##TITLE=Analysis number 329629
Compound Code cc 68246
Book Reference 546/34
Project Code adrs
Chemist Name craigr
##JCAMPDX= 6.0         $$ Bruker NMR JCAMP-DX V2.0
##DATA TYPE= NMR SPECTRUM
##DATA CLASS= NTUPLES
##ORIGIN= Bruker BioSpin GmbH
##OWNER= nmr
$$ XWIN-NMR		Version 3.5
$$ Wed Sep 19 11:18:11 2007 GMT Daylight Time (UT+1h)  MAYBRIDGE\nmr@NMR_250MHZ
##.OBSERVE FREQUENCY= 250.131544655141
##.OBSERVE NUCLEUS= ^1H
##.ACQUISITION MODE= SIMULTANEOUS (DQD)
##.ACQUISITION SCHEME= undefined
##.AVERAGES= 16
##.DIGITISER RES= 18
##SPECTROMETER/DATA SYSTEM= dpx250
##.PULSE SEQUENCE= zg30
##.SOLVENT NAME= CDCl3
##.SHIFT REFERENCE= (INTERNAL, CDCl3, 0, 16.522)
##AUDIT TRAIL= $$ (NUMBER, WHEN, WHO, WHERE, WHAT)
$$ ##TITLE= Audit trail, XWIN-NMR		Version 3.5
$$ ##JCAMPDX= 5.01
$$ ##ORIGIN= Bruker BioSpin GmbH
$$ ##OWNER= nmr
$$ C:\u/data/dgb/nmr/ADRS/1740/pdata/1/auditp.txt
$$ ##AUDIT TRAIL=  $$ (NUMBER, WHEN, WHO, WHERE, WHAT)
(   1,<2007-09-19 11:17:47.01 +100>,<MAYBRIDGE\nmr>,<NMR_250MHZ>,
      <created by zg, POWCHK disabled, PULCHK disabled
       configuration hash MD5:
       76 6E 9A 78 1E 09 19 81 EC 84 63 8F B0 6A 59 2D
       data hash MD5: 64K
       80 F9 32 71 CD EF 94 B4 84 23 1F AA 0B 4C 77 7E>)
(   2,<2007-09-19 11:18:01.45 +100>,<MAYBRIDGE\nmr>,<NMR_250MHZ>,
      <Start of raw data processing
       ef LB = 0.3 FT_mod = 6 PKNL = 1 SI = 32K 
       data hash MD5: 32K
       3F FB 66 25 EA 9D 0F 1B F2 1D 26 1D A3 51 A3 62>)
(   3,<2007-09-19 11:18:03.17 +100>,<MAYBRIDGE\nmr>,<NMR_250MHZ>,
      <apk 
       data hash MD5: 32K
       55 F1 B0 B5 C8 04 90 F1 F0 AD 5E D3 D4 9B 38 46>)
(   4,<2007-09-19 11:18:04.21 +100>,<MAYBRIDGE\nmr>,<NMR_250MHZ>,
      <abs ABSG = 5 
       data hash MD5: 32K
       3C AA 27 7D E0 73 B1 06 83 14 8D CE 53 2A AC 6F>)
$$ ##END=
$$ 
$$ hash MD5
$$ DD C9 A6 CA 8F CB A2 BB 6A AA 2C A0 B7 93 33 DC
##$RELAX= 
##$RELAX= 
##$RELAX= 
##$RELAX= 
##$RELAX= 
##$RELAX= 
##$RELAX= 
$$ Bruker specific parameters
$$ --------------------------
##$DU= <C:\u>
##$EXPNO= 1740
##$NAME= <ADRS>
##$PROCNO= 1
##$TYPE= <nmr>
##$USER= <dgb>
##$AMP= (0..31)
100 100 100 100 100 100 100 100 100 100 100 100 100 100 100 100 100 100 
100 100 100 100 100 100 100 100 100 100 100 100 100 100 
##$AQSEQ= 0
##$AQ_mod= 3
##$AUNM= <au_zg>
##$AUTOPOS= <16 >
##$BF1= 250.13
##$BF2= 250.13
##$BF3= 250.13
##$BF4= 250.13
##$BF5= 500.13
##$BF6= 500.13
##$BF7= 500.13
##$BF8= 500.13
##$BYTORDA= 1
##$CFDGTYP= 0
##$CFRGTYP= 5
##$CHEMSTR= <none>
##$CNST= (0..31)
1 1 145 1 1 1 1 1 1 1 1 1 1 1 1 1 1 1 1 1 1 1 1 1 1 1 1 1 1 1 1 1 
##$CPDPRG= <>
##$CPDPRG1= <>
##$CPDPRG2= <>
##$CPDPRG3= <>
##$CPDPRG4= <mlev>
##$CPDPRG5= <mlev>
##$CPDPRG6= <mlev>
##$CPDPRG7= <mlev>
##$CPDPRG8= <mlev>
##$CPDPRGB= <>
##$CPDPRGT= <>
##$D= (0..31)
0 1 0 0 0 0 0 0 0 0.06 0 0 0 0 0 0 0.0002 0 0 0 0 0 0 0 0 0 0 0 0 0 0 
0 
##$DATE= 1190197063
##$DBL= (0..7)
120 120 120 120 120 120 120 120 
##$DBP= (0..7)
150 150 150 150 150 150 150 150 
##$DBP07= 0
##$DBPNAM0= <>
##$DBPNAM1= <>
$$ [...]
##$SUBNAM7= <"">
##$SUBNAM8= <"">
##$SUBNAM9= <"">
##$SW= 20.6930455092707
##$SWIBOX= (0..15)
0 0 3 0 0 0 0 0 0 0 0 0 0 0 0 0 
##$SW_h= 5175.983436853
##$TD= 65536
##$TD0= 1
##$TE= 296.16
##$TE2= 300
##$TE3= 300
##$TEG= 300
##$TL= (0..7)
0 120 120 120 120 120 120 120 
##$TP= (0..7)
150 150 150 150 150 150 150 150 
##$TP07= 0
##$TPNAME0= <>
##$TPNAME1= <>
##$TPNAME2= <>
##$TPNAME3= <>
##$TPNAME4= <>
##$TPNAME5= <>
##$TPNAME6= <>
##$TPNAME7= <>
##$TPOAL= (0..7)
0.5 0.5 0.5 0.5 0.5 0.5 0.5 0.5 
##$TPOFFS= (0..7)
0 0 0 0 0 0 0 0 
##$TUNHIN= 0
##$TUNHOUT= 0
##$TUNXOUT= 0
##$USERA1= <user>
##$USERA2= <user>
##$USERA3= <user>
##$USERA4= <user>
##$USERA5= <user>
##$V9= 5
##$VALIST= <valist>
##$VCLIST= <CCCCCCCCCCCCCCC>
##$VD= 0
##$VDLIST= <DDDDDDDDDDDDDDD>
##$VPLIST= <PPPPPPPPPPPPPPP>
##$VTLIST= <TTTTTTTTTTTTTTT>
##$WBST= 1024
##$WBSW= 4
##$XGAIN= (0..3)
0 0 0 0 
##$XL= 0
##$YL= 0
##$YMAX_a= 428175
##$YMIN_a= -456027
##$ZGOPTNS= <>
##$ZL1= 120
##$ZL2= 120
##$ZL3= 120
##$ZL4= 120
##$ABSF1= 16.522
##$ABSF2= -4.171173
##$ABSG= 5
##$ABSL= 3
##$ALPHA= 0
##$AQORDER= 0
##$ASSFAC= 0
##$ASSFACI= 0
##$ASSFACX= 0
##$ASSWID= 0
##$AUNMP= <proc_1d>
##$AZFE= 0.1
##$AZFW= 0.1
##$BCFW= 0
##$BC_mod= 0
##$BYTORDP= 0
##$COROFFS= 0
##$CY= 12.5
##$DATMOD= 1
##$DC= 0
##$DFILT= <>
##$DTYPP= 0
##$F1P= 14.0000005364418
##$F2P= -0.99999901652339
##$FCOR= 0.5
##$FTSIZE= 32768
##$FT_mod= 6
##$GAMMA= 0
##$GB= 0
##$INTBC= 1
##$INTSCL= 1
##$ISEN= 128
##$LB= 0.3
##$LEV0= 0
##$LPBIN= 0
##$MAXI= 10000
##$MC2= 0
##$MEAN= 0
##$ME_mod= 0
##$MI= 0
##$NCOEF= 0
##$NC_proc= -3
##$NLEV= 6
##$NOISF1= 0
##$NOISF2= 0
##$NSP= 0
##$NTH_PI= 0
##$NZP= 0
##$OFFSET= 16.522
##$PC= 1
##$PHC0= 153.8772
##$PHC1= 4.36802
##$PH_mod= 1
##$PKNL= yes
##$PPARMOD= 0
##$PSCAL= 4
##$PSIGN= 0
##$REVERSE= no
##$SF= 250.13
##$SI= 32768
##$SIGF1= 0
##$SIGF2= 0
##$SINO= 400
##$SIOLD= 32768
##$SREGLST= <1H.CDCl3>
##$SSB= 0
##$STSI= 32768
##$STSR= 0
##$SW_p= 5175.98343685301
##$SYMM= 0
##$S_DEV= 0
##$TDeff= 65536
##$TDoff= 0
##$TI= <Analysis number 999999
Compound Code 99
Book Reference 9
Project Code 9>
##$TILT= no
##$TM1= 0
##$TM2= 0
##$TOPLEV= 0
##$USERP1= <user>
##$USERP2= <user>
##$USERP3= <user>
##$USERP4= <user>
##$USERP5= <user>
##$WDW= 1
##$XDIM= 32768
##$YMAX_p= 462881147
##$YMIN_p= -150635
$$ End of Bruker specific parameters
$$ ---------------------------------
##NTUPLES= NMR SPECTRUM
##VAR_NAME=  FREQUENCY,     SPECTRUM/REAL,   SPECTRUM/IMAG
##SYMBOL=    X,             R,               I
##VAR_TYPE=  INDEPENDENT,   DEPENDENT,       DEPENDENT
##VAR_FORM=  AFFN,          ASDF,            ASDF
##VAR_DIM=   32768,         32768,           32768
##UNITS=     HZ,            ARBITRARY UNITS, ARBITRARY UNITS
##FACTOR=    0.157963299565203, 1,           1
##FIRST=     4132.6476996994, 0,             0
##LAST=      -1043.33573715361, 0,           0
##MIN=       -1043.33573715361, -150635,     0
##MAX=       4132.6476996994, 462881147,     0
$$ Real data points
##PAGE= N=1
##DATA TABLE= (X++(R..R)), XYDATA
$$ [...]
16461E73l948l870k169m753M817J6271R937q239k194q218r118m417K433p414L637
$$ 573 -3375 -7245 -9414 -14167 -9350 6921 16858 8619 6425 -1793 -10911 -15328 -12895 -20309 -16672
16446a6672K1011k297J376L982j997J1281k190j5519j0692L436K447L041k096
$$ -16672 4339 2042 3418 7400 5403 16684 14494 -1025 -11717 -8281 -5834 -2793 -4889
16433d889J2207n31K986j3957j1966J5073J5287n091q698r19M810m902n452j931
$$ -4889 7318 6787 9773 -4184 -16150 -1077 14210 9119 421 -498 4312 -590 -6042 -7973
16419g973M256n361J4029N023K733L57M86p267l876R000l652j414J1841o897r268
$$ -7973 -3717 -9078 4951 9974 12707 13064 13550 6283 2407 11407 7755 6341 18182 11285 2017
16404B017N060q75J14J248J939l491q946p604L237M832L252N650j296Q574J5271
$$ 2017 7077 6202 6316 7564 9503 6012 -2934 -10538 -7301 -2469 783 6433 5137 13711 28982
16389B8982L223j8894n487q912o928j267p025j857O012J2953Q963J390L690l938
$$ 28982 32205 13311 7824 -1088 -8016 -9283 -16308 -18165 -12153 800 9763 11153 14843 10905
16375A0905j1535j0201P256p238l904O91J400K754M616R458n430K029j7698l803
$$ 10905 -630 -10831 -3575 -10813 -14717 -14026 -12626 -9872 -5256 4202 -1228 801 -16897 -20700
16361b0700P639J1236O985k620n753j204J6735l689J1666J5095o360j1511o909
$$ -20700 -13061 -1825 5160 2540 -3213 -4417 12318 8629 20295 35390 29030 17519 10610
16348A0610K88r87M358N737r37o764n474N260n36l566m474j669J4135M010J083
$$ 10610 10898 9911 14269 20006 19069 12305 6831 12091 11555 7989 3515 1846 15981 19991 21074
16333B1074J0577m554P458J2785K847Q718K848J0456J2763o24j0117N518j9431
$$ 21074 31651 27097 34555 47340 50187 58905 61753 72209 84972 84348 74231 79749 60318
16320F0318j2752q529j8488j674n012J512Q54L603L508O98j1973O943k793j2632
$$ 60318 47566 39037 20549 18875 13863 15375 16229 19832 23340 24038 12065 19008 16215 3583
16306C583r550R494J2569l112r9J2048J056M306K921J629j5500q419q729P126
$$ 3583 -5967 3527 16096 12984 12885 24933 25989 30295 33216 34845 19345 10926 2197 9323
16292I323N028J4613N065j8126k4648j3413J0909K2609Q719k84j168L712j20o418
$$ 9323 14351 28964 34029 15903 -8745 -22158 -11249 11360 20079 19795 18627 22339 22219 15801
16278A5801J774l877n052j4329m603O602Q725J5174R918J3755j5097j6737Q087
$$ 15801 17575 13698 8646 -5683 -10286 -3684 5041 20215 30133 43888 28791 12054 20141
16265B0141p473j5995N36L798r071p372K3K747P34J3436J0077J0022n133j0521
$$ 20141 12668 -3327 -2791 1007 -8064 -15436 -15413 -12666 -11932 1504 11581 21603 16470 5949
16251E949m634K04P356L200k697L147l895R731N542L76l279j349l910j0051J190
$$ 5949 1315 1519 8875 12075 9378 12525 8630 18361 23903 24279 21000 19651 15741 5690 6880
16236F880Q803n806r506o883O947J2034n890j947J0053P212m548n092L246k447
$$ 6880 15683 9877 371 -6512 435 12469 6579 4632 14685 21897 17349 12257 15503 13056
16222A3056K614k746J6396N284n41J981q44j2131P040P00j0640Q139M08Q370R022
$$ 13056 15670 12924 29320 34604 34063 36044 35200 23069 30109 30809 20169 28308 28716 37086 46108
16207D6108Q72q432q191K7365J5581p482n564p302j6214m627q855n136J1186O809
$$ 46108 46980 38548 30357 57722 73303 65821 60257 52955 36741 32114 23259 18123 29309 36118
16193C6118L885O598J4664L719j4778l383m348j1878j0698J0593R128Q547m980
$$ 36118 40003 46601 61265 64984 50206 46823 42475 30597 19899 30492 39620 48167 43187
16180D3187k786J2657J3512J258j0654r596N69K027l505p996j4465J0843K0895
$$ 43187 40401 53058 66570 67828 57174 47578 48147 50174 46669 38673 24208 35051 55946
16167E5946P683J196L361r669M537N586l046j178K146j7042j3629j902K260J9829
$$ 55946 63629 64825 68186 58517 63054 68640 65594 64416 66562 49520 35891 33989 36249 56078
16153E6078L054n0J8358K946N170o162N208P699j7752j197J3884l217j2840P61
$$ 56078 59132 59082 77440 80386 85556 79394 84602 92301 74549 73352 87236 84019 71179 71940
16139G1940L056J1639k213O72l26N905J2732O64R879J1907P778N473O178Q150
$$ 71940 74996 86635 84422 85094 84768 90673 103405 104069 113948 125855 133633 139106 145284 153434
16125A53434O838K0849J2744Q427l465j7102j992J6161K0687J9576K0645L3003
$$ 153434 160272 181121 193865 202292 198827 181725 179733 195894 216581 236157 256802 289805
16113B89805J2671K5686R657K0318L0952L1035N8431N7007O4205N2326O5032P5664
$$ 289805 302476 328162 337819 358137 389089 420124 478555 535562 599767 652093 717125 792789
16101G92789O5634P2767Q9445J10386R5179J01084J21911J48976J76437K12361
$$ 792789 858423 931190 1020635 1131021 1226200 1327284 1449195 1598171 1774608 1986969
16091A986969K61099L39764M40075N54407P39416R94846J343012J806627K380286
$$ 1986969 2248068 2587832 3027907 3582314 4321730 5316576 6659588 8466215 10846501
16082A0846501K995105L719973M455531M964211N405647N741598N974863N377141
$$ 10846501 13841606 17561579 22017110 26981321 32386968 38128566 44103429 49480570
16074D9480570L713132K953921K282534N12550j627794l394428l745506m409927
$$ 49480570 53193702 56147623 58430157 58942707 57314913 53920485 50174979 45765052
16066D5765052n778226o198363n827954n194889m606717l987432l224371k493924
$$ 45765052 39986826 33788463 27960509 22765620 18158903 14171471 10947100 8453176
16058H453176j908422j411000r86309o92621m95333l79194k80088k31452j86596
$$ 8453176 6544754 5133754 4147445 3454824 2959491 2580297 2300209 2068757 1882161
16049A882161j49879j34328j23628j11770r8874q4197q5092o9971p1654q1414
$$ 1882161 1732282 1597954 1474326 1362556 1263682 1179485 1094393 1024422 952768 871354
16039H71354o1345p0066p4654n9945n0230o6885m1581k5481k9307l1892p580k5960
$$ 871354 810009 739943 665289 605344 555114 488229 446648 421167 391860 359968 352388 326428
16027C26428k9533j7417n801m649o44j6776k2424j9814j6848k67R61j540j3320
$$ 326428 296895 279478 273677 269028 268384 251608 229184 209370 192522 192255 193216 191676 178356
16014A78356j4520m142j845n770j0899O51o286j8794o098j4754m772O316j218
$$ 178356 163836 159694 157849 152079 141180 141831 135545 116751 110653 95899 91127 97443 96225
16001I6225M551j537j9178O651R605j5487k724K5177p989j359P064R257k0j6366
$$ 96225 100776 99239 80061 86712 96317 80830 78106 103283 95294 93935 100999 110256 110236 93870
15987I3870q714p660m304m813Q6J1442L599m838k650Q786K341j5446j9342q994
$$ 93870 85156 77496 73192 68379 68465 79907 83506 78668 76018 84804 87145 71699 52357 43363
15973D3363l56J5542Q88j3760o512L487j2778k083j769r703o064L492o260Q334
$$ 43363 43007 58549 59437 45677 39165 42652 29874 27791 26022 16319 10255 13747 7487 15821
15959A5821J4515J4724k2Q65R209O869p064L842K504q972m584O317j123j2709
$$ 15821 30336 45060 45038 45903 55112 61981 54917 58759 61263 52291 47707 54024 52901 40192
15945D0192j0037j0450l797k491j486J0792M376j392J0470K682j0701L557J1062
$$ 40192 30155 19705 15908 13417 11931 22723 27099 25707 36177 38859 28158 31715 42777
15932D2777j1992k5466L97J447P140R212K54o540l865p977K419J1186K144J2239
$$ 42777 30785 5319 5716 7163 14303 23515 23769 17229 13364 5387 7806 18992 21136 33375
15918C3375O790k0353l629N907J816N144K092N4p757p473o311o50m378K184J0996
$$ 33375 40165 19812 16183 22090 23906 29050 31142 31196 23439 15966 9655 9005 4627 6811 17807
15903A7807K898j814j389r057R07R433k474Q912L96m775r764r344o733O958J1509
$$ 17807 20705 18891 17502 8445 9352 18785 16311 25223 25619 20844 11080 1736 -4997 1961 13470
15888A3470o673p654R704p731k2633l194p04N77J7422J0320m383J811j469q216
$$ 13470 6797 -857 8847 1116 -21517 -24711 -25415 -24838 -7416 2904 -1479 332 -1137 -9353
15874i353P945J3192q292k822K076J5678J4962k309j7036K242q387r460m129P33
$$ -9353 -1408 11784 3492 670 2746 18424 33386 31077 14041 16283 7896 -1564 -5693 -4960
15860d960J1050J410p647p76J1861J027k618p676m913P499Q584K171l046q170
$$ -4960 6090 7500 -147 -923 10938 11965 9347 1671 -3242 4257 12841 15012 11966 3796
15846C796M320L583N13o13k979M265N928k110Q294q220k2041R97k046m071o218
$$ 3796 8116 11699 12212 11599 8620 12885 18813 16703 24997 16777 -5264 -4267 -6313 -10384 -16602
15831a6602r449K1862J9616M695j5143j0295J813L526M095q780j0954r387j0962
$$ -16602 -26051 -4189 15427 20122 4979 -5316 -3503 23 4118 -4662 -15616 -25003 -35965
15818c5965M037j4370R120J8745J338J4205J1019R179m36j6024J848l309N990
$$ -35965 -31928 -46298 -37178 -18433 -17095 -2890 8129 17308 16872 848 2696 -613 5377
15805E377m534M307M073J38l664j7555r112J447R922j053N831K538J2380n706
$$ 5377 843 5150 9223 9361 5697 -11858 -20970 -19523 -9601 -10654 -4823 -2285 10095 4389
15791D389P05J0820j3165J446j923m921J047O230K28n027l187O849Q175M415j916
$$ 4389 5094 15914 2749 4195 2272 -2649 -1602 4628 4856 -171 -3358 3491 11666 16081 14165
15776A4165q930m251J0627J1307m047m187N507K448j1779n696M33n48j93j1231
$$ 14165 5235 984 11611 22918 18871 14684 20191 22639 10860 5164 5597 5049 4856 -6375
15762f375j4913Q701N891N169N576J2294M433m77k5476j1075N476m255J0308J0923
$$ -6375 -21288 -12587 -6696 -1527 4049 16343 20776 20299 -5177 -16252 -10776 -15031 -4723 6200
15748F200o112k942r357p510Q121j0703m261O060J1437J7959O486p387p587J569
$$ 6200 88 -2854 -12211 -19721 -11600 -22303 -26564 -20504 -9067 8892 15378 7991 404 1973
15734A973J2012l344j3006O695p301j1048J6662O964r546n692n522R387K2572
$$ 1973 13985 10641 -2365 4330 -2971 -14019 2643 9607 61 -5631 -11153 -1766 20806
15721B0806l500j5488j6256l863J0689K366L344o896N337P982L120M87o18J569
$$ 20806 17306 1818 -14438 -18301 -7612 -5246 -1902 -8798 -3461 4521 7641 8128 7510 9079
15707I079j606j1487K357J843Q79R552R62O402l668M121N83o301j0336k804n333
$$ 9079 7473 -4014 -1657 186 1065 10617 11579 17981 14313 18434 19017 12716 2380 -424 -5757
15692e757j4552j791K515j0247R737J0296K162L479O640R424J868j907J710k093
$$ -5757 -20309 -22100 -19585 -29832 -20095 -9799 -7637 -4158 2482 11906 13774 11867 13577 11484
15678A1484Q2n533l008N120r859N997J373j3545n299o654O143J1021n908r434
$$ 11484 11566 6033 3025 8145 -1714 4283 5656 -7889 -13188 -19842 -13699 -2678 -8586 -18020
15664a8020J084J0737J4309L450Q099Q883J156j6135j0383l542L58L843N667M213
$$ -18020 -16936 -6199 8110 11560 19659 28542 29698 13563 3180 -362 -4 3839 9506 13719
15650A3719L661m886j1211q868o278J215J513J5843p010j688N823J27o331N59
$$ 13719 17380 12494 1283 -7585 -13863 -12648 -11135 4708 -2302 -3990 1833 1960 -4371 -3812
15636c812n979j029m611l940K833O157J6205N384p789j081J2024Q19n203k060
$$ -3812 -9791 -10820 -15431 -19371 -16538 -10381 5824 11208 3419 2338 14362 15181 9978 7918
15622G918j295N727J3831j2491j5941j344k642k710J494L680m198J3162J0240
$$ 7918 6623 12350 26181 13690 -2251 -3595 -6237 -8947 -7453 -3773 -7971 5191 15431
15609A5431j633j2125j0497q995R491J2531QK087q974K1731J4036k3592j3669
$$ 15431 13798 1673 -8824 -17819 -8328 4203 4211 6298 -2676 19055 33091 9499 -4170
15596d170n26r978J2084J0144o292j3346r561l223J0282J5188l068j2785n467
$$ -4170 -4696 -14674 -2590 7554 1262 -12084 -21645 -24868 -14586 602 -2466 -15251 -20718
15583b0718O975l558j4589J895O201q017J5412Q164p541o30R437J6684l27p830
$$ -20718 -13743 -17301 -31890 -29995 -23794 -31811 -16399 -8235 -15776 -16406 -6969 9715 9388 1558
15569A558p60R060k088n197j866k521r249j5786j615J6600K1997J5844J2012O309
$$ 1558 798 9858 7770 2573 707 -1814 -11063 -26849 -28464 -11864 10133 25977 37989 44298
15555D4298o368j7916j5584k843l468M14J5831J318q917Q961J4679J0338j4215
$$ 44298 37930 20014 4430 1587 -1881 -1467 14364 15682 6765 15726 30405 40743 26528
15542B6528k028L488k224q275K218j291J7716K4810K6986J2870R791J6373J9286
$$ 26528 24500 27988 25764 17489 19707 18416 36132 60942 87928 100798 110589 126962 146248
15529A46248K220J4003K7703K9228K0272K4852K4030L748p933r664j8916j5384
$$ 146248 148468 162471 190174 219402 239674 264526 288556 292304 284371 274707 255791 240407
15517B40407j9911l1059k1776k4381k6231m723k1733k2310o688j3346j0708j1385
$$ 240407 220496 189437 167661 143280 117049 112326 90593 68283 61595 48249 37541 26156
15505B6156l975N000l214q324j5100j922r44J5001L248Q836K867j2468j1568J3421
$$ 26156 22181 27181 23967 15643 543 -1379 -2323 12678 15926 24762 27629 15161 3593 17014
15491A7014j3954p950k757O96J6014J6510j6264k8830k645N749Q537O661J048
$$ 17014 3060 -4890 -7647 -6951 9063 25573 9309 -19521 -22166 -16417 -7880 -1219 -171
15478a71N76J431P53J505J562N677J833o43J3500L310k1126o232k833M37K665
$$ -171 405 1836 2589 4094 5656 11333 13166 12523 26023 29333 8207 1975 -858 -421 2244
15463B244K64Q064J0922l385p637j3866L16L716Q403M783k70j182j2791n824l716
$$ 2244 2508 10572 21494 18109 10472 -3394 -3078 638 9041 13824 13554 12372 -419 -6243 -9959
15448i959L342l42r281k563O341q4M660J3290L12J190J5998J717n105l834J967
$$ -9959 -6617 -6959 -16240 -18803 -12462 -12546 -7886 5404 5716 6906 22904 24621 19516 15682 17649
15433A7649J257m78l749j508Q220l101k012n666q499p984p467Q284J6615J8120
$$ 17649 18906 18428 14679 13171 21391 18290 16278 10612 2113 -5871 -13338 -5054 11561 29681
15419B9681J0165m057r474p450r075q449o741k906j841J030L565J1699R881N956
$$ 29681 39846 35789 26315 18865 9790 1341 -5400 -8306 -10147 -9117 -5552 6147 16028 21984
15405B1984l099j1960o518p19N863p811k147j655L699J456J0631j6135r514J040
$$ 21984 18885 6925 407 -312 5551 -2260 -4407 -6062 -2363 -907 9724 -6411 -15925 -14885
15391a4885P245M277j170L989K5577N619j8241j4931j466J1532q228q549Q290
$$ -14885 -7640 -3363 -4533 -544 25033 30652 12411 -2520 -3986 7546 -682 -9231 -941
15378i41q626q851R22J244K703J0398k755k900J1229M598p517O810k629o432m099
$$ -941 -9567 -18418 -17496 -16252 -13549 -3151 -5906 -8806 2423 7021 -496 6314 3685 -2747 -6846
15363f846P81L168o887q780N305Q376O020M052Q249M863m751j4652J2085j2584
$$ -6846 -6065 -2897 -9784 -18564 -13259 -4883 1137 5189 13438 18301 13550 -1102 10983 -1601
15349a601j0420J2954J346o289q523l375J5229R899m325L628m879k1411K957k374
$$ -1601 -12021 933 2279 -4010 -12533 -15908 -679 9220 4895 8523 3644 -17767 -14810 -17184
15335a7184k270R176j649N901N595L163N887m638n483k990j896J9271j2378j3013
$$ -17184 -19454 -10278 -11927 -6026 -431 2732 8619 3981 -1502 -4492 -6388 12883 505 -12508
15321a2508O47k568J452o263J2443J7202j725L488K209Q991n166r05N804J1411
$$ -12508 -11861 -14429 -12977 -19240 -6797 10405 8680 12168 14377 23368 18202 17297 23101 34512
15307C4512k109l272p26O882O94j2959n127Q56m899k856j304j159l253n025j2292
$$ 34512 32403 29131 28405 35287 35981 23022 17895 18751 13852 10996 9692 8533 5280 255 -12037
15292a2037j0953N199R857K761l37q042q16l897J789J665J715P53j0110N207P429
$$ -12037 -22990 -17791 -7934 -5173 -5510 -13552 -14368 -18265 -16476 -14811 -13096 -12343 -22453 -17246 -9817
15277i817N260J268M021q643k1941j183Q256K1161J7915L179j7595q301K643n873
$$ -9817 -4557 -3289 732 -7911 -29852 -31035 -22779 -1618 16297 19476 1881 -6420 -3777 -9650
15263i650k330n806N378P51P70P682J8171J2334l184k1869r118Q699N428m765
$$ -9650 -11980 -17786 -12408 -11657 -10887 -3205 14966 27300 24116 2247 -6871 1828 7256 2491
15249B491j7143p455n9Q382J2330p314K941m970m729K0587L694J728q795L651
$$ 2491 -14652 -22107 -22166 -13784 -1454 -8768 -5827 -10797 -15526 5061 8755 10483 1688 5339
15235E339P10N558P844p050j4815j0774J2403O066P210O60j3491k2051j3811J0468
$$ 5339 6049 11607 19451 12401 -2414 -13188 -785 5281 12491 13151 -340 -22391 -36202 -25734
15221b5734M726J965J4006M654M564M634N313O767M748m20k652o552q409k769
$$ -25734 -21008 -19043 -5037 -383 4181 8815 14128 20895 25643 25223 22571 16019 7610 4841
15207D841O156Q214j2389L80l289q497l61K549J307p316l979j3588M623J2133
$$ 4841 10997 19211 6822 7202 3913 -4584 -4945 -2396 -1089 -8405 -12384 -25972 -21349 -9216
15193i216R598O58l755o03Q216n276j1404K326M246j137j9401J603R736J233L412
$$ -9216 382 1040 -2715 -3318 4898 -378 -11782 -9456 -5210 -6347 -25748 -24145 -14409 -13176 -9764
15178i764r801J32P206p202j0600P16O888j9538R1J6372k85j381Q093L230Q648
$$ -9764 -19565 -19433 -12227 -19429 -30029 -29313 -22425 -41963 -41872 -25500 -25785 -27166 -19073 -15843 -7195
15163g195M732m79m551r429j328J0360O194O595o421j6847p020J0929O718J4422
$$ -7195 -2463 -2942 -7493 -16922 -18250 -7890 -1696 4899 -1522 -18369 -25389 -14460 -7742 6680
15149F680J9877N847j4254p473n578j674m814k604l605J592o935M11L908r451
$$ 6680 26557 32404 18150 10677 5099 3425 -1389 -3993 -7598 -6006 -12941 -12530 -8622 -18073
15135a8073m770K2817O210j2740j185n680P654r334O620L090P546m973j11O257
$$ -18073 -22843 -26 6184 -6556 -7741 -13421 -5767 -15101 -8481 -5391 2155 -2818 -2929 3328
15121C328j608p161j1331L165k027O377L385N842L681l814q446o097M08j003l536
$$ 3328 1720 -5441 -16772 -13607 -15634 -9257 -5872 -30 3651 -163 -8609 -14706 -14298 -15301 -18837
15106a8837r639j547P297Q976J4554l618J82r069l886K350j136L780K442L810
$$ -18837 -28476 -30023 -22726 -13750 804 -2814 -2632 -11701 -15587 -13237 -14373 -10593 -8151 -4341
15092d341N350l270n653p213l673K142J8791N959m105j1522m406m302r701J0894
$$ -4341 1009 -2261 -7914 -15127 -18800 -16658 2133 8092 3987 -7535 -11941 -16243 -25944 -15050
15078a5050K887O733O131J3634J5112M978r248j3610j7873K076L574p290J79J0124
$$ -15050 -12163 -5430 701 14335 29447 34425 25177 11567 -6306 -4230 -656 -7946 -7767 2357
15064B357N205q844J502r543j6323m397J1172Q300J6361J465N95m078j0498j259
$$ 2357 7562 -1282 220 -9323 -25646 -30043 -18871 -10571 5790 7255 7850 3772 -6726 -7985
15050g985J3739J3214j1792o984j8605k4774M135Q087J8037J4527L873j533j2115
$$ -7985 5754 18968 7176 192 -18413 -43187 -39052 -30965 -12928 1599 5472 3939 -8176
15037h176P120l108N019M200l597n735J037k448j8055k920K758K166J3901R549
$$ -8176 -1056 -4164 855 5055 1458 -4277 -3240 -5688 -23743 -26663 -23905 -21739 -7838 1711
15023A711M254j4162K336p52R809M182J415O922Q757j3152j0888N527j362j0477
$$ 1711 5965 -8197 -5861 -6613 3196 7378 8793 15715 24472 11320 432 5959 4597 -5880
15009e880r343j5147N085L240P155J4037p074j172j1931j328o405j117K2293J6064
$$ -5880 -15223 -30370 -25285 -22045 -14890 -853 -7927 -9099 -21030 -22358 -28763 -29880 -7587 8477
14995H477N426o596K232j1348p222L526J0914N144j5831p283m178Q791J1942j1498
$$ 8477 13903 7307 9539 -1809 -9031 -5505 5409 10553 -5278 -12561 -16739 -7948 3994 -7504
14981g504j4437J1571O525j281L564J773l15M777K466j0973J270k159j957N023
$$ -7504 -21941 -10370 -3845 -5126 -1562 211 -104 4673 7139 -3834 -2564 -4723 -6680 -1657
14967a657O692K0256j8233p808J643M482k936o354r271K686R371K637J1262J859
$$ -1657 5035 25291 7058 -750 893 5375 2439 -3915 -13186 -10500 -1129 1508 12770 14629
14953A4629m699r033L014J2293M519q762L853j841j1497k501r431p919k238J5417
$$ 14629 9930 897 3911 16204 20723 11961 15814 13973 2476 -25 -9456 -17375 -19613 -4196
14939d196P952L016P70j3902j2536N91J1079J643p020q704J2373O62q181q002
$$ -4196 3756 6772 7542 -6360 -18896 -18305 -7226 -5583 -12603 -21307 -8934 -8272 -16453 -24455
14925b4455m188n929l817k070Q898n53K939J2501Q988L311l506q276k858n529
$$ -24455 -28643 -34572 -38389 -40459 -31561 -32114 -29175 -16674 -7686 -4375 -7881 -16157 -19015 -24544
14911b4544j0460J477K3125J5133R207m267p499j3303q925J0063J0633p4k168
$$ -24544 -35004 -33527 -10402 4731 13938 9671 2172 -11131 -20056 -9993 640 566 -1602
14898a602q30K5L136P92J557O674N906j4357j4768J0239N391q039J3369J912j3391
$$ -1602 -2432 -2407 729 1521 3078 9752 15658 1301 -13467 -3228 2163 -5876 7493 9405 -3986
14883c986L996P027J2195j004L11r100L68K581j3828r030k809K583q078q8N407
$$ -3986 10 7037 19232 18228 18539 9439 9807 12388 -1440 -10470 -13279 -10696 -18774 -18862 -13455
14868a3455q382j0441j4560P676L371j1992J1935K1951O183J608o782K749J84
$$ -13455 -21837 -32278 -46838 -39162 -35791 -47783 -35848 -13897 -7714 -6106 -12888 -10139 -9955
14855i955m783p718o991l949L576j35k452o066M646J5524J4101m052Q247J1620
$$ -9955 -14738 -22456 -29447 -33396 -29820 -29955 -32407 -38473 -33827 -18303 -4202 -8254 -7 11613
14841A1613j520j087k62r93j4470j7472P342J0175K266l759Q888J653j073K627
$$ 11613 10093 9006 8744 7751 -6719 -24191 -16849 -6674 -4408 -8167 721 2374 1301 3928
14827C928K2J055J590k4000p150K876J0542L137r958R233l437J339O557P46Q622
$$ 3928 3950 5005 6595 -17405 -24555 -21679 -11137 -8000 -17958 -8725 -12162 -10823 -4266 -3520 5102
14812E102m782J20o768o383J0912J4726j0233M606M593j320n297L973r904j6947
$$ 5102 320 440 -6328 -12711 -1799 12927 2694 7300 11893 10573 5276 9249 -655 -17602
14798a7602O533Q422l726l87P324R755r388J770R227J808O433q316j855n908n295
$$ -17602 -11069 -2647 -6373 -6760 564 10319 931 2701 11928 13736 20169 11853 9998 4090 -1205
14783a205m96O144j778o679j582q919J690O935R240J158n999j2434P273p285o365
$$ -1205 -1701 4443 2665 -4014 -5596 -14515 -12825 -5890 3350 4508 -1491 -13925 -6652 -13937 -20302
14768b0302O026L3j060J0834J0153o560n606j644J0710J0218L277p630N18j4777
$$ -20302 -14276 -14243 -15303 -4469 5684 -876 -6482 -8126 2584 12802 16079 8449 8967 -5810
14754e810q193N871J3838K38j0446k5956O21J1842j275J6453j406j790p92M825
$$ -5810 -14003 -8132 5706 5944 -4502 -30458 -29837 -17995 -19270 -2817 -4223 -6013 -6805 -1980
14740a980M479J0643n103j0661m766p269n883m023J1161l128j848J2211J363l494
$$ -1980 2499 13142 8039 -2622 -7388 -14657 -20540 -24563 -13402 -16530 -18378 -6167 -4804 -8298
14726h298K078J1407J2065P07N82n724j664l627j3533j855O958J3944M479r135
$$ -8298 -6220 5187 17252 17959 18541 12817 11153 7526 -6007 -7862 -904 13040 17519 8384
14712H384j5865l014M465O62R407J5639N383n798J243n659j1345L708n811j1198
$$ 8384 -7481 -10495 -6030 -5368 4039 19678 25061 19263 20506 14847 3502 7210 1399 -9799
14698i799n291J4898J731p501j2615l281J614O81J2205N231k492m263j1101o158
$$ -9799 -15090 -192 1539 -5962 -18577 -21858 -20244 -19563 -7358 -2127 -4619 -8882 -19983 -26141
14684b6141j80J0350k554m666M547J1538J2290J4402m886l139j8876k209J1864
$$ -26141 -26321 -15971 -18525 -23191 -18644 -7106 5184 19586 14700 11561 -7315 -9524 2340
14671B340m228j1093l682K078J759J4739L397j1170r080n154M758J0391J8419
$$ 2340 -1888 -12981 -16663 -14585 -12826 1913 5310 -5860 -14940 -20094 -15336 -4945 13474
14658A3474m028j2577k426J406P991J2447J987n626j2718L834m461k062J3203
$$ 13474 9446 -3131 -5557 -4151 3840 16287 18274 12648 -70 3764 -697 -2759 10444
14645A0444M766N64r20o082k860j0046p162l534P557j067o888j809Q003J3436
$$ 10444 15210 15774 14854 8772 5912 -4134 -11296 -14830 -7273 -8340 -15228 -17037 -9034 4402
14631D402N40j5332K921K3727n899j4284Q590M274L869M298k155M655j0263j1185
$$ 4402 4942 -10390 -7469 16258 10359 -3925 4665 8939 12808 17106 14951 19606 9343 -1842
14617a842p11k936k743K724K769q893j3287j640J7134J1927J0398N587J44j307
$$ -1842 -2553 -5489 -8232 -5508 -2739 -11632 -24919 -26559 -9425 2502 12900 18487 18631 17324
14603A7324J723j9456r940l338n568O729P879O51K3L051m163j9853o186N591P351
$$ 17324 19047 -409 -10349 -13687 -19255 -12526 -4647 -3996 -3973 -922 -5085 -24938 -31124 -25533 -18182
14588a8182J8673M574P346j2642k3862O554o440L719M757k114O339O957P030L076
$$ -18182 491 5065 12411 -231 -24093 -17539 -23979 -20260 -15503 -17617 -11278 -4321 2709 5785
14574E785J192o777M588p715J964M518L343L163J134j772j791l136j3590j1528
$$ 5785 6977 200 4788 -2927 -963 3555 6898 10061 11195 9423 7632 4496 -9094 -20622
14560b0622L216P152P516j1172K442J0667M132j5408j3738K312n994J8394R615
$$ -20622 -17406 -10254 -2738 -13910 -11468 -801 3331 -12077 -25815 -23503 -29497 -11103 -1488
14547a488R503J558n980j2644j651q983l889l193J2340M048l843R667J4372l824
$$ -1488 8015 9573 3593 -9051 -10702 -19685 -23574 -26767 -14427 -10379 -14222 -4555 9817 5993
14533E993q404o262J4629J431n685J0197J1637q279k378K931N92P448q775j7800
$$ 5993 -2411 -8673 5956 7387 1702 11899 23536 15257 12879 15810 16402 23850 15075 -2725
14519b725K757K387j0871l230j818o293J0542K871p124m681j297J7186N184O390
$$ -2725 32 2419 -8452 -11682 -13500 -19793 -9251 -6380 -13504 -18185 -19482 -2296 2888 9278
14505I278m963J078J224r79l625p294k555j859k665J6516k600n710J0905J6252
$$ 9278 4315 5393 6617 5638 2013 -5281 -7836 -9695 -12360 4156 1556 -4154 6751 23003
14491B3003m881p996j0540j9440J6222J8143M341j0482N848O839j5655q351j5363
$$ 23003 18122 10126 -414 -19854 -3632 14511 18852 8370 14218 21057 5402 -2949 -18312
14478a8312q432L260R930N63k988P173k678K546q241j556K300J2196J3940R991
$$ -18312 -26744 -23484 -13554 -12991 -15979 -8806 -11484 -8938 -17179 -18735 -16435 -4239 9701 19692
14464A9692j564j1838k697M654n512q642K198j0316L192J8433M612o689p55r429
$$ 19692 18128 6290 3593 8247 2735 -5907 -3709 -14025 -10833 7600 12212 5523 4768 -4661
14450d661n188R25L079L302o71N583O189J1126k736R331n561k0952j2971R82K476
$$ -4661 -9849 -8924 -5845 -2543 -3214 2369 8558 19684 16948 26279 20718 -234 -13205 -12223 -9747
14435i747K505Q986k284q992j6801j4176o53K257N475J6993J5252K634K316p948
$$ -9747 -7242 1744 -540 -9532 -26333 -40509 -41162 -38905 -33430 -16437 -1185 1449 3765 -4183
14421d183R33j0105j3387J961J4800J4964k183P843R541r119o389l352j3887m256
$$ -4183 -3250 -13355 -26742 -24781 -9981 4983 2800 10643 20184 11065 4676 1324 -12563 -16819
14407a6819L610J5440p08k29p535j1208R633J792K104n00j2956j8094J823K897
$$ -16819 -13209 2231 1523 1294 -6241 -17449 -7816 -6024 -3920 -4420 -17376 -35470 -33647 -30750
14393c0750J3943K0438J1336m198o318J748O023M799l33j7473l240K303j880k921
$$ -30750 -16807 3631 14967 10769 4451 6199 12222 17021 16688 -785 -4025 -1722 -3602 -6523
14379f523k556R383O711n497r060j0426n92j067J5527L227m754J2931J0511j2407
$$ -6523 -9079 304 7015 1518 -7542 -17968 -18560 -19627 -4100 -873 -5627 7304 17815 5408
14365E408p979o491n629m792J6139J4373Q074j1775O478P730l196j9990k877L747
$$ 5408 -2571 -9062 -14691 -19483 -3344 11029 19103 7328 13806 21536 18340 -1650 -4527 -780
14351g80L716M329l145k325P375l432j761j0330L852P704J725O6m367J2176k086
$$ -780 2936 7265 4120 1795 9170 5738 3977 -6353 -2501 5203 6928 6994 2627 14803 12717
14336A2717K68o871l947r914o233r662r256J8667N623m153J0604m452k659L997
$$ 12717 12985 6114 2167 -7747 -13980 -23642 -32898 -14231 -8608 -12761 -2157 -6609 -9268 -5271
14322e271L417J6482q493k0202k945L044o526K689M213m759R684L048n915m41
$$ -5271 -1854 14628 6135 -14067 -17012 -13968 -20494 -17805 -13592 -18351 -8667 -5619 -11534 -11975
14308a1975J1561J60K730K837n59j0902o774N938o601j322Q567M186N88J940m097
$$ -11975 -414 -254 2476 5313 4754 -6148 -12922 -6984 -13585 -14907 -6340 -2154 -1566 374 -3723
14293c723L510Q830K165p54p990J312l469o168k214L520m126k203Q348J8804p519
$$ -3723 -213 8617 10782 10028 2038 3350 -119 -6287 -8501 -4981 -9107 -11310 -2962 15842 8323
14278H323j2593N165L06p926K258N175O748J568j2202o931J3855r28k07o050k109
$$ 8323 -4270 895 1201 -6725 -4467 708 7456 9024 -3178 -10109 3746 2818 2611 -3439 -5548
14263e548J798J930q88O786K318j2344k370j033j7379K77J0466k1489m598R699
$$ -5548 -3750 -1820 -2708 4078 6396 -5948 -8318 -9351 -26730 -26453 -15987 -37476 -42074 -32375
14249c2375Q611Q654p823L181l083j1000R645Q234O651p018j852R280M067j7678
$$ -32375 -23764 -15110 -22933 -19752 -22835 -33835 -24190 -15956 -9305 -16323 -18175 -8895 -4828 -22506
14235b2506R16J971K1948J3413l147j1018o537M337l250J2244l65o404O815J71
$$ -22506 -21590 -19619 2329 15742 12595 1577 -4960 -623 -3873 8371 8006 1602 8417 8588
14221H588j67N066k494j355j756J59n433R40K528p824r282j45j514m979O333j056
$$ 8588 8421 13487 10993 9638 7882 8041 2608 3548 6076 -1748 -11030 -11175 -12689 -17668 -11335 -12391
14205a2391r271M897K492P975P099l895M094q747q643J5773J4338l079j1658p328
$$ -12391 -21662 -16765 -14273 -6298 801 -3094 1000 -7747 -16390 -617 13721 10642 -1016 -8344
14191h344k080k117R164Q564j0754j2780j5001Q166J1960J1565P487j0796j1739
$$ -8344 -10424 -12541 -3377 5187 -5567 -18347 -33348 -25182 -13222 -1657 5830 -4966 -16705
14178a6705o202Q089N814M118p968K975Q264n253J0394n74l41M148O657m452j2268
$$ -16705 -22907 -14818 -9004 -4886 -12854 -9879 -1615 -6868 3526 2952 2611 6759 13416 8964 -3304
14163c304k035P400L188j2978o560m307J040J3024O605j2898K059Q83n194n406
$$ -3304 -5339 2061 5249 -7729 -14289 -18596 -17556 -4532 2073 -10825 -8766 -7883 -13077 -18483
14149a8483k857J2271k588k586J1479n849K284j201P42l843J2005R031o728J191
$$ -18483 -21340 -9069 -11657 -14243 -2764 -8613 -6329 -7530 -6788 -10631 1374 10405 3677 4868
14135D868K927Q346R33r89l364r561O421J0075j1426j2024k1470k875P622J6955
$$ 4868 7795 16141 17074 16085 12721 3160 9581 19656 8230 -3794 -25264 -28139 -20517 -3562
14121c562L654R033J3291L841k476j360p253Q575N286l0195j6314J647L283L345
$$ -3562 92 9125 22416 26257 23781 22421 15168 23743 29029 -1166 -17480 -15833 -12550 -9205
14107i205N632K914p114o563K2424R692o656l295j5784n744O620J8222l552j0854
$$ -9205 -3573 -659 -7773 -14336 8088 17780 11124 7829 -7955 -13699 -7079 11143 7591 -3263
14093c263n449N85O735Ln684p358n168J1605L364K449j0480m176J3402J3541J124
$$ -3263 -8712 -8127 -1392 -1389 -7073 -14431 -19599 -7994 -4630 -2181 -12661 -16837 -3435 10106 11230
14078A1230k176K47O37j219J419N049M664L865j7137j6513P103J3762j329n453
$$ 11230 9054 9301 9938 8719 10138 15187 19851 23716 6579 -9934 -2831 10931 9602 4149
14064D149j638k921J4847j2053j1179Q17K152l143J0612O490m598J967n868Q761
$$ 4149 2511 -410 14437 2384 -8795 -7978 -5826 -8969 1643 8133 3535 5502 -366 8395
14050H395j0953J643J6348Q33o527j348m600N615k1087m496R126M106K472R1k152
$$ 8395 -2558 -915 15433 16266 9739 8391 3791 9406 -11681 -16177 -7051 -2945 -473 -382 -2534
14035b534P565M563j866K48o307R817J0255j5869r556j2426j3661J5532K7479
$$ -2534 5031 9594 7728 7976 1669 11486 21741 5872 -3684 -16110 -29771 -14239 13240
14022A3240O965Q81J931N214j1363j8363j4518r366K0604J4148N985n510j5027
$$ 13240 20205 21086 23017 28231 16868 -1495 -16013 -25379 -4775 9373 15358 9848 -5179
14009e179j6002k459J4257O792J6518J8459j1245j5213n637j754j1749K346J3687
$$ -5179 -21181 -23640 -9383 -2591 13927 32386 21141 5928 291 -1463 -13212 -10866 2821
13996B821N324Q733o860j1638L337N433j0690Q699M000k360m034m67j843n46P66
$$ 2821 8145 16878 10018 -1620 1717 7150 -3540 5159 9159 6799 2765 2298 455 -91 675
13981F75P159j2481M658m44O583m31l61J3898j973Q705l796m659k342J40P140
$$ 675 7834 -4647 11 -433 6150 5719 5358 19256 17283 25988 22192 17533 15191 15331 22471
13966B2471k420l91M340j6814k558q775J974J3513R548k690p753k331k328o226
$$ 22471 20051 19660 24000 7186 4628 -4147 -2173 11340 20888 18198 10445 8114 5786 -440
13952d40N44o691K167j1103k225R70M08J2021j2350J740o78L214N253N646L893
$$ -440 104 -6587 -4420 -15523 -17748 -16778 -16370 -4349 -16699 -14959 -15637 -12423 -7170 -1524 2369
13937B369m18j1699R843R60K048j6305m884J204J3450j045p38M745l844J075j3211
$$ 2369 1951 -9748 95 1055 3103 -13202 -18086 -16882 -3432 -4477 -5215 -470 -4314 -3239 -16450
13922a6450J2238M810Q263n051N590Q075J892j2176j0379J903K676J2313N428
$$ -16450 -4212 598 8861 3810 9400 17475 19367 7191 -3188 -1285 1391 13704 19132
13909A9132o831K169m969l496k918l824J9871J1944l747q960n695p894N069j989
$$ 19132 12301 14470 9501 6005 3087 -737 19134 31078 27331 18371 12676 4782 9851 7862
13895G862r204J582n33k564m26j784q015L709K435J902j2355K811L527k172J8049
$$ 7862 -1342 240 -293 -2857 -3283 -5067 -13082 -9373 -6938 -5036 -17391 -14580 -11053 -13225 4824
13880D824K500k707n597K967P601k365K042j518n706j495Q857O868j5341q220
$$ 4824 7324 4617 -980 1987 9588 7223 9265 7747 2041 546 9403 16271 930 -7290
13866g290O101l512p107P285K826M362l375l766o75N335J0373j6380J213J5012
$$ -7290 -1189 -4701 -11808 -4523 -1697 2665 -710 -4476 -5151 184 10557 -5823 -4610 10402
13852A0402J2053r32j1674K23K716q850j4540L615J1815r46J3622p529n674j726
$$ 10402 22455 21523 9849 10072 12788 3938 -10602 -6987 4828 3882 17504 9975 4301 2575
13838B575j040k833l684m846K807J204o802N205O070P510Q667j3317o331l533
$$ 2575 1535 -1298 -4982 -9828 -7021 -5817 -12619 -7414 -1344 6166 14833 1516 -4815 -8348
13824h348J5990j7640o217j347J2257R739j1699k489J4510L90Q05M339K945q977
$$ -8348 7642 -9998 -16215 -17562 -5305 4434 -7265 -9754 4756 5146 5951 10290 13235 4258
13810D258l767J5062R316j1042k3592n346R672N142j7979o553O975M463R498K803
$$ 4258 491 15553 24869 13827 -9765 -15111 -5439 -297 -18276 -24829 -17854 -13391 -3893 -1090
13796a090P814j233l022L529m615P974N602n653j1637M75N967l15N128j0717o580
$$ -1090 6724 5491 2469 5998 1383 9357 14959 9306 -2331 -1856 4111 3796 8924 -1793 -8373
13781h373J4281P591j0005N591o816q983m979k059P300n629n34K513K432Q909
$$ -8373 5908 13499 3494 9085 2269 -6714 -11693 -13752 -6452 -12081 -12615 -10102 -7670 1239
13767A239l973q749P904O852K005N87J360M450n076P770r689j0717R85N814L172
$$ 1239 -2734 -11483 -3579 3273 5278 5865 7225 11675 6599 14369 4680 -6037 -5052 762 3934
13752C934o57L969q626j1910j4948r73J0824J7608O453j9951R56M647Q907J1065
$$ 3934 3277 7246 -1380 -13290 -28238 -29211 -18387 -779 5674 -14277 -13321 -8674 233 11298
13738A1298K806Q81q293o025L667K3227P433r157p619n723J061m625N634M363
$$ 11298 14104 14985 6692 667 4334 27561 34994 25837 18218 12495 13556 8931 14565 18928
13724A8928n16j8721o191J5524M176k1832q096m45R904R688K367K016O216K787
$$ 18928 18412 -309 -6500 9024 13200 -8632 -16728 -17173 -7269 2419 4786 6802 13018 15805
13710A5805o780k924r722q785q635J24l860n991J1701J6248K881R625J919l277
$$ 15805 9025 6101 -3621 -12406 -21041 -20917 -24777 -30768 -19067 -2819 62 9687 11606 8329
13696H329n221L181M627J881p01q037o134L439o36j2501R407n256l559O526N032
$$ 8329 3108 6289 10916 12797 12096 4059 -2075 1364 728 -11773 -2366 -7622 -11181 -4655 377
13681C77L070L901M730j3791j554o397p137K380L499J1678P709j1811K197R887
$$ 377 3447 7348 12078 -1713 -3267 -9664 -16801 -14421 -10922 756 8465 -3346 -1149 8738
13667H738j3557k794P451K2455Q18K441j532j1505j3272m895j0779k488P107N584
$$ 8738 -4819 -7613 -162 22293 23111 25552 24020 12515 -757 -5652 -16431 -18919 -11812 -6228
13653f228M159K324N230M205k862R333L478n753K085Q451K395j0423j024j0975
$$ -6228 -2069 255 5485 9690 6828 16161 19639 13886 15971 24422 26817 16394 15370 4395
13639D395L59M837k1067m762J7536R368K03K709M746j8255K474L899P220m144
$$ 4395 4754 9591 -11476 -16238 1298 10666 10869 13578 18324 69 2543 6442 13662 9518
13625I518n190q311J246R764J1470j676j4620j3891o185R205J7684q350J155P589
$$ 9518 4328 -3983 -2737 7027 18497 16821 2201 -11690 -17875 -8670 9014 664 1819 9408
13611I408j108j3066Q31P962N403j2254r931Q297o346r96K561q012P180J8622
$$ 9408 8300 -4766 -3935 4027 9430 -2824 -12755 -4458 -10804 -11800 -9239 -17251 -10071 8551
13597H551N786o92o519J1724p392J014L702o82N39M064q272j0829K925N545N037
$$ 8551 14337 13645 7126 18850 11458 12472 16174 15492 16031 20095 11823 994 3919 9464 14501
13582A4501J5628K579j6977j698J916P186k465j3275j991K718L495J4238n915
$$ 14501 30129 32708 15731 14033 15949 23135 20670 7395 5404 8122 11617 25855 19940
13569A9940k489O214p20o428j7313j2888l154J1993J0249J4335r43p24l775j5427
$$ 19940 17451 23665 22945 16517 -796 -13684 -16838 -4845 5404 19739 18796 18072 14297 -1130
13555a130n729r032l808O556j455Q000J3825j587n739K712K5186N653j3294n289
$$ -1130 -6859 -15891 -19699 -13143 -14598 -6598 7227 5640 -99 2613 27799 33452 20158 14869
13541A4869j8161N71l815J806J4411J3070j2738j987M804j7039n933K662P94K349
$$ 14869 -3292 -2721 -6536 -4730 9681 22751 10013 8026 12830 -4209 -10142 -7480 -6686 -4337
13527d337m870q937L996J3282P440K329k7p003j1825m903j248P654J6320n786
$$ -4337 -9207 -18144 -14148 -866 6574 8903 8876 1873 -9952 -14855 -16103 -8449 7871 2085
13513B085j1643O129l228R191J7119J3062j236j4871k2417N054K814n911O957
$$ 2085 -9558 -3429 -6657 2534 19653 32715 31479 16608 -5809 -755 2059 -3852 3105
13500C105K367k556J1464N106N445o04m11J2762O974r872k4649O535K153K66l480
$$ 3105 5472 2916 14380 19486 24931 24327 23916 36678 43652 33780 9131 15666 17819 18085 14605
13485A4605K476J1323q549j7648p44j1656l779L52J186L630N985J664l90p048
$$ 14605 17081 28404 19855 2207 1463 -10193 -13972 -13620 -12434 -8804 -2819 -1155 -1545 -8593
13471h593K677J4274R627o591r415J2963J2596j1316j98p771j0893k41m952N91
$$ -8593 -5916 8358 17985 11394 1979 14942 27538 16222 16024 8253 -2640 -2881 -7833 -7242
13457g242M496M939j0826k666L732o872m486P599J387J5019k94k165J3435n704
$$ -7242 -2746 2193 -8633 -11299 -7567 -14439 -18925 -11326 -9939 5080 4786 2621 16056 10352
13443A0352j3120O57j640k636P902k499R882O170l018M171l479L306Q558q008
$$ 10352 -2768 -2111 -3751 -6387 1515 -984 8898 15068 12050 16221 12742 16048 24606 16598
13429A6598n152K144k080j586J0787J741J184K390j5827j8819M248O057J4921
$$ 16598 11446 13590 11510 9924 20711 22452 23636 26026 10199 -8620 -4372 1685 16606
13416A6606o21M214p20k731j2711l196n760L585l746N964K533r264n108P636Q571
$$ 16606 15985 20199 19479 16748 4037 841 -4919 -1334 -5080 884 3417 -5847 -10955 -3319 5252
13401E252Q52j319Q008O180q884L926q58j895k0570k0770K4519K3760J0689r53
$$ 5252 6104 4785 12793 18973 10089 14015 13157 11262 -9308 -30078 -5559 18201 28890 27937
13387B7937m356l554l691j2763L525P407o231j308j690m844k429k144p160Q475
$$ 27937 23581 20027 16336 3573 7098 14505 8274 6966 5276 432 -1997 -4141 -11301 -2826
13373b826K9797J419M98L348q505r200q455K496j0247j0890L302J3897L621m915
$$ -2826 26971 28390 28888 32236 23731 14531 6076 8572 -1675 -12565 -9263 4634 8255 3340
13359C340P234O874j3632m551K150J564J4091Q295l808j9816j3038j0613J907
$$ 3340 10574 17448 3816 -735 1415 2979 17070 25365 21557 1741 -11297 -21910 -20003
13346b0003p627k76J2365O518k0074J494L921l94J6949r366m825P130J8898J5575
$$ -20003 -27630 -27906 -15541 -9023 -29097 -27603 -23682 -24076 -7127 -16493 -21318 -14188 4710 20285
13332B0285Q60n20j53J219p488n310m154n673K994O105j484q370m8p186M683k854
$$ 20285 21145 20625 20472 21691 14203 8893 4739 -934 2060 8165 6681 -1689 -1737 -8923 -4240 -7094
13316g094n19P008l121j17L847Q753M349p941M412P201j674r44N291M637j7635
$$ -7094 -7613 -605 -3726 -3843 4 8757 13106 5165 9577 16778 15104 14160 19451 24088 6453
13301F453l118Q012k595N432R384J729r95m160J373m557o964j0967j3077o849
$$ 6453 3335 11347 8752 14184 23568 25297 24302 20142 21515 16958 9994 -973 -14050 -20899
13287b0899J7077Q886p730k304L667Q832m10J260J260J2180J3537J115j2250k5092
$$ -20899 -3822 5064 -2666 -4970 -1303 7529 7119 8379 9639 21819 35356 36471 24221 -871
13273h71j1169l025J5294N596J1536J2277n845j744j1232M442P158n651o374M764
$$ -871 -12040 -15065 229 5825 17361 29638 23793 22049 10817 15259 22417 16766 10392 15156
13259A5156R563J4369n891p328N798J0325p765p363m46k2752k0701J1576J4225
$$ 15156 24719 39088 33197 25869 31667 41992 34227 26864 26418 3666 -17035 -5459 8766
13246H766j435j1447M463L345J0117Q092J091O836J0058p469o374j5950m782o318
$$ 8766 7331 -4116 347 3692 13809 21901 22992 29828 39886 32417 26043 10093 5311 -1007
13232a007J380R146p919j1360M835l222j177K205Q796j506n348Q429K1564N221
$$ -1007 373 9519 1600 -9760 -4925 -8147 -9324 -7119 1677 171 -5177 3252 24816 30037
13218C0037k505m415j2518j2366j148R540J2040m116N74n929r44Q057J512J437
$$ 30037 27532 23117 10599 -1767 -2915 6625 18665 14549 15123 9194 8250 16307 17819 19256
13204A9256j5331p624M7k782M353R418l9J6474L502O046L979R69j2962j3903j637
$$ 19256 3925 -3699 -3652 -6434 -2081 7337 7298 23772 27274 33320 37299 38268 25306 11403 9766
13189I766K904J0777n229R17R808K863j2158p749o549j785L52N160N33N949K140
$$ 9766 12670 23447 18218 19135 28943 31806 19648 11899 5350 3565 3917 9077 9610 15559 17699
13174A7699N947R793l050j7528j4637j980k160O129R966m079m097P144p201M478
$$ 17699 23646 33439 30389 12861 -1776 -3756 -5916 213 10179 6100 2003 9147 1946 6424
13160F424J861p896J829J653J0651K327l412N827m10O39O574o908P784m625j7932
$$ 6424 8285 389 2218 3871 14522 16849 13437 19264 18854 19493 26067 19159 26943 22318 4386
13145D386j1960P37j3164N33K429J4143K0009N946k860k870j659j2294o224N494
$$ 4386 -7574 -6837 -20001 -19468 -17039 -2896 17113 23059 20199 17329 15670 3376 -2848 2646
13131B646J808K542O117j103J0229n525j3163n870L503r248K660K4750M190k887
$$ 2646 4454 6996 13113 12010 22239 16714 3551 -2319 1184 -8064 -5404 19346 23536 20649
13117B0649l487m369L142N906J021j813j733Q766P836k075j0893k080L164j4961
$$ 20649 17162 12793 15935 21841 22862 21049 19316 28082 35918 33843 22950 20870 24034 9073
13103I073o798L733J2090O606k173l395R459J0841p493j3057o068j97J8687Q065
$$ 9073 2275 6008 18098 24704 22531 19136 28595 39436 31943 18886 12818 12621 31308 39373
13089C9373m696j8469O407n431j2271O583J126j5660P931J8791l770j1524N998
$$ 39373 34677 16208 22615 17184 4913 11496 12622 -3038 4893 23684 19914 8390 14388
13076A4388J5989J6054k666k2611j5870m185m56J665Q3l152r776l055r660K305
$$ 14388 30377 46431 43765 21154 5284 1099 643 2308 2391 -761 -10537 -13592 -23252 -20947
13062b0947P266k464L014k90Q670J7348K750L91j514j0855l14J2126P805j0342
$$ -20947 -13681 -16145 -13131 -13421 -4751 12597 15347 15738 14224 3369 3055 15181 22986 12644
13048A2644n274M145q161k005R476k399n282k759j1448q00J5032J1296J0914J6672
$$ 12644 7370 11515 3354 1349 10825 8426 3144 385 -11063 -11863 3169 14465 25379 42051
13034D2051J3528J1258L765O109O41O03J7671L5350J8062M449K0774M7752P5102
$$ 42051 55579 66837 70602 76711 77352 77955 95626 130976 149038 153487 174261 222013 297115
13021B97115J02084J25828J34982J23077Q0867J7743n7558j11850j49587j27748
$$ 297115 399199 525027 660009 783086 863953 881696 824138 712288 562701 434953
13011D34953j12925p1763o4921n3688k9173k0663j5956P531q272m674M745l852
$$ 434953 322028 250265 185344 131656 102483 81820 65864 73395 65123 60449 65194 61342
12999F1342j5948j0637j468J1507M476O625M791J366p311j4453j2494n249q712
$$ 61342 45394 34757 33289 44796 49272 55897 60688 62054 54743 40290 27796 22547 13835
12986A3835o972l910L883Q096j349m564J0752j3095j4159J3448J6404N015J1041
$$ 13835 6863 2953 6836 14932 13583 9019 19771 6676 -7483 5965 22369 27384 38425
12973C8425J3349j5049j9535K704j497j1820N6N026J1734L416l187p786O163l663
$$ 38425 51774 36725 17190 19894 18397 6577 6633 11659 23393 26809 23622 15836 21999 18336
12959A8336j6698L530N324P669P052r075L426R075j550j4948k136K266M76l184
$$ 18336 1638 5168 10492 18161 25213 16138 19564 28639 27089 12141 10005 12271 12747 9563
12945I563J1833m71L511o013p268R35R461J0330p318l021J1039m660J187k190
$$ 9563 21396 20925 24436 18423 11155 12090 21551 31881 24563 21542 32581 27921 29108 26918
12931B6918o608m994R045l32L858j3979j1866r710L153J2391P862J8217J0095
$$ 26918 20310 15316 24361 24029 27887 13908 2042 -7668 -4515 7876 15738 33955 44050
12918D4050J000r927j8476Q34j517j95l348O740J5620J0702o884j1421q406q774
$$ 44050 45050 35123 16647 17481 15964 15769 12421 19161 34781 45483 38599 27178 18772 9998
12904I998j335l789k292k605K0q242M421J0131L282J7398j917j08N247m33K103
$$ 9998 8663 4874 2582 -23 -3 -8245 -3824 6307 9589 26987 25070 24962 30209 29776 31879
12889C1879N024L020m726j3162q903l815Q661Q692J4051p694j254p50j4847q2
$$ 31879 36903 39923 35197 22035 13132 9317 17978 26670 40721 33027 31773 31023 16176 16094
12875A6094J8415j616m900p479j0504K694L077p069Q827J4090K2279j1252k0515
$$ 16094 34509 32893 27993 20514 10010 12704 15781 8712 17539 31629 53908 42656 22141
12862B2141J994N994J7158P897l078J2513J2829J9956J3880K8729K0683K6769
$$ 22141 24135 30129 47287 55184 52106 64619 77448 97404 111284 140013 160696 187465
12850A87465Q434j3371p022k2330k3224j6486m792R204j4034r693q035j9308j0388
$$ 187465 195899 182528 175506 153176 129952 113466 108674 117878 103844 94151 86116 66808 56420
12837E6420j1362L975J303P0M582Q768M306l192j665q239j968N168p740j133O432
$$ 56420 45058 49033 50336 50406 54988 63756 68062 64870 63205 54966 52998 58166 50426 49293 55725
12822E5725r183j4398n454m354n3k996L986J984N556L322n608m752N954P728M93
$$ 55725 46542 32144 26690 22336 22283 19287 23273 25257 30813 34135 28527 23775 29729 37457 37950
12807C7950N87M330O888J1753N841o573p665r927M965L501l858O710J3552P726
$$ 37950 38537 42867 49755 61508 67349 60776 53111 43184 48149 51650 47792 54502 68054 75780
12793G5780r307O233m601m848j0924l9L493k0124o609m440r461m797Q032K0191
$$ 75780 66473 72706 68105 63257 52333 52294 55787 35663 29054 24614 15153 10356 18388 38579
12779C8579K470M469R997n412q704p334j072O164m29R459J6338N834l935j7672
$$ 38579 41049 45518 55515 50103 41399 34065 32993 39157 38728 48187 64525 70359 66424 48752
12765D8752j7162J9626J0987k314m153J2215R743j4955j4190k64O482O859J23
$$ 48752 31590 51216 62203 59889 55736 67951 77694 62739 48549 48285 54767 61626 61749
12752F1749L425J6096M399q065M99j780P945O351q62n046l889o612K339J2050
$$ 61749 65174 81270 85669 77604 78103 76323 84268 90619 89757 84711 80822 74210 76549 88599
12738H8599k615k914J0803j797J3356L144n806P846M627P236P817K365O344J1406
$$ 88599 85984 83070 93873 92076 105432 108576 102770 110616 115243 122479 130296 132661 139005 150411
12724A50411J2018M161j347n18o049k3537j2325r084o87n229l436O278k140n217
$$ 150411 162429 166590 165243 164725 158676 135139 122814 113730 113043 107814 104378 110656 108516 103299
12710A03299P611n21J6596J2220J1891Q662J2685m832p829L0j3127j4676J165
$$ 103299 110910 110389 126985 139205 151096 159758 172443 167611 159782 159812 146685 132009 133174
12697A33174J0342J1916L115r365P729J3258o98r534M118K897m968j3180N491
$$ 133174 143516 155432 158547 149182 156911 170169 169471 159937 164055 166952 161984 148804 154295
12684A54295R728K0242J1549R221J4116k442o287L781L723j0592J3019J7987J3386
$$ 154295 164023 184265 195814 205035 219151 216709 210422 214203 217926 207334 220353 238340 251726
12671B51726J0442J2478M073L803R110R139l225p480J2387K0367R288K4682K1582
$$ 251726 262168 274646 278719 282522 291632 300771 297546 290066 302453 322820 332108 356790 378372
12658C78372K1952L2457K7466L0988K2724K8504J3576R943l894J1281J5685M804
$$ 378372 400324 432781 460247 491235 513959 542463 556039 565982 562088 573369 589054 593858
12646E93858J0735J3696J2328J718O284J6615K2496M2332N0636L8893M7386N8636
$$ 593858 604593 618289 630617 632335 638619 655234 677730 720062 770698 809591 856977 915613
12634I15613N7201Q1736Q0546Q5256O4694P6473Q3079Q7888Q5660J11034J42549
$$ 915613 972814 1054550 1135096 1220352 1285046 1361519 1444598 1532486 1618146 1729180 1871729
12623A871729J48438J72866K16307K67364L20065M03686N25509O75254Q36953
$$ 1871729 2020167 2193033 2409340 2676704 2996769 3400455 3925964 4601218 5438171
12614E438171R91874J121168J204147J238433J277192J392292J670702K204763
$$ 5438171 6430045 7551213 8755360 9993793 11270985 12663277 14333979 16538742
12606A6538742L050844M242931N850849Q076024J1383872J6294344K2905468K9737780
$$ 16538742 19589586 23832517 29683366 37759390 49143262 65437606 88343074 118080854
12598A18080854L2512030K6074303R498048j1879280k9056245l5519437l1702547
$$ 118080854 150592884 176667187 186165235 174285955 145229710 109710273 78007726
12591G8007726k3344305j5556893j0063890o570741m377436k938092j981513j350332
$$ 78007726 54663421 39106528 29042638 22471897 18094461 15156369 13174856 11824524
12583A1824524r50087q10514q51914r69972j077900j083259r57242p64867n91473
$$ 11824524 10874437 10063923 9212009 8242037 7164137 6080878 5123636 4358769 3767296
12574C767296m52639l54775k93461k56632k19727j87428j64681j45076j36675
$$ 3767296 3314657 2959882 2666421 2409789 2190062 2002634 1837953 1692877 1556202
12565A556202j28533j03710r2347p4710o8204n9886m8559n1281m6722n6314l1759
$$ 1556202 1427669 1323959 1231612 1156902 1088698 1028812 980253 928972 882250 825936 794177
12554G94177l1257j6208j6355p924k8553j1562m623r349k0247k7391k8967j4090
$$ 794177 762920 746712 730357 722433 693880 682318 677695 668346 648099 620708 591741 577651
12542E77651L947J0715m392q309l2812k3382k4537m4755k7719k8816k5996j3533
$$ 577651 581598 592313 587921 579612 546800 523418 498881 454126 426407 397591 371595 358062
12530C58062r440J409p091j1130j7388j5543j9585k5751j0531j055k693j834q204
$$ 358062 348622 350031 342940 331810 314422 298879 279294 253543 243012 241957 239264 237430 229226
12517B29226l986K610j9910q513j5300j3332L573M573q576m306J5115Q700n271
$$ 229226 225240 227850 207940 199427 184127 170795 174368 178941 170365 166059 181174 189874 184603
12504A84603k0451k4400n429J1183r240j8722j6115k440L339P070M127J724p644
$$ 184603 164152 139752 134323 145506 136266 117544 101429 98989 102328 109398 113525 115249 107605
12491A07605M003K176j4944l198K956N04J1705O928J6412O774O87R944j738j1784
$$ 107605 111608 113784 98840 95642 98598 99102 110807 117735 134147 140921 141608 151552 149814 138030
12477A38030J075J2941J462o060k0961j1917j7440k1105j8366R520J4277o139
$$ 138030 139105 152046 153508 147448 126487 114570 97130 76025 57659 67179 81456 75317
12465G5317l745j0291l014J7143K59l536J929p664n93l69j1433O67J470l020r196
$$ 75317 71572 61281 58267 75410 75669 72133 74062 66398 65805 65436 54003 54670 56140 53120 43924
12450D3924r773j1039K34K642P87J1175J0614p685m324R940L447Q336P927R7m85
$$ 43924 34151 23112 23346 25988 26775 37950 48564 40879 36555 46495 49942 58278 66205 66302 65817
12435F5817j659n208p27m621L614m088n254k551l139r177K715K92n129J7030J4501
$$ 65817 64158 58950 58223 53602 57216 53128 47874 45323 42184 33007 35722 36014 30885 47915 62416
12420F2416K365l859L651J5700q844j3779q037p022K991P694k003P591K307o743
$$ 62416 64781 60922 64573 80273 71429 57650 49613 42591 45582 53276 51273 58864 61171 54428
12406E4428k92q401j4972l140j4713r070Q074N658K899R774N818K519j493p60
$$ 54428 54136 45735 30763 27623 12910 3840 11914 17572 20471 30245 36063 38582 37089 36329
12392C6329L80o677j9679n352J4137q031R1R446m93n268o057N493J4063J7337
$$ 36329 36709 30032 10353 5001 19138 11107 11198 20644 20151 14883 8826 14319 28382 45719
12378D5719O09n571k866J3389O951k2263p340N746n984p882p700M949O192r725
$$ 45719 46328 40757 37891 51280 58231 35968 28628 34374 28390 20508 12808 17757 23949 14224
12364A4224N44K471j6230p91M066k635J2835N337l469l979L388J267k501j783
$$ 14224 14768 17239 1009 218 4284 1649 14484 19821 16352 12373 15761 17028 14527 12744
12350A2744o839k421m510q59J1238P461o729j310J6674M392p235r259m406J250
$$ 12744 5905 3484 -1026 -1885 9353 16814 10085 8775 25449 29841 22606 13347 8941 10191
12336A0191m4J46R309O267J931n809n177J6550j806M0l930l367J0302r555j1089
$$ 10191 10147 10293 19602 25869 27800 21991 16814 33364 31558 31598 27668 24301 34603 25048 13959
12321A3959p659j339M288J9239j4900q143O188Q436l169r569O836O836p913j5434
$$ 13959 6300 4961 9249 28488 13588 5445 11633 20069 16900 7331 14167 21003 13090 -2344
12307b344J04K610m605m86J0501P716j1084O82J3335K708M532n560O044K026J7168
$$ -2344 -2240 370 -4235 -4721 5780 13496 2412 3094 16429 19137 23669 18109 24153 26179 43347
12292D3347R790J773p033j3458j578Q94j5647k4399r416j813J1514J0590J0316
$$ 43347 53137 54910 47877 34419 32841 33735 18088 -6311 -15727 -17540 -6026 4564 14880
12279A4880r565q539J8575O381o033p710P42J019k892q535M300N271m097R704
$$ 14880 5315 -3224 15351 21732 15699 7989 8731 9750 6858 -1677 2623 7894 3797 13501
12265A3501P608j0378j2004J856p413K411J0755k272K009P807K888L044J0135
$$ 13501 21109 10731 -1273 583 -6830 -4419 6336 4064 6073 13880 16768 19812 29947
12252B9947n60r185L686N394q106M659K333r440j7485k533k737n430l24J2284
$$ 29947 29387 20202 23888 29282 21176 25835 28168 18728 1243 -1290 -4027 -9457 -9781 2503
12238B503N177P503j7024j1005J1363J0822m782j626l66N934j217q888j020M130
$$ 2503 7680 15183 -1841 -12846 -1483 9339 4557 2931 2565 8499 7282 -1606 -2626 1504
12224A504J5072N530J0587r710k1696O335J0735Q74P167j730j8560P949J7821
$$ 1504 16576 22106 32693 22983 1287 7622 18357 19231 26398 24668 6108 14057 31878
12211C1878Q535m425o688o372j584N642J2717J5041K3968M866j410J661K2166
$$ 31878 40413 35988 29300 22928 21344 26986 39703 54744 78712 83578 82168 83829 105995
12198A05995J6156K5108J7763Q163p315r745j7293j0693j4665j4728n378j4932
$$ 105995 122151 147259 165022 173185 165870 156125 138832 128139 113474 98746 93368 78436
12186G8436Q84Q643J0221O172L028J1191J5039K3775J8449K7298M6767P7124R9122
$$ 78436 79320 87963 98184 104356 107384 118575 133614 157389 175838 203136 249903 327027 426149
12173D26149J31538J55616J59185Q5629j3866j25696j82593j63659j20155p9155
$$ 426149 557687 713303 872488 958117 944251 818555 635962 472303 352148 272993
12163B72993o8144m5870j4897k0271k5343j8999m269M266m931K409k3591q103
$$ 272993 204849 158979 144082 123811 98468 79469 75200 79466 74535 76944 53353 45250
12151D5250M8L886M125o566l181N010p841m78r452J243J622j5698j2978k937K7249
$$ 45250 45298 49184 53309 46743 43562 48572 40731 40253 30801 32044 33666 17968 4990 2053 29302
12136B9302O871R813L25j325r397l367q42o581p651R24o91o787Q74Q54j859R239
$$ 29302 36173 45986 46311 44986 35589 32222 31380 24799 17148 18072 17381 10594 11468 12322 10463 19702
12120A9702j641J4079J3419J840O989K320J3711j1170j9473q773o264m724L647
$$ 19702 18061 32140 45559 47399 54388 56708 70419 59249 39776 31003 24739 20015 23662
12107B3662k390m835Q929l498j397k484N42P217J7966Q649K533O059l763l268
$$ 23662 21272 16437 25366 21868 20471 17987 18529 25746 43712 52361 54894 60953 57190 53922
12093E3922k71J049n648P817J6823J1052J2570P398K4186L3438K5860L2077J9419
$$ 53922 53651 54700 49052 56869 73692 84744 97314 104712 128898 162336 188196 220273 239692
12080B39692M2330M3259N4862M7520L2366N6698O9728Q6192J20072J66904K35263
$$ 239692 282022 325281 380143 427663 460029 516727 586455 672647 792719 959623 1194886
12069A194886L36526M62363O50164Q85016J040643J081844Q78601L75589k88866
$$ 1194886 1531412 1993775 2643939 3528955 4569598 5651442 6530043 6905632 6616766
12060F616766q51304j146843j152584r63023o98165m62485l32556k33741j54329
$$ 6616766 5765462 4618619 3466035 2503012 1804847 1342362 1009806 776065 621736
12051F21736r4451m5627l0293k4994l2361l8975l5779l7890m5593l7766j8107
$$ 621736 527285 481658 451365 426371 394010 355035 319256 281366 235773 198007 179900
12040A79900k3174k1998k3464k223o094n350r409j3997j100k517j1934q546J0903
$$ 179900 156726 134728 111264 109041 102947 97597 88188 74191 73091 70574 58640 50094 60997
12027F0997n060j333j5439k933J122r00j040j1467P545L364P06K661k147o781
$$ 60997 55937 54604 39165 36232 37354 36454 35414 23947 31492 34856 35562 38223 36076 29295
12013B9295R617J1511p318q478k289r748j0711J424J908M771o750p627j83r744
$$ 29295 38912 50423 43105 34627 32338 22590 11879 13303 15211 19982 13232 5605 5422 -4322
11999d322P039J3918O66j2627l119o30P425m495M888K298M797O091P118J278j7746
$$ -4322 2717 16635 17301 4674 1555 925 8350 3855 8743 11041 15838 21929 29047 30325 12579
11984A2579j5067j1208J2261P245J915m017p422K6J2453J0205L912m740m313j970
$$ 12579 -2488 -13696 -1435 5810 7725 3708 -3714 -3688 8765 18970 22882 18142 13829 11859
11970A1859j57J2579N728j503r909j1878N25J3117K085q82j3474j1204J0318J0441
$$ 11859 11702 24281 30009 28506 18597 6719 7244 20361 22446 21564 8090 -3114 7204 17645
11956A7645M851j2298k562J4786P207k0335j8656J1765L499q414J4500P654l977
$$ 17645 22496 10198 7636 22422 29629 9294 -9362 2403 5902 -2512 11988 19642 15665
11943A5665Q04M861K512R817P082k10J789n157j2340j2233o843O568L988k483
$$ 15665 16469 21330 23842 33659 40741 40531 42320 37163 24823 12590 5747 12315 16303 13820
11929A3820Q515j768m05J3316p741l856J8215j1360k3488k0229N272N176j382
$$ 13820 22335 20567 20162 33478 25737 21881 40096 28736 5248 -14981 -9709 -4533 -5915
11916e915K298J1265J1001L409q817j0825K72K44j2816L54L003J1059N221m067
$$ -5915 -3617 7648 18649 22058 13241 2416 2688 2932 -9884 -9530 -6527 4532 9753 5686
11902E686P057K214M20j4575o462J3087J8408m41K990n148K436o141o376K103
$$ 5686 12743 14957 15377 802 -5660 7427 25835 25394 28384 23236 25672 19531 13155 15258
11888A5258M379R913J3581J5294K7801Q567k369q896j3797J825j7599j2172j3189
$$ 15258 19637 29550 43131 58425 86226 94793 92424 83528 69731 71556 53957 41785 28596
11875B8596j2446M628j874P042N644j4384q11l910J1712J0647j3816k729k435
$$ 28596 16150 20778 18904 25946 31590 17206 16395 12485 24197 34844 21028 18299 15864
11862A5864j4178L806J4525M354L918o758J1383R22j1173k562k071L791N638n279
$$ 15864 1686 5492 20017 24371 28289 21531 32914 33836 22663 20101 18030 21821 27459 22180
11848B2180j1871l602m193l617m637o78K448M634J129k905j3751M191R190L855
$$ 22180 10309 6707 2514 -1103 -5740 -6418 -3970 664 1793 -1112 -14863 -10672 -1482 2373
11834B373L965J6918M022o363j9528k20n91N41K907J2966L958j2853j838P39P40
$$ 2373 6338 23256 27278 20915 1387 1167 576 1117 4024 16990 20948 8095 6257 6996 7736
11819G736n378l261k403L912r164J934O099j4159K689K773J4933N599o515O43
$$ 7736 2358 -903 -3306 606 -8558 -6624 -525 -14684 -11995 -9222 5711 11310 4795 5438
11805E438n503N870K275m347p185N913K199j630p385J3106K982l957O108P974
$$ 5438 -65 5805 8080 3733 -3452 2461 4660 3030 -4355 8751 11733 7776 13884 21858
11791B1858j2049j1736P734P56l204p625J0503L968o945p912k697l133J0233R822
$$ 21858 9809 -1927 5807 6563 3359 -4266 6237 10205 3260 -4652 -7349 -10482 -249 9573
11777I573N831n990o333M329M652R463J3277j2401j5655n53J1929k652n356n573
$$ 9573 15404 9414 3081 7410 12062 21525 34802 22401 6746 6193 18122 15470 10114 4541
11763D541p475K48R694J4900r331l336p39n855m880k771J6492N89L076l309k528
$$ 4541 -2934 -2686 7008 21908 12577 9241 8502 2647 -2233 -5004 11488 12077 15153 11844 9316
11748I316L428l531J0768k390M035N499j0176o694O996P117K907n910p689p029
$$ 9316 12744 9213 19981 17591 21626 27125 16949 10255 17251 24368 27275 21365 13676 6647
11734F647N45k94j1938j5135n995R796J2493L974J969o452l152n041J8940k908
$$ 6647 7192 6898 -5040 -20175 -26170 -16374 -3881 93 2062 -4390 -7542 -12583 6357 3449
11720C449l069J1345m150K054O91N498J2963j1847o497K581m454k504r840J0008
$$ 3449 380 11725 7575 9629 10320 15818 28781 16934 10437 13018 8564 6060 -3780 6228
11706F228J0106L091l534j1412J7956J214k2383J482p231p075k221R424K920m293
$$ 6228 16334 19425 15891 4479 22435 23649 1266 2748 -4483 -11558 -13779 -4355 -1435 -5728
11692e728R267N673P719L645L683j3845p998j7576M401K3175J265j41J647P586
$$ -5728 3539 9212 16931 20576 24259 10414 2416 -15160 -10759 12416 13681 13540 15187 22773
11678B2773l06p341j0621K87L375K2659J4901j541j9372j1620l013J5907J0411
$$ 22773 22467 15126 4505 4792 8167 30826 45727 44186 24814 13194 10181 26088 36499
11665C6499J652p651j8961m85K140O3l070j2054L894P434k826M121J5325J33q529
$$ 36499 38151 30500 11539 11054 13194 13257 10187 -1867 2027 9461 6635 10756 26081 26214 17685
11650A7685r5M2j912K091n415P108J0715M598N853J394n081M513j1181j1494m719
$$ 17685 17590 17632 15720 17811 12396 19504 30219 34817 40670 42064 36983 41496 30315 18821 14102
11635A4102K913j2509m811L826j771K3786R867j2190j0096r686q8N706j269O794
$$ 14102 17015 4506 -305 3521 1750 25536 35403 23213 13117 3431 3343 9049 7780 14574
11621A4574o913J774K253P281q328M197M083O598Q923o215k404o416K120N891
$$ 14574 7661 9435 11688 18969 10641 14838 18921 25519 34442 28227 25823 19407 21527 27418
11607B7418j441P191n318k4131o467J5728J333m260N096P65p536K171M590P94
$$ 27418 25977 33168 27850 3719 -2748 12980 14313 10053 15149 15914 8378 10549 15139 15933
11593A5933K286J1364j830M614p078p069j5665o241O129L994J184K280N878M797
$$ 15933 18219 29583 27753 32367 25289 18220 2555 -3686 2443 6437 7621 9901 15779 20576
11579B0576K764j426j478l201r43K022R430O05j3268J48p584O923L574Q05P927
$$ 20576 23340 21914 20436 17235 16292 18314 27744 28349 15081 15229 7645 14568 18142 18947 26874
11564B6874K953l533M507j5246j1183l735O062J3750k598j4422o504R821M275
$$ 26874 29827 26294 30801 15555 4372 637 6699 20449 17851 3429 -3075 6746 11021
11551A1021O121R268o702k134j660j1293o661N388P918N888j0390L057J1674P618
$$ 11021 17142 26410 19708 17574 15914 4621 -2040 3348 11266 17154 6764 9821 21495 29113
11537B9113l958N613p502N255J849N21j2031j3774J0411j3374q789J0103L121
$$ 29113 25155 30768 23266 28521 30370 30891 18860 5086 15497 2123 -6666 3437 6558
11524F558K971O347l331q59K419R032m106n283K266O8K836n150j356k739R595
$$ 6558 9529 15876 12545 11686 14105 23137 19031 13748 16014 16082 18918 13768 12412 9673 19268
11509A9268Q352j5489N696L367P735j5114j3453N350J0632q336P875K528q11J297
$$ 19268 27620 12131 17827 21194 28929 13815 362 5712 16344 8008 15883 18411 17600 18897
11495A8897N347J674o391R847R950l437k47L259O33m021M942o787j3763l667K02
$$ 18897 24244 25918 19527 29374 39324 35887 35640 38899 39532 35511 40453 33666 19903 16236 16438
11480A6438K567J8148j1694k639J771L433r831L884O405m648k345j0562j930k718
$$ 16438 19005 37153 25459 22820 24591 28024 18193 22077 28482 23834 21489 10927 8997 6279
11466F279J4503J0657j813j662o784j5338j0383K269P202o654o513o209J5121
$$ 6279 20782 31439 29626 27964 21180 5842 -4541 -2272 4930 -1724 -8237 -14446 675
11453F75J6018K28J144L71N299q674l713P883J7322o98r520m252J1110n274p806
$$ 675 16693 16921 18065 18436 23735 15061 11348 19231 36553 35855 26335 22083 33193 27919 20113
11438B0113j0158o069L897N815p764L843J1048l243N014j127m135j746R778j0268
$$ 20113 9955 3886 7783 13598 5834 9677 20725 17482 22496 21369 17234 15488 25266 14998
11424A4998L460K773n950P936L118Q963R938p009o203o844j894l28M642J0507
$$ 14998 18458 21231 15281 23217 26335 35298 45236 38227 32024 25180 23286 22958 27600 38107
11410C8107M21o566O576J61P97J5000K4263j243l5934k0437P578J3375n754J934
$$ 38107 38528 31962 38538 38699 39496 54496 78759 77516 41582 21145 28723 42098 36344 38278
11396C8278J1622M140q949j4203o126j672M715L157J505j2501j2174J860M355
$$ 38278 49900 54040 45091 30888 24762 23090 27805 30962 32467 19966 7792 9652 14007
11383A4007R596Q82J1439J4091K19q299r126r974m534j938P250J729q887Q958
$$ 14007 23603 24485 35924 50015 50234 41935 32809 22835 18301 16363 23613 25342 16455 25413
11369B5413K286o610j0556J4648J1521r854k939k611q772o577P92L224R105j388
$$ 25413 27699 21089 10533 25181 36702 26848 23909 21298 12526 5949 6741 9965 19070 17682
11355A7682j0109o811N961J3416J3498p485o320q382r101N301R721L097J3409
$$ 17682 7573 762 6723 20139 33637 26152 19832 11450 2349 7650 17371 20468 33877
11342C3877O191R589p944j0921Q198k217k527m336J522R741L208r814j6152L995
$$ 33877 40068 49657 41713 30792 38990 36773 34246 29910 31432 41173 44381 34567 18415 22410
11328B2410m432L895N684N609M778q710j0245o483L674N386N132n425N175n682
$$ 22410 17978 21873 27557 33166 37944 29234 18989 12506 16180 21566 26698 21273 26448 20766
11314B0766j4161l375J3596M273p88P113n103n540j0661J764J9913K329J3263
$$ 20766 6605 3230 16826 21099 20311 27424 22321 16781 6120 7884 27797 30126 43389
11301D3389O220J949p873r721j6946J6169J0757m845n467j5658j038n170J443
$$ 43389 49609 51558 43685 33964 17018 33187 43944 39099 33632 17974 16936 11766 13209
11288A3209Q666J6325O957J682r60J57Q201N75l679j3251q094j3475r679P843
$$ 13209 21875 38200 45157 46839 45879 46036 54237 54812 51133 37882 29788 16313 6634 14477
11274A4477P54N036P248Q032j764M9J0429j850j6347m748J442j0979l567l295
$$ 14477 15231 20267 27515 35547 33783 33832 44261 42411 26064 21316 22758 11779 8212 4917
11260D917J1945j3600O142K4311p392Q206L133j7555j220J0662j756O68M002P114
$$ 4917 16862 3262 9404 33715 26323 34529 37662 20107 18887 29549 27793 28461 32463 39577
11246C9577j697q010n519J857j4132j518R407Q35r225K204J3433Q413j967J0910
$$ 39577 37880 29870 24351 26208 12076 10558 19965 20800 11575 13779 27212 35625 33658 44568
11232D4568J1610O744k1154l944j0538q764o158L153J2086P477P992m372r011
$$ 44568 56178 62922 41768 37824 27286 18522 12364 15517 27603 35080 43072 38700 29689
11219B9689o787k4J5637K0449K015j1855m326j93k17n686j1615j4198j2255J7293
$$ 29689 22902 22878 38515 58964 60979 49124 44798 44605 44388 38702 27087 12889 634 17927
11205A7927K64J3J1981K5703l06p492j1056p19M505j1912N235k010M733P625N228
$$ 17927 18191 18204 30185 55888 55582 48090 37034 36315 40820 28908 34143 32133 36866 44491 49719
11190D9719q713R586M881l620p5j1458J361J0091J1572r448j0474L428J4947o967
$$ 49719 41006 50592 55473 51853 51778 40320 41681 51772 63344 53896 43422 46850 61797 54830
11176E4830k1216M534R72l482J0085Q972p897j1479j514j697k604n469L854K926
$$ 54830 33614 38148 39120 35638 45723 54695 46798 35319 33805 32108 29504 24035 27889 30815
11162C0815p362M962J9955J443p699J374K3260J3739j2178j4614N903R294J656
$$ 30815 23453 28415 48370 49813 42114 43488 66748 80487 68309 53695 59598 68892 70548
11149G0548M457J589k273p681P87m115j61j48L342j6931m639k948r729P742J8661
$$ 70548 75005 76594 74321 66640 67427 63312 63151 63003 66345 49414 44775 41827 32098 39840 58501
11134E8501j466j2724j1908N996O935m10K191J817N770k225L327j570m164q06
$$ 58501 57035 44311 32403 38399 45334 44924 47115 48932 54702 52477 55804 54234 50070 49264
11120D9264k074r57N589j8011j5212J0233M644P159M530j947j0411l884R04J2690
$$ 49264 47190 46233 51822 33811 18599 28832 33476 40635 45165 43218 32807 28923 29827 42517
11106D2517N569L108j3571J722l851Q267R633o134m811J7707M206m460m879j0869
$$ 42517 48086 51194 37623 39345 35494 43761 53394 47260 42449 60156 64362 59902 55023 44154
11092D4154O566N398l305q183K265m594P333K534o84o745J497n733J1249K642
$$ 44154 50720 56118 52813 44630 46895 42301 49634 52168 51484 44739 46236 40503 51752 54394
11078E4394L327N084J096l727j0484J045k128r348j1766l893J0278O190P844j017
$$ 54394 57721 62805 63901 60174 49690 50735 48607 39259 27493 23600 33878 40068 47912 46895
11064D6895k145J2721J695o623L359p955q213L917J7035k659j2531n644n026J2060
$$ 46895 44750 57471 59166 52543 55902 47947 39734 43651 60686 58027 45496 39852 34826 46886
11050D6886P344N42j0379j885K1535n46m63J953j820K107J6247k639j1601n182
$$ 46886 54230 54772 44393 42508 64043 63497 63034 64987 63167 65274 81521 78882 67281 62099
11036F2099O242M000j7169m837l75O603m902Q500J3777L72j4687Jk428l888l42
$$ 62099 68341 72341 55172 50335 49960 56563 51661 60161 73938 74310 59623 59624 57196 53308 52966
11021E2966r598m042l571M887R011L918j242R525J3946j0740j2278o65N399l201
$$ 52966 43368 39326 35755 40642 49653 53571 52329 61854 75800 65060 52782 52117 57516 54315
11007E4315p599m177k861N563J4637M745p42j2383m863q82Q217J6627o45n245
$$ 54315 46716 42539 39678 45241 59878 64623 63881 51498 46635 45753 53970 70597 69952 64707
10993F4707k581j4787j922J1187P103N321m682j9473j0708k25n05p195J7559J2568
$$ 64707 62126 47339 45417 56604 63707 69028 64346 44873 34165 33940 33435 26240 43799 56367
10979E6367k640P655l465p162k0309n38J6594N748K702j0797m994L082O450K043
$$ 56367 53727 61382 57917 50755 30446 29908 46502 52250 54952 44155 39161 42243 48693 50736
10965E0736j697O468m907k046N638L523J3260O458n05j304p443j2812K531J800
$$ 50736 49039 55507 50600 48554 54192 57715 70975 77433 76928 75624 68181 55369 57900 59700
10951E9700K575k995l162Q645J3449K5103n096j7499j5741M603J2660R086l665
$$ 59700 62275 59280 56118 64763 78212 103315 98219 80720 64979 69582 82242 91328 87663
10938H7663L030P276J0358l298O299K3558M729J808N75J9072K8168J1857L1175
$$ 87663 90693 97969 108327 105029 111328 134886 139615 141423 141998 161070 189238 201095 232270
10925B32270M8351N4751P3323R8528J36371K20336L12279L56539K54541m0913
$$ 232270 280621 335372 408695 507223 643594 863930 1176209 1532748 1787289 1746376
10915A746376l11121l98295l20355k06424j21461p7939n0741l1005l4222k1932
$$ 1746376 1435255 1036960 716605 510181 388720 310781 260040 229035 194813 172881
10905A72881k5469o007J5903j0841n724n256p100m516Rn103j7490o91J880p905
$$ 172881 147412 141405 157308 146467 140743 135487 128387 123871 123880 118777 101287 100596 102476 94571
10891I4571l195k901R447J050J2279N899j0434m87m096j047N222K886m461j0576
$$ 94571 91376 88475 97922 98972 111251 117150 106716 106229 102133 101086 106308 109194 104733 94157
10877I4157j6286N864L775L09n82j7891j0718j444N174M688n4L154O266j0943
$$ 94157 77871 83735 87510 87819 87237 69346 58628 57184 62358 67046 66992 70146 76412 65469
10863F5469N774k094J047J2911N668l524o72r460P03J056P324p517O359k932j3660
$$ 65469 71243 69149 70196 83107 88775 85251 84579 75119 75822 76878 84202 76685 83044 80112 66452
10848F6452j175o60N994j345n643R273J773n279Q367P448k107m683n84J836k594
$$ 66452 65277 64617 70611 69266 63623 72896 74669 69390 77757 85205 83098 78415 77831 79667 77073
10833G7073l350K909P602M472k628J1081q348j0179o17J2073l939j2981j3659
$$ 77073 73723 76632 84234 88706 86078 97159 88811 78632 78015 90088 86149 73168 59509
10820E9509K107O361P146j351L976N9J3597O783K81p301o19J924j566P117k708
$$ 59509 61616 67977 75123 73772 77748 77807 91404 98187 98468 91167 90548 92472 90906 98023 95315
10805I5315j8111n182j6195j5621n533o698J0411J6351K3402O562N169P514M316
$$ 95315 77204 72022 55827 40206 34673 27975 38386 54737 78139 84701 89870 97384 101700
10792A01700r665p888J69m524q361K85J1109J9746M383j440n94P842L752j205
$$ 101700 92035 84147 84316 79792 71431 71716 82825 102571 106954 105514 104920 112762 116514 115309
10778A15309K2N646O822l41o362m296o096j8j135j3408l092O861J4855J7338J948
$$ 115309 115331 120977 127799 127458 121096 116800 110704 110686 109551 96143 93051 99912 114767 132105 134053
10763A34053j782P335o85Q747K5680K8707K6817P198J7482L2888M8055L4682L253
$$ 134053 132271 139606 138921 147668 173348 202055 228872 236070 253552 286440 334495 369177 372430
10750C72430j9810k6522k8393n5275m3557q858q781J8604O956r689j5002k108
$$ 372430 352620 326098 297705 242430 198873 190015 181234 199838 206794 197105 182103 179995
10738A79995l921j2489j0207p002O384N506j5582J153j003m535P627J6155r821
$$ 179995 176074 163585 153378 146376 152760 158266 142684 143837 142834 138299 145926 162081 152260
10725A52260j7837k368j9600j8636K94L543M563N503N876K316K616O471o341J7571
$$ 152260 134423 132055 112455 93819 94113 97656 102219 107722 113598 115914 118530 125001 118660 136231
10711A36231J1864K233r090m836l498m367O448J8030j392m887m515j6288j7202
$$ 136231 148095 150328 141238 136402 132904 128537 134985 153015 151623 146736 142221 125933 108731
10698A08731N869J9408K2018K1772l086j3779P738J6829N244j8269l8260k9021
$$ 108731 114600 134008 156026 177798 174712 160933 168671 185500 190744 172475 134215 105194
10686A05194p531O260P757J7855J6273N086l032N514j6456j9126k088R514m147
$$ 105194 97663 103923 111680 129535 145808 150894 147862 153376 136920 117794 115706 125220 121073
10673A21073l232J2177K2726J7038j360Q79p466j1545Q804K0332O982O208l532
$$ 121073 117841 130018 152744 169782 168422 169301 161835 150290 159094 179426 186408 192616 189084
10660A89084r256j2479j8741N366J1940J6424J4140K9369K3773K067P48J6498
$$ 189084 179828 167349 148608 153974 165914 182338 196478 225847 249620 251687 252435 268933
10648B68933J8772J5497J0566J0831K5520J6944k338K8628N1729O5491P6013R7565
$$ 268933 287705 303202 313768 324599 350119 367063 364725 393353 445082 510573 586586 684151
10636F84151J23953J68696K30852L21571M31335M99298M11070K05574J2431j12705
$$ 684151 808104 976800 1207652 1529223 1960558 2459856 2870926 3076500 3088931 2976226
10626B976226k11756l29515m49120m82532m21164k85352j60719r0340o2908m7760
$$ 2976226 2764470 2434955 1985835 1503303 1082139 796787 636068 545728 482820 435060
10616D35060k2581l1011j4203j307n982m440P899K2762K0467J1036J0828q155
$$ 435060 412479 381468 367265 365958 359976 355536 363435 386197 406664 417700 428528 420373
10604D20373n275l0963j9795j022p501k207J1664Q855P520K938j0036n339m635
$$ 420373 415098 384135 364340 363318 355817 353610 365274 374129 381649 384587 374551 369212 364577
10591C64577j1108q291p196J1624K0665J8682K3019K2995K3570J6404Q77M976
$$ 364577 353469 345178 337982 349606 370271 388953 411972 434967 458537 474941 475818 480794
10579D80794J6514J7675J1576N878r579j3089L446P469J981K363J0076J0203K1666
$$ 480794 497308 514983 526559 532437 522858 509769 513215 520684 522665 525028 535104 545307 566973
10566E66973J3910N719K067o684n099Q08P967K2160J9871M1124M0315K9883K0782
$$ 566973 580883 586602 588669 581985 576886 577694 585661 607821 627692 668816 709131 739014 759796
10553G59796K7334K3895K8058J4336K7742K9440L1095L3874L0487K3246L7769
$$ 759796 787130 811025 839083 853419 881161 910601 941696 975570 1006057 1029303 1067072
10542A067072L2478O9899R4791P7863O4868O7980Q0938P8556Q1477P8631J01767
$$ 1067072 1099550 1169449 1264240 1342103 1406971 1474951 1555889 1634445 1715922 1794553 1896320
10531A896320J22000J12175J12073J23971J37523J62776K16114K68765L01485
$$ 1896320 2018320 2130495 2242568 2366539 2504062 2666838 2882952 3151717 3453202
10522C453202L54156M01658N13544O55819Q37338J020893J100778J012888Q74109
$$ 3453202 3807358 4209016 4722560 5378379 6215717 7236610 8337388 9350276 10224385
10513A0224385R22903J290718J894756K671090L677890M997660O676997Q688222
$$ 10224385 11147288 12438006 14332762 17003852 20681742 25679402 32356399 41044621
10505D1044621J1162269J4894458K1341800L2072796M7255665O3728975O8602301
$$ 41044621 52206890 67101348 88443148 120515944 167771609 231500584 300102885
10498C00102885L6493126k8182592p2881167p3942766n3137485l3523212k0973796
$$ 300102885 336596011 308413419 235532252 161589486 108452001 74928789 53954993
10491E3954993j3613361r172509o398260m599396l388173k559451j923719j450098
$$ 53954993 40341632 31169123 24770863 20171467 16783294 14223843 12300124 10850026
10483A0850026j085449p34004m97561n08762o98154q32180p99499o83297n45726
$$ 10850026 9764577 9030573 8533012 8024250 7326096 6493916 5694417 5011120 4465394
10474D465394m36296l67458l26028l11015k69406k39199k16499j95386j66483
$$ 4465394 4029098 3661640 3335612 3024597 2755191 2515992 2299493 2104107 1937624
10465A937624j22021q8511p5704p0704n9574n0600n2990o6582m0891m4927m3907
$$ 1937624 1815603 1727092 1651388 1580684 1521110 1470510 1417520 1350938 1310047 1265120 1221213
10454A221213m5346n4027o4891m4584m0036m3823m5992o1296m3945k7910j9152
$$ 1221213 1175867 1121840 1056949 1012365 972329 928506 882514 821218 777273 749363 730211
10443G30211j1835k396l950j1137j5n392r772j4657k8201k9307k632q053j2346
$$ 730211 718376 715980 712030 700893 700878 695486 685714 671057 642856 613549 610917 602864 590518
10430E90518k9646k3803K654k742j6793j0028m76j1042n415p32R542q772j8325
$$ 590518 560872 537069 539723 536981 520188 510160 509684 498642 493227 492495 502037 493265 474940
10417D74940k1279j8442j3133p402k874j875P067m210k4384p508j3296j2551o560
$$ 474940 453661 435219 422086 414684 411810 409935 417002 412792 388408 380900 367604 355053 348493
10404C48493m157m250r58k0754j9064j0188K2506K9658m56J5861m31j1802o305
$$ 348493 344336 340086 339128 318374 299310 289122 311628 341286 340830 356691 356260 344458 338153
10391C38153k0652Q7Q439N107O855J6978L4558M0411L3758K1219J6934J0495n042
$$ 338153 317501 317588 326027 331134 337989 354967 389525 429936 463694 484913 501847 512342 507300
10378E07300P511P258m096j0650m5211m6067m1902j8420K1598J9052l714q54L24
$$ 507300 514811 522069 517973 507323 462112 416045 374143 355723 377321 396373 392659 391805 392129
10365C92129O704J1230K0123J7064P244o258R698K4441M4176M2578M91n863r776
$$ 392129 398833 410063 430186 447250 454494 448236 457934 482375 526551 569129 569620 563757 553981
10352E53981k1726m7893n7458l5675j0267k46l690q319j3778L299J676J4473L1681
$$ 553981 532255 484362 426904 391229 380962 380716 377026 368707 354929 358228 359904 374377 406058
10339D06058J1065K1989K2846K1282J0677k477K357J454P308R672J2629N052O879
$$ 406058 417123 439112 461958 483240 493917 491440 493797 495251 502559 512231 524860 529912 536791
10326E36791J4254J3529J7612P489p558o950J1403j1191j5172j5503j1317K0471
$$ 536791 551045 564574 582186 589675 582117 575167 586570 575379 560207 544704 533387 553858
10314E53858K2531K9375K8208K9553R068n09N964n736J118J2751K7692K2801K0532
$$ 553858 576389 605764 633972 663525 672593 672084 678048 672312 673430 686181 713873 736674 757206
10301G57206K0024R496K1762L3911M23Q001K5032J3982p423J8307J8644J1845
$$ 757206 777230 786726 808488 842399 842822 850823 875855 889837 882414 900721 919365 931210
10289I31210K8006L1903K6867L5374M4163L0246N2337O5456O1886N1170L3017
$$ 931210 959216 991119 1017986 1053360 1097523 1127769 1180106 1245562 1307448 1358618 1391635
10278A391635M0553L3319M5952N5047M3476M4090P0382Q1223J01551J09346J13532
$$ 1391635 1432188 1465507 1511459 1566506 1609982 1654072 1724454 1805677 1907228 2016574 2130106
10267B130106J31711J38921J43186J45352J68475J93583J98035K22089K34547
$$ 2130106 2261817 2400738 2543924 2689276 2857751 3051334 3249369 3471458 3706005
10258C706005K34419K71319L18677L80273M80342O23481P33138Q50754R42617
$$ 3706005 3940424 4211743 4530420 4910693 5391035 6014516 6747654 7598408 8541025
10249H541025R88301J071577J171434J222885J343794J618466K143683K916096
$$ 8541025 9529326 10600903 11772337 12995222 14339016 15957482 18101165 21017261
10241B1017261L854105M945910O282490Q016316J0368981J3845955J9278175K7630635
$$ 21017261 24871366 29817276 36099766 44116082 54485063 68331018 87609193 115239828
10233A15239828L9643257N4411727O6997210O9193992N7938892M0686927J8769314
$$ 115239828 154883085 209294812 276292022 345486014 403424906 444111833 462881147
10226D62881147j6664797n1477775n9987687m2366619k1847029k0945269l6760266
$$ 462881147 446216350 394738575 334750888 292384269 270537240 249591971 212831705
10219B12831705m8812104m6114990l4355899k2641960j4619237r813352o872043
$$ 212831705 164019601 117904611 83548712 60906752 46287515 36474163 29602120
10212B9602120m925669l535432k539192j915602j578983j382665j203285j078409
$$ 29602120 24676451 21141019 18601827 16686225 15107242 13724577 12521292 11442883
10204A1442883j066831j032563r23536p50154n92917n95683o51332o38432n47543
$$ 11442883 10376052 9343489 8419953 7669799 7076882 6481199 5829867 5191435 4643892
10195D643892m44085l69342l04314k28979j99778j87377j45437j12347r6305p7287
$$ 4643892 4199807 3830465 3526151 3297172 3097394 2910017 2764580 2652233 2555928 2478641
10185B478641n7595m9928m0191l7465m4616j2722K087K8662K3773L2252M0577
$$ 2478641 2421046 2371118 2330927 2293462 2248846 2236124 2238211 2266873 2290646 2322898 2363475
10174B363475M9804J01126J76266K83311L96928N18584P00878R59393J331547
$$ 2363475 2413279 2514405 2690671 2973982 3370910 3889494 4590372 5549765 6881312
10165F881312J911917K753949L800803M529068L935772J228286k472665m794379
$$ 6881312 8793229 11547178 15347981 19877049 23812821 25041107 22568442 17774063
10157A7774063m862106l714624k511775j648403j085068p47454n39096l93488
$$ 17774063 12911957 9197333 6685558 5037155 3952087 3204633 2665537 2272049
10149B272049k71355k06775j68261j14976q0354o6838q5119r3238q3958p3320
$$ 2272049 2000694 1793919 1625658 1510682 1430328 1363490 1278371 1185133 1101175 1027855
10139A027855o3428o1919o4883p6417n3283m0324k8040k6890l1064l7955l7635
$$ 1027855 964427 902508 837625 761208 707925 667601 639561 612671 581607 543652 506017
10128E06017j4138l2215j7083k1260k7075r849j8700k7357j4424J9025R40Q457
$$ 506017 491879 459664 442581 421321 394246 384397 365697 338340 323916 342941 343881 352338
10116C52338J7157J6785n25j4801L691J0068J2956J5126k637j6629k0421q292
$$ 352338 369495 386280 385755 370954 374645 384713 397669 412795 410158 393529 373108 364816
10104C64816k4370l0896l5197j8877m402l881r834j8106j2248j9567k1224J0866
$$ 364816 340446 309550 274353 255476 251074 247193 237359 219253 207005 187438 166214 177080
10092A77080J6269J4540q470k070J4051J4624K5714K929J4210J6445J0025K7069
$$ 177080 193349 207889 199419 197349 211400 226024 251738 254667 268877 285322 295347 322416
10080C22416N3579Q8031J09495J63320K45429L17933L52488J98730j28315l50189
$$ 322416 375995 464026 573521 736841 982270 1300203 1652691 1851421 1723106 1372917
10070A372917l57578k50287j67733j28791r2261n5525m3817k3570r657l3202k3814
$$ 1372917 1015339 765052 597319 468528 376267 320742 276925 253355 243698 210496 186682
10059A86682k0475j4907j4993O035J3608P720K744J6706P133j740j1306j598j6683
$$ 186682 166207 151300 136307 142342 155950 163670 166414 183120 190253 188513 177207 175609 158926
10046A58926j7376j2433R189L634j587J2077l50k8863q363j6418j3648k1200o428
$$ 158926 141550 129117 138306 141940 140353 152430 152080 123217 114854 98436 84788 63588 57160
10033E7160k797J720j078Q953M012J0025Q282O129l086P269p365q198j0485J3642
$$ 57160 54363 56083 55005 63958 67970 77995 86277 92406 89320 96589 89224 81026 70541 84183
10019H4183K0114K6952O847R954K9249M7259N6880M2952L6792J6357k8418n3274
$$ 84183 104297 131249 138096 148050 177299 224558 281438 324390 361182 377539 349121 295847
10007B95847m9283m9642k9859k0529p066p703k1428j0938p694q913j7098r686
$$ 295847 246564 196922 167063 146534 139468 131765 110337 99399 91705 82792 65694 56008
9995E6008k2993j8706L517P92l574j0550L536l863j74L816L237p099M200J4309
$$ 56008 33015 14309 17826 18618 15044 4494 8030 4167 3993 7809 11046 3947 8147 22456
9981B2456L567k319L945o029l17J1030J832j5955j0439j434k51j5691r091K190
$$ 22456 26023 23704 27649 21620 21303 32333 34165 18210 7771 6337 6086 -9605 -18696 -16506
9967a6506P850L055p44Q488j515Q273O209P817l930m600N835J4767Q419J527r634
$$ -16506 -8656 -5601 -6345 2143 628 8901 15110 22927 18997 14397 20232 34999 43418 44945 35311
9952C5311l489n595O52l828m051q041j5200J0433J3300j8251o888J536J7867P636
$$ 35311 31822 26227 26879 23051 19000 10959 -4241 6192 19492 1241 -5647 -4111 13756 21392
9938B1392K285q733K068J8968n58l267j3029m38J5298J5901K540N932L853N807
$$ 21392 23677 14944 17012 35980 35422 32155 19126 18688 33986 49887 52427 58359 62212 68019
9924F8019J3952m439j843j3715j1776m411m826m746o057Q494M052j1332l969J363
$$ 68019 81971 77532 75689 61974 50198 45787 40961 36215 30158 38652 42704 31372 27403 28766
9910B8766p706L614J1013j9070k0585n051L303Q439L708p746Q829Q950J4784R545
$$ 28766 21060 24674 35687 16617 -3968 -9019 -5716 2723 6431 -1315 7514 16464 31248 40793
9896D0793p870r911M887n130J2406M072j7156j2096k760K0250l355j2244j254
$$ 40793 32923 23012 27899 22769 35175 39247 22091 9995 7235 27485 24130 11886 10632
9883A0632J4704j31Q51j056j915K336O728n846Q492N832j6536j2970k857k432
$$ 10632 25336 25205 26056 25000 23085 25421 32149 26303 34795 40627 24091 11121 8264 5832
9869E832R903J5351Q238j2863o633m02p768N729K2347K0907J480j4232J900o013
$$ 5832 15735 31086 39324 26461 19828 19426 11658 17387 39734 60641 62121 47889 49789 43776
9855D3776j432l642m027o642l113m655j20J0054o136K250J7019M416k806K365
$$ 43776 42344 38702 34675 28033 24920 20265 20145 30199 24063 26313 43332 47748 44942 47307
9841D7307Q764M527J2020J0107K0758K9014J6237K3603L8676N0315O3743J03776
$$ 47307 56071 60598 72618 82725 103483 132497 148734 172337 211013 261328 325071 428847
9829D28847J20949J68521K48763L00576K81811J84573N2482p4463j72985k01429
$$ 428847 549796 718317 967080 1267656 1549467 1734040 1786522 1712059 1539074 1337645
9819A337645j45491o954R4160J07560L4740m3328n8461j7617m9545j40265k44034
$$ 1337645 1192154 1185200 1279360 1386920 1421660 1378332 1319871 1302254 1252709 1112444 868410
9808H68410k41039j80034j34119p7984n6785k8361j0736j1749j7789k1886j7900
$$ 868410 627371 447337 313218 235234 178449 150088 139352 127603 109814 87928 70028
9797G0028n286J160j5908j2719O80M29P879j125l963j747k940N540q070Q88m320
$$ 70028 64742 65902 49994 37275 37955 38384 46263 45138 41175 39428 36488 42028 33958 34846 30526
9782C0526l611k633p632P041K309l070m834k091K471Q661N932J802p407l468P238
$$ 30526 26915 24282 16650 23691 26000 22930 18096 16005 18476 27137 33069 34871 27464 23996 31234
9767C1234j689l20P295N363j764N421J187r664j1046m321m925J82R766M217L039
$$ 31234 29545 29225 36520 41883 40119 45540 46727 37063 26017 21696 16771 16953 26719 30936 33975
9752C3975P190j1608o062m131J850J633N712R456Q888M562J0334J3980J3056K375
$$ 33975 41165 29557 23495 19364 21214 22847 28559 38015 46903 51465 61799 75779 88835 91210
9738I1210J3965O617l710j433J188n411k6433k9242j1078O290L649o859j4346
$$ 91210 105175 111792 108082 106649 107837 102426 75993 46751 35673 41963 45612 38753 24407
9725B4407Q980J3958j0569m307m317O073o949k100Q636L927n4P221o978j1884
$$ 24407 33387 47345 36776 32469 28152 34225 27276 25176 33812 37739 37685 44906 37928 26044
9711B6044J196o421p869o172J0313J977L273r361j0106K18O976N698Q768L530
$$ 26044 27240 20819 12950 6778 17091 19068 22341 12980 2874 3092 10068 15766 24534 28064
9697B8064r973n188O173p115l766P447m060j3223Q38J1786j624L43J0495M774
$$ 28064 18091 12903 19076 11961 8195 15642 11582 -1641 -803 10983 9359 9702 20197 24971
9683B4971j3743P76j273K0049l031j6621j0286Q185J5742o546k986K727J3390
$$ 24971 11228 12004 10731 30780 27749 11128 842 9027 24769 18223 15237 17964 31354
9670C1354k442k683J0994j459n101k879L829j0638L575k022J0977M207K783p987
$$ 31354 28912 26229 37223 35764 30663 27784 31613 20975 24550 22528 33505 37712 40495 32508
9656C2508k489j361L37j2070k543N694J1164M484K567m466m852j948l647L218
$$ 32508 30019 28658 28995 16925 14382 20076 31240 35724 38291 33825 28973 27025 23378 26596
9642B6596m665k353N675J183K708p058k710j779J0297k627k194J7410j343j3674
$$ 26596 21931 19578 25253 26436 29144 22086 19376 17597 27894 25267 23073 40483 39140 25466
9628B5466m942N87O209J0348j0468o329k448R612M419q919K94r518M11K7844K620
$$ 25466 20524 21111 27320 37668 27200 20871 18423 28035 32454 23535 23829 14311 14722 42566 45186
9613D5186r484k42J0443l231j2994j5387j2674Q264M951J0989n45n27l348N107
$$ 45186 35702 35460 45903 42672 29678 14291 1617 9881 14832 25821 25276 24749 21401 26508
9599B6508q747j1989j5770M03J4658J5336Q342P980l437N165k945J146N788p780
$$ 26508 17761 5772 -9998 -9595 5063 20399 28741 36721 33284 38449 35504 36650 42438 34658
9585C4658M68q750K595M471k437O92k538J167J0430m976j836j2703R72m859k681
$$ 34658 35126 26376 28971 33442 31005 31697 29159 30326 40756 35780 33944 21241 22213 17354 14673
9570A4673l343m992j5104J3193L842P933k619J0029J5133K734j3265n559k403
$$ 14673 11330 6338 -8766 4427 8269 16202 13583 23612 38745 41479 28214 22655 20252
9557B0252k228j818j3122l960O033j283J0294J1910R115k389J548J0859J6331
$$ 20252 18024 16206 3084 -876 5157 3874 14168 26078 35193 32804 34352 45211 61542
9544F1542K769r643j2869j6096J0033J71J4526n007j7121q436K048J1625l479
$$ 61542 64311 54668 41799 25703 35736 35907 50433 45426 28305 19869 21917 33542 30063
9531C0063m348N528R034m729j0328o464O441K699J5517J5111n816j4474j3467
$$ 30063 25715 31243 40277 35548 25220 18756 25197 27896 43413 58524 52708 38234 24767
9518B4767J2224P56N34Q401P224O574l452k0686l967J4699o33j4734j2280k551
$$ 24767 36991 37747 38281 46682 53906 60480 57028 36342 32375 47074 46441 31707 19427 16876
9504A6876K34M719Q745J0635p806l856M417R734O948Q590p971j3087j194N880
$$ 16876 17110 21829 30574 41209 33403 29547 33964 43698 50646 59236 51265 38178 36984 42864
9490D2864Q191l715m246j1382R61J2729P894j646r72K547k750p322l768L799n493
$$ 42864 51055 47340 43094 31712 32673 45402 53296 51650 50678 53225 50475 43153 39385 43184 37691
9475C7691k030O78n30q68o246M111J3310j578r592J790L962P141J139j2462j2223
$$ 37691 35661 36339 35809 34941 28695 32806 46116 44538 34946 36736 40698 47839 48978 36516 24293
9460B4293q9J1527j553O638K1763J771j5760j1911P543P89j3359k812j0430J204
$$ 24293 24204 35731 34178 40816 62579 64350 48590 36679 44222 45011 31652 28840 18410 19614
9446A9614P473J5408j019j0945q589P785M228n008o929J5450L082K0693J3407
$$ 19614 27087 42495 41476 30531 21942 29727 33955 28947 22018 37468 40550 61243 74650
9433G4650k8194k1728M203N975L777P958m359P310n09p546r282J478P541J0764
$$ 74650 46456 24728 28931 34906 38683 46641 42282 49592 49083 41537 32255 33733 41274 52038
9419E2038m212m020R851m25k417O144j248N199j912r370j0417m532R371O437Q496
$$ 52038 47826 43806 53657 53232 50815 56959 55711 60910 58998 49628 39211 34679 44050 50487 58983
9404E8983q384l744N744J0374k487k665L121l01L557p16k019O447M951j1383j8094
$$ 58983 50599 46855 52599 62973 60486 57821 60942 60641 64198 63482 61463 67910 72861 61478 43384
9389D3384l965o01m933j0760M559J4289J881J5222q037j7555J0444J6340K892
$$ 43384 39419 38818 33885 23125 27684 41973 43854 59076 51039 33484 43928 60268 63160
9376F3160k86j1972Q27r87o223J3451J1920M628J367q289q446j843l10q025o138
$$ 63160 62874 50902 51729 50742 44519 57970 69890 74518 75885 67596 59150 57307 56997 48972 42834
9361D2834J7087N821j1648Q01k057J79J3346J1221n330j4924R659J1540N285q894
$$ 42834 59921 65742 54094 54895 52838 53017 66363 77584 72254 57330 66989 78529 83814 74920
9347G4920K533l365M167q505o936R173J0120J559J390l906O424N690L19p792n150
$$ 74920 77453 74088 78255 69750 62814 71987 82107 83666 85056 81150 87574 93264 93583 85791 80641
9332H0641o745Q480M260k799m237R02L007R4O18o29K797l725L421K422l977N599
$$ 80641 73896 82376 86636 83837 79600 80502 83509 83603 84221 83592 86389 82664 86085 88507 84530 90129
9316I0129j8498j0162K12R698K492P299J0366M757n677P268q79o818N868J378
$$ 90129 71631 61469 61681 71379 73871 81170 91536 96293 90616 97884 97005 90187 96055 97433
9302I7433J275q789k479k836N439R832R446j2608k725l255O267L38J1179k18m037
$$ 97433 98708 89919 87440 84604 90043 99875 109321 96713 93988 90733 97000 97338 108517 108299 104262
9287A04262M758K728j0070l408k370q26q348n753j2303n281r795J1742J2838j2509
$$ 104262 109020 111748 101678 98270 95900 95074 86726 80973 68670 63389 53594 65336 78174 65665
9273F5665r666R877J3960R533j194k066j010K405o472K294P441n048M60R797p68
$$ 65665 55999 65876 79836 89369 88175 86109 85099 87504 81032 83326 90767 85719 86179 95976 95208
9258I5208r80P068R010k878O672m619m882m076O596M440j2229K224P875J4903
$$ 95208 94228 101296 110306 107428 114100 109481 104599 100523 107119 111559 99330 101554 109429 124332
9244A24332q374q074p282J1074J0160K553Q89k922j4485j490M726o674m521q42
$$ 124332 115958 107884 100602 111676 121836 124389 125278 122356 107871 106381 111107 104433 99912 99070
9230I9070J398J8514k434j2459j1494l227N962J3056j31k337J2064M789R219k870
$$ 99070 100468 118982 116548 104089 92595 89368 95330 108386 108255 105918 117982 122771 131990 129120
9216A29120j4692k613N870j647l900J1457n406m079L095n8l121J6102k750j3253
$$ 129120 114428 111815 117685 116038 112138 123595 118189 114110 117205 117147 114026 130128 127378 114125
9202A14125K242n082K195Q123r12j883q061n96O479O241R636p060j0986N137N748
$$ 114125 116367 111285 113480 121603 120691 118808 110747 110151 116630 122871 132507 125447 114461 119598 125346
9187A25346L678n546L047J5043J1231J126j0587Q855N247r930j3809J4970M740
$$ 125346 129024 123478 126525 141568 152799 153925 143338 152193 157440 147510 133701 148671 153411
9174A53411j4386L375K0704J2445p151m814m121q035j1958j1361L603Q195K622
$$ 153411 139025 142400 163104 175549 168398 163584 159463 151428 139470 128109 131712 139907 142529
9161A42529j1977K023K3370J7910J0230K543j0885l572j527J319M15O212M819
$$ 142529 130552 132575 155945 173855 184085 186628 175743 172171 170644 171963 172378 178590 183409
9148A83409j381j5507p092r417L21j542K565J0769J3820J3981N395q168k1332
$$ 183409 182028 166521 159429 150012 150333 148791 151356 162125 175945 189926 195321 187153 165821
9135A65821r144r789K513k007J7957K2651r484k210P49k971Q725J3132o829j110
$$ 165821 156677 146888 149401 147394 165351 188002 178518 176308 177057 174086 182811 195943 189114 188004
9121A88004J7641p191p089P565m136j0469O638N649M336J1752K241m02l046M07
$$ 188004 205645 198454 191365 198930 194794 184325 190963 196612 200948 212700 214941 214539 211493 211900
9107B11900j08l267l271P292J063m512n704J6482J6727M015j110o259M326L892
$$ 211900 211792 208525 205254 212546 213609 209097 203393 219875 236602 240617 239507 233248 237574 241466
9093B41466j3630n375P477m49m603Q8k771Q10L348L315n672n219j0305K197R210
$$ 241466 227836 222461 229938 229489 224886 224974 222203 223013 226361 229676 224004 218785 208480 210677 219887
9078B19887K257J594p52L088J1741J0163J203M956J944L511J4708l712j1798m040
$$ 219887 222144 223738 222986 226074 237815 247978 249181 254137 256081 259592 274300 270588 258790 254750
9064B54750r098P027l833K645M904J1749j0461r0J5903J274r438j2521N9P911
$$ 254750 245652 252679 248846 251491 256395 268144 257683 257593 273496 274770 265332 252811 252870 260781
9050B60781Q655O463J1826K111j1417j0294j157J1569p507p664N878J4444P213
$$ 260781 269436 275899 287725 289836 278419 268125 266968 278537 271030 263366 269244 283688 290901
9037B90901r5q752j3276O617M906J1648J445R725o051n356O758J6073r737j8900
$$ 290901 290806 282054 268778 275395 280301 291949 293394 303119 297068 291712 298470 314543 304806 285906
9023B85906o523j301Q462R403Q884J0862J4726K896j231j1538o102M892K445r571
$$ 285906 279383 278082 286544 295947 304831 315693 330419 333315 332084 320546 314444 319336 321781 312210
9009C12210Q533L877J3018K3481P038r943m207m745k078j1175J0015J1936R752
$$ 312210 320743 324620 337638 361119 368157 358214 354007 349262 347184 336009 346024 357960 367712
8996C67712p24K228K249M955j0636j3964k02P729P987p0R513J1781Q504o198o185
$$ 367712 366988 369216 371465 376420 365784 351820 351618 359347 367334 367264 376777 388558 397062 390864 384679
8981C84679K551j3986J46M221K2m1l142M202L210K647O088J4601J4695j2418o665
$$ 384679 387230 373244 373390 377611 377633 377592 374450 378652 381862 384509 390597 405198 419893 407475 400810
8966D00810N282J3848j0554l7363j2724K9488Q224L172J6597O964J016J7488P91
$$ 400810 406092 419940 409386 372023 359299 388787 397011 400183 416780 423744 424760 442248 443039
8953D43039L353O956N776o33q540Q195J505n77Q708O312M871R818J2396M638o419
$$ 443039 446392 453348 459124 458491 449951 458146 459651 459074 467782 474094 478965 488783 501179 505817 499398
8938D99398j1459M974L751J516J1607N653J2955O250o622o229N639P588J1409
$$ 499398 487939 492913 496664 498180 509787 515440 528395 534645 528023 521794 527433 535021 546430
8925E46430N041J2285K659J759K233q051J4444Q127k1237J0412K3479J2667L715
$$ 546430 551471 563756 566415 568174 570407 562356 576800 584927 563690 574102 597581 610248 613963
8912F13963J242J896L728K858P826J3361O372Q673O641K8066P387M432O140p066
$$ 613963 615205 617101 620829 623687 631513 644874 651246 659919 666560 694626 702013 706445 712585 705519
8898G05519n018O255M905L982M143J7484P60J1337M228R473K5832O12K98q769
$$ 705519 700501 706756 711661 715643 719786 737270 738030 749367 753595 763068 788900 789512 789810 781041
8884G81041m139J4039K2273J4622J2978K2146n992m1K165J2539J2811N194J4291
$$ 781041 776902 790941 813214 827836 840814 862960 856968 856927 859092 871631 884442 889636 903927
8871I03927P082J2765K1960K0249Q787L969J885P545J1692K6949J4865K8276o352
$$ 903927 911009 923774 945734 965983 974770 978739 980624 988169 999861 1026810 1041675 1069951 1063599
8858A063599o027J0129K0521R114K841J3594J5207J7643R010K9657K9688K0766
$$ 1063599 1057572 1067701 1088222 1097336 1100177 1113771 1128978 1146621 1155631 1185288 1214976 1235742
8846A235742J4115m057P553J3529J2906J5459O066J3178K9762J7863K2649J1067
$$ 1235742 1249857 1245800 1253353 1266882 1279788 1295247 1301313 1314491 1344253 1362116 1384765 1395832
8834A395832K3659K0778J0082J5830K1667L1502J6811J0768J0663J8440K9660
$$ 1395832 1419491 1440269 1450351 1466181 1487848 1519350 1536161 1546929 1557592 1576032 1605692
8823A605692K9851K8943J1175J7169J3624Q835K8458L8004K6761L9484L4514L8039
$$ 1605692 1635543 1664486 1675661 1692830 1706454 1715289 1743747 1781751 1808512 1847996 1882510 1920549
8811A920549L7038J8662K0838K1949K0720L4605L4734J3822K3933L2194K6985
$$ 1920549 1957587 1976249 1997087 2019036 2039756 2074361 2109095 2122917 2146850 2179044 2206029
8800B206029L3293L3682L2495K8169K9037L0736L9494M3059K3390L8304N0838
$$ 2206029 2239322 2273004 2305499 2333668 2362705 2393441 2432935 2475994 2499384 2537688 2588526
8789B588526L8652N1625M8942L6797M2287M2082K9687M6533M8529L1643L5678
$$ 2588526 2627178 2678803 2727745 2764542 2806829 2848911 2878598 2925131 2973660 3005303 3040981
8778C040981L5318M4248N9847N2100L9584N2219N4301M9449L6385L2377N1057
$$ 3040981 3076299 3120547 3180394 3232494 3272078 3324297 3378598 3428047 3464432 3496809 3547866
8767C547866N1848M6507N6219N5556N9178N3758N5237M3450M1426M6390N2368
$$ 3547866 3599714 3646221 3702440 3757996 3817174 3870932 3926169 3969619 4011045 4057435 4109803
8756D109803N5838L6645M6134N6289M7107N4023O8341N5642M4130N1558L0429
$$ 4109803 4165641 4202286 4248420 4304709 4351816 4405839 4474180 4529822 4573952 4625510 4655939
8745D655939L7257M4500N1547L4287K0461M7078M7263M8140L6233M4147M7902
$$ 4655939 4693196 4737696 4789243 4823530 4843991 4891069 4938332 4986472 5022705 5066852 5114754
8734E114754L8062L4901K4291R888L4112L0836K0565J0239Q453R861J0537N938
$$ 5114754 5152816 5187717 5212008 5221896 5256008 5286844 5307409 5317648 5326101 5335962 5346499 5352437
8722E352437J5951J2053J1699r746n562p76n137j0357o536p672k7879j2200k6134
$$ 5352437 5368388 5380441 5392140 5382394 5376832 5376056 5370919 5360562 5354026 5346354 5318475 5306275 5280141
8709E280141j9211j7777k4532k8049m1873m0696m8353l1763k9570l3129l0302
$$ 5280141 5260930 5243153 5218621 5190572 5148699 5108003 5059650 5027887 4998317 4965188 4934886
8698D934886l3881l5879m5392o9169l8079l3145n0948m7496n6169n8107o1949
$$ 4934886 4901005 4865126 4819734 4750565 4712486 4679341 4628393 4580897 4524728 4466621 4404672
8687D404672m8878m6142l5201l4334n3586o6703n4320n1066l4217m5930n9531
$$ 4404672 4355794 4309652 4274451 4240117 4186531 4119828 4065508 4014442 3980225 3934295 3874764
8676C874764n3964n9628n6582n6474l6996m5367m7529n6740n7482n7110m5744
$$ 3874764 3820800 3761172 3704590 3648116 3611120 3565753 3518224 3461484 3404002 3346892 3301148
8665C301148o0975l9482l0526m8082m6859l8933l7393m5063m6298n1306m0523
$$ 3301148 3240173 3200691 3170165 3122083 3075224 3036291 2998898 2953835 2907537 2856231 2815708
8654B815708l5676m3007l8344n2463n1807l1133l0608m0742l4668m0193l3899
$$ 2815708 2780032 2737025 2698681 2646218 2594411 2563278 2532670 2491928 2457260 2417067 2383168
8643B383168k9515m4249l1797k9067k4534n5461m2445l5466j8532k2611r220k9213
$$ 2383168 2353653 2309404 2277607 2248540 2224006 2168545 2126100 2090634 2072102 2049491 2040271 2011058
8631B011058l7165l3875m1582j3682r657l5251m7334l6390n559j2465j4584l1776
$$ 2011058 1973893 1940018 1898436 1884754 1875097 1839846 1792512 1756122 1750563 1738098 1723514 1691738
8619A691738l2629k3000k0020k5374j9903k0879m770k2180j2593j4166k3849l5030
$$ 1691738 1659109 1636109 1616089 1590715 1570812 1549933 1545163 1522983 1510390 1496224 1472375 1437345
8607A437345k7186k0357j2380j5938j7493r344j6500j5505j5595k5438j4022j481
$$ 1437345 1410159 1389802 1377422 1361484 1343991 1334647 1318147 1302642 1287047 1261609 1247587 1246106
8595A246106j9176j6970k301j1997k2110j2819J148j908p810j4743k0097j5851
$$ 1246106 1226930 1209960 1207659 1195662 1173552 1160733 1161881 1159973 1152163 1137420 1117323 1101472
8583A101472j3925j5112j5039k1954j2599j8293L20k2235k4077j1086j0068j2085
$$ 1101472 1087547 1072435 1057396 1035442 1022843 1004550 1004870 982635 958558 947472 937404 925319
8571I25319j7099k1732j9417P28J0275j4722r490j7654j3444q717j8073o672n797
$$ 925319 908220 886488 867071 867799 878074 863352 853862 836208 822764 814047 795974 789302 783505
8558G83505l062J20j4131j9040r339j4125j1944r841M68p638j4113j8050l477
$$ 783505 780443 780563 766432 747392 738053 723928 711984 702143 702611 694973 680860 662810 659333
8545F59333M518k314p107J010K917L095j7036j9000j0200J923l537j239p286R99
$$ 659333 663851 661537 654430 655440 658357 661452 644416 625416 615216 617139 613602 612363 605077 606076
8531F06076l21j2733j2654m083q670K652q341q160L455p237j3515j0984p234K571
$$ 606076 605755 593022 580368 576285 567615 570267 561926 553766 557221 549984 536469 525485 518251 520822
8517E20822j8036l825J975O872j36l245r089n079j2761n918l145q233M895N584
$$ 520822 502786 498961 500936 507808 507672 504427 495338 490259 477498 471580 468435 460202 465097 470681
8503D70681l912L243r674j3892j1166o194o60p169j707N080n953l860O217L530
$$ 470681 466769 470012 460338 446446 435280 429086 428426 421257 419550 424630 418677 414817 421034 424564
8489D24564j4092j1502j867j507k476n440J0544l553J712p058q383J1541p523
$$ 424564 410472 398970 397103 395596 393120 387680 398224 394671 396383 389325 380942 392483 384960
8476C84960j0091O55N20j1184q466m595m405p29J83j4957p35j779n908j3524m082
$$ 384960 374869 375524 376044 364860 356394 351799 347394 346665 346848 331891 331156 329377 323469 309945 305863
8461C05863M050j0130n911L190N629K9K630j141j179m796q433n345j448J2104
$$ 305863 309913 299783 293872 297062 302691 302720 305350 304209 303030 298234 289801 284456 283008 295112
8447B95112K799j3920P337j7550l065R154L097m809N06n497j3181j6409J0953
$$ 295112 297911 283991 291328 273778 270713 279867 282964 278155 278661 273164 259983 243574 254527
8434B54527L631j2197L759J1862R178R878M221j7564k670J379q015p529M586P481
$$ 254527 258158 245961 249720 261582 270760 280638 284859 267295 264625 266004 257989 250460 255046 262527
8420B62527j0818L9j2197n138Q23J6326M398q429j0646p326j0856n910M42N386
$$ 262527 251709 251748 239551 234413 235236 251562 255960 247531 236885 229559 218703 212793 213235 218621
8406B18621Q499P717m663j8733O127O950j0998o650k0164j1507K2913N150j0661
$$ 218621 227120 234837 230174 211441 217568 224518 213520 206870 186706 175199 198112 203262 192601
8393A92601n199Q228J4404j1432j002J1253l77j3441k243J4657k767M582J1105
$$ 192601 187402 195630 210034 198602 197600 208853 208476 195035 192792 207449 204682 209264 220369
8380B20369N45k5156k0615P331l498L850K041m823j4906p751M949o57r463k981
$$ 220369 220914 195758 175143 182474 178976 182826 184867 180044 165138 157387 162336 161679 152216 149235
8366A49235R079j3807L392J9167J1893j0293j2402L670J6208J2803l594m956j0311
$$ 149235 158314 144507 147899 167066 178959 168666 156264 159934 176142 188945 185351 180395 170084
8353A70084K275n856j2881j2229m751P838K198O88L655q987K259P240L453j8255
$$ 170084 172359 166503 153622 141393 136642 144480 146678 147366 151021 142034 144293 151533 154986 136731
8339A36731o568P89O707J3392L144n431J297J7807o4j0523K74q2R959J1849M865
$$ 136731 130163 130952 137659 151051 154195 148764 150061 167868 167804 157281 157555 157473 167432 179281 184146
8324A84146l148K517J0007J9650K6502K7932M7051P1623P7024L4675l2647p1621
$$ 184146 180998 183515 193522 213172 239674 267606 314657 386280 463304 497979 465332 393711
8312C93711p1779n6244l7548j4222k2482j6529o985j824r525j4554j4392O928
$$ 393711 321932 265688 228140 213918 191436 174907 167922 166098 156573 142019 127627 134555
8300A34555O481l781l204K524k782o231j3116o080j41Q811L63O282J255j404J8178
$$ 134555 141036 137255 134051 136575 133793 127562 114446 108366 108225 117036 117399 123681 124936 123532 141710
8285A41710J0614j4681p732n903J407K0037K1266L4707M4744O0044O1595N9470
$$ 141710 152324 137643 129911 124008 125415 145452 166718 201425 246169 306213 367808 427278
8273D27278J1291n3479r0148p0949l6076l8170k8323p101j0727l68j1302k153
$$ 427278 438569 385090 294942 223993 187917 149747 121424 114323 103596 103228 91926 89773
8261H9773l52L346l808J1608O686O872k781M29J0255P74n070j3996l125j575k616
$$ 89773 89421 92767 88959 100567 107253 114125 111344 111773 122028 122802 117732 103736 100611 99036 96420
8246I6420p591L214q35j781j1815K834K827l438M847O083o020K172j9778K576
$$ 96420 88829 92043 91208 89427 77612 80446 83273 79835 84682 90765 84745 86917 67139 69715
8232F9715P840M695J7777l6q259M900q99o424r739J1229P08q312O54q554J242
$$ 69715 77555 82250 100027 99991 91732 96632 95733 89309 79570 90799 91507 83195 83849 75295 76537
8217G6537M828n601p994R971l24q894j2809O505j978J208L947K013L439l349P432
$$ 76537 81365 75764 67770 77741 77417 68523 55714 62219 60241 61449 65396 67409 70848 67499 74931
8202G4931j51n204l280k447J045J010L147q319Q489R628j634o284k199j5636o454
$$ 74931 74780 69576 66296 63849 64894 65904 69051 60732 69221 78849 77215 70931 68732 53096 46642
8187D6642J1571J7071N364l820o797k854m754j773J709K059k620M779j254N595
$$ 46642 58213 75284 80648 76828 70031 67177 62423 60650 62359 64418 61798 66577 65323 70918
8173G0918j1328j5444j3742K565n650l526j309M237l320k450J1097J566J793j217
$$ 70918 59590 44146 30404 32969 27319 23793 22484 26721 23401 20951 32048 33614 35407 34190
8159C4190O926P411N914j631o958p118K81q431n167J8068j104m98K598O538o092
$$ 34190 41116 48527 54441 52810 45852 38734 39015 30584 25417 43485 42381 41883 44481 51019 44927
8144D4927j17l493j460P206Q246J2526n064j2132O29J1912Q215j0318j8884M894
$$ 44927 44810 41317 39857 47063 55309 67835 62771 50639 51268 63180 71395 61077 42193 47087
8130D7087J7789K654k441L385R05L020n282j6529j2110p850j0171k702P821p63
$$ 47087 64876 67530 65089 68474 69379 72399 67117 50588 38478 30628 20457 17755 25576 24813
8116B4813p276n882O482J0246n130r75J9470P295n845l794k324l712k376k504
$$ 24813 17537 11655 18137 28383 23253 22278 41748 49043 43198 39404 37080 33368 30992 28488
8102B8488P673N627J4001J0647K2973N345k0989k2112K814J3383p855j0928j230
$$ 28488 36161 41788 55789 66436 89409 94754 73765 51653 54467 67850 59995 49067 47837
8089D7837j8904j876K608R362J5342M107k1035p823r822M114R051P742l399p56
$$ 47837 28933 27057 29665 39027 54369 58476 37441 29618 19796 23910 32961 40703 37304 36548
8075C6548N97r6J0564L489j7222n762R672q646l820P16l642K509K437J4290K811
$$ 36548 37145 37049 47613 51102 33880 28118 37790 29144 25324 26040 22398 24907 27344 41634 44445
8060D4445n859n311L642q037L133L089p98N173L035P89q743O618n300M221q662
$$ 44445 38586 33275 36917 28880 32013 35102 34304 39477 42512 43301 34558 41176 35876 40097 31435
8045C1435j2145K4620R536k2670j9874L615Q656Q322Q581L478k933J3620N376
$$ 31435 19290 43910 53446 30776 10902 14517 23173 31495 40076 43554 40621 54241 59617
8032E9617n264N089M543p353r838q550r551M122N494m828O83r237j9411m596M580
$$ 59617 54353 59442 63985 56632 46794 38244 28693 32815 38309 33481 34164 24927 5516 920 5500
8017E500M475J0875l08j2725K882N418O843N054n939Q807R305J0218J893j513
$$ 5500 9975 20850 20542 7817 10699 16117 22960 28014 22075 30882 40187 50405 52298 50785
8003E0785j5496k625K015J4438m782o947J0645Q108k532O616K194j2483m872M809
$$ 50785 35289 32664 34679 49117 44335 37388 48033 56141 53609 60225 62419 49936 45064 49873
7989D9873J721J2919J0085j0097j2857N054r869O589O730o616k1547j084J6302
$$ 49873 51594 64513 74598 64501 51644 56698 46829 53418 60148 53532 31985 30901 47203
7976D7203p37Q017K721j8954j4615k930J0324O650P230J51J4683L425k3016j3603
$$ 47203 46466 54483 57204 38250 23635 20705 31029 37679 44909 45060 59743 63168 40152 26549
7962B6549K918J9372J7226J2070L845o100j0146r060n491o300j004o622J904n21
$$ 26549 29467 48839 66065 78135 81980 75880 65734 56674 51183 44883 43879 37257 39161 38640
7948C8640r049J518n14N700R563J244L487N698j556J393n651k4349k869k937J585
$$ 38640 29591 31109 30595 36295 45858 47102 50589 56287 54731 56124 50473 26124 23255 20318 21903
7933B1903J819O874L302m325j4518j753M411K534O356K027k671J197j074k129
$$ 21903 23722 30596 33898 29573 15055 13302 17713 20247 26603 28630 25959 27156 26082 23953
7919B3953N414N130m340l59P202J7064l961O09L400l703j6403j5507l313J4635
$$ 23953 29367 34497 30157 29798 37000 54064 50103 50712 54112 50409 34006 18499 15186 29821
7905B9821K0712O312q245q471N486Q152N426J095l683j0271j4113M445n731p750
$$ 29821 50533 56845 48600 40129 45615 53767 59193 60288 56605 46334 32221 36666 30935 23185
7891B3185R64N067J0686O52P092k593j2014J269N445o91O784J768j9333n109m416
$$ 23185 24149 29216 39902 40554 47646 45053 33039 34308 39753 39062 45846 47614 28281 23172 18756
7876A8756k56L81p546k856J1612r166j1191L15J1654Q466j701K220L300m513K989
$$ 18756 18500 18881 11335 8479 20091 10925 -266 49 11703 20169 18468 20688 23988 19475 22464
7861B2464P076l65L678p27J457n873M127Q840j2563l729K354o130P20N095J46
$$ 22464 29540 29175 32853 32126 33583 27710 31837 40677 28114 24385 26739 20609 21329 26424 26570
7846B6570q954p202O607j0825K153P241r133q09P800Q076J0943J0800Q756j990
$$ 26570 17616 10414 17021 6196 8349 15590 6457 5648 13448 21524 32467 43267 52023 50033
7832E0033j5298l077J951j1707l083R01k655k765N332N526j4323p070k453j078
$$ 50033 34735 31658 33609 21902 18819 19720 17065 14300 19632 25158 10835 3765 1312 234
7818B34J6854N185j549L481r191k342P801p064j019k807m839L316N262Q77r568
$$ 234 17088 22273 20724 24205 15014 12672 20473 13409 12390 9583 4744 8060 13322 14199 4631
7803D631r102Q582M443K289M858M552N421o442J0403M492r993M693k819n454k1060
$$ 4631 -4471 4111 8554 10843 15701 20253 25674 19232 29635 34127 24134 28827 26008 20554 -506
7788e06j0489k826N196K0496N5N920n126M539P08K1403Q382k1594p997K703K457
$$ -506 -10995 -13821 -8625 11871 11926 17846 12720 17259 17967 39370 47752 26158 18161 20864 23321
7773B3321N914k941j6256l202k736L547O64P934k650L044k28k824r881o200R300
$$ 23321 29235 26294 10038 6836 4100 7647 8311 16245 13595 16639 16411 13587 3706 -2494 6806
7758F806j163N903L234M606L060n554r811J8139p672o708R34j2040K577Q127M691
$$ 6806 5643 11546 14780 19386 22446 16892 7081 25220 17548 10840 11774 -266 2311 10438 15129
7743A5129J31P10j3491j7131K438n82O466L77K806J0822n08l938P462L18j2262
$$ 15129 15260 15970 2479 -14652 -12214 -12796 -6330 -5953 -3147 7675 7167 3229 10691 11009 -1253
7728a253M84R11j8092Q65M382N856k963Q092Q428p395M749q74N188o551j038j942
$$ -1253 -769 142 -17950 -17085 -12703 -6847 -9810 -1718 6710 -685 4064 3190 8378 1827 789 -1153
7712a153r199K418n838M266J404n068J783n190P379J2128j490j0520n194jP472
$$ -1153 -10352 -7934 -13772 -9506 -8102 -13170 -11387 -16577 -9198 2930 1440 -9080 -14274 -14275 -6803
7697f803L535n621m398j0460R078J8222K856q01K665l173L847Q673L398j358O113
$$ -6803 -3268 -8889 -13287 -23747 -14669 3553 6409 5608 8273 5100 8947 17620 21018 19660 25773
7682B5773j2305j4568k827Q159O610j3522o839K284q47J1523O762o59j0510M712
$$ 25773 13468 -1100 -3927 4232 10842 -2680 -9519 -7235 -8082 3441 10203 9544 -966 3746
7668C746P148l662j3628j225M823j8604r530O923M296K552J340O131N159K908
$$ 3746 10894 7232 -6396 -7621 -2798 -21402 -30932 -24009 -19713 -17161 -15821 -9690 -4531 -1623
7654a623n245m303J774N356N32Q621l625O365N240n147o488n590M70N688q32o844
$$ -1623 -6868 -11171 -9397 -4041 -3509 5112 1487 7852 13092 7945 1457 -4133 -3663 2025 1193 -5651
7638e651j262K984L213J5183m743j2835N09Q649J4933m284n943J201p112j0460
$$ -5651 -6913 -3929 -716 14467 9724 -3111 -2602 6047 20980 16696 10753 11954 4842 -5618
7624e618k597p646K906O736L434O010J1617M687r052p052n192k342m36o098r18
$$ -5618 -8215 -15861 -12955 -6219 -2785 3225 14842 19529 10477 3425 -1767 -4109 -4545 -10643 -11561
7609a1561k603J168J1197k549L026L81M879M312q474n256R029M794R039O492n536
$$ -11561 -14164 -12996 -1799 -4348 -1322 -941 3938 8250 -224 -5480 3549 8343 17382 23874 18338
7594A8338j9410o409n71K584L005J170M351J5654k670j6886L681J6272j3384N284
$$ 18338 -1072 -7481 -8052 -5468 -2463 -1293 3058 18712 16042 -844 2837 19109 5725 11009
7580A1009K848o049J185m406O74j4113n045J5584m127j0968j288p8k401o64J5894
$$ 11009 13857 7808 8993 4587 5261 -8852 -13897 1687 -2440 -13408 -14696 -14774 -17175 -17839 -1945
7565a945j1200j4529k932M174M41O752Q234L302R298j1085q739Q253j241R215
$$ -1945 -13145 -27674 -30606 -26432 -25991 -19239 -11005 -7703 1595 -9490 -18229 -9976 -11217 -2002
7551b002J445R921j521k3388r639O23J0061J1434J707P292o555j2395L062P099
$$ -2002 -557 9364 7843 -15545 -25184 -24561 -14500 -3066 -1359 5933 -622 -13017 -9955 -2856
7537b856m933R929N317o296k469J289l846J6392J0070k213o352m826r658q223
$$ -2856 -7789 2140 7457 1161 -1308 -19 -3865 12527 22597 20384 14032 9206 -452 -8675
7523h675l326L808J0205k199j291q483R32N688k454L851Q228L50K33o514j1177
$$ -8675 -12001 -8193 2012 -187 -1478 -9961 -9029 -3341 -5795 -1944 6284 6634 6867 353 -10824
7508a0824o765n434K0724Q721j647M880l488r280Q909J0272k106r904L228n833
$$ -10824 -17589 -23023 -2299 6422 4775 9655 6167 -3113 5796 16068 13962 4058 7286 1453
7494A453L963r67j7629Q928J2055L022r046j414M348M692r974p175L446O590P853
$$ 1453 5416 4449 -13180 -4252 7803 10825 1779 365 4713 9405 -569 -7744 -4298 2292 10145
7479A0145L296p250n674j1209L361q708j7283J4303K5413Q041j7214j2429J4257
$$ 10145 13441 6191 517 -10692 -7331 -16039 -33322 -19019 6394 14435 -2779 -15208 -951
7466i51P798L879p197j5083l126l861L029J6586J3712l64J1375p358k6659j1383
$$ -951 6847 10726 3529 -11554 -14680 -18541 -15512 1074 14786 14422 25797 18439 -8220 -19603
7452a9603J369K726J6545m087J136Q034P033m701j2397k2790o49J2183O360J917
$$ -19603 -18234 -15508 1037 -3050 -1914 6120 13153 8452 -3945 -26735 -27384 -15201 -8841 -6924
7438f924M923P361n983p178l614M474P119j0406q579O03j918p75N635J0829K292
$$ -6924 -2001 5360 -623 -7801 -11415 -6941 178 -10228 -18807 -18204 -20122 -20897 -15262 -4433 -2141
7423b141n982J2276J7187J781l230o613r271r085j0903J348q764K207O965q119
$$ -2141 -8123 4153 21340 23121 19891 13278 4007 -5078 -15981 -14633 -23397 -21190 -14225 -22344
7409b2344M273Q296M795j3198J344l841k634P590o484Q602k588J9387J1117J012
$$ -22344 -18071 -9775 -4980 -18178 -16834 -20675 -23309 -15719 -22203 -13601 -16189 3198 14315 15327
7395A5327K322j2352l952O429n196j1650j7698k31P638o506J2085J8603j6773
$$ 15327 17649 5297 1345 7774 2578 -9072 -26770 -27001 -19363 -25869 -13784 4819 -11954
7382a1954j8511M030K199L872P104Q275P69j9649M585K0507L270K615R040J3283
$$ -11954 -30465 -26435 -24236 -20364 -13260 -4985 -4216 -23865 -19280 1227 4497 7112 16152 29435
7368B9435O96k0800q080n607N776M424P252O831n337m432r165l371K6J4431O775
$$ 29435 30131 9331 1251 -4356 1420 5844 13096 19927 14590 10158 993 -2378 -2352 12079 18854
7353A8854j5980j2758O464N082l468o390K609J1536n770j0440n96L53J5383J3481
$$ 18854 2874 -9884 -3420 1662 -1806 -8196 -5587 5949 179 -10261 -10857 -10504 4879 18360
7339A8360M734p886k4675o94J1160N024N031Q63n724p354k591N092p797l663L321
$$ 18360 23094 15208 -9467 -10161 999 6023 11054 11917 6193 -1161 -3752 1340 -6457 -10120 -6799
7324f799j111o206M37M991K303K209J609J646K819O24n605j4357P316J2328L102
$$ -6799 -7910 -14116 -13679 -8688 -6385 -4176 -2567 -921 1898 2522 -3083 -17440 -10124 2204 5306
7309E306M365R92n054o02K44j713j0442M448J835J985p392J16N865J7999n363
$$ 5306 9671 10663 5609 5007 5251 3538 -6904 -2456 -621 1364 -6028 -5912 -47 17952 12589
7294A2589j1574n197l586O445J768J1669L337L652j5015j2554K767K807M414N233
$$ 12589 1015 -4182 -7768 -1323 445 12114 15451 19103 4088 -8466 -5699 -2892 1522 6755
7280F755J50j540j485j108m716N703j6l538m200K272P726k278n12Q730o770o519
$$ 6755 6905 5365 3880 2772 -1944 3759 3743 205 -3995 -1723 6003 3725 3213 11943 5173 -1346
7264a346m488j2467L691P392r24j9341j0364j107l475O53J1003J8449n11p650
$$ -1346 -5834 -18301 -14610 -7218 -8142 -27483 -37847 -38954 -42429 -41776 -30773 -12324 -12835 -20485
7250b0485L814l592Q51J1670j409j3526n653R584Q089m713J0294M596j1150p218
$$ -20485 -16671 -20263 -19412 -7742 -9151 -22677 -28330 -18746 -10657 -15370 -5076 -480 -11630 -18848
7236a8848q94J0118P602N36K851r397o321N104K3659J2163M049r134j5130j509
$$ -18848 -19742 -9624 -2022 -1486 1365 -8032 -14353 -9249 14410 26573 30622 21488 6358 4849
7222D849o8q392j0677l642j17M089J8045J1760p583j0894j4694r374O656m070
$$ 4849 4781 -3611 -14288 -17930 -18047 -13958 4087 15847 8264 -2630 -17324 -26698 -20042 -24112
7208b4112n015N650K4781k431j2896L75o296r169J5461J9724P574j0915j670N981
$$ -24112 -29127 -23477 1304 -1127 -14023 -13648 -19944 -29113 -13652 6072 13646 2731 1061 7042
7194G042j0415m996L576L781l74K681J116q479m015k081o508O300Q471k907K00
$$ 7042 -3373 -8369 -4793 -1012 -1386 1295 2411 -6068 -10083 -12164 -18672 -12372 -3901 -6808 -6608
7179f608J2203J4128n178j0469l392J7911K1767p766k0891j5861n60m9j884l504
$$ -6608 5595 19723 14545 4076 684 18595 40362 32596 11705 -4156 -4716 -4765 -6649 -10153
7165a0153n792J2149M55j025J0531l552k124Q24Q209m523j0200o744j027L531
$$ -10153 -15945 -3796 -3341 -4366 6165 2613 489 1313 9522 4999 -5201 -11945 -12972 -9441
7151i441R68q191l834L102O721J366m95Q171l430k211m90o36m992j369N799K67
$$ -9441 -8473 -16664 -20498 -17396 -10675 -9309 -9804 -1633 -5063 -7274 -7764 -8400 -13392 -14761 -8962 -8695
7135h695l800K235P584Q163j1610j537n269j2840J59O539L797j1835j0839J9786
$$ -8695 -12495 -10260 -2676 5487 -6123 -7660 -12929 -25769 -25610 -19071 -15274 -27109 -37948 -18162
7121a8162J2123k351J888K259Q132Q37k046j4621j8547j135N751M071J241j861
$$ -18162 -6039 -8390 -6502 -4243 3889 4726 2680 -11941 -30488 -31623 -25872 -21801 -20560 -22421
7107b2421O726O923q210j792q757P865n611R326m294m14n09j035r924J259J9511
$$ -22421 -15695 -8772 -16982 -18774 -27531 -19666 -25277 -15951 -20245 -20659 -21168 -22203 -32127 -30868 -11357
7092a1357R414J94j4107o522N238J2048M2l256p110N6J2091K372j2920K782J4604
$$ -11357 -1943 -1749 -15856 -22378 -17140 -5092 -5050 -8306 -15416 -15360 -3269 -897 -13817 -11035 3569
7077C569J599r202N006P917m31n837k1807q452O73p063N517J7607N287m397P995
$$ 3569 5168 -4034 972 8889 8458 2621 -19186 -27638 -26965 -34028 -28511 -10904 -5617 -10014 -2019
7062b019r073N60k679j0282N784o286K87J8029J4776J5917L573l522l764j1358
$$ -2019 -11092 -10532 -13211 -23493 -17709 -23995 -23708 -5679 9097 25014 28587 25065 21301 9943
7048I943j2611p509m193J885M678k280q081k84J9099J5670j2926j3982O815K692
$$ 9943 -2668 -10177 -14370 -12485 -7807 -10087 -18168 -18452 647 16317 3391 -10591 -3776 -1084
7034a084q200J691R861R071O083j8654k537k368m498p947l318Q326K459m004k90
$$ -1084 -9284 -7593 2268 11339 17422 -1232 -3769 -6137 -10635 -18582 -21900 -13574 -11115 -15119 -15409
7019a5409j023j4214O164J1749R495p18j7790j2806M061Q857J755J784j4906J5248
$$ -15409 -16432 -30646 -24482 -12733 -3238 -3956 -21746 -34552 -30491 -21634 -19879 -18095 -33001 -17753
7005a7753Q897J773j085O026J2698j4469j5014M420J2762K290P460j3621j3198
$$ -17753 -8856 -7083 -8168 -2142 10556 -3913 -18927 -14507 -1745 545 8005 -5616 -18814
6992a8814J2847J0906j499m500q501j060j113K268Q691o668P086J0787j4412q73
$$ -18814 -5967 4939 3440 -1060 -9561 -10621 -11734 -9466 -775 -7443 -357 10430 -3982 -4855
6978d855p355J83Q055o109j788n608R863J0140l998N541M931O409j0174k598O709
$$ -4855 -12210 -12027 -3972 -10081 -11869 -17477 -7614 2526 -1472 4069 9000 15409 5235 2637 9346
6963I346Q75o087r357o024j0535L616M173l57j498N090N610l040Q113j1014j651
$$ 9346 10221 4134 -5223 -11247 -21782 -18166 -13993 -14350 -15848 -10758 -5148 -8188 -75 -11089 -12740
6948a2740M218m137k72O899M209O27L874Q849j29L433P92l869j2097j4371p688
$$ -12740 -8522 -12659 -12931 -6032 -1823 -1196 2678 11527 11398 14831 15623 11754 -343 -14714 -22402
6933b2402l610j50M647J359n550o450J1826O062n601J0011j602m75R750N183k546
$$ -22402 -26012 -26162 -21515 -20156 -25706 -32156 -20330 -14268 -19869 -9858 -11460 -11935 -2185 2998 452
6918D52o59m234o568M415J3139J6826p070R144J1385j6003j891j2329M56j0583
$$ 452 -207 -4441 -11009 -6594 6545 23371 16301 25445 36830 20827 18936 6607 7063 -3520
6904c520j0283j99O326L583j803M240R257k830r045p176q3N069L565j627J5755
$$ -3520 -13803 -14002 -7676 -4093 -5896 -1656 7601 4771 -4274 -11450 -11533 -6464 -2899 -4526 11229
6889A1229L770j1865j3619j0279j54J2163L884j754j0280R513n155j8098k348
$$ 11229 14999 3134 -10485 -20764 -20918 -8755 -4871 -6625 -16905 -7392 -12547 -30645 -32993
6876c2993Q825J2806J6150m136j3411K647n14j1598j489l957R419J7746L254L440
$$ -32993 -24168 -11362 4788 652 -12759 -10112 -10626 -22224 -23713 -27670 -18251 -505 2749 6189
6862F189p395q367O721J1793j6665k287O276J503l287j1880P042K1952J3171l777
$$ 6189 -1206 -9573 -2852 8941 -7724 -10011 -3735 -2232 -5519 -17399 -10357 11595 24766 20989
6848B0989r763j5165k539P306p48l203m903r358j3962q72J2063j629n277L326
$$ 20989 11226 -3939 -6478 828 80 -3123 -8026 -17384 -31346 -32218 -20155 -21784 -27061 -23735
6834b3735N747L924M013J4891j083j4285j2410O431R920M706j1663j1894J3685
$$ -23735 -17988 -14064 -10051 4840 3757 -10528 -22938 -16507 -6587 -1881 -13544 -25438 -11753
6821a1753K1467n018j1325j1139k795m736r64n060M267J093J7122O318J044Q934
$$ -11753 9714 4696 -6629 -17768 -20563 -25299 -26263 -31323 -27056 -25963 -8841 -2523 -1479 7455
6807G455k103l109k194j4721m557L403l731L802R734N336J0610p583j8978J0292
$$ 7455 5352 2243 49 -14672 -19229 -15826 -19557 -15755 -6021 -685 9925 2342 -16636 -6344
6793f344j270j117J2624j777J0143M501j0951j0041j409m623j817J3401j3224
$$ -6344 -7614 -8731 3893 2116 12259 16760 5809 -4232 -5641 -10264 -12081 1320 -11904
6780a1904r064M802Q271O765J3925m214P730l4o833j1526r303j936l260L422K1696
$$ -11904 -20968 -16166 -7895 -1130 12795 8581 16311 16277 9444 -2082 -11385 -13321 -16581 -13159 8537
6765H537k241m483r653J815R223N576m041o122K01Q788j932r359P070J310j2098
$$ 8537 6296 1813 -7840 -6025 3198 8774 4733 -1389 -1188 7600 5668 -3691 3379 4689 -7409
6750g409j9057L519K2266L082q670m622o495M307J750r658L719J4300J225j226
$$ -7409 -26466 -22947 -681 2401 -6269 -10891 -17386 -13079 -11329 -20987 -17268 -2968 -1743 -2969
6736b969q09R029j0819o210p870M820J777o516L506K831K735P378J2698K220p265
$$ -2969 -3778 5251 -5568 -11778 -19648 -14828 -13051 -19567 -16061 -13230 -10495 -3117 9581 11801 4536
6721D536m359m837n755K466N090o11m041o3q600P820O540N427P367k033n625j7936
$$ 4536 177 -4660 -10415 -7949 -2859 -3470 -7511 -7574 -16174 -8354 -1814 3613 10980 8947 3322 -14614
6705a4614j062N385Q856j064K557k228M968J5940K273J883j0013J313j5571o637
$$ -14614 -15676 -10291 -1435 -2499 58 -2170 2798 18738 21011 22894 12881 14194 -1377 -8014
6691h014M050k147m267n29M434Q683m715J630k707q248j0653l837N630P118K228
$$ -8014 -3964 -6111 -10378 -10907 -6473 2210 -2505 -875 -3582 -11830 -22483 -26320 -20690 -13572 -11344
6676a1344O036o135m280J4563J6978J1780r229j4066r103J0748n483o452J956
$$ -11344 -5308 -11443 -15723 -1160 15818 27598 18369 4303 -4800 5948 465 -5987 -4031
6663d031j3414L370R125K0260p494j6016j2546q987p188m565K1194J1133P601
$$ -4031 -17445 -14075 -4950 15310 7816 -8200 -20746 -29733 -36921 -41486 -20292 -9159 -1558
6650a558Q04j1941R7j596Q539n977m812J6534R33r566M816j8112P220J2439O102
$$ -1558 -754 -12695 -12598 -14194 -5655 -11632 -16444 90 1023 -8543 -3727 -21839 -14619 -2180 3922
6635C922j6314j1506P193m787l683j830J1416R877J1662j144o472j2341L898K139
$$ 3922 -12392 -23898 -16705 -21492 -25175 -27005 -15589 -5712 5950 4806 -1666 -14007 -10109 -7970
6621g970r946L131k191n87n390L12M088O984j641j97j1618K237n259j203O89o581
$$ -7970 -17916 -14785 -16976 -17563 -22953 -22641 -18553 -11569 -13210 -13407 -25025 -22788 -28047 -29250 -28561 -35142
6605c5142M860P391J7796J7927p591l187Q042K701L72q745j1223j4690j0673J8582
$$ -35142 -30282 -22891 -5095 12832 5241 2054 10096 12797 13169 4424 -6799 -21489 -32162 -13580
6591a3580J1467j0317k160R009j005J869N100n280p59m809N284Q524M336j1532
$$ -13580 -2113 -12430 -14590 -5581 -6586 -4717 383 -4897 -5656 -10465 -5181 3343 7679 -3853
6577c853r899m26n048J552P292J1264l552J954m938j0252k673N215Q387J17J811
$$ -3853 -13752 -14178 -19226 -17674 -10382 882 -2670 -716 -5654 -15906 -18579 -13364 -4977 -4860 -3049
6562c049M016N695m234q24o923J3029o785R199m140j843q777p044K935j544m262
$$ -3049 967 6662 2428 1604 -5319 7710 925 10124 5984 4141 -4636 -11680 -8745 -10289 -14551
6547a4551P383l24K016N29l774j413P87J751J774j4264k598K405r37J1350p73
$$ -14551 -7168 -7492 -5476 -4947 -8721 -10134 -9347 -7596 -5822 -20086 -22684 -20279 -21216 -9866 -10639
6532a0639k315J405o627j1218L129N325R674l98J144r848K838J4427M679j597
$$ -10639 -12954 -11549 -18176 -29394 -26265 -20940 -11266 -11664 -10520 -20368 -17530 -3103 1576 -21
6518b1j1777k013j1564j3594J4884J0067l779j141M373M106N388k42n571q639
$$ -21 -11798 -13811 -25375 -38969 -24085 -14018 -17797 -18938 -14565 -10459 -5071 -5313 -10884 -19523
6504a9523r607k121J5681O015O333j2475l511k697M442K429j2874P240K4702O814
$$ -19523 -29130 -31251 -15570 -9555 -3222 -15697 -19208 -21905 -17463 -15034 -27908 -20668 4034 10848
6490A0848j5836m185k889m266L149k787J0891J566L85p479J1689J5619j4607q786
$$ 10848 -4988 -9173 -12062 -16328 -13179 -15966 -5075 -3509 -3124 -10603 1086 16705 2098 -6688
6476f688k444j792l408k969Q575l237n744O041K014m513N1J2071j3854r665L867
$$ -6688 -9132 -10924 -14332 -17301 -8726 -11963 -17707 -11666 -9652 -14165 -14114 -2043 -15897 -25562 -21695
6461b1695M436P533P76n800j077J3862M450j341O845J646j320n427j4538l028
$$ -21695 -17259 -9726 -8950 -14750 -15827 -1965 2485 1144 7989 9635 8315 2888 -11650 -14678
6447a4678K191P70p95m271r465n56J5293J1415n499n559Q69N103N281j174k8K5
$$ -14678 -12487 -11717 -12512 -16783 -26248 -26804 -11511 -96 -5595 -11154 -10285 -5182 99 -1075 -1103 -1078
6431a078k483m00J0526N50r315l924N970J0356j1227p383K575m460r251l369J828
$$ -1078 -3561 -3961 6565 7115 -2200 -6124 -154 10202 -1025 -8408 -5833 -10293 -19544 -22913 -21085
6416b1085J1019k71k480L695l590L209q288k684j8406K569P765J3116J7580L84
$$ -21085 -10066 -10337 -12817 -9122 -12712 -9503 -17791 -20475 -38881 -36312 -28547 -15431 2149 2533
6402B533j4838P668o994P29J1029r52m946l388L53K736q131l917P444M55J8858
$$ 2533 -12305 -4637 -11631 -10902 127 -825 -5771 -9159 -8806 -6070 -14201 -18118 -10674 -10219 8639
6387H639J3749j0754j7122l599o842n527R300K468k497j1222M577k189L498R595
$$ 8639 22388 11634 -5488 -9087 -15929 -21456 -12156 -9688 -12185 -23407 -18830 -21019 -17521 -7926
6373g926r242m116J461O163J0801k904k229J3585M361J0402k673j2678l157q833
$$ -7926 -17168 -21284 -19823 -13660 -2859 -5763 -7992 5593 9954 20356 17683 5005 1848 -6985
6359f985J2529Q827j3172j0388j558k237k4L14q689k230N128J0075J1708p51n321
$$ -6985 5544 14371 1199 -9189 -10747 -12984 -13008 -12694 -21383 -23613 -18485 -8410 3298 2547 -2774
6344b774n877M391J292J1694J3467R386n209j9481m361o029j967R91R003N014
$$ -2774 -8651 -4260 -2968 8726 22193 31579 26370 6889 2528 -3501 -5468 -4477 4526 9540
6330I540j467j244o872j895J0476Q716J304m810j6275r233L37P627N162M384L589
$$ 9540 8073 6829 -43 -1938 8538 17254 18558 13748 -2527 -11760 -11423 -3796 1366 5750 9339
6315I339m827q331m942n766j3358P157j0560q828J4682N478M433N171O205J1399
$$ 9339 4512 -3819 -8761 -14527 -27885 -20728 -31288 -40116 -25434 -19956 -15523 -10352 -4147 7252
6301G252l734p698k310o882N850p125p321N751J4212r655o441O474J008K778n900
$$ 7252 3518 -4180 -6490 -13372 -7522 -14647 -21968 -16217 -2005 -11660 -18101 -11627 -10619 -7841 -13741
6286a3741j0433P15P063n743o049K788R585Q750J3159L680m343j3373m080j142
$$ -13741 -24174 -23459 -16396 -22139 -28188 -25400 -15815 -7065 6094 9774 5431 -7942 -12022 -13164
6272a3164M758M221L802j7063j5705K355J735J3908J0176Q803L102o788k0084
$$ -13164 -8406 -4185 -383 -17446 -33151 -30796 -29061 -15153 -4977 3826 6928 140 -19944
6259a9944n109Q392O209P271P883O084L636o944L776j609q932n867J0665q15n241
$$ -19944 -25053 -16661 -10452 -3181 4702 10786 14422 7478 11254 9645 713 -5154 5511 4696 -545
6244e45q095m063J064J4868J1863k470j7440j4684k795J3111k715j059N436o24
$$ -545 -8640 -12703 -11639 3229 15092 12622 -4818 -19502 -22297 -9186 -11901 -12960 -7524 -8148
6230h148l39P680o60p45Q09K584j391j965J9016l731p029j8090j5730j965J6365
$$ -8148 -8487 -807 -1467 -2212 -1403 1181 -210 -2175 16841 13110 6081 -12009 -27739 -29704 -13339
6215a3339O095j0339o29L203p089j838R880J009j3098Q306q37n505J8897P98j2058
$$ -13339 -7244 -17583 -18212 -15009 -22098 -23936 -14056 -13047 -26145 -17839 -18676 -24181 -5284 -4486 -16544
6200a6544m811J9313O07r634O59L782r299J247J1201Q416j5662N92k090p6k495
$$ -16544 -21355 -2042 -1435 -11069 -10410 -6628 -15927 -14680 -3479 4937 -10725 -10133 -12223 -12299 -14794
6185a4794p123N716K598k652J0004O147k1135O82O958q203J0379J4973J1472O980
$$ -14794 -21917 -16201 -13603 -16255 -6251 -104 -21239 -20557 -13599 -21802 -11423 3550 15022 22002
6171B2002j1309k780L810O701r574m707N68q188N944r992O806K123M562P168R896
$$ 22002 10693 7913 11723 18424 8850 4143 4711 -3477 2467 -7525 -719 1404 5966 13134 23030
6156B3030r70j1106j3292L965n095P202R279L393j1592l119J1623n190k0313j1482
$$ 23030 22060 10954 -2338 1627 -3468 3734 13013 16406 4814 1695 13318 8128 -12185 -23667
6142b3667n626l402n60m992p52L558Q706J6113j304j2659m529J5612J4398J1284
$$ -23667 -29293 -32695 -33255 -38247 -38999 -35441 -26735 -10622 -11926 -24585 -29114 -13502 896 12180
6128A2180m458j0888q351n573r908O524R791o642m162R490P6J2008M104j3183
$$ 12180 7722 -3166 -11517 -17090 -26998 -20474 -10683 -17325 -21487 -11997 -11921 87 4191 -8992
6114h992m839M515L559j480j167m086p077M045l179p658O065Q855j5302R388J2099
$$ -8992 -13831 -9316 -5757 -7237 -8404 -12490 -19567 -15522 -18701 -26359 -20294 -11439 -26741 -17353 -5254
6099e254k354L65l087L377J5105Q996k2771n537R145J630J1379R905P973n890
$$ -5254 -7608 -7243 -10330 -6953 8152 17148 -5623 -11160 -2015 -385 10994 20899 28872 22982
6085B2982k4035k988N769L315q048n922j4232J0041Q057L591j0629K515j1116
$$ 22982 -1053 -4041 1728 5043 -3005 -8927 -23159 -13118 -5061 -1470 -12099 -9584 -20700
6072b0700j4283N779L487R711R578k409M290j5947L538R629j3863j4351Q831P183
$$ -20700 -34983 -29204 -25717 -16006 -6428 -8837 -4547 -20494 -16956 -7327 -21190 -35541 -26710 -19527
6058a9527O970q364j0712k774L79J5405J3656J661J030O152P084j395R24m83p291
$$ -19527 -12557 -20921 -31633 -34407 -34028 -18623 -4967 -3306 -2276 3876 10960 9565 10489 10006 2715
6043B715R07k507k61j939O678j0674q941o78L658Q92K36p043N844k441p912P679
$$ 2715 3622 1115 854 -1085 5593 -5081 -14022 -14700 -11042 -10150 -9914 -16957 -11113 -13554 -21466 -13787
6027a3787J0380n199o259J217j2621n346j1667N967J3036O909M389j0188j30L703
$$ -13787 -3407 -8606 -14865 -13648 -26269 -31615 -43282 -37315 -24279 -17370 -12981 -23169 -23299 -19596
6013a9596o062J0617J2518m115r793l792L395K288M69P012Q659J2390q494j6855
$$ -19596 -25658 -15041 -2523 -6638 -16431 -20223 -16828 -14540 -14071 -7059 1600 13990 5496 -11359
5999a1359r567N209J1667p532O688P519K918j629l382K83m268m473l785n199m216
$$ -11359 -20926 -15717 -4050 -11582 -4894 2625 5543 3914 532 815 -3453 -7926 -11711 -16910 -21126
5984b1126r144l788J2184O652J7432M635j2463k659r11O14j894k909K470P645
$$ -21126 -30270 -34058 -21874 -15222 2210 6845 -5618 -8277 -9188 -8574 -10468 -13377 -10907 -3262
5970c262M689K82O112J82Q833J0130J135N610K83j1746L083o189j0046j95k543
$$ -3262 1427 1709 7821 8003 16836 26966 28101 33711 33994 22248 25331 19142 9096 8901 6358
5955F358j2475M344R053j3306j5057L76N434k2245o161M900Q478J2146J5498O713
$$ 6358 -6117 -1773 7280 -6026 -21083 -20707 -15273 -37518 -43679 -38779 -30301 -18155 -2657 4056
5941D056N31M394m97p296M708J366p973k739J3237N481p855j271j8347j603K0485
$$ 4056 4587 8981 8484 1188 5896 7262 -711 -3450 9787 15268 7413 6142 -12205 -13808 6677
5926F677J3078J645J1334m551j8626j6086m315J2093m03L563N146j8640n14j921
$$ 6677 19755 21400 32734 28183 9557 -6529 -10844 1249 846 4409 9555 -9085 -9599 -11520
5912a1520p942J0056j3407n487J1454k472O280O80j489J6910m020K692K706k6444
$$ -11520 -19462 -9406 -22813 -28300 -16846 -19318 -13038 -12358 -13847 3063 -957 1735 4441 -22003
5898b2003j0736K09J2522J4142J2296j1929O043L547q18l274P037L207j1471j1118
$$ -22003 -32739 -32530 -20008 -5866 6430 -5499 544 4091 3273 -1 7036 10243 -1228 -12346
5884a2346l268K680R656J7273o128m030j486J379n366m281r783n973O2J1126j555
$$ -12346 -15614 -12934 -3278 13995 7867 3837 2351 3730 -1636 -5917 -15700 -21673 -21611 -10485 -12040
5869a2040m63K354J4445l557p743k627Q711P126O438p109n228P432O837q610m489
$$ -12040 -12503 -10149 4296 739 -7004 -9631 -920 6206 12644 5535 307 7739 14576 5966 1477
5854A477p587p58J2250L9M152p153j8938q904J4534J006j3832J273M812J0598
$$ 1477 -6110 -6868 5382 5421 9573 2420 -16518 -25422 -10888 -9882 -23714 -22441 -17629 -7031
5840g031N475p421L554J5078J5222K834j6978j1649m565j917J8362K3183K578
$$ -7031 -1556 -8977 -5423 9655 24877 27711 10733 -916 -5481 -7398 10964 34147 36725
5827C6725k5659k1294P471l1R165O126K313j2655j6448M529m881m177O476P1n053
$$ 36725 11066 -10228 -2757 -2788 6377 12503 14816 2161 -14287 -9758 -14639 -18816 -12340 -12269 -17322
5812a7322R697O893K0213K308j4385j4345l221J1323R8o891j045K00m217m448
$$ -17322 -7625 -732 19481 21789 7404 -6941 -10162 1161 1259 -5632 -6677 -6477 -10694 -15142
5798a5142P36J8152o915o296n418M747p181J7983R20j5232p835p518o089oJ1954
$$ -15142 -14406 3746 -3169 -9465 -14883 -10136 -17317 666 1586 -13646 -21481 -28999 -35088 -35094 -23140
5783b3140J3981L062O739K338M238r911L076P616j0732j7080J4436n749l76Q307
$$ -23140 -9159 -6097 642 2980 7218 -2693 383 7999 -2733 -19813 -5377 -11126 -11502 -3195
5769c195P0n797O62l105k590L156j3759o216J2435J5480J2872N56l986j0020r513
$$ -3195 -3125 -8922 -8260 -11365 -13955 -10799 -24558 -30774 -18339 -2859 10013 10569 6583 -3437 -12950
5754a2950Q51k261L11L111m419p081r898K3493O770l424j1510k079M03q404J0519
$$ -12950 -12099 -14360 -14049 -10938 -15357 -22438 -32336 -8843 -2073 -5497 -17007 -19086 -18683 -27087 -16568
5739a6568J1734J132m428j151L306r327k370O002l606l493P540J7497k121P150
$$ -16568 -4834 -3702 -8130 -9281 -5975 -15302 -17672 -11670 -15276 -18769 -11229 6268 4147 11297
5725A1297J2070o348j7514L884P229n204n439k154j0854p852O059J4267l178j471
$$ 11297 23367 17019 -495 3389 10618 5414 -25 -2179 -13033 -20885 -14826 -559 -3737 -5208
5711e208R365M090j3390j5229n091J5016J4145J535J551o436O952j447j0493o641
$$ -5208 4157 8247 -5143 -20372 -25463 -10447 3698 5233 6784 348 7300 5853 -4640 -11281
5697a1281R940L382j4990o754n390p049J491P254l30J406J1048P823K152J0173
$$ -11281 -1341 2041 -12949 -19703 -25093 -32142 -30651 -23397 -23727 -22321 -11273 -3450 -1298 8875
5683H875m843M832l219n483Q46j318k3336r933J7531K0318J616j5090m755K558
$$ 8875 4032 8864 5645 162 1008 -310 -23646 -33579 -16048 4270 5886 -9204 -13959 -11401
5669a1401r296L774J9633j6408l131K0763L434j3184M807K507J77J031O005j887
$$ -11401 -20697 -16923 2710 -13698 -16829 3934 7368 -5816 -1009 1498 1675 2706 8711 6824
5655F824J933l431L34k743j3790K152J1527Q536M484K175j596j5498J764O142
$$ 6824 8757 5326 5660 2917 -10873 -8721 2806 11342 15826 18001 16405 907 2671 8813
5641H813n268n033J0199o224j0365L131j950Q745m013k784j354q839o552j770
$$ 8813 3545 -1488 8711 2487 -7878 -4747 -6697 2048 -1965 -4749 -6103 -14942 -21494 -23264
5627b3264n457J8542O952N659R273K971j1643p284j911l830j1214R908O621l263
$$ -23264 -28721 -10179 -3227 2432 11705 14676 3033 -4251 -6162 -9992 -21206 -11298 -4677 -7940
5613g940k228Q07R992M926j954K937M363p699o577p80K006l559q516l566J418
$$ -7940 -10168 -9361 631 5557 3603 6540 10903 3204 -3373 -4153 -2147 -5706 -14222 -17788 -16370
5598a6370k088L595K36P135N55l034O032j1311j1503R454Q03p93J8991m893j406
$$ -16370 -18458 -14863 -14627 -7492 -6937 -9971 -3939 -15250 -26753 -17299 -16496 -17289 1702 -3191 -4597
5583d597L128J64l25n635M916l239n000J3715r847j6212L651J3743l172r70L356
$$ -4597 -1469 -1305 -1630 -7265 -2349 -5588 -10588 3127 -6720 -22932 -19281 -5538 -8710 -9680 -6324
5568f324J573j2703r498P388Q078j289m401m976J1273N150K3696J3136j0464j8913
$$ -6324 -4751 -17454 -26952 -19564 -11486 -12775 -17176 -22152 -10879 -5729 17967 31103 20639 1726
5554A726k568O753P271r883O402K6936l620j6672j5077q013L076j6251R268O465
$$ 1726 -842 5911 13182 3299 9701 36637 33017 16345 1268 -6745 -3669 -19920 -10652 -4187
5540d187p277J204j07l648J3556Q231p780l3P07q637J1699r01q945n22q227Q507
$$ -4187 -11464 -10260 -10367 -14015 -459 7772 -8 -41 666 -7971 3728 2827 -6118 -6640 -14867 -6360
5524f360P618J3988j2408n687j5018l026P206J776j584m104j2928P096J4256k018
$$ -6360 1258 15246 2838 -2849 -17867 -20893 -13687 -11911 -13495 -17599 -30527 -23431 -9175 -11193
5510a1193L856k843o304O185j518K643q875j798J0822J4337Q724j304r459j0260
$$ -11193 -7337 -10180 -16484 -10299 -11817 -9174 -18049 -19847 -9025 5312 14036 12732 3273 -6987
5496f987j7764n770k427O885Q521K014Q122J477r731p342K347J3229K994P163
$$ -6987 -24751 -30521 -32948 -26063 -17542 -15528 -7406 -5929 -15660 -23002 -20655 -7426 -4432 2731
5482B731L968J625r582M697j7352l238K0108j6416q296L1954J3086j7452q495
$$ 2731 6699 8324 -1258 3439 -13913 -17151 2957 -13459 -21755 10199 23285 5833 -2662
5469b662m782k925m461k627k789P513L590N857J1994j4874q089p57n124m53r94
$$ -2662 -7444 -10369 -14830 -17457 -20246 -12733 -9143 -3286 8708 -6166 -14255 -15012 -20136 -20589 -21583
5454b1583M746M949P953J5252J0161J0590k795j3397n876r767r941J0749J0711
$$ -21583 -16837 -11888 -3935 11317 21478 32068 29273 15876 10000 233 -9708 1041 11752
5441A1752r827m718K719o71J0496L797j187j6433r550J872m38R95j4769N318L659
$$ 11752 1925 -2793 -74 -745 9751 13548 12361 -4072 -13622 -11750 -12188 -11193 -25962 -20644 -16985
5426a6985j397R095O073K903O809n056p754N637K46R74j698N50r433p150l511
$$ -16985 -18382 -9287 -3214 -311 6498 1442 -6312 -675 -429 545 -1153 -603 -10036 -17186 -20697
5411b0697J1246N219o653N826M895O787n33J687q847p368O498m516o041M967k218
$$ -20697 -9451 -4232 -10885 -5059 -164 6623 6090 7777 -1070 -8438 -1940 -6456 -12497 -7530 -9748
5396i748j1795L308j0403n188L325R701m941R670m639m481J1021J1597j0735k1048
$$ -9748 -21543 -18235 -28638 -33826 -30501 -20800 -25741 -16071 -20710 -25191 -14170 -2573 -13308 -34356
5382c4356J1755J1293N42j4184K100R777J4683J987n019N637m510j450o404m298
$$ -34356 -22601 -11308 -10766 -24950 -22850 -13073 1610 3597 -1422 4215 -295 -1745 -8149 -12447
5368a2447j1516J5985K3724J006N167j0310n338n996j1560o570l336Q518K1678
$$ -12447 -23963 -7978 15746 16752 21919 11609 6271 275 -11285 -17855 -21191 -12673 9005
5355I005n317J1659O503j256J0038p854L953l146j7552j3620j3626P521O952q065
$$ 9005 3688 15347 21850 20594 30632 22778 26731 23585 6033 -7587 -21213 -13692 -6740 -14805
5341a4805J975K533n290q608J0706J93o916j519J3124n78L179Q840L161k584R122
$$ -14805 -12830 -10297 -15587 -24195 -13489 -13296 -20212 -21731 -8607 -9185 -6006 2834 5995 3411 12533
5326A2533p125k2771j564Q573M936o280m895O21j1311J083j304J6375q5J841j5940
$$ 12533 5408 -17363 -18927 -10354 -5418 -11698 -16593 -15972 -27283 -26200 -27504 -11129 -11214 -9373 -25313
5311b5313j4782P422j802K3696J6762j6400Q789p686r287n034l262k689K17Q551
$$ -25313 -40095 -32673 -34475 -10779 5983 -10417 -1628 -9314 -18601 -23635 -26897 -29586 -29369 -20818
5297b0818J7159J2295j104j7515j450M749o588P385j035k564J4903K781l518O550
$$ -20818 -3659 8636 7532 -9983 -11433 -6684 -13272 -5887 -6922 -9486 5417 8198 4680 11230
5283A1230N651p588j1181n980n607j7814l524J1616k411l213J6401K7050J0273
$$ 11230 16881 9293 -1888 -7868 -13475 -31289 -34813 -23197 -25608 -28821 -12420 14630 24903
5270B4903n105k2569r869L630J4335P926j2982j7043Q898j59r927J058P024n047
$$ 24903 19798 -2771 -12640 -9010 5325 13251 269 -16774 -7876 -8035 -17962 -16904 -9880 -14927
5256a4927o224M038m498Q234R656M85m090l14k065p14J9985J7579q714j7158j0969
$$ -14927 -21151 -17113 -21611 -13377 -3721 -3236 -7326 -7640 -9705 -10419 9566 27145 18431 1273 -9696
5241i696k673J685J2839L077r485l051j730J819L837O04j0254j9905R969J8990
$$ -9696 -12369 -10684 2155 5232 -4253 -7304 -9034 -7215 -3378 -2774 -13028 -32933 -22964 -3974
5227c974j392j9560l619J5891O730j8907o454r49l952J7809L2191Q027q340m945
$$ -3974 -5366 -24926 -28545 -12654 -5924 -24831 -31285 -32234 -36186 -18377 13814 21841 13501 8556
5213H556q521J1557O506l737p230j176j362j358K924j0606j6008L41N17M017p767
$$ 8556 35 11592 18098 14361 7131 5955 4593 3235 6159 -4447 -20455 -20114 -19597 -15580 -23347
5198b3347L79J8249N534o490N721J196K113L070n827j8O513m002j552K006J764
$$ -23347 -22968 -4719 815 -5675 46 1242 3355 6425 598 580 7093 3091 1539 3545 5309
5183E309O728P131l254j3619j912J7818N334j199j1584O78r057m233n441J2350
$$ 5309 12037 19168 15914 2295 383 18201 23535 22336 10752 11430 2373 -1860 -7301 5049
5169E049K411M372l449k0311j4859K768J3073p879L944J2679K444j985N192L795
$$ 5049 7460 11832 8383 -11928 -26787 -24019 -10946 -18825 -14881 -2202 242 -1743 3449 7244
5155G244O532m452r486J881p01q095j4156j4649m724J6003K2373L407P365l607
$$ 7244 13776 9324 -162 1719 1018 -7077 -21233 -35882 -40606 -24603 -2230 1177 8542 4935
5141D935L990m390k498l270j0276R730L388R420n526K124P130J0780j7453j5862
$$ 4935 8925 4535 2037 -1233 -11509 -1779 1609 11029 5503 7627 14757 25537 8084 -7778
5127g778Q879n535j585N418L461L273p116r879n02K664J4850L700j804k318o793
$$ -7778 1101 -4434 -6019 -601 2860 6133 -983 -10862 -11364 -8700 6150 9850 8046 5728 -1065
5112a065O2J5303n312j8905j1472n589P84K4177O018k993p630p349o675j713j891
$$ -1065 -1003 14300 8988 -9917 -21389 -26978 -26194 -2017 4001 1008 -6622 -13971 -20646 -22359 -24250
5097b4250J0691P654L729P780N995j2056m596J0873n016k2306m258P304q179p112
$$ -24250 -13559 -5905 -2176 5604 11599 -457 -5053 5820 804 -21502 -25760 -18456 -26635 -33747
5083c3747L755M890l357J0651o0m203P451L143m969J4454J3110m962m554l862
$$ -33747 -29992 -25102 -28459 -17808 -17868 -22071 -14620 -11477 -16446 -1992 11118 6156 1602 -2260
5069b260P279q666J346M236l644m99o613q797O535J65P505O992r379L393P80m42
$$ -2260 5019 -3647 -2301 1935 -1709 -2208 -8821 -17618 -11083 -10918 -3413 3579 -5800 -2407 -1627 -2069
5053b069r376q777N704K7117K640j146j0007q548J1901q774o054l142O817J455
$$ -2069 -11445 -20222 -14518 12599 15239 14093 4086 -4462 7439 -1335 -7389 -10531 -3714 -2259
5039b259K265J85J850K052J848q635j8865Q035J0194J1662M957M80m412j5723
$$ -2259 6 191 2041 4093 5941 -2694 -21559 -13524 -3330 8332 13289 13769 9357 -6366
5025f366j8356J351Q100K35L400M205J4441p890j3527P962N325j182l001q74R239
$$ -6366 -24722 -23371 -15271 -15036 -11636 -7431 7010 -880 -14407 -6445 -1120 -2302 -5303 -6177 3062
5010C062N814P697j8436q356Q671R013K232O543m330j0091o8L967p070N438m60
$$ 3062 8876 16573 -1863 -10219 -1548 7465 9697 16240 11910 1819 1751 5718 -1352 4086 3626
4995C626M707p359O909k182J676N484q224j1513M149K118o533m983L408Q192j685
$$ 3626 8333 974 7883 5701 7377 12861 4637 -6876 -2727 -609 -7142 -12125 -8717 -525 -2210
4980b210o626o065r056p226Q041M671N994n091n060J2888Q681m213l27o29j184
$$ -2210 -8836 -14901 -23957 -31183 -23142 -18471 -12477 -17568 -22628 -9740 -1059 -5272 -5599 -6228 -7412
4965g412k874P402j808j0531K1518J3242o05K047p941n607J5170N954j0584k261
$$ -7412 -10286 -2884 -4692 -15223 6295 19537 18932 20979 13038 7431 22601 28555 17971 15710
4951A5710j3579o095J2975k200l2j094r168m651P656J922k130N768p390q588l563
$$ 15710 2131 -3964 9011 6811 6779 5685 -3483 -8134 -478 1444 -686 5082 -2308 -10896 -14459
4936a4459R507N712k12j948j0076M400L678J3279k646q71K516l060n718m48R606
$$ -14459 -4952 760 548 -1400 -11476 -7076 -3398 9881 7235 6364 8880 5820 102 -346 9260
4921I260k145j7995l857j750L296L734M150l081J3001J1077j1882j2887j704N30
$$ 9260 7115 -10880 -14737 -16487 -13191 -9457 -5307 -8388 4613 15690 3808 -9079 -10783 -10253
4907a0253O657O952Q89k205j137r050j1055N977L726L562j258j8900Q598L477
$$ -10253 -3596 3356 4245 2040 903 -8147 -19202 -13225 -9499 -5937 -7195 -26095 -17497 -14020
4893a4020J0787R008L610N65j3349L096J6858p671j395R43m637M337j611l26M076
$$ -14020 -3233 5775 9385 9950 -3399 -303 16555 8884 7489 8432 3795 8132 6521 6195 10271
4878A0271j0414M074P082k307K711j3933J0600l468p448j1857p468K095Q20j679
$$ 10271 -143 3931 11013 8706 11417 -2516 8084 4616 -2832 -14689 -22157 -20062 -19242 -20921
4864b0921J913Q877O235J0414o281j7210m687R444O026l349k117Q000K617n511
$$ -20921 -19008 -10131 -3896 6518 237 -16973 -21660 -12216 -6190 -9539 -11656 -3656 -1039 -6550
4850f550o347J431k600O422J573K824K84M441j0701j534N5O524Q781o900n094
$$ -6550 -12897 -11466 -14066 -7644 -6071 -3247 -2963 1478 -9223 -10757 -10702 -4178 4603 -2297 -7391
4835g391m929M045K650M00P81j2251j671K816Q266R579J5067J02o786m838O321
$$ -7391 -12320 -8275 -5625 -5225 -4444 -16695 -18366 -15550 -7284 2295 17362 17464 10678 5840 12161
4820A2161K013M693k626j5331j015N339j2538m287n071J859J0233L312J4879K0503
$$ 12161 14174 18867 16241 910 -105 5234 -7304 -11591 -16662 -14803 -4570 -1258 13621 34124
4806C4124Q287k5205j1740p769M676M470j1908o844J236R035M798O924L569k053
$$ 34124 42411 17206 5466 -2303 2373 6843 -5065 -11909 -10673 -1638 3160 10084 13653 11600
4792A1600j0469j0812K259N284R253N024J030p902j0135M52J5085k842j8822q272
$$ 11600 1131 -9681 -7422 -2138 7115 12139 13169 5267 -4868 -4416 10669 7827 -10995 -19267
4778a9267p377L223J5907k548j461N450k043j8735P762K2164N608N681j1292j5455
$$ -19267 -26644 -23421 -7514 -10062 -11523 -6073 -8116 -26851 -19089 3075 8683 14364 3072 -12383
4764a2383j319M456J484K372M736M029r015P926n422m967J143J80Q087q018j27
$$ -12383 -13702 -9246 -7762 -5390 -654 3375 -5640 2286 -3136 -8103 -6960 -6780 1307 -6711 -6838
4749f838R70j0110j150M063J1562M095q222j1330o6J0944l925m83l947N285O89
$$ -6838 -5868 -15978 -17128 -13065 -1503 2592 -5630 -16960 -17026 -6082 -10007 -10490 -14437 -9152 -8463
4734h463r043r669j938J2466R678K576J0826j1529k918M29r629m1l694l063N217
$$ -8463 -17506 -27175 -29113 -16647 -6969 -4393 6433 -5096 -8014 -7585 -17214 -17255 -20949 -24012 -18795
4719a8795M213R835J677j176M852j017j4280j3232J3245J4706J0261K14o559m129
$$ -18795 -14582 -4747 -3070 -4246 606 -411 -14691 -27923 -14678 28 10289 10503 3944 -185
4705a85o376K386n920j6812R769J8213m751j3603r830r418M915N894j492o23J2772
$$ -185 -6561 -4175 -10095 -26907 -17138 1075 -3676 -17279 -27109 -36527 -31612 -25718 -27210 -27833 -15061
4690a5061J1341N908P101n021Q03K51P89j1794P107p8j8394N042J4401M074n121
$$ -15061 -3720 2188 9289 4268 5071 5322 6111 -5683 1424 1346 -17048 -12006 2395 6469 1348
4675A348P411k947j6665N769O101J0634N235l921J146l7j724l750J377m552o001
$$ 1348 8759 5812 -10853 -5084 1017 11651 16886 12965 14111 14074 12350 8600 9977 5425 -576
4660e76l511N658P706K0748K493j4088K251n353p912L521J024o746r299J4719
$$ -576 -4087 1571 9277 30025 32518 18430 20681 15328 7416 10937 11961 5215 -4084 10635
4646A0635l366L969Q373p232l023R831r764K103R70q912P048K775k0454j691J6124
$$ 10635 7269 11238 19611 12379 9356 19187 9423 11526 12496 3584 10632 13407 -7047 -8738 7386
4631G386pj5019M102L955j742m489J3210n672o765K257q394j946J0388K984j937
$$ 7386 7379 -7640 -3538 417 -1325 -5814 7396 1724 -5041 -2784 -11178 -13124 -2736 248 -1689
4616a689m50r811o697P74K223L818J460l112k235K771P342J0921l539r017k856
$$ -1689 -2139 -11950 -18647 -17873 -15650 -11832 -10372 -13484 -15719 -12948 -5606 5315 1776 -7241 -10097
4601a0097P285k770j784L229P006R30l218J401j1365q443J142n039J2495N66J30
$$ -10097 -2812 -5582 -7366 -4137 2869 3799 581 1982 -9383 -17826 -16684 -21723 -9228 -8662 -8532
4586h532K257J1645m800j7750L372J9634O842k986j1575j5730K259J4025J2711
$$ -8532 -6275 5370 570 -17180 -13808 5826 12668 9682 -1893 -17623 -15364 -1339 11372
4573A1372k325l301j4428l86M947j576J0654Q407m626R583j421k2322l684J0895
$$ 11372 9047 5746 -8682 -9068 -4121 -5697 4957 13364 8738 18321 16900 -5422 -9106 1789
4559A789O622j3804L216N485k851o202k777m903J6503R401J738O551p277m122
$$ 1789 8411 -5393 -2177 3308 457 -5745 -8522 -13425 3078 12479 14217 20768 13491 9369
4545I369O830l330j7954o655N251M481O892Q943J8870P130o817k765j3192j896
$$ 9369 16199 12869 -5085 -11740 -6489 -2008 4884 13827 32697 39827 33010 30245 17053 15157
4531A5157m254k793J324O077l515j3049o245j270j600O382l218J179k170N21k865
$$ 15157 10903 8110 9434 15511 11996 -1053 -7298 -8568 -10168 -3786 -7004 -5825 -7995 -7474 -10339
4516a0339M550k312J0718J945r129K70R94L354r87K863n894N781J379j0584J6216
$$ -10339 -5789 -8101 2617 4562 -4567 -4297 -3303 51 -936 1927 -3967 1814 3193 -7391 8825
4501H825M040J0859k959q743p557m78r507O833j966r619j9608q89L397K878J1183
$$ 8825 12865 23724 20765 12022 4465 3987 -5520 1313 -653 -10272 -29880 -30769 -27372 -24494 -13311
4486a3311J0933O727J2382j9587j0410Q660M933p616l498J2093M173p630n595
$$ -13311 -2378 4349 16731 -2856 -13266 -4606 327 -7289 -10787 1306 5479 -2151 -7746
4473g746Q796L184K405p545m859P469k061p432l157P804J146O465Q257o461K921
$$ -7746 1050 4234 6639 -906 -5765 1704 -357 -7789 -10946 -3142 -1996 4469 12726 6265 9186
4458I186N044l793m531N162j3333j2394O630J3691O02k638m210m156N037P337
$$ 9186 14230 10437 5906 11068 -2265 -14659 -8029 5662 6264 3626 -584 -4740 297 7634
4444G634l553K693j3367o790P57O372N210J4227J2782J2129j2991k0898j6641
$$ 7634 4081 6774 -6593 -13383 -12626 -6254 -1044 13183 25965 38094 25103 4205 -12436
4431a2436J539Q304J2087j0198k1214R389K3639n125l642L611R965P65L427j1328
$$ -12436 -10897 -2593 9494 -704 -21918 -12529 11110 5985 2343 5954 15919 16684 20111 8783
4417H783p207M053Q506O624q071j791j3145n198N674r42P265n780M968M123p289
$$ 8783 1576 5629 14135 20759 12688 10897 -2248 -7446 -1772 -2714 4551 -1229 3739 7862 573
4402E73p585j822j857J2919J1525O281q168j337r587M140j311l124j0821r438
$$ 573 -7012 -8834 -10691 2228 13753 20034 11866 10529 942 5082 3771 647 -10174 -19612
4388a9612n578R134N236N463j016Q569M167Q717m121p535j1929L610J0175j0252
$$ -19612 -25190 -16056 -10820 -5357 -6373 2196 6363 15080 10959 3424 -8505 -4895 5280 -4972
4374d972L005L839j5796r226n330J351K1470K5428n018k6695l308J092L923P155
$$ -4972 -1967 1872 -13924 -23150 -28480 -27129 -5659 19769 14751 -11944 -15252 -14160 -10237 -3082
4360c082N593L414M939q904p990k324j436M42J587j0446J6624K2013K892o615
$$ -3082 2511 5925 10864 1960 -6030 -8354 -9790 -9348 -7761 -18207 -1583 20430 23322 16707
4346A6707j3442M752P018j2320q999R59L176R378P737j346k297q616o275K891
$$ 16707 3265 8017 15035 2715 -6284 -5325 -2149 7229 14966 13620 11323 2707 -3568 -677
4332f77l565K418R081k628L079p262j4523j1554j1325O700J3741M210M409p324
$$ -677 -4242 -1824 7257 4629 7708 446 -14077 -25631 -36956 -30256 -16515 -12305 -7896 -15220
4318a5220J016N540m625p162J0809K1214n082j4557L696L30L59j1991O660R793
$$ -15220 -14204 -8664 -13289 -20451 -9642 11572 6490 -8067 -4371 -4041 -3682 -15673 -9013 780
4304G80r032o651r254n010J9083J421o629M163K225n025j939P109J2341r575j4637
$$ 780 -8252 -14903 -24157 -29167 -10084 -8663 -15292 -11129 -8904 -13929 -15868 -8759 3582 -5993 -20630
4289b0630M801K1959L69j1678O627L786K286L424M578k6331o349P706l307o823
$$ -20630 -15829 6130 6499 -5179 1448 5234 7520 10944 15522 -10809 -17158 -9452 -12759 -19582
4275a9582L540L63J048O348j828j0352p109K690L577j1217p204j28O828J4289
$$ -19582 -16042 -15679 -14631 -8283 -10111 -20463 -27572 -24882 -21305 -32522 -39726 -39854 -33026 -18737
4261a8737R854j448o076R959m297O462j887j1512L27Q059J2666P42k3238j4859
$$ -18737 -8883 -10331 -16407 -6448 -10745 -4283 -6170 -17682 -17355 -9296 3370 4112 -19126 -33985
4247c3985J6998J6302k253J0291J5413l019j2784r000J927J5488M729L307j8181
$$ -33985 -16987 -685 -2938 7353 22766 19747 6963 -2037 -110 15378 20107 23414 5233
4234E233p026J613m61j689m114L014K360j1867k247N75J9158J1015m727k192j1366
$$ 5233 -1793 -180 -641 -2330 -6444 -3430 -1070 -12937 -15184 -14609 4549 15564 10837 8645 -2721
4219b721m055O755L225j2478p99j6264n511K22J2621M795P100J216l983R00O573
$$ -2721 -6776 -21 3204 -9274 -10073 -26337 -31848 -31626 -19005 -14210 -7110 -5894 -9877 -8977 -2404
4204b404M540Q037j985n079o939n115J579k782p793L656n24q148r98L832M14R481
$$ -2404 2136 10173 8188 3109 -3830 -8945 -7366 -10148 -17941 -14285 -14809 -22957 -23955 -20123 -19709 -10228
4188a0228l378j067J2654J1342r680j4161J123N993J5429K283K52q216j9514q747
$$ -10228 -13606 -14673 -2019 9323 -357 -14518 -13395 -7402 8027 10310 10562 2346 -17168 -25915
4174b5915J3031J6532L784M151J2609o070j0639N022l300K127J965j8466n484
$$ -25915 -12884 3648 7432 11583 24192 18122 7483 12505 9205 11332 13297 -5169 -10653
4161a0653J2183M915m546j322R516k648p459j665p41o432K505R050q285l140M180
$$ -10653 1530 6445 1899 577 10093 7445 -14 -1679 -2420 -8852 -6347 2703 -5582 -8722 -4542
4146d542l89r368p01J4367o153K342J452m170N807P920r90l153k61o388m703J1880
$$ -4542 -4931 -14299 -15000 -633 -6786 -4444 -2992 -7162 -1355 6565 5575 2422 2161 -4227 -8930 2950
4130B950N770R25p689j8046q403O09R671P555p407N765R116m69j3417j411J0479
$$ 2950 8720 9645 1956 -16090 -24493 -23884 -14213 -6658 -14065 -8300 816 347 -13070 -14481 -4002
4115d002P98l649P412N467j2620o283J256M590L703k594q089p335M698K179r241
$$ -4002 -3204 -6853 559 6026 -6594 -12877 -11621 -7031 -3328 -5922 -14011 -21346 -16648 -14469 -23710
4100b3710N876J0602J3450j526q288n010n135r884L280J3304N915M205j3963j1563
$$ -23710 -17834 -7232 6218 4692 -3596 -8606 -13741 -23625 -20345 -7041 -1126 3079 -10884 -22447
4086b2447j056J0606L399k395O321k32K1333K170l282l718q093Q455M292K715
$$ -22447 -23503 -12897 -9498 -11893 -5572 -5804 15529 17699 14417 10699 2606 11061 15353 18068
4072A8068N064j8594p877O915O829k120n504p299J462q25K243p724J2163m507
$$ 18068 23132 4538 -3339 3576 10405 8285 2781 -4518 -3056 -3881 -1638 -9362 2801 -1706
4058a706k466P438L333n954J779N03O265M403J387o515j1565r846o037n611O473
$$ -1706 -4172 3266 6599 645 2424 2927 9192 13595 14982 8467 -3098 -12944 -18981 -24592 -18119
4043a8119N876J6237N457R833j0957j2330o420J758L724P076r713j4133K635J937
$$ -18119 -12243 3994 9451 19284 8327 -4003 -10423 -8665 -4941 2135 -7578 -21711 -19076 -17139
4029a7139M363j737q140J1281J5725P294p399K353j996P78q946o142n769Q710
$$ -17139 -12776 -14513 -22653 -11372 4353 11647 4248 6601 4605 5383 -3563 -9705 -15474 -6764
4015f764k900l79R541j63o411Q670J900o105P825K743j0267O645M132J3294q940
$$ -6764 -9664 -10043 -502 -665 -7076 1594 3494 -2611 5214 7957 -2310 4335 8467 21761 12821
4000A2821j5309o266m169k723k033J4785K1100M247l53R08r610n120l701P712
$$ 12821 -2488 -8754 -12923 -15646 -17679 -2894 18206 22453 22100 23008 13398 8278 4577 12289
3986A2289k810n517n411n287r20J5633J704j3743j5019M375k20J5637k196p780
$$ 12289 9479 3962 -1449 -6736 -7656 7977 9681 -4062 -19081 -14706 -14926 711 -1485 -9265
3972i265K363j352J9607J1207J140m553O831k171l670J2002M365q332j4181j0334
$$ -9265 -6902 -8254 11353 22560 23700 19147 25978 23807 20137 32139 36504 28172 13991 3657
3958C657M097J749K244O831p235n89L558j1186J1645q327l477l902l536J81J0738
$$ 3657 7754 9503 11747 18578 11343 10754 14312 3126 14771 6444 2967 -935 -4471 -4290 6448
3943F448M915J2663o250k0673M188R009k100j7477P097N179M043n844q771K702
$$ 6448 11363 24026 17776 -2897 1291 10300 8200 -9277 -2180 2999 7042 1198 -7573 -4871
3929d871M874J1005p33L577N896j0208j3522M489r157k374N27M780J3279J2201
$$ -4871 3 11008 10275 13852 19748 9540 -3982 507 -8650 -11024 -10497 -5717 7562 19763
3915A9763k802j1770j2193k216J137P529M980r66l744O389q33j3232m505M723
$$ 19763 16961 5191 -7002 -9218 -8081 -552 4428 3462 -282 6107 5274 -7958 -12463 -7740
3901g740J2113o090j2316o557K5139m200r766J1502P912o846p022J0506o38L724
$$ -7740 4373 -1717 -14033 -20590 4549 349 -9417 2085 9997 3151 -3871 6635 5997 9721
3887I721R42j2187k268k368J0158p988J0181J1000J2238k314j4806r64k375j739
$$ 9721 10663 -1524 -3792 -6160 3998 -3990 6191 17191 29429 27115 12309 11345 8970 7231
3873G231p68k126p402o767j1739J600L331K0287n709J550K1818j125o505o295
$$ 7231 6463 4337 -3065 -9832 -21571 -19971 -16640 3647 -2062 -512 21306 20181 13676 7381
3859G381N129P787L378n337j1974j0469r630J1508J5191r33O248O401r337n840
$$ 7381 12510 20297 23675 18338 6364 -4105 -13735 -2227 12964 12031 18279 24680 15343 9503
3845I503N431l73j1334J369K278o469j9247l24J996J0204O6L738N1k33R780M659
$$ 9503 14934 14561 3227 4596 6874 405 -18842 -19166 -17170 -6966 -6900 -3162 -3111 -3344 6436 11095
3829A1095q189m812q068k678J4534J1031j1272j5810p050J6067J1064p918n281
$$ 11095 2906 -1906 -9974 -12652 1882 12913 1641 -14169 -21219 -5152 5912 -2006 -7287
3816g287k766r87J3183m103K07N011j0629n04N403J2266Q932L358j5650o275M735
$$ -7287 -10053 -11040 2143 -1960 -1753 3258 -7371 -7875 -2472 9794 18726 22084 6434 159 4894
3801D894j65M13J12J1511R42n346q049o494p739n228J2849J1307L538M248n773
$$ 4894 4729 5142 5254 16765 17707 12361 4312 -2182 -9921 -15149 -2300 9007 12545 16793 11020
3786A1020o555q859N761Q118p844Q571J6474j1321q798m117M003q292L66M237
$$ 11020 4465 -4394 1367 9485 1641 10212 26686 15365 6567 2450 6453 -1839 -1473 2764
3772B764K210O162q62L235n041p297m486k079L558l088K454M748r195n761J0846
$$ 2764 4974 11136 10274 13509 8468 1171 -3315 -5394 -1836 -4924 -2470 2278 -6917 -12678 -1832
3757a832N71m747m103R508M741j090J2609L607q586j3282J550M360o35r12m071
$$ -1832 -1261 -6008 -10111 -603 4138 3048 15657 19264 10678 -2604 -1054 3306 2671 1759 -2312
$$ [...]
##END NTUPLES=NMR SPECTRUM
##END=
