##TITLE=Analysis number 329314
Compound Code cc 69301
Book Reference 547/16/1
Project Code adrs
Chemist Name simonw
##JCAMPDX= 6.0         $$ Bruker NMR JCAMP-DX V2.0
##DATA TYPE= NMR SPECTRUM
##DATA CLASS= NTUPLES
##ORIGIN= Bruker BioSpin GmbH
##OWNER= nmr
$$ XWIN-NMR		Version 3.5
$$ Mon Aug 20 15:00:39 2007 GMT Daylight Time (UT+1h)  MAYBRIDGE\nmr@NMR_250MHZ
##.OBSERVE FREQUENCY= 250.131544655141
##.OBSERVE NUCLEUS= ^1H
##.ACQUISITION MODE= SIMULTANEOUS (DQD)
##.ACQUISITION SCHEME= undefined
##.AVERAGES= 16
##.DIGITISER RES= 18
##SPECTROMETER/DATA SYSTEM= dpx250
##.PULSE SEQUENCE= zg30
##.SOLVENT NAME= DMSO
##.SHIFT REFERENCE= (INTERNAL, DMSO, 0, 16.522)
##AUDIT TRAIL= $$ (NUMBER, WHEN, WHO, WHERE, WHAT)
$$ ##TITLE= Audit trail, XWIN-NMR		Version 3.5
$$ ##JCAMPDX= 5.01
$$ ##ORIGIN= Bruker BioSpin GmbH
$$ ##OWNER= nmr
$$ C:\u/data/dgb/nmr/ADRS/880/pdata/1/auditp.txt
$$ ##AUDIT TRAIL=  $$ (NUMBER, WHEN, WHO, WHERE, WHAT)
(   1,<2007-08-20 14:59:30.72 +100>,<MAYBRIDGE\nmr>,<NMR_250MHZ>,
      <created by zg, POWCHK disabled, PULCHK disabled
       configuration hash MD5:
       76 6E 9A 78 1E 09 19 81 EC 84 63 8F B0 6A 59 2D
       data hash MD5: 64K
       37 40 55 2D 24 9D EF 4D EC 5E 5D 42 D8 BC 5E 8F>)
(   2,<2007-08-20 15:00:02.40 +100>,<MAYBRIDGE\nmr>,<NMR_250MHZ>,
      <Start of raw data processing
       ef LB = 0.3 FT_mod = 6 PKNL = 1 SI = 32K 
       data hash MD5: 32K
       16 1F 1A D8 77 EC B5 EA 0D CC B3 BB 1F 52 EA 2F>)
(   3,<2007-08-20 15:00:07.93 +100>,<MAYBRIDGE\nmr>,<NMR_250MHZ>,
      <apk 
       data hash MD5: 32K
       97 C9 7E DC 67 37 09 27 2B 4F 22 1F 66 72 46 B9>)
(   4,<2007-08-20 15:00:12.95 +100>,<MAYBRIDGE\nmr>,<NMR_250MHZ>,
      <abs ABSG = 5 
       data hash MD5: 32K
       E7 D2 DD 12 CE 8A 0C 68 8C A6 C9 B0 01 DA 69 26>)
$$ ##END=
$$ 
$$ hash MD5
$$ 82 4B 98 92 C7 49 A9 2E F0 22 CC 3E AC BA 78 EE
##$RELAX= 
##$RELAX= 
##$RELAX= 
##$RELAX= 
##$RELAX= 
##$RELAX= 
##$RELAX= 
$$ Bruker specific parameters
$$ --------------------------
##$DU= <C:\u>
##$EXPNO= 880
##$NAME= <ADRS>
##$PROCNO= 1
##$TYPE= <nmr>
##$USER= <dgb>
##$AMP= (0..31)
100 100 100 100 100 100 100 100 100 100 100 100 100 100 100 100 100 100 
100 100 100 100 100 100 100 100 100 100 100 100 100 100 
##$AQSEQ= 0
##$AQ_mod= 3
##$AUNM= <au_zg>
##$AUTOPOS= <5 >
##$BF1= 250.13
##$BF2= 250.13
##$BF3= 250.13
##$BF4= 250.13
##$BF5= 500.13
##$BF6= 500.13
##$BF7= 500.13
##$BF8= 500.13
##$BYTORDA= 1
##$CFDGTYP= 0
##$CFRGTYP= 5
##$CHEMSTR= <none>
##$CNST= (0..31)
1 1 145 1 1 1 1 1 1 1 1 1 1 1 1 1 1 1 1 1 1 1 1 1 1 1 1 1 1 1 1 1 
##$CPDPRG= <>
##$CPDPRG1= <>
##$CPDPRG2= <>
##$CPDPRG3= <>
##$CPDPRG4= <mlev>
##$CPDPRG5= <mlev>
##$CPDPRG6= <mlev>
##$CPDPRG7= <mlev>
##$CPDPRG8= <mlev>
##$CPDPRGB= <>
##$CPDPRGT= <>
##$D= (0..31)
0 1 0 0 0 0 0 0 0 0.06 0 0 0 0 0 0 0.0002 0 0 0 0 0 0 0 0 0 0 0 0 0 0 
0 
##$DATE= 1187618368
##$DBL= (0..7)
120 120 120 120 120 120 120 120 
##$DBP= (0..7)
150 150 150 150 150 150 150 150 
##$DBP07= 0
##$DBPNAM0= <>
##$DBPNAM1= <>
$$ [...]
##$SUBNAM7= <"">
##$SUBNAM8= <"">
##$SUBNAM9= <"">
##$SW= 20.6930455092707
##$SWIBOX= (0..15)
0 0 3 0 0 0 0 0 0 0 0 0 0 0 0 0 
##$SW_h= 5175.983436853
##$TD= 65536
##$TD0= 1
##$TE= 295.16
##$TE2= 300
##$TE3= 300
##$TEG= 300
##$TL= (0..7)
0 120 120 120 120 120 120 120 
##$TP= (0..7)
150 150 150 150 150 150 150 150 
##$TP07= 0
##$TPNAME0= <>
##$TPNAME1= <>
##$TPNAME2= <>
##$TPNAME3= <>
##$TPNAME4= <>
##$TPNAME5= <>
##$TPNAME6= <>
##$TPNAME7= <>
##$TPOAL= (0..7)
0.5 0.5 0.5 0.5 0.5 0.5 0.5 0.5 
##$TPOFFS= (0..7)
0 0 0 0 0 0 0 0 
##$TUNHIN= 0
##$TUNHOUT= 0
##$TUNXOUT= 0
##$USERA1= <user>
##$USERA2= <user>
##$USERA3= <user>
##$USERA4= <user>
##$USERA5= <user>
##$V9= 5
##$VALIST= <valist>
##$VCLIST= <CCCCCCCCCCCCCCC>
##$VD= 0
##$VDLIST= <DDDDDDDDDDDDDDD>
##$VPLIST= <PPPPPPPPPPPPPPP>
##$VTLIST= <TTTTTTTTTTTTTTT>
##$WBST= 1024
##$WBSW= 4
##$XGAIN= (0..3)
0 0 0 0 
##$XL= 0
##$YL= 0
##$YMAX_a= 246295
##$YMIN_a= -272565
##$ZGOPTNS= <>
##$ZL1= 120
##$ZL2= 120
##$ZL3= 120
##$ZL4= 120
##$ABSF1= 16.522
##$ABSF2= -4.171173
##$ABSG= 5
##$ABSL= 3
##$ALPHA= 0
##$AQORDER= 0
##$ASSFAC= 0
##$ASSFACI= 0
##$ASSFACX= 0
##$ASSWID= 0
##$AUNMP= <proc_1d>
##$AZFE= 0.1
##$AZFW= 0.1
##$BCFW= 0
##$BC_mod= 0
##$BYTORDP= 0
##$COROFFS= 0
##$CY= 12.5
##$DATMOD= 1
##$DC= 0
##$DFILT= <>
##$DTYPP= 0
##$F1P= 14.0000005364418
##$F2P= -0.99999901652339
##$FCOR= 0.5
##$FTSIZE= 32768
##$FT_mod= 6
##$GAMMA= 0
##$GB= 0
##$INTBC= 1
##$INTSCL= 1
##$ISEN= 128
##$LB= 0.3
##$LEV0= 0
##$LPBIN= 0
##$MAXI= 10000
##$MC2= 0
##$MEAN= 0
##$ME_mod= 0
##$MI= 0
##$NCOEF= 0
##$NC_proc= -4
##$NLEV= 6
##$NOISF1= 0
##$NOISF2= 0
##$NSP= 0
##$NTH_PI= 0
##$NZP= 0
##$OFFSET= 16.522
##$PC= 1
##$PHC0= -48.74228
##$PHC1= 5.668327
##$PH_mod= 1
##$PKNL= yes
##$PPARMOD= 0
##$PSCAL= 4
##$PSIGN= 0
##$REVERSE= no
##$SF= 250.13
##$SI= 32768
##$SIGF1= 0
##$SIGF2= 0
##$SINO= 400
##$SIOLD= 32768
##$SREGLST= <1H.DMSO>
##$SSB= 0
##$STSI= 32768
##$STSR= 0
##$SW_p= 5175.98343685301
##$SYMM= 0
##$S_DEV= 0
##$TDeff= 65536
##$TDoff= 0
##$TI= <Analysis number 999999
Compound Code 99
Book Reference 9
Project Code 9>
##$TILT= no
##$TM1= 0
##$TM2= 0
##$TOPLEV= 0
##$USERP1= <user>
##$USERP2= <user>
##$USERP3= <user>
##$USERP4= <user>
##$USERP5= <user>
##$WDW= 1
##$XDIM= 32768
##$YMAX_p= 386690853
##$YMIN_p= -340638
$$ End of Bruker specific parameters
$$ ---------------------------------
##NTUPLES= NMR SPECTRUM
##VAR_NAME=  FREQUENCY,     SPECTRUM/REAL,   SPECTRUM/IMAG
##SYMBOL=    X,             R,               I
##VAR_TYPE=  INDEPENDENT,   DEPENDENT,       DEPENDENT
##VAR_FORM=  AFFN,          ASDF,            ASDF
##VAR_DIM=   32768,         32768,           32768
##UNITS=     HZ,            ARBITRARY UNITS, ARBITRARY UNITS
##FACTOR=    0.157963299565203, 1,           1
##FIRST=     4132.6476996994, 0,             0
##LAST=      -1043.33573715361, 0,           0
##MIN=       -1043.33573715361, -340638,     0
##MAX=       4132.6476996994, 386690853,     0
$$ Real data points
##PAGE= N=1
##DATA TABLE= (X++(R..R)), XYDATA
$$ [...]
30378 578 14311 19845 115056 136337 50977 -8415 -46575 -73939 -145947 -194916 -169542 -22022
30366 -22022 43857 68436 125433 227354 242143 130037 46853 -77168 -31980 -10982 -72496
30355 -72496 22468 19294 32079 41329 57392 31210 -20750 -27031 -40214 -34773 -80434 -38667
30343 -38667 -36019 -35366 -38093 -132552 -86634 -59886 -34399 -9559 -82063 -131997 -91349 -24448
30331 -24448 38171 74724 45386 17920 12295 -22724 -82376 -105281 -56968 -49074 -32036 -27341
30319 -27341 -36361 36638 -6757 -67003 -67739 5767 37604 37621 131953 169635 150392 130577 90684
30306 90684 -40314 -64425 41573 43964 75982 98876 107518 113537 146449 194998 224717 180159
30294 180159 134887 47110 -9375 -12976 -9396 -68734 -125321 -91503 -105374 -20468 53727 -17382
30282 -17382 -6543 22277 113211 119960 -8198 -34970 26120 -28869 -70699 -53132 15104 -20259
30270 -20259 27496 61337 74488 83915 35645 -58645 -70172 -9030 64849 58862 -49520 -71405
30258 -71405 -12810 -22118 18223 -24485 -68108 -101338 -130365 -92322 -68468 -97120 -52015 -45004
30246 -45004 -71320 -151348 -208440 -121713 -39577 -15887 -58306 -83223 -80686 -63906 -70566 -67015
30234 -67015 -97518 -51598 -23471 -58682 -77362 -1745 67184 -43709 -96294 -98653 -80439 -71386
30222 -71386 -97862 -135374 -135804 -150418 -172755 -155751 -80051 -4510 19796 24843 66339 151981
30210 151981 161419 124228 67854 2074 -32351 -34291 -69604 -139108 -210970 -209747 -146363 -110307
30198 -110307 -110803 -170529 -133370 -65583 -56617 -138813 -124247 -35318 4362 47186 -4428 -156523
30186 -156523 -216019 -118422 -15593 -50091 -35553 -41520 -48228 32145 15346 37900 13627 -30792
30174 -30792 24206 43412 10071 -13894 -16761 -15725 44471 42430 -32334 -64225 -102882 -88657
30162 -88657 -67443 4032 44440 76311 53559 24117 -39377 -19598 69459 24525 17965 54833
30150 54833 62376 65129 57486 39508 16566 58272 109103 133328 47011 72661 173643 209741
30138 209741 186438 84250 60304 100936 43493 -1259 -12459 -10826 24945 91773 92029 114564
30126 114564 79431 -2535 -27754 -54133 -96964 -130415 -78766 -46038 -138026 -80620 -53494
30115 -53494 -58457 12911 46208 46885 -21169 -52610 -3020 109027 132167 156755 182041 120901
30103 120901 78639 -35690 3389 45648 24718 17186 30436 49548 68264 59409 114064 66439
30091 66439 25649 -4590 -32312 28985 79355 67098 37989 -51905 -95476 -47622 6879 -78405
30079 -78405 -112252 -50590 98552 96305 -15619 -25381 -22544 34710 -20040 -2890 -12294 -69797
30067 -69797 -39476 31268 44916 119987 188261 141294 16081 -8310 -2286 -77125 -119781 -78318
30055 -78318 -54478 -90362 -129551 -85589 -64632 -11081 2642 24327 -56434 -67503 13481 46160
30043 46160 42480 58614 85463 31699 1884 69973 117914 140145 71029 99131 113750 54165
30031 54165 85079 93573 57913 -16519 -38851 -217 1874 -22681 19710 36191 13260 23186
30019 23186 -34208 -147995 -116949 22233 87528 -8858 -42585 -11489 -74175 -68345 -48701
30008 -48701 -65942 -15508 24023 -52242 -53324 -35396 -45171 2079 -72653 -83379 -60035 -136671
29996 -136671 -150281 -27251 24292 -70964 -74513 -65401 -105377 -43467 41464 53287 63541 15032
29984 15032 -84738 17274 27179 37113 -12417 -2651 -17814 -12010 -21505 133 -93092 -69393
29972 -69393 16991 49298 91863 168987 123185 108693 86801 35252 66264 33616 -26779 -46345
29960 -46345 -24575 -5220 -13410 -32236 -64044 -107191 -128079 -78086 -25580 -24404 -55615 -17579
29948 -17579 2954 -26256 -66499 -41094 -141890 -173087 -96852 -74002 -29408 -72757 -153645
29937 -153645 -91404 -62813 -34259 19605 13207 -74720 -119737 -39900 -26902 -53913 -83300 -110417
29925 -110417 -69408 -36409 -15217 12173 42311 -1600 -58820 -55784 -54924 -68437 -86059 -80017
29913 -80017 -7120 -34642 -160582 -104861 -20002 -50902 -42052 6798 16467 67782 97800 118606
29901 118606 109477 178940 242718 241107 204262 164597 157853 111754 33796 -12936 52626 -9858
29889 -9858 -40084 -27007 -12415 1092 29173 131260 165936 54531 49637 27494 -8274 -7828
29877 -7828 -8426 67782 81536 136244 126074 102642 113068 73653 -28102 -86114 -115070 -175406
29865 -175406 -98634 -83158 -143574 -182922 -225624 -263006 -262650 -138112 -46156 -9959 -33418 -24039
29853 -24039 -15857 -86261 -148434 -143308 -114510 -68252 -105599 -197584 -176179 -227917 -201091 -152660
29841 -152660 -101537 -118847 -137320 -93754 -96493 -125063 -75720 4074 -7291 -38905 -67802 -139674
29829 -139674 -110800 -73475 -69721 -133199 -118689 -88090 -32919 -45597 -1727 -13011 9544 -36628
29817 -36628 -170801 -204062 -155227 -101394 -74044 -68550 -58725 -78129 -31580 3924 8844 -108387
29805 -108387 -96479 -106201 -153451 -93430 -32764 12564 4748 79031 104725 93279 108148 159403
29793 159403 176995 161655 189931 155371 70150 47437 101628 99162 51718 42448 -41812 -82513
29781 -82513 -89260 -147070 -156793 -106577 -54789 72992 82684 49152 -25845 -43239 -77420 -82869
29769 -82869 -31530 4022 20576 18574 14094 35967 -25815 -63585 -61735 -44904 -39388 8047
29757 8047 52008 43816 41068 59528 126240 133929 76099 12925 16521 93374 137829 116776 113296
29744 113296 4319 -44998 -25868 -26551 -39384 48741 28697 -56544 -55964 -93865 -79359 -111573
29732 -111573 -142185 -148857 -126438 -32295 -53704 -81541 -51171 -8228 -16160 33873 92266 72397
29720 72397 -26637 -75793 -87950 -137375 -24690 44902 51636 -5568 -51759 -53736 35113 9803
29708 9803 -17174 -20467 -44030 -36467 -47786 -99094 -119853 -107603 -134203 -49611 -2671 -54474
29696 -54474 -156263 -187944 -118956 -27691 -74537 -107790 -35003 -9070 -20821 -57664 -63573 -94655
29684 -94655 -26895 -3779 55231 122517 112433 29112 31169 24521 -119461 -131281 -49857 6261
29672 6261 35113 111560 193895 111614 3774 -76690 -50595 -119752 -205057 -110829 -68709 -60902
29660 -60902 -11541 -78046 -146050 -183773 -139476 -110830 -119120 -38538 -54 5278 -29919 -907
29648 -907 -35938 -39929 20016 81095 56828 -27494 40140 91609 115842 131250 47952 -13213
29636 -13213 -11533 92998 69580 19143 -18094 32168 43772 29205 129457 138753 71356 8982
29624 8982 62411 124200 189603 215619 176210 108560 -4061 -67923 -75414 -73195 -76146 -45364
29612 -45364 -54011 -54904 -5917 31124 35412 4859 -35460 27193 19719 -100181 -134541 -104412
29600 -104412 -97712 -107115 -180681 -137335 -106847 -107257 -97614 -107510 -180501 -138125 -89073 -823 36508
29587 36508 -37841 -15966 137189 114499 45686 -20882 -69947 -95150 -172545 -203244 -147261
29576 -147261 -129116 -101923 30592 28886 -102311 -178281 -87466 -4243 50213 -29029 -120489
29565 -120489 -84912 23005 97290 116756 103091 38591 6286 -59014 -43481 -71802 -78027
29554 -78027 -48013 7660 -25628 -5525 -33599 1399 86704 124103 70421 24422 -681 -49131
29542 -49131 25143 115816 87501 39507 25220 -38770 -63589 -89360 -173358 -117276 -20477 28102
29530 28102 79511 132793 107688 -29543 -117222 -145581 -206539 -142798 -120214 -91831 -102113
29519 -102113 -82067 -28779 -71358 -36716 -1107 36277 130691 169619 135474 73387 71663 105940
29507 105940 68228 25960 9635 78271 145158 154312 44428 9626 18430 -10268 -35185 14429
29495 14429 20487 -28165 -76482 -27536 55320 81268 107174 143306 105038 100133 94409 68220
29483 68220 15088 -47031 -102441 -75420 -57526 -119593 -6760 136669 114102 55006 56321
29472 56321 93260 123287 38267 7871 -56679 -105011 -95158 -54447 80297 140512 107439 59339
29460 59339 59854 -4952 33768 66283 73911 87052 39823 7657 -25016 -47950 -96481 -178556
29448 -178556 -186658 -161465 -78791 22677 46644 87396 109691 127816 21260 -43414 -67717
29437 -67717 -72281 -103238 -82424 -52447 -53581 -33635 -61173 -23804 -24586 -20700 -84000 -35445 33298
29424 33298 1126 -48458 -49116 -51526 -67770 -69152 -59065 -80254 -57621 -52317 -46393 -51952 -66327
29411 -66327 -82540 -108659 -95735 -143214 -170832 -138958 -120317 -94186 -70944 -58719 -37542 -85318
29399 -85318 -79847 -74633 -65581 -19444 39590 64537 79883 76290 70076 66390 -16234 15924 52094
29386 52094 27852 46904 88952 110081 127578 76429 44662 21194 -13371 14586 53701 45547
29374 45547 39037 137992 125195 153889 117022 -13084 25549 109035 43243 -14851 -48164 -81558
29362 -81558 -91140 -101900 -13969 7223 -53505 -11518 9114 -8722 -46951 -53531 1495 8758
29350 8758 16335 74185 35221 14961 12802 44511 67944 7318 -84971 -37773 -41803 -78468
29338 -78468 -62181 -47348 -10358 45668 -1238 -43982 50299 88617 22926 26740 -3585 -101137
29326 -101137 -103403 -90188 -78318 -94727 -20975 16483 30795 47197 2 16449 -21225 -101859
29314 -101859 -157579 -163409 -217319 -191796 -112612 -115607 -111726 -70252 -37957 -81839 -59120 670
29302 670 -69562 -89673 -29192 44604 -4432 57517 120297 57304 -18412 64365 101894 17093
29290 17093 -64418 -119941 -62594 -26582 -63749 -93142 -23404 -70003 -177771 -231353 -191321
29279 -191321 -165468 -187357 -178608 -158047 -92408 5305 57670 64633 85114 31511 -32915 -62215
29267 -62215 18145 72761 -3587 -106370 -69543 -64897 -19508 8676 17248 -234 5291 -1020
29255 -1020 -12916 -16709 34089 47526 92289 102913 85676 21025 -99208 -106215 -32890 21435
29243 21435 54854 -53133 -164484 -126667 -104541 -138706 -157617 -182415 -55194 -6170 37730
29232 37730 77655 39775 33224 37123 9210 -5434 28056 -2660 -2582 60331 35190 8756 4490
29219 4490 82262 72455 -47303 -109652 -110559 -86472 -57624 1544 79063 64309 -1070 8373
29207 8373 -16841 19997 -44741 -113281 -124051 -30439 57335 89081 -27583 -83805 -123073 -74939
29195 -74939 -35915 34422 -21240 -69726 9497 85432 54149 -2145 -21720 -4301 -31183 -35976
29183 -35976 -34956 -64068 -17425 -31209 6630 47151 128674 191313 192553 102700 90082 119046
29171 119046 68395 69095 -60187 -80269 -106313 -163028 -160757 -95307 -85640 -35651 68406 110981
29159 110981 45584 -44355 -42073 105784 135235 79427 -22180 -60895 -64748 3035 54851
29148 54851 51894 49473 -14222 -55660 -80149 -9118 -41938 76249 131373 117545 -29602 -88441
29136 -88441 -54439 -29586 -6910 7728 -97759 -99260 -54439 3259 12414 83749 123340 34016
29124 34016 9830 -46960 -52071 16672 53189 55652 48266 115779 158548 74373 42803 99845
29112 99845 116031 81343 82961 16888 -9623 49251 49955 20093 -37670 -2771 30951 94378
29100 94378 57939 -29036 -110454 -167516 -154126 -103559 -7141 77862 79774 64190 28587 -20161
29088 -20161 -20790 -37161 27241 82680 46074 44004 -1036 -62684 -130633 -161958 -134888 -80315
29076 -80315 22265 17793 17099 23006 -44503 -108088 -69263 -23834 -16867 -35950 -109722 -157584
29064 -157584 -230703 -244514 -251762 -216613 -125530 -30819 33972 -50755 -79942 -88091 -97542 -171483
29052 -171483 -227725 -104132 -24198 -14474 -1764 -46067 -85445 -81429 -20058 -25739 -25579 -23364
29040 -23364 5317 -10217 -3217 25488 -42776 -67026 -51879 -15546 -91621 -119073 -44550 806
29028 806 40924 -3003 32833 41186 9754 -14455 3349 14235 -36876 3725 37006 11880
29016 11880 -34179 37712 50862 12356 91246 118887 16058 -44718 56797 71116 73352
29005 73352 49667 145738 211297 198062 164848 82834 19537 41617 73274 80490 67344 68313
28993 68313 29499 -46024 -40887 -6359 -43170 6684 76023 106160 36651 43420 78787 135268
28981 135268 149238 80018 90802 100803 24678 32948 68619 25460 -17754 26720 114788 72179
28969 72179 62465 89927 46458 15740 27135 56584 -7980 -70047 -85308 -55776 -33148 -44875
28957 -44875 -52109 -44235 17840 -3388 -46093 -15280 -32496 -99967 -44481 -25022 -36922 -15516
28945 -15516 -61112 -78318 -95145 -31592 -68412 28723 104906 53478 48132 -53820 -105093 -137505
28933 -137505 -88788 -70858 -67808 33810 34641 21858 82173 92563 68310 27763 -75089 -95609
28921 -95609 -106962 -6493 9730 -106067 -151817 -117099 -60702 -86550 -130719 -54208 -58795
28910 -58795 8975 23147 38587 5217 63086 34755 70080 9731 -58016 5284 18299 -39638
28898 -39638 14522 45366 -29074 -113959 -140270 -34919 90001 133476 123509 71838 -9596
28887 -9596 -48163 -104124 -148377 -118834 -110687 -28821 47634 57249 5649 -12302 24227 137175
28875 137175 174496 186712 57074 57611 65271 56610 95428 119189 1764 -62936 -40785 -80768
28863 -80768 -39132 5374 -8415 -23881 -31350 57323 41968 63824 -29054 4865 -33701 -69122
28851 -69122 14922 -14808 -24028 -22344 -8623 -284 70752 83502 30279 12937 35033 -36377
28839 -36377 -22759 96422 92424 27203 -102993 -113850 -70046 -1052 -19628 3156 2850 -7847
28827 -7847 -66196 -80622 -85182 -77955 -54063 -46278 -90171 -25362 68123 60252 18385 87152 33664
28814 33664 33218 -18793 -107255 -91413 -62478 -46607 -15371 36828 60532 69673 80557 26852
28802 26852 45750 81068 67704 34690 23472 5504 -32653 -90256 -73544 23031 14752 -13859
28790 -13859 73568 139648 97384 160228 167675 126370 -2739 -61805 18628 60330 66800 -12385
28778 -12385 -33064 -9799 33723 -35068 -82786 -94518 -58067 -92629 -102451 -111769 -91645 33402
28766 33402 108591 51896 -10900 44300 -12253 -15440 84126 83894 21594 250 23166 3069
28754 3069 -38283 -20634 919 -14292 24339 22307 44696 61839 6391 8993 -18914 -94263
28742 -94263 -54052 57078 61667 -2339 39945 41699 34981 -28213 -18404 -28631 44541 35044
28730 35044 -8987 -15150 -5304 48667 79427 92727 53689 56811 33981 -77237 -120436 -91023
28718 -91023 -100706 -109051 -78801 25598 73467 1211 -20788 -27700 60115 97918 26056 -18823
28706 -18823 -21576 -60020 -183033 -226937 -148486 -122887 -93477 -61372 -42293 -14223 -26917 -86514
28694 -86514 -153644 -123906 -40883 -53478 -126486 -128118 -94217 -128800 -89413 -97235 -49846 -12927
28682 -12927 69451 86104 -7524 -20067 -36150 -65060 11583 -23238 -85353 -105629 -51138 -93072
28670 -93072 -122844 -123620 -156146 -83209 -2073 -6845 -34055 -84598 -125253 -188977 -274324 -247104
28658 -247104 -109292 57193 46862 -14074 -77535 -85378 -62412 -23955 76819 59503 61503
28647 61503 28027 -46319 -85672 -42016 58526 124455 84779 66449 113197 79608 -33648
28636 -33648 -113194 -126593 -106709 -65924 43461 93177 19914 -32862 -31830 -10887 22033 28886
28624 28886 89603 11080 -40377 -34633 -31355 -51342 -64754 -140861 -71440 -572 -75115 -89352
28612 -89352 35138 56487 59251 42345 92623 108155 81523 7026 -36728 -90427 -124581 -118262
28600 -118262 -159192 -171644 -105750 -94918 -68289 -64016 7756 115288 36767 -69666 -50485
28589 -50485 23157 15657 73361 82495 12518 -53281 -4317 -9540 -120152 -126419 -61245 -39987
28577 -39987 71386 113977 132576 136408 64029 40479 49195 271 -46481 -53015 -94867 -69522
28565 -69522 -91709 -115202 -42919 43418 22628 -67724 -33252 15107 4261 -8222 -57011 -87502
28553 -87502 -112207 -161430 -142038 -150275 -86229 -51832 -94095 -176597 -144176 -113778 -73181 -67784
28541 -67784 -64912 -89923 -100574 -82154 19910 85595 68686 20759 -39700 -65413 -140483 -198234
28529 -198234 -167082 24991 42689 13610 13178 -1166 4093 -38295 -16691 57829 87144 154002
28517 154002 176942 123013 6822 -41778 -91100 -139864 -168122 -130313 -15593 43906 41258
28506 41258 -50929 -9830 -7080 -9805 -8017 -61419 -66466 -26606 -2048 -115066 -143139 -87744
28494 -87744 -57811 -37665 3850 -13741 -127333 -122122 25635 95259 32563 -2383 -64598
28483 -64598 -92274 -82580 -67176 -96086 -73011 -31633 -42431 11543 92664 123689 167072 193360
28471 193360 214011 134319 84809 -951 -89821 -148547 -109250 -68996 -98768 -41954 16692
28460 16692 18400 72159 122081 89477 -45250 -152093 -82645 -17320 -19954 -44028 -20419 -2073
28448 -2073 -44344 -9242 22614 -39720 -96264 -33034 63073 78743 69612 -61077 -62484 -23069
28436 -23069 7224 42588 30816 -7106 -37763 -29748 -87148 -53812 35481 144100 147469 28683
28424 28683 -3341 -4847 22121 83720 29925 8958 26898 27946 83276 40906 -42935 -93474
28412 -93474 -47833 -30571 -136383 -119315 -111891 -102278 -41799 24408 -13055 -91473 -125631 -117678
28400 -117678 -65471 -80944 -47463 26592 -68457 -30238 61240 58917 -35831 -109432 -136325 -53019
28388 -53019 -2776 -36691 -59547 -54214 -103009 -15572 153021 137974 38621 -13566 -83062 -66317
28376 -66317 -34860 63339 131567 146436 181421 82502 -94807 -32274 19484 1660 -12308
28365 -12308 2573 -21789 -87816 -127268 -65653 9452 -2489 -64016 -53311 56011 19695
28354 19695 -52131 9699 44612 128343 64809 -20182 -95111 -71232 -57918 -102143 -54976 4917
28342 4917 -4216 -25555 -50926 -69010 -124297 -129955 -126634 -78128 -43770 -6907 62663 -13999
28330 -13999 -55245 -14825 310 -5439 33406 44127 -27931 -64071 -5920 -2182 -76354 -8431
28318 -8431 -19202 -11612 -36793 -21432 -80904 -157796 -119966 2068 149374 140971 54335 7662
28306 7662 -43261 -16265 44985 112796 73219 -47816 -112921 -133412 -97241 -50881 -116679 -125702
28294 -125702 -65486 -47884 7095 43820 -20990 -27625 -87098 -89678 27420 97038 118669 78797
28282 78797 106555 46938 21479 -45363 -18760 133589 164081 68396 -22048 -111035 -119891 -113017
28270 -113017 -193972 -243260 -277264 -199700 -159948 -67212 -73026 -7414 18488 -39179 -17476 -123
28258 -123 -53150 -105407 -97222 -71393 -14465 41093 112804 96919 26102 66632 82897 88603
28246 88603 130158 216287 217565 112606 15929 94004 130420 141770 100206 4134 -12492 -80248
28234 -80248 -88499 -6314 8533 -3147 50400 -28981 -145218 -202276 -188864 -158569 -80082 -36597
28222 -36597 -18 63565 39167 -9151 35318 10223 -92257 -147422 -134310 -41701 13760
28211 13760 63303 97212 128235 59024 12016 8798 -40279 -103129 -7133 92971 17509 62715
28199 62715 103370 45598 -32464 -7191 92726 175573 98127 -11631 -129530 -123094 -69031
28188 -69031 -70843 -64821 -9299 -38099 -16371 63295 99259 79246 50854 -78557 -70403 -30105
28176 -30105 27301 33579 36748 -13017 -53717 -23005 23434 7764 -136180 -133077 -70965 -22675
28164 -22675 -7953 10573 35915 77841 85499 115805 106118 43807 -10117 -14070 12982 52308
28152 52308 100191 102877 31166 12503 3255 -65285 -123138 -192639 -129249 -99746 -137714 -78213
28140 -78213 -2226 -63103 -67390 -55190 -6392 24142 -64554 -152931 -54599 30745 86702 43605
28128 43605 16438 -35753 10624 -3196 -22079 -38863 -4967 52417 27232 -69560 13763 50299
28116 50299 100855 157378 195477 182718 113954 79825 70604 28809 -3866 -3547 -33908 5974
28104 5974 32585 53435 53686 26857 -43665 -90641 12303 25622 69787 38246 -32365 23137
28092 23137 127463 118799 120077 57268 51983 87770 13715 -71217 -55768 -93315 -58074 -37188
28080 -37188 -56822 -69302 -31419 -1125 36733 -4757 -28642 6141 -79820 -126966 -59484 -7773
28068 -7773 9441 27465 6671 -61618 -23175 13645 -23219 -6332 7065 -27616 14606 28217
28056 28217 54697 80205 103481 79602 7109 -58577 -58069 -29422 6062 35637 90896 135013
28044 135013 137437 6279 19233 21854 89827 129937 94792 142747 72448 52401 18547 -6546
28032 -6546 9839 3739 31279 60152 46709 -39639 -52568 -61313 -60307 21551 134576 152879
28020 152879 83219 93037 61923 18357 9742 -52674 -1847 -10382 -25047 152896 68666 -27157
28008 -27157 -13841 75901 102540 102752 22619 -52044 -42823 -6471 -54748 -62880 -45159 -8884
27996 -8884 87714 112055 111587 -16798 -104977 -72561 -57254 -47412 -1031 -19868 22992 -23265
27984 -23265 -88837 -130282 -127373 -114039 -56738 17995 16268 -35124 -96235 -43376 56671 50688
27972 50688 31682 32507 37652 76462 53952 -20107 -6958 -24505 -44481 -33374 -36330 -2904
27960 -2904 109054 110983 111953 70120 -21728 -5519 -33268 -26936 57445 146563 137171 137030 98342
27947 98342 59859 25495 75162 66160 -3823 6636 23957 32209 45241 -8020 -48057 -11714
27935 -11714 70907 25475 -60109 -66589 -15487 -55747 -82919 -69926 -84559 -94302 -78869 -50958
27923 -50958 -21583 57577 55543 -27876 -30518 -984 86786 96360 72041 78469 69406 2410 42864
27910 42864 71742 -42931 -50857 -69888 -36494 11669 62770 22338 -670 -26534 -31490 -80087
27898 -80087 -50721 -17374 -39016 -30779 -16645 40174 59212 11642 -54702 -66783 -61454 16810
27886 16810 37171 39299 61346 56959 120878 116036 50053 138323 243734 235093 117229 70302
27874 70302 40655 -3989 18098 -66812 -115336 -122453 -102525 -121450 -188773 -156127 -95465 -75240
27862 -75240 -76799 -99763 -20937 30639 -52949 -40203 80460 106045 107291 56802 19404 -6177
27850 -6177 -33635 -81275 -79822 38626 55854 15789 81177 129810 99832 113158 111306 89999
27838 89999 77897 67200 -30921 -73979 -73856 23707 -19590 -49357 35847 81473 73911 50996
27826 50996 54999 72385 11514 -25036 -116545 -200033 -149685 2028 7818 -3950 -70874 -142455
27814 -142455 -157930 -103383 -58105 -983 -33017 -117094 -37626 12081 -73060 -96474 -80105
27803 -80105 -37573 -44685 -41103 -95947 -126037 -168163 -66401 59425 49635 59417 32314 -30142
27791 -30142 -9908 16927 -2658 -86893 -111733 -35422 -85137 -123076 -82859 38304 119526
27780 119526 78778 61783 -24502 -93206 -91976 14163 54315 92826 69209 48677 156710
27769 156710 125780 2686 -379 38281 -15734 -39355 -79222 -71960 -8780 37959 59509 61389
27757 61389 3457 -18446 -73544 -56119 -37695 64087 157518 187757 115353 98247 122576
27746 122576 35359 -31344 -21983 -100287 -64053 -36488 -64010 -147554 -101261 -47315 -49217 -60804
27734 -60804 -20768 81039 35644 -17697 -20462 -118884 -135001 -57417 -33827 -62644 -73617 -100152
27722 -100152 -28503 -73436 -52312 -27017 31450 104266 95150 98068 103609 79658 -33645 -90425
27710 -90425 -64863 -46468 -92677 -150973 -119213 -115744 -31614 85373 76068 53017 94559 133904
27698 133904 112078 66334 132271 186447 139846 76310 73769 41321 61616 -2000 -53158 -87760
27686 -87760 -58594 -29720 -5610 43736 111461 98537 102227 74401 81609 86423 98100 35664
27674 35664 25119 -33831 -88454 -8545 -29665 -54890 18203 66329 91274 -31772 -16786
27663 -16786 22572 62741 37559 -26640 -642 -18659 -38601 80550 -15442 -3953 25759
27652 25759 -403 54039 64917 54970 -19453 -49920 -30549 -37087 11349 73674 68650 34043
27640 34043 77040 67703 13456 77772 125428 163990 129751 8346 1647 21374 98704 120292
27628 120292 129170 140311 123096 89301 22531 -80174 -115968 -135853 -114478 -100182 -106101 -56618
27616 -56618 65424 107146 90626 79738 73144 54821 37022 1341 -90183 -95406 -78917 -103534
27604 -103534 -93211 -36133 -19907 34255 -5868 -79643 -57799 16290 -14725 -41249 -102079
27593 -102079 -134195 -130786 -127642 -47974 -49812 12603 -1276 -90926 -123775 -95571 -51773 9173
27581 9173 47442 44523 105018 172998 194248 143018 112994 52588 49957 52497 60322 28157 -14255
27568 -14255 -34064 -33793 12492 62703 122053 130745 70150 -63216 -142274 -77253 12387 52522
27556 52522 -8088 -21498 45143 65389 -18243 -725 20384 20375 85215 113254 75138 73013 32335
27543 32335 32324 22390 -45076 -12976 63256 121001 149164 147655 96067 15796 250 90121 71278
27530 71278 19145 -71776 -92556 20762 96144 106498 65504 64059 131855 93886 -49078
27519 -49078 -107017 -2238 85706 62114 4811 -17391 -16587 -38522 -50796 -32836 48649 22730
27507 22730 -49449 -124435 -68406 -31641 -8600 -23543 20996 111475 162754 62488 29136
27496 29136 84122 174599 115383 116998 59059 18080 2947 35751 82120 49798 32418 97084
27484 97084 160425 151231 -57752 -145964 -155885 -24592 89595 68136 41064 126533 134043 55989
27472 55989 5345 21530 64136 1990 -5989 -14017 -55586 -62936 -32929 9017 83832 74699
27460 74699 5139 -2644 22718 -28603 -6434 126872 188250 -21333 -116752 -22898 23862
27449 23862 26710 41407 70115 46664 18705 -8550 -23428 -17787 40944 59705 102138 82140
27437 82140 94077 113040 155385 257567 261790 211959 232155 108767 5624 131918 188571
27426 188571 196650 138554 166263 125140 102290 48415 141089 131760 96965 127042 101045 101196
27414 101196 91326 -18695 -48149 55934 50856 116946 68969 24413 7725 48893 3603
27403 3603 -26035 -9865 23799 -793 -36979 -8479 1182 -11006 89766 137243 158333 46604
27391 46604 78555 126114 140355 87630 -26063 -66351 18992 113696 114735 50772 55179 73794
27379 73794 68512 111935 201440 215448 106789 52485 87543 92334 69185 66814 138281 196892
27367 196892 150807 62138 -4536 14698 27145 61225 98021 71027 96784 172177 223610
27356 223610 201811 255919 230107 134622 66631 62519 97366 129573 135608 144670 89684 35407
27344 35407 28179 101802 105434 157240 201870 146255 102826 124302 208773 146980 87831 38961
27332 38961 81720 145163 66365 109780 125396 89984 108250 43268 4916 40538 47660 56635
27320 56635 132455 156348 134590 8370 -18245 -34983 36353 97670 66857 36957 30186 79319
27308 79319 42267 60288 56672 6528 -106805 -46239 19005 73917 122090 109141 65908 66244
27296 66244 51423 78206 45732 124738 205227 169525 193616 129800 63517 142905 254016
27285 254016 285766 275123 228979 153488 59729 -25283 6419 114119 86411 144364 122274
27274 122274 103141 141854 223173 246935 214432 240032 166676 98563 87613 51975 78411
27263 78411 79004 179069 280789 202165 116263 62202 107557 184043 139715 191484 209382 152869
27251 152869 69071 18660 -43749 -25700 -43309 -80166 39705 166961 117847 65149 52278
27240 52278 60000 71878 129821 151261 148527 121598 152657 123529 91339 76773 87032 122948
27228 122948 128173 31156 4967 67376 127264 159417 224934 183357 168876 107103 76006 32021
27216 32021 24092 110330 153732 96907 40643 223568 305720 264507 216659 258670 221868 214570
27204 214570 187140 152838 92970 113311 168387 127947 116020 123606 2535 -74434 22654
27193 22654 109683 153637 163334 123857 60938 116470 225910 257727 153712 134291 128647 66746
27181 66746 103074 73942 119957 96630 46995 59034 111019 209912 191675 273174 166358
27170 166358 104277 88540 128179 64400 66666 127737 73981 65502 23673 97837 217994 288998
27158 288998 304563 267931 273969 299040 338165 333151 288747 307079 224071 186399 210433 278787
27146 278787 303384 280536 229784 228340 204698 245804 254860 232672 181466 200564 197509 299998
27134 299998 312763 295417 212252 256520 257379 183619 164047 202051 208822 163349 195480 300163
27122 300163 439998 434598 347542 386079 287786 231267 154970 126788 131584 141339 229674 214042
27110 214042 236896 231443 243812 253761 201044 144929 166816 265071 316353 325717 331757 295797
27098 295797 223664 258599 260010 245823 237179 253040 268157 258525 312766 379226 318795 277252
27086 277252 273091 310837 363295 347592 365715 376435 277133 272809 393828 533351 491329
27075 491329 441691 440221 339194 341740 427797 368612 332046 334049 387471 317997 314384 358940
27063 358940 380758 332299 273510 313027 393886 331770 335317 368985 448716 415192 380609 291919
27051 291919 254051 231871 262429 333857 367342 331014 336218 267135 300790 334463 339643 328298
27039 328298 324229 266622 226890 306518 406713 389965 543115 647691 629164 635034 577979
27028 577979 500833 497888 523860 533610 507870 557298 593446 596843 666843 690566 668295 565585
27016 565585 494822 499165 575168 633626 663656 716937 688230 697043 623104 636108 681907 558321
27004 558321 467308 447242 429074 534394 595493 579499 549464 506919 503323 525858 546446
26993 546446 619925 645852 651485 630171 592097 595269 607628 646300 710305 761773 697133 717862
26981 717862 727077 767116 761859 892298 972732 999587 969076 929581 907975 867054 890478 850623
26969 850623 861049 891148 912954 922506 861527 835429 912053 957197 883500 887394 954250 984208
26957 984208 1026944 989657 891776 833198 984829 1097532 1064626 1013945 975344 1030131 1099483
26946 1099483 1181689 1195506 1119080 1172878 1175159 1175938 1285343 1397387 1432130 1428962 1393842 1298741
26934 1298741 1268396 1340685 1403497 1430495 1431801 1472934 1501509 1490909 1485346 1521044 1571701 1614887
26922 1614887 1666121 1803741 1825261 1802401 1703094 1737727 1814926 1839027 1773128 1687277 1750322
26911 1750322 1916534 2003012 2002448 2092034 2164005 2205329 2234647 2172793 2117890 2216707 2252141
26900 2252141 2259420 2319098 2393730 2471735 2538226 2599738 2597052 2570740 2535744 2553654 2654845
26889 2654845 2739255 2820050 2852866 2835153 2855311 2853573 2940912 3073433 3185088 3201091 3262091
26878 3262091 3306390 3283956 3346988 3441923 3449390 3579039 3756192 3823014 3903790 4002271 4062612
26867 4062612 4077768 4131678 4212438 4336236 4353372 4505583 4599841 4729809 4800392 4797697 4877512
26856 4877512 5030924 5167849 5298389 5366164 5525348 5600702 5717981 5875796 6066237 6127034
26846 6127034 6133218 6196935 6192821 6188410 6265468 6463626 6702897 6844109 6920539 6976006 7124802
26835 7124802 7201719 7230571 7316479 7444063 7508318 7651612 7700395 7799249 7871287 7925388 8047718
26824 8047718 8151580 8250407 8268481 8277292 8273882 8222603 8329299 8439846 8453092 8341149 8399665
26813 8399665 8551756 8529549 8493706 8475573 8401867 8408027 8386939 8358392 8267358 8116824 8048975
26802 8048975 8009119 8078468 7988115 7889741 7844725 7766682 7645932 7518781 7428188 7286799 7109907
26791 7109907 6949871 6863048 6830135 6798468 6729514 6671928 6654683 6591217 6469346 6313087 6191830
26780 6191830 6080577 6008837 5963157 5799049 5615129 5563031 5482654 5379918 5245856 5126501
26770 5126501 5042320 4922839 4781054 4757272 4664320 4638046 4638885 4601636 4503965 4340290 4186984
26759 4186984 4103990 4037943 4012253 3959707 3811833 3714092 3644500 3634858 3483560 3450688 3433762
26748 3433762 3453001 3405900 3348606 3208168 3136793 3128986 3091703 3063167 2977865 2963710 3019676
26737 3019676 2921524 2864445 2836784 2646908 2567147 2543848 2503563 2500394 2457655 2357972 2297935
26726 2297935 2285273 2251782 2144773 2119387 2079120 2072599 2146687 2142206 2101310 2021192 2017461 2031793
26714 2031793 2024639 1977478 1938319 2011208 1976497 1859169 1826643 1714622 1669387 1694059 1657601
26703 1657601 1646568 1619232 1613614 1653085 1649889 1609091 1604301 1559768 1513975 1515643 1450354 1361741
26691 1361741 1329343 1294274 1280019 1305642 1355063 1380659 1343003 1348775 1262001 1217401 1236788
26680 1236788 1291240 1206116 1146257 1153623 1155600 1098402 1058886 1162419 1132149 1075051 1120512
26669 1120512 1086562 1052083 1047713 1091928 1034547 981223 950015 892447 905623 919144 912256 902264
26657 902264 918391 946551 909266 811817 889377 952018 984587 923950 822953 750533 793880
26646 793880 774698 743084 744383 752838 763679 711450 657146 577182 649654 664445 705777 723303
26634 723303 694802 649981 616107 590574 620419 669418 721380 709409 675450 617643 553186
26623 553186 525819 533750 643778 632731 634282 662088 736305 796611 723043 742896 723986 627711
26611 627711 561667 502025 525348 578845 590828 591748 613992 592571 536954 529148 541308 492983
26599 492983 513534 472285 428594 479148 483769 490209 483167 424783 409731 462280 448988 494805
26587 494805 556143 576542 599851 473219 392538 438789 474958 418572 410135 442797 329073
26576 329073 330262 359085 337657 274762 200045 258385 329978 251623 210650 196734 246161 251415
26564 251415 224949 273709 337383 301461 322446 294934 239462 211409 193270 229422 342394
26553 342394 277959 290064 373295 352147 404988 381252 402237 437140 322116 342193 341949 352173
26541 352173 424379 336103 207555 174373 230252 231662 312276 312358 250614 237147 246900 241900
26529 241900 314203 287713 272325 234266 208378 284024 333339 351150 305736 251329 227110
26518 227110 222482 184046 198922 218864 292647 349372 291392 241681 194095 208798 240353 266723
26506 266723 298696 267355 247339 214940 226444 267663 244750 170321 168295 199421 169334 187635
26494 187635 248199 328991 409866 302594 141513 189742 210225 191128 167925 184076 274816
26483 274816 291748 177595 145624 154113 199375 193090 182831 206850 177612 29533 -51820
26472 -51820 -9725 121353 184283 166107 138441 49760 105500 72052 92053 142030 206416
26461 206416 275581 217266 152071 110753 51808 44815 26735 73563 135826 110175 83836 34395
26449 34395 13319 -4323 94642 178648 222622 296606 307162 258725 167774 168106 174345 95873
26437 95873 64219 90813 102249 38945 40044 98401 203055 238714 114727 120078 150411 120826
26425 120826 103917 98107 217312 310679 349966 217486 211164 219899 170612 166420 135997 142253
26413 142253 234282 370432 364177 312546 221206 248163 270698 199662 210683 363434 352581
26402 352581 284329 264504 264856 196088 196269 243017 161274 72596 52365 44077 66263 101368
26390 101368 116225 113293 188678 183118 142332 94759 -6716 -14851 -4758 77138 144851 117066
26378 117066 58766 30032 1048 -56896 -53066 -7442 110807 167781 163729 93732 115218 96688
26366 96688 96576 82225 47887 71257 26042 25303 68667 153427 186397 176041 142367 175408
26354 175408 224728 185222 124102 136910 106125 84628 136415 148778 91746 28697 57936
26343 57936 108359 234934 249317 213555 152912 64988 16971 3011 -234 32123 -5585 -5861
26331 -5861 -21466 29870 46710 79539 71568 96947 82880 117726 84192 -11881 -48362 7505
26319 7505 91966 77681 33401 40598 35971 147297 175810 145733 93657 83100 105285 123015
26307 123015 164776 73596 -56166 -110055 -86551 -85742 -49929 17829 47200 90594 83305 107700
26295 107700 79292 104655 61690 72177 131683 87755 46000 4608 32378 104566 114388 129725
26283 129725 87284 24752 5048 36236 66454 57115 112624 125408 143045 95899 121473 123505
26271 123505 107363 111311 37450 33351 23564 71764 129962 184713 184652 169385 179656 144648 128947
26258 128947 160114 175635 179902 200342 201515 229638 192034 143195 83644 59095 107655 85157
26246 85157 110861 58283 36924 6923 50469 54587 65082 6967 -24265 -29354 42489 64413
26234 64413 35336 -25556 -50743 13988 4429 -51012 682 32171 47554 54528 25528 61278
26222 61278 48665 19003 9074 7825 -35113 -25211 -6638 -13484 -67308 -75075 -16383 39731 3292
26209 3292 12513 -5231 -13301 12431 55080 36369 -47605 -6401 10374 -66888 -95057 -31999
26197 -31999 94821 114703 84481 74366 93016 78391 3583 -48775 -43939 -15638 31586 141516
26185 141516 163567 115822 80563 90850 78862 81774 55113 63201 91904 136219 106859 58851
26173 58851 58746 111674 139292 95884 151559 208584 274201 217951 220929 307746 344044 264112
26161 264112 165334 146623 112590 49732 72940 87486 96251 50099 53671 90888 58032 43096
26149 43096 64692 -20820 -52838 -32100 37947 25075 32643 51840 66000 88030 103422 79241
26137 79241 38715 23449 -51851 -47793 -13197 28418 -50560 -50785 28234 43478 19341 15106
26125 15106 18537 77553 152510 152015 138684 217802 235220 150697 112976 435 -82180 -110832
26113 -110832 15155 77951 9699 -67127 -95741 -107031 -34010 1499 16971 -8146 -7854 46535
26101 46535 5491 1573 59019 85625 3500 -35249 12828 26746 64998 53442 83201 88299
26089 88299 32566 -12632 -74357 -100158 -56077 -62687 82621 148013 77220 132501 136141 117951
26077 117951 131624 97496 8018 23111 10889 -7916 26687 -35569 -124416 -129425 -91432 -41577
26065 -41577 10881 33920 -8716 20930 -50960 -78674 -6303 11224 135019 222358 187573
26054 187573 152738 124711 96618 71214 77297 51394 84276 105976 68893 -2184 24113 -15112
26042 -15112 -97623 -66375 -5166 -34053 -125990 -29666 103020 170954 218177 209753 153685 115353
26030 115353 99928 91633 49104 39475 89636 71287 -34099 -97106 -35945 8777 52658 14329
26018 14329 -34514 -141290 -81947 9013 28152 13877 -61652 -86994 -69002 -50393 -1043
26007 -1043 14819 19428 -43332 -140487 -159854 -86149 -79117 -123515 -84646 -51072 -16779 70502
25995 70502 112523 114237 16599 -60046 17352 62162 105631 50269 58405 173910 87844 12950
25983 12950 59213 5956 27390 -4933 75364 107364 62357 87083 27197 -38438 -110228 -93642
25971 -93642 12151 2073 1248 -30816 -51459 -36762 -21405 281 -79654 -58193 -35547 -48781
25959 -48781 -49842 -342 -12811 -71328 -38603 32991 58456 59921 62721 18541 -18943 -96207
25947 -96207 -48730 58818 78548 76454 89028 134938 93465 134852 196703 276462 271301 119172
25935 119172 65836 57131 74165 137616 153907 116915 89261 81401 138622 183877 130106 111186
25923 111186 78434 69515 43702 16787 86077 59145 -44935 -46771 46673 17802 55035 44056
25911 44056 25929 -53798 -86157 -24423 3927 -11767 -52628 2369 38650 -18103 3441 -8251
25899 -8251 4418 44908 -28390 -66981 -50260 -16858 -43656 4124 61437 84759 115864 114121
25887 114121 100668 71936 72594 11458 -28579 13763 72161 18039 -40398 2386 97675 8281
25875 8281 22963 33376 -16500 5816 33953 113057 124524 108618 89508 133033 126121 98721
25863 98721 115830 161906 151470 73838 69432 63939 109000 107029 73693 102655 141436 142758
25851 142758 92937 85777 96974 130775 146524 182232 117590 94254 123862 72822 61781 45141
25839 45141 37219 -3713 -68968 -52192 -26882 -1587 33808 40287 7735 -67796 -97170 -24535
25827 -24535 32087 142 -56451 -29901 38978 11668 38312 -26753 -12160 72292 62269 12826
25815 12826 -17137 -96591 22622 175963 158932 129454 61989 76660 94199 130971 103322
25804 103322 49325 39103 68837 -27153 -137875 -156562 -79337 -94745 -161024 -115233 -54690
25793 -54690 -19108 -28873 -25792 24043 16712 -23782 39797 31663 -3473 7553 -20872 -57396
25781 -57396 -121545 -127246 -41258 20465 47610 56926 7997 -49241 -85042 -80081 -18680 90027
25769 90027 26699 -148 21119 -10433 -32650 34077 34050 64647 15386 17459 41405 110632
25757 110632 137910 135530 163822 137933 122477 67615 52253 1228 8592 -70674 -12216 43938
25745 43938 -53556 -116744 -68182 -18416 -43334 -28716 -42885 -34503 49634 110215 37395 -49451
25733 -49451 -58634 -20309 -102753 -179507 -139196 -110909 -27661 45503 8588 -20522 -39299 -68796
25721 -68796 -1774 -29287 -29867 -14990 -6689 32645 8262 -27503 65781 124220 32237 -37162
25709 -37162 -10037 21586 82017 59580 40067 37832 20560 34454 -2942 -55563 -19103 51653
25697 51653 13721 -38803 -17767 -6894 -2184 -12044 12374 82516 42142 -11768 25702 -10431
25685 -10431 -13762 -3355 35665 86433 92617 36294 34923 63557 109499 6255 -92851 -69169
25673 -69169 12434 -77108 -100227 -54479 72955 27273 -8568 13134 -36091 -74823 -49648
25662 -49648 -88007 -67031 -13012 55126 9565 -20246 -13992 -26918 70566 102991 77960 56715
25650 56715 7307 -88329 -159097 -110946 -109254 -48588 -3250 13377 -1224 -43538 -16790 -15637
25638 -15637 92458 136520 177028 143631 37114 -20064 -8178 46308 100805 115907 102649
25627 102649 70761 41201 56767 96013 45143 -26459 -36499 33092 91583 89131 51698 -46613
25615 -46613 -43504 -8803 -16322 -30762 -43767 8062 31828 -25832 -19055 94620 20994 -60925
25603 -60925 -31811 29267 47689 58557 95890 46103 13503 91468 5448 -94667 -56689
25592 -56689 14987 47059 -6046 -104075 -75494 -70026 -28371 -26636 -81933 -89369 -89257 -120579 -57159
25579 -57159 45877 77539 -14037 -66902 -62873 -35941 -8792 4575 79625 85799 56176 71114
25567 71114 77046 21735 -19571 -46277 -54776 18444 60251 22029 -1953 80844 23714 -165407
25555 -165407 -176482 -88619 -29923 13183 98676 122363 73318 -60563 -72090 -29093 -6260
25544 -6260 50211 -6371 -12088 45781 90447 117718 118536 99723 15676 -31443 41242 93765
25532 93765 36982 3834 24724 39530 98939 124783 104639 114958 75971 50775 81040 98476
25520 98476 120006 70619 -2111 -23417 -49875 23810 17599 -89689 -92726 -24392 68632 103104
25508 103104 149586 158123 148061 121896 122633 78334 22205 -11718 19208 -15372 7676 21139
25496 21139 -21217 27565 64314 101979 174849 248981 148818 -3055 -56175 19987 58713
25485 58713 62484 3585 12301 49259 58032 47277 97023 87483 25399 45422 100577 78736
25473 78736 3211 5973 9675 9978 -85936 -19955 -16251 6690 28204 -2352 49622 9715 -54306
25460 -54306 -46148 -7784 60581 119617 71063 -30055 -5615 -12633 -54569 -64797 -40860 92268
25448 92268 91733 32095 6566 -81460 -140173 -8668 -614 -61849 -159213 -154444 -32880 120363
25436 120363 192868 162616 165578 99810 79988 -69852 -141747 -68713 -12889 70584 69251 -21781
25424 -21781 -8449 45634 75058 121014 155361 162649 178206 125420 62574 47278 97575 149203
25412 149203 116440 58717 42640 51925 65525 136308 135459 58919 -32199 -72875 -47644 28587
25400 28587 87044 162917 138625 128624 110286 24094 -49348 -21382 79584 124690 46694
25389 46694 20146 -675 -50762 -125933 -128099 -67850 -130765 -202296 -150890 -44752 12609 -17013
25377 -17013 -63797 -9536 -37284 -50335 -13034 -68240 -47521 4628 -2588 37080 95329 100735
25365 100735 94607 104670 50796 22427 -33266 -48367 -63789 -106472 -101895 -108688 -103207 -95617
25353 -95617 -123734 -68387 16871 -2016 -77265 -70575 -83326 -57114 -46143 -30464 39935 118114
25341 118114 94199 134392 154038 101915 -55700 -147063 -142487 -107903 -57238 -102782 -58473
25330 -58473 -37630 -27087 -24526 3985 41791 75770 70828 92164 82264 18331 -63637 -114282
25318 -114282 -63693 22188 -41411 -93672 -51749 -31304 -3463 -45261 -41072 20112 5674 3043
25306 3043 -20893 -70124 -39084 -125555 -112467 -66317 -25448 -1917 59018 136780 71433 52195
25294 52195 36823 36006 64630 47073 42427 58318 58449 65807 50341 -34089 -47837 -45742 -27756
25281 -27756 -31195 -95485 -65800 -60938 18862 20895 76925 110527 25037 2812 -27614 -41643
25269 -41643 -62360 -59232 -36179 -7027 -36054 18469 -22142 -28378 53535 70050 67974 120055
25257 120055 162268 108817 59703 40544 -50487 -128125 -56617 -7877 26394 24412 30700 9316
25245 9316 -96026 -178123 -146526 -56609 -46588 -108765 -117468 -152095 -129071 -118502 -134980 -73105
25233 -73105 7467 1396 17175 -67652 -123713 -52142 9636 44414 -27844 15398 -11776 43671
25221 43671 -4217 -11018 8265 1130 72266 44906 78835 126409 4128 17053 35487 10083
25209 10083 -101525 -141316 -151015 -169574 -139928 -40704 -17293 -56015 -83716 -11793 17496 -73914
25197 -73914 -25412 -45278 -62537 -26237 -6079 53466 114398 138827 142794 115693 91775 27733
25185 27733 -66110 -7327 -48383 -110530 -105726 -70356 -15421 7643 -39510 -30168 20836 8257
25173 8257 -45345 -53013 958 7208 -5838 71136 87722 117649 149357 117509 93109 -19993
25161 -19993 -113114 -108895 -17260 29001 157613 276542 246771 131079 -49467 -71905 29615
25150 29615 87951 52708 46805 19951 -18406 21100 7969 -26025 -30368 15496 57655 37815
25138 37815 -55605 16162 71179 59440 18223 -39759 1391 89088 139626 91218 -53054
25127 -53054 -19991 25365 20582 -32267 11040 71350 127165 172533 167039 71275 -68342 -124122
25115 -124122 -102949 -38907 28687 -31860 -45068 -73272 -70091 -38503 -32264 -36125 -57815 -45198
25103 -45198 -33061 -2250 19633 37154 112352 145521 33523 -12895 -29042 -39986 -64865
25092 -64865 -95790 -2971 -12988 -12005 7030 -10787 49014 64397 73167 49337 -806 -19609
25080 -19609 -63614 -60178 -29198 -27011 67244 136246 164628 191457 162062 22396 -29282 -19032
25068 -19032 -1062 68343 -16131 -73909 -14479 32162 -68589 -109624 -33600 10362 34130
25057 34130 28328 65130 -8676 -41755 -31243 -32089 29218 -36209 -39593 -87436 -60953 10898
25045 10898 52149 104371 95936 -60 -13979 17151 55205 138683 136038 62573 10989 -50175
25033 -50175 -2092 67967 37818 -7840 -3828 -80483 -67574 -66738 -129383 -154534 -73931 -17370
25021 -17370 -5770 27815 70593 63749 44466 -53823 -127952 -107989 -82900 -148478 -135278 -27318
25009 -27318 31676 -683 -54448 2378 33472 84 -80576 -124004 -46240 13067 -29643 33365
24997 33365 -2017 -22438 12520 21208 48439 -9043 -66215 -27348 -4878 34921 39389 -8309
24985 -8309 -24363 -65548 -5343 97958 39732 60395 79337 67769 -4369 -40634 -54472 -20460
24973 -20460 -87261 -148807 -68175 -90894 -162997 -97226 -7470 6898 10502 -35803 -115025 -74444
24961 -74444 -67317 8097 63020 49952 41235 2506 -19916 14678 103126 103890 -46471 -68887
24949 -68887 -28364 -72715 -175095 -147730 -92185 -52933 -65997 -109472 -186187 -172974 -116199
24938 -116199 -162613 -186165 -123239 -43573 4 -34126 -39396 -51427 -39227 -20707 -59371 -66461
24926 -66461 -41506 35967 61863 81426 78762 68749 82148 82451 56344 27549 40680 -10156
24914 -10156 -24187 45702 98430 103859 111634 61201 76428 52960 37308 85063 96515 102248
24902 102248 90667 88533 80677 85989 98464 110180 122013 137447 89955 18075 31519 -59661
24890 -59661 -34372 -62330 16044 86472 3500 -7349 33327 130590 96709 45597 18471 25160
24878 25160 -14799 -51638 -38655 -23222 -1453 -21511 -27591 89332 118133 42320 -399 18130
24866 18130 44992 85738 68099 26199 -19525 -36178 -44038 6939 47868 61330 80777 -6349
24854 -6349 -45771 -43233 -53416 9714 -5365 -29176 9253 15967 -59281 -113002 -175102 -128327
24842 -128327 -79074 -22560 -16121 -4985 37849 43366 -35456 -11512 43199 -4632 -36365 10178
24830 10178 -22607 -29972 1607 -9444 -149223 -113764 -67207 -52793 2774 32224 78958 22019
24818 22019 -46985 -53400 -81474 -100808 -16059 -45719 4540 -2369 54365 41060 66686 870
24806 870 350 73037 121259 133064 204734 271443 218107 218441 158745 77456 23955 59805 21906
24793 21906 1594 112084 35751 -52945 -43647 -8467 49235 33373 32901 -4337 -54843 -16861
24781 -16861 -26923 -67491 -148727 -129440 -27665 -23356 -20885 -50435 -46758 25782 110802 20560
24769 20560 -26679 14128 -14902 -73630 -34652 24192 27738 -2235 -86346 -48720 13429 -5962
24757 -5962 5341 -86880 -75693 -90484 -135642 -95995 -27430 -77843 -80189 -107021 -90157 -33040
24745 -33040 -52353 -57548 -40324 -36453 -113623 -128915 -91584 -115649 -93839 -23144 4786 -49658
24733 -49658 -85124 -14438 50612 83645 99149 52470 -34735 -89628 -47881 -35907 -4691 -4751
24721 -4751 -62422 -91103 -66633 -103920 -93266 -128506 -101155 -45761 1154 -2718 -19409 40313
24709 40313 161686 112767 -3776 -14855 27153 112639 109243 31290 12761 77711 20329
24698 20329 78053 53027 26375 43286 -98793 -157405 -71500 -24537 -6444 28640 50343
24687 50343 45766 30422 41706 9311 -31679 -50144 -126934 -77117 22017 49705 28387 -29010
24675 -29010 -57687 33536 -4227 -31237 -47741 -42815 -26973 4888 22602 6279 9399 -25678
24663 -25678 -48298 -12993 -43967 -96044 -39285 -68964 -21326 -46845 -40713 -18955 -59626 -117770
24651 -117770 -139490 -41530 -47501 -14578 -29913 -58573 -51972 -33747 -39328 -49178 -73571 10020
24639 10020 38753 -20596 32525 51754 99194 108373 47574 6653 -95242 -48870 -7989 35896
24627 35896 29150 12648 2976 37840 2455 -17893 -62748 -65079 -29004 66355 157340 188042
24615 188042 216575 111116 5598 -64532 26662 90002 42973 -10368 19042 111564 89284
24604 89284 -21485 -50197 -41998 -44390 -45331 -19470 -113620 -29622 37890 18801 13006 29048
24592 29048 21176 49164 -32594 -115605 -126062 -148195 -77517 17197 17672 56669 45769 -16689
24580 -16689 -25202 -70309 -33982 -24179 -13840 -50838 -77887 -31670 42871 75008 -17395 -47249
24568 -47249 -10012 -746 -77779 -137440 -130739 4109 58765 99377 82874 71312 -15360 -38230
24556 -38230 92561 137295 143435 75670 54578 89876 60221 -58172 -107530 -42644 -2405
24545 -2405 -67535 -78343 -20977 701 8069 -81850 -82271 12897 42723 -25016 -93812 -889
24533 -889 178975 191760 97226 36799 -41386 -103454 -102539 -118656 -108597 -83699 -63323 -137184
24521 -137184 -25182 10685 -6816 -32444 -57004 -60132 -114184 -131169 -50092 14095 40770
24510 40770 120276 83482 -30236 -8373 -42244 -159864 -231431 -213407 -186061 -100804 46800
24499 46800 97208 54067 -26648 -172564 -227935 -189607 -162227 -109174 -35937 -127084 -237294
24488 -237294 -190336 -137732 -101764 -55059 -74779 -5309 -40703 -100269 -119416 -145957 -196191
24477 -196191 -210322 -125201 -93881 -32443 -21428 -98050 -9662 3437 -116450 -200305 -141584
24466 -141584 -114624 -60660 -21477 26757 -41658 -15228 16271 14782 45337 125138 92171 61621
24454 61621 -41898 -33721 -43783 -99767 -130067 -103666 -66780 -26914 8399 -472 29983 29785
24442 29785 -16087 -34406 -51015 -20234 -14773 41829 20754 42234 53127 -13978 -72137 -86300
24430 -86300 -125123 -100703 -154338 -107752 -6904 16371 -12066 -3211 -1437 -27824 -10623 29067
24418 29067 -73298 -66362 -50708 -79007 -62770 -32793 -23017 -33434 36761 50177 54356 208626
24406 208626 267870 168065 109032 14934 -21509 -43401 -46 59239 68565 69409 -698 57885
24394 57885 125126 103065 3947 -36335 59127 18382 -47305 -26387 19107 -13579 -13426 -36291
24382 -36291 -70027 -74708 -41763 53922 64172 84117 124103 94999 35638 29657 86305 21040
24370 21040 -76206 20749 29765 -58952 -53462 -57628 -59115 -128859 -200962 -128987 -109597 -147373
24358 -147373 -223879 -146739 -58263 34884 2360 -30329 -60575 -96123 -112628 -165703 -242204
24347 -242204 -244235 -260478 -203892 -238871 -158345 -7186 88172 160839 135869 106653 28754
24336 28754 96294 43146 89042 66300 87019 100470 42691 21125 69385 83423 33226 51977
24324 51977 64222 6465 -39667 -79020 -129916 -20818 69873 53322 -67635 -163228 -113028
24313 -113028 -73651 -69690 -86626 -114148 -191007 -158846 -68657 -46542 -43211 30463 85471 23401
24301 23401 -30477 -51764 -47375 -83647 -146964 -91786 -100983 -15342 63915 76881 85181 170708
24289 170708 145293 83667 78142 37882 13592 -931 17680 -43328 -127278 -110025 -51965 -67236
24277 -67236 -78976 -74266 -63684 -13340 743 -13559 -3197 5907 13925 10878 -15271 -68009
24265 -68009 -99633 -72670 -33274 -16123 -35574 -11983 52545 -48102 -142510 -118868 -97427
24254 -97427 -116056 -151935 -161358 -209438 -75098 84328 66320 48397 93603 54481 12191
24243 12191 -47106 -27465 -19188 17836 57442 -6938 -48161 -58003 24673 42105 -20598 -51319
24231 -51319 -49379 -40003 -12011 21119 98989 75290 22929 4269 -27850 -24071 49135 85987
24219 85987 74940 47580 -7255 -129228 -170142 -186084 -124391 -123878 -80754 46636 15286 -13105
24207 -13105 -47195 -80161 -78138 -68603 -53085 -60934 -45075 -54682 -24631 -38956 -112707 -203084
24195 -203084 -166852 -59626 -1751 62814 161467 144559 35359 -54036 -47751 9966 77187
24184 77187 124433 37451 80600 141661 94362 66273 9282 -36088 -18800 -10771 26765 95477
24172 95477 130133 125063 91916 63048 65032 43165 -12207 25358 10724 -16126 61188 129550
24160 129550 135419 128899 86499 73577 101214 145738 112214 76473 1827 -18037 -7736 27878
24148 27878 65423 76322 95610 33635 -55893 -61259 -102014 -56737 24413 22186 -20356 -40061
24136 -40061 -51908 -48185 -55014 -114817 -142507 -130595 -86535 41257 28863 -14486 -79921 -73133
24124 -73133 -37487 -41020 -2972 -32018 -87711 -75115 -56306 -104143 -219292 -243009 -193016 -119832
24112 -119832 -46297 85976 184487 188447 104201 37490 20538 21048 23305 101429 85373 -35617
24100 -35617 -63429 -86407 -18834 -9599 -32861 -4177 -15904 -63028 -89888 -19047 -2309 -66197
24088 -66197 -85640 -31158 33358 110368 65696 -26838 -72797 -71570 -80783 -66368 -45429 -13903
24076 -13903 -4126 9619 -58845 -66929 -12733 92592 117447 -6302 -108389 -85277 -38304
24065 -38304 14566 -43351 -88848 -88107 -52180 -7895 36378 93935 64044 86439 -13380 -62121
24053 -62121 -64866 -36096 -15376 -1867 13953 -33821 479 29150 34504 139149 126287 41382
24041 41382 36576 63941 23103 -18966 -14739 37027 -25823 -94341 -31601 -19132 -86703 -60893
24029 -60893 -86634 -56859 -20285 -22541 -51507 -36635 -126155 -113326 -49582 1597 9724 32630
24017 32630 34683 61317 92600 102046 62377 -21795 -80866 -84192 -76134 -98092 -141273 -84543
24005 -84543 33305 113284 142339 25444 -46097 -33025 388 -21098 -75199 -50568 -73432
23994 -73432 -34358 -88066 -129742 -76744 -31930 4548 51742 65946 58084 108377 73053 -25432
23982 -25432 -93913 -115655 -60122 26200 100874 82424 76674 43884 -15582 -21672 -12242 -86304
23970 -86304 -26975 35864 122192 216762 180317 158228 191736 125855 81873 56201 25505 48419
23958 48419 102944 91433 66438 66777 7134 -87557 -111203 -131426 -50170 -4221 87902 126791
23946 126791 125388 54519 127619 172027 87204 59952 12166 -32257 22723 35138 -20068 -14132
23934 -14132 23801 137017 104454 62329 33031 40812 -4530 -19064 17692 27683 21703 -7236
23922 -7236 -10115 17084 -45699 -53145 -22804 -45148 -52732 -22245 -29539 -100385 -72734 -78815 -77157
23909 -77157 -65824 -113978 -57683 47947 27180 122525 144957 39289 21957 -20880 -65429
23898 -65429 26981 90221 9651 37767 55132 -31140 -104669 -107706 -58448 -41474 -16870 -52049
23886 -52049 -185593 -199540 -5746 1192 -43002 -72084 -100099 -89345 -34266 53458 93483
23875 93483 69096 116932 82858 16800 7739 51156 30459 622 -13091 -61753 -43205 -80533
23863 -80533 -180667 -148214 -115694 -75956 -14480 36142 124218 184361 117319 -34854 -63679
23852 -63679 -45966 -80468 -88573 -55757 -40443 -61417 -39904 -30307 -94697 -120754 -18504 1964
23840 1964 -46284 -65657 -19240 -82709 -216568 -298110 -203180 -83331 -97314 -82767 -46315
23829 -46315 -23947 -113923 -36171 29326 -18630 -22775 -28470 -64768 -51882 -100215 -25017 40957
23817 40957 43901 63071 24494 -31664 -46342 -28360 -13292 -73855 -167265 -140181 -94234 -25084
23805 -25084 -75583 -202828 -214681 -98136 29419 82665 24893 -38415 -17856 -67240 -109979
23794 -109979 -133978 -143136 -95536 -22568 87251 113453 15351 -27129 7705 45381 12442
23783 12442 -26381 -4009 88157 24275 -9872 89078 136909 80324 9517 98210 86464 17238
23771 17238 27935 96579 69328 57632 135400 167687 120717 165976 115098 -12848 -66481
23760 -66481 -92151 -107326 -59363 -74378 -53727 9108 -46338 1770 -16106 -65193 -67069 -117321
23748 -117321 -171773 -116382 -30399 -10109 -81257 -68385 -38760 -84271 -132715 -126189 -144924 -142838
23736 -142838 -151464 -138310 -115421 -88725 -100188 -102299 -110014 -5461 123458 123148 48826 51443
23724 51443 -8091 58816 76833 120063 123956 43104 -11259 -66841 -59011 -30581 -33396 -8618
23712 -8618 -24402 -16365 -23284 3938 41907 41306 -1354 -13854 -5453 41380 81798 48539 -2391
23699 -2391 -50059 -3904 9936 24452 48011 10349 -18241 -62570 1507 9758 -31682 -48588
23687 -48588 17050 -56084 -36384 15813 43795 45924 70656 115565 40391 -33397 -23500 27379
23675 27379 -73907 -178976 -109481 -15404 25228 107539 142439 99703 36542 -6399 -85774
23664 -85774 -167894 -94359 -32736 -33907 28588 63917 24785 -21382 10408 -13047 -32914 -105215
23652 -105215 -91583 -75414 16139 46138 62331 13956 32762 13631 1482 -7288 -29424 22356
23640 22356 23512 -2503 569 35017 7206 -34753 -37460 57343 91270 108486 87047 75719
23628 75719 -38300 -58758 86191 71664 115150 197814 161227 119775 86414 41919 29863
23617 29863 82728 116644 138284 124348 33990 8422 -8967 -19941 -106153 -83291 -45791 -100870
23605 -100870 -4044 -15635 -82144 -102458 -41054 1136 31763 38709 40578 87338 142628 174687
23593 174687 159515 37796 46873 94096 89683 90756 178688 128332 38216 -19130 43332 168735
23581 168735 240391 182446 135132 86690 21278 18632 -3465 -8553 -48128 -46799 38525 174113
23569 174113 119288 6948 13696 65488 88430 56104 9930 3185 -22441 -57266 -93102 -15268
23557 -15268 51478 69968 -8719 -47474 -3628 -55112 -60882 -12065 57639 59317 -35667 -72923
23545 -72923 -61646 -14366 -24382 -19485 -63633 -95443 -58273 -92774 -72655 -62933 -31410 25975
23533 25975 12678 -30946 -43499 -41183 -73805 -92514 -101811 -30922 35105 -63494 -91038 46931
23521 46931 111575 119 -28497 46238 127910 163031 114472 106073 205066 73740 -9038
23510 -9038 36355 59380 18637 44509 36131 -4396 -44699 -6872 42164 26086 -68219 -111519
23498 -111519 -47235 18645 57461 34278 29060 -877 -36645 -94239 -108570 -91442 -67235 72776
23486 72776 93335 104307 89935 34465 1129 -59345 -106395 -113119 -133065 -134550 -91996 41158
23474 41158 36390 -55681 -90381 -60921 -19187 -60425 -34242 19795 61146 150122 140007 101762
23462 101762 118839 167514 121324 50452 -25548 -24982 6487 56278 75502 102323 127124 39154
23450 39154 -88631 -21754 96400 92120 39686 -30560 -32062 -58045 -110776 -91466 -75644 -8106
23438 -8106 36221 -12378 -13881 -27815 -54090 -74726 -107686 -95091 -69585 -70437 -109828 -53877
23426 -53877 -36439 -63226 -59755 -56922 -60992 94857 137065 37662 -145507 -182365 -141747 -2706
23414 -2706 53876 83332 62748 -23182 -1837 11541 2125 79171 104165 14756 -119237 -199683
23402 -199683 -141563 -19066 30711 -9143 15339 47586 104636 111722 104161 23964 -794 18717
23390 18717 -68088 -88183 -45963 -33705 32296 106131 76673 -26458 -76577 -108257 -77174
23379 -77174 10385 43257 -29296 871 17757 77957 31571 -44940 -55196 -3776 52601 109546
23367 109546 154673 152470 111065 105375 55989 2905 -12498 -7613 21825 30553 42008 -17643
23355 -17643 -82783 -33692 34617 114393 29606 -80132 -98038 -31337 -10858 -3177 18445 15408
23343 15408 -39812 -107841 -23557 57460 107005 102796 100465 126100 41207 -31301 38236 16595
23331 16595 -14260 28150 -14922 45283 115017 133725 136153 143619 1805 30261 40085 6363
23319 6363 -36106 -78777 2960 73741 61697 -22196 -79100 -130828 -107156 -37996 2235 -41942
23307 -41942 -65409 -53530 10086 4137 -56546 -64411 -69348 -78938 -81377 -21842 -15096 -76884 -79791
23294 -79791 -48117 25196 71734 91109 53315 58696 71514 73253 101576 12775 26223 -31309
23282 -31309 -15286 83598 43222 27236 41224 34599 29146 33268 27833 -12470 -57114 -78375
23270 -78375 -68687 2904 100273 177159 73484 -48203 -48196 35278 91680 100337 37310 -47300
23258 -47300 -57293 1914 7516 43896 39267 121273 187465 101881 -9889 -20572 41652 19619
23246 19619 53112 40657 45509 -22268 -36509 -69475 -26153 -4025 -45365 -24980 23936 49103
23234 49103 22856 -62882 -112821 -56004 -80456 -118979 -196450 -150320 -15031 65200 55678 -21513
23222 -21513 18973 9170 66923 118256 98908 44163 -11033 19843 35469 5241 -51994 -17637
23210 -17637 -4763 101534 84524 35383 -64080 -61617 20061 67099 56757 29177 4064 -42201
23198 -42201 -77797 -15471 -43146 -36657 81600 128558 39516 -19253 -170149 -253856 -170362
23187 -170362 -70429 -51329 18121 30190 -23410 -12976 -39161 -54383 -394 120625 161843
23176 161843 140776 98574 39744 -32258 -59201 -25220 -25961 -17691 -21060 60529 74604 92507
23164 92507 56641 39914 -38289 -29954 -3727 18912 35340 27736 45489 -12941 -101401 -155465
23152 -155465 -157527 -206363 -146370 -85885 -89548 -111123 -108774 -21728 -46713 -82899 -39859 5272
23140 5272 55477 103387 82519 100116 101374 159764 132463 148085 126019 55065 -22576 -27219
23128 -27219 -68668 -145907 -120840 -115899 -100412 -100485 -109446 -49203 -47547 -18130 -13746 -52869 -79651
23115 -79651 -54058 -50762 -62779 -124968 -76972 -36047 -39299 -132069 -237036 -141173 -78868 -27152
23103 -27152 -75456 -157451 -170339 -171251 -162705 -117937 44696 171084 105438 1254 -35295 20772
23091 20772 168177 146801 146140 138187 163123 68170 49789 146168 131208 202574 240093 119104
23079 119104 7988 -45471 -108170 -87371 -15340 28662 -19983 -19849 -33201 -98915 -68380 -81691
23067 -81691 -13275 93565 108984 131117 17817 -88950 -63043 1328 113757 162079 121476
23056 121476 78331 10977 -28381 -26205 -38096 30458 104301 81272 59189 -48516 -69409
23045 -69409 -61442 -28965 -42834 -76455 -92933 -85186 -53989 -8554 21245 58265 60808 -73175
23033 -73175 -83151 -57109 -89586 -64991 54966 97133 36577 6192 -66770 -148297 -194503 -198009
23021 -198009 -69519 -27307 -15002 23419 79114 85852 46855 -25409 -73695 -40008 -15764
23010 -15764 -2401 8813 8411 99718 93202 18623 -34464 7809 21879 308 -6820 -50063
22998 -50063 -4384 -49974 -523 89131 68030 46491 11629 2486 44868 -35096 -112391 -187042
22986 -187042 -100668 -49035 -80579 -70466 -32618 -25503 -25245 -54606 -24443 -26269 -165076 -204404
22974 -204404 -62220 -18734 -95406 -125096 -120629 -97010 -43225 34229 63754 57596 25874 18421
22962 18421 89173 187863 219897 134207 73117 126814 30800 -24952 -9223 -1563 -29571 23512
22950 23512 43326 -41138 -69279 -37551 585 79337 40390 28691 13321 46967 84008 36206
22938 36206 -3622 -9999 23502 -5926 -101038 -51815 37168 -9745 -41061 7283 22556 -39652
22926 -39652 -103574 -104842 -2670 40228 90609 130653 92038 -5587 -53811 27823 51490 -29011
22914 -29011 -51037 -31290 31592 112497 145277 97096 87473 86010 121514 61154 -67090 -31676
22902 -31676 -35939 -44589 -26185 -7706 40475 96234 140543 127399 91710 67870 -3148 813
22890 813 -30947 -93226 -148762 -54701 63186 -6257 7142 118958 93572 146899 246276 210715
22878 210715 123713 93007 84731 37902 1331 8717 -58676 -48119 12492 62693 62041 32664
22866 32664 28327 22080 -77324 -77760 -22974 52036 92783 43402 49059 -53350 -75453 43281
22854 43281 85624 72009 44234 26937 -4229 -57353 14195 65407 34868 53670 -350 47837
22842 47837 82428 68262 26141 -24069 -31305 -6156 595 -38088 -45940 26802 61211 115698
22830 115698 84370 56872 -21467 52794 71352 85463 15850 -78775 -80483 10231 154317
22819 154317 142948 160160 84411 -14057 -8545 -36277 9955 24642 -65068 -94241 -79289 -47600
22807 -47600 -94488 -67799 -26338 -77647 -88975 -10873 14212 -2467 -26490 27832 86311 107199
22795 107199 25886 58473 64435 80670 40519 -13613 -42265 -86561 -91946 -39781 11302 37453
22783 37453 -50703 -108086 -117992 -72503 -19680 7187 62202 48981 -16594 -15562 -15556 18307 50976
22770 50976 18009 -36278 -9655 -10103 24302 8786 -44406 26553 52064 3912 49382 79783
22758 79783 30541 -75710 -87364 -75998 -59509 -66232 -60450 -49881 -112065 -139743 -116169 -52290
22746 -52290 -14276 15548 99914 97767 29145 63474 85864 54128 78100 108256 105110 50933
22734 50933 15348 -18918 24145 29306 137661 58566 19774 69808 90781 88781 64391 63229
22722 63229 15294 -3106 1477 102365 107621 -95680 -99503 10221 24427 58760 134298 156216
22710 156216 110895 73264 119473 77390 -43843 -26295 27248 -22075 -5524 28914 28083 8394
22698 8394 -59268 -28370 2370 11983 -69351 -80863 -21545 13561 68397 124328 81729 -23744
22686 -23744 -20162 -18723 -33100 -102964 -176644 -179578 -117555 -70658 -65555 -21164 54581 18644
22674 18644 21580 38042 34396 68147 -47902 -3064 -14927 -61739 -59427 -21331 -34375 20308
22662 20308 90842 65323 26893 -75595 -91472 -45845 -97380 -127206 -141302 -63746 -109465
22651 -109465 -183615 -190284 -167598 -137086 -107712 -82451 13268 111070 175414 101821 37657 69811
22639 69811 76771 58229 55515 36206 73521 85257 106522 7261 -112188 -201748 -196747 -90715
22627 -90715 -56539 -123901 -90783 17732 -44791 -25682 20546 45488 99210 89854 -16684
22616 -16684 4353 102644 80238 4098 14332 -30083 -55216 -22836 -60222 -91670 -174413 -143081
22604 -143081 -148782 -120149 -47816 -44762 -10914 -68482 -106827 -89707 -42456 -70415 -33776 16052
22592 16052 -21338 542 -2882 25971 17138 -1638 48078 49019 -34704 -60938 -89921 -86233 -107241
22579 -107241 -134299 -132140 -147278 -161123 -133075 -133055 -113137 -55140 26234 43966 114707 90999
22567 90999 42363 -35668 -6696 18841 -10362 -13678 22121 -73537 -79054 -18209 57414 85252
22555 85252 92221 16938 -47162 -57967 -191875 -203522 -178783 -89559 -59946 -56100 -96100 -74509
22543 -74509 -66564 -21050 -5993 -86487 8951 23629 -2515 -87960 -210653 -86056 66473
22532 66473 40825 -38094 -37969 -60196 -86864 -121591 -140107 -142468 -199720 -125336 -5817 -4917
22520 -4917 10334 -41297 -49951 -65170 -21525 23914 -2039 -35562 -25019 -68023 -73195 -52606
22508 -52606 62522 72998 44111 -25541 -13139 -47344 -98230 -100521 -77915 -34695 -29944 -81195
22496 -81195 -140444 -131853 -57333 -59660 -143502 -142215 -154934 -133076 -71263 -77412 -38806 49585
22484 49585 -926 -50443 -26487 -27670 -24714 89297 93550 47808 35604 33437 -32442 -59497
22472 -59497 -78969 -171653 -139303 -56731 10155 33923 71978 28093 -3354 -11425 29249 -7959
22460 -7959 -34046 -26616 -89049 -172934 -125688 47394 165462 116163 15500 4139 3944 -124059
22448 -124059 -142514 -105854 -118290 -137261 -119154 -46289 -36343 -16726 -7203 -35967 -77231 -106737
22436 -106737 -64824 -28646 92646 31403 39300 102574 100966 98832 89224 -49563 -103302 -58483
22424 -58483 -41706 -72485 -96562 -199631 -258489 -186993 -123868 -82974 -101149 -102939 -155131 -255825
22412 -255825 -209476 -124814 -69812 -100875 -45450 3045 15309 19703 -3204 47129 68527 170901
22400 170901 222446 183924 151420 103133 46298 -684 23719 43456 56291 123270 152768
22389 152768 142042 118367 48872 -97443 -154493 -140115 -176728 -159104 -108176 -13812 1195
22378 1195 -21310 18853 72274 49589 -35442 -85400 -81281 3953 85743 30933 -45113 -12827
22366 -12827 8608 69538 80030 22408 6459 47464 41338 24441 66508 159746 90135 44980
22354 44980 40164 12025 -72188 -110954 -82043 -55686 -29639 -13431 -50576 -39239 932 -28397
22342 -28397 -31823 -110328 -144653 -84712 -26353 -49387 -22560 -16985 -4341 -15358 29818 -214
22330 -214 475 19928 70072 49861 47265 26123 -3424 -18166 49911 166074 162483 127695 18969
22317 18969 11267 40367 48199 44508 45285 18553 -11674 -47349 -32596 -55600 -63280 -2403 22653
22304 22653 100506 83674 3550 -45650 -41349 -74659 -74141 -36273 -29510 -79246 -7366 1227 -79301
22291 -79301 -64347 -52975 -166958 -150287 1380 25609 37169 55222 65636 68833 70230 44247
22279 44247 83823 75313 82686 53621 -43281 -37854 11539 901 -82849 -76834 -34015 1683
22267 1683 23512 -6284 -2865 20021 10628 49476 90232 56762 80195 61677 55192 15003
22255 15003 -26503 -20844 15973 32449 -9890 38640 114515 112691 4826 -28380 57235 113515
22243 113515 42257 13734 -17171 26817 45135 -42281 -109224 -15264 125134 41741 34863
22232 34863 93612 65614 28009 12995 -28083 17555 4593 -89294 -98856 -101146 22387 99325
22220 99325 14281 -33282 -6025 9600 -39689 -79121 7868 -5754 44018 72430 105974 123917
22208 123917 120640 42580 -53401 -100292 -29597 9166 78392 56138 -62219 -33901 2837
22197 2837 71362 70656 -52097 -117685 -43528 24071 -54735 -92454 -92730 -83666 -94361 -113786 -144914
22184 -144914 -74103 3185 -21381 -23829 57535 60067 79640 21190 -24792 -42272 4217 95049
22172 95049 170026 158608 92085 46109 23944 -24033 -30135 104384 89736 34951 -36127 -8659
22160 -8659 -19658 -100316 -36777 -23703 -13406 11594 23978 -20532 -74194 -22612 -51359 -150341
22148 -150341 -105655 -72591 -25602 -43499 -61601 -80855 -20133 19316 -8335 -72438 -38370
22137 -38370 -25692 7433 -2207 -44209 10783 -36570 -25344 70089 69574 63233 6411 -6223
22125 -6223 47099 -10493 -73668 -64246 -44035 -75133 -100740 -91359 -35131 -88556 -118547 -78325
22113 -78325 -72000 -101222 -142533 -159917 -142887 -61267 -19701 -56636 -89410 -104006 -61171 -8441
22101 -8441 -35994 -73177 -62176 -142520 -113988 -16835 79157 91109 60779 37757 23782 -32161
22089 -32161 -87014 -71875 -84979 -131127 -100866 -117882 -136041 -136728 -84990 -15603 51687 59039
22077 59039 74279 68564 -50654 -130923 -157994 -115930 -5293 5757 -69470 -122485 -111673
22066 -111673 -110264 -71401 87129 57008 1295 6081 56015 27146 63627 82142 46655 -44005
22054 -44005 -33516 -39202 28009 42356 42784 79237 68278 24171 -66743 -79548 -3943 63124
22042 63124 47753 816 9424 26818 85457 83939 89304 -14090 48823 56366 52707 82647
22030 82647 108830 116464 72372 91319 88842 28100 -6380 58948 60241 38400 -59867 -94004
22018 -94004 -39932 -55040 -81482 -74668 -83912 -57918 -66141 -26309 465 43780 148308 174546
22006 174546 182928 133763 110333 97028 64071 142075 83087 -23221 38046 21085 -90298
21995 -90298 -187426 -152960 -71748 -48267 3322 -36927 -48642 -40350 42950 56258 -8922 -61484
21983 -61484 -80201 -116043 -147753 -74676 -23197 8853 51981 -22782 -136315 -57917 6583
21972 6583 -32720 -56326 -126365 -162275 -105240 -69955 -81322 -115922 -99927 -83245 -114521 -132319
21960 -132319 -127160 -122002 -67396 -70616 -87514 -91563 -98064 28337 70795 -15576 -96112 -97857
21948 -97857 -52772 33751 44136 51274 18880 13384 66955 93266 77382 3073 -34540 -50098
21936 -50098 -10258 20632 -7124 418 4987 16506 -7793 4692 -32566 -45003 -20512 20197
21924 20197 -656 20228 35429 61889 31902 -64544 -58714 -3172 25601 -73944 -29022 -23271
21912 -23271 -71806 -151964 -109317 -18114 22383 19511 -42501 -116300 -43247 68105 46505 72951
21900 72951 83289 41121 74646 77445 105793 127366 95217 20851 79826 67631 59136 -4781
21888 -4781 2877 79565 144557 137912 153726 138139 114239 92199 29230 -12949 -48368 -29376
21876 -29376 -47007 -126300 -54368 -62549 -138786 -94145 -30378 2032 -34815 22098 28660 -21264
21864 -21264 -143947 -149334 14012 136529 150053 46446 -23839 -63838 -8286 42083 3851
21853 3851 -62214 -67382 40243 125674 141158 33373 -57246 -74706 -153668 -99288 -42791 -60414
21841 -60414 -36860 -7964 89914 55837 11183 -50341 -153052 -115233 -68699 11539 38579
21830 38579 95733 86550 161543 173447 74653 31714 79920 87932 39808 -13365 29152 12298
21818 12298 34724 28357 421 -41164 18718 85612 16098 -31055 -8118 38270 13117 17902
21806 17902 42674 -27090 -20108 -114211 -107780 -71534 -109866 -131637 -108994 -122047 -118489 -105714
21794 -105714 -43348 16885 -28962 -43425 813 94725 133446 47908 -21204 12290 -2445
21783 -2445 -23656 -22553 46821 43838 28714 -1377 2341 16894 28921 102997 121060 88040
21771 88040 29860 -416 -36137 -83769 -160942 -173078 -163102 -84012 -39088 -23260 50687 96708
21759 96708 132761 200221 125075 54524 142739 146934 42889 -53644 -79631 -70718 -63736 -17614
21747 -17614 62445 15425 34092 121276 83387 102620 149159 202136 120582 72923 37929 10558
21735 10558 -137889 -144285 -44108 3266 -19401 -44175 -66174 -54094 26873 17617 -17640 -2900
21723 -2900 -3846 -54361 -115354 -105291 -92375 -63569 -61769 -31401 -42173 -29827 -26792 -68683 -114865
21710 -114865 -101606 -50724 -80687 -117147 -138357 -126037 -156415 -105766 -120134 -156844 -98371
21699 -98371 -57095 -65638 -18007 -50632 -77454 -82214 -83790 -72612 -112585 -116126 -145845 -100475
21687 -100475 -16948 4136 47265 50420 69055 75890 48608 -291 -29220 14084 42463 -8775
21675 -8775 -28191 -60323 -15656 -4359 1924 -55756 -127261 -173527 -78609 26112 -50293 -120478
21663 -120478 -169444 -106310 -81854 -146450 -68909 -50492 -72797 -90665 -103137 -100287 -76694 -65279
21651 -65279 -30874 24020 4193 -18141 -79989 -36375 -37852 -44706 -45677 -7471 -16661 -85853 -111205
21638 -111205 -112599 -131115 -177138 -140200 -118964 -169742 -116307 -66262 -87641 -14949 20242 41525
21626 41525 39682 21204 32720 32141 14258 -91431 -109710 -19640 4176 19046 84332 71231
21614 71231 123938 153157 107668 87204 22090 16995 61020 45702 39034 56393 46328 30991
21602 30991 -17412 71052 50360 92805 56454 37727 23209 6352 -48412 -29971 1915 -34526
21590 -34526 -73673 -7108 -43869 -24097 4465 -35936 -76694 -107933 -114324 -141142 -154017 -107045
21578 -107045 21703 22347 -27097 -61683 -116099 -111223 -146122 -147378 -82603 -132205 -74762 -42824
21566 -42824 -58271 -127330 -148663 -129820 -95702 -121791 -74057 -62041 -61642 -35812 10589 11337
21554 11337 4397 3224 -11235 6516 -21256 54503 100207 159579 141646 86628 2867 -26186
21542 -26186 31377 60725 -21438 -49232 -133170 -92175 -65327 -88149 -81053 -72363 -70018 -74402
21530 -74402 -30743 -49597 -64620 -104093 -220323 -128470 -49836 -23136 8780 26872 18470 -53664
21518 -53664 -74955 -119782 -107257 -41937 -16899 -88460 -115482 -66400 -51381 -56877 -38587 -32430
21506 -32430 -61862 -20771 -13849 20878 50243 52717 44247 6670 -65167 -48151 -19503 -54118
21494 -54118 -99969 -64740 -453 -6004 5705 36636 100553 232753 179670 26511 -5981
21483 -5981 31337 21258 85057 152872 95855 68707 7176 22120 77314 38396 9344 7836
21471 7836 14498 -31159 -22456 31732 22635 44375 51513 42385 -30469 -78707 -22322 -21128 -98416
21458 -98416 -59468 -116288 -80641 -78128 -158919 -117872 -111653 -93466 -36582 -6315 -28163 41037
21446 41037 45852 8382 18466 13165 -26056 -31679 -32173 -132395 -115620 -62858 -52942 -39953 6356
21433 6356 73992 21025 -58151 -104414 -86788 -78533 -133799 -94929 83421 -18417 -93719 -105352
21421 -105352 -35892 -16138 51354 53372 41885 -25568 -64482 -49474 -116371 -154780 -134364 -239588
21409 -239588 -313055 -157117 2305 6698 34852 -6179 -63253 -85607 -75075 -21300 -62412
21398 -62412 -224420 -223744 -119917 -67828 -23805 -1913 94599 107471 86537 94436 35395 -2363
21386 -2363 -25318 -36420 -35196 67347 40558 -35662 -85827 -51868 -161520 -186068 -56400
21375 -56400 5245 1402 77228 64978 17489 1704 23724 -44376 -42518 43240 26366 5640
21363 5640 25741 -302 47922 16516 106027 153514 136877 92061 109008 133359 118441 80244
21351 80244 57509 -68666 -136471 -103580 -19598 23023 -19192 -51210 23510 103612 172126
21340 172126 199803 102245 53912 29842 -5141 -14538 -2189 -7711 -91952 -92825 -69650 -256
21328 -256 114207 214010 118217 109391 100303 111151 38718 -86812 -91218 45931 82230 45029
21316 45029 2764 5355 39168 95363 27555 -12423 -55220 -71860 -13738 -12112 -10817 -24801
21304 -24801 -17701 20146 21099 18052 28107 -26717 -27709 -5425 -52752 -72196 -433 30442 21599
21291 21599 33939 69519 63473 58937 50365 -45529 -91028 -67913 -133403 -130770 -148909 -173354
21279 -173354 -146802 -111254 -105667 -77401 -3934 5053 -49717 -36542 -87672 -27749 73255 95058
21267 95058 36710 11941 40371 131518 64302 -16781 -58448 -22175 31329 -74277 -38602
21256 -38602 -55589 -61905 19970 60071 192088 123940 70405 94662 71760 -42178 -51211 -71096
21244 -71096 -79368 -39432 44524 36457 -9496 5856 58770 83046 88867 96890 139981 126770
21232 126770 -12147 -46759 -4519 -26943 21613 -23052 22195 14926 -19594 -7117 2856 -58452
21220 -58452 -64493 3994 26781 30694 20676 -18444 -171384 -265178 -277890 -213268 -130670 -142415
21208 -142415 -140434 -11820 68983 122597 95455 30605 10094 -6894 -84847 -34685 -5382
21197 -5382 -24079 -2255 11360 61628 98276 111053 47572 7678 -37451 17610 33501 -25457
21185 -25457 -71207 -110046 -27646 11199 55843 139791 179848 114687 20768 -69323 -133236 -67204
21173 -67204 -55847 -81411 -24099 47881 56861 75455 81040 45679 7761 41766 26705 -34336
21161 -34336 -87543 -122365 -104829 25282 136123 14725 -95347 -90681 4850 -36499 -57553
21150 -57553 -110489 -96939 -169490 -77088 65298 20378 -45179 -5913 54258 27700 26152 75423
21138 75423 135753 130182 83645 47646 42861 117322 105346 44175 59235 23166 -17881 616
21126 616 978 6109 375 -25881 -58483 -146692 -150381 -133567 -78399 -84611 -70501 -2237 50702
21113 50702 56678 106788 115635 59772 -7285 -30470 -47016 14134 114376 95846 21898 30338
21101 30338 -3178 -26900 13634 -108132 -97514 -19465 11688 42893 123679 75483 -80975
21090 -80975 -88021 -70441 -7874 50502 37384 27056 13605 -50795 -45810 14684 36281 91792
21078 91792 102513 85310 35379 34717 17767 67721 109289 146480 119772 76836 111241 145863
21066 145863 220110 357717 531404 726801 929723 865888 651000 547546 355448 166346
21056 166346 127504 140611 80389 133931 191319 205813 206761 268058 236835 287650 399818 541913
21044 541913 707073 917497 938480 787423 574295 417703 315193 270941 169349 81201
21034 81201 59155 43411 2858 48358 45568 -50314 -45515 20341 82403 138402 108382 112663
21022 112663 184605 244073 83469 -1765 -56342 -86616 -80479 -81627 -30189 -24986 -41650 -38627
21010 -38627 -1097 -14821 -32289 -66564 -119421 -27951 -15426 -26846 24268 74657 35461 35433
20998 35433 38190 20124 44552 78272 86626 15613 -96359 -148569 -136847 -130501 -80418 -137588
20986 -137588 -152062 -64182 -99130 -163052 -225323 -172004 -149213 -177998 -126672 -64307 13002
20975 13002 3107 -102511 -142336 -79819 -20204 -23399 -141605 -98746 7730 37103 -74496
20964 -74496 -76133 -55972 -40670 -62794 -13 78141 102668 88803 45426 -104332 -111181 -84062
20952 -84062 -65232 -88511 -120617 -49348 -18320 -14171 51388 47373 64798 65510 -7988 -43095
20940 -43095 -77051 -36333 7026 59494 -37916 -49066 23036 17141 27489 931 -43918 -69008
20928 -69008 -61144 -13610 -48428 -23715 -48931 -59747 -115772 -62542 -38366 7168 -27063 29975
20916 29975 134381 160902 154972 186018 111353 13744 113366 121511 -10387 -132999 -30744
20905 -30744 74047 80517 43960 -30301 4924 -55786 -181482 -203337 -121206 -48497 -57801 -10087
20893 -10087 46152 173666 153035 29225 9025 40744 54461 77086 46569 59788 61518
20882 61518 101553 117534 69341 -6464 -73987 -13139 3799 45529 59267 35111 -4456 -26098
20870 -26098 -65352 4891 8842 -17744 93315 157166 129660 75694 67887 14882 -51220 -29303
20858 -29303 -18837 22387 91218 55619 -10846 -16487 -13138 12493 9352 8066 -3610 30639
20846 30639 46688 -4899 -7167 48941 75614 40714 34756 45242 42346 49467 25413 50569
20834 50569 21764 32684 -5427 21219 68932 84041 64173 10274 -73151 -9348 59057 49198
20822 49198 12591 -42243 -102305 -60974 -77095 15817 43491 110610 142486 85134 33279 27559
20810 27559 -15921 -15167 -47701 -81520 -105315 -114015 -59102 -17983 -4777 51523 23027 5945
20798 5945 -33287 -52687 -54224 -68951 -48671 -23089 -31038 3751 122104 207285 198180 189965
20786 189965 219053 154467 87541 79706 61362 76230 73330 23589 -12780 -78341 -37191 -40067
20774 -40067 -64523 -53037 -10812 52528 93805 66067 48864 5545 -5546 53897 68983 8860
20762 8860 -37547 -1421 97444 82075 8474 -72467 -45477 -65739 -45257 -10084 15138 71979
20750 71979 91762 100113 86810 172959 193248 129154 54547 -32552 -9955 -35003 -46659 52183
20738 52183 182608 297254 255558 166244 147138 93673 103674 85466 85552 95910 149333 201376
20726 201376 236809 164745 83354 10834 18078 -8144 65565 86713 85531 86247 43534 77475
20714 77475 89926 22239 -94370 -63674 2252 18183 157411 182233 102652 111170 120593 109330
20702 109330 67206 36136 -29687 41432 38746 -44595 73526 150623 135027 75222 60011
20691 60011 87370 41224 -21672 72835 96304 35540 58799 46361 17041 19187 691 -16085
20679 -16085 39684 113897 84968 78637 74430 163199 163353 65999 87148 103969 65202 -13874
20667 -13874 -14428 -7264 -70514 -83876 -22758 -10257 28364 102040 103481 61967 93756 88181 97280
20654 97280 113634 85714 147946 153476 115383 44751 25407 74854 93422 71861 29075 21940
20642 21940 36915 -33707 -34017 -18728 35535 118692 163531 172243 158842 126853 134432 211290
20630 211290 169908 112841 44094 78003 56336 1296 -19757 -9764 -18444 16664 98524 162584
20618 162584 182588 86006 74979 60197 72871 39387 52794 202506 329083 517475 594648
20607 594648 438446 245750 160276 171739 170259 117456 164408 231593 280335 281143 212249 173169
20595 173169 197544 236959 186544 223525 266922 272727 219697 175697 191861 192292 216383 132194
20583 132194 173230 221626 314751 352945 335644 293278 252271 236299 242930 281127 398062
20572 398062 368365 311303 317897 284483 169865 239767 288117 309665 361857 393239 401165 275895
20560 275895 287633 311780 391099 402200 299477 286441 303098 265495 324816 363120 347861
20549 347861 308312 288850 362544 448514 400484 381369 460898 431797 451477 488453 509194
20538 509194 475689 463712 473998 535557 618321 663176 772965 953370 1026783 1036713 1045586
20527 1045586 1061186 1153779 1444519 1810845 2205291 2660176 3213226 3425640 3187678 2930440
20517 2930440 2839612 3041855 3273672 3261157 3098839 3042879 3023941 2878821 2876920 3176060
20507 3176060 3636092 4073517 4391358 4560847 4677634 5053526 5821370 6802219 7550916
20498 7550916 7843748 8097240 8704816 9817956 11399445 13482640 16360397 20458379 26235046
20489 26235046 34476249 46275584 64613406 96904581 154292619 245258931 348608179
20482 348608179 386690853 306333288 193184844 122283694 84015421 61573840 46770076
20475 46770076 35975060 28034477 22433221 18315647 15181117 12727735 10915863 9567321
20467 9567321 8562142 8010209 7803242 7662158 6977944 5947376 5140170 4564597 4130439
20458 4130439 3754447 3442898 3141614 2832821 2558481 2422034 2383788 2438063 2415627 2145583
20448 2145583 2068411 2221781 2635867 3127494 3304181 2826250 2124499 1615891 1302279 1188119
20438 1188119 1098768 978834 891764 842814 743185 763049 916927 972056 808884 739170 735248
20427 735248 749169 703700 714448 740054 693015 592390 370893 318701 323653 366149 412526
20416 412526 386198 362217 372847 324683 364362 300185 214151 195989 230736 277450 292582
20405 292582 254770 271906 281050 252960 194056 245750 282043 220387 171524 157646 183194 181308
20393 181308 190200 248563 305880 296022 242043 221434 169291 159511 177651 193904 175884 160310
20381 160310 142630 104288 105766 170279 45227 -27587 37355 115115 175747 152655 130295
20370 130295 195361 143405 104935 172098 246778 225695 224454 163937 118327 201188 156998 165663
20358 165663 208374 203056 360318 413448 315400 290584 241399 294374 312071 219343 191665
20347 191665 137066 74112 31415 114275 122584 149625 159222 103371 108107 74741 52598 20934
20335 20934 -25435 5836 24168 13857 -58108 -87138 -59493 57988 11546 -38691 27389
20324 27389 20358 2502 26043 39349 -6315 -21907 62155 94250 -1079 -99937 -121266 -139459
20312 -139459 -121428 21692 105194 44418 8245 -40867 40430 121476 159930 135414 46627
20301 46627 40474 18113 -17455 -72338 -63107 -8572 24064 69819 86236 175632 117943 10374
20289 10374 -34270 23402 277 -11066 -21561 29668 69849 155226 148129 178703 118339 79801
20277 79801 46676 -35845 23419 82313 77601 63168 80791 41142 59721 46672 61172 126402
20265 126402 135292 -24049 -79985 -49864 -8166 7928 -35438 -119015 -72124 -96549 -106198 -53290
20253 -53290 9713 73766 77356 107747 95447 25058 -25714 -103665 -104951 -130808 -128970 -87302
20241 -87302 -73888 -73282 -77844 -101214 -121079 -84449 66584 23183 -87988 -64314 -36773 -29712
20229 -29712 13378 1984 -21280 -77407 -99300 -65058 74835 141447 119727 111664 40482 17912
20217 17912 27579 -30786 -64758 -38057 -29260 7492 -23428 -40867 -112056 -171338 -70698 -29543
20205 -29543 71994 85445 85696 16647 -640 19586 18199 -44117 -17184 -34583 39759 89287
20193 89287 97983 55600 83544 117955 118462 130515 81459 63226 76158 79340 110452 69786
20181 69786 -15930 -28924 -54935 -132251 -185349 -88770 -105561 -49517 -56190 -46690 86721 119151
20169 119151 37446 -107010 -92817 -100097 -125004 -172008 -158233 -138038 -102164 -19830 72283
20158 72283 60837 -32981 -68100 -42661 -1395 66362 121638 69305 14566 51687 39159 -54256
20146 -54256 -101253 -36536 -51954 -83521 -104798 -17745 -7050 -15297 1860 -55232 -68594 -68959
20134 -68959 -63890 102110 165523 158604 71517 150870 178769 100970 -7909 -42500 -62744 -46971
20122 -46971 -96793 -111039 -80434 -129991 -133588 -98311 -60680 -526 43368 120366 97027 95010
20110 95010 17730 -14517 41196 133760 105871 81597 81990 122297 89967 18870 -4603 70846
20098 70846 135731 47309 8647 61096 46291 46405 -17009 -3500 14704 -24801 -58803 -63156
20086 -63156 -49654 -90109 -111694 14281 79373 49556 81732 88675 -25242 -41188 25590
20075 25590 51851 -51290 -91677 -51998 -42722 -79189 -10210 -111179 -70044 41117 57631
20064 57631 100887 132516 92614 -360 -51788 -20013 81756 45260 -15385 -72870 -90674
20053 -90674 -41127 3233 -18569 -18170 15934 28151 -35662 -85998 -42303 -64265 -77840 -46493
20041 -46493 -38357 -38405 -39330 27141 44473 6997 1421 -3821 29933 126815 173843 190706 188330
20028 188330 178228 145537 50699 40440 4775 -9519 -50964 -50113 -89026 -90044 -102433 -80696
20016 -80696 -70645 15133 117942 164522 197881 129372 106898 5313 -10639 -58251 -33802
20005 -33802 -20203 -12853 -4899 -71520 -79028 -49784 7574 23703 43678 99187 77640 66762
19993 66762 35070 14273 60270 52998 10131 -18071 -16847 46081 -1635 56892 18381 -75858
19981 -75858 -102727 -93154 -4906 -24250 45416 86243 105645 55685 68316 45329 -36892 -107344
19969 -107344 -80057 -72576 -43879 37097 96010 116548 87909 24815 -20692 -34996 -63689 -57225
19957 -57225 25022 -15849 -88619 -16369 27 -38694 -11827 64606 60650 7706 87324 27857
19945 27857 -14490 19602 79522 152605 120947 63032 60703 11848 70925 88042 164683 78941
19933 78941 7009 -4280 8725 -3213 44499 149946 214744 176141 81348 108108 181745
19922 181745 159820 177822 185878 202481 290028 397658 611239 794852 808569 733026 592515
19911 592515 465002 346982 255918 177804 211825 258605 235529 117978 94024 96961 85613
19900 85613 169812 286786 439372 585471 688816 791026 716262 529427 287582 158399
19890 158399 109163 149488 173114 169506 119036 5500 -55394 -11768 -12810 -40762 -57233 -64754
19878 -64754 1294 37367 34607 61368 62360 34618 59569 43359 598 42631 29716 -50277
19866 -50277 16797 84259 20854 13917 14434 -34464 -78614 -9154 -23052 -110612 -129565 -60280
19854 -60280 -12170 -12392 -74692 -94045 -102473 -95203 -20101 -96414 -179073 -77864 10980 -16576
19842 -16576 -78845 -120774 -28161 -14684 -27979 -12538 44440 93973 74110 118915 39999 -61112
19830 -61112 -97719 -135020 -243162 -216172 -95721 -87378 -68438 -29115 66987 36609 1887
19819 1887 13135 -37500 -64903 -14987 114115 114286 86988 -25110 -104714 -51868 -23943 67172
19807 67172 112282 31249 10088 -324 7300 -21658 -1868 1876 16182 98761 137248 137016
19795 137016 64630 -110293 -144620 -129380 -77318 -34711 84973 216088 225348 146745 104013
19784 104013 7565 -78734 -72688 -50623 -50562 -65471 11612 85985 148516 129658 189607 257916
19772 257916 302550 258821 180132 63341 15013 4586 -107932 -66337 31504 57474 68476
19761 68476 70071 61748 -52061 -79962 9215 88787 77579 91328 75956 33562 53371 60188
19749 60188 70633 87370 35360 24428 -8527 -34588 16867 47910 62666 62247 51017 95885
19737 95885 95389 12010 -56221 -8217 62998 62840 59025 95273 19740 -30772 -10437 -42413 -32681
19724 -32681 39311 84483 96460 42918 34558 84317 109849 137261 136227 90007 87171 126636
19712 126636 101270 60719 43138 -49803 -59212 -64772 -65681 -37680 -2667 -28322 -106473 -67019
19700 -67019 17461 55272 51312 60304 37814 22982 5038 2340 32814 22409 -4683 14998
19688 14998 -36427 -42160 -18726 -30770 -63545 -53258 -12731 -9645 -3172 -38016 -21052 -10962
19676 -10962 -28363 -67516 -146376 -185465 -163206 -159335 -137478 -82735 -182022 -210517 -123119 -136374
19664 -136374 -99590 -61358 -13488 4906 -38868 -30710 -44283 715 67490 70999 11414 61169
19652 61169 -58832 -163092 -159043 -101563 -16971 -852 -35557 -44886 -80084 -93454 -85333 -26468
19640 -26468 -20035 22555 37209 2162 -44169 -52507 -48258 -107541 -118280 -66030 12807 104610
19628 104610 163444 102847 74670 45403 99449 81137 26737 -37259 -110553 -68677 45312
19617 45312 80821 110757 113572 79360 48806 753 65021 97535 7932 -33249 -29893 -40131
19605 -40131 -72443 -84421 -32199 -10344 -63155 -128596 -99751 -95484 -79277 -79818 -110653 -50691
19593 -50691 34751 45977 24864 24134 123802 170185 122126 92862 168586 190082 74708 29327
19581 29327 -55167 -69046 -78669 -37433 53523 -59619 -108432 -105412 -83088 -85263 -128866 -110437
19569 -110437 -12420 16697 -35645 -18545 -20814 -33961 -12441 188603 212608 175781 106331
19558 106331 31382 46034 31074 47129 57553 50269 70408 1521 -23655 6176 -87800 -65051
19546 -65051 -50518 -41138 -7649 102245 66353 -17245 -24233 -79006 -64305 23445 -9591 -41656
19534 -41656 -81710 -41364 -4535 24899 77716 35008 -8434 18640 6043 21064 -65896 -74374
19522 -74374 -31874 -7376 -66308 -130699 -99189 -67403 -51018 -57481 -67682 -117775 -151533 -98622
19510 -98622 -79660 -67415 9820 34464 -21757 -55321 -70072 -16684 -61792 -48441 14042 125409
19498 125409 132905 111045 127928 121095 102226 94010 95698 16806 74712 152393 136215 89612
19486 89612 38805 -1348 13968 48930 52522 79217 57520 23506 -57130 26868 33762 64650
19474 64650 31357 3273 11202 72141 156321 115335 -20633 641 64112 69801 73962 97204
19462 97204 -2896 -19203 24582 -32023 -114877 -66515 36003 -32422 -86518 -54696 -51867
19451 -51867 -4880 -13259 27209 43428 -18053 -20946 -36834 -3910 51732 14988 -10330 32138
19439 32138 105469 7743 -42505 -13195 62442 98126 45997 -19515 -39150 35683 33864 -26854
19427 -26854 -43695 -35754 -5001 68789 19618 -34986 -126 -11430 17545 51317 -20993 -52816
19415 -52816 3502 -32892 -56687 -30081 38246 122732 107748 51525 41057 -20717 -51926 -46839
19403 -46839 -17773 -17130 43903 -713 -45171 -12877 7398 -72902 -66214 -3220 12062 6070
19391 6070 3829 -36063 -85639 -49688 9754 33764 52864 29942 -5057 -95118 -95331 -75309
19379 -75309 -37908 -37252 49051 152576 125133 111278 48550 -47304 78676 128509 59559 25307
19367 25307 -30442 -60500 32338 61057 36174 -4415 -21248 41787 126453 124594 122066 139674
19355 139674 137451 54366 -63098 -40416 55508 64431 56647 49634 16958 -20806 17394 17541
19343 17541 21218 -1815 -42756 -88052 -167247 -160109 -41516 -9499 -8805 24580 34093 7334
19331 7334 4914 34163 81813 27200 39359 56593 15990 -54857 -111136 -42547 -23516 11389
19319 11389 38920 32446 -23512 -54247 -95404 -138018 -68327 -39309 -43672 -2286 28032 53898
19307 53898 86963 94302 5672 40067 84250 101680 50998 24169 37102 -76827 -159009 -140106
19295 -140106 -162256 -164289 -151820 -174271 -104598 -5564 86270 54025 -3272 -55566 -76827 -71486
19283 -71486 -134202 -178167 -144114 -123916 -71385 -27060 19320 75074 28302 -57372 -74424 -108889
19271 -108889 -105236 -151670 -142877 -125146 -147317 -134123 -171409 -146588 -57997 -64030 -98419 -41782
19259 -41782 38693 -28346 -41377 -25933 -14765 -105147 -150361 -125730 -65776 -23175 -48692 -30994
19247 -30994 -71274 -164322 -166263 -57658 -15620 -60476 -34917 53698 106915 60754 9268 -25556
19235 -25556 72487 63999 -48856 -143770 -143184 -121416 -30562 -3158 1528 9001 -36368 -95624
19223 -95624 -90364 -70277 -12955 5696 -44254 -69262 -68753 16448 17840 19072 37077 45535 419
19210 419 28839 126871 136498 112953 35636 -229 -7278 -13316 29912 22547 -27282 -98072 -72374
19197 -72374 -88854 -113796 -80323 -56379 -11991 -14422 -11253 9892 -32672 717 -14345 -53544
19185 -53544 -31230 -7102 -80579 -35544 478 4939 12689 42729 73383 -10808 13334 -41777
19173 -41777 12475 53970 33664 -105111 -108042 -100911 -57208 -53285 -20185 -79109 -166187 -47368
19161 -47368 86592 81261 50022 72710 101105 120385 2416 -52411 26804 75060 76718 71280
19149 71280 10813 -25323 -53495 -59225 -132605 -200973 -94721 26768 56445 49457 2666 -5695
19137 -5695 50092 16248 66945 69775 49819 5906 -11034 -56078 -107606 -69891 -26614 -50392
19125 -50392 -44727 -57388 -6625 57961 58315 16018 59770 51166 62173 93742 27844 -86737
19113 -86737 -61504 -1540 6328 27356 74396 16331 -109226 -110265 -78733 -73805 -34392 37702
19101 37702 98062 100158 77867 41601 26243 -6360 -24983 -23496 -24970 -55345 -66528 5917
19089 5917 32129 -20622 -37788 -45097 8723 -120093 -199083 -239553 -219931 -116485 46540
19078 46540 36653 -52719 -50923 7641 27798 91313 -35185 -59466 -39104 -12833 34331 64485
19066 64485 101672 119216 78046 71560 48150 55042 5829 14844 -2064 -68248 -59684 10135
19054 10135 34660 24908 -25716 -21543 20940 -20804 -108639 -74230 7795 43893 99859 98057
19042 98057 16212 -34606 -61013 -79642 -20863 -61516 2261 102908 59407 -8398 -90910
19031 -90910 -99842 -56248 1487 84393 71770 39411 9920 25612 89307 55723 -149 -62266
19019 -62266 -50047 -57290 -31308 1649 -18573 -14803 -21092 -34623 -117564 -115055 -59456 -55307 -85761
19006 -85761 -19510 2896 -40878 -45122 -100390 -82157 -88090 -138742 -162149 -85391 -58135 -44689
18994 -44689 15203 -47947 -23660 64878 61744 18828 28657 61665 -48905 -171404 -84733 10861
18982 10861 92638 6419 16903 -26777 -149877 -165654 -80879 -124744 -114428 -96214 -106788
18971 -106788 -41529 27576 -43917 -18411 44495 96884 47421 -37988 -101718 -71773 -80125 -89345
18959 -89345 -45748 -1931 -7536 -10245 28971 25117 49809 25913 -22020 19835 15106 20546 84851
18946 84851 111855 153857 209653 225318 196682 109886 40668 9124 -87331 -88078 -72272 -128002
18934 -128002 -109830 -139939 -65835 -76909 -51004 -70594 -143775 -186953 -155175 -157069 -64026 45044
18922 45044 -42405 -77450 -45929 -103850 -122318 -181472 -143616 -137384 -81653 -1762 -51104 -119619
18910 -119619 -128587 -66532 -113927 -111778 -14563 59507 103363 99648 78357 71304 69350 69047 72720
18897 72720 32436 54094 -8893 -99881 -79405 -101557 -13637 37994 47292 104738 65225 822
18885 822 -43952 -44621 -41470 -69669 -36295 -33166 -16883 17400 -3378 -65627 -102896 -108114 -164368
18872 -164368 -92373 -37621 -14188 69478 -1376 -114433 -200415 -212378 -152209 -131819 -24402
18861 -24402 34552 53743 101473 121468 128317 21870 -50493 14564 71641 42387 53227 -81603
18849 -81603 -149765 -115280 -61321 46063 26494 -12901 -62110 -43609 -87490 -130816 -167365
18838 -167365 -106818 -44685 -32735 -82651 -51586 16316 110153 124838 59459 -23537 -69893
18827 -69893 -124780 -156756 -78011 -132831 -166413 -210160 -191077 -101766 -34284 -50478 -135335 -152877
18815 -152877 -39125 47259 105795 69947 25612 40287 52448 73833 55048 122443 113650
18804 113650 132905 145696 90783 48480 -15367 -37463 -12959 -4168 -1517 -33970 -121956 -232853
18792 -232853 -261404 -234335 -112075 88554 189117 44694 9147 33498 48390 48148 68264
18781 68264 88725 61676 5401 17875 69355 34645 43714 61639 24641 -55093 -130761 -119741
18769 -119741 -20807 22869 -637 43370 59369 26816 49056 38593 -6025 -33180 -30036 -3378
18757 -3378 13374 -16984 -17281 65496 77904 35193 -65868 -99093 -11355 29429 13064 -36910
18745 -36910 -111377 -103046 -128805 -147269 -152827 -136229 -124924 19923 92115 71382 -2270 -48256
18733 -48256 -111700 -140329 -192613 -114273 6388 12746 9812 -48574 -15889 -58722 -30851 7437
18721 7437 98366 55488 22810 -37655 -79742 31353 88700 86506 183430 168308 67402 17585
18709 17585 -16623 -43141 -81301 -70203 -49290 48726 37335 -107039 -54020 4974 48482
18698 48482 -7444 -87930 -57894 -47631 -55570 -20804 26123 94378 100427 105946 79696 78676
18686 78676 58878 41838 36731 43880 5524 -56297 -85655 -57778 -84903 -100482 -86226 -65352
18674 -65352 -55099 12216 92353 44349 -54736 -50163 -80885 -175579 -151580 -139775 -98696 -72467
18662 -72467 -97912 -60078 -50864 -71733 -77158 -128450 -115023 -24403 -2281 5721 -22180 -62552
18650 -62552 -62332 15100 54421 103506 139269 119549 110074 29578 -10581 -40974 -25471 -7276
18638 -7276 35996 85488 17960 4425 -2736 27565 9873 -14388 -28957 -57750 -47505 -96151
18626 -96151 -122760 -126678 -42712 -8091 -67423 -51135 -19451 -75915 -110483 -77620 36024 72945
18614 72945 145988 173577 125329 48131 -24761 -82114 -131200 -152886 -191016 -152489 -11280
18603 -11280 -8227 -61979 -48432 -10184 -1242 -109097 -188861 -205213 -161516 -74210 3508 -39908
18591 -39908 -121095 -193381 -115506 -84827 -116165 -117617 -64340 -30387 -69492 -21393 22052 67285
18579 67285 34317 -51119 -57098 -15818 -15738 -9974 6745 -16616 -70251 -59417 -77597 -108470 -98110
18566 -98110 -83693 -28224 -7082 -58926 -76734 -172798 -156403 -112892 -81037 -21028 28110 11244
18554 11244 6503 -15123 -50862 20020 10707 -12910 -83399 -102979 -128932 -169853 -162284 -107269
18542 -107269 -137549 -132082 41965 69114 35055 -15471 -73621 -53277 -57508 -95761 -60223 -24548
18530 -24548 -60970 -66382 -67492 -105545 -82698 -106742 -163497 -200695 -209380 -116692 -100670 -224083
18518 -224083 -219989 -190664 -137471 -45443 -8272 -28598 21350 60656 73125 62882 -994 -65509
18506 -65509 -113409 -74299 -41811 -14657 -47087 -51958 -6553 31926 58591 45469 22014 -14950
18494 -14950 -18545 -37872 -72616 -71431 -67783 -7367 -61125 -140311 -154958 -110253 -24116 6310
18482 6310 8140 -48792 -74421 -120621 -84200 -117259 -16376 -70026 -197198 -138583 -18287
18471 -18287 -22153 -91190 -32019 6723 -131437 -111136 -47019 -150090 -80035 -1037 46529
18460 46529 41593 -3669 77022 135777 145676 104095 142146 51957 30271 -23989 -81993 -89203
18448 -89203 -110762 -127677 -114426 -111333 -73250 -5451 33664 24454 -14428 -28729 -18323 -45114
18436 -45114 -48343 -62530 -27842 26271 64226 45952 -61235 -62572 -52850 -103336 -76661 -37401
18424 -37401 -102759 -63225 -17360 27600 67611 95767 49937 -14892 13934 50318 53666 36356
18412 36356 37676 19627 -10814 28191 134787 103785 74281 29458 -4754 -13936 30830 -13651
18400 -13651 -57885 -54151 -84454 -67989 -30442 4404 44659 4401 -44249 -23365 14029 13080
18388 13080 -29073 -79612 -144000 -148284 -126006 -102182 -118744 -118451 -28835 15961 53186 78697
18376 78697 32657 1929 -83626 -76509 -3655 86068 150513 48902 -5202 -11167 -37123 -72807
18364 -72807 -161241 -114108 -173173 -125460 -33406 5871 -6236 -39804 -11108 -3425 56515 113684
18352 113684 68532 -4175 28441 132001 115584 -27308 -47823 -22209 -43354 -51936 -7180
18341 -7180 -32906 -103910 11743 53420 70132 92809 2916 -39223 9395 -19154 61570 56038
18329 56038 17523 -6402 -9734 -52070 -122384 -171245 -81505 29933 53318 27604 -1325 -16067
18317 -16067 -24395 7347 58164 28966 17171 910 -21248 -12153 2968 4040 67079 160532
18305 160532 49403 -57189 -26768 17574 -53617 -74233 -63752 4347 20930 -26351 -19888
18294 -19888 47058 125640 161504 97207 -13555 43758 -53201 -200993 -211531 -92713 -76885
18283 -76885 -116823 -81717 -99984 -58340 37753 110134 79977 35176 17417 21747 -42410 -70210
18271 -70210 -59046 -20588 45718 -24751 -102334 -127674 -90764 -61669 18749 33986 34972 -9561
18259 -9561 -60221 -46546 -10585 -73809 -115647 -163737 -147605 -112020 -84506 -57544 -115736 -61742
18247 -61742 -32178 -17923 -25721 -69330 -58640 -24105 48013 49212 36704 45707 26654 -579
18235 -579 -100438 -97306 -21127 57960 142109 70174 -23411 -102013 -135714 -161008 -106491 -79939
18223 -79939 -95294 -123157 -91030 -22013 -9251 9379 11818 45614 107458 56250 48126 78783
18211 78783 139034 135410 165064 171585 142659 71205 -9228 -4883 16532 27460 -36155 -137591
18199 -137591 -128493 -174771 -263080 -140519 -25994 11539 5760 -34252 -52359 -21032 -14819 -46131
18187 -46131 -19097 -58045 -29651 36792 77926 22640 -82410 -116024 -55605 16414 108843
18176 108843 128273 40479 57768 95380 98763 51960 25005 -77274 -116205 -137090 -100146
18165 -100146 -115366 -102720 -145660 -158779 -93341 -70678 -59520 -92216 -142624 -110198 -101043 -64895
18153 -64895 15995 30205 3860 -29853 17835 2902 24118 47230 -7466 -140300 -91549
18142 -91549 -67172 -56187 -4646 -94976 -90565 -88211 -69823 22234 102448 136534 129524 63138
18130 63138 -19822 -9818 -12829 14534 -83923 -154639 -105621 -61330 115471 116953 63429 17473
18118 17473 51110 75014 13736 16224 -11847 -88474 -67368 -4860 80553 126900 67233 -56171
18106 -56171 -80724 -47679 -38147 63307 108846 94675 55680 -48711 -91427 -107511 -85733
18095 -85733 -133614 -127720 -74219 -66112 14707 37833 -39072 -1747 -7356 -17298 33112 60580
18083 60580 171539 194478 136475 70332 51388 66094 64273 77627 55304 33839 226 -12560
18071 -12560 15893 12349 16638 -14434 -69645 -145316 -76567 -52479 -46762 -124440 -196001 -200435
18059 -200435 -166081 -116804 -173870 -224632 -136953 -85579 -124542 -132244 -69490 -87190 -85604 14613
18047 14613 -7461 12800 -3934 7413 -66628 -126693 -942 9161 25918 19015 -46653 -48602
18035 -48602 -55780 -78330 22557 32716 -37657 -94313 -42234 -41677 -139886 -168621 -147155 -116917
18023 -116917 -111621 -60776 -58170 17126 58949 37666 -50030 -170307 -105939 -77936 -147983 -58985
18011 -58985 48297 36706 9094 53652 51542 -46257 -34098 -69356 -132076 -115332 -94412 -78778
17999 -78778 -56336 -75679 -84586 -70352 -63944 -85390 -22974 -58991 -100709 -79624 -147491 -189162
17987 -189162 -89768 -4423 -34725 -75988 -47299 -1440 45306 78041 40473 -28210 -55761
17976 -55761 -65433 -24964 5751 16709 47883 150845 170871 102215 -16958 -30626 -82288
17965 -82288 18469 82075 196564 281407 267210 170460 -9641 -27837 -37972 16622 50473
17954 50473 52177 52279 49527 95151 87272 -4259 -66231 -119021 -135801 -95911 -5512 14986 17502
17941 17502 -40249 -132067 -38556 -17960 39184 54150 83151 14290 -134369 -139874 -64350 -6047
17929 -6047 92772 55913 -67498 -100500 -47241 -102664 -128469 -20730 -12318 -55167 -43223 58959
17917 58959 57512 45521 76314 42498 48993 99118 29282 27758 144467 107039 56728 91088
17905 91088 131382 100335 101879 213473 135426 116876 148229 119244 75340 16112 21679 31063
17893 31063 61590 58552 64866 -2491 -116518 -71478 -89554 -57635 -10660 -70500 -96292 -40979
17881 -40979 -78621 -172149 -140291 -102059 -58803 12022 50108 59218 61420 113008 122280 91394
17869 91394 31000 27176 19472 110767 120846 30472 46949 -7123 -104046 -121108 -122005 -52014
17857 -52014 32815 44485 -38357 -164908 -146969 -149832 -185336 -202874 -187540 -66980 -64519 -82278
17845 -82278 -866 78917 70122 2331 -100222 -47990 51395 81618 1496 50234 106144 98051
17833 98051 69093 18271 -82645 -56929 -132491 -144421 -102608 -38106 -68559 -129985 -78052
17822 -78052 -74562 -36365 -21802 -106681 -202507 -209550 -175780 -86002 -69859 -28315 29107 19780
17810 19780 10951 68747 37765 -62670 -58140 47288 -8038 5434 44306 12548 43741 148013
17798 148013 160378 83712 59036 107697 168324 82103 -83894 -54615 -86578 -121897 -79888
17787 -79888 -35241 43681 78104 98685 77459 108644 96215 -23749 -56006 -83983 -80966 20167
17775 20167 105040 93770 80483 -20557 -12531 95538 144587 61440 35575 -40014 -8747
17764 -8747 102854 48398 -4247 -33772 -93938 -249775 -299142 -328778 -285190 -92295 -104503
17753 -104503 -123488 -58684 -65746 -19018 -8675 -86566 -32285 2118 8137 -19751 -17452 -49107
17741 -49107 -100489 -174532 -226608 -173685 -96587 9789 104737 102561 129389 113379 -5893
17730 -5893 -37389 -31492 -45914 -89822 -71213 -57261 -1171 -33401 -60791 13532 26687 -6053
17718 -6053 -77991 -56283 -40492 -73221 -37840 -12694 29277 5003 18667 5578 -67075 -114870
17706 -114870 -151897 -204165 -174267 -183892 -186358 -120258 -91674 -76222 -35238 -20108 -20364 -33957
17694 -33957 -93408 -111880 -161608 -114519 -37207 -47553 -116615 -117270 -133379 -124219 -123917 -147315 -210982
17681 -210982 -137699 12615 -777 -26325 -4413 -56621 -122221 -119972 -81520 -26888 -533
17670 -533 -25310 35506 74891 94814 53269 99413 84848 6330 -10945 -44948 -60853 -39869
17658 -39869 -31249 -122822 -164866 -143059 -93374 -170030 -137778 -61735 -55771 689 -22525 -104473
17646 -104473 -80038 -59779 -56121 -12467 34872 -28140 -62753 14872 43405 109993 72147 -96208
17634 -96208 -137193 -12240 44834 105431 116023 67559 78921 60024 37827 -13738 -18733 -29227
17622 -29227 -46686 -89549 -115421 -126639 -132918 -101560 -69109 -16183 50183 16164 -68380 -76562
17610 -76562 -132316 -164086 -83218 -79629 -110454 -92862 -101909 -81036 -97585 -133018 -142187 -45065
17598 -45065 -6318 51419 -62856 -108395 -40750 -116788 -164052 -129883 -120070 -144888 -147299 -106345
17586 -106345 -68397 -24471 -59797 -52270 -9059 -12206 -8884 -72500 -99381 -84036 -43218 -27896
17574 -27896 14072 36086 -7590 -58222 -51482 -72377 -9827 20277 80587 82021 54184 21639
17562 21639 -806 -26033 23505 159632 110762 132611 119952 61288 42864 59280 -10909
17551 -10909 -52639 -107868 -41598 -454 -39966 -153 48041 28320 46709 100515 135239 152865
17539 152865 177047 94494 23251 -63683 -9777 62354 59325 32942 53878 125903 119360 13058
17527 13058 -76712 -62100 -67537 -52606 -40462 -6702 26370 -15132 32951 55161 19262 -70781
17515 -70781 -85472 -68578 -112007 -71528 23288 36707 35743 8261 79698 111998 17122 -33981
17503 -33981 -42298 -57605 -80608 -61296 -26908 20747 39261 -48437 -120522 -107003 -37869 -56887
17491 -56887 -75949 -19116 15635 -53717 -143233 -168203 -230298 -191815 -124565 -66200 -90664 -60579
17479 -60579 1025 56542 8483 -146660 -189304 -99119 -60535 -116031 -181938 -193881 -48898
17468 -48898 16400 22104 19120 9563 -8945 -43645 31329 1712 1850 48257 24018 23074 91427
17455 91427 80583 69401 57792 58262 47517 -21784 -11229 -51721 6570 -7490 -57860 -53766
17443 -53766 69781 75880 -36334 -94691 -18457 86258 27003 40827 54974 97090 63599
17432 63599 54127 92303 46850 -44343 -116814 -166100 -165705 -145359 -124209 -35265 16265 47310
17420 47310 13683 25444 81715 11156 -106347 -185844 -141572 -139407 -111499 -70450 -44392 15092
17408 15092 43260 73380 55916 -108630 -102858 -57491 68211 95091 -5584 -22672 -40247
17397 -40247 -55135 -15527 33492 -46879 -87872 -80389 -74188 -87872 -125629 -121863 -138142 -170788
17385 -170788 -149671 -70528 -56909 -47540 -80137 -51475 -38806 -43261 -6624 -26810 -34719 -26164
17373 -26164 -12341 -11914 -96612 -130966 -138116 -89788 -65177 -73254 -51019 -103815 -146215 -52724
17361 -52724 -92012 -93141 -40920 -100403 -96939 -120126 -157832 -159744 -81324 -10034 60733 42726
17349 42726 66725 25980 -32427 -42324 -28996 -40577 -100177 -115421 -101294 -97022 -74892 -22554
17337 -22554 -60394 -128358 -82975 -46497 -83237 -118773 -88452 -4311 46856 21936 95810 139171
17325 139171 173985 88335 70267 75515 113645 177131 132710 58398 -64445 -144883 -110852
17314 -110852 -47448 -56861 -47097 -100907 -105901 9474 19368 -39287 -105542 -109232 -85256 -34798
17302 -34798 -23371 -144395 -61652 69072 81093 67436 41568 73596 95596 75556 71390
17291 71390 96919 121682 104500 96373 53882 54092 56559 -61020 -39457 11194 62021 44530
17279 44530 24877 -26532 -59766 -70316 -115784 -98943 -158504 -77843 -2424 -13309 -72669 -90406
17267 -90406 -192458 -242949 -207196 -195921 -69338 -44692 -53501 -100473 -158446 -193571 -188758 -125442
17255 -125442 -119501 -145666 -36629 29204 51378 42316 -50149 -106480 -211826 -167220 -74230
17244 -74230 -82302 -163638 -177968 -134365 -115890 -145195 -109498 -127634 -167812 -166242 12848 133650
17232 133650 53868 -5999 -8712 -45171 -74675 882 -1632 8985 -48382 -58356 -52631 -71249
17220 -71249 -95074 -41729 -44323 -88942 -99504 18773 92085 81929 24597 24415 21060 67347
17208 67347 40670 -19662 34183 74474 68919 127793 129391 159971 81062 -1820 -21324 -25011
17196 -25011 29538 65859 35844 36738 13962 -17593 -3140 -49557 -30018 1313 108548 196618
17184 196618 83978 15691 -454 98932 182989 168130 55228 13358 48402 19631 2754
17173 2754 81652 83213 95796 108491 96604 24655 -114874 -121199 -122612 -125741 -87986 -76329
17161 -76329 -169915 -164225 -133836 -101441 -91194 -49731 -51272 -137810 -111695 -97986 -91068 -92217
17149 -92217 -98754 -154839 -158520 -98808 -99394 -58503 -54436 -72267 -47882 -44749 -43165 15733 99281
17136 99281 67923 -80592 -61124 84476 153920 107862 32935 10134 14877 10776 9556 20481
17124 20481 38612 -9909 -93280 -135908 -56617 -11039 -55977 -27714 -35766 -71699 -53761 -14110
17112 -14110 15049 29594 39054 -13153 -73208 -167410 -210803 -133077 -15402 -6980 -13211 8544
17100 8544 100241 -12030 -152125 -134999 -207499 -192129 -115614 -105345 -96137 -34574 876 -515
17088 -515 24268 63966 65943 82877 53362 61997 -5420 -42355 -127923 -223999 -146484 -76026
17076 -76026 -85129 -48330 -9712 -92557 -143692 -146760 -192332 -144528 -99141 -58924 -67067 25324
17064 25324 41418 -93584 -104166 -16209 -26525 44449 24762 -60374 -15685 19619 -26938
17053 -26938 -44959 -47033 -43721 -44854 65412 60010 -4482 -58365 -3452 12906 -100803 -103018
17041 -103018 -145541 -145375 -121896 -129504 -65928 -42140 -94701 -72196 -88066 -89090 -80165 -64901
17029 -64901 -113067 -60915 -41083 -64315 -54439 5573 33665 21084 108677 77850 -72756 -90799
17017 -90799 -74470 -125761 -107580 -64059 -103173 -86153 -112282 -99854 -34649 -56003 -61430 8903
17005 8903 33115 -9196 -22242 47651 15357 -38030 -25650 -102891 -106628 -75737 -113330 -77744
16993 -77744 -89865 -108055 -143070 -104317 -76322 -118188 -174964 -67270 -10805 -53433 -57436 -66679
16981 -66679 -48998 -35308 -97972 -27151 -22032 -63628 -95094 -192900 -226511 -181006 -48381 -5347
16969 -5347 7873 7972 6724 -6380 1701 -11938 -87759 -105714 -103745 -137653 -128164 -100645 -16981
16956 -16981 5040 22219 -3644 -28736 -83908 -58069 41658 87871 17400 4908 54644 -43532
16944 -43532 -95376 -124525 -214982 -200855 -70141 -37139 -55209 31285 133339 10567 -61167
16933 -61167 -14661 -1564 -14830 -2643 -26013 -37961 -118646 -212789 -118995 54663 81015
16922 81015 25489 -84838 -56178 -61185 -37576 -9973 21855 6154 -42959 -35380 -42161 -52057
16910 -52057 -93817 -72763 -114581 -38694 26920 82069 86586 -19633 -113751 -130953 -145866 -146543
16898 -146543 -95874 -136683 -186545 -126439 -42302 -53063 -34937 -56367 -53799 -54120 13728 82105
16886 82105 187487 193272 170724 112792 164645 124147 120477 93944 -51373 -88828 -6681 33464
16874 33464 -68748 -112037 -82039 -35106 2862 7019 40718 63601 49500 3210 67498 143059
16862 143059 92190 -3267 -62109 -110982 -11688 30453 60024 68054 59207 13820 7808 77227
16850 77227 100841 93230 10954 -47426 -109388 -23335 27069 -49662 -67134 -53117 5975 18552
16838 18552 14459 -14013 9213 -272 21365 -25691 -28918 27160 57779 -8425 250 -15440
16826 -15440 17225 -3384 -62881 -103361 -106088 -75183 -3067 -12992 -73546 -88429 -54475 9318
16814 9318 17891 39177 102 20935 -13976 -81245 -84743 12982 84393 103727 6203 -52066
16802 -52066 -48152 6204 -56202 -67363 -75594 -105419 -73250 -81269 -150544 -149369 -120832 -135674
16790 -135674 -125695 -36992 3665 -65543 -51451 5481 -1864 -29559 7433 7129 30450 38056
16778 38056 75393 21646 -14370 83740 87487 -26901 -4092 -51726 70849 121899 43331
16767 43331 107637 98996 59620 36170 45972 108778 104235 38500 25891 23720 41297 69522
16755 69522 80606 27742 44697 76504 43533 1694 -33311 -90069 -142868 -79900 -96813 -73375
16743 -73375 -150718 -119729 -79082 -123768 -99836 -21847 23754 -18807 -42685 19907 44406 34004
16731 34004 23768 -45478 -60791 -17032 -70950 -124478 -75475 -36488 -77172 -122148 -160599 -150511
16719 -150511 -36409 69752 101010 105584 -615 -107179 -89116 -98930 -65729 -63272 -86087
16708 -86087 -113017 -95661 -35428 85520 114911 38357 -34257 -50560 -59213 -55681 -70681 -88891
16696 -88891 -77973 -38484 -77538 23999 41754 47871 22967 3205 20945 59714 38465 66618
16684 66618 88548 13592 -101433 -196436 -202845 -170124 -168835 -111070 -59607 -92157 -190966 -175247
16672 -175247 -78230 -142717 -158096 -67948 -115681 -148924 -69158 -21466 -19305 -53881 -71136 -76796
16660 -76796 -69252 -168104 -205106 -244751 -195098 -151343 -144634 -143921 -173466 -208842 -250104 -240817 -226246
16647 -226246 -197482 -191349 -97752 -92900 -36674 89644 109737 72768 44931 20667 -10274 -57496
16635 -57496 -31718 -13551 -15170 20927 -2364 5640 -13642 -113199 -134798 -39599 14450 24027
16623 24027 -54070 -117720 -77112 31412 58325 4195 -113966 -197258 -218647 -202653 -158471
16612 -158471 -57494 61769 115864 68876 33426 51530 33960 -12844 26927 63377 63578
16601 63578 47100 -7343 -14385 25440 94245 79692 29146 -33505 -65515 -34973 -8622 -9788
16589 -9788 10075 -27828 -52964 -73671 -49432 -4854 12630 37756 24158 -39723 -34772 -92711
16577 -92711 -144602 -141492 -101547 -72143 -16381 8250 21221 -66600 -81323 -6078 14069 49836
16565 49836 13453 -62238 -72658 -23534 -16426 75747 98014 -37823 -17144 7454 56220 9814
16553 9814 -39533 -64494 -82994 -97009 -96592 -117970 -137249 -152677 -107537 -96161 -88056 -33655
16541 -33655 -14779 41491 85391 -2191 3317 58779 32632 -38233 16249 11320 -11048 9712
16529 9712 -18156 -25693 51583 31842 32186 33669 25803 30246 56478 -8301 14171 18503 -10329
16516 -10329 25659 49113 -9841 -65178 -41382 -69903 -54079 -75406 -64066 -34346 -4238 7597
16504 7597 -85079 -145794 -127454 -89660 -89044 -133523 -93534 -49188 -20860 -56638 -48155 48333
16492 48333 72996 26586 21261 -36135 -70889 -35218 22181 -51016 18266 21256 -33052 -76355
16480 -76355 -31743 -43562 -117760 -74055 -36620 -47155 -80493 9817 20573 -59241 -61686 -148368
16468 -148368 -217059 -134097 14272 4710 -13294 -22794 -3063 -21159 20430 52163 38413 -28178
16456 -28178 63403 61278 27913 31781 -21319 -16155 -26071 43348 77407 26898 90088 54614
16444 54614 -1143 -36160 -26620 -7879 -12235 -31077 -4391 -45928 -125861 -141305 -138819 -64886
16432 -64886 16047 8193 -21714 -45861 -40807 15492 4445 -30895 -9934 -64925 -103061 -58810
16420 -58810 -22012 -1562 29913 7316 37519 60896 82892 -7392 -10288 47002 6135 18640
16408 18640 24228 -34005 -65611 -25283 -70013 -52293 -69377 -37399 -87481 -116765 -100730 -99917
16396 -99917 -89796 -39710 -46670 -185004 -236917 -184984 -111310 -47515 -39926 -51874 -56484 -153485
16384 -153485 -105141 -34868 16190 15225 -62149 -36653 -15643 -17397 37318 58877 126888 136690
16372 136690 97619 -12419 -73934 -70938 -43354 -63823 -100792 -45712 -54352 -130674 -153795 -120498
16360 -120498 -54834 -97515 -110732 -105901 -103190 -92547 -88020 -60389 -59320 -14132 56090 21221
16348 21221 -6545 -44211 -123461 -124977 -120578 -103446 -27045 9957 -11601 60745 60416 -1393
16336 -1393 -68278 -44799 -49678 -33904 -10849 807 -24431 -40346 -12783 45854 43974 30285
16324 30285 12407 31021 27871 52717 -20710 31145 12109 1504 12030 93883 115935 70854
16312 70854 8386 5577 -22963 -54877 -119991 -133781 -138923 -79479 -46647 -103438 -162886 -69022
16300 -69022 -78993 -50963 -34861 -33781 -60299 -39660 24071 22932 -37084 -85745 -167551 -253505
16288 -253505 -202086 -91049 -27095 1834 29417 -33815 -9432 19092 79820 118434 148962
16277 148962 146399 161507 158495 89465 63212 57272 108272 111286 94018 31821 -8920 -9609 -69494
16264 -69494 -79760 -58322 -104918 -130993 -129305 -92422 -99872 -131326 -123985 -29454 6679 -30861
16252 -30861 -19132 107770 213104 178417 134799 14024 -30531 78346 55036 20516 90804
16241 90804 56435 91177 41902 -1749 4269 -48421 -37605 -97963 -101143 -116985 -113123 -19840
16229 -19840 81569 81947 36871 55974 14756 45586 90205 106256 76060 72659 17052 -13762
16217 -13762 -5065 -40790 -65830 -65110 -122038 -101452 -97868 -67543 -7242 -25042 26122 25182 -3611
16204 -3611 36865 -37377 -93004 -53660 72311 99107 42886 11954 43708 23295 -1744 -108703
16192 -108703 -211607 -93076 4847 -3018 -63101 -88608 -127659 -99115 -83195 -10659 24542
16181 24542 13556 -44724 -81696 -124283 -94686 -57580 -39891 -95329 -97839 -82762 -60154 -39583
16169 -39583 -5022 33749 62665 25174 64083 36300 -43887 -53764 -99209 -80978 -44577 -12147
16157 -12147 8175 29390 51845 -23654 -118452 -8683 43503 -28762 -121815 -79962 -2174
16146 -2174 66190 49213 11556 -38996 -59361 -52440 -74750 -36752 35643 1560 -33890 -80245
16134 -80245 -115856 -130863 -116439 -67521 -19823 -46736 -62274 -2419 -34814 -87337 -106265 -43998
16122 -43998 38064 63143 95728 117215 138769 122701 32370 -47184 -99950 -112963 -135002 -18594
16110 -18594 -21100 -90866 1581 -14144 -27232 48624 43836 -14694 5226 133188 132367 55958
16098 55958 -43509 -85751 -60053 -23349 -5433 -27840 -13078 47432 107926 76518 68238 93595
16086 93595 9813 -21452 -66453 -113219 -148157 -101092 -78557 -88758 -64022 -82632 -18472 -8977
16074 -8977 -39579 -24023 -11578 34399 101904 175369 72797 15880 30186 -81969 -120224
16063 -120224 -94230 35383 -5577 -30203 -22515 5119 -35726 37489 134104 65169 24562
16052 24562 1669 -79950 -162500 -126694 -135635 -104425 -29676 -43934 -72037 -42945 -28731 3012
16040 3012 12732 -73764 -47175 79602 108995 -92925 -132883 -72136 2764 -7785 23817 -961
16028 -961 -12210 13520 19997 -11854 -25342 -42731 -24700 -70468 -54615 -71794 -144579 -96600
16016 -96600 -18367 49710 93094 -31360 -42137 -15676 -32098 -96279 -119217 -79499 -24122
16005 -24122 14353 19487 -10047 -19873 -88446 -116222 -126333 -141247 -57596 -37991 -9724 -27930
15993 -27930 -77804 -122006 -132706 -131936 -57529 -32133 -14375 12508 -26510 -127518 -133689 -59483
15981 -59483 19751 84865 117124 117518 55719 -8626 15027 -79977 -166654 -91974 2006 39193
15969 39193 5523 -15930 -83840 -47465 10242 -35952 -24918 -2982 17259 33376 -19474 -55975
15957 -55975 -41265 36556 62039 -69652 -143303 -45783 -45567 -10822 105516 181910 106562 3713
15945 3713 -42823 -65711 -48520 -32492 -69807 -100866 -54770 -41757 -46515 -46142 -23179 -103063
15933 -103063 -88535 6892 103263 116743 174645 179065 97016 63420 8645 -13580 -14087 40315
15921 40315 68227 -34715 -78476 -22577 8526 10345 -4753 52637 75784 109999 85211 47863
15909 47863 59240 -12149 -37589 1708 50329 108517 71773 34538 18070 30648 43413 -5004
15897 -5004 26988 62622 104877 61654 -6489 20169 -108878 -172379 -50834 17459 37866
15886 37866 67648 68152 107185 71976 -61651 -156119 -258671 -212863 -135046 -140867 -91264 -105133
15874 -105133 -106260 -138169 -148465 -58724 -26904 -61032 -128082 -199631 -198258 -137901 -83749 -84028
15862 -84028 -48996 -89101 -63918 -20559 -9312 -15928 12422 29306 10882 58451 14795 -40176
15850 -40176 -77814 -60449 -43686 -42600 -3937 80570 29577 2125 9786 -36259 -34842 -43426
15838 -43426 -30737 6350 -27483 -86334 -104303 -86735 -111640 -120281 -82063 -26135 -34332 -38571
15826 -38571 -45964 -43050 -28620 94870 183181 87790 23799 -54351 -46228 -108608 -93888 -36248
15814 -36248 39114 -10959 -17229 -32006 29738 49414 63561 56884 28479 -2279 -74505 -102343
15802 -102343 -157082 -165780 -135659 -57115 -8478 50631 103371 95753 -62753 -100430 -76836 -102118
15790 -102118 -153356 -98183 -84241 -57549 3381 1399 56964 53507 -121045 -218376 -215957 -140923
15778 -140923 -140421 -94367 -70051 -28712 6393 44905 77795 17235 -16183 -38941 -76220 15174
15766 15174 30369 44564 -21966 -136994 -146057 -58775 5693 43220 -44542 -95312 -50753 -43827
15754 -43827 25778 122160 98113 -7903 -63183 -47802 -125826 -151683 -108529 -148225 -185541
15743 -185541 -128870 -33174 -19891 -45843 -81975 -102159 -75095 -74270 -40115 -27679 -51015 -102816
15731 -102816 -123775 -10129 -25516 -84514 -66226 -68911 -55162 4641 102673 17911 -135625
15720 -135625 -218000 -186497 -145999 -69008 -49851 -27200 -46219 1297 1973 20541 51127 57101
15708 57101 20803 -9344 -36544 -57089 -27252 -88697 -161446 -164123 -198885 -180761 -193389 -149378
15696 -149378 -5843 34118 50969 -26400 -56610 -103169 -118030 -125034 -2569 77552 18673
15685 18673 -51323 -44944 -20574 -63543 1959 86464 46728 -26789 -60923 -104255 -89703 -120750
15673 -120750 -116781 -176359 -157778 -101050 -113108 -128358 -102296 -59146 7886 -3396 -51250 -63839
15661 -63839 -65471 5979 -8221 -61925 27704 53893 -43391 -14727 39043 67007 -9915 -19756
15649 -19756 -36033 9759 57935 44206 21552 18914 -29963 -52238 -117354 -68904 -22142 -87278
15637 -87278 -93978 -109526 -137474 -82324 -4417 1155 5210 -6491 64153 86372 82823 42260
15625 42260 15134 55849 26265 -27575 -51616 -111242 -64295 -2885 12923 56955 95127 101496
15613 101496 80701 12909 5116 17497 124119 88669 -2826 -26867 -28747 -97073 -8951 70322
15601 70322 64188 14392 20016 55121 3874 -88779 -111937 -110454 -54910 -21323 9737 -28573
15589 -28573 -43967 -82913 -125242 -74793 -25976 -86134 -75575 10591 60023 27287 9228 -3881
15577 -3881 75636 163105 215756 164990 125530 109872 105945 134597 92566 88479 93850 56728
15565 56728 24302 93978 55017 65221 45456 6345 -66952 -120369 -85425 -40378 -24465 2786
15553 2786 -57969 -30399 -53208 -37567 -149959 -88970 -31270 13424 9344 -41578 -43135 -809
15541 -809 50848 91446 126178 127018 42722 -2919 10211 -10475 -28875 9527 85595 58711
15529 58711 -2626 -87112 -99694 -64601 -106068 -185979 -150704 -114208 -164590 -116589 -28519 -30199
15517 -30199 -91055 -52963 -95228 -100555 11073 44324 6355 -7340 -72027 -102769 -19523 70620
15505 70620 104994 13829 -43163 19942 40057 22218 -44289 9613 42214 -3916 -45665 -46254
15493 -46254 -40037 -71170 -27312 -58236 -96554 -102154 -50812 -26542 11594 19028 -51727 -55704
15481 -55704 -142271 -152583 -139822 -103084 -39483 -52516 -81459 -34242 -8689 19011 -33613 -98152
15469 -98152 -86352 -69367 -74689 1944 49684 61646 50989 -77821 -85366 -112159 -156352 -180707
15457 -180707 -143407 -177127 -145766 -111202 -46562 65138 27841 32188 50484 46242 50032 31267
15445 31267 69346 69442 36311 16287 36824 123826 97378 66133 1436 13809 3564 112012
15433 112012 148603 52224 5448 -218 69846 84802 37631 -17855 -90270 -60173 -12371 -34587
15421 -34587 29516 70306 50196 19647 81238 59848 82299 51507 -37953 -82383 -36698 -542
15409 -542 15497 72595 21862 -23487 -26316 15552 -5855 -115933 -85828 -72864 -55007 -82005
15397 -82005 -42715 -39350 24849 44417 21185 11975 -101816 -156471 -97263 -130936 -61021 16924
15385 16924 47814 16625 -11881 63279 81863 41783 -5385 -107618 -198032 -243447 -262293
15374 -262293 -217764 -231579 -189467 -128600 -83492 -30260 41332 90794 47184 -45024 -90389
15363 -90389 -130680 -200249 -125677 -74249 -133240 -80527 -15794 969 -51145 -32486 126821
15352 126821 138539 54118 88319 113863 51071 9994 17706 51691 14887 30494 135588
15341 135588 159903 125784 70103 61018 61945 -7113 -19974 -51467 -120034 -197470 -148737 -58052
15329 -58052 -60149 51387 83157 47043 45219 17015 52579 121440 100177 -11081 18253 62996
15317 62996 -17384 26231 24264 -5459 -55222 -48326 59540 48651 75529 72602 17764 49430
15305 49430 35012 45475 88382 82005 118719 62950 -8761 -45020 19805 32238 41239 -8832
15293 -8832 -82295 -46014 -78749 -92154 -80584 -45848 7937 -8878 -1105 38001 69693 297
15281 297 -52039 -38569 -14195 50932 92092 19056 -45615 -51206 4986 -84166 -105583 -100408
15269 -100408 24293 75563 -8198 -24465 -35148 -70021 9818 327 38635 64273 28649
15258 28649 14295 103214 59160 23115 -111679 -174146 -101287 -64104 -31936 -11870 -3013 10602
15246 10602 -30826 -69053 -62219 22640 -21030 -93320 -131392 -121147 -146014 -198370 -163309 -109090
15234 -109090 -49233 -36907 -26318 -82300 -156572 -167105 -107579 -32204 8311 89544 77904
15223 77904 767 27043 24337 89986 80271 54986 17860 27820 34655 -9791 24707 -10442
15211 -10442 -31683 22849 102918 134438 105966 15044 -17810 -78856 -69379 -65261 -64369 -50473
15199 -50473 -10820 -62540 -83329 -41089 13024 -45653 -51798 47825 59317 70354 128853 74832
15187 74832 53993 74454 91728 13874 -60298 4768 82867 75312 -14317 -102842 -72272 9386
15175 9386 -17086 -6974 32676 24840 -47757 -101147 -55110 -41724 -63559 -76232 -91167 -38345
15163 -38345 2108 -35499 -64168 39073 44417 -34691 -107277 -73742 -84621 -58319 -25189 20994
15151 20994 -8755 -25211 13187 92418 70735 131941 57578 -28229 -77786 -13536 53312 65804
15139 65804 34386 -37690 -18346 -38269 -59752 -77381 -10457 -22719 -54521 -117968 -65231 71340
15127 71340 146600 170827 61843 -8174 -80754 -101483 -92462 -110138 -13723 13630 7175 -14108
15115 -14108 -38870 -91604 -73643 -23557 -18535 -49452 -1012 65708 3345 -75221 -76531 -80503
15103 -80503 -65721 3224 -6567 -46800 -69231 -42508 -21560 -21539 -65991 -120279 -130579 -109076
15091 -109076 -39752 -28127 -82381 -87345 -90161 -46629 -52528 -52613 -20932 29059 71240 68044 58405
15078 58405 43938 18026 64875 51156 11412 26736 56510 72678 8786 -79774 31 35235
15066 35235 81738 14214 51425 12763 -44114 -9609 -28128 -40242 -25011 -39048 -71574 -79444
15054 -79444 79401 171387 100456 -3325 -41343 -30844 12379 62259 63811 70173 123802 170987
15042 170987 97155 76010 97605 11344 -6652 41023 44657 -17164 -31921 49195 35610 32835
15030 32835 33742 -4526 -28558 -68841 -60659 -75989 -134281 -103721 -86423 -62609 -26365 32257
15018 32257 29923 1376 -29414 9369 698 -11117 37463 67013 62627 716 15983 -69294
15006 -69294 -82351 -101082 -132684 -150489 -14675 -7196 -24745 -27968 -24479 32255 83894 28249
14994 28249 26216 87273 94846 33482 15272 -17733 -10557 -10556 12082 13796 -20852 -32217 47187
14981 47187 115651 -4092 -120749 -107782 -75360 -79973 -24425 42926 105386 93011 125192
14970 125192 97133 98033 93437 -4657 -34573 -67661 32892 72071 16960 25541 66041 54279
14958 54279 45355 138436 76380 44636 -2820 6011 66184 84804 112440 140486 175685 97096
14946 97096 48760 -6931 -136457 -171786 -161704 -162238 -108906 -54619 28502 125682 152873 86060
14934 86060 87150 -47566 -139431 -66249 -31779 30517 123510 174402 143308 112891 -25096
14923 -25096 -2149 100247 73079 -40765 -61649 -59174 2362 50348 18645 33108 11980
14912 11980 -43220 -3798 -30564 -14440 -7666 2550 7762 70352 58284 -24319 -14999 -74511
14900 -74511 -94185 -96867 -102437 -29516 -31406 -16029 -35713 -140320 -216444 -219661 -72088 -27696
14888 -27696 -59616 -4642 -9709 -40638 56859 114495 108344 18714 -15293 -32143 -83607 -138948
14876 -138948 -133822 -144257 -132073 -74750 61775 59749 13051 -16154 -110383 -149299 -119432 -67774
14864 -67774 14613 45128 -74772 -95967 -41054 52279 29784 -22325 -42477 -49868 -30288 -22201
14852 -22201 23513 -2996 30601 35526 7906 21384 17304 35355 -18271 -56046 -79569 -12916
14840 -12916 51785 12400 40600 79642 71673 88454 53914 112987 90676 15799 32927 42614
14828 42614 25060 -19774 -11379 -18321 33942 60481 38106 -92078 -98751 -54256 -72377 -160424
14816 -160424 -165331 -189151 -103025 -55786 -96821 -164816 -144164 -47416 -15397 -11578 13057 59509
14804 59509 122985 118986 28855 28564 98853 17058 -134606 -177839 -138436 -16028 29042 -50636
14792 -50636 -48909 -82204 -40768 -21251 -64639 -116084 -27551 -43854 -124423 -90091 -68574 -80924
14780 -80924 -21577 -40949 -36369 -2410 60199 27040 -21 -31566 -78664 -72416 -81573 -85755
14768 -85755 -75206 38522 93648 52823 68728 57951 34538 40625 -21370 -30570 25149 31328
14756 31328 45718 89911 60605 82230 26692 25011 7488 55685 62865 -23905 -63107 -52087
14744 -52087 -3066 56813 54805 43491 81864 74962 40419 83763 86530 18121 -49222 -30463
14732 -30463 -60586 -78937 -19905 -30423 -21315 -28241 -8780 5372 85781 132517 -14868 -96181
14720 -96181 -36813 -32597 3536 77300 159869 128856 104033 123852 -8076 -56601 -64973 -78273
14708 -78273 -92033 -60030 -80224 -102303 -61160 59050 55747 53558 40435 49608 90392 30420
14696 30420 -882 26385 -47137 -62453 38890 124808 65908 -10315 10351 84079 144708
14685 144708 82519 42005 2253 8478 -2516 -18346 26126 54826 -10790 -23072 -16343 -57731
14673 -57731 -156170 -206967 -240767 -177950 -91214 8769 44485 -19784 -63494 -91641 -3902 17965
14661 17965 -38563 -39641 -30196 -64687 -110318 -48838 56989 104862 114911 78500 47805 883
14649 883 -63983 -21383 26116 -11113 10893 25181 74088 60693 40332 21214 81009 75746
14637 75746 -17829 -37234 -50144 -35104 -66834 -74902 -12204 -37343 -64176 -15110 27348 5854
14625 5854 -68762 -177221 -132830 -66386 5891 -23112 -69707 -62488 -4920 35702 40755 -9843
14613 -9843 42748 115902 136563 43154 -27703 -71330 -79961 -75151 -86270 9292 103173 77797
14601 77797 -8828 -31425 -99198 -171916 -164900 -141466 -19817 -75302 -144690 -47044 11596 -32598
14589 -32598 -107433 -150438 -180535 -121416 -20867 29164 27232 13859 -38878 -174355 -175012 -108977
14577 -108977 -17435 -520 17674 11201 -3204 -109381 -165617 -161743 -132129 -81262 -80155 -3875
14565 -3875 933 -10756 11974 84540 139478 59564 3399 34337 -4571 -2069 49751 53523
14553 53523 27813 -5751 46733 23623 -63799 -45140 -41768 -9371 -67098 -37892 -7611 -57123
14541 -57123 -142167 -181502 -155414 -123958 -110482 -72615 -77031 -97171 -127543 -38180 20243 83255
14529 83255 33542 -68890 -64196 -102443 -44504 12670 19540 -16132 -76949 -109347 -65135 3397
14517 3397 51771 25826 71782 32599 -37254 -89894 -137074 -150206 -86650 -37296 9097 -13768
14505 -13768 35264 -3309 -28445 -24724 -27670 -3103 -29259 -5716 27259 88332 35775 11086
14493 11086 -103127 -178994 -200545 -137371 -109044 -105053 -68127 122 9372 33136 36867 1186
14481 1186 -46132 -45219 -59392 -81248 -29483 23494 24688 -4735 -39629 -1367 -62822 -149976
14469 -149976 -179147 -101268 -129882 -146527 -100539 -102449 -125476 -131419 -61574 -76268 -26357 11754
14457 11754 -12926 -2542 -66361 -100549 -132127 -73683 -40061 -81302 -48504 -767 65101 104525
14445 104525 76741 126747 132863 1388 -59821 44307 76857 891 26842 101561 69430
14434 69430 102651 181087 174978 63019 -15336 -24015 48712 82517 46117 -12536 -11678 -7198
14422 -7198 -4790 -79047 -45271 -57269 -89424 -86040 -26904 84238 171658 123851 18529 1714
14410 1714 -70490 -41576 16342 14559 10075 -21124 -47106 21912 38767 79880 97866 14833
14398 14833 -48906 -77041 -87373 -69772 -36540 4457 -39602 -36541 -20431 -12152 -10161 -60575
14386 -60575 -48384 -22643 -42943 -58666 15259 2928 -67851 -47170 -76538 -123506 -142025 -104719
14374 -104719 -58554 15280 79940 36519 -64333 -93260 -3967 -3431 -63376 -103251 -104564 -51365
14362 -51365 -101013 -163261 -113118 9204 10389 -47943 -72449 -93252 -93620 -76818 -79002 -98451
14350 -98451 -153500 -88938 -69812 -49859 -1089 5717 21639 29790 -1058 -1264 -48967 -47693 24321
14337 24321 25828 27540 11442 41347 -13519 -109229 -134134 -20317 35169 -33770 -25626 -43991
14325 -43991 -19314 24257 26141 38510 -14056 -15282 8684 -10878 -29136 27455 162813 232298
14313 232298 31322 -1443 18850 -50486 -94501 -100454 -140230 -118786 -110856 -39346 -18100 -40246
14301 -40246 -108070 -140540 -189778 -140191 -16784 -26379 -80291 -146894 -127719 -112348 -57136 15399
14289 15399 61518 98833 123048 -28885 -100768 -26545 -51930 -91806 -112548 -105830 -47360 -58615
14277 -58615 -148537 -180433 -259127 -145398 -18586 20009 126413 133164 121333 122925 114019 122356
14265 122356 58772 8126 -27844 -81319 -128061 1522 35400 -21579 -64031 -47797 -23140
14254 -23140 13104 28145 25553 -26821 -64255 -112979 -97042 -65905 -3226 71389 159454 147107
14242 147107 20363 -40168 -39466 -40246 -22038 4644 -26089 -117444 -197644 -118202 -95069 -64060
14230 -64060 -138998 -167203 -100694 35701 75770 32544 22860 -1390 -20740 -93826 -38368 118169
14218 118169 48137 -34638 -77336 16332 3371 -24047 -6665 -11141 -60565 -57652 -16357 -26178
14206 -26178 -50069 -37261 49516 104437 70320 22498 37120 67128 51684 68336 124855 196800
14194 196800 154796 194604 170240 80876 50125 19824 -63555 18836 119206 41765 -85641
14183 -85641 -137431 -144997 -108210 -41428 17764 -23761 -726 -56570 -108691 -109457 -77610 4434
14171 4434 -3829 2036 21021 -12299 -21948 67618 51188 -31071 -25871 25865 77190 28422 -44073
14158 -44073 -40198 -58252 -34347 -21149 -53539 27878 83847 59827 92380 69950 -43082 -63630
14146 -63630 102899 250270 251595 104246 58431 89712 87225 24974 28632 47031 24348 -30452
14134 -30452 -74685 -78020 -43259 23797 82386 70376 -31436 -29380 28840 -32479 -84378 -2306
14122 -2306 -60798 -21251 96229 159811 120704 63609 53521 72772 54301 34510 34249 56167
14110 56167 55905 -733 -68312 -65837 26034 24834 39528 96239 65693 52171 -24535 -57306
14098 -57306 24833 -46814 -89868 -58913 16671 8241 -25240 40617 12118 26225 7487 -77158
14086 -77158 -58411 -108446 -151705 -71348 -23458 22134 112284 187516 143464 78445 84788 125276
14074 125276 150650 110388 13978 -17375 -15943 -8911 -40138 -11622 -58951 -40776 84848 82466
14062 82466 61676 24999 17401 39416 119 -41570 -33205 16426 43923 51365 84610 50866
14050 50866 -20188 -70544 -84286 23023 135970 88636 50150 59461 46733 36098 35853 38920
14038 38920 6414 17453 -25807 -46138 -60172 -30119 -1780 -50689 -19219 -73909 -92659 -38111
14026 -38111 6205 35635 96567 79053 44118 77000 102547 19566 -39997 -415 -24805 17188
14014 17188 97810 59931 -28478 -13964 -98180 -209021 -152191 -55439 16640 31668 66649
14003 66649 69653 89986 120914 38231 17873 -15820 -44153 -28266 61806 74593 15909 101590
13991 101590 114412 104011 38047 33895 -8043 -18623 5879 37051 85779 146292 15875
13980 15875 -48274 -18141 -17605 4013 88294 48262 3516 -7112 -18661 -6335 -11824 -107874
13968 -107874 -130476 -75534 -33507 28726 66499 17588 -39578 -161032 -180047 -131763 -112076
13957 -112076 -594 68769 45337 18207 -68111 -45420 -22596 -71432 -81629 -106737 -91126
13946 -91126 -45163 -11755 -3830 9525 62104 16249 1785 25912 -44000 -72634 -60964 -4842
13934 -4842 -13123 -28184 591 21675 -7113 -114039 -122302 -69092 6003 48113 -5320 3666
13922 3666 36010 -69772 -153333 -131503 -108015 -122709 -42951 2568 12460 -107199 -221812
13911 -221812 -187213 -84728 11599 45363 -66996 -113982 39109 159889 119426 131516 47329
13900 47329 3741 -19783 -47028 3088 -16970 -45011 -22101 -53302 -105189 -116932 -105578 -71637
13888 -71637 -47115 -140727 -139878 -46275 -24934 43581 72169 64927 125912 141279 154077 143535
13876 143535 177231 111652 59599 52228 -4848 1111 10933 67994 98115 101365 53530 40783
13864 40783 52943 33369 133532 159753 88568 51390 -70090 -69469 -23504 14376 39737 22879
13852 22879 42448 38375 20964 24154 31012 83774 93916 15503 28743 59227 26118 -80373
13840 -80373 -125353 -37227 39283 141607 188880 75526 44510 -57581 -186302 -148022 -120490
13829 -120490 -57786 -47348 35384 81887 126215 160053 82378 49477 31535 -53193 -96170
13818 -96170 -32318 -13511 8523 -32138 2317 35898 121261 169951 122992 135209 54695 2890
13806 2890 -66842 -78545 -84005 -60551 9717 48032 48119 91091 16042 7695 -21511 -39454 -22431
13793 -22431 -38650 -89091 -170645 -254771 -306145 -215299 -95061 35053 88830 -14364 -130169
13782 -130169 -134985 -79276 -42499 -8605 -44451 -143 26118 5522 93711 82697 145456 153953
13770 153953 11821 -33538 41082 76967 125108 48982 16300 46440 -4703 -57416 -46327
13759 -46327 -19695 -63190 -60136 -50566 -79474 -107663 -96329 -74742 -109577 -89722 5 89770
13747 89770 113585 96798 68316 98745 54531 34614 35360 -39902 -41223 -39016 -27020 30851
13735 30851 118553 105150 2646 -32179 45085 43257 10673 41798 -9450 12953 42035 76777
13723 76777 100297 117289 79220 58073 68450 -4569 -15493 -41816 -11728 126651 156921
13712 156921 182942 176979 135168 160001 183782 209453 220584 166204 96810 70328 95771 37295
13700 37295 40265 26880 -415 -43578 -118952 -122392 -98393 -23192 55696 25646 33007 90106
13688 90106 14596 -100039 -47379 -30979 -57945 -26008 -20712 -32652 -40669 18824 29439 1127
13676 1127 -36496 -39064 9326 -15233 -23588 -26117 38033 39709 65046 104214 165190 203413 110866
13663 110866 33316 31414 63038 4147 -74048 -17150 60501 48811 -14998 -49660 -26022 -237
13651 -237 31640 62756 42272 55191 57716 30543 85888 117772 41960 23916 108757 51485
13639 51485 -57202 -1889 3951 9778 11006 46867 63211 68771 35483 47477 84673 105815
13627 105815 29463 -66347 17395 46938 -36354 -2726 -12802 73159 135776 140039 81494 54636
13615 54636 68794 -18245 -96283 -60064 32293 17861 -9812 8898 15494 49526 65301 21198
13603 21198 32688 6533 -25252 -120406 -101043 -72653 -18373 -5062 -20768 -9985 9561 19237
13591 19237 -25751 -11922 66653 137912 126875 81680 51901 443 -14210 75537 127570 27069
13579 27069 -44636 61263 70764 61674 137751 119599 59038 6701 75628 143057 165565 181475
13567 181475 136867 96134 132975 134498 93013 67222 132166 116061 95310 153251 147828 150464
13555 150464 212197 256507 223423 127321 93295 167097 199836 232065 226035 181839 167013 138023
13543 138023 152382 193392 187764 254649 260269 250668 210217 298728 348010 245951 252468 180296
13531 180296 205891 237394 242968 301418 242713 196620 194803 207692 111145 83081 47323 81776
13519 81776 114450 155244 220375 196761 195466 203208 241289 155281 124239 104812 87855 53490
13507 53490 157769 302864 280805 272359 213576 158891 125396 37055 840 -28298 20828
13496 20828 163403 204075 226087 222633 155898 54237 65144 98261 127639 77542 38405
13485 38405 65408 45837 -22863 -78630 -27389 55673 43436 29055 31577 -16299 49173 48770
13473 48770 77882 148470 146512 147373 107060 87513 105052 152498 158428 150220 109324 102685 119950
13460 119950 159901 171376 102837 144962 144831 83933 33088 -3221 -48273 -111841 -60705 -32342
13448 -32342 36298 26965 6540 -37341 25963 31621 25497 67538 102584 70034 -56794 -115226
13436 -115226 -84880 -67692 -91231 -28578 -32871 -21547 46882 79308 5848 11921 51915 58588
13424 58588 39199 77487 58870 53610 189629 180519 116879 54916 89626 50284 11755 31739
13412 31739 100014 8548 -34900 7286 36722 43266 29555 -24033 19901 124795 219448 181088
13400 181088 91742 159710 317632 513415 538256 527731 466630 381499 261932 193466 127186
13389 127186 80058 113685 157912 177733 208420 159330 138067 100640 85228 43751 55533
13378 55533 28804 -6017 40312 40407 -48366 -19359 39209 49053 -4013 34857 64368 128306
13366 128306 172320 90458 58579 139634 178381 171055 162610 129517 50139 3621 59993 151542
13354 151542 190766 226283 233929 326910 394033 392222 429738 373919 226897 205817 211229 220923
13342 220923 169389 106063 123397 165396 174056 105656 74023 -71701 -61562 14353 35603
13331 35603 -68245 -83416 -54165 -10485 -20108 -66188 -70255 -38016 -63488 -61910 -3528 62018
13319 62018 144949 218942 244324 173400 122079 92077 -2554 -43715 -57941 755 10331 98385
13307 98385 244577 309725 270403 240751 223223 157581 102204 92844 81150 57120 133295 166823
13295 166823 60015 17565 29270 15635 18399 -12411 -35853 -41549 -46302 -98408 -124561 -50212
13283 -50212 42327 -4928 -38869 34879 94704 80101 1911 79276 57923 31818 107339 78010
13271 78010 68659 49308 98203 136486 131756 170825 145802 60792 -28931 -33446 -36493 -14461
13259 -14461 -19252 36869 -26623 2748 82502 116243 82747 31528 -28407 -53134 97120 125383
13247 125383 60339 53419 100282 103501 24086 -9129 -10580 72085 139470 156090 112472 70973
13235 70973 66765 10804 67402 151616 54640 -96863 -70962 -16923 -47692 -38998 -34365 32197
13223 32197 80684 119824 136620 167934 158785 91332 190078 270562 235238 149368 92046 51558
13211 51558 30662 -3690 19637 60731 -12593 -11505 602 -47812 -40176 5692 104323 100558
13199 100558 14593 2203 89598 86551 48266 -10257 30040 13909 60406 141353 137529 132055
13187 132055 181800 150293 152359 101863 25519 898 62345 55023 65999 15357 -15341 86500
13175 86500 76391 -10617 10892 -12073 -20865 -15634 -44520 -18739 7595 19755 -8847 -3775
13163 -3775 31763 135386 166750 142426 120551 95297 20290 4125 10938 20830 11858 100592
13151 100592 147807 170209 96071 123089 128970 72378 78828 88663 25486 4803 35836 -13433
13139 -13433 -33817 -113510 -97775 -41675 41749 181782 128720 85630 9895 -25867 34052
13128 34052 17726 55721 103365 79091 142585 208614 148928 28576 32633 25951 41864 100716
13116 100716 225024 163061 4610 58232 85752 115158 87681 66277 35660 105197 126848
13105 126848 117677 145774 109091 67643 34840 38572 110433 123585 169566 196388 220590 214236
13093 214236 180590 179119 107707 54542 -6718 -135153 -127984 -69504 -141753 -140983 -86691 -58054
13081 -58054 -98536 -4528 98537 25087 -41539 -55676 -84362 -96584 18606 40784 141316
13070 141316 168161 153552 142631 143363 204736 225003 234614 205497 193530 191547 30691 42898
13058 42898 100809 113146 91711 105209 76482 7237 -18115 -78005 15644 80579 36618 4342
13046 4342 -41667 -56792 54219 87517 40164 51761 30906 -82789 -103675 -66115 -1866
13035 -1866 34087 34346 -17203 -13420 -2274 -4546 46262 44731 114176 118457 75142 68998 60614
13022 60614 77104 113241 82491 150056 158161 171805 62931 -5017 123810 181121 75897
13011 75897 53243 99392 120046 118984 149479 109486 97722 46252 127109 145503 110222 91530
12999 91530 -21332 -86323 -64302 -18988 40723 36486 69808 64457 133230 103571 73774 59382
12987 59382 18270 49939 94784 112046 85438 82694 42600 33544 70887 110422 178927 205836
12975 205836 151094 99611 139544 202394 163675 128402 96114 72885 60448 100227 96152 26866
12963 26866 44323 60883 106910 155995 138238 87680 96986 182217 213716 142006 120965 172126
12951 172126 176581 226304 169986 98506 44712 34558 53293 108001 178005 175579 97462 20164
12939 20164 38473 78395 92852 58734 31092 8658 36987 126832 78577 104912 65480 -1523
12927 -1523 -75674 -58895 83584 117199 190017 172815 129008 44310 70553 71425 71584 110727
12915 110727 79743 19651 -44067 -78881 -39093 -8501 -62826 -9562 58616 114846 95417
12904 95417 121302 218598 258449 199573 141486 74170 89422 71250 96143 109961 113031 122928
12892 122928 143973 112449 66139 118476 78105 18003 -62815 -62785 -37911 -35378 -5912 -5892 3100
12879 3100 17062 18041 -4024 35018 74974 127667 71444 97304 92384 224143 259730 189733
12867 189733 61175 25166 -32631 -112482 -142267 -90827 1760 -5990 -2358 23598 107971 81123
12855 81123 65326 63176 75142 148442 100282 94576 -9474 -24960 11281 -45008 37125 174109
12843 174109 205186 118271 134602 149745 179017 67587 19577 37280 -17656 -18372 -63535 -113775
12831 -113775 -137628 -72364 34575 6030 9110 677 48496 166176 173865 4350 -39624
12820 -39624 35874 122195 154091 138575 129165 105864 84945 22548 8207 -25620 22710 60203
12808 60203 57690 55821 67358 34943 6653 2304 74689 93985 62721 -32217 -48985 1773
12796 1773 27844 6077 31511 -16108 -61339 9263 87742 88175 183362 219508 189754 203799
12784 203799 169989 107098 75358 96092 67829 53436 -35337 44115 109952 131203 81777
12773 81777 111021 210372 220967 138910 88104 77386 121180 124950 50609 145037 116061 112964
12761 112964 122780 95335 63238 96648 94887 69826 79874 78351 28094 -32293 -77292 -10917
12749 -10917 76720 182534 287528 254663 260061 218268 142007 140929 114811 232469 247625
12738 247625 251671 238089 251062 260787 249448 287536 412767 401350 400861 377880 376676 379483
12726 379483 349205 322715 287168 268017 207188 211978 148895 182160 241023 318753 273973 263704
12714 263704 264981 148317 113189 91123 149696 206236 259873 275094 192050 172207 270932
12703 270932 336910 370645 299442 306552 339200 402275 480083 489835 566670 569943 650488 796344
12691 796344 800982 713670 663472 740477 718874 663997 534218 434264 443823 421324 311856
12680 311856 361804 415984 343095 362498 387093 420175 385397 353151 369136 320842 284545
12669 284545 340126 331179 260432 283329 390917 479967 447753 381242 462969 438384 373368
12658 373368 394908 385905 398738 391659 314240 374290 436700 461179 412015 347645 351912 331118
12646 331118 294373 289786 193930 139900 218045 304156 332313 308635 259973 289616 381312 526172
12634 526172 571407 545982 547930 495344 454893 323469 187777 130140 189923 179960 176759 253504
12622 253504 334614 367721 302965 286412 202574 88081 74342 144982 150673 101971 102845 122350
12610 122350 86795 78705 139810 203274 118849 -30575 25664 103260 137670 234132 223186
12599 223186 121737 88101 171841 184140 115431 78508 68991 143236 143266 129275 69561 32898
12587 32898 112169 124141 168238 240742 264687 228117 157626 166830 244650 289908 234417 184161
12575 184161 211967 236239 209368 167470 190298 172254 172273 206655 234901 158939 189454 187628
12563 187628 220451 188514 204864 150547 54266 74364 122848 150544 149377 80281 62160 123963
12551 123963 123825 125365 147995 176325 127911 145502 157673 152357 140065 163541 116715 92939
12539 92939 158887 160931 123909 237675 271573 195799 193117 214086 259495 225826 162896 192330
12527 192330 126045 101341 114485 164068 184592 250943 310034 320325 253298 131826 109800
12516 109800 159277 233045 253222 251617 309852 224051 167808 217108 221070 176243 157989 209867
12504 209867 171973 146526 142114 172112 291664 279530 250428 233818 227298 219692 267942 273321
12492 273321 206385 137584 159705 120822 133942 189149 174882 165956 174992 209157 134369 41397
12480 41397 84804 174977 217045 275047 344126 340608 299704 262542 217988 255485 298694 320650
12468 320650 323044 248087 207069 240879 321376 389497 324215 200405 197816 249639 281762 256400
12456 256400 236396 223724 264390 282047 230665 283653 290994 338212 370097 297807 218402 236207
12444 236207 159622 91206 72833 102118 197284 230159 225520 124811 128494 206504 229515 260634
12432 260634 283302 448804 497671 442825 398428 229807 164413 150133 246040 325687 342561
12421 342561 302086 233632 242691 385191 480766 449431 465402 499942 536958 599270 479150
12410 479150 324103 302600 315415 319159 353119 421688 409018 415509 384931 430857 355161 311316
12398 311316 390791 394190 413401 507228 599921 677393 714852 731719 716323 678948 559891
12387 559891 564578 585561 647542 625010 620167 717080 687933 671269 733328 776272 818143 900711
12375 900711 894438 889915 872480 870793 917991 935116 1003731 944367 901004 878506 984277 1086966
12363 1086966 1184152 1204298 1247645 1255426 1242657 1344389 1454551 1497840 1624002 1649532 1625767
12352 1625767 1607382 1682577 1624979 1612889 1698537 1793562 1785378 1744970 1738918 1739779 1804794 1795589
12340 1795589 1777006 1810965 1845062 1849312 1851120 1913043 1910832 1893127 1820254 1787630 1837020 1797780
12328 1797780 1769171 1773308 1859061 1884976 1927981 2075149 2161747 2285980 2405704 2501294 2600058
12317 2600058 2792957 3043983 3286427 3600811 3839315 4032601 4322257 4678061 5023948
12308 5023948 5437408 5869594 6374503 6845586 7239523 7567765 7916428 8295355 8732916
12299 8732916 9226978 9674695 10151337 10644929 11320065 12248012 13405767 15092329 17314978
12290 17314978 20138245 23583448 27764298 32639234 37854301 42997436 47372950 49978578
12282 49978578 50293667 48393934 45155504 41492528 38145388 35517537 33547882 32335834
12274 32335834 31679225 31638827 32008464 32678369 33832735 35170660 36450284 37563416 38220204
12265 38220204 38402767 38482437 38721875 39271087 40107350 41319387 42778773 44161008 45184389
12256 45184389 45666992 45784307 45639786 45557851 45930946 46836883 48503554 51029920 54611726
12247 54611726 59836341 67120494 76833979 89053427 103728793 119939919 134709587
12240 134709587 143526223 142761702 133218887 119009410 104205749 91134819 80169134
12233 80169134 71142469 63842198 58469053 54779495 52340070 50872580 50042574 49583138
12225 49583138 49206622 48603089 47494114 45941394 44240718 42548256 41090027 40031272
12217 40031272 39372276 39079859 39006309 38936428 38550778 37624492 36342506 34980436 33800641
12208 33800641 33008992 32650311 32632969 33104803 34172640 35963805 38574652 42090994 46099858
12199 46099858 50052400 53299600 54655165 53350533 49563130 44350737 38741110 33385865
12191 33385865 28543195 24483860 21183028 18356151 16145582 14579522 13487692 12655210
12183 12655210 12020551 11546957 11138437 10637274 10040209 9649888 9204848 8597646 7954550
12174 7954550 7333880 6775346 6272691 5746197 5356158 5013104 4705719 4371088 4101367
12165 4101367 3868681 3657831 3441251 3345861 3154988 2958476 2826583 2762784 2800997 2657618
12155 2657618 2557264 2402817 2309489 2281797 2231074 2227347 2275298 2361648 2437256 2485403 2473586
12144 2473586 2422612 2328859 2366663 2365386 2314157 2272741 2279166 2251563 2192854 2162157 2249343 2325949
12132 2325949 2313348 2329897 2274859 2226945 2209519 2250264 2251724 2159229 2014330 1939988 1916634
12121 1916634 1887254 1835583 1789056 1762910 1710675 1629824 1558652 1492084 1430568 1470522 1385736
12110 1385736 1371740 1458790 1458703 1531766 1655701 1657246 1602475 1473782 1388189 1375747 1420678 1464802
12098 1464802 1519001 1449596 1397525 1476468 1511583 1451692 1467968 1476601 1445867 1460670 1474340
12087 1474340 1525439 1534906 1492188 1469222 1438843 1403691 1441565 1532993 1548574 1558419 1562917 1491826
12075 1491826 1490928 1526366 1571888 1528737 1551194 1511679 1544421 1622748 1764445 1769461 1744764 1806611
12063 1806611 1791944 1724377 1683288 1712527 1743272 1725324 1709707 1728734 1734038 1740752 1799764 1799447
12051 1799447 1774859 1853214 1893325 1873239 1916248 1939941 1926070 1878792 1910499 2030637 2169204
12040 2169204 2176205 2123385 2106341 2112562 2140298 2167022 2124651 2174067 2154754 2230145 2338636
12029 2338636 2369273 2348189 2294146 2267184 2309752 2393370 2446962 2508574 2492005 2408196 2397999
12018 2397999 2524252 2538503 2575771 2632575 2634607 2713173 2715692 2748294 2807641 2855265 2927285
12007 2927285 2904898 2839495 2927031 3058729 3174593 3265588 3317752 3433924 3489923 3583442 3751416
11996 3751416 3787555 3790308 3866762 4040086 4174955 4176929 4285201 4412353 4462274 4538870 4691515
11985 4691515 4883082 4933814 4948572 5107727 5218729 5241508 5382973 5566297 5734606 5845843
11975 5845843 6024894 6253602 6504769 6654344 6723320 6924646 7142555 7333102 7609187 7836687
11965 7836687 8186156 8550059 8867450 9170273 9449403 9688563 10056169 10492917 10860914
11956 10860914 11214430 11643025 12095428 12623492 13227430 13847514 14536614 15201174 15852500
11947 15852500 16564476 17363274 18158110 18990993 19948147 21002011 22168657 23422857 24625255
11938 24625255 25866331 27255525 28708499 30353939 32163161 34137796 36126746 38297278
11930 38297278 40668219 43151752 45706396 48472674 51421757 54420532 57551042 60886529
11922 60886529 64278815 67708276 71108357 74538212 77719915 80526770 83085930 85348712
11914 85348712 87114892 88323277 88992595 89088774 88535210 87371516 85770860 83715701 81255478
11905 81255478 78502038 75430311 72095383 68792297 65571574 62408414 59232961 56063710
11897 56063710 53098661 50215436 47422902 44726744 42221965 39977256 37863905 35971276
11889 35971276 34146342 32327079 30652997 29178978 27703521 26281181 25063914 23883481
11881 23883481 22716384 21657459 20681720 19727916 18904171 18082698 17343908 16606138 15873335
11872 15873335 15184715 14571808 14004898 13514019 12985207 12364772 11871552 11513298 11113173
11863 11113173 10668409 10209903 9730587 9369208 9066779 8807499 8499464 8290573 8096199
11854 8096199 7831469 7597606 7404712 7217768 6917032 6609253 6345975 6133679 5952149
11845 5952149 5788129 5701281 5596759 5483611 5286140 5158954 5072323 4961813 4841891 4687706
11835 4687706 4575251 4433169 4339284 4293961 4274101 4166607 3968928 3815200 3792750 3772549
11825 3772549 3670562 3554888 3401443 3383423 3341640 3294004 3210284 3088706 3032650 3024607 2918408
11814 2918408 2818365 2835656 2883167 2792305 2676969 2547655 2556774 2590827 2646926 2618677 2550179
11803 2550179 2484348 2431357 2431763 2419340 2345494 2296528 2154740 2110052 2129108 2090826 2068698
11792 2068698 2197004 2225208 2131543 2129103 2184902 2202366 2193345 2138351 2155234 2180434 2121559
11781 2121559 2072517 2019822 1933243 1871107 1876223 1865553 1808142 1754335 1780033 1720149 1627947
11770 1627947 1697197 1654536 1593976 1555180 1524169 1537400 1529174 1507664 1402295 1284653 1331617
11759 1331617 1418653 1440978 1397747 1411790 1391336 1294979 1235698 1231223 1289523 1286016 1229984 1258748
11747 1258748 1193184 1237516 1265262 1239627 1157481 1092356 1138755 1109799 1041347 986010 939597
11736 939597 950177 987699 944956 944375 962788 955105 914082 880408 780996 739271 778085 822434
11724 822434 821898 784407 742082 681251 638969 611467 687223 756972 775230 691525 706721 634051
11712 634051 658008 698553 645934 567636 557233 569176 497074 450771 447119 423958 430381 454328
11700 454328 419266 443170 522905 561580 578105 595448 619037 544317 479579 609860 588407
11689 588407 525836 539413 484866 432376 386346 374178 419843 413256 398221 472402 542792 497928
11677 497928 516698 537604 565518 592730 609463 467646 426710 373930 302240 364285 376567
11666 376567 377371 422124 423334 350418 323222 316260 305841 312584 360446 318239 303613 317046
11654 317046 335012 344648 358086 356330 357419 313198 304755 380304 354684 312198 332216 341738
11642 341738 356659 269569 236570 273824 296146 280884 274338 306282 349968 381991 469951 422587
11630 422587 372732 286748 278510 281121 168747 222149 401695 408325 360748 288546 298146 292452
11618 292452 312351 369971 323987 303994 328205 290573 339722 294333 265621 247397 270370
11607 270370 299477 381050 403160 408674 296647 228403 192853 201746 231308 209873 258891 303502
11595 303502 199911 66728 8295 40788 154959 278533 299489 237386 178661 131200 138252
11584 138252 119334 108905 92964 43464 130970 204360 194742 248740 295813 316713 318651 232571
11572 232571 206497 147798 41894 62766 118493 154201 210903 226456 155067 130083 150488
11561 150488 232883 220934 286360 262048 148315 106288 147385 156726 227856 180755 160527
11550 160527 215406 169290 88971 113728 148384 150019 119365 165622 214605 208125 89895 22998
11538 22998 1593 133213 242100 163219 99783 108098 112661 61658 46722 144479 210112 214765
11526 214765 244447 181330 143772 127071 182643 172227 134765 118288 159867 187357 233184
11515 233184 220154 172799 156057 155521 217696 162812 157900 129188 137703 156374 216122 287559
11503 287559 213110 44261 55143 100499 148574 115035 201518 198624 166251 177868 167251
11492 167251 126606 115231 163568 225404 184889 146804 105473 185502 233856 197415 151863
11481 151863 192259 150483 66878 66896 71622 126795 121111 45664 1714 46233 31399 -59080
11469 -59080 -40358 785 10920 39793 85070 39451 33928 -3859 -120749 -107257 14683
11458 14683 62152 86887 93960 52234 152601 202844 231640 261221 228299 128333 67974 48678
11446 48678 52327 14287 43847 21654 122030 200173 187868 153957 192870 84979 -46381
11435 -46381 -27351 -21896 -59447 -3493 6521 45116 129874 54384 -15829 -59301 -9856 -44058
11423 -44058 -57988 625 90917 125481 73780 94574 107656 151348 161588 82118 47569 46405
11411 46405 122585 150894 123149 131909 198408 221433 173124 95346 -850 -38952 -60635 38966
11399 38966 107279 41410 -25984 -33872 -90451 -65700 105761 82368 76156 99105 99017 89107 77590
11386 77590 103276 105766 123022 39647 25264 87960 145093 120016 93584 71558 68387 93049
11374 93049 118350 84360 58235 34950 -63538 -103440 -49604 -2155 87821 151830 146302 215216
11362 215216 162249 101615 113815 208017 173423 162746 121131 43730 113491 159629 110478
11351 110478 114867 19857 -58093 -28267 26121 26935 23703 -18604 58664 47413 -45677 -15477
11339 -15477 -8594 -44087 50450 88686 44318 81090 166589 201330 100486 82483 79617 159083
11327 159083 100275 21044 96770 167030 185741 227068 257386 287650 239497 119581 77623
11316 77623 105718 105139 130190 174532 152676 197111 102341 46900 112450 126611 170265 179806
11304 179806 127647 108273 55535 27648 -13864 44928 17481 167 -70610 -111749 -74104
11293 -74104 7297 106017 130468 41445 -24532 55363 113775 144980 82911 41427 49063 -35207
11281 -35207 -47930 14440 116684 87 -58172 -75519 -90873 -90141 -38178 -35268 8743 58648
11269 58648 74919 -676 366 -5790 -62108 6086 114578 84825 24774 32856 91659 29071
11257 29071 42879 -180 -90815 -80047 5104 79133 81245 50592 116895 175878 148666 25335
11245 25335 13329 6871 -38747 -70227 -55018 23010 81436 71755 6156 14415 79689 60423
11233 60423 17891 -33587 -62537 -175116 -148598 -51785 -34625 -12470 44320 98567 180741
11222 180741 161487 77555 60091 -20655 28040 63036 74984 104336 135981 36250 13860
11211 13860 24168 20116 120669 113885 79427 130043 103267 56009 85654 139014 72286 49885
11199 49885 32644 89090 127303 79945 47653 -9774 2816 20417 56145 78769 42780 -10596
11187 -10596 -51326 -49845 6152 67350 152854 157951 67294 3164 17614 -27975 -11722 -15209
11175 -15209 -23949 23030 38186 9307 -4529 32797 47722 -14304 -63722 -4113 -2842 35345
11163 35345 7537 -85214 -73590 -62597 -80792 66951 213761 155993 47247 22972 65572
11152 65572 33173 65964 87072 98858 187821 205208 115804 36565 50853 8599 -44849 20237
11140 20237 75208 62818 47001 32412 50677 121377 84393 29595 -31638 -24741 32877 -17356
11128 -17356 7088 4371 -63532 -69789 -66018 12393 104740 68841 11095 81187 165273 152088
11116 152088 143864 69586 18977 22029 81746 112708 43895 -93 76505 104756 111343 25353
11104 25353 -3239 49625 42478 25078 34729 -18368 -30927 61319 185102 154328 26379 -14270
11092 -14270 -7584 -24209 -1352 78232 46752 27446 31285 46840 37438 -35886 -5567 30075
11080 30075 66063 70077 45358 20033 23360 51898 73741 161642 116058 101276 23315 -15309
11068 -15309 54838 13090 -62101 -21909 40726 -30488 -68187 -9966 33879 66941 104414 52913
11056 52913 56226 44241 -30105 1523 85280 202876 256558 270842 275111 306319 194118 136770
11044 136770 187566 183007 169796 158693 97974 82095 164094 235556 344695 422715 495860
11033 495860 583316 639841 567138 472451 404163 356677 278383 320188 387814 495810 642225
11022 642225 745669 835812 857877 779523 669260 649697 552734 500793 419901 371882 319262
11011 319262 363968 459823 495922 594013 518377 372139 281438 253170 227765 169435 82018
11000 82018 113617 228656 288376 283451 300207 303442 222557 177875 158267 94501 81149 134293
10988 134293 130372 73804 122717 78636 106663 54554 -5052 72706 91736 77462 39609 45148
10976 45148 5186 91500 123584 59974 71654 -30198 12152 95479 88472 102452 137813 70446
10964 70446 -70468 -145279 -86606 -1221 65268 53642 62225 52391 103011 155296 105277 -2208
10952 -2208 -160705 -130467 -19851 15280 28217 12167 11974 -58124 6531 82170 21141 -38911
10940 -38911 -38434 -92096 -192288 -183807 -194556 -149577 -41938 -57755 -107144 -83411 5110 16490
10928 16490 8294 41579 31912 -21339 -49376 -19785 92448 65905 64777 85358 134515 136300
10916 136300 156484 184706 195876 145959 177730 220057 209833 218366 162262 56703 62384 69934
10904 69934 -51995 -20920 2558 -85319 -128083 -51893 37524 204296 284597 293086 181729
10893 181729 131590 188968 195778 211536 178994 148716 114699 85396 -49955 -141737 -118515
10882 -118515 -130901 -84642 -15726 29331 46968 32423 56712 161721 159550 104238 133822
10871 133822 119749 79653 91793 128826 36609 -2513 -8466 15320 49485 89004 109623 94865
10859 94865 157758 188715 111107 6131 6534 44326 16792 7741 46220 148226 187276 144212
10847 144212 157622 167970 140831 108245 174280 140821 94414 134354 59345 -6519 134362
10836 134362 219178 160523 127126 131935 172730 178635 141386 147178 64276 -26144 -19678 13426
10824 13426 -34469 -7782 -15127 -43933 -48313 -22227 11390 142450 274951 318102 215776
10813 215776 117544 -22301 17520 8408 -21671 -26460 -13106 -41513 -72983 -97240 -44265 -28658
10801 -28658 -58548 -22995 -25208 13641 -5598 19963 31708 103170 168629 164882 106900 90473
10789 90473 45493 79152 127510 122042 154455 126830 71875 -8628 -38645 -43460 -16423 27787
10777 27787 65587 91314 65396 105808 85621 11412 -7494 34335 71807 107377 48316 11459
10765 11459 42749 83309 126655 28068 -12812 -87033 -104726 35513 149521 216334 272830
10754 272830 193929 228330 205696 149841 126311 32574 6495 -31609 35681 160724 192525
10743 192525 195090 208304 143584 113986 140831 173843 204046 282961 243167 248667 239033 184407
10731 184407 119629 123082 205224 337911 341048 368160 352926 321220 318603 226853 182738 193470
10719 193470 262908 395825 460128 399272 386876 425185 304419 330617 437123 415029 318612
10708 318612 332903 432335 431958 410628 436903 493550 402170 298043 181345 175094 256698 294751
$$ [...]
##END NTUPLES=NMR SPECTRUM
##END=
