##TITLE=Analysis number 329714
Compound Code cc 69309
Book Reference 547/22/2
Project Code adrs
Chemist Name simonw
##JCAMPDX= 6.0         $$ Bruker NMR JCAMP-DX V2.0
##DATA TYPE= NMR SPECTRUM
##DATA CLASS= NTUPLES
##ORIGIN= Bruker BioSpin GmbH
##OWNER= nmr
$$ XWIN-NMR		Version 3.5
$$ Mon Sep 24 14:10:26 2007 GMT Daylight Time (UT+1h)  MAYBRIDGE\nmr@NMR_250MHZ
##.OBSERVE FREQUENCY= 250.131544655141
##.OBSERVE NUCLEUS= ^1H
##.ACQUISITION MODE= SIMULTANEOUS (DQD)
##.ACQUISITION SCHEME= undefined
##.AVERAGES= 16
##.DIGITISER RES= 18
##SPECTROMETER/DATA SYSTEM= dpx250
##.PULSE SEQUENCE= zg30
##.SOLVENT NAME= CDCl3
##.SHIFT REFERENCE= (INTERNAL, CDCl3, 0, 16.522)
##AUDIT TRAIL= $$ (NUMBER, WHEN, WHO, WHERE, WHAT)
$$ ##TITLE= Audit trail, XWIN-NMR		Version 3.5
$$ ##JCAMPDX= 5.01
$$ ##ORIGIN= Bruker BioSpin GmbH
$$ ##OWNER= nmr
$$ C:\u/data/dgb/nmr/ADRS/2270/pdata/1/auditp.txt
$$ ##AUDIT TRAIL=  $$ (NUMBER, WHEN, WHO, WHERE, WHAT)
(   1,<2007-09-24 14:10:00.60 +100>,<MAYBRIDGE\nmr>,<NMR_250MHZ>,
      <created by zg, POWCHK disabled, PULCHK disabled
       configuration hash MD5:
       76 6E 9A 78 1E 09 19 81 EC 84 63 8F B0 6A 59 2D
       data hash MD5: 64K
       D2 05 C6 42 01 08 14 8D 6D F9 E0 6D 72 A6 9A C0>)
(   2,<2007-09-24 14:10:16.50 +100>,<MAYBRIDGE\nmr>,<NMR_250MHZ>,
      <Start of raw data processing
       ef LB = 0.3 FT_mod = 6 PKNL = 1 SI = 32K 
       data hash MD5: 32K
       E5 96 37 7D A3 D1 A4 F5 E0 DA 3C 96 88 D9 A5 62>)
(   3,<2007-09-24 14:10:18.12 +100>,<MAYBRIDGE\nmr>,<NMR_250MHZ>,
      <apk 
       data hash MD5: 32K
       EB 84 FB 55 44 23 D8 B5 CD 97 C4 3B 1A 6F CC F6>)
(   4,<2007-09-24 14:10:18.92 +100>,<MAYBRIDGE\nmr>,<NMR_250MHZ>,
      <abs ABSG = 5 
       data hash MD5: 32K
       57 8F 2E B2 AB B1 4A 03 3A 62 4D 8E D8 15 40 36>)
$$ ##END=
$$ 
$$ hash MD5
$$ BE 11 8E BE 32 CA D9 B4 4F C5 A8 A1 31 B9 88 4F
##$RELAX= 
##$RELAX= 
##$RELAX= 
##$RELAX= 
##$RELAX= 
##$RELAX= 
##$RELAX= 
$$ Bruker specific parameters
$$ --------------------------
##$DU= <C:\u>
##$EXPNO= 2270
##$NAME= <ADRS>
##$PROCNO= 1
##$TYPE= <nmr>
##$USER= <dgb>
##$AMP= (0..31)
100 100 100 100 100 100 100 100 100 100 100 100 100 100 100 100 100 100 
100 100 100 100 100 100 100 100 100 100 100 100 100 100 
##$AQSEQ= 0
##$AQ_mod= 3
##$AUNM= <au_zg>
##$AUTOPOS= <38 >
##$BF1= 250.13
##$BF2= 250.13
##$BF3= 250.13
##$BF4= 250.13
##$BF5= 500.13
##$BF6= 500.13
##$BF7= 500.13
##$BF8= 500.13
##$BYTORDA= 1
##$CFDGTYP= 0
##$CFRGTYP= 5
##$CHEMSTR= <none>
##$CNST= (0..31)
1 1 145 1 1 1 1 1 1 1 1 1 1 1 1 1 1 1 1 1 1 1 1 1 1 1 1 1 1 1 1 1 
##$CPDPRG= <>
##$CPDPRG1= <>
##$CPDPRG2= <>
##$CPDPRG3= <>
##$CPDPRG4= <mlev>
##$CPDPRG5= <mlev>
##$CPDPRG6= <mlev>
##$CPDPRG7= <mlev>
##$CPDPRG8= <mlev>
##$CPDPRGB= <>
##$CPDPRGT= <>
##$D= (0..31)
0 1 0 0 0 0 0 0 0 0.06 0 0 0 0 0 0 0.0002 0 0 0 0 0 0 0 0 0 0 0 0 0 0 
0 
##$DATE= 1190639398
##$DBL= (0..7)
120 120 120 120 120 120 120 120 
##$DBP= (0..7)
150 150 150 150 150 150 150 150 
##$DBP07= 0
##$DBPNAM0= <>
##$DBPNAM1= <>
$$ [...]
##$SUBNAM7= <"">
##$SUBNAM8= <"">
##$SUBNAM9= <"">
##$SW= 20.6930455092707
##$SWIBOX= (0..15)
0 0 3 0 0 0 0 0 0 0 0 0 0 0 0 0 
##$SW_h= 5175.983436853
##$TD= 65536
##$TD0= 1
##$TE= 297.16
##$TE2= 300
##$TE3= 300
##$TEG= 300
##$TL= (0..7)
0 120 120 120 120 120 120 120 
##$TP= (0..7)
150 150 150 150 150 150 150 150 
##$TP07= 0
##$TPNAME0= <>
##$TPNAME1= <>
##$TPNAME2= <>
##$TPNAME3= <>
##$TPNAME4= <>
##$TPNAME5= <>
##$TPNAME6= <>
##$TPNAME7= <>
##$TPOAL= (0..7)
0.5 0.5 0.5 0.5 0.5 0.5 0.5 0.5 
##$TPOFFS= (0..7)
0 0 0 0 0 0 0 0 
##$TUNHIN= 0
##$TUNHOUT= 0
##$TUNXOUT= 0
##$USERA1= <user>
##$USERA2= <user>
##$USERA3= <user>
##$USERA4= <user>
##$USERA5= <user>
##$V9= 5
##$VALIST= <valist>
##$VCLIST= <CCCCCCCCCCCCCCC>
##$VD= 0
##$VDLIST= <DDDDDDDDDDDDDDD>
##$VPLIST= <PPPPPPPPPPPPPPP>
##$VTLIST= <TTTTTTTTTTTTTTT>
##$WBST= 1024
##$WBSW= 4
##$XGAIN= (0..3)
0 0 0 0 
##$XL= 0
##$YL= 0
##$YMAX_a= 437636
##$YMIN_a= -497419
##$ZGOPTNS= <>
##$ZL1= 120
##$ZL2= 120
##$ZL3= 120
##$ZL4= 120
##$ABSF1= 16.522
##$ABSF2= -4.171173
##$ABSG= 5
##$ABSL= 3
##$ALPHA= 0
##$AQORDER= 0
##$ASSFAC= 0
##$ASSFACI= 0
##$ASSFACX= 0
##$ASSWID= 0
##$AUNMP= <proc_1d>
##$AZFE= 0.1
##$AZFW= 0.1
##$BCFW= 0
##$BC_mod= 0
##$BYTORDP= 0
##$COROFFS= 0
##$CY= 12.5
##$DATMOD= 1
##$DC= 0
##$DFILT= <>
##$DTYPP= 0
##$F1P= 14.0000005364418
##$F2P= -0.99999901652339
##$FCOR= 0.5
##$FTSIZE= 32768
##$FT_mod= 6
##$GAMMA= 0
##$GB= 0
##$INTBC= 1
##$INTSCL= 1
##$ISEN= 128
##$LB= 0.3
##$LEV0= 0
##$LPBIN= 0
##$MAXI= 10000
##$MC2= 0
##$MEAN= 0
##$ME_mod= 0
##$MI= 0
##$NCOEF= 0
##$NC_proc= -4
##$NLEV= 6
##$NOISF1= 0
##$NOISF2= 0
##$NSP= 0
##$NTH_PI= 0
##$NZP= 0
##$OFFSET= 16.522
##$PC= 1
##$PHC0= 154.3583
##$PHC1= 5.501193
##$PH_mod= 1
##$PKNL= yes
##$PPARMOD= 0
##$PSCAL= 4
##$PSIGN= 0
##$REVERSE= no
##$SF= 250.13
##$SI= 32768
##$SIGF1= 0
##$SIGF2= 0
##$SINO= 400
##$SIOLD= 32768
##$SREGLST= <1H.CDCl3>
##$SSB= 0
##$STSI= 32768
##$STSR= 0
##$SW_p= 5175.98343685301
##$SYMM= 0
##$S_DEV= 0
##$TDeff= 65536
##$TDoff= 0
##$TI= <Analysis number 999999
Compound Code 99
Book Reference 9
Project Code 9>
##$TILT= no
##$TM1= 0
##$TM2= 0
##$TOPLEV= 0
##$USERP1= <user>
##$USERP2= <user>
##$USERP3= <user>
##$USERP4= <user>
##$USERP5= <user>
##$WDW= 1
##$XDIM= 32768
##$YMAX_p= 458480066
##$YMIN_p= -244298
$$ End of Bruker specific parameters
$$ ---------------------------------
##NTUPLES= NMR SPECTRUM
##VAR_NAME=  FREQUENCY,     SPECTRUM/REAL,   SPECTRUM/IMAG
##SYMBOL=    X,             R,               I
##VAR_TYPE=  INDEPENDENT,   DEPENDENT,       DEPENDENT
##VAR_FORM=  AFFN,          ASDF,            ASDF
##VAR_DIM=   32768,         32768,           32768
##UNITS=     HZ,            ARBITRARY UNITS, ARBITRARY UNITS
##FACTOR=    0.157963299565203, 1,           1
##FIRST=     4132.6476996994, 0,             0
##LAST=      -1043.33573715361, 0,           0
##MIN=       -1043.33573715361, -244298,     0
##MAX=       4132.6476996994, 458480066,     0
$$ Real data points
##PAGE= N=1
##DATA TABLE= (X++(R..R)), XYDATA
$$ [...]
25548A9641o8751j3658J8820L6378M8258J3261m7141L332m9497P927J1025j1913
25536c2318j4782O703K932j0680m3448O362L7888J7447M7111P742q854j5955j3996
25523a3848J974K425K9163K4762n1632o7727q308M0708j6302J315J1172P7355
25511C1057K4694n1505n1053M5456L8797k2789j368k1036N264m4619J7123j1750
25499d1729L1042J1814K6225L1454J5936p818p413j1239q5023m3908N0494O3570
25487C3405l6549j8056J2194j071l585k6048J708J3089K2810L900K2202N980k3763
25474F216l1565K2848J1424J5185k9633k6697o512O0069M0464k5499J077K1697
25462E9074K402n4863j2531O4344L5638j23J6644m1454L986L0277J9804k7472
$$ plain form
25548 19641 -49110 -62768 -43948 -7570 40688 53949 6808 10140 -39357 -31430 -20405 -32318
25536 -32318 -47100 -40397 -37465 -48145 -91593 -85231 -47343 -29896 17215 24957 16103 148 -13848
25523 -13848 -11874 -9449 19714 44476 -7156 -74883 -83191 -42483 -58785 -57470 -46298 31057
25511 31057 55751 4246 -46807 -1351 37446 14657 13289 -7747 -2483 -47102 -29979 -41729
25499 -41729 -10687 1127 27352 58806 74742 66924 59511 48272 -36751 -80659 -30165 33405
25487 33405 -3144 -21200 -9006 -10077 -13662 -39710 -38002 -24913 -2103 1797 23999 29979 6216
25474 6216 -25349 -2501 8923 24108 -5525 -32222 -38734 21335 61799 36300 37377 59074
25462 59074 61476 6613 -5918 58426 94064 93941 110585 69131 73117 103394 123198 95726
25450I5726J800q8521j094J366K5507l2208n2289o1391K5682Q695M1861L2308
25438b558K8104Q476j0988K3082M4937J847m9316p0740J132J8430O9437k6068
25426C5775k8012J974J9629j8040L2210o319r1221J7299M7262K9530q641K6006
25414E7452l5609n5150m3160M3422M4046J5039l61O3051M3097n804O262J9162
25402A51447p1540n1472M8136J3326k8042p732J7269k4053o9476o0382k7937K9984
25390h0472k543k6474K1232l6980r538K4478l5403J9162R0303J0230j3868L539
25378c6334M7320K174K5702l0037K9136Q303o771J9123q561m0159O9489j2737
25366F6648j8851k3703Q416m888j8357k5277J8668M3498J1763n401k5408k0729
$$ plain form
25450 95726 97526 9005 7911 9277 34784 2576 -49713 -111104 -85422 -76727 -34866 -2558
25438 -2558 25546 34022 23034 46116 91053 92900 43584 -27156 -26024 -7594 61843 35775
25426 35775 7763 9737 29366 11326 43536 37217 -54004 -36705 10557 40087 31446 57452
25414 57452 21843 -33307 -76467 -33045 11001 26040 25679 88730 131827 126023 132285 151447
25402 151447 79907 28435 76571 89897 61855 54123 71392 47339 -22137 -82519 -110456 -80472
25390 -80472 -83015 -109489 -88257 -125237 -134775 -110297 -145700 -126538 -36235 -26005 -39873 -36334
25378 -36334 10986 13160 38862 8825 37961 46264 39493 58616 50055 9896 79385 66648
25366 66648 47797 24094 32510 27622 9265 -16012 2656 46154 57917 52516 27108 6379
25354F379L5850J5437q3952m0621M2707K3559M975l1610L2497J7980m1100p969
25342b5868N4555K8324J4181k4823l8901l3949j3133J4625M8920M3009l0902m3590
25330g552l6845l611K7360L662M097L7764K0527r37p4091j7497m1546k099K5322
25317f5446L5716l7070k9490M3409Q5229M1009l4847j8309P7339Q8384m4638r1464
25305D9822j1480o095l914N394j0034o3809l7990l7705k6942L6944O7035L2168
25293f606J8554q328l2260J1151L6329J4385o9037n451J00727L9928o8366r740
25281B1286M8304J2155o665O862n6067m5837Q565l5076M4466K0038r957J7671
25269B5745M0697l2219k7098j9821K0474J3306m6642m9122M9900K7947K7667k5487
$$ plain form
25354 6379 42229 57666 -26286 -66907 -24200 -641 4334 -27276 5221 23201 -17899 -25868
25342 -25868 28687 57011 71192 46369 7468 -26481 -39614 -24989 23931 66940 36038 -7552
25330 -7552 -44397 -48008 -20648 -16986 -12889 24875 45402 44465 -29626 -47123 -88669 -90768 -65446
25317 -65446 -29730 -66800 -96290 -52881 32348 73357 38510 20201 97540 185924 141286 49822
25305 49822 38342 32247 28333 33727 23693 -40116 -78106 -115811 -142753 -105809 -38774 -6606
25293 -6606 11948 3620 -28640 -17489 18840 33225 -35812 -41263 59464 99392 31026 21286
25281 21286 69590 81745 75080 81942 25875 -19962 -11397 -46473 -2007 18031 8074 25745
25269 25745 66442 34223 7125 -12696 7778 21084 -25558 -74680 -24780 3167 30834 5347
25257E347m7308K2624N1077o104j5491n6654j0201J27980J418k8427J9872k1164
25245D2969k5995L765R032Q37K8562n1676l4598j0426K6762Q368k0100O103L4023
25232A7626J9590L5045k3398j4150K6822K3996M2494K6380Q688n5009k0731k5747
25220F1606j9375n918m5670r774K2331N3043P0980J2229q8094o6302K560o12j2217
25207b5213J9933j1525O450o9915L2190j5608L903m750M9752q27j521j3252p2734
25194a03117l103J9199K7037n7182K4360Q9174K5467k3716m008L3445L8232k576
25182F3212p6531o2097k9743k0722L9882J7180l1230m6371L5132P4187Q600o141
25170c4642K3072K1030K8918N7829M7437l3056m0786o787l0376l7269N736N9347
$$ plain form
25257 5347 -41961 -19337 31740 25636 10145 -46509 -56710 71270 72688 44261 64133 42969
25245 42969 16974 20739 29771 30608 59170 7494 -27104 -37530 -10768 -2400 -22500 -16397 17626
25232 17626 37216 72261 48863 34713 61535 85531 128025 154405 163093 108084 87353 61606
25220 61606 42231 36313 -9357 -19131 3200 56243 127223 139452 51358 -14944 -12384 -12996 -25213
25207 -25213 -5280 -16805 -10355 -80270 -48080 -63688 -59785 -64535 -14783 -15610 -17131 -30383 -103117
25194 -103117 -106220 -87021 -59984 -117166 -92806 -3632 21835 -1881 -5889 27556 65788 63212
25182 63212 -13319 -75416 -105159 -125881 -85999 -68819 -100049 -146420 -111288 -37101 -28501 -34642
25170 -34642 -11570 9460 38378 96207 143644 110588 69802 63015 32639 -4630 1106 60453
25158F0453J4628r336m9108l9335j3628k598j301N2117L577J5238k7017k6536
25146b2846J1257J8541P2587L325j8530j621n312N53n842K2342k7598m9346k5730
25133b8220J1905J7535J0725k2535p214K994J4948l0549l932J9282L486o029l718
25120b1322l3994m5797N2734K7036l0010K61P619J3523j1817J710J2071J7626
25108a0360K2011k5305j0061m2977k8693O4949N8603K7548m1217n6678J4j2916
25096e5082O067M4883K9743J4650K3975l1614L8499j4887l3669K1116l942P893
25084D7632j4491j8437J6153O46L6823J5932J2414J076k6114J5076k8159k2129
25072C6422N79o4185q2346j0822N6509l365m743P629j037K98J2974M0832L9725
$$ plain form
25158 60453 75081 65745 16637 -22698 -36326 -38924 -40225 11892 15469 30707 3690 -22846
25146 -22846 -11589 6952 79539 82864 64334 62713 57401 57954 52112 74454 46856 -2490 -28220
25133 -28220 -16315 1220 11945 -10590 -17804 -14810 138 -30411 -34343 -15061 -11575 -17604 -21322
25120 -21322 -55316 -101113 -48379 -21343 -51353 -51092 -43473 -29950 -41767 -40057 -27986 -10360
25108 -10360 11651 -13654 -23715 -66692 -95385 -30436 28167 55715 14498 -42180 -42166 -55082
25096 -55082 -49015 -4132 25611 40261 64236 32622 71121 56234 22565 43681 39739 47632
25084 47632 33141 14704 30857 31503 68326 84258 96672 97748 71634 86710 58551 36422
25072 36422 37001 -27184 -109530 -120352 -63843 -67208 -71951 -64322 -65359 -65061 -52087 -11255 28470
25059B8470L1863M8251m4562j6477J395m3887l7915N5983N8078O742R62p5168
25047A3735m0156J1817j3849n518j9630M6502l890R958K1545l72L8070P2710j1548
25034A19374l7299k4407n9605j9953L793L3408K2350k5799j4039l1799n3722O557
25022h1141K8721j8508O695N7110N761N1228J4869P3306N419j09791m6194m4934
25010e7459l3173j1805J1284K3987J4726K2502n968M2512p2041p351k612q973
24998h4371N2749K5341q682l6721N385K5994K6760l0800k3030N6400J839J5240
24986B6104n0343K0937J3875j8837N3785j5817o7587p92J6897k3585m1463k5918
24974a12744N6697L5948M4070J2229O359l8102l0263L6012K8198K252J6261m0594
$$ plain form
25059 28470 60333 108584 64022 47545 48940 5053 -32862 23121 81199 87941 88903 13735
25047 13735 -26421 -14604 -28453 -33971 -53601 -7099 -10989 -1031 20514 20142 58212 130922 119374
25034 119374 82075 57668 -1937 -21890 -18097 15311 37661 11862 -2177 -33976 -87698 -81141
25022 -81141 -52420 -70928 -64233 -7123 -1362 49866 64735 138041 143460 33669 -12525 -57459
25010 -57459 -90632 -102437 -91153 -67166 -52440 -29938 -35906 6606 -65435 -72786 -75398 -84371
24998 -84371 -31622 -6281 -14963 -51684 -46299 -20305 6455 -24345 -47375 9025 10864 26104
24986 26104 -24239 -3302 10573 -8264 45521 29704 -37883 -38675 -21778 -45363 -86826 -112744
24974 -112744 -56047 -20099 23971 36200 42559 4457 -25806 10206 38404 40656 56917 16323
24962A6323j5871Q0063L8328l4130m8512J5119l2764p1863J8613M5688K5958q063
24950B8889O338p126m8791R616O9268N3876j6621m3736o7372p6697n2870Q4873
24938f0353J06964P2240l8336k4010N5775n3959k5070j8845n1733L4416O2438
24927E9527L5554l2433o2843p0578R641N3307L5942J8222k9670l3207J2284l9913
24915d4167k1707L0369j3327m655L9816O202k3735k0964j3882M5025j503p059
24903b9587j9012N0172j83n3105K7438M8733K5969q53N959p0960J3429L2059N8176
24890H8235k0260m2506l1424j7449O7206P5751l6126j12403m7882j4351R302K3556
24878e8351M2137M3892p723j9178L0466k6540l8684J817N700J951N261L571N105
$$ plain form
24962 16323 452 80515 118843 84713 36201 51320 18556 -53307 -34694 10994 36952 28889
24950 28889 35227 28101 -20690 -11074 58194 112070 95449 51713 -15659 -92356 -145226 -60353
24938 -60353 46611 118851 80515 56505 112280 58321 33251 14406 -37327 -2911 59527
24927 59527 95081 62648 -195 -70773 -61132 -7825 28117 46339 16669 -16538 -4254 -44167
24915 -44167 -65874 -35505 -48832 -53487 -13671 -7469 -31204 -52168 -66050 -21025 -22528 -29587
24903 -29587 -48599 1573 1390 -51715 -24277 24456 50425 49572 55531 -15429 -2000 30059 88235
24890 88235 67975 25469 -5955 -23404 43802 119553 83427 -28976 -76858 -91209 -81907 -58351
24878 -58351 -16214 27678 19955 777 31243 4703 -33981 -32164 -26464 -24513 -19252 -15681 -10576
24865a0576P5952m5842p0367j3503L6940N365J7616N7237m0049J6479J1349o5123
24853b4522K4384O7943K6037r480l8912l0195L023k2708L2488r386K2308k3848
24841A7132o671J9675p103J3825j1747n8181K2673O962J7886j1851l2826j1437
24829d1663k5527K5678K0553L6866K7704J7685r059J1493m291n1599o2969L7994
24817a7135L2153k5396k1678K7823K3550K6017l3680l6551K6251K7484n8014o0869
24805i0045m6633M1626K9505M869k2041m3199n3438O8146R4792N145J1548K1770
24793B2045K089R282m4803Q110l188n024O7217J7052q167l781M083O519k5977
24780D5457j00966m5169l4115L9222K4876K7085k373l0366J2600k6020J0684J9194
$$ plain form
24865 -10576 65376 19534 -50833 -64336 -27396 -22031 -4415 52822 12773 29252 40601 -24522
24853 -24522 -138 67805 93842 84362 45450 15255 18278 -4430 28058 18672 40980 17132
24841 17132 10461 30136 23033 36858 25111 -33070 -10397 -3435 14451 2600 -30226 -41663
24829 -41663 -67190 -41512 -20959 15907 43611 61296 52237 63730 59439 7840 -55129 -17135
24817 -17135 15018 -10378 -32056 -4233 19317 45334 11654 -24897 1354 28838 -29176 -90045
24805 -90045 -136678 -95052 -65547 -60678 -82719 -125918 -179356 -111210 -16418 -11273 275 22045
24793 22045 24134 33416 -11387 -3277 -6465 -11489 55728 72780 64613 60832 64915 71434 45457
24780 45457 -55509 -100678 -134793 -95571 -70695 -43610 -45983 -76349 -63749 -89769 -79085 -59891
24768e9891L2203M9216K3163m2259p6333M4341Q1320J9358J1245N500k8365n951
24756E3547n5811l0969k3563j0212M5910O3615J5643P847K1871n162o9219o2846
24744d9349k3362j6496j8563L0535j4700r7O188p26K1113N0547K4131k6646l2125
24731d9550l709R0537R583o4277k2115K5911q035n835L200P309M3603L2449M2831
24718A01902q55n9536k7028j3456J8611o2422l0097k3363Q551P887N3268j4239
24706d0777k184K448J3268N5838M6547k3742n1639k3552L897K14N220M6662R313
24693D1513n3638k7270k4585L1776M2739r526J0865l256L6543k125K2367R946
24681G5349k1986K7137J3113k7988n5757k3799o8751k6834M9726k0197O4450L2765
$$ plain form
24768 -59891 -27688 21528 44691 2432 -73901 -29560 51760 71118 82363 87863 59498 53547
24756 53547 -2264 -33233 -56796 -67008 -21098 42517 58160 66007 87878 82716 13497 -49349
24744 -49349 -72711 -89207 -107770 -77235 -91935 -92032 -85844 -86570 -65457 -14910 9221 -17425 -49550
24731 -49550 -53259 37278 46861 -17416 -39531 -13620 -21655 -27490 -24290 -16981 26622 59071 101902
24718 101902 101047 41511 14483 1027 19638 -42784 -72881 -96244 -87693 -79806 -26538 -40777
24706 -40777 -42961 -40513 -27245 28593 75140 51398 -241 -23793 -19896 -19682 -14462 32200 41513
24693 41513 -12125 -39395 -63980 -32204 10535 1009 11874 8618 45161 43036 65403 75349
24681 75349 53363 80500 93613 65625 9868 -13931 -82682 -109516 -59790 -79987 -15537 17228
24669A7228l5042M6069Q255N765o9199j8127j5241K2749K4160N5815J5961O764
24657F5157k5897m3624k5880n1811k1618L7749L0288M0437K2312j1086j8827o3883
24645f6683n872P0238R282P1159j5099m5561J2100J1860l0431k8110j7929K2002
24633a3044L3454r890J00068L6759m0172k8859K3808M0044k0258l9330l2102J873
24621E2351l0919n210M544k1739j03542m2852K4286K1516L7233k0345k6449J4412
24609i6714j82J1950M3060Q0798N3041M7555Q442n7688r6102J0927N0470k9492
24597B6065j1732O558k1427r073P61m6607L1789M7098k0961N3908L3619n0223
24585C9775P171K344l1432o3418K2164j7758k4075J9729O2632j897M3526J8210
$$ plain form
24669 17228 -17814 28255 36510 42275 -26924 -45051 -60292 -37543 -13383 42432 58393 65157
24657 65157 39260 -4364 -30244 -82055 -103673 -65924 -35636 4801 27113 16027 -2800 -66683
24645 -66683 -72555 -2317 6965 78124 63025 17464 29564 41424 10993 -17117 -35046 -13044
24633 -13044 20410 10520 110588 147347 107175 78316 102124 142168 121910 82580 50478 52351
24621 52351 21432 16222 20766 -973 -104515 -147367 -123081 -101565 -64332 -84677 -111126 -96714
24609 -96714 -96896 -84946 -41886 38912 91953 139508 147950 90262 -5840 5087 55557 26065
24597 26065 14333 20891 -536 -9609 -8848 -55455 -23666 23432 2471 56379 89998 39775
24585 39775 46946 49290 17858 -45560 -23396 -41154 -65229 -45500 17132 15235 58761 76971
24573G6971n1247J2125J683k1614k4753k0939l199L5231n56J335J9379k3156n8288
24560e7028m4282j1679K5749O0808l8331N3008m94J3860P1466l034m6203J1208
24548C5048J3231K3718k6137l9628j0884J7033J5953J1055J5358o071k4174k5430
24536i28M1561L2885p496J0440l2566l4172M6991j8388p790R28J6017k1453k2569
24523C460O797k1870n3926q447N0855j6054K1082j9253l0477J5195L2661L8400
24511A8423l6722Q904m909P681K3071j414M6710j1342L5899k4198m2131M88J01539
24498A21999M1226j31553l5558O6383j3184k5309P69K3561l8234m6559o621J25
24486d2955Q076l522J1562M7435L2061q359j440j9168m9870l721j727L613j7065
$$ plain form
24573 76971 25724 37849 39532 17918 -6835 -27774 -30973 4258 3702 5037 24416 1260 -57028
24560 -57028 -101310 -112989 -87240 -26432 -64763 -11755 -12249 1611 73077 70043 23840 35048
24548 35048 48279 71997 45860 6232 -4652 12381 28334 39389 54747 48676 24502 -928
24536 -928 40633 73518 66022 76462 43896 9724 56715 38327 30537 31465 47482 26029 3460
24523 3460 10257 -11613 -65539 -73986 -23131 -39185 -18103 -37356 -67833 -52638 -19977 18423
24511 18423 -18299 -9395 -14304 -6623 16448 15034 61744 50402 86301 62103 19972 20460 121999
24498 121999 163225 31672 -3886 62497 49313 24004 24773 48334 10100 -36459 -43080 -42955
24486 -42955 -34879 -38401 -26839 20596 52657 44298 42858 23690 -26180 -29901 -31628 -28015 -45080
24473d5080K8999j8438m96O1375N0472M6055k893j8329J2335j7030m9528m4235
24461C207o3124J9310O1993L1544j9466m28M030j5813j5519k7115J4361k0504
24449b7524K094K6400n4543j3551K8553R4873k3140n1588m616J59L6426L0114
24437D3657k4194k526j1471M1171K4712j7158p4897l9561L8836m1953l8488K8944
24425g2928M2456J1009J6239J1898J319J7793K4300l5258j7936L0354K7131n6835
24413d58n3948P9269L5830j8956J432l5054J1185l5800L4788N265r266p302R486
24400A6471k1979J9632K5733j7084J270J076j334j0622k2235m2326m4038K7920
24388f7516J2508L0244r818k4358k5362M7496m377l0842j5383N5797M2243m8411
$$ plain form
24473 -45080 -16081 -34519 -35015 26360 76832 122887 119994 101665 114000 96970 47442 3207
24461 3207 -59917 -40607 21386 52930 33464 33036 37066 21253 5734 -21381 -7020 -27524
24449 -27524 -25430 970 -53573 -67124 -38571 56302 33162 -18426 -23042 -22883 13543 43657
24437 43657 19463 16937 5466 46637 71349 54191 -20706 -60267 -21431 -63384 -101872 -72928
24425 -72928 -30472 -19463 -3224 8674 9993 27786 52086 16828 -1108 29246 56377 -458
24413 -458 -54406 24863 60693 41737 43169 8115 19300 -16500 18288 23553 14287 6985 16471
24400 16471 -5508 14124 39857 22773 24043 25119 23785 13163 -9072 -51398 -95436 -67516
24388 -67516 -55008 -24764 -34582 -58940 -84302 -36806 -41183 -72025 -87408 -31611 10632 -37779
24376c7779K4205K6776L4254p0279J0321K115m5073l666Q117j3847k2934N864
24364h1926L3519L8138o598J7122M1758J5781L8959J0745q685j1081k1536K2062
24352H8258n2312l6220K2804j7873j7586M6335j7180M6655j82l914n1608J3225
24340B0402L7629l5076o0068m023N3873l692M51j932L7541l3270p6119J0972J2717
24327d0595K0293P0227j7770k1527N3753J1171k6719J0995l0059l2843j4822M76
24315a7420j0110j0789N1115m09q932k5635N043L5860m0425j6608J7381K3065
24303B136n2386j6932M354O4627m39m6658j644N2229n612m0987k6378o348L3620
24290d0418J3206N045N9678j5364l4295K684l914N8373J9717m5383m4564q6799
$$ plain form
24376 -37779 -13574 13202 47456 -22823 -12502 -10387 -55460 -59126 -51009 -64856 -87790 -81926
24364 -81926 -48407 -10269 -16867 255 42013 57794 96753 107498 98813 87732 66196 88258
24352 88258 35946 -274 22530 4657 -12929 33406 16226 62881 62699 58785 7177 20402
24340 20402 58031 22955 -37113 -41136 12737 9045 9496 7564 45105 11835 -64284 -53312 -40595
24327 -40595 -20302 49925 32155 10628 64381 75552 48833 59828 29769 -3074 -17896 -17420
24315 -17420 -27530 -38319 12796 12387 3455 -22180 -17137 18723 -21702 -38310 -20929 2136
24303 2136 -50250 -67182 -62828 1799 1360 -45298 -46942 5287 -325 -41312 -67690 -74038 -40418
24290 -40418 -27212 -22167 37511 22147 -12148 -9464 -13378 44995 64712 19329 -25235 -112034
24278a12034K0286M1973j9167J5325N1735j7863l2294P8047J1317l3391k0746
24267a6812K1867j8035J5420j7035l9102k2762k8419N6780L8097O9824K4908j7013
24255F7718M408N578j6238k2432n7844k0623J5426J221m996M5050O8240Q462l7791
24242E6179K9026m5387j390N1649K9538m4112j4951o0064p4720K2490L4248j9736
24230c7230L9080R0081k1892m8476o056m1156J4637O2801N762k1427L406l4843
24218D687l6652j3696J8721N6759J3181n811k7489q4832m2673K0204N982M7645
24206d3974N9607J6026n5524j8939O4582L8669l3059o2843P24O7222N6774R186
24194I8451m2177n8021M5491O231m3344k5968J987N8753J6601j2054j7172P432
$$ plain form
24278 -112034 -91748 -49775 -68942 -53617 -1882 -19745 -52039 26008 37325 3934 -16812
24267 -16812 5055 -12980 2440 -14595 -53697 -76459 -104878 -48098 -10001 59823 84731 67718
24255 67718 72126 77704 61466 39034 -18810 -39433 -24007 -22786 -27782 17268 85508 93970 56179
24242 56179 85205 39818 38428 90077 119615 75503 60552 488 -74232 -51742 -17494 -37230
24230 -37230 1850 91931 70039 21563 15507 -25649 -11012 51789 57551 36124 39530 4687
24218 4687 -31965 -45661 -26940 29819 43000 37189 9700 -75132 -117805 -97601 -91619 -43974
24206 -43974 15633 31659 -23865 -42804 21778 60447 27388 -35455 -34731 32491 89265 98451
24194 98451 56274 -1747 43744 49975 6631 -19337 -17350 41403 58004 45950 28778 36210
24182C6210L1995j3780r4174l5148l0412M8238o521L7460L1742j1153l21k8370
24170c4234r4266R772M6534M2003J6454J8362m9924l3655q527K1176k78L7033
24158b9550L6420l6129j8193K0879j4631k6171l5404M6390M9687K0393R505l4085
24146a0889j188J5385l9146l9213J4557L4391K6318m6598l09Q7138k8258L4157
24134D6345L1975J6734o5755p9532J6309Q6101N094l0753l0296m0170K2999J09930
24122H8981l167l6000j0608M0433j4446J3805Q988m7075K6841m395M0691J6150
24110A20198M048l4989p1222k2035n411k6340M209M6474K5819K995p068n1131
24098a4453k2467J7050M3187l5181n6881O9580K9882j6020K6647m2013m2388L8806
$$ plain form
24182 36210 68205 54425 -39749 -74897 -105309 -57071 -63592 -26132 5610 -5543 -5864 -34234
24170 -34234 -128500 -118728 -72194 -30191 -13737 4625 -45299 -78954 -87481 -66305 -66583 -29550
24158 -29550 6870 -29259 -47452 -26573 -41204 -67375 -102779 -56389 -6702 13691 23196 -10889
24146 -10889 -12077 3308 -35838 -75051 -60494 -26103 215 -46383 -46692 40446 12188 46345
24134 46345 78320 95054 29299 -50233 -33924 52177 57271 26518 -3778 -43948 -20949 88981
24122 88981 85814 49814 39206 79639 65193 78998 87986 40911 67752 63357 104048 120198
24110 120198 124246 89257 18035 -4000 -9411 -35751 -31542 14932 40751 43746 36678 -14453
24098 -14453 -36920 -19870 23317 -11864 -68745 835 30717 14697 41344 -669 -43057 -4251
24086d251k6302k0942O8086r299l0358J7575N0358K6609m6697k3297k7484k0177
24074d6179J8632R051L5772K0453P767q2458k2650j0815Q87L4552J0420K3483
24062a085K6597N2871J144l4639n6690J1687K6680K0473K9014m7377m7819l0489
24050d9633L7194o3359k5018K0888K7128N8496K3544K0851j3858J8677n1023m0727
24038c6840k8553J9037M2914N0638l2839k035L4218m0579R165Q786P5309M3575
24026A42796r302m0822n2762r3250m893R1038o086p7765m8480M1962R0878J8071
24014E1385k8300J7383O8195j9235k2373m4334n5919P275J3689m9490Q250j2693
24002f6167l223j201O5745r074j7994j8220J2718O7582J3799j679J7167l0836
$$ plain form
24086 -4251 -30553 -51495 16591 7292 -23066 -5491 44867 71476 24779 1482 -26002 -46179
24074 -46179 -27547 -18496 17276 37729 45496 -36962 -59612 -70427 -69540 -34988 -24568 -1085
24062 -1085 25512 78383 79527 44888 -11802 -115 26565 47038 76052 28675 -19144 -49633
24050 -49633 -12439 -75798 -100816 -79928 -52800 5696 29240 50091 36233 54910 3887 -36840
24038 -36840 -65393 -46356 -3442 47196 14357 12322 46540 5961 15126 23912 99221 142796
24026 142796 133494 92672 39910 -53340 -58233 32805 26719 -51046 -99526 -57564 33314 51385
24014 51385 23085 40468 108663 89428 67055 22721 -33198 -25923 -12234 -61724 -53474 -66167
24002 -66167 -69390 -70591 -4846 -13920 -31914 -50134 -37416 30166 43965 42286 59453 28617
23990B8617l4480R44P247m7419N4436K4940L070r213L1560q394m2611n7334m0289
23977h8926N9372k1112l1117l72M7253Q9575L6649k3527k4928j4797k8387j3092
23965a3409l0887p260P7323p399n0320M954J2671p950M9619j2818N5493L5745
23953A05762o6814n8102L6800m8415l2151N6783L9552l5911J734J0345M1125j2711
23941C7997k7942q723K4883j023R346p23j0367j5367P566N3368j6472m1492n5593
23928d4542J8397K4413J6j8888n583J3568m550l8732o0233L34J3945j4229J4541
23915a01543J1673L0705O7938J1453j1780k2865r2654k2268P2659P0454K4120
23904C7892M8747L0848n2773n9719M0897L2933k1403l1464q406l5120M4329j0362
$$ plain form
23990 28617 -5863 -4919 2328 -45091 9345 34285 37355 28142 59702 51308 8697 -48637 -88926
23977 -88926 -29554 -50666 -81783 -82155 -34902 54673 91322 67795 42867 28070 -317 -13409
23965 -13409 -44296 -51556 25767 18368 -31952 -26998 -14327 -22277 27342 14524 70017 105762
23953 105762 38948 -19154 17646 -30769 -62920 -6137 33415 -2496 -762 9583 50708 37997
23941 37997 10055 1332 26215 25192 34538 33815 23448 8081 15647 69015 52543 11051 -44542
23928 -44542 -26145 -1732 -1716 -20604 -26187 -12619 -17169 -55901 -116134 -115800 -101855 -116084 -101543
23915 -101543 -89870 -59165 8773 20226 8446 -14419 -107073 -129341 -56682 13772 37892
23904 37892 86639 117487 64714 4995 45892 78825 57422 25958 17552 -17568 26761 16399
23892A6399l4774M9091J7756k273j0806q878q5634k7795k300k6577j5737L9526
23880i2002P8232J8787j9893o635j8674N5472N1935K3156M034K2029k7930p5131
23868A3380m8816M376M4533j8968p8001j7193J4100n617P2765J8242k729K0265
23856A6337q363M2779K5186q1541k9291O3050n811j4346j5472R571l48k0004j5819
23843c4072Q1337L1735r830k3017J2050J8236l0339o4842J1891j2294J9610M636
23831E101k683m2618l7180J8602n727n334K80m898m6983J7564L6645J4413pO6805
23817A3980K4013M6164k3621l3077n4817r932q674r075K2786r467p977P1506K6121
23804D7930J4485j1071P826j4738l7207P932J8099j4605R153k8993R127k504r601
$$ plain form
23892 16399 -18375 30716 48472 46199 35393 26515 -59119 -86914 -89214 -115791 -131528 -92002
23880 -92002 -13770 5017 -14876 -21511 -40185 15287 67222 90378 94412 116441 88511 13380
23868 13380 -35436 -31060 13473 -5495 -83496 -100689 -86589 -92206 -19441 -1199 -3928 16337
23856 16337 7974 50753 75939 -5602 -34893 28157 22346 8000 -7472 2099 1751 -18253 -34072
23843 -34072 47265 79000 69170 46153 58203 76439 46100 -18742 -6851 -19145 465 5101
23831 5101 2418 -40200 -77380 -58778 -64505 -69839 -69559 -74457 -121440 -103876 -67231 -52818 -52825 13980
23817 13980 37993 84157 60536 27459 -27358 -37290 -45964 -55039 -32253 -41720 -49697 21809 47930
23804 47930 62415 51344 59170 44432 7225 15157 33256 18651 27804 -1189 7938 5434 -4167
23791d167k6322m3593o1744m060j3879K6741O8688M0175L6610J5319Q074q35o9241
23778b8234K8208j0694l1103N858l323m24j201J6484P0502M9859l8678n1095p4009
23765f7850P0117K6172j2675m5355l4321L7232n0618L0195K4060Q330j9058K6282
23753g489O565J5605o0885l3026N0765N5831m7684j8199m8472M2279k3948o0988
23741a29646N1979K3183J8446M2228k015o545K4843l0086k5652K5735J7663J9845
23729B9978K7630j7511j7277l2434M5420L3094j855j0390k5346J7561o839L0932
23717G2963N1027L349n6913p2054K926L9387k699m09K4053R272N6177m873J3000
23704A35206o552m4157j605l3686m8899l865P671K0138Q5368M1754k8781o3072
$$ plain form
23791 -4167 -30489 -74082 -135826 -139886 -153765 -127024 -58336 -18161 18449 33768 41842 41007 -28234
23778 -28234 -26 -10720 -41823 -35965 -39288 -39712 -40913 -24429 46073 95932 57254 6159 -67850
23765 -67850 2267 28439 15764 -29591 -63912 -26680 -77298 -47103 -23043 -14713 -33771 -7489
23753 -7489 -924 14681 -46204 -79230 -28465 27366 -20318 -38517 -86989 -44710 -68658 -129646
23741 -129646 -77667 -54484 -36038 6190 4175 -2370 22473 -7613 -33265 -7530 10133 29978
23729 29978 57608 40097 22820 -9614 35806 68900 67045 56655 31309 48870 42031 72963
23717 72963 123990 127339 70426 -1628 1298 40685 37986 37577 61630 70902 127079 122206 135206
23704 135206 128654 84497 82892 49206 307 -3558 4113 24251 109619 151373 122592 59520
23692E9520k1864k5413k4393J6781l6914j3602l1364J0809k0433K1024p973n5705
23680a29527J5291Q0777P6450J5931p4187L2558Q4453K6184j8163K4788j4863
23669A19692n0700j384j3069p7175l1719O3321Q692M739K192o6429J2110K3522
23657f208L9518n3287l0011J6370N7080O0116J7011q5427j4861J4981n845k0589
23645a1152K545j2655N0598R1849n5476m1160j1940l7339k0474l5680N0664L370
23633b6850K2977M5935n809j9081m8688j0902n284l299j2280K5064O5071M464
23621C1318p6860m5942J4503p737O9324J3543m163J3656L1119l327k3221k0536
23609h323j8951k5927J1358K3161r131K210K3537l9991m78K9900r376O607j4584
$$ plain form
23692 59520 37656 12243 -12150 4631 -32283 -45885 -77249 -66440 -86873 -65849 -73822 -129527
23680 -129527 -114236 -33459 42991 58922 -15265 17293 101746 127930 109767 134555 119692
23669 119692 68992 67608 54539 -22636 -54355 8966 17658 22397 24589 -41840 -29730 -6208
23657 -6208 33310 -19977 -49988 -33618 23462 83578 100589 15162 301 15282 9437 -11152
23645 -11152 -8607 -21262 29336 121185 65709 24549 12609 -24730 -45204 -80884 -30220 -26850
23633 -26850 -3873 42062 36253 17172 -31516 -42418 -47702 -51001 -63281 -38217 26854 31318
23621 31318 -45542 -91484 -76981 -84718 -15394 -1851 -6014 7642 38761 35434 12213 -8323
23609 -8323 -27274 -53201 -41843 -18682 -27813 -25603 -2066 -42057 -42535 -12635 -22011 -15404 -29988
23596b9988k0062k5430m2661j3393N1796J9770n5293n0618L1821N317J6645M3633
23584f8463P8542P7322L5726n9140k3057M1390N1094m5128q899o5490n6390k6677
23572f9170K3490m725l8750K2336Q2484N4568L0991l0898l1859k9045j505R761
23560A7678K7461N9138J2251l2100k7799n855Q798j7879n5902m1177L0216m0185
23548f5355o6535K4730J1053M1645Q2948q3302o6075M1325M4253m420J9858L588
23536a6287j6636n5936N444P3945K9768n3472j9044L2108K9634L007k7375n4282
23524f9126l2852J3115L0757O5838k0156m2476k0291j0606j5012l5517J3555K0025
23512a02746N1774M1716j3980J286J2927L4250J7172n641k4151l5281j3990k6779
$$ plain form
23596 -29988 -50050 -75480 -118141 -131534 -79738 -59968 -115261 -165879 -134058 -128741 -112096 -68463
23584 -68463 10079 87401 123127 63987 40930 82320 133414 88286 79387 13897 -42493 -69170
23572 -69170 -45680 -50405 -89155 -66819 15665 70233 101224 70326 38467 9422 7917 17678
23560 17678 45139 104277 116528 84428 56629 50774 59572 41693 -14209 -55386 -25170 -65355
23548 -65355 -131890 -107160 -96107 -54462 28486 -54816 -120891 -79566 -35313 -39733 -19875 -16287
23536 -16287 -32923 -88859 -83415 -9470 20298 -33174 -52218 -20110 9524 12531 -14844 -69126
23524 -69126 -101978 -88863 -58106 7732 -12424 -54900 -75191 -85797 -100809 -136326 -122771 -102746
23512 -102746 -50972 -9256 -23236 -21950 -9023 25227 42399 36758 12607 -22674 -36664 -63443
23500f3443pK5183j3037j6922m760K4171P675P474r395L5871L3050N6707m553
23487G8014j05678m1674m089L3339K4023M8209k2119o5409o427J1615l8003k2973
23475a11172P9182M7110r159l391l1661m6338k3016L6606M7120j0553j6047J2383
23463b8936L9283N0227j4254j4660K6876N1113m1757J0678L2272n5415q5294J611
23451b8256M9149n3539j5059J761l0162K931n619k8282L9223N7465K2774K789
23439A5175n0776j4985Q651q7k115J065j6110j1619J2805Q782Q667K0494N357
23426a4696l3809L295L867L1204J4689O9793k8127r3797J6358R0590J5457n3282
23414B1542k4628K914N9547K3203K798j6891o9125o5123K4513k3806L9096M5574
$$ plain form
23500 -63443 -63450 -38267 -51304 -68226 -72986 -48815 -41140 -33666 -43061 -7190 25860 82567 78014
23487 78014 -27664 -69338 -73427 -40088 -16065 32144 10025 -55384 -61811 -50196 -88199 -111172
23475 -111172 -31990 15120 5961 2570 -29091 -75429 -98445 -61839 -14719 -25272 -41319 -28936
23463 -28936 10347 60574 46320 31660 58536 109649 67892 78570 110842 55427 -29867 -28256
23451 -28256 20893 -32646 -47705 -45944 -76106 -73175 -78794 -107076 -67853 -10388 12386 15175
23439 15175 -35601 -50586 -41935 -42022 -44137 -43072 -59182 -70801 -57996 -49214 -40547 -20053 -14696
23426 -14696 -48505 -45210 -41343 -10139 4550 74343 46216 -47581 -31223 59367 74824 21542
23414 21542 -3086 -172 59375 82578 85376 68485 -640 -65763 -41250 -65056 -25960 19614
23402A9614m0913k2989K3503O7616j9369l8744Q605L5112K2389P092n3955l9095
23390c1134K5575L8576K158p780r656K6321L455L6593m5056k9111n992K3630K3308
23377E0887L5965k580o5507K755o1817l3118M5576N4104l7347J3351L8899J7371
23365E8539j1888m8177o3399l0746N8380N9395L6199o3858l1851j0357J6704j1765
23353d2824K7086N3386L844l0396l7440m9634M060q357O5012M1835l6665q663
23341a8756j0111O1514K2934M0493n6921n783K1856J6624l801j1227j13501k1408
23329g8087K4523M4435J6711J1607o086M1667P1371k5331n7110m5633l5195j9851
23317e6979k352p26J6271j6572P960M8192R3649R186k4192j7925p4217q1268M2218
$$ plain form
23402 19614 -21299 -44288 -20785 46831 27462 -11282 -2677 32435 54824 61916 7961 -31134
23390 -31134 -5559 33017 35175 27395 17739 44060 47515 84108 39052 9941 3949 27579 50887
23377 50887 86852 84272 18765 21520 -40297 -73415 -27839 26265 -11082 2269 41168 58539
23365 58539 46651 -1526 -64925 -95671 -37291 22104 58303 -5555 -37406 -47763 -31059 -42824
23353 -42824 -15738 37648 41492 11096 -26344 -75978 -71918 -80275 -15263 26572 -10093 -18756
23341 -18756 -28867 32647 55581 96074 39153 33370 55226 71850 68049 56822 -56679 -78087
23329 -78087 -53564 -9129 7582 19189 13103 54770 126141 100810 43700 -1933 -37128 -56979
23317 -56979 -59331 -60057 -43786 -60358 -52398 -4206 89443 98629 74437 56512 -17705 -98973 -56755
23304e6755L7014k2064k7817L0584N2284k1967m5688j804J2947L2751N963P5535
23292G0983r129j3847l188n6624q9088m5936K2871R2606L6311m2800J8540L6029
23280A6728j3021j3901k575J2705K0018q091n8802K5287K3259j7665k9567k7034
23268g2659j4273k414K4006O4964l2401j15047L3210R9738L6572l345j2637j582
23256D132m5835k0690J6428j1491m0472j0156O957P8320o06j9739j6584j5065
23244g4801N5342n666l9247k1188K1803J7704O0686O3908k7673j3431j8752l4475
23232a5790o9489K168N4960l042j7562m8908L2357P2247j6237j4604J4975J7046
23220H121j484k1519R826O20L3587k7546j9580j5087M2577M564l9163m792J7126
$$ plain form
23304 -56755 -19741 -41805 -69622 -39038 13246 -8721 -54409 -56213 -43266 -10515 -4552 70983
23292 70983 61854 48007 44819 -11805 -100893 -146829 -123958 -31352 4959 -37841 -19301 16728
23280 16728 3707 -10194 -12769 -64 19954 11863 -46939 -21652 1607 -16058 -45625 -72659
23268 -72659 -86932 -89346 -65340 -376 -32777 -147824 -114614 -14876 21696 18351 5714 4132
23256 4132 -41703 -62393 -45965 -57456 -97928 -108084 -101127 -22807 -23413 -43152 -59736 -74801
23244 -74801 -19459 -25125 -64372 -85560 -63757 -46053 14633 78541 50868 37437 18685 -15790
23232 -15790 -85279 -83111 -28151 -31193 -48755 -97663 -65306 6941 -9296 -23900 -8925 8121
23220 8121 6637 -14882 -5056 -4436 29151 1605 -17975 -33062 9515 14079 -25084 -29876 -12750
23207a2750L5000L0462N6708m720R575q328n16o895k4218J470J4013J138m3302
23194D7637p2660J4690K3330j1243j463K4800K1502l2060p0453l5955J4387l579
23182h1067q436L8190K7245m245k2543k0226K5627L5014K8655k4205k8781k9280
23170f4052k5647L5914J9865K5455K7739K4513M859K0102j0647N547r660l0390
23158B3598K8062p438j2564k1744q9745l5708N4834P1180L6250p2359p7884j5593
23146a19111N2655M0410L9411L9527K839k0055q878R622J0616M230j8024o5986
23134c2744j7091M2406Q3357n0704o6574K2923N40k2277M0769N2240q709l0580
23122A3556O449j5381p979K5819k5112j2073M3702K7277j0729o0875j6491K3695
$$ plain form
23207 -12750 22250 52712 109420 104700 114275 105947 105431 98536 74318 75788 89801 90939 47637
23194 47637 -25023 -10333 12997 1754 291 25091 46593 14533 -55920 -91875 -77488 -81067
23182 -81067 -89503 -51313 -24068 -28313 -50856 -71082 -45455 -10441 18214 -5991 -34772 -64052
23170 -64052 -89699 -53785 -33920 -8465 19274 43787 48646 68748 58101 63648 53988 23598
23158 23598 51660 44222 31658 9914 -79831 -115539 -60705 10475 46725 -25634 -103518 -119111
23146 -119111 -66456 -26046 13365 52892 55731 35676 26798 36420 47036 51266 33242 -32744
23134 -32744 -49835 -7429 75928 25224 -41350 -18427 -17887 -40164 605 52845 44136 13556
23122 13556 20005 4624 -3355 22464 -2648 -14721 28981 56258 45529 -15346 -31837 -8142
23110h142q736o669J778K9236R2k7092p3952r639m027O227O9481L1116j8940k6314
23096d5581j1137N9842K9213J1859j6985o2196N454j5062l0975L6845M814M0823
23084F914N2391k0890k3182L5823m658L457p489l757L0416p4632k8771K8677j0561
23071a6262N474K1621O915k3383Q161P1459l7453m2405k6663J2028L9867O9894
23059H9253L7762J6677o848R088n4754n0394J5348j6045m4537J7949K5400K6705
23047F5604m8204k0194Q4403L4957k6211m1454M571J3430l9815l9040J9460k9521
23035b2014J2908J3885k7287k9998J3263j8148m0251J7128J7292K9784L7745k2533
23023a8226l3906j5673M2395O166k0164j9739M0294J9954J4264L002K8483J2601
$$ plain form
23110 -8142 -16878 -23547 -21769 7467 7559 -19533 -93485 -103124 -107151 -100924 -31443 -327 -19267 -45581
23096 -45581 -56718 3124 32337 44196 27211 -34985 -29531 -44593 -75568 -38723 -33909 6914
23084 6914 59305 38415 15233 51056 46398 49855 42366 38609 69025 -5607 -34378 -5701 -16262
23071 -16262 -10788 10833 17748 -5635 2526 73985 36532 -5873 -32536 -20508 19359 89253
23059 89253 127015 143692 136844 145932 91178 40784 56132 40087 -4450 13499 38899 65604
23047 65604 17400 -2794 81609 116566 90355 48901 53472 66902 27087 -11953 7507 -22014
23035 -22014 -9106 4779 -22508 -52506 -39243 -57391 -97642 -80514 -63222 -33438 4307 -18226
23023 -18226 -52132 -67805 -25410 -19244 -39408 -59147 -18853 1101 15365 18367 46850 59451
23011E9451m0797l1992k9616K61P1263J4842o852K4346K6362L4556j4040n0618
22999E7166o3192l7996M6298N458J6640l461n0943j2599L3429P7721K1962l0613
22987E9870q2559l5963J4436L9437P1822j0333k5331R336j4873p8915l7767j8445
22975a09285L7879L9227N3269K7805Q691R856l0059K2224R094N476p239j9031
22963D7907L165M883K771k1169K5610l4025L620L8952l5940l8259O6454P6729
22951A40698j9784k5562k3273K0497j1079o3808K116K1699j1626o6895o021K5640
22939a7398m5360l4500o1707K1746O6709O4994N9887j8086r3800n849O451N324
22927e1589J5118l8955l6615M4877j2938k8344K7262M2224M8830L7014k516j5390
$$ plain form
23011 59451 18654 -13338 -42954 -42693 28570 43412 36560 60906 87268 121824 107784 57166
22999 57166 -6026 -44022 2276 7734 24374 20913 -30030 -42629 -9200 68521 90483 59870
22987 59870 -22689 -58652 -44216 -4779 67043 56710 31379 40715 25842 -53073 -90840 -109285
22975 -109285 -71406 -32179 21090 48895 57586 67442 37383 59607 68701 74177 66938 47907
22963 47907 51072 55955 58726 37557 63167 29142 32762 71714 35774 -2485 63969 140698
22951 140698 120914 95352 72079 92576 81497 17689 19805 41504 29878 -37017 -43038 -17398
22939 -17398 -62758 -97258 -158965 -137219 -70510 -5516 54371 36285 -57515 -63364 -56913 -51589
22927 -51589 -36471 -75426 -112041 -67164 -80102 -108446 -81184 -38960 9870 46884 44368 28978
22915B8978m563m9012m2146l5398k0436M9713Q9008J2112r3795k6J8041M672O3486
22902B0634P1q7496k685R8855k0486j112q093K1724K6527J39j3294j7807J445
22889A8422l737l180k8090J4218j5746k4245L2463Q663L157M3307L4021q5362
22877f109k498K3806k4374q0467K0541K8809K1366N5056k9936m536K3633P366
22865C2657j7226N4829Q924p8235J8118N2862J736r875K2044k0034J493m8441
22853A8852l1700P775m539j8796O1386K7632l9362j8769j3213J6316K9908o040
22841B9450M162N230k1056M4137k2097p4999J3029J2271k7470q853N279L4822
22829f095P983n5680k3713N863M2617K5988J299N3796N0772q5819n4193K932M074
$$ plain form
22915 28978 24415 -24597 -66743 -102141 -122577 -72864 16144 28256 -65539 -65565 -47524 -42852 20634
22902 20634 20705 -66791 -69476 29379 8893 7781 -312 21412 47939 48078 34784 16977 18422
22889 18422 14685 11505 -16585 -2367 -18113 -42358 -9895 -1232 1925 45232 79253 -6109
22877 -6109 -8607 15199 -9175 -89642 -69101 -40292 -18926 36130 6194 1658 25291 32657
22865 32657 15431 70260 79184 949 19067 71929 73665 63790 85834 65800 67293 18852
22853 18852 -12848 -5073 -9612 -28408 32978 60610 21248 2479 -10734 5582 35490 29450
22841 29450 33612 38842 17786 61923 39826 -35173 -22144 -9873 -37343 -46196 -40917 -6095
22829 -6095 1888 -53792 -77505 -71642 -29025 -3037 -1738 52058 102830 17011 -37182 -34250 -30176
22816c0176L704n615K5961M684k3160p023J0180m739M1715J8039k3004K7033K963
22803D0562l7422J348K7888j8054j0171M8191K1825q285J954k0465L6026k3158
22791F0239j8640M9729J983m8572j7969j0300K2554L3015n6832k3473N3194J4544
22779E9472l6092J0768O579L2949J2876n512o8423J9396L8628m9387j1390K1388
22767C1252m7353l891m6000J3968N193J8811N3957m0254n4410k5211M7629K6722
22755a9587m7853k2514K4834n797N7780Q874K8884J3945p936L7621j3187m8394
22743F670P415L3547j7034j295n089o4329K6836j9884L3032k4635l7236k2235
22731h4237J7735Q0161L5971N669m5535n2069l0155r648K5098L6998k7605l6436
$$ plain form
22816 -30176 -26472 -32087 -6126 -1442 -24602 -31625 -21445 -26184 15531 33570 10566 37599 40562
22803 40562 3140 4488 32376 14322 4151 52342 74167 65882 67836 47371 83397 60239
22791 60239 41599 91328 93311 44739 26770 16470 39024 72039 15207 -8266 44928 59472
22779 59472 23380 34148 40727 73676 86552 81040 12617 32013 70641 21254 9864 31252
22767 31252 -16101 -19992 -65992 -52024 -46831 -28020 25937 -14317 -68727 -93938 -46309 -19587
22755 -19587 -67440 -89954 -65120 -70917 -13137 -4263 24621 38566 30630 68251 55064 6670
22743 6670 14085 47632 30598 29303 24214 -40115 -13279 -33163 -131 -24766 -62002 -84237
22731 -84237 -66502 13659 49630 55299 9764 -42305 -72460 -82108 -57010 -20012 -47617 -84053
22719h4053j4098K4765q158j7061K695j159L4232m6806l6141Q4596J9659p26j041
22706d3296j4518l2157K3600N4480M8597J8170N780n0787J5383l866k495M2120
22694F1011O6874k7031p9348m3752p493R209P466j6855J3699K3749j1305k4999
22682b8775j1173K101J4999K4139K4141P059k7017k0071M6300K5689K9919j4023
22670G3288o159j4012l2168K0194K8598o3077O932q967k3039m6801Q067O99Q948
22657d7497j198L0017K3342R310M2061K6391j0189j1933n128k9373o0747l7345
22645g2289R722J5661j313r2835J6022M2655k7008k5487M9090N1100K6485j5467
22633b3664k8507M7604L4857J4575m0855j9371L0604k8280k8879L4437k0941m2997
$$ plain form
22719 -84053 -98151 -73386 -81544 -98605 -95910 -97069 -62837 -109643 -145784 -61188 -41529 -42255 -43296
22706 -43296 -57814 -89971 -66371 -11891 36706 54876 60656 9869 25252 21386 18891 61011
22694 61011 127885 100854 21506 -22246 -29739 -20530 -13064 -29919 -16220 7529 -3776 -28775
22682 -28775 -39948 -37847 -22848 1291 25432 32491 5474 -14597 31703 57392 87311 73288
22670 73288 67129 53117 20949 41143 69741 6664 13596 4629 -18410 -65211 -57144 -56445 -47497
22657 -47497 -48695 -18678 4664 13974 56035 82426 72237 60304 55176 25803 -34944 -72289
22645 -72289 -62567 -46906 -48219 -141054 -125032 -82377 -109385 -134872 -85782 -34682 -8197 -23664
22633 -23664 -52171 -4567 30290 44865 4010 -15361 15243 -13037 -41916 -7479 -28420 -71417
22621g1417Q88j3265l5039k2423N1363J3708j0912k851O8103K3160N727M1788
22609D8830O8294O1840k1486o2802k6343k9554k7116M2934l1096l0689K8308M7420
22597F8540l1269o2758N0442K7185n131j9878P710o906K11J1256K3738j1262m976
22584D6902m6722l4810l9868l7713L3567K5900L7504L2127L828j663L265K063
22572B4380K808q0752l7726J9754L7887r607K6288K7267k0248p697L6007r911
22560H450Q42O9555R0193l2414p5912R789Q768p8210m2185j0943P2295J2365j6507
22547A6086j6111J0607J8495j2957l4330O130o3081j5267N3763O405Q907N426
22535a5927R830K8516o342j5060l6047R263N6300M4867m966N2343K095n6159r230
$$ plain form
22621 -71417 -70529 -83794 -118833 -141256 -89893 -76185 -87097 -89948 -21845 1315 7042 48830
22609 48830 117124 178964 157478 94676 68333 38779 11663 54597 23501 -7188 21120 68540
22597 68540 37271 -25487 24955 52140 47009 27131 34841 27935 28146 39402 63140 51878 46902
22584 46902 180 -34630 -74498 -112211 -78644 -52744 -15240 16887 20715 19052 22317 24380
22572 24380 27188 -53564 -91290 -71536 -33649 -43256 -16968 10299 -9949 -17646 18361 8450
22560 8450 9292 78847 169040 136626 60714 70503 79271 1061 -41124 -52067 20228 32593 16086
22547 16086 -25 10582 29077 16120 -18210 -12080 -75161 -90428 -36665 -30260 -21353 -15927
22535 -15927 -6097 22419 16077 1017 -35030 -25767 30533 75400 70434 122777 124872 68713 59483
22522E9483K9381j2929q0545m1096J8334Q7503k946p3159n1732K5271L9131O5330
22510F2026R675k7882n1145L0381O750k3718k6400L1227L3610N9542o27p1170
22498C2269k5206O6529L2361j6082l1156j3608J9429P637l1755k0990J0701J2408
22486D2537M4778J6943k9285M8136n2756n9382m2885J0684J4552p367l3253L0469
22474a6829M98n3836L7458N2547L6947k0769N679o683m6609l995J2436r724j1103
22461b3983J3291L2031N0816j4934k7825O6555k075o454k9060l3702O228k471
22449B8417n3718q914M8207O4013j6878o1094j6653L7998q177K0926p3300k4550
22437f3723L9717K5083m482k1172J2427j8307N48j2162N21k964j965j1902k119
$$ plain form
22522 59483 88864 75935 -4610 -45706 -27372 60131 57185 -15974 -67706 -42435 -3304 62026
22510 62026 71701 43819 -7326 23055 29805 6087 -20313 10914 44524 104066 103439 32269
22498 32269 7063 73592 105953 89871 58715 45107 64536 72173 40418 19428 30129 42537
22486 42537 87315 104258 74973 123109 70353 10971 -31914 -21230 -6678 -14045 -47298 -16829
22474 -16829 -16331 -70167 -32709 19838 56785 36016 41695 35012 -11597 -15592 -3156 -12880 -23983
22461 -23983 -10692 21339 72155 57221 29396 95951 93876 87422 58362 24660 30888 28417
22449 28417 -25301 -34215 13992 78005 61127 33 -16620 21378 13201 34127 -39173 -63723
22437 -63723 -24006 1077 -3405 -24577 -12150 -30457 -29909 -42071 -41550 -44514 -46479 -58381 -60500
22424f0500J6024l1279K952Q5642J0031l4843l8581J700M3321L9714m897n537
22412B3747l2742Q635J2154J0708K9064P715O08q1254o5822M2453J3356r8888
22400a30266J764n273j0984L4013L9833L2002q866m1032K6355Q5977N360o6139
22388c7256N60J1405K683k0146o716O0918N299L5126o448o9065n3644L3092K4967
22375a9225K8071M9645l6876j4088J3487o7815Q992L4708J0131l1729p7297L298
22363i8698J7522K3663R510L571n389J4804K2817K0223L9601J8301l0412k391
22351C3122K5244p0630l1201O2988O6212j747j2126n1616m948l512m1978P392
22339b2800J7728j9045O930m937j1785N4679O8023l2641m8250l9594m4564q231
$$ plain form
22424 -60500 -44476 -75755 -72803 12839 22870 -11973 -50554 -48854 -5533 34181 29284 23747
22412 23747 -8995 -360 11794 22502 51566 59281 59889 -21365 -87187 -44734 -31378 -130266
22400 -130266 -128502 -133775 -144759 -110746 -70913 -38911 -47777 -88809 -62454 23523 28883 -37256
22388 -37256 -36696 -25291 -22608 -42754 -49470 11448 16747 51873 45425 -23640 -77284 -44192 -19225
22375 -19225 8846 58491 21615 7527 21014 -46801 -37809 -3101 7030 -24699 -101996 -98698
22363 -98698 -81176 -57513 -48003 -44432 -49821 -35017 -12200 8023 47624 65925 35513 33122
22351 33122 58366 -12264 -43465 19523 85735 83988 71862 20246 15298 11786 -30192 -22800
22339 -22800 -5072 -24117 -17187 -22124 -33909 20770 88793 56152 7902 -31692 -76256 -84487
22327h4487k2979k3774k0716M6310N9758Q41k905L0014r675K6952O4240o1094
22315B485j8137p0128l656M3505l6794O3446N0969P1744M3320q2099l7985o9980
22303d3310m7797M7914K6460l2617o8743Q108J39017P2221K037m2666j4574m7401
22291a351L9981l2088k7823l8124K1326K3447k7650N838K5871J571J3643K7542
22279C2183l8206m6310J1876l8796j6922m7834k2392Q5308M2538J3815M0805K7560
22267D3625l0736o672k748n3071K995R48L2175J6095L9673L95l7284j2868m0431
22254d7904j6474j0719K7628N2719L4193Q045k5746m8128m7233o185M0650M042
22242c5112Q582L4835l060j0054K2023M470J0499J2209J0846K8352l7484k553
$$ plain form
22327 -84487 -107466 -131240 -151956 -105646 -45888 -45047 -47952 -17938 -27613 -661 63579 2485
22315 2485 -15652 -85780 -89436 -45931 -82725 -19279 31690 103434 146754 64655 26670 -43310
22303 -43310 -91107 -43193 -16733 -49350 -118093 -109985 29032 101253 103290 60624 46050 -1351
22291 -1351 38630 6542 -21281 -59405 -38079 -14632 -42282 -36444 -10573 -9002 4641 32183
22279 32183 -6023 -52333 -40457 -79253 -96175 -144009 -166401 -81093 -38555 -24740 16065 43625
22267 43625 12889 6217 3469 -49602 -46607 -45659 -13484 2611 42284 42679 5395 -7473 -47904
22254 -47904 -64378 -75097 -47469 5250 39443 47488 21742 -26386 -73619 -79804 -39154 -35112
22242 -35112 -26530 8305 5245 -4809 17214 21684 32183 44392 55238 83590 46106 43553
22230D3553k1631q084K2691k8415j1159M3858J3282j5298j7339j7661j7294L4424
22218B0927p129K941Q106M6065L6589m6752p3585k9480k4849m154L2614m5957
22206h4664m1924j8514L0522J29150O1875q888o9172J936L5598K3173n946r1765
22194c8619l5717l330L7786K4098K0822k2068J085P0188K1595N540j1702K1921
22182I1599l4044l8874o245l892K2319M5381L8719L6962k7282n9946r4609j3125
22170d3037r192k281M8000j3470j3900j5810n0131l2540l3743o78M6587K4570
22158i5625M3784l5305l3009M2653J8077O008k666m2296n2797M954k849M0182
22146a08889N0739O8305M4323l8708K8055O877l4828n774k664K9055j5516l9361
$$ plain form
22230 43553 21922 13838 36529 8114 -3045 40813 54095 38797 21458 3797 -13497 20927
22218 20927 13798 16739 24845 70910 107499 60747 -12838 -42318 -67167 -71321 -38707 -84664
22206 -84664 -126588 -145102 -114580 14570 76445 67557 -1615 321 35919 59092 53146 -38619
22194 -38619 -74336 -77666 -39880 -15782 5040 -17028 -15943 54245 75840 81380 69678 91599
22182 91599 57555 18681 12436 8544 30863 76244 114963 151925 124643 64697 -29912 -43037
22170 -43037 -52229 -54510 -6510 -19980 -33880 -49690 -99821 -132361 -166104 -166782 -120195 -95625
22158 -95625 -51841 -87146 -120155 -77502 -59425 -53417 -56083 -98379 -151176 -146222 -149071 -108889
22146 -108889 -58150 10155 54478 15770 43825 50702 15874 10100 7436 36491 20975 -18386
22134a8386J9124M4539n0093o2232M7352K089o1626K6171N9463j0439O6665m353
22122E8274m3609L8364J2419r927j9122j1284l6640o1265J4092J3208j6559L4231
22110b7818L5845O2343j0927k7598j1368n3542m6334j1067j122J0279J0748j1439
22098h2000o658K2736K8334l193k8285K3837O3936j2356O554J7073O5934k7226
22086F8686l5028r5065j6594P26P4589k5419M623K9348j1467Q538M6718j2004
22074C7651m4891p158K1957M4190J7325q8099n7274q4747J0710M7254K45O1220
22062d1617M7779J398J4064K2064K2929l4292j6259p1177m9782K2174Q0152J0185
22050G618k8072n1636J6323m341l6148K6905M8669K632K8336L6888K0378K885
$$ plain form
22134 -18386 738 45277 -4816 -67048 -19696 -17607 -79233 -53062 6401 -4038 62627 58274
22122 58274 14665 53029 65448 55521 36399 25115 -11525 -72790 -58698 -45490 -62049 -27818
22110 -27818 8027 70370 59443 31845 20477 -33065 -79399 -90466 -91588 -81309 -70561 -82000
22098 -82000 -88658 -65922 -37588 -40781 -69066 -45229 18707 6351 12905 29978 95912 68686
22086 68686 33658 -61407 -78001 -77275 -2686 -28105 -23482 5866 -5601 2937 49655 37651
22074 37651 -7240 -14398 7559 51749 69074 -19025 -76299 -161046 -150336 -103082 -102837 -41617
22062 -41617 6162 7560 21624 43688 66617 32325 16066 -55111 -104893 -82719 -2567 7618
22050 7618 -20454 -72090 -55767 -60108 -96256 -69351 -20682 -18050 10286 47174 67552 70437
22038G0437j8024l5405k682K2769j99n4510n5560j7805O3097N5498K2043L9305
22026H8964N17j6528l2817L3712K0347J8389O960J7041k5527r4364p900k5610
22014a6816l1106J7740L6167L1683M1637j3871K9026l5038j3446j353O186N503
22002E6312P050M4347q1899o4743l2105M6632N4147n4065k9163R3686L6820j0302
21990F6717r0975k9487M3013K5653K3707K9122m0062m5547Q914K6886m4965j0822
21978c7846O9826o569p4399K3988N2002m006K6634l6170L2717l7606j8629o2960
21966g3018k9026J0445O2114O1060K8387J1718l1741l4312j173j4538J11N2130
21954D2157l111J9217M7880m4257p6532l2583K5523L082j1980Q0071k7988j1977
$$ plain form
22038 70437 52413 17008 14326 37095 36896 -17614 -73174 -90979 -27882 27616 49659 88964
22026 88964 89481 72953 40136 73848 94195 112584 119544 136585 111058 16694 8794 -16816
22014 -16816 -47922 -30182 5985 37668 79305 65434 94460 59422 45976 44623 50809 56312
22002 56312 63362 107709 25810 -38933 -71038 -24406 29741 -24324 -53487 40199 77019 66717
21990 66717 -24258 -53745 -10732 14921 38628 67750 27688 -17859 -8945 17941 -27024 -37846
21978 -37846 31980 25411 -48988 -25000 27002 22996 49630 13460 46177 8571 -10058 -73018
21966 -73018 -102044 -91599 -29485 31575 59962 71680 39939 5627 4454 -10084 -9973 42157
21954 42157 39046 58263 106143 61886 -14646 -47229 -21706 -18624 -30604 49467 21479 9502
21942I502M7932j1329Q6o3796m5275J0762L497O619O1002j2791j621o9891n2437
21929a17740Q755J8845N6053l0201q5767M4519L0732L2126O8746m1317n4334P556
21917f2027n4893Q635N4038R239K3802L8805L7730k0387k2869q2133J4217j27
21905e5970K7420K9125k2161K4422K3564q8621j4909P891L9436K1351m0209M4743
21893c918j2788o1119l524J104M0673M6294l2802l9602J4412L4732j4450J9467
21881a1521N7697L5330m2388l8329p5963m60J1222M1816n4726l7531J0448L3285
21869g1120O3018j7366l3045J224O434K3594j9169J8147j4501n936J9905r547
21857c8362J7571j4790m4607m5590r074L5144M1637O1169J6560k4479M2565N0388
$$ plain form
21942 9502 57434 46105 46191 -17605 -62880 -52118 -48621 -42002 19000 6209 4588 -65303 -117740
21929 -117740 -108985 -90140 -34087 -64288 -150055 -105536 -74804 -42678 26068 -15249 -69583 -62027
21917 -62027 -116920 -108285 -54247 -45008 -21206 17599 55329 34942 12073 -70060 -55843 -55970
21905 -55970 -28550 575 -21586 2836 26400 -62221 -77130 -69239 -29803 -8452 -48661 -3918
21893 -3918 -16706 -77825 -81349 -80245 -39572 6722 -26080 -65682 -51270 -16538 -30988 -11521
21881 -11521 46176 81506 39118 789 -75174 -75634 -64412 -22596 -77322 -114853 -104405 -71120
21869 -71120 -8102 -25468 -58513 -57289 -50855 -27261 -46430 -28283 -42784 -48720 -28815 -38362
21857 -38362 -20791 -35581 -80188 -125778 -134852 -99708 -58071 3098 19658 -4821 37744 88132
21845H8132n3291J1554K5994m3245o1478J5722M1476m0605j382L8539l2634o4840
21833g6058j2892M382q004L9944Q464j2223l2552M9491P9981j5815k2971q372
21821f625l5981l110K7973j661k6973m4898n5871k6538M9890N4263L4289k311
21809c7553N2086l2656k1427M0058L981k225K610n2731l1853L9674J8365l9706
21797f1377j8097R02R827J2544P219Q417M6848L2950L8537L2009j8787k9448O183
21784F7727J1054o0230n765L2074j0457l8519l3697k7302m350Q345j3579k3268
21772i7967K2743L3925J8390k4750J9499K5807j3443o600N167M0112K2635K3756
21760F9274L9880p218n4832o4296m4188q4661l635R0344M1710l5553j4011j8321
$$ plain form
21845 88132 34841 46395 72389 29144 -32334 -16612 24864 -15741 -17123 21416 -11218 -76058
21833 -76058 -88950 -84568 -92572 -52628 -44164 -56387 -88939 -39448 40533 24718 1747 -6625
21821 -6625 -42606 -45716 -17743 -19404 -46377 -91275 -147146 -173684 -123794 -69531 -35242 -37553
21809 -37553 14533 -18123 -39550 508 4489 2264 4874 -47857 -79710 -40036 -21671 -61377
21797 -61377 -79474 -78572 -68745 -56201 -48982 -40565 6283 39233 77770 109779 90992 61544 67727
21784 67727 78781 18551 12786 44860 34403 -4116 -37813 -65115 -69465 -61120 -74699 -97967
21772 -97967 -75224 -41299 -22909 -47659 -28160 -2353 -15796 -22396 -17229 22883 45518 69274
21760 69274 109154 101936 47104 -17192 -61380 -146041 -149676 -59332 -17622 -53175 -67186 -85507
21748h5507J9593p80j324l093N6089J8206l1883L944K4658K1817J987J4356K2399
21735F0462n5691l687M3476j7966l0392n622o806L371r85o415J5550N5725J4675
21722F5695K4680K7205k2099k4714r4043p7363J7590J5314n651M144K4867K5838
21710a8537L7376L1184j423J0905J7360o2095l3053J7623k8782L7432O2677r852
21698F0815m4975j9093K6095j4364q965J7354p415l8391j8149k3275L2070J1363
21686b6930j7382l0886k0844K4489K3435J8182M8396r279l6530L728K5936Q063
21674A0378K1219n3876m2634M5696l9838P4161N6249j5225m5031k6814j7205P791
21662b5129K7247l264M949m6606l035K6493M209K7249Q043J7484L3536k6822l8594
$$ plain form
21748 -85507 -65914 -66694 -68018 -71111 -15022 3184 -28699 -24755 -97 21720 23707 38063 60462
21735 60462 4771 1084 44560 26594 -3798 -9420 -16226 -12855 -13840 -20255 -4705 51020 65695
21722 65695 90375 117580 95481 70767 -23276 -100639 -83049 -67735 -73386 -69242 -44375 -18537
21710 -18537 18839 50023 48600 59505 76865 14770 -18283 -660 -29442 7990 70667 60815
21698 60815 15840 -3253 22842 8478 -487 16867 9452 -28939 -47088 -70363 -38293 -26930
21686 -26930 -44312 -75198 -96042 -71553 -48118 -29936 18460 9181 -27349 -23621 2315 10378
21674 10378 31597 -22279 -64913 -19217 -59055 15106 71355 56130 11099 -15715 -32920 -25129
21662 -25129 2118 -1146 3803 -42803 -45838 -19345 -15136 12113 20156 37640 71176 44354 5760
21649E760n2909k6822j2560J8693K9999o034L9829k207P054K2857k0821J292L9236
21636D3367J5986l4481L0890Q532o2803l4983K2906P2192j8762k4228p4682k8652
21624h4718N0941M4701N2822m8887l2503k123j9841K8526K0348j5124k0473L2871
21612F540o720r8987k9782L3769O8753K7114o0714M792M8253J9430j8716P9504
21600G3236K0014n7895N0619K2882n3993l0749O041N1301l7303q559p22k1784
21588A3088k7412n548j0929M4163M1714k2259j1026J9196l468K9084J8612n9146
21576B6069l5957J4078l7592l5403N9j0762l1443L236M0441O0069K1531j7015
21564b689k4097m179R0824J2724j2222m9983p5447j3515k588k7511J0940J0618
$$ plain form
21649 5760 -47149 -73971 -86531 -67838 -37839 -43873 -4044 -6251 803 23660 2839 4131 43367
21636 43367 59353 24872 55762 64294 1491 -33492 -10586 61606 42844 18616 -56066 -84718
21624 -84718 -33777 10924 63746 14859 -17644 -19767 -39608 -11082 9266 -5858 -26331 6540
21612 6540 -180 -99167 -128949 -95180 -26427 687 -60027 -55235 -6982 12448 -6268 73236
21600 73236 93250 35355 85974 108856 54863 24114 30155 81456 44153 35594 34872 13088
21588 13088 -14324 -19872 -30801 13362 55076 32817 21791 40987 37519 66603 85215 26069
21576 26069 -9888 4190 -33402 -68805 -68746 -79508 -110951 -107715 -67274 -7205 14326 -2689
21564 -2689 -26786 -30965 59859 72583 60361 10378 -65069 -78584 -81172 -108683 -97743 -87125
21552h7125k2401M5460M7861K2397k9511K5990q418n5812n5523K5257P3851k716
21540b0690j8356j05322k9351l007O1157M1890M4833M1661k3252n1139L1357J5258
21528a4961M565K0505l3357q3M2878K2449j2966n2842q6923k6026O8243K9184
21516c9334K1608j3119p6190P759J0847L7865M6951M4964N6071m5408l7647M8656
21504F3023k8450o47M5047k604j7836j3426k8034n114l5997J8786K5055P5203
21492I5006N0599J0939k2700J4571m5278j04920q1821L649O0969J0743K9139L617
21480B4513l3851P760P9331L3936n669p9819j7009K2361K743l2013k3315K0422
21468f10M4470L4882m472o6304m2371k4169k7710O1447J1574l131J4428M4991
$$ plain form
21552 -87125 -109526 -64066 -16205 6192 -23319 2671 -5747 -61559 -117082 -91825 -17974 -20690
21540 -20690 -39046 -144368 -173719 -176726 -115569 -73679 -28846 12815 -10437 -61576 -30219 -14961
21528 -14961 -10396 10109 -23248 -23331 19547 41996 29030 -23812 -110735 -136761 -68518 -39334
21516 -39334 -17726 -30845 -107035 -99276 -88429 -50564 -3613 41351 97422 52014 14367 63023
21504 63023 34573 33926 78973 76369 58533 45107 17073 11959 -24038 -5252 19803 95006
21492 95006 145605 156544 133844 148415 103137 -1783 -83604 -79955 -18986 -8243 20896 24513
21480 24513 -9338 -1578 77753 111689 106020 26201 9192 31553 34296 2283 -21032 -610
21468 -610 43860 78742 74270 7966 -34405 -58574 -86284 -24837 -13263 -16394 -1966 43025
21456D3025K0639j10513j6406J7114l1793L2734m385o2061P6435O7790j9102p049
21444F428N113M662J8092n2093k8654P2667K1360m1798q938L8827J1682l683k4792
21431A8873j8101j1511m385M1398L3057J9546l9989q397o7k8148J8791m3072L976
21418a8029K4536K6212j692K2320O3269K121j4125k6509m2072l0870J330N8525
21406F5016j2460k7009K667O6335J2015j24919l2224q241M2104M4599k348k4634
21394I01o3703n6203l1235Q7783L2029k4026n6018O3552L9307j2147J6977o981
21382i764L3234j5652q59l2115k7933L221J2919L269k5756J6221k6589N234P8943
21369A4373J2032K1933K0885k3186k1279L2467L8261l5406q6891o6793N385K4479
$$ plain form
21456 43025 63664 -46849 -63255 -46141 -77934 -45200 -49585 -111646 -35211 32579 13477 6428
21444 6428 11541 16203 34295 -17798 -46452 26215 47575 5777 -3161 35666 47348 43665 18873
21431 18873 772 -10739 -15124 26274 59331 78877 38888 30491 30424 2276 21067 -22005 -18029
21418 -18029 6507 32719 31027 53347 116616 118737 104612 78103 36031 5161 6491 65016
21406 65016 52556 25547 28214 94549 106564 -18355 -50579 -58820 -16716 27883 25535 901
21394 901 -62802 -119005 -150240 -62457 -30428 -54454 -110472 -46920 -7613 -19760 -2783 -9764
21382 -9764 23470 7818 6959 -25156 -53089 -49868 -36949 -33680 -59436 -43215 -69804 -64570 14373
21369 14373 26405 48338 69223 46037 24758 57225 95486 60080 -26811 -93604 -88219 -63740
21357f3740k0224O933L4522J1144N9284K227n9795J9464j1202m3680J8702M9558
21345C193N308o7235J5998J3469O037N5073l7691j7646K4081k0910K4720Q2190
21333H6587r133n6339j9418N5504N1386k6510r1168k3645n412k2198l5091J6237
21321g9200m668j6226J5771j6063N9844P7751n2776o1237L1911P9361L4362p1823
21309b993l3322M3051k2655p2860J7276Q1355k5813n995J297q714j8630k3508
21297g1511M8105K8124J1979J6440L643J6303K1835o3107l2196k258j2717k7412
21285f2772O05j9195R458L8958P789l9395n1059J4455p317N4168J6317P970o9457
21272i9475L5236R0218N661M2282O268m2815J3596l3765n3487J6618N5205j3910
$$ plain form
21357 -63740 -83964 -77031 -42509 -31365 27919 30146 -29649 -10185 -21387 -65067 -46365 3193
21345 3193 8501 -58734 -42736 -29267 -23230 31843 -5848 -23494 587 -20323 4397 86587
21333 86587 77454 21115 1697 57201 108587 82077 -9091 -32736 -38148 -60346 -95437 -79200
21321 -79200 -83868 -100094 -84323 -100386 -40542 37209 -15567 -76804 -44893 34468 68830 -2993
21309 -2993 -36315 6736 -15919 -88779 -71503 9852 -15961 -21956 -20659 -29373 -48003 -71511
21297 -71511 -23406 4718 16697 33137 36780 53083 74918 11811 -20385 -22643 -35360 -62772
21285 -62772 -62167 -81362 -71904 -32946 -25157 -64552 -115611 -101156 -108473 -54305 -37988 -30018 -99475
21272 -99475 -64239 25979 31640 73922 80190 37375 50971 17206 -36281 -19663 35542 21632
21260B1632J002m0012J7517k636L3139l9789K8077N323n9899o576j5418j4608
21248g2248J5767j5168J2447O9365J9271m0756m941M304l3021L2278M0879R304
21236C7481r464J7898k1290k2849R394n039R749L7434K0943K9616l0131j3512
21224F0230l6811r424k1771n1690j2702M4771K7454K4476j212l9269J1115J174
21212c659n3654L1501k3600q7568L387N0704M3954M8710J213m683l1688k073l7696
21199f5152l8557j0341l4835M0643Q2828Q0991j9209j4070j244l007r332l7751
21187b9036l5185j6270n460M6051L1501J1863j5766J5201p040J9199J2232J069
21175B8359k1575m8387M612j4064L9503k1162j1580J1460K6779J1279K704l3239
$$ plain form
21260 21632 22634 -17378 139 -2497 30642 -9147 18930 24253 -35646 -42222 -57640 -72248
21248 -72248 -56481 -71649 -59202 10163 29434 -11322 -16263 -11959 -44980 -12702 28177 37481
21236 37481 28017 45915 24625 1776 11170 6131 15880 53314 74257 103873 73742 60230
21224 60230 23419 13995 -7776 -59466 -72168 -27397 57 24533 23321 -15948 -4833 -3659
21212 -3659 -57313 -25812 -49412 -136980 -133593 -82889 -38935 9775 10988 6305 -25383 -27456 -65152
21199 -65152 -103709 -114050 -148885 -108242 -25414 55577 36368 22298 21054 18047 8715 -29036
21187 -29036 -64221 -80491 -85951 -39900 -8399 3464 -12302 2899 -4141 15058 27290 28359
21175 28359 6784 -41603 -36991 -51055 -11552 -32714 -44294 -32834 -6055 5224 7928 -25311
21163b5311L4015M6437r992o4127l2354l117O019R8813J8855m1207n869l3348
21151a1186m1023L1444O2165m4589K9862o934l2367l9145o0192k5524R910j6649
21139a44228K1061O1902N5330J6895L2330m0357k2061l60l5028K5108j3327O017
21127c6718N2667K5030K5594m1574k4237N905j4932R58O1428l2539q6327q7001
21115a51746J6804J2930J1394M8438M759q74L6690l2342m4012J8516O6971M0563
21103B8091L4643k7512o1435j6700L6257k5309m8950p0205l2620O6001L6501L6261
21091d4977K1802Q125O063k1759k8159k6367m0318J9317J9600L5744O8359J5733
21079C3163m1632l1382k5716j1765J6613Q5880O3476k5961m3444o581J7523k2213
$$ plain form
21163 -25311 8704 55141 45149 -18978 -51332 -54449 -48430 50383 69238 28031 22162 -11186
21151 -11186 -52209 -20765 41400 -3189 26673 19739 -12628 -51773 -111965 -137489 -127579 -144228
21139 -144228 -123167 -61265 -5935 10960 43290 2933 -19128 -19488 -54516 -29408 -42735 -36718
21127 -36718 15949 40979 66573 24999 762 6667 -8265 -7307 54121 21582 -64745 -151746
21115 -151746 -134942 -122012 -110618 -62180 -57421 -58295 -21605 -53947 -97959 -79443 -12472 28091
21103 28091 62734 35222 -26213 -42913 -6656 -31965 -80915 -151120 -183740 -117739 -81238 -44977
21091 -44977 -23175 -15050 -8987 -30746 -58905 -85272 -125590 -106273 -86673 -50929 17430 33163
21079 33163 -8469 -39851 -65567 -77332 -60719 25161 88637 62676 19232 12651 30174 7961
21067G961k8793N9168M5384n3441k0645j0779l4432J0199M5216l282j2729K761
21055F588k7346J4582L3233j3169m0975q4303P730K0555R498L1298O6406o850
21043A7247K2911R851r3905n147N647J5173m415M104M1949K5870k1018k0639k1259
21030b3631l4790L9584L7336N1764K1957J8845l4844n2433l1577J5619J3409k0122
21018A117K4420p6843j1867R9471J057n4074l7438M7953J8002l5547K8295N0080
21006E4626L9201o7297o949L865r4941m9001O050J2637L0525m529J5122M2716
20994a7975M483l682k7580j96M1011K6095K1423o936K0894m941j1960j2221k2382
20981F033j7615q367L4127J5579Q998n1470k0465O658K6148p91J3464K213q760
$$ plain form
21067 7961 -20832 38336 83720 30279 9634 -1145 -35577 -25378 19838 16556 3827 6588
21055 6588 -20758 -6176 27057 13888 -27087 -111390 -103660 -83105 -73607 -42309 24097 17247
21043 17247 40158 50009 -43896 -49043 -43396 -28223 -32638 -28534 13415 39285 18267 -2372 -23631
21030 -23631 -58421 -18837 18499 70263 92220 111065 76221 23788 -7789 7830 21239 1117
21018 1117 25537 -51306 -63173 36298 37355 -16719 -54157 -6204 11798 -23749 4546 54626
21006 54626 93827 26530 19581 23446 -71495 -120496 -114446 -101809 -71284 -75813 -60691 -17975
20994 -17975 -13492 -17174 -44754 -44950 -3939 22156 43579 36643 57537 52596 40636 28415 6033
20981 6033 -11582 -19949 14178 29757 38755 -12715 -33180 -26522 -374 -1165 12299 14512 5752
20968E752l8264l2891j906R355L3775P8956l1335j7431k8105N0270M3126m3763
20956B7539n0423J2100O84l6450K9443K842r468o7857n085Q3000K3657k9478j6915
20943c6411K0997M1582r140n965M9489l1359K1442r468q3808R205K3707l1678
20931d1407j8089M2824L4029K5875k8048k7030k1114J159K3135J9382K5296j4050
20919B1962J7412j3624M7849K061n8302m9350j7212P5452K1237j166n0019K417
20907a283L6311k4643m0946p134k8541K4578M2055M0639p1696L2250j0631p3106
20895h2147k1465M9322O4742J0392N0033L568l8501n1238L3740P6297L3767n3832
20883G4678l4076k8598o1293P926l827l6765l719L9608K2522o8930n934O1867
$$ plain form
20968 5752 -32512 -65403 -67309 -57954 -24179 54777 23442 6011 -22094 28176 71302 27539
20956 27539 -22884 -10784 -10100 -46550 -17107 -14265 -23733 -91590 -96675 -13675 9982 -19496 -36411
20943 -36411 -15414 26168 17028 11063 60552 29193 50635 41167 -42641 -33436 -9729 -41407
20931 -41407 -59496 -16672 17357 43232 15184 -11846 -32960 -31801 -8666 10716 36012 21962
20919 21962 39374 25750 73599 75660 17358 -31992 -49204 26248 47485 46319 -3700 -1283
20907 -1283 35028 10385 -30561 -37695 -66236 -41658 397 41036 -30660 1590 -9041 -82147
20895 -82147 -103612 -54290 10452 20844 70877 74445 35944 -15294 18446 94743 128510 74678
20883 74678 40602 12004 -49289 -41363 -45190 -81955 -85674 -46066 -23544 -92474 -98408 -36541
20871c6541j1939N4038j432k8850j0945k3748n8698J0457P3137R708J3147K2310
20859A0644J8937j7720l6175k4448r281Q8009J4513m9041K2988N7308n108m5946
20847B4680k4498m267k6787j4646L4585M3891K6478n7273p090j3106n209L2091
20835H849p278L8696l6485l8763m505P1514K4305k0935r9469J8906O2355p501
20823I689j4797N3896l623m0786o1629o5743k6963L5938M3437k4739j304K5624
20811g1000k6621l5999L4111M7133O3709M7148K5252k4433o2262k5417k1381P60
20799d9000L5600l19l7827M1620J2571L8677K0123R800k5155j01380J7860P8330
20787D0900N8564k8100n2735K0419M122l8790j8708l2161r129m2420p866k742
$$ plain form
20871 -36541 -48480 5558 4126 -24724 -35669 -59417 -118115 -107658 -34521 -24813 -11666 10644
20859 10644 29581 11861 -24314 -48762 -58043 29966 44479 -4562 18426 75734 70626 24680
20847 24680 182 -4085 -30872 -45518 -10933 32958 59436 2163 -4927 -18033 -23242 8849
20835 8849 1571 40267 3782 -34981 -39486 32028 56333 35398 -64071 -45165 17190 9689
20823 9689 -5108 48788 45165 4379 -57250 -122993 -149956 -114018 -70581 -95320 -96624 -71000
20811 -71000 -97621 -133620 -99509 -52376 11333 58481 83733 59300 -2962 -28379 -49760 -49000
20799 -49000 -13400 -13719 -51546 -9926 2645 41322 61445 71245 46090 -55290 -37430 40900
20787 40900 99464 71364 18629 39048 43170 4380 -14328 -46489 -55618 -98038 -105904 -108646
20775a08646M4628N3162J5312k7646j2511m559k8093K2256K6689N7919M5012l5311
20763D8212p6509L7249L6738o2476l7574K9923N3922k5165N353j9479n9309J0901
20751e8214L146J7336J2446N762k3296J7495j7346N7906l1496m3366n0167J0092
20739i9702N4931K2294m8600O8927L4568n2677k9154o998P4350J8163j5694p6157
20727e5749J3026k8793J9878M6864K2425l9813j3470k1754J8919p908K1073J5561
20715i741j0174l6560k7378K512L7969j042j3886J2948r336L8618L2711k6182
20703i541l0216R366q018l1874K1285N8508J247m630k2145l4245J9815k7288l7314
20690i5050Q7082K7652J7225j5827q0700k5114k574J5884k574L9675O518k7615
$$ plain form
20775 -108646 -64018 -10856 4456 -23190 -35701 -40260 -68353 -46097 -19408 38511 83523 48212
20763 48212 -28297 8952 45690 -16786 -54360 -24437 29485 4320 9673 -9806 -69115 -58214
20751 -58214 -55068 -37732 -25286 -19524 -42820 -25325 -42671 15235 -16261 -59627 -109794 -99702
20739 -99702 -44771 -22477 -71077 -2150 32418 -20259 -49413 -56411 17939 36102 20408 -55749
20727 -55749 -42723 -71516 -51638 -4774 17651 -22162 -35632 -57386 -38467 -46375 -25302 -9741
20715 -9741 -19915 -56475 -83853 -81341 -43372 -44414 -58300 -45352 -54688 -16070 16641 -9541
20703 -9541 -39757 -30391 -38409 -70283 -48998 9510 10757 6127 -16018 -50263 -30448 -57736 -95050
20690 -95050 -7968 19684 36909 21082 -59618 -84732 -87306 -71422 -73996 -34321 -27803 -55418
20678e5418K4062K9564m1414m8261K2629J2737m1209L6669N877R730L0336J2965
20666a733l0295l5561L1030N0882J3481o062l3793K1308L339j3910k7107k7591
20654e6012P2788j7313J7543Q7014N974j1048l6832J5355L2566j2124n336L2442
20642A25017N9983J7401p2461p2416p2878j9886K5584J275J7324J8978L0334p122
20630E1133j0559M2926J8121n9158k0684k6511l6474K4920n2259n5710N0749N1102
20618b2404J980J8677m790j9497j2885n7535O0626P6290j1862J2210n699K6471
20606F1582k781m984K3823k03l3367l2905j6255R57j9312K0446J5038l6947j4625
20593c9533N5855j2742K709P166l1234m2940K0928L6855J5944k868j7515K9663
$$ plain form
20678 -55418 -31356 -1792 -43206 -91467 -68838 -56101 -97310 -60641 -54764 -45034 -14698 -1733
20666 -1733 -32028 -67589 -36559 14323 27804 21742 -12051 9257 12596 -1314 -28421 -56012
20654 -56012 16776 -537 17006 104020 109994 98946 62114 77469 110035 97911 92575 125017
20642 125017 185000 202401 129940 57524 -15354 -35240 -9656 -8381 8943 27921 58255 51133
20630 51133 40574 83500 101621 42463 21779 -4732 -41206 -16286 -68545 -124255 -73506 -22404
20618 -22404 -20424 -1747 -6537 -26034 -38919 -96454 -35828 40462 28600 40810 35111 61582
20606 61582 58801 53817 77640 77437 44070 11165 -5090 -4133 -23445 -2999 12039 -24908 -39533
20593 -39533 16322 3580 6289 13455 -17779 -60719 -39791 -2936 13008 10140 -7375 22288
20581B2288J150k2743l2864O336M7468m653j2212k3725O485J3405N097k7096l605
20568b4669l364Q222J1630j9407n0103m20j4327j5773M645K5402P4694M2396O95
20555C9621K0584k8281n3783m1785J5987O3556L4714K1166P323K2836L1160l0846
20543A02252l1961L796m5055n0587l254n568l0985o835O3195J327k0174J8517
20531e332L0626l3495m2897L0313J4648Q3269M0368r848q3997k3509l8077q16
20519c8747M5675K0415J7335j4112M674j9088l1651L3022P556N555j2068k9782
20507a1216q988J639K4503L4226k213j1141O905l8371O24j1537j4255K7854L88
20494a582K5590J621J6256M197K782J7452j825l8422j4153N1650k389m7074j8761
$$ plain form
20581 22288 23438 695 -32169 -25833 21635 16982 4770 -18955 -12470 935 6032 -21064 -24669
20568 -24669 -28033 -19811 -8181 -27588 -77691 -78111 -92438 -108211 -103566 -78164 -3470 38926 39621
20555 39621 60205 31924 -21859 -63644 -47657 15899 50613 71779 79102 101938 133098 102252
20543 102252 70291 74087 29032 -21555 -24809 -30377 -61362 -68197 -5002 -3675 -23849 -5332
20531 -5332 25294 -8201 -51098 -20785 -6137 77132 117500 107652 23655 146 -37931 -38747
20519 -38747 6928 27343 44678 30566 35240 16152 -15499 17523 25079 30634 18566 -11216
20507 -11216 -20204 -18565 5938 40164 37951 26810 33715 -4656 -4032 -15569 -29824 -1970 -1582
20494 -1582 24008 25629 41885 46082 48864 66316 64491 26069 11916 63566 61177 14103 -4658
20481d658l614p097j1268K0218L3790j7224k8230L1905J7721j6880j7210n144
20469g691j0333n2770L077K3696K6094p548P3644P8221n9268j14635m1752M2078
20457d7187M2702N923J2984m7553l14K0344L9590l7723q5733j4565Q2887N2044
20445B3399o9714m3749j3803K9824O6311q115n1153r711L8401M958J0767K8858
20433F273J6792N0231L2700J0777n3687l5389k8168Q714P006m5852m461K5899
20421i165j8505J8853N2627k2153k0388p0437l8455o9353P565R9875N7186J8753
20409F403K090m5289p041M5472n979k9492n1775k5469R31P6986P1171K683m7125
20396f434L0279K3673J1014j0062L172j8066l0591K1264L0318j2617J6968k5581
$$ plain form
20481 -4658 -8272 -15369 -26637 -6419 27371 10147 -18083 13822 31543 14663 -2547 -7691
20469 -7691 -18024 -70794 -67717 -44021 -17927 -25475 48169 126390 67122 -47513 -89265 -47187
20457 -47187 -4485 1438 14422 -33131 -33445 -13101 26489 -11234 -96967 -111532 -28645 23399
20445 23399 -46315 -90064 -103867 -74043 -7732 -15847 -67000 -76711 -38310 -33352 -22585 6273
20433 6273 23065 73296 105996 116773 63086 27697 -471 8243 15249 -30603 -35064 -9165
20421 -9165 -27670 -8817 43810 21657 1269 -69168 -107623 -176976 -169411 -69536 -12350 6403
20409 6403 8493 -36796 -43837 1635 -4344 -33836 -85611 -111080 -110149 -33163 38008 40691 -6434
20396 -6434 23845 47518 58532 48470 51642 33576 2985 24249 54567 41950 58918 33337
20384C3337m4893k6879l8855o8928k9297Q26K2351J16239Q0782k5768m5948o0698
20372h7731N109j4559N553n6667M293M1991l6230M8221N9553n481R386l2854K9475
20359b9941O4390K1441l0269K4137L9120m913m8154m8945L6986K5415J2943K2317
20347H4527k7215j2135J5131j4015M366k6244l145o0712m7748K1595K356L8792
20335b4447j3030J6829L5339L8592N404J1926l9613r79j2920K8604L7212j9225
20323F3692m217Q207K3433M2933J7643J3144q2327r4785L0720J6977M5453P3027
20311A53900J275j963o7488O8379O5569M7745K5727M6695P9375N6758N4742J27151
20299F57865J46717J06998J93026J41443j9986j44334k36943j70456j18424j06951
$$ plain form
20384 33337 -11556 -38435 -77290 -146218 -175515 -174689 -152338 -36099 44683 18915 -27033 -87731
20372 -87731 -82622 -97181 -91628 -148295 -144002 -102011 -138241 -90020 -30467 -35948 -26562 -59416 -29941
20359 -29941 34449 55890 25621 49758 88878 83965 35811 -13134 23852 49267 62210 84527
20347 84527 57312 45177 60308 46293 50659 24415 21270 -39442 -87190 -65595 -63239 -24447
20335 -24447 -37477 -20648 14691 53283 58687 70613 31000 30021 17101 45705 82917 63692
20323 63692 59475 67682 91115 134048 151691 164835 82508 -12277 18443 35420 80873 153900
20311 153900 155175 153212 85724 154103 219672 267417 293144 339839 419214 475972 530714 657865
20299 657865 804582 911580 1104606 1246049 1226063 1081729 844786 674330 555906 448955
20289D48955k3808l412J3904n7833m8086J0080Q5163P0596J47258J98083J38187
20278I79087J39630J08908r087j52964j68040j22294j02217k00649j06977j04617
20268B60780l1785l4291k247n0374L023r890o4012o2317Q387M4662l5662l2317
20256f043k9451N6385O3011K3267n0649l2661L9461K4162J4789J7593j05980J1469
20244B5353M7876j2864m2469k0881M4191J7748P446l6882j8259k9262j0223j8463
20232d6689l086M1957o287N7171M4225l96j2356k9830m2706l3394J1840l3415
20220e2966K8775L0534m8532j3278P0310L2856J9244k0880k3451J4413J2487o5185
20208a5673J7267L8912L96J1843O473k723n7499k7982K1541m7785n2607L1726
$$ plain form
20289 448955 425147 421735 435639 377806 329720 339800 424963 495559 642817 840900 979087
20278 979087 1118717 1227625 1218538 1065574 897534 775240 673023 472374 365397 260780
20268 260780 228995 194704 192457 142083 145106 135216 71204 8887 17274 61936 26274 -6043
20256 -6043 -35494 20891 83902 107169 56520 23859 63320 87482 102271 119864 13884 25353
20244 25353 73229 60365 17896 -2985 41206 58954 66400 29518 11259 -18003 -28226 -46689
20232 -46689 -49775 -7818 -14105 43066 87291 86895 74539 44709 2003 -31391 -19551 -52966
20220 -52966 -24191 6343 -42189 -55467 14843 47699 66943 46063 22612 37025 49512 -15673
20208 -15673 1594 40506 40902 52745 59218 56495 -1004 -28986 -7445 -55230 -107837 -76111
20196g6111N4381M7849J3422l9067l222J7877O5187j1646k6069k4829l6870K8283
20184I185K7212M165j1971n654j560k4392K5828j0864q8667o8488K3007N5243
20172f6956M2515K5333m8851O186L9316K3336K885m7078J5656l4182J0446j5367
20160d6761P8730J8683J0303j8219n0417m021M5414R623J5228J242j7159k842
20148C9804n6773k0867j6175m7066L2508P6186k112r346P862l8864p847L0415
20136a2275m7820k667M5331J9527j5467k2334n6673j0193N9830L4117L5312m394
20124B2294j8060p339J4590Q784j4869K2162J2669M292N563l4120L4042J1653
20112F1661J5037j0113m048k1665q1864k3860K9683O4366M761K121n516M9565
$$ plain form
20196 -76111 -21730 26119 39541 474 -2748 15129 80316 68670 42601 17772 -19098 9185
20184 9185 36397 40562 28591 22937 21377 -3015 22813 11949 -76718 -145206 -122199 -66956
20172 -66956 -24441 892 -47959 -41773 -2457 20879 23764 -23314 -7658 -41840 -31394 -46761
20160 -46761 31969 50652 60955 42736 -7681 -11702 33712 43335 58563 59805 42646 39804
20148 39804 -16969 -37836 -54011 -101077 -68569 7617 5505 -3841 4021 -34843 -42690 -12275
20136 -12275 -60095 -62762 -17431 2096 -13371 -35705 -92378 -102571 -42741 -8624 26688 22294
20124 22294 4234 -3105 11485 20269 5400 27562 40231 44523 50086 15966 50008 61661
20112 61661 76698 66585 62537 40872 -40992 -64852 -35169 29197 33958 36079 30563 80128
20100H0128j389j7615J1489j7432l0002q4111j948L8337K1913l1909k5078K4401
20088c3216j2816J2894P8265M1088k5637j5722l0577L0378N0710k5772J6528l787
20076H2336j8754k2520k4307K315l3399N906o355P261N3362K2028o1205J839J4898
20063B3405m941O584L87l1002J7423k6264K0948l0070J0842K4024m916J1505L3319
20050E1244n3606n3971O144J02031N9933M5607j6298m1706k704J0745k3253o6562
20038A7604p1306l4289K3789K3758M0542K7961m2885K7087L339M638l5899k4378
20026d0039K2983J11622J5294K16l0041n0905q739L2688L4419r6060o9458J3427
20014f4593N5713j6749j8743L0406j2501j1769J0912K8396R641J1745P5197P6893
$$ plain form
20100 80128 78739 61124 72613 55181 25179 -58932 -60880 -22543 -630 -32539 -57617 -33216
20088 -33216 -46032 -33138 45127 86215 60578 44856 14279 44657 95367 69595 86123 82336
20076 82336 63582 41062 16755 19070 -14329 -8423 -14778 -7517 45845 67873 6668 8507 23405
20063 23405 18464 25048 25435 -5567 11856 -14408 6540 -23530 -12688 11336 6420 17925 51244
20050 51244 -2362 -56333 -50189 51842 111775 157382 141084 99378 96674 107419 84166 17604
20038 17604 -53702 -87991 -64202 -40444 98 28059 -14826 12261 15600 20238 -15661 -40039
20026 -40039 -17056 94566 109860 110076 80035 29130 20391 53079 87498 -8562 -78020 -64593
20014 -64593 -8880 -25629 -44372 -13966 -26467 -38236 -27324 1072 10713 22458 97655 174548
20002A74548r026l632k2535n533N1950L9566J5662k9821L0708r617M5267O2778
19990C40315R6609N4816k8562j04413j18666n0393j2622j0195l7805o5981M490
19979F7593l3477j3537O5142p652J1150n8405J2432R3872k185J1054n3696k5578
19967F6713m8229K0703M5483R63m1224q5827o6737n8303M2171M0019K2977K5399
19955c5892J6431K318M4353O5502N4015j3063o677o7192j6952l6312M6244M7724
19943A00499K6868J6792k556k1831m1936J8072P298m3832m4143L0066J0168O979
19931F2444N9164J443k1410P38j2741q438R61J6291N2338R8420L3951k9040l3711
19918B20410n9708q8057M9461j7295m3614P280L3552O7158k8579m0310K4813J0854
$$ plain form
20002 174548 165522 161890 139355 133822 185772 225338 241000 211179 241887 232270 277537 340315
19990 340315 436924 491740 463178 358765 240099 189706 177084 166889 129084 63103 67593
19979 67593 34116 20579 85721 78069 89219 30814 43246 137118 134933 145987 92291 66713
19967 66713 18484 39187 84670 85633 44409 -41418 -108155 -166458 -124287 -84268 -61291 -35892
19955 -35892 -19461 -17143 27210 92712 146727 133664 126987 59795 42843 6531 52775 100499
19943 100499 127367 144159 141603 119772 77836 95908 103206 59374 15231 45297 55465 62444
19931 62444 121608 123051 101641 102379 89638 81200 82161 98452 150790 249210 283161 254121 220410
19918 220410 160702 72645 122106 104811 61197 68477 102029 169187 140608 100298 125111 135965
19906A35965j505l2804k0128o561O431r484N204j6901o368k5454J344M0045P6020
19893A45804J7449M5814M413q0590m3382j217K7862j9658j6634o3392m4983K8615
19881A01M5498R3888K2881j2627k8566k1565N434J10870R466j3677J5623N0390
19869B77716J4478N705J2942n2315k8947M691N2377l7296L7076L4162n1686l6385
19857B32518l4482L2533k0448M2524J0742J1852O4923n18k6798k7940K2196j1684
19845B95418m1271n4k7193o405k7027N1373R8538P0956K2511m9591n9247K8874
19833C56882J5917l5296l9024q586Q4365J4417m7593l466O7486K7297n3749Q456
19821C87106O3096O5374N433j8169j769J5339m3873j1753Q387j0525K197r229
$$ plain form
19906 135965 134460 101656 81528 74967 81398 71914 77118 60217 53849 28395 29739 69784 145804
19893 145804 163253 209067 213480 132890 89508 88291 116153 96495 79861 16469 -28514 101
19881 101 45599 139487 162368 149741 121175 99610 105044 215914 225380 211703 227326 277716
19869 277716 292194 297899 310841 258526 229579 234270 286647 249351 286427 320589 268903 232518
19857 232518 198036 230569 210121 252645 263387 275239 340162 339644 312846 284906 307102 295418
19845 295418 254147 254093 226900 220495 193468 244841 343379 414335 436846 387255 328008 356882
19833 356882 372799 337503 298479 289893 374258 388675 341082 337616 405102 432399 378650 387106
19821 387106 450202 515576 521009 502840 501071 516410 472537 460784 469171 458646 460843 451614
19809D51614K2664O3718M628J7854O6088k681q057K3249P960K4940J1284Q52N5134
19796G39247K7146O6639J10499J10284M9772J9015N4788N9301J08596Q4527J10121
19785A539935J49719J82053K23392J97993K13640K66509K39542K24153K79563
19776C516499M41306M61425M14326M45958L24261O9076o4170j4868o113J61465
19766E749165L84171N01365O69325Q65590Q76780R24234J057142J143325J329597
19757A3500694J773804K076192K274647K438841K504802K788263L122238L461094
19749C3940575M002097M835144N865284P238564R160302J2231315J6822173K4396052
19741A18491506L5914132N1268985O6649751O7729845N4620572M7679772J6125503
$$ plain form
19809 451614 474278 537996 542624 560478 626566 623885 615828 639077 647037 671977 683261 684113 739247
19796 739247 766393 833032 943531 1053815 1103587 1122602 1177390 1236691 1345287 1429814 1539935
19785 1539935 1689654 1871707 2095099 2293092 2506732 2773241 3012783 3236936 3516499
19776 3516499 3957805 4419230 4833556 5279514 5603775 5672851 5608681 5593813 5587700 5749165
19766 5749165 6133336 6634701 7304026 8169616 9046396 9970630 11027772 12171097 13500694
19757 13500694 15274498 17350690 19625337 22064178 24568980 27357243 30479481 33940575
19749 33940575 37942672 42777816 48643100 55881664 65041966 77273281 94095454 118491506
19741 118491506 154405638 205674623 272324374 340054219 394674791 442354563 458480066
19734D58480066m5160589o6277228o5128243p0093127o2315521m3914460k8080476
19727G7510422j8159503j2523175r137731o791907n119023l946225l168550k346979
19719A6317329j666908j210138r08700p30281m81123m51792p19711p01847o74514
19710H772315o66527o60004n65888m10028l70581k66387k22082j26035K8241L7738
19700E550762j7910n7035l17116n03922m51629m76718n21410l77616k72346j82284
19690B372776j53908j11751q2494n9975j04327j03665j35797j06392q9955p8163
19680A346349n6573k880p2025n2671j231n5675o5282Q660M553j08400j7436j0344
19668I17045p0599o8513l5336m1357j3039J372J5524J6810o3011n8747j9744J6219
$$ plain form
19734 458480066 413319477 347042249 281914006 211820879 149505358 105590898 77510422
19727 77510422 59350919 46827744 37690013 30898106 25779083 21832858 18664308 16317329
19719 16317329 14650421 13440283 12531583 11801302 11320179 10868387 10148676 9446829 8772315
19710 8772315 8105788 7445784 6879896 6469868 6099287 5832900 5610818 5484783 5513024 5550762
19700 5550762 5532852 5475817 5158701 4654779 4203150 3726432 3205022 2827406 2555060 2372776
19690 2372776 2218868 2107117 2024623 1964648 1860321 1756656 1620859 1514467 1424512 1346349
19680 1346349 1289776 1286896 1214871 1162200 1160969 1105294 1040012 1048672 1053225 944825 927389 917045
19668 917045 846446 777933 742597 701240 688201 689573 705097 721907 658896 600149 580405 596624
19656E96624l1153J894O0235j944o4874p054o675K9282k2166p5182j2578l3528
19644D32881O6249K0563m6359n1349n3367j4075N8539K0694j6713k4526j2292
19633C80245K6488j9679k8146J8772K2084p673n1663l2279k8148K1306l6863o2083
19621B02361N7028N5575l7563o2072l6987N3421J30496O9212J8761m5951m8986
19610C55295q1381l3989o866P1066J3360m6756N486J3474n2334q1025J382P6550
19598B34262M2795m5576o0372J1799J4345m9264k0230K8741o14J8296k1212R897
19586A62867k4674O3434j0287l5516n2335M2069J2338l3655m0258M7898P7796
19575B09677n837l6080l5967N1180k6364l997m329r633m2595o5407n7649k5968
$$ plain form
19656 596624 565471 567365 627600 625656 560782 553728 547053 576335 554169 478987 466409 432881
19644 432881 499130 519693 473334 421985 368618 354543 413082 433776 417063 392537 380245
19633 380245 406733 387054 358908 377680 399764 392091 340428 308149 280001 301307 264444 202361
19621 202361 259389 314964 277401 215329 178342 231763 362259 431471 450232 404281 355295
19610 355295 273914 239925 233059 304125 317485 270729 276215 289689 237355 156330 157712 234262
19598 234262 277057 231481 171109 182908 197253 147989 127759 156500 155886 174182 152970 162867
19586 162867 138193 201627 191340 155824 103489 145558 157896 124241 83983 131881 209677
19575 209677 203840 167760 131793 182973 156609 152612 148283 138650 96055 30648 -27001 -52969
19563e2969O8851K3705r411k4894M055k2592N6331j3326J1825K1531L1005L064
19551I7175m8989k046j4101j7869j0618O20l1020k2058l6959P9607K4961K2297
19539D1000P8128J9111m3656j34288L1066J7632m250R7494K1057k1219j7635j9939
19527F4501k0994p243m9832K0423L7324J0045K5412L5009R300n1051k606M0344
19515A10632R7361j379j0578K9899k1384l2270J3429M7483k421k8097r9671o6906
19503C6098r895L7838L370k4856k5402J243j3940M1940M9121l7972j6361j3228
19491B7956k5451L5348M5722K2177J2619N994n6684m3429N1784Q5475L5311M1574
19479B38396J0643n6331p2612k2289l5626p8689r840L6673M8769P2526j0560m5434
$$ plain form
19563 -52969 15882 39587 30176 5282 9337 -13255 43076 29750 41575 63106 94111 97175
19551 97175 48186 46140 32039 14170 3552 4172 -26848 -48906 -85865 -6258 18703 41000
19539 41000 119128 138239 94583 -39705 -8639 8993 4743 102237 123294 102075 84440 64501
19527 64501 43507 36264 -13568 6855 44179 54224 79636 114645 123945 72894 70288 110632
19515 110632 207993 206614 196036 225935 204551 172281 185710 233193 230772 202675 103004 36098
19503 36098 26203 64041 67411 42555 17153 18396 4456 46396 95517 57545 41184 27956
19491 27956 2505 37853 83575 105752 118371 124365 67681 24252 76036 161511 196822 238396
19479 238396 249039 192708 120096 97807 62181 -16508 -26348 10325 59094 131620 121060 75626
19467G5626m2210J3833J2735M2765j6314K3258P150k6399j5477m7212J1148K9136
19455F8039j179Q883p000l7976R830M2554K9756J1666m7130J7958M1742K2368
19443A59511n0165o3085M7953M406R529R042l0854l0821k8011J9032J03606K0820
19431A70963l1384J2106q8952n5023k9613q985j0740K5564M8506j0176k586J7526
19419C7206N5261R363o9635m8385j9380N8931q686o1859m3831p791O4484L6699
19407B377k7712m0012k5964K7256k0822K2276M2064M2628K7790M3736N0412k3956
19395A20073q3553m2448j0828k9276J6684m0559P3829o636j6497P312o6514o6802
19383a45215L7484K6175P8965M1964J8932m4978j0134J2378p299n374M928m6589
$$ plain form
19467 75626 33416 47249 59984 102749 86435 109693 116843 90444 74967 27755 38903 68039
19455 68039 66860 75743 68743 30767 40597 83151 112907 124573 77443 95401 137143 159511
19443 159511 109346 46261 94214 98620 108149 117191 86337 55516 27505 46537 150143 170963
19431 170963 139579 151685 62733 7710 -21903 -30888 -41628 -16064 32442 22266 19680 37206
19419 37206 92467 101830 32195 -16190 -35570 23361 14675 -47184 -91015 -98806 -34322 2377
19407 2377 -25335 -65347 -91311 -64055 -84877 -62601 -20537 22091 49881 93617 144029 120073
19395 120073 36520 -5928 -16756 -46032 -29348 -69907 3922 -2714 -19211 -11899 -78413 -145215
19383 -145215 -107731 -81556 -2591 39373 58305 13327 3193 15571 8272 2898 7826 -38763
19371c8763J2078R70J7338k594K0248l2691J8104j9162K5549O2873K3690n566
19359H2074m3289m2347k3369j4206o590L681K8987k5862R951K9568L6319J0010
19347D4927l8767L822m893l853j5635N0130n660j3140N0426p089n2250k0081K7117
19334A5054j2754R809L4064j752m0329M0299N1262m9780L22j6878j0651q552m774
19321E340L4973J7021k0443K5966P224L1179k2941n4271R615L1272k9410K2176
19309E7701K5340l2140o4459N469N2790K1599l5303m4336j7309M5021P4843l5874
19297E3342k0392j9944o5692o276M1433M350K2607L2938L684j764K9305k6074
19285D7517o675n0941p3935n092N2210N1025j2850j1992J3906j8975L2138Q092
$$ plain form
19371 -38763 -26685 -25715 -8377 -10971 9277 -23414 -5310 -24472 1077 63950 87640 82074
19359 82074 38785 -3562 -26931 -41137 -47727 -44046 -15059 -40921 -30970 -1402 34917 44927
19347 44927 6160 9982 5089 1236 -14399 35731 30071 16931 67357 60268 8018 -12063 15054
19334 15054 2300 12109 46173 44421 4092 44391 95653 45873 46195 29317 18666 10114 5340
19321 5340 40313 57334 36891 62857 70081 101260 78319 24048 33663 64935 35525 57701
19309 57701 83041 50901 -13558 -8089 44701 66300 30997 -13339 -30648 14373 89216 53342
19297 53342 32950 13006 -52686 -58962 -17529 -13179 9428 42366 46050 44286 73591 47517
19285 47517 40842 -10099 -84034 -89126 -36916 14109 1259 -10733 3173 -15802 16336 24428
19273B4428j5770M8838Q4773r470p7471l0153k5997K3755j4490n7652l7392J1429
19261g5172M0040K9975j6377L5166K8647j1133o4741J2404j5875l8055n5600j0244
19249a40965Q4510O0998L9013J4613K0567M4213j1172n4624k7021n0448l4266
19238e4582L9280O8679P3473j6085l8969o4004k1999j2730k820j4093M3197J9985
19226A9332k187p1986j3817K2709L1191J9133R614J7708n0412j9446q676J2239
19214c4598L1644K2791J3420p935k0718l3512m306O1596l1586J4819L4289J02344
19202A48248l9911j4561M4529M8170K3949L0675q915Q358O1271J11440J13064
19191E26317J12124J19287J57439J60288J25369O7483p8714j35892k22704j89656
$$ plain form
19273 24428 8658 57496 142269 132799 55328 25175 -822 22933 8443 -49209 -86601 -75172
19261 -75172 -35132 -5157 -21534 13632 42279 31146 -33595 -21191 -37066 -75121 -130721 -140965
19249 -140965 -56455 4543 43556 58169 78736 122949 111777 57153 30132 -20316 -54582
19238 -54582 -15302 53377 126850 110765 71796 7792 -14207 -26937 -29757 -43850 -653 19332
19226 19332 17145 -54841 -68658 -45949 -14758 4375 13989 31697 -18715 -38161 -46837 -34598
19214 -34598 -2954 19837 33257 25322 4604 -28908 -33214 28382 -3204 11615 45904 148248
19202 148248 108337 93776 138305 186475 210424 241099 232184 240542 301813 413253 526317
19191 526317 638441 757728 915167 1075455 1200824 1268307 1189593 1053701 830997 641341
19181F41341j21896j03133p8469n304K7501P534L2146O3093r323J23063J63622
19170G40175J11790J06521J46694Q1254k8403j10240k39897j75239k24793j29430
19160B78432r6741n7117l8497l8848K557m3679p051M4244J1687l2095m6925m1098
19148f5131M0311J5740J4266q402Q703J3102K4658J2915m1448l4997R299j3550
19136b4534J1279J4358l57J6930K667k3347m6493K2060K0100k5671J7058K6844
19124A0894K7597m4232m4144k2140L216J3759M1906L4087k3579m3237K3891M3401
19112B1419m4821m6743L2850k213N7818k4535m2133J47r268j5369k288L9747r146
19099d4535K2951j7067l466L4711L0372o1119j9816j1930N8203k2986O925l8396
$$ plain form
19181 641341 519445 416312 337843 332539 360040 367574 399720 462813 453490 576553 740175
19170 740175 851965 958486 1105180 1186434 1158031 1047791 807894 632655 407862 278432
19160 278432 181691 124574 86077 47229 49786 6107 -944 43300 54987 22892 -24033 -65131
19148 -65131 -24820 -9080 5186 -3216 5487 18589 43247 56162 14714 -20283 -10984 -24534
19136 -24534 -13255 1103 746 17676 20343 -3004 -49497 -27437 -7337 -33008 -15950 10894
19124 10894 38491 -5741 -49885 -72025 -68809 -55050 -13144 20943 -2636 -45873 -21982 21419
19112 21419 -23402 -70145 -37295 -39508 18310 -6225 -48358 -48211 -57479 -72848 -75136 -35389 -44535
19099 -44535 -21584 -38651 -42117 -7406 22966 -38153 -57969 -69899 -11696 -34682 -27757 -66153
19087f6153L5876P5878K2262j97k0542l7999l5812k70M3282K731j1408j6683K2013
19074A2978N8676m2982l4702K0464l8881J8440N6887m1496m3082j0995M8193J1698
19062A5198K148n4424K1347M8625J3857k211J6021m6711J2534l4923M0743n4237
19050b2033o1635L9695L7765N205l6770k9175O3671L9114k848k9302O6206j7080
19038E2813j7227K6065J4984R801l4124l0500k4960j140Q990k5659m7973J7108
19026e1822J31213L1445j5395n0769k0237l7958j0187m0826j0009J2947j1995
19015g3593K909N3571l0607m8428R920P9459j3584m101M3480J2226K600k2775
19003A1077J860K7036M541k992p3877J8443K3656J5162K849j9703p427P5L0665
$$ plain form
19087 -66153 -30277 45601 67863 67666 47124 9125 -26687 -26957 16325 19056 7648 -9035 12978
19074 12978 71654 28672 -6030 14434 -24447 -6007 50880 9384 -33698 -44693 3500 15198
19062 15198 17346 -37078 -15731 32894 46751 44540 60561 13850 26384 -8539 32204 -22033
19050 -22033 -83668 -43973 -6208 -1003 -37773 -66948 -3277 35837 32989 3687 69893 52813
19038 52813 35586 61651 76635 86436 52312 21812 -3148 -4288 4702 -20957 -68930 -51822
19026 -51822 79391 110836 95441 44672 24435 -13523 -23710 -64536 -74545 -61598 -73593
19015 -73593 -70684 -17113 -47720 -96148 -86228 -6769 -20353 -24454 19026 31252 33852 11077
19003 11077 12937 39973 44514 41522 -32355 -13912 9744 24906 27755 8052 625 700 31365
18990C1365J9747j8095J4031o891q3146p0006p575M1247M9424K8165K6960j901
18978B3325l1838K2166n276m1309n8657k1161N0283P3091j335k996j5460l4789
18966d3956j2092K1874O46N3964K8481j7912m4554L5869O5685r445l707J947l6411
18953D0389k2958j1750M7442Q398o7822J5059j9951K390K8582L5215L0321j4362
18941G0953j5717J9540o9160m0455j2634K2200q165q009M7570L553K4343k5640
18929H379m1920J0082L6857N7273m3067R989j3821K6146n1286L188L2363J7677
18917E1860j3708k1203j5700j0982R794L947n3148k6325n6866n3185P2906J23637
18905A1027o313k5251j040j0501R304n925K7907O463q724n820n0246O751K2787
$$ plain form
18990 31365 51112 33017 47048 40157 -42989 -112995 -120570 -79323 -29899 -1734 25226 23325
18978 23325 -8513 13653 8377 -32932 -91589 -112750 -62467 10624 9289 6293 -9167 -43956
18966 -43956 -56048 -34174 -33528 20436 48917 31005 -13549 22320 88005 78560 74853 76800 40389
18953 40389 17431 5681 53123 61521 -6301 8758 -11193 -8803 19779 54994 85315 70953
18941 70953 55236 74776 5616 -34839 -47473 -25273 -33438 -41447 6123 9676 34019 8379
18929 8379 -33541 -23459 13398 70671 27604 37593 23772 49918 -1368 1820 34183 51860
18917 51860 38152 16949 1249 -9733 61 4008 -49140 -75465 -132331 -185516 -112610 11027
18905 11027 4714 -20537 -21577 -32078 -22774 -28699 -792 5671 -3053 -8873 -59119 -52368 -29581
18892b9581k4265O154M0373M6812m1611p8674L073r001m4366k2519L403J04830
18880d5372N3985K2013K5269j3373n5123l8819J8370O6695O039n5985p3191l8402
18868a27894K5538M8113N4789J9125j9078n9479M668J4135q413L7691J2031K4301
18856B5527J6290k0468m9470r832P773P453P1485J5946n5755l4028k9752M0041
18844a4790l3139l7103L3373J8495n103L5104O6621l856p7559k0227k7412N9555
18832f041L0153m2124r839L2362P484P882O312L5245m2399o0597K0533M1414m761
18819A5624j9848N0428J1031k0140k3013J3365O9681L7694l3746m9308n3384p4244
18807g5860L504j9018j9355K6676N3261l0354J3266K9268j8332J9791R754o865
$$ plain form
18892 -29581 -53846 -47692 -7319 39493 -2118 -80792 -77719 -86720 -131086 -153605 -150202 -45372
18880 -45372 8613 30626 55895 42522 -12601 -51420 -33050 33645 39684 -16301 -89492 -127894
18868 -127894 -102356 -54243 546 19671 593 -58886 -54218 -40083 -48496 -10805 1226 25527
18856 25527 41817 21349 -28121 -37953 -30180 -22727 48758 64704 8949 -25079 -54831 -14790
18844 -14790 -47929 -85032 -51659 -33164 -38267 -3163 63458 59602 -17957 -38184 -65596 -6041
18832 -6041 24112 -18012 -27851 4511 11995 19877 26189 61434 19035 -41562 -21029 20385 15624
18819 15624 -4224 46204 57235 37095 14082 27447 97128 134822 101076 51768 -1616 -75860
18807 -75860 -72356 -91374 -110729 -84053 -30792 -61146 -47880 -18612 -36944 -17153 -7399 -14264
18795a4264j3655k661J03550n840p555M4433l7694r5622l7183N2156Q43j7853
18783c1345K3811M880L935m352j6990k2629M3119K2445K1133J8872M7000P1959
18771A81838K1789M350J02118J00413J41281l1697j63894j44336r4698p2035P012
18760E2141l1233r522q534j4622q464k2304k8909K318l4656j8820l431k0510O5764
18747h0782M4257j7966j1063L0863O2661m736o1771n9416o4069M1871K6846J3033
18735h0272N004K894K3962J5800r454j7994p395J7077N3612r646M5651k4460j5125
18722c46k9329O9171j0674o1515J3719K3949k2438k8426r258K3216Q508j624J0375
18709a4672l4760j1805N4475m376j6223l1643J5691R568j3584m2626k5311K2351
$$ plain form
18795 -14264 -27919 -30580 72970 67130 59575 104008 66314 -29308 -66491 -14335 -13492 -31345
18783 -31345 -7534 -2654 1281 -3071 -20061 -42690 429 22874 44007 62879 109879 181838
18771 181838 203627 207977 310095 410508 551789 520092 356198 211862 117164 45129 52141
18760 52141 20908 11386 2852 -11770 -20234 -42538 -71447 -69129 -103785 -122605 -126036 -146546 -80782
18747 -80782 -36525 -54491 -65554 -34691 27970 23234 -38537 -97953 -162022 -120151 -93305 -80272
18735 -80272 -75268 -72374 -48412 -32612 -42066 -60060 -67455 -50378 3234 -6412 39239 14779 -346
18722 -346 -29675 39496 28822 -32693 -18974 4975 -17463 -45889 -55147 -31931 -23423 -25047 -14672
18709 -14672 -49432 -61237 -6762 -11138 -27361 -59004 -43313 -33745 -47329 -89955 -115266 -92915
18697i2915K4080l585K6264K1961j0393J4306k8074k0598k5794r843j0365o863
18685a21819L9904N1672L392j9855l9300M7173O3806K768k2827k9047J9938M2514
18673C8319L0005n3310m5562l8861K7257J0894L7091O7169p4791r542M6313L3512
18661F8494r221k9924J7236L2560O7524J2729q9935n575n838p6112o5243k643
18649h5948L0544p24K8870L618l1866L6212J7819k1462j0441j47P2578L4164l3483
18636C9734K1667p745l2944m4469O831K3420l9624m9661l7682j0766L657J9371
18624a08211K1213n1221K3332N2261p2329l0719M4828M7816j4693L1712N521j1464
18612f1954n597P0228p632Q576k4905l5762Q62K711K4707j1291n8283K0163Q900
$$ plain form
18697 -92915 -68835 -72420 -46156 -24195 -34588 -20282 -48356 -68954 -94748 -104591 -114956 -121819
18685 -121819 -81915 -30243 -26851 -46706 -86006 -38833 24973 27741 4914 -24133 -4195 38319
18673 38319 68324 15014 -30548 -69409 -42152 -31258 5833 73002 -1789 -11331 34982 68494
18661 68494 59273 29349 46585 79145 146669 159398 69463 63888 58050 -18062 -83305 -85948
18649 -85948 -55404 -56128 -27258 -23640 -55506 -19294 -1475 -22937 -33378 -33525 39053 73217 39734
18636 39734 61401 53656 20712 -23757 -16926 6494 -33130 -82791 -120473 -131239 -127582 -108211
18624 -108211 -86998 -138219 -114887 -62626 -134955 -165674 -120846 -73030 -87723 -56011 -50490 -61954
18612 -61954 -67551 2677 -4955 3621 -21284 -57046 -56184 -53473 -28766 -40057 -98340 -78177 -69277
18599f9277j1921K2713K5483j8789J9024Q185j6397N0751K96q4614m442M3356
18587c5632J2567j9176n781j868L6083j5595J9697M5834K6494p850R755m7669
18575A6859p6294m4383J6826Q707J6984J7488k111j9200r866L1084j6250l8142
18563i8298L1905j3559L682L8889j9409k9345M3767L3799M5381J3693J4870k3051
18551D2324P169L2021k6764l4375j5790k9858L6253K5336l4419R61K4355K5975
18539E3188k7432l1739n0396n4188k41K9965J7805j758n3682K5052L7638l805
18527e9593N619Q7024O0563m156m9824j4164p9722k8695K2410N9689J057j9249
18515a9041Q6n388R526p2973q8906N5767J32004K8073L4519K55m1958p0151k8738
$$ plain form
18599 -69277 -81198 -58485 -33002 -51791 -32767 -24582 -40979 9772 10068 -74546 -78988 -35632
18587 -35632 -23065 -42241 -48022 -49890 -13807 -29402 -9705 36129 62623 54773 64528 16859
18575 16859 -59435 -103818 -86992 -78285 -61301 -43813 -45924 -65124 -74990 -43906 -60156 -98298
18563 -98298 -66393 -79952 -76270 -37381 -56790 -86135 -42368 -8569 36812 50505 65375 42324
18551 42324 49493 81514 54750 20375 4585 -25273 10980 36316 1897 2858 27213 53188
18539 53188 25756 -5983 -56379 -110567 -110808 -80843 -63038 -64796 -118478 -93426 -55788 -59593
18527 -59593 -53974 33050 93613 89457 39633 25469 -54253 -82948 -60538 -849 208 -19041
18515 -19041 -18955 -24343 -14817 -87790 -176696 -120929 11075 39148 73667 73922 31964 -38187 -66925
18502f6925K9245L2763J6417J7634m3425m8388k254l5231N271P158J4931M5546
18490b7258N8458K5675k3370j4173j5109j402o1775k7978l1405j5961o30O6032
18478f8896N1824k954j7300o5854L2259L9410n3245O9682J718m4896o061K1431
18466d2882L1071L1517K4597J5690K8430p2281l9390J5751M7451m2584l9926j0610
18454e3166p4101K0483J718J8082n888O1737L8809j7945j5891n1723j0767o249
18442i4901K7975K5182K7580O7042J8104o3233o2707K5519m0216j0770P5302L3112
18430B7989n033j8705q86l2696K700J510O077m155K2771k3343k0953M4539K2823
18417B2638j1689l8772m3544l4986K1646j8405J4172P8952J1571o429l2766o3471
$$ plain form
18502 -66925 -37680 -4917 11500 29134 -14291 -62679 -64933 -100164 -94893 -87735 -72804 -27258
18490 -27258 31200 56875 33505 19332 4223 2821 -58954 -86932 -118337 -134298 -134928 -68896
18478 -68896 -17072 -20026 -37326 -103180 -70921 -31511 -84756 -15074 -13356 -58252 -64313 -42882
18466 -42882 -11811 19706 44303 59993 88423 16142 -23248 -7497 39954 -2630 -42556 -53166
18454 -53166 -127267 -106784 -105066 -86984 -92872 -31135 7674 -10271 -26162 -77885 -88652 -94901
18442 -94901 -66926 -41744 -14164 52878 70982 7749 -54958 -29439 -69655 -80425 -5123 27989
18430 27989 22956 4251 3365 -29331 -26631 -25121 -19044 -23199 -428 -23771 -44724 -185 22638
18417 22638 10949 -27823 -71367 -106353 -84707 -103112 -88940 -9988 1583 -4846 -37612 -101083
18405a01083J586J2705L6452O0619L777m1753p77j1063n1719Q517R4515J3965
18393B5741j0778k2569k129l6531r891j3547m8106N590J2094O9125K8249Q111
18381E359M6688j9602n7422m3129P2686r211K4899l3911j3922O7084R93n5581
18369a5069o6708k8863N8342P8559N1397O773N676P2415K2619l3825q8936k5060
18357C7320j013k3736j633k7273n1596k842n666l4627Q885R697n367L2547J5842
18344d9462N2298m3075L4242q3305k1153K2394L7151j8637L177m593K2574r1584
18332a39973j0219K1185O6983r552P2565M5148m405q8100j3969L506j1529K9322
18320c9038K0008Q833p763J9172M924O141m9335M2299K4451j5001P780K804l5735
$$ plain form
18405 -101083 -99497 -86792 -50340 10279 14056 -27697 -28474 -39537 -91256 -82739 11776 25741
18393 25741 14963 -7606 -9735 -46266 -56157 -69704 -117810 -112220 -100126 -31001 -2752 5359
18381 5359 52047 32445 -24977 -68106 4580 -4631 20268 -13643 -27565 39519 40512 -15069
18369 -15069 -81777 -110640 -52298 26261 77658 84431 90107 162522 185141 151316 62380 37320
18357 37320 36307 12571 10938 -16335 -67931 -70773 -76439 -111066 -102181 -92484 -97851 -65304 -49462
18344 -49462 2836 -40239 -5997 -89302 -110455 -88061 -50910 -69547 -66370 -70963 -48389 -139973
18332 -139973 -150192 -129007 -62024 -71576 989 46137 41732 -46368 -60337 -56831 -68360 -39038
18320 -39038 -19030 -10197 -17960 1212 6136 12277 -37058 5241 29692 14691 22471 25275 -10460
18307a0460L7694K8194n3032l6520q387j565M9980N434k424n340k9834m6159K5830
18294d6589K9369K1089K8820J2118K50O867J210J0675Q271j7954q007K4547L3583
18281A04249l3255L0434J8815j8704l5150o2147l5929n7415R82J1270L8860O8408
18269C0418M5792l6169m7781Q733M0483J5041J404j9853J6899J3171k0905l5135
18257A2098N0091j4711r935l7277J2608J6344k3084j295m8154J5034K833R772
18245a5676K6467M8583j5045l7888L1809J056m4497K3437K2750M7491j5828o211
18233F6448m1402j6732m1016n3858l1244J6251M8030N8353K8834J7156o880m2915
18221A025k9164Q9101O005m6787k1783M1274K6829N951m054m9978n3063m585k791
$$ plain form
18307 -10460 27234 55428 2396 -34124 -42511 -44076 5904 11338 8914 3574 -26260 -72419 -46589
18294 -46589 -17220 3869 32689 44807 45057 51924 53134 63809 72080 54126 46119 70666 104249
18281 104249 70994 101428 120243 101539 66389 4242 -31687 -89102 -88120 -76850 -37990 30418
18269 30418 76210 40041 -7740 993 41476 56517 57921 38068 54967 68138 47233 12098
18257 12098 62189 47478 37543 266 12874 29218 6134 4839 -43315 -28281 -25448 -15676
18245 -15676 10791 59374 44329 6441 38250 39306 -5191 18246 40996 88487 72659 66448
18233 66448 25046 8314 -32702 -86560 -117804 -101553 -53523 4830 33664 50820 43940 1025
18221 1025 -28139 60962 66967 20180 -1603 39671 66500 72451 68397 18419 -34644 -39229 -42020
18208d2020K8139P2368l9424k4375M2222O313j0990n8729l5361M4038M2262K064
18196B6507m2512l1398L4545N4917j0896J4263K14p534k605O8634L958Q435L9860
18183A56388j5690m1164j2681n1330j7653o2797L2086M3489j9375N03k6205M2458
18171B8029n1978n4653J9343o27P4778N2107P298k487q358N522R4978N5477p1840
18158A47589q1452L5165n9323K9456R1870k5693K0692L0850j1988j9867L0813
18147A88112L7556J3853o0765K523J33464J02253J2899l8795J9917K1920J09427
18136E42364J07152J29256R4643N0028J08632J13377J90345L21768L90273L72344
18126B420182M02643M29729M96803N49671N49984M85311N26941O96721R81483
$$ plain form
18208 -42020 -13881 58487 19063 -5312 36910 43223 32233 -26496 -61857 -17819 24443 26507
18196 26507 -16005 -47403 -12858 42059 31163 45426 45640 38106 35501 104135 108093 116528 156388
18183 156388 140698 99534 86853 35523 17870 -44927 -12841 30648 11273 11776 -14429 28029
18171 28029 -23949 -78602 -59259 -59886 14892 66999 74297 71810 63452 68974 163952 219429 147589
18158 147589 66137 101302 41979 71435 163305 137612 158304 189154 177166 157299 188112
18147 188112 225668 239521 178756 181279 314743 416996 429895 391100 411017 432937 542364
18136 542364 649516 778772 873415 923443 1032075 1145452 1335797 1657565 2047838 2420182
18126 2420182 2822825 3252554 3749357 4299028 4849012 5334323 5861264 6557985 7539468
18117G539468J335553J722576K259084L157714N263955R489769J6197981K4683922
18109G1650022L2521438J1115549l3528358l5264814j9524391r494022n186193
18102A2289231l339880k245406j490089r27753p27285o41667n54482m02000k62237
18093A698432k20770j42972j55056j66531j48880j20099p8464p4450l5756m6203
18083E09251m2176n0280n9527k1082N184J5020k2892N4839q993j4702l5136n3993
18071B75513o1726l1604l1191m6423o3198l369L9218J1921q381J4857l6767L8032
18059I6882P9327J3618L652M318l1374m5066N0256N4090J7470n4667m8077k8789
18047A11640O096k7517L9696K6151l9173k1066m6234M3558M9134k5083p5244k6679
$$ plain form
18117 7539468 8875021 10597597 12856681 16014395 21278350 30768119 46966100 71650022
18109 71650022 104171460 115287009 81758651 46493837 26969446 17475424 12289231
18102 12289231 8949351 6703945 5213856 4286103 3558818 2917151 2362669 1960669 1698432
18093 1698432 1477662 1334690 1179634 1013103 864223 744124 665660 591210 555454 509251
18083 509251 467075 416795 357268 336186 341370 356390 333498 388337 379344 364642 329506 275513
18071 275513 213787 182183 150992 104569 41371 38002 77220 89141 80760 95617 58850 96882
18059 96882 176209 189827 193479 197797 166423 121357 171613 225703 243173 188506 140429 111640
18047 111640 117736 90219 129915 156066 116893 95827 49593 93151 142285 117202 41958 15279
18035A5279k0562l4139K234Q2425L7700m5097l0504K9307K1737N5157l2221o4105
18023A7211R020n2189K2274O9096K0757q8352k1155l090L4868j5156l1976O4070
18011B5378k6677l6885J8869M9589L0821K1396n2504o5005m8127L4511n91J0262
17999c8963N4917m820K3j4181o990J491k2503k6526M9430J4972l0896j1762J6811
17986a8997L3876L7097N654n5704m1788l4885j6284L0031p101n4593O455N6071
17974f0168N6326k0454J8071L3101k9997K8089K1341l0338J0398J9694q81j4626
17962C0556k6093m6786k5705L3905J21876M537K7851o6605l5368j6705m6405n3724
17950i8666l015L426J6683J6772K9409L2397J487l9093J4075k0605J5674K914
$$ plain form
18035 15279 -5283 -39422 -37188 45237 82937 37840 7336 36643 58380 113537 81316 17211
18023 17211 26231 -25958 -3684 65412 86169 -2183 -23338 -26428 8440 -6716 -38692 25378
18011 25378 -1299 -38184 -19315 30274 61095 82491 29987 -35018 -83145 -48634 -49225 -38963
17999 -38963 15954 11134 11157 -3024 -10014 -8523 -31026 -57552 -8122 6850 -24046 -35808 -18997
17986 -18997 14879 51976 57630 1926 -39862 -74747 -91031 -61000 -68101 -122694 -116239 -60168
17974 -60168 -3842 -24296 -6225 26876 -3121 24968 46309 15971 26369 46063 45182 30556
17962 30556 4463 -42323 -68028 -34123 87753 92290 120141 53536 18168 1463 -44942 -98666
17950 -98666 -101681 -98255 -81572 -64800 -35391 -2994 -1507 -40600 -26525 -47130 -31456 -28542
17938b8542R563M1792j9878o5814k7327M0095L8298p308k5962j9019L568L9215
17926b1319q124l8149o3067J1763k9933Q810J0744M1289R6695J7309K0817Q154
17914E4989m0352j8281p840K2002r445o030j623k3766j4128l3413k8529j1616
17902a18032K2585j9141L0383K6440N1315j2589m0706M2794k1260l5639m290L5992
17890d2148J2363M06R521L5347j712p212m2910n5710M3155N5210K2603P4038k7522
17877G5429n8429m1649l1963R103L3695m164k8401R4075L8671k3893j3032K8477
17865G7919M39m2046n5251q869K073k4943l322K9360O665l9111M3487q213n329
17852b7141l769n6384k2513L2982K7037j7044q46n5135k1434M2532M8797K5643
$$ plain form
17938 -28542 -18979 22813 2935 -62879 -90206 -50111 -11813 -19121 -45083 -64102 -60534 -21319
17926 -21319 -29443 -67592 -130659 -118896 -148829 -140019 -129275 -87986 8709 26018 46835 54989
17914 54989 14637 -3644 -11484 10518 1073 -4957 -6580 -30346 -44474 -77887 -106416 -118032
17902 -118032 -95447 -114588 -84205 -57765 -6450 -19039 -59745 -16951 -38211 -73850 -78140 -42148
17890 -42148 -29785 -29379 -19858 15489 13777 6565 -36345 -92055 -48900 6310 28913 102951 75429
17877 75429 17000 -24649 -56612 -47509 -13814 -17978 -46379 47696 86367 62474 49442 77919
17865 77919 78358 36312 -18939 -27808 -25735 -50678 -54000 -24640 -17975 -57086 -13599 -21812 -27141
17852 -27141 -30910 -87294 -109807 -76825 -49788 -66832 -67678 -122813 -144247 -101715 -52918 -27275
17840b7275m0960K6170K3130n4560K0538m682l7535k5953K8524O1493o811m4414
17828h2335l3954K012Q9121L3470K7382N323l4742j9668K2834J4114k0767r836
17816g046l1925o218q339k751J0608Q1462N114j0470k2449L9987L1952n8366m9202
17803b7643j7979p536Q5634M0712m7435n9426j3547J1865m0576L4843P2497J312
17791C2721m9858M953l7188K8138K0399m481J9844J6565n078L0682K7740j6837
17779F7600l4913J8050q711q0239k1576m6980r901M8033J5115j7105M3460p0689
17767i7856j0774N2511m4139j6649N2761L6385K2133J9056k0932J4801k881k0616
17755a6200o121M0574l0959L2548K4164k6194o8542k5850J3803P2324L920K5697
$$ plain form
17840 -27275 -68235 -42065 -18935 -73495 -52957 -57639 -95174 -121127 -92603 -31110 -37921 -82335
17828 -82335 -116289 -114277 -25156 8314 35696 41019 6277 -13391 9443 23557 2790 -7046
17816 -7046 -38971 -45189 -53528 -56279 -45671 35791 40905 30435 7986 47973 79925 21559 -27643
17803 -27643 -45622 -53158 32476 73188 25753 -33673 -47220 -35355 -75931 -41088 31409 32721
17791 32721 -17137 -12184 -49372 -21234 -835 -5316 14528 31093 26015 56697 84437 67600
17779 67600 32687 50737 42026 -38213 -59789 -106769 -116670 -68637 -53522 -70627 -27167 -97856
17767 -97856 -108630 -56119 -100258 -116907 -64146 -27761 -5628 13428 -7504 7297 4416 -16200
17755 -16200 -22321 18253 -12706 19842 44006 17812 -50730 -76580 -62777 9547 13467 39164
17743C9164j2186k3935M5434j6932o8101q3589k2886L3318K3538M5504L8680q8472
17731i0463q1713J3616O5382J5328L9600p973P082O430j3321l0153M3019j102
17719c4268L8432M3810M3246j8989m2753m417r555L97O6444q295j7067Q10n3055
17706D740j5762j6230j3114K1708m4150n55J2245L6369k2562O814J2937N62j4608
17693c1606P728M2069j0059k2448m941k7833L5320j0369K1631O010r262j3976
17681a7736j1081l3510k888J6399l3851k5246l7216K46q068L5699P5507J9492
17669b2253J5623j2387q246j979J4422K8562l7372l3510K1909M4479m208m1897
17657c6857j319K7755k0280o1090J4766L6276K2936K85m1536Q503J1605N8657
$$ plain form
17743 39164 26978 3043 48477 31545 -36556 -120145 -143031 -109713 -86175 -40671 -1991 -90463
17731 -90463 -172176 -158560 -93178 -77850 -38250 -46223 -39141 -32711 -46032 -76185 -33166 -34268
17719 -34268 4164 47974 91220 72231 29478 25061 15506 15903 82347 74052 56985 57795 4740
17706 4740 -11022 -27252 -40366 -18658 -62808 -63363 -51118 -14749 -37311 -30497 -17560 -16998 -31606
17693 -31606 -23878 18191 8132 -14316 -19257 -47090 -11770 -22139 -508 5502 -3760 -17736
17681 -17736 -28817 -62327 -65215 -48816 -82667 -107913 -145129 -144883 -152951 -117252 -41745 -22253
17669 -22253 -6630 -19017 -27263 -29242 -14820 13742 -23630 -57140 -35231 9248 5040 -36857
17657 -36857 -38176 -10421 -30701 -91791 -77025 -40749 -17813 -17528 -59064 -50561 -38956 19701
17645A9701J3619j6967m6989M711J7594M7861J3059J7501j4481o2389o226n740
17633a8746L7539L3938M0672j4710o0802l5905k3892O5828J5419m9067J3972K4486
17621B8732p856l8587l256L4500q5845o3621O6576j5401J7717p337K4006Q111
17609d2261k7335n50O737l00J5076M7088K6288k0901j1444j3569m1593l0457M3455
17596d9766J7214k591K630o0439n9957j1335L071K7129K5378O545L3402P2799
17584D080q412m8676o7669N1658K9956j029L1351N245J6773J0999j5591L4035
17572D2720k9786n7968j8648M2238O8844l0963m4823n6500N7871M486L0151j0410
17560b788m8648Q613k724l9865P0483K8652p8460O4095P175r030J2462L8124J6017
$$ plain form
17645 19701 33320 16353 -30636 -25925 -8331 39530 52589 70090 55609 -6780 -13006 -18746
17633 -18746 18793 52731 93403 78693 17891 -18014 -41906 23922 39341 -9726 4246 28732
17621 28732 20876 -17711 -20967 13533 -72312 -135933 -69357 -84758 -67041 -74378 -50372 -42261
17609 -42261 -69596 -70146 -63409 -63709 -48633 -1545 24743 3842 -7602 -21171 -62764 -93221 -49766
17596 -49766 -32552 -35143 -32513 -92952 -152909 -164244 -161173 -134044 -108666 -102121 -68719 4080
17584 4080 -4332 -53008 -120677 -69019 -39063 -40092 -8741 -3496 13277 24276 8685 42720
17572 42720 12934 -45034 -63682 -21444 47400 16437 -28386 -84886 -27015 -22529 7622 -2788
17560 -2788 -51436 -42823 -45547 -85412 -14929 13723 -64737 -642 6533 -2497 9965 48089 64106
17547F4106j5616m8651J3141k3834j2749k2043L9668M6535l2012l6973J2639j960
17535a7749R461m962l0298j417K3110j0061j0483n8655m2637Q7871N875J8696
17523c1249J0118K510n4978M760M9395K0817N5228l9255r2252m8861j8357N0446
17511i1678L3781j2865K1174J0583N1575J4804m4191m2549K214J8811o127m7519
17499i1987J5195j9874M725J3479j5036P8360O0904j4130r0005L0263J1400P360
17487i346k2812l372l8383J0308M4178L3844n4365q9765k5794M5315j262J4993
17475i6461M768R27j3548k3624K1395K411K3450J7716M0086P2794k6211l3156
17463i453J6550L7735O465J1762m0293l1945J5065L1598J6464O9938K4403k1012
$$ plain form
17547 64106 48490 -161 12980 -10854 -23603 -45646 -5978 40557 8545 -28428 -15789 -17749
17535 -17749 -8288 -13250 -43548 -44965 -21855 -31916 -42399 -101054 -143691 -55820 -49945 -31249
17523 -31249 -21131 -18621 -73599 -68839 -19444 1373 56601 17346 -74906 -123767 -142124 -91678
17511 -91678 -57897 -70762 -49588 -39005 12570 27374 -16817 -59366 -57152 -38341 -44468 -91987
17499 -91987 -76792 -96666 -91941 -78462 -93498 -15138 45766 31636 -58369 -28106 -16706 -9346
17487 -9346 -32158 -35530 -73913 -63605 -19427 14417 -39948 -129713 -155507 -110192 -111454 -96461
17475 -96461 -91693 -90766 -104314 -127938 -106543 -104132 -80682 -62966 -22880 49914 23703 -9453
17463 -9453 7097 44832 51297 63059 22766 -9179 5886 37484 53948 123886 148289 127277
17451A27277m2002p917L8798J6707j2783K8517P1579J57480J66099R9086j59238
17440D83603k21734q8363l9339l9679n1848k6692l683K426j009K3852Q486n8405
17428a2385J4629L3145l9000l0540l2461l1518O973L1590K5108K4071J6307m5723
17416c9804j7336L0284N2510K8708K2519M6519m0869k3072j974K4436m4194k9189
17404H538K309k1604J690n0690l1719j79M2162N7034K5989P336L802P370j7212
17391C4826Q223j9969p8904O002M5740K1468p380m209P142K1193j5918j7152L5857
17378C6919L4254r656k9577K317j7648J6374k1110n8876J8710Q2999l0253p8284
17366e3831J0081J1832L565J2925P42j6333P058L7304l581o4348K1264m5234K6799
$$ plain form
17451 127277 85275 77358 116156 132863 120080 148597 220176 377656 543755 642841 483603
17440 483603 261869 173506 134167 94488 42640 15948 12265 14691 13682 37534 46020 -12385
17428 -12385 2244 35389 -3611 -34151 -66612 -98130 -91157 -59567 -34459 -10388 5919 -39804
17416 -39804 -57140 -26856 25654 54362 76881 123400 82531 59459 57485 81921 37727 8538
17404 8538 10847 -10757 -9067 -59757 -91476 -91655 -49493 7541 33530 40866 44668 52038 34826
17391 34826 43049 23080 -55824 -49822 -4082 17386 10006 5797 12939 34132 18214 1062 36919
17378 36919 71173 61517 31940 34257 16609 32983 11873 -47003 -28293 54706 24453 -53831
17366 -53831 -43750 -31918 -28353 -15428 -14686 -31019 -23961 13343 9762 -54586 -33322 -78556 -51757
17353e1757O3769j9194j6869p517j4109L5899L0401M7504n1617j68R142k9784
17341d300k3770o4884J6345j307M989l3964L9494Q8595m40j0003k4355J7939L8701
17328D3040J258K5895k4468J6124k9808n3616m1771J6017M1084q204k7342L6053
17316e738l8665k4672K548o20J4661K2254O419j5239L3705Q5476l6937l1063Q970
17303B1099k5812k8294Q302L5740J3214N9398j9845m2425m0058J1376l1049N351
17291c3003N3104j5684K17j2633J0386N36j4793L9490j1963m1635M7116k079J441
17278B0500m371L1743j9824l1432L9477L552k7673m178K470j5104n0141j5711
17266g0692J8031K0994j0631m0471k5433N0064J693k7133q234K9497O0057k80
$$ plain form
17353 -51757 12012 -7182 -24051 -31568 -45677 -9778 20623 68127 16510 16342 25484 -4300
17341 -4300 -28070 -92954 -76609 -77916 -72927 -106891 -67397 21198 20758 10755 -13600 4339 43040
17328 43040 44298 70193 45725 61849 32041 -21575 -63346 -47329 -6245 -14449 -41791 -5738
17316 -5738 -44403 -69075 -66527 -67147 -52486 -30232 -23813 -39052 -5347 80129 43192 12129 21099
17303 21099 -4713 -33007 -24705 11035 24249 83647 63802 21377 -18681 -7305 -38354 -33003
17291 -33003 20101 4417 4634 -7999 2387 2923 -11870 27620 15657 -25978 21138 19059 20500
17278 20500 16129 47872 28048 -3384 36093 39645 11972 7794 10264 -4840 -54981 -70692
17266 -70692 -52661 -31667 -42298 -82769 -108202 -58138 -56445 -83578 -91812 -62315 -2258 -2538
17254b538L7127m64k6969k072O1375l2573p202L146Q81K0891j00206m0583L0882
17241e8305N1186J9441n301k6843l8693p204J8609j5203k6221R830K0319N0153
17229h232K9842K956o7274M600k3259j9394j4267M0459P0696K0197k2278o3205
17217d9159m6932K594L176J7967J5210K1491J6113j9042J0704m2863j2442l7272
17205a20455L4229j895j8064m632R949O7041K3880l2191J4312l474K202m3690
17193g2788j30M1830K2274L0882j5966m4826N977M3882j5281r718K029o0504m2417
17180a14756R303M9163M4513j086n306j0511m9906k469M5550k678m4135N3740
17168b8578M2333l2618l5668M8765Q7163l1118n6954l08l1305l3184K9589m0468
$$ plain form
17254 -2538 34589 34125 7156 5084 66459 33886 26684 29830 30711 51602 -48604 -89187 -58305
17241 -58305 -7119 12322 7021 -19822 -58515 -65719 -47110 -62313 -88534 -78704 -58385 -8232
17229 -8232 21610 24566 -42708 -38108 -61367 -80761 -95028 -54569 16127 36324 14046 -49159
17217 -49159 -96091 -93497 -90321 -72354 -57144 -35653 -19540 -38582 -27878 -70741 -83183 -120455
17205 -120455 -86226 -88121 -106185 -110817 -100868 -33827 -9947 -42138 -27826 -31300 -29098 -72788
17193 -72788 -72918 -31088 -8814 22068 6102 -38724 -32747 11135 -4146 -13864 -11835 -72339 -114756
17180 -114756 -105453 -56290 -11777 -12863 -18169 -28680 -78586 -81055 -35505 -38183 -82318 -28578
17168 -28578 13755 -18863 -54531 -5766 81397 50279 -6675 -6983 -38288 -71472 -41883 -82351
17156h2351m0975Q6333Q2875R193j5078o9774n2184L6646J03364Q197p075k9534
17144B9637l9194k954m412q886j0561p2250j0425L6434M5650j408n9647k9767
17132a27783J8927N1455Q822m1432n0312M2116M3776j8429L165P7609M7109n6898
17120a875J5736k6472R740k7309p779k3164P100O8410J3764L350m7300n893J2357
17107i335n8670m6221J1084J3673L6143J5997j3782K8340O3188j7952k174l5605
17095a5314j2991j7914m7349J5249M2237K8161K4646P499P0488Q244r549n9984
17083C3423j6902j4448o2172m9549j3783j9333P4220O7443O5876J3440j1259k8950
17071C8006r1740K9501P6387L4852M1442o1393o312Q2118K8079n5030j14690n2737
$$ plain form
17156 -82351 -123326 -36993 45882 55075 39997 -29777 -81961 -45315 58049 66246 59171 29637
17144 29637 -9557 -12511 -16923 -25809 -36370 -108620 -119045 -82611 -36961 -38369 -98016 -127783
17132 -127783 -108856 -57401 -48579 -90011 -140323 -98207 -54431 -72860 -69695 7914 55023 -1875
17120 -1875 13861 -12611 -2871 -30180 -37959 -61123 -54023 14387 28151 31501 -15799 -21692 -9335
17107 -9335 -68005 -114226 -103142 -89469 -53326 -37329 -51111 -22771 40417 22465 20291 -15314
17095 -15314 -28305 -46219 -93568 -78319 -36082 -7921 16725 24224 94712 102956 93407 33423
17083 33423 16521 2073 -60099 -109648 -123431 -142764 -68544 -1101 64775 78215 66956 38006
17071 38006 -53734 -24233 52154 87006 128448 67055 60743 142861 170940 115910 1220 -51517
17059e1517M7673O8342K386M8302j7080l8531o0935k2290L070k6119K296k0720
17047f5123j5076K1964J7751J426R905l9231n4661M8230P3998M3833j586K4450
17035F5880J2726l7432l5700j7670m5046j4096P2531J6221k6271Q946m5994k582
17023d8487j7149L7878O7477j4373l1659p0440j7480R0994N6774p2373l1155L4124
17011a5869l9331P90P714M566O3859K0436l9796j1360L9483L347K6465m692j902
16998E3710M4511N2450r374o7510r858l9311n8570j7542m4966M6936J2936k626
16986c9214L2559K4976j1799J3910n2506n9073J1036J7050l5010P684K2485N7093
16974a0809J9196N003o3373o4889p893O4835N3170j7997J33P6855l7045J4442
$$ plain form
17059 -51517 -3844 64498 66884 115186 98106 59575 -1360 -23650 -20580 -46699 -44403 -65123
17047 -65123 -80199 -58235 -40484 -39058 -29153 -68384 -123045 -74815 -817 43016 41430 65880
17035 65880 78606 41174 5474 -12196 -57242 -71338 1193 17414 -8857 89 -45905 -48487
17023 -48487 -65636 -27758 39719 25346 -6313 -76753 -94233 -3239 53535 -18838 -49993 -15869
17011 -15869 -55200 -54410 -46696 -42130 21729 42165 2369 -8991 30492 33839 60304 55612 53710
16998 53710 98221 150671 141297 73787 63929 24618 -33952 -51494 -96460 -49524 -36588 -39214
16986 -39214 -6655 18321 6522 20432 -32074 -91147 -80111 -63061 -98071 -90387 -67902 -10809
16974 -10809 8387 13390 -49983 -114872 -122765 -57930 -4760 -22757 -22624 54231 17186 31628
16962C1628j0898k8026p7283j9474M1960k60o6300K2621J1204L9107j8178J292
16950g2607J1074j2798J6015K3895K7600J3238n7462l0543J0290L1033J1320J2345
16938a6600j3428M0787L753k4312J5344K5386J8535m4727j5380J247k1414M527
16926b6282j5227m6926l7981m88k182N2607j5077L117P7625O6582p8499j7040
16914c9771K4627J2823J4290o995j6240O369L4465k1840j6125K2367J5269J5261
16902D4500m1672m6357N318n7806n8218M3106J1575M5874M3390q3540O0103M0675
16890F948l5125l1146O482O1535K2801q3198j4669O8841O7945j6723j5224r431
16878B9036l9644L3267Q018J1306n625k9077K706j3697O8m995N882j3758K1439
$$ plain form
16962 31628 20730 -7296 -84579 -104053 -62093 -62353 -128653 -106032 -94828 -55721 -73899 -72607
16950 -72607 -61533 -74331 -58316 -34421 -6821 6417 -51045 -81588 -71298 -40265 -28945 -16600
16938 -16600 -30028 10759 14512 -9800 5544 30930 49465 4738 -10642 -9395 -30809 -26282
16926 -26282 -41509 -88435 -126416 -126904 -129086 -76479 -91556 -88439 -10814 55768 -22731 -39771
16914 -39771 -15144 -2321 11969 4974 -11266 -4897 29568 7728 -8397 13970 29239 44500
16902 44500 2828 -43529 -38211 -96017 -154235 -111129 -99554 -53680 -10290 -93830 -33727 6948
16890 6948 -28177 -59323 -52841 8694 31495 -51703 -66372 2469 70414 53691 38467 29036
16878 29036 -10608 22659 30677 41983 36358 7281 9987 -3710 -3642 -8637 -2755 -16513 4926
16865D926K2779n9182o3652J0905L5628L0514Q170k7332n681O1417K0157L1714
16853G0363M066k1467r12J7819J4300J8704l4261p4771m7372k2474J6626Q935
16841e0444O4659J1903L8122k1135j0726J0359L312n3746p2424n5030M3926Q4266
16829f958N1080J9563K6372o7251q1922K9220J5036r826l6384l3565K5465r188
16817g8358R104K2018M2482K2691k1333l1109l712k436j5466N9933n673n8550
16805f0409m0393N487M5102L469j0177M7291j9335o8419k6465P979J3435p108
16793a09543m220M7054P5511M114J9510o313l9974k1390n7745m1466O199K2276
16781a05987P567M252K8755o6196o597L420M5326Q4554P960J3427k9589j7641
$$ plain form
16865 4926 27705 -31477 -95129 -84224 -48596 -18082 -9912 -37244 -42925 18492 38649 70363
16853 70363 74429 52962 52050 69869 84169 102873 68612 -6159 -53531 -76005 -59379 -50444
16841 -50444 14215 26118 64240 43105 32379 42738 46050 -7696 -80120 -135150 -91224 -6958
16829 -6958 44122 63685 90057 22806 -59116 -29896 -14860 -24686 -61070 -94635 -69170 -78358
16817 -78358 -69254 -47236 -4754 17937 -3396 -34505 -38217 -40653 -56119 3814 -1859 -60409
16805 -60409 -100802 -95315 -50213 -46744 -56921 -9630 -28965 -97384 -123849 -115870 -102435 -109543
16793 -109543 -113763 -66709 8802 12916 32426 26113 -13861 -35251 -92996 -134462 -128263 -105987
16781 -105987 -98420 -94168 -65413 -131609 -138206 -134786 -89460 -4906 3054 16481 -13108 -30749
16769c0749L5024K0839R367J0750K5909j2437l8401n2403l3370L3226M5992l1558
16757a7811l5916J6332k281j1710n7394o0074l2378Q6692O2008J1682L4981j3918
16745a9787n2817l9362K2203J5189L2049N443p421J0732K6829m6096l17R846L5855
16732g654k6330j7439m0558m1752P7434J6649K1657K1147j3045m0085K7764L0120
16720G908o76k0948j7254J04N069k4444M4006l7459J8233P571N754K7391M2997
16707E8252m698j2367j4038j85k9837L893l8862m5430p007L9596k2553L728M4688
16694b4820J8995L2858K1269k0740j762q576j6857Q169o1374J0382K0952n325
16682b6829O421k8146l5644l223R44Q4145n714o8892k6957K5575P8464L190O1662
$$ plain form
16769 -30749 4275 25114 34481 45231 71140 58703 20302 -32101 -65471 -32245 13747 -17811
16757 -17811 -53727 -37395 -39676 -51386 -108780 -168854 -201232 -114540 -52532 -40850 -5869 -19787
16745 -19787 -72604 -111966 -89763 -74574 -42525 -37082 -44503 -33771 -6942 -53038 -53355 -43509 -7654
16732 -7654 -33984 -51423 -91981 -133733 -56299 -39650 -17993 3154 -9891 -49976 -22212 7908
16720 7908 7232 -13716 -30970 -30866 -25797 -50241 -6235 -43694 -25461 -17890 -12136 15255 58252
16707 58252 53554 41187 27149 26964 -2873 1020 -37842 -83272 -90279 -50683 -73236 -69508 -24820
16694 -24820 -5825 27033 48302 27562 25800 17224 367 8536 -52838 -42456 -21504 -26829
16682 -26829 -20408 -48554 -84198 -87421 -86477 -2332 -8046 -76938 -103895 -78320 144 3334 64996
16669F4996j41R43J7646J2033l7630k153k0275k3765l8697j3383k9210J00283
16657C0647K1195l6503l9552p3990J6101L9919P706k9240k0945P4338N6835K5163
16645G1674n8941j9257K9220j9742k8380K8184n5386o5046K5015O7423l1681m1258
16633i8175m3111k3384L4628O6993M8997O987J0987L2478n4931j04179O841M5047
16621g0822K3151J4890L4682q715J0236J8194J8706l711j414k8063m2316k8483
16609f3665k2185R9277P2841k2711J4414O548p311m189j0921m3213k2189L8339
16597C5035j2918k9020J829n970r7918o4898M9728P3450O544R788l9159J6474
16585e7035l5192k7711J2063N019K993N5962K029M565J2671M581J9421J9950j2079
$$ plain form
16669 64996 64855 65798 83444 95477 57847 55694 35419 11654 -27043 -40426 -69636 30647
16657 30647 51842 15339 -24213 -98203 -82102 -42183 -34477 -63717 -84662 -10324 46511 71674
16645 71674 12733 -6524 22696 2954 -25426 2758 -52628 -117674 -92659 -25236 -56917 -98175
16633 -98175 -141286 -164670 -130042 -63049 -14052 -7065 3922 36400 -18531 -122710 -115869 -70822
16621 -70822 -47671 -32781 1901 -6814 3422 21616 40322 36611 35197 7134 -35182 -63665
16609 -63665 -85850 13427 86268 63557 77971 84519 77208 73019 62098 18885 -3304 35035
16597 35035 22117 -6903 -5074 -11044 -108962 -173860 -124132 -50682 -44138 -34350 -73509 -57035
16585 -57035 -92227 -119938 -107875 -102856 -99863 -43901 -41872 -37307 -24636 -20055 -634 19316 7237
16572G237k9679k9969J8250J0966l2404K5039P834p2989k3809k1284K2722m81
16560a18567k836l7945j58J11486m452k3827l5709K2290Q6514K6162l495n8668
16548c9205l2242l8690l0859M1256J7411M5652O928m3688K6305P587J7897k601
16536b4249J5810q248o0402o591p000J0025q117O0679N8322k8459n8326M0515
16524a6041k5523K7311N133L420k3916K743N3116M6399Q392q0322m2961l2634
16512g4883K2703J3354j0886n1724p0158K5150N2179J1780J1569K3536J8312m103
16500c3171L5248R900k3953o7252l5279N604K6937k2048k9598N4749K3357Q0235
16488B4729j748k5809J3311M4162J2981l4196p7242l9079P291j8413Q6275N2019
$$ plain form
16572 7237 -22442 -52411 -34161 -23195 -55599 -30560 -22726 -95715 -119524 -140808 -118086 -118567
16560 -118567 -121403 -159348 -159506 -48020 -52472 -76299 -112008 -89718 -3204 22958 19463 -39205
16548 -39205 -71447 -110137 -140996 -99740 -82329 -36677 -29749 -73437 -47132 -39545 -21648 -24249
16536 -24249 -8439 -16687 -77089 -83680 -90680 -80655 -88772 -28093 30229 1770 -56556 -16041
16524 -16041 -41564 -14253 -9120 -5700 -29616 -26873 26243 72642 81034 712 -42249 -74883
16512 -74883 -52180 -38826 -49712 -101436 -171594 -146444 -94265 -82485 -70916 -47380 -29068 -33171
16500 -33171 2077 11977 -11976 -79228 -114507 -108903 -81966 -104014 -133612 -78863 -55506 24729
16488 24729 22981 -2828 10483 54645 67626 33430 -43812 -82891 -75600 -94013 -7738 44281
16476D4281J049k7808o6774Q3289N7396j112N5753l1635m1171j5510n273k8841
16464B3644j4984j1321l1417m3621l7562K0957P0780O1249k812l2484n4107p516
16452e9194L6005l36o729M9361R673l5511L4696J7486r653l3526O56N309O970
16439A5207j8842p347k5704J7862K459O7723L241j08576o4588K9548N6038L2598
16427c81j3251l5085l0045k6529J0852N389n795N0040N3315L393m021K9270J1641
16414D8793j7764l7439l5721O162N901j4670Q1468J9480r9869k3563K8465L5183
16402c574L6625k1422K8084j7355m5224M6662O729k2859k0564m5927l380k9703
16390i1908J0351K4488P599M1405M0168j2324k2355l9230R162N5971K9426j5724
$$ plain form
16476 44281 45330 17522 -49252 34037 91433 90321 146074 114439 73268 57758 52485 23644
16464 23644 8660 -2661 -34078 -77699 -115261 -94304 -23524 37725 34913 2429 -51678 -59194
16452 -59194 -23189 -23525 -30254 19107 28780 -6731 27965 45451 35798 2272 2928 8237 15207
16439 15207 -3635 -10982 -36686 -18824 -16365 51358 54599 -53977 -118565 -89017 -32979 -381
16427 -381 -13632 -48717 -78762 -105291 -94439 -89050 -94845 -44805 8510 11903 7882 37152 48793
16414 48793 31029 -6410 -42131 -35969 -30068 -44738 36730 56210 -43659 -67222 -38757 -3574
16402 -3574 33051 11629 39713 22358 -22866 23796 30525 7666 -12898 -58825 -62205 -91908
16390 -91908 -81557 -57069 -49470 -8065 32103 19779 -2576 -41806 -32644 23327 52753 37029
16378C7029l7683K8766n9726n0686m900N8094O1416n3206k9468k2066j2522J7171
16366f7781R572L4401m3191J8237L7715L6978L5930L6193l8594n036O8183n5277
16354F7330m7168k8609o1572j133J2561K4771K0804J6231J9468N5583L4185k41
16342A12210j26385k4708N5599k1225p097N5328k179q3085m1995R211J813l1041
16330a03554L7175J51r726J3625o3675L9358P0170p70K143l6325N234j8204K2413
16317d1985K1817J4264l5642j2074o54q623j0560N8536N3046o388J1170J6662
16305E9569q0677o0036P850Q6790J4116n1327m7397J8826J8260K8272k0031n9266
16293h5051p172K1714K8529m903N2601L28J461L157k5697k8132N402J1943l1662
$$ plain form
16378 37029 -654 28112 -31614 -82300 -87200 -29106 32310 -20896 -50364 -72430 -84952 -67781
16366 -67781 -58209 -23808 -66999 -48762 -11047 25931 61861 98054 59460 54424 122607 67330
16354 67330 20162 -8447 -70019 -71152 -58591 -33820 -13016 3215 22683 78266 112451 112210
16342 112210 -14175 -38883 16716 -4509 -11606 43722 41543 -41542 -83537 -74326 -72513 -103554
16330 -103554 -66379 -66228 -75954 -62329 -126004 -86646 -16476 -17246 -15103 -51428 -46194 -64398 -41985
16317 -41985 -20168 -5904 -41546 -53620 -54274 -62897 -73457 -14921 38125 31737 42907 59569
16305 59569 -21108 -81144 -73294 13496 27612 -23715 -71112 -52286 -34026 -5754 -25785 -85051
16293 -85051 -92223 -70509 -41980 -46883 5718 6046 7507 10664 -15033 -43165 -37763 -25820 -57482
16280e7482m4890l7269M6433M7494o628M1030l0418m1598n827L6914P4030K1924
16268D3713L491j2311l3111R237j4109k7539L1733L2500M9154n9313n1989J0260
16256a8284p3745m2535R2242L8394k4518J7876J7634p5692q6685q313O0795K5649
16244g7182N0310K2301K6284o94n585k5038M467J2884m5000p8591K3688M0457
16232e1699r018L1555j5695m5338M5775N0305l2676O258J0184M5887J803l2021
16220E320m8246O7953M9539k6614k264l0366p0334l7818L6739M115O410r742o295
16207f1603l896R470N6790k3489q050K5357j9646K1300P23M0176Q136o915n7076
16194a8723j2796K397J0807o3122q4817l5357J0138M8349O2925O3152k383K791
$$ plain form
16280 -57482 -102372 -139641 -93208 -45714 -52342 -11312 -41730 -83328 -89155 -52241 21789 43713
16268 43713 47204 34893 1782 11019 -3090 -30629 1104 33604 82758 23445 -28544 -18284
16256 -18284 -92029 -134564 -42322 -3928 -28446 -10570 7064 -68628 -155313 -163626 -102831 -77182
16244 -77182 -26872 -4571 21713 21019 15434 -9604 -5137 7747 -37253 -115844 -92156 -51699
16232 -51699 -60717 -29162 -44857 -90195 -44420 5885 -26791 -20533 -10349 35538 37341 5320
16220 5320 -42926 25027 74566 47952 45688 15322 -55012 -92830 -56091 -51976 -45566 -55308 -61603
16207 -61603 -65499 -56029 761 -22728 -30778 -5421 -25067 -3767 -3044 37132 45268 38353 -18723
16194 -18723 -31519 -29122 -18315 -81437 -166254 -201611 -191473 -143124 -80199 -17047 -19430 -16639
16182a6639o4708j7114L8153J0735m3398m9129k4208J9586N2942j3871k1098K0753
16170a07996O6834L0304N9417k3697k0026o7409j6518Q5712K8550j0902j8759
16159E510k5439q138N6697j6741j9517l5899q6867L594O4762L2156l1273P3216
16147A2061K6339k2001p4210P765k970j6829j5972N5320J1144j8634K1966O903
16135i118k2392K97j5452k8756n974j5560J4996J1466L6179Q026n9276j8805N3122
16122e1247n3273l9045J4157J0322J780P3194N5045n962n7462k6187k5418K0388
16110h3708L7421l8495m9547L8092Q9743J2246l5982K0832N4590l5065j4698Q938
16098D367o576J7425J5759J3324k770J9475J8581q467m1928k4588R191J4373k6225
$$ plain form
16182 -16639 -81347 -98461 -60308 -49573 -92971 -142100 -166308 -146722 -93780 -107651 -128749 -107996
16170 -107996 -41162 -10858 48559 24862 4836 -62573 -79091 6621 35171 24269 5510
16159 5510 -19929 -28067 28630 11889 -7628 -43527 -130394 -126800 -62038 -29882 -61155 12061
16147 12061 38400 16399 -57811 -50046 -53016 -69845 -85817 -30497 -19353 -37987 -16021 -9118
16135 -9118 -31510 -31213 -46665 -75421 -81395 -96955 -81959 -70493 -34314 -26288 -85564 -104369 -51247
16122 -51247 -104520 -143565 -129408 -119086 -117306 -44112 10933 4971 -52491 -78678 -104096 -83708
16110 -83708 -46287 -84782 -134329 -96237 -6494 5752 -30230 -9398 45192 10127 -4571 4367
16098 4367 -2209 15216 30975 44299 41529 61004 79585 71118 29190 4602 13793 28166 1941
16085A941K1740m125k0913l10P076k2114k8369n5673r39N7759J8149k3628o7255
16072a16661l753O3991J7270k2636L4779J4147j0958K0069L585r846q871j0730
16060b9614j3239K4573k3942l234k102Q2762O4220J684l8732n4842k9847p9146
16048a01459m2142M7488L2580K5747j4997n556l6171k8179M6866L7379P013k9009
16036f0440k6988N12K5626O6860j8577l7070K8926p598k8656L3217J9571J9492
16024A4875K5392N5313k0482k0894k5457j1625J8316J5534N8739J8543p0092q4024
16012b5862j8962k2405J9762K6303O470l0341M6246J9562l0730j7929j0954k1727
16000f0567l488J6376M6229K7888l0876k4734L661O2980K4322k2439p532j3323
$$ plain form
16085 1941 23681 19556 -1357 -1667 5409 -16705 -45074 -100747 -101686 -43927 -25778 -49406 -116661
16072 -116661 -120414 -56423 -39153 -61789 -27010 -12863 -23821 -3752 -167 -10013 -18884 -29614
16060 -29614 -42853 -18280 -42222 -45456 -47558 35204 99424 101108 62376 7534 -22313 -101459
16048 -101459 -143601 -96113 -63533 -37786 -52783 -58339 -94510 -122689 -75823 -38444 -31431 -60440
16036 -60440 -87428 -86916 -61290 5570 -13007 -50077 -21151 -28749 -57405 -24188 -4617 14875
16024 14875 40267 95580 75098 54204 28747 17122 35438 50972 109711 128254 58162 -25862
16012 -25862 -44824 -67229 -47467 -21164 -14694 -45035 1211 20773 -9957 -27886 -38840 -60567
16000 -60567 -64055 -47679 -1450 26438 -4438 -29172 -25511 37469 61791 39352 31820 18497
15988A8497n3647l3395o7790j483O0954O8226J5356k5771n9593O3277P2122k5504
15976C1249m1710j0861j1129j3781l7319r328M6643K2876M9328n9465j2K0624
15964a2885k386N0227M9858K6059q1267j3738p808J4149l4210l135L4946m485
15952A5325k8576K207J7882O0485j2706m5099j1240k2235N921J5144l6280j6248
15940e5420J1163M2147J0518J3982P3l7604L686k0650k0467J838L0064k0282O0669
15927A9717R822n2520R187J3323J4121J3437J0819j9430n0609k6120K1387l3677
15915g0543q5419J2446O1519j930M0906L3854N1365L2896j7583m1625r81J2341
15903B7246k3157J846l907K825M009r5503k6916M3263P8571J8080K2342n1201
$$ plain form
15988 18497 -35150 -68545 -136335 -137818 -76864 -8638 6718 -19053 -78646 -15369 56753 31249
15976 31249 -10461 -21322 -32451 -46232 -83551 -92879 -46236 -23360 25968 -33497 -33509 -12885
15964 -12885 -15271 34956 84814 110873 29606 15868 8060 22209 -12001 -15136 19810 15325
15952 15325 -13251 -11044 6838 67323 54617 9518 -1722 -23957 -18036 -2892 -39172 -55420
15940 -55420 -44257 -2110 8408 22390 22463 -15141 -11455 -32105 -52572 -50734 -20670 -40952 19717
15927 19717 29539 -22981 -13794 -471 13650 27087 37906 18476 -32133 -58253 -36866 -70543
15915 -70543 -155962 -143516 -81997 -83927 -43021 -9167 42198 75094 57511 15886 14905 27246
15903 27246 4089 5935 2028 4853 8862 -86641 -113557 -70294 8277 26357 48699 -2502
15891b502l2717M246K600L0200n9424j1116R8986O6334j1909r0301k922M1997
15879C3472J1895M4722k7661L4751o714m5666Q127Q525M2751j9010o2017M727
15867B7902k3309p0529p012Q4036L1599j1680m6130j7341L8724K4057N6779m1311
15855D5785k5642N1834J0652k5749m1032k9218J1177p959j5139n07J6740j5692
15843b4750l2321L2885R3548n879o2464j5920J2170n0130q667k4329n3716o7031
15831b06604l7694Q1824M9487P7629O0016j3495k6182K7695L096m322k071j0204
15819h25j1568l2178j4463K5055K5826J4736K3012l5584n8638k5281Q025k523
15807h4406N2389k241J5702K3817k5126K991K206l770K1555m391L2471O2l544
$$ plain form
15891 -2502 -35219 -30973 -28373 1827 -57597 -68713 30273 96607 84698 -5603 -8525 33472
15879 33472 45367 90089 62428 97179 90465 44799 52926 61451 104202 85192 23175 27902
15867 27902 4593 -65936 -72948 11088 42687 31007 -15123 -32464 6260 30317 87096 45785
15855 45785 20143 71977 82629 56880 15848 -13370 -2193 -10152 -25291 -25798 -9058 -24750
15843 -24750 -57071 -24186 69362 63483 1019 -14901 -2731 -52861 -61528 -85857 -139573 -206604
15831 -206604 -244298 -162474 -112987 -35358 24658 11163 -15019 12676 15772 11450 9379 -825
15819 -825 -12393 -44571 -59034 -33979 -8153 6583 29595 -5989 -64627 -89908 -81883 -84406
15807 -84406 -32017 -34258 -18556 5261 -19865 -16874 -14668 -18438 3117 -1274 31197 31259 27715
15794B7715l0726l1185m6736J9153J6469o011o4452m267O8300K9873m2801R861
15782e4807J2632O2051L9374l5250l9099K6865P031K8514l003l862L0747L6692
15770A07885K7795j9515r7890k2411M2124L4325J5955j1203k5778j9381k429J1064
15758D0541n4238n8399n015M3151M416N061K8416K3961j0869m1045l7856m6882
15746a08758K556L6742O2872K9219n3068k7970K5737M843j241K7780Q9777J816
15734I0305l2704q907j3824J8906K8397k7961j5581k9826l3280o5307n5209j8843
15722a63834K7Q5300R2780j8194m663K8903k7284q7365K2219O4561J0964P518
15710A0932K4885M8126J7968l689o4424k9195n5369J0957P1035K815k5627j6789
$$ plain form
15794 27715 -3011 -34196 -80932 -61779 -45310 -51321 -115773 -120040 -51740 -21867 -64668 -54807
15782 -54807 -42175 19876 59250 24000 -15099 11766 18797 47311 44308 40446 71193 107885
15770 107885 135680 116165 18275 -4136 37988 72313 88268 77065 51287 31906 29477 40541
15758 40541 -13697 -72096 -77111 -33960 -29544 -24483 3933 27894 17025 -24020 -61876 -108758
15746 -108758 -106202 -69460 -6588 22631 -30437 -58407 -32670 -27827 -29068 -1288 88489 90305
15734 90305 57601 48694 34870 53776 82173 54212 38631 8805 -24475 -89782 -144991 -163834
15722 -163834 -163807 -78507 14273 -3921 -8584 20319 -6965 -94330 -72111 -7550 3414 10932
15710 10932 35817 83943 101911 98222 33798 4603 -50766 -39809 31226 34041 8414 -8375
15698h375L1825K9273J0453k7948k2337l1436O7589N9707m7706l6395J6038M2807
15686H3495j03512n4077n818O4273J8073k1557K7509N3640l880o5788J2682k2686
15674a7646O0144K2643m8758K8094r584n0321J1990r875M4l0375j6745N612M5196
15661i581N5647k9308l517Q0001m0338k0644J3837j4558k9763P292m1375j3551
15649d5858K7172j8075M1128j2904O536J7230m5476o112J7363l5207K762K3850
15637b7591P1569J1010j337K642L7506l8537p0147O1925l03J9785L8365j0228
15625I4659j5097K3009l8985K0657K6158k3033m3910K5874K7096k9661m3346K1644
15613D5065M4724m0051m9880K1022L9446m4682k0192l5361n3837J6205K1978M8489
$$ plain form
15698 -8375 23450 52723 63176 35228 12891 -18545 49044 108751 61045 24650 40688 83495
15686 83495 -20017 -74094 -79912 -15639 2434 -19123 8386 62026 58146 -7642 5040 -17646
15674 -17646 42498 65141 16383 44477 34893 -15428 -3438 -13313 -13269 -43644 -60389 -54777 -9581
15661 -9581 46066 16758 13241 93242 52904 32260 46097 31539 1776 9068 -32307 -45858
15649 -45858 -18686 -36761 4367 -8537 -2001 15229 -30247 -36359 -18996 -54203 -51441 -27591
15637 -27591 43978 54988 53651 56293 93799 55262 -14885 47040 46737 66522 104887 94659
15625 94659 79562 102571 63586 84243 110401 87368 43458 69332 96428 66767 23421 45065
15613 45065 89789 49738 -142 20880 60326 15644 -4548 -39909 -93746 -77541 -55563 -7074
15601g074r547R062j6266L1680r803M5219L7422J2631m0238K9950k276l7167k3128
15588B0465k7028l5888J5049n149k500j0006m995K6640L4490r909o419J9490j1577
15575B663n6503l5394k2098K4470M7868L7471j1218n6954J5435K1320J1433N4565
15563C3058M4181l9048k8055j0129l93l687K3764k7448o39R939l8205m7137L2073
15550e1726l664K5682L3934L113k1831k9432J8054L6956j1023l4844K8293P0671
15538F4183l9960j0546O0097q063n5715K4133j272p5947k9490n467p3164L1241
15526a19970j3152M9339P2425J9630J506l4672K2649m47j6984k2268n1060j8974
15514a11978J4486Q078M7560K0874N8522K2503j8031l8225N0789k1661j2136J4950
$$ plain form
15601 -7074 -16621 -7559 -23825 7855 -1948 43271 80693 93324 53086 83036 80760 43593 20465
15588 20465 -6563 -42451 -27402 -32551 -35051 -45057 -50052 -23412 11078 1169 -5250 14240 2663
15575 2663 -53840 -89234 -111332 -86862 -38994 -1523 -12741 -69695 -54260 -32940 -21507 33058
15563 33058 77239 38191 10136 7 -386 -4073 19691 -7757 -8396 1543 -36662 -83799 -51726
15550 -51726 -55390 -29708 4226 7339 -14492 -43924 -25870 11086 63 -34781 -6488 64183
15538 64183 24223 13677 73774 65711 9996 34129 32857 -43090 -72580 -78047 -151211 -119970
15526 -119970 -133122 -83783 -11358 8272 9778 -24894 -2245 -2692 -19676 -41944 -93004 -111978
15514 -111978 -97492 -89414 -41854 -20980 37542 60045 42014 3789 54578 32917 20781 35731
15502C5731k2121n054j1632K0548l1164m7222o330P7206K1715j3385J334M0667
15490F0293O801l5281J1779L7843J7617k830j0534O603j7709k8455j6786j0494
15478A8847K3129M4840k4613k8883j9576P952J7260j4653k3771j2556M2428Q3848
15466A14252L529k3860k0911q32m390k8890r122J3918j9258m9092J9174O7264
15454F1782N2536k2676r2861k10J584p2999r865K0680K5291J684j8328K2342Q9447
15441E8407J5785j2030k4500m2085K8862N8235r0504q1578l9821o604J9152N0493
15429f6188l1999p015k2550l0590k2907N7290R1057K2760M3925K4221N382m130
15417E9256J033q0040l6848K616j3223M6860J0010j0348M077J1835j2440k8785
$$ plain form
15502 35731 13610 8556 -3076 17472 -13692 -60914 -67244 9962 31677 18292 19626 60293
15490 60293 67094 31813 43592 81435 99052 96222 85688 92291 74582 46127 29341 18847
15478 18847 41976 86816 62203 33320 13744 21696 38956 24303 532 -12024 30404 114252
15466 114252 117781 93921 73010 72178 67788 38898 29776 43694 24436 -24656 -5482 61782
15454 61782 114318 91642 -1219 -1429 155 -72844 -82709 -62029 -36738 -35054 -53382 -31040 58407
15441 58407 74192 62162 37662 -4423 24439 82674 -7830 -89408 -129229 -135833 -116681 -66188
15429 -66188 -98187 -105202 -127752 -158342 -181249 -123959 -32902 -10142 33783 58004 63386 59256
15417 59256 60289 -19751 -56599 -53983 -67206 -20346 -10336 -20684 -16607 -4772 -17212 -45997
15405d5997l9477L3185M204J3847M3430O649j1268j1686J2606o992m9350K6553
15393b4296N7559P0375m5103l7435J8489o6919k0284K3596j4706m2104L6138K1467
15381b3223l962K4068K96M4482L64k5856n2684M7338P4003r148k5880k44n8284
15368h730M363R823m9769l1710R262J4949K0675j95o6203N1986L8544k0469Q952
15355a8522K4652n6905J7810k9298l8201L025K7277L0758m3350j0813M1301P0538
15343A8272N0730j4764j964o423K5245J7733l2983p6106l9409R058l183l3100
15331h6894l076L2199M2165L5408q509o649r411R031M1090k5636J7117j2294m2294
15318a7753p937J6625K5100k9624K5485J4818J1901o518j7262n8120O6074J5297
$$ plain form
15405 -45997 -85474 -52289 -48085 -34238 9192 15841 4573 -7113 5493 -1499 -50849 -24296
15393 -24296 33263 103638 58535 21100 39589 -27330 -47614 -24018 -38724 -80828 -44690 -23223
15381 -23223 -27185 -3117 -2821 41661 42025 16169 -36515 10823 84826 75678 49798 49554 -8730
15368 -8730 -4367 5456 -44313 -76023 -66761 -51812 -31137 -31332 -97535 -45549 -7005 -27474 -18522
15355 -18522 6130 -50775 -32965 -62263 -100464 -97439 -70162 -39404 -82754 -93567 -52266 18272
15343 18272 69002 54238 52274 45851 71096 88829 55846 -20260 -59669 -50611 -53794 -86894
15331 -86894 -89970 -57771 -15606 19802 11293 4644 -4767 4264 45354 19718 36835 24541 -17753
15318 -17753 -25690 -9065 16035 -13589 11896 26714 38615 32097 14835 -43285 22789 38086
15306C8086J7246m8909l5920N0697L4032o9890o296l0153L971q648L5862M9892
15294B9970J8188k0047L733k9254m3964N1527M3177l3260m1724m4896J5834J6687
15282c4029M0241l9332J8384K904k1689J0k5374l8623M6924P8402K3675o1475
15270i982K0606M2630m6278p4885k7340m8598n731O0923N0914O8946J5684J0848
15258E7737l2927l3298p422n3270Q244n387k13J4008O9810k1912j9886L5840K8299
15245C9623m6317k6950J0949r758M3880K3237j6557j3673L5631P416o6048l1524
15233e0091N8546N4559L407K3058P914J5161p4477n9658o2559k8036k7385p7576
15221b17137M5853M1854L8223M5259k84J4469q509K0803M1730J0735M373J6207
$$ plain form
15306 38086 55332 6423 -29497 21200 55232 -14658 -20954 -51107 -47136 -55784 -19922 29970
15294 29970 48158 28111 31844 2590 -41374 10153 53330 20070 -21654 -66550 -50716 -34029
15282 -34029 6212 -33120 -14736 -11832 -33521 -33511 -58885 -97508 -50584 27818 51493 -9982
15270 -9982 10624 53254 6976 -67909 -95249 -143847 -149578 -88655 -37741 31205 46889 57737
15258 57737 24810 -8488 -15910 -69180 -60936 -66323 -66536 -52528 17282 -4630 -24516 11324 39623
15245 39623 -6694 -33644 -22695 -32453 11427 34664 18107 4434 40065 47481 -18567 -50091
15233 -50091 8455 63014 66421 89479 97393 112554 38077 -21581 -84140 -112176 -139561 -217137
15221 -217137 -171284 -129430 -91207 -45948 -46232 -31763 -40272 -19469 22261 32996 37369 53576
15209E3576m7801o9085j1041M2023j0512k6956N6583N9326n41j8552n3992l7300
15197f4272K3624L3427m493K9179K5662L5k7931J9649j7891r3984j9893L5463
15185f1425K8102N8952L1897n693r314N595N0062l8188m6480k4958O6186j5436
15173C9300o3027m1006k687k955K0502K5069P4087k4966k9601J2180J737l243
15161E390j5394k683k5573M1350j1189o2404m4451K9543J588K6894L869Q810J9447
15148b4803m1514n6808N3564j4996J851P2112L4884P935j3654n2204j7568K7264
15136b3937l7750k3601K4197Q476o662L4233K7416L829K6582o3992K912O4462
15124C6165J0391l9943J7583L1125L5477k6423j2810l120K2139k4883l1094m9091
$$ plain form
15209 53576 5775 -63310 -74351 -32328 -42840 -69796 -13213 46113 45572 27020 -26972 -64272
15197 -64272 -40648 -7221 -11714 17465 43127 43162 15231 34880 16989 -76995 -96888 -61425
15185 -61425 -33323 25629 57526 51833 42519 48114 98176 59988 13508 -11450 54736 39300
15173 39300 -23727 -64733 -67420 -70375 -49873 -24804 49283 24317 -5284 6896 8633 5390
15161 5390 -10004 -12687 -38260 3090 -8099 -70503 -114954 -85411 -83823 -56929 -53060 -44250 -24803
15148 -24803 -66317 -123125 -69561 -84557 -82706 -10594 24290 32225 18571 -33633 -51201 -23937
15136 -23937 -61687 -85288 -61091 -52615 -59277 -25044 2372 6201 32783 -31209 -28297 36165
15124 36165 46556 6613 24196 55321 90798 64375 51565 48445 70584 45701 14607 -34484
15112c4484m5794J7018M7830n3412n3136L173J1275L5745m959J5747J6360M0997
15100c640M2182K1095l2007M341k5702m0370J2564J5408K2051N6421j0605q513
15088E3225j6743l7550K8595J9012p863O204K9943p9554m2703j6866J5907L4517
15076a3876N4569J7994P762n3735k7416l1295m2142L515N7815p186r692O3077
15064A9390K8846J8020N301n4576q28j1276K9783J3842J7444l7245o3752k8604
15052f3655K171l6960K1295Q7110J2381n369M2395M0204k6324n3697j1219N687
15040A4019L5393q7658j2484J9730l708q678J14234O5358j8687l2605n2562j4883
15028A7469O9826j6954k1360n7502o4748K6077O9340J8065j6305L2548l0190k7079
$$ plain form
15112 -34484 -80278 -63260 -15430 -68842 -121978 -118805 -107530 -71785 -76744 -60997 -44637 -3640
15100 -3640 38542 59637 27630 31971 6269 -34101 -21537 -6129 15922 72343 61738 53225
15088 53225 36482 -1068 27527 46539 38676 44880 74823 -4731 -47434 -64300 -48393 -13876
15076 -13876 40693 58687 66449 12714 -14702 -45997 -88139 -84624 -26809 -33995 -43687 19390
15064 19390 48236 66256 71557 16981 16153 4877 34660 48502 65946 28701 -35051 -63655
15052 -63655 -61484 -98444 -77149 9961 22342 16973 59368 99572 73248 19551 8332 14019
15040 14019 49412 -38246 -50730 -31000 -34708 -43386 70848 136206 117519 84914 32352 17469
15028 17469 87295 70341 48981 -8521 -73269 -47192 22148 40213 23908 56456 26266 -813
15016h13M9258o732j0671L3997M2546J2928k6798p2455l4619j99K2784j1430l8728
15003d0932k2038Q360L6663K7206k7691j3413M3310l0038l5658m4424J2254k7528
14991a13929N5608P9265N995J5771p26l1538J2808m2846q296N347M2668N1628
14979G1755m6346p6407j0872L2275J9834n1540j0555Q6670J2375L8730p042l4416
14967B4461k5234K831j2424J362K1739K0521n5978k0796q168K4904J4250k2241
14955c4773k7210J8495N0764N8842n019j2605J1329n77o2075m560O0234j4845
14943C8000k9793l99k1458L3970M4793K3958R179M9273M470p6612o2440l1435
14931a8494M8619K9654p946k0621l8148k7328K3077K7545N0481m9473k2526K3676
$$ plain form
15016 -813 48445 41713 31042 65039 107585 120513 93715 21260 -13359 -13558 9226 -2204 -40932
15003 -40932 -62970 -54610 -17947 9259 -18432 -31845 11465 -18573 -54231 -98655 -86401 -113929
14991 -113929 -58321 20944 26939 42710 41984 10446 23254 -19592 -27888 -22541 20127 71755
14979 71755 25409 -50998 -61870 -29595 -9761 -61301 -71856 14814 27189 65919 58877 24461
14967 24461 -773 2058 -10366 -9004 12735 33256 -22722 -43518 -51686 -26782 -12532 -34773
14955 -34773 -61983 -43488 7276 66118 61099 48494 59823 59246 -2829 -7389 52845 38000
14943 38000 8207 7808 -13650 20320 65113 89071 98250 147523 151993 75381 12941 -18494
14931 -18494 30125 59779 51833 31212 -6936 -34264 -11187 16358 66839 17366 -5160 18516
14919A8516J5810p174O7316N218j03824r9216M4608P5583J4194m2430M6847J2627
14907D8075l082m6125m8721j1124J8140J5374k3639K2746J4301l4648J4032k374
14895c7045j6655J03247J4360p7294k8495O3474j58o9020n0900K3688O3799O9722
14883E8723K655k1334m6911n729L7044o886l9646m6156M2118J3968p281J3260
14871f175K1951O847R497j5437k9445m4751L2701Q9516J3615k0173j9148o2981
14859b3983l817j7038Q310o196o512K9607J1184M4965n9068J1057M9849j289n2230
14846a5161o3749k4651L2720O2986J5941j1727K4460M3513j1033l9210l9215o966
14834c2092L129R468k4568K3413J6085k099k4107P7520j5906n4264J5771L9239
$$ plain form
14919 18516 34326 27152 94468 99686 -4138 -103354 -58746 16837 31031 -11399 35448 48075
14907 48075 44993 -1132 -49853 -60977 -42837 -27463 -51102 -28356 -14055 -48703 -34671 -37045
14895 -37045 -53700 49547 63907 -13387 -41882 21592 21434 -47586 -98486 -74798 -10999 58723
14883 58723 61378 40044 -6867 -12596 24448 17562 -22084 -68240 -26122 -12154 -19435 -6175
14871 -6175 15776 22623 32120 16683 -12762 -57513 -24812 64704 78319 58146 38998 -23983
14859 -23983 -27800 -44838 -36528 -42724 -49236 -19629 -8445 36520 -22548 -11491 38358 37069 -15161
14846 -15161 -78910 -103561 -70841 -7855 8086 -3641 20819 64332 53299 14089 -25126 -32092
14834 -32092 -28963 -19495 -44063 -20650 -4565 -6664 -30771 46749 30843 -23421 -7650 31589
14822C1589L6108j7724l424m9003k0015n1468O143L5122k846L5082Q7270L350
14810I0184k3001o3036k0887k8069n382L8054r2879o5051Q2812M6140O304P4890
14798D0079j0019K0134M20n9814m2636j5083N6310K3983K1580L8346p350q450
14786E7500m2334J8673N7835p452k5175l796o6587k428K2362K1637k3895n0106
14774d3766m2758L901L2628L186j4767M2180l5064L4132K917N5147K6010J8746
14762H2492k1728R390K891p6800Q661J8484k0919m3807K0721L4179k1978J4461
14750F047j716m4714l9661M469Q2085j1228K657J9700J9734J4287j6501K548k8249
14737I458q613L0659Q660k1604J8891k1335Q358R526J7367L2046k0022r981m2514
$$ plain form
14822 31589 67697 49973 46549 -2454 -22469 -73937 -67794 -32672 -35518 -436 86834 90184
14810 90184 67183 4147 -16740 -44809 -50191 -12137 -105016 -170067 -87255 -41115 -34811 40079
14798 40079 30060 50194 50614 -9200 -51836 -66919 -10609 13374 34954 73300 65950 57500
14786 57500 15166 33839 91674 84222 59047 55251 -11336 -13764 8598 30235 6340 -43766
14774 -43766 -86524 -82623 -49995 -46809 -61576 -19396 -54460 -20328 -17411 37736 63746 82492
14762 82492 60764 70154 73045 -3755 4906 23390 2471 -41336 -20615 13564 -8414 6047
14750 6047 4331 -40383 -80044 -75575 6510 -4718 -2061 17639 37373 51660 35159 37707 9458
14737 9458 845 31504 40164 18560 37451 16116 24474 34000 51367 83413 63391 53410 10896
14724A0896J1799o0954M7351K1219l0544j0706K8563P841l0609m2229j1126J1371
14712d7128N4033j2107k3338P235Q216M454J5729O056p938J711K0169N9753J7295
14699A04140k240m5071M3689R812j9387o2029p85O4357l9772r8556j7080K4396
14687c8526j5364l5238r334l4777K2890R3251L6194K1971j0822k6615m3710j5186
14675e5266K7140K0550J3563l6156n72j0330J5780P353j9645J6292J7614L2839
14663B9162k1938q41J3153K5015l0754j7125m909j4609l2984P474K5333L9910
14651A6887K5184o507Q631K9746k853n4874n405P1987L1302j9319k8336l6062
14639C0381k20k0989k2221M916M8373l6333p5166K4666J01518J8371p8591j5256
$$ plain form
14724 10896 22695 -38259 9092 30311 -233 -10939 17624 25465 -5144 -47373 -58499 -47128
14712 -47128 6905 -5202 -28540 -21305 -13089 -8635 7094 13150 5212 6923 27092 86845 104140
14699 104140 101900 56829 100518 110330 90943 28914 28129 92486 52714 -45842 -62922 -38526
14687 -38526 -53890 -89128 -98462 -133239 -110349 -17098 19096 41067 30245 3630 -40080 -55266
14675 -55266 -28126 -7576 5987 -30169 -30741 -41071 -25291 -17938 -37583 -21291 -3677 29162
14663 29162 7224 6383 19536 44551 13797 -3328 -8237 -22846 -55830 -48356 -23023 16887
14651 16887 42071 35564 44195 73941 71088 16214 10809 82796 114098 94779 66443 30381
14639 30381 30161 9172 -13049 -8133 40240 3907 -71259 -46593 54925 73296 -5295 -20551
14627b0551k8178l0295Q4847J14860l99j08208p7280p181M7195L1331K8857J1962
14615D6960p1484k5460J0412J8647J0596j0229L3813K2954j3665n3654L5455k8282
14603b3937n4447r577j545K5574J83J6428J4792L870P43j2176l7892j843k3259
14590a03086M4716R6378O6468l0824N558l4165m9535J3759K6965j7665k2897R734
14578E406P565k4321j8057j9035K2185J7620j928M1328J2867l1587k4548k0531
14566c3036K1664M6584J5363k2306k1624K5384q366M64J0879K0476q166M7443
14554I4759N2737n8599m3120N854R886O1376O226o2887j6296k5822O0337J05596
14542A90047J9595m5339j3126k8464o5510n3711L481o703k6253l2452L3533M3904
$$ plain form
14627 -20551 -48729 -79024 5823 120683 120284 12076 -65204 -72385 -25190 6141 34998 46960
14615 46960 -24524 -49984 -39572 -20925 -10329 -20558 13255 36209 22544 -31110 4345 -23937
14603 -23937 -78384 -87961 -89506 -63932 -63749 -47321 -32529 -28659 -27916 -40092 -77984 -79827 -103086
14590 -103086 -58370 38008 104476 73652 79210 45045 -4490 9269 36234 18569 -4328 5406
14578 5406 12971 -11350 -29407 -48442 -26257 -8637 -10565 30763 43630 12043 -12505 -33036
14566 -33036 -11372 35212 50575 28269 6645 32029 23663 24127 35006 55482 47316 94759
14554 94759 147496 88897 45777 51631 61517 122893 129119 66232 49936 24114 84451 190047
14542 190047 209642 164303 151177 122713 57203 3492 6973 270 -25983 -58435 -24902 19002
14530A9002l9801k8821M5307L7573q4854k3108N8555K1380q402o892P142M9181
14518D6262L9686o2712j09271n6804M1981K6806r710P1247M8960n5034j9300K6128
14506a1761N2946M1979J7804p095L8538j18698r1632Q802L9177M5526J9790k2099
14494A3277j2708m03k7973k8529j773o320l765k8136N8277L425O3350J8896k5279
14481B2339j3867k4798k8837O8999M2566J507N6851P3792q960j4407n4188m7046
14469G3951P479k5468R769n3133J730P5832k7434n7521k8353L3424K7635m9483
14457a1572o2168k5178J4869J9639m8865M6062M5378M9588O1423k0264L948m2833
14445C0027o6795l8850m4192J6998L3274K297l4975M117M0097M7717O3085m8120
$$ plain form
14530 19002 -20799 -49620 -4313 33260 -51594 -74702 -16147 5233 -3169 -10061 -2919 46262
14518 46262 85948 23236 -86035 -142839 -100858 -74052 -83762 -12515 36445 -18589 -37889 -11761
14506 -11761 41185 83164 100968 93873 132411 13713 -77919 -69117 -29940 15586 35376 13277
14494 13277 569 166 -27807 -56336 -58109 -64429 -68194 -96330 -38053 -34628 28722 47618 22339
14481 22339 8472 -16326 -45163 23836 66402 67909 124760 198552 189592 175185 120997 73951
14469 73951 81430 55962 65731 12598 14328 90160 62726 5205 -23148 10276 37911 -11572
14457 -11572 -73740 -98918 -84049 -64410 -113275 -67213 -21835 27753 89176 68912 72860 30027
14445 30027 -36768 -75618 -119810 -102812 -69538 -67241 -102216 -98099 -58002 -10285 52800 4680
14433D680m2947l8246j3058L324M2320K1547j8761N3139j143j0762m9092l2259
14421h1258O636K0753P0728J04850j9535m3437m6968j9104m6513L1716M9665K9040
14409E6573k6292k543J0602K8749L2718J653l8876j1174n43q767J9534R08r888
14396E2654J7171k5853j4504J0719m5636P461Q0581L9748q005j9623M5709k8771
14384A11651l2168M663P9228R219N4663O2522K2998J9411M0112m9592P04l1497
14372B91914n3846l7402j4742j0390k9785n2830n291J112m4803n516P984Q040
14360E4445q7896K9198P8157N193n7939m481L6398J9888k1307j8192j6907K6061
14348D2618N6460m1236L2959j1923m1505q640m7834J3285N5020l3423l4399k0783
$$ plain form
14433 4680 -38267 -76513 -89571 -86247 -43927 -22380 -41141 11998 10855 93 -48999 -81258
14421 -81258 -74622 -53869 16859 121709 102174 58737 11769 -7335 -53848 -22132 27533 56573
14409 56573 30281 27738 38340 67089 99807 101460 62584 51410 50867 42100 61634 62542 52654
14396 52654 69825 43972 29468 40187 -5449 2012 82593 122341 114336 94713 140422 111651
14384 111651 79483 84146 163374 172593 227256 289778 312776 332187 372299 322707 323411 291914
14372 291914 238068 200666 185924 175534 145749 92919 87628 88740 43937 38421 46405 54445
14360 54445 -33451 -4253 73904 79097 21158 16677 53075 72963 51656 33464 16557 42618
14348 42618 99078 57842 90801 78878 37373 28733 -19101 -5816 49204 15781 -18618 -39401
14336c9401M1633K7920j4668r17m16m316n826K5188k313m8066L0181J0482R689
14323B9170l6891j56M5465k0661j0232O626L6731k2787o043N1076K2770m0952
14311E4116n8831p2107j3002N1559k134J7159J3798j1990Q521N1180J4594k1515
14299C1348K0510k4178J1444L2135m6141k3012k6806m258M7704K528R961m957
14287B6278k2173J0953j5984K4704m1256k9470O7887L2035p317m5202L8442J8372
14275E7269p404J2285n4181k8322L4980J15767K50k0621j8234n0694j0696K5904
14263E6303K5348p3713N67J02246M9087l0535N460l0304k0253l0901n0937M288
14251F656j3384J3158J02528p618k1397N852j6955m3918k3059O868k0416l1898
$$ plain form
14336 -39401 2232 30152 15484 14567 14151 9835 4009 29197 26884 -21182 8999 19481 29170
14323 29170 -7721 -7877 37588 16927 6695 13321 50052 27265 21222 72298 95068 54116
14311 54116 -4715 -76822 -89824 -38265 -40399 -23240 -9442 -21432 -12911 38269 52863 31348
14299 31348 51858 27680 39124 71259 25118 2106 -24700 -28958 18746 21274 31235 26278
14287 26278 4105 15058 -926 23778 -17478 -46948 20939 52974 45657 455 38897 57269
14275 57269 49865 62150 7969 -20353 14627 130394 130644 110023 91789 41095 30399 56303
14263 56303 81651 7938 8505 110751 159838 129303 134763 104459 84206 53305 2368 6656
14251 6656 -6728 6430 108958 101340 79943 85795 68840 24922 1863 8731 -11685 -43583
14239d3583j1599P6845K7698m8578l9324L5843K8632j5966L9243K7439k268j6865
14227E7517j4890L661p186p379k7475J8829J4896L8486M7980M313R897k1947j5597
14214A01105k1678p794j7067N5353K2327k1794K1755p603L69j9840k0414N8267
14202A42986l4574k791O3428K6894j3812j1329k8057k1612n5812K1025M5793M4476
14190A76615J10553R7654M4383Q2194N7905J3036o646M8233K3063k6502L4385
14179F54873N4043R0667O0754k8556k6674P9229O5562L3649j9150l1179O39l2889
14167I00968j24109q375k8844j14949n8332K5783k9449k1205l1981o3926j13878
14156C31703j7047o2327k8279j5384m9172R303N8708Q825j6460j7437m8210p6629
$$ plain form
14239 -43583 -55182 21663 49361 783 -38541 -2698 25934 9968 49211 76650 74382 57517
14227 57517 42627 46288 39102 31723 4248 23077 37973 76459 124439 128752 138649 116702 101105
14214 101105 79427 71633 54566 109919 132246 110452 132207 124604 124973 105133 84719 142986
14202 142986 108412 105621 169049 195943 182131 170802 142745 121133 65321 86346 132139 176615
14190 176615 287168 384822 429205 511399 569304 582340 575694 623927 646990 620488 654873
14179 654873 708916 799583 860337 831781 805107 884336 949898 983547 964397 933218 933857 900968
14167 900968 776859 768484 739640 624691 566359 592142 562693 541488 509507 445581 331703
14156 331703 314656 252329 224050 208666 159494 168797 227505 236330 219870 202433 154223 77594
14144G7594O3710M8471k0023o9943p2016J8529O5537m3587L786j5298M9316N0211
14132A56287p664K575O033m0997m8061j5502P7472m823p6620m2114k0716J3871
14120b59j5425R195J1358J0199K9444l8325p4691K1965O1323M4225L7358M505
14108A00872m2060n6744j6332m767j7796M0519O3808N0077J1041k9530K8447J1515
14096A39050m9611n9449o8514J8158M0093L7669P148J6876j3672L565l4689L35
14084C6959k5289K9234L1021L7231k4802l7011l1005l752M1646j86N3007J4789
14072A21842o7390l6392j014k2453Q178O7109K9993J0008j2677L4093N867M6312
14060A83476J7588q9845j6910O2168m0138K3326J2615j1898o4814J0465J5482
$$ plain form
14144 77594 141304 189775 169752 99809 27793 46322 111859 68272 72058 56760 106076 156287
14132 156287 148623 151198 157231 116234 68173 52671 130143 125320 48700 6586 -14130 -259
14120 -259 -15684 -6489 4869 15068 44512 6187 -68504 -46539 14784 59009 96367 100872
14108 100872 58812 2068 -14264 -19031 -36827 3692 67500 117577 128618 99088 127535 139050
14096 139050 89439 29990 -38524 -20366 19727 57396 64544 81420 67748 71313 36624 36959
14084 36959 11670 40904 71925 109156 84354 47343 16338 12586 54232 54046 107053 121842
14072 121842 54452 18060 17046 -5407 2771 69880 99873 109881 97204 131297 137164 183476
14060 183476 201064 111219 94309 156477 116339 139665 152280 140382 75568 86033 101515
14049A01515J2044n4199R361m729l1319K5151M1631N7402l392k1552L439M2027
14037A77379M4452P40j24788m5700k5850j7453K2159K2592j388k9013L0241K5068
14025G8439K4201J4902l6914o2085k2574j2242N4421m497m8136L6792k4000K6337
14013B4644O4527L7739k8858l7537l8471m7701p804O5429K673J0267M510j2085
14001C7333R381K7362P0426K0686m9198j9623J1009j24n1671p340L8901K1475
13989A08617n0674J1023L4470N321k6158K4724K0698J3854J222M6665L8049n685
13977B22126Q659k1193m810j2791o3987l1090M0376K5804M7315K8214n05J8332
13965B56450J4856l6688n2265k7616K7733m5622l9746r331j1338K3680j8676O6003
$$ plain form
14049 101515 113559 59360 68721 63992 32673 57824 99455 156857 153465 131913 135352 177379
14037 177379 221831 222571 97783 52083 26233 8780 30939 53531 52143 23130 53371 78439
14025 78439 102640 117542 80628 18543 -4031 -16273 38148 33651 -14485 22307 -1693 24644
14013 24644 89171 126910 98052 60515 22044 -25657 -33461 31968 34641 44908 49418 37333
14001 37333 46714 74076 144502 165188 115990 96367 107376 107252 55581 48241 87142 108617
13989 108617 57943 68966 103436 108757 82599 107323 128021 141875 143097 189762 227811 222126
13977 222126 230785 209592 204782 191991 128004 96914 137290 163094 210409 238623 238118 256450
13965 256450 271306 234618 182353 154737 182470 136848 97102 87771 76433 100113 81437 147440
13953A47440J8413l6735L0906P5425n2565q596l0160j3140q404J2531l0781j4259
13941I0075L8710j9900l9003Q804K253P4283j179L2097J9335M2499l0491r6479
$$ plain form
13953 147440 165853 129118 160024 235449 182884 174288 144128 130988 122584 135115 104334 90075
13941 90075 128785 108885 69882 78686 80939 155222 154043 186140 205475 247974 217483 121004
$$ [...]
##END NTUPLES=NMR SPECTRUM
##END=
