##TITLE=Analysis number 329414
Compound Code cc 69326
Book Reference 547/18/4
Project Code adrs
Chemist Name simonw
##JCAMPDX= 6.0         $$ Bruker NMR JCAMP-DX V2.0
##DATA TYPE= NMR SPECTRUM
##DATA CLASS= NTUPLES
##ORIGIN= Bruker BioSpin GmbH
##OWNER= nmr
$$ XWIN-NMR		Version 3.5
$$ Thu Aug 30 12:22:49 2007 GMT Daylight Time (UT+1h)  MAYBRIDGE\nmr@NMR_250MHZ
##.OBSERVE FREQUENCY= 250.131544655141
##.OBSERVE NUCLEUS= ^1H
##.ACQUISITION MODE= SIMULTANEOUS (DQD)
##.ACQUISITION SCHEME= undefined
##.AVERAGES= 16
##.DIGITISER RES= 18
##SPECTROMETER/DATA SYSTEM= dpx250
##.PULSE SEQUENCE= zg30
##.SOLVENT NAME= CDCl3
##.SHIFT REFERENCE= (INTERNAL, CDCl3, 0, 16.522)
##AUDIT TRAIL= $$ (NUMBER, WHEN, WHO, WHERE, WHAT)
$$ ##TITLE= Audit trail, XWIN-NMR		Version 3.5
$$ ##JCAMPDX= 5.01
$$ ##ORIGIN= Bruker BioSpin GmbH
$$ ##OWNER= nmr
$$ C:\u/data/dgb/nmr/ADRS/1810/pdata/1/auditp.txt
$$ ##AUDIT TRAIL=  $$ (NUMBER, WHEN, WHO, WHERE, WHAT)
(   1,<2007-08-30 12:21:27.48 +100>,<MAYBRIDGE\nmr>,<NMR_250MHZ>,
      <created by zg, POWCHK disabled, PULCHK disabled
       configuration hash MD5:
       76 6E 9A 78 1E 09 19 81 EC 84 63 8F B0 6A 59 2D
       data hash MD5: 64K
       0B 3D 8D 79 1D A4 70 D3 64 81 14 B4 3D 30 16 0C>)
(   2,<2007-08-30 12:22:01.26 +100>,<MAYBRIDGE\nmr>,<NMR_250MHZ>,
      <Start of raw data processing
       ef LB = 0.3 FT_mod = 6 PKNL = 1 SI = 32K 
       data hash MD5: 32K
       35 8E 9B 4C 4B 4E 6C 1F 54 60 84 14 EF 51 1B 10>)
(   3,<2007-08-30 12:22:06.41 +100>,<MAYBRIDGE\nmr>,<NMR_250MHZ>,
      <apk 
       data hash MD5: 32K
       C7 16 A4 60 DD 81 BB E5 3C BA F0 F9 CB 62 73 A3>)
(   4,<2007-08-30 12:22:11.21 +100>,<MAYBRIDGE\nmr>,<NMR_250MHZ>,
      <abs ABSG = 5 
       data hash MD5: 32K
       B6 01 5B 73 14 F0 66 00 93 8C 22 B6 21 B2 8B D7>)
$$ ##END=
$$ 
$$ hash MD5
$$ 65 DF DA 0B FE C1 FE 10 51 21 9E D9 B4 B5 6F ED
##$RELAX= 
##$RELAX= 
##$RELAX= 
##$RELAX= 
##$RELAX= 
##$RELAX= 
##$RELAX= 
$$ Bruker specific parameters
$$ --------------------------
##$DU= <C:\u>
##$EXPNO= 1810
##$NAME= <ADRS>
##$PROCNO= 1
##$TYPE= <nmr>
##$USER= <dgb>
##$AMP= (0..31)
100 100 100 100 100 100 100 100 100 100 100 100 100 100 100 100 100 100 
100 100 100 100 100 100 100 100 100 100 100 100 100 100 
##$AQSEQ= 0
##$AQ_mod= 3
##$AUNM= <au_zg>
##$AUTOPOS= <53 >
##$BF1= 250.13
##$BF2= 250.13
##$BF3= 250.13
##$BF4= 250.13
##$BF5= 500.13
##$BF6= 500.13
##$BF7= 500.13
##$BF8= 500.13
##$BYTORDA= 1
##$CFDGTYP= 0
##$CFRGTYP= 5
##$CHEMSTR= <none>
##$CNST= (0..31)
1 1 145 1 1 1 1 1 1 1 1 1 1 1 1 1 1 1 1 1 1 1 1 1 1 1 1 1 1 1 1 1 
##$CPDPRG= <>
##$CPDPRG1= <>
##$CPDPRG2= <>
##$CPDPRG3= <>
##$CPDPRG4= <mlev>
##$CPDPRG5= <mlev>
##$CPDPRG6= <mlev>
##$CPDPRG7= <mlev>
##$CPDPRG8= <mlev>
##$CPDPRGB= <>
##$CPDPRGT= <>
##$D= (0..31)
0 1 0 0 0 0 0 0 0 0.06 0 0 0 0 0 0 0.0002 0 0 0 0 0 0 0 0 0 0 0 0 0 0 
0 
##$DATE= 1188472884
##$DBL= (0..7)
120 120 120 120 120 120 120 120 
##$DBP= (0..7)
150 150 150 150 150 150 150 150 
##$DBP07= 0
##$DBPNAM0= <>
##$DBPNAM1= <>
$$ [...]
##$SUBNAM7= <"">
##$SUBNAM8= <"">
##$SUBNAM9= <"">
##$SW= 20.6930455092707
##$SWIBOX= (0..15)
0 0 3 0 0 0 0 0 0 0 0 0 0 0 0 0 
##$SW_h= 5175.983436853
##$TD= 65536
##$TD0= 1
##$TE= 296.16
##$TE2= 300
##$TE3= 300
##$TEG= 300
##$TL= (0..7)
0 120 120 120 120 120 120 120 
##$TP= (0..7)
150 150 150 150 150 150 150 150 
##$TP07= 0
##$TPNAME0= <>
##$TPNAME1= <>
##$TPNAME2= <>
##$TPNAME3= <>
##$TPNAME4= <>
##$TPNAME5= <>
##$TPNAME6= <>
##$TPNAME7= <>
##$TPOAL= (0..7)
0.5 0.5 0.5 0.5 0.5 0.5 0.5 0.5 
##$TPOFFS= (0..7)
0 0 0 0 0 0 0 0 
##$TUNHIN= 0
##$TUNHOUT= 0
##$TUNXOUT= 0
##$USERA1= <user>
##$USERA2= <user>
##$USERA3= <user>
##$USERA4= <user>
##$USERA5= <user>
##$V9= 5
##$VALIST= <valist>
##$VCLIST= <CCCCCCCCCCCCCCC>
##$VD= 0
##$VDLIST= <DDDDDDDDDDDDDDD>
##$VPLIST= <PPPPPPPPPPPPPPP>
##$VTLIST= <TTTTTTTTTTTTTTT>
##$WBST= 1024
##$WBSW= 4
##$XGAIN= (0..3)
0 0 0 0 
##$XL= 0
##$YL= 0
##$YMAX_a= 374493
##$YMIN_a= -376479
##$ZGOPTNS= <>
##$ZL1= 120
##$ZL2= 120
##$ZL3= 120
##$ZL4= 120
##$ABSF1= 16.522
##$ABSF2= -4.171173
##$ABSG= 5
##$ABSL= 3
##$ALPHA= 0
##$AQORDER= 0
##$ASSFAC= 0
##$ASSFACI= 0
##$ASSFACX= 0
##$ASSWID= 0
##$AUNMP= <proc_1d>
##$AZFE= 0.1
##$AZFW= 0.1
##$BCFW= 0
##$BC_mod= 0
##$BYTORDP= 0
##$COROFFS= 0
##$CY= 12.5
##$DATMOD= 1
##$DC= 0
##$DFILT= <>
##$DTYPP= 0
##$F1P= 14.0000005364418
##$F2P= -0.99999901652339
##$FCOR= 0.5
##$FTSIZE= 32768
##$FT_mod= 6
##$GAMMA= 0
##$GB= 0
##$INTBC= 1
##$INTSCL= 1
##$ISEN= 128
##$LB= 0.3
##$LEV0= 0
##$LPBIN= 0
##$MAXI= 10000
##$MC2= 0
##$MEAN= 0
##$ME_mod= 0
##$MI= 0
##$NCOEF= 0
##$NC_proc= -3
##$NLEV= 6
##$NOISF1= 0
##$NOISF2= 0
##$NSP= 0
##$NTH_PI= 0
##$NZP= 0
##$OFFSET= 16.522
##$PC= 1
##$PHC0= -34.62881
##$PHC1= 3.069935
##$PH_mod= 1
##$PKNL= yes
##$PPARMOD= 0
##$PSCAL= 4
##$PSIGN= 0
##$REVERSE= no
##$SF= 250.13
##$SI= 32768
##$SIGF1= 0
##$SIGF2= 0
##$SINO= 400
##$SIOLD= 32768
##$SREGLST= <1H.CDCl3>
##$SSB= 0
##$STSI= 32768
##$STSR= 0
##$SW_p= 5175.98343685301
##$SYMM= 0
##$S_DEV= 0
##$TDeff= 65536
##$TDoff= 0
##$TI= <Analysis number 999999
Compound Code 99
Book Reference 9
Project Code 9>
##$TILT= no
##$TM1= 0
##$TM2= 0
##$TOPLEV= 0
##$USERP1= <user>
##$USERP2= <user>
##$USERP3= <user>
##$USERP4= <user>
##$USERP5= <user>
##$WDW= 1
##$XDIM= 32768
##$YMAX_p= 312889179
##$YMIN_p= -172990
$$ End of Bruker specific parameters
$$ ---------------------------------
##NTUPLES= NMR SPECTRUM
##VAR_NAME=  FREQUENCY,     SPECTRUM/REAL,   SPECTRUM/IMAG
##SYMBOL=    X,             R,               I
##VAR_TYPE=  INDEPENDENT,   DEPENDENT,       DEPENDENT
##VAR_FORM=  AFFN,          ASDF,            ASDF
##VAR_DIM=   32768,         32768,           32768
##UNITS=     HZ,            ARBITRARY UNITS, ARBITRARY UNITS
##FACTOR=    0.157963299565203, 1,           1
##FIRST=     4132.6476996994, 0,             0
##LAST=      -1043.33573715361, 0,           0
##MIN=       -1043.33573715361, -172990,     0
##MAX=       4132.6476996994, 312889179,     0
$$ Real data points
##PAGE= N=1
##DATA TABLE= (X++(R..R)), XYDATA
$$ [...]
26758A4243j1122K7537J6573l1431k2727J9321j0229J32L0199J1111P515L300
26746E4422n1428k1560J1695M2505l7020m8029J3724K4360M3249M253k8430k6945
26734a9204J1935N0700k8536j7258p189j8570J161N5561J7519m0059j5315P375
26722a880J9196J7458P76M1742j3113k4248l4405n142k2627k2808L3893J5411
26710D253n886K7287N043k0616k4456L85K9702J0783j895o2197J2177M3749j142
26697A7187k8288J3849L5779k6019j1998J3019J6006m045L451k998j7032P785
26685A6696J8498r088K6647k1632k9337o1931K4253l0737n2718L687j3557N0241
26673g8978Q7240K0491L5361j6831q3824j0745J2670j4403M864j9706R284L1206
$$ plain form
26758 14243 3121 30658 47231 15800 -6927 12394 2165 2297 32496 43607 51122 54422
26746 54422 2994 -18566 -6871 35634 -1386 -49415 -35691 -11331 31918 36171 7741 -19204
26734 -19204 -7269 43431 14895 -2363 -9552 -28122 -26961 28600 46119 6060 -9255 -1880
26722 -1880 17316 34774 35550 77292 64179 39931 5526 384 -22243 -45051 -11158 4253
26710 4253 -1633 25654 30697 10081 -14375 -13990 15712 26495 24600 -37597 -25420 18329 17187
26697 17187 -11101 2748 38527 12508 510 13529 29535 25490 28941 25943 8911 16696
26685 16696 35194 26106 52753 31121 1784 -60147 -35894 -66631 -119349 -115662 -129219 -78978
26673 -78978 8262 28753 64114 47283 -36541 -47286 -34616 -49019 -44155 -63861 -54577 -23371
26661b3371J014j1644J1889k6630N3051M1068K66j5098k1453k6556j2371P816
26649b2019O517j6755J0376M4968J3791J0429j5468l9816j3971j0904l1131r348
26637g3331q262J8265M647m704j89j1249j2380J2391M7524J5870J6863J551P289
26624A4285P206P916J4936l1228l6733Q357L4222L363q031p459j6870J618M1221
26611C2803j448m8916K068k0801J8939J804K9047J6481k2772J4008K0383j997
26599C9599l3172k401K1450J2467j017m1208l43r222R111K8133K0407n6404o2471
26586g5071k1228N6921P5007Q620o595j9555k476K6363M8537L7673p17p722l5324
26573H4433N374l5284m4106k3729q157K2700J5136k6701l454J8160J9039M361
$$ plain form
26661 -23371 -22357 -34001 -22112 -48742 4309 45377 45643 30545 9092 -17464 -29835 -22019
26649 -22019 -15502 -32257 -21881 23087 36878 47307 31839 -7977 -21948 -32852 -63983 -73331
26637 -73331 -81593 -63328 -58681 -63385 -63574 -74823 -87203 -74812 -27288 -11418 5445 6996 14285
26624 14285 21491 29407 44343 13115 -23618 -15261 18961 22324 14293 6834 -10036 -8418 32803
26611 32803 31355 -17561 -15493 -36294 -17355 -15551 13496 29977 7205 21213 41596 39599
26599 39599 6427 4026 25476 37943 36926 -4282 -4625 -13847 -4736 23397 43804 -12600 -75071
26586 -75071 -96299 -39378 35629 44249 37654 18099 15623 41986 90523 128196 127479 119757 84433
26573 84433 89807 54523 10417 -13312 -21469 1231 16367 -10334 -13788 4372 23411 27772
26561B7772L4829k603j6979o889k9044k5412K3754K153k701K1030l5424o6372
26549g5886M0964M8202J7014j793j1193j1044J3851j7815l346j6037P809L7599
26537B8325m0368m6222K672m340j0712L3720L7092K8189k9276M1300j5581n4609
26525b9810o35M4598K0725l963l2717K3138j4814q424J1210J9601l2975k9584
26513c3650J9715l984N0689L3809L9109R993n6234r1042m4034j871L6786M5906
26501E192j0333J5989q147K2069l4189r847n3898M1473J4437l2229m1455M2949
26489d7989P9661O123m7244r2o241q937P4346L6027k0856J241j9838n6298o0653
26476g0750M127N9972L7530n799q6439j1435J1850j5116M4760M0046K6399K8518
$$ plain form
26561 27772 62601 59998 43019 36130 7086 -18326 5428 7581 4880 25910 -9514 -75886
26549 -75886 -34922 13280 30294 28501 17308 6264 20115 2300 -1046 -17083 -9274 28325
26537 28325 -12043 -58265 -55593 -59933 -70645 -36925 167 28356 -920 40380 24799 -29810
26525 -29810 -30445 14153 34878 30915 -1802 21336 6522 -1902 9308 28909 -4066 -33650
26513 -33650 -13935 -17919 32770 66579 105688 115681 59447 -31595 -75629 -77500 -40714 5192
26501 5192 -5141 10848 2701 24770 -9419 -19266 -73164 -31691 -17254 -49483 -90938 -47989
26489 -47989 31672 37795 -9449 -9541 -15782 -24719 49627 85654 64798 66039 46201 -10097 -70750
26476 -70750 -66623 -6651 30879 25080 -61359 -72794 -60944 -76060 -31300 8746 35145 63663
26464F3663l3569j9914l2172J7994k75j157j029l5359P73K2340K2595k5193k5032
26451d6335L2874J9402k177j7414J9009J4781j2879p265M744L730M4156L5012
26439H7638j2418n8354J3840K619j6403n5444l6701q306N8747M5476J8834j9226
26427B0302K216l330J5109J3681n3357l1333j0744J1764K5023r01K3078K4049
26415C5557q78K0659o926o2843j0769M4764M9655j7852R78r905K1437K7552j5055
26402G6374j5486J659j8794k7336n9246k5881J9973J4522J0334K747L5956O143
26390B0965l26L2666l4260r662k0311l5942M9822L6055L8372k2433l9149K491
26378A8288M3739J1099j5668j4072j9205j4946k1105R608K6358M1256l3514L6
$$ plain form
26464 63663 30094 10180 -21992 -3998 -4273 -5430 -6459 -41818 -41045 -18705 3890 -21303 -46335
26451 -46335 -13461 5941 3764 -13650 5359 20140 7261 -4 4740 8470 52626 87638
26439 87638 75220 16866 30706 33325 16922 -38522 -75223 -83529 -24782 20694 39528 20302
26427 20302 22518 19188 34297 47978 -5379 -36712 -47456 -35692 -10669 -11570 11508 35557
26415 35557 34679 55338 48412 -14431 -25200 19564 69219 51367 52345 42440 63877 91429 76374
26402 76374 60888 62547 43753 16417 -42829 -68710 -48737 -34215 -23881 -21134 14822 20965
26390 20965 20639 53305 19045 9383 -10928 -46870 2952 39007 77379 54946 15797 18288
26378 18288 62027 73126 57458 43386 24181 9235 -11870 -2262 24096 65352 31838 31874
26366C1874L7944J0505l1410k3831J9955K0357p094n774m4948k0192J6089j3226
26354i751j3019P1l8160L2056M8445R471P622l4245r573K6890l2457m2515l484
26341e8649J8158O2776M0430J5588k5853J2240K1799K4670L5857j3983n2262k0319
26329F0452m9771j6198k2411J0630K0139j7876j6913j7538Q958n115J5003K1198
26317i442p723K608l0486q68k540P541j8321J7594K0424k4125l0624J5322O6940
26304F300K4565k3125k236J5106K3088q945K2030j1339j5352O411J4686K630j7626
26291C6193q37J6463m2770l4605K4058P419n662j574j7062j0251q188L5392J2734
26278A1310o470q445M287j6089j6695k1115N6603L9736l3695m6729P715L2190
$$ plain form
26366 31874 69818 80323 48913 25082 45037 65394 58300 52526 7578 -12614 3475 -9751
26354 -9751 -22770 -22699 -60859 -28803 19642 29113 36735 2490 -7083 19807 -12650 -55165 -58649
26341 -58649 -40491 22285 62715 78303 52450 64690 86489 111159 147016 133033 80771 60452
26329 60452 10681 -5517 -27928 -17298 2841 -15035 -31948 -49486 -40528 -45643 -30640 -9442
26317 -9442 -17165 -14557 -45043 -45911 -48451 -40910 -59231 -41637 -21213 -45338 -75962 -60640 6300
26304 6300 30865 7740 5504 20610 43698 34753 56783 45444 30092 36503 51189 53819 36193
26291 36193 35356 51819 9049 -25556 -1498 5921 259 -1315 -18377 -28628 -36816 -1424 11310
26278 11310 4840 -3605 682 -15407 -32102 -53217 3386 43122 9427 -37302 -29587 2603
26266B603J382K5735r252j0955l9602P780N4361J1857J2611J2400k9019j4239
26254B5662m59M901K039K369j4483J398J5570o737k3695l226P8m33R27M962l0893
26239b2020k2644K1937M6137M7317k888k9158j7228m229r039k5076J2440q874
26227a3325J2543K9580J5995q815o947j9828k5987l6791L4458N4950j7092l4341
26215a5600j7920K5360J3067j3396J7624K9531q365k3380k7463L0744M2587j0762
26203D2027n10L6307L3104l328J4001n249k8742l4495K2799J3878m7045n6154
26191a3407K2669L4815k4717Q643j6965j7448j7793K9075J5899j0117l9858k5770
26179e4974J5498J824J3494Q307J7429l3273K6439J5520J0745K1985j7871l038
$$ plain form
26266 2603 3985 29720 20468 9513 -30089 -22309 32052 43909 56520 68920 39901 25662
26254 25662 25203 30104 32143 34512 20029 21427 36997 30260 6565 3339 3417 2984 3911 8873 -22020
26239 -22020 -44664 -22727 23410 70727 67839 38681 21453 17224 8185 -16891 -4451 -13325
26227 -13325 -782 28798 44793 35978 29031 9203 -16784 -53575 -19117 35833 18741 -15600
26215 -15600 -33520 -8160 4907 -8489 9135 38666 30301 6921 -20542 10202 52789 42027
26203 42027 41517 77824 110928 107600 121601 116352 87610 53115 75914 89792 42747 -13407
26191 -13407 9262 44077 19360 28003 11038 -6410 -24203 4872 20771 10654 -29204 -54974
26179 -54974 -39476 -37652 -24158 -15851 1578 -31695 -5256 10264 21009 42994 25123 22085
26167B2085J3898j525N011q444K4178q821k2390o432j6221K9572K243k4547J2045
26154B0652L0831L1388r235m0582l2814p037L257j8302K2454j9010o957K9311
26142C956J3637j2074P515k0464p147j0089P4J3354J6739l2896p142K6560k641
26129a0618k3351K075j5220L2972J7510l3187K0108k1949l0231j3922r958N7807
26117b7964K6860l1620o115K6797N624r911L4427k2671M6297N2231O243m3099
26105E7099j1825J6881L6057n0952j2557k301m7151l0250j3416K7875M4388K8424
26093D2272J1321M120l7002N591q198j6733k6256k1864l3332J0903J9281L8069
26081a1828N3928j6074k8284k4597l7437Q789L8274k9358n819K2439M1462J4996
$$ plain form
26167 22085 35983 34458 39469 31025 55203 46382 23992 17560 1339 30911 33154 8607 20652
26154 20652 51483 82871 73636 33054 240 -6797 -3540 -21842 612 -18398 -25355 3956
26142 3956 17593 5519 13034 -7430 -14577 -24666 -24592 -11238 5501 -27395 -34537 -7977 -10618
26129 -10618 -33969 -31894 -47114 -14142 3368 -29819 -9711 -31660 -61891 -75813 -85771 -27964
26117 -27964 -1104 -32724 -38839 -12042 -6418 -16329 18098 -4573 41724 93955 100198 57099
26105 57099 45274 62155 98212 47260 34703 32402 -14749 -44999 -58415 -30540 13848 42272
26093 42272 53593 57713 20711 26302 18104 1371 -24885 -46749 -80081 -69178 -49897 -11828
26081 -11828 42100 26026 -2258 -26855 -64292 -55503 -17229 -46587 -52406 -29967 11495 26491
26069B6491k3430L0848J5189p5071o6503k7925K0522N1301K7937j4112N046K4202
26057e505l7488k8555L4630J8408j2897n3364Q425N0708L0414J9141j0864J9107
26045C2160m720l4957l1963j0023K3229j8806k5734K3291L9570O181j9964L0172
26033H436N0043k1581j5058k8345Q627K3957k4897m8601l6549N4581N9735j3046
26021A7302P510k3243k9503M310M6801M5543L6117k5006j4890j6868m4494k4306
26009b0727J8463J7352M0602j595K3021m390j4503k4974j2835L1218n098j0978
25997C5556L2631j9657p1768j1875N3819j5629j315k8072N1429K9707m636j1211
25985C8979k734k7308j7242K0824J4271r161J1919L6420q898k9098J5967M304
$$ plain form
26069 26491 3061 33909 49098 -25973 -92476 -120401 -99879 -48578 -20641 -34753 -29707 -5505
26057 -5505 -42993 -71548 -36918 -18510 -31407 -84771 -76346 -25638 4776 23917 13053 32160
26045 32160 27440 -7517 -39480 -49503 -26274 -45080 -70814 -47523 -7953 -1772 -21736 8436
26033 8436 58479 36898 21840 -6505 2122 26079 1182 -47419 -83968 -29387 30348 17302
26021 17302 24812 1569 -27934 -23624 23177 68720 104837 79831 64941 48073 3579 -20727
26009 -20727 -2264 15088 55690 54095 77116 72726 58223 33249 20414 51632 46534 35556
25997 35556 68187 48530 -23238 -35113 18706 3077 1762 -26310 25119 54826 50190 38979
25985 38979 36245 8937 -8305 12519 26790 17629 29548 65968 57070 27972 43939 48243
25973D8243j8247p629k8216k1596K953q123m915J2841L4023N1959n199Q258J316
25960F5668k831k8702m2880l1890L7043P190K550J7637j736k2651r302J6972J0186
25947A7254K8334j4332m7142M4254o684l0138Q359J4735l103J8484M2430k0097
25935E2354k3862l1449n4144k9494K3369J9931k8996Q665L8705L0895j3551n3239
25923f0816j5683N1597J9578L0696M2161k414m7600l1429m538l6100O482O2994
25911A4928M704o8204k1153K4352K1594k9284L5128J9738k1286m7586J4907J08556
25899E6394K4790m9016k4035P20P871P916k1341o018J314r167K1168k0259L5966
25886B6303k2245o367j6646k7986P188J0870p426l8013N4348J9245j6965J7938
$$ plain form
25973 48243 29996 22367 -5849 -27445 -24492 -32615 -37530 -24689 9334 61293 56094 64352 65668
25960 65668 62837 34135 -8745 -40635 -3592 3598 6148 23785 22049 -602 -9904 7068 17254
25947 17254 45588 31256 -15886 28368 21684 -8454 -95 14640 11537 30021 72451 52354
25935 52354 28492 -2957 -57101 -86595 -63226 -43295 -72291 -63626 -24921 5974 -7577 -60816
25923 -60816 -76499 -24902 -5324 25372 67533 65119 17519 -13910 -18448 -54548 -48066 14928
25911 14928 19632 -48572 -69725 -45373 -23779 -53063 -17935 1803 -19483 -67069 -52162 56394
25899 56394 81184 32168 8133 8853 16724 24640 3299 -2719 -1405 -10572 10596 -9663 26303
25886 26303 4058 -2309 -18955 -46941 -39753 -28883 -36309 -74322 -19974 -729 -17694 244
25874B44R718J4279p695m3681L8644K4947L0777K6384l4009k1547j592j2990j0706
25861A2773K5026M7060J5930L9164r456l6715l2921k7503m6653O886m2620Q514
25849d0515O1510J6193l785j4796O30n043n337J4125l4776l0018K11J9854o129
25836b7876J0385L0768l7546l3973J5816L2402k9754K4647J2946j8812n196M6459
25824B0266q146K679j6831J2586K6201j1195j0694k3145k5371J8116L1165J3110
25812B8741K0761j4925P006m1384l3511j8139P838O4391j0395m191J3883L1987
25800E2062N817m7644l206J9058m7510N3118L6160M9532q004k1764N241j1455
25788H1405l1419N004r643o5185r620K8505m284J7424M3443o106j6867J0321L064
$$ plain form
25874 244 9962 24241 16546 -27135 11509 36456 67233 93617 59608 38061 36469 23479 12773
25861 12773 37799 84859 100789 139953 130497 93782 60861 33358 -13295 -6409 -49029 -40515
25849 -40515 20995 37188 33403 18607 19237 14194 8857 22982 -11794 -41812 -41601 -21747 -27876
25836 -27876 -17491 13277 -24269 -58242 -42426 -10024 -39778 -15131 -2185 -20997 -26193 20266
25824 20266 12120 14799 -2032 10554 36755 25560 14866 -8279 -33650 -15534 15631 28741
25812 28741 49502 34577 41583 199 -33312 -51451 -43613 20778 10383 6192 20075 52062
25800 52062 57879 10235 7029 26087 -21423 31695 67855 117387 109383 87619 92860 81405
25788 81405 49986 54990 45347 -19838 -29458 -953 -5237 12187 55630 49524 32657 42978 46042
25775D6042K3236j3823R561L346j8628k5184k6539n368j8967Q331j107k6403j661
25762d7164M88k6817J6612Q6186K5133j4219l1472K3639N592l245K538J3855n7679
25749f553j9556r52j4935O570R528M776R558J7194L7127L157k3481J1286J9880
25736E3599m3505l4817J9865K6403K5661l007l0127J81L6902J3253l8901l1011
25724e504n333Q479j495Q089J8585p514j2230K4609k753j4839r345L0006k1998
25711H757J7181J9778j1956j9156O368j2876J5420k4435j0830L260Q690k9819
25699b9618l0578L9745L9698L2828j4919l0058N751K5550J8674k2228k4642j5469
25687e266R947K4877O634j7019m0636n475M638J3377L5510l10n704k1533N4054
$$ plain form
25775 46042 69278 55455 65016 68362 49734 24550 -1989 -7357 -26324 -17993 -19100 -45503 -47164
25762 -47164 -46676 -73493 -56881 29305 54438 40219 8747 32386 37978 34733 37271 51126 -6553
25749 -6553 -26109 -27061 -41996 -35426 -25898 -21122 -11564 5630 42757 45914 22433 33719 53599
25736 53599 10094 -24723 -4858 21545 47206 44199 14072 14253 51155 64408 25507 -5504
25724 -5504 -10837 -2358 -3853 4236 22821 15307 3077 27686 24933 10094 749 30755 8757
25711 8757 25938 45716 33760 14604 20972 8096 23516 -919 -11749 -8489 201 -29618
25699 -29618 -60196 -20451 19247 52075 37156 7098 12849 38399 57073 34845 10203 -5266
25687 -5266 4681 29558 36192 19173 -21463 -26938 -22300 -8923 26587 26277 20573 -960 53094
25674E3094k2503j6787M547K0231L297k1401L9184r865o4737j8273K8841J57k0705
25661b4920j5324L2022j1634n3632J9069P3330j7941N729K8504q00l5677l9942
25649d1216K834l193Q933J9277L8627J8534k6164J428J7913m0426j4902O5567
25637D7212K9974L331k5328r6415j2579J3094J5920q611J3380J6995K5070M1583
25625F3626J3054p1633l6354k1985M42J1041o711j839K3904K4628P1048J3656
25613H2877l8353n2709l8726k8225Q907K7094L7903J9875J2826O173K2816M2626
25601A03084J000m8965k7318k98L4436J964R718l9565n9749J0107M6043J7153
25589D7610J4057q1824j3083r441r69J0558j6828L775M5273N252l7003O720N626
$$ plain form
25674 53094 30591 13804 18351 38582 41879 20478 59662 49797 -14940 -33213 -4372 -4215 -24920
25661 -24920 -40244 -8222 -19856 -73488 -54419 18911 970 6699 35203 34403 -1274 -41216
25649 -41216 -38382 -41575 -32642 -13365 25262 43796 17632 19060 36973 -3453 -18355 47212
25637 47212 77186 80517 55189 -41226 -53805 -40711 -24791 -33402 -20022 -3027 22043 63626
25625 63626 76680 5047 -31307 -53292 -52850 -41809 -48520 -50359 -26455 -1827 69221 82877
25613 82877 44524 -8185 -46911 -75136 -66229 -39135 -1232 18643 31469 37642 60458 103084
25601 103084 104084 55119 27801 27503 61939 63903 73621 34056 -25693 -15586 30457 47610
25589 47610 61667 -20157 -33240 -42681 -43650 -33092 -49920 -46145 -872 4380 -32623 -25903 -20277
25576b0277j1237K5706Q327M388M5728O918P695k0216m0627J6324r41l8652q2178
25563i9042K7563K4288j0853M8689L5759l6329K1093K7330p6513k5743K0401K8632
25551a4725L5352K8605j7329n0J8658j2754R768j7218k2425J6215Q76m990R030
25538B9013K3948J0589k3173R515m322k9778j7169P661J294j6612j5132K5058
25526H92n2374K522M3915j5524k7120Q637K7111J6359j8895p221L1896j879K8095
25513C6414N178m2136o0618j3767J4248M0012J1397l6091N8452P8610j8303m2064
25501C1332l9403j4378L6307j4177N488K8054j9108k2386Q580R760l2400l1218
25489e3549k1874J4962j2887J5739K9921L1828R673r80o612M7154N2637j8216
$$ plain form
25576 -20277 -31514 -5808 2519 6907 52635 59553 67248 47032 6405 22729 21788 -16864 -99042
25563 -99042 -71479 -47191 -58044 -9355 26404 -9925 11168 38498 -38015 -63758 -43357 -14725
25551 -14725 20627 49232 31903 31853 50511 37757 47525 30307 7882 24097 24973 19983 29013
25538 29013 52961 63550 40377 49892 45570 15792 -1377 6284 7578 -9034 -24166 892
25526 892 -51482 -48960 -5045 -20569 -47689 -39052 -11941 4418 -14477 -21698 10198 8319 36414
25513 36414 41592 -544 -61162 -74929 -60681 -20669 -9272 -45363 13089 91699 73396 31332
25501 31332 -8071 -22449 13858 -319 5169 33223 14115 -8271 309 10069 -22331 -53549
25489 -53549 -75423 -60461 -73348 -57609 -27688 4140 13813 12833 6221 53375 106012 87796
25477H7796o2043l4387m130n964L3286J8633l1055l3346j627L0023R41o505M875
25464c503K2592k6050k7644p916J6059L0004K8407l7471r486q395O390J4666j143
25451c490K3774K1170J5580p864k6738o191k5312o189K2922l5329K7368K5306
25439B5007k6739k0332j4786K163K805K3976K7053M7968K387m9770k7977Q960
25427G15M3199K4248k7330m6376r791j4937l6862J5534j9202l4357M3202O3813
25415A856J3115k2122m458O168L6566J0858p987O789o033m2482n666q514k9865
25402e1775j7051p468j2095p832L6931J6732j6658m954N8281K1453q019j5914
25390h369o345M8160L4520J3784p838P158j5100l9348M072L3687k8110k6587K5643
$$ plain form
25477 87796 25753 -8634 -12764 -18728 14558 33191 2136 -31210 -32837 -2814 -1873 -8378 -3503
25464 -3503 19089 -6961 -34605 -42521 -26462 3542 31949 -5522 -15008 -23403 -17013 -2347 -3490
25451 -3490 20284 41454 57034 49170 22432 16241 -9071 -15260 7662 -27667 -299 25007
25439 25007 -1732 -22064 -36850 -34687 -31882 -7906 19147 67115 69502 19732 -8245 715
25427 715 43914 68162 40832 -5544 -15335 -30272 -67134 -51600 -70802 -105159 -61957 1856
25415 1856 14971 -7151 -11609 -5441 31125 41983 33996 40785 34752 -7730 -13396 -21910 -51775
25402 -51775 -68826 -76294 -88389 -96221 -59290 -42558 -59216 -64170 -5889 15564 7545 -8369
25390 -8369 -14714 33446 67966 81750 73912 81070 65970 26622 30694 64381 36271 9684 35327
25377C5327L0719M2276k6580m3117o4610M966K6517K1457O160k9286l0054l469
25365b9694Q907K2778k7044n238j2800n030j7693K426J7635K3556K0326K768M1094
25352D1991K3r542p145J7255K2813L3216l713l1483j5620j3710M9914L113m3464
25339D3648j4187k4872L44k4776m84L1625J5082n1317j104P03J9514k548k6476
25326c4848N2438J7354k6732j3656k5791R410J576k4514j4054j1340P631M703
25314e7823j071K2560L198L1582j3707J6748J2171j4696P346N549K1355k4964
25302H248l3976k0505k4950K1497L837k514n134k905L739M5884N4930K8555l3037
25289D3669j9287M840J7213K354j6124k8396J4577j3226n8057L1915K0197k9644
$$ plain form
25377 35327 66046 108322 81742 38625 -25985 -21019 5498 26955 33115 3829 -26225 -29694
25365 -29694 -20787 1991 -25053 -30291 -43091 -48121 -65814 -63388 -45753 -22197 -1871 897 41991
25352 41991 42014 32472 25327 42582 65395 98611 94898 63415 47795 34085 83999 87112 43648
25339 43648 29461 4589 4933 -19843 -20327 11298 26380 -24937 -26041 -25338 -5824 -8372 -34848
25326 -34848 17590 34944 8212 -5444 -31235 -21825 -20249 -44763 -58817 -70157 -62526 -57823
25314 -57823 -58894 -36334 -33136 -1554 -15261 1487 13658 -1038 6308 11857 33212 8248
25302 8248 -25728 -46233 -71183 -49686 -45849 -48363 -53497 -56402 -52663 -6779 48151 76706 43669
25289 43669 24382 29222 46435 48789 32665 4269 18846 5620 -52437 -20522 -325 -29969
25277b9969j232o951K799P374J4385N455j3195O697M3988j8389l2851J3377L3889
25264B5377L468r178N5241J5281n7172k3803M2839j8501m0597K8790J3393p2809
25252c7671j0594N479K8284K6018J3178K2057p09j226M5706k3196l7704r002l4756
25239a4136j1994j4436M1866K4064K5491L5360k6102j7004q625n4097j9432J6894
25227b2151J7093M2821l4565k2298P241N0201L0309o6936n4298j0021K6961j7323
25215e2966j832Q728L6632N7889j5198l7861k4135j2713Q555m75L4639J6130m2240
25202b4847L977K9215j2116l319N7555m961m9878l2985K1028K4040J0129K6784
25190D4622J6458l7498L91R390j1938j6557J8144L543j4430n0077j0316L0660
$$ plain form
25277 -29969 -31201 -38152 -35353 -27979 -13594 -8139 -21334 -14637 29351 10962 -21889 -8512 25377
25264 25377 28845 19667 74908 90189 33017 9214 52053 33552 -7045 21745 35138 -37671
25252 -37671 -48265 -42786 -14502 11516 24694 46751 46042 44816 90522 67326 29622 20620 -14136
25239 -14136 -26130 -40566 1300 25364 50855 86215 60113 43109 34484 -19613 -39045 -22151
25227 -22151 -5058 37763 3198 -19100 -11859 38342 68651 1715 -52583 -62604 -35643 -52966
25215 -52966 -54798 -46070 -9438 48451 33253 -4608 -28743 -41456 -32901 -33376 1263 17393 -24847
25202 -24847 -20870 8345 -3771 -7090 50465 45504 -4374 -37359 -16331 7709 17838 44622
25190 44622 61080 23582 23973 33363 21425 4868 23012 26555 12125 -37952 -48268 -17608
25178a7608N300L2789k6J042j4417m9410N740N7691M8709J1226p089l0363j6582
25165B7002j157k2513R590M5689J8815l1283o460j2949J1744Q4548l0918m6160
25153D5948m930k5085o4359j018N2005K6145j1804p4868n1542K9859L8744N5580
25141A4675L2128Q963j6611m2282n831m343N782L849k3202M8346N177j5152K70
25128A1769m570j4161L436L5880j1677k1601j0563k6482M0321O2145q808O842
25116F2531m0830n3213j172J5978L1487L1771J1671n225j9736q908k6005k6387
25104b8038K6209M6006J4365p397m4445O549J1446j5148K5632J4962l2587k2195
25092d641K0301m153L610j9367l4421k3908L1318L7203M1123k3393l1773K601
$$ plain form
25178 -17608 -12308 20481 20455 21497 7080 -42330 -36590 21101 69810 81036 73947 43584 27002
25165 27002 25845 3332 12922 58611 77426 46143 39683 26734 38478 123026 92108 45948
25153 45948 41018 15933 -48426 -49444 2561 28706 16902 -57966 -109508 -79649 -40905 14675
25141 14675 46803 55766 39155 -3127 -8958 -13301 -7519 -3670 -26872 21474 26651 11499 11769
25128 11769 7199 -6962 -3526 32354 20677 -924 -11487 -37969 2352 64497 55689 62531
25116 62531 21701 -31512 -32684 -16706 14781 46552 58223 52998 33262 24354 -1651 -28038
25104 -28038 -1829 44177 58542 51145 6700 13249 24695 9547 35179 50141 17554 -4641
25092 -4641 15660 11507 15117 -4250 -38671 -62579 -31261 5942 47065 23672 -8101 -5500
25080e500J5316n164P53j9050P811L7597L097L8674j9650K6587j2070n591K055
25067F4865N522k7718k1789j5550J6637L812P339l1231k5625L2122M6638l399
25055E1623m661k3480k9168J9149o628o0332K5991M894K9608P526k1909J4181
25043F794L7536K0970L4829j8902m8284j8048l0476m2821j6632P682K0720M0190
25031f442L0000L134m469r568P397j1478l0324L015q43l4301N2296K5154q006
25018A5565k7032N601K8229j9426k3537K5733O364k1667m2549K2613M0757l4211
25006b3560j9929j8972j0190Q5211M2343k7674J029j3889J5466l0468P920P779
24994A5066J9958j3261j0328m2435n2012k401L5944K9516J344k5424J6011J0278
$$ plain form
25080 -5500 9816 4652 5405 -13645 -5834 31763 34860 73534 53884 80471 68401 62810 64865
25067 64865 70387 42669 20880 5330 21967 25779 33118 1887 -23738 8384 55022 51623
25055 51623 46962 23482 -5686 13463 6835 -53497 -27506 -22612 6996 14522 -7387 6794
25043 6794 44330 65300 100129 81227 32943 14895 -15581 -58402 -75034 -67352 -46632 -6442
25031 -6442 23558 26692 22223 12655 20052 8574 -21750 -18735 -19578 -53879 -1583 23571 15565
25018 15565 -11467 -5866 22363 2937 -20600 5133 11497 -10170 -52719 -30106 10651 -23560
25006 -23560 -43489 -62461 -72651 12560 54903 27229 28258 14369 29835 -633 7287 15066
24994 15066 35024 21763 11435 -31000 -83012 -85413 -49469 -19953 -18609 -44033 -28022 -17744
24982a7744K0921J2639J3760n489N271j5036n3806q754j0533l0069k5598K7771
24970h6667M6001J5989r837M1523L562J9058J4522m8527r679j0224k4987k8648
24958g7914m2792r23J6427Q839P451K630J2971j654L5688L1494l1924p242J9887
24945b7062J0965K0960K5369L1138m0157l0902K3371j5494k466j5027O808L255
24933i242P551J7371L6206J0563J0080Q50j6531P590j1142k0847M324L48j0072
24920B7049q462j1586O703J5985k2125j4774J1012L0348R676k3966m753l9667
24908b4560J0445O1647L652k5322k1398K829K2940j0104j0664J8061k0608m5582
24896c8664o749M6716N5222l2465J1914m2539j802K6783L953K407k7294l4969
$$ plain form
24982 -17744 3177 15816 29576 24087 29358 14322 -39484 -48238 -58771 -88840 -114438 -86667
24970 -86667 -40666 -24677 -34514 7009 10571 29629 44151 -4376 -14055 -24279 -49266 -77914
24958 -77914 -120706 -121629 -105202 -96363 -88912 -86282 -73311 -74965 -39277 -7783 -39707 -46949 -27062
24945 -27062 -16097 4863 30232 61370 21213 -9689 13682 -1812 -4278 -19305 -12497 -9242
24933 -9242 -1691 15680 51886 62449 72529 73379 56848 64438 53296 32449 36773 37121 27049
24920 27049 18587 7001 13704 29689 7564 -7210 3802 34150 43826 19860 15107 -24560
24908 -24560 -14115 47532 51184 25862 4464 7293 30233 20129 9465 27526 6918 -38664
24896 -38664 -45413 1303 56525 24060 35974 -6565 -8367 18416 22369 24776 -2518 -37487
24884c7487J4486K5047n340j2292L3046L072J065P769J3914L5908l15k4985l7183
24871A6705k7365M921M606j4836m2450j1750N161J1520k7926o877R864L2162J1689
24858c4576P353n651l2269N341K820l034K037L7887K3051L4023N4486L4667k5785
24845A00350o1511m0525p389k9210l356O233K0015m803P485L1413L5978J746K1413
24832G7839k1847q0451r204K1886J0472o7570K3113N1750J9788k1895j2985M060
24820e044J4429Q563M636P295k0352k8278M874K8695q917O165J4501J9286O63
24807D6516P331k1989r556K1160l3415k8658k8397j1402K7750O2174l2490J5808
24795A4832k7073j975M3195m79j6139L3262n6l5710O954N588K0031J3482j7371
$$ plain form
24884 -37487 -23001 2046 -3294 -15586 17460 20532 21597 29366 43280 79188 78873 53888 16705
24871 16705 -10660 -5739 -1133 -15969 -58419 -70169 -65008 -53488 -81414 -88291 -78427 -46265 -34576
24858 -34576 -27223 -32874 -65143 -59802 -56982 -60016 -57979 -20092 2959 36982 91468 126135 100350
24845 100350 38839 -1686 -9075 -38285 -41641 -35408 -15393 -20196 -12711 18702 54680 56426 77839
24832 77839 55992 -24459 -33663 -11777 -1305 -68875 -45762 5988 25776 3881 -9104 -5044
24820 -5044 9385 17948 22584 29879 9527 -18751 -13877 14818 5901 12066 26567 45853 46516
24807 46516 53847 31858 22302 43462 10047 -18611 -47008 -58410 -30660 31514 -976 14832
24795 14832 -12241 -14216 28979 28500 12361 45623 45567 9857 16811 22399 42430 55912 38541
24782C8541k3626J4580K1412J618L337m5888j6574Q861J1646k1910j0790K7995
24770I202M7142k7899j7943j7810j1435M115L4516j1924M764l2668L407l641L1660
24757A1486L5726j2674J435l8809k4449J5646J5087K763K3250r262j9721L9976
24745D0454L0568J2498j6079o4344j7659J5285r744j7969p478M8473L8655n02
24733E2158l0136k8854p921k3379J1984J1486J4977j246l6227J8590N7129k945
24721C5616k9441m1526k0935K9943r125L7504L1207J6482k5595m6455k7479J6837
24709c2967L0105J1571J4469o278j3393j8941j9963m765K7243j3422j4049N336
24697c5054j5673L094K4516K3555J5468j5898k7432m582k6164K6618P4062N222
$$ plain form
24782 38541 14915 29495 50907 52525 55862 9974 -6600 2261 13907 -8003 -18793 9202
24770 9202 56344 28445 10502 -7308 -18743 -14628 19888 7964 12728 -19940 -16533 -20174 11486
24757 11486 47212 34538 35973 -2836 -27285 -11639 3448 6211 29461 20199 478 40454
24745 40454 71022 83520 67441 3097 -14562 723 -9021 -26990 -34468 14005 52660 52158
24733 52158 22022 -6832 -14753 -38132 -26148 -14662 315 -931 -37158 -18568 38561 35616
24721 35616 6175 -35351 -56286 -26343 -35468 2036 33243 49725 24130 -22325 -49804 -32967
24709 -32967 -2862 8709 23178 16900 3507 -15434 -35397 -40162 -12919 -26341 -40390 -35054
24697 -35054 -50727 -47633 -23117 438 15906 8 -27424 -32006 -58170 -31552 42510 47732
24685D7732J919m097m6410k4091n2N4088O1214L2131k1916n4859l8108k6832m3059
24672f2340m360K1577N774J9028N303j018N0476L1168j134L73l0642n8364n473
24659b9632K6170K8782j3402r521j6824J484K3022r859k761k5522p27L4864J3665
24646A9739q57k3647l5161k1863j656J6872L6951k297l0962J0393L3404o101R090
24633C905K2997Q100m9899k8334j5769O1344k99K118K0633K2466j7232r336K3810
24620D4504l8922k4022K4805J1100k4923N455m198L4071L0578j8271k5751l226
24608A1200k5862J2575L4674L2726k371j7060j1215J7910k7798j1059r528j3158
24596h966k138K414N4965J3687n0207p730j0652q131K068L202k4200k1152J1975
$$ plain form
24685 47732 49651 45554 -856 -24947 -24999 29089 90303 122434 100518 45659 7551 -19281 -62340
24672 -62340 -66700 -45123 -39349 -20321 -15018 -16036 34440 65608 64474 64847 34205 -24159 -29632
24659 -29632 -3462 25320 11918 2397 -14427 -12943 10079 220 -2541 -28063 -28790 6074 19739
24646 19739 18882 -4765 -39926 -61789 -63445 -46573 -9622 -11919 -42881 -32488 916 -5185 3905
24633 3905 26902 35002 -14897 -43231 -59000 2344 2045 4163 24796 47262 30030 20694 44504
24620 44504 5582 -18440 6365 17465 -7458 -2003 -6201 27870 58448 40177 14426 11200
24608 11200 -14662 -2087 32587 65313 62942 45882 34667 52577 24779 13720 4192 -8966
24596 -8966 -11104 -8690 46275 59962 9755 2025 -8627 -16758 -14690 -11488 -35688 -56840 -44865
24583d4865K6351m6317r499M2435O3679J5529K2776l2591l0724M8944j6709k9741
24571I268K5501K7833M7786K340o981m4734k7034J4136l411l4416l7301O584o48
24558b1077p813J5706M0474K8822l3584k3521m396K0505R756O79K4998l1148j2322
24545G079k4544r49K8180j2184p836k8332k4264J9963K8297K363j3942L6754m994
24532E591l269j936j5658J3031M827m78l3588Q445J4987M7366K459j8576K3678
24519D6879J4614r068r793m1574j7457k2351o694K8477M1999l2019j3750L143
24507a7594R229j3494J9367q1l1904J732K7409j666l1565L7973M595j8235p42
24494a4976J6900J775l1228J5903O2190O6403k0004n0419m2336l9787l773r147
$$ plain form
24583 -44865 -18514 -64831 -74330 -31895 31784 47313 70089 37498 6774 55718 39009 9268
24571 9268 34769 62602 110388 112728 105747 61013 33979 48115 44704 10288 -27013 -20429 -21077
24558 -21077 -28890 -13184 27290 56112 22528 -993 -5389 15116 24872 25551 50549 19401 7079
24545 7079 -17465 -18414 9766 -2418 -10254 -38586 -62850 -42887 -14590 -12227 -26169 10585 5591
24532 5591 2322 386 -15272 -2241 2586 2108 -31480 -23035 -8048 39318 41777 23201 46879
24519 46879 61493 52425 42632 1058 -16399 -38750 -45444 -16967 25032 -6987 -20737 -17594
24507 -17594 -8365 -21859 -2492 -2573 -34477 -32745 -5336 -7002 -38567 -594 4001 -14234 -14976
24494 -14976 1924 3699 -27529 -11626 50564 116967 96963 46544 4208 -35579 -39352 -48499
24482d8499m374K3423J1228J6965k7285K2603K8340l8560k6746L5146N5117k026
24470D5332j5875n128M038J8112K59j2016n127J7674J7085l7148j5553j3820k180
24457d347K8151J0500K1732k3376l6273k1979K3768L801K843L1617j6839j1451
24445H147o767M6542j2959j6848M0062j6915Q756j1623l7868J3929l605J4797
24433B5648J3288k2379j4073p301j8881K493M7732J331k1421l2551q278k228k6976
24420f3596K831M6491L7267K9602j4776l8945k063L0191j3416J1489j7403k4334
24408a6662J8115L7195Q294m5457l4254r410l4470M3787L3210j8894K0358j1883
24396a0071J4439J1090j5978K4828L4665l6230m8482L9106L8006K9265q107p2025
$$ plain form
24482 -48499 -52873 -29450 -18222 -1257 -28542 -5939 22401 -16159 -42905 -7759 47358 45332
24470 45332 29457 24329 28367 46479 46738 34722 29595 47269 64354 27206 11653 -2167 -4347
24457 -4347 23804 34304 56036 32660 -3613 -25592 -1824 1977 4820 36437 19598 8147
24445 8147 1380 47922 34963 18115 58177 41262 50018 38395 527 14456 10851 25648
24433 25648 38936 16557 2484 -4817 -23698 -21205 26527 27858 6437 -26114 -34392 -36620 -63596
24420 -63596 -60765 -14274 22993 52595 37819 -1126 -3189 27002 13586 25075 7672 -16662
24408 -16662 1453 38648 46942 1485 -32769 -42179 -76649 -32862 348 -18546 1812 -10071
24396 -10071 4368 15458 -520 24308 58973 22743 -25739 13367 51373 80638 72531 506
24384E06j0219R241K369m4891j7882k3631J9466M2571n483J1348p400K5219P6960
24371G8174J2380n2450J1812M7090J4054l6870n8656Q363l069K7720P635J6173
24359G2356J9189m2900o6173J577N3423j3825j1224K4111J254j7908k7960Q885
24347H05J2329k1875j4892K3053K6026n0749L1728L0247j4593j6940k8001l567
24335b6429J0875j3296j398K2596N251n0538j1433J8668k2661l3942n439J7618
24323i0128K1355J4931J2675M2489N3554O830m3311l1648L0227J9894j5530j0018
24311A1320j0808k5528J3262J6617j0225k5767j2681O368M8132J1565j3660J527
24299A0122n5338k0161J3930J1923O4639L390l6608J956l364J4952R872P345j4486
$$ plain form
24384 506 -9713 -472 1897 -42994 -60876 -84507 -65041 -22470 -27953 -16605 -24005 1214 78174
24371 78174 90554 38104 49916 97006 111060 74190 15534 23897 20828 48548 56183 72356
24359 72356 91545 48645 -17528 -15951 37472 23647 12423 36534 37788 19880 -8080 805
24347 805 13134 -8741 -23633 -580 25446 -25303 6425 36672 22079 5139 -22862 -26429
24335 -26429 -15554 -28850 -30248 -7652 -2401 -52939 -64372 -45704 -68365 -102307 -107746 -90128
24323 -90128 -68773 -53842 -41167 1322 54876 61706 18395 -13253 16974 36868 21338 11320
24311 11320 512 -25016 -11754 4863 -5362 -31129 -43810 -37442 10690 22255 8595 10122
24299 10122 -45216 -65377 -51447 -39524 25115 28505 -8103 -6147 -9511 5441 15313 22658 8172
24286H172o545j9157J185p488J6848J1063j4973p385J4758k4598N095J9625k3251
24273b6651J31K3782K843J6440N116K7950L3048k2605k0309Q148o853m9937l0456
24260c9353j2635J8807P0J0786Q921n703m264R855m0552j6145L6198J704j5818
24247d8129l3644N7246M5513k0743k9705J4177o326l8108O379J9132L8376J6041
24235B0209J5990J0797m1424j8539l854N468L1729k1298K4342P270j357J9562
24223D8895J2701p145N279o12j6396j9170k0244N916J5219J2169K5438J6260j1307
24210F7003j9053k5652l4497n497q05k4204k3493K7453J9126R940J678K7295j9237
24197E7p566J6251K2743K1607j0839k9571k4552M044n5252j9910N2211M922k1372
$$ plain form
24286 8172 1627 -17530 -16345 -23833 -6985 4078 -10895 -18280 -3522 -28120 -23025 -3400 -26651
24273 -26651 -26520 -2738 105 16545 21661 49611 82659 60054 39745 47893 41040 -8897 -39353
24260 -39353 -51988 -33181 -33111 -22325 -13404 -19107 -23371 -13516 -54068 -70213 -34015 -32311 -48129
24247 -48129 -81773 -24527 20986 243 -29462 -15285 -21611 -59719 -53340 -34208 4168 20209
24235 20209 36199 46996 5572 -12967 -16821 -11353 20376 -922 23420 30690 29333 48895
24223 48895 61596 54451 59730 59118 42722 23552 3308 9224 24443 36612 62050 78310 67003
24210 67003 47950 22298 -12199 -17696 -18501 -42705 -66198 -38745 -19619 -9679 -8001 19294 57
24197 57 -7509 8742 31485 53092 42253 12682 -11870 -7826 -63078 -82988 -30777 -25855 -47227
24184d7227K3819J7711j6633n8507n328N102K8195o532L277L4531Q0183M5810
24172A04401j3117k4561j6812K5452L7588j5512n3953q48j091j0997l5732l0890
24160c6072l1708J5206J0814J9475L4489q131k5082K4656k6112L2952j2567k6426
24148b8506J728J1468O640l7j110j4983n6467L9141L7832k5035k2780j5569O869
24135f0809P429L0954r471j1374K9084R2N095j9814K3542P582k2960J4433k9720
24122c5937m2345L3513K4861L2021J2584Q869j1053j0617J2165k2230l3524J5470
24110a6223K6403j4687k6552r980j1385j9187k5893L6482M0302k4392j3807K3887
24098c5032J4961J402j3874j4015O200J7311L7679K0789p916m926p637l7356o205
$$ plain form
24184 -47227 -23408 -5697 -22330 -80837 -86165 -81063 -52868 -59400 -56123 -21592 58591 104401
24172 104401 91284 66723 49911 75363 112951 97439 43486 42638 41547 30550 -5182 -36072
24160 -36072 -67780 -52574 -41760 -22285 12204 4073 -21009 3647 -22465 10487 -2080 -28506
24148 -28506 -26778 -15310 -8670 -8707 -9817 -24800 -81267 -42126 -4294 -29329 -52109 -67678 -60809
24135 -60809 -53380 -22426 -31897 -43271 -14187 -14095 -9000 -28814 -5272 2310 -20650 -6217 -35937
24122 -35937 -78282 -44769 -19908 12113 24697 33566 22513 11896 24061 1831 -31693 -16223
24110 -16223 10180 -4507 -31059 -41039 -52424 -71611 -97504 -61022 -20720 -45112 -58919 -35032
24098 -35032 -20071 -18669 -32543 -46558 -40358 -23047 14632 35421 27505 22579 14942 -22414 -28619
24085b8619J6788O290K280J078J0458j8479K4863J8390r360k1142L019J204j3025
24072f255n811R952L2723l6686O772j3023m1509k988m950L0784L6202N408q861
24059A758k427k057L8668j9752k4193L4556L5876k1705l5698k3512j9759k28N7245
24046A8772J1652j5598k3582L9612L841k2338l511J0373l0193k2722K066R560
24034b2068n1139j0866K9038J0114L1241l323N647J2929J0229R509R048J4976
24022D5335q673o8130j2611J7345l512n5027j2530L800K5452O0659O1267L848
24010E7223q056M026k0188J1082O563O914q037m4998m744P804l9030j0970L2766
23997i645M0240J5479J6848J3625l5886n2984L132J0362N0597N3265j4612o4563
$$ plain form
24085 -28619 -11831 -5541 -3261 -2183 8275 -10204 14659 33049 23689 2547 5566 6770 -6255
24072 -6255 -12066 -2114 30609 -6077 695 -12328 -53837 -56825 -61775 -30991 5211 10619 1758
24059 1758 -669 -2726 35942 16190 -8003 26553 62429 40724 5026 -18486 -38245 -38473 18772
24046 18772 30424 14826 -8756 30856 34697 12359 8848 19221 -10972 -33694 -31628 -22068
24034 -22068 -73207 -84073 -55035 -44921 -13680 -17003 -11356 1573 11802 21311 30359 45335
24022 45335 36662 -31468 -44079 -26734 -30246 -85273 -97803 -94003 -68551 -7892 53375 57223
24010 57223 49167 53193 33005 44087 50650 57564 49527 4529 -215 7589 -31441 -42411 -9645
23997 -9645 30595 46074 62922 76547 40661 -12323 -9191 1171 51768 105033 90421 25858
23985B5858K3393q634m4653j1178j2163J8308l4885N554K6340L3891l1843j4926
23973b4938M67m5798j3046j2171p907K1862Q0654j1097j8158J9297M1125q303
23961B1987m6478M967J585J5727L520L2139j0989n7529M580j6418J5799N3340
23949B2230n502m4045K7027k5175j4881k2902k1929K7863L5642K4701k9597k1118
23937d7686J5859J742n1279m037L2839M3922K7830k0997j5696K6437J6919q980
23925A6873J559m0734j4269q939L2774o927Q865Q867k6380j5550L2655K248r634
23912a8592L4644J6370N6682M1342k7035m0255p3406K049p136n439K3275J1499
23900A3998j6803K3421O550k0779n280l2270j9259J451J143L7562L348j300j0824
$$ plain form
23985 25858 49251 40617 -4036 -15214 -27377 -9069 -43954 -38400 -12060 21831 -10012 -24938
23973 -24938 -24471 -70269 -83315 -95486 -103393 -81531 -877 -11974 -30132 -10835 30290 21987
23961 21987 -24491 -19524 -17939 -2212 1308 33447 22458 -35071 -30491 -46909 -31110 22230
23949 22230 16728 -27317 -290 -25465 -40346 -63248 -85177 -57314 -21672 3029 -26568 -47686
23937 -47686 -31827 -30085 -81364 -85401 -52562 -8640 19190 -1807 -17503 8934 25853 16873
23925 16873 18432 -22302 -36571 -45510 -12736 -19663 -10798 -1931 -28311 -43861 -11206 -8958 -18592
23912 -18592 16052 32422 89104 130446 103411 63156 -10250 -8201 -15337 -20776 2499 13998
23900 13998 -2805 20616 27166 6387 1107 -31163 -50422 -48971 -47828 -10266 -6918 -8218 -19042
23887a9042J0579k0423j2032k8037M4090N6952J7473l753r853m4180O987J0095
23875H856J3802k6296L210K9134o731j1380K0718j1487J2313n880m8794j5036
23863c7571L7945k701l9020P037L1020k1011l2142k7745L4295P9417M4208L3998
23851A07730l0213p3286l9249j3873k9044j6843L4121M3658j6360q361L230K0783
23839a7707J0916k5969J1048K8167J0509q761Q981j0821q044j3892J7620M7396
23827D9443J170k82K1723m6940L7473j5140k7968J2022L6639k4824m1024l2162
23815b9870K5456p371k0629j7769J1077L8476k7079Q470J7346K5049J9036j8042
23803B4150L278m6900K2806N7441J1676k7990m3415k1741r503P162j5609k4325
$$ plain form
23887 -19042 -8463 -28886 -40918 -68955 -24865 32087 49560 45807 35954 -8226 -1239 8856
23875 8856 22658 -3638 -428 28706 21975 10595 31313 19826 32139 26259 -22535 -37571
23863 -37571 374 -2327 -41347 -34310 -3290 -24301 -56443 -84188 -49893 29524 73732 107730
23851 107730 77517 4231 -35018 -48891 -77935 -94778 -60657 -16999 -33359 -41720 -38490 -17707
23839 -17707 -6791 -32760 -21712 6455 16964 8203 17184 6363 -1681 -15573 2047 49443
23827 49443 50613 50331 72054 25114 62587 47447 19479 31501 68140 43316 2292 -29870
23815 -29870 -4414 -11785 -32414 -50183 -39106 -630 -27709 -19239 -1893 23156 42192 24150
23803 24150 27428 -19472 3334 60775 72451 44461 1046 -20695 -30198 -23036 -38645 -62970
23791f2970K002N8624r216l3749J7132L0328K6791k6936l0668m047r515l8376
23779h0600j1568K1609l4128k0885K433M563J7138N9368J870L1573L582k1789
23767b6834M6334L5732m9644j2538K6420j8851L389J3890k4092n38j2993l6877
23755e6602l6055L9205P4921r701l4731J3257K8333j3367n4855p020K2740p99
23743c4674k426k5892J4335M1393q782l7533J5466O9750L3385j6290j5120n2809
23731a9197k5370K6370K7006l602J3926j4345J6641m004n555k6921J3212O9415
23719F7576L3001J7320k4491p1505l4637j9914L7332J1129m767j486L981K0143
23707C3682m6561l4933J2736L1100K9474O098L056k5272k2860r7j5416K5216N5942
$$ plain form
23791 -62970 -60968 -2344 -11560 -45309 -28177 2151 28942 2006 -28662 -32709 -42224 -80600
23779 -80600 -92168 -70559 -104687 -125572 -123139 -118576 -101438 -42070 -40200 -8627 -5045 -26834
23767 -26834 19500 55232 5588 -6950 19470 619 4008 17898 -6194 -6732 -19725 -56602
23755 -56602 -92657 -53452 21469 11768 -22963 -9706 18627 5260 -49595 -56615 -33875 -34674
23743 -34674 -37100 -62992 -48657 -7264 -16046 -53579 -38113 31637 65022 48732 33612 -19197
23731 -19197 -44567 -18197 8809 5207 19133 4788 21429 17425 11870 -15051 -1839 67576
23719 67576 100577 117897 93406 21901 -12736 -32650 4682 15811 11044 9558 13539 33682
23707 33682 -12879 -47812 -35076 -3976 25498 31596 34652 9380 -13480 -13577 -28993 -3777 52165
23694E2165M0371m948o7626K8299j417k2315J2997l7071l7060L599m57k9170J1109
23681e1524K4482L2145N335Q124M486J5232k1867o233k4971M4240J7196j9235
23669B7410j9984j5991k1615M788J4146K0283j2671J9606r856j4137k2979k0998
23657e1998J1589m171Q129L0903L9541k3668n4639l2182J7993M5078k880J0359
23645e946j9152J0835j3700J7944L6634m2098l1625L1745j3918j9059j2882N2851
23633h371M2826o009o819l6520r32K0936j8780N136k9001m7158k919P0467L9485
23620B2341k2493o760J224j3236k1694N638J4454L2092n905L789K3560J4631o803
23607D0838j5409J8719k6292j2335R177j5086n2517m2184M6422J1365k4212N798
$$ plain form
23694 52165 92536 87588 19962 48261 46844 24529 37526 455 -36605 -33006 -33463 -62633 -51524
23681 -51524 -27042 5103 10438 18562 23048 38280 16413 10180 -14791 29449 46645 27410
23669 27410 7426 -8565 -30180 -25392 -11246 9037 -3634 15972 6116 -8021 -31000 -51998
23657 -51998 -40409 -44580 -36451 -5548 33993 10325 -44314 -76496 -58503 -13425 -16305 -5946
23645 -5946 -25098 -14263 -27963 -10019 26615 -15483 -47108 -15363 -29281 -48340 -61222 -8371
23633 -8371 34455 28446 21627 -14893 -15825 5111 -13669 -8533 -37534 -84692 -87611 -17144 22341
23620 22341 -152 -6912 -5688 -18924 -40618 -34980 -20526 11566 5661 9450 33010 47641 40838
23607 40838 25429 44148 17856 5521 14698 -388 -52905 -95089 -48667 -37302 -61514 -55716
23595e5716N4866k0890j5465M8418n974L2797j4310R168j8614k7706q187M953
23583a6660K0937K0118O217L64M378n1006k7105k1444L4837o41n769L4289L7597
23570C6112M6192l0573j3538J665J3299k953J2056j7942l6773m9932J4049K8414
23558G6L0122J961k9986k1121K1359L4729k2221j6785J5719J3373o483j6243L306
23545G806K7436L2467j873j0204J105n9388m3248M7193N2907m375l1065j687j5305
23532A769L6546q134l2041k3952L2097J6699n844L3077J8695j2658K9122m0143
23520D5233k7606j1965m6803m8059n385J6807L0341N0158Q690j1463J0841M1000
23508E1789q086l514K019j2863j5034k5297j7569j5010j6479O8165r576M57m1695
$$ plain form
23595 -55716 -850 -21740 -37205 11213 5239 38036 23726 32894 14280 -13426 -21613 -16660
23583 -16660 4277 24395 30612 30976 35354 -15652 -42757 -64201 -29364 -30005 -35774 -1485 36112
23570 36112 82304 51731 38193 39858 53157 50204 62260 44318 7545 -42387 -28338 76
23558 76 30198 32159 2173 -18948 2411 37140 14919 -1866 13853 27226 20743 4500 7806
23545 7806 35242 67709 65836 55632 56737 -2651 -45899 1294 54201 49826 18761 17074 1769
23532 1769 38315 30181 -1860 -25812 6285 22984 17140 50217 68912 56254 85376 45233
23520 45233 17627 5662 -41141 -89200 -94585 -77778 -47437 2721 11411 -52 10789 51789
23508 51789 43703 40189 42208 29345 14311 -10986 -28555 -43565 -60044 8121 -1455 -998 -42693
23495d2693j0714K0788L1087O557l7156M7651R147l3878R97R529J3859l0787J8488
23482B875J314j4636r07j5636m8355l3606K4347O7315J482j9678J0298j2043J5742
23469b1488Q288q871j898Q735M4298O340k2390j6061j7763P100J4300p687J7671
23456A0574k9757l753p282L0156J6452k619J3842L043j7281k4316O887r555Q264
23443e345r9K462k1641k5641l3721K4244L9984j0066k0773J4403L5946J6409j2322
23430C840J3738K9781l4080j9342Q504M3773k3324j3163J5720L875P819J239m4598
23417f218k7484L4011L8420r912L967L4303k4673n797K5452J203J0310Q441n5750
23404B6273j0565M0956k897j6701m0033o2009J7043K7763K3225K4517j9932k1675
$$ plain form
23495 -42693 -53407 -32619 -1532 5025 -32131 15520 24667 -9211 -8214 1315 15174 -15613 2875
23482 2875 4189 -10447 -11354 -26990 -75345 -108951 -84604 -17289 -15807 -35485 -25187 -37230 -21488
23469 -21488 -13200 -22071 -23969 -15234 29064 35404 13014 -3047 -20810 -13710 590 -7097 10574
23456 10574 -19183 -22936 -30218 -62 16390 13771 27613 30656 13375 -10941 -4054 -13609 -5345
23443 -5345 -5444 -2982 -24623 -50264 -83985 -59741 -19757 -29823 -50596 -36193 -247 16162 3840
23430 3840 17578 47359 13279 -6063 2441 46214 22890 9727 25447 29322 37141 38380 -6218
23417 -6218 -33702 309 38729 28817 32784 67087 42414 36617 62069 63272 73582 82023 26273
23404 26273 15708 56664 53767 37066 -2967 -64976 -47933 -20170 3055 27572 7640 -14035
23392a4035m2479l1167M3088O3436J4552L6326N3164m4289n2344q599k7336l6499
23380d6182j0554M679N0140J3430j8755k9686K2207K162K893K8872o798j8786
23368f378L3546L1209P429j8927o565j9112L954n3994m3205k7743K022L1668N6392
23355i704R070j6549J1768L6545j8508O52P980m3471j3795J5110r264j1086O163
23342c5089k761J4373j2986J9254N7284L1614l7687j5974J3989l1330M367r018
23330c964J4522j2994l462K4612K2498K4128j4895J0190K8915K061l4987l2069
23318B4555j5655o464M7194n412J25J1912K503k2427n3969m1382L297L6923j1569
23305c0369l8571K9969K0590K8993O385J8532r68k6733k7010J3033M742P284K0030
$$ plain form
23392 -14035 -56514 -87681 -44593 18843 33395 69721 122885 78596 26252 17653 -9683 -46182
23380 -46182 -56736 -52057 -1917 11513 -7242 -36928 -14721 -12559 -9666 19206 12408 -6378
23368 -6378 27168 58377 65806 46879 40314 21202 25156 -28838 -72043 -99786 -97764 -66096 -9704
23355 -9704 -634 -17183 -5415 31130 12622 13274 21254 -22217 -36012 -20902 -30166 -41252 -35089
23342 -35089 -37850 -23477 -36463 -17209 40075 71689 34002 18028 32017 687 5054 -3964
23330 -3964 10558 -2436 -5898 18714 41212 65340 50445 60635 89550 91611 56624 24555
23318 24555 8900 2436 49630 44218 44343 56255 58758 36331 -17638 -59020 -55723 -18800 -30369
23305 -30369 -68940 -38971 -18381 10612 16997 35529 34561 7828 -19182 -6149 -1407 5877 25907
23292B5907k57p939n618K0386l6407q119M3299J6789j2343m4223L66M098j0092
23279a4153j715K8181q334j4057J2814l4575l7904L6575R618k5301j9918L849
23267f4920K8479k3534n013K8414M1921l613j5991j1767K5869L7734J8468r675
23255D6372n1250m361j4077j509J9935L913M94O7718N697l215k5334m7945M15
23242c147k3585o143j81j8666P514M449j9811k7143l18k4507L342J6120L7370
23229e4706n746l9452P769L9045K3940M1145L3137m1543Q121K6290m750J4404
23217D7654k8164M676P991l0007n898k3986m6694Q919L6415K5274M0995p312m301
23204B5562J4455P2l8021j50L943k3053o100J0491K7307J3740k3609m8135j5902
$$ plain form
23292 25907 25650 17711 12093 32479 -3928 -12047 31252 48041 35698 -8525 -8159 -4061 -14153
23279 -14153 -15868 12313 3979 -10078 2736 -31839 -69743 -33168 -23550 -48851 -68769 -64920
23267 -64920 -36441 -59975 -64988 -36574 5347 1734 -14257 -26024 -155 37579 56047 46372
23255 46372 -4878 -9239 -23316 -24825 -4890 -977 -483 67235 72932 69717 44383 -3562 -3147
23242 -3147 -26732 -32875 -33056 -51722 -44208 -39759 -59570 -86713 -87031 -111538 -108196 -92076 -54706
23229 -54706 -60452 -99904 -92135 -53090 -29150 11995 45132 3589 11710 38000 33250 47654
23217 47654 19490 24166 32157 2150 -3748 -27734 -74428 -65509 -29094 -3820 37175 29863 25562
23204 25562 40017 40089 2068 1918 5861 -17192 -23292 -12801 14506 28246 4637 -43498 -59400
23191e9400L9661K3194M049j8095j9039M658k7216l916J6807N809j4034K5223
23179b2299O260k4802J7468j4618K470O302l613K0512j4490J8376J9661r819O704
23166H112p996L6237M1106J5094r1909m7756K5752L2085L4566m5933l8620K3469
23154a5793L52J0798J1724k8476p0762L126K1159K3118l081l0935L0636j682P193
23141d2623K7176J5540l4226j9095k028R825L0293K2863N043K3332R63K5547J666
23128F4276N845j8150l5028n1477K517K8290K157J3992J5733k4776p97K0605l4203
23115a1016n264m363n696l5449M2945K8455K2911J8493K3656k0801l6400k2067
23103d596k6188k0698J8007J6978J4123L3629k9386k5317K7040J0089J1191L921
$$ plain form
23191 -59400 -19739 3455 7504 -10591 -29630 -24972 -52188 -56104 -39297 -33488 -47522 -22299
23179 -22299 -16039 -40841 -23373 -37991 -35521 -29219 -32832 -12320 -26810 -8434 11227 1408 8112
23166 8112 116 36353 77459 92553 644 -47112 -21360 10725 45291 -642 -39262 -15793
23154 -15793 -15441 -4643 7081 -21395 -92157 -89031 -67872 -44754 -47835 -78770 -48134 -49816 -42623
23141 -42623 -15447 93 -34133 -53228 -55256 -45431 -15138 7725 12768 36100 37063 62610 64276
23128 64276 70121 51971 16943 -34534 -32017 -3727 -1570 12422 28155 3379 2582 23187 -11016
23115 -11016 -16280 -20643 -26339 -61788 -18843 9612 32523 51016 74672 53871 17471 -4596
23103 -4596 -30784 -51482 -33475 -16497 -2374 31255 1869 -23448 3592 13681 24872 28793
23091B8793l5437k5479J1903r766m053L6962J7624p480l0123j3327m794j1146
23079d6323m8877j0568O991M6891j9282M7638O314J4238J0688j6965M713j0144
23067a4686K1375q594l3978J2688L4634R822J7603N388j7700r364j2181J629k2035
23054a5399J259L066J6085L7040k3685k0506K3531K8697L7368j8328l3004J5897
23042E2021J2269l8395l4569o2517J4366J4377J1554k7880j2158M2319K8836J7351
23030A7574m1378K8598K455k3965j4025n413K4665K5490j3626J6771M9107j0373
23018E5880o6347N172P98k8064r408J4344j2478O68K2673l0886j1032O3236K6361
23005C0917n1964O108N2277m097j3394k7725j6846o494J5684J3641K9163L3560
$$ plain form
23091 28793 -6644 -32123 -20220 -29986 -34039 2923 20547 13067 -17056 -30383 -35177 -46323
23079 -46323 -95200 -105768 -98777 -51886 -71168 -23530 -17216 -2978 7710 -9255 -4542 -14686
23067 -14686 6689 -1905 -35883 -23195 11439 21261 38864 44252 26552 17188 5007 6636 -15399
23054 -15399 -14140 -11074 5011 42051 18366 -2140 21391 50088 87456 69128 36124 52021
23042 52021 64290 25895 -8674 -71191 -56825 -42448 -30894 -58774 -70932 -28613 223 17574
23030 17574 -23804 4794 7249 -16716 -30741 -36154 -11489 14001 375 17146 66253 55880
23018 55880 -10467 -5295 -4497 -32561 -41969 -27625 -40103 -39435 -16762 -47648 -58680 4556 30917
23005 30917 -21047 -14939 37338 33241 19847 -7878 -24724 -31218 -15534 -1893 27270 60830
22993F0830j253o497m119j3827J437n360R949m725P497O540l5216p01m1327j5325
22979d2097k009K4106N512m010n27L4503J5041j1785r318k2502k1401R099J275
22966b4113L6395J5327o996q587r984M844p592k0695j1659O0666L7892j6760o3853
22953a5115k4330j0473p941J3572r515k550O85J8059L2526k4975l3981J0116M8864
22940e058J2960L216L2793j2973J1255L412j9800m2617k0056n011K4672M8206
22928C0999l790m554k0188P162j8470m919j95k6123Q330J0676L7406M3296k6579
22915C3051l305j0353m9534m756L7539N8587N3998m2682k7242J581j3990J6503
22903D9397j5521j0992J2294j4313N446O827m1423L913L2100M178k1760m3649
$$ plain form
22993 60830 59577 53080 48961 35134 36571 31211 41160 36435 43932 50472 15256 14555 -26772 -42097
22979 -42097 -44106 -20000 -14488 -18498 -19025 15478 30519 18734 9416 -13086 -34487 -25388 -24113
22966 -24113 12282 27609 20613 12026 2042 6886 -706 -21401 -33060 27606 65498 48738 -15115
22953 -15115 -39445 -49918 -57859 -44287 -53802 -56352 -55667 -37608 -5082 -30057 -64038 -53922 -5058
22940 -5058 7902 11118 43911 30938 42193 45605 25805 -16812 -36868 -41879 -17207 30999
22928 30999 27209 22655 2467 9629 -8841 -13760 -13955 -40078 -31748 -21072 16334 59630 33051
22915 33051 29746 19393 -30141 -34897 2642 61229 115227 72545 45303 46884 32894 49397
22903 49397 33876 22884 35178 20865 26311 33138 -8285 -4372 27728 31906 10146 -33503
22891c3503K8940K3564j9073l2935J6980L4690K6560K4864l37Q764j5790m6482
22879A6242k4099M4626O7415j0601l6547m3247l7970R161P2279K855o540K3649
22867G7223m768j4648k394l3996j1329m5296k4203J841M843J5603k8985q316K7152
22854d7273L7008j5209j1588N4265J0984k4555K2228K2742l1188k3300k9797l9530
22842g5213O620L4199J4579J7344J6143m3853p3903j8384M5893O1224K1763j9117
22830a2705p808Q082J6061k472l507j850J2028O673l1628K5321K3775o383j271
22817B4316k3215j4446L1756J0240r122K2312k1480k1516k0588Q294k6088k4366
22805f3903K4853N8232R557k5538n0137K5339K9781J9206l0382J3623M2679M3982
$$ plain form
22891 -33503 -4563 19001 -72 -33007 -16027 18663 45223 70087 69750 78514 62724 16242
22879 16242 -7857 36769 104184 93583 57036 13789 -24181 -15020 57259 60114 53574 77223
22867 77223 72455 57807 55413 21417 10088 -35208 -59411 -57570 -52727 -37124 -66109 -74425 -47273
22854 -47273 -10265 -25474 -37062 17203 28187 3632 25860 48602 17414 -5886 -35683 -75213
22842 -75213 -68593 -34394 -19815 -2471 13672 -30181 -104084 -122468 -76575 -15351 6412 -12705
22830 -12705 -20513 -12431 3630 1158 -2349 -4199 7829 14502 -17126 8195 31970 25587 24316
22817 24316 1101 -13345 18411 28651 19529 41841 20361 -1155 -21743 -13449 -39537 -63903
22805 -63903 -39050 19182 28739 3201 -46936 -21597 8184 27390 -2992 10631 53310 97292
22793I7292r951o6505n0790J6979j703k646j7180j4998L3998M0779n3186l996
22781c1907j0302M264O970K1796K3053m074l7449O587j0561j5548j4155q330J1669
22768e7987P5048K8689k5678q254J3027J0887J2253J6172j5622l7090K5046J5086
22756E1577j8589j6360m9372R698J5299j3178K0596K6657K5553j3782m686L2211
22744F5624L785l9614m9288j8807L1783l172O875N2175M3906j7870p6592j4872
22732a6067l713J7459K4872K9003J6274k3371j6648j4451J5933J7700L6668l948
22720G9711l0868k9613j1183P704n679n2232n30K4888M597j0544n366P739L7160
22707A5784K0141L409j6057k2465J1159n86l3686K911K7799P577m10M33L0254
$$ plain form
22793 97292 87341 20836 -29954 -12975 -14678 -17324 -34504 -49502 -15504 25275 -27911 -31907
22781 -31907 -42209 -37945 -30975 -9179 13874 9800 -27649 -21062 -31623 -47171 -61326 -69656 -57987
22768 -57987 17061 45750 20072 11818 24845 35732 47985 64157 48535 11445 36491 51577
22756 51577 32988 16628 -32744 -23046 -7747 -20925 -329 26328 51881 38099 33413 65624
22744 65624 69409 29795 -19493 -38300 -6517 -9689 -2814 49361 93267 75397 -1195 -16067
22732 -16067 -19780 -2321 22551 51554 67828 44457 27809 13358 29291 46991 83659 79711
22720 79711 48843 19230 8047 15751 10072 -42160 -42690 -17802 -13205 -23749 -29115 -21376 15784
22707 15784 35925 39334 23277 812 11971 11385 -22301 -19390 8409 15986 15576 16009 46263
22694D6263P652k1478j7473r173K3427R526l3040j5694J1809q255L1984k3097
22682B451o0556o471Q244J9102L3389M096L993k1257k753J0499L997R099j8710
22669a4877k0439L8618K9878Q285n904m814o8116m98R25o251J8846o359k7983
22656e8689k4001k8968K2125N942K0250M8009Q92m4399l0534p677K8797L9269
22644b8984J5737M626k9628l2392J4394K2354P932J1144j8658Q622N4866m3463
22632a3450l1221K0489l496J347K7552j2969K182K3582L5571r950k2884l556j4167
22619i70p139j2127K5429K4907k3492m3573k108r585N0395K5246J0674J8142l6052
22606A9747M5959J4280r241K445m6361k0040l1269J6566J9950J9649m2536l9749
$$ plain form
22694 46263 53915 32437 14964 5791 29218 38744 5704 -9990 1819 -6436 25548 2451
22682 2451 -58105 -64576 -56332 -37230 -3841 255 4248 -17009 -19762 -9263 -5266 3833 -14877
22669 -14877 -35316 3302 33180 41465 35561 30747 -37369 -37867 -36942 -43193 -24347 -30706 -58689
22656 -58689 -82690 -111658 -89533 -83591 -63341 -15332 -14440 -58839 -89373 -97050 -68253 -28984
22644 -28984 -13247 -8621 -38249 -70641 -56247 -33893 -25961 -14817 -33475 -24853 30013 -13450
22632 -13450 -44671 -24182 -27678 -26331 1221 -11748 -9566 14016 49587 39637 16753 13197 -970
22619 -970 -8109 -20236 5193 30100 6608 -36965 -39073 -48658 1737 26983 37657 55799 19747
22606 19747 65706 79986 70745 73190 26829 6789 -24480 -7914 12036 31685 -10851 -50600
22594e0600J9603M6195q558Q079J7850k8738m1553l9020k9384J7261N1956K0940
22582a5969k317l0883l1269K1384L7308K9643k8716J2075l1246l3676N6663L3765
22570A6762l877n0874O140j8451l6433k9158L7975O5178K2263J7946j0539j1114
22558E818q92K4098k3472l3354K7651Q340l0568k5225l0868L6933N523k2575O4118
22545E527L8596O016l1298p0526j0768K3696k3021j000K3262q874L508K1120J412
22532b2350N696L1226L0422j7252j3302m3217k9093L2054J9534L1231K1945n969
22520D0925j2036m7145m0000K1517L5120L1075K4486j6892O551l2500k1791K136
22508h554j2555J9542J7361k1974l6950M162N653j6115n126J5654J2485o0600
$$ plain form
22594 -50600 -30997 15198 6640 14719 32569 3831 -37722 -76742 -106126 -88865 -36909 -15969
22582 -15969 -18286 -49169 -80438 -59054 -21746 7897 -20819 -8744 -39990 -73666 -17003 16762
22570 16762 12885 -37989 -31849 -50300 -86733 -115891 -77916 -12738 9525 27471 16932 5818
22558 5818 4926 29024 5552 -27802 -151 8189 -22379 -47604 -78472 -41539 -36016 -58591 5527
22545 5527 44123 50139 18841 -51685 -62453 -38757 -61778 -62778 -39516 -48390 -44882 -23762 -22350
22532 -22350 -16654 14572 44994 27742 14440 -28777 -57870 -25816 -6282 24949 46894 40925
22520 40925 28889 -18256 -58256 -36739 -1619 29456 53942 37050 43601 11101 -10690 -8554
22508 -8554 -21109 -1567 15794 -6180 -43130 -38968 -33315 -49430 -54556 -38902 -26417 -87017
22496h7017j3760J0258K0701J9881q645L0947J3881K4228k881O023o382o324L2997
22483C3907K8409L934m7099n1406k0635Q301K4390p184r713q840n111Q544M6293
22470C790J5843k7934k6223N486K3006K7237j3686q814O914k9796j5716j6673
22458e6566k1866k1178L561L5940N1848j4412m50j8646k1915K3653J0151P113
22446b2767q700m643k7142L0444O3413L9563k7228j9646m885K559l9714k7861
22434d6607K5533J4243j8386P558K6900J6625q705J983k4760L3130M203K0254
22422E1971l8963q967n970M428j3156K609K2211k953j357L0657K1773m1041m2400
22409b1158j68L8101K3831J1996n348j5305n5278l9817L0559K7504j1864j0069
$$ plain form
22496 -87017 -100777 -90519 -69818 -49937 -58582 -27635 -13754 10474 7593 13616 7234 910 33907
22483 33907 62316 66250 19151 -32255 -52890 -44589 -20199 -27383 -37096 -45936 -51047 -42503 3790
22470 3790 19633 -8301 -34524 -29038 -6032 21205 7519 -1295 5619 -24177 -39893 -56566
22458 -56566 -78432 -99610 -96049 -60109 -8261 -22673 -23123 -41769 -63684 -40031 -29880 -22767
22446 -22767 -31467 -36110 -63252 -32808 30605 70168 42940 23294 18409 20968 -18746 -46607
22434 -46607 -21074 -6831 -25217 -17659 9241 25866 17161 19144 -5616 27514 31717 51971
22422 51971 13008 4041 -1929 2499 -10657 -8048 14163 11210 9853 40510 62283 21242 -21158
22409 -21158 -21326 16775 40606 52602 47254 31949 -23329 -63146 -32587 -5083 -16947 -27016
22397b7016r832M3981K3598m1804J2067k2086m7515J6708N263M7415J5204r006
22385F977l6994l4368Q792O3809J0442M438L1993K0757j6670m6237l3709k579
22373b3349J7639K4670J5494l7263r000l077J0109j7054K0925n544L1505O1719
22361H6774j7371m2385p329k2610J1777Q764n9408n9313K0634M6676r938M671
22349c9058j5369k2483L2066K4584K3090J1904j0212j9433l4982k6097k962L9418
22337c9534M351l1397L3582M337K9268j0716j408J0225J4005k0073N950J5806
22325A4396m1034m5163k158L5457J9132k8653r307J2888K4112p284N89J4849M4519
22312C2343J9118j8731n039j6912k2331p210o03k3154J0821J9092J0296m5345
$$ plain form
22397 -27016 -36848 7133 30731 -11073 994 -21092 -68607 -51899 -46636 779 15983 6977
22385 6977 -30017 -64385 -55593 8216 18658 23096 55089 75846 59176 12939 -20770 -23349
22373 -23349 -5710 18960 34454 -2809 -11809 -14886 -4777 -21831 -906 -6450 25055 86774
22361 86774 69403 27018 19689 -2921 8856 17620 -41788 -101101 -80467 -33791 -43729 -39058
22349 -39058 -54427 -76910 -44844 -20260 2830 14734 4522 -14911 -49893 -75990 -78952 -39534
22337 -39534 -35183 -66580 -32998 -28661 607 -10109 -11517 -1292 12713 -7360 -1410 14396
22325 14396 -26638 -71801 -73959 -38502 -19370 -48023 -57330 -44442 -20330 -27614 -27025 -12176 32343
22312 32343 51461 32730 27691 10779 -11552 -18762 -19365 -42519 -31698 -12606 -2310 -47655
22300d7655j8353J7117N2066J9010j3127j0419P5307j5893m6276P168k7208k9673
22288c7936J6324J3232J2451K7071j0568j0239o0194P251l36j6031K2302J3296
22276b3377M950O21J233j4537j8297M086M996L808j3573M734L3452J4473m1180
22263c8611J3809L5148L291O22K0401o45k7954j039j645k8819R194o983l8739
22250f1970p367J5465K5589N949R534k8550N504J6942J6024l4596k3177q128K4237
22237d4544M410k0644n4445J1070P4421L4588o105j5530k5884l0527o519L15J3582
22224f5812j5007j5064N0314M5478K348n9675K2548K0242j3413m458K7629r343
22212a4213j6324n0052k8487K5053M2638J0350k0263j0154Q446M5307m619L041
$$ plain form
22300 -47655 -66008 -48891 3175 22185 9058 -1361 73946 58053 11777 18945 -8263 -37936
22288 -37936 -21612 -8380 4071 31142 20574 10335 -49859 -42608 -42944 -58975 -36673 -23377
22276 -23377 -18427 -17806 -16573 -31110 -49407 -45321 -40325 -36517 -50090 -45356 -11904 2569 -38611
22263 -38611 -24802 10346 13637 14259 34660 34015 6061 5022 3377 -25442 -16248 -23231 -61970
22250 -61970 -69337 -53872 -28283 -22334 -12800 -41350 -35846 -18904 -2880 -37476 -60653 -68781 -44544
22237 -44544 -40134 -60778 -115223 -104153 -29732 4856 -1249 -16779 -42663 -73190 -79709 -79394 -65812
22224 -65812 -80819 -95883 -45569 -91 2257 -57418 -34870 -14628 -28041 -32499 -4870 -14213
22212 -14213 -30537 -80589 -109076 -84023 -41385 -31035 -51298 -61452 -53006 -7699 -12318 -9277
22200i277K3578l3385L944O491J1125n14J1276R410J0141J0252K162j0601r150
22187B5452m0234J4261J4125j8400j4859N257K6772r018l0277n1098m021M3729
22175c8311L8254M7414K3198k2291n2396j0154N9822L3124m6959k8186n304M6674
22163D4885k2523k219l5398n2611N093K0095L3841M2467J1723l2542r239K0270
22151B3842o0920n3132O305Q109K2067n227J8375J9380K1127j1525l5968R305
22139c8262O7769K2766o4609k6659J0853J5877K245l5246j6257j2953r364P734
22127g6106M7111J4484K5376J616l608K3961l891j5990J5284j6823o085j248p162
22114c081j20K440n1991J2772r142j7621r03L2304K4313L0067L1801r877k725
$$ plain form
22200 -9277 14301 -19084 -15140 -8649 2476 1962 13238 22648 32789 43041 45203 34602 25452
22187 25452 -14782 -521 13604 -4796 -19655 -14398 12374 3356 -26921 -78019 -82040 -38311
22175 -38311 -57 47357 70555 48264 -4132 -14286 45536 78660 31701 3515 -1789 44885
22163 44885 22362 20143 -15255 -67866 -62773 -42678 -8837 33630 45353 12811 3572 23842
22151 23842 -37078 -90210 -83905 -75796 -53729 -58956 -40581 -21201 -74 -11599 -47567 -38262
22139 -38262 29507 52273 -12336 -38995 -28142 -12265 -10020 -45266 -61523 -74476 -83840 -76106
22127 -76106 -28995 -14511 10865 12481 8873 32834 28943 12953 28237 11414 5329 4081 -3081
22114 -3081 -3201 -761 -52752 -39980 -49122 -66743 -67646 -35342 -11029 19038 50839 40962 38237
22101C8237m3596L334k4915l533j3832l0619K8074Q373j4317L4405J1275m0782
22089d7896J5555M7416J4126k6470m1680q153J0361K4711J4901p458M42k0438
22077b4583P215l519j8715J8523j7141k4298O625q688R641K1264J3051m312J4190
22064a0747M8278N8445N527o69p495l0240J6833r306l5987J0749j8467n2845q471
22051c4395J1815J9214k0722o172N4646K0323r3578l3744O3353M2830l5338l2350
22039d4118j3408J7306N9437J4143k9836k0576l6204k9828J0934M5992K1132q946
22027a3972j9634L4431N3739P72l6113j1606M994j4171k415l749J3812J6454k2744
22014b02j3018L4664K0567j2824m8031J3738J5560o0334j0086N1494o763j8231
$$ plain form
22101 38237 -5359 -2025 -26940 -30473 -44305 -74924 -46850 -38477 -52794 -18389 -7114 -47896
22089 -47896 -32341 15075 29201 2731 -38949 -47102 -36741 -12030 2871 -4587 -4145 -24583
22077 -24583 -17368 -20887 -39602 -21079 -38220 -62518 -55893 -64581 -54940 -33676 -20625 -24937 -10747
22064 -10747 37531 95976 101503 100834 93339 63099 79932 70626 34639 45388 26921 -25924 -34395
22051 -34395 -22580 -3366 -24088 -30260 24386 44709 -48869 -82613 -19260 23570 -11768 -44118
22039 -44118 -57526 -40220 19217 33360 3524 -17052 -53256 -83084 -72150 -26158 -5026 -13972
22027 -13972 -33606 825 54564 55336 19223 7617 12611 -1560 -3975 -7724 6088 22542 -202
22014 -202 -13220 21444 42011 29187 -18844 -5106 10454 -49880 -59966 -8472 -15235 -33466
22002c3466k4892k0445j6373L2566J8835q001m810P4211j0350k6622m255L1046
21990G444J592k7766M0287J2798l0145p538J3561J2303j9403m2723L254L2172
21978d164q296K1664L8960k0600j8850l8671o147N6935M80p0816r254l32j3773
21965g2864j0476n376K9169K4747Q038j6063q810L6452n130l0449K2356K1119
21953g287L6786j3510L125K4508j4395l3794k6933P153M2689K9728k5387N802
21941B8485J4994m9990k7355J274R221l0228J330J7269J1784J9792K9172J8440
21929D4188j6123N846l2660R23r101J4916J0156K3793m4582J2583K0384J5470
21917D5793K7840k0551j510n5890O871K102j2421j7396J6308M9227M4226P05n4910
$$ plain form
22002 -33466 -58358 -78803 -95176 -62610 -43775 -51776 -56586 17625 7275 -19347 -23602 7444
21990 7444 9036 -18730 21557 34355 4210 -3328 10233 22536 3133 -39590 -36336 -4164
21978 -4164 -12460 9204 48164 27564 8714 -29957 -36104 20831 21311 -49505 -58759 -59091 -72864
21965 -72864 -83340 -88716 -59547 -34800 -26762 -42825 -51635 -15183 -20313 -50762 -28406 -7287
21953 -7287 29499 15989 19114 43622 29227 -4567 -31500 -24347 18342 48070 22683 28485
21941 28485 43479 -6511 -33866 -32592 -23371 -53599 -52269 -35000 -23216 -3424 25748 44188
21929 44188 28065 33911 1251 2174 -6927 7989 18145 41938 -2644 9939 30323 45793
21917 45793 73633 53082 51572 -4318 2553 4655 -7766 -25162 -8854 40373 84599 85304 30394
21904C0394K705J6046k2326R695k3404J448j0820J0957J2671M481j0084k8884
21892g121j748k0857q081m5869P866M2420K7859p65J1274K6310M943j612Q790
21879D3409J7866M8750k023j2467k8783q6626j5305j1182j8510K2017R060m51
21867c4245J5533J4505k1287L221M3242M3592j9704j4915R507j309J1981j8522
21855C1599p168j5729J7081K5214n648J054R410l8579K1523K0350m3801j8834
21843c528j0824L3735P2452Q672n4720l6220j31j4495k4576L1947J4052L0394
21831D6758j512l2646k4248m663K7698j757j0035m954j8667l107J0942K6329J1109
21818B1247K2822K4901Q293l0087J701n27p5487j6852q328j1949J9184K0864J8486
$$ plain form
21904 30394 33099 49145 26819 36514 13110 14558 3738 14695 27366 31847 21763 -7121
21892 -7121 -8869 -29726 -37807 -83676 -75810 -33390 -5531 -6296 4978 31288 36231 34619 43409
21879 43409 61275 110025 108002 95535 66752 -19874 -35179 -46361 -64871 -42854 -33794 -34245
21867 -34245 -18712 -4207 -25494 -22273 20969 64561 44857 29942 39449 38140 50121 31599
21855 31599 24431 8702 25783 50997 45349 46403 55813 17234 38757 59107 15306 -3528
21843 -3528 -14352 19383 91835 100507 45787 9567 9436 -5059 -29635 2312 16364 46758
21831 46758 45246 12600 -11648 -16311 11387 9630 -405 -5359 -24026 -27133 -16191 10138 21247
21818 21247 44069 68970 77263 47176 48877 48350 -27137 -43989 -52317 -64266 -45082 -24218 -5732
21805e732K9030j5234k7878R871J7543L6534N030n2997m8334M9331L2184J0922
21793D0270j0397M752j3852m1622P090N1907P756l0307r084K014J0600K2099K0710
21780F1936M4156l439o0646o0798j9598K9990M9336j184K4239j7603m6317j5359
21768a5287O016K5144Q045j3498l0773l8698J6614O924K644K9338L7496j5935
21756A8030k9053J313J2318K5015J9108m737m3684P698K4095q538o0316n5358
21744i4109J9434O720K9833J2674k1845k9067n960M1523Q805L3736j3600n601
21732a7457M3319K5010j9976m3433k8470j0942K0831L2914N571J8419k1734j6811
21720a2759k6456q771J9628M0867O858k3895j5744J7374J9472J2337L4757J0102
$$ plain form
21805 -5732 23298 8064 -19814 -9943 7600 44134 49164 -3833 -52167 -2836 29348 40270
21793 40270 29873 34625 20773 -20849 -13759 38148 45904 15597 6513 8527 19127 41226 61936
21780 61936 106092 102653 42007 -18791 -38389 -8399 40937 39753 63992 46389 72 -15287
21768 -15287 -9271 15873 23918 10420 -20353 -59051 -42437 -35513 -32869 -3531 33965 18030
21756 18030 -11023 -9710 2608 27623 46731 41994 -1690 6008 30103 21565 -38751 -94109
21744 -94109 -74675 -67955 -38122 -25448 -47293 -76360 -82320 -40797 -31992 1744 -11856 -17457
21732 -17457 25862 50872 30896 -12537 -41007 -51949 -31118 1796 7367 25786 4052 -12759
21720 -12759 -39215 -47986 -28358 12509 19367 -4528 -20272 -2898 16574 28911 63668 73770
21708G3770N394L31k0700J0328j7423k0678k6223l1958n578L4041K1150P781J8019
21695D8254K5587o102k4358j6193n1173m5301L278K5625L402L583K2094L706k8362
21682c5960o823P359j5552L7222L6716K4623J7477M603l3706m3921J1810K0304
21670B4152l3637k1323J7839K9767m9256n394J4277K6977j5638n0282p160l3628
21658a03306p756K3128N3821N5602L6599L869k0040n4059l2232k94J7057k5583
21646e3194M914J3767l9672j6392L3750j8694j8999O4070N9456k3585j3384J4077
21634F114K1566K7034j107j3409K7100k6332o3527K5574L5704l468l1533l9189
21622c5473l065J0003m1715o3511O324L2250P4729K8563n5549k7869J467J6903
$$ plain form
21708 73770 79164 79495 58795 69123 51700 31022 4799 -27159 -32737 1304 22454 30235 48254
21695 48254 73841 67739 43381 27188 -23985 -69286 -66008 -40383 -36981 -33398 -11304 -7598 -35960
21682 -35960 -42783 -35424 -50976 -13754 22962 47585 65062 69665 35959 -7962 3848 24152
21670 24152 -9485 -30808 -12969 16798 -32458 -37852 -23575 3402 -12236 -62518 -69678 -103306
21658 -103306 -111062 -87934 -34113 21489 58088 61957 41917 -12142 -44374 -44668 -27611 -53194
21646 -53194 -48280 -34513 -74185 -90577 -56827 -75521 -94520 -30450 29006 5421 -7963 6114
21634 6114 27680 54714 53607 40198 67298 40966 -22561 3013 38717 35249 3716 -35473
21622 -35473 -38538 -28535 -70250 -133761 -127437 -95187 -20458 8105 -47444 -75313 -73846 -56943
21610e6943M179j8183K3876n525K5720K0719j5881j5964N12K1273J5178l2340
21598c3379J3957K4252L5056k8377k5289L4333m8864l4257M408J7937j1002l6637
21586h7862J3089n078K0620N1818N7462p456m6007k1258K27k7272R718J5770J7957
21573h272L3531J8109K2714K0189k5070O035K610M0861J6221k1529l800m5668
21561E5931o3122l9191k0068L1500K8449K004k5266l4942k5291K4386J4800j1443
21549f2253K769L1374L6135L736K2396l909K7949j1344l0327K0928q843N374n6258
21536b2273m4784m5396J3837K2154K2638L1277j4238L253L6504J9575l1240q13
21524i506o377L6418j4105l2053j976K3641J2026j5752J1737j7246m0340M9529
$$ plain form
21610 -56943 -52764 -70947 -47071 -52596 -26876 -6157 -22038 -38002 -37490 -16217 -1039 -33379
21598 -33379 -19422 4830 39886 11509 -13780 20553 -28311 -62568 -58160 -40223 -51225 -87862
21586 -87862 -74773 -79851 -59231 -7413 50049 42593 -3414 -24672 -24445 -51717 -41999 -26229 -8272
21573 -8272 25259 43368 66082 86271 61201 67236 69846 110707 126928 105399 101599 55931
21561 55931 -7191 -46382 -66450 -34950 -6501 -4497 -29763 -64705 -89996 -65610 -50810 -62253
21549 -62253 -59484 -28110 8025 11761 34157 30248 58197 46853 16526 37454 28611 33985 -22273
21536 -22273 -67057 -112453 -98616 -76462 -53824 -22547 -36785 -33532 2972 22547 -8693 -9506
21524 -9506 -15883 20535 6430 -25623 -27599 -3958 8068 -7684 4053 -13193 -53533 -4004
21512d004K1826L0462j5332K3437M247m401l8472l4044p309l1966j61M5641j339
21499a1415k4229p391O616L8309N360N958K665l3775N409K4803j952k5547O52
21486a4537j6765L3961K2527n032O7L379j807j6220k4824J0264P776j3984Q906
21473f289n830m5121K5474M9448k7290m0611L6205M1228n296j1444k5470N707
21461i289k866J9963K0000j3562O4L34O686P319O78k689q890K3105J8169K3907
21447H2929m3298m2597R275J2828P774J5219J89k1204J9719L5927l2466l5284
21435I011n8351k72K8834N8063R763m7978m4830k2045K2045K3368j4243j777J700
21422c6712K4598M6769l7697m3626k982J3008j7064K7868L7017k0982K9122Q537
$$ plain form
21512 -4004 17822 48284 32952 56389 60636 56235 17763 -16281 -23590 -55556 -55717 -10076 -11415
21499 -11415 -35644 -43035 -36419 1890 7250 13208 15873 -17902 -12493 12310 10358 -15189 -14537
21486 -14537 -31302 2659 25186 20154 20221 23600 21793 5573 -19251 -8987 -1211 -15195 -6289
21473 -6289 -12119 -57240 -31766 17682 -9608 -50219 -14014 27214 21918 10474 -14996 -9289
21461 -9289 -12155 7808 27808 14246 14310 14644 21330 28649 29327 26638 17748 40853 59022 82929
21447 82929 39631 -2966 6309 19137 26911 42130 42319 21115 40834 76761 44295 9011
21435 9011 -49340 -49612 -20778 37285 47048 -930 -45760 -67805 -45760 -22392 -36635 -38412 -36712
21422 -36712 -12114 34655 -3042 -46668 -49650 -36642 -53706 -25838 11179 -9803 19319 27856
21410B7856q212K0007j1585J4947N8346J29525J24988N2609J26724J67259J5410
21399G17874p5131j52202j35296p9700m7571l2178m2406o4917l3428l601q767
21388D2677O857R6792L9787O5576J08186J34549J72807P1105n1162j58633j06870
21377D21671o0654o3980p4083j04716m4703n420k2880j5808j613j2167j0538L7026
21365D2135p823L7107J1707n9007j4838Q320J6644L2742O871n29l5185l3077P664
21352A2731K5394j1737p104k3161K2180L1398K128j0941n6110K4941J8277k6801
21340A195P00j377j5484L0339L7399O70O218j945J8786N5270n9400p967M8973
21327A13377j8129j2040m9044j4365L2574l0944j900o267O927l2042J8881L4600
$$ plain form
21410 27856 19644 39651 28066 43013 101359 230884 355872 408481 535205 702464 717874
21399 717874 642743 490541 355245 275545 227974 195796 153390 88473 55045 51444 42677
21388 42677 49534 146326 186113 251689 359875 494424 667231 738336 687174 528541 421671
21377 421671 361017 297037 222954 118238 73535 68115 45235 29427 27814 15647 5109 42135
21365 42135 34312 71419 83126 24119 9281 17601 34245 66987 73858 73329 38144 5067 12731
21352 12731 38125 26388 19284 -3877 18303 49701 51829 40888 -15222 9719 27996 1195
21340 1195 1895 518 -14966 15373 52772 53442 59660 57715 76501 131771 72371 64404 113377
21327 113377 95248 83208 34164 19799 52373 21429 19529 13262 20189 -11853 7028 41628
21315D1628k2501m504k5562q289L2118j253J237K426q680J7697K1330P140K7757
21302H0544L1430q7776m085J8734N637J2001K7541n7731m9989l2242r551J2105
21290e3382k024K5663q750j1096L3150J4966j5625n1520R389M2254j1573l6244
21278f4792l9562L3661J5992l1129J3926M0335M6037L4702n020j6413J0209n4888
21266a6942k9702L8079P6265l539m7219j8764L3346K0739J6696m5571j0635J2223
21254B4976M0843q110j8555M2540M7795p6658j6819L1900j1908k6442n108j0824
21242A3630j6137K9761P379M132k7578K8241K3875j8892L28k3695k3137n2588
21230e4681l0079O563J6688M0555O1658J7976j6787j6417j0030K332j0196k0531
$$ plain form
21315 41628 19127 14623 -10939 -19228 12890 11637 12874 15300 6620 24317 45647 52787 80544
21302 80544 111974 24198 20113 38847 44484 56485 84026 26295 -23694 -55936 -65487 -53382
21290 -53382 -55406 -29743 -38493 -49589 -16439 -1473 -17098 -68618 -59229 -16975 -28548 -64792
21278 -64792 -104354 -70693 -54701 -85830 -71904 -31569 14468 49170 44150 27737 37946 -16942
21266 -16942 -46644 -8565 67700 64161 16942 -1822 31524 52263 68959 23388 12753 24976
21254 24976 65819 57709 39154 81694 129489 52831 36012 67912 56004 29562 24454 13630
21242 13630 -2507 27254 34633 38765 11187 39428 63303 44411 44739 21044 -2093 -54681
21230 -54681 -84760 -78197 -61509 -20954 40704 58680 41893 25476 15446 17778 7582 -12949
21218a2949j4738o394p97J403r991J3312N1239J9670j6862j1340k0135l0521l3493
21205g1596K2519M0290J8844p227l4016K1995J0871o227J2266j3596l2274J5701
21193b2450l653m4583k943K5444j2815R14N5704M1893k0656k3454n6888L1563
21181c1924K499J8873O650J534l0308j3909K0070J933j163K3099o722k2504k1
21168c1893P570K3020k5563j1197L0593J940l734j7905J4096R058N6878M5191
21156I8054j5042j5510J9086j7710j5630k7089k0066K5503l6089j1043j7379J8710
21144a4205M8614K0066K226J8071l6151l5273k5582J8011J6509j5501j5575l5835
21132e4625P222M4227Q261J3325l4652K2405J0060R39n5020o3873n8508j2751
$$ plain form
21218 -12949 -27687 -34081 -34878 -33475 -43466 -30154 21085 40755 23893 12553 -7582 -38103 -71596
21205 -71596 -49077 -8787 10057 2830 -31186 -9191 1680 -4547 7719 -5877 -38151 -22450
21193 -22450 -26103 -70686 -73629 -48185 -61000 -60086 -4382 37511 16855 -6599 -63487 -31924
21181 -31924 -29425 -10552 -3902 -2368 -32676 -46585 -26515 -24582 -25745 -2646 -9368 -31872 -31893
21168 -31893 -24323 -1303 -26866 -38063 -7470 -5530 -9264 -27169 -13073 -4015 52863 98054
21156 98054 83012 67502 86588 68878 53248 26159 6093 31596 -4493 -15536 -32915 -14205
21144 -14205 34409 54475 56701 74772 38621 3348 -22234 -4223 12286 -3215 -18790 -54625
21132 -54625 -47403 -3176 5085 18410 -16242 6163 16223 17162 -37858 -101731 -160239 -172990
21120a72990J19788J07010L4278N345J631m493l1709j6951q82n147j9169l103
21108A3608J7190J7126J8543P434l7166l3204j5349j2858R774J0467L1598l709
21096B3454J265j9403j0403J8568J4276K5199J7361k7409l6577L2161J5583J5437
21084F9512l2674K7440L7606L3408j0846k2650j2367k3921Q671K6937l5111j2143
21072E3862J4309M2305j4758J1142M0198j9168l1329j4958m8226j2606K5778L5733
21060H2282L6318l0201N921J918l8623k2544n311k0229L2730J2539j4294Q174
21048D8680K0808n978k2323l2533j4776L3746K2926k9211k2276j638L0817Q440
21036C6682j8924L558l5006R491L1344K2480K880r56j9228l2045j3780K0971J9581
$$ plain form
21120 -172990 -53202 53808 88086 93431 95062 90569 58860 41909 41027 35880 16711 13608
21108 13608 30798 47924 66467 73901 36735 3531 -11818 -24676 -14902 -4435 27163 23454
21096 23454 24719 5316 -5087 13481 27757 52956 70317 42908 6331 38492 54075 69512
21084 69512 36838 64278 101884 135292 124446 101796 89429 65508 74179 101116 66005 53862
21072 53862 68171 110476 95718 106860 147058 127890 96561 81603 33377 20771 46549 82282
21060 82282 118600 88399 94320 96238 57615 35071 29760 9531 42261 54800 40506 48680
21048 48680 69488 63510 41187 8654 -6122 27624 50550 21339 -937 -2575 28242 36682
21036 36682 17758 21316 -13690 -4199 27145 49625 52505 51549 32321 276 -13504 7467 27048
21023B7048j4917o118j3578k1544K1934M2340J4742j8375j6327L4685j2847j7370
21011A9673R300J6394M5572O404l6593l5427j1796K3849N748k5553j4682k0238
20999a7349o5259N3864N1971O975n058k5368J1623M3473j6114J5892K3556k7892
20987E0314j7568l8428L535K4689Q185q320J2210N6649K805m3439j4543j7236
20975A8853n7096J41Q895n2256o1295N152P2445N4140L0865R329J6878p614Q425
20962D6862L1698O0171k83m1409p6265L553K3693L9720L2627N2825j421p673p23
20949A63375J5560N2127L2818K4624N1299J2987N81r343k33L8298k1365k7348
20937C33380J291j6106m3526n1007p457J22j3354l5498l7228j540j4324J1954
$$ plain form
21023 27048 12131 6013 -7565 -29109 -7175 35165 49907 31532 15205 49890 37043 19673
21011 19673 28973 45367 90939 97343 60750 25323 13527 37376 43124 17571 2889 -17349
20999 -17349 -82608 -28744 23227 30202 25144 -224 11399 54872 38758 54650 78206 50314
20987 50314 32746 -5682 -2147 22542 30727 22407 34617 91266 94071 50632 36089 18853
20975 18853 -38243 -38102 -29207 -81463 -142758 -137606 -65161 -11021 19844 29173 46051 38437 46862
20962 46862 78560 138731 138448 97039 20774 24327 48020 87740 120367 173192 171771 164098 163375
20949 163375 178935 231062 263880 288504 339803 352790 353371 344028 343795 382093 360728 333380
20937 333380 334671 318565 275039 224032 216575 216697 203343 167845 130617 129077 114753 126707
20925A26707L0196J176J854L8146K650m641m698n085K9091M0769q156n0807L1944
20912B29146J1300o264N5115J3651j7225L9006l644k4575m6519K0260j4044q1197
20900A75010l5192J9565L9653L0500k3766K1270N021M4414M1963J941N750j1253
20888C14876j8324L4111O7124R687O692J7455L913K4752M7168K9456K7884M5013
20876F09807j796k4051K0488k7481j0380n626j6063R1318Q7532R2730N1735Q4723
20864I52936P3815O9386Q455n7149P204J12711J51870K67793M21113M57870M04249
20853B870253k2356k67045k41786j17674m6109L7417P2535J75236K36621K43571
20843B940663J61046J78904L20265N19151P24134P09312L45447J32042L67325
$$ plain form
20925 126707 156903 158079 159933 198079 200729 196088 191390 186305 215396 256165 248009 197202 229146
20912 229146 240446 234182 289297 302948 285723 324729 321085 296510 249991 270251 256207 175010
20900 175010 139818 159383 199036 229536 205770 227040 232061 276475 318438 320379 326129 314876
20888 314876 296552 330663 397787 407474 414166 431621 435534 460286 507454 536910 564794 609807
20876 609807 608011 583960 604448 576967 566587 560961 544898 636216 723748 816478 868213 952936
20864 952936 1026751 1096137 1104592 1047443 1054647 1167358 1319228 1587021 2008134 2466004 2870253
20853 2870253 2847897 2580852 2339066 2221392 2175283 2212700 2285235 2460471 2697092 2940663
20843 2940663 3101709 3280613 3600878 4120029 4844163 5553475 5898922 6030964 6398289
20834F398289N70758O01824L34591L22712O36541R87625J288115J594783K090627
20825A4825865K883970M122838N893538Q481647J2163125J8466346K9872770M8392653
20817A45102752P2179984P5478235K0128208o0825663p0565551m9946265l5132643
20810I6419057k4637613j7645839j2995978r277212o508238m753229l542108k654715
20802A4404125k031731j583940j135728p80687m52461l43591n99829q38190o68228
20793E969740n75228n23307m89966l97405l20514k86819k57659j48262j20072
20784B850508j98862k22750q6893n8365R1418K46705L66048J78223k25794m23619
20774B516619l54097k78611k05680j52861j28800j01874n5722q7901q1079n9610
$$ plain form
20834 6398289 6969047 7570871 7905462 8228174 8864715 9852340 11140455 12735238 14825865
20825 14825865 17709835 21832673 27726211 36207858 48370983 66837329 96710099 145102752
20817 145102752 217282736 292760971 312889179 252063516 181497965 131551700 96419057
20810 96419057 71781444 54135605 41139627 31862415 25354177 20600948 17058840 14404125
20802 14404125 12372394 10788454 9652726 8872039 8419578 8075987 7476158 6637968 5969740
20793 5969740 5394512 4871205 4381239 3983834 3663320 3376501 3118842 2970580 2850508
20784 2850508 2651646 2428896 2342003 2283638 2375056 2621761 2987809 3166032 2940238 2516619
20774 2516619 2162522 1883911 1678231 1525370 1396570 1294696 1238974 1151073 1069994 1010384
20764A010384p0259p2336k8336l672n5200q5833p6209o8405k5257k8396o3916
20753D32565j5014L1187k4379j764l087k5296l4515m91N440P327J9790j1068k7366
20740C53329l4305l5035R668L189L3589J2209m28k1943p6533l020L397J4295L5434
20727B93846O997p237m4310l5602j5738p339J7736J7067L7139L3443K6709O1302
20715C84013Q4258J21987J86087J16114j28305j95119o8573n8289n0966q5679
20705C05528k8252r717j6242n409p738k6634R568j4402J9204J1435M2807Q4455
20693C64603J57229Q2448k4873o4683m3808J3881r7q5663o4740l2956m3464p4814
20681A83063n0069o910K082j3135k0900l301L7203M2216k6075l9644l9204j0332
$$ plain form
20764 1010384 940125 867789 839453 835781 780581 694748 618539 550134 524877 496481 432565
20753 432565 417551 448738 424359 422595 419508 394212 359697 359206 364646 371973 391763 380695 353329
20740 353329 319024 283989 293657 296846 330435 342644 342216 320273 243740 240720 244117 258412 293846
20727 293846 300843 293606 249296 213694 197956 190617 208353 225420 262559 296002 322711 384013
20715 384013 468271 590258 776345 892459 764154 569035 500462 442173 391207 305528
20705 305528 277276 267559 251317 245908 238170 211536 221104 206702 225906 237341 280148 364603
20693 364603 521832 604280 579407 514724 470916 484797 484700 399037 334297 301341 257877 183063
20681 183063 132994 126084 128166 115031 94131 90830 128033 170249 144174 104530 65326 54994
20669E4994J4540K8579K9085L0443L933q026M4720N1616J1733M5140p791n6578
20657B42388m2122n9815p6027K6713Q6197n089l2768l0780L9732J6816J1534k4337
20645A52442j8506M5523L161j0714l2365j374o744l5996k940L9458O9768L8665
20633B40378Q1376R0795P2905k1745j27748n8736o6479l7819j2996l0689p3400
20622E5842k6226M2828K7242K2545L3194J5395L02j2920P293k4010j4277K3827
20610A51035j7358k0387k8852l359k7167J9785j4221l4520l5098l574J3935Q848
20598I067k5075k128J9642l56P252M4645K6305j6329j4713l4514J4616N8555M0236
20585A27203L37l6717r387L2550J551l0410m8049m760N4355m907n0992l2661J2497
$$ plain form
20669 54994 69534 98113 127198 157641 161574 153548 198268 249884 261617 306757 298966 242388
20657 242388 200266 140451 64424 91137 177334 172245 139477 108697 148429 165245 176779 152442
20645 152442 133936 179459 182620 171906 139541 138167 131423 95427 92487 131945 201713 240378
20633 240378 321754 412549 485454 463709 335961 277225 210746 172927 159931 129242 55842
20622 55842 29616 72444 99686 122231 155425 170820 171122 158202 165495 141485 127208 151035
20610 151035 133677 113290 84438 81079 53912 73697 59476 24956 -10142 -13716 219 9067
20598 9067 -16008 -18136 1506 1150 8402 53047 79352 63023 48310 13796 28412 86967 127203
20585 127203 127540 90823 81436 113986 115537 85127 37078 32318 86673 81766 30774 -1887 10610
20572A0610K0101Q401J3151l333k2666j0020L0770J1282L0153j4043l6524q331
20560B9551p193l2397J026N1386K4677p682k7707l2132r241L2236L4774O621K400
20547F6319j834L389r487L4377K4354n1588k5407l1956J6505K3548l5266P222
20535B0176M8711L1864J0484l5887k9939m287L1313L9593l1685j6455L655j6514
20523E1029n6471k0093J8955L9414P957J3092l8581j9995k0l6397m3383R967Q2282
20510G756P554M7506K2903k6818R761k6583n8976l5449J9033Q2890N1056o018
20498I4615m5028l8696l5245J9003j4825l4929O934N960j4826K0526L7911j660
20486b60L4411J7899N131m272l9737M412J2044M9816k8805k9585J6547j7806o357
$$ plain form
20572 10610 30711 39112 52263 48930 26264 16244 47014 58296 88449 74406 37882 29551
20560 29551 22358 -10039 -9013 42373 67050 59368 31661 -471 -9712 22524 57298 63919 66319
20547 66319 64485 67874 58387 92764 117118 65530 40123 8167 24672 48220 12954 20176
20535 20176 68887 100751 111235 75348 45409 41122 72435 112028 80343 63888 67543 51029
20523 51029 -5442 -25535 -6580 32834 40791 53883 15302 -4693 -4713 -41110 -84493 -74526 7756
20510 7756 15310 62816 85719 58901 68662 42079 -16897 -52346 -33313 49577 100633 94615
20498 94615 49587 10891 -24354 -5351 -20176 -55105 -48171 -42211 -57037 -36511 1400 -260
20486 -260 34151 52050 57181 52909 13172 17584 29628 79444 50639 21054 37601 19795 13438
20473A3438M4691J2603J0651j573j4564L2076J9826m9591m4456m9996J1638m264
20461a9521M5529L0133J6082J0607K2440n311l7804M465M6094k165m7287m5309
20449A7953m4797N6217L2463j8247l540m837j485j333j683J5301m217M2608K2918
20436A07321j0591k589l4839o5343l3747n675J6372J2510K3663k9354k0378r024
20424e1674L4362K8529L1506L6673j2653m515k0798j0369J9247k9233j9398J3085
20412A4762L4602j0126o868j6485j4778l3667K0462M2752O057k6108R124J0328
20400C0055J8835K7858N352J1441m2249r586k6042j9427j9545J357o353l959M1900
20387I637k9777J4537k9147n7408K2414M9222l444j867l1369j7783p364j3903
$$ plain form
20473 13438 58129 70732 81383 79810 65246 97322 117148 67557 23101 -26895 -15257 -19521
20461 -19521 26008 56141 72223 82830 105270 99959 62155 66620 112714 110549 63262 17953
20449 17953 -26844 29373 61836 43589 40049 35212 33727 32394 30711 46012 41795 84403 107321
20436 107321 96730 94141 59302 -6041 -39788 -45463 -29091 -16581 7082 -22272 -42650 -51674
20424 -51674 -17312 11217 42723 79396 66743 62228 41430 31061 50308 21075 1677 14762
20412 14762 49364 39238 32370 15885 1107 -32560 -12098 30654 36711 10603 19727 30055
20400 30055 48890 76748 82100 93541 51292 41706 15664 -3763 -23308 -21951 -28304 -32263 9637
20387 9637 -20140 -5603 -34750 -92158 -69744 -20522 -23966 -25833 -57202 -74985 -82349 -96252
20375i6252L4949L6963r884K0760k371m8371j0661J0141j8996o836N0985K2359
20363a7214j7450K3688K6749o1516k7026J0348L2164J0056K014O4128j9521p365
20351A9055j9731j2634j7435R505K906o533p3009j4373K3593N2807L2962o986
20339i873J962K8880p023L945q415J1575m158j5036j6594Q246L2195j1373k1482
20326g151J439k0869J5814j2935J8030K1026j4923p229M8577j6528o8831J1989
20314c1591O2463j0938k1238M2941k0383l3791q457j7504q628J7012r960N609
20302c4465J6165K1699o903k2059l8529j6281K1484L2360L8619L642J7460j0309
20290B2883m6777J6694N9629p157N366j4850n2460j1753j3223R696M8420l85j1958
$$ plain form
20375 -96252 -61303 -24340 -34224 -13464 -15835 -64206 -74867 -64726 -83722 -90558 -39573 -17214
20363 -17214 -34664 -10976 15773 -45743 -72769 -62421 -30257 -20201 -18187 45941 26420 19055
20351 19055 -676 -13310 -30745 -21240 -18334 -24867 -97876 -112249 -88656 -35849 -2887 -9873
20339 -9873 -7911 20969 13946 17891 9476 21051 16893 1857 -14737 -6491 25704 14331 -7151
20326 -7151 -5712 -26581 -10767 -23702 -5672 15354 431 -6798 41779 25251 -43580 -31591
20314 -31591 30872 19934 -1304 41637 21254 -12537 -20994 -38498 -47126 -30114 -40074 -34465
20302 -34465 -18300 3399 -3504 -25563 -64092 -80373 -58889 -26529 12090 15732 33192 22883
20290 22883 -23894 -7200 52429 45272 50638 35788 -16672 -28425 -41648 -31952 16468 16083 4125
20277D125j0467O406k8561j0215J5139K5919j9203l8585k3680L8878O5998J9560
20265D5314n074N7795K2224n4135Q394Q493J1530n5553m5822J2074N416M3205
20253E3861M394l2932r732J0232L0203M0076K8361O3114P7193R7322J61360J14150
20241F37602K9236p4285j38748j40425o5653l9702j3623k1898J0029m6855l3530
20230A02148N3243N0414R333M8788M3293R4768J33595J27306L8547p0238j73009
20219D58188j57438p3857n9259n0168K6491n0129o6851k5673K6715M2147L5394
20208A05560l5114j5877m0276j1337M5617M5706O185j293o5237p0413l6862K6812
20196d6529M2863M5340J6215k904R449J7665j4325k3120J6990k4221l785J0432
$$ plain form
20277 4125 -6342 64 -28497 -38712 -23573 2346 -16857 -55442 -79122 -40244 25754 45314
20265 45314 40240 98035 120259 66124 74518 83011 94541 38988 -6834 5240 10656 53861
20253 53861 58255 25323 15591 25823 56026 96102 124463 187577 264770 362092 523452 637602
20241 637602 666838 592553 453805 313380 247727 208025 194402 172504 182533 135678 102148
20230 102148 155391 205805 215138 263926 307219 401987 535582 662888 701435 631197 458188
20219 458188 300750 226893 167634 117466 143957 93828 26977 1304 28019 70166 105560
20208 105560 70446 54569 14293 2956 48573 94279 100464 99171 33934 -36479 -73341 -46529
20196 -46529 -3666 41674 57889 54985 64434 82099 67774 44654 61644 37423 33638 44070
20184D4070k1049k6081r030J6608l9294j5748K1269M5650l9748J959Q017Q977
20172d400m02j2133j8253k3079K409N1399n49o618m0091j3788L3319M3554r794
20159A574n973J7908l5930R802l012K5499p983J852j6901j1182Q801M1598k4505
20146A548l9320j3882M68J3242L5448j6171j8591K7876K0400p011o554k7772j2654
20133d2973J1655K1337k212M0302q178K0094r165m1058M422J7880l1210J9266
20121A60k2978k4820J6777K3891K6759j4912L7242k7197o2435l9620L0866P772
20109d8495p086k261K5759L5017L4687j5531l5834p539J7890L0541R771p12j8340
20096A7867j7895r721k5452j3427j8799N0314K9533L6013J1394k9615p543K3499
$$ plain form
20184 44070 23021 -3060 -12090 4518 -34776 -50524 -29255 16395 -23353 -21394 -13377 -4400
20172 -4400 -4802 -16935 -35188 -58267 -55858 -4459 -5008 -11626 -51717 -65505 -32186 11368 1574
20159 1574 -4399 13509 -22421 -12619 -15631 9868 1885 3737 -13164 -24346 -15545 26053 1548
20146 1548 -37772 -51654 -51186 -37944 -2496 -18667 -37258 -9382 11018 4007 -2547 -30319 -42973
20133 -42973 -31318 -9981 -12193 28109 19931 40025 30860 -10198 -5776 12104 -19106 160
20121 160 -22818 -47638 -30861 -6970 19789 4877 42119 14922 -47513 -87133 -56267 -48495
20109 -48495 -55581 -57842 -32083 2934 37621 22090 -13744 -21283 -3393 27148 36919 36207 17867
20096 17867 -28 -9749 -35201 -48628 -67427 -17113 12420 48433 59827 30212 22669 46168
20084D6168k0942l2577J6539m639n3607j9718J9939k1128j657K2446J2956k3063
20072e9283K932k460J3316K0998l5037k2547p770K1405J3821l413J3876J1190
20060c2972p274J0339r860j0798K221q95k513P1271L0142k9408P793l9183j4783
20047b5920q450K7348L7433M241j1742m8743R197J6497J8305j9906K918N7759
20035E8937J4772l4757j3413J0962J6521k8378j7511M917j916j5603K3542J9856
20023C7929P538m7629P111j8901k2952J7903k4588J7780M6272o277j9827o367
20011a2008J5278l0704O629J7447k4971o77J4324J4104L5800J6423m8749o273
19999c377M0177m3817k5724R661K9034l0832l8416M385J0004j9925K5198L2984
$$ plain form
20084 46168 25226 -7351 9188 4549 -49058 -68776 -48837 -69965 -71622 -49176 -36220 -59283
20072 -59283 -56351 -58811 -45495 -24497 -59534 -82081 -89851 -68446 -54625 -58038 -44162 -32972
20060 -32972 -40246 -29907 -39767 -50565 -48344 -49239 -51752 19519 49661 20253 28046 -11137 -25920
20047 -25920 -34370 -7022 30411 34652 22910 -25833 -16636 -139 18166 -1740 1178 58937
20035 58937 73709 38952 25539 36501 53022 24644 7133 12050 10134 -5469 18073 37929
20023 37929 45467 -2162 4949 -13952 -36904 -19001 -43589 -25809 20463 14186 -5641 -12008
20011 -12008 3270 -27434 -20805 -3358 -28329 -29006 -14682 -578 35222 51645 2896 -3377
19999 -3377 36800 -7017 -32741 -23080 5954 -24878 -63294 -58909 -48905 -68830 -43632 -10648
19987a0648n64k686J6606J4206P635j6705l6875k0228J4300j446K200l1001j3095
19974g8301K5208J8297o980J9883J515K587O018O368K56l666O761p823j7837M3327
19960A5613K6351R825j9100p518N52k4756K355K4161r356o291J9630J5026k3100
19947B3392m6588k2178L9800K1055k6913J6494n303n249J7200r214K056j5146
19935a0594j3176Q711L366J1314J4131r806j625M2738K7401l480l6049k5984l3336
19922b6389l7709K7520n498l3706K0937N7181j6621k8372k7203k936M630J8304
19910d9862J7395L1612j1101l3584k9113j8192K1317J3022j2086k0606J7688R473
19898f4037n272k3199J5585J9031K5880K4405O485n812O731K6893N6656k5166
$$ plain form
19987 -10648 -11212 -13898 2708 16914 24549 7844 -29031 -49259 -34959 -36405 -34205 -65206 -78301
19974 -78301 -53093 -34796 -41776 -21893 -20378 -17791 -11773 -5405 -5149 -8815 -2054 -9877 -27714 15613
19960 15613 41964 51789 32689 25171 25723 967 3322 27483 18127 11836 31466 46492 23392
19947 23392 -23196 -45374 -5574 15481 -11432 5062 -241 -5490 11710 2496 4552 -10594
19935 -10594 -23770 -15059 -11693 -379 13752 3946 2321 45059 72460 68980 32931 6947 -26389
19922 -26389 -64098 -36578 -42076 -75782 -54845 2336 -14285 -42657 -69860 -72796 -68166 -49862
19910 -49862 -32467 -855 -11956 -45540 -74653 -92845 -71528 -58506 -70592 -91198 -73510 -64037
19898 -64037 -69309 -92508 -76923 -57892 -32012 -7607 -1122 -6934 -203 26690 83346 58180
19886E8180k8084k9915l876J0592j2670p934k4061j3509l4975K6415L9457j6966
19874c7346m7005J6039M6195m9611j0201J8722k549J4448m2554n0164j271N1536
19862i3761M1706J0099j832l3766j019J4999K3906J431k3491J5501J0476K668
19850c3083K9641k2346P178K4533K3969j3374k6275J9085j4486j4748P020P876
19838e010J3507q788p531l6905J5241J3851R656j8819j6764M8108K9446k0798
19826A5194j5979o955J9288q398j8033j9120L591k5014K6247k193m27J6809k77
19813a5267K9584N103k5268M32O092L2845O0325r576q4195m5252K7947P958L6667
19800B7395J9767m6176k0951J3196k110N708l104O807L7265J261j8835L6619j6467
$$ plain form
19886 58180 30096 181 -3695 6897 -5773 -13707 -37768 -51277 -86252 -59837 -20380 -37346
19874 -37346 -84351 -68312 -22117 -71728 -81929 -63207 -65756 -51308 -93862 -144026 -145297 -93761
19862 -93761 -52055 -41956 -43788 -77554 -78573 -63574 -39668 -38237 -61728 -46227 -35751 -33083
19850 -33083 -3442 -25788 -18610 5923 29892 16518 -9757 9328 -5158 -19906 -12886 -5010
19838 -5010 8497 -291 -7822 -44727 -29486 -15635 -5979 -24798 -41562 6546 35992 15194
19826 15194 -785 -7740 11548 3150 -14883 -34003 -30412 -55426 -29179 -31372 -31799 -14990 -15267
19813 -15267 14317 19420 -5848 -5416 676 33521 93846 84270 75 -45177 -17230 -9272 27395
19800 27395 47162 986 -19965 -6769 -8879 -3171 -6275 532 37797 39058 20223 56842 40375
19787D0375k0130n3574j1101K6538L5994J5020j4659m9890k4818J4490K1704P4302
19775E4251J5072j4909n7583k2155K9499K1927k8886L3642J9298m0133o2142K4675
19763b7444K1262n349l9544K3482M0381j6515j0846j5312k5140k2128K074K0335
19751e4744K6518L1745k9756j0505N742M0129j9328m9962O564J2792r769J4026
19739c6548J0373n4511K6028K6641M244Q086j6658o443J307j032j8133k4013P903
19726g2756O2480J6582L39l8048l3984r745J2852l549K076q616J991k0239K9942
19713f0675P7431O144j0769o676k502L346J4807r193j2580J0470l6091l675J8918
19700a1045K7624K4976K3999q228k4830q357j2783k605j5068k5675L3317R706
$$ plain form
19787 40375 20245 -33329 -44430 -17892 18102 33122 18463 -31427 -56245 -41755 -20051 54251
19775 54251 69323 54414 -3169 -25324 4175 26102 -2784 30858 50156 10023 -52119 -27444
19763 -27444 -6182 -11531 -51075 -27593 12788 -3727 -14573 -29885 -55025 -77153 -75079 -54744
19751 -54744 -28226 3519 -26237 -36742 -31000 9129 -10199 -60161 -53597 -40805 -50574 -36548
19739 -36548 -26175 -80686 -54658 -28017 -23773 -15687 -32345 -38788 -37481 -38513 -56646 -80659 -72756
19726 -72756 -10276 6306 6645 -31403 -65387 -75132 -62280 -65829 -63753 -72369 -70378 -90617 -60675
19713 -60675 16756 22900 12131 5455 2953 6299 21106 11913 -667 9803 -26288 -29963 -11045
19700 -11045 16579 41555 65554 57326 32496 24139 11356 8751 -6317 -31992 1325 11031
19688A1031j8925j4694L14K6803l1520M911k145J4341k9996q196L300K6704k095
19675b0167j9444j4340M3726J1944J7206J7039m4228j8397Q139j1410j5224K4759
19663b0397P0632j0316q482n2812p525M226k4864M732J5224K4355J3029N189J3129
19650B6120m6752M994K0059O502j0134l4241n118j1957K9241N09k0440n573k2137
19637f8927K3863L346l5143n887K6058J5325J9737J6306J7836Q520l0693K0404
19625A0745k8379j0600j7230k1976J8883M109L8512J5854J3385j021l404Q13P480
19612B7171p536q761L978J8633R831l5930j2221K8176l5015O167K8406j5636P513
19599A4776K7536L2170j4244m1915Q231K5752Q68l7953n933Q129o06m449k1846
$$ plain form
19688 11031 -7894 -22588 -22274 4529 -26991 -22080 -24225 -9884 -39880 -48076 -44776 -18072 -20167
19675 -20167 -39611 -53951 -10225 1719 18925 35964 -8264 -26661 -18522 -29932 -45156 -20397
19663 -20397 50235 39919 31437 -21375 -28900 -24674 -49538 -44806 -29582 -5227 7802 12991 26120
19650 26120 -20632 -15638 4421 10923 789 -33452 -38570 -50527 -21286 -20777 -41217 -46790 -68927
19637 -68927 -45064 -41718 -76861 -82748 -56690 -41365 -21628 -5322 12514 21034 -9659 10745
19625 10745 -17634 -28234 -45464 -67440 -48557 -44448 -5936 9918 23303 22282 18878 19691 27171
19612 27171 19635 10874 14852 33485 43316 7386 -4835 23341 -11674 -5507 22899 7263 14776
19599 14776 42312 74482 60238 18323 26554 52306 53174 15221 9288 17417 16811 12362 -9484
19586i484m0826M401K1199K2883J1975M490L2419J7491l1249m1173m7793k7120
19574h2787K4900L3915M323M534J5937n9396R985J6748J2211N965K5044n738j195
19561D446J286J321p497j7715n607K6759M7427J2017j0148j3995l1961l6282K1681
19548h268L5510J2653n2784m5303r449L0841L2770n694l2304N937m3694j4863
19536i4648L2560J6808K4499O187l2157k8438K7390J9970J0666k0492L5498j4105
19524a6262m334N2967n210m8848q761O296R618K4859k1170p247J6152J5554k5739
19511a2125m6747J0296K1278M3381K1188k0967N963K7343J0242l594K1900j7883
19499F0275l646O246k8367j9096m8530k9558l8405k3124J2987Q482N8226K4345
$$ plain form
19586 -9484 -50310 -45909 -24710 -1827 10148 14638 47057 64548 33299 -7874 -55667 -82787
19574 -82787 -57887 -23972 -19649 -15115 822 -58574 -48589 -31841 -19630 -13665 11379 5641 4446
19561 4446 5732 7053 -444 -18159 -23766 2993 50420 62437 52289 38294 6333 -29949 -8268
19548 -8268 27242 39895 -12889 -58192 -67641 -36800 -4030 -9724 -42028 -36091 -79785 -94648
19536 -94648 -62088 -45280 -20781 -14594 -46751 -75189 -47799 -27829 -17163 -37655 -2157 -16262
19524 -16262 -20596 32371 27161 -21687 -30448 -24152 -14534 10325 -10845 -18092 -1940 13614 -12125
19511 -12125 -58872 -48576 -27298 16083 37271 16304 22267 49610 59852 56258 78158 60275
19499 60275 56629 62875 34508 15412 -33118 -62676 -101081 -124205 -111218 -102736 -44510 -20165
19487b0165K0493l748r905L2111k721K4352J7794l3977J5291j0321K182j1678
19475A9708J9891J0142l0563o683l1385j2834J3339K4099O365k4548L3075l8975
19463a8369m5215L2952j1230M2135L8871k1102j2432k0695m1259k1247M3176K1530
19451a2885J3723L5454j0920k2463L0748K5679j9447k2143l7738j7054K8209M3518
19439C4681J0728k1817l128r835k5832M953k572m6126l1477K8604J1377j146M947
19426d6643J6883j8229n0515K5199O2214K7165M1055K171L636k4944J5071P996
19414F1059l7995l6742O976L1702l3953m4578j9638n928M6145K1474K2067K1267
19402C1856J5194l3445J2948j2108r726j7553K65J1099q156M998k824O744k0684
$$ plain form
19487 -20165 328 -3420 -13325 18786 16065 40417 58211 24234 39525 29204 31386 19708
19475 19708 39599 49741 19178 12495 -18890 -31724 -18385 5714 12079 -12469 20606 -18369
19463 -18369 -63584 -30632 -41862 273 39144 18042 5610 -15085 -56344 -77591 -34415 -12885
19451 -12885 838 36292 25372 2909 33657 59336 39889 17746 -19992 -37046 -8837 34681
19439 34681 45409 23592 20464 10629 -15203 -10250 -12822 -58948 -90425 -61821 -50444 -51590 -46643
19426 -46643 -29760 -47989 -98504 -73305 -11091 16074 57129 59300 62936 37992 53063 61059
19414 61059 23064 -13678 -6702 25000 -8953 -53531 -73169 -79097 -32952 -11478 10589 31856
19402 31856 47050 13605 26553 14445 4719 -12834 -12569 -1470 -9626 -4628 -7452 -708 -21392
19389b1392O431j1594L559J0774O1837J541k821j4680N676k6m1225k8512L382
19376b7050K7498K235K5776J4666k225Q79k5360K205O935J7535k544l2286j2085
19363c821m056l8090J825J9330q194J1104K3242l1658n293J1185J3345J3748m103
19350a436K6408K0238N208m0712J055J8914O709l7991K906j6172l080M4757K1181
19337D7985l6877n2156o985K9046p780j1818J1897J1613P408l0214n050k6514
19325f9445K0412M1332K9492O817j1784l8926q432l203l0417J4126J111K24P2474
19312B3781n493j4728J1385L8523J4368N12k5867k2864j3996p231L1489K0679
19300E0558l7289k5573P445l4339L507N1038J6356M733m7779N595k3559j1513
$$ plain form
19389 -21392 -14961 -26555 -22996 -12222 49615 51156 48335 33655 39331 39305 -1920 -30432 -27050
19376 -27050 448 2683 28459 43125 40900 41779 16419 18624 25559 43094 40550 8264 -3821
19363 -3821 -7877 -45967 -44142 -24812 -33006 -21902 1340 -30318 -35611 -24426 -11081 2667 -1436
19350 -1436 24972 45210 50418 9706 10761 29675 36384 -1607 1299 -14873 -17953 26804 47985
19337 47985 11108 -41048 -48033 -18987 -26767 -38585 -26688 -15075 -7667 -37881 -42931 -69445
19325 -69445 -49033 -7701 21791 28608 16824 -22102 -30534 -33737 -64154 -50028 -48917 -48693 23781
19312 23781 18288 3560 14945 53468 67836 68348 42481 19617 5621 -1610 29879 50558
19300 50558 13269 -12304 -4859 -39198 -35691 15347 31703 36436 -11343 -5748 -29307 -40820
19288d0820m279p903M332O906N03k1954K1667J0863K2546K0937j5133n6157J3729
19275d4763K5617k0297L3173n186n719K4641J573q554o296k4604k2695L593K257
19262d7260K9472O195R451k1196p578j0762K260K7970o688j2494l1881N436L3452
19249b3623K1299j9774l1394M325J3848L1673K0954k5519l9782K1274M4053l255
19237A4079J4776k2531K0158L0021j7151k1723q418K9198j3483m0434j0212J0292
19225a5428j1224J8533j0596K6706j9848k550K4626j1679N878L4512O130n8876
19213a3816n2980k6838M615K9151K4742K0718m949k0981K4128J6481J0874J2509
19201B3654O760K211l5505n694L7281r765J0018M675j431l786l6687j8769M1646
$$ plain form
19288 -40820 -45099 -53002 -48670 -41764 -41261 -63215 -41548 -30685 -8139 12798 -2335 -58492 -44763
19275 -44763 -19146 -39443 -6270 -11456 -17175 7466 9039 485 -5811 -30415 -53110 -49517 -47260
19262 -47260 -17788 -11593 -2142 -23338 -30916 -41678 -39418 -11448 -18136 -30630 -62511 -57075 -23623
19249 -23623 -2324 -22098 -53492 -49167 -35319 -3646 17308 -8211 -47993 -26719 17334 14079
19237 14079 28855 6324 26482 56503 39352 17629 9211 38409 24926 -15508 -25720 -15428
19225 -15428 -26652 -8119 -18715 7991 -11857 -14407 10219 -1460 4418 38930 45060 -13816
19213 -13816 -66796 -93634 -89019 -59868 -35126 -14408 -19357 -40338 -16210 271 11145 23654
19201 23654 30414 32625 -2880 -8574 28707 18942 28960 33635 32204 28418 -8269 -27038 14608
19188A4608J9627n0071k4180j1161K4608n1089n809N5368K3815j1852J9389l4186
19176c0933l8668O4584N4066J7053k6401j0375j3400J7038M8836J1460m940j9354
19164F8966J633k3332j6765k3646k0529K1306o228P945O982l232p950o039L9588
19151C8699p999k0758j2390Q545O204k4937k7618L0266J0126q776o83N069m365
19138h617K6782k4222K0864J7251j2441k9125j8360P026K2344j3325j0348L8969
19126A6798K944k3207k8603k1904K3K0215k3932J2743j8887j9233N0710N557k0817
19113d7593J4817N4933O38m3617o655M8863L1282k8081k1937p991K7119j7260
19101D518k4133J9233J0540j4888r219k5850k8668M4090J6676P259Q832j5010
$$ plain form
19188 14608 34235 -15836 -40016 -51177 -26569 -77658 -83467 -28099 -4284 -16136 3253 -30933
19176 -30933 -69601 -5017 49049 66102 39701 29326 15926 32964 81800 93260 88320 68966
19164 68966 70599 47267 30502 6856 -13673 7633 1405 9350 16332 13100 5150 -889 38699
19151 38699 30700 9942 -2448 6097 12301 -12636 -40254 -9988 138 -8638 -9321 -4252 -8617
19138 -8617 18165 -6057 14807 32058 19617 -9508 -27868 -20842 1502 -11823 -22171 16798
19126 16798 19742 -3465 -32068 -53972 -53949 -33734 -57666 -44923 -63810 -83043 -32333 -26776 -47593
19113 -47593 -32776 22157 22795 -20822 -27477 21386 52668 24587 2650 -5341 21778 4518
19101 4518 -19615 -382 10158 -4730 -13949 -39799 -68467 -24377 -7701 -442 8390 -6620
19089f620j1287O000P080K8701K1143J9898l2947j0845J2017M341n4170k7007
19077d3696L416J9401J9115Q202J2663l3327k9426J1806K9343j4794j3524j1377
19065d2198j9000J0234K1719N6297L9169j6670j5041p381J4038j8936n2795l6832
19053f7396M295J3636K0784M7313j922l7184k2940k6997M669k4767R207M7055
19041c4247J8590K7293R53n1752o5220J3597K2180J3949J0003O243L8381k1710
19029b1740m1638L0945M7068K1989J9433j6683q417J1072J5277l0124m1797N728
19017h887k0986j0616l542j8959J6818L6866J0253k7961l8719N1781L1256k3214
19005e910J9434k0218m73l9519k5749l020K1315m2751K1780N8130L723j9153l7415
$$ plain form
19089 -6620 -17907 -11907 -4827 23874 45017 64915 31968 21123 33140 37481 -16689 -43696
19077 -43696 -40280 -20879 -1764 6438 19101 -14226 -43652 -31846 -2503 -17297 -30821 -42198
19065 -42198 -61198 -50964 -29245 27052 66221 49551 34510 27129 41167 22231 -30564 -67396
19053 -67396 -63101 -49465 -28681 18632 16710 -20474 -43414 -70411 -65742 -90509 -81302 -34247
19041 -34247 -15657 11636 12589 -39163 -104383 -90786 -68606 -54657 -44654 -38411 -30 -21740
19029 -21740 -63378 -32433 14635 36624 56057 39374 30957 42029 57306 27182 -14615 -8887
19017 -8887 -29873 -40489 -44031 -62990 -46172 -9306 947 -27014 -65733 -13952 17304 -5910
19005 -5910 13524 -6694 -7167 -46686 -72435 -75455 -54140 -96891 -75111 -16981 -13258 -32411 -69826
18992f9826k8731J8110J1302q971J9466N9319j754j8302J5898l969k8229q238
18980d3925K9910J6458Q312j1918m3554j2640n890J2386k036O0408K2492J5223
18968D5226k0315n7390l1870J3899l4394j9156L5454N9467j713m0046l018L7058
18956a6798K2836n681m044j867J2705q660j934J6865k2280R905O319J241p335
18943A272l3108j3940K1378J9246l1643J5207O130k1347m56m769R999k7289n7542
18930a16862k220Q2875R979k9992J7263K8538j1979p121P854j3033l6587j981
18918g3266K1259P838m830J2377k05J3355k3528j8465J333J5291K3301J4342n412
18905a6610M392m7263N320J2259J6812P889L5055j0910Q242K6110J0959k6129
$$ plain form
18992 -69826 -98557 -80447 -69145 -78116 -58650 669 -1085 -19387 -3489 -7458 -35687 -43925
18980 -43925 -14015 2443 10755 -1163 -44717 -57357 -63247 -50861 -52897 7511 30003 45226
18968 45226 24911 -32479 -64349 -50450 -84844 -104000 -68546 -9079 -10792 -50838 -53856 -16798
18956 -16798 6038 357 -3687 -5554 7151 -1509 -3443 13422 -8858 1047 7366 8607 1272
18943 1272 -31836 -45776 -24398 -5152 -36795 -21588 -15458 -36805 -37261 -42030 -32031 -59320 -116862
18930 -116862 -119082 -36207 -26228 -56220 -38957 -10419 -22398 -29519 -21665 -34698 -71285 -73266
18918 -73266 -52007 -44169 -48999 -36622 -36827 -23472 -47000 -65465 -64132 -48841 -25540 -11198 -16610
18905 -16610 -12218 -59481 -54161 -41902 -25090 -17201 17854 6944 15186 41296 52255 26126
18893B6126m785m046K8822J2507M563o465K3088m8789k0384j0070J1328K69p5
18880A2089l3552j7902j7977K2636K6407L6403J5511n2782m4300J3537q733K2954
18868b5709R993M1765J2182Q250k2581k1729L6064J2692O925j9936K5260K1776
18856H4952q512m5182k3611N812N8416q279k8945m211L3377j5615p4802l5610
18844f2210j8481J2853K5409o352j6756K2577N9750m2402j3050k1484O54K4861
18832c4631N8171k062m7764l8718j0555O3709q364L075j0870j8915k3132k4995
18820i5051L5015J2667k8099J8237O6992l1126n6056j527L8324M602j3088K1805
18808b7305L1272l06j3905M4370J0198l7445l4215k0385L1153K990n369L071l0776
$$ plain form
18893 26126 21341 17295 46117 58624 63187 56722 79810 31021 10637 567 11895 12164 12089
18880 12089 -21463 -39365 -57342 -34706 -8299 28104 43615 -9167 -53467 -39930 -48663 -25709
18868 -25709 -15716 26049 38231 46481 23900 2171 38235 50927 57852 37916 63176 84952
18856 84952 76440 31258 7647 13459 71875 63596 34651 30440 63817 48202 -26600 -62210
18844 -62210 -80691 -67838 -42429 -48781 -65537 -42960 16790 -25612 -38662 -60146 -59492 -34631
18832 -34631 23540 21478 -26286 -65004 -75559 -11850 -20214 -17139 -28009 -46924 -70056 -95051
18820 -95051 -60036 -47369 -75468 -57231 9761 -21365 -77421 -78948 -40624 -36022 -49110 -27305
18808 -27305 3967 3661 -10244 34126 44324 6879 -27336 -47721 -16568 -13578 -18947 -15876 -46652
18795d6652K6842j6868J5041L0173L137o2791L8719J0396J3783l620j3249J9791
18783A4702J7788j4406p1949k3917o493J5138L9428J7802j2814K2713N8858J3629
18771G0479k6999J9767L3320Q5510J22835J04905P664q6780j07316j07262l4337
18760H1786k1124j5020j1986o177k404n9259j5791M382P843Q001K0175K0405J4551
18747B5382j9286O503K5305j0946k5133J7315L0415j0805j0814K5877k9327l1387
18735f901j6765J971J9170K5336p172P880M043k673o934J025j6884K233p883J4322
18721A0768R566l5275j2577L1521k8062k199K1270K8524K4016k2509l823p175
18709A4045M695j2913j0793p192j1270j192Q547k8041n868L113L8518J914J7843
$$ plain form
18795 -46652 -19810 -36678 -21637 8536 11673 -51118 -12399 -2003 11780 8160 -5089 14702
18783 14702 32490 18084 -53865 -77782 -84275 -69137 -29709 -11907 -24721 -2008 56850 70479
18771 70479 43480 63247 96567 182077 304912 409817 417481 330701 223385 116123 81786
18760 81786 60662 45642 33656 27479 25075 -34184 -49975 -45593 -37750 -29749 -9574 10831 25382
18747 25382 6096 12599 37904 26958 1825 19140 49555 38750 27936 53813 24486 -6901
18735 -6901 -23666 -21695 -2525 22811 15639 23519 27562 24889 17955 18980 2096 4329 -3554 10768
18721 10768 20334 -14941 -27518 4003 -24059 -26258 -4988 23536 47552 25043 21220 14045
18709 14045 18740 5827 -4966 -12158 -23428 -24620 -16073 -44114 -49982 -46869 -8351 -6437 11406
18696A1406J5999k7163p602R245j4345J3290M318K439l2424k9390R174Q131K2992
18683a3930k9384J5868N4615m8694l2932M1246K1287n212j0394n556R353j6559
18671b0292n2579k1786J5834L5605L1178K0922K1626n559K6942j2370m5339J5828
18659A0010k980J0125J1195n00O400k0743n3272j9160N691J9447K5557J4845M1299
18646D7914j626l9767q714p839l3161K373k357P692l7166J2146L3326K1490r759
18633a5448k8176J3500l9930j5983L9392M1025R086k3976k1642M0130k716j6068
18621b0806K039N994O274p569L373j2469k3360l014J4767k1159J3975L7625O8416
18608F4086P033r009n405k2177K332L685j948N2R133j6857j9882M764L0501p119
$$ plain form
18696 11406 27405 242 -7360 1885 -12460 830 5148 7587 -24837 -54227 -45053 -36922 -13930
18683 -13930 -43314 -27446 27169 -21525 -54457 -13211 8076 2864 -7530 -13086 -3733 -20292
18671 -20292 -72871 -94657 -78823 -43218 -12040 8882 30508 24949 51891 39521 -5818 10010
18659 10010 7030 17155 28350 27850 34250 13507 -39765 -58925 -53234 -33787 -8230 6615 47914
18646 47914 46288 6521 -2193 -10032 -43193 -40820 -43177 -35485 -72651 -60505 -27179 -5689 -15448
18633 -15448 -43624 -30124 -70054 -86037 -46645 -5620 3466 -20510 -42152 -2022 -4738 -20806
18621 -20806 -18767 -12773 -6499 -14068 -10695 -23164 -46524 -49538 -34771 -55930 -41955 -4330 64086
18608 64086 71119 62110 56705 34528 36860 40545 38597 38649 47782 30925 11043 15807 46308 39189
18594C9189k0018l5042J3542J8298R350m822k3126m0125K3452L8635j4124m0381
18582c5172k1972J5467K3238n440K1366q130J128k3050k7623J8978K9533K8401
18570A6724P117q299o203R737n6599J54k1727j1133K70J5451L1714J6735N475
18557e84N5119J1046k4427m8133j6407q706J1902j1958M8873K3666j1040j2815
18545A6536j053J2235l2688j9235J7159j7834j6689L7500Q170k0218L6584K4090
18533D4557k2513j2130P14k616J1388O182N33o4919j3320r268l835P452L0858
18520b6917j190J4202j506r445L6408J5280m89K3108j3669m2399l8690k5700J9013
18507e1994J6247K3463j3663M0585J3546j8014N755l2925j35L8095k0796o080
$$ plain form
18594 39189 19171 -15871 -2329 15969 25319 20497 -2629 -42754 -19302 19333 5209 -35172
18582 -35172 -57144 -41677 -18439 -23879 -2513 -10643 -9515 -32565 -60188 -41210 -11677 16724
18570 16724 23841 15542 9339 19076 -37523 -37369 -59096 -70229 -69959 -54508 -22794 -6059 -584
18557 -584 54535 65581 41154 -6979 -23386 -32092 -20190 -32148 16725 40391 29351 16536
18545 16536 15483 27718 -4970 -24205 -7046 -24880 -41569 -4069 4101 -16117 20467 44557
18533 44557 22044 9914 10628 8012 19400 25582 26115 -38804 -52124 -61392 -65227 -57775 -26917
18520 -26917 -28107 -13905 -15411 -24856 11552 26832 26343 49451 35782 -6617 -45307 -71007 -51994
18507 -51994 -35747 -12284 -25947 14638 28184 10170 15925 -17000 -17135 20960 164 -5916
18495e916n2016m767K3286L6169L8005M537J473j6609m0167J3154R946m8751j0082
18482e1738J9233R26L4318P0559l3609m2093Q289j6484P692p928j9181j0358q691
18469d9065j7174K9491J526L5427N1842k2140m7009q568J2890J0988M576K0847
18457B3631o529o462K2884L8055J0937J3275k4821l9876n1730M011K6133j0413
18445i05j0331J3138K6070J5825n821k8910k0651M1084L583l8800j2831J4425
18433d124M224N0918K7204j9607l5890l5586K1219J0826J313j3205j7249q758
18421a8715K4413K0406k3228m3766q23k2918J787k8260k8587Q0520L5367l1884
18409c5688j7384q021j6933j1181M8992M51J9612L819k0448J7167N3590l8257
$$ plain form
18495 -5916 -57932 -62699 -39413 -3244 34761 39298 40771 24162 -16005 -2851 7095 -41656 -51738
18482 -51738 -32505 -31579 2739 73298 39689 -2404 5885 -10599 -2907 -10835 -30016 -40374 -49065
18469 -49065 -66239 -36748 -35222 205 52047 29907 -17102 -25670 -12780 -1792 2784 23631
18457 23631 17102 10640 33524 71579 82516 95791 70970 31094 -20636 -16625 9508 -905
18445 -905 -11236 1902 27972 43797 37976 9066 -11585 29499 33082 -5718 -18549 -4124
18433 -4124 100 51018 78222 58615 22725 -12861 8358 19184 20497 7292 -9957 -18715
18421 -18715 5698 26104 2876 -40890 -41713 -64631 -62844 -91104 -119691 -39171 -3804 -35688
18409 -35688 -53072 -61093 -78026 -89207 -40215 -39764 -20152 -16333 -36781 -19614 33976 -4281
18397d281k4147m985o010L7933j507J2932r825k4751q950P559p119j1199l2651
18384g7001J6268K9889K3764K7772K0636m295j6710K4216J5912j5165J1792j7721
18372C9357j9802k2905l1070j5389O4947K1566J1243M679m2700J0426L1866J726
18360E3944q419m3378j0719K6138j8986J7127K5541l9466N327K066j9469K6268
18348A5974K7253p9846l5599L0967L513L0716K9671j0277J9121m7637o0502J3900
18336f2746M9742L0645l1094n8579M702N8316M3778l684k7784j2416j3994N260
18324a7854K4231K1279J1695m6504J1980P904J0836j2262L674Q95n9521l7804
18312h1451L1620J4368k9851L3292M1823j293l604K5799l540L65k809J6305j796
$$ plain form
18397 -4281 -28428 -33413 -39423 -1490 -2997 9935 110 -24641 -33591 -26032 -33151 -44350 -77001
18384 -77001 -60733 -30844 -7080 20692 41328 37033 20323 44539 60451 45286 57078 39357
18372 39357 19555 -3350 -34420 -49809 15138 36704 47947 52626 9926 20352 52218 53944
18360 53944 45525 2147 -8572 17566 -1420 15707 41248 1782 7109 9175 -10294 15974
18348 15974 43227 -36619 -72218 -41251 -37738 -7022 22649 12372 31493 -16144 -76646 -62746
18336 -62746 -13004 17641 -13453 -72032 -67330 -9014 34764 31080 3296 -9120 -23114 -17854
18324 -17854 6377 27656 39351 -7153 4827 12731 23567 11305 14979 15874 -43647 -81451
18312 -81451 -49831 -35463 -65314 -32022 9801 8508 4904 30703 27163 27528 24719 41024 39228
18299C9228l8439m914l6784k4367k7K8722J7780N5688L7592j043r471m3372j2661
18286G932P188j2150M5291L1268k2275k8237k9177p326K509j108m5670o467L8636
18273a9586J4K7675M1188J0206k6179l1182l4109K2257Q724l4830L108M1528R801
18260A8615j2369j2745O550J1683J5428J4719M1791P813j6144p741j5106k1459
18248C1035m181l1585k3538K3779n040K072K1277L6698O527j8763L262n384k4149
18235A2010J4636O0389Q0O1096j2869n7093k342o94j4444J2409M595L0853l6431
18222G2195R082j241J1439n9669r883j7662j3866J4905j0861K857L973j1341J4474
18209D402M6523j801j2321j1403j8819R339M3580K606J4340j7206l1124l7401
$$ plain form
18299 39228 789 -4125 -40909 -65276 -65303 -36581 -18801 36887 74479 73436 63965 20593 7932
18286 7932 15120 2970 48261 79529 57254 29017 -160 -7486 -4977 -6085 -51755 -58222 -19586
18273 -19586 -19572 8103 49291 59497 33318 2136 -31973 -9716 -992 -35822 -32714 8814 18615
18260 18615 6246 -6499 51 11734 27162 41881 83672 91485 75341 67600 52494 31035
18248 31035 26854 -4731 -28269 -4490 -9530 -7458 13819 50517 57044 38281 41543 36159 12010
18235 12010 26646 87035 87115 148211 135342 78249 75907 75213 60769 73178 77773 108626 72195
18222 72195 81277 80036 91475 31806 21923 4261 -9605 5300 -5561 -2704 1269 -10072 4402
18209 4402 50925 49124 36803 25400 6581 15920 59500 62106 76446 59240 28116 -9285
18197i285K1847J5555j6482K3778j4672J0241M919M2237j6590m1986j9775l1529
18185c1742J1111J6915l298K4210N1210o858m3000K2743L9437j4109J6281J4758
18173I7658q136j5220k0262K2615j912l3160R961K9378Q622J8503l2949K786K5502
18160A03386r729J8392l2017N55O481J23j8308K2099K1640L354L046K4289r071
18147A34240l3925N4237L8090L5885K2320Q079J1011K6503l1648j7372J861M2993
18135B92274O4449O7341M7111J9163M0029J05361P4209N5235Q8276Q6246Q1257
18124A020951Q4684J60315J99029K32801K51017L08415M00200N60352P36624J032479
18114D986867J645163K582211M129811O892638J1634873J8184148J8603404K059274
$$ plain form
18197 -9285 12562 28117 11635 35413 20741 30982 35901 78138 61548 19562 -213 -31742
18185 -31742 -20631 -3716 -7014 17196 68406 61548 18548 41291 80728 66619 82900 97658
18173 97658 89522 74302 54040 76655 74743 41583 51544 80922 89544 108047 75098 77884 103386
18160 103386 93657 112049 80032 80587 87068 87191 68883 90982 112622 115976 119022 143311 134240
18147 134240 100315 154552 192642 228527 250847 258926 269937 296440 264792 247420 249281 292274
18135 292274 356723 424064 471175 490338 530367 635728 709937 765172 853448 939694 1020951
18124 1020951 1105635 1265950 1464979 1697780 1948797 2257212 2657412 3217764 3954388 4986867
18114 4986867 6632030 9214241 13344052 20236690 31871563 50055711 68659115 70718389
18106G0718389j8377951j6295351j0571315p333126n031786l461336k395800j666643
18098E585081j166437q76967o49104m52663l57547k78539k01852k13661j63628
18089A224683j43165j53522j20915n8339o2929m3201r285l8698o9559m5713n1606
18078D27751n8213o3985k1159p75m580p8488m4632M6841P6377L6330m2452o0933
18066B12082J1309j3405m8100k2745q588j1410l1986m0621J6184L1673J0444p975
18054I6862J2741J1225J1503l6676j3388l155l9857k6997J2368j204j2463o291
18042D668N0476N2393j9680Jl3318N908J4541r399K70J5397J0356l7358L904n555
18028E2604L452p87M9705K029k2079K824m252m5791j6250j7730j1770j3848j9015
$$ plain form
18106 70718389 52340438 36045087 25473772 18140646 13108860 9647524 7251724 5585081
18098 5585081 4418644 3541677 2892573 2439910 2082363 1803824 1601972 1388311 1224683
18089 1224683 1081518 927996 807081 748742 685813 642612 633327 594629 525070 479357 427751
18078 427751 369538 305553 284394 283619 279039 200551 155919 202760 279137 315467 273015 212082
18066 212082 223391 209986 161886 139141 130553 119143 87157 46536 62720 94393 104837 96862
18054 96862 109603 120828 132331 95655 82267 79112 39255 12258 24626 23422 10959 4668
18042 4668 55144 107537 87857 87858 54540 60448 74989 65590 65860 81257 91613 54255 58159 52604
18028 52604 56056 55269 104974 107003 84924 87748 83496 37705 21455 3725 -8045 -21893 -40908
18015d0908L2031J0343k173l619K3410l439j6362K3801N2818O578k4736j97K934
18002F0481P363r658l7781k5108K6430K5145K1560l0777j7833l0565j6882J103
17990b6522J3683k7575R442K5357n018L9043M4072k4818l3485k3210L1448M5889
17978F8306L0491J7267l1966n918J1176k3274j7522j958j5414l1293l1014j211
17966c2330L4233J4855M7483M151k3402m1639m3427k5421l984n491J4667J7577
17954d2728N9705k081r324M4813k1850j4714K7464j8798m4963k3706k0043j6630
17942h2855N9744N4858l0398l9078m813N3717o711k9379O785K5080Q52k9477k4101
17929d5776J2881P163M318m347j3705K7941m673L606j1951k0539j903J7792K0440
$$ plain form
18015 -40908 -8877 1466 -707 -4326 19084 15645 -717 23084 75902 82480 57744 57547 60481
18002 60481 67844 58186 20405 -4703 21727 46872 68432 37655 19822 -10743 -27625 -26522
17990 -26522 -12839 -40414 -30972 -5615 -10633 28410 72482 47664 14179 -9031 22417 68306
17978 68306 98797 116064 84098 78180 89356 66082 48560 46602 31188 -105 -31119 -32330
17966 -32330 1903 16758 64241 68392 44990 3351 -40076 -65497 -69481 -74972 -60305 -42728
17954 -42728 16977 14896 5572 50385 28535 13821 41285 22487 -22476 -46182 -66225 -82855
17942 -82855 -23111 31747 1349 -37729 -42542 11175 4464 -24915 -18130 6950 7802 -21675 -45776
17929 -45776 -32895 -25732 -21414 -25761 -39466 -11525 -16198 -12592 -24543 -45082 -46985 -29193 -8753
17916h753k5056k5897N1838O780N935j0912l4424K256M7566n14j2034p934L564
17903g585J3034N2968n474j9156K5166q723p1083l8845q336l2853j1076L0616
17891h1347M5748K2994j476M2364j849p324m8226k2669J8022N2753M570K2832
17879D6392n0967k8928j7773J0302J8872L1623J598K4109P8636k9672p4690j1241
17867a739j8870l5755J6912k527k4743j187J0029m877P933L3195L8335k6117l6436
17854d5847Q537K0725J5097L0568j9568j1332M4623J3912m2498k6247l4536J8012
17842b8554J7476Q151M5551J3005j6052m6336j0197N586J8220K1535K2922j1954
17830C9353J5259K6627l399l9706l5816K1234k940J5147k7603j4055O7612K2253
$$ plain form
17916 -8753 -33809 -59706 -7868 -1088 4847 -6065 -40489 -38233 9333 8819 -3215 -11149 -7585
17903 -7585 5449 58417 52943 33787 58953 50230 -20853 -59698 -68034 -100887 -111963 -81347
17891 -81347 -35599 -12605 -14081 28283 26434 19110 -29116 -51785 -33763 18990 23560 46392
17879 46392 -4575 -33503 -51276 -40974 -22102 9521 11119 35228 113864 84192 9502 -1739
17867 -1739 -20609 -56364 -39452 -41979 -66722 -67909 -57880 -62757 -54824 -21629 16706 -9411 -45847
17854 -45847 -37310 -16585 -1488 29080 9512 -1820 42803 56715 14217 -12030 -46566 -28554
17842 -28554 -11078 -2927 42624 55629 39577 -6759 -16956 -11370 6850 28385 51307 39353
17830 39353 54612 81239 77840 38134 2318 23552 20612 35759 8156 -5899 61713 83966
17818H3966n6583m3624l8736M9902L0345q271j2761J284k0008k9680l6418M3976
17806c6608K6097r651P767j7726L0695J1041L4172K1934j8723n2241j8105n429
17794b6777q712J9560K5768K026k1238j102N572K9374N2667J3173j7096Q676k730
17781G9161l8492k0194m3722L4878Q97l8268J5813J5741p808R2j129J1637j5250
17768f644k0019r303L1044K1561k3478J2331j6225n6682m0282L3787N5073J0112
17756h725L1717K9220J2859k086l0511o459J310L3405J1322k2265J5153K0338
17744H5278R109k410j2511L3224P2765J6457n2812l9262j4004R564k5045K0803
17732A01156o339m4114q964k776n2111l1961j1695K4954N1282J8332j358K6489
$$ plain form
17818 83966 27383 -16241 -54977 -5075 25270 16999 4238 5522 -14486 -44166 -80584 -36608
17806 -36608 -10511 -20162 -12395 -30121 574 11615 45787 67721 48998 -3243 -21348 -26777
17794 -26777 -35489 -15929 9839 11865 -9373 -10475 -4903 24471 77138 90311 73215 81891 79161
17781 79161 40669 20475 -23247 11631 12528 -25740 -9927 5814 -1994 -1902 -3031 8606 -6644
17768 -6644 -26663 -35966 -4922 16639 -6839 5492 -10733 -67415 -107697 -73910 -18837 -8725
17756 -8725 22992 52212 65071 62985 32474 26015 27325 60730 72052 49787 64940 85278
17744 85278 94387 91977 79466 112690 185455 201912 149100 109838 95834 105398 80353 101156
17732 101156 94817 50703 41739 38963 -13148 -45109 -56804 -31850 19432 37764 36406 62895
17720F2895l9584l1723k9775R062L4850m7m6797p604K9396R348m5517J2169J8736
17707b4591j3464q566j26O671K9363P588L0475k9749k8409L7148K8154K5317M1681
17694A01492p327q1702P16j145n448M405l1288q645j0842j2939Q857K1474p913
17681c0305j0041j0672M7914N1845N530p376Q900J8852m3521l6985K6861J104
17669B2106j3772K1274j8600l5625o4135J8776j5923k5157L2030K9027k2999R580
17657f3418J1309M2861K9066M154J4011j7684l4629J6090L3048l6488l5287O5
17645c6902j1158J4100J4174J2635J0901K6177j6261m7332o685M3934J9917j1860
17633A1640L003k0280K1952j7365l5320L501p196n048k7510K1004j533N747P378
$$ plain form
17720 62895 23311 -8412 -38187 -29125 5725 5678 -41119 -48723 -19327 -9979 -55496 -43327 -24591
17707 -24591 -38055 -46621 -46747 -40076 -10713 -3125 27350 -2399 -30808 6340 34494 59811 101492
17694 101492 94165 12463 13179 12034 6586 10991 -20297 -28942 -39784 -52723 -43866 -22392 -30305
17681 -30305 -40346 -51018 -3104 48741 54271 46895 55795 74647 31126 -5859 21002 22106
17669 22106 8334 29608 11008 -24617 -88752 -69976 -85899 -111056 -79026 -49999 -72998 -63418
17657 -63418 -52109 -9248 19818 23972 37983 20299 -14330 1760 34808 -1680 -36967 -36902
17645 -36902 -48060 -33960 -19786 -7151 3750 29927 13666 -33666 -40351 3583 23500 11640
17633 11640 14643 -5637 16315 -1050 -36370 -32869 -40065 -45113 -72623 -51619 -53152 -47405 -40027
17620d0027P020L5840N580K9953J370j0327j0475J85Q516R142l7965o0504j4025
17607g5717K2063J6044n979k0331K1575K1972K0806J2938L0690J3533L693l7778
17595B3509k7200r588O153m6787k2091m399L3477L7548L111m131m1607m513O7971
17582A1453L5374l3975J5626L0642n4632j978L5202l1928J5571j7462m1085J3392
17570b3800r331k3427M17M536J764M4521K3556j5256J0630J1990j5261k72l8168
17557b8101K8554M009m0677K2714J5857P306p740j3533k1091N097K7262N621J5097
17544B0375N176n2110j4913p915R61J4426J7427m800n496r245P46j7544N190J2075
17530c5647O904K282k1376J539k0978J3459N6305J9700k600j5070r443l97J5132
$$ plain form
17620 -40027 -33007 2833 8413 38366 39736 29409 18934 19119 27635 36777 -1188 -61692 -75717
17607 -75717 -53654 -37610 -43589 -63920 -42345 -20373 433 13371 44061 57594 61287 23509
17595 23509 -3691 -13279 -7126 -53913 -76004 -80403 -46926 -9378 -6267 -10398 -52005 -56518 11453
17582 11453 46827 12852 28478 59120 4488 2510 37712 5784 21355 3893 -37192 -23800
17570 -23800 -33131 -56558 -56141 -51605 -49841 -5320 18236 2980 13610 25600 10339 10067 -28101
17557 -28101 453 4462 -36215 -13501 2356 9662 1922 -11611 -32702 -27605 -343 5278 20375
17544 20375 25551 -26559 -41472 -49387 -48426 -34000 -16573 -21373 -26869 -36114 -35368 -52912 -47722 -35647
17530 -35647 -28743 -26461 -47837 -46298 -67276 -53817 2488 22188 19588 4518 -4925 -5322 9810
17517I810J209j1047n851m2649n731J5613L2687J16l2406l3595J6646o535j328
17504f3061K7343n006M808m2412k5000K4305K2854k254N1043K5554K326k4842
17492d342j2126l8195J218J0796K0158O509J0359m0787j3123j2449K4621k889
17480e0250k4144M044R745j8666k9502l908N1488K7827r141k9202l3542J8905
17468h6346L7027P320K4110Q240M88j7558o885O083J784M947k626m3062r439J9972
17454e5945L7286j5660J4839J0478K4252J7011J7530K2456Q918N4698K7551L9225
17442B02639J31871Q671r7975r5643p1298q5917k6313O8810K8968m7476j0937
17431E400o5971k9009P6183L4036p0006m3615M1018J9840L2850M7149J3633l9922
$$ plain form
17517 9810 11019 -28 -5879 -48528 -54259 -38646 -5959 -5843 -38249 -71844 -55198 -61733 -63061
17504 -63061 -35718 -40724 -35916 -78328 -103328 -79023 -56169 -58423 -7380 18174 20500 -4342
17492 -4342 -16468 -54663 -53445 -42649 -22491 -15982 -5623 -46410 -59533 -71982 -47361 -50250
17480 -50250 -74394 -70350 -60605 -79271 -108773 -112681 -61193 -33366 -42507 -71709 -105251 -86346
17468 -86346 -49319 -41999 -17889 -9649 -9161 -26719 -33604 -27521 -25737 -20790 -23416 -66478 -75917 -55945
17454 -55945 -18659 -34319 -19480 -9002 15250 32261 49791 72247 81165 135863 163414 202639
17442 202639 334510 343181 245206 149563 78265 -7652 -33965 34845 63813 16337 5400
17431 5400 -60571 -89580 -13397 20639 -49367 -92982 -51964 -32124 726 47875 61508 21586
17419B1586m911J1123M5227k6392o5367l6254J9825L3990j0833O989P246k0339
17407a8110j1359J8965p867k8252J8381L6769R266J0839j0557m4177o9692m017
17395i9811P2714N7270J8467k5636k7247j4080n039Q361N1941J5320r705k7413
17383A5142j7820j0595j9555K9861k3762j7359J0063p255J1022K2435k4646k4330
17371e6799K0943Q892L2407J0054k8425l3430P513M072L3714J7511k2590N1677
17359D5539o924n6592k1803k5799k2110M6468J1156q772J9717j934l3765k7686
17347h2505j831K2791J6235q740K4271M431o115j5387J271J7207J4730J4316Q191
17334H865R205l7310p0552p886O9881N1656M4077o981j6435m672m6873k5808L2700
$$ plain form
17419 21586 16675 27798 73025 46633 -18734 -54988 -35163 -1173 -12006 -5017 2229 -18110
17407 -18110 -29469 -10504 -18371 -46623 -28242 8527 17793 28632 18075 -26102 -95794 -99811
17395 -99811 -27097 30173 48640 23004 -4243 -18323 -23362 -15001 36940 52260 42555 15142
17383 15142 -2678 -13273 -32828 -2967 -26729 -44088 -34025 -41280 -30258 -7823 -32469 -56799
17371 -56799 -35856 -26964 5443 15497 -12928 -46358 -38845 -34773 -1059 16452 -6138 45539
17359 45539 38615 -17977 -39780 -65579 -87689 -41221 -30065 -38837 -19120 -21054 -54819 -82505
17347 -82505 -84336 -61545 -45310 -54050 -29779 -25348 -31463 -46850 -45579 -28372 -13642 674 8865
17334 8865 18070 -19240 -89792 -97678 -27797 23859 67936 60955 44520 39848 -7025 -32833 -133
17321a33k099j1761k698k470J7102K5737m421j6114l3387l4674J9859K0232L0858
17308F031M857l249l0352K8776L7092k6566p1802M3530J7712j3322N546l0804
17296c2551k5929N5942Q228L67P907O061j0822k876J1963j4905j8496k7134j6762
17283e9007O139M3920j4386l332K6250O828K7059j4327j3981n6059n8184o27J7341
17270i2366O6913J8336j6880j4865L245M4192J2544N97m6076l6571j4181M2904
17258c2208N3070j8487k3997k0761J6596j6125l8800J4739J2159O7722p23j0863
17246B322Q192j3190n5227J1997j0134k6131J7185O365L9430K9572J8939J5773
17234D5093j5290j726K3067k30o4455m8689k4787J006L3473J3763o974q193o575
$$ plain form
17321 -133 -2232 -13993 -16691 -19161 -2059 23678 19257 3143 -30244 -64918 -45059 -24827 6031
17308 6031 10888 7639 -22713 6063 43155 16589 -55213 -11683 6029 -7293 -1747 -32551
17296 -32551 -58480 -2538 5690 6057 13964 20025 9203 6327 18290 3385 -15111 -42245 -59007
17283 -59007 -52868 -8948 -23334 -26666 -416 6412 33471 19144 5163 -50896 -109080 -109707 -92366
17270 -92366 -25453 -7117 -23997 -38862 -35617 8575 21119 21716 -24360 -60931 -75112 -32208
17258 -32208 20862 2375 -21622 -42383 -25787 -41912 -80712 -65973 -53814 13908 13185 2322
17246 2322 10514 -2676 -57903 -45906 -56040 -82171 -64986 -58621 -19191 10381 29320 45093
17234 45093 29803 28077 51144 50914 -13541 -62230 -87017 -86011 -52538 -38775 -45749 -53942 -60517
17221f0517M867k0658L251J0607j7271l8043L3862J1996k0657J809o194m967M3562
17208e8353M2367M8809P858m8039m0304r313j8531l5j1208j634L4383j0223m2546
17195a06769k8348M46M0583K0442K2395j9047m6617K2846J1473L641l2070l3200
17183a44225K0766M5492K5294L146N229m622K6931M0466O257J7291J3206k1460
17171C3771q25l5547k681j939L7217J063j1633m1707k2778m8364j1261J5414N3634
17158c5636M327j1933k176M1010J7492j0320k1146l293L6488R05k9866k845L1589
17145A4596n633j3704R797J5398k2743k8313r752k8657n345J2646j7220j5300
17133i4230K8269M5660R178m3191j5603J5120N491k4605J1380L9057k1729j6297
$$ plain form
17221 -60517 -55650 -76308 -73057 -62450 -79721 -117764 -83902 -71906 -92563 -90754 -96948 -101915 -58353
17208 -58353 -15986 32823 40681 -7358 -47662 -56975 -75506 -75541 -86749 -88383 -54000 -64223 -106769
17195 -106769 -135117 -134671 -94088 -73646 -51251 -70298 -116915 -94069 -82596 -78955 -111025 -144225
17183 -144225 -123459 -77967 -52673 -49527 -44298 -48920 -21989 18477 24734 42025 55231 33771
17171 33771 32946 -2601 -5282 -7221 29996 31059 19426 -22281 -45059 -93423 -104684 -89270 -35636
17158 -35636 -31309 -43242 -45418 -4408 13084 2764 -18382 -21675 14813 15718 -14148 -16993 14596
17145 14596 8963 -4741 5056 20454 -2289 -30602 -40354 -69011 -74356 -61710 -78930 -94230
17133 -94230 -65961 -20301 -11123 -54314 -69917 -54797 -49306 -73911 -62531 -23474 -45203 -61500
17121f1500j1923N828L53j0227j693J0450J9393K2630k4K7644j5733k7226m143
17108d6171J2325N130k2975o4555J6415M791K8527Q9841N5244J1740l4335k9208
17096B6769j7680j5588m681Q115J4652k4721j7368M8054J7425O823N3450l6734
17084E8516j8046L3167j3845o4427o406j0902p712J1239O591m951m2784M94L273
17071e5793K8723q41J7820P356L668k8162k8031N246j30L623Q095k3062P842R454
17057d4192K1094k6859k1722n940L8040K109n0266M6421L2104J5057l556N752
17045H042Q625L330o856j4112k0178M950K3068j9497K153j4573J4623K3914J6440
17032B9929j4868K9165J1278Q164m766J3253m4166l9963P437K5820j122j5038
$$ plain form
17121 -61500 -73423 -67595 -67242 -77469 -79162 -68712 -49319 -26689 -26713 931 -14802 -42028 -46171
17108 -46171 -33846 -28716 -51691 -116246 -99831 -95040 -66513 23328 78572 90312 55977 26769
17096 26769 9089 -6499 -11180 -3065 11587 -13134 -30502 17552 34977 41800 95250 58516
17084 58516 40470 73637 59792 -4635 -11041 -21943 -29655 -18416 -11825 -16776 -59560 -59066 -55793
17071 -55793 -27070 -27911 -10091 -2735 933 -27229 -55260 -50014 -50144 -46521 -38426 -61488 -53646 -44192
17057 -44192 -23098 -49957 -71679 -77619 -39579 -37470 -87736 -41315 -9211 5846 2290 8042
17045 8042 16667 19997 13141 -971 -21149 -16199 6869 -12628 -10475 -25048 -10425 13489 29929
17032 29929 15061 44226 55504 63668 58902 72155 27989 -11974 -4537 21283 20161 5123
17020E123l9194m689j7267L3861J7178j049K351J1955r684j0812j8449n857N597
17007c0936J4894O294N707Q324J1773L9507j7070p080J482J371o1114J2573K5609
16994A1334o823m1178L4786M0131k299K2274J8038l0714l7891o540p167l44m1833
16981d8226r909L8128M2794k7611l51l7820J87J9311J514K2298J1261l6546Q778
16968a6192j3796J2380m46P862O759J9542J167K2566K7336l5196o5009o557L611
16955c5973R414K6430K3163j0177k6089n6837J3120J3779l9967K6497N5976j6913
16943a7577o864J8744K4637L3975k1862m4165l045p882k5450J7786J5519M228
16931a1956j6381k7458l3355j3699J4059O0976M1962O644l5150N587K6165J5197
$$ plain form
17020 5123 -34071 -38760 -56027 -22166 -4988 -6037 -3686 8269 -1415 -12227 -30676 -36533 -30936
17007 -30936 -16042 -9748 -4041 4283 16056 55563 38493 31413 32895 34266 -26848 -14275 11334
16994 11334 4511 -36667 -1881 38250 35951 58225 76263 45549 7658 1118 -6049 -6393 -48226
16981 -48226 -58135 -20007 22787 -4824 -5175 -42995 -42808 -23497 -21983 315 11576 -24970 -16192
16968 -16192 -29988 -17608 -18054 -10192 -3433 16109 17276 39842 67178 31982 -33027 -39584 -35973
16955 -35973 -26559 -129 23034 12857 -13232 -70069 -56949 -43170 -83137 -56640 -664 -17577
16943 -17577 -24441 -5697 18940 52915 31053 -13112 -16157 -24039 -49489 -31703 -16184 -11956
16931 -11956 -28337 -55795 -89150 -102849 -88790 -27814 14148 20792 -14358 -8771 17394 32591
16919C2591n3321k6391L8967j1299l8845P10J7845M398j941j2343m5618l5311
16907a30558K6432K8528M4088j6608j433J180O801N134M734l767l8433O335j3649
16894h1216L2843K5304J2356K2914j7028j5053k625j1161k7559L8487L9170J5379
16882C1811l4395k720K941M5053j0153j8856o7J0147J8181j0536j029L4041n3348
16869A1070M684j0771O398L5219k8056Q5k7602j5349o271l303O138J5693k7174
16856c9239L573P880O884k731j4052J0033q736R345N3683J447q317k6780P699
16843F89L7373J8982L4074l6830k8560l2907j5392n797J0322M2233j7950l9619
16831c3382J0244K3075k9683k6547j3692J4229K3222O7200O849l7343N859j6378
$$ plain form
16919 32591 -20730 -47121 -8154 -19453 -58298 -57588 -39743 -35345 -37286 -49629 -95247 -130558
16907 -130558 -104126 -75598 -31510 -48118 -49551 -48371 -41570 -36436 -31702 -35469 -73902 -67567 -81216
16894 -81216 -48373 -23069 -10713 12201 -4827 -19880 -22505 -33666 -61225 -22738 16432 31811
16882 31811 -2584 -5304 -2363 42690 32537 13681 13614 23761 41942 31406 30377 64418 11070
16869 11070 15754 4983 11381 46600 18544 18629 -8973 -24322 -30593 -33896 -27758 -12065 -39239
16856 -39239 -35666 -27786 -20902 -23633 -37685 -27652 -36388 -27043 26640 28087 19770 -7010 689
16843 689 38062 57044 91118 54288 25728 -7179 -22571 -28368 -18046 24187 6237 -33382
16831 -33382 -23138 -63 -29746 -56293 -69985 -55756 -32534 34666 41515 4172 10031 -6347
16819f347j3460l5182p6983l072M6330K4067N7827L6144l7922l2933k0998j44
16807f2673O2253M4248J9261k3066j3612k7370j0829K6727J1753K4918j0184m8549
16795g123q0430m9394J8412K5024N7865J5278m991m713J5394O283J6558j6272
16783h109n453J1151Q337o201j2233k1869O709K9911J3759N709L530J2415j0786
16770B6870K1772K371k6692k0523p5127m4406j2528N3567M0963L4204R19J1377
16758A2767J7539k324o9868m394J1251M8r185j0888j1624J0587L1594l1791r751
16745f6039j5121J5343L1801j0459R161K1790j8487o109L5276L2061j1555n8047
16733d0385j9156M2112L4478j3732l1426j3765j6282L7902K3555J2185P446P480
$$ plain form
16819 -6347 -19807 -54989 -131972 -135044 -88714 -64647 -6820 29324 -8598 -41531 -62529 -62673
16807 -62673 -420 43828 63089 40023 26411 -959 -11788 14939 26692 51610 41426 -7123
16795 -7123 -87553 -136947 -118535 -93511 -35646 -20368 -25359 -30072 -14678 -8395 8163 -8109
16783 -8109 -13562 -2411 5926 -275 -12508 -34377 -27668 2243 16002 21711 25241 37656 26870
16770 26870 48642 51013 24321 3798 -71329 -115735 -128263 -74696 -33733 471 1390 12767
16758 12767 30306 27982 -41886 -46280 -35029 -34981 -44166 -55054 -66678 -56091 -24497 -56288 -66039
16745 -66039 -81160 -65817 -34016 -44475 -35314 -13524 -32011 -38120 -2844 29217 17662 -40385
16733 -40385 -59541 -17429 17049 3317 -28109 -41874 -58156 -20254 3301 15486 22932 30412
16721C0412j5512l6226k182K145l0572L4186O2021K0343k9193l1128j7116K685
16709a0137k7373n316L5682o152K0522l119J1673j3915J9044R261k2481j9943
16697a2254o032n884l8682k9748p324K4929k351M5469M7654K5014k8349o1219
16685d8777l286M4805L7010k676l7204j97n549o299M206L3152L2420k2047j4181
16672A1377k0639K7274K5583q0897k6716L4462K2381M1666O264K758o88Q371l1657
16659A9539m0721l1200l5374M4476L4877L5797J1291l3334J5318O155k3245o1981
16647e8402Q222L3927J1391J436k678l0325K5190K377j2834j1509L149J9530k575
16634a3101J2826j1773l9355L4331L6710Q360l0556l1338j18j3221l0275K339
$$ plain form
16721 30412 14900 -21326 -23508 -21363 -51935 -17749 44272 64615 35422 4294 -12822 -10137
16709 -10137 -37510 -42826 -7144 -13296 7226 4107 15780 1865 20909 30170 7689 -12254
16697 -12254 -18286 -24170 -62852 -92600 -99924 -74995 -77346 -31877 15777 40791 12442 -48777
16685 -48777 -52063 -7258 29752 27076 -10128 -10325 -15874 -22173 -17967 15185 47605 25558 11377
16672 11377 -9262 18012 43595 -37302 -64018 -29556 -7175 34491 40755 43513 42825 51196 19539
16659 19539 -21182 -52382 -87756 -43280 -8403 27394 38685 5351 20669 26824 3579 -58402
16647 -58402 -50180 -16253 -4862 -3426 -6104 -36429 -11239 -8862 -21696 -33205 -30056 -10526 -13101
16634 -13101 -275 -12048 -51403 -17072 19638 27998 -2558 -33896 -34014 -47235 -77510 -75171
16622g5171j2148M8210N3861K362L399l2426j2422K4689N547m0303l7647K1139
16610e0910K6051K3486K985k4309K1094M7429L0743q20j1746l734n0813l6231
16598b6775k0748k2286J2866p143j8964N3625K7238j1721p695l1872n0597L1904
16586g2168P649m618m375O4376m698j7950J0366L206L2j290J4532L469O361o062
16572a170m3846K280K6105J577J2798K0196l0027l7446O215N722j6837J3080L4395
16559f958O848K981K5896j3798m7035j5887J659j3391K586K2766m049J8851P86
16546a8745l3677k2296l263Q43J9721K6739L860N162J0378K1142Q206J4567k8207
16533D430k6796j0875R056l3190L4856O150K1312j2308o6928K2793L0279J2072
$$ plain form
16622 -75171 -87319 -39109 14752 17114 20513 -11913 -24335 354 5901 -34402 -72049 -50910
16610 -50910 -24859 -1373 1612 -22697 -1603 45826 76569 75749 64003 60269 9456 -26775
16598 -26775 -47523 -69809 -56943 -64086 -83050 -29425 -2187 -13908 -21603 -53475 -104072 -72168
16586 -72168 -64519 -69137 -73512 -9136 -13834 -31784 -21418 -18212 -18180 -19470 -4938 -1469 4892 -1170
16572 -1170 -45016 -42736 -16631 -15054 -2256 17940 -12087 -49533 -43318 -37596 -54433 -41353 -6958
16559 -6958 -110 2871 28767 14969 -32066 -47953 -46294 -59685 -57099 -34333 -38382 -19531 -18745
16546 -18745 -52422 -74718 -77981 -77138 -57417 -30678 -26818 -21656 -11278 9864 18070 32637 4430
16533 4430 -22366 -33241 -24185 -57375 -22519 -16369 4943 -7365 -74293 -51500 -21221 -9149
16521i149J3112j6302Q305K3029Q175L098K2068k1203j8510j8513l9975j1787
16509e7652J2712k540N062K2115J2074l046J0502J3495J8078l0323n2321k5181
16497g7025J6771J3928j0364j5536J3449L7807M0340j8805n1380J308J0629J0489
16485b8389j730m4494l65J00153K9916k2264l522k7899J0059J3915m6506L7663
16473A6537N756l6891n2351k3866J6235K3931N9698J7626m0371J3553M108k3950
16461a9985l2281l4372O277J1044O7948K6870o108J1156K0703n343j5362J2237
16449D2784l6599m8017j413O386k0046J8356J5856L881m4606l1N3591j4369k3732
16436d7959K8159n500J3103j8977l5987m2333j4539k0634N001L7041L0318O2074
$$ plain form
16521 -9149 3963 -12339 -4034 18995 27170 30268 52336 31133 12623 -5890 -45865 -57652
16509 -57652 -44940 -47480 -42418 -20303 -8229 -11275 -773 12722 30800 477 -51844 -77025
16497 -77025 -60254 -46326 -56690 -72226 -58777 -20970 19370 565 -50815 -49507 -38878 -28389
16485 -28389 -30119 -74613 -74978 25175 55091 32827 29305 1406 11465 25380 -21126 16537
16473 16537 22293 -14598 -66949 -90815 -74580 -50649 9049 26675 -13696 -143 3965 -19985
16461 -19985 -52266 -86638 -80361 -69317 -1369 25501 19393 30549 51252 45909 30547 42784
16449 42784 6185 -41832 -43245 -36859 -56905 -38549 -22693 -18812 -63418 -63449 -9858 -24227 -47959
16436 -47959 -19800 -25300 -12197 -31174 -67161 -109494 -124033 -144667 -139666 -102625 -72307 -10233
16424a0233k620j9891K3449O2477p563q8401J657L0520j2481K5753Q878j8861
16412g316k13n1070R97N1670Q926l1374o538k3389p49L5465j3818j8211m9073
16399a04693J4625M4356J8694l7491l1477M0541K6812J5211J3136O484k0303j4212
16387b8317j3184K1514j1667j9787J5878N8970K1135k3481l3917K1196N571j8961
16375e050n8445J2844q268J1346K2199m347L6204K2678k5620o325k3021q832J9138
16362a5499M2155l0152J6720j2509n8849j6564K919O0278J7671n674J9688J8536
16350C8720j4406j6897k4114K7987m341j420p077L8031K7888K606m7335j8110
16338A532k888l1306m860J587r10n101N399R151J2123L0261K9358l1645j7662
$$ plain form
16424 -10233 -12853 -32744 -9295 53182 45619 -42782 -41125 -10605 -23086 2667 11545 -7316
16412 -7316 -7529 -58599 -57602 -5932 2994 -28380 -34918 -58307 -59056 -23591 -37409 -55620 -104693
16399 -104693 -90068 -45712 -27018 -64509 -95986 -55445 -28633 -13422 -286 6198 -14105 -28317
16387 -28317 -41501 -19987 -31654 -51441 -35563 23407 44542 21061 -12856 8340 13911 -5050
16375 -5050 -63495 -50651 -58919 -47573 -25374 -29721 6483 29161 3541 -2784 -25805 -34637 -15499
16362 -15499 26656 -3496 13224 715 -58134 -74698 -71779 -11501 6170 496 20184 38720
16350 38720 24314 7417 -16697 11290 6949 5529 -1548 36483 64371 66977 19642 1532
16338 1532 -1356 -32662 -37522 -35935 -36845 -41946 -36547 -27396 -15273 14988 44346 12701 -4961
16325d961j3744r10k394k1951O09K5888L7744n7987n4052R095L8601L8759L8846
16312C3543j8656m0769M0884L6304J188m2636k4991L682k329j4675K7649M1094
16300D0288p510k1154k5477r310J4245L0191j6501j3971j1336P721k2955J2123
16288b3646J0807k9857Q851J4715j7687K1157o767Q100r504l4673o61L6705n717
16275b8177K0044j5238Q422L9051O171k0499k4503k0881k1110K8914J8009L7474
16263B7677K6882J949j2961m2323j8525o414J6879N3052J5858m0716m793K4029
16251D0594K6759l4952J891R741m2894J4687L5013l9926k2703k2627k967J9781
16239a7603L5269k65J4446j4828j4450L522j9558l5940L8032J2151L6327J4083
$$ plain form
16325 -4961 -18705 -19615 -22009 -43960 -43351 -17463 20281 -37706 -91758 -82663 -44062 -5303 33543
16312 33543 14887 -25882 15002 51306 52494 9858 -15133 -11451 -13780 -28455 -806 40288
16300 40288 32778 11624 -13853 -23163 -8918 21273 4772 -9199 -20535 -12814 -35769 -23646
16288 -23646 -12839 -42696 -33845 -19130 -36817 -15660 -22427 -14327 -23831 -58504 -59165 -22460 -28177
16275 -28177 -8133 -23371 -14949 24102 30273 9774 -14729 -35610 -56720 -27806 -9797 27677
16263 27677 54559 56508 43547 1224 -17301 -23715 -6836 46216 62074 21358 16565 40594
16251 40594 67353 32401 34292 44033 1139 15826 50839 10913 -11790 -34417 -37384 -17603
16239 -17603 17666 17401 31847 17019 2569 6091 -13467 -49407 -11375 776 37103 51186
16227E1186j6805l6406n0643k9124N7933M0033k4855k5569r700j3915K1352l654
16215d0167q177j5544J9589k6679k0270M8962N0416J1761l2787L485J6801M120
16203A1510N574M216j6098Q253L6308j1469k5814P492k9770K1754K746l6626K1616
16190c08J6168Q295L7680l721o329m2030K66J5786J6686k4240k0565R685j2444
16177e071l9533k531R661j297K7730Q019j1669M5570P923k5981n0700m502M7715
16164E334J5897P849J2916J0438P610o1042n0861N991j5575K3702N0036k9248
16152a6953m5258m126L7169K5830J9019k2191n337j939l2143j4624L9922J1295
16140i336j4707l7812J0746J4609K1758O190L2196j90J3910O201l7562K0208J2601
$$ plain form
16227 51186 34381 -2025 -52668 -81792 -23859 16174 -8681 -34250 -43950 -57865 -36513 -40167
16215 -40167 -48344 -63888 -44299 -70978 -91248 -42286 8130 19891 -12896 -9411 7390 11510
16203 11510 17084 21300 5202 13455 49763 38294 12480 19972 -9798 11956 14702 -21924 -308
16190 -308 15860 24155 61835 58114 51785 9755 10021 25807 42493 18253 -2312 7373 -5071
16177 -5071 -44604 -47135 -37474 -38771 -11041 -3022 -14691 30879 38802 12821 -37879 -42381 5334
16164 5334 21231 29080 41996 52434 60044 -998 -51859 -45868 -61443 -37741 12295 -16953
16152 -16953 -62211 -66337 -29168 -3338 15681 -6510 -11847 -13786 -45929 -60553 -20631 -9336
16140 -9336 -24043 -61855 -51109 -36500 -14742 -8552 23644 23454 37364 43565 6003 26211 38812
16127C8812j2224K5961K1024k1662l2209K7362k2588m7973O167K0585O489r685
16115E9q585j10k7405k1464o370J0740m226J8878K6157K1841K0467m6009m8031
16102f4058R280K5841K3540K4965j353q139j3049k4119p651o803K641l185l2344
16089g4434O919q173M0359L8769m75J7920K3031n8147l6972J9051K4126l1348
16077c9374p534j901M005k959J1377K4126K0191n048n5878l1484L3750P665k5075
16064f8139J9729K8904L0001K2964O538m156J0876Q589j7345l2800J5021J6387
16052C6569l2724j999j1819l4072J9967L6177n281k3742k1680j8211J7016K2425
16040a7374L2618J3044k2009m4544k8003J1887K6756J4476J5966J2513K3152k0515
$$ plain form
16127 38812 26588 52549 73573 51911 19702 47064 24476 -23497 -17330 3255 9744 59
16115 59 -8526 -8636 -36041 -57505 -63875 -53135 -57361 -38483 -12326 9515 29982 -16027 -64058
16102 -64058 -54778 -28937 -5397 19568 18215 10076 -2973 -27092 -34743 -41546 -38905 -42090 -74434
16089 -74434 -67515 -75688 -35329 3440 2965 20885 43916 -14231 -51203 -32152 -8026 -39374
16077 -39374 -46908 -48809 -44804 -47763 -36386 -12260 7931 2883 -52995 -84479 -50729 -43064 -68139
16064 -68139 -48410 -19506 10495 33459 39997 35841 46717 55306 37961 5161 20182 36569
16052 36569 3845 1846 -9973 -44045 -24078 12099 6818 -16924 -38604 -56815 -39799 -17374
16040 -17374 15244 28288 6279 -38265 -66268 -54381 -27625 -13149 2817 15330 38482 17967
16028A7967j3250J1698l664L736q76n2935j2007J9701l9286K529L6998M1498K2882
16015C4991j1233j1380K864r555o898J1628K1193L818q540J2745q688m761N889
16002C2073j5563j0420k1616l9831J42K8324O172n7922K679L2021J1006L6439
15990C504N397l3381j7952k1372L5486L4486J6061L0784j7963j759l4705q520
15978i934j5486K2637J2035k316L1524k0171k3038j5900j1448R393j0890J5231
15966a8363K4137J4106m634j4097L237J586k3525j356J9339Q126O279R613J0047
15953C4495j0487K4037Q038k4293l446O952Q84L4195k3667r365n62K8449J1849
15940G7079j711Q469j9278k9292l1779r24M4005R519m4333M800N9246K9986l2813
$$ plain form
16028 17967 4717 16415 12751 16487 15611 -37324 -49331 -29630 -68916 -66387 -29389 12109 34991
16015 34991 23758 12378 15242 5687 -1211 10417 31610 35428 26888 39633 30945 26184 32073
16002 32073 16510 6090 -15526 -55357 -55215 -26891 -20719 -78641 -75962 -43941 -32935 3504
15990 3504 8901 -24480 -42432 -63804 -28318 6168 22229 53013 35050 33291 -1414 -9934
15978 -9934 -25420 -2783 9252 6936 38460 18289 -4749 -20649 -32097 -22704 -33594 -18363
15966 -18363 5774 19880 15246 1149 4386 5972 -17553 -18909 430 8556 14835 24448 34495
15953 34495 24008 48045 56083 31790 28344 35296 36180 70375 46708 37343 36781 65230 77079
15940 77079 75368 83837 64559 35267 3488 2564 46569 56088 11755 16555 75801 105787 72974
15927G2974k8819o0349k0497M615K0694K3685k8539n1713N98J1688j9330k2952
15915i7945N4199K1042q777k0349K8789j658j3336l2846L1112J4584Q699K3224
15903F738L4272q490j8794j5029j8885M3366N8420l5105j928M2520k6793r0539
15891c0247n623j8392J5812K2718j135Q976j6818k1683n4647N4144L7961j4745
15879b3679o0958m4536K6166J6057j1148L835N686N0733N5028N3252j9933k1180
15867B9323j6832m158l9077m027l796K7596k4966M995L9650R68j6346j3759m669
15854b5098M3184K4436n0029k6088j7262k4330P843L5643L355o3897p165K7391
15842g2017K4240K0315J5409j7400K1525M9050l8108m0112k5903l8889j4230M4159
$$ plain form
15927 72974 44155 -16194 -36691 -32076 -11382 12303 -16236 -67949 -67351 -55663 -74993 -97945
15915 -97945 -43746 -22704 -31481 -51830 -23041 -24699 -38035 -70881 -39769 -25185 -16486 6738
15903 6738 41010 32520 13726 -1303 -20188 23178 81598 46493 44565 87085 60292 -30247
15891 -30247 -35870 -54262 -38450 -15732 -16867 -7891 -24709 -46392 -101039 -46895 -8934 -23679
15879 -23679 -84637 -129173 -103007 -86950 -98098 -94263 -88577 -37844 17184 70436 50503 29323
15867 29323 12491 8333 -30744 -34771 -38567 -10971 -35937 -30942 8708 9676 -6670 -20429 -25098
15854 -25098 18086 42522 -7507 -33595 -50857 -75187 -67344 -31701 -28346 -92243 -99408 -72017
15842 -72017 -47777 -27462 -12053 -29453 -7928 41122 3014 -37098 -63001 -101890 -116120 -71961
15830g1961J2612Q68M1979J7618k5K39k259p220L83l544K273k3715r426L2712
15816i466J742j429P451j1472N7056j1706K1536k4475n0287k3475J8440j004j2074
15803c9163k8291L5356J3068m5008J0580O0878P2280r405J1288k6948j4895P955
15791D7695M86j2119k0054j5332K9823K3536l0430l7189J0842L8995j8810m6946
15779b9503J997L1394Q277Q806j4347l5350O721N388K1179J6223J9526l84l337
15766C6590j7975p07J0587j2482k6061l8505m6860l6281K4642K8015L0768O7412
15754A9143K8191K050k8119k1200r958o1967j2936k1588M6427L2917P983J8260
15742g97j4035l4894l202J3878o285n033J3903Lj3566K4488K4699J2473j3795
$$ plain form
15830 -71961 -59349 -58481 -16502 1116 1091 1330 -929 -8149 -7766 -11310 -9037 -32752 -42178 -9466
15816 -9466 -7724 -9153 -1702 -13174 43882 32176 53712 29237 -21050 -44525 -26085 -27089 -39163
15803 -39163 -67454 -32098 -19030 -64038 -53458 7420 79700 70295 81583 54635 39740 47695
15791 47695 48181 36062 16008 676 30499 54035 23605 -13584 -2742 36253 17443 -29503
15779 -29503 -27506 3888 12165 20971 6624 -28726 -22005 -16617 4562 20785 40311 39927 36590
15766 36590 18615 17908 28495 16013 -10048 -48553 -95413 -131694 -107052 -79037 -48269 19143
15754 19143 47334 49384 21265 65 -9893 -71860 -84796 -106384 -59957 -27040 -19057 -797
15742 -797 -14832 -49726 -52928 -39050 -45335 -50368 -36465 -36462 -50028 -25540 -841 11632 -2163
15729b163m8089J2962o583j7622M1720M4348Q519J9065J7562j9003J868n971l5456
15716A1157l3200J0923J1502P414o175P948N8732K9630j8799k8892n2013J441
15704c32L170r284L26l0261j6015K911K2810L4673R639o596o699K1695O096n8265
15690b6132l8135J2293K0648k771N005j6481m1772O286K4271k0337J760Q971L8010
15677b8384k8423J4585K9651L111p547K0481k214j4297J7024N703j6348j6092
15665b2750l111L6659J7400l5405m2805l3363L4983K2465K5927J4911q451K1561
15653B8021m2087m4003j2931J5884l15k299k881P0276L384P0j7559n560m349K430
15639a1919J1575j53J6351j6696l6412K2633L9193J3305P449K121l0831n7962
$$ plain form
15729 -2163 -50252 -37290 -43873 -61495 -19775 24573 33092 52157 69719 50716 52584 46613 11157
15716 11157 -22043 -11120 382 7796 1621 9569 68301 97931 79132 50240 -1773 -332
15704 -332 2838 -6446 -6120 -36381 -52396 -49485 -26675 7998 17637 11041 4342 26037 32133 -26132
15690 -26132 -64267 -51974 -31326 -34097 -29092 -45573 -87345 -81059 -56788 -77125 -75365 -66394 -28384
15677 -28384 -56807 -42222 -12571 -9460 -17007 3474 1260 -13037 3987 9690 -6658 -22750
15665 -22750 -25861 10798 28198 -7207 -50012 -83375 -48392 -25927 0 14911 6460 28021
15653 28021 -14066 -58069 -71000 -55116 -55431 -57730 -60611 9665 13049 13119 -4440 -10000 -14349 -11919
15639 -11919 -344 -497 15854 -842 -37254 -14621 24572 37877 45326 47447 16616 -41346
15627d1346j1251K6277j0356o231J4275N4188j9492P926K0246n728M104l6838
15615d226k2776J0898J5970L8798K2002l6247k5724j3250j4101Q346N971k8636
15603d2975k1211K8864N1741l0682l9520K8727K2636K3790j8011j1096M948K2000
15591A9211j1259M59k2549K1796q410J4272j6417j5033K8875m3328j5904K2784
15579b5503M2742j3990k0862R95J0693J4006K7805J6179R39j3093o5036j2330
15567c7455J4726K7859k9762J6032Q6168J6995m0022m5011J4655J714k2538p765
15555d404k6249l1221j8323J9362K8950k614K4546K4839j7153K4942M0197M171
15543F7043l0692j7798j7013J6154K0798N103l0481j1548j3425l349j4419J4094
$$ plain form
15627 -41346 -52597 -26320 -36676 -42907 -28632 25556 6064 13990 34236 28508 32612 -4226
15615 -4226 -27002 -16104 -134 38664 60666 24419 -1305 -14555 -28656 -20310 -14339 -42975
15603 -42975 -64186 -35322 16419 -14263 -53783 -25056 -2420 21370 3359 -7737 -2789 19211
15591 19211 7952 8411 -14138 7658 -752 13520 -2897 -17930 10945 -32383 -48287 -25503
15579 -25503 17239 3249 -17613 -16618 -5925 8081 35886 52065 53004 39911 -25125 -37455
15567 -37455 -22729 5130 -24632 -8600 77568 94563 54541 9530 24185 25899 3361 -4404
15555 -4404 -30653 -61874 -80197 -60835 -31885 -34499 -9953 14886 -2267 22675 62872 67043
15543 67043 36351 18553 1540 17694 38492 43595 13114 1566 -11859 -15208 -29627 -15533
15531a5533L4340m259k6830J4061Q43j843K8181J5352q701j7230k6434m038k6952
15518c9043J3289J744J6837K2083q93J6600j6643L561j6546k6153K9157Q573o32
15505A1934K2296K5753k0338K701L5154M1214n7019j70L8087K343l9637k6523
15493C5795j111j822J4402j0196P974L404m0189j9648P539j8250M290K3513M0967
15480D6668j0255n887k15k936M453J2556L625K1357K0270l2826l2369j5878j4836
15467f273L1652n625j5100J1279r027j405J5440l9974j7867n127K2767N209m4842
15454e8893k1838L6349O0955K1216R080m965j2870L9875K4732L801j8871j8425
15442F0146j9934m2486m4817j6595M2239j6274j892J613m4174M252K3343P253
$$ plain form
15531 -15533 18807 14548 -12282 1779 2622 779 28960 44312 35611 18381 -8053 -12091 -39043
15518 -39043 -25754 -24010 -7173 14910 14017 30617 13974 17535 989 -25164 3993 12566 11934
15505 11934 34230 59983 39645 42346 77500 118714 61695 61525 99612 101955 62318 35795
15493 35795 34684 32862 47264 37068 45042 48446 8257 -11391 -3852 -22102 -17812 5701 46668
15480 46668 36413 30526 30311 27375 31828 44384 48009 69366 89636 56810 24441 8563 -6273
15467 -6273 25379 19754 4654 15933 6906 5501 20941 -19033 -36900 -42027 -19260 -14051 -58893
15454 -58893 -80731 -44382 16573 37789 46869 41904 29034 68909 93641 97442 78571 60146
15442 60146 40212 -2274 -47091 -63686 -21447 -37721 -39613 -38000 -82174 -77922 -54579 -47326
15430d7326p227K530l469J6423M4299K6603K8276J161m7372j5427r541k4141k6632
15417f1843K3263Q655L6966L449J5202J5615l2701k1801O1599K29j0044k8085
15405A0504L399j5001J3046J9465k3039l2391j374J3665J2583j979P115Q143j3478
15392F58P972r447n0098m6734J9781J9283P2372K6830j2795k029J5770l6261n3498
15379d8196j5404L0145N2528q967j3811J1953j4006K114J0351Q470K5119J0550
15367E0846m1126k4480M542r525j6224K680j2943J3445K2750j1288J753K0806
15355A236J5795J1225M683j8165j4976j0268P130k6297K1938M3300N0157j115
15343H4643m8437k178m3295J3657L8698J7095m5178K9329o519k1440M602m0760
$$ plain form
15430 -47326 -54553 -52023 -55492 -39069 5230 31833 60109 61270 13898 -1529 -11070 -35211 -61843
15417 -61843 -38580 -29925 7041 10490 25692 41307 8606 -13195 48404 48633 38589 10504
15405 10504 13903 -1098 11948 31413 8374 -24017 -25391 -11726 857 -1122 5993 14136 658
15392 658 8630 -817 -50915 -97649 -77868 -58585 13787 40617 27822 25793 41563 5302 -48196
15379 -48196 -63600 -33455 19073 10106 -3705 8248 -5758 -3644 6707 15177 40296 50846
15367 50846 9720 -14760 -10218 -19743 -35967 -33287 -46230 -32785 -10035 -21323 -19570 1236
15355 1236 17031 28256 32939 14774 -202 -10470 -3340 -29637 -7699 35601 85758 84643
15343 84643 36206 34028 -9267 4390 43088 60183 15005 44334 37815 16375 20977 -19783
15331a9783j4369K5782J2523L1705l8153r248l561m942o043L2687L5629k2250
15319A9977j6584P712P298N3400k4479n5610n6438N702Q315L3130N9252M1011
15307H2686K191j7281j7608m0463j5620m426n283K171k511O915M3445p328k009
15294B4879R163K9440k7396k9637j557m782r926k321p942R338K1577L996k9492
15281a4660j2378R420N445L1624K8471k1304n3131j4863j94K8388K4239J5417
15269B6474k2241r941J6827o332j6972J3773j0961k9160J4768J4362L5473m562
15257B1508J7219m350l2844K7310K2382j2626r173q884j9808l1444j2033k3103
15245f5846Q830K5975K7240k6755m0251o263L4841M0642K363k0833k1188L8636
$$ plain form
15331 -19783 -34152 -8370 4153 35858 -2295 -11543 -15104 -20046 -26089 6598 42227 19977
15319 19977 3393 11105 18403 71803 47324 -8286 -64724 -59022 -50707 -17577 41675 82686
15307 82686 84877 67596 49988 9525 -6095 -10521 -15804 -13633 -16144 -9229 34216 26888 24879
15294 24879 34042 63482 36086 6449 4892 110 -9816 -12137 -20079 -10741 10836 14832 -14660
15281 -14660 -27038 -17618 -12173 19451 47922 26618 -26513 -41376 -41570 -13182 11057 26474
15269 26474 4233 -5708 11119 4787 -12185 1588 -9373 -38533 -23765 -9403 26070 21508
15257 21508 38727 34377 1533 28843 51225 38599 29426 20542 734 -30710 -42743 -65846
15245 -65846 -57016 -31041 -3801 -30556 -70807 -77070 -42229 -1587 776 -20057 -41245 -2609
15233b609l008J9742K4343n260L977p647q725J924p317q141K0221J2452m0690
15220g38K4444Q434n611l7128m5653L8223N6428L3022k344l2479q791l2595r860
15207a4648J8829R987j8765j8099J3843k4146l5092J323M8650J7186k6576M599
15195b2909r386l2144J7857K5479K0147O563M5650P388r437p950K5407j8743r921
15182C8001O764j9242K2616l4591k3559r085j715J2417J8728Q169k8640m199K3965
15169I629J5367k0586m764l2658J7158K2035Q653l2808l545N1128J0324m49p684
15156C1800L7160K334m3804m656P421L2200J4003r2576k7294K0837P80K2943R484
15143A0632p2518j8468M5497K3681K6940L4016J3624p997n7501q40K6603M075
$$ plain form
15233 -2609 -5617 14125 38468 33208 37185 29538 20813 22737 15420 7279 27500 39952 -738
15220 -738 23706 32140 26529 -10599 -56252 -18029 38399 71421 69077 36598 27807 -4788 -14648
15207 -14648 4181 14168 -4597 -22696 -8853 -32999 -68091 -66768 -18118 -932 -27508 -22909
15195 -22909 -32295 -64439 -46582 -21103 -956 5607 51257 58645 49208 41258 66665 47922 38001
15182 38001 44765 25523 48139 13548 -10011 -19096 -20811 -8394 10334 18503 -10137 -14336 9629
15169 9629 24996 4410 -354 -33012 -15854 6181 14834 -17974 -21519 29609 39933 39484 31800
15156 31800 68960 71294 27490 22834 30255 62455 76458 -16118 -43412 -22575 -21795 1148 10632
15143 10632 -61886 -80354 -34857 -11176 15764 49780 63404 55407 -2094 -2934 23669 27744
15131B7744m3973q041L6007K63p211p02J3697j7727j411j7495k1365n077J0765
15118c4526J5013K6631n788l5292O218M3954k6666J9387K0988K0627l7180j9980
15106f614j0972J2327K860J7760j2484L775L0274j949p79k1272o234n986P349
15093H055L5440m4281o8508K3733P611l3346m6372j1647M7159P2165P0050j1812
15081D8247k4923k1731K0873J5188R329m925J0507k1245m9263l1612K4612J5818
15069i125L5115J0772l0091r861j2894K864J9901J741l8414N0320P6106l087o3690
15056B9657k1851M6640K928p573j764o907K0900N129m9691j8778M3241K6123m8019
15043B0035o7378k8845K4806l501K5263K0648m6671L536O01M42L3783M0621K9136
$$ plain form
15131 27744 -16229 -24270 11737 12000 4789 4087 17784 57 -1354 -18849 -40214 -45291 -34526
15118 -34526 -19513 7118 1330 -33962 -27744 16210 -10456 8931 29919 50546 13366 -6614
15106 -6614 -17586 -5259 -2399 15361 2877 6652 36926 34977 34198 12926 6692 706 8055
15093 8055 43495 -786 -69294 -45561 -37950 -71296 -117668 -129315 -82156 -9991 60059 48247
15081 48247 23324 1593 22466 37654 46983 42058 52565 31320 -17943 -49555 -24943 -9125
15069 -9125 25990 36762 6671 -3190 -16084 -13220 6681 8422 -29992 20328 96434 93347 29657
15056 29657 7806 54446 57374 49801 48037 41130 62030 67159 17468 -1310 41931 68054 20035
15043 20035 -47343 -76188 -51382 -54883 -29620 -8972 -55643 -52107 -51506 -51064 -17281 23340 52476
15030E2476p575k1376q958K6677l8064k7315L7092L3874k7837k2424J520j0695
15018a2605j2033j0343J7342L414l367L6310O567k5914j871j431L5955J1178J1025
15005E4227J5646N5713L3341P9472J20204J00795M2523p0843j16865r3611n7575
14994A63027q4458k3142j0633k92Q983m9441m8967j8289K3105M8490l201k5167
14982a9985L1390M0303k0855l3621J8675p860J5145l1298k1125J2096m6053J3501
14970d9687L6915J2440K2421N2937n923j2969j9184n657l9964j1162K9425j3941
14958d349k6779M0475R031j0879j1149k5832M705L8700j4108l2348J2672q852
14946b8713K5547P567L258j3295j3364K7919j7945Q159J5453m0249l3717J1538
$$ plain form
15030 52476 44901 23525 14567 41244 3180 -24135 12957 46831 18994 -3430 -1910 -12605
15018 -12605 -24638 -34981 -17639 -14225 -17592 18718 25285 -629 -2500 -3931 32024 43202 54227
15005 54227 69873 125586 158927 238399 358603 459398 501921 431078 314213 220602 163027
14994 163027 78569 55427 44794 44502 53485 4044 -44923 -63212 -40107 8383 5182 -19985
14982 -19985 11405 51708 30853 -2768 15907 8047 23192 -8106 -29231 -17135 -63188 -49687
14970 -49687 -12772 -332 22089 75026 69103 56134 36950 31293 -8671 -19833 9592 -4349
14958 -4349 -31128 9347 18378 7499 -3650 -29482 -24777 13923 -185 -32533 -19861 -28713
14946 -28713 -3166 4401 7659 -5636 -19000 8919 -9026 -867 14586 -25663 -59380 -47842
14934d7842J5268J4656l548k2660J9483K4124j2758L8237J2540J0320j8876m2682
14922a3738m216N032L3953q000K5626m098p578p58r197k5017L3740J6801p940
14909C4610k7729j71J5147K956r891j2991M45L2038R217K5308l6553j1655J0486
14896C1217P977L0382m4624j0274j9305l645q779N621Q756J0654K4031R860m0595
14883A276l6461k1207L3362j4246l4543j075m544K1531M9385K4974j531K6947
$$ plain form
14934 -47842 -32574 -17918 -21466 -44126 -24643 -519 -13277 24960 37500 47820 28944 -13738
14922 -13738 -17954 -12922 21031 13031 38657 34559 26981 26223 17026 -7991 25749 42550 34610
14909 34610 6881 6710 21857 24813 14922 1931 2376 34414 43631 68939 32386 20731 31217
14896 31217 39194 69576 24952 14678 -4627 -8272 -17051 -11430 -2674 7980 32011 41871 1276
14883 1276 -35185 -56392 -23030 -37276 -71819 -72894 -77438 -55907 -6522 18452 16921 43868
$$ [...]
##END NTUPLES=NMR SPECTRUM
##END=
