##TITLE=Analysis number 329382
Compound Code cc 69604
Book Reference 486/196
Project Code adrs
Chemist Name simons
##JCAMPDX= 6.0         $$ Bruker NMR JCAMP-DX V2.0
##DATA TYPE= NMR SPECTRUM
##DATA CLASS= NTUPLES
##ORIGIN= Bruker BioSpin GmbH
##OWNER= nmr
$$ XWIN-NMR		Version 3.5
$$ Fri Aug 24 10:28:31 2007 GMT Daylight Time (UT+1h)  MAYBRIDGE\nmr@NMR_250MHZ
##.OBSERVE FREQUENCY= 250.131544655141
##.OBSERVE NUCLEUS= ^1H
##.ACQUISITION MODE= SIMULTANEOUS (DQD)
##.ACQUISITION SCHEME= undefined
##.AVERAGES= 16
##.DIGITISER RES= 18
##SPECTROMETER/DATA SYSTEM= dpx250
##.PULSE SEQUENCE= zg30
##.SOLVENT NAME= DMSO
##.SHIFT REFERENCE= (INTERNAL, DMSO, 0, 16.5711)
##AUDIT TRAIL= $$ (NUMBER, WHEN, WHO, WHERE, WHAT)
$$ ##TITLE= Audit trail, XWIN-NMR		Version 3.5
$$ ##JCAMPDX= 5.01
$$ ##ORIGIN= Bruker BioSpin GmbH
$$ ##OWNER= nmr
$$ C:\u/data/dgb/nmr/ADRS/1100/pdata/1/auditp.txt
$$ ##AUDIT TRAIL=  $$ (NUMBER, WHEN, WHO, WHERE, WHAT)
(   1,<2007-08-24 10:27:00.57 +100>,<MAYBRIDGE\nmr>,<NMR_250MHZ>,
      <created by zg, POWCHK disabled, PULCHK disabled
       configuration hash MD5:
       76 6E 9A 78 1E 09 19 81 EC 84 63 8F B0 6A 59 2D
       data hash MD5: 64K
       D3 EF A6 A4 BD 9D 59 70 96 E9 0C DE 7C A2 7A EE>)
(   2,<2007-08-24 10:27:34.85 +100>,<MAYBRIDGE\nmr>,<NMR_250MHZ>,
      <Start of raw data processing
       ef LB = 0.3 FT_mod = 6 PKNL = 1 SI = 32K 
       data hash MD5: 32K
       98 8B E5 A8 29 F5 8A A8 B5 F0 E2 D9 6E 46 2E EF>)
(   3,<2007-08-24 10:27:40.29 +100>,<MAYBRIDGE\nmr>,<NMR_250MHZ>,
      <apk 
       data hash MD5: 32K
       F8 BE DB 1E C5 D0 A2 76 2D F1 6C 21 44 48 EA 14>)
(   4,<2007-08-24 10:27:44.96 +100>,<MAYBRIDGE\nmr>,<NMR_250MHZ>,
      <abs ABSG = 5 
       data hash MD5: 32K
       60 55 01 61 D0 33 C6 B8 C3 B0 05 35 26 B9 FA 13>)
$$ ##END=
$$ 
$$ hash MD5
$$ 4C DE 16 F5 85 21 D2 B9 72 11 0C 38 1F 69 66 42
##$RELAX= 
##$RELAX= 
##$RELAX= 
##$RELAX= 
##$RELAX= 
##$RELAX= 
##$RELAX= 
$$ Bruker specific parameters
$$ --------------------------
##$DU= <C:\u>
##$EXPNO= 1100
##$NAME= <ADRS>
##$PROCNO= 1
##$TYPE= <nmr>
##$USER= <dgb>
##$AMP= (0..31)
100 100 100 100 100 100 100 100 100 100 100 100 100 100 100 100 100 100 
100 100 100 100 100 100 100 100 100 100 100 100 100 100 
##$AQSEQ= 0
##$AQ_mod= 3
##$AUNM= <au_zg>
##$AUTOPOS= <47 >
##$BF1= 250.13
##$BF2= 250.13
##$BF3= 250.13
##$BF4= 250.13
##$BF5= 500.13
##$BF6= 500.13
##$BF7= 500.13
##$BF8= 500.13
##$BYTORDA= 1
##$CFDGTYP= 0
##$CFRGTYP= 5
##$CHEMSTR= <none>
##$CNST= (0..31)
1 1 145 1 1 1 1 1 1 1 1 1 1 1 1 1 1 1 1 1 1 1 1 1 1 1 1 1 1 1 1 1 
##$CPDPRG= <>
##$CPDPRG1= <>
##$CPDPRG2= <>
##$CPDPRG3= <>
##$CPDPRG4= <mlev>
##$CPDPRG5= <mlev>
##$CPDPRG6= <mlev>
##$CPDPRG7= <mlev>
##$CPDPRG8= <mlev>
##$CPDPRGB= <>
##$CPDPRGT= <>
##$D= (0..31)
0 1 0 0 0 0 0 0 0 0.06 0 0 0 0 0 0 0.0002 0 0 0 0 0 0 0 0 0 0 0 0 0 0 
0 
##$DATE= 1187947614
##$DBL= (0..7)
120 120 120 120 120 120 120 120 
##$DBP= (0..7)
150 150 150 150 150 150 150 150 
##$DBP07= 0
##$DBPNAM0= <>
##$DBPNAM1= <>
$$ [...]
##$SUBNAM7= <"">
##$SUBNAM8= <"">
##$SUBNAM9= <"">
##$SW= 20.6930455092707
##$SWIBOX= (0..15)
0 0 3 0 0 0 0 0 0 0 0 0 0 0 0 0 
##$SW_h= 5175.983436853
##$TD= 65536
##$TD0= 1
##$TE= 296.16
##$TE2= 300
##$TE3= 300
##$TEG= 300
##$TL= (0..7)
0 120 120 120 120 120 120 120 
##$TP= (0..7)
150 150 150 150 150 150 150 150 
##$TP07= 0
##$TPNAME0= <>
##$TPNAME1= <>
##$TPNAME2= <>
##$TPNAME3= <>
##$TPNAME4= <>
##$TPNAME5= <>
##$TPNAME6= <>
##$TPNAME7= <>
##$TPOAL= (0..7)
0.5 0.5 0.5 0.5 0.5 0.5 0.5 0.5 
##$TPOFFS= (0..7)
0 0 0 0 0 0 0 0 
##$TUNHIN= 0
##$TUNHOUT= 0
##$TUNXOUT= 0
##$USERA1= <user>
##$USERA2= <user>
##$USERA3= <user>
##$USERA4= <user>
##$USERA5= <user>
##$V9= 5
##$VALIST= <valist>
##$VCLIST= <CCCCCCCCCCCCCCC>
##$VD= 0
##$VDLIST= <DDDDDDDDDDDDDDD>
##$VPLIST= <PPPPPPPPPPPPPPP>
##$VTLIST= <TTTTTTTTTTTTTTT>
##$WBST= 1024
##$WBSW= 4
##$XGAIN= (0..3)
0 0 0 0 
##$XL= 0
##$YL= 0
##$YMAX_a= 299220
##$YMIN_a= -287774
##$ZGOPTNS= <>
##$ZL1= 120
##$ZL2= 120
##$ZL3= 120
##$ZL4= 120
##$ABSF1= 16.57113
##$ABSF2= -4.122044
##$ABSG= 5
##$ABSL= 3
##$ALPHA= 0
##$AQORDER= 0
##$ASSFAC= 0
##$ASSFACI= 0
##$ASSFACX= 0
##$ASSWID= 0
##$AUNMP= <proc_1d>
##$AZFE= 0.1
##$AZFW= 0.1
##$BCFW= 0
##$BC_mod= 0
##$BYTORDP= 0
##$COROFFS= 0
##$CY= 12.5
##$DATMOD= 1
##$DC= 0
##$DFILT= <>
##$DTYPP= 0
##$F1P= 14.0000005364418
##$F2P= -0.99999901652339
##$FCOR= 0.5
##$FTSIZE= 32768
##$FT_mod= 6
##$GAMMA= 0
##$GB= 0
##$INTBC= 1
##$INTSCL= 1
##$ISEN= 128
##$LB= 0.3
##$LEV0= 0
##$LPBIN= 0
##$MAXI= 10000
##$MC2= 0
##$MEAN= 0
##$ME_mod= 0
##$MI= 0
##$NCOEF= 0
##$NC_proc= -4
##$NLEV= 6
##$NOISF1= 0
##$NOISF2= 0
##$NSP= 0
##$NTH_PI= 0
##$NZP= 0
##$OFFSET= 16.57113
##$PC= 1
##$PHC0= -51.50608
##$PHC1= 0.3310845
##$PH_mod= 1
##$PKNL= yes
##$PPARMOD= 0
##$PSCAL= 4
##$PSIGN= 0
##$REVERSE= no
##$SF= 250.129987709514
##$SI= 32768
##$SIGF1= 0
##$SIGF2= 0
##$SINO= 400
##$SIOLD= 32768
##$SREGLST= <1H.DMSO>
##$SSB= 0
##$STSI= 32768
##$STSR= 0
##$SW_p= 5175.98343685301
##$SYMM= 0
##$S_DEV= 0
##$TDeff= 65536
##$TDoff= 0
##$TI= <Analysis number 999999
Compound Code 99
Book Reference 9
Project Code 9>
##$TILT= no
##$TM1= 0
##$TM2= 0
##$TOPLEV= 0
##$USERP1= <user>
##$USERP2= <user>
##$USERP3= <user>
##$USERP4= <user>
##$USERP5= <user>
##$WDW= 1
##$XDIM= 32768
##$YMAX_p= 428859435
##$YMIN_p= -287030
$$ End of Bruker specific parameters
$$ ---------------------------------
##NTUPLES= NMR SPECTRUM
##VAR_NAME=  FREQUENCY,     SPECTRUM/REAL,   SPECTRUM/IMAG
##SYMBOL=    X,             R,               I
##VAR_TYPE=  INDEPENDENT,   DEPENDENT,       DEPENDENT
##VAR_FORM=  AFFN,          ASDF,            ASDF
##VAR_DIM=   32768,         32768,           32768
##UNITS=     HZ,            ARBITRARY UNITS, ARBITRARY UNITS
##FACTOR=    0.157963299565203, 1,           1
##FIRST=     4144.93673147145, 0,            0
##LAST=      -1031.04670538156, 0,           0
##MIN=       -1031.04670538156, -287030,     0
##MAX=       4144.93673147145, 428859435,    0
$$ Real data points
##PAGE= N=1
##DATA TABLE= (X++(R..R)), XYDATA
$$ [...]
17614a7218M9688o278k4909J9154k0887o2081j7248J2223P855o081k2727P362
17602h1147M0049M4259Q622r6111l6468L5658Q1755J6350N6170j4161p0676j7972
17590c3672j3340M2800L494N4010J8869p4196m8023K5206k1205o3083Q191L8022
17578f2927J8145K2832J508P2047O720J6380J8401p0961m1305r159j4079O9050
17566B6652N2254m6908J96L6988k0410k1902j9070L0254P353K1819j0555m8018
17554H653r350K5528l7646l4412L3077J0487j9794J194J7081n312k0577M1721
17542A0650P313k186L643j7178j2078k2539r384N7678N229K6650j4134j5452Q662
17529B6874q45q3786K1948j9783O8121L1707j7383l6283L2165L3844j2076k0973
$$ y = [-17218, 32470, 26192, 1283, 20437, -450, -62531, -79779, -67556, -59701, -65782, -88509, -81147, -41098, 3161, 11783, -84328, -120796, -85138, -3383, 12967, 69137, 54976, -15700, -33672, -47012, -4212, -718, 53292, 72161, -2035, -50058, -24852, -46057, -109140, -100949, -62927, -44782, -21950, -20442, 51605, 58325, 74705, 93106, 22145, -19160, -28319, -42398, 26652, 78906, 31998, 32194, 69182, 48772, 26870, 7800, 38054, 45407, 67226, 56671, 8653, -697, 24831, -12815, -47227, -14150, -3663, -23457, -22263, -5182, -10494, -31071, 10650, 17963, 15777, 19420, 2242, -9836, -32375, -41759, 15919, 21148, 47798, 33664, 18212, 26874, 26029, -57757, -35809, -55592, 12529, 44236, 26853, -9430, 22735, 56579, 44503, 23530]
17517B3530l1837M9035K8039j6001o0159j9599J2752j061P681j43099l9523O9953
17505a20289L9103l87K176K0393K9735K8009K2676Q1949k0246J7543J3648j4473
17493I9837l3005q7581j9161j6516l154N9935N1095P891L5691o4299m1406l7762
17481d8435q037P7528K8520L135p111J5890l7390j0212l292J8205j4776J0766
17469B4791K6109K4805J5177m3991p0838N790K6774M1929j0102l0380k8490L6855
17457A8429N8619j0757p5479j3727J0505o0640m0087K9406J8033J0013K5226k16
17445c0675J0060n478L4278r160p767K6521N8033R388k0339o1587j0996P3035
17433F5313Q8770P6683m4062j0029p0563r4456m1660K8363J3480J5247J784j5189
$$ y = [23530, -8307, 40728, 68767, 52766, -7393, -26992, -14240, -15301, -7620, -150719, -190242, -120289, -81186, -81573, -79397, -59004, -29269, -1260, 21416, 103365, 83119, 100662, 114310, 99837, 66832, -20749, -39910, -56426, -59580, 355, 51450, 59341, 95032, 30733, -10673, -48435, -56472, 21056, 49576, 52711, 45600, 61490, 24100, 13888, 10596, 28801, 14025, 24791, 50900, 75705, 90882, 46891, -23947, -18157, 8617, 50546, 40444, 10064, -18426, 18429, 77048, 66291, -9188, -22915, -12410, -73050, -113137, -83731, -65698, -55685, -30459, -30675, -20615, -26093, 8185, -975, -8742, 17779, 75812, 85200, 64861, 3274, -7722, 65313, 154083, 230766, 186704, 176675, 106112, 11656, -30004, -1641, 11839, 27086, 28870, 13681]
17421A3681J4017j444q747r317m63j224r965j3216k8765j5793k191M932K9616
17408b8879J7770J1531R9092K4909n2410r4475J5538L6351J1495m2022m0724K0552
17396b1272J8499J8027P274M1059k7649p6313m1709k8494J463N2560N1111l061
17384h505k3576J4893J197k4255J2809M6982K7780J27n9052q0579N0363M0123
17372a693M6284o476k0602k2649R252l7262K2434J1428j5497O2005R238q322P290
17359E5430k4947m6128k7117m874m473L6183n298R699R428k8330o0663M1526K7631
17346b1933L3874M6814l4042j4428N1070J2420P319k7654K7488l3526O778K5946
17334H0126R189l1123k541n4193p6581l7741L6015O7416J5063k0869J8188O571
$$ y = [13681, 27698, 26254, 17507, 8190, 7727, 6503, -3462, -16678, -45443, -61236, -63427, -58495, -28879, -11109, 422, 99514, 124423, 72013, -22462, -6924, 29427, 40922, -1100, -41824, -21272, -2773, 15254, 22528, 63587, 35938, -40375, -82084, -110578, -109115, -56555, -5444, -8505, -32081, -17188, -15991, -40246, -27437, 19545, 47325, 47452, -11600, -92179, -41816, -1693, 44591, 38115, 17513, -5136, 4116, -33146, -10712, 716, -14781, 47224, 56462, 48140, 55430, 30483, -15645, -42762, -47636, -52109, -15926, -21224, -11525, -2097, -30427, -91090, -49564, -21933, 11941, 58755, 24713, 10285, 61355, 73775, 81094, 53440, 80928, 47402, 54180, 80126, 89315, 58192, 55651, 1458, -75123, -112864, -76849, -9433, 5630, -15239, 2949, 9520]
17322I520p1365k7972J5246J8171n0888P699j25J2010R0124M2221M0472p349k3838
17309E3926j1654O3133N2026n3511o8860m2416j2091Q586O1597R1577j2539p2271
17297E7503n0723J369L3720k3022j1682N00m9966m7997l1180N1768P4011j5819
17285a1518o0367J4077K2523k6340n1865j6818M7061M0945K0850m0754L4735n729
17273c3200o1003j5493O7796M4666n9022m3593K0772Q8023Q0565n0997P605l5536
17261A0583m5140r93K6843N867o7057K350n906K6626K3811K2468L476j088L204
17248E044L4562j0357o1801o5040M7733j0520j8269O0042J01516p230l0083n371
17236D0226q843L6576O926o0408k0947j6503k547j3508k6487O062M5876N0458
$$ y = [9520, -61845, -89817, -74571, -56400, -107288, -99589, -99714, -87704, 2420, 44641, 85113, 77764, 53926, 42272, 105405, 157431, 103920, 35060, -7356, -19447, -10861, 50736, 142313, 129774, 57503, 6780, 8149, 41869, 18847, 7165, 7665, -42301, -90298, -121478, -69710, 4301, -11518, -71885, -57808, -35285, -61625, -113490, -130308, -83247, -42302, -21452, -62206, -27471, -33200, -94203, -109696, -41900, 2766, -56256, -99849, -79077, 8946, 89511, 38514, 46119, 10583, -34557, -35550, -8707, -2840, -69897, -67547, -73453, -46827, -23016, -548, 2928, 1840, 5044, 39606, 29249, -32552, -97592, -49859, -60379, -78648, -18606, 82910, 75680, 45597, 40226, 31383, 67959, 74885, 14477, -6470, -22973, -25520, -39028, -65515, -59453, -13577, 36881]
17224C6881K5025J8150P107k9875p2226n4262O888L7795L1375K3336n4319q7702
17212a11827j0133K6339p672M4258k9494J0406J8107R7418P2440k3532n6290j7670
17200A2350k6771m5783Q2971P028m0334l2774l7782J4042J9461r952j1790L9806
17188b9528N1626L9443J6925k9998l3458J4194J6766k5659m6399J1648k2903k6034
17176f3377o099k1898K0972N733L0545M8347J4681J7813r731m8608k5241N967
17164c0896J0470M1340L7055O3136P6475r6341n2326L6882K5499O960l4563n6561
17152B7130O0166l3193P417j1436L4266k4161l669M2935o4150m0563q193J8559
17140E108N1283l4633o5419J7392L4504k7489J461L0236q5111j11167L4550J04614
$$ y = [36881, 61906, 80056, 87163, 57288, -14938, -69200, -62312, -24517, 6858, 30194, -24125, -111827, -121960, -95621, -103293, -59035, -88529, -78123, -60016, 37402, 109842, 86310, 30020, 12350, -14421, -60204, 22767, 29795, -10539, -43313, -81095, -67053, -47592, -57544, -69334, -29528, 22098, 61541, 78466, 48468, 15010, 29204, 45970, 20311, -26088, -14440, -37343, -63377, -69476, -91374, -70402, -64669, -34124, 14223, 28904, 46717, 36986, -11622, -36863, -30896, -20426, 20914, 57969, 121105, 197580, 101239, 48913, 85795, 111294, 118254, 83691, 27130, 87296, 54103, 61520, 50084, 84350, 60189, 56520, 99455, 35305, -5258, -13451, 5108, 56391, 21758, -43661, -26269, 8235, -19254, -17793, 12443, -72668, -183835, -149285, -44671]
17128d4671K6414p0471k4951J5433L5823O6806p5977j208K8131n977j6457K2572
17116d4533p680l4490q762L5615L4650K2556K8490k476j8336p6514p695N6253
17104b2922O865N2246M7311J1453n3849l3130m0082L272k6494K0214k590j9523
17092e7229j8793K2947j4461j3616K0123Q1070L175o2417l0279k1881J3935R079
17080f8347N7999j6058K8978M4760L1949p639m3626l4555n4034K3993l2765k4948
17068i4293J6601J8464J6134J5022K1745m0532m975n765K6878N8406k9997k2883
17056b5195k7232p151j1011J5531m0796R046j1061J3120Q657j5826m9465m4642
17044a86025l605L5417M6660O2103K2228m986k5796L6132N0642n3755k1920l6139
$$ y = [-44671, -18257, -88728, -113679, -98246, -62423, 4383, -71594, -72802, -44671, -50648, -67105, -44533, -52213, -86703, -95465, -59850, -25200, -2644, 25846, 23370, 5034, -71480, -79175, -22922, -16057, 36189, 83500, 94953, 41104, 7974, -32108, -28836, -55330, -35116, -37706, -57229, -76022, -53075, -67536, -81152, -61029, 20041, 23216, -39201, -69480, -91361, -77426, -68347, -10348, -26406, 2572, 47332, 79281, 71642, 28016, -6539, -60573, -36580, -69345, -94293, -77692, -59228, -43094, -28072, -6327, -46859, -51834, -57599, -30721, 27685, -2312, -25195, -52427, -59578, -70589, -55058, -95854, -86808, -97869, -84749, -76092, -91918, -141383, -186025, -189630, -154213, -107553, -45450, -23222, -28208, -54004, -17872, 32770, -20985, -42905, -79044]
17032g9044j376M2878K2980J7518K8197O5553K827m2701p595J8377m922j2415
17020E0277M1766Q2m3320p2831l8263L459m917m4828r793J1619p354M3940j5153
17007h5316m1357j4687N711K5639N1423M9202m037M2123j679K485j8655M8771
16995E9623j6410m2173L9891K6806m1187m1114m9329k1991L8187l74L7256n88
16983a1403l836K6228k2419n0914m4143l002M4462L4858j9435J2495K0132J674
16971a5303J2991m9256L8659k402p386P0556J175l3427m8098k529K2475r760j696
16958b4001l7478k2229K2311K3952j9910k1290k8069L4842R0369J7600o4080m8734
16946g6717N7899K3543k7619J4958K0278j7553M345j1810J308N1235M9054l2042
$$ y = [-79044, -80420, -37542, -14562, 2956, 31153, 96706, 99533, 56832, 49237, 67614, 62692, 50277, 92043, 92125, 48805, -24026, -62289, -58830, -63747, -108575, -118368, -106749, -114103, -70163, -85316, -126673, -141360, -135649, -110010, -58587, -9385, -13422, 28701, 27022, 29507, 10852, 59623, 43213, 1040, 40931, 67737, 26550, -14564, -63893, -85884, -47697, -48071, -10815, -11403, -15239, 10989, -11430, -62344, -106487, -109489, -65027, -30169, -49604, -37109, -16977, -15303, -2312, -51568, -12909, -15311, -22697, 47859, 49034, 15607, -32491, -35020, -12545, -22305, -24001, -61479, -83708, -61397, -37445, -57355, -78645, -106714, -71872, 18497, 36097, -27983, -76717, -18818, 4725, -22894, -7936, 12342, -5211, -866, -12676, -11368, 39867, 88921, 56879]
16934E6879J2444J750K0374J2812N4135m1112j09464k6389J8119R213N061J1698
16922B5520j8947M2742J7319p812O767j7632l8935L0561j0332L9940l009m6416
16910A9766p8811K9507J5068l597J7217L994k1637K1854O648Q682r9268o1169
16898a41746N4910P0120K321l1325O2127L0596J2838l7576K4421k3218J4473J8182
16886E6123M0565q995p3639Q686N6557K5668J8503J0469m7012k3258k9839o2755
16874b8927j8601N8322J6475k4404o1808j9628J07332L1073j072l3125q348P447
16862B4736k0695k7736m5628k4135j4231l9813M8951O0881M9604m1982p3774L3116
16850g0706p537n9142Q70N6499J9710O1381J7592k0492n9723K0758Q0280n274
$$ y = [56879, 69323, 71073, 91447, 104259, 158394, 117282, 7818, -18571, -452, 8761, 13822, 25520, 6573, 49315, 66634, 58822, 65589, 47957, 9022, 39583, 29251, 69191, 66182, 19766, -59045, -29538, -14470, -18067, -850, 3144, -18493, 3361, 10009, 18691, -80577, -141746, -86836, -16716, -14395, -45720, 16407, 47003, 59841, 22265, 46686, 23468, 37941, 56123, 96688, 87693, 14054, 22740, 79297, 104965, 123468, 133937, 86925, 63667, 33828, -28927, -47528, 10794, 27269, 2865, -58943, -78571, 28761, 59834, 58762, 25637, 17289, 24736, 4041, -23695, -69323, -93458, -107689, -147502, -98551, -37670, 11934, -30048, -103822, -70706, -78243, -137385, -136515, -80016, -60306, 1075, 18667, -1825, -61548, -40790, 39490, 34216]
16838C4216l6524p3456k3740Q4890P3472j4272M6639j9216M387K7081p7638j0696
16826A5143j1412n2247k1598P1902O9946N0962k8295p891l1042p4288j4532j9288
16814e2640o176k1443j8988N6749L4976m7956j0147R309J8993l1177m0858P8812
16802c0546L8937P607J3564p2718k0243O840M0850K3175l9284k8089L1671j696
16790b9932r444l9674k1623J238L9964J2500J358J4136M3148n4457o6834O858
16778a02762L7240J1580K1947J1067l4465K6Q17J6468j5537m028K6623K0870J297
16765h857m0083L518N1284L0765J4447m4122m1496l8398j6530j8828M2976O5965
16753F41K051l0463j4168L865K145J8227M1064k9914m0514N787j23M2204k458
$$ y = [34216, -2308, -75764, -99504, -14614, 58858, 44586, 91225, 72009, 76396, 103477, 25839, 15143, 3731, -48516, -70114, 1788, 71734, 122696, 94401, 86510, 55468, -18820, -33352, -52640, -58816, -80259, -99247, -42498, -7522, -55478, -65625, -56316, -37323, -68500, -109358, -30546, 8391, 15998, 29562, -43156, -63399, -56559, -15709, 7466, -31818, -59907, -28236, -29932, -39376, -79050, -100673, -99435, -59471, -46971, -45613, -31477, 11671, -42786, -109620, -102762, -65522, -53942, -31995, -20928, -55393, -55367, -54550, -38082, -53619, -57647, -31024, -10154, -8857, -48940, -45422, 5862, 36627, 51074, 6952, -34544, -72942, -89472, -108300, -65324, 641, 2692, -27771, -41939, -38074, -35929, -17702, 23362, -6552, -47066, -41279, -41402, 802, -1656]
16740a656O53n1742j4277L5277k5345K2766J5143j2646p0781K4361K1523Q833
16728d7891J291q768J9303N2721L3212M1457j8480q3381R483N200k3386k1962
16716d1201q80O178k3039k829O0971M14Q270M9846J0885N374K2510J4468j4736
16703I6231m1563k8775N1907L7964m4048J0843M1350k8151n4122j7124j0829L6369
16691E0052L5549K0997n4407o5509l8980M5265J4824L5464k2503K1992M2225n6042
16679B8927m9337q853K3506m3991K5878K3379L8269j4221L0933O7228J9907o3294
16667G8331n1130l3426N9782o1254j7452J6913L8089k146k4506k6997L326J0297
16655a0173l76j4778q6707j4472M7219M7021P6125j0055p9264q0863m2180N6293
$$ y = [-1656, -1003, -52745, -67022, -31745, -57090, -34324, -19181, -31827, -102608, -78247, -56724, -47891, -46600, -55368, -36065, 16656, 49868, 91325, 72845, -10536, -1053, 4147, -19239, -41201, -42081, -35903, -58942, -61771, -800, -386, 7884, 57730, 68615, 73989, 96499, 110967, 96231, 54668, 25893, 77800, 115764, 71716, 82559, 123909, 95758, 41636, 24512, 13683, 50052, 85601, 106598, 52191, -13318, -52298, -7033, 7791, 43255, 20752, 42744, 84969, 28927, -20410, -29263, -5757, -49748, -23870, -491, 37778, 23557, 54490, 121718, 141625, 78331, 27201, -6225, 53557, -7697, -25149, -8236, 29853, 27707, 3201, -23796, -20470, -10173, -10549, -25327, -112034, -126506, -79287, -32266, 43859, 33804, -45460, -126323, -168503, -112210]
16643a12210M5494K8858j7210r397K6540J4892l1193K798J4814L1649L5086n62
16631B9559o4309l7185K0514K6644K8544J3967K2187R166o261L2933k483n6619
16619A6657p2757k2577N3843Q1893K2799n3486k1348J4641m531K1397j9651N6289
16607G3169M6154r9025n1783K9149M5537L5000Q531m6072n3164J9588l6836M450
16595b5302N2932K2959l2828N795j146L8351o5879m6078R889L6894J0757k9598
16583b3254J305k7528m0801p186L8284O7535q67m6751K048k7077k7617L9416P5720
16570B3227K6713j8552l0479L3843J2677j9206l4966k9585m6027L7146K1374l714
16558b7549M8723m0668J5900j8647k9630K7250q459l5962o2406L0050N7322P3709
$$ y = [-112210, -66716, -37858, -55068, -64465, -37925, -23033, -54226, -51428, -36614, -4965, 30121, 29559, -34750, -71935, -51421, -24777, 3767, 17734, 39921, 49087, 42826, 75759, 73276, 16657, -56100, -78677, -24834, 57059, 79858, 26372, 5024, 19665, 15134, 36531, 16880, 73169, 119323, 20298, -31485, -2336, 43201, 78201, 86732, 40660, -12504, 7084, -29752, -25302, 27630, 50589, 17761, 23556, 22410, 60761, -5118, -51196, -41307, -4413, 6344, -23254, -21949, -49477, -90278, -97464, -59180, 8355, 7488, -39263, -37215, -64292, -91909, -52493, 23227, 49940, 31388, 909, 34752, 47429, 28223, -6743, -36328, -82355, -45209, -23835, -27549, 21174, -19494, -3594, -22241, -51871, -24621, -33080, -69042, -131448, -101398, -44076, 29633]
16546B9633J4482l7487j9766L8905J1494j1177j9900j3630k9463q432m1983l5776
16534a23100N857K5168N946M4182K2131p1659Q242P0237M6927k8349L3429J051
16522D0062K415j3144l7727j212M0663n067J7351r255K0558K3743J3394o2780
16510B9001j9230J8660l1369M6370j1918o3697j9848l687K7116K3183P288M929
16498F798m6612J6689K720n6481k7967n192j6596J6219J842M8178L5504L6968
16486A2070n044K859Q980N8758k324n4066n7243M5861P1242K265q1956o4826m7434
16473a10858J7789P7752K6887j2649j4724j0274K0116O2481l7954n3090N8267
16462B3743j4191P397M5056m616k1018J6205L1565k134P1312J8169k8253k5085
$$ y = [29633, 44115, 6628, -13138, 25767, 37261, 26084, 6184, -7446, -36909, -45341, -87324, -123100, -117243, -92075, -86129, -41947, -19816, -91475, -83233, -12996, 33931, 5582, 39011, 40062, 42477, 29333, -8394, -9606, 31057, 25990, 43341, 34086, 54644, 78387, 91781, 29001, 9771, 28431, -2938, 43432, 31514, -32183, -52031, -55718, -28602, -5419, 1869, 6798, -39814, -23125, -20405, -76886, -104853, -110045, -126641, -110422, -108580, -60402, -24898, 12070, 7026, 9885, 18865, 77623, 75299, 21233, -36010, 9851, 81093, 83358, 1402, -63424, -110858, -93069, -15317, 11570, -1079, -15803, -26077, -5961, 56520, 18566, -34524, 23743, 9552, 16949, 62005, 57389, 36371, 52576, 84141, 82007, 153319, 171488, 143235, 118150]
16450A18150m0794l1724n1389k1008K841k655O294J9130J8019j2518L0642n370
16438B9618m172L8441j7874l7661P673o7993k4262O1397J8077O987j8669L6797
16426B8359j5283j8642K7721q062k7145J4131J5047m842n4063l5312J9632J2836
16414d5623J1638L7192L363j3086j6081k8744l6206j0047o563K3460j4863o98
16402i6258J4288J383k6119M0858M8465r4j614Q315L0942n1512p345J6550K2429
16389B88l0705j8375O484P4055K9116L2974L1780l5218K5895l496j2186l6177
16377F4435L259j3917J2845j977n4428q3998j0936m165M9344O8840j534k2385
16365E383l8191j6653K2516L323n400k7665L7669K3496M224K2000r407j9341m369
$$ y = [118150, 77356, 45632, -5757, -26765, -23924, -26579, -20285, -1155, 16864, 4346, 34988, 29618, 25446, 63887, 46013, 8352, 16025, -51968, -76230, -14833, 3244, 10231, -8438, 28359, 13076, -5566, 22155, 14093, -13052, 1079, 16126, 11284, -42779, -78091, -58459, -45623, -33985, 3207, 6570, -6516, -22597, -51341, -87547, -97594, -104157, -80697, -95560, -96258, -81970, -80587, -106706, -65848, -17383, -17477, -19091, -10776, 20166, -31346, -38691, -22141, 288, -30417, -48792, -42308, 31747, 60863, 93837, 125617, 90399, 116294, 112798, 100612, 64435, 67694, 53777, 66622, 64645, 10217, -73781, -84717, -88882, -39538, 29302, 27768, 5383, -32808, -49461, -26945, -23622, -29022, -56687, -19018, 4478, 8702, 30702, 21295, 1954, -2415]
16352b415Q0153J6171k6893J8502n2344o2989O105l2587K396L0662L0391J3676
16340B0828l4717q0046j9188j8160k8224P55J0637M6235K9729J1925K993l8797
16328i6030Q193L5034J8609K4553j8403k887m0098K6129J7506m3684o970K6502
16316e1546K7329j887R357l2882L7145M7155L7673n7492k0574K8469m5422j3827
16304c6502J6470m916N1171L4926j08048m8239J7816K2590k3252J4758N1538k326
16292a4014l6968L8687J1106M57P685j3109L5248k5577l2033K9203L5225j1327
16280B4583q462m1973k3417K6244L3395J3583n0163K9571j9575n6030k113P8469
16268D112P1225M620m4593Q94o523n7674J002N1962n4987l6381O8756M1432J4226
$$ y = [-2415, 77738, 93909, 67016, 85518, 33174, -29815, -23710, -56297, -53901, -23239, 7152, 20828, -13889, -93935, -113123, -131283, -159507, -158752, -148115, -101880, -72151, -60226, -57233, -96030, -87837, -52803, -34194, -9641, -28044, -30931, -71029, -44900, -27394, -71078, -78048, -51546, -24217, -26104, -16747, -49629, -12484, 34671, 72344, 14852, -5722, 22747, -22675, -36502, -20032, -24948, 26223, 61149, -46899, -95138, -77322, -54732, -77984, -63226, -11688, -14014, -50982, -12295, -1189, -732, 6953, -6156, 29092, 3515, -28518, 685, 35910, 24583, 16121, -25852, -49269, -23025, 10370, 23953, -26210, 3361, -16214, -72244, -74357, 4112, 75337, 79957, 35364, 36258, 29735, -27939, -26937, 25025, -29962, -66343, 2413, 43845, 58071]
16255E8071J8262k967l272k4868n1921K314r008n324L7317O562M744N0646J1556
16242I2112k7237m8223p1730n939k519m1109k6765J1840M1433J9838N128K7779
16230b5392O741m2106r809j4493K7216J5836J8794m3917l4789k1352J4020P2697
16218c6554k7324l0136k0791O4530j1901j6873l4522k1643J3044k9843o221L0315
16206a27919K7463O4134K7354j3162k353j7732j3666o827P344P1584J7678k0197
16194A3701l7439N153J6550K6036N5639O3464k5015n7406o7625Q1808J3128m1420
16182D6574k7932K6059l6857L0507N729r163p0511j5343N6804L1235L0323j1189
16170E6236n5555n2263R788m940p607J0431j0980L3359L4851j9262J5299J2676
$$ y = [58071, 76333, 73366, 70094, 45226, -6695, -4381, -13389, -18713, 18604, 25166, 29910, 80556, 92112, 64875, 16652, -55078, -61017, -63536, -104645, -131410, -119570, -78137, -58299, -53171, -25392, -18651, -60757, -70566, -85059, -57843, -42007, -23213, -67130, -101919, -123271, -109251, -36554, -63878, -94014, -114805, -50275, -62176, -79049, -113571, -135214, -122170, -152013, -158234, -127919, -100456, -36322, -8968, -22130, -24483, -42215, -55881, -62708, -55364, 16220, 33898, 13701, -23738, -18585, -2035, 24001, 79640, 143104, 118089, 60683, -6942, 74866, 87994, 46574, 18642, 44701, 7844, 38351, 44080, 34917, -35594, -50937, 5867, 37102, 67425, 56236, 681, -51582, -41794, -46734, -54341, -43910, -54890, -21531, 13320, -5942, 9357, 22033]
16158B2033n559J8150Q576n9578m5734N3423P930O0491L3998l1789j8894j5671
16146B7376j632k2092o2151J9447P0958P947n7330n3014K554M4796J3191L66K6530
16133A6946R57Q299l7717o7408M6450N4841k8540m4670L93K441j2146M1365M804
16120a3985J3202K6414j8488m6351N3918L4402o6523M5046r22m3224o756J7387
16108e880Q362N0544N3733l332r7560k6719L9737O801l7675p6531l2381n563M9368
16095g7096P6962l1876m3161J9209L776J9634L5522M2338K2128M547l0757K6723
16083F7949m0134p4936j182L0386L9567n314O3151K5760q3074L0208n2485p6307
16071g6411M7878R6400N7477N817n9272q213O5490o7397q9194J8068L3510r008
$$ y = [22033, 16474, 34624, 43200, -16378, -62112, -8689, -759, 59732, 93730, 61941, 43047, 27376, 25744, 3652, -58499, -39052, 31906, 39853, -17477, -70491, -67937, -23141, -9950, -9584, 16946, 17903, 26202, -11515, -78923, -32473, 22368, -6172, -50842, -50449, -48008, -60154, -18789, -13985, -783, 25631, 7143, -39208, 14710, 49112, -17411, 27635, 26713, -16511, -23267, -5880, 2482, 53026, 106759, 103427, 5867, -20852, 18885, 25686, -11989, -88520, -120901, -126464, -77096, -134, -32010, -75171, -55962, -52186, -32552, 2970, 45308, 67436, 71983, 41226, 67949, 27815, -47121, -48303, -17917, 21650, 16336, 79487, 105247, 22173, 52381, -104, -76411, -28533, 67867, 125344, 131161, 71889, 63676, 129166, 61769, -27425, -9357, 24153, 15145]
16059A5145K1023K9924R6783K8490p7517o6876o8692l9504m9475M5108J8828l889
16047e0652K05j4904M117O5827o1469r0755J6514J10966R1107m390r006K9979
16035H7539k9023J4950l1682r435J3879l3875k8178L7867K2883J4332l094k5708
16023C0455N6843l4951p9564j946j7187o7559K8566N9708P4718J3678N5060k8612
16011H9209o9952l9523l5913p241j8734n4522O1981J0780j394L2021j697l5958
15999g0943J8554L080R675J9123m7093K7045L3052L0506k7727j1453J6360K5152
15987B5331K2094j2359L6878j3915l2428N495l0198O3867k5129j4900J5091l194
15975C6633m9814L442l3967K4473j1697n1745q074P7695l715m0682j4373P0165
$$ y = [15145, 36168, 66092, 162875, 191365, 113848, 46972, -21720, -61224, -110699, -65591, -46763, -50652, -50447, -65351, -61234, 4593, -56876, -147631, -131117, -20151, 70956, 66566, 57560, 87539, 58516, 73466, 41784, 32349, 46228, 12353, -15825, 22042, 44925, 59257, 56163, 30455, 87298, 52347, -27217, -29163, -46350, -113909, -85343, -25635, 49083, 62761, 117821, 89209, 19257, -20266, -56179, -63420, -82154, -136676, -74695, -63915, -65309, -33288, -34985, -70943, -52389, -49309, -39634, -20511, -67604, -40559, -7507, 22999, -4728, -16181, 179, 25331, 47425, 35066, 71944, 58029, 25601, 31096, 898, 64765, 39636, 24736, 39827, 36633, -13181, -9739, -43706, -19233, -30930, -82675, -90749, -13054, -16769, -57451, -71824, -1659]
15963a659Q620j4807K6885L2203J3254j3295l2195M870J775K8748q348m9140L9966
15950C6877L2604M201j9087j2588K4441j085L3302k5240l9509k958Q345J0282
15938D9585k3091k5876k4350j7311m955J5800l2638N1030K8011L7677J5158k6091
15926D2949j0928M8549R2641j0006o7970k6332j7932l6706l4537k3364L7148J0632
15914D144n9338J383N1517P6345k3083m9779Q005m7585n2478j619l6339P1488
15902e7339L0088l8243m8954n388M5723M1583M704j8644K6536K9714j5784L4350
15890B8346j7164K2614r53m459l0M658M2586j09392l6524J6992J2999M1674M6522
15877D7869N433j8476p537n925j1849r133k9902J4889K8371N8549M4505o5405
$$ y = [-1659, 6961, -7846, 19039, 51242, 64496, 51201, 19006, 23876, 25651, 54399, 46051, -3089, 36877, 69481, 73682, 54595, 42007, 66448, 65363, 98665, 73425, 33916, 30958, 39303, 49585, 26494, 618, -23732, -41043, -45998, -30198, -62836, -11806, 16205, 53882, 69040, 42949, 32021, 80570, 173211, 163205, 95235, 68903, 50971, 14265, -20272, -43636, -6488, 4144, -55194, -53811, -2294, 74051, 50968, 1189, 9194, -38391, -90869, -92488, -128827, -57339, -27251, -65494, -114448, -119836, -74113, -32530, -27826, -46470, -19934, 9780, -6004, 28346, 11182, 33796, 32843, 28384, 28354, 33012, 75598, -33794, -70318, -53326, -40327, 1347, 47869, 53302, 34826, 27289, 21364, 9515, 382, -29520, -14631, 13740, 72289, 116794, 51389]
15865E1389q0668m4644q765K6646N2961q312l0413n415N173M4890J1300k3078
15853h936K270J3326r638L1878p892M7435k8598n6835M1579K7218l9957o3788
15841e1938k6261n2855N7157Q4490J6178l36l320l0902p994L6275K7201m1866
15829E829q1761j1585n9092j4349J6081N8539P5711L1618J5446K6391q822J1106
15817F5112k3888n7952k6339m699j9973K8542J9936L2291J572J8931J904r2932
15805e7495k9183K6476L4830j9589l3328K078K1120J1694K8950J480k6133L4596
15793d504M2416N9068K686n7905k1361m3072o2195L9386J638m7901j3057N8201
15781d6600K89j4889n4579L813L7154N4351M0547K9726j3421L136l3112j838J0707
$$ y = [51389, -29279, -73923, -82688, -56042, -3081, -11393, -41806, -47221, -42048, 2842, 14142, -8936, -6666, 6660, -2978, 28900, 21008, 68443, 39845, -16990, 24589, 51807, 11850, -51938, -78199, -131054, -73897, 10593, 26771, 26435, 23115, -7787, -15781, 20494, 47695, 5829, -75932, -87517, -146609, -160958, -144877, -86338, -10627, 20991, 36437, 62828, 54006, 65112, 41224, -16728, -43067, -47766, -67739, -39197, -19261, 13030, 14602, 33533, 35437, -57495, -86678, -60202, -25372, -44961, -78289, -76211, -55091, -43397, -14447, -12967, -39100, -4504, 37912, 96980, 99666, 41761, 20400, -22672, -84867, -45481, -43843, -91744, -104801, -46600, -46311, -61200, -115779, -111966, -74812, -20461, 20086, 49812, 36391, 39527, 6415, 4577, 15284]
15768A5284O0387k6260p965j207K1016j4249J36K9912n9949n2779R839J9530K9353
15755B3048M1665J0300k9625k9446l5853M865j0567j18902L0956N9643k1489R268
15743f6137O4982K0170Q2134m9510r3166J016l7486j6787M9070O9536j2820l5477
15731b4475m4567O3388O4853k3372L8457j0517l5445J3836k981n6564n877K0003
15719c261J6641R604J9379k965k9279m763m3385n23R506J6397j0199k8224l9n032
15705e6143N7476L761l9314K5617M2721J134o4166j6260K5523q071k1747M9622
15693A53K5984J03J4209J1385j6731k566k5242M532J6513M4167j6834n9446o800
15680a0573k2280n135j5378j9720n104L9174j0428O404M1618k7862K0948o310
$$ y = [15284, 75671, 49411, 41446, 40239, 61255, 47006, 47142, 77054, 17105, -35674, -25835, -6305, 23048, 64713, 75013, 45388, 15942, -19911, -15046, -25613, -144515, -113559, -53916, -75405, -66137, -1155, 19015, 101149, 51639, -41527, -40511, -77997, -94784, -45714, 23822, 11002, -24475, -69042, -5654, 59199, 35827, 74284, 63767, 28322, 42158, 39177, -17387, -23264, -3261, 13380, 22984, 42363, 39398, 10119, 5356, -38029, -38552, -29046, -12649, -22848, -51072, -51111, -56143, 1333, 5094, -34220, -8603, 34118, 35252, -28914, -45174, -19651, -27722, -49469, 153, 26137, 26240, 40449, 51834, 35103, 32537, 7295, 11827, 28340, 72507, 55673, -3773, -10573, -32853, -37988, -53366, -73086, -78190, -39016, -49444, -43040, -1422, -29284, -8336, -14646]
15668a4646M2682J5580l8634o6522k8921O8903k7771k9863J2817N169k1954k0759
15656a03919J9344j486K5600L8001K0285N5242l9028q7862j4038P730L3623L0153
15644a6355J1247l5752l1301J3724l1201O4049O3583J9183K235K4662k0824l2874
15632C0376l2140M8675J3841l9315m0941l5088L4971J2741K8077q714K0416J0520
15620D3419k4121k3881l1771l1779J417j440M2118L4538R141N07L0201m8118j0905
15607a0674k8154o1653j8409N9167N8378q4305k615m0763J9801P3347J8909q651
15595b5622j2469K1860k6430M0484J3026l4495m4776k9955K945K4572N4515N8840
15583D2495n592l7482J5486J9447k3485k8590j7387j0178K273M4962n1023m830
$$ y = [-14646, 28036, 43616, 4982, -61540, -90461, -21558, -49329, -79192, -66375, -61206, -83160, -103919, -84575, -86061, -60461, -22460, -2175, 53067, 14039, -73823, -87861, -80131, -46508, -16355, -5108, -40860, -72161, -58437, -89638, -25589, 37994, 57177, 59412, 84074, 63250, 30376, -1764, 46911, 60752, 21437, -19504, -54592, -19621, -6880, 21197, 12483, 32899, 43419, 19298, -4583, -36354, -68133, -66716, -68156, -26038, 8500, 17641, 18148, 48349, 231, -10674, -38828, -100481, -118890, -59723, -1345, -85650, -88265, -129028, -109227, -35880, -16971, -25622, -38091, -16231, -42661, -2177, 10849, -23646, -68422, -98377, -95432, -70860, -16345, 42495, 36903, -579, 14907, 34354, 10869, -17721, -35108, -45286, -43013, 1949, -49074, -53904]
15571e3904k1547O024O2895l0411k6509K0447K7479N2000J6570L0457J0055k6642
15559F6914m1062l4823m0659m7948r645R026J9506J5783M597m4143p366M3451
15547f6369J1361K6452j4910m0159p4738K4654K7672O7449M6646N5792Q998o1340
15535A1508l1215j556K8906K4629K2539m4975K2921Q340j7763o4810r974J9506
15523c1944J1367K8394J613Q182K7428k6220k7389N127j5163n1821M483l4019
15511i9962j2500L6033M4362j6920R816J8809r685k9747R601M4132O4577j101
15499E7415n1267o9940k888N0133K7629k9149j8996j5916K184l3453k0580L9252
15487f5576L9456K2488J6975L3555K5975k0764l8338j6528L4970N5011k2527k4232
$$ y = [-53904, -75451, -69427, -6532, -36943, -63452, -43005, -15526, 36474, 53044, 83501, 93556, 66914, 25852, -8971, -49630, -97578, -107223, -98197, -78691, -62908, -58311, -102454, -109820, -66369, -55008, -28556, -43466, -83625, -158363, -133709, -106037, -38588, 8058, 63850, 72848, 11508, -19707, -21263, 7643, 32272, 54811, 9836, 32757, 41097, 23334, -41476, -51450, -31944, -20577, 7817, 9430, 17612, 45040, 18820, -8569, -3442, -18605, -70426, -65943, -99962, -112462, -76429, -32067, -48987, -39171, -20362, -30047, -59794, -50193, -6061, 58516, 57415, 6148, -63792, -66680, -16547, 11082, -18067, -37063, -52979, -50795, -84248, -104828, -65576, -26120, -3632, 13343, 46898, 72873, 52109, 13771, -2757, 32213, 87224, 64697, 40465]
15475D0465J8016P5869L0177n232q2201m8949L6044M7633K693J2815k8093n2398
15463D6839K386m346J3366k1809K998N5478K8254j2203l6517l7404j4211k7393
15451d562j4483K6157O756J3877N9383o3980k4632n355L6167R2771o7154p5966
15439b1021K7447L5607K9992L445J9930N040m4079m1668l9410O401K777r233k643
15426b7415p478L184m280M8352N4941Q710J611k750m840J551M715j2471M8334
15413A12164o2091l0474K3877j9325n010K5791Q784o936O2056k9562p838L166
15401G4602J468m3672J2722L0888j5474j12629j8526L1707K4978J6356L2600O5129
15389A00149j1789K3155k3982q9722j00468O98l0538l841Q3507J6236m1495n1223
$$ y = [40465, 58481, 134350, 164527, 159295, 77094, 28145, 64189, 111822, 114515, 127330, 99237, 46839, 49225, 44879, 58245, 36436, 39434, 94912, 123166, 110963, 74446, 37042, 22831, -4562, -19045, 7112, 13868, 27745, 87128, 23148, -1484, -6839, 29328, 122099, 54945, -21021, 6426, 42033, 72025, 75470, 95400, 100440, 56361, 14693, -24717, -18316, -15539, -24772, -27415, -34893, -31709, -35989, 12363, 67304, 76014, 77625, 74875, 70035, 71586, 76301, 63830, 112164, 50073, 19599, 43476, 24151, 19141, 44932, 53716, 46780, 108836, 79274, 71436, 74602, 76070, 32398, 45120, 76008, 60534, -52095, -70621, -38914, -13936, 2420, 35020, 100149, 88360, 111515, 87533, -2189, -102657, -101959, -132497, -136338, -52831, -36595, -78090, -129313]
15377a29313o15K8454K3420O174j4539J7016O2034O1702r353L2605m3696r0565
15365e6676j1273L7831J07877O2426K5663m6545o2257l3374K2657L08l1383k531
15353A2723k5359j8719l0550N9496K4759o1930K584K0174R453J8367k0345j3533
15341b2880k3079K7968K3354J0373J0490R41J1325l6462l1540m1393j6289M4386
15329d2806N2317J3339J672l610L4272j6043K3261l9179n4722L7962j423o3155
15317e8115l8591L5806M0182j418j941l0649M4812N0078q090J140l6050k8858
15305c1694K0328l7016N6397M135m4164q789k3200j5720J6118P0838K9716n2898
15293a5949q530j7012K3569L2750j671P499J9297m8379O841K9438j4164l9883
$$ y = [-129313, -129928, -101474, -78054, -71880, -86419, -69403, -7369, 54333, 44980, 77585, 33889, -56676, -67949, -30118, 77759, 140185, 165848, 119303, 57046, 23672, 46329, 46637, 15254, 12723, -12636, -31355, -61905, -2409, 22350, -39580, -36996, -16822, -7369, 10998, -9347, -22880, -45959, -17991, 5363, 15736, 26226, 27167, 38492, 2030, -29510, -70903, -87192, -42806, 9511, 22850, 24522, 20912, 55184, 39141, 62402, 23223, -31499, 6463, 5040, -58115, -96706, -60900, -20718, -22136, -24077, -54726, -9914, 40164, 32074, 33214, -2836, -31694, -11366, -48382, 8015, 12150, -32014, -40803, -64003, -79723, -63605, 7233, 36949, -15949, -24479, -41491, -17922, 14828, 13157, 20656, 39953, -8426, -1585, 27853, 13689, -26194]
15281b6194m4699m7836P3903J7776J4893K0391k6176K5030M4781Q510J4273l3360
15269D1292m7481o317L0749j2395j6254L3642L5595K0124N854k160m1696j2442
15257B8511l9016n6221N5361K9405l7380q4350J949O4669O0503N076J5176m3013
15245F70k38O1900N252k94K7943r224l5225j7161l9902L9054K6481j2724J7754
15232F4286L8501O4425O8979p0022l2890m9350l7112j01580l9019M8864L8975
15221e943j6615o4870K1865J36289M8832n3443m4882L4646M9367n3273j5846L750
15209C9877o0748n9521j6602N1753P3626L3223p466k7305L5373j2583K2844J2862
15197H5333K4467l1290k8375k4752Q6140k2423m3185l0903J220L612l7546j7679
$$ y = [-26194, -70893, -118729, -44826, -27050, -12157, 8234, -17942, 7088, 51869, 60379, 74652, 41292, -6189, -12506, 18243, 5848, -10406, 23236, 58831, 78955, 84809, 82649, 40953, 28511, -10505, -66726, -11365, 18040, -19340, -103690, -101741, -37072, 23431, 28507, 43683, 670, 432, 62332, 67584, 67290, 95233, 86009, 50784, 33623, -6279, 32775, 59256, 46532, 64286, 102787, 167212, 236191, 166169, 133279, 83929, 46817, -54763, -93782, -44918, -5943, -22558, -87428, -65563, 70726, 119558, 66115, 21233, 55879, 105246, 51973, 36127, 39877, -20871, -80392, -96994, -45241, 28385, 61608, 54142, 26837, 62210, 49627, 72471, 85333, 109800, 78510, 50135, 25383, 111523, 89100, 45915, 15012, 16232, 19844, -17702, -35381]
15185c5381M1828K4614o82k2091k6261L0737M7264k5081k9070K8301n898J3612
15173D1892r450m600M2886J7508M5882L954l8760j3144l1669l2435q197n57M2095
15160E5405J4027m2942L6554J6540K2548K2436K2338l7443l9924n1750J719k4611
15148e103k9838N1189L3149l8503j6555L2840m994N934r373k2296l894K028k2910
15135b8326j2090J6011j8064K705L7956q500P1228J694K7795l636k401n5590n5093
15122b6311L1587L5627m2863j3958M3356J5995L7589J695q5854l1699r127K7524
15110a6439J535K5432M0109P848l4321k8494L3566M930k0103M4117O401l963n256
15097E5362M173L8202J2278n6683n8100j5610K6552L9390j2721R847L0759K418
$$ y = [-35381, 6447, 31061, 30379, 8288, -17973, 12764, 60028, 34947, 5877, 34178, 28280, 41892, 32442, 27842, 70728, 88236, 134118, 138072, 99312, 86168, 54499, 22064, 13867, 13310, 55405, 69432, 26490, 63044, 79584, 102132, 124568, 146906, 109463, 69539, 17789, 19508, -5103, -34941, 16248, 49397, 10894, -5661, 27179, 22185, 28119, 18746, -3550, -7444, -5416, -28326, -40416, -24405, -42469, -39764, -1808, -10308, 60920, 62614, 90409, 86773, 84372, 28782, -26311, 5276, 40903, -1960, -15918, 27438, 43433, 81022, 82717, -3137, -34836, -43963, -16439, -14904, 10528, 50637, 58485, 24164, -4330, 29236, 34166, 14063, 58180, 64581, 60618, 55362, 59535, 97737, 110015, 53332, -4768, -20378, 6174, 45564, 32843, 42690, 73449, 75867]
15085G5867K9498o116m8614J1078q758M2632j0104P79j5792J6687k275K022K5219
15072A12123M053q2491j4937j4283j2995l8642l3422j5022J1921J2447J8920K185
15060e0143L0942j7278P2798M304N825k0745k573j16L429M418m4523k3687M4205
15047F856L3501L6222o7016Q930J7433J9386O1361J8753n7875l1890j0945r152
15035B5564p5331l364L4985K9111k2158K333M2889K5223J0135k7792K412j313
15023D2694j3965J3827o9224o0244l2449J7134M9407o712K0477L4149K341l1983
15011c4548K2842N3794R870m9629M748O9597K9393J9832n640k6956n4479l8172
14999F52K1153Q977j5169o4157M2676O1550p1436n2133J688N2237M9638M7625
$$ y = [75867, 105365, 99249, 50635, 61713, 52955, 95587, 85483, 86262, 70470, 87157, 84882, 86904, 112123, 116176, 33685, 18748, 4465, -8530, -47172, -80594, -95616, -83695, -71248, -52328, -50143, -19201, -36479, 36319, 40623, 46448, 25703, 23130, 23014, 26443, 30861, -13662, -37349, 6856, 40357, 76579, 9563, 18493, 35926, 55312, 116673, 135426, 77551, 45661, 34716, 25564, -49767, -53131, -18146, 10965, -11193, -8860, 34029, 59252, 69387, 41595, 44007, 42694, 28729, 42556, -26668, -86912, -119361, -102227, -52820, -59532, -39055, -4906, -2565, -34548, -11706, 42088, 51958, 2329, 7077, 76674, 106067, 125899, 120259, 93303, 38824, 652, 21805, 30782, 15613, -48544, -5868, 55682, -15754, -67887, -66199, -13962, 35676, 83301]
14987H3301l0210l8393L1762L941J239l164R998l2268k2719J9420k7372n1611
14975e6076L2856J7796M4219Q761J5850j7760l2246l3656j8561K5060M2470L5764
14963F4477l6816l314R830l0629q6810p002K8164K6829O485N5381k8228k9468
14951c1101J9841j4691L0793Q585M0069j1124n0433k8790J3762k618m0081j9273
14939h5061O0597R730K3501L8549J7980m8357j1406O3621J631O616m0709p927
14927B8765p0118k450M3729K0690J7951K5440K4653J3639K4314L1065l8223r7079
14915B2376J8377J2130m0831k5352k4532k538m4742P296M0935J9034J3807k2460
14903b6500j3298K3216n4846J8001j7921K130k582N0395L1153L2046n3558j1521
$$ y = [83301, 53091, 14698, 46460, 50401, 51640, 48476, 58474, 26206, 3487, 22907, -4465, -56076, -23220, -5424, 38795, 47556, 63406, 45646, 13400, -20256, -38817, -13757, 28713, 64477, 27661, 24347, 34177, 3548, -83262, -90264, -62100, -35271, -28786, 26595, -1633, -31101, -11260, -25951, 4842, 13427, 53496, 42372, -8061, -36851, -23089, -25707, -65788, -85061, -24464, -14734, 8767, 47316, 65296, 16939, 5533, 69154, 70785, 77401, 36692, 28765, -41353, -43803, -74, 20616, 38567, 64007, 88660, 102299, 126613, 157678, 119455, 22376, 40753, 52883, 12052, -13300, -37832, -40370, -85112, -77816, -36881, -17847, -4040, -26500, -39798, -16582, -71428, -53427, -71348, -69218, -71800, -21405, 9748, 41794, -11764, -23285]
14891b3285M8168n1923j9117O7540M900L682j4756n9449L62n411m4058p274M4014
14878e6607P1695L7954k9846m5945M2815m3003q6481k7771j2450M2211M4330P2858
14866I760p105k8013K8638K2462K2691L7928L4280m7570o5852j1130R304N9059
14854F4452N5518j9820l5985k5118k3922J2536J5222M369q730R16o1090q8060
14842a09712L8521J16082J5502j2928k5859M9040N0206q053o7149m6666M8798
14831D7782j6875k4107m0977K5320j6901j9587l8335O2608M4960j6149R77J3551
14819B2267M1541P644n2380l1424N220L3709L8873J0520q551l5962k2515k7717
14807a8775k9063N2981M2405q5164k615O9451K6747k0602J9683n0044l4648L5318
$$ y = [-23285, 24883, -27040, -46157, 21383, 26283, 29965, 15209, -44240, -43878, -49289, -93347, -100621, -56607, 15088, 53042, 23196, -22749, 20066, -22937, -109418, -137189, -149639, -107428, -63098, 9760, 2655, -25358, 3280, 25742, 48433, 86361, 120641, 73071, 7219, -3911, 5393, 64452, 119970, 100150, 64165, 39047, 15125, 27661, 42883, 47252, 38522, 39438, -21652, -109712, -71191, 44891, 60393, 47465, 21606, 70646, 120852, 112799, 45650, -1016, 47782, 30907, 6800, -34177, -8857, -25758, -45345, -83680, -21072, 23888, 7739, 8716, 22267, 63808, 71452, 19072, -12352, -7132, 26577, 65450, 75970, 67419, 31457, 8942, -18775, -47838, 5143, 47548, -37616, -40231, 29220, 55967, 35365, 55048, 5004, -29644, 5674]
14795E674p203J8372J1412J7711J0721j7717M120l0852J2783M1439J2612m482
14783G4590K3245k2734k1116o3302o2932L4673N0488p617k9368K9593O8701K9739
14771A03960M0636J1449p4763k2671n520j9735J1170k0509m6619J3359L0834J9477
14759D1068J7847l6019n2436n3214K005R0962l307q8048m0806M9219J7639M2162
14747a2928L2573L8451K6528K3913l050n1539k4143k6600p0806J0129P4109p948
14735H689o6992j2207j5348L6728P2286L7266j5694k539K1613k0766k1398j690
14723A9948J2904N436J9053L3304P184n9744k6041k8625K344P3650M8323l1722
14711G6014n2908j3512l0696k4643M7211M6076L4051q2735j6350L8394k9510l3289
$$ y = [5674, -1529, 16843, 28255, 45966, 56687, 38970, 43090, 12238, 25021, 66460, 79072, 74590, 97835, 75101, 53985, -9317, -72249, -37576, 12912, 5295, -24073, 5520, 74221, 103960, 144596, 156045, 81282, 58611, 53091, 33356, 44526, 24017, -22602, -9243, 21591, 41068, 58915, 22896, -29540, -82754, -80749, 10213, 6906, -81142, -121948, -72729, -55090, -12928, 19645, 58096, 84624, 108537, 105487, 53948, 29805, 3205, -67601, -57472, 16637, 8689, -58303, -70510, -85858, -49130, 23156, 60422, 44728, 42189, 63802, 43036, 21638, 19948, 32852, 38288, 57341, 90645, 97829, 38085, 12044, -16581, -14237, 59413, 107736, 76014, 23106, 9594, -21102, -45745, 1466, 47542, 81593, -1142, -17492, 20902, -8608, -41897]
14699d1897k2210n194K312j4958J0413M7046m759j6454q145N5549K1497l1854
14687h654M7412M3682k4094L1429J0898q806o6294j16777J2319J6596J0622N0952
14675g15J3858J2940N3383r342k0911m8528j5811P058k1349R02J2744k1480J0568
14662b6683K6621J8016j3391m5756j5177j210O936N812K6641J1472M868J6471
14650A4620M0823p6312J8527K5689k6920M7950k3835K1747J700J4050j7242j01342
14638f0545l7434O7730O0224Q048J797m179k1180j4943J1287j8473O1281q3028
14626b9415l8764O8133M2376l486J0527m7841n7583q23M9597L5405k657l0855
14614e386K6255K0078l0767M5j0350j0737K4941P925k2950j713L398j6702K4640
$$ y = [-41897, -64107, -69301, -66989, -81947, -71534, -24488, -29247, -45701, -53846, 1703, 23200, -8654, 38758, 82440, 58346, 89775, 100673, 91867, 25573, -91204, -78885, -62289, -51667, -715, 13143, 26083, 79466, 70124, 49213, 685, -15126, -8068, -29417, -28515, -15771, -37251, -26683, -62, 17954, 4563, -41193, -56370, -57580, -50644, -44832, -18191, -6719, -1851, 14620, 55443, -20869, -2342, 23347, -3573, 44377, 20542, 42289, 43989, 58039, 40797, -60545, -97979, -30249, 29975, 38023, 39820, 35641, 14461, -482, 10805, -7668, 53613, -29415, -68179, -46, 42330, 38844, 49371, 1530, -56053, -56876, -7279, 28126, 25469, -5386, 20869, 40947, 10180, 10225, -125, -10862, 14079, 22004, -946, -2659, 739, -15963, 8677]
14601H677K3887K2627N8255l0202p448n1509l044J9501k8486p001j6658m3886
14589e5287N8754P9216O4438j5388n7760p4875m6905l3957M2863O7676P206l5180
14577H01l5066Q56j5709M006O2309K0191o8199J3444K3019j0480k913K0647L8405
14564E1311q268L1619j1099l1816M1614j3677l314M3640j7918l3445J5697P2738
14552A37082L7228J851N46m7318k0925K8872m5375p9943m6820L2689J08401J2277
14540A18565J9283k5973k0799n6628j593k3397j9642J4569K7819n0307p0003K0301
14528f7805N1952K8274Q422l4209j0187k2498j4143M1270J2253N380j9833N1544
14516C0420Q7391N2490l6237l2381j1865q1113n5711j0137J6827J3635Q6140M5856
$$ y = [8677, 32564, 55191, 113446, 83244, 75796, 24287, 21243, 40744, 12258, 5257, -11401, -55287, 3467, 82683, 147121, 131733, 73973, -902, -47807, -81764, -38901, 28775, 35981, 801, -34265, -33409, -49118, -45112, 17197, 37388, -30811, -17367, 5652, -4828, -7741, 12906, 51311, 43043, 74662, 63563, 31747, 73361, 59684, 56370, 100010, 82092, 48647, 64344, 137082, 174310, 176161, 176707, 129389, 108464, 137336, 91961, 12018, -34802, -2113, 106288, 118565, 137848, 111875, 91076, 34448, 32855, 9458, -10184, 4385, 32204, -18103, -88106, -67805, -15853, 12421, 20843, -13366, -23553, -46051, -60194, -18924, -6671, -1291, -21124, 30420, 117811, 170301, 134064, 101683, 89818, 8705, -47006, -57143, -40316, -26681, 59459, 105315]
14504A05315k5576n4420l0131l1595K5826L1911j3898m4497k8160M5543J5056
14493d626l6196n3470j8790K0419r111K9102M2420P4642M2781m8395l5960l5165
14481c2349Q982j9592J1927K533o8372J8013M3366K3985L175n2856J7254Q0444
14469C6510N6382L7860k6136n7501k2616N5746J483m2741l1069l4704K8030N719
14457F963m1114M600k58N18K0052j6187n845k0507k512M6462J9404J1047j2423
14444A0200l6198J2103L4072n211L19K1370K7942n4345k3768k2529P3181L256
14432D0392l8064r55j4749L9812R099K3585o250J6219n2835n6191j0662k602K2572
14419c0629P829M1264K3948m484J2563m9475j3985N6097k3004p2830J7698N9148
$$ y = [105315, 79739, 25319, -4812, -36407, -10581, 21330, 7432, -37065, -65225, -19682, -4626, -40822, -94292, -113082, -92663, -101774, -72672, -30252, 44390, 87171, 38776, 2816, -32349, -23367, -42959, -31032, -28499, -96871, -78858, -35492, -11507, -8332, -61188, -43934, 36510, 92892, 130752, 104616, 47115, 24499, 80245, 81728, 38987, 7918, -26786, 1244, 6963, -34151, -29551, -29809, -29291, -9239, -25426, -31271, -51778, -54290, -7828, 11576, 22623, 10200, -25998, -13895, 20177, 14966, 15285, 36655, 64597, 10252, -13516, -36045, 37136, 40392, 2328, 1373, -13376, 26436, 35535, 59120, 52870, 69089, 16254, -39937, -50599, -53201, -30629, -22800, 18464, 42412, 37928, 50491, 1016, -12969, 43128, 20124, -52706, -35008, 24140]
14407B4140r224k4625k43O569J8224k335P7974K2542k8884m9118J3630K5938k0047
14394E4541j4302M3892k3733l7049K3293l5543r0323m3742L4240K9883r245N0143
14382a7945N5753K4332R201k0398p856M4318K798m8497K4427K0139j1427n4513
14370B0332n5050J2655J6158J9527l8392J8438L0947L1302K9012q281m2334l5697
14358a383K3637N681k4091k5879L9378j1075l367k0381n675L0393J01049N5526
14346A63813q5136o7760L580L3438J5891l8460n894M6461k9229k1490J6851J7203
14334D9268M0119k0050o2843K0656N4573r41K3883K6643M0498L9654K5268k2839
14322B13889k6908N452k0356o6428n0740J3863k0067k3377l3852M9674M7884J3158
$$ y = [24140, 14916, -9709, -9952, -3383, 14841, 12506, 90480, 113022, 84138, 35020, 48650, 74588, 54541, 40239, 84131, 60398, 23349, 46642, 11099, -79224, -122966, -88726, -58843, -68088, -17945, 37808, 62140, 71341, 50943, 43087, 87405, 90203, 41706, 66133, 86272, 74845, 20332, -34718, -22063, -5905, 13622, -24770, -6332, 24615, 55917, 84929, 76648, 34314, -1383, 22254, 27935, 3844, -22035, 17343, 6268, 2901, -17480, -23155, 7238, 108287, 163813, 78677, 10917, 14497, 47935, 63826, 25366, 19472, 65933, 36704, 15214, 32065, 49268, 89387, 69337, 6494, 27150, 81723, 80782, 104665, 131308, 171806, 211460, 236728, 213889, 186981, 192433, 172077, 105649, 54909, 68772, 48705, 25328, -8524, 41150, 89034, 102192]
14310A02192m3079j0174L228M6934m3178n1078q524J3744J1098N8747j2093k9321
14298C8496k2414q349M2119J8193J4770L0109K2504J3083K4169L4507K645n5332
14286A54500r179L8603N525o1153n6011l6355j9931P7241K5976J9083M2374K1958
14274B02631n2619o8509n7946K8607N2170m307j1209k6625j6618j9582j3888j7356
14262e251K6449l338K6464n1449J0723L1645p9292j3181K8980J0314K203M5764
14250C0031K3928j9837J5535k433J7582q8823J2346R3941M2967l5315n7439l4149
14238a666K8099k8488l2215m9155K4426L9726M0354L1252J707o4884q9593q1370
14226a81807O5919P7839Q312J8797n383K3218L919m60m945j5066M1757O7327J3902
$$ y = [102192, 59113, 48939, 52167, 99101, 55923, 4845, -3679, 10065, 21163, 79910, 67817, 38496, 16082, 7733, 49852, 68045, 82815, 112924, 135428, 148511, 172680, 207187, 209832, 154500, 145321, 183924, 189449, 128296, 72285, 35930, 15999, 93240, 119216, 138299, 180673, 202631, 150012, 81503, 23557, 52164, 104334, 100027, 88818, 62193, 45575, 25993, 12105, -5251, 21198, 17860, 44324, -7125, 3598, 35243, -44049, -57230, -28250, -17936, -15733, 30031, 53959, 34122, 49657, 47224, 64806, -24017, -11671, 82270, 125237, 89922, 32483, -1666, 26433, -2055, -34270, -83425, -58999, -19273, 21081, 52333, 54040, -10844, -100437, -181807, -115888, -38049, -29737, -10940, -16323, 6895, 10814, 10354, 5409, -9657, 32100, 99427, 113329]
14213A13329n7855k5707J1587N6676M173l2050k5187j0488m4141l202K672O051
14201d142O2883O7575r021K5237j0406k6704m0657K5573n853K9324m520k5268
14189H4021K3716j7532M0524j9833n3856L5098k4870p9375p080L984l3083k2136
14177g0422J4934N5268O62J8999N8025o0152m1093Q226R6381J8831J9316k0657
14165I8318l9047k1061L8239M36L2395k7389n2452q7056l6231K066Q0123J11224
14153I9565M810k4530q008o3532o2774N4786K1465K5803l747O809L2525K3016
14141A06188n1651k7358P1219L9054L255l3248m740l8645k0555k184L4158J773
14129G7266j8949K9335J4163L0473j5475j4369j517j9007k8892n1782N531M2764
$$ y = [113329, 55474, 29767, 41354, 98030, 102203, 70153, 44966, 34478, -9663, -12865, -10193, -4142, 58741, 126316, 117295, 142532, 132126, 105422, 64765, 90338, 84485, 113809, 109289, 84021, 107737, 90205, 130729, 110896, 57040, 92138, 67268, -12107, -19187, -15203, -48286, -70422, -55488, -220, 442, 19441, 77466, 17314, -23779, -15553, 80828, 99659, 118975, 98318, 59271, 38210, 76449, 76885, 109280, 81891, 29439, -57617, -93848, -91782, -11659, 99565, 104375, 79845, 71837, 8305, -54469, 317, 21782, 47585, 43838, 50647, 83172, 106188, 54537, 27179, 98398, 137452, 140707, 107459, 102719, 64074, 43519, 41335, 75493, 77266, 58317, 87652, 101815, 132288, 116813, 102444, 100927, 81920, 53028, 1246, 6777, 49541]
14117D9541L278l7063M477l6057n738P7585M513j8206q298n8017l877L7661L4364
14104D4163J9379q470m3844M9234m3752J6875L0248j1595j0010N999K0739k5863
14092D3103J4798n2633o924J2358j5256J1705O0160J2599k3880l9039n0633L6587
14080B945M0744k9132J0546M4305j3422j03888N8293P1280r887l8789l7448q202
14068a2655J917r258M3276N0043L3126K8462J0348m8665k2560m4801j5236P4763
14056H8760J842j02703k1153k5255p212N848l673N1862N8815P2572j0489o4604
14044D4610l0131k2679o3866K263K5978j730K9438M4148k4445k2250M5832M9094
14032G6262N14j6084n8620j1597m1949k3367k2737N8240k3021n129M3776L9328
$$ y = [49541, 52819, 15756, 20233, -15824, -21562, 56023, 60536, 42330, 34032, -23985, -27862, 9799, 44163, 63542, 55072, 11228, 60462, 16710, 33585, 63833, 52238, 42228, 48227, 68966, 43103, 57901, 5268, -1656, 10702, -4554, 7151, 67311, 79910, 56030, 16991, -33642, 2945, 43689, 14557, 25103, 69408, 55986, -47902, 10391, 81671, 71784, 32995, -4453, -12655, -10738, -19996, 23280, 73323, 106449, 134911, 145259, 96594, 74034, 29233, 13997, 88760, 90602, -12101, -33254, -58509, -65721, -59873, -63546, -11684, 47131, 119703, 109214, 44610, 14479, -8200, -72066, -69803, -43825, -45555, -16117, 28031, 3586, -18664, 27168, 76262, 76776, 60692, 2072, -9525, -51474, -74841, -97578, -39338, -62359, -67488, -23712, 15616]
14020A5616L5342k8961J5929k1131j6761k6506K80N5347J6100p7925j02391N1593
14008h3468P0342l7917K0416j6053j9912j0966J087K7598Q076K3910P1834J5602
13996G0549R19J0184o0145l1505J5957N2440R820o8278M469L585L0645J3409q396
13983D3653L7537N494l6403j8339k1990Q847K9422K6837m2610p6691J9343M5066
13971B0166j1545p847l1662M2804J5321k3755J6502J8023L4562q942l6943j871
13959B4813J5661K5959L9001m013o5576k6523M0202l2401j4831o5909P7490N2448
13947F6321k3534j5541N3083K0315M7137N00L1794n6451p1122k1843k2874l409
13935D376j7282K1117K724K0905m054k3786k6792k1862M9803O918l56p938L72
$$ y = [15616, 50958, 21997, 37926, 16795, 34, -26472, -26192, 29155, 45255, -32670, -135061, -83468, -13126, -51043, -30627, -46680, -66592, -77558, -76471, -48873, -40797, -16887, 54947, 70549, 71468, 81652, 21507, -9998, 5959, 58399, 68219, -59, 4410, 7995, 38640, 52049, 43653, 81190, 86684, 50281, 31942, 9952, 18799, 48221, 75058, 32448, -44243, -24900, 20166, 8621, 774, -30888, 11916, 27237, 3482, 19984, 38007, 72569, 63627, 26684, 24813, 40474, 66433, 105434, 101421, 35845, 9322, 49524, 17123, 2292, -63617, 13873, 66321, 42787, 27246, 80329, 100644, 147781, 148281, 180075, 123624, 52502, 30659, 7785, 4376, -12906, 8211, 10935, 31840, 27786, 4000, -22792, -44654, 5149, 12067, 11711, 3773, 4145]
13922D145M6850N3748m2711m6017P557P9713K0233m8969n0557j3045k3527N3540
13910D0960O3701l8006l9203K8714l0618l9635P409M5050P0847l703l102k7935
13898G4479m7027l043P4349j7513j3840Q1591P244k757j5629l1778J9680n0430
13886G5326n1949K2989K6180n1014l1686M2784Q9566k181p1481k9399R17o42j8002
13873A408n0016K7501l8624L939M6583J4887L3194o0032K0655P9026l3191J7233
13861F2563l7598J1667l736k221N5931M6406m4316Q156L4557m9261n5263m3929
13849a7044L3430N5227j3590n4701n2390K653N3133L6329k9286J1552M1619Q738
13837G5670k9596Q370J5195K862k5161R453O6110M2410Q896o4485k418J750j2768
$$ y = [4145, 50995, 104743, 62032, 16015, 23572, 103285, 123518, 74549, 23992, 10947, -12580, 40960, 104661, 66655, 27452, 56166, 25548, -14087, -6678, 38372, 109219, 105516, 102414, 74479, 27452, 24409, 98758, 81245, 67405, 148996, 156240, 153483, 137854, 106076, 125756, 75326, 23377, 46366, 72546, 21532, -10154, 32630, 122196, 120015, 48534, 19135, 20052, 19410, 1408, -48608, -21107, -59731, -55792, -9209, 5678, 38872, -21160, -505, 78521, 45330, 62563, 24965, 36632, 32896, 30675, 86606, 133012, 88696, 96852, 131409, 82148, 26885, -17044, 16386, 71613, 58023, 3322, -49068, -46415, 6718, 43047, 13761, 25313, 66932, 75670, 46074, 54444, 69639, 72501, 47340, 56793, 122903, 165313, 174209, 109724, 107306, 109056, 96288]
13824I6288j3526l8203l5262O7458j4297n2073p215K6368n764j1191P5880J4239
13812A02702M6418R32n9106p5635m2970m5674n447L0671L5057k6092j5716J8399
13800c6461j6870o915p534K0308K6166L5423L289m1380L8253L5293L658L8375
13788I1605J526P322M1699M750l2313k0339n3496J1588M1054J7018l1816o00p14
13775G7284J0302k0358L6172m612j2817o5027o7244j9441m346o268p1561K6782
13763a21134R1531M8654J1214l474J6917j5816N625j5837o675N105r61k5333m56
13750a0640q100N848n3553K8007L7012K2788K8715J8174j0227m6730J906j8819
13738e619O619K0983M974O374O4549P48j5992m2337m6353K8532m1809J9189N9795
$$ y = [96288, 82762, 44559, 9297, 76755, 62458, 10385, 3170, 29538, 23774, 12583, 88463, 102702, 149120, 150052, 90946, 15311, -27659, -73333, -78780, -48109, -13052, -39144, -54860, -36461, -53331, -60246, -67780, -47472, -21306, 14117, 17406, -23974, 14279, 49572, 53230, 91605, 93131, 100453, 142152, 146902, 114589, 94250, 40754, 52342, 93396, 110414, 78598, 77998, 77284, 87586, 67228, 103400, 98788, 85971, 20944, -46300, -65741, -70087, -76355, -147916, -121134, -29603, 19051, 30265, 26791, 43708, 27892, 33517, 17680, 11005, 16110, 15149, -10184, -10640, -18740, -12892, -66445, -38438, -1426, 21362, 50077, 68251, 58024, 11294, 13200, -5619, 1000, 21983, 26957, 33331, 97880, 98628, 82636, 40299, -6054, 22478, -19331, -142, 59653]
13725E9653J7821M8499k2310p6505k224L3584N7974L2811j4678k4609n3798p0550
13713a4332k6534j9345L6922O1705L2818j3242Q813l916j4517j921L3215j2684
13701F6982m0722m1829J2088K1960r3997r3150M7589O6848M7592k9618j5908m718
13689e6883K6136O3119N971Q385N9118N2299n797k7226P6832n1899n6819j5796
13677G7440K6308p288m4763j5751o1620n705J7697L3415M4383k2865l0124n2175
13665d1048k0049j3780J381k0725M1141O0310O1257O2882k480l8265k0487r721
13653F0416k2930j8923k809q133P3066J473K0251J7331q093k771n644p6183j3815
13640A3236j3424K4856k2962j1998K2118L2274K3523L4581J4368K2386J1841k1343
$$ y = [59653, 77474, 125973, 103663, 27158, 24934, 58518, 116492, 149303, 134625, 110016, 56218, -14332, -40866, -60211, -23289, 38416, 71234, 57992, 66805, 62889, 48372, 46451, 79666, 66982, 26260, -15569, -3481, 18479, -75518, -168668, -121079, -54231, -6639, -36257, -52165, -56883, -30747, 32372, 38343, 46728, 105846, 158145, 152348, 125122, 201954, 150055, 93236, 77440, 103748, 96460, 51697, 35946, -25674, -31379, -13682, 19733, 64116, 41251, 11127, -41048, -61097, -74877, -73496, -94221, -53080, 7230, 68487, 131369, 128889, 90624, 70137, 60416, 37486, 18563, 15754, 7621, 80687, 82160, 102411, 119742, 111649, 108878, 103234, 27051, 13236, -188, 24668, 1706, -10292, 11826, 44100, 67623, 102204, 116572, 138958, 150799, 129456]
13628A29456q554l4387j8105j7308j2179O7088P53O101O8508L5899l9394q8205
13616H9673n0809o0533P663L7472j0939J9391k4060o263L0537l8816J6646L9214
13604D9176L1899R531j308j935o436p238J0886o7571p4530O1940Q5707L3277p2361
13591E1037n9551L0673j317m4405L0864M8337m612J5381N7618N2505l9245p5958
13579F1327J9455k3248J0474L8194n4847j5757q525J187K2406J0730N322o763
13567E9955Q748k8794j9920J6425K0289J2952R369K1846P0823N1953k3633n1169
13555A48844p4043j8026k9843k6438O3419M5786q988J4911n6400m6180l9849k1327
13543d8134J8488K5942j0610J4192K4783J0938l513L5491K3444j3676l0571l579
$$ y = [129456, 120902, 86515, 68410, 51102, 38923, 106011, 106764, 112865, 181373, 217272, 177878, 89673, 38864, -21669, -14006, 23466, 12527, 31918, 7858, 1595, 32132, -6684, 9962, 49176, 81075, 90606, 89298, 87363, 80927, 73689, 84575, 17004, -57526, 4414, 90121, 123398, 51037, -8514, 22159, 20842, -23563, 7301, 55638, 51026, 66407, 124025, 176530, 137285, 61327, 80782, 57534, 68008, 106202, 51355, 35598, 27073, 28260, 50666, 61396, 66718, 59955, 68703, 39909, 19989, 36414, 56703, 69655, 79024, 100870, 171693, 223646, 200013, 148844, 74801, 56775, 26932, 494, 63913, 109699, 100711, 115622, 59222, 13042, -26807, -48134, -29646, -3704, -14314, -122, 24661, 35599, 32086, 67577, 91021, 77345, 46774, 43195]
13531D3195k3302j1300M4774R028K7457j0963K9847N7244l8929n9721j0442Q312
13519F5200O7504m1870l204j6789j4202P373k2621q684K1539j6003k1671Q7094
13507A03666K7914n6070m7717L9316k436r1624l418O2666N7999m0552n7364l261
13495a0881P755K7995K6154j2660l363j9879M3823K9187j0890n068k2090q8018
13483c7935N3609J54j6986M8437R27N072n798J0080p4065l3975k4150K2503P0812
13470A8685N1699j6165m0091p613K3938P094J4311N248p4325j6591K9411N2227
13458D7828j7646J4861K0148J7231j6976j7924j5408O887j8996l568l1957K5304
13446I784J8973K2609j719K0373j1488K0716L3000J7080k0011m3686k1271q889
$$ y = [43195, 19893, 8593, 53367, 62395, 89852, 78889, 108736, 165980, 127051, 67330, 56888, 65200, 132704, 90834, 87630, 70841, 56639, 64012, 41391, 32707, 54246, 38243, 16572, 103666, 131580, 75510, 27793, 67109, 64673, -26951, -30369, 32297, 90296, 49744, -7620, -10881, -3126, 24869, 51023, 38363, 35000, 15121, 58944, 88131, 77241, 72173, 50083, -37935, 15674, 15828, -1158, 47279, 48206, 53278, 47480, 57560, -16505, -50480, -74630, -52127, 18685, 70384, 54219, 14128, 6515, 30453, 37547, 51858, 57106, -17219, -33810, -4399, 47828, 30182, 45043, 65191, 82422, 65446, 47522, 32114, 39001, 20005, 16437, -15520, 9784, 28757, 51366, 49647, 70020, 58532, 79248, 112248, 129328, 109317, 65631, 44360, 35471]
13434C5471K3842m953J2702j215L1435K7532o7466m9558Q1316L6538m3855K0403
13422A02192r416k1904l6077L1909K0836k8217k2281j1805P662M7412K3343q7505
13410A6149j8696Q2107P8425n776j4416M1702l7667p1123o407K9769P834o817
13398I5084k018m3125j0051M941O4823K8316p5445p1922k4588J6998N9620J23014
13386A65647j5841m8500P637k2286q6591o019L9459L5409O0749J2769m4770j2717
13374H4946K6523J6254O4428k2288j7786k2581p505n8433J1596j4647j0795n645
13362D4067K0886J5872j8094k6845K9705k4895k7742J7000O6100J6501l4806k9493
13350D8256J9480L2722K4788n0940n7826m9190k2828Q4074M9326p19k9880j1059
$$ y = [35471, 59313, 54360, 67062, 65847, 97282, 124814, 57348, 7790, 89106, 125644, 81789, 102192, 92776, 70872, 34795, 66704, 87540, 59323, 37042, 25237, 32899, 80311, 103654, 16149, -2547, 79560, 157985, 152209, 137793, 179495, 141828, 70705, 64298, 94067, 101901, 95084, 93066, 49941, 39890, 44831, 109654, 137970, 62525, -9397, -33985, -16987, 42633, 165647, 149806, 101306, 108943, 86657, 66, -5953, 33506, 68915, 129664, 142433, 97663, 84946, 111469, 127723, 192151, 169863, 152077, 129496, 121991, 63558, 75154, 60507, 49712, 44067, 64953, 80825, 62731, 35886, 65591, 40696, 12954, 29954, 96054, 112555, 77749, 48256, 67736, 100458, 125246, 74306, 16480, -32710, -55538, 28536, 77862, 77143, 47263, 36204]
13338C6204K2200l8862m8222m14K0647Q1308M5689J7311J7469l6495q5152n7674
13326b5991R6712Q4989J5784M567j1568k9696p7005q2947K3467L0326M5151N5312
13314A29101Q98m6623j4460m3395q392K8636M38l8842K9241K2838L0121O9944
13302A59505j2329k5440m5782l6134N2038K9586J4173M7588j3522r0712n3954
13291B5017K1456L6382m5036j5992J8941J5118L5377J1920K1940M717m2719m5884
13279D1237j4218O263M9089j4445j8210j1721m258Q950L5978K2612m8401j1516
13267D1360K103K0633J7708M971J2321n365n1440J4152J882K4101l2066l0516
13255A9844K1132K3694j8684j7637L1326r883J4138L2615j8180r115j2515M3585
$$ y = [36204, 58404, 19542, -28680, -29094, -8447, 72861, 118550, 135861, 153330, 116835, 31683, -25991, 70721, 155710, 171494, 176061, 164493, 134797, 57792, -25155, -1688, 28638, 73789, 129101, 129999, 83376, 68916, 25521, 17129, 45765, 46203, 7361, 36602, 59440, 89561, 159505, 147176, 121736, 75954, 39820, 91858, 121444, 135617, 183205, 169683, 78971, 25017, 46473, 82855, 37819, 21827, 40768, 55886, 91263, 103183, 125123, 129840, 87121, 41237, 27019, 33282, 82371, 67926, 49716, 37995, 33737, 42687, 78665, 101277, 52876, 41360, 43463, 64096, 81804, 86775, 99096, 93731, 42291, 56443, 58325, 82426, 50360, 19844, 40976, 64670, 45986, 28349, 59675, 49792, 63930, 96545, 78365, 69250, 56735, 100320]
13243A00320K1837j3324l9925J4853k870m6451R598K0263q7177N3237Q0198j3233
13231I7326p818J0683k118l6206l4790l5291j5709N1370N4701Q615k578k525K224
13218H7884m6099n9865M2143L1794k9323J6757Q887J7747k8572J6747K8441O640
13206I3181j9712j1773Q883m12j9769M1386K2863r4518L732j4526K5834J8386
13194E3555J7556j0899n4695n1827l7301l6499L7182J17608R2967n9778J2230
13183H0099K4973k9164j6836L5260M7622l205l3037J7342j0620k5906J5122j5767
13171H5883j6229n735q457m69o1189N4526P6918J8496m2767l0977p27J8936K4021
13158A12230n1061n4744n2222K5979K1435M7329Q5064J8932o014n7196k4057M3999
$$ y = [100320, 122157, 108833, 68908, 83761, 80891, 34440, 44038, 64301, -22876, 30361, 110559, 97326, 89508, 100191, 98073, 61867, 27077, -8214, -23923, 27447, 82148, 90763, 88185, 85660, 87884, 41785, -18080, 24063, 55857, 26534, 43291, 52178, 69925, 41353, 58100, 86541, 93181, 73469, 61696, 70579, 70167, 50398, 91784, 114647, 20129, 23861, 9335, 35169, 53555, 71111, 60212, 5517, -46310, -83611, -120110, -82928, 34680, 127647, 67869, 80099, 105072, 75908, 59072, 94332, 141954, 138749, 105712, 123054, 112434, 86528, 101650, 85883, 69654, 63919, 55462, 54993, -6196, 48330, 125248, 143744, 100977, 70000, 69273, 88209, 112230, 61169, 6425, -45797, -19818, 1617, 48946, 134010, 152942, 146928, 89732, 65675, 109674]
13146A09674K0893R2749M4931k2368k7149l738o2147m0511k3666l0732l3632N0409
13134G4713P7432m7541m6701M9440k7055k8691m093r582J5636j4745k9623l2015
13122b2825j4292J7425L2591L11j849L6072K4763k7433m3024l2344l3854J7752
13110d6707J7735j3436R9351L3083l0337j7851j7388j310K4637L2319K4864L9455
13098A44415K2001m6107n599j1428j7892L3631M1906J9070l3634l4104k4898k1307
13086F6054q498M785k5792l1719j996K3208O1391O7115m1002k8198L6679q945
13074A13082r061R149l8571l968M294r532K2128K8526R334L1208m0958k2860r417
13061H3354L7857j6800l4792M5073J9128J2366m3477j0908j8794j4190k1668J6743
$$ y = [109674, 130567, 223316, 268247, 245879, 218730, 214992, 152845, 112334, 88668, 57936, 24304, 74713, 152145, 104604, 57903, 107343, 80288, 51597, 47504, 37922, 53558, 38813, 9190, -22825, -37117, -19692, 12899, 13210, 11361, 47433, 72196, 44763, 1739, -30605, -64459, -46707, -28972, -42408, 56943, 90026, 59689, 41838, 24450, 23140, 47777, 80096, 104960, 144415, 166416, 120309, 114710, 103282, 85390, 119021, 160927, 179997, 146363, 112259, 87361, 66054, 57556, 62341, 36549, 4830, 2834, 26042, 87433, 154548, 113546, 85348, 122027, 113082, 104021, 113170, 74599, 70631, 74925, 65393, 87521, 116047, 125381, 156589, 115631, 92771, 83354, 121211, 104411, 69619, 114692, 133820, 146186, 102709, 91801, 73007, 58817, 37149, 53892]
13049E3892M3910j9693p0571n3728P761J20474m8306n3542L879q191L3335M7858
13037E7078Q156L437L2106J0764j8791j023q227o2693k7035K0660K30M9130L5203
13024I8995M162r738O8366R3709m5332l7516m4148m2748K0716J297k2657M747
13012H9853k1996k180K1683J0728K2686K5630p5528l3978R4187M0047p7030k0006
13000G4096N9753K5944j049J8908k9570r4309m9387k0219M6693l1495n602M3506
12988C7269K1187J0704N182J7182J8200J14511L8718j13985r7147J2132m279q532
12976E1142K0092O180j796J8958N3161p073j6194l09j0921k5725J6955j9643K376
12963H7203k2674K0261k1433K4425K8368M0806k6415j6056k2330r079k5537K4984
$$ y = [53892, 97802, 78109, 7538, -46190, -38429, 82045, 33739, -19803, -15924, -24115, 9220, 57078, 65234, 68671, 100777, 111541, 92750, 91727, 83500, 20807, -6228, 14432, 14662, 63792, 98995, 103157, 93419, 161785, 255494, 210162, 172646, 128498, 85750, 106466, 107763, 85106, 89853, 67857, 65677, 87360, 98088, 120774, 146404, 70876, 36898, 131085, 171132, 94102, 74096, 133849, 159793, 158744, 177652, 148082, 53773, 4386, -15833, 30860, -635, -6237, 37269, 58456, 69160, 74342, 91524, 109724, 224235, 262953, 148968, 51821, 63953, 59674, 51142, 71234, 77414, 75618, 94576, 147737, 140664, 124470, 124161, 113240, 87515, 104470, 84827, 87203, 64529, 84790, 63357, 87782, 116150, 156956, 130541, 114485, 92155, 83076, 57539, 82523]
12951H2523R455P79M9290j2243p8905j4656K6021l7185l8165j0782L2075P1027
12939G9234l2977j4110p315j4883J5228J8404O7091N5032j6960j0317m3469M229
12927I9187P2727K7263K315K541n303L6768j7664l7308l0578K646K5784R613l8703
12914A49288j6021j9937K0593K7457r742L1242j5395j5024P95m0397l939N0548
12902A59468j3932k3175k0571q7087Q979J03679m937m5933M3684r954l6263j6607
12890E7351M1809N2678J3991K8566O6083L48L4163K3297j6907N2661J14636P2030
12878E40706L3085o113k6129l4456j2596k7219p3452L4848R9289M904p1868m7985
12866D13014l0925K7335r566l6272K5713J3261M3236O5814L837j2857N9145l778
$$ y = [82523, 91978, 92757, 142047, 129804, 50899, 36243, 62264, 25079, -13086, -23868, 8207, 79234, 46257, 32147, 24832, 9949, 25177, 43581, 110672, 165704, 148744, 138427, 94958, 99187, 171914, 199177, 201492, 204033, 198730, 235498, 217834, 180526, 149948, 152594, 178378, 187991, 149288, 133267, 113330, 133923, 161380, 151638, 182880, 167485, 152461, 153256, 112859, 108920, 159468, 145536, 122361, 101790, 14703, 23682, 127361, 122424, 76491, 120175, 110221, 73958, 57351, 99160, 151838, 165829, 194395, 260478, 260826, 294989, 318286, 301379, 354040, 468676, 540706, 573791, 567678, 541549, 507093, 494497, 467278, 393826, 428674, 527963, 532867, 460999, 413014, 382089, 409424, 399858, 363586, 389299, 402560, 445796, 511610, 515447, 502590, 561735, 557957]
12854E57957j1480Q289N908K2308L6348J6655L9346M0551l6960m3752k0691n1010
12842E63469l5212J5999L575j5010k376J7885k8214L293l2453l7961K178p5586
12830C79587r5117l862Q058j4990j0947P5868L8967n192O5939L5306M0207M9422
12818E63246k3923J4370k7947l5051r4068l0564j345l6010n0846J3083J8442r812
12806B99575j08071l4144N0685K0677l31n7137m1208K6189N0215J07136j2232
12795C01354m1757j0092l1057m7421J4374j1045k1406K6830M3314M1805K4843
12784B89742o4055o0424k5049j7315k1652j2321M310l6538L3350K2056K8431l1068
12772A09467o9277J4818Q7415N0426K586p8049k6641N9588k2425m7611l5981N687
$$ y = [557957, 546477, 554766, 560674, 582982, 619330, 635985, 675331, 715882, 678922, 635170, 614479, 563469, 528257, 544256, 547831, 532821, 530445, 548330, 520116, 523409, 490956, 452995, 455173, 379587, 284470, 280608, 288666, 273676, 262729, 338597, 377564, 372372, 438311, 473617, 513824, 563246, 539323, 553693, 525746, 490695, 396627, 366063, 364718, 328708, 277862, 290945, 309387, 299575, 191504, 157360, 208045, 228722, 228391, 171254, 130046, 156235, 206450, 313586, 301354, 259597, 249505, 218448, 171027, 185401, 174356, 152950, 179780, 223094, 264899, 289742, 225687, 165263, 140214, 122899, 101247, 88926, 93236, 56698, 90048, 112104, 140535, 109467, 40190, 55008, 142423, 192849, 195435, 117386, 90745, 150333, 127908, 80297, 44316, 50003]
12760E0003K0832l4902M4280k6092K9011K7230k2809K9204j1816R477j0408p7673
12748B6337j1767J8418j6570N0943O4080M8725p325l5972j3906P1632P4537n4566
12736B14566l2440j6845j3734r658n793L9019j4773J021K2992l727r122j6165
12724A55341l0070K345k529N7537Q484J7430l8374j2759J5877J9303l0839m8577
12712A13169k9104O4409O5250Q865P661P4454k0635m5817K9215K1912K0986P307
12700C17672l3369k9373K3941n5197L9665J25860N7348q363k490K5011N7391J37087
12688F55183J89445J29810j2785n8174j30308j36669o7387n3733q1414o3045l8768
12677C32155j4833M772N1196p070k0969l2369k0969o0102m4256J9956J1030K2428
$$ y = [50003, 70835, 35933, 80213, 54121, 83132, 110362, 87553, 116757, 104941, 114418, 104010, 26337, 14570, 32988, 16418, 67361, 131441, 180166, 172841, 136869, 122963, 194595, 269132, 214566, 182126, 165281, 151547, 141889, 136096, 175115, 160342, 161363, 184355, 180628, 171506, 155341, 125271, 127616, 125087, 182624, 191108, 208538, 170164, 157405, 173282, 192585, 161746, 113169, 84065, 148474, 213724, 222589, 230250, 304704, 284069, 238252, 267467, 289379, 310365, 317672, 284303, 254930, 278871, 223674, 263339, 389199, 446547, 438184, 435694, 460705, 518096, 655183, 844628, 974438, 961653, 903479, 773171, 636502, 569115, 515382, 433968, 370923, 332155, 317322, 322094, 373290, 366220, 345251, 312882, 291913, 231811, 187555, 207511, 218541, 240969]
12665B40969M368R60m7444P285m1912P407M0265J642j8020l7846N1814Q8811L2229
12652C30528M2826o3930k4180J4495j6268L7934j2605j8927k0302n4212n5721
12641A59638R906N2247K628K0562K3783L2272J341r815J5883o868k6574o0386
12629B14617L866Q6801j0873m057k0445r2927k1950Q4765Q3226L7727K950J9960
12617C83660J3625k8083L2393J7106j0677j4966m9542j933n721J1818j633l1558
12605C14489n048q302L0164M7772M8356l2653l0519j9858k44l0498l3189k6131
12593B54339J3337J8293p565K7979P992l2758m8033o2887K2496R3096L1421o6396
12581B51314l4944M4364P0193Q475K9004m1314m9810K6182Q114p4120L7699N1662
$$ y = [240969, 245337, 246297, 198853, 206138, 164226, 171633, 211898, 213540, 195520, 157674, 209488, 298299, 330528, 373354, 309424, 285244, 299739, 283471, 321405, 308800, 289873, 269571, 215359, 159638, 169544, 221791, 224419, 244981, 268764, 301036, 302377, 292562, 308445, 301577, 275003, 214617, 218483, 305284, 294411, 290354, 269909, 176982, 155032, 239797, 323023, 360750, 363700, 383660, 397285, 369202, 401595, 418701, 408024, 393058, 343516, 341583, 335862, 347680, 346047, 314489, 309441, 301139, 331303, 379075, 427431, 394778, 364259, 344401, 344157, 313659, 280470, 254339, 267676, 285969, 278404, 306383, 314375, 281617, 233584, 170697, 193193, 286289, 317710, 251314, 216370, 260734, 330927, 339402, 368406, 327092, 277282, 303464, 311578, 237458, 275157, 326819]
12569C26819p488J1104J736p39k8822n8462L7848O5253L1440n8828n7373P6072
12557C38560P4591k3285L7091O4134J6866J9J5958J5142P4439J1653R463n2883
12545E81748k5750K02j1748k963J8999Q4903K0826j4232R863k5984o0278j9617
12533E55969N6932l2420l582j6883l3559j3786R9835Q9281j6323n0987J8613j0465
12521F42625n0211K678J6406l5708j5833P2172n727M1838k217o1373j8665J5285
12509F01270K1162L6264r372p331L6163L2197J4529m7527l1899J7592M078L3617
12497G00743N5252j4378J96R2503R0278m2045o362L2069J6193K7611L5566M518
12485I92144k4518L4325k249o117l5157N6649K6187l8793M0362O7915L7425l718
$$ y = [326819, 319331, 330435, 332171, 331432, 302610, 244148, 281996, 347249, 378689, 319861, 262488, 338560, 413151, 389866, 426957, 491091, 507957, 507976, 523934, 539076, 613515, 625168, 634631, 581748, 555998, 556200, 544452, 541489, 560488, 645391, 666217, 651985, 661848, 635864, 575586, 555969, 612901, 580481, 576899, 560016, 526457, 512671, 612506, 701787, 685464, 634477, 653090, 642625, 592414, 595092, 611498, 575790, 559957, 632129, 626402, 668240, 666023, 604650, 585985, 601270, 622432, 658696, 649324, 641993, 678156, 710353, 724882, 677355, 645456, 663048, 667126, 700743, 755995, 741617, 741813, 834316, 924594, 882549, 876187, 908256, 924449, 952060, 987626, 992144, 967626, 1001951, 999702, 993585, 958428, 1015077, 1041264, 1002471, 1042833, 1110748, 1148173, 1144455]
12473A144455m677J5112P1877Q236k5685L3424O0594K4746N5536Q6744J07133
12462A577495J3616k1565K8881P0134Q3075R5288P6279L5713J07209J62615N9231
12451B287971J02308Q6681J49219J82991J31139K17436K71977K91372K70450K84362
12441D275906L15636M14855N22390N74843O94451P34540P82704R54494J233467
12432A0503286J522567J913400K537025L285099M218295N542544P225734R203631
12424D5951581J1091532J1956772J0786427P304548K020725l363025p404532r376672
12416F8967356r362998q280835o605325m787370l271364k014589p69619M24134
12408C4299390J626310K857738M124962N312100O067704O128889N409721M160017
$$ y = [1144455, 1139778, 1154890, 1226767, 1235003, 1209318, 1242742, 1303336, 1328082, 1383618, 1470362, 1577495, 1591111, 1569546, 1598427, 1668561, 1751636, 1846924, 1923203, 1958916, 2066125, 2228740, 2287971, 2390279, 2476960, 2626179, 2809170, 2940309, 3157745, 3429722, 3721094, 3991544, 4275906, 4591542, 5006397, 5528787, 6103630, 6798081, 7532621, 8315325, 9269819, 10503286, 12025853, 13939253, 16476278, 19761377, 23979672, 29522216, 36747950, 45951581, 57043113, 68999885, 79786312, 87090860, 89111585, 85748560, 78344028, 68967356, 59604358, 51323523, 44718198, 39930828, 36659464, 34644875, 33875256, 34299390, 35925700, 38783438, 42908400, 48220500, 54288204, 60417093, 65826814, 69986831]
12400F9986831K833732J921659J675370K071085L059441M147270N017906N116217
12392I5829511M022447J807091r58533l492742n218495n919487n607317m547575
12384G5914900l169810j610677l82745L06393K91668n45732k039761l638517m940125
12375F0185594n411937n158000m255653l114174j824618m60210R02953K444933
12367D3308888M175292O180001Q366530J0357033J1318261J0522164P204127J589240
12359A03021536m641179r656031j2299022j2674935j1414651r528089p622224
12352C5185405n954950m574139l512203k780385k217690j704226j421742j164186
12344A1855884r71622q34774o75232n03889m11943m14851m83725n36893n19137
$$ y = [69986831, 72820563, 74742222, 76417592, 78488677, 81548118, 85695388, 90713294, 95829511, 99851958, 101659049, 100700516, 97207774, 91989279, 86069792, 80462475, 75914900, 72745090, 71134413, 70751668, 71058061, 71349729, 70803997, 68764236, 65125719, 60185594, 54773657, 49615657, 45360004, 42245830, 40421212, 39961002, 40863955, 43308888, 47484180, 53664181, 62030711, 72387744, 83706005, 94228169, 101432296, 103021536, 98380357, 88724326, 76425304, 63750369, 52335718, 42807629, 35185405, 29230455, 24656316, 21144113, 18363728, 16146038, 14441812, 13020070, 11855884, 10884262, 10049488, 9374256, 8870367, 8458424, 8043573, 7559848, 7022955, 6503818]
12335F503818n21742m70502m17506l79334l80095l58275l20473k03316j67445
12326C285130j86577j76921j82802j50175p0726o0455q8053o8375o6557j09702
12316B124787j32944q7111r0413p1985k0846l9362j04818l8574k0552j10881q5755
12305A321546m8339l3601n4591m7267j5910q946l3868n4749n470J7388J0708j8338
12293A028563m5432K3222j8738o9036r3595J6048j3067O842j4954q7156k8963
12282G03734r013k3519L0026r095k6532j4180M8103k74j3580l5993J4643k3141
12270F41179O406J3898p540r482j904j0378n1267l7991k9049K1493M2574n2785
12258E25154J0383l4263p0442J4354j958N166P75K3735O4133N6871J980j7868
$$ y = [6503818, 5982076, 5511574, 5094068, 4714734, 4334639, 3976364, 3655891, 3452575, 3285130, 3098553, 2921632, 2738830, 2588655, 2517929, 2457474, 2369421, 2301046, 2234489, 2124787, 1991843, 1904732, 1814319, 1742334, 1721488, 1682126, 1577308, 1538734, 1518182, 1407301, 1321546, 1273207, 1239606, 1185015, 1137748, 1121838, 1112892, 1079024, 1024275, 1018805, 1036193, 1046901, 1028563, 983131, 1006353, 987615, 918579, 824984, 841032, 827965, 834807, 819853, 732697, 703734, 694721, 671202, 701228, 692133, 665601, 651421, 699524, 699250, 685670, 649677, 664320, 641179, 647585, 661483, 653943, 644461, 642557, 632179, 580912, 542921, 513872, 535365, 577939, 525154, 535537, 501274, 430832, 445186, 443228, 448394, 449169, 472904, 537037, 593908, 595888, 578020]
12246E78020J3796L247J9151M8264k0626k9007Q7658m3048k9857P300j25433q7265
12234D22200m3267k9112M190j1345J9230n6616k0999J3267P9906K8123j6950j8717
12222C69910m0592J0877j4341k1431r135k452J6505M0416J5378r7745l1906L7284
12210B72768J8253K1685K7715j4206L5291Q9733k0240l8008k4561n6997K4403
12199C35836L749m1701o6703j3413L6878j6556L2982k9K1954J1617j4033k4123
12187B66458k8255Q979L405Q0267n678j05k3695p8344j6849L5678p87j9412K1104
12174B42766k0531O1982L5209L3927j4081n1453j4983n3644k2216N1194N7570
12163C05740j6690K8362O3600P8372P3218N2196j08719q1130l6371l3298J1588
$$ y = [578020, 591816, 595063, 614214, 662478, 641852, 612845, 700503, 657455, 627598, 634898, 509465, 422200, 378933, 349821, 354011, 342666, 361896, 305280, 284281, 297548, 377454, 405577, 388627, 369910, 329318, 340195, 325854, 304423, 295288, 292836, 309341, 349757, 365135, 267390, 235484, 272768, 291021, 312706, 340421, 326215, 361506, 451239, 430999, 392991, 368430, 311433, 335836, 339585, 297884, 231181, 217768, 254646, 238090, 271072, 271043, 292997, 304614, 290581, 266458, 238203, 247182, 250587, 330854, 325176, 325071, 301376, 223032, 206183, 241861, 241074, 221662, 242766, 222235, 284217, 319426, 353353, 339272, 287819, 272836, 219192, 196976, 248170, 305740, 289050, 317412, 381012, 459384, 532602, 584798, 476079, 394949, 358578, 325280, 336868]
12152C36868n7930K5357J869k3708j5027o7835k0930O8746M7950J4443k4601M9311
12140C34513J6782j398l0431J6909p9263l1039K0529P5581K3502m4189J728n3537
12128B49687q2401m778K9325K2686L6691m9679n7685M2022j6320N182N8403Q719
12116B41852j9794k4040N7884L2833m0861o5207j696L5426l8588K7022L0988l0579
12104B05240q751j1643J4786K4400j3789J1707Q4722K2667j6232k4624j4743p256
12092B66484P781L9199l3577m4233j5652k5706L700J7860L8744N655j7128k2196
12080B20931n3300j5425j2423N1907M7393m1398l9614N3562M1359l3047n8752
12069A61193M0184L2364K6977M69j2708l1545J6450J8006N4988K649j0558j2045
$$ y = [336868, 278938, 304295, 306164, 282456, 267429, 199594, 178664, 247410, 295360, 309803, 285202, 334513, 351295, 349897, 319466, 336375, 257112, 226073, 246602, 322183, 345685, 301496, 303224, 249687, 167286, 162508, 191833, 214519, 251210, 201531, 143846, 185868, 169548, 174730, 233133, 241852, 222058, 198018, 255902, 288735, 247874, 182667, 180971, 216397, 177809, 204831, 235819, 205240, 196489, 184846, 199632, 224032, 210243, 221950, 306672, 329339, 313107, 288483, 273740, 266484, 274265, 313464, 279887, 235654, 220002, 194296, 197996, 215856, 254600, 260255, 243127, 220931, 167631, 152206, 139783, 191690, 239083, 197685, 158071, 211633, 252992, 219945, 161193, 201377, 233741, 260718, 261187, 248479, 216934, 233384, 251390, 306378, 309027, 298469, 286424]
12057B86424k482J6643R942N1334O469k4916m5761k4125K8329L6564k9149J3046
12045C22318L7368L8014K4716n2459m794J7136P3328M28j5783M721J14769K13958
12033G73720J45383J09759J31169q353k03262k35909j01274r677j08115j09529
12023C83912j1617n974k3286O784R00l9159j475M3501l3662L984O8949K9354r774
12010D12437j773j5648j1698K646J9669l843K2726K8399j2076O924J9653K4910
11998D92326O069M7382M954l2732k8865l5411M5704L9379L472L439j1471l9165
11986D95081j2915K5879L0159L0642L5402j3731N292O6348J05063N9769j8165
11975H08824P065K4988k5278K067j5159O929L365J3095L0505J19659Q0837Q3729
$$ y = [286424, 283942, 300585, 310527, 361861, 368330, 343414, 297653, 273528, 301857, 338421, 309272, 322318, 359686, 397700, 422416, 369957, 365163, 382299, 455627, 456055, 440272, 444993, 559762, 773720, 919103, 1028862, 1160031, 1151678, 948416, 712507, 611233, 601556, 493441, 383912, 372295, 366321, 343035, 349819, 350719, 311560, 310085, 353586, 319924, 323908, 392857, 422211, 412437, 410664, 395016, 383318, 385964, 405633, 401790, 424516, 452915, 440839, 447763, 467416, 492326, 498395, 545777, 550731, 517999, 489134, 453723, 499427, 538806, 542278, 545717, 534246, 495081, 482166, 508045, 538204, 568846, 604248, 590517, 595809, 662157, 767220, 826989, 808824, 815889, 840877, 815599, 817666, 802507, 809436, 812801, 825896, 856401, 976060, 1056897, 1140626]
11963A140626R8282J05088P0424M0490J07356J36547P5646M2357k8437K3206k1767
11952A789818k6610L3693k8275J6504N948N7019k457N8332L8673M7897J81272
11941B171814J70624J05512J34816J25526J76130K22348K10944K28255L06758
11932C852727L11785K90103K76182L40348L97957M22423M43435M80319M56496
11923G271775O48011Q14244R30438J143010J380696J627516J981767K564251L261778
11914B1623486M207594N647532P821124J1212078J6554324K5295824M0126640
11907A32488602O3931558R2894767R7029477M2515031l1577500p3563643q7119368
11900B36598924p2942660m8436027l0700581j9989054j3514553r563665o964440
$$ y = [1140626, 1238908, 1343996, 1414420, 1454910, 1562266, 1698813, 1774459, 1816816, 1788379, 1811585, 1789818, 1763208, 1796901, 1768626, 1785130, 1791078, 1848097, 1845640, 1903972, 1942645, 1990542, 2171814, 2342438, 2447950, 2582766, 2708292, 2884422, 3106770, 3317714, 3545969, 3852727, 4164512, 4454615, 4730797, 5071145, 5469102, 5891525, 6334960, 6815279, 7271775, 7919786, 8734030, 9664468, 10807478, 12188174, 13815690, 15797457, 18361708, 21623486, 25831080, 31478612, 39299736, 50511814, 67066138, 92361962, 132488602, 196420160, 289314927, 386344404, 428859435, 397281935, 323718292, 236598924, 163656264, 115220237, 84519656, 64530602, 51016049, 41452384, 34487944]
11893C4487944n212818m108811l233564k574536k183342j832017j549495j320867
11885A2472494j133803r75410q51887p35750n61029m18607k97558k50011j15124
11876G133315Q7849K55930M04227M72340M99620N23378N57780N45852M92856L56062
11866A1329209M17m58918p01311q43415r07512r02770r31886q23207p10345o70305
11856D379957n60675m91264m33671k14731k08434k17558j82131j45043n9208j28936
11846A738306l8366P5092m7028l4283j4421n6296p7568r4934j18160q8419j28020
11835A115903j00632M501J4707l7031q3142q3277n6375n5248K2474K5096M5090
11824H12066L14m1524n3538j3496Q72L1935k3521p1788k6348p659l2561J768N0317
$$ y = [34487944, 29275126, 25166315, 21932751, 19358215, 17174873, 15342856, 13793361, 12472494, 11338691, 10363281, 9511394, 8775644, 8214615, 7796008, 7498450, 7248439, 7133315, 7221164, 7477094, 7881321, 8353661, 8853281, 9376659, 9934439, 10480291, 10973147, 11329209, 11329626, 10870708, 10169397, 9325982, 8418470, 7515700, 6583814, 5760607, 5050262, 4379957, 3819282, 3328018, 2894347, 2679616, 2471182, 2253624, 2071493, 1926450, 1867242, 1738306, 1699940, 1775032, 1728004, 1693721, 1679300, 1623004, 1545436, 1450502, 1332342, 1243923, 1115903, 1015271, 1019772, 1034479, 997448, 914306, 831029, 774654, 719406, 741880, 766976, 812066, 812380, 770856, 717318, 703822, 704694, 736629, 713108, 641320, 614972, 607313, 574752, 576520, 626837]
11811F26837J1349K6587p1824k8660K9109k5326q1856o9821p3967l348J8072K854
11799C60006K9977L2271J6989j8500p2512J7967r563j7468N4507m6068p3958K1332
11787B94980N9315O0622q755J1711n4193J3431j309l3701j21497q8350k9909P590
11775A09935J6816N3513J26514O2635j5625K7781l6227j5927n9218n6894Q2179
11764B95482K8693n0475m47Q6835P3296n6470q1553n684L4518q519j7295o948
11752B91433j6078r86k1002o0700k3821J7114N1878J4995M9304L1193N653J8172
11740C57155K849l952m960n8227l4909K6969l7804k0529M8502J8924l9067q4836
11728A70115R270K8677O4901o384L6718L5275j6953j9058N1552L88K9802N212
$$ y = [626837, 638186, 664773, 592949, 564289, 593398, 568072, 486216, 416395, 342428, 339080, 357152, 360006, 389983, 422254, 439243, 420743, 348231, 366198, 356635, 339167, 393674, 347606, 273648, 294980, 354295, 414917, 406162, 417873, 363680, 377111, 375802, 342101, 220604, 132254, 102345, 109935, 126751, 180264, 306778, 369413, 353788, 381569, 345342, 329415, 270197, 213303, 295482, 324175, 273700, 273253, 360088, 433384, 376914, 295361, 289677, 324195, 315676, 298381, 291433, 275355, 274369, 253367, 192667, 168846, 185960, 237838, 252833, 302137, 333330, 338983, 357155, 360004, 356052, 351092, 292865, 257956, 284925, 247121, 226592, 275094, 294018, 254951, 170115, 179385, 208062, 272963, 266579, 303297, 338572, 321619, 302561, 354113, 354501, 384303, 389515]
11716C89515l3680j6927J3784k1575m1171m7744k6041j0229K6930L6162O8878
11705C37902K3716m1718m6397k9294M1444K2535J3811k3946J9820P726j8322j2470
11693B94807J3376J5242q6382l3764M3466M3591p147M2178R2866K599o7209m8448
11681C05175N2947J6211j1822q3313j9491l8248M6984L7435k1671k8657n5875
11670A99675n363J0944j496J6604J7632m8113L716q575k3151N150m6533P271J15892
11657B43653J6491L2834q6j7755N395K3356m506l6169l2782J5791k2390k8707
11645A95125J8954N6599K6726K0898o6541n1265k0258j3542J1947Q0615J8699
11634B77957k2308n7860N677l6429k4944P6796J3836l792O020J4768k737N305
$$ y = [389515, 355835, 338908, 352692, 331117, 289946, 242202, 216161, 205932, 232862, 269024, 337902, 361618, 319900, 273503, 244209, 285653, 308188, 321999, 298053, 317873, 325599, 307277, 294807, 308183, 323425, 237043, 203279, 246745, 290336, 283189, 325367, 418233, 420832, 353623, 305175, 358122, 374333, 362511, 279198, 259707, 221459, 268443, 305878, 284207, 255550, 199675, 194312, 205256, 203760, 220364, 237996, 189883, 193599, 185024, 161873, 167023, 120490, 127761, 243653, 260144, 292978, 292892, 275137, 280532, 303888, 299382, 263213, 230431, 246222, 223832, 195125, 214079, 270678, 297404, 318302, 251761, 200496, 180238, 166696, 178643, 259258, 277957, 255649, 197789, 203466, 167037, 142093, 218889, 232725, 228933, 234953, 249721, 246984, 252289]
11622B52289J5878K3544J7047p831M38O9469L0602k7725j6503J5132K9564m0226
11610C61678J7230L0176m6889j7896L9861M57K6407m811M4757L916L4556l2188
11598D57254n7502l4848N0961N0647O7739k998O0925N3126N033k9512L095J6741
11586F40661j7279M1039N3540L0682M5535J6022o0518n2049Q065K8455K2438o3089
11574F93502k7388R088l5421J5335n8656l8465j0106K3036L9077j679L8977Q0822
11562G28122k5478J2032L8137K9811L855q5412r1931l6159j4528M1388L5291K4061
11550F59189n5480L138Q0365k5895l2815N622k4662k0391L7934l675L1322n1485
11538F03167K4812J12479O0015m3232N8292Q6409J0896J8590O8346Q2543Q2383
$$ y = [252289, 268167, 291711, 308758, 300927, 301365, 370834, 401436, 373711, 357208, 372340, 401904, 361678, 378908, 409084, 362195, 344299, 384160, 384617, 411024, 406213, 450970, 454886, 489442, 457254, 399752, 364904, 415865, 466512, 534251, 531253, 592178, 645304, 650337, 620825, 623920, 640661, 623382, 664421, 717961, 748643, 794178, 810200, 749682, 697633, 705698, 734153, 756591, 693502, 666114, 675202, 639781, 655116, 596460, 557995, 547889, 570925, 610002, 608323, 647300, 728122, 702644, 714676, 752813, 782624, 786479, 701067, 609136, 572977, 558449, 599837, 635128, 659189, 603709, 606847, 687212, 661317, 628502, 634124, 609462, 589071, 627005, 623330, 654652, 603167, 627979, 740458, 800473, 757241, 815533, 901942, 912838, 931428, 999774, 1082317, 1164700]
11527A164700L175k0412j3960n9364o6937N0411L6471j0548K3490N4205l1257
11516A129974K3526O1401k5609N615J03782J17593L4062R507K8288O5155J18289
11505A671583K5811k8478j7851M8657J60996Q0365k3463Q3465J32500J36524J81260
11494B451369J48327J29103J87039J32098J74888K16284K28216J77236K36952
11485D081512L20038L65080M63072M47566N08506O07686O82884Q09865R78237
11476I264446J213032J512656J805952K132283K800538L551668M523380N936329
11468C2740284P533737R376721J1154521J2213769J1506584Q550913L604465j846741
11460I4834253o328600q989534r757835r164118p665407n976682m285366k718821
$$ y = [1164700, 1167875, 1147463, 1133503, 1074139, 1007202, 1057613, 1094084, 1083536, 1107026, 1161231, 1129974, 1153500, 1214901, 1189292, 1194907, 1298689, 1416282, 1450344, 1459851, 1488139, 1553294, 1671583, 1697394, 1668916, 1651065, 1699722, 1860718, 1941083, 1917620, 2001085, 2133585, 2270109, 2451369, 2599696, 2728799, 2915838, 3047936, 3222824, 3439108, 3667324, 3844560, 4081512, 4401550, 4766630, 5229702, 5677268, 6185774, 6793460, 7476344, 8286209, 9264446, 10477478, 11990134, 13796086, 15928369, 18728907, 22280575, 26803955, 32740284, 40274021, 49650742, 60805263, 73019032, 84525616, 93076529, 96680994, 94834253, 88505653, 79516119, 69758284, 60594166, 52928759, 46952077, 42666711, 39947890]
11452C9947890j299593J22122J519667L049064M495015N580418N939222N053582
11444F4407387L288435J173935o51679j591730j492754m02004J448430L802731
11436F9982751O270269Q270852R043795P878365M786426M49604l769207o587626
11428I6325229p652030o911117n105029k983278j220337j26330j78596j371013
11420G0777499l302294n040051o102857o308090n560441m379670k995401j722955
11412C5365740m90372P04528J920200L229677M596621O107021P553948Q533531
11404F7520894Q385883O717799L317776j297997n852363r018648j0297089j0040772
11396D9435483q779809p178332n648578m373147l433550k789448k298529j836421
$$ y = [39947890, 38648297, 38770419, 40290086, 43339150, 47834165, 53414583, 59353805, 64407387, 67695822, 68869757, 68218078, 66626348, 65133594, 64731590, 66180020, 69982751, 76253020, 84523872, 93567667, 101446032, 106232458, 106682062, 102912855, 96325229, 88673199, 81762082, 76657053, 73673775, 72453438, 72327108, 72148512, 70777499, 67475205, 62435154, 56332297, 50024207, 44463766, 40084096, 37088695, 35365740, 34875368, 35579896, 37500096, 40729773, 45326394, 51433415, 58987363, 67520894, 75906777, 82624576, 85942352, 84644355, 78791992, 69773344, 59476255, 49435483, 40655674, 33477342, 27828764, 23455617, 20022067, 17232619, 14934090, 13097669]
11388A3097669j472389j168611j038697r64258q36363o59996n39400n01833m78521
11379E437601l99969l63728l49344l21492k64636k08915j37871j70972j35397
11370C085277j41496j89060j75388r8948m1461r4824p2918p7320o5193j34238
11360A994431j21214p1006L3265q4047p0188r7494o2539p442K6366l0113o4264
11349A445755n3726r5675r4408j5249k3708K6160R308l7314n3837L437K3349p6801
11337A057291j54113n5431R996k8334n9517N977o579k3416P6200n5884m9900l9683
11325F76607k0931K3001k6990r1953K6147j3176k1663k6818n2434m6802K0025
11314D45013J9889n3695m0887j5699O274J0650K9764K1728p7291K1766k2442m4803
$$ y = [13097669, 11625280, 10456669, 9417972, 8453714, 7617351, 6957355, 6417955, 5916122, 5437601, 5037632, 4673904, 4324560, 4003068, 3738432, 3529517, 3391646, 3220674, 3085277, 2943781, 2754721, 2579333, 2480385, 2438924, 2344100, 2271182, 2193862, 2128669, 1994431, 1873217, 1802211, 1835476, 1751429, 1681241, 1583747, 1521208, 1513766, 1540132, 1510019, 1445755, 1392029, 1296354, 1201946, 1186697, 1162989, 1189149, 1198457, 1161143, 1107306, 1110743, 1134092, 1057291, 903178, 847747, 857743, 829409, 769892, 775869, 769290, 745874, 822074, 766190, 716290, 676607, 655676, 678677, 651687, 559734, 585881, 572705, 551042, 524224, 471790, 424988, 445013, 464902, 411207, 370320, 354621, 360895, 371545, 401309, 423037, 345746, 367512, 345070, 300267]
11302C00267J249L2994j3437L1348L3884k5927m5349m3084j3110o755Q0796J6189
11290C49065j3189J9203R338m4872k3312l1382O0500K6781N9682k6850J2348l6068
11278C61244m2800j4145j0913k8422L645L2699k1387p1957k3765M8113q327l541
11266B20444J1238L5318j583q2174k993Q017r533K6171M178J6418J4120n2362
11254A87259k5670L8699l0014k8635K7218m7050m2531K2456M1193q481J5179K6627
11242A76250K6256K2942m3958j9616j4338m0539l65L0187O05N662K5891r752m7930
11229A11295m3059k2635k2616K62j7588L9173o840n374M4202K1933m436R012J7725
11216A21054P509l5816l4324l1876N2006l4216l8003M7916R9986K4835L7077j238
$$ y = [300267, 301516, 334510, 321073, 352421, 386305, 360378, 315029, 271945, 258835, 252080, 332876, 349065, 335876, 355079, 364417, 319545, 296233, 264851, 325351, 352132, 411814, 384964, 397312, 361244, 318444, 304299, 293386, 264964, 268609, 301308, 279921, 207964, 184199, 232312, 223985, 220444, 231682, 267000, 265417, 183243, 180250, 188267, 178734, 204905, 209083, 225501, 239621, 187259, 161589, 200288, 170274, 141639, 168857, 121807, 79276, 101732, 142925, 134444, 149623, 176250, 202506, 225448, 181490, 161874, 147536, 106997, 106632, 136819, 137424, 143086, 168977, 159225, 111295, 68236, 45601, 22985, 23247, 5659, 44832, 37992, 32618, 76820, 98753, 94317, 103329, 121054, 128563, 92747, 58423, 26547, 78553, 44337, 6334, 54250, 154236, 179071, 216148, 214910]
11204B14910p4758o7269J8194j2688k8768j5041J0562O2273N3508k8503j5365
11193A17055J4961L0103j1854O6047m0552J1170l0049N078O0160J9215O3673J07102
11181D12109J42323J22998R2834J37214K56119J87058J8748o418n565j18072j31407
11170A107941j40973j64107k03754m7693m0747m2838j9673M8004L6349O5148P6154
11159F73811J18427J19990O4685l5358l1534k6308P405J8488j2955M7411R2808
11148A036870M5500J16494J77917J13870O8065l9289j41722p6456o1377q6384
11138A153488j29583m5549j8955L1632j8817m6677q74p2232p7214k2091q6697
11127F66431p1143l9662k3313l9251k1190M6150L8813P4648J32450J48357J28262
$$ y = [214910, 140152, 72883, 91077, 78389, 49621, 34580, 45142, 107415, 160923, 132420, 117055, 132016, 162119, 150265, 216312, 175760, 186930, 156881, 161959, 222119, 241334, 305007, 412109, 554432, 677430, 770264, 907478, 1163597, 1350655, 1369403, 1362985, 1357420, 1239348, 1107941, 966968, 802861, 599107, 551414, 510667, 467829, 448156, 496160, 532509, 597657, 673811, 792238, 912228, 976913, 941555, 910021, 883713, 891118, 909606, 896651, 944062, 1036870, 1082370, 1198864, 1376781, 1490651, 1558716, 1519427, 1377705, 1301249, 1239872, 1153488, 1023905, 978356, 959401, 991033, 972216, 925539, 924665, 852433, 775219, 753128, 666431, 595288, 555626, 532313, 493062, 471872, 518022, 556835, 631483, 763933, 912290, 1040552]
11116A040552J07217J12747L4907q6794k04767j49690q9931j42546n8631q6107
11106D76957m1925m6411J360r240n185o2128n5198N620k2869m8096l7927n9283
11094I5675n5285l057N2587n67J2928J3834J0944O599J669M043K1732n11o9402
11081I1189m807k4015n0215K0301L4390j2910K1653q984R416L9296j598l1654
11069H2062n6183L2039J1403J9624J0690l4076l9791J5896L7763j002m8480j1202
11057A8743N6041l6576l9001L6662O8756R385j9608j1309K1093L3373K6424n146
11045A58837q441K4884K2485N5273M0128l3052J6124N5983L5447k917k7275L2002
11033C69478O4879O9567p2618O764K5798k6402J6262K3804K8702r6J3493J05653
$$ y = [1040552, 1147769, 1260516, 1295423, 1208629, 1003862, 854172, 764241, 621695, 563064, 476957, 435032, 388621, 389981, 380741, 375556, 313428, 258230, 263850, 240981, 192885, 154958, 95675, 40390, 37333, 89920, 89353, 102281, 116115, 127059, 133658, 135327, 139370, 161102, 160591, 91189, 86382, 62367, 12152, 32453, 66843, 53933, 75586, 66602, 76018, 115314, 113716, 82062, 25879, 57918, 69321, 88945, 99635, 65559, 25768, 41664, 79427, 78425, 29945, 18743, 74784, 38208, -793, 35869, 104625, 114010, 94402, 83093, 104186, 137559, 163983, 158837, 150396, 175280, 197765, 253038, 293166, 260114, 276238, 332221, 367668, 364751, 337476, 369478, 434357, 503924, 431306, 438070, 463868, 437466, 453728, 477532, 506234, 506138, 519631, 625284]
11021F25284N2167L8169O7803r231J7456K5503J8472p288n0505L23L5531J7002
11009H30686m5111p6734m8385j9547o4436k3707m1558n7602O636J2968j205K007
10997D74012J1858O7369m2464m8265l0905J3380K016o1369L8474J36306M0956
10986F01368l4979j04566Q03P0124M6714o7152m1314n0209q3737k2105R3696O0172
10974D68815j4368q34l6263p9472l2915o2260p5172k0009J7119M9710K987l3794
10962A83544k5345M2353M9386O5124J13518Q0030m3438J0987L2980M9660j8973
10951E39826m1733n3479p1879p4309k5167n4696j00368L1947J8777P2330K9357
10940B70606o3568p5287K800L73L3658j9212n7942m1099J9289l5528m7715l7226
$$ y = [625284, 677451, 715620, 783423, 774192, 791648, 817151, 835623, 828335, 777830, 778153, 813684, 830686, 785575, 708841, 660456, 640909, 576473, 552766, 511208, 453606, 460242, 473210, 472005, 474012, 485870, 553239, 510775, 462510, 431605, 444985, 447001, 385632, 424106, 560412, 601368, 566389, 461823, 462626, 532750, 579464, 512312, 470998, 420789, 337052, 314947, 408643, 468815, 454447, 453613, 417350, 337878, 304963, 242703, 167531, 147522, 164641, 214351, 217338, 183544, 158199, 200552, 249938, 315062, 428580, 508610, 465172, 476159, 509139, 558799, 539826, 498093, 444614, 372735, 298426, 273259, 218563, 118195, 150142, 168919, 241249, 270606, 207038, 131751, 134551, 134924, 168582, 149370, 91428, 50329, 69618, 34090, -13625, -50851]
10928e0851J090J270M1549N3780J2283j3571l078n816N8188j4623j3511L9187
10916A05897n7640l5236J1017l6691J0186N2510P495q203L928k354K8521p102
10904G2328n2817m1857Q673j8899O3896K6042k5980Q128L3198l1323q91j7144
10892B3354k3600j0765j7426K5302N2935K8784l2003j1705m7027p0766O9326R3708
10880H0117K1678O62r2759m8665O1238j1508K0612j2703j4146K835L1512K5517
10868F4390N3557M4226p1151j9918k1445K4253j7546j4354N4025K6836j6756N737
10856A11854M0665J9387k5541n0267L1971K0636j3459j9855J1913L5753m5419
10845A17638m3067K4012Q3846k1008o7853p2141J112P0193O1246M0922P2120k2591
$$ y = [-50851, -49761, -48491, -6942, 46838, 59121, 45550, 42472, 36656, 94844, 80221, 66710, 105897, 48257, 13021, 24038, -12653, -2467, 50043, 57538, 49335, 53263, 50909, 79430, 72328, 19511, -22346, -13673, -32572, 31324, 57366, 31386, 39514, 72712, 41389, 40498, 23354, -246, -11011, -28437, -3135, 49800, 78584, 46581, 34876, -12151, -82917, -13591, 80117, 101795, 102457, 9698, -38967, 22271, 10763, 31375, 18672, 4526, 7361, 38873, 64390, 117947, 162173, 91022, 71104, 49659, 73912, 56366, 42012, 96037, 122873, 106117, 111854, 152519, 171906, 146365, 96098, 128069, 148705, 135246, 115391, 127304, 163057, 117638, 74571, 98583, 182429, 161421, 93568, 21427, 22539, 92732, 153978, 194900, 267020, 244429]
10833B44429l4229P3875k3482p0552l5784k0638M183N5025j8125m0599j6314n16
10821A17273k1252K6950L2865J105o551k6256R88r20m65K3573J7134l7063l0993
10808I6388k4489k9020j8119k3590r486m5190J8205P3168L0269K2624K3296j0825
10796A03231p4841j9216K1381j1064R229J2307J4894r3899K7893J17393K0831
10785A28139M1242J4520q3603n5212M0331j0203l5387m557k1746n0569J3268K2851
10773i26M0766o1744O0531J25245r187m7520J0107K3436r879m3191m575p160n2070
10760B3833n614N9793k4966R769M7348M2518N6157k2171n0066j8691k4734m3737
10748D9439R0958R1401Q670p0777m5324N4371K5963j8808J0832l4483j165J6551
$$ y = [244429, 210200, 284075, 260593, 190041, 154257, 133619, 137802, 192827, 174702, 134103, 117789, 117273, 96021, 122971, 155836, 156941, 150390, 124134, 125122, 124202, 123737, 147310, 164444, 127381, 96388, 71899, 42879, 24760, 1170, -8316, -53506, -35301, 37867, 68136, 90760, 114056, 103231, 28390, 9174, 30555, 19491, 28720, 41027, 55921, -37978, -10085, 107308, 128139, 169381, 183901, 100298, 45086, 85417, 75214, 39827, 35270, 13524, -37045, -23777, -926, 39840, -21904, 38627, 163872, 154685, 107165, 117272, 140708, 130829, 87638, 83063, 75903, 23833, 18219, 78012, 53046, 62815, 110163, 152681, 208838, 186667, 136601, 117910, 93176, 49439, 140397, 231798, 240468, 169691, 124367, 178738, 204701, 185893, 196725, 162242, 161077, 177628]
10736A77628J9192j3368M0837M2074J1206Q172K5087K0233O7363l6517l8836N6458
10724C79529r387n6802o0127j3014J5440J4825l0352j621M987k3270j8870l4009
10712A67329l4643K6891O4165J2828n288K1912L3096N6859j8480r6794m0899P8192
10700B65168L6108J790N1921m2880m3470j8585N983j7140m089K7026j889K1678
10688B81621j4870L1030M6920M702n5839L691M3745k294j06013k9277l8588K4658
10676A89486R4648Q148m20m4761Q6502M1583q653M5152J8292N1027o006m9783
10664D25215j8796P384m0563k4401P4620Q1535j6735K4202N9163J244N4329J2317
10652F39514J2122L6115M1683L0057M0555k254J4586J4136O718N5802O7750P0436
$$ y = [177628, 196820, 183452, 224289, 266363, 277569, 285741, 310828, 331061, 398424, 361907, 323071, 379529, 370142, 313340, 253213, 240199, 255639, 270464, 240112, 238491, 243478, 220208, 201338, 167329, 132686, 159577, 223742, 236570, 231282, 253194, 286290, 343149, 324669, 227875, 186976, 265168, 301276, 303066, 354987, 312107, 268637, 250052, 256035, 238895, 234806, 261832, 259943, 281621, 266751, 297781, 344701, 349403, 293564, 297255, 341000, 338706, 232693, 203416, 164828, 189486, 284134, 292282, 291862, 247101, 333603, 375186, 366533, 411685, 429977, 481004, 474998, 425215, 406419, 413803, 373240, 348839, 423459, 504994, 488259, 512461, 571624, 572868, 627197, 639514, 651636, 687751, 729434, 759491, 800046, 797792, 812378, 826514, 833232, 889034, 956784, 1027220]
10640A027220P3476M8757P2863Q1276Q0867R8500J33702J77049K23782K06811
10630B224303K55230K25897J60516J61813L02936M16751N32343O47876R03498
10621E831163J277157J650650K250020L147072L970518M628393M480704L316687
10613C0552364J505603k63669j222096j262777l95626J110861K909116N069551
10605C8003327P465056R157542Q703586N271157L91261l603991n476436n048110
10597E4863392l034174k30435K964353O380380R691839J1597101J0081375M391385
10589I6705216k923915q488036j0815870r984169p327911m114742q73935K148436
10581E4325074M771717N986444M614196N38290m330753p728524q815395p830819
$$ y = [1027220, 1100696, 1149453, 1222316, 1303592, 1384459, 1482959, 1616661, 1793710, 2017492, 2224303, 2479533, 2705430, 2865946, 3027759, 3330695, 3747446, 4279789, 4927665, 5831163, 7108320, 8758970, 11008990, 14156062, 18126580, 22754973, 27235677, 30552364, 32057967, 31794298, 30572202, 29309425, 28913799, 30024660, 32933776, 38003327, 45468383, 54625925, 63329511, 68600668, 68991929, 65387938, 59911502, 54863392, 51829218, 51598783, 54563136, 60943516, 70635355, 82232456, 92313831, 96705216, 93781301, 85293265, 74477395, 64493226, 57165315, 53050573, 52176638, 54325074, 59096791, 65083235, 69697431, 70235721, 65904968, 58176444, 49361049, 41530230]
10573D1530230n796568l720115j764398q8339J043304J351137O50703r58940k894925
10564B9352089m158315m537927m134241l353345k545067j911863j438889j088000
10556F184442q66557o97629n47408m16016l54365l42830l41001k46964k33980
10547B137692j66831j30452j46180q1696j17302j54307r2506q9985l2449o716
10537A119268m8270n8587o4233q8165q1786k8330l4375k5298p1183o9208j6763
10526E33070N5337p765n1841j2573J1327J7825p2448m1267L7515L0828m1170j11197
10514C47641n5090k226n4899r108N6236k4333m5508L109o4403j445J02719m3187
10502B09506n2833m7039o4058L6183p176n6908o501O0781M9769l0773o7808M814
$$ y = [41530230, 35733662, 32013547, 30249149, 30160810, 31204114, 32555251, 33205954, 32247014, 29352089, 25193774, 20655847, 16521606, 13168261, 10623194, 8711331, 7272442, 6184442, 5317885, 4620256, 4072848, 3656832, 3302467, 2959637, 2618636, 2371672, 2137692, 1970861, 1840409, 1694229, 1612533, 1495231, 1340924, 1248418, 1158433, 1125984, 1119268, 1070998, 1012411, 948178, 860013, 778227, 749897, 715522, 690224, 619041, 549833, 533070, 588407, 580642, 528801, 516228, 527555, 545380, 472932, 431665, 469180, 500008, 458838, 347641, 292551, 290325, 235426, 226318, 282554, 258221, 212713, 215822, 151419, 149974, 252693, 209506, 156673, 109634, 45576, 81759, 74583, 17675, 11174, 71955, 121724, 90951, 23143, 27957]
10490B7957M442J1820P29n4468N3L6096N4981L0646j158M269O987J4932o247O0966
10476A92005p1990j6776K4497j7059l0185j2358Q393N0596J8426l5936o86l567
10464A05360q7736j3138K0083J7887k201L2231M105k770p6425J7733O4470M6646
10452A26245p954p0263k0420j05J3381k7369q4419l5228O651L6159k197M3166
10440b2353O246k7009k5847J1080L2936L7235j8769k8536K0515p235k450L3814
10428I627j8643J2756j1344L7248R059o2340N9K4486J2215k358k4819R384l6317
10415d0987L2106P834m0537l5636P3296J10824o383q8628r2936l5796P3983J2133
10403c0727L4747k8945K208L1825L7442j7730j1810L6465K428J1991j611K5375
$$ y = [27957, 32399, 44219, 44948, -9520, -9467, 26629, 81610, 112256, 111098, 115367, 122354, 137286, 131039, 192005, 120015, 103239, 127736, 110677, 80492, 68134, 76527, 127123, 145549, 109613, 108927, 105360, 17624, 4486, 24569, 42456, 40255, 72486, 76591, 73821, -2604, 15129, 79599, 126245, 118291, 48028, 27608, 27503, 40884, 13515, -70904, -106132, -99481, -63322, -65519, -22353, -16107, -43116, -68963, -57883, -24947, 12288, -6481, -35017, -14502, -21737, -24187, 9627, -9016, 3740, -7604, 29644, 38703, -23637, -23578, 908, 13123, 10765, -14054, -4670, -40987, -8881, -1047, -41584, -77220, -3924, 106900, 100517, 11889, -81047, -116843, -42860, -30727, 4020, -24925, -22717, 9108, 46550, 28820, 17010, 53475, 55903, 67894, 66283, 91658]
10391I1658q793L3823K4943o9180j17989n3845J7652M2957m5364l4763j5701k0928
10379a55530N0360k1544J7062q949j8192j4635p522M5199L9369N45l3324j898
10367a09059q771J7406M2900l1923R474J769N7588M4638m3694p6101p855m426
10355a08054L1218l5008l0867K7596M3925j7611O2639L5264K70K2776l9964l4516
10343d2332P0374K0149m5911n4854j1233J827L2368P609K5738K9531o5769J4157
10331a8346J929j8819J7417m7827J3576J3059k9640q439R338m1483L3161L2594
10319d3480M462L1977L1080l8396n1065K4276j1086L3627L5490K4945K9344M0979
10307A12153j43121j03168o405Q2903N7698M8328R053o3496m8867J1533M5199
$$ y = [91658, 82865, 116688, 141631, 72451, -45538, -99383, -81731, -38774, -84138, -118901, -134602, -155530, -105170, -126714, -109652, -118601, -136793, -151428, -158950, -113751, -74382, -73837, -107161, -109059, -117830, -100424, -57524, -89447, -79973, -78204, -20616, 24022, -19672, -95773, -103628, -108054, -76836, -111844, -142711, -115115, -71190, -88801, -26162, 9102, 9372, 32148, -7816, -42332, 28042, 48191, 2280, -52574, -63807, -61980, -29612, -22003, 3735, 33266, -32503, -18346, -16417, -35236, -17819, -65646, -52070, -39011, -68651, -77090, -67752, -109235, -76074, -43480, -39018, -7041, 24039, -14357, -65422, -41146, -52232, -18605, 16885, 41830, 71174, 112153, -30968, -134136, -140541, -57638, 60, 48388, 57441, -6055, -54922, -43389, 1810]
10296A810N7392J4897n7176l8208K1476l8230K866r046j534M8895Q289k9859p8968
10283i7396o559J427M5798J0016K984l3994J0155Q7068q900n7816J888j5489j0929
10270g1747j7290j00220n2902m4871Q5497Q3812K7395j5640j1497m325m9724K3457
10258a48055N81J7404J7371m7450K8612J5444N3442O5184l4482O312J5800k6490
10246c6327n3639j1107j5443P7505O8291O2492o9722p4689L0384p286Q063k7261
10234d8739J5013K1970J8774l9677m7941l4019L3385L6886j6141M7546q06r465
10222b3214l6202O712M6845Q719J5936J7530J947o3537j1033m6573o169r297L3857
10209f4479o065k529J556j9449l9309O369j599r511r47k2730L7753m19M7327N0732
$$ y = [1810, 59202, 74099, 16923, -21285, 191, -38039, -35173, -44219, -45753, 3142, 11431, -18428, -97396, -103955, -102528, -56730, -46714, -43730, -77724, -67569, 19499, 10599, -47217, -45329, -60818, -71747, -89037, -189257, -242159, -287030, -201533, -117721, -90326, -105966, -117463, -121788, -171512, -148055, -147474, -130070, -112699, -160149, -131537, -116093, -62651, 2533, -31949, -25637, -9837, -36327, -89966, -101073, -116516, -39011, 29280, 91772, 22050, -52639, -22255, -29541, -21478, -48739, -33726, -11756, 7018, -32659, -80600, -114619, -81234, -44348, -60489, -12943, -13749, -23214, -59416, -52704, -5859, 2860, 18796, 36326, 38273, -25264, -36297, -82870, -89039, -98336, -64479, -70544, -73073, -71517, -90966, -130275, -123906, -125505, -135016, -135963, -158693, -120940, -121359, -74032, -23300]
10195b3300Q7660k8568l5331k4388O265J457k9372Q768L9759l5017L7893K4122
10183B9948M6567M139n0432R421k3502N9729N1903M3912L65m3856o7824j101J5030
10170G4299M8237Q1640O8016M4490N139L4222J6638n0999m8336K9034R202j5123
10158B96459N4878M3772N4590j6039O597L6677o5913o4942l731l2558J9021R234
10146C38045l0585k3774P2979P257J3594J3789L798r2511j29784l4178j188K3522
10134A60964j8152j5681R128J00393P8759m0287q9339m4643L846k8764O010r1185
10122C1049q0084n8482N551j1036L8534l8159l7367o554M9974N8417M3966J5101
10110A0910j3929L1073j1022q6821k7416n614J6100M0624K6387k4611j1291J7317
$$ y = [-23300, 64360, 35792, 461, -23927, -17662, -16205, -45577, -36809, 2950, -32067, 5826, 29948, 76515, 80654, 30222, 39643, 16141, 75870, 127773, 171685, 172050, 128194, 60370, 59269, 74299, 122536, 204176, 272192, 316682, 321821, 356043, 372681, 321682, 273346, 302380, 311582, 296459, 351337, 395109, 449699, 433660, 440257, 476934, 411021, 346079, 342348, 309790, 328811, 338045, 307460, 283686, 356665, 363922, 377516, 391305, 395103, 302592, 172808, 138630, 137442, 160964, 142812, 127131, 136259, 236652, 315411, 275124, 185785, 141142, 144988, 116224, 122234, 31049, -49035, -107517, -101966, -113002, -74468, -112627, -149994, -156548, -106574, -48157, -4191, 10910, -3019, 28054, 17032, -69789, -97205, -102819, -86719, -46095, -19708, -44319, -55610, -38293]
10098c8293j3569k0685k7142K4979M0160K0500m4894k0675j4800Q0260N7944j1955
10086C1830o2721j4767L0289N198m091m7786n5033L1629J00411L8567m3044k0546
10074a0064K149N50J6017k8474r3796m0907J9051O724J0837Q5945K2922J7853
10062H807j6342p7734k720l830M5669M1982k7802j4398J0963R938L2531O491n9778
10049d6223j5181k545L8766J2638L7027L5637J7909r486n4878j8200j3089O892
10037a0733k213k3920k4356L6619j6327l5430K6821j4492K9819J9387k7626Q433
10025c4018k3276o08k9940j2782n0741K9987L1576q132J4980N2250L4517K6131
10013B9944l4413m76k0142k5705J5329j9736o1834K110R815N2051j499j9455K7791
$$ y = [-38293, -51862, -72547, -99689, -74710, -34550, -14050, -58944, -79619, -94419, -14159, 43785, 31830, -30891, -45658, -15369, -10171, -14262, -62048, -117081, -85452, 14959, 53526, 10482, -10064, -7915, -7365, 8652, -19822, -113618, -154525, -135474, -128750, -117913, -31968, -9046, 8807, -7535, -85269, -87989, -91819, -46150, -4168, -31970, -46368, -35405, -25467, 7064, 13555, -46223, -61404, -63949, -25183, -12545, 24482, 60119, 78028, 68542, 13664, -4536, -17625, -10733, -12946, -36866, -61222, -24603, -40930, -76360, -49539, -64031, -34212, -14825, -42451, -34018, -57294, -57902, -87842, -100624, -151365, -121378, -89802, -97934, -82954, -30704, 3813, 29944, -4469, -4945, -25087, -50792, -35463, -55199, -117033, -114923, -105108, -53057, -54556, -74011, -46220]
10000d6220M4133K9158J6263n0246l1348K8160j017l5004j5630K7220k9641j7080
9988h1252M0572R186k1003K1228n658N9418Q9704m4429l3644n7571k0245L1971
9976a1723j9868l70K142k617j9268J8345j8877p4845K8527L4220l63k193Q3422
9963A6532J2690l3727N1963R660j4490p9394n3997L0971N1708L376l2451L1832
9951e327k6697k5700j9886K2824o6342j1624L8532N0419l2036k0519k3989K5532
9939i4813P7393K0799k3784k5188L1403N4767L6313k8500m8557n3238L4080J6613
9927b712l3694J0685J5086K535J0160m0584k4157k674m5732R277P7982K7305n21
9914B956P100r567k6355M3648O2066K3670r391q5493o960J9033j1486N3799p2724
$$ y = [-46220, -2087, 27071, 43334, -6912, -38260, -10100, -11117, -46121, -61751, -34531, -64172, -81252, -40680, -31494, -52497, -31269, -36927, 22491, 112195, 67766, 34122, -23449, -43694, -11723, -31591, -31961, -29819, -32436, -51704, -33359, -52236, -127081, -98554, -64334, -64697, -66890, 16532, 29222, -4505, 47458, 57118, 42628, -36766, -90763, -59792, -8084, -4708, -37159, -5327, -32024, -57724, -77610, -54786, -121128, -132752, -94220, -43801, -75837, -96356, -120345, -94813, -17420, 3379, -20405, -45593, -14190, 40577, 76890, 48390, -167, -53405, -19325, -2712, -36406, -25721, -10635, -8100, 2060, -38524, -62681, -65355, -111087, -101810, -23828, 3477, 2956, 10056, 489, -25866, 17782, 79848, 103518, 94127, 8634, 1674, 20707, 9221, 63020, -9704]
9901i704K995j8779J426j580L4301K024k1423q640J9173o3858l2004L4621j7696
9888g9144j1229Q9789K7508j4810k4909k9576m430j2782o999J2833L6122M663
9876a2964j4262m0883k0251N3853r502K2270j0995j0194j9285j3597K4993N4517
9864C700k5909p6370K4594M7571k0397K714J1283M109R974O074L2012l0801K1980
9851A0534J9350k1475m9712P572p842K9332J8311n5o486j1682k2755m8766n7347
9838a41021j0214O5246n5113m2834M3164L8321P3870l5203l2149P285k930M5267
9826d6311O0322l7486m2039K4501j0423K890J6690N0775J1803L4899n796l5652
9814B4173Q527L8155J0374m3419k1632k5593k5212j0250P4134R856j6026j9042
$$ y = [-9704, -6709, -25488, -24062, -25642, 8659, 10683, -10740, -19380, -207, -64065, -96069, -61448, -79144, -90373, -584, 26924, 12114, -12795, -42371, -46801, -59583, -66582, -53749, -17627, -12964, -27226, -68109, -88360, -34507, -44009, -21739, -32734, -42928, -62213, -75810, -50817, 3700, -22209, -98579, -73985, -26414, -46811, -44097, -32814, -28705, -18731, -12657, 19355, -11446, 10534, 29884, 8409, -41303, -33731, -41573, -12241, 6070, 6015, -471, -12153, -34908, -83674, -141021, -151235, -85989, -141102, -183936, -140772, -102451, -28581, -63784, -95933, -88648, -91578, -46311, 14011, -23475, -65514, -41013, -51436, -48546, -31856, 18919, 30722, 65621, 59825, 24173, 32700, 70855, 81229, 37810, 16178, -9415, -34627, -44877, 29257, 39113, 23087, 4045]
9802D045k6822M3804L3247j1386p2824k7894j532j2697N554J9003K1180L1951
9790E629j4494o1537p020J188r771J7312o8815K0760Q3467L1917k0375o591o414
9777c4744r174M7174l5458k4829l012J9169L506o666o0714J7089Q3265M3896n72
9764C8930k0322l3117j2782n1401K1567J0454K2754k5856M392O1515l5665M6017
9752B6486R1355m5723q4593k5834n7456m6270N3016M9598K3725k1565p530m4342
9740h9133J0620J8140o606L3461K3822P147r295j7999m5819j5218k1944M6236
9728f6588J178k5565K8570L1306M0904L6871k3391K964L1842M6431J2759q4317
9716C2964n0095k3285J869j8612K6504j178j3306M6367K9337j0467k9697k0103
$$ y = [4045, -22777, 21027, 54274, 42888, -29936, -57830, -59362, -72059, -66505, -47502, -26322, 5629, -8865, -70402, -77422, -76234, -86005, -68693, -137508, -116748, -33281, -1364, -21739, -28330, -34744, -43918, 3256, -32202, -57031, -60043, -40874, -37368, -44034, -104748, -87659, -4394, 39502, 38930, 18608, -14509, -27291, -78692, -57125, -46671, -23917, -49773, -45381, 16134, -19531, 26486, 117841, 72118, -12475, -38309, -95765, -142035, -89019, -39421, -15696, -37261, -44791, -89133, -78513, -60373, -66979, -33518, -9696, -2549, -11844, -29843, -75662, -90880, -112824, -66588, -65410, -90975, -62405, -31099, 9805, 46676, 23285, 26249, 58091, 104522, 117281, 32964, -17131, -40416, -38547, -57159, -30655, -31833, -45139, 1228, 30565, 20098, -9599, -29702]
9704b9702K5389K616j1661k5022M9595M7542m5305l0695R619n6322k2861j3417
9692a00224L0616L9870l909L5479j5652o9479j7852J847K506N3123j542Q925M006
9679c2286R478q328j6396l4176L1079L3381L9511K828j7297m9191L9329K1450
9667A9382o6411l1326N5214J8982k4760J875J6497k320n9745k2708k517L1304
9655f6533J6710R762r718m262J2624j0011M503L5562P3278l3871l6507j1662M081
9642a6044j3248l1283L908K2449K2726L5615R234n2877k5493L6469j7863Q236
9630a8171P648o0580j4110l6844L447M8419P4753L2337p73l7425K839Q341N768
9617A5649r425j4689J0087k6290n3663l9750K2661K7759k3673L4248K7406J9609
$$ y = [-29702, -4313, -1697, -13358, -38380, 11215, 58757, 13452, -17243, -7624, -63946, -86807, -100224, -69608, -29738, -33647, 1832, -13820, -83299, -101151, -99304, -96798, -43675, -45217, -36292, -32286, -22808, -31136, -47532, -81708, -50629, -17248, 22263, 25091, 7794, -41397, -2068, 19382, -47029, -78355, -23141, -4159, -28919, -27044, -10547, -12867, -72612, -95320, -97837, -66533, -49823, -40061, -49779, -54041, -41417, -51428, -46925, -11363, 61915, 28044, -8463, -20125, -16044, -29292, -60575, -56667, -34218, -11492, 24123, 33357, -19520, -45013, -8544, -26407, -18171, -10523, -71103, -85213, -122057, -118610, -70191, 4562, 36899, 36126, -1299, 1540, 9881, 15649, 6224, -8465, 1622, -24668, -78331, -118081, -95420, -67661, -91334, -57086, -29680, -10071]
9605a0071j5870K6655j8815o8402K2649N7886L3383M7141p4411m0576P1738n121
9593B6186k0776j6975k8158j2551M4804j5754N2449N8889o7155m3277o136K1152
9581g302K7860L353j2641K2836j8962o6357k9408N64k0657j1908M3221L5136j7459
9568e1724j2619j4618J2668p757M3049K8882j8179l7339P698K3338K2438k2059
9556b6222l839m3579K0027N4454J2788N500M5K4510J517l3605m6823j5717m0939
9543i1883j7876Q8336J883M1589j5151L544Q413M5297j7287l657n5032o2695l887
9530g8406k3496J553M9437O1585M5545J9131m2158k6916l9917J0586R965k9020
9518d2111k8315L8Q656k174P1156O807m646L8845j0426l8422n8640k6394M1085
$$ y = [-10071, -25941, 714, -18101, -86503, -63854, -5968, 27415, 74556, 145, -40431, 31307, 26186, 5410, -11565, -39723, -52274, -7470, -23224, 29225, 88114, 20959, -22318, -28454, -7302, 20558, 23911, 11270, 34106, 15144, -51213, -80621, -80057, -100714, -112622, -69401, -34265, -51724, -64343, -78961, -66293, -74050, -31001, -2119, -20298, -57637, -49939, -26601, -4163, -26222, -30061, -73640, -53613, 841, 13629, 19129, 19174, 43684, 45201, 11596, -35227, -50944, -91883, -109759, -21423, -19540, 22049, 6898, 10442, 18855, 64152, 46865, 43208, -11824, -74519, -78406, -101902, -100349, -50912, 10673, 56218, 75349, 33191, 6275, -33642, -23056, -13091, -42111, -70426, -70388, -61732, -63906, 7250, 14057, 9411, 48256, 37830, -592, -59232, -85626, -44541]
9505d4541J4358m8592l3700L7553J7160K1408N2875O484L8434m2077m8435N3546
9493B4473J8977O106K3802P464j8458j8541j4878l8027l0230J887R384L4835K2843
9480B9637n7729k0044K244N9953M7594O5848o3272j20782l4606j7798K4153K1812
9468f2990M6160Q842m1194p02Q468K872N913o2478O451J6524N1476L1091K1703
9455C2136q953k9664l0535m337J2219p815m0154K531L9442j2576j720J3213L7687
9442A474M4097J8850m5225k6404L3284q92l6101R585j5937j4833j6300j0403M8525
9429a0280M1312j0615l719m7061j520L2966q7441o185N1123Q1379M5353j7735
9417F7577K731k6942j4604m3084M5320J7171j9967p3099J8762N8557n710M667
$$ y = [-44541, -30183, -78775, -112475, -74922, -57762, -36354, 16521, 23005, 61439, 19362, -29073, 24473, 43450, 49556, 73358, 80822, 62364, 43823, 28945, -9082, -39312, -37425, -28041, 6794, 29637, -28092, -48136, -45892, 14061, 61655, 127503, 64231, -56551, -91157, -108955, -84802, -62990, -16830, -7988, -49182, -49884, -41416, -38544, -32631, -95109, -88658, -72134, -20658, 10433, 32136, 23183, -6481, -37016, -41353, -29134, -36949, -77103, -74572, -35130, -47706, -49426, -36213, 1474, 45571, 64421, 19196, -7208, 26076, 25184, -10917, -1332, -17269, -32102, -48402, -58805, -10280, 31032, 20417, 16698, -30363, -31883, 1083, -86358, -92543, -41420, 39959, 85312, 67577, 70308, 43366, 28762, -14322, 30998, 48169, 28202, -44897, -26135, 32422, 26712, 31379]
9405C1379j4702l0265k2852k3562L188K3071j8970P042Q475q540k4607k3428M589
9392h9182J0268K1844j6289j4686N7033L4351K935M605k7750p1403J1932Q2570
9380F228K4737l5776j9276j8632j9766m910N4840L5465l9597L3981K7423Q723
9368E3440M722j6450r461n660J5055M4456m7087j7164j0576q9919P4Q509j1358
9355h1419K0489L511Q955M5188O6293n1363l4264J1950L0837J5577j4917m8648
9343b7811L0029k5853n811k9823j7521k0229K4177N892K6154R06k6882m6524R879
9330a03417Q7237L6715J2675p404m1804Q2001M1784l5712n4152n6396n3052l7372
9318a28897j0762K6882K5592O5371K2071j2964J0259j5525o2547n0536R827J2783
$$ y = [31379, 16677, -13588, -36440, -60002, -56814, -33743, -52713, -45671, -37196, -45736, -70343, -93771, -89182, -78914, -57070, -73359, -88045, -31012, 3339, 6274, 10879, -16871, -88274, -76342, 6228, 30965, -4811, -24087, -42719, -62485, -67395, -12555, 22910, -16687, 17294, 44717, 53440, 58162, 41712, 32251, 26591, 41646, 86102, 39015, 21851, 11275, -78644, -78570, -70061, -81419, -60930, -57419, -48464, -3276, 63017, 11654, -22610, -10660, 20177, 35754, 20837, -27811, 2218, -23635, -29446, -59269, -76790, -97019, -72842, -66950, -40796, -39890, -66772, -113296, -103417, -16180, 20535, 33210, 25806, -15998, 66003, 107787, 72075, 17923, -38473, -91525, -128897, -139659, -112777, -87185, -21814, 257, -12707, -2448, -17973, -80520, -131056, -121229, -108446]
9306a08446j4594M4695K7454p582K5397M5145M779m1865l3111J7893J8953l4580
9294e5862K0854j9202n8866k4349M2096O2444k4128j393j7460k5981M8889j200
9282e4158K1228N6401M192k6024k959L9248L8435J3831j4558J900j541r9588l4978
9269e8571J7047J9159p2649j0044M9093j4542r713J6012n1496j1312Q705k7721
9257a46032l6023L9335M0073L0679J5266J1114n5032k0135P7224l7076k173K2955
9245e9825k9066k4889N0525O8108M0847k7055j1773l5023j0541J8500R832j0165
9233b0525K1065J3414k996J212j5871r2978k1941J5410J3879p378K1126M9696
9221b5887j991q982k4622l9500r871J8890O5181o8378n7811K8217K5462J4519
$$ y = [-108446, -123040, -78345, -50891, -58473, -33076, 12069, 16848, -25017, -58128, -40235, -21282, -55862, -35008, -54210, -113076, -137425, -95329, -32885, -57013, -58406, -75866, -101847, -52958, -54158, -32930, 23471, 27663, 1639, -1320, 37928, 76363, 90194, 75636, 77536, 75995, -23593, -58571, -41524, -22365, -95014, -105058, -55965, -70507, -80220, -64208, -115704, -127016, -118311, -146032, -182055, -142720, -102647, -71968, -56702, -45588, -100620, -120755, -43531, -80607, -82780, -59825, -88891, -113780, -63255, 4853, 45700, 18645, 6872, -28151, -38692, -20192, -10360, -20525, 540, 13954, 10958, 12170, -3701, -96679, -118620, -103210, -89331, -96709, -75583, -25887, -27878, -36860, -61482, -100982, -110853, -91963, -26782, -95160, -152971, -124754, -99292, -84773]
9209h4773k688q80O5930n4533l4984J18678M0058m8297l944k1231n8666J4927
9197g0403J4384L2739p20m2823l8859K6294J1900K3234M6710j5846P627r954M6593
9184C0876K4479j5664j05j0342K6072O766n0221j4278J7988l7670J7932J6234
9172A2067J1436l2781n823k239J6987L7111m3622o9078J2735J798J8481L7087
9160e841J8756j8460J2394p325j5774k7583M54K6651N1440N5189J4420l7316n0901
9147A6104j737q793K1034L3840r181J070K7247m5180r631q875k4768m7555k9598
9134h6023M2876M2026j0538k0872N7908L0317m7385j2616r32n5833q101Q552L1071
9121b9550J3684K383K7066K4724m7453o7050R937L2428L7816K209J7289O4892
$$ y = [-84773, -87461, -88341, -22411, -76944, -111928, 6750, 46808, -1489, -5433, -26664, -85330, -70403, -56019, -23280, -24000, -66823, -105682, -79388, -67488, -44254, 2456, -13390, -5763, -15717, 30876, 55355, 39691, 39586, 29244, 55316, 62082, 11861, -2417, 15571, -22099, -4167, 12067, 23503, -9278, -15101, -17340, -353, 36758, -6864, -75942, -63207, -61409, -42928, -5841, 12915, -5545, 6849, -476, -16250, -43833, -43379, -16728, 34712, 89901, 104321, 67005, 16104, 14367, 5574, 26608, 60448, 51267, 52337, 79584, 34404, 24773, 15898, -8870, -56425, -86023, -43147, -1121, -11659, -32531, 25377, 55694, 8309, -4307, -5239, -61072, -69173, -60621, -29550, -15866, -13483, 13583, 38307, -9146, -76196, -66259, -33831, 3985, 6194, 23483, 88375]
9109H8375n6594p1538K4733M9524N428j0216M3027N9590r635k7747l1884J3971
9097G7034j2253J6526Q919N396k230j9971J1946j2474m8280j8639k0203k0318
9085c4547K288n139j0817l2679n6474L9113O9361K9204N4089M3234R835k9030
9073G8438R841l6868k8987j9401k5820N7303J3511j04456j6626J4803o628l1478
9061i6368n977M9591k7111k3102l8208R0918P628K9827R0894k3598p2270j3767
9049c1543K7973L969j1749J3119J6991l5031J9414M2980K9157j0983m4593k0931
9037a227J9541K4184O815L0842l3040k9651K4564K6382r902j0704j9673m9517
9025b1386k9797J0092K6283k1125m818j8229o2062l9761j9388l1598K0601J7174
$$ y = [88375, 31781, -39757, -15024, 34500, 39928, 29712, 72739, 132329, 122694, 94947, 63063, 77034, 64781, 81307, 90226, 95622, 93392, 73421, 85367, 72893, 24613, 5974, -14229, -34547, -32259, -37398, -48215, -80894, -137368, -98255, -28894, 310, 54399, 97633, 107468, 78438, 88279, 51411, 22424, 3023, -22797, 34506, 48017, -56439, -73065, -58262, -64890, -96368, -102345, -52754, -79865, -102967, -141175, -50257, -42629, -12802, 78092, 54494, -17776, -31543, -3570, 399, -11350, 1769, 18760, -16271, 3143, 46123, 75280, 64297, 19704, -1227, 18314, 42498, 49313, 80155, 47115, 17464, 42028, 68410, 58508, 47804, 28131, -21386, -51183, -41091, -14808, -35933, -40751, -58980, -121042, -160803, -180191, -211789, -191188, -174014]
9013a74014M3763N5649L3691j4811M5628N2302j14L2753k2149o0569m9094O6825
9001I860L9456o193J8424k5734r93N0566l847k4976n2297p64J22165L9550n7924
8988A07293n8979n3733p0020l6089R403N1774k904J2888j459l3249N769o311j9508
8975i5125m07N5789j0153n607M142J4029L1507j7066N990j22N893L3724L5370
8962E7964J1209l9563K3502J5970k6013K7640L91o4994n9232j3436k9000J9403
8950g6159M8159L212L7476K6457J4790j8431q507l7366K2142N3837L418m1509
8938B7519n518J1840l2995K0496m0599p2315L9705J18249M7905l1445p2613M809
8926A5038n4935p5660K5472K2305O3334J018l7868M0924L3807O687m697j499l4
$$ y = [-174014, -130251, -74602, -40911, -55722, -10094, 42208, 42094, 74847, 52698, -7871, -56965, 9860, 49316, 43123, 61547, 35813, 34820, 85386, 81539, 56563, 4266, 3502, 125667, 165217, 107293, 48314, -5419, -75439, -111528, -102125, -50351, -53255, -40367, -41826, -75075, -69306, -75617, -95125, -95532, -39743, -49896, -55503, -51361, -37332, -5825, -22891, -16901, -17023, -11130, 22594, 57964, 69173, 29610, 53112, 69082, 43069, 70709, 71100, 6106, -53126, -66562, -95562, -76159, -28000, -24788, 12688, 39145, 53935, 35504, 26997, -10369, 11773, 65610, 69028, 27519, 22001, 33841, 846, 21342, -19257, -91572, -51867, 66382, 114287, 82842, 10229, 15038, -39897, -115557, -90085, -67780, -4446, -3428, -41296, -372, 33435, 40122, 35425, 33926, 33892]
8913C3892j4402j1894n2901j2591J2910J9091J4442Q444J1137p016n509K2803
8901A8406L2571L3996J7029q9715k1622J7681K0183L9226M0332M2195m4408m8340
8889E7534l9423r073K362q74n7772n2384K4948K375M0541j4667k0771J0755Q0353
8876B3904K080n3456Q255R865m5319o5385k6257L1249J9700M4019K4651K1568
8864e126m3595k0566N0481m5612m2359n407K5297j2886l9182j6670N2092J07417
8852C884K3175J1068p8355m5643J7590K1549J8294N7937J30936p055n3445n6829
8840D3106k6133M0309J1615j3977K8333j7236k1005J8303q523K3244J4163j6496
8828G5703j8080j8227q0212J3429Q645j6595K4893j303L3471J3995r809J1106
$$ y = [33892, 19490, 7596, -45305, -57896, -44986, -25895, -11453, -3009, 8128, 1112, -4397, 18406, 50977, 84973, 102002, 12287, -9335, 8346, 28529, 67755, 108087, 150282, 105874, 57534, 18111, 9038, 11400, 10526, -47246, -99630, -74682, -72307, -31766, -46433, -67204, -56449, 23904, 25984, -27472, -19217, -9352, -54671, -120056, -146313, -115064, -95364, -51345, -26694, -5126, -48721, -69287, -18806, -64418, -106777, -112184, -86887, -99773, -138955, -155625, -103533, 3884, 27059, 38127, -40228, -85871, -68281, -46732, -28438, 29499, 160435, 153380, 99935, 43106, 16973, 57282, 68897, 54920, 83253, 66017, 45012, 63315, 54792, 78036, 92199, 75703, 57623, 39396, -40816, -27387, -18742, -35337, -10444, -11747, 21724, 35719, 25910, 37016]
8816C7016O6228q553k7036m7393L1405j1117q0055l461n2530k4428N0256J3216
8804e6452O8861k1019L2402m3708j5544K1341Q0031k8204l6502j2769k2984m3815
8792g8362N197n34q6788J6785O4927J3122k0235P9302r619k2710k0933R27N662
8779e3259R1526M7851n1971J3442m9075l4794O2546n477o7273m4564N095N4609
8767c1344R020k590J6426J2797n5653r4535K2327O1966L5171L5852R647j5458
8755C626N316K5501l6432j03573N863K8754O375M8292N7485j4817m3642q404M7779
8742B2123k8417M2191N6196p0830n7504j0525J2632L8757n93j5561j0552o8962
8730i1045L3610M642j1714M1073j5821J8181r251k187k7876k5387L4776J9958
$$ y = [37016, 103244, 94691, 67655, 20262, 51667, 40550, -39505, -42966, -95496, -119924, -69668, -56452, 12409, -8610, 23792, -19916, -35460, -14119, 65912, 37708, 1206, -11563, -34547, -78362, -73165, -73699, -160487, -143702, -78775, -65653, -85888, -6586, -16205, -38915, -59848, -58921, -53259, 38267, 86118, 34147, 47589, -1486, -36280, 26266, 20789, -46484, -91048, -85953, -31344, -22324, -24914, -8488, 4309, -51344, -145879, -123552, -61586, -26415, 9437, 19084, 3626, 8942, 34443, -1989, -105562, -99699, -70945, -64570, -16278, 41207, 26390, -17252, -25656, 22123, -6294, 35897, 92093, 21263, -36241, -46766, -34134, 4623, 4030, -11531, -22083, -91045, -57435, -52793, -64507, -23434, -39255, -21074, -30325, -32512, -60388, -85775, -50999, -31041]
8718c1041k0006l3461J7114k0784O8070o570l2990L5798R969K5977J1229J2061
8706C5366l1949k9183n0245n0688L7604N5320Q6404l411L25o0304m8558P9847
8694B0528K7750q934n8168Q48Q0493J8532k7701m9520o1494j944K3874O6503m0573
8681i806l2118Q573M85K7221K9132L5448J1985m0888K3358p073j783j7000q3346
8668e5812k5428K5814K8493K2952n2368L9734O7943K5366j5299m9922k6205k1522
8656c6254K4319p0148j4882O5578J791n025j0426O0437L5491k8680m2332k153
8644b2284O708N6693k230l4021J4773j5883J2042M294J7734n3111n0272Q1126
8632A5569N1562l6951K7260O9481j4310k6779j4928Q795M694m5136R634j373p972
$$ y = [-31041, -51047, -84508, -67394, -88178, -20108, -26678, -59668, -23870, -13901, 12076, 23305, 35366, 3417, -25766, -76011, -126699, -89095, -33775, 52629, 49218, 49543, -10761, -59319, 20528, 48278, 39344, -18824, -17976, 62517, 81049, 53348, 3828, -57666, -59610, -35736, 30767, -9806, -41924, -33351, -32866, -5645, 23487, 58935, 70920, 30032, 53390, 46317, 44534, 27534, -55812, -81240, -55426, -26933, -3981, -56349, -16615, 51328, 76694, 61395, 11473, -14732, -36254, -11935, -82083, -96965, -31387, -29596, -34621, -45047, 15390, 50881, 22201, -20131, -22284, -15576, 41117, 38887, 4866, 19639, 3756, 15798, 20092, 37826, -15285, -65557, 15569, 67131, 30180, 57440, 126921, 112611, 85832, 70904, 79699, 84393, 39257, 48891, 47518, 39546]
8619C9546l4838q4126K5748q472J2151M8563N2016j2716O117L5544L3378K4984
8607A37895J5497M0130o923m3257k1559K1765K5890K0110l6773j5203M8189N6275
8595B42036J1724j0046k0383n1818o0965k7878q2560K9165Q5754M6128P4179K6418
8583B61754o9118o0317m9302l9655k221k1647L1536O2506k8986R033J4983Q008
8571A16574n830K3255p8362n8347m0825o712N326K6683m642J1076j2974O896M3587
8558B5705M4403J7893l1030k0094k7396k4228j7217n801L600J6756l316N6238
8546C5513m0658m959R937K4830j8863j2562M7608j7519n0017m0444J867Q576K3258
8533c3433J6058j8909P308j475N1590Q228l1969l482k619M2200n9360R651M9882
$$ y = [39546, 4708, -79418, -53670, -62142, -49991, -1428, 50588, 37872, 43989, 79533, 112911, 137895, 153392, 193522, 186599, 143342, 121783, 143548, 169438, 189548, 152775, 137572, 185761, 242036, 253760, 243714, 223331, 171513, 110548, 82670, 110, 29275, 115029, 161157, 235336, 261754, 192636, 132319, 83017, 43362, 41141, 19494, 51030, 113536, 84550, 93583, 108566, 116574, 110744, 133999, 55637, -2710, -43535, -50247, -44921, -18238, -22880, -11804, -24778, -17882, 25705, 70108, 88001, 56971, 36877, 9481, -14747, -31964, -37765, -34165, -17409, -20725, 35513, -5145, -10104, -167, 24663, 5800, -6762, 40846, 23327, -26690, -67134, -65267, -56691, -33433, -17375, -36284, -28976, -30451, 21139, 29367, -2602, -6084, -8703, 33497, -25863, -16212, 33670]
8520C3670L0438R852r342O62k8678p427l66o0479o0834J8824N1114M0027O4081
8507H1542m9019q9327k4255M9710p199L7515K4844j6734r2989k7807L2091N0693
8495c0935l5691l2196M9306O454k8724M2179P1329l1113l5176K073J6778K5196
8483A9480K6341m6241O801O708q424n0522k9572P298J7961K932K8738J8863p366
8470g003l3077j2028P0768L4534m6518j3370L2562l4954R803N428k3153j3179
8458c0187K813M2846N2231k6241l5425K4992m322K5477L2885J3336P434l378j1139
8445I1322K7445N9l3755k2234m4503l1416K0326M9071k471K2846j2125o2027M1215
8432D3753L7887j591o9700j1299Q718m8518k7908N2111M8509J202l7781k2842
$$ y = [33670, 64108, 73960, 64618, 65280, 36602, 29175, 28809, -31670, -92504, -73680, -22566, 17461, 81542, 32523, -56804, -81059, -31349, -38548, -1033, 23811, 7077, -85912, -113719, -81628, -30935, -66626, -98822, -49516, -43062, -71786, -29607, 41722, 10609, -24567, -22494, -5716, 19480, 45821, -420, 6381, 13089, 4665, -45857, -75429, -68131, -50170, -47238, -18500, 363, -7003, -40080, -52108, 18660, 53194, 6676, -6694, 25868, -9086, 717, 6145, -17008, -30187, -27374, 15472, 67703, 41462, 6037, 31029, 26707, 52184, 85069, 98405, 105839, 102461, 91322, 118767, 118826, 85071, 62837, 18334, -13082, 7244, 56315, 53844, 76690, 64565, 2538, 43753, 81640, 80049, 10349, -950, 7768, -40750, -68658, -16547, 31962, 33164, -4617, -27459]
8420b7459l59m7882n1238M8980P0809l356l138L0471O766m0931j5610Q445j7747
8407d2249J6050P6602N442n649m1426n5460o4356k5315M9813J4621k967J122J8791
8394e4981R411K2412n795L4135M0488L3013k6237l9979J0889N3109N4316p6621
8382E4160n0894l6407K815j5019J9454P3081n306j5474m962M5437L8056k2209
8370H2732J3490j6873O317O1862M950l2500p716P094n0723l7602M231P491L9748
8357H2501N0408k982o7276j8283k9609M043J6463j7302Q643k1075k3805N3484
8345C5210K3353m8616L6601j6214Q040L578j393k2179m9625k2722O0860K6567
8333C3460l3805J2002N5116L8625K5661J273p443J0158l778K3216n2325m5440
$$ y = [-27459, -27818, -75700, -126938, -77958, -7149, -10505, -13643, 16828, 23594, -17337, -32947, -24502, -42249, -26199, 50403, 55845, 50196, 8770, -46690, -111046, -136361, -86548, -71927, -74894, -73772, -54981, -45570, -23158, -28953, 5182, 45670, 78683, 52446, 12467, 23356, 76465, 130781, 54160, 3266, -33141, -30326, -45345, -25891, 47190, 41884, 26410, 21448, 66885, 104941, 82732, 96222, 79349, 85666, 147528, 152478, 119978, 112262, 119356, 68633, 31031, 35262, 42753, 82501, 132909, 129927, 62651, 44368, 14759, 18802, 35265, 17963, 26606, 5531, -18274, 35210, 58563, 9947, 46548, 30334, 38374, 41952, 40559, 18380, -31245, -53967, 6893, 33460, -345, 11657, 66773, 105398, 131059, 132332, 124889, 135047, 131269, 154485, 102160, 56720]
8321E6720j9394o7568L3807R9653J9588l5832m42k6370m1816M5548P515l6255
8309C5154k7957K1576j3095M2299K529l9794j6963o79j64K0865K645L2508l9248
8296A9676k481j1275L5227L500k8995m0307O446J868J9466n638O820k5372k7508
8283d8573O5819O5728o7551Q87O8261N0360J644o2972q9022j5561M1870K3828
8271C4718O396o93q1305M4158L5222j285l3815m399r372L1860q795M393m6085
8258b9002J1421q098L965J6521n3172J009o808K6186k3332J1775k6802j3975J665
8245h8647N4426l153m1326o407K8592L3805m4338q724L2809J9998N7393M4695
8233G9123l2054L6980k5029o5788k0902M8150K431o524p358k3191k0264j1806
$$ y = [56720, 37326, -30242, 3565, 103218, 122806, 86974, 86532, 60162, 18346, 63894, 71409, 35154, 7197, 28773, 15678, 57977, 60506, 20712, 3749, 3070, 2906, 23771, 26416, 58924, 19676, 17195, 5920, 41147, 44647, 15652, -24655, -18209, -16341, 3125, -2513, 4307, -21065, -48573, 17246, 82974, 15423, 16310, 84571, 134931, 136575, 73603, -15419, -30980, 10890, 34718, 41114, 40421, -40884, 3274, 38496, 37211, 3396, -1003, -10375, 21485, 12690, 17083, -29002, -17581, -25679, -21714, -5193, -58365, -57356, -64164, -37978, -61310, -49535, -76337, -90312, -88647, -34221, -37374, -78700, -85107, -56515, -22710, -67048, -75772, -42963, -22965, 34428, 79123, 47069, 84049, 59020, -6768, -27670, 20480, 22911, 16387, 9029, -14162, -34426, -46232]
8221d6232n7925L905N4466K1482P233L6328n0195p1417j6890L8278P0005M0458
8209B9496p9507k1756j049M6910K6597Q560l717p651m3774j9911K590j1429L8917
8196c5724J0211k5542O346J2880k5423m227l6447j830K0180J1536N0402N6968
8184C9330K1166q678L3254k9578l5673j7302K7253k2450j1135O7076M4769k3300
8172H4732J3471l2767q9293o2022l1507O1801J1067O637P3649N9457l5387q1422
8160b1584j4787O288j1723l6148J8173Q927N515n9647J3480K8060N3880R811O8809
8147F9054m550p0229j5815M8057M1569L3665K6607N391n6093n3999J4745k0173
8135A8229O797K3955j9245j154k7772k1280j5696j2736O9457K3695J0020l3430
$$ y = [-46232, -104157, -100252, -45786, -24304, -17071, 19257, -30938, -102355, -119245, -80967, -10962, 29496, -50011, -71767, -72816, -25906, 691, 9251, 5534, -2117, -45891, -65802, -63212, -74641, -35724, -25513, -51055, -44709, -31829, -57252, -61479, -97926, -99756, -79576, -68040, -17638, 39330, 60496, 51818, 85072, 55494, 19821, 2519, 29772, 7322, -3813, 63263, 108032, 84732, 98203, 65436, -23857, -85879, -117386, -55585, -44518, -37881, 35768, 95225, 59838, -21584, -36371, -30083, -41806, -77954, -59781, -50854, -45339, -104986, -91506, -63446, -9566, 245, 69054, 64504, -5725, -21540, 26517, 68086, 101751, 128358, 133749, 77656, 23657, 38402, 18229, 25026, 48981, 29736, 28582, 810, -20470, -36166, -48902, 20555, 44250, 54270, 20840]
8123B0840N0892q209l7979J8994J2169M386J3303j696j0181q4041k3416J7365
8111b7573K3442K1417P610l889L1291n633k1144q024J119M6694j1910m1577j5671
8098c848J945J9576l787k1460L1487K7160K2882l5k7415l0825j7598N922K9760
8085C3764R712P980o0372k0023M6610O1209r874o2747n1040K9436Q1058P5895
8073A41608J8466k4573m7408l5844k6664l7177p2931O53K6732m6977k9289J3700
8061a19704O6971M596J8594M6488j8033l3185L1157O091k3496k2642J0044L6565
8049C446J1862O246K8245j9682R937j3663J0502N426n2224k973j0612r202k4464
8036e7156k7734j6636O4529K6252J1384M2821K3387L4953J1586J213m2192r8507
$$ y = [20840, 71732, 63523, 25544, 44538, 56707, 61093, 74396, 72700, 62519, -21522, -44938, -27573, -4131, 17286, 24896, 21007, 52298, 46665, 25521, 17497, 18616, 65310, 53400, 11823, -3848, -1903, 17673, 13886, -7574, 23913, 51073, 73955, 73920, 46505, 15680, -1918, 4004, 33764, 43476, 51456, -8916, -28939, 17671, 78880, 69006, 6259, -44781, -15345, 65713, 141608, 160074, 135501, 88093, 52249, 25585, -11592, -84523, -83870, -57138, -104115, -133404, -119704, -52733, -48137, -29543, 16945, -1088, -34273, -3116, 2975, -20521, -43163, -33119, 3446, 15308, 21554, 49799, 30117, 40054, 26391, 36893, 42319, -9905, -12878, -23490, -32692, -57156, -84890, -101526, -36997, -10745, 639, 43460, 66847, 101800, 113386, 114599, 72407, -26100]
8024b6100m8375O6180Q7900j5395l3180K7857N5609l6234M3974j2881n2210k6368
8012C0777K9292L8021o172p0012q2861K1918O2172J3359M1848l658k7667K3109
8000G0126n975p6235j6466Q0658J5877q244m0948j6262m3851K8548J416M4767
7988C3411M2438N3242R3242P873m6530n325j2215m8142n3517k3705L8051J7984
7976I6807o5653L6236J862q2567r976J2841P2023K0530Q6880M808p7373M4849
7964A41267m3039j6563j3595l6772K4994k0645M9382K1695q033n0903j4522l603
7952B9663L4035M0495K612k3776K1550L441K9331L4416o8790k6196L5787l3755
7940G8813m3817L935Q7711M7490o032m0641k5198m1634k7213N4316J1834l7448
$$ y = [-26100, -74475, -8295, 79605, 64210, 31030, 58887, 114496, 78262, 122236, 109355, 57145, 30777, 60069, 98090, 91918, 21906, -60955, -39037, 23135, 36494, 78342, 74684, 47017, 70126, 64151, -12084, -28550, 52108, 67985, 59741, 18793, 2531, -41320, -12772, -11356, 33411, 75849, 129091, 222333, 230206, 183676, 178351, 166136, 117994, 64477, 40772, 78823, 96807, 31154, 67390, 69252, -13315, -23291, -10450, 61573, 82103, 168983, 173791, 96418, 141267, 98228, 81665, 68070, 31298, 56292, 35647, 85029, 106724, 98691, 47788, 33266, 29663, 63698, 104193, 106805, 83029, 104579, 108020, 137351, 171767, 102977, 76781, 112568, 78813, 34996, 38931, 126642, 174132, 168100, 127459, 102261, 60627, 33414, 87730, 99564, 62116]
7928F2116k3164J3393L0624K892q094m8019j0678p308r606j8764l4898j2007L2762
7915c0751j4824j282J2146m2465J8773J0129M5924M1594J9187J7632n7248l0813
7903a1998M1644K0128l0214N216J1766q7608L5049N3696j2134J1029j5846M2871
7891F3599j3757l9956j6256J7015J30j1704K6706j7848n8835o865K0536Q477q3972
7878a12730r218O0723R8110p143O0454R703p7844p6728m727J7093J4043O882L282
7865a8100m56L69L3176k5101o6796M3996M5937n4708k4949M0061Q5162n356m1563
7852A1672J9717J4212j3463m828m8385j1816l02k5161K3674k882k7827N9601J1636
7839E848M983M7354m6553j631p123K5799J251J9585m2485K667J1718K4485k5590
$$ y = [62116, 38952, 52345, 82969, 85861, 77767, 29748, 19070, 11762, 2156, -16608, -51506, -63513, -30751, -45575, -46857, -34711, -77176, -58403, -48274, -2350, 39244, 58431, 76063, 18815, -11998, 29646, 49774, 19560, 24776, 36542, -51066, -16017, 37679, 25545, 36574, 20728, 63599, 49842, 9886, -6370, 10645, 10775, -929, 25777, 7929, -50906, -57771, -37235, -28758, -112730, -121948, -61225, 36885, 29742, 90196, 99899, 22055, -54673, -59400, -42307, -28264, -21382, -18100, -18556, -18187, 14989, -10112, -76908, -32912, 13025, -41683, -66632, -26571, 58591, 53235, 11672, 31389, 45601, 32138, 27310, -21075, -32891, -33193, -58354, -34680, -37562, -65389, -5788, 5848, 10831, 58185, 11632, 10001, 2878, 28677, 29928, 49513, 7028, 9695, 21413, 45898, 20308]
7826B0308m9002L4638j3764L986m705Q344k6985O320l3224m2525M7348K8187j6214
7813c7288O104k8217j8606K3643N4646K7004K1146L0584k0089N869j9496r192
7801C6108j3577m9360q2476J3121N2999J2542R515k8725k032N06J2062M7111J1217
7788A9011j0829m6279r1771j0636R2059P4522j0978J4148Q4583J4138n7189r3180
7776b2401K4799K1613n6007j2467l9050l9501J4372K6679j8927P1035M5365j8742
7764c232O0771J9044k4348m5535j690j6418r919K2911K2668J2892m9711k3008
7752c5575J2k8168k8883J3845M5970L5535j1947k9633L5152L2812j5064J8371
7740C2427Q4458Q5198n7636j09284n0374J2789l54j1032K7209M4809L9515q404
$$ y = [20308, -28694, 5944, -7820, -3834, -8539, -195, -27180, -20860, -54084, -96609, -49261, -21074, -37288, -31184, -59401, -78007, -54364, 282, 27286, 48432, 79016, 58927, 64796, 45300, 36108, 22531, -26829, -109305, -96184, -43185, -30643, -21128, -49853, -51885, -51379, -39317, 7794, 19011, 8182, -38097, -129868, -140504, -48445, 26077, 15099, 29247, 113830, 127968, 70779, -22401, 2398, 24011, -31996, -44463, -83513, -123014, -108642, -81963, -100890, -29855, 15510, -3232, 57539, 76583, 52235, 6700, 5010, -11408, -21327, 1584, 24252, 37144, -12567, -35575, -35563, -63731, -92614, -78769, -32799, 2736, -9211, -38844, -3692, 29120, 14056, 32427, 116885, 202083, 144447, 35163, -15211, -2422, -2776, -13808, 13401, 58210, 97725, 89321]
7728H9321p3637n458m4820l2094J4494M6898M4900J8406L1956N629l0934l9303
7716B5358j3156m8513k9419j1441j4121L9258P20K0655P4126O4333p5270m1432
7704h902o2613O3586O2643K1302R14R289l9713R130L200j6579L234L4040j3423
7691F6108o56p5654k4983L0004j6284K9679J8920j2645l355J4855L8836N489k0334
7678D9980n7490n0533M6231j054l2566K2678R376p757J7853J4451J5009j2788
7666A3390M152j3352r775J665l1505Q457M5221j03026m2147M2032k5494R880K7463
7653g3039O4953K8041o0829k2198j1344o397j7278N590j500M5752O12K4000P367
7640a6270M508K6528j5555J5034L0043j0471o1315r9289l1996L5520M8028R0924
$$ y = [89321, 15684, 10226, -34594, -66688, -52194, -5296, 39604, 58010, 89966, 95595, 64661, 25358, 12202, -36311, -65730, -77171, -91292, -52034, -51314, -30659, 43467, 107800, 32530, -8902, -71515, -7929, 54714, 76016, 76930, 86219, 46506, 55636, 58836, 42257, 45491, 79531, 66108, 65452, -10202, -35185, -5181, -21465, 8214, 27134, 14489, 11134, 25989, 64825, 70314, 49980, -7510, -58043, -11812, -12866, -45432, -22754, -13378, -21135, -3282, 11169, 26178, 13390, 17542, 4190, -5585, -3920, -35425, -26968, 18253, -84773, -126920, -84888, -110382, -100502, -73039, -8086, 19955, -40874, -63072, -74416, -80813, -98091, -92501, -94001, -48249, -47637, -23637, -16270, -11762, 14766, -789, 14245, 44288, 33817, -27498, -126787, -158783, -123263, -75235, 15689]
7628A5689K3819j9769r795J7913L5507m835n7677k802l5784N7201j7289j0570
7616h392j4478M5566K3224k8613l2908k898j1299k9289k5818J9082M488j1045
7604g2380m1972l9044K5072L3107N1143K1502L874L0778n203k6455m8062k3765
7592i1405k7670j3518O5657J0813m0796L9081J07956J9305N75M6660k1665l1161
7580F3832Q923n5067k6087j4331L8589M4840n880J0766o0377q6839M609l4263
7568a11285J1638J5610K5446K2821j9508n2201l88O5756K3193o192K1951J1276
7556H117l6323N8002l054j9264j4822l3479M844k7688K6673l7984M1643N2357
7544A9022J9529q805P514o0083l2916M4202M9629l9828m1452k1625k9679L7892
$$ y = [15689, 39508, 19739, 9944, 27857, 63364, 58529, 852, -1950, -37734, 19467, 2178, -8392, -22870, 22696, 45920, 17307, -15601, -18499, -29798, -59087, -84905, -65823, -61335, -72380, -114352, -153396, -128324, -95217, -44074, -22572, -18698, 12080, 6877, -19578, -67640, -91405, -119075, -132593, -66936, -56123, -96919, -57838, 50118, 69423, 69998, 116658, 94993, 63832, 72755, 17688, -8399, -22730, 15859, 60699, 54819, 65585, 5208, -81631, -77022, -111285, -99647, -84037, -58591, -35770, -55278, -107479, -107867, -42111, -18918, -25110, -3159, 8117, -28206, 29796, 26742, 7478, -7344, -40823, -35979, -63667, -36994, -74978, -33335, 19022, 38551, 29746, 37260, -22823, -55739, -11537, 38092, -1736, -43188, -64813, -94492, -56600]
7532e6600R140l4071k1178Q5260J956J9038Q3575L4653k982L041n9908j8403j8787
7519B4734n2778l842L2229J9120J8428j2442o5300R055L5047K3670k8100l0889
7507c1068k6740K5632O94L1748L7182n9885m3531K5542Q9728N7452k7488l6519
7495D2747K647n417q3231m4631J4657K9818l1703p134M0142J456K1196O5717q871
7482C7393m0442m4026M631K2742K6296N5364j6076k3575P941J2193m3359J847
7470I29J7391j9202j4793K5205J5395m5093j5639N2869N8138j2774l2331K7728
7458E7823k2586K6055L5465J329j8294l9200q27r167J5389p867j1472k1712L1371
7445C6307O3934m487p1573L286o0365r583M7362K929N441k9129o331k3449k6661
$$ y = [-56600, -47460, -81531, -102709, -17449, -15493, 3545, 87120, 121773, 118791, 121832, 61924, 43521, 24734, -28044, -31886, 343, 19463, 37891, 25449, -39851, -30796, 4251, 27921, -179, -31068, -57808, -32176, -31482, 266, 37448, -22437, -65968, -40426, 49302, 106754, 79266, 42747, 45394, 39977, -43254, -87885, -73228, -43410, -75113, -82247, -42105, -40649, -19453, 46264, 37393, -3049, -47075, -42444, -19702, 6594, 61958, 45882, 22307, 30248, 42441, -918, 929, 18320, -882, -15675, 9530, 24925, -20168, -35807, 17062, 75200, 62426, 30095, 57823, 35237, 61292, 96757, 98086, 79792, 40592, 39765, 30598, 45987, 38120, 26648, 4936, 36307, 100241, 95754, 24181, 27467, -32898, -42481, 4881, 7810, 13251, -15878, -22209, -45658, -72319]
7432g2319L5636l0960L5548N822j9596k3745j9089L3534N1391M9117j423n5127
7420a1211K8934o5989j8248J7306M6287j8532m9204n8114J2138J0846K8531J1006
7408f6250M5324j4262L9176L1516l9212j4190M5602K8863M05k3703L2634J3588
7396G9491Q999N0254O6968p2048o6908o7913k4274k690m0136o6669o8119j0380
7384b13425L7120j0063r034J17766O1242j3282o8943K5613L0801q0434q12J1783
7372a11668J6207N8414K2922J3650p3740N615Q5079j0612l2906N784p136P0489
7360D2098P7706J5621k3500J5575r181n1658o3717m432J788J3096l1468k9913
7348d7985J6656M2360R325K2412j1621L1061k8890q5161j3148P6474J2928o1457
$$ y = [-72319, -36683, -67643, -32095, -26273, -45869, -69614, -88703, -55169, -3778, 45339, 43916, -11211, 17723, -48266, -66514, -49208, -2921, -21453, -70657, -128771, -116633, -105787, -77256, -66250, -20926, -35188, 3988, 35504, -3708, -17898, 27704, 56567, 56972, 33269, 65903, 79491, 88490, 138744, 205712, 133664, 66756, -1157, -25431, -28121, -68257, -134926, -203045, -213425, -176305, -186368, -195402, -77636, -16394, -29676, -98619, -73006, -42205, -122639, -123451, -111668, -95461, -37047, -14125, -475, -74215, -68600, 16479, 5867, -27039, -21255, -28391, 42098, 119804, 135425, 111925, 127500, 118319, 66661, 2944, -1488, 300, 13396, -18072, -47985, -31329, 11031, 20356, 42768, 31147, 62208, 33318, -51843, -64991, 11483, 24411, -37046]
7336c7046n733o70j7836J4520M6954o887j3902l042K9288K1176N8857K722k146
7323H6255p187l2134m0832m2081k8435k4098m910N6506L7879L4048m7800p6747
7311h9536k3527K8684L9200j4123O427N0832j4312J7638j9494m8465K9919K445
7299c4312j960L1918k40p173o7814L7891L8126j4924r994M9226m934l4840k7067
7286d6097L4333M4400l4897o6234K5956K1026M5937l4881J689o4586n2618R642
7274a16330K2262M0045K749n9801M686J13167J6735m3721l5004l5384k9888M4172
7262g6312K7706m122M6060K759r5668k7215O6932M3981N1921L8562l5526p6371
7250c7293m9396P31m718l7584K783M7375K8599J1976L1255Q003k3884n0096l8366
$$ y = [-37046, -42779, -43449, -61285, -46765, 189, -6698, -20600, -23642, 5646, 26822, 85679, 88401, 86255, 79068, 46934, 6102, -35979, -64414, -88512, -93422, -36916, 963, 35011, -12789, -89536, -113063, -84379, -45179, -59302, -52875, -2043, -16355, 1283, -18211, -66676, -36757, -34312, -36272, -4354, -4594, -11767, -79581, -41690, -3564, -18488, -28482, 20744, 15810, -19030, -46097, -11764, 32636, -2261, -68495, -42539, -21513, 24424, -10457, -8768, -73354, -125972, -116330, -94068, -54023, -51274, -111075, -106389, 6778, 23513, -20208, -55212, -90596, -120484, -76312, -48606, -52728, -6668, -3909, -99577, -126792, -59860, -15879, 36042, 74604, 39078, -37293, -86689, -85958, -90676, -128260, -125477, -78102, -49503, -37527, -6272, 1731, -22153, -72249, -110615]
7237a10615j369J6919P0295L3129n586O4755m2188K2647O5195P290k4306n2066
7225D4100J2107J4383k1973l418k8011P423k4201l399O359m6146j4739J1723m0518
7212h6310j8728p748j201J462K6696K9754K7634j9604k7199l3605J6163P7603
7200a5083N1450n7376k3755K2804L64J4706j1158J3870j15622K1739Q7426n0596
7188f1231Q639l612n3252N9575O9786p6223M070K6744O586l2421Q30k909j0060
7175f3478l0841P5011N8267K101l4314l1723n0318n2064O8833O1299O35j5192
7163a1784M2671l9894n001l6474Q946J7264Q8532M0977o3698m6346J3784L2092
7151D1069j3793k9114K0899K3507n162J6488K3987l4135r150k3917n9355J1928
$$ y = [-110615, -111984, -95065, -24770, 8359, 2773, 67528, 25340, 47987, 113182, 120472, 96166, 44100, 56207, 70590, 48617, 45199, 17188, 24611, 410, -2989, 3370, -42776, -57515, -45792, -86310, -105038, -112786, -113987, -112525, -85829, -56075, -28441, -48045, -75244, -108849, -92686, -15083, 36367, -21009, -44764, -21960, -21596, -6890, -18048, -4178, -119800, -98061, -10635, -61231, -52592, -56204, -109456, -49881, 19905, -56318, -52248, -25504, -18918, -51339, -50509, -53418, -63478, -94319, -19308, 38959, 41060, 6746, -24977, -75295, -127359, -58526, 2773, 3408, -11784, 30887, -9007, -14008, -50482, -41536, -24272, 64260, 105237, 41539, -4807, 8977, 41069, 27276, -1838, 19061, 42568, 37406, 53894, 77881, 43746, 34596, 10679, -48676, -36748]
7139c6748Q567m9579j3775K4972k2919J7131M7150M3518J6159m188k0062l4646
7127b4420j7821K1532m6064j8242n254M6073J5333Q571Q333R878J6035k5658K7154
7114A5450L2983n1152L775M2582J077j8437M1861R601k4146k5967n3056J1747
7102a3682J8384J2346J5962o5362M851M9786K0399j7278M164K0737L7914P699
7090I5920n0421j1635n2571k1466J03555O8508o6053n4843n581O205k6960O4160
7078D8818N950l4966k4897L3047O3790L8008R780k5967r3448n5239j6566O1029
7066I339J6964K3220L3832m3940m3477J4792K4545O1441m6746j2550j9616l7088
7054a9284j8808L4807K7894j0742N695L1614l4082j0536J3987K2297j1593j3939
$$ y = [-36748, -28181, -77760, -91535, -66563, -89482, -72351, -25201, 18317, 34476, 30288, 10226, -24420, -42241, -20709, -66773, -85015, -90269, -44196, -28863, -20292, -11959, -2081, 13954, -11704, 15450, 48433, -2719, 1056, 43638, 44715, 26278, 68139, 77740, 53594, 27627, -25429, -13682, 4702, 17048, 33010, -32352, -27501, 22285, 42684, 25406, 29570, 50307, 88221, 95920, 45499, 33864, -18707, -40173, 63382, 131890, 65837, 10994, 5413, 11618, -15342, 48818, 54768, 19802, -5095, 27952, 91742, 129750, 139530, 113563, 20115, -35124, -51690, 9339, 26303, 49523, 83355, 39415, -4062, 10730, 35275, 96716, 49970, 37420, 17804, -19284, -38092, -3285, 24609, 13867, 19562, 51176, 17094, 6558, 20545, 42842, 31249, 17310]
7042A7310J0781J2731o1001K7862o200o4902P536n1884L213N9976k4765j293J0851
7029e9785N2272K5540o0696K1718L7963l6388p975O183j0924j5499K320l2283
7017g7554m7451M3755O4201N4198r875l8679R2900k122m0867l8594m1718R990
7005c1816L0515M9332k8099J9669J5018J6668K139q2707o1004p2513J02372J59174
6993A18748k1104m7539o9852l277K4655j601q3229k4725J6605M3830k5998J0619
6981f2868N4101O4740j0524m7495k4906l6047P8227K7589n922o9054J4781L3726
6969A6348J5947n4386k3152l2276K4875K5370J7592J0067M2547n415n1598m4366
6957e8447J708j7600M2099k347j7756j6424m1432K9077Q5396j6525J1345l655
$$ y = [17310, 28091, 40822, -20179, 7683, 1483, -63419, -55883, -107767, -104554, -44578, -69343, -70636, -59785, -7513, 18027, -42669, -20951, 17012, -19376, -27351, -21168, -32092, -47591, -45271, -77554, -125005, -81250, -17049, 37149, 27274, -11405, 81495, 79373, 38506, -88, -41806, -31816, -1301, 48031, 19932, 39601, 54619, 71287, 73426, -9281, -70285, -142798, -40426, 118748, 97644, 50105, -19747, -23024, 1631, 30, -83199, -107924, -91319, -47489, -73487, -62868, -8767, 55973, 45449, -2046, -26952, -62999, 15228, 42817, 36895, -32159, -17378, 16348, 32295, -22091, -45243, -77519, -52644, -27274, -9682, 385, 42932, 37517, -14081, -58447, -56739, -74339, -32240, -34587, -52343, -68767, -110199, -81122, 4274, -12251, -906, -4561]
6945d561m8836p841J5658J8233j2634l7877N653Q834L7996L2412k8725n99J4332
6932g955j6159P0992L0441K2274Q327n2801m4350K4902K0098K6574j6513k8187
6920C7643k1548N46J0163L3371K1397K4460N5991l5571q067n9769j2997L2039
6908G7658j9059j8260Q05P2949L419j5579o3458q823j6229j0470R607p663n5667
6895e0770J4538M0244N4337K4755l9653o2344p3644J2944N3800J4433j316l0993
6883d3669L0674J3284j3750l2870L509o745L046m4875K3915Q445l6120m3605P4981
6870f3780O183k8238K032M5483J2150m2451O301L0654n6610l8829N2670J1709
6858f2726k3153l7222j5010K4279l1128M5992N3336M8321j9391J8510j5876J7910
$$ y = [-4561, -53397, -61238, -45580, -27347, -39981, -77858, -72205, -63371, -25375, 7037, -21688, -22287, -7955, -24114, 46878, 77319, 99593, 107920, 55119, 10769, 35671, 55769, 82343, 65830, 37643, 16095, 16641, 26804, 60175, 81572, 106032, 162023, 126452, 118385, 58616, 45619, 77658, 58599, 40339, 41144, 114093, 117512, 101933, 38475, 29652, 13423, 2953, 12560, 4897, -50770, -36232, 4012, 58349, 83104, 43451, -18893, -92537, -79593, -25793, -11360, -12676, -43669, -12995, 289, -13461, -46331, -42822, -49567, -46521, -91396, -67481, -59036, -95156, -138761, -63780, -57597, -85835, -83803, -38320, -26170, -68621, -62320, -31666, -88276, -127105, -74435, -62726, -85879, -123101, -138111, -113832, -144960, -98968, -45632, 2689, -16702, 1808, -14068, 3842]
6846C842q118k3332L767L4177j7990L5417P782l5313K9012o471N3295J6569n453
6833H7184k9522j828o6644n7464J8471R6843L8396o2773m2647n5235k3753J8994
6821g9978K0591L4957o17L5529k144l595L4795k4962m1645l6960K225L8221K2511
6808a072L2689O1644m0418q2552r5995j0050O3902Q4427L5220l3971k6254L283
6796i147J9819n0079l184L7779J2161j4578P372L7291L4862k234j8792p387l3600
6783A0283l9147j7041J4317M38K7023J8047m2336o5644k3535K0915K8682M8669
6771a9329J3383n355J4259K1800J0942l6156k5409m8378J0815k988O584k9455
6759h9287Q727K9226J3662M5877o362M6313J9883m1984J1404r821j6437o1575
$$ y = [3842, -4276, -27608, -23841, 10336, -7654, 27763, 35545, 232, 29244, 22773, 76068, 92637, 87184, 57662, 55834, -10810, -68274, -49803, 47040, 85436, 22663, -19984, -75219, -98972, -79978, -59387, -24430, -25047, 10482, 8338, 4743, 39538, 14576, -27069, -64029, -61804, -23583, -1072, 31617, 93261, 52843, -29709, -125704, -135754, -71852, 12575, 47795, 13824, -12430, -9147, 10672, -39407, -42591, -4812, 7349, -7229, 143, 37434, 72296, 70062, 51270, 43883, 10283, -28864, -45905, -31588, -31150, -4127, 13920, -28416, -94060, -117595, -96680, -67998, -19329, -5946, -11301, 2958, 24758, 35700, -456, -25865, -74243, -63428, -66416, -59832, -89287, -80560, -51334, -37672, 8205, 1843, 48156, 68039, 26055, 37459, 27638, 11201, -50374]
6747e0374k3213L1582M3701N6291M6987J3919p5329l6078j2566m326M9342L4711
6735G4647N281j1846L6327l1716n1000N342j9610j6428l8078j8368O7104J5470
6723A7125j0351J0100L529J6995N912J3500p259j569o8120j3491N1620L741J0866
6710C2598L90m4012m3396K466L3509Q6356k3791p0416K812L2507N285J7157r808
6697B1657J7662L6767J9284N9529o0445m8675m0216J7807j0503o155K4812n2566
6685b1042J4557J7014L094K4433J5027P123J9063k7345N3754r711k0056J489j2456
6672F4944K6223K8184m3193j6523J783k6658j0181r632k4488l6634M2307m4771
6660d8639M296K0708p373J9081M2802K902M796M1974m6023n6154j1247n870k6515
$$ y = [-50374, -73587, -42005, 1696, 57987, 104974, 118893, 43564, 7486, -5080, -9406, 39936, 74647, 79928, 68082, 104409, 72693, 21693, 27035, 7425, -9003, -47081, -65449, 1655, 17125, 6774, 16874, 20403, 37398, 43310, 56810, 49551, 47982, -20138, -33629, 17991, 21732, 32598, 32988, -11024, -54420, -51954, -18445, 67911, 44120, -26296, -23484, 9023, 14308, 31465, 21657, 39319, 76086, 95370, 154899, 94454, 45779, 5563, 23370, 12867, 6712, 31524, -21042, -6485, 10529, 13623, 38056, 53083, 60206, 79269, 51924, 105678, 95967, 75911, 77400, 64944, 91167, 119351, 76158, 59635, 61418, 34760, 24579, 14947, -9541, -46175, -3868, -48639, -44343, -23635, -31008, -11927, 30875, 33777, 38573, 80547, 34524, -21630, -32877, -38747, -65262]
6647f5262L0252L9425l1099j7923K8552n355j8233j3249L3306j2250J2157K2008
6635B329j9322k8465j0851R006L0360K159j7758m0144K0995J02246m664m9269
6623c378j8138o367n0986J8176N2104m7528P596K7809j4500j2523L9001l068k0935
6610c2737K10j3778J5231n5267K5815J5997j1747k6908P1356L7097r389P195j8854
6597D221L7673L5992l0351k6868k3258j8040J8146k0011J612L4259k4812L300
6585h137j955J5946O5763k2802l3887L7026J108l7762m127J0517j5581k5649M8301
6572B8761o077m2223m753k0976l9818K9956R2427M1284r038o4513l6991l3506
6560f5467N8278K6678N793L702L972P2913J5304r59n530M8773L2031l3150q7211
$$ y = [-65262, -35010, 4415, -26684, -44607, -16055, -21410, -39643, -52892, -19586, -31836, -19679, 2329, -16993, -45458, -56309, -47303, -16943, -14784, -32542, -72686, -51691, 50555, 45891, -3378, -21516, -27883, -78869, -60693, -8589, -56117, -48521, -20712, -35212, -47735, -8734, -11802, -32737, -32527, -46305, -31074, -86341, -60526, -44529, -56276, -83184, -11828, 25269, 15880, 23075, 4221, 41894, 77886, 47535, 20667, -2591, -20631, -2485, -22496, -20884, 13375, -11437, -8137, -10092, 5854, 71617, 48815, 14928, 51954, 53062, 15300, 11173, 21690, 6109, -19540, 28761, 22684, -19539, -24292, -45268, -85086, -55130, 37297, 78581, 69543, 5030, -31961, -65467, -7189, 19489, 25282, 28984, 32956, 105869, 121173, 120214, 114684, 163457, 195488, 162338, 75127]
6547G5127j8541Q231K0195J2751K678M1222M091L3576k2732k8204L2550O6759
6535B27703o893j3744J7196M0418J6666L263L8257N0978J0036m6794m3747l3897
6523B59442j9714j2999k450l3382j5991J2255n1094k2611l5811k530P7724l496
6511A49343j8955o3184M2223k4680n0760J2429R6449r907Q477j13840n2641O4485
6499C9439J0886l7684k3003K4116k0765K219J4526K3190N0355l3065j03064j6405
6487f9255K7730O4451K1073m195M6504l1292j9163Q60M1912l6350j4335l8223
6475a0283l5626M4853J3049J54M297L2282n020j4481j5202J0685m262N214n2540
6462b6880j3622M3400J2835j2731K2432k6779m1066M6188J8176m5454N086j5895
$$ y = [75127, 56586, 64817, 85012, 97763, 100441, 141663, 145754, 179330, 156598, 128394, 160944, 227703, 220810, 207066, 224262, 264680, 281346, 284609, 322866, 373844, 383880, 337086, 293339, 259442, 239728, 226729, 224279, 190897, 174906, 187161, 136067, 113456, 77645, 75115, 152839, 149343, 130388, 67204, 109427, 84747, 33987, 46416, 142865, 132958, 141435, 27595, -25046, 39439, 50325, 12641, -10362, 13754, -7011, -4792, 9734, 32924, 83279, 50214, -52850, -69255, -41525, 22926, 43999, 39804, 86308, 55016, 35853, 36713, 78625, 42275, 27940, -10283, -45909, -1056, 11993, 12147, 16444, 48726, 43706, 29225, 14023, 24708, 20446, 25660, -26880, -40502, 2898, 15733, 3002, 25434, -1345, -42411, 3777, 21953, -23501, -18415, -34310]
6450c4310l4829n9262M4044K9383Q9868N1133n8274n4622M6288K0646J6508O618
6438F3191q3181k7839M5462M0972q836n3247J3451Q731m347l5329q554k6094l7257
6425a12877Q571N2486P0499J7779J890J6091k1826m1113j1203l2635J6425M4939
6413I026L7783J3062m7879N240k8562k1175K417M1601M9596o6443r9002n105O7738
6400d1703Q329K7722N0401K6028k6787K1609K6070J409k4278k0663L4700m2852
6388C9985j3207K2845l8123m6858L0500n828J759n893K267P2927L4859j8933l552
6375G2748j305m624m4214n263K1032J093K7970n528j2351L2947N8367j9936l8681
6362H2255k0166j6766p4889l3476M4211K5826J3808K6221J263k6417o067N5544
$$ y = [-34310, -69139, -128401, -84357, -54974, 34894, 86027, 27753, -26869, 19419, 40065, 56573, 63191, -19990, -47829, -2367, 38605, 29769, -23478, -10027, -1296, -5643, -40972, -49526, -75620, -112877, -104306, -51820, 18679, 36458, 38348, 54439, 32613, -8500, -19703, -52338, -35913, 9026, 46809, 59871, 11992, 17232, -11330, -32505, -30088, 11513, 61109, -5334, -104336, -109441, -41703, -33374, -5652, 44749, 70777, 43990, 65599, 91669, 93078, 68800, 48137, 82837, 39985, 26778, 49623, 11500, -35358, -4858, -10686, -8927, -14820, -12553, 60374, 95233, 76300, 72748, 71443, 66819, 22605, 17342, 38374, 39467, 67437, 61909, 49558, 82505, 140872, 120936, 82255, 62089, 45323, -29566, -63042, -18831, 6995, 20803, 47024, 48287, 21870, 15803, 71347]
6350G1347O1494k9122l7742k7108J6019j5832k4078j0299j4903k5815O2546O18
6338B7125j898j3516K523K4920J133m8295K6809M8457K5151l0011k433j915O909
6325F4959M8249J6191n5167j2944K3069l7512k4721O568J6038m655m0118k2384
6313b2427l5876n9210J3118Q371N9238N8105m4821l5613l4958o684l9664R1333
6301d9088O0956J0729J3761p763k0055O1930M6611L439j3662l1025J0615k2857
6289F3591k5019O497k9137l816J2191M368m0698k0625Q015M4748j023k7656k7848
6276c6412K6109J5939P7318J5634m0215k6439j5204L1083p394j9903j8598m1083
6264c9165l9032l072J0311L8998N0057p434j1999q352k0192k9845J3591M073j4566
$$ y = [71347, 132841, 103719, 65977, 38869, 54888, 39056, 14978, 4679, -10224, -36039, 26507, 27125, 25227, 11711, 14234, 39154, 40287, -8008, 18801, 67258, 92409, 62398, 59965, 58050, 64959, 113208, 129399, 74232, 61288, 84357, 46845, 22124, 28692, 44730, 40075, -43, -22427, -58303, -117513, -104395, -96024, -36786, 21319, -23502, -59115, -94073, -100757, -140421, -49088, 11868, 22597, 36358, 28595, 8540, 70470, 117081, 120520, 106858, 75833, 86448, 63591, 38572, 45069, 15932, 12116, 24307, 28675, -12023, -32648, -24633, 20115, 19092, -8564, -36412, -10303, 5636, 82954, 98588, 58373, 31934, 16730, 47813, 40419, 20516, 1918, -39165, -78197, -81269, -70958, -31960, 18097, 10663, -1336, -9688, -29880, -59725, -46134, -42061, -56627]
6251e6627k1031M9440J7514j6417r544o1984j8253L0436O0345N4299J0559m499
6239C4238m6328L0328K5430l2478n2031J3225q0194R231Q5372k9780J4344j1643
6227d0286K3566M1400p803k4525l4937m2935o681M5880K5045k7035j9551n303
6215g3165M8693N1187k5060k8821k1310N9387P926k5556j8933l4207k4596o070
6203i0525N2629J3513k533k7093M2083j2341p9654J510M7568P373L0037J3802
6191c631m5949k5003K4234m4020L5010Q7711m197l7741K9179k8863O483m0561
6179d7348l8714R383N6717J3618m1024j0139K8622O236K9754K9920l1359p2631
6167f6965J8505J6074l267L4708M9778J6919k4529k4780J7230j6614l7042l2340
$$ y = [-56627, -77658, -28218, -10704, -27121, -36665, -98649, -116902, -86466, -26121, 28178, 38737, 34238, -12090, 18238, 43668, 11190, -40841, -27616, -107810, -98579, -13207, -42987, -28643, -40286, -16720, 24680, 16877, -7648, -42585, -85520, -92201, -46321, -21276, -48311, -67862, -73165, -24472, 26715, 1655, -27166, -48476, 10911, 18837, -6719, -25652, -59859, -84455, -90525, -37896, -24383, -26916, -54009, -11926, -24267, -103921, -102411, -54843, -47470, -17433, -3631, -49580, -74583, -50349, -94369, -59359, 28352, 24155, -13586, 15593, -13270, -6787, -47348, -86062, -76679, -19962, -6344, -47368, -57507, -28885, -22649, 7105, 37025, 5666, -66965, -48460, -32386, -35653, -945, 48833, 65752, 41223, 16443, 33673, 17059, -19983, -52323]
$$ [...]
##END NTUPLES=NMR SPECTRUM
##END=
