##TITLE=Analysis number 329299
Compound Code cc 69609
Book Reference 486/188
Project Code adrs
Chemist Name simons
##JCAMPDX= 6.0         $$ Bruker NMR JCAMP-DX V2.0
##DATA TYPE= NMR SPECTRUM
##DATA CLASS= NTUPLES
##ORIGIN= Bruker BioSpin GmbH
##OWNER= nmr
$$ XWIN-NMR		Version 3.5
$$ Fri Aug 17 10:52:43 2007 GMT Daylight Time (UT+1h)  MAYBRIDGE\nmr@NMR_250MHZ
##.OBSERVE FREQUENCY= 250.131544655141
##.OBSERVE NUCLEUS= ^1H
##.ACQUISITION MODE= SIMULTANEOUS (DQD)
##.ACQUISITION SCHEME= undefined
##.AVERAGES= 16
##.DIGITISER RES= 18
##SPECTROMETER/DATA SYSTEM= dpx250
##.PULSE SEQUENCE= zg30
##.SOLVENT NAME= CDCl3
##.SHIFT REFERENCE= (INTERNAL, CDCl3, 0, 16.522)
##AUDIT TRAIL= $$ (NUMBER, WHEN, WHO, WHERE, WHAT)
$$ ##TITLE= Audit trail, XWIN-NMR		Version 3.5
$$ ##JCAMPDX= 5.01
$$ ##ORIGIN= Bruker BioSpin GmbH
$$ ##OWNER= nmr
$$ C:\u/data/dgb/nmr/ADRS/830/pdata/1/auditp.txt
$$ ##AUDIT TRAIL=  $$ (NUMBER, WHEN, WHO, WHERE, WHAT)
(   1,<2007-08-17 10:51:37.94 +100>,<MAYBRIDGE\nmr>,<NMR_250MHZ>,
      <created by zg, POWCHK disabled, PULCHK disabled
       configuration hash MD5:
       76 6E 9A 78 1E 09 19 81 EC 84 63 8F B0 6A 59 2D
       data hash MD5: 64K
       98 EE F1 57 A9 5C 28 30 6C 43 F7 EE DC 01 01 17>)
(   2,<2007-08-17 10:52:07.72 +100>,<MAYBRIDGE\nmr>,<NMR_250MHZ>,
      <Start of raw data processing
       ef LB = 0.3 FT_mod = 6 PKNL = 1 SI = 32K 
       data hash MD5: 32K
       B2 60 3A 5C E6 3F 3B 76 9E 8D 35 83 7C 04 29 A3>)
(   3,<2007-08-17 10:52:12.92 +100>,<MAYBRIDGE\nmr>,<NMR_250MHZ>,
      <apk 
       data hash MD5: 32K
       DC EE 1D D6 9D B7 B3 1F 9F 9D FC F1 69 D7 11 C8>)
(   4,<2007-08-17 10:52:17.86 +100>,<MAYBRIDGE\nmr>,<NMR_250MHZ>,
      <abs ABSG = 5 
       data hash MD5: 32K
       03 09 46 13 02 A1 52 78 DF 4E 3D 9C 9E 69 6A 64>)
$$ ##END=
$$ 
$$ hash MD5
$$ 35 73 C5 6A 39 A3 7B 73 3F 24 D8 78 21 AD 24 67
##$RELAX= 
##$RELAX= 
##$RELAX= 
##$RELAX= 
##$RELAX= 
##$RELAX= 
##$RELAX= 
$$ Bruker specific parameters
$$ --------------------------
##$DU= <C:\u>
##$EXPNO= 830
##$NAME= <ADRS>
##$PROCNO= 1
##$TYPE= <nmr>
##$USER= <dgb>
##$AMP= (0..31)
100 100 100 100 100 100 100 100 100 100 100 100 100 100 100 100 100 100 
100 100 100 100 100 100 100 100 100 100 100 100 100 100 
##$AQSEQ= 0
##$AQ_mod= 3
##$AUNM= <au_zg>
##$AUTOPOS= <13 >
##$BF1= 250.13
##$BF2= 250.13
##$BF3= 250.13
##$BF4= 250.13
##$BF5= 500.13
##$BF6= 500.13
##$BF7= 500.13
##$BF8= 500.13
##$BYTORDA= 1
##$CFDGTYP= 0
##$CFRGTYP= 5
##$CHEMSTR= <none>
##$CNST= (0..31)
1 1 145 1 1 1 1 1 1 1 1 1 1 1 1 1 1 1 1 1 1 1 1 1 1 1 1 1 1 1 1 1 
##$CPDPRG= <>
##$CPDPRG1= <>
##$CPDPRG2= <>
##$CPDPRG3= <>
##$CPDPRG4= <mlev>
##$CPDPRG5= <mlev>
##$CPDPRG6= <mlev>
##$CPDPRG7= <mlev>
##$CPDPRG8= <mlev>
##$CPDPRGB= <>
##$CPDPRGT= <>
##$D= (0..31)
0 1 0 0 0 0 0 0 0 0.06 0 0 0 0 0 0 0.0002 0 0 0 0 0 0 0 0 0 0 0 0 0 0 
0 
##$DATE= 1187344295
##$DBL= (0..7)
120 120 120 120 120 120 120 120 
##$DBP= (0..7)
150 150 150 150 150 150 150 150 
##$DBP07= 0
##$DBPNAM0= <>
##$DBPNAM1= <>
$$ [...]
##$SUBNAM7= <"">
##$SUBNAM8= <"">
##$SUBNAM9= <"">
##$SW= 20.6930455092707
##$SWIBOX= (0..15)
0 0 3 0 0 0 0 0 0 0 0 0 0 0 0 0 
##$SW_h= 5175.983436853
##$TD= 65536
##$TD0= 1
##$TE= 296.16
##$TE2= 300
##$TE3= 300
##$TEG= 300
##$TL= (0..7)
0 120 120 120 120 120 120 120 
##$TP= (0..7)
150 150 150 150 150 150 150 150 
##$TP07= 0
##$TPNAME0= <>
##$TPNAME1= <>
##$TPNAME2= <>
##$TPNAME3= <>
##$TPNAME4= <>
##$TPNAME5= <>
##$TPNAME6= <>
##$TPNAME7= <>
##$TPOAL= (0..7)
0.5 0.5 0.5 0.5 0.5 0.5 0.5 0.5 
##$TPOFFS= (0..7)
0 0 0 0 0 0 0 0 
##$TUNHIN= 0
##$TUNHOUT= 0
##$TUNXOUT= 0
##$USERA1= <user>
##$USERA2= <user>
##$USERA3= <user>
##$USERA4= <user>
##$USERA5= <user>
##$V9= 5
##$VALIST= <valist>
##$VCLIST= <CCCCCCCCCCCCCCC>
##$VD= 0
##$VDLIST= <DDDDDDDDDDDDDDD>
##$VPLIST= <PPPPPPPPPPPPPPP>
##$VTLIST= <TTTTTTTTTTTTTTT>
##$WBST= 1024
##$WBSW= 4
##$XGAIN= (0..3)
0 0 0 0 
##$XL= 0
##$YL= 0
##$YMAX_a= 485031
##$YMIN_a= -384895
##$ZGOPTNS= <>
##$ZL1= 120
##$ZL2= 120
##$ZL3= 120
##$ZL4= 120
##$ABSF1= 16.522
##$ABSF2= -4.171173
##$ABSG= 5
##$ABSL= 3
##$ALPHA= 0
##$AQORDER= 0
##$ASSFAC= 0
##$ASSFACI= 0
##$ASSFACX= 0
##$ASSWID= 0
##$AUNMP= <proc_1d>
##$AZFE= 0.1
##$AZFW= 0.1
##$BCFW= 0
##$BC_mod= 0
##$BYTORDP= 0
##$COROFFS= 0
##$CY= 12.5
##$DATMOD= 1
##$DC= 0
##$DFILT= <>
##$DTYPP= 0
##$F1P= 14.0000005364418
##$F2P= -0.99999901652339
##$FCOR= 0.5
##$FTSIZE= 32768
##$FT_mod= 6
##$GAMMA= 0
##$GB= 0
##$INTBC= 1
##$INTSCL= 1
##$ISEN= 128
##$LB= 0.3
##$LEV0= 0
##$LPBIN= 0
##$MAXI= 10000
##$MC2= 0
##$MEAN= 0
##$ME_mod= 0
##$MI= 0
##$NCOEF= 0
##$NC_proc= -5
##$NLEV= 6
##$NOISF1= 0
##$NOISF2= 0
##$NSP= 0
##$NTH_PI= 0
##$NZP= 0
##$OFFSET= 16.522
##$PC= 1
##$PHC0= -43.74091
##$PHC1= 7.955554
##$PH_mod= 1
##$PKNL= yes
##$PPARMOD= 0
##$PSCAL= 4
##$PSIGN= 0
##$REVERSE= no
##$SF= 250.13
##$SI= 32768
##$SIGF1= 0
##$SIGF2= 0
##$SINO= 400
##$SIOLD= 32768
##$SREGLST= <1H.CDCl3>
##$SSB= 0
##$STSI= 32768
##$STSR= 0
##$SW_p= 5175.98343685301
##$SYMM= 0
##$S_DEV= 0
##$TDeff= 65536
##$TDoff= 0
##$TI= <Analysis number 999999
Compound Code 99
Book Reference 9
Project Code 9>
##$TILT= no
##$TM1= 0
##$TM2= 0
##$TOPLEV= 0
##$USERP1= <user>
##$USERP2= <user>
##$USERP3= <user>
##$USERP4= <user>
##$USERP5= <user>
##$WDW= 1
##$XDIM= 32768
##$YMAX_p= 460134023
##$YMIN_p= -424021
$$ End of Bruker specific parameters
$$ ---------------------------------
##NTUPLES= NMR SPECTRUM
##VAR_NAME=  FREQUENCY,     SPECTRUM/REAL,   SPECTRUM/IMAG
##SYMBOL=    X,             R,               I
##VAR_TYPE=  INDEPENDENT,   DEPENDENT,       DEPENDENT
##VAR_FORM=  AFFN,          ASDF,            ASDF
##VAR_DIM=   32768,         32768,           32768
##UNITS=     HZ,            ARBITRARY UNITS, ARBITRARY UNITS
##FACTOR=    0.157963299565203, 1,           1
##FIRST=     4132.6476996994, 0,             0
##LAST=      -1043.33573715361, 0,           0
##MIN=       -1043.33573715361, -424021,     0
##MAX=       4132.6476996994, 460134023,     0
$$ Real data points
##PAGE= N=1
##DATA TABLE= (X++(R..R)), XYDATA
$$ [...]
16841a27566K5536L0946M5509j30632q6627R1642K54512K5782j62653m6314J27050
$$ -127566 -102030 -71084 -25575 -156207 -242834 -151192 103320 129102 -33551 -79865 47185
16830D7185l8654r0205j09640o4021n5899K0779J04451R9295M4118m8622J8802
$$ 47185 8531 -81674 -191314 -255335 -311234 -290455 -186004 -86709 -42591 -91213 -72411
16819g2411l3688N8924O2603P316Q3937L4826j00326r4488R7299M7942l1091p664
$$ -72411 -106099 -47175 15428 22744 106681 141507 41181 -53307 43992 91934 60843 53179
16807E3179j37733j19532M9907L3501Q9924J03294r696L5916n6772r7635m2403
$$ 53179 -84554 -204086 -154179 -120678 -30754 72540 62844 98760 41988 -55647 -98050
16796i8050Q0844L1170K7759O8404J1114K0316n3237l2575p6133r4933n8312q397
$$ -98050 -17206 13964 41723 110127 121241 141557 88320 55745 -20388 -115321 -173633 -182030
16784a82030M9264m6555J9316P1133P2806M6167K9855j8055j3028n2231L4911
$$ -182030 -132766 -179321 -160005 -88872 -16066 30101 59956 41901 28873 -23358 11553
16773A1553J0003L0143J3269p8408j04766j7512l1494N1677J34726J13562n6680
$$ 11553 21556 51699 64968 -13440 -118206 -135718 -167212 -115535 19191 132753 76073
16762G6073N8454p3156Q6947q6330m7941q2165l4613n6035m8014K2674Q0877K2722
$$ 76073 134527 61371 148318 61988 14047 -68118 -102731 -158766 -206780 -184106 -103229 -80507
16750h0507j0661o5179J9301M401J4305m098j04004m1413o4773O3015M0655M3997
$$ -80507 -91168 -156347 -137046 -132645 -118340 -122438 -226442 -267855 -332628 -269613 -228958 -184961
16738a84961r2759m1925Q7390N4278J6341O8008O4948k6399N0461r6306j02634
$$ -184961 -277720 -319645 -232255 -177977 -161636 -93628 -28680 -55079 -4618 -100924 -203558
16727b03558K0644J31169L9882l8053j02080Q779n7399k1321K14231J2376o4797
$$ -203558 -182914 -51745 -11863 -49916 -151996 -143217 -200616 -221937 -7706 4670 -60127
16716f0127j11609L782J0761K419L3865N0203P7556M9959j056j43184K3798J04718
$$ -60127 -171736 -167954 -157193 -154774 -120909 -70706 6850 56809 55753 -87431 -63633 41085
16704D1085j4592k0168l786L2590k2810o0953m681K2714l9966Q6380N1637K5638
$$ 41085 26493 6325 2539 35129 12319 -48634 -53315 -30601 -70567 15813 67450 93088
16692I3088R9552j49327r5127L2765M7729J9461p1341q9604q9517J5270m5038
$$ 93088 192640 43313 -51814 -19049 28680 48141 -23200 -112804 -202321 -187051 -232089
16681b32089K8841R4533J08912o7013R2913J88767N7807j12108j98684o6632o1735
$$ -232089 -203248 -108715 197 -66816 26097 214864 272671 160563 -38121 -104753 -166488
16670a66488L5194K3509p8730l139M0352P8033j5248p7023k4061j7889r3358k291
$$ -166488 -131294 -107785 -186515 -189654 -149302 -71269 -86517 -163540 -187601 -205490 -298848 -301139
16658c01139O7312J35866J25228O0220j06700n7770K8377K3342L6n1942o4450
$$ -301139 -233827 -97961 27267 87487 -19213 -76983 -48606 -25264 -25228 -77170 -141620
16647a41620n1796K0026J61719N5257N1074J1212K0366r5818l7079N3546P2582
$$ -141620 -193416 -173390 -11671 43586 94660 105872 126238 30420 -6659 46887 119469
16636A19469n791L346m0981q1665m0033M7637m000r0961J1806j4256m3355R2383
$$ 119469 113678 117024 76043 -5622 -45655 1982 -2018 -92979 -81173 -95429 -138784 -46401
16624d6401M8364K3474j49895q9129K9724M4352J8052K7347k9713n741M5662k7315
$$ -46401 1963 25437 -124458 -213587 -183863 -139511 -121459 -94112 -123825 -129566 -83904 -111219
16612a11219r412J43220N3756r9524k9782J6535Q1547O1843N1046O954m0456j32079
$$ -111219 -120631 22589 76345 -23179 -52961 -36426 45121 106964 158010 164964 124508 -7571
16600g571j80798j42720O1216J03378N4515p6132M1831J45254J01851K3263l1819
$$ -7571 -188369 -331089 -269873 -166495 -111980 -188112 -146281 -1027 100824 124087 92268
16589I2268q5784q604M0846n2866o5625O9619n3016j12845M6800J14979N1744
$$ 92268 6484 -2120 38726 -14140 -79765 -10146 -63162 -176007 -129207 -14228 37516
16578C7516p2937m2027j897r3624p3104K6003N9951l479o2381l4411m2382k0487
$$ 37516 -35421 -77448 -79345 -172969 -246073 -220070 -160119 -163598 -225979 -260390 -302772 -323259
16566c23259O6954J40696P6994j3657m2368n9118L5826K1449q12k4091l8350J28982
$$ -323259 -256305 -115609 -38615 -52272 -94640 -153758 -117932 -96483 -97295 -121386 -159736 -30754
16554c0754J21260q9284j66818R2188K9163k6385Q2321k3765l3214m8143n1110
$$ -30754 90506 1222 -165596 -73408 -44245 -70630 11691 -12074 -45288 -93431 -144541
16543a44541K8234L6132j2512p4772l3123j4883R8488M9161j5721O85J105M7263
$$ -144541 -116307 -80175 -92687 -167459 -200582 -215465 -116977 -67816 -83537 -82852 -81747 -34484
16531c4484M9045N5110J5686j21274K3103k7617j4590L5307O4368q4059j06274
$$ -34484 14561 69671 85357 -35917 -12814 -40431 -55021 -19714 44654 -39405 -145679
16520a45679N0223R4602P1027k0254n1089j14941N5724O3870m4185Q497o0128
$$ -145679 -95456 -854 70173 49919 -1170 -116111 -60387 3483 -40702 -32205 -92333
16509i2333L0500q748r8408J2022O9843N2942j5462m2384M190K1279l7322O7269
$$ -92333 -61833 -70581 -168989 -156967 -87124 -34182 -49644 -92028 -87838 -66559 -103881 -36612
16497c6612N4545L2018k5642j2640L9829J39833J2028r1773j22612r7232J7839
$$ -36612 17933 49951 24309 11669 51498 191331 203359 111586 -11026 -108258 -90419
16486i0419o8480n6367r056M8765l0344o6294P4469L6646o3018N5920O4844j41390
$$ -90419 -158899 -215266 -224322 -175557 -205901 -272195 -197726 -161080 -224098 -168178 -103334 -244724
16474b44724o1925N8862J07564Q0719R0092J45681l2619q740K3351K6687m9851
$$ -244724 -306649 -247787 -140223 -59504 30588 176269 143650 134910 158261 184948 135097
16463A35097L4194L4130J6103N8124O6235o1625j01661m3533j11743j9156P3475
$$ 135097 169291 203421 219524 277648 343883 282258 180597 137064 25321 6165 79640
16452G9640O2638n1174J33J3593l6807n2423m9110K1123P5398j9924j05002k2899
$$ 79640 142278 91104 91237 104830 68023 15600 -33510 -12387 63011 43087 -61915 -84814
16440h4814P3684J2950r5990p9898J02215j1633L6550J85175J82975n1617n6789
$$ -84814 -11130 1820 -94170 -174068 -71853 -83486 -46936 138239 321214 269597 212808
16429B12808L06k1249J20649J2927q2944j18857r2724L7360P9117O7780j0271
$$ 212808 213114 191865 312514 325441 242497 123640 30916 68276 147393 215173 204902
16418B04902O5281k2055L6375p7371j3761j62492o6274J25957P0608M5535j29023
$$ 204902 270183 248128 284503 207132 193371 30879 -35395 90562 161170 206705 77682
16407G7682L7098L2583k1741m709l5413Q4041M3144O4037m6850j999r3891o6414
$$ 77682 114780 147363 125622 120913 85500 169541 212685 276722 229872 227873 133982 67568
16395F7568K4867r7662m9624O2217P2294o4139l6472n7598K5065P8481J34285
$$ 67568 92435 -5227 -54851 7366 79660 15521 -20951 -78549 -53484 24997 159282
16384A59282L3444r6487o3754J03673J2774o7044j43107r2935M3506J65659J80255
$$ 159282 192726 96239 32485 136158 148932 81888 -61219 -154154 -110648 55011 235266
16373B35266J04764J55590k9599j13199l852p0110Q3362Q5198J24632r2857j34165
$$ 235266 340030 495620 466021 352822 348970 278860 362222 447420 572052 479195 345030
16362C45030r3012r0194p4597N4731J36648R8574o7937j07921p9127k5647N2646
$$ 345030 252018 161824 87227 141958 278606 377180 309243 201322 122195 96548 149194
16351A49194J1694O6174N3859K4580q383o6267n6034r2358j9966R7713K7838l2886
$$ 149194 160888 227062 280921 305501 297118 230851 174817 82459 62493 160206 188044 155158
16339A55158K7287l6305k0690p0403j21878L4761K4659j04996L7049K2570j6020
$$ 155158 182445 146140 125450 55047 -66831 -32070 -7411 -112407 -75358 -52788 -68808
16328f8808L0119m4783L727J46721P4309O5919o149M2261J79170J1274j3190r8048
$$ -68808 -38689 -83472 -79745 66976 141285 207204 201055 243316 422486 433760 420570 322522
16316C22522q30o950N7203L06313L20495K27317o1473O7759K51395O3173n3397
$$ 322522 321692 314742 371945 678258 998753 1226070 1164597 1232356 1483751 1546924 1493527
16305A493527j28219j98938k30117k14827j55919m0011L5702m4506K4357J30652
$$ 1493527 1365308 1166370 936253 721426 565507 525496 561198 516692 541049 671701
16295F71701J64705R6815p2886J6544J57245K70537K59074M8665j83214j91466
$$ 671701 836406 933221 860335 876879 1034124 1304661 1563735 1612400 1429186 1237720
16285A237720j42996n3847n674N3741N8117K2793j18783j39962r2843q0135L0018
$$ 1237720 1094724 1040877 1035203 1088944 1147061 1169854 1051071 911109 818266 738131 768149
16274G68149L2208Q0641J36555J14851o2380j07531j08875j79271j76616p5873
$$ 768149 800357 880998 1017553 1132404 1070024 962493 853618 674347 497731 421858
16264D21858P8801R373r9963k5884K6435M1849m1579j22533n8549n2296p531K7442
$$ 421858 500659 510032 410069 384185 410620 452469 410890 288357 229808 177512 169981 197423
16252A97423K2096K158m009m3507N812Q528j24590o971r5109l3919j0122J08834
$$ 197423 219519 221677 217668 174161 179973 188501 63911 56940 -38169 -72088 -82210 26624
16240B6624K4086j04976J5523m7863M5305P7144j06364K7537N1406p59m5486j30897
$$ 26624 50710 -54266 -38743 -86606 -41301 35843 -70521 -42984 8422 7663 -37823 -168720
16228a68720j8105J3333J74878J07388n3706j65958k54m8494J07927O1130m548
$$ -168720 -186825 -173492 1386 108774 55068 -110890 -111144 -159638 -51711 9419 4871
16217D871M3374L2702o407j34436l8879K008O4513P466N865n3657O3930Q5814
$$ 4871 48245 80947 74540 -59896 -98775 -96767 -32254 -24788 -18923 -72580 -8650 77164
16205G7164j65091l2895J14706M8789p8699m0802l0524J4501p7173O535K6894
$$ 77164 -87927 -120822 -6116 42673 -36026 -76828 -107352 -92851 -170024 -163489 -136595
16194a36595O4506J14372N9533J975K4794m6976l9020r9363N1289O2607k0553
$$ -136595 -72089 42283 101816 103791 128585 81609 42589 -56774 -5485 57122 36569
16183C6569Q839J7789k0771l5082l4282M5058r003J6555j290M4453J7520j9869
$$ 36569 45408 63197 42426 7344 -26938 18120 9117 25672 24382 68835 86355 66486
16171F6486j8555r6911j22283j39563K5417R4024O9244r271M7231n7532O3539
$$ 66486 47931 -48980 -171263 -310826 -285409 -191385 -122141 -131412 -84181 -141713 -78174
16160g8174M7984k2452q3729q6400L752J04529j7270k0220M2442Q9370j696K0183
$$ -78174 -30190 -52642 -136371 -222771 -219019 -114490 -131760 -151980 -109538 -20168 -21864 -1681
16148a681M021L8526m4433O7479J05840K7962k33228j98782l4357O5164m9277
$$ -1681 2340 40866 -3567 63912 169752 197714 -35514 -234296 -268653 -203489 -252766
16137b52766n2846O5474J47092P2733K6190n5916r3402J5865J03511J5638n3119
$$ -252766 -305612 -240138 -93046 -20313 5877 -50039 -143441 -127576 -24065 -8427 -61546
16126f1546K6194J4546Q5684k1081l7646p7416n6180M6971o1834l4443O1705R1170
$$ -61546 -35352 -20806 64878 43797 6151 -71265 -127445 -80474 -142308 -176751 -115046 -23876
16114b3876M1772j6458j05221L9819J36938n0649m8809j41717j27824j27996J13429
$$ -23876 17896 1438 -103783 -63964 72974 22325 -26484 -168201 -296025 -424021 -310592
16103c10592J57742O2854N2910j8492j53044R6883J10141L4398k9552l663p5231
$$ -310592 -152850 -89996 -37086 -55578 -208622 -111739 -1598 32800 3248 -415 -75646
16092g5646O702m0195J5651K5376O507O5638p8747n3326l4186N5740J03749K9287
$$ -75646 -68944 -109139 -93488 -68112 -61605 4033 -74714 -128040 -162226 -106486 -2737 26550
16080B6550M4897J6540m5112q7992j7383M0296p012J1638j38p306n6196l3057
$$ 26550 71447 87987 42875 -45117 -62500 -22204 -29216 -17578 -17716 -25022 -81218 -114275
16068a14275N7596m2290K9230J47479R171k6615O5906m9908p2232o4238m6469
$$ -114275 -56679 -98969 -69739 77740 86911 60296 126202 76294 4062 -60176 -106645
16057a06645P6777J33530j42672j30171r3701J57963P9069j5062j8718N5438J6249
$$ -106645 -29868 103662 -39010 -169181 -262882 -104919 -25850 -40912 -59630 -4192 12057
16046A2057j38406k11225l4538J05023R8836J71544J16026m1838Q6369k2356o6106
$$ 12057 -126349 -337574 -372112 -267089 -168253 3291 119317 77479 163848 141492 75386
16035G5386j19551n1969J2666k1011J33863O3405n0429j24744k8723J12816Q6375
$$ 75386 -44165 -96134 -83468 -104479 29384 92789 42360 -82384 -111107 1709 88084
16024H8084J21279L612n5023m8788k1893J8246O9567O3986K239j7768N4363p1496
$$ 88084 209363 212975 157952 109164 87271 105517 175084 239070 241309 223541 277904 206408
16012B06408M0191R6216n3637j42296M7447J43283l4023l1090K0739J55117J03786
$$ 206408 246599 342815 289178 146882 194329 337612 303589 272499 293238 448355 552141
16001E52141o085j38810j16910j6578L1702l3639O7825P3934Q76p5038j9452q5469
$$ 552141 546056 407246 290336 273758 305460 271821 339646 413580 414456 339418 319966 234497
15989B34497P870j3942p3724K6592o1788o104R8093R1847m6914m9329J3751o9392
$$ 234497 242367 228425 154701 181293 119505 113401 211494 303341 256427 207098 220849 151457
15977A51457j4140m858Q5793L4166p7798J8205K2437O7266l5151N4769p1504j01585
$$ 151457 137317 132459 218252 252418 174620 192825 215262 282528 247377 302146 230642 129057
15965A29057M7788K8910Q2935P7331p655R964p6313j1928M0200n2961K4353L703
$$ 129057 176845 205755 288690 366021 358366 368330 292017 280089 320289 267328 291681 295384
15953B95384P0470K9106L6690m182l8155J09499Q1334j7215n3300q0587J689m387
$$ 295384 365854 394960 431650 427468 389313 498812 580146 562931 509631 429044 430733 426346
15941D26346J34743K7894J02941n1948j15180k3884J8937P5398N6702n6051m1425
$$ 426346 561089 588983 691924 639976 524796 500912 519849 595247 651949 595898 554473
15930E54473k0641j21557j87273j50261p2146P0207P7546Q5593J31504K7980N5273
$$ 554473 533832 412275 225002 74741 2595 72802 150348 235941 367445 395425 450698
15919D50698m3578j1467l579l0990m9018k9231j08356K0252Q3881K2310r2606
$$ 450698 407120 395653 392074 361084 312066 282835 174479 194731 278612 300922 208316
15908B08316r6827j9807L9057J11198j5280n2428l1035l5887L677J371K670M6237
$$ 208316 111489 91682 130739 241937 226657 174229 143194 107307 110984 112355 115025 161262
15896A61262L6772r3080n9017J1932K112m5188j05273l5611Q921J40392J04993
$$ 161262 198034 104954 45937 57869 59981 14793 -90480 -126091 -117170 23222 128215
15885A28215j29930j41648K0126M6137N4718K7802J6462O9670j0555j53452P845
$$ 128215 -1715 -143363 -123237 -77100 -22382 5420 21882 91552 80997 -72455 -64610
15874f4610J30873M6884n5844o0671M911Q4421P3185j21058q1456j734o3911q276
$$ -64610 66263 113147 57303 -3368 1543 85964 159149 38091 -43365 -45099 -109010 -117286
15862a17286O2475P0330k6823l2469k6930o7275p3570k4394k8762N7388Q6597
$$ -117286 -54811 15519 -11304 -43773 -70703 -137978 -211548 -235942 -264704 -207316 -120719
15851a20719J06764O6958j578J9963Q4957l3453j5547J0108o1576J3474j9028
$$ -120719 -13955 53003 51425 71388 156345 122892 107345 117453 55877 69351 50323
15840E0323p1871M1103J7669q2828N0410j3418J1438L5515n6660p4112m3202L5136
$$ 50323 -21548 19555 37224 -45604 4806 -8612 2826 38341 -18319 -92431 -135633 -100497
15828a00497J60157R2722J8178O3138J87457m6358n2243J6529Q8522p0986n7356
$$ -100497 59660 152382 170560 233698 421155 374797 322554 339083 427605 356619 299263
15817B99263l0590J16172N5365q2217l0543M7557K0529k6124O5642J24115M2843
$$ 299263 268673 384845 440210 357993 327450 375007 395536 369412 435054 559169 602012
15806F02012r2136m8688Q3320J26275j1259M1069q790M140j3704O0826J1943O937
$$ 602012 509876 461188 544508 670783 659524 700593 691803 695943 682239 743065 755008 761945
15794G61945L0294M7080J8442r1832j27527j43943J3077O9621N2875M3285L6340
$$ 761945 792239 839319 857761 765929 638402 494459 507536 577157 630032 673317 709657
15783G09657O6686N5267p3796n1049k3746M8087k4074p7234j50632J5803K3874
$$ 709657 776343 831610 757814 706765 683019 731106 707032 629798 479166 494969 518843
15772E18843J41477J46085L0152o1377J13144J46793M9257j96304j04206j6127
$$ 518843 660320 806405 836557 775180 888324 1035117 1084374 888070 783864 767737
15762G67737q082p0014M392m4790K2240M4052j7493k9134j19896j27080q6477
$$ 767737 759655 689641 694033 649243 671483 715535 698042 668908 549012 421932 335455
15751C35455J2351k6091n6012J5334P8489m0154J7884M8449K8804k9020q3747
$$ 335455 347806 321715 265703 281037 359526 319372 337256 385705 414509 385489 301742
15740C01742Q0088q6745o2043L293M9151J10947J3608p1077K9030J41640q664
$$ 301742 381830 295085 233042 236335 285486 396433 410041 338964 367994 509634 500970
15729E00970K8441j27709q2939O8276Q2693O963P4840N9404q2357j06505r1479
$$ 500970 529411 401702 318763 387039 469732 476695 551535 610939 528582 422077 330598
15718C30598o8045J02153J07397R5781l618Q4316n5969o8888o7339l4288K6723
$$ 330598 262553 364706 472103 567884 564266 648582 592613 523725 456386 422098 448821
15707D48821J9505q2629q3192N6788L3105K6194n0944l9335j18939m3275p3958
$$ 448821 468326 385697 302505 359293 392398 418592 367648 328313 209374 166099 92141
15696I2141K880R422R6700l50n9650N992j2103j1409q1723p1306R462R166j7756
$$ 92141 95021 104443 201143 200793 141143 147135 135032 123623 41900 -29406 -19944 -10778 -28534
15683b8534O4706J00960m4198n1156p7068K4496L7697J0235P8436p779M1799n3942
$$ -28534 36172 137132 92934 41778 -35290 -10794 26903 37138 115574 107795 149594 95652
15671I5652l3205j9817r5224j02205r0716J3272J48674j2630o343l6101j04247
$$ 95652 62447 42630 -52594 -154799 -245515 -232243 -83569 -96199 -102542 -138643 -242890
15660b42890q746M971J53406J40895M7723O3546n8247M9102L223j6289q6914j08044
$$ -242890 -251636 -246665 -93259 47636 95359 158905 100658 149760 152983 136694 49780 -58264
15648e8264M8515n7734m0015j1262L4083J50793R0585j0249n3201p3076k5847
$$ -58264 -9749 -67483 -107498 -118760 -84677 66116 156701 146452 93251 20175 -5672
15637e672J1824K7179J0549J0360n2572m5840j23411n6791J30520J3959M2641
$$ -5672 6152 33331 43880 54240 1668 -44172 -167583 -224374 -93854 -79895 -37254
15626c7254J2591r8532K5302L9676J4595M5681J1089j0521j4646O3906m9557j10625
$$ -37254 -24663 -123195 -97893 -58217 -43622 2059 13148 2627 -12019 51887 2330 -108295
15614a08295K0512L6486R4313J06958l8630j3104m1557M945j9266M1554p7200
$$ -108295 -87783 -51297 43016 149974 111344 98240 56683 61628 42362 83916 6716
15603F716n4921O5099N1730n5901j2139N165J7503k2135J728l6322N3466q109
$$ 6716 -48205 16894 68624 12723 584 5749 23252 1117 2845 -33477 19989 11880
15591A1880n5335K0673K4169o6223J8570K4241j7720O723m9702P276J17755m067
$$ 11880 -43455 -22782 1387 -64836 -46266 -22025 -39745 -33022 -82724 -75448 42307 38240
15579C8240K9318o917q2521m1425J647J0820J01259n9619r33Q4480O8580n0829
$$ 38240 67558 60641 -21880 -63305 -61658 -50838 50421 -9198 -10131 74349 142929 92100
15567I2100O5592L9506L357N0158j06181o3568L1513l049p7308m3392j30454K24
$$ 92100 157692 197198 200555 250713 144532 80964 112477 109428 32120 -11272 -141726 -141502
15555a41502Q2959O3802R263m2516J5972L4818m1069m1448J182Q9728k3657K1160
$$ -141502 -58543 5259 14522 -27994 -12022 22796 -18273 -59721 -58539 31189 7532 28692
15543B8692j4863n5538n2581n7384k4472L3370P0058P0261j2627N6553o1027o7105
$$ 28692 13829 -41709 -94290 -151674 -176146 -142776 -72718 -2457 -15084 41469 -19558 -86663
15531h6663r2271J13079N6498l6617K3598Q7558n9999l1993J8438K5475n3906
$$ -86663 -178934 -65855 -9357 -45974 -22376 65182 5183 -26810 -8372 17103 -36803
15520c6803M1379Q0965j9132j11289J5086j5485o4835K4508P8100j52227l7482
$$ -36803 4576 85541 66409 -44880 -29794 -45279 -110114 -85606 -7506 -159733 -197215
15509a97215P8169q4931m6111j5700J11680J3013J467N5806k6131q6314l7695
$$ -197215 -119046 -203977 -250088 -265788 -154108 -141095 -139628 -83822 -109953 -196267 -233962
15498b33962J18347J50196j9236k1298Q43r7732l4801L0942R7942L7481l0175
$$ -233962 -115615 34581 15345 -5953 -5110 -102842 -137643 -106701 -8759 28722 -1453
15487a453j6636M661Q2277O523K7723M8226p5308P5215J24147L8066j31432n1934
$$ -1453 -18089 -13428 68849 75372 103095 151321 76013 151228 275375 313441 182009 130075
15475A30075o1266q4576m2993o9902M9738M9476l6090n7543L6868P0988o189o1930
$$ 130075 68809 -15767 -58760 -128662 -78924 -29448 -65538 -123081 -86213 -15225 -21414 -83344
15463h3344N3475j3571M4587P9960M5870j4228r4389l8374m0661J19057Q7866
$$ -83344 -29869 -43440 1147 81107 126977 112749 18360 -20014 -60675 58382 146248
15452A46248J7628j68122k02206o398R3966J82572P2404k1054K9569M3683j74680
$$ 146248 163876 -4246 -206452 -212850 -118884 63688 136092 115038 144607 188290 13610
15441A3610J3248N7223k6327k7541J570N9260r8567j30641M0209L2913k4458K0255
$$ 13610 26858 84081 57754 30213 31783 91043 -7524 -138165 -97956 -65043 -89501 -69246
15429f9246L6231N6272M0119k009L4741O8681p3650m3853j24560O9358L86O5286
$$ -69246 -33015 23257 63376 61367 96108 164789 91139 47286 -77274 -7916 -7530 57756
15417E7756k3134l5900p9897j199l657K4459j4778Q150p8670m1728Q4393O5818
$$ 57756 34622 -1278 -81175 -82374 -86031 -61572 -76350 -68200 -146870 -188598 -104205 -38387
15405c8387L1996J03819k5384j9040K8644J10537R428o1997j4116m9133o5590
$$ -38387 -6391 97428 72044 53004 81648 192185 201613 139616 125500 76367 10777
15394A0777q2381O0565K28400n7020j52180L7638L2697n3991K303m246j5242L0837
$$ 10777 -71604 -11039 217361 160341 8161 45799 78496 24505 26808 22562 7320 38157
15382C8157K6008m5741J4281N48K9804l9203j68926J4465M4837q3674J28389J87165
$$ 38157 64165 18424 32705 33253 63057 23854 -145072 -130607 -85770 -169444 -41055 146110
15370A46110L2300q1420j83685m0445m0647N749k4532P9965P2039r8283p872J23821
$$ 146110 178410 96990 -86695 -127140 -167787 -162038 -186570 -106605 -34566 -132849 -140721 -16900
15358a6900j8648J5451n5814m4427P1516J9054q398m6992p1429p4151n6725Q8801
$$ -16900 -35548 -20097 -75911 -120338 -48822 -29768 -38166 -85158 -156587 -230738 -287463 -198662
15346a98662L1177l937L6215K371K108L2405J5529k597j0096J4086m3675n8638
$$ -198662 -167485 -171422 -135207 -132836 -130728 -98323 -82794 -85391 -95487 -81401 -125076 -183714
15334a83714N0205J10253M6991k4260l9535k8027J5199J41970L6715n8427l2315
$$ -183714 -133509 -23256 23735 -525 -40060 -68087 -52888 89082 125797 67370 35055
15323C5055l1663P0675J27968o4478q1937K4398P1215K7416r4685M1441r855n7847
$$ 35055 3392 74067 202035 137557 55620 80018 151233 178649 83964 125405 115550 57703
15311E7703r9928k8966J9810K9163J2022n5135j143J10596J6858p5791P028J0581
$$ 57703 -42225 -71191 -51381 -22218 -10196 -65331 -66474 44122 60980 -14811 -7783 2798
15299B798K2064J46276o5562j01544n0670P9231j6314r249M2553q9891L8555N7529
$$ 2798 24862 171138 105576 4032 -46638 32593 16279 7030 49583 -40308 -1753 55776
15287E5776n9447L3899N584L3890K5739p5843o5615q9964J4555L3668J04048M0062
$$ 55776 -3671 30228 35812 69702 95441 19598 -46017 -135981 -121426 -87758 16290 56352
15275E6352N9909L8586o4690n0412N5808K4782J4189r7260J0447M5443K0386J8603
$$ 56352 116261 154847 90157 39745 95553 120335 134524 37264 47711 93154 113540 132143
15263A32143j33101j55062k721J05956J7309R1206R3750n7469K5221J5564l5424
$$ 132143 -958 -156020 -158741 -52785 -35476 55730 149480 92011 117232 132796 97372
15252I7372n6260l5498k6583J03002m0182N6109k6600p5926r2404M585M4510j1927
$$ 97372 41112 5614 -20969 82033 41851 97960 71360 -4566 -96970 -92385 -47875 -59802
15240e9802M7792Q6896k8857r570L9620J5239o8906p3976l8287j4283o1713j0290
$$ -59802 -12010 74886 46029 36459 76079 91318 22412 -51564 -89851 -104134 -165847 -176137
15228a76137K7836L2347N2334K2947m425R7992N2690j0634l2224o6493l0042L0225
$$ -176137 -148301 -115954 -63620 -40673 -45098 52894 105584 94950 62726 -3767 -33809 -3584
15216c584M7387p7022Q4877J8586J14641O4766j27709N2568P0697p1640q5065
$$ -3584 43803 -33219 51658 70244 184885 249651 121942 174510 245207 173567 88502
15205H8502o2708o4417P2805L3453j2882n8397J6179N6886n5662r02k9043P1762
$$ 88502 25794 -38623 34182 67635 54753 -3644 12535 69421 13759 12857 -16186 55576
15193E5576o0258p9648M2922K5387k0374j6511k9153P2257r2929R604J3694Q8460
$$ 55576 -4682 -84330 -41408 -16021 -36395 -52906 -82059 -9802 -102731 -93127 -79433 9027
15181I027o6472O504O8614q2852n4392j3048O0574K6566K1450j5465J0057J54125
$$ 9027 -57445 -50941 17673 -65179 -119571 -132619 -72045 -45479 -24029 -39494 -29437 124688
15169A24688K0859j41254o9467O1953Q5743m925o063m7271r0118L880J24269O9827
$$ 124688 145547 4293 -65174 -3221 82522 77597 71534 24263 -65855 -61975 62294 132121
15157A32121j3785j02404p2366q8737K7626M008K7765N1462J0388K7921R9489
$$ 132121 118336 15932 -56434 -145171 -117545 -113537 -85772 -34310 -23922 3999 103488
15146A03488j03194N4795o370J15693n1684o7982j9798K6094M1473m8714j8427
$$ 103488 294 55089 48719 164412 112728 44746 24948 51042 92515 43801 25374
15135B5374j6614M1487K9817m315j3267l6795m5817n5381J39336N95J05804K1214
$$ 25374 8760 50247 80064 75749 62482 25687 -20130 -75511 63825 64420 170224 191438
15123A91438j80247J5920m4214k4418L8055l7098N28R1475q9890J0704j9242O5726
$$ 191438 11191 27111 -17103 -41521 -3466 -40564 -40036 51439 -38451 -27747 -46989 18737
15111A8737N5281q7923l0562R9173J44870p4653j57627j8248j5536k4840o0687
$$ 18737 74018 -13905 -44467 54706 199576 124923 -32704 -50952 -66488 -91328 -152015
15100a52015m5527l5511J03139K027N6748Q6803k4745p3224p233N5215J15806
$$ -152015 -197542 -233053 -129914 -127887 -71139 15664 -9081 -82305 -89538 -34323 81483
15089H1483P7900l0671q2437J8697j06030r3597J287R6006N7229P936m0244p2780
$$ 81483 159383 128712 46275 64972 -41058 -134655 -133368 -37362 19867 27803 -12441 -85221
15077h5221J6049R9257L972J7380J7151m5615M2263R8911l4060n1970j83275q81
$$ -85221 -69172 30085 34057 51437 68588 22973 65236 164147 130087 78117 -105158 -106039
15065a06039J57123J96863l3269j01417n0280M253J40245r8079j20761n241O1603
$$ -106039 51084 247947 214678 113261 62981 67234 207479 109400 -11361 -16602 45001
15054D5001L6311l2722N631n5910p1369R2150R6267n6034j12358M2565L207j8289
$$ 45001 81312 48590 54221 -1689 -73058 19092 115359 59325 -53033 -10468 -7261 -25550
15042b5550O0703K8266l8089O4852p1699r3782K9800L6325j0044l5312M7395j1888
$$ -25550 35153 63419 25330 90182 18483 -75299 -45499 -9174 -19218 -54530 -7135 -19023
15030a9023J7852l7994P8467j3182j5290k4848R985n2393l9295K8879m2539J78627
$$ -19023 -1171 -39165 39302 26120 10830 -14018 -4033 -56426 -95721 -66842 -109381 69246
15018F9246n2800j14225L4643J69945P386Q9063K7490j44829p9028q6172J6500
$$ 69246 16446 -97779 -63136 106809 114195 203258 230748 85919 6891 -79281 -62781
15007f2781l0465K316R1089J09090N909J817M1225J8540q1354j6306n4928O4471
$$ -62781 -93246 -90930 159 109249 115158 116975 158200 176740 95386 79080 24152 88623
14995H8623m4034q0672J1306K9104j597l2164o1601L2464n3272J3911M0342k1899
$$ 88623 44589 -36083 -24777 4327 2730 -29434 -91035 -58571 -111843 -97932 -57590 -79489
14983g9489M7106R3200J6120j12078n06J7057K5763o8225j02631l1286K15475
$$ -79489 -32383 60817 76937 -35141 -35647 -18590 7173 -61052 -163683 -194969 20506
14972B0506J06926l7707K1784J4678o8646j0268l9751j6942l2135n055n0570k535
$$ 20506 127432 89725 111509 126187 57541 47273 7522 -9420 -41555 -46610 -97180 -99715
14960i9715o8787M9577J32604L4522n6121r8815j7286N7555R2535K9258j19144
$$ -99715 -168502 -118925 13679 48201 -7920 -106735 -124021 -66466 26069 55327 -63817
14949f3817m1431K0325K7179o085K4934K7721j15752n2278P8500J74396K6884
$$ -63817 -105248 -84923 -57744 -63829 -38895 -11174 -126926 -179204 -100704 73692 100576
14938A00576j1249q6615l0429N1521r091M3459L7579k3269Q6109J7480l4019O8886
$$ 100576 89327 2712 -27717 23804 14713 58172 95751 72482 158591 176071 142052 210938
14926B10938p1284j36377q5624k1114L8406N2286O1500K8357Q7118m7268j38264
$$ 210938 139654 3277 -82347 -103461 -65055 -12769 48731 77088 164206 116938 -21326
14915b1326q4703N8420K6445O3204j1883j34359M8603J42342N3403n2589N410
$$ -21326 -106029 -47609 -21164 42040 30157 -104202 -55599 86743 140146 87557 92967
14904I2967p155j01962K5175L6475j9804M4350n6162j48529j41808K1706M5270
$$ 92967 85812 -16150 9025 45500 25696 70046 13884 -134645 -276453 -254747 -209477
14893b09477j739l1694J266K42677J22543l8398l1178o6251L3607j24520n3278
$$ -209477 -211216 -242910 -241644 1033 123576 85178 54000 -12251 21356 -103164 -156442
14882a56442L6481l9563R57m8901m5101M4018J53924R0311O1492j516K6313l8925
$$ -156442 -119961 -159524 -158567 -207468 -252569 -208551 -54627 35684 97176 95660 121973 83048
14870H3048r5315j02192K8708J0843n5468K1742P2467K1659J09796J18157N7444
$$ 83048 -12267 -114459 -85751 -74908 -130376 -108634 -36167 -14508 95288 213445 270889
14859B70889n0620k2444J10358K4537K1815J14060J75567J82471J86405J57717
$$ 270889 220269 197825 308183 332720 354535 468595 644162 826633 1013038 1170755
14849A170755J89893K02458K22918L715m4884j86123l39745k69892k57992j45265
$$ 1170755 1360648 1563106 1786024 1789739 1744855 1558732 1218987 949095 691103 545838
14839E45838o3767q1055r3679M1453P2160j39185r7180J5523j064J8774j8271
$$ 545838 482071 401016 307337 348790 420950 281765 184585 200108 199044 217818 199547
14828A99547n7444l4789j5316K9020R4063O9229m2040L2524P9167R71n9805J01591
$$ 199547 142103 107314 91998 121018 215081 284310 242270 274794 353961 354932 295127 396718
14816C96718N8849L1906k467m4607L2037P2401J60941J70907K3834J07475J75822
$$ 396718 455567 487473 485006 440399 472436 544837 705778 876685 900519 1007994 1183816
14805A183816J95447J43742J28248R7491q889j90494k28794k63902k06361k39307
$$ 1183816 1379263 1523005 1651253 1748744 1739855 1549361 1320567 1056665 850304 610997
14795F10997j10316r1233J8829K1432J9572l8483k9298q3094j13446q0307m6020
$$ 610997 500681 409448 428277 449709 469281 430798 401500 318406 204960 124653 78633
14784G8633K4669Q028L5114q8833J889J38405l4355K5884Q9002k8593l4097n2032
$$ 78633 103302 111330 146444 57611 59500 197905 163550 189434 278436 249843 215746 163714
14772A63714j911j25565r6943J9345N3443P5445k2383n0546P6165m4953r5583
$$ 163714 161803 36238 -60705 -41360 12083 87528 65145 14599 90764 45811 -49772
14761d9772P7682J090k4613N3127Q801l2296J4480M5857L4379M1102j6868l1678
$$ -49772 27910 29000 4387 57514 66315 34019 48499 94356 128735 169837 152969 121291
14749A21291L9280J0210p1615j7908m693K7618j3098M1217o3912M7945j8009l6523
$$ 121291 160571 170781 99166 81258 76565 104183 91085 132302 68390 116335 98326 61803
14737F1803n2946K7606L9402Q2040m2866r1414p2674N8051J08562n3282p0606
$$ 61803 8857 36463 75865 157905 115039 23625 -49049 9002 117564 64282 -6324
14726f324k8243M0368L5226O6039L5635K4665m1249m157r0466k1136Q8470J22239
$$ -6324 -34567 5801 41027 107066 142701 167366 126117 121960 31494 10358 98828 221067
14714B21067P373q6706j40014m1960q8865m9867k1850J29058R3352Q2077P7434
$$ 221067 228440 141734 1720 -40240 -129105 -178972 -200822 -71764 21588 103665 181099
14703A81099L9778n5086p3890q6098n9198N4946L0371k1611L9764J2872M0317
$$ 181099 220877 165791 91901 5803 -53395 1551 31922 10311 50075 62947 103264
14692A03264O869K9841r8483j34658K16152N6493l0379l4614j00162m0832j15742
$$ 103264 110133 139974 41491 -93167 122985 179478 149099 114485 14323 -26509 -142251
14681a42251O2538P9132J11809L6228j0139k6745o4591M0866N6917J6856K9747
$$ -142251 -79713 -581 111228 147456 137317 110572 45981 86847 143764 160620 190367
14670A90367j05307N396Q540m883N8061J87786N0102M0172j62525m5950L9846
$$ 190367 85060 90456 98996 94113 152174 339960 390062 430234 267709 221759 261605
14659B61605p0756l9037l1808n7251M4022K6398O080j6509J07848J24960K8934
$$ 261605 190849 151812 120004 62753 106775 133173 139253 122744 230592 355552 384486
14648C84486L9457k5684r3806O3009J05783N4323P1981p7291k23659j01825M1120
$$ 384486 423943 398259 304453 367462 473245 527568 599549 522258 298599 196774 237894
14637B37894K4311R600K4825l0182j17144j23692P4341K359K7588Q7673K0208
$$ 237894 262205 271805 296630 266448 149304 25612 99953 102312 129900 217573 237781
14626B37781l6907O495M1092j7931m8929l429M9162Q153N3564L084n4585n6293
$$ 237781 200874 207369 248461 230530 181601 178172 227334 235487 289051 292135 237550 181257
14614A81257l2882m0875K6876J5972P0287M7256L8688J20227l7428P674P4150
$$ 181257 148375 107500 134376 150348 220635 267891 306579 426806 389378 397052 471202
14603D71202p6055n4796R184Q380p417N243L3619k4572j26760m6457J5779l3683
$$ 471202 395147 340351 349535 357915 350498 355741 389360 364788 238028 191571 207350 173667
14591A73667R0215N7749k685k0365p0499j8648p5616p0373M2316O6589L7368p976
$$ 173667 263882 321631 318946 298581 228082 209434 133818 63445 105761 172350 209718 201742
14579B01742j747m1366j4101J3143n8233j09490m1624R429J01726J21810j741
$$ 201742 199995 158629 144528 157671 99438 -10052 -51676 -42247 59479 181289 179548
14568A79548J20P522O9472L0739o542j641q7083O8474l3709j39969N1602J38764
$$ 179548 179668 187190 256662 287401 280859 279218 192135 260609 226900 86931 138533 277297
14556B77297O3931k4743q5561j7978N8015k9234m592k1632k9544q16l4731R2715
$$ 277297 341228 316485 230924 212946 270961 241727 237135 215503 185959 185143 150412 243127
14544B43127J10218m4896l5578K1340L1825k5159K4723Q291p6263m2337j00787
$$ 243127 353345 308449 272871 294211 326036 300877 325600 333891 257628 215291 114504
14533A14504J7323M4646j0520M8493J23576N0737J2199K2287Q8459M6387l7179
$$ 114504 131827 176473 165953 214446 338022 388759 400958 423245 511704 558091 520912
14522E20912M9836J12307M0039o611P042n5948l1524k9418m9262k5760O090K0892
$$ 520912 570748 683055 723094 716483 723525 667577 636053 606635 557373 531613 537703 558595
14510E58595j48364j31592j7759j5194m6975l1712J29753O28K6169M8710M6922
$$ 558595 410231 278639 260880 245686 198711 166999 296752 297380 323549 372259 419181
14499D19181O5650P9306J5223j00663o1869l7802M8565Q0655M6456Q9667P3791
$$ 419181 484831 564137 579360 478697 416828 379026 427591 508246 554702 644369 718160
14488G18160j09573n0241P6889q0363k0789Q0841J32237n1840M3946L3184R248
$$ 718160 608587 558346 635235 554872 534083 614924 747161 695321 739267 772451 781699
14477G81699O1084P1428k2714n3305m6946K2883K7648j13552p9361j04430L4409
$$ 781699 842783 914211 891497 838192 791246 814129 841777 728225 648864 544434 578843
14466E78843J22247J26546K575j7952K2308R4757P810r0373J33200J64218Q0776
$$ 578843 701090 827636 830211 812259 834567 929324 937134 846761 979961 1144179 1224955
14455A224955J31954K4055j41937Q378J67923R9296j3943j25474n5849J83365
$$ 1224955 1356909 1380964 1239027 1247405 1415328 1514624 1500681 1375207 1319358 1502723
14445A502723J29181K0678j5790J25840M8716p9735J52183J24899K9224N8297
$$ 1502723 1631904 1652582 1636792 1762632 1811348 1731613 1883796 2008695 2037919 2096216
14435B096216Q4680L1107K4170k3216R5050Q9741J52094J35874J82445K04846
$$ 2096216 2180896 2212003 2236173 2212957 2308007 2397748 2549842 2685716 2868161 3073007
14425C073007K52377L95885K54648K88443M37371M15893L86127M77317N01576
$$ 3073007 3325384 3721269 3975917 4264360 4701731 5117624 5503751 5981068 6482644
14416F482644N45869O91296R01597J082914J185810J303496J544001J805677K154462
$$ 6482644 7028513 7719809 8621406 9704320 10890130 12193626 13737627 15543304 17697766
14407A7697766K411830K844203L547752M339514N364196O934130R136952J2401107
$$ 17697766 20109596 22953799 26501551 30841065 36205261 43139391 52276343 64677450
14399F4677450J7216428K3860967L1915977L9831219M5332327M5977231L9293494
$$ 64677450 81893878 105754845 137670822 177502041 222834368 268811599 308105093
14392C08105093K3099648r95691k5554616m2091492m6796289m2186992l3572906
$$ 308105093 331204741 330209050 304654434 262562942 215766653 173579661 140006755
14385A40006755k5416660j8977756j4024002j0623592q264194o423013n259322
$$ 140006755 114590095 95612339 81588337 70964745 62700551 56277538 51018216
14378E1018216m399815l597262l053278k399320j937972j589340j235589q52264
$$ 51018216 46618401 43021139 39967861 37568541 35630569 34041229 32805640 31953376
14370C1953376m31549m5033J41888O21543J171584J485560J719234K186743K777364
$$ 31953376 31521827 31476794 31618682 32240225 33411809 34897369 36616603 38803346 41580710
14361D1580710L320765M062301N055343O400927Q346053J0908113J4586558K0071611
$$ 41580710 44901475 48963776 54019119 60420046 68766099 79674212 94260770 114332381
14353A14332381K6864267L4494723M1149967M4315418M1389184L0607123J0604061
$$ 114332381 141196648 175691371 216841338 261156756 302545940 333153063 343757124
14346C43757124j5311460l8283898n0742879n0952463m2997761l2843805k3995118
$$ 343757124 328445664 290161766 239418887 188466424 145468663 112624858 88629740
14339H8629740j7229807j2650166r577837p430723n855122m966382m051010l492208
$$ 88629740 71399933 58749767 49171930 41741207 35886085 30919703 26868693 23376485
14331B3376485k989657k505966k080345j830203j814969j424114j088484j020491
$$ 23376485 20386828 17880862 15800517 13970314 12155345 10731231 9642747 8622256
14323H622256p37797o70145n87281n07202m34400l47788l32402k55732k95416
$$ 8622256 7884459 7214314 6627033 6119831 5685431 5337643 5005241 4749509 4454093
14314D454093k57150k46435j79762j77171k46316l33184k00763m7783j27259k17863
$$ 4454093 4196943 3950508 3770746 3593575 3347259 3014075 2813312 2765529 2638270 2420407
14304B420407j57207j29592j38301j12288n0533j1043o7909p8537j23775J4752
$$ 2420407 2263200 2133608 1995307 1883019 1832486 1821443 1753534 1674997 1551222 1565974
14294A565974k331j16143j14419j07366q6243o6440L9104L2181J3115j37414j75688
$$ 1565974 1563643 1447500 1333081 1225715 1139472 1073032 1112136 1144317 1157432 1020018 844330
14283H44330j01658L1817O2597O0708p405p7319m4137K0835m0972o7618N8831
$$ 844330 742672 774489 837086 897794 890389 813070 768933 789768 748796 681178 740009
14272G40009J45222L2461o3332O453m9094p310K102L8828m3517j09742o6736j2467
$$ 740009 885231 917692 854360 860813 811719 804409 806511 845339 801822 692080 625344 612877
14260F12877K0164L2688N7410m2308m0160j2149Q159o5659l0248K5029o3050p4266
$$ 612877 633041 665729 723139 680831 640671 628522 636681 571022 540774 565803 502753 428487
14248D28487j08168l2697P5235Q923j9200J8833n4590J4421j00522J07498J16014
$$ 428487 320319 287622 362857 371780 352580 371413 316823 331244 230722 338220 454234
14237D54234O8669j9490L932j556k7167j8011M4155l1973j5841N3859O1071M4730
$$ 454234 522903 503413 507345 505789 478622 460611 504766 472793 456952 510811 571882 616612
14225F16612r9210j3349R5095M5514j48862p633N2811j019l7230q8848N802l1643
$$ 616612 517402 504053 599148 644662 495800 488167 540978 539959 502729 413881 419683 388040
14213C88040k1161K549L1619J1499k3515p4401p2842K2100L2429q5721P188P237
$$ 388040 366879 369428 401047 412546 389031 314630 241788 263888 296317 210596 217784 225021
14201B25021k2754k7562l7802N5172j11374L5989J36167l3367l8436M3020Q5527
$$ 225021 202267 174705 136903 192075 80701 116690 252857 219490 181054 224074 309601
14190C09601p9693r7292K1694N7356k6825l1320j353J48838M6459p9422l71r5259
$$ 309601 229908 132616 154310 211666 184841 153521 152168 301006 347465 268043 267672 172413
14178A72413j6776j06014j6652Q6653o7873k8260J38800m895j53142J06875J43638
$$ 172413 155637 49623 32971 119624 51751 23491 162291 157396 4254 111129 254767
14167B54767l5593j259J08889L6287n7093j91391j00863P5262J9407l1450M2438
$$ 254767 219174 217915 326804 363091 305998 114607 13744 89006 108413 76963 119401
14156A19401L5129J4749K9786L6516K3217p0800n2566O0300K1254R4221J7943
$$ 119401 154530 169279 199065 235581 258798 187998 135432 195732 216986 311207 329150
14145C29150j2916J5673p7593o2345P1036j00850l6134K7558j66635j18940n9605
$$ 329150 316234 331907 254314 191969 263005 162155 126021 153579 -13056 -131996 -191601
14134a91601L1732N2801M0487R9231J1669n6928L7160Q9495l1412o5583L7192
$$ -191601 -159869 -107068 -66581 32650 44319 -12609 24551 114046 82634 17051 54243
14123E4243p4932j03361K3137O0294J15273R9540j02894r6911O9874m3539m1884
$$ 54243 -20689 -124050 -100913 -40619 74654 174194 71300 -25611 44263 724 -41160
14112d1160M4736L3985R8069O9691L9785M7841m922r4798p1638r6270q8361J00744
$$ -41160 3576 37561 135630 205321 245106 292947 288025 193227 121589 25319 -63042 37702
14100C7702K6362Q732O2849P7634K4463p7496Q0969P9503j2223n1965n8410K0370
$$ 37702 64064 72796 135645 213279 237742 160246 241215 320718 308495 256530 198120 218490
14088B18490j9211j4627j595o06j6960j32506p3053r027o6992L1419M2175J66731
$$ 218490 199279 184652 183057 182451 165491 32985 -40068 -49095 -116087 -84668 -42493 124238
14076A24238J16166j02669j03593J8110P3788R463r8113K212R3622M8586k7135
$$ 124238 240404 137735 34142 52252 126040 135503 37390 39602 133224 181810 154675
14065A54675k364J1792r7950K409p642n4382o531L4061O830j45051N6344J28872
$$ 154675 152311 164103 66153 68562 60920 6538 7 34068 40898 -104153 -47809 81063
14053H1063Q7876j49024n7743J58007M4830q8315o9386j6433O7401M3183o4383
$$ 81063 168939 19915 -37828 120179 165009 76694 7308 -9125 58276 101459 37076
14042C7076o7728J1967M2703p7640m0809P4100O2332K5923N0987l013J35835o7073
$$ 37076 -30652 -18685 24018 -53622 -94431 -20331 42001 67924 118911 115898 251733 184660
14030A84660j80632j44283q6084P4083J43273J8775N9380O6136p6876n6146o117
$$ 184660 4028 -140255 -226339 -152256 -8983 9792 69172 135308 58432 2286 -3831
14019c831n6322o4767J4077N3648J11039K2387J02305o6495j41845l3982O6866
$$ -3831 -60153 -124920 -110843 -57195 53844 76231 178536 112041 -29804 -63786 3080
14008C080j4551n2202K4804P4196J12676q707n6901N071J7256l417n2833L7947
$$ 3080 -11471 -63673 -38869 35327 148003 139296 82395 87466 104722 101305 48472 86419
13996H6419n639K7039L8780k5290N64l1855r2952j16436Qk724l2350L6057J69492
$$ 86419 80780 107819 146599 121309 121873 90018 -2934 -119370 -119362 -122086 -154436 -118379 51113
13983E1113J02917j467q9906n8653N8003M2328o7143l7622J42061J13030j52112
$$ 51113 154030 152563 62657 4004 62007 104335 37192 -430 141631 254661 102549
13972A02549l6567N4350J2360j10830l9029N8240K2458L2902j65534L5525J07154
$$ 102549 65982 120332 132692 21862 -17167 41073 63531 96433 -69101 -33576 73578
13961G3578p1746q210O3980j0320J6645J07046L019r8159j18358L3533P6410m1800
$$ 73578 1832 -6378 57602 47282 63927 170973 173992 75833 -42525 -8992 67418 25618
13949B5618L0633R803j8439n0394N5265j8378L6135R3282Q2681J25K9309J56765
$$ 25618 56251 66054 47615 -2779 52486 34108 70243 163525 246206 246331 275640 432405
13937D32405P2885M5128J1513K62205K23803K80032K34368J34473M4300j10122
$$ 432405 505290 550418 561931 824136 1047939 1327971 1562339 1696812 1741112 1630990
13927A630990q2914j28531j99112k70585j28194j39091j23819q6291j6345j23541
$$ 1630990 1548076 1419545 1220433 949848 821654 682563 558744 472453 456108 332567
13917C32567r2559m5147M5250m9355q9435j01250M3962N2906j2107j4232K7492
$$ 332567 240008 194861 240111 190756 101321 71 44033 96939 84832 70600 98092
13906I8092K8867k088q3196L3034o91k690Q4748L7733q8461j6792J01235J54943
$$ 98092 126959 124871 41675 74709 74018 71328 156076 193809 105348 88556 189791 344734
13894C44734M1464P2667J65907J23611J54992K18145K23998K39049K14791J31764
$$ 344734 386198 458865 624772 748383 903375 1121520 1345518 1584567 1799358 1931122
13884A931122p7197j29788k46143k72897l67200j74165l1840j28721r1124l6364
$$ 1931122 1853925 1724137 1477994 1205097 837897 663732 631892 503171 412047 375683
13874C75683m7423n2679k9334o5154p1871q3292J37417L3725o9350m3687r2030
$$ 375683 328260 275581 246247 181093 109222 25930 163347 197072 127722 84035 -7995
13863g995J8769l0419p0123J50987Q615n757j02686j01362O0761L6365M334J5699
$$ -7995 10774 -19645 -89768 61219 69834 64077 -38609 -139971 -79210 -42845 -38511 -22812
13851b2812r801P5364O1285L3232p1705p0137n954Q509K6965l8245m2940Q692
$$ -22812 -32613 42751 104036 137268 65563 -4574 -10528 -2019 24946 -13299 -56239 -47547
13839d7547L0914r142l0497j9299P9249J7781N6028N9021K22891l6903j75209
$$ -47547 -16633 -25775 -56272 -75571 3678 21459 77487 136508 359399 322496 147287
13828A47287j56415j0036m632j7630k6233m6420Q1964P1739j6360r9933n3322
$$ 147287 -9128 -19164 -23796 -41426 -67659 -114079 -32115 39624 23264 -76669 -129991
13817a29991M6592Q826L9713j40045q3818l1510J6917P5503p935J04917O8297
$$ -129991 -83399 -74573 -34860 -174905 -258723 -290233 -273316 -197813 -205748 -100831 -32534
13806c2534p2674P0517N3181q3874O7696L1179O4271L0771J4888k8316J13656
$$ -32534 -105208 -34691 18490 -65384 2312 33491 97762 128533 143421 115105 228761
13795B28761P396o0895q8396j81365j47700M8118J17399J37649l0746j58113P8767
$$ 228761 236157 175262 86866 -94499 -242199 -194081 -76682 60967 30221 -127892 -49125
13784d9125R8597M2569o2096k370J6020q8505j60202M67Q5524M1212j660O905
$$ -49125 49472 92041 29945 27575 43595 -44910 -205112 -204645 -119121 -77909 -79569 -72664
13772g2664L4964o700M1031n4156o8752J4405J19454l2121k8899j4251J574K6425
$$ -72664 -37700 -44400 -3369 -57525 -126277 -111872 7582 -24539 -53438 -67689 -66115 -39690
13760c9690J00257J634P9354P6716m0390m1210k7487m6661j16584j4050j5408
$$ -39690 60567 62201 141555 218271 177881 136671 109184 62523 -54061 -68111 -83519
13749h3519N1814n0401O5383K2423j2223N1599n8963j13133O358k4429J32728
$$ -83519 -31705 -82106 -16723 5700 -6523 45076 -13887 -127020 -120662 -145091 -12363
13738a2363J21758l6492r974k2431n6510q517K2484J04950m57r7044R998K6979
$$ -12363 109395 72903 62929 40498 -16012 -24529 -2045 102905 102448 5404 15402 42381
13726D2381K9327o4253J825m5632K6668O0096n7960J3682K3533Q3025R4374N5465
$$ 42381 71708 7455 9280 -36352 -9684 50412 -7548 6134 29667 112692 207066 262531
13714B62531L7436j00690K6256q0785j09491M839r6045m2361J46469J10172j06418
$$ 262531 299967 199277 225533 144748 35257 40096 -55949 -98310 48159 158331 51913
13703E1913M5746O1439N9295L0449j30137j33456Q743j6176n7860L5849j3373
$$ 51913 97659 159098 218393 248842 118705 -14751 -6008 -22184 -80044 -44195 -57568
13692e7568J03652l2789n7962L3730M9365K4231J4327j01090o8799k5252L0234
$$ -57568 46084 13295 -44667 -10937 38428 62659 76986 -24104 -92903 -118155 -87921
13681h7921J3164M7231r2988p4389R7410k4165j30668P4216J00681O7684q219
$$ -87921 -74757 -27526 -120514 -194903 -97493 -121658 -252326 -178110 -77429 -9745 -17964
13670a7964m3761K1157k667L1650L4778o4567m4176K0484K9143n7617n3324r063
$$ -17964 -61725 -40568 -43235 -11585 23193 -41374 -85550 -65066 -35923 -93540 -146864 -155927
13658a55927J65618k7409O875l2055p7930M7944Q9925N9060j9732q7543M4936
$$ -155927 9691 -17718 -10843 -42898 -120828 -72884 17041 76101 56369 -31174 13762
13647A3762J06123R173j7714p5122j6644M5082l4039j11968M4580Q7675M1857
$$ 13762 119885 129058 111344 36222 19578 64660 30621 -81347 -36767 50908 92765
13636I2765l7721M709P2241n0169k2710r3878j23917K2391J46180Q9335j7725
$$ 92765 55044 59753 131994 81825 59115 -34763 -158680 -136289 9891 99226 81501
13625H1501q0489o5197o0017L1189n0822J3953k6588L4896l515O6124P5157m2571
$$ 81501 1012 -64185 -124202 -93013 -143835 -129882 -156470 -121574 -125089 -58965 16192 -26379
13613b6379L5997n647P6138J16084n2020k3186k8392n9994R346P4526Q6260j3159
$$ -26379 9618 3971 80109 196193 144173 120987 92595 32601 41947 116473 202733 189574
13601A89574p935n6639l5806j9504n3741M6327R5632m4269o0065o3218m7868O7474
$$ 189574 181639 125000 89194 69690 15949 62276 157908 113639 53574 -9644 -57512 9962
13589I962Q5923o1011r7030K302M849N2138q4209O7341O1912n4214N4613J80957
$$ 9962 95885 34874 -62156 -59854 -55005 -2867 -87076 -19735 42177 -12037 42576 223533
13577B23533J07575P26k19540j77819P849K4316J0970k141m6554j8230M2115n8634
$$ 223533 331108 331834 112294 -65525 -57676 -33360 -22390 -24531 -71085 -89315 -47200 -105834
13565a05834P4485J14367J30176l1973o0448l7798k1829M1410Q7468j06196q3129
$$ -105834 -31349 83018 213194 181221 120773 82975 61146 102556 190024 83828 699
13554F99J43017J4090j25442j03748l6745L4689j9343J7066k3101J20867J34173
$$ 699 143716 157806 32364 -71384 -108129 -73440 -92783 -75717 -98818 22049 156222
13543A56222N0424K708m4066l5670M9900j16290k23647r4118N8858J51535J516
$$ 156222 206646 209354 165288 129618 179518 63228 -160419 -254537 -195679 -44144 -42628
13532d2628K7630r0571Q17l3758j1383K3321M7666m5149m4652m1837L0697J14823
$$ -42628 -14998 -105569 -104752 -138510 -149893 -126572 -78906 -124055 -168707 -210544 -179847 -65024
13520f5024K7939k2085q6229n897O455J65478o763q6064Q1784O1756j9067m2991
$$ -65024 -37085 -59170 -145399 -151296 -144841 20637 13874 -72190 9594 71350 52283 9292
13508I292L033J5353O3837M7359o0351j3086j26M9969O4653m2828L3778m5166
$$ 9292 12325 27678 91515 138874 78523 65437 65311 115280 179933 137105 170883 125717
13496A25717k2635O0259m4648P849m4516K0687j02238j02717Q7067J16102L318
$$ 125717 103082 163341 118693 126542 82026 102713 475 -102242 -15175 100927 104245
13485A04245P1638n8154N19J4296N5333J05379j0468o5523j34270j19038l7300
$$ 104245 175883 117729 118248 132544 187877 293256 282788 217265 82995 -36043 -73343
13474g3343K2693L1390K6425J12280k3806j1401r804J1766p92l1705O1416k8311
$$ -73343 -50650 -19260 7165 119445 95639 84238 74434 86200 85408 53703 115119 86808
13462H6808l5225p3301N4598Q4315m8898j00570K162O93j2011K6583R9212n915
$$ 86808 51583 -21718 32880 117195 68297 -32273 -30111 -29418 -41429 -14846 84366 78451
13450G8451L9183N7441n6595r1056j2730m7018M3526R2078m774p702o4348l5633
$$ 78451 117634 175075 118480 27424 14694 -32324 11202 103280 98506 90804 26456 -9177
13438i177L3950k4548n594l919j2831M6004r320p745M916k9086K9440J0637K4188
$$ -9177 24773 225 -5369 -9288 -22119 23885 14565 6820 11736 -17350 12090 22727 46915
13425D6915J24895j596k9684M5162K0776L4037k2485m2205l3292k5894q3788J4310
$$ 46915 171810 170214 140530 185692 206468 240505 218020 175815 142523 116629 32841 47151
13413D7151l1093n4379j8130m219j11043N3003J6592N4072J1796k297M057o5470
$$ 47151 16058 -38321 -56451 -60670 -171713 -118710 -102118 -48046 -36250 -38547 -34490 -99960
13401i9960N8759L7612O419M4629J7881K064j15646p5660L9000J1907K1543J00780
$$ -99960 -41201 -3589 2830 47459 65340 67404 -48242 -123902 -84902 -72995 -51452 49328
13389D9328J1407n8275j6243K721J61056J0082m8110J2492K465L8324N7644P612
$$ 49328 60735 2460 -13783 -11062 149994 160076 111966 124458 126923 165247 222891 230503
13377B30503j15492r1643K3579Q2384J9169j16867j7018M4158q1199n7543L0915
$$ 230503 115011 23368 46947 129331 148500 31633 14615 58773 -22426 -79969 -49054
13366d9054L1192l760n2960J42475O6908M282k14737L699L9780Q7783M0731J9210
$$ -49054 -17862 -21622 -74582 67893 134801 139083 -75654 -71955 -32175 55608 96339 115549
13354A15549j49312j30345Q9643K4011p581n2355j22085j3528J37357J87085K4611
$$ 115549 -33763 -164108 -74465 -50454 -58035 -110390 -232475 -246003 -108646 78439 103050
13343A03050K5047J12943O4575p1518j86843q3164n9828q0909r8133P7428J082
$$ 103050 128097 241040 305615 234097 47254 -35910 -95738 -176647 -274780 -197352 -196270
13332a96270J48033L6331N1306j8157O5306j07009r3692M9754M5400K3710Q472
$$ -196270 -48237 -11906 39400 21243 86549 -20460 -114152 -64398 -18998 4712 13184
13321A3184K43j2093O040N2405l4012N3289p2776K2314M8442K0759l4546M558
$$ 13184 13427 1334 7374 59779 25767 79056 6280 28594 77036 97795 63249 67807
13309F7807n7272j6422R5993L727j8753p143m167l8313m5818n9675L3243P704
$$ 67807 10535 -5887 90106 93833 75080 67937 63770 25457 -20361 -80036 -46793 -39089
13297c9089Q0230n026K6277M7120O3646N4676m7400o7831R8893o6340o1663j7462
$$ -39089 41141 36115 62392 109512 173158 227834 180434 112603 211496 145156 83493 66031
13285F6031o2027K9588L3386n0699o3189N1352K6227L3164o9157k33J28160m699
$$ 66031 4004 33592 66978 16279 -46910 4442 30669 63833 -5324 -5557 122603 117904
13273A17904n419m6121l2971K8683l6818J9122Q0895j6383j5974p4766o5911N5981
$$ 117904 112485 66364 33393 62076 25258 44380 125275 108892 92918 18152 -47759 8222
13261H222J32216N7392l6650m0980k6871J01494j04588n1231Q6094p3383q1618
$$ 8222 140438 197830 161180 120200 93329 194823 90235 39004 125098 51715 -29903
13250b9903l5771O1767O8440L213k9461j11496o7877N4578P0582K4419O1471P5702
$$ -29903 -65674 -3907 64533 67746 38285 -73211 -141088 -86510 -15928 8491 69962 145664
13238A45664L1691o4642l2920j04312J9591K4606P9872L1788l1040n1593p2420
$$ 145664 177355 112713 79793 -24519 -4928 19678 99550 131338 100298 48705 -23715
13227b3715r8695m975J40104k1716r1240L9886R8661k909O3003N3108Q2048k4292
$$ -23715 -122410 -127385 12719 -8997 -100237 -60351 38310 35401 98404 151512 233560 209268
13215B09268j82156k3067J10552p8586K0099J17137M6730r6178j33184m7186O8117
$$ 209268 27112 4045 114597 36011 56110 173247 219977 123799 -9385 -56571 11546
13204A1546J14890J04284O1012o8007j27042n6503P6503L5551P2332J78727J0748
$$ 11546 126436 230720 291732 223725 96683 40180 116683 152234 224566 403293 414041
13193D14041J00828m2181q9080p5563q3878j25076m404M5439k0754J3364k8786
$$ 414041 514869 472688 383608 308045 224167 99091 94687 140126 119372 132736 103950
13182A03950j6034O9476m3705l3771j17843j2513J29139J48875J28147N7538p4171
$$ 103950 87916 157392 113687 79916 -37927 -50440 78699 227574 355721 413259 339088
13171C39088j03842p5029j8385M056J4091J19841P9915P0665o10J1978k1936K0042
$$ 339088 235246 160217 141832 145888 159979 279820 359735 430400 429790 441768 419832 439874
13159D39874K6310l5224M3165j9006O965J11581O5543Q1688J95772M41827L33258
$$ 439874 466184 430960 474125 455119 462084 573665 639208 720896 916668 1358495 1691753
13148A691753J52697j51620m62968l26673k93321k02317j36406j3702J41888O9790
$$ 1691753 1844450 1692830 1229862 903189 609868 407551 271145 257443 399331 469121
13138D69121o8667l134P8519O6171p8890j16529q4485L9241J51325J12644J4597
$$ 469121 400454 397320 475839 542010 463120 346591 262106 301347 452672 565316 579913
13127E79913N4136J5588r3765j19187O2297p859j05024p4883J7687L7239N6771
$$ 579913 634049 649637 555872 436685 498982 491123 386099 311216 328903 366142 422913
13116D22913J0586R0070q454j60191n1974P9294Q143k9057k4J16732K80342M54195
$$ 422913 433499 523569 515115 354924 302950 382244 390387 361330 361306 478038 758380 1212575
13104A212575M28773J78145q1920n07961m89415k02273j57317j08219j70733r6965
$$ 1212575 1641348 1819493 1737573 1229612 740197 537924 380607 272388 101655 4690
13094D690j3139K3653K6673Q9936N7941K3950L4276m5966m9496j00109K3597J49452
$$ 4690 -8449 15204 41877 131813 189754 213704 247980 202014 152518 52409 76006 225458
13082B25458P7481r6425l0788K6630j56048J7918M843L1748Q1490O8073p0599
$$ 225458 302939 206514 175726 202356 46308 64226 69069 100817 182307 250380 179781
13071A79781k1530m8614K7725j4891N6313k485R3298p4469l7856J04744K11485
$$ 179781 158251 109637 137362 122471 178784 176299 269597 195128 157272 262016 473501
13060D73501J36120J13880M6785l0019k08937j82405M3009m7838j01505O6934
$$ 473501 609621 723501 770286 740267 531330 348925 391934 344096 242591 309525
13050C09525K9114o2260J4263j25681l9035N693Q3459j6651q7528p2969j9451
$$ 309525 338639 276379 290642 164961 125926 131619 215078 198427 110899 37930 18479
13039A8479K8845J09242K761K6103m3993j7537j16864m0006N9491R2319O8712
$$ 18479 47324 156566 159327 185430 141437 123900 7036 -32970 26521 118840 187552
13028A87552K6967j13835j11082p637Q4823J15701J10518N774J3027L4135R6351
$$ 187552 214519 100684 -10398 -18035 66788 182489 293007 298781 311808 345943 442294
13017D42294P7410K28721M10076L01966L59317L98270K20635j09839l34108l62406
$$ 442294 519704 748425 1158501 1460467 1819784 2218054 2438689 2328850 1994742 1632336
13007A632336k80738j36413j69254j66679j39664j6658n0452k9510N6235j9554
$$ 1632336 1351598 1215185 1045931 879252 739588 722930 672478 642968 699203 679649
12997F79649J5670J77888R8312J97923J36649R3961O9439n984o3294k8214R4726
$$ 679649 695319 873207 971519 1169442 1306091 1400052 1469491 1463507 1400213 1371999 1466725
12986A466725J73630N5679J82279J80049Q2167N4575q2230k30784j77694j12538
$$ 1466725 1640355 1696034 1878313 2058362 2140529 2195104 2112874 1882090 1704396 1591858
12976A591858j74440j41940J7779j5109k3131K3580o656l0193L92l8625j07190
$$ 1591858 1417418 1275478 1293257 1278148 1255017 1278597 1271941 1241748 1242140 1203515 1096325
12965A096325j73654o6908J8485l03j03568m7096J29467N1490P2253J03163K59049
$$ 1096325 922671 855763 874248 873945 770377 723281 852748 904238 976491 1079654 1338703
12954A338703L06796K52307K36068K38543m3538l65134l62420l10696j63169j29959
$$ 1338703 1645499 1897806 2133874 2372417 2328879 1963745 1601325 1290629 1127460 997501
12944I97501j47220j08539j10583j05615m6151p2828j40794q3381J9097L970n1044
$$ 997501 850281 741742 631159 525544 479393 406565 265771 182390 201487 205457 154413
12933A54413R3557m1711j08327k6592J3626J76668K6711q3323N0291m6554K7164
$$ 154413 247970 206259 97932 71340 84966 261634 288345 205022 255313 208759 235923
12922B35923J27444p9405p4766M5825O7125r1619K4839R9701J12950n5585j01980
$$ 235923 363367 283962 209196 255021 322146 230527 255366 355067 468017 412432 310452
12911C10452J199k4975L0849R9911o3761j46597R0997n8544N9741J15732K8285
$$ 310452 311651 286676 317525 417436 353675 207078 298075 239531 299272 415004 443289
12900D43289n6189j07016O5058P0625r5358R8935J08739J4535n6332n177n4020
$$ 443289 387100 280084 345142 415767 320409 419344 528083 542618 486286 481109 427089
12889D27089R7577L1865o0628q2515o132N054m6102k3015P279l8234o148k1923
$$ 427089 524666 556531 495903 413388 407256 412310 366208 343193 350472 312238 306090 284167
12877B84167O3949O3870J20034L8298K2515N4886L8686M7648q8468o6019j08212
$$ 284167 348116 411986 532020 570318 592833 647719 686405 734053 645585 579566 471354
12866D71354o4616q7553j09075q7783K5744N7391K9803K1348o4868J4306J20806
$$ 471354 406738 319185 210110 122327 148071 205462 235265 256613 191745 206051 326857
12855C26857q849K1978L6710R7826L595J41675J24395M3116R3915J47751L25481
$$ 326857 318008 339986 376696 474522 478117 619792 744187 787303 881218 1028969 1354450
12844A354450O20601J155112J538673k570j503395j168851o33830k96044q8536
$$ 1354450 1975051 3130163 4668836 4666266 3162871 1994020 1360190 1064146 975610
12835I75610k96468j67417j46948n3263J20516Q9867N5209j0871J10929J31842
$$ 975610 679142 511725 364777 311514 432030 521897 577106 566235 677164 809006
12825H09006N1918K4514p7414l1010N0701k1241q0816J00680K3213j10009J6050
$$ 809006 860924 885438 808024 777014 827715 806474 725658 826338 849551 739542 755592
12814G55592K0629J2363l5196j7891r2092j50294m7570n622J4522M0208J22667
$$ 755592 776221 788584 753388 735497 643405 493111 445541 439919 454441 494649 617316
12803F17316J52799R8193J563j53904r8295l5491j15308n8369R6886R9955M8897
$$ 617316 770115 868308 869871 715967 617672 582181 466873 408504 505390 605345 654242
12792F54242j3666k7064N0449l2445n6228J85483J3799k8543m47N6923l3905m2702
$$ 654242 640576 613512 663961 631516 575288 760771 774570 746027 745580 802503 768598 725896
12780G25896P61l8094J8878J182L8686O841J10789M6005Q1480J36080j25692k38251
$$ 725896 726657 688563 707441 708623 747309 754150 864939 910944 992424 1128504 1002812 764561
12768G64561m4418P2944J00510m3929j82991m9043m0519q5890p9696m9196l1702
$$ 764561 720143 793087 893597 849668 666677 617634 577115 491225 411529 362333 330631
12757C30631J65675J20913O4058J20623J35665M5530J06110K2938J29236L2505
$$ 330631 496306 617219 681277 801900 937565 983095 1089205 1112143 1241379 1273884
12747A273884r5548K1887j57251j12656j98114m2734M2556K3005p9462j36111
$$ 1273884 1178336 1200223 1042972 930316 732202 689468 732024 755029 675567 539456
12737E39456p4273l5489M7151J31441J2200j16394N9036O358m5557l2600m080
$$ 539456 465183 429694 476845 608286 620486 504092 563128 569486 523929 491329 487249
12726D87249n1476n7120j1209m5804O4499j3444M8582R9982K6042n4267P7794
$$ 487249 435773 378653 367444 321640 386139 372695 421277 521259 547301 493034 570828
12715E70828J295j49417k9463Q8405R2078L420M6492l33r7290n0456J14753J80182
$$ 570828 572123 422706 393243 481648 573726 577146 623638 623305 526015 475559 590312 770494
12703G70494q1241r6615L4885K4147n0694l4121n6769p5464r5288J5749J51393
$$ 770494 689253 592638 627523 651670 600976 566855 510086 434622 339334 355083 506476
12692E06476J68374P9701J28910J93937O0604M4315Q8828N4999N2732O6291k6152
$$ 506476 674850 754551 883461 1077398 1138002 1182317 1271145 1326144 1378876 1445167 1419015
12681A419015n1535j9234K5109J14227r748J74849n2671r2189j03758j1215p6271
$$ 1419015 1367480 1348246 1373355 1487582 1477834 1652683 1600012 1507823 1404065 1392850 1316579
12670A316579j00991J853k3013j02213l6896J9498J18484O7985q2490m7372K1561
$$ 1316579 1215588 1217441 1194428 1092215 1055319 1074817 1193301 1261286 1178796 1131424 1152985
12659A152985Q4085J18433J44756Q0579R239l253J31455r639j0592J06832N2899
$$ 1152985 1237070 1355503 1500259 1580838 1590077 1586824 1718279 1708640 1698048 1804880 1857779
12648A857779j14992j89161o8690J2846J7160P043N9745O8747J4161o3976j08443
$$ 1857779 1742787 1553626 1484936 1497782 1514942 1521985 1581730 1650477 1664638 1600662 1492219
12637A492219J061K7608k6978M9146M1973q4012R879L7594Q5791J54225L8139
$$ 1492219 1493280 1520888 1493910 1543056 1585029 1501017 1510896 1548490 1634281 1788506 1826645
12626A826645O4139J92640K16712J86799J18074J357J1109P3669l1898r6597j46007
$$ 1826645 1890784 2083424 2300136 2486935 2605009 2606366 2617475 2691144 2659246 2562649 2416642
12615B416642j15400l7211m5484n1746k4617M4023l6912R8496J76888J03525N4997
$$ 2416642 2301242 2264031 2218547 2166801 2142184 2186207 2149295 2247791 2424679 2528204 2583201
12604B583201Q2455J11904Q6642Q6502J47781J20369J62401L27657L05490K51728
$$ 2583201 2665656 2777560 2864202 2950704 3098485 3218854 3381255 3708912 4014402 4266130
12594D266130K42651L62740L91497K01643L40027K77961K28730L17557J98132
$$ 4266130 4508781 4871521 5263018 5464661 5804688 6082649 6311379 6628936 6827068
12585F827068N7235Q4264K16222L39847L62023L67641M75289O40452P77263R51761
$$ 6827068 6884303 6968567 7184789 7524636 7886659 8254300 8729589 9370041 10147304 11099065
12575A1099065J010336J140983J474167J736159J882661K080434K372967K826739
$$ 11099065 12109401 13250384 14724551 16460710 18343371 20423805 22796772 25623511
12567B5623511L546148M795920O517761Q861316J2409139J7445146K4404769L4625286
$$ 25623511 29169659 33965579 40483340 49344656 61753795 79198941 103603710 138228996
12559A38228996M8071122O2986328P3164171O4723129K4858171k7817826n9081022
$$ 138228996 186300118 249286446 322450617 387173746 412031917 384214091 325133069
12552C25133069o3871444n5141090m2289746l0290128k0767492j3368622p602294
$$ 325133069 261261625 206120535 163830789 133540661 112773169 99404547 91802253
12545I1802253l010265J272111N638111J0522143J6431075K2950806K8518314
$$ 91802253 88791988 90064099 95702210 106224353 122655428 145606234 174124548
12538A74124548K9779932K4208199J3551460L519389j241812j250304K429718
$$ 174124548 203904480 228112679 241664139 245183528 243941716 242691412 245121130
12531B45121130J0174361K0644750L0472346L6045079L4358441K3115710K202953
$$ 245121130 255295491 275940241 306412587 342457666 376816107 399931817 402134770
12524D02134770k0424890l4565873l8197947l4949826k7846228j8708176q997995
$$ 402134770 381709880 347144007 308946060 273996234 246150006 227441830 218443835
12517B18443835l22018N558027Q142921P659788K885779p204510j8978438k6915164
$$ 218443835 218121817 223679844 231822765 239482553 242368332 235163822 216185384 189270220
12509A89270220k8101470k3974493j7838229j1516701n884003o45811M709935
$$ 189270220 161168750 137194257 119356028 107839327 101955324 101309513 106019448
12502A06019448J1332647J9912124L1292305M5523570O0506689P1374757O9426988
$$ 106019448 117352095 137264219 168556524 214080094 274586783 345961540 415388528
12495D15388528M4745495n921276n8963048q1445209p4902426n8528119m3193704
$$ 415388528 460134023 454212747 395249699 313804490 238902064 180373945 137180241
12488A37180241l1307252k2500466j6044911j1654283q846687o729973n126583
$$ 137180241 105872989 83372523 67327612 55673329 46826642 40096669 34970086
12481C4970086l930734l086459k718949k622801k462013k105002j862106j524708
$$ 34970086 31039352 27952893 25233944 22611143 20149130 18044128 16182022 14657314
12473A4657314j261350j148690r49240p49664o21084n88383m70037m23629m24333
$$ 14657314 13395964 12247274 11298034 10548370 9927286 9338903 8868866 8445237 8020904
12464H020904m40081l67063l19481m46975l19783k33586k35748j30784l0579j48572
$$ 8020904 7580823 7213760 6894279 6447304 6127521 5893935 5658187 5527403 5496824 5348252
12454E348252l68201j88477j94340k95372k18344j34627j24989k2314j31832j38055
$$ 5348252 4980051 4791574 4597234 4301862 4083518 3948891 3823902 3801588 3669756 3531701
12444C531701m1207r8573j26122j822J5633m853p1472j7475Q4748J84348N1741
$$ 3531701 3490494 3391921 3265799 3263977 3279610 3274757 3203285 3185810 3270558 3454906 3506647
12433C506647J00159Q3420J85205J76121O1584j19465j27538j37166k14791k82815
$$ 3506647 3606806 3690226 3875431 4051552 4113136 3993671 3866133 3728967 3514176 3231361
12423C231361j86234j19360r4794j46031j43175j01847j60940R381j7750k3342
$$ 3231361 3045127 2925767 2830973 2684942 2541767 2439920 2278980 2288361 2270611 2247269
12413B247269Q0217o1641p1934k2204N0790p594K0770J05269K29951K24039L49638
$$ 2247269 2327486 2265845 2193911 2171707 2222497 2214903 2235673 2340942 2570893 2794932 3144570
12402C144570M09190M42705N62896M39848J58710k73131l98507l70794l67194
$$ 3144570 3553760 3996465 4559361 4999209 5157919 4884788 4486281 4115487 3748293
12393C748293m70196l44821j79047j67755j49338o0679j19317p5397p6596j58693
$$ 3748293 3278097 2933276 2754229 2586474 2437136 2376457 2257140 2181743 2105147 1946454
12383A946454j67705j4408J11046J76388K30710P6753J61819K69588J61902k5556
$$ 1946454 1778749 1764341 1875387 2051775 2282485 2359238 2521057 2790645 2952547 2926991
12373B926991J7835K55399J94069J79802O1441p8141k34232l71288k87748k46430
$$ 2926991 2944826 3200225 3394294 3574096 3635537 3557396 3323164 2951876 2664128 2417698
12363B417698l18170k29394j44449r1360j23945k6421j39255j26554m5638j28842
$$ 2417698 2099528 1870134 1725685 1634325 1510380 1483959 1344704 1218150 1172512 1043670
12353A043670n8284j6488k0788k01525J308M0610R3856r1280j33222M5931J4626
$$ 1043670 985386 968898 948110 746585 747893 788503 882359 791079 657857 703788 718414
12342G18414q6123n7345K5298K9709m6461K5241J01570k6364j52616o8762N9363
$$ 718414 632291 574946 600244 629953 583492 608733 710303 683939 531323 462561 521924
12331E21924j118K3818M2179j0782M0310l1866j38282K624J05757K9957j04989
$$ 521924 520806 544624 586803 576021 616331 584465 446183 448807 554564 584521 479532
12320D79532j12900o7094k9048N5826J05187O2462j7032k4416l6390K625Q6980
$$ 479532 366632 299538 270490 326316 431503 493965 476933 452517 416127 418752 505732
12309E05732j1621p6724p352M21K9698j01611p6808k5543J55681J11033m6206
$$ 505732 494111 417387 410035 410456 440154 338543 261735 236192 391873 502906 456700
12298D56700L3934M4561n2204m8073q9880l9159O3929L5233M028O4693P3872L0056
$$ 456700 490634 535195 482991 434918 345038 305879 369808 405041 409069 473762 547634 577690
12286E77690l5558J06260J11084O9516j29344j74258j02840K7865j468M4319j6735
$$ 577690 542132 648392 759476 828992 699648 525390 422550 450415 448947 493266 476531
12275D76531q3347q3151L0829O1009n59K0565k7946k7168J7992J4349r2451J3076
$$ 476531 393184 310033 340862 401871 401312 421877 393931 366763 384755 399104 306653 319729
12263C19729j13666n3130K6593k1203p6141J47068O7583L9316m2048k796K5243
$$ 319729 206063 152933 179526 158323 82182 229250 296833 336149 294101 291305 316548
12252C16548N5103L3383n3413j4045L7990L5063l7319m1075r3671O1042R1219
$$ 316548 371651 405034 351621 337576 375566 410629 373310 332235 238564 299606 390825
12241C90825n340M9561K2613p6436r4818J72195J22676k2761N694O7875p6601
$$ 390825 385485 435046 457659 381223 286405 458600 581276 558515 564209 632084 555483
12230E55483p7784k8021q1262o7047M9336J3484n1369M4564J5832J753Q324k7406
$$ 555483 477699 449678 368416 301369 350705 364189 312820 357384 373216 374969 383293 355887
12218C55887L7656M0918j40953J5076k5924l400J42444M8767J9386o1475j03226
$$ 355887 393543 434461 293508 308584 282660 279260 421704 470471 489857 428382 325156
12207C25156l9439j7163K6922J14908J8514j4630j2857k1997r057L1452o1317
$$ 325156 285717 268554 295476 410384 428898 414268 401411 379414 370357 401809 340492
12196C40492k7732J11740N8657L7860n1556Q0768M3965n6537K6699r7673j14361
$$ 340492 312760 424500 483157 521017 469461 550229 594194 537657 564356 466683 352322
12185C52322r4311L3337j03357J5999J22624l8896M4744R7723O2532n669J2113
$$ 352322 258011 291348 187991 203990 326614 287718 332462 430185 492717 487048 499161
12174D99161m2218j7435O1807K8605p4749M9679J6017p9947n3849k7662M3800
$$ 499161 456943 439508 501315 529920 455171 504850 520867 440920 387071 359409 403209
12163D03209P5586O6583N0481l2944r3059j26898L519J60452O5293j33460p4135
$$ 403209 478795 545378 595859 562915 469856 342958 346477 506929 572222 438762 364627
12152C64627k10721q1169p1237j17205Q6038K21590J06241J6860n7946M4182n0242
$$ 364627 153906 72737 1500 -115705 -29667 191923 298164 315024 257078 301260 251018
12141B51018l1354M7001j5840N2647n2088n5629o4676K6008J53304J00078p238
$$ 251018 219664 266665 250825 303472 251384 195755 131079 157087 310391 410469 403231
12130D03231K889o533p7060k7751J1964l3162K1139K3502L3740K5059k24098l3253
$$ 403231 406120 399587 322527 294776 306740 273578 294717 318219 351959 377018 152920 119667
12118A19667k6100o8348J19053J1026L4313O3487N6606J2277m1287J0455l6933
$$ 119667 93567 25219 144272 155298 189611 253098 309704 321981 280694 291149 254216
12107B54216J1794J03122R1615q2445J2873L1448K5569M0147J23724J93895J08150
$$ 254216 266010 369132 460747 378302 391175 422623 448192 488339 612063 805958 914108
12096I14108K14676K72314L34864K31343p0265m0223j61359j10536k20855k24177
$$ 914108 1128784 1401098 1735962 1967305 1897040 1856817 1695458 1584922 1364067 1139890
12086A139890j30999l9837j02806M1879k1952p3465k0204J73778J98025M1178
$$ 1139890 1008891 969054 866248 908127 886175 812710 792506 966284 1164309 1205487
12076A205487J17605L20837M14105L31491L26377L07794L32096K73796O4074m1900
$$ 1205487 1323092 1643929 2058034 2389525 2715902 3023696 3355792 3629588 3693662 3651762
12066C651762J14854O9542k3179k65230m23531l60023k68109l20798j90136K2989
$$ 3651762 3766616 3836158 3812979 3547749 3124218 2764195 2496086 2175288 1985152 2008141
12056B008141J07164P1372J29175J99417K31470R9802O037j36769k05120j37144
$$ 2008141 2115305 2186677 2315852 2515269 2746739 2846541 2852578 2715809 2510689 2373545
12046B373545j98822j38163p3914P8144N9075J16266K86864L16717L40787K20047
$$ 2373545 2174723 2036560 1962646 2040790 2099865 2216131 2502995 2819712 3160499 3380546
12036C380546K86570K28632K51258J45937q414k25209m90081l82318l93656l98273
$$ 3380546 3667116 3895748 4147006 4292943 4284529 4059320 3569239 3186921 2793265 2394992
12026B394992k33366l14622j70724k11899k62007j2584p1939J34688l6421j92117
$$ 2394992 2161626 1847004 1676280 1464381 1202374 1189790 1117851 1252539 1216118 1024001
12016A024001j88068m567J05656J1781K38693K65974J64558J98010P1949N0569
$$ 1024001 835933 831366 937022 948803 1187496 1453470 1618028 1816038 1887987 1938556
12006A938556O2467j89467j85217k73643j60942j36795k20525j28012j02123o6308
$$ 1938556 2001023 1811556 1626339 1352696 1191754 1054959 834434 706422 604299 537991
11996E37991n3259M2757P0978n1390O2765J11548j0669j06406p3375p138L7289
$$ 537991 484732 527489 598467 547077 609842 721390 710721 604315 530940 523802 561091
11985E61091o9455N2745J14595k639j6534k8070r8063N5977m9363l8823l7421
$$ 561091 491636 544381 658976 656337 639803 611733 513670 569647 520284 481461 444040
11974D44040R2581Q244L8845l4738m7030J5353M1794j0328q1081k4780N9479R5219
$$ 444040 536621 544865 583710 548972 501942 517295 559089 548761 467680 442900 502379 597598
11962E97598K2083L326m5356k4441l2591k1096p6805k845O1221L1718M8428j17188
$$ 597598 619681 623007 577651 553210 520619 499523 422718 419873 481094 512812 561240 444052
11950D44052m8773L18o0095R1654J0742k1375k4379L9377O5969J19069K02503
$$ 444052 395279 395597 335502 427156 437898 416523 392144 431521 497490 616559 819062
11939H19062K8731o2585J2516l7716p1002o1788L7940j4421R613J44475J63683
$$ 819062 847793 785208 797724 760008 689006 627218 665158 650737 660350 804825 968508
11928I68508O596M9616j4497l8939l9725n2961j11658o9999K4674L612k419M1210
$$ 968508 975104 1024720 1010223 971284 931559 878598 766940 696941 721615 725227 722808 764018
11916G64018n9539J3347J71038j8n6902N8597N5347J45020l3486o2608j07813
$$ 764018 704479 717826 888864 888846 831944 890541 945888 1090908 1057422 994814 887001
11905H87001K9950j4165j15726j28861p5969m9967Q987J0734K3352L7991n9369
$$ 887001 916951 902786 787060 658199 582230 532263 541250 551984 575336 613327 553958
11894E53958K0409N7802l894O4461q0J01474J45465M4036J78639K21167J57588
$$ 553958 574367 632169 628275 692736 692656 794130 939595 983631 1162270 1383437 1541025
11883A541025K41229K06552O9695P7931j3304l9311o7418n7463j59259j34986
$$ 1541025 1782254 1988806 2058501 2136432 2123128 2083817 2016399 1958936 1799677 1664691
11873A664691n9639j23976n6146m9523j26386J1298m7321j1630j56413j38123
$$ 1664691 1605052 1481076 1424930 1375407 1249021 1260319 1212998 1201368 1044955 906832
11863I06832L5096J24619n2101q3016o5204j10242k7654R2147J50013J05214R2433
$$ 906832 941928 1066547 1014446 931430 866226 755984 728330 820477 970490 1075704 1168137
11852A168137P3114m939P6648J47626L2841m0420l0573J02968P4909J04740N4387
$$ 1168137 1241251 1236312 1312960 1460586 1493427 1453007 1422434 1525402 1600311 1705051 1759438
11841A759438L4038Q1229n8884j8842j06717j78975p6450j07282j49768j22529
$$ 1759438 1793476 1874705 1815821 1796979 1690262 1511287 1434837 1327555 1177787 1055258
11831A055258m2829O702j43486m295l0409J6209j374J9395K8637J84025M4811
$$ 1055258 1012429 1019131 875645 871350 840941 857150 855776 875171 903808 1087833 1132644
11820A132644j4258r2773j9578n2187r4150j089K4327M6175J56148K28753M9101
$$ 1132644 1118386 1025613 1006035 953848 859698 858609 882936 929111 1085259 1314012 1363113
11809A363113m6350l9280j680j02593j12556j44588R1225M6955r2082n9731L8792
$$ 1363113 1316763 1277483 1275803 1173210 1060654 916066 1007291 1054246 962164 902433 941225
11798I41225O4603K7220o6107N5736N8685j3280q2407L9061j1806k756j638O6781
$$ 941225 1005828 1033048 966941 1022677 1081362 1068082 985675 1024736 1012930 1010174 1008536 1075317
11786A075317J13181m9386k7507Q46k0271J41699N2694r3621r1394J1169q266
$$ 1075317 1188498 1139112 1111605 1112451 1092180 1233879 1286573 1192952 1101558 1112727 1104461
11775A104461j15255l6018L8890M9387j1037l445p0969O6851K3440L8316M5835
$$ 1104461 989206 953188 992078 1041465 1030428 1026983 956014 1022865 1046305 1084621 1130456
11764A130456P1698J09831P0005K28283J86402J20594J86465L6688j02745l2061
$$ 1130456 1202154 1311985 1381990 1610273 1796675 1917269 2103734 2140422 2037677 2005616
11754B005616J30896J96522J32878J71185J34454R0691M7463o9368j00959k05795
$$ 2005616 2136512 2333034 2465912 2637097 2771551 2862242 2909705 2840337 2739378 2533583
11744B533583j32610j95085k54958j30506j9919L4771K0498N2509L9167J28693
$$ 2533583 2400973 2205888 1950930 1820424 1800505 1835276 1855774 1908283 1947450 2076143
11734B076143J12943K91880J86303J73662L43848N00372O13129P85584O14625
$$ 2076143 2189086 2480966 2667269 2840931 3184779 3685151 4298280 5083864 5698489
11725E698489L10750k31837n40850o56074n41134m52523k70008k47183j83149
$$ 5698489 6009239 5777402 5236552 4580478 4039344 3586821 3316813 3069630 2886481
11716B886481o7867o6544j7703j08206j01046R3061K59397M24564K94442L23283
$$ 2886481 2818614 2752070 2734367 2626161 2525115 2618176 2877573 3302137 3596579 3919862
11706C919862M9922j08270j61123l2836N2769L1701J52965L47390M75714N53096
$$ 3919862 3969784 3861514 3700391 3667555 3720324 3752025 3904990 4252380 4728094 5281190
11696E281190M67563J91571K4271j30207k43602k92425k44435l32830j63668J16574
$$ 5281190 5748753 5940324 5964595 5834388 5590786 5298361 5053926 4721096 4557428 4674002
11686D674002J91429J23432M421j30465k06278j66205r0746j47855j06924j21683
$$ 4674002 4865431 4988863 4993284 4862819 4656541 4490336 4399590 4251735 4144811 4023128
11676D023128L4822P8424M9271R3571J42334K74005L30001M31645N44131O76711
$$ 4023128 4057950 4136374 4185645 4279216 4421550 4695555 5025556 5457201 6001332 6678043
11666F678043O47545O26230K51508L8343j16167j76385j15962n8191J37995L68427
$$ 6678043 7325588 7951818 8203326 8241669 8125502 7949117 7833155 7774964 7912959 8281386
11656H281386N51132M47476M90202O73208P92932O78774Q47267Q98794J111174
$$ 8281386 8832518 9279994 9770196 10443404 11236336 11915110 12762377 13661171 14772345
11647A4772345J332038J538262J931802K366368K985952L523186M415136N716429
$$ 14772345 16104383 17642645 19574447 21940815 24926767 28449953 32865089 38581518
11639C8581518P153734R567832J3021726J8305444K5997111L6916982N0795716
$$ 38581518 45735252 55303084 68324810 86630254 112627365 149544347 200340063
11632B00340063O5855524P5755495O7390534K9580844k1794774n3194173o0534199
$$ 200340063 266195587 341951082 409341616 438922460 417127686 363933513 303399314
11625C03399314n6395726m7333548l6634050k6220932j7270014r970789m490847
$$ 303399314 247003588 199670040 163035990 136815058 119545044 109574255 105083408
11618A05083408L29745N447776J2052436K0502512K8743741L2330020K7203520
$$ 105083408 105413153 110860929 122913365 143415877 172159618 204489638 231693158
11611B31693158J4461257l22035j1892608j6773512j5934299j1094401j301475
$$ 231693158 246154415 245832380 233939772 217166260 201231961 190137560 188836085
11604A88836085J2143518K7296295M2946200N5773114N8431875M3935399J1953274
$$ 188836085 200979603 228275898 271222098 326995212 385427087 429362486 441315760
11597D41315760k4712729m8814054n3620968m4253196k8826344j2936466k83513
$$ 441315760 416603031 367788977 314168009 269914813 241088469 228152003 227868490
11590B27868490P262937J0092175O600196l965591j8018093k9328075l2856503
$$ 227868490 235131427 245223602 251823798 247858207 229840114 200512039 167655536
11583A67655536k9277713k1818798j4058128p791148l247854L29808M093336R229451
$$ 167655536 138377823 116559025 102500897 94709749 91461895 91791703 95885039 105114490
11575A05114490J5987246K4388681L4090227M4046442N2179890N3951104M2671943
$$ 105114490 121101736 145490417 179580644 223627086 275806976 329758080 372430023
11568C72430023J2065907l0983633o0927262o5269092n4322694m0681988k9223187
$$ 372430023 384495930 353512297 292585035 227315943 172993249 132311261 103088074
11561A03088074k1115225j5422567j1187127q495349o527164n385533m454906
$$ 103088074 81972849 66550282 55363155 46867806 40340642 34955109 30500203
11554C0500203l739080l266336k634867k144414j817882j448007j248012j060737
$$ 30500203 26761123 23494787 20859920 18715506 16897624 15449617 14201605 13140868
11546A3140868q81761q21318o73600n72748m19038l47387k49256k53499j41847
$$ 13140868 12259107 11437789 10764189 10191441 9772403 9425016 9175760 8922261 8780414
11537H780414j09746j8250J8700J09198J80556J45553J65374L67017N25029N55309
$$ 8780414 8670668 8652418 8671118 8780316 8960872 9106425 9271799 9638816 10163845 10719154
11527A0719154O81400Q97987J244723J645715K158218K724607L566053M703500
$$ 10719154 11400554 12298541 13543264 15188979 17347197 20071804 23637857 28341357
11519B8341357O225878Q039117R907700J1419616J1137199P558170J178668n380313
$$ 28341357 34567235 42606352 52514052 63933668 75070867 82629037 83807705 78427392
11511G8427392r434719j0322572r491815p808957o190745m903709l826164l004932
$$ 78427392 68992673 58670101 49178286 41369329 35178584 30274875 26448711 23443779
11503B3443779k469831j950333j520506j291770r82040r15465p74806n57539n15547
$$ 23443779 20973948 19023615 17503109 16211339 15229299 14313834 13539028 12981489 12465942
11494A2465942k19768k08321j16947N1918J25281L07972M15421N00912O63405
$$ 12465942 12246174 12037853 11920906 11972824 12098105 12406077 12821498 13322410 13985815
11485A3985815P17655R65587J333814J695309K013694K591949L298829M155560
$$ 13985815 14703470 15669057 17002871 18698180 20711874 23303823 26602652 30758212
11477C0758212N458301P414212R787584J3314726J8050117K3530695K8379368
$$ 30758212 36216513 43630725 53418309 66733035 84783152 108313847 136693215
11470A36693215K8182170J7696359j934255k0129908k7766336k6396242k1569786
$$ 136693215 164875385 182571744 180637489 160507581 132741245 106345003 84775217
11463H4775217j6652033j2567968r468162p243447n611952m342787l535883k847434
$$ 84775217 68123184 55555216 46087054 38843607 33231655 28888868 25352985 22505551
11455B2505551k341246j755909j389609j158538r35797q46492p04774n45046m50717
$$ 22505551 20164305 18408396 17018787 15860249 14924452 14077960 13373186 12828140 12377423
11446A2377423l68257k44914j49954j01569M7828J34581L34139M44180N93318
$$ 12377423 12009166 11764252 11614298 11512729 11560557 11695138 12029277 12473457 13066775
11437A3066775Q28713R58859J244534J754536K266463K846346L666597M745575
$$ 13066775 13895488 14854347 16098881 17853417 20119880 22966226 26632823 31378398
11429C1378398N957168P581149R147078R968059Q774979M714995j668570p422464
$$ 31378398 37335566 44916715 54063793 64031852 72806831 77521826 75853256 68430792
11421F8430792j0371020j0523524r075246p319933n662679m307031l470204k756234
$$ 68430792 58059772 47536248 38461002 31141069 25478390 21171359 17701155 14944921
11413A4944921k188961j617330j435285j236319r90270q29062p16616n14355m65653
$$ 14944921 12755960 11138630 9703345 8467026 7476756 6647694 5931078 5416723 4951070
11404D951070m08251l67554l30974l28340k78783k28420j17797r7143j19994j41085
$$ 4951070 4542819 4175265 3844291 3515951 3237168 3008748 2890951 2793808 2673814 2532729
11394B532729j40003j47666j94071n6824M1753M059p0521r717j66059j71185Q4579
$$ 2532729 2392726 2245060 2050989 1994165 2035918 2039977 1969456 1959739 1793680 1622495 1707074
11383A707074K7053q698j06974k25342m2754P0972K77j23535j63184j2380k1862
$$ 1707074 1734127 1725429 1618455 1393113 1350359 1421331 1421608 1298073 1134889 1122509 1100647
11372A100647P3070M7401O0659j03581j22063n326N2341j50788j8724R1177O5050
$$ 1100647 1173717 1221118 1281777 1178196 1056133 1050807 1103148 952360 933636 1024813 1089863
11361A089863j6057l7710k5520P1359Q6268o092m7327K52J38156J11042J01365
$$ 1089863 1073806 1036096 1010576 1081935 1168203 1162111 1114784 1115036 1253192 1364234 1465599
11350A465599K5499j75504j41669l3684L3161J61780J22049r06j24142R9451P0402
$$ 1465599 1491098 1315594 1173925 1140241 1173402 1335182 1457231 1456325 1332183 1431634 1502036
11339A502036o6652j39027r4640Q6903q5603j33837k3147q3669M5351J65806J29344
$$ 1502036 1435384 1296357 1201717 1288620 1203017 1069180 1046033 962364 1007715 1173521 1302865
11328A302865R8867J23175P6366J48230J1777q478k9947J8911r4616m8021K4044
$$ 1302865 1401732 1524907 1601273 1749503 1761280 1752802 1722855 1741766 1647150 1599129 1623173
11317A623173l4225j97769j58044l6855j07798p2990J9125M4791N9038J59693
$$ 1623173 1588948 1391179 1233135 1196280 1088482 1015492 1034617 1079408 1138446 1298139
11307A298139L8184r4475M6158J84373J47441K8429K6896q9046r0579j11411j68423
$$ 1298139 1336323 1241848 1288006 1472379 1619820 1648249 1675145 1586099 1495520 1384109 1215686
11296A215686m6512o353n3987j27949l6562O5913J36610J14913J46520K1918j44352
$$ 1215686 1169174 1162821 1108834 980885 944323 1010236 1146846 1261759 1408279 1430197 1285845
11285A285845J8517M5112j21490j69452p253n303m2892q4475p3190J9619p5584
$$ 1285845 1304362 1349474 1227984 1058532 1051279 1045976 1003084 918609 845419 865038 789454
11274G89454o9695j58159j18161N3648n357L3644R1200Q6247j5795o3190q0591
$$ 789454 719759 561600 443439 497087 491730 525374 616574 702821 687026 623836 543245
11263E43245J3133K2913j18527j11024m2050q4128K9776m8455J15544J27758J7
$$ 543245 556378 579291 460764 349740 307690 223562 253338 204883 320427 448185 448202
11252D48202j67083K5982Q0882j9217r2874r5033L8808o7179K567n9133n0603
$$ 448202 281119 307101 387983 368766 275892 180859 219667 152488 155055 95922 45319
11241D5319L3667P6897P0871J8215l2174p4732R5633J39792r0163J0332j29800
$$ 45319 78986 155883 226754 244969 212795 138063 233696 373488 283325 293657 163857
11230A63857P199N8421J37396o0076p2339Q3337m578q0191L1258O6065R1474l184
$$ 163857 171056 229477 366873 306797 234458 317795 313217 233026 264284 330349 421823 418639
11218D18639j41513n9510k546R413K7272n874J38876p8750j05097r3223O404j0593
$$ 418639 277126 217616 215070 224483 251755 245881 384757 306007 200910 107687 114091 103498
11206A03498j33114J9999J62843J00651N9190p0392k8755J27311O6407k6430j6646
$$ 103498 -29616 -9617 153226 253877 313067 242675 213920 341231 407638 381208 364562
11195C64562j5541m1962M7308P3143P1545J81956J93809K69578J79271K22267
$$ 364562 349021 307059 354367 427510 499055 681011 874820 1144398 1323669 1545936
11185A545936K16534K03291J59083R7798j76023l58009l25417j71199j11447r1683
$$ 1545936 1762470 1965761 2124844 2222642 2046619 1688610 1363193 1191994 1080547 988864
11175I88864m6713M1675o7188m2961K1960k1805J6734O5072J12637J27052R4574
$$ 988864 942151 983826 916638 873677 895637 873832 890566 955638 1068275 1195327 1289901
11164A289901j2060P6257r633R2298o5461j10122m3013Q3705K11888K40161K43694
$$ 1289901 1277841 1354098 1344465 1436763 1371302 1261180 1218167 1301872 1513760 1753921 1997615
11153A997615J98656j8162l6448j59246k55121j03072J9951m399m0345P5725P3126
$$ 1997615 2196271 2178109 2141661 1982415 1727294 1624222 1644173 1639774 1599429 1675154 1748280
11142A748280O3377j11421k76484k09268j28738m2699n6860j25665j09675n4423
$$ 1748280 1811657 1700236 1423752 1214484 1085746 1043047 986187 860522 750847 696424
11132F96424P6353K4721J298J60137Q6555J72847J79690K47785K65365N1909N4380
$$ 696424 772777 797498 798796 958933 1045488 1218335 1398025 1645810 1911175 1963084 2017464
11121B017464j05047k47987l37344j26208j99013k63332p2370l0877j59535j3189
$$ 2017464 1912417 1664430 1327086 1200878 1001865 738533 666163 635286 475751 462562
11111D62562r3932n7536M3315j778j20407K1905L5201p732L4614k4817j73868
$$ 462562 368630 311094 354409 352631 232224 254129 289330 281598 316212 291395 117527
11100A17527m1818m7177j9688l2158J42435L0630Q808O628Q7590J13138r4972
$$ 117527 75709 28532 8844 -23314 119121 149751 158559 165187 252777 365915 270943
11089B70943k21629n1641m438O9708j8226M6660o963n0872J26503Q009m0746p9300
$$ 270943 49314 -2327 -6765 62943 44717 91377 84414 33542 160045 168054 127308 48008
11077D8008o9645l945R9030J69203L748j5909j9628q3360j1567j02905m14Q2273
$$ 48008 -21637 -25582 73448 242651 246399 230490 210862 127502 115935 13030 12616 94889
11065I4889M3897k9313J1322L4633L9591j05526j89015K885R3359K9773M3331
$$ 94889 138786 109473 120795 155428 195019 89493 -99522 -96637 -3278 26495 69826
11054F9826J6684j11233M9593M9865K9010N7600j1858J32178J28206r8228q0958
$$ 69826 86510 -24723 24870 74735 103745 161345 149487 281665 409871 311643 230685
11043B30685r4084O6555N3259l0788j2013Q6405j28669j33886r479n5655N1593
$$ 230685 136601 203156 256415 225627 213614 300019 171350 37464 27985 -27670 23923
11032B3923P9841K2575j4882J13858j931j4609N5254k2803q7547j18330J25008
$$ 23923 103764 126339 111457 225315 223384 208775 264029 241226 153679 35349 160357
11021A60357P9098j786j38459p3522J09202K23690R5263p3371q8603j18119m8508
$$ 160357 239455 237669 99210 25688 134890 358580 453843 380472 291869 173750 125242
11010A25242Q9058q7319j22737N5663N9162K6760M1163N4159Q0945j03370k6313
$$ 125242 214300 126981 4244 59907 119069 145829 186992 241151 322096 218726 192413
10999A92413L8821k4119j3546q944N7182Q397j613p7736o1961L4901m2540M010
$$ 192413 231234 207115 193569 184625 241807 250204 248591 170855 108894 143795 101255 105265
10987A05265l3317K1827k5766l077J10972J12420l1602j03045q4862o6230n1518
$$ 105265 71948 93775 68009 64932 175904 288324 256722 153677 68815 2585 -48933
10976d8933R7969K1795L6615l2308k7374p6627k3498o4291J23944M1693k3956
$$ -48933 49036 70831 107446 75138 47764 -28863 -52361 -116652 7292 48985 25029
10965B5029l6372M0203j08887j0397o9121m1828M4276n358K5140o1529m4825N7076
$$ 25029 -11343 28860 -80027 -90424 -159545 -201373 -157097 -162455 -137315 -198844 -243669 -186593
10953a86593L5758o0429Q8720J13221j24850K9336J66802P6744k1460q9885m3571
$$ -186593 -150835 -211264 -122544 -9323 -134173 -104837 61965 138709 117249 27364 -16207
10942a6207J3170J305P4139P571n714j02489J164Q1236Q8645k615j06529J31179
$$ -16207 -3037 -1732 72407 79978 74264 -28225 -27061 54175 142820 140205 33676 164855
10930A64855J11158M7560q8797j17528O5650K9286j8360o1671j9242k6620P9788
$$ 164855 276013 323573 234776 117248 182898 212184 193824 132153 112911 86291 166079
10919A66079Q4955Q5553K0877K4226K853j58473j81063J61667J61929k2026l1421
$$ 166079 251034 336587 357464 381690 384543 226070 45007 206674 368603 346577 315156
10908C15156R8428j3918o8934j2757j11497k6408L7755P6583J24963O7520j2623
$$ 315156 413584 399666 330732 317975 206478 180070 217825 294408 419371 486891 474268
10897D74268J4017j02821j18771j24185J9503J02729p1058j12666O0613k966K8498
$$ 474268 488285 385464 266693 142508 162011 264740 193682 81016 141629 138663 167161
10886A67161k7274o0454J10844M547m8720m1802q0736q8286K3756M0129l8031
$$ 167161 139887 79433 190277 194824 146104 104302 23566 -64720 -40964 -835 -38866
10875c8866m5336P6116R2692L7540L9772p9457q2851o4757Q2399L5780l7586l9715
$$ -38866 -84202 -8086 84606 122146 161918 82461 -390 -65147 17252 53032 15446 -24269
10863b4269q226M3944K9417o2450P3432J63063n9186K6335j5040p9627K0556R0722
$$ -24269 -32495 11449 40866 -21584 51848 214911 155725 182060 167020 87393 107949 198671
10851A98671N9769m4622j88119j48681R5850J97442J84919n1770j37726j57520
$$ 198671 258440 213818 25699 -122982 -27132 170310 355229 303459 165733 8213
10841H213p8901l4201k3194L8937L277P6753K3982R7884M8665j11517J4110j15968
$$ 8213 -70688 -104889 -128083 -89146 -85869 -9116 14866 112750 161415 49898 64008 -51960
10829e1960k2473J7670o711R8176L518q944J1295M8547P0393m6295L559n7650
$$ -51960 -74433 -56763 -63474 34702 38220 29276 40571 89118 159511 113216 116775 59125
10817E9125n0370k9644J12269J12791J22705p8763m9502k8473M5433O6494j154
$$ 59125 8755 -20889 91380 204171 326876 248113 198611 170138 215571 282065 280911
10806B80911l7883n3564j22548n290P9364M6737n6008j50388n7646J83100J87576
$$ 280911 243028 189464 66916 61626 140990 187727 131719 -18669 -76315 106785 294361
10795B94361j5475l18J16678k0101o6840l442n4786k7272q4660k8776j01015p9970
$$ 294361 278886 278568 395246 375145 308305 304863 250077 222805 138145 109369 8354 -71616
10783g1616Q9478J13250N4169o6165j11646l6185J6484M0167J06986O4398J17881
$$ -71616 17862 131112 185281 119116 7470 -28715 -12231 27936 134922 199320 317201
10772C17201J44901p3568j4923j23377q1914K5679M1559m0183j7822Q0568K6833
$$ 317201 462102 388534 373611 250234 168320 193999 235558 195375 177553 258121 284954
10761B84954J9152N6806P9885j48762n9083K2986N3115J2744L2459q0509j00983
$$ 284954 304106 360912 440797 292035 232952 255938 309053 321797 354256 273747 172764
10750A72764j06444L7417J12264n0119p9206j0290n955L2709J35471M4252J7688
$$ 172764 66320 103737 216001 165882 86676 76386 70431 103140 238611 282863 300551
10739C00551j0741k0464m0106j37394j09316j32033j9893m3655O0842J21613J17449
$$ 300551 289810 269346 229240 91846 -17470 -149503 -169396 -213051 -152209 -30596 86853
10728H6853q358j17761l1180K7657L5692r1100l5892R3592J4096m7445k9862J12529
$$ 86853 78495 -39266 -70446 -42789 -7097 -98197 -134089 -40497 -26401 -73846 -103708 8821
10716H821l9998o1702m7136J06780J37975n2356k2628j1141L1333J2146O1061
$$ 8821 -31177 -92879 -140015 -33235 104740 52384 29756 18615 49948 62094 123155
10705A23155L9367N9067Q9895q6292q2277n9577n8595o8774j8950J0033Q1298
$$ 123155 162522 221589 311484 225192 142915 83338 24743 -44031 -62981 -52948 28350
10694B8350O5525l521l4480j13680L4390r189N4373l4486m6911L7658J06929k9765
$$ 28350 93875 90354 55874 -57806 -23416 -32605 21768 -12718 -59629 -21971 84958 55193
10682E5193o5844r5510L7630L25P9920j255q2214l280R9104J34779O9272o866
$$ 55193 -10651 -106161 -68531 -68206 11714 10459 -71755 -75035 24069 158848 228120 221254
10670B21254Q641j54282j00574j7238L6294j4043j03967m2135P31N5889K1945
$$ 221254 229895 75613 -24961 -42199 -5905 -19948 -123915 -166050 -165319 -109430 -87485
10659h7485q82j394P8030J0088m8328p482J7240R844L2937L8900n5304k6944k9101
$$ -87485 -88367 -89761 -11731 -1643 -49971 -57453 -40213 -30369 2568 41468 -13836 -40780 -69881
10646f9881l2763J3174O8701l3586k9427n6120L6552k1604J9456N8900K8101j45525
$$ -69881 -102644 -89470 -20769 -54355 -83782 -139902 -103350 -124954 -105498 -46598 -18497 -164022
10634a64022k8655R4140l782q3023M6579J54760M519l9268q5949O4298P1364l6929
$$ -164022 -192677 -98537 -102319 -185342 -138763 15997 20516 -18752 -104701 -40403 30961 -5968
10622e968k5806k4008k1563K5024P049m1262J28035k5195j2615j0979l0411p9708
$$ -5968 -31774 -55782 -77345 -52321 -45272 -86534 41501 16306 3691 -7288 -37699 -117407
10610a17407q2303Q8321M9443J4732M5239M5197k9374N692P2781M087r346r0555
$$ -117407 -199710 -111389 -61946 -47214 -1975 43222 13848 19540 92321 96408 87062 -3493
10598c493o8996n6850R4765J16283P66k199O4806N1300l2229m6113K978N565j2829
$$ -3493 -72489 -129339 -34574 81709 82475 80276 145082 196382 164153 118040 121018 126583 113754
10585A13754p4240l2542J23644K2738J4705j00348k4990K6151j308L8442O0169
$$ 113754 39514 6972 130616 153354 168059 67711 42721 68872 67564 106006 166175
10574A66175N0089j363P5743Q6897l7602J8666J00005P0592j20482q5698n9276
$$ 166175 216264 214901 290644 377541 339939 358605 458610 529202 408720 323022 263746
10563B63746J2899P4303O5416K4449J6131j23929j06935J6111l9420n7803j24581
$$ 263746 276645 350948 416364 440813 456944 333015 226080 242191 202771 144968 20387
10552B0387J1999k0060o924p828N6735j01728n8436R3526R414j9471M1096l9010
$$ 20387 32386 12326 5402 -2426 54309 -47419 -105855 -12329 -2915 -22386 18710 -20300
10540b0300L2967N884J07528J2275r7199o7455K8464J23803k8951L0103L6427
$$ -20300 12667 18551 126079 138354 41155 -26300 2164 125967 97016 127119 163546
10529A63546j3467m4683K8553M6328L8230R0031L671j38149j16975M0155O2501
$$ 163546 150079 105396 133949 180277 218507 308538 312209 174060 57085 97240 159741
10518A59741k3819M3063J9737M6088J3033j02165M3959J6046p7219L9421J5445
$$ 159741 135922 178985 198722 244810 257843 155678 199637 215683 138464 177885 193330
10507A93330q2083L071K0183N6064K8498k2616r0722j2426J6310p5497M4516q2041
$$ 193330 111247 114318 134501 190565 219063 196447 105725 93299 109609 34112 78628 -3413
10495c413L3605J6335k1033k1354L1833N9654q1432k4962O4318n6638J9309J12682
$$ -3413 30192 46527 25494 4140 35973 95627 14195 -10767 53551 -3087 16222 128904
10483A28904J2947k8639o5503m9385M0889L980J589j8416p6618K3333K887J2884
$$ 128904 141851 113212 47709 -1676 39213 43193 44782 26366 -50252 -26919 -24032 -11148
10471a1148q4850J8265M0747m9568M7884N3249L8438o6366o9481j4763L8566J34341
$$ -11148 -95998 -77733 -36986 -86554 -38670 14579 53017 -13349 -82830 -97593 -59027 75314
10459G5314O3798Q2652M4444R5547O866n4273Q12p6570n5926J1854p0643p4830
$$ 75314 139112 221764 266208 361755 368621 314348 315160 238590 182664 194518 123875 49045
10447D9045N1475m5052m2337p8568k2367L3782J04016K5469j16847K8296M5483
$$ 49045 100520 55468 13131 -65437 -87804 -54022 49994 75463 -41384 -13088 32395
10436C2395m0006J8006J07388L3079l915n4796j5563P8047P4677r1839j80173
$$ 32395 -7611 10395 117783 150862 146947 92151 76588 154635 229312 137473 -42700
10425d2700n4110J1269Q9754m4377n80J8694Q1394K2082o8046j6933j5700l1146
$$ -42700 -96810 -85541 4213 -40164 -40744 -22050 59344 81426 13380 -3553 -19253 -50399
10413e0399m7929J488J03482j4344p8031r5341J01025K05748M3970L7725N5955
$$ -50399 -98328 -96840 6642 -7702 -85733 -181074 -80049 125699 169669 207394 263349
10402B63349m3272n3666K9408l6939K3611j4893n0088K0360j5356q1535J0021
$$ 263349 220077 166411 195819 158880 182491 167598 117510 137870 122514 40979 51000
10391E1000k8579m3213K9027m3741L6368q48L7049M1667Q0628j8832n9320m6461
$$ 51000 22421 -20792 8235 -35506 862 14 37063 78730 159358 140526 81206 34745
10379C4745k9375j06196p6230R8847J14082q2434r0716m3650k5537J0225R5783
$$ 34745 5370 -100826 -177056 -78209 35873 -46561 -137277 -180927 -206464 -196239 -100456
10368a00456N7901K5626o1009N7878O9318j20907q3554M8764J58710N2260N0207
$$ -100456 -42555 -16929 -77938 -20060 49258 -71649 -155203 -106439 52271 104531 154738
10357A54738m0241p4510K2714n5748j6574P8553K0056n3248j25506K8762O8083
$$ 154738 114497 39987 62701 6953 -9621 68932 88988 35740 -89766 -61004 7079
10346G079O1934j41029j29106P4072J9585k9744n5618K2062M6451n5538m541J8898
$$ 7079 69013 -72016 -201122 -127050 -107465 -137209 -192827 -170765 -124314 -179852 -184393 -165495
10334a65495L0850N3744k7314K8891P9388p9203j0919J07804J345Q609L9582K1466
$$ -165495 -134645 -80901 -108215 -79324 64 -79139 -90058 17746 19091 27700 67282 88748
10322H8748l3142K9833l2609r5847m7620k063N3129J38615n8239K3218J3560j80170
$$ 88748 55606 85439 52830 -43017 -90637 -92700 -39571 99044 40805 64023 77583 -102587
10310a02587r0490L4078J48659J25616m244l6825k6793N916K9531j3631P4950
$$ -102587 -193077 -158999 -10340 115276 111032 74207 47414 53330 82861 69230 144180
10299A44180Q243J4726o0257l6365o4285J4871J31872O3959Q9974M3334l5565
$$ 144180 152423 167149 106892 70527 6242 21113 152985 216944 306918 350252 314687
10288C14687k50l3746J6221J4523j0239j4949Q2718R9999J06618K57428O403q6979
$$ 314687 314437 280691 296912 311435 301196 286247 368965 468964 575582 833010 839413 752434
10276G52434j14710j15353q3809r6979o5356r2857p2171M9848N0006R8542p3740
$$ 752434 637724 522371 438562 341583 276227 183370 111199 161047 211053 309595 235855
10265B35855j36274k3521k156L0483O9848N4923n8019n9874j7125k5594o5351
$$ 235855 99581 76060 73904 104387 174235 229158 171139 111265 94140 68546 3195
10254C195R3647n3350K2863J18454L7261O0958J20233J02920J42867J14458p7766
$$ 3195 96842 43492 66355 184809 222070 283028 403261 506181 649048 763506 685740
10243F85740n6488q3743m8454j30288j87670j01007N6497P5182P3979L0938m8154
$$ 685740 629252 545509 497055 366767 179097 78090 134587 209769 283748 314686 266532
10232B66532j8056J40108J34088R9945j4545o403j4510m1570j00715p5121J12595
$$ 266532 248476 388584 522672 622617 608072 601669 587159 545589 444874 369753 482348
10221D82348K776j85178M164K955k08162m3000L8534k1110j9472O4455N9705l8148
$$ 482348 485124 299946 304110 307065 98903 55903 94437 73327 53855 118310 178015 139867
10209A39867j07091m8651r0164L8956J54678M7371j64904j1681J53467J09244
$$ 139867 32776 -15875 -106039 -67083 87595 134966 -29938 -41619 111848 221092
10199B21092K3369j2545Q6664K5255J07131R4872R2629O3233J09094k9131j05693
$$ 221092 244461 231916 318580 343835 450966 545838 638467 701700 810794 781663 675970
10188F75970j06978j17586j47954q3625l7370l2424j21325n3323J43561J55061
$$ 675970 568992 451406 303452 219827 182457 150033 28708 -24615 118946 274007
10178B74007m4672k1009o6475m0118p8878R082p4620P13N8660Q9812N1506p7750
$$ 274007 229335 208326 141851 101733 22855 31937 -42683 -41970 16690 106502 158008 80258
10166H0258l9193j0482p8441N4164N6038j92797o4806r383Q5565J23485K4048
$$ 80258 41065 30583 -47858 6306 62344 -130453 -195259 -204642 -119077 4408 28456
10155B8456l8046J4443J4320q3297K5479L5207n4616o8133o6046J4479L1348Q196
$$ 28456 -9590 4853 19173 -64124 -38645 -3438 -58054 -126187 -192233 -177754 -146406 -138210
10143a38210P5714P2810q29p9n3123p3524O7823p5334L2068P9675m4594Q4074
$$ -138210 -62496 10314 9485 9406 -43717 -117241 -49418 -124752 -92684 -13009 -57603 26471
10131B6471J0404k7591o2550j6007P4201j0172N3500k6233m7614R8015L8032k3759
$$ 26471 36875 9284 -53266 -69273 4928 -5244 48256 22023 -25591 72424 110456 86697
10119H6697M7026r416n5606p6229O8749J796m0025j09108J6878P9762J04144R547
$$ 86697 133723 124307 68701 -7528 61221 63017 22992 -86116 -69238 10524 114668 124215
10107A24215o18k709L2514J4756P5209j6003K4659j00436j33700p567p9669j19319
$$ 124215 123597 120888 153402 168158 243367 227364 252023 151587 17887 10320 -69349 -188668
10095a88668K9296Q2900r841L0339l0243o1581L4523K3483k5879m2236q2873k2816
$$ -188668 -159372 -76472 -86313 -55974 -86217 -147798 -113275 -89792 -115671 -157907 -240780 -263596
10083b63596J87555R3392N0210l2211o8321N2753O6947j2967j11032r5946M3980
$$ -263596 -76041 17351 67561 35350 -32971 19782 86729 73762 -37270 -133216 -89236
10072h9236J02283P899j13760P3027q858O8567m1076l0802J2707J1021J9288o6831
$$ -89236 13047 20946 -92814 -19787 -28645 39922 -1154 -31956 -19249 -8228 11060 -55771
10060e5771q1068J4363P1838O0581l3363o7061J4111k6171L0561J05419P4241
$$ -55771 -136839 -122476 -50638 9943 -23420 -90481 -76370 -102541 -71980 33439 107680
10049A07680O8689n6785j8754J39924O7445J67645L61183P21064J184963K87160
$$ 107680 176369 119584 100830 240754 308199 475844 837027 1558091 2743054 3030214
10039C030214j232713r02346l52122j58978p6487o6212p0442j36042n5724k094
$$ 3030214 1797501 895155 543033 384055 307568 241356 170914 34872 -20852 -22946
10029b2946J38701Q813m6403L6914m8845n292K8196o4752k0610k238M0783L8664
$$ -22946 115755 124568 78165 115079 66234 60942 89138 24386 3776 1538 42321 80985
10017H0985P604J6482M8553K6657o5032l5935J3140l1911j44768j18665J01342
$$ 80985 88589 105071 153624 180281 115249 79314 92454 60543 -84225 -202890 -101548
10006a01548Q5265K3292j11110R3926M5047j12585J03933l2991q0665O3165L9441
$$ -101548 -16283 7009 -104101 -10175 34872 -77713 26220 -6771 -87436 -24271 15170
9995A5170o9860O329o17P8174R985j9663p8565r811K2518Q1355l2375j7636J34697
$$ 15170 -54690 -48361 -48978 29196 39181 19518 -59047 -68858 -46340 35015 2640 -14996 119701
9982A19701Q9483j73434j06046j3220J51448l5859p6271n2526k72K2221j0457
$$ 119701 209184 35750 -70296 -83516 67932 32073 -44198 -96724 -96996 -74775 -85232
9971h5232k7290O2814m1593r5000Q0224N501K3677j07227q2720P2399L0477J10562
$$ -85232 -112522 -49708 -91301 -186301 -106077 -100576 -76899 -184126 -266846 -194447 -163970 -53408
9959e3408Q1192j4279K1734Q7939K4453k2682K431n3898r0034q8101J45154M8434
$$ -53408 27784 13505 35239 123178 147631 124949 127380 73482 -16552 -104653 40501 88935
9947H8935k2475m8489k7240l7187K0602Q4430P4495k8905N6739R5158L9800k5239
$$ 88935 66460 17971 -9269 -46456 -25854 58576 133071 104166 160905 256063 295863 270624
9935B70624K4348j4236l8719q9103k7548p0831M2871J70719K3000K1404m2184
$$ 270624 294972 280736 242017 152914 125366 54535 97406 268125 291125 312529 270345
9924B70345j38187q1952O6817M3744K5017r5097o8843M9646J5910j5264k358n2723
$$ 270345 132158 50206 117023 160767 185784 90687 21844 71490 87400 72136 69778 17055
9912A7055K5646O957L9616J03394k5431j1496O8551M672J0299m6705M7329q3713
$$ 17055 42701 49658 89274 192668 167237 155741 224292 228964 239263 192558 239887 156174
9900A56174o6679j01694k1465O7233m8693L4185l8337m9129N9248L5762o6418
$$ 156174 89495 -12199 -33664 33569 -15124 19061 -19276 -68405 -9157 26605 -39813
9889c9813L7076J46198P8917q6894k6021q6835l5554K9900l4457K4566J6330l6174
$$ -39813 -2737 143461 222378 135484 109463 22628 -12926 16974 -17483 7083 23413 -12761
9877a2761M7788K5175m8514k9334L121K4815L7964j33266k3602N8857p0653M0919
$$ -12761 35027 60202 11688 -17646 -14525 10290 48254 -85012 -108614 -49757 -120410 -79491
9865g9491J3327n1189K8794M2194J45348N2017J4265n5180p0366M9919O7139R2742
$$ -79491 -66164 -117353 -88559 -46365 98983 151000 165265 110085 39719 89638 156777 249519
9853B49519K7963M512J23920R1425J00923j8378q9923J51541K50490L94118P18592
$$ 249519 277482 281994 405914 497339 598262 579884 489961 641502 891992 1286110 2004702
9842B004702J368329K204366K032329L3839k035502k278963j383409p73821l23930
$$ 2004702 3373031 5577397 7609726 7643565 5608063 3329100 1945691 1171870 847940
9833H47940k89720r3728R211j42930j76025j00671N6646k9370J3346q2397P3972
$$ 847940 558220 464492 473703 330773 154748 54077 110723 81353 94699 12302 86274
9822H6274R8507n4834j3578K4707O6937L0858m0204k5405q2848K4116M5072J12904
$$ 86274 184781 129947 116369 141076 208013 238871 198667 173262 90414 114530 159602 272506
9810B72506J26157M8899q1415n1229q3347J12517l5554l9483l4511M526j11288
$$ 272506 398663 447562 366147 314918 231571 344088 308534 269051 234540 239066 127778
9799A27778p0527K7128M6737m5347o0961L7369J4966m3191n3160O4956L6737j4336
$$ 127778 57251 84379 131116 85769 24808 62177 77143 33952 -19208 45748 82485 68149
9787F8149L0268N3747L180O254n5925m1685M0534Q6736L8203O1670m3236k298
$$ 68149 98417 152164 155344 161598 105673 63988 104522 191258 229461 291131 247895 245597
9775B45597N1795M3701N9736N2395M6881o274m4898m969k200o121J5479q8525
$$ 245597 297392 341093 400829 453224 500105 493831 448933 443964 441764 435643 451122 362597
9763C62597j6100j2102L6340q7877p0155j308P2208M05K8458p1335m095r8811
$$ 362597 346497 334395 370735 282858 212703 211395 283603 284008 312466 241131 237036 138225
9751A38225N9512k9392o8951l6815j4023J05099N8261k2055q5492k4455J5019
$$ 138225 197737 168345 99394 62579 48556 153655 211916 189861 104369 79914 94933
9740I4933Q7433N9816m4197J0139Q2952K6891K9230J6776O1277n400M1022q3064
$$ 94933 182366 242182 197985 208124 291076 317967 347197 363973 425250 419850 460872 377808
9728C77808k48254j8509n9426Q8893J01824o4981o4047N1056M6431n0351j10568
$$ 377808 129554 111045 51619 140512 242336 177355 113308 164364 210795 160444 49876
9717D9876M3831M4930j7772o8009o0888k6753m6547k4165J9293l5124k9807J88449
$$ 49876 93707 138637 120865 52856 -8032 -34785 -81332 -105497 -86204 -121328 -151135 37314
9705C7314J79682j0530r7467m1386p6496k7447N873r2439k9601J75674M4722J9472
$$ 37314 216996 206466 108999 67613 -8883 -36330 -30457 -122896 -152497 23177 67899 87371
9693H7371M8576r45q7976q2467p9103M0474m0327R9415L8066j21374O6528M8204
$$ 87371 135947 135002 47026 -35441 -114544 -74070 -114397 -14982 23084 -98290 -31762 16442
9681A6442k9510R4030o9915n835N9806o0896j49281O8342J13503k9598j02666
$$ 16442 -13068 80962 11047 5212 65018 4122 -145159 -76817 36686 7088 -95578
9670i5578k8368N3305P115j05278j5444J09230R1298M3106L0088L4141j0213q6272
$$ -95578 -123946 -70641 -63526 -168804 -184248 -75018 16280 59386 89474 123615 113402 27130
9658B7130m8811q8626P6555K9972M2433J2187Q6084l1157J3278N8376j32099o0749
$$ 27130 -21681 -110307 -33752 -3780 38653 50840 136924 105767 119045 177421 45322 -15427
9646a5427j73785m960P7578j8671J3450J0127k429O8530J31689Q8258J8162j89457
$$ -15427 -189212 -194172 -116594 -135265 -121815 -111688 -114117 -45587 86102 174360 192522 3065
9634C065l0690L9527O1316Q8562j4460p3547j4440P501J1944n0620M1485o1506
$$ 3065 -27625 11902 73218 161780 147320 73773 59333 66834 78778 28158 69643 8137
9622H137M0762j0119r0278L1000M1975O4247Q196r9586k4800m140m2562M7016
$$ 8137 48899 38780 -51498 -20498 21477 85724 93920 -5666 -30466 -34606 -77168 -30152
9610c0152n9912K6110P30L4856O8264q116j16801o8929M2326J15362J47494O6309
$$ -30152 -90064 -63954 -63224 -28368 39896 31780 -85021 -153950 -111624 3738 151232 217541
9598B17541r0685j23360o1185L3811R2230M1237p9977p4119l5213j0351O3712
$$ 217541 126856 3496 -57689 -23878 68352 109589 29612 -44507 -79720 -90071 -26359
9587b6359K3329n5976K9829j5543j5287K4980O407L4388j7931J7417J1019j07967
$$ -26359 -3030 -59006 -29177 -44720 -60007 -35027 -28620 5768 -12163 5254 16273 -91694
9575i1694K7647J89610M8025n5220m274n091l6007K1455p1394n2883m1404K9982
$$ -91694 -64047 125563 173588 118368 114094 109003 72996 94451 23057 -29826 -71230 -41248
9563d1248N011J11430P513q9783l4685l5242M6295L8319Q2090p5156q4018Q7863
$$ -41248 -36237 75193 82706 -7077 -41762 -77004 -30709 7610 89700 14544 -69474 18389
9551A8389O9543O2429O1714M4135R65N3091j291r4956j3882k2969j5812M3492
$$ 18389 87932 150361 212075 256210 257175 310266 308975 214019 200137 177168 161356 204848
9539B04848L0381n8935m3764N7959J41958J76776j5115j18166r9765j23101p4133
$$ 204848 235229 176294 132530 190489 332447 509223 494108 375942 276177 153076 78943
9528G8943J02214K9451l2527m5508J1421J13006J502q0530J6686n8687p9143M9261
$$ 78943 181157 210608 178081 132573 143994 257000 258502 177972 194658 135971 56828 106089
9516A06089R3466j31736m8975J3942l9236N4338N9167N451n9250j30426j30875
$$ 106089 199555 67819 18844 32786 -6450 47888 107055 112506 53256 -77170 -208045
9505b08045P7386k990j9979K5249N3521Q9454J1129m8516L4559k1306l0914Q2350
$$ -208045 -130659 -133649 -153628 -128379 -74858 14596 25725 -22791 11768 -9538 -40452 41898
9493D1898J17986N8884q3247o6204o561o4626m1627O0752O4513o7464L0850K6823
$$ 41898 159884 218768 135521 69317 62756 -1870 -43497 17255 81768 14304 45154 71977
9481G1977k0201J13332m6093j49229l664j880o8627P5553P1885L1541N6892M2744
$$ 71977 51776 165108 119015 -30214 -33878 -35758 -104385 -28832 43053 74594 131486 174230
9469A74230j51275q7476l0430n1581O3874O2933K6858J7695J8469K8196q42j4552
$$ 174230 22955 -64521 -94951 -146532 -82658 -19725 7133 24828 43297 71493 70651 56099
9457E6099J9107J0814m8353j07717o2078Q7230j018n0365M9043R278n357K3338
$$ 56099 75206 86020 37667 -70050 -132128 -44898 -45916 -96281 -47238 -37960 -43317 -19979
9445a9979K3573J07035K023q1888l5110J9351O7643M4307K6187l6632o6904L354
$$ -19979 3594 110629 112652 30764 -4346 15005 82648 126955 153142 116510 49606 52960
9433E2960J7310N5231j2059P609J3133M1841j53011p6652L7493o8088J2994N1964
$$ 52960 70270 125501 113442 121051 134184 176025 23014 -53638 -16145 -84233 -71239 -19275
9421a9275K7474m202P5950j13282q8489L1163J23518M8033L3980j4611r396j09144
$$ -19275 8199 3997 79947 -33335 -121824 -90661 32857 80890 114870 100259 90863 -18281
9409a8281l9281j7683o9693l7812P7084R3934J9099k6292r3673K3796J26517N1111
$$ -18281 -57562 -75245 -144938 -182750 -105666 -11732 7367 -18925 -112598 -88802 37715 88826
9397H8826l2281L7260L6945m4794m9279o9270P753K1677q163l8402Q4726J47384
$$ 88826 56545 93805 130750 85956 36677 -32593 -24840 -3163 -11326 -49728 34998 182382
9385A82382j25757j14458K127K5224l9983l3725J7504L9619N4507K1931p9517
$$ 182382 56625 -57833 -55706 -30482 -70465 -104190 -86686 -47067 7440 29371 -50146
9374e0146o83K6132N8450O5662J820j3060M5798K5975m4184K9112M7074M3379
$$ -50146 -50829 -24697 33753 99415 101235 88175 133973 159948 115764 144876 191950 235329
9362B35329L7011j6937j11968k5297l1074j54714k3094O7882L8785p9140M4961
$$ 235329 272340 255403 143435 118138 87064 -67650 -90744 -22862 15923 -63217 -18256
9351a8256N1390J41615M1545r331R84n8345j11622k2001l4248L4795J26236k6129
$$ -18256 33134 174749 216294 206963 207947 149602 37980 15979 -18269 16526 142762 116633
9339A16633J2736m3535K7001j7313N8623j17804j11107O6234L5868M5149P0430
$$ 116633 129369 85834 112835 95522 154145 36341 -74766 -8532 27336 72485 142915
9328A42915M8607J5521M2236m4367n8860p4723M6225O6862L2301m0755P6466J15213
$$ 142915 191522 207043 249279 204912 146052 71329 117554 184416 216717 175962 252428 367641
9316C67641j27437r3993K06729N9406l7571N0499Q9681P9581K9041j11380j19065
$$ 367641 240204 146211 352940 412346 374775 425274 514955 594536 623577 512197 393132
9305C93132J6941J4646L9070K6500j00575N4526l4181j17972R757l5555J1552
$$ 393132 410073 424719 463789 490289 389714 444240 410059 292087 301844 266289 277841
9294B77841J06553K2396j4934j9419J0134K4665j08578l5780K13058P9311j20174
$$ 277841 384394 406790 391856 372437 382571 407236 298658 262878 475936 555247 435073
9283D35073k0185J23270P9360j814L1980O0423m0959p6007o9341L1068J51141
$$ 435073 414888 538158 617518 615704 647684 708107 667148 591141 521800 552868 704009
9272G04009J9789p7045N7064R207N5224J0554j13419P7532K42337J52577p0326
$$ 704009 723798 646753 703817 713024 768248 778802 665383 742915 985252 1137829 1067503
9261A067503j5209j06444j41529j20366j26265m8471o3480R5769O9292K8484n2372
$$ 1067503 1052294 945850 804321 683955 557690 509219 445739 541508 610800 639284 586912
9250E86912J284J10335J16637J29260R8372k1684p2608l9989J36103O1250P9816
$$ 586912 588196 698531 815168 944428 1042800 1021116 948508 908519 1044622 1105872 1185688
9239A185688R8164M3191L9758K3579K0594k3838J7261M6469m1848l8076K6646
$$ 1185688 1283852 1327043 1366801 1390380 1410974 1387136 1404397 1450866 1409018 1370942 1397588
9228A397588O2851N5411J20591M0819O1968J62229P6306K05357J63210N0495M2131
$$ 1397588 1460439 1515850 1636441 1677260 1739228 1901457 1977763 2183120 2346330 2396825 2438956
9217B438956J25032J24466K27806K31866J83461K50254L09704M34197M16425L37252
$$ 2438956 2563988 2688454 2916260 3148126 3331587 3581841 3891545 4325742 4742167 5079419
9207E079419L07654N65701O12762P58182Q78156R44302R84991J195606J569782
$$ 5079419 5387073 5952774 6565536 7323718 8201874 9146176 10131167 11326773 12896555
9198A2896555J843367J990285K078005K218164K259735K120992J978503J405466
$$ 12896555 14739922 16730207 18808212 21026376 23286111 25407103 27385606 28791072
9190B8791072O64987p3750q63355j524940j913818k188478k278686k192862j968014
$$ 28791072 29456059 29382309 28518954 26994014 25080196 22891718 20613032 18420170 16452156
9181A6452156j929188j586935j318294j274550j015223q45468q08464p34851o63938
$$ 16452156 14522968 12936033 11617739 10343189 9327966 8482498 7674034 6939183 6275245
9172F275245o06427m90328m92017l39486l11882k71220k53779k80852l05531j93261
$$ 6275245 5668818 5178490 4686473 4346987 4035105 3763885 3510106 3229254 2923723 2730462
9162B730462l00793k22719j08948j76553p0401j15992n6305n9532k1479l5414
$$ 2730462 2429669 2206950 2098002 1921449 1851048 1735056 1678751 1619219 1597740 1562326
9152A562326k24238j77318l9813O7746k6382K3497n0976m6443J0075l6413o9776
$$ 1562326 1338088 1160770 1120957 1188703 1162321 1185818 1134842 1088399 1098474 1062061 992285
9141I92285J3830L463p5145j62657p0530M04l6598n7719r2345k7531N7615M6360
$$ 992285 1006115 1009578 934433 771776 701246 701650 665052 607333 514988 487457 545072 591432
9129E91432q7592o2997k3518J4583k2204j676Q5930M1556L8999m2310p7439J2207
$$ 591432 503840 440843 417325 431908 409704 408028 493958 535514 574513 532203 454764 466971
9117D66971j03273m8373M5110m3448n1334M3712M0097n8115j23485M1431R5216
$$ 466971 363698 315325 360435 316987 265653 309365 349462 291347 167862 209293 304509
9106C04509Q3296m2002m1483k9466j31300j10650n7658Q9150J09168Q3572m4874
$$ 304509 387805 345803 304320 274854 143554 32904 -24754 64396 173564 257136 212262
9095B12262p9037j1916o3889J0033J20887M6155L1532Q323p3196n0110J3589j4128
$$ 212262 133225 121309 57420 67453 188340 234495 266027 274350 201154 151044 164633 150505
9083A50505p8291j14754N1625J18137K068P5954L3527L9556L0143r4055l7974
$$ 150505 72214 -42540 9085 127222 129290 205244 238771 278327 308470 214415 176441
9072A76441J8648q9664R3671p258m7731J1442K2999M9080O5539P156K418r4468
$$ 176441 195089 105425 199096 191838 144107 155549 178548 227628 293167 300323 302741 208273
9060B08273l4569R30p468j749m6180n245J2765J0690O0439J24340j24187q5543
$$ 208273 173704 174634 167166 165417 119237 113992 126757 137447 197886 322226 198039 112496
9048A12496M4876M6934O4797R195j25514l0303K870l6209k688l3126L1272J7706
$$ 112496 157372 204306 269103 278298 152784 122481 125351 89142 86454 53328 84600 102306
9036A02306n8724l334Q629m4660K6620J7653q358O1305l5837j8364N9638j6916
$$ 102306 43582 40248 48877 4217 30837 48490 40132 101437 65600 47236 106874 89958
9024H9958q6801J3076k6771q1796O4127J62248j7499p0502r760P3936k6408R453
$$ 89958 3157 16233 -10538 -92334 -28207 134041 116542 46040 36280 110216 83808 93261
9012I3261Q8600n5960j35139j08685Q1279R5078n6678o4164O8801R8996J21320
$$ 93261 181861 125901 -9238 -117923 -36644 58434 1756 -62408 6393 105389 226709
9001B26709q6195j8521O2456l3759K1315l9174m3796k8283j11070p6831k456l564
$$ 226709 140514 121993 184449 150690 172005 132831 89035 60752 -50318 -127149 -129605 -133169
8989a33169q2872K6732O7794P1515L609m8842J4330n9725o6357J33886J52257
$$ -133169 -216041 -189309 -121515 -50000 -46391 -95233 -80903 -140628 -206985 -73099 79158
8978G9158n9392n2958M4843j1693R8283J36981r7191j46839m9885k3546J5119
$$ 79158 19766 -33192 11651 -42 98241 235222 138031 -8808 -58693 -82239 -67120
8967f7120k136l0154k6281J40989K866J10911j3233L0681o4696r0198M0866m0246
$$ -67120 -69256 -99410 -125691 15298 18164 129075 115842 146523 81827 -8371 32495 -7751
8955g751j08926n4981R7801J7781K2393J7756K7282O7159L6007K9985j5979P4565
$$ -7751 -116677 -171658 -73857 -56076 -33683 -15927 11355 78514 114521 144506 128527 203092
8943B03092r0991j36973j00813J41752M0954o2011m2169m402K245J22830Q124
$$ 203092 112101 -24872 -125685 16067 57021 -4990 -47159 -51561 -49316 73514 81638
8932H1638j63822j34681K6639J7569Q3580P6144M6096N1708r3375K6756J5447
$$ 81638 -82184 -216865 -190226 -172657 -89077 -12933 33163 84871 -8504 18252 33699
8921C3699l9755j6166K8897N8091j48720j24750j3328J2334M2656O9772J02030
$$ 33699 -6056 -22222 6675 64766 -83954 -208704 -222032 -209698 -167042 -97270 4760
8910D760L3233K4368j45765j8789k8368k1196O0105O5702k0131j42093o9700R0017
$$ 4760 37993 62361 -83404 -102193 -130561 -151757 -91652 -25950 -46081 -188174 -257874 -167857
8898a67857J79798k6305L2285L3094l3452q0057j5935m421j4777l2435Q7040N2427
$$ -167857 11941 -14364 17921 51015 17563 -62494 -78429 -82850 -97627 -130062 -43022 9405
8886I405p6416p273J187j609O0831R9239Q0726j9931J8376L4538J2840j14016
$$ 9405 -67011 -74284 -73097 -74706 -13875 85364 166090 146159 164535 199073 211913 97897
8874I7897j02943l9121k8221q7840R353m437Q768N0826O4012Q1049L1309o9376
$$ 97897 -5046 -44167 -72388 -160228 -150875 -155312 -146544 -95718 -31706 49343 80652 11276
8862A1276L2374P980J1351j2975L937k6895m3294n7520o365o8724M0957l4239
$$ 11276 43650 51630 62981 50006 53943 27048 -16246 -73766 -80131 -148855 -107898 -142137
8850a42137m341P7172J7608k3185J5170l6804L3923J8178J0166p8926K6317L7060
$$ -142137 -146478 -69306 -51698 -74883 -59713 -96517 -62594 -44416 -34250 -113176 -86859 -49799
8838d9799J1292o2391K5455J2178j6831O5616m9073L8314Q3140j9043l442m9860
$$ -49799 -38507 -100898 -75443 -63265 -80096 -14480 -63553 -25239 57901 38858 35416 -14444
8826a4444l7323n5013M7920q415N3296m5057N9983L9954l9860L032n3392k6742
$$ -14444 -51767 -106780 -58860 -67275 -13979 -59036 947 40901 1041 4073 -49319 -76061
8814g6061M6051r293K2887L5268j5018J2684j1555j1432J3127m6163J6950J10718
$$ -76061 -30010 -39303 -16416 18852 3834 16518 4963 -6469 6658 -39505 -22555 88163
8802H8163J6165n4336J4738r9759j06147r679R4951J27800L2510k9645q0927o2108
$$ 88163 104328 49992 64730 -35029 -141176 -150855 -55904 71896 104406 74761 -6166 -68274
8790f8274o5909O9356P6326N1088k2486l2359k3397L3289P002j2759N4612o0658
$$ -68274 -134183 -64827 11499 62587 40101 7742 -15655 17634 24636 11877 66489 5831
8778E831j29071K1124L4127j352l6249k6903O9599N5652k0067K2342O6336L9927
$$ 5831 -123240 -102116 -67989 -69341 -105590 -132493 -62894 -7242 -27309 -4967 61369 101296
8766A01296o7101J4053k2157M7596M1490J6588m2815j10417L8391j227J2101Q2944
$$ 101296 34195 48248 26091 73687 115177 131765 88950 -21467 16924 15697 27798 110742
8754A10742k4155P3432k3168j18274P5910q7645L6823J69278q7985j68614m3236
$$ 110742 86587 160019 136851 18577 94487 6842 43665 212943 124958 -43656 -86892
8743h6892Q8714K243q336k8549j04877o1024J61999j0620l8322J15775J07507
$$ -86892 1822 4065 -4271 -32820 -137697 -198721 -36722 -47342 -85664 30111 137618
8732A37618O0649m5444p198J8097j21317j14679L8853L70k2228Q5800l5249M0824
$$ 137618 198267 152823 145625 163722 42405 -72274 -33421 -33051 -55279 30521 -4728 36096
8720C6096J35564j1041R7703R5281K4113j75650p0891k8846l5575P2175J1517
$$ 36096 171660 160619 258322 353603 377716 202066 131175 102329 66754 138929 150446
8709A50446m3058j7747P196l1890K3091P7l234M629p0897l4188m6463J3509J02996
$$ 150446 107388 89641 96837 64947 88038 88115 84881 89510 18613 -15575 -62038 -48529 54467
8696E4467K6639l7870m6447k2632k7571J4291K7969Q0132J34987j5465j25451
$$ 54467 81106 43236 -3211 -25843 -53414 -39123 -11154 68978 203965 188500 63049
8685F3049q6556P7977P1542j68519L8530Q6464M3715M0264P324Q180N1777Q9744
$$ 63049 -23507 54470 126012 -42507 -3977 82487 126202 166466 173790 181970 233747 323491
8673C23491j7029Q2765J29960j69735p8964K0994j25922o1378R8745O3763m9788
$$ 323491 306462 389227 519187 349452 270488 291482 165560 104182 202927 266690 216902
8662B16902j48711P3582N1477M6543R118q9983m6051j4083o4799j5492L3069R9031
$$ 216902 68191 141773 193250 239793 248911 158928 112877 98794 33995 18503 51572 150603
8650A50603K7333o172k9743R6144Q947j2627J18626J46235M25866N78630O88589
$$ 150603 177936 171764 142021 238165 247112 234485 353111 499346 925212 1503842 2192431
8639B192431K65462o64753n93744k67554j70903j76020j33401m6770J7158L7633
$$ 2192431 2457893 1793140 1199396 931842 760939 584919 451518 404748 421906 459539
8629D59539o5466p4932q6407J27407J71708j3954r4218N0122O2058O70j15690
$$ 459539 394073 319141 232734 360141 531849 517895 423677 473799 535857 536527 420837
8618D20837n9558O5868O9363o498k0234L2450k6811M3769J16490J02438j11263
$$ 420837 361279 427147 496510 490012 469778 502228 475417 519186 635676 738114 626851
8607F26851j13496l2119P9429N0427k7752J5198O8495J68054R5296J37607L65431
$$ 626851 513355 481236 560665 611092 583340 598538 667033 835087 930383 1067990 1433421
8596A433421Q44127J502190J072852j235574j394453p22788m67334l43399k411
$$ 1433421 2277548 3779738 4852590 3617016 2222563 1499775 1032441 689042 686631
8587F86631n3710k80531o9894J6138l5833m2904l1345j9019k9209j45991P3413
$$ 686631 632921 352390 282496 298634 262801 219897 188552 169533 140324 -5667 67746
8576F7746R0093J47566J14496j07991p6824l9223j51095M4679L7351j01464j6745
$$ 67746 157839 305405 419901 311910 235086 195863 44768 89447 126798 25334 8589
8565H589n942k8539K8559N8560L9534q7882R459O6242K2887K3062J60041J66853
$$ 8589 2647 -25892 2667 61227 100761 12879 22338 88580 111467 134529 294570 461423
8553D61423J63215O6881K41663N86955N71204l50715o28672m26772k08577j11728
$$ 461423 624638 691519 933182 1520137 2091341 1740626 1111954 685182 476605 364877
8543C64877o8424m4483p570J3136m1910j5924r5504n57M1847p9762O9288j3814
$$ 364877 296453 251970 244400 257536 215626 199702 104198 103641 145488 65726 135014 121200
8531A21200j03848m3148J67513J21178j34113j33965K1880J9576j3661p6315j5160
$$ 121200 17352 -25796 141717 262895 128782 -5183 16697 36273 22612 -53703 -68863
8520f8863M6796L4381j1947m1182N3806P0170j566k4136J8039j0628q4642l8226
$$ -68863 -22067 12314 367 -40815 12991 83161 81595 57459 75498 64870 -19772 -57998
8508e7998J20976p9240l531L8508j122J7605p0597j2676K2927j11929k981N2947
$$ -57998 62978 -16262 -19793 18715 17593 35198 -35399 -48075 -25148 -137077 -140058 -87111
8496h7111J8870J59968P4959j3375L6865J20863J11951N878J9654q3494r1915
$$ -87111 -68241 91727 166686 153311 190176 311039 422990 428868 448522 365028 273113
8485B73113q8482n8670N2660K5116K3954j01606j48431m6555K7377J308k7558
$$ 273113 184631 125961 178621 203737 227691 126085 -22346 -68901 -41524 -40216 -67774
8474f7774M464Q6866K1602m8926p9586M3926L7135k5414J4157R3984j3703j00805
$$ -67774 -63310 23556 45158 -3768 -83354 -39428 -2293 -27707 -13550 80434 66731 -34074
8462c4074j25528r6539J48775J91518J51764l3000o0687p1222j62433M1946P7057
$$ -34074 -159602 -256141 -107366 84152 235916 202916 142229 71007 -91426 -49480 27577
8451B7577M2486L5322J24819J35322K05959J78146J67720k647j14605j32480k48961
$$ 27577 70063 105385 230204 365526 571485 749631 917351 914704 800099 667619 418658
8440D18658j84626n1712O2732P7977Q211j0603K9679q2315p3662j4515P2454k3987
$$ 418658 234032 182320 245052 323029 331240 320637 350316 268001 194339 179824 252278 228291
8428B28291k6273l1515o2970o3090o1188m0528N1987J08282k1621j47137q4567
$$ 228291 202018 170503 107533 44443 -16745 -57273 -5286 102996 81375 -65762 -150329
8417a50329J07645J18108k6127M9244K5372m3179n8966P0381M8916K3076M6915
$$ -150329 -42684 75424 49297 98541 123913 80734 21768 92149 141065 164141 211056
8406B11056j12501M3482Q8164K2267M9441J22088J894l2962K1271j47472r6591
$$ 211056 98555 142037 230201 252468 301909 423997 425891 392929 414200 266728 170137
8395A70137k5323K3915J6041l5044j41684l9072J9683j5068J9531J752L0354J1704
$$ 170137 144814 168729 184770 149726 8042 -31030 -11347 -26415 -6884 -5132 25222 36926
8383C6926P5438j39744l8027J1190M8756K6339M0880R8504j11237n7499L3972
$$ 36926 112364 -27380 -65407 -54217 -5461 20878 61758 160262 49025 -8474 25498
8372B5498j5205P250Q2625O3499o4726j10154j35075K4172R5477J08868J6982
$$ 25498 10293 17543 100168 163667 98941 -11213 -146288 -122116 -26639 82229 99211
8361I9211m591Q1190j16567r6819q781L4381P2483m4846L7849J02292q683n5549
$$ 99211 94620 175810 59243 -37576 -46357 -11976 60507 15661 53510 155802 147119 91570
8349I1570m3561J7036K4242K478k7863P5363K5932k0806p2441r1252O8117N4240
$$ 91570 48009 65045 89287 91765 63902 139265 165197 144391 71950 -19302 48815 103055
8337A03055p5890N33n9352K4388J29132L9788j17201q6301q6619m0637J54609
$$ 103055 27165 27698 -31654 -7266 121866 161654 44453 -41848 -128467 -169104 -14495
8326a4495J19522n8779j2833L7331m0187p6618K6332M6000R4192Q996L4027l6980
$$ -14495 105027 46248 33415 70746 30559 -46059 -19727 26273 120465 129461 163488 126508
8314A26508p9143q431R5988l0869j28502J9120J13742k1085q0402M9091J15659
$$ 126508 47365 38934 134922 104053 -24449 -5329 108413 87328 6926 56017 171676
8303A71676L7126N7991N7112j047r4361l8669o0949o3529R4047J32289j03305
$$ 171676 208802 266793 323905 322858 228497 189828 128879 65350 159397 291686 188381
8292A88381j16720Q4446J6080j33903m1416j8808J8629L7242R3149j15029j07245
$$ 188381 71661 156107 172187 38284 -3132 -21940 -3311 33931 127080 12051 -95194
8281i5194l527N4804m888J4771N7504K9969j9795l2592J11290K6181r6402m9399
$$ -95194 -98721 -43917 -48805 -34034 23470 53439 33644 1052 112342 138523 42121 -7278
8269g278O4075J2523k567j06237N4724O4051q9672j01748p4630o0915O5123L00
$$ -7278 56797 69320 66753 -39484 15240 79291 -10381 -112129 -186759 -247674 -182551 -182251
8257a82251k2522J1567L2039Q8273k2604j6556J03524j4202r1301M0742J17192
$$ -182251 -204773 -193206 -161167 -72894 -95498 -112054 -8530 -22732 -114033 -73291 43901
8246D3901M2085K5376j9834r159j8258q8612K5077n2803j08815K4597M8948j3920
$$ 43901 85986 111362 91528 82369 64111 -24501 576 -52227 -161042 -136445 -87497 -101417
8234a01417Q6847N1206L3909j34251j43960P6353O7004q9544J02945M7398K9565
$$ -101417 -14570 36636 70545 -63706 -207666 -131313 -64309 -153853 -50908 -3510 26055
8223B6055K6895o9889n8562K654J21313L1738j90659j6776Q0737m1894o371J0173
$$ 26055 52950 -16939 -75501 -72847 48466 80204 -110455 -127231 -46494 -88388 -94759 -84586
8211h4586R3863K3379K3125k1878j13533J3400l7952K8764p9136P1226M8541L93
$$ -84586 9277 32656 55781 33903 -79630 -66230 -104182 -75418 -154554 -83328 -34787 -34394
8199c4394Q729J3420M7373M1909M9870j6842m866k8189n8781L8574J5888J9275
$$ -34394 -25665 -12245 35128 77037 126907 110065 105199 77010 18229 56803 72691 91966
8187I1966k0398m1149n2923J03716O5739J2358L5967j63097j35191p4816M2784
$$ 91966 71568 30419 -22504 81212 146951 159309 195276 32179 -103012 -177828 -135044
8176a35044R1652q0042n1872R1248M3521r0813J5600Q3892m2704q006J8862O1890
$$ -135044 -43392 -123434 -175306 -84058 -40537 -131350 -115750 -31858 -74562 -82568 -63706 -1816
8164a816J5801J8515M1042L5193o6435j70479j01696Q5208Q7467N9152k4188J866
$$ -1816 13985 32500 73542 108735 42300 -128179 -229875 -144667 -57200 1952 -22236 -20370
8152b0370P7906J02656p6978j09529l1396K9707k2816k6949l3247J9495J8674
$$ -20370 57536 160192 83214 -26315 -57711 -28004 -50820 -77769 -111016 -91521 -72847
8141g2847P6327r69K4104j8307q4406o5790M0066o078k1530J2742l841O5772R3433
$$ -72847 3480 2511 26615 8308 -76098 -141888 -101822 -107900 -129430 -116688 -120529 -54757 38676
8128C8676k9682J871p1576L4733J18795N9525M4023j76026n5918k624k8825l8662
$$ 38676 8994 10865 -60711 -25978 92817 152342 196365 20339 -35579 -38203 -67028 -105690
8116a05690O1809K5202K9562O8159n6041j93576m9855J860J53119Q9176o2749
$$ -105690 -43881 -18679 10883 79042 23001 -170575 -220430 -218570 -65451 23725 -39024
8105c9024o8454m6467o463O0479N4240o3957m8801O4918J40114k8503o0425j12893
$$ -39024 -107478 -153945 -160408 -99929 -45689 -109646 -158447 -93529 46585 18082 -42343 -155236
8093a55236m5610L0325P8817m2507J2428N3230M7345J5058q7763q1053O3160P3532
$$ -155236 -200846 -170521 -91704 -134211 -121783 -68553 -21208 -6150 -93913 -174966 -111806 -38274
8081c8274M5206J8265M2376n8162l6674n724o2576j9658P760M4175J78816Q0336
$$ -38274 6932 25197 67573 9411 -27263 -32987 -95563 -115221 -107461 -63286 115530 195866
8069A95866p6590j7371l2318J7007Q4689j10940k17470q1610J77218P8398o2840
$$ 195866 119276 101905 69587 86594 171283 60343 -157127 -238737 -61519 16879 -45961
8058d5961P937J1959O8344o2291q5469k1191M9169J22872k3078j12900M7855K8975
$$ -45961 -38024 -26065 42279 -20012 -105481 -126672 -77503 45369 22291 -90609 -42754 -13779
8046a3779J02553o859j46295O7937Q4267J68514o0808L2837k5801J27459j5923
$$ -13779 88774 81915 -64380 3557 87824 256338 195530 228367 202566 330025 314102
8035C14102k56993j05454K1905J19346P258k0056O5798K5274N2930j39638j16675
$$ 314102 57109 -48345 -26440 92906 100164 80108 145906 171180 224110 84472 -32203
8024c2203N8563M5000R5968N0116q299P6350n1474M5163q4078K1619q0898R462
$$ -32203 26360 71360 167328 217444 209145 285495 234021 279184 195106 216725 135827 145289
8012A45289n2521q4664L3280N7921P4954P9390O8184J1265L7396l7435P691P9556
$$ 145289 92768 8104 41384 99305 174259 253649 321833 333098 370494 333059 340750 420306
8000D20306K2427J55773N3955q4623r2713j42967l166j44358j35728M0062K32524
$$ 420306 442733 598506 652461 567838 475125 332158 328992 184634 48906 88968 321492
7989C21492R1854J44739k5991j08866j68880j44955l4112M2854P5234j08899l3640
$$ 321492 413346 558085 532094 423228 254348 109393 75281 118135 193369 84470 50830
7978E0830O3766M1046r381M9436l0373j06489M8071Q2058L682K9808M1108n4958
$$ 50830 114596 155642 146261 195697 165324 58835 106906 188964 192646 222454 263562 208604
7966B08604j01611J3268P0028n8375j2558k3574Q7410Q5769N2427l8830o4862
$$ 208604 106993 120261 190289 131914 119356 95782 183192 268961 321388 282558 217696
7955B17696o8336J9546O2050N3697j2494J2776K8859k6893n6558n2683j18552
$$ 217696 149360 168906 230956 284653 272159 284935 313794 286901 230343 177660 59108
7944E9108K4704j0762r3443k9141J4536M8641J4850J2913J00622M2053o232j5202
$$ 59108 83812 73050 -20393 -49534 -34998 13643 28493 41406 142028 184081 177849 162647
7932A62647p1376j18633K489J43679n0964r6107q174k8713Q3368L5055o6786L347
$$ 162647 91271 -27362 -24873 118806 67842 -28265 -36439 -65152 18216 53271 -13515 -10168
7920a0168O3732P107j1071R795Q0637K8823J1017l6107l8521q9768O8699J6516
$$ -10168 53564 60671 49600 59395 140032 168855 179872 143765 105244 15476 84175 100691
7908A00691j14120M330p1907j0203M2756K873n74Q0941O7117k0298m4112K6638
$$ 100691 -13429 -9099 -81006 -91209 -48453 -45580 -46154 34787 101904 81606 37494 64132
7896F4132R7262l1146j60954j16730O4866R7942R9879n8817k27598l6004P6538
$$ 64132 161394 130248 -30706 -147436 -82570 15372 115251 56434 -171164 -207168 -130630
7885a30630J10541j073k8999p6827j07069l1740j3528N6491N6076O3885j5973
$$ -130630 -20089 -21162 -50161 -126988 -234057 -265797 -279325 -222834 -166758 -102873 -118846
7874a18846L587n483J13230J21130l3245j5373o3832r8825o127P1666O3304M1975
$$ -118846 -115259 -120742 -7512 113618 80373 65000 1168 -97657 -103784 -32118 31186 73161
7862G3161o0622q2329K2685P3374m8949j22811k4745O2018M7819o4898J7983M5362
$$ 73161 12539 -69790 -47105 26269 -22680 -145491 -170236 -108218 -60399 -125297 -107314 -61952
7850f1952j08919q733N7275R3936M7313n047p6958N380L7265k6674K2207J493
$$ -61952 -170871 -179604 -122329 -28393 18920 13873 -63085 -57705 -20440 -47114 -24907 -23414
7838b3414L7585L6155O8023N897r5814j06574p8868J2443j8342p0664m1074j1799
$$ -23414 14171 50326 118349 124246 28432 -78142 -157010 -144567 -162909 -233573 -274647 -286446
7826b86446p291m7162O8741P773M1704L1914j4460J288l1153j18367q053O6833
$$ -286446 -293737 -340899 -272158 -264385 -222681 -190767 -205227 -203939 -235092 -353459 -361512 -294679
7814b94679Q5582J12935k1196m6179p1612l5301R3414R9585n393r1229N3504N7895
$$ -294679 -209097 -96162 -117358 -163537 -235149 -270450 -177036 -77451 -82844 -174073 -120569 -62674
7802f2674J13760l5510o0421j5775O5749m1209J8689R3272J0976K7855N651p0219
$$ -62674 51086 15576 -44845 -60620 5129 -36080 -17391 75881 86857 114712 120363 50144
7790E0144q0373K5218J1698K7385r3062n0404n6958k2734J11064N5580J06754
$$ 50144 -30229 -5011 6687 34072 -58990 -109394 -166352 -189086 -78022 -22442 84312
7779H4312j5207o1042J23079p0766j05688L5083Q5575n6775l1512r464j3823J2490
$$ 84312 69105 8063 131142 60376 -45312 -10229 75346 18571 -12941 -22405 -36228 -23738
7767b3738M8731r5l5012K1919J226n1590l2737l805n6891M8360J4136J5256K2692
$$ -23738 24993 24898 -10114 11805 13031 -38559 -71296 -75101 -131992 -83632 -69496 -54240 -31548
7754c1548j9583J6403J29393l8849j36913l4903L7386n8138J5016K5359o0530
$$ -31548 -51131 -34728 94665 55816 -81097 -116000 -78614 -136752 -121736 -96377 -156907
7743a56907L2961O7648q2543m4114L0309N8919O0615L6394n2346q8741m7420P3744
$$ -156907 -123946 -56298 -138841 -182955 -152646 -93727 -33112 3282 -49064 -137805 -185225 -111481
7731a11481r0599o1440J44855P7813j6133m0522o2262j03715m8572J20627J34449
$$ -111481 -202080 -263520 -118665 -40852 -56985 -97507 -159769 -263484 -312056 -191429 -56980
7720e6980r0880q7938J35715J9636p1517m2842k4025k6556L8501O3862L3751J2527
$$ -56980 -147860 -235798 -100083 -80447 -151964 -194806 -218831 -245387 -206886 -143024 -109273 -96746
7708i6746q7913p6611m9828R4740Q9771J01835L1217M6478J2506o347m5582o8634
$$ -96746 -184659 -261270 -311098 -216358 -126587 -24752 6465 52943 65449 59102 13520 -55114
7696e5114J7123j7160K2307N7889L7963k255N1693j06634j69352J826P7520k3288
$$ -55114 -37991 -55151 -32844 25045 63008 60753 112446 5812 -163540 -161714 -84194 -107482
7684a07482l9801R1736L317n3453p5679o617J59981k8953O0200N8424k1966j34202
$$ -107482 -147283 -55547 -52230 -105683 -181362 -187979 -27998 -56951 3249 61673 39707 -94495
7672i4495K847j03122m0746R9091m5389k9380R2900J17982l3829n1955N4989Q2203
$$ -94495 -91648 -194770 -235516 -136425 -181814 -211194 -118294 -312 -34141 -86096 -31107 51096
7660E1096J02997M214n4632m1066j25597j2444J8478l0368K1227J6795J91287
$$ 51096 154093 158307 103675 62609 -62988 -75432 -56954 -87322 -66095 -49300 141987
7649A41987N9416k5475o0152p2838K2467J843p6325k2220m2678l6786j8468j1382
$$ 141987 201403 175928 115776 42938 65405 67248 -9077 -31297 -73975 -110761 -129229 -140611
7637a40611l7942J4525J17536J3002q7750K818M166j3263N4247Q9534j16565p9638
$$ -140611 -178553 -164028 -46492 -33490 -121240 -118422 -114256 -127519 -73272 16262 -100303 -179941
7625a79941J13843J42352l2371j46352q2971Q3521P1431o747J1793N1079J44366
$$ -179941 -66098 76254 43883 -102469 -185440 -101919 -30488 -37235 -25442 25637 170003
7614A70003k7130m8007r296p4479N701j5530m2665o9562j228L0623N4083l8075
$$ 170003 142873 94866 85570 11091 16792 1262 -41403 -110965 -112193 -81570 -27487 -65562
7602f5562o1188q9946n3576j3187l2723m3399R7928K2568m0668k5312J12183J30018
$$ -65562 -126750 -216696 -270272 -283459 -316182 -359581 -261653 -239085 -279753 -305065 -192882 -62864
7590f2864m9551m8915m2323O0701L0870J9294j9718K1726J4430P3679k6935k4556
$$ -62864 -112415 -161330 -203653 -142952 -112082 -92788 -112506 -90780 -76350 -2671 -29606 -54162
7578e4162J4690m2176j7151m1575J3428O6062O0042l586r4651j04938p7415R1100
$$ -54162 -39472 -81648 -98799 -140374 -126946 -60884 -842 -4428 -99079 -204017 -281432 -190332
7566a90332K41726L6041L9555m3381q4831j1710k555r4603o2571l0676P8943P0288
$$ -190332 51394 87435 126990 83609 -1222 -12932 -15487 -110090 -172661 -203337 -124394 -54106
7554e4106J5634J13930q8104j25508K7163j1967J22732K8345L298N246Q9060m1198
$$ -54106 -38472 75458 -12646 -138154 -110991 -122958 -226 28119 31417 36663 125723 84525
7542H4525j4627L7091L6553p7456Q585l4931L1385n2209q5499N6911R9172k7613
$$ 84525 69898 106989 143542 66086 74671 39740 71125 18916 -66583 -9672 89500 61887
7530F1887n6847K2788o5639n2733r567L954J09447J9065k1418j17541j04907n4548
$$ 61887 5040 27828 -37811 -90544 -100111 -96157 13290 32355 10937 -106604 -211511 -266059
7518b66059M201O4382K05772p8620M999l7853J10007Q3272N0776l0678j25378
$$ -266059 -261858 -197476 8296 -70324 -65325 -103178 6829 90101 140877 110199 -15179
7507a5179J3953N1176q5760j05182n3967L6122J61128J71075j76956o6605L5564
$$ -15179 -1226 49950 -35810 -140992 -194959 -158837 2291 173366 -3590 -70195 -34631
7496c4631m4080j11729N7749J57638O4017k5357l2330n918k5954r7576N1839O9423
$$ -34631 -78711 -190440 -132691 24947 88964 63607 31277 25359 -595 -98171 -46332 23091
7484B3091J6912L1235j04383q2790k5027k2010k3215Q9568L8122P991j24088J9598
$$ 23091 40003 71238 -33145 -115935 -140962 -162972 -186187 -96619 -58497 -50506 -174594 -154996
7472a54996q0481n9117N0271O8503j989L8604k6687k8933O9969K7593J44161j1885
$$ -154996 -235477 -294594 -244323 -175820 -177809 -139205 -165892 -194825 -124856 -97263 46898 35013
7460C5013K5450l2475j0003O7646L4806j94109r1616N8414J75866L3224k5616
$$ 35013 60463 27988 17985 85631 120437 -73672 -165288 -106874 68992 102216 76600
7449G6600j05140R873M4988J4010j8903N068Q1654j0497q7951k7962l0283K3753
$$ 76600 -28540 -18667 26321 40331 21428 26496 108150 97653 9702 -18260 -48543 -24790
7437b4790n9532j08515R183Q0594P7246K6559j5553K9121j9139M8044L6065L2872
$$ -24790 -84322 -192837 -183654 -103060 -25814 745 -14808 14313 -4826 43218 79283 112155
7425A12155p5713J3508j47863m1734R400J08050Q7436P3506m4017r4522p6198
$$ 112155 36442 49950 -97913 -139647 -130247 -22197 65239 138745 94728 206 -75992
7414g5992j9195m849M2776L3394j238n5229J0924J46559J7426k8341n700m4047
$$ -75992 -95187 -100036 -57260 -23866 -25104 -80333 -69409 77150 94576 66235 60535 16488
7402A6488L5465l6808m351J55069J4006j73540j7357L3410K00K1323M432n9714
$$ 16488 51953 15145 10794 165863 179869 6329 -11028 22382 22582 43905 48337 -11377
7390a1377m6513Q81j49734n2606N5096P9249K8907J49856k2882r2719j9657N9308
$$ -11377 -57890 -57009 -206743 -259349 -204253 -125004 -96097 53759 30877 -61842 -81499 -22191
7378b2191R8394O4439k3691k8078r4933q9750j9126N6128O2995N680k4757k5084
$$ -22191 76203 140642 116951 88873 -6060 -95810 -114936 -58808 4187 9867 -14890 -39974
7366c9974j9831k6886j4332O2233M6726m6550K3992r524J9864N2247L9665M9900
$$ -39974 -59805 -86691 -101023 -38790 7936 -38614 -14622 -24146 -4282 47965 87630 137530
7354A37530m2478j17669m9920R2816r5189j04781K189L3875M5232M9375L1748
$$ 137530 95052 -22617 -72537 20279 -74910 -179691 -177502 -143627 -98395 -49020 -17272
7343a7272p5175P5406J50002L1054n1859j14131j1301J247m3834L7123L1882N7105
$$ -17272 -92447 -17041 132961 164015 112156 -1975 -13276 -12029 -55863 -18740 13142 70247
7331G0247J9495p8672J0335j11705q26P5402L1620l4196K1153k4087j8588M286
$$ 70247 89742 11070 21405 -90300 -91126 -15724 15896 -18300 2853 -21234 -39822 -35536
7319c5536J08732k8657J9173n3772j12438m5829N0273N4004Q5588k19o8939m5306
$$ -35536 73196 44539 63712 9940 -102498 -148327 -98054 -44050 41538 41319 -27620 -72926
7307g2926q6680O1839J09258o582n5831K5030K6306M2625L0407j13837j47454
$$ -72926 -159606 -97767 11491 4909 -50922 -25892 414 43039 73446 -40391 -187845
7296a87845j42313Q484O8372J07801Q1953L4865O0169p7284n7741J098r9767L1697
$$ -187845 -330158 -321674 -253302 -145501 -63548 -28683 31486 -45798 -103539 -102441 -202208 -170511
7284a70511K039R6852L5061r3139K0701R8951p2530l5741n5581Q3732R4000j6893
$$ -170511 -168472 -71620 -36559 -129698 -108997 -10046 -82576 -118317 -173898 -90166 3834 -13059
7272a3059k2555J1058k1877P1082n1176k6682K2007k0685l8371M7531N8304L0501
$$ -13059 -35614 -24556 -46433 24649 -26527 -53209 -31202 -51887 -90258 -42727 15577 46078
7260D6078K6610l98j15951j57873n9202M5409J0040m1071P8957J14054J18009
$$ 46078 72688 72290 -43661 -201534 -260736 -215327 -205287 -246358 -167401 -53347 64662
7249F4662J58245o984p5721q327k9417p0126K9375j06426j54587L3410O9748j7228
$$ 64662 222907 215923 140202 131875 102458 32332 61707 -44719 -199306 -165896 -96148 -113376
7237a13376R8656R3959m5055m7966j5302L8503K786K4940J02487j6862m9402o331
$$ -113376 -14720 79239 34184 -13782 -29084 9419 12205 37145 139632 122770 73368 67037
7225F7037l7914R071p3804k7076o1289J8121Q9792Q589r8094O5806j39339q1693
$$ 67037 29123 38194 -35610 -62686 -123975 -105854 -16062 -7473 -105567 -39761 -179100 -260793
7213b60793J1230R6598P8820N5589P4626j9137Q6139p0870O6280K0605J6762J681
$$ -260793 -249563 -152965 -74145 -18556 56070 36933 123072 52202 118482 139087 155849 157530
7201A57530j01050J8607O1865m2099q1221k327k3904k0565j16707J64683N2859
$$ 157530 56480 75087 136952 94853 13632 11305 -12599 -33164 -149871 14812 67671
7190F7671n8493M1500r253k7981K7207m7413k0304K3032o8843o4567L8891L3863
$$ 67671 9178 50678 41425 13444 40651 -6762 -27066 -4034 -72877 -137444 -98553 -64690
7178f4690L6166M5103r5880j69772n0980J24599P7275O2935j0694j3766J16781
$$ -64690 -28524 16579 -79301 -249073 -300053 -175454 -98179 -35244 -45938 -59704 57077
7167E7077o4106q8280O2406K4992J4942J32244O1897m8424r9978q4389k2788p495
$$ 57077 -7029 -95309 -32903 -7911 7031 139275 201172 152748 52770 -31619 -54407 -61902
7155f1902N6122R4005R371o4127K1620K1014o9268n3068J0312L7041n4815r3406
$$ -61902 -5780 88225 97596 33469 55089 76103 6835 -46233 -35921 1120 -53695 -147101
7143a47101l6937L7892P0702P7957L5775m5933M001N974o6603m8716Q6191J15639
$$ -147101 -184038 -146146 -75444 2513 38288 -7645 -3644 2330 -64273 -112989 -26798 88841
7131H8841p5395n0041l9894M2130j7089J8561r3747r1265K296M2073O8843J13370
$$ 88841 13446 -36595 -76489 -34359 -51448 -32887 -126634 -217899 -215603 -173530 -104687 8683
7119H683J0813k9775k2598L3296r544J3766m8530p7663l6879O850K7494J12757
$$ 8683 19496 -10279 -32877 419 -9125 4641 -43889 -121552 -158431 -151581 -124087 -11330
7107a1330j9624K5467P1000P8490j34022j43005M8126Q6237R0166K7903r3910
$$ -11330 -30954 -5487 65513 144003 9981 -133024 -84898 1339 91505 119408 25498
7096B5498l8195Q3262l3339j05679l7086L1243J5365L0531k9627J4476M6753r233
$$ 25498 -12697 70565 37226 -68453 -105539 -74296 -58931 -28400 -58027 -43551 3202 -6031
7084f031j0643J8734n6729j8299k7228L8086J32420j3391p2123M2433m4259o2394
$$ -6031 -16674 2060 -54669 -72968 -100196 -62110 70310 56919 -15204 27229 -17030 -79424
7072g9424m8153N2218q8356p4658M8282K8060J46311N8014M040l4033k9890m9330
$$ -79424 -127577 -75359 -163715 -238373 -190091 -162031 -15720 42294 46334 12301 -17589 -66919
7060f6919L209J1982O9546Q4811N7893j22166k4253L7772j13623j756P4917N7142
$$ -66919 -63710 -51728 17818 102629 160522 38356 14103 51875 -61748 -63504 11413 68555
7048F8555J3718o5017n1161N9301K1784R0655N599K3013r9046l4615k0119K3220
$$ 68555 82273 17256 -33905 25396 47180 137835 143434 166447 67401 32786 12667 35887
7036C5887j5677n0566P180L3922P850r0266L6817R6001j7551j0418K2792J24681
$$ 35887 20210 -30356 -23176 10746 18596 -71670 -34853 61148 43597 33179 55971 180652
7024A80652o6037j03462l033m7387k6500k9264N8757l1059k4225j6716J11056
$$ 180652 114615 11153 8120 -39267 -65767 -95031 -36274 -67333 -91558 -108274 2782
7013B782l8429q6945m4253P7707k1732J01251o19k5071j05901o533N2069P2542
$$ 2782 -35647 -122592 -166845 -89138 -110870 -9619 -10238 -35309 -141210 -147743 -95674 -23132
7001b3132l6804r7111P6501J7606r6997q2009k6766K9728J72191p438J6307R4557
$$ -23132 -59936 -157047 -80546 -62940 -159937 -241946 -268712 -238984 -66793 -74231 -57924 36633
6989C6633R0464O6200k198j78657p1676K1926k1634P5770j7861n3592j6637M5651
$$ 36633 127097 193297 191099 12442 -59234 -37308 -58942 16828 -1033 -54625 -71262 -25611
6977b5611K1362P6122L6202j12745r1832p866J13109K37663L2563k76795j62140
$$ -25611 -4249 71873 108075 -4670 -96502 -104368 8741 246404 278967 2172 -159968
6966a59968J4592j02541M6189J93875J07134j01489r7895j33060J3402N4570J48257
$$ -159968 -145376 -247917 -201728 -7853 99281 -2208 -100103 -233163 -219761 -165191 -16934
6955a6934Q2711j2704j02382r0349o3776R2358K4318N2427N1010L0543j10242
$$ -16934 65777 53073 -49309 -139658 -203434 -111076 -86758 -34331 16679 47222 -63020
6944f3020n7307j8426K2995j8890j39290j4083p376J24092R7402Q3206J57086
$$ -63020 -120327 -138753 -115758 -134648 -273938 -288021 -295397 -171305 -73903 9303 166389
6933A66389n638J8236k3558j74131r0396R3389J9504P5208O1218l4962m5659K4246
$$ 166389 160751 178987 155429 -18702 -109098 -15709 3795 79003 140221 105259 59600 83846
6921H3846m1807K2656K9906n9273j07665N4756N0836k8604m4805j5699K6833N5212
$$ 83846 42039 64695 94601 35328 -72337 -17581 33255 4651 -40154 -55853 -29020 26192
6909B6192q324J2830P5714n2667K586r0452m3180l8259O8259M9233k8404M6573
$$ 26192 17868 30698 106412 53745 56331 -34121 -77301 -115560 -47301 1932 -26472 20101
6897B0101J2744p059j00547m2910n311J07292K9355l7124L2311j4556k8180n72
$$ 20101 32845 25786 -74761 -117671 -122982 -15690 13665 -23459 8852 -5704 -33884 -34456
6885c4456k7500q7660l1512P063L9173K4871L84J2451q364J182O2291M8241j99206
$$ -34456 -61956 -149616 -181128 -174065 -134892 -110021 -109637 -97186 -105550 -104368 -42077 6164 -193042
6872a93042j37750O5329N5610n3300O1516J66517n186n823k9925J5720n7343P6137
$$ -193042 -330792 -265463 -209853 -263153 -201637 -35120 -40306 -46129 -76054 -60334 -117677 -41540
6860d1540k6260j09409P4513P5916M0105J3862k9281n3523p5127n0858k377k7009
$$ -41540 -67800 -177209 -102696 -26780 13325 27187 -2094 -55617 -130744 -181602 -183979 -210988
6848b10988k0854J8028j07317L22Q8488J94337P4727K1813n638Q7810Q1058q2203
$$ -210988 -231842 -213814 -321131 -320809 -232321 -37984 36743 58556 52918 140728 221786 139583
6836A39583n8153K0598P3254p2133m6390o8993J838O5610R6083J787n0632j5239
$$ 139583 81430 102028 175282 103149 56759 -12234 -10396 55214 151297 153084 102452 87213
6824H7213q2986n8435n9369K8588L1736k4991Q607P0175O3518N148n427K52j02814
$$ 87213 4227 -54208 -113577 -84989 -53253 -78244 -69637 538 64056 69204 63777 64029 -38785
6811c8785o3659m2649P1309O0468J9014M0133M536l0957j77831P1085J38201N5807
$$ -38785 -102444 -145093 -73784 -13316 5698 45831 50367 19410 -158421 -87336 50865 106672
6799A06672l5205o7492K9142q7008k0735m4946j8117j6680J03209l718l9701J7613
$$ 106672 71467 3975 33117 -53891 -74626 -119572 -137689 -154369 -51160 -54878 -94579 -76966
6787g6966j2703n170M2046n0640o0774j1892Q2645J09798n0382m3927K6860L5252
$$ -76966 -89669 -94839 -52793 -103433 -164207 -176099 -93454 16344 -34038 -77965 -51105 -15853
6775a5853N5037O6133k2075j97n4912N6836R2292m0783r1826j92137o752K5565
$$ -15853 39184 105317 83242 83045 28133 84969 177261 136478 44652 -147485 -154237 -128672
6763a28672j027K6391o3919J7291L2171J0603O8404K0210K2868K9965J32396J666
$$ -128672 -129699 -103308 -167227 -149936 -117765 -107162 -38758 -18548 4320 34285 166681 168347
6751A68347j3960N243o3720m6940k5036K4812m0850N269Q2916r0549j29814P7272
$$ 168347 154387 159630 95910 48970 23934 48746 7896 13165 96081 5532 -124282 -47010
6739d7010R6503K2468n5958o023L205q5422j9354O0984Q6008N0778q0602q708
$$ -47010 49493 71961 16003 9980 13185 -72237 -91591 -30607 55401 106179 25577 16869
6727A6869j9528l378m0880P7191M6386m7750q0298k3154O4601O2178p4277L824
$$ 16869 -2659 -6037 -46917 30274 76660 28910 -51388 -74542 -9941 52237 -22040 -18216
6715a8216L3749P1265r6581o973k1963l8828Q010P6985n9246j3983N5740j7452
$$ -18216 15533 86798 -9783 -16756 -38719 -77547 -69537 7448 -51798 -65781 -10041 -27493
6703b7493p7681M9441j56386j2427M4454P4984J06567n097j05689j51M9866Q4508
$$ -27493 -105174 -55733 -212119 -224546 -180092 -105108 1459 -3638 -109327 -109478 -59612 24896
6691B4896N7651O4520j47673j83537o4831J29306K1575P5064o3833J0055Q2825
$$ 24896 82547 147067 -606 -184143 -248974 -119668 -98093 -23029 -86862 -76807 6018
6680F018J3287n5587l4892q21M6476k2868J5030M3009j08954j47381j1475M360
$$ 6018 19305 -36282 -71174 -71995 -25519 -48387 -33357 9652 -99302 -246683 -258158 -253798
6668b53798N5541J23339J67916M889j20977j11774K1623J4410O2902M2771r4562
$$ -253798 -198257 -74918 92998 97887 -23090 -134864 -113241 -98831 -35929 6842 -87720
6657h7720j55855N3370J84172j7012N7116K0177o7573n3430p1683p7411J0319
$$ -87720 -243575 -190205 -6033 -23045 34071 54248 -13325 -66755 -138438 -215849 -205530
6646b05530Q9366M9018q2449k2526M9880O1921K6981K538Q4827J3337M0940p8018
$$ -205530 -116164 -67146 -149595 -172121 -122241 -60320 -33339 -30801 54026 67363 108303 30285
6634C0285o0485l457k3584O6053m7187L9062r118J7866O123j2244m3885K5307
$$ 30285 -30200 -33657 -57241 8812 -38375 687 -8431 9435 15558 3314 -40571 -15264
6622a5264q856o1804J8254j3162k3469K6851P2089j1009k8395m4443j5824L2537
$$ -15264 -24120 -85924 -67670 -80832 -104301 -77450 -5361 -16370 -44765 -89208 -105032 -72495
6610g2495k099o1144K2569k2818J00167P8724n4426o1113L4768J03057N869o4963
$$ -72495 -74594 -135738 -113169 -135987 -35820 42904 -11522 -72635 -37867 65190 71059 6096
6598F096J842j23397q665K444Q9076J04003l7476M8919r4068r7643L346M5286
$$ 6096 7938 -115459 -124124 -121680 -32604 71399 33923 82842 -11226 -108869 -105523 -60237
6586f0237o2557J7661M0567m9867o1703R3852J7623J9342J00328J0432p186J7745
$$ -60237 -122794 -105133 -64566 -114433 -176136 -82284 -64661 -45319 55009 65441 58255 76000
6574G6000o1818j18868K9075L2949n1921n5426j3493M4722j58760p3484J46922
$$ 76000 14182 -104686 -75611 -42662 -94583 -150009 -163502 -118780 -277540 -351024 -204102
6563b04102K22195j02662q4279p1874M522K8043K9835J14327M7047r3776k4371
$$ -204102 18093 -84569 -168848 -240722 -236200 -208157 -178322 -63995 -16948 -110724 -135095
6552a35095m1721J2716J03326Q9553o299J36656m1615n2799O005J6637J306n5587
$$ -135095 -176816 -164100 -60774 28779 22480 159136 117521 64722 70727 87364 88670 33083
6540C3083l3861k3061k6310m9897k6061N035J8766r1425n3679N1747J15847J5649
$$ 33083 -778 -23839 -50149 -100046 -126107 -121072 -102306 -193731 -247410 -195663 -79816 -64167
6528f4167k0713n1302p0744N704L2461K1129j13148j4570Q127O0895J44693L1998
$$ -64167 -84880 -136182 -206926 -201222 -168761 -147632 -260780 -275350 -267223 -206328 -61635 -29637
6516b9637N6457j01207l1929Q3538p924K5348Q6754n5925k3547q830J772L2342
$$ -29637 26820 -74387 -106316 -22778 -30702 -5354 81400 25475 1928 -6902 -5130 27212
6504B7212J49779L4114j44651o0137n2057l6624O9826J3702j00372p8589j809
$$ 27212 176991 211105 66454 6317 -45740 -82364 -12538 1164 -99208 -177797 -179606
6493a79606Q0301j4322M3856J01547L8355q665j13307M5742Q887l282P374l0164
$$ -179606 -99305 -113627 -69771 31776 70131 61466 -51841 -6099 2788 -494 6880 -23284
6481b3284k8554j68818M4839L5744j20873q5002J71971J18940l4513n0655K555
$$ -23284 -51838 -220656 -175817 -140073 -260946 -345948 -173977 -55037 -89550 -140205 -137650
6470a37650K3481j8961Q8243Q7994Q6561j30012p9977r0165k2152j1915R7748
$$ -137650 -114169 -133130 -44887 43107 129668 -344 -80321 -170486 -192638 -204553 -106805
6459a06805K3413M4606O6538m328j25791j43144J8206K5285j0592o3292l4978
$$ -106805 -83392 -38786 27752 23424 -102367 -245511 -227305 -202020 -212612 -275904 -310882
6448c10882K0485J15868Q1873j08338k7965J33068M8656J33778m1120j53779n6507
$$ -310882 -290397 -174529 -92656 -200994 -228959 -95891 -47235 86543 45423 -108356 -164863
6437a64863Q9563q5449J8489M8922J6942J1522o486p1339P3933Q813m4099Q6576
$$ -164863 -75300 -160749 -142260 -93338 -76396 -64874 -71360 -142699 -68766 -59953 -104052 -17476
6425a7476N1798j5414j3772k5289q3128P7942k5083L241R3374O6764N628M4855
$$ -17476 34322 18908 5136 -20153 -103281 -25339 -50422 -47181 46193 112957 118585 163440
6413A63440K9361j6337j20041q5851l2530M2431L7539J25137L1459k7037k7468
$$ 163440 192801 176464 56423 -29428 -61958 -19527 18012 143149 174608 147571 120103
6402A20103o6538P320o1927Q281M0111M642j8530o1489n9550N7506L0471j15534
$$ 120103 53565 60885 -1042 7239 47350 51992 33462 -28027 -87577 -30071 400 -115134
6390a15134j20941J0824Q5431M3214n333o0592L4512L9538j2270k0286Q4588N4009
$$ -115134 -236075 -225251 -139820 -96606 -101939 -162531 -128019 -88481 -100751 -121037 -36449 17560
6378A7560J05773j0404o5541j3512L3761J8254p2121l0867O8852j514k8701k1919
$$ 17560 123333 112929 47388 33876 67637 85891 13770 -17097 51755 50241 21540 -379
6366c79k8677M4826m4860n6278O767j21J34349J10402N7156l9090p9357l960j6269
$$ -379 -29056 15770 -29090 -85368 -78601 -78722 55627 166029 223185 184095 104738 100778 84509
6353H4509J3359q8133j19492R7450j6137j00520R5074K4434Q8040n6099q6930
$$ 84509 97868 9735 -109757 -12307 -28444 -128964 -33890 -9456 78584 22485 -64445
6342f4445q3263K3955J08211Q6671M3514M8809j24471j25978L8977O4633M2827
$$ -64445 -147708 -123753 -15542 71129 114643 163452 38981 -86997 -48020 16613 59440
6331E9440O4693l8934j32463p434L7991k3526n5771O3506L8197J02280k8859j29797
$$ 59440 124133 85199 -47264 -54698 -16707 -40233 -96004 -32498 5699 107979 79120 -50677
6319e0677J10400j9469l6943O6181M0037r6421j10072N4091R8305N5365r4610
$$ -50677 59723 40254 3311 69492 109529 13108 -96964 -42873 55432 110797 16187
6308A6187m8622o1589J2101o721N2387k901j57930k4453K6665M5246M0921J0251
$$ 16187 -32435 -94024 -81923 -88644 -36257 -39158 -197088 -221541 -194876 -149630 -108709 -98458
6296i8458Q0847Q6072K3120P6452j08359j08006o4158M3262P7989L4669q571j02997
$$ -98458 -17611 68461 91581 168033 59674 -48332 -112490 -69228 8761 43430 34859 -68138
6284f8138n2474N1535N9250N5465n490j22928o4230P3336N4144o5845O7109K5163
$$ -68138 -120612 -69077 -9827 45638 40148 -82780 -147010 -73674 -19530 -85375 -18266 6897
6272F897P0605K786K525j15943m2722k8583J8451O7122N0965k7595j8766L9913
$$ 6897 77502 80288 82813 -33130 -75852 -104435 -85984 -18862 32103 4508 -14258 25655
6260B5655R278M1773k0319m8405K5187J13878K6312l8417p7458Q5773J2116m7927
$$ 25655 34933 76706 56387 7982 33169 147047 173359 134942 57484 143257 155373 107446
6248A07446l8314n0747j44090J15790N1733L0471K1155j06638M1499m9370l4937
$$ 107446 69132 18385 -125705 -9915 41818 72289 93444 -13194 28305 -21065 -56002
6237e6002O4705p5371J6539r292l0331K3216k1102K7574k1876l5241J27701O3557
$$ -56002 8703 -66668 -50129 -59421 -89752 -66536 -87638 -60064 -81940 -117181 10520 74077
6225G4077j1438Q5567o6360o6055j0868M0530J04397p2142o3169M1508R685q5709
$$ 74077 62639 148206 81846 15791 4923 45453 149850 77708 14539 56047 65732 -19977
6213a9977j49318m1165J21045q7911N842j110L8171Q5459J11582j0945L5785j0179
$$ -19977 -169295 -210460 -89415 -177326 -171484 -172594 -134423 -48964 62618 51673 87458 77279
6201G7279j5425k4696R9670J8612r3453k1371N3105p4688k1386n4391N5333p9522
$$ 77279 61854 37158 136828 155440 61987 40616 93721 19033 -2353 -56744 -1411 -80933
6189h0933j56800k1465R0934J22228K4643J8666j1887j38734l545J29000j31388
$$ -80933 -237733 -259198 -168264 -46036 -21393 -2727 -14614 -153348 -156893 -27893 -159281
6178a59281k035J33071L122m2914q7602j4857M6498J34012l5707r3825L350O4258
$$ -159281 -161316 -28245 -25123 -68037 -155639 -170496 -123998 10014 -25693 -119518 -116168 -51910
6166e1910l3214P806P7468K9912o4839k1728L9633J29056R0593r0578l5262n0236
$$ -51910 -85124 -77318 150 30062 -34777 -56505 -16872 112184 202777 112199 76937 26701
6154B6701O096M4302o7088l5737L2648M6721j00900m6659k772K1680P5919n8284
$$ 26701 32797 77099 10011 -25726 6922 53643 -47257 -93916 -96688 -75008 911 -57373
$$ [...]
##END NTUPLES=NMR SPECTRUM
##END=
