##TITLE=Analysis number 329445
Compound Code cc 69646
Book Reference 486/198
Project Code adrs
Chemist Name simons
##JCAMPDX= 6.0         $$ Bruker NMR JCAMP-DX V2.0
##DATA TYPE= NMR SPECTRUM
##DATA CLASS= NTUPLES
##ORIGIN= Bruker BioSpin GmbH
##OWNER= nmr
$$ XWIN-NMR		Version 3.5
$$ Mon Sep  3 14:16:14 2007 GMT Daylight Time (UT+1h)  MAYBRIDGE\nmr@NMR_250MHZ
##.OBSERVE FREQUENCY= 250.131544655141
##.OBSERVE NUCLEUS= ^1H
##.ACQUISITION MODE= SIMULTANEOUS (DQD)
##.ACQUISITION SCHEME= undefined
##.AVERAGES= 16
##.DIGITISER RES= 18
##SPECTROMETER/DATA SYSTEM= dpx250
##.PULSE SEQUENCE= zg30
##.SOLVENT NAME= CDCl3
##.SHIFT REFERENCE= (INTERNAL, CDCl3, 0, 16.4573)
##AUDIT TRAIL= $$ (NUMBER, WHEN, WHO, WHERE, WHAT)
$$ ##TITLE= Audit trail, XWIN-NMR		Version 3.5
$$ ##JCAMPDX= 5.01
$$ ##ORIGIN= Bruker BioSpin GmbH
$$ ##OWNER= nmr
$$ C:\u/data/dgb/nmr/ADRS/10/pdata/1/auditp.txt
$$ ##AUDIT TRAIL=  $$ (NUMBER, WHEN, WHO, WHERE, WHAT)
(   1,<2007-09-03 14:14:46.51 +100>,<MAYBRIDGE\nmr>,<NMR_250MHZ>,
      <created by zg, POWCHK disabled, PULCHK disabled
       configuration hash MD5:
       76 6E 9A 78 1E 09 19 81 EC 84 63 8F B0 6A 59 2D
       data hash MD5: 64K
       AE 24 F1 B3 99 6D 40 11 B2 5B 74 26 4C 93 AA 16>)
(   2,<2007-09-03 14:15:15.26 +100>,<MAYBRIDGE\nmr>,<NMR_250MHZ>,
      <Start of raw data processing
       ef LB = 0.3 FT_mod = 6 PKNL = 1 SI = 32K 
       data hash MD5: 32K
       B4 FB C7 5A 77 63 78 F4 D0 97 08 2E 86 EF 82 13>)
(   3,<2007-09-03 14:15:20.39 +100>,<MAYBRIDGE\nmr>,<NMR_250MHZ>,
      <apk 
       data hash MD5: 32K
       2F 6C 7D 96 E2 08 E9 E2 7B EC E5 61 5C 5D 3A C3>)
(   4,<2007-09-03 14:15:25.12 +100>,<MAYBRIDGE\nmr>,<NMR_250MHZ>,
      <abs ABSG = 5 
       data hash MD5: 32K
       E2 D5 79 E9 F8 76 59 9F DA E7 16 DB 2F 42 C4 20>)
$$ ##END=
$$ 
$$ hash MD5
$$ 1B 54 C6 5A 2F B4 94 43 EB 35 F7 31 06 8C 76 FB
##$RELAX= 
##$RELAX= 
##$RELAX= 
##$RELAX= 
##$RELAX= 
##$RELAX= 
##$RELAX= 
$$ Bruker specific parameters
$$ --------------------------
##$DU= <C:\u>
##$EXPNO= 10
##$NAME= <ADRS>
##$PROCNO= 1
##$TYPE= <nmr>
##$USER= <dgb>
##$AMP= (0..31)
100 100 100 100 100 100 100 100 100 100 100 100 100 100 100 100 100 100 
100 100 100 100 100 100 100 100 100 100 100 100 100 100 
##$AQSEQ= 0
##$AQ_mod= 3
##$AUNM= <au_zg>
##$AUTOPOS= <27 >
##$BF1= 250.13
##$BF2= 250.13
##$BF3= 250.13
##$BF4= 250.13
##$BF5= 500.13
##$BF6= 500.13
##$BF7= 500.13
##$BF8= 500.13
##$BYTORDA= 1
##$CFDGTYP= 0
##$CFRGTYP= 5
##$CHEMSTR= <none>
##$CNST= (0..31)
1 1 145 1 1 1 1 1 1 1 1 1 1 1 1 1 1 1 1 1 1 1 1 1 1 1 1 1 1 1 1 1 
##$CPDPRG= <>
##$CPDPRG1= <>
##$CPDPRG2= <>
##$CPDPRG3= <>
##$CPDPRG4= <mlev>
##$CPDPRG5= <mlev>
##$CPDPRG6= <mlev>
##$CPDPRG7= <mlev>
##$CPDPRG8= <mlev>
##$CPDPRGB= <>
##$CPDPRGT= <>
##$D= (0..31)
0 1 0 0 0 0 0 0 0 0.06 0 0 0 0 0 0 0.0002 0 0 0 0 0 0 0 0 0 0 0 0 0 0 
0 
##$DATE= 1188825283
##$DBL= (0..7)
120 120 120 120 120 120 120 120 
##$DBP= (0..7)
150 150 150 150 150 150 150 150 
##$DBP07= 0
##$DBPNAM0= <>
##$DBPNAM1= <>
$$ [...]
##$SUBNAM7= <"">
##$SUBNAM8= <"">
##$SUBNAM9= <"">
##$SW= 20.6930455092707
##$SWIBOX= (0..15)
0 0 3 0 0 0 0 0 0 0 0 0 0 0 0 0 
##$SW_h= 5175.983436853
##$TD= 65536
##$TD0= 1
##$TE= 297.16
##$TE2= 300
##$TE3= 300
##$TEG= 300
##$TL= (0..7)
0 120 120 120 120 120 120 120 
##$TP= (0..7)
150 150 150 150 150 150 150 150 
##$TP07= 0
##$TPNAME0= <>
##$TPNAME1= <>
##$TPNAME2= <>
##$TPNAME3= <>
##$TPNAME4= <>
##$TPNAME5= <>
##$TPNAME6= <>
##$TPNAME7= <>
##$TPOAL= (0..7)
0.5 0.5 0.5 0.5 0.5 0.5 0.5 0.5 
##$TPOFFS= (0..7)
0 0 0 0 0 0 0 0 
##$TUNHIN= 0
##$TUNHOUT= 0
##$TUNXOUT= 0
##$USERA1= <user>
##$USERA2= <user>
##$USERA3= <user>
##$USERA4= <user>
##$USERA5= <user>
##$V9= 5
##$VALIST= <valist>
##$VCLIST= <CCCCCCCCCCCCCCC>
##$VD= 0
##$VDLIST= <DDDDDDDDDDDDDDD>
##$VPLIST= <PPPPPPPPPPPPPPP>
##$VTLIST= <TTTTTTTTTTTTTTT>
##$WBST= 1024
##$WBSW= 4
##$XGAIN= (0..3)
0 0 0 0 
##$XL= 0
##$YL= 0
##$YMAX_a= 396147
##$YMIN_a= -291444
##$ZGOPTNS= <>
##$ZL1= 120
##$ZL2= 120
##$ZL3= 120
##$ZL4= 120
##$ABSF1= 16.45728
##$ABSF2= -4.235893
##$ABSG= 5
##$ABSL= 3
##$ALPHA= 0
##$AQORDER= 0
##$ASSFAC= 0
##$ASSFACI= 0
##$ASSFACX= 0
##$ASSWID= 0
##$AUNMP= <proc_1d>
##$AZFE= 0.1
##$AZFW= 0.1
##$BCFW= 0
##$BC_mod= 0
##$BYTORDP= 0
##$COROFFS= 0
##$CY= 12.5
##$DATMOD= 1
##$DC= 0
##$DFILT= <>
##$DTYPP= 0
##$F1P= 14.0000005364418
##$F2P= -0.99999901652339
##$FCOR= 0.5
##$FTSIZE= 32768
##$FT_mod= 6
##$GAMMA= 0
##$GB= 0
##$INTBC= 1
##$INTSCL= 1
##$ISEN= 128
##$LB= 0.3
##$LEV0= 0
##$LPBIN= 0
##$MAXI= 10000
##$MC2= 0
##$MEAN= 0
##$ME_mod= 0
##$MI= 0
##$NCOEF= 0
##$NC_proc= -4
##$NLEV= 6
##$NOISF1= 0
##$NOISF2= 0
##$NSP= 0
##$NTH_PI= 0
##$NZP= 0
##$OFFSET= 16.45728
##$PC= 1
##$PHC0= -41.59529
##$PHC1= 2.60577
##$PH_mod= 1
##$PKNL= yes
##$PPARMOD= 0
##$PSCAL= 4
##$PSIGN= 0
##$REVERSE= no
##$SF= 250.130016185849
##$SI= 32768
##$SIGF1= 0
##$SIGF2= 0
##$SINO= 400
##$SIOLD= 32768
##$SREGLST= <1H.CDCl3>
##$SSB= 0
##$STSI= 32768
##$STSR= 0
##$SW_p= 5175.98343685301
##$SYMM= 0
##$S_DEV= 0
##$TDeff= 65536
##$TDoff= 0
##$TI= <Analysis number 999999
Compound Code 99
Book Reference 9
Project Code 9>
##$TILT= no
##$TM1= 0
##$TM2= 0
##$TOPLEV= 0
##$USERP1= <user>
##$USERP2= <user>
##$USERP3= <user>
##$USERP4= <user>
##$USERP5= <user>
##$WDW= 1
##$XDIM= 32768
##$YMAX_p= 392977605
##$YMIN_p= -151536
$$ End of Bruker specific parameters
$$ ---------------------------------
##NTUPLES= NMR SPECTRUM
##VAR_NAME=  FREQUENCY,     SPECTRUM/REAL,   SPECTRUM/IMAG
##SYMBOL=    X,             R,               I
##VAR_TYPE=  INDEPENDENT,   DEPENDENT,       DEPENDENT
##VAR_FORM=  AFFN,          ASDF,            ASDF
##VAR_DIM=   32768,         32768,           32768
##UNITS=     HZ,            ARBITRARY UNITS, ARBITRARY UNITS
##FACTOR=    0.157963299565203, 1,           1
##FIRST=     4116.45951400229, 0,            0
##LAST=      -1059.52392285072, 0,           0
##MIN=       -1059.52392285072, -151536,     0
##MAX=       4116.45951400229, 392977605,    0
$$ Real data points
##PAGE= N=1
##DATA TABLE= (X++(R..R)), XYDATA
$$ [...]
20258 -8914 -37041 -81891 -99680 -75205 -67668 -84362 -81022 -50081 -34207 -25228 -41374 4863
20246 4863 12690 22225 51285 47890 15250 9363 3235 -39936 -16881 44555 64362 65825 39031
20233 39031 -7718 -8433 2643 15042 -17695 27997 7841 -30907 -47944 -45271 -19875 -14460
20221 -14460 -23270 -14990 -18418 -13669 -4935 -58609 -52682 -28278 -27881 -48412 -109855 -99435 -38705
20208 -38705 12488 28612 22389 22989 17000 -881 2610 42975 42550 11402 25131 -11306 1274
20195 1274 27478 26126 3450 16988 30653 26347 31042 12339 -580 2529 7133 -19673 -26700
20182 -26700 10455 65797 103437 43624 7879 7380 -13724 1886 -8606 -35419 -45774 13224
20170 13224 2082 9237 17231 7125 46807 27126 -21018 -24650 -25441 -48367 -44134 -40199 -54209
20157 -54209 -80653 -58269 -53841 -9585 -2222 9892 21224 13126 -34144 5918 28070 27350 41784
20144 41784 19559 -16870 -2351 -10430 13959 13987 20796 29363 15926 -20859 -45435 -43580 -27199
20131 -27199 5893 14287 -2996 -8779 -2217 -2877 16284 -10727 -26630 -50555 -45575 -30088 -13917
20118 -13917 -3523 -8743 -20514 -14867 -24898 -29285 -41648 -39733 -26003 -20804 37762 58348 34286
20105 34286 50400 39863 33869 24515 33221 8734 21255 -1314 -3716 3009 -26963 -1011 30020
20092 30020 81348 51974 -13058 -34053 -32564 -26583 -13577 6973 3027 43983 40412 37658 33284
20079 33284 39770 6600 -29613 -44751 -31083 -16274 1907 -4543 -43083 -60862 -62942 -33118
20067 -33118 -50081 -45801 -17105 -47401 -48509 -22069 27355 13987 -5495 -13841 17146 26621
20055 26621 -11431 -37853 -72173 -94520 -60020 -13304 -16259 16293 17747 -1418 2435 -37384
20043 -37384 -37397 -53694 -47258 -44832 -66687 -36266 -19913 -5073 -16086 -22689 -42028 -28481 -25237
20030 -25237 -35469 -49758 -45874 -75698 -46262 2719 34293 50607 10254 -21125 -34382 -8705
20018 -8705 519 428 3227 -36638 -39898 -8139 -8221 -23282 -27148 -23238 -41950 -28693 -24740 -10044
20004 -10044 43945 61979 62790 32502 -592 -16537 -267 -35644 -49157 -64122 -92851 -55657
19992 -55657 -1676 -18454 4896 -4578 -26488 -23070 -10580 -5879 1321 11680 12910 37 20436
19979 20436 5004 -12816 -13413 27505 31815 -3624 -13514 -19790 2392 13703 9036 9500 5352
19966 5352 7782 20966 29625 33168 50475 37820 40290 12569 -9490 11843 48968 70010 58935
19953 58935 34414 27122 21002 37895 20915 3728 12554 18367 7849 -19174 -11105 34837 40405
19940 40405 5243 -58582 -63600 -47315 -51747 -63230 -44130 -13420 -8414 -15658 -18047 -15145 -16377
19927 -16377 -14577 -227 28629 10781 -25878 -49186 -56721 -16385 26890 41240 28826 2949
19915 2949 31411 6547 -1179 32738 6973 -4974 -4644 6066 19244 36073 685 -18821
19903 -18821 -56777 -58683 -1781 22136 -1847 -3741 -12392 -21319 -10629 5362 56588 77290
19891 77290 39735 15562 -915 24650 -6016 1907 14560 8410 29910 36126 18048 -8
19879 -8 -6070 -30514 -76222 -48431 -11110 34803 35524 16932 -3402 -35838 -16942 -19252 -46248
19866 -46248 -55872 -30092 9069 -11457 -19316 -9094 -18267 -40045 -49991 -25294 -53003 -37519
19854 -37519 -75702 -60360 991 27155 23461 4011 -10596 3600 -949 7319 -15577 -1154
19842 -1154 -30507 -49115 -25377 -33088 -31316 -13580 -12818 -9978 15532 18116 36117 40036 31700
19829 31700 44274 33313 9843 -46 -25035 -31659 6131 38199 48614 50479 48876 41699 4842
19816 4842 1449 -167 18766 22230 10462 -3089 -20969 -52024 -35071 -17462 -16783 26132 48563
19803 48563 36709 32343 53581 70881 86553 63059 14149 19706 35709 58925 37383 21198
19791 21198 16375 23688 2198 -21109 12045 6762 -18891 -24774 -42948 -75849 -55601 -13232
19779 -13232 -22014 9629 79918 53608 24771 -16477 -19983 32847 34637 50426 47446 55416 70587
19766 70587 90332 56033 23670 24666 41163 17044 -29660 -49879 -7041 30072 40231 8331
19754 8331 -8482 4264 10286 23795 -13141 -80686 -102617 -78513 -47401 -30458 -9211 10368
19742 10368 9309 11502 6740 12473 51350 27998 44308 31976 -18397 -48641 -40118 -21331 10842
19729 10842 38331 55415 2876 -23873 -15573 23266 1330 -20536 -26150 -36379 -46007 -34296
19717 -34296 -21429 23783 30431 -3799 689 3304 2892 11722 22428 8087 4176 -2659 31562
19704 31562 19495 11413 9825 38854 39093 28726 -14769 -19060 -132 3491 -11147 4387 3013
19691 3013 4895 28659 23600 8218 -20540 -42888 -7735 11359 31522 63307 63050 4760 -42980
19678 -42980 -37313 -11449 -16612 -21054 -29142 -10859 7672 38089 23616 -38732 -41026 -9718 -4062
19665 -4062 13782 52678 66628 48177 41376 63307 57674 42946 38486 43803 34893 18334 61482
19652 61482 120093 178199 208359 188076 156053 142652 174548 196430 188587 193117 185920 160734
19640 160734 182662 198519 176909 152733 77359 31753 -23158 8970 45355 45159 39045 37844
19628 37844 27446 24044 -5562 -30113 -26830 -2733 -16871 5339 23563 44805 50401 42847
19616 42847 29698 64115 68754 76616 90421 63344 55637 71553 83556 97200 79608 83474
19604 83474 133878 172254 150033 143669 209925 254076 241901 250800 205186 167923 195275 217157
19592 217157 210081 189864 170326 158254 137609 140626 140123 114988 100981 53037 15670 11072
19580 11072 -15039 -31447 -54956 -30525 -10867 21463 34007 43349 53483 61207 78502 89972
19568 89972 56311 41277 22153 10737 26110 36421 19810 -14483 -36817 3752 25840 20817
19556 20817 1322 17860 37496 24512 24125 37096 25122 16116 3950 27984 21828 15455 -9298
19543 -9298 -16254 8981 -18599 -8022 -32310 -17221 14500 63716 79551 86622 70457 50148
19531 50148 60783 40257 15842 11779 31423 4871 -20889 -34347 -62901 -71666 -34619 -5548
19519 -5548 22910 31080 11394 28777 61425 98830 110894 79114 55375 64616 91541 107226
19507 107226 78551 39592 41276 16409 16192 44328 48380 15814 14728 45617 73964 50006
19495 50006 29900 15624 13155 31488 43989 50765 60163 86601 68927 53188 75935 47996
19483 47996 38153 52584 14681 -9498 29474 70563 76370 29078 22645 61369 51928 48375 46694
19470 46694 50830 75624 42452 32374 44327 44186 42130 53350 21313 3194 19663 36520
19458 36520 43288 32125 59998 78169 45484 54403 114547 85045 63513 71020 70006 56298
19446 56298 42420 7880 7380 32371 62741 63077 61905 24304 -9013 12367 24061 19124 29381
19433 29381 29434 49857 66505 39850 20736 38517 40686 92444 107511 80756 65283 74985 91861
19420 91861 65923 20676 48494 55252 26057 35242 60315 14802 42460 89048 87188 50381
19408 50381 36358 52077 89610 104306 116834 81474 53483 45388 54631 42027 61067 77091
19396 77091 15495 19738 34831 38028 17334 24267 52441 59483 39559 32721 18664 11348 23718
19383 23718 46035 54329 34009 52663 62799 67174 63265 24351 34198 75133 73557 81504 84560
19370 84560 82971 107738 113139 106442 111368 81736 49894 33793 67048 104991 91076 113955
19358 113955 127891 99807 61599 75440 85092 73524 54973 59517 76389 85260 82936 130923
19346 130923 104711 96543 91190 103264 166076 142010 120693 125811 108481 76874 73562 88130
19334 88130 104119 101361 92616 94207 99787 76282 76056 59705 55888 93103 102016 98598 149245
19321 149245 187409 160497 127069 93707 105883 137424 118404 100859 100177 146023 161557 197190
19309 197190 179217 168794 186413 188065 167466 168775 189060 199899 199870 179328 159850 162664 169866
19296 169866 210463 227319 250790 282227 335098 469259 608161 764977 951319 1158114
19286 1158114 1276556 1285806 1182959 1058963 921260 850792 844822 949055 1070744 1175033
19276 1175033 1183387 1151920 1158487 1088093 948160 764888 595607 440710 348634 281345 239296
19265 239296 263440 236526 196096 166548 173488 197933 230329 287946 248659 186275 182286 184309
19253 184309 204871 237266 283360 278470 266090 309167 321127 355206 400289 447650 511571 627839
19241 627839 828981 1119119 1427397 1632308 1675432 1541047 1302285 1136171 1027969 1004299
19231 1004299 1084426 1248917 1429609 1563116 1619597 1551908 1382842 1159518 891420 701230
19221 701230 580386 483238 418304 321970 279040 292932 318507 288669 242876 231050 247749
19210 247749 299768 301813 294080 266336 258723 292533 352449 378486 386663 357453 358562 401961
19198 401961 407487 412380 440355 461506 468092 445652 423067 449868 467646 446178 462929 472832
19186 472832 493626 500081 487825 501029 469799 475324 470868 476580 456139 453022 432879 413365
19174 413365 407526 424839 482410 544599 546653 541941 582541 588889 586279 591984 612953 691782 792244
19161 792244 884156 961377 1046440 1138820 1215102 1296943 1331434 1349596 1366237 1417365 1515916
19150 1515916 1662790 1805083 1978884 2190772 2385998 2588595 2816520 3032497 3318333
19141 3318333 3740678 4351860 5194743 6361363 8123076 10821052 14832755 20256077 26131083
19132 26131083 30615342 33378400 35894547 39128250 41587693 42004331 41327878 40474686
19124 40474686 39324637 38011587 37110542 36275564 33705340 28691964 22560176 16865499
19116 16865499 12573437 9651551 7762955 6496584 5578506 4933360 4452331 4115591 3912679
19107 3912679 3773080 3687861 3587018 3493188 3398735 3306556 3223025 3171797 3185986 3251892 3351652
19096 3351652 3452699 3545832 3669053 3870022 4223109 4745990 5457750 6382528 7734707
19087 7734707 9750684 12905895 17672990 24269460 31705076 37994600 42307533 45074182
19079 45074182 45709407 43679294 40683762 39170975 40340525 42866418 44715712 45254825
19071 45254825 44039105 40096740 33427671 25838472 19110208 14011589 10514742 8203074
19063 8203074 6651794 5535791 4735772 4139432 3665790 3323573 3065282 2835324 2651183
19054 2651183 2515599 2318334 2124170 1941969 1770023 1610557 1480095 1379154 1318560 1231183
19044 1231183 1136806 1087045 1052081 991537 949362 905292 888960 887054 832229 757419 730033
19033 730033 720571 723307 685823 641107 577615 565704 570519 551377 498267 450261 406468 379180
19021 379180 325682 283564 280938 325738 342027 297036 266116 218348 222126 208265 219767 269939
19009 269939 296382 231341 197146 220797 219788 222028 270858 308863 340960 362436 379255 388229
18997 388229 339894 303307 286022 287770 320020 352790 368386 385885 364407 318230 277467 258146
18985 258146 241193 220671 217111 234837 261352 272765 206414 173930 137123 86764 98531 163372
18973 163372 221574 170694 156951 203163 230799 206781 209387 219103 183899 155715 157300 131006
18961 131006 78267 77840 121271 165527 197405 225257 248349 238424 235559 233936 258126 292345
18949 292345 258589 225198 217726 260007 257270 285497 301751 328338 365773 392910 374044 372102
18937 372102 336716 331443 293848 311237 335261 346904 356206 337337 329568 355913 418832 486998
18925 486998 608002 789215 922734 962921 923495 901687 905304 917839 946891 1034469 1189363
18914 1189363 1337010 1372883 1230452 1053756 943328 831819 690834 612006 645305 723947
18904 723947 819701 792347 717640 668358 561094 511098 457483 412605 355837 333598 304175
18893 304175 287652 292129 356500 393942 422127 493927 571673 671206 684928 622987 513946
18882 513946 431485 421706 447666 493976 568395 654182 849927 1073509 1368571 1722113 1944143
18871 1944143 1927879 1709297 1474350 1231616 1027346 940049 904944 994124 1210988 1474624
18861 1474624 1576356 1548715 1415037 1234693 1090627 906999 716663 561700 462545 426374
18851 426374 414728 341121 319390 314835 306213 293646 284579 231776 200475 192993 222915 257862
18839 257862 249615 220614 217973 224246 215724 190340 187718 212272 239645 244622 211812 236877 252852
18826 252852 232746 217541 218322 263473 295772 296122 295261 303726 294987 268053 221940 241290 253855
18813 253855 268117 304423 322016 323866 322484 344630 353726 372399 363332 333104 285777 280568
18801 280568 249304 231715 224258 217798 226374 244047 266965 343237 417322 487902 573221 636643
18789 636643 679245 647195 574829 495758 483457 472031 492128 525980 610633 733003 798416
18778 798416 800206 718119 627954 596364 556099 570657 554818 552095 534960 480624 535688 704426
18766 704426 843808 854145 759778 664025 635274 621579 586669 536715 500863 504205 525722
18755 525722 548132 542373 545568 584350 570649 605169 651792 727360 839962 981468 1221165
18744 1221165 1497057 1767014 1947095 1968995 1813963 1577124 1362608 1292286 1347144 1479470
18734 1479470 1715942 1924711 2064229 2038152 1875183 1611027 1410471 1285545 1182066 1095227
18724 1095227 1063617 1070001 1113302 1202749 1267254 1319408 1339936 1357594 1346442 1333739 1355893
18713 1355893 1404599 1518952 1635945 1768577 1896878 2029213 2202407 2520588 2967048 3591656
18703 3591656 4503858 5582455 6637110 7487275 8171469 8823020 9385357 9451849 8909684
18694 8909684 8040458 7237141 6882359 7149328 8106717 9561599 11399273 13577991 15414183
18685 15414183 16330444 16518279 15908847 14404620 12453612 10569009 8882477 7417971
18677 7417971 6323230 5653078 5258402 5049947 4963778 4900500 4872539 5023061 5232254 5481158
18667 5481158 5889444 6404403 6946304 7548593 8250672 9072142 9975244 11002734 12386645
18658 12386645 14473310 17781175 22835679 29909788 38659466 48179779 56635780 62496851
18650 62496851 66203168 69307179 72788791 76476520 80399373 80767215 74736734 66413256
18642 66413256 60776697 60701556 66484045 77688684 90928624 97942622 95186060 86297793
18634 86297793 74427572 62037096 50728256 40714059 32198348 25482991 20561853
18627 20561853 17145041 14862295 13216987 11899327 10883431 10188394 9751091 9464891
18619 9464891 9443453 9727457 10199461 10503792 10421897 10058851 9727478 9699616 10157942 11258856
18609 11258856 13229845 16463177 21452341 28624071 37544064 45529597 48372519 45129431
18601 45129431 38736742 32957588 30229653 31416344 36040010 41959371 45279807 43133987
18593 43133987 36602028 28658662 21924588 17344530 14514626 12350557 10310143 8499478
18585 8499478 7093559 6072541 5413794 5015578 4659219 4294432 3994419 3800635 3610397
18576 3610397 3439023 3315537 3253861 3268317 3373396 3584034 3865782 4020280 3966584 3828103
18566 3828103 3708951 3616591 3503471 3496724 3642498 4008469 4677543 5837329 7648900 10145991
18556 10145991 12978060 14893983 14803820 13131023 11003128 9444423 9013469 9868848 11671928
18547 11671928 13529261 14036873 12746029 10299861 7743218 5698700 4238856 3254874
18539 3254874 2635808 2263149 2000996 1823626 1655221 1523110 1414520 1344446 1283243 1204779
18529 1204779 1168157 1180272 1197832 1176265 1158180 1102609 1023867 917748 801247 756046 724329
18518 724329 731090 740882 817030 881307 888392 852151 831921 770097 681400 618751 617035 594122
18506 594122 578533 575215 581664 568927 571356 588721 609179 644703 627086 596769 562233 529012
18494 529012 514459 519940 511293 554825 552017 545998 629916 729412 872648 1079724 1336443 1553008
18482 1553008 1698229 1832435 1825585 1760785 1641564 1496868 1382311 1377474 1467114 1607656
18472 1607656 1746415 1853622 1854528 1752274 1589832 1388722 1207495 1052441 903074 788189
18462 788189 717742 641529 589650 578988 625675 634780 603075 617826 618882 607258 618206 573636
18450 573636 545748 543459 567045 620075 657582 744905 836908 975611 1099466 1215062 1379296
18439 1379296 1589163 1823706 2087909 2313785 2462544 2462313 2347926 2179473 2095920 2066961
18429 2066961 2075175 2067717 2076215 2073550 2046215 2029719 1936888 1820812 1722036 1615758 1541774 1467747
18417 1467747 1402004 1377170 1365017 1365862 1359712 1394515 1494537 1590512 1702891 1818431 1994359
18406 1994359 2195592 2431395 2749588 3194359 3791115 4700217 6034562 8042024 11093984
18397 11093984 15191033 19805670 24216408 26899485 26606201 24035078 20202912 16321363
18389 16321363 13143954 11003622 9896951 9761672 10613491 12413873 14880268 17418677
18381 17418677 19966075 22070406 22190307 20500654 18103768 15359711 12469049 9846673
18373 9846673 7790928 6382276 5504886 4920153 4503334 4191538 3968396 3863647 3812967
18364 3812967 3808697 3876795 4058070 4324559 4720837 5326261 6254824 7744441 10071103 13456858
18354 13456858 17760751 21679767 23381806 22493628 20271234 18473027 18371397 20153001
18346 20153001 23174729 26591607 29116300 29703067 29034432 27972019 27272677 27200862 26885421
18337 26885421 25591311 23786358 22101705 21262826 21240717 21891272 22900220 22674006 20832209
18328 20832209 18275427 15396150 12440780 9799884 7682330 6182425 5169271 4446515
18320 4446515 3902598 3557196 3312856 3158413 3081440 3061180 3074488 3128286 3152679 3203114
18310 3203114 3364543 3667790 4160531 4999505 6389823 8595071 11713803 15266630 18004604
18301 18004604 18456542 16659004 13762992 11006846 8927885 7609945 6925400 6812829
18293 6812829 7323303 8616878 10617253 12964271 15220446 16342146 15642937 13648537
18285 13648537 10950350 8238273 6102021 4558601 3509779 2800881 2293169 1935149
18277 1935149 1669298 1451554 1319131 1175941 1074422 989838 918088 828466 753729 711899
18267 711899 685725 627536 599521 653011 656701 655790 638890 600620 534955 469610 393577 316020
18255 316020 279475 307917 322525 330923 332492 355809 347754 396292 428903 464921 522968 588978
18243 588978 601303 552494 484302 419996 384737 325759 292524 284362 317384 330472 304140 298338
18231 298338 285496 261305 235316 185615 133866 123245 121153 152996 174419 194315 186023 141759
18219 141759 141064 148679 111934 75133 54750 83389 134437 135454 140046 144640 155887 159861 167431
18206 167431 160030 149961 115038 122746 125977 128322 147289 191308 215299 188189 147991 111453
18194 111453 121652 147648 163014 131102 123817 121302 111088 122780 133496 105883 98549 111046
18182 111046 111938 138923 176685 181307 181376 168460 146099 156829 179655 188746 256775 317875 359568
18169 359568 386508 375493 403936 381131 349701 339488 324036 306932 345847 394752 363421
18158 363421 331575 289762 228649 247636 259196 275819 286808 284203 289617 295267 231172 203166
18146 203166 241228 269945 272600 318707 392777 469979 504858 504448 513887 550853 548172 566463
18134 566463 564526 557654 616872 707231 823005 869761 868125 932851 1014334 1107491 1241932 1415676
18122 1415676 1616287 1844196 2114592 2482216 2961804 3522292 4222066 5206070 6636789
18113 6636789 8836136 12516954 18987936 31307128 54508820 80787667 78728055 60354564
18105 60354564 39040302 23863896 15464986 10760478 7895147 5994543 4702164 3780000
18097 3780000 3167061 2754995 2470939 2226840 2060463 1868773 1726662 1609876 1476190
18088 1476190 1317118 1218485 1124888 1043824 1006000 1004269 918310 767398 657477 597289 534833
18077 534833 447675 383494 380266 354225 329244 290153 264623 289535 298380 304228 300960 254722
18065 254722 178065 161344 172200 180143 153932 111148 71870 79084 72569 71956 74062 82691 57790
18052 57790 63200 107423 127473 133116 117496 126078 97488 83709 82531 79222 104112 123955 136546
18039 136546 130242 144755 137295 135640 141104 131860 168213 168216 134371 106294 104684 123386 99363
18026 99363 60088 38791 32808 50417 63188 55490 40053 26602 67504 98971 74745 8513
18014 8513 -30527 -10353 -13588 -7396 29014 15519 11915 23273 19509 15968 23421 2678 -6806
18001 -6806 -1210 20239 50287 37494 11682 9380 7739 -45326 -87656 -58852 -8053 -24836
17989 -24836 -7852 8216 17580 -33875 -29286 14891 6414 -45043 -41854 -32559 34929 77914 79122
17976 79122 110953 131700 109552 107792 60345 24405 22823 -19128 -35378 -17973 -17157 6626
17964 6626 18965 -12845 -21343 22901 10810 22609 40366 56806 65400 62267 19391 -38399
17952 -38399 -21675 36660 48645 71718 22846 8648 10296 -2165 15048 22374 52 442
17940 442 23643 40820 38954 20788 9769 -12876 -24207 2211 30380 20974 28988 29385 61937
17927 61937 54388 17515 4182 30655 11193 -25781 -25106 -8742 17908 32315 31835 62439 70375
17914 70375 48002 64867 77151 55971 48681 31958 12643 18617 5424 7253 31436 31897 -13202
17901 -13202 -23861 32758 48059 47435 65155 30443 32416 19413 9076 883 25570 18249 28421
17888 28421 21765 -8527 -697 -17493 -15529 -22639 -14456 38362 51566 -4283 -42087 -3452 68775
17875 68775 87571 80778 73613 65041 56422 51963 24163 -14241 -40528 -45568 -9771 -17555 -42156
17862 -42156 -41694 -59098 -58533 -58805 -42633 30594 76142 72559 41290 21961 48850 46665 34578
17849 34578 -1467 -36351 -48722 -54262 -15906 -14959 35162 76346 49337 44405 80150 70372 51696
17836 51696 25792 14364 43411 45245 44337 16152 -807 -37341 -13367 33169 91171 118879
17824 118879 90510 67721 73344 105953 113543 126818 125120 137242 143115 141156 123226 63723
17812 63723 39305 10617 -28720 -13055 34876 38186 54682 64601 33677 46790 71465 72996
17800 72996 38279 19286 36895 11838 -17123 -67711 -68599 -58553 -28480 9258 4654 -3797
17788 -3797 11533 73829 102504 103576 108423 81634 21226 41540 57174 22275 -979 -17899
17776 -17899 -20399 -15875 7791 10130 -29574 -16144 -616 37133 99873 144357 163267 111932
17764 111932 74609 31748 150 -31917 -41054 -39939 -35899 -57141 -86045 -96804 -51985 -60655
17752 -60655 -83722 -93554 -79010 -29270 -19671 -21762 -3901 -29643 -54701 -61305 -82536 -46671
17740 -46671 3958 6499 3639 -11539 -50311 -102983 -82315 -59827 -49206 -35462 -18933 -1624
17728 -1624 -170 13273 32985 31840 -25062 -56814 -72333 -64081 -97600 -105204 -74765 -30346 -53257
17715 -53257 -75057 -69241 -39715 -41659 -89409 -60393 -34068 -5144 18346 -92 -23339 -72426
17703 -72426 -92178 -64698 -66759 -46623 -52388 -49241 -51101 -37621 -46618 -41554 -46126 -43812 -11117
17690 -11117 26189 3843 -36500 -41527 -37178 -25043 10142 43942 74060 42844 -12229 -50287
17678 -50287 -65604 -93249 -75532 -55242 -50707 -8239 41968 69240 30861 -7791 -2213 4819
17666 4819 18998 35557 32565 -24860 -47476 -35168 -23449 -51471 -78083 -113415 -91321 -46405
17654 -46405 -39611 -35777 -45048 -19579 1147 -25744 -65159 -80187 -85853 -75743 -66611 -55912 -19388
17641 -19388 -11963 -27765 -42185 -24328 -59930 -77129 -81577 -52026 -44969 -87342 -116566 -111439
17629 -111439 -88922 -64399 -42233 -2672 -10503 -49237 -61748 -48245 -17948 -13285 -14103 -28732
17617 -28732 -27896 -56953 -100214 -93535 -73923 -64914 -67245 -78014 -36795 -22244 -50142 -62051 -84243
17604 -84243 -99660 -105797 -91059 -81841 -76475 -57184 -51413 -66191 -27618 -36809 -29551 -9129 -29065
17591 -29065 -15136 47837 52577 29947 13160 -20459 -14790 52262 32247 -11799 -39353 -40636
17579 -40636 -62430 -76882 -63364 -28103 -33790 -74466 -87145 -30192 -48377 -56803 -45550 -60716
17567 -60716 -56140 -38239 -38704 -41226 -29337 -7199 -20465 -11788 1182 6433 -10507 10542 -1348
17554 -1348 -1886 -34902 6730 -6663 -22341 9602 7337 -11998 -18696 -13155 -5194 -930 -21775
17541 -21775 -15356 -38696 -65003 -83319 -86881 -87065 -112489 -86482 -39065 -61334 -43010 -45308 -44166
17528 -44166 -43755 -41949 -26706 -17487 -55821 -31236 -4598 22354 28824 19257 43060 32077 28303
17515 28303 8399 -19803 -13949 -2603 30946 14368 18214 46411 15916 22309 4387 11731
17503 11731 -6389 -15046 -10246 17235 14128 2072 -20798 -43086 -77731 -42372 815 18221
17491 18221 -2852 -41993 -57045 -19585 20714 25686 1785 -10164 -42124 -88836 -60157 -40882
17479 -40882 -7405 3530 -48037 -78451 -72305 -63439 -49769 -15901 -11042 -54523 -53853 -1298 15398
17466 15398 -394 -36767 -55414 -43624 -38752 -27937 -21789 -3710 13555 -7241 -46141 -29427
17454 -29427 -2099 927 -1302 -2265 -6541 -35285 -25893 2543 32793 77630 115663 205689 350095
17441 350095 411682 356336 272691 171868 128453 95897 52706 -10011 -5956 -29841 -32092 2849
17429 2849 -13984 7536 73959 90314 56929 26074 32382 11386 2144 16891 13222 -30504
17417 -30504 -38430 -17995 -11937 -14034 -19530 -49023 -80750 -85732 -49412 -4908 -6429 -23665 -7871
17404 -7871 25405 22533 10593 21643 -21107 -73166 -88088 -63492 -27082 7366 -16998 -5498
17392 -5498 23767 25770 26909 1185 8389 -11778 -55494 -64003 -71044 -55112 -48731 -39333 -40411
17379 -40411 12326 -5199 -27726 -216 -19035 -21224 -58284 -75650 -73859 -18757 11977 8651
17367 8651 3473 -27276 -53507 -66041 -54001 -41181 -4138 -3516 -10135 -34648 -60010 -49735 -18026
17354 -18026 1164 22631 25430 36640 19780 2711 -33405 -55848 -37566 -44858 -68494 -58309
17342 -58309 -65622 -43103 -17708 -20128 -11161 -2208 82 -32830 -65664 -73752 -88067 -55819 -12448
17329 -12448 17279 -12562 -27019 -39778 -47986 -43416 -22978 -18790 2318 44579 65695 60848
17317 60848 49095 57720 23533 -10360 -917 -21265 -57191 -56142 -38070 -6436 32331 13506
17305 13506 -3781 -22074 -39680 -40782 -47803 -46603 -9513 -4625 -8866 15098 -24516 -27759 24500
17292 24500 18655 -11801 -39701 -35296 -13840 20214 8051 19258 41578 73394 65272 34190
17280 34190 -52306 -101589 -80699 -47145 2604 1671 -257 30435 -1852 -69013 -49030 -49983 -75408
17267 -75408 -79232 -51311 -61725 -54728 -27236 -47055 -48016 -46354 -30494 12981 41881 28341 -6676
17254 -6676 -39764 -32868 -43446 -32096 -17848 -23131 -25627 -40605 -40015 -10144 -32523 -37987 -61939
17241 -61939 -38986 10906 -14076 -43066 -32873 -43854 -76510 -61672 -30711 -27902 -59272 -83916
17229 -83916 -80817 -47917 -15274 -32881 -889 16155 11792 28907 31523 26686 -43273 -101770
17217 -101770 -110285 -66509 962 11283 -33622 -48659 -59926 -26008 -35822 -45229 -16571 -19840
17205 -19840 -26798 -22538 -18571 1678 10351 -18411 -40012 -10710 -18006 -37184 -12945 14726 -25040
17192 -25040 -62065 -43723 -12264 9904 3980 18616 16946 14262 -55666 -83511 -65340 -19183
17180 -19183 26444 5796 -5308 -3137 -8892 -28581 -33495 790 -17077 -12151 -24722 -12440
17168 -12440 -13827 -31223 -34109 -16505 -32383 -72167 -72030 -62491 -38756 -32029 -1558 -11188 -16377
17155 -16377 -8198 -2346 -8895 -20464 -30472 -52552 -62981 -66879 -32548 -33355 -37097 -31234 -37224
17142 -37224 -43366 -36863 -55360 -53922 -6645 -14054 -23806 -9929 -3825 -62559 -101596 -121320 -81935
17129 -81935 -91882 -85498 -61434 -38698 -65260 -71597 -45527 -43388 -54898 -31317 -45918 -87171
17117 -87171 -69732 -22491 19700 -4471 -37180 -54169 -58328 -54135 -42470 -9167 5803 -2872
17105 -2872 -686 -11528 23587 50156 55918 50247 5513 -9138 -5463 -11130 -31918 -36233 -31127
17092 -31127 -54730 -80506 -100366 -75622 -37926 -52648 -56247 -69231 -23204 -13008 -46632 -56497
17080 -56497 -65745 -63182 -61568 -18866 17105 7825 -49588 -79980 -67581 -23000 -37514 -38798 -12939
17067 -12939 20675 886 -8505 -2637 -15743 -1649 31811 51199 12592 -14082 -37152 -13861
17055 -13861 -25701 -14723 16497 -25016 -2377 23671 -1018 -29691 -3676 10890 -10037 -24890
17043 -24890 -9001 611 -24736 -66902 -65520 -59540 -73268 -79522 -79880 -34006 -48821 -55333 -66701
17030 -66701 -61091 -11024 27987 40724 37362 6678 -34633 -32201 -43658 -52614 -46710 -42465 -32277
17017 -32277 4343 -16624 -38183 -68586 -80992 -98615 -97235 -72313 -32954 504 33268 21390
17005 21390 14214 8500 664 3294 15913 8849 26714 13454 8245 19535 13170 -4874 17287
16992 17287 9930 -30457 -44780 -44325 -26450 8161 11029 -21 -234 -14355 15267 1363 -35919
16979 -35919 -52984 -71807 -29874 -18092 -35625 -20412 -31025 -26578 -25397 -9078 36207 54516
16967 54516 82420 41774 -9333 -14253 -29180 -37410 -28603 -20419 -22522 -45053 -27283 -18850 -17015
16954 -17015 -33695 4923 18063 15797 2559 -3726 -8825 -3684 -14689 -50275 -69252 -46583
16942 -46583 -8830 -6436 -21565 -23225 -1344 16744 8813 4440 7231 -10042 -11220 -14308 -18602
16929 -18602 -5033 -2589 2736 8648 -16616 -25467 -18587 -9030 -6981 -18741 1508 11174 -13664
16916 -13664 -31535 -66150 -55515 -42040 -68262 -57449 -47892 -76420 -52358 -5477 37221 -10041
16904 -10041 -8 35805 9277 -19501 -13028 4865 -7328 -24429 -34012 -44375 -20628 11808
16892 11808 7167 -13567 -38109 -46933 -34238 -23347 -54226 -30667 23120 7738 -25309 -32156
16880 -32156 -24061 -11566 15753 -8229 -34980 -19889 -34409 -24416 -26848 -36128 -99703 -104929 -58542
16867 -58542 -45734 -26347 -30527 -39979 -33730 -27513 -34751 -48675 -44186 -17415 -27511 -19637 -12129
16854 -12129 -4628 -9829 2687 2083 -5617 -24967 -9626 2416 10621 -10589 -32939 -27677 42716
16841 42716 76357 40038 -30879 16135 37297 25375 -651 -27328 -21377 -7794 -7816 -1500 15261
16828 15261 23745 27258 12649 -21680 -23352 -14296 -29515 -33429 -40883 -29477 -37427 -8746 2576
16815 2576 7192 34336 43802 21104 51440 50716 28442 16648 24652 20186 41715 39435 32914
16802 32914 23660 6385 2874 1824 5987 4913 1301 -8309 -39325 -31383 -27010 -8137 -4114 -52076
16788 -52076 -85481 -81958 -65352 -31904 -4007 -45720 -66447 -39007 -44211 -31479 1055 2219
16776 2219 16423 50035 38290 17816 -34845 -82295 -84114 -42985 6325 20418 -3453 -9033
16764 -9033 16723 36793 44678 38838 26408 -7428 2981 -24 -1524 -26470 -52337 -35972 6259
16751 6259 1483 22379 58236 73063 44570 34098 21715 -2138 32711 19089 -2282 -29715
16739 -29715 -13636 -513 891 -6245 -8617 -25807 -40928 -23278 -8898 -631 -37691 -56121
16727 -56121 -50244 -65807 -71773 -73876 -92482 -81953 -45275 -43545 -37914 -45617 -31006 -32820 -25787
16714 -25787 -26030 -55358 -64751 -41936 -9813 -14790 -50791 -43681 -40351 -58145 -63558 -87544 -87997
16701 -87997 -78084 -40673 -31859 -1281 10840 9313 7111 16192 -39203 -31347 -13487 10592 11953
16688 11953 17702 -581 -23582 -23578 4966 -20783 -38725 -20714 -11228 -45897 -12933 1513 -8573
16675 -8573 -27191 -53097 -56379 -33769 -71509 -93251 -94911 -66810 -49278 -11024 -7436 -51311
16663 -51311 -59526 -47546 -58371 -39040 -13898 -9103 18083 -567 18587 60993 76580 54219
16651 54219 27343 25960 12916 -6171 -14164 -35801 -15654 9520 -23780 -45684 -38793 -36838
16639 -36838 -41755 -33856 -31624 -11945 -15015 -44698 -77732 -64076 -15774 -33135 -21951 10584
16627 10584 37897 56033 48730 13177 9701 1754 -4196 -6364 -11042 -8432 -27053 -20777 -37014
16614 -37014 -6760 53677 55641 14729 15892 9561 -18974 -56083 -90618 -48701 -34540 -48276
16602 -48276 -64754 -76696 -30565 -41637 -60075 -50448 -50879 -43966 -56157 -74158 -44020 -20549
16590 -20549 -43233 -43293 -32514 -58782 -34631 -11040 -9568 -23151 -56019 -73378 -83493 -55156
16578 -55156 -31344 -36381 -46882 -20506 -10972 406 -20733 -10777 24154 38453 27591 1551
16566 1551 34757 -8769 -30266 -7927 13325 56082 59441 6920 -26575 -27827 -26571 -35390 -46916
16553 -46916 -18905 -40349 -63533 -67906 -56039 -44878 -16693 631 23460 12262 21229 7358
16541 7358 -33697 -35853 9278 37359 61233 61578 21068 12803 -13874 -11155 -31075 -38004 -19124
16528 -19124 -40054 -44541 -27997 -16552 -18210 -27827 -41706 -43211 -67396 -49901 -45997 -69394 -53022
16515 -53022 -64553 -72932 -58015 -15858 -36206 -48907 -6489 16197 -2013 -39835 -53763 -73452
16503 -73452 -70403 -72601 -64860 -35572 -21222 -9097 -27777 -31575 -17621 -23681 -78279 -79877 -73970
16490 -73970 -84115 -76731 -16673 1762 -8805 -18615 -18906 -4122 20181 -9618 -36088 -16219
16478 -16219 13761 -202 -47375 -56272 -41148 -40017 -79186 -98225 -85720 -76512 -68435 -69982 -70315
16465 -70315 -51241 -66047 -39183 -12758 8981 533 11963 19197 4317 -1076 6469 -12901
16453 -12901 -6770 4168 -33887 -21009 -4084 10781 14599 13518 35743 40554 49788 65888 47768
16440 47768 29856 -19497 -25024 -22841 -16041 7220 -6938 10152 2142 -14871 5182 12796 -5629
16427 -5629 -15063 -2262 20185 26930 4871 -21870 -19707 -5488 24196 -10183 -39072 -755
16415 -755 26029 20250 43605 49911 1352 -51352 -39284 1592 3558 37082 26906 -1480 -582
16402 -582 1502 12571 -19309 -7566 -18723 -9830 -1308 -30170 -31788 -63036 -62776 -47894 -16297
16389 -16297 -14483 -19535 -27775 -7868 8063 -14591 -42019 -11687 -12500 -4171 -24772 -38240 -39879
16376 -39879 -57623 -71219 -63727 -31360 -15059 2940 7718 -10556 7503 7556 6790 26436 45356
16363 45356 23018 27676 -19450 -50996 -48679 -43607 -32532 -9944 6223 -3922 -15445 -26475
16351 -26475 -10590 8834 11057 -5703 -27095 -3841 34307 43813 38256 -2807 -11262 -20774 -32895
16338 -32895 -17209 -13381 -23334 -2431 31583 57851 2633 -45127 -44921 -21056 8769 -4441
16326 -4441 -46184 -29508 16362 25127 18716 10696 -15570 -8336 1596 -11369 -4199 -53508 -72186
16313 -72186 -58305 -47451 -40118 -31815 -35274 -31039 -75440 -86643 93 9783 -8267 40852 40735
16300 40735 31530 -9884 -18179 266 -14143 11081 -25180 -52829 -40096 -33089 -11363 -60195
16288 -60195 -92213 -119692 -96550 -43705 -69440 -90562 -80388 -47442 -16853 -29460 -5624 -9717
16276 -9717 -20568 32504 43940 9578 -27 45261 51718 25242 -7115 -24227 -32016 -43140
16264 -43140 -62338 -38595 29223 69168 49886 36123 15175 6610 -29815 -65566 -39286 8195
16252 8195 -14442 5597 16052 3000 -4220 20391 49261 67715 42315 1540 -5230 39083
16240 39083 43909 22575 -768 -13784 13354 -19971 -22518 -11046 -19532 -31874 -20225 8134
16228 8134 10621 -29549 -38207 -43097 -13023 -2389 -41652 -47705 -62377 -52289 -47324 -77629 -50587
16215 -50587 -3951 -5721 8462 28752 -29464 -42185 988 2685 -7016 -25264 -15456 -10311 -48249
16202 -48249 -52009 -51270 -50992 -3676 -1521 -7817 25936 7867 240 -9953 -28198 -30163 -5726
16189 -5726 24462 42369 25129 18913 16118 55243 68838 41207 7215 3293 24425 56283
16177 56283 47268 68368 109479 114212 93540 49061 26263 19338 3143 3676 6299 43986 40624
16164 40624 -10690 -28898 -20635 -10342 23158 17228 10798 26771 2734 -14828 -3908 3102
16152 3102 38095 42481 20351 -2043 -11055 26276 23334 -15853 -20350 -1074 9186 10289 11707
16139 11707 16193 -9150 6089 19900 2855 9179 41214 19643 39065 42942 32809 -534
16127 -534 -27943 -34385 -56312 -14577 36092 43337 10927 -34837 -42338 -69923 -126644 -69251 22642
16114 22642 35197 8728 27838 36374 42977 8227 10465 -1247 16856 -5951 -5086 783 13333
16101 13333 524 -6844 -3399 49718 65426 61292 30262 29586 61311 68455 44894 22909 1456
16088 1456 15119 53618 29888 7541 -26298 -24260 -40247 -34924 -14807 -13860 -3912 8233 19328
16075 19328 22081 -15624 -24257 -6493 -28573 -27226 -30508 -33338 -13236 4013 34467 41801 27735
16062 27735 13170 8919 -8876 -19375 -4051 -9125 -8976 13599 38040 49822 32230 -3905
16050 -3905 -9331 -10943 -9286 -29815 -55614 -93512 -77257 -50317 3115 6707 -218 17585 10886
16037 10886 -12514 22218 6392 -21272 -22222 -19910 -42897 -56851 -29893 -49927 -68900 -60040
16025 -60040 -26887 -25294 -38460 -33015 -47047 -26899 -20534 -13463 -16016 1546 5046 8749 39655
16012 39655 46623 -8249 7960 44517 44652 27695 34566 25932 11931 10845 -12736 -21171 -24478
15999 -24478 -32915 19041 51381 11512 -11211 -36530 -41460 -67995 -31302 2907 -46142 -41432
15987 -41432 -15629 16948 21804 33938 25193 -13513 -14527 7326 -6668 -3203 -14436 -13842 -18803
15974 -18803 -1370 16160 2143 2725 8024 17819 3053 10962 -7892 4869 1552 -17247 -26444
15961 -26444 -21179 -25436 -11621 3703 36051 74075 45182 43663 50377 30781 10808 10231 -4028
15948 -4028 -27 17617 51744 79321 44020 48125 17565 21164 15453 -328 17898 9902 25397
15935 25397 48712 47159 27479 10114 23476 41772 82988 77108 78123 82315 81532 110479 87548
15922 87548 46325 43361 41920 9155 46820 16267 31445 33096 13888 6903 -18776 -37122
15910 -37122 -12017 -17943 -29370 -14637 -17948 -11912 -2067 12338 39151 19959 19810 27432 64065
15897 64065 95928 48845 10515 -17291 -33730 5398 30196 28490 54856 18768 -17252 -34960
15885 -34960 -7680 29758 27927 32082 62054 55948 23427 30429 57752 46499 23634 65784
15873 65784 65825 49061 58781 48134 6256 13013 44820 24935 16821 -13323 -35831 -48558 -34972
15860 -34972 -16608 3670 35555 23555 -5017 -56422 -99570 -90386 -83007 -34222 -48691 -20094
15848 -20094 39888 27885 41982 60986 34677 14840 4220 2538 11969 11301 7311 -2786 -5181
15835 -5181 5357 -23059 -24904 -10344 -20093 -11840 -6614 -12839 -7943 -43837 -43075 -34930 -33745 -28675
15821 -28675 -30049 -44481 -24647 1002 29763 15270 -30512 -39061 19891 66766 78964 86964
15809 86964 52070 37102 61400 68423 32970 10941 -8635 -17623 -5150 -24635 -38063 -19436
15797 -19436 21247 38071 24080 40019 34350 54356 36950 14264 5344 23363 34142 30430
15785 30430 -13778 -23983 -14394 27788 5613 -4307 -11462 -15417 -18367 -23249 45 -17112 -49034
15772 -49034 -47417 -44885 -46945 -41211 -68943 -58326 -24943 27303 19881 30065 28720 44727 51508
15759 51508 31541 -7642 -7338 21783 25226 17245 56308 83172 52683 -10839 -31071 2807
15747 2807 1204 -5768 28726 47450 29962 13099 28951 42572 78633 69990 47823 48634 36522
15734 36522 21143 22561 -2546 -14591 10903 23987 32968 2481 -33747 -12111 -1817 8857
15722 8857 -1747 31394 31574 18272 -4301 -33505 -40482 -3042 26056 48550 31388 21815 -476
15709 -476 29806 15822 8253 31599 57965 60101 23305 -1053 15238 32898 25525 9613 -4008
15696 -4008 2020 -6634 -12916 -15936 1813 41877 32760 31995 46343 51846 1412 -12058 -3742 15936
15682 15936 31246 2664 -39678 -31687 -39968 -56850 -73839 -71848 -50993 -27394 -44443 -12690
15670 -12690 -31321 -55275 -48546 -63495 -85196 -74404 -29688 3888 17208 -7888 3651 36038
15658 36038 57175 59597 105340 106503 87448 77127 79846 72535 66541 42763 17264 24330 19542
15645 19542 21546 15445 -40017 -68282 -63433 -7033 -17287 -43498 -49859 -22959 -19387 -1996 5514
15632 5514 8507 -7077 -31367 -27227 -19147 -31232 -34001 -24318 -24373 -13841 24482 3760 -10379
15619 -10379 44289 42852 43684 59324 45713 10618 -19822 -11844 -10411 -29537 -20483 4394 27617
15606 27617 7164 14183 24194 37367 31396 27915 42158 38549 27507 5150 11038 20309 -4563
15593 -4563 -4319 -5244 -12868 -20808 25792 35493 43081 34259 16603 351 -21511 -48427 -50098 -49829
15579 -49829 7194 19805 -8236 -26749 -8636 13146 11665 -41734 -32735 11195 -12118 -29413
15567 -29413 -24730 36745 74158 92205 67096 65210 60937 49379 28500 -13157 -38244 -22930
15555 -22930 -34666 -59574 -57428 -52141 -8783 24579 34190 16199 38429 65202 49698 38230
15543 38230 69941 60041 17275 17694 27121 9993 7784 16732 7915 13793 5807 5719 12251 -5858
15529 -5858 -16262 6411 41338 36810 14404 8333 27022 45948 57865 44660 30582 19725
15517 19725 -14694 -2972 30215 21879 16026 15316 11613 5271 -1226 -11342 -722 19458 50325
15504 50325 61839 47163 63395 70655 54664 46152 22452 10389 26267 22241 18684 31444
15492 31444 26208 39921 28319 10344 3334 8630 24338 -8008 -3550 -8234 -3981 -1550 33094
15479 33094 63234 62020 52330 33605 -3840 -14712 -33349 -34553 -7500 -5943 -15494 11235 26303
15466 26303 55439 43455 -12893 -20058 -12479 -19575 -3712 34891 35261 12896 -11234 -17793 -4996
15453 -4996 2798 -29097 -7654 15004 -7051 -9064 -23451 -35468 -31997 -45374 -40729 -29316 2713
15440 2713 20810 -1005 -24459 -50008 -36723 13849 42064 47810 13164 -12025 -59904 -64472
15428 -64472 -24085 24650 2552 -44983 -56275 -38343 13465 7492 -5599 -26093 -89347 -81520
15416 -81520 25648 70567 82516 78059 37395 4254 35964 43447 31052 25884 47379 78689
15404 78689 86767 83397 58751 72499 72221 60864 44171 7605 -10781 -2929 7078 -9083 12
15391 12 -20287 -24380 5466 353 -17883 -23728 -10526 30121 17186 -4733 -16844 5763 27703
15378 27703 45579 24585 22901 4769 -6463 8879 19493 2364 -31386 -21840 20784 52057
15366 52057 26807 -10194 -41079 -42421 -67711 -71016 -37554 -39052 17527 46966 61752 40742
15354 40742 -385 -5009 -11845 -29163 -50668 -56525 -24823 31134 36356 -9104 -35441 -37948 1729
15341 1729 41786 33112 5111 9722 21415 -18594 -34528 11686 48513 43497 33774 25903 -16989
15328 -16989 -45467 -54226 -70308 -46025 3071 12305 11189 -7787 17494 42898 53820 70105
15316 70105 71553 31183 15905 2626 6699 44558 80734 60443 29071 27003 12378 -503
15304 -503 -12968 -22701 3872 -23562 -2853 9579 -6103 -47900 -57086 -40714 -18045 -882
15292 -882 3242 -47204 -59181 -8605 -21451 4619 46769 34521 23204 28132 33400 35509 63363
15279 63363 62567 76136 69072 29027 20396 43656 53224 25276 -13167 -50711 -30045 187 34162
15266 34162 63989 45542 -11142 25240 39046 49069 40775 51416 54882 90431 93499 80971
15254 80971 98616 69585 59987 41882 43745 39111 49514 22499 12818 15855 48138 68365 38657
15241 38657 22798 22103 19283 12679 3341 -14621 -10197 26646 56817 24251 10936 14307 33937
15228 33937 58809 85453 103372 84449 68403 27872 9092 -7557 -52739 -33558 1277 35953
15216 35953 55188 20460 -2265 18507 12676 26083 -5712 -11025 -14614 5742 36708 -22415
15204 -22415 -46752 7091 43210 39629 -21493 -49286 -33105 -11687 -22135 -25480 10809 8935
15192 8935 -7138 870 20989 15405 26609 30614 -42872 -81417 -42334 9840 17650 20592 355
15179 355 -21674 -4860 -16515 -11781 169 -2277 -15772 10250 25067 -18662 -12160 -10884 9236
15166 9236 26806 51457 21099 10988 -5690 -5542 11506 -27973 -47003 -50704 -28608 17475
15154 17475 10334 -24571 -36178 -62191 -12494 34544 67526 41791 4100 -24083 -28144 -16371
15142 -16371 -1183 -27634 -95251 -90383 -62261 -24613 28602 6536 -25869 2407 8328 4345
15130 4345 27816 43520 48970 49570 28525 2242 12231 23956 34418 44629 29382 36964 63132
15117 63132 104212 107734 83738 48975 22068 42951 93935 91088 56870 69177 63124 33623
15105 33623 29238 49479 24032 16331 27712 26961 -22234 -24531 12604 53927 53523 40298 34012
15092 34012 71336 102587 128376 121111 108493 111627 125090 89352 44013 24211 18034 -20205
15080 -20205 12925 10002 -2440 7334 34821 37824 19685 19110 17456 95564 130297 113018 67869
15067 67869 44278 55238 50587 57476 31629 -14262 -23823 -8691 10198 49454 66032 107535
15055 107535 66547 32217 48666 42199 17174 15702 16257 -5482 16143 7813 -18755 -16251 -9053
15042 -9053 -8504 21240 43713 46646 39294 38145 11985 -8829 -19621 14079 12229 40713 75585
15029 75585 67418 58973 12522 -5971 2799 29854 41093 100608 122725 106370 59323 22750
15017 22750 8283 25320 18872 -21165 -17435 21439 23771 27053 25376 30821 12878 14595 19375
15004 19375 38857 57155 60444 38784 10435 -1758 2873 12439 34664 45059 37543 52577
14992 52577 64184 75701 48052 24453 40636 57342 29746 26628 23632 18641 8989 11667 34213
14979 34213 43050 62020 93368 81286 77730 107159 117599 76436 35093 15806 5821 40057
14967 40057 72221 67770 68709 82187 82399 96345 58467 45981 31349 24103 14488 50170 110090
14954 110090 160553 115562 74026 65756 64126 54778 53158 81502 121153 99643 85676 96217
14942 96217 82868 85897 102448 53392 45196 54407 47206 73723 88911 58571 68686 68291 44980
14929 44980 -7325 -16902 17117 72739 110251 117868 84282 72590 86823 80114 69333 95383
14917 95383 118803 128760 117120 86505 92887 119167 145672 154050 108023 54900 53517 73374
14905 73374 97442 119885 131545 119620 97473 120197 108820 86009 78895 101915 106687 122594
14893 122594 135864 191112 195485 194397 181085 129076 112934 157097 145262 115647 123455 105602
14881 105602 86033 99116 112884 137494 133558 130285 163061 191704 215650 254337 233837 194258
14869 194258 225391 270382 240263 213995 210673 224829 203946 189202 222714 214388 217029 238431
14857 238431 252306 250617 230416 208459 192690 198321 202885 227796 230018 216943 260480 265482
14845 265482 278390 285580 252890 258709 237922 175076 210681 246689 279503 283009 269506 242435
14833 242435 226186 251618 282275 314592 295391 339651 357082 367805 334041 313137 308446 319055
14821 319055 325243 293848 279712 228555 245632 300673 329290 330233 325399 326663 352821 386763
14809 386763 384626 369530 333373 259522 244793 269561 309778 379370 389155 340885 302172 312597
14797 312597 323747 368059 336721 293696 313166 312456 314898 316423 326081 345681 353120 338992 345249
14784 345249 363682 358838 375076 399903 413053 392211 365559 294099 290018 303965 297097 335652
14772 335652 344384 335110 309469 289663 300430 284151 257238 257142 277911 316604 301404 266758
14760 266758 288401 302730 282954 281646 283950 270391 262314 252765 247341 239579 217683 192766 214142
14747 214142 247198 245205 255753 249084 221278 233192 223431 211290 214019 230117 180961 132629
14735 132629 129002 157305 175752 166755 199025 245048 215846 227444 200383 172058 191704 222290
14723 222290 165908 121743 117416 169925 217832 207483 192450 185689 165395 191661 195982 169221
14711 169221 165407 164303 168362 175966 131935 128910 124428 100148 91362 88578 103737 117791 126120
14698 126120 105000 124818 129667 130554 113576 113676 101094 94608 73356 85221 100639 145969 124209
14685 124209 111268 96296 85728 76089 75060 117386 102557 75556 62470 59456 42835 25107
14673 25107 49644 75642 105010 136956 117297 102454 43139 -11844 -6338 24027 -6212 -13310
14661 -13310 41126 89303 88182 84165 71966 61014 39014 1622 13415 46908 55937 49895
14649 49895 38088 14267 2062 43541 57260 36724 65453 60770 35197 40444 5227 6067
14637 6067 5923 5019 46089 49941 70698 70188 71201 97030 48066 4816 39726 81140 55642
14624 55642 48634 43141 40513 55612 4284 5603 55910 76327 39663 32936 33589 52660 44473
14611 44473 40774 40165 68406 92832 104758 120929 116271 107464 96619 33173 34205 53315 36080
14598 36080 22099 53375 36289 13217 18942 22207 11055 13568 32741 62517 77040 54242
14586 54242 59783 92736 110833 94532 77626 85145 84065 64715 63135 55490 43301 38264 76153
14573 76153 99694 54771 -2125 1759 23490 4211 25154 26913 53977 57578 48775 7050
14561 7050 -7109 23977 -12131 -15535 -13179 -48117 -14260 5974 -8705 -6695 -21517 -31244 2954
14548 2954 42910 68475 78770 69518 35297 55938 58535 29967 61515 86158 72623 66807
14536 66807 83542 110169 110541 80184 51223 24461 3565 55688 55640 79176 52685 42000 22988
14523 22988 21791 69114 77607 63607 8277 -43340 -37063 -14767 10864 6293 -9913 6871
14511 6871 362 6334 14246 9589 -1890 12786 64442 66485 42759 6134 40825 87623 65632
14498 65632 21228 1542 -3764 9258 20759 29902 36461 26889 54619 38535 33044 37452 71418
14485 71418 92654 69665 62634 49938 46055 47180 -9234 -34606 6590 44222 21473 20038
14473 20038 25651 18309 28779 44981 32803 44306 45438 55895 56571 16823 11507 56032 68518
14460 68518 46485 39859 36695 40661 51208 54361 101839 108665 79419 66876 99434 109529 111942
14447 111942 107667 93398 84280 86399 66773 108164 96942 80135 73120 110063 126429 131772
14435 131772 126189 94063 83883 98496 79479 45507 70230 76573 61294 44877 48714 51435
14423 51435 51327 76431 89165 97041 89685 37272 -11439 12129 54801 62755 55043 63020 47464
14410 47464 21618 40445 29708 54426 43308 47600 37255 31010 30481 52681 53299 90946 124942
14397 124942 124595 93535 51406 37452 60544 72427 103486 130804 171242 186869 221682 237717
14385 237717 232809 239240 280689 350430 437273 524728 643586 747122 839121 922374 977649
14374 977649 1004146 991402 865716 710892 562415 458420 390938 316089 273708 204035 177096
14363 177096 200196 238660 233152 167097 137758 118151 121704 131825 154171 143784 102810 95756
14351 95756 74800 41394 61277 88402 137699 102422 80735 80479 72592 61333 44466 38796
14339 38796 12181 22464 47121 66328 82288 112658 102192 58331 43622 51420 73690 68639
14327 68639 55954 56484 57164 53972 20277 -2606 32716 52247 64923 53737 36653 75754 77793
14314 77793 71478 57897 65490 112625 104078 51316 52951 58934 41586 9461 15537 35541 38131
14301 38131 44585 38634 35563 48684 18207 38810 65297 60736 58205 40626 23451 44832 53557
14288 53557 24752 18419 47316 76760 84301 97958 137950 141984 116376 97991 59483 71847
14276 71847 76521 48247 39603 41817 50448 21113 69957 108558 113526 76973 62304 96007 98747
14263 98747 86580 31393 8995 46323 71884 70578 58685 56921 56464 35380 41877 75046 60507
14250 60507 32092 58029 72140 77043 59142 56940 55415 50045 39922 13515 -6765 31138
14238 31138 75832 61990 66607 79939 81713 45919 37920 58478 117586 129034 132822 147307
14226 147307 153136 128802 105669 102905 92613 94362 96297 73604 89994 77397 42288 47487
14214 47487 33759 6538 60420 95787 101799 76581 61403 39973 35141 31689 58408 92549
14202 92549 39045 43980 53375 61606 65643 22924 32391 52043 74380 50416 50988 39530 15011
14189 15011 9087 42075 88662 88198 69695 44537 252 22995 70304 85737 75158 56120
14177 56120 58416 45889 76042 104393 90949 103065 104314 69044 72195 63159 110574 71355
14165 71355 52517 83352 113278 141640 124260 78452 64318 111677 131776 130537 133157 118642
14153 118642 81753 80116 93479 64547 44437 47743 60233 85512 79704 46192 27743 17593
14141 17593 24427 58420 71043 46257 44642 42736 30427 56307 78572 91387 81749 69080
14129 69080 67499 30573 61608 89798 74979 51338 62914 58816 42650 46921 56463 61961 78392
14116 78392 50416 43409 39990 36786 67953 99924 46956 13782 19762 28641 14582 49216 76180
14103 76180 90052 78791 70527 72268 69347 87291 92655 96897 72865 42760 63223 109801 96279
14090 96279 109819 74369 57584 44638 52778 40490 40401 59441 34989 12448 52775 46831 37483
14077 37483 37262 37002 70306 115575 71304 41530 70969 109405 111752 115613 77171 82823 64104
14064 64104 47430 57213 63902 85869 87367 94173 72927 51234 19510 23552 26246 6112 447
14051 447 42527 61954 83909 49359 66177 78409 44616 16200 24427 54030 -1654 -9291
14039 -9291 -40493 21730 64881 45214 34723 39133 31478 53224 77475 82590 43638 22989
14027 22989 21612 40524 45060 64095 82927 99043 118522 116057 145198 145178 113281 124576 109291
14014 109291 91707 77565 61917 67431 47957 13804 3938 29929 62613 33642 48129 54315
14002 54315 61452 67128 75473 86161 89191 87034 114557 128042 133699 129888 122786 74645 71617
13989 71617 103235 65628 46776 40672 40931 26617 12511 30339 27634 23957 30391 30506 41251
13976 41251 28756 37721 31673 30517 31098 46251 71675 94412 119217 130941 116095 68919 37643
13963 37643 11926 20169 55452 97911 92059 79968 79322 51738 32452 33357 41056 56664 52576
13950 52576 22899 -5229 34773 56868 39308 44597 70682 61689 37705 62143 58859 52777
13938 52777 80174 29615 -469 20743 75201 66550 51769 74821 27476 8671 69551 103744
13926 103744 105826 97548 85625 87463 77891 77956 69006 105416 119572 89295 87883 100434 89219
13913 89219 110466 112719 60316 19788 54343 83153 47647 29309 43850 64623 72993 91282
13901 91282 85882 89398 117231 125747 105289 50902 24345 17565 56819 75210 75340 89190 116192
13888 116192 126690 111688 126608 180049 165818 114343 53260 48191 55624 49465 54160 50074
13876 50074 13962 17469 32189 59154 61372 73376 94238 98097 106723 98920 81208 70723 58913
13863 58913 53916 90576 109475 95715 64612 35498 28885 25549 38048 40818 75691 102269
13851 102269 114507 90538 81643 72029 83696 85812 73165 73812 74705 98671 107454 100583 87288
13838 87288 96179 83918 81397 89125 65923 50914 113554 147845 107792 97942 117347 120562 101640
13825 101640 52464 66579 86403 30116 30102 24307 32244 45212 72652 64328 93886 100182 66213
13812 66213 63497 30674 -4323 56942 95356 102659 86130 82326 59244 64532 66200 100595 119028
13799 119028 98965 58939 84946 97723 87221 49849 79727 101163 123479 103537 91485
13788 91485 114420 105532 63205 66240 86793 81019 89643 69443 73421 126251 155597 121901 105970
13775 105970 135251 148224 140740 132145 110399 100053 80895 100840 111385 83108 87199 104243
13763 104243 94198 87950 89624 104523 104927 51713 59125 78330 99117 98420 84400 72930 74468
13750 74468 69369 70503 50752 52089 62595 65321 30491 21559 28151 57557 88330 122838 186895
13737 186895 165370 120924 119407 130171 164131 182997 175467 181282 197648 198151 159856 140534
13725 140534 195792 226016 199655 206503 212988 236718 295117 381193 436863 514852 675832 801326
13713 801326 907129 987248 1014738 955314 880450 771502 662645 546194 418399 342177
13703 342177 297806 266572 237201 239302 270543 280599 241599 212877 204493 209064 240284 254468
13691 254468 260551 302570 349523 357216 370778 432130 504555 607346 758784 896422 965989
13680 965989 973408 936873 867930 791829 683899 530796 391837 367702 333679 290950 291780
13669 291780 258243 236271 191635 131470 109154 145942 160998 144462 166987 166760 150123 164342
13657 164342 137914 123283 145603 135799 147368 174669 202606 217588 196341 143246 129246 187070
13645 187070 243556 251331 231053 236444 229951 211296 213518 250698 322411 381969 403977 447503
13633 447503 508326 583819 677452 768227 876133 1007538 1111811 1191661 1175467 1106815 953580
13622 953580 807776 644537 521641 458994 416310 328936 302418 297953 297969 281217 251553 243704
13610 243704 257625 270452 277552 271880 316990 364289 387415 405061 452086 523725 605769 733808
13598 733808 888713 1015949 1111240 1095199 1044669 979605 874553 740163 611259 466462
13588 466462 430004 391216 313316 284447 265600 236364 197472 139902 131634 161386 192696 190153
13576 190153 202359 171916 143047 159017 154238 170554 194072 171412 148111 170847 206666 214021
13564 214021 192213 145079 127940 119294 116073 99078 110004 174310 197264 178840 162433 168051
13552 168051 167040 159325 171650 169764 142838 114281 88325 70660 107826 119215 171939 157309
13540 157309 133584 158289 138045 134826 168850 174741 170726 175670 155754 145062 165866 148663
13528 148663 192820 229842 190675 134931 116799 133423 161133 181039 171759 136124 165508 165943
13516 165943 109771 96695 107011 135038 173893 164360 135439 122691 122783 118434 119715 107335 122170
13503 122170 136979 127479 132166 143445 102942 112057 147641 155074 185934 189495 159248 143985
13491 143985 122511 123197 165192 173152 176057 158723 99799 84680 103747 105024 117224 129718
13479 129718 165258 154059 140407 171723 203913 229466 222603 236192 220141 155488 151053 117497
13467 117497 102508 155278 168383 192479 223908 245963 267271 303195 289870 310849 328331
13456 328331 321648 376866 406289 438906 493355 607056 757113 863811 938057 1033705 1120629
13445 1120629 1174482 1187350 1114291 1006992 928108 821013 717887 609317 532213 481487
13435 481487 392395 358186 368905 342930 336296 323323 316920 292623 279436 271830 254798 251098
13423 251098 279533 286038 264502 244995 237805 232408 208237 227454 227025 221923 264750 265474 269047
13410 269047 255377 245282 246245 255398 229450 216076 239026 235444 208204 207657 211929 236245 242587
13397 242587 244507 268448 273363 282986 252082 249038 213494 207337 195461 216088 205543 204375 237474
13384 237474 234937 226107 240106 222501 215479 212859 202128 181197 167095 182595 206348 211198
13372 211198 199040 193678 189769 189211 183081 151156 177677 188198 176211 173661 178497 207467 204742
13359 204742 177161 171041 167604 150484 134585 186581 176282 191054 199286 207613 221502 214681
13347 214681 237902 223863 159710 187174 208441 197865 203111 214302 235472 245909 185136 193374
13335 193374 210895 215373 215034 224661 202596 201659 195638 210583 202509 152708 141090 147153 147555 185331
13321 185331 230103 243972 231272 190510 170721 181701 207732 227475 211796 190043 180740 173183
13309 173183 169999 166415 176765 191117 199961 154690 152937 168416 183847 192155 203282 238301
13297 238301 282234 286652 250200 260748 289153 314627 299997 262177 218285 211573 247941 259591
13285 259591 243221 261073 252434 215455 217515 282484 291776 277337 288327 289960 267510 300290
13273 300290 332088 283587 239453 247711 283815 287134 259193 228879 255773 272100 283269 274131
13261 274131 261787 285794 298986 296513 272908 258724 238428 231009 219787 217985 266552 284882
13249 284882 247699 252405 280015 274468 270860 276496 298878 298177 284496 282453 291450 308223 331261
13236 331261 352889 319617 313796 297734 273826 232775 208841 235149 259628 319350 332533 297805
13224 297805 304288 328478 349070 339335 332645 354633 344199 324728 297551 276270 303453 315293
13212 315293 349858 325692 279125 237531 241680 275301 329748 398226 377314 354350 333413 301764
13200 301764 288380 289649 321319 337940 354921 368674 402560 427815 438265 412445 415195 393514
13188 393514 380179 418127 475353 444328 364792 381688 405249 400586 378164 369255 360014 410567
13176 410567 456093 465520 478569 467181 474375 480626 475486 461988 460826 456924 441623 430470 421069
13163 421069 442349 472120 508536 557803 560124 583833 537454 511473 486923 512629 514651 458084
13151 458084 433486 463813 501436 511365 578755 681251 806198 867255 860286 838412 846688 851749
13139 851749 880656 842163 795609 760962 739485 747960 733152 731201 674514 645784 681476 692299
13127 692299 656175 660191 711794 765599 784792 780603 802243 836243 821017 768646 796336 851376
13115 851376 830118 831985 821747 821607 811801 811005 875292 882574 854656 860636 891391 936664 924901
13102 924901 897695 922154 1010871 993768 985280 1025914 1038324 1028413 1079532 1130296 1178244 1195663
13090 1195663 1232074 1240779 1262177 1279658 1308852 1330871 1359176 1440761 1453465 1435662 1476026
13079 1476026 1538778 1555143 1624273 1686642 1763690 1812176 1855337 1921112 1961203 2019793 2093454
13068 2093454 2147582 2172586 2216912 2306731 2354828 2443451 2557145 2647835 2749335 2834335 2962497
13057 2962497 3142536 3303402 3463934 3635429 3852448 4049144 4222398 4460084 4738926
13048 4738926 5079456 5433885 5757793 6103519 6559416 7031878 7564077 8211990 8945054
13039 8945054 9791636 10759144 11896470 13183224 14752456 16573886 18602396 20896745
13031 20896745 23453351 26421453 29904578 34045006 39179384 45779008 54540362 66090409
13023 66090409 81075356 99893837 122123810 146366369 170339095 190839998 204185566
13016 204185566 207286303 198930853 180688797 156339957 130222752 105880211 85327668
13009 85327668 69044977 56627021 47332651 40361567 35050753 30920474 27599947 24787420
13001 24787420 22315493 20083825 18087853 16251400 14576367 13115375 11892356 10902653
12993 10902653 10066293 9258958 8447635 7696754 7050321 6450747 5918861 5481089 5102813
12984 5102813 4763768 4430317 4148874 3892096 3695800 3545122 3476544 3397052 3263319 3104788
12974 3104788 3009607 2952671 2870723 2800607 2696023 2542049 2472451 2402681 2331218 2331717 2286479
12963 2286479 2278864 2235918 2176284 2087779 1992913 1887483 1788235 1710510 1664764 1650064 1640636
12952 1640636 1602739 1587556 1540106 1449761 1327033 1287152 1264637 1217944 1163767 1119347 1066258
12941 1066258 1086327 1062211 1051325 1076074 1096193 1129811 1192763 1260283 1270968 1324854 1339541
12930 1339541 1351441 1280946 1183876 1080314 965484 845837 779354 769399 764592 729509 676807
12919 676807 639319 623430 639709 645287 591078 563830 545703 545072 555042 560533 557502 535129 528400
12906 528400 536797 517683 478484 432616 396828 405788 420450 425416 425399 407940 431840 432362 451845
12893 451845 476558 466029 458763 485976 528697 584239 629068 675541 678009 660120 688869 667456
12881 667456 587152 515658 465375 433492 467428 433190 387822 386907 376688 367215 383183 370039
12869 370039 370193 377367 394144 399572 412502 432658 465512 479179 479614 476156 433757 409692 398613
12856 398613 393613 396811 405646 416644 389987 348012 354208 355654 381101 398170 405093 437907 443898
12843 443898 447638 522614 659814 848432 1188646 1580817 1634995 1398525 1081116 817438
12833 817438 696414 604371 496295 448767 438928 391638 359659 374546 403931 405226 351207
12822 351207 315967 335729 323810 324090 348192 357869 365557 404543 393021 359565 356283 356300 370673
12809 370673 381562 387906 352718 357083 356698 379786 353677 359118 365351 358517 352451 344882 355652
12796 355652 355388 343580 341088 347037 352774 352739 379403 381155 414106 434175 408784 413426 413861 365980
12782 365980 362146 357026 364993 366187 366121 378894 402649 403183 395588 368317 356339 361141 388505 411775
12768 411775 389146 400996 407348 437918 463192 458900 482538 477415 460005 447359 464247 464564
12756 464564 484124 462833 450834 453253 461204 412290 395313 411335 391844 388431 435811 465797
12744 465797 461971 461607 489361 480333 421767 395881 418521 441379 468775 473863 486615 496480 498535
12731 498535 506365 477427 441786 431383 429015 468800 473790 436323 431604 421176 455169 469122
12719 469122 496587 469188 457720 473214 461716 468645 497442 472953 455159 467880 433244 384131
12707 384131 368058 390233 405422 406524 437552 471696 478215 477366 488138 505733 466726 436966
12695 436966 445328 495148 542183 551654 549482 554520 542684 559741 580600 566219 553258 539902
12683 539902 544281 553184 552597 545971 537564 525106 546880 578065 561415 550048 589388 590863 586007
12670 586007 617046 608408 562937 613619 710254 781620 800390 828516 856548 889791 927327 960702
12658 960702 980707 982270 1045297 1079981 1076311 1049427 1032254 982450 918510 892270 895163 914871
12646 914871 922971 917707 971987 996210 1035359 1025664 1025356 1058575 1098018 1194291 1325613 1444663
12634 1444663 1602911 1780166 1945445 2067799 2153697 2207568 2192701 2105209 1956783 1785988
12624 1785988 1650328 1557823 1483426 1458840 1452261 1436126 1383312 1343173 1341425 1332248 1340630 1343299
12612 1343299 1295171 1288557 1292280 1320712 1340431 1369193 1417717 1497297 1586963 1652901 1717695 1798864
12600 1798864 1849111 1862971 1883796 1914763 1962849 2056494 2154006 2243049 2350128 2442981 2586676
12589 2586676 2775788 3004580 3252168 3563881 3927834 4313162 4782894 5341093 5963929
12580 5963929 6574877 7024898 7244864 7369171 7378817 7255497 6925612 6485331 6046528 5686987
12570 5686987 5411856 5233541 5165165 5206495 5318398 5501683 5781975 6162466 6666041 7314326
12560 7314326 8092875 8824209 9402289 9945688 10560892 11411528 12421049 13526246 14588717
12551 14588717 15727956 17208524 19177966 21699821 24417183 27140358 30209321 34193909
12543 34193909 39883554 48004513 59146360 73656593 91365305 110181812 125208504
12536 125208504 130724380 125204469 111774484 95218348 79471080 66441608 56602895
12529 56602895 49626451 45060443 42435330 41432137 41989396 44084377 47823860 53430540
12521 53430540 60977195 69795710 78579349 85787896 90471578 92764876 93460062 93717380
12513 93717380 94793589 97865862 103574066 111746497 121199011 129817757 135138174 135335461
12505 135335461 130248818 121415941 111112698 101294448 93190258 87500251 84358122 83262128
12497 83262128 83515419 84388850 85195133 84982917 82674054 77807418 70914034 63317949 56363481
12488 56363481 50891447 47151601 45101552 44831771 46431175 50176356 56608181 66381560
12480 66381560 80021774 97267465 116460829 133784774 143512327 141048585 127086310
12473 127086310 106769501 85684044 67249714 52611851 41525658 33251269 27159675
12466 27159675 22657192 19237029 16657497 14654757 13041947 11732545 10604904 9622238
12458 9622238 8751002 7956824 7275033 6654486 6109142 5624720 5145824 4731321 4373432
12449 4373432 4029282 3753209 3509608 3282179 3063215 2845490 2674909 2541044 2405369
12440 2405369 2281389 2166759 2075477 1977020 1885032 1736570 1630991 1571518 1513087 1489262
12430 1489262 1422579 1386203 1370684 1334521 1266639 1191939 1103372 1054601 993539 946777 919315
12419 919315 888544 915835 907589 873969 839169 781568 732137 674137 676472 694616 720655 749236
12407 749236 777483 793913 787363 733529 678292 645431 595348 528463 480584 489020 539588 558879
12395 558879 532019 483679 504602 475725 449322 479282 531444 529640 500748 489332 466529 438290
12383 438290 393523 344014 371870 401528 376364 320348 361154 374770 383859 434090 423185 383364
12371 383364 399730 427400 405724 381014 386570 402815 403364 450217 477022 517993 583321 597488
12359 597488 599457 623837 651485 684364 662845 573879 484196 422172 356051 330217 327112 323035
12347 323035 340839 372905 407701 427783 432146 389158 324704 240190 202576 178107 154924 127809
12335 127809 151598 158241 125471 109207 104688 122689 145922 151735 157881 150420 150634 174350 162107
12322 162107 162888 132214 101790 116816 133685 153642 179392 149518 156731 169400 176946 166144
12310 166144 131266 98718 98142 150342 160868 164934 145398 110266 95349 122983 83927 102746
12298 102746 120664 72308 46694 96477 114016 134826 142772 125596 124573 159359 215487 202396
12286 202396 163684 154863 134895 120662 121340 108820 74865 57046 48136 99665 118608 106012
12274 106012 94707 120384 152312 142784 174393 244179 293259 243794 169744 143273 148520 163905
12262 163905 147939 150219 162573 192550 209319 208824 192990 167223 140857 129297 129059 131367 125160
12249 125160 140872 168843 135490 95928 98756 108495 97862 72868 69588 46914 67411 85472
12237 85472 105293 154795 156493 158199 143401 104529 113029 93507 71886 123843 195961 185480
12225 185480 183180 186045 172595 163879 150551 137031 116419 113795 100485 106072 138436 132038 92817
12212 92817 100812 132201 151198 166647 112802 67303 78727 110365 87003 83035 108346 124055
12200 124055 81017 82152 87847 107229 107737 75039 78267 81460 93141 104974 93534 62240 46512
12187 46512 35323 59303 31668 23828 39502 68690 65567 41229 32604 55411 50152 29262
12175 29262 35140 55909 61026 20235 -14189 34857 30321 44689 50631 20091 -20750 -8774
12163 -8774 -1290 -6848 35189 18794 -25492 -42137 14040 38331 30908 51345 61386 56916 30643
12150 30643 6600 5914 45209 93805 119141 133222 99648 91329 85282 85841 46276 15853 22462
12137 22462 47976 125691 109650 115441 90409 75725 83814 61683 34273 57884 55363 91945
12125 91945 119647 96922 57896 54368 71091 87540 74871 111991 146579 144421 129120 115433
12113 115433 94576 84291 67689 69434 113391 134302 114154 120106 157258 171415 156999 126011
12101 126011 141381 172916 158578 133774 161230 135518 148945 196417 158797 160523 201748 233242
12089 233242 250443 277967 266522 244818 251583 251737 273207 306851 340701 423812 518111 565694
12077 565694 677828 746642 764739 808832 826032 824685 849321 872637 879098 892790 943120 1043168
12065 1043168 1086112 1037743 951808 852116 773559 724397 776378 830809 871322 890680 885993
12054 885993 896114 940011 1019945 1101139 1128841 1169937 1218394 1232627 1270434 1308446 1262111
12043 1262111 1225845 1203627 1158122 1087104 1089500 1107780 1160590 1195709 1260734 1288469 1262756
12032 1262756 1224088 1191980 1162591 1076978 980890 936928 886106 853965 836700 819939 795748
12021 795748 775386 747071 775941 843474 916685 956008 1030558 1093951 1080655 1007536 936143
12010 936143 895969 864494 834190 814979 793932 784644 805633 773532 699599 622325 553583 507368
11998 507368 472439 409790 368989 356654 312996 292870 308157 293022 260450 250070 242898 213159
11986 213159 183171 186635 210143 207250 242241 263734 248113 208540 205516 218867 208849 185187
11974 185187 214926 280134 277799 242671 208752 222962 218917 196004 188656 217572 262767 281649
11962 281649 268699 246824 198668 216482 197964 199058 224114 266808 252270 218606 234137 245563
11950 245563 227879 222885 211222 216806 198113 175723 175070 152591 187487 183183 162247 175412
11938 175412 157600 173200 201143 241258 202418 183019 206862 228484 265495 274788 295983 233495
11926 233495 222277 214490 240308 262881 280592 299874 280712 270875 266432 279313 263021 230355
11914 230355 249362 274115 262686 259322 264791 315012 347801 358268 376609 371901 345720 317133
11902 317133 311595 312863 322109 300869 291901 300542 279958 277977 311258 286763 269894 277879 269397
11889 269397 280882 323292 351593 359385 317174 295062 302314 283847 276126 288562 287896 288218 299563
11876 299563 323569 392319 403072 393115 396527 389930 396079 393140 383029 370974 398777 438500
11864 438500 458611 482925 517113 600071 631365 635957 673753 724620 761593 810100 868422 899787
11852 899787 920566 914931 923247 915958 909333 867537 794299 729265 669833 632630 555166 487702
11840 487702 496423 511293 517414 496555 502097 507089 525581 572304 627606 641995 665898 703633
11828 703633 796299 886599 980444 1106164 1204143 1302355 1376202 1410709 1439212 1450332 1442141
11817 1442141 1339947 1243941 1161004 1033963 939236 864504 814908 779911 724344 685764 653120
11806 653120 647642 617208 610376 618818 611176 593968 619868 668042 696036 742563 802374 879788
11794 879788 944254 966487 1007137 1062407 1087769 1109217 1113384 1075406 1059539 1046526 1012271 1011628
11782 1011628 1062910 1161644 1292381 1451146 1624473 1761437 1834338 1858395 1904576 1941813
11772 1941813 1936140 1861559 1721367 1568461 1394390 1258878 1168102 1085390 1039031 985527 987933
11761 987933 1007023 992499 1015167 1065836 1183753 1351190 1500928 1705156 1950781 2154690
11751 2154690 2323673 2475509 2613987 2766203 2915095 3021008 3063682 2998977 2872369 2752658
11741 2752658 2657271 2558844 2471703 2373706 2247492 2056325 1865450 1730339 1585796 1425525
11731 1425525 1312749 1249714 1210935 1213519 1237982 1293485 1363878 1389509 1459072 1553622 1609346
11720 1609346 1665822 1766354 1842280 1918489 2010975 2084896 2121044 2202485 2218935 2168321 2086406
11709 2086406 1964061 1816746 1688804 1597623 1475154 1406729 1383552 1335558 1314717 1273100
11699 1273100 1286393 1318977 1381285 1474863 1495367 1554508 1617088 1636651 1634968 1620439 1606349
11688 1606349 1628525 1657280 1690694 1670923 1691285 1751342 1865654 1978389 2026882 2099668 2166253
11677 2166253 2172588 2209460 2277272 2302540 2264985 2289253 2372031 2446534 2528065 2599738 2653832
11666 2653832 2768970 2884410 3012153 3098539 3233147 3386293 3558754 3736442 3867190 4024081
11656 4024081 4196427 4376959 4556664 4799382 5069104 5415945 5860306 6329332 6780378
11647 6780378 7308348 7894325 8583058 9424389 10456551 11704321 13241387 15030316 17182719
11638 17182719 19816300 23109800 27349715 32923464 40412278 50493973 63920421 81050431
11630 81050431 101137919 121179359 135663168 139639643 132937795 119136701 102578543
11623 102578543 86504903 72694179 61853930 53958721 48713214 45772989 44711796
11616 44711796 45401546 48042225 52821524 59719239 67973610 76057402 82224096 85556798
11608 85556798 85905059 83919682 80851848 77922861 76582573 78125259 83452575 92903252
11600 92903252 106233873 121643782 135640886 144181055 144530917 136966957 124456274 110836425
11592 110836425 99309182 91541816 87617203 86526139 86964061 87491653 86667837 83451202
11584 83451202 77475400 69400614 60687403 52763067 46589301 42424101 40076932 39256590
11576 39256590 39814343 41895352 45812676 51860346 60404754 71661052 85294845 100061961
11568 100061961 113399274 121398684 120352960 109900176 93636866 76100966 60447812
11561 60447812 47841033 38254894 31056654 25649727 21589368 18508975 15991844 13968805
11553 13968805 12361508 10946286 9786246 8842385 8025856 7288972 6596646 6002649 5461778
11544 5461778 4981433 4579239 4202270 3850613 3594381 3324230 3142681 2934442 2737532
11535 2737532 2598483 2461669 2340566 2257638 2242749 2237025 2243616 2231265 2227246 2244448 2238435
11524 2238435 2245491 2268836 2256052 2219179 2202808 2122726 1978191 1827084 1723398 1617387 1446504
11513 1446504 1259691 1135729 1045125 942802 897221 904258 895537 896319 904292 854841 803328 796868
11501 796868 784253 800691 851612 925444 986638 1025826 1043748 1107316 1082114 1033241 1014525
11490 1014525 982709 956890 928649 880257 774710 663371 569385 515310 518340 531429 481264
11479 481264 491086 476407 440645 469676 462536 413493 406906 364425 357934 393263 365201 361940
11467 361940 398401 441676 489864 496976 503867 459911 390811 372461 356042 300113 268029 291375
11455 291375 307556 274613 276497 350560 370404 415926 453880 447764 451707 459728 391674 300638
11443 300638 257401 240062 230669 222015 256269 281868 314720 350477 336768 302170 259200 258455
11431 258455 273267 262552 247339 225129 179843 154344 104715 99038 81020 138219 214025 236280
11419 236280 221101 189715 146984 135384 150505 138092 161135 130084 89063 104164 148143
11408 148143 158203 186681 195205 239706 250045 231169 232486 246952 235556 290278 396226 493343
11396 493343 517896 506882 570561 680869 784505 947401 1147546 1401147 1698923 1955860
11386 1955860 2048017 1976554 1804662 1565329 1288137 1102400 962152 862686 799044 777242
11376 777242 780730 802850 832126 892814 982544 1103513 1252212 1352044 1402060 1402414 1367875 1322403
11364 1322403 1275625 1233198 1215943 1308396 1492070 1712180 1933215 2116507 2197935 2206799 2120390
11353 2120390 1923964 1698371 1542415 1407495 1374791 1345021 1360293 1375794 1400784 1377843
11343 1377843 1259097 1143635 1006109 865767 782999 705719 670707 622657 634302 690779
11333 690779 732497 837788 970818 1133958 1366562 1576961 1756547 1922206 1944043 1800189
11323 1800189 1572348 1273697 1026052 811758 628712 549853 472239 370451 294088 248989
11313 248989 268921 227754 199938 181301 169067 159575 138527 153369 152031 116629 110130 125700
11301 125700 107877 99071 85610 63118 72861 71792 71165 77688 99025 68963 24185 -15583 -8954
11288 -8954 -6326 6965 30175 22163 8503 5497 -10398 2277 -30960 -7210 -36383 -20729
11276 -20729 23352 44259 23826 -6196 -38580 -19253 21322 58068 45985 1669 -54697 -52186
11264 -52186 -62009 -71954 -73950 -42604 -21443 -11167 14940 -12794 28364 56338 25373 -22794
11252 -22794 -40911 -63409 -82059 -52952 -68801 -77074 -40165 -13087 4886 3203 5630 -35622
11240 -35622 -53795 -72814 -58409 -49742 -61269 -45459 -6350 14918 7877 8255 -6174 21861
11228 21861 50038 59119 59694 62151 60229 60728 53148 35527 -321 -753 -19971 -31603 -25356 -16884
11214 -16884 -9172 -1900 2287 -18593 6932 37852 33770 5829 -5987 12588 10722 59936 75255
11201 75255 44914 1352 -1305 4703 36844 37514 44046 70907 88733 66530 64144 60111 92325
11188 92325 167362 255122 345582 455780 551047 625870 645937 622385 563162 498015 452747
11177 452747 433297 371540 331554 304768 285352 254602 221299 214654 237895 307086 356169 373598
11165 373598 410518 427000 440482 466023 538163 521066 519881 527036 534770 560225 582448 644167
11153 644167 729711 782913 754367 703015 668827 627391 560620 517223 479719 451511 452099 489348
11141 489348 499645 471953 436556 431807 442007 367617 319250 359396 381251 362797 354067 379855
11129 379855 361874 340603 347209 400435 453029 542631 603470 629702 644566 602089 582620 522642
11117 522642 425971 333155 286373 236991 199028 150790 92682 89357 99903 81189 69969 51537
11105 51537 26399 10300 37015 59882 72453 71532 114786 111019 62960 28951 43706 36652
11093 36652 28457 47331 23835 1300 27625 22120 29602 36124 1223 -22941 -22514 5549 7535
11080 7535 42950 37802 17198 7665 -6894 -14997 -9409 28642 28241 -4996 7237 35629 -2061
11067 -2061 -22069 6947 30783 36764 23785 11238 40680 61969 88383 91587 68104 87633
11055 87633 66204 32652 26275 30675 38419 33685 29188 14540 23810 -12942 -31563 -19804 5844
11042 5844 40402 64957 69157 58320 61915 17741 27172 40573 -859 -53194 -53698 -28101 -332
11029 -332 -17543 -58450 -26965 2548 36512 27435 5585 18903 58307 55013 41202 34409 58749
11016 58749 61502 87476 96649 85763 96741 95533 61052 73425 66141 70030 80630 74833 66891
11003 66891 19018 8878 13424 2132 -1475 -7427 13867 -11115 -20574 -2643 -14731 8659
10991 8659 28853 29462 9995 11356 -16084 -32347 -32371 -9113 182 -16102 6369 52762 70238
10978 70238 57633 86265 60390 47312 30903 42156 25062 43246 46749 39517 31646 36126
10966 36126 16283 -20628 -30935 -1742 -15665 -37368 -33112 -16585 -1652 20805 31001 64786
10954 64786 105504 127992 125404 113466 89592 81036 86067 108423 134516 159854 107798 106895 140311
10941 140311 81710 55829 68703 82368 80517 58824 51414 79820 74994 56612 48149 41036
10929 41036 57602 48034 8698 -3533 32671 73367 69168 70454 67119 91537 91104 86447 70578
10916 70578 66796 69023 97351 94361 89096 94106 106917 144564 183666 201935 186901 176558 205123
10903 205123 212803 191197 191548 219905 235959 270997 310232 377399 461270 549495 652161 808824
10891 808824 1037251 1350422 1667088 1916476 2062412 2048812 1869300 1576793 1248463 945344
10881 945344 779798 649736 552987 491247 401524 321771 282258 258545 245124 183420 175364
10870 175364 215313 251206 255499 216817 211448 187356 172993 177623 140845 148895 132080 102688
10858 102688 103954 108901 133199 152245 170928 172044 148157 105027 88822 116581 110901 101599
10846 101599 107186 142839 131745 139673 127785 106087 106029 104765 115539 120833 126501 121291 145095
10833 145095 130954 98689 76818 92900 107669 121591 182869 187975 168195 151989 135462 152494
10821 152494 145414 137905 130910 107466 94711 106959 141271 170847 157585 130894 114212 113701
10809 113701 151982 165625 179143 148283 141935 158556 147212 116746 130796 133324 118415 73395
10797 73395 61561 110605 140777 131367 160567 146070 144167 141853 162947 149182 170150 174087
10785 174087 189614 174931 160936 120848 100516 83701 78909 65022 95855 100477 87608 74890
10773 74890 116993 177161 148700 133342 119871 144507 131612 119228 98992 107895 102217 74795
10761 74795 69919 103546 116062 157537 227290 250104 196933 210446 215710 172256 156320 168112
10749 168112 193041 207463 212097 179458 206682 214360 218182 248673 278570 249585 191711 160910
10737 160910 203465 224947 243189 226093 278130 311050 284453 314325 312402 271152 223162 241154
10725 241154 227650 214589 227723 242522 229125 212318 214303 212092 231410 276667 276350 223162
10713 223162 221561 265044 279237 277218 243373 239113 264799 285847 279645 260055 252762 239645
10701 239645 222238 189638 168205 171688 228412 283140 268469 290141 282970 293815 276712 260928
10689 260928 257348 253490 247622 230957 198637 206402 251078 278495 279750 298365 301504 271058 293072
10676 293072 301808 285217 258865 246899 244201 251201 255522 271455 304059 315506 309658 291663
10664 291663 302958 302975 279933 247217 251358 278258 333582 348770 383585 379091 361789 356698 394363
10651 394363 431739 444510 424960 412472 410623 425122 426799 423804 430122 408312 406525 396229
10639 396229 360227 352310 378245 402160 402485 391357 419492 419917 433842 473916 494036 479446
10627 479446 443792 417536 398930 383227 400645 422206 441183 416842 413569 449207 485759 493450
10615 493450 495111 518350 532379 581085 598770 594154 598104 616278 599173 597364 598187 558085 501396
10602 501396 441429 395968 403412 515853 652766 825862 982447 1135981 1203814 1205440 1171901
10591 1171901 1071022 1022878 991775 985163 996601 963518 952813 933559 921395 914982 892517
10580 892517 915321 922069 932448 953725 935266 889485 869835 904978 937513 921872 924123 898136
10568 898136 909523 965165 978354 1012766 1027286 1028978 1032819 1027869 1031197 1074220 1098968 1106550
10556 1106550 1136208 1187157 1219794 1239420 1287623 1333174 1355457 1382838 1435316 1473563 1507233
10545 1507233 1521122 1584691 1655115 1681673 1700513 1749334 1812760 1844581 1871126 1917067 1921757
10534 1921757 1966240 2017515 2108641 2207941 2286697 2355047 2400333 2471658 2496973 2515362 2579954
10523 2579954 2644088 2726258 2843398 2996750 3083609 3108065 3147044 3238646 3341467 3484587
10513 3484587 3656050 3840677 4010588 4118221 4306768 4516963 4706042 4961703 5239153
10504 5239153 5571168 5904434 6254396 6615471 7000051 7428488 7857905 8369718 8916373
10495 8916373 9520242 10208428 10988260 11896277 12971687 14226331 15678718 17304161 19087728
10486 19087728 20951302 22904214 25051390 27601824 30774965 34740992 39718103 45914398
10478 45914398 53677894 63562213 76427344 93527389 116635060 148233892 191112077
10471 191112077 246623526 310514215 367133338 392977605 376361998 327360916 266038538
10464 266038538 208585289 162090370 126901645 100839947 81521007 67034027 56107158
10457 56107158 47787539 41361348 36362032 32455967 29398271 26937933 25008571 23432055
10449 23432055 22063665 20856175 19818633 18962308 18223019 17407289 16435475 15222672 13823028
10440 13823028 12431110 11089915 9868176 8798367 7911950 7192245 6578888 6113945 5720606
10431 5720606 5345191 5031191 4736485 4462666 4242700 4029081 3906065 3749065 3600819
10422 3600819 3507716 3440935 3370903 3324055 3315522 3300490 3383825 3508820 3770597 4089470 4517107
10411 4517107 5058607 5623948 6224998 6688074 6859043 6683525 6204443 5512024 4748503
10402 4748503 4025876 3438469 2949297 2543874 2165710 1948091 1770342 1581283 1442433
10393 1442433 1322868 1224570 1176201 1149902 1110583 1082137 1045722 966151 905730 855011 833135
10382 833135 837682 831949 820708 765637 730587 717826 704562 697392 656777 607337 575629 570125
10370 570125 560741 557634 523171 533995 528328 463414 441970 435976 423038 395592 352875 319668
10358 319668 342875 364199 350984 312071 296524 309376 278011 258451 289521 298455 259799 278893
10346 278893 268360 209785 172745 146838 165683 257337 404057 529892 638081 721274 757251
10335 757251 726259 653517 577547 515477 426516 341657 259510 205531 189101 155442 174685
10324 174685 174468 182995 148858 158395 235034 214789 190603 226683 244524 186629 157591 184523
10312 184523 214281 194443 158428 179674 172399 126935 89497 95220 138707 151727 150578 133844
10300 133844 113591 108461 97160 80982 112910 116741 37447 -20313 -22090 12872 59112 43273
10288 43273 13357 40242 72321 93269 78825 88048 96777 113358 97420 123487 144532 165474
10276 165474 106091 47636 50291 104116 116075 98476 48241 35050 30435 49806 45197 8553
10264 8553 -43180 -29123 -11806 5116 -7495 -13899 6275 25855 9696 -3223 -23043 -17234
10252 -17234 -6138 -7380 10659 20320 8675 11632 7343 25456 67433 62126 68549 50353 60058
10239 60058 99231 116503 114836 144225 155905 166504 206756 228403 229932 311986 332778 289398
10227 289398 202854 161248 121130 110295 102397 97461 85174 70187 85073 86596 46171 40475
10215 40475 42499 73279 133981 140181 88584 53304 54102 6876 143 10816 51170 33023 31893
10202 31893 46635 25060 33652 53824 57997 59127 83874 79300 41543 11119 49836 59951
10190 59951 47207 25556 56449 69063 59271 20609 6502 5698 33913 36165 -7238 1612 17130
10177 17130 29362 36241 14104 -3323 1268 9165 2073 -3891 -1750 -6446 17008 80519 113038
10164 113038 98654 67332 57603 32886 45455 116681 158208 148815 147172 154084 139692 84633
10152 84633 40989 52894 80494 73069 41985 48628 34493 20910 -10507 -11974 -14568 -14007 -28738
10139 -28738 -69708 -30789 5308 10744 -12759 -23533 -31239 -28096 -25184 -18310 -39518 -11969 17782
10126 17782 41554 36640 6785 35287 68904 64087 43014 53371 12339 -10599 -38130 -69205
10114 -69205 -84182 -46087 -12530 -31585 -55663 -63379 -45909 -19326 -4536 -24278 -11048 1001
10102 1001 -18408 -45109 -7057 6413 -13257 16462 20726 20360 -14067 4229 -4236 20180 870
10089 870 -39158 -26913 -26944 -9750 -14296 -38181 -17821 -28678 -35019 4555 10130 -19226 29054
10076 29054 49935 49218 88529 99423 89925 47508 66402 93848 111671 69716 52624 79220
10064 79220 98870 131486 124364 108808 147867 131164 133343 166582 198768 187641 196586 247764
10052 247764 322038 405029 517777 629779 768192 977290 1268129 1597001 1908685 2040578
10042 2040578 1952458 1688292 1374793 1112866 868328 657158 528419 431158 385202 364137
10032 364137 342706 248532 199862 196484 180516 180242 192429 128996 92142 101167 91373 88995 86103
10019 86103 86141 67353 45608 44404 87598 90740 66325 46080 30479 51884 42999 13552 -41305
10006 -41305 -44095 -21631 -43233 -23708 -31 -13175 -13362 17672 30119 21293 24207 37996 45075
9993 45075 54769 69241 50648 57859 17126 17047 85889 107295 55744 61785 48444 52983 -5788
9980 -5788 -8628 -6350 -13799 -36441 -25865 10095 1153 8808 19341 -5995 10067 58507 86040
9967 86040 76919 79380 86875 66241 32645 26762 24848 32537 32872 19991 4424 -1580 -18537 -13148
9953 -13148 -17057 -22602 17929 7840 -6109 -21107 10964 26518 45766 51695 35665 28727 64403
9940 64403 73524 65526 18918 12906 3511 -27168 -48245 -60158 -66655 -4546 46693 19195 1463
9927 1463 40473 54594 27681 13164 -11123 -14979 2314 -1748 -4513 29004 80956 68379 62861
9914 62861 78103 90025 94101 40773 1273 21274 36059 49170 38448 54495 63229 33643
9902 33643 17987 30214 47974 48843 29474 26091 -6450 13761 36985 14356 23119 60558 68049
9889 68049 69125 74882 100731 98640 93795 102554 111471 111188 131910 115753 96025 77291 73657 91546
9875 91546 81142 84311 77308 57603 22259 18805 40592 71869 112586 117893 85744 80109 72975
9862 72975 85303 70324 62443 70572 88869 110582 100633 96071 72784 69883 69026 81164 107202
9849 107202 106459 75983 96405 135207 175827 189292 167368 143397 154247 130814 121167 134734
9837 134734 124240 86354 43139 34504 25589 9206 45496 60283 67022 98248 139434 109926
9825 109926 54183 46276 58767 66034 64627 70607 82794 66203 55415 29311 23567 18105 21166
9812 21166 38043 53625 92090 116871 101702 78091 72272 64343 103831 151650 156458 128356
9800 128356 163003 173715 175647 132241 129677 146123 110963 106459 102206 114430 104415 91480
9788 91480 73643 61447 51023 18446 72530 62893 43939 42938 39421 65766 110573 141656
9776 141656 147343 151073 160423 147076 129716 160791 153586 124739 125021 175871 149256 129823 126538
9763 126538 109499 136023 145243 102645 114401 117646 125744 158713 126129 108682 104302 114568
9751 114568 135978 139287 173079 175972 142665 94206 81210 69012 108671 169259 173669 145468
9739 145468 130139 143621 130294 141375 153818 155755 160274 158010 116939 120875 134387 140964 147484
9726 147484 113714 126250 144260 178052 160426 134643 103721 82998 60665 97742 138936 139424
9714 139424 109969 104834 101648 94037 84722 108048 119482 92716 97037 132497 166370 184577 185084
9701 185084 147621 111137 141403 153394 96051 76877 87827 101329 110323 125384 160366 182990
9689 182990 138190 123639 170012 188357 151991 163255 170595 174370 144408 128404 111935 131115
9677 131115 129365 117800 107353 123974 174364 154033 182776 215893 181643 169047 154343 164337
9665 164337 159185 164108 170576 137933 92047 118611 129929 131482 102649 84093 92961 149235 160998
9652 160998 178269 195489 172378 144775 137090 159094 160187 136789 134164 126813 143291 149130 125245
9639 125245 106749 126338 150035 152265 154830 167437 214196 218852 173197 125552 103341 116097
9627 116097 128230 140197 183333 216340 204550 217960 253743 262661 240104 220868 233519 250072
9615 250072 220511 177355 166675 184455 172271 158292 176403 224092 244505 248046 250906 238080
9603 238080 213158 182851 168047 188105 228154 253270 263614 280131 288519 269339 226697 219472
9591 219472 195407 222295 254549 235939 235863 223404 223856 239311 242926 258601 245842 207620 185275
9578 185275 211384 197194 181472 175282 198180 240960 230362 220625 216485 229444 230562 205975
9566 205975 204856 210191 209954 236290 244513 284489 292240 279155 265657 231375 160685 159181 174084
9553 174084 201110 211956 194579 156867 154943 220188 235669 226023 250771 252067 234000 272893
9541 272893 308140 314112 314590 327953 320344 304782 287297 320509 338474 347820 331159 296423 349270
9528 349270 374944 353857 323798 337907 340174 369713 392703 370530 349645 356568 379632 395963
9516 395963 428948 448626 425167 373767 349877 342759 329867 313970 312430 343859 369299 356857
9504 356857 335604 357935 385953 398012 416629 394682 367724 374032 333625 273824 268550 291271
9492 291271 320123 326219 291243 308333 329366 331455 301868 349132 377445 405499 398278 386994
9480 386994 405322 408023 408984 398162 413752 409699 389716 391788 360660 369256 349904 367352 370993
9467 370993 393035 422781 436283 433808 417438 431131 434159 457627 497172 516680 500651 505396
9455 505396 491466 463208 447682 456660 486157 478647 493457 512971 557002 575685 549299 516104
9443 516104 502244 482422 511516 503894 496436 466238 443271 486983 582151 647301 661509 598820
9431 598820 568454 575777 568592 571233 626017 654160 669351 679615 646844 682297 678115 655195
9419 655195 666515 699866 745158 759871 745905 733431 756469 782432 772625 746448 742159 759265
9407 759265 770467 783811 823324 842478 883523 856836 830626 834916 853823 876190 885073 842843
9395 842843 812922 833237 864824 878324 860154 892430 949173 973305 969360 1004140 1039112 1084905
9383 1084905 1088784 1074084 1052844 1042619 1084875 1108296 1155732 1179543 1199517 1226888 1251101 1253472
9371 1253472 1261789 1266126 1273338 1295524 1301989 1315532 1334392 1368612 1399294 1464771 1499452 1536855
9359 1536855 1497464 1509595 1552495 1561272 1589516 1634439 1688856 1698408 1748959 1783587 1783915 1787833
9347 1787833 1839310 1899988 1915188 1974327 2029241 2087943 2145487 2196072 2272056 2333609 2367044
9336 2367044 2392898 2438946 2490835 2531719 2592548 2648203 2754150 2853124 2884350 2972418 3071211
9325 3071211 3146252 3232499 3303432 3362599 3447732 3547947 3695013 3805665 3899527 3994355 4136669
9314 4136669 4354916 4506729 4645828 4807707 4966832 5155369 5302136 5479529 5739210 5969411
9304 5969411 6140731 6347186 6646522 6904623 7159547 7473620 7789693 8126872 8486475 8841688
9294 8841688 9235764 9637521 10105288 10586861 11080481 11648744 12253506 12903227 13517709 14154699
9284 14154699 14836634 15578245 16381878 17234260 18159252 19115363 20083814 21090072 22121072
9275 22121072 23140181 24140376 25210677 26304191 27290048 28244278 29188816 30051977 30789482
9266 30789482 31349307 31773064 32032559 32126151 32054874 31841575 31482442 30994023 30303687 29494134
9256 29494134 28646317 27734443 26752872 25705190 24627771 23553385 22498672 21422813 20399133
9247 20399133 19437387 18511235 17597260 16675736 15803720 15026641 14316946 13613108 12945344
9238 12945344 12341650 11751269 11174072 10626033 10126660 9648907 9198759 8781389 8395613
9229 8395613 8012662 7670765 7362305 7041391 6754992 6506305 6240241 5953600 5706064 5492356
9219 5492356 5269388 5087983 4886266 4667449 4490675 4359097 4224170 4074607 3957928 3806522
9209 3806522 3677854 3577909 3480200 3322115 3200829 3126629 3056050 2961647 2873703 2778869 2677574
9198 2677574 2590180 2576336 2551536 2452709 2334418 2286578 2252183 2165510 2120268 2054263 1970869
9187 1970869 1913023 1848462 1821258 1767691 1723109 1702858 1687334 1670130 1668752 1665488 1625975 1557036
9175 1557036 1519336 1515410 1478036 1455849 1399662 1312881 1294658 1266560 1255576 1257908 1255194 1235530
9163 1235530 1211358 1175704 1135820 1127406 1077263 1037266 1021433 1035363 1043424 1012630 976802 979482
9151 979482 974445 955988 925836 855489 850965 861226 886346 906796 880332 842386 799474 783264
9139 783264 766357 741338 754792 745202 716984 731875 730797 728397 704965 700387 681719 674883 670951
9126 670951 661846 665144 658975 631353 599574 573482 578778 602978 608760 577316 549284 532881 503704
9113 503704 483525 462861 468324 477308 488797 511185 515334 540086 517888 451616 433005 427187
9101 427187 434033 439481 444448 478599 484059 461845 416805 386804 371040 352239 361850 379425 404830
9088 404830 383312 365639 325043 280436 279323 311742 353713 393671 447273 480706 440876 379065
9076 379065 328770 293016 303619 288671 274086 301429 311848 287273 272382 258061 268637 275685
9064 275685 267113 280684 274225 272111 264747 274858 277608 281541 290307 320528 305688 280275 269735
9051 269735 265174 288297 263373 251259 241458 223487 227708 229956 200808 189819 200743 199328 205986
9038 205986 260000 285809 240554 208375 249631 268018 254620 236345 245403 281697 252469 213204
9026 213204 211616 244153 242846 278349 297473 271899 233597 250060 290230 300685 261318 182107
9014 182107 161557 163771 156651 166315 179261 173768 173000 159938 170268 194097 185090 181256 162100
9001 162100 174051 183086 181065 172633 148055 158827 169748 204748 231051 231867 210282 211271 208963
8988 208963 201622 182394 169877 151578 156644 171872 185760 205602 162864 155056 163358 176845
8976 176845 189015 164523 192281 181099 164449 183336 175572 137694 132389 153989 145948 118156
8964 118156 122951 134956 138848 140848 173435 184437 163685 137531 125575 95368 121172 186463
8952 186463 217092 210189 172440 116195 94096 78490 59829 70443 80502 94446 103933 113028
8940 113028 121837 100670 84271 79567 91178 114748 142283 137093 118471 133057 153663 129210
8928 129210 126008 124344 124957 134784 127154 95552 128250 133170 108720 102455 64733 51743 80196
8915 80196 69274 54647 56499 64713 134221 153994 138853 160942 135414 73344 61484 33309
8903 33309 14490 43126 68650 106585 146977 98889 62270 82908 116905 151556 169236 171107
8891 171107 198357 160417 114670 113660 118241 84159 50061 41916 77353 86576 97366 124245
8879 124245 129104 127803 86548 77220 127315 163373 118494 87583 105700 116550 137215 143135
8867 143135 94522 69308 114079 129917 119648 92635 71402 49890 75712 88490 81678 83827
8855 83827 82827 78643 93380 103076 132558 109334 70355 90833 130539 107622 80528 63449
8843 63449 88763 105644 76824 32940 30979 29508 48349 69220 113804 95760 104103 113471 101734
8830 101734 99442 118862 111187 117339 129640 113290 103615 91298 120733 131141 104351 102648 87645
8817 87645 79814 90008 61120 89637 58074 12120 197 -1732 36507 67072 41048 65595
8805 65595 37461 29254 69278 98805 110926 118688 130432 148095 131134 122806 123599 101559 139619
8792 139619 115880 102063 125758 131332 101507 87198 57702 48119 68577 68499 56857 89429 131596
8779 131596 117394 65032 36700 35024 88741 134679 130973 88742 92329 118093 97689 120180
8767 120180 133017 140063 123888 140342 178417 154488 133636 138176 141254 130637 113135 90638
8755 90638 73051 83760 87728 92617 105403 87701 59404 88071 93332 86862 65652 57459 47209
8742 47209 48382 58306 95208 77456 76472 82408 102919 97274 63837 46546 56545 88185 77135
8729 77135 69306 56580 58343 95805 74071 30109 51107 80629 92893 140011 113315 72731
8717 72731 51804 77744 84419 87532 72706 76500 66617 88307 102748 89757 103842 77457 63763
8704 63763 50809 21148 16259 19978 41618 63937 72620 82874 126738 139366 118551 77431
8692 77431 67302 49297 55239 68762 55762 57136 96562 111828 90803 63026 48214 47172
8680 47172 55831 57035 57842 58554 65093 43207 35477 79484 58724 48912 77830 107605 141959 180501
8666 180501 124092 79813 88702 84687 88169 83462 109738 136310 140704 138806 110282 93152 59428
8653 59428 67450 118871 138411 133159 135417 144756 87283 61870 51993 39694 42809 80437 112390
8640 112390 112356 80944 63819 40754 80567 155536 165322 140464 149979 140226 89262 56959 84734
8627 84734 56862 53698 92538 99283 82529 45432 49950 88688 143325 163697 140764 126708
8615 126708 102041 86704 108253 87111 77507 53351 69812 58927 62425 114245 142842 134822
8603 134822 129288 138713 179908 158021 137111 168118 192795 180348 137619 123733 143588 186525
8591 186525 168430 161381 171534 169653 134936 154343 157899 174648 180033 158932 187041 154370
8579 154370 157887 152034 103124 88019 96900 91549 67727 63551 74085 73824 103716 152851 134738
8566 134738 107938 118498 122654 91078 83366 70621 68298 58987 69520 82439 81729 50977 5580
8553 5580 27662 18109 5166 16163 79028 106649 101619 53878 68501 99873 108227 113076 137949
8540 137949 157943 175701 159834 132323 74436 91879 106139 76579 62480 44290 62900 59802
8528 59802 39769 31922 17473 17659 35477 35757 12061 -12187 1761 24850 51828 48909 37604
8515 37604 60495 73035 82254 86288 107991 66055 19324 45620 74934 73293 44923 32972
8503 32972 26346 68852 94302 114254 82221 70450 59617 21530 24433 28330 27721 61367 73887
8490 73887 93570 113340 127121 71307 46658 51541 49397 80834 88422 60862 30380 19154
8478 19154 56566 57637 62977 108431 95341 103175 142680 192289 270608 243453 148234 120137
8466 120137 93418 112766 131372 126720 91428 85383 116787 81271 41360 44637 71271 99736
8454 99736 76269 65780 80506 61165 45063 61075 67174 92547 91581 75114 22394 19875 22901
8441 22901 54145 80955 63166 38307 81840 107217 89945 108944 122385 127616 113784 154215
8429 154215 183225 238177 284751 294119 294139 277511 204774 153063 144746 138109 78287 50870 58109
8416 58109 40322 49931 62431 88765 114233 116151 103464 94413 105490 140700 111941 77415
8404 77415 90811 117567 144604 148506 143461 130404 112608 100444 87493 34518 -3730 19078
8392 19078 54400 61440 36365 41434 47635 64360 86788 118377 106527 119560 164388 196245
8380 196245 188482 183862 173345 154217 108131 86748 89787 60092 45356 18309 37357 41657
8368 41657 -22908 -43208 -13281 -14095 -25085 -41100 -31829 -23736 -11754 -10880 12471 39696 74590
8355 74590 106491 71487 -8933 10867 68706 98479 87786 69801 77811 115525 128660 115941
8343 115941 83317 61298 61886 59541 59219 82837 102224 122864 99295 84311 29253 15614 13223
8330 13223 7355 40765 29814 21351 7919 16737 17583 23131 33698 23921 2579 5254 15586
8317 15586 24501 47789 52830 38682 31850 24985 34482 6917 4924 32781 40535 67863 75348
8304 75348 51238 50626 50451 90250 98132 58993 26374 52497 76756 51330 43975 2763 21974
8291 21974 38653 73203 63683 36031 47601 43606 30950 49832 47091 56616 43528 20694 24454
8278 24454 22432 30802 41789 49657 44215 32821 45790 20570 -9273 -2382 -40116 -49149 -206
8265 -206 17837 57025 48869 42608 48182 38576 -5660 -35280 -40441 -13297 -17711 -12815 21449 3845
8251 3845 -13077 -22510 -18411 8890 -28851 -13643 348 -676 -9487 4750 33733 71859 28764
8238 28764 36172 38083 51934 22061 -9294 -15381 11176 21596 27308 -9102 -25813 -26918 -20645
8225 -20645 24054 33438 14604 14135 2832 -1697 -5822 -968 -6394 101 14398 9071 13260 31704
8211 31704 72070 51745 47550 34692 13078 26532 14240 -21369 -17831 29736 25784 14552
8199 14552 8677 16607 10026 19000 36175 6879 -49362 -78620 -92871 -76514 -29258 17462 57544
8186 57544 30123 -26152 -52872 -33417 -45300 -38515 -59637 -45727 -9085 4929 -4537 -40967
8174 -40967 -31669 888 5573 3319 26144 21212 -18600 11198 33128 27423 29383 41619 64285
8161 64285 60098 48970 30695 3457 25891 24005 -30014 -15721 -273 -9057 -19073 -12804 -25675
8148 -25675 -33625 -30399 -22390 -5701 9249 29708 20485 33130 33010 49254 60964 46266 45349
8135 45349 54141 10476 -41798 -26658 -2456 9441 -9309 4263 -13157 6311 32923 -3456
8123 -3456 -42173 -28800 -9383 -1252 -45701 -55999 -37648 20297 30336 71176 76415 39315
8111 39315 -41271 -37749 -29575 -21124 -4650 573 -13923 -34365 -57733 -65400 -39336 -44501 -61771
8098 -61771 -86894 -62141 -45194 -34186 -26664 25670 38847 9825 18395 631 -2319 -5436 -28726
8085 -28726 -9865 15610 25045 10217 13137 34896 6417 5132 13179 -3372 -24718 -27602 -6132
8072 -6132 1036 -17453 -26596 -17885 -41189 -25850 -15789 -25070 -54211 -70376 -31358 -41089 -92821
8059 -92821 -85515 -58081 -62982 -62758 -24638 10217 25602 -11644 -66121 -49721 -11999 9431 28774
8046 28774 21399 -27423 -52543 -46775 -33951 -9902 25640 42548 -10687 -63692 -81156 -65881
8034 -65881 -88434 -42365 -10631 -5568 20609 25967 11539 4332 -27043 -62530 -49982 -29352
8022 -29352 -28721 -43029 -9739 -7493 4409 38404 50106 7043 -6529 -24034 -34365 -5298
8010 -5298 34886 69846 83819 34921 24798 4021 14502 30261 -136 -48744 -73974 -64408
7998 -64408 -11858 -11703 -21734 -31961 -14472 4256 23460 16009 13052 21069 10712 24054 23437
7985 23437 -1639 -8669 -5381 1389 9974 -21179 -61388 -34272 -9397 25168 12685 -18794 -33106
7972 -33106 3630 9314 -25518 -53328 -50334 -43189 -55661 -80800 -70789 -33855 14023 10629 -1587
7959 -1587 -18736 -41124 -45659 -57513 -51807 -42150 -41004 -29423 -21164 1714 13959 19313 30912
7946 30912 22450 9601 -7853 -8795 -1421 -10915 -61579 -43396 -32644 -46089 -25883 4127 9356
7933 9356 -6490 -24687 -42546 -46391 -24320 -41094 4356 19275 12082 -16711 -17518 -2009 41647
7920 41647 57374 53482 56042 2897 -6136 27085 37621 20861 -15497 -13579 -15378 5297 -6436
7907 -6436 -13034 13116 -23315 -9079 -14543 -51142 -66694 -58364 -40723 -50147 -29936 -14788 7344
7894 7344 -9161 -2160 332 -36956 -43144 -77381 -76196 -60778 -14228 -4504 4002 11915 -4961
7881 -4961 -50775 -33721 25286 33095 10260 -6385 1998 34487 1402 -6277 15604 5801 -18111
7868 -18111 -19508 22763 37529 30909 22090 23385 4465 -1382 -26207 -22911 -12352 -40621 -16022
7855 -16022 -30189 -35926 -41346 -50283 -30160 -42564 -37270 5854 979 -3678 4330 -8914 1719
7842 1719 22521 57430 38173 -40407 -102429 -70270 -21804 -35740 -56399 -43667 -46654 -48776
7830 -48776 -30593 -20908 -65947 -69044 -36369 -22150 -52726 -66626 -52806 -29272 -45796 -32183
7818 -32183 -32773 -32390 -35228 -65145 -58836 -5943 773 23395 17898 22881 16229 -5405 -4845 -15332
7804 -15332 25811 54713 89520 80853 59889 33810 6979 -41731 -50723 -23369 -17925 -13177 -1297
7791 -1297 -33397 -25629 -36778 -39124 -47228 -41771 -9095 15370 25408 -7510 -35195 -29289 1497
7778 1497 7936 14937 13293 23281 33369 35015 4765 -16396 -26003 -71764 -79512 -56139 -49235 -29096
7764 -29096 -13032 -33469 -58652 -47560 -32066 -1983 26165 39608 23208 -21047 -37055 -43716
7752 -43716 -44818 -42347 -53489 -15618 -8283 -25012 2727 1829 -7538 -13098 -26280 -14782 4793
7739 4793 8749 17477 487 -25790 -45213 -36445 -46562 -26610 -23772 -30747 -35580 -25945 -20719 -29271
7725 -29271 -45436 -58447 -66858 -29248 29380 -14998 -22733 -14468 21760 17216 4715 -17089 3069
7712 3069 38830 33996 39272 45939 961 -27728 -53658 -22014 -1684 17875 32785 26611 10824
7699 10824 -38958 -85532 -46353 -7021 9328 -18497 -17906 28540 57366 28452 13930 38399
7687 38399 9169 -18837 -52120 -58343 -8263 139 15142 -2861 -43588 -76859 -93986 -99704
7675 -99704 -134177 -144852 -111346 -54916 -54123 -41198 -15763 13150 -1833 -7573 -18130 -20905 -30278
7662 -30278 -48353 -94549 -85373 -77036 -66522 -25010 17939 33804 19729 15558 -21196 -77974
7650 -77974 -80485 -87865 -80056 -45143 -43314 -26417 -21153 -12466 26919 46745 31115 -25872 -41409
7637 -41409 -43808 -65561 -49786 -38996 -17313 -28954 -60583 -57675 -32274 -61956 -56206 -64506 -84100
7624 -84100 -64231 -63173 -66176 -88359 -66325 -68642 -73289 -82187 -46592 -5457 20136 3114 -30037
7611 -30037 -74057 -67272 -80444 -82550 -50271 -9476 23834 62910 40367 143 -28848 -25620
7599 -25620 2049 30781 51023 46632 30654 6289 -24836 -16974 -33228 -53610 -46350 -19417
7587 -19417 -3025 16437 47434 26870 1698 9964 9611 -9493 16311 27436 21710 -5794 2152
7574 2152 18628 31172 31091 -12110 -40847 -31998 -41028 -49798 -36477 -16652 -8495 7485 -7197
7561 -7197 14802 41965 20130 4621 -26704 -21294 15428 2764 -6977 -31668 -37130 -35938 -21631
7548 -21631 -26645 -40443 -43088 -47077 -54291 -55749 -56844 -63209 -67739 -42192 -22130 -16183 -43401 -38718
7534 -38718 -50236 -71362 -76620 -82391 -81946 -62639 -48571 -22591 -22137 -42639 -49769 -81847 -80229
7521 -80229 -76816 -62204 -80259 -56580 -33480 -15656 -49677 -70719 -103521 -51025 -26220 -8559
7509 -8559 -19479 -3128 -4707 -12298 -10495 -2052 -31426 -46770 -30617 -44300 -77134 -79277 -51220
7496 -51220 -18805 -30661 -27954 -26950 -25485 -14596 1217 -19968 -2052 9921 5249 -19620 -18889
7483 -18889 -23610 -34461 -73879 -89011 -78834 -42125 -36320 -53975 -28345 -18803 6029 1761 1391
7470 1391 -13621 -14178 -19643 -39383 -51042 -65632 -44555 -42162 -64737 -55906 -24295 -28515 -41758
7457 -41758 -46559 -57552 -54122 -16901 -22107 -44902 -10265 -11485 -44706 -61263 -73628 -18512 -50769
7444 -50769 -63815 -39701 -19956 -30415 -33873 -61814 -23377 20123 8722 -43692 -62016 -36758
7432 -36758 -16134 -41166 -43383 -57652 -29388 7151 -12363 -47527 -53189 -66685 -49697 -10502
7420 -10502 18325 -10896 -12531 -13285 -17749 34319 43420 17992 5734 -5853 15015 9521 18082
7407 18082 13856 -16310 -17116 7008 8887 7967 -38765 -55761 -39963 -20124 -40117 -76447 -102673
7394 -102673 -91435 -87006 -61103 -27698 2476 -10810 -12219 17233 9651 -6982 5052 -24424
7382 -24424 -22682 -24958 -11507 -17985 -29154 -32207 -67990 -84560 -89027 -46300 3255 18046 11354
7369 11354 10764 6194 -3483 -14602 -34907 -40202 -51162 -17490 1360 -9654 -22637 -52112 -61778
7356 -61778 -73219 -50940 -9496 -8895 -23291 -10493 18046 -7621 -61009 -62535 -89994 -75478
7344 -75478 -39377 -15918 12862 -1613 -10401 -123 7217 24123 -14942 -73490 -83780 -74864
7332 -74864 -79808 -96671 -82477 -64988 -42742 -38768 -59224 -94144 -137160 -151536 -130548 -113952
7320 -113952 -58979 -50156 -34212 23633 24575 10860 -627 -2724 -1833 -10175 -32033 -24908 -22463
7307 -22463 -20137 4355 -10858 -42883 -68890 -52999 -17243 14939 -1360 -26636 -28835 -32255
7295 -32255 -17123 -8250 -16875 -15432 17306 16524 -8742 4400 14455 35198 26502 5260 -28232
7282 -28232 -12091 39611 53025 6753 -28753 -59664 -72025 -57742 -82634 -69745 -35505 -2689
7270 -2689 -22065 -18110 -6156 22761 33291 9111 -2128 13714 25256 16645 14083 29204 22634
7257 22634 -2796 -21621 -9366 -34644 -22472 -33492 -13585 -38629 -42193 -2728 44309 50699
7245 50699 42340 43268 38166 -17549 -31555 -48526 -89589 -45100 -26730 -42997 -15823 5691 -6368
7232 -6368 -14322 -41411 -26768 -15943 -1461 -12078 -49899 -55134 -27906 -21055 -24670 -10875 -1179
7219 -1179 5670 -22215 -22489 5110 -6418 6070 -26808 -8728 21286 47324 14567 -17460 -14036
7206 -14036 5547 -27305 -15657 -29485 -13407 -8096 9461 25750 21272 28208 32226 -1742 -20502
7193 -20502 -33578 -6336 -13328 -618 -15583 -36971 -25532 -36621 -85173 -128201 -103896 -79066
7181 -79066 -85143 -116041 -114146 -90860 -60418 -52859 -68144 -55123 -103375 -94235 -77835 -80074 -123985
7168 -123985 -108465 -70406 -51684 -32811 -14946 -29994 -25944 -34976 -19170 -4819 -50101 -35657
7156 -35657 -21954 -49202 -76510 -49101 -59065 -68875 -36736 23970 21521 20291 -7714 -37656 -13034
7143 -13034 10199 -19490 9119 27825 32109 34517 38114 -2169 -39873 -18501 23132 26302 11507
7130 11507 -31248 -24658 -9821 -30952 -5429 31195 -10899 -16697 6558 -15563 -39514 -46966
7118 -46966 -42173 -32435 -24795 3170 25704 44796 19966 -17223 -30229 -14229 6197 -19366
7106 -19366 -75694 -60250 -10328 -1597 -12831 -28388 -40295 6535 32641 8073 -38 -2385
7094 -2385 24398 -8481 -69208 -63086 -36050 -5975 -35176 -4062 23125 24661 23768 7646 -15671
7081 -15671 16860 7477 -39295 -23410 10416 10137 1055 6858 -44333 -83309 -35834 -20486 -16100
7068 -16100 -14571 -26243 -20361 -30142 -41961 -41411 330 -26889 -25185 6871 -12335 -38654 -48070
7055 -48070 -43663 -7374 -9516 -59012 -68755 -59864 -47972 -51337 -87370 -95924 -51745 -56598 -79459
7042 -79459 -61534 -2147 34908 8935 -25870 -72715 -86962 -88465 -55296 -81028 -84547 -61272
7030 -61272 -63001 -59386 -43539 -33712 -27516 -32908 -28627 -31044 -7654 22596 23750 50708 50327 -8429
7016 -8429 -34417 -16265 -13135 -5236 129 -6454 -1931 18034 -4009 -43121 -21982 -8142 -34746
7003 -34746 -70479 -65108 -53076 -49465 -59675 -63138 -70621 -80123 -71345 -29964 -12949 -16429 -25921
6990 -25921 -61892 -31689 -13909 -59370 -108352 -80690 -63173 -74823 -54142 -44636 -62480 -103644
6978 -103644 -110119 -87774 -73945 -52827 -55867 -40441 -12489 -31072 -41909 -59184 -40853 -32398
6966 -32398 -454 17374 66557 91010 66410 -4481 -2653 8958 -20099 -22851 -22609 -24802 -21749
6953 -21749 -32490 -17869 14866 29211 19299 -17721 -15252 10960 -3248 -21866 -65264 -68996
6941 -68996 -27468 16549 14591 412 -27663 -37428 -62466 -63925 -41698 -33249 -48181 -53153 -49801
6928 -49801 -47121 -104838 -103653 -71341 -71828 -38452 -28229 -10643 -15619 -24116 -8081 -24890 -33432
6915 -33432 -14125 -17523 -20800 -30505 -56245 -44655 -52323 -91460 -99224 -57073 -34655 -24830 -31630
6902 -31630 -19136 -32200 -70186 -87075 -82586 -62516 -39151 -61516 -79433 -60285 -41317 -52627
6890 -52627 -60751 -39794 -43960 -48840 -69004 -64948 -87411 -76686 -66771 -49833 -53034 -76883 -53126
6877 -53126 -16973 -10743 -34798 -23051 -6104 21538 -1891 19054 85727 58190 41296 3273
6865 3273 5995 18405 22780 -252 -8930 10576 24660 -9232 -37583 -15705 -30067 -4708 -7633
6852 -7633 -13457 -24000 -2210 -83 -16237 -16158 -18465 -3399 28271 30581 3947 23448 19574 31944
6838 31944 5456 26844 58372 69548 40429 19575 26787 37539 12528 31696 39516 32170
6826 32170 24711 11258 -30959 -40787 6049 34942 34596 24566 52433 38700 4129 -15528 -27181
6813 -27181 -15476 -3134 -6542 -26239 -58567 -53732 -27080 -20453 -40676 -102978 -116583 -62761
6801 -62761 -22590 -6617 -21558 -76669 -90666 -69186 -30571 -58990 -91917 -56736 -17975 -14818
6789 -14818 -1260 -2620 -9451 -41049 -49093 -69835 -61710 -34667 -22990 10477 32980 61156 33979
6776 33979 -28983 -24513 -35770 -38117 -25746 -52824 -62870 -33274 -23357 -53069 -48199 -15038 11860
6763 11860 -5268 -17740 3131 24054 7970 6262 -4462 -24153 -8906 -5205 -20296 -9964
6751 -9964 -4714 -20447 -22028 -20910 -43134 -38404 -20825 -14625 6391 3057 35090 51665 34482
6738 34482 72475 84917 79298 57504 66986 50253 60787 91442 74294 5603 -6163 15437
6726 15437 8873 -4766 29208 38642 42192 58137 41709 44379 96830 170315 214602 263418 335492
6713 335492 428329 595065 839202 1203120 1754000 2218421 2165444 1732341 1225405 826911
6703 826911 541745 397625 295059 217228 160357 120642 84487 33679 -5581 -30509 -11658
6692 -11658 -22438 -32390 -17705 9412 -10092 -11802 13152 52162 42165 41829 56856 36745 62036
6679 62036 23517 -20562 -49176 -57740 -28257 8204 28772 16811 29301 38202 13453 13011 14601
6666 14601 14810 14837 30497 -10891 -25636 -14759 -19834 -18624 20192 40683 22933 37728 18128
6653 18128 -18709 -25948 -4131 -24403 -26649 -19104 -17706 -7436 -11568 -59016 -51932 -28789 -47298
6640 -47298 -47933 -14927 -13796 -5158 22304 44607 42687 65997 75845 72971 30428 -22740 -39801
6627 -39801 -29861 -61678 -91640 -77689 -46526 9514 10934 -12864 -15289 -1953 -14866 -10518 -39105
6614 -39105 -62450 -66013 -73103 -82146 -47828 -49634 -33310 -21605 -33362 -55267 -50377 -76909 -82324
6601 -82324 -52630 -48197 -4802 1352 -7641 13507 61410 43943 15487 -1 -31550 -19089
6589 -19089 8962 -6929 -13263 -9041 -27885 -53957 -57513 -64917 -63716 -83207 -85610 -53926 -18629
6576 -18629 -27613 16319 23781 8657 32524 46304 31923 31018 29532 19845 12604 -31207 -50138
6563 -50138 -6474 39333 8930 -9453 20090 -20704 -80660 -78953 -44177 1211 11200 32429
6551 32429 9655 -28109 -15776 5063 23008 36521 37196 1029 -27715 -13857 -34386 -73948
6539 -73948 -85688 -139025 -150660 -104853 -97921 -93118 -60402 -26185 -5220 -25680 -72674 -75531
6527 -75531 -60996 -20258 -19654 -49057 -48000 -379 33493 54022 24398 -7621 -14651 -24562 -31177
6514 -31177 -48265 -95892 -48920 -41682 -82332 -111209 -74955 -27723 -1308 -14576 -28838 -62678
6502 -62678 -99172 -70949 -22981 -5409 -6240 -29094 2968 6669 9353 15859 18561 1350 33357
6489 33357 21884 -11711 -40019 -74049 -11664 32892 25503 -2261 -42576 -51258 -39224 8365
6477 8365 12973 -15002 -1556 19873 59162 89104 88445 57106 33066 4380 -17485 -24770 -18781
6464 -18781 -19092 -15442 -27411 -19216 -32382 -61338 -59867 -52445 -33874 -40709 -46361 -67340 -84508
6451 -84508 -58557 -30902 -56106 -85120 -127840 -103175 -91126 -91530 -77944 -86826 -80957 -58667 -49593
6438 -49593 -38010 -42864 -36980 -6743 -23013 -24916 -11422 -34674 -10910 -30278 -5133 -1925 -5227
6425 -5227 1597 39874 31654 6406 -9552 -5160 11110 23701 30829 23598 -19277 -11206 2304
6412 2304 -10194 -28988 -41522 -31421 -39512 -18072 -47773 -66512 -43947 -15665 -7149 -28559
6400 -28559 -74050 -35560 -25850 -61306 -58709 -67495 -37840 2373 -4709 -30457 -44386 -61787 -61518
6387 -61518 -31310 -39074 -52955 -46085 -29988 -15514 -12471 -39298 -74401 -53423 -44355 2304 36033
6374 36033 30290 35172 5542 -53347 -86715 -64832 -23236 -22615 -18836 4635 -601 -27194 -34917
6361 -34917 -16142 10767 7962 8802 9901 21980 -16683 -45477 -55974 -103209 -112182 -111828 -91209
6348 -91209 -68149 -27937 -34674 5838 -8205 -31897 -60721 -51029 -33146 -37704 4185 31900
6336 31900 2602 -56556 -72456 -62210 -42062 -10534 303 24704 12729 -2104 -5372 -30822
6324 -30822 -31364 -38305 -21537 -28771 -3829 2250 -6448 11984 18954 15339 5411 -19091 -52414 -70424
6310 -70424 -41905 -3325 15754 -7178 -43008 -35827 -41638 -35350 -2730 -18601 -38760 -41152 -30897
6297 -30897 -22303 9703 25345 -10750 -22830 -17868 -33886 -41936 -6030 28088 10821 -8997
6285 -8997 -8073 -17967 -7822 -8057 9776 52805 61420 37644 20977 25318 2022 -32214 -48626
6272 -48626 -21882 -43866 -38572 -43352 -47850 -69210 -93989 -95084 -79154 -37203 6916 -11734 4375
6259 4375 -7059 -28365 -28129 -68295 -44133 -36762 -32851 -48587 -47012 -38119 -54989 -59999 -67112 -49730
6245 -49730 -4851 -9267 -3083 2351 -9515 -27279 -36488 11775 2758 -8975 7327 43372 38864
6232 38864 11453 -11393 4755 21611 8459 -2657 5483 1631 -16195 -16813 -2198 -8133 429
6219 429 -10889 -39624 -39301 -36099 -26182 -22685 -38099 -33238 -8347 -12725 18249 18053 40432 60461
6205 60461 47227 58881 43420 49472 29897 22971 19097 13058 10501 23867 -8366 -19914 -26697
6192 -26697 -55866 -33520 -21719 -24724 -13559 -5519 -36956 -50481 -23153 21268 28350 28324 -12133
6179 -12133 -40860 -16260 37096 23097 30716 59420 16675 335 51184 77483 81645 66735
6167 66735 64923 42364 13120 -1546 15635 21737 14546 947 -27266 -23003 4750 55651 69097
6154 69097 106302 80223 72917 87247 57138 28813 23328 734 13928 41387 42248 12287 -8967
6141 -8967 -21441 -26063 -34658 -8634 -10959 -36256 -51135 -26795 -366 271 2703 12914 5282
6128 5282 -27731 -58946 -26436 32278 13425 -31837 -9519 1938 -26455 -37082 -49933 -48935
6116 -48935 -27658 6246 20964 22002 36555 35842 3639 -24419 9979 40181 29669 -21860
6104 -21860 -16843 -16705 -5688 -23968 -46605 -27173 -20435 -51023 -27057 -5825 -22096 -36545 -35436
6091 -35436 -73802 -39753 3383 -4479 -48734 -61128 -42497 -24175 67333 72820 32991 29613
6079 29613 14319 -11828 -60831 -74772 -78000 -49946 -19220 -46105 -75397 -41974 -24141 -13022
6067 -13022 -9246 -27768 -53498 -44211 -24654 -10783 8346 -3057 -3384 -24499 -12737 -18468 -22368
6054 -22368 -39102 -10793 27494 23796 -30597 -18998 16517 53068 62356 45067 35902 50942
6042 50942 53661 25656 -7130 618 1304 -8211 -10058 -33477 -50990 -18162 -1572 -46930 -19641
6029 -19641 -24948 -19604 -51486 -82029 -64029 -24523 -3731 9493 19109 -17599 -9363 -10182 -51144
6016 -51144 -75578 -59595 -50892 -16014 4953 -16810 -3170 -14455 -18637 -12683 -1679 -13960
6004 -13960 -26702 -14854 -25528 -13294 -9789 -10098 -6323 22243 19898 2837 1260 30767 27309
5991 27309 -4926 13813 32363 22765 40187 66908 51020 9641 8780 -8882 -15033 -3234 1874
5978 1874 10112 -19770 -52662 -52829 -73625 -60289 -25718 -7318 23187 46763 17954 19285 17390
5965 17390 8449 23301 19782 -27959 -8269 29063 65737 56000 30802 39389 16785 -2043 -37810
5952 -37810 -47687 -41818 -37833 6529 -4102 8639 51231 24722 -34866 -65632 -45952 -16578
5940 -16578 5663 45825 21645 9609 31487 25495 17076 39571 31988 4768 -28925 -43910
5928 -43910 -11650 -9064 21719 20273 6985 58201 40150 26851 -27250 -27683 2506 -27717 -9468
5915 -9468 15192 -16163 -34726 -22571 -25274 22889 33566 55672 62664 26238 -11401 -69913
5903 -69913 -77190 -21005 -55119 -58054 -46249 -8253 -16864 -33546 -19189 -35148 -42359 -12315 12272
5890 12272 10766 11542 -27192 -79900 -66874 -64510 -51907 -45461 -46396 -40045 -34375 3544 27434 27184
5876 27184 -20136 -39791 -63843 -52125 -10153 45544 52326 32785 23377 -1518 -18115 -37504
5864 -37504 -12481 11507 -7355 -27134 -41758 -36889 18502 38188 64409 106474 91662 48009
5852 48009 933 -16416 -13836 -1908 998 -21940 -13790 -9622 657 4668 26432 6045 -48997
5839 -48997 -58856 -29443 28985 -5611 -60516 -84632 -51609 -28409 -15523 7223 -14657 -20228
5827 -20228 -13357 -3954 -10988 21262 4504 371 617 -5373 15312 27845 28019 9701 53037 36136
5813 36136 29661 13753 -2707 25008 55472 58153 58394 43116 18034 -12252 -20854 5140 18238
5800 18238 50377 70072 73659 96607 70690 45885 53243 8606 -14548 -15158 -21421 5692 -54891
5787 -54891 -56500 -14272 981 10222 -10170 -9744 13371 -5255 -13261 23391 21240 29284 68035
5774 68035 56328 37958 38682 32647 19545 7594 -22211 -21185 -9816 -31055 -40872 -13043 28823
5761 28823 52760 35620 25257 15676 19186 20266 -5628 20174 29187 39316 71568 43387 6790
5748 6790 21928 18770 38823 42460 41719 34445 33533 13016 49316 47151 40873 27835 18738 4008
5734 4008 28632 56109 58594 37781 2896 1213 -33860 -53857 -72826 -69515 -35535 6630 30214
5721 30214 5059 -15097 -49961 -26080 4434 29675 17978 1262 45 -35668 -38317 -36387
5709 -36387 -34854 23439 63047 38715 43741 9109 -23923 -51330 -49576 -3456 -14088 -7541 36912
5696 36912 44346 29295 37571 40699 15023 -31209 -41967 -15671 20809 41600 35830 32082 -17865
5683 -17865 -39498 -8680 11815 -29850 -42639 14570 34109 -2086 -22552 -39419 -64935 -53698
5671 -53698 -12589 26186 11217 -5389 -14138 9052 17500 -2472 -32525 -38492 -57406 -30069
5659 -30069 11502 47286 32310 3437 35100 73544 69045 42124 -1620 -3629 -24015 -25389
5647 -25389 -17710 -3760 2396 -260 -15213 -51976 -44407 -22804 -42874 -49077 -14278 -10866 -68807
5634 -68807 -71584 -42485 -66602 -63128 -52977 -40635 -36542 -28318 -31350 9076 -13549 -27673 -31034
5621 -31034 -18192 -39504 -36293 -38870 -75015 -114150 -104951 -94766 -86346 -63101 -37821 -28271 -19754
5608 -19754 -58982 -117664 -130758 -91851 -45486 -42406 -33726 -21702 -49445 -34619 -38729 -40517 -21908
5595 -21908 -11707 22213 19888 9749 19100 5989 -11221 9882 -22463 -19138 -28345 -14396 19062
5582 19062 45508 39752 38296 14803 -38349 -61948 -59428 -63884 -37739 -34095 -63500 -96734 -48815
5569 -48815 -30192 -72480 -98767 -52517 3365 39789 36546 7016 -1250 -20897 -15340 5617
5557 5617 7694 -21360 -40272 -8143 36962 15498 -13208 -3012 47947 69752 40248 -11190
5545 -11190 -24855 17455 -8685 -22994 -12643 -3115 55551 41056 -15539 -51351 -70002 -74691
5533 -74691 -85000 -59327 -14203 26384 32622 13608 -15125 -59055 -41533 159 -15553 -69827
5521 -69827 -28333 -63899 -62727 -29638 -21319 -6245 8160 43723 50702 71780 29183 5013
5509 5013 24384 37476 3379 -44748 -52344 -65100 -94875 -108995 -67076 -52622 -38800 -1856
5497 -1856 -12086 -23198 -24931 -2450 -6895 -14619 -33339 -42514 -36924 -37163 -15312 29886 3046
5484 3046 -3123 -26190 -46118 -11334 28401 16626 20000 976 38197 56031 18691 -7493
5472 -7493 -24212 14274 45704 37959 1574 -13315 11421 41521 45512 55289 14723 12518 41967
5459 41967 70940 48958 7495 36790 45417 56595 34084 48834 12217 -2403 -30288 -50861
5447 -50861 -42165 8229 45672 30452 5278 3351 64160 63728 37175 -9435 -1790 4615 -27276
5434 -27276 -62321 -73171 -61190 -53101 -17227 -16974 -24152 -14096 5980 10408 5367 6991 10194
5421 10194 31215 28050 9040 32065 42925 31112 4529 -22883 15267 30896 33204 11905
5409 11905 14182 21387 5705 -16050 17583 31933 22834 20968 35354 42001 61626 44699 15463
5396 15463 23737 37618 31776 -30524 -66169 -45436 -47088 -55377 -59864 -95244 -80152 -46944 -43264
5383 -43264 -19585 12052 22947 4420 -11536 -15562 -24452 -43007 -8300 2388 -16523 -31817
5371 -31817 -43418 -27100 -33298 -21217 19685 13262 5550 -16941 -50584 -15193 11178 -16670
5359 -16670 -31217 15330 13969 3235 18201 -889 6718 -6060 -14942 -35910 -46134 -40760 -40442
5346 -40442 -20377 -3341 29732 24952 1348 -25400 -22431 -13875 -10630 -9232 7018 -16972 -14983
5333 -14983 -5658 -7763 -5190 -50302 -18851 29619 30735 21974 -8010 -17163 24828 21013 8299
5320 8299 11068 23003 16657 -16168 -34789 -51878 -28248 -17032 -18851 -28825 -18712 19615 30808
5307 30808 20824 19896 43219 48308 77658 69349 38822 40548 11983 -3245 -5726 -8472 -265 -10840
5293 -10840 10204 -23628 -53022 -10730 -16608 -47769 -28374 -14757 -29468 -58182 -29747 5780
5281 5780 12002 -1556 -45271 -21119 19598 21430 16551 3944 38940 68495 53412 57395 57703
5268 57703 19208 -8560 -51311 -47677 -35608 -25396 -33702 -52755 -15472 -9882 -4491 -15893 2208
5255 2208 42853 32614 14318 -39980 -57787 -42998 -33809 -20729 142 12126 12770 10537 907
5242 907 17510 55674 41551 53817 53433 41439 -4235 -61816 -59277 -18238 2562 513 -8452
5229 -8452 13997 21384 15576 -12066 -15157 -2653 -12232 -11572 -26063 -8542 -2562 -2583 -4518 -17213
5215 -17213 -7134 8715 30877 16049 8081 -8487 18597 16953 -28536 -64631 -30657 -25512
5203 -25512 83 19702 -12317 -8627 -8032 -4084 -28899 -29999 -15505 26572 36432 -20648 -16065
5190 -16065 -32879 -34772 -31106 11205 50231 53330 19475 -4540 -32681 -28989 -39016 -45734 -117570
5177 -117570 -98077 -29213 -21531 -31631 -31449 -34571 -35914 -7399 21655 48304 55655 12836 -15838
5164 -15838 -69219 -87894 -66810 -61275 -79550 -53758 -55142 -17210 28418 62087 56437 57837 81269
5151 81269 85991 68013 31479 8534 17901 24940 16800 -7389 -3129 10993 28852 43909 37737
5138 37737 28464 23551 24525 11805 -9056 32370 42987 44049 5016 5662 11043 30948 1863
5125 1863 -45683 -51008 -94659 -94217 -75339 -71195 -19376 12687 15178 12929 22634 30323 -407 -41827
5111 -41827 -74806 -69321 -26717 -12914 8077 -7413 -11656 -21687 -57151 -67714 -60212 -76423
5099 -76423 -50184 -48761 -38890 -34575 11738 25378 54 -27902 3048 27639 42886 47462 36129
5086 36129 -11559 -25627 -16283 -45274 -45545 -30176 -37086 -11720 10621 10999 11715 18859 35398 47837
5072 47837 58682 27942 35518 19615 42384 18925 31802 21612 21845 16032 -30036 -41225 -26707
5059 -26707 -19617 -49838 -73622 -91715 -29988 836 12366 -3756 23842 19492 27989 34603 8042
5046 8042 -4168 -18315 -22970 -33691 -5602 18620 -4436 -9032 18180 -1953 -31442 -19415
5034 -19415 -14785 -11877 -38658 -29981 -6977 -5226 -34026 -41407 -29479 -38972 -28471 -3535 34579
5021 34579 47270 52868 39920 -3326 -26506 -28077 -26654 -3562 17400 38045 9393 -12019
5009 -12019 -20805 -16821 -13136 31443 87080 89101 43150 10816 -40170 -61868 -60089 -63602 -70239
4996 -70239 -89357 -104826 -109416 -103628 -67984 -36426 21109 12955 -6831 -16531 -830 -13521 -28846
4983 -28846 -42207 -12915 20680 -17840 -43300 16883 8982 -3261 49375 17892 -506 -5612
4971 -5612 24823 59037 21521 5053 -21123 -12404 -29612 -42120 -18152 -12975 3549 7466 -29188
4958 -29188 -2900 -8275 17282 26757 25400 16603 25364 67400 97854 73550 30916 13692 25182
4945 25182 -5178 -21146 -2533 11759 -17830 -14765 -7137 -4860 9660 27958 26915 1115 6018
4932 6018 38596 37629 40870 80774 71477 15693 19154 10665 -3206 -60348 -70362 -49878 -39773
4919 -39773 -6136 61796 79410 52334 5123 702 -5458 7948 13013 -21607 -15873 2947 58758
4906 58758 59418 4388 14222 23512 40098 64567 44191 14186 -33582 -54797 -65663 -52504 -31470
4893 -31470 -27967 -13884 19189 18974 -10362 -40518 -15223 31463 47200 35407 6000 -7947
4881 -7947 -29645 -41029 -19227 21316 5499 3701 -16481 -12022 -24900 -32026 -32624 -45734 -24526
4868 -24526 44874 56923 23708 21791 -20849 -33398 -45693 -23970 -12343 -37993 -43673 37486
4856 37486 13083 -8511 33796 23222 21004 13726 5682 -20927 24084 46162 19017 -11018
4844 -11018 -32091 2945 -20827 -63503 -58003 -45915 24128 65403 50981 -2563 -1890 64366
4832 64366 86801 60559 24059 30973 55977 90315 54471 22620 -39737 -64368 -58135 -12349
4820 -12349 17388 10389 11262 8550 -27655 -12895 34503 33026 40951 13610 -39372 -43925 -41521
4807 -41521 -45690 -35307 12265 11567 -25801 -42030 -40935 -25787 -20640 -25612 -20989 -13010 25525
4794 25525 7545 -21980 -4378 -38490 -28822 -33841 -52479 -72283 -54651 -79842 -71354 -35841
4782 -35841 -9705 -37350 -47064 -20317 -3640 15895 19114 -9855 -73059 -65726 -53612 -7257
4770 -7257 16736 -3693 -25622 -43624 -60271 -48932 -41982 -67860 -64546 -68989 -67062 -58950 -44072
4757 -44072 29819 39801 17676 6151 -16913 -18204 36902 63845 77324 47946 11962 -1062
4745 -1062 12552 5772 -15403 2249 -10890 -35296 -58572 -60273 -17144 -7918 -6282 -5910 -20076
4732 -20076 -31286 -16491 -9237 -29020 -33311 -31850 -675 15789 36846 26981 20854 8192 13811
4719 13811 23872 10576 -10567 -27511 -721 15816 -20777 -25009 -18694 -38551 -44342 -57127
4707 -57127 -77997 -111854 -117892 -53662 -25260 -8002 31652 39662 9385 -38325 -53279 8479
4695 8479 9129 10159 -25064 -66627 -35361 -28583 -35916 -44561 -91489 -72219 -37546 -41391 -18690
4682 -18690 1012 1487 11457 36729 13595 -3300 -22450 -10045 6674 -11753 -2449 10198 -39913
4669 -39913 -32499 9171 -6911 -1312 13212 3562 35411 5876 -58872 -40764 28570 11206
4657 11206 -11764 -14945 3738 19590 20627 6881 -10106 5803 23081 8078 25320 55333
4645 55333 53132 71057 47538 13375 22599 4656 -42692 -15889 22793 22127 27826 49216 72353
4632 72353 59714 50767 57839 58750 53728 44460 41311 36194 7372 6219 16084 -16812 -5205 -13581
4618 -13581 -36507 -3117 2008 24393 60401 30957 -25391 13926 53962 76953 56971 39868
4606 39868 35915 34197 65348 73403 30100 -1394 -54467 -68032 -56321 -2092 25489 15162
4594 15162 33004 57444 61524 50794 49475 63732 18169 -5119 11800 18204 12458 7177 -6955
4581 -6955 -27778 5146 14545 24584 38697 40395 45008 40597 17693 -7922 -24401 -18828 -15739
4568 -15739 -25692 -27575 8733 -11274 -495 5097 -12327 -23279 -62768 -60619 -27616 -1795 18790
4555 18790 14920 39937 44771 33366 18557 -5493 -31323 2702 27038 40697 5522 -33275
4543 -33275 -84835 -96483 -71967 -51338 -59454 -31275 -29112 -59640 -86329 -58652 -38184 -36081
4531 -36081 -34898 -19871 -9372 -3582 22170 41452 25533 25980 48102 32754 52712 65387 43061
4518 43061 6027 -13057 -4926 -5337 -4829 2797 615 -1306 -3206 31272 47552 77081 60976 43445
4504 43445 32787 22949 32087 19468 10556 8991 14481 25903 -22071 -43761 -15452 5278 -10717
4491 -10717 -52049 -56315 -42338 -40885 -29935 -16835 -23356 -592 40127 -121 -33019 -17448
4479 -17448 8507 -11144 -8189 -9579 -28767 -39662 -60080 -68756 -55164 -39541 -450 9169 -27227
4466 -27227 -30404 -15424 12720 9438 -639 5267 27436 57437 52351 19948 39043 58622 49312
4453 49312 12861 -2672 32781 51882 11652 -20509 -38526 -18724 -1002 1958 -39485 -14258
4441 -14258 7592 15219 8304 18776 -5231 -55900 -94597 -21129 50699 34874 17179 -11538
4429 -11538 -23281 -31158 -50194 -54976 -38356 -20900 -24666 690 28834 25249 19341 15148 -17405
4416 -17405 -30409 -22560 -12371 2830 18085 7942 15246 24831 4934 -16827 -3201 -19618
4404 -19618 -59027 -65204 -52053 -23261 -6367 1920 5931 -17869 -31661 -57039 -61845 -42248 -12218
4391 -12218 9995 11059 8365 48462 25600 -28143 -38306 1605 19740 -3386 -697 -27816
4379 -27816 -40044 -27386 -35541 -21727 -32556 -25730 -56623 -76247 -72182 -75973 -55780 10244 21932
4366 21932 1726 7639 719 -6506 85 14110 -3006 -3754 34501 46797 39619 6562 -2525
4353 -2525 6508 -46410 -38763 13997 55077 57171 1332 -14742 -12791 -1208 29908 -14941 13086
4340 13086 52748 7502 -14054 -48106 -48234 -37368 -24510 -29069 -14218 -12573 3121 856 -34113
4327 -34113 -52691 -50828 -33576 -8902 -25991 -44385 -36026 -52046 -21245 21712 31062 44851
4315 44851 59613 49941 12016 -12641 -9084 14452 47791 75147 56382 28466 -11582 -32855
4303 -32855 -12157 26731 24958 -5170 2899 4618 18319 53636 50018 27572 -15858 -48359 -65331
4290 -65331 -83403 -94039 -68607 -52992 -58106 -53830 -58407 -25671 9198 -9469 -57756 -43621
4278 -43621 -19328 -4294 10795 18145 -45274 -61385 -35190 -63860 -71522 -35415 -22668 -45448
4266 -45448 -40313 -18716 -8076 -7606 18516 29052 39416 32391 47737 22327 -7567 -21705 -19158
4253 -19158 -20199 -43607 -34890 -16883 -1760 33565 4018 -36771 -50334 -36141 14317 44052
4241 44052 22371 -14974 -37250 -4266 1207 -6430 16236 -6257 -23167 -24857 19039 22968 -25130
4228 -25130 10947 16691 31548 -1504 -50035 -62795 -26680 -30198 -49459 -42587 5455 24960
4216 24960 -1954 20432 -34 -655 14724 32239 37185 12999 10960 28186 34888 20597 -14635
4203 -14635 -27508 -16761 -2250 3615 8775 20390 -9560 -62257 -55133 -29662 -49397 -67564
4191 -67564 -55049 -36660 9092 27734 3028 10575 45144 42388 25609 1285 -13007 -17405
4179 -17405 -19186 -17838 -16753 15405 49164 28735 11378 46392 35699 -1948 -22635 -28823 -41126
4166 -41126 -37321 -25569 1772 -11062 -2304 -7684 -14330 -52512 -19609 3115 41167 70858 65813
4153 65813 48799 33204 41780 63539 57517 42726 30036 16909 -5633 -7341 -4887 -4680 1085
4140 1085 -10089 -9238 -29834 -53845 -77546 -30475 31187 58336 30663 -35022 -50334 6811
4128 6811 56257 24974 -1542 -34553 -15233 9600 29270 67 -43718 -44270 -17355 2519
4116 2519 -15659 5475 19505 49677 67726 71805 59773 49549 50627 40843 44598 36394 29888
4103 29888 20890 12599 -8483 -17657 6217 11021 17349 31935 37583 64256 67082 34606 25539
4090 25539 11408 -11327 -5029 315 1087 -217 8272 28629 20730 24224 20285 33521 48328 65341
4076 65341 78877 62627 23559 44883 63085 12083 -48567 -86483 -66152 -45339 -73961 -61282
4064 -61282 -84929 -84218 -67485 -64921 -70609 -78851 -40942 1146 27638 26182 -1440 -23065 -47119
4051 -47119 -12589 25509 44449 25673 14587 10024 11164 -17506 -73807 -47247 11155 12391
4039 12391 -1290 -26960 -21825 -10192 12443 12841 5313 -5151 13336 2745 12226 37307 38831
4026 38831 -20223 -12264 10984 49859 31883 -4580 -63176 -72840 -51129 -5472 24738 8324
4014 8324 -16707 -14392 26010 63516 63657 42181 25122 12883 8251 -12905 -7290 22923 4001
4001 4001 4374 4844 19064 6935 17453 33151 42114 57508 75282 40826 13197 6358 48348
3988 48348 43675 26822 35732 26672 46764 63312 30823 31170 34977 1661 -3395 10471 -7804
3975 -7804 -29764 -26203 -34586 -53190 -20976 1986 -759 -35718 -16860 29236 13476 -21549 -43402
3962 -43402 -28806 10547 6770 -9709 -15123 11437 45307 16988 -37393 -10456 1002 -20369
3950 -20369 -28715 1053 -15213 -8007 -9097 -20093 -68014 -96615 -94836 -82578 -74184 -20852 -25397
3937 -25397 -51655 -31296 -22665 -34581 -23900 4292 19428 29975 19058 3913 -3041 -7461
3925 -7461 14764 34255 32335 53510 42006 15669 10779 24298 27293 37794 55468 9532 -21802
3912 -21802 -3353 -7292 12378 -13901 -25712 -32579 -12296 -37163 -52538 -52600 -41989 -29610 -43042
3899 -43042 -41024 -45596 -32022 8036 31809 14826 12753 20727 31603 26473 5238 -6355 -9509
3886 -9509 5516 10852 23784 30583 65013 64211 30570 -9208 -31778 -42837 -6274 -1330 530
3873 530 11716 -5127 -16425 -59295 -84999 -38855 9503 3740 -3571 17098 40878 39086 14311
3860 14311 30002 65875 65958 16594 10470 23535 8037 -5899 -19513 -38009 -53266 -73841 -31502
3847 -31502 -18642 -5874 290 -3804 -26525 -33336 -6946 28513 39981 33982 47190 9121 -38744
3834 -38744 -37986 -6068 -31482 -35221 -7745 -16291 -16596 -1367 23863 36006 58017 76310 72075
3821 72075 33546 39455 63059 67675 90458 82892 41077 -989 -44354 -37800 24290 42871 43560
3808 43560 52440 42315 33071 -10515 -15300 3437 25293 74739 73049 67314 23759 12747 39703
3795 39703 13582 2175 590 -2584 -6468 23063 58711 52574 39230 25959 44687 70436 52042
3782 52042 41227 7648 5152 18404 18116 -14488 10590 -13492 -2363 39730 39787 -3 -48626
3769 -48626 -25612 11110 18004 20405 49325 55330 72275 44757 73859 48565 -11765 -40157
3757 -40157 -35761 -7043 24468 -3947 17507 23204 31101 29406 32735 14728 17784 52199 66762
3744 66762 47033 12277 -18905 1747 21963 8471 21513 42333 28664 -29384 -44629 1284
3732 1284 24008 -143 340 -14139 -38371 -27752 -11611 15962 19716 23979 42407 85171 82979
3719 82979 22822 -21204 -2990 5700 -30245 -21209 -30279 -56911 -47380 -16607 7982 37167 36875
3706 36875 10619 12631 860 11888 8054 -6893 6141 11327 -2806 -11640 -20740 -16732 -4236
3693 -4236 -49934 -56725 -19363 -2375 15532 37594 47226 67172 52829 16915 -29525 -34786 -36160
3680 -36160 10095 28640 39371 -25481 -54456 -6417 -15908 -11239 -6798 25643 -8864 -11324 30783
3667 30783 26328 -12527 -15552 8398 47107 44118 45577 54750 118642 141217 154979 77260 55358
3654 55358 46148 53810 48974 48532 60234 79212 42026 16731 18062 46336 45303 10441 -17520
3641 -17520 -14486 14823 7311 -10969 -15223 6167 34132 12276 -1212 22406 12808 37468 27208
3628 27208 4847 -16732 -2101 -25423 -22693 32654 7947 -27518 -9740 18422 41849 16832
3616 16832 25423 23491 24385 14902 48058 68143 67743 51551 73068 46951 46666 60608 45822 32024
3602 32024 10656 13370 14166 -41207 -21672 -4221 -585 9823 24353 52103 39168 44445 26191
3589 26191 16600 8636 12654 -9714 -32310 -48895 -59919 -45614 -49006 -33050 -5733 20771 34886
3576 34886 45978 37743 21411 1289 -7085 -23424 11831 50420 62588 56367 75831 75913 44304
3563 44304 44447 52931 41615 20488 1979 -28010 -2636 15391 26728 -7639 3225 18025
3551 18025 47022 37634 53916 31019 -46459 -53857 15088 71256 39527 -2586 -20568 -11533
3539 -11533 6965 -6970 2416 34679 36385 -45086 -95716 -85247 -66187 -61442 -50415 -20313
3527 -20313 17674 10447 11730 8809 13956 15211 24031 -5652 -25775 -16654 -12301 -40899 -48829 -36304
3513 -36304 13565 39697 42351 42634 27067 -22065 -32599 -17265 17508 -11580 10302 9297 7575
3500 7575 9695 -27447 -39327 -17869 -8730 4886 2892 -36156 -28134 -21907 -35799 -14090 -14866
3487 -14866 3645 41689 14219 27906 -840 -36948 -26994 -3539 7055 7803 1904 15911 613
3474 613 -205 4135 -8420 1204 55221 51161 36103 14779 806 15433 16560 2452 37128
3461 37128 93371 103373 64384 46566 27231 15802 33916 26239 2871 -26876 172 2880
3449 2880 -19987 -13429 -16263 23189 -886 -18960 18248 17485 192 -7511 -11199 16079 -1657
3436 -1657 -20274 -5158 4173 15876 42180 65853 49331 25398 64222 55747 9630 -43923
3424 -43923 -51588 -9015 29963 5781 -38910 -26229 1940 14832 -10614 -23990 -14174 -30148
3412 -30148 -49628 -62775 -36540 -9111 1071 5680 -12186 -29796 30379 92173 92102 73780 36704
3399 36704 6362 9706 14013 -16080 -1921 34595 21171 -16748 -27922 14791 33560 -3452
3387 -3452 -21252 -35153 -26040 -6682 2129 -20045 -62188 -39168 12484 6053 -18247 -13288 -329
3374 -329 7157 -7786 -14415 -37899 -47559 -26276 -19962 -27794 -52721 -38302 -38411 -17286 -21625 -3876
3360 -3876 7947 351 -31483 -58083 -36148 -17909 -7563 -28410 -12173 14897 39370 46526
3348 46526 20511 -11350 -22844 -16625 -6870 -6874 -12531 11821 32257 28768 -9020 -68897 -44530
3335 -44530 -27135 -35180 -67898 -46169 -31472 -2584 12994 29502 6203 9739 15881 1717
3323 1717 18396 25630 31413 40573 25934 9216 23435 31990 16834 12269 -10925 -8696 -1219
3310 -1219 4994 -10108 -11252 1016 -34908 -34835 11729 25201 21757 11916 -17390 -41223 -14522
3297 -14522 36770 48132 23026 18265 -11824 -9011 13523 19715 7072 29481 47356 43947 12965
3284 12965 46158 51449 50981 17476 -8116 -33901 -62220 -41757 -13026 -40110 -34020 -46884 -87699
3271 -87699 -82276 -50273 -20632 -20378 -29521 -45382 -16130 9906 -4570 -24292 -44357 -22653 -5237
3258 -5237 -14234 -11467 -3450 24694 30105 37742 75595 50909 24296 47212 39478 67515 72348
3245 72348 70088 63280 74379 70828 46174 17845 26846 29009 28214 9300 982 25705 17306 -27921
3231 -27921 -53777 -58700 -29675 -2076 13075 42932 7579 -6045 -7480 13670 -8927 -46805
3219 -46805 -32587 -15586 -27625 -6670 18227 1327 -9282 32105 55899 27552 20169 50591
3207 50591 63718 49613 40646 79208 116843 91326 37580 -4553 -25283 -55196 -33416 -20057
3195 -20057 -26748 -32460 -31005 -12223 282 1904 -7437 -12288 -7331 35233 56508 42250 28207
3182 28207 7674 6774 24573 32640 -4965 -13060 -36597 -23586 32580 53673 77371 61565 33175
3169 33175 -7161 -28184 -15481 -11333 -267 28804 21634 -26493 -46951 -57979 -5399 -38596
3157 -38596 -15346 8384 26632 5101 15023 92955 95182 70808 68411 48421 36439 45539 46834
3144 46834 36664 1614 -53306 -69231 -9618 79625 95420 52308 35417 5051 -21375 -22039
3132 -22039 -19226 13268 52846 52274 -15751 -21869 5609 11215 20161 18497 73788 78690 22351
3119 22351 13080 -23182 -50625 -16985 -7630 12865 6376 -12712 17993 13846 18883 14962 -8062
3106 -8062 -29025 -25272 -25892 -32329 -36917 -43897 -37068 -27237 -50857 -52435 -46963 1675 56749 59529
3092 59529 69929 57160 43266 35307 5276 9552 50986 66464 65108 38026 34390 20665 26596
3079 26596 40623 12527 7851 -15270 296 11689 8210 22081 -2481 -29893 -18455 6092
3067 6092 15281 3768 -42799 -33386 -23632 -29992 -59779 -70627 -47108 -50820 -13399 -11196 -27641
3054 -27641 -8825 -17122 -38173 -32332 30297 94010 72342 54374 34972 23780 42725 9809
3042 9809 -11712 -6103 -10681 -46406 -44874 -24817 -30258 -34581 -1247 -22436 -63190 -20156 26960
3029 26960 61800 79498 42199 9034 15797 38150 -16937 -12256 -19534 -27952 -31381 -45760 -27615
3016 -27615 -42549 -66999 -50764 -8303 -11959 -43387 -40602 -17786 19688 37935 2225 -19235
3004 -19235 -25307 35794 41370 -4200 -17626 32889 58180 100708 84424 55867 45730 -4424
2992 -4424 -42393 -59922 -34426 -1060 42494 48126 2370 -44310 -47142 -19396 2296 -13264
2980 -13264 -2200 -526 17291 -8309 -1474 10002 3734 3244 7600 32777 23506 58890 75319
2967 75319 22921 -17132 -423 40645 81757 108871 117499 97416 42058 28376 -2958 40437
2955 40437 47989 21587 7938 254 -26075 -16126 -9302 -25465 -24939 -13288 102 -526 -30670
2942 -30670 -23734 -41617 -30960 -10459 21854 42968 16173 -15908 -20348 3724 -419 -17133
2930 -17133 11621 8260 17736 27901 47 -31423 -9345 32794 63617 13212 -10789 -29411
2918 -29411 -49516 -16761 31663 45900 47543 40051 39789 64107 51368 15184 -24259 3745 30119
2905 30119 8555 -620 14307 39064 62699 62359 77957 64056 60585 67484 63858 8767 -26547
2892 -26547 6168 37454 14242 -5563 -7933 -15672 -13945 4473 12874 13570 -24019 -27091 -29213
2879 -29213 -22496 -12134 -24109 -65526 -94908 -82444 -63420 -52470 -61891 -87067 -40126 12195
2867 12195 33455 21388 -8731 20294 45284 22779 -10230 13798 38275 10857 -10865 -3811
2855 -3811 -1297 25247 16556 24591 4384 -3688 1660 3334 -11808 -27172 -42701 -47874 -23129
2842 -23129 1179 2012 222 -4110 -634 3467 -20831 -47767 -36428 -15549 59652 73691 31015
2829 31015 36448 57660 45537 53043 37888 -1249 -25006 -586 29097 27750 23898 29878 31123
2816 31123 4701 28711 6605 26006 29613 17482 14074 28106 19406 9853 -12106 -14980 -29041
2803 -29041 -8951 -1214 7878 -23173 -74140 -81555 -74857 -66265 -26585 -1074 16928 -3478 -16054
2790 -16054 -1642 -44471 -44033 -23423 -24295 -7073 28746 55432 49955 33900 18212 4473 37411
2777 37411 66028 64285 25440 -21581 -34903 -13286 20585 32231 18271 -24322 -28968 -26367
2765 -26367 16091 6561 -32914 -43357 -27093 -10932 42868 43604 41211 48258 23899 53503 57777
2752 57777 16297 -33119 -30497 14371 48713 79160 86178 76878 71194 61196 28889 28131 22159
2739 22159 -29474 -54054 -77775 -94527 -51381 -27424 -8592 -11046 -28804 -22617 20255 -15065
2727 -15065 -52780 -71473 -36362 4388 24688 54052 50896 45844 21688 -694 -22815 -16356
2715 -16356 -27817 -32825 -18802 -12371 -29466 -39860 -46866 -32667 -22946 17038 76999 84094 83246
2702 83246 75565 55519 25238 1597 20710 26164 34199 22705 54293 71495 57285 49067 44013
2689 44013 53487 30602 21173 25951 39228 17774 -8949 -11620 -15675 17691 33396 68614 80487
2676 80487 105520 79054 34886 41680 30127 42930 29548 -20775 -52906 -52885 -20380 8454 -10503
2663 -10503 -21847 -16777 -3210 -18752 3196 29586 33526 3724 -11673 -7493 33897 47799
2651 47799 44622 49148 15842 -8689 39853 83018 56610 36373 12847 -14301 -30082 -27966
2639 -27966 -13939 4642 29086 55942 76721 62386 35499 -29045 -60964 -52030 -27618 10704
2627 10704 -3068 -9618 -12883 27072 38896 28274 47416 31101 -12957 -9170 13837 40883
2615 40883 32046 41485 37197 33686 -22695 -20197 -30019 -35991 -29596 -32820 -33299 -66558 -64752 -57854
2601 -57854 -64374 -55910 -15594 12422 23304 56283 50745 7769 -50068 -44559 -23362 -9619 -28828
2588 -28828 -63246 -51400 -50434 -36411 11989 37341 33823 6342 -19357 -48726 -20285 -11049 324
2575 324 23223 44501 12579 -12339 -32767 -34280 -40353 5121 35039 65521 69202 51925 23113
2562 23113 25078 25924 37053 37248 45907 53385 36535 50667 15770 -21344 -28855 8593 17356 2091
2548 2091 -19499 -30528 -29536 -32351 -52790 -29476 -11233 3029 37546 28642 -12652 -47085 -57733
2535 -57733 -1341 -13926 -4444 -12675 12441 28632 17946 21537 -1844 9620 -3490 17107
2523 17107 44867 48492 22625 18526 34036 51843 27581 5303 20994 35575 10086 1069
2511 1069 -28196 -46992 -65487 -60606 -48785 -30158 16648 22384 13775 9753 29788 37927 34926
2498 34926 -26681 -55104 -60239 -19918 -7178 -10064 11867 35087 27596 2204 -9820 801
2486 801 6761 -8238 -4602 4876 -8299 -19482 17000 3172 1645 -39434 -41734 -32172 -31692 -46296
2472 -46296 -50862 -64179 -27239 12742 -11491 -20482 -29776 -20201 25903 41972 59126 95587 111372
2459 111372 84368 69194 64117 55729 17794 -5777 32044 49472 48573 23327 31334 51035 19785
2446 19785 21479 -11948 -20478 2397 1216 -50784 -47097 -7287 -3152 48353 114056 58303 17177
2433 17177 3453 34796 61688 63129 46464 51787 46266 43829 66048 52186 30791 23557 -18225
2420 -18225 -38014 -39284 -12390 3045 17429 27809 -1645 -37154 -27990 -31112 -45574 -20766
2408 -20766 -8365 -18182 5982 -8529 3476 -11364 -26144 -62327 -58592 -20185 -36668 -39526
2396 -39526 -16871 36711 70215 65917 67017 25354 12362 13078 -13402 -9047 -5249 6048 5664
2383 5664 22565 34001 48382 45936 6072 -14944 -14589 -4757 -27167 -8582 17831 -6267 -4212
2370 -4212 12669 50629 41253 -10411 -8525 5324 -36661 -31547 689 12930 7310 -27666 -36711
2357 -36711 -67089 -68345 -32800 -52061 -72530 -79784 -61732 -44851 -22474 -28453 -10483 29135
2345 29135 33165 23302 -15279 -33264 -1267 16072 12909 -15193 -13054 -10373 10205 62347 79142
2332 79142 58153 64076 51091 28256 26486 16081 29667 40126 51292 71441 69705 51030
2320 51030 63468 16460 -18023 22943 47570 29064 -12796 -39033 -59568 -32333 5330 36536
2308 36536 41975 51369 4419 16164 39889 21850 -44117 -39398 11485 14135 35448 39235 5979
2295 5979 1786 11171 -34950 -46832 -43464 -34137 -1443 -9740 20022 42799 75949 58003 51156
2282 51156 43253 14319 12532 19802 15967 14809 20383 16609 -19221 -23398 1014 33480 50451
2269 50451 71691 43788 19979 -6208 -23245 -30255 -21259 26576 72309 85013 50902 -346
2257 -346 -52476 -28152 -21014 -25867 3768 6251 7274 5407 -15200 -10487 11260 2554 27603 20585
2243 20585 -4617 25003 33840 15489 -18898 -6636 -10186 -38971 2567 38156 33127 61518
2231 61518 76810 48115 31794 50810 67783 63357 61765 21139 30271 45304 50105 14212 -21376
2218 -21376 -40497 -50408 -47592 -30086 -10294 6640 -4712 11164 20838 48570 35971 5463
2206 5463 -36090 12655 67877 70498 32847 10507 19844 50656 69564 37888 431 -15282
2194 -15282 -33501 -16451 31604 65905 34416 6626 -5132 -9585 -10861 -18108 -32262 -42896
2182 -42896 -16664 10969 27843 10729 -9984 8469 11436 19682 27547 24061 28428 35882 24804
2169 24804 30551 11075 -22261 -34814 -44345 -30266 -22126 -21851 -19753 -22740 -5408 7077 24609
2156 24609 20766 2241 -12825 -19854 -25402 96 22647 -15822 -20962 -26310 -23487 -19162 -2503
2143 -2503 -20106 -35827 -27114 -36066 -58625 -13706 11530 -2694 -4009 2175 -8759 4456 5317
2130 5317 38254 76222 74429 20157 -3499 531 9732 8072 12192 9852 19429 -6476 -4078 -2869
2116 -2869 -6305 1860 -7135 -29376 -29967 -34236 9487 15879 39560 29551 31784 43299 45056 19168
2102 19168 -21022 -34987 -39249 -21312 -40357 -25972 -18378 -38779 -75029 -58524 -68076 -57898
2090 -57898 -12363 14709 -4043 -26272 -12858 -422 -26119 -12063 32780 35272 50516 67896
2078 67896 53574 31380 70948 63407 67216 52004 12782 -35110 -58084 -53584 -31858 -6347
2066 -6347 3102 -17370 764 9100 25743 21063 -16521 -35856 -20735 2315 25810 14232 14469
2053 14469 -10656 -16167 -35861 -55806 -46160 -37991 -26694 -5823 31312 37258 34704 52909 58618
2040 58618 18131 -3569 8431 -3876 -16246 -13317 -3142 16679 5802 -8484 -45557 -25057
2028 -25057 -14502 -7423 5665 -16064 -36149 -19169 27996 25861 -2773 -37990 -40273 -21075
2016 -21075 -5331 -10683 15122 22455 4217 3016 5969 9491 2111 -45089 -49153 25945 83527
2003 83527 65309 18709 -5361 -19862 3130 16077 25549 3024 -796 16965 9570 -5532
1991 -5532 -6997 20225 17803 -20692 8712 64321 87434 58281 48324 18316 -6842 20815 13921
1978 13921 8269 20543 20654 5916 27396 34734 -7158 -27006 -18015 -4954 9201 -4093 10223
1965 10223 28291 -17921 -44356 -446 -13277 -54873 -69628 -52366 -35495 -34972 -47372 -19641
1953 -19641 -20262 -1214 -8708 8405 21579 34521 39773 43458 27985 48018 52546 59088 38633
1940 38633 9582 -9314 -56381 -72609 -45766 -20474 19397 39411 -14571 -20116 -6144 -18971
1928 -18971 -22278 -44335 -41166 -16382 -18459 -4624 9713 43359 29719 27777 51818 45748 40797
1915 40797 16701 30666 27071 19479 -3200 -11981 12275 56215 41364 21326 -5641 -20418
1903 -20418 -1740 21986 1027 7127 -19867 -19583 -27290 -3008 -7217 -13803 -41194 -47610 21027
1890 21027 34413 -30766 -40033 -24126 29341 51686 35072 22568 -11847 -35511 -6712 -20384
1878 -20384 -27490 -25102 -3172 11854 -1842 -7996 -21824 -2167 -2374 -17019 -649 11412 5228
1865 5228 3977 16646 21201 18349 32253 12719 428 9886 3582 -39127 -51054 -11390 23761
1852 23761 785 -24797 -23136 -45683 -77293 -64990 -84815 -87872 -30209 6428 30034 8485
1840 8485 19918 19907 1290 9522 1612 -14524 5476 6709 14449 35133 62449 47385 14440
1827 14440 -20480 -47570 -15579 -44153 -56849 -20114 -24734 -26392 -11518 27336 34580 27938 3794
1814 3794 -17357 -10889 1084 31718 46205 35259 -30932 -46383 -33681 -15275 14206 41977
1802 41977 47605 55154 38191 33642 51934 56306 43112 4187 28821 42742 42388 54547 30987
1789 30987 35760 7751 31948 26325 -16849 -10161 3976 39799 17223 -12420 -26876 -44949
1777 -44949 -18003 14550 15831 23370 50046 80932 75295 46605 44724 5128 -6100 3276 8064
1764 8064 33598 37380 37138 36472 37348 44205 62304 35837 49879 74694 48380 75187 100779 123486
1750 123486 108293 69929 29586 -19108 -7345 5009 -15469 -21552 -24636 -10034 30954 46999
1738 46999 43469 39784 65461 25205 -20617 -24222 -14524 8114 25437 18117 29872 -5799 -46355
1725 -46355 -26524 4957 6603 17935 39545 18023 -10028 -14479 -43743 -48209 -31418 -11310
1713 -11310 9788 30751 16908 1497 11125 25683 39875 2772 -33925 -7526 -5359 -11167
1701 -11167 -55201 -60898 -69254 -44374 -42289 -76574 -94345 -77555 -64551 -32148 -7443 41517
1689 41517 65390 56761 6324 -3737 28150 49547 59832 33062 11595 13972 39327 31748
1677 31748 -9910 -9077 -15204 -27839 3342 -12665 -15953 -19409 5363 21259 38608 13802 13321
1664 13321 24133 14092 44738 78505 112170 88081 41450 31214 23197 34 -14100 -8876
1652 -8876 12849 26923 50677 38535 -12971 -30171 -30533 -7121 42407 74030 77972 76010 93946
1639 93946 61128 13694 -4359 27053 45913 26954 -189 6188 -33112 -22425 11212 19153
1627 19153 26148 33923 27224 18566 1333 -19546 -6316 35792 38203 15286 31263 11713 -5779
1614 -5779 -11996 -14909 744 45754 12476 -10792 -41884 -52212 -39440 -11104 -13660 13404 24166
1601 24166 11019 -5925 7558 45657 49170 64012 19503 3056 18600 2923 -5297 6113
1589 6113 36742 41983 31161 7770 -16866 -12258 -18506 -26364 -41860 -76863 -64424 -6181 8434
1576 8434 -6734 11630 10437 -15932 32019 55228 34681 38394 30814 50983 19040 -58864 -73605
1563 -73605 -39112 -53489 -54030 -22886 -3903 -4492 6896 29289 28019 9675 2860 -2602 -13283
1550 -13283 -957 4172 -9861 -10654 -46140 -72356 -48115 -8201 29189 41788 16844 -6921
1538 -6921 -16498 -10499 -27394 -46032 -17818 29623 19433 -13311 -47588 -50295 -54985 -5529 16882
1525 16882 883 -11182 7956 -616 -41962 -27491 44464 81570 65508 25032 12610 48904
1513 48904 76396 91803 100848 73577 34230 2247 16035 21496 14757 8295 13667 40965 -610
1500 -610 -34981 -51290 -45495 -61653 -116946 -100231 -69710 -34578 -6273 -13711 -16952 -7420 -7267
1487 -7267 -20285 -24656 -48322 -60307 -40588 -26316 -23301 -19527 -18366 -36797 -33690 -2133 -3541
1474 -3541 1112 -24634 -25383 -24776 24552 21155 38687 29164 23614 -13108 -19096 13533 -7266 -21520
1460 -21520 -8692 13062 -8220 -64463 -58196 -29180 -11307 10641 27239 29754 14768 31257
1448 31257 38763 -5364 -27104 -32841 -27676 -42104 -52356 -8427 12918 -12472 2594 -1760 -40327
1435 -40327 -42046 -2502 15116 39670 20229 -14765 -47692 -68237 -51944 -22143 30514 33743
1423 33743 11212 5268 29163 21124 7961 19850 20326 37495 4883 12521 6088 36030 29000
1410 29000 -5779 22808 -2963 -39675 -21918 22475 91011 90431 79585 36772 16929 39883
1398 39883 13037 9970 36626 58611 6610 -40186 -20805 -33256 -18010 -42101 -4151 24010
1386 24010 18056 46358 87909 69960 16231 -18198 9729 22554 8416 -6438 -47235 -38108
1374 -38108 -13917 -9237 -16286 38217 56357 40350 8927 -13956 -51189 -55472 -33435 -19507
1362 -19507 -7841 61577 89029 94246 86965 56139 49001 48616 61725 51462 2634 -14974 -8494
1349 -8494 -13752 -9175 -773 -18423 -26173 -33299 27949 57526 25815 -15840 -16934 -13729 -15286 -2103
1335 -2103 2827 3390 -14156 -30983 -44254 -29422 -3801 -13431 -14287 -41140 -23381 -48893 -56534
1322 -56534 -23236 -416 -29 27624 24290 30767 48120 38141 46821 60914 55956 50428 38345
1309 38345 12806 4718 23003 7397 9518 43379 55140 44608 20273 27291 33088 18678 16824
1296 16824 25664 17587 14869 19753 -17594 -23377 -16798 -21323 -19340 -14924 -5309 -8797 -22071 4045
1282 4045 41208 24112 19511 56301 83421 59780 -1916 -4178 19790 31549 33276 42324 1009
1269 1009 3184 14322 -14357 -15736 20298 9760 -695 -51882 -36545 -13534 -44909 -57451
1257 -57451 -55891 -4128 27402 69399 48217 -6488 -4960 -2116 -25843 -9897 12142 106
1245 106 16892 11153 -10725 -35006 2156 9858 25645 -6657 -48447 -21224 -2225 15991 52671
1232 52671 7632 -32425 -20205 -33384 -22849 -17833 -10349 15149 14845 48359 45210 46545 74735
1219 74735 61504 17333 21118 49613 45195 34037 16846 6911 18465 -22969 -54668 -31707
1207 -31707 -2099 -10061 -40859 -17266 32801 45779 24739 -1880 18202 15072 1406 -24318
1195 -24318 -31323 -11866 -15955 -49424 -60394 -42111 -42961 -1996 8793 16713 9734 7478 1738
1182 1738 6134 -16822 813 11635 16032 36414 45061 54947 26362 5429 -25412 -38853 -23170
1169 -23170 22796 46709 56283 39543 10137 5947 5476 -13809 -10414 19053 21662 -3082 -51399
1156 -51399 -29906 13647 33921 10375 3202 11803 7589 -13426 -21889 -24740 15474 10679 11757
1143 11757 29000 27480 -6954 -28490 9124 30759 12466 22571 10770 -7671 -20273 -83120
1131 -83120 -83131 -32509 -1771 -27304 -61735 -2571 33137 -4983 -47481 -16957 -2763 -166 16975
1118 16975 38175 52559 47128 63106 83806 60884 39865 35491 15404 11403 3101 20706 45269
1105 45269 47771 16026 -4040 -39433 -60424 -34958 -21204 -74905 -54140 -27465 -25446 -21251
1093 -21251 18495 39305 64748 58047 63643 81650 63548 43613 36543 33059 37214 54561 60350
1080 60350 50840 75061 74638 80054 77951 41181 19556 39359 31755 56863 46330 6750 28394
1067 28394 19129 7866 7976 18304 35598 28982 18636 -15553 -20770 -30952 -37096 -75599 -85590
1054 -85590 -72207 -69946 -75979 -44278 -33412 -45700 -49136 -36195 -8443 23079 -608 -4379 12066
1041 12066 35618 51917 42232 34258 16654 1521 -14826 -11166 -33084 -53148 -39359 -24559
1029 -24559 -9911 -376 -5296 -12993 -26825 63 40350 30342 33639 57343 34400 1640 -18184
1016 -18184 -41389 -43474 -23116 -19652 184 -6542 21312 41088 -7021 -48461 -25594 -29550 -20740
1003 -20740 -23706 -27847 -45447 -47228 -23641 1121 35323 32066 15522 13454 6718 -19854 -54968
990 -54968 -95769 -58502 -50417 -65456 -61947 -36241 -29117 -20879 11098 28582 43406 35230 26383
977 26383 -5154 -24936 17298 39039 29191 -22651 3922 18110 -2880 -38546 -33017 -15484
965 -15484 6570 7514 -30487 -66601 -46601 -32356 -47384 -41964 -68903 -64744 -48008 -61036 -37051
952 -37051 -40647 -2468 3686 -17833 -33652 -43961 2891 -4530 -1810 14802 -1439 -31464 -35092
939 -35092 -44593 -47524 -53243 -28167 -8138 3063 12098 10604 -11550 -28222 -47961 -41746 -6192
926 -6192 25800 44738 -3638 -23570 -18576 10173 18952 19327 -15296 -8755 -5722 2523 -25459 -25699
912 -25699 27652 13678 -1297 -6225 -45007 -44306 -47345 -34730 -14486 -10114 -21459 -8960 -5973
899 -5973 -5359 -16996 -32724 -79390 -60451 -30693 -22118 -11940 -7061 -6666 -21627 -43501 -63699
886 -63699 -65464 -36286 -67447 -31865 17535 -9335 -48603 -65336 -37441 -13404 23346 35940
874 35940 11834 -48669 -64309 -35958 -7006 -27198 -48156 -47155 -61830 -77057 -58769 -53819
862 -53819 -43643 -19238 -26224 -31961 -20254 -19697 929 -4895 -1912 24460 34300 6761 -31945
849 -31945 -44345 -25961 -25229 -62945 -49774 -59102 526 11155 -6382 -32457 -61807 -40786 -20866
836 -20866 -19580 -14617 -41740 -47201 -6597 -22934 -15304 1810 28437 22970 40645 29992 12944
823 12944 12883 2679 -21014 8136 -2133 687 -4538 145 54225 71533 51428 46688 33462
810 33462 34123 20799 24890 19225 1935 14867 6554 284 28484 9110 12537 62569 56181 52031
796 52031 86184 49337 -4211 25211 29094 27862 -25284 -33828 1724 11249 10159 -1356 22119
783 22119 68729 66007 12800 -16294 -5338 -9922 7492 9162 24104 14709 20782 66572 71572
770 71572 67238 22736 43973 38217 36141 -24675 -49152 -44676 -41285 -48892 -10736 9892 19003
757 19003 58937 39682 18581 33539 59799 34266 19004 15522 33328 -2761 1235 -12507
745 -12507 17950 28370 7943 -41812 -10829 -35449 -84435 -63651 -62624 -37460 7092 58439
733 58439 44453 27104 56374 49336 28257 29843 23094 13231 2129 1799 4768 -6792 -6309 -5266
719 -5266 15691 39413 50578 24447 -1456 -19734 7253 7975 26790 30364 3962 19409 41601
706 41601 39316 4855 -12896 -6544 214 6694 -17851 9971 36228 62501 104476 84245 33713
693 33713 17021 -23206 -21305 -29604 -51172 -22638 33303 61428 16046 -14527 -22416 -19193 4671
680 4671 39977 40948 8166 -16415 -4772 32891 59634 50326 24311 -15286 -32898 -18948 17888
667 17888 23322 27737 68332 47940 30580 -9624 -1705 -19203 -20873 31830 38152 12888 -6547
654 -6547 -16233 -970 84686 65892 -609 -62768 -66062 -51908 -29539 9706 9985 10528 36173
641 36173 51697 53231 54972 45605 6250 15047 60669 64110 22267 25641 49951 36659 32897
628 32897 43026 61434 25476 20637 17318 9985 25938 45324 43071 23188 10858 13362 67187
615 67187 77921 60990 38905 29414 8391 4470 38150 54710 59119 67051 6394 -49816 -58135
602 -58135 -32408 -29441 -41236 -30872 8095 32881 32278 27632 -847 7961 54654 107697 79772
589 79772 20796 -23238 -2018 11906 22336 29448 10994 1513 23798 1270 38867 52080
577 52080 6053 -12904 -1791 -15692 -20227 -10922 11432 61986 97471 93745 60985 68020 57669
564 57669 37286 19022 -6554 -641 3588 20622 18838 -7209 -10621 -19311 -15921 -6389 -12201 24405
550 24405 41867 46007 33091 4293 -14013 18250 29109 -3725 -16355 -30496 -17261 53727
538 53727 42671 13067 -695 53277 112145 96626 72444 52395 27194 2619 4140 45909
526 45909 60392 41030 23672 17717 13604 26462 2384 4131 22391 10196 5183 36944 29605
513 29605 -23086 -25413 -8607 -23356 -33190 6020 4841 -14998 -8840 -22935 -26919 -24487 -28925
500 -28925 -6163 -17400 -10149 16377 -17128 -24625 -42922 -27312 -9049 2555 27697 31909 4411
487 4411 -4187 20023 45761 34159 35555 46834 52541 84229 51973 24298 -5632 15334 -1912
474 -1912 -22085 -224 33763 29074 6734 -2066 -32382 -39097 -39662 -16707 -29974 -39020 -25319
461 -25319 -78643 -53732 -29567 -2453 14997 15617 -7057 -40983 7200 47871 35020 -3920
449 -3920 -26342 -39788 -19307 -13576 -19599 -37904 -1888 42373 53675 23047 50764 71971 74414
436 74414 77058 51953 19853 -21818 -47191 -55520 -49379 -48202 -5554 58033 55177 33532 9693
423 9693 -19532 4364 26812 18318 -3187 12648 34073 47025 36276 5945 34921 23182
411 23182 8403 34663 23207 27093 12250 17565 21723 -5461 -7015 28824 33878 7641 -12587
398 -12587 -6718 -821 38098 41461 9559 -6965 22502 51803 68745 48919 30566 -3645 -10416
385 -10416 8759 -356 -10076 -20074 9749 49600 92682 80774 38651 45420 42117 46588 65981
372 65981 31292 6028 26214 30904 10962 -355 -22674 -32776 -31701 -16040 -22868 -14247 -32424
359 -32424 -41763 -31900 -33782 -25035 -1213 2598 -9125 -15327 3126 14671 32508 47365 9496
346 9496 -42795 -42847 -10008 -13726 -18472 121 3529 40160 56949 34085 39732 54796 33725 2865
332 2865 -12304 7605 33319 36022 45207 60389 37370 106 4185 -9365 -25701 -21110 -51882
319 -51882 -76209 -52855 -41551 -26464 -33522 -16051 -13832 -45812 -54000 -79900 -68765 -31694 -1987
306 -1987 -8637 -8341 34515 33893 27841 42789 26234 24718 55195 34784 45284 59440 74929 81474
292 81474 57368 28305 34478 71405 68388 31238 26311 11971 -20311 -52940 -35060 7891 20593
279 20593 18745 -14589 -33076 -53653 -20783 1136 -25882 -20579 11774 156 -15153 -33669
267 -33669 -22543 -28103 -21795 1603 10255 -5938 2771 43665 52985 52667 72577 61388 24065
254 24065 11439 24372 14291 26432 10900 8738 22227 20410 -4850 14760 36686 23644
242 23644 -21753 -28085 -18598 17430 43580 43426 51777 38447 922 -20738 -294 4021 25062
229 25062 10169 8121 27645 17559 -14225 -18562 -4815 27728 32955 10024 8221 -1679 9344
216 9344 28321 28514 21108 -6380 -1386 5711 10910 42636 25598 27470 13552 17492 25948 37070
202 37070 39567 46000 41620 10855 -6606 -4182 -15471 -53094 -51974 -51981 -34405 -23014 -920 10295
188 10295 27900 13922 -28187 23148 41475 3500 -26146 -26702 7071 7546 19656 39419 30718
175 30718 6605 -1209 21893 36412 387 -12805 -4538 4566 -1312 -28679 -16317 2166 12616
162 12616 -38383 -44460 -17552 18653 -4724 -10506 14500 17157 15961 32013 40879 37215 28639
149 28639 38151 37698 36422 48384 57785 36174 21703 17386 2639 -18817 -41168 -28148 -48720
136 -48720 -56886 -8193 5217 -2005 12875 11251 4482 22782 18859 -8364 -21766 -6311 29754
123 29754 29139 22018 -8238 -21424 -11165 -23394 -9500 -10053 -6925 4656 7834 -12312 -1405
110 -1405 2619 19039 15845 10747 8121 14820 40883 32769 -24316 -32767 2824 1584 12352 -11269
96 -11269 -19309 -9473 -18353 -27928 -18895 -16543 -21226 -27595 -24974 -17511 21054 30394 27752 25269 23989
81 23989 12855 -11314 -29743 -5127 4586 -5118 -17295 -13842 -13470 13967 21651 1636 11676
68 11676 45633 39610 12275 -5497 12186 35473 37571 34448 9346 -8198 -22256 3180 4597
55 4597 -3960 -23428 -59079 -44964 -10526 23030 709 -5769 658 -15742 -19498 21663 5639
42 5639 -37240 -29361 2554 7117 34802 47882 21334 20604 20154 19795 -12076 -26020 -42174 -34436
28 -34436 -12965 -357 12653 8903 -7589 -3398 24370 41237 34299 22759 12456 12167 -9973
15 -9973 -13476 -4998 15344 13379 17627 -8013 -27745 -13009 -1847 8602 7605 4598 6290 13190
1 13190 25810
0 25810
$$ Imaginary data points
$$ [...]
##END NTUPLES=NMR SPECTRUM
##END=
