##TITLE=Analysis number 329454
Compound Code cd 08403
Project Code adrs
Chemist Name fwd chemicals
##JCAMPDX= 6.0         $$ Bruker NMR JCAMP-DX V2.0
##DATA TYPE= NMR SPECTRUM
##DATA CLASS= NTUPLES
##ORIGIN= Bruker BioSpin GmbH
##OWNER= nmr
$$ XWIN-NMR		Version 3.5
$$ Mon Sep  3 15:49:15 2007 GMT Daylight Time (UT+1h)  MAYBRIDGE\nmr@NMR_250MHZ
##.OBSERVE FREQUENCY= 250.131544655141
##.OBSERVE NUCLEUS= ^1H
##.ACQUISITION MODE= SIMULTANEOUS (DQD)
##.ACQUISITION SCHEME= undefined
##.AVERAGES= 16
##.DIGITISER RES= 18
##SPECTROMETER/DATA SYSTEM= dpx250
##.PULSE SEQUENCE= zg30
##.SOLVENT NAME= CDCl3
##.SHIFT REFERENCE= (INTERNAL, CDCl3, 0, 16.522)
##AUDIT TRAIL= $$ (NUMBER, WHEN, WHO, WHERE, WHAT)
$$ ##TITLE= Audit trail, XWIN-NMR		Version 3.5
$$ ##JCAMPDX= 5.01
$$ ##ORIGIN= Bruker BioSpin GmbH
$$ ##OWNER= nmr
$$ C:\u/data/dgb/nmr/ADRS/100/pdata/1/auditp.txt
$$ ##AUDIT TRAIL=  $$ (NUMBER, WHEN, WHO, WHERE, WHAT)
(   1,<2007-09-03 15:48:02.64 +100>,<MAYBRIDGE\nmr>,<NMR_250MHZ>,
      <created by zg, POWCHK disabled, PULCHK disabled
       configuration hash MD5:
       76 6E 9A 78 1E 09 19 81 EC 84 63 8F B0 6A 59 2D
       data hash MD5: 64K
       52 87 93 B8 3B 8E D4 1F 77 B0 EC E8 35 03 A1 D7>)
(   2,<2007-09-03 15:48:34.62 +100>,<MAYBRIDGE\nmr>,<NMR_250MHZ>,
      <Start of raw data processing
       ef LB = 0.3 FT_mod = 6 PKNL = 1 SI = 32K 
       data hash MD5: 32K
       B5 BD 5C B5 B2 54 D4 E0 C3 E3 5E 0D EE BF 2A 16>)
(   3,<2007-09-03 15:48:40.09 +100>,<MAYBRIDGE\nmr>,<NMR_250MHZ>,
      <apk 
       data hash MD5: 32K
       52 7A 2F 5D F1 73 45 12 88 05 F8 2F 66 AD 68 8E>)
(   4,<2007-09-03 15:48:45.26 +100>,<MAYBRIDGE\nmr>,<NMR_250MHZ>,
      <abs ABSG = 5 
       data hash MD5: 32K
       85 54 7D 30 09 9A 86 9C A5 AF F0 6D CC 32 36 7E>)
$$ ##END=
$$ 
$$ hash MD5
$$ 8D 95 B7 9B 70 34 A2 C6 30 28 04 C5 6B 46 C5 A2
##$RELAX= 
##$RELAX= 
##$RELAX= 
##$RELAX= 
##$RELAX= 
##$RELAX= 
##$RELAX= 
$$ Bruker specific parameters
$$ --------------------------
##$DU= <C:\u>
##$EXPNO= 100
##$NAME= <ADRS>
##$PROCNO= 1
##$TYPE= <nmr>
##$USER= <dgb>
##$AMP= (0..31)
100 100 100 100 100 100 100 100 100 100 100 100 100 100 100 100 100 100 
100 100 100 100 100 100 100 100 100 100 100 100 100 100 
##$AQSEQ= 0
##$AQ_mod= 3
##$AUNM= <au_zg>
##$AUTOPOS= <36 >
##$BF1= 250.13
##$BF2= 250.13
##$BF3= 250.13
##$BF4= 250.13
##$BF5= 500.13
##$BF6= 500.13
##$BF7= 500.13
##$BF8= 500.13
##$BYTORDA= 1
##$CFDGTYP= 0
##$CFRGTYP= 5
##$CHEMSTR= <none>
##$CNST= (0..31)
1 1 145 1 1 1 1 1 1 1 1 1 1 1 1 1 1 1 1 1 1 1 1 1 1 1 1 1 1 1 1 1 
##$CPDPRG= <>
##$CPDPRG1= <>
##$CPDPRG2= <>
##$CPDPRG3= <>
##$CPDPRG4= <mlev>
##$CPDPRG5= <mlev>
##$CPDPRG6= <mlev>
##$CPDPRG7= <mlev>
##$CPDPRG8= <mlev>
##$CPDPRGB= <>
##$CPDPRGT= <>
##$D= (0..31)
0 1 0 0 0 0 0 0 0 0.06 0 0 0 0 0 0 0.0002 0 0 0 0 0 0 0 0 0 0 0 0 0 0 
0 
##$DATE= 1188830878
##$DBL= (0..7)
120 120 120 120 120 120 120 120 
##$DBP= (0..7)
150 150 150 150 150 150 150 150 
##$DBP07= 0
##$DBPNAM0= <>
##$DBPNAM1= <>
##$DBPNAM2= <>
$$ [...]
##$SUBNAM7= <"">
##$SUBNAM8= <"">
##$SUBNAM9= <"">
##$SW= 20.6930455092707
##$SWIBOX= (0..15)
0 0 3 0 0 0 0 0 0 0 0 0 0 0 0 0 
##$SW_h= 5175.983436853
##$TD= 65536
##$TD0= 1
##$TE= 297.16
##$TE2= 300
##$TE3= 300
##$TEG= 300
##$TL= (0..7)
0 120 120 120 120 120 120 120 
##$TP= (0..7)
150 150 150 150 150 150 150 150 
##$TP07= 0
##$TPNAME0= <>
##$TPNAME1= <>
##$TPNAME2= <>
##$TPNAME3= <>
##$TPNAME4= <>
##$TPNAME5= <>
##$TPNAME6= <>
##$TPNAME7= <>
##$TPOAL= (0..7)
0.5 0.5 0.5 0.5 0.5 0.5 0.5 0.5 
##$TPOFFS= (0..7)
0 0 0 0 0 0 0 0 
##$TUNHIN= 0
##$TUNHOUT= 0
##$TUNXOUT= 0
##$USERA1= <user>
##$USERA2= <user>
##$USERA3= <user>
##$USERA4= <user>
##$USERA5= <user>
##$V9= 5
##$VALIST= <valist>
##$VCLIST= <CCCCCCCCCCCCCCC>
##$VD= 0
##$VDLIST= <DDDDDDDDDDDDDDD>
##$VPLIST= <PPPPPPPPPPPPPPP>
##$VTLIST= <TTTTTTTTTTTTTTT>
##$WBST= 1024
##$WBSW= 4
##$XGAIN= (0..3)
0 0 0 0 
##$XL= 0
##$YL= 0
##$YMAX_a= 513457
##$YMIN_a= -399085
##$ZGOPTNS= <>
##$ZL1= 120
##$ZL2= 120
##$ZL3= 120
##$ZL4= 120
##$ABSF1= 16.522
##$ABSF2= -4.171173
##$ABSG= 5
##$ABSL= 3
##$ALPHA= 0
##$AQORDER= 0
##$ASSFAC= 0
##$ASSFACI= 0
##$ASSFACX= 0
##$ASSWID= 0
##$AUNMP= <proc_1d>
##$AZFE= 0.1
##$AZFW= 0.1
##$BCFW= 0
##$BC_mod= 0
##$BYTORDP= 0
##$COROFFS= 0
##$CY= 12.5
##$DATMOD= 1
##$DC= 0
##$DFILT= <>
##$DTYPP= 0
##$F1P= 14.0000005364418
##$F2P= -0.99999901652339
##$FCOR= 0.5
##$FTSIZE= 32768
##$FT_mod= 6
##$GAMMA= 0
##$GB= 0
##$INTBC= 1
##$INTSCL= 1
##$ISEN= 128
##$LB= 0.3
##$LEV0= 0
##$LPBIN= 0
##$MAXI= 10000
##$MC2= 0
##$MEAN= 0
##$ME_mod= 0
##$MI= 0
##$NCOEF= 0
##$NC_proc= -2
##$NLEV= 6
##$NOISF1= 0
##$NOISF2= 0
##$NSP= 0
##$NTH_PI= 0
##$NZP= 0
##$OFFSET= 16.522
##$PC= 1
##$PHC0= -42.38321
##$PHC1= 4.301706
##$PH_mod= 1
##$PKNL= yes
##$PPARMOD= 0
##$PSCAL= 4
##$PSIGN= 0
##$REVERSE= no
##$SF= 250.13
##$SI= 32768
##$SIGF1= 0
##$SIGF2= 0
##$SINO= 400
##$SIOLD= 32768
##$SREGLST= <1H.CDCl3>
##$SSB= 0
##$STSI= 32768
##$STSR= 0
##$SW_p= 5175.98343685301
##$SYMM= 0
##$S_DEV= 0
##$TDeff= 65536
##$TDoff= 0
##$TI= <Analysis number 999999
Compound Code 99
Book Reference 9
Project Code 9>
##$TILT= no
##$TM1= 0
##$TM2= 0
##$TOPLEV= 0
##$USERP1= <user>
##$USERP2= <user>
##$USERP3= <user>
##$USERP4= <user>
##$USERP5= <user>
##$WDW= 1
##$XDIM= 32768
##$YMAX_p= 303186928
##$YMIN_p= -60406
$$ End of Bruker specific parameters
$$ ---------------------------------
##NTUPLES= NMR SPECTRUM
##VAR_NAME=  FREQUENCY,     SPECTRUM/REAL,   SPECTRUM/IMAG
##SYMBOL=    X,             R,               I
##VAR_TYPE=  INDEPENDENT,   DEPENDENT,       DEPENDENT
##VAR_FORM=  AFFN,          ASDF,            ASDF
##VAR_DIM=   32768,         32768,           32768
##UNITS=     HZ,            ARBITRARY UNITS, ARBITRARY UNITS
##FACTOR=    0.157963299565203, 1,           1
##FIRST=     4132.6476996994, 0,             0
##LAST=      -1043.33573715361, 0,           0
##MIN=       -1043.33573715361, -60406,      0
##MAX=       4132.6476996994, 303186928,     0
$$ Real data points
##PAGE= N=1
##DATA TABLE= (X++(R..R)), XYDATA
$$ [...]
24461A7691j0532q699j879j3562O097j681j1429J3113j392n482O131r907N730
24448a5801J0884L588N45J7342K085j4212k366k0057n664N663K3523K3514N13
24435B9557q62j4408j6894n567M351r240J5510K0030p32j8655j5041j0458J992
24422b0417R498M556J706J6179R543o040O016o016j9796p78J1784j159o741l081
24408d746L584L162J909R030O966j8359r634K826O398P632j510L495p490L136
24394F399m565k591j0208n431j4030l578K725M585K0694m416Q647P037j479q29
24380B960j0041K005P599O016M436o105n413J193j2414J8076R378K8p722r096
24366I00n650R149J1078J9637M170j1421j873r732m0j0035o636J3361J910J5045
$$ y = [17691, 7159, -1540, -3419, -16981, -10884, -12565, -23994, -10881, -12273, -17755, -11624, -21531, -15801, -4917, -1329, -784, 16558, 18643, 4431, 2065, -17992, -23656, -17993, 5530, 29044, 29557, 28695, 14287, -2607, -8174, -3823, -13063, 2447, 22477, 21745, 3090, -11951, -22409, -20417, -10919, -6363, -4657, 11522, 21065, 15025, 21041, 15025, -4771, -5549, 6235, 5076, -1665, -4746, -1162, 2000, 3909, 12939, 19905, 1546, -8088, -5262, 1136, 8768, 7258, 10753, 3263, 6399, 1834, -757, -10965, -16396, -30426, -34004, -31279, -26694, -6000, -10416, -1769, 5268, 3789, 2960, -7081, -5076, 2523, 8539, 12975, 6870, 1457, 2650, -9764, 8312, 17690, 17718, 9996, 900, -4750, 4399, 15477, 35114, 39284, 27863, 25990, 16258, 16218, 6183, -453, 12908, 14818, 29863]
24352B9863m568j1594P84m345L211J4463K026K402O024p814o551j6661j7300r208
24338a9268o935K8800J0963j2054o90Q09J550K986m822O995j70J584k53k2646
24324a3151p284R659L139m79K6133J3500j3930p163L45M900Q332L561r308j826
24310A6428j2389j2919j2301q191k870J2290J5604J3555m167n80m543M59o039
24297e663n988R157J5319j0072j7815J2513l086m045J6231n959r188k165j7182
24284b7943Q779K2276N105L956M176J1767j8674k1289M71M931K42J4026M905m385
24270H343j3776L099K4686L027r452q646j5268O018M737j3622l485K613J2025
24257B99o60l294n5r922o158j099R294Q573R85l548O501K420m897j0451j820J169
$$ y = [29863, 25295, 13701, 14485, 10140, 13351, 27814, 29840, 32242, 38266, 30452, 23901, 7240, -10060, -19268, -26203, 2597, 13560, 1506, 816, 1625, 3175, 6161, 1339, 8334, 8164, 9748, 9495, -13151, -20435, -10776, -7637, -8116, 18017, 31517, 17587, 10424, 10769, 15669, 24001, 27562, 18254, 16428, 4039, -8880, -21181, -29372, -32242, -19952, -4348, 9207, 5040, 4460, -83, 376, -5663, -11651, -2494, 12825, 2753, -15062, -2549, -5635, -9680, 6551, 592, -8596, -10761, -27943, -19164, 3112, 8217, 12173, 16349, 28116, 9442, -11847, -11376, -6445, -6203, 7823, 12728, 8343, -5433, -2334, 22352, 25379, 15927, 7281, -7987, -1969, 2768, -10854, -14339, -11726, 299, -361, -3655, -3710, -13632, -19790, -20889, -11595, -3022, -2037, -5585, 916, 3336, -1561, -12012, -13832, -12663]
24241a2663Q815p433J8697Pj1352p264J2549Q90j4073J2497M784o31j880J885
24227D828n680k1002j0123Q465J2905O842n926J5003j3269k0372P635K6852M950
24214A1108R029p794j7179l140p593r531K0917J2052J0640N076p159j1170j5350
24201a0094p344Q156k477M634q551J5587J0050L248R187N756k0579p926O83n328
24187d998J1121K0109j7513O131l577r879O213P912r717p161n954l488j2513l209
24173b6523J3114J4379P317m173J555l756j857R847J702M338J153n088j8426r835
24159a6253q872J2121J6854J7j4941J8177J9110M261r957j0218j8568j0306P175
24146a1400j897J593L270L112R918P781o902J5746l288j0217M844l368j1052j0084
$$ y = [-12663, -3848, -11281, 7416, 7423, -3929, -11193, 1356, 2246, -11827, 670, 5454, 4823, 2943, 4828, -852, -21854, -31977, -23512, -10607, -3765, -9691, 5312, -7957, -28329, -20694, 6158, 11108, 20137, 12343, -4836, -7976, -15569, -25100, -4183, 7869, 18509, 23585, 16426, 5256, -10094, -17438, -9282, -11759, -7125, -15676, -89, 9961, 13209, 22396, 28152, 7573, -353, 330, -4998, 6123, 26232, 8719, 14850, 11273, 1394, 7607, 15519, 5802, -1359, -7313, -10801, -23314, -26523, -13409, 970, 8287, 4114, 5669, 1913, 56, 9903, 11605, 15943, 17096, 12008, -6418, -16253, -25125, -13004, 3850, 3867, -11074, 7103, 26213, 30474, 20517, 10299, -8269, -18575, -11400, -13297, -11704, -8434, -5322, 4596, 12377, 5475, 21221, 17933, 7716, 12560, 9192, -1860, -11944]
24132a1944p628l534J1727K6961J9026m595l0528m81j141j3516J300J2745K1810
24119B0202J5198r693j7584J958K897P999j4492j2692j7392p068L74Q215N957
24106a6121r06k090O707p858k400j0940j5477K2095R530l153J669j797k561R570
24092a3732l366q514K750q167L963M575K923k444l420J3734K419n217N43J144
24078a2809J0045Q420J0249j906J773n181j809L727l972m325N132K233R16P250
24064A9743k1288j3652J9661J006M353J6546r070r439j8485m354M623k153J762
24051a0747L989M167J136j4155O784J524N46j2839P093k348l100O390Q741K6278
24037B3459K856j7916j6397J1688J146j6647k079P382P517J4373j3955j6523M188
$$ y = [-11944, -19572, -23106, -11379, 15582, 34608, 30013, -515, -996, -2137, -15653, -14353, -1608, 20202, 35400, 25707, 8123, 10081, 12978, 20977, 6485, -6207, -23599, -30667, -30293, -22078, -16121, -17027, -19117, -12410, -20268, -22668, -33608, -49085, -26990, -17460, -20613, -18944, -20741, -23302, -13732, -17098, -25612, -22862, -31029, -27066, -22491, -19568, -22012, -25432, -11698, -9279, -14496, -13953, -12809, -2764, 5656, 15905, 13999, 15772, 10591, 8782, 12509, 8537, 4212, 9344, 11577, 12493, 19743, -1545, -15197, 4464, 5470, 9823, 26369, 17299, 7860, -10625, -14979, -10356, -12509, -10747, -6758, -2591, -1455, -15610, -8826, -7302, -6756, -19595, -12502, -14850, -17950, -11560, -2819, 23459, 26315, 8399, -7998, 3690, 4836, -11811, -13890, -6508, 1009, 15382, 1427, -15096, -10908]
24024a0908n153J4605k407L813Q988J0293j5568j5621Q152J2758k396J268k340
24011E484r632p503j9750K615J1098Q592n628j1800J4910M512q539j6372m66J2100
23997b0379J5355j755j9848Q815J0532K676R228J1288r072j1914k496N211K2340
23984A9981J3731k2248j8538J2545Q553M706k341k4298K364J4973o692k420j609
23971a293q639L846n018j3851J1178J2427n907j399q609M023K3825J605j7214
23958e026j2554n244J7595O376J2394M436k1897R115q312p40o192j1141P942J6586
23944C338n664m395J1651m219j5224J4985q558M787R717o48p17O621r28j8944
23930h198j3258j4412j751J0206K3059M608r224m296J2546L145l759q317j8000
$$ y = [-10908, -16061, -1456, -3863, -50, 8938, 19231, 3663, -11958, -3806, 8952, 6556, 7824, 5484, -4148, -11651, -31401, -28786, -17688, -9096, -14724, -26524, -11614, -7102, -15641, -32013, -32479, -20379, -5024, -6779, -26627, -17812, -7280, -4604, 4624, 15912, 6840, -5074, -7570, -2359, 19981, 33712, 11464, -7074, 5471, 14024, 18730, 16389, -7909, -5545, 9428, 2736, 316, -1293, -9932, -6086, -11104, -24955, -13777, -1350, -7257, -8656, -17265, -13242, 10583, 12188, -5026, -17580, -22824, -5229, 1147, 13541, 17977, -3920, 5195, -3117, -3857, -10049, -21190, -13248, 3338, -2326, -6721, 4930, 711, -14513, 472, -8086, -3299, 6418, 5770, 5053, 11674, 10746, -8198, -21456, -35868, -37619, -27413, -4354, 254, -8970, -13266, -720, 2425, -1334, -9651, -27651]
23917b7651J5807J1509K560j0452j2274P846k119J6957K616k857J6382Q978k718
23904B4584j0146J220q180j853J2846O737P063P61L598j4084j6075j8567j6761
23891b8857k076J8202J339n298k873J4193K1321m665m140N83J0520j913o089N9
23877A0306m635q175j1069J0400J4191n658l754J3983j051j0553l147m62J78J7442
23863A7996K924m179o013N294k319R008P263j6415J2399J34j4720o854N393n057
23849D854j5003M281J1772Q322p482o140j7865J6109M278q496j257j861k694p557
23835a8739O137J8606J7525J0316j6142j4928m692j4308M289Q857o381j3871O643
23822a6688j0913j1282J7666K5376J831k791j3987J4777J6463n488r226k6436
$$ y = [-27651, -11844, -335, 2225, -8227, -20501, -12655, -14774, 2183, 4799, 1942, 18324, 27302, 24584, 14438, 15658, 7478, 5625, 18471, 25208, 32271, 33032, 36630, 22546, 6471, -12096, -28857, -30933, -12731, -11392, -16690, -19563, -5370, 15951, 11286, 7146, 7729, 18249, 16336, 10247, 10306, 5671, -2504, -13573, -3173, 11018, 5360, 1606, 15589, 14538, 3985, 838, 376, 554, 17996, 20920, 16741, 10728, 16022, 13703, 22711, 29974, 13559, 25958, 26092, 11372, 4518, 9911, 4854, -10149, -5868, 5904, 14226, 6744, 604, -17261, -1152, 3126, -5370, -6627, -8488, -11182, -18739, -12602, 6004, 23529, 33845, 17703, 2775, -1917, -16225, -11936, -3079, -9460, -23331, -16688, -27601, -38883, -21217, 4159, 5990, 3199, -10788, 3989, 20452, 14964, 5738, -20698]
23810b0698j5740j7439M901J7853Q999o748K0309J3410n714j4107L010J0286l036
23797d714n805j111Q617J8915l526p646L837L897r063k7410R227J9765L474j0276
23783a819o635R952J7445L063p961j1068l144L470j5586j0186O957J5220K3091
23770B2799q302k0908j6715Q002J7473J0696P037R968j511r69j0094o537n603
23757E336j1320J8183J5302j7581j5237l574M902Q802N190k936K158N749m816
23744A0158j6304q04j434k491K0899p66J0474l19j4846q011m743j477K2641q068
23730D909k814R256J1051j1067q477n479j4521j3205N597K737Q76Q705P754p472
23716a2150R108J0032M143o316j2540j0056M667J7568K634q515O558J3325J3458
$$ y = [-20698, -36438, -53877, -48976, -31123, -22124, -28872, -8563, 4847, -867, -14974, -11964, -1678, -4714, -10519, -11630, -3013, 15902, 12376, 4730, 8567, 12464, 3401, -24009, -14782, 4983, 8457, -1819, -8454, 1498, 18943, 22006, 14045, 2977, -167, 3303, -12283, -22469, -15512, -292, 22799, 14497, -6411, -23126, -15124, 2349, 13045, 20082, 30050, 28539, 27570, 17476, 10939, 5336, -5984, 12199, 27501, 9920, -5317, -8891, -3989, 4813, 10003, 7067, 9225, 14974, 10158, -6146, -6950, -8384, -10875, 10024, 9258, 19732, 19413, 4567, -3444, -8187, -9664, 12977, 4909, 2095, 11351, 22402, 11335, 2858, -2621, -17142, -30347, -24750, -22013, -21137, -12432, -4678, -12150, -3042, 6990, 11133, 4817, -7723, -17779, -13112, 4456, 7090, -1425, 5133, 18458, 31916]
23703C1916o824m076j2814k3977j3171O569P874J4887J0807m943p477p063j1423
23690a9715q686J6038J8756N130J515j4250j0499R986M848J3595r56k2006j5456
23677b1700j0642p516m72J9823J2483R063R286J269J7289n227j1336j1746J318
23664A892J4738p95j17n40J0776p492j3318L903Q192l108J858j2253j3545m629
23650a4438L245p193l242J376J0836J270J2347K631n191j5770K468j8595j5748
23637d6004K7604J6801j3577j848N75J7865k302j3940J6778Q850M655K165j3813
23624C809r48Q944J5754j5775j5720r186q343J6187K7555j1818j8251l706J6894
23611E396N749j9520k5747q817J1412K1619P115j1384Q169Q881o7P028J7311r290
$$ y = [31916, 25092, 21016, 8202, -15775, -28946, -22377, -14503, 384, 11191, 6248, -1229, -8292, -19715, -28401, -12363, 6393, 11523, 13038, -1212, -11711, -1725, 3123, 16718, 15762, -6244, -21700, -32342, -39858, -40330, -20507, -8024, 1039, 10325, 11594, 28883, 23656, 12320, 574, 1892, 16630, 15835, 15718, 15178, 25954, 18462, 5144, 9047, 17239, 14131, 15989, 3736, -9809, -14438, -11193, -18386, -21628, -20252, -9416, -8146, 4201, 6832, 1641, -14129, -11661, -30256, -46004, -18400, -1599, -15176, -17024, -16449, 1416, -886, -14826, 1952, 10802, 15457, 17622, 3809, 2861, 11805, 27559, 11784, -3936, -13122, -21465, -5278, 22277, 10459, -7792, -11498, 5396, 11145, -8375, -34122, -42939, -31527, -9908, -2793, -14177, -6008, 2873, 2806, 9834, 27145, 17855]
23597A7855j8908j0564r665L136j836J7069M198q474j0740J5914p86n241O905
23584a137m154r934P865P784r330j1802L480N155P702J3711N642J1537M876j4172
23570A7223j8463q640L227O434J8100j5606k6059J0602J0560O575j2623R133Q686
23557I149l708J7393J3206r199j3861j0481j0036n638J3600N406j5651K2392o02
23544A1970O284j1256k5354J37J3313N60J231k032k488L004L309p508O406j0569
23530a2993N572J4742k1556k7404P923K3292N804p219K690j3043j203J489O937
23517a4969L383k029L80P088R259O232K558j5242j4538j0348Q141j447j0767l064
23503c5363O323J5518P103Q197n67J8803m577j1008k206L831m196o099p708N485
$$ y = [17855, -1053, -11617, -21282, -18146, -19982, -2913, 1285, -7189, -17929, -2015, -2801, -8042, -1137, -5291, -15225, -7360, 424, -8906, -20708, -17228, -12073, -4371, 9340, 14982, 26519, 31395, 17223, -1240, -9880, -6653, -219, 17881, 2275, -23784, -13182, -2622, 3953, -8670, 463, 9149, 5441, 22834, 36040, 26841, 12980, 2499, -7537, -13175, 425, 5831, -9820, 12572, 11970, 18254, 6998, -18356, -18219, -4906, -4346, -3115, -5147, -7635, -4631, -1322, -8830, -2424, -12993, -7421, 7321, -14235, -41639, -33716, -10424, -4620, -11839, -9149, -22192, -23395, -21906, -14969, -11586, -13615, -13235, -6147, 3112, 9344, 11902, -3340, -17878, -28226, -20085, -21532, -32299, -35363, -29040, -13522, -6419, 1778, 1211, 20014, 15437, 4429, 2223, 6054, 1858, -4241, -11949, -6464]
23489f464P563J6097m746j7701k8306M497N157j2703q248J6617N041J9941J9376
23476A6121q561o680o11K606j942l850Q127P798k026l167l607O37J2576j0586
23462F835j0797j5459q404O226J0348K4086j489K790q382k7898K810L353J6275
23449B94J3573o728j1174m030J0631r848K942N884j4937o565J904K784N425J6849
23435G004L535J470m684R720j236o792Q370p017j2460O144J6980j3090j873K009
23421H080R221n153j6716M831R111l662n992j282q413p851M864J7190n131j4925
23407a5828m907J8753Q681r559n307K2913J4889O875k2744j2158J2507J0624j0888
23394A3851l002m571l825L197R729L431j5746r575n50L400k00R793q652O471L113
$$ y = [-6464, 1099, 17196, 12450, -5251, -33557, -29060, -23903, -36606, -44854, -28237, -23196, -3255, 16121, 7560, 880, 269, 2875, 933, -2917, 5210, 13008, 10982, 7815, 4208, 4845, 17421, 6835, -3962, -19421, -27825, -21599, -11251, 12835, 11346, 14136, 5754, -22144, -19334, -15981, 294, 13867, 7139, -4035, -8065, 2566, -7282, -4340, 1544, -13393, -19958, -18054, -15270, -9845, 7004, 10539, 12009, 7325, 17045, 15809, 9017, 17387, 10370, -2090, 4054, 21034, 7944, 6071, 8080, 17301, 12148, -4568, 263, 9374, 5712, -280, -1562, -9975, -17826, -12962, 4228, -903, -15828, -20735, -1982, 6699, -2860, -8167, 14746, 29635, 36510, 13766, 1608, 14115, 24739, 13851, 10849, 6278, 2453, 5650, 15379, 18810, 3064, -6511, -7061, -3661, -3861, 5932, -2720, 3751, 6864]
23379F864P535l973j0357K440j6203M181J7534p46R14J471j4467L117r853l561
23365a5104mJ9523M70j9671J3926R836n764k1059j9783M245K1020o497K450J3766
23351b646o566j0587K8278M776r595O9L099j5742j483J2j248R469J2074K5721
23337C5631j788r355p996q435k987j1097r821j312R931J7586O824l628r08Q213
23323B0858M451J348j4968j3624K503K7047k68l1799n060j3267j5119J0354J9030
23310h514K1974j3851p206N338K10l613M046K974k636j733K470j3979j6985L964
23296b7541K3252J6662K467j6872L159K904p942r55J1186o809J3144R414j6702
23283E367n721n406O258m864M579j2305q253O400J8427R636K295j4315Q640P169
$$ y = [6864, 14399, 10426, 69, 2509, -13694, -9513, 8021, 7275, 8189, 9660, -4807, -1690, -11543, -15104, -15108, 4415, 4885, -14786, -860, 8976, 3212, -17847, -37630, -33385, -12365, -18862, -16412, -2646, -9212, -19799, 8479, 13255, 3660, 3729, 6828, -8914, -10397, -10385, -11633, -2164, 9910, 35631, 33843, 24488, 16492, 8057, 5070, -6027, -15848, -17160, -7229, 10357, 17181, 13553, 12645, 20858, 25309, 26657, 11689, -1935, 568, 27615, 27347, -4452, -9512, -22779, -37898, -27544, -8514, 13460, -391, -7597, -2259, -2049, -5662, -1616, 1358, -1278, -3011, -541, -14520, -31505, -27541, -4289, 12373, 14840, -2032, 1127, 4031, -3911, -4866, 6320, -489, 12655, 22069, 5367, -354, -5760, 498, -4366, 213, -12092, -20345, -13945, 4482, 14118, 16413, 2098, 10738, 17907]
23269A7907j268n711r899j698k1099m41J1991L136J0534O515k184O315l857j6229
23255e988j8110J1652P913J7947K937n773k1153l983M044l358N336J6592q137
23242h1J4P937l957n171k711j3630k937k150l644M092l010n105P87J1808J9570
23227A812R549j7859j6265J0764K2534Q954l097J826j1369n414J2194j4364k0057
23214b0792J2151m375l973K236k925M136m225L199L129j0194J958J5515r184j5593
23200b8937j4984J0170N324J5199k861j0618M209P509n088M553K06o498K8283
23187F467J5476o460j2773j8042j0020K3098R416Q5k948J1643j0988m767K152
23174B339r112j0651M151J3489m053o817M758m245J7396J0887j1721j2081j5558
$$ y = [17907, 16639, 10928, 1029, -669, -21768, -22209, -10218, -7082, 3452, 9967, 7783, 14098, 10241, -5988, -24098, -12446, -4533, 13414, 16351, 10578, -10575, -14558, -10514, -13872, -8536, 8056, -81, -67, 7870, 3913, -1258, -3969, -17599, -20536, -22686, -26330, -22238, -25248, -30353, -29566, -17758, 1812, 11361, -6498, -22763, -11999, 10535, 19489, 16392, 18218, 6849, 1435, 13629, -735, -20792, -8641, -13016, -16989, -14753, -17678, -13542, -17767, -14568, -11439, -21633, -19675, -4160, -13344, -28937, -43921, -33751, -28427, -13228, -16089, -26707, -22498, -14989, -20077, -15524, -15318, -21816, 6467, 21943, 15483, 2710, -15332, -25352, -2254, 7162, 7247, 4299, 15942, 4954, 187, 2339, -6773, -17424, -13273, 216, -3837, -10654, -5896, -10141, 7255, 18142, 6421, -5660, -21218]
23161b1218J0119K1609N446O713L325k052Q837l982j0483J121Q182m891j8527
23148D199k888n952n192K1036q90n575J683j0566K692J2720j3589n288j51P516
23134b45L908N422j0654o706K817L899l757j3028j499J7265R811N913o669N833
23120A2310o726k970m44r165q434L61J3429p220N054O776L880R812M68q925j5082
23105f876Q822P093j3046j4482R228J8273J256J476o368n128o905r083M295k744
23091a4189j4502J248J890L099J0222l824J218p514P930O028l642n160M702J5437
23077B943M581R575K907j6660K258m801q505J226q136O025j308M077j007p738
23063a4563K554J5302r06j7555j2118J3164J5888Q979j2848J116M954j5166j4434
$$ y = [-21218, -11099, 10510, 15956, 22669, 25994, 23942, 32779, 28797, 18314, 19435, 27617, 22726, 4199, 1311, -4641, -9833, 11203, 10313, 4738, 6421, -4145, -1453, 11267, -2322, -7610, -7761, -245, 3663, 9085, -1569, -8275, -5458, -1559, -5316, -18344, -19843, -2578, 7233, 13146, 6477, 12310, 5584, 2614, 2170, -6995, -15429, -15068, -1639, -8859, -3805, 2971, 6851, 16663, 17131, 8206, -6876, 1946, 9039, -4007, -18489, -9261, 9012, 10268, 11744, 5376, 248, -6657, -15740, -11445, -14189, -28691, -27443, -25553, -22454, -12232, -16056, -14838, -22352, -14422, -8394, -12036, -17196, -12494, 2943, 7524, 17099, 20006, 3346, 5604, 803, -7702, -6476, -14612, -8587, -9895, -5818, -6825, -14563, -12009, 3293, 2387, -15168, -27286, -14122, 1766, 10745, -2103, -987, 3967, -11199, -25633]
23050b5633j4009J3057O91k616O43J3626K056p8m221P49j211j3678L802J4365
23036a2457l89p845p101J9613K967j3763j8197l304K5207J4633J3886N983m130
23023A5103j350j1591j1931q24J2529J1135p482o718l485O185M965Q38P129K2092
23009C6595j2651n072M257l31k2000j1196K175M604Q791P350R597O466j1128k5965
22995h508Q428J1211j1870o954r505q718N454R253l168Q930N168j2757p837J302
22981a9571J8133K616k958P292j250O190k707j5239L744K5752k822j8674l113
22968b607j385r487k504J3402J0650j9832q648o482j996j1152J5438J9694m733
22955i642l881O79k648j634M914P173k995j60J4421J630l738k959j6428j7210
$$ y = [-25633, -39642, -26585, -25894, -28510, -27867, -14241, -12185, -12263, -16484, -15735, -16946, -30624, -26822, -12457, -12846, -20691, -27792, -8179, -5212, -18975, -37172, -40476, -15269, -636, 13250, 19233, 15103, 13753, 2162, -9769, -10593, 1936, 13071, 5589, -1129, -4614, 1571, 6536, 7374, 14503, 36595, 23944, 18872, 23129, 22798, 798, -10398, -8223, -3619, 5172, 12522, 22119, 28585, 17457, -8508, -80, 11131, -739, -7693, -17198, -25916, -20462, -11209, -14377, -5447, -279, -13036, -20873, -19571, -1438, 1178, -1780, 5512, 4262, 10452, 7745, -7494, -3750, 22002, 19180, 506, -2607, -3992, -13479, -15983, -2581, 8069, -11763, -20411, -26893, -28889, -40041, -24603, -4909, -9642, -13523, -12844, -15492, -17126, -12212, -5039, -8034, -8194, 6227, 7857, 4119, 1160, -15268, -32478]
22941c2478j1684r619O345O888j550J6052K9424R707j495m619J156p535j0490
22928i898J0277L856j348L271L643r747p117M801k995J544q067j0104K225M979
22914a4680q567n365J2067O387j2143j8024k366Q575P670o655R476J0032K391
22901a1202j2666j2333J1126J2492k312M052Q277P605r757M977Q628m050k159
22888B678l618Q982J2966p399k3779K615o903J963K123N290J0154O524l207J3052
22874B1441q631j9291P934Q405Q893j0445j0409J5053K2837j3706k6563j844q845
22861a5171m10l749P636N943Q752n027r502R570l001J3151Q691n182l839k229
22847E633J5102l669n912J9686j750K237p501o045j0789j2520L386N007q918j3241
$$ y = [-32478, -44162, -53781, -47436, -40548, -42098, -26046, 3378, 13085, 11590, 6971, 8127, 592, -9898, 379, 4235, 2887, 6158, 9801, 54, -7063, -2262, -5257, -3713, -11780, -21884, -19659, -14680, -23247, -28612, -16545, -10158, -22301, -40325, -42691, -34116, -26446, -33101, -23625, -13593, -11202, -23868, -36201, -25075, -12583, -14895, -10843, -2566, 5039, -4718, 259, 8887, 4837, 2678, -940, 8042, 21008, 13609, -10170, -7555, -14458, -12495, -10372, -5082, 5072, 11596, 8389, 21441, 12810, -6481, 1453, 9858, 18751, 8306, -2103, 12950, 35787, 22081, -4482, -6326, -15171, -15581, -19330, -11694, -5751, 3001, -2026, -11528, -1958, -4959, 8192, 16883, 11701, 7862, 5633, 20735, 17066, 11154, 30840, 29090, 31327, 23826, 17781, 6992, -5528, -2142, 2865, -6053, -19294]
22833a9294o056J2640K4974J876J066j8247j1857k950K0682J3993M695j5202o373
22820e3q188J4328P464q186k3210O746K1345J3147q793o260p877p218j8347k047
22806b7149P479L665O678O948J354j3936l150Q316P407j2843n552J7226O868j3302
22792i991o590P234K597Q772J1555j2644m406J0908n169j4786r807M975Q798J3386
22778D832j4868j2566J2079M870j6025M380J4568J5567L1302Q681k5999j0177
22766A6644P901j0774O151r426J210m247J303j499j8980j2184j4965j3437R550
22753d2753j4658k237K7191K3530K620j898K161Mj989P704K504M043m233j0120
22739h131j9926k784O113K9340J0072K966O622k1347j4938k763R499O559n886
$$ y = [-19294, -25350, -12710, 12264, 14140, 15206, -3041, -14898, -17848, 2834, 16827, 21522, 6320, -53, -8241, 6087, 13551, 5365, -17845, -11099, 10246, 23393, 14600, 8340, 463, -6755, -25102, -27149, -19670, -16005, -9327, -2379, -1025, -14961, -18111, -9795, -2388, -15231, -20783, -3557, 3311, -9991, -16581, -9347, -6750, 2022, 13577, 933, -3473, 7435, 2266, -12520, -22327, -17352, -8554, 4832, -10036, -22602, -10523, -5653, -21678, -17298, -2730, 12837, 44139, 52820, 26821, 16644, 24545, 13771, 19922, 10496, 11706, 7459, 8762, 7263, -11717, -23901, -38866, -52303, -42753, -57411, -59648, -32457, -8927, -6307, -8205, -6044, -6040, -8029, -325, 2179, 6222, 1989, -8131, -28057, -30841, -24728, 4612, 14684, 17650, 24272, 2925, -12013, -14776, -5277, 1282, -4604]
22726d604j8482j2216J2063K0787J1494k13l821N266j6537p141N386j558k365
22713a1941m679k498J876p461O359j09M653K3o760J608J4779P498J3709j050j3251
22698B756k414J2110j3305J314N737j0422J981J2689J6626j3350k7333L625o289
22685a6275m33J0917O782N052J1715k77r497Q251j1732k2630o617J6710J3224
22672E190j0236j9795J1411K234n610k992k83K0844r704j4637K658Q419J0763
22659a738K179N141L44J352o534q077j4953N050J6986J3r97J5486j0362j6231
22645a2341M583L403k56R294j2268n811M972q515j806O137M756P910o169J0605
22631D494r058N263N011n572k869M308J182k0053L575P306m975J531N236N908
$$ y = [-4604, -23086, -35302, -23239, -2452, 9042, 8829, 5008, 10274, -6263, -13404, -8018, -9576, -11941, -16620, -19118, -17242, -24703, -18344, -18453, -13800, -13777, -20537, -18929, -4150, 3348, 17057, 16007, 2756, 342, 12452, -853, 461, 6198, -4224, -2243, 10446, 27072, 13722, -13611, -9986, -16275, -16708, -5791, 991, 6043, 17758, 17481, 7984, 16235, 4503, -18127, -24744, -8034, 5190, -5046, -24841, -13430, -11196, -16806, -19798, -20081, 763, -8941, -23578, -20920, -12501, -1738, 441, 5582, 5926, 7278, 744, -7333, -22286, -17236, -250, -237, -1234, 14252, 3890, -12341, -7758, -4355, -4611, 4683, -7585, -13396, -8424, -16939, -18745, -12608, -7852, 58, -6111, 4494, -4564, 699, 5710, 138, -2731, 1577, 2759, -17294, -13719, -6413, -11388, -9857, -4621, 1287]
22617A287O114n288j7317j2j3213j45N08j569J771J9445L7255m577j5164K038
22603A1133j2490r060k0914K62O78P317J3048Q847n841M579J6425R764k1305k2434
22589a9991J7690R602j2158m766j2373j6040l648J9651J3524N539J2573Q778r683
22576H698j7656j5715J4399J4587Q70M861J9637O238k4480k7351J849J8070l118
22563H89Q312J188K776Q505J0477j6821j2077N968j5297q050L578r087J2039P380
22549b20O130o903L574j8752L068L591l920m758J5707O363k527l994K897j221
22535i65q616o122m540K512k10l138o65m153k551J0713K0216J6980M011k0818
22521B654m454p184j1082O584L496j2777K940J7935k03L5725j3552j9188k3377
$$ y = [1287, 7401, 2113, -15204, -15216, -28429, -28574, -28066, -29635, -27864, -8419, 28836, 24259, 9095, 11133, -1357, -10417, -31331, -31069, -30391, -23074, -10026, -1179, -7020, -2441, 13984, 23748, 2443, -19991, -2301, 7301, -4857, -9623, -21996, -38036, -41684, -22033, -8509, -2970, 9603, 18381, 8698, -8958, -24673, -10274, 4313, 5183, 10044, 29681, 35919, 11439, -15912, -14063, 4007, 889, 9201, 10389, 13165, 21670, 32147, 15326, 3249, 9217, -6080, -14130, -10552, -19639, -7600, -220, 5910, -993, 2581, -16171, -13103, -9512, -13432, -18190, -2483, 3880, 1353, -2641, 256, -965, -9581, -15703, -20243, -17731, -17941, -21079, -21744, -25897, -28448, -17735, 2481, 19461, 23472, 2654, -1800, -8984, -20066, -13482, -9986, -22763, -19823, -1888, -2091, 33634, 20082, 894, -22483]
22508b2483J8041J0511k50n485O725m17q324j6080k2880J583J2422O104P852n675
22494a8356J199M044O286k139J455K1904q898j9036J980Q871j176R287P863j4270
22480i86L780J1863n003J1912P196o077j2829Q527J1064n346j0347l259n983n474
22466i62j9360j5661K104J0643J5298K218N058R785k0356j8494P06P293j169Q93
22452b2004N390N290K86k516j329J0079J1567L233j4114J817n879q438Q211j774
22438a0181l864J2127J5350J736j0280j2440j6407p482J843p725R425J639M219
22425b2040J4128M545J6931m006k2933M870K1732Q298j9436j0657Q941j4310j1260
22412b5197J126P875L288P79j2651P019Q322R459q573q286O672O969J0917q927
$$ y = [-22483, -4442, 6069, 5819, 334, 7059, 6642, -1682, -17762, -40642, -39059, -26637, -20533, -12681, -18356, -17157, -13113, -6827, -8966, -7511, 14393, 5495, -13541, -11561, -2690, -3866, 5421, 13284, -986, 2794, 14657, 9654, 21566, 28762, 22685, 9856, 18383, 29447, 24101, 13754, 10495, 4512, -962, -20322, -35983, -33879, -23236, -7938, -5720, -662, 9123, -11233, -29727, -29021, -21728, -22897, -22004, -16614, -11324, -11038, -13554, -14883, -4804, 6763, 9996, -4118, -2301, -8180, -16618, -8407, -10181, -14045, -1918, 13432, 15168, 4888, -7552, -23959, -31441, -29598, -37323, -27898, -26259, -22040, -7912, -3367, 13564, 9558, -13375, -8505, 13227, 21525, 2089, -8568, 373, -13937, -25197, -24071, -16196, -12908, -12129, -24780, -17761, -9439, 20, -8553, -16839, -10167, -3198, 7719, -1208]
22398a208Q807P203k380n116j0948q038K724j4324r309J6325K3786O518p823K481
22384H698o005l44N341J8334M433j0803j4919L182q773j1871k687L4185P261j0533
22370A5499N54j788m641M067Q369L608j6318j7261M260J2092l703K770k1204K100
22356a1596R863J5519K548j0600J072p560j5240l133j1697K5806N182j6155J8767
22343B776Q853J0052R537P622n385j0155q03N817o504M148j0167j2096q265N240
22329F70q505n359L160J6537J429j569j608J839o479p036j582j6739J542r812
22315c3512J0829j966q875J1883J4372K3883r686j5592r933q604P566M515O100
22302i020K183p174K145J412j1255r013p256O85J3637K7775K685n809K387j095
$$ y = [-1208, 7599, 14802, 12422, 7306, -3642, -11680, -8956, -23280, -32589, -16264, 7522, 14040, 6217, 8698, 2693, 2349, 7690, 26024, 30457, 19654, 4735, 7917, -856, -12727, -15414, 18771, 26032, 15499, 16053, 14265, 9624, 13691, 22060, 25668, 9350, -7911, -3651, 8441, 4738, 7508, -13696, -11596, -1733, 13786, 16334, 5734, 6806, -754, -15994, -19127, -30824, -5018, 164, -15991, 2776, 11629, 21681, 31218, 38840, 33455, 23300, 22497, 28314, 21810, 25958, 15791, 3695, -4570, 670, -7835, -13194, -10034, 6503, 7932, 6363, 4755, 6594, 115, -6921, -8503, -25242, -23700, -33512, -22683, -24649, -33524, -21641, -7269, 16614, 6928, -8664, -18597, -27201, -19635, -15120, -9020, -6837, -14011, -11866, -10454, -21709, -30722, -37978, -37293, -23656, 4119, 6804, 995, 3382, 2287]
22288B287n375j2754N595K3188N919j3082n196m056P019R277p523j9076K595k0918
22274c2100p035J0976K3709K039k1064j840J6519K151R994L656j3442k5379O204
22261b5612Q435O565L464J0114k2585k4184P69K3541J0728J363j2101Q414Q025
22248c064K3458l027j2996l338k632N247J710o318j853l301L44j7847j5784L779
22234c5622J4181L682m821J3583P965j2694q085l255p693O847J4351J6181R101
22221A3721j763p430l8304r227K647K5788K641k734q377l408J778J7657J1733
22208D722J3068q034k0324o810J829J8607k907p82n514J695J0433J97J2707K40
22194A9127j9116p168q648Q70Q471J9541K834P416N561j7787j4652j4017O751
$$ y = [2287, -3088, -15842, -10247, 12941, 18860, 5778, 582, -3474, 3545, 12822, 5299, -13777, -11182, -32100, -39135, -28159, -4450, -2411, -23475, -25315, -8796, -6645, 3349, 7005, -6437, -31816, -25612, -17177, -10612, -7148, 2966, -19619, -43803, -43034, -19493, -8765, -7402, -19503, -11089, -3064, 20394, 17367, 4371, 1033, -1599, 3648, 5358, -960, -2813, -6114, -5770, -23617, -39401, -35622, -21441, -17759, -22580, -8997, -1032, -13726, -21811, -25066, -32759, -25912, -11561, 4620, 13721, 11958, 4528, -33776, -43003, -40356, -14568, -11927, -14661, -23038, -26446, -24668, -7011, 4722, 17790, 9756, -10568, -17378, -15549, 3058, 151, -631, -6145, -4450, 5983, 6180, 18887, 19127, 11, -7157, -15805, -14935, -6464, 13077, 15911, 23327, 28888, 11101, -3551, -17568, -10817]
22181a0817J1096J0820p941K60N458j299N869o123k2801p313J5181J0024Q903
22168A1317M263l160j5254k878n40J0807j6273q443L074J0472j87J605J5723J320
22154A1846j2206K393O381N79L96j929m007j1387O265R254l2M158j1490j2869
22140a2648L294K818J1342j759J0327J0828M879j3977K276M151j0922j9626J945
22127g072M746K0278O825j1803j2661j1495J032J7701J3537n027l647j2540J0771
22114A0645K25j1390j6667m057J2403L446r158J938N045N667r453N666K325o848
22100a0213N618l987q023J1286J8158j532j4390k2020j3208M204J349J9004J3523
22087b31o403J8178j52j6136j3083k242L528m736M093m400j2601q080J2378J5249
$$ y = [-10817, 279, 11099, 3158, 3418, 8876, 7577, 13446, 7323, -15478, -22791, -7610, 2414, 11317, 15580, 12420, -2834, -5712, -6252, 4555, -11718, -20161, -17087, -6615, -6802, -5197, 10526, 11846, -360, 2033, 8414, 8993, 9389, 7460, 3453, -7934, -1669, 7585, 7553, 11711, 221, -12648, -9354, -6536, 4806, 3047, 13374, 24202, 29081, 15104, 17380, 21531, 10609, -9017, -7072, -2326, 17952, 24777, 12974, 313, -11182, -10150, 7551, 21088, 16061, 12414, -126, 10645, 10870, -520, -17187, -21244, -8841, -5395, -14553, -12615, -7570, -1903, -11356, -5690, -3365, -10213, -4595, -8582, -16605, -5319, 12839, 11307, -3083, -25103, -38311, -34107, -32758, -13754, -231, -6634, 11544, 11392, -4744, -17827, -20069, -16541, -21277, -17184, -21584, -34185, -42265, -29887, -14638]
22073a4638P016Q0P221m864q95M238J2166M93K562j7062j5489P558m403j3464
22059b9481m460J2772k388r108j524K3084K3100O9j4395j013k586o167K572M364
22045e161M997J2077M620k132n10q446j5385j849J9056P745j6309j6199n193N242
22031a7447m397J2554O817r728N48M391L116J4130J1455n785r754j5885p679m423
22017b2087J1350m341k686j9114J363K2774l341l606p4n538R332K790n373J3547
22003e004J0810m753j085J1891n718n348J1707K350N275J1135l060j4638j2018
21990A544m050p46l431O197Q000l614K983J10j2503l652J0322O277l079p298J135
21975a805j274O053K789K981Q329j130k3459k0562J0140K3909J095N121O608j8101
$$ y = [-14638, -7622, -7542, -321, -5185, -6080, -1842, 10324, 10817, 13379, -3683, -19172, -11614, -16017, -29481, -33941, -21169, -23557, -32665, -34189, -11105, 11995, 12064, -2331, -3344, -5930, -12097, -9525, -5161, -164, 11913, 16533, 14401, 13891, 5445, -9940, -11789, 7267, 15012, -1297, -17496, -22689, -17447, -21844, -9290, -2473, -12201, -11653, -7262, -4146, 9984, 21439, 15654, 5900, -9985, -17664, -22087, -10737, -15078, -17764, -36878, -35515, -12741, -16082, -19688, -19762, -25300, -15968, -13178, -18551, -5004, 5806, 1053, -32, 11859, 6141, 793, 12500, 14850, 20125, 31260, 28200, 13562, 1544, -2506, -3252, -6683, -486, 7514, 3900, 6883, 6993, -5510, -9162, 1160, 7437, 4358, -2940, -1805, -3079, 2974, 5763, 8744, 17073, 15943, -7516, -28078, -17938, 5971, 7066, 12187, 18795, 694]
21961F94j922O791N425M503j1455M94k2653o451k0422J3859K1567J6761Q192K919
21947A8302q393q294k881o323q533J1838K0292M929R328q853j2509j5406J0438
21934C935j662J0842Q085k746k449r128r938o252J469j0802q320K451n230O791
21920b2954J4840K857k37O161M95o444m831M735p285k393L917m188L836N034J6438
21905I981K405j4942j136L498P38j5973n499M34N789J3248j7597K531J1548m8
21891e023K1637P831q612O101K035o754k9438P73q004K2074O614j4329K181L250
21877C36n364J1257J6408O201j458j345k8124o870J7191k283J0944P322l421l0827
21863a0033p63N882R665k452J2713l956K247J1359n287j01q086l67Q928J099j7067
$$ y = [694, -1228, 5563, 10988, 15491, 4036, 4530, -18123, -24574, -44996, -31137, -9570, 7191, 15383, 18302, 9909, 1615, -1266, -7589, -16122, -4284, 16008, 20937, 30265, 21412, 8903, -6503, 3935, 2273, 13115, 21200, 18454, 16005, 6877, -3061, -9313, -7844, -18646, -26966, -24515, -29745, -22954, -8114, -5257, -5494, 667, 1162, -5282, -10113, -5378, -12663, -15056, -11139, -15327, -11491, -6457, 9981, 12386, -2556, -3692, -194, 544, -15429, -20928, -20494, -14705, -1457, -19054, -16523, -4975, -5023, 16614, 24445, 15833, 21934, 23969, 17215, -12223, -11450, -19454, 2620, 9234, -5095, -2914, 336, -5028, 6229, 22637, 28838, 27380, 26035, -2089, -8959, 8232, 5949, 16893, 24215, 20794, -10033, -10796, -4914, 4751, 2299, 15012, 11056, 13303, 24662, 19375, 19274, 11188, 10821, 19749, 20848, 3781]
21848C781l098N651L776m334k1236P114J4888Q199o540j4365p40O502O922Q11
21834G331J73J151q32O155J2337K850j4695j8818k344M38K151p828n214Q506K3137
21819A4498o461m296m99P421M328K657j5126o117J9092o57r945r833p902Q117
21805d723J3987N839j3381J0321J9267O977j3033L710j5539p268K9011O237j7051
21792B4354l791j3367j6407k818n405J1324R5Q924J4016k2507j5136L479j3471
21779c0710J557J1794R01L385r709r121j14L0224J3339J5739j5436j9832o997
21766a4980m205j994M430J1641J2514m643l576J773J0972j444j905J8088O175
21753C2846n866j7064j1125j409Q097m197j576j0137p571J6212N962j2081p104
$$ y = [3781, 683, 6334, 10110, 5776, -15460, -8346, 6542, 14741, 8201, -6164, -6904, -402, 6520, 7331, 7504, 8655, 7823, 13978, 26315, 29165, 14470, -4348, -6692, -6254, -4103, -11931, -17145, -8639, 14498, 8037, 3741, 3242, 10663, 14991, 17648, 2522, -3595, 15497, 14840, 4895, -4938, -12840, -4723, 9264, 15103, 1722, 12043, 31310, 38287, 25254, 28964, 13425, 6157, 35168, 41405, 24354, 20563, 7196, -9211, -12029, -17434, -6110, -6015, 2909, 16925, -5582, -20718, -17239, -30710, -29153, -17359, -16458, -13073, -22782, -31903, -32017, -1793, 11546, 27285, 11849, -7983, -14980, -19185, -21179, -16749, -5108, 7406, 2763, -813, 960, 11932, 10488, 8583, 26671, 32846, 26980, 9916, -1209, -2618, 5479, 1282, -294, -10431, -18002, -1790, 4172, -7909, -15013]
21740a5013r95k044J4853J5531J0204k916M380J695J53l703n845M244J5752N626
21726D1922k2719j0628M685q785J1656K0461k832k3479j8255K451k584m284J2318
21713g3R453q19o101J4461n960j4598j071k104j1245r636k517J0712Q133P820
21699c545J2729M296k201r988J410n565J2777J0903R231j6771n395j989l497j936
21685D59p545j3708N993J0083N948M3J0752L523j497j1759o803q341L589Q742
21671e21N400L723p466j5792J648J1514L565j181j3525P267J3096m35l827N112
21657H578L968k876J0869L447l684n241j26J4569J60p022k539q117p738o30r406
21642e788k20K004O98M198M781n977o793k756P42n48P898J128j4742l199J7415
$$ y = [-15013, -16008, -18052, -3199, 12332, 22536, 19620, 24000, 25695, 25848, 22145, 16300, 20544, 36296, 41922, 19203, 8575, 13260, 4475, 16131, 36592, 33760, 10281, -7974, -5523, -8107, -12391, -73, 9380, 8561, 2460, 16921, 10961, -3637, -4708, -6812, -18057, -27693, -30210, -19498, -11365, -3545, 9184, 13480, 11279, 1291, 2701, -2864, 9913, 20816, 30047, 13276, 7881, 5892, 2395, 459, -7086, -20794, -14801, -4718, 1230, 1273, 12025, 15548, 14051, 2292, -4511, -12852, -9263, -521, 4879, 8602, 1136, -14656, -13008, -1494, 2071, 890, -12635, -5368, 7728, 7293, 3466, 8578, 12546, 9670, 20539, 23986, 20302, 15061, 14935, 29504, 29664, 22642, 20103, 11986, 4248, 3618, -5788, -6008, -4004, -3306, 892, 5673, -304, -7097, -9853, -9111, -9659, -1761, -633, -15375, -18574, -1159]
21627a159J4550P976r326j5960n627P335P038o433k188J844K493J023J577K517
21613E660o806p007q736m494n465J1852q017p187J5168q225J20p279L272J7746
21599i398p898J47P133m683n577N406Q683p384j1936J5107K849p427Q439P686
21585A147j963k591o369K288M282J4651M694q443j0449r389K2307L441j1062q692
21571f148K016P14J460J168j2181K536J3193M797j6783j7906J946R704n26j900
21557a7910l654J1976J1542o784p616j2165m302L232N335r607L471J5923j621
21544a2180P744O516r80N584j4051j92M950O342p884m365N964j1646o007n960
21530b6165j5032J2278L0061L702m408J917Q47j1117j0964L023O734J3890R283
$$ y = [-1159, 13391, 21367, 12041, -3919, -9546, -2211, 4827, -1606, -3794, -1950, 543, 1566, 3143, 5660, -1146, -8153, -16889, -21383, -26848, -14996, -23013, -30200, -15032, -23257, -23137, -30416, -27144, -9398, -17296, -17149, -10016, -14699, -20276, -14870, -6187, -13571, -25507, -10400, -7551, -14978, -6539, 1147, -816, -3407, -9776, -7488, -3206, 11445, 16139, 7696, -2753, -12142, 10165, 13606, 2544, -6148, -4132, -3418, -1958, -790, -12971, -10435, 2758, 7555, -9228, -27134, -25188, -15484, -16010, -17910, -21564, -9588, 1954, -4830, -12446, -24611, -28913, -25681, -20346, -29953, -26482, -10559, -12180, -4436, 2080, 1100, 6684, -7367, -7559, -2609, 3733, -4151, -8516, -2552, -14198, -20205, -26165, -41197, -28919, 1142, 4844, 436, 2353, 3200, -7917, -18881, -15858, -9124, 4766, 14049]
21517A4049Q904R04m782j8676n173P865j4955j6741J6793O515J1J244m849p819
21503a6710r53K6228K719r679n630k058j728J2o261R432j979j3147O659N498k473
21488a0070j0205K062M174R843K338L074o527j0352k827m720K299J444P917M044
21474g506P705M573P567m847n289J923p440j0021j2671n87J0595J5270K1957J9128
21460D0357m222j7359j2563M153q968n1J1619n151n264j8049L54R662m222k697
21446a2401n950o480R16K181L699J5380L504m827k828j4938q341K59N324P884
21432a6618J9108M93L640J971n957J962Q71m758k3405N260J2688r541J881J0851
21418a554j0424l356n705q860J092J2783J3398K291j9254j4164R223J4066j049
$$ y = [14049, 22953, 23857, 19075, 399, -4774, 3091, -11864, -28605, -11812, -5297, -5286, -4042, -8891, -16710, -17663, 8565, 11284, 1605, -4025, -6083, -7811, -7799, -14060, -4628, -6607, -19754, -13095, -7597, -10070, -20275, -18213, -14039, -4196, -1858, 1216, -5311, -15663, -18490, -23210, -20911, -19467, -11550, -7506, 199, 4772, 12339, 7492, 2203, 4126, -3314, -13335, -26006, -26593, -15998, -728, 21229, 40357, 36135, 18776, 6213, 10366, 1398, 1347, 12966, 7815, 2551, -15498, -15144, -5482, -9704, -12401, -18351, -24831, -23915, -21734, -18035, -2655, 849, -3978, -6806, -21744, -30085, -29826, -24502, -16618, 2490, 2983, 6623, 8594, 2637, 4599, 5470, 712, -22693, -17433, -4745, -14286, -12405, -1554, -11978, -15334, -21039, -29899, -28807, -16024, -2626, -335, -19589, -33753, -24530, -10464, -11513]
21405a1513m295K033N55r60J393N626M777J9551o679k2782m704M081J3857N736
21391F676l515j1934r435N479K831P905J229j9596m927J2611K3475M463j5989
21378g27m612J1221K534k0585k550R652K968p461j566N503Q989j405r122j7316
21364b4477k279k76J0290j67l663l989J1643J930J074J1989p878r435j0124K452
21350b2910n177K7384J2619L83j4956o643m818K293m662J0344K474j6319m666
21337b4654l957Q524k060L372J6578o150j6461R540J0827k042r167L60J4681l65
21323i74m233O193q379j8786Q780N876N071K289l338j8544P555K510m507K0456
21309c1j63r654P752k005K6826j968j1209j4016r143J6541j2137l072J983j3660
$$ y = [-11513, -15808, -13775, -13220, -14180, -12787, -7161, -2384, 17167, 10488, -12294, -16998, -12917, 940, 6676, 3161, -8773, -18208, -12729, -9898, -1993, -764, -20360, -25287, -12676, 10799, 15262, -727, -5339, 5882, 8416, -12169, -14719, -5067, -2099, -9560, -11126, -5623, 3366, 1961, -7161, -24477, -26756, -27032, -16742, -16909, -20572, -24561, -12918, -10988, -9914, 2075, -5803, -15238, -25362, -22910, -28087, -703, 11916, 12299, -2657, -9300, -14118, -11825, -16487, -6143, -3669, -19988, -24654, -28611, -20087, -22147, -18775, -2197, -8347, -24808, -15268, -4441, -6483, -15650, -15290, -609, -974, -5207, 986, -7393, -26179, -17399, -11523, -6452, -4163, -7501, -26045, -18490, -15980, -20487, -31, -194, -9848, -2096, -4101, 22725, 20757, 9548, -4468, -13611, 2930, -9207, -12279, -10296, -23956]
21295b3956k802J1965K064M793l244Q253N913R362L118N824M384j6368j6602j8659
21281b5955M217J1354P503J2443J4107Q785L184j4028o341p973j3587L580P163
21268D452p572K564O359m372k0901j876J7933L612k552j3623P94L0246J1128J6502
21254D2694L125k1134j6507M273J2563r88j6134O01J273p031M489q760r170Q768
21240a938J5850J6713j4974j3820O668K1989j5874n281r641j5076L022l164J5197
21227c29R462N862n005p053j8711k270J3332j1915L281J230J421k841j3231r682
21213c6449R533J2045n280R280J3772j5352o214J0895O120l112O513J148q348
21200e449j7006Q677Q877J775P665R034j5161K183m905Q920P756J5225K0193j077
$$ y = [-23956, -26758, -14793, -12729, -7936, -11180, -2927, 2986, 12348, 15466, 21290, 25674, 9306, -7296, -25955, -21738, -10384, -2881, 9562, 23669, 32454, 35638, 21610, 15269, 7296, -6291, -2711, 4452, -3120, -556, 5803, 1431, -19470, -21346, -3413, 199, -2353, -15976, -15182, 15064, 26192, 42694, 45819, 24685, 8178, 12451, 25014, 24026, 7892, 8493, 9766, 2735, 7224, -1536, -10706, -1938, 13912, 30625, 15651, 1831, 8499, 30488, 14614, 9333, -308, -15384, -12362, -15526, -329, 9133, 14995, 9990, 2937, -15774, -18044, -4712, -16627, -13346, -12116, -10695, -13536, -26767, -36449, -26916, -14871, -20151, -10871, 2901, -12451, -18665, -7770, -1650, -4762, 1751, 2899, -5449, -22455, -13778, -4901, -3126, 4539, 13573, -1588, 595, -4310, 4610, 12366, 27591, 47784, 46707]
21186D6707j0803j1025J075J3205j3357L38p780r62j3260j2985Q972P527j7002
21173i350r273L515J1698L114p611l040J0764p754p752O432J4235J000O455n444
21159F989o378k082j0336M886r222N958J7548O505k3197q388K0093j1030l826
21146a2480J7103m323N171N505n880k421P926p093k1295o054k013J588Q607k169
21132a7828M736Q409p100j3384M082K0226K2472R759k3080j5501k353k274J4288
21119B452J0896k469j7259r754Q201J427l746m047k661J359k77O018r648R597
21105i911K587m450R765J2264K2077q438l3156n050j2011j0572J4266P515J6519
21092A405L0432o788j0594K064r220N294K534m005K282r561k4245j0105P24n391
$$ y = [46707, 35904, 24879, 25954, 39159, 25802, 26140, 18360, 17398, 4138, -8847, 125, 7652, -9350, -18623, -15108, -3410, -296, -7907, -10947, -183, -7937, -15689, -9257, 4978, 5978, 12433, 6989, 611, -1471, -11807, -6921, -16143, -10185, 7363, 13868, -9329, -17717, 2376, -8654, -12480, 4623, 300, 5471, 10976, 5096, 2675, 10601, 3508, -17787, -23841, -25854, -24266, -15659, -17828, -13092, -4683, -11783, -25167, -21085, -859, 21613, 31372, 8292, -7209, -9562, -11836, 2452, 13348, 10879, -6380, -16134, -7933, -6506, -10252, -14299, -16960, -15601, -15878, -9860, -19508, -9911, -7324, -11774, -2009, 10255, 32332, 23894, -9262, -14312, -26323, -36895, -22629, -15114, 1405, 31837, 25049, 14455, 16519, 7299, 12593, 15127, 11122, 13404, 3843, -20402, -30507, -29783, -35174]
21078c5174R755J2707J4496J203o289j0820r205P584Q546J411k883O657N686J536
21064E210j189j3489k3703N731R559N480l452K286j3549J3076R365j3484j2560
21051c0719j297P684N624n047K482K5198K374j5965j518K1597K1558q062j3398
21038A0511J079o583o745M096M046K664o835J4472J4989N348j5412p668O868K742
21024B3572j5739n368m108j472j0592N875J849M46k491Q370M461j3419j1322j0313
21010c0251J1389J4221J8592L338r694m015K3479M996q675p097q103J6168j5459
20997H889l556Q704l997p752N303q661n484K8483J3714r887K879k009j2266j7936
20983c576l437M656Q020R193Q593j7841O886K141j5384j4943J0543K1842R516
$$ y = [-35174, -25419, -12712, 1784, 2987, -3302, -14122, -23327, -15743, -7197, -5786, -8669, -2012, 3674, 5210, 4021, -9468, -33171, -27440, -17881, -12401, -15853, -13567, -27116, -14040, -4675, -18159, -30719, -32016, -24332, -18708, -23755, -21273, 3925, 6299, -9666, -11184, 10413, 31971, 23909, 10511, 11590, 5007, -1738, 2358, 6404, 9068, 2233, 16705, 31694, 37042, 21630, 13962, 20830, 23572, 7833, 2465, -1643, -3115, -13707, -7832, -5983, -5537, -8028, 342, 4803, -8616, -19938, -30251, -18862, -4641, 13951, 17289, 7595, 3580, 27059, 32055, 23380, 16283, 8180, 24348, 8889, 5333, 14037, 10040, 2288, 7591, -1070, -6554, 21929, 35643, 25756, 28635, 26626, 14360, -3576, -7013, -2357, 5663, 14856, 23449, 5608, 12494, 14635, -749, -15692, -5149, 16693, 26209]
20970B6209j999k4552k2342L14Q375R281J1898k578J3524K672j9M40l809l787
20956A3627M312m462j493P020K063j0382k4538j2690K1691J7944N386j8523j9207
20943a9252l028J7474L583p307l456K323K734R320R49N386m46j8463m406J3718
20929h71O903n404J1624l364j3877J370j134L575p441J2681K612l959Q734j1317
20915A32p721K411J2121N176O956o138q604J402J0995O060J0741k3969j0410K581
20901A733J0882J1909K704l928j3246n978n787k132l801m121O817Q510j7561p703
20887b1702N544L018R274M966j429q062Q24K612K7269j0015k5994R81O563L357
20873b794M389j3085j0012J4714J340k5350m708J3823L3595J3446j2113q635r922
$$ y = [26209, 24210, -342, -22684, -22370, -13995, -4714, 7184, 4606, 18130, 20802, 20783, 21223, 17414, 13627, 17939, 13477, 11984, 19004, 21067, 10685, -13853, -26543, -4852, 13092, 18478, -45, -19252, -22280, -4806, -1223, -8530, -11986, -9663, -6929, 2391, 3340, 8726, 8280, -10183, -14589, -871, 6032, 628, 12252, 8888, -4989, -3619, -4753, -1178, -8619, 4062, 6674, 2715, 11449, 132, -7589, -5178, 6943, 12119, 19075, 12937, 4333, 5735, 16730, 22790, 33531, 9562, -848, 1733, 12615, 24524, 27228, 23300, 10054, 4076, -1711, -3843, -7644, -11765, -4948, 3562, -13999, -21702, -16158, -13140, -3866, 1100, -329, -8391, -7567, -4955, 22314, 12299, -13695, -12714, -6151, -2794, 1595, -11490, -21502, -6788, -5448, -30798, -35506, -21683, 11912, 25358, 13245, 4610, -5312]
20860e312N63q066J069Q802J2615j8144j9587K2908J1775o457j4250j3149J2012
20847a5221P044o738j906M384j1807K3674J6569O328J607K923k968k330Q066J3265
20833D2890j646j3607k2993p577j899r226p316J3788J4423L835j0874J211n889
20820d880J5438R167j2740j7224N170o578m055q843M430Q814j0012m045O54K1230
20806c474J8889L533j8370j6610O022R89p307J5713J1940J1058L4l580p784k1359
20792a0306r708j0668K152P911L257J1397J3668J0936q047k1504p111q140J3587
20779a2576K6226J7913M075j8163j5658j1335N249M169l295l898K969j183K7256
20766B1749J4257k5746m6826q048K18L468J6554R592J201O316J4559J119j4073
$$ y = [-5312, -4749, -12815, -11746, -2944, 9671, -8473, -28060, -5152, 6623, 166, -14084, -27233, -15221, -8177, -14915, -16821, -12437, -24244, -570, 15999, 22327, 23934, 26857, 23889, 21559, 29625, 42890, 41244, 27637, 4644, -2933, -4832, -14058, -21374, -7586, 6837, 10672, -202, 1009, -4880, 10558, 19725, 6985, -10239, -5069, -11647, -15702, -24545, -20115, -11301, -21313, -25358, -24704, -3474, 15415, 18948, 578, -16032, -10010, -9021, -16328, -615, 11325, 22383, 22417, 18837, 11053, -10306, -20014, -30682, -28530, -20619, -17362, -5965, 7703, 18639, 10592, -10912, -18023, -26163, -12576, 13650, 31563, 35638, 17475, 1817, -9518, -4269, -100, -3395, -7293, -4324, -5507, 21749, 36006, 10260, -36566, -44614, -44396, -40928, -24374, -14782, -13581, -7265, 7294, 8413, -5660]
20753e660m271M105k552j0870N477K0462k178q821m483Q502J977q910J178J2486
20739F442N467O842j239r887J730o588m678k054l137j461j1768j8744J2428J1515
20725a5132j0729J2617K7659R671k660j1379l9801j420K1062N850J2723L881j0478
20712A864m732J789R035Q294K465k1868j8192j072K3900J3473r890n614k992q284
20698a1824m830O15O646J2291n388n774m584m392K446N129m21L760m724P395k0549
20683b4204p002J3078K176p563J4806k761p724Q683K0325R871j1177k3874j2406
20670b7772o475j0691p782k61O489K651Q983K186Q984O366R651Q807M327J3797
20656A9260l867l717J22j7049m21j0026j1621k966J1061N813j261R08L732p993
$$ y = [-5660, -9931, -5826, -8378, -19248, -13771, 6691, 4513, -4308, -8791, -289, 1688, -7222, -6044, 6442, 11909, 18751, 17512, 7625, 9355, 2767, -1911, -3965, -7102, -8563, -20331, -39075, -26647, -15132, -25861, -13244, 14415, 24086, 21426, 10047, -29754, -31174, -10112, -4262, 8461, 12342, 1864, -2868, -1079, 7956, 16250, 18715, -3153, -21345, -22417, 1483, 14956, 5066, -548, -3540, -11824, -16654, -16039, -9393, 2898, -2490, -8264, -12848, -17240, -14794, -9665, -10086, -6326, -11050, -3655, -24204, -31206, -18128, -15952, -23515, -8709, -11470, -19194, -10511, 9814, 19685, 8508, -15366, -27772, -34247, -44938, -52720, -52981, -46492, -43841, -34858, -32672, -23688, -17322, -7671, 1136, 5463, 19260, 15393, 11676, 11798, -5251, -5672, -15698, -27319, -30285, -19224, -13411, -14672, -13764, -10032, -18025]
20642a8025o451R775N772O86r631J0838R206l029j4574q010K493p010k332J6978
20628a3314Q351n792P879M712J077j3792l745O763L211l831m651K513K623l008
20614a1004jP262n443j997P245o252L031L616m434r866m371N132J4703J3984j5607
20599d002r225L41O982k0341j9551R760J1385N784P064O336O418r713j3190J880
20585b0072J5976J6061R095K433p961j5746r166K659M699j8677J6896J2802k3189
20572a4190J2399Q73J5065J2821k1082k0253p514j552J6643M512P008q388k2497
20559b6155L681K5546j3577q058J0462J4237J2343R26p222N342j3854r192j0758
20546a6279k687O085K961L314O988j2223j0101q883j608L328J6376M533l768J176
$$ y = [-18025, -24476, -14701, -8929, -8243, -17874, -7036, 2170, -859, -15433, -23443, -20950, -27960, -30292, -13314, -4963, -10755, -2876, 1836, 2913, -10879, -14624, -7861, -4650, -8481, -13132, -10619, -7996, -11004, -11005, -3743, -9186, -11183, -3938, -10190, -7159, -3543, -7977, -17843, -22214, -17082, -2379, 11605, -4002, -13227, -12886, -5904, -26245, -45796, -36036, -24651, -18867, -11803, -5467, 951, -8762, -21952, -20072, -4096, 11965, 21060, 23493, 15532, -214, -9380, -6721, -2022, -20699, -3803, 8999, -14190, -1791, -918, 14147, 26968, 5886, -14367, -21881, -23433, -6790, -2278, 4730, -3658, -26155, -22474, 3072, -10505, -18563, -8101, 6136, 18479, 19405, 12183, 17525, 3671, -5521, -16279, -18966, -12881, -9920, -6606, 382, -11841, -21942, -30825, -32433, -29105, -12729, -8196, -11964, -10788]
20532a0788J2071Q544r696p893J1327R932N313j2218o169k598O614N89k728L04
20518B604J0829J1736J201q411j4681l898j525O829J912O448J645J0560j1j5626
20504I612j532J7057R361l515j2300j3302Q315j3237O463M442M879j3056j4653
20491a1466k4220P159O516J3591J5798j59L881q391r489m828L404J7068N166q327
20477E703p417R661m971j963R602j3964k4276N48J1970J5635o400N979N16j4548
20463a3925r777l794J123J5733J1212N714n963M75l860p48P59j537m958o650K59
20448a5937N435N851PL596m439P990J8348J23m431r998k489r661R59J9836J5865
20433C1055J096j3986j7428j0931j497o477J5178r788M307J3446J1548J6240o878
$$ y = [-10788, 1283, 9827, 131, -7762, 3565, 13497, 18810, 6592, 423, -2175, 4439, 5028, 2300, 2604, 13433, 25169, 26370, 17959, 3278, -620, -2145, 4684, 6596, 13044, 14689, 25249, 25238, 9612, 8080, 25137, 34498, 30983, 18683, 5381, 13696, 459, 6922, 11364, 16243, 3187, -11466, -35686, -28527, -22011, -8420, 7378, 7219, 11100, 2709, -6780, -11608, -8204, 8864, 14030, 5703, -1714, 7947, 2976, 1013, 10615, -3349, -27625, -27077, -15107, 528, -5872, 107, 623, -13925, -23702, -27496, -26373, -10640, 572, 6286, 323, 798, -3062, -3810, -3051, -4588, -9546, -16196, -15937, -10502, -4651, -4644, -1048, -5487, 2503, 20851, 20974, 16543, 6545, 4056, -5605, -4646, 15190, 31055, 32151, 18165, 737, -10194, -11691, -18168, -2990, -12778, -8471, 4975, 16523, 32763, 25885]
20420B5885l254j490k167j1781j7307j1741K148K2800O932r226K757j0306j770
20407h520N379J3824P797o237l126r453K0902P120k1943k0987M98J0257R330J4323
20393A9164k0043j958L401O393p610j9285j0491O766O657L528N8R619O002N263
20379G464k2154M846J9858Q594j6275j316p556J046J631J4504K1n317l362j0611
20365h627p641j9251J1959J8985P882o108K69j4737P724m448j4898R558p093K6060
20351c66K2143j1137L036R906J2617j3468j9620L526J2444k920k513J960K574
20338A8182j6289R495N989m811p528Q750R069j8422k1633n333K3932O045Q100
20325A5546r107j3467j9000j615L968J584J256p93o579J1426J6974J2807j1582
$$ y = [25885, 22631, 21141, 18974, 7193, -10114, -21855, -19707, 3093, 10025, 799, 3556, -6750, -8520, -3141, 10683, 18480, 12243, 9117, -336, 20566, 27686, 5743, -15244, -14746, -4489, 4841, 19164, -879, -2837, 564, 6957, -653, -19938, -30429, -23663, -17006, -13478, -13420, -3801, 2201, 7464, -14690, -9844, 10014, 18608, 2333, 1017, -6539, -5493, -3862, 10642, 10663, 5346, 1984, -8627, -16268, -35519, -23560, -4575, 3307, -2801, -2532, -17269, -9545, -13993, -28891, -19333, -26426, -366, 21777, 10640, 13676, 23582, 36199, 22731, 3111, 6637, 19081, 16161, 13648, 15608, 18182, 1893, 11388, 17377, 12566, 5038, 13788, 22857, 4435, -17198, -22531, 1401, 7446, 15546, 6439, -7028, -26028, -27643, -23675, -22091, -20835, -21628, -28207, -16781, 193, 13000, 1418]
20312A418j2504R42j212J918K4395O09j9513j5994p709k696j487P022J1419J61
20298a3231J339Q092r864O342l127l127k40m581p655K062K1208K0852K058L592
20284B3720j517K262k175o329K315j2599J1780Q045r586k566j2179j0421O834
20271b416M470k4822j2341l95O363m477J7892L351p70N553k239K102j4486j2022
20257c4237K157K9066R948m423l404J5197K396n790j471p01k497K604n632M121
20243G334p095q75R523k8239j204P038O769n595l455J8969J4228K888j4623J181
20229F844N831j0849j4252m580m695o89Q878m009O663L249J858m271k9403J899
20215c7526Q591J1953k216J1716P942j742j7639l729L030M439l387M582P491Q624
$$ y = [1418, -11086, -10144, -11356, -9438, 14957, 15566, -3947, -19941, -27650, -30346, -31833, -24811, -13392, -13231, -11892, -3800, -13664, -7322, -10449, -13576, -13816, -18397, -26052, -23990, -2782, 18070, 20128, 23720, 22203, 24465, 22290, 15961, 18276, 5677, 17457, 25502, 15916, 13350, 1171, -9250, -2416, 2054, -22768, -35109, -35504, -29141, -33618, -15726, -12375, -13145, -7592, -9831, -7729, -22215, -34237, -32080, -3014, 6934, 2511, -893, 14304, 16700, 10910, 9439, 8738, 6241, 8845, 3213, 7334, 239, -636, 8887, -19352, -20556, -13518, -6749, -12344, -15799, 3170, 17398, 20286, 5663, 6844, 12675, 1826, -12426, -17006, -21701, -22390, -13512, -17521, -10858, -7609, -5751, -10022, -39425, -37526, -28935, -16982, -19198, -7482, 460, -1282, -18921, -22650, -19620, -15181, -18568, -13986, -6495, 2129]
20201B129p805K635J3446k597j0457J4239r65l957J1575o573r197j1031k233j0918
20187b1709L437K7040o253j8708O045K2227K252J0303p527l1116q919K2604J2823
20174A2499J488P230q909m007n103j4736k355O533j1889p298M842j5167J285K4411
20160a1176P399k506Q986L594j676m025l846M017J319J4155J721j0604J5311L850
20146B6519q037n485j1400j1241J2454M996j2667j5097o602J0612J1978M762J4579
20133A5371J0138k3411r639P210N597j0171q698L671J0460R043q845p677q839
20120a5790o081N113J2321J4831N524j6774n274J6419k908j4235J361J726l914
20107g681O310l41R333L513J0849j561j0004P289O095m782M546o884j2128k383
$$ y = [2129, -5676, -3041, 10405, 7808, -2649, 11590, 10625, 6668, 18243, 11670, 2473, -8558, -10791, -21709, -18272, 8768, 2515, -16193, -10148, 12079, 14331, 24634, 17107, -14009, -22928, -324, 12499, 13987, 21217, 12308, 8301, 3198, -11538, -13893, -7360, -19249, -26547, -21705, -36872, -35587, -11176, -3777, -6283, 2703, 6297, 4621, 596, -3250, 767, 2086, 16241, 17962, 7358, 22669, 26519, 18482, 12997, 1597, -9644, 2810, 7806, -4861, -19958, -26560, -15948, -3970, 792, 15371, 25509, 2098, -7541, -331, 5266, -4905, -13603, -9932, 528, 9571, 726, -6951, -15790, -21871, -16758, -4437, 10394, 15918, -856, -6130, 10289, 7381, -6854, -5493, -3767, -7681, -1371, -1712, 7621, 11134, 21983, 20422, 10418, 17707, 23802, 19020, 23566, 16682, 4554, 2171]
20093B171Q341j4737q541J7276J8771k577j3193j5381L559Q496m636L783N159
20080H491l291L511J6235J95k2809j6974J5322P685j9208j1663K1223P097k630
20067C184k738J448O024p825r324R647l546m805m718m905J0564K0491J9244j0161
20053B2580J4031J3145j4781k2206q930N412j129j2649j519j0622l777O802O090
20040g553N027N862j6755o032K807J8744L63k7870K686J3997j3883Q124K2066
20027G583j0831p821p604n391O757M979o056N984J0789P612l19J2350K418j1089
20013I361o876k0074m200J3167N837j1236J6306J8308k116j1571j1043m013J291
20000f859J771k3736n792J1557L940J4057J9086P82j2056N45j698k486M793M782
$$ y = [2171, 10512, -4225, -12766, 4510, 23281, 20704, 7511, -7870, -4311, 4185, -451, 3332, 8491, 5200, 8711, 24946, 25141, 2332, -14642, 680, 8365, -10843, -22506, -1283, 5814, 3184, 446, 1894, 7918, 93, -9231, 416, -3130, -7935, -12653, -17558, -6994, 13497, 32741, 22580, 36611, 49756, 34975, 12769, 3839, 9251, 8122, -4527, -6046, -16668, -20445, -13643, -7553, -2526, 3336, -13419, -19451, -16644, 2100, 2463, -25407, -22721, -8724, -22607, -14483, 7583, -3248, -11069, -18673, -24064, -17307, -12328, -18384, -12400, -1611, 6001, 5682, 18032, 20450, 9361, 2485, -17589, -21789, -8622, -2785, -14021, 2285, 20593, 18477, 6906, -4137, -8150, -6859, -5088, -28824, -34616, -23059, -19119, -5062, 14024, 14806, 2750, 3295, 1597, -889, 3904, 8686]
19986H686r931n550J5878j833l158J5556M989j0029l73O987O477j6314k0669j3070
19972b2354K002J1688J749P277Q037K02r961p957J815j0685L839K1544m222r748
19958f774q568k225J1704L399R666J7448J530M919R05j3768K027l42k1201j6170
19944a7450o821J4071N017o292j082P754J1629J0263n986Q581l134j052j5352
19931A46l622O731J6418P321j0648k4066m134O916j1659j7163j237q297J4796
19918b8498J9647j064j680R036J6589J577j9016j432j0509J1789k494P940l925
19905b040k949K999K0950j0236n416Q886R427q612p219r522Q384q43n379l477
19891e047M808J2244N829N735p199L741N023R823k814o929j9547k2610P992J7687
$$ y = [8686, -1245, -6795, 9083, 7250, 4092, 19648, 24637, 14608, 14235, 21222, 27699, 11385, -9284, -22354, -20352, -8664, -6915, 362, 8399, 8601, -1360, -9317, -7502, -18187, -14348, 7196, 2974, -6774, -15342, -17567, -5863, -2464, 7202, 24650, 26180, 31099, 32004, 18236, 20263, 19921, -1280, -17450, -24271, -10200, -5183, -11475, -12557, -4803, 6826, 17089, 11103, 19684, 16550, 15498, 146, -3476, 3255, 19673, 26994, 16346, -7720, -11854, -4938, -16597, -33760, -34997, -43294, -28498, -8851, -9915, -11595, -2559, 14030, 15607, -3409, -4841, -15350, -3561, -6055, 1885, -2040, -4989, -1990, 18960, 8724, 3308, 12194, 21621, 13009, 5790, -3732, 4652, 3809, -1570, -5047, -239, 12005, 17834, 23569, 16370, 20111, 25134, 34957, 32143, 25214, 5667, -16943, -8951, 8736]
19877H736J0203J0054o398n7j3846j4720j2388j2383J1245J8001j380j3549L841
19864a2641J7248k550l540J4719L732j3829N229P744J8995K784j1169m370j1848
19851A0504r244J342k489r732n061P130N524L033l298J376J1846J3582J240j1203
19837A4550k4712l484R794J3756J2315m243q493k984j8032j1953O858J1582J943
19824c103Q799J3172k489j0384j3311k629K886Q500o987K182O211k8322N156K1440
19810A121N765n418P103L928j53Q357N117j538n06J243k441j8457r67n111J04
19795a853N508j506Q087J2599l625l294j680j1686o28J3828j6790J8892P743P582
19781C3177M842j8502j2067j0342J6451L426k408k854k0494N734K443j0461N310
$$ y = [8736, 18939, 28993, 22595, 22538, 8692, -6028, -18416, -30799, -19554, -1553, -2933, -16482, -12641, 4607, 2057, -1483, 13236, 16968, 3139, 8368, 16112, 35107, 37891, 26722, 22352, 10504, 1260, 2602, 113, -9619, -14680, -7550, -2026, 1007, -2291, -915, 10931, 24513, 25753, 14550, -10162, -13646, -3852, 9904, 22219, 17976, 9483, 6499, -11533, -23486, -16628, -5046, -3103, 5696, 18868, 16379, 5995, -7316, -9945, -7059, 1441, -5546, -3364, 2847, -25475, -20319, 1121, 6886, 1468, 8571, 12499, 12346, 20703, 25820, 24282, 23776, 25019, 22578, 4121, 3154, -1957, -1853, 3655, 2149, 10236, 22835, 19210, 15916, 14236, 2550, 1922, 15750, -1040, 17852, 25595, 33177, 38019, 19517, 7450, -2892, 13559, 16985, 14577, 11723, -8771, -3037, -594, -11055, -5745]
19768e745J5515j7937k2435Q351J1371N266N42K962R266J0579N264m184j5254
19755C561p559N540J150Q416J1211k519p080j3651N792m26J612K3040J0877L135
19741D3099q010j8169o095m388J2660J6141P493J981j6463n387k421L050K95n637
19727A8149r258O384O185j0458k2289N411j187o279j925J1651n09L652M109K820
19713F456L904o75J9611j0104j4508J3170J826p088j8460N440J5658J511o167
19700A0574r429Q27J4660q802m535n345N279J2781O935M667K413j6702k5699R937
19686b439P710P9J637Q597K040l247m337O215K8401N00k2646r22m109j1382j1820
19671e723k106N766j3397K587K1381k563K0J6867l943j3322J273M307n192m568
$$ y = [-5745, 9770, -8167, -30602, -22251, -10880, -5614, -5072, -2110, 7156, 17735, 22999, 18815, 3561, -3998, 1542, 2692, 11108, 22319, 19800, 12720, -931, 4861, 4435, 6047, 29087, 39964, 43099, 35089, 16920, 10825, 6437, 19097, 35238, 42731, 44712, 28249, 22862, 20441, 23491, 23786, 18149, 8891, 15275, 21460, 11002, -11287, -5876, -7063, -13342, -15267, -3616, -4125, -473, 3636, 6456, 10360, 9685, 29296, 19192, 4684, 17854, 19680, 12592, -5868, -428, 15230, 16741, 10574, 1145, 1972, 16632, 7830, 3295, -2050, 3229, 16010, 22945, 27612, 30025, 13323, -12376, -2439, 5271, 5350, 6987, 15584, 17624, 14377, 10040, 16255, 44656, 45156, 22510, 21588, 17479, 6097, -5723, -7829, -2063, -15460, -12873, 8508, 5945, 5965, 22832, 18889, 5567, 6840, 11147, 5955, 1387]
19657A387q859j1537l795p139J2142R768o100j737J0879J2388k634p87K960P128
19643A4064q07n995j7417r103K440N918J8644R266M892J0818j0877J8495M318
19630D4656l0423K011O557n373k4820j6878R95J7042J1799m260k010R464J274
19617A0034M548P193j236L903k5182j6308J5431J3679N765k363n518J924r288
19604B582P768J1672R595m193j3351j3238m838J5925N938r943p672m222k591J829
19590d739P800M98J4016Q461l605j9116q577N720N685K991K668k571j0028l713
19576d510M226J3185p4j5921j4635j3922Q212J5889Q54O94N559J0437Q581j4258
19562D317m353J3274P249J0575J033k158j0050q460l263k125O199J4776j3465
$$ y = [1387, -7472, -19009, -22804, -29943, -17801, -8033, -14133, -15870, -4991, 7397, 4763, 3976, 6936, 14064, 13257, 7262, -10155, -19258, -16818, -10900, 7744, 17010, 21902, 32720, 21843, 40338, 44656, 14233, 16244, 22801, 17428, -7392, -24270, -23275, -6233, 5566, 1306, -704, 8760, 10034, 14582, 21775, 20539, 24442, -740, -17048, -1617, 12062, 17827, 15464, 9946, 11870, 2582, 10350, 22022, 31617, 27424, 14073, 835, -4003, 11922, 17860, 7917, 245, -3977, -6568, -4739, 3061, 3559, 17575, 26036, 22431, 3315, -5262, 458, 6143, 9134, 11802, 9231, -797, -4510, -284, 12901, 12827, -3094, -17729, -31651, -23439, -7550, -6696, -6002, -443, 9994, 18575, 4317, -36, 13238, 20487, 31062, 32095, 29937, 19887, 11427, 8164, 6039, 12238, 27014, 13549]
19549A3549n902m367q305J1526J1065j814P203J2412j3713k2064n444j409m177
19536a1440J1676P344J0030k744n977p032j1609r06J2883Q011L568k3240p438
19523a6874M88N758J1018m614j2689j7803J2336J1337Q381k269Q54M304k194o887
19509h854R219J64j0609K798K20O914J1821N233j0161r750j898l532k811o856
19495a8102j6078j8935J7446K0651M307j3801N79K0604l578R544Q031m823j350
19482D495K271J796k066J5314N416p238l623J452J3951j1306k6732J055j008N032
19468a191O303r16O159k639O334N510l738j0007K172O390l291N6p768m33k089
19453H52O836J8341n510p698J6860k393j6053P560P155r617P045j1620P88n242
$$ y = [13549, 7647, 3280, -5025, 6501, 17566, 15752, 22955, 35367, 21654, -410, -5854, -7263, -11440, 236, 7580, 17610, 14866, 8889, 1857, -9752, -10658, 2225, 10236, 13804, -9436, -16874, -16386, -10628, 390, -4224, -16913, -34716, -22380, -11043, -2662, -4931, -4077, 227, -1967, -8854, 365, 529, -10080, -7282, -7062, -148, 11673, 16906, 6745, -3005, -4903, -8435, -11246, -18102, -34180, -53115, -35669, -15018, -10711, -24512, -23933, -3329, -6907, 2637, 10668, 5845, 4495, 6766, 8562, 6496, 21810, 27226, 19988, 16365, 17817, 31768, 20462, -6270, -5215, -6223, -1191, 5112, 4196, 10355, 7716, 14050, 19560, 15822, 5815, 7987, 14377, 11086, 11142, 3374, 2941, 852, 7688, 26029, 20519, 12821, 29681, 27288, 11235, 18795, 25950, 16333, 23378, 11758, 12546, 7304]
19439G304J0367J7392O61j2295j3129J4547K539k4112j3869o076j1805o334O647
19426b8163K4579J5370l140M460O328j7900j7941m819K1067K0485p251k719j438
19413H918j157j42K8625P746k4067l3289o109J989K507J4206j086J0993q161m8
19399I25J2860m824j3871M369Q309m390l878k836p83M993O835l656Q403J7721
19385C0177M353j2218j6936K760K879r772K2675o851q063j733j940K0375M672
19372C0378l827M532m927N556l595q996j3789k6272j464J9297N28o266q508j703
19358a9056r983P357K8417P645r116M784N849j1856q127n266o170N450J9735K59
19344I922m224L647J2498n151J185J1779o3j6949j1817n158J3205j146p146l961
$$ y = [7304, 17671, 35063, 35724, 23429, 10300, 24847, 27386, 3274, -10595, -16671, -28476, -34810, -28163, -3584, 11786, 8646, 13106, 19434, 1534, -16407, -21226, -159, 20326, 13075, 10356, 8918, 7761, 7619, 36244, 43990, 19923, -13366, -19475, -17486, -14979, -773, -1859, 9134, 973, 925, 13785, 8961, -4910, -541, 7768, 3378, -500, -3336, -4119, 874, 7709, 4053, 12456, 30177, 34530, 22312, 5376, 8136, 11015, 1243, 23918, 17067, 9004, 7271, 5331, 25706, 30378, 26551, 31083, 26156, 31712, 28117, 19121, 5332, -20940, -22404, -3107, -2579, -8845, -17353, -19056, -29039, -21682, 6735, 14380, 5264, 10048, 15897, 4041, -4086, -9352, -15522, -10072, 9663, 9922, 5698, 9345, 21843, 16692, 17877, 29656, 29593, 12644, 827, -4331, 8874, 7728, 582, -3379]
19330c379J6035m603j8727m617K6196k596Q319K0456o422k3157n860j0059P325
19317a089M377o211j7116J0068K3119J2416L280Q837k3531k4596l867J589P761
19304d963J6857m323j0055j886J1333J0098j5040o097L556K580J2600L697M600
19291B2957m55j469j6545j1880J63l720r5L36J1024K4811j010j2100Q940K2998
19277D3955M012j8878q084m336j920l586J3375J4152j8946n348Q694p934o102
19264I054r970K505M618J3007q35k403j1274j1948r796P873Q468J9369K1934q675
19250C1927j3143r059j2839r253N90O419P241J5277K227j2873l375L939j2156
19237e078R16J6735J0913R864Q049J4889J910r510j5971j3410P237j021j3544
$$ y = [-3379, 12656, 8053, -10674, -15291, 10905, 8309, 16628, 37084, 30662, 7505, 1645, -8414, -1089, 3288, -2923, -20039, -9971, 13148, 25564, 28844, 37681, 14150, -10446, -14313, -12724, -4963, 11894, 7571, -2484, -4370, 6963, 17061, 2021, -4076, -520, 2060, 14660, 18357, 22957, 22502, 21033, 4488, -7392, -7229, -10949, -11044, -10708, 316, 25127, 24117, 12017, 20957, 43955, 47967, 29089, 21005, 16669, 14749, 11163, 24538, 38690, 19744, 14396, 23090, 15156, 9054, -916, 1589, 6207, 19214, 18379, 15976, 4702, -7246, -17042, -9169, -701, 18668, 40602, 31927, 18784, 9725, -3114, -12367, -11777, -5358, 1883, 17160, 19387, 6514, 3139, 7078, -5078, -4162, 12573, 23486, 33350, 41399, 56288, 58198, 48688, 32717, 19307, 26544, 25523, 11979]
19224A1979N083r67K057J417N747j120l2131k2462p521K5431M6281J3699j2492
19211C5001r554j343k231j0150k0121j005k851O975N540R57N419J2750r110k792
19197G485L42j9901J4733J4964l799q291J388M609J4758q856q0L783R235Q208
19183C8578l779j4721p84j3840r321O645J0630m442j2943K682n918J410L988M072
19169B257q046k156K0415P247k714K735n10k1695p656j478J2502K0510N777j0492
19155A6696p125P975k739p222K101O322Q213l617L131j4865j5509N425J3089p042
19141D833K350Q695J0066P955l226O64j5168j9814L945m434q249J4579J3060k859
19127A2397J4489M183o909j3445k753J045m049Q210j35m446K250O146m4j7614
$$ y = [11979, 17062, 16095, 18152, 19569, 25316, 24196, -7935, -30397, -37918, -12487, 33794, 47493, 35001, 25447, 24104, 21873, 11723, -8398, -9403, -12254, -5279, 261, 1218, 6637, 19387, 10277, 7485, 7827, -12074, 2659, 17623, 13824, 5533, 6921, 11530, 26288, 17432, 17352, 21135, 30370, 38578, 34799, 20078, 19294, 5454, -3867, 2778, 13408, 8966, -3977, -1295, -7213, -5803, -1815, 2257, -5789, -7945, 12470, 19717, 17003, 19738, 19228, -2467, -10123, -11601, 901, 21411, 27188, 16696, 9571, 17546, 14807, 7585, 9686, 16008, 24221, 20604, 23735, 8870, -6639, -1214, 11875, 4833, 7183, 15878, 25944, 33899, 30673, 31337, 16169, -3645, 300, -4134, -12383, 2196, 15256, 12397, 26886, 31069, 24160, 10715, 7962, 9007, 4958, 13168, 13033, 8587, 10837, 16983, 16939, -675]
19113f75o396p841j0555M442J6259J9758J1420k070p437n535Q169L883j5602j6590
19099h770N280N483J2981J1113K895p391k9259J278J6703J0978J4564n859K202
19086C2198P04j8709k0528l623K9342J3806j444j8718j521j2061k5098k719K8974
19073F03K1965O149M875k074j0128R419O113j4585r022k579N601l298j092K6778
19059C8725O280j2898o330j508k3M708j1000j1837k092J078K0262k0684q249l91
19045c959K1618Q938L834J696M029r079j0141j2992j0736Q180Q124j3991o965
19032a1444R653Q511N931n830j466j609K144o116o0O404R31J540j5225n894K347
19017a0183J590j5293N41R168L1565J6381p212j0720L99j1863l507J2601L805
$$ y = [-675, -7071, -14912, -25467, -21025, -4766, 14992, 26412, 24342, 16905, 11370, 19539, 23422, 7820, -8770, -3490, 1993, 14974, 26087, 28982, 21591, -7668, -6390, 10313, 21291, 35855, 29996, 32198, 32902, 14193, -6335, -9958, 19384, 33190, 31746, 13028, 11507, -554, -25652, -28371, 603, 22568, 28717, 33592, 31518, 21390, 30809, 36922, 22337, 13315, 10736, 16337, 13039, 11947, 38725, 45005, 32107, 25777, 24269, 24246, 28954, 17954, 6117, 4025, 5103, 25365, 4681, -3568, -3959, 17659, 26597, 30431, 32127, 36156, 27077, 16936, 3944, -6792, 1388, 9512, -4479, -11444, -1791, 6720, 12651, 6821, 5355, 3746, 5890, -226, -286, 6118, 7049, 8589, -6636, -12530, -10183, -8593, -23886, -23345, -14177, 17388, 33769, 26557, 15837, 16236, 4373, 866, 13467, 17272]
19004A7272J0485K217J969K951j912j8345L299J8472K449o08M587q43m947k596
18990C4450j1472r657K186J5636Q43J113J7876L930J994j2780j0400k973K954
18977C3700j911L557q208m087m838q795M851P994J7807j061r263p285M673O090
18963C3224M52J69r64J076o692M41J9789L401j0169k5932j0974l614p722p592
18949a5107R155J1005R502M266k894n217J175P336n795K532Q886q321Q08Q40l146
18934A5025O414j7053K619J8435J101m824K502O087l529N72O759n603J4903m204
18920C9204k2042p744N003j136k232m517M966J5208k595M468r701m148J6750J8347
18906D9831J239j3839J43k1560L650J7153n575n958n507N513J311P440J3371o432
$$ y = [17272, 27757, 29974, 31943, 34894, 32982, 14637, 17936, 36408, 38857, 38249, 42836, 41993, 37046, 34450, 22978, 13321, 15507, 31143, 31986, 33099, 50975, 54905, 56899, 44119, 33719, 30746, 33700, 31789, 35346, 27138, 23051, 18213, 9418, 14269, 22263, 40070, 39009, 29746, 22461, 27134, 33224, 33676, 33845, 32881, 33957, 27265, 27706, 47495, 50896, 40727, 14795, 3821, 207, -7515, -15107, -5952, 5053, 14555, 18821, 15927, 10710, 11885, 19221, 13426, 15958, 24844, 16523, 17331, 18171, 15025, 21439, 4386, 7005, 25440, 26541, 21717, 24219, 30306, 26777, 27349, 34108, 28505, 43408, 39204, 17162, 9418, 14421, 13285, 11053, 6536, 11502, 26710, 24115, 28583, 18882, 14734, 31484, 49831, 51070, 37231, 37374, 15814, 19464, 36617, 31042, 25084, 19577, 25090, 26401, 33841, 47212, 40780]
18892D0780k1269q791J431l60L380K2563n739p750K0544Q928j1898j4982m541
18879B2296o52Q803L085j452j1962j902Q018p87l177J0619k579r287k775l012
18865A5236J3765N626j285J8432m827j0741l249k940J832J3205K283L602O478
18852E7417j6019p609J0866j0782j3378J1522R735j9628J504k1934k842J3056
18840A1908J5468N604k152K487p340j2739N899m570O281J1845N524p23j3156j1007
18826A3329j385N00Q369J3548K271j1200J491k76q98j4880J377J588o916J3701
18812B0619j2060J0386J1879J570o825N554J3801J942r769k4077r206k937J754
18799B631J2551J7252N090j2428J859N063j1550j6720J1163l228l677k908Q403
$$ y = [40780, 19511, 10720, 12151, 11791, 15171, 37734, 31995, 24245, 44789, 53717, 41819, 26837, 22296, 21644, 30447, 33532, 32080, 20118, 18216, 26234, 25447, 22270, 32889, 30310, 21023, 18248, 15236, 29001, 34627, 33342, 51774, 46947, 36206, 32957, 30017, 31849, 45054, 47337, 50939, 57417, 41398, 33789, 44655, 33873, 20495, 32017, 41752, 22124, 23628, 1694, -1148, 11908, 27376, 32980, 30828, 33315, 25975, 13236, 19135, 14565, 20846, 32691, 38215, 37492, 24336, 13329, 11944, 12444, 20813, 34361, 36632, 25432, 26923, 26647, 25749, 10869, 12246, 13834, 6918, 20619, 8559, 18945, 30824, 32394, 25569, 31123, 44924, 46866, 37097, 13020, 3814, 877, 2631, 15182, 32434, 37524, 25096, 26955, 32018, 20468, 3748, 14911, 11683, 8006, 5098, 13501]
18786A3501K883K410j33q136j7231J0570K0893J644j5392M011K0131O785J0025
18773E1961R406J5991L473j0376Q302K5248M1249Q1680K6812n8765p1691k1078
18761A02212o377q797k3440j2687k4846q765q268O152P913J3906J6756p198M861
18748E1422j274q558p174n301M510n232N3N348J319N759P574N822J0341J6144
18734H0753L0984K8537K5397M1458N6775P9576J77480L59324M67505J47274l34359
18723A160704m32064k70032j59159q5626m4047l2610K445k5567l4555j3079j1359
18712E5051k080M343m908l919O637n991k204L028r181M825J5725K4374J0750p094
18698H9356K5418K1536J3609L4040M7251R3817J59674K87493M44831L86902j26896
$$ y = [13501, 16384, 18794, 18661, 10525, -6706, 3864, 24757, 26401, 11009, 15020, 35151, 41936, 51961, 61367, 77358, 80831, 70455, 78757, 104005, 145254, 226934, 253746, 194981, 123290, 102212, 95835, 87038, 63598, 50911, 26065, 17300, 9032, 15184, 23097, 37003, 53759, 46561, 51422, 50148, 41590, 34416, 29115, 33625, 28393, 28446, 33794, 35113, 40872, 48446, 54268, 64609, 80753, 111737, 140274, 165671, 207129, 263904, 343480, 520960, 880284, 1347789, 1495063, 1160704, 728640, 458608, 299449, 213823, 169776, 137166, 139611, 114044, 79489, 66410, 55051, 52971, 57314, 52406, 48487, 55124, 49133, 46929, 49957, 40776, 45601, 61326, 85700, 96450, 89356, 114774, 136310, 149919, 183959, 231210, 325027, 484701, 772194, 1217025, 1603927, 1477031]
18687A477031m77778l83994k32648j05220p4974n4776k8261k0072j0737l7297
18677E1274j9370L757P252l800Q184L7189K301l0296l5864J1469J4167l677j980
18664D0606j5766k959Q821J5425R206j620J4679j0347k0219K596J5600J9656L008
18651G8686k0228k0062l378r492m101L385J0007n087k1563M644J2545K385k645
18638B5096l239n014K9944M4150p391m1274k0260q860J2901J9067n04K729n236
18625D2109L300J4946L753q232L63J0265K71p537j1528l011P365J3394j2502l0563
18611B2393o162n263k639m295P739M275O796K622p119k0151J816L456K7521K8405
18597E9394J3529j3356j0336r644r433k0554k040J1367N686K1611m577M984j3590
$$ y = [1477031, 999253, 615259, 382611, 277391, 202417, 147641, 119380, 99308, 88571, 51274, 31904, 35661, 42913, 39113, 47297, 84486, 86787, 56491, 20627, 32096, 46263, 42586, 40606, 24840, 21881, 30702, 46127, 55333, 53713, 68392, 58045, 37826, 40422, 56022, 75678, 78686, 58458, 38396, 35018, 25526, 21425, 24810, 34817, 29730, 8167, 12811, 25356, 27741, 25096, 21857, 16843, 46787, 90937, 83546, 42272, 22012, 13152, 26053, 45120, 44616, 47345, 42109, 45409, 60355, 64108, 55876, 56239, 66504, 66775, 59238, 47710, 44699, 52064, 65458, 52956, 22393, 16231, 10968, 8329, 4034, 11773, 16048, 22844, 25466, 18347, -1804, 12, 3468, 30989, 59394, 72923, 59567, 49231, 39587, 30154, 9600, 7560, 18927, 24613, 46224, 41647, 46631, 33041]
18584C3041K470K1141Q789o665N839K030j232j5079j0290N280l948k9077p227
18571E072R835J4329M156l606K162j0956n641J960q564R556J1705j4252j1479
18558D277M020r883J6494J6420l451m697R934J2685J3237k1997j2702m584j8230
18545A523N537q856k484K5909L618j145N184L803n244q619q602m082L247J1132
18531B0921M773k1898m335L42J5502J4636n712n286N083o779k4955P112J4619
18518A4023o775K505J8578K0472l412M544M592m724J5135R846o931j5303o356
18505D6194j5253N83J7885J9257K7682n859k8844o988K3662j4441l0514j896p318
18492B4150J1089n562j2170J9519J9116k1778p257j1219J3800K5404Q266l768
$$ y = [33041, 35511, 56652, 65441, 58776, 64615, 66645, 65413, 50334, 40044, 45324, 41376, 12299, 5072, 14907, 29236, 33392, 29786, 31948, 20992, 15351, 17311, 8747, 18303, 30008, 15756, 4277, 8297, -1586, 14908, 31328, 27877, 23180, 33114, 45799, 59036, 37039, 24337, 19753, 1523, 7060, -1796, -4280, 21629, 25247, 24102, 29286, 33089, 27845, 19226, 10624, 6542, 9789, 20921, 25694, 3796, -539, -197, 15305, 29941, 24229, 18943, 24026, 17247, -7708, -596, 14023, 7248, 9753, 28331, 48803, 45391, 49935, 54527, 49803, 64938, 74784, 67853, 52550, 46194, 30941, 31524, 49409, 68666, 96348, 90489, 61645, 54657, 78319, 63878, 33364, 31468, 24150, 35239, 29677, 17507, 37026, 56142, 34364, 27107, 15888, 29688, 55092, 63358, 59590]
18480E9590k4697k0838J1940Q587j4381L483P881J3060Q333l579O98O685K4859
18467H1621m568j0352J0057j0374k0488o724J4475j108k725K777R809Q52K6947
18454I0199l120J173K3126J5138p020j9095l2161j0850Q456j1906q515k135L903
18441D7193j944N724K3141R581m18J806k4106j4677O36K0187J4749J5975K578
18428A00425j0936n276r29j3621r066P67j6458K739m830j2882M2J2072K411L1139
18414G5597L0538p194j6773j2169p478j4741K693Q623j84Q087J4344J7025J0740
18401A09108J3956q068j2019j9112k0846k116L981n703P463r99j980P869M158
18388G5692P577K970J4070o396K675K7200M6016L7417L9369K585o059m2970l8695
$$ y = [59590, 34893, 14055, 25995, 34582, 20201, 23684, 31565, 44625, 52958, 49379, 50077, 56762, 81621, 77053, 66701, 76758, 66384, 45896, 39172, 53647, 52539, 49814, 52591, 62400, 63252, 90199, 87079, 88252, 111378, 126516, 119496, 100401, 68240, 57390, 65846, 53940, 45425, 43290, 47193, 45249, 50973, 74114, 83695, 83277, 85083, 60977, 46300, 46936, 67123, 81872, 97847, 100425, 89489, 84213, 83284, 69663, 60597, 61364, 44906, 47645, 42815, 29933, 29975, 42047, 44458, 75597, 106135, 98941, 82168, 69999, 62521, 47780, 50473, 59096, 58912, 66999, 81343, 98368, 109108, 123064, 114996, 102977, 83865, 63019, 60903, 64884, 59181, 66644, 65645, 63665, 71534, 75692, 83269, 86239, 100309, 93913, 96588, 123788, 169804, 207221, 246590, 249175, 243116, 200146, 161451]
18375A61451l2285m2296k940L912l325j4218J5584Q160K1662M571k807J0923J4743
18362A43135L52j5681j0097J3817J6982j0993j2778j2965o288j397j0932j250
18350I1905R003K288J9554K0642L3175J0978J1933L8618Q683k2185l3747k1660
18338A69187k9118k1287M834J1476q115o414K654n580O70R838p96k9377j1971
18325H6001K0022J520j4661l688J6373R830J5283o861o381k3865k8117K56L616
18312F9328L947J2180J5368m662K141k2623j2256K0766L0431J1452K057j1177
18300A16952R891j316l151J0424J3518m659L044L192j4087j6067J1662J4795N687
18287A49885J9760j3592j8893N577J7506K08k740o037l0232m0382j1604J0333
$$ y = [161451, 129166, 86870, 83930, 87842, 84517, 70299, 85883, 94043, 115705, 120276, 117469, 128392, 143135, 143487, 127806, 117709, 131526, 148508, 137515, 124737, 111772, 105484, 104087, 93155, 91905, 100908, 103196, 122750, 143392, 176567, 187545, 199478, 238096, 246779, 224594, 190847, 169187, 140069, 118782, 123616, 135092, 126977, 120563, 123217, 117637, 118307, 128145, 127349, 97972, 86001, 106023, 107543, 92882, 89194, 105567, 115397, 130680, 123819, 117438, 93573, 65456, 65712, 69328, 73275, 85455, 100823, 96161, 98302, 75679, 63423, 84189, 114620, 126072, 128129, 116952, 126843, 125527, 122376, 132800, 146318, 141659, 144703, 147895, 133808, 117741, 129403, 144198, 149885, 169645, 156053, 137160, 142737, 160243, 160451, 157711, 151674, 121442, 81060, 69456, 79789]
18275G9789J3297K0619K0648K1822M785n218r730j230m03Q154L402q833J0263
18262A57365L3984J6250j0050K521K6178M8472P7278O9861l3910j63063j38790
18251H6096j889K6150p798p030j2090R10J339P739R487K224J124J7662L9032K9582
18237A92538R882R281K965q163J262Q646J156j151P27Q611K2664m378n539J4568
18223B53069P799K4997L4331P4541J19591N4461j42954k09124j01658l12J0756
18212A25497J0503O816L0759L6661K4978J4209q57j3926j3071J242R983J209j7483
18199B16520K4960L7882J8369N162j0669k2462j241K7434K7815Q464P402J4881
18187C54517J6169K4225K6497N0325Q9901J00472J33574O5309m9865q7266l6692
$$ y = [79789, 93086, 113705, 134353, 156175, 160960, 155742, 146012, 144782, 144379, 152533, 155935, 147102, 157365, 191349, 207599, 197549, 200070, 226248, 274720, 351998, 421859, 387949, 224886, 86096, 84207, 110357, 102559, 95529, 83439, 84349, 85688, 93427, 102914, 105138, 106262, 123924, 162956, 192538, 202420, 211701, 214666, 206503, 207765, 216411, 217567, 216416, 217143, 225754, 248418, 244040, 238501, 253069, 260868, 285865, 320196, 394737, 514328, 568789, 425835, 216711, 115053, 114741, 125497, 136000, 142816, 173575, 210236, 235214, 249423, 248566, 234640, 221569, 222811, 232794, 234003, 216520, 241480, 279362, 297731, 302893, 292224, 269762, 268521, 295955, 323770, 332234, 339636, 354517, 370686, 394911, 421408, 471733, 561634, 662106, 795680, 860989, 811124, 723858, 687166]
18176F87166M030J3928L5191K9128L3721N5738N1187P5843J05019K07834L40005
18165A638790M40483J43058l18226l69833j71695o2750m6503o8359l6287O0821
18155A209499J10537J17161J14065J19206J58942K84806M69915O43471O36849
18146C864451K11748p5882l4976J24585L24020N47102P96117R26895J018281J222527
18136H924868J678784K461119L536723N180248Q098965J3665325K3930340M3383720
18128A10860092P3891442P4488313j0636692p8570128o9896960l8476716j9310409
18121D2348942j0249974n455115k889914l295073l846531k820902j363276o1961
18113A2366196P34391J294583K613043M892978Q897939J2225068L717416r470970
$$ y = [687166, 691196, 705124, 740315, 769443, 803164, 858902, 910089, 985932, 1090951, 1298785, 1638790, 2079273, 2222331, 1904105, 1534272, 1362577, 1299827, 1253324, 1184965, 1148678, 1209499, 1320036, 1437197, 1551262, 1670468, 1829410, 2114216, 2584131, 3227602, 3864451, 4076199, 4000317, 3965341, 4089926, 4413946, 4961048, 5757165, 6684060, 7702341, 8924868, 10603652, 13064771, 16601494, 21781742, 29880707, 43546032, 67476372, 110860092, 184751534, 259239847, 248603155, 170033027, 100136067, 61659351, 42348942, 32098968, 26643853, 23753939, 20458866, 16612335, 13791433, 12428157, 12366196, 13100587, 14395170, 17008213, 21901191, 30799130, 43024198, 46741614, 37270644]
18105C7270644j1771237p037554l102155j174035k40221N86627J656136K924371
18097A9112576M529549P085979J1824650K0579178L6846429O6587822R4858114
18090B61424297M1762631o3110044r2698187o0685668l1421103j6974232j0490209
18083B7807485o940227m504687l087676k210388j494097q78926n45607q00670
18075G345207j054950r36582o19779k98435P5688K43137j32679n47157n80639
18066C493811m59918l53663k86442k03260j26080p9463q3614p1205n4165K00P3243
18055A849444K12291L83940L13990j98357n66105m60872k70703k19492j70902
18046H73234p1901m2572l8941k4210j6339j5247j9641k2576k5540l1844l8120
$$ y = [37270644, 25499407, 18461853, 15359698, 14185663, 13945442, 14532069, 16188205, 19112576, 23642125, 30728104, 42552754, 63131932, 99978361, 166566183, 261424297, 303186928, 240076884, 147378697, 86693029, 55271926, 38297694, 27807485, 20867258, 16362571, 13274895, 11064507, 9570410, 8691484, 8145877, 7345207, 6290257, 5353675, 4733896, 4435461, 4511149, 4754286, 4621607, 4074450, 3493811, 3033893, 2680230, 2393788, 2190528, 2064448, 1984985, 1901371, 1830166, 1776001, 1776201, 1849444, 2061735, 2445675, 2759665, 2561308, 1995203, 1534331, 1263628, 1044136, 873234, 801333, 758761, 719820, 695610, 679271, 664024, 644383, 621807, 596267, 564423, 526303]
18035E26303j309J9796K0703J1654l510k7984o361J721k9604m4893j8408L127
18023D51235k5054l5804l3499j8925j272R476o906M143J8239J3765K163j7518
18011C60043p511N726J8614J9261o054q904J0362m10K1948N9828L3055m5659j01714
17998C58585o6265k8825k0090o713J4548M980l4383k4005r707o527J3456K780
17986A97834o905J3555j104J735K3138K0453q13n115r821J4318J9115o772l2705
17973B26913K658J9161K5481K5979J3936j5129j446K5207N2549M2086r1871j21039
17961B04485q3357k3706n848O364K4313J7430K877j0723L762J225J1806L4261
17949A82889L5357K2579J8218O2525J62354L24382L78991M0696k85191k99039
$$ y = [526303, 524994, 544790, 565493, 577147, 573637, 545653, 539292, 541013, 511409, 466516, 448108, 451235, 426181, 390377, 356878, 337953, 336681, 346157, 339251, 343394, 361633, 375398, 377561, 360043, 352532, 358258, 376872, 396133, 390079, 381175, 391537, 391127, 413075, 472903, 505958, 460299, 358585, 292320, 263495, 243405, 236692, 251240, 256220, 221837, 197832, 188125, 181598, 195054, 197834, 190929, 204484, 203380, 205115, 228253, 248706, 247893, 242778, 232957, 247275, 266390, 259618, 226913, 229571, 248732, 274213, 300192, 314128, 298999, 297553, 322760, 375309, 417395, 325524, 204485, 121128, 97422, 91574, 97938, 122251, 139681, 142558, 131835, 135597, 136822, 148628, 182889, 218246, 240825, 259043, 321568, 483922, 808304, 1187295, 1227991, 942800, 643761]
17939F43761j72513q4152k5246M5812J12953K57047L65618J55036k78800l67483
17929F52033k27155j11708n9206n1336l8053l8450k7408R332Q135K288j3432q847
17917I6193J12O688J958j1710K5385K1964q170j5280j0372K113K3247L3695K1401
17904A87224n850j8690l0339m1381l2164j6383R58J2153J3462J7587J0050M522
17892A01149J5250m677j3493r621o520p8R48o26Q763K781l329k3407pJ9861j9089
17877F7905j4469P487J6657J5329L8515J724j2316p344J5358R867L781j5546k0817
17864A06131L132J7619Q12j4624l2162j1117P241K3051O30j5928j296O0j6217
17851F7332j4586l341N668L602J0065L0283l294m308J1037N071O92P708K9551
$$ y = [643761, 471248, 387096, 361850, 407662, 520615, 777662, 1143280, 1298316, 1019516, 652033, 424878, 313170, 253964, 202628, 164575, 126125, 98717, 108049, 116184, 118472, 105040, 96193, 96305, 102993, 104951, 93241, 118626, 140590, 132420, 117140, 106768, 108881, 132128, 165823, 187224, 181374, 162684, 132345, 90964, 58800, 42417, 43375, 55528, 68990, 86577, 96627, 101149, 116399, 111722, 98229, 88608, 82088, 82010, 82958, 82332, 91095, 93876, 90547, 67140, 67133, 86994, 67905, 53436, 60923, 77580, 92909, 131424, 133148, 120832, 113488, 128846, 138713, 142494, 126948, 106131, 109263, 126882, 127694, 113070, 80908, 69791, 77032, 100083, 100713, 84785, 83489, 83549, 67332, 52746, 49405, 55073, 58675, 68740, 99023, 95729, 91421, 102458, 107529, 108221, 115929, 145480]
17838A45480M2204L5677L2120L7816l4336k8169n8737l9246l1058q775p971L747
17826H8752J536Q58m869N747l701n294J2788J0326j5425j9519N156l584r274O718
17812G0215R157r030P429j473J255L591n44j4734j038K2998K3254K5336L9007
17799A75423N5021N856k1221k1740l9267l1817j7962r75J1576J4398N907n118
17787A30081L640j6199r838j4573q624K737j3821k200O435k727j0076k415J2703
17774G5123K6848K2750o749k9420l7800j7911n926J7162K9879L9936Q926M797
17762A27615j6687j6738P860M0881L4608M7051L3515j8410m3522l7716q267J6287
17750A66477J2492K6329M4827J4470l8079j9602k227l133m0663m3069k3216R425
$$ y = [145480, 187684, 223361, 255481, 293297, 258961, 230792, 172055, 132809, 101751, 92976, 85005, 88752, 90288, 91146, 86277, 92024, 88323, 83029, 95817, 106143, 90718, 71199, 76355, 72771, 63497, 70215, 79372, 70342, 77771, 76298, 77553, 81144, 80600, 65866, 64828, 87826, 111080, 136416, 175423, 230444, 236300, 215079, 193339, 154072, 122255, 104293, 103318, 114894, 129292, 135199, 130081, 133721, 117522, 107684, 93111, 84487, 87224, 73403, 71203, 77638, 74911, 64835, 62420, 75123, 101971, 124721, 117972, 88552, 50752, 32841, 26915, 44077, 73956, 113892, 122818, 127615, 110928, 94190, 102050, 142931, 177539, 224590, 258105, 239695, 196173, 158457, 150190, 166477, 178969, 205298, 250125, 264595, 226516, 206914, 204687, 201554, 160891, 117822, 94606, 104031]
17738A04031K5981L209J4813J3439j1862j2799p287l132p145M544K8684N1913
17726B04389M1968K2681j3382m5538j5582J2416R469J3545L0327N2110M9402j310
17714C60495j9906j7105L0011N5473L8759p5948k13502j41402N712K7708O418
17703E6713N397J0561N536m66K9256K3345o090k0861k416K1549J3854L5687K2092
17690A94157O341p53Q793K547j703K9736K1167j0168j1232N558Q303J2536J1417
17677B76699K6317P3161J08935J07362M7453n8370k0771K08677L96978K07473
17667A373914k30852l30486k15416j03098j3534M8154Q8713J83394L07050K42976
17657A350815j53006l59028k58902j16344k7289j1559k0259m0456m1456j3319
$$ y = [104031, 130012, 133221, 148034, 161473, 149611, 136812, 129525, 126393, 119248, 123792, 152476, 204389, 246357, 269038, 255656, 210118, 194536, 206952, 216421, 229966, 260293, 312403, 361805, 360495, 340589, 323484, 353495, 408968, 447727, 371779, 158277, 16875, 22587, 50295, 56713, 62110, 72671, 78207, 77741, 106997, 130342, 124252, 103391, 100975, 122524, 136378, 172065, 194157, 200498, 199745, 208538, 211085, 209382, 239118, 260285, 250117, 238885, 244443, 252746, 265282, 276699, 303016, 376177, 485112, 592474, 639927, 581557, 560786, 769463, 1166441, 1373914, 1143062, 812576, 597160, 494062, 480528, 528682, 617395, 800789, 1107839, 1350815, 1197809, 838781, 579879, 463535, 436246, 424687, 404428, 363972, 322516, 309197]
17647C09197J4820J2770r584l334K7464J8410R55q323L1056M7348M8278L1636
17635E20693P466o645J7332K6506L6840N2785O4900N0984M6947K9186L1512N454
17623H83960K8109R5576J28426K06897L77064M82088K13493k82821m10412k65918
17613A456462j38541n2585K4092Q4554J04188R2840Q2586J23323K16853K79985
17603B273757L40729M48587O11219Q04948P80989L44715L4045K95831P56953J053807
17593G745580J273896J651125K380354L535475M764073O328227R879128J7294440
17585E4852298L0986177N6611376R1006668O9340963l7094971r3656224p1403207
17578A00643080l8002232j9815662j1583608p361124m521728l175772k782537
$$ y = [309197, 324017, 336787, 327203, 323869, 351333, 369743, 370698, 362375, 393431, 440779, 489057, 520693, 528159, 521514, 538846, 565352, 602192, 654977, 719877, 770861, 817808, 846994, 878506, 883960, 912069, 1007645, 1136071, 1342968, 1720032, 2202120, 2415613, 2132792, 1722380, 1456462, 1317921, 1265336, 1289428, 1373982, 1478170, 1571010, 1653596, 1776919, 1993772, 2273757, 2614486, 3063073, 3674292, 4479240, 5260229, 5604944, 5638989, 5934820, 6691773, 7745580, 9019476, 10670601, 13050955, 16586430, 21350503, 27678730, 37557858, 54852298, 85838475, 142449851, 233456519, 302797482, 265702511, 172046287, 100643080, 62640848, 42825186, 31241578, 23880454, 19358726, 16182954, 13400417]
17571A3400417k250198j563893j030272o98369n32485l65976j61274J27700M11133
17562G336783L03996j24449j13295L24879O80484Q78449J071695J553586K499956
17553A4412084L621107M723427O878581J1682596K0841778L7889015O6839721
17546A66888309Q1815929J2044263p1344139p7249859m5377003k3084154j2720413
17539C0972933p916385m960698l087931k410768j910977j129596p76905j142362
17531G637311j329336j108895q39324o14108m24789k51080j69291j56601j34940
17522B608947j23022j14347j22597j13324m8152O1045J60028L27218N91133P86271
17512D013200L58743k45435n38249p53708p51937n10142k90911j76509j47294
$$ y = [13400417, 11150219, 9586326, 8556054, 7857685, 7325200, 6959224, 6797950, 6925650, 7336783, 7640779, 7516330, 7403035, 7727914, 8408398, 9286847, 10358542, 11912128, 14412084, 18033191, 22756618, 29635199, 41317795, 62159573, 100048588, 166888309, 248704238, 260748501, 189404362, 112154503, 66777500, 43693346, 30972933, 23056548, 18095850, 15007919, 12597151, 10686174, 9556578, 8779673, 7637311, 6307975, 5199080, 4359756, 3745648, 3320859, 3069779, 2900488, 2743887, 2608947, 2485925, 2371578, 2248981, 2135657, 2087505, 2148550, 2308578, 2635796, 3226929, 4013200, 4371943, 4126508, 3588259, 2834551, 2082614, 1572472, 1281561, 1105052, 957758]
17503I57758j29830p5860m0367m9642m2929l1039k7203K527r566j5161r938j4600
17491E14150L45J3053K2268L2691L476k7061l1441j0378L861r414M235M8068O6797
17478F30650R5108J39707P5794j02221j83338j31623o2671k9532j4260N526N86
17467D23726L156j6321n536J1936K0660J8547J5129p528J938M2798R1501N3434
17455F53440m5607q0265k4224O1787J51202K72957M60694Q46393J549697J551963
17445E398037l31754j675031j336107o50631l42209k74828k15325j19979n6504
17436C95669k4451l4492k3417r03K273j3903j539k2409j5361Q8k634M55J54o591
17422B52939k578K8932N3637q065p7406q4744n8519m5026r961K3058J1536p135
$$ y = [957758, 827928, 752068, 711701, 662059, 619130, 588091, 560888, 563415, 553849, 538688, 528750, 514150, 514495, 527548, 549816, 582507, 585983, 558922, 527481, 517103, 520964, 511550, 515785, 563853, 630650, 725758, 865465, 941259, 839038, 655700, 524077, 461406, 431874, 417614, 423140, 423726, 426882, 410561, 405025, 416961, 437621, 456168, 471297, 463769, 465707, 508505, 600006, 653440, 607833, 527568, 503344, 565131, 716333, 989290, 1449984, 2296377, 3846074, 5398037, 5066283, 3391252, 2055145, 1404514, 1062305, 787477, 572152, 452173, 395669, 371218, 336726, 313309, 312406, 314679, 300776, 299237, 276828, 261467, 261555, 258921, 259376, 259530, 252939, 250361, 279293, 332930, 324865, 247459, 162715, 104196, 59170, 49209, 72267, 83803, 76668]
17410G6668O635J4635J7706j5672j0585R465J220j3525J082k0505l1128L943K2801
17397F2740K7345K9885K6084j7516m4519k0156M323j757j7447m462N350l048P751
17384E4573j933J4899K278l252k4167k2769R074J7076o42L035r5r968P965J1047
17370E7121l3847j1804J7535K3651R054R330j7657j8298j1525J7782J0266J7979
17358F9587J598l1020j7312j3447j7321J4917j0435l997K0385K1581J3240Q874
17346E6650N974k286q51j063j2237j8485J245J447M23N22m252j3754N070o781
17332A1622j11Q410L7003J5272j9312O93N097k7835j2633R194j554J2715j0048
17319B8513j2867K754M315P77j4580p294Q650P66l067o365O280k1122R04J9560
$$ y = [76668, 83303, 97938, 115644, 99972, 89387, 98852, 100072, 86547, 87629, 67124, 35996, 39939, 62740, 90085, 119970, 146054, 128538, 84019, 63863, 68186, 66429, 48982, 44520, 49870, 46822, 54573, 52640, 67539, 69817, 66565, 42398, 19629, 28703, 45779, 45137, 48172, 48077, 38109, 46074, 57121, 23274, 11470, 29005, 52656, 61710, 71040, 53383, 35085, 23560, 41342, 51608, 69587, 71185, 40165, 22853, 9406, -7915, 7002, -3433, -7430, 12955, 34536, 47776, 56650, 62624, 60338, 59487, 58424, 46187, 27702, 28947, 30394, 30817, 31339, 27087, 13333, 18403, 11622, 11511, 19921, 56924, 72196, 52884, 53577, 58674, 30839, 18206, 27400, 25846, 38561, 28513, 15646, 18400, 22715, 23492, 8912, 1618, 10268, 11034, 7967, 1602, 7882, -13240, -12336, 7224]
17305G224j0781n816N955k26J8772L526j2618j843N674K655R963m471P201J943
17291B7158p144j0920j5747p550K597J2349J1788n917Q041J0607o228j0174J929
17278A0789n262n936j8383j21J8008N231j1765m398Q434j1648j139O53J1038P683
17264C184J532K095k062j4923j4432K402j466O987m203k827K862M470n772N718
17250a6435J5366J6144l342q090j0259m654M772L930m228K223O004J8596K9035
17237D9062j0773l6022k4352O63Q316J5197J6462K2054J0958K835k4544k5494
17225D362k1630j7490p575J955M860P826J1992L300J0162j441Q301J832j0261
17212c807j33j3900r379m208Q034j07R862J9813K7776o965q934q914n714j4784
$$ y = [7224, -3557, -9373, -3418, -3644, 15128, 18654, 6036, 4193, 9867, 12522, 22485, 18014, 25215, 27158, 20014, 9094, -6653, -14203, -11606, 743, 12531, 6614, 14655, 25262, 19034, 8860, 10789, 5527, -409, -18792, -18913, -905, 4326, -7439, -11837, -3403, -15051, -16190, -15537, -4499, 3184, 4716, 6811, 4749, -10174, -24606, -22204, -23670, -16683, -20886, -23713, -20851, -16381, -22153, -16435, -1069, 15075, 11733, 3643, -6616, -11270, -6498, -2568, -6796, -4573, 1431, 20027, 49062, 38289, 2267, -22085, -21422, -13106, 2091, 18553, 40607, 51565, 54400, 29856, 4362, -17268, -34758, -42333, -40378, -35518, -27692, -15700, -12400, -2238, -3679, 4622, 6454, -3807, -3940, -17840, -27219, -31427, -23393, -23500, -13638, 6175, 33951, 26986, 18052, 9138, 3424, -11360]
17198a1360r931k372j358n014J157J2191j1024J2362J8300J231r491q58m956j2855
17184b3978j3917q063J5619K4628R164k81M647Q329O709k5912p129R866j3454
17171a3772m353j2776j2194P382P175M673q86J6757O555k547p398p457J6753R012
17157F924J1555q886j7994p700J4724K8928L825n066J779j2761k78L3638j1506
17144C7182k3697M349J408K040l851q691m347J45P915M472o104o027L026r629
17130a809j2517O712j3398m54Q314L744P128L081j0109J74J3022L6969L259q061
17116C6055l8500j4392K864J963J1720J4259l735J339Q05K801p695J314j6551
17103g753J5543O572k384m043o268J0399P884q609j1586k696L765q877j9544j1964
$$ y = [-11360, -21291, -23663, -25021, -30035, -28878, -16687, -27711, -15349, 2951, 4182, -5309, -6167, -11123, -23978, -37895, -45958, -30339, -5711, 3453, 3172, 7819, 16148, 22857, -3055, -10184, -318, -13772, -18125, -30901, -43095, -35713, -28538, -23865, -24751, -7994, -1439, -3986, -11384, -18841, -2088, 6924, 18479, 9593, -8401, -16101, -1377, 27551, 31376, 26310, 28089, 15328, 15050, 48688, 37182, 13485, 17834, 19242, 21282, 17431, 8740, 4393, 4538, 12453, 16925, 10821, 4794, 7820, -1809, -14326, -7614, -21012, -21466, -13152, -9408, -2280, 801, -9308, -9134, 3888, 40857, 44116, 36055, -2445, -16837, -13973, -12010, -290, 13969, 10234, 11573, 12378, 15179, 7484, 8798, -7753, 7790, 14362, 11978, 7935, 1667, 12066, 19950, 11341, -245, -2941, 824, -8053, -27597, -39561]
17089c9561J1783J5055K1616J2537j5048n237K4868J2083j7076j6042j302J4285
17077A7961o58k2809q632R967l71N773P013J3223l108j4688l545j0964j1174K551
17063a9461J7260j1540o497J5088L270j2571j865j7359J1743K1020M337k91R68
17050D102L160k123r972k837j2691k754J6556K0762n923J9471R294p018J9896
17037D9923P077k7135k7276J3686J4164J7087n067l198J3686K7917K7514L6945
17025A45323O5161R7897K08204L72049M91992J75204l43402m67610k94424j61205
17015B89189j03303m7858j0701m791j8160j8438j7712j9971j1479q252r613m055
17003A4856O155O07L7739P406j8553q747j2842j6282J0313J9223M3603P694J9114
$$ y = [-39561, -27778, -12723, 8893, 21430, 6382, 1145, 26013, 38096, 21020, 4978, 3676, 17961, 17303, -5506, -14138, -4171, -4542, 1231, 8244, 21467, 18359, 3671, 126, -10838, -22012, -19461, -2201, -13741, -20238, -5150, -1880, -14451, -16316, -33675, -21932, -912, 3425, 3134, 4102, 7262, 5139, -4833, -7670, -20361, -23115, -6559, 14203, 8280, 27751, 37045, 30027, 49923, 57000, 29865, 2589, 16275, 30439, 47526, 42459, 39261, 52947, 80864, 108378, 145323, 210484, 308381, 516585, 888634, 1380626, 1555830, 1212428, 744818, 450394, 289189, 185886, 138028, 127327, 122536, 104376, 85938, 68226, 48255, 36776, 28524, 18911, 14856, 21011, 21618, 59357, 66763, 48210, 39463, 26621, 10339, 20652, 39875, 83478, 91172, 110286]
16990A10286M7567M9276R4018J36621K30467M06678L78863j02892m29357l81063
16980E40464k10397j13360n4362m2579k5444j5384j9211k0117n41j7223p937m743
16968I166R714K608J84m244K0861m156p152K884o77j6814j2284n33O012O926N091
16953A7586k355p566j717j0774p647j033N558k050J4884j285r310r31J4749L66
16939H475j2162j3744K4768J6414L202o414r136l004J772O507j2109n264J7286
16926A6591Q585k3456K866n627j4645K180P232j0359j5322Q948K0574L205m556
16913c784o659K270R779J615k448j6149r891J4108R744O560l348o91R473J493
16899A2072k9424j3945k719M423L324R408J9171J068j6738J437J0355j4293n275
$$ y = [110286, 157853, 207129, 301147, 437768, 668235, 1074913, 1453776, 1350884, 921527, 540464, 330067, 216707, 162345, 119766, 94322, 78938, 59727, 39610, 39069, 21846, 13909, 9166, 18880, 21488, 21672, 17428, 38289, 34133, 26981, 29865, 29188, 12374, 90, -443, 5569, 12495, 17586, 15231, 7665, 5948, -4826, -12473, -13506, -7948, -9998, 4886, 3601, -5709, -6640, 8109, 8475, -3687, -17431, 7337, 23751, 26953, 20539, 11403, 8399, 10171, 16678, 4569, -695, 16591, 25176, 1720, 4586, -1041, -15686, -13506, -6274, -16633, -31955, -23007, -2433, 772, -3784, -10443, -8173, 1606, 3221, 773, -15376, -25267, -11159, -1415, 5145, 1797, 1106, 10579, 12072, -17352, -31297, -34016, -29593, -26269, -16861, 2310, 3378, -13360, -11923, -1568, -15861, -21136]
16886b1136J1632P222L954r017j1731P062J8330O61K49J849o844k8865J813J7372
16872g449O641l868N369l944J9392P852l419j0118r192j2385p291l05J4950J2763
16858H996M979M232j6912k2540j610L767J5937J4978l0245J371J6494L944q681
16845e290j0489l224J0788N060M186J1194M519j998L638m825j3578o097M445j2991
16831a4662j1156J233J4552J5866Q431o073r144p880K909M998p11J7736o503j0981
16817a385l405Q977N991J0019j491j3645J459J2628J0364j4799M243O949L896
16804B9801j3026q929o532p632l37Q73J372j0446j505J9593O844k701q286K391
16790A480J631l283R312p554P376j3711o238J6954P709j2531p011O851J5128J3225
$$ y = [-21136, -9504, -2282, 1672, -7345, -19076, -12014, 6316, 6977, 7226, 9075, 2231, -26634, -24821, -7449, -808, -4676, 693, -3251, 16141, 23993, 20574, 10456, 1264, -11121, -18412, -18717, -3767, 8996, 13975, 18207, 1295, -21245, -22855, -19088, -3151, 11827, -18418, -17047, -553, 3391, -5290, -15779, -19003, -8215, -3155, 1031, 12225, 16744, 14746, 18384, 13559, -19, -6116, -1671, -14662, -25818, -24585, -10033, 5833, 14264, 8191, -953, -8833, -5924, -926, -1637, 16099, 9596, -1385, -4790, 4187, 10178, 20197, 18706, 5061, 6520, 19148, 29512, 14713, 18956, 25905, 29801, 16775, 7846, 1314, -6318, -6655, -5782, -4410, -14856, -16361, 3232, 10076, 7375, -911, 1480, 3111, -172, 9140, 1586, 8962, -4749, -10987, 5967, 13676, 1145, -5866, 985, 16113, 29338]
16776B9338q131p354k5929o858m175j705l976j4631J0293J0174Q958Q48L411l660
16762a3397k289K220K3461Q062l468n251j2352P668j435j3858r453m527o690m693
16748c6002R134K5953q386j2311l658P200J3794P576J2475j6343j8251p06M502
16735a5023j3421O312K0273j489J506j2901K941J2342m672j784K029j4682r880
16722b8449P153O05O406M717J2799M791j3149k0037o910L553m000J0669K257Q886
16708a0709O732q805q282J5670L220K054n552Q313J4232l211k091Q665p827k2009
16694i600p390K0660N993j7869k864N796j838p338K971J0644Q640l227m399l307
16680c128R889K4583L237j7401K691p219n939j2541p845L05j3908K5126L1866
$$ y = [29338, 21207, 13853, -12076, -18934, -23109, -24814, -28790, -43421, -33128, -22954, -13996, -13148, -9737, -13397, -15686, -13466, 9995, 18057, 14589, 9338, -3014, 4654, 3219, -10639, -20092, -24619, -31309, -36002, -26868, -915, -9301, -21612, -25270, -18070, -4276, 3300, 15775, -568, -18819, -19525, -15023, -28444, -22132, -1859, -3348, -1842, -14743, -11802, 540, -4132, -5916, -3887, -18569, -28449, -21296, -20691, -14285, -9568, 3231, 8022, -5127, -25164, -32074, -28521, -32521, -21852, -19595, -10709, -3977, -12782, -21064, -5394, -2174, -120, -5672, 2641, 16873, 13662, 11571, 20236, 12409, -9600, -16990, 3670, 9663, -8206, -11070, -5274, -7112, -14450, -11479, -835, 7805, 4578, 179, -3128, 6761, 31344, 34581, 17180, 19871, 12652, 6713, -5828, -13673, -13368, -27276, -2150, 29716]
16667B9716K130n726r789n600q976J0520M956P190j3193K38K65n00J861k1939
16653h847K903J3145J4021j4122k0912P414k431p947J0566J2591J8322j181j8084
16640E438j0760j1181L105J3546r90k455J3780L287r223j8035p390K383m442k131
16626b5068L265Q359O44J938Q358J2899l850j017j2640K01K1740N252m421l326
16612A2334M479k304j3766j6060j6638j1786n709L0333J5023r791M88o489J5249
16599d637J0637L344r320k0105j8538O012k604l776P152J643J0256O883j556J9971
16585E362O994j3866r119p65L752J3867P752M166j1354k0579k916J3469q615j5704
16571b7556J4553J4145O652J84K329k678R757j1506q941M912J0833j0084o122
$$ y = [29716, 31846, 26120, 16331, 10731, 1755, 12275, 17231, 24421, 11228, 11466, 11731, 11231, 13092, -8847, -5944, 7201, 21222, 7100, -13812, -6398, -8829, -16776, -6210, 6381, 24703, 23522, 5438, -5322, -16503, -13398, 148, -842, -3297, 10483, 13770, 4547, -13488, -20878, -18495, -22937, -25068, -21803, -13444, -12800, -10862, -2504, 10395, 6545, 5528, -7112, -6911, 14829, 20081, 15660, 12334, 16813, 14509, 743, -15317, -31955, -43741, -49450, -19117, -4094, -13885, -13397, -19886, -4637, 6000, 9344, 24, -20081, -38619, -32607, -35211, -38987, -31835, -30192, -19936, -13053, -14609, 5362, 12356, -1510, -10629, -11394, -7642, 6225, 13977, 18143, 6789, -13790, -16706, -3237, -11852, -27556, -13003, 1142, 7794, 7978, 10307, 7629, 17386, 5880, -3061, 1851, 12684, 2600, -3522]
16558c522o272j9543j0759K2977L75k1595O163j337K153N105J976m780p333P225
16544b9167K29q7J8894J8507q467m203m475j5318J743J2177J817J0765J1515j861
16530A2069n404J6216l452j0862M266R565J0799m325j2693p407j960J593Q487
16517A6892L849J135j3488m616Q074l788j1473j2590R29m85J8224O430N863j4007
16503I49p724J7245n058j314J3882P50o798j0316j4564M246j5358j7972J958Q294
16489c1780o718O076R438l796j0231K4321K1697Q779L067k2228m006N902R631
16476A0152J1551m332K521m656j1477j2837K9627j789K669N456j3862k330j3152
16463b459l659m333L423k325J4202K329j0781q131j934Q707N851j1163L632R38
$$ y = [-3522, -9794, -29337, -40096, -17119, -16744, -38339, -32176, -33513, -31360, -26255, -24279, -29059, -36392, -29167, -28938, -29025, -10131, 8376, -91, -4294, -8769, -24087, -22344, -10167, -8350, 2415, 13930, 12069, 6665, 22881, 19429, 8567, 12833, 22398, 33197, 28872, 16179, 8772, 6812, 8405, 16892, 20741, 21876, 8388, 3772, 11846, 8058, -3415, -16005, -15076, -15561, 2663, 9093, 14956, 949, -6775, 10470, 5412, 4098, 17980, 18730, 11932, 1616, -12948, -8702, -24060, -42032, -40074, -31780, -38498, -32422, -22984, -26780, -37011, -12690, 9007, 17786, 20853, -1375, -5381, 521, 10152, 21703, 17371, 19892, 15236, 3759, -9078, 20549, 18760, 21429, 26885, 13023, 10693, -2459, -6118, -10451, -7028, -9353, 4849, 7178, -3603, -11734, -13668, -4961, 890, -10273, -6641, -5703]
16449e703j66J0998P127M174r912l2814l264K83M877J3977N918j593j9244R709
16435a5633J8503L794j849J2621L055j7597j392J844J600J6996l513J1024o261
16422B3192j970r227j5300r550L489J2279L689L380R244l776r148N057m933j3227
16408f801J3049j827j0128J1848Q690k424j0220J2845j632j2340l555J483m0o426
16394g478r53J2644O876M131r501R82k074N983K500J1874Q241j3917o143J245
16380A4410o730J3108j7789p466j465J1940P480n550K736R316j2992q847J010
16367h39n00Q876L182O826m985P754l078P18k0188j4289J998M349M636O875j375
16352d0o685r232L392J1954o119K996Q071J4244q164j0407L064Q355Q513J0665
$$ y = [-5703, -5869, 5129, 12256, 16430, 6518, -26296, -29560, -29277, -24400, -10423, -4505, -6098, -25342, -15633, 2870, 6664, 4815, 17436, 20491, 2894, 1502, 3346, 4946, 21942, 18429, 29453, 23192, 21222, 11995, -3305, -12855, -9366, 2913, 6602, 9982, 19226, 15450, 6302, 11359, 6426, -6801, 6248, 4421, -5707, 6141, 14831, 12407, 2187, 15032, 13400, 1060, -2495, -1012, -1052, -7478, -8431, 4213, 11089, 15220, 5719, 6701, 4627, 10610, 13110, 24984, 33225, 19308, 13165, 14410, 7680, 20788, 2999, -4467, -5932, 6008, 13488, 7938, 10674, 19990, 6998, -1849, -839, -1339, 7537, 10719, 17545, 12560, 20314, 17236, 17954, -2234, -16523, -14525, -10176, -5540, 1335, -40, -6725, -15957, -12565, -611, -6730, -3734, 4337, 18581, 10417, 10, 3074, 11429, 19942, 30607]
16338C0607j3876j7926p184j986P175Q834O724N827j6238p652r713J096K385m257
16324a6184j122J17P20l302N384J948K681o318p700R598K113k8140m056L404p47
16309d1604R621n407k508M815p754J2760J9990J0040N583j390j0350j5586J6481
16296e309m141N496m690o95j1145K578J6152P306J1632l72o188p822j1443L374
16282e267l278L753R730k299R21j6831q658r337K002J5993P487l983J0717J6151
16268A7101j1749q877p61M28j9218q737J4659M783N697J7690j147J0912J4986
16255C5767p596l229j5812j1873J391J1808j4274j6385K258m02K656p944r681
16242c3316l021L443M141J0005Q143K349j2721K868N38j1018O884J4862K447p694
$$ y = [30607, 16731, -1195, -8379, -10365, -3190, 5644, 12368, 18195, 1957, -5695, -15408, -14312, -11927, -16184, -17306, -17189, -16469, -19771, -14387, -12439, -9758, -16076, -23776, -14178, -12065, -40205, -44261, -40857, -41604, -31983, -37390, -39898, -35083, -42837, -30077, -10087, -47, 5536, 4146, -6204, -21790, -5309, -9450, -3954, -8644, -9339, -20484, -17906, -1754, 5552, 17184, 16812, 10624, 2802, -8641, -5267, -8545, -4792, 4938, 2639, 3560, -13271, -21929, -31266, -29264, -13271, -5784, -9767, 950, 17101, 5352, -3525, -4286, -3858, -23076, -31813, -17154, -12371, -6674, 11016, 9869, 20781, 35767, 28171, 24942, 9130, -2743, -1352, 10456, -3818, -20203, -17945, -18347, -15691, -23635, -33316, -36337, -32894, -28753, -18748, -10605, -8256, -20977, -18109, -17571, -28589, -21705, -6843, -4396, -12090]
16228a2090J1222J0765o944r28J3173q603j7048Q415o460R42J1266J480j0755
16215e565j4556j706J73k49r403R894J8987J7706J653J757q554k6058r38L877
16201a2982R622Q309R356k786L628j6268R93J266k149j2776j467J163r35p155
16187b2181l02N158r39O859k555l847O713J6889J023l280j9969J1064J677p019
16173a0709Q44J2334M166K0757l831k9452j9758P312O748M445j5784j459J4972
16160i415m245j2898N863O376j0528o501R273J8598q69P279J5128K665j8983m374
16146b631j401R004J6247p819m319M907q336j2117Q437L878R739j87j591K258
16132A6069r812j0715j7534j2963O201O186j411J991M605L175J5637p313q464
$$ y = [-12090, -868, 9897, 2953, 2025, 15198, 6595, -10453, -2038, -8498, -7556, 3710, 5190, -5565, -20121, -21827, -21654, -21903, -31306, -21412, -2425, 15281, 16934, 18691, 10137, -15921, -16859, -12982, -3360, 4949, 14305, 11519, 15147, -1121, -128, 1138, -1011, -13787, -15254, -14091, -15026, -22181, -22483, -17325, -18264, -11405, -13960, -17807, -11094, 5795, 6818, 3538, -16431, -5367, -3690, -10709, -9865, 2469, 6635, 27392, 23561, -5891, -25649, -18337, -11589, -7144, -22928, -24387, -9415, -13660, -26558, -20695, -14319, -24847, -31348, -22075, -3477, -4346, 2933, 18061, 20726, 1743, -2631, -4032, 4972, 21219, 13400, 9081, 13988, 5652, -6465, 1972, 5850, 15589, 15402, 13811, 16069, 6257, -4458, -21992, -34955, -28754, -22568, -23979, -21988, -17383, -14208, 1429, -5884, -14348]
16119a4348j4994r275j054J3232O079K0184J2255R357k672p222j5886l61n727
16106a0432j0512J3123J2833k260M54r727K855J5151p057k1516l11P486n591n702
16092b1206n492J3278J5319r234j271P976R912j177j5123O564l905l428M737o405
16078i455L293J2774P707P154r522k7332q968j595R518O695J0449k820j54k646
16064d902J02P386j01j988O963M145r024Q509M353p281j4793N062r076N127N005
16049e13J9083L314n068n322j6046j3053m695M81J0062L460n948L675J0443p496
16035g623p763L300j287j1821p345N770L0927J0897k2216k2315l891J1688O488
16022a5191O381l294k318o04L234j9443J3884Q287M438k217p427J3166N359r227
$$ y = [-14348, -29342, -38617, -39671, -26439, -20360, -176, 12079, 21436, 18764, 11542, -4344, -4705, -10432, -20944, -7821, 5012, 2752, 3206, -6521, -3666, 11485, 4428, -17088, -17399, -9913, -15504, -21206, -26698, -13420, 1899, -7335, -8606, -630, 9282, 8105, -7018, -454, -4359, -7787, -3050, -9455, -6162, 6612, 14319, 21473, 11951, -15381, -24349, -25944, -16426, -9731, 718, -2102, -2256, -4902, -4800, 2586, 2485, 497, 7460, 11605, 2581, 11090, 15443, 8162, -6631, -1569, -10645, -5518, -513, 18570, 21884, 16816, 11494, -4552, -17605, -22300, -21819, -11757, -8297, -14245, -10570, -127, -7623, -15386, -12086, -13373, -25194, -32539, -26769, 4158, 15055, -7161, -29476, -33367, -21679, -15191, -8810, -12104, -14422, -15026, -11792, -31235, -17351, -9064, -4626, -6843, -14270, -1104, 4255, -4972]
16008d972M270L551J435M370L656m4j4489j2218j468J824P789K586P950N898j1739
15993a601j0472j2240l618Q040m516K3202J0312Q929N736j2797k2988j9516J014
15980c0515k051J0729O359q511M704K0832K145j3388q139K950j30J608P715K473
15966c219p224j5446o178J5466K4377L750q340m858j894o958j2559l059J5011
15953a1131P057L346j686j3675M578J2935J8144k995k4542q187m110j439J7508
15940d197J978l94m530P459O874J0623o009q890j4644P281J2162O199r177j024
15926C711Q77J6346K600j1596p549K425q63j2427J5730J1553q972k52R807n52
15912B0838o707L086Q45M544k5303r101r13j0685N19R531P828K969j6384O02R776
$$ y = [-4972, -702, 2849, 4284, 8654, 12310, 12266, -2223, -14441, -15909, -14085, -6296, -3710, 4240, 10138, -1601, -12073, -24313, -27931, -19891, -24407, -1205, 9107, 18036, 23772, 10975, -12013, -31529, -30515, -32566, -21837, -15478, -23989, -19285, 1547, 3692, -9696, -17835, -14885, -15015, -13407, -5692, -3219, -10443, -25889, -32067, -16601, 7776, 11526, 3186, -1672, -3566, -10524, -23083, -26142, -11131, -4074, -728, -2414, -16089, -11511, 1424, 19568, 16573, -7969, -16156, -20266, -21705, -4197, -2219, -2613, -7143, 316, 7190, 17813, 11804, 2914, -11730, -4449, 7713, 13912, 4735, 3711, 4588, 20934, 23534, 11938, 4389, 6814, 5951, -6476, 9254, 20807, 11835, 11583, 21390, 20838, 14131, 17217, 18062, 22606, -2697, -11798, -12711, -23396, -22877, -13346, -5518, -2549, -18933, -18331, -8555]
15897h555O32J093j2520k3144K718J5579L3674J93k9931j0995J8084J1892N012
15884C732K051Q759m353m827k622m467J715M607m880j591k908j748j076j275J741
15869g142P200j2824j6411O339K505K593J5059N861J282k617l400O012n809p353
15855h705j2109j1819K2810p294n376o826r334P232J6722r178n16O401n801Q046
15841a5747k990p283r750K3596J3802L881N674r168k2813j4116J4613J6674j527
15828e154K360J1342k26p449j0251K912n851j5405L955J2368J2366r394J802K894
15814c731R171J270K465P376J4047O186j292j5464j7605j0590p204J7750K0766
15801B3145P39L37j8633j2116K6516J1775j9417q966o915k2253l778J6443K0015
$$ y = [-8555, -7923, -6830, -19350, -42494, -39776, -24197, 9477, 9670, -20261, -31256, -13172, -1280, 3732, 5783, 14542, 10189, 5362, 2740, -1727, -12, 4595, -285, -1876, -4784, -6532, -7608, -8883, -7142, 58, -12766, -29177, -22838, -20333, -17740, -2681, 3180, 4462, 1845, -1555, 4457, -1352, -8705, -20814, -32633, -9823, -17117, -22493, -29319, -38653, -31421, -14699, -23877, -24393, -17992, -23793, -15747, -18737, -26020, -35770, -12174, 1628, 5509, 11183, 2015, -20798, -34914, -20301, -3627, -5154, -2794, 8548, 8322, 873, -9378, -6466, -12317, -27722, -23767, -11399, 967, -8427, -6625, -3731, 5440, 6710, 9175, 16551, 30598, 36784, 35492, 20028, 2423, -8167, -15371, 2379, 23145, 23884, 24221, 5588, -6528, 19988, 31763, 12346, 3380, -3535, -25788, -29566, -13123, 6892]
15788F892O724l880m437j4023j004Q973o64q061m619L088n051j3615j947k20J036
15773c0808P181J3278R279l257M535K956J0897k6578K545P804J3742O388K674
15760B0636J018K590j1811J7965p549j8424j0799L211j5609l253M942l319o8k127
15746b2597L836L596K2557n563j4455n749p319J7260J0189J035j7656M493N720
15733d653Q653m875q601O159N70j0729M987j506j051J443r509j04J2537P134P999
15718H454K430L724j1126j2953j83r111O374J0267J095l556l699o107N914j818
15704a0295j3228j2254K780L143n277Q009j312J3280m033o408J1262R339q826
15691a3820K507L761M145k033q494N291P226Q586j2216r023J593p861q12R674
$$ y = [6892, 13616, 9736, 5299, -8724, -9728, -755, -1419, -9480, -14099, -11011, -16062, -29677, -31624, -31844, -30808, -23627, -10349, -1070, -4327, 208, 3164, 14061, -12517, -9972, -2168, 11574, 17962, 20636, 21654, 24244, 12433, 30398, 22849, 4425, -6374, -3163, -18772, -22025, -17083, -20402, -20470, -22597, -18761, -15165, 7392, 1829, -12626, -18375, -25694, -8434, 1755, 2790, -14866, -10373, -4653, 4000, -875, -9476, -3317, -2747, -13476, -8489, -9995, -11046, -9603, -19112, -19216, -6679, 455, 8454, 10884, 14608, 3482, -9471, -9654, -18765, -12391, -2124, -1029, -4585, -8284, -14391, -8477, -10295, -23523, -35777, -32997, -29854, -35131, -27122, -28434, -15154, -19187, -25595, -14333, -4994, -13820, -11313, -7552, -3407, -5440, -13934, -8643, -1417, 7169, -5047, -14070, -12477, -20338, -21150, -11476]
15677a1476J982j503J0705K763p437p795L081q38J0422j1732J05R932M039K918
15663E166J1211M97o863j2151M310R695M228M56L515n28p595q130j8241l517J5150
15648b797O245l902m441l372J0850J1750J0149P8M892l069j3936j9652j2091J291
15634a8005R044Q842L503M865M106o202l866j1928J589R288J1122n024q36Q927
15620A5425K123l955L974j1294j0122J5624J1323k4006m465r447r836j3023o840
15607d4519J3383K0385J5031L91o348r346O619J3651J4514m869L503r177j4623
15594a405j6906k186L840N127nK23K1798o156k037M66J4374J203J349o026q158
15579E501q157N08l072l732M607K927L252J4935j834o485J9694j415j8892O864
$$ y = [-11476, -9494, -10997, -292, 2471, -4966, -12761, -9680, -10518, -96, -11828, -11723, -1791, 2248, 5166, 16377, 16874, 10011, -2140, 2170, 11865, 16093, 16549, 20064, 19536, 11941, 3811, -14430, -17947, -2797, 3448, -454, -4895, -8267, 2583, 14333, 24482, 24560, 29452, 26383, 12447, -7205, -19296, -18005, -8961, -119, 3384, 8249, 12355, 6153, 2287, -9641, -8052, 1236, 12358, 7334, 6498, 15425, 17548, 13593, 17567, 6273, -3849, 11775, 23098, -908, -5373, -14820, -24656, -37679, -44519, -31136, -10751, 4280, 4671, -1677, -11023, -4404, 9247, 23761, 18892, 22395, 13218, -1405, -18311, -20497, -16657, -11530, -11535, -11312, 10486, 4330, 2293, 2759, 17133, 18336, 19685, 13659, 5501, -2656, -2148, -5220, -8952, -4345, -1418, 1834, 16769, 14935, 8450, 28144, 26729, 7837, 14701]
15565A4701N427q561J1055k579j2925p624o541k398K607N069Q251j253j3376L382
15551d765Q398M180k234k538J1012j402o182p268L138M287l777n8M944q050m163
15536d478j1284j5853R621J3761J7064J9041j5977P60K2151k061j4025p542K7
15523A1205k7693j3277K0270J2232P83K2609j3805k5150m701M193J8081J99L229
15510H175j0358j4081r020P658R10O547J2412J2787J3901m903m00O622j0840q803
15496A0607j3269p679K7921K37j6212N696j1788o594Q161J754o098J1914j2299
15483g649L646O629J9292R988p069k5640k6364K454K435J4378J3390K430J4543
15470B2463J2113j3148k917j7411j2062o99P839O068j4779l445M049m379R420
$$ y = [14701, 20128, 11567, 22622, 20043, 7118, -506, -7047, -9445, -6838, -1769, 6482, 5229, -8147, -4765, 3633, 7813, 5579, 3041, 14053, 12651, 6469, -799, 2339, 6626, 2849, 2791, 7735, -315, -4478, -15762, -31615, -21994, -8233, 8831, 27872, 11895, 12655, 34806, 32745, 18720, 11178, 11205, -16488, -29765, -9495, 2737, 3520, 26129, 12324, -12826, -17527, -13334, 4747, 4946, 8175, -2183, -16264, -25284, -17626, -16716, -10169, 2243, 15030, 28931, 24028, 23628, 30250, 19410, 10607, -2662, -10341, 17580, 17817, 1605, 7301, -4487, -11081, -2920, -1166, -7264, 4650, -7649, -4003, 2626, 21918, 31906, 24837, -803, -27167, -24713, -22278, -7900, 5490, 7920, 22463, 34576, 21428, 18511, 1100, -10962, -11661, -3822, 2246, -12533, -15978, -11929, -16308, -6888]
15457f888P941k584j526M286k73j804l953o068J460m622k022R968L424p679j1049
15442b1389k765L310Q454J8925P510k160J3625p304k826J793o401j1052k3432
15429b3712j775J2955J1298N266P942j0883q883J5511Q018j2829m327k33N821
15416D169j1187p776M169P323j2077j2531k16J0089Q715J394L334r9l070p215
15402a4978n652Q392J7031j237j3466J489j070J9656J5023o827o889L767L714
15389A8953n385j4915r039L266Q185J1976O99L023O876l144n764j8910j6848L838
15375a7189J9977j3814N712j626J8831J624n160k0687M011J2185q142r536j8167
15362c1981o495P447J7961J3974j0590P103J3524k634r824j7007J3719J0268M547
$$ y = [-6888, 1053, -1531, -3057, 1229, 956, -848, -4801, -10869, -9409, -14031, -16053, -6085, -2661, -10340, -21389, -24154, -20844, -12390, 6535, 14045, 11885, 25510, 18206, 15380, 17173, 10772, -280, -23712, -25487, -12532, -1234, 4032, 11974, 1091, -7792, 7719, 15737, 2908, -1419, -1652, 4169, -7018, -14794, -10625, -3302, -15379, -27910, -28126, -18037, -9322, -7928, -4594, -4693, -7763, -14978, -20630, -12238, 4793, 3556, -9910, -8421, -9491, 10165, 25188, 18361, 11472, 15239, 18953, 13568, -1347, -10386, -7120, 1065, 13041, 13740, 16763, 23639, 20495, 14731, -4179, -21027, -17189, 2788, -11026, -5314, -6940, 11891, 13515, 8355, -12332, -8321, 3864, -4278, -13814, -31981, -38476, -31029, -13068, 906, -9684, -2581, 10943, 8309, -1515, -18522, -4803, 5465, 10012]
15349A0012k166J4352K344j38k020n101R480j7189r970n761j4855m398J545K108
15335b1757J3485J1272N183k0268m261R187J9070j29r733l78o417j4530o256J834
15321b3698l901L413J9658J6836J0061K5j9653k057Q152J2404j8523j9777m012
15308b1072J378r438K937J9823O282k797j1195J108J9019P601j0342k3552K395
15295a7853J7318m038j6710q06J0477J0026p895k284o329j138Q021J4604Q061
15282A1454J6686l1415r838J6788R913m226j9684O799J2369j0872n043n175j5439
15269b7683j0249Q995N58K923P752N738l952L70Q301K6708J2692K609K83j2133
15255B2912k0188J0467J2723l416j3332j7424j3191k71J3340Q176P391O659m43
$$ y = [10012, 7846, 22198, 24542, 24404, 22384, 17283, 26763, 9574, -396, -6157, -21012, -25410, -23865, -21757, -8272, 3000, 8183, -12085, -16346, -7159, 11911, 11782, 2049, 1671, -4746, -19276, -25532, -23698, -27599, -24186, -4528, 12308, 22369, 22394, 2741, 684, 8836, 21240, 2717, -17060, -21072, -19694, -29132, -26195, -6372, -90, -2887, -14082, -12974, 6045, 13646, 3304, -20248, -17853, -535, -4573, -21283, -22089, -11612, -1586, -9481, -11765, -18094, -19232, -11211, 3393, 11454, 28140, -3275, -13113, 3675, 13588, 9362, -10322, -3523, 8846, -2026, -7069, -12244, -27683, -37932, -28937, -28379, -25456, -17704, -11966, -15918, -15548, -7247, 19461, 32153, 34762, 35045, 22912, 2724, 13191, 25914, 22498, 9166, -8258, -21449, -21720, -8380, -204, 7187, 13846, 13403]
15242A3403K27j2253N110J741Q62j2405j3038M903J5655Q370j6276j6079k617
15229b2397M070R0J8796J0956O821R851k3689p19K205p655J118K2622P292j4939
15215A4422l315j5293o13O470j5716k0968J6567K7245R482K467R02l619M351j321
15201B1061j6559j250J0832n30o902p264j1603O532m605N040J0974M99P308r376
15187D157p784N184L609J2078R600J6676J886j0242j9575M459J4410k560j0960
15174B0938k979Q531l958j5700r643n93J206n123m428j081n835O690J5034L722
15160F781p52R401J5418k241r972P189m687q793K45j897N488p688j392M143O71
15145A1914M264J3109o631j4916l350J2504L49p140j3395M424J0491l367J295
$$ y = [13403, 13630, 1377, 6487, 8228, 9090, -3315, -16353, -11450, 4205, 12575, -3701, -19780, -22397, -18327, -18237, 559, 11515, 18336, 28187, 4498, 3779, 5984, -1671, -553, 22069, 29361, 14422, 11107, -4186, -4799, 1671, -14045, -35013, -18446, 8799, 18281, 20748, 21650, 18031, 22382, 21061, 4502, 3252, 14084, 13554, 6652, -612, -12215, -5683, -10288, -5248, 5726, 6225, 13533, 4157, -3627, 1557, 5166, 17244, 26844, 43520, 45406, 35164, 15589, 20048, 34458, 31898, 20938, 17959, 26490, 22532, 6832, -2811, -3404, -2198, -7321, -11749, -12830, -18665, -11975, 3059, 6781, 6029, 15430, 30848, 28607, 18635, 25824, 21137, 12344, 12589, 10692, 16180, 8492, 7100, 11243, 11914, 16178, 29287, 22656, 7740, 4390, 16894, 17243, 10103, -3292, 1132, 11623, 8256, 9551]
15132I551J4692p901O939N025j9417j1842k761m738M446R228M440m984n303L476
15118H51K529n769O03n205r528J9704R127j817J0764J1345L953J2256l4327j5044
15104e58R64m31N682j2816L074O360Q176R030m584j3378j2425N570P163P630R356
15089A8813j5617m539M72P898j4146R08O536j963L146L833n339j6401J1322J4121
15075I044j5956o418o073N534m737P125K4376J3463j366j2966N627k470l1j2130
15061C022n548K934m496J103l371j6183L774L375o426J1926n616N40J256K820
15047a0890P116j506k7755R469Q864N777p853r41J5051N344l840q725o978Q990
15033g877K1123N932J2128o644l112p259m677k854J4108P696o647o436j0561l434
$$ y = [9551, 24243, 16342, 23281, 28306, 8889, -2953, -5714, -10452, -6006, 3222, 7662, 2678, -2625, 851, 3380, -2389, -1786, -6991, -16519, 3185, 12312, 10495, 21259, 32604, 36557, 48813, 14486, -558, 406, -25, 5657, -7159, -4085, 2275, 10451, 19481, 14897, 1519, -10906, -5336, 1827, 9457, 18813, 3196, -1343, -871, 7027, -7119, -6211, 325, -1638, 1508, 5341, 2, -16399, -5077, 9044, -6912, -13330, -19403, -13869, -18606, -11481, 12895, 26358, 24992, 12026, 17653, 15183, 15152, 3022, -2526, 408, -4088, -2985, -6356, -22539, -18765, -15390, -21816, -9890, -15506, -14966, -13710, -10890, -3774, -5280, -33035, -23566, -14702, -8925, -16778, -17719, -2668, 2676, -1164, -9889, -16867, -7877, 13246, 19178, 31306, 24662, 21550, 14291, 9614, 6760, 20868, 28564, 21917, 15481, 4920, 1486]
15019A486n129k043R096J5683L102j2109j2893J789o945L862j800K627j343j1560
15005a6177p43L7103O701k2421n144n507P94J6716n076j989O665M643j6167o280
14991f882j0861M467J0286l217k1322J5342J3585J8779n292m470j4640j4482L346
14978a5361l099N770J1453J0675K124j3554p198j0456J4639J3490L083p012j4190
14965i636J0000R680n126J664j64K166Q354O74j6413P504J2340k626r935j1778
14951c296k44K037p100K701O753J3006J852j1048j2296l141j906m601j087M266
14937a4104j6996o145R902k6O851P285O958J7727m843L247r784q486q169N823
14923a0760K0054J9950q028j1213o736k498j4372k008K019L2p108O10J4023J2070
$$ y = [1486, -3643, -5686, 3410, 19093, 22195, 10086, -2807, -1018, -7963, -4101, -5901, -3274, -4617, -16177, -16920, 20183, 26884, 4463, -681, -6188, -5394, 11322, 6246, 4257, 10922, 15565, -602, -6882, -17743, -13276, -2990, -6207, -27529, -12187, 1398, 20177, 14885, 10415, -4225, -18707, -15361, -18460, -12690, -1237, 9438, 11562, -1992, -9190, -19646, -5007, 8483, 11566, 4554, -9636, 364, 10044, 4918, 6582, 6418, 8584, 16938, 17612, 1199, 8703, 21043, 18417, 8482, -3296, -3540, -1503, -8603, -5902, 851, 13857, 15709, 4661, -7635, -10776, -12682, -17283, -18370, -14104, -31100, -37245, -27343, -27369, -20518, -13233, -6275, 11452, 6609, 9856, 72, -8414, -16583, -10760, 9294, 29244, 21216, 10003, 3267, 769, -13603, -15611, -13592, -13560, -20668, -20058, -6035, 6035]
14909F035j3137Q797K2216R511j0493m797j0310p184J2798N628p842j0705p526
14896g009R787O625J3249K1082j1618j8541o438R520O204J496J9947j792k18P568
14882D9862j8304l338q627l342n897j12m864n447M975J6983K236k1378k9958l859
14868c1070J5928K2719J2430j655p739J878j5611J1669J1466j846j493q659n672
14855B345Q291k217j4425k3406R013J6974J3531l943m503l498j0703O319r093
14842a5315Q55o97r4J3608n25N438r056M619J9217j9794p764n325n096K701J3735
14827c493P406J0038K85j8683j535J0918J3364P568k068p515p945m683L530L115
14813A0302n734J0534R758q450j579K175k0850k3143K7907J6026N10j0682r437
$$ y = [6035, -7102, 1695, 23911, 33422, 22929, 18132, 7822, 638, 13436, 19064, 11222, 517, -7009, 2778, 9403, 22652, 43734, 32116, 13575, 7137, 16657, 22861, 24357, 44304, 42512, 42294, 49862, 31558, 28220, 19593, 16251, 10354, 10242, 5378, -69, 4906, 21889, 24125, 2747, -27211, -31070, -15142, 7577, 20007, 18352, 10613, 12491, -3120, 8549, 20015, 18169, 16676, 8017, 2345, 10636, 8419, -6006, -29412, -20399, -3425, 10106, 6163, 1660, -1838, -12541, -6222, -15315, -14460, -15157, -15251, -1643, -2168, 3270, -5786, -1167, 18050, -1744, -9508, -14833, -19929, -17228, -3493, 3913, 13951, 14236, -4447, -5982, 4936, 18300, 25868, 23800, 16285, 8340, 3657, 7187, 10302, 4568, 15102, 24860, 16410, 14831, 17006, -3844, -26987, 920, 16946, 17456, 6774, -2663]
14800b663j6631k486J2059J0769J637j4878n597l64n317q735P581J4372K6847
14787A6594N662L658j5250j5239J2219J1035l006j1105j3624J4583j616k8702
14775b4791J232K3860R074p13J0847k037j3148r437J3220J4686L136q454q797
14762H678k127L588j3848J3582J5074q271j6476j3266L420L0637O13k0625j3551
14749a2572J707J0207q56r060j3990j841P315J5324Q061R517Q312l014j880n509
14735A1721m450r84p238R819j3555j6681K013J0608J2957n410L944j5271q20J0337
14721c010K331P591J327k4248j0553J0439P528j3901j2093J4136M796j0391m214
14708c0262P683J3274r495J6489l113j6014j1750J3834n246m752P620J0935K680
$$ y = [-2663, -19294, -21780, -9721, 1048, 2685, -12193, -17790, -18154, -23471, -32206, -24625, -10253, 16594, 22256, 25914, 10664, -4575, 7644, 18679, 15673, 4568, -9056, 5527, 3911, -24791, -23559, 301, 9375, 8662, 19509, 17472, 4324, -5113, 8107, 22793, 25929, 17475, 8678, 6551, 10139, -3709, 9873, 24947, 16676, 200, -13066, -9646, 20991, 21604, 979, -12572, -10865, -658, -1514, -10574, -24564, -26405, -19090, -3766, 4295, 13812, 22124, 19110, 17230, 11721, 7271, 6287, -951, 8868, -4687, -21368, -19355, -8747, 4210, -1200, 2744, -12527, -13347, -3010, -679, 6912, 8239, -16009, -26562, -16123, -8595, -22496, -34589, -20453, -15657, -26048, -30262, -22579, -9305, -18800, -2311, -5424, -21438, -33188, -19354, -24600, -29352, -21732, -10797, -8117]
14695h117J0635M501J1384n853N587N803m880j2621r306l594L687K3846l83j6512
14681D177L118J1904l238M641Q281m930j3716J776J3487r252j3299j3665m351
14668a5067j31n519N673k319J3340K0618m530q033j5539P543K0111N188N209m583
14654B1961R3R365k894j7967j2980m787J539j769j0645j5596n499J2367K0404
14641f408K180N589P143L975j4183o716L348P30j690k877n672J4954K7682P175
14627C5230j5758j7697k156p039r597J957O977R978r39k0973j4166J168Q854Q329
14613a5832J025j9565O215o718O452K513o023N34J8195J499l46o510Q100K1529
14599A1068R829O954J666o098j0969j1484P711R564J4910K642r708o855r384q013
$$ y = [-8117, 2518, 7019, 18403, 12550, 18137, 23940, 19060, 6439, -2867, -6461, -2774, 21072, 20689, 4177, 7295, 19199, 15961, 20602, 28883, 23953, 10237, 12013, 25500, 16248, 2949, -10716, -15067, -15198, -20717, -15044, -17363, -4023, 16595, 12065, 4032, -11507, -3964, 16147, 21335, 26544, 21961, 22054, 31419, 28525, 10558, -2422, -7209, -5670, -7439, -18084, -33680, -39179, -26812, -6408, -4228, 1361, 8504, 12479, -1704, -8420, -5072, -4342, -6032, -8909, -14581, 373, 28055, 35230, 19472, 1775, -381, -7420, -17017, -15060, -8083, 1895, 956, -20017, -34183, -33015, -24161, -15832, -14807, -34372, -28157, -34875, -28423, -25910, -31933, -31399, -13204, -11705, -12051, -18561, -10461, 11068, 20897, 27851, 29517, 23419, 12450, 966, 8677, 18241, 33151, 35793, 26085, 19230, 9846, 1833]
14585A833o255n485q035j2702Q03J9496j4051r123K8252M212j3558m718J8778
14572e53J1137q980k884Q721K1042Q522j7688k3740r884J7368L049j4774l774
14559a2438K623M974j3946n454O020m946J7017J1275K552J5696L249r50L99j3824
14545A2247l106n540P073r558o217K7616j1351q501K425m649r2o616K078m389
14531h580N86q057r92K8995J5132j0239o093q904j1844p473J3949Q128l1711q789
14517c5892K2869J2580l044R958q204j3571n365J9154K148n338J8972k070q387
14504C810P351L088l524p561j1467r317O529j858J3389J8076O100j1714j4913
14491b011O952R021P238j9988j1473J749q682J0510r311r927l748M55J0397J2981
$$ y = [1833, -4422, -9907, -17942, -30644, -29841, -10345, -24396, -33519, -5267, -1055, -14613, -19331, -553, 10584, 1604, -1280, 7441, 28483, 37005, 19317, -4423, -14307, 3061, 6110, -8664, -12438, -9815, -4841, -18787, -24241, -18221, -23167, -6150, 5125, 7677, 23373, 26622, 25672, 26071, 12247, 9141, 3601, 10674, 1116, -5101, 22515, 11164, 2663, 5088, 439, 347, -6269, -4191, -8580, -7994, -16051, -17043, 11952, 27084, 16845, 10752, 1848, -9996, -17469, -3520, 4608, -27103, -35892, -13023, -443, -3487, 6471, -1733, -15304, -20669, -1515, 633, -4705, 14267, 12197, 3810, 11161, 14249, 10725, 3164, -8303, -17620, -11091, -12949, 440, 18516, 24616, 12902, -2011, 4941, 13962, 21200, 1212, -10261, -8512, -17194, -6684, -15995, -25922, -29670, -29215, -18818, -5837]
14477e837j1117j7173m930Q933K0981K4843J7020q354j5349j8421k937J63J5704
14464C526L054L282J5582N817k1575j5361l559k571J7263J5918k706j7248j2152
14451a0730R300K3422M478k543o089j0480j4843n908k49Q730m95J4407j0266j58
14437a424J1341M547L38j364k765j6202P833L7308O34r433p403M592M649l928
14423B8723k804m952r748k844N45l864j7725j4991J8660Q653o623j2313Q59o63
14409a9087J3394J6664K321j3026q96L907p986j462L193j564N96N634R469k533
14395H624j5599q543P895O456o02k407J1838N333L496r934L801j563r12O07j2323
14380c833m543J3024J2055J777l68j1295l147M812k237k3347J181J2971K698m305
$$ y = [-5837, -16954, -34127, -39057, -30124, -9143, 15700, 32720, 24366, 9017, -9404, -12341, -12178, 3526, 6580, 9862, 25444, 31261, 9686, -5675, -9234, -11805, 5458, 21376, 18670, 1422, -10730, -1430, 21992, 26470, 23927, 17838, 7358, -7485, -13393, -13642, -4912, -5407, 9000, -1266, -1424, 9917, 14464, 14802, 13438, 10673, -5529, 2304, 39612, 40246, 30813, 23410, 28002, 32651, 28723, 25919, 20967, 11219, 8375, 8920, 5056, -12669, -27660, -9000, -347, -6970, -19283, -18424, -19087, -5693, 10971, 13292, 266, -630, 3277, -4709, -6171, -2978, -4542, -3946, 1688, 11157, 8624, -6975, -15518, -7623, -1167, -1769, -4176, 7662, 12995, 16491, 6557, 10358, 8795, 7883, 8490, -3833, -8376, 4648, 16703, 18480, 18112, 6817, 3670, 8482, 6245, -17102, -15921, -2950, -252, -4557]
14366d557k23M68j254J0578k381j946Q631q232j1026K75n507L913J1658K022j532
14351H87J937q504p920j5723J4635N185J1160J342j453p493j317j1713j3671P615
14337b5033J1387L177J1699R027p027k15O484j128j468q283k039N712n621l385
14323f713P8j1036n441O016j931R951M753J704j9294j487l290o135P799J2030
14309a2996M219q20M829R646R452P995K2046J358j3379q741J284k097N603n893
14295B2506j1832q022Q001n166J3151K0488J433J451J45J545j1987l2451q652
14282i390o994K965K2513J2845M898k2020j1581o985j1124K2175M36j2904J0117
14269e049K782n894k822j2824K311J0704k32J2844K228j8450K50J9599m064j7553
$$ y = [-4557, -4780, -4312, -5566, 5012, 2631, 685, 9316, 1084, -9942, -9667, -15174, -11261, 397, 2419, 887, 2824, -5680, -13600, -29323, -14688, -9503, 1657, 2999, 1546, -5947, -7264, -18977, -32648, -25033, -13646, -10469, 1230, 10257, 3230, 3015, 9499, 8371, 6903, -1380, -3419, 2293, -3328, -6713, -6635, -17671, -23112, -17096, -19027, -9076, -4323, -2619, -21913, -23400, -26690, -32825, -25026, -12996, -8777, -9597, -4768, 4878, 14330, 22325, 44371, 45729, 32350, 23609, 24893, 22796, 28399, 22506, 10674, 2652, 10653, 5487, 18638, 39126, 40559, 42010, 42155, 43700, 31713, -738, -9390, -16384, -13419, 9094, 21939, 26837, 4817, -6764, -13749, -24873, -2698, -2262, -15166, -5049, -2267, -8161, -10983, -23807, -21496, -10792, -11024, 1820, 4048, -14402, -14152, 5447, 1383, -16170]
14255a6170J7833Q552k746K0237K482j1709j0298j4302n824K1256J737j157j018
14242H873m186k641R485N749k150j0157l272K372O281m33P617j5335p099k830
14228g726J6145n8j2400n178O500M749J1751q260j632L111R078q032k0701J890
14214a0763N524K432K674n160J252J3069M984m091L244J7104N205K853j9582j2989
14200E756o583k275k132Q265O26j760J710M936k771p468M106J1730J5937n941
14186B4136j6411J6r48q894Q618P066M971J877j5063j7422m871l732p635K1845
14172f447J1313p330J2412N324J0301p878k1592P522P526J6479O988j7381j3251
14159C986j0623j4147L398K846J0862J5255p856O899l576n283m032P106m699p853
$$ y = [-16170, 1663, 10215, 7469, 27706, 30188, 18479, 8181, -6121, -11945, 9311, 11048, 9891, 8873, 4687, 2046, 11531, 17280, 15130, 4973, 1701, 4073, 10354, 9921, 17538, 2203, -4896, -7726, 8419, 8361, -4039, -9217, -2717, 2032, 13783, 5523, 3891, 7002, 16080, 8048, -12653, -10763, -5239, -2807, -133, -5293, -4041, 9028, 14012, 9921, 13165, 30269, 35474, 38327, 18745, 5756, -827, -3102, -5234, 3031, 3657, 1897, 3607, 8543, 5772, -1696, 2410, 14140, 30077, 24136, 7725, 7741, 6793, -2101, 6517, 13583, 18554, 20431, 5368, -12054, -16925, -20657, -28292, -6447, 4866, -2464, 9948, 15272, 25573, 17695, -3897, 3625, 11151, 27630, 34618, 17237, 3986, -6637, -20784, -17386, -14540, -3678, 11577, 3721, 10620, 7044, 1761, -2271, 4835, 136, -7717]
14145g717M083J5751O047j3090j121j1388K518L561L185O022K884J4776J3025
14132C8536j1958k5812O599J5928Q083l610o301j9893j0721o85j0243J6240j381
14119e218r018l112l261R311m072J768J6684J4234j2779r361M805J1420k9488
14106a8087m206Q070J2494Q806j9585j6182n996m506q421M420p525J2906O131
14093c1681K01J7025M548o086O669k687O955L269J3512L873p613j8056N978K144
14079a949M652J213o205J0242R609j6678j0897k351M747j2124j2851P944J7324
14066g324M509J0635j124Q910L669O648j1836p7K2106J7424j3993L828N167k6034
14052B2508j1861j6567j5555J3567J0617J524r692p194J3410j3314j2983O424
$$ y = [-7717, -3634, 12117, 18164, 5074, 3953, -7435, -4917, -1356, 1829, 7851, 10735, 25511, 38536, 26578, 766, 7365, 23293, 31376, 27766, 21465, 1572, -9149, -9834, -20077, -3837, -5218, -14236, -17348, -20609, -11298, -15370, -13602, 3082, 17316, 4537, -4824, -19, 11401, -18087, -22293, -14223, -1729, 7077, -12508, -28690, -34686, -39192, -47613, -43193, -50718, -37812, -31681, -31480, -14455, -9907, -15993, -9324, -12011, -5056, -1787, 11725, 15598, 7985, -10071, -4093, -1949, 2703, 3916, -2289, 7953, 17562, 884, -10013, -12364, -7617, -19741, -32592, -24648, -7324, -2815, 7820, 6696, 15606, 19275, 25923, 14087, 14010, 36116, 53540, 39547, 43375, 48542, 22508, 10647, -5920, -21475, -7908, 2709, 4233, -5459, -12653, 757, -12557, -25540, -19116]
14040a9116J1591P389n641J6070L319P511k473K214j0095j0827j0755j548j1348
14027b3709J883Q738j2274O532O425p400K0183L272K683O919n775J289O700l141
14013A2325k603N578N684p0j6507j1033Q685j729j792J456j0263l601J2601M11
13999h58J461j1557l785r77j094J6072R942k125J4918J5828Q468j5819k7587J6753
13985A9640K3074j2712j0588j031j4957j6119J0644J0288L384Q850J4892q426
13973B6939j7780j3518m889J0188K395N33o940J8335K0797k6396q806J1092J5462
13960B7412j1759j0542m434P968P207J2794Q818j585k0924p829k59j971m021O73
13946A548Q250j3539o8p44O683r142j4043J896K402R1l039J1730N281M613K124
$$ y = [-19116, -7525, -136, -5777, 10293, 13612, 21123, 18650, 20864, 10769, -58, -10813, -12361, -23709, -21826, -13088, -25362, -18830, -12405, -19805, 378, 3650, 6333, 13252, 7477, 8766, 15466, 12325, 9722, 15300, 20984, 20914, 4407, -6626, 2059, 330, -1462, -6, -10269, -13870, -1269, -858, 603, -10954, -14739, -15716, -16810, -738, 9204, 7079, 21997, 37825, 46293, 30474, 2887, 19640, 42714, 30002, 19414, 18383, 3426, -12693, -2049, 8239, 11623, 20473, 35365, 26939, 9159, -4359, -9248, 940, 3335, 3868, -3072, 15263, 36060, 9664, 858, 11950, 27412, 15653, 5111, 677, 8645, 15852, 28646, 37464, 35879, 14955, 7126, 6867, 4896, 875, 1548, 9798, -3741, -3809, -4553, 2130, -7012, -21055, -19159, -16757, -16666, -19705, -7975, -2694, 1919, 4043]
13931D043K495k723o852k049J2493j591M942P987p213L227M506K700k239j3321
13917F405j380q889K4028P546n164r19j245p209L604J326J106o426n315q860p753
13902i145J42M764r664k936J182j479J48q865P573J9389M838n476q703O900J0691
13887I359j7462o671J3297J0726j991j5754M354M601J9256K0236j1296k1640l0800
13874b3785p968J8434J9315m372j066Q439P074r964n333j450P145L177j7858l51
13860h563M090L585L619K30J235J9562J842j202k027o315N548l366j7667q613
13846h042Q376P418J50Q6J042k5567j6035M653J8196K779m042p700j3397J464
13832c0619Q309J0320K4649o79p253n897J6841J171j022Q090R13j0881j0077j6330
$$ y = [4043, 6538, 3815, -3037, -5086, 7407, 5816, 10758, 18745, 11532, 14759, 19265, 21965, 19726, 6405, 5025, -3864, 20164, 27710, 22546, 21627, 20382, 13173, 16777, 18103, 19209, 12783, 7468, -1392, -9145, -9003, -4239, -13903, -16839, -15657, -17136, -16988, -25853, -18280, 1109, 5947, 471, -8232, -1332, 9359, -8103, -14774, -1477, 9249, 7258, -8496, -4142, 459, 19715, 39951, 28655, 7015, -23785, -31753, -13319, 5996, 1624, 558, 8997, 16071, 6107, 774, -676, 6469, 9646, -8212, -8563, -4473, -888, 2731, 2961, 4196, 23758, 25600, 24398, 22371, 16056, 21604, 18238, 571, -8042, 334, 7752, 7902, 7988, 9030, -16537, -32572, -27919, -9723, -6944, -10986, -18686, -32083, -30619, -22310, -11990, 12659, 11980, 4727, -1170, 15671, 16842, 15820, 23910, 24823, 13942, 3865, -12465]
13818a2465j3060K147n441R396L838N794l395M755M327J9857j980j1637Q393O775
13804A7304n279K117l102j2130r588j3502p477P292L717N959R835L832j3166K962
13790a1226J2843q739j2498J3519L486j2407N843R375O364R251L485j3154p203
13777a061L371M676J646K425M462j1125J5916p205l997M811r249p721N538M512
13763F999M514q503p860J789j3642P449K3727K754O311l968N613j0961o310O122
13749A4034J692O060m239j0063j3494Q391N486p466j0899q56J4030q583j777j520
13735i204J094J9754J1292k980k218q967j5243k600m649O339R687k320j0235J788
13721h462P442J367r956R597J2191j3343J0987N036j3655r307l476O686N864n843
$$ y = [-12465, -25525, -23378, -28819, -19423, -15585, -9791, -13186, -8431, -4104, 15753, 13773, 2136, 10529, 17304, 12025, 14142, 11040, -1090, -10678, -24180, -31657, -24365, -20648, -14689, -4854, -1022, -14188, -11226, 1617, -7122, -19620, -6101, -2615, -15022, -9179, 196, 6560, 15811, 19296, 6142, -1061, 2310, 6986, 8632, 11057, 15519, 4394, 20310, 13105, 9108, 13919, 4670, -3051, 2487, 6999, 11513, 3010, -4850, -3061, -16703, -9254, 14473, 17227, 23538, 19570, 25183, 14222, 7912, 14034, 15726, 21786, 17547, 7484, -6010, 2381, 7867, 401, -10498, -11354, 2676, -5907, -7684, -9204, -8110, 11644, 22936, 19956, 17738, 8771, -6472, -9072, -13721, -7382, 2305, -15, -10250, -8462, -1020, 347, -9609, -12, 12179, -1164, 9823, 14859, 1204, -8103, -11579, -4893, 971, -4872]
13707d872N865K362p800q287j7575O569J6948m857m903j826J6074J2226o056m478
13693f10N36J266l606K370P443j0448L808L59j6381J5666P88l795j2191j916K3735
13678G024J3557q313j223o468N41N223P401q976K299N34r414l58K382l481J152
13663A880Q988M585J2575j354r297j4174j2195j2051J06J7897k097K348L962K608
13649C781j745M190J1570Q22j9560m474k476R153L599j229J2147j0395M433J3068
13635B2884P031n810j2379n159L294p353k748m728p43j2188j369q103j2678J7732
13621b2317L2964J5917M495p616j9785j2380q562q625J170K7774K501L15j4283
13608h432p289Q983M983K983l351j259P773j1032Q219l680k246j0581J1095m597
$$ y = [-4872, 993, 3355, -4445, -12732, -30307, -23738, -6790, -11647, -16550, -18376, -2302, 9924, 3868, -610, -74, 1192, -2414, -44, 7399, -3049, 759, 1118, -15263, 403, 1191, -2604, -14795, -16711, 7024, 20581, 12268, 11045, 4577, 5118, 10341, 17742, 8766, 11065, 11599, 2185, 1827, 4209, 728, 1880, 10868, 15453, 28028, 26674, 17377, 3203, -8992, -21043, -20937, -3040, -5137, -2789, 1173, 3781, 2036, 6226, 17796, 18618, -942, -5416, -7892, 1261, 4860, 3631, 15778, 5383, 9816, 22884, 29915, 24105, 11726, 6567, 9861, 2508, -240, -4968, -5711, -17899, -19268, -27371, -40049, -22317, 10647, 26564, 31059, 23443, 3658, -8722, -17284, -25909, -24739, 3035, 5536, 5851, -8432, -15721, -6738, -1755, 1228, -2123, -3382, 4391, -6641, 1578, -2102, -4348, -14929, -3834, -8431]
13594h431K135k455p454J1356J6367m852J4960L192o547M038N87j3510J370L837
13580A4593j1871k1869p28j063n000J0784r411M95J9476K3629l78k4996j2232
13567a8571Q653L019m345R692K318j6683j2879J5672J7988J2408K928j2895j5453
13554h148J3054J4643K188n589L682J1899n336o349N051m935j5775o156L226P108
13540H563R632J0726K175o265j1113k0767J5635J8735k943K627q113j1060p438
13527C94j724J906P780p607k1122j7695N318J0766Q416Q24m130O783P211j622
13513d502K1300J3651k436k9069k5289P920J1569k637N624p158J819P359O536
13500D687q197p873O370J0275j0128M718j460j0313R236K3407Q200p441k5179
$$ y = [-8431, -6296, -8751, -16205, -4849, 11518, 6666, 21626, 24818, 18271, 22309, 22896, 9386, 10756, 14593, 2722, -19147, -19875, -20938, -25938, -15154, -24565, -24070, -4594, 19035, 18657, -6339, -18571, -9918, -6899, -11244, -1552, 766, -15917, -28796, -13124, 4864, 17272, 20200, 7305, -8148, 4906, 19549, 21737, 16148, 19830, 31729, 26393, 20044, 25095, 20160, 4385, -1771, 1455, 8563, 18195, 28921, 31096, 24831, 13718, -7049, 8586, 27321, 24378, 27005, 18892, 7832, 394, -1330, 576, 8356, 749, -20373, -38068, -32750, -21984, -13568, -12744, -16874, -10091, -2880, -4502, 16798, 30449, 28013, -1056, -26345, -18425, -6856, -9493, -3869, -11027, -9208, -1849, 4687, -3510, -11383, -5013, 5262, -4866, -148, -1608, -11921, -2685, 20722, 28922, 21481, -3698]
13487c698j0351O301J3785j3987j8092J0085J9252l213j354k417q691J3396J6724
13474A7740M042k600j660j3479j4420k437m479L902m697r772J0858K0355k380
13461I73q262J5438j928k421L439n11j5824j5157Q208m370M139n664N53K073K364
13446a6950n597J1870J2009J3984j3314j5102k429J365l423m079l945O777Q187
13433a0647p831R51M935r91j187J5797N831j6103j0702N097J8662L150J0281o142
13419A1101n79L171q688p058l823J030M307L804J668j5823Q88K762P595J2764
13405A3119M940j0476j436k535k443p157n115j278n032J87Q090Q142n389j0732
13391a7115l478l350q372k049P589p755l798n175m538L4100K6853j658j0738N769
$$ y = [-3698, -14049, -7748, 6037, -7950, -26042, -15957, 3295, 82, -1272, -3689, -12380, 1016, 17740, 21782, 19182, 17522, 4043, -10377, -12814, -17293, -13391, -18088, -27860, -17002, 3353, 973, -7289, 8149, 6221, 3800, 7239, 6728, -9096, -24253, -16045, -20415, -16276, -21940, -21387, -19314, -16950, -22547, -10677, 1332, 15316, 2002, -13100, -15529, -14164, -17587, -21666, -25611, -18834, -10647, -18478, -17527, -12592, -13583, -14770, 1027, 6858, -9245, -19947, -14850, 3812, 6962, 17243, 11101, 10522, 13693, 5005, -2053, -5876, -4846, -539, 3265, 4933, -10890, -10002, -7240, 355, 13119, 18059, 7583, 6147, 3612, 1169, -5988, -11103, -12381, -17413, -17226, -9136, -994, -6383, -17115, -20593, -23943, -32315, -34364, -26775, -34530, -38328, -43503, -48041, -13941, 12912, 11254, 516, 6285]
13377F285J0079J424j7211k1929l265J6612J2715J3994J0189n493p756n286J0148
13364B0506P541k0012r666M095Q774q119L398O961K912O028L066L618o734q012
13350A4356O386R344p176j4103j826m050j449J7612p977l923n884k0604j0512
13337b9806J6008p200M654P765K959J3346r333L86O926O84j439k0501m103K2835
13323C181o167q630J4559r866j0490l406J1611O579L487N493m0K0697j4996l2354
13309b0342j354N775O137j2704L786J7817K0381P801k7603P40J2835l749J0373
13296A9893K171n061j0883l118j6102R972P903k596J4049O630Q761o927l402P482
13282B8772J3114j4742j3750K010q178p579j1759M034k79J8262J0397N322m190
$$ y = [6285, 16364, 17788, 577, -21352, -24617, -8005, 4710, 18704, 28893, 23400, 15644, 10358, 20506, 28047, 8035, -1631, 2464, 11238, 3119, 6517, 13478, 16390, 22418, 25484, 29102, 22368, 14356, 20742, 30086, 22910, 8807, 6981, 2931, 1482, 19094, 11117, 7194, 1310, -19294, -29806, -13798, -20998, -16344, -8579, -5620, 7726, -1607, -1221, 5705, 6389, 4950, -15551, -19654, 3181, -2986, -11616, 2943, -6923, -17413, -20819, -9208, -2629, 858, 6351, 6311, 27008, 12012, -20342, -21696, -15921, -9784, -22488, -18702, -885, 19496, 27297, -306, 434, 13269, 9520, 19893, 22064, 17003, 6120, 3002, -13100, -3128, 4775, 2179, 16228, 22858, 31619, 24692, 21290, 28772, 41886, 27144, 13394, 15404, 7226, -353, -12112, -8078, -8357, 9905, 20302, 25624, 21434]
13269B1434K118J2213j0160j7866n25K3676q91l347m968R535o05M88o042J4410
13255C9470j197k0125j8172j1983n386J38l518P288J0229J6041J5605l34r495
13242A8561M63J8417m510m248j0601j3288k4523j2093J1457J3050J6832N197j1995
13229B719k328j2961K331j5901p361N292L857K199N59R146o015O683K5462J1548
13215B5230n326k2021o22P16K741m958M825R18j0709M971K668j434k104N567J0570
13200A1032p547l28j2412J335J1006P85N934j283j1553l250k918J4720N260j5048
13186d267J970l331J0735N935j3765n474R429N079J3104J9530l328j3124j2019
13173A0474p551j0339Q071K7849K679j8800m282Q680J0749j5271j6445M184L837
$$ y = [21434, 23552, 35765, 25605, 7739, 7214, 30890, 29999, 26652, 21684, 31219, 30614, 31102, 25060, 39470, 38273, 18148, -24, -12007, -17393, -17255, -20773, -13485, -3256, 12785, 28390, 28056, 18561, 19024, 37441, 32931, 28683, 18082, 4794, -19729, -31822, -20365, -7315, 9517, 14714, 2719, 391, -12570, -10239, -26140, -33501, -28209, -24352, -22153, -21594, -12448, -18463, -11780, 13682, 25230, 19904, -2117, -2739, -2023, 718, -4240, 585, 1503, -9206, -4235, -1567, -3001, -5105, 462, 11032, 3485, 3157, -9255, -7920, 3086, 3871, 9805, 8522, -3031, -6281, -9199, 5521, 10781, -4267, -2297, -5628, 5107, 11042, -2723, -8197, 1232, 6311, 19415, 38945, 35617, 22493, 10474, 2923, -7416, 655, 28504, 31183, 12383, 8101, 16781, 27530, 12259, -4186, -2, 3835]
13160C835j1901j92K0861q169m956j0452p305L212o942n127K3876J5906j8377
13147e731j8058o257J3725J0882J2737n516j3197n379L330j0070K625Q45K2494
13134B430Q894Q377K500J2681o89k2241l051k117k1693K083K3597l048N286q516
13120D493o699P161J3213Q125j2076j2046o419K503R142O292n051N176N190m123
13106A4881K012n831L195J161q219j8038j0826Q360K6418J5863j3915q280m597
13093B184L445J5349k199q578m802l881J743R209M435m585j2388J1008k330M816
13079A3426o595j2376j854J4191R511p521K786j3202p819J4429L309R857J3795
13066C1937j1708j3420J514L873j637J0441o993j6432L193N236Q433J415L203
$$ y = [3835, -8066, -8258, 12603, 4434, -522, -10974, -18279, -15067, -22009, -27136, -3260, 12646, -5731, -23789, -30046, -16321, -5439, 7298, 1782, -11415, -16794, -13464, -23534, -20909, -20064, 2430, 11324, 19701, 22201, 34882, 34193, 11952, 8901, 6784, -14909, -12826, 10771, 7723, 13009, 4493, -2206, 4955, 18168, 26293, 14217, 2171, -4248, -1745, 7397, 13689, 8638, 13814, 19004, 14881, 16893, 11062, 14257, 15418, 7199, -10839, -21665, -13305, 13113, 28976, 15061, 6781, 2184, 5629, 20978, 18779, 10201, 5399, 1518, 3261, 12470, 16905, 12320, -68, 10940, 8610, 13426, 6831, -5545, -7399, 6792, 16303, 8782, 11568, -1634, -9453, 4976, 8285, 18142, 31937, 20229, 6809, 8323, 12196, 10559, 21000, 14007, -2425, 768, 6004, 14437, 15852, 19055]
13053A9055j7882q858n246r354J1745j442K5598P692N371J663l276m919k2928
13040b781j3824K0096K375n39k7038l552K0590K0184l816j591J7055L02j1341
13027A6120l5p260k000p508j2779M892R42k094J2394n882j4057J2990J3107O909
13013A5739q169r97J554j8731J0464R550J803j6655j5423O140J2609l215M785
13000e46J5234o677l421m613j3135l802K925k976j451j477K403J0927J4958J0138
12986A8487q471K185p388j9171J3592o630M471K699R665P46m589k434O535J1279
12972B0976P296k604P739j0503k9102r076M55J6489O213l946j0142m614q656J7051
12958b424L590J4525J520O748m825j431j934L616j1296o307P126l134O259J445
$$ y = [19055, 1173, -7685, -12931, -22285, -10540, -11982, 13616, 21308, 26679, 28342, 25066, 20147, -2781, -16605, 3491, 5866, 5327, -21711, -25263, -4673, 15511, 11695, 10104, 27159, 27461, 16120, 16085, 8825, 6825, -683, -13462, -8570, -7628, -9722, 2672, -3210, -17267, -4277, 8830, 15739, 7570, 6573, 8127, -10604, -140, 9410, 11213, -5442, -20865, -14725, -2116, -5331, -546, 14688, 8011, 4590, -23, -13158, -16960, -14035, -17011, -18462, -19939, -17536, -6609, 8349, 18487, 10016, 12201, 4813, -14358, -766, -7396, -2925, -226, 9439, 10185, 5596, 3162, 9697, 20976, 28272, 25668, 33407, 22904, -6198, -15274, -14819, 1670, 7883, 3937, -6205, -10819, -19475, -2424, 1166, 15691, 17211, 23959, 19134, 17703, 15769, 19385, 8089, 1782, 8908, 5774, 12033, 13478]
12944A3478J720M54k023p215r488J7069J1664n657k2221l098k381k582J1841m340
12930b779m077k0804j2155Q807N121O859J5948p950J6460L583j0392K1554N537
12917B5712j3115j0901j4000m84J49J6079P361q807R475r985j6189k660M047J6044
12903B726J4796j0670j9335J4658j3590r03L380N696l107M886P310O591J227K421
12889A6086m007k8411q893Q78J4557J4101J2836p696j8938M391p816J1699K4017
12876B2804J716k0469J4149J2305j6995J02j7295j4655R66m86l421R201J7366
12863E288Q281j317M607K705j736o775j3313j1262j9952J0725K67K1206K8155
12850B6879J883M38j5137l8340j5395K2221J4195o466M316J0449m412n790j0590
$$ y = [13478, 15198, 15652, 13629, 6414, -3074, 13995, 25659, 20002, -2219, -5317, -7698, -10280, 1561, -2779, -6856, -27660, -39815, -31008, -25887, -19028, -3080, -11030, 5430, 9013, -1379, 20175, 25712, 12597, 1696, -12304, -12788, -12639, 3440, 10801, 1994, 11469, 1484, -14705, -17365, -13318, 2726, 17522, 6852, -12483, 2175, -11415, -12318, -8938, -3242, -6349, -1463, 5847, 12438, 13665, 16086, 12079, -16332, -25225, -24347, -9790, 4311, 17147, 9451, -9487, -5096, -12912, -1213, 22804, 24520, 4051, 18200, 30505, 13510, 13612, -3683, -18338, -17372, -17858, -21279, -12078, 5288, 13569, 12252, 16859, 19564, 17828, 11053, -2260, -13522, -33474, -22749, -22482, -1276, 26879, 28762, 29200, 14063, -24277, -39672, -17451, -3256, -9722, -5406, 5043, 631, -5159, -15749]
12837a5749j0455j908L805Q550Q499K0991O808m930M405P252j0021K063M605j3131
12823A0784j3922N008P636j0980n428P502Q567J6745m862j2145l158K817Q642
12810A7206q72o943O816N043k2338j7308M869K2762J1285r75K35K866j5343l134
12796D169q425n671l118J2049K966k625k226O913J058j3950j4945L111K3003K667
12782D976M624J6561K371J3205j641l2286j5010j789O632L03J3409N837k22K299
12768A9269j0729j2219K375L954L622m012j2209o628M415K4463O077j8844J292
12755H26Q314q672j1521j005K701r513R142L68n766L036O901R438L220j2071l239
12740g841J1849J0298j5394L826J3225j1382j6170n153J967M191J8146K186q200
$$ y = [-15749, -26204, -28112, -24307, -15757, -7258, 13733, 20541, 15611, 20016, 27268, 17247, 19310, 23915, 10784, -3138, 1870, 9506, -1474, -6902, 600, 9167, 25912, 21050, 8905, 5747, 8564, 17206, 16334, 9391, 16207, 21250, -1088, -18396, -13527, 9235, 20520, 19545, 19780, 22646, 7303, 4169, -4256, -9927, -13045, -996, 1970, -655, -2881, 4032, 5090, -8860, -23805, -20694, 2309, 4976, 9600, 26161, 28532, 41737, 40096, 7810, -7200, -8989, -2357, -2054, 11355, 17192, 16970, 19269, 8540, -3679, -1304, 2650, 6272, 2260, -9949, -16577, -12162, 12301, 18378, -466, 826, 9140, 468, -11053, -12058, -9357, -18870, -9728, -9360, -15126, -12090, -5189, 4249, 7469, -4602, -7841, 4008, 14306, -1088, 2738, 15963, 4581, -11589, -16742, -14775, -10584, 7562, 9748, 1548]
12727A548n184j4072r02P230J808R243N493J3201N031l241j7384Q956J9478o157
12713B5048j2606M329l208O695n672r206n086k0686J3498o713k617J7175R376
12700A0327j659J418J1389r720r178k962p270R57l823Q900j0209p125j4759l468
12686c7182J5839J3848o721p417m287p748N371P688J2329P071l026l6q79M182
12672i68Q46o619l071J2722j7349l851j947q372K1010R950K968j133n909l119
12658d842n11l237J0297M986j3893j5168j0609J0213j187m752J1389J8484k641
12645a471j356j6526m054L382K4442L251N298L197k2322K834q379k791J905J1345
12631a245J3828J2503n249K093P636j5028j0001J526M629J815O671p140k021m933
$$ y = [1548, -3636, -17708, -18610, -11380, -9572, -329, 5164, 18365, 23396, 20155, 2771, 11727, 31205, 25048, 12442, 16771, 13563, 20258, 14586, 5380, 294, -20392, -6894, -13607, -16224, 951, 10327, 8668, 10086, 21475, 11755, 2577, -385, -7655, -6698, -10521, -1621, -11830, -18955, -33714, -37182, -21343, -7495, -14216, -21633, -25920, -33668, -28297, -20609, -8280, -1209, -4235, -4271, -5150, -968, -122, -6741, -9812, 2910, -14439, -18290, -20237, -28609, -7599, 2351, 5319, 4186, -1723, -4842, -5353, -8590, 1707, 6693, -7200, -22368, -32977, -22764, -23951, -28703, -17314, 1170, -1471, -2827, -19353, -23407, -20025, 4417, 7668, 12966, 16163, -6159, -3325, -11704, -14495, -12590, -1245, 12583, 25086, 19837, 21930, 29566, 14538, 4537, 6063, 10692, 12507, 19178, 12038, 10017, 5084]
12617E084K081P00K694J289J040K240Q079r246p651J665r309K161k852r360J693
12602i692K490J6391J2214O87j0981L885k588K173j2811m488k684J5857P743p189
12588A1007J009j4023j3427m904L121K575J5169K411j1685Q0J2507J0206R418
12575B3464J4437k056p211J084j259R821m879j9054j0769k260J0231j170l238
12562G141J3898K762j7540n952j3272R349J0998p933M627J2566K451k416p294
12549I385r163R152J624n985K926n716j1589J793j850k229o604q979N956J2215
12535i064J593J4967O213M835o907k0341o235K6610J574k1072R386Q250P110K828
12521A9747J5473M329k5388m56J461P244j153j823J1941k055k4104j2184P929
$$ y = [5084, 7165, 7865, 10559, 11848, 12888, 15128, 23207, 13961, 6310, 7975, -1334, 827, -2025, -11385, -9692, -7202, 9189, 21403, 22090, 11109, 14994, 12406, 14579, 1768, -2720, -5404, 10453, 18196, 11007, 12016, -2007, -15434, -20338, -17217, -14642, 527, 2938, -8747, -8667, 3840, 14046, 23464, 37901, 35845, 28634, 29718, 28459, 38280, 33401, 14347, 3578, 1318, 11549, 10379, 7141, 21039, 23801, 6261, 309, -12963, -3614, 7384, -549, 4078, 16644, 19095, 16679, 9385, 222, 9374, 10998, 5013, 7939, 2223, -9366, -7573, -9423, -11652, -18256, -27235, -21279, -9064, -7471, 7496, 13709, 18544, 11637, -8704, -14939, 11671, 13245, -7827, 1559, 9809, 16919, 19747, 35220, 39549, 14161, 13705, 15166, 22410, 21257, 19434, 31375, 29320, 5216, -6968, 961]
12508I61p697j5097Q089M190O470N424l974L390K823J523j0551j1161q374N284
12494a8700J1034r24N421n362k264J1560J8664o458l217m781p204K725o534K903
12480c137j5079L801L0372K3202M934j2207q718k5931k5084J8145J7076R518N487
12467B2379j2175J1520j8329j0468o449m701P883P6j024R810K469n571n759J7406
12453G067J0743j4745l820l708Q431J3202l696p705k093n022j336j0283r647J5470
12439g142J9422J0249j5450J690J8963r762O860q079j2385J136p035l926n173
12426a0632r386m558R52m80J1852J0200r996J3530j260J080J8297q311k8937K312
12412a5337J2405k190J559m77m071o90O238k107j0833P773M816m397j8577Q651
$$ y = [961, -6736, -21833, -13744, -9554, -3084, 2340, -1634, 1756, 4579, 6102, -4449, -15610, -23984, -18700, -7666, -8590, -3169, -8531, -10795, 765, 19429, 12971, 9754, 4973, -2231, 494, -6040, -3137, -18216, -14415, 15957, 39159, 44093, 31886, 23168, -2763, -27847, -9702, 7374, 16892, 22379, 10204, 21724, 3395, -7073, -13522, -18223, -10340, -10264, -11288, -1478, 991, -4580, -10339, 7067, 17810, 3065, -755, -4463, 3968, 17170, 13474, 5769, 3676, -1346, -2682, -12965, -22612, -7142, 12280, 22529, 7079, 8769, 27732, 17970, 24830, 16751, 4366, 5502, -1533, -5459, -10632, -20018, -24576, -23624, -24104, -12252, -2052, -12048, 1482, 222, 1302, 19599, 11288, -17649, -15337, -2932, -5122, -3563, -4040, -8111, -8801, -2563, -4670, -15503, -7730, -2914, -7311, -25888, -17237]
12398a7237Q439L377K047q066j4261P084K165l801J2561j0368Q02l995l69j865
12384b3487J0781k273p764K531m7j5054r0J6404J0360P587j7382N240J2956m90
12370g28m075j2343q448J7527J3493j144N523l812r015K358M32n178N597m93k0260
12355b0566J0636K757R375N091K171m308n533J011J0277l766o040L439R575p396
12341F723K065l758K230k155j1939r831N243L263J6292N334J2177J1180p130p341
12327B2353j5923m370n847L0M96p772J208J7133Q655j243j1413M212K0622J1320
12313C9461n303j2765k496j2438J035K859P882j1979J825O852O951M347o712j0657
12299H862P652l179l75j053j0728J6579p705o103R64m128j1404l428Q547J7644
$$ y = [-17237, -8798, -5421, -3374, -11440, -25701, -18617, -16452, -20253, -7692, -18060, -17258, -21253, -21622, -23487, -12706, -14979, -22743, -20212, -20259, -35313, -35403, -18999, -8639, -1052, -18434, -13194, -238, -728, -4803, -17146, -25594, -8067, 5426, 4282, 9805, 5993, -3022, -664, -232, -5410, 187, -306, -20566, -9930, -7173, 2202, 7293, 9464, 5156, -377, 634, 10911, 7145, 1105, 4544, 14119, 6723, 8788, 5030, 7260, 5105, -6834, -16665, -11422, -8159, 8133, 13467, 25644, 36824, 29694, 22353, 6430, 2060, -3787, -3757, -3261, -11033, -9825, 7308, 15963, 14720, 3307, 7519, 28141, 39461, 34158, 21393, 18897, 6459, 7494, 10353, 18235, 6256, 8081, 14933, 21884, 26231, 19519, 8862, 16514, 13335, 12960, 11907, 1179, 17758, 10053, 3950, 4914, 786, -10618, -14046, -5499, 12145]
12285A2145j448J507R49q262J1614k849j2625j5255L980J1435n91k619L048J879
12271B908J122m309L932M892K743j6626M63J1184J9743j1212q101r291k039R513
12257D922J803P376J0693j7308j4415L76K1676K6780j2614j5826m058l378Q155
12244A4182L091j4479n349R294l368j8866Q510o117k0588j050J7240K6173j0774
12231b101j0280p540j326P266L990J3171N217r097j0613J1968m253K005J651j2138
12217a2080k3659l100K7147O224n137J017m79j6049R176J4683O096j5254j3976
12204b5391J1764P545l296k009n354L425J4133K5374O614m532j1096q727p543
12191I07j8700J787K668P988K091J519P336o297p669p303R802J1012R342J641
$$ y = [12145, 10697, 12204, 13153, 4891, 16505, 13656, 1031, -14224, -10244, 1191, 600, -2019, 1029, 2908, 4030, -279, 3653, 8545, 11288, -5338, -4875, 6309, 26052, 14840, 6739, -2552, -4591, 4922, 6725, 14101, 24794, 7486, -6929, -6553, 15123, 41903, 29289, 13463, 9405, 6027, 14182, 17273, 2794, -2555, 6739, 3371, -15495, -6985, -13102, -33690, -34740, -17500, 8673, -2101, -12381, -19921, -21247, -13981, -9991, 3180, 8397, -700, -11313, 655, -3598, -1593, 58, -12080, -35739, -38839, -11692, -5468, -10605, -9588, -10067, -26116, -16940, -2257, 3839, -11415, -25391, -13627, -6082, -9378, -11387, -16741, -13316, 817, 26191, 32805, 28273, 17177, 8450, 907, -17793, -16006, -13338, -5350, -3259, -1740, 5596, -701, -8370, -15673, -5871, 5141, 14483, 16124]
12177A6124q58n348m702l604R986J575j0257J0808j749J658j0401j1224P290J1302
12163A0600k773Q3o056m893k705Q043J292O266K449m806j1548J4415J3392l344
12149B0415o591n004k2881j652j933k292J8935K1555o691j2342K907J090j6239
12136a0723n622m187N828L044N392o51J3744m864j2273o327R756M901j274K595
12122f61k860O628N207K634m405j4527l037J2940P187N18j0303q637P136J7156
12108A4976J0060R69N457o639j1678k9363j2335r630K4863J7601k4451o442J0044
12095a6568l826r321J4509M238J1071l680o000L85m028M887j111j984O613Q576
12081C761j839N305o244n768j747r926k559J1851o022p736o575j4078J0479J5464
$$ y = [16124, 15266, 9918, 5216, 1612, 11598, 13173, 2916, 13724, 11975, 13633, 3232, -7992, -702, 10600, 7827, 7910, 1854, -3039, -5744, 2299, 3591, 9857, 12306, 7500, -4048, 10367, 23759, 20415, 13824, 8820, -14061, -15713, -17646, -19938, -1003, 20552, 13861, 1519, 4426, 5516, -10723, -16345, -20532, -14704, -11660, -6268, -6919, 6825, 1961, -10312, -16639, -6883, -1982, -3256, -661, -3521, 3107, 8314, 10948, 6543, -7984, -11021, 1919, 9106, 9624, -679, -9316, -2180, 14976, 25036, 26005, 31462, 24823, 13145, -16218, -28553, -38183, -13320, 4281, -20170, -26612, -16568, -20394, -29715, -15206, -10968, 103, -3577, -9577, -9192, -13220, -8333, -9444, -11428, -4815, 3761, 1922, 7227, 983, -4785, -6532, -16458, -19017, -7166, -13188, -20924, -27499, -41577, -31098, -15634]
12067a5634k2604K332K7885J7376R008R968o651r010j8697J236m130O593J1232
12054H904k4646J758J8440M790L186L541o793j2296m82J983j5466M100J8564j0302
12040d719k618K890l190P13Q585N795R990q536o296j64N969n867J72Q847j053
12025A0518j1688k335J6750P300j6315l476J5018p181j252R972O88j697k299r805
12011D198J0882J0701m796OK737P400k4017o440J4480O759j1913r793O01q356
11997g551J738J6398J0949j1282j4320m247J8275j155l13Q542j5267j46n443j4470
11983a8292J1109J6646L878l126j0200j905L363k473J565k845K445j0235n595
11970a5665N966O589l106q546K1587j235j7292q344K15N097N146O222n270R673
$$ y = [-15634, -38238, -35906, -8021, 9355, 18363, 28331, 21680, 12670, -6027, -4791, -8921, -2328, 8904, -15742, -13984, 4456, 9246, 12432, 15973, 9180, -3116, -3598, -1615, -17081, -12981, 5583, -4719, -7337, -4447, -7637, -6924, 1661, 7456, 17446, 8910, 2614, 2450, 8419, 2552, 2724, 11571, 10518, -1170, -3505, 13245, 20545, 4230, 754, 15772, 8591, 7339, 17311, 17999, 16302, 14003, 4198, 15080, 25781, 20985, 20991, 23728, 31128, 7111, 671, 15151, 21910, 9997, 204, 805, -7551, -5813, 10585, 21534, 10252, -4068, -8315, 9960, 8805, 8492, 17034, 1767, 1621, -3822, -18292, -7183, 9463, 13341, 10215, 15, -1890, 1473, -1000, 565, -2280, 165, -10070, -15665, -9699, -3110, -6216, -14762, 6825, 5590, -11702, -20046, -19831, -14734, -9588, -3366, -8636, 1037]
11956A037l627o871n057j1511L871P70P807J1906j224M810n513l350J4804P02
11942H554j5797j0519n532J0788J6015R755j0416q576p640r692j0433J1683O996
11929a4814M070o102J2927O941m12L946P395j0731j8494J069O800l187R034J6664
11915A5106o837l640J0949O246j0118P205J0817r950j9629P327k289O57R142o493
11901H493j3076M522r00j5976o829L691L484q705j3667Q489K4776J2096q895n937
11887h434N7M284o890n532j1936J553J1576n430J470M061m468l909K213M240j1790
11872b8935o449J2594K6128J1284J851n503m719M310M469j1102Q722P501r547
11859A0604j5531p959j76K282K1390l96j9010j6961Q332Q205Q533P290J6118r091
$$ y = [1037, -2590, -9461, -14518, -26029, -22158, -21388, -13581, -1675, -2899, 1911, -3602, -6952, 7852, 8554, -7243, -17762, -23294, -12506, 3509, 13264, 2848, -5728, -13368, -23060, -33493, -21810, -14814, -10744, -16846, -3919, 3022, 2610, 6556, 13951, 3220, -15274, -14205, -7405, -10592, -1558, 15106, 8269, 4629, 15578, 21824, 11706, 18911, 29728, 19778, 149, 7476, 5187, 5844, 14986, 8493, -4583, -61, -961, -16937, -23766, -20075, -16591, -25296, -38963, -30474, -5698, 6398, -2497, -8434, -8377, -4093, -10983, -16515, -28451, -26898, -15322, -20752, -19282, -15221, -19689, -23598, -21385, -17145, -28935, -35384, -22790, 3338, 14622, 16473, 10970, 6251, 10561, 15030, 3928, 12650, 20151, 10604, -4927, -12886, -13062, -10780, 10610, 10214, -8796, -25757, -17425, -9220, -687, 6603, 22721, 13630]
11845A3630o679J2651O716r807q083p193J0095j683p675L674K956J7987Q058r533
11831B5114n617j4223j9160m817J3619l89K614l616j3038K2580J6569m327j7398
11818b089j6852J6307P771j176J855J2553N223L746k806r111m921P416r598j5179
11804f861o726R558M11N003J0724O088m878r106R471m356q845m933q540m805n43
11789a8338l332P360R40R625J2020o546m505K340J1183N287l60j8549j8082L80
$$ y = [13630, 6951, 19602, 26318, 16511, 8428, 1235, 11330, 9647, 1972, 5646, 8602, 26589, 34647, 25114, 19497, 5274, -13886, -18703, -5084, -5473, -2859, -6475, -19513, 3067, 19636, 15309, -2089, -18941, -2634, 5137, 3961, 5816, 18369, 23592, 27338, 24532, 15421, 10500, 17916, 8318, -6861, -13587, -4029, -3618, 1385, 12109, 18197, 13319, 4213, 13684, 9328, 483, -4450, -12990, -17795, -18338, -21670, -14310, -13370, -3745, 8275, 1729, -2776, -436, 10747, 16034, 15674, -2875, -20957, -20577]
$$ [...]
##END NTUPLES=NMR SPECTRUM
##END=
