##TITLE=Analysis number 329709
Compound Code gk 00761
Project Code adrs
Chemist Name fudan
##JCAMPDX= 6.0         $$ Bruker NMR JCAMP-DX V2.0
##DATA TYPE= NMR SPECTRUM
##DATA CLASS= NTUPLES
##ORIGIN= Bruker BioSpin GmbH
##OWNER= nmr
$$ XWIN-NMR		Version 3.5
$$ Mon Sep 24 12:51:41 2007 GMT Daylight Time (UT+1h)  MAYBRIDGE\nmr@NMR_250MHZ
##.OBSERVE FREQUENCY= 250.131544655141
##.OBSERVE NUCLEUS= ^1H
##.ACQUISITION MODE= SIMULTANEOUS (DQD)
##.ACQUISITION SCHEME= undefined
##.AVERAGES= 16
##.DIGITISER RES= 18
##SPECTROMETER/DATA SYSTEM= dpx250
##.PULSE SEQUENCE= zg30
##.SOLVENT NAME= DMSO
##.SHIFT REFERENCE= (INTERNAL, DMSO, 0, 16.522)
##AUDIT TRAIL= $$ (NUMBER, WHEN, WHO, WHERE, WHAT)
$$ ##TITLE= Audit trail, XWIN-NMR		Version 3.5
$$ ##JCAMPDX= 5.01
$$ ##ORIGIN= Bruker BioSpin GmbH
$$ ##OWNER= nmr
$$ C:\u/data/dgb/nmr/ADRS/2240/pdata/1/auditp.txt
$$ ##AUDIT TRAIL=  $$ (NUMBER, WHEN, WHO, WHERE, WHAT)
(   1,<2007-09-24 12:51:21.14 +100>,<MAYBRIDGE\nmr>,<NMR_250MHZ>,
      <created by zg, POWCHK disabled, PULCHK disabled
       configuration hash MD5:
       76 6E 9A 78 1E 09 19 81 EC 84 63 8F B0 6A 59 2D
       data hash MD5: 64K
       06 C6 89 FA E4 BA B9 3A F0 06 9B 6C A8 6D CE B3>)
(   2,<2007-09-24 12:51:33.26 +100>,<MAYBRIDGE\nmr>,<NMR_250MHZ>,
      <Start of raw data processing
       ef LB = 0.3 FT_mod = 6 PKNL = 1 SI = 32K 
       data hash MD5: 32K
       9B 53 D2 7C 6B 83 8E 6B D4 EC D3 4B 61 AF 18 31>)
(   3,<2007-09-24 12:51:34.95 +100>,<MAYBRIDGE\nmr>,<NMR_250MHZ>,
      <apk 
       data hash MD5: 32K
       99 67 FF 61 00 93 03 90 AF 8A 21 99 F8 78 43 85>)
(   4,<2007-09-24 12:51:35.85 +100>,<MAYBRIDGE\nmr>,<NMR_250MHZ>,
      <abs ABSG = 5 
       data hash MD5: 32K
       0E 2F 20 12 0C D3 9F 38 B7 CB 50 CD 8F 2E E8 BC>)
$$ ##END=
$$ 
$$ hash MD5
$$ 7D 90 82 24 C1 28 27 6B AC D8 9E 15 FC 92 0C 46
##$RELAX= 
##$RELAX= 
##$RELAX= 
##$RELAX= 
##$RELAX= 
##$RELAX= 
##$RELAX= 
$$ Bruker specific parameters
$$ --------------------------
##$DU= <C:\u>
##$EXPNO= 2240
##$NAME= <ADRS>
##$PROCNO= 1
##$TYPE= <nmr>
##$USER= <dgb>
##$AMP= (0..31)
100 100 100 100 100 100 100 100 100 100 100 100 100 100 100 100 100 100 
100 100 100 100 100 100 100 100 100 100 100 100 100 100 
##$AQSEQ= 0
##$AQ_mod= 3
##$AUNM= <au_zg>
##$AUTOPOS= <28 >
##$BF1= 250.13
##$BF2= 250.13
##$BF3= 250.13
##$BF4= 250.13
##$BF5= 500.13
##$BF6= 500.13
##$BF7= 500.13
##$BF8= 500.13
##$BYTORDA= 1
##$CFDGTYP= 0
##$CFRGTYP= 5
##$CHEMSTR= <none>
##$CNST= (0..31)
1 1 145 1 1 1 1 1 1 1 1 1 1 1 1 1 1 1 1 1 1 1 1 1 1 1 1 1 1 1 1 1 
##$CPDPRG= <>
##$CPDPRG1= <>
##$CPDPRG2= <>
##$CPDPRG3= <>
##$CPDPRG4= <mlev>
##$CPDPRG5= <mlev>
##$CPDPRG6= <mlev>
##$CPDPRG7= <mlev>
##$CPDPRG8= <mlev>
##$CPDPRGB= <>
##$CPDPRGT= <>
##$D= (0..31)
0 1 0 0 0 0 0 0 0 0.06 0 0 0 0 0 0 0.0002 0 0 0 0 0 0 0 0 0 0 0 0 0 0 
0 
##$DATE= 1190634680
##$DBL= (0..7)
120 120 120 120 120 120 120 120 
##$DBP= (0..7)
150 150 150 150 150 150 150 150 
##$DBP07= 0
##$DBPNAM0= <>
##$DBPNAM1= <>
##$DBPNAM2= <>
##$DBPNAM3= <>
$$ [...]
##$SUBNAM7= <"">
##$SUBNAM8= <"">
##$SUBNAM9= <"">
##$SW= 20.6930455092707
##$SWIBOX= (0..15)
0 0 3 0 0 0 0 0 0 0 0 0 0 0 0 0 
##$SW_h= 5175.983436853
##$TD= 65536
##$TD0= 1
##$TE= 296.16
##$TE2= 300
##$TE3= 300
##$TEG= 300
##$TL= (0..7)
0 120 120 120 120 120 120 120 
##$TP= (0..7)
150 150 150 150 150 150 150 150 
##$TP07= 0
##$TPNAME0= <>
##$TPNAME1= <>
##$TPNAME2= <>
##$TPNAME3= <>
##$TPNAME4= <>
##$TPNAME5= <>
##$TPNAME6= <>
##$TPNAME7= <>
##$TPOAL= (0..7)
0.5 0.5 0.5 0.5 0.5 0.5 0.5 0.5 
##$TPOFFS= (0..7)
0 0 0 0 0 0 0 0 
##$TUNHIN= 0
##$TUNHOUT= 0
##$TUNXOUT= 0
##$USERA1= <user>
##$USERA2= <user>
##$USERA3= <user>
##$USERA4= <user>
##$USERA5= <user>
##$V9= 5
##$VALIST= <valist>
##$VCLIST= <CCCCCCCCCCCCCCC>
##$VD= 0
##$VDLIST= <DDDDDDDDDDDDDDD>
##$VPLIST= <PPPPPPPPPPPPPPP>
##$VTLIST= <TTTTTTTTTTTTTTT>
##$WBST= 1024
##$WBSW= 4
##$XGAIN= (0..3)
0 0 0 0 
##$XL= 0
##$YL= 0
##$YMAX_a= 345389
##$YMIN_a= -355425
##$ZGOPTNS= <>
##$ZL1= 120
##$ZL2= 120
##$ZL3= 120
##$ZL4= 120
##$ABSF1= 16.522
##$ABSF2= -4.171173
##$ABSG= 5
##$ABSL= 3
##$ALPHA= 0
##$AQORDER= 0
##$ASSFAC= 0
##$ASSFACI= 0
##$ASSFACX= 0
##$ASSWID= 0
##$AUNMP= <proc_1d>
##$AZFE= 0.1
##$AZFW= 0.1
##$BCFW= 0
##$BC_mod= 0
##$BYTORDP= 0
##$COROFFS= 0
##$CY= 12.5
##$DATMOD= 1
##$DC= 0
##$DFILT= <>
##$DTYPP= 0
##$F1P= 14.0000005364418
##$F2P= -0.99999901652339
##$FCOR= 0.5
##$FTSIZE= 32768
##$FT_mod= 6
##$GAMMA= 0
##$GB= 0
##$INTBC= 1
##$INTSCL= 1
##$ISEN= 128
##$LB= 0.3
##$LEV0= 0
##$LPBIN= 0
##$MAXI= 10000
##$MC2= 0
##$MEAN= 0
##$ME_mod= 0
##$MI= 0
##$NCOEF= 0
##$NC_proc= -3
##$NLEV= 6
##$NOISF1= 0
##$NOISF2= 0
##$NSP= 0
##$NTH_PI= 0
##$NZP= 0
##$OFFSET= 16.522
##$PC= 1
##$PHC0= 146.6971
##$PHC1= 6.771819
##$PH_mod= 1
##$PKNL= yes
##$PPARMOD= 0
##$PSCAL= 4
##$PSIGN= 0
##$REVERSE= no
##$SF= 250.13
##$SI= 32768
##$SIGF1= 0
##$SIGF2= 0
##$SINO= 400
##$SIOLD= 32768
##$SREGLST= <1H.DMSO>
##$SSB= 0
##$STSI= 32768
##$STSR= 0
##$SW_p= 5175.98343685301
##$SYMM= 0
##$S_DEV= 0
##$TDeff= 65536
##$TDoff= 0
##$TI= <Analysis number 999999
Compound Code 99
Book Reference 9
Project Code 9>
##$TILT= no
##$TM1= 0
##$TM2= 0
##$TOPLEV= 0
##$USERP1= <user>
##$USERP2= <user>
##$USERP3= <user>
##$USERP4= <user>
##$USERP5= <user>
##$WDW= 1
##$XDIM= 32768
##$YMAX_p= 397521823
##$YMIN_p= -162341
$$ End of Bruker specific parameters
$$ ---------------------------------
##NTUPLES= NMR SPECTRUM
##VAR_NAME=  FREQUENCY,     SPECTRUM/REAL,   SPECTRUM/IMAG
##SYMBOL=    X,             R,               I
##VAR_TYPE=  INDEPENDENT,   DEPENDENT,       DEPENDENT
##VAR_FORM=  AFFN,          ASDF,            ASDF
##VAR_DIM=   32768,         32768,           32768
##UNITS=     HZ,            ARBITRARY UNITS, ARBITRARY UNITS
##FACTOR=    0.157963299565203, 1,           1
##FIRST=     4132.6476996994, 0,             0
##LAST=      -1043.33573715361, 0,           0
##MIN=       -1043.33573715361, -162341,     0
##MAX=       4132.6476996994, 397521823,     0
$$ Real data points
##PAGE= N=1
##DATA TABLE= (X++(R..R)), XYDATA
$$ [...]
23111 27372 17074 8908 21176 -4411 4421 20496 13429 266 -33729 -21201 -3203 4185
23099 4185 -8393 -33127 8889 39256 18137 -45647 -63535 -26789 -38480 -15721 8883 60477
23087 60477 45555 -1905 -31563 -55719 -76057 -31340 3684 -28576 -52288 -59999 -80984 -40064
23075 -40064 -21035 -36715 -22783 -1926 -9858 -31742 -50674 -17373 -6626 -33111 -8995 -30978
23063 -30978 -53054 -57224 -38859 -3798 5664 47248 60382 39517 42939 71434 61536 42841
23051 42841 56350 33489 48822 3309 -39923 -21461 -6508 -5238 39782 81499 32342 -17306
23039 -17306 -50037 -32969 4514 -1736 -18940 -48372 -43312 -22217 21490 59239 72961 45955
23027 45955 11893 28090 17358 26154 12202 26042 36139 69295 60976 2649 -29552 11083
23015 11083 9738 -20965 -7458 -14919 -22753 -1808 5767 -24069 -46917 -35679 4022 2311 23423
23002 23423 44435 39074 32095 13345 13922 9314 -23498 -11843 26323 4638 -8114 -19288 -10224
22989 -10224 -20718 -47375 -67610 -69771 -62621 -50762 -63905 -60615 -40166 12249 58091 30899
22977 30899 43840 63676 46123 31030 55138 59653 24357 -19334 -17024 18358 14984 -57
22965 -57 17730 -38685 -71314 -22400 15141 -14516 -74722 -58240 -28361 -29531 7446 27447
22953 27447 30579 19261 -3895 361 -59813 -96389 -48780 -37177 -42592 -64806 -56479 -43859
22941 -43859 -78799 -83457 -111783 -113315 -70560 -57809 -23783 -14161 13911 9874 561 12712 -3109
22928 -3109 8055 -10597 -23134 25750 76656 82505 25304 -21573 -67266 -88989 -74971 -77306
22916 -77306 -61096 -59189 -34378 14134 54439 88184 79457 91361 85116 46747 22009 11382
22904 11382 47729 94888 57218 32431 11908 4949 19316 32072 31002 21924 -14170 -66874
22892 -66874 -51668 -55284 -76041 -48559 -25489 -25690 -30922 -39570 -61688 -59629 -33922 -11406 -1625
22879 -1625 -60585 -102079 -100178 -42803 9740 64546 70229 35949 10134 24109 -20018 -30609
22867 -30609 -20553 -3994 -23484 33509 68629 79157 82628 100595 42975 41582 80059 74866
22855 74866 73033 62318 9796 16348 31642 18379 -16429 -25552 36108 28410 -10435 -36146
22843 -36146 -68580 -69013 -32360 3461 18440 -10642 -16138 2597 16324 13238 31501 38134 29689
22830 29689 23544 24852 28794 407 -30709 -2738 33541 16479 -2266 -31869 -15930 -7774
22818 -7774 11928 -41466 -55277 -25633 28289 10601 -1264 358 -7964 -16589 -36383 -61984
22806 -61984 -45078 -7072 24170 1293 -21276 -23160 -3242 33742 45651 43446 36911 20979
22794 20979 5590 7136 -14926 -59321 -51230 -20948 17989 13907 34238 48889 44832 47629 24608
22781 24608 -9321 -17307 -5529 -36248 -54802 -28710 -4879 -8803 -21707 -41732 -66702 -31210
22769 -31210 -26130 -29681 -5997 2567 16896 8690 35537 81175 75193 33867 -31671 -43486 -29790
22756 -29790 -20599 -30545 -13129 -14052 -16757 3870 10034 76201 89569 58107 11935 -25989 -20491
22743 -20491 -18097 -34524 -26477 -13311 -17821 4685 -760 -34549 9824 16193 -2486 5496 -19844
22730 -19844 -41692 -45061 -61505 -35395 -5057 9031 -11354 -16940 31631 23804 20193 -4970
22718 -4970 -4703 28373 48177 40205 58810 83372 69205 83706 39924 34794 36464 39979 26366
22705 26366 -48131 -77791 -107306 -82327 -51369 -40932 -24009 -23183 -34721 -36275 -48424 -54413
22693 -54413 -22967 -12035 564 6026 10333 10458 -35858 -36556 -15817 -10783 -8677 -52265 -41255
22680 -41255 -62526 -78601 -35226 28475 11327 -20020 -29240 -19675 -802 30917 19363 16389
22668 16389 19887 35364 28594 24808 -30862 -49105 -43322 -15168 -10723 -17472 -11784 -25854 -28401
22655 -28401 -44203 -63369 -32013 -5371 29022 38800 27991 -14974 -43432 218 -18914 -29805
22643 -29805 -31259 -3096 30308 31038 -15671 26533 16677 -30479 -42487 -24654 -20951 -28309 -62278
22630 -62278 -64403 -59990 -76397 -92491 -77817 -58951 -46670 -43580 -10373 22204 15072 14891 19768
22617 19768 29981 19965 20604 29896 -14928 -10841 35210 76501 25384 -36896 -39506 -12170 28228
22604 28228 2977 6396 29060 39125 18460 20646 40958 40074 29651 25085 -3724 -26450 6039
22591 6039 7720 -33742 -41704 4009 32340 22994 29682 56030 48032 36781 46545 65442 98210
22578 98210 98920 93623 115193 86653 60333 54204 34995 11817 -14251 -53749 -38979 -16082
22566 -16082 -29220 -25949 -11125 -45288 -43872 -18916 6753 -351 -1489 -32836 -64764 -82836
22554 -82836 -59833 -44000 -11322 30904 1104 -29434 1507 43025 20388 3575 38172 78661
22542 78661 34055 -20612 17935 24541 11989 -2958 -10288 -2667 -44885 -35819 -8206 -49526
22530 -49526 -63095 -59149 -55290 -50300 -30242 19233 22985 -23194 -35802 14024 28651 15038
22518 15038 6443 17315 30983 15505 -56100 -70564 -64312 -46524 -13092 10720 -30031 -32773
22506 -32773 247 13245 26711 24574 -5023 6723 29826 16950 49995 83818 23810 -48731
22494 -48731 -36926 -52210 -61719 -41855 -55823 -11721 31799 39135 13361 -241 -14734 -38323
22482 -38323 -61689 -31089 4189 -11516 -1979 -20011 -36581 -45311 -14326 60935 74827 40357
22470 40357 -4562 -42632 -7345 -14652 -295 -11123 -4817 -8542 -36597 -41948 -15678 -26783
22458 -26783 -91932 -112236 -53658 -2847 24773 -19334 4438 29791 -33300 -67645 -62375 -67966
22446 -67966 -55246 426 46869 36948 -5674 -32965 -18010 -11836 186 9831 16789 5060
22434 5060 -16656 -6493 536 -15450 -11695 -41160 -43117 -11499 3462 -9597 -18685 -45728 -53334
22421 -53334 -30978 -39241 -22943 499 -53571 -84484 -51828 28600 94072 102577 72030 39052
22409 39052 -10185 -16436 -461 44014 7820 -50199 -93999 -51300 -13818 23030 9767 10998
22397 10998 18317 27319 16126 -18403 -42425 -26394 -45351 -54529 1552 58821 27494 46776
22385 46776 57934 22013 -5281 -46585 -77323 -55448 -48002 -31221 4826 35729 60351 74098
22373 74098 57766 8099 -62555 -121338 -67609 -48141 254 39617 58790 54106 14542 787
22361 787 -1241 11871 45706 51852 37537 8771 -9203 -4283 13730 24348 19198 5119 -24646
22348 -24646 -28637 -7244 -4135 195 -3058 -31193 -37960 -54272 -82427 -103588 -62619 -33653 -83233
22335 -83233 -90166 -40772 -27705 -47998 -78321 -40572 -27074 -47175 -68771 -26352 -21676 -54034
22323 -54034 -58532 -15483 -27381 -25200 -16719 -55922 -98085 -123142 -120137 -94684 -93435 -64230 -44999
22310 -44999 -23599 -62603 -63928 -46323 -22706 -35999 -49549 -32062 -42382 -57774 -19507 -15386
22298 -15386 -31171 -34425 -4744 9650 31 -68822 -76527 -39033 -16754 -31177 -35405 -30868 -4226
22285 -4226 2079 -10319 -7115 14013 17379 -3638 -8586 34410 22647 22900 26993 7206 38850
22272 38850 27941 13060 -12523 -34448 -43961 -28490 -21552 -34124 -78176 -114841 -102604 -24828
22260 -24828 28499 5143 -31449 -44092 -19310 16311 13341 -10846 -24787 -25463 -4931 -30952
22248 -30952 -47167 -27376 -46868 -68025 -62926 -42402 -34634 665 7089 -2608 -1733 18909 13027
22235 13027 -5027 -13693 -14704 -30354 -48302 304 12222 -403 -20269 9356 8925 -4034
22223 -4034 -5320 47638 49573 32690 10520 10634 33108 46613 20320 -15773 -34860 -29078 -67096
22210 -67096 -53935 -18901 -6975 -34263 -69356 -103342 -109920 -55985 -15730 -26464 -17522 -20419
22198 -20419 -56622 -452 35195 -33976 -41032 -46552 -35276 -22964 -36912 20970 60782 77269
22186 77269 64927 43542 27870 -20916 -96260 -78484 -21985 -32969 -47115 -37977 -70386 -107005
22174 -107005 -48913 -6944 -9082 18047 21957 31786 8597 -14760 -32281 -67078 -56454 -25878
22162 -25878 11533 -10195 -29832 -37792 -55995 -59455 -42235 -53632 -72570 -43275 -24199 -45748
22150 -45748 -42492 -4828 25755 50194 44583 56542 40325 36598 6427 -27417 -10569 7705
22138 7705 7955 1564 -23743 -61886 -53666 -61719 -58117 -69742 -53491 -17688 -19216 9341 -4464
22125 -4464 -10085 -58544 -92775 -90076 -25922 -10300 -33178 -19164 5355 34658 45490 68755
22113 68755 63672 -1368 -35595 -39687 -33554 -4641 10720 -4218 9377 22018 -24802 -53781
22101 -53781 -47194 -32560 -12681 -9748 19002 31776 58766 35999 31138 38308 29971 3086 -16005
22088 -16005 12135 17012 55864 62991 34925 31938 -10162 17352 44282 50607 12766 -8801
22076 -8801 -10819 -24779 2261 23141 47205 24642 16940 48916 56964 38850 13324 12080 -7130
22063 -7130 -31496 -23977 11106 577 -30323 -43495 -76586 -48532 -42447 -69099 -3590 20529
22051 20529 -44170 -70288 -61384 -49101 -47235 -37126 -8760 -26079 6153 25706 22293 35669
22039 35669 52341 16994 7270 -34624 -59643 1725 25258 -40924 -32744 -28686 -23876 -64081
22027 -64081 -31129 25777 64571 86809 68151 22769 -24524 -42618 -20478 -17764 -33606 -34606
22015 -34606 -25974 -79642 -77421 -48553 -20315 17403 34016 32631 -9407 -32865 -82204 -79496
22003 -79496 -65656 -46857 -31763 -73139 -56297 -36433 -40849 -17007 16671 -5249 7947 36685
21991 36685 2666 11076 -20908 -31398 -6102 -13064 -4896 22355 24304 -40628 -37839 -6355 10945
21978 10945 42211 53489 6605 10356 -14783 -13589 -33483 -17716 20296 16004 32932 -3211
21966 -3211 -37550 -51164 -23304 6560 -12571 -22891 -39617 -51916 -66835 -63654 -56509 -19911
21954 -19911 -32152 -42077 -43178 -7681 -22060 -29650 -28523 23327 44674 20589 -18338 -22200 -24706
21941 -24706 -20207 3889 22842 10604 13405 44218 29650 17993 39597 79056 34148 -27587
21929 -27587 -46323 -49586 -12021 19838 29871 16065 -964 -2943 25801 26474 -28629 -4936
21917 -4936 17265 11112 10804 16305 -9445 -39795 -23128 27802 3261 -5097 31880 38377 -23122
21904 -23122 -49781 -66489 -16645 48260 57435 -14040 -32834 -8246 -31658 -24853 2463 7280
21892 7280 10206 -1025 -759 -1660 -18803 -28772 -17425 -39926 -30633 -7058 7483 20714 -7444
21879 -7444 -2627 -39661 -56397 -53069 -48167 -70090 -71697 -45552 -68210 -33455 12881 -12689 -54468
21866 -54468 -41899 -41658 -60811 -43613 542 -28373 -68168 -28552 6110 31764 -304 3492
21854 3492 55540 79982 67471 46924 62391 25031 24427 14306 -19686 -9129 -18948 -42729
21842 -42729 -59195 -77848 -42918 -27241 -54212 -45818 -82083 -74716 -19499 -5704 -13827 -802
21830 -802 7587 952 -17607 3952 -386 -19021 -10742 4098 33812 51803 36514 41804 20537
21817 20537 -8972 -35186 -35128 -39254 -19108 16687 69667 71878 27370 19840 20443 31896 -16823
21804 -16823 -18929 10666 -28770 -71354 -40764 6329 21017 24159 22634 -36734 -44871 -29825
21792 -29825 -47074 -43804 -7191 -9324 -21197 -15230 6532 26527 -1830 -8642 -38839 -75175
21780 -75175 -67354 -68231 -22300 -30519 -29278 -34550 -57394 -31237 -15995 -24887 -9476 11713 17613
21767 17613 73821 105208 60339 2644 -15597 -57870 -64071 -81768 -70274 -30185 -29273 -24781
21755 -24781 -28857 -9904 -15498 2621 5693 11697 -3322 3055 -20377 -40135 -47656 -70091 -53326
21742 -53326 -15343 20441 32082 -13945 -40511 -16855 17723 -9977 6822 39543 35003 -6488
21730 -6488 -27262 2235 -18882 -79114 -101676 -60192 -29406 8160 27118 14192 -23340 -73598
21718 -73598 -46688 31896 38884 -20187 -58388 -85528 -74551 -43781 20532 35648 15825 49032
21706 49032 81729 64810 54749 22551 13336 32893 55128 58696 65557 31993 62353 55220
21694 55220 16612 -13436 -34543 8023 63228 34229 -23209 -45044 -91005 -107058 -107805 -100276
21682 -100276 -91785 -81814 -66113 -34621 -17171 -36480 -32239 -37691 -60367 -70772 -14507 -7814
21670 -7814 -11318 12211 -13817 -40769 -63651 -55070 -56839 -77526 -39741 -25409 -29486 -28457 -17281
21657 -17281 -16758 6078 21296 8498 16736 14773 -14351 -12078 -20317 -42611 -12387 -9448 -24852
21644 -24852 -62097 -63268 -54073 -64585 -62138 -70775 -25995 -6769 1023 35080 31984 48924 47456
21631 47456 37541 43101 10952 21160 47858 46235 44000 18574 -20424 -37534 -3379 -10529 -6846
21618 -6846 16912 -6248 -26283 -13246 -25423 -12697 -8235 -3591 -5036 1152 -707 -5969 41465
21605 41465 49763 28869 -2641 -3901 36794 30929 56834 72548 55276 16356 -23011 -31643
21593 -31643 -16897 -25797 -28925 -56303 -71016 -21240 22740 31268 47705 37083 27036 18647
21581 18647 10254 13040 30794 22296 -27073 -10321 38608 2721 -57891 -40470 -6955 -8079
21569 -8079 5926 14275 6622 -29325 -46938 -29000 -60482 -58211 -8957 9504 28545 40752
21557 40752 25834 -8916 -56333 -48940 -33722 -22586 -5178 8301 31017 30303 31061 12606 -3963
21544 -3963 -19344 -15442 -1407 -20197 26588 47268 15238 -25394 -61463 -42291 -7420 30630
21532 30630 51844 39648 -16788 -55867 -77602 -28309 29319 38413 35148 11541 38749 42182
21520 42182 27956 36822 62762 46503 4033 -36513 -61915 -27790 -43435 -61572 -44434 -48201
21508 -48201 -51391 -12044 -17792 -2274 -16663 -33709 -50158 -23287 -4310 11689 -3453 -19891
21496 -19891 -29286 -294 786 8798 20363 11013 34357 38627 11895 4098 11319 -12470 -46979
21483 -46979 -30190 -833 3048 -24575 -806 20942 18913 12184 23228 9596 795 -2773 12034
21470 12034 55971 65225 13050 -32354 -31025 -8619 -231 -28442 -44359 719 17253 19397
21458 19397 33076 30344 24554 40808 6817 -4189 -12574 -9622 -35843 -47826 -29114 3905
21446 3905 35721 60130 69207 90288 61335 54306 20068 28574 45642 48409 30489 -22061 -46143
21433 -46143 -28180 -18835 13206 30249 5724 -24446 -28708 -52326 -37036 -33665 -17403 841
21421 841 7503 9942 10444 -2022 4376 13068 38492 34208 -11598 -27664 -16259 15815 25521 -5616
21407 -5616 3116 25465 15564 -284 -11523 -50748 -62400 -51476 -32001 -23095 -16971 -38049 -45429
21394 -45429 -32009 -22099 2453 24349 13547 -12300 -63843 -52867 -34521 -43014 -71348 -44899
21382 -44899 -9722 16964 2319 2313 -11039 -4489 12733 8405 -22038 -38200 -46353 -78297 -53840
21369 -53840 -22547 -72363 -48897 -3736 -69 -6312 10663 -15016 -27568 -33652 -17781 12623
21357 12623 45205 35495 -17206 -26010 -20114 -366 57015 31928 -2546 -8818 -20269 -12822 14711
21344 14711 19552 2930 -33165 -45768 -40841 -34969 -11053 -26340 -40803 -23747 -2460 1537
21332 1537 40320 35131 -195 7159 -18025 -51776 -65841 -24130 -10887 -33089 -12967 -31473
21320 -31473 -19122 -8711 -8396 -4596 8940 18632 17636 25599 16393 -14773 -19305 -10298 -7903 15391
21306 15391 31697 -2429 58765 88666 77261 32625 8457 54882 71485 41619 2957 -49936
21294 -49936 -36408 -6942 -23155 -37974 -21907 21129 42644 92458 56485 25650 38558 67890
21282 67890 32312 5909 24709 38268 40052 21425 9951 41831 72073 61117 17186 8522
21270 8522 -657 -11070 -4834 13556 12263 6259 17201 -15803 -77468 -63937 -59683 -77125 -38788
21257 -38788 -15765 -29271 -18360 5104 7077 -34018 -30553 6111 9973 -20526 -14737 6320
21245 6320 17873 2617 -820 -7545 -28494 -24538 -19570 8946 30809 32501 -338 -20681 -54708
21232 -54708 -43259 10006 2216 -36876 -57006 -40374 8661 55308 -1244 -57072 -57135 -45965
21220 -45965 -26675 -23692 12710 -13821 -52168 -75229 -39751 -5725 7750 -37140 -40773 -19806
21208 -19806 -10571 -33180 -15982 -21135 -39797 14068 21547 31628 43722 13488 2610 26881
21196 26881 38562 33621 23363 -1836 -36067 -68727 -30466 -17292 -32638 5227 -40 -36748
21184 -36748 -43647 11397 24181 24383 445 16439 13255 -28190 -45664 -44038 -52592 -45713 -40042
21171 -40042 -24392 8132 39696 35202 -26893 -52796 -29570 -32997 -44610 -47145 5902 -929
21159 -929 -11717 -12793 -30653 -45771 -20436 4193 -1408 -20113 -23338 -20349 -30789 -76087 -76272
21146 -76272 -63989 -54402 -44594 -50238 -31980 1040 9565 20657 49674 31561 32894 42887 51752
21133 51752 67605 17971 -26793 -76021 -64396 -35259 -35236 -27513 -5870 25850 49100 31943
21121 31943 8016 -8441 -4397 -5154 -39454 -19756 -900 -15403 -12036 -10416 -39923 -68919 -62744
21108 -62744 -45683 -18551 38590 27477 12018 53392 71466 72969 29090 -17156 -19600 27126
21096 27126 35600 20594 18804 463 56724 41851 37850 28799 10971 3199 10345 20298 13465
21083 13465 -32542 -48463 -80528 -56828 -24786 -7733 2602 -6913 15432 27127 54318 62232
21071 62232 22776 24486 -13963 -39797 -72900 -69661 -54876 -20081 -20656 -47959 -65392 -92529
21059 -92529 -90598 -62321 -15873 -15014 -4641 11835 35724 65578 90013 110114 31415 -2827
21047 -2827 -7830 3886 9682 56289 53632 22957 3238 10330 -16495 -54183 -54835 -19732 13951
21034 13951 22434 10971 -17837 -36976 -14846 -4084 -4129 -18025 -58591 -56222 -54821 -32479 888
21021 888 30455 22780 13794 -24643 -41301 -37514 -15605 27814 28264 -6668 -10439 34386 51630
21008 51630 16907 15376 15374 26356 11948 762 12197 2756 -16695 -59121 -69951 -12491 35983
20995 35983 42299 47379 50716 42124 36346 39451 24166 30455 2246 -48983 -11662 10546 -26912
20982 -26912 -23518 -20188 -17722 -35853 -22964 -42310 -21363 23427 50450 80528 86560 54614
20970 54614 17899 19035 25866 32815 -13475 -32104 -36854 -31711 -6268 -9420 -36885 -15987 -44641
20957 -44641 -52576 -50142 -33909 329 5364 -9275 -27806 -29614 -55266 -58461 -7209 2951 8977
20944 8977 19425 -21893 -19987 -12651 -31941 -25159 198 30 5498 -21637 -14996 -23191 -15087 -11581
20930 -11581 25022 52201 78893 61287 42373 60153 40462 -1223 -64586 -101548 -90505 -52239
20918 -52239 -41511 3578 14176 -36582 -34573 -60368 -100869 -106888 -22314 36079 55011 8748
20906 8748 15115 38907 51202 52333 53508 12305 -937 12363 1665 -52769 -79106 -39572
20894 -39572 -27281 16298 29993 19994 -3246 52090 91421 93961 86206 79179 61743 9648
20882 9648 -37069 -27452 -21581 -24731 -8199 4742 5785 37784 11753 1754 -54036 -77483 -54907
20869 -54907 -24806 -750 33502 7988 -22840 -26058 -22873 9481 7462 -31456 -20334 2502
20857 2502 5174 -7247 -22577 28892 46296 12364 7143 52267 88185 72665 58876 54576
20845 54576 36921 35547 18082 -11249 -30077 -25284 -25262 20455 39394 -10253 -46744 -36410 -33668
20832 -33668 -14890 34773 64827 24508 -32355 14660 38712 20153 -24737 -33461 -15171 -10033
20820 -10033 9469 -6914 -3724 -7723 12490 -7958 -33430 -71359 -55906 -59612 -24750 -28556
20808 -28556 3042 20404 40704 15029 10301 6561 -13774 -18537 12614 24094 -9988 -20744
20796 -20744 -10130 -20883 2268 31890 37303 32287 4377 -44177 -43881 -6228 7501 19532
20784 19532 43475 54285 47723 19662 18514 34395 59150 63201 12060 -11752 26312 -1293
20772 -1293 -9779 -14628 7005 60796 74636 70887 68794 82678 77282 58971 40798 55988 79877
20759 79877 78841 76509 39652 16120 16343 -38126 -67112 -51210 -55494 -32990 -61870 -56672 -71370
20746 -71370 -49819 -10513 7345 9507 3402 -14462 -12318 -811 1373 12837 34305 35829 -12822
20733 -12822 -35378 -44635 -32569 -9036 -37142 -55882 -30595 -19391 -14661 26418 57402 11711
20721 11711 -19853 8980 48519 -2930 -29477 -37051 -38824 16316 66962 59259 37783 19801
20709 19801 8003 46823 48398 44784 23838 -5727 -41232 -29542 -32675 -41669 -20698 -6046
20697 -6046 1743 -14192 9478 29281 -30193 -53473 -43021 -41912 -25964 -6617 -2616 -7833 -16173
20684 -16173 -64897 -65186 -26294 -1473 15049 -5529 4922 45455 88036 54932 66633 91108
20672 91108 60078 9222 -5866 27282 6089 32247 43344 -6220 -17418 10766 -26235 -18116
20660 -18116 -1151 -20729 5992 37712 67751 91140 95864 115144 103712 112052 143626 168781
20648 168781 175459 160085 193629 214913 223767 274885 327572 368162 417142 400636 402143 447293
20636 447293 445235 414323 416180 408233 386878 390857 385737 415074 387259 319931 292279 248655
20624 248655 205502 219979 207474 143849 140103 98203 41580 17106 8037 -22665 -3673 41149
20612 41149 21525 14750 17548 15450 170 -29818 -12241 36720 41162 9462 2426 -6195 -13645
20599 -13645 1629 -20822 -34350 -28813 -27534 -12464 -13340 -1214 28329 47970 6901 3943 37080
20586 37080 62881 72417 70267 46658 55021 24072 -5261 18686 6439 -21780 2543 38955
20574 38955 45670 41514 15481 13222 7767 10430 40940 61150 47353 56281 41044 58822 69593
20561 69593 52905 33692 10503 16400 -3531 -36515 -51992 7629 38305 10317 -29724 -10602
20549 -10602 -20662 -34443 4514 -40761 -49292 -60909 -92879 -125567 -120996 -47087 15193 26818
20537 26818 40043 17770 -6922 22211 24795 29728 44005 39219 52485 7290 -9222 -15300
20525 -15300 8318 22730 20396 24765 22739 -308 13612 27290 32578 40565 58731 16070 -750
20512 -750 -5807 -12816 -5470 38403 63817 33180 14873 8084 -21350 -37139 -28957 3171 789
20499 789 54960 52623 29434 31654 24963 -9768 -44392 -37159 -12129 -12530 -18982 -10720 -10188 16033
20485 16033 30990 25868 10769 9407 23507 53464 55742 44742 24691 14005 2136 29475
20473 29475 48821 34208 53840 66823 52177 8697 -17867 -21012 20235 72159 71593 83051
20461 83051 69297 57060 3684 -22327 -9278 -1868 12436 13561 -2460 5370 52745 67443
20449 67443 28975 -1099 -18667 9385 -26085 -66017 -17362 37973 45185 9943 11401 16425
20437 16425 37597 12098 2332 -14176 -24778 -17195 -34749 -18497 -34255 -37087 -15416 -27669
20425 -27669 4928 7681 35604 -8290 -52807 -6824 51949 75738 44174 15942 23206 65797
20413 65797 75907 78434 42205 -13023 22510 29678 -5366 -4799 18251 -6145 -38792 -32632 -13088
20400 -13088 13215 41770 54136 69537 89643 63416 -1125 -51957 -36068 4044 35057 14419
20388 14419 -12566 18596 55810 105282 109183 85636 79770 57873 41394 36490 15770 20219
20376 20219 20663 15982 56947 52020 -5180 -47216 -60369 -50834 -22899 -27239 -7863 -8049 16202
20363 16202 20974 16329 28578 -22792 -21863 13534 48278 45384 31500 -14931 -40493 -82105 -66810
20350 -66810 -50469 -59931 -45710 -17822 -5991 5959 -828 -19097 15315 21067 -4233 15535
20338 15535 14826 2780 -39487 -4862 38841 42552 39531 46548 53971 45729 30814 32256 18225
20325 18225 36080 40538 67106 83657 69121 67654 34619 17164 37315 22022 -9291 -12170
20313 -12170 7670 18133 -8456 5749 21527 62217 67559 45877 12106 -5886 -3613 22988
20301 22988 41024 66614 81067 57320 51623 36357 44656 39572 73118 84225 75806 76425 94306
20288 94306 121067 137514 125190 113234 103042 91822 87194 80746 72703 76272 86668 79366 77086
20275 77086 95377 90559 48144 84877 153648 182003 172041 138460 106476 62632 44751 41675
20263 41675 67056 74087 102498 107623 116854 142442 162831 168363 152829 104812 58348 62200 50848
20250 50848 64799 69822 79462 66762 67781 96834 102530 40804 54405 96281 118872 124826 75683
20237 75683 49379 38875 43295 85735 100669 97634 82823 102550 90602 57445 62111 56901
20225 56901 62675 56105 65975 54191 40781 83500 126715 105982 105771 80153 50369 27459 11731
20212 11731 -13131 -14699 26001 77040 64288 83859 77442 95529 99723 78586 77375 57568
20200 57568 56393 55251 25627 42520 43185 54368 38676 49214 73212 99137 104411 98111 112490
20187 112490 125113 98127 89107 41911 22968 22630 -6411 -4820 29695 -21566 -13900 12161
20175 12161 21366 15429 -4738 61678 52176 102147 150015 146055 102619 89441 80142 52923 70555
20162 70555 125200 124080 106712 133440 101321 101091 131536 106643 72031 66850 108356 132212
20150 132212 101237 106063 113645 141421 173294 195124 207461 179530 155668 126594 105274 120881
20138 120881 124156 109545 154583 195668 162281 149388 136285 142929 144988 123822 107277 105071
20126 105071 117668 139408 112989 139122 178168 197292 176176 138101 122571 138801 161751
20115 161751 186015 214274 264517 279651 283102 282695 267776 273280 277568 278688 256420 213465 242975
20102 242975 256470 251709 269689 304560 347959 347308 324088 295269 286925 313274 319398 316386 329098
20089 329098 356137 350448 358916 365931 357042 388563 388458 361204 346341 378275 411206 438909 444806
20076 444806 454607 474178 494535 502862 504758 523464 537269 565273 622581 681029 687247 713994
20064 713994 747297 765720 769015 806897 877255 962106 1016594 1110509 1270578 1385884 1482961
20053 1482961 1534794 1644894 1841727 2077530 2331477 2572120 2837670 3083416 3317947 3531713
20043 3531713 3797597 4188658 4632930 5093529 5699563 6487404 7545509 9028019 11075362
20034 11075362 13942363 17695646 22343433 27724265 33290713 38975585 45181668 52162918
20026 52162918 60134261 69217086 78208365 84800249 88536572 90783212 91151544 90480659
20018 90480659 91008447 91979698 90536791 86309822 80469245 71941849 62108238 53899059
20010 53899059 47548271 41901214 36568561 31409079 25910127 20490822 15958150 12475158
20002 12475158 9954070 8136273 6791352 5815286 5080462 4524412 4058882 3684145 3334506
19993 3334506 3044450 2797684 2551162 2359096 2170271 1962990 1789900 1664250 1529140
19984 1529140 1383913 1237865 1094850 913743 812687 768012 743680 670403 601793 566997
19974 566997 519492 427647 391566 381996 332928 271424 268939 257299 266592 270363 263290 271857 241390
19961 241390 236159 211941 193363 205252 206504 212920 201776 176712 139936 95723 89215 106540
19949 106540 165302 192866 179697 149675 138275 117628 94055 87447 81231 73175 76977 105900
19937 105900 150995 147108 140884 132758 104185 57229 81904 82502 73089 33090 -40641 -26267 14876
19924 14876 34993 73045 105887 58739 10878 -34984 -19034 26536 65905 88682 65643 23499
19912 23499 -6106 16475 -5244 -45425 -27380 -7357 15975 43574 5642 -34457 -14130 30530
19900 30530 24450 4361 -20241 -41341 -25880 19730 63713 63908 36308 63092 83704 77211
19888 77211 25997 44753 109612 94878 85061 91752 78177 36828 -18110 -30751 -16887 -6125
19876 -6125 19346 14840 861 14493 31227 38218 54226 82930 35944 -19391 -51590 -17587
19864 -17587 8133 -2829 -4048 11106 7149 -11120 -24242 -29925 -15512 -24511 -44975 -64005
19852 -64005 -62704 -55596 -76163 -78259 -9991 29761 8909 -25216 -21512 -25040 -25646 -6753 -18571
19839 -18571 -69823 -58217 -44805 -44658 -6405 -11756 -12205 -1153 -6514 3126 39739 23090 -5046
19826 -5046 -33546 -12706 10194 4483 3195 3000 22961 8092 -22050 -12756 -60015 -62163 -49175
19813 -49175 -30408 -32081 -21409 -9288 -24918 -11712 37124 40819 -16605 -21872 -5796 -20093
19801 -20093 -30479 -43711 -41674 -9415 9501 -4958 14265 -4670 -24007 -20419 -1043 27807
19789 27807 -2435 -35216 -50363 -42695 -43828 -41967 -27664 -36293 -8698 -53213 -119962 -106764
19777 -106764 -118852 -119360 -114109 -108290 -77843 -59819 -37489 -1791 -4688 -12148 -8772 -59715 -71605
19764 -71605 -68589 -49371 -9324 -2276 7758 63069 52289 42450 42959 48140 6480 -5922 -54005
19751 -54005 -79763 -87134 -45984 -20066 -37478 -73724 -22886 10326 -19769 -14007 -13479 1977
19739 1977 8772 -14621 -36916 -80686 -47926 -5615 -4526 -31909 -29383 -40383 -77182 -110777
19727 -110777 -89098 -82150 -45370 -18729 29440 -1031 -27447 -41312 -42360 -23739 6678 52210
19715 52210 52190 24139 32851 45868 25720 -3413 -11431 18636 10404 -17015 503 8375 7373
19702 7373 -17637 -30215 -31192 -25304 7218 77389 78550 66316 25733 6990 -6230 27982 54079
19689 54079 42697 70808 29251 -14451 -24987 -9545 1946 43185 72408 90267 90030 43798
19677 43798 -4780 -19656 -13615 -23236 -22773 3883 7477 25043 12850 5518 13987 -33105 -43987
19664 -43987 -13043 -23959 -37067 -25577 2306 -33132 -27561 -4309 33347 29192 16473 -6913
19652 -6913 -21701 -16092 22850 3178 -31508 -46718 -59916 -57283 -31147 -6277 46492 71985
19640 71985 21328 22113 33702 32963 13749 -30370 -38775 -30070 -57051 -49494 -29423 -12595 -953
19627 -953 -23352 -29373 -12086 -35108 -36951 -54978 -17428 -3259 -27992 -18221 1062 16848 19617
19614 19617 14301 2340 -5406 9180 -3382 -7122 -10965 -44125 -60055 -34916 -11753 -7973 -46300
19601 -46300 -22855 12082 -8322 -27497 7319 -542 -17610 -10175 16434 7709 -20513 -1863
19589 -1863 29292 -9763 -32384 -56574 -35069 -47655 -47955 -55420 -55271 -70799 -65823 -59112 -60541
19576 -60541 -28118 -27124 -65641 -52881 -34630 -3932 5280 43367 46466 50986 -10689 -47088 -32752
19563 -32752 -38907 -33925 -51041 -37241 -6802 -21426 -56476 -75619 -29614 13081 34455 41298
19551 41298 35717 33608 15334 -20211 -47288 -42473 -67272 -54608 -31262 -34261 -32689 -62520 -73721
19538 -73721 -43421 -45388 -54755 -54673 -44118 -41973 -23381 -30618 -1182 5893 10043 3012 11758 38778
19524 38778 46640 30667 23175 34194 10517 -60180 -89069 -85230 -101350 -96638 -88712 -60747 -47449
19511 -47449 -50119 -48515 -43919 -35437 -11453 29797 20497 3416 -27273 -90572 -112362 -66022 -42214
19498 -42214 -30672 -13262 -8325 3343 -10040 8586 43949 50062 5815 -24660 -40589 -39337
19486 -39337 -50570 -70151 -97424 -76614 -23004 -51854 -70961 -79862 -74270 -96303 -116807 -90949
19474 -90949 -52423 -28082 -20463 -27549 -46984 -65851 -48492 -30561 -42034 -8431 -31608 -26261
19462 -26261 -61422 -85390 -93572 -92908 -73398 -22495 1048 11496 -16607 -46610 -46069 -16212 11954
19449 11954 -6012 -53874 -38408 -80968 -54769 -17786 -18559 -591 -1676 -29393 -17689 -8380
19437 -8380 59289 35555 7725 9582 -20079 5315 6183 27586 46374 14393 -32594 16510
19425 16510 13719 19038 -7313 -10842 -20800 -10334 -24219 -16371 -18136 26308 26675 32819 91244
19412 91244 78933 69135 98018 162327 149725 136667 178271 209604 237401 261803 296053 329661
19400 329661 384704 418378 422634 428764 468501 445990 387582 356986 307382 270596 254067 281727
19388 281727 233001 160420 146492 138997 102605 100738 112073 83343 72002 67358 29254 18351
19376 18351 23174 -7553 -7234 17601 -13134 -37148 8158 45994 7872 -14259 18537 29040
19364 29040 -13671 -34954 -2761 -5445 -37950 -71574 -19999 -35851 -44691 -2510 14502 9758
19352 9758 -8369 9173 2994 -21744 -53635 -33438 1299 15572 51355 59351 38320 23272
19340 23272 8513 53749 29119 18960 9548 1004 2408 18742 7806 -19165 -50647 -49341
19328 -49341 -62186 -76795 -97866 -99688 -69695 -63044 -63453 -14188 6568 67924 67448 32016 8121
19315 8121 -11762 -17736 -47861 -27491 -20755 -21795 11244 23560 14526 -17572 -12943 -8138 28276
19302 28276 51802 63585 36939 -7591 -19905 -21469 -37513 -56976 -51148 -43063 -12906 506
19290 506 -15130 -14173 1864 -5549 14301 -18551 -20304 22728 16511 18382 6395 -17241 -3930
19277 -3930 59165 56338 76576 80988 80512 64420 80449 88831 71912 75491 121424 155004 196763
19264 196763 276604 351097 464630 608238 729379 896129 1052254 1214509 1268172 1273508
19254 1273508 1254267 1260849 1229163 1085913 910508 768840 665182 567113 448756 333361
19244 333361 217286 121613 59738 86048 57728 33478 63509 52089 -7610 -13604 59331
19233 59331 85660 71649 38423 41636 -4485 -33332 -11932 20699 39682 39367 7453 -10196
19221 -10196 -2344 -53367 -30796 -7753 -10578 41248 50223 26494 17448 9470 -13414 -21408 8117
19208 8117 -18967 1667 -742 2983 -7597 -11796 11485 4049 -20634 -35988 -2694 -21741 -20523
19195 -20523 -23469 -80926 -109554 -72716 -28650 -26151 -30240 -50818 -80047 -61385 -57560 -59405 -58786
19182 -58786 -72154 -41180 -56591 -43505 -21089 -15268 -65792 -91337 -78799 -47511 -17391 -22128
19170 -22128 -52845 -45985 -4654 -10266 -70426 -19066 -11116 -18973 -30418 -35815 -66637 -68503 -66124
19157 -66124 -67150 -65548 -70971 -99679 -104516 -62289 -19759 -33973 -49213 -66127 -76887 -86906
19145 -86906 -50047 -5270 -772 -17123 -5797 26958 2276 -14811 -13717 -16943 -8316 -15236 -3870
19132 -3870 16217 -1477 -51699 -82903 -66173 -7450 -4688 -32185 -35344 4900 13323 21662 28676
19119 28676 36597 45173 42897 26749 37639 36222 30852 8932 -26630 -34085 -47828 -36001 -41087
19106 -41087 -45455 -24370 22390 -37357 -89029 -90424 -68983 -62255 -16179 -22256 -37915 -27714
19094 -27714 -32912 -68321 -92267 -59237 -32410 -7713 4916 8338 2367 4989 -11484 -1804 -7847
19081 -7847 -43410 -46955 -49139 -55713 -38314 -55342 -34219 -36548 -32508 -42407 -11670 13208 14947
19068 14947 -39906 -36506 -62125 -91121 -70179 -24705 -525 -11251 -56780 -47617 -37529 -18891
19056 -18891 -31804 -44185 -47165 -20188 -18817 -30626 -43255 -32547 -54898 -64965 -30060 1047
19044 1047 -11912 -3006 2590 2044 1258 -45490 -57828 -29690 -38489 -18381 -12567 -18052 5262 17338
19030 17338 45312 42684 30197 -36389 -53579 -16909 10504 -14057 -13689 15626 15300 36002 15143
19017 15143 8935 -10609 -4764 -30611 -33902 -5652 -32868 -240 6652 -1420 -3020 -49509 -39671
19004 -39671 21367 67706 82989 18548 -6313 7715 18792 -11219 -71081 -59254 -49881 -45593
18992 -45593 -58029 -75987 -47879 -3322 30472 12542 -50674 -103903 -82418 -56259 -65478 -69638
18980 -69638 -57698 -59507 -30438 -53181 -87872 -71589 -61279 -69455 -28549 4270 10030 9637 -42134
18967 -42134 -45803 171 33416 18703 -406 -24743 -31010 -12400 -2541 2723 15366 43077
18955 43077 43961 -13281 -2045 -20650 -78245 -86184 -83120 -47496 -10734 2464 -37733 -63588
18943 -63588 -25130 -46806 -16147 -19111 -35939 -41285 -41126 -10407 17883 18050 28815 19394 2603
18930 2603 14038 4513 28749 20776 -19407 -47785 -40398 -19668 -29842 -29713 3827 37700 32122
18917 32122 18570 1250 -27256 1279 -11340 -13703 -21948 -9181 7522 19001 17983 2334
18905 2334 34189 36438 18718 36333 2486 -20839 91 34621 41871 25758 34279 15251
18893 15251 18914 14023 12178 -10502 -29873 -11028 -29263 -10320 -15146 -47559 -58061 -57530 -72037
18880 -72037 -34523 -22164 -38707 -37494 -30123 -1697 -6897 -9493 -1811 -14270 -50071 -94689 -115458
18867 -115458 -107215 -111041 -78042 -34442 -29778 -10392 10890 -11675 -31877 -65369 -76187 -42109
18855 -42109 -12139 34644 15819 -11093 -25429 -28747 -50532 -83115 -115737 -136391 -113884 -79431
18843 -79431 -81145 -80594 -19877 7049 28156 4988 -33846 -71449 -69967 -17669 -37968 -41533 -24187
18830 -24187 -68695 -81559 -68467 -37735 19663 18379 -3295 27224 14955 -26379 -53632 -46893
18818 -46893 -22441 15039 39028 14691 -730 28908 45567 32421 13525 -18998 -9922 -9429
18806 -9429 15038 -5454 -15373 17418 19040 -10039 -35176 -46980 -22103 -42124 -67166 -84126
18794 -84126 -63371 -18652 -37066 -20989 -29792 -84739 -78459 -48343 -41502 -47817 -81637 -82754 -91074
18781 -91074 -68636 -69539 -88133 -47743 -25874 -15417 -26332 -47609 -70889 -92721 -98884 -107617
18769 -107617 -100641 -53363 -6283 -36957 -58665 -30653 -37309 -70491 -70156 -50852 -24405 -32586
18757 -32586 -49581 -39964 -22518 -2499 -22613 -12704 10291 43016 43421 29553 58228 80541
18745 80541 58607 32204 -4483 -40738 -32819 -3140 9115 -18073 -31644 -27509 -41842 -43357
18733 -43357 -19958 -38222 -57305 -66163 -38317 -2831 -7486 -28673 -9698 -20946 -29230 -40033
18721 -40033 -27462 -8091 -5490 8996 -3054 -20809 -19604 -2017 -1075 4688 8746 -1962 -19364
18708 -19364 -24403 -30432 -13320 1264 15176 33692 63806 55810 16153 -15298 -27313 -15694
18696 -15694 -9098 -7368 -40548 -91827 -95999 -63652 -22754 -28613 116 -8697 -23165 -3402 1967
18683 1967 -7460 -1158 36658 35787 -30369 -72241 -39904 -50668 -30953 -24591 -30788 -46490 -111105
18670 -111105 -100200 -50732 -62535 -99609 -69637 -43102 -3870 -10395 -33197 -19819 -42905 -15448
18658 -15448 -30558 -53093 -12756 -25124 -49751 -22367 -4967 1215 -30705 -36704 -9771 18004
18646 18004 -1800 -52620 -84749 -112348 -128780 -103742 -99033 -108674 -81381 -48401 -86823 -143249
18634 -143249 -141896 -76408 -23431 5887 8006 8071 -26522 -60224 -90368 -72962 -57158 -40699
18622 -40699 -1240 -4448 7795 25466 17439 11854 -3592 14746 -6574 -51296 -59848 -43919
18610 -43919 -23690 -24874 10343 23205 59906 28800 30948 41904 -22585 -71896 -76490 -106912
18598 -106912 -107466 -42568 17502 36246 -17221 -15487 18197 13373 26323 13459 13955 60 17630
18585 17630 -34499 -93000 -97998 -64279 -19356 -35882 -1568 34374 29219 45570 71944 22362
18573 22362 26589 20597 -1965 -20132 -26335 -14898 -51543 -64252 -74462 -92779 -87723 -55948
18561 -55948 -70800 -55658 11301 19211 -33151 -14799 21628 46396 44200 -5405 -10747 -24402
18549 -24402 -16068 -11642 29867 16117 -7036 -1668 32706 44382 69137 54501 34607 24066
18537 24066 -5207 -30771 17236 24847 -1700 -25350 -46615 -80549 -81803 -41874 -26227 -18816
18525 -18816 -639 4353 11530 9345 -26422 -34825 909 20533 29148 52811 55166 44693 50658
18512 50658 42949 32953 30682 48528 32327 3207 31032 44616 25137 -7588 -1227 -4550 -15252
18499 -15252 -52934 -78650 -45316 -53174 -19774 -14111 -63399 -62355 -51660 -49518 -35639 -9341
18487 -9341 -15396 -38255 -48668 -26399 -12727 -13765 -636 326 41108 65808 44000 -4617 -3614
18474 -3614 -4602 -21895 -17784 -40894 -65771 -96651 -89188 -71079 -51928 -36922 -11241 -21796 -61554
18461 -61554 -56815 -9708 -11259 -14723 -42737 -56929 -48732 -22808 -17120 -44972 -64996 -47339 -34084
18448 -34084 -27947 -35116 -80433 -34974 13712 22029 -4720 5669 -24408 -46541 21335 48565
18436 48565 54808 36335 24593 19520 -8984 2672 20411 39630 50172 65739 20914 -32005
18424 -32005 -74878 -76648 -39545 -37874 -42950 -82359 -97687 -64463 -1268 34592 26736 16441
18412 16441 9163 -29488 -65491 -73113 -45660 -49936 -40952 -7167 -30773 -36646 -36327 -47345 -22880
18399 -22880 -2232 20325 41490 20260 -31838 -45094 -28618 -51058 -59100 -68272 -80812 -86270
18387 -86270 -45051 -18703 -30516 -59082 -77681 -85908 -77832 -44333 -10778 -11918 -31249 -48565
18375 -48565 -70710 -6635 -11304 -53405 -74103 -78470 -50952 -41818 -30423 -41481 -48007 -58617
18363 -58617 -48575 -35107 -1594 44748 36803 13168 18067 26126 16670 1724 16922 12809 445
18350 445 485 -6398 11999 5860 36090 27006 19394 -25224 -36924 -27067 -55267 -45442 -45568 -31627
18336 -31627 -4206 -8010 -58324 -47674 -45125 -51617 -29196 -31415 8271 42570 40816 22362 -25127
18323 -25127 -73336 -79700 -104969 -68063 -12149 -3114 -21592 13560 54507 17629 -35587 -40932
18311 -40932 -44058 -41062 3376 -1112 -8706 -571 -46042 -46470 -48280 -25337 10191 20880 21253 36048
18297 36048 34948 5867 -7145 -20415 -52236 -50077 -34848 -35021 -27131 -32156 -28309 -46540 -82587
18284 -82587 -87520 -77941 -69715 -70091 -45769 -40603 -52632 -4009 25902 14068 -29283 -17617 -7430
18271 -7430 -480 -20624 -14778 -51109 -10737 60769 49503 31492 36420 13493 28564 55061
18259 55061 44602 13086 6647 -18425 -23123 -39617 -43584 17492 30071 5332 -43321 -78140
18247 -78140 -92678 -72246 -26962 -34367 -26808 -14525 11289 13111 -3668 531 20163 -32904
18235 -32904 -55925 -57608 -72725 -47980 -40100 -25826 -18561 -47001 -71574 -88441 -75472 -58077
18223 -58077 -47393 -76726 -72612 -22890 31270 56426 45114 -473 -62147 -136698 -122552 -109288
18211 -109288 -95465 -99494 -78001 -25737 -29194 -19146 -12398 -21172 -39761 -16311 19815 34140
18199 34140 32233 27163 14800 -36020 -65732 -61762 -58569 -47043 -48525 -41574 -43046 -12097 -1260
18186 -1260 -8221 -20916 -3185 -769 -14097 571 -7512 -39224 -23063 -37276 -8099 -11782 -54107
18173 -54107 -76379 -86935 -56037 -16918 23719 1945 8218 5801 24445 -19432 -64195 -65597
18161 -65597 -54686 -55124 -71079 -52292 -37467 -91584 -120847 -87459 -53245 -11609 -15434 -50891
18149 -50891 -49630 -64098 -62375 -49517 -86045 -94261 -33637 19782 8956 -7054 -23434 -31851
18137 -31851 -20333 21057 6508 -16432 -10223 -13300 -26054 -70619 -53275 -18267 57592 61552
18125 61552 1454 -33932 -32466 -13306 8603 217 -25829 -50383 -71198 -53190 -41781 -12749
18113 -12749 2492 8310 -27692 -21157 -29554 -20319 -9847 2764 16985 -4982 -31839 -29519 -44224
18100 -44224 -43965 -44844 -70791 -71931 -83101 -122747 -75076 -6479 -23668 -41554 -15303 13882 31594
18087 31594 17356 -2366 -12452 -28709 4813 13141 19621 9729 23858 12449 -10353 -17517
18075 -17517 -62611 -87317 -66199 -25468 33479 27307 26286 -11973 9037 -10674 -15624 -1125
18063 -1125 8328 64295 66056 21054 6481 16016 17412 34803 40521 49319 5326 -12256 -37837
18050 -37837 -42856 -38383 -76926 -96889 -55097 6884 11403 -32342 -45358 -10746 -4271 -26415
18038 -26415 -33646 -45167 -51079 -9766 9478 -36082 328 8592 -12020 -20688 -16704 -266 -14634
18025 -14634 -59235 -61145 -12103 -12215 -30996 19779 25282 -3826 16287 27118 43920 -388
18013 -388 -41990 -28752 -15798 13070 22766 -12208 4397 15999 4934 -38709 -9644 -18467
18001 -18467 -11960 12262 4902 -16734 -16882 -17733 -11413 18056 9859 -42799 -77510 -102949 -90831
17988 -90831 -48746 -11224 -26536 -39572 -51582 -46714 -42002 -17078 -52543 -77804 -75290 -76924
17976 -76924 -25697 12949 20320 43005 55059 71249 80411 46148 92345 102277 70500 63028
17964 63028 38675 3301 -445 -13841 -34842 -23489 -47931 -80079 -86928 -47417 -15395 -31587
17952 -31587 -33468 -25912 1412 20870 -14370 -11266 2104 -23900 -42808 -32598 11906 17538
17940 17538 -11179 8599 69821 102864 97258 56269 15793 37607 64826 33448 -5335 -38357
17928 -38357 -71519 -56821 -56703 -88889 -28583 -2792 24008 -7516 -27576 -35785 -26788 -13403
17916 -13403 -16437 -37427 3260 7078 -19100 -53507 -86390 -90704 -68950 -108315 -94298 -59974
17904 -59974 -39466 -23236 -32074 -55598 -65749 -45960 -50925 -33849 -12676 -40022 -44458 -16348
17892 -16348 -1266 20102 -14480 -58205 -55713 -63004 -77500 -87409 -69696 -33212 -34236 -8466
17880 -8466 -9357 -16210 -16280 -20349 -32400 21963 24910 -27998 -14687 -28992 -26740 -8085 3595 -3785
17866 -3785 29935 17852 14276 5697 2117 -13032 22735 14965 -13551 7028 26699 12075 -11435
17853 -11435 -45007 -12872 10583 -56202 -107512 -61409 -47251 -70308 -64277 -37541 -9634 58640
17841 58640 52411 21996 20969 -12813 -16041 4216 8032 38876 5397 -12159 -52292 -62270 -22080
17828 -22080 19836 -22737 -32793 -26681 -8797 -25930 -42726 -32156 -62570 -59806 1526 45713
17816 45713 57180 23087 19907 1784 -57109 -102105 -110831 -70411 -85844 -70789 -34851 -14227
17804 -14227 -24122 3332 -22866 -42607 21 34273 27147 -23691 -30881 -4994 -17523 -14630
17792 -14630 13312 11902 -39227 -60398 -48712 -13004 -38980 -67401 -58726 -53697 -38772 -57207
17780 -57207 -27476 -19876 -40693 -53531 -64589 -98850 -28193 11639 -2358 -38194 -15155 -13168
17768 -13168 18633 3262 -11025 -34620 -5171 49911 85423 119695 87079 38311 23749 75291
17756 75291 91429 49632 34542 2604 -39887 -58404 -57768 -83188 -128842 -84850 -83943 -75633 -74792
17743 -74792 -71700 -60058 -6553 39303 11941 -12561 -26577 -3302 19311 24410 -11416 -28064
17731 -28064 14757 -139 -59786 -82102 -42946 9463 26424 29678 54222 40173 29848 35342
17719 35342 43828 22086 33388 21317 -20585 -39608 -85353 -71300 -52327 -54537 -14557 454
17707 454 -10872 21138 -2793 -36175 -40393 -45806 -72326 -26409 9036 -41496 -103412 -84785
17695 -84785 -71633 -33589 -16182 -7646 -32628 -20857 13793 -24572 -19852 17910 54438 51011
17683 51011 17505 586 19560 -18283 -34039 -16874 188 -37949 -25037 -36062 -94314 -57951
17671 -57951 -36804 -54254 -44587 -36625 -21847 -447 20574 37161 11181 15729 18671 8176
17659 8176 197 -745 -8278 28463 1323 -44945 -23280 11385 -14833 -83285 -63352 -66866 -48737
17646 -48737 -36520 10514 8420 31634 78459 67420 38820 19908 -22323 -20655 -44430 -54725
17634 -54725 -30677 -3113 -21053 -37162 -41182 -37013 -20251 -6034 -4565 -18026 -7847 -3851
17622 -3851 -6904 -32413 -11924 -27656 31170 66182 33938 10463 25316 25430 1063 -18726
17610 -18726 -9918 -47328 -28475 -4088 13431 39997 38683 49694 47822 -26928 -36691 -22846
17598 -22846 -29022 -3459 -12803 -58110 -58437 -14523 -26692 -47451 -48370 -27745 -45272 -18504 -10838
17585 -10838 -20084 11745 53298 -14824 -48650 -60669 -31764 -211 -14776 -39348 6282 33119
17573 33119 19450 12287 -6560 -29032 -3656 -15859 -70658 -76600 -36383 -25931 -33774 -58663
17561 -58663 -65613 -70192 -76095 -15945 20883 -11566 -8760 4726 -7875 -37933 -74215 -85057
17549 -85057 -36720 13459 14520 30648 17669 -11824 7522 27990 36830 32622 51817 44821
17537 44821 45042 53394 63905 48043 15323 12086 31122 11103 -16441 -19915 41824 25110 9620
17524 9620 29881 16293 -32957 -62327 -44458 -2058 55424 82135 61183 30294 36485 6044
17512 6044 -12997 -39123 -86433 -100024 -68559 -37242 -82850 -58230 12175 51599 64277 -18500
17500 -18500 -76117 -65578 -22603 -22441 -26144 -51056 -79129 -43543 -11188 17515 16643 -10240 -6285
17487 -6285 -24020 -6859 4372 27935 -24945 -60969 -33821 -24796 -18084 -26112 -29124 -1728 23102
17474 23102 3791 -5440 -13875 -13071 -6930 51920 66664 51725 32740 40123 51958 5276 -32623
17461 -32623 -16336 9281 30190 26282 16448 23465 39068 43399 -75 -29077 -16086 -30202
17449 -30202 3046 38616 26135 28497 51473 84820 54749 38563 15643 5594 -21896 -49205
17437 -49205 -39824 -29232 -16267 3808 38638 37423 45696 20023 -17728 -23651 -21235 -19421 -22506
17424 -22506 -7132 15884 -15479 -26145 -11956 23921 15529 -24881 -50454 -60888 -73582 -57557
17412 -57557 -48677 -41841 -42182 -18597 -35697 -46198 -59407 -51225 -57182 -42899 -4228 36247 24550
17399 24550 -28580 -44871 14051 42771 -8693 -40687 -48601 -64896 -87880 -76792 -62669 -76377
17387 -76377 -77837 -66619 -42668 -44322 -38186 -9158 926 -7796 -7010 1822 -45813 -36724 -38133
17374 -38133 -24390 -16537 1326 -14794 -9570 10301 -11826 -2312 6587 -19808 -27455 -34515 -31895
17361 -31895 -36019 -42988 -27833 -41662 -37206 -26152 -3203 9510 7496 -13052 -26056 -57371
17349 -57371 -48478 -31501 -32352 -15456 -47612 -36894 -30757 -62661 -74256 -98910 -128778 -103161
17337 -103161 -74519 -23519 -703 21270 11781 13055 -6071 6753 9975 -21775 20375 37381
17325 37381 8959 -21024 -7782 -21778 -19143 -35209 -43888 -16948 -27968 -51895 -37678 -20779
17313 -20779 -590 34093 41665 10481 -61708 -78414 -37942 5831 54445 25161 12737 11983
17301 11983 6178 5878 1930 -28385 -12258 40046 70144 39116 44026 -5025 -8497 15524 2291
17288 2291 -6155 -52578 -92307 -53378 -35736 -50104 -33493 -38064 -56209 -46859 -26098 -40452
17276 -40452 -36494 29672 59872 46016 11666 -10726 18231 10533 -19947 -53841 -44772 -18074
17264 -18074 -5748 -3404 -13274 -33979 -28908 -71955 -58476 -29743 -7831 -16464 -21815 16279 44642
17251 44642 41321 45915 22601 10554 6245 47045 5588 -38615 -26397 -27389 -19958 -22612 -42961
17238 -42961 -22908 -15222 -49301 -82509 -109142 -135209 -102689 -42910 -23795 7727 34434 -247
17226 -247 -35980 -1609 38213 27258 -5571 -47348 -64456 -71887 -59159 -43724 -55389 -35776
17214 -35776 -21342 -12289 -2011 18616 45286 47165 19342 9545 -18395 -38533 -26586 -41985
17202 -41985 -55049 -66455 -56366 -44485 -4932 22259 31249 37488 29460 21058 23889 77961 72090
17189 72090 17006 -11081 -42698 -51215 -30977 5006 2945 3082 -30448 -23037 -10788 -9383 -41759
17176 -41759 -80686 -55705 -5679 45904 59074 59659 55582 45484 20203 23280 10512 2749 2221
17163 2221 47761 89868 62697 2169 -44675 -18886 26691 14855 17363 37275 2450 -22865
17151 -22865 -18272 -23226 5079 20263 27302 33984 9199 10257 -6235 -2603 32656 9969 -13714
17138 -13714 44930 69554 -1936 -30171 -22931 -45212 -60121 -22491 -37221 -38687 -53834 -48351
17126 -48351 -62045 -35021 22045 -9645 -45499 -36358 -31128 -26369 -7993 -8171 -20227 16135 20066
17113 20066 -11386 -17130 12746 -5872 -14642 -12233 -31330 -22313 16712 16944 9212 -1219 -17623
17100 -17623 -28980 -63634 -54104 -26950 -52631 -46705 -46982 -74913 -58206 -56243 -39092 -24079 6378
17087 6378 -7169 -473 -30066 -31980 -35669 -74094 -62369 -14515 1127 2070 23762 54983 49119
17074 49119 76093 43223 83747 87412 73211 71652 58403 22423 10771 5952 -8026 -23898
17062 -23898 40170 74107 73633 21886 -14684 -45727 -21472 -15737 3877 10521 15395 13218 47664
17049 47664 36736 22864 47934 24719 -14924 -2562 26464 -15295 -52881 -57400 -50657 -35353
17037 -35353 -11389 -26932 -36992 -44977 -40008 -36379 5290 16632 20782 54753 65851 68424 21093
17024 21093 13651 -7984 3874 -15579 -37060 -17952 -4986 4978 1902 -7743 560 54181 48871
17011 48871 18216 5749 29596 45159 21908 9940 -2676 -26461 -62556 -83012 -101253 -82175
16999 -82175 -63721 -26294 4450 -7981 -29038 -83979 -125427 -82660 -23906 -2081 4857 -23373
16987 -23373 -77744 -106875 -129159 -112519 -71869 -34587 -19662 -20358 -28726 -29611 -2499 -11249 23494
16974 23494 18515 -735 -39601 -41107 3907 -1437 -12697 -43710 26286 48867 22546 19840
16962 19840 16910 -46 -11400 -32174 -24436 3287 23727 20430 6007 22551 17552 13517 38219
16949 38219 29851 13552 12435 28450 24217 48699 66636 37996 -2676 -24419 -13360 8944
16937 8944 19859 24887 24968 13992 31684 39787 4064 -9777 -14481 -32414 -28367 -22336 41969
16924 41969 28639 -35372 -26738 -1393 24362 -13857 -35769 -10891 23218 21369 11568 12156 808
16911 808 -14047 2572 38407 22044 -6924 -32140 -39678 3818 58348 23490 -11569 -61286
16899 -61286 -62861 -69208 -5109 10777 9554 549 -12795 -27653 -50472 -45183 -18509 -33300 -58724
16886 -58724 -29734 -16359 -56967 -54720 794 32082 34286 21420 8861 -7313 8710 12221
16874 12221 -20068 -37336 -7588 5131 -3026 -17706 -48667 -26919 7580 30697 41302 3630
16862 3630 -26444 -64476 -58790 -46997 -77323 -65531 -27353 31888 43164 19409 14437 53439
16850 53439 23851 1888 738 40133 86529 100404 47921 -5469 27444 31918 33613 900
16838 900 -51032 -99789 -89758 -33135 3934 -4863 -17419 3736 47908 72887 70319 53087
16826 53087 13758 -38485 -47548 -49798 -85383 -81153 -83128 -31252 9681 32030 354 -22451
16814 -22451 -59958 -73159 -81472 -96817 -54396 4991 -27080 -28277 -28154 -50024 -44584 -26587 -60116
16801 -60116 -40371 13333 24905 6003 -13510 42213 24293 -25608 13837 9246 7030 -23975
16789 -23975 -46034 -64258 -78288 -61960 5 22268 5653 -20106 -32821 7877 35952 26736
16777 26736 45112 32233 -715 -47931 -85741 -64431 -16284 -22629 -43575 -61551 -47484 -33559
16765 -33559 -23867 -16571 -2802 15785 28032 1122 -19562 -1571 -2492 31854 46653 6385
16753 6385 -16143 851 -23049 -33109 -34509 -14454 -473 13429 60825 19228 -27553 -38005
16741 -38005 -49693 -36789 7521 48019 36570 31288 -2231 14173 25386 1714 11913 15013
16729 15013 -25577 -69249 -34293 -12540 -6454 -20161 -39997 -38164 -21272 7807 -3161 -52737
16717 -52737 -93497 -92328 -56749 -37182 -72549 -55814 -62788 -35545 -12086 -6017 12861 8641
16705 8641 20957 28873 13406 13263 34100 27172 33787 -14752 -56592 -45359 -21512 -12038 18852
16692 18852 39958 44404 17071 -23256 -80189 -136776 -102811 -37324 -12801 13406 29344 28987
16680 28987 8379 -2555 3622 -27022 -55557 -80009 -73708 -42174 -50410 -45999 -28883 -45797
16668 -45797 -47098 -21913 -50876 -9919 -20216 -16773 -14647 -9069 16868 38435 33038 36460 21304
16655 21304 32843 58289 59714 73395 90229 83692 38395 -12079 -22541 -32660 -31293 -26769
16643 -26769 -25797 -23720 -13322 -7549 -11289 -3653 7586 -10649 -30929 -11747 -3393 -27175 -42431
16630 -42431 -45825 -6889 -8067 -29210 -40118 -28691 -7549 -4792 -1115 14086 28346 24406 12083
16617 12083 35540 6983 20666 43756 43362 50674 55974 15422 6787 23017 17114 -32732 -34625
16604 -34625 -17513 -25579 -17700 7835 -930 -27801 9032 22430 -30154 -26679 -32486 -28145 -3954
16591 -3954 2355 -14466 2456 6743 6257 7749 25281 14807 8996 50057 77141 35455 32040
16578 32040 12995 -31412 -8527 -1318 -5637 -38365 -73107 -28513 -32660 -72215 -87909 -75495
16566 -75495 -59525 -49744 -34940 -42808 -81496 -60254 -7830 -33492 26556 40826 -3032 -8455
16554 -8455 2852 -3659 -30179 -49142 -28086 -14956 -30754 -18046 -19267 -18579 15063 34665 41474
16541 41474 33427 58866 31196 -32729 -57269 -56898 -62783 -61341 -45014 -49245 -29918 -35912 -51247
16528 -51247 -56954 -25466 -2897 -16862 -43460 -38624 20597 37371 28186 5748 16687 25969
16516 25969 36168 52813 67714 61183 46538 42060 10096 236 17482 13233 -8645 -19877
16504 -19877 7259 -12402 -45761 -40433 -19741 -6079 -8672 -20807 2691 29450 -7992 -34318
16492 -34318 -7910 750 -9270 -3706 -38300 -59807 -35228 -24976 -19580 -2075 37506 60667
16480 60667 19650 -34450 -57054 -76064 -66879 -40106 -15871 19771 19942 16170 2627 -15133
16468 -15133 -77816 -47622 -12702 -6150 -24051 -55493 -42145 -31145 -9206 -7847 10373 140
16456 140 1372 -13992 -13717 -37426 -59906 -35157 -16214 -5609 17240 -34738 -17143 -19307 -10772
16443 -10772 15377 48463 46776 29263 17470 4364 17720 47257 11129 -45740 -40374 -58327
16431 -58327 -75679 -31945 -19293 -1675 -3996 -4288 -27320 -28578 -6022 12246 -2908 2149 -3242
16418 -3242 -11184 -18816 -38577 -41716 -52163 -26544 -29631 -41499 -33651 7861 -2206 -27396 -12113
16405 -12113 8886 25019 35331 -4108 -15602 -53707 -51091 -18626 -6992 -39821 -35517 -4434
16393 -4434 22026 9070 -16219 -32513 -43609 -37210 -19489 -29517 -28174 -14555 -9428 -24701
16381 -24701 -63574 -49392 -16685 -26435 -7536 16337 -23595 -81291 -76393 -54079 -12282 37035
16369 37035 25926 15772 -15221 7165 42024 25043 44654 58274 48925 34489 11699 -24719
16357 -24719 -3667 38459 26970 20214 48857 37670 12109 17220 20228 -10651 -36908 -34268
16345 -34268 -11275 -10849 2891 31169 8654 -45587 -84313 -61673 5247 19124 -28870 -34885
16333 -34885 8346 -34557 -49590 -3095 35 -15559 -3838 13471 16106 16159 -13518 -39251 -26084
16320 -26084 -2780 -15529 -43460 -77525 -62998 -64027 -66972 -71528 -88613 -55838 17085 11943
16308 11943 32672 33516 25587 -15184 -26441 -6124 13930 30450 47215 56719 66997 71890 57589
16295 57589 50175 60237 76759 85814 16368 -7835 11345 26681 9980 -14644 -28137 -28380
16283 -28380 -21749 -37865 -55470 -15443 17390 -12638 -20811 -38446 -1739 34670 40674 38687
16271 38687 18159 -24898 -18238 -36581 -42798 -29608 -44996 -74249 -69698 -30531 -2684 9711
16259 9711 3415 -6004 29557 40423 34314 -4063 -25412 -8208 -54836 -42711 3183 1849 -20718
16246 -20718 4768 994 16216 69278 87900 65626 69475 66516 58682 48716 10011 -5439 30085
16233 30085 49942 57688 24813 21409 5746 -27865 -53036 -36487 -15817 -27217 -11540 -11547 14777
16220 14777 21435 29 -16860 -18343 -33398 -34805 -57999 -29208 18401 33011 21513 3698
16208 3698 6793 31789 29961 24040 -1134 -6587 4438 -25885 -27611 -13157 -10886 44656 100472
16195 100472 76452 51422 27505 -1278 -56389 -76817 -75092 -71003 -46545 -5881 -14368 -10891
16183 -10891 -18184 -49851 -28839 -37958 -23902 -18300 -23225 -16303 -58 20782 52193 30869 4228
16170 4228 1952 -55349 -69772 -55588 -39609 -25865 -52108 -59909 -52763 -21799 -10139 3377
16158 3377 8788 -12848 -3483 -22720 -28643 -9224 -9744 -6522 16300 13019 1828 -10916 9561
16145 9561 160 -8855 -24737 -32196 -16145 34482 35725 15916 15461 3971 -23329 -26021 -7953
16132 -7953 9745 9083 27095 29669 15324 2224 -16780 -44790 -47903 -36992 -18524 -6837 -24927
16119 -24927 12001 52643 89494 58763 -20193 -11833 16590 29009 27721 8630 33976 35080
16107 35080 5055 -368 -23645 -43865 -64463 -19750 31453 36012 -13651 -34533 -22878 -2141
16095 -2141 -18857 10234 53918 45412 34394 26659 18744 26310 21359 -14087 6957 44627 61290
16082 61290 96525 105998 62178 9330 -7896 41454 77576 81268 46271 30825 32283 14481
16070 14481 29305 32330 55081 47725 -4662 -81404 -87737 -58188 -56117 -51377 -972 -25114 -31878
16057 -31878 9061 6561 -21902 -22159 -11188 4793 -4614 -6428 4406 36779 40797 12114 25786
16044 25786 37946 31129 -4558 -27687 -26454 3938 34358 31127 -12697 -46657 -40924 -7572
16032 -7572 -4903 -11465 33913 16726 -7414 -31293 -44690 -69797 -5459 5059 29212 36510
16020 36510 -25277 -27072 -14000 -33703 -15303 37237 73949 44724 6584 10665 -44925 -33564
16008 -33564 -12231 -23446 -30759 -694 4262 4118 -8906 -12669 -25346 7825 29681 11480 28611
15995 28611 46075 27666 -5976 -27418 3884 47695 36016 5511 -13399 24883 50999 39394
15983 39394 31084 -4427 -26061 -21233 -25929 -17184 -27755 -75889 -56939 -42940 216 6981 32816
15970 32816 16223 8750 24014 4907 -30125 -56089 -52998 -26280 -8783 -18242 -34307 -34066 -26411
15957 -26411 -28594 -61785 -37263 4036 11289 -20513 -14311 -25054 -36251 -10009 -1220 -6207 -18077
15944 -18077 -284 -12358 -15372 32124 61028 28282 2177 13521 28870 12229 1513 -756
15932 -756 -3915 39531 35775 45971 48007 21939 46585 46242 20792 -1621 -2234 2662 14044 6099
15918 6099 28749 9559 -40090 -73953 -52471 -11045 20071 -14575 -33051 -31130 -32040 -11044
15906 -11044 -30072 -14686 53 7202 -32594 -61964 -29596 2480 -11619 -29537 20568 23689
15894 23689 1831 -20075 -34252 -61943 -34948 -15986 -9358 -33302 -43535 -31279 -20289 -3697
15882 -3697 6538 12680 32686 25062 10836 26334 8180 -12736 22382 46806 71439 25572
15870 25572 18269 -1579 -41050 -53064 -57099 -41235 -22942 11822 49155 13835 -8288 -17562
15858 -17562 -39009 -29018 -47651 -42586 -21427 -17720 -30933 -25919 -47268 -68870 -30152 -26199 -33418
15845 -33418 -47171 -43373 -44652 -68096 -48302 -7977 -2608 12293 54142 38974 56507 49166
15833 49166 46247 1481 -9714 -4359 10527 7948 -12621 -17572 -6628 10801 20126 -25622 -30229
15820 -30229 -6252 -4478 -52332 -46075 -21435 -28237 -31209 -21540 -14175 -16698 -23447 -61352 -71242
15807 -71242 -90560 -98943 -109369 -79613 -54876 -68840 -86240 -70185 -58251 -51452 -11925 36203
15795 36203 57744 35863 -25078 4855 20567 -26564 -29446 -1799 -12390 -16330 -234 -13685
15783 -13685 -2529 18161 -60 4390 31721 45917 17541 15794 -19576 -40377 -53113 17290
15771 17290 28179 21684 60862 36449 11995 32395 -4180 -22364 -20667 -16590 -25348 -23786 -5170
15758 -5170 451 22868 68569 97467 66169 26937 76375 119631 146233 261166 413537 635820
15746 635820 832292 772374 499985 299679 212865 137938 41687 17692 7557 26707 64986
15735 64986 54723 27273 29335 14065 12801 7460 2311 7835 -9135 13093 36840 8549 -60253
15722 -60253 -77627 -17046 -22807 -20608 -39209 -51363 -58700 -52608 -20891 -9746 219 -25436 -170
15709 -170 50622 19542 -29855 -71588 -47626 -46346 -44795 -80205 -37888 -21223 -30979 -36515 -32413
15696 -32413 -6127 15244 49457 41210 29332 31605 38572 16574 -2642 51109 65777 80288
15684 80288 53179 16082 44785 46268 -10763 -3806 -490 -23788 -23120 -5481 5664 -2443 6759
15671 6759 17264 12327 9909 6165 18659 22095 26980 34260 34385 20669 53742 -1992 -37436
15658 -37436 -15908 -21485 -7740 8973 -7110 9251 -6953 4132 -19454 -50664 -91581 -106625
15646 -106625 -76514 -4957 5267 -17935 22864 26037 5883 -22050 -39828 -7924 9521 27121
15634 27121 40608 11043 35033 38685 74762 33160 -21419 -9148 -10641 -22452 -32109 -15914
15622 -15914 -8715 -12658 -24550 -35475 -4081 29763 11769 1991 10450 80194 77936 40720 -2539
15609 -2539 -29594 -9142 28574 3592 -29984 -33391 -37817 4256 585 -15534 -15116 -6220 -25739
15596 -25739 -272 53973 31634 -17144 -23348 -29302 -58561 -25558 -829 -29319 -51471 -25553
15584 -25553 -27373 -39340 -20345 -40390 -36544 -53621 -49706 -28437 -34060 2751 36205 40895 56552
15571 56552 50542 4451 52455 65005 41406 16376 -4165 -20925 -40900 -72579 -41605 -49166
15559 -49166 -54101 -47365 25017 47462 29215 -3794 -6096 4070 23584 38680 -5175 -16265
15547 -16265 -22540 1174 -49187 -97966 -96173 -81786 -98461 -86215 -35468 -26324 -21298 19210
15535 19210 45945 28753 -3703 5040 1675 -13040 -9956 -17533 -5913 -1815 8163 19302 3365
15522 3365 -24254 -15360 -23611 -21529 -53486 -10610 45690 51214 10372 -35902 -48739 -76294 -70270
15509 -70270 -36488 -24127 -9737 -10803 -12092 56146 82818 120839 119857 100847 91079 46786 26114
15496 26114 29337 1402 3202 -16421 -12664 9870 10694 10003 2975 -31605 -44085 778 15514
15483 15514 -32146 -39431 -66486 -81467 -37828 -463 6253 49504 47392 39081 9156 1322 32393
15470 32393 32808 -4008 -23450 -22029 -25888 3774 48505 55327 -846 340 8251 -21484 -9363
15457 -9363 -40897 -91091 -86415 -100626 -84370 -57778 -39389 -25750 -62159 -50506 -21620 -20836
15445 -20836 -36655 -1870 6639 743 -35140 -31605 25954 51487 32803 16199 43965 55537
15433 55537 42898 44193 67735 40991 28879 35481 35441 1163 -19576 -44543 -71450 -30270 -2636
15420 -2636 4656 12852 6133 59045 60218 20341 -23759 -14293 10308 13685 15499 -36453 -39348
15407 -39348 5459 21352 46769 33210 -15554 -45822 -61781 -77009 -30463 -21253 -41018 -38956
15395 -38956 -20276 -32733 -13563 -21108 3013 38129 25994 6995 -43339 -33088 -5941 -14637
15383 -14637 -42846 -14394 5821 17356 32581 11230 -4824 -51871 -71375 -58747 -47633 -43240
15371 -43240 -63302 -40758 -39050 -66299 -51496 -12427 -20690 -3384 -25764 -58013 -53838 -6241
15359 -6241 11818 -24372 -86370 -100072 -79945 -100740 -102700 -71064 -20058 -260 -5889 -22311
15347 -22311 -2760 3450 -21743 -41025 -60608 -67914 12110 19660 -24912 -37072 9170 802
15335 802 -27810 -53938 -67994 -30096 -24776 -6152 742 47085 57982 57409 24321 13883 26612
15322 26612 49376 53573 44936 53838 35293 -27510 -44303 2836 19200 -12663 -14723 -8388 -3827
15309 -3827 -31137 -54289 -89478 -71465 -62242 -73807 -40555 -33509 -22386 -26982 -11374 -15281 4214
15296 4214 30578 15185 -11029 26194 34397 15924 -976 -5198 -918 -15147 -52936 -38813
15284 -38813 -27650 -8908 33401 40187 34819 30864 -8700 -2496 12958 7945 -22665 -7536 41108
15271 41108 32781 15025 16999 20631 36330 2590 -57024 -63980 -32297 9146 13296 784 -28061
15258 -28061 -41242 -50124 -38254 -5402 6288 4617 -12039 -33913 -33015 -33680 2891 19814 30461
15245 30461 30085 -4341 -2317 24900 35470 9990 12575 18440 27384 3503 -17430 -41568 -52453
15232 -52453 -44269 27491 77127 63924 23911 -243 -11504 -3 -20282 -27536 -9364 -10307
15220 -10307 -6349 43204 63440 54134 62444 19464 17219 36000 39949 41439 41523 35847 27189 13058
15206 13058 28800 45135 19799 -5333 -9286 -10591 -872 -10838 -59282 -69408 -78952 -55672 -35805
15193 -35805 -141 -5185 -7830 -14684 -19642 6746 -17196 -40853 -17346 -17603 -4414 -14593 -65394
15180 -65394 -16856 12888 -19279 -4394 -2750 -8205 -26101 -38999 -22598 -33968 -19925 5149
15168 5149 40961 84605 97462 82919 83480 83966 70193 58383 67283 35268 27901 60052 78081
15155 78081 65674 80968 57740 50022 45770 19818 -7675 16346 28427 35995 36827 8931 -7442
15142 -7442 -6012 -16355 -20462 -15272 -15151 -2619 5479 -41658 -36374 39578 58150 46411 20140
15129 20140 33394 59041 59663 39218 36499 28635 39440 -21165 -16642 -35604 -25209 2618 7231
15116 7231 20892 10693 -13297 -11725 -8009 -5060 -8795 -15979 -39986 -52274 -42042 14935 64508
15103 64508 80337 88694 64715 19473 -34618 -34318 1936 24399 4469 -45940 -26233 -10949
15091 -10949 -49273 -64537 -48365 -14015 44212 40303 44565 37949 23749 -13464 -35384 -22567
15079 -22567 -4582 2438 17398 49059 41186 39201 13622 29430 23246 9500 14868 986 12473
15066 12473 19263 -10407 956 6525 6716 -5369 -25082 -39061 27233 24364 15486 34192 21570
15053 21570 22652 10473 27822 32164 31978 37002 23917 5157 -7713 31495 57154 55626 65940
15040 65940 40362 2545 -7033 24999 12030 -65629 -79071 -71642 -36307 2948 -26832 -51163
15028 -51163 -63034 -46170 -29869 -64188 -40045 -31257 1916 3720 19444 4105 -16899 -26471
15016 -26471 -26675 -2939 6180 -15839 9539 15851 -31357 -25671 16640 52118 66966 65742 60163
15003 60163 74438 27706 -20891 -38437 -21645 38947 86716 65504 60929 36800 9092 -32882
14991 -32882 -30611 -15295 -16467 -66187 -72367 -67548 -49260 -53588 -31109 1228 38743 72795 69488
14978 69488 26308 -1251 -6028 17270 -3041 -13839 3162 26835 6098 18989 22435 23356
14966 23356 27630 24315 25826 36525 39022 45170 28380 -18024 -31367 12978 -2852 -24699 -44224
14953 -44224 -57409 -23654 5456 9399 23418 24281 -25829 -32602 -42279 -84415 -50483 8531 63590
14940 63590 62586 59257 27156 -3946 36077 28310 -4958 -38683 5016 51212 55013 21723
14928 21723 60966 111038 59578 16837 20466 30375 40083 8606 -18819 40146 36946 43095 53068
14915 53068 8986 10674 59070 96709 69384 64279 81310 79026 27169 -5315 -31713 -47664
14903 -47664 -44786 -21600 23411 64347 118574 142827 126032 58661 -12090 -50110 -52463 -21447
14891 -21447 -7080 2943 70 39838 54128 17815 -2841 -3662 36950 69192 82211 90559
14879 90559 62835 51815 55821 55446 29894 16501 -7249 -43623 -47760 -21401 2014 24367
14867 24367 2756 -40640 -16659 32861 25894 -7016 19905 29985 26827 28541 58397 24081
14855 24081 -27787 -47312 -50814 -43280 -26630 10585 54029 103958 116060 82110 64230 55536
14843 55536 27646 15295 -22569 -17665 -7589 -18342 -25559 8759 -9429 -31862 4730 27150
14831 27150 -8346 -29132 -43336 -66429 -63503 -31588 -9616 1100 32807 58114 31773 -4402
14819 -4402 -3759 5157 51198 110968 77136 51192 7188 -3067 -44131 -37777 -1045 9665 16219
14806 16219 26910 6448 29257 43302 -23459 -34828 -31050 -14607 25738 64685 67715 38067
14794 38067 56155 83199 89113 45468 18135 16856 -5390 -19835 -52075 -30657 14613 1121
14782 1121 -31089 -29645 -137 -18789 -45825 -38126 -3997 15925 22852 26026 34643 64156 38584
14769 38584 50812 68554 50085 50526 38664 64817 57615 59653 46748 51538 107153 93394 75521
14756 75521 54461 38408 29784 20590 -2342 3080 13376 41697 42912 37562 49676 -1374 -30924
14743 -30924 24971 22015 -4048 10499 29047 41463 39423 597 621 29098 49525 63513 54098
14730 54098 36735 51944 457 -52301 -58629 -86510 -96500 -58000 -58453 -61871 -41729 -22580 -11823
14717 -11823 -10605 12879 20811 -14806 7958 -6192 -27108 -27428 -33448 -23892 -29546 8451 8428 -29224
14703 -29224 -22151 -20019 -38745 -25236 -22547 2546 19713 -7083 -39079 -9220 33125 7808
14691 7808 -1999 19102 23475 55701 82417 62300 60131 21904 1993 -25842 -24144 -24877 -13237
14678 -13237 -22572 16002 50137 50229 36618 49873 88272 107769 62120 38010 8192 -1644 -735
14665 -735 533 8253 25566 18283 12415 18369 27890 50475 59479 79002 101026 63235 32554
14652 32554 21504 20391 2003 -16951 6891 35297 36616 45792 32264 36880 34424 -5340 -47720
14639 -47720 -18180 -11328 -38886 -16202 -11844 -15290 -1000 35922 39205 21940 12139 13323 -14511
14626 -14511 -28790 5535 37615 43494 40187 61707 91014 89072 54089 19906 11294 34046
14614 34046 65005 69635 74026 30339 64986 98198 90023 59557 58423 46696 27141 2612
14602 2612 29697 46075 87055 72955 -2954 -32394 -40920 -11153 28070 10618 -32313 -29725
14590 -29725 -46766 -36468 10226 59214 103354 56369 9450 -15543 -10385 73538 69104 52179
14578 52179 25670 11869 13540 74 -2745 23198 73145 85453 101592 105730 109624 105935 127336
14565 127336 111868 86377 59502 47990 88257 77844 60836 54843 64290 92674 117235 151737
14553 151737 97855 35619 25705 41460 31705 33450 12864 2714 5705 18947 30612 36800
14541 36800 84452 39937 -2913 27616 96580 85721 65770 55818 41124 55995 60821 53261
14529 53261 37054 61320 55037 18386 31774 31659 38974 62483 28857 41399 16895 3082
14517 3082 -22478 -36477 -38430 -37231 -22138 -19673 12465 37815 64364 46930 28085 47551
14505 47551 63989 57783 59030 66675 71871 56566 43079 28652 58783 74385 66285 45000 25906
14492 25906 12776 37777 61149 28209 5741 17627 8031 36128 57563 64536 46536 29417
14480 29417 15307 326 32108 78269 74021 77333 69130 66370 84395 65256 75308 45052
14468 45052 -11337 -46031 -28908 -13564 528 18230 -1423 -30965 -32305 -20399 27878 46977
14456 46977 37325 34420 31240 4690 17892 60847 54245 25133 5838 -8816 -17232 14132 14565
14443 14565 -26008 -20290 18227 16736 -5771 654 30309 38177 34313 87827 93387 88484 25701
14430 25701 21463 25635 10207 -16422 -20135 -20566 -24063 453 25149 57654 42044 17449 29482
14417 29482 -484 14803 59034 21230 5704 30906 24563 -8303 -22506 -11452 -11136 -7569
14405 -7569 10387 28563 21781 -19019 -5613 2014 -28745 19365 69165 80803 53807 740
14393 740 -31606 -30971 15059 37643 73493 93843 107521 83359 77920 80232 122769 146275 118228
14380 118228 128100 54893 39976 58948 82304 75893 22015 3377 6475 47995 70548 65219
14368 65219 44190 25027 -24051 9601 25378 8707 19255 35729 8923 -8120 -18813 5768
14356 5768 21227 97683 100695 60373 12758 -4048 2410 -38881 -19273 -3396 -34915 -52534
14344 -52534 -38386 -3754 19746 -1309 -20205 -37934 -44599 -38491 -17267 -19649 2193 11136
14332 11136 -2591 11331 7427 33737 55084 70492 53614 52495 41745 33143 27523 16271
14320 16271 4174 -9423 -18389 -11210 -11132 -19658 -5502 18838 37195 23644 37949 43010 27683
14307 27683 -30447 -17860 -39187 -25483 11462 22734 54836 75244 53031 19076 25105 25625
14295 25625 11967 -824 15956 42815 40783 10516 9034 -11207 -49499 -24386 -23692 -14510 -20645
14282 -20645 -40095 -63948 -104927 -95361 -61289 -38964 -35828 -4629 12003 17925 19231 11685 15715
14269 15715 23359 25672 56991 43349 1432 -32810 -23058 25021 52175 55632 72322 76135 93727
14256 93727 80531 76756 57351 48023 23890 -176 32071 48300 68871 56400 35919 36915
14244 36915 48975 50979 60841 19830 53951 88333 95844 55818 26016 27674 49382 70256
14232 70256 65495 50608 52509 64300 66576 54423 36331 27067 -8781 -3331 43741 41903 12625
14219 12625 -22699 -38872 -43934 -70576 -85842 -36047 -21401 -3899 -5357 28218 23898 20373
14207 20373 -17850 15568 47982 30519 29631 24594 12077 55386 55557 28623 29294 24887 28609
14194 28609 26698 10288 -20324 -30366 -39940 -40839 -23771 -17704 349 2461 -19347 -33897 -17665
14181 -17665 10742 72962 54300 12484 -6805 46239 128550 127571 70447 7913 -26567 -36866
14169 -36866 -28145 -1524 -8956 -19629 -1804 32550 39246 3519 -18637 -11694 26612 53368
14157 53368 84105 90650 53684 13460 11253 17127 98 19984 31217 17767 -9324 -10965
14145 -10965 4553 -12061 -40322 -50289 -51794 -29810 -18058 17255 55949 30682 10818 28266
14133 28266 46751 33223 63420 56214 18085 -6023 21256 40899 71494 69913 36840 56704
14121 56704 76084 67905 89602 82161 32736 14410 25719 41696 68335 68252 52908 -8396 32320
14108 32320 14797 17805 48528 39353 50375 65200 56190 40548 43749 74326 60884 47886
14096 47886 51730 62009 47788 19642 26672 24864 49428 46945 55978 75391 77630 52845 70320
14083 70320 111119 116198 108282 104900 54120 -6547 16545 42574 85502 59248 33868 22147
14071 22147 35400 61948 57342 67733 14580 17461 30237 59317 78243 66023 35228 38078
14059 38078 28106 14326 -3189 22444 48804 29439 62656 52357 28292 19786 34451 21939
14047 21939 -818 -21855 9383 -12986 -21242 14154 52343 60282 78384 76041 58382 11685
14035 11685 1914 9697 -10828 13789 68638 79008 29735 11783 48293 43422 28926 25494
14023 25494 50476 75827 61125 53006 19892 5586 21829 75803 87217 51997 52703 81667
14011 81667 120623 100532 89261 95369 95805 55952 13278 -4789 -5263 7682 33334 17183 15877
13998 15877 36597 24619 13444 26883 10144 -12675 5080 24259 -285 -4174 34580 62451
13986 62451 49296 28978 37821 60252 58737 67272 101948 94949 82216 43582 39155 47259 41609
13973 41609 39871 27832 -22388 -9930 38310 73064 87355 5070 -21428 -33880 13130 17409
13961 17409 14076 -23870 -61098 -39573 -5944 55721 104424 56375 25616 18958 65493 79980
13949 79980 30654 36555 63180 69760 38969 28734 -450 -4881 36922 48755 50621 -17052
13937 -17052 652 34856 27576 12677 9391 27642 40418 12928 -6925 -13636 -51089 -62428
13925 -62428 -20105 15805 35973 15165 9168 3438 5473 -15080 -17923 -11397 -22365 -36498 20666
13912 20666 35065 61064 40796 23900 29363 -8706 -29249 18457 26185 16257 48336 75048
13900 75048 79799 64631 22425 3875 28441 58946 63605 75911 56349 54708 20855 -15706
13888 -15706 -30799 -1050 5001 14028 40404 26209 34844 54931 12372 -41685 -4717 54975
13876 54975 90866 98172 65734 73904 54526 65891 68026 54587 32271 -59 -999 21058 43074
13863 43074 61977 76732 93374 70126 64502 65197 51000 54855 84524 97850 63830 18569
13851 18569 2038 51886 68945 58210 -6010 -16656 -22256 -25880 1085 -21930 -68424 -68528
13839 -68528 -46166 -31700 13001 26832 44168 50030 90636 141074 129011 120377 104244 68741
13827 68741 30748 37724 35577 12162 36189 42609 16951 27614 39906 46620 53072 46470 82740
13814 82740 113863 131126 90277 58359 75773 96065 85802 74611 62720 67116 78277 79125
13802 79125 83717 104847 110002 80164 38249 -7483 26 24838 20919 43449 30297 28088 -1636
13789 -1636 -20233 4181 14014 24226 6567 -8563 656 34274 53276 59638 74223 79485 111302
13776 111302 151192 143720 119591 86015 59213 58918 78529 94429 115592 113702 58112 85195
13764 85195 130538 109531 101752 110271 135128 113362 47832 35062 33607 -2768 -3882 48240
13752 48240 50612 45013 26508 -5755 -16222 6539 39439 74585 63608 47952 48524 35601
13740 35601 23187 28856 12208 16870 8073 10601 13121 6597 23758 68687 26024 15274 54586
13727 54586 40157 30186 52384 27342 43753 80147 100521 103265 105648 103800 79624 44640
13715 44640 -4934 -9285 37856 92570 116670 105675 94160 87202 51517 7136 15080 45442
13703 45442 80000 86780 128396 111222 61419 32382 68563 44593 58659 67512 62939 84903
13691 84903 81219 77933 61279 70088 104225 105642 71045 29895 20062 17660 24886 25013 13832
13678 13832 14564 29261 16869 -9761 29088 80154 61547 31367 37744 25914 37453 95073
13666 95073 101225 76493 39548 44533 71307 23929 20895 60046 86476 63233 68182 52680
13654 52680 43206 65600 105224 119247 97044 59196 36733 36568 29133 90960 130647 143037
13642 143037 108150 109238 87108 56198 31268 33571 53067 86015 89250 128092 116026 107969
13630 107969 113368 102678 74168 61495 49821 31812 6984 21429 37585 53517 35759 60540
13618 60540 91365 65620 75305 97537 120210 131277 126125 86798 36585 60206 46983 7389
13606 7389 -433 5363 38722 60247 43662 13674 24806 63404 74704 105016 109111 111547 88023
13593 88023 75725 112237 115064 93586 48919 42377 32629 41563 81095 151401 152814 83490 60272
13580 60272 53872 26281 20115 -4702 -22830 10511 78130 108821 103923 107578 107754 90016 78802
13567 78802 94171 101510 82592 81147 63620 68645 41760 68687 80638 65573 55365 31010
13555 31010 11694 92413 121451 100872 94071 98373 90399 86672 23240 44353 96899 125194
13543 125194 96209 94964 112282 135785 137639 94759 104614 107875 125466 115985 79413 77388 63146
13530 63146 75917 94544 103730 117788 120696 110781 113618 88706 56399 49331 48393 95700 132372
13517 132372 128126 133434 159385 171625 186225 143177 112322 128920 119707 119757 144029 132143 92301
13504 92301 88733 93354 92992 102952 98620 79682 105022 134857 142393 106653 105971 126804 121141 114313
13490 114313 74003 88137 115382 157140 174650 170962 190547 208502 217928 175824 136051 129872
13478 129872 119307 70471 69795 100896 72419 41300 42645 63245 84239 98914 96532 84091
13466 84091 81433 68239 7053 -10434 2735 -1658 37277 44658 97774 122050 89054 82604
13454 82604 25215 3132 41904 44253 20026 -12995 33182 65286 88583 84404 66915 44994
13442 44994 63617 136238 141284 142402 131360 148440 135006 153273 172755 144668 69584 49350
13430 49350 89300 122802 146418 151888 166397 204193 188477 158519 140373 120300 75021 42312
13418 42312 86011 114911 142280 156910 117882 90571 93340 71587 49231 69927 77256 71389
13406 71389 114987 160315 149906 116304 112927 102175 68110 64092 87646 77679 67714 72472 108258
13393 108258 132034 110856 57538 58742 89441 100451 100782 92640 56885 47825 67798 77915
13381 77915 69888 101308 116203 154073 151232 114365 77480 74449 97121 107356 83931 78728
13369 78728 113834 160637 117257 94045 131630 125670 89643 52727 76518 79601 46909 10889
13357 10889 27139 76623 102228 106990 118892 125818 113276 77901 118554 124615 108290 123029
13345 123029 81629 77063 114309 149492 169551 159687 111032 65200 80079 99115 114793 157549
13333 157549 121683 51813 71275 113914 116299 80116 66684 69118 56348 87534 116048 123368
13321 123368 141731 168897 171490 208547 215857 176510 202331 252830 291343 328626 386828 460203
13309 460203 597478 677281 790084 910195 1096194 1316242 1566164 1786644 1968515 2119619
13299 2119619 2225004 2206972 2076762 1869696 1707233 1494337 1275763 1074921 931370 801271
13289 801271 659620 570166 505475 450038 392446 331292 316783 307194 257375 246621 204625
13278 204625 201046 178839 166601 147826 157414 172846 176520 184504 188244 191500 166003 173069 183615
13265 183615 151760 163656 148552 106435 76801 100973 137903 138386 105868 115839 119221 107558
13253 107558 124059 155049 145116 153614 191790 170116 143171 163011 168687 152365 190922 180687
13241 180687 198438 187459 185938 167660 139309 143158 149254 120214 113938 89622 65797 67918
13229 67918 108337 129604 123438 119877 110019 154849 149296 134540 152083 144816 141123 159448 164657
13216 164657 143106 120956 147884 103294 86247 77458 109453 133969 120197 132343 132439 136013
13204 136013 127507 135565 162725 182311 188178 179273 199371 204360 183876 176832 171263 198853 135383
13191 135383 123911 137105 129911 137511 169739 153233 179119 173023 165474 131911 125572 134455 119771
13178 119771 99279 92569 101177 86562 90644 68960 85431 129574 134453 112913 86299 65781
13166 65781 91976 49949 16556 -15057 -15489 1133 39391 50760 53824 87153 108298 122974
13154 122974 128271 148491 186474 187425 200626 212093 201075 200442 241300 272871 294279 246519
13142 246519 230274 197931 175134 178616 188526 198124 158291 153221 195440 235695 252487 257149
13130 257149 258751 247399 255970 303783 323264 333589 289947 241686 255531 266183 281686 321992
13118 321992 339269 312547 337214 338622 369844 420370 458139 464538 497883 513356 560474 568696
13106 568696 551716 543753 531528 494994 459188 436484 410273 365753 310818 259551 240308 267086
13094 267086 283323 297097 319450 346498 315575 284977 266245 251475 261791 251343 278181
13083 278181 305383 360507 369469 342240 331586 330304 350221 431430 463113 477311 491237 509043
13071 509043 539311 581218 630870 668685 753734 875327 958226 1067344 1185425 1173921 1094946
13060 1094946 1041953 984724 942560 981397 1060347 1206859 1436691 1827335 2245192 2617951
13050 2617951 2742239 2542598 2173888 1841685 1631051 1528947 1429024 1383594 1493630 1723579
13040 1723579 2045690 2456382 2804125 2864983 2577238 2132892 1718109 1453490 1272435 1124745
13030 1124745 1055257 1041220 1086831 1179125 1290363 1334973 1305716 1162893 999056 847390
13020 847390 767189 674427 606804 551664 519206 474851 455634 448026 423223 423995 422044 406516
13008 406516 402441 420646 450544 492847 456978 443087 428319 391329 414569 447569 439372 453072
12996 453072 419020 409348 428743 421126 459618 503585 451929 456925 472750 476416 441869 453633
12984 453633 473076 511790 504480 525592 576885 566809 514826 495372 513899 547669 644314 695689
12972 695689 690737 651740 699669 688996 694761 707859 678894 658307 643211 654971 684919 739350
12960 739350 768501 778411 776984 752309 743392 775513 788984 777663 736412 728309 737864 800627
12948 800627 830917 792257 744008 730480 776478 844469 864134 856256 875308 916042 942200 975601
12936 975601 1020145 1014127 1029185 1072668 1100816 1114575 1095795 1096774 1135550 1117047 1157122 1176355
12924 1176355 1198823 1238677 1271005 1331949 1379476 1405749 1406211 1425034 1499393 1554951 1620824 1667494
12912 1667494 1718874 1781305 1851540 1880490 1897392 1971796 2107737 2203282 2287149 2385994 2488871
12901 2488871 2553973 2597333 2704264 2846639 2949924 3110760 3283976 3415873 3560490 3704667
12891 3704667 3893714 4117988 4367693 4608990 4866666 5203007 5574819 5915859 6369802
12882 6369802 6833520 7333330 7948544 8662224 9454317 10284575 11144151 12158868 13346378
12873 13346378 14810961 16512263 18484245 20900086 23885112 27621531 32407914 38645535
12865 38645535 46939042 58152271 73318316 93736617 120571278 154386883 194750115
12858 194750115 240400805 288142248 331619684 365358913 388332482 397521823 388136809
12851 388136809 363285970 329799876 288730695 242476243 198329003 159950735 126915344
12844 126915344 99434028 78160242 62323783 50577785 41727633 34865241 29416304
12837 29416304 25077458 21566530 18678148 16333890 14396924 12803263 11444799 10301339
12829 10301339 9311267 8468402 7741390 7135548 6602679 6126453 5732608 5406836 5081866
12820 5081866 4772576 4501433 4210705 3943851 3756015 3533589 3315401 3143409 2986664
12811 2986664 2834102 2645134 2507261 2379157 2277171 2175821 2102549 2051641 1970676 1917767
12801 1917767 1878678 1806373 1766979 1703779 1637281 1611752 1528638 1422443 1360688 1358109 1350258
12790 1350258 1284977 1226055 1157017 1110226 1115372 1064732 1038119 1013336 978014 946395 922011
12779 922011 887733 865788 807392 739181 725979 723831 717215 686868 650519 657346 636193 620991
12767 620991 586355 590454 580768 530256 499566 496498 527127 511997 478445 427337 410694 419827
12755 419827 404257 400946 417025 467494 470441 437161 424028 454408 453765 426451 398402 436881
12743 436881 461816 450433 424240 427839 402952 383344 357583 330190 348063 375889 389508 398579
12731 398579 379358 373468 376336 454136 505300 528733 515701 504742 470195 442418 423752 414662
12719 414662 402094 354163 357835 363429 389230 406753 402712 382643 351086 344565 333131 353589
12707 353589 381446 326524 299090 272389 276689 295679 296042 310864 315070 293698 199839 154328
12695 154328 147688 194317 226690 194669 166637 191594 223796 241156 263021 261547 255661 210111
12683 210111 198334 179287 168209 172636 157063 157392 205106 241916 214891 212424 190799 207127
12671 207127 240124 243234 255390 258804 222102 227690 250986 229785 226957 208321 155462 176916
12659 176916 173641 166821 195173 205010 221716 230026 258385 253779 250945 260229 245391 215011 195681
12646 195681 143259 121156 130863 120589 111254 82019 72743 74329 31740 26864 51086 49462 49174
12633 49174 31836 21326 9565 48940 99157 99788 73487 123136 149726 155624 123132 129039
12621 129039 136597 162680 238885 249156 200717 179035 195997 198264 178676 168458 127504 108775
12609 108775 112575 148369 161811 155835 116146 136102 152452 176520 153343 126348 116155 144603
12597 144603 167066 145695 120194 141678 99621 47675 56796 67959 86321 90680 70701 118081
12585 118081 155006 150930 129874 84177 76617 79627 105810 116838 117057 131082 155819 148893 122615
12572 122615 119679 108289 133003 148018 147138 114638 102676 97168 127064 142857 94505 98317
12560 98317 145009 112015 92772 70365 81754 114682 135765 155917 176160 193032 209293 234579
12548 234579 287406 308993 303634 274867 316549 325272 288987 304732 292347 265680 229945 205845
12536 205845 191859 201706 199508 178997 163475 164869 192823 217638 222943 177713 171739 208786
12524 208786 222430 218790 188293 172887 177886 170802 117300 69247 74846 94205 120149 147810
12512 147810 141942 155111 196774 212987 224873 216723 202266 218199 199323 197909 170864 163054
12500 163054 118197 146674 166821 176534 190858 198623 175225 187209 182948 189659 192598 151333
12488 151333 153296 145558 161034 168727 162353 190285 269318 258192 238348 274040 272124 260471
12476 260471 218891 185644 154685 154103 181043 187254 216624 225397 203379 229094 211973 191872
12464 191872 225975 238083 208853 192066 178271 203172 194700 205521 203728 193075 170239 168155
12452 168155 193686 170440 178913 175985 172338 199200 227020 234351 255109 232413 203810 199952
12440 199952 199607 242065 279523 298919 302718 293073 264484 233431 265414 303915 292296 289622
12428 289622 313457 325227 321262 285164 288233 310609 330100 341671 312766 324520 316721 326642
12416 326642 362242 422263 448259 460326 488871 560621 667564 794093 948531 1093531 1238975
12405 1238975 1458114 1658059 1861460 2056387 2219694 2262052 2200095 2044767 1849492 1682831
12395 1682831 1488271 1295151 1085305 898340 752063 615602 514457 484323 455395 436942
12385 436942 443752 438709 423702 396458 350486 376658 389922 356249 359503 378866 378942 332199 298006
12372 298006 293284 294025 288440 297686 300667 294477 254885 276672 259373 259221 220986 213297 268125
12359 268125 300006 305160 315201 292899 249578 244005 277601 274284 287955 316767 316061 284571
12347 284571 246909 233392 212164 217666 225688 255595 268951 280822 305235 316383 286993 263687
12335 263687 266578 303428 288718 322894 347238 319000 314928 331012 319035 333051 337887 310286
12323 310286 324122 308921 278453 293363 367881 368309 329686 268266 283873 291804 267338 278068
12311 278068 305681 312157 328925 358528 339253 339481 339623 356850 391256 416303 345560 326738
12299 326738 346839 353378 343681 348412 343496 325327 337746 338433 339557 341979 342400 371867 366008 383507
12285 383507 398826 395781 432338 434487 437446 392859 377545 467250 465359 431459 411197 428426
12273 428426 425267 465420 426900 396237 385931 394828 424545 467682 462569 447696 430568 442702
12261 442702 465324 465362 480634 470386 428527 429019 465627 487500 504715 476682 457172 497723
12249 497723 490999 475630 475487 455006 472066 503770 519093 532402 549476 539284 537428 536714 525252
12236 525252 502365 514140 526387 524388 513089 502670 487284 496070 531951 573170 564931 545827
12224 545827 533222 536066 562928 517421 516653 545185 554106 575244 570091 551904 602449 632408
12212 632408 647139 619575 577120 529680 518106 496783 503030 547743 605620 615938 603297 594242
12200 594242 617741 662201 675385 685683 662063 644947 679868 736903 716563 669473 664286 691565
12188 691565 688580 656900 684948 711571 718504 718651 715113 728091 736927 776523 734088 708614 731877
12175 731877 785656 770182 736656 703383 677575 675953 667453 650752 644877 724048 754660 726003
12163 726003 721158 802502 855093 862739 832410 839768 834211 854387 933556 970154 928457 886987
12151 886987 890540 879692 869287 907495 901632 889443 911296 945780 997442 975176 952711 935265
12139 935265 932583 1009246 1065403 1041291 1000304 1030842 1001015 995714 1021317 1042114 1068321 1087817
12127 1087817 1079290 1060278 1091648 1110108 1125511 1131547 1137681 1147966 1145278 1168059 1172162 1148031
12115 1148031 1168742 1206477 1207910 1203098 1211082 1227951 1226652 1226965 1276869 1326695 1322563 1328666 1342001
12102 1342001 1372426 1380014 1396389 1375074 1397335 1490583 1507696 1485499 1446514 1422410 1448181
12091 1448181 1434742 1439811 1456136 1489128 1502680 1510760 1531614 1537455 1559828 1619268 1626389 1636166
12079 1636166 1643324 1616192 1605656 1619691 1665941 1713330 1711395 1707864 1744148 1763557 1793007 1835060
12067 1835060 1859903 1867940 1872712 1879896 1898266 1957566 1975246 1975853 1970880 1995288 2012961 1986835
12055 1986835 1982915 2013480 2042537 2069425 2064372 2102406 2163204 2161682 2191358 2211789 2256541 2325249
12043 2325249 2325812 2348662 2387920 2407246 2460232 2479494 2472114 2471357 2489914 2511687 2543231 2594264
12031 2594264 2636787 2681650 2762152 2784810 2781870 2805241 2870599 2919556 2934548 2909447 2951777
12020 2951777 2971758 3017441 3078111 3119429 3120011 3139067 3179762 3238219 3270188 3297791 3350291 3358955
12008 3358955 3352164 3370861 3407912 3428610 3491295 3540013 3579467 3612625 3626995 3661266 3702807
11997 3702807 3733841 3790945 3849853 3918798 3910989 3944042 3977538 4024275 4057000 4086621 4098282
11986 4098282 4133691 4224037 4288863 4349017 4369344 4364550 4398040 4462452 4539445 4598158 4667592
11975 4667592 4684835 4679580 4697264 4703324 4735956 4789875 4831275 4874647 4934399 4997081 5039474 5028854
11963 5028854 5073732 5127710 5126372 5129743 5150391 5188619 5219444 5262266 5289170 5371211 5399750 5388831
11951 5388831 5426980 5468361 5468197 5505946 5517283 5508351 5520186 5512316 5488456 5538064 5558182 5557393
11939 5557393 5597678 5690209 5692658 5650841 5641742 5638397 5650429 5673183 5729025 5782949 5814074 5801015
11927 5801015 5746106 5714126 5681557 5667200 5685392 5694919 5679375 5690434 5678808 5645225 5609412
11916 5609412 5593248 5586881 5587578 5528027 5502037 5451896 5431995 5448887 5448220 5416364 5394452 5358948
11904 5358948 5320720 5314237 5262954 5212586 5201664 5169352 5102128 5095640 5093474 5067551 4998107 4970103
11892 4970103 4942002 4911539 4840653 4781347 4738238 4720061 4696714 4643816 4591887 4534565 4495415
11881 4495415 4468251 4429813 4359945 4259330 4195789 4238885 4236819 4227682 4192458 4137498 4073150
11870 4073150 4012145 3977601 3945792 3901885 3853720 3839987 3799121 3739737 3717848 3689564 3655445
11859 3655445 3614591 3575161 3572390 3564055 3488337 3400251 3346698 3332000 3291862 3253393 3222591 3192038
11847 3192038 3153925 3131551 3090220 3072108 3093991 3078204 3016723 2919100 2834681 2810602 2810990 2768975
11835 2768975 2716437 2683454 2687824 2687037 2624799 2587764 2537477 2523404 2550382 2512823 2454801 2412650
11823 2412650 2424191 2431766 2418242 2430765 2374092 2349588 2349103 2310915 2228186 2158165 2108100 2072752
11811 2072752 2073315 2085401 2068939 2048416 2053078 2055738 2013915 1979803 1928058 1913551 1874933 1808687
11799 1808687 1818937 1860931 1837969 1830223 1795234 1804007 1814747 1765996 1744102 1770457 1748936 1699092
11787 1699092 1626907 1623508 1619736 1599415 1571670 1536325 1509125 1511791 1478022 1449332 1467633 1437750
11775 1437750 1429436 1433898 1407807 1410470 1426973 1423346 1395855 1370825 1368590 1328064 1311929 1327778
11763 1327778 1301162 1291033 1297658 1268165 1212754 1220804 1218783 1254711 1229022 1204559 1211833 1218235
11751 1218235 1174021 1118689 1146420 1153116 1122188 1079292 1060937 1074685 1086546 1072512 1035170
11740 1035170 1024047 1041378 1051419 1111506 1138447 1108810 1080076 1056817 1043457 1061469 1088042
11729 1088042 1037530 987858 968614 969268 964528 926742 947244 978860 977610 964570 912960 826781
11717 826781 786098 822719 830259 839660 836663 863936 887494 898038 925038 857937 802013 815631
11705 815631 822690 790535 761754 731548 700236 666289 664513 716328 773116 748146 780247 798547
11693 798547 811353 776797 741059 720232 672746 642451 662891 656790 642934 652207 662658 662796
11681 662796 664863 646638 635212 629913 611929 602593 618756 619636 640046 651518 618696 562590
11669 562590 532896 522929 504458 512943 517939 540950 558802 555370 559917 569446 559544 526070 515301
11656 515301 558278 561835 580981 538738 483820 476935 511169 470036 470291 514325 544572 585377
11644 585377 574709 529893 536719 555141 545720 516919 519226 550365 544221 485576 457942 486433
11632 486433 476712 492911 501457 492179 472113 442822 472937 483381 425674 430039 446458 466667
11620 466667 471613 423740 383219 390573 374078 360635 412565 444824 445293 411456 407168 382369
11608 382369 405825 435419 463109 420333 401663 410741 411917 398243 389892 390298 425894 440518
11596 440518 425927 393573 349223 342076 371198 373400 386137 375342 389400 378789 355392 359811
11584 359811 363664 337848 348301 335768 322901 364570 324554 289431 303551 348599 359572 334226
11572 334226 263811 261144 258258 241793 293996 363778 376307 395867 406000 360666 335408 311082
11560 311082 344986 377895 374218 350181 318778 276510 271187 285775 279319 256293 256160 252523 296272
11547 296272 287936 256489 220783 282385 302932 280747 223718 222998 268452 298985 301493 306056
11535 306056 301067 307692 318234 308687 294354 288542 277081 291568 326704 337507 346684 314309
11523 314309 310947 269615 291150 299220 275564 233236 245024 279723 252718 244635 262833 258433
11511 258433 203345 176418 215773 243028 237212 232304 268511 299575 296835 247124 227162 229740
11499 229740 228239 171935 140059 182619 212700 196043 181231 221943 235931 250163 245991 185970
11487 185970 154979 196795 233975 207475 170393 157825 178433 215981 211683 190458 178146 171868
11475 171868 170946 137144 165105 217781 250377 250084 252880 271182 256431 222299 204832 209620 224842
11462 224842 222952 199725 234468 258412 225041 183622 188841 226588 226842 191445 138916 166958
11450 166958 210987 236442 224194 239744 243354 215636 209004 198240 159417 126219 106197 129086
11438 129086 168330 183710 190901 226359 221987 183320 195210 194222 187145 228335 252729 205540
11426 205540 186881 178988 169343 165201 158277 139055 139803 145709 151889 155376 182013 178302 148241
11413 148241 164344 194234 186927 148256 135580 148195 155496 133984 159433 142545 138492 137234
11401 137234 156871 159659 139541 132869 157360 138456 107212 104989 86805 50536 67394 103510
11389 103510 145490 129852 119765 94195 95611 111154 135394 133722 138338 116660 139073 166560
11377 166560 165614 135577 103811 65973 37164 69771 94957 95793 118209 129961 125051 127725 170878
11364 170878 160175 151785 151684 126468 147660 181205 149759 151992 156239 157584 138296 109653 91306
11351 91306 140832 136598 155637 145201 93694 78328 63925 51736 69319 90387 62016 71685
11339 71685 81060 123840 156912 148192 96929 42321 10599 47857 78746 92927 88043 68105
11327 68105 106001 132556 165501 135625 105864 89505 85378 79130 73497 80855 84790 99586 69010
11314 69010 78210 86199 70482 53671 80060 132540 151732 120411 140246 151717 121814 106368
11302 106368 88951 88903 99312 93954 79116 66527 61152 83962 119381 132248 100897 107738 122939
11289 122939 115376 90148 65264 113494 146309 153250 135451 131300 149502 165899 169718 139926
11277 139926 165885 164056 141389 132813 133099 124730 136094 145834 110672 93598 114251 127101 123049
11264 123049 65162 28347 39192 42286 66109 91579 99850 43136 41271 75755 69015 74167
11252 74167 87463 86108 100404 132796 136709 101758 59519 56934 61812 83217 76759 57699 98322
11239 98322 97692 96684 98635 119063 132502 139823 145728 161600 167645 192412 188345 139331 96146
11226 96146 67451 23498 4921 52925 86579 100531 59433 72236 82553 42508 72807 76004
11214 76004 73985 94034 74251 61414 37682 44043 46215 68950 73158 74258 102103 144517 119718
11201 119718 112160 129093 124779 128610 97921 87465 67556 57369 62022 57806 57677 80960 74782
11188 74782 106268 131667 97869 48948 61490 49872 43783 64335 90807 102907 87737 73438
11176 73438 63258 69855 62884 43296 79066 113055 127460 111998 89364 70848 56016 86739
11164 86739 104557 56407 52689 31663 41151 66856 72848 83707 136318 127290 116888 98036
11152 98036 57884 30995 45076 54565 96926 84088 73662 77742 59739 64179 67278 36592
11140 36592 29141 61247 58000 43753 44222 73539 93263 100186 82175 114434 150672 92871 22162
11127 22162 -2176 16760 52438 38127 11487 27127 59278 55932 65328 72907 49340 51729
11115 51729 59525 35498 28489 48411 78741 74436 52159 20916 -11968 -25150 40858 51213
11103 51213 19048 3839 22507 23838 29258 48002 80738 52739 34466 62291 55155 71419
11091 71419 100021 99552 86678 65135 44605 28263 54990 77075 55325 29855 56412 52602
11079 52602 69688 101066 94375 75906 89605 120130 102342 114802 83620 64981 66516 100938
11067 100938 113636 62517 58733 74325 73529 63029 51696 58678 26594 13975 9767 22592
11055 22592 92727 97335 83170 85459 124928 113122 116062 147645 164710 190933 188105 175587
11043 175587 202308 183228 152588 197625 253798 264793 295773 360257 390888 355244 346017 319766
11031 319766 325744 322795 326512 374212 425186 464864 502852 563657 551680 506970 466510 421529
11019 421529 384698 360290 355260 372884 351508 339080 400208 425681 414070 358109 309322 273314
11007 273314 235119 193946 185296 204774 199824 170159 180068 160269 180315 209716 182937 127287
10995 127287 68514 54653 44294 64774 64253 37773 62655 83279 68037 56294 53278 55240
10983 55240 52433 40131 4439 -37672 17996 88383 109782 50753 23384 34452 64993 59393
10971 59393 81398 83188 27279 -30442 -38204 -10048 10319 48999 23667 -19499 29301 54440
10959 54440 48301 52410 55342 43233 32307 31260 54308 57401 83855 68453 14791 10390 42934
10946 42934 37709 13188 43143 55553 27178 15186 79139 97838 61209 53658 42748 3513
10934 3513 25324 31765 24199 65711 83825 98957 108841 62425 63175 48466 58410 99606 114859
10921 114859 125485 67014 33505 40635 46864 80271 68357 62375 33758 1977 -33417 -10918
10909 -10918 4460 -7919 57664 71112 49688 42293 34846 -2421 -10561 -11668 -24806 -29038 -38610
10896 -38610 745 33712 74087 94407 69877 42663 45028 49016 53263 53904 59551 54080 32106
10883 32106 9191 18721 46267 65745 51963 30951 65127 87038 81824 119700 117423 120605
10871 120605 90897 102072 124532 164604 145696 93397 64337 65931 70146 88475 109414 128830
10859 128830 145699 167744 176353 142549 67092 46814 76656 107566 92220 88621 131910 158976
10847 158976 158736 170124 153712 165644 165277 147371 96447 85320 101628 77576 66845 97669
10835 97669 132289 153844 163407 156823 132527 123393 149303 127974 85985 105077 115522 108674
10823 108674 120652 96238 87183 102091 92890 71303 63548 44461 37019 -5003 -6522 50425
10811 50425 77009 59361 76522 88863 27019 -15590 -3949 -2353 -26552 -29267 17044 54288
10799 54288 83573 45063 7755 896 26928 51611 91712 133395 126231 133354 136946 119226
10787 119226 83127 57218 38179 36407 56525 65798 70361 37795 13795 2064 33306 53056
10775 53056 62226 48193 50354 23599 27671 54339 20873 -31344 -7466 84166 149226 120041
10763 120041 96915 71731 102810 123787 114771 74887 43337 11004 27247 32164 26047 39417
10751 39417 40583 -7017 -22370 -363 -10356 30603 37713 84877 103016 98230 78537 36062
10739 36062 61368 116552 138804 118260 112004 109620 102526 94907 131170 140451 162378 149069 136612
10726 136612 94888 74176 84417 121571 131031 112407 167631 171848 123635 109024 134652 181344
10714 181344 206512 169825 142098 138329 164844 170048 208221 216940 240848 251055 196765 201334
10702 201334 200462 234101 262324 252661 232950 241154 235648 238155 273065 274070 283937 278320 286371
10689 286371 298731 270655 223407 190318 207203 219352 235965 249408 262265 258160 289862 299060
10677 299060 343050 360073 334320 331466 322865 284250 282389 300065 331055 350135 333770 330061
10665 330061 356835 353377 401479 463025 466405 443234 454009 457091 450149 441936 492550 502698
10653 502698 548091 573290 559029 574098 608103 614893 631880 683052 729484 823671 913611 944564
10641 944564 996134 1046319 1118433 1253302 1371578 1493260 1677536 1881093 2069149 2220087
10631 2220087 2342765 2511269 2772819 3103692 3535443 4076668 4838610 5887221 7330638
10622 7330638 9279519 11871339 15229152 19296720 23580260 27029572 28588576 28156858
10614 28156858 26615190 25170678 24590896 25320615 27686765 31935535 38299069 46526295
10606 46526295 55146489 61283787 62361522 58448159 52380779 47052374 43928176 43464370
10598 43464370 45808509 51180454 59589842 70199687 80595382 86596915 84791999 76001629
10590 76001629 64789574 54999168 48171713 44461186 43644342 45504557 49700565 55371773
10582 55371773 60522433 62389608 58919111 51113745 42200469 34682052 29419157 26238051
10574 26238051 24770629 24714598 25706687 27197487 28315487 27914121 25422744 21389878 16997725
10565 16997725 13150680 10146960 7976009 6353844 5187473 4283051 3628328 3104756
10557 3104756 2659328 2289974 2048873 1834681 1617615 1431933 1302691 1211781 1113642 1002477
10547 1002477 909631 857383 789151 752665 696884 594298 524150 497958 473168 449472 436558
10536 436558 449336 411185 354562 339424 318029 349119 359922 364284 378472 341078 306099 310685
10524 310685 306669 294223 266251 244726 189400 196282 239413 187975 194044 172907 113328 100362
10512 100362 134864 129463 113887 88192 101356 112176 122136 118034 92399 78295 46229 45526
10500 45526 64969 104572 93135 55256 14470 50273 55142 51307 49643 59448 96243 114563
10488 114563 129839 102510 54133 35772 42474 39770 20247 36841 26918 14978 42668 59171
10476 59171 106455 95165 110197 81517 67222 97466 107999 124147 114249 94288 95522 69501
10464 69501 67197 85341 76699 66151 22432 26939 41263 104224 134906 112167 119994 157042
10452 157042 152540 121600 119377 66300 28964 33187 70640 66006 76829 68987 51142 49441 18958
10439 18958 -5556 22494 57017 52252 40039 9909 11075 61760 52897 26491 34011 39852 18013
10426 18013 17487 -20816 -48449 -13148 22766 43777 86614 63187 70950 57818 18116 3201
10414 3201 4003 -27770 -50350 -37577 -38402 -32148 -25142 -30839 -40808 4569 -17118 -18870 942 2792
10400 2792 -7887 -11870 -23124 -23791 26841 60565 59593 6999 -60578 -59166 -33344 -23492 -17848
10387 -17848 11733 37973 22565 33615 24376 3896 -10679 -30714 -10343 9577 -12907 -42069
10375 -42069 -36937 9487 4158 10147 1091 -20800 4391 6599 1183 -27871 -56661 -27513 -2798
10362 -2798 -4329 -50109 -64555 -89618 -50428 -11184 -654 -16668 -6013 6530 -11736 -30213
10350 -30213 -35309 -82793 -97761 -57393 -7354 4202 11353 22276 24606 25188 49130 50813 46404
10337 46404 42545 59337 43538 19526 643 -37304 -29611 2481 5195 1323 -20417 -29450 -27223
10324 -27223 -63697 -108494 -105520 -98498 -73517 -78510 -79564 -34698 -10638 11735 28177 32841 6190
10311 6190 7323 4057 -2202 25077 22979 -15403 -39446 -39406 -38204 -35593 -35133 -7057 17015 -5077
10297 -5077 7426 33151 10833 -23465 -21427 -39401 -34714 -17587 -17460 -28345 -13466 25631 39881
10284 39881 73725 73244 70271 67444 16873 28101 -2247 30243 25183 19693 11600 20010 -2696
10271 -2696 -16548 -61242 -85854 -49768 -17306 9866 -11015 -18681 -26120 16864 55456 14000
10259 14000 7045 42382 82858 91212 68372 55457 36336 26700 -1648 22202 -6951 -12185
10247 -12185 -9024 -33774 -25160 9133 38608 6359 -23267 -44562 -68184 -33961 -1596 8633
10235 8633 6591 73157 99834 42928 18248 15356 24195 47894 36608 -11864 -8183 -7147 23092
10222 23092 36131 5263 8202 -8179 -24339 -22573 -47128 -60499 -20989 3950 -28623 -34629
10210 -34629 -19704 13638 7526 -23399 -12709 -17676 -57286 -62792 -28797 -21624 -14199 2804 15682
10197 15682 10723 -30657 -45092 -56018 -17903 -22897 22324 30420 17574 46746 48153 6274
10185 6274 3341 34635 107747 97215 102784 156506 175063 163997 185699 157427 130526 151048
10173 151048 147798 142558 182893 197200 225733 275789 339136 315366 289392 251266 219744 154072
10161 154072 135293 229790 340491 435495 468153 497762 516472 442681 338155 268055 285199
10150 285199 238887 224030 241617 267293 297283 345579 347349 299080 227177 153114 118982 85999
10138 85999 86461 102482 94528 105217 116927 131090 121558 108439 101000 89573 64442 1460 -41377
10125 -41377 -14586 23960 6234 -44121 -30959 -39519 -23321 -30306 7797 39139 29722 -1455
10113 -1455 -8980 8063 31632 13770 6507 68581 85383 51265 19909 -16863 -14449 -42237
10101 -42237 -59605 -13968 19682 14435 -29846 -14637 -26631 -49326 -37209 7180 15895 -4404
10089 -4404 22462 45167 49997 1717 5599 18255 -6434 -34448 -32669 -40288 -16367 -38983 -79608
10076 -79608 -60993 -51078 -76652 -61022 -32013 -41043 -69220 -34905 -16203 -27020 -17096 -8623
10064 -8623 -9870 -18524 -31174 -53107 -58205 -37888 -14743 3321 -25808 -24796 21648 63629 27852
10051 27852 26029 -26217 -5313 12802 -902 -23477 -11452 7763 9387 4493 -13359 -51779
10039 -51779 -64532 -87906 -76963 -52998 6277 21837 -5551 -57297 -76505 -114382 -102210 -45916
10027 -45916 -4666 318 3521 32116 30346 4861 -15890 -14058 10606 7896 -13266 -39290 -9898
10014 -9898 -44100 -54564 -26151 -4070 11190 -14438 -44108 -9287 32150 -14194 -46315 -54540
10002 -54540 -43567 -12416 -10930 -29828 -12586 -6956 -17181 -8552 -10534 -14588 -24049 -29905 20882
9989 20882 52311 2636 -26641 -1673 33203 36245 22485 -8595 -24869 -9519 29280 21300
9977 21300 25261 21613 24789 31275 13172 -11246 1062 -17646 22696 29710 16727 -19876 -38253
9964 -38253 -52840 -46726 -81765 -73371 -37721 -22528 -17738 -36163 -15661 9402 47435 76783
9952 76783 88211 53892 15842 5201 2236 7509 22506 48051 43127 19386 -10328 -16707 -25462
9939 -25462 -10873 -331 1642 -35955 -46774 11908 15820 33711 41732 49435 43233 7974 21361
9926 21361 41125 34903 -194 3528 71 -41467 -33707 -10466 -16295 -2418 -540 6145 -28917
9913 -28917 -19698 10398 -31096 -40964 -10026 -25401 -29576 -5440 8222 4059 -16636 -22171 -15236
9900 -15236 -22610 4729 3418 -20434 -56501 -79299 -63556 -31303 -25271 -75296 -87198 -70645
9888 -70645 -39719 3131 53483 41538 33461 23189 15833 328 -32548 -47866 -22138 21237
9876 21237 35360 24741 22631 6515 24820 3707 -22894 183 -11762 2633 16849 -15646
9864 -15646 -52167 -59317 -44708 -4444 8949 -313 6359 31383 66652 35229 -30493 -13295
9852 -13295 21617 40910 48452 -9572 -39038 23907 16097 -47290 -93757 -34193 28839 31103
9840 31103 33859 16837 10678 30874 33385 28194 28171 31233 26627 4473 2347 20154 30602 43686
9826 43686 45154 20873 -27756 -51102 -40859 -51321 -38337 -26965 -53227 -94219 -72445 -16930
9814 -16930 11539 -10850 -24319 -18296 -24209 -27776 1493 5877 -889 -16392 -32675 -11065 7901
9801 7901 4829 2819 -10744 -2211 36082 53382 56861 21403 -46420 -78539 -46880 -7062 -353
9788 -353 -12300 8809 -9413 -7042 17946 -4183 -36395 -37738 -33748 -20244 -28505 -19654 38737
9775 38737 41546 -26974 -64722 -83089 -114273 -136090 -125519 -79556 -49931 -20705 -14886 -49492
9763 -49492 -77291 -53107 -57438 -41668 10700 16475 7534 34664 32429 19261 10516 -5889 -48905
9750 -48905 -57504 4220 4042 -11965 -21838 -7592 22758 19362 7958 30023 29106 21777 15099 -22878
9736 -22878 -18659 -45482 -105035 -103690 -65880 -38856 -44735 -54537 -39529 -83862 -87978 -77100 -25867
9723 -25867 8908 -21861 -14311 -14172 -11823 37486 15001 1229 -19673 -35549 -18335 -15124 6598
9710 6598 10779 19121 -10321 -3589 35760 66045 62326 25799 16514 -9034 -31055 -42638 -9984
9697 -9984 -4694 -21574 -39561 1299 55800 61868 39750 27478 16712 -1826 -45899 -48326 -13310
9684 -13310 -6549 -4609 3151 12735 4706 -19269 -11009 8788 -5164 -9561 -9624 -2414 -10494 -4678
9670 -4678 11967 13247 21604 9371 27799 33467 26313 5323 23641 52055 23923 6250 -4985
9657 -4985 -2638 9218 44965 132347 255071 303975 263865 163592 91213 64066 52347 60554
9645 60554 56883 59195 41160 45198 36855 -39544 -53720 -13342 21810 43766 15626 13892 31074
9632 31074 56032 35090 17565 25143 7611 -3526 19031 41073 48553 3069 -30476 -43008
9620 -43008 -52540 -23591 -5621 -38479 -51024 1954 22711 -18294 -15573 21217 9607 -35875
9608 -35875 -63868 -80617 -50255 -16685 -16424 5276 41345 15168 16967 -24790 -82603 -121035
9596 -121035 -161156 -138669 -82104 -86133 -84678 -73966 -56805 -41485 -14500 -10583 -27485 -39027
9584 -39027 -54777 -30346 -4913 -13912 -20994 -58311 -47765 -20060 10635 19306 21770 32935 31689
9571 31689 38686 77649 79838 57730 65223 85900 48530 43178 37138 -5960 -74562 -94489 -53934
9558 -53934 -30312 -32394 -63227 -81049 -75641 -81090 -62514 -50498 -29817 -36111 -54000 -54714 -65509
9545 -65509 -40133 -18309 16253 12867 669 17457 23908 -4530 -29111 -26924 -14069 -6725 4141
9532 4141 -13400 -15233 30481 33567 -26289 -46802 22038 23323 -2469 -10017 14106 6031 -28466
9519 -28466 -46679 -15517 -14447 8720 23113 -10932 -53161 -36245 9043 44551 38570 4244
9507 4244 1222 16582 1116 4509 -13415 -8480 32916 60247 83606 57974 10603 -19651 -58166
9494 -58166 -44977 -22985 29455 56131 9579 3141 2684 7235 -1129 -69028 -51022 -27591 -29075
9481 -29075 -61415 -75448 -57586 -47010 -32823 17932 37314 10579 4543 33547 45948 36356
9469 36356 4797 -18751 -21320 -19532 -43500 -50478 418 23204 34152 32438 -34620 -36966 -24082
9456 -24082 733 5758 4339 19498 -3871 16565 -3273 -28284 -57424 -4044 44281 57516
9444 57516 90563 86581 61315 18524 2309 23888 6079 9804 30453 828 -2877 35224
9432 35224 43107 49020 12425 -41403 -79695 -72807 -66938 -38439 17916 9634 -2387 -13386 -19665
9419 -19665 -7228 -33264 -68341 -54923 23158 16696 12756 25757 31540 37607 39558 27057 -10602
9406 -10602 -19871 -19874 -29714 -42113 -47864 -54491 -22342 438 -7606 -55719 -99861 -109439 -59980 4163
9392 4163 9787 -3588 -5917 15938 937 -47435 -9884 93147 136038 75655 17242 15470
9380 15470 11500 40749 44734 33357 14178 -8054 -32216 -47735 -37093 -12576 -12987 -36425 -38976
9367 -38976 -50987 -28245 44058 21397 -40911 -80172 -71492 -22335 27423 36040 7848 -57784
9355 -57784 -124428 -91187 -93865 -89481 -69066 -18299 9758 27419 19434 -20751 -50220 -66497
9343 -66497 -74067 -19253 -2327 -7317 -7217 2667 38356 61751 22260 16663 11471 -4420 -18249
9330 -18249 -30248 -9236 57509 50371 15015 52128 88829 91671 76213 63242 37322 -8352
9318 -8352 -31482 -36243 4279 -1124 -17926 -12063 9648 29508 45794 26310 40985 36485 12398
9305 12398 19203 12632 4366 27059 43704 33790 58888 60815 54186 -4344 -50188 -55909 -11508
9292 -11508 3156 -832 14623 19790 -10101 19708 -22056 -32116 -5933 16751 12167 8335 4373
9279 4373 -27758 -55122 -24474 19109 29292 15978 37028 33467 13905 -30885 -29689 25220
9267 25220 60153 15070 -25385 33148 52145 8121 9337 -4937 4585 16438 8716 4250 6772
9254 6772 -3390 28031 33920 29157 36932 27074 3781 -13316 -38946 -26109 20165 26814 -43
9241 -43 8439 48376 26564 20228 15098 16414 32413 22322 15752 -2197 11870 50407 23747
9228 23747 -12646 2282 4454 26058 -8046 -19462 -29138 17141 50165 49645 47737 32001 17257
9215 17257 22678 4221 12832 34692 29353 13474 12729 50345 14233 -10220 -10036 -7405 15062
9202 15062 949 -9796 -18999 -10628 24789 42674 -8439 -26756 -48150 -70786 -28349 -39924
9190 -39924 -55345 -53787 -62735 -69160 -48529 -51677 -27547 -12619 -11452 30123 40887 36293 52166
9177 52166 82590 47003 26800 2385 -9772 -1741 -13047 14471 24072 -2217 5901 55049
9165 55049 54765 61964 18459 -1449 19302 53813 64365 52769 70692 21635 25782 31970 5132
9152 5132 -995 35535 47717 55952 21935 14196 14673 65363 24457 -9733 27081 26447 12317
9139 12317 -6815 -11242 -9841 14626 21397 31545 -17053 -36797 -38996 20406 23946 -9663 12212
9126 12212 16306 -13430 -10549 23532 26794 -38939 -46425 3381 -3179 32475 72494 44367 30289
9113 30289 4682 -15014 -40413 -21278 -6587 -39881 -27262 -45935 -27239 4643 33635 45913
9101 45913 46187 78639 70970 37443 -33192 -64020 -96933 -80162 -75245 -48526 -15954 47559 46383
9088 46383 32335 29622 19146 -15812 -1060 -31188 -30266 -17438 -33275 -42968 -16250 15992 21107
9075 21107 22199 -2948 -24102 -40182 -29311 -26425 -48226 -5418 9804 -1014 5215 24519
9063 24519 62366 56511 65847 57566 73103 66624 14380 -7560 -57610 -70662 -56868 -31997 -4162
9050 -4162 21826 22575 -9140 -8453 -6509 -8871 13366 14835 -1542 -10029 -19720 -57980 -70770 -48340
9036 -48340 -25188 -50381 -3747 25176 -5781 -25447 37551 52528 32930 1325 -23924 -52854
9024 -52854 -40945 -28241 -3913 10959 24159 2741 1968 20141 -43537 -20412 -225 -11018
9012 -11018 -2986 -13388 -3951 67780 77512 83518 67125 57643 77406 66606 30353 -9193 -12325
8999 -12325 -47885 -78876 -60768 -57302 -25176 -39680 -52189 -37774 -31674 -40274 -48374 -28165 -7992
8986 -7992 -47678 -70529 -86156 -94253 -62728 -42320 -63547 -40138 -15818 -5088 -18956 349
8974 349 -28742 -48009 -46296 -34024 -25971 -46781 -57197 -26597 -12920 -16100 -32162 -25970 -41773
8961 -41773 -32663 -26208 -30025 -51898 -28655 13207 51329 38891 10704 -11729 15825 37313
8949 37313 934 -7009 -44206 -54063 -53662 -60003 -75880 -54016 -9182 -18055 -28220 -15071 -14529
8936 -14529 3980 13952 13336 -15800 -37499 5968 46680 51667 54089 43895 12986 264 -33751
8923 -33751 -33314 -7175 4229 48114 45649 22241 51080 76190 20945 14050 -7899 -29622 -14882
8910 -14882 10727 -2781 -26325 -32549 -63362 -54397 -30793 -51481 -53500 -7837 12184 4048 22211
8897 22211 21712 29592 19579 27258 60275 57425 33696 26492 3635 -12044 -38420 -29043 18804
8884 18804 18797 -25839 -34734 -8774 -6766 -48649 -41460 -13776 -6660 -13524 -66508 -93046 -121493 -99119
8870 -99119 -50262 -65929 -76348 -89129 -93175 -65585 -35666 46286 81776 15638 -10177 -11691
8858 -11691 27717 93216 108252 72371 50371 40530 54921 56422 59404 73108 62859 54183 34288
8845 34288 20885 7474 19126 17782 -31486 -21741 -16808 -33381 -40354 -13877 2318 35188 32258
8832 32258 67761 63446 72507 49703 13827 6706 18016 48101 104435 114819 90117 38996
8820 38996 -2445 -24827 -48120 -29631 -7544 40275 48782 84194 129780 138114 91376 96026
8808 96026 106288 107060 99039 106815 74642 29073 19463 1739 -4647 48276 84251 74776 49982
8795 49982 39603 36451 15156 5233 -12885 -29937 25939 18229 16421 27894 -14964 -32096 -21704
8782 -21704 -26238 -42077 -24097 -17656 25612 65192 50597 9663 8780 29194 58004 79256 106816
8769 106816 98054 89103 87308 59723 23353 26393 47106 38302 18767 70053 81481 29434 700
8756 700 -7704 -23224 -22657 -10257 -15451 -49993 6846 49396 85503 81871 63894 46256 71470
8743 71470 60489 10602 -1222 5879 15583 64288 86798 127279 107981 70815 65298 44794
8731 44794 39948 63181 81437 97127 114615 121850 90137 32693 65673 65776 39877 36607 32435
8718 32435 13762 18587 26334 46344 53672 96617 71966 45499 34750 54641 61487 51697 63476
8705 63476 46155 9950 17752 55618 75881 45562 58307 47564 9711 28630 78131 111212
8693 111212 99532 49027 63179 84291 77544 63739 17887 8457 45868 19812 1232 52304
8681 52304 72112 58878 38490 2820 4027 34060 28874 24134 29644 481 -39221 -19360 -25199
8668 -25199 -30863 -3530 55191 76250 90146 68874 36091 32737 12323 24173 22587 26725 20
8655 20 25132 45408 37248 29283 35742 42677 36117 45432 27826 -170 93 -32875 -32671 -11128
8641 -11128 -7250 -33334 -35225 23836 65710 65922 12226 9677 19782 51532 69911 91320 100858
8628 100858 58766 39064 77945 23101 -9015 -2478 -23591 -24570 4229 21474 13602 23227 51330
8615 51330 76461 103328 87150 79834 55850 38333 29599 13386 -23051 -12452 64838 56245
8603 56245 36091 51221 99596 124971 101841 32281 12765 3713 1092 13171 12525 34368 46637
8590 46637 52506 50280 45945 57169 81799 134753 138360 112928 118894 145892 143282 178428 188406
8577 188406 157470 117868 133317 163192 160472 163284 150693 118965 87879 90075 69578 82798
8565 82798 73240 52666 20502 52406 52520 42327 66079 69180 58649 50162 47191 81079 78884
8552 78884 74245 70398 59842 48521 15804 24045 3300 -11604 29645 87971 45498 34536
8540 34536 40870 52624 29399 5349 7388 227 -17708 -10691 -1956 -13470 40522 72683 89783
8527 89783 49341 52106 56735 53032 32689 17526 60171 77327 104890 91682 74680 65884 52999
8514 52999 49955 51353 45233 50595 32850 20478 57852 66768 88319 125050 143286 128057 111707
8501 111707 35583 4266 23917 15484 4444 -9473 -21451 -10072 20387 47271 51374 28023
8489 28023 36797 50413 62916 77330 53897 76625 83915 45498 34829 41812 47644 88992 121924
8476 121924 92465 113284 99180 91673 84261 51094 85956 72581 23871 35773 17641 18120
8464 18120 12138 -3765 15633 6063 79403 123364 129081 81338 53339 111059 96115 86000
8452 86000 81619 78906 76681 59152 62845 64809 55762 37968 80341 83308 83117 62895 48156 47491
8438 47491 72704 65782 71034 71057 72118 60882 50612 34820 17980 9847 42318 71582 92864
8425 92864 52209 -14118 -1595 2543 -16951 1332 28677 46956 74819 89290 96801 100787
8413 100787 87705 66145 47189 45351 60087 44441 39034 40497 78599 78321 46317 37274 45049
8400 45049 64024 83994 130205 109402 84855 90548 44854 41441 47261 25586 47400 89112
8388 89112 97623 90786 82828 126495 153054 105185 78449 104163 113888 50284 91727 115925 112440
8375 112440 84324 83419 74808 83238 33354 36734 65261 36543 43555 79094 60760 72115 113589
8362 113589 110166 70289 26849 20055 30842 25334 36499 50984 63059 79744 87103 78890 73772
8349 73772 52561 91511 127265 91238 99090 94698 84463 124648 152755 151114 124299 113817
8337 113817 66444 53907 68892 99723 117818 110400 112024 111266 81856 94329 67020 52324
8325 52324 59579 78414 96360 98926 108110 117622 93766 87145 84140 49705 11309 16429 79051
8312 79051 114494 114545 107806 71337 80936 119901 126879 143893 184394 204353 211848 219683 219913 209375
8298 209375 257924 282411 208104 154078 120985 105038 98003 131218 141401 149192 144224 144221 134256
8285 134256 153321 171109 120055 75520 106389 132584 159402 145300 142827 143462 119625 104801
8273 104801 103291 122787 109959 85248 104800 113865 156974 168471 161965 166831 137171 93068
8261 93068 131655 170042 164099 163782 163552 207044 156313 161825 158367 129868 78672 27698 68471
8248 68471 77189 48141 46082 71301 124578 127554 144002 160949 131845 119538 109393 86311
8236 86311 64226 86444 95191 98630 136236 102629 88304 118211 102839 50506 64031 87207
8224 87207 70335 99834 108832 117193 113016 99520 130140 147633 170040 128557 74133 38510
8212 38510 81498 108732 130818 120557 116816 120581 130173 112495 144873 182715 159358 96708
8200 96708 68847 97968 126374 149428 153031 135881 133346 140823 156545 164021 132818 106609 84469
8187 84469 114582 95326 84551 122472 92666 36169 49383 56808 53637 59294 74094 65619 82610
8174 82610 85902 91853 106859 56586 59475 117678 134433 146699 134052 113114 82232 77995 58595
8161 58595 17672 63704 124014 114114 66892 39851 11379 44340 72170 65552 52671 65551
8149 65551 77384 85592 75011 11697 -28807 17623 21631 -171 22026 44048 18794 -1104
8137 -1104 6178 28876 12769 34315 59459 107278 105947 78422 63672 55642 36535 -25032 -80774
8124 -80774 -85938 -43669 -1798 27114 49071 48507 60450 54109 34379 36830 53559 60311 59371
8111 59371 78957 93432 61029 52582 40409 48803 61675 101016 112773 118337 72380 74178 85691
8098 85691 71943 57281 43616 31808 10135 63639 64935 49814 64323 66145 52168 57638
8086 57638 29721 -22652 -26045 -8543 6154 -11290 -22633 -1463 -8079 -5190 27350 16717
8074 16717 -20789 -45412 -71547 -92043 -60791 -50835 -83579 -95830 -61741 -28620 -21015 -16107
8062 -16107 11915 28503 49918 54220 63854 71540 82205 75671 63771 53140 28141 15546 -2085
8049 -2085 -51164 -27460 34315 40581 45877 13048 -3958 -13055 2581 34365 21454 655 5782
8036 5782 37672 15849 23456 68214 62650 34583 20165 25682 63683 56431 49064 26567 -31159
8023 -31159 -58274 -63416 -18900 -12299 -18760 -19060 -10099 3443 34279 54153 21752 -13206 -35426
8010 -35426 2318 22348 23997 -8225 -27490 -47934 -24751 9699 52067 45895 83566 113857
7998 113857 75716 35752 64872 96052 55662 36816 58566 69227 42575 33993 34531 -3309
7986 -3309 -23535 -9299 -19333 9265 71673 95465 61243 21069 -6427 847 -3584 -38450
7974 -38450 -13196 26308 48197 68136 63055 70387 102212 111018 44641 7133 5332 54035 53068
7961 53068 4570 -75219 -64961 -9669 12525 51473 86489 42166 33972 33839 58937 78403
7949 78403 79029 29642 22528 46514 94216 65681 12480 -13561 -1300 -26920 -20009 17794 -19376
7936 -19376 -20715 -27821 -27208 6474 11526 7815 4510 -11611 3200 -8709 -18131 -5831 27931
7923 27931 10991 6000 30257 27080 97955 137573 124208 84114 8301 -11709 -17298 -25695 -15420
7910 -15420 1430 24947 64065 50329 67250 37220 11224 17673 29817 44006 46428 16075
7898 16075 9256 -17575 -32115 -22053 -32949 -19634 -18156 -13848 -3066 2487 -2545 -40129 -22824
7885 -22824 -3230 -9664 18950 23130 -2085 25485 26737 15312 -35443 -69052 -85003 -39690
7873 -39690 23995 29050 22667 19045 12633 20003 27571 52545 52529 36122 17391 7748 -640 -806
7859 -806 15122 33650 17346 -9762 -22167 -15057 12705 4804 19926 56112 29099 3129 6771
7846 6771 -2569 -6599 1599 -2222 22051 24594 18019 15974 -15638 -9348 12816 27961 19630 -11876
7832 -11876 18148 -7231 -72588 -73833 -26573 -18011 19209 39619 60361 79791 56576 48068
7820 48068 67839 93481 89688 101466 82128 42391 -734 -3849 -19678 -35021 -2786 52861
7808 52861 60011 86945 76714 80727 63130 51659 10784 -2948 32721 34815 7230 -11625
7796 -11625 13640 70269 115017 87870 60274 56089 43799 37724 50228 61721 12118 -10817
7784 -10817 -10728 -57471 -59672 -25768 21616 17388 3320 8620 24079 9134 1741 11011 39935
7771 39935 32213 38625 62548 40170 23782 7346 -26087 -17896 -14159 7747 40460 61289 75367
7758 75367 34049 18348 35203 5751 10822 68 -22479 -17753 -22431 -27924 -33032 -41146 -17161
7745 -17161 25395 64425 85675 61741 36490 7651 -20767 -23635 656 845 -25366 -32360 -29159
7732 -29159 -26972 4462 54810 56609 6249 -23688 -12945 -26297 -24525 -9813 875 7738 44429
7719 44429 62889 42972 -13501 -36026 144 7617 6630 1212 -7533 -26637 -15701 -1436 13663
7706 13663 18158 13576 27815 20985 638 13293 -30595 -55896 -105583 -105907 -31736 5582 -34734
7693 -34734 -66440 -22324 19909 25796 23163 17425 51212 87614 88687 90754 69230 63558 26967
7680 26967 35896 33044 12397 244 -2480 8170 7740 -15508 -306 3275 -21373 -8261 7959
7667 7959 -15764 -19868 -7029 10974 20062 28209 7840 24627 27822 26311 61077 38574 -8881
7654 -8881 -27761 -20893 -8245 -20646 -25172 -35714 -49138 -65912 -39709 -16224 7369 -3837
7642 -3837 -19112 -15421 -10653 7901 9976 -41182 -30747 61477 112981 76218 39469 18871 14237
7629 14237 -688 -17290 -36165 -41650 -23569 -14540 17208 19922 27623 -19451 -57138 -74193 -21017
7616 -21017 -1046 -18741 -49185 -78642 -116564 -89650 -24689 40092 81269 47938 13732 -16175
7604 -16175 6452 16432 -41815 -57093 -44266 -23287 -23163 -11022 -41521 -6687 30974 39217 47748
7591 47748 69842 115613 97398 46205 17605 -10685 -50996 -30926 1967 66680 41384 13762
7579 13762 -15839 4236 17958 -7696 14062 22669 -20379 -32375 -54783 -10922 12965 17187
7567 17187 -19902 -38634 -28682 1514 42684 54381 78834 84327 20756 35264 42079 13733
7555 13733 2744 3719 -4002 24301 39060 18932 21553 33751 23885 11485 -38777 -58555 -38028
7542 -38028 -33181 12456 44824 49529 25900 -38250 -47222 -15445 15738 3660 3600 -21403 -19296
7529 -19296 24729 11227 42853 5106 -34929 -33796 -35453 -12466 -18844 -26815 -12790 37102 42883
7516 42883 23894 6048 3446 -36791 -56055 -43010 18253 27055 -11157 -72184 -91611 -57566
7504 -57566 -51911 -25831 2672 31655 -7565 -7274 -21305 -36329 -34176 6180 26750 86060 80174
7491 80174 68173 42001 5361 -11584 8762 -10176 -437 13865 4191 16183 17859 18011 -26202
7478 -26202 -46997 -56190 -16360 44274 30996 5454 -3965 1374 9312 -21790 -44862 -23688 -3233
7465 -3233 4846 15208 37028 57228 66427 57881 23888 -3322 -15904 13093 33092 27248 5286
7452 5286 25329 49622 42140 28366 30510 13061 2885 17780 -22273 -36704 -24345 -33687 3335
7439 3335 34420 -16479 -51708 -60837 -23661 -16402 -38728 -63883 -30175 -39049 -20617 -21576 -11144
7426 -11144 -4545 -13689 -41580 -78399 -64304 -68199 -75113 -48350 -39785 -24835 34387 37704 52724
7413 52724 40048 34059 24188 137 -13553 -37779 -28357 -64690 -65681 -41307 -87834 -74276 -54709
7400 -54709 -37562 -22566 -37835 -44382 -48681 -47469 -21790 -35623 -27203 -36525 -66607 -58374 -69772
7387 -69772 -28464 16276 50691 22020 -6687 -8201 -24559 -31539 -36799 -43829 -10004 2970 -7056
7374 -7056 -39450 -50420 -27722 -8346 -32650 -40145 -37309 -53904 -106608 -78970 -50997 -8133
7362 -8133 -26586 -33967 -18669 -6315 3024 -30192 -36369 -28626 -33616 -2524 11404 18363 6803
7349 6803 2270 17039 32207 50504 56385 -189 -27026 17821 46830 38559 39234 22511 -3121
7336 -3121 -22808 6642 26399 56216 43079 8090 11035 -1421 -23496 -53974 -53187 -22410 -6485
7323 -6485 -5907 -44469 -83277 -69027 -10912 12978 35641 33949 31719 40738 -10428 -63643 -51442
7310 -51442 -26691 -9998 2234 -5814 9755 53406 41266 12859 -22976 -53971 -78468 -62935
7298 -62935 -55960 -61225 -49250 5683 58393 59029 34796 39936 48621 26470 -13243 -75403 -82562
7285 -82562 -68305 -79568 -90242 -76577 -16782 48395 74682 29706 -36373 -58676 -66145 -15755
7273 -15755 28427 28887 -6920 -25931 -20311 20891 44157 19407 -22445 -4906 -6678 -9216 24010
7260 24010 64009 52646 21001 31501 11037 -15313 -31440 -35779 -58531 -56918 -41620 -21812
7248 -21812 -25639 -40289 -2711 14915 4112 -19297 -6662 -521 -461 10750 12663 -7364 -5092
7235 -5092 -9087 -38975 -60440 -76669 -38342 -7787 -7905 -42852 -47762 -51700 -43419 -60958 -66546
7222 -66546 -54744 -45713 -79603 -68230 -27454 4412 -26616 -18703 -11199 -43739 -16858 -815
7210 -815 -12642 -10788 -25030 -36160 -69364 -55288 -28395 -11935 -38938 -57769 -48503 -84858 -53026
7197 -53026 1215 -17029 -28389 -14545 -59710 -75471 -33644 -24532 -49722 -84219 -53114 -6485
7185 -6485 -3470 -50273 -44875 -20321 -6623 -400 -30464 -59115 -31411 -10257 -29900 29580 83380
7172 83380 64059 2133 -79652 -64693 7894 47355 28121 -5106 -20358 -10702 48147 84552
7160 84552 48142 13607 12027 -43062 -56699 -15007 -14576 -53002 -31993 19499 40132 -8164
7148 -8164 -45096 -43949 -17447 -11075 19721 -11544 -8995 9292 -1489 -18046 -12169 -21511 -13820
7135 -13820 -23941 -51182 -58323 -76362 -100562 -99492 -93467 -120555 -77089 -40705 -8701 17993
7123 17993 41934 46817 33766 8154 2047 4367 12241 12288 -31389 -50499 -14521 -22319 -55682
7110 -55682 -17683 34608 34726 15066 -13103 -13484 -33507 -55352 -55336 -42225 -6319 -28862 -58646
7097 -58646 -34499 -23644 -25670 -415 15635 8956 10336 12667 28321 42638 18906 -21034 11403
7084 11403 12804 -1968 -60737 -97405 -84600 -47483 -14478 -22851 -36347 -43721 -53518 -29213 -24995
7071 -24995 -17364 -30190 -59322 -51521 -18928 22394 41786 17974 1004 42702 51430 33304
7059 33304 17751 -25467 -39623 -62297 -20527 12125 28026 -43406 -78142 -65131 -88029 -88344
7047 -88344 -55708 30790 51981 34007 -4755 -10004 18963 -1308 -8099 -30104 -31847 -11044
7035 -11044 -6387 -1444 -13772 -41053 -57341 -62716 -37601 -26936 -5867 -20063 -36859 -15528
7023 -15528 50147 77909 19689 -27431 -24017 -51146 -54318 -27300 637 46782 30475 -1873
7011 -1873 16995 -4280 -5588 2024 290 -13990 -28980 5067 23839 -12999 -33629 -48267 -32421
6998 -32421 -15054 -47536 -49592 -18797 -15086 -10763 -59444 -71850 -92363 -106362 -89502 -89462 -89012
6985 -89012 -57499 -25260 2390 -13788 336 -14691 -22336 -55639 -75926 -69812 -34977 -14101
6973 -14101 -10392 -927 -27420 -57639 -39075 -51637 -75426 -42895 -10820 -19479 -16991 9512 24534
6960 24534 15087 5027 40695 40146 31952 1758 -7437 29819 34359 31917 21480 25529 -2641
6947 -2641 -28197 -23852 5920 13065 -28440 -26882 -18155 -55927 -36575 -53612 -75172 -75251 -81960 -87742
6933 -87742 -52235 15379 48355 49805 86680 57965 52200 44031 28048 9861 29470 22816 -5338
6920 -5338 -43630 -54706 -50027 -82971 -94353 -90529 -52630 -13228 -55831 -58393 -22333 19855 -8810
6907 -8810 -70264 -63483 -69028 -66720 -66996 -62638 -85617 -80323 -59171 -55125 -57099 -24472 2722 -3367
6893 -3367 -5100 -23648 -23794 -29260 -85080 -110061 -122777 -86822 -76263 -78450 -54072 -54657 -26953
6880 -26953 -27912 -54477 -113918 -90638 -43768 -15830 -20434 -26690 -36824 -10014 4932 -29259 -41955
6867 -41955 -51927 -59522 -44073 -67615 -79910 -50485 -42003 -60984 -48187 -28070 16888 34270
6855 34270 34092 10622 9022 -13542 -44616 -22610 10144 42504 38322 13587 38050 20891 -2259
6842 -2259 -22911 -26842 1849 20171 15400 -9927 -42075 -32527 -22484 -25911 -30516 -24353 -21161
6829 -21161 1230 37525 55894 77384 59310 24739 27190 56487 52590 3451 -14174 -24929
6817 -24929 -28712 -33400 -52777 -24350 26074 32962 3764 3913 -18860 -54596 -51910 -78832 -71733
6804 -71733 -59211 -36904 -16105 -23373 -67314 -41702 -33092 -472 3753 -3968 -2778 -11598 3989
6791 3989 45233 34860 9202 18555 512 9393 52820 67154 44316 -10172 -40117 -44381 -22071
6778 -22071 -250 14101 14906 43957 31422 8952 -11341 31658 59577 58113 27451 -28238
6766 -28238 -4380 -25546 -36934 -46075 -37611 704 8192 28632 63881 34217 -1903 7558 -50061
6753 -50061 -70692 -22254 25776 42405 40678 -46101 -65456 -28785 -42037 -70993 -57269 -40047
6741 -40047 -15453 -41817 -62813 -22196 -30473 -48682 -21135 -4603 18572 31116 65402 66123
6729 66123 42768 20355 23149 55167 61192 -5907 -25285 -8431 18638 38769 475 -65740
6717 -65740 -108458 -104785 -87850 -125969 -134551 -138310 -133898 -46989 -15568 -46748 -60512 -70400 -82261
6704 -82261 -61609 -81394 -57735 916 19044 4057 -8212 -25854 -32943 -50821 -27406 -63882
6692 -63882 -69184 -10117 16560 -12332 -58328 -94491 -49761 2511 36215 32393 20429 -12541
6680 -12541 14725 77621 76121 55141 26372 22584 34402 -132 -35994 -56905 -46299 -15158
6668 -15158 -14330 -27928 -51801 -38165 10210 34989 13360 -32876 -51451 -24005 -14280 -2570
6656 -2570 -21167 -45394 -35550 32802 52030 15962 -12258 -16762 -26995 -42811 -12362 -45223
6644 -45223 -24859 -26861 -29047 -45602 -63343 -61048 -45456 -19678 -18769 -20162 2095 20793 6053
6631 6053 26992 59874 28777 -21573 -68094 -69395 -52068 13051 10722 -50261 -34290 -20599
6619 -20599 237 6354 -3824 -10147 1779 7728 -17967 -26860 -23268 -34127 -29585 -27214 -3479
6606 -3479 -2818 -29197 -37015 -35285 -29078 -41080 -11562 -10216 -58259 -51448 -9265 29963 32596 31142
6592 31142 22507 30485 14213 2134 -5363 11413 66532 31663 -6725 2517 -12159 -10278 -19838
6579 -19838 -42337 -533 2101 -19272 -17822 -9168 20193 40340 29188 -57741 -69346 -28311
6567 -28311 36870 31946 -21776 -30090 -9195 4768 14275 2698 50008 71874 30977 38126 10929
6554 10929 12160 25677 37250 42025 35425 46338 62634 56722 7976 -56318 -78877 -51851 -17548
6541 -17548 12680 -19521 -61100 -50912 -16318 33345 47668 34434 28959 37608 53635 13434
6529 13434 -21894 -66108 -88786 -66030 -17274 694 26887 19481 24099 35117 50454 45587
6517 45587 43209 28285 -31930 -66634 -108839 -82392 -24619 13429 30754 7054 21044 48989
6505 48989 47230 28131 -19085 -13702 23270 17674 -7536 -36552 -3631 19424 14240 18478 13693
6492 13693 6602 17161 -4423 -25881 -39811 -1514 11195 15142 -19698 -13679 -3252 -13919
6480 -13919 -24105 -56586 -37933 -15129 -5741 -20500 -15177 -40497 -45925 -54447 -85310 -84331 -57920
6467 -57920 -32216 -23644 -59900 -59407 -44712 -7119 -25863 -15032 6094 -7755 23213 -380
6455 -380 -28290 -12104 3360 -4254 -18899 6108 7777 13060 3891 297 -30323 -66766 -49824
6442 -49824 -37428 -11261 -19040 -17316 17045 5818 -5170 6717 12605 8752 3598 -23068 -5967
6429 -5967 -348 -34040 -55140 -66289 -65840 -61879 -79043 -63625 -48689 -37154 -71041 -91873 -79547
6416 -79547 -59475 -37902 -13472 4400 -20179 -94566 -65892 -42115 -13199 -29247 -20513 -21300
6404 -21300 -3869 4597 -5800 -31065 -40824 -44721 -47856 -29464 -16889 -16326 -14416 33936 37668
6391 37668 13504 -38292 -52933 -69827 -61760 40554 82690 38170 20602 25834 6808 -27940
6379 -27940 -23910 -73882 -62214 -50725 -35965 -33994 -13017 -16125 38365 48588 34730 15834
6367 15834 -4451 -32583 -50317 -8156 -30377 -66943 -30721 -18699 -20093 -35235 -43954 -17606
6355 -17606 2343 -32376 -38319 -40664 -53905 -49766 -15186 -33716 -12856 -2010 28752 65397
6343 65397 58059 72373 67225 16306 -9386 -1115 -16370 -18448 8208 25288 86277 93089 23962
6330 23962 -4523 12536 -3051 -22835 -16870 -47464 -8629 53249 36729 19800 6431 -22074
6318 -22074 -7684 -4844 2210 9808 -35748 -56905 -6420 -15160 -23683 -6995 6912 12164 -34632
6305 -34632 -56540 -36709 -50601 -73194 -66710 -77281 -66239 -53134 -43825 -29020 -16282 -29218
6293 -29218 -28934 -4878 -241 807 26165 20055 17916 8383 -4508 9411 -11776 -21988 15931
6280 15931 10509 551 17685 18396 19762 10887 -4631 -36543 -8931 -5013 -59431 -35433 -19379
6267 -19379 -29849 -15625 28005 -6196 -42649 -97336 -100057 -59999 -48748 -41456 -14008 4751
6255 4751 6122 17188 9522 10061 14444 24463 46746 54108 20427 16979 41827 26282 7871
6242 7871 943 -38825 -85000 -77778 -74020 -68537 -34836 -16357 6269 -30894 -40358 -59424 -44828
6229 -44828 -42865 -49297 -57882 -28534 -17007 -22864 -38136 -40055 -19172 2075 894 -44995 -88534
6216 -88534 -102245 -86245 -32611 24314 42312 -10161 19158 26281 -2163 -3167 7718 13988
6204 13988 -8614 -40758 -44373 -48280 -56379 10855 -2008 -73689 -84292 -47123 -24384 -59452
6192 -59452 -31882 5873 -1716 3380 -27401 -28071 4552 -13657 -31268 -48286 -6696 26211 4306
6179 4306 16039 38049 27954 -4974 1809 9593 -10798 -33051 -34117 -29970 -32775 -36121 -14118
6166 -14118 -3412 -21064 -14917 -20349 3701 48382 22386 -2984 2162 -10311 -38349 -85606
6154 -85606 -100871 -51477 -31359 -22014 -29383 -44229 -22571 9661 10830 7451 -3669 19243 31724
6141 31724 12103 -36904 -34094 -16698 -28517 -29908 -9401 -10714 -6422 -19924 -8751 -20079 -21083
6128 -21083 -48494 -32278 -3222 11702 -18159 -78666 -36368 38475 16844 -15341 -14457 6368
6116 6368 -2544 -22291 -74152 -93896 -94927 -93325 -97717 -53985 -37245 -7288 -16583 -34570 -26874
6103 -26874 -20779 -6003 -2304 -36750 -28750 484 21311 3432 5887 11336 24051 3266 -20309
6090 -20309 -17498 -30239 -67839 -54594 -21013 26654 16001 -52730 -38056 -17960 3702 -14338
6078 -14338 -8816 17276 14882 -939 -45585 -52014 -68692 -95609 -98318 -85478 -54785 -61812 -42450
6065 -42450 -19823 -33880 -41386 -47010 -80656 -89878 -84682 -74104 -59857 -29156 -23887 -14677 3799
6052 3799 -10174 -12772 -42352 -46791 -19398 -41758 -39844 -24203 -17213 -48888 -54400 -38982 -26760
6039 -26760 -31518 -41185 10435 22084 13270 -1367 -49575 -83729 -131572 -145119 -107248 -47350
6027 -47350 -27007 10332 28215 35894 4859 -11833 -10326 -8856 -10463 14332 -26109 -18268 3957
6014 3957 13816 -2098 -33345 7237 25033 33090 -3553 -34786 -58021 -55915 -73469 -81753 -77893
6001 -77893 -65148 -30594 -1397 426 -28675 -58991 -45993 -21456 -59069 -74972 -41623 -10546
5989 -10546 -4282 35511 7013 -73881 -52634 -33742 -30783 -70511 -97088 -98961 -60875 -31377
5977 -31377 -11409 -13731 31339 24963 20406 54734 34597 -589 -30892 -95529 -96419 -75509 -45635
5964 -45635 -3941 29916 34857 17374 20506 21804 11731 -8662 -51911 -67183 -24883 -15730 -11119
5951 -11119 -2525 20956 10267 13610 10235 9301 7405 20865 1294 -5479 -19427 -14464 -28447
5938 -28447 -27628 -62430 -93371 -82123 -68646 -79799 -59900 13011 2123 -14525 10117 55806
5926 55806 60160 -5155 -73702 -95636 -76573 -48552 -12122 -34848 -64271 -87101 -121401 -89796
5914 -89796 -98207 -82338 -43200 -18112 -30153 -65195 -54888 -49347 -27645 8438 20163 24297
5902 24297 21380 32823 -2064 -10411 -27833 -41790 -53248 -7100 -23399 -68178 -58331 -29754
5890 -29754 -18263 -36916 -28684 -18973 -16764 -28058 -37980 -58961 -45620 10029 6278 13326 -861
5877 -861 9355 8816 36475 53187 23148 11721 18630 -10639 -3337 8611 5813 -52443 -64769
5864 -64769 10613 61482 52667 -15119 -15173 -34280 -28333 -18756 -24175 -14269 -10292 -19118 -23595 -25480
5850 -25480 -3028 9139 -30838 790 -10627 -45519 -61790 -60939 -49549 -40562 -18455 27118
5838 27118 26597 25312 44309 35828 34121 -4767 -35795 -35607 -38608 -46282 -33406 -24757 -73198 -48757
5824 -48757 8177 24148 25807 6237 -39323 -28769 -4286 9758 23480 23202 26407 -736 -14505
5811 -14505 11418 11953 33095 9045 -16570 -43265 -55420 -64449 -22244 13272 20035 10904 20724
5798 20724 46220 9481 -8821 -14610 -12650 17343 55878 10426 -19387 -23783 -27966 -11006 -7177
5785 -7177 -12283 22743 32805 14502 24781 -29972 -48490 -11416 17228 21927 -9575 -6734 2988
5772 2988 -48252 -49812 14035 18021 5734 8606 29194 16483 -12687 -91191 -102429 -40541 -17457
5759 -17457 -35490 -24296 -51172 -101657 -133739 -147525 -105158 -52210 -47187 -73651 -56917 -54674
5747 -54674 -36422 -40774 -13406 10919 21047 17717 -15852 -34450 -40191 -51086 -56044 -37226 -917
5734 -917 -9844 -13363 -29278 -47133 -70942 -108255 -129460 -87912 -63542 -81849 -80157 -71378 -76585
5721 -76585 -49878 -26766 -10287 4227 -21472 -39350 -47728 -35516 -27034 -9835 30451 -10577
5709 -10577 -63440 -25109 17222 17584 -17256 -29932 -10392 19576 23192 24781 22513 9151 -5545
5696 -5545 -14960 -34920 -72475 -56493 -52014 -25218 -4826 -16568 5595 5760 2989 1679 -31106
5683 -31106 -40985 -46589 -39879 -28815 -33620 -52937 -79807 -23624 -1684 -8175 32958 36673 35931
5670 35931 49067 69830 61841 42014 13028 -2834 -1786 13403 -2161 4372 44946 41127 42981
5657 42981 13999 32327 53539 47407 52029 16054 -15614 -41763 -39894 14987 -5299 13450
5645 13450 27967 -46437 -50392 -14368 42594 58967 63356 19513 -1293 -35921 -60888 -58830
5633 -58830 -72267 -61200 -50263 -34094 -19643 -19576 -45233 -57475 -69701 -69483 -56988 -50745 20812
5620 20812 34124 16640 -17417 -58214 -64842 -60613 -24684 2519 7737 -9193 -20703 -3462
5608 -3462 -20159 -4686 -12479 -64184 -82997 -15303 28930 29487 -15087 -63049 -35315 -22425 -2899
5595 -2899 9479 20369 38561 18193 -12815 -20463 -10910 4038 -13765 -13746 -34158 -49408 -63387
5582 -63387 -76198 -93629 -108423 -77373 -41382 8174 -26724 -52689 -60676 -39792 -17980 5922
5570 5922 -17326 -22972 -29349 -34775 -69223 -45122 -49769 -70390 -58437 -80333 -98806 -75226 -58613
5557 -58613 -22438 18987 39168 1271 10160 38661 28042 -17433 -22520 10591 49191 63601
5545 63601 54504 36916 -15090 -32776 -34808 -61450 -25466 2388 -5580 -8560 -35783 -55800 -53286
5532 -53286 -45839 -47518 -47083 -63422 -65231 -62024 -24316 -5937 -16510 -8178 -20976 -8641 27424
5519 27424 44759 38868 6170 -41326 -54528 -45160 -28026 -15561 -10308 16202 24249 30785 4554
5506 4554 541 13979 -5973 -22168 -30038 -57038 -80761 -69993 -72201 -78474 -71727 -23462 -431
5493 -431 6866 2803 9076 -13806 -28805 -17151 -7877 -20101 -3154 -38134 -55695 -50392 -58486
5480 -58486 -71531 -61756 -73915 -23469 24662 44181 56223 57034 88244 108237 81748 54361
5468 54361 24432 13978 34348 33080 -14364 -30331 -376 52295 60246 44831 54056 44248 -13270
5455 -13270 -2554 26090 28466 14413 -16961 -36969 -34277 -27514 -74946 -84575 -50585 401 -25262
5442 -25262 -15952 -10685 -16726 -13856 -2795 -15333 -30766 -22116 -39126 -23167 -29207 -6372 38324
5429 38324 45725 22587 5713 45023 42195 36194 2090 -28023 -21421 -16811 -34794 -32232 -22056
5416 -22056 -12217 34676 50872 51196 -33059 -34440 -10128 -7020 -12268 3170 54538 35826 -31431
5403 -31431 -60349 -47573 -30844 -36785 -48067 -24891 35472 72440 46993 54560 5292 -38942
5391 -38942 -34295 -30308 -51600 -18149 -2624 -8256 -10990 -53081 -93882 -110317 -77651 -35820 -13438
5378 -13438 -2186 -30822 -63686 -98245 -90784 -75730 -64256 -33125 -22110 -13919 26881 7253
5366 7253 -57363 -68438 -48936 -20370 -21995 -53417 -63105 -85987 -89155 -100347 -64630 6008 20379
5353 20379 2088 -51919 -62234 -45148 4260 -239 -65533 -67290 3901 5801 4707 -45933 -44960
5340 -44960 -53193 -24029 -3448 -23434 -22086 -13726 -39061 -67413 -54312 -31112 -42271 -83016
5328 -83016 -98311 -63567 -22129 27112 44165 29118 6837 -5828 -19092 -9141 -19127 6075
5316 6075 26697 30123 14588 27104 31806 30668 15394 32473 72818 70543 36418 30604 46358
5303 46358 46655 22522 28619 -18057 -20891 37535 49114 7387 21120 44323 60604 36983 42897
5290 42897 72285 52305 29856 -7647 -25405 -38385 -31635 -29196 -33748 -51873 -26841 -29137 -71628
5277 -71628 -66891 -9657 -31079 -45300 -38165 -41005 -32605 -49894 -35014 -9799 -24606 -42751 -9951
5264 -9951 12343 43998 30195 -20460 -11545 -11947 18978 2461 -46410 -49311 -44374 6403 25034
5251 25034 -10712 -3264 -30579 -13738 8595 19653 47298 19012 -10758 -30457 -18362 -22799
5239 -22799 -30285 -21656 -8065 4977 -13911 -4342 4803 8132 8979 55549 45900 34472 29514 -2781
5225 -2781 14167 40381 3831 -19543 -52407 -68524 -53160 -29211 -29287 -52869 -60438 -44402 -40523
5212 -40523 -67103 -100555 -78794 -33193 -8385 11407 16814 4719 -36751 -81417 -82979 -119077
5200 -119077 -117791 -89603 -32571 21106 51034 18427 -1417 494 11388 -38394 -43245 -71406
5188 -71406 -103579 -90011 -90793 -77866 -31130 7842 -19880 -47733 -18983 3006 -22756 -35053
5176 -35053 -41816 -81503 -92435 -118503 -98696 -77239 -65124 -51957 -35554 -23041 22192 12407
5164 12407 -27127 -55976 -56667 -64489 -48157 -14649 -43144 -28092 7237 4977 18127 15450 -25786
5151 -25786 -28105 -15495 -34502 -46582 -31310 -24638 -57469 -70251 -79700 -88495 -86529 -65840 -57805
5138 -57805 -5114 48015 17918 -14467 6092 -7392 -21909 -12174 18503 41832 34828 30669
5126 30669 45404 31004 -24794 -16362 35174 27289 31647 69057 66722 32371 31839 33532 23549
5113 23549 12776 44117 5981 -41514 -25822 -3497 -9131 -8028 4998 1224 10428 15153 -24325
5100 -24325 -62588 -23963 7744 6080 -2914 19867 176 -30662 5804 43139 26213 45458
5088 45458 36772 -19273 -45929 -74234 -107521 -119819 -100440 -101838 -95958 -93818 -89402 -46544 12642
5075 12642 26219 -3713 7886 -26908 -23221 -44718 -68895 -71115 -72303 -90106 -51145 -1245
5063 -1245 -43734 -71560 -32142 35866 54900 5795 958 11796 -25854 -36239 -28141 -27585 -47667
5050 -47667 -57735 -29325 -5271 3571 -20921 -34789 -58263 -41683 -16972 -30089 2086 -9947
5038 -9947 -41486 -53442 -80696 -78361 -29217 -24547 -39726 -65814 -30774 -10191 13237 53530
5026 53530 36637 1408 -15994 29762 36032 -967 446 1668 19310 33931 5023 -4450 -19659
5013 -19659 -36397 -25602 -36174 -8330 1837 -3419 36414 36480 29608 25884 4126 -14891 -21135
5000 -21135 -31635 -38670 -55045 -43561 -60444 -74546 -26520 10781 13792 36532 23049 8393
4988 8393 25122 42145 45372 25174 45724 49759 36931 -30119 -28200 -49228 -33841 -48085 -50568
4975 -50568 -18000 -13638 -10204 -49222 -42648 -11425 -15757 -51281 -63148 -56528 -22114 -39419 -47079
4962 -47079 -11772 27466 14469 -7817 -8742 1801 49097 48178 10199 -44760 -66829 -60742 -27024
4949 -27024 -37956 -60042 -40273 -10224 -24809 12529 -1175 -21733 -10266 -55146 -52984 2582
4937 2582 51121 78794 76253 51880 28059 2310 -28538 -17052 -35988 -62457 -39333 -22511
4925 -22511 -4271 13486 24257 44140 47459 17744 18149 -1405 -29129 8914 -9889 -1068 17041
4912 17041 36684 -1855 -18965 -31770 -19492 -20458 -7294 19299 36655 4608 17474 9016
4900 9016 24174 46392 47262 43082 45872 5858 -26418 -42144 -43508 -47843 -57281 -57614 -13441 -53457
4886 -53457 -59473 -25532 -42037 -67862 -46002 -46773 -36433 -38243 -9701 -7147 -58906 -68723 -53092
4873 -53092 -36571 -5617 1416 -3743 -51153 -76905 -79574 -66298 -46796 -44949 -48972 -25254 -22144
4860 -22144 -53391 -70170 -53244 -32534 -21315 -37002 -38571 12381 10099 -2228 -953 46669
4848 46669 52290 -11626 -33350 -78697 -97634 -103622 -84838 -38040 -29400 -13947 -51767 -78941
4836 -78941 -45654 -14004 13762 20366 -20802 -39436 -22688 626 -1866 -17229 -84024 -106467
4824 -106467 -73675 -54919 -37092 -48345 -18254 -5171 6482 19404 -17421 -50756 -36462 -23574
4812 -23574 -594 30853 116925 110827 64484 36508 12900 -46819 -69911 -72000 -41950 -23989
4800 -23989 10335 -29069 -64663 -33472 9427 -8365 -51313 -35184 -15385 -25639 -75601 -72460
4788 -72460 -53310 -65656 -49851 -1092 20924 2395 -39130 -36845 -14865 -702 -330 2038 -16253
4775 -16253 -5944 -8199 41656 53631 22205 53882 54705 19942 46244 32419 -10233 -41509
4763 -41509 -66795 -108211 -76604 -85374 -88010 -86388 -35107 7344 -14211 5674 46135 62736
4751 62736 72851 59788 25064 12001 27213 -4135 -13785 -10074 -41728 -28142 10864 35214
4739 35214 65505 54158 44189 61247 89514 84477 37650 21181 -12779 -42280 -17866 -2069
4727 -2069 19862 22038 26483 2757 -13620 -60533 -88851 -121794 -117837 -61361 -38465 -49428 -47988
4714 -47988 -40315 -27076 -70468 -57018 -57601 -62396 -43587 -4069 -9474 -6151 -15613 -45433 -49665
4701 -49665 -16809 612 33807 -31270 -63567 -36424 9772 2498 13150 44505 15198 46686
4689 46686 66862 28445 27367 34849 35662 61591 8041 -67707 -56251 -65184 -56915 -17235 16659
4676 16659 -5781 -36521 -35474 -19867 24874 14256 -21806 -34090 -7011 20856 14948 19017
4664 19017 5077 14789 29013 27759 -14225 -51361 -54613 -16113 -18013 6566 23938 22207 51261
4651 51261 44809 -2694 -25746 -22222 -23123 -9440 17168 11564 12605 29098 2904 -9256 -22252
4638 -22252 -10484 15729 29092 14106 62478 23917 -55746 -50782 -21965 -30776 -52136 -50162
4626 -50162 -54376 -46964 -6605 11485 3143 13714 17016 -56 -4913 43604 17398 7491 31943
4613 31943 -18793 -73599 -94276 -108691 -117563 -87921 -77150 -74338 -75998 -53557 -40840 -50272 -54517
4600 -54517 -74785 -74917 -36453 19541 28844 12405 3004 26484 21449 -1578 -6375 9174 -25841
4587 -25841 -26394 -6179 28268 41407 37010 80938 83996 67835 67584 23390 18197 52166 5786
4574 5786 -8758 -13942 -14024 -61047 -83523 -126341 -118461 -83127 -82814 -70569 -37025 -33311 -18396 -27062
4560 -27062 -17299 -8736 4187 -11992 -6572 4902 53280 28630 -6038 -22451 -33123 -36393 -4690
4547 -4690 42700 55664 48187 44329 76311 77814 62203 8790 -35684 -20594 -12354 14908 28433
4534 28433 15608 12101 -15383 -48386 -7537 -8208 -1620 -3682 9653 3334 -5576 20213 46102
4521 46102 61852 86756 66559 18358 35980 36941 1865 -18379 25939 19827 6515 -10083
4509 -10083 679 -45068 -17850 17046 -18395 -42937 -39674 -42716 -6929 724 -3234 -4800 -27990
4496 -27990 -85281 -116511 -116487 -89491 -43825 -31180 -49000 -60371 -61606 -84417 -62543 -38566 -28741
4483 -28741 19832 26704 5082 -6869 26910 13555 15263 13599 -13206 -49119 -74010 -77117 -55014
4470 -55014 -28720 -55287 -61308 -22816 -27579 -40771 -22093 -432 30673 34135 10938 15236 2567
4457 2567 9573 -17670 -6605 -12186 -22873 -17070 33442 51531 28361 -41774 -121416 -103436 -24903
4444 -24903 -15631 -822 -9256 -34927 -58815 -53073 -39844 -38648 -1953 -8292 -41452 -37362 -40828
4431 -40828 -43886 -49262 -38850 -42878 -52782 -37849 -43341 -11511 10475 -21344 -37082 -40750 -41406
4418 -41406 -33672 -43708 -30879 -52525 -88503 -93164 -90512 -71963 -17754 16347 36933 58992
4406 58992 38661 -27257 -36070 -3800 -24335 -23892 -58281 -64103 -23253 -9512 -17539 -38679 -29907
4393 -29907 2705 8663 44270 52187 23594 -30932 -74076 -46125 -7877 -15044 -33518 -27503 -50590
4380 -50590 -80086 -67149 -48050 -14778 -11163 -17409 13284 -29942 -46414 -42217 -50964 -44971 -9927
4367 -9927 15515 18036 6580 13419 12039 -18829 -47161 -11961 -30985 -6382 42410 22009 27561
4354 27561 19227 -32700 -62607 -42867 -44394 -41361 -28431 13848 14792 19160 17024 -20254 33132
4341 33132 21674 -10825 1098 10645 15776 -3440 -73 -17208 -33347 -59460 -97062 -70696
4329 -70696 -33482 -33459 -60770 -55215 -28542 -45888 -48111 -55573 -40525 -13450 -15530 -48474 -48562 -41080
4315 -41080 -37546 -24354 -20959 -41664 -27421 -11061 -21789 -25158 -15070 -17340 -22891 -27112 -2743
4302 -2743 18150 7407 1393 25193 23950 24221 21549 15206 -9794 -20021 -73278 -92165 -49844
4289 -49844 -20962 -49946 -51247 -37249 -38366 -15424 -14559 -43884 -43128 -12623 -53990 -4399 9075
4276 9075 -13385 -66665 -57802 -36697 4885 52347 81515 102149 124934 132856 82169 39546
4264 39546 16601 -18903 -18854 -21683 -18310 5773 -2749 19371 38277 43569 6562 8073 11817 43393
4250 43393 46120 35706 8514 12276 13114 -32094 17959 10509 13116 9575 -1976 31854 8515
4237 8515 20427 -1793 5806 23644 48908 17848 -259 4877 29206 40730 52309 54472 14732
4224 14732 17637 40677 48988 46167 19470 4684 10087 8307 5801 37515 28276 38908 12434
4211 12434 27740 26610 7937 -44694 -23288 -38049 -54175 -31996 -8444 1779 -1585 -7147
4199 -7147 4406 10443 20873 56320 36280 4468 5606 -13800 -11814 -30227 -24553 1841 -4629
4186 -4629 -4624 7890 1163 -16788 4518 31315 60497 37699 -50716 -54042 8154 27372 36965
4173 36965 7705 -1836 33657 67867 82603 73163 46926 52069 30962 -678 18327 49035
4161 49035 30920 -28666 -30853 -35297 -2063 -735 14631 17387 10407 8195 -27964 2406 29500
4148 29500 -32514 -35950 -29867 -31016 -5011 27334 20155 12626 -67244 -66915 -47843 -10138 21530
4135 21530 714 -13231 -2108 -38404 4097 37710 5890 6400 5235 661 -3819 -27478 -68101
4122 -68101 -83118 -98501 -75809 -81506 -84871 -67547 -50577 -14086 -37404 981 43190 21581
4110 21581 -14059 -29766 -15225 -14019 -29274 -11320 -4168 54767 41248 10055 758 -5849 -38134
4097 -38134 -65215 -49566 -39047 -1079 52774 7215 -74223 -109257 -79436 -35336 -35518 -91173
4085 -91173 -121791 -89560 -84242 -81333 -76063 -109082 -139222 -93973 -86024 -101113 -109966 -67363 -48854
4072 -48854 -18737 -4460 -972 -872 -14276 -4793 15570 54835 57968 2079 -7435 12206 51851
4059 51851 87167 99120 54074 32607 504 -36572 -32187 -29611 -34129 -74945 -48733 -61053
4047 -61053 -55332 -28627 -25023 -36344 -5621 -5563 -16385 -55544 -28854 -4965 17857 -13668 -6589
4034 -6589 80 -16336 -22120 -62034 -48963 -59891 -76184 -22253 21914 71291 80360 51755 -3018
4021 -3018 -30958 -35212 -173 22712 -25474 -21552 24244 39490 40589 35799 34176 61855 72370
4008 72370 71062 34023 25074 32273 2317 -10490 14450 -12445 -31468 -32834 -22849 4390 -1388
3995 -1388 41010 13119 -29768 -39473 -16428 4285 22836 2531 985 23905 1568 3506 28917
3982 28917 15987 39908 41470 38942 45656 12546 10741 -23010 -60595 -17705 19603 42736 46495
3969 46495 55634 87999 124215 95437 62432 28651 11822 -13822 -15190 22353 32348 6775
3957 6775 -22804 -33477 48873 42278 11588 12158 -985 -38778 -16251 -9943 -19745 8182 41602
3944 41602 46285 47417 346 -32687 -29803 -26177 -63009 -79623 -77501 -71991 -52151 -39254 -41756
3931 -41756 -38187 -57465 -50211 -78386 -45615 -30713 -28647 -46668 -17039 -19893 25388 -5002 -21473
3918 -21473 -60354 -58300 -52939 -46144 -56470 -36350 -79736 -112541 -124511 -96773 -57419 -53907 -98443
3905 -98443 -119678 -98034 -88258 -90902 -88273 -73861 -27169 -47824 -42149 -31417 2265 11182 12415
3892 12415 -29071 -30283 -28874 -40456 -17224 24551 25802 46256 28769 1094 -324 -7962 -17088
3879 -17088 -75257 -63791 -43931 -32148 -11399 10320 26338 20003 -5575 2803 18233 23551
3867 23551 29705 3145 -9378 -2700 37571 35540 -5518 -50784 -44237 -81081 -40095 -11252 -1446
3854 -1446 -15068 -26292 -35385 -26200 -7422 35444 8186 -35350 -53923 -33073 -22041 -39424
3842 -39424 -51766 -75870 -68663 -80728 -25553 16506 47990 65972 54004 18546 16166 36647
3830 36647 15235 4825 -30289 -44739 -55318 -51975 -58733 -26987 -22901 -21035 -4516 -33646 -48440
3817 -48440 -13975 -27576 -62199 -88115 -71925 -41729 -66024 -40442 1670 22877 10391 -52016
3805 -52016 -109309 -85799 -50848 -48025 -23398 -24088 -31213 -7590 -4937 28290 17325 -23945 -28984
3792 -28984 -12982 -45254 -75337 -62270 -30173 -21542 -28728 -10631 18491 28801 -13294 -29844
3780 -29844 36242 68025 61646 43061 53234 80648 77984 40073 29156 8456 4245 -9671
3768 -9671 -3213 -11975 -28084 -13000 -6795 -10622 19460 13531 21174 40064 35886 27780 -912 -9491
3754 -9491 19922 14822 -33557 -74544 -85132 -43837 -13390 -2557 18256 16406 -27191 -11106
3742 -11106 -4341 -7927 1380 -3615 33170 55750 46091 83834 76938 38834 -10941 -38925 -52565
3729 -52565 -55420 -44118 -1150 1754 -7643 19009 16679 36333 28147 -2376 17213 28545 43463
3716 43463 12035 -5514 -10638 -6605 -45695 -14153 -12227 -43200 -59484 -31468 -10638 -14627 18058
3703 18058 65773 50723 65170 28805 -36012 -43282 -28202 -22237 -5512 -10447 -25730 -27780 -53301
3690 -53301 -51174 -32189 -7858 10879 24152 2984 -29656 -29675 -14216 -49888 -40980 15189 31202
3677 31202 39241 34145 -17993 -43306 -61334 -56976 -57310 -40534 -27241 -25747 -21952 -24715 -38502
3664 -38502 -56427 -64746 -58552 -32195 -32253 -60398 -60549 -70125 -54543 -26144 -46300 -116537 -132477
3651 -132477 -129512 -95172 -62846 -66576 -46270 -5464 14380 30261 -7240 -34718 -32950 -24049
3639 -24049 -32916 -31329 -49155 -34822 -16070 -48979 -46587 -48539 -50572 -4569 -10010 -22832 -5709
3626 -5709 20605 32003 22499 16614 42262 78185 53505 7280 23758 30688 22505 -8519 11250
3613 11250 41347 52100 45774 -2532 -6245 12631 -1647 -74689 -103337 -88198 -62598 -28722
3601 -28722 -37641 -38309 -18261 -1344 40188 32243 80183 73732 68797 85614 46030 10652 -3914
3588 -3914 -32240 -16537 23728 16624 -24475 -73860 -79733 -102532 -96911 -41548 -23856 -36591 -87612
3575 -87612 -124516 -52413 -8709 7132 7477 -16717 -25252 -20464 -12837 -41112 -63566 -36688 -25050
3562 -25050 -26514 -24516 -27933 -23797 4617 23136 35536 37627 -16107 -62421 -61559 -75953 -37925
3549 -37925 22498 34967 35129 21819 4860 29519 20863 -12486 -41214 -2413 30422 13930
3537 13930 20773 34136 9039 -36614 -44774 -63452 -61587 -80225 -76790 -68422 -54895 -61787 -16129
3524 -16129 13709 -11025 5211 4725 26779 48664 18558 34853 17377 -3182 -18927 -10499
3512 -10499 38665 49262 7278 5683 43462 58202 48521 41037 40205 32230 9481 -19899 -21490
3499 -21490 -5412 3955 -12968 -2987 -13744 -20892 -18149 -33316 22444 50108 35056 -27862 -17269
3486 -17269 43497 -4330 -53334 -35326 -8146 49958 58143 13465 35531 63121 48284 30822
3474 30822 27262 21904 55350 39445 -10401 -18227 -17001 -8579 16844 13257 32556 28040 37684
3461 37684 22395 -23223 27906 2967 -50730 -59874 -57656 -74105 -62412 -29067 -5586 -18919
3449 -18919 -38212 3638 27527 42434 39112 33873 37879 56402 31570 -14268 -31225 -16325
3437 -16325 -23897 -16949 -21665 -11445 -3746 -6921 -18739 -5030 39667 57648 67089 16349 -302
3424 -302 -10922 -30670 -38356 6016 11402 7487 14919 34004 39214 58625 36645 17814 42118
3411 42118 36501 33168 55687 31651 13724 -19015 8542 20835 14314 9309 9212 5532 6966 -9560
3397 -9560 -48455 -32451 -21695 -43211 -8530 -15855 -55054 -62477 -62283 -68393 -93831 -69018 -33493
3384 -33493 -23607 -29089 -1809 3281 -11878 -40610 -12363 -4368 15281 18649 16625 14988 -30983
3371 -30983 -73757 -69412 -58878 -32709 3295 41405 29228 1266 -31738 -68647 -53406 -5406
3359 -5406 10464 7870 17986 11095 18483 25877 39111 39018 -7597 -15289 35789 41077 56402 92765
3345 92765 59720 5455 -7601 -29385 -43370 -24453 21880 56224 46138 7543 6427 34854
3333 34854 44321 51643 59106 55714 57271 58042 36147 41329 52845 80675 85329 57274 52266 55724
3319 55724 10464 12397 -27056 -46098 -40476 -6722 3727 11843 -13620 -11646 11225 -3549 -30957
3306 -30957 -21608 7971 14067 -23855 -58390 -67894 -27449 -16013 -41246 -42474 -21002 -43 19743
3293 19743 15367 -21061 -42158 -29828 -30196 -58918 -51496 -39772 -78989 -89674 -27077 2679 -7930
3280 -7930 5043 42732 33191 -14230 22087 40782 14554 3138 -13482 -11002 -58727 -108720
3268 -108720 -123784 -91392 -71479 -74194 -71357 -96040 -106567 -85028 -95092 -73366 -73452 -68791 -65326
3255 -65326 -42212 -12545 28636 39535 27832 2660 1564 2837 -5604 -14581 -27666 -25861 -21052
3242 -21052 8747 5735 -5223 -26751 -51840 -56642 -46604 -64290 -90311 -76101 -43101 3267
3230 3267 13031 17353 1457 7575 19358 -7754 -45736 -81594 -93606 -112123 -95279 -68127 -44409
3217 -44409 -9292 -25992 -50524 -65359 -32162 -20736 -20518 17059 35711 21207 9884 5868
3205 5868 -22295 -37232 -51744 -24962 -34916 -43290 -34088 -16789 18089 -12765 2940 28285 -4757
3192 -4757 1490 32221 54036 55691 71218 26015 2463 4376 42075 51797 71955 36218 -5129
3179 -5129 2748 20592 -1564 -495 -10522 -19427 21232 19391 14527 42792 5209 -32762 -24751
3166 -24751 -41174 -17479 25077 17898 7636 -4276 -11525 -9089 42363 19795 -11035 11554
3154 11554 25505 67464 83226 61618 59632 58214 47652 56318 42735 65984 14573 -33031
3142 -33031 -39970 37347 63149 59601 78780 70196 54447 31961 2081 -24249 -18869 3361 64645
3129 64645 78390 53984 40562 53987 43674 -3651 -1947 -13830 -20156 -31055 -48391 -50412
3117 -50412 -40353 -36207 10947 50529 5872 -18560 -14597 -23244 -20314 -35952 -38428 -8683 21196
3104 21196 42392 41636 28362 2082 -67392 -63805 -46170 -28042 2731 -16177 -27002 -40901
3092 -40901 -15174 -19798 9926 -13958 -5205 12625 5387 -5389 -18464 -47509 -49943 -56961 -77787
3079 -77787 -83299 -24415 -25760 -14886 -30299 -29828 9441 42478 39249 2690 -13639 -25509 -29480
3066 -29480 6268 3713 8086 35940 51194 21960 -9734 47645 51468 4856 -5691 -28800
3054 -28800 -16305 43677 1030 -18341 -28468 -12570 -31516 -39336 -55434 -73694 -65759 -62655
3042 -62655 -91627 -104998 -61830 4527 19779 24440 3713 -349 19946 59282 17641 -39380
3030 -39380 -46324 -33363 -79599 -115993 -113377 -70007 -28244 -11368 -15980 27221 8047 -60097
3018 -60097 -86312 -62427 -50486 -71631 -63890 12480 29640 10251 25216 -18321 -17407 12059
3006 12059 9503 1040 11640 -16726 11100 10897 17660 26723 33302 58406 36294 -33938 -26182
2993 -26182 -6047 7568 56459 56790 56635 51704 76494 83402 65944 38199 25609 12853 29322
2980 29322 8650 5594 -21410 -34790 1698 19764 5904 10006 -302 14660 26846 11466
2968 11466 -7960 -8313 24182 20488 22420 41114 20659 7815 21570 51274 54630 51665 31732
2955 31732 14675 16901 55124 88497 35917 -6805 14866 14936 13181 -19341 -14433 -60730 -65795
2942 -65795 -9173 15681 23508 12682 8799 12849 -26653 -38878 -58 10572 8447 27252 16973
2929 16973 -18935 -47074 -56624 -28408 9540 7280 6983 26806 12632 -34604 -56385 -36559 -13776
2916 -13776 5901 951 -13570 -22684 -4853 7479 20492 7804 13835 9323 1814 10494 4143
2903 4143 46571 10879 -3208 15986 33160 37825 27262 3332 40396 80480 50357 -5303
2891 -5303 -26339 -4740 -20527 -41114 -18482 36370 50096 61831 49161 952 -45094 -47929
2879 -47929 -22274 -19992 -55400 -63896 -5172 -15110 -39900 -31605 -9401 18995 41480 34648 6257
2866 6257 -2974 23452 80272 65525 37251 6801 8107 15922 3889 38069 44836 6770 -13845
2853 -13845 -152 26407 44548 68075 24076 19117 31282 82184 91354 90004 48610 9734
2841 9734 -24345 19240 60370 57105 33855 22294 26100 45530 73584 67394 17892 -22466 -25224
2828 -25224 17702 30855 22518 -4192 -26797 -17372 -13288 -31173 -51197 -12383 27132 58558
2816 58558 86291 95358 24660 20190 40006 31046 -7196 21466 24820 29011 23205 28445 -21632
2803 -21632 -7352 16080 433 -10974 -7129 -21024 -6433 16410 943 -16892 -43889 -66526
2791 -66526 -83657 -47453 -11441 -17239 22694 17240 -37933 -32691 -38562 -32510 -50979 -63935 -28265
2778 -28265 -44979 -30715 31733 55270 35402 37265 78099 128792 115614 40732 -5969 5808
2766 5808 23847 61527 70510 60744 29403 -1182 -34191 -41257 -31219 -21754 -32944 -15586 12353
2753 12353 53812 48755 36991 43372 11737 1296 1861 -25563 -39712 -76867 -2003 34801 16742
2740 16742 2977 26286 30540 -15170 -28806 -3793 -297 -13658 -18133 -1465 881 -16791 -48950
2727 -48950 -83232 -106797 -88342 -89747 -59293 -23852 -474 1146 14907 -3182 77 -6765 -20637
2714 -20637 -15959 3905 -20654 -8125 784 398 21345 17126 -20409 -49630 -47581 -60369 -51221
2701 -51221 -73908 -9054 18223 33799 37782 64742 76503 85379 49073 30885 9713 971
2689 971 -22905 18581 30042 3789 -14443 -30811 -26070 -20808 -33841 -25553 24071 69093 38886
2676 38886 -5126 12692 -4970 -17373 12408 27221 10626 -31952 -39988 -15185 -2460 17433
2664 17433 25430 35755 37670 41097 17144 -29980 -45436 -22720 -2807 -10032 -27953 5040 44887
2651 44887 44428 23768 5874 -25471 -38988 -30726 -45217 -75001 -62801 -45916 -67427 -57152
2639 -57152 -49306 -61420 -63455 -68324 -12700 8926 -37625 -69129 -37888 -34583 -47992 13481 84731
2626 84731 58595 8213 10996 12919 -3126 3126 18154 -20697 -9600 -10685 2484 7666 5874
2613 5874 17131 25164 24417 -5715 -25271 -22993 10862 9740 7692 2307 -17139 -58431 -67238 -73850
2599 -73850 -28523 27706 801 -20754 5880 38039 2351 -7921 -10088 -22816 -24120 -8750
2587 -8750 34063 77238 57719 22404 5495 -3198 21934 38423 26665 20472 61147 69824 61334
2574 61334 51334 6425 44369 58060 62368 60078 16364 14691 971 -45142 -27761 24755
2562 24755 44515 82269 64781 18538 -7918 -2317 449 -4408 -16537 -13083 -19202 -46626 -47309
2549 -47309 -84121 -55431 3718 5706 48730 62033 5947 -25568 -27615 -19644 -25926 -45736 -38010
2536 -38010 -22374 -30614 -29756 -46023 -28617 -29778 14374 23366 18337 10809 3884 7000 -11695 -31858
2522 -31858 -43939 -6360 39914 15965 -5445 -16782 -32665 -33990 -41913 -49392 3169 43557
2510 43557 107906 82521 52832 55258 26634 35765 25992 39915 12855 -760 12720 -1610
2498 -1610 -13957 -14288 -21792 20766 58992 59965 37783 38545 39526 45826 15361 -34701 -13486 4863
2484 4863 50007 56352 47200 9787 6339 21484 24801 -4426 -22792 -15469 8477 42421 70639
2471 70639 84474 56713 22411 17935 24620 39201 57889 35892 5213 20971 13557 13142 32
$$ [...]
##END NTUPLES=NMR SPECTRUM
##END=
