##TITLE=Analysis number 328795
Compound Code gk 00779
Project Code adrs
Chemist Name stores
##JCAMPDX= 6.0         $$ Bruker NMR JCAMP-DX V2.0
##DATA TYPE= NMR SPECTRUM
##DATA CLASS= NTUPLES
##ORIGIN= Bruker BioSpin GmbH
##OWNER= nmr
$$ XWIN-NMR		Version 3.5
$$ Wed Jul  4 13:51:02 2007 GMT Daylight Time (UT+1h)  MAYBRIDGE\nmr@NMR_250MHZ
##.OBSERVE FREQUENCY= 250.131544655141
##.OBSERVE NUCLEUS= ^1H
##.ACQUISITION MODE= SIMULTANEOUS (DQD)
##.ACQUISITION SCHEME= undefined
##.AVERAGES= 16
##.DIGITISER RES= 18
##SPECTROMETER/DATA SYSTEM= dpx250
##.PULSE SEQUENCE= zg30
##.SOLVENT NAME= Acetone
##.SHIFT REFERENCE= (INTERNAL, Acetone, 0, 16.522)
##AUDIT TRAIL= $$ (NUMBER, WHEN, WHO, WHERE, WHAT)
$$ ##TITLE= Audit trail, XWIN-NMR		Version 3.5
$$ ##JCAMPDX= 5.01
$$ ##ORIGIN= Bruker BioSpin GmbH
$$ ##OWNER= nmr
$$ C:\u/data/dgb/nmr/ADRS/360/pdata/1/auditp.txt
$$ ##AUDIT TRAIL=  $$ (NUMBER, WHEN, WHO, WHERE, WHAT)
(   1,<2007-07-04 13:50:37.27 +100>,<MAYBRIDGE\nmr>,<NMR_250MHZ>,
      <created by zg, POWCHK disabled, PULCHK disabled
       configuration hash MD5:
       76 6E 9A 78 1E 09 19 81 EC 84 63 8F B0 6A 59 2D
       data hash MD5: 64K
       FB 6D C4 61 EF 72 03 0B B5 BE 34 57 AB 5E 43 F9>)
(   2,<2007-07-04 13:50:51.68 +100>,<MAYBRIDGE\nmr>,<NMR_250MHZ>,
      <Start of raw data processing
       ef LB = 0.3 FT_mod = 6 PKNL = 1 SI = 32K 
       data hash MD5: 32K
       D1 B8 65 5B C9 68 24 C8 1F CC 41 8C 39 F6 E1 F2>)
(   3,<2007-07-04 13:50:53.46 +100>,<MAYBRIDGE\nmr>,<NMR_250MHZ>,
      <apk 
       data hash MD5: 32K
       22 BD 94 B3 12 80 07 57 0B 00 01 4C 70 00 05 5E>)
(   4,<2007-07-04 13:50:54.27 +100>,<MAYBRIDGE\nmr>,<NMR_250MHZ>,
      <abs ABSG = 5 
       data hash MD5: 32K
       F3 A1 57 63 12 59 02 13 FC 39 BE 97 D9 FD F3 9C>)
$$ ##END=
$$ 
$$ hash MD5
$$ 6E 9E 7C 4B B5 3D 80 70 A1 F7 83 FB 5E 15 F7 9D
##$RELAX= 
##$RELAX= 
##$RELAX= 
##$RELAX= 
##$RELAX= 
##$RELAX= 
##$RELAX= 
$$ Bruker specific parameters
$$ --------------------------
##$DU= <C:\u>
##$EXPNO= 360
##$NAME= <ADRS>
##$PROCNO= 1
##$TYPE= <nmr>
##$USER= <dgb>
##$AMP= (0..31)
100 100 100 100 100 100 100 100 100 100 100 100 100 100 100 100 100 100 
100 100 100 100 100 100 100 100 100 100 100 100 100 100 
##$AQSEQ= 0
##$AQ_mod= 3
##$AUNM= <au_zg>
##$AUTOPOS= <30 >
##$BF1= 250.13
##$BF2= 250.13
##$BF3= 250.13
##$BF4= 250.13
##$BF5= 500.13
##$BF6= 500.13
##$BF7= 500.13
##$BF8= 500.13
##$BYTORDA= 1
##$CFDGTYP= 0
##$CFRGTYP= 5
##$CHEMSTR= <none>
##$CNST= (0..31)
1 1 145 1 1 1 1 1 1 1 1 1 1 1 1 1 1 1 1 1 1 1 1 1 1 1 1 1 1 1 1 1 
##$CPDPRG= <>
##$CPDPRG1= <>
##$CPDPRG2= <>
##$CPDPRG3= <>
##$CPDPRG4= <mlev>
##$CPDPRG5= <mlev>
##$CPDPRG6= <mlev>
##$CPDPRG7= <mlev>
##$CPDPRG8= <mlev>
##$CPDPRGB= <>
##$CPDPRGT= <>
##$D= (0..31)
0 1 0 0 0 0 0 0 0 0.06 0 0 0 0 0 0 0.0002 0 0 0 0 0 0 0 0 0 0 0 0 0 0 
0 
##$DATE= 1183553436
##$DBL= (0..7)
120 120 120 120 120 120 120 120 
##$DBP= (0..7)
150 150 150 150 150 150 150 150 
##$DBP07= 0
##$DBPNAM0= <>
##$DBPNAM1= <>
##$DBPNAM2= <>
$$ [...]
##$SUBNAM7= <"">
##$SUBNAM8= <"">
##$SUBNAM9= <"">
##$SW= 20.6930455092707
##$SWIBOX= (0..15)
0 0 3 0 0 0 0 0 0 0 0 0 0 0 0 0 
##$SW_h= 5175.983436853
##$TD= 65536
##$TD0= 1
##$TE= 296.16
##$TE2= 300
##$TE3= 300
##$TEG= 300
##$TL= (0..7)
0 120 120 120 120 120 120 120 
##$TP= (0..7)
150 150 150 150 150 150 150 150 
##$TP07= 0
##$TPNAME0= <>
##$TPNAME1= <>
##$TPNAME2= <>
##$TPNAME3= <>
##$TPNAME4= <>
##$TPNAME5= <>
##$TPNAME6= <>
##$TPNAME7= <>
##$TPOAL= (0..7)
0.5 0.5 0.5 0.5 0.5 0.5 0.5 0.5 
##$TPOFFS= (0..7)
0 0 0 0 0 0 0 0 
##$TUNHIN= 0
##$TUNHOUT= 0
##$TUNXOUT= 0
##$USERA1= <user>
##$USERA2= <user>
##$USERA3= <user>
##$USERA4= <user>
##$USERA5= <user>
##$V9= 5
##$VALIST= <valist>
##$VCLIST= <CCCCCCCCCCCCCCC>
##$VD= 0
##$VDLIST= <DDDDDDDDDDDDDDD>
##$VPLIST= <PPPPPPPPPPPPPPP>
##$VTLIST= <TTTTTTTTTTTTTTT>
##$WBST= 1024
##$WBSW= 4
##$XGAIN= (0..3)
0 0 0 0 
##$XL= 0
##$YL= 0
##$YMAX_a= 685575
##$YMIN_a= -639214
##$ZGOPTNS= <>
##$ZL1= 120
##$ZL2= 120
##$ZL3= 120
##$ZL4= 120
##$ABSF1= 16.522
##$ABSF2= -4.171173
##$ABSG= 5
##$ABSL= 3
##$ALPHA= 0
##$AQORDER= 0
##$ASSFAC= 0
##$ASSFACI= 0
##$ASSFACX= 0
##$ASSWID= 0
##$AUNMP= <proc_1d>
##$AZFE= 0.1
##$AZFW= 0.1
##$BCFW= 0
##$BC_mod= 0
##$BYTORDP= 0
##$COROFFS= 0
##$CY= 12.5
##$DATMOD= 1
##$DC= 0
##$DFILT= <>
##$DTYPP= 0
##$F1P= 14.0000005364418
##$F2P= -0.99999901652339
##$FCOR= 0.5
##$FTSIZE= 32768
##$FT_mod= 6
##$GAMMA= 0
##$GB= 0
##$INTBC= 1
##$INTSCL= 1
##$ISEN= 128
##$LB= 0.3
##$LEV0= 0
##$LPBIN= 0
##$MAXI= 10000
##$MC2= 0
##$MEAN= 0
##$ME_mod= 0
##$MI= 0
##$NCOEF= 0
##$NC_proc= -2
##$NLEV= 6
##$NOISF1= 0
##$NOISF2= 0
##$NSP= 0
##$NTH_PI= 0
##$NZP= 0
##$OFFSET= 16.522
##$PC= 1
##$PHC0= -58.75867
##$PHC1= 2.771355
##$PH_mod= 1
##$PKNL= yes
##$PPARMOD= 0
##$PSCAL= 4
##$PSIGN= 0
##$REVERSE= no
##$SF= 250.13
##$SI= 32768
##$SIGF1= 0
##$SIGF2= 0
##$SINO= 400
##$SIOLD= 32768
##$SREGLST= <1H.Acetone>
##$SSB= 0
##$STSI= 32768
##$STSR= 0
##$SW_p= 5175.98343685301
##$SYMM= 0
##$S_DEV= 0
##$TDeff= 65536
##$TDoff= 0
##$TI= <Analysis number 999999
Compound Code 99
Book Reference 9
Project Code 9>
##$TILT= no
##$TM1= 0
##$TM2= 0
##$TOPLEV= 0
##$USERP1= <user>
##$USERP2= <user>
##$USERP3= <user>
##$USERP4= <user>
##$USERP5= <user>
##$WDW= 1
##$XDIM= 32768
##$YMAX_p= 564039538
##$YMIN_p= -67165
$$ End of Bruker specific parameters
$$ ---------------------------------
##NTUPLES= NMR SPECTRUM
##VAR_NAME=  FREQUENCY,     SPECTRUM/REAL,   SPECTRUM/IMAG
##SYMBOL=    X,             R,               I
##VAR_TYPE=  INDEPENDENT,   DEPENDENT,       DEPENDENT
##VAR_FORM=  AFFN,          ASDF,            ASDF
##VAR_DIM=   32768,         32768,           32768
##UNITS=     HZ,            ARBITRARY UNITS, ARBITRARY UNITS
##FACTOR=    0.157963299565203, 1,           1
##FIRST=     4132.6476996994, 0,             0
##LAST=      -1043.33573715361, 0,           0
##MIN=       -1043.33573715361, -67165,      0
##MAX=       4132.6476996994, 564039538,     0
$$ Real data points
##PAGE= N=1
##DATA TABLE= (X++(R..R)), XYDATA
$$ [...]
24540 -11940 -4709 1104 1 -1503 1550 1062 -1993 -2976 287 7522 8073 8337 2481 -3310 -97
24525 -97 498 -3220 229 2694 3686 5894 6436 3752 2093 -1021 -8400 -19168 -12369 -2293 3537
24510 3537 3204 2775 2482 -4402 -5692 -9563 -7489 211 1565 -994 2604 4535 6790 -1790 -6314
24495 -6314 -2887 -2010 -5647 -56 3109 4777 967 -2227 -2436 -2522 -1631 -2638 5841 5746 2612 1337
24479 1337 -415 -1470 2065 5735 7052 8103 10483 8555 5605 13 -4724 -7040 -4726 -5369 -3734
24464 -3734 1327 7142 10320 3515 2696 5455 6970 11903 8949 6743 227 -707 5951 3565 5983
24449 5983 11374 9372 460 -3131 -1675 -3761 2934 3523 1519 1347 -1225 -7454 -4199 1333 3177
24434 3177 2336 -6051 -13033 -10333 -5237 -5288 -8729 -8007 -8047 -5408 -8396 -3456 1402 1255 1062 -2477 -4977
24417 -4977 -233 -7090 -13669 -9204 981 3735 3027 3096 2418 -8108 -5365 -2701 -8956 -10999 -5680
24402 -5680 -1385 4491 2999 5107 5037 4437 4344 -2110 -9457 -10086 -9704 -11340 -4236 2872 6131 7238
24386 7238 12807 10098 3947 -488 -7813 -8856 -4191 -1737 -456 -1236 -927 1413 2584 2123 1593 796
24370 796 -5326 -1994 -158 1888 429 6363 4943 -4030 -7032 -3927 -3888 -6223 -7246 -7460 -4909 -5558
24354 -5558 -6869 -6856 -7009 -8481 -9678 -6520 -3201 -2660 -3799 -4306 -8118 -1065 1339 -9792 -5513 -1753
24338 -1753 -7788 -1832 1457 168 3072 3972 4447 4612 5017 8063 1162 -7612 -11635 -11139 -5031 -5961
24322 -5961 -4943 -2215 -2120 -3288 -2422 2882 1057 -6564 -5674 -5347 548 -1689 -4464 -7168 -5108 -4326
24306 -4326 -4294 -6789 -5649 -2108 995 -3397 -3977 -4790 -1222 479 -1249 -8303 -10435 -7622 -1517 -1064
24290 -1064 -3711 -4968 -1786 3745 5012 6187 4361 -3620 -4290 -8903 -10799 -6135 -4111 -3506 -18
24275 -18 910 -3374 -352 8448 10143 7466 8536 2393 -1865 970 3377 1595 2272 2979 -1225 -7767
24259 -7767 -10272 -5180 -4083 -1655 9701 7708 1787 1777 4675 2133 -1556 -10447 -16844 -11721 -9434
24244 -9434 -10884 -7060 -9661 -10596 -2885 -1486 211 -2813 -776 -3816 -6324 -8497 -9714 -3395 1656
24229 1656 1631 -6505 -6810 -4574 -1538 6942 7696 -1545 -2314 1105 962 -2270 -5605 -5302 -1506 -860 -3623
24212 -3623 2643 -3470 -5927 -3957 -5052 2201 7629 6043 2922 -836 -4461 -5818 -3941 852 3892
24197 3892 -2678 -5229 -6935 -8189 -12113 -10444 -8671 -7563 -10478 -3277 -915 651 3655 3440 -1574
24182 -1574 -8320 -1413 4863 4855 2138 4070 2823 -1980 -7523 -5611 -4704 -2759 3208 1964 1892 4546
24166 4546 23 -4692 -2268 202 -3859 -749 1463 -162 -8590 -20767 -17528 -7674 -2627 -6028
24152 -6028 -8064 -4016 -668 -4289 -1990 3213 6893 7818 383 -2562 -4722 -4597 -5594 -3802 6584
24137 6584 8561 9285 13808 11552 5045 2735 1098 2358 -1161 -6615 -9755 -6639 4378 8057 3163
24122 3163 -664 2898 8244 6885 2755 -5201 -6894 -12710 -14935 -8594 -3740 -1518 5078 5358 -3167
24107 -3167 -5501 -2093 -4955 -829 9832 9422 7405 7713 7324 5174 7097 4630 1786 -2693 -6082
24092 -6082 -8166 -6535 -8438 -2841 1161 589 -4339 -10 1255 -4284 -12365 -12459 -11757 -9658 -683 2996
24076 2996 1641 4427 8284 5767 9590 11861 11732 5343 2530 -3421 -1844 4443 3487 5300 4160
24061 4160 -94 -5343 -5548 -1758 -4310 -12121 -11452 -4433 -10010 -18631 -20542 -18168 -8192 -10894 -14406
24046 -14406 -10921 -7252 -5793 -5338 -11459 -11614 -13546 -10225 197 2093 2913 1553 3073 3586 1971
24031 1971 -3772 -6631 -3248 181 -161 3842 10809 10145 6836 12291 16442 14260 9552 4174 5754
24016 5754 12586 8475 -5331 -10686 -2850 -8102 -10532 -5216 -805 -772 -1369 -3879 -242 -4129 -1935
24001 -1935 7687 6525 -4893 -9543 -5110 -3955 -1687 -1525 4986 11093 4341 -615 -5532 -2735 3520
23986 3520 771 -1902 -1458 2604 646 217 3220 4326 -3225 -5408 456 3334 2535 -1062 -1565 -354
23970 -354 2387 1565 1309 6076 6808 8414 12085 6319 7752 13036 15695 4621 -3694 -3969 -5044 -5254
23954 -5254 -9091 -5007 -2303 -2917 270 -503 -7370 -5511 -4990 -4200 -1968 1226 8661 6190 -404 -5443
23938 -5443 -3678 -7853 -11453 -11395 -8861 -7215 1316 6593 9711 2006 -3805 -10777 -13319 -9480 -10012
23923 -10012 -7789 -8412 -6858 -2331 -1920 -5037 -6482 -4890 -6502 -8393 -7574 -9421 -10504 -16775 -18971
23908 -18971 -14714 -15254 -7902 -3789 -1388 -3345 -3525 -3640 -874 -3859 -1120 -3573 -7729 -10064 -5289
23893 -5289 594 5339 4526 -921 3588 6429 8056 4172 -1387 -9856 -8139 -5515 -9100 -5566 -352
23878 -352 -800 -11317 -3646 -1576 -3158 1521 888 941 -239 1325 -3218 -5176 -6661 -2454 212 7534
23862 7534 15546 9664 9517 9765 11397 7373 9573 6294 6628 2668 -3932 -6516 -2842 -5873 -6677 -5604
23846 -5604 -5127 -3607 -7454 -3724 6922 7337 8736 6586 2292 -3216 -2054 3685 6663 -3195 -3268
23831 -3268 2955 3823 7148 6232 10204 5324 -1564 -2888 3593 12739 6989 188 5231 8051 3005
23816 3005 -1904 -3347 5232 8389 375 -2452 4361 11472 9085 -192 1538 5610 7803 1772 5844
23801 5844 2518 -4485 -7440 -10461 -1454 -2399 -4559 -8930 -9062 -2576 -755 -11892 -13966 -10079 -5909
23786 -5909 -1641 -3711 -5829 -1605 4933 11908 7452 -6316 -5350 -2081 -5853 -13932 -11294 -2992 -2943
23771 -2943 -8658 -11045 -2742 2610 -4252 -5102 -732 -3260 -9408 -12733 -6904 -5092 -5641 -6373 -5924 -7983
23755 -7983 -7994 -2391 -771 -5762 -2194 -3706 104 6740 3175 3345 4175 5455 4497 6824 4039 -1790
23739 -1790 2272 2445 4524 9085 5961 8854 16304 16355 10568 7689 8874 -3074 -3831 -6262 -10194
23724 -10194 -3625 -2349 -5231 -1134 -2886 -8529 1116 4276 -3493 -3472 -3786 -293 2708 3137 -459
23709 -459 -2308 -13304 -17876 -7556 -1656 3446 5724 -3149 -7579 -4670 -9961 -14321 -9314 -7825
23695 -7825 -12504 -18035 -14493 -5635 -251 1931 7617 9577 10569 9385 3996 7067 3024 -6504 -14610
23680 -14610 -13844 -13635 -10262 -6822 1124 5516 4263 3646 -5188 -6863 -4862 -9187 -8079 -4363 1054
23665 1054 666 -10168 -9970 -3581 2753 5818 -369 -7298 -5528 5191 10573 5573 3367 1055 3529
23650 3529 5817 11180 6696 2999 1058 973 4367 10394 11500 5168 1446 1359 9703 15536 12679 -1415
23634 -1415 -7750 -9591 -11626 -15678 -10548 -8323 -6252 -2714 -3535 -6867 -3886 -2535 -6213 -11275 -9326
23619 -9326 -4693 18 2653 5290 7094 3820 -3041 1586 479 -1652 -2480 1938 6539 3779 1380
23604 1380 4048 -2761 -11637 -11773 -8628 -10507 -16935 -10657 -1733 1784 -3950 -4493 -3524 -9413 -9025 1463
23588 1463 4117 1974 485 1941 4253 -1901 -2385 -3486 -7577 -4171 -1999 -3568 -791 7029 11019
23573 11019 8074 3141 -5637 -2399 543 -885 5760 6281 5185 33 -6059 -3891 -2007 2257 1089
23558 1089 -834 -4262 -5456 -8414 -11417 -6315 -5814 -7476 -3869 1204 6452 8316 -743 -716 -3974
23543 -3974 -3635 -1165 -685 1667 3929 9136 5148 -3364 3036 1563 -4451 -7438 -10308 -7074 -10220
23528 -10220 -5176 17 -5292 -8642 -7653 -4579 240 2322 -926 -1770 -387 152 -982 -536 -9284
23513 -9284 -8686 -10695 -12216 -8846 -6469 -7774 -3018 171 9095 9176 10280 5944 2548 5550 7272
23498 7272 4561 -1911 -2399 -792 2305 -8009 -11733 -13619 -14424 -12422 -12366 -10359 -5654 -4425 -6272
23483 -6272 -4572 -885 -37 -865 4741 12046 8105 282 -7288 -11748 -9689 -8054 -3792 -3763 -8587 -6315
23467 -6315 -2085 -1721 -4076 3065 2064 2781 2181 -398 -1575 -2948 6645 9382 5369 -3380 5068
23452 5068 10609 7244 1426 -6667 -5683 -7235 -7851 -9228 -5348 1996 11116 7887 3189 175 -1544
23437 -1544 -4198 -6812 -10516 -7307 -5162 1251 2144 44 -701 2688 6722 9831 10096 7342 9154
23422 9154 6599 4275 2513 4812 10870 6257 -3345 -5590 -3724 1739 -4117 -4498 -1868 -3791 -4768
23407 -4768 -3328 -2085 1956 2153 -8065 -15649 -13248 405 3677 4273 2695 2449 2988 9760 5127
23392 5127 4880 643 -10211 -13015 -4715 3132 2584 8978 13548 9198 6887 2851 1692 -1360 -449
23377 -449 -5754 -7041 -6997 -3208 -2542 -4658 -4293 -4403 -2267 -4486 -6090 -7603 -8127 -8951 -11404 -13271 -15098
23360 -15098 -9328 -4450 -4741 -1448 -3880 -7132 733 9387 7661 3228 2265 -4888 -5233 1812 -800
23345 -800 -4382 -7607 -7831 -7033 -4841 -5183 -7314 -9302 -7467 -10072 -8773 1233 1983 -3035 1684 -2451
23329 -2451 -8536 -5026 3200 6834 3753 298 2312 1297 -2530 -7286 -8867 850 8167 3112 -1238
23314 -1238 -2360 -899 -1988 -5494 -11323 -17138 -7090 -5275 -2050 -308 5262 5052 -846 -2877 -3178
23299 -3178 -4870 -4352 -3883 1165 3483 -1079 5317 3721 928 1359 -6450 -7335 -7884 -9431 -9171 -12482
23283 -12482 -13102 -10582 -5370 -225 431 -1487 132 2532 852 -1961 -1598 -9628 -18032 -18094 -12083 -11184
23267 -11184 -11296 -6179 -6480 -6617 -2738 -4141 -5625 1137 1514 -6590 -5002 -1695 -3426 -6556 -1895
23252 -1895 -6043 -9636 -9583 -8855 -9275 -10608 -12166 -6335 1212 3264 292 -4521 -1766 -1583 -181 -4756
23236 -4756 -8449 -5340 -8095 -13959 -14815 -8432 -2356 -5439 -10778 -19613 -22969 -19553 -11659 658 -451
23221 -451 -5462 -6031 -4153 0 -1827 -7023 -16062 -18167 -9178 250 4373 2963 360 -1451 -106
23206 -106 4044 -2819 -2224 -3931 -9849 -6156 -4290 -12470 -14827 -12539 -9135 -8369 -8604 -7611 -6157 -4096
23190 -4096 -8812 -5149 -11236 -14696 -15440 -15060 -13400 -3517 8345 9125 4671 3820 1402 195 596 1384
23174 1384 8518 9225 8096 4347 -2588 -3608 -6963 -8188 -6204 649 79 -2316 -1131 -4623 -607
23159 -607 5642 865 -4015 -5533 -5321 -4986 -11319 -10687 -13386 -15851 -16011 -12419 -16395 -19125 -17789 -8118
23143 -8118 732 8372 9762 2482 800 5975 4500 1725 1652 514 -1863 1415 -123 -1440 -351
23128 -351 2495 -476 -1563 -3876 -11070 -20170 -19851 -16688 -4336 5082 6779 -2676 -6748 -9097 -11110
23113 -11110 -11431 -10371 -4489 -4890 -8023 -9902 -9945 -12224 -11691 -4904 -4535 -8130 -7484 -6656 -1670 6079
23097 6079 2766 -2112 -3112 -1310 2374 3197 140 -6924 -4239 -834 -3628 -1727 2542 -1440 -6289
23082 -6289 -2967 -5794 -6494 -10941 -17768 -13830 -7295 -7261 -8723 -6793 345 -1847 -10252 -8089 -9127
23067 -9127 -13145 -15846 -6805 1970 2679 5006 9267 3555 -7006 -7459 -5359 -617 -2150 2987 5750
23052 5750 12896 20511 16190 5595 1183 -8620 -15745 -18737 -9779 -3413 -4341 122 5140 -720 4572
23037 4572 1558 -1138 4157 3297 -3664 -5702 -102 6609 4471 642 4085 1977 571 -5834 -8045
23022 -8045 -7608 -5186 1597 -320 6777 6972 -970 -8417 -8856 -1691 3565 2984 3428 -2938 -6095 -4522
23006 -4522 123 4203 2684 -262 386 4087 6104 9325 11465 4869 -4771 -3347 -4506 -1391 -7764
22991 -7764 -14186 -13104 -10092 -4748 -271 -4969 -11443 -13781 -9179 -5999 -2759 -4367 -6250 -6172 -9580
22976 -9580 -4818 4605 9801 7427 3906 8521 8778 10885 9235 2017 4665 8006 8271 8462 5972
22961 5972 -2519 -2252 -4792 -10632 -7020 -6374 -2702 -11004 -15778 -15325 -15255 -9351 -4864 -3338 -9243 -10421
22945 -10421 -4589 -2552 -2153 -5039 -9566 -10500 -6264 194 4557 2999 -1111 -4745 -5268 -3120 -1828
22930 -1828 -3781 -1906 6614 7191 832 -10190 -8742 -4618 -5239 2877 2644 -603 6453 4438 2839
22915 2839 2185 -2236 -6222 -4015 -2968 -2701 -6692 -6585 -3577 892 2367 1661 -2112 -5450 -9365 -7064
22899 -7064 -7596 -5191 356 -5523 -9888 -8949 -7961 -8881 -9476 -5333 -8943 -8525 -11223 -9603 -5895 -1146
22883 -1146 -3205 -4854 -9581 -10559 -7415 -2922 -3575 3872 8165 3839 8988 12086 7241 -261 -6549
22868 -6549 -8101 -5583 4295 5575 2314 -1061 -11069 -12220 -12044 -7402 -10244 -10806 -8525 -9215 -12505
22853 -12505 -10877 -5645 1747 7231 9695 8496 12163 7383 -2052 25 4515 2779 5670 6408 4048
22838 4048 -1355 -3911 -4505 -1033 -3442 -8397 -6937 -3708 -2681 -611 4070 235 -10081 -4794 -7634
22823 -7634 -5873 -1507 2395 -4787 -4240 4682 10287 6582 -1430 219 -6427 -13288 -15802 -11562 -3761
22808 -3761 381 -2650 -620 -2683 -9755 -17291 -14533 -15929 -12373 -6716 -9725 -7881 -5614 -3540 -3609
22793 -3609 -3606 -3165 -5464 -13207 -16143 -16158 -12488 -9430 -6933 -1317 -1676 -4933 -9968 -2628 -1573 -7224
22777 -7224 -6050 -7766 -7039 -4552 -3401 -588 402 3827 2580 8566 6675 3080 -6213 -3028 -2726
22762 -2726 -12210 -17027 -16195 -8917 -8921 -11974 -15082 -10914 -3141 -4099 -9908 -4683 33 3324 2526 -4650
22746 -4650 -8828 -13917 -4180 -947 -2821 -2364 -3618 -10797 -12590 -10373 -5752 -1678 -1315 1 1010
22731 1010 -2323 -3758 -1325 5813 12378 14776 5590 3192 1671 -3327 -6956 1030 1574 -7752 -8592
22716 -8592 -921 -2223 -9111 -2386 4475 2043 -2265 397 -1569 -2968 450 3954 7698 4683 3697
22701 3697 7642 2681 -6980 -6935 -2937 6327 2629 2026 4277 10415 5484 5547 2028 -2439 1347 746
22685 746 -5534 -12048 -9341 -8482 -3469 -2186 -7344 -6893 1152 676 -4254 -7723 -15511 -13156 -13623 -13941
22669 -13941 -14361 -12235 -13645 -17035 -10204 -7796 -8558 -3559 -3387 -2470 -1803 -2670 4387 11468 9951 9699
22653 9699 978 -6008 -11261 -13001 -10019 -7255 -8905 -12026 -11409 -13744 -7472 3527 4604 -124 -7199
22638 -7199 -10914 -10383 -16596 -20615 -23210 -22499 -16788 -9702 -1491 2172 -3544 1400 343 -5384 -4974
22623 -4974 -4433 -8717 -12258 -11207 -5062 -2890 254 1436 390 -3155 -1536 1175 -1365 -11155 -16560
22608 -16560 -15368 -12620 -5419 5809 10195 7988 2073 -1282 3409 3113 -2642 -7417 -2643 -1699 -7698
22593 -7698 -4307 -5763 -10246 -9880 -7977 -4951 -5191 -7323 -5739 -1877 -6258 -5708 1155 -3344 -5052
22578 -5052 2154 2966 4251 6147 -4470 -2 2179 -1646 -5559 -6090 -1575 1160 -196 -2350 -106
22563 -106 796 6642 6834 9442 6694 709 -2718 -8478 -17840 -10889 -2581 -6549 -2345 -2843 -5513 -4957
22547 -4957 -7916 -5851 -4572 -956 370 -4349 -8092 -13457 -12987 -6338 -4963 -9297 -10143 -6513 -7511
22532 -7511 -9578 -6666 -5116 -1627 6392 371 -4209 -1429 -3041 -6151 -2571 -916 -6673 -8977 -11937
22517 -11937 -9596 2002 3135 1087 881 -860 -5761 -2702 274 -1418 -3661 -3678 -6863 -1583 1799
22502 1799 1576 -511 -3768 -2096 3246 153 -7802 -6447 -2015 -6931 -4654 -344 -4677 -5679 -13188
22487 -13188 -17186 -12594 -11708 -7756 -4372 3608 4368 -629 4733 3715 -1157 -7492 -14495 -16451 -13589
22472 -13589 -12797 -19617 -18053 -12520 -10618 -8543 -14600 -8140 -1053 -5386 -3514 1018 -6221 -7010 -6512
22457 -6512 -4372 -3851 -7561 -9531 -4498 -3503 -1555 -2989 -4424 -42 2921 291 -8769 -11093 -10315
22442 -10315 -10553 -2296 -889 -3527 -4649 -2220 -465 1770 547 832 -2217 921 1051 -10233 -6303
22427 -6303 -4607 -3836 697 -3798 -5742 -7304 -8442 -8087 3046 7917 7480 3646 3495 -59 -4003
22412 -4003 -4842 -6245 -12677 -21117 -29986 -31295 -18963 -8632 -5051 -6616 -4383 -5704 -8025 -5131
22398 -5131 -6985 -10227 -11987 -10876 -944 413 -4232 -5659 -6875 -9835 -7136 -6417 -11904 -17683 -14917
22383 -14917 -7357 -899 -3715 -2906 5511 9746 3385 -2703 -4236 -8538 -9420 -9596 -1811 2301 -4776
22368 -4776 -3133 -3040 1678 -2587 -8242 -6377 -9567 -6548 -4794 -7071 -14285 -18089 -15602 -11776 -5395
22353 -5395 -9630 -12550 -16076 -7054 -1538 -2257 -882 3812 1011 -6053 -7933 -3514 -4111 -4885 -7262
22338 -7262 625 3798 4352 4780 2387 -2687 -4333 -5528 -1753 4347 1815 5307 9716 6198 7029
22323 7029 5869 -207 -2151 489 191 -648 7046 8576 7914 11756 8648 4755 1509 2605 7359
22308 7359 1892 -332 5188 -820 -4903 -4690 -5693 -14100 -22249 -23375 -21691 -18263 -13143 -6507 -6288
22293 -6288 -6139 -10537 -14365 -11352 -2437 -2395 4708 -2360 -13467 -8355 369 -92 -566 3729 1151 729
22277 729 738 -1817 -4298 -6203 -8891 -8573 -7190 -5508 -3820 1942 8963 8858 -1986 -5115 -7588 -6766
22261 -6766 -10732 -16944 -19170 -17319 -17038 -11432 -3509 -508 -1769 -9807 -11011 496 6363 4058 -1793
22246 -1793 -10798 -6717 -4300 -9360 -8544 -5079 -5420 -11755 -9979 -6414 -9579 -12519 -16333 -16003 -18135
22231 -18135 -13929 -9072 -9204 -8229 -3872 -3650 -4723 -3579 -11302 -13285 -11998 -1454 -4723 -5351 1443
22216 1443 -366 -6081 -7483 -11563 -13106 -10364 -11069 -6723 -9237 -9302 -7068 -12439 -15935 -11794 -15124
22201 -15124 -13789 -8745 -9213 -13061 -12312 -7079 -4266 132 -903 -1267 -6666 -8558 -9903 -7693 -9359
22186 -9359 -12171 -15930 -12678 -13234 -13606 -5054 952 4436 -602 -11796 -19040 -9898 -4012 -3967 -3573 -3276
22170 -3276 -9828 -7452 -9172 -14707 -12295 -10170 -1708 -5123 -10518 -5933 -5198 -10880 -13978 -12260 -11142
22155 -11142 -12886 -12914 -8730 707 2051 144 -4682 -3631 -7046 -15541 -9774 -4419 -5587 -3281 -1627
22140 -1627 1382 901 -5964 -8318 -3229 -2065 -8469 -3909 2948 1363 -2991 -11590 -13175 -15378 -12651
22125 -12651 -6355 -7224 -6931 -3740 -3506 -5344 -897 2239 1668 3358 4119 -120 -4128 -3817 -9864 -14421
22109 -14421 -19568 -9133 -3336 943 -759 -11054 -9208 -2310 -5770 -6685 -3982 -2668 -8120 -14960
22095 -14960 -14597 -11371 -7942 -4461 -43 409 2542 577 -2858 -4897 -5003 -5107 -4662 -6063 -814 4667
22079 4667 4292 4636 5320 8055 9706 5054 -3065 -3217 -3771 -4635 -7809 -10025 -8568 -1169 6197 4745
22063 4745 -2757 -3734 -9616 -12507 -9941 -11276 -12178 -14208 -18032 -11506 -4396 1935 3162 329 -1544
22048 -1544 -5096 -11234 -15571 -9016 -1999 -3253 -7173 -11720 -10675 -10413 -13819 -11064 744 6745 1039
22033 1039 -6356 -10073 -10545 -16875 -13911 -12719 -11982 -8799 -8844 -8241 -11071 -12521 -3532 -5462 452 1317
22017 1317 -7515 -6065 -7343 -15623 -12580 -4231 2476 -3858 -6826 -9816 -7246 -1483 -5832 -15089 -16686
22002 -16686 -20106 -19489 -7044 -4090 -2382 -2390 -5166 -11316 -6697 -8283 -9053 -5091 5124 451 -4079
21987 -4079 -5472 227 -1888 -6492 750 7034 10324 3590 -1933 -6644 -8225 -6242 -5074 -4921 -2172
21972 -2172 2060 -2689 -8236 -8526 -11046 -5885 -7278 -9753 -8090 -5860 1423 1640 1572 1284 -3911 -14286
21956 -14286 -19934 -14116 -10006 -6208 -4324 -5517 -7960 -8750 -8663 -10840 -8824 -9583 -12819 -12745 -5653 -7397
21940 -7397 -8843 -1410 -1642 -1997 1447 3640 -1228 -3488 -3615 -943 -2782 -5874 -9146 -11636 -10837 -9166
21924 -9166 -9568 -7380 -8881 -13934 -22339 -16124 -9950 -11608 -5983 -7076 -7011 -4614 -2382 957 1359 -6035
21908 -6035 -8136 -5624 -9699 -7638 -2863 470 -97 -859 -5238 -9319 -9719 -10881 -7970 -11759 -10941 -13199
21892 -13199 -15425 -7177 -5840 -7672 -3619 192 -2001 -1701 8529 16284 14711 3695 -4363 -8666
21878 -8666 -11844 -7089 -4888 -5921 -3329 -3459 -4035 -3703 -4657 -2317 6192 5042 -3331 -11974 -11763 -11457
21862 -11457 -10252 -6347 1236 -4275 -11732 -14690 -12557 -7715 -4849 -7668 -5363 -4979 -7878 -9839 -22075
21847 -22075 -20089 -13543 -12795 -19111 -14468 -7096 -3324 -3291 -8088 -12382 -10504 -11106 -14960 -14667 -15145 -12013
21831 -12013 -16417 -14576 -12171 -8318 -10666 -11827 -12523 -14642 -12256 -10253 -14921 -18987 -13478 -12216 -12719
21816 -12719 -7563 569 611 -3670 -3240 -398 3413 3738 419 -1824 494 2640 -162 -4899 5758
21801 5758 4918 -3263 -5638 -14234 -10367 -67 7273 1038 -3908 -1292 -7246 -4457 482 1603 2515
21786 2515 2594 3407 2986 -1919 -7089 -11504 -1979 -839 -9061 -11535 -8373 -2568 -501 -3084 -3062 1185
21770 1185 1920 -1267 -6737 -5313 -848 3047 -665 -365 -104 -1088 -1399 -5536 -6195 -9322 -6983 3612
21754 3612 9271 4830 -708 -11673 -15226 -18322 -18500 -15298 -10685 -5405 -9462 -16801 -11544 -8735 -2193
21739 -2193 3220 7943 13184 9397 -7745 -11188 -3928 3755 4724 2232 824 -2496 -6243 1178 3538
21724 3538 1564 4610 1844 -1850 -5654 2365 5722 1993 -315 1931 1291 2784 10992 12857 12026
21709 12026 7827 7666 10625 9617 2957 251 -4262 -2332 -3184 -8296 -10076 -5081 -6427 -7535 -7647
21694 -7647 -6226 -3671 -5964 -4352 -5078 -289 -1478 -14374 -17564 -13387 -1584 1295 -4929 -8755
21680 -8755 -8767 -10365 -14891 -11138 -7172 -7991 -9812 -9130 -15428 -13669 -9779 1967 468 -154 -3452 -10043
21664 -10043 -10197 -6558 -7149 -8183 -5447 -4958 -12782 -15664 -13231 -13362 -11137 -14160 -14701 -10152 -12953 -19164
21648 -19164 -18929 -3985 2107 -1643 3639 3291 2964 -577 -4163 -6479 -11362 -5791 -3325 -6040 -16454
21633 -16454 -12866 -8701 -10926 -7853 -5091 -13006 -10446 -1754 951 -4603 -8977 -4285 -4931 -2286 1788
21618 1788 19 -8606 -14906 -15378 -8722 -7171 -10773 -9612 -5571 -7976 -7369 -4827 -8975 -8999 -9503 -4637
21602 -4637 -7359 -5589 -958 -4618 -11450 -12643 -12543 -12457 -11256 -9883 -13309 -14698 -5189 -3411 3243
21587 3243 8495 9550 3025 2517 3228 -3054 -10581 -9972 -4685 1924 -137 -4398 -6339 -8911 -8837 -4035
21571 -4035 -3825 -1914 1391 78 -333 -361 3319 378 -6137 -5662 -9038 -9028 -2050 1382 -470 -3618
21555 -3618 -10909 -17439 -8977 -5264 -1339 1696 3377 510 5069 4052 -736 -1142 -11945 -14920 -15575
21540 -15575 -10062 -8385 -9072 -10098 -12898 -13900 -12409 -16895 -19690 -21080 -21613 -14259 -10821 -12631 -10455
21525 -10455 -7505 -7033 -1278 -326 1080 -45 -793 2322 -5764 -10242 -3859 -2547 1740 2897 6392
21510 6392 6545 5149 5219 331 -4686 -11499 -11778 -5995 -6445 -5436 -5172 -8977 -6904 -7213 -1717 -4533
21494 -4533 -8300 -5636 -9666 -8210 869 7390 4792 -2024 -3006 4297 14095 8287 1072 4427 4938
21479 4938 5177 828 -439 3783 3202 -9017 -15499 -12791 -12730 -12037 -7799 -3910 -5186 -9988 -15704 -13575
21463 -13575 -4093 -1704 -459 -1989 -9428 -9712 -7406 -5619 -8928 -951 -2399 -10013 -8233 -6898 -9952
21448 -9952 -11012 -8683 -6596 -11717 -11996 -5096 -2162 -72 -4585 -7150 -3508 -6463 -5568 -2946 -8936
21433 -8936 -10882 -8804 -11542 -14419 -13460 -11593 -11052 -7864 651 220 3048 5280 -23 -3100 4156
21418 4156 8435 7096 1256 451 2224 4647 8494 12779 4179 -4933 -7260 -3026 -5056 -3719 972
21403 972 -339 -1887 394 -5480 -8934 -3836 -2430 -1831 -2469 -8601 -8897 -8279 -9557 -4396 -3780 -1942
21387 -1942 -2748 -5097 -4548 2991 -492 1967 3677 -885 -9063 -11317 -6675 -7022 -12149 -10769 -1101
21372 -1101 5648 3634 5140 5630 4303 -2449 -216 4618 6930 4836 -4125 -7519 -5568 -6064 -1217
21357 -1217 -1885 -5584 -5424 -4194 -4771 -3203 -4241 -1265 6648 8888 2291 -3961 -1620 -6155 -12312
21342 -12312 -12915 -8619 -6852 -4566 -1414 -3111 -7356 -7585 -12776 -7306 185 172 463 -2691 -4546 -6346
21326 -6346 -11948 -10757 -7517 -6648 -6264 -5714 -6416 -7124 -273 -2303 -5319 348 -311 -5748 -10741 -9255
21310 -9255 -9519 -13398 -9502 -6069 -10840 -8241 -8163 -4158 -4833 -11402 -11199 -6748 -12401 -17107 -21004 -24047
21294 -24047 -27139 -28483 -24212 -11661 -9867 -6868 -6323 -4444 -135 79 947 1246 -2098 2802 3551
21279 3551 -3431 -3153 -5555 -1019 1255 9414 7442 1291 7817 11662 10346 5047 -2067 -4377 -3816
21264 -3816 -5526 -3617 -6412 -8783 -9055 -9247 -12603 -16734 -12242 -8411 -7886 -1910 -152 -2530 -9759
21249 -9759 -18390 -11615 -5539 -1372 1982 184 -3647 -11438 -14193 -10401 -4425 497 5404 7798 3198
21234 3198 -603 -155 -5256 -4868 -3468 -10182 -7813 -1677 2615 1120 -6480 -9657 -13569 -15255 -16668
21219 -16668 -15302 -10489 -2856 2433 3543 185 -1233 -2587 -4858 -7623 -9056 -13573 -9488 -6474
21205 -6474 -7 2766 4036 4510 3756 -3409 -4441 -5281 -10651 -14424 -14382 -8500 -3565 -3958 -4674 -7090
21189 -7090 -11947 -12533 -8427 -5027 -8467 -8002 -2566 -4846 -7175 -4454 -76 -3957 332 4202 888
21174 888 -6821 -9661 -12237 -7232 -3512 -5150 -12014 -9832 -9372 -6826 -2387 -2503 -4202 2381 4898
21159 4898 1989 -1653 -5723 -7692 -8210 -6503 -5055 -8939 -17148 -19302 -14672 -13434 -1744 5276 2031
21144 2031 785 1072 5999 7027 2285 -6716 -8301 -9345 -10257 -14470 -15180 -7398 -4550 -5350 -8851 -9227
21128 -9227 -536 5049 2472 1859 -3083 -6993 -7547 -5367 -8128 -6940 -1851 -2854 -3051 -6597 -11283
21113 -11283 -16006 -11451 -2709 -273 -4792 -10825 -13806 -12798 -12946 -9140 -9988 -7306 -3603 -3979 -5895
21098 -5895 -6172 -5521 343 -618 -426 -5519 -11368 -11167 -7085 -6358 -1464 3004 2730 -182 -3227 427
21082 427 2588 -3220 552 -502 -792 3848 5914 588 1089 3118 196 1981 7905 13453 11637
21067 11637 11761 21088 33002 33346 29840 27038 29474 39553 43943 56959 75994 99424 124771
21054 124771 165328 210943 247915 291819 352918 405300 460965 525398 565523 595704 633149
21043 633149 634526 630737 636744 608540 573275 559933 509477 449544 403645 344300 285743 247563
21031 247563 205642 160575 129253 105171 88668 70025 57091 48787 45928 37502 29070 22155
21019 22155 19323 18327 16076 16262 18798 19225 16593 11859 7985 7320 12521 18995 19086 13815 12316 3331
21003 3331 1423 1427 3185 3870 4345 5046 -5684 -8517 -6758 -9836 -7439 909 3362 1565 -1517 -5765
20987 -5765 -2365 -7899 -8710 -7650 -4382 2645 5432 963 -4874 -2691 -4473 -4633 -6362 -3871 2463
20972 2463 -5080 -15426 -15998 -10263 -7606 -13895 -17306 -10205 -4358 5496 11452 5481 3416 -295 -5475
20957 -5475 -7627 -434 1795 -1658 -5902 -6216 3190 3615 -3978 -11514 -7736 -870 2178 -159 -3073
20942 -3073 -3283 -2171 -2050 -2117 -3354 -2419 -557 -2301 721 -952 -5405 -11389 -12217 -2917 -5775 -3473
20926 -3473 -2241 -4758 -4709 -3650 -4217 -613 326 -6199 -1393 4499 10630 10114 4205 -126 993 -145
20910 -145 -2278 5075 5843 7449 3061 -3415 -3284 -2224 5777 6999 2235 3347 9667 12252 13660
20895 13660 10473 5990 10139 5879 1047 -4160 -4591 -1472 -1144 -561 -937 -10709 -16450 -4295 1572
20880 1572 -3352 -6929 -8413 -9291 -9178 -9544 -10751 -11897 -15479 -19046 -15628 -10637 -6681 -4190 -4457 -3030
20864 -3030 -10461 -16330 -11509 -11398 -10706 -7029 -5824 -2616 -2249 8795 13163 10217 5841 2677 2254
20849 2254 3772 -91 -355 3551 251 73 -1796 5693 2363 -2740 -6366 642 6877 4351 3328
20834 3328 -1003 797 1666 -2613 -7204 -7304 -9800 -4610 -679 -8172 -12593 -8509 -5992 -11322 -8999
20819 -8999 -8773 -9225 -9422 -7104 -8012 -11425 -13387 -11969 -16213 -14153 -3052 2330 -1265 116 3262
20804 3262 4616 -3306 1962 6904 5062 9244 12435 11338 7730 3972 -3774 -7465 -4223 1044 6224
20789 6224 6020 5158 5373 7910 10316 13109 11371 6948 9199 10611 8036 4744 2823 -7377 -5496
20774 -5496 -2379 -7204 -5761 -6156 -5325 -6452 -13998 -13371 -15110 -8887 -4810 -1804 -967 -5114 -8137 -11719
20758 -11719 -5373 -356 1986 6838 7956 823 -2509 -1180 -8758 -11999 -8532 -3927 -2741 -7635
20744 -7635 -15037 -20927 -13869 -1942 6598 6043 3037 5108 6502 2943 4875 1413 -4659 -6519 -3999
20729 -3999 -8873 -9664 -6999 -3052 889 6220 13047 18519 14093 7892 4933 10818 16110 13574 10843
20714 10843 10138 13311 14295 20337 29270 31184 24032 27941 29042 31000 36891 43143 49314 55817 46758
20699 46758 41686 42128 45271 50500 44263 46351 53067 55607 55581 58029 58156 55844 49347 51182 54121
20684 54121 53862 54975 52465 49977 44149 44195 45744 39251 41992 44164 41721 39399 40383 46627 47331 47353
20668 47353 43396 39240 28530 23862 23405 17632 13339 14119 17783 17467 11717 6201 8729 8534 5072
20653 5072 8999 12697 12567 15798 16430 18692 11520 12049 5867 4254 -645 -5764 -1879 -3740 -1289
20638 -1289 4954 -1669 -3787 -3728 -6385 -9673 -13721 -13161 -7837 -13135 -7436 -208 1486 4565 6570
20623 6570 880 -4812 -133 6013 7485 10750 7327 3396 1793 9465 9728 7822 6116 90 300
20608 300 2470 -2949 -9461 -9725 -11022 -6485 382 -1436 -3877 -1706 1137 11860 21232 19195 13236
20593 13236 15878 18863 20654 19657 23076 23972 26032 25320 27812 19211 10028 1681 7105 14912 10399
20578 10399 7630 -911 -4581 -545 2199 -6392 -14232 -21090 -33987 -43257 -49471 -49138 -51057 -57892
20564 -57892 -67165 -66483 -61733 -59897 -52817 -49510 -38334 -18409 -7539 5534 26238 50154 62175
20551 62175 69317 83330 92946 99610 107263 107139 107433 109834 94700 84680 86294 84570 78420 68374
20537 68374 59634 59903 60729 54124 51389 47975 43401 44464 44022 43052 42566 43132 46892 52917 56001 59139
20521 59139 67190 77175 81064 76418 75101 76593 77381 77843 80388 83835 81784 76683 86747 85180 86728
20506 86728 89730 86186 92386 101021 103670 107054 106999 108344 116206 119442 117587 116280 118592 117705 114923
20491 114923 118799 127853 134173 141167 146328 149153 151540 159884 170079 182108 188902 197384 208474
20478 208474 219414 233000 238158 248728 269098 283236 301747 328161 345130 351803 373446 397826
20466 397826 423693 450991 472408 507523 544322 578619 634122 692749 756611 832468 922845
20455 922845 1033810 1152961 1298843 1450128 1604608 1808413 2015515 2234422 2510538 2758086
20445 2758086 3010663 3357726 3718915 4125148 4710969 5434701 6360342 7659353 9363531
20436 9363531 11701291 15067024 19530292 24692988 31094916 39130674 46628950 54856847
20428 54856847 65682515 74888716 84172354 96515572 103065574 107129654 115379046 117245330
20420 117245330 115600217 117963102 113680707 106009787 102944698 94668679 82932823 74579921
20412 74579921 64732203 54312279 46926634 39502620 31968516 26140267 21197971 16951421
20404 16951421 13815059 11624007 10035224 8872217 7971726 7233071 6642191 6117561 5643799
20395 5643799 5226907 4823873 4443170 4093743 3749899 3435317 3150071 2877119 2634966
20386 2634966 2414296 2209482 2029854 1875680 1736744 1613740 1507645 1417811 1334910 1258842
20376 1258842 1186925 1118462 1052264 984639 923200 872126 823357 784136 746443 709076 677136
20365 677136 643527 618629 591820 562320 544793 527494 510214 502455 486019 469618 454664 439845
20353 439845 420664 406765 397681 387187 377507 363428 348533 336984 329324 322315 314381 307083 296677
20340 296677 288041 285348 285298 275915 265591 261521 255284 247215 235852 232735 224703 224157 219540 212366
20326 212366 206433 205883 202169 194154 193152 195746 196041 193550 189249 185283 178554 180090 183377 179450 170415
20311 170415 165762 158528 155948 153705 154180 156880 158218 154460 150492 146581 137744 132171 131798 131344 127922
20296 127922 124779 120346 125128 129946 140030 148702 156411 167749 174239 192992 212622 225782 233449
20283 233449 242877 245136 251191 263144 253698 242506 239311 236902 230143 221474 212280 198083 189610
20270 189610 182874 174345 167719 162331 156429 156297 161528 153466 151057 146899 146601 142793 139516 144691 149143
20255 149143 149684 152546 159590 171513 183039 193591 207957 229613 262269 317355 394034 481305
20243 481305 586537 718583 867640 1014370 1185154 1381940 1569480 1771364 1975260 2096731
20233 2096731 2207722 2320330 2342274 2330390 2335107 2252473 2128746 2034880 1870573 1659022
20223 1659022 1472833 1280008 1090383 939485 801972 673588 560120 460784 382877 320231
20213 320231 281004 253460 231966 203442 191276 189632 181497 170869 159119 149229 133902 121739
20201 121739 115352 110947 107045 104010 98422 91905 86647 81401 79942 75045 68454 67589 61500 58224
20187 58224 50352 42474 44278 54802 54379 50408 45436 41433 46853 51448 53807 50460 50344 52769 49051
20172 49051 45653 41750 46007 45469 46197 54275 57584 51841 49396 44255 34532 37408 46425 51629 48791
20157 48791 45712 44813 46736 41280 40144 41346 41391 50494 52478 49842 46612 41167 48303 46936 40384
20142 40384 35949 37224 36519 39677 34325 27508 25454 26825 22664 15615 20479 19622 17147 24194 31645
20127 31645 29648 27981 26383 27292 23468 25668 28190 33650 39449 35189 26956 22516 19229 21145 24352
20112 24352 24038 20702 16311 18225 21198 23878 19653 13382 20315 27213 31253 31892 34716 35864 35153
20097 35153 36215 25300 22017 20660 23750 34141 35737 38792 39717 35086 32777 32299 22545 21373
20083 21373 24486 27179 31579 27914 22578 18866 21696 22622 19561 20425 17780 11502 7714 18304 22239
20068 22239 22240 18278 13930 11868 16926 17314 18471 15130 16405 13229 16024 21122 19163 17053 18704
20053 18704 22304 25195 29169 30228 24970 25537 24217 26340 19955 13085 11997 21236 24493 19780 19559
20038 19559 15965 14514 12912 14199 20459 23488 16034 12202 9402 11124 17735 20185 21713 27589
20024 27589 24930 18988 21406 27641 20712 15318 17034 13670 13743 9349 13779 11017 4643 5227 9071
20009 9071 13987 13005 15209 17734 19999 22254 23633 20595 12039 7065 12576 20683 18990 16426 17373
19994 17373 22863 22828 21652 26183 26446 24138 22694 26915 21101 17760 15917 11553 7821 4682 15348
19979 15348 23464 26276 24005 17371 8766 13782 12810 11301 11161 5085 6969 14345 12961 3436 -53
19964 -53 8644 11537 11624 5955 6774 15776 13710 8591 11033 17118 7835 4946 11636 11454 11327 11155 11635
19947 11635 8513 5168 9886 9575 6741 8658 6462 5211 6645 8161 2446 336 -2628 1358 -1797
19932 -1797 -4509 -2218 6502 3879 5241 358 -5393 -7229 -2938 -7667 -12767 -10162 -6650 -3682 -9448
19917 -9448 -6649 556 4090 5123 7150 9733 12833 15812 12560 12989 17758 17422 16067 18170 21921
19902 21921 21750 17170 18762 21107 24452 22446 22700 25884 20057 14927 14153 18586 23088 26906 19157
19887 19157 15785 20031 21612 21126 15866 16232 15819 12755 13537 10871 5454 7055 12526 13711 10912
19872 10912 4803 8991 14296 14922 17586 15634 11660 14941 17348 14437 17555 20412 16780 9089 8954
19857 8954 11236 12931 13229 9889 11940 10649 10214 11035 16373 18165 12350 12267 20536 23141 23540 21298
19841 21298 14303 11264 11152 10255 13942 22638 27633 29292 34716 33966 25221 23077 27813 33312 35256
19826 35256 33453 36529 38936 45068 50988 55182 55544 58202 65149 67208 73530 84910 97906 102233
19812 102233 109472 122563 136122 160023 175326 198180 227383 263992 309709 356456 415971 494802
19800 494802 574007 670572 800344 943396 1116474 1353840 1628960 1966911 2382166 2843404
19790 2843404 3253576 3663986 4120811 4582527 5099069 5725760 6384847 6683106 6931813
19781 6931813 7137311 7019193 6911441 6960578 6924955 6578354 6355786 5893982 5153163 4508896
19771 4508896 3966315 3444893 2984739 2635407 2221567 1807079 1456202 1156070 925085
19762 925085 757655 645036 568499 508082 458561 418560 384900 355638 335583 317681 290109
19751 290109 266157 246790 222169 208728 190749 170628 157665 143187 135633 124389 113669 109180
19739 109180 104731 107133 101259 89805 80270 74497 70815 60445 59255 65134 65846 55602 46127 42104
19725 42104 41266 41218 40412 39795 41766 45634 45452 42182 38826 29685 31884 40234 35973 33496 37060 30302
19709 30302 26641 25237 25654 24574 18382 18249 21398 22878 22378 26511 21553 15986 14233 12466 20254
19694 20254 23686 22058 19064 24533 23176 22903 19692 14039 9452 7961 16275 21279 13823 13344 22421
19679 22421 23186 18348 16214 18961 21344 14732 11083 6559 8134 13594 13139 13213 11757 8291 10372
19664 10372 8510 3677 6436 10213 15370 14137 9138 8432 12202 12031 16942 17208 9278 10375 17746
19649 17746 26341 31750 36683 40895 44135 40221 31682 25598 22660 14896 16492 14809 14712 16293 17749
19634 17749 20154 18327 19825 16666 17779 11170 4467 3430 8632 15354 7657 7083 6307 3490 -1572
19619 -1572 5697 16284 18388 20021 16627 12809 7741 12380 13160 12673 17365 16888 20444 23899 24558
19604 24558 19137 20327 15267 11374 15438 14564 11701 11952 10524 9167 9076 7650 7542 6947 15443 17599
19588 17599 12414 13046 7792 3039 1368 5154 8428 3698 -4596 -1337 2094 1903 5758 7461 12069
19573 12069 13162 9921 3317 -3931 -2171 2772 6028 9724 4041 -818 4796 8379 9605 -1308
19559 -1308 -5640 -548 -5467 -7519 -4487 -6027 -7175 -8441 -4763 -5657 -2623 -6254 -9365 -7479 -3489
19544 -3489 -1373 -6371 -7960 -8868 4277 8009 849 -738 1256 -1525 -3292 -10124 -6897 -3651 -1162
19529 -1162 6017 13768 8070 6517 -1246 -1233 135 -4862 -3248 336 -2661 -2159 -2191 3265 4502 6865
19513 6865 1011 -419 -5425 -9398 -35 -1215 -1075 585 2110 3203 3129 3082 768 396 858 6905
19497 6905 8174 8294 14138 12834 11220 11524 9379 11048 6556 8002 6663 7711 3214 -2829 4507
19482 4507 2333 -822 6206 8834 6651 6108 1092 -3036 -5980 -5111 2890 1754 -4218 -12369 -13384
19467 -13384 -4521 2328 4428 2987 3845 1967 1815 -281 -517 -4965 -4801 -3663 -7522 -7417 1663 -246
19451 -246 375 1649 -484 -2848 -1462 1864 7172 -270 -5668 -5378 -959 -2567 -3629 -3418 -457 -4150
19435 -4150 2331 2913 4908 11704 10311 -1036 -1020 7175 6874 7111 6273 8356 7854 3572 -3235 -8066
19419 -8066 -2462 249 1233 449 -2085 -818 -2553 -961 -1815 4450 3606 5761 6582 -3397 -5083 -9195
19403 -9195 -10297 -8168 -6588 -10016 -10047 -12134 -13818 -11926 -7994 -6507 -6371 -6763 -5909 -10174 -12713 -2992
19387 -2992 -257 4225 2486 -1563 -5454 -6652 -2031 2930 5981 1734 -3153 -7895 -8617 -9520 -13371
19372 -13371 -14557 -14739 -11995 -6235 -1199 667 629 2081 2308 -1921 -11042 -10480 -8230 -2631 1594 3808
19356 3808 -3299 -8184 -7137 -8795 -7293 -7150 -6424 -373 1888 -4914 -7490 1432 7892 10440 8382
19341 8382 2378 -3460 -4094 -6958 -8294 -4392 -3855 -4648 1925 8856 1208 -2387 2089 2244 2038 -2894
19325 -2894 5674 2004 -7226 -6160 -5602 -6076 936 1474 -3009 -11191 -14024 -10296 -4685 -1394 -7772
19310 -7772 -11823 -11051 -7504 -4359 -5704 -7846 -8678 -7898 -3775 -4290 -4276 -11474 -10526 -7320 -3475 -3087 -319
19293 -319 269 -3720 -1050 -786 -1938 68 6136 8604 3859 425 4430 5604 6087 6287 5196 5591
19277 5591 7574 6288 4941 6778 9898 15956 14022 10559 5286 409 -2557 -10027 -5171 3153 6260
19262 6260 9254 -328 -2675 1076 3265 9269 13453 8167 -762 -2056 -4293 -7885 -9795 -4813 -332
19247 -332 -4925 -4032 7312 16499 10024 6869 5639 5084 3759 -341 -51 2407 1487 -6828 -5392 -5425
19231 -5425 -5227 1756 4437 3371 2420 -3063 1713 7194 11718 8402 6183 639 1456 1070 -3546 -8051
19215 -8051 -5735 -985 -7358 -13944 -19846 -11864 -11263 -13926 -12533 -5034 2829 -6256 -10127 -4219 251
19200 251 2112 -3594 -3722 -3208 1777 7960 12603 4800 3447 2919 -7799 -5428 2740 4062 -2285
19185 -2285 -1080 8718 11815 5667 6847 10071 12320 10301 12764 11499 8777 11044 14416 12205 13660
19170 13660 8799 10807 17408 20862 25555 30246 29779 27026 30484 24981 18199 22610 33494 35252
19156 35252 35648 36105 35434 20257 15259 14763 10839 6705 7781 13457 11351 7400 2860 2989 9425
19141 9425 12656 6887 3002 5368 4796 1930 4230 7223 4546 -8057 -9530 -7996 -2333 -2263 -4455
19126 -4455 -5298 -6235 -7176 153 8658 2237 -3587 -4496 -3065 1118 1119 4381 8045 1043 -339 2148
19110 2148 7747 4865 -3664 -4927 -2475 -2558 2240 3686 9987 14275 10567 8748 4924 -3121 -4768
19095 -4768 -4773 -3845 -6517 -3973 -1264 -1154 -1591 -3929 -3632 -5491 -3628 -8204 -8024 -4909 -4677 -8418 -10579
19078 -10579 -11561 -12881 -1631 5857 4054 3382 954 1233 -30 -5467 -10430 -15194 -14462 -12189 -10997
19063 -10997 -10279 -5273 2628 796 -1284 -3337 -2468 -4024 -10246 -3521 -1202 3111 4351 -2841 -623
19048 -623 4242 2466 2979 -2849 -10657 -7341 -4232 -6869 -7879 -7202 -10256 -10916 -4958 1089 2934 -541
19032 -541 -3978 -2569 -2323 -3304 560 570 -556 3031 524 2850 5067 5516 8101 5586 -788 2051
19016 2051 6996 3605 -3890 -5620 -6252 -13192 -9913 -4538 1843 3659 6018 6543 6186 7906 7963 4996
19000 4996 2646 -2904 -222 3025 4198 2805 5833 7689 7230 3131 3850 1110 -4573 -5729 -8042
18985 -8042 -819 7329 5518 1875 5154 4504 -720 -3580 -6932 -7032 -4412 -4549 -1778 2204 3239
18970 3239 -1871 -7881 -10487 -14505 -17581 -18823 -14251 -12794 -9334 -7114 -6359 -3980 -2285 -6483 -8356
18955 -8356 -7327 -7533 -11894 -16487 -12016 -8412 -9120 -3289 -497 -7885 -13606 -7254 -4126 -3414 -660
18940 -660 5404 3539 -492 -3356 -5660 -5353 1896 -42 -2490 -5118 -4963 -1073 -4744 -10211 -12361
18925 -12361 -6692 -4936 -4163 -1609 -360 -3660 -1819 -2495 917 3267 1763 2268 4361 -1283 -1311 3745
18909 3745 680 -5742 -7172 -11847 -15314 -3708 -3372 -3805 -425 2942 154 4303 5189 4237 3226
18894 3226 -1429 -5286 -6575 -1077 5637 3769 146 8312 4726 -7676 -6845 -5804 -9497 -10937 -7573
18879 -7573 1853 3148 -6528 -14094 -9458 -3242 2552 -1474 -2640 -497 -286 -5637 -6530 -10609 -12205
18864 -12205 -6238 -7127 -11360 -11494 -6219 986 682 -545 337 -10013 -6660 -728 2250 -2549 -3339
18849 -3339 1803 3884 4892 672 365 2987 3620 1182 1747 1530 3106 391 -3464 -8985 -1479 -452
18833 -452 3946 2687 4870 -909 -3163 -10329 -4559 -4338 -5105 -3576 -881 6578 2235 -5836 -9476
18818 -9476 -7474 -6481 -4378 -12083 -10817 -9630 -7609 -6233 -7831 -12681 -15249 -14153 -13195 -4842 -5126
18803 -5126 -6408 -8914 -6213 -2632 -3642 2262 -3225 -3111 951 -5215 -12298 -18456 -16732 -9538 -2334
18788 -2334 -6366 -6474 -8511 -8162 -5839 -4057 1247 20 321 -1738 -210 10508 9342 9089 9673 2688
18772 2688 -8176 -10843 -5191 364 2177 2299 204 -6522 -6918 -4082 1643 -6284 -10589 -6689 -734
18757 -734 4694 4435 9498 7677 6153 7521 2083 -4487 -5153 -3150 -2366 -6742 -9706 -7856 1908 1878
18741 1878 1573 946 -2222 -5613 -1117 -4107 -4575 -1955 -5975 -4532 -7522 -8735 -3782 -6736 -9748
18726 -9748 -10284 -7771 -6197 -8347 -8985 -9527 -3744 4494 970 -4887 -3667 -2090 -10332 -17012 -22971
18711 -22971 -21093 -15024 -8309 -5070 -8929 -13803 -9534 -722 -3288 -6654 -4715 -6251 -8279 -7176
18697 -7176 -1121 -2654 -5427 -10718 -17385 -15707 -1747 -3055 -10528 -9647 -13659 -11022 -11225 -8228 -2546
18682 -2546 -3185 -5980 -6201 -6088 -2827 -1820 -6507 -14371 -9207 2666 8158 10162 11078 10096 7951 5431
18666 5431 -38 -4621 -3385 -3596 -6081 -7787 -4437 -5035 -5004 -6819 -12709 -18239 -13338 -13638 -18569 -25873
18650 -25873 -25013 -16014 -12941 -12922 -8862 -1810 -4193 -2409 461 4523 10628 7727 -1108 -8182 -4893
18635 -4893 -2445 5017 6049 -7022 -12531 -6177 -537 6034 4506 635 -1424 -1939 -3144 -5737 -5157
18620 -5157 -652 5999 3773 1268 -2538 739 5100 3203 -3402 -2552 992 4419 10873 14042 13120
18605 13120 8261 1408 2214 5391 1536 -3422 -5789 -6851 -6058 -4791 -6409 -9689 -13511 -5030 -2707
18590 -2707 -8443 -9198 -8089 -6367 -4834 -8379 -4705 -2093 -3498 4087 1843 -1866 -5226 -1270 3145
18575 3145 716 -4464 -3627 -8623 -8911 -9353 -5241 -6829 -7614 -10887 -8817 -3326 5100 6894 3684 -243
18559 -243 1808 -1129 -3083 -4967 934 4349 -973 -1173 -2176 -2405 -6246 -5433 -7151 -7330 -5725 -3513
18543 -3513 -288 1176 3705 526 -2882 -6771 -1139 -2177 -8065 -6151 -8384 -15716 -10946 -8713 -7974
18528 -7974 -2472 885 2808 3153 1288 -4567 -7771 -10770 -9351 -6858 -9125 -9771 -8451 -3241 -7816
18513 -7816 -10924 -5163 -2304 1474 -2458 -5401 -4137 1147 -2029 -5850 -5017 -3904 1719 106 -4503
18498 -4503 -8831 -9993 -5455 -1339 -5242 -13076 -13949 -14560 -16110 -13282 -7431 -226 4227 3966 1378
18483 1378 -1079 -411 4643 -4378 -8738 -7082 -8256 -7426 -4095 -4714 -1071 -2684 -4110 -7768 -2572
18468 -2572 -5718 -8278 -4101 -1855 -964 1947 3087 -1163 -2486 206 -836 1062 -1401 -3681 -9560
18453 -9560 -7439 -6064 -7538 1901 1362 4538 8123 374 -5993 -5724 -6724 -5741 2610 4543 2004
18438 2004 1803 4104 -1745 -5411 -1117 539 -963 -1755 -380 -1463 -3006 -7005 -2252 -245 6883
18423 6883 7428 2542 -2831 -867 486 -900 -345 1843 3701 5411 5555 10040 13498 12511 9628 5035
18407 5035 -422 295 8240 10532 3153 -4151 -7333 -9226 -4395 1347 1509 9042 16690 14297 23146
18392 23146 27243 28857 25388 12815 4186 3786 2281 -3668 -1129 288 440 1769 4305 4621 2499
18377 2499 -3369 -3367 333 3657 4308 6051 10864 5838 3232 -450 -3183 -4866 -5560 -1214 1327 2984
18361 2984 2629 3131 -6946 -13255 -6891 -7445 -2031 6181 6423 -1589 -11806 -17453 -14223 -14356 -13571 -8678
18345 -8678 -10105 -13763 -7355 -4114 -4399 -1057 -628 -6930 -6872 -7948 -3057 1162 -6421 -14934 -17570 -14960
18329 -14960 -12433 -12251 -14254 -16121 -11759 -10877 -9921 -2744 -5460 -6122 -7016 -12955 -13986 -8180 -3372 -7912
18313 -7912 -5983 -5996 4992 9555 5750 1983 4756 3061 4044 1061 -1348 -2486 -1149 -894 -2881
18298 -2881 -9579 -15208 -15295 -16059 -10450 -2512 -2241 -1985 -509 6650 16362 7145 6113 6277 -3075 -7772
18282 -7772 -3070 -2550 -568 1624 2349 3970 8541 9065 3589 -2786 -1648 3393 5671 2518 6590
18267 6590 3464 7578 11682 7795 4996 281 -6982 79 -128 -7535 -10550 -16770 -17205 -14559 -18149
18252 -18149 -16067 -5240 -4591 -3853 -1902 -3888 -2429 473 3897 2746 -2147 -5966 -6786 -4655 -4933
18237 -4933 -2718 -2390 -5086 -4687 -1258 -450 -2128 270 5316 4842 3609 4585 4142 1255 2642 2146
18221 2146 -1134 -4632 -3742 -2232 2250 -426 -8115 -11189 -5821 -4148 -4445 -4001 -7888 -8303 -5415 -7305
18205 -7305 -7465 -13022 -10715 -6033 -2936 -3513 -4980 -5099 -5814 -325 -975 -854 -1425 -6398 -9744 -12018
18189 -12018 -7987 -8008 -13678 -14377 -9634 -7132 -9314 -12226 -17647 -16948 -6248 -4047 -3366 -11007 -15212
18174 -15212 -21960 -19542 -10067 -6387 -8116 -12698 -11536 -5068 -6710 -1400 14754 10246 11208 9072
18160 9072 10386 14763 21466 24854 16291 7650 4578 5480 -1518 -5022 -2999 -1198 -3715 -4849 -3600
18145 -3600 -458 -6257 -16245 -11802 -9473 -12422 -4301 -455 -2117 2103 2154 445 4479 4053 -6859
18130 -6859 -8944 -7857 -7563 -8346 -10362 -8637 -5459 -7655 -11250 -6863 -6274 -2951 1856 1877 3418 12845
18114 12845 22569 21233 23556 26405 21070 15045 18924 24442 25199 26012 32539 28231 26727 25844 25101
18099 25101 20968 14900 13767 10266 6530 4788 4514 -3142 -5311 -7520 -260 354 -5625 -985 6442
18084 6442 11336 7114 2256 2356 6995 11901 12451 8660 6934 8691 14922 19229 28695 30733 27490
18069 27490 23375 19070 15043 14991 10892 15593 17495 12600 10183 12609 17752 15032 10166 6171 4758
18054 4758 2831 -377 -3218 -2936 482 2556 -1005 -5691 -4161 -5370 -363 3980 7608 10377 8942
18039 8942 4747 8414 1383 -1600 3528 2692 2655 474 -2672 917 2640 -2331 -9203 -2544 6754
18024 6754 7730 3528 1064 -5386 -14853 -11566 -4916 -2243 -7241 -11934 -9065 -6404 -7938 -4631 -1693
18009 -1693 11602 10651 7545 1840 -7988 -8495 -9377 -7036 -4333 -6075 -9827 -8771 -5340 -5825 -1219
17994 -1219 -4769 804 5808 5661 5027 1750 -904 -307 1038 -4277 -589 2918 5218 467 -3746
17979 -3746 -3502 308 8866 20534 29597 33294 32185 31886 33381 26639 31237 32429 29288 27807 30437
17964 30437 34087 30923 27164 32773 33373 31619 26882 25204 18657 15065 14651 10955 3895 7854 9380
17949 9380 3548 4178 -1809 -2422 399 2674 7798 13070 13589 8450 7733 4194 3412 6634 10506 8269
17933 8269 3997 5094 12631 16945 14909 15651 20258 13284 11248 14495 14754 17509 17104 13262 9332
17918 9332 4224 14409 17573 21935 23468 19547 14127 10298 15683 17402 12509 7170 -813 5156
17904 5156 8613 7249 4906 9363 11277 10490 10098 14729 8995 7622 7032 7040 9250 8469 1567 -2340
17888 -2340 -3895 -9033 -6690 243 3669 5357 9131 10338 5685 7325 8066 -1102 -7411 -4193 -571
17873 -571 -260 -5770 -5973 -574 -3738 -4849 3182 864 452 -95 685 -5783 -11575 -11202 -86 4184
17857 4184 3971 7606 3703 3193 5728 1605 -2309 -4440 -5753 -10594 -8160 -7497 -3295 4125 1741
17842 1741 907 -1212 3452 10267 8133 1775 -2253 -3252 -816 -2558 -5940 -8278 -11425 -8849 784
17827 784 3419 2512 1315 3114 8781 4170 7816 13582 15341 17508 15024 10258 12164 10925 15572
17812 15572 15578 9145 -105 -5203 -10272 -8476 -5303 -4012 -4836 -10347 -3742 637 -2121 245 4104
17797 4104 7459 12280 9009 4927 9319 3080 2053 534 -1149 -655 1617 101 -4337 2543 4875
17782 4875 3930 4450 7440 11803 22648 22766 12084 3976 5629 -2188 -10374 -10334 -6999 -9690 -9735 -9876
17766 -9876 -11972 -4909 6496 9633 5721 4237 4721 3031 749 -5488 -7324 -10385 -8184 -9645 -10719
17751 -10719 -6958 -2695 -1647 5478 9395 7485 2794 1818 6514 4854 6458 1649 -2521 -2113 -5488
17736 -5488 -8621 -5512 -4996 -11180 -13263 -11810 -8920 -4504 -8084 -4699 1737 506 -58 -3402 -6377
17721 -6377 -3485 805 -253 -1211 -6743 -1029 8859 9784 5799 1163 -3645 -5887 -11330 -12529 -14741
17706 -14741 -10298 -6593 -3927 -1400 -897 4138 4968 9366 4371 -368 -2582 -6283 262 4155 7608
17691 7608 5791 7842 7170 4603 1580 -1839 2527 4941 682 6172 6623 -1067 -6967 -1202 348
17676 348 -1866 -157 8550 6564 1008 -8761 -9223 -6067 -6170 -1760 -400 -1777 2849 11812 11639 5317
17660 5317 8846 8723 1824 -3170 -6696 -2171 1653 344 309 243 9438 14096 13143 11138 6364 6730
17644 6730 10561 12989 10068 7177 7576 7290 4306 -3413 -12756 -10988 -270 3089 3436 9401 8590
17629 8590 3721 1596 -4282 -541 2949 7643 10519 4847 -3841 -10320 -11981 -9777 -8261 -1008 -1089
17614 -1089 -3763 -2626 737 3504 2925 3752 17409 20509 21091 24209 22348 23733 25511 22179 21162
17599 21162 19617 20238 17223 15648 21846 14843 6660 858 2334 6671 -989 -6320 -6684 -2334 -214
17584 -214 1522 2562 268 -2150 2273 4651 6178 8987 8968 12643 8089 8703 6195 8526 7077 -633
17568 -633 -6863 -6005 -4497 -5542 2019 8931 6503 931 -5324 -2937 3603 2811 -139 190 -5044 -5528
17552 -5528 3389 8575 5389 3766 2336 7129 9257 9208 10056 9012 9288 15464 16685 17132 16728 12121
17536 12121 14381 12808 10619 9219 10608 8176 7153 -1091 -5553 -109 4525 1959 2033 1653 -1973
17521 -1973 3313 1770 -1163 -6281 -10442 -10059 -2951 1764 3050 4499 8064 8155 5903 5293 4509 2380
17505 2380 -4309 -6542 -2383 5291 3971 -139 4278 7458 7136 2768 -4402 -6191 491 -6329 -9809
17490 -9809 -2244 1809 -327 -8032 -9775 -3531 -243 -195 6896 4854 4725 -2613 -5741 -6336 -14116 -16500
17474 -16500 -12072 -5027 2016 2584 329 8540 14484 18477 13496 13648 12420 5842 6215 9674 5074
17459 5074 5646 6815 8827 8747 4274 5880 223 -5668 -2971 -1035 -9048 -12126 -8497 -599 2646
17444 2646 -1246 -2364 -9597 -11140 -14237 -17050 -13887 -13901 -11593 -6931 -3314 -6449 -4268 436 1959
17429 1959 476 7308 11530 16201 12978 2756 3584 2564 2835 2081 97 -1213 5216 9712 10377
17414 10377 10931 10628 6722 2334 3420 3948 6874 4919 444 -2271 -5203 -12601 -11935 -6190 -263
17399 -263 -42 820 772 4925 1376 -5861 -11960 -14393 -7533 -1232 2497 7627 6608 -1776 -2294 -6379
17383 -6379 -6867 -5670 -2327 -2655 -5188 -2366 7085 10444 2840 1937 5699 5534 1981 562 225 2543
17367 2543 4552 7690 6059 1138 -1517 -2496 -8706 -1895 7372 -1445 -6492 -3397 -3813 -6711 -8549
17352 -8549 -8494 -5535 -6958 -6969 -5412 -6822 -5206 -6338 -4072 -6904 -4580 -3772 1634 -1784 -2572 -6445
17336 -6445 -9324 -7991 -7361 -12974 -11990 -13371 -8072 -10015 -8402 -8079 -11409 -9555 -11628 -9627 -1142
17321 -1142 2370 -1834 -6004 -7834 -11228 -9373 -4616 2135 696 -661 -1688 -4668 -10172 -10598 -10799
17306 -10799 -6998 -11808 -9751 -1893 2253 7114 6803 409 -8367 -7289 572 -2159 -4385 -689 4378
17291 4378 12436 15841 17932 15977 7033 1845 3438 1193 -791 3081 10398 8115 2058 -172 -3683
17276 -3683 -4716 -1752 -2085 -9109 -15071 -14842 -13094 -7650 -6847 -1955 -2350 -4235 -9455 -14503 -13031 -13147
17260 -13147 -11521 -14040 -10254 -5050 -3201 -6430 -10806 -8934 -5872 -1078 2491 -3158 -8581 -15299
17246 -15299 -14104 -13410 -14412 -11486 -10794 -5252 -4971 -3795 -3739 -10488 -15394 -10801 -7144 -4371 -4156 -10760
17230 -10760 -10652 -10870 -11490 -2845 999 2472 -3056 -7940 -6152 -9527 -9405 -13943 -14249 -16887 -20975 -16920
17214 -16920 -15676 -10618 -4001 -5713 -2965 -4599 -5298 -12602 -14269 -11452 -12239 -7568 156 3905 3463
17199 3463 3973 6544 338 -3559 -8531 -10153 -11252 -7739 2612 3026 -184 -7477 -11771 -20949 -23261
17184 -23261 -20859 -18305 -10710 -9296 -9090 -11599 -15070 -6194 -1349 -9213 -8213 -3673 -8308 -6388 -4851
17169 -4851 -7082 -10118 -13101 -8638 -13854 -1026 10383 11412 4826 921 7481 10153 7324 3010
17155 3010 -4509 -9572 -10633 -11830 -6454 -96 -6420 -8041 -6583 -4053 -3320 -386 -3696 -5311 -4382
17140 -4382 -5978 -15107 -13809 -8050 -4203 -4818 -3900 -786 -586 -2520 -2516 -5392 -13886 -18177 -19044 -16986
17124 -16986 -12295 767 2242 1163 -1977 -4087 1495 524 -3031 -1814 -6125 -5869 -5647 -6820 -5499
17109 -5499 -4150 -2183 -8535 -15151 -17978 -14165 -7531 -7687 -4977 661 -1523 -8039 -5742 -4642 -1611
17094 -1611 -667 -1204 497 2932 -3234 -5810 -2810 5566 7737 2468 1490 -5402 -6160 -6986 -4905 -5872
17078 -5872 -7527 -3689 356 3071 2053 4536 1574 -4964 -9734 1427 -2000 -9189 -7249 -4500
17064 -4500 -10804 -12143 -4461 -3134 -5748 -825 3269 3775 2456 -1136 2638 3771 5995 -1269 -6669
17049 -6669 -9644 -8016 -3976 -4162 -8322 -12042 -8862 -4694 -7469 -6443 -7673 -381 -1246 -12 -504
17034 -504 -2268 -7800 -13405 -10314 -7270 -8438 -7093 -10220 -3726 -1368 -1726 -1962 -2106 -1058 -827 -4948
17018 -4948 -6747 -1889 3211 7731 13792 13554 3905 3293 8882 7398 5216 4720 1147 -3638 -11473
17003 -11473 -10177 -6482 -3700 -3953 -4483 -4340 -1706 4881 9302 5022 1781 -3611 -5315 -6499 249
16988 249 6320 10578 12290 4262 -3129 -8123 -10136 -10876 -13903 -12117 -12469 -10239 -1787 2312 -1237
16973 -1237 -7397 -5367 296 -4169 -4423 -6640 -7887 -8969 -2211 -4540 -3765 -2417 1762 2326 1133
16958 1133 1789 -3080 -2530 3658 -2487 -5605 -6976 -1648 309 4806 4456 831 -6819 -5063 3294
16943 3294 6103 -5028 -8412 -5027 -7422 -8402 -15157 -22344 -17930 -11188 -13974 -12993 -7649 -6266 -7874
16928 -7874 -8844 -7377 -9648 -14867 -13117 -5885 -5088 1004 -4119 -10090 -10876 -17515 -20959 -12710 -11234
16913 -11234 -14926 -19738 -23134 -23687 -21196 -16191 -9147 -5906 -4008 -9089 -14758 -14656 -11993 -15103 -19033
16898 -19033 -11860 -7567 -13964 -14181 -10966 -10480 -7263 -12019 -10949 -8734 -9683 -9436 -8548 -2453 -10544 -13032
16882 -13032 -13853 -18210 -14448 -12106 -14051 -9544 -4714 -7781 -9161 -7522 -9290 -4158 -3142 369 14799
16867 14799 19239 14271 -314 -5447 -6082 -3345 -5979 -9320 -14470 -10678 -1479 4084 8016 5251
16853 5251 734 1131 1448 152 -49 -3468 -187 4775 3621 467 -1535 -1827 -6182 178 1811 -3136
16837 -3136 1271 -165 -3234 -13384 -20057 -20638 -17693 -16088 -18852 -19248 -14707 -4995 1136 1540 1317
16822 1317 1457 493 -2415 -5411 -2455 -1937 -1409 -7365 -11275 -12315 -12746 -7707 -6703 -9273 -6208 -6876
16806 -6876 -5376 -6575 -8737 -6309 -8406 -13189 -6156 822 -2426 -5254 -5370 1007 -2963 -8218 -8985
16791 -8985 -2122 -987 -327 -3861 -2043 -545 -4527 -5021 -8302 -10074 -6989 -593 -1962 -3535 -5290
16776 -5290 -2668 -4497 -5263 -6153 -6363 -8558 -6767 -1092 -323 -5055 -3143 2805 -688 -9094 -7945 -6390
16760 -6390 -6997 -5924 -10081 -4207 1363 2025 -8614 -11936 -10247 -5995 -3107 123 -2122 -8824 -11041
16745 -11041 -3627 -3167 -7101 -10512 -13056 -10869 -6954 -10234 -6835 -57 -1348 -908 -3122 -9402 -10754
16730 -10754 -12464 -10651 -8155 -6547 -10174 -10149 -7079 -5021 -456 -1584 -6334 -8074 -8242 -12009 -11141
16715 -11141 -5485 -2129 -4005 -2212 -1462 -10888 -15076 -19999 -17112 -7286 -1922 -6194 -11240 -14603 -14757
16700 -14757 -13548 -10728 -11042 -15155 -14255 -7866 -6321 -13105 -13447 -10143 -9201 -6050 3921 876 -6277
16685 -6277 -4503 -3170 -5243 -8575 -10723 -12554 -7695 -6039 2788 -847 -2270 -7280 -12667 -3747 -4185
16670 -4185 -2651 -4714 -553 -3798 -7211 -7697 -5213 -4111 -10847 -7167 -8287 -6140 -5649 -1816 -3262
16655 -3262 -6966 -9037 -6750 -5354 -1817 -554 -1712 -3677 -2828 -2740 -9086 -13437 -7249 -7673 -9545 -9438
16639 -9438 -8851 -7190 -2901 1919 2709 318 -749 12110 4939 -3019 -6281 960 -1795 -2464 -2277
16624 -2277 1658 1010 -3115 -8386 -7768 -7507 -6263 -5875 -5419 -2545 -2367 -2573 -5886 -3447 -610 -1450 -4508
16607 -4508 -2839 -8269 -8297 -5634 -9745 -14596 -15560 -12456 -6165 3635 5949 49 -2895 -2428 -2287 -8594
16591 -8594 -7262 -3461 -263 -3267 26 6223 3190 3990 4422 2231 -5035 -6649 2782 6048 -182
16576 -182 -6682 -6651 -5015 -3027 -2039 -3768 -6669 -8245 -4562 -9589 -10536 -16018 -13090 -11737 -2633 -855
16560 -855 -2840 477 2599 -3541 -9309 -11527 -8741 -8836 -13923 -11447 -10391 -7950 -2597 242 996 -586
16544 -586 -10475 -21232 -24737 -13108 2113 3953 6402 6173 -1630 -2835 647 -3869 -6391 -1306
16530 -1306 1082 -1655 -8903 -10140 -2616 -2235 -165 -3003 -5289 -10944 -5130 -3056 -2483 3876 5633
16515 5633 1434 -5936 -13002 -13612 -10119 -8882 -9422 -4755 -8171 -7547 -6142 -6457 -8708 -10968 -9829 -11268
16499 -11268 -8829 -7959 -12476 -14876 -15158 -12800 -7118 -7556 -3265 1059 -1823 -6000 -6494 -3844 -2021
16484 -2021 -3361 -2871 -2097 -529 5548 3109 -3007 -5781 -11627 -13144 -13090 -13995 -9953 -8663 -4088 -3594
16468 -3594 -1683 6665 5591 6639 6503 8013 4623 -901 -4977 -4369 -6404 -9696 -9975 -8679 -9090 -5026
16452 -5026 -3186 -4183 -4309 -5343 -3959 -7161 -11052 -8980 -6316 -5074 -1183 -6707 -6392 -2425 -6759
16437 -6759 -8404 -8295 -427 4827 1537 -8615 -10526 -7915 -5920 -4229 1311 4644 5054 -1211 -12763
16422 -12763 -16455 -15474 -13043 -11129 115 3071 -472 -267 1831 2475 7370 7016 -6757 -10908 -8368
16407 -8368 -6574 -6645 -8483 -10070 -7820 -3688 -1647 -4129 -4412 -3399 -1818 -3851 -3205 -3376 -2228 -4079
16391 -4079 -7854 -4247 3095 4081 -99 -267 -1857 2219 6670 9008 5390 4736 5293 5910 7913 4944
16375 4944 -1694 -5702 -219 7501 7062 834 -3183 -4338 -7407 -9780 -11446 -10835 -15784 -20497 -18148
16360 -18148 -18074 -10650 -4341 8200 12067 10424 7220 -2507 -10290 -8123 -9732 -15335 -17340 -11873 -5679
16345 -5679 -5646 8085 14333 6931 3227 -1666 -8591 -14898 -17716 -11007 -6331 -7196 -3304 69 5970
16330 5970 9297 5884 7224 4269 -1055 -2819 -5185 -11201 -7767 2156 7957 1649 1388 7955 4599
16315 4599 1904 -4654 -5720 -3298 1977 4040 378 -1416 -1098 -3986 -6386 -7077 -3728 -2587 -2614 258
16299 258 -1649 -2474 -9746 -14375 -11018 -2873 6011 8803 7559 8935 7608 2250 4869 5035 -1487
16284 -1487 -3972 -661 -3661 -3787 -4952 -7691 -5391 -2661 224 7130 10006 4466 2968 -178 -1030
16269 -1030 -4154 -3451 -3114 -2587 4761 6032 1029 -653 -1887 4132 6474 2699 -3417 -8977 -12871
16254 -12871 -15753 -5656 1130 3361 -3274 -4263 -1153 3633 5998 3916 -3315 -13386 -13841 -7399
16240 -7399 -2353 1159 3019 76 -1033 -5343 -8350 326 3757 -1177 -5353 -4540 -6205 -3766 -6462
16225 -6462 -1098 -921 776 2340 -2043 -2505 -3509 -5347 -2689 -2382 99 -4593 -16030 -15730 -9304
16210 -9304 -11866 -7780 -5902 -5397 -7021 -10580 -14039 -9112 -9266 -13855 -11998 -10572 -10499 -9304 -8552 -10493
16194 -10493 -13156 -3513 5477 2743 -5843 -8550 -8380 2458 9553 5350 -7931 -3643 17 -5353
16180 -5353 -12727 -14338 -11441 -3106 777 -1145 -5430 -10235 -16540 -7329 3605 88 -2556 3258
16166 3258 8011 7535 10671 10387 6313 7826 8722 6892 8250 4004 939 -3686 -8072 -7533 -761 -438
16150 -438 2494 7209 6890 1843 840 -6515 -7691 -2409 -2720 -5297 -9463 -10101 -9968 -10486 -13638 -14575
16134 -14575 -15470 -7883 -6798 1114 6621 1819 -1337 2005 4088 -3060 -2424 2433 2650 6213 10826
16119 10826 9630 6812 9348 5873 -466 -5847 -12206 -22150 -16251 -6082 -307 -7238 -9412 -6354
16105 -6354 578 -1350 17 2859 5025 4606 8963 12412 13338 10279 -531 -1055 -2801 -6861 -5627
16090 -5627 -1988 -71 -66 217 -3479 -5592 -3787 -9892 -5416 -8 2168 -2669 -5897 -956 -3516 -6814
16074 -6814 -10547 -12177 -7776 -8309 -11707 -12484 -7612 -7116 -5475 1960 3617 6554 4443 5036 8491 3972
16058 3972 7212 10253 3631 -3253 -3402 -7272 -9683 -1906 -4146 -3156 -1541 5802 6876 4296 11039
16043 11039 13301 9523 9505 9481 10743 13691 9672 4113 2727 1934 2954 6471 -3764 -8905 -5008
16028 -5008 -3538 -3756 -4012 -2946 -1509 388 4205 -4303 -6597 -7072 -8985 -6820 -1617 -2382 -1301 -1757
16012 -1757 -669 -1374 357 3024 3792 6746 3477 2935 2741 4277 4528 1985 4792 9223 9557 7641
15996 7641 8500 9842 7840 5696 6501 2381 -7181 -8980 -2587 4816 5477 5441 5366 6322 8521 6365 -5680
15979 -5680 -7100 -4502 -4240 -5983 -8736 -10898 -5075 1007 9822 10079 3935 -149 -2587 783 -1666
15964 -1666 838 4842 3002 -2655 -5560 -7083 -2999 -1088 5105 5732 1717 -2232 -9765 -7236 -10902
15949 -10902 -4830 -5870 -8389 -11042 -13379 -9176 270 5729 6893 613 1418 4801 8376 12742 6503
15934 6503 1987 -137 -5809 -12323 -9601 -726 10973 10549 5931 5844 7895 8612 6433 1303 -22
15919 -22 -493 4766 3795 -1023 -4172 -3415 -2576 -3059 -6227 -6936 -3316 -3172 -5166 7360 9732 4479 -676
15902 -676 -4062 -142 3266 9441 6126 -1949 2151 -1215 -1995 -3934 -670 1414 -575 -1886 2120
15887 2120 6637 8750 8114 2587 -2094 1616 3394 6602 4210 -1387 2822 6214 1806 3303 8777
15872 8777 12760 16793 9782 5651 -187 -164 3842 4183 5837 6610 2989 7564 15006 12843 2549
15857 2549 -1716 -1220 -2154 3575 3582 -931 -8684 -7973 -5467 422 1173 5526 5476 -2404 -13893 -20230 -14684
15840 -14684 -2911 2658 -1407 -2527 -549 -3768 -5297 1207 8639 11084 7916 7508 9724 14007
15826 14007 9944 9384 10939 16769 9223 1574 3847 10433 6169 4321 10172 16031 15293 11796 13840
15811 13840 5044 -5174 -13189 -9103 -2745 2884 6135 5105 -3416 -7831 -8773 -1853 4145 3177 10234
15796 10234 9144 7133 904 1012 -4819 -885 4201 -224 -7211 -4462 345 -189 2913 2459 1480
15781 1480 5410 -1184 -3449 -3950 -5354 -12446 -14318 -13779 -9841 -2844 2269 6516 4036 3969 5035 -1250
15765 -1250 -6628 -4145 -2737 -5228 -6599 5 7883 2948 4612 -653 -2007 155 1100 -7037 -354
15750 -354 -1479 -3525 -4208 -2963 -25 -7231 -5059 -1597 -2674 -625 -4404 -7655 -6785 -6948 -3726 -3849
15734 -3849 -661 -1943 -7771 -8547 -5530 -9885 -5923 1166 4727 3287 1808 -2438 -5305 -5755 -7924
15719 -7924 -7142 -2160 -687 2347 5122 6079 -571 -1374 -971 500 6001 3439 -2082 -6076 -16323
15704 -16323 -6787 3595 5925 3463 8798 8569 7274 8893 5237 10257 5951 5345 7912 2312 1145
15689 1145 -499 7753 10148 6636 9159 9662 -657 -6443 1269 8405 6686 -2623 -6783 -8668 -2184
15674 -2184 -7085 -3885 -6974 -13517 -12812 -12109 -6569 -997 -3968 -7457 -7834 3617 7554 8390 7263
15659 7263 1503 -17 1763 -662 1099 766 4285 3643 -5109 -3339 356 1468 -2522 -2757 1497
15644 1497 4747 3815 7230 3968 -1545 -1142 2848 -314 2302 316 -1988 -841 -6052 -6303 -4807
15629 -4807 -5765 -6971 -3922 -2152 -235 -899 2030 7463 10757 7810 2198 2347 -1191 -5892 -5738 -5560
15613 -5560 -12397 -10112 -5760 -3084 1040 2283 -2522 -4011 -4586 -1532 8088 12075 8075 10520 3768
15598 3768 -6509 -2138 -967 -3061 -4107 -2613 -5883 -11401 -14371 -12833 -6215 -2061 1382 3583
15584 3583 4210 1796 7089 7056 4733 436 478 7171 9029 6288 1555 267 6410 15770 14262 14271 7514
15567 7514 663 -2596 -4218 1466 5440 6442 6780 -807 -3226 -5581 -3641 39 -600 -2380 1494
15552 1494 4553 4058 3051 -231 -2951 -3432 -9632 -9432 -5781 -4855 1128 5217 6099 7988 5996 189
15536 189 -2659 -5515 -5383 -775 4245 1397 6079 5714 6398 3671 -2793 -338 -4640 -7764 -5617 -1531
15520 -1531 -3512 1468 12382 13040 5635 7737 3756 6329 12095 18202 11799 7168 6654 3909 250
15505 250 -4553 -5859 1617 1177 1860 4825 2398 6869 2067 -5511 -4429 -3594 -1948 3816 3447 -1255
15489 -1255 -3861 -2686 -246 -5864 -4675 6421 11369 13450 9759 9897 9003 12600 16512 14244 10868
15474 10868 5787 1149 9846 10101 7755 6150 9830 8434 7856 14123 11947 -384 -486 -2391 -5146
15459 -5146 -4173 3870 4129 5082 10157 12963 5808 2769 5724 7944 8524 8974 14132 12567 6167 5167
15443 5167 5436 3245 3328 820 2527 5878 6163 6433 5158 8273 6793 11749 14005 15781 14813 9692
15427 9692 5105 7123 12921 11625 8614 791 -315 -5143 -3218 1240 1444 3293 -396 -2334 -740
15412 -740 4651 7523 7140 -1000 -3221 5383 9149 5797 10149 11896 9501 7909 7098 1677 5797
15397 5797 14186 13670 8073 2307 -549 578 7973 8077 6542 7551 1732 5076 5589 4200 1259
15382 1259 -3957 1869 8594 19688 23311 22573 19244 20599 21714 18731 18741 19167 9318 2252 1433 8241
15366 8241 9684 7527 8057 5968 5814 9184 15648 14437 15778 17588 9912 8570 10697 16930 22732
15351 22732 24247 19293 16535 16423 9638 10440 8183 5667 10593 11978 13944 7646 6332 2830 4654
15336 4654 13119 16095 10295 2826 338 2601 618 -880 -316 83 1946 8174 12005 15229 17412
15321 17412 8606 -499 2238 5158 787 145 -6636 -6153 4090 10740 18343 11807 11068 5758 4569
15306 4569 9153 16347 20464 19162 15210 13944 9202 8007 8036 6639 7000 9067 5519 2189 1209 3280
15290 3280 3988 6483 840 -2273 -598 334 3894 5013 6877 7292 12467 16970 18231 19913 12438
15275 12438 5295 3456 4869 615 -5924 -1419 8011 12120 4230 3619 6608 3695 3888 4887 4449
15260 4449 12052 12359 8866 4750 1311 -799 1111 284 1615 -1293 875 988 2275 13831 20698
15245 20698 15549 15425 12656 15899 16415 12285 10792 14868 10883 12574 12363 8558 10153 7298 7406
15230 7406 8189 10026 16046 13048 16144 13146 12118 13702 18495 19263 19087 16327 13177 12364 12672 15592
15214 15592 13643 12879 14505 19738 20166 16178 10529 3592 4103 8490 12331 6982 2793 -58 1925
15199 1925 5350 1431 1426 7088 3302 -1799 -5909 -7380 -1399 2974 8431 9966 2016 2418 8609 7947
15183 7947 5609 5285 863 3130 9514 11082 5356 2571 7653 7491 3836 5805 10049 2686 -2556
15168 -2556 -9632 -7643 -261 -2263 -1013 172 -2277 768 4401 -402 -1087 3074 419 1617 1200
15153 1200 3269 -196 -4653 -1620 6999 11344 5800 4516 3245 3317 5854 6577 9312 10010 9355 14867
15137 14867 9568 2351 14764 16256 13625 16411 14174 12739 13941 8435 6290 2184 1474 5268
15123 5268 -138 -4581 -1894 3805 5697 3735 5753 12432 13819 8590 8007 14989 12905 12459 10003
15108 10003 9286 13957 13285 7890 8039 3911 2466 1174 3800 7328 10599 10576 11200 11979 14323 12950
15092 12950 12759 20215 21027 19329 14214 6843 -3847 5906 14897 10416 7583 3677 5797 6700 4969
15077 4969 9468 13437 15964 13418 12787 10058 10984 14670 18490 17159 20346 19909 16790 17010 15751 15074
15061 15074 14848 10537 5671 -711 3164 5637 5999 1092 9555 10936 7141 6653 7699 7701 4466 12339
15045 12339 18911 6657 -7148 -1896 9002 17626 20498 17037 17848 8021 2311 5660 10031 12720
15031 12720 12167 14061 15062 14820 8309 137 3700 10045 13805 22354 23068 10779 9238 13143 20488
15016 20488 19484 10598 7915 8449 9183 20967 27651 29126 15980 5287 7631 8050 3440 4053 12350
15001 12350 16778 14918 14946 9429 9082 7753 6947 5049 6130 4976 1409 -5477 -6277 6340 14437
14986 14437 10655 3801 1040 5881 4144 5207 5961 -2318 -5828 7874 14739 16369 14929 10497
14972 10497 10691 7705 2684 5506 7834 13950 13627 14583 18646 19004 18608 15969 14924 11270 6643 5146
14956 5146 10498 14710 12959 8109 6546 9737 12735 11877 18074 17093 14354 14910 15386 14483 11621 6600
14940 6600 6332 8353 11327 14852 20722 22882 18945 15790 16944 11009 6785 12026 21660 18687 18907
14925 18907 17376 18059 13238 10671 13213 13134 12359 6844 5292 13067 13867 12633 6854 6702 7540 5752
14909 5752 6155 9605 7748 1130 4439 11922 12250 10502 13583 10869 10520 5499 3447 9767 5381
14894 5381 3045 6048 8762 13165 19899 19814 16154 13507 17530 15990 9639 15310 14719 17442 12712
14879 12712 8323 5771 6323 9007 11829 13806 18927 21574 24830 28555 20888 15785 11147 5197 7879
14864 7879 6591 10362 16903 13791 3197 2678 3218 4777 6055 12385 11736 11648 12814 9978 6002 2709
14848 2709 4080 10999 11021 7153 8022 5971 3995 5739 10007 10395 12330 14149 13118 8226 2855 4930
14832 4930 12677 20052 18213 10709 10432 5352 3365 12631 14402 18393 14426 9904 8834 14954 19613
14817 19613 14289 8433 6879 4122 -1316 6255 14022 21176 22631 22849 22501 25932 22700 20764 18092
14802 18092 16889 17732 13262 13549 22540 21509 19629 16791 11193 9340 21853 32655 21143 4368
14788 4368 5957 15691 20548 18250 17132 20779 21292 20800 17571 17053 19994 22404 25298 22585 15187
14773 15187 10844 13241 12956 13937 20298 20716 17853 18160 17088 11107 14581 16963 16965 15560 14926 20250
14757 20250 23306 19439 15789 19131 19858 25087 24021 27731 22597 17447 19001 22233 19846 19977 18585
14742 18585 11627 4031 5509 12521 24702 27942 21661 16492 9949 6627 4399 955 4997 14657
14728 14657 20661 30644 30538 28971 29129 26531 28455 28321 29696 31156 22085 15831 20327 25229 25327 19497
14712 19497 15902 15442 8815 13597 16106 16053 18863 25531 25407 12385 8646 15460 20855 15033 16213
14697 16213 12241 10110 8137 13181 15374 18990 18005 19071 16446 14440 15230 19267 14212 13908 10973
14682 10973 13971 19747 15242 19261 25189 16665 10599 20824 25527 21454 20968 25852 24028 24818 25548
14667 25548 22531 19859 15568 10048 22246 24175 16410 15707 24002 28782 24925 24093 20874 13642 15623
14652 15623 20571 31351 29382 26841 28766 31366 29962 29778 31646 30254 29572 29454 30200 29178 27474
14637 27474 28633 27428 25094 23553 30217 25198 20618 22404 20508 25562 28502 31104 30280 27814 25171
14622 25171 23340 21155 18845 18740 19776 21822 22221 20098 20169 18022 15544 16535 20423 21004 17902 7450
14606 7450 13068 22263 26452 29267 35790 34429 36451 31362 21649 20307 25125 24091 23563 26187 24887
14591 24887 21576 24351 25638 23325 17203 25772 27905 24074 21837 19706 16482 22138 23590 28559
14577 28559 33943 31816 31375 37696 40340 37208 33856 32937 31427 34875 43076 38416 32436 29221 28942
14562 28942 27997 30042 34242 32338 31924 38376 37214 34483 31444 25674 24225 24227 16642 14175 18537 25124
14546 25124 24042 23977 24443 26020 29775 26653 21820 18517 16670 19356 18007 14934 18904 23644 21173
14531 21173 19743 18338 21018 22467 26723 29240 25477 27297 29683 38422 36926 27692 18115 16751
14517 16751 19179 24232 30174 34900 34168 31655 28045 32996 36818 37178 33760 23949 20472 19133 19198
14502 19198 19737 18480 17813 19270 22316 28327 26441 21524 22530 25185 22752 14583 15069 17448 19568
14487 19568 24458 26229 26944 30854 29192 27011 27378 31429 37805 40429 36739 23267 24378 31249 37067
14472 37067 36248 36678 34957 30420 22366 21658 20187 20437 11445 10069 19915 23540 25211 25363 27471 22644
14456 22644 17838 17138 16493 17314 16524 16113 20149 18597 23065 23945 26481 28710 25953 24826 28470 27957
14440 27957 28957 37890 38909 34686 31174 39889 37746 27801 21677 22248 17830 24536 32694 32442 29340
14425 29340 28956 30081 35223 33913 36039 29174 26098 24310 26367 28077 33760 36307 40036 36263 28117
14410 28117 26519 24508 25740 35190 37948 30980 29549 33318 32307 35730 37296 33356 29239 21656
14396 21656 28130 28477 35568 42183 38738 28107 27403 32374 29912 26661 27101 31785 28896 29763 32679
14381 32679 31882 26917 23309 29930 31110 29995 30513 33569 34223 42133 43623 44536 38513 29288 31397
14366 31397 32195 29266 34506 43932 46998 45625 36407 31926 24488 20195 19547 24018 25715 23967 22741
14351 22741 24677 24658 28877 27165 23156 24442 24926 26355 28350 29068 29010 33572 33593 28226 26725 31285
14335 31285 38367 39627 41074 42920 44170 45650 41617 37924 35923 39743 40482 35051 35881 35023 32758
14320 32758 35357 34689 33642 31256 28560 28282 24949 20972 19158 26576 30745 24022 23170 31427 35271
14305 35271 34266 33288 27996 31715 31337 30877 28519 24447 23915 28558 27929 27124 34389 38808 35016 31139
14289 31139 28163 24981 19459 20388 23494 26865 34511 34579 28015 30367 30317 23077 32173 38595 33912 30406
14273 30406 32709 31051 27871 29331 32793 38752 37309 32343 31758 31241 34163 32275 26072 26010 25978 31986
14257 31986 31446 31385 28265 29936 28703 27477 31611 33924 34285 37463 35204 38643 42687 44965 43635
14242 43635 44778 46038 39282 32402 32756 34831 38592 34825 30421 26672 34448 32966 33594 34978 30821
14227 30821 25873 26492 26322 29115 28902 35439 37961 35259 35902 41587 42651 35521 35339 39579 43285 44948
14211 44948 53646 56535 55257 48231 40161 35935 40577 42151 42381 39284 36806 35386 33637 37734 41595
14196 41595 44310 35842 37395 40104 35066 37952 38411 38440 37813 37537 34330 33813 32640 29753 35812 42277
14180 42277 48586 49866 47309 47392 36283 32929 36278 39606 36673 43621 48054 48436 45645 46593 46918
14165 46918 39425 37158 36482 39311 42832 45306 48703 54220 52084 45707 44426 43081 37855 35423 33214
14150 33214 39090 44947 49776 52280 45657 40004 37627 34609 37359 42690 39991 38631 37443 43849
14136 43849 48390 50644 42096 35796 32939 31742 36612 39602 44025 46400 45589 40864 34260 35572 41826
14121 41826 41996 45727 41708 36700 38848 50053 46906 38157 39030 36421 36353 37028 35046 36078 43263
14106 43263 47545 45319 46541 44445 40020 41492 44728 49673 50453 50956 47790 39966 30007 32240 39634
14091 39634 43654 46233 46419 43491 43330 42726 39859 46321 52563 54636 49183 49059 49254 45915 37117 42468
14075 42468 49238 46770 43752 42376 38961 41223 43499 44219 46332 47298 49887 50856 50565 51942 45309
14060 45309 38259 39317 49218 51084 47428 53880 57731 51997 55935 63347 60563 57731 58424 54443 50706
14045 50706 51672 49874 43336 41104 44950 51904 57154 61156 53864 50745 52968 60887 61061 58311 52837
14030 52837 58429 61410 50889 42243 35339 26159 27250 35491 39767 47655 45034 47085 47704 44426
14016 44426 41239 41669 46866 50023 50023 47848 42051 46110 53394 55307 56234 62818 62460 55513 47417 40546
14000 40546 46542 57836 54729 56981 61356 63584 58210 55736 53331 52406 51923 51982 55166 51062 43917
13985 43917 46618 47078 46727 57339 60134 60207 57862 53590 53647 53946 58297 60617 57049 55534 50421 50388
13969 50388 51669 54302 56380 58738 57479 56703 56972 58766 58212 52055 48007 49234 47216 54084 56829
13954 56829 51746 51163 54023 53018 55484 56151 56986 62998 56253 47684 40685 45648 50697 49784 52486
13939 52486 53984 51277 42872 42796 50601 55083 50519 50285 47697 45612 55769 61386 64784 64990 60134
13924 60134 62998 63914 63665 60316 61019 61884 64464 66836 62737 64502 72875 69533 65706 59729 54268
13909 54268 49336 47690 48279 53573 61627 67400 64352 66577 68126 62109 59989 62452 58854 55288 61819
13894 61819 60951 58241 60050 63567 66720 58805 62247 60182 58548 61562 65672 68603 64926 67585 72349
13879 72349 70432 66023 61435 53338 56985 64537 66582 63560 55432 49423 46797 45577 51461 60140
13865 60140 70010 71134 62496 60748 61411 64599 76072 80656 73758 65650 62927 59760 59153 58419 56756
13850 56756 65917 67982 65643 61191 56093 61543 65162 71330 67394 71223 73338 65845 60760 67381
13836 67381 71846 70730 69931 67000 68462 68479 66653 73924 76335 67574 64235 60478 64853 64669 64868 64527
13820 64527 63217 64345 67424 72441 74081 67656 61403 65162 61074 60441 58178 55206 55122 60194 69969
13805 69969 73865 70239 70593 75662 80139 77434 73999 78752 84852 86810 85866 81143 76527 77344 76806
13790 76806 76786 73717 68109 72128 73853 77342 75505 73941 71961 73737 77828 75258 77469 77011 72656
13775 72656 69943 68447 68990 73852 81738 79946 71151 66958 65307 69300 72767 74366 83079 83537 83009
13760 83009 83358 80864 79263 78287 81164 82122 87466 82220 76509 77695 80650 80376 79761 80022 80663 78068
13744 78068 83165 84494 84949 84627 87565 87406 96137 101908 94786 86435 85408 81063 80921 75129 70451
13729 70451 70511 72588 66224 67907 79209 85871 88532 89816 91018 90240 91353 97038 93446 82557 78995
13714 78995 81665 81004 82351 79010 78972 84677 82740 79839 82646 90582 91793 94540 100849 99951 102055
13699 102055 98609 88740 81957 79105 80549 82163 80257 82333 77413 79265 86544 85414 82601 78776
13685 78776 79671 81272 83093 83629 85911 87568 88664 87405 85286 91977 98353 97357 92920 95109 94963
13670 94963 85107 80269 81094 81615 85615 97355 99633 98968 97424 102641 104723 94088 95385 104596 102291
13655 102291 98145 92062 91343 92077 95548 92837 97566 104840 111135 121246 115189 109140 109025 111013 109120
13640 109120 107947 105816 112757 111752 103624 102889 105887 101213 98773 100191 101305 103842 109501 108845 108512
13625 108512 111718 105675 109380 114095 116048 110998 102179 96399 97755 101391 101715 104710 105431 103879 101068
13610 101068 98827 96200 93564 93931 101647 109074 109706 108280 117922 124210 126362 119583 118609 120421 119801
13595 119801 124714 133559 129559 119405 114759 115984 120197 127899 130080 132445 134978 129615 128162 128452
13581 128452 128986 129874 136899 141455 139618 137700 137023 136590 141417 151124 153185 156043 172111 178149 181977
13566 181977 190586 211190 235135 268328 321199 389600 468181 583237 745289 967591 1264061
13555 1264061 1586213 1994169 2500700 2799139 3035507 3330964 3214806 2926384 2704675
13546 2704675 2261164 1770591 1401476 1081945 813012 623533 500333 427086 380593 329692
13536 329692 290799 262505 239789 225647 214192 206895 196464 189739 185114 175249 167321 168347 171694
13523 171694 171113 177321 188710 193127 199302 202340 204877 207057 207906 198546 192570 188190 188507 179011 171515
13508 171515 162758 156051 145269 136648 131038 132545 130750 126846 118208 114524 116172 123403 127745 124791
13494 124791 119822 121872 128335 127936 131983 130207 125366 133993 148645 152339 155762 153565 142738 134677
13480 134677 134544 134733 137600 141798 142002 157603 170006 175168 170009 164466 159178 157047 150690 155783
13466 155783 159419 153970 148634 147262 148891 147415 141207 138823 138269 146203 148504 145837 146219 139088 141260
13451 141260 142134 137274 139008 144035 140485 142806 142961 148096 148219 151092 156295 154731 152773 156214 154445
13436 154445 159317 163253 166995 167955 168847 168810 165782 167039 166850 166183 166988 170189 170860 176525 187475 202611
13420 202611 223667 248905 279994 310921 326329 341823 362938 364767 352068 341505 327694 306080
13408 306080 284651 265502 246632 228384 224059 222701 216484 215039 213503 215413 213203 211634 205883
13395 205883 206191 218516 227316 225532 222795 226939 237379 250062 255802 266561 288461 304655 324528
13382 324528 335245 344126 354413 351815 345159 341705 337075 328877 323833 320207 329992 345372 360719
13369 360719 386344 401090 391348 382205 383576 370600 346650 332152 323995 321139 320769 322971 336562
13356 336562 341624 351235 367444 366799 355441 343275 311491 286954 277121 261150 251110 245538 239362
13343 239362 242778 243685 244005 251248 252765 250653 249527 251794 261132 262552 258503 254443 253443 253957 255847
13328 255847 251790 246667 246528 247637 243618 239563 234522 232783 222892 224940 220973 216558 212220 210028
13314 210028 206422 207465 205914 212355 216706 218103 219977 222219 226155 237526 247744 257181 258619 262001
13300 262001 259687 253967 258185 262527 262169 259047 261338 261258 268937 276057 269449 260715 257750 259497 253844
13285 253844 245662 236127 235621 239797 241270 252999 262814 262429 263398 269499 280277 292903 300005 305165
13271 305165 320034 335140 343318 348222 360260 363697 366754 378398 376425 363321 360900 352427 332755
13258 332755 315625 294807 273477 267540 268700 267901 272584 273214 258046 244716 234423 208508 185654
13245 185654 147464 111361 83259 60458 45545 72607 123928 168754 244132 336613 434513
13234 434513 554907 664887 750457 828050 878040 892711 902450 892312 844967 776407 713053
13223 713053 662620 616277 579761 555834 545687 546060 551268 557506 556959 557068 553912 560042 565664 573110
13209 573110 568974 569641 576301 579689 583196 594947 611981 628125 643055 658571 677129 699501 716963
13196 716963 732778 746003 754096 756675 769638 776982 778198 785734 796722 804638 812263 819619 830667
13183 830667 836406 845315 861409 887479 907297 922113 943620 966191 987141 1008923 1031170 1049293
13171 1049293 1064149 1079664 1088164 1102707 1120897 1133984 1159445 1200184 1253137 1309688 1368363
13160 1368363 1426398 1486474 1552806 1615565 1681109 1744887 1798044 1854477 1902526 1947002 2012905
13149 2012905 2081764 2162497 2252057 2351908 2460512 2573767 2698407 2823916 2974939 3151766
13139 3151766 3329443 3527176 3739707 3957243 4187338 4409488 4647705 4919755 5193403
13130 5193403 5491174 5853247 6277134 6756046 7326169 8011679 8827597 9788794 10952764
13121 10952764 12357693 14073978 16206256 18897349 22412928 27104692 33480511 42387068
13113 42387068 54322585 70018174 91298143 119783088 158769003 211761683 269636523
13106 269636523 335200971 421397382 479312302 509899262 562085706 564039538 512814360
13099 512814360 481839024 426053843 338383334 268789545 209587090 155415187 115589822
13092 115589822 88832139 70448937 57439237 47937078 40538470 34743112 30198313
13085 30198313 26537654 23570981 21158155 19185354 17580749 16272428 15193269 14363912
13077 14363912 13780760 13433935 13378698 13622047 14099335 14906371 15862997 16416221 16892714
13068 16892714 17174107 16425999 15256152 14045414 12305481 10480442 8969209 7635873
13060 7635873 6494332 5626688 4968814 4442225 4018105 3663980 3352143 3090276 2867641
13051 2867641 2658306 2480375 2317179 2170210 2054078 1963776 1880230 1802676 1740287 1685685
13041 1685685 1634015 1589199 1546612 1495907 1439455 1382790 1329462 1280871 1223793 1178016 1136267
13030 1136267 1094880 1067182 1042772 1017318 994943 976693 951107 926366 910195 890584 861224
13019 861224 841798 825431 805930 788300 764308 743887 729686 708260 694023 690779 680100 675112
13007 675112 679964 678404 680978 687559 699111 711351 720364 727760 729887 735502 737362 740356 747372 758207
12993 758207 767803 789035 816878 852828 910623 987432 1085853 1209609 1359889 1562409 1835482
12982 1835482 2194681 2677805 3316091 4187110 5397464 7077406 9468455 12527033 15809918
12973 15809918 19941993 25139529 28893821 31170046 34380585 35515538 32935790 30564508
12965 30564508 28023383 23160695 18361221 14812854 11522020 8668649 6622043 5223468
12957 5223468 4256444 3561649 3038368 2641386 2321363 2071000 1874817 1717482 1576863
12948 1576863 1464712 1355845 1239344 1138539 1049768 957877 879912 819130 762023 722412
12938 722412 687250 655635 633141 616201 597248 574088 557089 548251 544150 528830 511343 497803
12926 497803 485428 472120 457563 448626 435527 418843 418647 414729 394323 367557 351782 330401
12914 330401 310126 308566 299137 286246 276930 271162 273353 267554 266999 268653 268305 266803 268169 267364
12900 267364 269771 265535 259735 261791 266454 268166 264614 256668 256619 253929 247282 244451 247995 250994 245994
12885 245994 242410 240529 228938 216182 205768 198389 195759 189682 184855 188856 188382 180677 177652 178060
12871 178060 179916 181231 180897 174540 173754 177956 179296 180785 182281 178390 170959 173060 177181 183484 190273
12856 190273 189694 190158 197524 201437 198018 199499 194851 191135 195902 197967 193631 194809 193454 186773 184014
12841 184014 186245 186678 191269 184547 182611 185017 187179 194157 195649 191580 192359 203078 216927 221492
12827 221492 209594 199161 194490 186776 175896 168296 162373 156846 152212 151833 148822 146311 143477 142519
12813 142519 141639 136388 138050 140108 136829 137008 133527 134670 132051 123797 120972 134654 142255 138200
12799 138200 141273 148029 142524 133144 129173 125865 119518 118075 127248 138310 140807 145798 151511 164987
12785 164987 176361 177067 169365 160283 157747 160979 159914 160364 156475 155982 148997 144638 150153 151058 154350
12770 154350 150649 150545 155467 158978 150371 160183 166691 163479 167178 171781 170897 170253 164633 159035 157629
12755 157629 153608 151973 149023 145301 137950 136470 134792 144318 150716 146859 149263 143960 144054 147525 148228
12740 148228 147293 142277 135964 135357 135491 138767 132982 131675 137368 139917 144579 147775 146243 146962 143480
12725 143480 141731 142554 148660 149517 145138 141387 149663 154113 157318 161644 157293 158717 161974 161300 159795
12710 159795 159466 159111 167789 175740 180994 177286 175101 180494 181707 186778 176995 165664 158521 160848
12696 160848 158876 156061 155404 157688 158848 149376 146033 145494 153199 163956 166453 164464 163775 163923 165864
12681 165864 171583 184964 192853 194205 199091 198980 195246 195456 191448 188176 191760 197251 203080 205783
12667 205783 216424 217050 211644 217296 231212 244342 264066 293732 335760 388726 459198 544887
12655 544887 663887 824447 1054208 1357748 1686056 2104625 2595881 2873504 3135300 3416676
12645 3416676 3259236 2974543 2748193 2283209 1802652 1440859 1118511 864703 692926
12636 692926 580591 503221 441692 399392 364209 331158 308863 290947 275305 264724 252133
12625 252133 244547 241493 245423 251762 252279 255288 262363 272165 275715 280110 290389 294121 280459 268008
12611 268008 252971 241617 224990 210872 210126 208651 199346 190701 193663 195114 193368 187303 183792
12598 183792 183991 192622 191302 188821 192248 191218 181360 185463 188441 182909 183413 180488 180121 177129 179498
12583 179498 173980 173752 173142 180162 181676 182985 180682 180108 175872 176763 176005 179072 182804 180898 174618
12568 174618 174558 173919 176215 180606 168215 172948 182137 186963 193023 191835 187696 190621 191940 187535 192978
12553 192978 193005 193677 189917 189772 187543 182268 187163 194770 192248 193926 196727 194315 193486 195735 199033
12538 199033 198660 200732 201979 201457 194125 190064 186654 183962 187618 192798 201635 209233 210507 218087 228172
12523 228172 243173 270634 289222 310219 330509 339189 349276 369323 376686 360064 348388 330702
12511 330702 302137 271554 255192 248520 237099 223247 211146 211256 207609 204287 208659 208491 207034
12498 207034 198050 190145 196245 203068 200365 199110 197682 191203 191108 190048 195131 205064 216859 211309
12484 211309 206913 200802 203127 210072 214825 221523 227590 223112 222819 229295 233124 230199 223518 220557
12470 220557 219807 224868 221607 216023 219252 217022 216684 218824 219030 221089 217631 217219 221743 216527 212194
12455 212194 211402 219953 223867 227315 232091 232546 230497 229714 226378 224133 217604 213983 215260 214973 219838
12440 219838 218648 219740 224299 231199 235801 229004 221055 221647 221274 223383 229156 233554 232618 234333 228749
12425 228749 228973 239320 240805 237644 236281 240879 246310 244091 238348 232108 232165 244406 249279 243018
12411 243018 244769 244118 243910 245393 241069 241041 243342 242480 238142 242984 250331 250817 249711 251430 250646 248972
12395 248972 246889 251966 255260 254051 251231 248945 244492 243565 246061 244551 247658 247863 248658 250446 247668
12380 247668 243139 244797 246540 250390 251536 257306 259233 270051 274453 275608 271810 260348 256270 253238
12366 253238 253383 247425 249137 247306 250390 261069 257181 254442 258940 262797 264285 263648 265693 261396
12352 261396 268015 271070 273157 269316 260697 259467 262544 264000 269102 275625 277005 272801 272234 266605
12338 266605 265249 265456 270547 280034 281391 278087 266639 266529 268437 269558 270258 279348 283809 276194 281351
12323 281351 288226 287142 277933 277714 280216 288307 291445 291123 283591 282087 278213 276735 283463 283238 279094
12308 279094 277641 278516 281307 282244 286070 283395 285785 284219 280594 280156 285324 287140 288069 291223 298462
12293 298462 300970 294274 284813 278627 274892 280417 278033 283294 294348 295898 297166 297463 295094 289145
12279 289145 294343 299996 303250 306945 306512 305301 302416 302783 308341 309797 307848 304764 301116 299482 299353
12264 299353 302758 300234 298867 300970 306045 308364 306900 308891 310648 303019 302128 307768 313191 308999
12250 308999 305254 304996 303484 302701 301899 302326 313460 318813 319862 319968 322403 321653 319908 318093 315913
12235 315913 311182 311339 319860 321351 320866 320593 325850 327220 328953 329561 322381 323452 332606 340802 347056
12220 347056 344605 339804 336834 334278 334372 334744 333549 331670 330064 323812 318899 326099 328527 326600 328611
12205 328611 333597 325062 321906 325553 322556 329657 331639 327192 324257 333314 338709 336674 340438 342241
12191 342241 342663 342357 339415 345166 347836 348378 349864 349962 346153 340515 341235 345356 343427 339296 339451 344393
12175 344393 350886 351440 346918 350282 354136 352549 353504 360260 350709 350439 354188 354560 355834 356516 345898
12160 345898 346580 354460 355777 346735 347222 352411 353052 340858 341225 347850 350268 355273 361730 366074 364516
12145 364516 358664 360861 363211 365970 371614 376201 378555 379427 379317 375183 376887 372237 365398 361952 361774
12130 361774 365994 366351 372170 374772 375107 373809 372610 377411 377341 374527 368989 369600 372600 371221 373072
12115 373072 373773 377247 374437 367516 368916 368419 366928 367181 372706 375188 380137 384998 381670 377920 370507
12100 370507 376994 383483 385478 382038 380585 381667 385540 386979 390698 389815 383185 380230 380747 383432 387289
12085 387289 381327 381420 385806 385998 385264 384904 388299 390808 382626 382350 389224 385069 382786 386124 379121 377312
12069 377312 381857 387069 395663 396338 397865 400674 396302 393214 393437 389303 390850 391568 394971 388190 388238
12054 388238 391472 391673 394265 391884 388786 389460 385558 384190 383938 385486 384983 387829 394467 390756 387583
12039 387583 389431 392661 396647 398134 397609 397945 395457 396450 395380 390406 391347 397136 399971 399749 397781
12024 397781 400287 402762 397088 394272 388412 390795 393293 389733 389533 389248 396512 399886 405203 404725 400341
12009 400341 400332 393626 387608 390847 395568 398358 401993 398205 401518 405857 399062 390797 388698 387060 392993
11994 392993 401236 409713 411422 409832 411619 413394 410084 403554 396026 390920 398666 401307 401098 399462
11980 399462 392956 399491 402088 408028 412220 410695 406914 407677 414155 416093 409592 400595 403211 407512
11966 407512 407421 403552 401744 400501 398579 394976 396842 400647 401280 403370 406698 403437 404935 406201 409521
11951 409521 411469 413442 412352 409874 405038 403316 402068 397767 400875 411529 415197 413656 416006 414431
11937 414431 411958 409448 399986 398355 399299 406970 411537 409367 396090 390411 393466 400163 408053 413973
11923 413973 416202 414379 407851 400904 393507 397402 397232 403789 408169 409236 406940 398862 396398 399588
11909 399588 398500 395908 397308 401733 403846 402764 400033 398525 406907 415785 417158 415199 413186 409424
11895 409424 406775 401595 395350 404765 410394 411496 410821 409370 408696 410175 401304 402150 405144 402904 400370
11880 400370 403891 400434 397109 393381 392273 394453 396163 400298 403749 406780 405554 399200 398954 396784
11866 396784 400859 410894 404391 398455 401230 404443 403982 401021 400743 402573 402786 403267 398649 397841 399054
11851 399054 401036 400804 398785 401145 406720 409809 413461 416091 422942 432526 441451 447042 457940 493795
11837 493795 551089 596290 559710 506630 471179 440583 417911 407799 403113 396234 394500 399280
11825 399280 394087 390571 393431 397941 396394 394906 396304 393774 393637 390664 390535 389440 388669 384127 382952
11810 382952 381581 375970 376492 372762 373905 380076 384621 378028 378895 380455 384897 386157 382441 375781 375909
11795 375909 384249 387936 381735 381877 384286 378165 375422 375600 378772 381208 383962 379727 368315 364008
11781 364008 370016 375225 372852 376455 378066 376908 379080 379050 376463 370326 362740 365743 366405 364135 364384
11766 364384 359193 354935 357363 360499 373690 379528 372164 370978 366932 367148 365487 364404 370574 377267
11752 377267 372089 366008 358623 358638 350414 351351 356720 359200 361704 367191 366592 366817 365381 364453 366833 362865
11736 362865 361377 362923 359591 353411 347793 350092 354421 345964 339387 341434 345280 343281 344355 342164
11722 342164 342054 345348 351202 350345 346152 343598 352642 359069 354721 349526 341735 335555 338882 337041 336465
11707 336465 345633 350210 353100 354627 345363 340434 331596 322054 325679 329056 326974 321605 325618 330358
11693 330358 329406 332138 334770 330975 328924 323377 320359 326676 326460 321534 320859 314416 317778 320552 327372
11678 327372 326373 327799 325382 319889 322549 325987 324754 320683 320796 331031 334734 330574 328306 326707
11664 326707 322671 326260 322104 326018 329200 325124 321149 322757 325841 326381 322582 315542 317334 314618
11650 314618 314709 312086 308494 316948 319112 311202 303695 302379 307860 310150 306443 308204 311195 313385 303543
11635 303543 301010 302831 302431 303941 300663 292464 292265 293267 294286 292171 292146 289166 288200 292973 298578
11620 298578 299885 295285 294869 293883 298646 296737 288596 293367 292782 284769 280591 285193 290294 289108 284111
11605 284111 285812 286813 279014 286342 296920 298216 296564 292630 295383 292105 291225 289030 287251 284438
11591 284438 281279 276077 273012 277220 276968 281391 283618 282136 283943 284882 281196 280583 282315 288644 290646
11576 290646 280919 271331 275378 280316 283107 281167 283740 286415 283860 281226 281742 281594 280353 275262 270698
11561 270698 265952 267420 266970 270843 268649 269545 266716 262621 264291 267103 263471 257011 260394 262849 259837
11546 259837 261554 261698 261116 255218 259210 269435 268571 264682 260497 257843 258296 266458 271055 265328 262111
11531 262111 258633 256625 258347 256887 249320 248096 258780 260499 258239 258085 254530 252623 252379 256250
11517 256250 259959 258603 257796 261732 256276 251615 250550 251115 252584 249842 246457 241860 239894 238720 237728
11502 237728 239749 237847 238402 242586 241075 235426 230041 230467 233163 228889 234858 241727 243888 242611 239642
11487 239642 234388 230659 236243 240641 241849 236756 238212 235510 229911 223302 219228 222304 227735 231492
11473 231492 233295 237250 236994 238158 243146 239677 232050 224261 226764 227999 224815 216557 214637 215247 215983
11458 215983 219833 225504 229497 222814 216349 215021 224727 221034 223440 234601 238214 232032 227666 220148
11444 220148 208975 211554 213543 211816 212175 214990 226511 223832 217856 215679 218840 221242 216625 208089
11430 208089 198353 193924 196389 207591 210526 207278 213691 209698 202419 201662 204838 199905 192930 200314
11416 200314 203683 207041 200513 193061 193903 198425 204042 204280 200446 203157 204963 204897 203085 200827 205878
11401 205878 212377 207383 198780 191032 190446 187297 182174 184921 192142 193354 198019 202842 203301 201954 203605
11386 203605 205157 206866 203331 199914 205629 208232 196895 192408 191395 184431 183095 187876 184278 178082
11372 178082 172155 179394 193260 192999 187367 187417 196063 193072 185921 182778 183394 185736 181492 182914 189023
11357 189023 190776 184811 181681 179822 182627 188033 186729 191323 192605 196190 196560 191391 192501 190151
11343 190151 187694 185002 186908 189609 188289 186868 184045 182252 181680 185220 185989 178393 170927 172362 176009
11328 176009 170101 165327 168528 172966 177280 175749 175707 175062 175967 172689 178343 183067 178992 178997 174249 160264
11312 160264 152458 158515 164036 170247 166839 162534 157431 158844 158889 162407 166379 160723 159508 154549 151111
11297 151111 154682 153294 152823 157701 159042 165254 166399 162265 159373 158375 162622 164781 163934 166291 164266
11282 164266 164512 163106 160057 156401 159203 156109 154569 152509 151412 155023 156157 154288 149186 148558 155366
11267 155366 155051 158820 159723 153017 154377 154068 153306 160807 162744 157897 157440 162730 156594 150670 148314
11252 148314 147801 146428 151354 155230 155683 154833 149959 148745 150785 152110 152498 147545 144539 143321 141894
11237 141894 140668 144008 144084 143474 141443 136494 137777 138739 133925 130625 133252 136994 139682 137446 136948
11222 136948 138403 136540 137361 135761 134387 137066 140724 141065 138225 136289 138785 138731 138240 138199 136994 134397
11206 134397 131613 126951 127331 132668 135081 137940 141635 141299 135024 133410 128786 129156 134111 140533 138653
11191 138653 132204 131347 134089 135858 132723 129306 131562 132842 127485 130265 127381 127507 134087 139047 137864
11176 137864 140720 143854 140267 130489 122141 124835 129546 129687 130048 130096 130671 125556 122470 115736 114029
11161 114029 114941 121280 126639 131294 119969 109356 105373 113505 121400 124897 126767 129732 127299 128299
11147 128299 127189 118730 115587 117577 118700 118879 116700 115497 116825 114855 116414 114278 118961 128838
11133 128838 129419 123797 115419 122334 119292 117170 114816 117947 119665 124558 126016 125647 121960 118478 122730
11118 122730 129349 131666 137778 140370 134059 124476 117390 114215 112201 108200 109177 111847 112840 113545 113379
11103 113379 113874 110212 101853 108020 120526 119045 114016 115204 113821 110594 107347 105000 104977 104710 109181
11088 109181 109985 114660 121632 124212 126647 120386 117236 119520 127764 129146 120289 120733 123309 123088 118512
11073 118512 114423 110872 110565 104612 100887 101222 92009 90065 88458 94275 104477 103446 110229 113735
11059 113735 108493 108075 105427 100205 98991 105490 103823 105453 107307 109567 113738 106363 99473 102232
11045 102232 101475 96570 102900 109713 109685 99303 99361 98473 101736 98135 95277 96263 95739 90782 91685 97819
11029 97819 95428 95319 96789 98438 96365 92489 95256 98703 98120 102475 99338 92237 92050 87008 84908
11014 84908 89115 95908 93227 85582 84599 91489 93148 89125 87022 83870 83255 82626 83952 82480 86966
10999 86966 92169 94223 94303 96046 96251 101773 99412 97246 99018 98349 91860 91107 93715 94141 95945 99263
10983 99263 97323 91115 92287 94708 99868 100518 96728 92212 92375 94492 96122 94259 92643 94172 87778
10968 87778 89892 95911 98843 103450 99323 94386 88718 81570 75353 76673 77217 85313 86423 90044 95030
10953 95030 94896 88682 87190 83492 80025 84602 83067 82363 79012 79372 81080 92376 101509 96661 92695
10938 92695 94079 97245 96349 88950 86954 85412 84448 84600 86017 83427 87487 85945 80958 80487 86359
10923 86359 85978 82915 78748 76372 77081 70691 71370 79687 83766 83578 79176 72809 76510 83849 88673
10908 88673 89822 85279 89354 88440 91261 91977 89533 81888 81771 83377 82527 87136 90630 88150 86047
10893 86047 87003 87711 79622 74382 77377 76193 68682 71368 69735 70537 73844 71232 71984 67813 66249
10878 66249 71136 79355 80382 85064 89682 81890 71380 72846 76324 80521 80064 71849 76838 77662 75669
10863 75669 74188 76687 77496 77718 71753 73115 79223 78509 80963 85549 85017 68787 61626 67349 70352
10848 70352 66041 67293 70067 73821 78272 79991 72417 64497 71445 71774 71091 69130 68176 67116 68572
10833 68572 63261 59848 64423 75174 77291 83066 82238 79681 75194 71938 65309 63601 57656 59764
10819 59764 71179 76282 77020 74212 67298 71423 75762 80821 81716 77431 76984 75008 66937 65847 63481
10804 63481 66557 72032 73177 73640 73812 65983 67278 64990 68200 72013 71508 67599 69912 69494 68280
10789 68280 68778 73455 79418 76124 64518 62848 65435 67536 70337 70249 60859 58757 63642 61080 64527
10774 64527 73674 70736 60715 56264 54241 56586 60173 65719 67390 67527 66233 55711 49184 50267
10760 50267 59060 56338 57985 57635 61138 64759 70349 66046 72502 76854 77064 73175 70874 64543 56342
10745 56342 61373 57702 56633 58564 64342 63074 66513 67764 68823 65253 64249 67084 68994 68758 71862
10730 71862 65822 60930 66410 68309 65835 68211 71772 66808 63297 67930 59181 52003 49156 50991
10716 50991 55736 58116 55930 50343 56337 68369 71219 67953 73075 74185 68950 65158 62124 55006
10702 55006 58422 64481 63210 58423 57001 64635 70087 70323 69109 74351 76020 75684 74671 74775 74824 77380
10686 77380 74901 68524 69139 60541 54904 58388 67201 64497 62056 65836 61871 61921 61714 61363 59211 60093
10670 60093 57992 56022 63012 64618 63451 59341 60643 59738 57408 54127 58145 61738 64107 65999 64766
10655 64766 58626 55158 63408 70330 72403 64290 60597 57780 54431 58198 65818 69003 63095 60629
10641 60629 64941 64446 54799 50912 58523 61848 59382 57208 58546 65195 71957 72561 71300 66240 61143
10626 61143 57652 59482 69752 69820 61954 58242 54682 50857 55032 54640 56884 60212 59279 60028 57561
10611 57561 55292 61295 62996 67658 70878 70627 62971 59542 60715 53109 51949 59221 57585 57165 59192
10596 59192 62372 57623 48502 44974 40828 51531 52644 52099 57703 60312 56042 55071 59136 62420 61553
10581 61553 57888 63528 63970 63828 64888 58056 49546 54554 57833 59338 64212 58663 58366 59886 60182
10566 60182 53456 53614 53083 50628 57823 57056 54621 56591 64052 59472 59330 64596 62100 52917 49823
10551 49823 50266 50047 48294 49229 46001 44375 48784 45731 45935 50500 55380 62537 65151 59471 55717
10536 55717 57736 55253 48202 50142 50275 50435 54362 58757 56343 56109 60124 62785 62220 61748 60968 57280
10520 57280 48792 47088 47961 45820 47821 46519 45358 49609 54363 52732 50976 51322 51845 45409 42625
10505 42625 39847 38198 48219 49218 45670 38241 35208 45079 57446 59488 61887 56024 52588 49632
10491 49632 46675 48270 45359 38434 37696 41905 42122 45960 52019 48017 47594 48125 51093 63084 63273
10476 63273 58872 54876 51010 53239 50002 53979 55171 53739 50697 54702 56319 59275 52939 51427
10462 51427 47882 41940 40544 37002 32321 32278 42796 48500 40471 38465 48104 51430 52707 54468 49910
10447 49910 48480 54394 51465 47690 57129 51957 48620 42415 43512 43367 38741 39000 39892 37165 43517
10432 43517 54040 61172 58142 50786 45941 44001 39454 36182 35678 37520 44815 50048 49625 51663 54262
10417 54262 53853 54140 51277 40789 43148 57049 57007 55510 53306 52294 51090 50775 55793 56052 46526
10402 46526 39786 37698 34123 33161 31474 36035 38986 35870 39080 40643 45403 50642 52846 45693 42821
10387 42821 46526 45117 39463 39940 43435 39298 35376 40200 46367 43425 45964 52954 57025 50419 48419
10372 48419 52106 59160 60463 57462 55564 52921 51645 51490 56546 55795 51085 50350 56608 60252 60517
10357 60517 57438 51700 51876 52409 48227 45513 45106 46013 45887 54599 58264 57290 53968 45943 44750 46790
10341 46790 47377 42358 38189 37524 43551 37458 36226 34491 44276 48449 46143 49303 51522 49048 45768
10326 45768 46810 45905 43099 42336 43191 45628 51028 56232 62830 67996 70796 69334 63079 53905 49514
10311 49514 50175 44449 43130 49686 48048 45416 45287 46022 49661 54349 61528 59793 60932 63231 65049
10296 65049 58982 47805 48119 51200 52257 48392 50100 57563 65529 63968 64949 65673 73465 70384 57681
10281 57681 53936 56259 60731 70122 76989 77651 79808 90701 109696 132959 161681 181321 161061
10268 161061 127162 97352 88557 92620 99818 107612 114141 129329 137597 148505 186117 246485 272737
10255 272737 238723 182863 139239 117163 101752 107261 109597 120876 131531 145338 171906 225812
10243 225812 311030 353465 302021 222532 168250 134600 119722 117893 115608 117969 117061 127866
10231 127866 140423 174034 232867 252669 216315 163019 124945 103432 99410 94707 95403 98059
10219 98059 96690 99198 103650 128844 155321 166432 143085 112832 93981 83953 76172 71547 68750
10206 68750 69789 67953 72332 76670 79302 86422 89131 87528 81308 74875 73012 60585 57991 60061
10192 60061 64608 65268 64314 59843 59505 62114 65438 68168 68522 68224 66875 60627 63019 59933 55915 56422
10176 56422 63925 68693 68918 71390 78094 82625 80424 67725 60240 59880 54792 49823 39860 36288 45454
10161 45454 49777 52760 53599 49734 48394 47280 50700 50676 53326 50814 51687 56084 56350 54738 47769 49667
10145 49667 57277 59442 67211 77033 79816 77326 70670 69155 77417 86174 95981 96737 97786 102369 101233
10130 101233 109769 113983 122642 130351 140639 146281 146101 133556 126877 123390 116662 111841 107156 110279
10116 110279 113745 120775 126982 127975 135044 136919 135932 154466 172166 178438 176879 174344 183045 191078
10102 191078 183145 174975 182255 196064 177039 148986 131704 117493 107929 102440 94834 84899 78507
10089 78507 80243 79376 79466 76774 80298 77763 76916 74338 70329 68313 71696 70570 68758 71067 71433 69715
10073 69715 70386 73291 72687 72186 66764 67285 63229 65519 66027 57377 55236 57689 65793 71959 75762 76126
10057 76126 72285 72343 66669 65480 65817 66676 64094 76095 90655 94491 98969 111739 126353 143469
10043 143469 150589 150585 155449 157818 150732 149346 146051 147714 145252 148766 147509 137488 134659 134888 130772
10028 130772 130647 128225 134895 139197 132113 127675 124734 122352 119348 110223 95440 89251 81082 71013
10014 71013 62007 59510 57030 55913 52581 59999 69685 74701 77355 75757 77995 74309 77165 70311
10000 70311 57684 48406 47388 49690 57592 72343 83168 83681 84859 89097 90870 96124 95737 93199
9986 93199 93361 81640 68378 71868 83408 93450 104949 105955 110757 119678 128748 141434 147438
9973 147438 144707 132332 120147 113673 111989 114477 117805 126672 130846 125593 113964 117425 130930
9960 130930 132855 131079 134056 122755 106678 101710 103203 111558 119787 116112 114864 122434 126724 130638
9946 130638 133274 133243 139406 142471 139862 141958 137377 142328 139161 132805 143038 155189 164744 168393
9932 168393 173901 179444 178431 180087 190686 201951 197325 192547 200358 213375 225961 239562 248452
9919 248452 261606 268003 279717 300595 317502 334704 360769 396130 444959 528393 637847 772061
9907 772061 949776 1212934 1599713 2235497 2680818 2813186 2730700 2795631 3344819 3554879
9897 3554879 2977517 2346210 2035456 2010178 2164744 2461407 2966897 3555647 3901013 4398012
9887 4398012 5436320 5862193 5052661 4112845 3717233 3884890 4523759 5528985 6784313
9878 6784313 8270870 10419977 14195484 19454141 22857954 21345829 16890862 12419329
9870 12419329 9491671 8162397 8080682 8980840 10569514 12554121 14937974 18721483 25952473
9861 25952473 36346433 41906546 36921418 27278118 19300695 14453279 12186221 11763568
9853 11763568 12679425 14383582 16595911 19538777 24779513 35013624 49128369 55425131
9845 55425131 46395165 32278217 21919687 15909647 12771842 11411884 11240660 11847351
9837 11847351 13001951 14875933 18242744 24674376 33923208 37850209 31300707 21599600
9829 21599600 14615163 10586954 8440609 7368826 6969426 7038348 7461098 8298320 9811828
9820 9811828 12883763 17320887 18966203 15508437 10641686 7119934 5017143 3778534
9812 3778534 2967759 2383263 1957393 1646121 1415251 1235883 1095178 984421 887584 807799
9802 807799 737649 682577 653764 642566 606350 557234 499622 441246 397918 366886 347339 324477
9790 324477 290651 266849 239015 220085 220964 210577 205833 198675 186223 165302 150828 139485
9778 139485 129745 126734 126135 119054 106307 96719 98900 106118 99724 92549 83023 80600 80457 80457 68968
9763 68968 63348 60552 59220 63488 67699 70815 69703 70876 72916 70089 64885 57130 53549 47127 51628
9748 51628 49681 40589 41761 47266 47256 44037 49833 50922 51065 52725 53267 59719 66416 54081 40770
9733 40770 30188 30399 29000 34046 41841 50701 50119 51803 53853 59170 66468 67820 61253 50941 41944
9718 41944 35690 30366 37759 52500 61378 66119 66491 66406 73145 75865 73042 71008 61600 55914 55766
9703 55766 57013 81449 125698 114714 86736 70068 68343 72384 72656 61440 55486 51912 42021
9690 42021 33144 33074 30663 25129 26914 26902 28975 31438 30513 32739 43298 43358 39395 34223 32340 32783
9674 32783 25733 24276 21795 19281 10662 7304 6195 7244 15307 17078 16252 6967 10898 15731 16616
9659 16616 16295 11570 10053 12964 16291 15906 22183 20570 20714 21014 24046 13452 7701 10441 11837
9644 11837 10678 14023 14736 14284 12081 10870 4174 5341 11560 14923 13385 11751 9072 13226 14112
9629 14112 14342 8033 1684 3557 9589 17626 13791 9350 14863 13014 9595 8681 10765 12271 21943
9614 21943 18280 10868 7626 3372 11434 12110 8322 6070 7803 9855 8681 10845 7953 6875 5622
9599 5622 174 -1476 -3357 901 1382 3343 2556 2287 10690 12809 12394 12498 14716 13053 13675 11288
9583 11288 5918 5114 4846 7000 10391 13456 12309 6000 6762 9342 12124 9038 4363 8301 14098
9568 14098 8479 -575 -3544 3785 13334 12791 17224 13441 11098 7895 7986 13759 14872 8691 9426 4784
9552 4784 -1394 -5005 -7038 -1396 194 -1954 -1052 -3060 -4230 -2272 2592 3699 -2174 -5653 -8581
9537 -8581 -7579 -2794 1255 4080 10748 16568 11281 7086 5189 -418 -1617 -5258 -9217 -9958 -1304
9522 -1304 -1155 -7260 -8794 -7084 -5065 -7498 -6307 -4518 -7864 -7630 -5939 -5525 -6249 -2536 7193 19572
9506 19572 19658 23598 20233 9812 8663 10901 10571 11492 17898 15093 19082 25963 20360 14885 12641
9491 12641 8489 7619 14169 21567 22272 30830 39374 43599 40268 33717 24886 32375 35190 38830 47600
9476 47600 54690 64770 84537 107280 113299 101743 92094 79528 67290 51316 43633 52612 66041
9463 66041 73843 91164 116626 163126 218369 226129 184053 136063 104085 81191 71472 73233 76246
9450 76246 91291 102170 126472 156589 218435 291011 295581 229546 160043 113875 80601 63289
9438 63289 56695 59372 67822 75774 87482 107614 153573 203609 204660 160332 111859 84541 68654
9425 68654 58927 50336 50213 48913 48101 55738 61715 84782 115500 113190 85208 59508 40057 25859
9411 25859 22852 23789 17685 10263 7091 9126 12185 12734 16668 16828 13159 5529 7702 6495 3996
9396 3996 434 -5697 -10125 -6926 5842 10948 7962 534 5386 15071 21112 20172 11054 5448 10391
9381 10391 9303 5523 5355 7124 8651 3150 943 -6874 -2502 2878 3017 -2530 -6687 -12058 -9925
9366 -9925 -2030 8197 11019 12724 8155 8648 11114 7170 5763 5322 7034 5614 1591 1787 9809
9351 9809 8309 4706 -1567 257 3164 3441 5276 5479 5642 1242 2927 9016 12205 4895 91 3533
9335 3533 6613 5111 4924 2579 530 -473 -527 -84 4015 1580 6472 15020 15989 18051 17967 18750 12758
9318 12758 6888 9078 14231 14115 9821 3486 -25 -2594 214 2274 4868 -193 3150 239 3364
9303 3364 4059 11474 10423 3857 4681 2902 1959 -547 -118 3445 429 902 4528 10411 12170 14291
9287 14291 6183 568 2097 2212 6929 3683 3341 9308 19110 18282 18060 22060 27318 31577 39929 49369
9271 49369 56935 58263 57566 63532 64344 65830 76792 108882 153363 170827 140064 97611 58012
9258 58012 40551 31892 26748 28286 24374 17713 14484 9996 10310 10189 14216 10893 7851 8274 13414
9243 13414 13296 9488 17480 19601 8959 3592 3585 9577 9318 4933 6709 11911 14155 11316 6083 -1233
9227 -1233 -4420 -1668 6025 3212 5448 13247 16787 13192 4671 2941 257 -670 2851 10832 18440
9212 18440 18880 14525 17230 13683 3878 1986 6627 9788 9845 6523 1406 376 1472 6284 5466 9348
9196 9348 11161 14502 13765 10516 13387 14257 13015 16471 13873 5136 9213 14065 7785 -1133 3761
9181 3761 11660 15926 9705 10283 10403 11787 11784 14630 12428 11830 13762 16965 16515 14929 8629 2234 4728
9164 4728 8866 7482 10212 9705 7258 14540 19870 13451 13344 17850 18129 19771 24071 24536 19810 11058
9148 11058 10685 12472 8552 7306 6266 7139 14603 18235 16720 13959 16158 17821 17141 14982 13168
9133 13168 12198 8145 10928 15604 15274 16561 16897 11564 6613 8944 12640 12874 15910 20937 19010 18365
9117 18365 14565 10367 13051 15516 8252 7502 16241 24420 22129 15978 16693 18758 26240 34149 26334
9102 26334 23992 23140 18994 15980 13910 8638 8414 13810 16975 19561 18536 15492 12607 8744 6912
9087 6912 9481 10007 9421 9375 14466 16421 17199 17939 19234 15996 6359 6421 6615 9952 5486 2298 5833
9070 5833 8794 15041 17347 19426 14628 6245 4110 14146 23844 21319 20742 12844 9545 6017 6434
9055 6434 8157 13222 14462 13041 9912 11814 11985 4601 2369 5097 3054 5489 6719 5982 9464
9040 9464 17386 14353 10608 6631 11035 14366 9373 3908 10206 18636 17258 6607 3793 1837 2993
9025 2993 4481 6264 5637 9517 9443 4916 9226 8596 11302 21004 22173 24041 25021 24119 24265 21960 20947
9008 20947 14200 8093 5356 11655 12894 10513 2014 -1092 5162 7078 7872 8948 13140 12547 4928
8993 4928 3512 9335 13202 15564 15199 13593 13891 13962 11933 12120 13819 18988 17308 16428 17596 16852 12742
8976 12742 8613 6567 4940 4916 2752 1406 7909 6342 719 -4285 -10027 -10257 -7547 -2867 -2045 -1747
8960 -1747 -533 4074 4846 482 2974 3458 6151 6362 9145 5749 1509 2529 2498 3001 1001 -1412
8944 -1412 1521 2652 2668 2118 5615 5933 4053 974 948 6017 12309 10188 6271 5270 6209 32 -4772
8927 -4772 1033 6053 7964 4383 3898 5921 5977 8437 5321 2956 6888 9814 7875 5952 471 810
8911 810 3703 -5758 -7075 6532 4235 2052 -1537 -4144 -6866 -3472 -737 5706 10729 11353 6365
8896 6365 5403 6829 4581 4973 1823 -1248 8675 13652 10044 2760 838 -5509 -505 8345 13319
8881 13319 5185 2138 -358 -6199 -11873 -13483 -12622 -3097 -6275 -3896 -1469 -4269 -7751 -3824 1505
8866 1505 6067 13361 11145 6030 4037 5471 603 -2032 -161 247 -7164 -3515 -5045 1678 5587
8851 5587 5255 6397 3276 -1494 -2335 3420 8577 2370 -1426 551 7178 9849 9209 9241 6303 6736
8835 6736 5098 3384 -2285 -634 2075 4354 14766 21218 17554 11509 10115 5006 -1948 -2512 -5438
8820 -5438 -2479 7149 11403 11920 7270 1653 4397 7294 1127 -1181 -3171 -3505 -1647 740 1037 8946
8804 8946 5052 1780 -1144 394 2191 6237 5959 8233 10767 14097 10616 3006 2708 1800 -883 1474
8788 1474 5547 7598 6951 3584 2551 2962 521 5411 4178 1983 4961 6937 6173 3813 3720 1494
8772 1494 7169 13080 19015 19577 19341 20273 16115 9109 10126 10548 8891 4788 3408 3130 7834 7110
8756 7110 3037 4850 7668 14831 14178 8016 8288 9909 11357 11285 13278 8046 1653 2559 6882 11789
8740 11789 12313 8813 15816 15736 11130 10458 13616 7786 8779 5731 1998 6149 17483 15967 15711 8697
8724 8697 9852 14383 12862 12017 13044 15493 9854 -130 647 4529 5765 11974 12131 13864 13845 10928
8708 10928 11403 10976 8873 6695 6684 10182 16085 23249 24737 24611 20627 16306 9560 4176 5792 7684
8692 7684 11090 13107 19251 18226 15321 13161 16732 18213 17594 11856 11434 12832 19274 19772 17435 20329
8676 20329 11894 10548 7771 9446 14352 12644 6615 9278 7690 8247 9541 9867 3587 3584 12554 18996
8660 18996 20826 17398 9328 20434 32613 34863 33906 26372 19899 18906 23151 20368 18258 24607 25955
8645 25955 21921 18811 22863 21160 20824 28157 34083 25816 20726 27698 31401 34349 36090 41483 34918
8630 34918 36323 36423 38076 44397 51790 68013 79471 89135 93034 86181 89846 97571 99144 100919
8616 100919 112181 132884 155894 151893 142332 134895 128026 128745 126622 145440 198399 268958 291361
8603 291361 232828 160153 116157 83618 62107 57175 48485 46379 49167 45711 37998 38383 38236 41091
8589 41091 47047 46408 48352 52749 61235 75436 84688 98712 112031 125048 157088 223197 277765
8576 277765 246548 181817 129236 91651 73505 67874 61352 53698 53568 55690 54309 48954 46127
8563 46127 48199 50932 50419 52987 53758 54908 55196 57255 56550 55991 59028 56035 53459 54880 51768 47434
8547 47434 48692 43613 45184 43620 41131 45867 46338 49095 53355 51170 49418 51226 55737 54930 53552
8532 53552 56923 65324 68521 66999 62798 64547 65067 61848 55070 57655 59760 58135 55889 48071 42486
8517 42486 40017 46666 59152 66251 65112 59027 52308 52198 53642 56264 54024 50888 51389 43754 42190
8502 42190 47234 49941 49167 50202 47192 45292 45685 53832 48373 49158 48207 42719 39146 31755 33482 37901
8486 37901 45989 44322 42585 36429 37436 41543 52305 56938 48853 39459 34216 35126 38308 37143 33278
8471 33278 32627 30366 20046 15504 13352 8609 14480 22993 29495 33508 34053 32562 39319 42656 38603
8456 38603 25117 15661 11268 16484 22314 20492 15662 11952 8980 3500 6025 6119 8776 12211 14217
8441 14217 11970 10082 9817 9701 13154 16971 17272 15130 16519 23401 25603 26677 21915 13456 11975
8426 11975 14978 10657 10733 17042 19088 17563 13368 6545 11724 17444 23864 22773 29065 31549 25967
8411 25967 16589 12520 15291 15751 21160 21404 12899 8871 4285 7826 4276 5428 11575 19851 19968
8396 19968 15543 17566 16422 17571 14487 13305 9906 538 4896 7564 7901 12628 14524 22237 17058
8381 17058 9544 2204 0 2194 5000 4045 2249 8167 13893 14095 11493 11605 8735 5985 12776
8366 12776 15528 7692 3905 8223 9069 5521 4429 7415 4185 9556 18935 22093 16271 12008 8816
8351 8816 9834 9369 9198 8771 8905 10923 16163 18063 17108 16513 13376 5653 4332 3919 6369 4281 5739
8334 5739 7028 2060 -2043 -5019 -3591 11271 16563 12722 14090 10343 10755 8817 11841 13068 11255
8319 11255 10988 12050 13380 9195 3083 3329 6861 11706 17183 16143 15579 13533 13856 8457 6675 3460
8303 3460 8135 7691 14245 11748 10978 5396 7149 6298 -1238 59 -3933 -92 5171 2500 -2087 1888
8287 1888 1441 9559 10080 9484 13977 12922 12038 16675 15325 7082 11599 7719 6573 7559 8058 6393
8271 6393 2405 3514 274 5587 12069 14596 10241 12402 7944 2744 11136 9972 10590 11588 12617
8256 12617 4818 -2869 -4989 -407 8649 8235 6238 4240 8842 6008 -1810 -7893 -11528 -6173 1390
8241 1390 -1391 -6558 -8580 -8795 -9815 -10728 -4429 989 5957 9452 6230 4125 3730 -198 -2713 2135
8225 2135 3055 2574 6080 3393 -143 -2402 -2958 -5106 -993 4201 4697 10036 10108 9060 9821 9131 5403
8208 5403 3043 -1709 -3481 -1488 2247 2524 -358 -5335 -8353 -4117 -9536 -9699 -5297 6082 4529
8193 4529 -2290 1580 5746 8201 4385 2350 2370 4271 6837 9978 8505 -559 44 -1395 4045 5222
8177 5222 -373 1543 2022 8612 2428 -4950 -4082 5177 5460 1793 -4041 -4351 -4746 3733 11697 9277
8161 9277 2285 2197 9466 14461 2736 -4465 -2431 2933 781 1162 4795 2894 3283 4141 5467 668
8145 668 -7220 -9021 -3191 718 4918 6814 4131 -3386 -831 4205 4820 5969 2702 1456 2311 -1125
8129 -1125 553 -2997 -1693 1921 3373 12446 9681 7764 2488 6305 8633 7338 3597 4109 8853
8114 8853 7595 4920 7506 11391 6545 7095 7573 7613 4620 -3052 -8125 -5393 -2070 4359 5761 5220
8098 5220 5714 6633 5562 6623 4853 6484 9552 14015 12447 5206 1104 2308 -1377 385 4498
8083 4498 10050 11093 16004 21627 22780 20272 16145 16701 22332 20162 17624 17799 17001 17010 14528 18155
8067 18155 18274 19601 20851 15399 14180 17500 22152 23448 23963 21751 16325 17961 20467 23912 21312
8052 21312 19034 18579 17179 15733 16287 21665 15984 10504 10252 12800 17025 19131 18207 11465 7144 11374
8036 11374 19592 15284 8649 12619 23513 27498 29951 27788 24145 23009 25157 27914 30943 29773
8022 29773 23191 17600 18089 17347 18592 20631 22925 17228 20850 27714 26304 22569 23426 23149 22921 22102
8006 22102 30945 24500 21479 18313 21556 21344 20740 26090 33362 26535 18920 13203 12907 23991 22936
7991 22936 15364 16223 17081 24197 24588 22021 20181 24530 26807 24225 18613 19583 19097 21749 24863 25651
7975 25651 24525 25468 27593 28108 20811 16809 11784 14258 19446 25120 26325 24212 29648 19662 17209
7960 17209 23772 22502 24653 26885 20868 16596 8969 8083 13555 21072 24052 21333 17054 17559 24885
7945 24885 29165 24199 24134 22636 20115 24165 19893 16453 21314 30309 33281 28336 26519 27243 20870
7930 20870 18910 21507 17419 13276 11284 15350 13110 19404 30889 32868 28023 27056 23858 26531 26685
7915 26685 22907 26675 28600 30315 31068 34755 33164 32044 29969 28783 24948 16602 13398 14411 18692
7900 18692 21501 23727 19570 17086 15346 10317 3359 4335 8611 3438 3912 11900 10271 2980 -2194
7885 -2194 -39 2936 6248 8841 12304 12046 12659 19334 23872 15419 12030 16042 16556 19780 22867 27050
7869 27050 26391 21714 19883 16057 11802 9222 11205 13109 15956 13969 18139 25348 25343 27543 17256
7854 17256 11393 6756 2838 4232 6015 5843 5086 8275 4240 690 6779 10234 5060 -3044 1621
7839 1621 5995 -374 -4024 -8219 -8335 -5486 -3441 1052 -1268 -4201 -9977 -15458 -10537 -9308 -8832
7824 -8832 -2841 2454 -2411 -4413 -2639 1017 5005 1477 -3083 611 -723 671 1697 434 302
7809 302 1110 4201 2021 -703 -599 -4682 -4230 1244 934 -661 -7139 -7955 -5227 -4337 -6702 -4956 -5970
7792 -5970 -2439 -8340 -7543 -10158 -4053 2525 -2674 -5035 1403 -1305 -4974 -5262 -2934 1617 -2314
7777 -2314 -6547 -5482 -5152 -2769 -1881 -3584 -6241 -7441 -7513 -9461 -11024 -7839 -13 6347 13591 16270
7761 16270 14514 11647 13866 14836 17214 8666 4101 5111 -4707 -6639 6009 4211 3643 -690 -7897
7746 -7897 -10839 -14307 -13946 -13283 -11155 -6088 -9969 -20175 -12238 -3825 -1578 -5321 -9162 -6440 -9113
7731 -9113 -13119 -9428 -9433 -5389 -1424 -5930 -7840 -2730 -758 -5314 -4961 -172 5795 7391 6690 5670
7715 5670 481 -1909 -8184 -3661 -2438 -2084 -1691 1807 8400 7673 6027 4587 5115 1644 -1764 -2652
7699 -2652 -4317 -5687 -6608 -4501 -804 -3891 -4345 -5488 -7079 -7806 -10158 -12195 -12023 -14917 -15272 -11405
7683 -11405 -10847 -15624 -14330 -5476 3572 5722 1528 -1446 2699 473 -2035 -9157 -7142 -2239 2852
7668 2852 -2988 -4813 -2642 1755 -2830 -3629 291 -316 -5296 -7906 -5495 -4690 -9853 -6820 -758 -9620
7652 -9620 -17102 -19579 -18325 -17927 -17531 -18705 -11433 -12052 -12777 -15124 -10783 -10641 -11534 -14203 -12775 -10111
7636 -10111 -6778 -5178 -3236 6443 2223 -5710 -855 6922 5575 -820 3270 4377 709 2124 -800
7621 -800 -3939 -5270 -8115 -7923 -5296 -5316 -13208 -12036 -11735 -11856 -8619 -4910 -4707 -9069 -13426 -7286 -4415
7604 -4415 1124 2712 -727 -3875 -4167 -852 3787 -2389 -9125 -12632 -18069 -14667 -9150 -6624 -7231
7589 -7231 -2036 -6259 -7345 -5530 -10628 -10225 -9783 -12846 -12229 -8297 -5161 -6873 -7782 -5236 -5961 -2404
7573 -2404 -3703 -7410 -12435 -13908 -10414 -3007 -5519 -6598 -8077 -14653 -21390 -17376 -12836 -12076 -15160
7558 -15160 -18533 -13777 -7926 -8027 -2309 -316 -3823 -4214 -8312 -12030 -11419 -11817 -7759 -4639 -6032 -13262
7542 -13262 -17670 -14117 -13362 -12132 -11638 -7673 -10360 -13681 -7101 -248 7084 4845 -5957 -5015 -364
7527 -364 1456 482 -3292 -7268 -6199 3830 -981 -6413 -6750 -1887 2948 3198 7017 8826 6683 4978
7511 4978 -752 -5881 -11826 -10186 -3497 -1518 -2973 -8189 -8921 -10517 -4846 1734 291 -2005 -7651
7496 -7651 -21658 -22282 -16727 -11512 -6041 -3753 -4570 -8230 -1886 -2514 -5406 -4289 -2802 -724 3942
7481 3942 2342 -924 -8639 -14010 -17536 -17396 -14725 -10442 -10763 -9693 -7173 -3878 -550 -9605 -9587 -4040
7465 -4040 -5592 -3979 1991 7985 9715 -4293 -15020 -13845 -10414 -7318 -5683 -11349 -19149 -24499
7451 -24499 -18685 -18480 -11620 -3825 -8276 -11210 -5145 -9500 -9942 -16983 -23450 -19645 -21344 -18987 -8826
7436 -8826 -3809 1213 7854 4090 -4640 -4422 -4809 1241 -508 3982 4457 2768 -2509 -1118 2293 1526
7420 1526 -5311 -13789 -13160 -13943 -13589 -12124 -3627 -2079 1271 7071 407 -6276 -6547 -9915 -5115 -1572
7404 -1572 -2014 -469 -50 -4848 -9133 -4127 -637 -7351 -13403 -9091 -10391 -5918 -9175 -15099 -15352 -17145
7388 -17145 -17748 -12195 -3666 -2225 -6862 -5090 2973 6957 4107 9539 9491 -727 -3916 -5522 -10730
7373 -10730 -15807 -11604 -19572 -17238 -4737 -3642 -5699 -6630 -6881 -11518 -14723 -12629 -9666 -5796 -6933
7358 -6933 -11303 -6302 -4068 -4900 -11480 -13738 -9320 -6499 -4095 916 3126 -1046 -2361 -2700 -1906 106
7342 106 -3134 -681 -5428 -10019 -8663 -4935 -3364 -2870 -1030 -2158 -148 -3868 -6101 -12426 -10190
7327 -10190 -6449 -3009 -10843 -12571 -5755 -3300 -8152 -3914 -3204 -8276 -16105 -11991 -6213 -9040 -16355
7312 -16355 -11651 -4931 1273 -1940 -5093 -5027 -5685 -3716 -952 -13229 -18067 -13014 -10828 -13243 -15313
7297 -15313 -19383 -21256 -22559 -23027 -14505 -5855 217 4587 1615 -736 154 -196 -2120 623 -5339
7282 -5339 -11995 -9487 -6066 -2847 -5329 -12388 -15318 -13452 -12118 -14029 -6339 -327 -2847 -4104 -3696
7267 -3696 -10997 -10931 -5488 -644 -1690 -3816 -7608 -3311 -3787 -2890 -4130 -7999 -5695 -8293 -7062 -9536
7251 -9536 -15479 -13749 -12988 -7623 -5051 -4982 -9249 -13457 -11847 -9048 -6649 -9321 -10960 -14237 -15712 -10952
7235 -10952 -6504 -14052 -17991 -9613 -7180 -5841 -5444 -3187 966 2112 -4925 -14127 -16071 -17791 -13403
7220 -13403 -13163 -8731 -4408 -2688 -8839 -9903 -11487 -13221 -12817 -10164 -4713 628 -468 -8163 -15189
7205 -15189 -16025 -16059 -13676 -3396 170 2840 1300 -3724 -6814 -6943 -4616 1240 -4786 -2095 -1963 -2706
7189 -2706 -5363 -3762 4863 7102 3530 2011 -1113 4237 12170 6212 5096 -1200 -7289 -10373 -11508
7174 -11508 -9938 -7966 -7237 -1159 4901 -2631 -7465 -6827 -5458 -8468 -5891 -3591 3000 2520 -1223
7159 -1223 254 -3099 -6845 -5063 -6588 -8152 -8041 -9788 -9647 -9782 -10368 -15057 -14227 -4642 -2312 -334
7143 -334 -1690 1672 -1220 -5205 -10954 -8457 -4418 -5752 -4352 -11107 -10593 -10216 -4902 543 3330 -544
7127 -544 -2167 -3369 -4162 -4772 -5339 -493 -2467 -4809 -4281 -5031 -4797 -324 2598 1322 -5747 -6316 -7851
7110 -7851 -2538 1342 2455 -4341 -6403 -772 2027 6361 169 -782 -4277 -11746 -10903 -10514 -6516 -1157
7094 -1157 -6448 -6235 3395 -1665 -9472 -10398 -10216 -6410 426 -2416 996 10080 4429 1273 551 2560
7078 2560 3504 -4983 -7231 -8260 -8466 -6676 -13284 -12636 -12974 -6523 -8189 -1920 3792 4716 8372 5212
7062 5212 2113 -2708 -4968 -1063 -695 -6269 -10873 -9610 -1739 -2854 -4514 -4455 -2628 -4361 -3703 -96
7046 -96 -4880 -6258 -1113 2081 158 5117 2107 1073 5552 118 -6709 -15275 -18985 -15911 -2137
7031 -2137 -1466 -8545 -8452 -9132 -5826 -7097 -4287 -5004 -5045 -9763 -18789 -20257 -13103 -9631 -12730 -12431 -9584
7014 -9584 -7878 -9373 -7512 -4475 -9840 -11351 -6218 -5924 -5646 -912 -5987 -11658 -6918 -9607 -14595
6999 -14595 -22884 -21174 -10438 -7199 -8581 -9319 -3874 3593 4131 1560 8 1943 -2181 -5919 940
6984 940 -1995 -6207 -3715 -3216 -803 -5443 -12273 -11328 -11595 -10054 -5294 -7614 -12125 -14262 -15515 -16380
6968 -16380 -15688 -12534 -12857 -12298 -11026 -5918 -376 -1231 -8719 -14727 -10173 -3001 4834 -827 -5968 -6139
6952 -6139 -9534 -10492 -10941 -8004 -11837 -13082 -10845 -4026 -3819 2337 8794 8825 7408 9217 11259 10669
6936 10669 2419 328 258 -1478 -3186 -7307 -5796 -1911 2807 625 -5333 -6123 -5710 -5511 -11805 -19220
6920 -19220 -20766 -16330 -10572 -10868 -17317 -17470 -8481 -3132 -1464 5139 2826 -9224 -11817 -11568 -16626
6905 -16626 -14342 -9148 -11422 -11517 -5189 -3047 -7094 -2282 -1236 1972 2528 2035 5022 1110 -6619 -7605
6889 -7605 -6131 3413 3752 226 -3940 -3447 -2409 4546 7710 4886 2231 -2068 -6816 -2712 -6225
6874 -6225 -12137 -6959 -2544 -465 5547 4063 -5789 -12517 -11440 -10448 -11019 -15452 -13432 -9493 -7104
6859 -7104 -6091 -3205 -2973 -3628 -3391 -1849 -2699 -7164 -10358 -14967 -9560 -6638 -2532 1087 2896 -1061
6843 -1061 -3359 -437 -2619 -6460 -9116 -8659 -9623 -7788 -7211 -13451 -10750 -6874 -1744 -4431 -8919 -5284
6827 -5284 -1918 -7337 -11708 -13527 -6282 -13 6812 8715 8344 3534 1131 -1396 -3429 -417 -627
6812 -627 -8855 -14046 -24430 -21051 -9584 -3484 -4731 -4913 -3634 -5647 -3865 -7328 -6706 -7409 -7744 -4276
6796 -4276 -3403 -1925 1252 47 -542 -3976 -10381 -16352 -15581 -15858 -16903 -16234 -11189 -11388 -14517 -6589
6780 -6589 -842 2216 3736 -806 3249 -1483 -3014 4636 10204 8997 -2604 -10045 -7002 -5118 -5927
6765 -5927 -10805 -14465 -12129 -9503 -4180 -7483 -8739 -7079 -6008 -3144 -1054 -1381 1433 1536 3532
6750 3532 7034 15043 26961 38629 51728 60228 73602 59576 32213 15791 11637 7218 4110
6737 4110 4374 5492 -2533 -4734 -4803 -2941 -3622 -3855 -4148 -5802 -1897 3494 2034 3598 765 -5927
6721 -5927 -11452 -5050 -7982 -9710 -10743 -16579 -17181 -16331 -10471 -8257 -6228 -7942 -7365 -1686 -7481 -4433
6705 -4433 -1209 1728 480 1262 1429 1066 1234 1866 12360 12923 8161 8165 4177 -63 -5072 -651 7559
6688 7559 10531 8334 4007 2644 -1461 6952 13603 25463 30339 15330 -204 -4463 -2646 -3394
6674 -3394 -4232 -3201 -7486 -13919 -12307 -12731 -17849 -13506 -16711 -21097 -20980 -18786 -11175 -1488 134 -2791
6658 -2791 750 1234 1144 -1554 -3082 -1517 -2376 -9594 -16456 -18692 -14342 -9753 -6089 -5659 -8817 -9188
6642 -9188 -7849 123 -1192 -8748 -4788 1006 -2877 -10885 -12122 -8952 -1652 -2250 -1440 2561 2848 -2576
6626 -2576 -2435 2066 2178 -2284 -4336 549 3902 4322 -798 -3274 750 -3905 -12276 -12424 -6940 6866
6610 6866 11667 8080 3155 -1795 -940 30 1817 52 -506 -739 5943 4421 6850 6296 -3854 -5297
6594 -5297 1502 1194 3111 387 -4396 -10266 -4938 -1429 -1938 -1071 731 3994 12457 19418 35236
6579 35236 70975 105581 74727 48695 32734 18141 6558 13256 10466 1463 -2259 -2386 -3516
6566 -3516 -6384 -4500 -2102 -2153 502 -4474 -2407 -1369 6469 11246 8332 7811 1563 -4816 -3556 -459
6550 -459 -5214 -7807 -12933 -11272 -10571 -7263 -6834 -6326 -11186 -7743 -6082 -6514 -5239 -1997 376 693
6534 693 -5098 -12644 -13298 -7039 -3480 -7153 -14616 -17129 -9498 -5478 -7521 -6979 -4906 -2758 -2722 -2128
6518 -2128 -1783 2184 1266 -4143 -10903 -13133 -17269 -17174 -11386 -6276 -10201 -11246 -8994 -2699 -649 -3925
6502 -3925 38 -3379 -7277 -2742 -1042 -4412 -2745 2954 4098 3735 5730 9379 4340 -2302 -5496
6487 -5496 -8760 -8066 -13882 -8749 -6535 -8109 -3860 -1261 2511 1236 -2338 -873 1752 964 -7217
6472 -7217 -8936 -11548 -11859 -14350 -22001 -19497 -15737 -13334 -17599 -22264 -20425 -14170 -11106 -8009 -15458
6457 -15458 -16164 -15498 -8580 -4631 -9080 -8462 400 -1499 -4960 -1581 3591 -1935 -5790 -6928 -10717
6442 -10717 -10745 -4647 -2277 -3081 -6003 -6013 -7632 -10644 -9918 -8372 -3450 1000 4393 4652 -76 -1246
6426 -1246 -3402 -5331 -2776 4299 1890 -7144 -9083 -4128 -5670 -6966 -432 200 -1574 66 9660
6411 9660 7238 -808 -8555 -10580 -6831 -2447 -2488 4 1144 -3320 -10101 -12221 -6784 288 304 -4242
6395 -4242 -8812 -4853 -5415 -2397 23 -11161 -17798 -15386 -16862 -21216 -24557 -17343 -10685 -7578 -7972
6380 -7972 495 -91 -4963 -2 3663 -408 1098 -1688 -3258 751 5703 2200 -3844 -7184 -9174
6365 -9174 -9674 -7772 -9794 -7940 -6034 -11801 -7979 -6035 -6598 -2765 -2532 293 8200 11189 10902 12192
6349 12192 6974 -227 -3757 -1021 -4110 -8391 -10949 -10262 -2673 831 209 -2721 -6387 -2667 -2953
6334 -2953 -9607 -17523 -9671 -6747 -1054 4470 7855 5282 -1668 -6245 -13314 -10835 -7139 -9572 -9547
6319 -9547 -14584 -5322 -3526 -10633 -7220 -2529 -3600 -10186 -10060 -13011 -14382 -10627 -5541 -6574 -2576
6304 -2576 424 -1166 -804 851 6320 6600 -458 4792 3792 111 -6145 -7869 -7131 -3067 4427 14103
6288 14103 9057 2829 4345 2441 850 4380 5250 3036 -2525 -4386 -2586 -3587 -1375 3408 615
6273 615 271 4666 3816 540 4813 4390 -2726 -4608 -5639 -1706 703 1426 1927 -2939 1004 3008
6257 3008 1715 -3375 -9329 -7286 2705 2849 2987 3801 2575 190 -6833 -10643 -16180 -14135 -14722 -10408
6241 -10408 -4467 -3774 -8227 -14396 -20896 -8678 392 988 -159 2581 6187 2028 3188 5858 -1259
6226 -1259 -5995 2395 -48 -4956 -6984 -4618 2136 552 440 2204 921 -3759 -12136 -9367 -6773
6211 -6773 -6293 -4939 798 466 -1845 -4515 -6564 -9501 -9153 -8895 -7055 -3090 -5718 -5422 -6334 -11834
6195 -11834 -5658 1364 2947 5641 1727 -4657 -6158 -8217 -4818 -5134 -2551 -1186 -202 -3942 -8618
6180 -8618 -6003 -244 -2138 -8444 -2249 1680 281 -5813 -14895 -11655 -2688 -1999 -594 481 2179
6165 2179 -978 -692 -3206 -4037 -993 -3006 2948 2810 -4719 -7931 -3981 -249 -4880 -3471 -11327 -11529
6149 -11529 -14765 -9027 -5885 -6563 -9818 -7737 -15357 -14988 -10092 -5992 -6934 -5569 -5860 -8816 -8526 -6122
6133 -6122 -9952 -11588 -13817 -10845 3755 5050 -3365 -13617 -8146 175 2836 740 5334 7289
6119 7289 8337 5271 1049 -2573 -428 -2390 -3515 -648 853 2174 4873 8145 3729 -2979 -6741
6104 -6741 -11259 -13834 -11917 -3947 6374 -3282 -10686 -8835 -12537 -19780 -19679 -19373 -13256 -11473 -8866
6089 -8866 3726 4825 8773 518 -8550 -7188 -2226 1130 1209 -2694 -2317 -2352 -9771 -16991 -15714 -6717
6073 -6717 -5284 -9398 -9555 -11286 -9513 -1451 3731 825 200 57 -3487 -1519 2609 9635 10736 9092
6057 9092 2601 -2868 -9023 -7178 -6974 -1761 -4082 -11155 -8805 -3817 -3704 -1145 4280 3009 -2394
6042 -2394 -1974 -5594 -14267 -9616 -3286 -99 2406 -630 -5127 -2921 -3542 -1073 455 1224 -815 -6699
6026 -6699 -8876 1127 7586 2192 -4260 -8921 -7852 -3592 -3092 -4868 -5498 -14425 -17015 -12812 -7195
6011 -7195 -5269 3752 5929 -1000 -5358 -2389 -2432 -3991 -256 7093 14968 12132 -306 -3083 -3095 1791
5995 1791 -758 -5498 -7781 -5878 -6117 337 -4430 -4066 -2211 -4906 -1512 1889 2210 4343 1923 -2932
5979 -2932 -3312 -7111 -13376 -14035 -7660 -3425 1034 4263 4632 2666 -6635 -10520 -12324 -10840 -7819 -3549
5963 -3549 1498 -2585 -10880 -12611 -12417 -12054 -3193 2331 7351 3130 982 5344 8730 3743 -2205
5948 -2205 -8706 -10670 -12854 -6827 -5694 -9954 -4314 4814 1141 -8083 -7174 -8501 -9777 -8365 -12258
5933 -12258 -15255 -14219 -13020 -17369 -14461 -9104 -8113 -7336 -5878 -2406 974 3834 4017 4696 7233 179
5917 179 -6362 -12223 -7795 -2511 -337 -4774 -6227 -7526 -6115 -2605 949 -5067 -1174 568 3640
5902 3640 5378 7261 5516 5443 -6082 -7543 1558 1439 -9294 -10054 -10141 -7809 -12138 -14998 -17022 -12746
5886 -12746 -9107 -10778 -10068 -5398 -2855 1733 -258 -8759 -15597 -8811 -5915 257 -1002 1852 -3086
5871 -3086 -14266 -15820 -13481 -13057 -10863 -6740 -5302 -460 163 -618 179 -1901 508 4585 6984 8155
5855 8155 3143 2204 3804 -2129 -17074 -17552 -8060 3825 4279 7569 10243 -495 -6138 -2361 -6674
5840 -6674 -9508 -9068 -5879 -4089 -5455 -4813 -6845 -4337 248 -1023 2078 829 -197 -7862 -8275 -8478
5824 -8478 -14208 -14300 -7905 -1836 -3371 -5439 -11816 -15921 -14699 -12770 -7611 -11337 -12481 -15484 -10687
5809 -10687 -9895 -2995 -2437 -6095 -9561 -12506 -2643 2680 8590 -1167 -7759 -7968 -1139 337 166 416
5793 416 -1747 -5054 792 4980 6227 12478 15005 13275 18724 17003 5690 11618 10565 2076 5254
5778 5254 5253 -4606 -1610 -3759 -4967 -1112 -1501 -4687 -3618 1656 -3487 -8870 -781 2553 2908 5997
5762 5997 4829 -2669 -7141 -10424 -13756 -8689 -8987 -12641 -12371 -11600 -12421 -10758 -5507 -6838 -16141 -17395
5746 -17395 -11743 -9408 -6532 -1877 2984 2460 2610 2464 4640 4586 6337 6757 -3398 -11638 -3933 3011
5730 3011 2454 429 4774 6712 3080 8570 10783 5950 2940 4794 8150 2506 4642 -838 -6300
5715 -6300 -2297 -2350 -73 4312 6493 7688 7424 -1135 -1407 -4614 -4340 357 2229 -60 -2362 877
5699 877 -612 -7632 -7536 -8689 -8876 -7403 -10083 -7430 -10040 -10351 -5674 -10614 -14459 -13401 -8245 -4159
5683 -4159 -684 -4958 -6652 -6284 -3198 -2877 -1431 1610 1835 2109 347 -2805 -8990 -10635 -13786 -19321
5667 -19321 -11665 -8123 -6271 -1937 4623 -3224 -5478 -1107 -3246 -8604 -10579 -6249 2436 -1472 -3444
5652 -3444 -8474 -15479 -11965 -4087 4849 6292 502 -7005 -2118 -4330 -11895 -8953 -9448 -8113 -2725
5637 -2725 -2406 -1725 2567 -3902 -10214 -15357 -14193 -10853 -3272 582 1460 -729 282 4156 2534 680
5621 680 -8445 -17275 -12936 -7980 -2763 -3456 -5762 -9082 -2543 4125 -1814 -440 4489 7919 5510
5606 5510 -282 1769 9665 10889 16969 8904 4885 3225 2340 4656 2181 -4591 -5850 -2813 -1553
5591 -1553 -3918 -10096 -5410 -3981 -8902 -14656 -7638 1420 -5075 -11588 -7170 -3581 -6920 -2152 -4821
5576 -4821 -9146 -4984 -1054 -1882 -7506 -10124 -3969 1822 3180 4004 -8028 -16579 -13765 -5912 1208
5561 1208 -3594 -4841 -2486 -6426 -8066 -10187 -9898 -4731 -4173 -9356 -12196 -6890 -3727 -4735 -1133
5546 -1133 -3154 662 3431 1339 -2487 -3744 2202 -1572 2154 4115 943 -4397 -9556 -13858 -6993
5531 -6993 -5040 -4357 -5437 3478 8710 12784 11632 9997 4457 -2635 -6512 -10685 -10808 -8478 -8472 -3372
5515 -3372 1382 4474 -1630 -7141 1099 1970 -8857 -14676 -16645 -12326 -5653 -2684 3386 338 -3623
5500 -3623 -9544 -8928 -2250 -6670 -276 95 1081 -1417 -12103 -16581 -17619 -10169 -1336 -6144 -8776
5485 -8776 -7398 -2173 -5690 -4103 1729 1370 -547 -4171 -12199 -10352 -1114 449 3294 3937 3234 5639
5469 5639 8121 10462 6075 -6117 -11272 -10800 -4863 3584 10019 8013 8024 9048 11894 11147 5083 -23
5453 -23 3381 7274 2632 -3108 678 3848 4416 2302 -3186 -6846 -2974 -1354 -2889 -7876 -12992 -11740
5437 -11740 -9304 -7569 -7938 -2929 -6920 -4919 50 -1721 2257 764 -4051 -3426 -420 2187 8897
5422 8897 11927 7935 2674 -3050 -5809 -6592 -2982 4373 145 -6349 -7079 -7130 -808 2168 3560 7212
5406 7212 6119 -2325 -7399 -11646 -2897 -917 -9921 -6620 316 -1220 -2809 -2653 -581 -2816 -3267
5391 -3267 -555 4937 5773 -851 -1598 4684 12621 7562 2635 2643 5629 7371 4272 -5000 -2336 -2369 78
5374 78 -313 1162 -1834 -7771 -15928 -17047 -7828 -4393 -2344 4051 599 1966 3516 -482 -3989 -4030
5358 -4030 -7950 -7345 -7355 -4214 1437 27 -3236 -4658 -3333 -803 -2737 398 3814 1775 655 1710
5342 1710 6098 5432 2285 -4439 -9909 -5998 -126 6645 7701 7453 5069 1140 -5892 1559 5563
5327 5563 7604 8636 8819 2247 -3716 -4039 -2101 -50 -3869 -1022 3680 4227 1303 3869 9700 7362
5311 7362 2628 -419 -4348 -5587 -3307 -3270 -1087 -3695 -9465 -12675 -7404 -5567 -4275 46 -1926
5296 -1926 -7294 -5662 298 7723 10969 7300 636 -6099 -4545 -3845 -1003 -4603 -7347 -8587 678
5281 678 6183 5650 6851 5108 -260 -5998 -10233 -12691 -11906 -6626 -4607 -9749 -15047 -10731 -3830 -524
5265 -524 2338 842 3220 3850 4018 -2504 -6697 -9289 -12869 -3541 -1886 -12181 -12910 -1521 872
5250 872 -4664 -8669 -549 6355 405 -3159 -4120 -5422 -3832 -6809 -8743 -3222 978 -1368 4165
5235 4165 7054 3720 3388 1101 1830 2547 -3512 -7961 -7123 -2172 -2705 -3223 -5752 -13743 -8029 -3174
5219 -3174 -4366 -13641 -9331 -1902 -3005 -6294 -2986 -898 -8949 -12720 -10893 -5991 -4686 1057 7000
5204 7000 6946 -1541 -3113 -5255 -3033 -4018 -5234 -7298 -6844 -13852 -13172 -443 4257 5028 64 -7279
5188 -7279 -9835 -8444 -7126 -1793 5899 2418 -3232 -8031 -2333 -1542 -25 -2697 -4157 -7698 -7626 -7846
5172 -7846 -7681 -3972 3036 2894 3557 571 -7257 -14064 -10195 -10817 -9479 -5040 149 -1412 591 987
5156 987 -1493 -7792 -9196 -12256 -15482 -13628 -12197 -6345 -5202 -3563 -4879 -7252 202 -1031 -2624
5141 -2624 -6913 -6543 -12128 -10740 -2165 -10619 -14120 -15916 -18422 -16474 -17672 -11780 -13867 -13770 -6278 -60
5125 -60 2566 1405 -7222 -12059 -7969 -12815 -17039 -12605 -10064 -9977 -9444 -10160 -6240 -10744 -11640 -5747 -72
5108 -72 1187 -1315 -3866 -7426 -6459 -5705 -6390 -7798 -2765 508 1902 -4383 -7637 -5901 -7486 -6995
5092 -6995 -9720 -4571 -2954 -4649 -4555 -1592 2390 -506 -1172 -7854 -7426 -6413 -4120 -7645 -301 -3024
5076 -3024 -4528 4030 4648 6809 4428 1537 -2559 -3881 -3298 -251 -1078 -5779 -1397 2776 909 -697
5060 -697 -75 -1223 -5884 -3411 3691 -3388 -9143 -14104 -8719 -496 3506 2365 -969 -4241 4971
5045 4971 8971 6630 5246 -252 -845 -3405 645 -2829 -9099 -12046 -9888 -8837 -14109 -10080 -6359
5030 -6359 -3286 -5537 -7598 -3958 3230 1966 -5805 -5674 -1840 -1646 -1235 3001 -2246 2162 3916 -561
5014 -561 635 6675 2916 -3494 -2276 4062 5880 3373 -2813 -3201 -4763 -5356 -823 1238 1180 -2636
4998 -2636 -2882 1209 -3161 -10434 -13364 -12567 -13044 -8131 -10091 -18456 -16117 -9493 -186 4412 7177 4663
4982 4663 -4228 -4598 -1400 3096 4206 3818 5126 988 4852 686 -6222 -11941 -12759 -11763 -8528 -2782
4966 -2782 4368 5563 5210 8970 -1003 -2529 -3720 -5189 -3782 -9030 -6645 608 -683 -7168 -14366
4951 -14366 -11633 -3422 -2041 -1211 -2244 -3672 -7153 -6416 -4633 3327 6095 9169 3153 -778 4737
4936 4737 8403 6247 -5531 -10618 -8917 -5004 -5633 -1323 1020 4418 4917 6285 11756 10704 7739
4921 7739 3451 782 -2416 -2308 -1859 211 -1634 -5409 -1262 2022 -1964 -620 -2644 2143 1792 -1809
4905 -1809 -6305 -2789 -2844 -3983 5259 11300 5873 2209 -8868 -7322 -6765 -6045 -2887 -2714 -4755 -11063
4889 -11063 -6035 5523 12172 9878 3576 -4187 -1951 -4123 -6022 -6157 -2943 -994 2974 3149 4621
4874 4621 30 3268 -1106 -8158 -10401 -6953 -7001 -6431 -2366 -4377 -2085 -2280 2067 3749 10851 9390
4858 9390 4010 2923 -1023 -8288 -9115 -7885 -13353 -14740 -11544 -8066 -5663 -9958 -5131 -6070 -7746
4843 -7746 -6441 -5104 1210 7215 3242 -3460 -8401 -8558 -4267 -4566 -2936 -2196 -1990 -1201 -2863 2119
4827 2119 3424 -1788 -2230 -1784 -7549 -16880 -19131 -11203 -1895 -534 -2356 -3114 4534 8890 7544 1591
4811 1591 -3180 -10767 -7658 4448 6295 1245 -2260 -4884 -7805 -7303 -5812 -2242 -3005 -6920 -3067
4796 -3067 3497 2245 4001 5115 7424 6020 3315 6730 7151 1342 -4839 -6304 -1072 556 -3892
4781 -3892 -3546 -1373 -1546 1107 5566 5888 -8912 -10335 -7013 -223 6264 -2481 -7066 -6729 -4959 -7335
4765 -7335 -11268 -4414 -4089 -1704 -1144 -3978 -8427 -8938 -3966 -43 -391 935 -1962 701 2277 -2656
4749 -2656 -859 -3414 -953 425 -5327 -9139 -3159 -6826 -12948 -13599 -7392 4799 919 17 -1981
4734 -1981 -3546 2381 6432 7614 6895 3026 -871 -1044 -661 3290 2256 6519 6861 3848 -2568 -4497
4718 -4497 -5173 -7776 -4701 -6435 -3758 -2589 -1222 2469 2841 1901 -3120 -7908 -8735 -11719 -14391 -18886
4702 -18886 -15639 -7350 -10834 -10521 -12504 -8534 -1112 3313 -2925 -3012 -1647 1330 -3042 -6126 -6926 2920
4686 2920 4915 -2949 -7357 -290 2818 -3258 -9061 -8267 -676 4476 2399 7704 16336 22020 21560
4671 21560 15050 10022 9453 8266 10668 10295 6276 2119 -1399 -1113 6189 7548 7553 4589 7277 9023
4655 9023 3159 1528 2712 6411 8182 11326 8862 1668 1671 4547 9495 6232 8151 12082 13007 15756
4639 15756 12396 12535 10857 6972 6194 3660 6240 3638 -1778 -5732 -8178 -3945 -1100 2114 6195
4624 6195 1198 -3133 -4765 -3500 -8876 -8515 -4019 -8618 -9760 -3873 3623 923 -6174 -4629 -2043
4609 -2043 -600 -2668 -6204 -15284 -21833 -24864 -21198 -19355 -16653 -11325 -10274 -10306 -4109 -3021 -2942 -40
4593 -40 6613 10549 1972 -4855 -8848 -8532 -11061 -12221 -7214 -4549 -7549 -5268 -1256 -6284 -9408 -9332
4577 -9332 -3697 -1119 -1721 363 -1789 -5806 -5891 -4848 -6352 577 3162 -4883 -6153 -5882 552 -3243
4561 -3243 -3179 -6237 -5744 -5735 -726 -138 2776 4878 7422 14784 13794 11543 3745 -4715 -6828 -4651 -3303
4544 -3303 -8164 -7545 -3380 -2508 -4373 -12119 -9368 -5421 969 6203 3001 -4265 -13261 -16529 -17978
4529 -17978 -15841 -3733 5306 4776 -6456 -12866 -12027 -3763 1521 6440 9944 5290 3205 4999 7891
4514 7891 2888 3350 3618 3879 6304 2303 6498 3415 -2011 -112 6764 10929 2311 1343 2319 1446
4498 1446 -289 -7600 -8179 -7007 -1683 -7 822 4453 2211 -2768 -218 10217 9963 8398 10754
4483 10754 12131 12686 10185 5009 -698 1738 1781 769 -5661 -15201 -20237 -15267 -10276 -720 -1415 -3279
4467 -3279 -4392 -1440 1388 -1770 -6622 -2622 -4568 -11751 -10967 -15923 -19018 -21508 -13661 -5139 -4659
4452 -4659 -1671 -5896 -315 1541 2983 -4094 -2858 -99 -1125 2962 -1432 -753 1888 2763 4407
4437 4407 5396 2595 7078 8046 -2602 -7099 -4550 2037 8506 12015 10578 3069 3696 11433 7757
4422 7757 2216 4391 4812 476 796 -791 -3530 -1810 5377 4491 1234 3916 1929 1117 4458 9149
4406 9149 10242 4948 6524 7591 3996 -789 1299 -4153 -5602 -3206 -3566 -4325 -4088 660 -5646 -5776
4390 -5776 -5504 -2531 4441 62 -1864 -5696 -1841 2469 -3189 1043 -3029 -2203 681 -1684 -5255
4375 -5255 1773 -1060 -5295 -2163 -2551 3119 3334 -693 -593 -352 1270 4428 5939 4886 -2452 -5775
4359 -5775 -9556 -9600 -10619 -9134 -4533 -3935 -6230 -5723 -9147 -7477 -3590 -3025 -1567 -1849 397 5891
4343 5891 7362 4053 -106 2200 1532 1603 6019 4648 -1760 -4348 -6250 -1813 -151 -2972 -7689 -10819
4327 -10819 -3693 5276 3889 3902 3220 -915 -4970 -4273 -2782 -3019 1722 162 -9232 -2279 6501 4371
4311 4371 3000 847 -2805 674 8799 7448 -7354 -10637 -9725 -6905 -5189 2018 -376 -5389 -11123
4296 -11123 -12774 -16039 -11742 -5279 -4269 -2646 1986 -7034 -5488 -3429 -4902 -3081 -8053 -7987 -4807
4281 -4807 -3293 5727 7213 6142 3369 -232 -6040 -5960 -6577 -1755 3475 -909 -1371 -2519 -6206 -3507
4265 -3507 -832 807 920 -2861 -9630 -11919 -9028 -3868 5546 300 -9149 -7192 -8351 -7638 -5403
4250 -5403 -10155 -11119 -13227 -9627 -11190 -12792 -6123 5714 3368 -2134 -2297 1496 4923 2707 -3734
4235 -3734 -5210 875 2222 -6426 -7983 -14201 -17592 -9012 -6380 766 3677 9490 12889 12048 10141
4220 10141 8157 941 -138 -2577 -5582 -517 -2715 -1498 948 2456 -6233 -32 4360 5180 6331
4205 6331 1129 53 -1434 -1300 952 2200 2594 290 -6628 -2826 -148 4726 2598 996 -1298
4190 -1298 1411 -335 -2552 480 6185 6982 -182 -538 -2175 -3337 -5928 -4488 1565 7316 4047
4175 4047 2885 -2917 -5466 -4579 -5114 -1113 -823 -5535 -2808 1105 -1175 474 -4822 -4738 -955 -564
4159 -564 -7255 -10125 -7095 1406 12762 10436 8207 3235 -1191 -2995 -2125 -1783 1535 -5508 -8983
4144 -8983 -13096 -13890 -10493 -5333 -2261 2785 4278 -3187 -5605 -122 -446 2098 -246 1237 3843
4129 3843 3751 3025 1520 -3670 -5055 -4237 -5354 -1417 -1020 2713 4450 5727 4624 691 3843 6425
4113 6425 2322 4620 6706 5275 1260 -440 -2628 -2619 -6924 -5687 -5362 -1904 -873 -4474 -6862 -8748
4097 -8748 -6728 -6561 -3716 -5827 -3663 4306 5829 9387 8430 3933 4184 10527 13734 10845 6422 10199
4081 10199 8527 7031 6564 6616 3732 3026 2206 -578 -3147 -7166 -10001 -14731 -10014 -9921 -14494 -7720
4065 -7720 -2233 -331 656 1479 1611 -5581 -7930 -11430 -8047 -3341 -4450 -3176 2392 996 -4502 -7469
4049 -7469 -7250 -2129 2271 8694 10083 13486 9653 2807 -2809 -6502 -1181 1206 1782 6060 7653
4034 7653 9006 8139 3279 5018 -2829 -9803 -7009 -3900 -2400 2077 9623 8207 3522 5187 7356
4019 7356 6021 328 -1125 -4194 -3690 4768 13438 6938 153 1949 -3072 -6144 -3320 3435 3161
4004 3161 2859 -151 4765 4709 2419 -743 1024 -4291 -4824 -1719 -1088 2026 4142 3074 2056 -1311
3988 -1311 -4605 203 3034 3663 6358 2859 -7526 -8176 -9253 -9045 -8276 -11149 -12470 -3601 -876 3306
3972 3306 4636 9112 10401 4370 4626 7778 1196 -6938 -9216 -7459 -1405 947 696 -1235 -5565
3957 -5565 2149 -2778 -11641 -14381 -14268 -11162 -5578 -7904 -3401 4265 -115 -3802 364 4182 5050
3942 5050 240 1625 -1189 820 -3113 -1392 2826 2791 4127 5601 3806 -1828 -12799 -14967 -7472
3927 -7472 -5730 -10271 -13003 -7053 -8773 -10300 3228 9259 3961 261 13347 15819 5950 2150
3913 2150 3069 1166 5593 3684 -981 -2576 -8239 -7098 1654 10863 6470 -2187 -7162 -3437 -5670
3898 -5670 -780 -3250 -4858 150 4249 6545 2432 -2729 -350 -2543 -4740 -4000 -9194 -7555 -6782
3883 -6782 -14360 -12064 -4107 -3485 1383 1929 3039 868 3057 643 560 -63 -3452 1062 1527 -3546
3867 -3546 -7982 -9097 -8589 -4516 -1407 -1179 -1197 -3924 -3936 -3555 -2056 -4978 -1061 -2524 -5459 -4911 -681
3850 -681 1542 4039 1250 267 4004 3411 -1747 -1132 -103 -244 2626 -3259 -836 12125 15070 8838
3834 8838 9596 9556 6856 4091 2286 5638 4065 4829 1612 5706 8562 10619 1983 2031 -1920 -7625
3818 -7625 -8446 -7664 -8184 -8056 -11105 -5995 1027 810 747 -1286 -8139 -3626 -553 -3206 -4280 -1091 -1011
3801 -1011 -3092 -3066 -5107 -3693 -2554 400 2041 4554 6517 4411 6387 6709 -287 2458 -747 -13483
3785 -13483 -8609 -7674 -4649 -4318 -5243 -5104 -2765 2130 1998 -3005 3622 5880 5542 3878 2936 -6597
3769 -6597 -12683 -15063 -12182 -9650 -13594 -15658 -13703 -7328 -6207 -8508 -13278 -7069 -4277 -5668 496
3754 496 9100 8820 7662 7542 8336 9442 7792 1733 -1236 5097 5452 7834 14274 14237 12545 1373
3738 1373 -1875 -3105 -3220 1655 2360 6632 8451 7398 4160 4778 7521 10456 6635 5377 5283 3567
3722 3567 2173 -2992 -1381 495 -2183 -5585 -11155 -13600 -15350 -14261 -5277 726 -2493 -8952 -16347
3707 -16347 -16505 -16598 -15961 -6380 1475 -3066 -12081 -14181 -14143 -11174 -10099 -11002 -16521 -14832 -13400 -6820
3691 -6820 -9412 -5928 -5571 -10735 -7487 -9386 -10360 -9347 -2330 2617 -1721 -246 -9429 -16047 -12284
3676 -12284 -13974 -16387 -20805 -14599 -6080 4708 3115 -11609 -14636 -12901 -4521 -5073 -6873 -8036
3662 -8036 -6597 -6094 -5890 -3488 252 3060 -2538 -2560 -6739 -10937 -12448 -5960 3218 327 -4584 -1536
3646 -1536 757 4003 4474 1750 364 4794 2487 1001 2773 2597 7734 972 7279 11417 3883
3631 3883 -4351 -1846 -7077 -7057 -5015 -2318 2234 12409 10795 2848 -2511 -4438 -6751 -7688 -6513
3616 -6513 -3512 -257 -2405 -551 3341 4624 6352 8275 358 -5893 -742 2120 2811 3690 1479
3601 1479 2859 -2742 -3470 -457 1480 2339 -3667 -6849 -4647 1842 3972 4878 -177 -2776 -4849 -1277
3585 -1277 545 3503 4881 -582 -52 71 -1114 -7100 -10936 -3367 -1439 -4541 -8763 -2502 -1558 -4369
3569 -4369 -6885 -6024 -1516 263 2890 13961 15044 9884 6188 7831 5413 1183 5763 -1918 -209
3554 -209 1157 1591 8894 9711 1520 -2310 -3117 -1253 1995 1273 -235 -2161 1519 6806 5214 5915
3538 5915 1515 -54 2906 1893 -822 -373 1508 3166 -1860 -7568 -6745 -6081 -10659 -4961 -582 5727
3522 5727 9449 9058 6130 2427 3656 5262 2950 1699 -1714 757 4409 6166 4065 742 -3774
3507 -3774 -8389 435 9288 6645 924 -7623 -1801 -936 -3524 -4536 -4055 782 7509 8683 12810
3492 12810 13096 9172 1383 -863 1758 7432 4756 6613 2498 -2253 1187 6071 1446 -908 -8606
3477 -8606 -7628 -1948 4569 5220 1259 -2419 1666 -1516 -7571 -8313 -7728 -712 742 1542 3912 2930
3461 2930 10019 6960 9296 9638 4280 5550 3360 4973 4313 5474 5015 513 -5259 -3994 -4202 -2751
3445 -2751 -668 389 -3678 -6834 -6554 -12448 -15227 -9839 -10717 -17371 -23969 -20225 -14241 -10936 -10236 -7576
3429 -7576 -2507 3213 8869 8458 3697 280 4183 1499 -4155 2399 5798 2555 -889 -3152 -3366
3414 -3366 -2547 -5596 -6747 -2482 -527 -2852 -523 1585 2561 2527 -1047 2770 6692 7573 4893 2574
3398 2574 2545 -5832 -9184 -10125 -15228 -13048 -5978 2059 3843 3213 2570 770 -2056 4336 14336 19626
3382 19626 12390 6729 11430 7579 2370 2498 8270 10115 5372 -1253 -1693 993 4610 4463 10287
3367 10287 13485 12601 8167 6781 8127 11932 11325 10044 11619 10144 8852 11343 1982 13 -2167
3352 -2167 -525 -1414 -1552 2886 8404 6532 -773 -2397 -445 -9560 -9424 -2714 700 -3081 -9411 -7470
3336 -7470 -6029 -4076 -877 -4067 -3441 1373 3104 -308 -1899 -575 67 -5402 -4143 -2157 -5372
3321 -5372 -7569 -10508 -8335 -5027 888 1876 -535 -5036 -4508 804 5493 -1580 -6215 -4959 -44
3306 -44 4068 8062 7556 698 -1597 -274 1069 178 3311 -3021 264 7149 5466 1081 -182 1083
3290 1083 -4242 -7279 159 -2062 -5651 -2710 973 -513 -2476 1856 -461 -30 -1411 -3654 2485
3275 2485 8667 15171 17954 15618 5981 1672 5185 -3522 -4013 1 119 -2714 -3964 -1170 -2911
3260 -2911 -10923 -18398 -21236 -15919 -13345 -12793 -10830 -7352 -1922 4214 9017 8914 6517 11268 8919
3245 8919 1204 -3469 -3421 -1304 1390 1073 -635 5283 2402 4560 6907 6459 3879 6589 2608 -2417
3229 -2417 3116 3387 -7958 -11529 -8619 -7936 -5843 -2306 1312 2219 2097 4305 7555 6603 161 -4469
3213 -4469 -6417 34 -174 -39 599 6867 6708 4203 347 -8069 -14855 -15654 -14359 -9860 -3399 -3786
3197 -3786 -1356 -7555 -3967 -288 -841 -552 -4331 -5837 204 -5042 -7967 -6304 1671 6991 2634
3182 2634 -5390 1094 4671 7451 6040 6365 2405 -3074 -3887 -6075 -4185 -515 -4197 -4040 -917 -1300
3166 -1300 5171 9724 1365 -6526 -10866 -5591 -1002 2698 9162 7630 6073 6040 6661 12742 7856 6670
3150 6670 313 -796 1034 -1691 -6909 -5331 43 8225 2084 1061 -3465 -3267 -2436 -5329 -3906
3135 -3906 1686 4121 -1142 -259 4328 7996 6680 2672 4497 1488 2052 3853 2085 -579 -1098 -7151
3119 -7151 -10736 -7419 -3743 596 3637 7538 5785 3318 2951 1389 -3834 -7110 -10752 -9965 5255
3104 5255 2442 -1716 1900 8581 15764 9683 -2168 -307 -3461 -3424 610 4227 9180 12616 11757
3089 11757 10746 11352 12580 11632 1514 2945 11004 1100 -12654 -16496 -14888 -9638 -12536 -15414 -12097
3074 -12097 -6760 -4340 -4584 -3466 316 3142 5171 4215 4965 4454 2100 1865 -271 492 -4089 -1070
3058 -1070 1943 324 -3364 -5660 -4661 -4053 -12151 -17375 -11452 308 8743 6507 7361 3686 5188
3043 5188 9278 6260 -2819 -1614 1102 -2037 -4064 -1869 -654 -2411 -1981 786 6375 7424 -446
3028 -446 -4437 -7673 -11981 -8245 -2589 -5410 -5174 -11273 -18926 -18315 -14170 -10911 -7631 -6509 -1563 -1111
3012 -1111 -1094 -7205 -14867 -9294 -9815 -11441 -7720 -5652 -9349 -15698 -6980 142 799 10006 10436 3812
2996 3812 3969 7028 10814 12031 12112 8415 1984 -4663 1125 9409 13799 15820 8835 5903 5664 3044
2980 3044 4265 11662 11043 5680 6232 3674 -302 -631 1338 5867 2730 4023 7344 2902 140 2127
2964 2127 -1217 -2259 2079 979 4838 11939 11014 11923 7797 -1406 -6106 -1651 -5151 3147 6880
2949 6880 -4125 -5634 4737 3658 3083 3432 3066 6210 2434 -5716 -7281 -3522 3513 4532 4700
2934 4700 6185 1436 2662 9073 5443 7361 7671 3974 734 496 2483 -637 124 132 5171 7988
2918 7988 7125 5393 4589 2666 -1091 -4424 -136 3284 6101 9466 594 -2465 4016 3506 710 1972
2902 1972 1861 1284 -5501 -6587 -1958 3877 4973 6439 8021 9093 12126 3628 -233 317 -2291 -3059
2886 -3059 -8342 -10606 -4505 -4963 -4370 787 4125 12060 8922 7856 13190 15602 14885 10427 1551 2873
2870 2873 8093 -2052 -1846 6961 11669 12117 5847 -918 -3667 -1836 316 1143 4679 6822 1441
2855 1441 -4098 -8161 -9143 -5328 -2511 -3363 -5477 -112 670 3562 3388 -1242 477 5733 7597 9028
2839 9028 -314 -5521 -5568 -103 5942 2578 -3344 3032 3556 6285 12656 9892 5962 2751 29 -8289
2823 -8289 -11810 -9274 -1660 4300 4874 2614 -2260 -2376 -1947 -398 -2274 -3847 -4379 -4828 -7085 -8513
2807 -8513 -1582 1837 -1789 -3744 -1163 2223 4514 12463 9097 6231 10522 12142 16632 16710 15369
2792 15369 12273 4624 4229 5216 11504 7605 -6466 -8191 -2908 4969 7902 3542 845 -791 -3233
2777 -3233 -2990 124 3868 4052 9211 11277 4465 2356 6504 10902 14108 7157 355 268 -3100 -8144
2761 -8144 -2074 2540 5731 -1479 -5017 -1466 3607 8490 8628 12220 18980 17263 4932 -5635 -7836
2746 -7836 -6802 -8436 -8550 -778 10842 10932 9813 11824 6975 5595 6671 6860 5468 -2783 -9713 -8851
2730 -8851 -8200 -8877 -9826 -11668 -13398 -8500 -8680 -704 4194 11271 13415 5006 17 3438 2844 2019
2714 2019 -3542 -3677 -4143 -6400 1570 3837 -4309 -3308 1475 7268 6893 4057 673 -3230 -87 -165
2698 -165 1412 -7855 -6685 -1431 -1145 -6010 -3082 4324 5686 8208 11756 18266 14022 4438 1712
2683 1712 -3062 -7231 -5664 118 3716 4005 4976 2393 3194 3232 2446 2487 2479 7403 3058 -6748 -9986 -5994
2665 -5994 -1956 -2516 1501 2600 -829 6958 5049 -792 -3869 -7563 -767 8207 7311 955 -4509
2650 -4509 -9677 -6919 -5113 944 6348 7768 52 -5055 -9484 -8053 -4160 1156 -1683 -1973 -5095
2635 -5095 -1297 -187 3948 9089 9265 8500 10566 8118 4862 5535 6522 -2999 -6844 -2782 -3542 -1349
2619 -1349 -58 780 3151 2556 106 -2649 -2036 2464 -3781 -3377 -2297 -3546 -2197 4147 15855 15108
2603 15108 8238 6922 4545 4395 8062 5229 -2513 -2847 -4449 -7863 -2795 -1187 -2313 1670 9950
2588 9950 8649 4849 3593 5186 3659 1107 1597 3085 8033 7159 1841 -1651 -7137 -8287 -2710
2573 -2710 7680 3357 2431 5751 4305 4275 179 -2002 1402 -2397 2154 9052 6590 -782 -4098
2558 -4098 -4082 -5507 -1174 -358 986 1512 -1280 -4784 -3438 -6405 -8589 -4269 -5581 -5862 229 4783
2542 4783 5919 3417 -4795 -6997 -1821 -4891 -9884 -16576 -16017 -7319 -7112 -5035 -5208 -3774 -3310 -5086
2526 -5086 -8057 -2597 260 -1665 1172 2382 3498 8007 3369 -3561 -6466 -7494 -13660 -10546 -9554
2511 -9554 -13917 -10217 -1884 300 -5773 -8591 -4287 -196 -103 -1569 -2354 1149 1555 1217 6366 7743
2495 7743 7468 156 -5441 -498 1880 4017 7701 441 -7417 -16174 -14737 -3862 6269 10555 10660
2480 10660 9336 8880 12918 8797 6470 3715 3990 -3609 -3948 -309 5563 5953 607 -1120 1217 -13
2464 -13 -4292 -4807 -5603 -6964 -10469 -10996 -9154 -5603 462 -76 -586 3986 3831 10340 12538 5489 -833
2447 -833 4237 5796 10249 9647 5973 3042 5258 7793 7606 5376 883 -1931 -789 2330 4771 7088
2431 7088 6589 3530 -1791 593 3284 1754 -439 -1786 3971 11660 14229 13599 4887 -173 -1513
2416 -1513 -5923 -12673 -8870 -2768 2309 -6160 -13718 -8813 -6667 -2570 8487 9942 13919 13698 11365
2401 11365 9426 8790 -46 -6052 -1421 -614 -1675 2808 3094 6902 12521 15034 13806 8758 845
2386 845 -5258 -11225 -6888 -3388 -6709 -6398 4439 4736 7433 7927 -1034 2124 10654 4633 962 787
2370 787 3353 2902 329 -1947 171 5647 8134 11015 9807 6493 2013 1509 10340 6985 1614 -352
2354 -352 -1032 -5473 -1192 1553 6632 7790 1221 -2770 -1379 529 -28 -1230 2001 6509 4635 -2678
2338 -2678 -4636 -4992 1305 5706 5572 3552 -273 -6120 -5955 -6217 -12270 -11237 -8209 -3650 -988 -4452
2322 -4452 -7580 -691 7295 7784 4859 4411 2014 3455 6525 6840 4176 4475 5131 1301 1905 9391
2306 9391 2854 -7671 -9354 -7769 -5747 -2515 -518 1280 2899 3245 5258 6317 10105 13297 4504
2291 4504 -2427 -4262 -5571 -6787 -6687 -109 4261 427 -2676 -809 2836 4078 2986 5421 462
2276 462 -9948 -17034 -16468 -14192 -8742 728 46 -804 8464 8331 8442 5740 242 -558 -5029 -2863
2260 -2863 2990 -2193 -5234 -4950 -8537 -3413 -2428 -2460 -5483 -4394 -2957 -2617 -4440 -594 4665 5274
2244 5274 6278 11729 12511 6144 1327 9462 5516 7186 6767 8249 9555 7456 6702 4626 78 2822
2228 2822 7497 6207 3174 1045 2513 9103 10547 10051 6664 5013 1677 -624 1653 3716 853
2213 853 -503 2634 -338 2556 4319 5499 4578 5380 162 -5923 -6627 178 4151 2758 -857 -9161
2197 -9161 -4141 10935 12767 12244 6762 7879 14690 16600 11430 8625 7015 7351 1768 -2813 2400
2182 2400 2242 9067 12964 11190 7064 2102 5300 7668 5679 1180 -3582 -5122 498 5699 7614
2167 7614 8135 3521 3441 4717 9196 7824 10396 10602 8619 4768 1523 6299 5960 2720 805 4804
2151 4804 7467 7435 5173 10437 12284 6613 10640 4931 -149 -447 -5647 -5704 -1246 9035 12803 3736
2135 3736 -7208 -3414 -858 -1835 908 620 1236 3521 -953 2365 6908 -2860 -9243 -8571 -2523 7696
2119 7696 9813 6775 6200 7671 11875 9931 4917 3453 1913 2726 4209 1954 -226 4352 2922
2104 2922 -486 5110 2145 2642 2025 -3535 -2832 -2345 717 1017 2263 4768 6821 1712 -2986 -3770
2088 -3770 -201 -3026 -11116 -8834 -5759 -2745 4054 8374 11104 12115 5137 -711 -610 4972 -268
2073 -268 -4276 -6822 -10268 -8085 195 -659 2416 6566 4829 8876 10466 7965 7124 170 -6505 -7758
2057 -7758 -8549 -5130 -1995 -135 -4697 3210 15256 14786 7586 1269 -450 1798 4653 9359 8637
2042 8637 8606 6319 1261 290 1687 -3809 -7226 -86 2820 1630 9222 10238 7042 3271 3815 1618
2026 1618 5124 4902 8914 13265 10340 10160 16133 14034 8446 14623 12091 6557 2042 804 -764
2011 -764 -2413 -1615 -566 11172 14142 15181 13752 11984 8594 3520 4936 5026 -3490 -11272 -6640 217
1995 217 -184 2632 7202 7677 14585 16340 17590 9846 4294 3497 9194 8169 2619 3747 782 -494
1979 -494 407 -5515 -3535 4876 5879 2564 114 815 6378 9187 8540 7038 -349 -272 -663 2160 4713
1962 4713 4666 8900 9867 10168 11210 12704 12056 10443 9568 1126 2508 3902 -4456 -6966 -1436 1251
1946 1251 -302 -266 1083 -5536 -2027 3863 2497 3232 9308 4419 -3316 -3680 -4466 1413 -1112 -9532
1930 -9532 -7070 -1589 2204 4489 5950 4934 7494 9895 5426 6174 1277 -3618 -4080 -3913 6034 10858
1914 10858 9588 5393 -2040 -3774 5401 8118 10390 9738 9184 10026 4049 4270 7732 9166 8707 7884
1898 7884 4303 67 3786 4990 6062 6140 5414 6209 8576 7584 1774 1514 805 -4078 -6005 -4400 2157
1881 2157 381 -2314 -2572 -5335 -3754 -2912 5902 5114 3212 -4886 -4925 858 1537 -558 1759 5681
1865 5681 3189 -5323 -6897 -1554 -4159 -8871 -10809 -8105 -7965 -2895 8086 7836 6839 4629 4575 12556
1849 12556 16110 7723 -265 395 4204 3649 3557 414 560 2827 6250 8281 7044 71 -5445 -5879
1833 -5879 -7788 -8148 -10665 -10962 -2858 5510 5685 6520 3839 3133 3044 -163 -18 2700 -4337 -3197 -137
1816 -137 2434 -2604 227 957 6580 1886 780 1155 7 -549 4993 12250 9568 3712 2661 926
1800 926 418 1010 5429 9498 7340 1260 2180 -2386 -144 1443 5559 7029 5543 7680 3781 1201
1784 1201 -910 -2583 479 1764 2729 -1556 -57 -1917 -3291 3188 11300 8668 5969 -508 -865
1769 -865 -4471 -8903 -8446 -2854 929 704 -6870 -4696 -2343 -96 -7397 -11519 -5775 -272 2047 9725
1753 9725 848 -1333 3140 8011 8522 3430 4442 7869 6769 2836 -682 -5213 -7498 -2800 -7237
1738 -7237 -12280 -14654 -7304 1213 2424 -1519 -2072 1258 2449 -1036 -6214 -811 4639 7167 7097 7771
1722 7771 5601 2606 1371 -775 -1284 -632 -2696 3948 10626 10087 14859 12543 3136 -809 -1332 3070
1706 3070 4102 5890 4751 8612 13362 8901 4500 3736 5178 5718 4466 4505 6965 11025 8999 5857
1690 5857 10643 7989 6180 5054 3235 433 -1300 -7617 -2952 942 2147 2176 10148 7973 -2856
1675 -2856 -6199 -5062 -9493 -10065 -7529 -4617 -3646 5301 7303 -171 -2165 -3474 -10027 -7937 -1131
1660 -1131 1567 1447 5893 11892 10121 11390 6528 -1796 -284 1713 2490 -4122 -6231 -6823 -2689 2653
1644 2653 6636 6792 4663 -874 -4517 -7674 -3475 -1712 3617 3023 3569 854 2067 5372 5910 8411
1628 8411 7146 4958 9020 7458 1639 -657 1922 2482 4877 -60 -2440 2832 -5003 -8552 -950
1613 -950 -3898 -3964 -2600 1395 2588 5091 4606 3905 5423 1216 -2079 1102 1637 7933 4405 -2489
1597 -2489 -4569 -4592 -1557 -760 -2861 200 -137 -12014 -8694 1966 6357 1484 2018 1419 -380 -1668
$$ [...]
##END NTUPLES=NMR SPECTRUM
##END=
