##TITLE=Analysis number 329742
Compound Code km 01364
Project Code adrs
Chemist Name stores
##JCAMPDX= 6.0         $$ Bruker NMR JCAMP-DX V2.0
##DATA TYPE= NMR SPECTRUM
##DATA CLASS= NTUPLES
##ORIGIN= Bruker BioSpin GmbH
##OWNER= nmr
$$ XWIN-NMR		Version 3.5
$$ Wed Sep 26 10:02:07 2007 GMT Daylight Time (UT+1h)  MAYBRIDGE\nmr@NMR_250MHZ
##.OBSERVE FREQUENCY= 250.131544655141
##.OBSERVE NUCLEUS= ^1H
##.ACQUISITION MODE= SIMULTANEOUS (DQD)
##.ACQUISITION SCHEME= undefined
##.AVERAGES= 16
##.DIGITISER RES= 18
##SPECTROMETER/DATA SYSTEM= dpx250
##.PULSE SEQUENCE= zg30
##.SOLVENT NAME= DMSO
##.SHIFT REFERENCE= (INTERNAL, DMSO, 0, 16.522)
##AUDIT TRAIL= $$ (NUMBER, WHEN, WHO, WHERE, WHAT)
$$ ##TITLE= Audit trail, XWIN-NMR		Version 3.5
$$ ##JCAMPDX= 5.01
$$ ##ORIGIN= Bruker BioSpin GmbH
$$ ##OWNER= nmr
$$ C:\u/data/dgb/nmr/ADRS/2360/pdata/1/auditp.txt
$$ ##AUDIT TRAIL=  $$ (NUMBER, WHEN, WHO, WHERE, WHAT)
(   1,<2007-09-26 10:01:45.01 +100>,<MAYBRIDGE\nmr>,<NMR_250MHZ>,
      <created by zg, POWCHK disabled, PULCHK disabled
       configuration hash MD5:
       76 6E 9A 78 1E 09 19 81 EC 84 63 8F B0 6A 59 2D
       data hash MD5: 64K
       5B 17 57 35 61 35 8C 62 F7 24 FE DF 6E A7 C5 E2>)
(   2,<2007-09-26 10:01:58.04 +100>,<MAYBRIDGE\nmr>,<NMR_250MHZ>,
      <Start of raw data processing
       ef LB = 0.3 FT_mod = 6 PKNL = 1 SI = 32K 
       data hash MD5: 32K
       C7 D6 B8 ED 2B 6B A8 4A 0F 5B CA 5F 46 79 52 40>)
(   3,<2007-09-26 10:02:00.21 +100>,<MAYBRIDGE\nmr>,<NMR_250MHZ>,
      <apk 
       data hash MD5: 32K
       E7 A1 92 B2 79 DC 8B 98 88 31 23 04 79 5C 64 A3>)
(   4,<2007-09-26 10:02:00.98 +100>,<MAYBRIDGE\nmr>,<NMR_250MHZ>,
      <abs ABSG = 5 
       data hash MD5: 32K
       06 8A 1E 73 AE 32 0D 57 53 CF 3F 7F F4 49 92 1D>)
$$ ##END=
$$ 
$$ hash MD5
$$ 81 3B 14 7A 90 1D 47 37 AA 93 9E 17 91 70 4F BC
##$RELAX= 
##$RELAX= 
##$RELAX= 
##$RELAX= 
##$RELAX= 
##$RELAX= 
##$RELAX= 
$$ Bruker specific parameters
$$ --------------------------
##$DU= <C:\u>
##$EXPNO= 2360
##$NAME= <ADRS>
##$PROCNO= 1
##$TYPE= <nmr>
##$USER= <dgb>
##$AMP= (0..31)
100 100 100 100 100 100 100 100 100 100 100 100 100 100 100 100 100 100 
100 100 100 100 100 100 100 100 100 100 100 100 100 100 
##$AQSEQ= 0
##$AQ_mod= 3
##$AUNM= <au_zg>
##$AUTOPOS= <38 >
##$BF1= 250.13
##$BF2= 250.13
##$BF3= 250.13
##$BF4= 250.13
##$BF5= 500.13
##$BF6= 500.13
##$BF7= 500.13
##$BF8= 500.13
##$BYTORDA= 1
##$CFDGTYP= 0
##$CFRGTYP= 5
##$CHEMSTR= <none>
##$CNST= (0..31)
1 1 145 1 1 1 1 1 1 1 1 1 1 1 1 1 1 1 1 1 1 1 1 1 1 1 1 1 1 1 1 1 
##$CPDPRG= <>
##$CPDPRG1= <>
##$CPDPRG2= <>
##$CPDPRG3= <>
##$CPDPRG4= <mlev>
##$CPDPRG5= <mlev>
##$CPDPRG6= <mlev>
##$CPDPRG7= <mlev>
##$CPDPRG8= <mlev>
##$CPDPRGB= <>
##$CPDPRGT= <>
##$D= (0..31)
0 1 0 0 0 0 0 0 0 0.06 0 0 0 0 0 0 0.0002 0 0 0 0 0 0 0 0 0 0 0 0 0 0 
0 
##$DATE= 1190797304
##$DBL= (0..7)
120 120 120 120 120 120 120 120 
##$DBP= (0..7)
150 150 150 150 150 150 150 150 
##$DBP07= 0
##$DBPNAM0= <>
##$DBPNAM1= <>
##$DBPNAM2= <>
##$DBPNAM3= <>
$$ [...]
##$SUBNAM7= <"">
##$SUBNAM8= <"">
##$SUBNAM9= <"">
##$SW= 20.6930455092707
##$SWIBOX= (0..15)
0 0 3 0 0 0 0 0 0 0 0 0 0 0 0 0 
##$SW_h= 5175.983436853
##$TD= 65536
##$TD0= 1
##$TE= 296.16
##$TE2= 300
##$TE3= 300
##$TEG= 300
##$TL= (0..7)
0 120 120 120 120 120 120 120 
##$TP= (0..7)
150 150 150 150 150 150 150 150 
##$TP07= 0
##$TPNAME0= <>
##$TPNAME1= <>
##$TPNAME2= <>
##$TPNAME3= <>
##$TPNAME4= <>
##$TPNAME5= <>
##$TPNAME6= <>
##$TPNAME7= <>
##$TPOAL= (0..7)
0.5 0.5 0.5 0.5 0.5 0.5 0.5 0.5 
##$TPOFFS= (0..7)
0 0 0 0 0 0 0 0 
##$TUNHIN= 0
##$TUNHOUT= 0
##$TUNXOUT= 0
##$USERA1= <user>
##$USERA2= <user>
##$USERA3= <user>
##$USERA4= <user>
##$USERA5= <user>
##$V9= 5
##$VALIST= <valist>
##$VCLIST= <CCCCCCCCCCCCCCC>
##$VD= 0
##$VDLIST= <DDDDDDDDDDDDDDD>
##$VPLIST= <PPPPPPPPPPPPPPP>
##$VTLIST= <TTTTTTTTTTTTTTT>
##$WBST= 1024
##$WBSW= 4
##$XGAIN= (0..3)
0 0 0 0 
##$XL= 0
##$YL= 0
##$YMAX_a= 231540
##$YMIN_a= -283774
##$ZGOPTNS= <>
##$ZL1= 120
##$ZL2= 120
##$ZL3= 120
##$ZL4= 120
##$ABSF1= 16.522
##$ABSF2= -4.171173
##$ABSG= 5
##$ABSL= 3
##$ALPHA= 0
##$AQORDER= 0
##$ASSFAC= 0
##$ASSFACI= 0
##$ASSFACX= 0
##$ASSWID= 0
##$AUNMP= <proc_1d>
##$AZFE= 0.1
##$AZFW= 0.1
##$BCFW= 0
##$BC_mod= 0
##$BYTORDP= 0
##$COROFFS= 0
##$CY= 12.5
##$DATMOD= 1
##$DC= 0
##$DFILT= <>
##$DTYPP= 0
##$F1P= 14.0000005364418
##$F2P= -0.99999901652339
##$FCOR= 0.5
##$FTSIZE= 32768
##$FT_mod= 6
##$GAMMA= 0
##$GB= 0
##$INTBC= 1
##$INTSCL= 1
##$ISEN= 128
##$LB= 0.3
##$LEV0= 0
##$LPBIN= 0
##$MAXI= 10000
##$MC2= 0
##$MEAN= 0
##$ME_mod= 0
##$MI= 0
##$NCOEF= 0
##$NC_proc= -3
##$NLEV= 6
##$NOISF1= 0
##$NOISF2= 0
##$NSP= 0
##$NTH_PI= 0
##$NZP= 0
##$OFFSET= 16.522
##$PC= 1
##$PHC0= 149.2417
##$PHC1= 9.826482
##$PH_mod= 1
##$PKNL= yes
##$PPARMOD= 0
##$PSCAL= 4
##$PSIGN= 0
##$REVERSE= no
##$SF= 250.13
##$SI= 32768
##$SIGF1= 0
##$SIGF2= 0
##$SINO= 400
##$SIOLD= 32768
##$SREGLST= <1H.DMSO>
##$SSB= 0
##$STSI= 32768
##$STSR= 0
##$SW_p= 5175.98343685301
##$SYMM= 0
##$S_DEV= 0
##$TDeff= 65536
##$TDoff= 0
##$TI= <Analysis number 999999
Compound Code 99
Book Reference 9
Project Code 9>
##$TILT= no
##$TM1= 0
##$TM2= 0
##$TOPLEV= 0
##$USERP1= <user>
##$USERP2= <user>
##$USERP3= <user>
##$USERP4= <user>
##$USERP5= <user>
##$WDW= 1
##$XDIM= 32768
##$YMAX_p= 310535053
##$YMIN_p= -190838
$$ End of Bruker specific parameters
$$ ---------------------------------
##NTUPLES= NMR SPECTRUM
##VAR_NAME=  FREQUENCY,     SPECTRUM/REAL,   SPECTRUM/IMAG
##SYMBOL=    X,             R,               I
##VAR_TYPE=  INDEPENDENT,   DEPENDENT,       DEPENDENT
##VAR_FORM=  AFFN,          ASDF,            ASDF
##VAR_DIM=   32768,         32768,           32768
##UNITS=     HZ,            ARBITRARY UNITS, ARBITRARY UNITS
##FACTOR=    0.157963299565203, 1,           1
##FIRST=     4132.6476996994, 0,             0
##LAST=      -1043.33573715361, 0,           0
##MIN=       -1043.33573715361, -190838,     0
##MAX=       4132.6476996994, 310535053,     0
$$ Real data points
##PAGE= N=1
##DATA TABLE= (X++(R..R)), XYDATA
$$ [...]
24708B7785l8296R284m125l9790p1358j2430O4144M6908l2447J6956K5660J2225
24696D516m8773m682j9394l020l3792j2849J48590Q3366r872k5563N566J3098
24684I7191n1016j4265K1701j6720k5724k6870j598N699p430J1882M3383K7598
24672F3831m6686l1957k6883j4677n89l8984Q480L5421j0889n422j5279N2776
24660c0858O2270p802m087J9822k9458P422L4040M0661k5571l8491n1463j5771
24648c9286L2058k4810K1527m386P261k9168k390q182L7938K3709j4457k3468
24636b3654l7576L1335O6225k206n9670j7788O4522l9247k7731m992P5787p94
24624B4211k947m7300j9001J4785K0841K2385j6982Q504M6022j4962k0910r334
$$ y = [27785, -10511, -1227, -5352, -45142, -116500, -128930, -64786, -17878, -50325, -33369, -7709, 4516, -44257, -48939, -68333, -71353, -105145, -117994, 30596, 113962, 104090, 78527, 84093, 97191, 46175, 31910, 53611, 36891, 11167, -15703, -17301, -11602, -19032, -7150, 36233, 63831, 17145, -14812, -41695, -56372, -56961, -95945, -87465, -52044, -62933, -68355, -83634, -30858, 31412, 23610, 19523, 39345, 9887, 17309, 51349, 92010, 66439, 27948, -23515, -39286, -7228, -32038, -10511, -14897, -7636, -36804, -39194, -47376, -9438, 14271, -186, -23654, -61230, -29895, 36330, 34124, -25546, -43334, 21188, -18059, -45790, -50782, 25005, 24211, 21264, -26036, -45037, -30252, -9411, 12974, -4008, 4496, 50518, 35556, 14646, 5312]
24612E312n7716L530J1992O0293J8443k0259l2067n2780j5985K6039L9942L2219
24600A8963J0135k297Q233O5191n7465p4361N564Q621k9812P393O541K6682k0894
24587b7506M250M083Q866K1776M875L5419J7944j9205K6457q0226m3781J7888
24575b9160M5457L6598J1135m6936j6099M9186M21j7790K3296K3441n1395k777
24563B5377J3757j5140k2923k4685M7783m0104j0468M5339L7505J1276k4169J5276
24551E8824m4887m7525m1408M101K7622M3240M1966o1046P463n1685l2906J6073
24539h0168K5344m8277L669j5526K7597O8524M0039k5940j3351L27J0991M860
24527a911J2654k2025l9443Q421N6225K5200k9050j7097m7358R95L8652l1132
$$ y = [5312, -52404, -48874, -36882, 23411, 41854, 21595, -10472, -63252, -79237, -53198, -13256, 18963, 29098, 26801, 35034, 100225, 42760, -31601, -26037, -17416, -47228, -39835, -33294, -6612, -27506, -23256, -19173, -10307, 11469, 16344, 51763, 69707, 50502, 76959, -3267, -47048, -29160, 16297, 52895, 64030, 17094, 995, 50181, 50602, 32812, 56108, 79549, 28154, 25377, 39134, 23994, 1071, -23614, 24169, -15935, -26403, 18936, 56441, 67717, 43548, 58824, 13937, -33588, -74996, -70895, -43273, -33, 41933, -19113, -11650, -63335, -96241, -80168, -54824, -103101, -99432, -114958, -87361, -18837, 21202, -4738, -18089, -17762, -6771, -1911, 10743, -11282, -50725, -42304, 13921, 39121, 10071, -7026, -54384, -53389, -14737, -45869]
24515d5869J4888K0345L379m290r60j8601j5437N1985j0542m5198m2355r680O640
24502i5695L8639L5396L1605q393k6951L068J9070M3003J4148j1079P247k324
24490D7734j9587p1502k1463M6900K9962k8571l459j4577N5426K2222j9360j912
24478B1813l1113M1829p504o8246P302L9792J7134M7138j8928k620n09J119m3543
24465C664N784J1360m2129J8564J2683N9037J9701p0937n3305L269K8034n889
24453a0164R065K2767o023l6098j2955j9611p795j7635J337M4540J1178J8724
24441b670L8709k2777j6164p870J608o465L2449Q464k8954J4884K8340l2922j8737
24428a2105J9116l3425j3768L1181O197k3833M3104j2359N779J6257J9249K3240
$$ y = [-45869, -30981, -10636, -7257, -11547, -12507, -31108, -46545, 5440, -5102, -50300, -92655, -102335, -95695, -57056, -21660, 9945, 1552, -25399, -22331, -3261, 39742, 53890, 42811, 50058, 47734, 28147, -43355, -64818, -17918, 12044, -16527, -19986, -34563, 20863, 43085, 23725, 21813, -9300, 32529, 25025, -43221, -35919, 3873, 21007, 68145, 49217, 46597, 46088, 47207, 3664, 9448, 20808, -21321, -2757, 9926, 68963, 88664, 17727, -35578, -32309, -4275, -10164, -1099, 21668, 15645, -20453, -33408, -53019, -60814, -78449, -77112, -32572, -21394, -2670, 36039, 13262, -2902, -10772, -9164, -15629, 16820, 25284, -3670, 11214, 39554, 6632, -12105, 7011, -26414, -40182, -9001, -2804, -26637, 16467, 4108, 9887, 26144, 45393, 68633]
24416F8633l2749n0378p956j0764K7799J543j7673m0422k6809K6099j3281l6097
24404a12055N1835L8457m113K3916J3349l2776l2167K4210l757l8880R527K2369
24392d0085K4746p19l8962J6332K0885O6513m3553k4724K673K0928k0233j7844
24380c4043p563k1440l1552k1933J0175M9236K7606q722K2299N377l2881k4386
24368f7827P492O5868M5624j9671l3339L3664L8013p083l7150l859K4399M397
24356E0528l3729n1739k823K7385M1779P056k876K0774m0725q587Q723k9965j6160
24343c0359J3577l6793J671J0470K5153K890P563q002J3263J7725k6578K4933
24331A5513k7592n2052K8780O8684J2766J4371k9661k7294j3892l641N677L8826
$$ y = [68633, 35884, -14494, -22450, -33214, -5415, -3872, -21545, -61967, -88776, -62677, -75958, -112055, -60220, -21763, -25876, -1960, 11389, -21387, -53554, -29344, -33101, -71981, -62454, -40085, -15339, -16058, -55020, -38688, -17803, 48710, 5157, -19567, -16894, 4034, -16199, -34043, -41606, -63046, -94598, -116531, -106356, -57120, -29514, -38236, -15937, -10560, -43441, -67827, -60335, 5533, 51157, 31486, -1853, 31811, 69824, 62741, 25591, 21732, 46131, 50528, 16799, -34940, -37763, -10378, 31401, 38457, 35581, 56355, 15630, 7043, 15766, -14199, -30359, -16782, -53575, -51904, -41434, -16281, -13391, -5828, -13830, -567, 17158, -9420, 15513, -12079, -64131, -35351, 33333, 46099, 60470, 30809, 3515, -10377, -14018, -8341, 30485]
24319C0485p017o487j4551P568k5677J720J6728M0202K2714j7297k2922m1352
24307a5886k2821p980n1688L2047N6796N8212O691m9940p063n318q498r631J5222
24294i857m114K9705L2783k0789K0756k052K91p781k9985j1170l1069K6506j941
24281h717L093j509j1598J6625K7693q670k0920j7307J276j0601l5335O861k8502
24268h7611J7179k8073j2529L7827P3937L0865K0264l8245o4972o610m124M5306
24256a6786J1614K0683q761j9688j5315l6081k3263L3811M0456N5373N3117m2443
24244E2717k4473j2309J6795O3623Q91k5459m0952m8340k09m335j1241J1135q004
24231c0161j3525N06m5361n44L4920k691m232k885L9427o141L6368J1596k2799
$$ y = [30485, 23468, 16981, 2430, 9998, -15679, -13959, 2769, 42971, 65685, 48388, 25466, -15886, -38707, -46687, -98375, -66328, -9532, 48680, 55371, 5431, -1632, -6950, -15448, -25079, -9857, -13971, 15734, 48517, 27728, 48484, 46432, 46723, 38942, 8957, -2213, -33282, -6776, -8717, -5624, -7133, -18731, -2106, 25587, 16917, -4003, -21310, -20034, -30635, -65970, -59109, -87611, -70432, -98505, -111034, -73207, 730, 31595, 51859, 13614, -51358, -57968, -62092, -16786, -5172, 15511, 6750, -12938, -28253, -64334, -87597, -53786, -13330, 42043, 95160, 52717, 28244, 15935, 32730, 96353, 97244, 71785, 30833, -17507, -17716, -22051, -33292, -22157, -30161, -43686, -43180, -88541, -89085, -54165, -56856, -61088, -63973, -24546, -30687, 5681, 17277, -5522]
24218e522J3521j4774j4959m732J52M868j5689j3277J4204P5185N5755k3920M607
24205G5419l1096p2637k2917L4650o123j9528N884M2618R757o1316o062l609L886
24192e1074J8601L6582K4976l8368j8162j278K7091j7769J9397p195P289j4338
24180a4248M71L2555q864j8456J1315K4367j1441r809r657J7418J892k9073M78
24167a3052K4637K8879k1872l0575n7818K7144k7851K7404j4609j0128o422r229
24155h3492P612l634K6079J591J3341M5764J9523n5644P8130N5354l6112n7999
24143A0513k9459k0279K4222l628j6036j8370j8343L9154L7317K7603j6672P312
24131B3334l137p473j4074j8962n6649j2028K0910O2577K5628o4964l7167j0835
$$ y = [-5522, 7999, -6775, -21734, -26466, -26314, -21446, -37135, -50412, -36208, 38977, 94732, 70812, 75419, 44323, -28314, -51231, -16581, -22704, -42232, -36348, 6270, 16027, -45289, -51351, -54960, -51074, -32473, 4109, 29085, -9283, -27445, -28723, -1632, -19401, -4, -7199, 90, -14248, -13777, 18778, 9914, -8542, 2773, 27140, 15699, 5890, -3767, 13651, 15543, -13530, -13052, 11585, 40464, 18592, -11983, -69801, -42657, -70508, -43104, -57713, -67841, -74263, -83492, -75880, -79514, -53435, -51844, -38503, 7261, 26784, -28860, 49270, 104624, 68512, 10513, -18946, -39225, -15003, -18631, -34667, -53037, -71380, -32226, 5091, 32694, 16022, 23334, 20197, 12724, -1350, -20312, -76961, -88989, -68079, -5502, 20126, -44838, -82005, -92840]
24119i2840J2007N0481l7063p580K4064J1658L8115K6931k9044R23k0849j0533
24107c3730J3551k765L3056K9577l8564l0165j8851j027J9852M583J9662k7892
24095c2713l922N991j7255q503M1486k603l756j6602J6598P409n5423M519j1856
24082g6630J7602Q1776j6835o603j9984p6289p985K3678O0429k6675N9585M7377
24070E9446k127j0822J507k6084j6196J6111k4659k6067k4714L4330K3332k246
24058A811J9584J7291q4l8230o3008m0443j3430L2968O8768L9197J9301L9812
24046H3537J5829k2108j7416o1797N50j2655M8N0786l592m8805L998L0871l228
24033A6018l2314j58o859N105R674M7683J6353j9504j5561L941k3154r023K9740
$$ y = [-92840, -80833, -30352, -67415, -74995, -50931, -39273, -1158, 25773, -3271, -2348, -23197, -33730, -20179, -22944, 10112, 39689, 1125, -29040, -47891, -48918, -29066, -24483, -4821, -32713, -36635, -30644, -47899, -56402, -14916, -17519, -21275, -37877, -21279, -13870, -69293, -64774, -76630, -59028, 22748, 5913, -690, -20674, -96963, -104948, -81270, -20841, -47516, 12069, 59446, 57319, 46497, 48004, 21920, 5724, 21835, -2824, -28891, -53605, -19275, 4057, 1811, 21395, 38686, 38602, 372, -62636, -103079, -116509, -83541, -14773, 24424, 43725, 83537, 99366, 77258, 59842, -1955, -1405, -14060, -14012, 36774, 33182, -15623, -11625, 19246, 16018, -16296, -16454, -23313, -18208, -8534, 39149, 55502, 35998, 20437, 24378, 1224, -7799, 21941]
24020B1941J7718k5045N585j2123m46J1019k9182k1780L7005N53l5047J063n304
24007c4043j309M119J8254o6304J6196K2930L2610J5496J5426n9969r246n5624
23995a01464J0676M7107M2597J1136J348L0859J8131m0812m0339J7814O0005J6807
23983G3865n3040l2036l1982J6926m2484j8733K3454L0488K6883P177N524K2525
23971B8567J8086J3647l4639n0089j8189M494k1626k7249L597O0778M0401P492
23959B5270L8233M5154j7328K4812J535k8064m5515k9235j8696j6102o197K700
23947b3433K732j0148l0216J0153L6364J7789j1506m7263r25j3098J6120k378
23935e5809n1730J1190N0746J3591L8445j6466k6332J1079k7869j9032M003O584
$$ y = [21941, 39659, 14614, 20199, 8076, 7630, 18649, -10533, -32313, 4692, 5245, -29802, -28739, -34043, -35352, -31233, -12979, -79283, -63087, -40157, -7547, 7949, 23375, -36594, -45840, -101464, -90788, -43681, -1084, 10052, 11400, 42259, 60390, 19578, -20761, -2947, 57058, 73865, 20825, -11211, -43193, -26267, -68751, -87484, -64030, -33542, -6659, 518, 6042, 28567, 46653, 60300, 25661, -24428, -42617, -38123, -59749, -86998, -83401, -22623, 17778, 25270, 63503, 108657, 91329, 116141, 117676, 89612, 44097, 14862, -3834, -19936, -26133, -23433, -20701, -30849, -61065, -50912, -14548, 3241, -8265, -55528, -56453, -69551, -53431, -55809, -107539, -96349, -45603, -32012, 6433, -10033, -36365, -25286, -53155, -72187, -68184, -61600]
23923f1600M0929L5018j4752O82m567r869l7638k9840O2856r022K4275q66L2493
23910B8099J8982k3454o0696o556N1235O771l9035m4254o441m566j8660l5146
23898a33721r172L9231N596K5008N1915M6324r069o577K6478Q359k1657k3752
23886a037l4386J8259m787j359M2278J8858K458m0599n3677J6013N9308K870n477
23873A8722j3848l0665k2987j0203R708L4604J7512K4871j7842l8786q001K511
23861c4404L191K5004N7936L4973N661m7659p4008m1853J5711L488J704R158K4198
23848a6900m496k2008j3214L8678M5643l3287j311j9541o06k679j3434R6K9957
23835a3102j0337k3172N0941N818J7087p152p458k8037P000O0142K4717n767l5446
$$ y = [-61600, -20671, 14347, -405, 277, -4290, -14159, -51797, -81637, -18781, -27803, -3528, -4394, 28099, 47081, 23627, -37069, -43625, 7610, 14381, -24654, -68908, -75349, -79915, -98575, -133721, -142893, -103662, -98066, -73058, -21143, 25181, 16112, 9535, 36013, 44372, 22715, -1037, -35423, -17164, -21951, -23310, 18968, 37826, 40284, -315, -53992, -37979, 21329, 24199, 18722, 4874, -25791, -48778, -58981, -49273, -14669, 2843, 27714, 9872, -28914, -36915, -34404, -31213, -6209, 51727, 86700, 92361, 44702, -29306, -71159, -55448, -51960, -50256, -41098, -16900, -21396, -43404, -56618, -17940, 27703, -5584, -6895, -26436, -27042, -29721, -43155, -43059, -13102, -23439, -46611, 4330, 10148, 27235, 20083, 12625, -15412, -8412, 51730, 76447, 70680, 35234]
23822C5234n3862J0734j7111J7555K177M27K2847K2124j3366J1570J452l3226
23810F555P1K65Q304j0049j7778k9198J8406j0179m0749m2800M7252P9434n629
23797C905n773L8614L3706k9669J4650j8058j8315j0770j7064l5500k7835L4229
23785c7880M3424l0543l4336M015L6295R528m566r80J1352J9264N384j5320k6129
23772b0492M5089p958L3002l9286l5076j1782M3354J8019j5586j6558l8666J5679
23760c0261o673k7414N3968J7049m4106l2319L577N9648n102K126k6614j0276
23748d6397o9k0825m154M1823L9807L4591J8033p855q5001N320K923k3470L9663
23735e611J4734J0887j0572J7733K163j0241n0778J2169P8k9966k8622K1712J6543
$$ y = [35234, -18628, -7894, -25005, -7450, -5273, -4846, 18001, 40125, 26759, 38329, 39781, 6555, 6626, 6891, 15195, 5146, -12632, -41830, -23424, -33603, -74352, -117152, -69900, 9534, 3905, -1868, 36746, 70452, 40783, 55433, 37375, 19060, 8290, -8774, -44274, -72109, -37880, 5544, -24999, -59335, -55320, -19025, -9497, -14063, -15043, -3691, 15573, 20957, 5637, -20492, 24597, 16639, 49641, 10355, -24721, -36503, 6851, 24870, 9284, -7274, -45940, -30261, -36934, -64348, -10380, 6669, -37437, -69756, -66179, -6531, -11633, -9507, -36121, -46397, -46466, -67291, -71445, -29622, 10185, 44776, 62809, 54954, -30047, -24727, -21804, -45274, -5611, 9123, 20010, 9438, 27171, 29334, 19093, -31685, -19516, -19438, -49404, -78026, -56314, -39771]
23722c9771P424J6925j9284l58j3871J4949M5609N0302J802l0725K1373K5580
23710G9955m4277p6110k871P0786k8630P64L8992k2185n540k4136m718J9725K6409
23697B8164l0781l0927j6790j0880j7228O7656M8961l1109m731j8871M485J4776
23685B725k250P461L1694J7325l4950K8095k8853m4313J1569J0733K1941m3116
23673b1939P4n772q70N157k820J8513N0078l6207l2765r654j1637J1673M3199
23660G030R418l0233j1351j0865N829K0603l4780l6399j0833J73q153N2370Q310
23647c8881k4070j2896L7186K5091k683m1463K1562N2780K4194J7016J1872J2507
23635H2215j3503l3551j7377o794n7515n6197l9985M7410M9737Q744J4558j5724
$$ y = [-39771, -32347, -15422, -34706, -35064, -48935, -33986, 11623, 61925, 63727, 33002, 54375, 79955, 35678, -40432, -43303, 27483, -1147, -383, 38609, 16424, 10884, -13252, -17970, 1755, 28164, -2617, -33544, -50334, -61214, -78442, -10786, 38175, 7066, 2335, -16536, -12051, 2725, 475, 7936, 39630, 56955, 22005, 50100, 21247, -23066, -11497, -764, 21177, -21939, -21865, -27637, -28507, -23350, -26170, -7657, 42421, 6214, -26551, -36205, -47842, -36169, 7030, 16448, -13785, -25136, -36001, -30172, -9569, -44349, -80748, -91581, -91408, -99561, -47191, -38881, -62951, -75847, -38661, -13570, -16253, -57716, -36154, 16626, 40820, 57836, 69708, 82215, 68712, 35161, 17784, 10990, -46525, -102722, -142707, -95297, -45560, -36816, -22258, -37982]
23623c7982k4219J0053R3249M3469j9743n4609j1357m042J4872J0957P404j0731
23611A7321J590J8427j6840m5463k0337R285j9282l661n787k3498R351M0016K4486
23598a4392J8301l759o505n6360J1868Q988j0361K3814J6748j9617o031m4261
23586h1567k7101n867q925K9590M4217K476K379K0O898j7652K2977N8968L188
23573B9601m0508m7032K8288m703J7161J2824K8065j0613j1490j9460j97j7831
23561c5895O6183J2746j8015k8673n3403j7456J8679J4606p617n767j0217j3421
23549g8250M9943M4891L6749n8360o6055j2525N7824N8533K7844n0141q762l4
23537A657l195J8029K9717k0627l2558j5425k1796l7634M0576l662l063N427p031
$$ y = [-37982, -62201, -52148, 41101, 84570, 64827, 10218, -1139, -5181, 9691, 20648, 28052, 17321, 18911, 37338, 20498, -24965, -45302, -36017, -55299, -58960, -64747, -88245, -78894, -38878, -14392, 3909, 150, -6355, -62715, -50847, -41859, -52220, -28406, -11658, -31275, -37306, -81567, -108668, -114535, -123460, -93870, -49653, -47177, -44798, -44778, -37880, -55532, -32555, 26413, 29601, -10907, -57939, -29651, -34354, -17193, -4369, 23696, 13083, 1593, -17867, -18064, -35895, 30288, 43034, 25019, -3654, -57057, -74513, -55834, -41228, -48845, -54612, -64829, -78250, -28307, 16584, 53333, -5027, -71082, -83607, -25783, 32750, 60594, 10453, 1691, 1657, -1538, 16491, 46208, 25581, -6977, -22402, -44198, -81832, -41256, -44918, -47981, -42554, -49585]
23524d9585k0210K9609L4768l2108k4940K4607R592k937K8280J770K1788O21n1190
23511b9935k9703M7130J9430J1435o470K364L760K5836J9980k1347j5359m840
23499B2281K042K9864O709r048k8651k5207j1451M3213N3088k7771r0540L7243
23487A772L7779l0173l5794M603r106p723j7783L1841M9699J3962K752k9578j2138
23474A13l0647j1752L990R592n5652j9107K5041O5059M7915n3757o6105N2279
23462c3031P0771L545k4624j3853k1942J7813j7777k4010O5201K3901j8446n9051
23450c1503j5337K8564m861J2274K1906N6136K3222m2717m5717k3740O7700K5819
23438G1746m0078k8745n9504R157J5677K7249O803R57p788k4452p071O0451K3481
$$ y = [-49585, -69795, -40186, -5418, -37526, -62466, -37859, -28267, -31204, -2924, -1154, 20634, 21255, -29935, -59638, -12508, 6922, 18357, 11887, 14251, 18011, 43847, 63827, 42480, 27121, 22281, 24323, 54187, 60896, 51848, 23197, -2010, -13461, 29752, 82840, 55069, -35471, 1772, 39551, 9378, -26416, -21813, -30919, -38642, -56425, -24584, 25115, 39077, 41829, 12251, 113, -30534, -42286, -38296, -28704, -84356, -103463, -78422, -13363, 34552, -19205, -85310, -33031, 37740, 41285, 16661, 2808, -19134, -1321, -19098, -43108, 22093, 45994, 27548, -31503, -46840, -18276, -23137, -10863, 11043, 67179, 90401, 47684, 1967, -21773, 45927, 71746, 31668, 2923, -56581, -47424, -31747, -4498, 2305, 3262, -4526, -28978, -36049, 24402, 47883]
23425D7883p836L3953p860k5837m5845k0674J9179j6851K2819M3462o163p389
23413B8841r069m9352l3640M028R341k2083n173J4522k6243l000J6636O2534k4834
23400c7492o486l5318L0057L5689J3864j4203K6877k5715k7839K669j5212L1147
23388b1962M343M3221K0361j2122n567l5469n5751N998J9790M6725r99r98J419
23375H989j4294M183k2387k2399M7518R914l1946N221k382N908k0672n3254q175
23362i3776L2581M3038K277q513J9345p984J2123N5398J7121l3432j0498j6156
23350A1524k6498M0152k823k7016j250R022k0142q47K682l6466L5243k690K2748
23337C639J1447J02J6596K5641n233k1254O479m3420l9731m9623J5037J6935M9097
$$ y = [47883, 40047, 74000, 66140, 40303, -5542, -26216, -7037, -23888, -1069, 42393, 36230, 28841, 19772, -29580, -63220, -59192, -49851, -71934, -77107, -62585, -88828, -91828, -75192, -12658, -37492, -43978, -79296, -49239, -13550, 314, -13889, 12988, -12727, -40566, -37897, -53109, -21962, -17619, 25602, 45963, 33841, 28274, -7195, -62946, -56948, -37158, 9567, 8568, 7570, 8989, -5305, -1122, -23509, -45908, 1610, 11524, -20422, -15201, -17583, -11675, -32347, -85601, -93776, -61195, -18157, -15880, -24393, -5048, -13032, -909, 54489, 71610, 38178, 27680, 11524, -14974, 25178, 22355, -4661, -5911, 3111, -17031, -17878, -15196, -51662, -16419, -19109, 3639, 15086, 15188, 31784, 57425, 52192, 30938, 37417, -6003, -45734, -95357, -80320, -63385, -14288]
23324a4288N917n1300K3500Q458K7025J7449j7009k9730j0505l1273J0296j1511
23312g2971L3238J0346n5183K9688N9288j2598L1247j8799K0677L4703j4905m4905
23300a74q296q75l7104j7721M2755J4864J9511Q224N649k8427k7917k1172P20
23287d9963K8854P3561N424K1191n1183o611L375j5491j3563j9122j9981J2653
23275c0856K7196l0540k2186o0032j903K6448j1151m75J7585K2710K6534L9285
23263B615m9648p541N996l6956J0654L8474J2666L5853l016O917j2361k5216Q4981
23250F3418k7968o0595j1587J5229O4227o828k6577n020j1446k0609R263O642
23238a1851p978J6619J8434j9232L0528m321l0246J7934M1275l3217p155k487
$$ y = [-14288, -8371, -59671, -36171, -27713, -688, 16761, -248, -29978, -40483, -71756, -61460, -72971, -39733, -29387, -84570, -54882, 4406, -8192, 23055, 4256, 24933, 59636, 44731, -174, -8470, -9345, -46449, -64170, -21415, -6551, 12960, 21184, 26833, -1594, -29511, -50683, -49963, -21109, 52452, 57876, 79067, 27884, 21273, 24648, 9157, -4406, -23528, -43509, -30856, -3660, -34200, -56386, -116418, -118321, -91873, -103024, -103499, -85914, -63204, -36670, 2615, -47033, -54574, -48578, -85534, -74880, -36406, -23740, 12113, 9097, 16014, 3653, -21563, 63418, 35450, -25145, -36732, -21503, 42724, 35896, 9319, 4299, -7147, -27756, -18493, -11851, -19829, -3210, 15224, -4008, 26520, 22199, -8047, 9887, 51162, 17945, 10790, 8303]
23226H303j6227M2224J3928M4153k1739m2879m1856l0446K8449M2959j6797n2341
23214d2269l0090q050J1157q04J6374J0849J0030m3445l3942M0610K8481r259
23202e0358N0192M0988k4905n4151R005r050J608O6450L7135l5275o5932n263
23190c9556J7253J4337J8727o2581m8395k634M61M221M1347K0806l8180J1390
23178f2804j6816K413L0088j4173k1469K1836N3823q427q876k0330J1699J0121
23166b2915K6649O811l6638n722j0785J0717N614r44P040K4801M2786l8378k1760
23153a2724J8974j4893k4252j3965j0754L1483n8018l9949R309M8019L95l9476
23141a05851N6296J2684J6462o4237r34M35M718J1223M8205L5807j7326l0235
$$ y = [8303, -7924, 34300, 48228, 92381, 70642, 27763, -14093, -44539, -16090, 26869, 10072, -42269, -72359, -80409, -69252, -70056, -53682, -42833, -32803, -76248, -110190, -69580, -41099, -50358, -166, 40822, 15917, -38234, -29229, -38279, -36671, 29779, 66914, 31639, -34293, -39556, -22303, -7966, 10761, -51820, -100215, -102849, -102388, -98167, -56820, -36014, -74194, -62804, -79620, -77207, -47119, -61292, -82761, -60925, -7102, -15529, -24405, -44735, -33036, -22915, 3734, 10545, -26093, -31815, -42600, -31883, -26269, -27213, -20173, 4628, 47414, 9036, -12724, 6250, -8643, -32895, -46860, -57614, -26131, -84149, -124098, -114789, -66770, -66375, -105851, -49555, -36871, -20409, -84646, -85580, -85145, -80427, -69204, -20999, 14808, -2518, -32753]
23129c2753O129k2393J1839L8814j5193l2881p505l533N533N2326P5308j5708
23117E9983n613j8512L0414K1935n9610n278J9574j1664L1133K3269P292j0453
23105H2470K8382j1077l6487k5285k9878n1504J6441M7902O092l1742j26332j4912
23093a45930P7298O6160K4297L42n2788J9385R211j1574k1948o3563j5868N8253
23081e6725j1749N85N8000J0272k9213L3773J09671M7508k1106k5751p1474m9513
23069e722k3246q331O632J3847k9016K8028M3570L4903l2685l2153N4215J2509
23057F2551p049n8897o1309r481L8545N8869M1009j913j2919j3143l5086R206
23045A0383p20o3952q928Q400L2196j1432K53L6001m3247j5332k2266l595K6432
$$ y = [-32753, -26624, -49017, -37178, 1636, -13557, -46438, -53943, -57476, -51943, 383, 75691, 59983, 54370, 35858, 66272, 88207, 28597, 23319, 42893, 31229, 62362, 85631, 92923, 82470, 110852, 99775, 63288, 38003, 8125, -43379, -26938, 20964, 27056, -4686, -131018, -145930, -68632, -2472, 21825, 22167, -30621, -11236, -2025, -13599, -35547, -99110, -114978, -56725, -68474, -67889, -9889, 383, -28830, 4943, 114614, 162122, 141016, 115265, 43791, -5722, -28968, -37299, -30667, -16820, -45836, -17808, 25762, 60665, 27980, -4173, 50042, 62551, 55502, -3395, -64704, -74185, -35640, 23229, 64238, 62325, 49406, 36263, 1177, 10383, 9663, -54289, -63217, -54817, -22621, -34053, -33800, 2201, -41046, -56378, -78644, -82239, -55807]
23032e5807q437J9997K81k6187J6347K2193J4527n748L843k3901M610M3889K4304
23019B9911j6584k5377k9716l1064k8990L8021N7258q174K1530j3914n4832R468
23007e2463J0708J9751R815J1096L1761j9752j6930k839K8356l4447r269M2738
22995A8525J4095n2209l5133K4894k8562L616K0375L2584j5424j4019j6475J6180
22983c1553M4013J0478k8956L313j4732k1039n6823l0223K5129M7231L832Q533
22971d0797k4779M9430K2052L449K3280k6341l3698j0761K9896M600L8433K6163
22959F0927L247J1530J4581j8015j3610j8326k0666k3436m3285N4511K6041p4215
22947d0716L886L5272K1366l0896o2428J3861J181K6130k860k6518n5202J9397
$$ y = [-55807, -64244, -44247, -43966, -70153, -53806, -31613, -17086, -22834, -18991, -42892, -38282, 5607, 29911, 13327, -12050, -41766, -72830, -101820, -63799, -6541, -14715, 6815, -7099, -61931, -52463, -41755, -22004, -12189, -1093, 30668, 10916, -6014, -8853, 19503, -14944, -24213, 18525, 32620, -19589, -54722, -29828, -58390, -54774, -34399, -1815, -17239, -31258, -47733, -31553, 12460, 22938, -6018, -2705, -17437, -38476, -95299, -125522, -100393, -53162, -49330, -40797, -65576, -16146, 5906, 9355, 32635, 6294, -27404, -38165, -8269, -3669, 34764, 60927, 64174, 75704, 90285, 72270, 58660, 40334, 19668, -3768, -47053, 7458, 33499, -40716, -36830, -1558, 19808, -11088, -73516, -59655, -58474, -32344, -35204, -61722, -116924, -97527]
22935i7527O9344K7956k9916l0457n271K7064k0010p171j375J0632M7938m5545
22923e4338j2286L2837j5475M265m1033j6694K705L9309K0506q151l6167j9007
22911a03529L5634O210j575L4320j3149j2049l572r099K7887K7399k0138K2396
22899i265K2702L867L193J5231k4454m0229p0117Q558M3926K4080p02m2861l0893
22886i6964J9854M667J2166k3613J6649Q556l9230k8758N887P604M298M148l5386
22873a40122N9741M9694j729n7754L971K0958p668R088L8186j2486k0224K7186
22861c1159Q0195N4068l0849r6898K2013Q546L6823r726l6889Q743p654j5106
22849a7893m8883l9544J1737K2510K4113j676J6950K6456J1070J9133J1444J5358
$$ y = [-97527, -28183, -227, -30143, -60600, -65871, -38807, -58817, -65988, -67363, -56731, -8793, -54338, -66624, -33787, -49262, -44997, -86030, -102724, -100019, -60710, -40204, -48355, -84522, -103529, -67895, -61685, -63260, -28940, -42089, -54138, -57710, -66809, -38922, -11523, -31661, -9265, 13437, 17304, 20497, 35728, 11274, -28955, -99072, -90514, -46588, -22508, -23210, -66071, -96964, -77110, -72443, -60277, -83890, -67241, -58685, -97915, -126673, -120786, -113182, -108884, -104736, -140122, -80381, -30687, -32416, -90170, -86199, -65241, -72909, -63821, -25635, -38121, -58345, -31159, 49036, 103104, 72255, -24643, -2630, 5916, 42739, 33013, -3876, 4867, -2787, -17893, -66776, -106320, -94583, -72073, -47960, -49636, -32686, -6230, 4840, 23973, 35417, 50775]
22837E0775K0198m1250n5147P23J0705n1279j6280J4568o460n648l9516J5939
22825a02672J9818k3210l6346L4552K4424P0086K6235J1248L4435l7670J2278
22814C3178O5416L4736o0745r1229j6070J8617R142l3445K84K8284j1409m1380
22802f4621K2010N8105r111m8558K3573J0922l6956M2410m3678J5013K0199K0728
22790A0036K8421k9004R955J2275j7933l9135l7339k1179M273N1066J7634m5114
22778e6044L8846K5189J853J1346k1228m1386L1037K224k0073r896M9620J11179
22766A22667j1731j3980l5904p7652n9807P365j1957j2025N7744J4453Q6335L358
22754F8866m7586n519o367k7669k9608m1816r969l3379Q863O1529N7754K4184
$$ y = [50775, 70973, 29723, -25424, -24701, -13996, -65275, -81555, -66987, -73447, -79095, -118611, -102672, -82854, -106064, -142410, -107858, -83434, -13348, 12887, 24135, 58570, 20900, 33178, 98594, 133330, 72585, -18644, -34714, -16097, -6955, -40400, -40116, -11832, -23241, -64621, -42611, 15494, 6383, -42175, -18602, -7680, -44636, -2226, -45904, -30891, -10692, 10036, 38457, 9453, 19408, 31683, 13750, -25385, -62724, -83903, -79630, -28564, -10930, -56044, -17198, 7991, 9844, 21190, -38, -41424, -10387, -8163, -28236, -38132, 11488, 122667, 110936, 96956, 61052, -16600, -76407, -69042, -80999, -93024, -35280, -20827, 65508, 68866, 21280, 15761, 9394, -18275, -47883, -89699, -99668, -133047, -124184, -62655, -4901, 19283]
22742A9283m0653j2781K0496L5879L6969j8239k3580j4786L5509j1970K1995j6699
22730C1423n2180j6684L0573j8249m1142j0224K1033J7599p322l4748M2998L0254
22718f669o170k2047N2790N0195o091o4189k9720M3791j2005K0117L5293N370
22706F0665j0700l1373m3616l9378K5077N113m1713R374O0430j5803j0564K634
22694b9854N4553o670p323N2648j7196p9681k6803K3060k6800K4060L607l4065
22682g0464%K6495J1664p2182J927M6181Q73l6702L2019K9654l3605l1144j6044
22669a11328K4079N3277o445o322L1718O0715l0588n7963k3714j8889L6400J4579
22657c4481J2792k0582j8747J2990o1266j5267o668L0274R3004K7660N3491j0377
$$ y = [19283, -21370, -34151, -13655, 22224, 59193, 40954, 17374, 2588, 38097, 26127, 48122, 31423, -20757, -37441, -6868, -25117, -66259, -76483, -55450, -37851, -45173, -79921, -36923, -6669, -12839, -34886, 17904, 68099, 62008, -2181, -31901, 11890, -115, 20002, 55295, 60665, 49965, 18592, -25024, -64402, -39325, -34212, -75925, -66551, -6121, -21924, -32488, -29854, 24699, 18029, 10706, 63354, 46158, -33523, -60326, -37266, -64066, -40006, -36399, -70464, -70464, -43969, -32305, -104487, -102560, -56379, -55506, -92208, -60189, -30535, -64140, -95284, -111328, -87249, -33972, -40417, -46739, -15021, 45694, 15106, -42857, -66571, -85460, -49060, -34481, -21689, -42271, -61018, -48028, -109294, -124561, -131229, -100955, -7951, 19709, 73200, 62823]
22645F2823m0753j5548N1485L0357K899K7684m943n0845k8885k1787l1326j9258
22633c8097L070o112k9445M2932M3515K47p415j2124R582O0159M4927j4307p611
22620H9321L3265k2660o4205n5412J0635j1762k6536j3534J5662K3763j0698j6965
22608d9126k7163j9412P673L8394L4388r698j5033J2867N9533l1014L411K4762
22596B9582m6096j8042k217l605L166l639l5728M8533Q9521k589j9604n8262l0387
22583d9367J8971K5193k8803k9148j8528k1935j5954O1053N0454J3724k6704r225
22571c0269j5783l1304L1531j689R312R619M568l5245K9367K1950M2254J2587
22559D6898j4379M477L296J7392m64p0791r7056K3298K9493M1562O3930j8705
$$ y = [62823, 22070, 6522, 58007, 88364, 91263, 118947, 114004, 63159, 34274, 12487, -18839, -38097, -35027, -41139, -70584, -27652, 15863, 16110, 8695, -3429, 6153, 66312, 111239, 96932, 89321, 122586, 99926, 35721, -19691, -9056, -20818, -47354, -60888, -45226, -21463, -32161, -49126, -76289, -95701, -88028, -49634, -15246, -24944, -39977, -27110, 32423, 1409, 4820, 29582, -16514, -34556, -36773, -40378, -37212, -40851, -76579, -28046, 61475, 58886, 39282, -18980, -49367, -30396, -5203, -34006, -63154, -81682, -103617, -119571, -58518, -8064, 5660, -21044, -30269, -46052, -77356, -45825, -47514, -38202, -28583, -24015, -59260, -29893, -7943, 34311, 46898, 32519, 36996, 40292, 57684, 57220, -13571, -110627, -87329, -57836, -16274, 47656, 28951]
22547B8951n2109m7376k2298L2863M8165J3238L791K0376j440L4536j3606l4260
22535A0831j0539n9095L1470M0330n6714n7045o0278J3820R9167Q772n1902L4687
22523e6496K7609L2081L6034n873n2964P575k9614k5069K7025k7557L3090j2085
22511d6244Q175L2837j3315j938J4187K6457j1094l3161k6211K0225J6478R8812
22499H5208l2954l4693N974J7654M1383j3253r894m727k0988K9571m1453o6678
22487d4850L470N1193k51k4569n6185j6600K5518K4718O5807L2365p891J2669
22475F5394J8203m0336k7369l3911L382K237J1470j6401L8637j3952k8411l4884
22463e5941j9900K3439L9117J5362k5915m7183l7442O109N3847j1302K3368L6455
$$ y = [28951, -23158, -70534, -92832, -59969, -11804, 1434, 5225, 25601, 24161, 58697, 45091, 10831, 292, -58803, -27333, 12997, -43717, -100762, -161040, -147220, -48053, -39281, -91183, -56496, -28887, 3194, 39228, 33355, -19609, -12034, -41648, -66717, -39692, -67249, -34159, -46244, -38069, -5232, -18547, -20485, -6298, 20159, 9065, -24096, -50307, -30082, -13604, 85208, 52254, 17561, 23535, 41189, 82572, 69319, 59425, 54698, 33710, 63281, 21828, -44850, -41380, 9813, 9562, -15007, -71192, -87792, -62274, -37556, 28251, 60616, 52725, 65394, 83597, 43261, 15892, -18019, -14637, -12400, -930, -17331, 21306, 7354, -21057, -55941, -75841, -52402, -13285, 2077, -23838, -71021, -108463, -102354, -48507, -59809, -36441, 14]
22451A4j2664o2281j1188P901M2727P6027L6410m5508j7710k1756k2925K3194
22439g759P8279j6135n1030J7639K0410j6689P979l2841k7737k3025m063R179
22427d5793L2384J249J5063M3681j0451l1470o7290L0485K2160L2938J5547P532
22415D6035n7456j3014M997L3835J2153L78L6973J402n6561k9827J9215l4923
22403c6793k8985J6790n880l6196m108N4153L731n835M2443m9311J0407L6302
22391c282k4950k0447K8604J0765j3067J602K5538J013j6060J8098n5898j1905
22379e9989N7191O9315k7774m071n2758l4843k6727k610k6267K5821M3377N4007
22367A4672K1769J3413k8576o3519J0219P476j3368m905o1815l276L3623O2874
$$ y = [14, -12650, -74931, -86119, -78218, -35491, 40536, 76946, 31438, 13728, -8028, -30953, -7759, 70520, 54385, 3355, 20994, 41404, 24715, 32694, -147, -27884, -50909, -54972, -45793, -13409, -12160, 2903, 46584, 36133, 4663, -62627, -32142, -9982, 22956, 38503, 46035, -11421, -24435, -19438, 14397, 26550, 26928, 63901, 65303, 8742, -21085, -1870, -36793, -65778, -48988, -54868, -91064, -95172, -41019, -37288, -43123, -680, -49991, -39584, -3282, -28232, -48679, -20075, -9310, -22377, -20775, 4763, 5776, -10284, 7814, -48084, -59989, -2798, 66517, 38743, 34672, -18086, -52929, -79656, -82266, -108533, -82712, -39335, 14672, 36441, 49854, 21278, -42241, -32022, -24546, -37914, -42819, -104634, -107910, -74287, -11413]
22355a1413O8034m558j3010n4317K0895o4200k8863L7689O744O164P6510M1508
22343H1183k0204n3663j1431j0659J0896L7798n1846l7875L0591k7731J464K897
22331d8580J6783K3924K418l1208j4429K8537J9356J3716r003l9414K8800L387
22319e713R366l6894M695L9961k588J6898j8998o8663l3039l06K3730R640K7063
22306c4848J1598O171J0362K8580L6287r535m2192k4256L8281O1159l1294n6285
22294e972K9260M5346k9673m3386L5288p255p114l7978O349O021P026j0284r4
22281a2466k8264K4702K3462l4135l3257m1435J3914K5379j3159M4207L9214N729
22269A3891j9015l7705l85L4500k0765l3422J9497m169M6857L4658j0485L207
$$ y = [-11413, 56621, 52063, 39053, -15264, 5631, -58569, -87432, -49743, -42999, -36835, 39675, 81183, 60979, 7316, -4115, -14774, -3878, 33920, -17926, -55801, -25210, -52941, -51477, -48580, -31797, -7873, -5455, -36663, -51092, -22555, -3199, 10517, 1514, -37900, -9100, -5713, 3653, -33241, -28546, 11415, 8827, 25725, 6727, -61936, -94975, -95281, -71551, -61911, -34848, -23250, -17079, -6717, 21863, 58150, 48615, 6423, -17833, 20448, 81607, 50313, -5972, 23288, 68634, 38961, -4425, 30863, 23608, 16494, -21484, -15135, -9114, -2088, -12372, -12466, -40730, -16028, 7434, -26701, -59958, -101393, -87479, -62100, -75259, -31052, 8162, 13891, -5124, -42829, -43214, -8714, -29479, -62901, -43404, -47573, -716, 33942, 23457, 26664]
22257B6664J1650n5790P399J0055n1944j3492L1856J2746L1680J7212p650O61
22245B1047J0090m3881j9965L2239J4558k022K0631L5060n3164k4109M7935L7624
22233G6043R024k5679k9738l876j9236m1994k5328M8196n250N273R623K1060j3830
22220D288k0041j2430P249M2252l7298r352N131n919Q18k252K7249j1781k6183
22207c8269k6467j5863L2806O0608M3051l9138M3197M3690m5088m9655m938M2012
22195D5946j624j1420k4355k0464j1851J5649p080j7470K489K1552J0448q588
22183f768j4479n600l5193J1203K274q290J3008J1233L5426j8104K2966K1141
22171B8817j101J611l0671m3442K3607M1901L2752k5064j1833J4336n6410m2250
$$ y = [26664, 38314, -17476, -10077, -22, -51966, -65458, -33602, -20856, 10824, 28036, 20386, 21047, 31137, -12744, -32709, -470, 14088, 12066, 32697, 67757, 14593, -9516, 38419, 76043, 85067, 59388, 29650, 25774, 6538, -35456, -60784, -12588, -17838, -12565, -2942, 18118, 4288, -15753, -28183, -20934, 21318, -15980, -25332, -20201, -26120, -25302, -27554, -305, -12086, -38269, -64736, -80599, -47793, 12815, 55866, 16728, 59925, 103615, 58527, 8872, 3934, 45946, 44322, 32902, 8547, -11917, -23768, -8119, -15199, -32669, -30180, -8628, 1820, -6768, -21247, -26847, -62040, -50837, -48563, -56853, -43845, -32612, 2814, -15290, 7676, 28817, 27716, 29327, -1344, -44786, -21179, 20722, 53474, 28410, 16577, 30913, -25497, -67747]
22159f7747K5799N3548l5827j4401L8293K5177M3751j8445k7411M0807L2660n3644
22147D2560q5588o7955M8955P0801N378j1157j1619q799M6382R606m831j2051
22135B1682k6523J2313l8653l2246l2134J008M7291L1216J673K0857m426k180
22123a22j288l4486m6519j7959N8542k1836m559J4530J556L6688J5854n1706M120
22110d7185L3153j131j4590L0458k4218K1380K766M6213j0217m3640K3663M0048
22098E6700k8832k3530k033J0798K086K224K5936k7671p2910l6932J9583J8131
22086e6450J4458p445K9946L1054j6497m8119O1127K1520j2173r35m6779L4j8164
22073d8423k3244J6229L0257J6403j1347q383l0884r424l3155M0086M9865L8272
$$ y = [-67747, -41948, 11600, -24227, -38628, -335, 24842, 68593, 50148, 22737, 63544, 96204, 42560, -43028, -110983, -62028, 8773, 14151, 2994, -8625, -17424, 28958, 38564, 33733, 21682, -4841, 7472, -31181, -63427, -95561, -94553, -47262, -16046, -14373, 6484, 2058, -122, -1410, -35896, -82415, -100374, -41832, -63668, -68227, -53697, -52141, -15453, 401, -51305, -47185, -14032, -15163, -29753, 705, -23513, -2133, 633, 46846, 36629, -7011, 16652, 56700, 27868, 4338, 2305, 13103, 15189, 17413, 43349, 15678, -57232, -94164, -74581, -56450, -41992, -49437, -19491, 11563, -4934, -53053, 8074, 29594, 17421, 16486, -30293, -30259, -48423, -71667, -55438, -25181, -8778, -20125, -28508, -59392, -68816, -101971, -61885, -12020, 26252]
22061B6252N961o0142j0320K6117k9103K9224k25k8702L1036l7374j497M1918
22049f855L1418j0020o066o4965k4600L3780n930L3205K8699P872n3763j8882
22037e6107m7745m7966L5223r768M952L3415P946J4510M0117K2471l3378K5740
22025a0590M1561O4644M538m3197l2272M450J2219n7674l5498L4162O916M039
22013f702K5794j6980K5939l7952K1381j7468j8411L4628r149Q650K5598l502
22001C1826m7666k4659k4556J5046L0070L8369K705k8899k1273k7264l5039L0234
21989f1106J111n0583j0487K6535L7415M565K6744K8892l3346j5694K215K1315
21977b2424l1044J6536N047j5276O514M8679J9878o4783q1375P0897J01079j7342
$$ y = [26252, 32213, -27929, -38249, -12132, -41235, -12011, -12236, -40938, -9902, -47276, -48773, -6855, 24563, 14543, 8477, -56488, -81088, -47308, -53238, -20033, 8666, 16538, -37225, -56107, -103852, -151818, -116595, -126363, -121411, -87996, -80050, -65540, -25423, -2952, -36330, -10590, 30971, 95615, 100153, 56956, 24684, 29134, 41353, -16321, -51819, -17657, -10741, -6702, 19092, 2112, 28051, -9901, 11480, -5988, -24399, 10229, 1080, 9730, 35328, 31826, -15840, -40499, -65055, -50009, -19939, 18430, 21135, -7764, -29037, -56301, -91340, -61106, -59995, -110578, -121065, -94530, -57115, -52550, -25806, 3086, -30260, -45954, -43739, -22424, -53468, -36932, -31885, -47161, -40647, 8032, 27910, -36873, -118248, -47351, 53728, 36386]
21965C6386m3115j1882J4379L6327J1197o5306k9496N4955L1141l5053j1467J4157
21953B223P7213j1497j7417N753l2232n2755j3882K8475m5239m5597p817n073
21941a17845K8014K3110k9213O396K7156l238N084q505M8872K6512j5897k5775
21929c5329l023J4815J3467Q60O256l881j2604j6465N005P723K9136j2939l3962
21916d0941R490j5467n4206N0301K9432J7651p607j2438K9421j1552K710P27m9193
21903e1672j8680m469j5638M738O5228l8083J0235N0567L7495j4652m661K1041
21891D1449j353k4145k3074J903M859J0721N751Q976j1646j5580J3294l0066l3232
21878e2143J4555Q8562N5295R439l1005k1130n1761l9352J5136L3559j7090j278
$$ y = [36386, -6729, -18611, -4232, 32095, 43292, -22014, -51510, 3445, 34586, -467, -11934, 2223, 79436, 67939, 50522, 56275, 24043, -28712, -42594, -14119, -59358, -104955, -112772, -117845, -89831, -66721, -95934, -89538, -62382, -65620, -60536, -69041, -20169, 6343, -9554, -35329, -38352, -23537, -10070, -9210, -2954, -6835, -19439, -35904, -30899, -23176, 5960, -6979, -40941, -31451, -46918, -101124, -50823, -21391, -3740, -11347, -23785, 5636, -5916, -3206, -2479, -51672, -70352, -74821, -90459, -85721, -20493, -58576, -48341, 2226, 39721, 25069, 20408, 41449, 40096, 15951, -7123, -5220, -361, 10360, 16111, 25087, 13441, -2139, 11155, -18911, -52143, -37588, 50974, 106269, 115708, 84703, 63573, 11812, -27540, -12404, 21155, 4065, 2787]
21866B787l2505J3679J8711p780n156m9332K1759m1561K5313J8796R552r652j3165
21853d8554j1313L1096J5072J1317N396J2242O459m3379o3188m3598M707J7779
21841a05964K4224K7919k332M0936k1806k6598l516J9845p960k3014J3824K8281
21829c6161J2539k897o884L6388J1294k9384j6887Q102m0764j207Q7814m227J8811
21816C6537o1118p510J8135o867J6785O946p981j3389l0188M3483P737P80J6029
21803A9379j7408l8549j8641k7656N693O1467J6090o630n842K9264M0155k5104
21791C2218J7631K9815M194m8251n2030n0363J3837J5281p66J6598j5203j1167
21779d8206M5905L071L935K207k1472j8833j5711o608q462K4701j0071L1952J0099
$$ y = [2787, -29718, -16039, 2672, -5108, -10264, -59596, -37837, -79398, -54085, -35289, -25737, -35389, -48554, -59867, -28771, -13699, -2382, 3014, 15256, 21715, -21664, -84852, -128450, -123743, -105964, -81740, -53821, -56153, -15217, -37023, -63621, -67137, -47292, -55252, -78266, -64442, -36161, -23622, -26519, -33403, 2985, 14279, -15105, -31992, -23890, -64654, -65861, 21953, 17726, 36537, -24581, -32091, -13956, -20823, -4038, 2908, -5073, -18462, -48650, -5167, 2570, 3350, 19379, 1971, -36578, -55219, -82875, -77182, -15715, 375, -6255, -12097, 17167, 57322, 32218, 49849, 79664, 83858, 35607, -16423, -66786, -52949, -37668, -38434, -21836, -37039, -48206, -2301, 770, 4705, 6912, -14560, -33393, -49104, -55712, -64174, -39473, -49544, -17592, -7493]
21766g493k9363J828K5379K4628m4048l630J6851K003J7390m1827k4309J9089
21754d3502J3415Q170j1180j8087J7200M7755j560J6045K1796j6905n992J8712
21742D5867n864j4319K6622k3756o5864J5716M0058k4757p166L0489j5376N021
21730F671p5567K5173J6853J7765J632J4681n338l8880n345L1513N6326L4452
21718G9936l757m8998j1994j9572Q621n896j1814j8332L0022J278J8444M0930
21706E8868r964n7908k5986J8820k8370q242K8688J8314J8773M8255m8920n1025
21694c8697O085N190j524k875j1167M2940L0075l9438k4121L6409j5920k7561
21682d0604N0917L0331m3757l8382j3696k0684j4846J0538O475n471m18l881j3624
$$ y = [-7493, -36856, -35028, -9649, 14979, -29069, -32699, -15848, -13845, 3545, -38282, -62591, -43502, -30087, -21917, -33097, -51184, -33984, 13771, 12211, 28256, 50052, 33147, 27155, 45867, 40003, 25684, 52306, 28550, -37314, -21598, 18460, -6297, -13463, 17026, 1650, 6671, -68896, -43723, -26870, -9105, -7473, 7208, 1870, -37010, -42355, -10842, 45484, 79936, 76179, 27181, 15187, -4385, 4236, -1660, -13474, -31806, -1784, -506, 17938, 58868, 48904, -9004, -34990, -16170, -44540, -52782, -24094, -5780, 12993, 61248, 12328, -38697, -32612, -27422, -28946, -31821, -42988, -48, 30027, -9411, -33532, 2877, -13043, -40604, 10313, 40644, -3113, -41495, -55191, -75875, -90721, -80183, -73708, -79179, -79597, -83478, -97102]
21669i7102p143K5082j4907J6572L0480M7057m3227j7728l086L1535J6980K018
21657a3469k2435N482M702J9936j5662r012L1797j769n9012l5796j4345M0795
21645f8788N5528L4884L456K0287l3517n948K1132n815q125J4047J7125n1597
21633g331k4670J1274j9859K8854K1699P392K5155j2956j1075q987K8218K8808
21621F6522j5526m0589M583O250j1682J987K0380l871J5818p839m6517k9941M4633
21608D208N3834l0377l5547n8942j227L4391j2442q715j2266L6413j2292j8608
21596f1570j4687K9541J6503m013k8301M6400l4430n0824j5334K7337O406l2388
21584a15360K3283M9037Q4196J9750k8481j5334M2534k8616m1413M0611K3434
$$ y = [-97102, -104245, -79163, -94070, -77498, -47018, 39, -43188, -60916, -64002, -32467, -15487, -13469, -35904, -30422, -25720, -5784, -21446, -30458, 1339, -430, -59442, -95238, -109583, -68788, -13260, 21624, 25080, 45367, 11850, 5902, 27034, 21219, 13094, 27141, 44266, -7331, -32001, -20727, -40586, -11732, 9967, 17359, 42514, 29558, 18483, 9496, 37714, 66522, 50996, 10407, 14990, 21240, 9558, 11545, 31925, 28054, 43872, 36033, -10484, -40425, 4208, 58042, 27665, -7882, -66824, -68051, -33660, -46102, -54817, -67083, -30670, -42962, -61570, -76257, -46716, -30213, -34226, -62527, -16127, -50557, -101381, -116715, -89378, -82972, -115360, -92077, -43040, 41156, 60906, 32425, 17091, 59625, 31009, -10404, 30207, 53641]
21573E3641l3994K8847Q513j0824k4782j0498m295M25k2437J2985j114L3042L1342
21560F0851j4030j6767o2721m2843K1681Q977m2795m046O0936L6726p673k0019
21548b1723k476J0752k4266j367K1773O706M9807M1089l1949m8259l2262L1571
21536f04j8948L3536o008L187k2400j2278l218q299m0148m16P0027L7199m6892
21523a5262k6707L1279K4145K9262l6761q0933J829O433L0265J1423J3990l9428
21511e0465M582L9371k2461k0017j0145l9320k548K7382K3586K2060M647k5258
21499d8586k6263O1341j2217p5247m9848K5671L5304O1277L4515J6137l1285j5524
21487b4725m3658R69M4034L2390K0253j1521m3465l7929R69K0570K9787L9054
$$ y = [53641, 19647, 48494, 57007, 46183, 21401, 10903, 6608, 7033, -15404, -2419, -3533, 29509, 60851, 46821, 30054, -32667, -75510, -53829, -44852, -87647, -91693, -30757, 5969, -1704, -21723, -24199, -13447, -37713, -39080, -17307, -10601, 39206, 80295, 48346, 87, -32175, -604, -19552, 13984, 7976, 11163, -11237, -23515, -26733, -35032, -75180, -75596, -5569, 31630, -15262, -41969, -10690, 13455, 42717, 5956, -74977, -73148, -66715, -36450, -25027, -11037, -50465, -45883, -6512, -28973, -48990, -59135, -98455, -101003, -73621, -50035, -27975, -23328, -48586, -74849, -13508, -25725, -100972, -150820, -125149, -89845, -28568, 5947, 22084, -9201, -24725, -68383, -67414, -23380, 9010, 29263, 17742, -25723, -63652, -62683, -42113, -12326, 26728]
21475B6728K0059k8807j7411L8860m0284l4103J7985K4005K3847J6162l7872n4556
21463d5387L0385k4702k88k267N843l1540M8021N4559J2396n2021j4355K7071
21451G715P956l8326K088P635K1374K0343K9884O266J0946n0751l8104J9730j048
21438E708l0l6788k2981M2433N3157m558k0249m8034l1807K3258K0842j5735J0529
21425b4255K36j9496k1156L6004L0665Q476k3185N1114j2119m5461L4235K1712
21413C6770l7565r4652k3638j6987K4348J8797M6101L2111K8362j5830r616O3663
21401E1864O8449o2488n5312P086r437j2809J5081L9226l2034q8041m4603L062
21389a19956N1136R4209j4886l1712j4435L0849j9849j2177L0905j7095j7603
$$ y = [26728, 46787, 17980, 569, 39429, -855, -34958, -16973, 7032, 30879, 47041, 9169, -45387, -15002, -39704, -39992, -42259, -36416, -67956, -19935, 34624, 47020, -5001, -19356, 7715, 15671, -22655, -20567, -12932, 8442, 28785, 58669, 64935, 75881, 25130, -12974, 6756, 5708, 5678, -31110, -54091, -11658, 41499, 36941, 16692, -31342, -63149, -39891, -19049, -34784, -24255, -24019, -43515, -64671, -28667, 1998, 10474, -12711, 38403, 26284, -19177, 15058, 36770, -795, -95447, -119085, -136072, -111724, -92927, -46826, -14715, 13647, -2183, -11799, 51864, 120313, 57825, 2513, 9599, 162, -12647, 2434, 41660, 9626, -78415, -123018, -119956, -68820, 25389, 10503, -21209, -35644, -4795, -24644, -36821, -5916, -23011, -40614]
21378d0614l0814k1719L9795M6727J6657j5785l2654J695L7466Q5396J2761k4108
21366G4803n5530k8313J0045k3172J7117l3775k8925L4425M9605J07k6326q8981
21354i8920j4571m388Q195L5415N3744p806p484l3201m9828O495L1873l3026J7932
21341i5570P7134j9372P84l403N5537J1581o0200N843L5898k249l2421l280m795
21328c4513l5757L711L1537M5378o676J2626l1167L488J4964k3060l8950k2060
21316h0479L0740O439L7045k2340K5392j3320l7154L6497R971J6910K1506J7620
21304D8827J9671n3962L405J830L0505r116m7145p2338k6940N5049J2742k9301
21292f6773K2970J8481P42J2155M0831j2092j2389j3671n719J8004K054p712m8091
$$ y = [-40614, -71428, -93147, -53352, -6625, 10032, -5753, -38407, -36712, 754, 86150, 98911, 74803, 19273, -9040, 1005, -22167, -5050, -38825, -67750, -33325, 16280, 16387, -9939, -98920, -113491, -117879, -109684, -74269, -20525, -28331, -35815, -69016, -118844, -112349, -80476, -113502, -95570, -18436, -37808, -37024, -40427, 15110, 26691, -33509, -27666, 8232, 5983, -26438, -29718, -34513, -70270, -66559, -35022, 10356, 3680, 16306, -14861, -11373, 3591, -19469, -58419, -80479, -49739, -43300, -6255, -28595, -3203, -16523, -53677, -17180, -7209, 9701, 31207, 48827, 68498, 14536, 17941, 19771, 50276, 41160, -5985, -78323, -105263, -50214, -37472, -66773, -43803, -25322, -24580, -12425, 28406, 16314, 3925, -9746, -15465, 2539, 4593, -3119, -51210]
21279e1210K8983O2229n4986m4660N2052k9830k9865l616k9785J1632N0194N6275
21267A7413K8888j8830K300j5660o165k5118m4849p789J057N9817P9682K4866
21255I5612l1637k9087q7006j3123L5614K3408j41n925n687M925K6529K2165m539
21242C1108m5286K5691K5614P407l5966l986l381K0915L3522M2964q754q6213
21230C635q301q930p089k4453k3324m4769K9170M3082L1452L1004j2929p464k6868
21217b5784k2154L7972J95K4498J2742O534j1336l5613n5819k4202J0239P7675
21205e053L2879M3755l9849r969P808J1087j6059n1571J5369L0739k3287J8415
21193A4264L2349J6260k5238j2389n329k672K1166J3977k0854l5976l1540J0474
$$ y = [-51210, -22227, 40002, -14984, -59644, -7592, -37422, -67287, -70903, -100688, -89056, -38862, 17413, 46301, 27471, 29771, 14111, 7946, -17172, -62021, -69810, -68753, -8936, 70746, 95612, 63975, 34888, -52118, -65241, -29627, -6219, -6360, -12285, -17972, -13047, 13482, 35647, 31108, -14178, 11513, 37127, 44534, 8568, 4582, 1201, 22116, 55638, 98602, 89848, 3635, -4666, -13596, -20685, -45138, -68462, -113231, -84061, -40979, -9527, 21477, 8548, 1084, -25784, -47938, -9966, -9771, 14727, 27469, 34003, 22667, -12946, -68765, -92967, -82728, -5053, 27826, 71581, 31732, 21763, 29571, 40658, 24599, -26972, -11603, 19136, -4151, 14264, 46613, 62873, 37635, 25246, 19917, 17245, 38411, 52388, 31534, -4442, -35982, -25508]
21181b5508p79M124P717L9674O696l7947l2265q222k910J7340L1442l4517j2460
21168d7615k0777K3487L8372j3626l7151P418J3519L6470J4970L795Q494l4523
21156g167j331K0648J8912n9p7820L3499K6166k5723m4737L7535O2088j0876l8611
21143g476J5398J3429J8186n5562n042R1573n293J40P209k1568k5679M3066r187
21130E9194m2452m0902j1721J0102p058m0039K0849L985J2479P713L0395K2869
21118B5414K4045n671J2099m0320l2124k731M445n856j651L1088O746Q824L496
21105B7804J9822o222n7295J2144K3946m496M0673K7409j7116l4513k3142j2230
21093c216L0778L1190k1623p197j3892k3991l3868j4392K3356j6040J0892K4165
$$ y = [-25508, -26287, -22163, -14446, 25228, 31924, -6023, -38288, -46510, -49420, -32080, -638, -35155, -47615, -68392, -44905, -6533, -20159, -57310, -49892, -36373, 97, 15067, 18862, 27356, -7167, -8498, 12150, 31062, 31003, -46817, -13318, 12848, -12875, -57612, -20077, 42011, 31135, -7476, 7922, 21351, 39537, -16025, -21067, 70506, 65213, 65353, 72562, 50994, 25315, 68381, 59194, 16742, -24160, -35881, -25779, -32837, -72876, -52027, -48042, -35563, -27850, 2545, 25414, 49459, 43788, 55887, 15567, -16557, -19288, -14843, -20699, -22350, 8738, 15484, 24308, 27804, 47626, 41404, -15891, -3747, 20199, 15703, 56376, 83785, 66669, 32156, 9014, -3216, 27562, 58752, 37129, 29932, 16040, -7951, -41819, -56211, -32855, -48895, -38003, -13838]
21081a3838M0513N5172q344j8539j395o432j2008j1909r518k327O85j9955q172
21068a6067J3385p202k318L4056j6951j5626J111m1034j4545L2935j6348M642
21056d3962K2509J8234J530k626k7660l480k983q913M5205M8015J3558m5132j3177
21043A118J6881j5779o233j7630m3200l5627O1640J0288j5412K9901j835K6847
21031A0959L3571m882j0514N095j0331k704J3777m0224K338N3279l1161n0639
21019c1436J5758j3563J0862M946j0355r213J5796j5156J8921j8008o1923R916
21007h3455L0683N0854l1628q704J5477Q830R029k516M054L3227K6223K9963J105
20994H3142m0257k1284J901n9958n4597K4079R349J5104K8525j4150k2568K2422
$$ y = [-13838, 26675, 81847, 73503, 54964, 53569, 47137, 35129, 23220, 13702, 11375, 12060, -7895, -16067, -2682, -9884, -12202, 21854, 4903, -10723, -9612, -50646, -65191, -32256, -48604, -43962, -21453, -3219, -1689, -4315, -31975, -35455, -38438, -47351, -2146, 45869, 59427, 14295, 1118, 17999, 2220, -4013, -21643, -64843, -100470, -38830, -28542, -43954, -14053, -15888, 10959, 44530, 39648, 29134, 34229, 23898, 21194, 34971, -5253, -2915, 50364, 19203, -31436, -15678, -29241, -18379, -13433, -23788, -33001, -17205, -32361, -13440, -31448, -93371, -83455, -52772, -1918, -33546, -42250, -26773, -17943, -8914, -11430, -7376, 25851, 52074, 82037, 83142, 42885, 21601, 23502, -36456, -91053, -66974, -57625, -42521, -13996, -28146, -50714, -28292]
20982b8292L1535k864k2092O7397J3679n4439q517r639n6475n901O1051K3850
20970I293j6103l7112N780o2833k5397N0363K7765J6768j1341J8243O766l4777
20958e2585k0472J4139j3888L5026K1177O26M9159M838N827L903j5522K0158n426
20945D6960Q472q466l6439m2073J4909K4250r403O203l4864j4096K7451K1597
20933D501k7698j733J7739M2682n840o0847p99J2546m1993L722J6363N0401J4564
20920B3608m2544k4411K0701O8l221O0800q212k6183j7323k4259l3121r16k4296
20907i9309N2677O605P340J2200K4911L5856N287j2934p533j780k2900P340l8432
20894c0672j8286L6091j6261k1290m6882j5329K2280l263J4085N2032K71k2904
$$ y = [-28292, 3243, 379, -21713, 45684, 59363, 4924, -3593, -13232, -69707, -75608, -14557, 9293, -6810, -43922, -38142, -100975, -126372, -76009, -48244, -31476, -42817, -24574, -17808, -52585, -73057, -58918, -72806, -37780, -16603, -15977, 33182, 38020, 43847, 47750, 32228, 52386, 46960, 55432, 46966, 10527, -31546, -16637, 7613, -1790, 4413, -30451, -44547, -17096, 4501, -23197, -24930, -7191, 35491, 29651, -31196, -31995, -19449, -61442, -57720, -41357, 9044, 23608, -18936, -43347, -22646, -22578, -25799, 35001, 26789, 606, -16717, -40976, -74097, -75013, -99309, -46632, -40027, -32687, -20487, 4424, 40280, 45567, 32633, 25100, 23320, 420, 7760, -30672, -48958, -12867, -29128, -50418, -97300, -112629, -90349, -93612, -79527, -27495, -27224, -50128]
20882e0128J6944N1480P812N2544K8668l7087K9330p711k2421k5531K6719l4968
20870C5651j5824k8585J1264J1150M6829m8836l8738Q380L7277K6639n6200N7632
20858D6639j2941k7845J2584M636j3037l950n021K96J9965K1760o06j5316R62
20845B8126J1131J7939R247k2735J3046k6556N506l46L4839K588j7962l2781j2136
20832I906K4158k2716l2132j6480J0932J9433r819q238L7566M7257l9591o9407
20820d9131J1483L381L2937L2490j7130k5452l3811k7825m618K215l226J1908
20808f6779j0986q560J9507q746O619N5393r486j5469q324k851M3287J3302n321
20795A586l0136l448K938k7249L2924j962Q467k4103k8582L1444M779p025j9114
$$ y = [-50128, -33184, 18296, 26108, 78652, 107320, 70233, 99563, 91852, 69431, 43900, 70619, 35651, 19827, -8758, 2506, 13656, 60485, 11649, -27089, -18709, 18568, 45207, -10993, 46639, 33698, 5853, 18437, 23073, 10036, 6086, 1065, 1361, 21326, 43086, 42480, 27164, 28126, 39257, 57196, 66443, 43708, 56754, 30198, 35704, 35358, 70197, 72785, 54823, 22042, 9906, 34064, 11348, -20784, -37264, -26332, -6899, -16718, -24956, 12610, 59867, 20276, -49131, -37648, -34267, -1330, 31160, 14030, -11422, -45233, -73058, -77676, -75461, -78687, -66779, -77765, -86325, -66818, -75564, -68945, -13552, -23038, -38507, -46831, -49682, -6395, 6907, 1586, -28550, -31998, -29060, -56309, -23385, -25347, -16880, -40983, -69565, -38121, -33342, -40367, -59481]
20782e9481r912k2034n355K2572q935M4276L624L4590N006m164p076l181k5984
20769c6054j9097j9988K2387O690j3215l1024J3678k4213L385N3798M5536k0092
20757a8209L5379L5459J5954K4134l0520n2192m9965k5378M2573L7046M162K4440
20745D2883k8374n4517n145l84J1679O065j3347L3913P52k826J498J0409l2110
20732b9504K854L9647K4684K8530J2404Q78L56N056l9633j9203L1412P555m5443
20719A9593j5646j3847L5103J678m9363n3255l558j4509N0291P6662j9734j4915
20707a500K597J2975j1872l7658N014O3905K4150j8032m4890K7685J4174l7728
20695a180q8516n6904P0971R7561N9308J4267K585k1948J80l006j3417p4563m2974
$$ y = [-59481, -69393, -91427, -96782, -74210, -83145, -38869, -35245, -655, 4351, 187, -6889, -10070, -36054, -55151, -75139, -52752, -46062, -59277, -90301, -76623, -100836, -97451, -43653, 1883, -18209, 17170, 52629, 68583, 92717, 62197, 10005, -39960, -65338, -22765, 14281, 18443, 42883, 14509, -40008, -45153, -45537, -33858, -27793, -41140, -7227, -6475, -9301, -7803, 2606, -29504, -26650, 12997, 37681, 66211, 78615, 79493, 79849, 84905, 45272, 26069, 57481, 65036, 19593, 3947, -9900, 25203, 26881, -22482, -75737, -79295, -93804, -43513, 33149, 13415, -1500, 1097, 14072, 2200, -35458, -30444, 33461, 57611, 39579, -5311, 22374, 36548, -1180, -89696, -146600, -75629, 21932, 81240, 95507, 98092, 76144, 76324, 73318, 59901, -14662, -57636]
20682e7636K1487Q586k3417J6036n7Q343k6643j1115j4036K2140M562L899l7574
20669h5425K7974l4659k0935J8739L3350O4792K7043j3830o953k5507m5184k6051
20657h6646J6755J2107K3727M1502K0372K4570k2803m248k6458j3418j5375M235
20645b5680J4480J7161o8245J448P069l0703l4125M5064K4290r532l0174l344
20633i2291j0334o720K8745L4489J5926J8279J6200l7270m2919J4554L0368O43
20621c0330J7250r827l4181j6990k7776N1065O7151k7855l7305J2623K5581N3310
20609D2716k17k979k0176l7794k8186K653J0979L6550J1982k4967k1789n4131
20597h5359k5157P3072M7002n157Q058J2866m5740r629O1919K8382l0197Q499
$$ y = [-57636, -36149, -27563, -50980, -34944, -35001, -26658, -53301, -64416, -78452, -56312, -51750, -47851, -85425, -57451, -92110, -113045, -94306, -60956, 3836, 30879, 17049, 10096, -15411, -60595, -86646, -69891, -57784, -34057, 7445, 27817, 52387, 29584, 25336, -1122, -14540, -29915, -25680, -11200, 5961, -62284, -60836, -53767, -84470, -118595, -73531, -49241, -58773, -88947, -92291, -102625, -109345, -80600, -46111, -30185, -11906, 4294, -32976, -75895, -61341, -30973, -30330, -13080, -22907, -57088, -74078, -101854, -50789, 16362, -11493, -48798, -36175, -10594, 42716, 42499, 39520, 19344, -18450, -46636, -43983, -33004, 3546, 15528, -9439, -31228, -85359, -110516, -37444, 9558, 4401, 12459, 25325, -20415, -30044, 31875, 60257, 30060, 38559]
20585C8559o2963l4980K275K4877K0056o199q453r250j0626m1994K721J4947j0019
20572h1049K5211J6219k119N7012k6575M0463m1229j7499j8555M2067Q840J7610
20560B0396L3963p211k3201j6398l1868m539J5330r350k7276m4843L862N5129
20548c6006j872J8436K1226L9647L3273o00n4489j4923K738M1750J5770l6493
20536B8457o6979n62n984K6240k1073N026K4839m1302J5773K4468J0215J141j2153
20523a1894J1021K4094J7484k0917k1980k0318m3045m6211m8690L572N6207L0800
20511f9877M493O8105R7221K7447m8652n0719n4070m3413M907L4683R544O212
20499a4119M2595j7021m5901j2638j4467K3832j783M885M8986M9202l226o0930
$$ y = [38559, -24404, -59384, -57109, -32232, -12176, -18375, -26828, -36078, -46704, -88698, -85977, -71030, -81049, -55838, -39619, -41738, 15274, -11301, 29162, -12067, -29566, -48121, -6054, 2786, 20396, 54359, 47148, 23947, 7549, -24319, -28858, -13528, -22878, -50154, -94997, -91135, -36006, -37878, -19442, 1784, 41431, 74704, 74104, 19615, 4692, 7430, 49180, 64950, 28457, -38522, -39084, -45068, -18828, -39901, -34875, -10036, -51338, -35565, -11097, -882, 259, -11894, -873, 23221, 40705, 19788, -2192, -22510, -65555, -111766, -160456, -156884, -100677, -69877, -65384, 2721, 99942, 127389, 78737, 28018, -26052, -69465, -64558, -29875, -20331, -14119, 28476, 11455, -34446, -47084, -61551, -37719, -39502, -34617, 14369, 63571, 60345, -585]
20487e85m0342j8302R149r119K2045l1093j2442J3502p850N6893O4034K6295L6392
20474A08577k6477K7267k6413p1618j707J3149m2375J7481K6492n2959p244K3900
20462a1927M1232o1273l3548K8946J0659M517K0895k2443J8588K5722j5087j6298
20450a0017l535K2647r96p602K0949J2299j5927k581K7038n747o0060P952M1094
20437B5514J9401k2166k2886l9924P771r768k9077k8811N3758O434K4836J5576
20425F58n8495m8901J8758L6074L1524j444J3489n116K1361j725k7607j404R1792
20412F8964j2234Q562J2042n1214j5223n742j9230j8842m2280J8669q553k9308
20400i4389L5477K9321j5010J9454j0941l481K226K7306N0264L0579j4291j1132
$$ y = [-585, -40927, -59229, -50080, -59199, -37154, -68247, -80689, -67187, -75037, -18144, 45890, 72185, 108577, 82100, 109367, 82954, 11336, 9629, 22778, -19597, -2116, 24376, -28583, -35827, -11927, 29305, -31968, -65516, -36570, -25911, -21394, -499, -22942, -4354, 21368, 6281, -10017, -13552, 9095, 8099, 497, 21446, 33745, 17818, 15237, 42275, 36528, -23532, -15580, 25514, 44915, 22749, -137, -40061, -32290, -42058, -71135, -99946, -46188, -39754, -14918, 658, -57837, -106738, -87980, -51906, -20382, -21826, -8337, -13453, 7908, 6183, -21424, -22828, 68964, 56730, 65292, 77334, 26120, 10897, 5155, -14075, -32917, -75197, -56528, -65081, -94389, -58912, -29591, -44601, -25147, -36088, -39569, -37343, -10037, 40227, 70806, 56515, 45383]
20388D5383n5813l884K8410K6702o2524n5507j7563N883M6338p884j7549k3037
20376i1045r079n4880N4370N2630K9917m8557n2973k8374K9599J9478L0574l871
20364g2211K450M3729K0948l115M845J7155l4746l6750K2157J0083M4399J5981
20352C4925K3745k8735j3143j6638r615J7006l1262j3315m1255j7995M6098P945
20340d2239j1033l30M190k0809K0719r16K6797k9098j3230J0142M1726K0737j9264
20327a2608L1212K4534L1025j2844n5330j1784n978K043K2431L2909j4606K3013
20315E4017j090n8940J1006k6800l4569L1028K6938k1604n331N9968J233m5396
20303i540K179M8846l2096m7568j4154j4817l021M9831R659J8506k1722j7646
$$ y = [45383, -10430, -14314, 14096, 40798, -21726, -77233, -94796, -88913, -42575, -50459, -68008, -91045, -100124, -155004, -100634, -48004, -18087, -66644, -119617, -147991, -118392, -98914, -68340, -72211, -69761, -26032, -5084, -8199, -3354, 13801, -20945, -57695, -35538, -25455, 18944, 34925, 58670, 29935, 16792, 154, -9461, 7545, -23717, -37032, -78287, -96282, -50184, -42239, -53272, -53602, -49412, -70221, -49502, -50418, -23621, -52719, -65949, -55807, -14081, 6656, -12608, 18604, 43138, 74163, 61319, 5989, -5795, -11773, -9730, 12701, 45610, 31004, 54017, 52927, -6013, 4993, -21807, -56376, -25348, 1590, -20014, -25345, 34623, 35856, -9540, -7361, 41485, 9389, -38179, -52333, -67150, -70171, -20340, -10681, 7825, -13897, -31543]
20291c1543r446Q882M0257j8309K1980j5520m0805l949p16K4919J5986M4058O9019
20278A04813L321m262l2298o1925j027L2252m1898J8530N0099o3116l4279j1943
20266d1733N28o313l2431L0656O9157N0984k2521n2925M011J174k6076j3819l989
20253d3297l0598m793R278L0688K8243j1721m2701K6035R880J0643l3403l04P461
20240d4589P992O171N2926M8634j1181k9588m2080k1150J6554J0840M949o2084
20228f2606j7165J2445k7747J9787J5695L1056K3866k6257j1881k2178J353K7944
20216c5688J3185J4823j2380k7626K4619M80m028J7130r284J8231J0087J140J4398
20203B5087k6993n0040J05K5890O3335j1986k6689P76m0688q693M2572j3543n5057
$$ y = [-31543, -40989, -32107, 8150, -10159, 11821, -3699, -44504, -48453, -49169, -24250, -8264, 35794, 104813, 108134, 103872, 71574, 9649, 8622, 40874, -1024, 17506, 67605, 4489, -29790, -41733, -41205, -47518, -79949, -49293, 19864, 70848, 48327, -4598, -587, 587, -25489, -39308, -43297, -73895, -78688, -69410, -38722, -10479, -22200, -64901, -38866, -28986, -18343, -51746, -52050, -44589, -36597, -30426, 22500, 71134, 59953, 30365, -11715, -32865, -16311, -5471, -522, -62606, -79771, -67326, -95073, -75286, -59591, -28535, -4669, -30926, -42807, -64985, -63632, -35688, -22503, -7680, -20060, -47686, -23067, -22587, -26615, -9485, -18769, -538, 9549, 10689, 25087, -1906, -51946, -51841, -25951, 37384, 25398, -1291, -515, -41203, -49896, -7324, -20867, -75924]
20190g5924K3202J0195K961K98j213j457J502j1171j7792L571K5939J3637K6673
20177D21J5488O804j8196L196J2718p154m3213m6766M326N5728K8554J4216n0395
20164b4273n488L0434j1981P011j0585J1553j9871P955K6046j6311n124j8922
20152b9556K8285j9363m2456j6778k489M3501P6897K4332j3353k5635j7027o0602
20140e4244k9021o615Q7683M258m1149l7530M9426K2999k1917P534R277j231L0643
20127B0113M1163q326o0997l0100J940j3044j3926k0089j8995R502L1294J0166
20115e1299J5888n627j3164R18J9369k954m2671m1792N9677J04533J3963l2431
20103B4410p5600o404L8591r945o0812J7932K8706K7909Q376L1879k0877R280
$$ y = [-75924, -52722, -42527, -39566, -39268, -40481, -41938, -40436, -51607, -69399, -65828, -39889, -26252, 421, 15909, 22713, 4517, 7713, 20431, 13277, -29936, -76702, -72376, -16648, 11906, 26122, -24273, -29761, 673, -11308, -4297, -14882, -3329, -23200, -15245, 10801, -5510, -10634, -29556, -1271, -20634, -63090, -79868, -82357, -38856, 38041, 62373, 49020, 23385, 6358, -54244, -83265, -89880, -2197, 2061, -39088, -76618, -27192, -4193, -26110, -18576, -9299, -10530, 20113, 61276, 52950, -8047, -38147, -36207, -49251, -63177, -83266, -102261, -92759, -61465, -51299, -35411, -41038, -54202, -53284, -33915, -36869, -79540, -121332, -61655, 42878, 56841, 24410, -51190, -57594, -19003, -28948, -89760, -71828, -43122, -15213, -6837, 25042, 4165, 13445]
20091A3445L2283m7964j3930J991r96K2523J4881r8129n3586J2557M0162o172
20079h2935l0566J5567L8572j0888q677J7543Q821M9690N7966J5139n8568m2706
20067c1042j9317K0406j8465m2408o9102q815L0476M8869K3019J630j4575j2131
20055i1455K0054l97k6489J4842o848J2798O1083K4827j7966o847J9423J8075
20043B1100m0997m5380K2604O8983m3445p2863l9424J0960K6413K3805j098j0837
20031h0179j4215K7437N7047J7046k6724L5700m126R550j9425p5146l3556N7921
20019d8670N0092N508J3502K035k224l725J2711Q0661K1303k0509n4951n1090
20007D643j596j7950k1764k174Q725J9225k1093l5993l938K3341N0194L867j2782
$$ y = [13445, 45728, -2236, -16166, -14175, -15171, 7352, 22233, -75896, -129482, -116925, -76763, -82935, -113501, -97934, -59362, -70250, -78927, -61384, -52563, -2873, 55093, 70232, 11664, -31042, -50359, -29953, -48418, -90826, -159928, -168743, -138267, -89398, -66379, -64749, -79324, -91455, -71401, -71798, -98287, -83445, -90293, -77495, -16412, 8415, -9551, -16398, 3025, 21100, -19897, -65277, -42673, 26310, -17135, -89998, -129422, -118462, -92049, -68244, -69342, -80179, -94394, -66957, -9910, 7136, -19588, 16112, 11986, 21536, 2111, -73035, -106591, -48670, 1422, 6930, 20432, 22467, 20243, 16518, 29229, 109890, 131193, 110684, 55733, 4643, 3047, -14903, -36667, -38841, -30116, -10891, -31984, -67977, -71915, -48574, 1620, 5487, -7295]
19994g295L1418k0651l5776o690k49P815J2758k7153K8971M1593m1244m8464j9571
19981h4538O0195k1342l8507K8837K7639K609l6813j4296J3695j4356K2430K6192
19969b8255J1526K2408P975j5116r74j8327p888j9277k6706N5019j2057k4614
19957e6286R541L7412L5373K1103L4238o1803m4025r088n0766j9977O1153N2373
19945I248J3221L0127l409l5285j7402k7025j0267L6336R704n401O03l6550K327
19932c3773p435L8757J5959p368L519l3479K194P035o5072j8595J5843O3723k1084
19919c9776n2755J5320q306J5663M2035J2196j6313l0847k2591k1772Q496j1421
19907a10071J5662K8789O6534m0000m1508O4966O666k5993J3369L3791j2661j0137
$$ y = [-7295, 24123, 3472, -32304, -38994, -39243, -31428, -18670, -45823, -16852, 24741, -16503, -64967, -84538, -24343, -45685, -84192, -55355, -27716, -25107, -61920, -76216, -62521, -76877, -54447, -28255, -16729, 5679, 13654, -1462, -2436, -20763, -28651, -47928, -74634, -19615, -31672, -56286, -46745, -9333, 26040, 47143, 81381, 19578, -24447, -33535, -84301, -104278, -43125, 9248, 22469, 52596, 49187, 13902, -3500, -30525, -40792, -4456, 5248, -153, 450, -36100, -33773, -41208, -2451, 13508, 6140, 9659, -23820, -21626, -14591, -79663, -98258, -82415, -18692, -39776, -92531, -77211, -85517, -69854, -27819, -15623, -31936, -62783, -85374, -107146, -98650, -110071, -94409, -65620, 914, -39086, -80594, -15628, -8962, -34955, -21586, 12205, -456, -10593]
19895a0593l1886k2363k0965K0776K5751j3340j5488Q0757J04754m711l4914k4120
19883E3658l1456n348K1404n3331K463J0386j7729p999Q593m3186K9922M3526
19871A0903M027P397l911l1515j4757K1029k2865k0184l6677m330M5969K8859
19859a6055j198Q181L7529P778j3917K7439M0326N696l8494k2295l2149m5245
19847d2404J7155K4305K4272J1836n9045M1J0343J9463k3880m0374N699K3940
19835b8649J0110K6284K039q1860l9376O676P7929N9645p197m3165j809L8655
19823A9282p001j061l284N267k5545l0207m418L324k2266l6866L354J3694M8682
19810c7045M3663j3379M309o098K4476M1318m6164k0883J1733K3805M0196N67
$$ y = [-10593, -42479, -64842, -85807, -65031, -39280, -52620, -68108, 12649, 117403, 112692, 77778, 53658, 22202, 16854, 38258, -15073, -12610, -2224, -19953, -27952, -19359, -62545, -32623, 10903, 14930, 22327, 18416, -13099, -27856, -6827, -29692, -49876, -86553, -90883, -44914, -16055, -17253, -9072, 28457, 36235, 22318, 49757, 90083, 95779, 57285, 34990, 2841, -42404, -25249, -944, 23328, 35164, -23881, -23840, -13497, 5966, -17914, -58288, -52589, -28649, -18539, 7745, 9784, -72076, -111452, -104776, -26847, 32798, 25601, -17564, -19373, 19282, 12281, 11220, 7936, 13203, -12342, -42549, -46967, -43643, -65909, -102775, -99421, -85727, -37045, 6618, -6761, -2452, -8550, 15926, 57244, 11080, -9803, 1930, 25735, 65931, 66498]
19798F6498j010N425o3685o5480q193K2966J8950r345J1403l2577j2450M7195
19786b0303N4664l2506K7520L714r775j0416l219N07Q59J6511l851O985R812j6748
19772B3754l8489M0534K2893j2887j5610l6108J4079M4769k6559l8116j7353j8976
19760e8069R988m016N1792K549l5862O0059K4716q0927l5108J6193J5609j7387
19748e0463k8492p3925M1610N7898n557m8201j8740K8983K6325L610K2588J7600
19736b6764p441M049Q643P310k5356j6722q150R104l9522q489L254j3975L0590
19723h3469K8024M9478M9553J721O405k055O649J8112l0754m3354M4815l6005
19711I120k9751L5109K7481q911m2189o456J2857j0493p160M1869K3374p763n580
$$ y = [66498, 65488, 70913, 7228, -58252, -66445, -43479, -24529, -33874, -22471, -55048, -67498, -20303, 34361, 1855, 29375, 33089, 23314, 12898, 9679, 10186, 11045, 27556, 23705, 30690, 40502, 23754, -14735, 25799, 48692, 35805, 20195, -15913, -1834, 42935, 16376, -21740, -39093, -58069, -48081, -52097, -305, 2244, -33618, 26441, 51157, -29770, -64878, -48685, -33076, -50463, -78955, -152880, -111270, -53372, -58929, -107130, -125870, -96887, -70562, -66952, -44364, -26764, -34205, -30156, -21513, -14203, -39559, -56281, -64431, -55327, -94849, -103338, -100084, -114059, -83469, -55445, -5967, 43586, 45307, 51712, 49657, 56306, 74418, 43664, 310, 45125, 9120, -20631, 14478, 41959, 33048, -9141, -15597, -2740, -13233, -20393, 21476, 44850, 37087, 31507]
19698C1507k2288l7647p589P233j331J0415m6441k8882M0707P6675L1760j7467
19686C6652j7938r607j5640o4530l4910K5108P5497K7558n8217J0241L0596J0632
19674A5442n392K4847k324m5799K9318N9756Q636k1752L5817K0706j4476n0986
19662E3793j7282K3402Q635j2660m5277j7658k422R834n3737j7692j8796M323
19650h5537R994J4070K0516l4387n4026P8297R3693j7746j7229l6959J5012K5382
19638A1080k7607o166L1778l609m0468R869R109m2322j6850j9382J5229O2008
19626a7331L444n831N7370o869p962Q60J1173K0272j0980j0742k4220J7132n246
19613B1070k9248j2739n5365J1788O5560K1493K7462o319l3425j9549p519m580
$$ y = [31507, 9219, -28428, -36017, -28784, -30115, -19700, -66141, -95023, -54316, 22359, 54119, 36652, 18714, 9107, -6533, -71063, -105973, -80865, -5368, 22190, -36027, -25786, 4810, 15442, 10050, 34897, 32573, -13226, 16092, 75848, 84484, 62732, 98549, 119255, 104779, 53793, 36511, 59913, 68548, 55888, 10611, -7047, -9469, 365, -53372, -71064, -89860, -85537, -75543, -61473, -40957, -75344, -129370, -51073, 42620, 24874, 7645, -29314, -14302, 11080, -16527, -22693, 9085, 5476, -34992, -25123, -16014, -58336, -75186, -94568, -79339, -17331, -13887, -19718, 37652, 30783, 22821, 23681, 34854, 55126, 44146, 33404, 9184, 26316, 21070, -8178, -20917, -76282, -64494, 1066, 22559, 50021, 43702, 10277, -9272, -16791, -21371]
19601b1371L429n3738J1651P3780k2869L3168J0261k7114K410J0430M8465o6191
19589B311j4579N2223k1222m1373L209J1757l876K5570L853q82m5122o8035l6707
19576a32873N5820R0929J058j3538j1407j9287L9610J806l3711j9920P324L0678
19564c511R793k0666n546J0644k0795j863O93k0266J3054M3317K477M7066J2312
19551F6709k3152O2347q236q3715k3537L4391J6096N791o531m5842N3121M5183
19539I2625p020Q360k0986m2076j8323r646J9734Q5838J02708K7149J03540P5107
19527D17010J32489J43100K00802K68340K01563J42576l1027k35574k60942k18064
19517G60273j86310j30062j36250j09066m1221M1519K877l5250l4678p8777n4236
$$ y = [-21371, -17942, -71680, -60029, 13751, -9118, 24050, 34311, 7197, 9607, 20037, 68502, 2311, -12268, 39955, 18733, -22640, -19431, -7674, -11550, 14020, 17873, 16991, -28131, -96166, -132873, -77053, 13876, 14934, 1396, -10011, -29298, 10312, 12118, -21593, -41513, -34189, -3511, 6282, -14384, -19930, -9286, -30081, -31944, -31251, -51517, -38463, 4854, 7331, 54397, 66709, 43557, 105904, 97668, 13953, -9584, 24807, 40903, 46694, 40163, -5679, 47442, 92625, 85605, 93965, 72979, 30903, 12580, 2934, 22668, 108506, 211214, 238363, 341903, 417010, 549499, 692599, 893401, 1161741, 1363304, 1505880, 1474853, 1239279, 978337, 760273, 573963, 443901, 307651, 198585, 157364, 198883, 201760, 166510, 131832, 53055, -1181]
19506a181j3644J9440P161L913j6044K3596M0264k7108q2168K8322L8836p444
19494A3943m0461k0896L6125J6442J4730l55j2846M225K5406J0374Q678J4180
19482F9545m2965m9942n2118j5392o20j5220M7083O3360l117m2294p933j947j6812
19469f8372L1705l102J7916J7879K3047K1041J6114K1980m9375o775j5160j0694
19457c796J0522n0114J1534J8295O975K2608J6392N0404j7515n5587o7019k6776
19445h4077m0633K7073L5176K7392J0837m20J9739l5134k5125O5193O93L1445
19433C2159j1169J254j6184l3263k6616M075K2141P841L8907J0354K2723k3985
19421B8237j0185l4440J3426N5914O2695n7558l4621j92L805L2283j0963j094
$$ y = [-1181, -14825, 4615, 11776, 15689, -355, 23241, 63505, 36397, -45771, -17449, 21387, 13943, -26518, -47414, -11289, 5153, 19883, 19528, 6682, 10907, 36313, 46687, 55365, 69545, 26580, -23362, -75480, -90872, -91492, -106712, -59629, 3731, 614, -41680, -49613, -51560, -68372, -36667, -39769, -21853, -3974, 19073, 40114, 56228, 78208, 28833, 22058, 6898, -3796, 6726, -43388, -31854, -13559, -6584, 16024, 32416, 82820, 65305, 9718, -57301, -84077, -124710, -97637, -62461, -35069, -24232, -24652, -4913, -40047, -65172, 21, 714, 32159, 20990, 22244, 6060, -27203, -53819, -49744, -27603, -19762, 19145, 29499, 52222, 28237, 18052, -16388, -2962, 52952, 115647, 58089, 23468, 23276, 27081, 59364, 48401, 47307]
19409D7307M867n7391o1072N316L6413k2212l7338K1530M0350J05J1524O8439
19397E7838L3234J1512L881o5904q407N735k4326k0270j5952N650n747j4894L1747
19384e903J2216l7383K1021N8276K516p3538m4591K6585M3496J6686p859m2929
19372c1407l90P655M2690j6749j4727J8563m0662R030O0228P211q213P639o866
19359C4002J2780m4115L207K5908N077l4713j5530N1452K5553r549Q717k1481
19347D1308n9543K66k1802n703N5704K9378K4152j5602o3606K0097K653Q23J6960
19334B5085j6235p483L9027P15J5794m5792j8726J8893J4129L1668J2743m625
19322F5193p914J7315n4054m8867L0709J604o3350K3023Q013j3489N9700K3574
$$ y = [47307, 52174, -5217, -66289, -60973, -24560, -46772, -84110, -62580, -22230, -22125, -10601, 57838, 91072, 102584, 106465, 40561, 32154, 37889, 13563, -6707, -22659, -17009, -22756, -37650, -5903, 6313, -31070, -10049, 48227, 50743, -22795, -67386, -40801, 2695, 19381, 11522, -31407, -31797, -24142, 18548, 1799, -12928, 5635, -35027, -25997, 34231, 41442, 33229, 40868, 34002, 46782, 2667, 5874, 31782, 36859, 2146, -13384, 38068, 63621, 54072, 62789, 41308, -18235, -17969, -39771, -45474, 10230, 39608, 63760, 48158, -15448, 4649, 7302, 8125, 25085, 8850, 1367, 40394, 41109, 56903, 11111, -7615, 11278, 25407, 57075, 69818, 65193, 57279, 74594, 20540, -28327, 2382, 3986, -59364, -36341, -28328, -41817, 17883, 41457]
19310D1457J3777Q96K772k1653k6249m7954j3883K6822O5513J2231j2425K3740
19298F5044J677k7806l7550k3671n2712n329O4959O0076K3503k2214L3887o9847
19286A0017j2498N8377R550l0634l3160j3432R922j8951k9735n47K5497N3199
19274B7605n9750P703K5608J9520k4240R402J6872O5363O2426o773n0460l7444
19262E5832k9352l9234n3662l1357P0069L2139j1024j0324N481k8688K6710K7651
19250A4241m6839n2802j2860L5450L8183O5079N0392n0494m2391J6943k297J9567
19238C2172J2085L183P071n547K1974j7284k6774n6888q150k2830P496J2323O7121
19225B5952M749k2908m1409k6114K7427M6380M03p917O417M4368L2793n1773p6539
$$ y = [41457, 55234, 56130, 58902, 37249, 11000, -36954, -50837, -24015, 41498, 53729, 41304, 65044, 66721, 38915, 1365, -22306, -75018, -80347, -15388, 44688, 68191, 45977, 79864, 10017, -2481, 55896, 65446, 34812, 1652, -11780, -1858, -20809, -50544, -51091, -25594, 27605, -32145, -24442, 1166, 20686, -3554, 5848, 22720, 88083, 150509, 143736, 93276, 55832, 26480, -12754, -66416, -97773, -27704, 4435, -6589, -16913, -11432, -40120, -13410, 14241, -32598, -85400, -98260, -62810, -24627, 40452, 90844, 40350, -2041, 14902, 12605, 32172, 44257, 47440, 54511, 48964, 70938, 53654, 26880, -30008, -38158, -60988, -53492, -41169, 25952, 30701, 7793, -33616, -59730, -32303, 14077, 14480, 6563, 12980, 57348, 90141, 38368, -38171]
19212c8171K2662L781M4226J677k0198k7086j9042K3778j5298k9436K960M8679
19200a468R544l20j0552K1863J5417K9069J5710j0527n6498k4562L2753L263k3848
19187a56k4415m2571O2669k018p099J4810k4052r266j3066N001M6860L5493j2856
19174B9334k7481j7057n476k200j0306M0194M1507m8325r8026m0757L6845N3337
19162d8411L4082J646K2034k7773J717j0219P412K7115J6595j2417l2410j7609
19150c8238J3307K6274l9932j0565M7589O2267M2470n3514k0764r463J6885L1042
19138F7358J9064N449j4345m7972k0243K0321M211K2020j1242k8633o987L0937
19126C9938J7564J8073m229Q981P082l4881K9206m7390m6370L9628J0916k3116
$$ y = [-38171, -15509, -11728, 32498, 34175, 13977, -13109, -32151, -8373, -23671, -53107, -50147, -1468, 8076, 7756, -2796, 19067, 34484, 63553, 79263, 68736, 12238, -12324, 20429, 23692, -156, -24571, -67142, -4473, -6491, -13590, 1220, -22832, -32098, -45164, -40163, 6697, 42190, 29334, 1853, -15204, -20680, -22880, -33186, 7008, 48515, 190, -97836, -138593, -101748, -48411, -14329, -12683, 9351, -18422, -16705, -26924, -19512, 7603, 24198, 11781, -20629, -38238, -24931, 1343, -38589, -49154, -1565, 60702, 103172, 49658, 28894, 19431, 36316, 67358, 86422, 91871, 77526, 29554, 9311, 29632, 33843, 55863, 44621, 15988, 9001, 39938, 57502, 75575, 71346, 80327, 87409, 52528, 81734, 34344, -12026, 27602, 38518, 15402]
19114A5402l5122L3893L5189J9354l0780L3517Q0881j368p4194n8068O806O07
19102B6117o449M9673Q2680Q9764O2839J5436q3201o8124l1825K4364m1983n8557
19090F0734R231K7098l1869K022j1439K0802J8086j2605L6830J6970k7513O292
19078A14639N4615J8176J5603J5747j1491m4425l8440l5707l963l3089O795M3601
19066A02061J2212p835n8264n7399k0143L7314M3587j8459k8734M9107l0304K6162
19054D9305J4538k4658J5222j856k1264L5467J6448K2281o884l1244K0090j9212
19042F8233J7822N0848j2770m0735n3755M307k7140j3045M8132K2357k753l1783
19030B9718q945o168p1336N460P1709O2085L6981j2626k2853n2523M6761P437
$$ y = [15402, -19720, 14173, 49362, 68716, 37936, 71453, 152334, 150966, 76772, 18704, 25510, 26117, 19668, 69341, 152021, 241785, 304624, 320060, 236859, 168735, 136910, 161274, 119291, 60734, 69965, 97063, 65194, 67216, 55777, 76579, 94665, 82060, 118890, 135860, 108347, 114639, 169254, 187430, 203033, 218780, 207289, 162864, 124424, 88717, 84754, 51665, 58460, 102061, 114273, 106438, 48174, -9225, -29368, 7946, 51533, 33074, 4340, 53447, 23143, 49305, 63843, 39185, 54407, 52551, 31287, 66754, 83202, 105483, 98599, 67355, 87445, 68233, 86055, 136903, 124133, 83398, 29643, 33950, 6810, -6235, 41897, 64254, 61501, 29718, 20773, 14605, -56731, -51271, 20438, 82523, 119504, 106878, 84025, 31502, 78263, 85700]
19018H5700L9069M4307L4346m3609K960l8062j2098j1333j2584o287j7249J5803
19006H0963k9178p827M8306J4955k8842O128J0991J3274j0036M2610N3524M6643
18994B41511j1031j2180n5645K1604O1493k491m838k9255l8156n4399p1118o650
18982C8845L3001J4453m21l8207L3231L0874o645m2993J1139j8102K3869J3903
18970I2947N3302P2374L7950k764J6166l4521m737J1970M1993N3364l8665k3609
18958B75770n249M1548Q9m6793j0782m8980k400p484k7392K1219N6883K9487N0368
18945C26284L1156j1012P588L9665m9047l7107L2119K4135J6343L2249M9522M481
18933D66376j2414n2726m4857P2542J12824P0137N8362Q4636Q3795K6855R497
$$ y = [85700, 124769, 169076, 203422, 159813, 162773, 124711, 112613, 101280, 88696, 82409, 65160, 80963, 51785, 43958, 92264, 107219, 78377, 84505, 95496, 108770, 98734, 141344, 194868, 241511, 230480, 218300, 162655, 184259, 245752, 243261, 238423, 209168, 171012, 116613, 45495, 38845, 71846, 86299, 85878, 47671, 80902, 111776, 105131, 62138, 73277, 55175, 79044, 92947, 146249, 218623, 256573, 253809, 269975, 235454, 230717, 242687, 284680, 338044, 299379, 275770, 270521, 312069, 312158, 265365, 254583, 205603, 203203, 195719, 168327, 189546, 246429, 275916, 326284, 357440, 346428, 354016, 393681, 344634, 307527, 339646, 363781, 380124, 412373, 461895, 466376, 453962, 401236, 356379, 428921, 541745, 611882, 670244, 754880, 838675, 865530, 875027]
18922H75027J8204m4619r8454o312l5783o7266m2708j6508k6626q053l8447K7073
18910E35528K6284L4079O5213M3116K9067M402J5052O0630P2243N5716J8990J4271
18898I74591L3878N6395K6283L8136O5339M2171N563O438P6272J07546J45564
18887A578176P1975M6063Q9151J38046K25630K54073K75322M08633N96886O59387
18877D343342P49496P92454O44702N41404K49657j71636l89872l74211j93130
18868F192206j49J44319K71670M11661N48269P18768Q57774R73571J210970J500810
18858A2829869J843486K379642L045932L880645N139039O904018R417924J3335520
18850E8776075J8817633K6080564L5539727M6735027N5382219M9975500J9228308
$$ y = [875027, 893231, 848612, 750158, 743846, 708063, 640797, 598089, 581581, 554955, 546902, 508455, 535528, 561812, 595891, 661104, 704220, 733287, 737689, 752741, 813371, 885614, 941330, 960320, 974591, 1008469, 1064864, 1091147, 1129283, 1194622, 1236793, 1242356, 1248794, 1325066, 1432612, 1578176, 1650151, 1696214, 1785365, 1923411, 2149041, 2403114, 2678436, 3087069, 3683955, 4343342, 5092838, 5885292, 6529994, 7071398, 7321055, 7149419, 6759547, 6385336, 6192206, 6192057, 6336376, 6608046, 7019707, 7567976, 8286744, 9144518, 10118089, 11329059, 12829869, 14673355, 17052997, 20098929, 23979574, 29118613, 36022631, 45440555, 58776075, 77593708, 103674272, 139213999, 185949026, 241331245, 291306745, 310535053]
18843C10535053k3583752n0309996n5224395m6409631l4129867k4032736j6993449
18836E9851227j2177565q926489o763578n131864m007966l240229k631420k126449
18828A4845667j750708j501130j224331j016607p67380o64584o31826m57951k21462
18819F609688j03997J17923L04582L24352J92585j56364m53209n31025m75054
18810E829481m23055n18622o13421n37164l88426l39790k82516k30908k07089
18801B288490j19790q1259j03708j21443o1322q0377q6576j23569p7382r0407
18791A342657n0406l8831o5829m102l9822l8641m3451l9979n0177j1149j801j8554
18779I39915n4806m6910n1302n2054m938K0672K333l2832p2996n7519m5635o0377
$$ y = [310535053, 286951301, 236641305, 181416910, 135007279, 100877412, 76844676, 59851227, 47673662, 38747173, 31983595, 26851731, 22843765, 19603536, 16972116, 14845667, 13094959, 11593829, 10369498, 9352891, 8585511, 7920927, 7289101, 6831150, 6609688, 6505691, 6623614, 6928196, 7252548, 7445133, 7288769, 6835560, 6304535, 5829481, 5406426, 4887804, 4274383, 3737219, 3348793, 3009003, 2726487, 2495579, 2288490, 2168700, 2087441, 1983733, 1862290, 1800968, 1720591, 1634015, 1510446, 1433064, 1342657, 1292251, 1253420, 1187591, 1183489, 1143667, 1105026, 1061575, 1021596, 971419, 960270, 958469, 939915, 885109, 838199, 786897, 734843, 729905, 750577, 752910, 720078, 647082, 589563, 543928, 483551]
18767D83551k2349j497K0636M1663r09m2031r418M1551M5438j4581k9325L7591
18755E50320l2754m4385Q570L1563J6517p5554K090N2850K9283k6520q1322J195
18743D31853m3546l7965M59J0150K9966j8245l0980Q589L5796r713j030j7854
18731C57480j2637m1849j8219j7058o454m1367L415M5423l5753j6214L5865M218
18719B56850k6111J2718j1115L8525Q8716r792m834N216n0018K7318M7310q238
18707C66545J6203M1070Q121m9405k1485n2639l9324r220j2853J8070M3170J1134
18695C19387K6598P597k6367K2876N2862J11305J43935J03136J05027J18426J15935
18684A100717J24299J04258N210K7459P2142N5007M1270M1527M2741o054p9783
$$ y = [483551, 461202, 459705, 480341, 522004, 521095, 479064, 469646, 511197, 556635, 542054, 512729, 550320, 517566, 473181, 481751, 513314, 529831, 454277, 456367, 509217, 538500, 511980, 430658, 431853, 388307, 350342, 350801, 360951, 390917, 372672, 341692, 350281, 386077, 376364, 375334, 357480, 344843, 302994, 284775, 267717, 261263, 219896, 223311, 268734, 232981, 216767, 252632, 256850, 230739, 243457, 232342, 270867, 359583, 349791, 344957, 350173, 300155, 327473, 374783, 366545, 382748, 423818, 431939, 382534, 361049, 308410, 269086, 259866, 247013, 265083, 308253, 319387, 345985, 353582, 327215, 350091, 402953, 514258, 658193, 761329, 866356, 984782, 1100717, 1225016, 1329274, 1334484, 1361943, 1434085, 1489092, 1530362, 1571889, 1614630, 1608576, 1528793]
18673A528793j5939o9807q4951j22949j19445j63185n7028q6956p9696j28698
18663F00139m3185m1046r408K524k5027n0454l0207o2913m2391j1572K1329j6796
18651B90993m0989k3030k214M6209K8248j6694n0789o3657o6040M6664N5854k8665
18639A75890J3829J8638K3762K8722k0813p9820k5593k890K3909L038n78M058
18627A62152n36L5362m424p1840m0174l5004L6819M2272k0065l103m1168j9898
18615D0393k1461K1112k2001k4237j4737L380m586J7764O3278N934J7240Q318
18603I0397K5403k0624k1178k3333J5854K2789k6741J9536l4707q08Q1506L6290
18591A64384j796r063j3246l432o271k8372j895r577o6832l502J0474o4362j7820
$$ y = [1528793, 1512854, 1443047, 1358096, 1235147, 1115702, 952517, 895489, 808533, 728837, 600139, 556954, 515908, 506500, 509024, 483997, 433543, 403336, 340423, 298032, 286460, 307789, 290993, 250004, 226974, 224760, 270969, 299217, 282523, 231734, 168077, 102037, 148701, 204555, 175890, 189719, 208357, 232119, 260841, 240028, 160208, 134615, 131725, 155634, 158672, 158094, 162152, 161616, 196978, 192554, 120714, 80540, 45536, 82355, 124627, 104562, 101459, 60291, 40393, 18932, 40044, 18043, -6194, -20931, -17551, -22137, -4373, 58905, 64839, 82079, 90397, 115800, 95176, 73998, 50665, 66519, 89308, 62567, 82103, 47396, 46588, 128094, 164384, 162588, 153525, 140279, 136847, 130576, 102204, 100309, 90732, 23900, 20398, 30872, -33490, -51310]
18578e1310L0474L6961N9650j0723k2804m8404l8380j0390L4307J4677J4367N0437
18566E8862j6940n2658L2357L3904R119o0321k1292K4858j4612l6697K128J0300
18554c0992k842M9583L6348Q31R023j2248j8792R069J2538n1832l5571M2288P6632
18541H4035J4319K7657L4555j230m3963k4567k4817j2569J1720L495l2498M914
18529D1051j4987k2865K3874M3612j1092l1842J4056K9699K4030n121l255k315
18517H4845l6242n8056j7490j8628O373O0183N4213k3340N350J429K6725L3418
18505A18780k6745o5624k6708M1237M4917j6201L041j6347l8431L454j9204l7040
18493c4871m0574j7853P6846J8953J6372k4283l9172r46K9857O0333l5350m9874
$$ y = [-51310, -20836, 16125, 75775, 65052, 42248, -6156, -44536, -54926, -20619, -5942, 8425, 58862, 41922, -10736, 21621, 55525, 64644, 4323, -16969, 7889, -6723, -43420, -41292, -30992, -33834, 15749, 52097, 52928, 61951, 49703, 30911, 39980, 52518, 686, -34885, 7403, 84035, 98354, 126011, 160566, 159336, 115373, 90806, 65989, 53420, 65140, 68635, 36137, 41051, 26064, 3199, 27073, 70685, 59593, 27751, 41807, 71506, 95536, 90415, 87160, 84845, 48603, -9453, -26943, -45571, -39198, 20985, 75198, 51858, 57208, 58637, 85362, 118780, 92035, 26411, -297, 40940, 85857, 69656, 72697, 56350, 17919, 21373, 2169, -34871, -75445, -93298, -16452, 2501, 18873, -5410, -44582, -45528, -15671, 44662, 9312, -40562]
18481d0562L9530P8998L1634r985j3909j4086l2347n7084K2233M9536L216m5844
18469A1330O181J9777N863L8328N007L6233M2988n4910j0831M4733L7763N8009
18457B40471K4390K5637j4063m6653l3220m218j5125k1362j5475k9837j6185n1112
18445D3248j4544K326n595L075O731J3851j0296r747K3238N7374j6234l7275m2681
18432A3471j0310j8862K8074n198m0436o648L6517J1027K2516k1298l060m2522
18420c6729k1629R24j169K4346N6145J8295o395m58N761j5569m1215m2627J3594
18407d6726K0613N128L92N5793M7169l769k9761O056l2735K6218L1679j9843k5110
18394C5104L2132N1447K6698K4783o2064n6946j6310j1427K7061k9337m4052O320
$$ y = [-40562, -1032, 77966, 109600, 99615, 85706, 71620, 39273, -17811, 4422, 53958, 57174, 11330, 17511, 37288, 43151, 81479, 86486, 122719, 165707, 110797, 99966, 144699, 182462, 240471, 264861, 290498, 276435, 229782, 196562, 192344, 177219, 155857, 140382, 110545, 94360, 43248, 28704, 31030, 25435, 28510, 35241, 49092, 38796, 29049, 52287, 109661, 93427, 56152, 13471, 3161, -15701, 12373, 7175, -33261, -39909, -3392, 7635, 30151, 8853, 5793, -36729, -58358, -57434, -58603, -34257, 21888, 40183, 33788, 33330, 39091, 23522, -17693, -60320, -46726, -26113, -20985, -20593, 35200, 82369, 78600, 48839, 54895, 22160, 48378, 80057, 60214, 35104, 67236, 118683, 145381, 170164, 108100, 51154, 34844, 23417, 50478, 21141, -22911, -16591]
18382a6591K4992j0438n890L0266O94p627k2424K0963j6595m1837j640q124q286
18369f2537P672J4051N2513J1618j3430m109K5039J9677k0171J4543J0989n4266
18357A589j4040K6736K7398j9171o446J6796J3290K2292k4783k6560J2844L0731
18345F0676l0416j4750p493L9361M1313o2901r594r586k3222p009N2906P564o5138
18332b8289P968j7538M625r798L8809M4618J0103J1112n8080J0051K4283q260
18320B9604O649k6567r722K100Q203L653l3594k6687J5917n7040j6567K4376M3424
18307c6251m6j2475L3770K423J8750n1246k1800O3973L0743N0390R971n0048m9240
18294a1086p557M3550M62j9967O618K3165l6612j6193K7917O448j8079j5271m3599
$$ y = [-16591, 8401, -2037, -7927, 22339, 23033, 15406, -7018, 13945, -2650, -44487, -46127, -54251, -62537, -54865, -40814, 11699, 23317, 9887, 5778, 30817, 50494, 30323, 44866, 55855, 1589, -12451, 14285, 41683, 22512, 16066, 32862, 46152, 68444, 43661, 17101, 29945, 60676, 30260, 15510, 8017, 47378, 88691, 25790, 16196, 6610, -16612, -23621, 29285, 36849, -28289, -20321, -37859, -33234, -43032, -4223, 40395, 50498, 61610, 3530, 13581, 37864, 29604, 36253, 9686, -36, 2064, 10267, 13920, -19674, -46361, -30444, -87484, -104051, -79675, -36251, -36297, -48772, -15002, -12579, 6171, -45075, -66875, -2902, 27841, 78231, 88202, 38154, -11086, -18643, 24907, 25369, 5402, 12020, 35185, -1427, -17620, 10297, 16745, -1334, -16605, -60204]
18281f0204N3517j7286j0611K9903l8776p775J3522O852j923J6432L0110l9376
18269b5615j631k1661m4888K9191R0123K9686l0829m6963R893L9784j5323J1877
18257B3644Q311L9090j0906o886p685j4055l9138K0977k4382l8954r170L0712
18245b8442r110j3485J2314J7549j7758L5077n0955l8240J0487P4860K150O6607
18233F1054K6443k3178l6046m3740j1270p651L1369O5472N4178L6764l0161o7753
18221E5481M286M3239k9575k4475J8640L1435l3930n0477m7988Q811J8492J6875
18209A0814M9946M8081j5770n3232n8511j1285N7891J6332l080R461q203o3585
18197b1141k4930N6728J9310Q278P02j3461j7979K5545L1304J0398l538M145k4898
$$ y = [-60204, -6687, -23973, -34584, -4681, -43457, -51232, -37710, -30858, -32781, -16349, 13761, -25615, -27246, -48907, -93795, -64604, 25519, 55205, 24376, -22587, -12694, 27090, 11767, 23644, 31955, 71045, 60139, 53253, 45568, 31513, -7625, 13352, -11030, -49984, -59154, -28442, -37552, -51037, -38723, -21174, -38932, -3855, -54810, -93050, -82563, -7703, -5553, 61054, 87497, 64319, 28273, -15467, -26737, -34388, -3019, 62453, 116631, 153395, 123234, 55481, 59767, 103006, 73431, 48956, 67596, 99031, 65101, 14624, -33364, -24553, -6061, 10814, 60760, 108841, 93071, 39839, -18672, -29957, 27934, 44266, 41186, 50647, 42444, -21141, -46071, 10657, 29967, 38245, 38947, 25486, 7507, 33052, 64356, 74754, 71216, 75361, 50463]
18184E0463j7075L0978m4330k0565M4541J6690K8826m5407J5139l908j6805K6449
18172F4996P658j2694n4546N923M3827Q2304O9212K5117P6893J59885J36295J50113
18160G54983K08534K51173K17436J1372j40122k32133k30548k58917j39053n7813
18150C84912l4697l7724q2296k2084k6756m0643N407j9172n845k4788J3479k2302
18138H7491L494J5582l6180n2220K6837M050o0660l0221N790M7000J7177o915
18126B1225j4630j9019m178K1695L4648l3283l7047M894l0934m0372J3275P3207
18114a0519k298p997j4613J6183j3825m132O0251J7712j1648j4285l2619O727
18102a1063l6167J0438L0846k5097n65L5610k9270J0400P730J8270n1345r718
$$ y = [50463, 33388, 64366, 20036, -529, 44012, 60702, 89528, 44121, 59260, 55352, 38547, 64996, 72654, 59960, 5414, 11337, 55164, 137468, 206680, 231797, 308690, 468575, 604870, 754983, 963517, 1214690, 1432126, 1443498, 1303376, 1071243, 840695, 581778, 442725, 384912, 350215, 312491, 230195, 208111, 181355, 140712, 146119, 126947, 121102, 96314, 109793, 87491, 90985, 106567, 70387, 18167, 45004, 49054, -11606, -41827, -36037, 10963, 28140, 21225, 6595, -12424, -16602, 5093, 39741, 6458, -30589, -25695, -56629, -97001, -83726, -10519, -12817, -20814, -35427, -19244, -33069, -37201, 23050, 40762, 29114, 14829, -17790, -11063, -47230, -36792, -5946, -31043, -31608, 4002, -25268, -14868, -7138, 11132, -40213, -49931]
18090d9931M2821l3814J7649L3608K7533k3160j2855K0956K6553L5224J4874q793
18078I0665m0365k3731j3690l9306j0173K3653O1101j4535j1097k8038K4909L8296
18066E7689l8575l4728l868k1426j5582K8051K6724K7161K1411k7752m3351l2037
18054e6283K3728M3768J5727k0576M7851k3637m1452k1918j5623P5546O9234k4084
18042G2281q850K2440P919L9528L4422L4715k9265K4007P0477K0167J3436M1493
18030C42770K4482R3779J12917P0183J06842J06986R1557J02132O1934R3202O9683
18019A276467P0150M5570J9473k4757l9029J9591J0485p6333n9102m7710n3007
18008A141798j29288j89782j17994j12168o8612p1537q718k4091j09557p2863
$$ y = [-49931, -7110, -40924, -23275, 10333, 37866, 14706, 1851, 22807, 49360, 84584, 99458, 90665, 50300, 26569, 12879, -26427, -36600, -12947, 48154, 33619, 22522, -5516, 19393, 57689, 19114, -15614, -19482, -40908, -56490, -28439, -1715, 25446, 46857, 19105, -24246, -56283, -32555, 11213, 26940, 6364, 54215, 30578, -10874, -32792, -48415, 27131, 96365, 72281, 63431, 85871, 93790, 133318, 167740, 202455, 173190, 197197, 267674, 287841, 301277, 342770, 367252, 461031, 573948, 644131, 750973, 857959, 949516, 1051648, 1113582, 1206784, 1276467, 1346617, 1392187, 1411660, 1386903, 1347874, 1367465, 1377950, 1301617, 1242515, 1194805, 1141798, 1012510, 822728, 704734, 592566, 523954, 452417, 443699, 419608, 310051, 237188]
17998B37188J5181l0004o9814k6458Q136K561L2033m3206Q231p6665k4203L5769
17986F8749K0806K3956K4802j6669k4115r784j8273l0324J3724O766J9679l080
17974G6237Q369P3749k0887p5522j3668L0952M69q5961l0272M8011j3028L2725
17962C1174M4797m9042O413M0077j0509k9773K594l4893k5314J6337k7551n901
17950d1591J0245K3896M4370p092l5610P210L0051K7748l8430N473O021N3365
17938H5656N1840m9519r1702L3026L4046L8763K2889j8529l3010r024k3649k7322
17926A3465P2852J3081k3085j3256M5217M4371m0487q6006L7324K3817L3534O022
17914A26849k2319Q585r230K69M6672J6937j6184J218L7720J7209k3853q618L3717
$$ y = [237188, 252369, 222365, 152551, 126093, 134229, 136790, 168823, 125617, 133848, 57183, 32980, 68749, 89555, 113511, 138313, 121644, 97529, 87745, 69472, 39148, 52872, 59638, 79317, 76237, 84606, 158355, 137468, 61946, 48278, 79230, 79699, -6262, -36534, 11477, -1551, 31174, 75971, 26929, 33342, 73419, 62910, 33137, 35731, 838, -24476, -8139, -35690, -41591, -31346, -7450, 36920, 29828, -5782, 1428, 31479, 59227, 20797, 26270, 32291, 85656, 137496, 87977, -3725, 29301, 63347, 102110, 124999, 106470, 73460, 64436, 40787, 13465, 86317, 99398, 76313, 63057, 108274, 152645, 112158, 26152, 63476, 87293, 120827, 126849, 104530, 113115, 103885, 104154, 150826, 167763, 151579, 152797, 190517, 207726, 183873, 175255, 208972]
17901B08972r9k5243J4515Q727n0265l9672K3723R368k4532P9245O174p7269J0046
17888A43690n0231m352L8011N6832k7842o0060p67O605K0626J6649j1963K403
17876A29601n969O808J5153m882p1613l9668R630K7840K8169m1931L4928j4614
17864G3452K3950J9861P1492j8023o3955j7738q685j9219L71K1693k2723j972
17852E8504P366L952j0990k9675n5070n902N7965J5836L7545j7713M3498J3081
17840A18397l2615j4156l4937L585P4663M07J349p864k1105k8299p222j2650o660
17827C2893k8063k314k1147j2583K7115j9724m074K9271M216p3371L4197M4663
17815A1079k5302l2156O2400j3469j2430p055J1142L7319K3446L0595O0511j5911
$$ y = [208972, 208873, 183630, 198145, 206872, 156607, 116935, 140658, 150026, 125494, 204739, 210913, 133644, 143690, 93459, 89107, 127118, 183950, 156108, 96048, 95281, 101886, 122512, 139161, 127198, 129601, 123632, 130440, 145593, 140711, 69098, 29430, 39060, 66900, 95069, 53138, 88066, 73452, 97402, 117263, 188755, 170732, 106777, 89039, 80354, 61135, 61506, 83199, 60476, 58504, 65870, 69822, 58832, 29157, -25913, -31815, 26150, 41986, 79531, 61818, 105316, 118397, 85782, 71626, 36689, 40274, 114937, 115344, 116693, 108829, 87724, 59425, 52203, 39553, 32893, 4830, 2516, -18631, -31214, -4099, -23823, -27897, 1374, 5590, -67781, -33584, 11079, -14223, -46379, 16021, 2552, -9878, -16933, -5791, 31528, 54974, 85569, 146080, 130169]
17803A30169l2252K931j2243j9322j3625k8925j5554M4266k5728n6547N3045J295
17791B7510K609L3067o1045n0381k9813L8677L7487K6868L892J7679J516k0548
17779B7518J9493k5859r357n3843P83j9384J8142P3901L0295l4366o2992n2148
17767h7817Q054k0963L3822J0035j9114O465J5428L4781J3084l8852J9988o509
17755c1598M4134J5360j4659m0494k2333J5097q613M3616O597j7069M7100K6615
17743F3753j11067l9093O0861P5087O519k1411l4345l9955L337P196r917l2541
17731g1576j614m922M8907L3508J3798J305j8502K595O1300K4803k4316q3675
17719a8389p4042K0411Q948L9819J1687o856J0529J1506j3238n1251j5989j0922
$$ y = [130169, 97917, 100848, 88605, 69283, 55658, 26733, 11179, 55445, 29717, -26830, 26215, 27510, 30119, 63186, 2141, -48240, -78053, -39376, -1889, 24979, 28871, 46550, 48066, 27518, 47011, 21152, 11795, -42048, -41265, -60649, -42507, 31394, 61689, 27323, -35669, -87817, -79763, -100726, -66904, -56869, -75983, -69518, -54090, -19309, -6225, -45077, -25089, -31598, 12536, 27896, 13237, -27257, -49590, -34493, -43106, 510, 7107, -9962, 37138, 63753, -47314, -86407, -25546, 49541, 56060, 34649, 304, -39651, -36314, -29118, -39035, -71576, -73190, -78112, -29205, 4303, 18101, 19406, 904, 3499, 64799, 89602, 65286, -18389, -92431, -72020, -63072, -23253, -11566, -18422, -7893, 3613, -9625, -60876, -76865, -87787]
17707h7787L2285N6229m092J3048K1903k7038j7921K0630L8540P216J2831j8464
17695D7380l7345J30k5908j3028J0230L407j4168P365l011l6460J9101N1369M816
17682A3878K6421N9293q434l4520o9262j0514L4465l1377o735K3750k0040l518
17670b6593R367K9505j0304j8196L86l5334k6489J3922N1201K9978K3571r451
17658C1563m7976K15J7377N3228j4974j169M4650K1348l2587O162N591k2011l8565
17645B2852m1857j3484L806j691O0337L1932m2443k6136K160K7006l717j5497
17633C268P119n1226j2322K1206j3312k4491J9244L6007L0791l0128K8984K9980
17621D5120n7159l7160O792O5660M267j9698L085j8430k2778J4108j1139J4790
$$ y = [-87787, -55502, 727, -3365, 9683, 31586, 4548, -13373, 7257, 45797, 53013, 65844, 47380, 10035, 10165, -15743, -28771, -18541, -15134, -29302, -21937, -24948, -61408, -42307, 9062, 13878, 40299, 99592, 91158, 56638, -12624, -23138, 11327, -20050, -26785, -3035, -23075, -26593, -17226, 12279, 1975, -16221, -15835, -51169, -77658, -63736, -12535, 17443, 41014, 31563, -16413, -16198, 1179, 54407, 39433, 38264, 82914, 104262, 71675, 77837, 83428, 61417, 22852, -19005, -32489, -28683, -30374, 29963, 61895, 19452, -6684, -4524, 22482, 18765, 3268, 10387, -40839, -53161, -31955, -45267, -69758, -50514, -14507, 16284, -13844, 15140, 45120, -12039, -49199, -42407, 23253, 27520, 7822, 10907, -7523, -30301, -16193, -27332, -12542]
17609a2542M4430L613L751q904N574j519P111m866j3039j6689J4629J5717j3349
17596B3917l8176j9608M1993l8837L975M5652L8602n056n0609p4211o478O9305
17584i531o787J2004Q72K2020Q04n303L5571J0072m1021m6197J15p049K990J8636
17570a2804k771K6243K8270L2327j3722k8160n778K7004N933K2109l196o3542
17558A1913m3296k3730R687N9658j4444k6146K9971R067j3528n003J5182k9707
17546b0376o6570j4609N2638O6090K9854L0695k141N418k2061J5352O818o2078
17534A9030o5091k8086J0544J3062J0806P694k7712j4864R019K3421k5119j7242
17522h4538R664r443k7540L1495M1124O434m142M562L6141j7817J3256k5807O181
$$ y = [-12542, 31888, 35501, 39252, 30348, 35922, 34403, 41514, 36648, 23609, 6920, 21549, 37266, 23917, -14259, -33867, 8126, -30711, -26736, 18916, 57518, 52462, 1853, -72358, -78836, -9531, -16318, -4314, -3442, 18578, 19382, 14079, 49650, 59722, 18701, -27496, -27381, -34430, -31440, -12804, -15575, 10668, 38938, 71265, 57543, 29383, 23605, 50609, 56542, 78651, 75455, 11913, -31383, -55113, -45426, 14232, -212, -26358, 3613, 12680, -848, -5851, 9331, -20376, -86946, -101555, -48917, 17173, 47027, 77722, 75581, 80999, 58938, 74290, 81108, 19030, -46061, -74147, -63603, -50541, -39735, -32041, -59753, -74617, -65598, -42177, -67296, -84538, -74874, -84317, -111857, -80362, -39238, -32804, -36946, -32384, 3757, -14060, -804, -26611, -20430]
17509b0430n048o612P9301J803k9112j689O2039k5244k2492j8031k6198j4241
17497b5954q876j6914j2485p588j6052J5021L8552K8732j6354q027J4034Q375
17485g536l5862j5121J0744r509j0631K539J8808k35k2743k0020O0648N828k269
17472b5359j6706P9997M8446j4606k7853l7005l2487l8970k1679M5067M319L6479
17460c57M8169m037l2841m9852j5980L0380J1271R115j5823M099K805J2676J4764
17447A4389M4962l4396n7592j6488j6830l3224j1977N4897M998K0071M615j799
17435b8374K7913R118k260j2179r352L0R70j111l8635k4537J742L0513l0359L325
17421g3196R1248K3703n1645k8491j3836J7027L2327L396l5085j8393j3427K269
$$ y = [-20430, -25478, -32090, 47211, 49014, 19902, 18213, 80252, 55008, 32516, 14485, -11713, -25954, -34830, -51744, -64229, -71817, -87869, -72848, -34296, -5564, -21918, -29945, -15911, -7536, -43398, -58519, -47775, -57284, -67915, -65376, -46568, -46803, -69546, -89566, -28918, -23090, -25359, -42065, 37932, 86378, 71772, 43919, 6914, -25573, -64543, -86222, -41155, -36836, -357, 47812, 43775, 10934, -38918, -54898, -24518, -13247, -4132, -19955, -15856, -13051, -375, 14389, 59351, 24955, -32637, -49125, -65955, -99179, -111156, -56259, -51261, -31190, -26575, -28374, -461, 8657, 6397, -5782, -15134, -15104, -14134, -15245, -53880, -78417, -76675, -46162, -76521, -73196, 18052, 41755, -9890, -38381, -52217, -35190, -2863, 533, -34552, -52945, -66372, -64103]
17409f4103k5474n9987M9677N1225J1111N5623j0638m4362P709K1974j7456n0474
17397g5175L4351L2280J348M9696J2161L9965j084q3848m4784J5769O2739K4904
17385F8322m1999k7406Q569K465j6203L273K7400k754n75l2708j2582K5836l6145
17372c4507k7794j4694M5440L3727n5897K2969K8970k0021r014j943N6558m7825
17360b4031l0547k1056N6044K4126J013l6162j5222p883n2387j1005L1006J9089
17348f7015J4461K5049M0746J0396R579k0440l1707m5417K3017R972j4764J9552
17336b6571l5700O240p968N561m951P563J9207j7814J6560K8299K0434L431L499
17323A7790k2853j4977q104o1N4383P629k7231j9347k6648q624N2492M9064l6036
$$ y = [-64103, -89577, -149564, -99887, -48662, -37551, 18072, 7434, -36928, -29219, -7245, -24701, -75175, -40824, -8544, -7196, 42500, 54661, 94626, 93542, 9694, -35090, -19321, 43418, 68322, 26323, -1083, 7486, 9951, -6252, -2979, 24421, 21667, 21092, -11616, -24198, 1638, -34507, -62301, -76995, -31555, 2172, -53725, -30756, -1786, -21807, -30821, -32764, 23794, -24031, -54578, -75634, -19590, 4536, 5549, -30613, -45835, -53718, -106105, -117110, -86104, -67015, -52554, -27505, 13241, 23637, 33216, 12776, -18931, -64348, -41331, -31359, -46123, -26571, -62271, -56031, -63999, -58438, -63389, -55826, -36619, -54433, -37873, -9574, 10860, 14291, 17790, -5063, -20040, -28144, -28205, 26178, 33807, 6576, -12771, -39419, -48043, 4449, 53513, 17477]
17310A7477l0812k5315L1532j4053k2677K0791M4661P862l5871m6648m3327M4321
17298e2059N4448M285m7874j8833L6366L9863k4564k2689j0869k6827O373K2274
17286d0106K9281L2595J6489L1962k354o6384m0795q2n9080l2372M8873Q4601
17274B628O6313R549l1517n0792m0628J7989R732L4136M172p832k2682J5729L0034
17261C6831K0546q677J3910o473j2277l8754j8564k7802n342J656L261j0399J5592
17248c6492J9909K7825j8674n9701J3674K5627k5246k1786J0097J1007L4370K852
17236a6538m2522q8892K6925P3387O882l7714l1617j2307J8150J6369p228N1841
17224d3264O0305M002o3002l7940j845l1646J645J5260M909K4190L6416N3356
$$ y = [17477, -13335, -38650, -7118, -21171, -43848, -23057, 21604, 29466, -6405, -53053, -96380, -52059, 2389, 6674, -41200, -60033, -23667, 16196, -8368, -31057, -41926, -68753, -62380, -40106, -10825, 21770, 38259, 70221, 67867, 1483, -39312, -39394, -98474, -130846, -81973, 2628, 68941, 78490, 46973, -3819, -44447, -26458, -16726, 17410, 21582, 13750, -8932, 6797, 36831, 57377, 48700, 62610, 56137, 43860, 5106, -13458, -41260, -46602, -44946, -41685, -52084, -36492, -16583, 11242, -7432, -67133, -53459, -27832, -53078, -74864, -64767, -53760, -19390, -16538, -59060, -147952, -121027, -47640, -40758, -78472, -110089, -122396, -104246, -87877, -95105, -43264, 17041, 21043, -41959, -79899, -81744, -113390, -111745, -96485, -91576, -67386, -30970, 22386]
17212B2386J9409m0538j8170J9278L152k8812k2699M7907k032N7138l766m9214
17200D039l0974P396J4349K5762N9399L9138k9586m5837k8550j2469J0521Q992
17188B2180R192l6740m6220q450K1407Q110N501j2127M4961m1538j9710R763k7715
17175g1386Q177L1064J978j2493K0632j9726o975K1644L7842J6621P591K7664
17163F2633l2403n0293m8453k4122O769R669n29O8124J0690l2433m9076M139K9590
17150d5695k506K3240J9456k0490l5400Q676m9058R12J3902M5774K2306P152J0132
17137a599J5462N8721q75l4814n8507n181k4882k1188K1803k6081M2164P1831
17125C6854M0675K297o0195J3725j4587m0627O355q090K3135l3507n7130M6145
$$ y = [22386, 41795, 1257, -16913, 2365, 5517, -23295, -45994, 1913, -119, 57019, 53253, 4039, -26935, -19539, -5190, 20572, 79971, 119109, 89523, 43686, 15136, 2667, 13188, 22180, 31372, -5368, -51588, -60038, -38631, -30521, -25020, -37147, 7814, -33724, -53434, -43671, -71386, -63209, -32145, -30167, -42660, -22028, -41754, -48729, -27085, 10757, 27378, 34969, 62633, 30230, -20063, -68516, -92638, -85869, -76200, -76729, -8605, 2085, -30348, -79424, -75285, -45695, -48201, -24961, -5505, -25995, -61395, -52719, -101777, -100865, -86963, -41189, -18883, -11731, -1599, 13863, 72584, 71709, 36895, -21612, -26793, -51675, -72863, -51060, -77141, -34977, 36854, 77529, 79826, 19631, 33356, 18769, -21858, -15503, -23593, -458, -33965, -91095, -44950]
17113d4950J2092M519Q265l4418k1336M772J074L7413k0600q663Q950K3411L647
17100b5824O69N661o0914K5307L1585N1178M110n5389m8859R38L8635o679p944
17087d7526J7610N272J7343L6266P966J4919l4583l6656P092O467n6421m8713
17075a10964J3078Q829L1879L6041L2752l100l2180n3097j2585J4117k08P504
17063f7934L4904L3477l1032k8179j9869J6821j4948J3679K3285j5231K4632P7721
17051D7326K5603m4055p1587k998J050k8229K1659L6231m6080o401K4023p956
17039e1414j1716J3739K9093R304j0641j2393J3890N2101m0338m2588O363K4701
17027a9899L9471k4720r521j1069k9451J9683L5065J2059r808k0216m0580j4103
$$ y = [-44950, -32858, -28339, -20074, -54492, -75828, -71056, -69982, -32569, -53169, -61832, -52882, -29471, -25824, -25155, -19494, -80408, -55101, -23516, 27662, 31772, -23617, -72476, -71538, -32903, -39582, -47526, -29916, -24644, -7301, 28965, 36931, 51850, 17267, -19389, -12297, -5830, -62251, -110964, -97886, -89057, -57178, -21137, 11615, 8515, -23665, -76762, -89347, -75230, -75438, -67934, -33030, 447, -30585, -58764, -78633, -61812, -76760, -63081, -39796, -55027, -30395, 47326, 72929, 28874, -42713, -45711, -44661, -72890, -51231, -15000, -61080, -67481, -43458, -51414, -63130, -49391, -20298, -10994, -21635, -34028, -20138, 31963, -8375, -50963, -44600, -19899, 19572, -5148, -14669, -25738, -55189, -35506, -441, 11618, 1810, -18406, -58986, -73089]
17015g3089K8676q586K6558L50k5589j3805K1173j7409M9138M0694p876o231r798
17002D206j8519q739J7655J243j934l5807N8784m5822j05209K5564O8898N0623
16990A0943l4954P046L512j4512l0413K0801M944M886K2928k2664K641K2304k7276
16977b9814J5923j1405j9965r800L5572j6230l0528j6249R485K1290M8617K7448
16965B4344k7802l4971j2138L2211k3979l4234M008J8420J9708q202k1919J6735
16953d7819l546K1859M543j6433J3435K911l068M6789J3886m3090k0052N6492
16941B5907N0686m5852k5732J628l3605l3487j3441l1512k0162K2243N2574K8447
16929b2306n2697m0329j1441j9724K6699P3697O559k1809J6400L5777j4587J7438
$$ y = [-73089, -44413, -52999, -26441, -26091, -51680, -65485, -44312, -61721, -12583, 28111, 20235, 14004, 4206, -14313, -23052, -5397, -4154, -6088, -41895, 16889, -28933, -134142, -108578, -39680, 10943, -24011, -16965, -13453, -27965, -58378, -37577, -32633, -27747, -4819, -27483, -24842, -2538, -29814, -13891, -25296, -45261, -55061, -19489, -35719, -66247, -82496, -73011, -51721, -3104, 24344, -3458, -38429, -50567, -18356, -42335, -76569, -72561, -54141, -34433, -42635, -64554, -47819, -51365, -29506, -24963, -41396, -27961, -25050, -28118, 18671, 32557, -10533, -30585, 25907, 76593, 30741, 5009, 6637, -26968, -60455, -73896, -105408, -125570, -103327, -50753, -22306, -75003, -115332, -126773, -146497, -119798, -46101, -39542, -61351, -44951, -9174, -23761, -6323]
16917f323K9661J0510l2672m8596o292J4579q231L194j631n4171k2669P8460J974
16904d2207l6732q706O1635O8380j7814o0452J9107L478M4335N2486k3432j4479
16892D5599L6857J325M794K3421k5589k6912l6154o2939j0348M1003k5093l42
16880c4378Q710j2295K0053r309n8650l4115k2275M7273L2483K5483q124J8697
16868b6447L5909j0390k0091o5210J00N4899N3763j966R382k6859m262K344j0709
16855i537K3348O2316J6537l8921p3689J4801N159K1320J4058j6830J6250l787
16843C1025n824j4346l8795J7048M979J453L795J8477k2486k5348J3178J8385
16831A541K3681K6445n5091q447L3016p066L7838J6606j3996j749J1573K3791
$$ y = [-6323, 23338, 33848, 1176, -47420, -53712, -39133, -47364, -44170, -45801, -99972, -122641, -44181, -42207, -78939, -87645, -26010, 42370, 24556, -35896, -16789, -13311, 31024, 83510, 60078, 45599, 82456, 83781, 88575, 111996, 86407, 59495, 23341, -39598, -49946, -8943, -34036, -34378, -25668, -37963, -17910, -27219, -85869, -119984, -142259, -94986, -62503, -37020, -45144, -26447, 9462, -928, -21019, -86229, -86129, -31230, 22533, 20567, 29949, 3090, -1172, 1172, -9537, 13811, 76127, 92664, 53743, -19946, -5145, 14, 21334, 35392, 18562, 34812, 31025, 25201, 10855, -27940, -10892, -5913, -4460, -665, 17812, -4674, -30022, -16844, 1541, 25222, 51667, -3424, -11871, 21145, 14079, 51917, 68523, 54527, 52778, 64351, 88142]
16819H8142q167m6974n4844m78L534l2232k1931j6463K695J9669l0080R529M0095
16806d7505O817l4507k1936K5033L3494j6376K3217L727q897J3488j8564n3712
16794i5721l6023L9530K2298J8551L8030k420r954j6571n0131l3974J4003Q4309
16782b8073O3253J9782n5926j9937M278K3435k5578m1097J8215J1465L7718k6788
16770a9253M089n656n78K0412l2715l3730L1923l865l7926P314N6189J7100k8901
16757b5597K655K783R007M3297K6403M025M5860j9957m1894m4927k3755j0495
16745c2595m0715K2658J6121j9298n1700k366K5737k7119K1187M4505L1896L3753
16733B2064K2457k8592n641o414m0196J4100o570n274R655l4755j0544O769n784
$$ y = [88142, 79975, 33001, -21843, -22321, -18787, -51019, -72950, -89413, -86718, -67049, -97129, -87600, -47505, -40688, -75195, -97131, -72098, -38604, -54980, -31763, -28036, -36933, -23445, -42009, -95721, -131744, -92214, -69916, -51365, -13335, -15755, -25709, -42280, -92411, -126385, -112382, -28073, 35180, 54962, -964, -20901, -16623, 6812, -18766, -59863, -41648, -30183, 7535, -19253, -15164, -20820, -21398, -986, -33701, -67431, -35508, -39373, -77299, -69985, -13796, 3304, -25597, -22942, -20159, -11152, 32145, 58548, 62573, 108433, 88476, 46582, 1655, -22100, -32595, -73310, -50652, -34531, -53829, -105529, -107895, -82158, -109277, -88090, -43585, -11689, 22064, 44521, 15929, 10288, 3874, -36322, -22222, -28792, -34066, -24411, -59166, -69710, -62941, -68725]
16720f8725M6269R20N7375K3828k4743p2052l5125k8547J8419P6045O2525K1397
16708G7586j8436j4606M3565n151j8302m4984k6221J5710J7167J1681o592o950
16696B4467j5401o421k9554m3196J0224K467J7630L1225j0470j0665n884K5322
16684a0256K11l0803M272j1387J1782N0643N1294k2313p1973r475l5300O3557
16672i748N2832o2501n6817K1939P0539k023j7199j310j7622J407J2974K4661
16660A7132J3663m600k4833n360P22k1419K5261J0725M8228k5755j6171l2795
16648a5202j7045L2375K8399k0307p4J739k5076J0049m1117k0571L4381K7018
16636e431l8508N499L4524J3172J8907L981J961O849n1463l1224L9987N608r036
$$ y = [-68725, -22456, -21536, 35839, 59667, 34924, -37128, -72253, -100800, -82381, -6336, 56189, 77586, 59150, 44544, 88109, 82958, 64656, 19672, -6549, 9161, 26328, 38009, 31417, 24467, 9066, 2645, -26909, -70105, -59881, -57414, -39784, -8559, -19029, -29694, -35578, -10256, -10045, -40848, -36576, -47963, -36181, 14462, 65756, 43443, -28530, -38005, -73305, -9748, 43084, -19417, -76234, -54295, 16244, 14221, -2978, -4288, -21910, -20503, -7529, 17132, 30795, 26195, 1362, -3998, -3276, -24695, 566, 11291, 59519, 33764, 17593, -15202, -32247, 128, 28527, 8220, 8146, 9885, -15191, -5142, -46259, -66830, -32449, -5431, -43939, -38440, -3916, 9256, 28163, 32144, 34105, 40954, -10509, -41733, -1746, 3862, -5174]
16623e174J4284l4844m4319l0950K9480M5133J3866k1505J6652Q0928l5899j16309
16611h8657N1932O4614o649l8117j8149k5745M2878L0295M3885L9340l7543r0196
16599c2112k8513l229l3421J6649K2473l9723K9470J5590J6378N7246Q826k4193
16587E441K8823J2825o3743j6778j1646L629L094J9195J1319m0194M273M8986
16575E224J5391R557k9060K8066J2458O643k187j8545l356j4302N9965n554n8678
16562E622l2598K1149j2506Q308P221K1412p0482m0688J7990O2326J7087o6394
16550f1553j0300j5494Q3581P3675l5160n4353M79K0341L1244q728K4603L4360
16538H2695o3988l6888L0073q210K0071J8551m1015q6750K0870N3553M4533K9391
$$ y = [-5174, 9110, -25734, -70053, -101003, -71523, -26390, -12524, -34029, -17377, 63551, 27652, -88657, -36725, 27889, 21240, -16877, -35026, -60771, -17893, 12402, 56287, 95627, 58084, -32112, -60625, -63854, -97275, -80626, -58153, -97876, -68406, -52816, -36438, 20808, 29634, 5441, 34264, 47089, -16654, -33432, -45078, -41449, -38355, -19160, -7841, -48035, -43762, 5224, 20615, 30172, 1112, 29178, 41636, 48279, 46092, 27547, 24191, 9889, 69854, 64300, 5622, -26976, -5827, -18333, -10025, -2804, 18608, -51874, -92562, -74572, -12246, 4841, -61553, -71853, -87347, -3766, 69909, 34749, -19604, -19125, 1216, 32460, 23732, 48335, 82695, 18707, -18181, 11892, 3682, 23753, 42304, 1289, -85461, -64591, -11038, 33495, 62886]
16526F2886j1160l5354m3341j454N36j6865L4774j4843m1941L642L1172M5968
16514A4020l2830j8436L4276J9763K9029J1389m2151n9800k0995l5700O330Q766
16502h6339M9617J1676n6903L8994R0782j6844l8643J3555m6612R661J8792j5557
16490b7821m2526m8773p994N8933L3802k1323j8362M0713N4394N350m2840k0367
16478c6814k942K4406k2131j6505K6685O4356J1314l0132m7575n6934M5600P020
16466c3652M0542j0423j8329k1228k4620J2754L733L579J4240j806q384J2705
16454c0889J5751J0893j2035k4651k3175m9934j0982P8969M9094k8207j8086L857
16442c9395K2255K1742J5129n5700n5187M5382P546k2966o1489j3456Q8268P225
$$ y = [62886, 51726, 16372, -26969, -28423, -27887, -44752, -9978, -24821, -66762, -63120, -31948, 14020, -18810, -37246, -2970, 16793, 45822, 57211, 15060, -44740, -65735, -101435, -95105, -86339, -36722, -25046, -81949, -42955, 47827, 30983, -7660, 5895, -40717, -31056, -12264, -27821, -70347, -119120, -127114, -68181, -34379, -55702, -74064, -33351, 21043, 26393, -16447, -36814, -39756, -15350, -37481, -53986, -27301, 37055, 48369, 18237, -29338, -86272, -40672, -33652, 6890, -3533, -21862, -43090, -67710, -54956, -51223, -47644, -33404, -35210, -43594, -30889, -15138, -4245, -16280, -40931, -64106, -114040, -125022, -46053, 3041, -25166, -43252, -39395, -17140, 4602, 19731, -35969, -91156, -45774, -38228, -61194, -122683, -136139, -47871, -40646]
16430d0646j0536l409o760M1719J6771j0684K0594K3470J0177j443k060l5940
16418A253n1458n8860r042L9689M9501J4457j624l2694O863l693J1371k3556Q691
16405d9102O7804M8263Q54j5730n4980k4978K926J6297J9368r568k5850o5566
16393i0262l9970L0353L6566K5318L5524L521l3307j3731R613P612p715k840Q698
16380c0620l234m929l3036K8974N6018K4092L5410k1374n5222l0691k7233L1522
16368c0323K6083j0719j1986N810n468P589K3241Q576L021K3569j0820n6334L6218
16355H457P455q910J2199K2275j0188k5524j9610k3372K4101o350J3293Q8163
16343H1989K7845n9351L3525n1239o4265j3542O457N5152J9156k7358p304l852
$$ y = [-40646, -51182, -54591, -61351, -19632, -2861, -13545, 7049, 30519, 40696, 39253, 37193, 1253, -50205, -109065, -118107, -78418, -28917, -14460, -16084, -48778, -41915, -45608, -34237, -57793, -49102, 18702, 66965, 67819, 52089, -2891, -27869, -24943, -8646, 10722, 1154, -24696, -90262, -130232, -99879, -63313, -37995, -2471, 1050, -32257, -45988, -36375, -28763, -36478, -39318, -30620, -33854, -38783, -71819, -42845, 13173, 37265, 72675, 51301, -3921, -34612, -61845, -30323, -4240, -14959, -26945, -21135, -26603, -19014, 4227, 12803, 15824, 39393, 28573, -27761, 8457, 15912, 7002, 19201, 41476, 31288, 5764, -13846, -37218, -13117, -19467, -6174, 81989, 109834, 50483, 84008, 32769, -31496, -45038, -38581, 16571, 35727, 8369, 1065, -2787]
16331b787J8216K5284J3960K485j3308n4007m7413O4562O868j0213J0719O6033
16319H0399J4997p5477J6196j0726r749L8491O706q224k6592j7010o550L6527
16307C8988j1521k8069L3356j689m9726k0782J6162k2811n501j7476m7628l0252
16295a46949M9007L5465l4439l1965L0573M1542k3148M015P8032L9689l6895o3759
16283e8832K0519R1573m425k7512j4029j8698J3289j8795J1150j1195r769j6659
16271d3383k9975J604L6592M9955J8214j2531O891j3781l731R721J7712M1564
16259G8852m298P710n8069j2610L0580k4485l4136L5688R785j5510K825j6004
16247C28q1063M432J7397Q228M5662K6444l2222m8191r851K6763N4785J8213R640
$$ y = [-2787, 15429, 40713, 54673, 57158, 43850, -10157, -57570, 6992, 13860, 3647, 14366, 80399, 95396, 19919, 36115, 25389, 15640, 54131, 60837, 52613, 26021, 9011, 2461, 38988, 27467, -602, 32754, 31065, -18661, -39443, -23281, -46092, -51593, -69069, -116697, -146949, -97942, -62477, -96916, -128881, -98308, -56766, -79914, -75899, 2133, 41822, 4927, -58832, -38313, 53260, 48835, 21323, 7294, -11404, 1885, -16910, -5760, -16955, -26724, -43383, -73358, -71754, -35162, 14793, 33007, 20476, 27367, 13586, 9855, 19576, 37288, 78852, 74554, 82264, 24195, 11585, 42165, 17680, -16456, 19232, 29017, 13507, 16332, 328, -80735, -76303, -58906, -50678, -5016, 21428, -10794, -58985, -68836, -42073, 12712, 30925, 40565]
16234D0565j1117J2329K1988K6607m4582J2652k1892q3931j9785K3122J8742J6920
16222h382n76j8501m1150M9761J4797j855k1280j4617j2126l1234J4811j6434
16210h6786k4484K9974O2800k4517l388J52M734M5980o435R612m123L6432j7889
16197B2062j9829k9641p0485R039O493J2886k3622k5442L7654O9573J6808j1128
16185e632j376m6204k6305M5133K7077J0174k2391M034j6057R320R885k8076J8
16172d0400k1439P318q345J6060J8555l7398l1353Q267J1422L625M1635K718m1012
16159g0347k2731K5197j7506K7749P1568n615m3994J6449L8789j8533q218j7583
16147b4775k973k7681n2107K7753M652k0646k5567O5323R6785k3829o1722j3386
$$ y = [40565, 29448, 41777, 63765, 90372, 45790, 58442, 36550, -47381, -67166, -44044, -25302, -8382, -8958, -27459, -68609, -18848, -4051, -5906, -27186, -41803, -53929, -85163, -70352, -86786, -111270, -81296, -18496, -43013, -46401, -46249, -41515, 4465, -1970, 7642, 3519, 39951, 22062, 2233, -27408, -97893, -88854, -82361, -69475, -93097, -118539, -80885, -11312, 5496, -5632, -7008, -53212, -79517, -34384, -7307, 2867, -19524, -15490, -31547, -22227, -12342, -40418, -40400, -61839, -54521, -62866, -46806, -28251, -65649, -97002, -88735, -77313, -73688, -32053, -29335, -70347, -93078, -67881, -85387, -57638, 13930, 8315, -35679, -19230, 19559, 1026, -7192, -24775, -27748, -55429, -107536, -79783, -75131, -95777, -121344, -56021, 40764, 16935, -44787, -58173]
16135e8173k6851J4525J5995L6789J6533L7706k1626J5291o907m7506l1942j3941
16123g0107j5084n292r443M6884N7180k5266j6051j994M8063O561j3675m4851
16111d3075q335K1634L1002J9916K377K576l5462l0618k1671o708P545L6887q750
16098c2682P730K8966L1374M2897P309n332j8310o302j891k9445m1041J7222N9753
16085F0248l2902m1253O623p188j7827K2208J2536j7097K1307n817K6926K2852
16073E0616k6886k2893K9223K7387l2161j1531J9657L0594j5756J8708K3516j4715
16061G5759n6637j3549L536K3380J6535j7893j4621L29j4507j2242j39K0636j0361
16048B26P090j4024J2862L0061l7037p0502L5668o258k5117L8510O3325j5502
$$ y = [-58173, -85024, -70499, -54504, -17715, -1182, 36524, 14898, 30189, 23282, -24224, -56166, -70107, -85191, -90483, -99926, -53042, 4138, -21128, -37179, -39173, 8890, 15451, 1776, -43075, -51410, -29776, 1226, 21142, 23519, 26095, -9367, -39985, -61656, -68364, -60819, -23932, -32682, -24952, 4014, 35388, 78285, 85594, 80262, 61952, 55650, 53759, 24314, -16727, 495, 60248, 27346, -13907, -7284, -14472, -32299, -10091, 2445, -14652, 6655, 838, 27764, 50616, 23730, 837, 30060, 57447, 25286, 13755, 33412, 64006, 48250, 66958, 90474, 75759, 19122, 5573, 9109, 32489, 49024, 31131, 16510, 16839, 2332, -9910, -10049, 10587, 226, 7316, -6708, 6154, 36215, -822, -71324, -35656, -41914, -67031, -28521, 34804, 19302]
16036A9302n1016l0410n253O6537j3755n8781R193O387q1146m6575P3427J3727
16024i8363r185P9963M0276l7776n354M0796K8048l4591k9867O73J6849J095k3865
16011c1301l4499J0489M8336M9607K1015k6692J859j0195l6468o5008K279K8900
15999d1678O482K3258p267n944m1363J5055M0312L0157l7832k3150n794J7058
15987c0706o683K9399q455J3902L390l7715n8444J3779k1275M9641L3901m3893
15975f3159K7769M0267J0687j4006m0569j3995k922L9289m133k107l638J233m169
15962b9453m667k3542J0325L8455J8422J7041r638n8261J8195P339L1261K2173
15950C7650L520m9669p067m9020P908P602L1026L7034l9086l7580j3354j1013
$$ y = [19302, -31714, -62124, -67377, -840, -14595, -73376, -64183, -57796, -138942, -185517, -112090, -98363, -107548, -27585, 12691, -25085, -30439, 10357, 38405, 3814, -26053, -25380, -8531, -7436, -31301, -65800, -55311, -6975, 42632, 63647, 36955, 38814, 28619, -7849, -72857, -70578, -41678, -35196, -11938, -19205, -25149, -66512, -51457, -11145, 19012, -18820, -41970, -47764, -30706, -37389, -7990, -16445, -2543, 847, -36868, -95312, -81533, -102808, -53167, -19266, -63159, -35390, 4877, 15564, 1558, -39011, -53006, -55928, -16639, -20772, -22879, -26517, -25284, -29453, -34120, -57662, -47337, -8882, 9540, 26581, 16943, -41318, -23123, -15784, 15477, 37650, 41170, -8499, -15566, -64586, -56678, -49076, -18050, 18984, -20102, -57682, -71036, -82049]
15938h2049J1838l075J1710K798m4794J9591N5496J9493j9930o713J7990M8588
15926C0943K8193m4505l7729j4260j3081N8855m0813j8889L8746J2423m6457k1145
15914f7719N3517P645l4323k2921M1284L3820L539J1542L1503j8423m5346m1310
15902d7192m0251M0434J0378j9913J009j3737L0792M8931j2101n6105L5183L439
15890a9133J0480K857l3563J2056K7033p707J2723K5000o0255n7297K5482j6256
15878g8580N8968L880j4276Q653K5380M6032j2810K879L177k2815l0658J4011
15866C841K2740l9122k3240J4908K8990k1421J7070L1913m4183l0049K903L6672
15854A022K3912k2912N6128k5241K359P063n5477l2145J1864j1077n8444O528
$$ y = [-82049, -70211, -73286, -61576, -58778, -103572, -83981, -28485, -8992, -28922, -35635, -17645, 30943, 59136, 14631, -23098, -37358, -50439, 8416, -32397, -51286, -12540, -117, -46574, -67719, -14202, -6557, -40880, -63801, -22517, 11303, 14842, 26384, 57887, 39464, -5882, -47192, -87443, -47009, -36631, -56544, -55535, -69272, -38480, 10451, -1650, -57755, -22572, -19133, -8653, -5796, -39359, -27303, -270, -7977, 4746, 29746, -30509, -87806, -62324, -78580, -19612, -15732, -30008, -21355, 4025, 50057, 37247, 40126, 43303, 20488, -10170, 3841, 26581, -12541, -35781, -20873, 8117, -13304, 3766, 35679, -8504, -38553, -35650, 1022, 24934, 2022, 58150, 32909, 35268, 42331, -13146, -45291, -33427, -44504, -102948, -96420]
15842i6420L0868L2486K1412K3600J6866K3545n818k933L0687K5722o439m5737
15830D7839R988L698l0948n9971j5581J5736k5162n0690q480K1016K3604J2255
15818e6696L2500J796k6311Q50M8557O371l2040l570M9273J207o229j2603p459
15805d354J5499L158k371O487m9511L546J5564K1118m863L2198L2228p5683k8816
15792c5800o148l270Q082M2448q636n5536j0518R850k1534j8398N5297N7571j64
15779A3244n091j7447m0487J2981K968l1123K7686K3868l9613L0411M0492L0799
15767D8688j7026o5207k196j7888n1029j8747K1058L3186J7480L5608J1374J0323
15755E624K0658j1938j0449k3342J1329K2099j4067K1676k750k8423k8601o4573
$$ y = [-96420, -65552, -33066, -11654, 11946, 28812, 52357, 46539, 43606, 74293, 100015, 93576, 47839, 57827, 61525, 30577, -29394, -44975, -29239, -54401, -105091, -113571, -92555, -68951, -56696, -24196, -22400, -48711, -47861, 696, 7067, -24973, -28543, 20730, 21937, 15708, 3105, -4354, 11145, 14303, 11932, 18419, -31092, -27546, -11982, 9136, 4273, 36471, 68699, -6984, -35800, -41948, -45218, -37136, 5312, -3324, -58860, -69378, -59528, -81062, -99460, -44163, 13408, 13244, 8153, -9294, -49781, -36800, -33832, -64955, -37269, -13401, -53014, -22603, 17889, 48688, 31662, -33545, -35741, -53629, -104658, -123405, -102347, -69161, -51681, -16073, -4699, 5624, 26282, 14344, 3895, -19447, -8118, 13981, -86, 21590, 18840, -9583, -38184, -102757]
15743a02757j719L1544k8257N9182L0406j2288n945j1921n902k8579k0695J9970
15731g6961K2216J9238r890K6414K7291m9187M21o655j1750K5474K4300K0903
15719A1814L0907l155l0659k4303l1562j0147K5183M8094K804j4349N7549p235
15707E4941j2272o9692j3467J6826N357K285k2410k3153K8115M2243l3226m4369
15695f8822l9597P216N3285k9934q894P641M5605K4166L1029J4855j4610o6778
15683d4838L1736J4511J1625J9390L5230k4539k9478m1902l2394J3509J0256j4327
15671e1221k2901n1498j5086N1027J0603N4689O9761M1282k5034l3059L707m3513
15659a1243J006o693L1296N2164J807p8057l5654O882P0966N8224l5351p7051
$$ y = [-102757, -104476, -72932, -101189, -42007, -11601, -23889, -29834, -41755, -47657, -76236, -96931, -76961, -54745, -35507, -45397, -18983, 8308, -40879, -40458, -47113, -58863, -33389, -9089, 11814, 42721, 39566, 8907, -15396, -46958, -57105, -31922, 16172, 18976, 4627, 62176, 54941, 42669, -27023, -40490, -23664, -18307, -16022, -38432, -61585, -33470, 8773, -24453, -68822, -108419, -101203, -47918, -77852, -86746, -79105, -33500, -9334, 21695, 36550, 21940, -44838, -13102, 1409, 13034, 32424, 67654, 43115, 13637, -28265, -60659, -47150, -36894, -51221, -74122, -125620, -140706, -89679, -79076, -24387, 45374, 86656, 61622, 28563, 32270, -11243, -10237, -16930, 14366, 66530, 68337, -9720, -45374, -38492, 32474, 90698, 55347, -21704]
15647b1704j8213l2582K985J2896Q016M6409L4116Q990j4189m8403k6021K585
15635d5115L3325K4441N73j0719k0234l849K5778J467l0272Q754M9975K9196k1080
15622D2240n056J4975j4943k9847k1607k5231j6876rl3880j3811M3525L7903J3823
15609h794M0472K229j2135L239k0043O420n9888k509o858O331j5763J3832L8476
15596a4991J3819q120O496n6962m8122K5326N6370N682r595l6989L4789m428j150
15583c7875j5634O963P747L6641J6448o217k4943J2612K3947M1498K9533k2225
15571F8495l0740l0977o4463p2714j4484O8031K9640l2399K8622j1118J901j1894
15559g2100j0389l7411L143J6710L3830N129r346M0885M4651L4582j898j644k5244
$$ y = [-21704, -39917, -72499, -69514, -56618, -48602, -2193, 31923, 40913, 26724, -21679, -47700, -45115, -11790, 12651, 13224, 2505, -17729, -21578, 4200, 5667, -24605, -15851, 34124, 63320, 42240, 37184, 52159, 37216, 7369, -14238, -39469, -56345, -56354, -90234, -104045, -60520, -22617, -8794, 31678, 33907, 21772, 25011, 4968, 11388, -48500, -51009, -57867, -51536, -67299, -53467, -14991, -1172, -9292, -2796, -59758, -107880, -82554, -26184, -20502, -30097, -67086, -32297, -36725, -37875, -53509, -46546, -38799, -2158, 14290, 8073, -16870, -4258, 19689, 61187, 90720, 68495, 37755, 6778, -57685, -130399, -144883, -76852, -47212, -79611, -50989, -62107, -60206, -72100, -82489, -119900, -116757, -100047, -66217, -61088, -70434, -29549, 15102, 49684, 47786, 46142, 20898]
15546B0898j7768m3801m0128j1759N2446K0272l8427r4075j5186M2554J0994k5213
15534a39193N076L4495P3700J5800J9751j8544J0072m213O1030J3271L58k3367
15522D8236l9209k4538L7660o111m1744j5801n488j7558J8230L3625Q041M0574
15510C5917j2256k7720m4308l3056J8655R744l6234j098M1076m9268l796O7251
15498c5093J6996j291k1859j3598m2192q032M8268N478J5039N5509L5869j1612
15486D3482n1446l2288J3252K6161J3789M1196j7832o7682k0077j3490r796r106
15474h3837K5683K6588l0941J1862L0864K6386M7896j5816p7617r908l4162l1531
15462a14533P675O1893j5849R742K7892j1067J421m044M240J2212k7077k3759
$$ y = [20898, 3130, -40671, -80799, -92558, -40112, -19840, -58267, -152342, -167528, -124974, -113980, -139193, -134117, -99622, -25922, -10122, 9629, -8915, 1157, -3056, 57974, 71245, 71603, 48236, 9027, -15511, 22149, 16038, -25706, -41507, -46995, -64553, -46323, -12698, -4657, 35917, 23661, -4059, -48367, -81423, -62768, -53024, -89258, -90356, -49280, -98548, -102344, -35093, -18097, -19388, -41247, -54845, -97037, -105069, -56801, -51323, -36284, 19225, 55094, 43482, -7964, -40252, -27000, -839, 12950, 54146, 36314, -31368, -51445, -64935, -74731, -83837, -58154, -31566, -62507, -50645, -19781, 6605, 54501, 38685, -38932, -48840, -83002, -114533, -106858, -44965, -60814, -51072, -23180, -34247, -32826, -36870, -32630, -20418, -47495, -71254]
15450g1254K4905O8081O2608l2816j7640l7195l767M81l7951l3064k1286K0926
15438g7972j2323k7208Q680L5747O4541K5424k2140L037M0194j3850p6133l439
15426e5442L6997J5822Q620l4692j1015j3179j6896M8084J6450M1416n316k7475
15414C374K7678L7691n181n8064m2834K443k2241k4237m731P0801K3795J0251
15402A8745N1173Q693L602m5597l1208j2761J4554J6172l5315n3897l722L8204
15390c1357M2958K4510L9044O514l9281k4521j6929O379J2587m153l4485m8776
15378f7510l895M8412K8822K4887O910N612j5783p1817m1125j087J6808K4537
15366d5229K5849L3435p817m831j7120o670L9810J0259n2946K3317L4162L543
$$ y = [-71254, -46349, 21732, 84340, 51524, 33884, -3311, -7078, -6597, -44548, -77612, -98898, -77972, -90295, -117503, -108823, -73076, -8535, 16889, -5251, -2214, 37980, 24130, -52003, -55442, -18445, -2623, 5997, -28695, -39710, -52889, -69785, -21701, -5251, 36165, 30849, 3374, 31052, 68743, 63562, 5498, -37336, -34893, -57134, -81371, -86102, -15301, 8494, 18745, 69918, 78611, 82213, 36616, 5408, -7353, 7201, 23373, -11942, -65839, -69561, -31357, 11601, 36111, 75155, 81669, 42388, 17867, 938, 7317, 19904, 15751, -18734, -67510, -71405, -22993, 5829, 30716, 37626, 43238, 27455, -44362, -85487, -86574, -69766, -45229, -19380, 14055, 6238, 1407, -15713, -22383, 17427, 27686, -25260, -1943, 32219, 35762]
15354C5762l8324m526Q513J6058K735j9761K0919J0581j7891m7751l1410M7318
15342a7777J5998j6314L674k0541K5783L3542Q743l58r899n0650r872j2033J8113
15329c1591r407L1763R902j9740k8103l6953K9925j033K0017J3318K0441P012
15317E551L1545o4061m3089Q292J2970j892M0297j3267k1168O5250j3339Q549
15305A5638k0814R118J212l0480k3587N9456J5724n312j4273k2738Q189j0510
15293a8377j9765j0043j5825L1854M3653L5152j585k558j0929r735J1183j7086
15281A5939J4447J69m9285J5941M9011J2352k7172j8472j9256m7274K3016L9505
15269H921P769m8318l5092J4034p82l7303M35O2257J1909m1705q654j9457J1307
$$ y = [35762, -2562, -7088, 1425, 17483, 20218, 457, 21376, 31957, 14066, -33685, -65095, -17777, -1779, -18093, -14419, -34960, -9177, 24365, 33108, 32750, 22851, -27799, -37671, -49704, -31591, -40998, -9235, 667, -19073, -47176, -84129, -54204, -55237, -35220, -21902, -1461, 5551, 37096, -26965, -70054, -61762, -48792, -50684, -10387, -23654, -44822, 20428, 7089, 15638, -5176, 3942, 5154, -25326, -48913, 10543, 26267, 20955, 6682, -16056, -7867, -18377, -38142, -48185, -64010, -32156, 11497, 46649, 45064, 42506, 31577, 21842, 33025, 15939, 30386, 30555, -18730, -2789, 46222, 58574, 31402, 12930, -6326, -53600, -30584, 8921, 16690, -31628, -66720, -52686, -53468, -90771, -90336, -28079, -16170, -57875, -66529, -85986, -74679]
15256g4679r767K1837L5201K4872j0316l7588K177K4748L3795J1719K592l2572
15244g981k6049J6936J7241k9500j541J984K4865k6853k1337J5396M5269k0932
15232a2502J2796J8020m0922r371L3911M3635j5737j9739l1121j4972K2196l1367
15220d5173p058N414K2214K0444n9178M942L4622M4603j3029r59j355m2771k1784
15207e9068J7733j755K2943L919L7J6600L2505K9857J3406n052k7962n5613M0102
15194B7652l3246j7018K5380l8026j4775L7458r627j1954K0548k5469m3532N6508
15182b6101P6442L0152L192k4061p9828k7821k1284N4662M8488M9762r516K605
15170G6692j1086o7246p046j1013J990K8879J8280J4444J219p289K8645n2864
$$ y = [-74679, -84446, -62609, -27408, -2536, -12852, -50440, -48263, -23515, 10280, 21999, 24591, -7981, -34030, -17094, 147, -29353, -30894, -28910, -4045, -30898, -52235, -36839, 8430, -12502, 294, 18314, -22608, -31979, 1932, 45567, 29830, 10091, -21030, -36002, -13806, -45173, -52231, -46817, -24603, -4159, -63337, -58395, -23773, 20830, 7801, 6842, 5487, -37284, -59068, -41335, -43090, -20147, -16228, -16191, 409, 32914, 62771, 76177, 71125, 43163, -12450, 27652, -5594, -22612, 2768, -35258, -50033, -12575, -22202, -34156, -13608, -39077, -82609, -26101, 50341, 80493, 83685, 59624, -20204, -48025, -69309, -14647, 33841, 83603, 74087, 76692, 65606, -1640, -8686, -19699, -17709, 11170, 29450, 43894, 45113, 37824, 66469, 13605]
15158A3605r311p021j3184J801N762J4863O2571J9399p859m0622l7277n7048q612
15145f2933J3236O896L2862N3484l109m1789k5857l0471J5450K1887M925j1336
15133b6755L4505m8091l6167O1381J2969n298J2342j5915n3098p256J4841N3849
15121b693n450K594K5640M2129j9015l9578K1466k5349l7516K0850K9611J6391
15109B9080K2450l402n9885K9504o767N656J9497r039m8584L2132K3503k5761
15097H384q221M283n75M5391m8360J661J3059l7394q370M377P0345K603k1324
15084B5859j0678l824j1987o014L951K9993K7152L4743O628J3699m4399L261M4873
15071A13257j6167o0271m4752k5496l1775J9754J1822m5874m3313o453M4884K1021
$$ y = [13605, 4294, -2727, -15911, -14110, -8348, 6515, 69086, 88485, 80626, 40004, 2727, -54321, -62933, -49697, -42801, -9939, 43545, 40436, -1353, -27210, -57681, -42231, -20344, -15419, -26755, 7750, -40341, -76508, -15127, -2158, -7456, 4886, -11029, -64127, -71383, -56542, -2693, -8143, -5549, 20091, 62220, 43205, 3627, 25093, -256, -37772, -16922, 12689, 29080, 51530, 48128, -11757, 17747, 10980, 16636, 36133, 27094, -21490, 10642, 34145, 8384, 163, 4446, 3871, 49262, 902, 2563, 15622, -21772, -30142, -25765, 44580, 47183, 25859, 15181, 11357, -630, -6644, -2693, 27300, 54452, 89195, 95823, 109522, 65123, 68384, 113257, 97090, 36819, -7933, -33429, -65204, -45450, -33628, -79502, -122815, -129268, -84384, -63363]
15059f3363j3571L8705M499k8544j5701L7724N7753N0136M3600j4995p2285j8854
15047E104l6976L2060n715q682P781k1083j1303k2842n7190j0469O949O0610K8659
15034c3097o2243p316Q4102R436K4732L548J066j9711m9799R433Q040N3858J6284
15021C8333p4383l879M8556l09l9276k1834m957J8596Q896n506j5796j0493p601
15008f9653n425q567K0658k0976Q061M5735j6284o524N9187L7678M944n4808l5737
14995d1711j9257N9244J4372J3745O1140M4101m2003p6814M2520L5996p278m0267
14983D3788l6409l2483l1941J7228j7073J5337J7322J0816J7764L849q708j8605
14971a9115j7165j2591m3956L0331N8588M8288J9292r464r540j5550L7297k2727
$$ y = [-63363, -76934, -38229, -33730, -62274, -77975, -40251, 17502, 67638, 111238, 96243, 23958, 5104, -31872, 188, -5527, -14209, -6428, -27511, -38814, -61656, -118846, -129315, -122366, -61756, -33097, -95340, -102656, -18554, -9118, 15614, 19162, 20228, 517, -49282, -39849, -31809, 22049, 38333, -36050, -39929, 8627, 8318, -30958, -52792, -57749, -39153, -30257, -35763, -51559, -62052, -69653, -75078, -83645, -62987, -83963, -75902, -30167, -46451, -52975, 6212, 43890, 48834, -5974, -41711, -60968, -1724, 12648, 26393, 87533, 131634, 89631, 12817, 55337, 91333, 84055, 43788, 7379, -25104, -57045, -39817, -56890, -41553, -24231, -13415, 4349, 8198, -510, -19115, -36280, -48871, -92827, -62496, -3908, 44380, 63672, 54208, 44668, 29118, 66415, 43688]
14959D3688K3442l4271l3195K486J2789J1914J650k631J2863k201j293J1560k502
14946D4299j2863l5719r106R545M6796L424j2838J5514N282l1961P651j9696k7671
14933a7343Q533L145L5564K9304J703Q05k7044J3917LO281j0805k8237N789K5954
14919D7569k1651l5171l7865N260K7895l715m6091K6259j522j3863J9208k0190
14907e3877l1674J380K2707K2333k2733L4087J6473M8942j1022k3636J294j1751
14895g477P287j3642k7750k7495M4284L742k0068j7963K4106N2567L2209k544
14883D7256R398k3528m7017J2934J9248L0637L2363j4861l1518l2210n8930m9565
14871a05793L2819O6792M376j9684J2390K4484k6707j749L5890L5036R179l8081
$$ y = [43688, 67130, 32859, -336, 2150, 14939, 26853, 28503, 25872, 38735, 36534, 35241, 46801, 44299, 31436, -4283, -13389, -3844, 42952, 46376, 33538, 49052, 54334, 22373, 30024, 10328, -17343, -8810, -5665, 29899, 59203, 60906, 61711, 34667, 48584, 48587, 54868, 44063, 15826, 21615, 47569, 25918, -9253, -47118, -41858, -13963, -17678, -63769, -37510, -39032, -52895, -33687, -53877, -85551, -84171, -61464, -39131, -61864, -27777, -11304, 37638, 26616, 2980, 4274, -7477, -190, -13832, -41582, -69077, -24793, -21051, -41119, -59082, -34976, 17591, 49800, 47256, 56654, 33126, -13891, -957, 18291, 48928, 81291, 66430, 34912, 2702, -56228, -105793, -72974, -6182, -1806, -21490, -9100, 15384, -11323, -13072, 22818, 57854, 67033, 28952]
14859B8952M226K1714j1750J2957k3177j3828K812l7712L8946L5642q648j4411
14847C5723k2539R64l0825k820j7232m6895J5077K3309O364K7028j8137Q313K607
14834a9063M3222k8919j3844O647M708k662l6362o475M230M046O32O219O8746
14821C1125L0372n1111R264L2561j6545K1762O107P329L8549K3859n5442k8518
14809D9312L216m841r494m0426L0145L7441j4977P633l0411Q083N3238k6502j3037
14796D9380L88k5949m3398O976k979J6489k1564m6519m8008o023R3730O9685J5223
14783E7431m787M016l6729k6534K5723J2191l6334l7221j5788P643R036O28M772
14770c5953K5359p007k9699M3577P5950K3767k0726l0538J0154k423n4269J5882
$$ y = [28952, 33178, 54892, 43142, 56099, 32922, 19094, 21906, -15806, 23140, 58782, 50134, 35723, 13184, 14148, -16677, -19497, -36729, -83624, -68547, -45238, -38874, -11846, -29983, -21670, -19063, 24159, -4760, -18604, -11957, -7249, -9911, -46273, -52748, -48518, -44472, -43840, -37621, 31125, 61497, 10386, 19650, 52211, 35666, 57428, 63535, 70864, 109413, 133272, 77830, 49312, 52528, 47687, 38193, -2233, 27912, 65353, 50376, 58009, 27598, 35681, 88919, 62417, 49380, 49768, 23819, -19579, -12603, -15582, 907, -20657, -67176, -115184, -121207, -27477, 42208, 57431, 52644, 56660, 19931, -6603, 19120, 31311, -5023, -42244, -58032, -50389, -41353, -40725, -35953, -10594, -17601, -47300, -3723, 72227, 95994, 75268, 44730, 54884, 52461, -1808, 14074]
14758A4074N6722K8006k7777j03356k0068N3763m432L396k026l6293j0421j4242
14746f2654J6262L3627O3636l8820l4526M177K0666K6172j8233M3453J8976l0595
14734D2141p6645m3522N2762K9058J8450P224p695K3145k424k6287J1352N1465
14722G9024k0588m4564j6666n0062l5569K5054L8190K7035l199k2267L449J7529
14710b634K7677N824j2524N790k5312R089R718m5762J3511j8618m342j3791K721
14697d8653L0908N1706M7046L8241p2555n4781j5069l2317m4419J3381O1848L3283
14685H619K5273J1862O239j8417k6186j2316N5890M1126j0728m6467K6153L3362
14673I4410J665m1924m3260l4248k8873l2716L6315K6577k08l3101Q06J0842K7110
$$ y = [14074, 70796, 98802, 71025, -32331, -52399, 1364, -3068, 328, -1698, -37991, -48412, -62654, -46392, -12765, 50871, 12051, -22475, -18298, 2368, 28540, 10307, 53760, 72736, 42141, -34504, -78026, -25264, 3794, 22244, 29468, 21773, 44918, 42494, 16207, 27559, 79024, 58436, 13872, -2794, -52856, -88425, -63371, -25181, 1854, -1345, -23612, -20163, -2634, 25043, 30867, 18343, 24133, -1179, 7910, 17628, -28134, -14623, -33241, -37583, -51374, -48653, -17745, 33961, 81007, 119248, 46693, -8088, -23157, -55474, -99893, -86512, -24664, 8619, 33892, 45754, 51993, 33576, 7390, -4926, 50964, 92090, 81362, 34895, 61048, 94410, 96075, 54151, 10891, -23357, -52230, -84946, -48631, -22054, -22262, -55363, -54557, -43715, -16605]
14660a6605M9688j5686q7882r710O107L0667K8540K8500J5046j0245k0076O143
14648D487L8127J7329O619l7041l7136K1901q314k0950j0395M66N211l5130R934
14635d4892L3072J9244N9198L135m1913m5649m2975k6354j1845L3790R9146K8052
14623F2009j8355o182m0195k2417M548L530M0850j5227o9590L7083K1293n877
14611h530p573k4236j3311j0224o409k0978O490J6272j4890j8430J2796J03025
14599A4002N0298j784k11p619n8789j5835q748K6457M4054j1718o712k4192j8087
14586a8884J4377K4318m6357L5655J0423J9681N640o3664m3511N0396Q7005J9016
14574I4095k7131l5252N910j0676m3751o512L2117M5947j9441n1730j8575O653
$$ y = [-16605, 33083, 17397, -70485, -80195, -74088, -43421, -14881, 13619, 28665, 18420, -1656, 4487, 42614, 59943, 66562, 29521, -7615, 14286, 5972, -14978, -25373, -24907, -19696, -54826, -44892, -11820, 7424, 66622, 69757, 27844, -17805, -60780, -87134, -98979, -65189, 33957, 62009, 43654, 37472, -2723, -25140, -20592, -17062, 23788, 8561, -61029, -23946, -2653, -8530, -16103, -40339, -53650, -63874, -70283, -91261, -84771, -68499, -83389, -101819, -89023, 14002, 64300, 62516, 62305, 54686, -4103, -19938, -28686, -2229, 41825, 30107, 23395, -797, -18884, -4507, 19811, -26546, 9109, 19532, 39213, 44853, -18811, -62322, -11926, 75079, 94095, 66964, 31712, 37622, 26946, -16805, -23317, 8800, 54747, 35306, -16424, -34999, -28346]
14562b8346J5878J9785p65k9311k1978M7190L4914k1631K8806K8653J7675j8230
14550G2640q1050l6788J0862P6167J4644j0475q75l491k8167J4519M1682M4428
14538A14096M9075o1771k6588K8857k3629n608J5739p2066p5116l5672N483M8210
14526c8990L977r728M2722N4667J3104J5890j1395o635o1837m3711N324J9845
14514a6767j7893l3719L5072o072j0335J3704K9924k0757k4417j4813m1931l55
14502a08359J6500L7722M611M096M568J3666L2600o131q461n2883N6653M9577
14490D4159j2224J9556j4817l3448M757J6735R677J2977J0729L1013J8295k2394
14478H5015M364p141J7815m0666p3853L1733M0809R550k8461J164L206j7440N439
$$ y = [-28346, -12468, 7317, 6552, -22759, -44737, 2453, 37367, 15736, 44542, 73195, 90870, 72640, -8410, -45198, -34336, 41831, 56475, 46000, 45125, 41634, 13467, 27986, 69668, 114096, 163171, 101400, 74812, 103669, 80040, 74432, 90171, 18105, -57011, -92683, -87200, -38990, -35013, -44741, -2019, 52648, 65752, 81642, 70247, 63612, 1775, -41936, -36612, -16767, -34660, -68379, -33307, -39379, -49714, -36010, -6086, -26843, -51260, -66073, -108004, -108359, -91859, -54137, -49526, -45430, -40862, -27196, 5404, -727, -9188, -62071, -5418, 44159, 31935, 51491, 36674, 3226, 7983, 24718, 34395, 47372, 58101, 89114, 107409, 85015, 89379, 82238, 100053, 59387, -14466, 17267, 58076, 67626, 39165, 40329, 43535, 26095, 31534]
14465C1534k4194m0418j1399K3217Q221J6824j7927k2840L6606Q9702j815n0159
14453C7352K18J0025J6823N742r785m6383J0721k2883j2654O311Q16L1234K5252
14440E2789j4588l0556p7910k369M0913L6755L0995K5168J9604k7137k7253l7065
14428a0654k0601j6882J5583L0716O9544K6866L5184j1953n8131q3031J6950N8338
14416E1929k375j9862N277L427p955q491l9687L858L3295J5820J1758l4334J6440
14403B9100O159r7J0508o8355j7186L8486L9794j0219O308K973j3489m242k7291
14390g551l090R940J8245J0552j2673K0790J9921j5265r002j0194J7790k5361
14378A4102q0954k0165N2338O3004k5184K403l1743j8349J302K427L3108N476
$$ y = [31534, 7340, -33078, -44477, -21260, -13039, 3785, -14142, -36982, -376, 89326, 87511, 37352, 37570, 47595, 64418, 70160, 60375, 13992, 24713, 1830, -10824, -4513, -3697, 27537, 52789, 38201, 7645, -70265, -72634, -31721, 5034, 36029, 61197, 80801, 53664, 26411, -10654, -31255, -48137, -32554, -1838, 67706, 94572, 129756, 117803, 59672, -23359, -6409, 51929, 49554, 29692, 34969, 38396, 30441, 21950, -17737, -13879, 19416, 35236, 46994, 12660, 29100, 35259, 35162, 45670, -22685, -39871, -1385, 38409, 28190, 34498, 37471, 23982, 19740, -7551, -10641, -701, 17544, 28096, 15423, 36213, 56134, 40869, 31867, 21673, 39463, 14102, -66852, -87017, -34679, 28325, 3141, 5544, -26199, -44548, -43246, -40819, -7711, -2235]
14366b235j0927m3859k5309N4015M0751K8268j457r26o0298m2512K9963L8679
14354D153M3415k5406k7484K4565k7109j7158R198m3236k310J7791l345j7654
14342f4580m88M5435K6956k3122K8699N0571k0173j4815J5085k1796m6879k4923
14330e0030k2528j8342o498K3662j2090m0123J9555M7676N6482M2296M0590l6190
14318D4460j6535j3764j0092m7569M655j4015q307K2397J0660j676m2737O1667
14306a0856m845k3255J6527r333N814L1809j6457m2452J8810K649k5673k3087
14294h0349L9904R746n985J7427Q6903m1116k9782L594K2186L7395j406o8004
14282i487l2612R341l5241K3856K048O4357M7425N231O712J6183j9375n2581j7959
$$ y = [-2235, -13162, -57021, -82330, -28315, 12436, 40704, 39247, 38321, -21977, -64489, -34526, 4153, 47568, 22162, -5322, 19243, -7866, -25024, -15826, -59062, -61372, -43581, -46926, -64580, -65068, -19633, 7323, -15799, 12900, 63471, 43298, 28483, 43568, 21772, -25107, -50030, -72558, -90900, -97398, -73736, -85826, -125949, -106394, -58718, -2236, 40060, 80650, 44460, 27925, 14161, 4069, -43500, -38845, -52860, -61167, -38770, -28110, -29786, -72523, -10856, -15701, -38956, -22429, -31762, -25948, 5861, -10596, -53048, -34238, -31589, -57262, -80349, -40445, -30699, -36684, -19257, 67646, 26530, -3252, 342, 22528, 59923, 58517, -9487, -42099, -32758, -67999, -44143, -42095, 22262, 69687, 74918, 81630, 97813, 78438, 25857, 7898]
14269G898K2856l2554m5137N110k82M9300K9891J6125R463l6294n383L637j786
14256B2844j6861J3320K6903P983r860k3621m8429p0140J0658O7211K6601Q677
14244A5286L8309Q395m2668p4083m955Q467L5574M0021Q178j6244j7160N544L56
14231E020J1912L6514m0082j3308l5918P050L0186J5424n2787m0854l1601o949
14219a15393N0390L1588L874j6792L1475j5097K5760K1549m1366n2721J4206K8363
14207c4164L7068K441J6328Q0941k2485q2031j0163j1081K0097K9287P030l9378
14195f110k5014P938M228j7857N955J8686J3392l0692j9679K0349J0703L1424
14183A3323K8452j7797k8627m9740k311J5354J3579K0036l7486K1734O3462R793
$$ y = [7898, 30754, -1800, -46937, -41827, -42109, 7191, 37082, 53207, 62670, 26376, 20993, 24630, 22844, 5983, 19303, 46206, 54189, 44329, 20708, -27721, -97861, -87203, -19992, 6609, 15286, 53595, 61990, 19322, -54761, -59716, -51249, -15675, 24346, 32524, 16280, -880, 4664, 5020, 16932, 53446, 13364, 56, -35862, -28812, 1374, 16798, -35989, -76843, -108444, -115393, -65003, -33415, -29541, -46333, -14858, -29955, -4195, 17354, -24012, -76733, -62527, -34164, 2904, 5345, 21673, 102614, 80129, -1902, -12065, -23146, -3049, 26238, 33268, -6110, -31124, -23186, -18958, -36815, -30860, -12174, 1218, -29474, -49153, -28804, -18101, 13323, 41775, 23978, -4649, -54389, -56700, -41346, -27767, -7731, -45217, -23483, 39979, 49772]
14171D9772p704K0194M8700p0110q7194K9695K0900k1404O0862k6524j8291k2155
14159b3259m0344O6931L3744k875L1627k162k568r22k7436J0583k4585n7632k4489
14146f3387K2594j4138M208Q5791L1238j6319n163p04m7993R505j0923L6003K0330
14133E1042o3575l1959J1132j3139K4666O138j1191j2236K1628L5121m2362K2847
14121a888K0211k5447L9536j8448l355N4244n5838j2413K1818l55k4105k0758
14109b6798k3253m6792O650L5572J1752J9470J8972J4725L7419m5778l7989L5168
14097h82j3659P730q480l1796K946j0288M0283J6539l7212l3746K497j642L5039
14084c2671K8336k6960j9417J9218N226N929m883k8863o5242K6909K9194L2129
$$ y = [49772, 42068, 62262, 110962, 40852, -46342, -16647, 4253, -17151, 43711, 17187, -1104, -23259, -63603, 3328, 37072, 34197, 65824, 63662, 61094, 60172, 32736, 43319, 18734, -38898, -63387, -40793, -54931, -50723, 35068, 66306, 49987, 44824, 44120, -3873, 5632, -5291, 30712, 51042, -12533, -44492, -33360, -46499, -21833, -15695, -26886, -39122, -17494, 17627, -24735, -1888, 18323, -7124, 32412, 13964, 10609, 64853, 9015, -3398, 18420, 18065, -6040, -26798, -50051, -96843, -90193, -54621, -42869, -23399, -4427, 10298, 47717, 1939, -36050, -882, -14541, -6811, -15291, -47087, -44141, -54429, -14146, 2393, -34819, -68565, -66068, -67710, -32671, -4335, -31295, -50712, -31494, -26268, -20339, -25222, -54085, -119327, -92418, -63224, -31095]
14072c1095M9865M7507k713m0583l2716n3279J759L1988L4100m1705J5688N46
14060b0638k6093m0651k5684J6642J6594K9182L1243K6563K6370l7962J0246J7932
14048B3744n9435k8396J2411O494R60P525L7145P30m54m8501l2690J2839O46M3144
14034b3838L3787m4106O9291K7892L0106J9002n5574q6040j1137L3987N0185r945
14022C3610j0351k6261j8122Q260M1123n163k6054j969q674M0040J4822k7583
14010A3678k3441k4510j700j2335L6196P227j4409k3568K0111L0719L004m617
13998F355L2764M727m4400j4771J8226J9583j8356j0784J248m185K4553j8787
13986c827K1376O6551n0015n0653q097J5324M521L7094J6696j5804J5042k1609
$$ y = [-31095, 18770, 66277, 63564, 22981, -9735, -63014, -61255, -29267, 4833, -36872, -21184, -20638, -46731, -87382, -113066, -96424, -79830, -50648, -19405, 7158, 33528, -4434, 5812, 23744, -35691, -64087, -51676, -45182, -44222, -36697, 448, 1178, 724, -47777, -80467, -67628, -66982, -23838, 9949, -34157, 35134, 63026, 93132, 112134, 56560, -29480, -40617, -6630, 43555, 33610, 23259, -3002, -21124, -12864, 28259, 23096, -2958, -4927, -13601, 26439, 41261, 13678, -9763, -34273, -35973, -48308, -12112, -4885, -19294, -42862, -22751, 7968, 10972, 6355, 39119, 43846, -554, -15325, 2901, 22484, 4128, -6656, -5408, -9593, 14960, -3827, 17549, 84100, 34085, -16568, -24665, -9341, -4820, 32274, 48970, 33166, 48208, 26599]
13974B6599r388k896K8278j696m1122M835Q635j3699Q168Q0558L6767K6575l0784
13961A20830n0950K2759j8782p2500m5051L3817p990k1238R009O7425J3965P471
13949E8765j3143m1066k3763L2092J7536J3916k6367J8956J7283m723L8519J4604
13937A02609o7863l0361r801m2445J9103J5397l4390j5859Q9760L7250n8577r993
13925e170K6486j5007O108J3182k3669l7521O2485J6363K1137o84q399J7918M8197
13912A21426O096m3445k8996n0179N21M6995M93l3509L7360m067p7007r97O814
13899a8495K8638N0091k2259o5129k691M1051J2632k4589l5090L0258K9415p544
13887A6288l867j8550K3026O2613O177K7397L4054l5839o6857p9519k5343j8387
$$ y = [26599, 17211, 14315, 42593, 40897, -225, 4610, 13245, -454, 7714, 88272, 125039, 151614, 120830, 69880, 92639, 73857, 1357, -43694, -9877, -17867, -39105, -30096, 37329, 51294, 58765, 45622, 4556, -19207, 12885, 30421, 44337, 17970, 36926, 54209, 49486, 88005, 102609, 34746, 4385, -5416, -47861, -28758, -13361, -47751, -63610, 26150, 63400, 4823, -5170, 21316, 6309, 12417, 25599, 1930, -35591, 26894, 43257, 64394, 63710, 55311, 73229, 121426, 127522, 84077, 55081, 4902, 5423, 52418, 52911, 19402, 56762, 52695, -24312, -25309, -18495, 10143, 60234, 37975, -27154, -29845, 11206, 23838, -751, -35841, -5583, 23832, 16288, 12421, -6129, 16897, 79510, 85687, 113084, 147138, 111299, 44442, -35077, -60420, -78807]
13875g8807M9777P997q043j1484L6446k7153J9790P7121K9432k0820p034m2209
13863B5013k444j3624m230r53j2458M3722J7773j3907m4248j64L0638o42J2737
13850C7213m225k2410K6916J6328n8424k3963O219J7465N1500j447j5902j1566
13838A7704J6396N3802l5499m8062j4811N498M278l437J8868m0915k5934k2587
13826g4699k6312M8607L0504J7900M2051J8194L284j9040k5515N208L6432j2982
13814D3632j1407J166j8979Q580K086l6116n6045k4494L1463N8406K4593p3881
13802e0996m257O4426L4185k1239j8792k6486K1708m629R541K8708m2580j4107
13790b4518R077k4987j6082J7043M5127M1005o627O939n160p183N130j9438k7325
$$ y = [-78807, -29030, -21033, -29076, -40560, -4114, -31267, -11477, 65644, 95076, 74256, 67222, 25013, 22569, 8945, 4715, 3762, -8696, 35026, 52799, 38892, -5356, -5520, 25118, 24476, 37213, 32988, 10578, 37494, 53822, -4602, -28565, -22346, -4881, 46619, 45172, 29270, 17704, 34100, 87902, 52403, 4341, -10470, -4972, -694, -4131, 14737, -26178, -52112, -74699, -101011, -52404, -21900, -4000, 38051, 56245, 59529, 40489, 14974, 20182, 56614, 43632, 32225, 33391, 14412, 22992, 25078, -11038, -67083, -91577, -60114, -1708, 22885, -50996, -55253, 9173, 43358, 22119, 3327, -23159, -1451, -6080, 3461, 32169, -10411, -24518, -15441, -40428, -56510, -39467, 5660, 46665, 40038, 46977, 41817, 34634, 39764, 20326, -6999]
13777f999J590o498l846M6152R451j5869j4074k3778j8894K3923L8820l6099k9476
13764c5597O559J9082j4634M187K0235j9236n069J9128K0190L6790k1034J5890
13752D6491j8350J4391k0316K405o6176j8253L6330J8774J1006M272k186J6109
13740B4497K5022q492P20L089j560j4588R064N6805N184k7262J1304J0686k3816
13727G0653j1071n3592m0191M1960q070K5697O371m4219j3378L4093K284K0101
13715C0638J2337L1960O594k4984K790o183k7833p8995r3988Q8618J23859L5231
13703A00044j186Q871m2688l6647l5914J7603N0755K5236l4196l0064J8884j0852
13691B9846L292K7655N100q2657K3378J3694N2217M92r905r983l2672k3173l3665
$$ y = [-6999, -5409, -11907, -15753, 30399, 39850, 23981, 9907, -13871, -32765, -8842, 29978, -6121, -35597, -29038, -9956, -24590, -20403, -168, -19404, -24473, -5345, 14845, 51635, 30601, 46491, 28141, 42532, 22216, 24621, -41555, -59808, -23478, -4704, 6302, 10574, 8388, 24497, 49519, 41027, 41747, 44836, 43276, 28688, 37752, 94557, 99741, 72479, 83783, 94469, 70653, 59582, 5990, -34201, 7759, -311, 25386, 31757, -12462, -25840, 8253, 10537, 30638, 42975, 74935, 81529, 56545, 59335, 53152, 25319, -53676, -147664, -59046, 64813, 100044, 98858, 107729, 65041, 28394, -7520, 10083, 60838, 86074, 51878, 21814, 40698, 29846, 33138, 60793, 65893, -16764, 6614, 20308, 72525, 73017, 63112, 53129, 20457, -2716, -36381]
13678c6381L445k7082K7926J8190r655K6630K6025o3186l7123m4408J4664O3891
13666c7064Q049j76O638N3491L0859j6738j9865k3960J3048j6901k1524P4223
13654E0080P2595j7766n4968l2794N3041j6734L2926K3710l9142k209K5303K9470
13642A23512J9099k370m4970k9870K6923J4688J7326P487m4192k5318R624j4046
13630E7893m1753m3871j9777L3175N1414M0781j7883m2481l9277j8730k3987L2174
13618c2322L3839J8567M6401j9381J3345k5164l3713j078p035N024M8005K1829
13606F8317l5285j1320K017J3416q427k3846l5370k2778Q6544R271K2307P8311
13594A43157k4061o0719k9165J1754K8196K8203O471L2052m0463o7867j9776l1972
$$ y = [-36381, -32936, -60018, -32092, -13902, -23557, 3073, 29098, -34088, -71211, -115619, -100955, -37064, -29015, -29191, -22553, 30938, 61797, 45059, 25194, 1234, 14282, -2619, -24143, 50080, 122675, 104909, 49941, 17147, 70188, 53454, 86380, 110090, 70948, 68739, 94042, 123512, 142611, 140241, 95271, 65401, 92324, 107012, 124338, 131825, 87633, 62315, 71939, 57893, 16140, -27731, -47508, -14333, 37081, 77862, 59979, 17498, -21779, -40509, -64496, -32322, 1517, 20084, 66485, 47104, 60449, 35285, 1572, 494, -6541, -1517, 46488, 68317, 33032, 21712, 23729, 37145, 28718, 4872, -30498, -53276, 33268, 42539, 64846, 143157, 119096, 58377, 29212, 40966, 69162, 97365, 103836, 135888, 95425, 27558, 7782, -24190]
13582b4190m971O903m590J917M6341K2011m9199K2310R2640J3201M523j5855K9598
13569A40639k2196k6571k2540j2619k4864K270J7120j7357m2158M1492K8616L2208
13557I4040l2778j0001O041K3815N390m3643m2023n146J5211J4723K4520J4810
13545F4959j2281L8834L6576L0437J5778j2682m2278m6918l1030l2348k7998O8215
13533D9264L8168k8536l6990m5400j3548J7026k836N2013m060o1686k3378M4356
13521a5607P3345O052J9584o4120k859K4087l566j2259l1653j7494L6138L6515
13509D8163p964n0131q946o470m136L0314N2926L1913m1365J4811j773J6124J702
13496G5168k5084o497m601r732k4456K1334L9296m1556j625K1450J4995K4126
$$ y = [-24190, -29161, -22258, -26848, -24931, 21410, 43421, -5778, 16532, 109172, 122373, 126896, 111041, 140639, 118443, 91872, 69332, 56713, 31849, 34119, 51239, 33882, -8276, 33216, 61832, 94040, 61262, 51261, 57302, 81117, 86507, 42864, 841, -4305, 10906, 25629, 50149, 64959, 52678, 91512, 128088, 158525, 174303, 161621, 119343, 72425, 41395, 9047, -18951, 49264, 87432, 58896, 21906, -23494, -37042, -20016, -22852, 29161, 25101, -36585, -59963, -15607, 57738, 63790, 83374, 19254, 16395, 40482, 36916, 24657, -6996, -24490, 11648, 48163, 40199, -9932, -18878, -25348, -29484, 830, 53756, 85669, 44304, 59115, 57342, 73466, 75168, 50084, 43587, 38986, 29254, 4798, 26132, 65428, 23872, 22247, 43697, 58692, 82818]
13484H2818Q958k653r4621p672K0908L3075M0231o919k9899j8921j2124J3124
13472B6305K3685j4954j3083Q066J5189o627Q525M68N3141J4740m6010j5477L2403
13459H6371j1485r072k5950J0321J2112K1655j2491l2393m4927k1240M9755L6799
13447E9455m9408n6102J1176P2810M0651j8747n6310l490L5046K105J0366m6685
13435H67N712Q483n7502k3112J1530N3729M054j67J5893N5023K3683L3199K4470
13422A55862n0213n6094K329l3478K5626M6919j1779q93o121J3032m5685J2554
13410E2059M7614P374n6846m6870k9059m635K5188L7596O5291k2703m641J5321
13398H5689r314j4193N094p18j2974r026j4251N1033M5238J3048k8022j8184n1865
$$ y = [82818, 91776, 89123, -5498, -13170, 7738, 40813, 81044, 74125, 44226, 25305, 13181, 26305, 49990, 35036, 21953, 30019, 45208, 38581, 47106, 47574, 100715, 115455, 69445, 53968, 86371, 74886, 65814, 39864, 50185, 62297, 83952, 71461, 39068, -5859, -27099, 22656, 59455, 10047, -46055, -34879, 37931, 78582, 59835, 3525, 35, 35081, 37186, 47552, 867, 6579, 15062, -42440, -65552, -54022, -293, 3761, 3594, 19487, 74510, 98193, 131392, 155862, 105649, 49555, 51884, 18406, 44032, 90951, 79172, 78279, 72158, 85190, 39505, 52059, 99673, 107047, 50201, 3331, -25728, -30363, -5175, 32421, 97712, 75009, 70368, 85689, 76375, 62182, 67276, 66558, 53584, 44558, 30307, 81340, 126578, 139626, 111604, 93420, 41555]
13385D1555n0171j6295K8320O836j5844K4937L9695Q148K2974K2079j9013n9199
13373C4022j4869l8705m5293N972j631P614K0589o972J929N6839J8101j6730J9580
13360D0446K5509M716k3222m4260L993K1634K1450K7349Q9m948P332J7043o4475
13347C2656k1014M266k0313Q4495M9819l7027j9611L1201k4502M8095K2343K2953
13335A73361l0717n0265K5592K2599l2632J906K7086j8759k8585K7827J505N151
13323A24069j9008k3803j2730j6362j3149M3850K8256q117k1406l0629j3319K3011
13311F0663J4026q524j8284J4220r840k3495l6527J6157K6018J1071K3527M2792
13299A11804K8205k5406K0714K5823p914n9477n9275l760J0088k875L285J8628
$$ y = [41555, -8616, -24911, 3409, 10245, -5599, 19338, 59033, 67181, 90155, 112234, 93221, 34022, 19153, -19552, -64845, -58873, -60504, -52890, -32301, -39273, -37344, 19495, 37596, 20866, 40446, 65955, 70671, 47449, 3189, 7182, 28816, 50266, 77615, 77704, 72756, 80088, 97131, 32656, 11642, 15908, -4405, 80090, 129909, 92882, 73271, 104472, 79970, 128065, 150408, 173361, 142644, 92379, 117971, 140570, 107938, 109844, 136930, 118171, 89586, 117413, 118918, 124069, 105061, 81258, 68528, 52166, 39017, 82867, 111123, 103006, 81600, 50971, 37652, 60663, 74689, 66165, 47881, 62101, 52261, 28766, -7761, 8396, 34414, 45485, 69012, 111804, 140009, 114603, 135317, 161140, 153226, 93749, 34474, 30714, 40802, 37927, 41212, 59840]
13287E9840M4120J9419J9345m109q2716q05P1878J2659K3483j4814k8521l5840
13275H3939p558j335l3980j8693k143p775L8742M4457m2677l3916n983n926M9693
13262E6845M6345m5374J4384L009m6488K3947k131j5580L6029P199n6128L8420
13250F0477N4224J2007l9618p8521l7232R727L8085j7604O933K0521M4971j4516
13238E9454M0447K4265j4746l9386O855j5374k449K2222J423l36J7652K3143J698
13225A24868j6663n0866N2255Q667J5383m8872o1584J8021q63K982j3499k9725
13213A04M4313M899l4958O508n181p553M4274M7775n6490k4093l6173L2046L8055
13200E3526k8086Q219Q1681J8396l4919L739K4523j4738K1196o424m1595j0153
$$ y = [59840, 103960, 123379, 142724, 138615, 55899, 55094, 126972, 139631, 163114, 148300, 119779, 83939, 76381, 75046, 41066, 22373, 20230, 12455, 51197, 95654, 52977, 19061, 13078, 7152, 56845, 103190, 57816, 72200, 75209, 28721, 52668, 50537, 34957, 70986, 78185, 22057, 60477, 114701, 126708, 87090, 8569, -28663, -18936, 19149, 1545, 8478, 28999, 73970, 59454, 99901, 124166, 109420, 70034, 76889, 61515, 59066, 81288, 82711, 82375, 100027, 123170, 124868, 108205, 57339, 109594, 118261, 133644, 84772, 23188, 41209, 40346, 43328, 29829, 104, 44417, 49316, 14358, 20866, 15685, 8132, 52406, 100181, 43691, 19598, -16575, 15471, 53526, 25440, 33659, 115340, 133736, 98817, 102556, 127079, 112341, 133537, 127113, 85518, 75365]
13188G5365n876k5654R948M174p217L488J3669o417J2151l1759n7097q424N767
13175a7882M4251N9970p011N205j9317k2066L3822N457j6860J0199j1367M747
13163F9148k309O440L0770J66j9357j8826k4988M1942n5560k9338K1266M689k4639
13150e96K8855m999j1704J3331K7792M9894K4127k2941j9810l5927m0987M8393
13138E5428J1541K528K5353m74j5608o1299l3371K3251Q895J7849N9057L4326
13126A27476l8315R997j5064k266r115n3037j2183N3240J1968j2153n6904j0045
13114f401Q4131L7615n456M97o0312O215Q70J3991K8837j6780j9122q13j0517
13101E2755L2807l1737j2949n528L246j4973l0640J7085K0727L0630q642q492
$$ y = [75365, 69489, 43835, 53783, 57957, 50740, 54228, 67897, 61480, 73631, 41872, -15225, -23649, -17882, 26369, 86339, 79328, 84533, 65216, 43150, 76972, 82429, 65569, 75768, 64401, 69148, 66839, 73279, 104049, 104215, 84858, 66032, 41044, 82986, 27426, -1912, 19354, 24043, -596, 28259, 23260, 11556, 24887, 52679, 102573, 126700, 103759, 83949, 48022, 7035, 55428, 66969, 69497, 94850, 94376, 78768, 17469, -15902, 7349, 16244, 34093, 93150, 127476, 89161, 99158, 84094, 81828, 72713, 19676, 7493, 60733, 72701, 60548, 3644, -6401, 77730, 115345, 109889, 110386, 50074, 56289, 57159, 71150, 99987, 83207, 64085, 63272, 52755, 85562, 53825, 40876, 35348, 38594, 23621, -7019, 10066, 30793, 61423, 52781, 44289]
13089D4289J4679M3137K4498O2438J1989r4566m5462k5127r331j8226j9494N427
13077e749L8530p201R807L218K8189K5215j5342r201K3285l0327J7068J0187l785
13064H3894O010n778M5194m090K3101J6097M2807J9980p4639l8724q171M740M5764
13051A56185K801k5185l8011J4609p580q288K9623K670k3232l2271l2383J4863
13039E3801K9065k9770J7451K0324J7503K0693N1575m5449p0241J4325K1167n509
13027I4935j3221N913L189l8251M5125N3980J5381m4932k5512l8854k4396M5781
13015G9138N1683j0259j5425J2122j3076l3451K0208l701j1476L3493K4315n1324
13003H2247j045M9692k6631J249N0460L3344k4161m4134q095L7838J978k7417
$$ y = [44289, 58968, 102105, 126603, 189041, 201030, 106464, 61002, 35875, 26544, 8318, -11176, -5749, 32781, 25580, 35387, 38605, 66794, 92009, 76667, 67466, 90751, 60424, 77492, 87679, 83894, 89904, 84126, 129320, 125230, 148331, 164428, 207235, 227215, 152576, 113852, 105681, 110421, 156185, 158986, 133801, 95790, 110399, 102819, 94531, 124154, 126824, 103592, 71321, 38938, 53801, 82866, 53096, 70547, 90871, 108374, 129067, 180642, 135193, 64952, 79277, 100444, 94935, 81714, 87627, 90816, 52565, 97690, 151670, 167051, 122119, 96607, 57753, 33357, 79138, 130821, 120562, 105137, 117259, 104183, 70732, 90940, 87239, 75763, 109256, 133571, 82247, 81202, 130894, 104263, 105512, 155972, 189316, 165155, 121021, 112926, 150764, 152742, 125325]
12991A25325K6301L0320j6751J571J1260j8188o6286n5822J6115J2106M2417L8271
$$ y = [125325, 151626, 181946, 165195, 166766, 178026, 159838, 93552, 37730, 53845, 65951, 108368, 146639]
$$ [...]
##END NTUPLES=NMR SPECTRUM
##END=
