##TITLE=Analysis number 328851
Compound Code km 02339
Project Code adrs
Chemist Name stores
##JCAMPDX= 6.0         $$ Bruker NMR JCAMP-DX V2.0
##DATA TYPE= NMR SPECTRUM
##DATA CLASS= NTUPLES
##ORIGIN= Bruker BioSpin GmbH
##OWNER= nmr
$$ XWIN-NMR		Version 3.5
$$ Mon Jul  9 15:49:31 2007 GMT Daylight Time (UT+1h)  MAYBRIDGE\nmr@NMR_250MHZ
##.OBSERVE FREQUENCY= 250.131544655141
##.OBSERVE NUCLEUS= ^1H
##.ACQUISITION MODE= SIMULTANEOUS (DQD)
##.ACQUISITION SCHEME= undefined
##.AVERAGES= 16
##.DIGITISER RES= 18
##SPECTROMETER/DATA SYSTEM= dpx250
##.PULSE SEQUENCE= zg30
##.SOLVENT NAME= CDCl3
##.SHIFT REFERENCE= (INTERNAL, CDCl3, 0, 16.4533)
##AUDIT TRAIL= $$ (NUMBER, WHEN, WHO, WHERE, WHAT)
$$ ##TITLE= Audit trail, XWIN-NMR		Version 3.5
$$ ##JCAMPDX= 5.01
$$ ##ORIGIN= Bruker BioSpin GmbH
$$ ##OWNER= nmr
$$ C:\u/data/dgb/nmr/ADRS/710/pdata/1/auditp.txt
$$ ##AUDIT TRAIL=  $$ (NUMBER, WHEN, WHO, WHERE, WHAT)
(   1,<2007-07-09 15:49:08.25 +100>,<MAYBRIDGE\nmr>,<NMR_250MHZ>,
      <created by zg, POWCHK disabled, PULCHK disabled
       configuration hash MD5:
       76 6E 9A 78 1E 09 19 81 EC 84 63 8F B0 6A 59 2D
       data hash MD5: 64K
       B7 39 FB 7F 8C 7E E5 23 9D FA 8A C4 98 1D F1 00>)
(   2,<2007-07-09 15:49:20.98 +100>,<MAYBRIDGE\nmr>,<NMR_250MHZ>,
      <Start of raw data processing
       ef LB = 0.3 FT_mod = 6 PKNL = 1 SI = 32K 
       data hash MD5: 32K
       73 B2 68 C6 01 D5 6B A2 D4 81 F0 4D C4 09 38 6A>)
(   3,<2007-07-09 15:49:22.61 +100>,<MAYBRIDGE\nmr>,<NMR_250MHZ>,
      <apk 
       data hash MD5: 32K
       9E 7B 70 27 4B 75 D8 9F 81 73 47 DA 07 46 52 FD>)
(   4,<2007-07-09 15:49:23.31 +100>,<MAYBRIDGE\nmr>,<NMR_250MHZ>,
      <abs ABSG = 5 
       data hash MD5: 32K
       95 6B BD 83 AD A1 F5 4C EB 0D 9D 04 AB 9A E5 2B>)
$$ ##END=
$$ 
$$ hash MD5
$$ C5 07 39 2B 4F 12 56 07 A3 4B 16 5E A3 94 EA B4
##$RELAX= 
##$RELAX= 
##$RELAX= 
##$RELAX= 
##$RELAX= 
##$RELAX= 
##$RELAX= 
$$ Bruker specific parameters
$$ --------------------------
##$DU= <C:\u>
##$EXPNO= 710
##$NAME= <ADRS>
##$PROCNO= 1
##$TYPE= <nmr>
##$USER= <dgb>
##$AMP= (0..31)
100 100 100 100 100 100 100 100 100 100 100 100 100 100 100 100 100 100 
100 100 100 100 100 100 100 100 100 100 100 100 100 100 
##$AQSEQ= 0
##$AQ_mod= 3
##$AUNM= <au_zg>
##$AUTOPOS= <60 >
##$BF1= 250.13
##$BF2= 250.13
##$BF3= 250.13
##$BF4= 250.13
##$BF5= 500.13
##$BF6= 500.13
##$BF7= 500.13
##$BF8= 500.13
##$BYTORDA= 1
##$CFDGTYP= 0
##$CFRGTYP= 5
##$CHEMSTR= <none>
##$CNST= (0..31)
1 1 145 1 1 1 1 1 1 1 1 1 1 1 1 1 1 1 1 1 1 1 1 1 1 1 1 1 1 1 1 1 
##$CPDPRG= <>
##$CPDPRG1= <>
##$CPDPRG2= <>
##$CPDPRG3= <>
##$CPDPRG4= <mlev>
##$CPDPRG5= <mlev>
##$CPDPRG6= <mlev>
##$CPDPRG7= <mlev>
##$CPDPRG8= <mlev>
##$CPDPRGB= <>
##$CPDPRGT= <>
##$D= (0..31)
0 1 0 0 0 0 0 0 0 0.06 0 0 0 0 0 0 0.0002 0 0 0 0 0 0 0 0 0 0 0 0 0 0 
0 
##$DATE= 1183992546
##$DBL= (0..7)
120 120 120 120 120 120 120 120 
##$DBP= (0..7)
150 150 150 150 150 150 150 150 
##$DBP07= 0
##$DBPNAM0= <>
##$DBPNAM1= <>
##$DBPNAM2= <>
$$ [...]
##$SUBNAM7= <"">
##$SUBNAM8= <"">
##$SUBNAM9= <"">
##$SW= 20.6930455092707
##$SWIBOX= (0..15)
0 0 3 0 0 0 0 0 0 0 0 0 0 0 0 0 
##$SW_h= 5175.983436853
##$TD= 65536
##$TD0= 1
##$TE= 296.16
##$TE2= 300
##$TE3= 300
##$TEG= 300
##$TL= (0..7)
0 120 120 120 120 120 120 120 
##$TP= (0..7)
150 150 150 150 150 150 150 150 
##$TP07= 0
##$TPNAME0= <>
##$TPNAME1= <>
##$TPNAME2= <>
##$TPNAME3= <>
##$TPNAME4= <>
##$TPNAME5= <>
##$TPNAME6= <>
##$TPNAME7= <>
##$TPOAL= (0..7)
0.5 0.5 0.5 0.5 0.5 0.5 0.5 0.5 
##$TPOFFS= (0..7)
0 0 0 0 0 0 0 0 
##$TUNHIN= 0
##$TUNHOUT= 0
##$TUNXOUT= 0
##$USERA1= <user>
##$USERA2= <user>
##$USERA3= <user>
##$USERA4= <user>
##$USERA5= <user>
##$V9= 5
##$VALIST= <valist>
##$VCLIST= <CCCCCCCCCCCCCCC>
##$VD= 0
##$VDLIST= <DDDDDDDDDDDDDDD>
##$VPLIST= <PPPPPPPPPPPPPPP>
##$VTLIST= <TTTTTTTTTTTTTTT>
##$WBST= 1024
##$WBSW= 4
##$XGAIN= (0..3)
0 0 0 0 
##$XL= 0
##$YL= 0
##$YMAX_a= 327378
##$YMIN_a= -301134
##$ZGOPTNS= <>
##$ZL1= 120
##$ZL2= 120
##$ZL3= 120
##$ZL4= 120
##$ABSF1= 16.45334
##$ABSF2= -4.239832
##$ABSG= 5
##$ABSL= 3
##$ALPHA= 0
##$AQORDER= 0
##$ASSFAC= 0
##$ASSFACI= 0
##$ASSFACX= 0
##$ASSWID= 0
##$AUNMP= <proc_1d>
##$AZFE= 0.1
##$AZFW= 0.1
##$BCFW= 0
##$BC_mod= 0
##$BYTORDP= 0
##$COROFFS= 0
##$CY= 12.5
##$DATMOD= 1
##$DC= 0
##$DFILT= <>
##$DTYPP= 0
##$F1P= 14.0000005364418
##$F2P= -0.99999901652339
##$FCOR= 0.5
##$FTSIZE= 32768
##$FT_mod= 6
##$GAMMA= 0
##$GB= 0
##$INTBC= 1
##$INTSCL= 1
##$ISEN= 128
##$LB= 0.3
##$LEV0= 0
##$LPBIN= 0
##$MAXI= 10000
##$MC2= 0
##$MEAN= 0
##$ME_mod= 0
##$MI= 0
##$NCOEF= 0
##$NC_proc= -2
##$NLEV= 6
##$NOISF1= 0
##$NOISF2= 0
##$NSP= 0
##$NTH_PI= 0
##$NZP= 0
##$OFFSET= 16.45334
##$PC= 1
##$PHC0= -50.39634
##$PHC1= 7.066525
##$PH_mod= 1
##$PKNL= yes
##$PPARMOD= 0
##$PSCAL= 4
##$PSIGN= 0
##$REVERSE= no
##$SF= 250.130017171238
##$SI= 32768
##$SIGF1= 0
##$SIGF2= 0
##$SINO= 400
##$SIOLD= 32768
##$SREGLST= <1H.CDCl3>
##$SSB= 0
##$STSI= 32768
##$STSR= 0
##$SW_p= 5175.98343685301
##$SYMM= 0
##$S_DEV= 0
##$TDeff= 65536
##$TDoff= 0
##$TI= <Analysis number 999999
Compound Code 99
Book Reference 9
Project Code 9>
##$TILT= no
##$TM1= 0
##$TM2= 0
##$TOPLEV= 0
##$USERP1= <user>
##$USERP2= <user>
##$USERP3= <user>
##$USERP4= <user>
##$USERP5= <user>
##$WDW= 1
##$XDIM= 32768
##$YMAX_p= 446061458
##$YMIN_p= -269414
$$ End of Bruker specific parameters
$$ ---------------------------------
##NTUPLES= NMR SPECTRUM
##VAR_NAME=  FREQUENCY,     SPECTRUM/REAL,   SPECTRUM/IMAG
##SYMBOL=    X,             R,               I
##VAR_TYPE=  INDEPENDENT,   DEPENDENT,       DEPENDENT
##VAR_FORM=  AFFN,          ASDF,            ASDF
##VAR_DIM=   32768,         32768,           32768
##UNITS=     HZ,            ARBITRARY UNITS, ARBITRARY UNITS
##FACTOR=    0.157963299565203, 1,           1
##FIRST=     4115.47434939205, 0,            0
##LAST=      -1060.50908746096, 0,           0
##MIN=       -1060.50908746096, -269414,     0
##MAX=       4115.47434939205, 446061458,    0
$$ Real data points
##PAGE= N=1
##DATA TABLE= (X++(R..R)), XYDATA
$$ [...]
16982D1025j2107k5576j3325Q476P019k804l1271l438J0088j1834j017M679R832
$$ 41025 28918 3342 -9983 -1507 5512 2708 -28563 -32001 -21913 -33747 -34764 -30085 -20253
16969b0253J0208L739j8257J5325P536l518j0235M832J728J1799N149L001j3333
$$ -20253 -10045 -6306 -24563 -9238 -1702 -5220 -15455 -10623 -8895 2904 8053 11054 -2279
16956b279M310k288K086j0496Q237J0325Q646j9371k5571Q927K8827K1369N71
$$ -2279 2031 -257 1829 -8667 -430 9895 18541 -830 -26401 -17474 11353 32722 33293
16943C3293k2075k1914n448J1552R327J0453o5p926P184J3529k191k576l025j8709
$$ 33293 11218 -10696 -16144 -4592 4735 15188 15123 7197 14381 27910 25719 23143 20118 1409
16929A409j9267j4769J589J7167p205K1785J1660J118q207j9026K086K3906J06
$$ 1409 -17858 -32627 -31038 -13871 -21076 709 12369 13487 5280 -13746 -11660 12246 12352
16916A2352j3525J867r98O777J828j3570p479k783p989M41R165O042P317R027
$$ 12352 -1173 694 -304 6473 8301 -5269 -12748 -15531 -23520 -23079 -13914 -7872 -555 8472
16902H472j106P998m23K426q946j9760M140O858l254n054L107J0395n19o50N703
$$ 8472 7366 15364 14941 17367 8421 -11339 -7199 -341 -3595 -8649 -5542 4853 4334 3684 9387
16887I387P687J579k317n40M715m081j0142k1170j1808j2p005M547L063N171J0404
$$ 9387 17074 18653 16336 15796 20511 16430 6288 -14882 -26690 -26702 -33707 -29160 -26097 -20926 -10522
16872a0522j818m058Q550r28p453J2058M999j7894n014K225M17L235J7974J522
$$ -10522 -12340 -16398 -7848 -8776 -16229 -4171 828 -17066 -22080 -19855 -19438 -16203 1771 3293
16858C293j1900n094J6622K269r268q183k0761O641K1103J7355o461k2701Q53
$$ 3293 -8607 -13701 2921 5190 -4078 -12261 -33022 -26381 -5278 12077 5616 -17085 -16232
16845a6232M300J4762J0680j0127p48J668n571O617k725N207j2098m111J1102
$$ -16232 -11932 2830 13510 3383 2635 4303 -1268 5349 2624 7831 -4267 -8378 2724
16832B724J1387m89n179j5194m102J845P067J4344O331m097j4105N054J078R73
$$ 2724 14111 13622 8443 -6751 -10853 -9008 -1941 12403 18734 14637 532 5586 6664 7637
16818G637J9760m947q388M424j6768k282R246L165j31k580n623j862M633J096
$$ 7637 27397 22450 14062 18486 1718 -564 8682 11847 11716 9136 3513 1651 6284 7380
16804G380J1148j2913J008k0232J5641K3836m752q462j0951j083n086N79l580
$$ 7380 18528 5615 6623 -13609 2032 25868 21116 12654 1703 620 -4466 -3887 -7467
16791g467K085J5790q449j6241l0804M666K8740j2693n659N235O129K4296Q188
$$ -7467 -5382 10408 1959 -14282 -45086 -40420 -11680 -24373 -30032 -24797 -18668 5628 13816
16778A3816M768M735j932J349j1136n240o046j3631J6114j230n204j5029L580
$$ 13816 18584 23319 21387 22736 11600 6360 314 -13317 2797 1567 -3637 -18666 -15086
16765a5086p820o042J4027J566M068L439n047k353j89P588K042J7171J0940j9570
$$ -15086 -22906 -28948 -14921 -13355 -9287 -5848 -10895 -13248 -13437 -5849 -3807 13364 24304 4734
16751D734r696R103P801K5186L902j8820j2258M71R378L436K074J764q936k531
$$ 4734 -4962 4141 11942 37128 41030 22210 9952 10423 19801 23237 25311 27075 18139 15608
16737A5608q416q961k33p217k0116M59J4350m311Q977J7203k497M392N198r165
$$ 15608 7192 -1769 -2002 -9219 -29335 -28876 -14526 -18837 -9860 7343 4846 9238 14436 5271
16723E271m671Q875P74j011k811q130j0716n584J0494J1475P19o915q597n782
$$ 5271 600 9475 10249 9238 6427 -1703 -12419 -18003 -7509 3966 4685 -2230 -10827 -16609
16709a6609j0420K006P371K60J8564K3881q341l987r514L99L234L939k861j0827
$$ -16609 -27029 -25023 -17652 -17392 1172 25053 16712 12725 3211 3610 6844 10783 7922 -2905
16695b905j9144p850J7503J8232l583Q360O364r913o125j891J4878O290j4427
$$ -2905 -22049 -29899 -12396 5836 2253 10613 16977 7064 939 -952 13926 20216 5789
16682E789r326m412p294J2541K741k3065O156q830j2757Q478J7032J3403k115
$$ 5789 -3537 -7949 -15243 -2702 39 -23026 -16870 -25700 -38457 -29979 -12947 456 -1659
16669a659k488p266l24L387P267l002L056R685j0466K01J3198j3434o566j260
$$ -1659 -4147 -11413 -11737 -8350 -1083 -4085 -1029 8656 -1810 -1609 11589 -1845 -8411 -9671
16655i671o024q395R451J7677O271q558n243j2771j4177J2611M070J1535Q647
$$ -9671 -15695 -24090 -14639 3038 9309 751 -4492 -17263 -31440 -18829 -14759 -3224 5423
16642E423k823p034P604N493m910N23m371n002J151j4931j0857J3294J4404J1119
$$ 5423 2600 -4434 3170 8663 3753 4276 -95 -5097 -3946 -18877 -29734 -16440 -2036 9083
16628I083O127J2709K969p029q915j9656q290j2917P089L492Q99L0337L222J3481
$$ 9083 15210 27919 30888 23859 14944 -4712 -13002 -25919 -18830 -15338 -14439 15898 19120 32601
16614C2601j5253j5586N05n156K709M365j1623m659J0525p547m037p126k812J0309
$$ 32601 17348 1762 2267 -2889 -180 4185 -7438 -12097 -1572 -9119 -13156 -20282 -23094 -12785
16600a2785k326k00K1110J6589j2053j4932m474J2866O712O975j4615j1105K112
$$ -12785 -15111 -15311 5799 22388 10335 -4597 -9071 3795 10507 17482 2867 -8238 -6126
16587f126P27M43o91Q30J930P578J0675n545J446M72k317r263j45L710j2722p455
$$ -6126 -5399 -4956 -5647 -4817 -2887 4691 15366 9821 11267 11739 9422 159 14 3724 -8998 -16453
16571a6453j142J026q661J0279M616j78M347J2535Q307L51k769o751J1344J1465
$$ -16453 -17595 -16569 -25230 -14951 -10335 -10513 -6166 6369 14676 15027 12258 5507 16851 28316
16557B8316q063o633R458j3527j2621j3725j0333m90n801O549J193K6763J4359
$$ 28316 20253 13620 23078 9551 -3070 -16795 -27128 -27618 -33419 -26870 -25677 1086 15445
16544A5445j1699J667o526n012j199N341J6199J5888k104m311j3561o051n619
$$ 15445 3746 5413 -1113 -6125 -7324 -1983 14216 30104 28000 23689 10128 4077 -1542
16531a542R799J8925j4618k4690p275J9162K657m299l104J1633J3070L994j2225
$$ -1542 8257 27182 12564 -12126 -19401 -239 2418 -1881 -4985 6648 19718 23712 11487
16518A1487P953l542j5143N662k811r120j7823N158P222O563J5563N858o076M622
$$ 11487 19440 15898 755 6417 3606 -5514 -23337 -18179 -10957 -4394 11169 17027 10951 15573
16504A5573m409l330k2799j1302Q975P952J0407n17J0649J6833m041O018j593
$$ 15573 11164 7834 -14965 -26267 -17292 -9340 1067 550 11199 28032 23991 30009 28416
16491B8416l192J0244k3486n860k970l190J776J7366M101k774p598k915N231q570
$$ 28416 25224 35468 11982 6122 3152 -38 1738 19104 23205 20431 12833 9918 15149 6579
16477F579j3203M10j2505n274o342O908J3677j5105R482J6069M447M386K515j996
$$ 6579 -6624 -6214 -18719 -23993 -30335 -23427 -9750 -24855 -15373 696 5143 9529 12044 10048
16463A0048j056K124L918P467n367Q339j3931m760M473q074k656L122j2827j5831
$$ 10048 8992 11116 15034 22501 17134 25473 11542 6782 11255 3181 525 3647 -9180 -25011
16449b5011Q344o79J0369J96n589O859O834N186j327j2599J0050j73q658j0599
$$ -25011 -16667 -17346 -6977 -6781 -12370 -5511 1323 6509 5182 -7417 2633 2460 -6198 -16797
16435a6797k062L011J1726o370M892P389O998l234j2590j3494P353K9480J0227
$$ -16797 -18859 -15848 -4122 -10492 -5600 1789 8787 5553 -7037 -20531 -13178 16302 26529
16422B6529m583l871m929j6656q001J0870J2138J50J925O350J1030p388o449p710
$$ 26529 21946 18075 13146 -3510 -11511 -641 11497 11647 13572 19922 30952 23564 17115 9405
16408I405J768p763j0685J1578P757q583j9747n119P663J0557l407q018J4895
$$ 9405 11173 3410 -7275 4303 12060 3477 -16270 -21389 -13726 -3169 -6576 -14594 301
16395C01l836R354J5960R8K654J0450M598l2484j4558J0860L82o990J2552P679
$$ 301 -3535 5819 21779 21877 24531 34981 39579 7095 -7463 3397 3779 -3211 9341 17020
16381A7020j181J1308o953j3834P984q594M727j1965j6768o614K81J903L45L790
$$ 17020 15839 27147 20194 6360 14344 5750 10477 -1488 -18256 -24870 -24589 -22686 -22341 -18551
16367a8551J1877M59j0394N25M837J0918O661j1970j0804n615l94O499J621o769
$$ -18551 -6674 -6215 -16609 -16084 -11247 -329 6332 -5638 -16442 -22057 -22451 -15952 -14331 -21100
16353b1100o108J061j4609M374J7725P844r455m851O839R290k672q640l894J6953
$$ -21100 -27208 -26147 -40756 -36382 -18657 -10813 -20268 -25119 -18280 -8990 -11662 -20302 -24196 -7243
16339g243K252j1514J0926N396j1581p589M704J8692L40q060k459j1144l762j9131
$$ -7243 -4991 -16505 -5579 -183 -11764 -19353 -14649 4043 4383 -3677 -6136 -17280 -21042 -40173
16325d0173j4383J5990J9548J6900O870l485l274K2782K0340r942j4255j0556
$$ -40173 -54556 -38566 -19018 -2118 4752 1267 -2007 20775 41115 31173 16918 6362
16313F362j7415k4933j0188J0178J3831J9045J2022K512M244J4102q973r76j4922
$$ 6362 -11053 -35986 -46174 -35996 -22165 -3120 8902 11414 15658 29760 20787 19811 4889
16300D889j5563M743p408L413N803o513J1112N278K0857p334j4332j6583j4293
$$ 4889 -10674 -5931 -13339 -9926 -4123 -10636 476 5754 26611 19277 4945 -11638 -25931
16287b5931j5277K0964J0919o11j4462M457Q267M916j2054k650m079j4502J1247
$$ -25931 -41208 -20244 -9325 -9936 -24398 -19941 -11674 -6758 -18812 -21462 -25541 -40043 -28796
16274b8796J9670M730n803l374m132k135J3103J5245j446K732j3096l572J0975
$$ -28796 -9126 -4396 -10199 -13573 -17705 -19840 -6737 8508 7062 9794 -3302 -6874 4101
16261D101K876J5385q366j2663j3809j743K455K5285Q519p412j0213j35O565J3095
$$ 4101 6977 22362 13996 1333 -12476 -14219 -11764 13521 22040 14628 4415 4280 10845 23940
16247B3940m642j6276o317o330J719K558k584R054J3313P88p032L979m063j6059
$$ 23940 19298 3022 -3295 -9625 -7906 -5348 -7932 1122 14435 15223 8191 12170 8107 -7952
16233g952N464m519j1601R444J6682M14n815j954m497L481K053N483O516K759
$$ -7952 -2488 -7007 -18608 -9164 7518 7932 2117 163 -4334 -853 1200 6683 13199 15958
16219A5958r840o882J267K4501Q293r136k6575j2617M660Q846J3211O183P699
$$ 15958 6118 -764 503 25004 33297 24161 -2414 -15031 -10371 -1525 11686 17869 25568
16206B5568J4111k5777k1926k957J4829K7077j2885j2410L303N506J95M896P576
$$ 25568 39679 13902 -8024 -10981 3848 30925 18040 5630 8933 14439 14634 19530 27106
16193B7106j3215p293q70J0097O179k480k1692j4091P073O656j000K227k2126
$$ 27106 13891 6598 5728 15825 22004 19524 -2168 -16259 -9186 -2530 -3530 -1303 -23429
16180b3429l447J2487Q345J0001J3003k2757K572K238M845k185n432j6011r940
$$ -23429 -26876 -14389 -6044 3957 16960 -5797 -3225 -987 3858 1673 -3759 -19770 -29710
16167b9710J5311K921k318l323j6268j1880K3858L8632J8277p319j7435o380J558
$$ -29710 -14399 -11478 -13796 -17119 -33387 -45267 -21409 17223 35500 28181 10746 4366 5924
16154E924k549Q203J6756o574j0818N614j004j908M912J0837M893q620K689m105
$$ 5924 3375 11578 28334 21760 10942 16556 15552 13644 18556 29393 34286 25666 28355 24250
16140B4250n999n750q948m516J3068O52j3225m348j1030J1621J3346N958N29p806
$$ 24250 18251 12501 3553 -963 12105 12757 -468 -4816 -15846 -4225 9121 15079 15608 7802
16126G802q1n066R94m678l884m925N900n155N788J9075K702k441K864j9388K370
$$ 7802 7721 2655 3649 -1029 -4913 -9838 -3938 -9093 -3305 15770 18472 16031 18895 -493 1877
16111A877K4j3348Q662P618M333q709r359J489P412j3920O056J1472P04n368J0929
$$ 1877 1901 -11447 -2785 4833 9166 457 -8902 -7413 -1 -13921 -7865 3607 4311 -1057 9872
16096I872L691l697R035l213j0171Q132o932K391j881j2625l230o04R596j02k11
$$ 9872 13563 9866 18901 15688 5517 13649 6717 9108 7227 -5398 -8628 -9232 364 262 51
16081E1J5774Q307M926n19m559m768m832J3470Q175j0831j3785j5004n187j0376
$$ 51 15825 24132 29058 28539 23980 19212 14380 27850 36025 25194 11409 -3595 -8782 -19158
16067a9158l953M679K0871R047O027j6618k1275n001Q683l561K3990o470m149
$$ -19158 -23111 -18432 2439 11486 17513 895 -20380 -25381 -16698 -20259 3731 -2739 -6888
16054f888q579J4016N999R379j524P428j7142j0131R961O833N262L12l013m761
$$ -6888 -15467 -1451 4548 13927 12403 19831 2689 -7442 2519 9352 14614 14926 11913 7152
16040G152j1195j5380o314P977J3891M433Q614j363J3312J2530j3194j9116N290
$$ 7152 -4043 -19423 -25737 -17760 -3869 564 9178 7815 21127 33657 20463 1347 6637
16027F637j5126k349J3223M660J011q342j2541J608J8818P03N748M891m472j2086
$$ 6637 -8489 -10838 2385 7045 8056 -286 -12827 -11219 7599 8302 14050 18941 14469 2383
16013B383p603J1543M277j4533R434J0080m580j3705o230P006J8133N107j7659
$$ 2383 -5220 6323 10600 -3933 5501 15581 11001 -2704 -8934 -1928 16205 21312 3653
16000C653j9947J2980J3799o724r936j4884N527j760M064J1082J3664K585j1532
$$ 3653 -16294 -3314 10485 3761 -6175 -21059 -15532 -17292 -13228 -2146 11518 14103 2571
15987B571j0281l907n483M928l139L338K4039J0871k657q808j9026L144J1490
$$ 2571 -7710 -11617 -17100 -12172 -15311 -11973 12066 22937 20280 11472 -7554 -4410 7080
15974G080k5M769O390p819L729m853K086o665J0542J0807n997j7493n648J495
$$ 7080 7055 11824 18214 10395 14124 9271 11357 4692 15234 26041 20044 2551 -3097 -1602
15960a602K687K046j761j054Q275m24j258N996p871l828L708r938m789K167J1250
$$ -1602 1085 3131 1370 316 8591 8167 6909 12905 5034 1206 4914 -5024 -9813 -7646 3604
15945C604P087n162Q95J9766J2538j2254j2584j1777J3642m682j5543q593K984
$$ 3604 10691 5529 6424 26190 38728 26474 13890 2113 15755 11073 -4470 -13063 -10079
15932a0079J7994O761j0416J2784m027j5754n926q309N204J3481k271m559N359
$$ -10079 7915 14676 4260 17044 13017 -2737 -8663 -16972 -11768 1713 -558 -5117 242
15919B42m989r736k021p505J0361J6918J3299r213k3709j290m611K413q8o543
$$ 242 -4747 -14483 -16504 -24009 -13648 3270 16569 7356 -16353 -17643 -22254 -19841 -19929 -26472
15905b6472o737P573R321P290j9567r867J8795L0423L193j6958n390J4667J2225
$$ -26472 -33209 -25636 -16315 -9025 -28592 -38459 -19664 10759 13952 -3006 -8396 6271 18496
15892A8496o316J815j9705o817j494J733l342J4824m051l140K285m906j593J0545
$$ 18496 12180 13995 -5710 -12527 -14021 -12288 -15630 -806 -4857 -7997 -5712 -10618 -12211 -1666
15878a666j410N902o425r746L372Q73k134p1q365p195P172M111j7166P49l084
$$ -1666 -3076 2826 -3599 -13345 -9973 -9100 -11234 -11305 -19670 -26865 -19693 -15582 -32748 -31999 -35083
15863c5083J2454K3813n679q965J5505J2554j0847K455M117P264K0041m480j6266
$$ -35083 -22629 1184 -4495 -13460 2045 14599 3752 6207 10324 17588 37629 33149 16883
15850A6883j4052oj603l255J5387p818k6709j2265K2999K460L308k329r525P225
$$ 16883 2831 2825 1222 -2033 13354 5536 -21173 -33438 -10439 -7979 -4671 -7000 -16525 -9300
15836i300Q055p544o805K3669J2179k3731j3072L504o489K669J6478j775q962
$$ -9300 -1245 -8789 -15594 8075 20254 -3477 -16549 -13045 -19534 -16865 -387 -2162 -11124
15823a1124l667p79N146P834K535Q52r334J7474K164l3432j8807J1298P309R05
$$ -11124 -14791 -15570 -10424 -2590 -55 797 -8537 8937 11101 -22331 -41138 -29840 -22531 -21626
15809b1626K49K6876l33p099m185K363J733k5874m3P34J2508J4236K547r108j8711
$$ -21626 -21377 5499 5166 -1933 -6118 -3755 -2022 -27896 -27939 -27205 -14697 -461 2086 -7022 -25733
15794b5733J831O994j98R868N708p554r331l025J7030J7320J4828J3890j3018
$$ -25733 -23902 -16908 -17106 -7238 -1530 -9084 -18415 -21440 -4410 12910 27738 41628 28610
15781B8610j9429j1094N8j261n529R216j45q084k340j107k210J0094O834j1670
$$ 28610 9181 -1913 -1855 -3116 -8645 571 426 -7658 -9998 -11105 -13315 -3221 3613 -8057
15767h057k695q349K507j1035n196N618J2388K3790O872j0592O70j810o535N812
$$ -8057 -10752 -19101 -16594 -27629 -32825 -27207 -14819 8971 15843 5251 5921 4111 -2424 3388
15753C388Q937N863J1772l929j1936r873J1716m017j915j3136m6R949j0232l1262
$$ 3388 12325 18188 29960 26031 14095 4222 15938 11921 10006 -3130 -3176 6773 -3459 -34721
15739c4721p166L946J2663N767O327L0591J1277j265k4069n809k640n113M801
$$ -34721 -41887 -37941 -25278 -19511 -13184 17407 28684 27419 3350 -2459 -5099 -10212 -5411
15726e411J0678j8548j0960M485m012J492J2455J3031l933p716j6568j6411Q961
$$ -5411 5267 -13281 -24241 -19756 -23768 -22276 -9821 3210 -723 -8439 -25007 -41418 -32457
15713c2457K0833P056K198k222m653l137j2899N03j0322J4279K3042K4940L840
$$ -32457 -11624 -4568 -2370 -4592 -9245 -12382 -25281 -24778 -35100 -20821 2221 27161 31001
15700C1001j3585k0103j4676O023j477P56R076N796p426l523o32l189l841K989
$$ 31001 17416 -2687 -17363 -11340 -12817 -12061 -2985 2811 -4615 -8138 -8770 -11959 -15800 -12811
15686a2811K6389M030j4864K825N988M623l15K783J957J245k3157m627p351q202
$$ -12811 13578 17608 2744 5569 11557 16180 15865 18648 20605 21850 -1307 -5934 -13285 -21487
15672b1487J1935m2L074J163N021K724L619p295j832r002N857J1535Q896R971
$$ -21487 -9552 -9594 -6520 -5357 -336 2388 6007 -1288 -3120 -12122 -6265 5270 14166 24137
15658B4137j0253j1612k409J0121l168J5444M049l61l163J3889j762j0145o374
$$ 24137 13884 2272 -137 9984 6816 22260 26309 25948 22785 36674 34912 24767 18393
15645A8393j077q576l211j757q992l779J045K104R476m03n499J27Q397o9r493
$$ 18393 17316 8740 5529 3772 -5220 -8999 -7954 -5850 3626 3223 -2276 -2149 6248 6179 -3314
15630c314J1657L072J1573J2294K657m727J2662n311r009q792k1406j5949M902
$$ -3314 8343 11415 22988 35282 37939 33212 45874 40563 31554 22762 1356 -14593 -9691
15617i691K1137J1638q849L688m400j595K858q691j6048j358J5537J7031l9q92
$$ -9691 11446 23084 14235 17923 13523 11928 14786 6095 -9953 -11311 4226 21257 21218 20326
15603B0326Q101n924k3701o973O173j3031R551M880N77l871R117k889m174j2885
$$ 20326 28427 22503 -1198 -8171 -1998 -15029 -5478 -598 -21 -3892 5225 2336 -1838 -14723
15589a4723O618J4734J5345j1918p924Q279j9095N696J416j8086n566J3305P300
$$ -14723 -8105 6629 21974 10056 2132 10411 -8684 -2988 -1572 -19658 -25224 -11919 -4619
15576d619j557k040j2706M551J3830j9780M23O761o339R172J9532N236m304k191
$$ -4619 -6176 -8216 -20922 -16371 -2541 -22321 -21898 -15137 -21476 -12304 7228 12464 8160 5969
15562E969q128q096q715L057K1152M63J158O159r566j0706P028J2709O991J0832
$$ 5969 -2159 -10255 -18970 -15913 5239 5702 6860 13019 3453 -7253 -225 12484 19475 30307
15548C0307l418j2310J322O719q958j0305K8539Q312j0554O04m923J397r182n400
$$ 30307 26889 14579 15901 22620 13662 3357 31896 40208 29654 30258 25335 26732 17550 12150
15534A2150N724L365j7182j0052P559m35m211L199Pn023k5016J9790N908o680
$$ 12150 17874 21239 4057 -5995 1564 1129 -3082 117 124 -4899 -29915 -10125 -4217 -10897
15520a0897m994j570O25R296J672J6232r552k9437K706J0262K0779k319J0902
$$ -10897 -15891 -17461 -16836 -7540 -5868 10364 812 -28625 -25919 -15657 5122 2803 13705
15507A3705J1351p99n019j1638k0998p096j60k008P55r113o029R564K1673P722
$$ 13705 25056 24257 19238 7600 -13398 -20494 -20654 -22662 -21907 -31020 -37049 -27485 -5812 1910
15493A910N675N063p875j5366o849J405q383l292R082Q659j8315O054K0027L597
$$ 1910 7585 12648 4773 -10593 -17442 -16037 -24420 -27712 -18630 -9971 -28286 -22232 -2205 1392
15479A392j3601o679Q065J4250n926j0801L433J7194j4610P188l924l669J6800
$$ 1392 -12209 -18888 -10823 3427 -2499 -13300 -9867 7327 -7283 -95 -4019 -7688 9112
15466I112k422L923M743P971j9485p242J733n089R74j2293K104K3040K1517L608
$$ 9112 6690 10613 15356 23327 3842 -3400 -1667 -6756 -5782 -18075 -15971 7069 28586 32194
15452C2194M793j5375j0370J4252J453o835n424j726M410M289j5336j1643j4705
$$ 32194 36987 21612 11242 25494 26947 20112 14688 12962 17372 21661 6325 -5318 -20023
15439b0023J021m577m478J4954N480R417R77j2409k2299l711K0083J4597m535
$$ -20023 -19002 -23579 -28057 -13103 -7623 1794 2771 -9638 -31937 -35648 -15565 -968 -5503
15426e503K282J9092r565J299l507j5949K801J1634J2025J544L304R647J4618
$$ -5503 -3221 15871 6306 7605 4098 -11851 -9050 2584 14609 16153 19457 29104 43722
15413D3722j7830j8460l788j1578j368J9767N253Q124j3175k889J648j2731L692
$$ 43722 25892 7432 3644 -7934 -9302 10465 15718 23842 10667 7778 9426 -3305 387
15400C87O619j84m515O024r99M481R292N596r340j7728l927N494K099n923J0518
$$ 387 7006 6822 2307 8331 7332 11813 21105 26701 17361 -367 -4294 1200 3299 -2624 7894
15385G894r059j9019j091K7588J1019K276j8n598N919N363j4643J1229N754j2909
$$ 7894 -1165 -20184 -21275 6313 17332 19608 19590 13992 19911 25274 10631 21860 27614 14705
15371A4705q934q828K590P721L225k161j3973j261J7304n132K101J7959J0866
$$ 14705 5771 -3057 -467 7254 10479 8318 -5655 -6916 10388 5256 7357 25316 36182
15358C6182j4967M995m788j9387K108P397M424K589R86r362j1274j2877K294J6397
$$ 36182 21215 26210 21422 2035 4143 11540 15964 18553 19539 10177 -1097 -13974 -11680 4717
15344D717J806j8882M049j933j074M008J9920K182o809p679M445k8763J117K8553
$$ 4717 6523 -12359 -8310 -10243 -11317 -7309 12611 14793 7984 305 4750 -24013 -22896 5657
15330E657O848J0661L150Q435N18j1024j8909K070J2869O983q490k4583j3108
$$ 5657 12505 23166 26316 34751 35269 24245 5336 7406 20275 27258 18768 -5815 -18923
15317a8923M566K0954J4711j6792k1235o186J6912L7423N264j6584q854K016j5166
$$ -18923 -14357 6597 21308 4516 -16719 -22905 -5993 31430 36694 20110 11256 13272 -1894
15304a894j7361O108O331P502q574K48J5141l61N783M14O616j6320K717K5475
$$ -1894 -19255 -13147 -6816 686 -7888 -7640 7501 7140 12923 13337 19953 3633 6350 31825
15290C1825J043j3461k0717j2684j022Q34P177R982k347q353o445o648j194N844
$$ 31825 32868 19407 -1310 -13994 -15016 -14182 -7005 2977 630 -7723 -14168 -20816 -22010 -16166
15276a6166Q816l65J2479J6655j653q598K880Q361o175j2844j9166k2371J799
$$ -16166 -7350 -7715 4764 21419 19766 11168 14048 22409 16234 3390 -15776 -38147 -36348
15263c6348K0335R281po345R325Q882J3379k0309j2446O747R897l251J2569O741
$$ -36348 -16013 -6732 -6739 -13084 -3759 5123 18502 -1807 -14253 -7506 2391 -860 11709 18450
15249A8450J1206j4706j056j545j0444L677P557Q82K264q581j9140P616j077j5524
$$ 18450 29656 14950 13894 12349 1905 5582 13139 14021 16285 7704 -11436 -3820 -4897 -20421
15235b0421j2510J9720K4596q120r328j423N558n854p855q482j1193M906J9522
$$ -20421 -32931 -13211 11385 3265 -6063 -7486 -1928 -7782 -15637 -24119 -35312 -30406 -10884
15222a0884j2123Q230L2746q600k6093R72L684k773n723m175Q359K2655J009r432
$$ -10884 -23007 -14777 17969 9369 -16724 -15752 -12068 -14841 -20564 -24739 -16380 6275 7284 -2148
15208b148m253N395l816o412K730Q19Q496j951k1463J7103K052q676l811k605
$$ -2148 -6401 -1006 -4822 -11234 -8504 -7685 811 -1140 -22603 -5500 -3448 -12124 -15935 -18540
15194a8540k006l428p029L290K3571l405j3219j456P254N920O879k232m253P02
$$ -18540 -20546 -23974 -31003 -27713 -4142 -7547 -20766 -22222 -14968 -9048 -2169 -4401 -8654 -7952
15180g952J463j230p664J0132J4761j1290k3354K137J376J0879M566p509r269
$$ -7952 -6489 -7719 -15383 -5251 9510 -1780 -25134 -22997 -21621 -10742 -6176 -13685 -22954
15167b2954l109L60l30J3501K5970J2126N388j122k853j151n69P541l045o395
$$ -22954 -26063 -25703 -26033 -12532 13438 25564 30952 29830 26977 25826 25257 32798 29753 23358
15153B3358J738m734q874j5257n998j946j2r320q675J3638L263J7789K5714P012
$$ 23358 25096 20362 11488 -3769 -9767 -11713 -11725 -21045 -29720 -16082 -12819 4970 30684 37696
15139C7696q828j9120j6773m985j812M179L715m969k107K1266J1032K049R239
$$ 37696 28868 9748 -7025 -12010 -13822 -9643 -5928 -10897 -13004 8262 19294 21343 30582
15126C0582j22m205r468O914Q717p40J4542n665p733j1102j1877J1604l160k2251
$$ 30582 30460 26255 16787 23701 32418 31678 46220 40555 32822 21720 9843 21447 18287 -3964
15112c964K415O67L830k933J4806j1020j9222O318J731p740K959J1633o414r579
$$ -3964 -1549 -882 2948 15 14821 3801 -15421 -9103 -7372 -15112 -12153 -520 -6934 -16513
15098a6513p616K8295R304j0604o246O068O493P902o285m492m440Q645M205K212
$$ -16513 -24129 4166 13470 2866 -3380 2688 9181 17083 10798 6306 1866 10511 14716 16928
15084A6928r696j4179M935l149j6039J0802J0916J8532J6101k5915j4663P388
$$ 16928 7232 -6947 -2012 -5161 -21200 -10398 518 19050 35151 9236 -5427 1961
15072A961O830Q920L204Q002j0102j2926q948o099k351n320O96N797j270L019
$$ 1961 8791 17711 20915 28917 18815 5889 -3059 -9158 -11509 -16829 -16133 -10336 -11606 -8587
15058h587j3143M030K0230j8180l406J3049J9191m134r707j2683O74M329q612
$$ -8587 -21730 -17700 2530 -15650 -19056 -6007 13184 9050 -657 -13340 -12666 -8337 -16949
15045a6949J0623N353L927J1004r936j2104k252K727j2079j6053N009J020O912
$$ -16949 -6326 -973 2954 13958 4022 -8082 -10334 -7607 -19686 -35739 -30730 -29710 -22798
15032b2798J7509O490K880L447l442P297Q714L18k6798P006K2676k889j0819p436
$$ -22798 -5289 1201 4081 7528 4086 11383 20097 20415 -6383 623 23299 20410 9591 2155
15018B155p423J1155Q67n633r925O384L640j1650L608M815l277J7479J6027j3809
$$ 2155 -5268 5887 6754 1121 -8804 -2420 1220 -10430 -6822 -2007 -5284 12195 28222 14413
15004A4413k3445p719K4837K0687P383K6409L2662J1582l2175m2188l253n145
$$ 14413 -9032 -16751 8086 28773 36156 62565 95227 106809 74634 32446 29193 24048
14992B4048q168Q324R308k995k511O524j0269J162j3402p496P492J6112j240k2216
$$ 24048 15880 24204 33512 30517 28006 34530 24261 25423 12021 4525 12017 28129 26889 4673
14978D673k204J02J1163J0248J0440K291l368j5366p280j2764K576j641o076J0186
$$ 4673 2469 2571 13734 23982 34422 36713 33345 17979 10699 -2065 511 -1130 -7206 2980
14964B980k084j0893j0070j2176K1990K6998l058m131l528q742R936L562j5737
$$ 2980 896 -9997 -20067 -32243 -10253 16745 13687 9556 6028 -2714 7222 10784 -4953
14951d953l151J3260R144r273j2856j0823M87Q043k880p118j8063J98P965l141
$$ -4953 -8104 5156 14300 5027 -7829 -18652 -18165 -10122 -13002 -20120 -38183 -37985 -30020 -33161
14937c3161Q445J6506J6203P005j9665j387k0J0062m191L51Q420J010o959m914
$$ -33161 -24716 -8210 7993 14998 -4667 -6054 -6074 3988 -203 148 8568 9578 2619 -2295
14923b295J4386K818j5581j9203L484j154p714J1160J7298n05k0182q63O331K037
$$ -2295 12091 14909 -672 -19875 -16391 -17545 -25259 -14099 3199 2694 -17488 -18351 -12020 -9983
14909i983L344Q780j8054R484J2232o587j6021j2763j1348J7295K3430j564o453
$$ -9983 -6639 2141 -15913 -6429 5803 -784 -16805 -29568 -40916 -23621 -191 -1755 -8208
14896h208k292o55J0516n723k1210M664J7885J9902j691n593L571K127P956M256
$$ -8208 -10500 -11155 -639 -6362 -27572 -22908 -5023 14879 13188 7595 11166 13293 21249 25505
14882B5505j0746J69P93m876q674r538R502j649K968J2748p026j8922r342j416
$$ 25505 14759 14928 15721 10845 2171 -7367 2135 486 3454 16202 9176 -9746 -19088 -20504
14868b0504P154K6287J2256p505K549q682j2998r968l667K458J136J2799l599
$$ -20504 -13350 12937 25193 17688 20237 11555 -1443 -11411 -15078 -12620 -11484 1315 -2284
14855b284m233P333K702m016j2267r288m341Q891R222K578j1373j6532M688R823
$$ -2284 -6517 816 3518 -498 -12765 -22053 -26394 -17503 -8281 -5703 -17076 -33608 -28920 -19097
14841a9097Q901K1018k073j0656L48L421R072J1990K638o444j4358L150m299j0869
$$ -19097 -10196 10822 8749 -1907 -1559 1862 10934 22924 25562 19118 4760 7910 3611 -7258
14827g258J4498O230j0986o331R137P490r505r927m19Q624k35o925k784o334Q768
$$ -7258 7240 13470 2484 -3847 5290 12780 3275 -6652 -7071 1553 1318 -5607 -8391 -14725 -5957
14812e957Q257j1230K890J782m651M666j047j6515J0034J0308q788K814P134P419
$$ -5957 2300 -8930 -6040 -4258 -8909 -4243 -5290 -21805 -11771 -1463 -10251 -7437 -303 7116
14798G116n925K70J608j4194m202J1813J3167J6066p993k2857M773J0206j1413
$$ 7116 1191 1461 3069 -11125 -15327 -3514 9653 25719 17726 -5131 -358 9848 -1565
14785a565q327p577j3905J1207K2155J3810k232j97k040j2630J2551j0750J37
$$ -1565 -9892 -17469 -31374 -20167 1988 15798 13566 13369 11329 -1301 11250 500 637
14772F37O865k142N157J6670J1369j8130M471J301K911m161j5263n823M6r508
$$ 637 7502 5360 10517 27187 38556 20426 24897 26198 29109 24948 9685 3862 3908 -5600
14758e600j0951l664j570K2691J6375p075j3429j5476n688L280J6843N264p251
$$ -5600 -16551 -20215 -21785 906 17281 10206 -3223 -18699 -24387 -21107 -4264 1000 -6251
14745f251K007R478K6052P358j507j9529p329P504j6997l975m036j4531J2483
$$ -6251 -4244 5234 31286 38644 37137 17608 10279 17783 786 -3189 -7225 -21756 -9273
14732i273K8527q198K802j925q808q1Q883j0677r673R196J9330n856j7770m466
$$ -9273 19254 11056 13858 11933 3125 3044 11927 1250 -8423 773 20103 14247 -3523 -7989
14718g989P095R808J5854O81n91j9854m364r934J246L161j5176L20K1242k634
$$ -7989 -894 8914 24768 25449 24858 5004 640 -9294 -8048 -4887 -20063 -19743 1499 -1135
14704a135j2764L194N145J1379J6068l420r054J309N781L206k0020k4670Q778
$$ -1135 -13899 -10705 -5560 5819 21887 18467 9413 10722 16503 19709 -311 -24981 -16203
14691a6203O861k705J3749K0884n330j056j8992j4665j8152M706P236Q008N719
$$ -16203 -9342 -12047 1702 22586 17256 16200 -2792 -17457 -35609 -30903 -23667 -15659 -9940
14678i940J1064o124O731j301N133L417J0645P219j1273p596P574r189J8780k47
$$ -9940 1124 -5000 1731 430 5563 8980 19625 26844 15571 7975 15549 6360 25140 24893
14664B4893k2518j6447P440J2060Q148q223p379N002l047K286R480j2905J825
$$ 24893 2375 -14072 -6632 5428 13576 5353 -2026 2976 -71 2215 11695 -1210 615
14651F15p01N344L957r194q711K1336k821j7876P905m501M36j5492j2130J7358
$$ 615 -86 5258 9215 21 -8690 12646 9825 -8051 -146 -4647 -4211 -19703 -31833 -14475
14637a4475J5331q58r291o125J7974J314M770N914K528o610j6834j558N338J4176
$$ -14475 856 -2 -9293 -15418 2556 3870 8640 14554 17082 10472 -6362 -7920 -2582 11594
14623A1594J9209J9169j3539l8727m818J663o649r431j4424K503l73K2594K0945
$$ 11594 30803 49972 36433 -2294 -7112 -5449 -12098 -21529 -35953 -33450 -33823 -11229 9716
14610I716J2349p558j6848j521J2801P8R193J006J692j1759j8968p819N634J5630
$$ 9716 22065 14507 -2341 -3862 8939 9017 18210 19216 20908 9149 -9819 -17638 -12004 3626
14596C626J0572p677j5727O530J368j6414O04N082M928J216Q298M356p184o155
$$ 3626 14198 6521 -9206 -2676 -1308 -17722 -17118 -12036 -7108 -5892 2406 6762 -422 -6577
14582f577K1J9960O142l029j539k1411l081J0221J1455J0967L574j6061j1970
$$ -6577 -6556 13404 19546 16517 14978 -6433 -9514 707 12162 23129 26703 10642 -1328
14569a328m469L228M644j234j1955j6273k0778J123J3368Q723M682M584R983j2037
$$ -1328 -5797 -2569 2075 841 -11114 -27387 -48165 -47042 -33674 -24951 -20269 -15685 -5702 -17739
14555a7739N280P657P202N499r933q869J0994K0922n471k0713o304K269J2219
$$ -17739 -12459 -4802 2400 7899 -2034 -10903 91 21013 15542 -5171 -11475 -9206 3013
14542C013K491p084J6195J8259p511j3944o367j6597p431K0201j0035Q934J1913
$$ 3013 5504 -1580 14615 32874 25363 11419 5052 -11545 -18976 1225 -8810 124 12037
14529A2037Q72J0440K603m173k1145n572P500j2277j0107o749Q453J150m110J7687
$$ 12037 12909 23349 25952 21779 634 -4938 2562 -9715 -19822 -26571 -18118 -16968 -21078 -3391
14515c391K2136j4705r321Q335n292O909J4637L683n552M938m37j8931j1595J440
$$ -3391 18745 4040 -5281 3054 -2238 4671 19308 22991 17439 22377 21940 3009 -8586 -7146
14501g146N06k550J0455m382j8861O996J1662L363l882n956R645J9945N199j0033
$$ -7146 -6640 -9190 1265 -3117 -21978 -14982 -3320 43 -3839 -9795 -150 19795 24994 14961
14487A4961p560o933K85O396K505K119K411l528n467j5451k974J1311J5693j2493
$$ 14961 7401 468 753 7149 9654 11773 14184 10656 5189 -10262 -13236 -1925 13768 1275
14473A275o444K772J351k458l357k050K2935KP891J6639k99l929k3949J76j1093
$$ 1275 -5169 -2397 -1046 -3504 -6861 -8911 14024 14026 21917 38556 38257 34328 10379 10555 -538
14458e38L856q029p473j37n903O686J0137l058r228K0448K1585l66q540k1944
$$ -538 3318 -4711 -12184 -12321 -18224 -11538 -1401 -4459 -13687 6761 28346 27980 19440 -2504
14444b504Q661J4021J993j6416j0118Q024L114j1788J888M687o126k921j3793
$$ -2504 6157 20178 22171 5755 -4363 3661 6775 -5013 -3125 1562 -4564 -7485 -21278
14431b1278J5102K1747m35k1863J357K3734Q029j3164j5395m366k176P074N290
$$ -21278 -6176 15571 15136 -6727 -5370 18364 26393 13229 -2166 -6532 -8708 -1634 3656
14418C656J1156J8039j5271p307m648m998l609q102k862n14P867R584J4163K6434
$$ 3656 14812 32851 17580 10273 5625 627 -2982 -11084 -13946 -14460 -6593 2991 17154 43588
14404D3588k586j4154p150j6612j480j2293k0691Q59Q274R332J365J662J3166
$$ 43588 41002 26848 19698 3086 1606 -10687 -31378 -30519 -22245 -12913 -11548 -9886 3280
14391C280J2533K281n263J271l525Q489L519l262L221Rj7963k0434j609J3555
$$ 3280 15813 18094 12831 14102 10577 19066 22585 19323 22544 22553 4590 -15844 -17453 -3898
14377c898J0315j0221O23P521j775k443L599N340N581n196p854q390J1306O046
$$ -3898 6417 -3804 -3181 4340 2565 122 3721 9061 14642 9446 1592 -6798 4508 10554
14363A0554j1411J6395l414k7578o705K5687J5407q891l706q709l839J719o15
$$ 10554 -857 15538 12124 -15454 -22159 3528 18935 10044 6338 -2371 -6210 -4491 -5106
14350e106J1063L705L024p148k008j397M101Q457R746J074m096r223j0052j879
$$ -5106 5957 9662 12686 5538 3530 2133 6234 14691 24437 25511 21415 12192 2140 261
14336B61J2699Q607P526R562n583j0567j0251N303k307o891m717Q18J6763j9321
$$ 261 12960 21567 29093 38655 33072 22505 12254 17557 15250 8359 3642 4460 21223 1902
14322A902J841P812M316K084L621k698j1875P236J1898l468j3509l844m563J0125
$$ 1902 3743 11555 15871 17955 21576 18878 7003 14239 26137 22669 9160 5316 753 10878
14308A0878o667N396P802Q001r615j0712J128N726Q160j4997j1746P776N129l320
$$ 10878 4211 9607 17409 25410 15795 5083 6211 11937 20097 5100 -6646 1130 6259 2939
14294B939L813j8598O434q912j568M649J1509j1998l691Q15q896O70K0642J4005
$$ 2939 6752 -11846 -5412 -14324 -15892 -11243 266 -11732 -15423 -14608 -23504 -22834 -2192 11813
14280A1813R903m446o468j4841K555K9894o675j0802k870r94j0029k604M01o32
$$ 11813 21716 17270 10802 -4039 -1484 28410 21735 10933 8063 7069 -2960 -5564 -5163 -5795
14266e795R206j309k797L074o315n93j0730k31q3m040J0134m954O352N046R88
$$ -5795 3411 2102 -695 2379 -3936 -4529 -15259 -15490 -15573 -19613 -9479 -14433 -8081 -3035 -2047
14251b047r137O507O140o179j9274j0746N999Q363Q509N225M855j1511j2641O331
$$ -2047 -11184 -4677 1463 -4716 -23990 -34736 -28737 -20374 -11865 -6640 -1785 -13296 -25937 -19606
14237a9606M970J5054J272J5750k981j4694J5465M37O040m980j3210p209K104
$$ -19606 -14636 418 1690 17440 14459 -235 15230 15667 21707 16727 3517 -3692 -1588
14224a588J3158l347N193Q228L517J73j9204j1090k266O941J6932N499l660o422
$$ -1588 11570 8223 13416 21644 25161 25334 6130 -4960 -7226 -285 16647 22146 18486 12064
14210A2064q458k559j7257r901l265k193J9690J5857Q677j0040m742K839o437
$$ 12064 3606 1047 -16210 -26111 -29376 -31569 -11879 3978 12655 2615 -2127 712 -5725
14197e725N466M593r049N779M981k575j9674n182M527K0787MJ6239N11k2343l50
$$ -5725 -259 4334 -4715 1064 6045 3470 -16204 -21386 -16859 3928 3932 20171 20682 -1661 -2011
14182b011K1137j582l327j2703j4484P511J1552K012q352j7790J2816J5357L775
$$ -2011 19126 17544 14217 1514 -12970 -5459 6093 8105 -247 -18037 -5221 10136 13911
14169A3911L246n521q36M77j2793P303p709Q878R600K968j171j209j2346k812
$$ 13911 17157 11636 10800 11277 -1516 5787 -1922 6956 16556 19524 18353 17144 4798 1986
14155A986r632j0050k869J1512J5791O408r153j9843n272n562J4174K2781J7839
$$ 1986 -7646 -17696 -20565 -9053 6738 13146 3993 -15850 -21122 -26684 -12510 10271 28110
14142B8110j0166j1578R73P270j996n019K29Q63j210j5078J1019J1974r711j0809
$$ 28110 17944 6366 7339 14609 12613 7594 7823 8686 7476 -7602 3417 15391 5680 -5129
14128e129N698J3182m254j399r873l143N353J361R097R634M04o193r425o243L236
$$ -5129 569 13751 9497 8098 -1775 -4918 435 1796 10893 20527 20931 14738 5313 -930 2306
14113B306J0188n456o211r13o879L537N754p645m584L377J4712m080k2309r993
$$ 2306 12494 7038 827 -86 -6965 -3428 2326 -5319 -9903 -6526 8186 4106 -18203 -28196
14099b8196O670J9343J6821o143r324M441N399J3464j2239j1311K3880O059j0383
$$ -28196 -21526 -2183 14638 8495 -829 3612 9011 22475 10236 -1075 22805 28864 18481
14086A8481j6799k0941J2714M622J2768K322K57j6074o628K895q194J5909K153
$$ 18481 1682 -19259 -6545 -1923 10845 13167 13424 -2650 -9278 -6383 -14577 1332 3485
14073C485m665m928J414P721j435M36J3574J391l363j4058O27L876J508n628l490
$$ 3485 -1180 -6108 -4694 3027 1592 2028 15602 16993 13630 -428 199 4075 5583 -45 -3535
14058c535r104N128j0614m318K1693J351r539L227m62j0267j606R010K285M888
$$ -3535 -12639 -7511 -18125 -22443 -750 601 -8938 -5711 -6173 -16440 -18046 -9036 -6751 -1863
14044a863N949L655O639M901p911j694j7363n111j0008j568J0777J1436k182N640
$$ -1863 4086 7741 14380 19281 11370 9676 -7687 -12798 -22806 -24374 -13597 -2161 -4343 1297
14030A297l105J502q726j5558J443J3325J4878p111M013o923J605J3687M125O261
$$ 1297 -1808 -306 -9032 -24590 -23147 -9822 5056 -2055 1958 -4965 -3360 10327 14452 20713
14016B0713j3477L146n191j2615j1085K095K4043L74j0774P20n300m503l824n575
$$ 20713 7236 10382 5191 -7424 -18509 -16414 7629 8003 -2771 -2051 -7351 -11854 -15678 -21253
14002b1253j4244J0132N984l658J41o821R429J4629P831j052j1299J0459k281
$$ -21253 -35497 -25365 -19381 -23039 -22898 -29719 -20290 -5661 2170 1118 -10181 278 -2003
13989b003L531n390q357O368J6782k726K339Q111Q838K841j2009J481q799q183
$$ -2003 1528 -3862 -12219 -5851 10931 8205 10544 18655 27493 30334 18325 19806 11007 2824
13975B824R952k2891j0239j686k821J6951O621J1613K343k890m381p15j4333o494
$$ 2824 12776 -10115 -20354 -22040 -24861 -7910 -1289 10324 12667 9777 5396 4681 -9652 -16146
13961a6146K1079M446J1044j6682p274q599P049O713j5036j4317O722N175J2316
$$ -16146 4933 9379 20423 3741 -3533 -12132 -5083 1630 -13406 -27723 -21001 -15826 -3510
13948c510J0464p679K757J630M678m838J4159j726j6012j530j3987k765J9164
$$ -3510 6954 -725 2032 3662 8340 3502 17661 15935 -77 -1607 -15594 -18359 805
13935H05K607P36K0272j606J0909M973l797j1617k109j3045j4756N620P769J3810
$$ 805 3412 4148 24420 22814 33723 38696 34899 23282 21173 8128 -6628 -1008 6761 20571
13921B0571k42m711k794j3421j3639j0257Q324K803n736N937Q502q230j1115r140
$$ 20571 20329 15618 12824 -597 -14236 -24493 -16169 -13366 -19102 -13165 -4663 -12893 -24008 -33148
13907c3148J5805J1027o250N609O775J2500o066N9j370j059j381L262O906j2012
$$ -33148 -17343 -6316 -12566 -6957 -182 12318 6252 6311 4941 3882 2501 5763 12669 657
13893F57o514J928r066J0410J0371m26N979j0370J2040O384j0931k7428J2269
$$ 657 -5857 -3929 -12995 -2585 7786 7360 13339 2969 15009 21393 10462 -16966 -4697
13880d697J3681J4816J0328N078j0792n241j7991j7006P833J4702K31J0216R408
$$ -4697 8984 23800 34128 39206 28414 23173 5182 -11824 -3991 10711 10942 21158 30566
13867C0566J0978l780p036J058N261j8019j1944r831j5582N426P281K386o173
$$ 30566 41544 37764 30728 31786 37047 19028 7084 -2747 -18329 -12903 -5622 -3236 -9409
13854i409q08M756L835k683R20J8582R257k509j597j4843j3699j738J0375o02
$$ -9409 -10217 -5461 -1626 -4309 -3389 15193 24450 21941 20344 5501 -8198 -9936 439 -163
13840a63o780n451j4633J0774j268J035J1690K373K472j819l499n860l107J7393
$$ -163 -6943 -12394 -27027 -16253 -17521 -16486 -4796 -2423 49 -1770 -5269 -11129 -14236 3157
13826C157Q847k0783j3143R496J4445K552j2723j3787j5496n6J9588J139n583
$$ 3157 12004 -8779 -21922 -12426 2019 4571 -8152 -21939 -37435 -37491 -17903 -16764 -22347
13813b2347m325k751n484J2807J2571L187J3898J2169K967J9297M352k2706k2678
$$ -22347 -26672 -29423 -34907 -22100 -9529 -6342 7556 19725 22692 41989 46341 23635 957
13800I57j9242K3670J1829j5567j2421J2999J6360k477p46j0959m565R329q354
$$ 957 -18285 5385 17214 1647 -10774 2225 18585 16108 15362 4403 -162 9167 813
13787H13j2204j1799M986O568J9904M433p638L821r633N564p414j2456Q879L378
$$ 813 -11391 -23190 -18204 -11636 8268 12701 5063 8884 -749 4815 -2599 -15055 -6176 -2798
13773b798L018J0943J200L79K416J9703j735j7833K864O000j5696p57n965l777
$$ -2798 220 11163 12363 12742 15158 34861 33126 15293 18157 24157 8461 7704 1739 -2038
13759b038J028M078n894l743J8674o59m87M411r066L492Q317M93k639n738j1981
$$ -2038 -1010 3068 -2826 -6569 12105 11446 10959 15370 6304 9796 18113 18606 15967 10229 -1752
13744a752j5814J662n3m224o178O327J2846J1085L383L654p079p454k739l044
$$ -1752 -17566 -15904 -15957 -20181 -26359 -20032 -7186 3899 7282 10936 3857 -3597 -6336 -9380
13730i380m856p089l451P500j1023N498O045R070K13J3586O70l3N683R803P410
$$ -9380 -14236 -21325 -24776 -17276 -28299 -22801 -16756 -7686 -7473 6113 6783 6750 12433 22236 29646
13715B9646q709m973j4572k333M627Q050N269n094J1747M226R003K544m398J526
$$ 29646 20937 15964 1392 -941 3686 11736 17005 11911 23658 27884 36887 39431 35033 36559
13701C6559l151j640p314k1426k393J601J7245k079L530m936q70Q084l137n934
$$ 36559 33408 31768 24454 3028 635 2236 19481 17402 20932 15996 15126 23210 20073 14139
13687A4139L077J0397j3876p376r659j2883K639q046k09J386K651R463L226M278
$$ 14139 17216 27613 13737 6361 -3298 -16181 -13542 -21588 -21797 -20411 -17760 -8297 -5071 -793
13673g93j2177O10m79r861j1876j759N957K53j2698J2605J7396j748k932K1130
$$ -793 -12970 -12360 -12839 -22700 -34576 -36335 -30378 -30125 -42823 -30218 -12822 -14570 -17502 3628
13659C628p433r977L474o024K070P988P969J3946k613j0349J5302p614j0011o006
$$ 3628 -3805 -13782 -10308 -16332 -14262 -6274 1695 15641 13028 2679 17981 10367 356 -5650
13645e650O624l868N346j144n407K962o260q992R580j909j5142j0092J7363K0531
$$ -5650 974 -2894 2452 1308 -4099 -1137 -7397 -16389 -6809 -8718 -23860 -33952 -16589 3942
13631C942L160o219q391j244l540N73K3477P968j8755j2467J8957O657m154O14
$$ 3942 7102 883 -7508 -8752 -12292 -11719 11758 19726 971 -11496 7461 14118 9964 10578
13617A0578J5411r071j1028r377m35j3204j2203K883L889O375k102Q423N560l714
$$ 10578 25989 16918 5890 -3487 -3922 -17126 -29329 -26446 -22557 -16182 -18284 -9861 -4301 -8015
13603h015J7076p856o307k379R268l442J0148m377L226J6570J776J2171j703m235
$$ -8015 9061 1205 -5102 -7481 1787 -1655 8493 4116 7342 23912 25688 37859 36156 31921
13589C1921j4312q393M167j5498l519O475M811m613k7516P80J6412J3469O493
$$ 31921 17609 9216 13383 -2115 -5634 841 5652 1039 -26477 -25697 -9285 4184 10677
13576A0677R314J1572j027k0838n199J269N634k222m094r745P218O827j2540P991
$$ 10677 19991 31563 30536 9698 4499 5768 11402 9180 5086 -4659 2559 9386 -3154 4837
13562D837O88j6891j837l083p799K057J0037m670j2193R097J3318N066J720r75
$$ 4837 5525 -11366 -13203 -16286 -24085 -22028 -11991 -16661 -28854 -19757 -6439 -1373 347 -628
13548f28o512j8833M4L102R708J1137J353J605M305k578n527P92o387P34k2749
$$ -628 -7140 -25973 -25929 -22827 -13119 -1982 -629 976 5281 2703 -2824 -2032 -8419 -7685 -30434
13533c0434r168J8270K0399L273J4751j556q897j3396J6004J6318o914j424k642
$$ -30434 -39602 -21332 -933 2340 17091 15535 6638 -6758 9246 25564 18650 17226 14584
13520A4584j3849o582M981J5700J6426j7921p596j693J2991q331k0081K218J9648
$$ 14584 735 -5847 -866 14834 31260 13339 5743 4050 17041 8710 -11371 -9153 10495
13507A0495n380q165l744k414J1783M895O733p060l911n814q025J4709O040N197
$$ 10495 5115 -3050 -6794 -9208 2575 7470 14203 7143 3232 -2582 -10607 4102 10142 15339
13493A5339N439k96p883J0430O075k2995r384J8455M208R107P934k4061k0634
$$ 15339 20778 20482 12599 23029 29104 6109 -3275 15180 19388 28495 36429 12368 -8266
13480h266k3149Q077Q273p913J052Q929M945P579M152n438m007J235J0345O883
$$ -8266 -31415 -23338 -15065 -22978 -21926 -12997 -8052 -473 3679 -1759 -5766 -4531 5814 12697
13466A2697J275k058j3455R034L31l887R391j236q893j0608J5497J4396Q289L947
$$ 12697 13972 11914 -1541 7493 7824 3937 13328 12092 3199 -7409 8088 22484 30773 34720
13452C4720J468K648o25q715j1656m158O047L860j3702k0646n602M89Q493j9425
$$ 34720 36188 38836 38211 29496 17840 13682 19729 23589 9887 -10759 -16361 -15872 -7379 -26804
13438b6804O858K5633j6523k3963O381J9346P031M360R933k892rq394P491j11
$$ -26804 -19946 5687 -10836 -34799 -28418 -9072 -2041 2319 12252 9360 9351 957 8448 8337
13424H337p370j0557J583J2752Q751j5021k526P785N882p049J7870J2414N408
$$ 8337 967 -9590 -8007 4745 13496 -1525 -4051 3734 9616 2567 20437 32851 38259
13411C8259j6659j2222J9374M903M730j0193j3336K681j7294O124K7250n681j0923
$$ 38259 21600 9378 28752 33655 38385 28192 14856 17537 243 6367 33617 27936 17013
13398A7013L448N809p286J1323M145r564J6302J1871p089J0567J9601k2096r064
$$ 17013 20461 26270 18984 30307 34452 24888 41190 53061 45972 56539 76140 54044 44980
13385D4980k3228r335J520K90l463M258j973n947o868j7538O961j103r69R62j791
$$ 44980 21752 12417 13937 14227 10764 15022 13049 7102 234 -17304 -10343 -11446 -12415 -11453 -13244
13370a3244J293p659P80J3423P770N093R034J969k157j4029j238p683q903J1305
$$ -13244 -11951 -19610 -18830 -5407 2363 7456 16490 18459 16302 2273 1035 -6648 -15551 -4246
13356d246M016j2383J965Q808J112m666Q50J452M293o969N020k722J1701J1036
$$ -4246 -230 -12613 -10648 -1840 -728 -5394 -4544 -3092 1201 -5768 -748 -3470 8231 19267
13342A9267L251J1831l472k0150j9497P71N455j1018J6136J5235m64J2115j0410
$$ 19267 22518 34349 30877 10727 -8770 -7999 -2544 -13562 2574 17809 17345 29460 19050
13329A9050j6818r46n363j5270N785K5430P00l12n653N988l02o59K9j2368q046
$$ 19050 2232 1286 -4077 -19347 -13562 11868 12568 12256 6603 12591 12289 11630 11659 -709 -8755
13314h755J995k577N414j0974M270M594q506J0483J2252r601j6583J000J7370
$$ -8755 -6760 -9337 -3923 -14897 -10627 -6033 -14539 -4056 8196 -1405 -17988 -16988 382
13301C82K50j5876r490M77M068m333j3498J7687K9009J2344L68j5285j2200N846
$$ 382 632 -15244 -24734 -24257 -20189 -24522 -38020 -20333 8676 21020 21388 6103 -6097 -251
13287b51L208n003O638k015J060n284J4164j3498l208K6086j2185n938J131R019
$$ -251 2957 -2046 4592 2577 3637 -1647 12517 -981 -4189 21897 9712 3774 4905 13924
13273A3924j7296K050O671k835j135l528k897R190J2650L250l119K964O390j2453
$$ 13924 -3372 -1322 5349 2514 1379 -2149 -5046 4144 16794 20044 16925 19889 26279 13826
13259A3826k4104l637M169l193J857O091J3307l722L616m089k0722j0078P904
$$ 13826 -10278 -13915 -9746 -12939 -11082 -4991 8316 4594 8210 4121 -16601 -26679 -18775
13246a8775J654J7214R484j6453k3968l060Q072R510J0976K006n170R037J5205
$$ -18775 -17121 93 9577 -6876 -30844 -33904 -25832 -16322 -5346 -3340 -8510 527 15732
13233A5732o109j1543k02L828J01n569l25J127p757J8180O655J6600M516l699
$$ 15732 9623 -1920 -2122 1706 1807 -3762 -4087 -2960 -10717 7463 14118 30718 35234 31535
13219C1535J4991n596l0777r871N791j087n005O142m339j463N736K7957Q876j1637
$$ 31535 46526 40930 10153 282 6073 4986 -19 6123 1784 321 6057 34014 42890 31253
13205C1253j9487q387J7927J0285l601j3023j9283Q821K3679m402j9759o839J0656
$$ 31253 11766 3379 21306 31591 27990 14967 -4316 4505 28184 23782 4023 -2816 7840
13192G840q371j8811J2849K1062M759P862l761p684J626J1482m9j4380J637k7391
$$ 7840 -531 -19342 -6493 14569 19328 27190 23429 15745 17371 28853 28804 14424 16061 -11330
13178a1330k0161l130K4400K2581j0878o499j9191O725k688K653j548P461J5827
$$ -11330 -31491 -34621 -10221 12360 1482 -5017 -24208 -17483 -20171 -17518 -19066 -11605 4222
13165D222m417o363K665p842o086j4522j579J4901J2370L339j5618K726m6Q213
$$ 4222 -195 -6558 -3893 -11735 -17821 -32343 -33922 -19021 -6651 -3312 -18930 -16204 -16250 -8037
13151h037L827p121r04j0339o875J853J2655Q045J1559J7694L546l22j5309l436
$$ -8037 -4210 -11331 -12235 -22574 -29449 -27596 -14941 -6896 4663 22357 25903 25581 10272 6836
13137F836p616o45J7345M567j9625k651q085M475k5894m022M382M549K0330J6967
$$ 6836 -780 -1425 15920 20487 862 -1789 -9874 -5399 -31293 -35315 -30933 -26384 -6054 10913
13123A0913j564k2641j3041J2838K1313J290L04j1068j5252q290l700K2722J2807
$$ 10913 9349 -13292 -26333 -13495 7818 9108 9412 -1656 -16908 -25198 -28898 -6176 6631
13110F631J061M506k4397j2946M720n807j794J1014K351l837k195j4239J3494
$$ 6631 7692 12198 -12199 -25145 -20425 -26232 -28026 -17012 -14661 -18498 -20693 -34932 -21438
13097b1438O290O459o518j2131J2291J1258J5967J2968j5179m316N785j3874R082
$$ -21438 -15148 -8689 -15207 -27338 -15047 -3789 12178 25146 9967 5651 11436 -2438 6644
13084F644K4852j6274j1123n429l684j2888J492J4598o295j0927R851J036m490
$$ 6644 31496 15222 4099 -1330 -5014 -17902 -16410 -1812 -8107 -19034 -9183 -8147 -12637
13071a2637r269K3558K996k485l517J1779l211P885k4448j0645K1939J7155J6133
$$ -12637 -21906 1652 4648 2163 -1354 10425 7214 15099 -9349 -19994 1945 19100 35233
13058C5233k62j6825j2424J920q535J1050l563k072q580J2724M563J68p965j9364
$$ 35233 34971 18146 5722 7642 -893 10157 6594 4522 -4058 8666 13229 13397 5432 -13932
13044a3932j9474J1773J1796m805l453k87l444J0495K1017j4863N352P903j1039
$$ -13932 -33406 -21633 -9837 -14642 -18095 -18382 -21826 -11331 9686 -5177 175 8078 -2961
13031b961j3007J0271n202J455K276r902j3102k659J4300L564O094J1244o753
$$ -2961 -15968 -5697 -10899 -9444 -7168 -17070 -30172 -32831 -18531 -14967 -8873 2371 -4382
13018d382L25r003o123j0132l10Q877O388J417n146P51L642M523q719K125j610
$$ -4382 -4057 -13060 -19183 -29315 -29625 -20748 -14360 -12943 -18089 -17338 -13696 -9173 -17892 -15767 -17377
13003a7377Q838K542Q445J3333j555j4914K249n474O479j3380p160p471p531J3527
$$ -17377 -8539 -5997 2448 15781 14226 -688 1561 -3913 2566 -10814 -17974 -25445 -32976 -19449
12989a9449J2175K917r585J3613P293p333o551J3882p29j6075j2382J151P962
$$ -19449 -7274 -4357 -13942 -329 6964 -369 -6920 6962 6233 -9842 -22224 -21073 -13111
12976a3111K685K560J8386R775q768r98j2499k2634o526K697J0524J424J6381
$$ -13111 -10426 -7866 10520 20295 11527 10529 -1970 -24604 -31130 -28433 -17909 -16485 -104
12963a04J1094Q873K692j8876m382L483j3075p852J0363q768J051Q243j761K121
$$ -104 10990 19863 22555 3679 -703 2780 -10295 -18147 -7784 -16552 -15501 -7258 -9019 -6898
12949f898R853M956l995J0042p915K078j2885N166m310J0611L13r417l23O569
$$ -6898 2955 7911 3916 13958 6043 8121 -4764 402 -3908 6703 7016 -2401 -2724 3845
12935C845P363K070N348j5925j336o030r247k453J904j8758O14J9445M399L168
$$ 3845 11208 13278 18626 2701 1365 -4665 -13912 -16365 -14461 -33219 -32605 -13160 -8761 -5593
12921e593J428L86j1492K463o129K869J6267J0979j2409L848J5418r076j6696
$$ -5593 -4165 -3779 -15271 -12808 -18937 -16068 199 11178 -1231 2617 18035 8959 -7737
12908g737o426K0782j672j0310p87K087O56J5895P728M018J1688K934j9934k207
$$ -7737 -14163 6619 4947 -5363 -6150 -4063 -3407 12488 20216 24234 35922 38856 18922 16715
12894A6715J2533q078j5426m677J4343N300O587j0944Q233n347j413j6540k3662
$$ 16715 29248 21170 5744 1067 15410 20710 27297 16353 24586 19239 17826 1286 -22376
12881b2376L004J3464K0452K640p477j8585J1835p24J5835m834j6593j2516K976
$$ -22376 -19372 -5908 14544 17184 9707 -8878 2957 2233 18068 13234 -3359 -15875 -12899
12868a2899j93r680j001n94K577j481l157J0881O574K6615J6098P386j022m2816
$$ -12899 -13092 -22772 -23773 -24367 -21790 -23271 -26428 -15547 -8973 17642 33740 41126 40104 -2712
12854b712L103J1792N101J438p171M947q318m398k242n544J0609j966j0429l071
$$ -2712 391 12183 17284 18722 11551 16498 8180 3782 1540 -4004 6605 4639 -5790 -8861
12840h861m011j5157M146k010o26P721Q530k1946M79l528K819N555M0P898k671
$$ -8861 -12872 -28029 -23883 -25893 -26519 -18798 -10268 -32214 -31735 -35263 -32444 -26889 -26849 -18951 -21622
12825b1622J0772R966K932L019O040n99p111l03L317O82Q382J8622j4388j6036
$$ -21622 -10850 -884 2048 5067 11107 10508 3397 3094 6411 7093 15475 34097 19709 3673
12811C673R035n796K477J4556j2275j9053j6287n987K0072P624P616O753j128
$$ 3673 12708 6912 9389 23945 11670 -7383 -23670 -29657 -9585 -1961 5655 12408 11280
12798A1280r387M555J4496q470M38o853o08m764j2267L056o556P186K515J2828
$$ 11280 1893 6448 20944 12474 12912 6059 5451 687 -11580 -8524 -15080 -7894 -5379 7449
12784G449P305p13j0041k3042J0781L303m235O999m824r724J0877K239p890O707
$$ 7449 14754 14041 4000 -19042 -8261 -4958 -9193 -2194 -7018 -16742 -5865 -3626 -11516 -4809
12770d809R254r12P08K367r422l217K0163j1808n959q982O308J8603j3551m698
$$ -4809 4445 3533 4241 6608 -2814 -6031 14132 2324 -3635 -12617 -6309 12294 -1257 -5955
12756e955k578o144q334N539J3243L812k2966K2120J1396k856j1393j2149j458
$$ -5955 -8533 -14677 -23011 -17472 -4229 -417 -23383 -1263 10133 7277 -4116 -16265 -17723
12743a7723O57J1236P391J2535n743j734Q230J472k068o038k3450k0723J8165
$$ -17723 -17066 -5830 1561 14096 8353 6619 14849 16321 14253 8215 -15235 -35958 -17793
12730a7793J6359q075l277l366j783J9317J3723l468M829J3825q670j293K821
$$ -17793 -1434 -9509 -12786 -16152 -17935 1382 15105 11637 16466 30291 21621 20328 23149
12717B3149k3346j6334J2979q949R83O763J2523KP86l868r794Q452R230j6119
$$ 23149 -197 -16531 -3552 -12501 -11518 -4755 7768 7770 8556 4688 -5106 3346 12576 -3543
12703c543j4160Q461R761j4528o836J322k157R648J1648O753j6j0348j2374l653
$$ -3543 -17703 -9242 519 -14009 -20845 -19523 -21680 -12032 -384 6369 6353 -3995 -16369 -20022
12689b0022l615J4844Q666p080j073k247q053K2747Q097n708j927j986K305r270
$$ -20022 -23637 -8793 -127 -7207 -8280 -10527 -18580 4167 12264 6556 4629 2643 4948 -4322
12675d322r402p229K123J1126J101j0766o527K4526O628k6156J2469R124O874
$$ -4322 -13724 -20953 -18830 -7704 -6603 -17369 -23896 630 7258 -18898 -6429 2695 9569
12662I569j4688P667J587j4728O982K044l419n610O192M903J7984o912q547n038
$$ 9569 -5119 2548 4135 -10593 -3611 -1567 -4986 -10596 -4404 499 18483 11571 3024 -2014
12648b014j3749J6J8974j458J02j9825J7806O960o615N684j6818k3657J5219j0924
$$ -2014 -15763 -15747 3227 1769 1871 -17954 -148 6812 197 5881 -10937 -34594 -19375 -30299
12634c0299m255O389J0378K596j313j316J2133K1493J3248n179q752j5971r371
$$ -30299 -34554 -28165 -17787 -15191 -16504 -17820 -5687 15806 29054 23875 15123 -848 -10219
12621a0219J1397J6808J067j145n036J035p046j1372j9318m039k113j575J7734
$$ -10219 1178 17986 19053 17908 12872 13907 6861 -4511 -23829 -27868 -29981 -31556 -13822
12608a3822K4881R87j648j7567j7384N259r554q920q191N199K0040N359L472R633
$$ -13822 11059 12046 10398 -7169 -24553 -19294 -28848 -37768 -45959 -40760 -20720 -15361 -11889 -2256
12594b256N144J0354l484k3903N296J6344j085Q68L126J437j6987j2359K4385
$$ -2256 2888 13242 9758 -14145 -8849 7495 6410 7278 10404 11841 -5146 -17505 6880
12581F880J2394K0444j4076q521r702R98L408Q188j8038k0659p605O78K890P908
$$ 6880 19274 39718 25642 17121 7419 8417 11825 20013 1975 -18684 -26289 -25611 -22721 -14813
12567a4813r767M703J4126P423l844j9147j5774N818K096R565J0446J0654j288
$$ -14813 -24580 -19877 -5751 1672 -2172 -21319 -37093 -31275 -29179 -19614 -9168 1486 198
12554A98k897p444o641P024J6287n266R299J1105p966K209o29k0863J229q376
$$ 198 -2699 -10143 -16784 -9760 6527 1261 10560 21665 13699 15908 15279 -5584 -4355 -12731
12540a2731n932l882K1264J1679j0831r612J7571J8570j0679k1396p899n942K1700
$$ -12731 -18663 -22545 -1281 10398 -433 -10045 7526 26096 15417 -5979 -13878 -19820 1880
12527A880J5355L254k5426j2601J0244J082j1495J88Q175l444K1352J6548R178
$$ 1880 17235 20489 -4937 -17538 -7294 -6212 -17707 -17519 -9344 -12788 8564 25112 34290
12514C4290J867j1041k1048k6143N255R040j8n090j3205m073J4499K026J5816
$$ 34290 36157 25116 4068 -22075 -16820 -7780 -7798 -12888 -26093 -30166 -15667 -13641 2175
12501B175J5378j3997j4572m914r405K4857J3403q23o431m458j1265n669R462
$$ 2175 17553 3556 -11016 -15930 -25335 -478 12925 12102 5671 1213 -10052 -15721 -6259
12488f259j861L372Q864j1303j1388K933L082P243P120j675L699M515j0684j1511
$$ -6259 -8120 -4748 4116 -7187 -18575 -15642 -12560 -5317 1803 128 3827 8342 -2342 -13853
12474a3853NO111m559o625Q9L764K1949l734j3013m820Q47P042n851O437O90J0237
$$ -13853 -13848 -7737 -12296 -18921 -18832 -15068 6881 3147 -9866 -14686 -13839 -6797 -12648 -6211 -5521 4716
12458D716k719j1696O634J2491N603j4047N639j954K300J3100k8625k2014R778
$$ 4716 1997 -9699 -3065 9426 15029 982 6621 4667 6967 20067 -8558 -30572 -20794
12445b0794J911J7987J125n648N651J2887L074r005q372j2715m242O322O631O567
$$ -20794 -18883 -896 229 -5419 232 13119 16193 7188 -1184 -13899 -18141 -11819 -5188 1379
12431A379J0028M434L994k492m510n211L258j1472P660R727j6716J944k95r040
$$ 1379 11407 15841 19835 17343 12833 7622 10880 -592 7068 16795 79 2023 1728 -7312
12417g312Q910j369J856Q836O737j1312j0357O452K506k418k775l430r872J2437
$$ -7312 1598 229 2085 10921 17658 6346 -4011 2441 4947 2529 -246 -3676 -13548 -1111
12403a111J4836R970q703j1506J0188j4659k3671J055L047Q845L100j7549M170
$$ -1111 13725 23695 14992 3486 13674 -985 -24656 -23601 -20554 -11709 -8609 -26158 -21988
12390b1988J6111N202q895M005J3579r377j1376l513J751j4209K4613J1254j2280
$$ -21988 -5877 -675 -9570 -5565 8014 -1363 -12739 -16252 -14501 -28710 -4097 7157 -5123
12377e123k746J3489J0218J5146J2022K025j2681l779L475j0639l0592o905J8869
$$ -5123 -7869 5620 15838 30984 43006 45031 32350 28571 32046 21407 -9185 -16090 2779
12364B779O23j4753K681K560K3908r601l247r125k465L94j0036m395Q352J2586
$$ 2779 3402 -11351 -8670 -6110 17798 8197 4950 -4175 -6640 -6246 -16282 -20677 -12325 261
12350B61l689r063J5360j3938j2611L590J2514R053M189J859J6279p42n841j2289
$$ 261 -3428 -12491 2869 -11069 -23680 -20090 -7576 1477 5666 7525 23804 23062 17221 4932
12336D932O481R11P814J2653j2406p222o515K101q663M182o776J0406k730m430
$$ 4932 11413 12324 20138 32791 20385 13163 6648 8749 86 4268 -2508 7898 5168 738
12322G38q63m864k828J3486J5405q636L430j4158j1966J467O711L19j8461n721
$$ 738 -125 -4989 -7817 5669 21074 12438 15868 1710 -10256 -8789 -2078 -1759 -20220 -25941
12308b5941M036J4077N425N887k534j1403R535J1862K998K995k168J157L120k623
$$ -25941 -21905 -7828 -2403 3484 950 -10453 -918 10944 13942 16937 14769 15926 19046 16423
12294A6423r746J1021k595j6817n301p125l319J0298Q823j2986J45J7467L364
$$ 16423 6677 17698 15103 -1714 -7015 -14140 -17459 -7161 1662 -11324 -11179 6288 9652
12281I652l390o762J1239J234j428J9553m286l1180k5521M688J100J5861L065
$$ 9652 6262 -500 10739 11973 10545 30098 25812 -5368 -30889 -26201 -25101 -9240 -6175
12268f175j1866J671J3195K979M185o034j5391k2286J8444K3726o86l84K721P447
$$ -6175 -18041 -16370 -3175 -196 3989 -2045 -17436 -39722 -21278 2448 1762 1378 4099 11546
12254A1546K1620p853j0842m903o096j1173J767p364n97R444J3570j0100j2736
$$ 11546 33166 25313 14471 9568 3472 -7701 -5934 -13298 -13895 -4451 9119 -981 -13717
12241a3717M891K4680O246j2017j130K947k304Q44o016j919l870R513L389l10
$$ -13717 -8826 15854 22100 10083 8953 11900 9596 10440 4424 2505 -1365 8148 11537 11227
12227A1227l253L258O717J6071K0108J339m3096n616J1164P838L719j0188k0307
$$ 11227 7974 11232 17949 34020 54128 55467 12371 6755 17919 25757 29476 19288 -1019
12214a019l1936J5205O358P489J2392j3291k1089n601P694Q364M489j1341K135
$$ -1019 -32955 -17750 -11392 -3903 8489 -4802 -25891 -31492 -23798 -15434 -10945 -22286 -20151
12201b0151j0041k928N972J2983m81J5840K0231J195Q687j134j9498r169j540
$$ -20151 -30192 -33120 -27148 -14165 -14646 1194 21425 22620 31307 30173 10675 1506 -34
12188c4k46j7603L467J3624O790j7897J0646J8685N510n88j417n223k492K150
$$ -34 -280 -17883 -14416 -792 5998 -11899 -1253 17432 22942 22354 20937 15714 13222 15372
12174A5372j9725j0552L444K116P406J8221m474j5892j2422o584j827R485N699
$$ 15372 -4353 -14905 -11461 -9345 -1939 16282 11808 -4084 -16506 -23090 -24917 -15432 -9733
12161i733j7515q717J7674P170R968N073k782r122J0182m06O593k428O47J0531
$$ -9733 -27248 -35965 -18291 -11121 -1153 3920 1138 -7984 2198 1792 8385 5957 6604 17135
12147A7135O421O807r66k6800N453P756j9494j0654N182j004j224j3736M852p107
$$ 17135 23556 30363 29397 2597 8050 15806 -3688 -14342 -9160 -10164 -11388 -25124 -20272 -27379
12133b7379R819R551J425m14p991J1351J6941o48n893N754J2502m027r374r312
$$ -27379 -17560 -8009 -6584 -6998 -14989 -3638 13303 12655 6762 12516 25018 20991 11617 2305
12119B305r230m246P867Q977r458k362K2395J0501m804j2537o577L68J2485l534
$$ 2305 -6925 -11171 -3304 5673 -3785 -6147 16248 26749 21945 9408 2831 3199 15684 12150
12105A2150m41j9831l0460l076J8746P562J5393m340j1045M61M532M743K5225
$$ 12150 11709 -8122 -38582 -41658 -22912 -15350 43 -4297 -15342 -14881 -10349 -5606 19619
12092A9619J1079k303n141j3573j3358O753J2927R14q286K314k0350k449Q563
$$ 19619 30698 28395 23254 9681 -3677 3076 16003 16917 8631 10945 -9405 -11854 -3291
12079c291L457j0121j2716n58K1680L699j1750J075K994j0065n009o893O927m274
$$ -3291 166 -9955 -22671 -23229 -1549 2150 -9600 -8525 -5531 -15596 -20605 -27498 -20571 -24845
12065b4845K471K3441J453j0747J236m953M216J3088O931j2940j170J2143m526
$$ -24845 -22374 1067 2520 -8227 -6991 -11944 -7728 5360 12291 -649 -1819 10324 5798
12052E798m190o582J714r079O423J3423n279P650R800J1867j4633k5848m849k636
$$ 5798 1608 -4974 -3260 -12339 -5916 7507 2228 9878 19678 31545 16912 -8936 -13785 -16421
12038a6421J4390K855r445m36J3730l937p468K504J173o984j0362j117J4086m088
$$ -16421 -2031 824 -8621 -9057 4673 736 -6732 -4228 -3055 -10039 -20401 -21518 -7432 -11520
12024a1520P27M897m012J881L156n341N177l161l764J9424J2219j0516r152M782
$$ -11520 -10793 -5896 -9908 -8027 -4871 -10212 -5035 -8196 -11960 7464 19683 9167 15 4797
12010D797p606N963n92k1987o32P03o252Q295J5098J6348r638n320n133M887Q846
$$ 4797 -2809 3154 2562 -19425 -20057 -19354 -25606 -17311 -2213 14135 4497 -823 -5956 -1069 7777
11995G777j430O074O914L401l099n105q443k013J2588K863j1819k1745j9627M244
$$ 7777 6347 12421 19335 22736 19637 14532 6089 4076 16664 19527 7708 -14037 -33664 -29420
11981b9420k203J6416K3747l269r282j2140J5069L3062j4410k1343p64j153j1663
$$ -29420 -31623 -15207 8540 5271 -4011 -16151 -1082 31980 17570 -3773 -4537 -5690 -17353
11968a7353O886O399o36M768O783J2704O527m246k346o730o29j708k51j2213o046
$$ -17353 -10467 -4068 -4704 64 6847 19551 26078 21832 19486 12756 12127 10419 10168 -2045 -8091
11953h091J0227J6054K44l212n378q891k024o109L824p599j1055M749Q493j685
$$ -8091 2136 18190 18434 15222 9844 953 -1071 -7180 -3356 -10955 -22010 -17261 -8768 -10453
11939a0453J0959N549j716n27j0132j1882J502J1891J3461m274j0065k170N684
$$ -10453 506 6055 4339 3812 -6320 -18202 -16700 -4809 8652 4378 -5687 -7857 -2173
11926b173m01K3989l477k2758m994j4628J1022J3807m954j1806j0549O986L160
$$ -2173 -2574 21415 17938 -4820 -9814 -24442 -13420 387 -4567 -16373 -26922 -19936 -16776
11913a6776q918K701M118l902K907K0147j3098q194o863jK0802J8521j0018j2038
$$ -16776 -25694 -22993 -18875 -22777 -19870 277 -12821 -21015 -27878 -27879 -7077 11444 1426 -10612
11899a0612k454r072j3950K3869K2261n623K187n571k6525J6224P681j38J3463
$$ -10612 -13066 -22138 -36088 -12219 10042 4419 6606 1035 -25490 -9266 -1585 -1723 11740
11886A1740J413n425k3318J6425P330j1515j961J650N847R687L995j8404j9577
$$ 11740 13153 7728 -15590 835 8165 -3350 -5311 -3661 2186 11873 15868 -2536 -22113
11873b2113N583k434j0902K756J9980J2880j5273J4062M883K110L94o23J1333
$$ -22113 -16530 -18964 -29866 -27110 -7130 5750 -9523 4539 9422 11532 11926 11303 22636
11860B2636R02q297j320L599j15K479k231j9074j3980j1128L1565K0678r494q200
$$ 22636 23538 15241 13921 17520 17405 19884 17653 -1421 -15401 -26529 5036 25714 16220 8020
11846H020K257K408l292J814k0683r87J0364o366J328K784r135Q270K7540O808
$$ 8020 10277 12685 9393 11207 -9476 -10463 -99 -6465 -5137 -2353 -11488 -3218 24322 31130
11832C1130k2457k1173j2381j877L724J881j1334p788M040K878R573J0084K8400
$$ 31130 8673 -12500 -24881 -26758 -23034 -21153 -32487 -40275 -36235 -33357 -23784 -13700 14700
11819A4700J5687j3651m284p619j0934q772K366N553J7707m320M173o642q549
$$ 14700 30387 16736 12452 4833 -6101 -14873 -12507 -6954 10753 6433 10606 3964 -4585
11806d585L832j8704o609j899l469O899K765n977J4983J0048J0322p006Q99L48
$$ -4585 -753 -19457 -26066 -27965 -31434 -24535 -21770 -27747 -12764 -2716 7606 600 1499 1847
11792A847l466J1968n010j159R263J258j4507p506o467N688M266J2129m552q060
$$ 1847 -1619 10349 5339 4180 13443 14701 194 -7312 -13779 -8091 -3825 8304 3752 -4308
11778d308J863p397P292O523j1385J3664J3682o97J2905M058j8324k4642L512
$$ -4308 -2445 -9842 -2550 3973 -7412 6252 19934 19237 32142 36200 17876 -6766 -3254
11765c254l541q438j499R787J0180P581j1793j7571Q250O684k070j1665o486N978
$$ -3254 -6795 -15233 -16732 -6945 3235 10816 -977 -18548 -10298 -3614 -5684 -17349 -23835 -17857
11751a7857O066j061j110n139O12J2217j377n227j706m412m212m064K4119P395
$$ -17857 -11791 -12852 -13962 -19101 -18489 -6272 -7649 -12876 -14582 -18994 -23206 -27270 -3151 4244
11737D244j843P894j3185J580L063k105j0655Q892l824p182j8923P40J3200l21
$$ 4244 2401 10295 -2890 -1310 1753 -352 -11007 -2115 -5939 -13121 -32044 -31304 -18104 -18425
11723a8425L33N117p582J3871N420J3505K492j7073j9112j1850o996J1417J9150
$$ -18425 -18092 -12975 -20557 -6686 -1266 12239 14731 -2342 -21454 -33304 -40300 -28883 -9733
11710i733Q670j896o058J545P365J1577l817q237n334J0286q696o10J469L605
$$ -9733 -1063 -2959 -9017 -7472 -107 11470 7653 -584 -5918 4368 -4328 -4938 -3469 136
11696A36r79r820J0442l682N085m226q870J492k0936r35K4048O021M247n808j0486
$$ 136 -843 -10663 -221 -3903 1182 -3044 -11914 -10422 -31358 -32293 -8245 -2224 2023 -3785 -14271
11681a4271q927j5030q646K2694N037k1411P810J1900J7933n435j1512K833Q933
$$ -14271 -23198 -38228 -46874 -24180 -19143 -40554 -32744 -20844 -2911 -8346 -19858 -17025 -8092
11668h092m411L978k413j0546o263k910J3578L633j2294N69J7827J2918J5118
$$ -8092 -12503 -8525 -10938 -21484 -27747 -30657 -17079 -13446 -25740 -25171 -7344 5574 20692
11655B0692j4075p452j8751n435o6L892N819R557k711J997q525j2738l907O984
$$ 20692 6617 -835 -19586 -25021 -25087 -21195 -15376 -5819 -8530 -6533 -15058 -27796 -31703 -24719
11641b4719m042k568J1290J540r56k784k588J8760J4772l315J1905Q683j1291
$$ -24719 -28761 -31329 -20039 -18499 -19455 -22239 -24827 -6067 8705 5390 17295 25978 14687
11628A4687k3634o777J530l14N748n44r541j0465J301J6810K286O79o847j2178
$$ 14687 -8947 -15724 -14194 -14508 -8760 -9304 -18845 -29310 -28009 -11199 -8913 -8234 -15081 -27259
11614b7259p867J1610J7357n742j4404k486N027R873J6432N982m708J489P387
$$ -27259 -35126 -23516 -6159 -11901 -26305 -28791 -23764 -13891 2541 8523 3815 5304 12691
11601A2691j8486p29j472j1183J125R955o527k0344j1846J0890J6536J1454j0234
$$ 12691 -5795 -6524 -7996 -19179 -18054 -8099 -14626 -34970 -46816 -35926 -19390 -7936 -18170
11588a8170M327K0863m19k872K256L013j5026j1064J6812O443K211K0210R55j5759
$$ -18170 -13843 7020 6601 3729 5985 8998 -6028 -17092 -280 6163 8374 28584 29539 13780
11574A3780m092j0201l513K374L225J4271K424K142J522j6182R920K392j4116
$$ 13780 9688 -513 -4026 -1652 1573 15844 18268 20410 21932 5750 15670 18062 3946
11561C946j3864m548o841J5995J7553j5297j5237J016R594P847Q143J2631n466
$$ 3946 -9918 -14466 -21307 -5312 12241 -3056 -18293 -17277 -7683 164 8307 20938 15472
11548A5472n967o966j2750J691N680O33r99k141J9572J4958j7057k6018r959M20
$$ 15472 9505 2539 -10211 -8520 -2840 -2207 -3206 -5347 14225 29183 12126 -13892 -23851 -23431
11534b3431L048L16J6702J1607L125j9847l7780q92J8317J5240M322N158r965
$$ -23431 -20383 -20067 -3365 8242 11367 -8480 -46260 -47152 -28835 -13595 -9273 -4115 -14080
11521a4080M819J217M093k059J3680j5757r535P318k12r871p929o807Q558J6601
$$ -14080 -9261 -8044 -3951 -6010 7670 -8087 -17622 -10304 -10516 -20387 -28316 -35123 -26565 -9964
11507i964K9572n164r705R37R539j7485r813K884P615J5110J4409k1483j7627
$$ -9964 19608 14444 4739 5676 15215 -2270 -12083 -9199 -1584 13526 27935 6452 -11175
11494a1175j265L00J6766k4K058j2947j8303m522p710J7875J6376P959j1053j7979
$$ -11175 -12440 -12140 4626 4602 6660 -6287 -24590 -29112 -36822 -18947 -2571 5388 -5665 -23644
11480b3644o765R183K1476l471j2785k4474N027J1906l27J1849m283K2084Q762
$$ -23644 -30409 -21226 250 -3221 -16006 -40480 -35453 -23547 -23874 -12025 -16308 5776 14538
11467A4538k2789m121K5780j40J009j2453J930N220J0382j900j0546J545j6116
$$ 14538 -8251 -12372 13408 13268 14277 1824 3754 8974 19356 17456 6910 8455 -7661
11454g661j0528R636R40J058N144K400k412m073l69J4871J2143j750j8628j861
$$ -7661 -18189 -8553 -7613 -6555 -1411 989 -1423 -5496 -5865 9006 21149 19399 771 -1090
11440a090m314L46J4518j6949k5973J3097J6662m899l892J280o716p017K5416
$$ -1090 -5404 -5058 9460 -7489 -33462 -20365 -3703 -8602 -12494 -11214 -17930 -24947 469
11427D69J3605Q495P18j0091j7043m828K455J7700J3480O041j2031k1488J427
$$ 469 14074 22569 23287 13196 -3847 -8675 -6220 11480 24960 31001 18970 -2518 -1091
11414a091J1086l281j0696r636K2009j0261L217J4111l597J065p670l012j5280
$$ -1091 9995 6714 -3982 -13618 8391 -1870 1347 15458 11861 12926 5256 2244 -13036
11401a3036J800O715N114p511J0082J8103k7k4666J90J197k904p591Q856M203
$$ -13036 -11236 -4521 593 -6918 3164 21267 21240 -3426 -3236 -2039 -4943 -12534 -3678 525
11387E25j7773J3328J1255q849n260K651j7507N542l629J4523J2981j4808O734
$$ 525 -17248 -3920 7335 -1514 -6774 -4123 -21630 -16088 -19717 -5194 7787 -7021 -287
11374b87J1679k340o883J0295O344o582p082K084j0989j0831N112m803j2527N494
$$ -287 11392 9052 2169 12464 18808 12226 5144 7228 -3761 -14592 -9480 -14283 -26810 -21316
11360b1316J5485K595J4737L443j5065k1501R01J4504J473L630J304m816Q267
$$ -21316 -5831 -3236 11501 14944 -121 -21622 -20721 -6217 -4744 -1114 190 -4626 3641
11347C641n969k317K433j0988m021J0685Q952q924k714K3037R656r655j8729j1586
$$ 3641 -2328 -4645 -2212 -13200 -17221 -6536 2416 -6508 -9222 13815 23471 13816 -4913 -16499
11333a6499M579K672k478K1809R796j4680j5248l562N882j1053L361J264n546
$$ -16499 -11920 -9248 -11726 10083 19879 5199 -10049 -13611 -7729 -18782 -15421 -14157 -19703
11320a9703p855J2174J1886p266j0182j821N145P639J5445q347p430J4054Q154
$$ -19703 -27558 -15384 -3498 -10764 -20946 -22767 -17622 -9983 5462 -2885 -10315 3739 11893
11307A1893r839r528M689Q602J6844K366Q47O628J928j113j3082k0088j3386N031
$$ 11893 2054 -7474 -2785 5817 22661 25027 25874 32502 34430 33317 20235 147 -13239 -8208
11293h208M78P649R928j2033j1991n461J0064J812M551o144K046j028o314Q31
$$ -8208 -7730 -81 9847 -2186 -14177 -19638 -9574 -7762 -3211 -9355 -7309 -8337 -14651 -13820
11279a3820o089p045j027J0141J6837L597p115N462k136K264J9636M128o091j5984
$$ -13820 -19909 -26954 -27981 -17840 -1003 2594 -4521 941 -1195 1069 20705 24833 18742 2758
11265B758l080m863j559k215N59R952J9034j501K929j0872j6169J0744N788n808
$$ 2758 -322 -5185 -6744 -8959 -8400 1552 20586 19085 22014 11142 -5027 5717 11505 5697
11251E697m821J2929k66l951K968p414K254Q255j1376n817P692k309R278R213
$$ 5697 876 13805 13539 9588 12556 5142 7396 15651 4275 -1542 6150 3841 13119 22332
11237B2332n741j2032k585r015L968N587P364K387n298k0535P084J0791R371j0179
$$ 22332 16591 4559 1974 -7041 -3073 2514 9878 12265 6967 -13568 -6484 4307 13678 3499
11223C499j2368J0l381L380L380R899M673p717j2329q394q919P043J3823q592
$$ 3499 -8869 -8859 -12240 -8860 -5480 4419 9092 1375 -10954 -19348 -28267 -21224 -7401 -15993
11209a5993n065j0201O092L0151J4841m675j4264J1233K0696n778j4818o851L776
$$ -15993 -21058 -31259 -25167 4984 19825 15150 886 12119 32815 27037 12219 5368 9144
11196I144n189j7309l292P556k139l554j4494J0961K1379k508k6814kJ4645K5012
$$ 9144 3955 -13354 -16646 -9090 -11229 -14783 -29277 -18316 3063 555 -26259 -26261 -11616 13396
11182A3396k278j6093p690J4512J4795N177j7386p530M815p968k362o317M24l564
$$ 13396 11118 -4975 -12665 1847 16642 21819 4433 -3097 1718 -6250 -8612 -14929 -14505 -18069
11168a8069J1213k662K359n901O882P361J742L678N584N394J462k653N038j0545
$$ -18069 -6856 -9518 -7159 -13060 -6178 1183 2925 6603 12187 17581 19043 16390 21428 10883
11154A0883r725m335m744M563p258k212Q528m278q53J3168k564j4737m631R215
$$ 10883 1158 -3177 -7921 -3358 -10616 -12828 -4300 -8578 -9431 3737 1173 -13564 -18195 -8980
11140h980j2165J2560J5805K444k726J7248Q148Q220j2142k8780r767l418K498
$$ -8980 -21145 -8585 7220 9664 6938 24186 32334 40554 28412 -368 -10135 -13553 -11055
11127a1055q420N466J624MM843p448m323l122L324N078J0301J7541q168k1297
$$ -11055 -19475 -14009 -12385 -12381 -7538 -14986 -19309 -22431 -19107 -14029 -3728 13813 5645 -15652
11113a5652o314J4652J3979J0904J0896o491j6890Q3M359Q689j0491j2798o168
$$ -15652 -21966 -7314 6665 17569 28465 21974 5084 5167 9526 18215 7724 -5074 -11242
11100a1242R786K4206O00j0175o504l546K207j635n105m903J3440K1061j105M965
$$ -11242 -1456 22750 23350 13175 6671 3125 5332 3697 -1408 -6311 7129 28190 27085 32050
11086C2050Q50j5313m721j8760j7246o103Q724Q657Q188j3327n411J2509K75J0030
$$ 32050 32900 17587 12866 -5894 -23140 -29243 -20519 -11862 -3674 -17001 -22412 -9903 -9628 402
11072D02m993p159J7853K7846L018j5180r925p672q502J0931K110j2013j891R017
$$ 402 -4591 -11750 6103 33949 36967 21787 11862 4190 -4312 6619 8729 -3284 -5175 3842
11058C842J2912J336L29j5050o214J1036M529r137m95j478k1345m30N495J4062
$$ 3842 16754 18090 18419 3369 -2845 8191 12720 3583 3088 1610 -19735 -20165 -14670 -608
11044f08j7199K205J2226J5967j1625l0172o779P358J1569j0253o53P413R313
$$ -608 -17807 -15602 -3376 12591 966 -29206 -35985 -28627 -17058 -27311 -27964 -20551 -11238
11031a1238J0709Q35o151j1224K114J184J9543R887p306k1467j3674J0448j986
$$ -11238 -529 306 -5845 -17069 -14955 -13771 5772 15659 8353 -13114 -26788 -16340 -18326
11018a8326M881P715J8204O436j5687j7910j498N544l656j3583J406J5057K4735
$$ -18326 -13445 -5730 12474 18910 3223 -14687 -16185 -10641 -14297 -27880 -26474 -11417 13318
11005A3318R641j086p924J7278K8942m528j1148J7648K7613J4268L365p696P247
$$ 13318 22959 21873 13949 31227 60169 55641 44493 62141 89754 104022 107387 99691 106938
10992A06938M6419L6645O3858O4415J01128J72620K23456K61238L55050N86740
$$ 106938 153357 190002 253860 318275 419403 592023 815479 1076717 1431767 2018507
10982B018507M25486n04550p53622m91408k64442j38621o7545n8218l5572k2141
$$ 2018507 2443993 1939443 1185821 694413 429971 291350 223805 165587 130015 107874
10972A07874l3680r938k1087j531k406k874J985j3087k540L212P921R533O992
$$ 107874 74194 64256 43169 41638 39232 36358 38343 25256 22716 25928 33849 43382 50374
10959E0374j0188r330o311k6786P120J0820j7528J5457n626o250n764R725j411
$$ 50374 40186 30856 24545 -2241 4879 15699 -1829 13628 8002 1752 -4012 5713 4302
10946D302m351J2482R466k0347j0038J9499m935o236n379p257L365m729q873n855
$$ 4302 -49 12433 21899 1552 -8486 11013 6078 -158 -5537 -12794 -9429 -14158 -23031 -28886
10932b8886n218l101R415L0040R947N594j0111j9133K63J2212J2701P73k0208
$$ -28886 -34104 -37205 -27790 2250 12197 17791 7680 -11453 -11190 1022 13723 14496 -5712
10919e712j007J4326p111l492m413j6762P409K3802l047o447J995q418p895J8884
$$ -5712 -6719 7607 496 -2996 -7409 -24171 -16762 7040 3993 -2454 -459 -8877 -16772 2112
10905B112J2351l623M846k285M967q582j0610Q450n193N256J9824O470K262k0629
$$ 2112 14463 10840 15686 13401 18368 9786 -824 7626 2433 7689 27513 33983 36245 15616
10891A5616k3330Q672J5203m433k756j0985N972p022Q908J628j8441j1018O42
$$ 15616 -7714 958 16161 11728 8972 -2013 3959 -3063 5845 7473 -10968 -21986 -21344
10878b1344J1545P828j5243Q219J5840K1846j9216q388R698k4130n213J8117J9675
$$ -21344 -9799 -1971 -17214 -8995 6845 28691 9475 1087 10785 -13345 -18558 -441 19234
10865A9234J0669j858k7072r937n701K7490J6546j065r190q396J0036K1094O887
$$ 19234 29903 28045 973 -8964 -14665 12825 29371 28306 19116 10720 20756 41850 48737
10852D8737o330j2733o240m561K52J5295O578K6765n5p898k676Q401K691K2300
$$ 48737 42407 29674 23434 18873 19125 34420 40998 67763 67708 59810 57134 65535 68226 90526
10838I0526M2512P871k0175j2409R552J8633j7303j1707L2582J1133j7237j6986
$$ 90526 133038 140909 120734 108325 117877 136510 119207 107500 140082 151215 133978 116992
10826A16992k568j6133j3646j8978l180J351l3200j1171j0494k7084j0249j249
$$ 116992 114424 98291 84645 65667 62487 63838 30638 19467 8973 -18111 -28360 -29609
10814b9609k855R982p15k3666J1581K5954l914L073K1394j749k3400j5437p572
$$ -29609 -32464 -22482 -23197 -46863 -35282 -9328 -13242 -10169 11225 9476 -13924 -29361 -36933
10801c6933J633J3043j3529m350j2476O236o077k093K3603R210K225J453n114
$$ -36933 -35300 -22257 -35786 -40136 -52612 -46376 -52453 -54546 -30943 -21733 -19508 -18055 -23169
10788b3169j2892K402Q940o31j3160J2304J5488Q352r469L76J384L1156K5821
$$ -23169 -36061 -33659 -24719 -25350 -38510 -26206 -10718 -2366 -11835 -11459 -10075 21081 46902
10775D6902L188l067K52j9059k3799l0464j1856K9030j5152j3442R0j0756J2556
$$ 46902 50090 47023 47275 28216 4417 -26047 -37903 -8873 -24025 -37467 -37377 -48133 -35577
10762c5577K6898L4028J9957N34o750j6075Q78N092j680L382J4942K1249J6277
$$ -35577 -8679 25349 45306 45840 39090 23015 23893 28985 27305 30687 45629 66878 83155
10749H3155K2554M4536L1948O1924O3594J8456o6345o3835k0834K452K5437M7133
$$ 83155 105709 150245 182193 244117 307711 326167 259822 195987 175153 177605 203042 250175
10737B50175K4172m4058p6358p6940m9033j8593M914N3315L7616K18k8645k4153
$$ 250175 274347 230289 153931 76991 27958 9365 14279 67594 105210 105428 76783 52630
10725E2630k0615k2911j6385p238m093M643K2462l594p304k1788m6028k6235J6261
$$ 52630 32015 9104 -7281 -14519 -18612 -13969 8493 4899 -2405 -24193 -70221 -96456 -80195
10712h0195R5432J54246Q8398n9865m1885J20362J55550R3115M7778Q8858J32342
$$ -80195 15237 169483 257881 198016 156131 276493 432043 525158 572936 661794 794136
10701G94136P693q5610j26646r4407o0192l7757m3446k7762j2128j5327j1619
$$ 794136 801829 716219 589573 495166 434974 397217 353771 326009 313881 298554 286935
10690B86935J6497p565j8290J061k3745k6310M848J8893K0481L2963J5627j064
$$ 286935 303432 295867 277577 278638 254893 228583 233431 252324 272805 305768 321395 320331
10678C20331k3679m8628j2512P033P970m868l520k181q977q531O54l989Q901j8657
$$ 320331 296652 248024 235512 242545 250515 245647 242127 239946 230969 222438 223092 219103 228004 209347
10664B09347N916n666j1114j8425K5097K6777L7133O0715M8778K1072L341n999
$$ 209347 215263 209597 198483 180058 205155 231932 269065 329780 378558 399630 402971 396972
10652C96972Q838J7093P078J2413J0426J8140K2624J7321K0069J7556J247P747
$$ 396972 405810 422903 429981 442394 452820 470960 493584 510905 530974 548530 549777 557524
10640E57524M511j704J6956K8536K6913J530J4668M6550O8503O8427P123l2427
$$ 557524 562035 560331 577287 605823 632736 634266 648934 695484 763987 832414 839537 807110
10628H07110L2148M7992J3735K5252N9455R0297N5775j1934j0159J9964M7944
$$ 807110 839258 887250 900985 926237 985692 1075989 1131764 1119830 1109671 1129635 1177579
10617A177579Q1584J93350J18568m0843N8971J55943J93120J50155J44287K17703
$$ 1177579 1259163 1452513 1571081 1530238 1589209 1745152 1938272 2088427 2232714 2450417
10607B450417K10902K06576K38623L47580M92911N76266P19276P45412Q09832
$$ 2450417 2661319 2867895 3106518 3454098 3947009 4523275 5242551 5987963 6797795
10598F797795J216732J408227O20625L53245R66214J764372K440610L180275M273816
$$ 6797795 8014527 9422754 10043379 10396624 11362838 13127210 15567820 18748095 23021911
10589B3021911N695620O997243Q923888J2620770J8492860K7495014L7913448
$$ 23021911 28717531 35714774 44638662 57259432 75752292 103247306 141160754
10582A41160754M4324407N3343457Q9037384J18195456j9336418j44264658j19197970
$$ 141160754 185485161 238828618 327866002 446061458 426725040 282460382 163262412
10575A63262412o5628718l3544236j8311788j1310506p385162n238600m175845
$$ 163262412 97633694 64089458 45777670 34467164 27082002 21843402 17667557
10568A7667557l385880k281533j550563j171662r02347o81884n54398m70531j02601
$$ 17667557 14281677 12000144 10449581 9277919 8375572 7693688 7139290 6668759 6566158
10559F566158J85209n58706j158636q80747n14126l21252k42643k34201k14706
$$ 6566158 6751367 6192661 5034025 4153278 3639152 3317900 3075257 2841056 2626350
10550B626350k44627k22694j29227r2328r4166q3784o8214r3978k23852j30955
$$ 2626350 2381723 2159029 2029802 1937474 1843308 1759524 1691310 1597332 1373480 1242525
10540A242525M8173K3293o2433j20273j44538j20685n4477j2562k547k2518l8031
$$ 1242525 1290698 1313991 1251558 1131285 986747 866062 811585 799023 796476 773958 735927
10529G35927k0002k8054r1976l7018J7236K8821k3252k5556j9664j2922j1242
$$ 735927 715925 687871 595895 558877 576113 604934 581682 556126 536462 523540 512298
10518E12298l7130m1323m8717j1747O781K73q55R87p798R999q302k5581j6749
$$ 512298 475168 433845 385128 373381 380162 380435 379580 380567 372769 382768 374466 348885 332136
10505C32136o311j5490j7936J5865L6704J9756J2587m755N571n180o967j8438
$$ 332136 325825 310335 292399 308264 344968 364724 377311 372556 378127 372947 365980 347542
10493C47542l1964j1540j4565j4192l1216j5236j5721j9382k0378O614J1051q569
$$ 347542 315578 304038 289473 275281 244065 228829 213108 193726 173348 179962 191013 182444
10481A82444k1139j1792m3899k5320j0019R225J9618J5198j1037k3573k2896q457
$$ 182444 161305 149513 105614 80294 70275 79500 99118 114316 103279 79706 56810 48353
10469D8353L565J0631k6270k499K4033K1584k882k6612n8867m8986n0442l5055
$$ 48353 51918 62549 36279 33780 57813 79397 76515 49903 -8964 -57950 -108392 -143447
10457a43447n7427o8540L5992J30769J46609R6063J7607O5608R8103M695j290
$$ -143447 -200874 -269414 -233422 -102653 43956 140019 157626 223234 321337 326032 324742
10446C24742k7345j0683P972j1692k4360j6336j8680j3554l436j6762j7506N902
$$ 324742 297397 286714 294686 282994 258634 242298 223618 210064 206628 189866 172360 178262
10434A78262j1944k8930j3287N87M91O78J1743J7877J9962J3650j1922k383k010
$$ 178262 166318 137388 124101 124688 125179 125857 137600 155477 175439 189089 177167 174784 172774
10421A72774j2641k916J0109N568M018O833J2931j0440q572j0932k5336q31J911
$$ 172774 160133 157217 167326 172894 176912 183745 196676 186236 177664 166732 141396 140565 142476
10408A42476J2255m706j4617J396L3069o32q299j9255j4320q375K063N686Q729
$$ 142476 154731 150025 135408 136804 169873 169241 160942 141687 127367 118992 121055 126741 135470
10395A35470R211L920k071m006J5094P33j696k908q758k8766l5728k0328j3237
$$ 135470 144681 148601 146530 142524 157618 158351 156655 153747 144989 116223 80495 60167 46930
10382D6930j1013J3741K4020J8715J7505R46N637K018K0927K2045J0111p445j7275
$$ 46930 35917 49658 73678 92393 109898 110844 116481 118499 139426 161471 171582 164137 146862
10369A46862k8849j7099J2533j0656j2499n837J9740J1469l040k406m484q663
$$ 146862 118013 100914 113447 102791 90292 84455 104195 115664 112624 110218 105734 97071
10357I7071P343J9430M555q091n830k9003n217M452J500J7171L032N173m750k070
$$ 97071 104414 123844 128399 120308 114478 85475 80258 84710 86210 103381 106413 111586 106836 104766
10343A04766J730q03o044k540l600p575l406j3110k0233j2644M004P716J5512
$$ 104766 106496 105693 99649 97109 93509 85934 82528 69418 49185 36541 40545 48261 63773
10330F3773K0208Q298L157j2229r355k974K751J3241m422l279O78r444q857Q516
$$ 63773 83981 92279 95436 83207 73852 70878 73629 86870 82448 79169 79847 70403 61546 70062
10316G0062p544P660P250j0746m765J5985n965j5749j306j495O886o696k945n965
$$ 70062 62518 70178 77428 66682 61917 77902 71937 56188 54882 53387 60273 53577 50632 44667
10302D4667J1315M738r431R8p655J7616J1133j7984j3554K55L482P338o653P537
$$ 44667 55982 60720 51289 51387 43732 61348 72481 54497 40943 41198 44680 52018 45365 52902
10288E2902J678J594P702K810j908j3934r394j7487k274L137Q850P545J1842k048
$$ 52902 54580 56174 63876 66686 64778 50844 41450 23963 21689 24826 33676 41221 53063 51015
10274E1015J9843M678J126j0916j9119k2096k698J318P865p370j0986J0820J9081
$$ 51015 70858 75536 76662 65746 46627 24531 21833 23151 31016 23646 12660 23480 42561
10261D2561K696j2031Q443k543o175q498P57N499K709J3666r202o721j4695p545
$$ 42561 45257 33226 41669 39126 32951 24453 25210 30709 33418 47084 37882 31161 16466 8921
10247H921j2285l138J3675M746j1512o447L3216L2411J087j2905m25m056P721
$$ 8921 -3364 -6502 7173 11919 407 -6040 27176 59587 60674 47769 47344 43288 51009
10234E1009Q19n803o961j1029o058R31L924N916J5912R69M751J2742j2124j9077
$$ 51009 51828 46025 39064 28035 21977 22908 26832 32748 48660 49629 54380 67122 54998 35921
10220C5921K255J1881p3j5053j3280r573J2164K1663j122J0203M517J239j2363
$$ 35921 38176 50057 49984 34931 21651 12078 24242 45905 44783 54986 59503 60742 48379
10207D8379j2557j1205p542J2767R865m01L546J1079J6644j986r920k2324O238
$$ 48379 35822 24617 17075 29842 39707 39306 42852 53931 70575 68589 58669 36345 42583
10194D2583J5758K701K601N757k300o620J0216J2551J1768O299N988J1661k179
$$ 42583 58341 61042 63643 69400 67100 60480 70696 83247 95015 101314 107302 118963 116784
10181A16784L145L7043N4450O1942N9956J04456J74185K27125K58384L26933N32441
$$ 116784 119929 156972 211422 273364 333320 437776 611961 839086 1097470 1424403 1956844
10170A956844N29514l32145q01758n74171k95533j45810p0504n7313m3165k4334
$$ 1956844 2486358 2154213 1352455 778284 482751 336941 266437 209124 165959 141625
10160A41625k5205k6575j0003r357J0015n224j5890M4m04L028J5182m768N423
$$ 141625 116420 89845 79842 70485 80500 75276 59386 59430 59026 62054 77236 72468 77891
10147G7891J2814j6096q251J2042P539q898j9248L816n139q497q190K908N07j256
$$ 77891 90705 74609 66358 78400 85939 77041 57793 61609 56470 47973 39783 42691 43198 41942
10133D1942K524k748M76o42q264L231l109J1673P807K882j0606j3935j5130K407
$$ 41942 44466 41718 42194 41552 33288 36519 33410 45083 52890 55772 45166 31231 16101 18508
10119A8508Q808J8185K319o018r782P222j8019j1564j796K5036J4507k937j7779
$$ 18508 27316 45501 47820 41802 32020 39242 21223 9659 7863 32899 47406 44469 26690
10106B6690j0797O894j1578j3019J4956J1683N508N426J7469l242k3899J2804
$$ 26690 15893 22787 11209 -1810 13146 24829 30337 35763 53232 49990 26091 38895
10094C8895q335j1152r550L199R324q204R33L0918O352q952o930j4204J741J3957
$$ 38895 30560 19408 9858 13057 22381 14177 15110 46028 52380 43428 36498 22294 24035 37992
10080C7992P662J2517k519j0165J2337N958Q081r377j1027j4321r930P637K980
$$ 37992 45654 58171 55652 45487 57824 63782 71863 62486 51459 37138 27208 34845 37825
10067C7825j4952o913o831J4913M613O345L3816J5151k0325j1772J3844N005J1803
$$ 37825 22873 15960 9129 24042 28655 35000 68816 83967 63642 51870 65714 70719 82522
10054H2522J3246l111p417K6186L8883O0123R1058J32494J62355J90221L01474
$$ 82522 95768 92657 85240 111426 150309 210432 301490 433984 596339 786560 1088034
10043A088034M74456j72176n63763l60473j87367r8036m7903k7023j0225k4524
$$ 1088034 1562490 1390314 826551 466078 278711 180675 132772 105749 95524 71000
10033G1000j9534p77L950j0J576K358l011l928q715j0552p179j708R866n017n690
$$ 71000 51466 50689 54639 54629 56205 58563 55552 51624 42909 32357 25178 23470 33336 28319 22629
10018B2629j4327N634J0946J2150L048j8373j2661j6229r4j82J5890o130j8045
$$ 22629 8302 13936 24882 37032 40080 21707 9046 -7183 -7277 -7459 8431 2301 -15744
10005a5744p78K0354J6888J27l955j6579j2897Q448J7953P633j282q94o768n206
$$ -15744 -16522 3832 20720 20847 16892 313 -12584 -4136 13817 21450 20168 19274 12506 7300
9991G300p015J4153l205L390p202J0087j1382P321Q685j506L421r502K081J34
$$ 7300 285 14438 11233 14623 7421 17508 6126 13447 22132 20626 24047 14545 16626 16760
9977A6760N025J0281M326N177j4629j3512l576j701n961r115O263Q223N9l980
$$ 16760 21785 32066 36392 41569 26940 13428 9852 8151 2190 -6925 -662 7561 7620 3640
9963C640j0512m70o084q099Q893R424J5436M749n216j139M900r652j7310q396
$$ 3640 -6872 -7342 -13426 -21525 -12632 -3208 12228 16977 11761 10622 15522 5870 -11440 -19836
9949a9836J4479K1555R080j4943P668R736j6683l2375N472O590o058R256K001
$$ -19836 -5357 16198 25278 10335 18003 27739 11056 -21319 -15847 -9257 -15315 -6059 -4058
9936d058J4389J1554n360L084M334M985k835m853j4337n901n627m77j285n230
$$ -4058 10331 21885 16525 19609 23943 28928 26093 21240 6903 1002 -4625 -5102 -6387 -11617
9922a1617n927N634K8788J1437n157J1817R243L929j3425k568Q737o906j4058
$$ -11617 -17544 -11910 16878 28315 23158 34975 44218 48147 34722 32154 40891 33985 19927
9909A9927m621r303m202l108R748J2325O857R287n672j7955L27J24J4427r179
$$ 19927 15306 6003 1801 -1307 8441 20766 27623 36910 31238 13283 13610 13734 28161 18982
9895A8982K565J8629Q224p583q10J0632J9926N94k6114m1105m508J3201J2491
$$ 18982 21547 40176 48400 40817 40007 50639 70565 71159 45045 3940 -568 12633 25124
9882B5124J07j2474q536L079M655N914j2377J1413J6476o216j3284J4069N152
$$ 25124 25231 12757 4221 7300 11955 17869 5492 16905 33381 27165 13881 27950 33102
9869C3102m043j885k709P19j0260j4445P519K3557O521m899Q988M665P215j0843
$$ 33102 29059 27174 24465 25184 14924 479 7998 31555 38076 33177 42165 46830 54045 43202
9855D3202j6181L651L089L008J3814q4k9325l4535j5010J2429J4254M241r80O809
$$ 43202 27021 30672 33761 36769 50583 50499 21174 -13361 -28371 -15942 -1688 2553 1573 8382
9841H382o337j433J1770j5733j325J3015j1265l526K3771J897j068J354k162J764
$$ 8382 2045 612 12382 -3351 -4676 8339 -2926 -6452 17319 19216 18148 19502 17340 19104
9827A9104k0700p15l329l419n939R412r387P281M937j1782l411J0109L418K2062
$$ 19104 -1596 -2311 -5640 -9059 -14998 -5586 -14973 -7692 -2755 -14537 -17948 -7839 -4421 17641
9813A7641j1136K861P005M404p7M167o215j6572m638n901j7465o701J2852L12
$$ 17641 6505 9366 16371 20775 20698 24865 18650 2078 -2560 -8461 -25926 -32627 -19775 -19463
9799a9463M829J1645N629J5162K1882P491r573j7622n345j4611J3703k390J2350
$$ -19463 -14634 -2989 2640 17802 39684 47175 37602 19980 14635 24 13727 11337 23687
9786B3687J3173m896j9958m191R192j7144L392J0342l257l859j8204l534P052
$$ 23687 36860 31964 12006 7815 17007 -137 3255 13597 10340 6481 -11723 -15257 -8205
9773h205P450k082N2O30K1445k738j0210o462J763j627J1474O598j2153o140j339
$$ -8205 -755 -2837 -2785 -2155 19290 16552 6342 -120 1643 16 11490 18088 5935 -205 -1544
9758a544J7212O601O57j1193j4158L358j411r861k260L076Q975J8221L671J5088
$$ -1544 15668 22269 22926 11733 -2425 933 -478 -10339 -12599 -9523 -548 17673 21344 36432
9744C6432j2401k5069k707J2919Q942M198j2096j7201P34J8054p052m496J3425
$$ 36432 24031 -1038 -3745 9174 18116 22314 10218 -6983 -6249 11805 4753 257 13682
9731A3682J1804l643J0161K196o457r716j2288k553p989r759l032J1952n804o961
$$ 13682 25486 21843 32004 34200 27743 18027 5739 3186 -4803 -14562 -17594 -5642 -11446 -18407
9717a8407j1152j764r749J9940J9113j248O894L294K581l421K567l286M346j731
$$ -18407 -29559 -31323 -41072 -21132 -2019 -3267 3627 6921 9502 6081 8648 5362 9708 7977
9703G977o378M694J027j243K064P638m734k536p805J1184J171n459J1614J68O51
$$ 7977 1599 6293 7320 6077 8141 15779 11045 8509 704 11888 13059 7600 19214 19382 20033
9688B0033j628J4001J0034k2894p062J4390l219j1322O110L305j1721p143J4517
$$ 20033 18405 32406 42440 19546 12484 26874 23655 12333 18443 21748 10027 2884 17401
9675A7401J3761J715j3830p072O489j4890k691L50J7731J5909O567o883k882o649
$$ 17401 31162 32877 19047 11975 18464 3574 883 1233 18964 34873 41440 34557 31675 25026
9661B5026q142O632J2710r460q534J668j520K0086K0351m188j9672k6351j6936
$$ 25026 16884 23516 36226 26766 18232 19900 18380 38466 58817 54629 34957 8606 -8330
9648h330O544L520o4K3650J247k7911q384P494J3122n416M290J4973M184m951
$$ -8330 -1786 1734 1670 25320 26567 -1344 -9728 -2234 10888 5472 9762 24735 28919 23968
9634B3968J0251k917o12k2269m379J2129Q309j949j104j5505j7632k99M871L62
$$ 23968 34219 31302 30690 8421 4042 16171 24480 22531 21427 5922 -11710 -12009 -7138 -6776
9620f776j0125J6327R881j0901l02J1506J2500m791j2584o846P173J5675l749
$$ -6776 -16901 -574 9307 -1594 -1896 9610 22110 17319 4735 -2111 5062 20737 16988
9607A6988j5015j9583R23J7070M858m155j3040M058J4243J555l090p779O049p271
$$ 16988 1973 -17610 -16687 383 5241 1086 -11954 -7896 6347 7902 4812 -2967 3082 -4189
9593d189M357J4205M173q885m741J5670K343M18j1154j4458l50j5792o121O692
$$ -4189 168 14373 18546 9661 4920 20590 22933 23351 12197 -2261 -2611 -18403 -24524 -17832
9579a7832n804qJ20K2908l4o987K628j30p652k789O181R91J4203J1089J0579J0384
$$ -17832 -23636 -23644 -23524 -616 -650 -7637 -5009 -5139 -12791 -15580 -9399 -8408 5795 16884 27463 37847
9563C7847o592l955j0010Q297n722j9821r939n957o101l243J3117J4286j666l971
$$ 37847 31255 27300 17290 25587 19865 44 -9895 -15852 -21953 -25196 -12079 2207 541 -3430
9549c430K3005N70j0719M165L178J2638O962k3648j2207j4166J5618m741J346
$$ -3430 19575 20145 9426 13591 16769 29407 36369 12721 514 -13652 1966 -2775 -1429
9536a429o74j620J5745K0005j7004k2230R543J048o109Q401l764M240J011m311
$$ -1429 -2103 -3723 12022 32027 15023 -7207 2336 3384 -2725 5676 1912 6152 7163 2852
9522B852m994P999P744m952j4940K0813P480J1045P904j5111j298j2900j013J0213
$$ 2852 -2142 5857 13601 8649 -6291 14522 22002 33047 40951 25840 24542 11642 10629 20842
9508B0842k250l331r733L259r336M673P950N946p851j0346j4963J748P129J6571
$$ 20842 18592 15261 5528 8787 -549 4124 12074 18020 10169 -177 -15140 -13392 -6263 10308
9494A0308Q143j1691L648J9379q56O955n920j5192j9140j4595J8644J2610R567
$$ 10308 18451 6760 10408 29787 28931 35886 29966 14774 -4366 -18961 -317 12293 21860
9481B1860P455j1447j6412j6553K456j1459K763K4709J603j0576J1097N658m268
$$ 21860 29315 17868 1456 -15097 -12641 -24100 -21337 3372 4975 -5601 5496 11154 6886
9468F886q532q013P722J2075J6761j1200m125k218p479l285n843L149k442p723
$$ 6886 -1646 -9659 -1937 10138 26899 15699 11574 9356 1877 -1408 -7251 -4102 -6544 -14267
9454a4267J9272K2016R943k5777j9015L31j1018j2183Q521L3518L0320J213l505
$$ -14267 5005 27021 36964 11187 -7828 -7497 -18515 -30698 -22177 11341 41661 42874 39369
9441C9369j3647j0675q693j1147n466N81o114R376R474j6824Q504J7989j7293
$$ 39369 25722 15047 6354 -4793 -10259 -9678 -15792 -6416 3058 -13766 -5262 12727 -4566
9428d566J737J884J4677o805m113o410P653R448k030j5674q011R482Q004M581
$$ -4566 -2829 -945 13732 6927 2814 -3596 4057 13505 11475 -4199 -12210 -2728 5276 9857
9414I857M739n293Q088J1209O842m997j2279O748k3041j5566r18O683J9434J0692
$$ 9857 14596 9303 17391 28600 35442 30445 18166 24914 1873 -13693 -14611 -7928 11506 22198
9400B2198j170j1255J245O950m916k0184K597J4667Q790j154M436K450j1009K503
$$ 22198 21028 9773 11018 17968 13052 -7132 -4535 10132 18922 17768 22204 24654 13645 16148
9386A6148K954M291n159l5448l8608K351K8219J6855J0203K920n862j2710O820
$$ 16148 19102 23393 18234 -17214 -55822 -53471 -25252 -8397 1806 4726 -1136 -13846 -7026
9373g026m556j509O424O146r803j1527n242n021K791P623P739K1005m945n105
$$ -7026 -11582 -13091 -6667 -521 -10324 -21851 -27093 -32114 -29323 -21700 -13961 7044 2099 -3006
9359c006M269N027K607J830K38k1289p561R320M89K967J633J3302p634j0120R682
$$ -3006 1263 6290 8897 10727 10965 -10324 -17885 -8565 -8076 -5109 -3476 9826 2192 -7928 1754
9344A754R514k5399j0027O755R362j993L560n413n039k730L527j818J8906K0444
$$ 1754 11268 -14131 -24158 -17403 -8041 -10034 -6474 -11887 -16926 -19656 -16129 -17947 959 21403
9330B1403j6287k4125Q681K0189J334N84J9619K0751n715j4927k0782O707P068
$$ 21403 5116 -19009 -10328 9861 11195 11779 31398 52149 46434 31507 10725 17432 24500
9317B4500o429O958j720O8O624l030n082o125r468k333J3713j2784M00J978j5221
$$ 24500 18071 25029 23309 23377 30001 26971 21889 15764 6296 3963 17676 4892 5292 7270 -7951
9302g951M914J3460O281j8255j5055N526o788q899j736J1534Q858n282Q159J1315
$$ -7951 -3037 10423 16704 -1551 -16606 -11080 -17868 -26767 -28503 -16969 -8111 -13393 -5234 6081
9288F081o316K09o63j701m650K262K276K980J012m948r65L291O619L990Q231q447
$$ 6081 -235 -26 -689 -2390 -7040 -4778 -2502 478 1490 -3458 -4423 -1132 5487 9477 17708 9261
9272I261N357R088p418j731J3736N206r892n209P819J0460l33k244O697J0518
$$ 9261 14618 23706 16288 14557 28293 33499 23607 18398 26217 36677 36344 34100 40797 51315
9258E1315k0056j7182j1986j284M702M27n127k0399J4842K6679J819k89o926k20
$$ 51315 31259 14077 2091 807 5509 5936 809 -19590 -4748 21931 23750 23461 16535 16315
9244A6315q85J1530k766j3390J5646J0296j1464O579M765k0564j1098N122R310
$$ 16315 15430 26960 24194 10804 26450 36746 25282 31861 36626 16062 4964 10086 19396
9231A9396p720r834J2335J3291j283q573J06l075Q921O378j846p09R296o53M520
$$ 19396 11676 1842 14177 27468 26185 17612 17718 14643 23564 29942 28096 27387 36683 36030 40550
9216D0550K151j839k071n568k3654n948J2648J6524J9289l491r103J4511Q702
$$ 40550 42701 40862 38791 33223 9569 3621 16269 32793 52082 48591 39488 53999 62701
9203F2701p832k1159r749J9389j4265n618rl829J1691Q053m982J1541J3054j4953
$$ 62701 54869 33710 23961 43350 29085 23467 23458 19629 31320 39373 34391 45932 58986 44033
9189D4033K880J5508J0404p585P003l289p182J2228J2053J4308Q626j9540j2255
$$ 44033 46913 62421 72825 65240 72243 68954 61772 74000 86053 100361 108987 89447 77192
9176G7192J8830M1889K4443r354j1554J3750K8356M600l851J3474K1339K3871
$$ 77192 96022 137911 162354 153000 141446 155196 183552 188152 184301 197775 219114 242985
9164B42985L8153K1537J6677K2185N1967N7937P2967P2140P9446Q0309J14226
$$ 242985 281138 302675 319352 341537 393504 451441 524408 596548 675994 756303 870529
9153H70529J53307J73241K16948K80373L49312M40022N71904P13465Q48987J012857
$$ 870529 1023836 1197077 1414025 1694398 2043710 2483732 3055636 3769101 4618088 5630945
9143E630945J165744J216206R64162K33849p64877j439548j542798j287259r59506
$$ 5630945 6796689 8012895 8977057 9210906 8446029 7006481 5463683 4176424 3216918
9134C216918p04096m92823l63887k92165k12074j74052j63173j10339p8972o1365
$$ 3216918 2512822 2019999 1656112 1363947 1151873 977821 814648 704309 625337 563972
9124E63972p5953o1628l2328l8102l7177j3215k6226m928k1503m6324k831j7212
$$ 563972 488019 426391 394063 355961 318784 305569 279343 274415 252912 206588 203757 186545
9112A86545k0654j721L076l942R63k6157j8366p230J492q812J882j1182k6456
$$ 186545 165891 164170 167246 163304 164267 138110 119744 112514 114006 105194 107076 95894 69438
9099F9438j0014K110r54R99J9640j0616j0548p657N562K082N357J8130N701l035
$$ 69438 59424 61534 60580 61579 81219 70603 60055 52398 57960 60042 65399 83529 89230 86195
9085H6195j0437j2030j1209m546j91J0658j300n313m571k1136j8117k862L598
$$ 86195 75758 63728 52519 47973 47782 58440 57140 51827 47256 26120 8003 5141 8739
9072H739Q236j4686O485J187P206J4440j3370n89P370J7283M299j0299k1816K088
$$ 8739 16975 2289 8774 9961 17167 31607 18237 17648 25018 42301 46600 36301 14485 16573
9058A6573O520n34J966R063K0527O134k751k3714n753j601m05K2748J8343n023
$$ 16573 23093 22559 24525 33588 54115 60249 57498 33784 28031 26430 26025 48773 67116 62093
9044F2093l3257j8652J8916n951j2260J4441n08j2877J2896P394J5974q399j2412
$$ 62093 28836 10184 29100 23149 10889 25330 24822 11945 24841 32235 48209 39810 27398
9031B7398r338j4699p103N059m530j737M859J8953Q843n513j0174O864j1418q202
$$ 27398 18060 3361 -3742 1317 -3213 -4950 -91 18862 27705 22192 12018 18882 7464 -738
9017g38L165q345j6088O861M329J5284R290j0989j915L974N064L4271Q401j2322
$$ -738 2427 -5918 -22006 -15145 -10816 4468 13758 2769 854 4828 9892 44163 52564 40242
9003D0242N208q166j2429j5997j944n199o374N806J3536J5056M996n012r797j0329
$$ 40242 45450 37284 24855 8858 6914 1715 -4659 1147 14683 29739 34735 29723 19926 9597
8989I597j5554Q185N699j3463m545J630r411q478R132J4003Q241K221k798m516
$$ 9597 -5957 2228 7927 -5536 -10081 -8451 -17862 -26340 -17208 -3205 5036 7257 4459 -57
8975e7o445j5071N169j846J3694Q500M150K152N721N221o539R807J7297q454j4290
$$ -57 -6502 -21573 -16404 -18250 -4556 3944 8094 10246 15967 21188 14649 24456 41753 33299 19009
8960A9009J120J0154l752j4883l340O954j2613p072O370O91k612K460J242J1856
$$ 19009 20129 30283 26531 11648 8308 15262 2649 -4423 1947 2638 26 2486 3728 15584
8946A5584O542j5009J4852l695k4730N300J6387N672J8054M648k347j6573k0550
$$ 15584 22126 7117 21969 18274 -6456 -1156 15231 20903 38957 43605 41258 24685 4135
8933D135r42K1155J4307j9195m34P356L071k1036M877j1073J1529K0963j8014
$$ 4135 3193 24348 38655 19460 19026 26382 29453 8417 13294 2221 13750 34713 16699
8920A6699j8092q632M610J800m78O575n25P74j4911R401J8466J758r057o454p429
$$ 16699 -1393 -10025 -5415 -3615 -4093 2482 1957 2731 -12180 -2779 15687 17445 8388 1934 -5495
8905e495Q060m73n825P989J5321l893j8418j6836l919j0368J7886J7451q784j2734
$$ -5495 2565 2092 -3733 4256 19577 15684 -2734 -19570 -23489 -33857 -15971 1480 -7304 -20038
8891b0038k983p767n329O22N140P841L270J0626J0901R05j1739n332N353J2742
$$ -20038 -23021 -30788 -36117 -35495 -30355 -22514 -19244 -8618 2283 3188 -8551 -13883 -8530 4212
8877D212J1034k071L434J066p923K55J9467j4172q466J0667L083q643j5822o953
$$ 4212 15246 13175 16609 17675 9752 10007 29474 15302 6836 17503 20586 11943 -3879 -10832
8863a0832R589P721m541O022M026N262K447o950j5182k462k402q126J0041J8823
$$ -10832 -1243 6478 1937 7959 11985 17247 19694 12744 -2438 -4900 -7302 -15428 -5387 13436
8849A3436o300o658l382j222P600J739j1877j2769j8598k492N907n043k58J209
$$ 13436 7136 478 -2904 -4126 3474 5213 -6664 -19433 -38031 -40523 -34616 -39659 -39917 -38708
8835c8708J7419J8576P580l967o374j825L827J3496K107J430N630j1095o175l343
$$ -38708 -21289 -2713 4867 900 -5474 -7299 -3472 10024 12131 13561 19191 8096 1921 -1422
8821a422j2631J218J1862j363K601l92L230O879J4458K812r106j1883Q460k995
$$ -1422 -14053 -12835 -973 -2336 265 -127 3103 9982 24440 27252 18146 6263 14723 11728
8807A1728R42q633p910n127j3377O117J3036M497K660L252O937m037K82o373o931
$$ 11728 12670 4037 -3873 -9000 -22377 -16260 -3224 1273 3933 7185 14122 10085 10367 3994 -2937
8792b937M928N20M158j76N478o277p446J5064j803N948p026r976J3769R935j4857
$$ -2937 1991 2511 6669 6493 11971 5694 -1752 13312 11509 17457 10431 455 14224 24159 9302
8777I302j1030L282j2800k017k248l566O193p937O0j89J2082L014j1796j9277
$$ 9302 -1728 1554 -11246 -13263 -15511 -19077 -12884 -20821 -20761 -20950 -8868 -5854 -17650 -36927
8763c6927q479J4190O821k851l043N249J4416J1571q178q876l813M941J9983Q074
$$ -36927 -45406 -31216 -24395 -27246 -30289 -25040 -10624 947 -7231 -16107 -19920 -14979 5004 13078
8749A3078J093r807n625n055L166p691k11J4458k006K879L426Q423r429N899L330
$$ 13078 14171 4364 -1261 -6316 -3150 -10841 -11052 3406 1400 4279 7705 16128 6699 12598 15928
8734A5928J4736M694k3990m114Q643J932K073j5486j7549Q494M01p847j0179j4320
$$ 15928 30664 35358 11368 7254 15897 17829 19902 4416 -13133 -4639 -4238 -12085 -22264 -36584
8720c6584K096J2986J5425J1671m399P219L152J4028q429k3789P137Q492J1630
$$ -36584 -34488 -21502 -6077 5594 1195 8414 11566 25594 17165 -6624 513 9005 20635
8707B0635M948j0782p871J293m919m083J1454J4447P120j412j1110m488N499q775
$$ 20635 25583 14801 6930 8223 3304 -779 10675 25122 32242 30830 19720 15232 20731 11956
8693A1956j3711o635m560L453N141O735J108J984j464o602O149q134J3188J5663
$$ 11956 -1755 -8390 -12950 -9497 -4356 2379 3487 5471 4007 -2595 3554 -4580 8608 24271
8679B4271R122l824o252j506J975q737j3041q318j0048J4849K0226P993o515j3634
$$ 24271 33393 29569 23317 21811 23786 15049 2008 -6310 -16358 -1509 18717 26710 20195 6561
8665F561j1569j3976r685J5029K5237l795q699n293M999J2121K2096K0014o32
$$ 6561 -5008 -18984 -28669 -13640 11597 7802 -897 -6190 -1191 10930 33026 53040 52408
8652E2408j9582j7686J240O938K787m244n628K743J0314m153N709j7693j6770
$$ 52408 32826 15140 16380 23318 26105 21861 16233 18976 29290 25137 30846 13153 -3617
8639c617k3436R292K6324P604j1252j4039J1885P367N509o446n532k662j056p98
$$ -3617 -27053 -17761 8563 16167 4915 -9124 2761 10128 15637 9191 3659 997 -59 -857
8625h57Q666R597j5351m823J4550j5361P704J6967l007j3561m598k6880k4969
$$ -857 7809 17406 2055 -2768 11782 -3579 4125 21092 18085 4524 -74 -26954 -51923
8612e1923M686J3838M0377k946k068J6914j959p573j0276k365K9318j208j1618
$$ -51923 -47237 -33399 6978 4032 1964 18878 16919 9346 -930 -3295 26023 24815 13197
8599A3197n989O986Q909J452J397R15K387O126J1910n272q671n530j86j0604j1730
$$ 13197 7208 14194 23103 24555 25952 26867 29254 35380 47290 42018 33347 27817 27631 17027 5297
8584E297O954J7272J3376j3786j6885Q096J88r791p455M085L219o073J8445j9418
$$ 5297 12251 29523 42899 29113 12228 20324 20512 10721 3266 7351 10570 4497 22942 3524
8570C524j7400j064Q453O821J3845o971l553j0219j320J6612l315j4320q477L138
$$ 3524 -13876 -14940 -6487 334 14179 7208 3655 -6564 -7884 8728 5413 -8907 -17384 -14246
8556a4246j2201K23J2390J899J3116K799j0877k106O166r788o168J3601J1060
$$ -14246 -26447 -26224 -13834 -11935 1181 3980 -6897 -9003 -2837 -12625 -18793 -5192 5868
8543E868j5760j3499O873K7670O285p336J506j550j0367m364o530K0386J4970
$$ 5868 -9892 -23391 -16518 11152 17437 10101 11607 10057 -310 -4674 -11204 9182 24152
8530B4152q380j3152J1310J0680N877m239N02N177j1236j6341K469J8063N358
$$ 24152 15772 2620 13930 24610 30487 26248 26750 31927 20691 4350 6819 24882 30240
8517C0240j5035P321O335j3841q354J1927J1764l826r490J092p30j9799K816R575
$$ 30240 15205 22526 28861 15020 6666 18593 30357 26531 17041 18133 17403 -2396 420 9995
8503I995L83P779O589j0403o347l099n475m6K666L7l322j8352J4079Q763j7057
$$ 9995 10378 18157 24746 14343 7996 4897 -578 -624 2042 2079 -1243 -19595 -5516 3247 -13810
8488a3810j5699J1279P32r536k057J8701J9374K488J016m989J5558l624j2724
$$ -13810 -29509 -18230 -17498 -27034 -29091 -10390 8984 11472 12488 7499 23057 19433 6709
8475F709L963J5925j3978k0161J641M951p16J1983J0734P477j3411k3796L872
$$ 6709 10672 26597 12619 -7542 -5901 -950 -1666 10317 21051 28528 15117 -8679 -4807
8462d807R391K971J5528M354J0187j7800j4787j0952M575j0768j0836J7716J3546
$$ -4807 4584 7555 23083 27437 37624 19824 5037 -5915 -1340 -12108 -22944 -5228 8318
8449H318q260L778K2136J2501n192o566j8033j3813j869R076m70j866j6312o742
$$ 8318 58 3836 25972 38473 33281 26715 8682 -5131 -7000 2076 1606 -260 -16572 -23314
8435b3314K665K1566M787P742J0061R739l456M235J2956r063k1353k7256j0485
$$ -23314 -20649 917 5704 13446 23507 33246 29790 34025 46981 37918 16565 -10691 -21176
8422b1176k873j451J0733J8240j3960m333o159J2971J0379L439l0816k515Q299
$$ -21176 -24049 -25500 -14767 3473 -10487 -14820 -20979 -8008 2371 5810 -25006 -27521 -19222
8409a9222J6457P530j1686l801K2628R636r459n670N516M096K019m12m015j6553
$$ -19222 -2765 4765 -6921 -10722 11906 21542 12083 6413 11929 16025 18044 17632 13617 -2936
8395b936J194J6368J272j5756k1144j036J3052M184n882q189q75m87K6197K4500
$$ -2936 -1742 14626 15898 142 -21002 -22038 -8986 -4802 -10684 -18873 -19748 -20235 5962 30462
8381C0462L751q633n663q430n923M219M026j0435q347K46J7605n310j8916j7455
$$ 30462 34213 25580 19917 11487 5564 9783 13809 3374 -4973 -4727 12878 7568 -11348 -28803
8367b8803o663J8590J1569Q871p875j5838k440L307J617K809O890J832R41O762
$$ -28803 -35466 -16876 -5307 3564 -4311 -20149 -22589 -19282 -17665 -14856 -7966 -6134 -5193 1569
8353A569q51K804m685Q056o339J0199M965j5172j7702j2429J992J3761J7971J5458
$$ 1569 718 3522 -1163 6893 554 10753 15718 546 -17156 -29585 -27593 -13832 4139 19597
8339A9597P332J4200l305k4466k760J6059K983l067q685r402l758j1139n424P886
$$ 19597 26929 41129 37824 13358 10598 26657 29640 26573 17888 8486 4728 -6411 -11835 -3949
8325c949Q545Q825p544r414k040m075K082K161K2774K201j0313k1349j7413l3325
$$ -3949 4596 13421 5877 -3537 -5577 -9652 -7570 -5409 17365 19566 9253 -12096 -29509 -62834
8311f2834j216J9429Q237m52J4442K026q550o087m770P492O358L313J192N893
$$ -62834 -64050 -44621 -36384 -36836 -22394 -20368 -28918 -35005 -39775 -32283 -25925 -22612 -21420 -15527
8297a5527L510J451J0942M460j1248O61J1658n902K601q941n003L689J7646K230
$$ -15527 -12017 -10566 376 4836 -6412 -5751 5907 5 2606 -6335 -11338 -7649 9997 12227
8283A2227K97P908k47l140M273j2752n119m326j0652j0632Q555J7187J125j6076
$$ 12227 12524 20432 20185 17045 21318 8566 3447 -879 -11531 -22163 -13608 3579 4704 -11372
8269a1372j9588M482J3913J6249j1697M34Q515n045j4375j3602Q845K628Q96J3149
$$ -11372 -30960 -26478 -12565 3684 -8013 -7579 936 -4109 -18484 -32086 -23241 -20613 -19717 -6568
8255f568k074n076M005l965J6796O835J1879j8198j2787J1897K1856j677j286
$$ -6568 -8642 -13718 -9713 -13678 3118 9953 21832 3634 -9153 2744 24600 22923 21637
8242B1637j4261j3484J4328j1935p521L3692M080j2024j8577j2068j0951N801
$$ 21637 7376 -6108 8220 -3715 -11236 22456 26536 14512 -4065 -16133 -27084 -21283
8230b1283k05r193L203P011n300L186K856K407Q222O419K1765M343j1697O198
$$ -21283 -21488 -30681 -27478 -20467 -25767 -22581 -19725 -17318 -9096 -2677 19088 23431 11734 17932
8216A7932m390j7193m37K2307J934o912M180J3433J510J025p704p979r9l7248
$$ 17932 13542 -3651 -4088 18219 20153 13241 17421 30854 32364 33389 25685 17706 17607 -19641
8202a9641o176Q852K7831j66p634K428k463j0336P213O158J147p185L993N096
$$ -19641 -25817 -16965 10866 10700 3066 5494 3031 -7305 -92 6066 7213 28 4021 9117
8188I117Q155P521n303k446j869k4864l0980m346J7446K0363K0952K8069j1252
$$ 9117 17272 24793 19490 17044 15175 -9689 -40669 -45015 -27569 -7206 13746 41815 30563
8175C0563j6693p938j0094P545N086L445K095p775k927K2543j109n403j761o127
$$ 30563 13870 5932 -4162 3383 8469 11914 14009 6234 3307 25850 24741 19338 17577 11450
8161A1450l655k6335j3848J0112J2075J7065O03j7340o774O297J0583J6084q144
$$ 11450 7795 -18540 -32388 -22276 -10201 6864 7467 -9873 -16647 -10350 233 16317 8173
8148H173j4198o503m677r220M535J1509Q708r422R890k957n627K955J9683j448
$$ 8173 -6025 -12528 -17205 -26425 -21890 -10381 -1673 -11095 -1205 -4162 -9789 -6834 12849 11401
8134A1401l175k212K96J511p639j1283M59l542k371m394J5970P822j1524j8148
$$ 11401 8226 6014 6310 7821 182 -11101 -10642 -14184 -16555 -20949 -4979 2843 -8681 -26829
8120b6829m516P951K1789N615j0802j2699q415N389J0211o12J1603M041P242m265
$$ -26829 -31345 -23394 -1605 4010 -6792 -19491 -27906 -22517 -12306 -12918 -1315 2726 9968 5703
8106E703m630P859J4351K328j4034q382l078J080J1248j2933L043Q307o869J390
$$ 5703 1073 8932 23283 25611 11577 3195 117 1197 12445 -488 2555 10862 3993 5383
8092E383M294P742r875j3758j6j6095L928L019Q953J0041J6634n577l5239O746
$$ 5383 9677 17419 7544 -6214 -6230 -22325 -18397 -15378 -6425 3616 20250 14673 -20566 -13820
8078a3820J5364p944k2532O339K096L3N740J0316j310J3570L699O67k187m457
$$ -13820 1544 -6400 -28932 -22593 -20497 -20464 -14724 -4408 -5718 7852 11551 12218 10031 5574
8064E574j5846p555M908K594j967n882p278p015J367J40J6430J6653P382P68r452
$$ 5574 -10272 -17827 -12919 -10325 -12292 -18174 -25452 -32467 -31100 -30960 -14530 2123 9505 10273 821
8049H21j1339j070K769O814L825K702l665m373J1179J7061j0933l196k665J43
$$ 821 -10518 -11588 -8819 -2005 1820 4522 857 -3516 7663 24724 13791 10595 7930 8073
8035H073J1721j5828j2151J7833J7202N85j3917J391j0800m290J490N680q089
$$ 8073 19794 3966 -8185 9648 26850 27435 13518 14909 4109 -181 1309 6989 -1100
8022a100l542Q176J664N606J6306n29n852k5239n584O485J1734M686P193j0849
$$ -1100 -4642 3534 5198 10804 27110 26581 20729 -4510 -10094 -3609 8125 12811 20004 9155
8008I155j8310K145K849R198p369r488J2184K7907L111r496j5948j0445k886j2124
$$ 9155 -9155 -7010 -4161 5037 -2332 -11820 364 28271 31382 21886 5938 -4507 -7393 -19517
7994a9517p878J1080P390J8239P410j319L977R497q995j1329L083J1692L653o132
$$ -19517 -27395 -16315 -8925 9314 16724 15405 19382 28879 19884 8555 11638 23330 26983 20851
7980B0851J1849J1308k6841j9403k363K28L0q087j7999K624P458J3630R304q132
$$ 20851 32700 44008 17167 -2236 -4599 -4371 -4341 -12428 -30427 -27803 -20345 -6715 2589 -5543
7966e543J0660j2358p750Q115r682j1035J653J0672R303J0629J4524P75k417J4812
$$ -5543 5117 -7241 -14991 -6876 -16558 -27593 -25940 -15268 -5965 4664 19188 19963 17546 32358
7952C2358J7589N795n756j6303k1944n485J1514J453n328j87M201l579j0877J3139
$$ 32358 49947 55742 49986 33683 11739 6254 17768 19221 13893 13706 17907 14328 3451 16590
7938A6590J530J2490J7719m346k8898l0338j0703J232Q578J1528J6618r85R651
$$ 16590 18120 30610 48329 43983 15085 -15253 -25956 -24724 -16146 -4618 12000 11015 20666
7925B0666P721j4574j1405n407L332k829m47P99O833K685r213J8593K3668K941
$$ 20666 28387 13813 2408 -2999 333 -2496 -2943 -2144 4689 7374 -1839 16754 40422 43363
7911D3363l0704n168J4980J258Q02M547J1715k3667p442Q920R950N811k636k1225
$$ 43363 12659 7491 22471 23729 24531 29078 40793 17126 9684 18604 28554 34365 31729 10504
7897A0504j253K736Q438Q335j5187j2138N539O630j51p904l393P653J5662n556
$$ 10504 9251 11987 20425 28760 13573 1435 6974 13604 13453 5549 2156 9809 25471 19915
7883A9915j7527O177N625m430N332l668p340n43p676L994J4126k8284n294N459
$$ 19915 2388 8565 14190 9760 15092 11424 4084 3541 -4135 -141 13985 -14299 -19593 -14134
7869a4134j0784Q328Q354n198K888k911J0479k680m924N44J0860m867q988m382
$$ -14134 -24918 -16590 -8236 -13434 -10546 -13457 -2978 -5658 -10582 -10038 822 -4045 -13033 -17415
7855a7415o982K324J7196q056j3202N742j4306m203J1969J3051j5032P714J6142
$$ -17415 -24397 -22073 -4877 -12933 -26135 -20393 -34699 -38902 -26933 -13882 -28914 -21200 -5058
7842e058q904r064Q584K6976K9193J2946r781j0476j8519q852m360p520m799P848
$$ -5058 -13962 -23026 -14442 12534 41727 54673 44892 34416 15897 7045 2685 -4835 -9634 -1786
7828a786O343Q79J6807R241m639P460J0822p293k5484p386J470J4339k775k2411
$$ -1786 4557 5436 22243 31484 26845 34305 45127 37834 12350 4964 6434 20773 17998 -4413
7814d413q200l454m699J3474J8773j4456P358Q166p087j2598j8779O363l535j221
$$ -4413 -12613 -16067 -20766 -7292 11481 -2975 4383 12549 5462 -7136 -25915 -19552 -23087 -24308
7800b4308J2279r091j6384o94p134Q579R470J443N034N388j5678J0735Q827J302
$$ -24308 -12029 -21120 -37504 -38198 -45332 -36753 -27283 -25840 -20806 -15418 -31096 -20361 -11534 -10232
7786a0232o153n630J5559P164k0006Q27J9136J5237j5095j0193K573q021j1035
$$ -10232 -16385 -22015 -6456 708 -19298 -18471 665 15902 807 -9386 -6813 -14834 -25869
7773b5869K11O952m015K394L1787Q505j8988j9972J6478l331j6173p328J0675
$$ -25869 -25658 -18706 -22721 -20327 11460 19965 977 -18995 -2517 -5848 -22021 -29349 -18674
7760a8674J588J8863l85j424J0357J12j5106l259R198K2984j44N603Q082k5684
$$ -18674 -17086 1777 1392 -32 10325 10437 -4669 -7928 1270 24254 24110 29713 37795 12111
7746A2111n934k441j4821j3935J7823O484k068l378O737Q71k192J4978o694j5756
$$ 12111 6177 3736 -11085 -25020 -7197 -713 -2781 -6159 578 1449 -743 14235 7541 -8215
7732h215j474o87O777L18R349p722N310K711m928l177J9043J8528k527n690n50
$$ -8215 -9689 -10376 -3599 -3281 6068 -1654 3656 6367 1439 -1738 17305 35833 33306 27616 27066
7717B7066r722K026Q815J414l980J815q699n862j276N854n91J0394j3672j3496
$$ 27066 17344 19370 28185 29599 25619 27434 18735 12873 11597 17451 16860 27254 13582 86
7703H6l539K2284j3269j6953J063J1416q122j6927K818O516J4438k1445l046J1442
$$ 86 -3453 18831 5562 -11391 -10328 1088 -7034 -23961 -21143 -14627 -189 -21634 -24680 -13238
7689a3238N501J0086N439P758M896j5914j528j7129j250j421O332K0655m527l906
$$ -13238 -7737 2349 7788 15546 20442 4528 3000 -14129 -15379 -16800 -10468 10187 5660 1754
7675A754j0679L77L465J2935l488m898N92k2563k651N019O082J3105R237Q38n610
$$ 1754 -8925 -8548 -5083 7852 4364 -534 58 -22505 -25156 -20137 -14055 -950 8287 9125 3515
7660C515j6983K24N561j0553K121K331l556J1404J2608n292q231j7706J6221K0401
$$ 3515 -13468 -13244 -7683 -18236 -16115 -13784 -17340 -5936 6672 1380 -6851 -24557 -8336 12065
7646A2065j5901j1802J2331K4614r47p988m750J651j036j3903l164M113P65J6160
$$ 12065 -3836 -15638 -3307 21307 20360 12372 7622 9273 8237 -5666 -8830 -4717 -3952 12208
7632A2208M148m58l464j0115J2603n008m507q85n075J5578J3844j097k2167k6267
$$ 12208 16356 15898 12434 2319 14922 9914 5407 4522 -553 15025 28869 27772 5605 -20662
7618b0662K177J024p987J3812J3447P93o999Q0n24j4095k6554O483K1147M869
$$ -20662 -18485 -17461 -25448 -11636 1811 2604 -4395 -4315 -4839 -18934 -45488 -39005 -17858 -12989
7604a2989P639k12k678J1095l424m403N832j7956m512J4979K452R357j2621k6474
$$ -12989 -5350 -5562 -8240 2855 -569 -4972 860 -17096 -21608 -6629 -4177 5180 -7441 -33915
7590c3915L148R253O74R242q620o84R227m557k464m309J1817P986O505L065J641
$$ -33915 -30767 -21514 -20840 -11598 -20218 -20902 -11675 -16232 -18696 -23005 -11188 -3202 3303 6368 8009
7575H009O728p905j004N039n097k1248p921L747k448J2013J5315J5305o138j7106
$$ 8009 14737 6832 5828 10867 5770 -15478 -23399 -19652 -22100 -10087 5228 20533 14395 -2711
7561b711r331q310j2496r754M491J2158L735J0640L461J791J3702J5431m545j350
$$ -2711 -12042 -20352 -32848 -42602 -38111 -25953 -22218 -11578 -8117 -6326 7376 22807 18262 16912
7547A6912j7416j3612J825M639J1862K566J356L708o442P873J5R43N268j6255
$$ 16912 -504 -14116 -12291 -7652 4210 6776 8132 11840 5398 13271 13286 14229 19497 3242
7533C242j3123P720K411P954P852j611j359j2069j1831M834j1868K34J8992n470
$$ 3242 -9881 -2161 250 8204 16056 14445 13086 1017 -10814 -5980 -17848 -17614 1378 -4092
7519d092M834l925j865P249J2999J1677j1602j8740J0131J0171O111k1264K27
$$ -4092 742 -3183 -5048 2201 15200 26877 15275 -3465 6666 16837 22948 1684 1911
7506A911j2011k1741N739R941K043J0408L062n570K918j1635j02L89l660k695
$$ 1911 -10100 -31841 -26102 -16161 -14118 -3710 -648 -6218 -3300 -14935 -15037 -14648 -18308 -21003
7492b1003P510N549P288O092j9186K632M344N828l928o745k745J6352J030l909
$$ -21003 -13493 -7944 -656 5436 -13750 -11118 -6774 -946 -4874 -11619 -14364 1988 3018 -891
7478h91m426M312j2711j797L013o213J0585J1973J5630l066j1287q940M744q440
$$ -891 -5317 -1005 -13716 -15513 -12500 -18713 -8128 3845 19475 16409 5122 -3818 926 -7514
7464g514P63J6023J2199m872k2732j2455L588K3711R952n270L221J2734n859j3479
$$ -7514 -6751 9272 21471 16599 -6133 -18588 -15000 8711 18663 13393 16614 29348 23489 10010
7450A0010k3287n281K1859J5502K210k176k0753Q440O441j4691j0007n057N995
$$ 10010 -13277 -18558 3301 18803 21013 18837 -1916 6524 12965 -1726 -11733 -16790 -10795
7437a0795N498M119L079p314j058m852m030L040o084k656J8592J4225J7803Q261
$$ -10795 -5297 -1178 1901 -5413 -6471 -11323 -15353 -12313 -18397 -21053 -2461 11764 29567 37828
7423C7828j0685k2843m691o390k2285N696J8850J414k0445k472N521J0394m08
$$ 37828 27143 4300 -391 -6781 -29066 -23370 -4520 -3106 -23551 -26023 -20502 -10108 -10516
7410a0516j486K549j709l064P455J0092J5611m589Q434J3682m364k3128o450m436
$$ -10516 -12002 -9453 -11162 -14226 -6771 3321 18932 14343 22777 36459 32095 8967 2517 -1919
7396a919j5710k464j5190m894J8424J8445K94J3686O373j559j878j5363Q569q670
$$ -1919 -17629 -20093 -35283 -40177 -21753 -3308 -3014 10672 17045 15486 13608 -1755 6814 -1856
7382a856L55O701n08J0432M3k5957j0072J4221J8738r064K664K213o147q015J532
$$ -1856 -1501 5200 4692 15124 15167 -10790 -20862 -6641 12097 3033 5697 7910 1763 -6252 -4720
7367d720k300M131O445J6724J3702j3332j5743k2564J734J6188J2412o471j3803
$$ -4720 -7020 -2889 3556 20280 33982 20650 4907 -17657 -15923 265 12677 6206 -7597
7354g597k558r435o958j662J182N829J0721L124J6260Q373r044j1170j8873M351
$$ -7597 -10155 -19590 -26548 -28210 -27028 -21199 -10478 -7354 8906 17279 8235 -2935 -21808 -17457
7340a7457Q986q89k752J223Q059l095r192J6246J7230L734J766N49l039M814L844
$$ -17457 -8471 -9360 -12112 -10889 -2830 -5925 -15117 1129 18359 22093 23859 24408 21369 26183 30027
7325C0027o990o727J6847Q01k919o821j0877k7898L181J5019j1683o853J935j375
$$ 30027 23037 16310 33157 33958 31039 24218 13341 -14557 -11376 3643 -8040 -14893 -12958 -14333
7311a4333L506O24M607r781j1919M311R501j7467o263J5652K1679O534j4237m469
$$ -14333 -10827 -10203 -5596 -15377 -27296 -22985 -13484 -30951 -37214 -21562 117 6651 -7586 -12055
7297a2055Q436O709J4224J3417j1536k3457j4185J836J4077r122L961J1920j749
$$ -12055 -3619 3090 17314 30731 19195 -4262 -18447 -16611 -2534 -11656 -7695 4225 2476
7284B476l244j658m64r654J521j018j5521m36J6493O182j1865O647O903o42n758
$$ 2476 -768 -2426 -2890 -12544 -11023 -12041 -27562 -27998 -11505 -5323 -17188 -10541 -3638 -4280 -10038
7269a0038J4487j505O011m562j086o12j7142j261P557M185Q195Q356L571p945
$$ -10038 4449 2944 8955 4393 3307 2695 -14447 -15708 -8151 -3966 4229 12585 16156 8211
7255H211l563p508R504m416o380k1264j8771J4745K2710K345r370O21L672K843
$$ 8211 4648 -2860 6644 2228 -4152 -25416 -44187 -29442 -6732 -4387 -13757 -13136 -9464 -6621
7241f621K265J4373r227j0114l230P496Q583J18K308o750O804O545k829m841L776
$$ -6621 -4356 10017 790 -9324 -12554 -5058 3525 3643 5951 -799 6005 12550 9721 4880 8656
7226H656P207o066j2721J0500R729q975l764l292j4264p663J4941L662P945k682
$$ 8656 15863 9797 -2924 7576 17305 8330 4566 1274 -12990 -20653 -5712 -2050 5895 3213
7212C213j808q538k6550m65Q723L292J7831q481K414o150j0757J4432R51K291
$$ 3213 1405 -7133 -33683 -34148 -25425 -22133 -4302 -12783 -10369 -16519 -27276 -12844 -11893 -9602
7198i602J3334R37j8182K921K3493L327n818j2882j3523M056J2765N171m284Q032
$$ -9602 3732 4669 -13513 -10592 12901 16228 10410 -2472 -15995 -11939 826 5997 1713 9745
7184I745J361k1444j0423q033P649K1373J1138j681j8000r310J0368L270r57K6
$$ 9745 11106 -10338 -20761 -28794 -21145 228 11366 9685 -8315 -17625 -7257 -3987 -4944 -4918
7170d918N037m365n586J7718M677J5186L036j5337j8039j313r488k1145n725J2135
$$ -4918 119 -4246 -9832 7886 12563 27749 30785 15448 -2591 -3904 -13392 -34537 -40262 -28127
7156b8127j750J6248q208j4710K4732K4566r898r946L940J0933j0840p441J3888
$$ -28127 -29877 -13629 -21837 -36547 -11815 12751 2853 -7093 -3153 7780 -3060 -10501 3387
7143C387N196n580J1121j362l301n930j2355j3680J8696J5422j1146K558J925
$$ 3387 8583 3003 14124 12762 9461 3531 -8824 -22504 -3808 11614 468 3026 4951
7130D951P256J0676j5925M759K4880j1787N387l701j7093j9805p22m589j0302
$$ 4951 12207 22883 6958 11717 36597 24810 30197 26496 9403 -10402 -11124 -15713 -26015
7117b6015O350j596J9850R38j2417j5245q380K2678K3131Q855M622J884j676q540
$$ -26015 -19665 -21261 -1411 -473 -12890 -28135 -36515 -13837 9294 18149 22771 24655 22979 14439
7103A4439J22j9800r751O362n729M239J9273k56k0172j0837p379L422J4810Q523
$$ 14439 14561 -5239 -14990 -8628 -14357 -10118 9155 8899 -11273 -22110 -29489 -26067 -11257 -2734
7089b734J4001j4974l070M486r990L515P671m355j2431P805J2188J2002o844j507
$$ -2734 11267 -3707 -6777 -2291 -12281 -8766 -1095 -5450 -17881 -10076 2112 14114 7270 5763
7075E763j0092q791l922j563J4489k319m054J177J555P302j87J4167J0908N946
$$ 5763 -4329 -13120 -17042 -18605 -4116 -6435 -10489 -9312 -7757 -455 -642 13525 24433 30379
7061C0379k284k386o304j0008j0010m702k0362J4217K0231L032K655K1019l696
$$ 30379 28095 25709 19405 9397 -613 -5315 -25677 -11460 8771 11803 14458 35477 31781
7048C1781o700k433j7358p210j263Q463J3456j3395k0051j554j1396Q561R429
$$ 31781 25081 22648 5290 -1920 -3183 5280 18736 5341 -14710 -16264 -27660 -19099 -9670
7035i670L250n0O845J5918p18k6407l2832O183N150R728P473j5042J0479J5182
$$ -9670 -6420 -6470 375 16293 15575 -10832 -43664 -37481 -32331 -22603 -15130 -30172 -19693 -4511
7021d511Q112M496J633p212k998n443p600K792K0697N470j738O345m261L040j7454
$$ -4511 3601 8097 9730 2518 -480 -5923 -13523 -10731 9966 15436 13698 20043 15782 18822 1368
7006A368m695L561Q734N503q966k650n125k362K509M857O510O00j378j0835R14
$$ 1368 -3327 234 8968 14471 5505 2855 -2270 -4632 -2123 2734 9244 9844 8466 -2369 -1455
6991a455q94n737Q514P305N486j627M433O213k721r369M988M524j3789l166K855
$$ -1455 -2349 -8086 428 7733 13219 11592 16025 22238 19517 10148 15136 19660 5871 2705 5560
6976E560L643L235L455k0118m979M054K4315J2592k160r545k6875K198P551m285
$$ 5560 9203 12438 15893 -4225 -9204 -5150 19165 31757 29597 20052 -6823 -4625 2926 -1359
6962a359j7706q516J2033j1456j972q405J0952J5027N805m541j386J7547P769
$$ -1359 -19065 -27581 -15548 -27004 -28976 -37381 -26429 -11402 -5597 -10138 -11524 6023 13792
6949A3792j4405j5990j8232N24M615M725J5994Q996n433j477J4453j335j2642
$$ 13792 -613 -16603 -34835 -34311 -29696 -24971 -8977 19 -5414 -6891 7562 6227 -6415
6936f415j3272K886J8452K891n714k654j0963j187o577J0224K309P147Q308j383
$$ -6415 -19687 -16801 1651 4542 -1172 -3826 -14789 -15976 -22553 -12329 -10020 -2873 5435 4052
6922D052J7811J4911N903R981m122l1558r345J5688p215j2598q963p276o86M621
$$ 4052 21863 36774 42677 52658 48536 16978 7633 23321 16106 3508 -5455 -12731 -13417 -8796
6908h796R826M70j0624l581J0451J5736o899L806p699N767P960j4852j8371m601
$$ -8796 1030 1500 -9124 -12705 -2254 13482 6583 10389 2690 8457 16417 1565 -16806 -21407
6894b1407Q039K365j2078j3539O225m308K0858J9141R37j5159l327j1155J9750
$$ -21407 -13368 -11003 -23081 -36620 -30395 -34703 -13845 5296 6233 -8926 -12253 -23408 -3658
6881c658L5419M629n797k3541l962j886R45J5014p899o800J60j633m297R341q23
$$ -3658 31761 36390 30593 7052 3090 1204 2149 17163 9264 2464 2624 991 -3306 6035 5212
6866E212q083k238p186Q053Q075j1545n739J3607J4039j2917j727j2403q406p266
$$ 5212 -2871 -5109 -12295 -4242 3833 -7712 -13451 156 14195 1278 -449 -12852 -21258 -28524
6852b8524K802Q409K2938J3146M745q023p424p166j1291L6N731K292q143J3773
$$ -28524 -25722 -17313 5625 18771 23516 15493 8069 903 -10388 -10352 -4621 -2329 -10472 3301
6838C301J7203O685M446j2582l697J0563j0068j2300K338n036q880R556Q88P33
$$ 3301 20504 27189 31635 19053 15356 25919 15851 3551 5889 853 -8027 1529 2417 3150
6824C150J1956N887J804p927j4751M393o209J7216P282n139n75m9R01o282k126
$$ 3150 15106 20993 22797 14870 119 4512 -1697 15519 22801 17662 17087 17038 17939 11657 9531
6809I531Q182R568J0874k1847j1858k169J4495j5976q745k535Q31J4389M366j127
$$ 9531 17713 27281 38155 16308 4450 2281 16776 800 -7945 -10480 -9649 4740 9106 7979
6795G979j6163J1126P182j6296J565J7572N669l971j1721k511j3346J9532K658
$$ 7979 -8184 2942 10124 -6172 -4607 12965 18634 14663 2942 431 -12915 6617 9275
6782I275j6559j1604Q795pj2046j6998P687Q707O496q698N351j925l941M175J8656
$$ 9275 -7284 -18888 -10093 -10100 -22146 -39144 -31457 -22750 -16254 -24952 -19601 -21526 -25467 -21292 -2636
6767b636O761j365J714p588l940m091J0035p111O146n619p335K495R98K3550J3588
$$ -2636 4125 2760 4474 -3114 -7054 -11145 -1110 -8221 -2075 -7694 -15029 -12534 -11536 12014 25602
6752B5602J1289j7155j6522j1007J3670J3054M73q27L406O19j4729r969K350J2186
$$ 25602 36891 19736 3214 -7793 5877 18931 19404 18577 21983 22602 7873 -2096 254 12440
6738A2440M716K295r687J600P531N141p703R105N239L415J3467Q05j9842K503
$$ 12440 17156 19451 9764 11364 18895 24036 16333 25438 30677 34092 47559 48364 28522 31025
6724C1025J8251J4159R76Q128k912K2026L1846L9968L9719N6863M5138k3292p1063
$$ 31025 49276 63435 64411 72539 69627 91653 123499 163467 203186 260049 305187 281895 210832
6711B10832o9380l7748l1463k4155l0038j00Q370N942N102j5870j1728n453q841
$$ 210832 141452 103704 72241 48086 18048 17948 26318 32260 37362 21492 9764 4311 -4530
6698d530O78J3726l174n45j4968J256j7815L178J4793N053J3853O223j3891O576
$$ -4530 -3852 9874 6700 6155 -8813 -7557 -25372 -22194 -7401 -2348 11505 17728 3837 10413
6684A0413p91j374L12l52L472q487j2349L903l885j248m778J2257m192m854M790
$$ 10413 9622 8248 8560 8208 11680 3193 -9156 -5253 -9138 -10386 -15164 -2907 -7099 -11953 -7163
6669g163n393j1126M339m031m482J6147P566L183r693P476J3830n236N179J0475
$$ -7163 -12556 -23682 -19343 -23374 -27856 -11709 -4143 -960 -10653 -3177 10653 5417 10596 21071
6655B1071M823j0534l602J3583r926l187j028J3131r99r348J239J494J8647J511
$$ 21071 25894 15360 11758 25341 15415 12228 11200 24331 23332 13984 15223 16717 35364 36875
6641C6875j209L518j4627j6665J8614J282j9149o986o92J747J5303R982K961j7114
$$ 36875 35666 39184 24557 7892 26506 27788 8639 1653 961 2708 18011 27993 30954 13840
6627A3840j7374L257P090j0592k990l364o954l520p721J768J5408J2290l58j4395
$$ 13840 -3534 -277 6813 -3779 -6769 -10133 -17087 -20607 -28328 -26560 -11152 1138 780 -13615
6613a3615P394Q838j079o128j237J7716N565k143p820j2707Q622N820q404r486
$$ -13615 -6221 2617 1538 -4590 -5827 11889 17454 15311 7491 -5216 3406 9226 822 -8664
6599h664O501O096j455o128j1835J2477o16m298n942M43o864L959O208M816R043
$$ -8664 -2163 3933 2478 -3650 -15485 -3008 -3624 -7922 -13864 -13421 -20285 -16326 -10118 -5302 3741
6584C741J9874n962j8949j8625j0317J0057J6340M356o71J3263M314k4632j5780
$$ 3741 23615 17653 -1296 -19921 -30238 -20181 -3841 515 -156 13107 17421 -7211 -22991
6571b2991j520J4072J8711J859j4914j3793J2409P988p102K130R273K148j1391
$$ -22991 -24511 -10439 8272 10131 -4783 -18576 -6167 1821 -5281 -3151 6122 8270 -3121
6558c121p175j2099j5146p88R601O596J2125J2577P373j7148J307J0736n698l360
$$ -3121 -10296 -22395 -37541 -38329 -28728 -22132 -10007 2570 9943 -7205 -5898 4838 -860 -4220
6544d220K350l720J2911N712j4572m30m4j1384n650j614n302J0465K5386J4315
$$ -4220 -1870 -5590 7321 13033 -1539 -1969 -2013 -13397 -19047 -20661 -25963 -15498 9888 24203
6530B4203j0531Q58k2541j2952J0924J0903J2303P601K232n149j7573l180J3323
$$ 24203 13672 14530 -8011 -20963 -10039 864 13167 20768 23000 17851 278 -2902 10421
6517A0421P104j1303q500M613l151MJ33p303m438L990J7568q385L263J475j1671
$$ 10421 17525 6222 -2278 2335 -816 -812 -679 -7982 -12420 -8430 9138 753 4016 5491 -6180
6502f180o897m663L782L471j0082K522q57J815J3233K1043J0790q619j913L435
$$ -6180 -13077 -17740 -13958 -10487 -20569 -18047 -18904 -17089 -3856 17187 27977 19358 17445 20880
6488B0880j2492Q46J354j768J2242j625K295p373o308k621O862j5846N680j2682
$$ 20880 8388 9234 10588 8820 21062 19437 21732 14359 8051 5430 12292 -3554 2126 -10556
6474a0556r974K6990q128o78J8222P222P374j1619k136P096j0552j3114n385J43
$$ -10556 -20530 6460 -1668 -2346 15876 23098 30472 18853 16717 23813 13261 147 -5238 -5095
6460e095L734K68m58J1458K472K190L202p884k659m780r220O875m549q664n097
$$ -5095 -1361 -1093 -1551 9907 12379 14569 17771 9887 7228 2448 -6772 103 -4446 -13110 -18207
6445a8207o434q941J0211K2216Q55J079L491N729l928q670M498N38n674j3869
$$ -18207 -24641 -33582 -23371 -1155 -300 779 4270 9999 6071 -2599 1899 2437 -3237 -17106
6431a7106J3113K771L924J8697L729j636j6632r359p585j7617J3673K0988N136
$$ -17106 -3993 -1222 2702 21399 25128 23492 6860 -2499 -10084 -27701 -14028 6960 12096
6418A2096o012m284j519q888r210o027m912R286R653N3j4099r257j7706J1447
$$ 12096 6084 1800 281 -8607 -17817 -23844 -28756 -19470 -9817 -9764 -23863 -33120 -50826 -39379
6404c9379J6947K4859q41m798n470j3598p217q557O038K102R620J0245o173L845
$$ -39379 -22432 2427 1586 -3212 -8682 -22280 -29497 -38054 -32016 -29914 -20294 -10049 -16222 -12377
6390a2377N676k80J2751J8353p254p820L710n157j1434j0088J6360p61O154J6495
$$ -12377 -6701 -6981 5770 24123 16869 9049 12759 7602 -3832 -13920 2440 1679 7833 24328
6376B4328J658j991o898J300k5815k1432j797N057J7155P257J865N128j9601L272
$$ 24328 25986 23995 17097 18397 -7418 -28850 -30647 -25590 -8435 -1178 687 5815 -13786 -10514
6362a0514j4164m744L262o46J7124J0168j476J2704M702j5252r944n108Q159R999
$$ -10514 -24678 -29422 -26160 -26806 -9682 486 -990 11714 16416 1164 -8780 -13888 -5729 4270
6348D270n300j7343o656N706J0364J0665K937p158m868J5388J3125P761j1507
$$ 4270 -1030 -18373 -25029 -19323 -8959 1706 4643 -2515 -7383 8005 21130 28891 17384
6335A7384J045n83j3491j5776j0664m850J9616M313N469K135k5807K125R800J8259
$$ 17384 18429 17846 4355 -11421 -22085 -26935 -7319 -3006 2463 4598 -21209 -19084 -9284 8975
6321H975m233j2144P260O28r675R238K978m909Q118J7374R401j5934k0413r019
$$ 8975 4742 -7402 -142 486 -9189 49 3027 -1882 6236 23610 33011 17077 -3336 -12355
6307a2355p812nj0300k1951J1765Q257J7529J9594O182R190J604j8704n584J4965
$$ -12355 -20167 -20172 -30472 -52423 -40658 -32401 -14872 4722 10904 20094 21698 2994 -2590 12375
6293A2375Q224j0080m399J1286L699l449m306P541o560q107N526K902n957k2868
$$ 12375 20599 10519 6120 17406 21105 17656 13350 20891 14331 6224 11750 14652 8695 -14173
6279a4173O692K0161L058k0750j2094l801O019P724m060j099J5371O892K955J279
$$ -14173 -7481 12680 15738 -5012 -17106 -20907 -14888 -7164 -11224 -12323 3048 9940 12895 14174
6265A4174j0166j605J924k458Q512Q406k456o634j4779n561Q294J2209K173p140
$$ 14174 4008 2403 4327 1869 10381 18787 16331 9697 -5082 -10643 -2349 9860 12033 4893
6251D893j3689K965O203j6527j3268m129p021Q522J2435K1208J0306k3174o338
$$ 4893 -8796 -5831 372 -16155 -29423 -33552 -40573 -32051 -19616 1592 11898 -11276 -17614
6238a7614k04r277J53J3342M294J5694N33Q435j3199M867Q373j1493J3662J0465
$$ -17614 -17818 -27095 -26942 -13600 -9306 6388 6921 15356 2157 7024 15397 3904 17566 28031
6224B8031m411L754n015R43K277K713q701j3689j5205N948Q767j2211l837J5096
$$ 28031 23620 27374 22359 23302 25579 28292 19591 5902 -9303 -3355 5412 -6799 -10636 4460
6210D460J1819J677j8369o690N16P545Q675J6676L729N65q992j3039P996j5555
$$ 4460 16279 17956 -413 -7103 -6587 958 9633 26309 30038 30603 21611 8572 16568 1013
6196A013M293q098m312j885J1638J9669n642j0961Q218p408j7469P16k99L497
$$ 1013 5306 -2792 -7104 -8989 2649 22318 16676 5715 13933 6525 -10944 -10228 -10527 -7030
6182g030M298l568K0480j819r357j4974j1159M820L28J962K453K617j2056n244
$$ -7030 -2732 -6300 14180 12361 3004 -11970 -23129 -18309 -17981 -16019 -13566 -10949 -23005 -28249
6168b8249n44R306j707o911p026K4955L1016j7174J680L585j683j793p143k0935
$$ -28249 -28793 -19487 -21194 -28105 -35131 -10176 20840 3666 5346 8931 7248 5455 -1688 -22623
6154b2623O161K0503M389K798l655J037N036P1j1034k466k0434k058N800n708
$$ -22623 -16462 4041 8430 11228 7573 8610 13646 13717 2683 217 -20217 -22275 -16475 -22183
6140b2183K898K8514J3161j5762L643j1446p656J0051J4601j2745r35O980r421
$$ -22183 -19285 9229 22390 6628 10271 -1175 -8831 1220 15821 3076 2141 9121 -300
6127c00K536L102N07j4834j5113l482J7604j86j4127J3417J2949m436L351n87
$$ -300 2236 5338 5845 -8989 -24102 -27584 -9980 -10166 -24293 -10876 2073 -2363 988 401
6113D01m271j185j8069k5632j0475l294J9094K2181J8695J9327J4839n675k1002
$$ 401 -3870 -5055 -23124 -48756 -59231 -62525 -43431 -21250 -2555 16772 31611 25936 4934
6100D934m464j2610j1990l820J1455J0749j0517l60J9024J0643j2795j4789l050
$$ 4934 470 -12140 -24130 -27950 -16495 -5746 -16263 -16623 2401 13044 249 -14540 -17590
6087a7590O92k077J4558m761o301N757O266r096L151J9220L736J1244p179L299
$$ -17590 -16898 -18975 -4417 -9178 -15479 -9722 -3456 -12552 -9401 9819 13555 24799 17620 20919
6073B0919N673p694q732j8097j2672M996m637o354K5072J7247O198J2437k4315
$$ 20919 26592 18898 10166 -7931 -20603 -15607 -20244 -26598 -1526 15721 21919 34356 10041
6060A0041k976k860j6552q538o878m697J0696R636k980K117R801p927o022M849
$$ 10041 7065 4205 -12347 -20885 -27763 -32460 -21764 -12128 -15108 -12991 -3190 -11117 -17139 -12290
6046a2290r12j3580k184J3211l450k9J4777J477N697J9073k0225r832L545N962
$$ -12290 -13202 -26782 -28966 -15755 -19205 -19234 -4457 -2980 2717 21790 1565 -8267 -4722 1240
6032A240r743r458l619N562P281m409j2906O769J0171m756N789L2225J1135r634
$$ 1240 -8503 -17961 -21580 -16018 -8737 -13146 -26052 -19283 -9112 -13868 -8079 24146 35281 25647
6018B5647K744O336r625j7496j9145J5321M394p481J1895k851o667m191J3382
$$ 25647 28391 34727 25102 7606 -11539 3782 8176 695 12590 9739 3072 -1119 12263
6005A2263k469r971m752P43K098J0220L385j7479o494M139O359j609o179m288
$$ 12263 9794 -177 -4929 -4186 -2088 8132 11517 -5962 -12456 -8317 -1958 -3567 -9746 -14034
5991a4034J6822N512L546J3Q684o745k5458j6835O350K0896J2727q23j936j771
$$ -14034 2788 8300 11846 11859 20543 13798 -11660 -28495 -22145 -1249 11478 10655 8719 6948
5977F948M051K8J3210k20J364j1676r675p770j209J9024m925j1861j5886L133
$$ 6948 10999 11027 24237 24017 25381 13705 4030 -3740 -4949 14075 9150 -2711 -18597 -15464
5963a5464M301n800J2436K334Q341r15m290j9300j100R941J5779K1571o014j3823
$$ -15464 -11163 -16963 -4527 -2193 6148 5233 943 -18357 -19457 -9516 6263 27834 21820 7997
5949G997p230N391r778j1470K955J4992M20k800Q864n63j3720R274J4992n560
$$ 7997 767 6158 -3620 -15090 -12135 2857 3277 477 9341 8778 -4942 4332 19324 13764
5935A3764k942L747n923n928j032j7531k3577K1984L1466j678J1216K1081k962
$$ 13764 10822 14569 8646 2718 1686 -15845 -39422 -17438 14028 12350 23566 44647 41685
5922D1685p462j9946r056o806j0793O333L632m580j2875r100M713M719J7095J1846
$$ 41685 34223 14277 5221 -1585 -12378 -6045 -2413 -6993 -19868 -28968 -24255 -19536 -2441 9405
5908I405O683r266L447L505j3545q817M599J553Q448k028j4923m244K1800K26
$$ 9405 16088 6822 10269 13774 229 -8588 -3989 -2436 6012 3984 -10939 -15183 6617 6843
5894F843p213j2843N16Q612o685N136M252J0148j195j3756N090O014J5555M698
$$ 6843 -370 -13213 -12697 -4085 -10770 -5634 -1382 8766 7571 -6185 -1095 4919 20474 25172
5880B5172o521j159n684r86R044n85k257p651j5732j6370n577m935J6374M569
$$ 25172 18651 17492 11808 10822 19866 19281 17024 9373 -6359 -22729 -28306 -33241 -16867 -12298
5866a2298j2421J3706M126j2776K208J0813j491J6579k119J0882N855J0069K11
$$ -12298 -24719 -11013 -6887 -19663 -17455 -6642 -8133 8446 6327 17209 23064 33133 33344
5853C3344j2053k692L817r783m373O470j0110k6517j5805k922J2727J4256L834
$$ 33344 21291 18599 22416 12633 8260 14730 4620 -21897 -37702 -40624 -27897 -13641 -9807
5840i807J4362M721k853k1820K237J931m832J003O463L508K910P232l729N754
$$ -9807 4555 9276 6423 -15397 -13160 -11229 -16061 -15058 -8595 -5087 -2177 5055 1326 7080
5826G080j4647j6084J0646O616r037q534J5128M826m706N445L186O764K046L367
$$ 7080 -7567 -23651 -13005 -6389 -15426 -23960 -8832 -4006 -8712 -3267 -81 6683 8729 12096
5812A2096p449O261O671k780q966n863r562J2987O872l11L536J2965n566o196
$$ 12096 4647 10908 17579 14799 5833 -30 -9592 3395 10267 9956 13492 26457 20891 14695
5798A4695o076J0675M424j8919q057J910J0552r697m011J5249P548J773J378K487
$$ 14695 8619 19294 23718 4799 -3258 -1348 9204 -493 -4504 10745 18293 20066 21444 23931
5784B3931p105m407j0035k917j889n448L037J6660J8283k2521j3846N971j3234
$$ 23931 16826 12419 2384 -533 -2422 -7870 -4833 11827 30110 7589 -6257 -286 -13520
5771a3520O001q274m908o807j99r28J807J4353M843r674k727J8173J3385J1932
$$ -13520 -7519 -15793 -20701 -27508 -27707 -28635 -26828 -12475 -7632 -17306 -20033 -1860 11525 23457
5757B3457l023j3909j1981j1944N642k1307l997P625K0138P073J297j0238O400
$$ 23457 20434 6525 -5456 -17400 -11758 -33065 -37062 -29437 -9299 -2226 -929 -11167 -4767
5744d767k351O982J3414J475N812l863J572o443p376j2694J983r067m391J1802
$$ -4767 -7118 -136 13278 14753 20565 16702 18274 11831 4455 -8239 -6256 -15323 -19714 -7912
5730g912M491j6047J1560P759O931q026j3081j4446L427J3449N206P171j8331
$$ -7912 -3421 -19468 -7908 -149 6782 -1244 -14325 -28771 -25344 -11895 -6689 482 -17849
5717a7849m266J4542K327n382R549J0835m942l433K333m071k2088j8674j57R896
$$ -17849 -22115 -7573 -5246 -10628 -1079 9756 4814 1381 3714 -357 -22445 -41119 -41276 -31380
5703c1380M153J6770q863q376K6404J4985N338R305o190k3265k00J0463m923K426
$$ -31380 -27227 -10457 -19320 -27696 -1292 13693 19031 28336 22146 -1119 -1319 9144 4221 6647
5689F647R173j0454j2415J1252J0113n034j420j2263k608J01j831j1982n323M814
$$ 6647 15820 5366 -7049 4203 14316 9282 7862 -4401 -7009 -6908 -8739 -20721 -26044 -21230
5675b1230q240J64J2072J1206k05N106R874N78o799l040J2563O15q335r99O505
$$ -21230 -29470 -29306 -17234 -6028 -6233 -1127 8747 9325 2526 -514 12049 12664 4329 3330 9835
5660I835J1242L860r546j6515O169J668k068o10K808J3159M529j792k209O290
$$ 9835 21077 24937 15391 -1124 5045 6713 4645 4035 6843 20002 24531 22739 20530 26820
5646B6820L85j717m024P786m545j4628j7786k3369R169J5812P097L508J1430n550
$$ 26820 27205 25488 21464 29250 24705 10077 -7709 -31078 -21909 -6097 1000 4508 15938 10388
5632A0388r191o439R19K726J1035j889n399k38L335O550K313K075k983m341K047
$$ 10388 1197 -5242 -4323 -1597 9438 7549 2150 1912 5247 11797 14110 16185 13202 8861 10908
5617A0908m750N849J6630r304j5423j3525l590o828J939K682R756J6240P784O52
$$ 10908 6158 12007 28637 19333 3910 -9615 -13205 -20033 -18094 -15412 -5656 10584 18368 19020
5603A9020p137M111J4694k1235l6463k8347L292J0074K319l293J3944Q765J7903
$$ 19020 11883 15994 30688 9453 -27010 -55357 -52065 -41991 -39672 -42965 -29021 -20256 -2353
5590b353m391j074m873n290k060Q573j6272l310J4424J1514J3183l842o451n545
$$ -2353 -6744 -7818 -12691 -17981 -20041 -11468 -27740 -31050 -16626 -5112 8071 4229 -2222 -7767
5576g767M344L107j4506j6625J664O047K1877J5427N173j3838J6027N891j8906
$$ -7767 -3423 -316 -14822 -31447 -29783 -23736 -1859 13568 18741 4903 20930 26821 7915
5563G915j7642J0419J7169j440j755N172p076P99L159k1075j3006J5957J2011
$$ 7915 -9727 692 17861 16421 14666 19838 12762 13561 16720 -4355 -17361 -1404 10607
5550A0607j66K970j3595j2884J829l021Q927J9948K880m608o784j687r827p252
$$ 10607 10441 13411 -184 -13068 -11239 -14260 -5333 14615 17495 12887 6103 4416 -5411 -12663
5536a2663J6094J1383J3199o110k2984m665R459j933M422L503Q536j5306J84J2768
$$ -12663 3431 14814 28013 21903 -1081 -5746 3713 1780 6202 9705 18241 2935 3119 15887
5522A5887M237k4303j5695l821J3311M724J69k653O12N399j620p591j426m895
$$ 15887 20124 -4179 -19874 -23695 -10384 -5660 -5491 -8144 -7532 -2133 -3753 -11344 -12770 -17665
5508a7665K050q353P063J7095L152J8474n933k4009j1684L133J3336M491j2744
$$ -17665 -15615 -23968 -16905 190 3342 21816 15883 -8126 -19810 -16677 -3341 1150 -11594
5495a1594L035n823l708J710O060O428J0488L468P483o306n192n537M247j3088
$$ -11594 -8559 -14382 -18090 -16380 -10320 -3892 6596 10064 17547 11241 6049 512 4759 -8329
5481h329j1770Q01J8357R328L821q621J7450L321j7604j5953k412q97R21o740
$$ -8329 -20099 -19298 -941 8387 12208 3587 21037 24358 6754 -9199 -11611 -12508 -11587 -18327
5467a8327Q349J011J4676J9339J0675j2311j3854q007J530K192j2409n092K796
$$ -18327 -9978 -8967 5709 25048 35723 23412 9558 1551 3081 5273 -7136 -12228 -9432
5454i432l029Q104p764k451j886l382N38L066Q124J713l253J6175O159j0194j4463
$$ -9432 -12461 -4357 -12121 -14572 -16458 -19840 -19302 -16236 -8112 -6399 -9652 6523 12682 2488 -11975
5439a1975j4019j86J9399L328N712R275r778j2406J6919M245j9859l665j3011
$$ -11975 -25994 -26180 -6781 -3453 2259 11534 1756 -10650 6269 10514 -9345 -13010 -26021
5426b6021P620K1620J4288j4353p940J761j746J9802j512j9280j1056j4475j2872
$$ -26021 -18401 3219 17507 3154 -4786 -3025 -4771 15031 13519 -5761 -16817 -31292 -44164
5413d4164J7410J9p50Q271R915J1723p12j969j955N683r531j8633M665J6055j101
$$ -44164 -26754 -26735 -27485 -19214 -9299 2424 1712 -257 -2212 3471 -6060 -24693 -20028 -3973 -5074
5398e074K517J732j354p379m721L080J0376o447j5033o381K08P560j1997N800
$$ -5074 -2557 -825 -2179 -9558 -14279 -11199 -823 -7270 -22303 -28684 -28476 -20916 -32913 -27113
5384b7113j900J1702j885j4378j0457J3938M173K4917J1153j1290r973j295j1154
$$ -27113 -29013 -17311 -19196 -33574 -44031 -30093 -25920 -1003 10150 -1140 -11113 -12408 -23562
5371b3562j597J0809L069R281o658r693N025j362j4648J4201p509l485J3600J5109
$$ -23562 -25159 -14350 -11281 -2000 -8658 -18351 -13326 -14688 -29336 -15135 -22644 -26129 -12529 2580
5357B580m226n124p71j0723j2231j455P157K0442J1088R923j4818J4224j5353
$$ 2580 -1646 -6770 -7541 -18264 -30495 -31950 -24793 -4351 6737 16660 1842 16066 713
5344G13j3780j0115n59K653O790l428J3319J6005j586M909m192p52j2254M208
$$ 713 -13067 -23182 -23741 -21088 -14298 -17726 -4407 11598 10012 14921 10729 9977 -2277 1931
5330A931O144r327j0513J803n195J6498n228j8965J5894R425p978p691J3250J7688
$$ 1931 8075 -1252 -11765 -9962 -15157 1341 -3887 -22852 -6958 2467 -5511 -13202 48 17736
5316A7736P670L070k9757j7683o065J4238M356k0498q249j575J4502J3742N385
$$ 17736 25406 28476 -1281 -18964 -25029 -10791 -6435 -26933 -35182 -36757 -22255 -8513 -3128
5303c128M891Q23J1833k093k654M933J630q780n341N958j5187k0656j0546p668
$$ -3128 1763 2586 14419 12326 9672 14605 16235 7455 2114 8072 -7115 -27771 -38317 -45985
5289d5985M461M880M841J9546K0611Q369o687m060R918k715r416p995q533R143
$$ -45985 -41524 -36644 -31803 -12257 8354 16723 10036 5976 15894 13179 3763 -4232 -12765 -3622
5275c622j1977J959J6639n372k3447K240M440j294P317L252N947m012k53J2056
$$ -3622 -15599 -13640 2999 -2373 -25820 -23580 -19140 -20434 -13117 -9865 -3918 -7930 -8183 3873
5261C873L919j8839N215j162p766j679j2615j3364N327J372j0681k599J6556J8785
$$ 3873 7792 -11047 -5832 -6994 -14760 -16439 -29054 -42418 -37091 -35719 -46400 -48999 -32443 -13658
5247a3658L2101O4o335p970j788j363J0388J1443M44k385j5346j1711R612r413
$$ -13658 18443 18507 12172 4202 2414 1051 11439 22882 23326 20941 5595 -6116 3496 -5917
5233e917j5112Q61J7885J078o142j2202p172J7986L163k008M020q52N05M938L298
$$ -5917 -21029 -20168 -2283 -1205 -7347 -19549 -26721 -8735 -5572 -7580 -3560 -4412 -3907 1031 4329
5218D329J324j0645J2224J852j3158j7705J360O980m500q427J3007K2193p889
$$ 4329 5653 -4992 7232 9084 -4074 -21779 -20419 -13439 -17939 -26366 -13359 8834 945
5205I45k144Q467n049R853M99j6567J1507o610o111Q215L712k809n144n363q552
$$ 945 -1199 7268 2219 12072 12571 -3996 7511 901 -5210 3005 6717 3908 -1236 -6599 -15151
5190a5151m783J8203J2580L093j9519j3908m984J1149J7729M508M40N356L540
$$ -15151 -19934 -1731 10849 13942 -5577 -19485 -24469 -13320 4409 8917 9357 14713 18253
5177A8253q287J861R898j2942j2785m471n58M414l901p408j0365j853l886J246
$$ 18253 9966 11827 21725 8783 -4002 -8473 -9031 -4617 -8518 -15926 -26291 -28144 -32030 -30784
5163c0784j897n46J2142K0287L202k4308M439K8669R012l401j307j8791j0894
$$ -30784 -32681 -33227 -21085 -798 2404 -21904 -17465 11204 20216 16815 15508 -3283 -14177
5150a4177n697O171O266j3489j7006l255P287K5338J0077R817j851K26k217L666
$$ -14177 -19874 -13703 -7437 -20926 -37932 -41187 -33900 -8562 1515 11332 9481 9707 7490 11156
5136A1156j2446q264J1753k990k2453j586O501J945j207Q027J5454j5669k554
$$ 11156 -1290 -9554 2199 -791 -23244 -24830 -18329 -16384 -17591 -9564 5890 -9779 -12333
5123a2333O966J1838n860j0397J3876J2544Q693Rj633j3694m874N507R836j557
$$ -12333 -5367 6471 611 -9786 4090 16634 25327 25336 23703 10009 5135 10642 20478 18921
5109A8921M66m681q360K025N664L93q257j6965o439J24J1298J7727J4359r966
$$ 18921 19387 14706 6346 8371 14035 14428 6171 -10794 -17233 -17109 -5811 11916 26275 16309
5095A6309j9586p680J506m308K3763J6609k503j3241j2977p867m641K2559K1407
$$ 16309 -3277 -10957 -9451 -13759 10004 26613 24110 10869 -2108 -9975 -14616 7943 29350
5082B9350j3972r828j9238K762J0504m715Q786R869r091J6241J7814j4310O805
$$ 29350 15378 5550 -13688 -10926 -422 -5137 3649 13518 4427 20668 38482 24172 30977
5069C0977k402j4119j5470r761l122K413n968K0028N802O079q828j2504P94K27
$$ 30977 28575 14456 -1014 -10775 -13897 -11484 -17452 2576 8378 14457 5629 -6875 -6081 -5854
5055e854n384o332k52K917N068k645L726p677j015L13j1158l149J3165j0071J2791
$$ -5854 -11238 -17570 -17822 -14905 -9837 -12482 -8756 -16433 -17448 -17135 -28293 -31442 -18277 -28348 -15557
5040a5557M137l34R905l647r723P237N561R759J620q617N583N952J008P052J3420
$$ -15557 -11420 -11754 -1849 -5496 -15219 -7982 -2421 7338 8958 341 5924 11876 12884 19936 33356
5025C3356l878m514P380O882k0402j7116j520R902k148K857q884j5286K51M002
$$ 33356 29478 24964 32344 39226 18824 1708 188 10090 7942 10799 1915 -13371 -13120 -9118
5011i118J287J4004P375J8312l341j0564j3166J0681q69k0206p881J4368o804
$$ -9118 -7831 6173 13548 31860 28519 17955 4789 15470 14601 -5605 -13486 882 -5922
4998e922j8244P885K1277P568j3705J502Q985j336L223j574k679O990j676j9548
$$ -5922 -24166 -16281 4996 12564 -1141 361 9346 8010 11233 9659 6980 13970 12294 -7254
4984g254k553m669j1220n580J4484L26M668n536L052K712J2980J2907J2617j0337
$$ -7254 -9807 -14476 -25696 -31276 -16792 -16466 -11798 -17334 -14282 -11570 1410 14317 26934 16597
4970A6597r440j479O942n658k3215j1875J4727J3817k0890p41J5492N40l913J456
$$ 16597 7157 5678 12620 6962 -16253 -28128 -13401 416 -20474 -21215 -5723 -5183 -9096 -7640
4956g640K1434n925N559O973n981M557l702j4373j1379R754m218J2937J4305n608
$$ -7640 13794 7869 13428 20401 14420 18977 15275 902 -10477 -723 -4941 7996 22301 16693
4942A6693j3584q615K0429j7804p696l204L667M964o565N120n091L157r430P549
$$ 16693 3109 -5506 14923 -2881 -10577 -13781 -10114 -5150 -11715 -6595 -11686 -8529 -17959 -10410
4928a0410R228o044K508K1927N02j3074q396l608M243j611O708P188N977J61m475
$$ -10410 -1182 -7226 -4718 17209 17711 4637 -3759 -7367 -3124 -4735 1973 9161 15138 15299 10824
4913A0824m274R087J5688J0466n231k2855j2881p918J0497n96j5717j2347r62
$$ 10824 6550 15637 31325 41791 36560 13705 824 -7094 3403 2807 -12910 -25257 -26219
4900b6219q604J084K5693n00j2266J6324j265o760P373n153p80R403K247N958
$$ -26219 -34823 -33739 -8046 -8546 -20812 -4488 -5753 -12513 -5140 -10293 -11073 -1670 577 6535
4886F535j304j9676J0096J9825J1589k968j1597j5484o143j509l528O57O145J607
$$ 6535 5231 -14445 -4349 15476 27065 24097 12500 -2984 -9127 -10636 -14164 -13507 -7362 -5755
4872e755l251P620m294k7982o81K5596J4040Q272n7k331p09J6668J3144q610j0311
$$ -5755 -9006 -1386 -5680 -33662 -34343 -8747 5293 13565 13508 11177 10468 27136 40280 31670 21359
4857B1359q263j9771k0535K590J3535J0190l964m136n412q799J463J46J411n388
$$ 21359 13096 -6675 -27210 -24620 -11085 -895 -4859 -8995 -14407 -23206 -21743 -21597 -20186 -25574
4843b5574N099j654P132K5166j902q59K937Q017p06j6430N759j0059r85P356j0118
$$ -25574 -20475 -22129 -14997 10169 8267 7408 10345 18362 17656 1226 6985 -3074 -4059 3297 -6821
4828f821N812L857M141J0130L304N289L272j3049o753o89k3781n254J8486j092
$$ -6821 -1009 2848 6989 17119 20423 25712 28984 15935 9182 8493 -15288 -20542 -2056 -3148
4814c148j0800L293l882O217j1813N805K0396J2527K396r687o773r897L309q339
$$ -3148 -13948 -10655 -14537 -8320 -20133 -14328 6068 18595 20991 11304 4531 -5366 -2057 -10396
4800a0396n919O735K3887N187j0792J344q997l368k189k1279k3286K217J5679
$$ -10396 -16315 -9580 14307 19494 8702 10046 1049 -2319 -4508 -25787 -49073 -46856 -31177
4787c1177M198R809R016j009m731n214J7134o752K061J7793m552k0598j7083L202
$$ -31177 -26979 -17170 -8154 -9163 -13894 -19108 -1974 -8726 -6665 11128 6576 -14022 -31105 -27903
4773b7903L276N561L138Q454j7556O45J4139R072N241R186Q629J0344K441l467
$$ -27903 -24627 -19066 -15928 -7474 -25030 -24385 -10246 -1174 4067 13253 21882 32226 34667 31200
4759C1200j6037j892l535n977j6898q406J3893J6328R429O856k0884j8066j3815
$$ 31200 15163 13271 9736 3759 -13139 -21545 -7652 8676 18105 24961 4077 -13989 -27804
4746b7804N302J3680K5305k808l689j4568L564K953l868j877R264R424r787p844
$$ -27804 -22502 -8822 16483 13675 9986 -4582 -1018 1935 -1933 -3810 5454 14878 5091 -2753
4732b753L051J2769R324j1006j3163j4305l159R12K7285J5401J4073k0653P85
$$ -2753 298 13067 22391 11385 -1778 -16083 -19242 -18330 8955 24356 38429 17776 18561
4719A8561k2868k1144K0159L759P879Q762k118L036J1429j1604l635n455m478
$$ 18561 -4307 -25451 -5292 -1533 6346 15108 12990 16026 27455 15851 12216 6761 2283
4706B283k928p866Q845N978K0335r537j662J0709K295p469j5970J711K0119j0082
$$ 2283 -645 -8511 334 6312 26647 17110 15448 26157 28452 20983 5013 6724 26843 16761
4692A6761n340N802q601p59N540N898P935r122r792K12k749j7221J949K707N36
$$ 16761 11421 17223 8622 7863 13403 19301 27236 18114 8322 8534 5785 -11436 -9487 -6780 -6244
4677f244R618M710j2331j7234j5400K912K7149J8352L137j3933j569O937M739
$$ -6244 3374 8084 -4247 -21481 -36881 -33969 -6820 11532 14669 736 -833 6104 10843
4664A0843m493Q525j2307J366J5105k0983M148k1851n047J4314M727r565J3106
$$ 10843 6350 14875 2568 3934 19039 -1944 2204 -19647 -24694 -10380 -5653 -15218 -2112
4651b112J0768M691m550l042R25L019o003j2795P310N776l799r855q068J0555
$$ -2112 8656 13347 8797 5755 6680 9699 3696 -9099 -1789 3987 188 -9667 -17735 -7180
4637g180N988p516j2481K4523K3141J4008j2418j7380k5059m200O356j496L891
$$ -7180 -1192 -8708 -21189 3334 26475 40483 28065 10685 -14374 -18574 -12218 -13714 -9823
4624i823Q309N146l961O092Q00r696K40j318o846j408j3203p138J1347r88K886
$$ -9823 -1514 3632 -329 5763 6563 -3133 -2893 -4211 -11057 -12465 -25668 -32806 -21459 -22447 -19561
4609a9561J5492K9342O480p767J6835N185j8155j4296q786P020L051Q0J1704r063
$$ -19561 -4069 25273 31753 23986 40821 46006 27851 13555 4769 11789 14840 14920 26624 17561
4595A7561j530j7870k8895O016J9554J3646o828Q153L794j6074K559L471j3927
$$ 17561 16031 -1839 -30734 -24718 -5164 8482 1654 9807 13601 -2473 86 3557 -10370
4582a0370L924J436o403l727R575P328o648j1147J299k680L16n241N903L633J140
$$ -10370 -6446 -5010 -11413 -15140 -5565 1763 -4885 -16032 -14733 -17413 -17097 -22338 -16435 -12802 -11662
4567a1662j2337r459J9519Q285P944n136m206j495j2743M265J0408j705N48J0916
$$ -11662 -23999 -33458 -13939 -5654 2290 -2846 -7052 -8547 -21290 -17025 -6617 -8322 -7774 3142
4553C142J3003K148j5618m876j9646o411J1975m278J82J2541j2423N546Q027J4993
$$ 3142 16145 18293 2675 -2201 -21847 -28258 -16283 -20561 -20379 -7838 -20261 -14715 -6688 8305
4539H305J6562o016j2191R48J1280p42j1837r413p105N975J5570K638O346n95
$$ 8305 24867 18851 6660 7608 18888 18146 6309 -3104 -10209 -4234 11336 13974 20320 19725
4525A9725j094N924j0168L378Q012q450j3587n730N757J8796p561j6982Q561M58
$$ 19725 18631 24555 14387 17765 25777 17327 3740 -1990 3767 22563 15002 -1980 6581 7039
4511G039j0527P534p937r010j479n27O450Q292Q90O967q716k174j3091r433J4997
$$ 7039 -3488 4046 -3891 -12901 -14380 -14907 -8457 -165 725 7692 -1024 -3198 -16289 -25722 -10725
4496a0725K538j1886l493N770P105n263J0982J4619J0169j9425k0734J4610Q084
$$ -10725 -8187 -20073 -23566 -17796 -10691 -15954 -4972 9647 19816 391 -20343 -5733 2351
4483B351J8026j25j9714j2597J1264J5177n330J038Q713R67J170P676k837k036
$$ 2351 20377 20252 538 -12059 -795 14382 9052 10090 18803 19770 20940 28616 25779 23743
4469B3743j3734M708P614J8q0J2429j1307j6851m653Q81O60k995n368L901J5572
$$ 23743 10009 14717 22331 22349 22269 34698 23391 6540 1887 2768 3428 433 -4935 -1034 14538
4454A4538R147j385j5245j6268j4022J6594L4127m337n819J554q507l890K586
$$ 14538 23685 22300 7055 -9213 -23235 -6641 27486 23149 17330 18884 10377 6487 9073
4441I073Q375j4331j2250J0592l036n977N152j0625k223J4033P118j0433j9060
$$ 9073 17448 3117 -9133 1459 -1577 -7554 -2402 -13027 -15250 -1217 5901 -4532 -23592
4428b3592q854K5535K7842J4655Q976j1038m202j7944j5901L622J608N27n889
$$ -23592 -32446 -6911 20931 35586 44562 33524 29322 11378 -4523 -901 707 1234 -4655
4415d655J6516P282j7603j4285j015P408R687J0071j1065j2115o397m97J1647
$$ -4655 11861 19143 1540 -12745 -13760 -6352 3335 13406 2341 -9774 -16171 -16668 -5021
4402e021j5335k752J5846O956M797O040k54m480j4596Q721j9670m76L0257j992
$$ -5021 -20356 -23108 -7262 -306 4491 10531 10277 5797 -8799 -78 -19748 -20224 10033 8041
4388H041j8817N131k368k464q049L992R729J902Q142o541R36l182k693Q696j631
$$ 8041 -10776 -5645 -8013 -10477 -18526 -14534 -4805 -2903 5239 -1302 -366 -3548 -6241 2455 824
4373H24p806m07R814Q201n900k5165m705q67n649J9474L466M847q393M799P709
$$ 824 -6982 -7389 2425 10626 4726 -20439 -25144 -26011 -31660 -12186 -8720 -3873 -12266 -7467 242
4358B42j0139o690l715L0936J3060j3286j0880j095l865J2673o893k373l725K8046
$$ 242 -9897 -16587 -20302 10634 23694 10408 -472 -1567 -5432 7241 348 -2025 -5750 22296
4344B2296J5958r638K83j3956o127J316p659k441j648J1457J0474R551p232j6534
$$ 22296 38254 28616 28899 14943 8816 10132 2473 32 -1616 9841 20315 29866 22634 6100
4330F100j1199l673J9372p48L225P171k0623n723k43P7J4514n437j1808J1258
$$ 6100 -5099 -8772 10600 9852 13077 20248 -375 -6098 -6341 -6264 8250 2813 -8995 2263
4316B263Q804q135P148P626L569N970n105j9550j3701K292J6777Q591j364j7867
$$ 2263 11067 2932 10080 17706 21275 27245 22140 2590 -11111 -8819 7958 16549 15185 -2682
4302b682k2207l578L1493J1977J168Q130j2545j2331j2003p345N285K1136K662
$$ -2682 -24889 -28467 3026 15003 16171 24301 11756 -575 -12578 -19923 -14638 6498 9160
4289I160q886J5053j168j3535L082j9361k4719R404J8508l755J2852J5442J0379
$$ 9160 274 15327 14159 624 3706 -15655 -40374 -30970 -12462 -16217 -3365 12077 22456
4276B2456M793R887j0181r059P482M532j3358k7386j125P591K0310J2029j3637
$$ 22456 27249 37136 26955 17896 25378 29910 16552 -10834 -11959 -4368 15942 27971 14334
4263A4334m312J0859j2492L977J2355k508J26j2318j0981j5830m632J57p78N415
$$ 14334 10022 20881 8389 12366 24721 22213 22339 10021 -960 -16790 -21422 -21265 -22043 -16628
4249a6628o763J8241R510j2366L666o345P33Q684j6493j4257o210J5279J4775
$$ -16628 -23391 -5150 4360 -8006 -4340 -10685 -9952 -1268 -17761 -32018 -38228 -22949 -8174
4236h174J127O899L404j2679j0578K499n300o624k0017J8459K5190j193N490j1618
$$ -8174 -7047 -148 3256 -9423 -20001 -17502 -22802 -29426 -49443 -30984 -5794 -6987 -1497 -13115
4222a3115o975O565J0471M744J2448M163j9421k2419l953N268J1822J0696o236
$$ -13115 -20090 -13525 -3054 1690 14138 18301 -1120 -23539 -27492 -22224 -10402 294 -5942
4209e942l959n408P324j0219K418R576J0058Q623o973j1020m124j054O97P083
$$ -5942 -9901 -15309 -7985 -18204 -15786 -6210 3848 12471 5498 -5522 -9646 -10700 -10003 -2920
4195b920J1625M065n37Q623j3482n756L451r393O096J4184j7748M425M410L735
$$ -2920 8705 12770 12233 20856 7374 1618 5069 -4324 1772 15956 -1792 2633 7043 10778
4181A0778J5329j0341j9016j1986K91J0967M937J1761Q541o26r870P464P865m647
$$ 10778 26107 15766 -3250 -15236 -14945 -3978 959 12720 21261 20635 10765 18229 26094 21447
4167B1447m748j1201l168J3219k0604j7041N457P927P926J210J4127l505q739
$$ 21447 16699 5498 2330 15549 -5055 -22096 -16639 -8712 -786 424 14551 11046 2307
4154B307l632r477p258N791j0073q108M933J7526O818J0958J681k0677N602R127
$$ 2307 -1325 -10802 -18060 -12269 -22342 -30450 -25517 -7991 -1173 9785 11466 -9211 -3609 5518
4140E518l843J3746J1116j6405p811L11k37q99J801k532O512j5052r115n43l111
$$ 5518 1675 15421 26537 10132 2321 2632 2395 1496 3297 765 7277 -7775 -16890 -17433 -20544
4125b0544L187j434P09L079R630J3704J1153J061j5089J348N083M50M341n063
$$ -20544 -17357 -18791 -18082 -15003 -5373 8331 19484 20545 5456 6804 11887 12337 16678 11615
4111A1615N403n421p080r868P084l094p689j3707j3048J2766J5245j1886k341
$$ 11615 17018 11597 4517 -5351 1733 -1361 -9050 -22757 -35805 -23039 -7794 -19680 -22021
4098b2021J1338J5611M996j9635j0576N057l678O425n889K160P058R868L484j1221
$$ -22021 -10683 4928 9924 -9711 -20287 -15230 -18908 -12483 -18372 -16212 -9154 714 4198 -7023
$$ [...]
##END NTUPLES=NMR SPECTRUM
##END=
