##TITLE=Analysis number 329755
Compound Code mo 00953
Project Code adrs
Chemist Name fudan
##JCAMPDX= 6.0         $$ Bruker NMR JCAMP-DX V2.0
##DATA TYPE= NMR SPECTRUM
##DATA CLASS= NTUPLES
##ORIGIN= Bruker BioSpin GmbH
##OWNER= nmr
$$ XWIN-NMR		Version 3.5
$$ Wed Sep 26 11:50:50 2007 GMT Daylight Time (UT+1h)  MAYBRIDGE\nmr@NMR_250MHZ
##.OBSERVE FREQUENCY= 250.131544655141
##.OBSERVE NUCLEUS= ^1H
##.ACQUISITION MODE= SIMULTANEOUS (DQD)
##.ACQUISITION SCHEME= undefined
##.AVERAGES= 16
##.DIGITISER RES= 18
##SPECTROMETER/DATA SYSTEM= dpx250
##.PULSE SEQUENCE= zg30
##.SOLVENT NAME= DMSO
##.SHIFT REFERENCE= (INTERNAL, DMSO, 0, 16.522)
##AUDIT TRAIL= $$ (NUMBER, WHEN, WHO, WHERE, WHAT)
$$ ##TITLE= Audit trail, XWIN-NMR		Version 3.5
$$ ##JCAMPDX= 5.01
$$ ##ORIGIN= Bruker BioSpin GmbH
$$ ##OWNER= nmr
$$ C:\u/data/dgb/nmr/ADRS/2450/pdata/1/auditp.txt
$$ ##AUDIT TRAIL=  $$ (NUMBER, WHEN, WHO, WHERE, WHAT)
(   1,<2007-09-26 11:50:26.35 +100>,<MAYBRIDGE\nmr>,<NMR_250MHZ>,
      <created by zg, POWCHK disabled, PULCHK disabled
       configuration hash MD5:
       76 6E 9A 78 1E 09 19 81 EC 84 63 8F B0 6A 59 2D
       data hash MD5: 64K
       88 A9 28 90 6A E7 F7 0E 3C 29 30 D7 1F DC D1 4B>)
(   2,<2007-09-26 11:50:38.78 +100>,<MAYBRIDGE\nmr>,<NMR_250MHZ>,
      <Start of raw data processing
       ef LB = 0.3 FT_mod = 6 PKNL = 1 SI = 32K 
       data hash MD5: 32K
       6D 0D 3B D9 C1 E5 35 F4 D2 6A 35 70 E5 47 B1 9E>)
(   3,<2007-09-26 11:50:40.48 +100>,<MAYBRIDGE\nmr>,<NMR_250MHZ>,
      <apk 
       data hash MD5: 32K
       20 C6 0D 5E 36 55 B5 91 79 F6 23 70 59 B0 C2 06>)
(   4,<2007-09-26 11:50:41.17 +100>,<MAYBRIDGE\nmr>,<NMR_250MHZ>,
      <abs ABSG = 5 
       data hash MD5: 32K
       2E 8B B8 03 27 A8 CA 4E EA AB 26 85 1B F1 70 E1>)
$$ ##END=
$$ 
$$ hash MD5
$$ 67 C4 F6 FD CF 9B C0 39 8C 4B 20 EE 5E EA 36 70
##$RELAX= 
##$RELAX= 
##$RELAX= 
##$RELAX= 
##$RELAX= 
##$RELAX= 
##$RELAX= 
$$ Bruker specific parameters
$$ --------------------------
##$DU= <C:\u>
##$EXPNO= 2450
##$NAME= <ADRS>
##$PROCNO= 1
##$TYPE= <nmr>
##$USER= <dgb>
##$AMP= (0..31)
100 100 100 100 100 100 100 100 100 100 100 100 100 100 100 100 100 100 
100 100 100 100 100 100 100 100 100 100 100 100 100 100 
##$AQSEQ= 0
##$AQ_mod= 3
##$AUNM= <au_zg>
##$AUTOPOS= <52 >
##$BF1= 250.13
##$BF2= 250.13
##$BF3= 250.13
##$BF4= 250.13
##$BF5= 500.13
##$BF6= 500.13
##$BF7= 500.13
##$BF8= 500.13
##$BYTORDA= 1
##$CFDGTYP= 0
##$CFRGTYP= 5
##$CHEMSTR= <none>
##$CNST= (0..31)
1 1 145 1 1 1 1 1 1 1 1 1 1 1 1 1 1 1 1 1 1 1 1 1 1 1 1 1 1 1 1 1 
##$CPDPRG= <>
##$CPDPRG1= <>
##$CPDPRG2= <>
##$CPDPRG3= <>
##$CPDPRG4= <mlev>
##$CPDPRG5= <mlev>
##$CPDPRG6= <mlev>
##$CPDPRG7= <mlev>
##$CPDPRG8= <mlev>
##$CPDPRGB= <>
##$CPDPRGT= <>
##$D= (0..31)
0 1 0 0 0 0 0 0 0 0.06 0 0 0 0 0 0 0.0002 0 0 0 0 0 0 0 0 0 0 0 0 0 0 
0 
##$DATE= 1190803825
##$DBL= (0..7)
120 120 120 120 120 120 120 120 
##$DBP= (0..7)
150 150 150 150 150 150 150 150 
##$DBP07= 0
##$DBPNAM0= <>
##$DBPNAM1= <>
##$DBPNAM2= <>
##$DBPNAM3= <>
$$ [...]
##$SUBNAM7= <"">
##$SUBNAM8= <"">
##$SUBNAM9= <"">
##$SW= 20.6930455092707
##$SWIBOX= (0..15)
0 0 3 0 0 0 0 0 0 0 0 0 0 0 0 0 
##$SW_h= 5175.983436853
##$TD= 65536
##$TD0= 1
##$TE= 296.16
##$TE2= 300
##$TE3= 300
##$TEG= 300
##$TL= (0..7)
0 120 120 120 120 120 120 120 
##$TP= (0..7)
150 150 150 150 150 150 150 150 
##$TP07= 0
##$TPNAME0= <>
##$TPNAME1= <>
##$TPNAME2= <>
##$TPNAME3= <>
##$TPNAME4= <>
##$TPNAME5= <>
##$TPNAME6= <>
##$TPNAME7= <>
##$TPOAL= (0..7)
0.5 0.5 0.5 0.5 0.5 0.5 0.5 0.5 
##$TPOFFS= (0..7)
0 0 0 0 0 0 0 0 
##$TUNHIN= 0
##$TUNHOUT= 0
##$TUNXOUT= 0
##$USERA1= <user>
##$USERA2= <user>
##$USERA3= <user>
##$USERA4= <user>
##$USERA5= <user>
##$V9= 5
##$VALIST= <valist>
##$VCLIST= <CCCCCCCCCCCCCCC>
##$VD= 0
##$VDLIST= <DDDDDDDDDDDDDDD>
##$VPLIST= <PPPPPPPPPPPPPPP>
##$VTLIST= <TTTTTTTTTTTTTTT>
##$WBST= 1024
##$WBSW= 4
##$XGAIN= (0..3)
0 0 0 0 
##$XL= 0
##$YL= 0
##$YMAX_a= 280743
##$YMIN_a= -310773
##$ZGOPTNS= <>
##$ZL1= 120
##$ZL2= 120
##$ZL3= 120
##$ZL4= 120
##$ABSF1= 16.522
##$ABSF2= -4.171173
##$ABSG= 5
##$ABSL= 3
##$ALPHA= 0
##$AQORDER= 0
##$ASSFAC= 0
##$ASSFACI= 0
##$ASSFACX= 0
##$ASSWID= 0
##$AUNMP= <proc_1d>
##$AZFE= 0.1
##$AZFW= 0.1
##$BCFW= 0
##$BC_mod= 0
##$BYTORDP= 0
##$COROFFS= 0
##$CY= 12.5
##$DATMOD= 1
##$DC= 0
##$DFILT= <>
##$DTYPP= 0
##$F1P= 14.0000005364418
##$F2P= -0.99999901652339
##$FCOR= 0.5
##$FTSIZE= 32768
##$FT_mod= 6
##$GAMMA= 0
##$GB= 0
##$INTBC= 1
##$INTSCL= 1
##$ISEN= 128
##$LB= 0.3
##$LEV0= 0
##$LPBIN= 0
##$MAXI= 10000
##$MC2= 0
##$MEAN= 0
##$ME_mod= 0
##$MI= 0
##$NCOEF= 0
##$NC_proc= -3
##$NLEV= 6
##$NOISF1= 0
##$NOISF2= 0
##$NSP= 0
##$NTH_PI= 0
##$NZP= 0
##$OFFSET= 16.522
##$PC= 1
##$PHC0= 143.3882
##$PHC1= 8.886997
##$PH_mod= 1
##$PKNL= yes
##$PPARMOD= 0
##$PSCAL= 4
##$PSIGN= 0
##$REVERSE= no
##$SF= 250.13
##$SI= 32768
##$SIGF1= 0
##$SIGF2= 0
##$SINO= 400
##$SIOLD= 32768
##$SREGLST= <1H.DMSO>
##$SSB= 0
##$STSI= 32768
##$STSR= 0
##$SW_p= 5175.98343685301
##$SYMM= 0
##$S_DEV= 0
##$TDeff= 65536
##$TDoff= 0
##$TI= <Analysis number 999999
Compound Code 99
Book Reference 9
Project Code 9>
##$TILT= no
##$TM1= 0
##$TM2= 0
##$TOPLEV= 0
##$USERP1= <user>
##$USERP2= <user>
##$USERP3= <user>
##$USERP4= <user>
##$USERP5= <user>
##$WDW= 1
##$XDIM= 32768
##$YMAX_p= 374913932
##$YMIN_p= -120472
$$ End of Bruker specific parameters
$$ ---------------------------------
##NTUPLES= NMR SPECTRUM
##VAR_NAME=  FREQUENCY,     SPECTRUM/REAL,   SPECTRUM/IMAG
##SYMBOL=    X,             R,               I
##VAR_TYPE=  INDEPENDENT,   DEPENDENT,       DEPENDENT
##VAR_FORM=  AFFN,          ASDF,            ASDF
##VAR_DIM=   32768,         32768,           32768
##UNITS=     HZ,            ARBITRARY UNITS, ARBITRARY UNITS
##FACTOR=    0.157963299565203, 1,           1
##FIRST=     4132.6476996994, 0,             0
##LAST=      -1043.33573715361, 0,           0
##MIN=       -1043.33573715361, -120472,     0
##MAX=       4132.6476996994, 374913932,     0
$$ Real data points
##PAGE= N=1
##DATA TABLE= (X++(R..R)), XYDATA
$$ [...]
14478D9854p682J148n1979j5615p692M296L8360j1497m6647J7990N2482K2587
14466D5605p331j5416k6902L6311L3301L040J4522N060J98l0923k8454j9298j5344
14453e631N335j0168k0977J110j1329j0120K1132J8364K7066n659k2668L632m188
14440a4101l3570j6585Q250j856j824J886J2290K6443j6564k7567k586J339J60
14427f4285L9361J6161p127k3521j575K6954K4826j426L328J4682N221o88R194
14414D1105J0727j7781j0759p313k7050p397Q973j3040M9388K593n092o137k1433
14401c216j027p713j2602p66p836J9017k1663P581o05j0628K0363J9464k2269
14388b1900j2660K703j0399M630J2892l909K6127j2364l7241k2733R438K7591
$$ plain form
14478 49854 42172 43320 -8659 -24274 -31966 -27670 10690 -807 -47454 -29464 23018 45605
14466 45605 38274 22858 -4044 32267 65568 68608 83130 88190 88388 57465 29011 9713 -5631
14453 -5631 -296 -10464 -31441 -30331 -41660 -51780 -30648 -12284 14782 9123 -13545 -9913 -14101
14440 -14101 -47671 -64256 -56006 -57862 -59686 -57800 -45510 -19067 -35631 -63198 -65784 -64445 -64285
14427 -64285 -24924 -8763 -15890 -39411 -40986 -14032 10794 9368 12696 27378 32599 31911 41105
14414 41105 51832 34051 23292 15979 -11071 -18468 -9495 -22535 26853 29446 24354 18217 -3216
14401 -3216 -4243 -11956 -24558 -25324 -33160 -14143 -35806 -28225 -28830 -39458 -19095 369 -21900
14388 -21900 -34560 -31857 -42256 -37626 -24734 -28643 -2516 -14880 -52121 -74854 -65416 -37825
14376c7825N955m481p609J065j2413J5901J2198j2410j090L6672L0547j9711J4283
14363B1082n757l1631k411J0206M970j5934K8578K8250K3928J857J2286k2054
14351E3370m5132j0002P419O886j0212j2008J6200O1099J3481j8986j1875m3771
14339F469k1846K6336J1045J5541k3821p571j2045j1430J727j3384j422k224r661
14326d2286J9176K7070J8676J1286n974l535l8312J5061r757j8365j6723k9850
14314g3533L418L6282M0240J3663j7597q625L705K6097L9821j7484m6615J4553
14302A3925O60j0554K1572m419r966k8839j5627j0680J4644L7225j3148J3549
14290H342J8501J927k0279k041J1677N393r925K0869N720o091j3220k2557j0671
$$ plain form
14376 -37825 -31870 -36351 -43960 -42895 -55308 -39407 -27209 -39619 -40709 -4037 26510 6799 21082
14363 21082 15325 -16306 -18717 -8511 -3541 -19475 9103 37353 61281 63138 75424 53370
14351 53370 8238 -1764 5655 12541 2329 -9679 6521 67620 81101 62115 50240 6469
14339 6469 -15377 10959 22004 37545 13724 6153 -5892 -17322 -15595 -28979 -30401 -32625 -42286
14326 -42286 -23110 3960 22636 33922 27948 24413 -13899 1162 -8595 -26960 -43683 -73533
14314 -73533 -70115 -33833 6407 20070 2473 -6152 -2447 23650 63471 45987 -628 13925
14302 13925 14585 4031 25603 21184 11218 -17621 -33248 -43928 -29284 7941 -5207 8342
14290 8342 26843 28770 8491 6450 18127 23520 13595 34464 40184 34093 20873 -1684 -12355
14277a2355J6490K8980p534j3738J8021j2619k2698k1371L4859K7446p159j3077
14265A5245o436m003K9681o077l6513n7918j5327K9908K2133J777j8072q562K279
14252e1885K7071K6004Q049k863j2274K4181Q835k1374J4836l8063m3472L4959
14240b5996K8908J1637J0832L1539K2397r575l3832j9118J7291K1474K1138j3155
14228F3540o3047J7892J6176j7566l2066j8269K840L204L033L6833M0939n699
14216D7810k0636o310O417J0104j4832l0198j5166n451M4937K0666m8274k8970
14204c9903j4026o85K1249O581K5542K8999J6098m6765P357P769O447O275J2388
14191C7326K856k4964m06Q227j3746n707P203k2306M8783K7783L6147l1141l7470
$$ plain form
14277 -12355 4135 33115 25581 11843 29864 17245 -5453 -26824 8035 35481 28322 15245
14265 15245 8809 4806 34487 28410 -8103 -66021 -81348 -51440 -29307 -27530 -45602 -54164 -51885
14252 -51885 -24814 1190 9239 6376 -5898 18283 27118 5744 20580 -17483 -60955 -25996
14240 -25996 2912 14549 25381 56920 79317 69742 35910 16792 34083 55557 76695 63540
14228 63540 493 18385 34561 16995 -15071 -33340 -30500 -27296 -24263 12570 53509 47810
14216 47810 27174 20864 27281 37385 22553 -7645 -22811 -28262 16675 37341 -10933 -39903
14204 -39903 -53929 -54614 -33365 -26784 -1242 27757 43855 -2910 4447 12216 18663 24938 37326
14191 37326 40182 15218 14812 23039 9293 3586 10789 -11517 37266 65049 101196 70055 32585
14178C2585q490r97L7299r519k8411j1513J1781Q617j8400J6930K3700O547N974
14165F6103k9546j8226j4014q311M906Q222k386K417J271K1256L4121j4760R69
14152E2022j7174p839J3288j0371J9440J4035J8601P158q697k5119n183o061M154
14139D8254L1382N1002Q312j0318r831j1236K5422r866J9220j0121L769M4192
14127A80181K3440m703K1757M2916N4261L2638K7245L2109N2870R6525P3401M9661
14115F82301Q3484R1717J24960P3214Q2859J08257Q4093L9141K0588p069j4460
14104A369085k3789m6579q352p876K1834k4818k0652N9729N9737P0605O9943J02018
14092A620885J61288J40160J88262K08066J85456J56725J11761R4281K1777k0189
$$ plain form
14178 32585 24095 23098 60397 50878 22467 10954 22735 31352 12952 29882 53582 60129 66103
14165 66103 36557 18331 4317 -3994 912 9134 6748 9165 10436 31692 65813 51053 52022
14152 52022 34848 27009 40297 29926 49366 63401 82002 89160 80463 55344 50161 44100 48254
14139 48254 79636 130638 138950 128632 118801 107565 132987 123121 142341 132220 135989 180181
14127 180181 203621 198918 220675 263591 317852 350490 377735 409844 462714 559239 632640 682301
14115 682301 765785 857502 982462 1055676 1138535 1246792 1330885 1370026 1390614 1383545 1369085
14104 1369085 1345296 1298717 1290365 1282489 1304323 1279505 1258853 1318582 1378319 1448924 1518867 1620885
14092 1620885 1782173 1922333 2110595 2318661 2504117 2660842 2772603 2866884 2888661 2868472
14082B868472n9448o9310j19734j45066j23555j51863r8688o8106n4507k6637
14072A951558J00N0804N2227L2897J21057J56071J75837K46290K60003K65048
14062C311892K43733J91062K18060J78518J41859N8343j6656p3834j22451j70188
14052C960338j77299j80980k11586j73574j38240j03143p7294o278Q8467J12898
14042C093309J33472J84015K64299L12901L73660L95715L77473L33109K77161
14033E745114K04642N2812r1014j67979k85297l12884l55013l70465l42678k81756
14023C795482k77008k03506j70577p6221m5262l564R953N1769J40304J63712J66850
14012C551932J80950J74539J91848J67730J14760Q1971k4577j01636j85345k29596
$$ plain form
14082 2868472 2809024 2739714 2619980 2474914 2351359 2199496 2100808 2032702 1978195 1951558
14072 1951558 1951658 2002462 2054689 2087586 2208643 2364714 2540551 2786841 3046844 3311892
14062 3311892 3555625 3746687 3964747 4143265 4285124 4343467 4326811 4252977 4130526 3960338
14052 3960338 3783039 3602059 3390473 3216899 3078659 2975516 2898222 2891944 2980411 3093309
14042 3093309 3226781 3410796 3675095 3987996 4361656 4757371 5134844 5467953 5745114
14033 5745114 5949756 6002568 5911554 5743575 5458278 5145394 4790381 4419916 4077238 3795482
14023 3795482 3518474 3314968 3144391 3068170 3022908 3019344 3029297 3081066 3221370 3385082 3551932
14012 3551932 3732882 3907421 4099269 4266999 4381759 4463730 4439153 4337517 4152172 3922576
14002C922576k15555k51210k45707k67960k62822k09965j37486j25743p0019p4581
13992B061528m8535P543M7158M8977Q9641J11598J44834J69389J82766J43488
13982B958387J08715O5821K6240k4867r8421j67638j81003k14223k31163k17169
13972B024679j49956j36713j37461j19643q7561l4118k9721M391K5717K8581M5476
13961A433671O3407M8927J4842L7907J0309o9172o5959n7786r5429j08072j40834
13950A071811j28695q9187p8549q8208p0009o6122p1369o0350j8207j2587n6259
13939C32269k9320O704L998k9998j6200l9688j0250l9795J507L964l868O783l1423
13926A54683n2883J198L15k0379R064J0312j2294m2543K18J8726J9182j958k8886
$$ plain form
14002 3922576 3707021 3455811 3210104 2942144 2679322 2469357 2331871 2206128 2136109 2061528
13992 2061528 2012993 2020536 2067694 2116671 2206312 2317910 2462744 2632133 2814899 2958387
13982 2958387 3067102 3132923 3159163 3134296 3035875 2868237 2687234 2473011 2241848 2024679
13972 2024679 1874723 1738010 1600549 1480906 1393345 1359227 1329506 1333897 1359614 1388195 1433671
13961 1433671 1497078 1546005 1560847 1598754 1609063 1539891 1473932 1416146 1320717 1212645 1071811
13950 1071811 943116 853929 775380 687172 617163 551041 479672 419322 401115 388528 332269
13939 332269 302949 309653 313651 283653 267453 227765 217515 177720 179227 183191 179323 186106 154683
13926 154683 101800 102998 103313 82934 91998 102310 90016 47473 47691 66417 85599 83641 54755
13913E4755M694o754J4798r110m2117r424L1387J215j7151J0703L1218K0539q244
13900G6509j9045l4583k0042l938J5661k942k491P873M3309J6087n179j2167p624
13887E1428Q7j7961K670n9L529J7970M0962k654k3145N991O194j8757j3616k4308
13873B8331n6288J7647J0025K762q203J0895O340K4350K6120R542l5042l3997
13861B482K1942k67r23K896l2464j9125L1059o15j0943K0345N952m363k2010R184
13847C150O452n928m475J2145K1388j6764J2330k0344K8761r473m4432k6244O1353
13834A7919o067r777J0962o373O669j9823k185o203O223J2678J3886o15k6920
13821i626j1123J0533K519l738O267l5715N190J9132J4689L3495K0673l0345k1400
$$ plain form
13913 54755 59449 52695 67493 58383 16266 6842 38229 39444 22293 32996 64214 84753 76509
13900 76509 57464 22881 2839 -1099 14562 11620 9129 17002 60311 76398 71219 59052 51428
13887 51428 51515 33554 36224 36165 39694 57664 98626 95972 72827 78818 85012 66255 52639 28331
13873 28331 -27957 -10310 -285 2477 -5726 5169 11509 35859 61979 71521 36479 2482
13861 2482 24424 24157 23234 26130 -6334 -25459 5600 4985 -5958 14387 20339 15976 -6034 3150
13847 3150 9602 3674 -801 11344 32732 15968 28298 7954 36715 27242 -17190 -43434 17919
13834 17919 11852 2075 13037 6664 13333 -6490 -8675 -14878 -8655 4023 17909 17294 -9626
13821 -9626 -20749 -10216 -7697 -11435 -5168 -40883 -35693 -16561 -1872 31623 52296 21951 551
13808E51R04M669J0959q468k2330j0037P260L1201N028J4116M038j705r914j1537
13794A4735O862k926j1559j5974j583k531M4835J55k3401j2600m307k5702J5181
13781a8815K8303P846K8175j9141l5647j0940R262n759L9521K6703k1422O464
13769C4550k9649k5684J8162n7K995l467j1532Q329K0575j29O738J4337j0157
13756B5011n84m936m6857n2752K999J3663K7330J5660j0225J461J872j135j98
13743b8691j2317N260L7521P727j3004J4988k0021o0578J6272P275j5734K0099
13731d1203J4828L4515J8533O363k1126J1668K7856j3442l9432N917L483J1351
13719A9311k9789k6229l338J8417K0202J941k5254j5361J7865Q828J5134J9169
$$ plain form
13808 551 1455 6124 17083 8615 -13715 -23752 -16492 14709 19737 33853 37891 36186 26272 14735
13794 14735 21597 18671 7112 -8862 -10445 -12976 31859 32014 8613 -3987 -8294 -33996 -18815
13781 -18815 9488 17334 45509 26368 -9279 -20219 -10957 -16716 22805 49508 28086 34550
13769 34550 4901 -20783 -2621 -2678 317 -3150 -14682 -6353 14222 14093 20831 35168 25011
13756 25011 24427 19491 -27366 -80118 -77119 -63456 -36126 -20466 -30691 -29230 -27358 -28493 -28691
13743 -28691 -41008 -35748 1773 9500 -3504 11484 -8537 -69115 -52843 -45568 -61302 -41203
13731 -41203 -26375 8140 26673 33036 11910 23578 51434 37992 -1440 4477 7960 19311
13719 19311 -10478 -36707 -40045 -21628 -1426 515 -24739 -40100 -22235 -13407 1727 20896
13707B0896J441n154K2108L4163j3231l2884j2939R299j4532j7290k1604K3954
13695e773J5707J0837n603j4493l327R06K6683o44K4578J2376j1005j5288k9962
13682D992p175K2334k916n025p60L896K2371j9687l7175N580J5961M2774q617
13669C6553q360J4976j628j0726j1708L570J8537n5769l7905p100M06K4639M1517
13656G002M041j880R666J366j3077k3507j2880L353K9002L648j6591J3093l00
13643B936k013J3036l571j4526k1871o308K2475J3260K65K5295O168j390O990
13630D0746J2902k2462k2245k7964J1993m226p6M4684m84J2914j0573r318J535
13617B7426J1482k6669L0249K8244j9553k5701K1655j2832n950k1167k0978K1965
$$ plain form
13707 20896 22337 17183 39291 73454 60223 27339 14400 23699 9167 -8123 -29727 -5773
13695 -5773 9934 20771 15168 675 -2652 -1746 24937 24293 48871 61247 50242 34954 4992
13682 4992 -2183 20151 17235 12210 11450 15346 37717 18030 -19145 -13565 2396 45170 36553
13669 36553 28193 43169 41541 30815 19107 22677 41214 -14555 -52460 -59560 -59154 -34515 7002
13656 7002 11043 9163 18829 20195 7118 -16389 -29269 -25916 3086 6734 -9857 3236 2936
13643 2936 923 13959 10388 -4138 -26009 -32317 -9842 3418 3683 28978 35146 33756 40746
13630 40746 53648 31186 8941 -19023 -7030 -11256 -11332 33352 32868 45782 35209 25891 27426
13617 27426 38908 12239 42488 70732 51179 25478 47133 34301 28351 7184 -13794 8171
13605H171J082o985P675k0897K6763k9815k4079j9721P371K1206K7367p702J6044
13592F480j1144p969o249L5083J3984j1342l857j3965M944M435m0452r390M772
13579c4670J9417J3331J5446j7538J3516J9873J8805j2408l4720j8381M6260L7553
13567F6484m1850m7912k1362L1107Q4728L083l7122j0215j1236m9168o887m509
13555d4859J0261K7969N33j4649J8878L1762J5583k192j6858k3652o772R846k544
13542C306K165K5656M262j3635k2807J1558K3664l4130J9896R066K2332k7352
13530B3981P96Q069j2176k0224n344q669Q086J5232k8693O816L0645K2272l8337
13517B454k3369M8620L2804p469k1679n1101k3553J0076L7430K3053l784j0175
$$ plain form
13605 8171 9253 2268 9943 -10954 15809 -14006 -38085 -57806 -50435 -29229 -1862 -9564 6480
13592 6480 -4664 -12633 -18882 16201 30185 18843 14986 1021 5965 10400 -30052 -39442 -34670
13579 -34670 -15253 -1922 13524 -4014 9502 29375 48180 35772 1052 -17329 28931 66484
13567 66484 24634 -23278 -44640 -13533 71195 74278 37156 26941 15705 -33463 -40350 -44859
13555 -44859 -34598 -6629 -6096 -20745 -1867 29895 45478 43286 26428 2776 -3996 5850 3306
13542 3306 5471 31127 35389 21754 -1053 10505 34169 39 19935 29001 51333 23981
13530 23981 24777 32846 20670 446 -4898 -13567 -5481 9751 -18942 -12126 18519 40791 2454
13517 2454 -20915 27705 60509 53040 31361 -19740 -43293 -33217 4213 27266 23482 13307
13505A3307Q956k313R43l73n357q566Q194K2078k5594k3178n976N518J2339P963
13491G941k7421n509j5147j5779K7765j0575L3164L5077J418j7188k9844L0042
13479A3944l7779j5211P763K3861K2427J3737K303j1051k7364k2783K4449K1607
13467A5903j9501N110K0967N644M658N023j5814n8548R028J8136L6914K2304j0559
13454C9265J5223j9851k1792J1691L8017j1996m7280J214P45J9004J3404k1423
13442A6221R623l4772j4439J4326k6459j3547L5837K4015N250l1002p939J0478
13430a2408L554N252j9159j2674k593R27j6979J4541N1577J9142j241P843j2503
13417B5279j9127J339j1582M149j0737j9937r16k9799m848L1764K9893q398q107
$$ plain form
13505 13307 22263 19950 20893 20520 15163 6597 14791 36869 11275 -11903 -17879 -12361 -22 7941
13491 7941 -19480 -24989 -40136 -55915 -28150 -38725 -5561 29516 30934 13746 -16098 13944
13479 13944 -23835 -39046 -31283 -7422 15005 28742 31045 19994 -7370 -30153 -5704 15903
13467 15903 -3598 1512 22479 28123 32781 37804 21990 -36558 -27530 -9394 27520 49824 39265
13454 39265 54488 34637 12845 24536 62553 50557 3277 4491 5236 24240 37644 16221
13442 16221 25844 -8928 -23367 -9041 -35500 -49047 -13210 10805 16055 -14947 -22886 -12408
13430 -12408 -8854 -3602 -22761 -35435 -38028 -37101 -54080 -39539 12038 31180 29939 37782 25279
13417 25279 6152 7491 -4091 58 -10679 -30616 -31532 -61331 -66179 -34415 -4522 -12920 -21027
13404b1027k5902K9128J5084j3182k985o647J549j6456K0641K7218R710q183k0121
13391a1173j6256J6290K2187j072M467P455j8709R402J2430N909O512j0786k1152
13378E504l1550j0352L2519j3306j8675k7604l207j0633J1890K9610L7677k3897
13366b2024k2193K097J1023R878q243p331p134J5202K7501J4249J1586j8137j6270
13353i796o520j7531k3217K3234J9722K6778K369l6167k5991P834Q625R04k6662
13340e6418j9499j067K2345M6776j1118M804J6747j3336K118J3170o367l6002
13328c7847q11J0866M4250r656m3922J0311J0458J0737j2155r354j3436j8388
13316e8947j2789L4351J8033J8840j3068j1922j94J1451j0441j3733J4358K8284
$$ plain form
13404 -21027 -46929 -17801 -2717 -15899 -18884 -25531 -23982 -40438 -19797 7421 17131 8948 -11173
13391 -11173 -27429 -11139 11048 9976 14443 21898 3189 12591 25021 30930 37442 26656 5504
13378 5504 -26046 -36398 -3879 -17185 -35860 -63464 -66671 -77304 -65414 -35804 1873 -22024
13366 -22024 -44217 -42120 -31097 -21219 -29462 -36793 -43927 -28725 -1224 13025 24611 6474 -9796
13353 -9796 -16316 -33847 -57064 -33830 -14108 12670 15039 -21128 -47119 -39285 -30660 -29756 -56418
13340 -56418 -75917 -76984 -54639 -7863 -18981 -14177 2570 -10766 -8648 4522 -1845 -37847
13328 -37847 -38658 -27792 16458 6802 -37120 -26809 -16351 -5614 -17769 -27123 -40559 -58947
13316 -58947 -71736 -37385 -19352 -512 -13580 -25502 -25696 -14245 -24686 -38419 -24061 4223
13304D223n010k3166N330J2835j5532q981r979K0344j549K0217k4997j4629K6370
13291a4524j2186J9877N391m011l236j5649J3036j061L0294J8484j5051l1303
13279i939j1163L021Q889j1739j38Q738O586K4557L769J7664q75k6129n3223L307
13265c6675k3155J2216J2983N201r331R698K1382L9718L3115l0379k3787l6746
13253b5760k0154m843J753L2892K8561O49j013l5864P364L5771j2317j3934R234
13240B339J9281j4884N122O484j5860l9040l614N952k978j4747J8629j201q377
13227d2894L2620M9718n54j8737p350q171j3665j3015o546L6382L209j6208k9408
13214c4619K1752K9248j5573J820J5444m990J0962K824L0178j5607N394k3704
$$ plain form
13304 4223 -787 -23953 -18623 -5788 -21320 -30301 -40280 -19936 -21485 -1268 -26265 -40894 -14524
13291 -14524 -26710 -6833 -1442 -5453 -8689 -24338 -11302 -12363 17931 36415 21364 -9939
13279 -9939 -21102 -18081 -9192 -20931 -21069 -12331 -5745 18812 22581 40245 39370 13241 -39982 -36675
13265 -36675 -59830 -47614 -34631 -29430 -38761 -29063 -7681 32037 65152 34773 10986 -25760
13253 -25760 -45914 -50757 -49004 -16112 12449 13098 12085 -23779 -16415 19356 7039 -6895 2339
13240 2339 21620 6736 11858 18342 2482 -36558 -40172 -34220 -37198 -51945 -33316 -34517 -42894
13227 -42894 -10274 39444 38890 20153 12803 4632 -9033 -22048 -28594 7788 10997 -5211 -34619
13214 -34619 -12867 16381 808 2628 18072 13082 24044 26868 57046 41439 46833 23129
13202B3129k0436l4171l4954k4736K8147K0784j522n20J9110q425j743N1294O044
13189B2001O486J1386R741j2022l9649j253J6048n133o348K431k2013o663J3062
13176a1926J1312J2684m517l4219K1612M0311k5549k1999r529R958J9548K2570
13164C0256P209J8421j8192j7613J2487j4981j1844k566J277k0382j9574r766
13152d5268K1661J698j6948K1880L4055Q628P188M383k3689n3751L605O635k0849
13139e0772L259R679k3019L6602L9068J9971j884k6447k2286J0472l546j979J3239
13126B357j3110o405M8374L9722L68l4645j5508n319K5451j6983j5699p637N611
13113F577k2252J9407L6680J2698j656l4356L340L843j6858L5537J3145J6215
$$ plain form
13202 23129 2693 -31478 -66432 -91168 -63021 -42237 -43759 -44279 -25169 -33594 -35337 15957 22001
13189 22001 28487 39873 49614 37592 -2057 -3310 12738 7605 1257 3688 -18325 -24988 -11926
13176 -11926 -614 12070 7553 -26666 -5054 35257 9708 -12291 -21820 -11862 7686 30256
13164 30256 37465 55886 37694 20081 32568 17587 5743 3177 4454 -15928 -35502 -45268
13152 -45268 -23607 -21909 -38857 -16977 17078 25706 32894 37277 13588 -40163 -36558 -29923 -50772
13139 -50772 -47513 -37834 -60853 -24251 14817 34788 32904 6457 -15829 -5357 -8903 -10882 2357
13126 2357 -10753 -17158 31216 70938 71306 36661 21153 15834 41285 24302 8603 966 6577
13113 6577 -15675 3732 40412 53110 51454 17098 20438 24281 7423 42960 56105 72320
13101G2320L4893j8056m2232k768J6059J3400k0276j4436j717k2052k0103p812
13089a2780q521L7538Q291L853p448l2972n554K1807L5368l2417q394o237k919
13076a0385K5531R538j0807k6904p768m718Q394q373J0625O254q294j2089L5678
13063F682K5357k442j1203k2157J536j717l6836j6494L2117M9055J7341L9268
13051H0507k562j943J8255q144m423l5028Q329l8561k900k050L131n211k667j8199
13037a1466Q688J0936J1100P5892O546l6772l8361l3741L303J5021O106m25k0260
13024c433K4604J2091j0971q716k672j1140r672l8722k2107j9212K11N5406M8301
13011A3968J8586m9292r604J5013P556J3220n51j0184p4j7778K5729L7004j7342
$$ plain form
13101 72320 107213 89157 46925 44157 60216 73616 53340 38904 37187 15135 -4968 -12780
13089 -12780 -21301 16237 24528 28381 20933 -12039 -17593 4214 39582 7165 -1229 -7466 -10385
13076 -10385 15146 24684 13877 -13027 -20795 -25513 -17119 -25492 -14867 -8613 -16907 -28996 6682
13063 6682 32039 29597 18394 -3763 -2227 -3944 -40780 -57274 -25157 23898 41239 80507
13051 80507 77945 76002 94257 86113 81690 46662 54991 16430 13530 11480 14611 9400 6733 -11466
13037 -11466 -2778 8158 19258 95150 101696 64924 26563 -7178 -3875 11146 17252 16827 -3433
13024 -3433 21171 33262 22291 13575 10903 -237 -9909 -48631 -70738 -89950 -89739 -34333 13968
13011 13968 32554 -16738 -26342 -11329 -3773 9447 8896 -1288 -1362 -19140 6589 43593 26251
12998B6251k1973J4148K713K5464j494j1886k3010M200J326k1174J8646L5089
12986D8300k2549R121j607K838K479j8804K435j6103k3944k6708K3321J6386j1182
12973a6017M352J6980J0218J1733R306m876J4566J4278k8706q937M565M2838j4613
12960E5687n7770l730k572J090J6198m851O025J2757r944O988p561K7282N721
12947D5320J7972k586K351j1855P126q793J1717q320j6713P193l676N235K7445
12934G2416K6156n309q930J0106k5512k3810j8229p94j5735k0811L819K5283K80
12921A8930j2357o117k05J6749K6386j3993M571J9511L0243l559j2974j9736p637
12908C9812j7042q081k6576L2955M0478J754r622n169k2386q403L0237J4782k4462
$$ plain form
12998 26251 4278 18426 21139 46603 45109 33223 10213 14413 15739 -5435 13211 48300
12986 48300 25751 34872 33265 36103 38582 19778 22213 6110 -17834 -44542 -21221 -4835 -16017
12973 -16017 -11665 5315 15533 27266 36572 31696 46262 60540 31834 22897 27462 70300 55687
12960 55687 -2083 -5813 -8385 -7295 8903 4052 10077 22834 12890 19878 12317 39599 45320
12947 45320 63292 60706 63057 51202 58328 49535 61252 52932 36219 43412 39736 44971 72416
12934 72416 98572 93263 84333 94439 68927 45117 26888 26094 10359 -10452 -6633 18650 18930
12921 18930 6573 456 251 17000 43386 29393 33964 53475 83718 80159 67185 47449 39812
12908 39812 22770 14689 -11887 21068 61546 63300 53678 48509 26123 17720 47957 62739 38277
12895C8277j5195l8379r460N1841K5799r519j2183J5565j6553l6827q542J9919
12883D743j9773j0734M7052j2429j3079L3261J2696j7424O494N000j0236K9907
12871E5478P247j0640j6285Q836J2009N776l9060r233J3984J6650j8836k3326
12859B600j0647K5241K3677j2525p038j1443o517q576J9525K4117K6226J0091
12847G4731J0984J1092k933M900l6058o958J7645j2152r968n398K0601j0705Q156
12834F3937j8583l2918J0534K1040j296k971O714n396J397l1159K0096Q70j9895
12821A2370k8381J2556K1691L6235n837l023j124j4867P013L9539j7241k3149
12809C5782j3646j8358M684l4344N012q957N18J6968J522l52L395J1492K4057
$$ plain form
12895 38277 23082 -15297 -24757 27084 52883 43364 31181 46746 30193 -6634 -15176 4743
12883 4743 -15030 -25764 21288 8859 -4220 29041 41737 24313 30807 35807 25571 55478
12871 55478 62725 52085 35800 44636 56645 62421 23361 14128 28112 44762 25926 2600
12859 2600 -8047 17194 40871 28346 21308 9865 3348 -5228 14297 38414 64640 74731
12847 74731 85715 96807 93874 98774 62716 55758 73403 61251 51283 45885 66486 55781 63937
12834 63937 45354 12436 22970 44010 42714 39743 46457 41061 42458 11299 31395 32265 12370
12821 12370 -16011 -3455 18236 54471 48634 45611 44487 29620 36633 76172 58931 35782
12809 35782 22136 3778 8462 -25882 -20870 -29827 -29309 -12341 -10819 -11171 -7776 3716 27773
12796B7773K6808j2257j0092k7423j5157N0354J5406l0827P98l219k3545q839
12784a0220J5500L234m2J1516m360j0956J8607K5071r928l5185J65J6216l0365
12771a0747J9540J0232J517J0047J8916l724m024o150R455K908M257r212r450
12758C3565L5201K972j3520m383q314k8910o227m099M1098K4061j1353j7960L186
12745D5317Q165j678M619n7404j6622P122L3194K610j0361L844J8474J3727K1455
12732G2462J6950n932j8557j6953O177j1131m2595k3735J6514J2647R779J8643
12720C4269J0940K8055J197m8565p320o778j2278M208J7428L42K9510K3914r669
12707F5253j8596r760l909k93M1856R283o1141l3985J0388M4052q515L298K9076
$$ plain form
12796 27773 54581 42324 32232 4809 -10348 40006 55412 24585 25383 22164 -1381 -10220
12784 -10220 5280 8514 8472 19988 15628 4672 23279 48350 38422 3237 3402 19618 -10747
12771 -10747 8793 19025 20542 30589 49505 45781 41757 35607 45062 47970 52227 43015 33565
12758 33565 68766 71738 58218 53835 45521 16611 10384 6285 47383 71444 60091 42131 45317
12745 45317 53482 51804 56423 -981 -17603 -10481 22713 25323 14962 18806 37280 51007 72462
12732 72462 89412 83480 64923 47970 54147 43016 421 -23314 -6800 5847 15626 34269
12720 34269 45209 73264 74461 25896 18576 11798 -480 3728 21156 21498 51008 74922 65253
12707 65253 46657 36897 32988 32695 74551 83834 22693 -11292 -904 43148 34633 37931 67007
12694F7007K6066k5661j3114L0978k4619j9314R059J060K3321j440l1065j4970
12682B7308P266J0083n73J5125m285l4816J6503J5803j9620K1309J0095j5904
12670D8294j005k6195r069k1646p45Q170j7998O334L5531J6085k0264q290m652
12657D550j0571J4743K2892J9087J8610M468k96r646P861J2376j1222J5627J8235
12644A06714k5139n3793l3096L6827L2734n72k240j5245K1332J6427N517K912
12632I2378m030L55r836O546J1909k498k868o044O719j8615m32K5708K0649J024
12618A20965j7360J4217q313J7130J1362j2076k6277K3772M7160l7140m2125m324
12606H6991k5367J6478J8337k5388p941K6280l1491K8511K300j1535j1925l579
$$ plain form
12694 67007 93073 67412 54298 85276 60657 41343 50402 51462 74783 73343 42278 27308
12682 27308 34574 44657 44084 59209 54924 20108 36611 52414 32794 54103 64198 48294
12670 48294 47289 21094 12025 -9621 -10366 -2196 -20194 -13860 21671 37756 17492 9202 4550
12657 4550 -6021 8722 31614 50701 69311 73779 73483 63837 71698 84074 72852 88479 106714
12644 106714 81575 27782 -5314 31513 64247 63675 61435 46190 67522 83949 89466 92378
12632 92378 88348 88703 78867 85413 97322 94824 91956 85912 92631 74016 73584 99292 119941 120965
12618 120965 103605 117822 109509 126639 138001 125925 99648 123420 170580 133440 91315 86991
12606 86991 61624 78102 96439 71051 63110 89390 57899 86410 88710 77175 65250 61671
12594F1671j0722k6050O596K1767K270O879K0586j4551j0716q302J7751J3213
12582H0392K2023J0938J8940L5407J0259k7420k646J8556j6028m9443o988J4840
12570A08830J3223p651k1497J3135L5049Q289J3008o242m034J8140J1195M2346
12558B23791J2948j9130J5376L3187J0847K2285N204L355M2229L9853O691j427
12546C95209L986N7066M7666J2120L8444N6169M4480O3949O3112O9448R7527J34444
12534A083620J32015J23502J63809K05653J95327K49860K61843K80697K73632
12525B969958K65492K51631K35450K10075J95141J12006M7758j67n1699p6848
12515D158797j25717j77152j52727j33838j25775j23403q8739k632Q1491N6835
$$ plain form
12594 61671 50949 24899 31495 53262 55532 62411 82997 68446 57730 49428 67179 80392
12582 80392 102415 113353 132293 167700 177959 150539 147893 166449 150421 100978 93990 108830
12570 108830 122053 114402 92905 106040 141089 149378 162386 156144 152110 170250 181445 223791
12558 223791 236739 217609 232985 266172 277019 299304 304508 307863 350092 389945 396636 395209
12546 395209 399195 456261 503927 516047 554491 610660 655140 719089 782201 851649 949176 1083620
12534 1083620 1215635 1339137 1502946 1708599 1903926 2153786 2415629 2696326 2969958
12525 2969958 3235450 3487081 3722531 3932606 4127747 4239753 4287511 4287344 4235645 4158797
12515 4158797 4033080 3855928 3703201 3569363 3443588 3320185 3231446 3228814 3310305 3367140
12505C367140J45674K28075K44766K71418L52854L62949L40212K93976L20235
12496E927299L17248K58682J94495J41973N1501O0019L0840k6969p9901q4247
12486F790940j03406j19752j29195r6389j60441j33893j07478j67490j58821j51552
12476E462523k26560k43292k61370k86226k65707k45323j68069n3860K1026L2746
12466C765888L6451J07328J76400K00187J94461J73708J65550J48070J40470J17790
12456E226303Q6707O4452L0599l350q0179j15823j47544j16787j27144o3611j2422
12445D741201n462L8157J31368J96503K04901K14313J58585J41615J35307R5003
12435F051491M4469j9901l0559p3884j37930j62869k08374k09486k00758k06784
$$ plain form
12505 3367140 3512814 3740889 3985655 4257073 4609927 4972876 5313088 5607064 5927299
12496 5927299 6244547 6503229 6697724 6839697 6891198 6951217 6982057 6955088 6875187 6790940
12486 6790940 6687534 6567782 6438587 6342198 6181757 6047864 5940386 5772896 5614075 5462523
12476 5462523 5235963 4992671 4731301 4445075 4179368 3934045 3765976 3712116 3733142 3765888
12466 3765888 3802339 3909667 4086067 4286254 4480715 4654423 4819973 4968043 5108513 5226303
12456 5226303 5313010 5377462 5408061 5404711 5324532 5208709 5061165 4944378 4817234 4753623 4741201
12445 4741201 4735739 4773896 4905264 5101767 5306668 5520981 5679566 5821181 5956488 6051491
12435 6051491 6095960 6076059 6045500 5971616 5833686 5670817 5462443 5252957 5052199 4845415
12425D845415j97035j29567o9723q017N6419J29562K02696K70225L30955L37594
12415E768524L44292K95642K79993K85576K34336J92685J63079J51901J90775
12406G906803J66680J40695J42320J54251J24980O9103k3863o5520r2778j37888
12396H384783j88209k55805k87788l67948l85551l70845m13760m34782l69350
12387E310745k97892k89822k32056j40237o6309j4121K9497J07600J74329J67867
12377D749601J87036K22177J79270J66847J14976M7574q447o0685j23475k15501
12367E259373k65321k94742l24439l45658l46158l44920l40168l37598k93416
12358B366953k65867k28492k22157j84565j76939j58696p0316l1896p3262q1715
$$ plain form
12425 4845415 4648380 4518813 4449090 4441073 4497492 4627054 4829750 5099975 5430930 5768524
12415 5768524 6112816 6408458 6688451 6974027 7208363 7401048 7564127 7716028 7906803
12406 7906803 8073483 8214178 8356498 8510749 8635729 8704832 8680969 8615449 8522671 8384783
12396 8384783 8196574 7940769 7652981 7285033 6899482 6528637 6114877 5680095 5310745
12387 5310745 5012853 4723031 4490975 4350738 4284429 4270308 4299805 4407405 4581734 4749601
12377 4749601 4936637 5158814 5338084 5504931 5619907 5667481 5659034 5598349 5474874 5259373
12367 5259373 4994052 4699310 4374871 4029213 3683055 3338135 2997967 2660369 2366953
12358 2366953 2101086 1872594 1650437 1465872 1288933 1130237 1059921 1028025 954763 873048
12348H73048q4006l8364j6988l7606p3378n6317j6246k4561k7606m5962j1821
12337D40193Q238p51M77l7117n1038o4887k5535R463N342j9354J0658p177Q910
12324B77422K2957j0592l2214m0564N027K9982K8482j9191l425j6927n606J6529
12312B51880j3834m1319Q931m103k1814j422L984K298N00P824P049J2979J1449
12299B24402l4901l5338n068j7837l648L6014J240m1570k175j9560j0328L5371
12287A26602j511J5698J7797j5969q909j9526k2373l19N143J2637L4746J2666
12275A56682M8K0430l755n573p535m299l5884q296L0836l265L695l119j1189k7430
12261A01346K654J5267j0784k6877O576j1576J0518J1243Q053N672j8920M472
$$ plain form
12348 873048 789042 750678 733690 696084 622706 566389 550143 525582 497976 452014 440193
12337 440193 448431 447680 448157 411040 360002 295115 269580 279043 284385 265031 275689 268512 277422
12324 277422 300379 289787 257573 217009 222036 252018 280500 261309 257884 240957 235351 251880
12312 251880 238046 196727 205658 201555 179741 178319 182303 184601 185101 192925 199974 212953 224402
12299 224402 189501 154163 149095 131258 127610 163624 164864 123294 121119 101559 91231 126602
12287 126602 125091 140789 158586 142617 133708 114182 91809 91490 96633 109270 144016 156682
12275 156682 156730 177160 173405 167832 160297 155998 120114 111818 142654 139389 143084 139965 128776 101346
12261 101346 104000 119267 108483 81606 88182 76606 87124 98367 106420 112092 93172 97644
12249I7644L5777j0781l1431l6273K039L7146K4397K606L8142J4177l880j8306
12237A51257k0211j9708l740k1642K8442k8722j0662M3279R427j8385k36n579
12225A03520k1514l893P409j1285K5082j3349k3025l00M34J2933M1329J2818N578
12212A35737N99r643J5333l0957j6951j793P528K6723J8487L775l485N913P340
12199A58606l897J5921R375j8499J4089J238j2592J456M0183M47l305k4531l4389
12186A44102l0944j009J7458K7385K5519J6484O024k286N510J0184k464K0794
12174B36757K0469l7985k2817k4060k891K1318L5053j8353L2777K6159K134O016
12162B74577l2088l7485j8504L3912J0796r070l5770r860j2307K8827L8170n4491
$$ plain form
12249 97644 133421 122640 91209 54936 56975 94121 118518 121124 159266 173443 169563 151257
12237 151257 131046 111338 107598 85956 114398 85676 75014 118293 127720 109335 109099 103520
12225 103520 82006 78113 85522 74237 99319 85970 62945 62645 63079 76012 117341 130159 135737
12212 135737 136336 126693 142026 111069 94118 92325 99853 126576 145063 148838 145353 151266 158606
12199 158606 154709 170630 180005 161506 175595 176833 164241 165697 205880 206327 203022 178491 144102
12186 144102 113158 112149 129607 156992 182511 198995 205019 202733 208243 218427 215963 236757
12174 236757 257226 219241 196424 172364 169473 190791 225844 207491 240268 266427 268561 274577
12162 274577 242489 205004 186500 220412 231208 222138 186368 176508 164201 193028 231198 176707
12150A76707j9052L340l327N3479R406k5923J570J1142j1904k0276j3871N322
12138A66613K2049R271j1695M551N349l385L5086K1228L1165P426m5268l4496
12126B07894K512L1077p080l632M29j231p571M735P514m712M1198L6489o573l0529
12112B70520j0339J9001K2339j1338K0212J8212k2677j1434K5861Q09o469l92
12100C14305j4084R72J7170K7142k8131J3319O039J0017Q035K2847l7872j3755
12088C26004M568K4213J8255r332j5470n373J9949k8436o239L541R045R623j5166
12075C35182p94J0692O1935M4528p357j1251n416K1623k519j6838k6947J5152
12063D17990L4814L9915J4164j0513k2651J6635J7190M43j0672K8793K2954K782
$$ plain form
12150 176707 157655 160995 157668 211147 220553 194630 196200 207342 195438 175162 161291 166613
12138 166613 188662 197933 186238 190789 196138 192753 227839 249067 280232 287658 242390 207894
12126 207894 210406 241483 234403 230771 231200 229969 222398 227133 234647 229935 271133 307622 301049 270520
12112 270520 260181 279182 301521 290183 310395 328607 305930 294496 320357 321166 314697 314305
12100 314305 300221 301193 318363 345505 317374 330693 336732 346749 354784 377631 339759 326004
12088 326004 330572 354785 373040 363708 348238 342865 362814 334378 328139 331680 340725 350348 335182
12075 335182 334388 345080 407015 451543 444186 432935 427519 449142 446623 429785 402838 417990
12063 417990 452804 492719 506883 496370 473719 490354 507544 507987 497315 526108 549062 551844
12051E51844j1721j609K648m797P300n631K4586N675J2374K8045M0773J0060L550
12038F63097l534N653j9046l5908k6131P393K3253M2265P4168n419O570J0422
12026G42783n538J9616M908J8327R325K762o442j916J0425J5022J5221J6660j4523
12013H26630R363K9779K9013J2430K2568K1357K6620J8685J0575q425L9612J6401
12001A054608K9419K9558M9671J1312K0530M4882L7374N4525J4548j1055J8850
11990A354222N1394N3104J5514N797J7002L8128M4793M6139N9959L9203M2590
11979A767845L7832N5221N1793M1046L3486N8724O6601M5709Q8538O3103N4811
11968B364709P0175P6563M8949M9822Q2803J17962J15636R0129R1352J12024J10836
$$ plain form
12051 551844 540123 538514 541162 536365 543665 538034 562620 568295 580669 608714 649487 659547 663097
12038 663097 659563 665216 646170 610262 584131 591524 614777 657042 731210 725791 732361 742783
12026 742783 737245 756861 761769 780096 789421 792183 785741 783825 794250 809272 824493 841153 826630
12013 826630 835993 865772 894785 907215 929783 951140 977760 996445 1007020 998595 1038207 1054608
12001 1054608 1084027 1113585 1163256 1174568 1195098 1239980 1277354 1331879 1346427 1335372 1354222
11990 1354222 1405616 1458720 1474234 1480031 1497033 1535161 1579954 1626093 1686052 1725255 1767845
11979 1767845 1805677 1860898 1912691 1953737 1987223 2045947 2112548 2158257 2246795 2309898 2364709
11968 2364709 2434884 2511447 2560396 2610218 2693021 2810983 2926619 3016748 3108100 3220124 3330960
11957C330960J09935J20206J16206J55960J39815J08051J56144J63507J58488
11948D559272J77019J80141K08835J99068K35908K42250K54805K89689K77493
11939F624480K89018K91158K90705L37815L72055L65240M09074M22193M56605
11930I858343M53388M00074M84100N10148N10933N39392N93190N37396N38466
11921A4425430N60409N63229N41401N43739N33340M92004M45839L64662K95516
11912A8765569K38596J77306R9483J3568r003o9622j68978k57794l04837l52137
11902A8132151l95040m38853m80018n42806n64198n57042n42385n59281n47106
11893A3505422n50236n26329n06134n05417m66394m84544m65986l95860l95608
$$ plain form
11957 3330960 3440895 3561101 3677307 3833267 3973082 4081133 4237277 4400784 4559272
11948 4559272 4736291 4916432 5125267 5324335 5560243 5802493 6057298 6346987 6624480
11939 6624480 6913498 7204656 7495361 7833176 8205231 8570471 8979545 9401738 9858343
11930 9858343 10311731 10711805 11195905 11706053 12216986 12756378 13349568 13886964 14425430
11921 14425430 14985839 15549068 16090469 16634208 17167548 17659552 18105391 18470053 18765569
11912 18765569 19004165 19181471 19280954 19294522 19285519 19215897 19046919 18789125 18484288 18132151
11902 18132151 17737111 17298258 16818240 16275434 15711236 15154194 14611809 14052528 13505422
11893 13505422 12955186 12428857 11922723 11417306 10950912 10466368 10000382 9604522 9208914
11884I208914m34516l66265l25949l38817l25023l01871k87323k54224k80893
11875F294033k45864k21874k24851j98290k11288k13152j67469j81530j85524
11866D444191j46822j54623j54928j22323r8262r4179r5138j22222r5836j07522
11856C252336j04223j01754o7363p1029p3922r4924p2111q1671q6638q5194o0086
11845B353421m6157q0134l9382m6108m6393l1590n5392m3681k1138m6261l5866
11834A861319l8011l8684o4181m7096l0375J0010k890m0279m0421m8244l6105
11823A485043m2765o4555K791K0190j7003l0001j6671l1572j7620J3292j8354
11812A282775l42k1569n3858l1518k4356l557j2249P700k7367k3561p672K6232
$$ plain form
11884 9208914 8774398 8408133 8082184 7743367 7418344 7116473 6829150 6574926 6294033
11875 6294033 6048169 5826295 5601444 5403154 5191866 4978714 4811245 4629715 4444191
11866 4444191 4297369 4142746 3987818 3865495 3767233 3673054 3577916 3455694 3359858 3252336
11856 3252336 3148113 3046359 2978996 2907967 2834045 2739121 2667010 2585339 2498701 2413507 2353421
11845 2353421 2307264 2227130 2187748 2141640 2095247 2063657 2008265 1964584 1943446 1897185 1861319
11834 1861319 1823308 1784624 1720443 1673347 1642972 1652982 1650092 1609813 1569392 1521148 1485043
11823 1485043 1442278 1377723 1380514 1400704 1383701 1353700 1337029 1305457 1287837 1301129 1282775
11812 1282775 1282433 1260864 1207006 1175488 1151132 1147575 1135326 1143026 1115659 1092098 1084426 1110658
11800A110658L1562m285O595L0530l827k4360j8680P201Q035k6212k7558R503
11788A099162L1206J1616k2668n532K0524J74K9445M914K9014L7290K2276o978
11776A250443k6398N2138O6868O6821J9859K0331o707K4891M9803N3413J06423
11765A677885Q9369Q2068P3760Q5836P5288J09081J14745R9753J13836J45926
11755B667547J64141J82698J70099J61699J30229J54577J63466J59440J10709
11746D064605J18388J06983Q5153R9677P7531Q6084K8205K2377J3496j868K6361
11735D726992L9316K4986N5757N0761N2420M2558L2789N4791N6125N2051J9316
11724E207862K2960J768N219l8433j07651j54758r7717j02981r2106j10151j40024
$$ plain form
11800 1110658 1142220 1137935 1144530 1175060 1171233 1146873 1128193 1135394 1143429 1117217 1089659 1099162
11788 1099162 1130368 1141984 1119316 1113784 1134308 1134482 1163927 1168841 1197855 1235145 1257421 1250443
11776 1250443 1224045 1276183 1343051 1409872 1429731 1450062 1443355 1468246 1518049 1571462 1677885
11765 1677885 1767254 1849322 1923082 2008918 2084206 2193287 2308032 2407785 2521621 2667547
11755 2667547 2831688 3014386 3184485 3346184 3476413 3630990 3794456 3953896 4064605
11746 4064605 4182993 4289976 4375129 4474806 4552337 4638421 4666626 4689003 4702499 4700631 4726992
11735 4726992 4766308 4791294 4847051 4897812 4950232 4992790 5025579 5080370 5136495 5188546 5207862
11724 5207862 5230822 5232590 5237809 5199376 5091725 4936967 4839250 4736269 4644163 4534012 4393988
11713D393988j03888j12881j12642r8037q5062q2877p5789m7718N959p264k5425
11702C648364J3844O4458Q4974J02873P6401J44522J50475J40819J11461J57614
11692D695805J74179J69527J47401J05410J25316J17658Q9825O5079P1394L0410
11682E792004K5928N7036K5423O141K3249M7669J3704Q1870J03486J11888J33515
11671F421913J36775J61125J47022J04846J11453J01052J09609R5274N8506q565
11661G439010m1643m5473o7285j38805j15734j33023j39822j94404j69798j71189
11651F221834j53141j85383j56167r1288j11406j06839l7476l4612n6170m9776
11641E239576o0791q6997q2814n2467o3854j09712j33186j06289r3952j17342
$$ plain form
11713 4393988 4290100 4177219 4064577 3966540 3881478 3798601 3722812 3675094 3681053 3673789 3648364
11702 3648364 3662208 3726666 3811640 3914513 3990914 4135436 4285911 4426730 4538191 4695805
11692 4695805 4869984 5039511 5186912 5292322 5417638 5535296 5625121 5690200 5761594 5792004
11682 5792004 5817932 5874968 5900391 5906532 5929781 5977450 5991154 6073024 6176510 6288398 6421913
11671 6421913 6558688 6719813 6866835 6971681 7083134 7184186 7293795 7389069 7447575 7439010
11661 7439010 7397367 7351894 7284609 7145804 7030070 6897047 6757225 6562821 6393023 6221834
11651 6221834 6068693 5883310 5727143 5635855 5524449 5417610 5380134 5345522 5289352 5239576
11641 5239576 5178785 5091788 5008974 4956507 4892653 4782941 4649755 4543466 4449514 4332172
11631D332172j67209j31026j25945j25313j09635j03398j21238j15865p0621n4150
11621C207772k2789k8574m4180l2001L4014M7050L9855J0499K9628J10972J26233
11610C478479Q3197Q7284J29002J06954R1200R9898J10075R3266O6665K7764L2916
11599D406700K6935L970o4902n1888j8969n8418q6161o9318l7320k5099p0320
11588C955210k0938n350j3058M49l065o914l6328j8488m4628p9417q5431n0927
11576C591115j02713j32901j40763j33702j47045j48848j48311j50333j45163
11567B341336j40483j54867j25570j19455r3555n4578r7572r1759p5373j01441
11557A286683q9915m6243o8561p8746k8544Q855M254k2676o0698k3207m7336o3061
$$ plain form
11631 4332172 4164963 4033937 3907992 3782679 3673044 3569646 3448408 3332543 3261922 3207772
11621 3207772 3184983 3156409 3112229 3080228 3114242 3161292 3201147 3211646 3241274 3352246 3478479
11610 3478479 3561676 3648960 3777962 3884916 3976116 4076014 4186089 4279355 4346020 4373784 4406700
11599 4406700 4433635 4437605 4372703 4320815 4301846 4243428 4157267 4087949 4050629 4025530 3955210
11588 3955210 3934272 3928922 3915864 3916313 3913248 3906334 3870006 3851518 3806890 3727473 3642042 3591115
11576 3591115 3488402 3355501 3214738 3081036 2933991 2785143 2636832 2486499 2341336
11567 2341336 2200853 2045986 1920416 1800961 1707406 1652828 1555256 1463497 1388124 1286683
11557 1286683 1196768 1150525 1081964 1003218 974674 983529 987783 965107 904409 881202 833866 770805
11545G70805k0045j6649j9180p902m0028k0928j0019m6188k0908p524m355l2461
11533E24618p781k1335m9911J5068r427j4624m882n122j2995J2819N295o261P247
11520D32709j9676m7031j5713J5014K5068j2193o7778k6658K884P318R048k5731
11508B77261p556M022j9361J248k1126k6857q93K8657K1362k8661k4619L1150
11496B34627j1053j5585j645K5667r453k1930k738N534j9826k1799J1195k3768
11484A49226r339L617m4120m333M3606N9650J3065k7782k2700J2401P125P292
11472A87708J0617p1r68J8195l6886r487q831j0014J4248K9588j0985k0044q299
11459A54771p818p228K8040O180k5389l0677R608o580j3666J2625P325j5946l3578
$$ plain form
11545 770805 750760 734111 714931 707029 667001 646073 636054 589866 568958 561434 557079 524618
11533 524618 516837 495502 445591 460659 451232 436608 431726 426604 413609 426428 431723 425462 432709
11520 432709 413033 366002 350289 365303 390371 378178 310400 283742 286626 293944 302992 277261
11508 277261 269705 273727 254366 255614 234488 207631 206738 235395 256757 228096 203477 234627
11496 234627 223574 207989 206344 232011 222558 200628 197890 203424 183598 161799 172994 149226
11484 149226 139887 143504 99384 95051 138657 198307 211372 183590 160890 173291 180416 187708
11472 187708 198325 198254 197286 215481 178595 169108 160277 150263 164511 194099 183114 163070 154771
11459 154771 146953 139725 167765 173945 148556 117879 127487 120907 107241 119866 127191 111245 77667
11446G7667n740L4309K1374o063k636P231N264j3778m0508j0918M2281K2815J6781
11433A48079J2528p196j9349m9943n849j2023N019K1349L4006j9006l7860J4511
11421H4266J3154J9078J7015j7416j1557j3224K5079j7667k1429K0073N22j7009
11409H0885j9886o597J4971m950k350J2307j0588J1161J7610k0059j1742j093
11397E9669j3719K8013J8196J2603k0424k1376N753K9401L470m2549J0449J3880
11385H3366J0571j7268O574j0053k470J2904m103J2990k4071J601J057M22m439
11372F7081j444m533L2819K7385N624M026l6194j476j983M355k1977j2702k0727
11359D0254K044N700J241N773O047R048j1666j9942k8619j227l417J4354J3012
$$ plain form
11446 77667 71927 106236 127610 121547 118911 126142 131406 117628 77120 66202 108483 131298 148079
11433 148079 160607 153411 134062 84119 78270 66247 71266 92615 126621 107615 69755 84266
11421 84266 97420 116498 133513 116097 104540 91316 116395 98728 77299 97372 97894 80885
11409 80885 60999 54402 69373 64423 62073 74380 63792 74953 92563 72504 60762 59669
11397 59669 45950 73963 92159 104762 84338 62962 68715 98116 101586 59037 69486 83366
11385 83366 93937 76669 83243 73190 70720 83624 79521 92511 68440 70041 71098 71520 67081
11372 67081 65637 61104 93923 121308 126932 130958 94764 93288 91305 95660 73683 60981 40254
11359 40254 42298 47998 49239 55012 61059 70107 58441 38499 9880 8653 5236 19590 32602
11346C2602N658L1715J7233j9873j5794k5325K735J7333j1343P644K4217J109
11334F7911k3624l3687m3357M6790N0018R747k1409m8877K9352K6781m287L193
11322E8551L2518j1548j2888K167N089j0955k1202p518J8560N634o859J6757M849
11309G3155l921p052j7733O853K28j0972k9243j4317K894J0304K3050J5777l0866
11296A8157j1678R983j0257L5081K8394O929m8410j5931J3032J741J8755J2715
11284E8511j8557j2358j4579j386O843R886j2870J4982p682l736j3665j9517M0927
11271B6799L128k2175J1245n861k2571m255M452l771K016J2192K9621K1833J169
11258E3822L494k7148M467K6747m581P072j2706J4129j7367n5552r376J1044J6368
$$ plain form
11346 32602 38260 69975 87208 67335 51541 26216 28951 46284 34941 42585 66802 67911
11334 67911 44287 10600 -32757 14033 64051 73798 52389 3512 32864 59645 55358 58551
11322 58551 91069 79521 66633 68800 73889 62934 41732 34214 52774 58408 51549 68306 73155
11309 73155 69234 62182 44449 51302 51530 40558 11315 -3002 -108 10196 33246 49023 18157
11296 18157 6479 16462 6205 41286 69680 76609 28199 12268 25300 27041 45796 58511
11284 58511 39954 27596 13017 11631 18474 28360 15490 30472 22790 19054 5389 -14128 26799
11271 26799 29927 7752 18997 13136 -9435 -13690 -9238 -13009 -10993 1199 30820 52653 53822
11258 53822 57316 30168 34635 61382 56801 63873 51167 65296 47929 -7623 -16999 -5955 10413
11245A0413j0629J0167L2852L7177m0068k1488p22Q547q813L5225K4710m9509
11233B7862j7343L1971J9988R815j6175p707j2803N582J1684k200j864j4291K435
11220C6954K2699J4165n383J7307n1431r847J4970J1000k0676K0587j4082L716
11208C9979K9146J012J2894N229l0977K6826M2988l5414k1051L5154R283q62k5079
11195H9128l2005k0621J2123l1430j0497L047J3867J0015K2953j531j97j8954
11183C5898j0425j3639j0492N641j942K2384J6853j735m133o640Q290r912j3124
11170A7024J6858K2148j6385K014j7912k2019j3434J6592K6409j2346J9474j4622
11158B3801j2202l222L0517J6112k6062j284N011J7512R099K104J2644j2078J0623
$$ plain form
11245 10413 -216 9951 42803 79980 39912 18424 17702 26249 17436 52661 77371 27862
11233 27862 10519 42490 62478 72293 56118 48411 35608 41190 52874 50674 48810 34519 36954
11220 36954 59653 73818 68435 85742 34311 24464 39434 50434 29758 50345 36263 39979
11208 39979 69125 70137 83031 88260 57283 84109 127097 91683 70632 105786 115069 114207 89128
11195 89128 57123 36502 48625 17195 6698 9745 23612 33627 56580 55049 54852 35898
11183 35898 25473 11834 1342 6983 5041 27425 44278 42543 38410 31770 40060 30148 17024
11170 17024 33882 56030 39645 41659 23747 1728 -11706 4886 31295 18949 38423 23801
11158 23801 11599 8377 38894 55006 28944 27660 32671 50183 59282 61386 74030 61952 72575
11145G2575m380l1262l0601J1536K2889j630k5574J3483q564m147K4889n465J678
11132C5427j7768m817k9840q022M1515j8708k392r261k4304L5880M9543J0933
11120E8186k4132j0278L1688K6933m447m5460j7084l3541l8723N1671K5898J4609
11108C5320J1930p532q31j8503R322k3502k7159j6016L7536P307j7350j5385j4659
11095c9522J5169k262L8737J5294r387J9184n850k7968j8808M322j1867J8336
11083d622K6107J6836J4534l4657r320L1633J1948l0635k1168j4216j0228q954
11071c2742K8407r984k0333j8573L3548L8821m551n689j0383n884o995J0228K1137
11058A7007J7945K9312j6442k9674K665L4373L2187K1685l396Q194K6539K8641
$$ plain form
11145 72575 68195 36933 6332 17868 40757 39127 13553 27036 18472 14325 39214 33749 35427
11132 35427 17659 12842 -16998 -25020 16495 -2213 -4605 -13866 -38170 -2290 47253 58186
11120 58186 34054 23776 55464 82397 77950 32490 15406 -18135 -56858 -5187 20711 35320
11108 35320 47250 39718 38887 20384 29706 6204 -20955 -36971 565 7872 -9478 -24863 -39522
11095 -39522 -24353 -26615 12122 27416 18029 37213 31363 3395 -15413 -11091 -22958 -4622
11083 -4622 21485 38321 52855 18198 8878 40511 52459 21824 656 -13560 -23788 -32742
11071 -32742 -4335 -14319 -34652 -53225 -19677 19144 14593 8904 -1479 -7363 -14358 -4130 17007
11058 17007 34952 64264 47822 18148 20813 55186 87373 109058 105662 113856 140395 169036
11046A69036j3236j9091q519r947l0977J3942L2705K9229M7640L3482M9257M4243
11034C37764R872m5719n6883j1715m45l799K1406O645K8246M9808K7669K8624
11022C91473k1887m0647k0128m9100o4024K881K0953k9961J2953L5975M5715j9500
11010B64703k3015l958l2539n3913k2185P986Q741O919L0462P151M51j6352n8842
10997A15609l7065p9487L38K0805R208J252m3066r529j5150j5111L1886l285j7741
10984d1336o463J8757j530N047Q300K4934J5920l8368j9801k0617j4238M6775
10972b2620L1565l7099K0463K7478k6777m4675J0497j390l843K5299L3655P587
10960B0140k2207j2608k4422j3911K72K3552J2758Q969N396M415J1518r808k947
$$ plain form
11046 169036 155800 136709 128190 118243 87266 101208 133913 163142 210782 244264 293521 337764
11034 337764 347636 301917 245034 233319 232874 229075 250481 257126 285372 335180 362849 391473
11022 391473 369586 328939 308811 259711 195687 198568 219521 189560 202513 238488 284203 264703
11010 264703 241688 237730 205191 151278 129093 137079 145820 152739 183201 190352 190803 174451 115609
10997 115609 78544 -943 -605 20200 29408 30660 -12406 -21935 -37085 -52196 -20310 -23595 -41336
10984 -41336 -47799 -29042 -30572 -25525 -17225 7709 23629 -14739 -34540 -55157 -69395 -22620
10972 -22620 8945 -28154 -7691 19787 -6990 -51665 -41168 -42558 -46401 -21102 12553 20140
10960 20140 -2067 -14675 -39097 -53008 -52736 -29184 -16426 -7457 -2061 2354 13872 4064 1117
10947A117J9573j7361J9854L338P48K4844j7958j5931l5440J736L004j1808R096
10934a5188M285k8252k802L0565j2055k1305J9591R570n58j3396J8940N0489m344
10921C5540m3007K507j5050q0N2605p541k6266l5077j4307L4375l025J4146J1554
10908F374Q050Q383N703k7685k5885l978M4909M3540R245k9828m5354p108K806
10895a0828N60K9284N4193l928m3348l4753l9520J358j3495K4040K5200M146J65
10882f926o249M958r609j4611Q795J6118O734J8737j8078K727k6944O023N600
10869a2725M8445j9320q283J9307M6516J2416k9909n498J6499o818k7725R198
10857D2103L4205n953l6907k3851K838q250p641M7268M534N412k4262k6416J4000
$$ plain form
10947 1117 20690 3329 23183 26521 27269 52113 34155 18224 -17216 -15480 -12476 -24284 -15188
10934 -15188 -10903 -39155 -41957 -11392 -23447 -44752 -25161 -15591 -16149 -29545 -10605 39884 35540
10921 35540 -7467 -4960 -20010 -20090 32515 24974 -1292 -36369 -50676 -16301 -19326 -5180 6374
10908 6374 14424 22807 28510 825 -25060 -29038 15871 59411 68656 38828 -6526 -13634 -10828
10895 -10828 -10268 19016 73209 69281 25933 -8820 -48340 -46982 -60477 -36437 -11237 -7091 -6926
10882 -6926 -13175 -8217 -17826 -32437 -23642 -7524 -790 17947 -131 2596 -24348 -18325 -12725
10869 -12725 35720 16400 8117 27424 73940 86356 56447 50949 67448 60630 32905 42103
10857 42103 76308 70355 33448 9597 12435 4185 -3456 43812 48346 53758 29496 3080 17080
10844A7080M816n251L2172k0832k6676K2042O367q795r489J3683J0234q533m576
10831B2242l9731l1716K8003K2235j6315P017N9173L0751k4495k0232J8547k0240
10819C5239j3360K337R358k6524R746K3739q658k327P412q632m1483k8769k499
10806d4421Q572K0105J912j0205R320L920J2930K9157l4432n23j7063O589N7219
10793D3080K1702m45n2897j5030j0450O568m483J3969K7996j5683J936J449j2205
10780E507K4652m839J9697j294J0911n0071j3877N0376M4094j2071J9216l365
10768H8936M400n132L626l248N725o507j7492J0265L772M378k1422k7833j6643
10755B2825l2304L363K6870K1861k8477j4867R925L4220J1550k7069P8J7912K3350
$$ plain form
10844 17080 21896 16645 48817 27985 1309 23351 29718 20923 11434 25117 35351 26818 22242
10831 22242 -17489 -49205 -21202 1033 -15282 -8265 50908 81659 57164 36932 55479 35239
10819 35239 21879 24216 33574 7050 16796 40535 31877 29550 36962 28330 -13153 -41922 -44421
10806 -44421 -35849 -15744 -13832 -24037 -14717 -10797 2133 31290 -3142 -3665 -20728 -14139 43080
10793 43080 64782 64337 11440 -3590 -14040 -7472 -11955 2014 30010 14327 16263 17712 5507
10780 5507 30159 25320 45017 43723 54634 4563 -9314 41062 85156 73085 92301 88936
10768 88936 93336 88204 91830 88582 94307 87800 70308 80573 84345 88723 67301 39468 22825
10755 22825 -9479 -6116 20754 42615 14138 -729 9196 43416 54966 27897 27975 45887 69237
10742F9237j0998j9686J6239o779l0666M6987J1387k5389p718R184L344j7026
10730C8116O868K5073l2811m872q947J1935L8797J8417o642k1938O622j65k2534
10717D7919j2391l3973l739j3980j260o181M392M1793J2462j9872k8252k711K392
10704a3401K7724K013k2918j8375j8019J1582L4658K198J1709K8981P676n3972
10692a44n7212m368L0964K0694O984j6108r120m463K2140K0688K7029J4603k6334
10679B5353j0808j1313k678J1573L6338J2704K5369j2415k2408j690k6305j4888
10667H832K0045J2306j3408j748J83M8113K3131p523K0193R308K9417J8718o218
10654A61349j1727n893L4173K2991q033K4023K8141M2075J7401M8174O0062N6751
$$ plain form
10742 69237 58239 38553 54792 48013 17347 64334 75721 50332 42614 51798 55142 38116
10730 38116 44984 70057 37246 32374 23427 35362 74159 92576 85934 63996 70618 70453 47919
10717 47919 35528 1555 -2184 -16164 -17424 -23605 -19213 22580 35042 15170 -13082 -15793 -13401
10704 -13401 14323 16336 -6582 -24957 -42976 -31394 3264 5462 17171 46152 53828 -144
10692 -144 -57356 -61724 -30760 -10066 -3082 -19190 -28310 -32773 -10633 10055 37084 51687 25353
10679 25353 14545 3232 554 12127 48465 61169 86538 74123 51715 50025 23720 8832
10667 8832 28877 41183 27775 26027 26210 74323 97454 89931 110124 119432 148849 167567 161349
10654 161349 149622 143729 177902 200893 192860 216883 245024 287099 304500 352674 412736 469487
10642D69487J784N629N1849M1903K9553P1444R9748J38662J36005J55262J53306
10631A354632J35432J29419J82277K40120L16500M23752O00194Q67050J216752
10622E466128J650733K240972K897940L553272L734997K956413J398075k07053
10614B3691477j206494j246850o38354M91921J905180L591903N513836P162054
10606C9264673P505053N263731J143146k778580m857560m687320k956898o49291
10598C7246954J834959M507350P266103R310915R138780N186093j179429o669460
10590F6642265r245527q679795o300560l540677r47868J476740L615770M990488
10582D8010836M536213J578187k672977o115159p444706o658895m856955l002225
$$ plain form
10642 469487 471271 476900 528749 570652 600205 671649 771397 910059 1046064 1201326 1354632
10631 1354632 1490064 1619483 1801760 2041880 2358380 2782132 3382326 4249376 5466128
10622 5466128 7116861 9357833 12255773 15809045 19544042 22500455 23898530 23691477
10614 23691477 22484983 21238133 20599779 21091700 22996880 26588783 32102619 39264673
10606 39264673 46769726 52033457 53176603 50398023 45540463 40853143 37896245 37246954
10598 37246954 39081913 43589263 50855366 60166281 69305061 74491154 73311725 66642265
10590 66642265 57396738 48716943 42416383 38875706 37927838 39404578 43020348 48010836
10582 48010836 52547049 54125236 51452259 45337100 37892394 31233499 26376544 23374319
10574B3374319j399679j04678Q45894J318479R64814l28992k034605l272640l730802
10565A5632110l401251k705837j992392j418937j099614q74222o43202m77241
10557C019414l78759k72596k51929j95682j48015j47807j75241j08794j15637
10548A224954r2890o5491o3391n5384o0747m4382p2871q3655m2758j4273q672
10537F20440k1240l3337m906J1057k187l7315l9088l1485k0535k6062L450q579
10525D10213m0462J701o465j9717P569J3208K7231K1031q962m7223k1388K2210
10513C58946j9558k1100n778k9610l8911J1080L6580l367L0065O587m2005k5747
10501B57182j1497Q529M3268J7715j6902l9430j1686L4087J1111j8223J1564j1020
$$ plain form
10574 23374319 21974640 21869962 22715856 24034335 24999149 24670157 22635552 19362912 15632110
10565 15632110 12230859 9525022 7532630 6113693 5014079 4139857 3496655 3019414
10557 3019414 2640655 2368059 2116130 1920448 1772433 1624626 1449385 1340591 1224954
10548 1224954 1132064 1066573 1003182 947798 887051 842669 769798 686143 643385 629112 620440
10537 620440 599200 565863 560957 572014 569827 532512 493424 461939 441404 415342 418792 410213
10525 410213 369751 371452 364987 345270 352839 366047 393278 414309 405347 358124 336736 358946
10513 358946 339388 318288 312510 282900 243989 255069 291649 288282 318347 324934 282929 257182
10501 257182 245685 254214 297482 315197 298295 258865 247179 281266 292377 274154 285718 274698
10489B74698j4210k620k1060N047n11K860N575J1644M186l1714k8307o160l630
10476A95798j5789Q923j2760P414K9635r006k594j2593k3003j9505m4175j6899
10464H5446o128J885N503L480r332J0691J1102n427o096k3879K4935K9238l8384
10451H3034k3858J7114O63J3204j2147k776P543J0947k344k2273P60n374J976
10438F6469j5569k7947k5792J9725J8457l7433j5177L0728j4023J2167P2Q734
10426B0411K7296M7966N255Q135j4675l6583N873O265J5272k5647K591l9911L721
10413B5969m5J622K5222j1001O04k3953P029L0303j2632n298j4734J2287J5258
10400E0631r899n413l6374k682L0241J496K958N263j8596j1712J547l0191K2732
$$ plain form
10489 274698 260488 257868 236808 241855 241344 244204 249779 261423 265609 233895 205588 199428 195798
10476 195798 180009 188932 176172 183586 213221 204215 201621 189028 166025 146520 102345 85446
10464 85446 79318 81203 86706 90186 80854 91545 102647 97220 91124 67245 92180 121418 83034
10451 83034 59176 76290 76953 90157 78010 75234 82777 93724 91380 69107 69867 64493 66469
10438 66469 50900 22953 -2839 16886 35343 -2090 -17267 13461 -562 11605 11677 20411
10426 20411 47707 95673 100928 109063 94388 57805 63678 69943 85215 59568 62159 22248 25969
10413 25969 25924 27546 52768 41767 42371 18418 25447 55750 43118 37820 23086 35373 50631
10400 50631 40732 35319 -1055 -3737 26504 28000 30958 36221 17625 5913 7460 -22731 1
10387AK1199n405j6867J0571j2080j8255J5778L2260M3098q041l2269j6870K313
10374A5433L5877J0210N895q465k2546J6749J8163J093J0375k1475n9217K854
10362D946J8682n76Q69k2592o172J0898J584J7302L5781Q642m7006n3227j3395
10349d4264N1381P560k3855L1100K2444K8268K2448j7575n3662j3907J2757J8474
10337D1169J9789k6755K0697m0154n6648L3663L1336K2391O042O705j329K653
10325E9559j9264k3229l4372j5773N318l800J2293K9185o4L4846L4405j1767k1734
10312D5603j7690Q600j7385l6527j180L065N094K1718K0385r546k3920m7522L764
10299d5541L6639J1316j637J3452K646l7741O159K9348K2486R288p693M003L1676
$$ plain form
10387 1 21200 15795 -1072 9499 -2581 -20836 -5058 27202 70300 62259 29990 13120 15433
10374 15433 51310 61520 67415 58950 36404 53153 71316 72409 82784 61309 2092 4946
10362 4946 23628 23052 23921 1329 -4843 6055 7639 24941 60722 69364 22358 -30869 -44264
10349 -44264 7117 14677 -9178 21922 44366 72634 95082 77507 23845 9938 22695 41169
10337 41169 60958 34203 54900 14746 -41902 -8239 23097 45488 51530 58235 56906 59559
10325 59559 40295 17066 -17306 -33079 -27761 -31561 -19268 9917 9853 44699 79104 67337 45603
10312 45603 27913 36513 19128 -17399 -18579 -15514 -10420 11298 31683 22137 -1783 -49305 -45541
10299 -45541 -8902 2414 777 14229 16875 -20866 -14707 14641 37127 46415 38722 42725 74401
10286G4401K8066M320k6520N981j0998r493l5401j8547j47M608J0975J8117j129
10273D4233j6210q653J4344J0026J798p524k6713k4393k8580P116K4494K0807
10261A0745m187j2703L0628M0196O513m8807l2088j5791l876K0646J4661k907
10249C030j3370Q622K6534J7735J496j1440k5623q352m211k6099J3258J1241k5346
10236c2525J312K2210M103M963p14j1365n309j127L7875J2486q499J7255j8292
10223B2373m531M2510k6427m7066N975M2146J6731o886J4122j6338k8525j3995
10211H9M080K5724j133M73J4465N106j148k9539j0103K8797k7648K688N163j881
10197A5133K987R460J383o656j155j7333l5580j1161L5328N0794N0608j2536j0784
$$ plain form
10286 74401 102467 106787 80267 86248 75250 65757 30356 11809 11662 16270 27245 45362 44233
10273 44233 28023 19370 33714 43740 45538 38014 11301 -13092 -41672 -34556 -10062 10745
10261 10745 6558 -6145 24483 64679 71192 22385 -9703 -25494 -29370 -8724 5937 3030
10249 3030 -10340 -1718 24816 42551 44047 32607 6984 -1368 -5579 -31678 -18420 -7179 -32525
10236 -32525 -31213 -9003 -4900 63 -651 -12016 -17325 -18452 19423 31909 23410 40665 22373
10223 22373 17842 60352 33925 -13141 -7166 34980 51711 44825 58947 42609 14084 89
10211 89 4169 29893 28760 29233 43698 48804 47656 18117 8014 36811 9163 11851 17014 15133
10197 15133 18120 27580 28963 22307 21152 3819 -31761 -42922 -7594 43200 93808 81272 70488
10184G0488K0123p270k7924j1149J8325K8270M4589K3301P694j7299p294M439
10172A46293P440J6798M8414M8292P2721N782n0919k0590k3751k6030j5358M7455
10160B56547M8957M4626N0106N0512L703K0385n2649l6281l4146p544n6720k3871
10148B63625L2047J2133L0719M4293k2272m3131k4027k3248k2117m0631n0970
10137A56421j7361L8612P371m767j6403m2323k8068j7718J3432j0109k276J409
10125G8220j5210j2259k4818j4193N16J2808M395K0957o403J6378M05j6078j6905
10112B7813l1250K4024J3657p920j7958q35M115j4687J4929Q03j8558j5226K8286
10099G193K8348k4269K2617L0341K897J3870K1077o370k5003p8171j8831J3934
$$ plain form
10184 70488 90611 83341 55417 44268 62593 90863 135452 158753 166447 149148 141854 146293
10172 146293 153733 170531 218945 267237 339958 345740 294821 274231 250480 224450 209092 256547
10160 256547 305504 350130 400236 450748 454451 474836 422187 385906 351760 344216 287496 263625
10148 263625 295672 307805 338524 382817 360545 317414 293387 270139 248022 207391 156421
10137 156421 139060 177672 185043 180276 163873 121550 93482 75764 89196 79087 76811 78220
10125 78220 63010 50751 25933 11740 12256 25064 29459 50416 44013 60391 60796 44718 27813
10112 27813 -3437 20587 34244 26324 8366 7531 11646 -3041 11888 12691 -5867 -21093 7193
10099 7193 35541 11272 33889 64230 67127 80997 102074 95704 70701 -7470 -26301 -12367
10087a2367L0708J9561R87L3513J2227k6907j1600j5954J36j6334m30p111j3804
10074g375R898K5304L325l895K0090j1115l5763K7032K0832k2472r917k6881P173
10061c764L1274K2315J4069m078j5046O717p900Q067j5579J0356Q787l5718j2302
10048G198j731J5215K5350R272R179j2759k3764K0257R497l1013R238K3058J7747
10035G6744j0859O216o52p577j2018J4099K4939r963m7530q292L1758N156l3810
10022B8211j7868K0627J9874R471m464j5807k3378q305l3136k1590M8058J2051
10010A3744J3055r744j1566K2198K4987P409j1264j6920r711L5503K2904j9127
9998F1468m4345q368k279J2897j2404m0523j8539N679J7127K3393m202l3592L9218
$$ plain form
10087 -12367 18341 37902 38889 72402 84629 57722 46122 30168 30304 13970 13540 6429 -7375
10074 -7375 2523 27827 31152 27257 47347 36232 469 27501 48333 25861 15944 -10937 -3764
10061 -3764 27510 49825 63894 59816 44770 51487 43587 51654 36075 46431 55218 19500 7198
10048 7198 5467 20682 46032 55304 64483 51724 27960 48217 57714 26701 35939 58997 76744
10035 76744 65885 72101 71449 63872 51854 65953 90892 80929 33399 25107 56865 62021 28211
10022 28211 10343 30970 50844 60315 55851 40044 16666 8361 -24775 -46365 1693 13744
10010 13744 26799 17055 5489 27687 52674 60083 48819 31899 22188 57691 80595 61468
9998 61468 17123 8755 6476 19373 6969 -33554 -52093 -46414 -29287 -5894 -10096 -43688 -4470
9985d470L7194m0934k36K4329L4356L9152j7241j4881N215j5683n1479k3872M657
9972b3893j1022K3175Q821j3033r396J2560L0939J7223o432J653J2679l9197k870
9959A207j0001j8352L320L641j4719m278j5241J262P502n904o141K3031K7620
9946g053K7500P553k0431l2842J9666q519M018K5302M468J2750Q621m754L457
9933C9736K0355j3004J4713N232O747k1105J3396L2521r807n7623k7573J7715
9921B1303J9192q345J956K4283L1605l7847k1459j1972m6078k3544K7440K2578
9909h88J4887m03J7150Q718K9300J5978r533P487K194j6290n4107N714L1369K419
9895E3995K297O709J4234j4698j9964k4280P536K2880m524k7080n04K734Q375
$$ plain form
9985 -4470 32724 -8210 -8446 15883 50239 89391 72150 57269 62484 46801 -4678 -28550 -23893
9972 -23893 -34915 -11740 -2919 -15952 -25348 -12788 18151 35374 28942 30595 43274 4077 1207
9959 1207 -8794 -27146 -23826 -20185 -34904 -39182 -54423 -53161 -45659 -51563 -57704 -34673 -7053
9946 -7053 20447 28000 7569 -25273 -5607 -14126 -10108 15194 19662 32412 41033 36279 39736
9933 39736 60091 47087 61800 67032 73779 52674 66070 98591 88784 31161 3588 21303
9921 21303 40495 32150 34106 58389 89994 52147 30688 18716 -27362 -50906 -23466 -888
9909 -888 13999 13596 30746 39464 68764 84742 75209 82696 84890 68600 14493 20207 51576 53995
9895 53995 56292 63001 77235 62537 42573 18293 25829 48709 44185 17105 16601 19335 27710
9882B7710R259O898K7913l258j9725k9812j2964J5192j5745K1196K9570K5174
9870H1408K1520K1678p019k3022o271J5133j914l3532j41J840k0353P42J0151
9857F0220N721j9728j9982J1614J6067J61L2578K8309k4453j3602J7040K2241
9845A16186r995l3187l1085j1416r606p348J3556L6941j4966m666o229J573K9878
9832F9636L2211l051N593n7096n5393K282J3681K7664l1792K9513M5339J7395
9820I5982n646q478P771k1099p361M0039J0819k2830J7903Q884p376K4475J7689
9807A50772K6839J3521l6934K376R54n60J9940J2310N568O239R344J9010L8754
9794B68133L6051J1424K5196M7610L2145M7613J5934J6060J8689R4560J02021
$$ plain form
9882 27710 36969 43867 71780 68522 48797 18985 6021 21213 5468 26664 56234 81408
9870 81408 102928 124606 117587 94565 88294 103427 101513 67981 67840 69680 49327 50069 60220
9857 60220 65941 46213 26231 37845 53912 54073 86651 114960 90507 76905 93945 116186
9845 116186 106191 73004 41919 30503 20897 13549 27105 64046 49080 44414 38185 39758 69636
9832 69636 101847 98796 104389 47293 -8100 -5818 7863 35527 3735 33248 78587 95982
9820 95982 90336 81858 89629 68530 61169 101208 112027 89197 107100 115984 108608 133083 150772
9807 150772 177611 191132 154198 156574 157528 156968 176908 189218 194786 201025 210369 229379 268133
9794 268133 304184 315608 340804 388414 420559 468172 484106 500166 518855 613415 715436
9783G15436J05053J25073J61599J35818J08323J21171J34287J25883J08314J09581
9773A950538R5309R9482J21057R3681P7352R1141O5102J5526k3375r264j5042
9762B561507L753J1978N4393J08734J44031J66358J80541K20032K40433K57622
9752C949382K26532K40502J90890J63383J46685R8124Q5636O5147K3002J6376
9742E205659o113p5118j28020q7744k8372k2098p23L620R548O2766O6175R0015
9730E089595O2138N0806N0348M7994K5763m4591j9162j0997j8360o250j1904k6362
9718E189018m2883N643K7962M6802L7630j3570N5814K3988k7089n2264m5326P533
9706E213258K5446m2987n2843m3651q7082j57731p8840l2201m1940j0918M8888
$$ plain form
9783 715436 820489 945562 1107161 1242979 1351302 1472473 1606760 1732643 1840957 1950538
9773 1950538 2045847 2145329 2266386 2360067 2437419 2528560 2593662 2609188 2585813 2576549 2561507
9762 2561507 2565260 2577238 2631631 2740365 2884396 3050754 3231295 3451327 3691760 3949382
9752 3949382 4175914 4416416 4607306 4770689 4917374 5015498 5101134 5166281 5189283 5205659
9742 5205659 5199546 5124428 4996408 4908664 4880292 4858194 4857471 4861091 4870639 4933405 4999580 5089595
9730 5089595 5151733 5202539 5252887 5300881 5326644 5282053 5262891 5251894 5233534 5227284 5215380 5189018
9718 5189018 5146135 5151778 5179740 5226542 5264172 5250602 5306416 5330404 5303315 5251051 5205725 5213258
9706 5213258 5238704 5195717 5142874 5099223 5012141 4854410 4775570 4743369 4701429 4690511 4739399
9695D739399Q8145J08436J13397J34883J58734J29914J16573J04008P2659L6938
9685E803086R93M53l1708p1707q2629r2941q4272o3852m1306q655N7619Q0760
9673E465841J01657J22360J53893J56409J68708J41701J48340J27459R6328N1570
9663F734266K0608M2064N6549L8707r332m3031l4330L184M8226K2110l500l0123
9651F845398q027J1717L674L3920K0802l855k6182n0580q1828o8828q6818j04373
9639F485020r9314p8702n5269j4657L3700O9035O0484M1311M8090N0487N728j429
9627F544484n0524n9715r3367j23251j42684j79096k16112k74850l22214l05680
9617D776991k73278k65345k51711k07852j52833j16155o4209p8002j153J4432
$$ plain form
9695 4739399 4827544 4935980 5049377 5184260 5342994 5472908 5589481 5693489 5766148 5803086
9685 5803086 5804079 5804532 5772824 5701117 5618488 5525547 5441275 5377423 5336117 5327462 5385081 5465841
9673 5465841 5567498 5689858 5843751 6000160 6168868 6310569 6458909 6586368 6682696 6734266
9663 6734266 6754874 6796938 6853487 6892194 6882862 6839831 6805501 6808685 6856911 6879021 6875521 6845398
9651 6845398 6837371 6849088 6852762 6886682 6907484 6903629 6877447 6826867 6745039 6676211 6589393 6485020
9639 6485020 6385706 6307004 6251735 6237078 6270778 6339813 6400297 6441608 6489698 6540185 6545913 6544484
9627 6544484 6493960 6434245 6340878 6217627 6074943 5895847 5679735 5404885 5082671 4776991
9617 4776991 4503713 4238368 3986657 3778805 3625972 3509817 3445608 3367606 3366453 3380885
9607C380885j9349m1702m5882p6365r2284j06514j03561r0079j15387j40716j52932
9596B396114j70346j90202j82488j73137j70235j65631j16398o3910p1863q7276
9586A004628p9101r8294j22430j00367m3047J016k5706l0569m5946j6203l7932
9575D06049l3740l2707k3710l9143J3603k7349J1092J3919k210l0410j6493J7950
9563B56851q613M2170J4181l3197j4162k3689p005n368L947j0840L797R371k4785
9550B02658K5428j0404m3344P553L5491J1692m2629R32k1920O751J4119j4239
9538A72088j5138j2717L1042K2827J0000k8006k1243n305K6522m0975l4194K0459
9526A25360P429J9539j7754j8702j2371N65J7402J4321K4031P24L3566j5038j8040
$$ plain form
9607 3380885 3361536 3319834 3273952 3197587 3105303 2998789 2895228 2805149 2689762 2549046 2396114
9596 2396114 2225768 2035566 1853078 1679941 1509706 1344075 1227677 1163767 1091904 1004628
9586 1004628 925527 827233 704803 604436 561389 562405 536699 506130 460184 443981 406049
9575 406049 372309 339602 315892 276749 290352 263003 274095 288014 285804 255394 238901 256851
9563 256851 248238 290408 304589 271392 257230 233541 226536 221168 225115 214275 218072 227443 202658
9550 202658 228086 217682 174338 181891 217382 229074 186445 187377 165457 172208 186327 172088
9538 172088 156950 144233 175275 198102 208102 180096 158853 153548 180070 139095 104901 125360
9526 125360 132789 152328 134574 115872 103501 104066 121468 135789 159820 160544 194110 179072 161032
9513A61032j7840l5962k547J2775J3531j5022p126l281j5706L4353M0685L645
9501A68537q327m2987j5616L9776K0465o281m9271m3934l305K3908k696J2265
9489I2534k185l6632J0544J8513K2035K7494J7076k8645l5529K9899J4357l9527
9477H9934m169k122L3040L0385k8278k1764k8476j9092p612J1772J0716J1176
9465G5510k4213r792K7004M8908L2370l9583l4117k2741p678K939J4574L5486
9453I8667O971k8121P991L413m2617k3802K5351K5606J4968j2456k8371n581j2380
9440B9639j1607m332o394J9922L4421K4583p167L8288Q835l3949l5494r259j580
9427D5906j1233P400j6474J6443M2363J0429j4939l1444j3547K9718J5307J8037
$$ plain form
9513 161032 143192 107230 104683 117458 130989 115967 108841 105560 89854 124207 164892 168537
9501 168537 160210 117223 101607 141383 161848 155567 106296 62362 59057 82965 80269 92534
9489 92534 90349 53717 64261 82774 104809 132303 149379 120734 85205 115104 129461 89934
9477 89934 85765 83643 116683 147068 118790 97026 68550 49458 41846 53618 64334 75510
9465 75510 51297 41505 68509 117417 149787 110204 76087 53346 45668 48607 63181 98667
9453 98667 105638 77517 85508 88921 46304 22502 47853 73459 88427 75971 47600 42019 29639
9440 29639 18032 13700 7306 27228 61649 86232 79065 117353 126188 92239 56745 47486 45906
9427 45906 34673 42073 25599 42042 84405 94834 79895 48451 34904 64622 79929 97966
9415I7966j413l5228j2992l1582J6947K4661R284j696q879j9569Q89k3282J1917
9402B7023O7360N504p815Q577r16l9166m3299j1481K4350J8418N1961K9286k3171
9389A06631l3244k1836p083L310l097j1872M876K4989j1747m86L303l524j6930
9376C3290l6366l0516L962M424R375K1722K4067L0492K9152j3982l9908O59q393
9363B7978J4062K9208J4407j1373O947L138k121L2595r882l0761m9816j9766L0721
9350C5337L1451K270K127L3062j3528l572R041j2640j0579J1916j9658j2748J3487
9337F5966J6725l401q832j220J8798O236J1154k0865l4058K4577K8627j1576J6186
9324A08317m6J5659p84m1253l717j0322J454k2291j1561N1759J5307j6687o937
$$ plain form
9415 97966 96553 61325 48333 16751 33698 58359 67643 65947 57068 37499 38388 15106 27023
9402 27023 94383 99887 92072 100649 99733 60567 17268 5787 30137 48555 100516 129802 106631
9389 106631 73387 51551 44468 47778 44681 32809 37685 62674 50927 50441 53744 50220 33290
9376 33290 -3076 -33592 -29630 -25206 -15831 5891 29958 60450 89602 75620 35712 36371 27978
9363 27978 42040 71248 85655 74282 81229 84367 82246 114841 104959 74198 24382 4616 35337
9350 35337 66788 69058 71185 104247 90719 87147 96188 83548 72969 84885 65227 52479 65966
9337 65966 82691 79290 70458 69238 88036 94272 105426 84561 50503 75080 103707 92131 108317
9324 108317 108271 123930 123146 81893 78176 67854 69308 47017 35456 87215 102522 85835 78898
9311G8898J0208l728l4698j6897K8556K2876J9816k527j5385J7963J044N355K6595
9298A38076k3794l9842J1388N905j3512J1116J4015L259J3187k1026J5981K0668
9286A35421k6483k5621K5578j1701k2464n168J5869K3231o717k0808K1557J5906
9274A18600J3170O450K0044J1688K1536L8857q334L2449J056l0793J9720J14695
9262C59138Q0254M0583L1696P1589R9070J14078J17844J38610J19849P9341L9732
9251A291784K2627j5509q5607q6198p8801r0455r4406q5301j58767j19054o4640
9240D35673n3542p0024L908j7254m0955k8949j4874k9542l7537Q120J65L4597
9228A89786K6012K6544m3890o9341j1415j3410K6441J6832q929l862m844k875
$$ plain form
9311 78898 89106 85378 50680 33783 62339 85215 105031 102504 87119 105082 106126 111481 138076
9298 138076 114282 74440 85828 91733 78221 89337 103352 106611 119798 98772 114753 135421
9286 135421 108938 83317 108895 97194 74730 69562 85431 108662 101945 81137 102694 118600
9274 118600 131770 138220 158264 169952 191488 230345 222011 254460 255516 224723 244443 359138
9262 359138 439392 479975 511671 583260 682330 796408 914252 1052862 1172711 1252052 1291784
9251 1291784 1314411 1298902 1213295 1127097 1048296 957841 863435 778134 619367 500313 435673
9240 435673 382131 312107 316015 298761 257806 228857 213983 184441 146904 155024 155189 189786
9228 189786 215798 242342 198452 129111 117696 104286 130727 147559 138630 134768 129924 127049
9216A27049J1774K0328j1106K191N751k1848l855n877N447K9917K5170J239k5603
9203A60577r047J0293j3661m5347L835K0410N007j5950K2575n504l707K9618R416
9190A68515L3818N434j803q783J5122k2573q544M2658M2902j579J4387j7938J6401
9177B78017L5441L3222M2505J2756K6682L7840J7724M8476R4853N9294R4377L6935
9165H18122M4017J14773J86024J91071J30006J62364K22415K21053K49086K46487
9155B585418K29583J59323J27705J3483m0539p2231j03925j06869j51324j63471
9145B477153j10821j09018p7995q5882o0508k1274Q726Q2823J00075J01651J60227
9134B465157J98796K27878K38583K05007K04824J81647J18314L1868l9219j25317
$$ plain form
9216 127049 138823 159151 148045 150236 155987 134139 130284 124407 129854 159771 184941 186180 160577
9203 160577 151530 161823 148162 102815 106650 127060 132067 116117 138692 133188 129481 159099 168515
9190 168515 202333 207767 205964 197181 212303 189730 181186 223844 266746 265167 279554 261616 278017
9177 278017 313458 346680 389185 401941 428623 466463 484187 532663 627516 686810 781187 818122
9165 818122 862139 976912 1162936 1354007 1484013 1646377 1868792 2089845 2338931 2585418
9155 2585418 2815001 2974324 3102029 3115512 3074973 3002742 2898817 2791948 2640624 2477153
9145 2477153 2366332 2257314 2179319 2093437 2032929 2011655 2020381 2103204 2203279 2304930 2465157
9134 2465157 2663953 2891831 3130414 3335421 3540245 3721892 3840206 3872074 3832855 3707538
9124C707538j69906j80081j94829k42388j98740j24460r2533n0938m7610P362
9114B413415N7338Q5898Q8514J22289J93680J78112K49540K47052K37732K68833
9104D142403K93687K86464K97252L02247K47223K27602J68842Q1193J74l6899
9094F010188j24142k07143k45585k28370k01780k40722j47889p9984m2354K5281
9084D517500O0032J51158K43548L08635L69752L99138M22839M19021M00114L96732
9074G688469L21791K28781J34236M2730p9085k29393l68251m26200m65054m98293
9064F349731m89177m67598l89495l23090k60066k20949j72033q0552l7241L1152
9054C940682Q2224J03622J72149K15807K69343L28452L55322L17675K83141K23442
$$ plain form
9124 3707538 3537632 3357551 3162722 2920334 2721594 2597134 2504601 2453663 2406053 2413415
9114 2413415 2470753 2556651 2645165 2767454 2961134 3139246 3388786 3635838 3873570 4142403
9104 4142403 4436090 4722554 5019806 5322053 5569276 5796878 5965720 6046913 6047087 6010188
9094 6010188 5886046 5678903 5433318 5204948 5003168 4762446 4614557 4534573 4492219 4517500
9084 4517500 4577532 4728690 4972238 5280873 5650625 6049763 6472602 6891623 7291737 7688469
9074 7688469 8010260 8239041 8373277 8416007 8336922 8107529 7739278 7313078 6848024 6349731
9064 6349731 5860554 5392956 5003461 4680371 4420305 4199356 4027323 3946771 3909530 3940682
9054 3940682 4022906 4126528 4298677 4514484 4783827 5112279 5467601 5785276 6068417 6291859
9044F291859J44405l4550j54554k60844l25161l14344k52451k58522k51901k40916
9034D343021j82919j19454j04852n2102M460J2708O2343J72597K41085K72929
9024D649816L24926L78944M08109M76318M61123M34773L74554K43173J27205n5712
9014G823229j32678k16057k91959l69493m20826m37197l97494l49838l56666l18321
9004D532700k60020j57571j13149l0250L4014K0597P2424J38925K09997J73608
8994D621275J51173J54505J15378Q1440J905n4261j31391j34429j37523j57961
8984D510111j88211k17792k66485l21632l51266l69882l03879k63330j59933p1625
8974A996076m5417m1201n1838J0336N1463P1613Q3771J15818J71625J69146J67119
$$ plain form
9044 6291859 6436264 6401714 6247160 5986316 5661155 5346811 5094360 4835838 4583937 4343021
9034 4343021 4160102 4040648 3935796 3883694 3888154 3900862 3963205 4135802 4376887 4649816
9024 4649816 4974742 5353686 5761795 6238113 6699236 7134009 7508563 7751736 7878941 7823229
9014 7823229 7690551 7474494 7182535 6813042 6392216 5955019 5557525 5207687 4851021 4532700
9004 4532700 4272680 4115109 4001960 3971710 4005724 4026321 4098745 4237670 4447667 4621275
8994 4621275 4772448 4926953 5042331 5123771 5125676 5071415 4940024 4805595 4668072 4510111
8984 4510111 4321900 4104108 3837623 3515991 3164725 2794843 2490964 2227634 2067701 1996076
8974 1996076 1950659 1909458 1857620 1867956 1919419 1991032 2074803 2190621 2362246 2531392 2698511
8963B698511J42847J65643J45046N5435j4065o3108j06764j48917j69951j75881
8953B528796j71849j30443j47824j10466p8692o3285j15J1156j7L9561Q2009Q5360
8941B044191R5263J22620J33776R8000J08234J00493P7673j2476p7342j02598
8931B587834j18237j59346j74480j64404j16078q9133j12222p6517l6626r6165
8921A444626p2361l2265l7062q876K0793O530O019l880M073J4788J5380R795r207
8908A358353J9940L2985L8671P6267Q3723L710J3050M5491M4775P1291J05267
8897A893523J29897R7860Q3439O9083J01923J44514J22602J73931J51428K00871
8887C169071K14286K13390K19176K80088L10646L36808M06905M62737N59713O13520
$$ plain form
8963 2698511 2841358 3007001 3152047 3207482 3193417 3130309 3023545 2874628 2704677 2528796
8953 2528796 2356947 2226504 2078680 1968214 1889522 1826237 1826122 1837278 1837261 1876822 1958831 2044191
8941 2044191 2139454 2262074 2395850 2493850 2602084 2702577 2780250 2767774 2690432 2587834
8931 2587834 2469597 2310251 2135771 1971367 1855289 1766156 1653934 1577417 1540791 1444626
8921 1444626 1372265 1340000 1302938 1294062 1314855 1321385 1327404 1323524 1327597 1342385 1357765 1367560 1358353
8908 1358353 1378293 1411278 1449949 1526216 1609939 1613649 1626699 1672190 1716965 1788256 1893523
8897 1893523 2023420 2121280 2204719 2273802 2375725 2520239 2642841 2816772 2968200 3169071
8887 3169071 3383357 3596747 3815923 4096011 4406657 4743465 5150370 5613107 6172820 6786340
8877F786340O70221P81101Q82757J065531J329178J566561J899140K285030K634263
8868A9900122L078023L575016M003892M654209N748768P561581J0419034J4661651
8860G3602296K0866118K9657021M1546255N5625397O6168428O0052953K7395464
8853C74913932j7060825n0750657o3955038n7943756m4248518l1758226k2654207
8846H6542705j6311507j1931336q897701o752980n211192m183777l588892l301474
8838B6363846l065522k804067k433927k057230j695198j482453j262543j049453
8830A0513453q97468p83178o78074n79053n05411m52572m30394l47419l67752
8821E472132l40049l04362k83909k37602k10771j85306k07800j90041j50000j12407
$$ plain form
8877 6786340 7456561 8237662 9120419 10185950 11515128 13081689 14980829 17265859 19900122
8868 19900122 22978145 26553161 30557053 35211262 40960030 48521611 58940645 73602296
8860 73602296 94468414 124125435 165671690 221297087 287465515 347518468 374913932
8853 374913932 357853107 307102450 243147412 185203656 140955138 109196912 86542705
8846 86542705 70231198 58299862 49402161 42649181 37437989 33254212 29665320 26363846
8838 26363846 23298324 20494257 18060330 16003100 14307902 12825449 11562906 10513453
8830 10513453 9615985 8832807 8154733 7575680 7070269 6617697 6187303 5839884 5472132
8821 5472132 5132083 4827721 4543812 4306210 4095439 3910133 3702333 3512292 3362292 3249885
8811C249885j36377j52780j17706j14586j11944r7892j13680p6609r4797j12792
8801B120722j00986m3550o5069j04342l6021m5793k8485k3403l1741n6120j6224
8790A568988p7006k6158k7192o1970l1254l3512l835J5785l2864k0081j9384O683
8778A258200K5665l2108m4525l5347j5487k0286m7666k1790N228l3977j8990p911
8766A011006j9593k2712K4608j2m3690n8291O432j9746p1215l9313R636N292J9316
8753H01718M911M23O450q619j4226m945L768j337m0942j1645q989p582J8813p851
8739G29947J2294K5838P276j2K4137M1437N4435K4088l0984n5474p2491j35559
8727F24932j77957j62057p6778Q317P404J1199K8289O3K186M4290J7214k6437
$$ plain form
8811 3249885 3113508 2960728 2843022 2728436 2616492 2518600 2404920 2328311 2233514 2120722
8801 2120722 2019736 1976186 1911117 1806775 1770754 1724961 1696476 1673073 1641332 1585212 1568988
8790 1568988 1491982 1465824 1438632 1376662 1345408 1311896 1308061 1323846 1290982 1270901 1251517 1258200
8778 1258200 1283865 1251757 1207232 1171885 1156398 1136112 1088446 1066656 1071884 1037907 1018917 1011006
8766 1011006 991413 968701 993309 993297 949607 891316 897748 878002 806787 767474 777110 782402 801718
8753 801718 806629 807052 813502 804883 790657 785712 789480 788143 747201 735556 726567 718985 737798 729947
8739 729947 742241 768079 775355 775343 799480 840917 895352 919440 888456 832982 760491 624932
8727 624932 446975 284918 208140 216457 223861 235060 263349 263412 265598 309888 327102 300665
8715C00665K5804J3294J2437j1091K5297k3764k2013J1322J0221k274m13Q81j9807
8702C20559k3813K5735L0054q977k1788l1304O280K3503J0818J2441m3731q734
8690B91043j8323L518K5873N0511J9874k1703l1871l053M31L787n4161k5438J492
8677B41980m7194k2640K5648J7781L5865K9503Q139K3388k1803p676l1852p6911
8665A74228l5579k9629R885k290J4967M8368O3028P57j3342J366L205j4227O057
8652B26794j504L6086L8933J0338k1970k4423p264l286L5419K2451j7255k1834
8640B72485R570K368J3479J4566k1748j3662o465J1217K8331j1160l6956m574
8628B57451k4290k2150l506J1439L964K9849L0452r467k376J3859j8921j4170
$$ plain form
8715 300665 326469 339763 352200 341109 366406 342642 320629 331951 342172 339898 339485 340366 320559
8702 320559 296746 322481 352535 343558 321770 290466 296746 320249 331067 343508 299777 291043
8690 291043 272720 276238 302111 352622 372496 350793 318922 315869 316300 320087 265926 240488 241980
8677 241980 194786 172146 197794 215575 251440 280943 289082 312470 290667 282991 251139 174228
8665 174228 138649 109020 118905 116615 131582 179950 242978 243735 230393 231759 234964 220737 226794
8652 226794 225290 261376 300309 310647 288677 264254 256990 253704 289123 311574 294319 272485
8640 272485 282055 284423 297902 312468 290720 277058 270593 281810 310141 298981 262025 257451
8628 257451 233161 211011 207505 218944 222908 252757 283209 273742 271366 285225 266304 252134
8616B52134k0905K2288J7802r921j6401k948n444k6283L552K6041L1846J9381
8604B91142R254q340m3030l6828o607j1934J9682k672m0098Q252L0739L7859L1635
8591B79054k162o529K6669K0698j9437P25J4981j3437L5690k06k2505n0741O758
8578B69558K5643M797j0167k6042k0171k8898k1447J1476p214K4694r242m1779
8566A71208j3057l865Q376l2650J2136L183L295J5635k7750l2935M720j6855K845
8553I4286J9937J8552P8239L9325K374k0597r472k0559k9962l734r453J7717J4367
8540A91020j6067j6599k3590p855K4111M3584L7154k8166n067O758k7025k685
8528A75573k0945o396M661L8678K2816k6497r269p835k1908o371p203Q527J7525
$$ plain form
8616 252134 231229 253517 271319 261398 244997 242049 236605 210322 213874 239915 271761 291142
8604 291142 300396 292056 249026 212198 205591 193657 213339 210667 170569 178821 209560 247419 279054
8591 279054 276892 270363 297032 317730 298293 299018 313999 300562 336252 336046 313541 262800 269558
8578 269558 295201 299998 289831 263789 243618 214720 193273 204749 197535 222229 212987 171208
8566 171208 158151 154286 162662 130012 142148 145331 148626 164261 136511 103576 108296 91441 94286
8553 94286 114223 132775 211014 250339 252713 232116 222644 202085 172123 168389 158936 176653 191020
8540 191020 174953 158354 134764 126909 151020 194604 231758 203592 198525 205283 178258 175573
8528 175573 154628 148232 152893 191571 214387 187890 178621 170786 148878 142507 135304 143831 161356
8515A61356K148l0203Q79L4694k0325j970P070p059J3138K3618J1987p440m327
8502A83566j2596l643j0357J9644J5590k3503p891O102N056J6911o784K8521J5452
8489B26068k2226j8935L765J1821j5274j3246k3920j3370M7822N889l5118j9969
8477A33307J9583L6101l945J1819N1509j4485k1140J0121j456L389K7719L1788
8465B84310L7785M8761J0672J7987O5833O6617Q8085Q7816J29532J35909J32914
8454A106221J37762J25822K9542j0239m531m4795q1026j06931j09869j18421j20602
8443H02933q9361n2814p2305p4921k9967l9040p1885m3114k7479j7612m2433k2115
8431B19887j1153k5001J5265k441p789l713p337J9196m87j8988j308m878k5654
$$ plain form
8515 161356 163504 133301 134180 168874 148549 146579 153649 146590 159728 183346 195333 187893 183566
8502 183566 170970 167327 156970 176614 192204 168701 160810 166912 171968 188879 182095 210616 226068
8489 226068 203842 184907 188672 200493 185219 171973 148053 134683 182505 188394 153276 133307
8477 133307 152890 188991 185046 196865 248374 233889 212749 222870 221414 224803 252522 284310
8465 284310 322095 370856 381528 399515 465348 531965 620050 707866 837398 973307 1106221
8454 1106221 1243983 1369805 1399347 1389108 1384577 1339782 1258756 1151825 1041956 923535 802933
8443 802933 713572 660758 588453 513532 483565 444525 372640 329526 302047 284435 242002 219887
8431 219887 208734 183733 198998 196557 188768 185055 177718 196914 196427 177439 176131 171253 145599
8418A45599r595k593l2783Q510K2898j0113M03J1798J5883j396J6542j3240O141
8405A58054K6867k775k1475l3190J050N289j8746k6295K7085K2487j5266K384
8393A25469J4403j7778k5296J256J5771Q098N155L959J9930J4812o823l9685q048
8380A11223J8585j0757K42K7868j8125j9134j8935o990O863J9561j0758j0101
8368H9542O527N6851j396j0473j6499m3661K1828L4496L709q230l882J8316L3664
8355A80792K80Q437j5750k746J9993j5800k1856K256l423j0026n811j8381j9360
8342I8605J4591N6878M199l2675n811J927n39j9556r897K7616N2303r231m7144
8329A31266j0017R751J8025k0625k5658K074j6819K8902M2980j6219j5715L6060
$$ plain form
8418 145599 136004 133411 100628 109138 132036 121923 122326 134124 150007 148611 165153 151913 158054
8405 158054 184921 182146 160671 127481 128531 133820 115074 88779 115864 138351 123085 125469
8393 125469 139872 122094 96798 98054 113825 121923 127078 131037 150967 165779 158956 119271 111223
8380 111223 129808 119051 119293 147161 129036 109902 90967 83977 90840 110401 99643 89542
8368 89542 96069 152920 151524 141051 124552 80891 102719 137215 140924 132694 128812 147128 180792
8355 180792 181072 189509 173759 171013 191006 175206 153350 155606 152183 142157 136346 117965 98605
8342 98605 113196 170074 174273 141598 135787 137714 137175 117619 107722 135338 187641 178410 131266
8329 131266 121249 131000 149025 128400 102742 104816 87997 116899 159879 143660 127945 164005
8317A64005L701k9718J9378r76j8846l966J3966M1554m241l622p316o98j5155
8304A58066j5929l266j9222j2229n123k3980j6031M9988M4895R415p808n60j4236
8291A43980k2577p482K2804L7689j1086o543l0523J2785K6647N252K0051k8240
8279A62757l0558j8556r495l0018j6134J3117K0951N34L798m29K1211J1146K2011
8266A50335R391J1190J837N271m584J4594l0505m8599q389M3660R957m625J233
8253A50766j0030j7053j3980n421N57K1241k503J0401K280k0841J7914R591j3792
8240A29130j9021k5803j5411r959m37N2774M8185J6686l4434j7855k8753m063
8228I1039j7839j726Q269r509j389K2634L5628J6833L8465J1269r772K489J178
$$ plain form
8317 164005 167706 137988 157366 156390 137544 133578 147544 189098 184857 181235 173919 173221 158066
8304 158066 142137 138871 119649 107420 102297 78317 62286 112274 157169 166584 158776 158216 143980
8291 143980 121403 113921 136725 174414 163328 156785 126262 139047 165694 170946 190997 162757
8279 162757 132199 113643 104148 74130 57996 71113 92064 92598 96396 95967 117178 128324 150335
8266 150335 159726 170916 172753 178024 173440 188034 157529 108930 100541 144201 154158 149533 150766
8253 150766 140736 123683 109703 104282 104839 126080 123577 133978 136258 115417 133331 142922 129130
8240 129130 110109 84306 68895 58936 58499 111273 159458 176144 141710 123855 95102 91039
8228 91039 73200 71474 79743 70234 68845 91479 127107 143940 182405 193674 183902 186391 187569
8215A87569L753J937k5682n7568j4120J8825l4235j7656J9130K4066j1298l6916
8203E7805L5800L5717j4886n358J2989j6037J4869j3341N864M5552J6363k3240
8191A52097l0414k8211j1784N153K6122J1325P615k1368k3093q156Q809Q493J7552
8178A14140j269p308p081l6427q265L3606o618K0884k7712J7975J0940J7145J0655
8165A30665K0880k7888k9570J6557n775L423k1599l0199J0518R371l0439j2729
8153C3215J2688M485N6548J1192j7465l5440K59r988O556L4886L8833K171o308
8140A31632k5806k3747o3551M95K2882K203j8944M8656J1088l2272j0282K2128
8128F4482K5541j0435j364j7387L402N454O272K1127K8415J1457o3509j0238k663
$$ plain form
8215 187569 191322 193259 167577 110009 95889 114714 80479 62823 81953 106019 94721 57805
8203 57805 93605 129322 114436 109078 122067 106030 120899 107558 113422 158974 175337 152097
8191 152097 121683 93472 81688 86841 112963 124288 131903 110535 87442 79286 88095 96588 114140
8178 114140 112871 105563 98482 62055 53790 87396 80778 101662 73950 91925 102865 120010 130665
8165 130665 151545 123657 94087 110644 104869 108292 86693 56494 67012 76383 45944 33215
8153 33215 45903 50388 106936 118128 100663 65223 65482 55494 62050 96936 135769 137940 131632
8140 131632 105826 82079 18528 19023 41905 44108 25164 73820 84908 52636 42354 64482
8128 64482 90023 79588 78224 60837 64239 69693 75965 97092 125507 136964 73455 63217 60554
8115F0554J8387Q280J7241O869j5074N037k0899j2193N560k0328o016q17K0467
8102F7068K198O238O597J2724k3807o746n746P713k9639l262K5801O762J5622
8089H1523Q529P36m0383J3066P363K6555J8104k9537j4000j5465j1303r014K9905
8076F6079k871K433K007j1596p525k3645k4894J5491J4305n267N168J6403K385
8063D8473m035j0801M873J1244j4685P085J4964M44k644L5145K7235k6347m5116
8050D5835j635J6946M352K992K038J1566p405k1653j1356o360j4567P16K3641
8037D5110l390K3787J2511j7822j3062j477Q319K7739N137l7432J6563J233j8579
8024D8637P04j0419K5684K6881J4239J2625j2666k3725m380J1763m6819j99j6794
$$ plain form
8115 60554 78941 87221 104462 111331 96257 101294 80395 68202 73762 53434 47418 46601 67068
8102 67068 69266 75504 82101 94825 71018 64272 58526 66239 36600 33338 59139 65901 81523
8089 81523 90052 90788 50405 63471 70834 97389 115493 85956 71956 56491 45188 36174 66079
8076 66079 63208 65641 67648 56052 48527 24882 -12 15479 29784 24517 29685 46088 48473
8063 48473 44438 33637 38510 49754 35069 42154 57118 57562 54918 90063 117298 90951 45835
8050 45835 44200 61146 65498 68490 70528 82094 74689 53036 41680 35320 20753 21469 45110
8037 45110 41720 65507 78018 60196 47134 45657 53976 81715 86852 49420 65983 67216 48637
8024 48637 49341 38922 64606 91487 105726 118351 105685 81960 77580 89343 42524 42325 25531
8011B5531J3644M3195J1653j1381k1593j4518L351L308m518K0750k3618j8074
7999B7730p324N688L3625L857n433j2718J4101o774j8663K563J0750O723J3778
7986F7903l2346k0901K3321L7230N0226N585J074J2279m201j221k0764k5204j7909
7973G5072J1859j7218r612J2758r11J775J5151J7338k4343k9831m275k977L3177
7960G7963Q399J4120k6587m109K7834Q081k1757J4058n634n3394l3195J6935J9783
7947D2497O864j9713j608J811j8239J8076k216J6649p21K5713J4642j5019N803
7934G4539j5109j1478j6253j1167r883M1080M473k3482j5268k2268K0269K444
7922A7897l3004J6912L8907J0882K711J940k4311l521k0211J6390L1839L1610
$$ plain form
8011 25531 39175 82370 94023 82642 61049 46531 49882 53190 48672 69422 45804 27730
7999 27730 20406 26094 59719 63576 58143 45425 59526 52752 34089 36652 47402 54125 67903
7986 67903 35557 14656 37977 75207 125433 131018 132092 144371 140170 138949 118185 92981 75072
7973 75072 86931 69713 60101 72859 71948 73723 88874 106212 81869 52038 47763 44786 77963
7960 77963 86362 100482 73895 69786 97620 105701 83944 98002 92368 38974 5779 22714 42497
7947 42497 49361 29648 28040 29851 11612 29688 27472 44121 43400 69113 83755 68736 74539
7934 74539 59430 47952 31699 20532 10649 51729 56202 32720 17452 -4816 15453 17897
7922 17897 -15107 1805 40712 51594 54305 56245 31934 28413 8202 24592 56431 88041
7910H8041R292j6159j7179j7818j5517k6063l416j2044J5245J6473J9661K7740
7898F8256K4850q548j2197k8423j1338J8735J6393l9097o822M470q303j4534M5678
7885D9120K0643j7151L9554r469O373R970k739k3667j9596j4154J814q624m877
7872B7197n340J8895J6605n4138m3260J8720L8590N165p912K940K646J314j298
7859B0124J5048m362l6346j9469M7116J6957L7752K3508j0559j754j679j7608
7847F8728J590J643j7814k4503L9313K4365R464j3745m2257j9528K4233j9034
7835C2455k8501J2125J7047j8210k076j0633j789k1223N243J1915L0883J0431
7823C7667l5955M924J8968J7229k897m3737J0295j9224L935l283j673M81L0339
$$ plain form
7910 88041 97333 81174 63995 46177 30660 4597 1181 -10863 4382 20855 40516 68256
7898 68256 93106 84558 72361 43938 32600 51335 67728 28631 21809 26279 17976 3442 49120
7885 49120 69763 52612 92166 82697 89070 99040 96301 72634 53038 38884 40698 32074 27197
7872 27197 21857 40752 57357 3219 -40041 -21321 17269 22434 14522 17462 20108 21422 20124
7859 20124 35172 30810 -5536 -25005 22111 39068 76820 100328 89769 88015 86336 68728
7847 68728 70318 71961 54147 29644 68957 93322 102786 89041 46784 27256 51489 32455
7835 32455 3954 16079 33126 14916 12840 2207 418 -20805 -15562 -3647 27236 37667
7823 37667 1712 6636 25604 42833 39936 -3801 6494 -12730 -8795 -12078 -13751 -13270 17069
7810A7069J5099M3246P02l2392j7646j6179m563o446j9318l18j2079J4784M9280
7797C1239N035M624N423m2504m026j5816M6775m831j5217j7824p610j4509q783
7784c8024K6730j9389m010K1939L9832R354J4962j9879n7985O74R623j4299M8768
7771A8296R225m3517q185J1881K1655N5626K3295Q929j7108j6321K6706m823j2952
7758G2707k685J1810K373n100J0860j6825l3349k8429J6257L350j3021J7947R186
7745D5081o694K33J918J4341k4668N626L716j8708J0836J9599j8864k2302R01
7732A1015K6266J9006L438l435l732l0609l3809m6030J1586M7213L0178R140l1459
7719H768P664R364Q95k4099r731k1445K1922L7016k4277J788L2295k474j9183
$$ plain form
7810 17069 32168 75414 76116 43724 26078 9899 5336 -1110 -20428 -20746 -32825 -18041 31239
7797 31239 36274 40898 46321 3817 -209 -16025 30750 25919 10702 -7122 -14732 -29241 -38024
7784 -38024 -11294 -30683 -34693 -12754 27078 36432 51394 31515 -26470 -25796 -16173 -30472 18296
7771 18296 27521 -15996 -24181 -12300 9355 64981 88276 97205 80097 63776 90482 85659 72707
7758 72707 70022 81832 84205 79105 89965 73140 39791 11362 27619 30969 17948 35895 45081
7745 45081 38387 38620 40538 54879 30211 35837 39553 20845 31681 51280 32416 10114 11015
7732 11015 37281 56287 59725 56290 52558 21949 -11860 -57890 -46304 909 31087 40227 8768
7719 8768 16432 25796 26691 2592 -7139 -28584 -6662 30354 6077 7865 40160 37686 18503
7706A8503j0880l418J9574K9295O415j1478J8338n127j9238n339J6384K4366p691
7693F9704k0158j1813o031J2461p052KK973k2034K349K291K730j7479K9043K8484
7679F5470k4437K595Q679J141j6711K4119j3585k9716R920K7704k9138l0022K0019
7666A6038m424j9668N317L3989J2629P899k6527k5985m441p761N681K3322m462
7653A1607J0290j6589j5498J9984K2597Q999j3087q375P157J1003j2040l172N061
7640B7937K232j1289Q225K3177N5755j4825m5655j3135j912k3958K1042M7100
7628G4694N979o363j0374l0544l2047K1712p081k0678J3427o198J0171L3090K0673
7615F6461m96L645k6534M589K6726l099n862j3137O308j1978j1699p6R164J8173
$$ plain form
7706 18503 7623 4205 23779 53074 59489 48011 66349 61222 41984 36645 53029 77395 69704
7693 69704 49546 37733 31702 44163 37111 37113 40086 18052 20401 22692 25422 7943 36986 65470
7679 65470 41033 43628 52307 53448 36737 60856 47271 17555 27475 55179 26041 -3981 16038
7666 16038 11614 -8054 -2737 31252 43881 51780 25253 -732 -5173 -12934 -7253 16069 11607
7653 11607 21897 5308 -10190 9794 32391 41390 28303 19928 27085 38088 26048 22876 27937
7640 27937 30169 18880 27105 50282 106037 91212 45557 32422 30510 6552 27594 74694
7628 74694 80673 74310 63936 33392 1345 23057 15976 -4702 8725 2527 12698 45788 66461
7615 66461 65965 69610 43076 47665 74391 71292 65430 52293 58601 46623 34924 34848 44012 62185
7601F2185J281j3518J7327r775K936r474r263J4115l7602j8727J2744L2212K4924
7588F9365k5512j2557J0457n4113K617L2595K293K3130J4183k2758j4639O710
7576C1771J958k7228L863J2826O250K5446R154J1089p469k8815K785l435l180
7563C5015m9913M687L3526J2610O936Q322j1719l954J130J8535J8903m2486l8230
7550f638N219L9117N0082O487j344p997k9346L724K0576j5523k1260k3601J9446
7537C8942j273L835k2408l1106q824p924J276L6284R757j9955j6878M192N313
7524h769o367J4588J6437K643K720j4749k3255j7208J0408K652O907j1915Q38
7511b5070L4914P727n161K2474j8885m4262J788K1164p460K8537K153r504R438
$$ plain form
7601 62185 63466 49948 67275 57500 60436 50962 41699 55814 18212 -515 12229 44441 69365
7588 69365 43853 31296 41753 -12360 -9743 22852 25145 48275 62458 39700 25061 31771
7576 31771 33729 6501 10364 23190 29440 54886 64040 75129 67660 38845 41630 38195 35015
7563 35015 -14898 -10211 23315 35925 42861 51183 39464 35510 36640 55175 74078 31592 -6638
7550 -6638 -1419 37698 87780 94267 92923 84926 55580 59304 79880 64357 43097 19496 38942
7537 38942 37669 41504 19096 -12010 -20834 -28758 -27482 8802 18559 -1396 -18274 -14082 -8769
7524 -8769 -15136 -548 15889 18532 21252 6503 -16752 -33960 -23552 -20900 -13993 -25908 -25070
7511 -25070 9844 17571 12410 34884 15999 -28263 -26475 -5311 -12771 15766 17919 8415 17853
7498A7853J6803l1299m3574J9403M4714k725j0387o934M0237Q264j5242l2391
7486D722j9270k0240p042L7800M4350L5231l8390M434k9559m5004j9198j822M5347
7473h641K9981O4764j4945k0256k7159J981K2m112l793p990R058k6081Q076M5202
7459D6107l4534j2306Q991o80L4717J7746m4884k3025N310k3730k3228J7937K7777
7446c802L6200K751K805j2587O841Q998j8667k1772M804P706K7392R938l09J636
7432E1934R391l0980n0666j5227J9344J1841M6236j4086j1983L720R178p610p528
7419A3564j0884K5544M091l0975P111l4398o44L6590J6038Q593j3329P31M0954
7406F2986O652l0262j9009N866J5458J3592J2608k234m3962j0807k554k4588M539
$$ plain form
7498 17853 34656 3357 -40217 -20814 23900 21175 10788 3854 44091 52355 37113 4722
7486 4722 -14548 -34788 -41830 -4030 40320 75551 37161 41595 12036 -32968 -52166 -53988 -8641
7473 -8641 21340 86104 71159 50903 23744 25725 25747 21635 17842 9852 18910 -7171 905 46107
7459 46107 11573 -733 8258 7578 42295 60041 15157 -7868 -2558 -26288 -49516 -31579 -3802
7446 -3802 32398 35149 37954 25367 32208 41206 22539 767 5571 13277 40669 50607 50298 51934
7432 51934 61325 30345 -20321 -35548 -16204 -4363 41873 27787 15804 19524 28702 21092 13564
7419 13564 2680 28224 32315 1340 8451 -25947 -26591 9999 26037 34630 21301 22032 62986
7406 62986 69638 39376 20367 26233 41691 55283 67891 65657 21695 10888 8334 -16254 -11715
7393a1715P629q254J6604L8424K2363l037l2143m4140j2438J6878K7149J8500
7381C5820Q724k1647j9058j6411q587J8750M4900P531j2116K991j3297k4638J1609
7368A4571j3450p161L5037K1583J9886m472j8791p931J0896J1207l8093m1479
7356a8197J2466L0826j6746j8553j8593O326O766N080p68j7926P174J5819j8163
7343b4489j8759J9530K5469N75k2139O03K1584K7262j7352k0483j709j0985Q806
7330a2087J6187k54j8986j6115K2784l338Q70K2561l443M178p179m8548J250L6308
7316e812J5153k0842m052p991J2583J8343k0798J9893J4366J057j0808j731l1538
7303b2177k9757K4312K5868J6950L812Q959k960l0799l4642J608j302K2467j2038
$$ plain form
7393 -11715 -4086 -12340 4264 42688 65051 62014 29871 -14269 -26707 -9829 17320 35820
7381 35820 44544 22897 3839 -12572 -21159 -2409 42491 50022 37906 40897 27600 2962 14571
7368 14571 1121 -6040 28997 50580 70466 65994 47203 39272 50168 61375 23282 -18197
7356 -18197 -5731 25095 8349 -10204 -28797 -22471 -15705 -10625 -11393 -29319 -22145 -6326 -24489
7343 -24489 -43248 -23718 1751 2326 -19813 -19210 2374 29636 12284 -8199 -9908 -20893 -12087
7330 -12087 4100 3846 -15140 -31255 -8471 -11809 -10939 11622 8179 12357 5178 -43370 -42120 -5812
7316 -5812 9341 -11501 -15553 -23544 -10961 7382 -13416 6477 20843 21900 11092 9361 -22177
7303 -22177 -51934 -27622 -1754 15196 19008 27967 25007 -5792 -40434 -38826 -40128 -17661 -29699
7290b9699J1261K5530K2491n923m4548J4171K615J4311L623k4834o365O166K1789
7277A0588k0310j0715K8516L2979p522L0247n228l8030l2808k1183n164j1946
7265e0576j046J8779j4509o738L2991K4433M112l7706j7902j2758J9320O0701
7253A9101J8228k4023q101j8709k0889J1541m433q286K0039J6795l1987j918J2539
7240b0103k324j8674j2631J8257K1137L2864j1847j3383p846M1353J0889o560
7228C1132j4856j0023J1010K5014J0065k7721k4962j8739J5330N087N947K4685
7216C1969N3155l2798j3315j7025m085L8195j9279k9344k6744k2123J6407K6584
7204A597k2010J1445J3481m408j6873j4058k315R948N024Q865j0370j8890O37
$$ plain form
7290 -29699 -18438 7092 29583 23660 -20888 -6717 -4102 10209 13832 -11002 -17367 -11201 10588
7277 10588 -9722 -20437 8079 41058 33536 63783 58555 20525 -12283 -33466 -38630 -50576
7265 -50576 -51622 -32843 -47352 -54090 -21099 3334 7446 -30260 -48162 -60920 -41600 19101
7253 19101 37329 13306 5205 -13504 -34393 -22852 -27285 -35571 -15532 1263 -30724 -32642 -20103
7240 -20103 -22427 -41101 -53732 -35475 -14338 18526 6679 -6704 -14550 26803 37692 31132
7228 31132 16276 6253 17263 42277 52342 24621 -341 -19080 -3750 1337 7284 31969
7216 31969 85124 52326 39011 21986 17901 56096 36817 7473 -19271 -41394 -24987 1597
7204 1597 -20413 -8968 4513 105 -16768 -30826 -33141 -23193 -18169 -9304 -19674 -38564 -37927
7191c7927R150O966r479P096P912J8363J4097L4545l879p88j263J7801j1613l8286
7177A2695K2627K490l4510Q161k7675k2863r549J5387j154j0594o824K6820N87
7164b4402M124l989J5097P611L2306j429m2234j033L1990K2855j4994P43k0481
7151F164j7472J1893j318K0505m340k2336j3775l19K5014K0832K988p9o928m3779
7137b2950l4402R035M6966J5635k3570k35K8268K3009k2514M2340N269j9653j6646
7124C0552j9722n415J7201k8380l2418K6471L0284J4671k666O304M3132j853j4082
7111F4079m0446k5815p206j5666o1J472N0751K2356j8831k341l191j4889n380
7098D832K540J4194n3164n8642J5366O5606J7220P703L2412p413j5393l9575j0529
$$ plain form
7191 -37927 -28777 -21811 -31290 -24194 -16282 2081 16178 50723 46844 46056 44793 62594 50981 12695
7177 12695 35322 37812 3302 11463 -16212 -39075 -48624 -33237 -34391 -44985 -51809 -24989 -24402
7164 -24402 -20278 -24267 -9170 -1559 30747 29318 -12916 -13949 18041 40896 25902 26645 6164
7151 6164 -11308 585 -733 19772 15432 -6904 -20679 -20998 4016 24848 27836 27757 20829 -22950
7137 -22950 -57352 -48317 -1351 14284 -9286 -9521 18747 41756 19242 61582 66851 47198 30552
7124 30552 10830 5415 22616 -5764 -38182 -11711 18573 33244 30578 36882 80014 78161 64079
7111 64079 23633 -2182 -9388 -25054 -25115 -23643 27108 49464 30633 28292 25101 10212 4832
7098 4832 7372 21566 -31598 -90240 -74874 -9268 7952 15655 48067 40654 25261 -14314 -24843
7085b4843J4849K289Q748j7316L532n350j9092m724K6354K9774J9466J0446l1219
7072A2914j4818N922p295K2708K6844k3835j256j0038k0077l0529J6228K5854
7060B622p269j7543J0559N615O401P871Q044j3267j4003k6319j956j104N622J7245
7046a7482l4719m7094J1605L3477J4596j1651j7306L3194M7809j1114k754L0523
7034B9084K160j0199j3520n398j0131J7997J7595K6437J7509m547k0377m0653
7022E957l6096k2116J3529P632M425K0499M0159J9804q639j4574k8737l1856Q771
7009b1242k6843q204J3436K9889J5217K0j5450k5705j1805J3824J46P218J5593
6996a3906N327O082k9657K4361R962k1771Q523l1630j0610K0851m761n281K5119
$$ plain form
7085 -24843 -9994 -7705 1043 -16273 -12741 -18091 -37183 -41907 -15553 14221 33687 44133 12914
7072 12914 -1904 4018 -3277 19431 46275 22440 21184 11146 -8931 -39460 -23232 2622
7060 2622 -4647 -22190 -11631 -6016 385 8256 16300 3033 -10970 -37289 -39245 -40349 -34727 -17482
7046 -17482 -52201 -99295 -87690 -54213 -39617 -51268 -68574 -35380 12429 1315 -1439 29084
7034 29084 31244 21045 7525 2127 -8004 9993 27588 54025 71534 66987 46610 5957
7022 5957 -30139 -52255 -38726 -31094 -26669 -6170 33989 53793 45154 30580 1843 -30013 -21242
7009 -21242 -48085 -56289 -42853 -12964 2253 2273 -13177 -38882 -50687 -36863 -36717 -29499 -13906
6996 -13906 -8579 -2497 -32154 -7793 2169 -19602 -11079 -42709 -53319 -32468 -37229 -42510 -17391
6983a7391K1422j717p202K0319j7963j367M6595K1816Q412k0983j3535j7894l3134
6970a2622r227q311l598K7717N2786j0502j5538k9043j4236j571q148K7287J2722
6957G716k4741k2340J0228n321m219K3719M436O874j4662N017k085j1059j7578
6944d4015m648O934K9549K2758j7743j4473K5316K3450J965j8771k4152j7797
6932c1627j1947J0148j3855L0105L1801p723j443k465l2259N227L94L0437K3022
6919B9815O194o212k5946l7580K3540M5979M297k3076J6369J304m0309N833K8360
6906B8568m33L1792n489l8639j9823m28n57N02J6701j8665j4978M114M319L6942
6892B3926o518n148l0881j2488L1400K0178l4577l665J4728j970k7113J0058K9804
$$ plain form
6983 -17391 4031 2314 -4888 15431 -2532 -3899 42696 64512 72924 51941 38406 20512 -12622
6970 -12622 -21849 -30160 -33758 -6041 46745 36243 20705 -8338 -22574 -24145 -32293 -5006 7716
6957 7716 -17025 -39365 -29137 -34458 -38677 -14958 -10522 -3648 -18310 -13293 -15378 -26437 -44015
6944 -44015 -48663 -41729 -12180 10578 -7165 -21638 3678 27128 29093 10322 -13830 -31627
6932 -31627 -43574 -33426 -47281 -17176 14625 6902 5459 2994 -29265 -24038 -23644 6793 29815
6919 29815 36009 29797 3851 -33729 -10189 35790 40087 17011 33380 34684 -5625 208 28568
6906 28568 28135 59927 54438 15799 -4024 -4452 -5009 -4507 12194 -6471 -21449 -17335 -13016 23926
6892 23926 17408 12260 -18621 -31109 291 20469 -14108 -17773 -3045 -5015 -32128 -22070 7734
6879G734J3421Q65j7411r728K7984p04K921M598q894j3611k8318j0456K4722R512
6865B635j2237n776J8222P200L013J782J0300M399j0951l0909K54l759K514j2550
6851b5863P17J2096j1470k4243J4405J3502L7431k8166m0495m735N807L0610l1005
6838e1409k6039K7273K1688R406K3038K2795k2968m272r597j4135p492j3849J0051
6825c5510K3632j9351l5817J0445k547K1033P333k15r389J8762k93M165l984K0425
6811a311Q705j7747l718K2706j4228j6306q584m6209R49K4210K3995J8215k650
6798a1973J1423O392k573K867k8337K0242J545j4057k4358J672j2863K8201L1675
6785I856l1084J5903q526M723j2568k5509N045M0827R538n179L1470K6195j6418
$$ plain form
6879 7734 21155 22020 4609 -5119 22865 22161 25082 29680 20786 7175 -21143 -31599 -6877 2635
6865 2635 -9602 -15378 2844 10044 13057 14839 25139 29538 18587 -12322 -12068 -15827 -13313 -25863
6851 -25863 -25146 -13050 -24520 -48763 -34358 -20856 16575 -11591 -52086 -56821 -51014 -20404 -51409
6838 -51409 -77448 -50175 -28487 -19081 3957 26752 3784 -488 -10085 -24220 -31712 -45561 -35510
6825 -35510 -11878 -31229 -67046 -56601 -59148 -38115 -30782 -30997 -40386 -21624 -21917 -17752 -21736 -1311
6811 -1311 7394 -10353 -14071 8635 -5593 -21899 -30483 -76692 -75743 -51533 -27538 -9323 -11973
6798 -11973 -550 5842 3269 6136 -22201 -1959 -414 -14471 -38829 -37157 -50020 -21819 9856
6785 9856 -21228 -5325 -13851 -9128 -21696 -47205 -42160 -1333 8205 3026 34496 60691 44273
6772D4273m4730m290M3411j053j7031J3649O808p448k830l5591J1192K9157n505
6759C0012m8365L466j5384j7862R893K7364k21r108J8519j625L6k686m534J9525
6745I030K0537k5589j001n7387m3578M5587L5155J0823L9137p566p883l6078K1375
6732B562J4884j8819M567n1256j0251J80J6608m333j5065Q261K1536Q720O583
6719a5823J6035J618l2510j4249J2976Q030J818l45Q530J6557R725j7338p904
6706a2880M594l1765k6622K7597j2140j1393K377J2856L7680J6479M3194O345
6694E6322j9496k5171j9987j4419k289J4020J6912L3243K4309o521N765J561l2366
6681C1883l4433j5986j5655J7409J7523j198J0599j5246k0877j0543K0956j0260
$$ plain form
6772 44273 -457 -4747 38664 37611 20580 34229 41037 33589 30759 -4832 6360 35517 30012
6759 30012 -18353 -14887 -30271 -48133 -38240 -10876 -11097 -20205 -1686 -3311 -3275 -5961 -10495 9030
6745 9030 29567 3978 2977 -54410 -97988 -52401 -17246 -6423 32714 25148 17265 -18813 2562
6732 2562 17446 -1373 3194 -48062 -58313 -58133 -41525 -45858 -60923 -52662 -31126 -22406 -15823
6719 -15823 212 1830 -30680 -44929 -31953 -23923 -22105 -22450 -13920 2637 12362 -4976 -12880
6706 -12880 -8286 -40051 -66673 -39076 -51216 -62609 -60232 -47376 -9696 6783 49977 56322
6694 56322 36826 11655 -8332 -22751 -25040 -11020 5892 39135 63444 56923 62688 64249 31883
6681 31883 -2550 -18536 -34191 -16782 741 -457 10142 -5104 -25981 -36524 -15568 -25828
6669b5828J1716N031m263K996k0848P137l117J3873R601K6411m517m1144j7314
6656d0266k2032J5215J4337J2610K9365K6383J9643l5223n351L6355J9460P861
6644G8357n53o0285m7888k4010J9945N964J2405J0774k3183N580j5693K8536K6700
6631A6649J0300L397k0397k0773K5197K5976j6189j1311r765J6126J3689j6887
6619A6012j0947O545N446J3033K251j6058j7857l2924L1380K9702O349r21k395
6606B9616J6592k3317j6777P397R767j0727j9907l024j1219K0494J2289j7347
6594f163Q008K0063M214N492m455K470J7110m0019J775J2733J2146L881j900j4907
6580B0448k6644O6k8816J1890P780O698J7266J1404k3353l1002O757K4883m771
$$ plain form
6669 -25828 -14112 -9081 -13344 -10348 -31196 -24059 -27176 -13303 -3702 22709 18192 -22952 -40266
6656 -40266 -62298 -47083 -32746 -20136 9229 35612 55255 20032 14681 51036 70496 78357
6644 78357 77804 17519 -30369 -54379 -34434 -28470 -16065 -5291 -28474 -22894 -38587 -10051 16649
6631 16649 26949 30346 9949 -10824 14373 40349 24160 12849 3084 19210 32899 16012
6619 16012 5065 11610 17056 30089 32340 16282 -1575 -34499 -3119 26583 32932 32011 29616
6606 29616 46208 22891 6114 13511 23278 12551 -7356 -10380 -21599 -1105 11184 -6163
6594 -6163 1845 21908 26122 31614 27159 29629 46739 6720 8495 21228 33374 37255 35355 20448
6580 20448 -6196 -6130 -34946 -23056 -15276 -8578 8688 20092 -3261 -34263 -27506 -2623 -7394
6567g394K614k618K1980P71M601p071K6167K729n937l4807k7689j8453J5527j4109
6553d3689K568K5613L1619K3878J0063j5614k4025j6167K2250k1695m446L1418
6541B1773k4961L51M866j5618j59Q039k2705J830K4176N715K0793j9386q239K3421
6527A9896j562k607k642j5102q245J8450j2369k4705K4647J407K540j1505O114
6514e683K0509N919p890m8064l3933j7388L3068L3499J7292P59k8643j9750O871
6501d3434J9511Q702p96M7311J5185L7483j1320p0854R985K7014L220j7278O305
6488C1034j92l0264j5410q331n1986J957J287L2554L856J4285Q942j1998K353
6475b1913j0705R136R993m3981K3610K9322K600j825q241n700K1676k1854k6057
$$ plain form
6567 -7394 -4780 -7398 14582 15353 19954 12883 39050 41779 35842 1035 -26654 -45107 -29580 -43689
6553 -43689 -41121 -15508 16111 39989 50052 34438 10413 -5754 16496 -5199 -9645 21773
6541 21773 -3188 -2837 2029 -13589 -13748 -5709 -28414 -26584 -2408 3307 24100 4714 -3525 19896
6527 19896 18334 15727 13085 -2017 -10262 8188 -4181 -28886 -4239 -2832 -292 -11797 -5683
6514 -5683 14826 20745 12855 -35209 -69142 -86530 -53462 -19963 -2671 -1912 -30555 -50305 -43434
6501 -43434 -23923 -15221 -16017 31294 46479 83962 72642 1788 11773 38787 42007 24729 31034
6488 31034 30842 578 -14832 -23163 -75149 -73192 -71905 -39351 -35495 -21210 -12268 -24266 -21913
6475 -21913 -32618 -23482 -13489 -57470 -33860 -4538 -1938 -3763 -12004 -17704 3972 -17882 -43939
6462d3939Q958K2588p733L7J7070M51J9330O799l4171j580k153M271K8138l415
6448A4651j6050j3230J9860J2456n572K9150j6221l8231j2029J6042q266K3313
6436E873O572m528j1141j8674R391O027j3158J7323J785j0284k2390m3068L9797
6423c6475J4641L0795n597j4412J3508o472p067Q957o983L4873J7275l518N114
6410D4639l7615k9722r446J1937K9264r989k0215j3318J1822M21m488l3181K532
6397e7359J6190J010J3060K9908Q893K3574M467j0183j8858j1889j0290J8041
6385F564J3780R157J2764J5167m271o1302j8987L2888J5391L221q572n485l3014
6372b2699q647K8604P958k9211j2844L8610L0107k7019K884K0523k854M010K3328
$$ plain form
6462 -43939 -34981 -12393 -20126 -20089 -3019 -2568 16762 23561 -10610 -12190 -14343 -10072 18066 14651
6448 14651 -1399 -14629 5231 17687 12115 41265 25044 -13187 -25216 -9174 -17440 5873
6436 5873 12445 7917 -3224 -21898 -12507 -6480 -19638 -2315 -530 -10814 -33204 -76272 -36475
6423 -36475 -21834 8961 3364 -11048 2460 -4012 -11079 -2122 -9105 25768 43043 39525 44639
6410 44639 7024 -22698 -32144 -20207 9057 -932 -21147 -34465 -22643 -22222 -26710 -59891 -57359
6397 -57359 -41169 -40159 -27099 2809 11702 35276 39743 29560 10702 -1187 -11477 6564
6385 6564 20344 29501 42265 57432 53161 -8141 -27128 5760 21151 24372 15800 10315 -22699
6372 -22699 -31346 -2742 5216 -23995 -36839 1771 31878 4859 7743 28266 25412 29422 52750
6359E2750j5639l5390j0918K2705O418k3601k9703K345L1317k83J9851j2585L1963
6346C9230R105k3384j3138m276j8062L265j0144L268j2443J9640O479m4150o5047
6333a09657Q237L2806L2962j4985l0995k077N4193J7464l406l4059N046J1485
6321c2986J55J3937l54k6194M920J5564K4245k1873J6281l5789k2416K9918k702
6308c7294K8117K5591J1795k2222l7824K9349j1703l3341n731K3489R414O932
6296a3428L84K9584P180k729k666k6664j7144N645K5091K4743J9618K1561j6508
6283E4667k4113l5616k4861p135L9649J8106Q381n46k0944j8460j7840J946j7159
6270d3925j7946J029M7714j0376k1216K006P607k133r053O769R398l4021J0341
$$ plain form
6359 52750 37111 1721 -9197 13508 19926 -3675 -33378 -31033 284 1 19852 7267 39230
6346 39230 48335 24951 11813 7537 -10525 -7260 -17404 -14136 -26579 -6939 -460 -44610 -109657
6333 -109657 -101420 -68614 -35652 -50637 -81632 -83709 -29516 -12052 -15458 -49517 -44471 -32986
6321 -32986 -32831 -18894 -19248 -45442 -40522 -24958 -713 -22586 -6305 -42094 -64510 -34592 -37294
6308 -37294 -9177 16414 28209 5987 -31837 -2488 -14191 -47532 -53263 -29774 -20360 -13428
6296 -13428 -13044 16540 23720 20991 18325 -8339 -25483 -19838 5253 29996 49614 71175 54667
6283 54667 30554 -5062 -29923 -37058 2591 20697 29078 28532 7588 -10872 -28712 -26766 -43925
6270 -43925 -61871 -60842 -13128 -23504 -44720 -42714 -35107 -37240 -46293 -39524 -30126 -64147 -53806
6257e3806O585j0565K0300J2971j3256L464J8901K7602k2159j6814n685J6004
6245a6458j8074R777J1k921J5548J3753k8976k7001J3007L8815J8732j8215r389
6232a1391j1812j0068P142J7384k1921L2004r934Q20K6504j8050k7589j2353k431
6219d1695K9K1079K7517M013N28N277j4394j5253O735J0640o519k877n901R28
6205i893N719k2552L193N097p169l4549J1999K7340J0787K0490L8997K9755j9961
6192E9253R653j5185l0393k0221j2957j0234q700N845k1204l4876k9069M9934
6180e8154N1964p778l0695j8318M5192L2235J4026r036n4773k7131J4056J8763
6168b9649J961o513j0187K9051R446j8422L951j7245m278p02L169J997o937O17
$$ plain form
6257 -53806 -47221 -57786 -37486 -24515 -37771 -34307 -15406 12196 -9963 -26777 -32462 -16458
6245 -16458 -34532 -24755 -24744 -27665 -12117 1636 -27340 -54341 -41334 -2519 16213 -2002 -11391
6232 -11391 -23203 -33271 -26129 -8745 -30666 1338 -8596 -7776 18728 678 -26911 -39264 -41695
6219 -41695 -41666 -20587 6930 10943 11471 16748 2354 -12899 -6164 4476 -2043 -4920 -10821 -9893
6205 -9893 -4174 -26726 -23533 -18436 -25605 -60154 -48155 -20815 -10028 10462 49459 79214 59253
6192 59253 68906 53721 23328 3107 -9850 -20084 -28784 -22939 -44143 -79019 -108088 -58154
6180 -58154 -6190 -13968 -44663 -62981 -17789 14446 28472 19436 -35337 -62468 -48412 -29649
6168 -29649 -27688 -34201 -44388 -15337 -5891 -24313 -20362 -37607 -41885 -42587 -39418 -37421 -44358 -43741
6154d3741J2282P074m4707j7322K3162K1706K6388J6554J480p784j6562K1371
6142i9J6708l6207l6912l460K2795J4105j3110K3013J7181j9751Q041K0174N264
6129A7742j974K4901Q46k4770j1369j7004k0448k7311r178k350j6585J4985J6442
6116e6073J3077L8127J7155l1300k839p709j6955j8268K8049J6572n2025n498
6104g7687K0296L713L509J3152N022k6445j4718L3161k3845m670r960J1813K7809
6091c8850J6373K1714n653O805M0349k4331m9233r381m455j879K5444n907K8189
6078h15K4724k6571j7428m484K2120j2970j3407K4463O015l2324k1889o588K6967
6065c2187p430p104J5344O226l427n478J4996K9690l0267k2103K7731N5362J8251
$$ plain form
6154 -43741 -31459 -24385 -69092 -86414 -63252 -41546 -15158 1396 2876 -4908 -21470 -99
6142 -99 16609 -19598 -56510 -59970 -37175 -23070 -36180 -13167 4014 -15737 -7696 12478 17742
6129 17742 15768 40669 41515 16745 5376 -11628 -32076 -59387 -68565 -70915 -87500 -72515 -56073
6116 -56073 -42996 -4869 12286 -19014 -21853 -29562 -46517 -64785 -36736 -20164 -72189 -77687
6104 -77687 -57391 -53678 -50169 -37017 -31995 -58440 -73158 -39997 -63842 -68512 -78472 -66659 -38850
6091 -38850 -22477 -763 -6416 389 40738 16407 -32826 -42207 -46662 -48541 -23097 -29004 -815
6078 -815 23909 -2662 -20090 -24574 -2454 -15424 -28831 -4368 1647 -30677 -52566 -59154 -32187
6065 -32187 -39617 -46721 -31377 -25151 -28578 -34056 -19060 10630 -19637 -41740 -14009 41353 59604
6052E9604l8461k1339l8496m844M739L3069L551J121Q442k1375K812m986n9008
6039g5171Q363L6300K3584J5405p97k6982p403j9816l1542J4206J7950K7993Q975
6026h935l108n2527o700J5017k64L711k04K5549K5497J4209j1113O885J9271k5786
6012A502j9791j7L441L282j1627j9L7701P804j4207r851N447j9023k6180r144
5998e0682q7j0204k3227K8713K5859j874P825k9703Q683L5706j1280M86J2625
5985g160Q396j1779K3756r118J9866j1488P0K071r848O778j7866j6876j191j52
5971b4541r795m596j5597o250K8349L6505K2952j2607l8430j4395N955j7131l4794
5958h4375m675N7667L4799J0736r640r692j9281k1476l742j1915K8416M3149J1228
$$ plain form
6052 59604 21143 -196 -38692 -43536 -38797 -5728 -2177 -1056 7386 -13989 -11177 -16163 -75171
6039 -75171 -66808 -30508 -6924 8481 7684 -19298 -26701 -46517 -78059 -63853 -45903 -17910 -8935
6026 -8935 -12043 -64570 -71270 -56253 -56517 -52806 -53010 -27461 -1964 12245 1132 8017 27288 1502
6012 1502 -18289 -18306 -14865 -11583 -23210 -23229 14472 22276 8069 -1782 3665 -15358 -41538 -50682
5998 -50682 -50769 -60973 -84200 -55487 -29628 -31502 -23677 -53380 -44697 -8991 -20271 -19785 -7160
5985 -7160 1236 -10543 13213 4095 23961 12473 12543 14614 4766 11544 -6322 -23198 -24389 -24541
5971 -24541 -34336 -38932 -54529 -60779 -32430 4075 27027 14420 -24010 -38405 -32450 -49581 -84375
5958 -84375 -89050 -31383 3416 14152 4512 -5180 -24461 -45937 -49679 -61594 -33178 9971 21199
5945B1199k7341k8830j1177K9393K2395j7032j4658K3211j254r317L1989N224
5933B3802N378m0469R111R747k2300j3438L6147N195j0912l3550k148p617K5017
5920a6037n347k0411N0534J0409j3045j234m802L96J2138J8334k2980k161r163
5907c369j1618k5744J1976K1079j9682l0379K1804P540L1808J1654j3587j0618
5895i136k4572l1486m428P652j3063L0474J7632M785J0887J1000j0191j9145J1142
5882a8449L3072p746j8479J479j2573J3053L1737K873J0556j4354n6872K3316
5870a2387n731J6359K1370j6724o449k6383m1231k4277L2535L1032k1855m869
5858e8610K0128K9170J2619K2914p013l4088j6105J7277l358N0972n483j391l2612
$$ plain form
5945 21199 -6142 -34972 -46149 -16756 5639 -11393 -26051 -2840 -4094 -13411 18578 23802
5933 23802 29180 -11289 -2178 7569 -14731 -28169 7978 13173 2261 -31289 -33437 -41054 -16037
5920 -16037 -21384 -41795 8739 19148 6103 4869 67 463 12601 30935 7955 5794 -3369
5907 -3369 -14987 -40731 -28755 -7676 -27358 -57737 -35933 -28393 3415 15069 1482 -9136
5895 -9136 -33708 -65194 -69622 -61970 -75033 -44559 -26927 -22142 -11255 -255 -10446 -29591 -18449
5882 -18449 14623 6877 -11602 -10123 -22696 -9643 22094 24967 35523 21169 -35703 -12387
5870 -12387 -18118 -1759 19611 2887 -3562 -29945 -71176 -95453 -62918 -31886 -53741 -58610
5858 -58610 -38482 -9312 3307 26221 19208 -14880 -30985 -13708 -17066 33906 28423 27032 -5580
5845e580k6208j9844j4889K0692K5742p234q806k3916k83K0756j4104M1372J0560
5832a742j0378k2875l8846O8534M4285p052j2223o298l3054k5538n9k0065K3798
5819d1513q910m2626Q355L628N838J6526j5453j1832L6280L3739j6658j7300K3577
5806b6349J6258k490r064k6854k569K722L2635J6780o557j9636k0962J0035J9196
5793a6855J1543K1744j6938r949k6695l480J9597J3561J2574j2730r406j3540
5781c0574J2897M5037j022K0412M389k736k3875q372p86K961j4063P461K4227
5768C5956j8565j7754j2226K2812p20l1001K057K7490K1803j508p49j5511k340
5755I744K8208j9041L992n000k8063j7759K7311K9606J900j606J0845K0801k1675
$$ plain form
5845 -5580 -31788 -51632 -66521 -45829 -20087 -27321 -36127 -60043 -60326 -39570 -53674 -12302 -1742
5832 -1742 -12120 -34995 -73841 -5307 38978 31926 19703 13405 -19649 -45187 -45246 -65311 -41513
5819 -41513 -50423 -93049 -84694 -81066 -75228 -58702 -74155 -85987 -49707 -15968 -32626 -49926 -26349
5806 -26349 -10091 -12581 -21645 -48499 -51068 -48346 -15711 1069 -5488 -25124 -46086 -36051 -16855
5793 -16855 -5312 16432 -506 -10455 -37150 -40630 -21033 -7472 5102 -7628 -17034 -30574
5781 -30574 -17677 27360 26338 46750 51139 48403 24528 16156 15370 18331 4268 11729 35956
5768 35956 17391 -363 -12589 10223 9503 -21498 -19441 8049 29852 28344 27595 12084 9744
5755 9744 37952 18911 22903 17903 -10160 -27919 -608 28998 30898 29292 40137 60938 39263
5742C9263j5318o112k7957l5409L0153J0347p779j4216K9975m463O503k6890n480
5729b7383j6605j1136L575L1277k0050J434l238o879J3044L9126Q272l112l1828
5716b3503j1571j1264j322j3288J1369L1699J9654j5916k2158N519n014j1347
5704d7142L086J5765L4341l805j0710Q155n0347J1037K3419O173K223P517J0321
5691A0033l4992j5478J5949P2P522K7923N406J6166j2568m819L3763J6977l7893
5678B8061K0317R401P041m5072k8760L2588r701l132Q478k0078j4606K4963J4045
5665B3545K6625L089K994q629Q937k1687k743K650m39J6527M167k1190p503J5625
5651D1968k1327l6245p765Q065M01j3027r306J4699K819K5255o020j7959j1788
$$ plain form
5742 39263 23945 17833 -10124 -45533 -15380 -5033 -12812 -27028 2947 -1516 4987 -21903 -27383
5729 -27383 -43988 -55124 -51549 -20272 -40322 -38888 -42126 -49005 -35961 3165 11437 8325 -23503
5716 -23503 -35074 -46338 -47660 -60948 -49579 -17880 1774 -14142 -36300 -30781 -35795 -47142
5704 -47142 -44056 -28291 6050 2245 -8465 -310 -50657 -39620 -16201 -10028 -7805 -288 10033
5691 10033 -24959 -40437 -24488 -24416 -16894 11029 16435 32601 20033 15214 48977 65954 28061
5678 28061 48378 57779 64820 19748 -9012 23576 13875 10743 19221 -857 -15463 9500 23545
5665 23545 50170 53259 56253 47624 56561 34874 32131 34781 34342 50869 55036 33846 26343 41968
5651 41968 20641 -15604 -23369 -15304 -14903 -27930 -37236 -22537 -19718 5537 -483 -18442 -30230
5638c0230J2223m784n516K8148K6429J2555o908j7173n0255n208K1313L0528l4441
5625b3319l4519J4118l0148j7204O5146M7737k1961m1321J5012r719l098J0804
5613b8472Q326K1199J0197o704k0009k3424J0265J8067K827k1195n03j894J8204
5600a3116K2527o379l1691K0820R370J4181J0450k8691K881N4414k351l2630r884
5587I901K4414J2591k1090j5896J5258o820r335l3849k0987j5005M1361J9518
5575F1j3763j430j882J3475k1792l968M730j2337L830L3477n649l8805J21J8949
5561b4983K0356p884M5236J040k9986J2294K411l898k7199l6107p468j8857O704
5548f8341K5930J1652K1696P340O978J1263L561j8225l1189P21m767L2676k2926
$$ plain form
5638 -30230 -18007 -22791 -28307 -159 26270 38825 31917 14744 -35511 -40719 -19406 11122 -23319
5625 -23319 -57838 -43720 -73868 -91072 -25926 21811 -150 -41471 -26459 -36178 -39276 -28472
5613 -28472 -20146 1053 11250 4546 -15463 -38887 -28622 -10555 -7728 -28923 -29426 -31320 -13116
5600 -13116 9411 3032 -28659 -7839 1531 15712 26162 -2529 352 54766 52415 19785 9901
5587 9901 34315 46906 25816 9920 25178 18358 9023 -24826 -45813 -60818 -19457 61
5575 61 -13702 -15132 -17014 -3539 -25331 -29299 -24569 -36906 -33076 401 -5248 -44053 -43932 -24983
5561 -24983 -4627 -12511 32725 33765 3779 16073 18484 14586 -12613 -48720 -56188 -75045 -68341
5548 -68341 -42411 -30759 -9063 -1723 5255 16518 20079 1854 -29335 -28614 -33381 -705 -23631
5535b3631N718K8247n126N11n692j8087N921j4165m0070Q82J6034j6392r414P601
5521f7663J5022J5482J09K3965L0428j7768j3874L5740j7385l3755q215M6474
5509H560j4771l2773k6887l191K0209J418J1117J6267J8364L3744l3808p186O168
5496b769Q363l846q596n414k8435N947J5655j0986l2257K8555J8038r66j405j3791
5482c1907J6733j9824o383K6660m043j7788K3508K2693J0120j9250K747O509l1851
5469b2076p842j718K7082K3039m55m1179r290N442k5990k142K9204N3790j5769
5456A2096l1178k7531O556m289J3048J5051Q751j2645m213K151J5225o712n991
5443a9681J5145N267j4010q046k4752o014M015K1374J9029p682j4800k2674j0509
$$ plain form
5535 -23631 -17913 10334 5208 5719 27 -18060 -12139 -26304 -66374 -65492 -49458 -65850 -75264 -67663
5521 -67663 -52641 -37159 -37050 -13085 17343 -425 -14299 21441 4056 -29699 -37914 8560
5509 8560 -6211 -38984 -65871 -69062 -48853 -47435 -36318 -20051 -1687 32057 -1751 -8937 -2769
5496 -2769 5594 1748 -6848 -12262 -40697 -34750 -19095 -30081 -62338 -33783 -15745 -16711 -18116 -31907
5482 -31907 -15174 -34998 -41381 -14721 -18764 -36552 -13044 9649 19769 519 3266 9775 -22076
5469 -22076 -29918 -31636 -4554 18485 18030 -23149 -32439 -26997 -52987 -55129 -25925 27865 12096
5456 12096 -19082 -46613 -40057 -44346 -31298 -16247 -7496 -20141 -24354 -22203 -6978 -13690 -19681
5443 -19681 -4536 731 -13279 -21325 -46077 -52091 -48076 -26702 -7673 -15355 -30155 -52829 -63338
5430f3338L7206K4916N857J7867l340l461R119r544k6989o073j5590J9067J6248
5417A945P01k7407j4226K6367l684J6161J5750P585j4345l383j5956k0228n41
5404c1261J7225N898Q491j4931L275L273K9062j6025o86J312j7689j3117k0641
5391d5814J5556L0449P727k252R245N842j146j6009l999j249j396o226K0041J7708
5377B8477k9972n5041J2713O2880L9494k6020l5321j0537j8983J3764K2201k5883
5365b2228J649J608J868K0085P436J7723k3976k5521m183J442n120Q888N572J0223
5351d534J7270p788o54m9736l8847n662L8703J5920k6881j2961L9432N1018j5294
5338a4j5322P79l702J4053k0225J0876Q275L0986J2172P655J2507m0092l3891
$$ plain form
5430 -63338 -26132 -1216 4641 22508 19168 15707 24826 15282 -11707 -17780 -33370 -14303 1945
5417 1945 2646 -24761 -38987 -12620 -16304 -143 15607 23192 8847 5464 -10492 -30720 -31261
5404 -31261 -14036 -8138 353 -14578 -11303 -8030 21032 5007 4321 5633 -12056 -25173 -45814
5391 -45814 -30258 191 7918 5666 14911 20753 19607 3598 -401 -1650 -3046 -9272 10769 28477
5377 28477 -1495 -56536 -43823 19057 58551 32531 -2790 -13327 -32310 -18546 3655 -22228
5365 -22228 -20579 -18971 -17103 2982 10418 28141 4165 -21356 -25539 -24097 -29217 -20329 -14757 -4534
5351 -4534 12736 4948 4294 -45442 -84289 -89951 -51248 -35328 -62209 -75170 -35738 15280 -14
5338 -14 -15336 -14557 -18259 -4206 -24431 -13555 -5280 25706 37878 45533 58040 17948 -15943
5325a5943P402J2160J5040O293k9972j4226r786J733K6257O162R904Q608Q126
5312C1758N664Q466R19L0098j1704R87n1342l2049j3687l470K4177r584k7549
5299d7316J9912j4372j4192O937J9565P759J0495N727k1405M73r495L542j1626
5286d3996j9526J0275M039j1704P876J7408J8404p370J4780L0820J500j8953k3342
5273a9789L359R285j8751J4496M525l253k1985l2339J6811r178K7130K7396j8170
5260b0463J9654J8873q008K7137K979l5859J7700J6510r656N53P401j1244m577
5247B1000m079m781l8451n4J1960l1124j3154J4748L9021p571p120q832k4480
5234e2917K0654Q38j1570J9960J5956l1176j4355J0956J8361J7776m319r015j7223
$$ plain form
5325 -15943 -8541 3619 18659 24952 -5020 -19246 -29032 -27299 -1042 5120 15024 23632 31758
5312 31758 37422 45888 46807 76905 65201 66188 14846 -17203 -30890 -34360 -10183 -19767 -47316
5299 -47316 -27404 -41776 -55968 -49031 -29466 -21707 -11212 -5485 -26890 -26417 -35912 -32370 -43996
5286 -43996 -63522 -53247 -49208 -60912 -53036 -35628 -17224 -24594 -9814 21006 22506 3553 -19789
5273 -19789 -16430 -7145 -25896 -11400 -6875 -10128 -32113 -64452 -47641 -56819 -29689 -2293 -20463
5260 -20463 -809 18064 10056 37193 40172 4313 22013 38523 28867 29420 36821 25577 21000
5247 21000 16921 12140 -26311 -26365 -14405 -45529 -58683 -43935 -4914 -12485 -19605 -28437 -52917
5234 -52917 -32263 -31425 -42995 -23035 -7079 -38255 -52610 -41654 -23293 -5517 -9836 -18851 -36074
5221c6074J0606J870k6515q30J2069J0585J0724M5232j5434n2936j4972J5399
5209d0276n927k591R307j08K1980o843J6928j5370m527L1435N292K829L3980k046
5195D4063m6985m7097O532O8914J1778j6609l4637k9065k3590Q430J6857K1410
5183a9999j7243J178J5376L1542j0076j1344k4362j3913M1849J5149P181J8385
5171C3723K7874J435m2706l4018k8253L2877j6214j0981J9213K3473p033l951
5159d561j845K392q762k42p332n0518k0389P388O1888L1530P851Q246k4687m1642
5145d0683K2265M447p325j6100K722K5128r256j701j5460O836M138o169N529K5883
5131B54K2099O671l6774k3511K1429K950J43o089k3235J2820l046J4762J3320
$$ plain form
5221 -36074 -25468 -23598 -50113 -50943 -38874 -28289 -17565 27667 12233 -40703 -55675 -40276
5209 -40276 -46203 -48794 -39487 -39595 -17615 -24458 -7530 -22900 -27427 4008 9300 12129 46109 44063
5195 44063 -2922 -50019 -43487 25427 37205 20596 -14041 -43106 -66696 -58266 -41409 -19999
5183 -19999 -37242 -36064 -20688 10854 778 -10566 -34928 -48841 -6992 8157 15338 33723
5171 33723 61597 63032 20326 -13692 -41945 -9068 -25282 -36263 -17050 6423 -610 -4561
5159 -4561 -6406 -4014 -12776 -13018 -20350 -70868 -91257 -83869 -21981 9549 17400 25646 959 -40683
5145 -40683 -18418 -13971 -21296 -37396 -34674 -9546 -18802 -20503 -35963 -29127 -24989 -31158 -25629 254
5131 254 22353 29024 -7750 -31261 -9832 -6882 -6739 -12828 -36063 -23243 -26289 -11527 1793
5118A793k1002j4389o095K095L397k0263K3110n77N96J7959k8127M384J1387J4058
5104a1674J1318L8867l7534k6889K091j140k7659K267L6660J0240q381K2967j3361
5091b228k1399k7812J1798M456K813R981M8000K0770m9520J4155j4433L452j252
5078a219K8834p488j335j457J423M476q690n701j5299j2313j1644K3537K5193
5065A8317O586m2136k5201j5704k0180m648q590L7649n800M2469j6018J7538L8680
5052B2962p180m7404k5360k0568J5816M4001P333K559K1950L1397R51J007j9685
5039B7779k7140m20k6223N369j3292K0781J454n405K6706o241L011J7384k8943
5026e180k7844L0596m535k958k0944k6753k4467K5077M4153k1067k3109K3954
$$ plain form
5118 1793 -19209 -33598 -39693 -37598 -34201 -54464 -31354 -31931 -31335 -13376 -41503 -37119 -25732 -11674
5104 -11674 -356 38511 977 -25912 -23821 -24961 -52620 -50353 -13693 -3453 -11834 11133 -2228
5091 -2228 -23627 -51439 -39641 -35185 -32372 -22391 25609 46379 -3141 11014 -3419 33 -1219
5078 -1219 27615 20127 18792 17335 18758 23234 14544 8843 -6456 -18769 -30413 -6876 18317
5065 18317 24903 -17233 -42434 -58138 -78318 -82966 -91556 -53907 -59707 -17238 -33256 -15718 22962
5052 22962 15782 -31622 -56982 -77550 -61734 -17733 -10400 -7841 14109 45506 46457 47464 27779
5039 27779 639 219 -26004 -20635 -33927 -13146 -11692 -17097 9609 3368 6379 23763 -5180
5026 -5180 -33024 -2428 -6963 -9921 -30865 -57618 -82085 -57008 -12855 -33922 -57031 -33077
5014c3077M1029J1140j5867o464K169k2275j0545J2990J41J6985o946J0272q219
5001h667p19j943O832N1806k416m0170k7547N094K8443Q945l0751k1473O889j319
4987b6996n37l158O929L4156J8937M201l1282k3832K3663N504j5967j225j0585
4974b0192R745J8146J3776J6723j1105n675m587j543J5413j0720J075J2953m9073
4961a5064k3005K7412n142K828N416l985n393N039q3J4438j5243Q970O107J1638
4947A3933l1345j1265N477j8600J0991r35L1842K2517m0337K1046k1643l7411
4935e5730K374K9263k035j0798l2J7080M53L2023L5487k3314m788l5865m6238
4922f2120M0286M9516l4727l6030k2606O185K0057O476r701M4271K6514q780l8716
$$ plain form
5014 -33077 7952 19092 3225 -3239 -1070 -23345 -33890 -20900 -20759 -3774 -10720 -448 -8667
5001 -8667 -9386 -11329 -4497 47309 44893 4723 -22824 -17730 10713 19658 -11093 -32566 -25677 -26996
4987 -26996 -27533 -30691 -23762 10394 29331 33532 2250 -21582 2081 7585 -8382 -9607 -20192
4974 -20192 -10447 7699 21475 38198 27093 21418 16831 15288 30701 19981 21056 34009 -15064
4961 -15064 -38069 -10657 -15799 -12971 -7555 -11540 -16933 -11894 -11977 2461 -12782 -3812 2295 13933
4947 13933 -17412 -28677 -23200 -41800 -30809 -31744 98 22615 -17722 3324 -18319 -55730
4935 -55730 -53356 -24093 -26128 -36926 -36958 -19878 -19425 12598 48085 24771 19983 -15882 -62120
4922 -62120 -21834 27682 -7045 -43075 -65681 -59496 -39439 -32963 -42664 1607 28121 19341 -19375
4909a9375K8616K3721l7600j5440l3996J3178K6460o769n1073P001M5653P059
4897a2565j9596J3738J5333J6448m027J1238j3363p138r184L2028L458n810K5295
4884D5855r826n6023j0148K4560m295j0042k5648K0556L9963n687m4044r547J7657
4871b6669J0232n634N919j5118m6639j319O7011J7868K189L679l2880j3567k2628
4858e7556k892K4078P263k1222k0292L7841J2608k2884o623J4140K2307J0816
4846b416J4108p641N417k6491k5113J3212J3902k9940l175K1256j5820j1565l110
4833e7376J6753J5752K266k517J0695r47j8571M588M8361L1028j6253m4606m337
4820a5164K0433k5396j2064M3887k34l1089J3158J3223j0713j5261K5216J1620
$$ plain form
4909 -19375 9241 32962 -4638 -20078 -54074 -40896 -14436 -21205 -72278 -65277 -19624 -12565
4897 -12565 -32161 -18423 -3090 13358 9331 20569 7206 68 -9116 22912 26370 20560 45855
4884 45855 36029 -19994 -30142 -5582 -9877 -19919 -45567 -25011 14952 9265 -34779 -44326 -26669
4871 -26669 -16437 -22071 -16152 -31270 -77909 -79228 -12217 5651 7840 11519 -21361 -34928 -57556
4858 -57556 -60448 -36370 -29107 -50329 -70621 -32780 -20172 -43056 -49679 -35539 -13232 -2416
4846 -2416 11692 4051 9468 -17023 -42136 -28924 -15022 -44962 -48137 -26881 -42701 -54266 -57376
4833 -57376 -40623 -24871 -22605 -25122 -14427 -15374 -33945 -29357 19004 50032 33779 -10827 -15164
4820 -15164 5269 -20127 -32191 11696 11462 -19627 -6469 6754 -3959 -19220 5996 17616
4808A7616k9363k5078l105M1397K3444l0707l6050O81K789j5013n158L7414L364
4795a7769K9641N569j6861k7331j1608M74J0077q43J5453J0757j7130P993L742
4782g836k5336k5863J5730J4165J5190K7089O112k1797m2635j2379K145L2007
4770b3408K0086L7274r055j4677M5092K481k0921l531q864j2582k6732k4921J0705
4757b9053K2395L1225j7362p041j7924j4743K885L997k6939k6012k1274k165K6812
4744g5199P2147L6564j3317r333k02j1117n300n768K809R422q568l783r614n0
4730b1309l942j2104J960N4861J8204m2594l162K856j0827o976K6290j289k2327
4717b0359O245o684n5367k8755J8712M7881j4373J8878L4866K9454K519k2928
$$ plain form
4808 17616 -11747 -36825 -39930 1467 24911 -5796 -41846 -41165 -38376 -53389 -58547 -21133 -17769
4795 -17769 11872 17441 580 -26751 -38359 -37885 -27808 -28651 -13198 -2441 -19571 -11578 -7836
4782 -7836 -33172 -59035 -43305 -29140 -13950 13139 19251 -2546 -45181 -57560 -55415 -23408
4770 -23408 -3322 33952 24897 10220 55312 57793 36872 33341 24477 11895 -14837 -39758 -29053
4757 -29053 -6658 24567 7205 164 -17760 -32503 -29618 -25621 -52560 -78572 -99846 -102011 -75199
4744 -75199 -3052 33512 20195 10862 10660 -457 -5757 -11525 -8716 706 -7862 -11645 -21259 -21309
4730 -21309 -25251 -37355 -35395 19466 37670 -4924 -8086 -5230 -16057 -23033 3257 1968 -20359
4717 -20359 -14114 -20798 -76165 -104920 -86208 -38327 -52700 -33822 1044 30498 33017 10089
4705A0089q754K304n911R311j5464J4399J2679j208m1983m2560L0345J5845n515
4692b6423J1339L957J58K347j9726j0484J8087K1954m2880J7418K4473r306j697
4679a0783j970k1668J2650J4396K5033J6054j4363k1009k2703M021J0374J2449
4667B481p265l4393n105J0653K6917j7045l996r567N015J9585j6409j6137J6472
4654b8794K1659q442l9021J4714L8680O470J0322j6228j0279m8526m6993J7234
4642h9204K8108K3326o156k060Q478K5528j2989j2048j4672J2702L1626J1565
4630D204j0612l696m881j8401P686K7831J8148O75M676q974j5157K964L837K6058
4616C4358J7123Q962l1383r973k9927j2224M81j3746K3955k0732M0224O29k1572
$$ plain form
4705 10089 1335 3639 -2272 7039 -8425 5974 18653 17445 -24538 -67098 -36753 -20908 -26423
4692 -26423 -15084 -11127 -10969 -8622 -28348 -38832 -20745 1209 -41671 -24253 220 -9086 -10783
4679 -10783 -12753 -34421 -21771 -7375 17658 33712 19349 -1660 -24363 -20342 -9968 2481
4667 2481 -4784 -39177 -44282 -33629 -6712 -23757 -27753 -37320 -32305 -12720 -29129 -45266 -28794
4654 -28794 -7135 -15577 -54598 -39884 -1204 5266 15588 -640 -10919 -59445 -106438 -89204
4642 -89204 -61096 -37770 -43926 -45986 -37508 -11980 -24969 -37017 -51689 -38987 -7361 4204
4630 4204 -6408 -10104 -14985 -33386 -25700 2131 20279 20954 25630 16656 1499 4463 8300 34358
4616 34358 51481 60443 29060 19087 -10840 -23064 -22583 -36329 -12374 -33106 7118 7747 -13825
4603a3825j1248K1601P231k0552j7296J9721L2284R149l450m4454j3991P285l20
4590b7865J7645R749j3315J6194K4796K069Q371j5223J7748J3153l291j9666k0459
4577I906k8454p279K546J7165L4916K3841l2098l7859P722K3984J0552J2573k1944
4564A5571j7471j5140k9619J5762R283P133J5827N405j5831j6297J7752L1878
4552B4253K857l2122L3966j0909o1002q859r740J7607L5498j2253k7175K8241
4540a9638L0794j7184r842K3344K9398q007j7307N912m89o5038n0627j8877L2655
4527h4906M7325L1170K2497m673n71R284k460j8260k6867m1536K0845J5517k0944
4514e3579j1607K7361R342l7311j3637J470O266M1812K4061L6912J9591m900m2317
$$ plain form
4603 -13825 -25073 -3472 3759 -16793 -34089 -14368 17916 27065 23615 -20839 -34830 -27545 -27865
4590 -27865 -10220 -471 -13786 2408 27204 29273 37644 22421 40169 53322 50031 30365 9906
4577 9906 -18548 -25827 -23281 -6116 28800 52641 20543 -17316 -9594 14390 24942 37515 15571
4564 15571 -1900 -17040 -46659 -30897 -21614 -14481 1346 6751 -9080 -25377 -7625 24253
4552 24253 27110 -5012 28954 18045 -42957 -51816 -61556 -43949 -8451 -20704 -47879 -19638
4540 -19638 11156 -6028 -15870 7474 36872 28865 11558 17470 16981 -48057 -98684 -117561 -84906
4527 -84906 -37581 -6411 16086 11413 10842 20126 17666 -594 -27461 -68997 -48152 -32635 -53579
4514 -53579 -65186 -37825 -28483 -65794 -79431 -77961 -71695 -29883 -5822 31090 50681 45781 3464
4501C464k1088K9555K3495n288l358j7266l8014j6338J5084P320J1725m134N137
4488i706j4607j4517J5896K4317o498j1379k0788Q846o367J0863k6784j859K0875
4475c1708J6442K6986M299j2289l928j5889k0608N806L4961M320j476l6582k5849
4462e5515j8942K9384L1276K4051l4611k4177k4027r001N8237N2513K30M562K64
4449C4244j9278j8226J2813k356k7757k5558O439J0036J6172j5532j783J188N0996
4436B1398j8960l2155Q21L969L548M371j9075r160j2214o353Q282J3851J6743
4423b4934j8779j8947M406K9761j0393J832K2346P100R993J0363j24k076j7168
4410f620N1759J8467k7278j0246m4679m214N1208L0410l0751l2386L120k0439
$$ plain form
4501 3464 -17624 11931 35426 30138 26780 9514 -28500 -44838 -29754 -22434 -10709 -14843 -9706
4488 -9706 -24313 -38830 -22934 1383 -5115 -16494 -37282 -28436 -34803 -23940 -50724 -52583 -31708
4475 -31708 -15266 11720 16019 3730 -198 -16087 -36695 -30889 4072 8392 6916 -29666 -55515
4462 -55515 -74457 -45073 -13797 10254 -24357 -48534 -72561 -81562 -23325 29188 29418 33980 34244
4449 34244 14966 -3260 9553 7197 -20560 -46118 -39679 -29643 -13471 -29003 -30786 -29598 21398
4436 21398 2438 -29717 -28896 -24927 -21379 -17008 -36083 -45243 -57457 -63810 -55528 -41677 -24934
4423 -24934 -43713 -62660 -58254 -28493 -38886 -37054 -14708 -7608 2385 12748 12624 10548 -6620
4410 -6620 45139 63606 36328 26082 -18597 -22811 28397 58807 28056 -4330 -1210 -21649
4398b1649N377K4746O094l3979l2899K0954L1151J1591j2725m1129J981k1724
4386f2211J4094O810O381M920r314m88J5965K9987L7209l5271k5596p771K6992
4373A707J9495n268p635M6486K9708j7426l2570l9547n348R063L6931j8951n738
4360A0907j2357p808k975n049m8538R97O7585L1652J1446J9842j5170k1173K355
4347C1714j0584r727J505l6651j4314p915r399K8785J9631L672q845K258M8k3639
4333c3461J8234L0456m1968k1748K4856n630L2821J459j7416M1384j7624l3095
4321b1732j3094j6571q815M1062j1784l1968K4979R951L760K5804j8138p868M772
4308a9642J8600j4825j5957K0624j5638J589j1332K3672L076l629N032J9065j7174
$$ plain form
4398 -21649 -16272 8474 14568 -19411 -52310 -31356 -205 11386 -1339 -42468 -40487 -62211
4386 -62211 -48117 -41307 -34926 -30006 -39320 -39808 -23843 6144 43353 8082 -17514 -25285 1707
4373 1707 21202 15934 8299 54785 84493 67067 34497 -5050 -10398 -1335 35596 16645 10907
4360 10907 -1450 -9258 -12233 -17282 -65820 -64823 2762 34414 45860 65702 50532 29359 31714
4347 31714 21130 11403 12908 -23743 -38057 -45972 -55371 -26586 -6955 -3283 -12128 -9870 -9822 -33461
4333 -33461 -15227 15229 -26739 -48487 -23631 -29261 3560 5019 -12397 28987 11363 -21732
4321 -21732 -34826 -51397 -60212 -19150 -30934 -62902 -37923 -27972 -24212 1592 -16546 -24414 -19642
4308 -19642 -1042 -15867 -31824 -11200 -26838 -25249 -36581 -12909 -9833 -13462 -8430 10635 -6539
4295f539l0019J0476K1150K8246k0491J633K2557j0412k4274j3974R018L215K0936
4282A1522l550k4421R759k2488M1032L4052O481j9665m3100M547J6002k0299l1383
4269d1511o207J2348L1550K2325J3939j8780r148l42k6344k1593J2974r916K751
4256c7954k382k5428Q164K8188J5868q559k1849k8930J8065L7815o389j5743l674
4243d2808K2692J9651j0862M298J0123j5599r49J7196l388J606k1615k6894L0984
4230a5565L1992m877o584N638L564j1120q296m898j4403k3941J6912K9347J3297
4217A1066Q062m28q4J300M374l908k8720n2146Q955O6603J0438L306J3430j3287
4203B8961o268J2569j0537j5492j2708L843k6926j5023L7040K0825M916l814q264
$$ plain form
4295 -6539 -36558 -26082 -4932 23314 2823 4456 27013 16601 -7673 -21647 -12629 -9414 11522
4282 11522 7972 -16449 -6690 -29178 11854 45906 52387 32722 -10378 -5831 10171 -10128 -41511
4269 -41511 -47718 -35370 -3820 18505 32444 13664 4516 4174 -22170 -43763 -30789 -40705 -37954
4256 -37954 -40336 -65764 -57600 -29412 -13544 -22103 -43952 -72882 -54817 -17002 -23391 -39134 -42808
4243 -42808 -20116 -465 -11327 -7029 3094 -12505 -13454 3742 354 1960 -19655 -46549 -15565
4230 -15565 16427 11550 4966 10604 14168 3048 -5248 -10146 -24549 -48490 -31578 -2231 11066
4217 11066 19128 18700 18616 19916 24290 20382 -8338 -60484 -51529 15074 25512 28818 42248 28961
4203 28961 22693 35262 24725 9233 -3475 368 -26558 -41581 -4541 16284 21200 17386 9122
4190I122l8747M704K9984K2599l260r215J1720K4624j3983j7286k6072j8785j1946
4177c6541r067L89J9722J7908R113J1303J0060J8103K717L2690j4352j1682j1956
4164C8407M762q09j8133k3166j570j5861m2172L0967K4372r100o288J2028K1397
4151A4834Q564k612j0423P801J6992j2546l8644J6597J2518l2654k38J1836J3790
4138E815j4217k2740L1090J8507P89q845j9898j9400L4154K3006M213m0495l8845
4125d6866Q105k9965K1057L5172N357J3015j6752k2425J92j6662j5824J5217K2129
4112b8250P970K865J0093J4102j3968k0807J1454K4848j8038k961J9335K3187
4100B9830j9148p743k7110O609K2656O511M793l1699l4796m499l412n158N057
$$ plain form
4190 9122 -29625 -24921 5063 27662 24402 15187 26907 51531 37548 20262 -5810 -24595 -36541
4177 -36541 -45608 -45219 -25497 -7589 1524 12827 22887 40990 43707 76397 62045 50363 38407
4164 38407 43169 42360 24227 1061 -509 -16370 -58542 -27575 -3203 -12303 -18591 -6563 14834
4151 14834 23398 20786 10363 18164 35156 22610 -16034 563 13081 -19573 -19811 -7975 5815
4138 5815 -8402 -31142 -52 18455 19244 10399 -9499 -28899 5255 28261 32474 -8021 -46866
4125 -46866 -38761 -68726 -47669 -12497 -7140 5875 -10877 -33302 -33110 -49772 -65596 -50379 -28250
4112 -28250 -20280 -17415 -7322 6780 -7188 -27995 -16541 8307 -9731 -12692 6643 29830
4100 29830 10682 2939 -24171 -17562 5094 11605 16398 -15301 -50097 -54596 -58008 -63166 -58109
4087e8109K3255L3867J6955k0133j0656k344j5075M0863K0185n346o147j9593
4075b278k3867J2428K3724j197N879R20k447j8484J378K4091q951j6808k2604
4062b8216L390J5343J0220J0295O239P781j2709l484j7651q36q953j6673m53K0002
4048a5705l1184k2436M4038K3919M0589N694j8450l0104l0153J4434K0843o209
4036d724m338J8509j7618l1126j9263M1549L1947l099n072p682K705l0377j9128
4023d7717k568J5082K6306L7053J6650k8237j6831K2941J9353j4532o1088r356
4011d2944J5806M292R843j4265r046L9443J2572l6224j2748L828K8876K9414p637
3998B1210j2373K407J3496j4063j5182j8533j2954k6522J8723J7086J2845k991
$$ plain form
4087 -58109 -34854 -987 15968 -4165 -14821 -17165 -32240 8623 28808 23462 17315 -2278
4075 -2278 -26145 -13717 10007 8810 14689 15609 13162 -5322 -3944 20147 11196 -5612 -28216
4062 -28216 -24826 -9483 737 11032 17271 25052 12343 8859 -8792 -9628 -18581 -35254 -35707 -15705
4048 -15705 -46889 -69325 -25287 -1368 39221 44915 26465 -3639 -33792 -19358 1485 -4724
4036 -4724 -9062 9447 -8171 -39297 -58560 -17011 14936 11837 6765 -917 1788 -28589 -47717
4023 -47717 -50285 -35203 -8897 28156 44806 16569 -262 22679 42032 27500 -33588 -42944
4011 -42944 -27138 -22846 -13003 -27268 -36314 3129 15701 -20523 -33271 -29443 -567 28847 21210
3998 21210 8837 11244 24740 10677 -4505 -23038 -35992 -62514 -43791 -26705 -13860 -16851
3986a6851j0995K9154J3492l8733J2477O726m707N951M0649L358j0187o633K0131
3973D3832l1832j3358K1915j0795k5871J882L1144j8987m50J7939l2953l6350
3961e3884j203K3581M7237Q113l8388j4754L727J9196N174K5328l3371l2583O538
3948c5289L110j5227J0596J2079p542J483r627j8082L094L2314K6682k8353l5549
3935f0311j8827M6424L9412q369j0740r967j8694l0896j3452L9882M2103J7643
3923A4208j3788J566j0602j767L09L1567j8036k025L8306J3757k8226j1298m7270
3910c3299n784M4040K0209j8620j1522j9866L628J160O165L2986q967j5523K5070
3897A9677n569l6317J3049K3160m4405p760r150M634J0333M9940P719k9602j1232
$$ plain form
3986 -16851 -27846 1308 14800 -23933 -11456 -4730 -9437 -3486 37163 40521 30334 23701 43832
3973 43832 12000 -1358 20557 9762 -16109 -14227 16917 -2070 -2520 15419 -17534 -53884
3961 -53884 -55087 -31506 15731 23844 -14544 -29298 -25571 -6375 -1201 24127 -9244 -41827 -35289
3948 -35289 -32179 -47406 -36810 -24731 -32273 -30790 -40417 -58499 -55405 -23091 3591 -24762 -60311
3935 -60311 -79138 -32714 6698 -1671 -12411 -22378 -41072 -71968 -85420 -45538 -3435 14208
3923 14208 420 1986 -8616 -10383 -10074 21493 3457 1432 39738 53495 25269 13971 -33299
3910 -33299 -39083 4957 25166 6546 -4976 -24842 -21214 -20054 -13889 19097 10130 -5393 19677
3897 19677 14108 -22209 -9160 14000 -30405 -38165 -47315 -42681 -32348 17592 25311 -4291 -15523
3884a5523r998j8777j409l340J8956K3029K3505k0512l4734J4975J9559J0991
3872F722J6925Q644J968M483k253k1547j8807j9039L9677J0271k843l1508l2014
3859c9321K0330M195n244J411l0937K8669o021j1616J6019j328j1155m6164M40
3846h0722j2756J3796L0439J4051J3445L7267J3408k7452k4167P766j589j4663
3834c1177p351K315J9954K9301J3050O046l0141j0697J4443k2198J5770J5890
3822A5205J145j1439k7785K84K2326q947K844J6709j681j5313O021P516k6930
3809b0045o579J8178j0100J3717J6131m203J7615j2094j0884p884J5691M046k8880
3796a5291l706J8094M777l139J1385K261j0249o159l230j6436K0896J1014L2N777
$$ plain form
3884 -15523 -25521 -44298 -45707 -49047 -30091 -7062 16443 -4069 -38803 -23828 -4269 6722
3872 6722 23647 32291 34259 38742 36489 14942 -3865 -22904 16773 27044 24201 -7307 -39321
3859 -39321 -18991 -14796 -20040 -18629 -49566 -20897 -26918 -38534 -22515 -23843 -34998 -81162 -80722
3846 -80722 -93478 -79682 -49243 -35192 -21747 15520 28928 1476 -22691 -14925 -16514 -31177
3834 -31177 -38528 -36213 -16259 13042 26092 32138 1997 -8700 5743 -16455 -685 15205
3822 15205 16350 4911 -22874 -22590 -264 -9211 -6367 10342 8661 -6652 -631 6885 -20045
3809 -20045 -26624 -8446 -18546 -4829 11302 7099 24714 12620 1736 -6148 9543 13589 -15291
3796 -15291 -18997 -903 3874 735 12120 14381 4132 -2027 -5257 -21693 -797 10217 10249 16026
3782A6026K0699q650m399k1405k932K1584J3841k3675k9172l465K7306K1l6289
3769c0510j3820M804J1472P600j6203l8696j919K9994J6352m931K604K9778J6057
3756A2582J5465J1938q631J0131K9396L9273J510k2492l4547l0327J0948j1254
3744B3992j9117j8042k218L6337J9964r286n13r825k1813l5625N677J5999J5804
3731A334N424N031N089p692m307r029j3225o190p016q609k1625j7920P729P447
3717f3559K4104K8981L511k0289Q376K0528J8214m3877J1655J5635j5997J8720
3705F002M466j6814q491J0222j7247N385K5395j786L2036o771k0584l2418j9517
3692d0122M416P650K9027p320q651J1793J1006q590j1817K3598J0227k0818q914
$$ plain form
3782 16026 36725 28075 23676 2271 -661 20923 34764 11089 -18083 -21548 5758 5779 -30510
3769 -30510 -44330 -39526 -28054 -20454 -36657 -75353 -77272 -47278 -30926 -35857 -33253 -3475 12582
3756 12582 28047 39985 31354 41485 70881 110154 111664 89172 54625 24298 35246 23992
3744 23992 4875 -13167 -15385 20952 40916 31630 31117 21292 -521 -36146 -30469 -14470 1334
3731 1334 6758 11789 16878 9186 4879 -4150 -17375 -23565 -30581 -39190 -60815 -78735 -71006 -63559
3717 -63559 -39455 -10474 -6963 -27252 -18876 1652 19866 -24011 -12356 3279 -12718 6002
3705 6002 10468 -6346 -14837 -4615 -21862 -16477 8918 7132 39168 32397 11813 -20605 -40122
3692 -40122 -35706 -28056 971 -6349 -15000 -3207 7799 -791 -12608 10990 21217 399 -8515
3679h515o448Q395k4304k2484K6733j2747J9678P863n173J9566k3364j6943J8003
3666a9740J7326R202j8336j9731j4112j2229r044j9894m081J8401j5772k857L5391
3653e5476L4616l0315R797M5762N222j2044q031k2857j2157J2775Q952j2112P939
3640b7929J9210P538K0890L977l4199k4677L4507j0400q930p95j1150L1424J6455
3627A5921k195l4110j910N3102R623j327l4060k9723j176M772L2153J5415p794
3614A8691J820l600k0657m038J0518o525M425J7775m545k6265K545J5680r938
3601d114R33K49j624n258j5480P817j1392K9793J6831j5n339l6832j3263M3185
3587E491O910M52m865j1811j9949J5605K2673M5243j5535l1021n2171q240L0828
$$ plain form
3679 -8515 -14963 -6568 -30872 -53356 -26623 -39370 -19692 -11829 -17002 2564 -20800 -37743 -19740
3666 -19740 -2414 6788 -11548 -31279 -45391 -57620 -66664 -86558 -90639 -72238 -88010 -90867 -55476
3653 -55476 -20860 -51175 -41378 4384 9606 -2438 -10469 -33326 -45483 -32708 -23756 -35868 -27929
3640 -27929 -8719 -1181 19709 23686 -10513 -35190 -683 -11083 -20013 -20808 -31958 -534 15921
3627 15921 13726 -20384 -22294 30808 40431 39104 5044 -24679 -25855 -21083 11070 26485 18691
3614 18691 20511 16911 -3746 -7784 2734 -3791 634 18409 13864 -12401 -9856 5824 -4114
3601 -4114 -3181 -2932 -4556 -9814 -25294 -17477 -28869 924 17755 17740 12401 -24431 -37694 5491
3587 5491 12401 12853 7988 -3823 -23772 -8167 14506 59749 44214 13193 -38978 -47218 -16390
3574a6390Q32k2851J3497j3367M0423L8714n073k4435j7706M464J0694m953k4809
3561b0960p218J0568K7238j861j5031M371j0163j8319O19m5K020J7048K8215j39
3547A6343j3507J5937m4294j4743M3072K1939L388O54n257k8254m898K369K2162
3534A4911m424m314J0004L930j9751K5046j017k0714j3014j3738N171Q97r397
3521b6410k225K3246j813J2443J3002J7189j9615j8472p863j2553J1428J5204
3509C561O469m044R205J4002p791k3643o887O165J0713j605j30K696K7660L258
3495C9629n4710k9122j0877J0223L5079J9228P887k9690k7731j870J8927K2713
3483c14K6443L464n585O558P710m4070k4681j3061Q006l210O018R551l3890m725
$$ plain form
3574 -16390 -15558 -38409 -24912 -38279 2144 40858 35785 11350 -6356 -1892 8802 3849 -20960
3561 -20960 -28178 -17610 9628 7767 -7264 -2893 -13056 -31375 -30756 -30801 -28781 -11733 16482 16343
3547 16343 2836 18773 -25521 -40264 2808 24747 28135 28789 23532 -4722 -9620 -7251 14911
3534 14911 10487 6173 16177 20107 356 25402 24385 3671 -9343 -23081 -17910 -17013 -26410
3521 -26410 -28635 -5389 -7202 5241 18243 35432 15817 -2655 -10518 -23071 -11643 3561
3509 3561 10030 5986 15191 29193 21402 -2241 -9128 -2963 7750 6145 6015 8711 36371 39629
3495 39629 -15081 -44203 -55080 -44857 -9778 9450 17337 -12353 -40084 -41954 -23027 -314
3483 -314 26129 29593 24008 30566 38276 -5794 -30475 -43536 -35530 -38740 -32722 -23171 -57061 -61786
3469f1786L2638J5242K7374M0446j5k0790j5379k2634l808J5049m3180k1816J3134
3456d5525m582J9375J2993L1927L6707k1000n040O353j5511j4149K1546J232q180
3443A6146R356L4162l789k1618m2565j5051Q214J9223o2N176j9405j149j8431
3430b9793j396j5457K718M812J4483O2183j076r038l3149l5974L056j3986l549
3417e6166R442K1989P020q007N557R648J362k329L2063J1496j7414k5249l5336
3404d5924J774r808J0828R425j0081Q29R930J2926N79J5425K6357j4441o087K6703
3390B8435K5225Q66j726j9639n4494l464K0957k24k5173J7875J3379j2637M608
3377f012N4328m42j2871K8864P361n9390n6034R486m143j3400p476j0638J5310
$$ plain form
3469 -61786 -29148 -13906 13468 53914 53899 33109 17730 -4904 -8712 6337 -36843 -58659 -45525
3456 -45525 -50107 -30732 -17739 14188 50895 29895 24855 31208 15697 1548 23094 24326 16146
3443 16146 25502 59664 55875 34257 -8308 -23359 -15145 4078 4016 9192 -10213 -11362 -29793
3430 -29793 -31189 -46646 -43928 -39116 -24633 37550 36474 27436 -5713 -41687 -38631 -52617 -56166
3417 -56166 -46724 -24735 -17715 -25722 -20165 -10517 -9155 -11484 20579 32075 14661 -10588 -45924
3404 -45924 -44150 -53958 -43130 -33705 -43786 -42957 -33027 -20101 -19522 -4097 22260 7819 1732 28435
3390 28435 53660 54526 52800 33161 -21333 -24797 -3840 -4064 -29237 -11362 2017 -10620 -6012
3377 -6012 48316 47874 35003 63867 71228 11838 -44196 -34710 -38853 -52253 -59729 -70367 -55057
3364e5057o81j6448k836K9408J5653J0619P720J6669O931L68k150J3941J0744
3351C4881J8546m6570R944N4419J0298k1630j6546l8328L208l3729k2684L096
3339d5095K0766J2885J4486j7549j4586k021K7373K3760K833k5873k2101p35K4925
3326i32L4980Q129k7135j1725j7308j9669J4455K4884N846N834j4421j0943j3592
3313b1597Q119K3817k3777k6752M5883K2354q591m5040k6103n948j760O2274j44
3300B735j6485n36j1714l5156j2342L9007r520j2746K532j463N575P784Q664K6308
3286g357J6581J2647Q897l2328m032k62K3371r418k3962K001L904J0190n399k6244
3272c1411r098L0374j3675j3596J0748J7196J7879j280j8480j4905P096J4100
$$ plain form
3364 -55057 -55738 -72186 -75022 -45614 -29961 -19342 -11622 5047 11978 12346 10196 24137 34881
3351 34881 53427 6857 16801 71220 81518 59888 43342 5014 8222 -25507 -48191 -45095
3339 -45095 -24329 -11444 3042 -14507 -29093 -31114 -3741 20019 22852 -3021 -25122 -25857 -932
3326 -932 34048 42177 15042 3317 -13991 -33660 -19205 5679 11525 17359 2938 -8005 -21597
3313 -21597 -13478 10339 -13438 -40190 5693 28047 19456 -25584 -51687 -57635 -59395 2879 2735
3300 2735 -13750 -14286 -26000 -61156 -73498 -34491 -44011 -56757 -54225 -55688 -50113 -42329 -33665 -7357
3286 -7357 9224 21871 30768 -1560 -5592 -5854 17517 8099 -15863 -13862 -9958 232 -5167 -31411
3272 -31411 -40509 -10135 -23810 -37406 -26658 -9462 8417 7137 -11343 -26248 -19152 -5052
3260e052p219l084k3341L0872Q327j4361j4618J0151M9524L5344k5688m0984m0932
3247d1061j0791J9410L3174p722L279K0522L1672M547l3909K8636k010n3972k137
3234a0362L8449J1589j4367j5219j4349k5954r436p599k731K2285J5702K2023
3222A0031k3584J7134m436k6712K5037M0746L5751o728M65J568j2963k9541o9276
3209d2508p46L1134K3111J2814k9651n189J024K2952M4964n143j2301J8931n0225
3196I167k1361k739O494M4606J3407J3374m541m386l1620j7167J1318k496j0574
3183C482J2390K0922j339J5363N04l4029J0444J9791O914K9860l1850m4804k9866
3170b2218n432L5346n090k9207j8735M266M9001l4354M875k82K7807K355j1655
$$ plain form
3260 -5052 -12271 -15355 -38696 -7824 503 -13858 -28476 -18325 31199 66543 40855 -129 -41061
3247 -41061 -51852 -32442 732 -6990 -3711 16811 48483 53030 19121 47757 45747 -8225 -10362
3234 -10362 28087 39676 25309 10090 -4259 -30213 -39649 -47248 -49979 -27694 -11992 10031
3222 10031 -13553 3581 -855 -27567 -2530 38216 73967 67239 67704 69272 56309 26768 -42508
3209 -42508 -43254 -12120 10991 23805 -5846 -11035 -10011 12941 57905 52762 40461 59392 9167
3196 9167 -12194 -14933 -8439 36167 49574 62948 58407 54021 22401 5234 16552 14056 3482
3183 3482 15872 36794 35455 50818 51322 17293 27737 47528 54442 84302 52452 7648 -22218
3170 -22218 -27650 7696 2606 -26601 -45336 -41070 7931 -26423 -21548 -21830 5977 8332 -3323
3157c323K234L079N411J4093m8766j1379J4725j8076J8095K8784P277k4748K288
3144a0306j013J7453N908K803L924k0430j9446R822L4177p094Q83j9710j2922
3131a5951r067l0160K3206Q365l8798o11K2080l362L2620J3220l2549j3061M4823
3118G55m306j8242l6405o743J9048J577J2893J5406J884P278K23P65J6542k5478
3104a4803J3516J2950j523l1557m4781J9909L3607J954J3271k4559M995M0030
3092B3009l884j7237M459P292LJ6681r398j1866m698r607L658J3995k1247l1686
3078d0526R708M2795j5434q064J7315J6274N061j197n578r864k9444j9113r268
3065d7335k7501K9779P271J4826j8212k1806L1110M4971j6503l4764p170M153
$$ plain form
3157 -3323 -1089 1990 7401 21494 -27272 -38651 -23926 -42002 -23907 4877 12154 -12594 -10306
3144 -10306 -11319 6134 12042 14845 18769 -1661 -21107 -11285 22892 15798 16681 -3029 -15951
3131 -15951 -25018 -55178 -31972 -23607 -62405 -63016 -40936 -44298 -11678 1542 -31007 -44068 755
3118 755 -3551 -21793 -58198 -64941 -45893 -44316 -31423 -16017 -14133 -6855 -6632 -5867 10675 -14803
3104 -14803 -1287 11663 10140 -21417 -66198 -46289 -12682 -10728 2543 -22016 -17021 23009
3092 23009 19125 1888 6347 13639 13642 30323 20925 9059 4361 -5246 -1588 12407 -8840 -40526
3078 -40526 -30818 11977 -3457 -11521 5794 22068 27129 25932 20354 10490 -18954 -38067 -47335
3065 -47335 -74836 -45057 -37786 -22960 -41172 -62978 -31868 13103 -3400 -38164 -45334 -41181
3053d1181J8936O182n0093j9239L900L0887P502j488O571L0111n150M400j2409
3040b1071N992j1219q952o419K5254K2303N897N764j784p120L6450j095k4901
3027A9099r743J6729o115m8144j7739K8206J2086K7843l542j1160L077p255k2640
3014a9298j2180j2172O768N559J6693j8733K462K1994J8334l859K1311K0835J2620
3001F0334L05Q088q350N492J943l8068o1029J9882L8695o027J7224q759O849N063
2987D1642m1110m1795j1229K7565J1145N987l375J6820M779j6052j3216L853K2187
2974G201J3946K429J5411l0638n4414p871M2846M7643J083j0466J5618l587K905
2961D2106J1790j7830l9388j8372J9507K9378J0141n65N534J371J5413j7080k1965
$$ plain form
3053 -41181 -22245 -16063 -66156 -85395 -81495 -50608 -43106 -44594 -38023 -7912 -13062 -8662 -21071
3040 -21071 -15079 -26298 -35250 -41669 -16415 5888 11785 17549 15765 8645 45095 44000 19099
3027 19099 9356 26085 19970 -28174 -45913 -17707 -5621 22222 18680 7520 10597 3342 -19298
3014 -19298 -31478 -43650 -36882 -31323 -14630 -33363 -30901 -8907 9427 5568 26879 47714 60334
3001 60334 60639 68727 60377 65869 67812 29744 -31285 -11403 27292 21265 38489 29730 36579 41642
2987 41642 532 -41263 -52492 -24927 -13782 -7795 -11170 5650 10429 -5623 -18839 -14986 7201
2974 7201 21147 23576 38987 8349 -46065 -53936 -11090 36553 37636 27170 42788 39201 42106
2961 42106 53896 36066 -3322 -21694 -2187 27191 37332 36767 42301 43672 59085 42005 20040
2948B0040n953k2857m3494L403j8315j262Q683L2128O395j5232M757J0283j37
2935b1561L1193L1984P653M286j0602K353j8275l0138n30K7707j0554k955o294
2922D267n767j092j5307K233k6145o913K2879J3751P444o227j0423K0203k13j2161
2908a3471J2211K3547O969m1407L275r108Q64K144n753K3828L4349p9l3903J5749
2894A9215N066N848q360K3548M083O292j3446j2367k6882j1242k6584k847L5623
2881b053q888J8758J1640p309L510l3345L3915M0677o435k6414O453k5830j2990
2868h311k9211Q711O870p360R742M6436K4701q099n1374o710K1837N176q192o272
2854b056k798j7371k2773l72K8250l135K0259k512r20m880L559J7136r390j1691
$$ plain form
2948 20040 14087 -8770 -52264 -48861 -67176 -68438 -59755 -27627 -21232 -36464 -31707 -21424 -21561
2935 -21561 9632 41616 49269 53555 42953 45306 27031 -3107 -3637 24070 13516 10561 4267
2922 4267 -1500 -2592 -17899 -15666 -41811 -48724 -25845 -12094 -4650 -10877 -21300 -1097 -1310 -13471
2908 -13471 -1260 22287 29256 -12151 -8876 -17984 -17120 -14976 -20729 3099 37448 37369 3466 19215
2894 19215 24281 30129 21769 45317 49400 55692 42246 29879 2997 -8245 -34829 -37676 -2053
2881 -2053 -10941 7817 19457 12148 15658 -17687 16228 56905 50470 24056 30509 4679 -8311
2868 -8311 -37522 -28811 -21941 -29301 -19559 26877 51578 43479 -7895 -14605 7232 12408 4216 -2056
2854 -2056 -4854 -22225 -44998 -45370 -17120 -20255 4 -2508 -3428 -8308 -4749 12387 2997 -8694
2840h694N1402L633m2467k6327K5156J8137j4124j9246O850N237p16K0631k7927
2827h455k562J1013P191l3972j2070J1795L7397k041j3727K165M8L3976N0310
2814H1068K346l0788j7095j1779P345K907n640Q94J2232Q428j4798k3950k0388
2801i218p861q433J674K7294j0912j0648O926j3443k1212J9851J0951j8162J711
2788c1482J4252j6861J4608K2160J7825J1624m521P928l5197k9409j7862M91K1028
2775b5416J3635J7797K0594M085k2322k7836J4463L1283J0530L0755j3159j9332
2763C5077k7015j1278J1123N851K1753j6903q390l0799j783Q401n41p475L8265
$$ plain form
2840 -8694 42708 46341 3874 -22453 2703 20840 6716 -12530 -5680 -443 -1159 19472 -8455
2827 -8455 -11017 -4 7187 -26785 -38855 -27060 10337 8296 -5431 -3266 -3218 30758 81068
2814 81068 83414 52626 35531 23752 31097 34004 28364 29258 41490 49918 35120 11170 -9218
2801 -9218 -17079 -25512 -23838 3456 -7456 -18104 -11178 -24621 -45833 -25982 -15031 -33193 -31482
2788 -31482 -17230 -34091 -19483 2677 20502 32126 27605 35533 336 -29073 -46935 -46444 -25416
2775 -25416 -11781 6016 26610 30695 8373 -19463 -5000 26283 36813 67568 54409 35077
2763 35077 8062 -3216 7907 13758 35511 18608 10218 -20581 -22364 -13963 -14504 -21979 16286
$$ [...]
##END NTUPLES=NMR SPECTRUM
##END=
