##TITLE=Analysis number 328863
Compound Code mo 00973
Project Code adrs
Chemist Name fudan
##JCAMPDX= 6.0         $$ Bruker NMR JCAMP-DX V2.0
##DATA TYPE= NMR SPECTRUM
##DATA CLASS= NTUPLES
##ORIGIN= Bruker BioSpin GmbH
##OWNER= nmr
$$ XWIN-NMR		Version 3.5
$$ Wed Jul 11 10:31:16 2007 GMT Daylight Time (UT+1h)  MAYBRIDGE\nmr@NMR_250MHZ
##.OBSERVE FREQUENCY= 250.131544655141
##.OBSERVE NUCLEUS= ^1H
##.ACQUISITION MODE= SIMULTANEOUS (DQD)
##.ACQUISITION SCHEME= undefined
##.AVERAGES= 16
##.DIGITISER RES= 18
##SPECTROMETER/DATA SYSTEM= dpx250
##.PULSE SEQUENCE= zg30
##.SOLVENT NAME= CDCl3
##.SHIFT REFERENCE= (INTERNAL, CDCl3, 0, 16.522)
##AUDIT TRAIL= $$ (NUMBER, WHEN, WHO, WHERE, WHAT)
$$ ##TITLE= Audit trail, XWIN-NMR		Version 3.5
$$ ##JCAMPDX= 5.01
$$ ##ORIGIN= Bruker BioSpin GmbH
$$ ##OWNER= nmr
$$ C:\u/data/dgb/nmr/ADRS/770/pdata/1/auditp.txt
$$ ##AUDIT TRAIL=  $$ (NUMBER, WHEN, WHO, WHERE, WHAT)
(   1,<2007-07-11 10:30:55.47 +100>,<MAYBRIDGE\nmr>,<NMR_250MHZ>,
      <created by zg, POWCHK disabled, PULCHK disabled
       configuration hash MD5:
       76 6E 9A 78 1E 09 19 81 EC 84 63 8F B0 6A 59 2D
       data hash MD5: 64K
       9F D9 2E DC 3F 47 B4 AE CA 89 0F D1 4C 90 54 E1>)
(   2,<2007-07-11 10:31:07.44 +100>,<MAYBRIDGE\nmr>,<NMR_250MHZ>,
      <Start of raw data processing
       ef LB = 0.3 FT_mod = 6 PKNL = 1 SI = 32K 
       data hash MD5: 32K
       70 6C 1C 59 7A B2 90 A9 D7 1B AD 8A 5A 41 B7 64>)
(   3,<2007-07-11 10:31:09.28 +100>,<MAYBRIDGE\nmr>,<NMR_250MHZ>,
      <apk 
       data hash MD5: 32K
       E6 4B D0 48 75 BE E2 5E CE 92 61 0C C4 DF E9 32>)
(   4,<2007-07-11 10:31:10.08 +100>,<MAYBRIDGE\nmr>,<NMR_250MHZ>,
      <abs ABSG = 5 
       data hash MD5: 32K
       B9 F8 4B B3 82 7B 61 87 6F EF 02 42 4D 40 66 82>)
$$ ##END=
$$ 
$$ hash MD5
$$ 2E AC 41 6D 19 D7 46 87 5C 63 66 D8 A9 8B 93 AE
##$RELAX= 
##$RELAX= 
##$RELAX= 
##$RELAX= 
##$RELAX= 
##$RELAX= 
##$RELAX= 
$$ Bruker specific parameters
$$ --------------------------
##$DU= <C:\u>
##$EXPNO= 770
##$NAME= <ADRS>
##$PROCNO= 1
##$TYPE= <nmr>
##$USER= <dgb>
##$AMP= (0..31)
100 100 100 100 100 100 100 100 100 100 100 100 100 100 100 100 100 100 
100 100 100 100 100 100 100 100 100 100 100 100 100 100 
##$AQSEQ= 0
##$AQ_mod= 3
##$AUNM= <au_zg>
##$AUTOPOS= <6 >
##$BF1= 250.13
##$BF2= 250.13
##$BF3= 250.13
##$BF4= 250.13
##$BF5= 500.13
##$BF6= 500.13
##$BF7= 500.13
##$BF8= 500.13
##$BYTORDA= 1
##$CFDGTYP= 0
##$CFRGTYP= 5
##$CHEMSTR= <none>
##$CNST= (0..31)
1 1 145 1 1 1 1 1 1 1 1 1 1 1 1 1 1 1 1 1 1 1 1 1 1 1 1 1 1 1 1 1 
##$CPDPRG= <>
##$CPDPRG1= <>
##$CPDPRG2= <>
##$CPDPRG3= <>
##$CPDPRG4= <mlev>
##$CPDPRG5= <mlev>
##$CPDPRG6= <mlev>
##$CPDPRG7= <mlev>
##$CPDPRG8= <mlev>
##$CPDPRGB= <>
##$CPDPRGT= <>
##$D= (0..31)
0 1 0 0 0 0 0 0 0 0.06 0 0 0 0 0 0 0.0002 0 0 0 0 0 0 0 0 0 0 0 0 0 0 
0 
##$DATE= 1184146254
##$DBL= (0..7)
120 120 120 120 120 120 120 120 
##$DBP= (0..7)
150 150 150 150 150 150 150 150 
##$DBP07= 0
##$DBPNAM0= <>
##$DBPNAM1= <>
##$DBPNAM2= <>
##$DBPNAM3= <>
$$ [...]
##$SUBNAM7= <"">
##$SUBNAM8= <"">
##$SUBNAM9= <"">
##$SW= 20.6930455092707
##$SWIBOX= (0..15)
0 0 3 0 0 0 0 0 0 0 0 0 0 0 0 0 
##$SW_h= 5175.983436853
##$TD= 65536
##$TD0= 1
##$TE= 296.16
##$TE2= 300
##$TE3= 300
##$TEG= 300
##$TL= (0..7)
0 120 120 120 120 120 120 120 
##$TP= (0..7)
150 150 150 150 150 150 150 150 
##$TP07= 0
##$TPNAME0= <>
##$TPNAME1= <>
##$TPNAME2= <>
##$TPNAME3= <>
##$TPNAME4= <>
##$TPNAME5= <>
##$TPNAME6= <>
##$TPNAME7= <>
##$TPOAL= (0..7)
0.5 0.5 0.5 0.5 0.5 0.5 0.5 0.5 
##$TPOFFS= (0..7)
0 0 0 0 0 0 0 0 
##$TUNHIN= 0
##$TUNHOUT= 0
##$TUNXOUT= 0
##$USERA1= <user>
##$USERA2= <user>
##$USERA3= <user>
##$USERA4= <user>
##$USERA5= <user>
##$V9= 5
##$VALIST= <valist>
##$VCLIST= <CCCCCCCCCCCCCCC>
##$VD= 0
##$VDLIST= <DDDDDDDDDDDDDDD>
##$VPLIST= <PPPPPPPPPPPPPPP>
##$VTLIST= <TTTTTTTTTTTTTTT>
##$WBST= 1024
##$WBSW= 4
##$XGAIN= (0..3)
0 0 0 0 
##$XL= 0
##$YL= 0
##$YMAX_a= 282547
##$YMIN_a= -374953
##$ZGOPTNS= <>
##$ZL1= 120
##$ZL2= 120
##$ZL3= 120
##$ZL4= 120
##$ABSF1= 16.522
##$ABSF2= -4.171173
##$ABSG= 5
##$ABSL= 3
##$ALPHA= 0
##$AQORDER= 0
##$ASSFAC= 0
##$ASSFACI= 0
##$ASSFACX= 0
##$ASSWID= 0
##$AUNMP= <proc_1d>
##$AZFE= 0.1
##$AZFW= 0.1
##$BCFW= 0
##$BC_mod= 0
##$BYTORDP= 0
##$COROFFS= 0
##$CY= 12.5
##$DATMOD= 1
##$DC= 0
##$DFILT= <>
##$DTYPP= 0
##$F1P= 14.0000005364418
##$F2P= -0.99999901652339
##$FCOR= 0.5
##$FTSIZE= 32768
##$FT_mod= 6
##$GAMMA= 0
##$GB= 0
##$INTBC= 1
##$INTSCL= 1
##$ISEN= 128
##$LB= 0.3
##$LEV0= 0
##$LPBIN= 0
##$MAXI= 10000
##$MC2= 0
##$MEAN= 0
##$ME_mod= 0
##$MI= 0
##$NCOEF= 0
##$NC_proc= -4
##$NLEV= 6
##$NOISF1= 0
##$NOISF2= 0
##$NSP= 0
##$NTH_PI= 0
##$NZP= 0
##$OFFSET= 16.522
##$PC= 1
##$PHC0= 158.0561
##$PHC1= 4.107944
##$PH_mod= 1
##$PKNL= yes
##$PPARMOD= 0
##$PSCAL= 4
##$PSIGN= 0
##$REVERSE= no
##$SF= 250.13
##$SI= 32768
##$SIGF1= 0
##$SIGF2= 0
##$SINO= 400
##$SIOLD= 32768
##$SREGLST= <1H.CDCl3>
##$SSB= 0
##$STSI= 32768
##$STSR= 0
##$SW_p= 5175.98343685301
##$SYMM= 0
##$S_DEV= 0
##$TDeff= 65536
##$TDoff= 0
##$TI= <Analysis number 999999
Compound Code 99
Book Reference 9
Project Code 9>
##$TILT= no
##$TM1= 0
##$TM2= 0
##$TOPLEV= 0
##$USERP1= <user>
##$USERP2= <user>
##$USERP3= <user>
##$USERP4= <user>
##$USERP5= <user>
##$WDW= 1
##$XDIM= 32768
##$YMAX_p= 287798980
##$YMIN_p= -51620
$$ End of Bruker specific parameters
$$ ---------------------------------
##NTUPLES= NMR SPECTRUM
##VAR_NAME=  FREQUENCY,     SPECTRUM/REAL,   SPECTRUM/IMAG
##SYMBOL=    X,             R,               I
##VAR_TYPE=  INDEPENDENT,   DEPENDENT,       DEPENDENT
##VAR_FORM=  AFFN,          ASDF,            ASDF
##VAR_DIM=   32768,         32768,           32768
##UNITS=     HZ,            ARBITRARY UNITS, ARBITRARY UNITS
##FACTOR=    0.157963299565203, 1,           1
##FIRST=     4132.6476996994, 0,             0
##LAST=      -1043.33573715361, 0,           0
##MIN=       -1043.33573715361, -51620,      0
##MAX=       4132.6476996994, 287798980,     0
$$ Real data points
##PAGE= N=1
##DATA TABLE= (X++(R..R)), XYDATA
$$ [...]
24868A1231N374k804j4187K36P352p778L848O645l357l063j882P028K339N618
$$ 11231 16605 13801 -386 -150 7202 -576 3272 9917 6560 3497 1615 8643 10982 16600
24854A6600M864m977M725J270K751o290j3795l15j622q401J031M088M139L58N76
$$ 16600 21464 16487 21212 22482 25233 18943 5148 4833 3211 -5190 -4159 -71 4068 4426 5002
24839E002o633p491o104q976J1225J1519J6833q507p410K166M930L185r25j005
$$ 5002 -1631 -9122 -15226 -24202 -12977 -1458 15375 6868 -542 1624 6554 9739 8814 7809
24825G809L918m60m706k681k742L28o134r788J0024m08L968O720r860k537m133
$$ 7809 11727 11267 6561 3880 1138 1466 -4668 -14456 -4432 -4840 -872 5848 -4012 -6549 -10682
24810a0682J709J1151l891j347Q794P33l576q194k781P878K864j1351P399O522
$$ -10682 -8973 2178 -1713 -3060 5734 6467 2891 -5303 -8084 -206 2658 -8693 -1294 5228
24796E228k184R55N749L098q5p021p365p657m131Q586M019J978P126L197j069
$$ 5228 3044 3999 9748 12846 12761 5740 -1625 -9282 -13413 -4827 -808 1170 8296 11493 10424
24781A0424q961j1882M169Q487Q482K795p223q251J321o412R043M433K878j1187
$$ 10424 1463 -10419 -6250 2237 10719 13514 6291 -1960 -639 -7051 1992 6425 9303 -1884
24767a884q723K729O522m049o919O389j103Q084N085j823L969J645j374l397m246
$$ -1884 -10607 -7878 -1356 -5405 -12324 -5935 -7038 1046 6131 4308 8277 9922 8548 5151 905
24752I05q941j843O997P914m813k959K470K041L678l195j0514l560q543J4261
$$ 905 -8036 -9879 -2882 5032 219 -2740 -270 1771 5449 2254 -8260 -11820 -20363 -6102
24738f102Q983N166k641j041P237J780n556p216j0737J763R487K464K27l317K088
$$ -6102 2881 8047 5406 4365 11602 13382 7826 610 -10127 -8364 1123 3587 3814 497 2585
24723B585o82j288M572n909l697P191k845n375k419O445k47m032K274k752K173
$$ 2585 1903 615 5187 -722 -4419 2772 -73 -5448 -7867 -1422 -1669 -5701 -3427 -6179 -4006
24708d006N976L819n884L105p644p343M110J0374P959L297j301P45N200l633m838
$$ -4006 1970 5789 -95 3010 -4634 -11977 -7867 2507 10466 13763 12462 13207 18407 14774 9936
24693I936J550n638j766J699j505N353j376O20N35n683J235m599j3373J182J0305
$$ 9936 11486 5848 4082 5781 4276 9629 8253 8873 9408 3725 4960 361 -13012 -11830 -1525
24678a525M470N628M989K590k38n692k858j511R390K014L919k574q133l99M647
$$ -1525 2945 8573 13562 16152 15914 10222 7364 5853 15243 17257 21176 18602 10469 10070 14717
24663A4717m111L262P70K945L152j0926n034N72K062O476L666o917j3195P749
$$ 14717 10606 13868 14638 17583 20735 9809 4775 5347 7409 13885 17551 10634 -2561 5188
24649E188J1586J642K029j0751j0166n274N699j57r2K281J266O22q24o922p68
$$ 5188 16774 18416 20445 9694 -472 -5746 -47 -204 -296 1985 3251 3873 3049 -3873 -4641
24634d641l374r71O373J2209P623J6j209q87p288j0435M84M69o548K50j782K792
$$ -4641 -8015 -8986 -2613 9596 17219 17235 16026 15139 7851 -2584 -2100 -1631 -8179 -7929 -9711 -6919
24618f919k705j110O092Q120j0126L986J1544L958J140p191j1641K587J2875O532
$$ -6919 -9624 -10734 -4642 3478 -6648 -2662 8882 12840 13980 6789 -4852 -2265 10610 17142
24604A7142j0199q763j936L969R169m221o299J2969O056m821j6078K216Q775n135
$$ 17142 6943 -1820 -3756 213 9382 5161 -1138 11831 17887 13066 -3012 -796 7979 2844
24590B844o999M516N145n075q715Q519J3972J182L624q760n497j508J0465M251
$$ 2844 -4155 361 5506 431 -8284 235 14207 15389 19013 10253 4756 3248 13713 17964
24576A7964j261L463K853j0087l900K491n132j737k718O399O56r298k364M007
$$ 17964 16703 20166 23019 12932 9032 11523 6391 4654 1936 8335 8991 -307 -2671 1336
24562A336M640m803q40J658n18N677O076j185K829k554j0357J907M637m747l698
$$ 1336 5976 1173 333 1991 1473 7150 13226 12041 14870 12316 1959 3866 8503 3756 58
24547E8J472K164n765n953J367K525J130P102p11m303M446O917l522j611J0641
$$ 58 1530 3694 -2071 -8024 -6657 -4132 -3002 4100 3389 -914 3532 10449 6927 5316 15957
24532A5957k079p392J588K707q332q10O86L245O95o803p010l512J4589M872p312
$$ 15957 13878 6486 8074 10781 2449 1639 2325 5570 6265 -538 -7548 -11060 3529 8401 1089
24517A089k432J331m588Q85R95L928P90Q058O058q084m371N333r653N315k512
$$ 1089 -1343 -12 -4600 -3715 -2720 1208 1998 10056 16114 8030 3659 8992 -661 4654 2142
24502B142o208N533M133M589o441n767r23p57j555J349K125P05R52o68n064j443
$$ 2142 -4066 1467 5600 10189 3748 -2019 -2942 -3699 -5254 -3905 -1780 -1075 -123 -791 -5855 -7298
24486g298J5545J4095j3473m547K488K541L571l77K895j845j1021j3612o3O972
$$ -7298 8247 22342 8869 4322 6810 9351 12922 12545 15440 13595 2574 -11038 -11101 -4129
24472d129M866p429L122R569m750o352J654N682L692p46j3792o86L705K59m79
$$ -4129 737 -6692 -3570 5999 1249 -5103 -3449 2233 5925 5179 -8613 -9299 -5594 -5335 -5814
24457e814P443oR457L27q027M986m056n777K085P800N348p378j3291J640O172
$$ -5814 1629 1623 11080 11407 3380 8366 4310 -1467 618 8418 13766 6388 -6903 -5263 909
24442I09p728k043O898J2630M52j404n192m912R031l218o037P902J0095q564q286
$$ 909 -6819 -8862 -1964 10666 11118 9714 4522 -390 8641 5423 -614 7288 17383 8819 533
24427E33k585j847n568Q518O581O105n753k606J508J3613O528o493m454k477J078
$$ 533 -2052 -3899 -9467 -949 5632 11737 5984 3378 4886 18499 25027 18534 14080 11603 12681
24412A2681n037j1938O17K941M758N770j429m891k973n037L382P22J425N135m715
$$ 12681 7644 -4294 -3677 -736 4022 9792 8363 3472 499 -4538 -1156 -434 991 6126 1411
24397A411p35n96k048p40J0279k941n027m034j350K617K466K01M938M664o006
$$ 1411 676 80 -1968 -2708 7571 4630 -397 -4431 -5781 -3164 -698 -497 4441 9105 3099
24382C099k060N60J17P84J120j544n728N183k339m377P544O427j655J0873K9q538
$$ 3099 1039 1599 1716 2500 3620 2076 -3652 1531 -808 -5185 2359 8786 7131 18004 18033 9495
24366I495m543m603O69J4625l13j3070l942m688k393J0256P230K279q814r115
$$ 9495 4952 349 1018 15643 15330 2260 -1682 -6370 -8763 1493 8723 11002 2188 -6927
24352f927N141J69k156L228Q631N900k224n511J902j948m566M662J4607R091j6495
$$ -6927 -1786 -1617 -3773 -545 8086 13986 11762 6251 8153 6205 1639 6301 20908 29999 13504
24337A3504o621m491J244n383L343K522m051P62K702J053K31J740L602O146r5
$$ 13504 6883 2392 3636 -1747 1596 4118 67 829 3531 4584 4815 6555 10157 16303 16208
24322A6208j4982m073j430N644m929J86l739J571J868N374K088l310r388K947
$$ 16208 1226 -2847 -4277 1367 -3562 -3376 -7115 -5544 -3676 1698 3786 476 -8912 -5965
24308e965m202P94L499L377J55m904J242l502L743m600R743M423p20l654l703
$$ -5965 -10167 -9373 -5874 -2497 -2342 -7246 -6004 -9506 -5763 -10363 -620 3803 3083 -571 -4274
24293d274l981q47K608M693p213J2392L290J906o269l829j908k992m05M194J113
$$ -4274 -8255 -9102 -6494 -1801 -9014 3378 6668 8574 2305 -1524 -3432 -6424 -6829 -2635 -1522
24278a522j080r729k32J757K25p991L238J1765j189J039m317n377m473q679P360
$$ -1522 -2602 -12331 -12563 -10806 -10581 -18572 -15334 -3569 -4758 -3719 -8036 -13413 -17886 -26565 -19205
24263a9205J3162O643J0609K47K639j633j9090n933Q078N436P313O38k178o18
$$ -19205 -6043 600 11209 11456 14095 12462 -6628 -12561 -4483 953 8266 8904 6726 6108
24249F108o104N675L788j790L18p727p05N035J051M039n627m727k010P364m104
$$ 6108 4 5679 9467 7677 7995 268 -437 4598 5649 9688 4061 -666 -2676 4688 584
24234E84j1331q821m58k261P682Q117K4640J3353N800J1571P04j807p58m38j897
$$ 584 -10747 -19568 -20026 -22287 -14605 -6488 18152 31505 37305 48876 49580 47773 47015 46577 44680
24219D4680l311q826r418L598o899j1456n493l844n198l957l269m608k544l513
$$ 44680 41369 32543 23125 26723 19824 8368 2875 -969 -6167 -10124 -13393 -18001 -20545 -24058
24205b4058j0936j2555J2091J5422Q247P961J1173J2302R418J3739J4870R247
$$ -24058 -34994 -47549 -35458 -20036 -11789 -3828 7345 19647 29065 42804 57674 66921
24193F6921q318r160j390j6930j5167j3001j7041n314k980j0682n905L355R756
$$ 66921 58603 49443 48053 31123 15956 2955 -14086 -19400 -22380 -33062 -38967 -35612 -25856
24180b5856O956l074K210P446K913J106K25l901J079m388n192r23O828M42M686
$$ -25856 -18900 -21974 -19764 -12318 -9405 -8299 -8074 -11975 -10896 -15284 -20476 -21399 -14571 -14129 -9443
24165i443M335R745j171q510k602j202O919O829l45o902j1713q131P47J1560R433
$$ -9443 -5108 4637 3466 -5044 -7646 -8848 -1929 4900 4555 -2347 -14060 -22191 -21444 -9884 -451
24150d51J763r32O429L204N196N167J461J983N179l5j5536j3268r700j903l755
$$ -451 1312 380 6809 10013 15209 20376 21837 23820 28999 28964 13428 160 -9540 -11443 -15198
24135a5198K75N469J2369O399L213j3153m420m391k727L500Q040L763o925L270
$$ -15198 -14923 -9454 2915 9314 12527 -626 -5046 -9437 -12164 -8664 -624 3139 -3786 -516
24121e16J0995P366J273j377o5O496l987n409p631m366o919m76n961j0376l078
$$ -516 10479 17845 19118 17741 17676 24172 20185 14776 7145 2779 -4140 -4616 -10577 -20953 -24031
24106b4031R258J4871R678j0100r122J824q65L975o90j229J539J097O885N323
$$ -24031 -14773 98 9776 -324 -9446 -7622 -8487 -4512 -5202 -6431 -4892 -3795 3090 8413
24092H413L514k514l065R01J483n262q304m719M434K516M730n142l449l510k116
$$ 8413 11927 9413 6348 7249 8732 3470 -4834 -9553 -5119 -2603 2127 -3015 -6464 -9974 -12090
24077a2090q26L600K035J2891j364p584l481j740M163Q229M529l587n608j1137
$$ -12090 -12916 -9316 -7281 5610 4246 -3338 -6819 -8559 -4396 3833 8362 4775 -833 -11970
24063a1970L493l287K719J5621J0919m202q967k872J044K059M543r88Q015L203
$$ -11970 -8477 -11764 -9045 6576 17495 13293 4326 1454 2498 4557 9100 8112 16127 19330
24049A9330m423n555O55n24J871k745J904j2709j3035l648K214J2349P535l310
$$ 19330 14907 9352 10007 9483 11354 8609 10513 -2196 -15231 -18879 -16665 -4316 3219 -91
24035i1J388N690L917n404J649r781N07J894L999r092R301R981M094J147n932
$$ -91 1297 6987 10904 5500 7149 -2632 -2125 -231 3768 -5324 3977 13958 18052 19199 13267
24020A3267p142q625P07K588K816k364O257k167k214L800m946m212l822L948P368
$$ 13267 6125 -2500 -1793 795 3611 1247 7504 5337 3123 6923 1977 -2235 -6057 -2109 5259
24005E259N336r481K67M361k324k71J29N000L816Q16r325p338m674l209J1801
$$ 5259 10595 1114 1381 5742 3418 3147 3276 8276 12092 12908 3583 -3755 -8429 -11638 163
23990A63J2184j619j511n494n637m562J083p144r276R836J0556m015l686P699
$$ 163 12347 10728 9217 3723 -1914 -6476 -5393 -12537 -21813 -11977 -1421 -5436 -9122 -1423
23976a423j660j064Q2p845P48r12k62L537J2946N430M68j495j335j2823J473m633
$$ -1423 -3083 -4147 -4065 -11910 -11162 -12074 -12336 -8799 4147 9577 10045 8550 7215 -5608 -4135 -8768
23960h768m887R349J935L462j460K695J0766Q188j107j0539L565N839L858k586
$$ -8768 -13655 -4306 -2371 1091 -369 2326 13092 21280 20173 9634 13199 19038 22896 20310
23946B0310j0163j547N709J0627O188J53J48p813o815k743l66j6661j2297N396
$$ 20310 10147 8600 14309 24936 31124 31277 31425 23612 16797 14054 13688 -2973 -15270 -9874
23932i874R820j107k2L449Q056R335n228r560P107J0173q973k013r675l306n015
$$ -9874 -54 -1161 -1183 2266 10322 19657 14429 4869 11976 22149 13176 11163 1488 -1818 -6833
23917f833K630N228j0798q829J29K967O304M339j200O034P569N800r78m21o921
$$ -6833 -4203 1025 -9773 -18602 -18473 -15506 -9202 -4863 -6063 -29 7540 13340 12362 11941 5020
23902E020j781K640K628R812m96n34M726K384L072j6029k175J915R161n824k865
$$ 5020 3239 5879 8507 18319 17823 17289 22015 24399 27471 11442 9267 11182 20343 14519 11654
23887A1654m232j0015k257M633J0273J0313r112j3320j0134P6J0888K032k619
$$ 11654 7422 -2593 -4850 -217 10056 20369 11257 -2063 -12197 -12121 -1233 799 -1820
23874a820k243Q061n285n195K075j289N149o17k492k298M630N488m638m533J2032
$$ -1820 -4063 3998 -1287 -6482 -4407 -5696 -547 -1164 -3656 -5954 -1324 4164 -474 -5007 7025
23859G025J5360k253j1770j816j987l163K358J522j194j592K8M139o080l229r88
$$ 7025 22385 20132 8362 6546 4559 1396 3754 5276 4082 2490 2518 6657 577 -2652 -3640
23844c640K155j297M788J15k714O808K831m470l406j715N970o80n852J560O00
$$ -3640 -1485 -2782 2006 2121 -593 6215 9046 4576 1170 -545 5425 4745 -1107 453 1053
23829A053R462o526j941J225k30n575J0647P272q788m333K895J121m841m587m363
$$ 1053 10515 3989 2048 3273 3043 -2532 8115 15387 6599 2266 5161 6282 1441 -3146 -7509
23814g509L740Q419l281m2L006J320k310n420J298n49M120M482o862r598L233
$$ -7509 -3769 4650 1369 1327 4333 5653 3343 -2077 -779 -1328 2792 7274 412 -9186 -5953
23799e953J2531l715r850L799N021k329l3l259N526K078M878k589j546j14n653
$$ -5953 6578 2863 -6987 -3188 1833 -496 -529 -3788 1738 3816 8694 6105 4559 4445 -1208
23784a208N37P451J1226P765l675L561k147l127m587q32l63m1l817p421N540K665
$$ -1208 -671 6780 18006 25771 22096 25657 23510 20383 15796 14964 14601 14560 10743 3322 8862 11527
23768A1527P153m351j807L189l353o828j1337O57k784l819J456Q511Q297r413
$$ 11527 18680 14329 12522 15711 12358 5530 -5807 -5150 -7934 -11753 -10297 -1786 6511 -2902
23754b902K805o01M416N595M647k341o314n387L259M440R18M446K128l650l052
$$ -2902 -97 -698 3718 9313 13960 11619 5305 -82 3177 7617 8535 12981 15109 11459 8407
23739H407Q725N557l360M417l751j923O961K2j613k477M913M547p423r795n855
$$ 8407 17132 22689 19329 23746 19995 18072 25033 25055 23442 20965 25878 30425 23002 13207 7352
23724G352o785K595m95j449P220m595j815N139P5l984o446Q984q626j5335l286
$$ 7352 567 3162 2667 1218 8438 3843 2028 7167 7242 3258 -3188 5796 -2830 -18165 -21451
23709b1451J7305O070j0586k729l195M91J926P656k284P872M112l823m114O056
$$ -21451 -4146 1924 -8662 -11391 -14586 -14095 -12169 -4513 -6797 1075 5187 1364 -2750 3306
23695C306K441j444m45p409p08M226K575n286j67l88N512Q304J038J0584j720
$$ 3306 5747 4303 3858 -3551 -4259 -33 2542 -2744 -2911 -3299 2213 10517 11555 22139 20419
23680B0419q434l439M350J4003M861p486j7187j1903N270N448j3446r707m202
$$ 20419 11985 8546 12896 26899 31760 24274 7087 -4816 454 5902 -7544 -17251 -21453
23667b1453N013M911Q868N79m601J2328J4055k561j0091n713l213o731K89J1982
$$ -21453 -16440 -11529 -2661 -2082 -6683 5645 19700 17139 7048 1335 -1878 -8609 -8320 3662
23653C662R050Q252l546p914J85m163p208J908j811L400O309M312K197j797p5
$$ 3662 12712 20964 17418 9504 9689 5526 -1682 226 -1585 1815 8124 12436 14633 12836 12761
23638A2761k112r518n082l314j570M60J043O930L093L173L863N445n63j6911N41
$$ 12761 10649 1131 -3951 -7265 -8835 -8375 -7332 -402 2691 5864 9727 15172 14609 -2302 -1761
23623a761p61M55k341O208p279m488k859m102O592J3992n883k0J535j467L013
$$ -1761 -2522 -2067 -4408 1800 -5479 -9967 -12826 -16928 -10336 3656 -2227 -2247 -712 -2179 834
23608H34K334J565k142J019k241L213k824k532R83L368q339J951K381k150M983
$$ 834 3168 4733 2591 3610 1369 4582 1758 -774 209 3577 -4762 -2811 -430 -2580 2403
23593B403K11J097K091n922J654L942q60m109j124l474N336J814r287r35L032
$$ 2403 2614 3711 5802 -120 1534 5476 4616 507 -617 -4091 1245 3059 -6228 -7163 -4131
23578d131p772p246q30M046J4835J3897o514o926P05N531m689k383l669P06J0418
$$ -4131 -11903 -19149 -19979 -15933 -1098 12799 6285 -641 64 5595 906 -1477 -5146 -4440 5978
23563E978K587N880M173j2166k661l116o568l490o349J2740J0290J341n316Q77
$$ 5978 8565 14445 18618 6452 3791 675 -5893 -9383 -15732 -2992 7298 8639 3323 4200
23549D200p066M936J377k076K467K09m466k483N417K229L800o422O190j996K907
$$ 4200 -2866 2070 3447 1371 3838 4047 -419 -2902 2515 4744 8544 2122 8312 6316 9223
23534I223q38J157J0949M601q517q816n636j046m135r561k768L602k947j0597
$$ 9223 8385 9542 20491 25092 16575 7759 2123 1077 -3058 -12619 -15387 -11785 -14732 -25329
23520b5329J7527J2029l895p560m357O631N340N367j699J438r46m857M340O737
$$ -25329 -7802 4227 332 -7228 -11585 -4954 386 5753 4054 5492 4546 -311 4029 10766
23506A0766j6235n048R111M121l977j7423l720M096M658L904K813m477K809j833
$$ 10766 -5469 -10517 -1406 2715 -1262 -18685 -22405 -18309 -13651 -9747 -6934 -11411 -8602 -10435
23492a0435j072J270n669J1145K0455K060J908K676L05n059j2620J207R611j882
$$ -10435 -11507 -10237 -15906 -4761 15694 17754 19662 22338 22643 17584 4964 6171 15782 13900
23478A3900r45o273q935K011K279m54r702p354O449R648k28j749p414J341K134
$$ 13900 12955 6682 -2253 -242 2037 1583 -8119 -15473 -9024 624 396 -1353 -8767 -7426 -5292
23463e292k502J273K313n928j745r41n52J4666L775l724j718L077l868o834K149
$$ -5292 -7794 -6521 -4208 -10136 -11881 -12822 -13374 1292 5067 1343 -375 2702 -1166 -8000 -5851
23448e851K384m544l18o61K561P425N864L084o261l879k868L150K097L105M29
$$ -5851 -3467 -8011 -8329 -8990 -6429 996 6860 9944 3683 -196 -3064 86 2183 5288 5717
23433E717l201P86j3446n261J419K265Q942Q362L064R597p51r164n272j498M630
$$ 5717 2516 3302 -10144 -15405 -13986 -11721 -2779 5583 8647 18244 17493 8329 3057 1559 6189
23418F189J2408q709p006M178n197l385N64k709j619J34k042M538m41k462l229
$$ 6189 18597 9888 2882 7060 1863 -1522 -958 -3667 -5286 -5152 -7194 -2656 -3097 -5559 -8788
23403h788L094P520q84p69j0179r29k843L292M983L962Q325J284j362m825N985
$$ -8788 -5694 1826 942 173 -10006 -10935 -13778 -10486 -5503 -1541 6784 8068 6706 1881 7866
23388G866K267N473M95l427j3143J1517M066j1982L01M404J688L084Q10m878l175
$$ 7866 10133 15606 16101 12674 -469 11048 15114 3132 3433 7837 9525 12609 13419 8541 5366
23373E366K389K104J233M757L157K2k837L371P73j3690j066N967p700q31M644
$$ 5366 7755 9859 11092 15849 19006 19028 16191 19562 20335 6645 5579 11546 3846 3015 7659
23358G659j219O845L796j698m102k504l234k119K059L713O259J887j1830j813
$$ 7659 6440 13285 17081 15383 11281 8777 5543 3424 5483 9196 15455 17342 5512 3699
23344C699p471J620M873J868K784J028r902J193J636J382N552k152j0166J288
$$ 3699 -3772 -2152 2721 4589 7373 8401 -1501 -308 1328 2710 8262 6110 -4056 -2768
23330b768K726N518k642l477P087n042o037K150j2929J432M933K541K669N572
$$ -2768 -42 5476 2834 -643 6444 1402 -4635 -2485 -15414 -13982 -9049 -6508 -3839 1733
23316A733Q258O291j0889l31K833J914q72m066j573l836J228n124n67L130J542
$$ 1733 9991 16282 5393 5062 7895 9809 8937 4871 3298 -538 690 -4434 -5001 -1871 -329
23301c29r77l658L842L206k681j187J579M785o32m965m477J819J851p187r18J020
$$ -329 -1306 -4964 -1122 2084 -597 -1784 -205 4580 3948 -1017 -5494 -3675 -1824 -9011 -9929 -8909
23285h909J070R318Q133o608r035L563P480L106r757N309K789K510k638n6j204
$$ -8909 -7839 1479 9612 3004 -6031 -2468 5012 8118 -1639 3670 6459 8969 6331 6275 5071
23270E071o920m280J732L461N482L462J1248N828n098j4329j0821M552j02O1J2267
$$ 5071 -1849 -6129 -4397 -936 4546 8008 19256 25084 19986 5657 -5164 -612 -714 -653 11614
23255A1614j727r11k594K157k41j0644p345k329k058N914o43m656j227j70l741
$$ 11614 9887 8976 6382 8539 8298 -2346 -9691 -12020 -14078 -8164 -8807 -13463 -14690 -14860 -18601
23240a8601O806L929k23P410N571l657j1112o00p42p54j575o71J3756O51o26k191
$$ -18601 -11795 -7866 -8089 -679 4892 1235 -9877 -10477 -11219 -11973 -13548 -14219 -463 188 -438 -2629
23224b629o27j326l191P26J748k319n217P754P928J087O249Q399K28m893k937
$$ -2629 -3256 -4582 -7773 -7047 -5299 -7618 -12835 -5081 2847 3934 10183 18582 18810 13917 10980
23209A0980L204L119m259j1234q265N779Q429M551q12l11l009o485P581J452j1798
$$ 10980 14184 17303 13044 1810 -6455 -676 7753 12304 11492 11181 8172 1687 9268 10720 -1078
23194a078J06P975j771k858m6L51K195J073p004J803N102k124l405L501k78N325
$$ -1078 -972 7003 5232 2374 2328 2679 4874 5947 -1057 746 5848 3724 319 3820 3542 8867
23178H867O526j0090j1635k058O097M677j905r939J038L047L039J439k833j9K85
$$ 8867 15393 5303 -6332 -8390 -2293 2384 479 -9460 -8422 -5375 -2336 -897 -3730 -3749 -3464
23163c464j834j3748M168K818j365J0269m224J460Q057J102j212N773n117l38
$$ -3464 -5298 -19046 -14878 -12060 -13425 -3156 -7380 -5920 2137 3239 2027 7800 2683 2345
23149B345K977J769l133O429J307k454q599o071p686J0585J0276n583o897R564
$$ 2345 5322 7091 3958 10387 11694 9240 641 -5430 -13116 -2531 7745 2162 -4735 4829
23135D829P526k125m390l618o751K268R57p441k597L229j550j693k99K691j815
$$ 4829 12355 10230 5840 2222 -4529 -2261 -1304 -8745 -11342 -8113 -9663 -11356 -11655 -8964 -10779
23120a0779j68N660M97R555N944K055m800j9159r896M305J0644L046K053J291
$$ -10779 -10947 -5287 -4790 4765 10709 12764 7964 -11195 -21091 -16786 -6142 -3096 -1043 248
23106B48j0940l45p479o554O578J4177M509m540j0943r286M809O365J6575K296
$$ 248 -10692 -11037 -18516 -25070 -18492 -4315 194 -4346 -15289 -24575 -19766 -13401 3174 5470
23092E470j043J1441J261j870m556j1869L828m998q763M513R983M06o999r90p48
$$ 5470 4427 15868 17129 15259 10703 -1166 2662 -2336 -11099 -6586 3397 3803 -3196 -4186 -4934
23077d934r650o50J3366P454m562j3251j279n474J14O128j957j281l628O035O159
$$ -4934 -14584 -15234 -1868 5586 1024 -12227 -13506 -18980 -18866 -12738 -14695 -15976 -19604 -13569 -7410
23062g410j81J623p651P045j982o132K83O83l613L64J2173M067K456l453j0450
$$ -7410 -7591 -5968 -13619 -6574 -8556 -14688 -14405 -13722 -17335 -16971 -4798 -731 1725 -1728 -12178
23047a2178n426J231O232j041j706R981P314J2089o561n796n877k888Q066K935
$$ -12178 -17604 -16373 -10141 -11182 -12888 -2907 4407 16496 9935 4139 -1738 -4626 3440 6375
23033F375n310q80j880j566q228L553K274Q262n431P426R704j773r372K113p023
$$ 6375 1065 185 -1695 -3261 -11489 -7936 -5662 2600 -2831 4595 14299 12526 3154 5267 -1756
23018a756m579P351M944J702J886m010r100k802j179k824L793O398K324K60Q01
$$ -1756 -6335 1016 5960 7662 9548 5538 -3562 -6364 -7543 -10367 -6574 -176 2148 2408 3209
23003C209K419o08K086J0795o510k230p620j673n114n00J901J379l476M912j2338
$$ 3209 5628 5020 7106 17901 11391 9161 1541 -132 -5246 -5746 -3845 -2466 -5942 -1030 -13368
22988a3368R51K685O479K855j901p23r97q689J174L216M608N700L273n536J99
$$ -13368 -12417 -9732 -3253 -398 -2299 -3022 -4019 -12708 -11534 -8318 -3710 1990 5263 -273 -74
22973g4o46m570j2135J0955J3736O797r567o502n278j108l581L493O098L221K927
$$ -74 -720 -5290 -17425 -6470 7266 14063 4496 -2006 -7284 -8392 -11973 -8480 -2382 839 3766
22958C766k065m130K859P62R073j669n617O87j534m348o679k748R612J935J136
$$ 3766 1701 -2429 430 1192 10265 8596 2979 3666 2132 -2216 -8895 -11643 -2031 -96 1040
22943A040J045n292n870n389n086L571L074R585J6339J2558N553j2449j2854r171
$$ 1040 2085 -3207 -9077 -14466 -19552 -15981 -12907 -3322 13017 25575 31128 18679 5825 -3346
22929c346L938l185p86P344j9m488n130R074R531J976j1520L404L960q971j3725
$$ -3346 592 -2593 -3379 3965 3946 -542 -5672 3402 12933 14909 3389 6793 10753 1782 -11943
22914a1943M225J3288l191p082M013K887q117q29k677P327K574J367j229P97l474
$$ -11943 -7718 5570 2379 -4703 -690 2197 -5920 -6749 -9426 -2099 475 1842 613 1410 -2064
22899b064r424O632J0317n928r290m553Q098O961k849J125J4566K241j511j417
$$ -2064 -11488 -4856 5461 -467 -9757 -14310 -6212 749 -2100 -975 13591 15832 14321 12904
22885A2904j615Q396N1l882l775l449n724M128M33m846o324j873k529m946M159
$$ 12904 11289 19685 19736 15854 12079 8630 2906 7034 7467 2621 -3703 -5576 -8105 -13051 -8892
22870h892R535M179K821m984j0042J387J161J495j163k898J0554K594j104j1139
$$ -8892 643 4822 7643 2659 -7383 -5996 -4835 -3340 -4503 -7401 3153 5747 4643 -6496
22856f496j860J7233l502q518m52M057M399O422k976j1858J530j1137p553Q42
$$ -6496 -8356 8877 5375 -3143 -3595 462 4861 11283 8307 -3551 -2021 -13158 -20711 -19869
22842a9869J753J0921Q199O977L619l139p23O581O524o488j0466m423k137Q149
$$ -19869 -18116 -7195 1004 7981 11600 8461 7738 14319 20843 14355 3889 -534 -2671 5478
22828E478k694o36j178k594m356L122M405P296j0474O047L841L406k609p785l999
$$ 5478 2784 2148 970 -1624 -5980 -2858 1547 8843 -1631 4416 8257 11663 9054 1269 -2730
22813b730J2414P472j0081j1709P423J819R643M348K579j000o940o743M299O105
$$ -2730 9684 17156 7075 -4634 2789 4608 14251 18599 21178 20178 13238 6495 10794 16899
22799A6899l864j1682j6803j179K8j185K203Q083m114m727p24O952L255R566O372
$$ 16899 13035 1353 -15450 -16629 -16601 -17786 -15583 -7500 -11614 -16341 -17065 -10113 -6858 2708 9080
22784I080p379q398j6133n414K915R716R290K755O478j657p228J677Q315j361
$$ 9080 1701 -6697 -22830 -28244 -25329 -15613 -6323 -3568 2910 1253 -5975 -4298 4017 2656
22770B656l689r344O390O281m709q058J1411L738m813n406M648O80P02J772j727
$$ 2656 -1033 -10377 -3987 2294 -2415 -10473 938 4676 -137 -5543 -895 -215 487 2259 532
22755E32p490k49n079J492p116m464O101l070O272K371j737p366L270Q540O547
$$ 532 -6958 -7207 -12286 -10794 -17910 -22374 -16273 -19343 -13071 -10700 -12437 -19803 -16533 -7993 -1446
22740a446K945l331n632k906q9M765j797k115N783Q474j601o86m174K755L845
$$ -1446 1499 -1832 -7464 -10370 -10459 -5694 -7491 -9606 -3823 4651 3050 2364 -1810 945 4790
22725D790Q046r450n929m11n259Q060R510j0100l794j436K176R251O173p702n510
$$ 4790 12836 3386 -2543 -2954 -8213 -153 9357 -743 -4537 -5973 -3797 5454 11627 3925 -1585
22710a585R51R265L790Q13k045n005l045O84O060k431q355n903J2732Q659o006
$$ -1585 -634 8631 12421 13234 11189 6184 3139 3823 9883 7452 -903 -6806 5926 14585 8579
22695H579O06j65K439L997J087l772l513N019O206j1015p093j899j350l628O324
$$ 8579 9185 9020 11459 15456 16543 12771 9258 14277 20483 9468 2375 476 -874 -4502 1822
22680A822P409l932j0609J932J2458N593q341r988k723O68P600J0445O229P587
$$ 1822 9231 5299 -5310 -3378 9080 14673 6332 -3656 -6379 -5711 1889 12334 18563 26150
22666B6150j537p117n848n058l542j700M2j085m291j1280N080J1871O495J0328
$$ 26150 24613 17496 11648 6590 3048 1348 1390 305 -3986 -15266 -10186 1685 8180 18508
22652A8508J871r728l078J925j611J502n443J742j244k250L674K753O69q28k080
$$ 18508 20379 10651 7573 9498 7887 9389 3946 5688 4444 2194 5868 8621 9290 8462 6382
22637F382P45n318k508J621M226J663n501M028q15n245J94J622J85K542k991M689
$$ 6382 7127 1809 -699 922 5148 6811 1310 5338 4523 -722 -528 1094 1279 3821 830 5519
22621E519j10O814N154n959j4396k851r842J3599Q340P086j851N175J0043m934
$$ 5519 5409 12223 17377 11418 -2978 -5829 -15671 -2072 6268 13354 11503 16678 26721 21787
22607B1787l475o232r497L161J675j150Q608P422q097j081k206n605K290k599
$$ 21787 18312 12080 2583 5744 7419 6269 14877 22299 14202 13121 10915 5310 7600 5001
22593E001K980K50m855j629J0271Q73j174N168n195p81p339P0K608n530j701J6224
$$ 5001 7981 8231 3376 1747 12018 12891 11717 16885 11690 10909 3570 3640 6248 718 -983 15241
22577A5241J444j8912j8240o261J3947J4045J630l921L444j146r747l111M358
$$ 15241 16685 -2227 -20467 -26728 -12781 1264 2894 -1027 2417 1271 -8476 -11587 -7229
22564g229K320N466k720L187J2584O581o430N220j1468o640J450k590K905J4O114
$$ -7229 -4909 557 -2163 1024 13608 20189 13759 18979 7511 871 2321 -269 2636 2650 8764
22549H764l884m651J331J549k578l414J660N50R02R885J7945j0825j5824Q134
$$ 8764 4880 229 1560 3109 531 -2883 -1223 -673 229 10114 28059 17234 1410 9544
22535I544N086K454j4094q018L750l278j34j557J919p26M161J273O37J1348Q089
$$ 9544 14630 17084 2990 -5028 -1278 -4556 -4690 -6247 -4328 -5054 -893 380 1017 12365 20454
22520B0454j1046j101j1026l658j438l45K266J385o029O168R724J12j899j631
$$ 20454 9408 8307 -2719 -6377 -7815 -8160 -5894 -4509 -10538 -4370 5354 5466 3567 1936
22506A936K344M835j931l729o047P47J3284k470q522k614L126M774L737m723k264
$$ 1936 4280 9115 7184 3455 -2592 -1845 11439 8969 447 -2167 959 5733 9470 4747 2483
22491B483n517l149m143M140O2N947J0117K773o208j0533k809J073k10O370L887
$$ 2483 -3034 -6183 -10326 -6186 -6124 -177 9940 12713 6505 -4028 -6837 -5764 -5974 396 4283
22476D283j434P219o68q006o265P89O14J525l89M529O051M395K199l363P344l740
$$ 4283 2849 10068 9400 1394 -4871 -4082 -3468 -1943 -2332 2197 8248 12643 14842 11479 18823 15083
22460A5083q199j50j954k693l095p59M990k892p657q67m714L635J506P92n094
$$ 15083 6884 6734 4780 2087 -1008 -1767 3223 331 -7326 -8193 -12907 -9272 -7766 -6974 -12068
22445a2068K343J2068J1371q738k274Q470n479k311k851P990R38j0618j3106Q376
$$ -12068 -9725 2343 13714 4976 2702 11172 5693 3382 531 8521 9459 -1159 -14265 -5889
22431e889P548j651k923N91P141Q684J595j031M089L422j429q232k413j387n378
$$ -5889 1659 8 -2915 -2324 4817 13501 15096 14065 18154 21576 20147 11915 9502 8115 2737
22416B737p220j0086k909O19p99J046P332J5649J662k543p189K918m9q0l772n22
$$ 2737 -4483 -14569 -17478 -16859 -17658 -16612 -9280 6369 8031 5488 -1701 1217 1168 1088 -2684 -3206
22400c206N580M647k860j087J696n383J361N695j1278L482p91o298K892k717o19
$$ -3206 2374 7021 4161 3074 4770 -613 748 6443 -4835 -1353 -2144 -8442 -5550 -8267 -8886
22385h886J2721N885p81j256L584r484p731l083K239q52N975J649j892p198r805
$$ -8886 3835 9720 8939 7683 11267 1783 -5948 -9031 -6792 -7644 -1669 -20 -1912 -9110 -18915
22370a8915k422p09O782R870N312J310n945J716N193k653J0123P025o123n920
$$ -18915 -21337 -22046 -15264 -5394 -82 1228 -4717 -3001 2192 -461 9662 16687 10564 4644
22356D644j1682J364L829J1635N643l269l661L28k088l684L064j648L241k817
$$ 4644 -7038 -5674 -1845 9790 15433 12164 8503 8831 6743 3059 6123 4475 7716 4899
22342D899Q25j975L738K094K972m561o688J826O559N275K504L780o099k134l556
$$ 4899 5724 3749 7487 9581 12553 7992 1304 3130 9689 14964 17468 21248 15149 13015 9459
22327I459q793J0740m501m382m737L181J285M173j157k833p152m882P273P439
$$ 9459 666 11406 6905 2523 -2214 967 2252 6425 5268 2435 -4717 -9599 -2326 5113
22313E113K506K106l989K777n121o393J192k095r495r157K406K438p714Q932P142
$$ 5113 7619 9725 5736 8513 3392 -3001 -1809 -3904 -13399 -22556 -20150 -17712 -25426 -16494 -9352
22298i352m258L052K301j813k315k528M790m42N08M479m046L257k957n591M138
$$ -9352 -13610 -10558 -8257 -10070 -12385 -14913 -10123 -10565 -10057 -5578 -9624 -6367 -9324 -14915 -10777
22283a0777P213j814K9J0483K060o016N34O63J1811Q252n180p236L261n299J148
$$ -10777 -3564 -5378 -5349 5134 7194 1178 1712 2375 14186 22438 17258 10022 13283 7984 9132
22268I132M38m671j0847l526m107r122R103J2826J0034n789J25O352K012Q91n854
$$ 9132 9570 4899 -5948 -9474 -13581 -22703 -13600 -774 9260 3471 3596 9948 11960 12851 6997
22253F997p369n891N494K597k022q247J444N404l36n09Q44k033k179L951K790
$$ 6997 -372 -6263 -769 1828 -194 -8441 -6997 -1593 -1929 -2438 -1594 -3627 -5806 -1855 935
22238I35p829j410L570L801J53M965o236J667k944m156K345m335M214K692J333
$$ 935 -6894 -8304 -4734 -933 -780 4185 -2051 -384 -3328 -7484 -5139 -9474 -5260 -2568 -1235
22223a235k753o285M705n328o25P929M914J401l146O194p306j383P715l596m471
$$ -1235 -3988 -10273 -5568 -10896 -11521 -3592 1322 2723 -423 5771 -1535 -2918 4797 1201 -3270
22208c270J468R25l642j1758K335K859O477L801L050k41J4211j694q212p168q759
$$ -3270 -1802 -877 -4519 -16277 -13942 -11083 -4606 -805 2245 2004 16215 14521 6309 -859 -9618
22193i618l010Q795K728k43K926N108L927L506j0266p530j4517O42J3358P535
$$ -9618 -12628 -3833 -1105 -1348 1578 6686 10613 14119 3853 -3677 -18194 -17552 -4194 3341
22179C341N603J897j2630k587k0R829n179m696P042M678j455p680L459k341r594
$$ 3341 8944 10841 -1789 -4376 -4396 5433 254 -4442 2600 7278 5823 -1857 1602 -739 -10333
22164a0333n33R103l011q813j906L069L712J473k37M322J3184n946l953N100J42
$$ -10333 -10866 -1763 -4774 -13587 -15493 -12424 -8712 -7239 -7476 -3154 10030 4084 131 5231 5373
22149E373N462m034o987M62m209l913m748J606j12K700J8M122Q443k384l767l418
$$ 5373 10835 6801 -186 276 -3933 -7846 -12594 -10988 -11100 -8400 -8382 -4260 4183 1799 -1968 -5386
22133e386O135J345j0402j287K039o110j692N804L67M71m425R262N231L365K625
$$ -5386 749 2094 -8308 -9595 -7556 -13666 -15358 -9554 -9187 -8716 -13141 -3879 1352 4717 7342
22118G342p806l640P487p250m191j895l420Q692k645j26L051l966m797M823M022
$$ 7342 -464 -4104 3383 -3867 -8058 -9953 -13373 -4681 -7326 -7452 -4401 -8367 -13164 -8341 -4319
22103d319L498j520k273K502M928m223L647k052j316L316k204j707J7691K137
$$ -4319 -821 -2341 -4614 -2112 2816 -1407 2240 188 -1128 2188 -16 -1723 15968 18105
22089A8105m39l639q766j0533L503N149j041Q27K811k961L328m775L307M208l718
$$ 18105 17666 14027 5261 -5272 -1769 3380 2339 3166 5977 3016 6344 1569 4876 9084 5366
22074E366k839l316k802o452K071J838o449L629M578K58J068o005m016j1504l034
$$ 5366 2527 -789 -3591 -10043 -7972 -6134 -12583 -8954 -4376 -4118 -3050 -9055 -13071 -24575 -27609
22059b7609L035K323n708R020J0323m30L42M076J1891l174o623N936j1195k875
$$ -27609 -24574 -22251 -27959 -18939 -8616 -9046 -8704 -4628 7263 4089 -2534 3402 -7793 -10668
22045a0668J012L246j054M799j823o111j0314J575N086L429k757N38L905K117
$$ -10668 -9656 -6410 -7464 -2665 -4488 -10599 -20913 -19338 -14252 -10823 -13580 -13042 -9137 -7020
22031g020O649P026K209J862m16q69j8582l906J958m136j108K305p447j815N809
$$ -7020 -371 6655 8864 10726 10310 9441 -9141 -13047 -11089 -15225 -16333 -14028 -21475 -23290 -17481
22016a7481K587O517K690k328p370J662K639K582p709P85L864l661L282Q775J6557
$$ -17481 -14894 -8377 -5687 -8015 -15385 -13723 -11084 -8502 -16211 -15426 -11562 -15223 -11941 -3166 13391
22001A3391o001m778l305o221o62K150K109J0877Q093o46M33M276p501j0912n883
$$ 13391 7390 2612 -693 -6914 -7576 -5426 -3317 7560 15653 15007 15440 19716 12215 1303 -4580
21986d580O291J548L669o377p40J661k050M364N819p692p414R224R428Q62L255
$$ -4580 1711 3259 6928 551 -189 1472 -578 3786 9605 1913 -5501 3723 13151 14013 17268
21971A7268K87k507l877l377n259N659M605p947o826J0873P860L165K20l479n865
$$ 17268 17555 15048 11171 7794 2535 8194 12799 4852 -1974 8899 16759 19924 20144 16665 10800
21956A0800j1992J722J613o971M073J6284r431r359K5n350L936O181Q385J2913
$$ 10800 -1192 530 2143 -4828 -755 15529 6098 -3261 -3236 -8586 -4650 1531 9916 22829
21942B2829L173o662l03j682L625j4595o874p137P872n986N85L154J368L164j229
$$ 22829 26002 19340 19037 17355 20980 6385 -489 -7626 246 -5740 -5155 -2001 -633 2531 1302
21927A302j183j3076k965K81K189Q625O886n810r51q647n060L597j0594p862J0861
$$ 1302 119 -12957 -15922 -15641 -13452 -4827 2059 -3751 -4702 -13349 -18409 -14812 -25406 -33268 -22407
21912b2407L460P602n414k649J622J2385R767l606k417k66l569j463k371k538
$$ -22407 -18947 -11345 -16759 -19408 -17786 -5401 4366 760 -1657 -1923 -5492 -6955 -9326 -11864
21898a1864O475K81P80O822n233n811k179k390L626N309k15l388J093N926P522
$$ -11864 -5389 -5108 -4328 2494 -2739 -8550 -10729 -13119 -9493 -4184 -4399 -7787 -6694 -768 6754
21883F754P15r800p451R863p69l236m604N681Q668q05M974l025J0545m88q611
$$ 6754 7469 -2331 -9782 81 -688 -3924 -8528 -2847 5821 5016 9990 6965 17510 17022 8411
21868H411j1228o367N49J1647Q35J701R670O39J561r240l279k433J140N484p55
$$ 8411 -2817 -9184 -8635 3012 3847 5548 15218 15857 17418 8178 4899 2466 3606 9090 8335
21853H335J88m974j0255k310k187j2545M998K629J352J5878p028m99O470L266
$$ 8335 8523 3549 -6706 -9016 -11203 -23748 -18750 -16121 -14769 1109 -5919 -6418 52 3318
21839C318k655J1909o342n432l706L077l130l174N550J1409J37k137m463N085
$$ 3318 663 12572 6230 798 -2908 169 -2961 -6135 -585 10824 10961 8824 4361 9446
21825I446M657o001j3170o71O542L928j488J2989Q91o642q208M278J753p098j411
$$ 9446 14103 8102 -5068 -5739 803 4731 3243 16232 17123 10481 2273 6551 8304 1206 -205
21810b05P533j427n789r268L004N603L171j31N65O254K418o745j036P219K388
$$ -205 7328 5901 112 -9156 -6152 -549 2622 2491 3056 9310 11728 4983 3947 11166 13554
21795A3554L430J159R643l068j0336j4o390M247k641j3182l038J324J095p514
$$ 13554 16984 18143 27786 24718 14382 14368 7978 12225 9584 -3598 -6636 -5312 -4217 -11731
21781a1731l460R638R636j2676n615J724K094p0N470R658M293K386O089o904q020
$$ -11731 -15191 -5553 4083 -8593 -14208 -12484 -10390 -10460 -4990 4668 8961 11347 17436 10532 2512
21766B512l253R101K295p286j426r081j3307q49o242Q972J1379j229p881n70N972
$$ 2512 -741 8360 10655 3369 1943 -7138 -20445 -21294 -27536 -18564 -7185 -8414 -16295 -16865 -10893
21751a0893k010L776R694J486m72q48q335j731m313n15K27O342K832r416j09J1376
$$ -10893 -12903 -9127 567 2053 1581 733 -7602 -9333 -13646 -14161 -13934 -7592 -4760 -14176 -14285 -2909
21735b909Q262m953J798M756O172J810J12p635l794O375L752J681q79J2O468K695
$$ -2909 5353 400 2198 6954 13126 14936 15048 7413 3619 9994 13746 15427 14548 14560 21028 23723
21719B3723r24o678l130L182Q01J250l207j2737o054J301O360J343j331m675n294
$$ 23723 22799 16121 12991 16173 16974 18224 15017 2280 -3774 -2473 3887 5230 3899 -776 -6070
21704f070Q8j069L483R637J1363l232o32P713N443l282O83n54j2234l365M96l503
$$ -6070 -5982 -7051 -3568 6069 17432 14200 13568 21281 26724 23442 24125 23571 11337 7972 8468 4965
21688D965J393j4019m789O563N575K226j1775n22N642N837J1301K09j2189k937
$$ 4965 6358 -7661 -12450 -5887 -312 1914 -9861 -10383 -4741 1096 12397 12606 417 -2520
21674b520J8402J942n139j4319J777N96j36k265j1j34o07j179L51N924K272k997
$$ -2520 15882 17824 12685 -1634 143 739 603 -1662 -1673 -1807 -2414 -3593 -3242 2682 4954 1957
21658A957p073j113J0742q198n436R676L155Q233J332K080K320o129J621n115
$$ 1957 -5116 -6229 4513 -3685 -9121 555 3710 11943 13275 15355 17675 11546 13167 8052
21644H052m985k210j2102p1K3K514k135j3962m127N816j755p47P259R585J0721
$$ 8052 3067 857 -11245 -11316 -11293 -8779 -10914 -24876 -29003 -23187 -24942 -25689 -18430 -8845 1876
21629A876K08j6133K38M007P455j060j4271j965M994O286L628n780n206m478M641
$$ 1876 2084 -14049 -13811 -9804 -2349 -3409 -17680 -19645 -14651 -8365 -4737 -10517 -15723 -20201 -15560
21614a5560P015M842p14M892j5269l56P214n748l31O005k071M540J045j5767n379
$$ -15560 -8545 -3703 -4417 475 -14794 -15150 -7936 -13684 -14015 -8010 -10081 -5541 -4496 -20263 -25642
21599b5642K419O463J4807N001p388N087J1521m1j4190k953R54o933K311m99l404
$$ -25642 -23223 -16760 -1953 3048 -4340 747 12268 12227 -1963 -4916 -3962 -10895 -8584 -9083 -12487
21584a2487o28J470k768k128r45l713R463J4240M508r638L561m965j686q52m40
$$ -12487 -13115 -11645 -14413 -16541 -17486 -21199 -11736 2504 7012 -2626 935 -4030 -5716 -6568 -7008
21569g008L884m883m505K087j851M866J0040O172j387j0401Q1J5018P568K377
$$ -7008 -3124 -8007 -12512 -10425 -12276 -7410 2630 8802 7415 -2986 -2905 12113 19681 22058
21555B2058k598j385J035j3362l261n44n740K971N104K030m355o228q89R846o759
$$ 22058 19460 18075 19110 5748 2487 1943 -3797 -826 4278 6308 1953 -4275 -5164 4682 -2077
21540b077j3762j0977L361J566M648m93J825l426K953O437R259q75l360J472L574
$$ -2077 -15839 -26816 -23455 -21889 -17241 -17734 -15909 -19335 -16382 -9945 -686 -1561 -4921 -3449 125
21525A25M88k566R46k905p152k374Q74Q288L153J52o464L417O613L192q142P6
$$ 125 613 -1953 -1007 -3912 -11064 -13438 -12564 -4276 -1123 -971 -7435 -4018 2595 5787 -2355 -2279
21509b279r290J591q8P498Q061p019n220P825O263l130p150m199J1703Q377N965
$$ -2279 -11569 -9978 -10066 -2568 5493 -1526 -6746 1079 7342 4212 -2938 -7137 4566 12943 18908
21494A8908m65l642p32j120n445j153n861l499j055l56l169K673j020K327P747
$$ 18908 18443 14801 14069 12949 7504 6351 490 -3009 -4064 -4420 -7589 -4916 -5936 -3609 4138
21479D138n323k596K282O254j626j309j5004m744J3771J0597M217l773l087M165
$$ 4138 -1185 -3781 -1499 4755 3129 1820 -13184 -17928 -4157 6440 10657 6884 3797 7962
21465G962J454P89l746j0593l90r605l463J0613Q628N163j0906J920R858L006
$$ 7962 9416 10205 6459 -4134 -4524 -14129 -17592 -6979 1649 6812 -4094 -2174 7684 10690
21451A0690j195p972j0267O9L286J09N179M501o09K714J2690N824o770q217N644
$$ 10690 9495 1523 -8744 -8675 -5389 -5280 -101 4400 3791 6505 19195 25019 18249 10032 15676
21436A5676K311n787k004k085q892o656J0919Q52r362j859K517Q30j268m897n342
$$ 15676 17987 12200 10196 8111 -781 -7437 3482 4334 -5028 -6887 -4370 -3540 -4808 -9705 -15047
21421a5047N758O709R239M249l50m390k959N724j0538K155J553k096P624M256
$$ -15047 -9289 -2580 6659 10908 10558 6168 3209 8933 -1605 550 2103 7 7631 11887
21407A1887K568j1880l772R666O660M635r391J674J194j460P948l45l669m473
$$ 11887 14455 2575 -1197 8469 15129 19764 10373 12047 13241 11781 19729 19384 15715 11242
21393A1242q618K233o25q884J502l476m899J697k603M249J527j2387q721J2773
$$ 11242 2624 4857 4232 -4652 -3150 -6626 -11525 -9828 -12431 -8182 -6655 -19042 -27763 -14990
21379a4990O430M023j0110k924L925J443L221l724L436O996L850m547q869J723
$$ -14990 -8560 -4537 -14647 -17571 -13646 -12203 -8982 -12706 -9270 -2274 1576 -2971 -11840 -10117
21365a0117n389o227J819R331J1539Q928o307p326j428r842m709K40J778l088
$$ -10117 -15506 -21733 -19914 -10583 956 9884 3577 -3749 -5177 -15019 -19728 -19488 -17710 -20798
21351b0798N478R089J1731k225r32q425o768n32K503l803L326K068L627j787N965
$$ -20798 -15320 -6231 5500 3275 2343 -6082 -12850 -13382 -10879 -14682 -11356 -9288 -5661 -7448 -1483
21336a483j963K426J0329k116N145l018j0390m051o285L608N812j966N295r231
$$ -1483 -3446 -1020 9309 7193 12338 9320 -1070 -5121 -11406 -7798 -1986 -3952 1343 -7888
21322g888j3507l475J261P079J887k29L204P680j813M011Q760P841l008j1151
$$ -7888 -21395 -24870 -23609 -16530 -14643 -14872 -11668 -3988 -5801 -1790 6970 14811 11803 652
21308F52n4p160J366O12k088m716l883J2480N05J69L814N529n389P790J2900l212
$$ 652 598 -6562 -5196 -4584 -6672 -11388 -15271 -2791 -2286 -2117 1697 7226 1837 9627 22527 19315
21292A9315p591j4748N186J2438l533q535o531k019M387m516m689O947K290J077
$$ 19315 11724 -3024 2162 14600 11067 2532 -3999 -6018 -1631 -6147 -10836 -3889 -1599 -522
21278e22q4n629J070J00J581j186L654P91p254K959R141J0157k804l043l208j222
$$ -522 -606 -6235 -5165 -5065 -3484 -4670 -1016 -225 -7479 -4520 4621 14778 11974 8931 5723 4501
21262D501J766p633l919j2826P85J8460J2721j290L495j501m186N081r32n449
$$ 4501 6267 -1366 -5285 -18111 -17326 1134 13855 12565 16060 14559 10373 15454 14522 9073
21248I073j0458j2162r139l89j216O068Q379m23L104O555j957J4P617P482M238
$$ 9073 -1385 -13547 -22686 -23075 -24291 -18223 -9844 -10267 -7163 -608 -2565 -2551 5066 12548 16786
21233A6786K423o719j4850o311O066l085N567j913o653k260Q974J0839m382l16
$$ 16786 19209 12490 -2360 -8671 -2605 -5690 -123 -2036 -8689 -10949 -1975 8864 4482 4166
21219D166n435k627J831P735R262J208j4511q655k096L875L393k970l079m63J869
$$ 4166 -1269 -3896 -2065 5670 14932 16140 1629 -7026 -9122 -5247 -1854 -4824 -7903 -8366 -6497
21204f497j0365j984N815M966N629K493k631O75N412J750J560n21p131p816J38
$$ -6497 -16862 -18846 -13031 -8065 -2436 57 -2574 -1899 3513 5263 6823 6302 -829 -8645 -8507
21189h507K295o080L269J1896q10q860j1311L797Q519J3365K045o481o307j601
$$ -8507 -6212 -12292 -9023 2873 2063 -6797 -18108 -14311 -5792 7573 9618 3137 -3170 -4771
21175d771J0122M799l651L263j021O809j161q958L084K668K478p099l604r106
$$ -4771 5351 10150 6499 9762 8741 15550 14389 5431 8515 11183 13661 6562 2958 -6148
21161f148l820J1178R767o555j5981l953K202J303m513n29K339j2377O319J5726
$$ -6148 -9968 1210 10977 4422 -11559 -15512 -13310 -12007 -16520 -17049 -14710 -27087 -20768 -5042
21147e042J5717J877j2495m594J062L573K152l196j5056J548j555l740M417R533
$$ -5042 10675 12552 57 -4537 -3475 98 2250 -946 -16002 -14454 -16009 -19749 -15332 -5799
21133e799J1103M266l344L798r04o602j440k626r574j302Q197J695k907j0820
$$ -5799 5304 9570 6226 10024 9120 2518 1078 -1548 -11122 -12424 -4227 -2532 -5439 -16259
21119a6259K841m542k074J147J4910P075J574J1285Q216j2681n472p244r662l784
$$ -16259 -13418 -17960 -20034 -18887 -3977 3098 4672 15957 24173 11492 6020 -1224 -10886 -14670
21105a4670l902R084L952l631O703J2044O35j2484j4987m482j30L588m948Q952
$$ -14670 -18572 -9488 -5536 -9167 -2464 9580 10215 -2269 -17256 -21738 -21868 -18280 -23228 -14276
21091a4276J1704j840k090K956O065o42o827j372m7m293o652K298M536Q413o430
$$ -14276 -2572 -4412 -6502 -3546 2519 1877 -4950 -6322 -6369 -10662 -17314 -15016 -10480 -2067 -8497
21076h497j144P036P829M242m264n976l402p193r270R14P018R860K063J611O270
$$ -8497 -9641 -2605 5224 9466 5202 -774 -4176 -11369 -20639 -19725 -12707 -2847 -784 827 7097
21061G097K068L940O198j808r419J855l15n031J82K885J296j0035M23j0414q898
$$ 7097 9165 13105 19303 17495 8076 9931 9616 4585 4767 7652 8948 -1087 -664 -11078 -19976
21046a9976j59L789R79n501J0775R567K281p319o956j621J0203l068J5082R903
$$ -19976 -20135 -16346 -15367 -20868 -10093 -526 1755 -5564 -12520 -14141 -3938 -7006 8076 17979
21032A7979n416r42l245j2926m735m356k170M289J6388J2079p102k148j0886N564
$$ 17979 12563 11621 8376 -4550 -9285 -13641 -15811 -11522 4866 16945 9843 7695 -3191 2373
21018B373M161m807q415m573R99k611O766O647N517J082K885Q50n430O421k183
$$ 2373 6534 1727 -6688 -11261 -10262 -12873 -6107 540 6057 7139 10024 10874 5444 11865 9682
21003I682K840p404m869m928O16K611m95k211K424R883j663r567o166q92L915
$$ 9682 12522 5118 249 -4679 -4063 -1452 -1947 -4158 -1734 8149 6486 -3081 -9247 -10139 -6224
20988f224L1K896Q96L693k774J209M993M481L762m004k785j602j2733Q068J2419
$$ -6224 -6193 -3297 -2401 1292 -1482 -273 4720 9201 12963 8959 6174 4572 -8161 -93 12326
20973A2326O505J710k707K509J154p892k228j345o149P65k623m060l820k360j645
$$ 12326 18831 20541 17834 20343 21497 13605 11377 10032 3883 4648 2025 -2035 -5855 -8215 -9860
20958i860j181L411M569l157o47j717k998R244K39L26j275j2417m410J23n532
$$ -9860 -11041 -7630 -3061 -6218 -6865 -8582 -11580 -2336 -2097 -1771 -3046 -15463 -19873 -19750 -25282
20943b5282M832O480Q208N509J447q611r229m46K427J0704K843r15k628j017J0938
$$ -25282 -20450 -13970 -5762 -253 1194 -7417 -16646 -17092 -14665 -3961 -1118 -2033 -4661 -5678 5260
20928E260n731m837L585p708L619R893p802m006m202N263J439K985O602P99L579
$$ 5260 -471 -5308 -1723 -9431 -5812 4081 -3721 -7727 -11929 -6666 -5227 -2242 4360 5159 8738
20913H738L930j1516k337J115l603K877O430K612o506m885k018k17M275n59m909
$$ 8738 12668 1152 -1185 -70 -3673 -796 5634 8246 1740 -3145 -5163 -5380 -1105 -1664 -6573
20898f573J721L764M457J0611L557L10j340n325j238j5412j3685K294P525J4922
$$ -6573 -4852 -1088 3369 13980 17537 17847 16507 11182 9944 -5468 -19153 -16859 -9334 5588
20884E588J0558j239j6614j058P731q23j551n958j871Q523m77M006J658p92j910
$$ 5588 16146 14907 -1707 -2765 4966 4143 2592 -3366 -5237 3286 2809 6815 8473 7681 5771
20869E771l701o622j964L36l495r75l776O211J706L594R538j035m212l998n510
$$ 5771 2070 -4552 -6516 -6180 -9675 -10650 -14426 -8215 -6509 -2915 6623 5588 1376 -2622 -8132
20854h132j637l111q88r42J192L306J1461m63O869J773l552J241j5504k567Q43
$$ -8132 -9769 -12880 -13768 -14710 -13518 -10212 1249 786 7655 9428 5876 7117 -8387 -10954 -10111
20839a0111M061J868j113J334M628Q173M221M582k121j1111J602j466l199k208
$$ -10111 -6050 -4182 -5295 -3961 667 8840 13061 17643 15522 4411 6013 4547 1348 -860
20825h60p07J949k197Q36P039L86L647K298q352j6084j033j845N151Q526M697
$$ -860 -1567 382 -1815 -979 6060 6446 10093 12391 4039 -12045 -13078 -14923 -9772 -1246 3451
20810C451R602M955q91l192k841n373j61J964L59J693j361j1487p250K128R559
$$ 3451 13053 18008 17117 13925 11084 5711 5550 7514 7873 9566 8205 -3282 -10532 -8404 1155
20795A155N13J634j718j3091m466N065J489m647L684L511J568L108M849o164n78
$$ 1155 1668 3302 1584 -11507 -15973 -10908 -9419 -14066 -10382 -6871 -5303 -2195 2654 -3510 -4088
20780d088N58J907Q95J361P00l674L710J428N354J85J827l87J767J550l677J00
$$ -4088 -3530 -1623 -728 633 1333 -2341 1369 2797 8151 8336 10163 9776 11543 13093 9416 9516
20764I516m122j768k203l03N245M637r115K813j916P29K850k195O52j922k662
$$ 9516 5394 3626 1423 1120 6365 11002 1887 4700 2784 3513 6363 4168 4820 2898 236
20749B36N214k952k216m180j537P700j931j4322k55Q240J398m314M216p065k145
$$ 236 5450 2498 282 -3898 -5435 2265 334 -13988 -14243 -6003 -4605 -8919 -4703 -11768 -13913
20734a3913n46l728J241L169K521O536n783N24O772m87n147K069N645O98L184
$$ -13913 -14459 -18187 -16946 -13777 -11256 -4720 -10503 -9979 -3207 -3694 -8841 -6772 -1127 -429 2755
20719B755n27m292n589R734P021k788q042M137M045n026M772J263p828q783j935
$$ 2755 2228 -2064 -7653 2081 9102 6314 -1728 2409 6454 1428 6200 7463 -365 -9148 -11083
20704a1083J567k603O132L57m494m003k244J747J0074K959r86N204L419j2768
$$ -11083 -9516 -12119 -5987 -5630 -10124 -14127 -16371 -14624 -4550 -1591 -2577 2627 6046 -6722
20690f722j2662j253K3154J0989K008o846j2112l52k71L281K502O034P045n24
$$ -6722 -19384 -20637 2517 13506 15514 8668 -3444 -3796 -4067 -786 1716 7750 14795 14271
20676A4271N878K43j3423p830k408M487J0353K366k103l241o723N754M090j3605
$$ 14271 20149 20392 6969 -861 -3269 1218 11571 13937 11834 8593 1870 7624 11714 -1891
20662a891j6501K219M72L919J1135j372j4866k662n13R91K539J4061O97m179l784
$$ -1891 -18392 -16173 -15701 -11782 -647 -2019 -16885 -19547 -20060 -19069 -16530 -2469 -1772 -5951 -9735
20647i735J025L232L592O33j317J416l98p620J683N924R003K651j0066J171J0386
$$ -9735 -8710 -5478 -1886 -1253 -2570 -1154 -1552 -9172 -7489 -1565 7438 10089 23 1194 11580
20632A1580n465q841m078L46J1547L586J600l631M577M373p47j1335o114q47J512
$$ 11580 6115 -2726 -6804 -6458 5089 8675 10275 6644 11221 15594 14847 3512 -2602 -3449 -1937
20617a937m804r57r234j0489J3119P865l510n117M960K866q29r678n832P037J4262
$$ -1937 -6741 -7698 -16932 -27421 -14302 -6437 -9947 -15064 -10104 -7238 -8067 -17745 -23577 -16540 -2278
20602b278R002L768K711j1095L273J0902n763j313j833l123p134q192n205J588
$$ -2278 6724 10492 13203 2108 5381 16283 10520 9207 7374 4251 -2883 -11075 -16280 -14692
20588a4692N87m587j315n77m239M905O130L380m013K57r250j0023M015l056J738
$$ -14692 -14105 -18692 -20007 -20584 -24823 -19918 -13788 -10408 -14421 -14164 -23414 -33437 -29422 -32478 -30740
20573c0740r298j30J9101J6696l787l462M388L263q544o728m24J4192M224M151
$$ -30740 -40038 -40168 -21067 -4371 -8158 -11620 -7232 -3969 -12513 -19241 -19665 -5473 -1249 2902
20559B902l109M791O581J573m673j530M8Q45r485q146m156L173P923N032l27J391
$$ 2902 -207 4584 11165 12738 8065 6535 6583 7428 -2057 -10203 -14359 -11186 -3263 1769 1442 2833
20543B833o7q003j505j84K925n680k022J0236K683M69k008m22O725R51m618j738
$$ 2833 2766 -5237 -6742 -6926 -4001 -9681 -11703 -1467 1216 1685 -323 -745 5980 6931 2313 575
20527E75J867k480q89j3571O8O400j638J091Q032R115M456r879o120l684N250
$$ 575 2442 -38 -927 -14498 -14430 -8030 -9668 -8577 -545 8570 13026 3147 -2973 -6657 -1407
20512a407L253q259M33o00n058k881L73J075K094K123o436J80K240K213K10j4531
$$ -1407 1846 -6413 -5980 -6580 -11638 -14519 -14146 -13071 -10977 -8854 -15290 -15110 -12870 -10657 -10447 -24978
20496b4978k610J2071n584k284J0675Q894m270N988K981J983j905l472L204n783
$$ -24978 -27588 -15517 -21101 -23385 -12710 -3816 -8086 -2098 883 2866 961 -2511 693 -5090
20482e090q146m024k828j172m458k750K493J2262n91Q901J4990l13j0197j0010
$$ -5090 -13236 -17260 -20088 -21260 -25718 -28468 -25975 -13713 -14304 -5403 9587 9274 -923 -10933
20468a0933o802R591Q057K348o414r072j714O494j168p875M198O155L057l780
$$ -10933 -17735 -8144 -87 2261 -4153 -13225 -14939 -8445 -9613 -17488 -13290 -7135 -4078 -7858
20454g858o026m773l345J114N803Q573N533P563K838o20j149j411k917K289N53
$$ -7858 -13884 -18657 -22002 -20888 -15085 -6512 -979 6584 9422 8802 7653 6242 3325 5614 6167
20439F167K810q187r369L664j061r324m912M452P012k138K911k762l88j220o206
$$ 6167 8977 790 -8579 -4915 -5976 -15300 -20212 -15760 -8748 -10886 -7975 -10737 -11125 -12345 -18551
20424a8551O549J364L405K941K311j289j281k633r836P214J0783P58l051l946
$$ -18551 -12002 -10638 -7233 -4292 -1981 -3270 -4551 -7184 -17020 -9806 977 1735 -1316 -5262
20410e262O594K713Q149o931j1450P03l926n04R409m271K027J903J0215P323K93
$$ -5262 1332 4045 12194 5263 -6187 -5484 -9410 -9914 -505 -4776 -2749 -846 9369 16692 16985
20395A6985k653j1618r128K064J1722p097j455N897N456p845o492j210J104J718
$$ 16985 14332 2714 -6414 -4350 7372 275 -1180 4717 10173 2328 -4164 -5374 -4270 -2552
20381b552K299N322Q452j897J365J72j2574l395J62J3279P564J0194P865p402
$$ -2552 -253 5069 13521 11624 12989 13161 587 -2808 -2646 10633 18197 28391 36256 28854
20367B8854r040m802k687j1302R81J022J111k534j0426J805m549n091M582J734
$$ 28854 19814 15012 12325 1023 2004 3026 4137 1603 -8823 -7018 -11567 -16658 -12076 -10342
20353a0342j0228l729J631J6987R187m58p305j883J572L479M235N210m024q189
$$ -10342 -20570 -24299 -22668 -5681 3506 3048 -4257 -6140 -4568 -1089 3146 8356 4332 -3857
20339c857l566p254M563L887M722K614q984k390P908m49j1355J608M871p91p191
$$ -3857 -7423 -14677 -10114 -6227 -1505 1109 -7875 -10265 -2357 -2806 -14161 -12553 -7682 -8473 -15664
20324a5664j1701J481K4296K427o460k51N337L587n040m677O498M689j405Q06
$$ -15664 -27365 -25884 -1588 839 -5621 -5872 -535 3052 -1988 -6665 -167 4522 3117 3923
20310C923j7617L313KQ253N638r262M477l799P400L730j0393j3521K20K070O146
$$ 3923 -13694 -10381 -10379 -2126 3512 -5750 -1273 -5072 2328 6058 -4335 -17856 -17636 -15566 -9420
20295i420k465N727J182n312N404R067k475j5646m370K331M277n411k941J1550
$$ -9420 -11885 -6158 -4976 -10288 -4884 4183 1708 -13938 -18308 -15977 -11700 -17111 -20052 -8502
20281h502j8q249K954j974k183J3264J2029j494n952r578l660L065J3698p52r934
$$ -8502 -8520 -16769 -13815 -15789 -17972 -4708 7321 5827 -125 -9703 -13363 -10298 3400 2648 -7286
20266g286P054O814J894k654L493J236l296r84P700L69p782p706l044L129k349
$$ -7286 -232 6582 8476 5822 9315 10551 7255 6271 13971 14340 6558 -1148 -4192 -1063 -3412
20251c412o266M458R467n566j3404j470J870J0170O791j1091o377L687Q595L128
$$ -3412 -9678 -5220 4247 -1319 -14723 -16193 -14323 -4153 2638 -8453 -14830 -11143 -2548 580
20237E80P170k527L30J808o7n72j834j1265k589m106Q469J0971p90o996m433J0706
$$ 580 7750 5223 5553 7361 7294 6722 4888 -6377 -8966 -13072 -4603 6368 5578 -1418 -5851 4855
20221D855j267j5661L892O365J869J964j3135l945J956M179O083M227k829N165
$$ 4855 3588 -12073 -8181 -1816 53 2017 -11118 -15063 -13107 -8928 -2845 1382 -1447 3718
20207C718Q564l47j3028m831k038k508l099J3624J0202k481j4392q559M363P231
$$ 3718 12282 11935 -1093 -5924 -7962 -10470 -13569 55 10257 7776 -6616 -15175 -10812 -3581
20193c581r835m184N757k714K725k675j433m578M594n072q3M003L787N61n418
$$ -3581 -13416 -17600 -11843 -14557 -11832 -14507 -15940 -20518 -15924 -20996 -21079 -17076 -13289 -12728 -18146
20178a8146N749M78j1550m078P056Q377m250j221K098R928Q347J761n094l027
$$ -18146 -12397 -11919 -23469 -27547 -20491 -12114 -16364 -17585 -15487 -5559 2788 4549 -545 -3572
20164c572l987m13p861O918Q436M397m022l245n523j430n249m548k243P629J4458
$$ -3572 -7559 -7972 -15833 -8915 -479 3918 -104 -3349 -8872 -10302 -15551 -20099 -22342 -14713 -255
20149b55K389r06o098m478R40N332O325l15l500j0045J214M582j46p129L089j174
$$ -255 2134 1228 -4870 -9348 -8408 -3076 3249 2934 -566 -10611 -9397 -4815 -4961 -12090 -9001 -10175
20133a0175l266L718J0197O177n792k407J050P134p216q096M87L422O15n744J102
$$ -10175 -13441 -9723 474 6651 859 -1548 -498 6636 -580 -8676 -8189 -4767 -4152 -9896 -8794
20118h794Q32l033L219J1729m780k569l093Q99p837K822J789m284M809k962Q912
$$ -8794 -7962 -10995 -7776 3953 -827 -3396 -6489 -5590 -13427 -10605 -8816 -13100 -8291 -11253 -2341
20103b341P522q334n507p232N917K241L102R317m878j4987j716m451J3611J8361
$$ -2341 5181 -3153 -8660 -15892 -9975 -7734 -4632 4685 -193 -15180 -16896 -21347 -7736 10625
20089A0625n54o800L132q119l7R772M05n678o897J702J8179Q250j3091j4599m876
$$ 10625 10071 3271 6403 -1716 -1753 8019 8424 2746 -4151 -2449 15730 23980 10889 -3710 -8586
20074h586J904M758L144r369m898L460J2627R700r371j3985L975R180M50l767
$$ -8586 -6682 -1924 1220 -8149 -13047 -9587 3040 12740 3369 -10616 -6641 2539 2989 -778
20060g78l992n923J170n231J627n982j017m997j769Q748L661L707O190K877q292
$$ -778 -4770 -10693 -9523 -14754 -13127 -19109 -20126 -25123 -26892 -18144 -14483 -10776 -4586 -1709 -10001
20045a0001J428j66K728K86j295M225O162q736l990j011q125l701j08l116N819
$$ -10001 -8573 -8739 -6011 -5725 -7020 -2795 3367 -5369 -9359 -10370 -18495 -22196 -22304 -25420 -19601
20030a9601J9168K80o285p06L611K228j480n411K23L703M609k777l042N205J946
$$ -19601 -433 -153 -6438 -7144 -3533 -1305 -2785 -8196 -7973 -4270 339 -2438 -5480 -275 1671
20015A671k420k585m784J866K266m438L16L237m390J917K956M391N018N400n967
$$ 1671 -749 -3334 -8118 -6252 -3986 -8424 -8108 -4871 -9261 -7344 -4388 3 5021 10421 4454
20000D454j1461k207k084k573L604N467k713Q27L607P757n713j283l60O109j0134
$$ 4454 -7007 -9214 -11298 -13871 -10267 -4800 -7513 -6686 -3079 4678 -1035 -2318 -2678 3431 -6703
19985f703K027O662r40l039p352n859J2985J3366P15K032j1960K947r53j2620
$$ -6703 -4676 1986 1046 -1993 -9345 -15204 -2219 11147 11862 13894 1934 4881 3928 -8692
19971h692L654n734j3373K593R379j312m307m234j522J526O21J989M729K159J599
$$ -8692 -5038 -10772 -24145 -21552 -12173 -13485 -17792 -22026 -23548 -22022 -21401 -19412 -14683 -12524 -10925
19956a0925o289j621N37R55K125k060P247O361L917k683j0279L269k218r75K400
$$ -10925 -17214 -18835 -18298 -17343 -15218 -17278 -10031 -3670 247 -2436 -12715 -9446 -11664 -12639 -10239
19941a0239n2l253L182K565o05j025l786L030l660m441q528j716N459L959J2713
$$ -10239 -10291 -13544 -10362 -7797 -8402 -9427 -13213 -10183 -13843 -18284 -26812 -28528 -23069 -19110 -6397
19926f397M274l563l18R63J290O780q7k442l225n099l607L294N493N872N691o230
$$ -6397 -2123 -5686 -6004 -5041 -3751 3029 2942 500 -2725 -7824 -11431 -8137 -2644 3228 8919 2689
19910B689j218m282o113j955k392M215P221P438k898q448j067j993O726L389k211
$$ 2689 1471 -2811 -8924 -10879 -13271 -9056 -1835 5603 2705 -5743 -6810 -8803 -2077 1312 -899
19895h99M331J199j746o39j301p270n654K668J0946j291L665K988K564p504m477
$$ -899 3432 4631 2885 2246 945 -6325 -11979 -9311 1635 344 4009 6997 9561 2057 -2420
19880b420l267m331O813J0803j100j0202j0181J487L730Q429Q046j0565K233p689
$$ -2420 -5687 -10018 -3205 7598 6498 -3704 -13885 -12398 -8668 -239 7807 -2758 -525 -8214
19866h214p341K779K652m141J547j9J6038P149o779m960J770k679n441M932K485
$$ -8214 -15555 -12776 -10124 -14265 -12718 -12737 3301 10450 3671 -1289 481 -2198 -7639 -2707 -222
19851b22M453J527q670J778n350n491M012M154L18j2131m496o243N276K803O454
$$ -222 4231 5758 -2912 -1134 -6484 -11975 -7963 -3809 -3491 -15622 -20118 -26361 -21085 -18282 -11828
19836a1828J203m416J2002l767o295K791N939O76M355p49q642l228j267R003L345
$$ -11828 -10625 -15041 -3039 -6806 -13101 -10310 -4371 -3695 660 -89 -8731 -11959 -13226 -4223 -878
19821h78o690j6278K131J9488P989m174m096l221j53K625o485J474J1082R614
$$ -878 -7568 -23846 -21715 -2227 5762 1588 -2508 -5729 -5882 -3257 -9742 -8268 2814 12428
19807A2428m415n574n798j3484p905J0473Q293J0967K56n398j1620J499K388j99
$$ 12428 8013 2439 -3359 -16843 -24748 -14275 -5982 4985 5241 -157 -11777 -10278 -7890 -8089
19793h089k652k441J393N47J250L483k145q489o90N588K775N320M335J37q376
$$ -8089 -10741 -13182 -11789 -11242 -9992 -6509 -8654 -17143 -17833 -12245 -9470 -4150 185 322 -8054
19778h054j637K868O132o528J017J1551Q649p405O19k711o513j729j615K158J630
$$ -8054 -9691 -6823 -691 -7219 -6202 5349 13998 6593 7212 4501 -2012 -3741 -5356 -3198 -1568
19763a568J0653m32n433p087N076m618O21r223m404L935R544L308n510j1039M739
$$ -1568 9085 8653 3220 -3867 1209 -3409 -2788 -12011 -16415 -12480 -2936 372 -5138 -16177 -11438
19748a1438R018P70J0105J933J293o097j4506p67Q452P482n415j1836L999o124
$$ -11438 -2420 -1650 8455 10388 11681 5584 -8922 -9689 -1237 6245 830 -11006 -7007 -13131
19734a3131P084M28J220O181l863n306o845O049L432J584L073L85k534j1600J209
$$ -13131 -6047 -5619 -4399 1782 -2081 -7387 -14232 -8183 -4751 -3167 -94 291 -2243 -13843 -12634
19719a2634J1126O008n071q639n012p738J2099J54q075N67K928N014N381o96J695
$$ -12634 -1508 4500 -571 -9210 -14222 -21960 -9861 -9707 -17782 -17215 -14287 -9273 -3892 -4588 -2893
19704b893L846j5804JJ0339K782O795L263j1586j1316m407p102K694N134K338
$$ -2893 953 -14851 -14850 -4511 -1729 5066 8329 -3257 -14573 -18980 -26082 -23388 -18254 -15916
19690a5916J881J1621M845o252r941P53N851J1178N673l080q243L139j505j1516
$$ -15916 -14035 -2414 2431 -3821 -13762 -13009 -7158 4020 9693 6613 -1630 1509 4 -11512
19676a1512J934J750p4P480O452J0746j032o590k121k259j748m334m628J454N59
$$ -11512 -9578 -7828 -7902 -422 6030 16776 15744 9154 7033 4774 3026 -1308 -5936 -4482 -3923
19661c923K585K070r772k958K306L623L619j791o691k197n71K07J813L115O231
$$ -3923 -1338 732 -9040 -11998 -9692 -6069 -2450 -4241 -10932 -13129 -13700 -13493 -11680 -8565 -2334
19646b334J110k563N212O055O735O362L936P724M0k067q698Q005Q27j1436p903
$$ -2334 -1224 -3787 1425 7480 14215 20577 24513 32237 32277 30210 21512 29517 30344 18908 11005
19631A1005p713J320M651J18J2313O498j756N016j340l973j172r235m15o712j0960
$$ 11005 3292 4612 9263 9381 21694 28192 26436 31452 30112 26139 24967 15732 15317 8605 -2355
19616b355p885m177J920N392N958J2006L730Q02m826j3378n420P602N693J5775
$$ -2355 -10240 -14417 -12497 -7105 -1147 10859 14589 15391 10565 -2813 -8233 -631 5062 20837
19602B0837J0364P547n501j5179m798q162m229k441q355l917n335l787J5242Q544
$$ 20837 31201 38748 33247 18068 13270 5108 879 -1562 -9917 -13834 -19169 -22956 -7714 830
19588H30k316p21j0600p040J184R261N318J0859n535j6144j4116k099o533Q758
$$ 830 -1486 -2207 -12807 -19847 -18663 -9402 -4084 6775 1240 -14904 -29020 -31119 -37652 -28894
19574b8894N018N546O141O79o45n685l445K033J1993l546j128q880p293L495N445
$$ -28894 -23876 -18330 -12189 -11510 -12155 -17840 -21285 -19252 -7259 -10805 -11933 -20813 -28106 -24611 -19166
19559a9166J445O28N713K140j366N854n389K244O907J0472L567m940o511n240
$$ -19166 -17721 -17093 -11380 -9240 -10606 -4752 -10141 -7897 -990 9482 13049 8109 1598 -3642
19545c642K165O595J772l304k061p524J70l00j83R147J44n766N684N787n110p381
$$ -3642 -1477 5118 6890 3586 1525 -5999 -5829 -6129 -6312 2835 2979 -2787 2897 8684 3574 -3807
19529c807l71l93Q121P12k476p54p371l453q93l092R751J224n019q980q1P668
$$ -3807 -4178 -4571 3550 4262 1786 1032 -6339 -9792 -10685 -13777 -4026 -2802 -7821 -16801 -16882 -9214
19513i214K229K373J2329L552J715m892q076m242L740j979J02N850m369M170Q690
$$ -9214 -6985 -4612 7717 11269 12984 8092 16 -4226 -486 -2465 -2363 3487 -882 3288 11978
19498A1978K903r483j1881l162k014K973p104j46j833K690K56o066l60Q96N552
$$ 11978 14881 5398 -6483 -9645 -11659 -8686 -15790 -15936 -17769 -15079 -14823 -20889 -21249 -20353 -14801
19483a4801P255m988m449o269q68J0091J2115Q576K089l929o861q658n549J5318
$$ -14801 -7546 -12534 -16983 -23252 -24120 -14029 -1914 6662 8751 4822 -2039 -10697 -16246 -928
19469i28j764j1045N664q091k895k155n701L298P714L378q26N864l577m515k738
$$ -928 -2692 -13737 -8073 -16164 -19059 -21214 -26915 -23617 -15903 -12525 -13351 -7487 -11064 -15579 -18317
19454a8317P192k499o02J2098J2346j1468j3110l941N661L016k896j30M981l175
$$ -18317 -11125 -13624 -14226 -2128 10218 -1250 -14360 -18301 -12640 -9624 -12520 -12650 -7669 -10844
19440a0844K910n957J690k413j724M236J7981J494j0639n365Q5J1419O868J898
$$ -10844 -7934 -13891 -12201 -14614 -16338 -12102 5879 7373 -3266 -8631 -8546 2873 9741 11639
19426A1639m530Q798M03j3726k846P051J569K007m589n970O682K694j4049p149
$$ 11639 7109 15907 16310 2584 -262 6789 8358 10365 5776 -194 6488 9182 -4867 -12016
19412a2016j466M214O388J336l660n726p14L902J181l492o038o090R551J2788
$$ -12016 -13482 -9268 -2880 -1544 -5204 -10930 -11644 -7742 -6561 -10053 -16091 -22181 -12630 158
19398A58m692k457k604j107O929p317n176L285l301r178N842L118K426n016l293
$$ 158 -4534 -6991 -9595 -10702 -3773 -11090 -16266 -12981 -16282 -25460 -19618 -16500 -14074 -19090 -22383
19383b2383J3606Q63N844k80n390j712m985L490o29n550m067k437O786m135l269
$$ -22383 -8777 -7914 -2070 -2350 -7740 -9452 -14437 -10947 -11576 -17126 -21193 -23630 -16844 -20979 -24248
19368b4248J31Q612P743O176J4106j63k026K039j4617o210j114J774J612o329
$$ -24248 -24117 -15505 -7762 -1586 12520 12357 10331 12370 -2247 -8457 -9571 -7797 -6185 -12514
19354a2514L091K9M585J58J838l735o618l831N384K9j519R14n00Q994o383n654
$$ -12514 -9423 -9394 -4809 -4651 -2813 -6548 -13166 -16997 -11613 -11584 -13103 -12189 -12689 -3695 -10078 -15732
19338a5732N93J1592J2005m953q249j0461j443L582P174n564k648M268J0699j038
$$ -15732 -15139 -3547 8458 3505 -4744 -15205 -16648 -13066 -5892 -11456 -14104 -9836 863 -175
19324a75j72l204j382j26K927n364J055J4380O693q014n765J125j675n876r024
$$ -175 -347 -3551 -4933 -5059 -2132 -7496 -6441 7939 14632 6618 853 1978 303 -5573 -14597
19309a4597k193M105n110K302P121R845J607J321Q643l791k626n398K157P348
$$ -14597 -16790 -12685 -17795 -15493 -8372 1473 3080 4401 13044 9253 6627 1229 3386 10734
19295A0734k159m813K864l731k715l859l103J25M477Q962Q97K875j025n326q121
$$ 10734 8575 3762 6626 2895 180 -3679 -6782 -6657 -2180 6782 7679 10554 9529 4203 -3918
19280c918j506Q500K489j76k101j960L757j802m508q355K846k492R605N995p02
$$ -3918 -5424 3076 5565 5389 3288 1328 5085 3283 -1225 -9580 -6734 -9226 379 6374 5672
19265E672n097n203r3q31l820L199L480j36K06M281L803L034pr791r662k926J0817
$$ 5672 575 -4628 -4721 -5552 -9372 -6173 -2693 -2829 -2623 1658 5461 8495 8488 -1303 -10965 -13891 -3074
19248c074L545J802n99q969k792R805J70j0366r11K223k94n271r182J269O286
$$ -3074 471 2273 1674 -7295 -10087 -282 -112 -10478 -11389 -9166 -9460 -14731 -23913 -22644 -16358
19233a6358J2155J5446R231o453r835k259q645O369m104o704n528L333K034L368
$$ -16358 -4203 11243 20474 14021 4186 1927 -6718 -349 -4453 -11157 -16685 -13352 -11318 -7950
19219g950K667P395O500l627l969l076n371o557m022N077k309K096j0249m696
$$ -7950 -5283 2112 8612 4985 1016 -2060 -7431 -13988 -18010 -12933 -15242 -13146 -23395 -28091
19205b8091M028o86j276L100L321J1845O944p367l57P370m702K525J0836q53L548
$$ -28091 -24063 -24749 -26025 -22925 -19604 -7759 -815 -8182 -8539 -1169 -5871 -3346 7490 6637 10185
19190A0185r34J517q112K249q973o878k84J4787M017j1744j0357o279m305K25
$$ 10185 9251 10768 2656 4905 -4068 -10946 -11230 3557 7574 -4170 -14527 -20806 -25111 -24886
19176b4886J767Q227j078J134N044L208J1614O699j3706o097P132l838p280O430
$$ -24886 -23119 -14892 -15970 -14836 -9792 -6584 5030 11729 -1977 -8074 -942 -4780 -12060 -5630
19162e630Q307l974m478M543K890k200l977j933O172J135R150J3720n348k1300
$$ -5630 2677 -1297 -5775 -1232 1658 -542 -4519 -6452 -280 855 10005 23725 18377 -2923
19148b923n054J2969Q104n913r9N985l256o470j3403n672P802N529R16j305J932
$$ -2923 -7977 4992 13096 7183 7084 13069 9813 3343 -10060 -15732 -7930 -2401 -1485 -2790 -858
19133h58K690o386Q30L974L49P179O927K963j0084n058K298o921j2111N833L603
$$ -858 1832 -4554 -3724 250 599 7778 14705 17668 7584 2526 4824 -2097 -14208 -8375 -4772
19118d772l062j934j450K678M665N514J66j0405o731o64O450m70K489K722R91
$$ -4772 -7834 -9768 -11218 -8540 -3875 1639 1805 -8600 -15331 -15995 -9545 -10015 -7526 -4804 -3813
19103c813j1011q426N278N418J1064Q048n363L072L33r759l490K188o32J055j430
$$ -3813 -14824 -23250 -17972 -12554 -1490 6558 1195 4267 4600 -5159 -8649 -6461 -7093 -6038 -7468
19088g468R305l516o54k35l628M68N749l822p468p120l08J3469J973k736l647
$$ -7468 1837 -1679 -2333 -2568 -6196 -5728 21 -3801 -11269 -18389 -18697 -5228 -3255 -5991 -9638
19073i638K700O237l261j2836J983L358R70L851J238O171j772J977K464m67O7
$$ -9638 -6938 -701 -3962 -16798 -14815 -11457 -10487 -6636 -5398 773 -999 978 3442 2975 3042
19058C042J2732J7j0485q944O269K396M568J945j839j253j890j4216r874j113
$$ 3042 15774 15791 5306 -3638 2631 5027 9595 11540 9701 8448 6558 -7658 -17532 -18645
19044a8645K206L576M448j823N40J0614n884l935j1096q941k084Q14Q590J1076
$$ -18645 -16439 -12863 -8415 -10238 -9698 916 -4968 -8903 -19999 -28940 -31024 -30210 -21620 -10544
19030a0544N447J564j201O185q809k147P859q89O765m947j3224j947J9630J414
$$ -10544 -5097 -3533 -4734 1451 -7358 -9505 -1646 -2535 4230 -717 -13941 -15888 3742 5156
19016E156k952o179r30N620p830l012R572l444k236M898L514J848L142J72j0832
$$ 5156 2204 -3975 -4905 715 -7115 -10127 -555 -3999 -6235 -1337 2177 4025 7167 7339 -3493
19001c493p734Q28o67Q13k291K003r50M174J846k552P897o71p168k909J3910M134
$$ -3493 -11227 -10399 -11066 -10253 -12544 -10541 -11491 -7317 -5471 -8023 -126 -797 -7965 -10874 3036 7170
18985G170P7n255l580q561m572M685J485j604J0302R125R03P086n344q171m398
$$ 7170 7247 1992 -1588 -10149 -14721 -10036 -8551 -10155 147 9272 10175 17261 11917 3746 -652
18970f52j834K238n284J0394M016r140j0935k271m589P304j648L571Q404p797
$$ -652 -2486 -248 -5532 4862 8878 -262 -11197 -13468 -18057 -10753 -12401 -8830 -426 -8223
18956h223j0977O12J0829o86J041O857L153j601k218L273O992M951k223k287J076
$$ -8223 -19200 -18588 -7759 -8445 -7404 -547 2606 1005 -1213 2060 9052 14003 11780 9493 10569
18941A0569p276k5m153J207L983R265o899m395O738L89n735J147q741J205K467
$$ 10569 3293 3268 -885 322 4305 13570 6671 2276 9014 9403 3668 4815 -3926 -2721 -254
18926b54O796Q28p554N252m321j3467j3635o41n570L838J7050N549p709k428N368
$$ -254 6542 7370 -184 5068 747 -12720 -26355 -26996 -32566 -28728 -11678 -6129 -13838 -16266 -10898
18911a0898j76O844R297j177m507K496Q46L886o574k637P17J1111M370j587N033
$$ -10898 -11074 -4230 5067 3890 -617 1879 2725 6611 37 -2600 -1883 9228 13598 12011 17044
18896A7044l300L454l682j6762m008P456J2398J408o075p374J230K854M640k205
$$ 17044 13744 17198 13516 -3246 -7254 202 12600 14008 7933 559 1789 4643 9283 7078
18882G078r712k916k3j856K804K944J608K226k365N175N577O823n462r286n538
$$ 7078 -2634 -5550 -5573 -7429 -4625 -1681 -73 2153 -212 4963 10540 17363 11901 2615 -2923
18867b923o64M225r078M930Q971J642O276O04p119o531R682M239k819q381L162
$$ -2923 -3587 638 -8440 -3510 5461 7103 13379 13983 6864 333 10015 14254 11435 3054 6216
18852F216P802M12O144O217J400r521M312l759k497k582N241O966M345k71p292
$$ 6216 14018 14430 20574 26791 28191 18670 22982 19223 16726 14144 19385 26351 30696 30425 23133
18837B3133K089n691J999n493l357o733J771M416J067n103J469N918r770K717
$$ 23133 25222 19531 21530 16037 12680 5947 7718 12134 13201 8098 9567 15485 5715 8432
18823H432N334k783m267M38j055J184j350N124j2129j0942q16M812m152K326J1477
$$ 8432 13766 10983 6716 7154 6099 7283 5933 11057 -1072 -12014 -12830 -8018 -12170 -9844 1633
18808A633R459l811j276R389P479l891k645p953q905o46R327j47j0226q93L388
$$ 1633 11092 7281 6005 15394 22873 18982 16337 8384 -521 -1167 8160 8013 -2213 -3106 282
18793B82O694q88j0512o532o370M140J4706L846K807k700L72L841m908O455N449
$$ 282 6976 6088 -4424 -10956 -17326 -13186 1520 5366 8173 5473 5845 9686 4778 11233 16682
18778A6682O34l300m605m44R498j0584J174J2428P762J9163L4854L3983p637l3222
$$ 16682 17316 14016 9411 8967 18465 7881 9055 21483 29245 48408 83262 117245 109608 76386
18764G6386k7161j4740j6045m535o056q2o663M069Q788n29o692o748J1309J0806
$$ 76386 49225 34485 18440 13905 7849 7767 1104 5173 13961 13432 6740 -8 11301 22107
18750B2107o059o938j55O143M99j161p710O784L871l24n752n806q791L231N287
$$ 22107 16048 9110 8955 15098 15597 14436 6726 13510 17381 17057 11305 5499 -3292 -61 5226
18735E226n208j5374M366O912J2363R567L170N061J1571K310r014k247O826J4497
$$ 5226 18 -15356 -10990 -4078 8285 17852 21022 26083 37654 39964 30950 28703 35529 50026
18721E0026K1182J4362J6424K5422L8974J3879j0632J446J751p963L219J2829
$$ 50026 71208 85570 101994 127416 166390 180269 169637 171083 172834 164871 168090 180919
18709A80919J8300K1166R988k193l401P68J4266L3096K7863L3106L0948K334j9050
$$ 180919 199219 220385 230373 228180 224779 225547 239813 272909 300772 333878 364826 367160 348110
18696C48110k0552j8918k5217k5964j1889j733j933O03N914M529J586l298j3171
$$ 348110 327558 308640 283423 257459 245570 243837 241904 242507 248421 252950 254536 251238 238067
18683B38067k0643j7032j8020j2550M697K1957J7311l722M585K4087L5438L4496
$$ 238067 217424 200392 182372 169822 174519 196476 213787 210065 214650 238737 274175 308671
18671C08671J3497J1817K1322L1403N0940N5706M6279J8051m354p262j5303l0606
$$ 308671 322168 333985 355307 386710 437650 493356 539635 557686 553332 546070 530767 500161
18659E00161l5600m0093l0560O51J8029K5161O542j9643k1381k1048r493o209
$$ 500161 464561 424468 393908 394559 412588 437749 444291 424648 403267 382219 372726 366517
18647C66517n769L124L284L459R099N147n594j3325j6718j9955j0090j6927k0283
$$ 366517 360748 363872 367156 370615 379714 384861 379267 365942 349224 329269 319179 302252 281969
18634B81969k1492k4291k3257k3441k5083k4033k3668j9320o96L689J3062J9125
$$ 281969 260477 236186 212929 189488 164405 140372 116704 97384 96688 100377 113439 132564
18622A32564K3866L2656K8295K4774K0520L2646K2713k410j5650l1870j9281o823
$$ 132564 156430 189086 217381 242155 262675 295321 318034 315624 299974 268104 248823 242000
18610B42000j1783l437m218k6933l6751k3336q818J254N455j3517q777k076j4899
$$ 242000 230217 226780 222562 195629 158878 135542 126724 127978 133433 119916 111139 109063 94164
18597I4164r419n369O381k3269j6570J0629N952m978J596J1044O783L819P954
$$ 94164 84745 79376 85757 62488 45918 56547 62499 57521 59117 70161 76944 80763 88717
18584H8717J1586M197j003l6j7337M943J0117O331r50j1199r711r519K245L267
$$ 88717 100303 104500 103497 103461 86124 91067 101184 107515 106565 95366 85655 76136 78381 81648
18570H1648J2970L590N540M101J4133J8926N084m151j1142q675l482j5872j5548
$$ 81648 94618 98208 103748 107849 121982 140908 145992 141841 130699 122024 118542 102670 87122
18557H7122j0913o443n843o767j73J5494J6602J7037K2498J0813l134J716n957
$$ 87122 76209 69766 63923 57156 56983 72477 89079 106116 128614 139427 136293 138009 132052
18544A32052j7123p748k040n029j1898j2246r679l867n400m098J42N516J121P306
$$ 132052 114929 107181 105141 100112 88214 75968 66289 62422 57022 52924 53066 58582 59703 67009
18530F7009K2193K2581K4259J5090P001j0565j6218j5839k7840q023n609r475
$$ 67009 89202 111783 136042 151132 158133 147568 131350 115511 87671 79648 74039 64564
18518F4564j3004M188P544J6430K746p707K059l476j0857J0660K3364o407k4273
$$ 64564 51560 55748 63292 79722 82468 74761 76820 73344 62487 73147 96511 90104 65831
18505F5831j1518n207j3771N688J327p923j328M691J40l664o453K109j663k812
$$ 65831 54313 49106 35335 41023 42350 34427 33099 37790 37930 34266 27813 29922 28259 25447
18491B5447Q734L810q66J576j544m914p820q568M398l31j526k612L077J2170n214
$$ 25447 34181 37991 37125 38701 37157 32243 24423 15855 20253 19922 18396 15784 18861 31031 25817
18476B5817j225m88l184J6684J3887o121j3701p401J0220J4818M086K856L41J720
$$ 25817 24592 24104 20920 37604 51491 45370 31669 24268 34488 49306 53392 56248 56589 58309
18462E8309J332q779p218M630J1237k352k516n671n604j174N344J955N13l670
$$ 58309 59641 50862 43644 48274 59511 57159 54643 48972 43368 42194 47538 49493 50006 46336
18448D6336J654j751l372P905J6251J4453M734J5485O422m632Q381N079O017l029
$$ 46336 47990 46239 42867 50772 67023 81476 86210 101695 108117 103485 111866 116945 122962 119933
18434A19933o641k971N212L481m787j4845j3085o003j228M278M34N15m563l305
$$ 119933 113292 110321 115533 119014 114227 99382 86297 80294 79066 83344 83778 84293 79730 76425
18420G6425P080N753K327J1639K3895L9052K6455K5802K6085K0142K1501K1874
$$ 76425 83505 89258 91585 103224 127119 166171 192626 218428 244513 264655 286156 308030
18408C08030M494k1377l4905l0296k5501j7069k1414k0265j1703j218q104k346
$$ 308030 312524 291147 256242 225946 200445 183376 161962 141697 129994 128776 120672 118326
18396A18326O344N365l538j1610r550J963L951M742n712r961Q882K988L639P103
$$ 118326 124670 130035 126497 114887 105337 107300 111251 115993 110281 100320 109202 112190 115829 122932
18382A22932J909K174N117L272l208l498o099l825m040Q625M845j3737n992Q11
$$ 122932 124841 127015 132132 135404 132196 128698 122599 118774 114734 123359 128204 114467 108475 109286
18368A09286Q93p822o021K27L838J6203O142O63l294j235m154k61K432J383L151
$$ 109286 110179 102357 96336 96563 100401 116604 122746 123409 120115 118880 114726 114465 116897 118280 121431
18353A21431N822J3178p061o956K112N304K174j0575k2005j5388o389k078L87
$$ 121431 127253 140431 133370 126414 128526 133830 136004 125429 103424 88036 81647 79569 79956
18340G9956j443p064N495N976N2j78N074J7602Q210m896K478M749N177L827M372
$$ 79956 78513 71449 76944 82920 82972 82794 87868 105470 113680 108784 111262 116011 121188 125015 129387
18325A29387J1176J6646J3806R064J9275K2258K7388K4761J4599J7255P711j650
$$ 129387 140563 157209 171015 180079 199354 221612 249000 273761 288360 305615 313326 311676
18313C11676j1315j9667k4674j0665j2883j0836r785o253m114j460J697o015N382
$$ 311676 300361 280694 256020 245355 232472 221636 211851 205598 201484 200024 201721 195706 201088
18300B01088J8565J6638M453n330l9J1732J2787J4949K7882K5680L0898L0625
$$ 201088 219653 236291 240744 235414 235375 247107 259894 274843 302725 328405 359303 389928
18288C89928K1318K1491J5761k084j8997k3442l0198n2953m2939l4547k0663k1045
$$ 389928 411246 432737 448498 446414 427417 403975 373777 320824 277885 243338 222675 201630
18276B01630m544l37N833P113J1847J1381N139M837j876J130O666J4876j68p234
$$ 201630 197086 196749 202582 209695 221542 232923 238062 242899 241023 242153 248819 263695 263527 256293
18262B56293p777O072P201J0266N726J3160J7523P231k002K543J7236L1956L1467
$$ 256293 248516 254588 261789 272055 277781 290941 308464 315695 313693 316236 333472 365428 396895
18249C96895L1352K7315M0903M4856O0851N4786M4792M6077N5405Q4130R8019
$$ 396895 428247 455562 496465 541321 602172 656958 701750 747827 803232 887362 985381
18238I85381N1728M854l861M1476R6026R8944L0555m6181n7652l2405N407L4700
$$ 985381 1037109 1041963 1038102 1079578 1175604 1274548 1305103 1258922 1201270 1168865 1174272 1208972
18226A208972P4451R4848R9301J16912J45156J66445J71902K06176K74883L55568
$$ 1208972 1283423 1378271 1477572 1594484 1739640 1906085 2077987 2284163 2559046 2914614
18216B914614M57761O29256Q17183Q73032O95506K98361r6834l10698k73095p7760
$$ 2914614 3372375 4001631 4818814 5691846 6387352 6685713 6588879 6278181 6005086 5927326
18206E927326J45992L48045M82762N60787N98638O48822Q72813J347464J999846
$$ 5927326 6073318 6421363 6904125 7464912 8063550 8712372 9585185 10932649 12932495
18197A2932495K461658K643836L106352M454987O898373J0358602J4574048J8396846
$$ 12932495 15394153 18037989 21144341 25599328 32497701 42856303 57430351 75827197
18189G5827197J8863614J4685564Q592035L922697K209250K283762n71383n287011
$$ 75827197 94690811 109376375 117968410 121891107 124100357 126384119 125812736 120525725
18181A20525725q215691p687875m504304l408326r215112j6134533j6460327j1207599
$$ 120525725 112310034 104622159 100117855 96709529 87494417 71359884 54899557 43691958
18173D3691958n867211k671591j320603n19935P45128K731606N525122R161854
$$ 43691958 37824747 35153156 33832553 33312618 34057746 36789352 42314474 51476328
18165E1476328J3680797J9260975K4891338K8795819K9193615K6000684K1258692
$$ 51476328 65157125 84418100 109309438 138105257 167298872 193299556 214558248
18158B14558248J8107754J5819586Q275219p349607k4994927l2483437k8901154
$$ 214558248 232666002 248485588 256760807 249411200 224416273 191932836 163031682
18151A63031682k6131472k8059902k7534852k1292847j4196281q987621n560982
$$ 163031682 136900210 108840308 81305456 60012609 45816328 36828707 31267725
18144C1267725l510331k433807j802585j263845p97771o40945p70806j023176
$$ 31267725 27757394 25323587 23521002 22257157 21459386 20818441 20047635 19024459
18136A9024459j284100j349508j103223o56440k19604O4741L53994R22056J734064
$$ 19024459 17740359 16390851 15287628 14631188 14411584 14476325 14830319 15752375 17486439
18127A7486439K248233K291043J587390l05522k625491l840467l537043k531633
$$ 17486439 19734672 22025715 23613105 23307583 20682092 16841625 13304582 10772949
18119A0772949j548943q32378l27634J05479O10882J313821K347689L895351N665155
$$ 10772949 9224006 8391628 8063994 8169473 8780355 10094176 12441865 16337216 22002371
18110B2002371O860622P293030L629118q06816j872840R21529K631700J302744
$$ 22002371 28862993 36156023 39785141 38978325 37105485 38027014 40658714 41961458
18102D1961458j570435m503379o006752n615431l899282k468632j921815j828294
$$ 41961458 40391023 35887644 29880892 24265461 20366179 17897547 15975732 14147438
18094A4147438j704157j422929r91257m93353Q9157P46736J432908K068945K362847
$$ 14147438 12443281 11020352 10029095 9535742 9624899 10371635 11804543 13873488 16236335
18085A6236335K366165K794590L782520M313793L881096K106581q70228l593084
$$ 16236335 18602500 21397090 25179610 29493403 33374499 35481080 34610852 31017768
18077C1017768m425789m091389l751571l296849k405711j611612j271203r91008
$$ 31017768 26591979 22500590 18749019 15452170 13046459 11434847 10163644 9172636
18069I172636m39850L53609J215267J670666R13532o26726j580372j296097n24488
$$ 9172636 8732786 9086395 10301662 11972328 12885860 12259134 10678762 9382665 8858177
18060H858177l0046J70250N12358J268798K189132K616614K579840K528384K197619
$$ 8858177 8828131 8998381 9510739 10779537 12968669 15585283 18165123 20693507 22891126
18051B2891126J300243K42262r07751k322543l460068l737794l257231k418437
$$ 22891126 24191369 24433631 23525880 21203337 17743269 14005475 10748244 8329807
18043H329807j585932r54762m59764m3941L88218Q76236J354342J375606O04585
$$ 8329807 6743875 5789113 5329349 5285408 5673626 6549862 7904204 9279810 9884395
18034I884395m29441q69963n65560k07457k56848l05724J13774Q83507J174777
$$ 9884395 9454954 8584991 8019431 7811974 7555126 7249402 7363176 8246683 9421460
18025I421460L59210p25838j061760o41019r9514J71390K393l27654n03148n27513
$$ 9421460 9780670 9054832 7993072 7352053 7252539 7423929 7426322 7098668 6595520 6068007
18015F068007m25643r1447L12635L49834j99580q47689j074616q50998n31576
$$ 6068007 5642364 5550917 5863552 6213386 6013806 5166117 4091501 3240503 2708927
18006B708927k89156j52244p7105k1279M3778J32307K03779L15658M77305N74069
$$ 2708927 2419771 2267527 2190422 2169143 2212921 2345228 2549007 2864665 3341970 3916039
17996C916039M85351J34541l04785o00090o37809n50539m25306l37812k93527
$$ 3916039 4401390 4535931 4231146 3631056 2993247 2442708 2017402 1679590 1386063
17987A386063k26743j57714q7647l5147J538K3106M9391P8582R6525M8387l3423
$$ 1386063 1159320 1001606 913959 878812 880350 903456 952847 1031429 1127954 1176341 1142918
17976A142918r1967j24390j25586j07713q1977n5459m0191k0723j2832j3129r361
$$ 1142918 1050951 926561 800975 693262 611285 555826 515635 494912 482080 468951 459590
17965D59590p677P312R644O394k0582m0990m0565l0116j9820m400j2587j5208
$$ 459590 451913 459225 468869 475263 454681 413691 373126 343010 323190 318790 306203 290995
17953B90995j4285k3960j4881l621j1284j4296p150l309j1104k373J685O378J0
$$ 290995 276710 252750 237869 234248 222964 208668 201518 198209 187105 184732 186417 192795 192805
17940A92805L618l603M303K203N028K091L861O199m133j956l555l513m175m11
$$ 192805 196423 192820 197123 199326 204354 206445 210306 216505 212372 210416 206861 203348 199173 198762
17926A98762n96m829o790K893M656m529j6684l301k794j0420l114M958J255Q691
$$ 198762 198166 193337 186547 189440 194096 189567 172883 169582 166788 156368 153254 158212 159467 168158
17912A68158P640N64L552L949j330Q756l78r86J3181L810p668n556j705M135K80
$$ 168158 175798 176362 179914 183863 182533 191289 190911 189925 203106 206916 199248 193692 191987 196122 196402
17897A96402j4581o356j2822j0406q948q756n167r08N278n710l044j1436k270
$$ 196402 181821 175465 162643 152237 143289 134533 129366 128458 133736 128026 124982 113546 111276
17884A11276k94J16L848N57q984o894M432P677O807P099j677Q07O119p045o325
$$ 111276 110982 111098 114946 115503 106519 99625 104057 111734 118541 125640 123963 124770 130889 123844 117519
17869A17519J23r418n294q308K903N808o632j94m063j921O982K836j0184M626
$$ 117519 117642 108224 102930 94622 97525 103333 96701 96507 92444 90523 97505 100341 90157 94783
17855I4783L730j03K39m681o927q277J2948J2675o934j736O485M660m292n001
$$ 94783 98513 98410 98649 93968 87041 78764 91712 104387 97453 95717 102202 106862 102570 97569
17841I7569J0875K970r238m77J4451M818q688n477j82m466n465n86O468n281J1048
$$ 97569 108444 111414 102176 101699 116150 120968 112280 106803 106621 102155 96690 96104 102572 97291 108339
17826A08339O035k89j7531m216l432k123p16l644n641n020m454N370J295j261
$$ 108339 114374 114085 96554 92338 88906 86783 86067 82423 76782 71762 67308 72678 73973 72712
17812G2712k188n011O580J704o63j443K0j042P235M379n229q626k956L528J383
$$ 72712 70524 65513 72093 73797 73134 71691 71711 70669 77904 82283 77054 68428 65472 69000 70383
17797G0383k70n004K127M763m069n8O544j681j220k687O494N72K590N724p448
$$ 70383 70113 65109 67236 71999 67930 67872 74416 72735 71515 68828 75322 75894 78484 84208 76760
17782G6760o638p424j0181n286O203J4796o42l0q12J0866p235j3423K495Q270
$$ 76760 70122 62698 52517 47231 53434 68230 67588 67558 66746 77612 70377 56954 59449 67719
17768F7719O839k426m801K453R78l093J816j51l240j297K14p261k359L549k372
$$ 67719 74558 72132 67331 69784 70762 67669 69485 69334 66094 64797 65011 57750 55391 58940 56568
17753E6568j843o564L779K49L006P780o417J589k297J057J1929K312K074j1968
$$ 56568 54725 48161 51940 52189 55195 62975 56558 58147 55850 56907 68836 71148 73222 61254
17739F1254J745O719q209j477P370R051R34o040O741o541j7181l22J1162O369
$$ 61254 62999 69718 61509 60032 67402 76453 77387 71347 78088 71547 54366 54044 65206 71575
17725G1575k380j620j697K472k52K201Q958j833j808R105P276J5941K8449L6972
$$ 71575 69195 67575 65878 68350 68098 70299 79257 77424 75616 84721 91997 107938 136387 173359
17711A73359M2764M9548O3115L7633K2527J9838L0016L7389N1049L8095J1985
$$ 173359 216123 265671 328786 366419 388946 408784 438800 476189 527238 565333 577318
17700E77318j4433j8577j1464N063m128k95m513n899k0767k2474l1358n6043m9160
$$ 577318 562885 544308 532844 537907 533779 533484 528971 523072 502305 479831 448473 392430 343270
17687C43270l0815l9280l4285k2764r917j1696m032j835M616J6944J2282k262
$$ 343270 312455 273175 238890 216126 206209 194513 190481 188646 193262 210206 222488 220226
17675B20226m947l008j485J123n76p89J0146K5053L7436L7740M7044M3997K9585
$$ 220226 215279 212271 210786 211909 211333 210544 220690 245743 283179 320919 367963 411960 441545
17662D41545K6493L2034K8813J6741R641J6941L7885N3297O1389N3914K9570P90
$$ 441545 468038 500072 528885 545626 555267 572208 610093 663390 724779 778693 808263 809053
17650H09053l4061n7643l8711j4291j4379k2144k4944l9909o0344n8890m7205
$$ 809053 774992 717349 678638 664347 649968 627824 602880 562971 502627 443737 396532
17639C96532m4563m0571k7034n938m671j4173j4580p104j2037j1550k4674k5724
$$ 396532 351969 311398 284364 278426 273755 259582 245002 237898 225861 214311 189637 163913
17627A63913j6078j2790r057P223J262n696O476J8233J9016L53K818R145O817
$$ 163913 147835 135045 125988 133211 134473 128777 135253 153486 172502 172855 175673 184818 191635
17614A91635K836R003O744j0448m924o899j2611n989K016R26J3058K3979K4033
$$ 191635 194471 203474 210218 199770 194846 187947 175336 169347 171363 172289 185347 209326 233359
17601B33359J6572p483l5286l8531l6274k7829j2823o393L215J097j078O87L286
$$ 233359 249931 242448 207162 168631 132357 104528 91705 85312 88527 89624 88546 89233 92519
17588I2519l971q698M589K5136K1662K7048K9184O865o865q171j1577r344q915
$$ 92519 88548 79850 84439 109575 131237 158285 187469 194334 187469 179298 167721 158377 149462
17575A49462j3440p586j1515j2424j2964p596r398j1242l950R079q84p60P581
$$ 149462 136022 128436 116921 104497 91533 83937 74539 63297 59347 68426 67542 66782 74363
17562G4363Q793j260j176K942J5469K3041L6242L2210K0684J5511K152j0726k1846
$$ 74363 83156 81896 80720 83662 99131 122172 158414 190624 211308 226819 228971 218245 196399
17549A96399k8648j3420j4844j9049k0201k3562j0028O29O8p86k705R17L937j43
$$ 196399 167751 154331 139487 120438 100237 76675 66647 67276 67344 66558 63853 64770 68707 68564
17535F8564R530N830K625m872J4694K4290K7294M412j0055o554k63M48p828l302
$$ 68564 78094 83924 86549 81677 96371 120661 147955 152367 142312 135758 135495 135943 128115 124813
17521A24813p383K81J0292P8j7936p397j3079p992j0908j0327r697n957K026N340
$$ 124813 117430 117711 128003 128081 110145 102748 89669 81677 70769 60442 50745 44788 46814 52154
17507E2154n758m850j971P517J1220o655J108k077J3311J7585M290J314K213j1329
$$ 52154 46396 41546 39575 47092 58312 51657 52765 50688 63999 81584 85874 87188 89401 78072
17493G8072l984J0448j1175j1558j2373r302O161k154n528j2096j524J2974n33
$$ 78072 74088 84536 73361 61803 49430 40128 46289 44135 38607 26511 24987 37961 37428
17480C7428p122j5372j093O124K659N013J335R527J106l853k838M555j074L649
$$ 37428 30306 14934 13841 19965 22624 27637 28972 38499 39605 35752 32914 37469 36395 40044
17466D0044l663n866L059m635m024p858J294N866J496J658J660N849j096l601
$$ 40044 36381 30515 33574 28939 24915 17057 18351 24217 25713 27371 29031 34880 33784 30183
17452C0183l762J236N58L552l033P3n051P211J4959L7273K9887N691k5487k5276
$$ 30183 26421 27657 28215 31767 28734 28807 23756 30967 45926 83199 113086 118777 93290 68014
17438F8014j5578j1599j5793o79j0336J638K777K197L183M439j538J737K764l08
$$ 68014 52436 40837 25044 24365 14029 15667 18444 20641 23824 28263 26725 28462 31226 30918
17424C0918K273p292m598R062J266r39m634J194n05k175L25n425q241j09K183
$$ 30918 33191 25899 21301 30363 31629 30690 26056 27250 26745 24570 24895 19470 11229 11120 13303
17409A3303J602K818P64k200k182j641Q489l510R38J397p250o845M328N794q59
$$ 13303 14905 17723 18487 16287 14105 12464 20953 17443 18381 19778 12528 5683 10011 15805 14946
17394A4946j3492K689l025M412o80J624j011M399J0873O099n185J424R391l745
$$ 14946 1454 4143 1118 5530 4850 6474 5463 9862 20735 26834 21649 23073 32464 28719
17380B8719j187j0025o690K520P210M842K204o507m167o1j1503O210N440n303
$$ 28719 27532 17507 10817 13337 20547 25389 27593 21086 16919 16858 5355 11565 17005 11702
17366A1702j075K535K695o185P127R226R125l457o083l906q393r32N982P178R199
$$ 11702 10627 13162 15857 9672 16799 26025 35150 31693 25610 21704 13311 12379 18361 25539 34738
17351C4738j1232o901M164K578p650R55Pl982m454r789L328P977L058R84j931
$$ 34738 23506 16605 20769 23347 15697 16652 16659 12677 8223 -1566 1762 9739 12797 13781 11850
17336A1850l317o652m379N057K738J304J2775M486l080o095n617m388j3192J1667
$$ 11850 8533 1881 -2498 2559 5297 6601 19376 23862 20782 14687 9070 4682 -8510 3157
17322C157J3687n639J163R651j128j1051p73N532J660K180K124K116J0520J427
$$ 3157 16844 11205 12368 22019 20891 9840 9067 14599 16259 18439 20563 22679 33199 34626
17308C4626l781n467M415Q384j0755r483l046l213P558R915l484J452j2294k176
$$ 34626 30845 25378 29793 38177 27422 17939 14893 11680 19238 29153 25669 27121 14827 12651
17294A2651r54o88J892L703k369J741P616O44j908J128M032J0825j2142m887K907
$$ 12651 11697 11009 12901 16604 14235 15976 23592 24236 22328 23456 27488 38313 26171 21284 24191
17279B4191m077j0111L857M72m30J2421J9395q187k2035r337M928K994j6259p5
$$ 24191 20114 10003 13860 14332 13902 26323 45718 37531 15496 6159 11087 14081 -2178 -2253
17265b253M481O293Q738n199O581m066l464l96L534N589K60n329K436j380k311
$$ -2253 2228 8521 17259 12060 18641 14575 11111 10715 14249 19838 20098 14769 17205 15825 13514
17250A3514l706k260J2954K895j3916j052r16r676j650N788J199j377O463K379
$$ 13514 9808 7548 20502 23397 9481 8429 7513 -2163 -3813 1975 3174 1797 8260 10639
17236A0639O11J4742J153j5370m074p93K160k56N08k894j375k916K447K717M548
$$ 10639 11250 25992 27145 11775 7701 6908 9068 8812 9320 6426 5051 2135 4582 7299 11847
17221A1847J856L678m25m778j675l840J2543j912m915M452Q162P959O315o608
$$ 11847 13703 17381 16956 12178 10503 6663 19206 17294 12379 16831 24993 32952 39267 32659
17207C2659m961m787Q366j725o608k771O77o878L96J2627p4pj605j2561L044O70
$$ 32659 27698 22911 31277 29552 22944 20173 20850 13972 14368 26995 26921 26914 25309 12748 15792 16462
17191A6462L950K640n586K161m04K411N61M705p148p821K371R209K05N621q860
$$ 16462 20412 23052 17466 19627 19223 21634 22195 26900 19752 11931 14302 23511 23716 29337 20477
17176B0477r99k885M08j183P26m521L471M677K780N097m841L401N47j1913m344
$$ 20477 19478 16593 17001 15818 16544 12023 15494 20171 22951 28048 23207 26608 27155 15242 10898
17161A0898L899j1038K366K396O508k078L9K001j6425o307L848M956K82N611M042
$$ 10898 14797 3759 6125 8521 15029 12951 12990 14991 -1434 -7741 -3893 1063 1345 6956 10998
17146A0998k559J104L763m091j1253K123P227P491K822O589k855L75J2616m729
$$ 10998 8439 9543 13306 9215 -2038 85 7312 14803 17625 24214 21359 21734 34350 29621
17132B9621q492l245J329o470K51L618l827l005R59O3r09j150o74O164O565j5452
$$ 29621 21129 17884 19213 12743 12994 16612 12785 9780 10739 10802 9893 8743 8069 14233 20798 5346
17116E346K841J827P99k977n814Q298K892L683J756Q331K56q860n7p696m731O392
$$ 5346 8187 10014 10813 7836 2022 10320 13212 16895 18651 26982 27238 18378 18321 10625 5894 12286
17100A2286N45k11K911q967o39P27R32n391M490J462j67o139J762J3803l226j822
$$ 12286 12831 12620 15531 6564 5925 6652 7584 2193 6683 8145 7978 1839 3601 17404 14178 12356
17084A2356J544q640l033K739O52P056K273K858K124n260L834k711p567M832M491
$$ 12356 13900 5260 2227 4966 5618 12674 14947 17805 19929 14669 18503 15792 8225 13057 17548
17069A7548j5763p451L218J1015P90q887N425N866m24k955M876k362j0046l797
$$ 17548 1785 -5666 -2448 8567 9357 470 5895 11761 11337 8382 13258 10896 850 -2947
17055b947P634L692l827o627M20Q592Q84J283r760N09J294k939m43j444k717P007
$$ -2947 4687 8379 4552 -2075 -1655 6937 7821 9104 -656 -147 1147 -1792 -2235 -3679 -6396 611
17039F11K5874K785j1750j0530L755J2943N319L246k258l70j6918K391K164j2772
$$ 611 26485 29270 17520 6990 10745 23688 29007 32253 29995 29625 12707 15098 17262 4490
17025D490r022J0443P465k65P097M246l445j0540N19M374p295k513N389M309K808
$$ 4490 -4532 5911 13376 13111 20208 24454 21009 10469 10988 15362 8067 5554 10943 15252 18060
17010A8060N079n945R748J4243n170j5567p348j1334O04m076j326o055L02M131
$$ 18060 23139 17194 26942 41185 36015 20448 13100 1766 2370 -1706 -3032 -9087 -8785 -4654
16996d654O37k411J1032J1357L792o475m127j958Q081K603p875q521P983P512
$$ -4654 -4017 -6428 4604 15961 19753 13278 9151 7193 15274 17877 10002 1481 9464 16976
16982A6976R34j1884o296p142K795M316K492R967P606J017M022k281l23m850l410
$$ 16976 17910 6026 -270 -7412 -4617 -301 2191 12158 19764 20781 24803 22522 22199 17349 13939
16967A3939j174q22l001m77o430N016J189P61N020m020N142N318M044j1252n436
$$ 13939 12765 11943 8942 8465 2035 7051 8240 9001 14021 10001 15143 20461 24505 13253 7817
16952G817Q082L854l173k704k049O57J421l2L188N699l691n710M88n458j1754
$$ 7817 15899 19753 16580 13876 11827 12484 13905 13873 17061 22760 19069 13359 13847 8389 -3365
16937c365K847K724k368k12j410Q931J0289L41l939Pm40j583p168o092j703J4001
$$ -3365 -518 2206 -162 -374 -1784 7147 17436 17777 13838 13845 13405 11822 4654 -1438 -3141 10860
16921A0860N237K171j000m64J11q433q571l755M896K242M259J1963p065m376p083
$$ 10860 16097 18268 17268 16804 16915 8482 -89 -3844 1052 3294 7553 19516 12451 8075 992
16906I92k45N437N264L640j952j745j831j633L039K979L491n60o160q549n793
$$ 992 747 6184 11448 15088 13136 11391 9560 7927 10966 13945 17436 16876 10716 2167 -3626
16891c626L010M31m38O394l605K623J1054m496p015k406L501k382l396L414J213
$$ -3626 -616 -185 -623 5771 2166 4789 15843 11347 4332 1926 5427 3045 -351 3063 4276
16876D276M392N062l275j2497k125l660O751J211J283j00J0578N320n263q360
$$ 4276 8668 13730 10455 -2042 -4167 -7827 -1076 135 1418 1318 11896 17216 11953 3593
16862C593n213J703J192m3q146J073R071M879l72J2458j103j1206M10J3565r049
$$ 3593 -1620 83 1275 1232 -6914 -5841 3230 8109 7737 20195 19092 7886 8296 21861 12812
16847A2812j3010O259J571j649M780J967k730n684j498Q102O966M472k148j852
$$ 12812 -198 6061 7632 5983 10763 12730 10000 4316 2818 10920 17886 22358 20210 18358
16833A8358J620l796q86j705N398J404J021K507o753j1907l028M457j699o06O47
$$ 18358 19978 16182 15296 13591 18989 20393 21414 23921 17168 5261 2233 6690 4991 4385 5032
16818E032L012N81n317l823R245j57m160N436P972l290m137O184j178r381J948
$$ 5032 8044 8625 3308 -515 8730 8573 4413 9849 17821 14531 10394 16578 15400 6019 7967
16803G967pp356o258N94Q760M183q046k001o10l493M513M907L763J061N68M33
$$ 7967 7960 604 -5654 -5060 3700 7883 -163 -2164 -2774 -6267 -1754 3153 6916 7977 8545 8978
16787H978K088r770j0316L341N420N7J835J217j0408p995K254Q500P965Q695L807
$$ 8978 11066 1296 -9020 -5679 -259 -202 1633 2850 -7558 -15553 -13299 -4799 3166 11861 15668
16772A5668r95j0043k332m90o305M43P158m816l762o407j36j735Q423J5957Q837
$$ 15668 14673 4630 2298 1808 -4497 -4054 3104 -1712 -5474 -11881 -12017 -13752 -5329 10628 19465
16757A9465M368P246j3000j1088L392m488j0901q479J0650Q416P735k180l461
$$ 19465 23833 31079 18079 6991 10383 5895 -5006 -13485 -2835 5581 13316 11136 7675
16744G675N055P343r16m72Q15L48p09p141o266k91m701L65R765J918q576n106
$$ 7675 12730 20073 19157 18685 19500 19848 19139 11998 5732 5441 740 1105 10870 12788 4212 -894
16728h94K499P524K714n342l583O780N681l668j353L894J0082J0969J1300M452
$$ -894 1605 9129 11843 6501 2918 9698 15379 11711 10358 14252 24334 35303 46603 51055
16714E1055j223M170M334L529j2593j6659j4071k0357L330j089P704Q719O24K310
$$ 51055 49832 54002 58336 61865 49272 32613 18542 -1815 1515 426 8130 16849 17473 19783
16700A9783J939P258M034K50j521n836l307q847j6285p605j820Q78O726o34N7
$$ 19783 21722 28980 33014 33264 31743 25907 22600 13753 -2532 -10137 -11957 -11079 -4353 -4987 -4930
16685d930M29L90N115n46K045p31J1650J3036L956Q20l593m18q75k837l013j1871
$$ -4930 -4501 -4111 1004 458 2503 1772 13422 26458 30414 31234 27641 27223 26348 23511 20498 8627
16669H627n906k277l749o569l928M260R507k319j2007k969j2J1032M088n517k310
$$ 8627 2721 444 -3305 -9874 -13802 -9542 -35 -2354 -14361 -17330 -17342 -6310 -2222 -7739 -10049
16654a0049k079q866m58j820o46J0398J2155j764k382K333O978J4773R208o847
$$ -10049 -12128 -20994 -21452 -23272 -23918 -13520 -1365 -3129 -5511 -3178 3800 18573 27781 20934
16640B0934p442p169n44n182L363j846K608O961j262M1k69n558L297M191o601
$$ 20934 13492 6323 5779 597 3960 2114 4722 11683 10421 10462 10193 4635 7932 12123 5522
16625E522n770O456K930K392N66O672p029o753P224Q425o983p330r079j3126M492
$$ 5522 -248 6208 9138 11530 12096 18768 11739 4986 12210 20635 13652 6322 -2757 -15883 -11391
16610a1391J2693O508k321M079J0138m78o619j419M24k811j8563p505K019O562
$$ -11391 1302 7810 5489 9568 19706 19228 12609 11190 11614 8803 -9760 -17265 -15246 -8684
16596h684Q284l974R653J2032L085q786J478N013m12j3927k892j168q526J0146
$$ -8684 -400 -4374 5279 17311 20396 11610 13088 18101 17689 3762 870 -298 -8824 1322
16582A322R203k765l825n045p912m557K245P611L377K092R019k241q371Q003K115
$$ 1322 10525 7760 3935 -1110 -9022 -13579 -11334 -3723 -346 1746 10765 8524 153 8156 10271
16567A0271p113l637N821n211K074k006r693m796J0372L590O702Q027o171l292
$$ 10271 3158 -479 5342 131 2205 199 -9494 -14290 -3918 -328 6374 14401 8230 4938
16553D938l834m447R542M12P890K775j3463j5642o133K374P501L807j89L964O714
$$ 4938 1104 -3343 6199 6611 14501 17276 3813 -11829 -17962 -15588 -8087 -4280 -4469 -505 6209
16538F209P14j0630J454j236L034O835P931L501n229q572n980m995K797L385k075
$$ 6209 6923 -3707 -2253 -3489 -455 6380 14311 17812 12583 4011 -1969 -6964 -4167 -782 -2857
16523b857J917M637M932k708q257K077O179l215R190K120L82m839k746L586p989
$$ -2857 -940 3697 8629 5921 -2336 -259 5920 2705 11895 14015 14397 9558 6812 10398 2409
16508B409L554k787p127J155J574j411O046m303O478p855k90J054q319M058R173
$$ 2409 5963 3176 -3951 -2796 -1222 -2633 3413 -890 5588 -2267 -2557 -1503 -9822 -5764 3409
16493C409N800k486M743L450K255l133o956j772j324M5N698m425r330L479J2117
$$ 3409 9209 6723 11466 14916 17171 14038 7082 5310 3986 4031 9729 5304 -4026 -547 11570
16478A1570l24n89j642J86J812K77m765p065J0417M902j466J022L202n53n704
$$ 11570 11246 10657 9015 9201 11013 11290 6525 -540 9877 14779 13313 14335 17537 16984 11280
16463A1280r921j2088p177l857O811M396o808m701J5003J126j78M675N682n55
$$ 11280 1359 -10729 -17906 -21763 -14952 -10556 -17364 -22065 -7062 -5936 -6114 -1439 4243 3688
16449C688l460l019j474N889N123p015j2206k535K509Q181J5940P034q476m800
$$ 3688 228 -2791 -4265 1624 6747 -268 -12474 -15009 -12500 -4319 11621 18655 10179 5379
16435E379m014m261r736J975O964J0508l559p135n855n285K079Q242m261K070
$$ 5379 1365 -2896 -12632 -10657 -3693 6815 3256 -3879 -9734 -15019 -12940 -4698 -8959 -6889
16421f889N963K879P496O719m941k707p283m875j663R531L8j2156J777M038J76
$$ -6889 -926 1953 9449 16168 11227 8520 1237 -3638 -5301 4230 4268 -7888 -6111 -2073 -1897
16406a897r41O365K435K991k979j391l24R27P501j1108m791J452J2321o157j324
$$ -1897 -2838 3527 5962 8953 5974 4583 4259 5186 12687 1579 -3212 -1760 10561 4404 3080
16391C080m000q699O649R762l402J564K078j1604j551r88n261M880n64J722R727
$$ 3080 -920 -9619 -2970 6792 3390 4954 7032 -4572 -6123 -7111 -12372 -7492 -8056 -6334 3393
16376C393K822j0011L905k53j1330J649Q720P92m72L455L299l928n441o437m012
$$ 3393 6215 -3796 109 -144 -11474 -9825 -1105 -313 -785 2670 5969 2041 -3400 -9837 -13849
16361a3849J4617j957N02N983j900o07N759M473q951j0185J1552k54j0952J41
$$ -13849 768 -1189 -687 5296 3396 2789 8548 13021 4070 -6115 5437 5183 -5769 -5628
16347e628L747Q431M75j992N759l740p43L975m873p774K918j97m401j765M709
$$ -5628 -1881 6550 7025 5033 10792 7052 6309 10284 5411 -2363 555 358 -4043 -5808 -1099
16332a099R067L025K060m088p352j929J502n850K701K821k99M114L073m114m095
$$ -1099 7968 10993 13053 8965 1613 -316 1186 -4664 -1963 858 559 4673 7746 3632 -463
16317d63n688o48K312J107O80L246O656P281k928l34m516q595L067J3268l214
$$ -463 -6151 -6799 -4487 -3380 -2700 546 7202 14483 11555 11221 6705 -1890 1177 14445 11231
16302A1231j4984L988J0490p500n932k208m251j384l657l252o970O797Q840J38
$$ 11231 -3753 235 10725 3225 -2707 -4915 -9166 -10550 -14207 -17459 -24429 -17632 -8792 -8654
16288h654j46M614O376O042o47N971n091o375O553j696M750K860o582m959L334
$$ -8654 -8800 -4186 2190 8232 7585 13556 8465 2090 8643 6947 11697 14557 7975 3016 6350
16273F350m66K383K322l001K024L033o734n310p64K959k46N508m966Q5l171k622
$$ 6350 5884 8267 10589 7588 9612 12645 5911 601 -163 2796 2550 8058 3092 3177 6 -2616
16257b616N231J418p546k387M895R173J2912j0113K56j748r969q927l118J3555
$$ -2616 2615 4033 -3513 -5900 -1005 8168 21080 10967 11223 9475 -494 -9421 -12539 1016
16243A016K008n61k296l858j0276m144R78k02J2750R699j017r538j3845L237R312
$$ 1016 3024 2463 167 -3691 -13967 -18111 -17133 -17335 -4585 5114 4097 -5441 -19286 -16049 -6737
16228f737P183k390J81m314l675j001n177j382Q034P152J518J65j750j1286j1151
$$ -6737 446 -1944 -1763 -6077 -9752 -10753 -15930 -17312 -9278 -2126 -608 -443 -2193 -13479 -24630
16213b4630P649Q527Q640k334n35j715j812K717O910K288o334p933n936k31P039
$$ -24630 -16981 -8454 186 -2148 -2683 -4398 -6210 -3493 3417 5705 -629 -8562 -14498 -14729 -7690
16198g690N07n040J866M123L12M011Q973O923r67O598K630j5441j8807n075P858
$$ -7690 -7183 -12223 -10357 -6234 -5922 -1911 7062 13985 13018 19616 22246 6805 -12002 -17077 -9219
16183i219L468l119j847J028l929j08P387l718Q19n70K725K70l21K231K661M394
$$ -9219 -5751 -8870 -10717 -9689 -13618 -13726 -6339 -10057 -9238 -9808 -7083 -6813 -7134 -4903 -2242 2152
16167B152o730l79j015j520l016J2990L709j074o298l949L791K453M173M910O004
$$ 2152 -4578 -4957 -5972 -7492 -10508 2482 6191 5117 -1181 -5130 -1339 1114 5287 10197 16201
16152A6201q856L119p134o916Q154m893p847Q177j271p183P121O563p935J3958
$$ 16201 7345 10464 3330 -3586 4568 -325 -8172 5 -1266 -8449 -1328 5235 -2700 11258
16138A1258L089l476l425R38M095J1o032r068j387k104j759K457k197K462P843
$$ 11258 14347 10871 7446 8384 12479 12490 6458 -2610 -3997 -6101 -7860 -5403 -7600 -5138 2705
16123B705J612j945N038k532M476m96l660o699J3244P743j5343l838n869K030
$$ 2705 4317 2372 7410 4878 9354 8858 5198 -1501 11743 19486 4143 305 -5564 -3534
16109c534O339L504k241m47o082j0439Q829M497m379J453P016K324N98j650N91
$$ -3534 2805 6309 4068 3621 -2461 -12900 -4071 426 -3953 -2500 4516 6840 7438 5788 6379
16094F379n917O58P619n645N611O201R002N409k2246j8154P329J0486L508L653
$$ 6379 462 1120 8739 3094 8705 14906 23908 29317 7071 -11083 -3754 6732 10240 13893
16080A3893o59n760o429M09O434n012k611m80P728n72J70m018k304J484L914q786
$$ 13893 13234 7474 1045 1454 7888 2876 265 -215 7513 6941 7111 3093 789 2273 6187 -2599
16064b599j1390k793L000J0615l868m948r50J4268J5841j050p777p699R68q585
$$ -2599 -13989 -16782 -13782 -3167 -7035 -11983 -12933 1335 17176 16126 8349 650 1618 -6967
16050f967k442L569L167P87L718j631r417m72P297J89q644j2438k208R66O939
$$ -6967 -9409 -5840 -2673 -1886 1832 201 -9216 -9688 -2391 -2202 -10846 -23284 -25492 -24526 -17587
16035a7587Q892K540K289o745K139L804q007M846L544o312o719n231k69k281N339
$$ -17587 -8695 -6155 -3866 -10611 -8472 -4668 -12675 -7829 -4285 -10597 -17316 -22547 -22816 -25097 -19758
16020a9758N305J0690K84n137r41P160J0172r709l253m63o812r742O368L100n782
$$ -19758 -14453 -3763 -3479 -8616 -9557 -2397 7775 -1934 -5187 -5650 -12462 -22204 -15836 -12736 -18518
16005a8518n424M173O984K185P231m38l154R07M549P692l085j6288k603K225J650
$$ -18518 -23942 -19769 -12785 -10600 -3369 -3807 -6961 -6054 -1505 6187 3102 -13186 -15789 -13564 -11914
15990a1914Q453M528M115L919O211o505l537M938J782k037j4297j594L029J0736
$$ -11914 -3461 1067 5182 9101 15312 8807 5270 10208 11990 9953 -4344 -5938 -2909 7827
15976G827P556o030l761m524p653K896J792P007q832M495o111j101L384L517M673
$$ 7827 15383 9353 5592 1068 -6585 -3689 -1897 5110 -3722 773 -5338 -6439 -3055 462 5135
15961E135l259nJ0570J209m429L930q855l571n537r891N60K707R306M081m94o295
$$ 5135 1876 1871 12441 13650 9221 13151 4296 725 -4812 -14703 -14143 -11436 -2130 1951 1457 -4838
15945d838K86J5986K720n237N89q957p130N923P959K06j1804p537l645J6666M675
$$ -4838 -4552 11434 14154 8917 9506 549 -6581 -658 7301 7507 -4297 -11834 -15479 1187 5862
15930E862l035n563M04N71n943q66J428M063n955l706O936p465j1972L959J2070
$$ 5862 2827 -2736 -2332 -1761 -7704 -8570 -7142 -3079 -9034 -12740 -5804 -13269 -25241 -21282 -9212
15915i212R826P297l807O930Q400k427p224K799k946O451o284j617J391Q834q101
$$ -9212 614 7911 4104 11034 19434 17007 9783 12582 9636 16087 9803 8186 9577 18411 10310
15900A0310r664p491o947M905J4470M67M864L514j246k288l794p664J817J0828
$$ 10310 646 -6845 -13792 -8887 5583 6050 10914 14428 13182 10894 7100 -564 1253 12081
15886A2081L114p80m216k384J402O226m253j1580o720m250J804L753k861O815
$$ 12081 15195 14415 10199 7815 9217 15443 11190 -390 -7110 -11360 -9556 -5803 -8664 -1849
15872a849K608k181N51o330k350q978k969J1005M149k899L764L838P815l065q203
$$ -1849 759 -1422 -871 -7201 -9551 -18529 -21498 -10493 -6344 -9243 -5479 -1641 6174 3109 -5094
15857e094k158J126O056L291r140M955N195L463n432l845P934L528r774l115J84
$$ -5094 -7252 -6126 -70 3221 -5919 -964 4231 7694 2262 -1583 6351 9879 105 -3010 -2826
15842b826m064j70N618P622n298p590N111K212K693M88r78j1736K214J1911N072
$$ -2826 -6890 -7060 -1442 6180 882 -6708 -1597 615 3308 3796 2818 -8918 -6704 5207 10279
15827A0279n121n145M752k675k558j188m82m580L979Q727j0081r959R202J3935
$$ 10279 5158 13 4765 2090 -468 -1656 -2138 -6718 -2739 5988 -4093 -14052 -4850 9085
15813I085j481n101o516j026l151j875L715O90k150L111l036j957k301n686k38
$$ 9085 7604 2503 -4013 -5039 -8190 -10065 -6350 -5660 -7810 -4699 -7735 -9692 -11993 -17679 -17917
15798a7917L705j300J495Q723n13m353o306M192m697O836R705N594k556P041k724
$$ -17917 -14212 -15512 -14017 -5294 -5807 -10160 -16466 -12274 -16971 -10135 -430 5164 2608 9649 6925
15783F925P3n519n829N002K873j085o232q75l07J4201J5580M235j1029j5378k443
$$ 6925 6998 1479 -4350 652 3525 2440 -3792 -4667 -4974 9227 24807 29042 18013 2635 192
15768A92l420j418n403J291J4884n507j4636J212P871k13K533J989o1m92j611
$$ 192 -3228 -4646 -10049 -8758 6126 619 -14017 -12805 -4934 -5147 -2614 -625 -686 -1178 -2789
15753b789K198J754m961l627n386r022m507J2582Q524L676m264J239P82N685p016
$$ -2789 -591 1163 -3798 -7425 -12811 -21833 -26340 -13758 -5234 -1558 -5822 -4583 -3801 1884 -5132
15738e132L046jP652m061j2357j1015M156Q114M530Q170K876m222l34l189r398
$$ -5132 -2086 -2087 5565 1504 -10853 -21868 -17712 -9598 -5068 3102 5978 1756 1422 -1767 -11165
15723a1165l177J7691J6927j887p218j270O994O593k254k444k868M317J014q177
$$ -11165 -14342 3349 20276 18389 11171 9901 16895 23488 21234 18790 15922 20239 21253 13076
15709A3076m478l507o353o401N661j116L002O387m873j97r292o173M036j039J600
$$ 13076 8598 5091 -1262 -7663 -2002 -3118 -116 6271 1398 1201 -8091 -14264 -10228 -11267 -9667
15694i667o421M14m335k826O21J917M874Q938m608Q697j946q973Q809R114K953
$$ -9667 -16088 -15674 -20009 -22835 -22214 -20297 -15423 -6485 -11093 -2396 -4342 -13315 -4506 4608 7561
15679G561r080l095j180o579L553N174N538J2958R83n381m587l146K107k36K33
$$ 7561 -1519 -4614 -5794 -12373 -8820 -3646 1892 14850 15833 10452 5865 2719 4826 4590 4823
15664D823k201l491O738l446n906J209K455P535j287n844n678N822j147j2917
$$ 4823 2622 -869 5869 2423 -3483 -2274 181 7716 6429 585 -5093 729 -418 -13335
15650a3335m924K36l13Q17O016l063l15K884M549k893M604J078J272Q437p999
$$ -13335 -18259 -18023 -18336 -17519 -11503 -14566 -14881 -11997 -7448 -10341 -5737 -4659 -3387 5050 -2949
15635b949r672k709J422m983K669J4718Q120l316K395J387L574j2303p539M643
$$ -2949 -12621 -15330 -13908 -18891 -16222 -1504 6616 3300 5695 7082 10656 -1647 -9186 -4543
15621d543j171M545K219m209k734J697L528R238N850p790j1554p851M246K528
$$ -4543 -5714 -1169 1050 -3159 -5893 -4196 -668 8570 14420 6630 -4924 -12775 -8529 -6001
15607f001J688O869J292j77J285m025q8k594o696M60J0199R619L516k549j0490
$$ -6001 -4313 2556 3848 3671 4956 931 843 -1751 -8447 -7987 2212 11831 15347 12798 2308
15592B308k239j954o298k203Q146Q592J784p579m26k778p278k794O352M270K209
$$ 2308 69 -1885 -8183 -10386 -2240 6352 8136 557 131 -2647 -9925 -12719 -6367 -2097 112
15577A12n781M349J057n43O882M456n382L316o470j026J02k050n518N270P323
$$ 112 -5669 -1320 -263 -806 6076 10532 5150 8466 1996 970 1072 -978 -6496 -1226 6097
15562F097K552j4935j0901K347K191J765P547J1470n153q749k201j830n465J66
$$ 6097 8649 -6286 -17187 -14840 -12649 -10884 -3337 8133 2980 -5769 -7970 -9800 -15265 -15099
15548a5099k170J0896K239j1991Q495Q560n15J2900n589j0114K529j755q73M179
$$ -15099 -17269 -6373 -4134 -16125 -7630 930 415 13315 7726 -2388 141 -1614 -2487 1692
15534A692N640J9184j2792j4844k39n714l524O198l162j2339M488J1381L313m13
$$ 1692 7332 26516 13724 -1120 -1359 -7073 -10597 -4399 -7561 -19900 -15412 -4031 -718 -1131
15520a131j043m623L565R71j515q380l521Q509l811N538j979o134j431L731M183
$$ -1131 -2174 -6797 -3232 -2261 -3776 -12156 -15677 -7168 -10979 -5441 -7420 -13554 -14985 -11254 -7071
15505g071O6K066M939r681l440O459j470j237M023m904N693j659M8k599j51J241
$$ -7071 -7005 -4939 0 -9681 -13121 -6662 -8132 -9369 -5346 -10250 -4557 -6216 -6168 -8767 -8918 -7677
15489g677J484j71r905L183Q045M754q551j217J71J196N351J257K708l35m851
$$ -7677 -6193 -6364 -16269 -13086 -5041 -287 -8838 -10055 -9884 -8688 -3337 -2080 628 293 -4558
15474d558K295l921q37J0661P718l021j1489K477K560m560M313K903L020J282
$$ -4558 -2263 -6184 -7021 3640 11358 8337 -3152 -675 1885 -2675 1638 4541 7561 8843
15460H843j2078j5908O137Q026Q630Q025o537k480r424j932P88O236J890p721
$$ 8843 -3235 -19143 -13006 -4980 3650 11675 5138 2658 -6766 -8698 -7910 -1674 216 -7505
15446g505N233J073m635o054K979P639k743j585J469l424P417K812K746p638n651
$$ -7505 -2272 -1199 -5834 -11888 -8909 -1270 -4013 -5598 -4129 -7553 -136 2676 5422 -2216 -7867
15431g867k002j0787o261p60N18Q576J0732Q587J3015J406j143n3n023j695k127
$$ -7867 -9869 -20656 -26917 -27677 -27159 -18583 -7851 736 13751 15157 14014 13961 8938 7243 5116
15416E116j2168l735n083m414Q744J833j6494j0438O775J3123J1159J2082K75
$$ 5116 -7052 -10787 -15870 -20284 -11540 -9707 -26201 -36639 -29864 -16741 -5582 6500 6775
15403F775k775J1550n692n411n212O255R820l196p831N464j302p148m042O97J1122
$$ 6775 4000 15550 9858 4447 -765 5490 15310 12114 4283 9747 8445 1297 -2745 -2048 9074
15388I074Q056m163j0322p126l395j4591M14J0428Q63m362m208O824Q858j714
$$ 9074 17130 12967 2645 -4481 -7876 -22467 -22053 -11625 -10762 -15124 -19332 -12508 -3650 -5364
15374e364L586M228n339J084j013j1182p237k172R619J2763k153p158q24J533
$$ -5364 -1778 2450 -2889 -1805 -2818 -14000 -21237 -23409 -13790 -1027 -3180 -10338 -11162 -9629
15360i629m822O634L210l430N015R015R084J457k882j1186m710O726M140M417
$$ -9629 -14451 -7817 -4607 -8037 -3022 5993 15077 16534 13652 2466 -2244 4482 8622 13039
15346A3039o2o479l233j796K893M479n68n16P89q728k559L93p829M021L826J082
$$ 13039 12977 6498 3265 1469 4362 8841 8273 7757 8546 -182 -2741 -2348 -10177 -6156 -2330 -1248
15330a248o744k367J902O517K663l803k600n536j834n584m008R981J0154P392
$$ -1248 -7992 -10359 -8457 -1940 723 -3080 -5680 -11216 -13050 -18634 -22642 -12661 -2507 4885
15316D885j214o726J283M44p753j3412O115j277m140j867M979N028l151J875N380
$$ 4885 3671 -3055 -1772 -1328 -9081 -22493 -16378 -17655 -21795 -23662 -18683 -13655 -16806 -14931 -9551
15301i551J1654N856l146L571j583K190k474m484K945M821J683J363k702j396
$$ -9551 2103 7959 4813 8384 6801 8991 6517 2033 4978 9799 11482 12845 10143 8747
15287H747m940j6449q383j137J1538N439K624K999N545r325r264M887J2366J565
$$ 8747 3807 -12642 -21025 -22162 -10624 -5185 -2561 438 5983 -3342 -12606 -7719 4647 6212
15273F212K942j2291j187k710j3265k280O990O057J441J1391J4501p3j3586r388
$$ 6212 9154 -3137 -4324 -7034 -20299 -22579 -15589 -9532 -8091 3300 17801 17728 4142 -5246
15259e246k15p466L603m095p819J1965M513J360l85n316l741l804L667J0926R237
$$ -5246 -5461 -12927 -9324 -13419 -21238 -9273 -4760 -3400 -3785 -9101 -12842 -16646 -12979 -2053 7184
15244G184l863j0015J0425o69o86M021l309n133j1303p652o42l217k895J1078
$$ 7184 3321 -6694 3731 3062 2376 6397 3088 -2045 -13348 -21000 -21642 -24859 -27754 -16676
15230a6676J2814K864J002l130o69k769p242N537N80n253J427J917Q758J971m149
$$ -16676 -3862 -998 4 -3126 -3795 -6564 -13806 -8269 -7689 -12942 -11515 -9598 -840 1131 -3018
15215c018J566O690k69k050p168n288l615K679R501O021J373n7o109L800P825
$$ -3018 -1452 5238 4969 2919 -4249 -9537 -13152 -10473 -972 5049 6422 6365 256 4056 11881
15200A1881l486r869l669p56j379K162O096J788k392p390L58M345K636m638L541
$$ 11881 8395 -1474 -5143 -5899 -7278 -5116 980 2768 376 -7014 -6656 -2311 325 -4313 -772
15185g72m664K165n089n011n217O241o042K296Q413J874k182K753J0937m185l083
$$ -772 -5436 -3271 -8360 -13371 -18588 -12347 -18389 -16093 -7680 -5806 -7988 -5235 5702 1517 -1566
15170a566l560O363N034j224l783M295L331J719k352m350j5705j6690M357J6942
$$ -1566 -5126 1237 6271 5047 1264 5559 8890 10609 8257 3907 -11798 -28488 -24131 -7189
15156g189O958Q979k325j7657o579J1907J2248j14k6j2r518r751q427m485J856
$$ -7189 -231 8748 6423 -11234 -17813 -5906 6342 6228 6202 6190 -3328 -13079 -21506 -25991 -24135
15141b4135J6172N102j55m422k27o806N00l498M870j546M318R485L50j994k155
$$ -24135 -7963 -2861 -3016 -7438 -7665 -14471 -13971 -17469 -12599 -14145 -9827 -342 8 -1986 -4141
15126d141k535j667n536M037M468Q167m232r831K562m280j2616P29Q022Q333o430
$$ -4141 -6676 -8343 -13879 -9842 -5374 2793 -1439 -11270 -8708 -12988 -25604 -24875 -16853 -8520 -14950
15111a4950n903K866L913l741L013K955k886m757K197L702Q138J1877M36o263
$$ -14950 -20853 -17987 -14074 -17815 -14802 -11847 -14733 -19490 -17293 -13591 -5453 6424 6860 597
15097E97r949r234K058K009N168M622K119M690k71j2140m375l735q69O776L179
$$ 597 -9352 -18586 -16528 -14519 -9351 -4729 -2610 2080 1809 -10331 -14706 -18441 -19310 -12534 -9355
15082i355P699J862m077M876j005k540q976p149J5404M935r154k618j0783q649
$$ -9355 -1656 206 -3871 1005 0 -2540 -11516 -18665 -3261 1674 -7480 -10098 -20881 -29530
15068b9530Q36Q272J1925O918o351J330J2563n473j2865k777k052M400J1418m753
$$ -29530 -28694 -20422 -8497 -1579 -7930 -6600 5963 490 -12375 -15152 -17204 -12804 -1386 -6139
15054f139k388Q411J2462k529r439j5605l539N886J5121J3291M649J984M663o650
$$ -6139 -8527 -116 12346 9817 378 -15227 -18766 -12880 2241 15532 20181 22165 26828 20178
15040B0178j3542j2083j824j435N623M217n138j2244K534M484K153j497L342N972
$$ 20178 6636 -5447 -7271 -8706 -3083 1134 -4004 -16248 -13714 -9230 -7077 -8574 -5232 740
15026G40J538l608j4741J912q108J47J0558Q394M821L585J918J896r053J070o803
$$ 740 2278 -1330 -16071 -14159 -22267 -22120 -11562 -3168 1653 5238 7156 9052 -1 1069 -5734
15011e734m850M123o05J259J6648J0450p610q352q001j7043O945J4216j908p062
$$ -5734 -10584 -6461 -7066 -5807 10841 21291 13681 5329 -2672 -19715 -12770 1446 -462 -7524
14997g524p968l24J2076O138J0197P726j3803K343j659l792k478P065K179j1316
$$ -7524 -15492 -15816 -3740 2398 12595 20321 6518 8861 7202 3410 932 7997 10176 -1140
14983a140n628N646K461q510j190n144L764j241p51R498k434q734M985O543n108
$$ -1140 -6768 -1122 1339 -7171 -8361 -13505 -9741 -10982 -11733 -2235 -4669 -13403 -8418 -1875 -6983
14968f983k579J2709Q311p880p968J297jj506R274Q956j37j3422p084N239J444
$$ -6983 -9562 3147 11458 3578 -4390 -3093 -3094 -4600 4674 13630 13493 71 -7013 -1774 -330
14953c30r4m791k134L663J2900r56p31m687r446M039O1K485m716L081j062j551
$$ -330 -424 -5215 -7349 -3686 9214 8258 7527 2840 -6606 -2567 -2506 -21 -4737 -1656 -2718 -4269
14937d269K702r510j898K891P033O84p374m635p96R60K229O516N35l710O725N991
$$ -4269 -1567 -11077 -12975 -10084 -3051 -2367 -9741 -14376 -15172 -14212 -11983 -5467 -4932 -8642 -1917 4074
14921D074M788n46j3916j1527Q31N522J275O5J2351J3553r82j5458j824O241o778
$$ 4074 8862 8316 -5600 -17127 -16296 -10774 -9499 -9434 2917 16470 15488 30 -1794 4447 -2331
14906b331r39l880J252L841O886j1216p872P866M537o007n832l945O101J438n570
$$ -2331 -3270 -7150 -5898 -2057 4829 -6387 -14259 -6393 -1856 -7863 -13695 -17640 -11539 -10101 -15671
14891a5671L342Q733L352K771n718r322n358r58N497J1009Q06l93L855m579n526
$$ -15671 -12329 -3596 -244 2527 -3191 -12513 -17871 -18829 -13332 -2323 -1517 -1910 1945 -2634 -8160
14876h160m163k499l373j812J482M106M968p353N013O23n21M678R764j45l802
$$ -8160 -12323 -14822 -18195 -20007 -18525 -14419 -9451 -16804 -11791 -11168 -11689 -7011 2753 2608 -1194
14861a194j504k792L890O313J616p295k871N516L6k792L920j336L389J794k028
$$ -1194 -2698 -5490 -1600 4713 6329 -966 -3837 1679 1715 -1077 2843 1507 4896 6690 4662
14846D662n340O593L934o303l413K842n409j0058N424L019M059K995n750M365
$$ 4662 -678 5915 9849 3546 133 2975 -2434 -12492 -7068 -4049 10 3005 -2745 1620
14832A620K142j2024q64O500o269n936l246P641Q638j282n739q032l019J1906
$$ 1620 3762 -8262 -9126 -2626 -8895 -14831 -18077 -10436 -1798 -3080 -8819 -16851 -19870 -7964
14818g964n399r77M377n667J890O131L24J366Q904l356j642o695j1050p514J1346
$$ -7964 -13363 -14340 -9963 -15630 -13740 -7609 -7285 -5919 2985 -371 -2013 -8708 -19758 -27272 -15926
14803a5926J1521n537o139M677K498k812n260o538K934N356L592r88Q39N988K804
$$ -15926 -4405 -9942 -16081 -11404 -8906 -11718 -16978 -23516 -20582 -15226 -11634 -12622 -11783 -5795 -2991
14788b991o83P40O896n453p351l620M922Q116J443q100r306J54O417n048n110
$$ -2991 -3674 -2934 3962 -1491 -8842 -12462 -7540 576 2019 -6081 -15387 -15233 -8816 -13864 -18974
14773a8974P094O207o170J1555N710o374k072J174L091K952R148N290j3382j4662
$$ -18974 -11880 -5673 -11843 -288 5422 -952 -3024 -1850 1241 4193 13341 18631 5249 -9413
14759i413r470r77K985L925j107k218K231K414N584j3449r305M359L353M236O656
$$ -9413 -18883 -19860 -16875 -12950 -14057 -16275 -14044 -11630 -6046 -19495 -28800 -24441 -21088 -16852 -10196
14744a0196L241k832N78j2934J318N585m809j577J539Q466J0082N393j796j6658
$$ -10196 -6955 -9787 -9209 -22143 -20825 -15240 -20049 -21626 -20087 -11621 -1539 3854 2058 -14600
14730a4600K010O858L924k52q311J834n164j0891N663R288M197L363K445J1577
$$ -14600 -12590 -5732 -1808 -2060 -10371 -8537 -13701 -24592 -18929 -9641 -5444 -2081 364 11941
14716A1941N214j3456j2147l145j316j095N217P755J789J186o154q386l355O99
$$ 11941 17155 3699 -8448 -11593 -12909 -14004 -8787 -1032 757 1943 -4211 -12597 -15952 -15253
14702a5253P726J347L757L027P295m019j0879m236J681K240R16n471j3478Q895
$$ -15253 -7527 -6180 -2423 604 7899 3880 -6999 -11235 -9554 -7314 -6398 -11869 -25347 -16452
14688a6452J5847k987J35L994j0145p672r88N109L639M037N775n9o940l422o768
$$ -16452 -605 -3592 -3457 537 -9608 -17280 -18268 -13159 -9520 -5483 292 233 -6707 -10129 -16897
14673a6897l369R61P959J101Nr98m591R296L818N377o302n984k934J449p442o681
$$ -16897 -20266 -19305 -11346 -10245 -10240 -11238 -15829 -6533 -2715 2662 -3640 -9624 -12558 -11109 -18551 -25232
14657b5232L048K0607M216k994J329j1697j2425o75J3821K049P712J660P357L460
$$ -25232 -22184 -1577 2639 -355 974 -10723 -23148 -23823 -10002 -7953 -241 1419 8776 12236
14643A2236k479o251j3886Q12J5702O071n54q457Q876P251m37r133p193p145o299
$$ 12236 9757 3506 -10380 -9568 6134 12205 11651 3194 12070 19321 18884 9751 2558 -4587 -10886
14628a0886O634J0709N4o315K993L599M513J3925L454j0151j136m456p740n889
$$ -10886 -4252 6457 6511 196 3189 6788 11301 25226 28680 18529 17393 12937 5197 -692
14614f92Q82N185r017l507o52o539l645J975j712q33R488O377J380O418j185p429
$$ -692 190 5375 -3642 -7149 -7801 -14340 -17985 -16010 -17722 -18555 -9067 -2690 -1310 5108 3923 -3506
14598c506o38K065k797Q868J140o043q695j044K833M326k616p191o039O220K71
$$ -3506 -4144 -2079 -4876 3992 5132 -911 -9606 -10650 -7817 -3491 -6107 -13298 -19337 -13117 -12846
14583a2846m524O78M382O581Q237n613j223n135P746O186N212N012r705r40m545
$$ -12846 -17370 -16692 -12310 -5729 2508 -3105 -4328 -9463 -1717 4469 9681 14693 4988 4048 -497
14568d97O465j966j5272o736J50J120L308k775n281J684L821J0068M610l430L718
$$ -497 5968 4002 -11270 -18006 -17856 -16736 -13428 -16203 -21484 -19800 -15979 -5911 -1301 -4731 -1013
14553a013k427l749k473m849R406m244l222P975K965J069M92M442N640m21j3546
$$ -1013 -3440 -7189 -9662 -14511 -5105 -9349 -12571 -4596 -1631 -562 -70 4372 10012 9591 -3955
14538c955j2061o849k017N435j908l351J0300J3293K742j1439L884J52R360K238
$$ -3955 -16016 -22865 -24882 -19447 -21355 -24706 -14406 -1113 1629 -9810 -5926 -5774 3586 5824
14524E824J1580O28l866n092j6231m275J1311o907L575R369K722j169o103l295
$$ 5824 17404 18032 14166 9074 -7157 -11432 -121 -7028 -3453 5916 8638 7469 1366 -1929
14510a929K806J936K634r66j0419k972l269j085l096M726P239k100k455J750L438
$$ -1929 877 2813 5447 4481 -5938 -8910 -12179 -13264 -16360 -11634 -4395 -6495 -8950 -7200 -3762
14495c762o066p062o137j888M05N751N750J79L81N016N083L123Q387J977n606
$$ -3762 -9828 -16890 -23027 -24915 -24510 -18759 -13009 -12830 -12449 -7433 -2350 773 9160 11137 5531
14480E531j6422j2913m20N172N267M44J186k220k327j639K826m268K950J354K077
$$ 5531 -10891 -23804 -24224 -19052 -13785 -13341 -12155 -14375 -16702 -18341 -15515 -19783 -16833 -15479 -13402
14465a3402l533O37O178l487J0035k507j1550j995k599j257O8N381o114P804J4025
$$ -13402 -16935 -16298 -10120 -13607 -3572 -6079 -17629 -19624 -22223 -23480 -23412 -18031 -24145 -16341 -2316
14450b316j310n108q444K115n595O632J909n62M780k149p107J127O367O47N292
$$ -2316 -3626 -8734 -17178 -15063 -20658 -14026 -12117 -12679 -7899 -10048 -17155 -16028 -9661 -9014 -3722
14435c722L311J962m951j357j322K299L740q307o437P008L218P130q368k863L364
$$ -3722 -411 1551 -3400 -4757 -6079 -3780 -40 -8347 -14784 -7776 -4558 2572 -5796 -8659 -5295
14420e295J247N64L26j0343j557L727n126p072o680J2365J0410l009R65r5l238
$$ -5295 -4048 -3484 -3158 -13501 -15058 -11331 -16457 -23529 -30209 -17844 -7434 -10443 -9478 -9573 -12811
14405a2811k614O045j89L049J921J592j249j0468n481n547Q136N685J0511Q103
$$ -12811 -15425 -9380 -9569 -6520 -4599 -3007 -4256 -14724 -20205 -25752 -17616 -11931 -1420 6683
14391F683j753J013P759n090k045p181o188p367J142P684O034l494p965K314N197
$$ 6683 4930 5943 13702 8612 6567 -614 -6802 -14169 -13027 -5343 691 -2803 -10768 -8454 -3257
14376c257J3163p06q937o169j4369M584J5554L173r362R31k718M76J296L827j2136
$$ -3257 9906 9200 263 -5906 -20275 -15691 -137 3036 -6326 -5395 -8113 -7637 -6341 -2514 -14650
14361a4650N421O151k582k251O183n71n124M436l617j435r82q255P866P407J489
$$ -14650 -9229 -3078 -5660 -7911 -1728 -2299 -7423 -2987 -6604 -8039 -9021 -17276 -9410 -2003 -514
14346e14l170N404p518l37k951K432k736K600O450k413J281M080K460o619K173
$$ -514 -3684 1720 -5798 -6135 -9086 -6654 -9390 -6790 -340 -2753 -1472 2608 5068 -1551 622
14331F22J008k893n709k123q350o489J1346J9006M971j4754j1699K988j14K296
$$ 622 1630 -1263 -6972 -9095 -17445 -23934 -12588 6418 11389 -3365 -15064 -12076 -12190 -9894
14317i894n504L449L547m459N574O454l455o306L998j472m422J072k416r025n704
$$ -9894 -15398 -11949 -8402 -12861 -7287 -833 -4288 -10594 -6596 -8068 -12490 -11418 -13834 -22859 -28563
14302b8563R718j587Q787O872R02o850j391N948L725q402M605N605l448l939J225
$$ -28563 -18845 -20432 -11645 -4773 -3871 -10721 -12112 -6164 -2439 -10841 -6236 -631 -4079 -8018 -6793
14287f793j882K08O274J739J009r64K178J631p716j2471N33p854M216R91J280
$$ -6793 -8675 -8467 -2193 -454 555 -409 1769 3400 -4316 -16787 -16254 -24108 -19892 -18901 -17621
14272a7621J1410K323q934q15L189P85P103M657j543M15p443p511j00P249J721
$$ -17621 -6211 -3888 -12822 -13637 -10448 -9663 -2560 2097 554 969 -6474 -13985 -14085 -6836 -5115
14257e115j563n901o329r072n452J209K438J1690J1474O222K118p31q973j2417
$$ -5115 -6678 -12579 -18908 -27980 -33432 -32223 -29785 -18095 -6621 -399 1719 988 -7985 -20402
14243b0402O36M633M691O75J4881k136q824n20K597m913l6j3609J022K3137J3
$$ -20402 -19766 -15133 -10442 -9767 5114 2978 -5846 -6366 -3769 -8682 -8718 -22327 -21305 1832 1845
14228A845j3678l968l120K047N537J894j598J455O835L948q875L047Q995p05K597
$$ 1845 -11833 -15801 -18921 -16874 -11337 -9443 -11041 -9586 -2751 1197 -7678 -4631 4364 3659 6256
14213F256j1518n557N201m045r98N141l573o833P218O301K935n439M009L563m430
$$ 6256 -5262 -10819 -5618 -9663 -10661 -5520 -9093 -15926 -8708 -2407 528 -4911 -902 2661 -1769
14198a769m320o86M784L627m838o486j63l5P995m420R73n928k473k703p902M294
$$ -1769 -6089 -6775 -1991 1636 -3202 -9688 -9851 -9886 -1891 -6311 -5338 -11266 -13739 -16442 -24344 -20050
14182b0050J1268l386L319k140J457O424o462l827R796o791q77O710m80o817O299
$$ -20050 -8782 -12168 -8849 -10989 -9532 -3108 -9570 -13397 -3601 -10392 -11269 -4559 -5039 -11856 -5557
14167e557M86k879n521k083k559l99l178K088J3126L10J171O195j0218j4871l820
$$ -5557 -5071 -7950 -13471 -15554 -18113 -18512 -21690 -19602 -6476 -6166 -4995 1200 -9018 -23889 -27709
14152b7709P842O525Q911K869m979K310J0201m210K542K094J543M866j935j2992
$$ -27709 -19867 -13342 -4431 -1562 -6541 -4231 5970 1760 4302 6396 7939 12805 10870 -2122
14138b122P32R502P553j1182j1339p585n404J2267J675j0665K97M889J879j0058
$$ -2122 -1390 8112 15665 4483 -6856 -14441 -19845 -7578 -5903 -16568 -16271 -11382 -9503 -19561
14124a9561R05L569j210M684J1786J319j0564l290P487o821L103K610j450N413
$$ -19561 -18656 -15087 -16297 -11613 173 1492 -9072 -12362 -4875 -11696 -8593 -5983 -7433 -2020
14110b020O374m074K013r26o769m891p8J423N151M511r885n540j1396K940J1971
$$ -2020 4354 280 2293 1367 -5402 -10293 -10371 -8948 -3797 714 -9171 -14711 -26107 -23167 -11196
14095a1196L981Q199O123m655k612P205m481Q132q721j3828k637N432l467J176
$$ -11196 -7215 984 7107 2452 -160 7045 2564 10696 1975 -11853 -14490 -9058 -12525 -11349
14081a1349L903K824M308k933j8064m905J7499O385n366l592Q948N195k240L95
$$ -11349 -7446 -4622 -314 -3247 -21311 -26216 -8717 -2332 -7698 -11290 -2342 2853 613 1008
14067A008k97j0452Q39J0466m310l953J0854K207m301r713m86j861K874N642l789
$$ 1008 711 -9741 -8902 1564 -2746 -6699 4155 6362 2061 -7652 -8138 -9999 -7125 -1483 -5272
14052e272m464j0030k051l045r9M663J0457L602p343q114L057K963M432Q496m25
$$ -5272 -9736 -19766 -21817 -24862 -24961 -20298 -9841 -6239 -13582 -21696 -18639 -15676 -11244 -2748 -3173
14037c173j0861n713K264J2418K405k374J246p815r5P525P971p539Q450P999j0661
$$ -3173 -14034 -19747 -17483 -5065 -2660 -5034 -3788 -11603 -11698 -4173 3798 -3741 4709 12708 2047
14022B047m524L544O276o807j350o395l837L520Q183r990n687N926J987L450M995
$$ 2047 -2477 1067 7343 536 -814 -7209 -11046 -7526 657 -9333 -15020 -9094 -7107 -3657 1338
14007A338l30M549L096n949j396q69K636N843J117n331m055K575K386p784j1642
$$ 1338 1008 5557 8653 2704 1308 439 3075 8918 10035 4704 649 3224 5610 -2174 -13816
13992a3816J1164M976j0168J604M493J648q007N452M376K623K158j3425R05l74
$$ -13816 -2652 2324 -7844 -6240 -1747 -99 -8106 -2654 1722 4345 6503 -6922 -6017 -6391
13978f391R24O307k07O988Q606r400K165k679m748n876k644Q325n86J0453J0632
$$ -6391 -5467 840 633 7621 16227 6827 8992 6313 1565 -4311 -6955 1370 784 11237 21869
13963B1869p130j9794q081K401N473j683m949J1304N346L987j73o386L165J760
$$ 21869 14739 -5055 -13136 -10735 -5262 -6945 -11894 -590 4756 8743 8570 2184 5349 7109
13949G109Q90J228K592k466r024p98M449l414j1823O378J696q56o75J2069q28
$$ 7109 7999 9227 11819 9353 329 -469 3980 566 -11257 -4879 -3183 -4039 -4714 7355 6527
13934F527O281J019q757r70p059n103k679P170J144j0546J935N054P151K032j585
$$ 6527 12808 13827 5070 4100 -2959 -8062 -10741 -3571 -2427 -12973 -11038 -5984 1167 3199 1614
13919A614j673K722j618p226m337M928L959N212k921K384n862k650N685P797J899
$$ 1614 -59 2663 1045 -6181 -10518 -5590 -1631 3581 660 3044 -2818 -5468 217 8014 9913
13904I913j1903r03L909n347o643l435l422P676R624M442M751m281m796p979r365
$$ 9913 -1990 -2893 1016 -4331 -10974 -14409 -17831 -10155 -531 3911 8662 4381 -415 -8394 -17759
13889a7759J231Q601L993Q158k88r308l869L466K048R960O831j4216K33P74N923
$$ -17759 -16528 -7927 -3934 4224 3936 -5372 -9241 -5775 -3727 6233 13064 -1152 -919 -145 5778
13874E778M48J0175Q976j979j8813o146o34L000n005M862K472J954L722N786j7247
$$ 5778 6226 16401 25377 23398 4585 -1561 -2195 805 -4200 662 3134 5088 8810 14596 -2651
13859b651j6311L034K185L918J1182J0613k898p980l229o32m317q36N126m23k559
$$ -2651 -18962 -15928 -13743 -9825 1357 11970 9072 1092 -2137 -2769 -7086 -7922 -2796 -3219 -5778
13844e778M098K222m753j49M44J2417j391j2247O672L514j013M463j4559o620
$$ -5778 -1680 542 -4211 -4360 -3916 8501 7110 -5137 1535 5049 4036 8499 -6060 -12680
13830a2680j502N492o152m526m316j0030l223K158J5876J0959M196L416L353o320
$$ -12680 -14182 -8690 -14842 -19368 -23684 -33714 -36937 -34779 -18903 -7944 -3748 -332 3021 -3299
13816c299O464L027m203j611K154l531M547J0960o794l425p0K797r519j1305j763
$$ -3299 3165 6192 1989 378 2532 -999 3548 14508 7714 4289 4219 7016 -2503 -13808 -15571
13801a5571Q251J549L927J1840L253n667p312k425N199L970n545l815K982l765
$$ -15571 -7320 -5771 -1844 9996 13249 7582 270 -2155 3044 7014 1469 -2346 636 -3129
13787c129J627n112K739k289j2388N265J2692J049K535j459k108J2590J709j1511
$$ -3129 -1502 -6614 -3875 -6164 -18552 -13287 -595 454 2989 1530 -578 12012 13721 2210
13773B210p986o880O000J285p437M466M102J18M182o321r355MN350j876r649K28
$$ 2210 -5776 -12656 -6656 -5371 -12808 -8342 -4240 -4122 60 -6261 -15616 -15612 -10262 -12138 -21787 -21559
13757b1559J3312N070Q661J001m663N364N058m043R709j5401l960K224j259N036
$$ -21559 -8247 -3177 5484 6485 1822 7186 12244 8201 17910 2509 -1451 773 -486 4550
13743D550q227m909N242R213M127k597J0n53k658k836K68p927l440l529j255O540
$$ 4550 -3677 -8586 -3344 5869 9996 7399 7409 6856 4198 1362 1630 -6297 -9737 -13266 -14521 -7981
13727g981K080J0432K855r077n848J256R47r901J461O602O675l207O309M742o116
$$ -7981 -5901 4531 7386 -1691 -7539 -6283 -5336 -15237 -13776 -7174 -499 -3706 2603 7345 1229
13712A229j4927j3727r8K933j058j093L116O577P270M404l64K96n121o565p415
$$ 1229 -13698 -27425 -27523 -24590 -25648 -26741 -23625 -17048 -9778 -5374 -5738 -5442 -10563 -17128 -24543
13697b4543J494K43N036k21O815O184N465K119j294j595r224n165R90N560j272
$$ -24543 -23049 -22806 -17770 -17991 -11176 -4992 473 2592 1298 -297 -9521 -14686 -13696 -8136 -9408
13682i408J390k43l542J0541J41k214P344m970n513O17o73M555J4128J2121q121
$$ -9408 -8018 -8261 -11803 -1262 -1121 -3335 4009 -961 -6474 -5857 -6530 -1975 12153 24274 16153
13667A6153j3156q558j1605O132K745K330j3482l273L782J0037r28o310M516K513
$$ 16153 2997 -5561 -17166 -11034 -8289 -5959 -19441 -22714 -18932 -8895 -9823 -16133 -11617 -9104
13653i104R81P915J733p286j2811j2887K1003P998J137k59N63m192p97P705J482
$$ -9104 -8123 -208 1525 -5761 -18572 -31459 -10456 -2458 -1321 -1580 -1017 -5209 -6006 1699 3181
13638C181O497j5281o805J0393J791n160j1194n973O092J1379J950n458j7854
$$ 3181 9678 -5603 -12408 -2015 -224 -5384 -16578 -22551 -16459 -5080 -3130 -8588 -26442
13625b6442L436N535J0827J2111m802o628M788M003M015K781M87P57j459p842
$$ -26442 -23006 -17471 -6644 5467 665 -5963 -1175 2828 6843 9624 10111 10868 9409 1567
13611A567j0901n017m675k334J0745P438O150P324l786q009J0055J5280O212J083
$$ 1567 -9334 -14351 -19026 -21360 -10615 -3177 2973 10297 6511 -1498 8557 23837 30049 31132
13597C1132j3571j7062j8849j1046l841P733R940K835M297K0452k858j1383l915
$$ 31132 17561 499 -18350 -29396 -33237 -25504 -15564 -12729 -8432 12020 9162 -2221 -6136
13584f136J684n797j0014J46l58Q934J6364R668k195m882j3965j9463j3381Q348
$$ -6136 -4452 -10249 -20263 -20117 -20475 -11541 4823 14491 12296 7414 -6551 -26014 -39395 -31047
13570c1047N816k777J6727J6851Q921M94r608n930k546R890J2931k690j6428j0386
$$ -31047 -25231 -28008 -11281 5570 14491 14985 5377 -553 -3099 6791 19722 17032 604 -9782
13556i782o662k978L136j34J2307J2528J1298m835j2221r088l365l197j224K770
$$ -9782 -16444 -19422 -16286 -16420 -4113 8415 19713 14878 2657 -6431 -9796 -12993 -14217 -11447
13542a1447k531j637O926n99q776l661j090K670J345M206Q042P735m737r580k272
$$ -11447 -13978 -15615 -8689 -9288 -18064 -21725 -22815 -20145 -18800 -14594 -6552 1183 -3554 -13134 -15406
13527a5406P507Q011J0367Q737L407j2317m84j38l93k571q560q2J0916L357l594
$$ -15406 -7899 112 10479 19216 22623 10306 9822 9684 9291 6720 -1840 -1922 8994 12351 8757
13512H757n835N037J008O09L232j1159j5112M786O683J398l106K410K698l691
$$ 8757 2922 7959 8967 9576 12808 1649 -13463 -8677 -1994 -596 -3702 -1292 1406 -2285
13498b285j4240l601P413M359q45l876m485O796O263l030r663N332r276o763Q376
$$ -2285 -16525 -20126 -12713 -8354 -9199 -13075 -17560 -10764 -4501 -7531 -17194 -11862 -21138 -27901 -19525
13483a9525j556k930K972n493k022O824N581K885j616o574J417O96K720k070L984
$$ -19525 -21081 -24011 -21039 -26532 -28554 -21730 -16149 -13264 -14880 -21454 -20037 -19341 -16621 -18691 -14707
13468a4707k250L406N304L897j980J269l485j708K500J741n882L071p047p852
$$ -14707 -16957 -13551 -8247 -4350 -6330 -5061 -8546 -10254 -7754 -6013 -11895 -8824 -15871 -23723
13454b3723P911K343N376O87n832R086M020j11J478m582q898R86O437R010l933
$$ -23723 -15812 -13469 -8093 -7406 -13238 -4152 -132 -243 1235 -3347 -12245 -11259 -4822 4188 255
13439B55n117j773M394o559k292n342K293J0970J5549r087K42l814q685o438L331
$$ 255 -4862 -6635 -2241 -8800 -11092 -16434 -14141 -3171 12378 3291 3533 -281 -8966 -15404 -12073
13424a2073r192j1861M214Q578O222R639R19k140J943J73J501O215j122K318J2590
$$ -12073 -21265 -33126 -28912 -20334 -14112 -4473 -3554 -5694 -3751 -3578 -2077 4138 3016 5334 17924
13409A7924j744j0150j2512n068P242P49j2197k932J532m840j993M671j099M195
$$ 17924 16180 6030 -6482 -11550 -4308 -3559 -15756 -18688 -17156 -21996 -23989 -19318 -20417 -16222
13395a6222M576P242J3095N131m289k917O477l577j4209m535L115PL378L148K
$$ -16222 -11646 -4404 8691 13822 9533 6616 13093 9516 -4693 -9228 -6113 -6106 -2728 420 422
13380D22M752M54j185m417o057M684J173P847l893j6097L298Q28O441O843Q091
$$ 422 5174 5628 4443 26 -6031 -1347 -174 7673 3780 -12317 -9019 -8191 -1750 5093 13184
13365A3184n646o88l437M102N23j110N330l868o429J716l844L560N859M946k130
$$ 13184 7538 6850 3413 7515 8038 6928 12258 8390 1961 3677 -167 3393 9252 14198 12068
13350A2068l764j1659j1682l757K50Q443O375n749m59m05K08m390K061K730K038
$$ 12068 8304 -3355 -15037 -18794 -18544 -10101 -3726 -9475 -9934 -10339 -10131 -14521 -12460 -9730 -7692
13335g692J136j783j156J81l233k150J674R422L551q626l186k126L784L352j1123
$$ -7692 -6556 -8339 -9495 -9314 -12547 -14697 -13023 -3601 -50 -8676 -11862 -13988 -10204 -6852 -17975
13320a7975m58M795L765M443J55j1818p542k425M314J1415J4554n555k061K060
$$ -17975 -18433 -13638 -9873 -5430 -5275 -17093 -24635 -27060 -22746 -11331 3223 -2332 -4393 -2333
13306b333K698q176L875P342P557J0691j943j0570j7870o019M961m916j615J2408
$$ -2333 365 -7811 -3936 3406 10963 21654 19711 9141 -8729 -14748 -9787 -14703 -16318 -3910
13292c910O908J0655L338J043O71n142l068n570l406K487R076j753r729N412L448
$$ -3910 2998 13653 16991 18034 18705 13563 10495 4925 1519 4006 13082 11329 1600 7012 10460
13277A0460L007q585m256q059k24q620l510J65K316P555J1018N795m733k824m544
$$ 10460 13467 4882 626 -7433 -7657 -16277 -19787 -19622 -17306 -9751 1267 7062 2329 -495 -5039
13262e039n001k277m5J729K498j297n340L834J4875o538j421o51l917n739J0350
$$ -5039 -10040 -12317 -12362 -10633 -8135 -9432 -14772 -10938 3937 -2601 -4022 -4673 -8590 -14329 -3979
13247c979L063j618n669J430J667L222j0652q214R858Q384r181M003P108K722
$$ -3979 -916 -2534 -8203 -6773 -5106 -1884 -12536 -20750 -10892 -2508 -11689 -7686 -578 2144
13233B144M709j349k551j712P278k70L297j3468k983J074J846K184P91L55j602
$$ 2144 6853 5504 2953 1241 8519 8249 11546 -1922 -4905 -3831 -1985 199 990 1345 -257
13218b57K394L520l374o343m613O369M662J174j46q226j009K879L240l695N818
$$ -257 2137 5657 2283 -4060 -8673 -2304 2358 3532 3386 -4840 -5849 -2970 270 -3425 2393
13203B393J397q94J007k555J311l000o82P190r816j7420M872J5147Q225O419O257
$$ 2393 3790 2896 3903 1348 2659 -341 -1023 6167 -3649 -21069 -16197 -1050 7175 13594 19851
13188A9851r08p207l121l419k175L23j990k918m70p179M93M026K840j521o592
$$ 19851 18943 11736 8615 5196 3021 3344 1354 -1564 -2034 -9213 -8720 -4694 -1854 -3375 -9967
13173i967j0053L075Q694m183n161p657o415P670J1004Q176R236J2284M042j303
$$ -9967 -20020 -16945 -8251 -12434 -17595 -25252 -31667 -23997 -12993 -4817 4419 16703 20745 19442
13159A9442j2594j1255R58K248Q64l880J669m657K624J6967j968j6906L047L490
$$ 19442 6848 -4407 -3449 -1201 -337 -4217 -2548 -7205 -4581 12386 10418 -6488 -3441 49
13145D9P63p360m653r95K47R454K695J747j355p53M245j3146p076K850R128Q781
$$ 49 812 -6548 -11201 -12196 -11949 -2495 200 1947 592 -161 4084 -9062 -16138 -13288 -4160 4621
13129D621J181o294O58N697J602k899j1137k692K684k457R17O644N974j696P498
$$ 4621 5802 -492 166 5863 7465 4566 -6571 -9263 -6579 -9036 -8119 -1475 4499 2803 10301
13114A0301n420r581k974N893j01n3k068O745M684j0957j2196J9816J24k913l798
$$ 10301 4881 -4700 -7674 -1781 -1882 -1935 -4003 2742 7426 -3531 -15727 4089 4213 1300 -2498
13099b498p982l967J0066P074M09k325J52k975k173p983j840K459K270L655J325
$$ -2498 -10480 -14447 -4381 2693 3102 777 929 -2046 -4219 -12202 -14042 -11583 -9313 -5658 -4333
13084d333O773O381N191K13o770m657k937Q59M138o91q329j1141P06l34O190m013
$$ -4333 2440 8821 14012 14225 7455 2798 -139 720 4858 4167 -4162 -15303 -14597 -14931 -8741 -12754
13068a2754L541O927j355n881J226M593L963p276j121K398O61q73j253O495k968
$$ -12754 -9213 -2286 -3641 -9522 -8296 -3703 260 -7016 -8137 -5739 -5078 -5951 -7204 -709 -3677
13053c677L281J4106l789j6990j200J445K945n451J3431Q127j0008N432O698k60
$$ -3677 -396 13710 9921 -7069 -8269 -6824 -3879 -9330 4101 12228 2220 7652 14350 14090
13039A4090k947o752o440L138K519P72J278k850o671o79L83O187J304N497J3855
$$ 14090 11143 4391 -2049 1089 3608 4380 5658 2808 -3863 -4542 -4159 2028 3332 8829 22684
13024B2684r143n137l60Q70q70k093q677k091J9823k984p504J843L83L71j1853
$$ 22684 13541 8404 8044 8914 8044 5951 -2726 -4817 15006 12022 4518 6361 6744 7115 -4738
13009d738n041q17l702O55l356P663M247P394P064k790j2179r383P92N938P508
$$ -4738 -9779 -10596 -14298 -13643 -16999 -9336 -5089 2305 9369 6579 -5600 -14983 -14191 -8253 -745
12994g45O837P706n767l433R818j4019l226M927k779m815l442M35j1l6L526r9
$$ -745 6092 13798 8031 4598 14416 397 -2829 2098 -681 -5496 -8938 -8503 -8514 -8550 -5024 -5123
12978e123L461o93j533m321J312P159k216J018L179j215K243l290p529l09R044
$$ -5123 -1662 -2355 -3888 -8209 -6897 262 -1954 -936 2243 1028 3271 -19 -7548 -7857 1187
12963A187K193q523n65J2135J0456n58m752n323q18n019k786O602j3584p219N024
$$ 1187 3380 -5143 -5708 6427 16883 16325 11573 6250 5432 413 -2373 4229 -9355 -16574 -11550
12948a1550R772L409O15J2399P908q528m271o781Q94Q740j774k657k553l009k835
$$ -11550 -1778 1631 2246 14645 22553 14025 9754 2973 3867 12607 10833 8176 5623 2614 -221
12933b21R74M038K639j074q165r210q61Q393L246p903O398K025L532N065o714
$$ -221 753 4791 7430 6356 -1809 -11019 -11880 -3487 -241 -8144 -1746 279 3811 8876 2162
12918B162j2275l55r61k740P607O392J755j255j478K434l266j387M458p379m240
$$ 2162 -10113 -10468 -11429 -14169 -6562 -170 1585 330 -1148 1286 -1980 -3367 1091 -6288 -10528
12903a0528M847l30k157O754K219J0115P810j3166K875j050n194m464O368J5557
$$ -10528 -5681 -6011 -8168 -1414 805 10920 18730 5564 8439 7389 2195 -2269 4099 19656
12889A9656j291o136o881K771n018m859L238l712l074j1217R868R742j503m265
$$ 19656 18365 12229 5348 8119 3101 -1758 1480 -2232 -5306 -16523 -6655 3087 1584 -2681
12875b681K83k224M935l000o65k117N638O565K888l965j878o948J3098O386p99
$$ -2681 -2398 -4622 313 -2687 -3352 -5469 169 6734 9622 5657 3779 -3169 9929 16315 15516
12860A5516o087n512M455J197l6M464M690M509K287j1416j1074l656j871n303
$$ 15516 9429 3917 8372 9569 9533 13997 18687 23196 25483 14067 2993 -663 -2534 -7837
12846g837P228J894J088J1170J2080q393l714o74Q246L573j2572j2058k391N444
$$ -7837 -609 1285 2373 13543 25623 17230 13516 12842 21088 24661 12089 31 -2360 3084
12832C084N790L12K768K54o587m460l427m67l003j772P249P368k611j1471M618
$$ 3084 8874 9186 11954 12208 5621 1161 -2266 -2733 -5736 -7508 -259 7109 4498 -6973 -2355
12817b355J4029K865k53M859O690M992m967p927j0725j170M228p0L100J58L090
$$ -2355 11674 14539 14286 19145 25835 30827 25860 17933 7208 6038 10266 10196 13296 13454 16544
12802A6544R429j487j6572q558m73L181m202m462J332m990L538J2566K895l281
$$ 16544 25973 24486 7914 -644 -1117 2064 -2138 -6600 -5268 -10258 -6720 5846 8741 5460
12788E460N790l391o101n957R267N676m460L716J72J810P968m558o126j387o358
$$ 5460 11250 7859 1758 -4199 5068 10744 6284 10000 10172 11982 19950 15392 9266 7879 1521
12773A521j373L96L686Q286J554O328Q68n763n952l318l492L245j256J954M633
$$ 1521 148 544 4230 12516 14070 20398 21266 15503 9551 6233 2741 5986 4730 6684 11317
12758A1317p511n41j182J4244O539j909j274J011j0325j1106n698K840Q52j869
$$ 11317 3806 3265 2083 16327 22866 20957 19683 20694 10369 -737 -6435 -3595 -2743 -4612
12744d612J1532O848M664K131l189O296K99N748j894j5947k194N616o300m910
$$ -4612 6920 13768 18432 20563 17374 23670 23969 29717 27823 11876 9682 15298 8998 4088
12730D088P029k049l844k008J0481J871l775r815o577J1865Q605l52l240L050
$$ 4088 11117 9068 5224 3216 13697 15568 11793 1978 -4599 7266 15871 15519 12279 15329
12716A5329N105J983O455m933o27o877j475n016k465p456Q273J2812L385M652
$$ 15329 20434 22417 28872 23939 23312 16435 14960 9944 7479 23 8296 21108 24493 29145
12702B9145n167j2250k713n137J004J774K612M907l042M510N200K344K604j660
$$ 29145 23978 11728 9015 3878 4882 6656 9268 14175 11133 15643 20843 23187 25791 24131
12688B4131M970O572q766o398m446l280l258J247O851K003j585r613q972k927
$$ 24131 29101 35673 26907 20509 16063 12783 9525 10772 17623 19626 18041 8428 -544 -3471
12674c471M254N350K164J907P42L534L920M752j672J953Q9Q550m014j3873n596
$$ -3471 783 6133 8297 10204 10946 14480 18400 23152 21480 23433 23522 32072 28058 14185 8589
12659H589L383N940l624j2582R352P618m839R133J9890L3424J7755l389j2531
$$ 8589 11972 17912 14288 1706 11058 18676 13837 22970 42860 76284 94039 90650 78119
12646G8119j5614j2124j6398q929q918J5j1704l343O12r77M617p638p759R006
$$ 78119 62505 50381 33983 25054 16136 16151 4447 1104 1716 739 5356 -2282 -10041 -1035
12632a035J1970R061J527J3675P808l388r739j5661l878J985m629J834N891m033
$$ -1035 10935 19996 21523 35198 43006 39618 29879 14218 10340 12325 7696 9530 15421 11388
12618A1388k363J0182M509j951o597q050oj330j1402R936J2368M545M089M44m169
$$ 11388 9025 19207 23716 21765 15168 7118 7112 5782 -5620 4316 16684 21229 25318 25762 21593
12603B1593j28j601J72o49k896J002J2340o023p527J151k755M422J9114M266j0466
$$ 21593 21465 19864 20036 19387 16491 17493 29833 23810 16283 17434 14679 19101 38215 42481 32015
12588C2015j2287K179J774r484m819M54R271K0273J216J709L87j2989L492Q253
$$ 32015 19728 21907 23681 14197 9378 9832 19103 39376 40592 42301 42688 29699 33191 41444
12574D1444m426j571k12j1504k901K149J4761J5256L945k543o406j9158m599m56
$$ 41444 37018 35447 35235 23731 20830 22979 37740 52996 56941 54398 47992 28834 24235 23779
12560B3779L543Q084o709L974J3482R215J0089j0883L487J2414J1454J4429J1458
$$ 23779 27322 35406 28697 32671 46153 55368 65457 54574 58061 70475 81929 96358 107816
12547A07816J9502J1255J4757J4797J3886L7652P6352J04372J49014J83586K00610
$$ 107816 127318 138573 153330 168127 182013 219665 296017 400389 549403 732989 933599
12536I33599K14632J96591J19041m557j64158k41815k61958k15821j66794j11016
$$ 933599 1148231 1344822 1463863 1459306 1295148 1053333 791375 575554 408760 297744
12526B97744o5663m2615k4983j9569j5588K08O5l457j2031j3575q078k922j2128
$$ 297744 232081 189466 164483 144914 129326 129534 129599 126142 114111 100536 92458 89536 77408
12513G7408j1867K701m222p440L541M004m098q093L001L699m505O892q775n914
$$ 77408 65541 68242 64020 56580 60121 64125 60027 51934 54935 58634 54129 61021 52246 46332
12499D6332J721k257J346J246m058L671K426k706p461J540N726l074p090L863
$$ 46332 48053 45796 47142 48388 44330 48001 50427 47721 40260 41800 47526 44452 37362 41225
12485D1225k030J38P202m696K794K440j256K746k341m808j606l983m854P703L769
$$ 41225 39195 39333 46535 41839 44633 47073 45817 48563 46222 41414 39808 35825 30971 38674 42443
12470D2443j70J336p965j0580m160M012J094l444P98N429J2509N052j1362k833
$$ 42443 42273 43609 35644 25064 20904 24916 26010 22566 23364 28793 41302 46354 34992 32159
12456C2159n841m333l617K940P191O155K433q371j1904k604l212j3771R588J3775
$$ 32159 26318 21985 18368 21308 28499 34654 37087 28716 16812 14208 10996 -2775 6813 20588
12442B0588p911n780K432J3670J2961n563j984L692L158J3791Q020J762N674j74
$$ 20588 12677 6897 9329 22999 35960 30397 28413 32105 35263 49054 57074 58836 64510 64336
12428F4336J0894Q129n666n784K052o661L479L308J93r24K428r65q215r901L969
$$ 64336 75230 83359 77693 71909 73961 67300 70779 74087 74280 73356 75784 74819 66604 56703 60672
12413F0672M506R621J16l382l88l171p50q608q565j2297o041P84N419P139O695
$$ 60672 65178 74799 74915 71533 71145 67974 67224 58616 50051 37754 31713 32497 37916 45055 51750
12398E1750J5690P815Q684M042o287L183M233n965k746R855L981k172N429Q143
$$ 51750 67440 75255 83939 87981 81694 84877 89110 83145 80399 90254 94235 92063 97492 105635
12384A05635J5441P560J4820K6194K8340M7301O3932R8912J43479J58812J35345
$$ 105635 121076 128636 143456 169650 197990 245291 309223 408135 551614 710426 845771
12373H45771N6323n4712j29556j32040r6912o6251m9147k3352j6522q185M074
$$ 845771 902094 847382 717826 585786 488874 422623 373476 350124 333602 325417 329491
12362C29491K3520K7548K1170K3232k49L611R865J9988L3033K4657J6755J0781
$$ 329491 353011 380559 401729 424961 424712 428323 438188 458176 491209 515866 532621 543402
12350E43402j1942k2341j6027j0715N02J5818L4905N4206R6408J36279J87617
$$ 543402 531460 509119 493092 482377 482879 498697 533602 587808 684216 820495 1008112
12339A008112K15426J78638Q1595l7627j42061j78855j69177j51750j20403p7445
$$ 1008112 1223538 1402176 1483771 1446144 1304083 1125228 956051 804301 683898 606453
12329F06453n1124l5735j3864R426K1896K1858j61j6497j9390j8030k5529k7533
$$ 606453 555329 519594 505730 515156 537052 558910 558749 542252 522862 504832 479303 451770
12317D51770j0506r97N194m196j0694k5502l1236k1127j6m527n555P129K1892
$$ 451770 441264 440267 445461 441265 430571 405069 373833 352706 352690 348163 342608 349737 371629
12304C71629M2646Q0415J10827P5158r55q3294j10509r8521q4904o0181k7109
$$ 371629 414275 494690 605517 680675 679720 596426 485917 387396 302492 242311 215202
12293B15202k5334j8183j7912j4352j1787j1281p959R30K1197K2445J3334k874
$$ 215202 189868 171685 153773 139421 127634 116353 108394 109324 130521 152966 166300 163426
12281A63426m638P898J4868J930j2785k0168k0674q047l11j3353j1903l167k36
$$ 163426 158788 166686 181554 183484 170699 150531 129857 121810 121499 108146 96243 93076 92840
12268I2840K506J9097J4543M999J5500K0968J5939J995J051Q731O642l455R611
$$ 92840 95346 114443 128986 133985 149485 170453 186392 188387 189438 198169 204811 201356 210967
12255B10967K5234L1347M0312M1144L1945L0890J2125n49j3254l8496n9465o2610
$$ 210967 236201 267548 307860 349004 380949 411839 423964 423415 410161 371665 312200 249590
12243B49590n6381m3542k2108j2424o976J1072J2020k117K848k826M550P019p89
$$ 249590 193209 149667 127559 115135 108159 119231 131251 129134 131982 129156 133706 140725 139936
12230A39936p298j3852o024K385j28K0920J8778J7067Q434k125o141O165O717
$$ 139936 132638 118786 112762 115147 115019 135939 154717 171784 180218 178093 171952 178117 184834
12217A84834K499M431m946L401N826J6821J7826J0392J1319J2663N939J606j2611
$$ 184834 187333 191764 186818 190219 196045 212866 230692 241084 252403 265066 271005 272611 260000
12204B60000M340j61j3273J874J2805P728L507O657p506N467J7906M237J2699
$$ 260000 264340 264179 250906 252780 265585 273313 276820 283477 275971 281438 299344 303581 316280
12191C16280M049o06L952J6921J7362R870J4860K9118K6639J7646L3568K8129
$$ 316280 320329 319723 323675 340596 357958 367828 382688 411806 438445 456091 489659 517788
12179E17788K9642L9901L4898K0551K0050K4081L1366M9118N9911O6594O2820
$$ 517788 547430 587331 622229 642780 662830 686911 718277 767395 827306 893900 956720
12168I56720L0914J2667Q188K4324K8291K9502J8960K4383K3748K5095N0457N8750
$$ 956720 987634 1000301 1008489 1032813 1061104 1090606 1109566 1133949 1157697 1182792 1233249 1291999
12156A291999P3648O5097O6756P7968R4300J26765J50009J80347K19307K29541
$$ 1291999 1365647 1430744 1497500 1575468 1669768 1796533 1946542 2126889 2346196 2575737
12146B575737K23183K21902K42325K97707M12177N82047Q06458J102275J440678
$$ 2575737 2798920 3020822 3263147 3560854 3973031 4555078 5361536 6463811 7904489
12137G904489J741315J974630K046605J904306J629363J433974J539669K166132
$$ 7904489 9645804 11620434 13667039 15571345 17200708 18634682 20174351 22340483
12129B2340483L490604N733909R277129J4773806K2890871L3126764M2450492
$$ 22340483 25831087 31564996 40842125 55615931 78506802 111633566 154084058
12122A54084058M7765208M5798153L2380307P771254k1150361m3519407n2559972
$$ 154084058 201849266 247647419 280027726 287798980 266648619 223129212 170569240
12115A70569240m8305105l6939432k5018490j6061334j0242556o522958m103485
$$ 170569240 122264135 85324703 60306213 44244879 34002323 27479365 23375880
12108B3375880k505741j498280r84263r20553j212557j613712j828372j812702
$$ 23375880 20870139 19371859 18387596 17467043 16254486 14640774 12812402 10999700
12100A0999700j630789j387829j140881r16602p20581n78308m73537l70554k88051
$$ 10999700 9368911 7981082 6840201 5923599 5203018 4624710 4151173 3780619 3492568
12091C492568k30934j78380j61827j56272j70671j92486j94578j72341j56765
$$ 3492568 3261634 3083254 2921427 2765155 2594484 2401998 2207420 2035079 1878314
12082A878314j30173j09856r0658p4145o8457n6364l3331k7533r843L763j5098
$$ 1878314 1748141 1638285 1547627 1473482 1405025 1348661 1315330 1287797 1277954 1281717 1266619
12071A266619l4368m7081o2204o2818m4843l5459l3948l9534l6555l6109m3568
$$ 1266619 1232251 1185170 1122966 1060148 1015305 979846 945898 906364 869809 833700 790132
12060G90132k5024r677k0900k0103j2002j6569k6475l5219k8347k0975j2451l858
$$ 790132 765108 755431 734531 714428 702426 685857 659382 624163 595816 574841 562390 558532
12048E58532n472p841j2808j5909r092q473j3194j4311j1506p873k2292k6025
$$ 558532 553060 545219 532411 516502 507410 498937 485743 471432 459926 452053 429761 403736
12036D03736j8713j1797n312j5785k2445j2236n85j056j309k947O529n652o051
$$ 403736 385023 373226 367914 352129 329684 317448 316863 315807 314498 311551 318080 312428 306377
12023C06377j1614q034J23N064r13m105k210k868J1881J521k847J0721o76j4489
$$ 306377 294763 286729 286852 291916 291003 286898 284688 281820 293701 295222 292375 303096 302420 287931
12009B87931j3332j9744j1409o360r617N110J4547K1797K1216K3921L4385L8568
$$ 287931 274599 254855 243446 237086 227469 232579 247126 268923 290139 314060 348445 387013
11997C87013K3582J3676j066j7795j9529l7164o1695p2261n9572l6716j4158o598
$$ 387013 410595 424271 423205 405410 385881 348717 287022 214761 155189 118473 104315 97717
11985I7717j102l246m70K142R650J2073N710P143J2750M402N120p437p805M296
$$ 97717 96615 93369 92899 95041 104691 116764 122474 129617 142367 146769 151889 144452 136647 140943
11971A40943J7838M657j4142j2222j4239j2623m481j0158m50q749o159m146l363
$$ 140943 158781 163438 149296 137074 122835 110212 105731 95573 95123 86374 80215 76069 72706
11958G2706l84j85k05J1549O473P916K555j4516m479k129m877o36l987l57J1536
$$ 72706 72322 72137 71932 83481 89954 97870 100425 85909 81430 79301 74424 73788 69801 69444 80980
11943H0980J1136R347P310L505n0m391j4027m217K147J323n777l668o183j0144
$$ 80980 92116 101463 108773 112278 112228 107837 93810 89593 91740 93063 87286 83618 77435 67291
11929F7291n709m565k628r336K604Q159P340m253r171n324j400p09K690p60J212
$$ 67291 61582 57017 54389 45053 47657 55816 63156 58903 49732 44408 43008 42299 44989 44229 45441
11914D5441J341M930p127j1689q432k378j0185j5802R970J0001L908J297k34N731
$$ 45441 46782 51712 44585 32896 24464 22086 11901 -3901 6069 16070 19978 21275 21041 26772
11900B6772R096L792o004L784o997K952P710M540p500n679m716n000n796N502
$$ 26772 35868 39660 33656 37440 30443 33395 41105 45645 38145 32466 27750 22750 16954 22456
11886B2456N079O262M724l434r58P124P204k855k2J868L21K364o639l659Q305
$$ 22456 27535 33797 38521 35087 34129 41253 48457 45602 45580 47448 47769 50133 43494 39835 48140
11871D8140P691P147r02O755J1378N506p44j6201j1729J481J1005J306p788l338
$$ 48140 55831 62978 62076 68831 80209 85715 84971 68770 57041 58522 69527 70833 63045 59707
11857E9707P141j1764j1236j2160q078Q30J8195L859k796j1455M311l283K153
$$ 59707 66848 55084 43848 31688 23610 24440 42635 46494 43698 32243 36554 33271 35424
11844C5424P839o768p629L65K727K959L463J2510P661n158p546m15m197n020r367
$$ 35424 43263 36495 28866 29231 31958 34917 38380 50890 58551 53393 45847 45432 41235 36215 26848
11829B6848K125K664l564o57q73l414P553j510k524j1353j2404k996L67K953N679
$$ 26848 28973 31637 28073 27416 26543 23129 30682 29172 26648 15295 2891 -105 262 3215 8894
11814H894l845M741R597M27q288n609J265J3094M758k375J1557J3539n38J76j1617
$$ 8894 5049 9790 19387 19814 11526 5917 7182 20276 25034 22659 34216 47755 47217 47393 35776
11799C5776k693J2615J0508J427m73k832p066o427p774J571m436O94O920Q402
$$ 35776 33083 45698 56206 57633 57160 54328 47262 40835 33061 34632 30196 30890 37810 46212
11785D6212M888l431r368Q73O590q349k629n645j09J250N066k314p542l776R390
$$ 46212 51100 47669 38301 39174 45764 37415 34786 29141 29032 30282 35348 33034 25492 21716 31106
11770C1106l789j335M358k476k767n773o913j1508O369O94J635N501q32P96j079
$$ 31106 27317 25982 30340 27864 25097 19324 12411 903 7272 7966 9601 15102 14270 15066 13987
11755A3987p79O857J2416L055J3656r224q456L5l839J0233J761j099m508o590
$$ 13987 13208 20065 32481 35536 49192 39968 31512 31547 27708 37941 39702 38603 34095 27505
11741B7505P782L312M496P23k232k856j925J043l939L973J6126n900j36M659M411
$$ 27505 35287 38599 43095 43818 41586 38730 36805 37848 33909 37882 54008 48108 47972 52631 57042
11726E7042O985k829q430M571J563k481n3J833N456J7104J9474P574R329Q383
$$ 57042 64027 61198 52768 57339 58902 56421 56368 58201 63657 80761 100235 107809 117138 125521
11712A25521K792J3524R522J3139K7660M1871N3434Q3622J21643J89821K37468
$$ 125521 128313 141837 151359 164498 192158 234029 287463 371085 492728 682549 920017
11701I20017K66117K16986J12234j9971j50983k16086k21517k01984j74722j34895
$$ 920017 1186134 1403120 1515354 1495383 1344400 1128314 906797 704813 530091 395196
11691C95196q3689n5054l0780j2635r390k916j201j6478r240m794L115O389j5648
$$ 395196 311507 256453 225673 213038 203648 200732 199531 183053 173813 169019 172134 178523 162875
11678A62875k4322o813N610n653r829K150k84j995J0100K0322J4933m761m002
$$ 162875 138553 131740 137350 131697 121868 124018 123734 121739 131839 152161 167094 162333 158331
$$ [...]
##END NTUPLES=NMR SPECTRUM
##END=
