##TITLE=Analysis number 329464
Compound Code mo 07178
Book Reference a
Project Code adrs
Chemist Name stores
##JCAMPDX= 6.0         $$ Bruker NMR JCAMP-DX V2.0
##DATA TYPE= NMR SPECTRUM
##DATA CLASS= NTUPLES
##ORIGIN= Bruker BioSpin GmbH
##OWNER= nmr
$$ XWIN-NMR		Version 3.5
$$ Tue Sep  4 11:25:45 2007 GMT Daylight Time (UT+1h)  MAYBRIDGE\nmr@NMR_250MHZ
##.OBSERVE FREQUENCY= 250.131544655141
##.OBSERVE NUCLEUS= ^1H
##.ACQUISITION MODE= SIMULTANEOUS (DQD)
##.ACQUISITION SCHEME= undefined
##.AVERAGES= 16
##.DIGITISER RES= 18
##SPECTROMETER/DATA SYSTEM= dpx250
##.PULSE SEQUENCE= zg30
##.SOLVENT NAME= CDCl3
##.SHIFT REFERENCE= (INTERNAL, CDCl3, 0, 16.522)
##AUDIT TRAIL= $$ (NUMBER, WHEN, WHO, WHERE, WHAT)
$$ ##TITLE= Audit trail, XWIN-NMR		Version 3.5
$$ ##JCAMPDX= 5.01
$$ ##ORIGIN= Bruker BioSpin GmbH
$$ ##OWNER= nmr
$$ C:\u/data/dgb/nmr/ADRS/180/pdata/1/auditp.txt
$$ ##AUDIT TRAIL=  $$ (NUMBER, WHEN, WHO, WHERE, WHAT)
(   1,<2007-09-04 11:25:25.53 +100>,<MAYBRIDGE\nmr>,<NMR_250MHZ>,
      <created by zg, POWCHK disabled, PULCHK disabled
       configuration hash MD5:
       76 6E 9A 78 1E 09 19 81 EC 84 63 8F B0 6A 59 2D
       data hash MD5: 64K
       97 A7 06 B1 47 F8 18 42 58 63 C4 BC 89 89 68 39>)
(   2,<2007-09-04 11:25:36.84 +100>,<MAYBRIDGE\nmr>,<NMR_250MHZ>,
      <Start of raw data processing
       ef LB = 0.3 FT_mod = 6 PKNL = 1 SI = 32K 
       data hash MD5: 32K
       3E B9 66 E2 63 EA 73 25 5B 99 E7 D8 EB 04 43 FD>)
(   3,<2007-09-04 11:25:38.39 +100>,<MAYBRIDGE\nmr>,<NMR_250MHZ>,
      <apk 
       data hash MD5: 32K
       C6 93 2B D1 99 D6 3A 03 7D C7 B2 DC E4 E3 40 E3>)
(   4,<2007-09-04 11:25:39.08 +100>,<MAYBRIDGE\nmr>,<NMR_250MHZ>,
      <abs ABSG = 5 
       data hash MD5: 32K
       72 EF 53 6A 66 96 3E FB 08 C6 A2 B7 C3 43 00 6F>)
$$ ##END=
$$ 
$$ hash MD5
$$ 3D 28 24 91 9D 9A 00 1E F1 CD 2F C7 14 D9 DC F7
##$RELAX= 
##$RELAX= 
##$RELAX= 
##$RELAX= 
##$RELAX= 
##$RELAX= 
##$RELAX= 
$$ Bruker specific parameters
$$ --------------------------
##$DU= <C:\u>
##$EXPNO= 180
##$NAME= <ADRS>
##$PROCNO= 1
##$TYPE= <nmr>
##$USER= <dgb>
##$AMP= (0..31)
100 100 100 100 100 100 100 100 100 100 100 100 100 100 100 100 100 100 
100 100 100 100 100 100 100 100 100 100 100 100 100 100 
##$AQSEQ= 0
##$AQ_mod= 3
##$AUNM= <au_zg>
##$AUTOPOS= <57 >
##$BF1= 250.13
##$BF2= 250.13
##$BF3= 250.13
##$BF4= 250.13
##$BF5= 500.13
##$BF6= 500.13
##$BF7= 500.13
##$BF8= 500.13
##$BYTORDA= 1
##$CFDGTYP= 0
##$CFRGTYP= 5
##$CHEMSTR= <none>
##$CNST= (0..31)
1 1 145 1 1 1 1 1 1 1 1 1 1 1 1 1 1 1 1 1 1 1 1 1 1 1 1 1 1 1 1 1 
##$CPDPRG= <>
##$CPDPRG1= <>
##$CPDPRG2= <>
##$CPDPRG3= <>
##$CPDPRG4= <mlev>
##$CPDPRG5= <mlev>
##$CPDPRG6= <mlev>
##$CPDPRG7= <mlev>
##$CPDPRG8= <mlev>
##$CPDPRGB= <>
##$CPDPRGT= <>
##$D= (0..31)
0 1 0 0 0 0 0 0 0 0.06 0 0 0 0 0 0 0.0002 0 0 0 0 0 0 0 0 0 0 0 0 0 0 
0 
##$DATE= 1188901524
##$DBL= (0..7)
120 120 120 120 120 120 120 120 
##$DBP= (0..7)
150 150 150 150 150 150 150 150 
##$DBP07= 0
##$DBPNAM0= <>
##$DBPNAM1= <>
$$ [...]
##$SUBNAM7= <"">
##$SUBNAM8= <"">
##$SUBNAM9= <"">
##$SW= 20.6930455092707
##$SWIBOX= (0..15)
0 0 3 0 0 0 0 0 0 0 0 0 0 0 0 0 
##$SW_h= 5175.983436853
##$TD= 65536
##$TD0= 1
##$TE= 296.16
##$TE2= 300
##$TE3= 300
##$TEG= 300
##$TL= (0..7)
0 120 120 120 120 120 120 120 
##$TP= (0..7)
150 150 150 150 150 150 150 150 
##$TP07= 0
##$TPNAME0= <>
##$TPNAME1= <>
##$TPNAME2= <>
##$TPNAME3= <>
##$TPNAME4= <>
##$TPNAME5= <>
##$TPNAME6= <>
##$TPNAME7= <>
##$TPOAL= (0..7)
0.5 0.5 0.5 0.5 0.5 0.5 0.5 0.5 
##$TPOFFS= (0..7)
0 0 0 0 0 0 0 0 
##$TUNHIN= 0
##$TUNHOUT= 0
##$TUNXOUT= 0
##$USERA1= <user>
##$USERA2= <user>
##$USERA3= <user>
##$USERA4= <user>
##$USERA5= <user>
##$V9= 5
##$VALIST= <valist>
##$VCLIST= <CCCCCCCCCCCCCCC>
##$VD= 0
##$VDLIST= <DDDDDDDDDDDDDDD>
##$VPLIST= <PPPPPPPPPPPPPPP>
##$VTLIST= <TTTTTTTTTTTTTTT>
##$WBST= 1024
##$WBSW= 4
##$XGAIN= (0..3)
0 0 0 0 
##$XL= 0
##$YL= 0
##$YMAX_a= 373453
##$YMIN_a= -219282
##$ZGOPTNS= <>
##$ZL1= 120
##$ZL2= 120
##$ZL3= 120
##$ZL4= 120
##$ABSF1= 16.522
##$ABSF2= -4.171173
##$ABSG= 5
##$ABSL= 3
##$ALPHA= 0
##$AQORDER= 0
##$ASSFAC= 0
##$ASSFACI= 0
##$ASSFACX= 0
##$ASSWID= 0
##$AUNMP= <proc_1d>
##$AZFE= 0.1
##$AZFW= 0.1
##$BCFW= 0
##$BC_mod= 0
##$BYTORDP= 0
##$COROFFS= 0
##$CY= 12.5
##$DATMOD= 1
##$DC= 0
##$DFILT= <>
##$DTYPP= 0
##$F1P= 14.0000005364418
##$F2P= -0.99999901652339
##$FCOR= 0.5
##$FTSIZE= 32768
##$FT_mod= 6
##$GAMMA= 0
##$GB= 0
##$INTBC= 1
##$INTSCL= 1
##$ISEN= 128
##$LB= 0.3
##$LEV0= 0
##$LPBIN= 0
##$MAXI= 10000
##$MC2= 0
##$MEAN= 0
##$ME_mod= 0
##$MI= 0
##$NCOEF= 0
##$NC_proc= -4
##$NLEV= 6
##$NOISF1= 0
##$NOISF2= 0
##$NSP= 0
##$NTH_PI= 0
##$NZP= 0
##$OFFSET= 16.522
##$PC= 1
##$PHC0= -35.16932
##$PHC1= 5.411723
##$PH_mod= 1
##$PKNL= yes
##$PPARMOD= 0
##$PSCAL= 4
##$PSIGN= 0
##$REVERSE= no
##$SF= 250.13
##$SI= 32768
##$SIGF1= 0
##$SIGF2= 0
##$SINO= 400
##$SIOLD= 32768
##$SREGLST= <1H.CDCl3>
##$SSB= 0
##$STSI= 32768
##$STSR= 0
##$SW_p= 5175.98343685301
##$SYMM= 0
##$S_DEV= 0
##$TDeff= 65536
##$TDoff= 0
##$TI= <Analysis number 999999
Compound Code 99
Book Reference 9
Project Code 9>
##$TILT= no
##$TM1= 0
##$TM2= 0
##$TOPLEV= 0
##$USERP1= <user>
##$USERP2= <user>
##$USERP3= <user>
##$USERP4= <user>
##$USERP5= <user>
##$WDW= 1
##$XDIM= 32768
##$YMAX_p= 508885321
##$YMIN_p= -400769
$$ End of Bruker specific parameters
$$ ---------------------------------
##NTUPLES= NMR SPECTRUM
##VAR_NAME=  FREQUENCY,     SPECTRUM/REAL,   SPECTRUM/IMAG
##SYMBOL=    X,             R,               I
##VAR_TYPE=  INDEPENDENT,   DEPENDENT,       DEPENDENT
##VAR_FORM=  AFFN,          ASDF,            ASDF
##VAR_DIM=   32768,         32768,           32768
##UNITS=     HZ,            ARBITRARY UNITS, ARBITRARY UNITS
##FACTOR=    0.157963299565203, 1,           1
##FIRST=     4132.6476996994, 0,             0
##LAST=      -1043.33573715361, 0,           0
##MIN=       -1043.33573715361, -400769,     0
##MAX=       4132.6476996994, 508885321,     0
$$ Real data points
##PAGE= N=1
##DATA TABLE= (X++(R..R)), XYDATA
$$ [...]
28178b7327j3367q760L5446L8322K910M986O2112m3986J6850J0942n4378j793
$$ -27327 -40694 -49454 -14008 24314 27224 32210 94322 50336 67186 78128 23750 21957
28166B1957R2623l9576k8498P0100L0188n1512p2374m3750Q5222M2576o287l3205
$$ 21957 114580 75004 46506 116606 146794 95282 22908 -20842 64380 106956 100669 67464
28154F7464M5028l8101l853j04447n1754N1669L7350M3681k27k953j18175p4876
$$ 67464 112492 74391 70538 -33909 -85663 -33994 3356 47037 46810 43857 -74318 -149194
28142a49194K8016Q0354l4312j6654o3195K6691J68504L0549K5497N8120o9067
$$ -149194 -121178 -40824 -75136 -91790 -154985 -128294 40210 70759 96256 154376 85309
28131H5309j13858L75Q0975N5797m2842m7839p7295J6575Q2293j099j2953q4711
$$ 85309 -28549 -28174 52801 108598 65756 17917 -59378 -42803 39490 38391 25438 -59273
28119e9273L2247N1115J8617J0968o1695n4630n6063L3898Q0288l701j360j6666
$$ -59273 -27026 24089 42706 53674 -8021 -62651 -118714 -84816 -4528 -8229 -9589 -26255
28107b6255N5657M0366k1300J0684j05902o9888J8790M2231k1069j66929p284
$$ -26255 29402 69768 48468 59152 -46750 -116638 -97848 -55617 -76686 -243615 -250899
28096b50899O4570l1444M1749M7091n8496J615J08048P74j8569K6737K2870L8250
$$ -250899 -186329 -217773 -176024 -128933 -187429 -185814 -77766 -76992 -95561 -68824 -45954 -7704
28084g704O85l962J4895l0494m0429J32137J2499J642n7291N5588l6704q9840
$$ -7704 -7019 -10981 3914 -26580 -67009 65128 77627 79269 21978 77566 40862 -48978
28072d8978l2710J20747J09855j2937j37748L2029P1684Q349J7475j21190o7309
$$ -48978 -81688 39059 148914 135977 -1771 30258 101942 110291 127766 6576 -60733
28061f0733j43634R21O98l1480K5117O1722R6147q8121k7108q183Q6370P3485
$$ -60733 -204367 -203446 -202748 -234228 -209111 -147389 -51242 -139363 -166471 -174654 -88284 -14799
28049a4799P7916P7754q9312J2148L0738K9407k5850R7135P901r822l2247p7591
$$ -14799 63117 140871 51559 63707 94445 123852 98002 195137 203038 193216 160969 83378
28037H3378j25193j09325p9706j8616J7042J02380J70912J1735J7885p2521m459
$$ 83378 -41815 -151140 -230846 -249462 -232420 -130040 40872 52607 70492 -2029 -6488
28026f488J07875O910N3082K9855o3494o3713o9513N3011N1359l6854q9068n0404
$$ -6488 101387 108297 161379 191234 127740 64027 -5486 47525 98884 62030 -27038 -77442
28014g7442M8894r2690q1251k0434Q885J46137Q2321K2894n4582j01510j8038
$$ -77442 -28548 -121238 -202489 -222923 -214038 -67901 14420 37314 -17268 -118778 -136816
28003a36816P4018J7572N4994O6685K608P281j09799n7014K5796n3702J3751M5357
$$ -136816 -62798 -45226 9768 76453 79061 86342 -23457 -80471 -54675 -108377 -94626 -49269
27991d9269Q7717K6457N0706R004P048l1541o1592K2923r5397j76626q5781Q9712
$$ -49269 38448 64905 115611 124615 131663 100122 38530 61453 -33944 -210570 -296351 -206639
27979b06639R9677J05755j9459k0952L7606O2355M278j0996o4088k5746j2214
$$ -206639 -106962 -1207 -20666 -41618 -4012 58343 62621 51625 -12463 -38209 -50423
27968e0423L5452L610j4591p087j3577P648N8934J41839Q6584n0402M759r746
$$ -50423 -14971 -11361 -25952 -33039 -46616 -38968 19966 161805 248389 197987 202746 193000
27956A93000K2932L5560K3933r2872j24519O7156R7428K185J4200P803j6519l1737
$$ 193000 215932 251492 275425 182553 58034 125190 222618 224803 239003 246806 230287 198550
27944A98550l3469k402q572o0865q6389r621J22808n6249l5262o3563O955m2036
$$ 198550 165081 162679 154107 93242 6853 -2768 120040 63791 28529 -35034 -28079 -70115
27932g0115N1712R6211K1327k9679l4618n1691J19554k1612p8797j8111L9183
$$ -70115 -18403 77808 99135 69456 34838 -16853 102701 81089 2292 -15819 23364
27921B3364k8464j02376M8522J90765L9984m8580K3634M9981k4491J8184J4644
$$ 23364 -5100 -107476 -58954 131811 171795 123215 146849 196830 172339 190523 205167
27910B05167M999J6335n1755l4992r8N0777j03035o255O273j43275j34181M3446
$$ 205167 210166 226501 174746 139754 139656 190433 87398 81143 87416 -55859 -190040 -146594
27898a46594L506Q4674R7244M5140K8891p861l471J0867J2769j09468l7416J6036
$$ -146594 -143088 -58414 38830 83970 112861 105000 101529 112396 125165 15697 -21719 -5683
27886e683k2774R2559N5666k4177o8523n5440n6137j07493m0873K7319J03591
$$ -5683 -28457 64102 119768 95591 27068 -28372 -84509 -192002 -232875 -205556 -101965
27875a01965L1276j3830n7278M9492J02191j04873p8793k1835n0198j7009J33979
$$ -101965 -70689 -84519 -141797 -92305 9886 -94987 -173780 -195615 -245813 -262822 -128843
27864a28843J62031k9785j32429m9500M6780Q2129R5754k0203k0571j9286l3286
$$ -128843 33188 3403 -129026 -178526 -131746 -49617 46137 25934 5363 -13923 -47209
27853d7209j6720j2142J28668m0424L8685k5099J5108L8597j83457j17821O5244
$$ -47209 -63929 -76071 52597 12173 50858 25759 40867 79464 -103993 -221814 -156570
27842a56570Q0806J20736q593k5113R7296N1912m7715p5392j32069j5472K5139
$$ -156570 -75764 44972 36379 11266 108562 160474 112759 37367 -94702 -110174 -85035
27831h5035o192K9040j8519N3462P6553r9594n34N5067N8204n5277j16997q9045
$$ -85035 -91227 -62187 -80706 -27244 49309 -50285 -50819 4248 62452 7175 -109822 -198867
27819a98867l8414L8718K5620L6648J07123J13763o6836j33331m0062n914R6437
$$ -198867 -237281 -198563 -172943 -136295 -29172 84591 17755 -115576 -155638 -161552 -65115
27808f5115K2929k5950M6856K0781J4800k2319P9848L7175J15212M297q9690p0498
$$ -65115 -42186 -68136 -21280 -499 14301 -8018 71830 109005 224217 228514 138824 68326
27796F8326p4013k0305J72676J72720j07415j26152l4148m5344P4087N1869M3941
$$ 68326 -5687 -25992 146684 319404 211989 85837 51689 6345 80432 132301 176242
27785A76242j15590o8811k3519N2688j9811L0710j8032N5924m2012M8700N4779
$$ 176242 60652 -8159 -31678 21010 1199 31909 13877 69801 27789 76489 131268
27774A31268J9670p4365r5269m4951n5576j7436J7892j330M9471P1467q7309j35224
$$ 131268 150938 76573 -18696 -63647 -119223 -136659 -118767 -120097 -70626 841 -86468 -221692
27762b21692K2215l0485k3516K4462O5375J20859R387o7262J21679J9095o1533
$$ -221692 -199477 -229962 -253478 -229016 -163641 -42782 -33395 -100657 21022 40117 -21416
27751b1416m4739O5026O8098R0444P3166o4491r2381R492p673j3710Q4871J1781
$$ -21416 -66155 -1129 66969 157413 230579 166088 73707 83199 75526 61816 146687 158468
27739A58468n9858l1163L5379o4168L2532J7947o0125r3218o3371m7723O012j1816
$$ 158468 98610 67447 102826 38658 71190 89137 29012 -64206 -127577 -175300 -169288 -181104
27727a81104J09859L5359Q2658Q5602J883j03856j13029l5090j7412o2466P2591
$$ -181104 -71245 -35886 46772 132374 134257 30401 -82628 -117718 -135130 -197596 -125005
27716a25005Q0938n627K3968J01789j22276m554K1564O6734K0141r0634O8980
$$ -125005 -44067 -49694 -25726 76063 -46213 -50767 -29203 37531 57672 -32962 36018
27705C6018P3149j09194j8924O2915J59613P628l6030k0640L2167K3290r2120
$$ 36018 109167 -27 -18951 43964 203577 211205 175175 154535 186702 209992 117872
27694A17872j14120k0204R2591O6801l7244j01964k854M609l4444q9362P9601
$$ 117872 3752 -16452 76139 142940 105696 3732 878 5487 -28957 -118319 -38718
27683c8718K9342K5006j6689r9002L5940R1296J0594j12449m3924L5060L5196
$$ -38718 -9376 15630 -1059 -100061 -64121 27175 37769 -74680 -118604 -83544 -48348
27672d8348o8402m9929J06314K5206P8407L6173N6916q634m7233p2308Q8745j07101
$$ -48348 -116750 -166679 -60365 -35159 43248 79421 136337 127703 80470 8162 96907 -10194
27660a0194M9376j1447j19207n5900J63944J64838L2659j19382o0565M5942J43866
$$ -10194 39182 27735 -91472 -147372 16572 181410 214069 94687 34122 80064 223930
27649B23930q8288j13818k1342K4101J32250k9708j76488p2551M0482J01072l7841
$$ 223930 135642 21824 482 24583 156833 127125 -49363 -121914 -81432 19640 -18201
27638a8201k0016o745o5274M7175j5379M6902j2653L8402O1528P1003j5337O2747
$$ -18201 -38217 -44962 -110236 -63061 -78440 -31538 -44191 -5789 55739 126742 111405 174152
27626A74152q6135q6327o7145q9511M24J14658M3681O8807N6771j02812l2964
$$ 174152 88017 1690 -65455 -154966 -154542 -39884 3797 72604 129375 26563 -6401
27615f401k416q2156p8691M6140M2266q2185N5182m5823J5305M3805P1681P3031
$$ -6401 -8817 -90973 -169664 -123524 -81258 -163443 -108261 -154084 -138779 -94974 -23293 49738
27603D9738k6398L4674M1910L3750p1142r1513q2407Q4299Q9021P8031K1208p0121
$$ 49738 23340 58014 99924 133674 62532 -28981 -111388 -27089 61932 139963 161171 91050
27591I1050r4369p4397p4759J10426K9245K5487J23998M1115k4153o0884q9050
$$ 91050 -3319 -77716 -152475 -42049 -12804 12683 136681 177796 153643 92759 3709
27580C709L2562O1258l27K0010l5932R2939J124p784M6291L9806m5976O63p3661
$$ 3709 36271 97529 97202 117212 81280 174219 175343 167559 213850 253656 207680 208343 134682
27567A34682q7803m6177O1432L5822J1848k4428l5921J8442m9060n9200J4353
$$ 134682 46879 702 62134 97956 109804 85376 49455 67897 18837 -40363 -26010
27556b6010k9253L6588n8516j615o4014R4743M0222K1362n0299k322j8250L4108
$$ -26010 -55263 -18675 -77191 -78806 -142820 -48077 -7855 13507 -36792 -39114 -57364 -23256
27544b3256L7849p5919j6351Q642M7744m1908R005J67067m6259j53097m420J6157
$$ -23256 14593 -61326 -77677 -69035 -21291 -63199 -54194 112873 66614 -86483 -90903 -74746
27532g4746P7692k263P669N2058R449l3542n4540k1016p2254k7781L3930J14459
$$ -74746 2946 683 8352 60410 69859 36317 -18223 -39239 -111493 -139274 -105344 9115
27520I115J14622k1573L5972o6084j34289M6969J02204j5035r2062j0603m8399
$$ 9115 123737 102164 138136 72052 -62237 -15268 86936 71901 -20161 -30764 -79163
27509g9163n415J1719J6677L5760m9236j9712m5723k1891L0918L0393L7952N4223
$$ -79163 -84578 -72859 -56182 -20422 -69658 -89370 -135093 -156984 -126066 -95673 -57721 -3498
27497c498L0072n9405k813R8088N3533K7907N8640j1189j8720q5630q1187j1353
$$ -3498 26574 -32831 -35644 62444 115977 143884 202524 191335 172615 86985 5798 -5555
27485e555p6652r2090M8772J47624R8646K1702n4322O5634N9123q1089k5353j23387
$$ -5555 -82207 -174297 -125525 22099 120745 142447 88125 153759 212882 131793 106440 -16947
27473a6947l6682Q4056p3745j69034Q1914J55839O885J4585k3396l5680J2097
$$ -16947 -53629 30427 -43318 -212352 -130438 25401 32286 46871 23475 -12205 -108
27462a08l3180j6200p259l2559p4437P1503N1816o9391r615Q4490m8695k3845
$$ -108 -33288 -49488 -56747 -89306 -163743 -92240 -40424 -109815 -119430 -34940 -83635 -107480
27450a07480N8740l146J5822j0733N0037N0689k2924j37011Q6989J10641M2403
$$ -107480 -48740 -51886 -36064 -46797 3240 53929 31005 -106006 -19017 91624 134027
27439A34027k5198r0572l2914j09634J9825J50163m7792r6244r4247M848L5977
$$ 134027 108829 18257 -14657 -124291 -104466 45697 -2095 -98339 -192586 -187738 -151761
27428a51761P5330J0597K2164J0502q3399J5027K8472N3508m879n8723k897J214
$$ -151761 -76431 -65834 -43670 -33168 -116567 -101540 -73068 -19560 -24439 -83162 -86059 -84845
27416h4845n9313L7424M1855J18240k2099l7128j3248P4912p069p9382q690N9756
$$ -84845 -144158 -106734 -64879 53361 31262 -5866 -19114 55798 48729 -30653 -39343 20413
27404B0413P1513L1208m6331R8643M5425n8625K77j33251l965L2988R470k6558
$$ 20413 91926 123134 76803 175446 220871 162246 162523 29272 25307 58295 67765 41207
27392D1207J5796N2328Q3509k7217m7169o3341P7284j4853J5448l37J7710p1898
$$ 41207 57003 109331 192840 165623 118454 55113 132397 117544 132992 132655 150365 78467
27380G8467k084n8721k1606j060j44999K8397M5341j2339M4862m766j36236O2523
$$ 78467 76383 17662 -3944 -5004 -150003 -121606 -76265 -88604 -43742 -48508 -184744 -122221
27368a22221K1484L810J28760O3053l4194l230q7300j31462O4227R4438o6352
$$ -122221 -100737 -96927 31833 94886 60692 57462 -29838 -161300 -97073 -2635 -68987
27357f8987r7584J23041M7607k3527n1005J9862O2112M8862P4345l6082j31889
$$ -68987 -166571 -43530 4077 -19450 -70455 -50593 11519 60381 134726 98644 -33245
27346c3245m5445K042p812k4505Q7496N4002j7896K4634k6428j793m2236L0881
$$ -33245 -78690 -76648 -84460 -108965 -21469 32533 14637 39271 12843 11050 -31186 -305
27334c05j4708o2984j8454N8171K8697R0876N5612m3926n4760N2594q1922o1805
$$ -305 -15013 -77997 -96451 -38280 -9583 81293 136905 92979 38219 90813 8891 -52914
27322e2914k7877J946q287J48325R175J2949K8979p4030n2490l0062K5550J5054
$$ -52914 -80791 -78845 -87132 61193 70368 83317 112296 38266 -14224 -44286 -18736 -3682
27310c682N730j14867o144K1406J43064K2242n5667R442n4220K0060j3757q3358
$$ -3682 2048 -112819 -118963 -97557 45507 67749 12082 21524 -32696 -12636 -26393 -109751
27298a09751J15542J03916N9735q6086p5442P8256k8424Q4189N848j01632r301
$$ -109751 5791 109707 169442 83356 7914 86170 57746 141935 147783 46151 36850
27287C6850l1186K7017J00933j03844q121m5555j6116K1118M4137N9399m7284
$$ 36850 5664 32681 133614 29770 21649 -23906 -40022 -18904 25233 84632 37348
27276C7348m7672j30586l0713J59135R3351O6198L8992j07939p0987l5814j9870
$$ 37348 -10324 -140910 -171623 -12488 80863 147061 186053 78114 7127 -28687 -48557
27265d8557j5224m6001n7292q5479O4300M8276P3998N8879j34951p4151R8342
$$ -48557 -63781 -109782 -167074 -252553 -188253 -139977 -65979 -7100 -142051 -216202 -117860
27254a17860J13562N0737N6037p237l3993p5433L0553K4580k0812M8288Q8389
$$ -117860 -4298 46439 102476 95239 61246 -14187 16366 40946 20134 68422 156811
27243A56811q323l8588l51n4266m6381n6768k2421K7889j2399p0488K5802P2158
$$ 156811 148488 109900 109549 55283 8902 -47866 -70287 -42398 -54797 -125285 -99483 -27325
27231b7325L1361K7376K967j2228q152L6263P9139N1898o0716N4902m9423n7035
$$ -27325 4036 31412 34379 22151 13999 50262 129401 181299 120583 175485 126062 69027
27219F9027K0394j18768k0757J6985L1877M9803O5564k2073l3010Q313J3463r734
$$ 69027 89421 -29347 -50104 -33119 -1242 48561 114125 92052 59042 67355 80818 71084
27207G1084n3762r5602P0362J99660L4270j04504n1025q3335j44218r197P4726
$$ 71084 17322 -78280 -7918 191742 226012 121508 70483 -12852 -157070 -166267 -91541
27196i1541O8906K1883L692k2970p9283n5112J40172L8496L2642r0711j9811O7044
$$ -91541 -22635 -752 2940 -20030 -99313 -154425 -14253 24243 56885 -33826 -53637 13407
27184A3407K4460N0959L3845k2043J5614l1770q3753M5470N8374j5764P0671l2530
$$ 13407 37867 88826 122671 100628 116242 84472 719 46189 104563 88799 159470 126940
27172A26940j6533J7723J11608Q3809j15587p7276l6655l219k5350p866L7131
$$ 126940 110407 128130 239738 323547 207960 130684 94029 90810 65460 57594 94725
27161I4725O6899n4621r0525k2604J17391J322r6524m8570l2638N3321j5300J2288
$$ 94725 161624 107003 16478 -6126 111265 112587 16063 -32507 -65145 -11824 -27124 -14836
27149a4836J29322m3040L3406q1006k9310l4578J5286P513k8211j6165L1570m4714
$$ -14836 114486 71446 104852 23846 -5464 -40042 -24756 -17243 -45454 -61619 -30049 -74763
27137g4763o6597R1187L3241j8688O4161L7798j0926l4305k3912J7279p2386J146
$$ -74763 -141360 -50173 -16932 -35620 28541 66339 55413 21108 -2804 14475 -57911 -56765
27125e6765o4862P772Q330Q2559K0580j0735j4493j9281O4360O8292m7074l2884
$$ -56765 -121627 -113855 -105525 -22966 -2386 -13121 -27614 -46895 17465 85757 38683 5799
27113E799P889p1006r635J2550M6534N2568L3894l1578q2276L5695m071l0321
$$ 5799 13688 -57318 -66953 -54403 -7869 44699 78593 47015 -35261 434 -3637 -33958
27101c3958j8625p633J04353M3820r7980L3542k1664O8245M5494r9317Q7415j05086
$$ -33958 -52583 -60216 44137 87957 -10023 23519 1855 70100 115594 16277 103692 -1394
27089a394j26112l9335O0593O4559N5885l2187j0193l2137O4093k629o1356k8469
$$ -1394 -127506 -166841 -106248 -41689 14196 -17991 -28184 -60321 3772 1143 -60213 -88682
27077h8682K2971J09700N7561r3511n7520O439l5491J0916q830L0785N1386m7300
$$ -88682 -65711 43989 101550 8039 -49481 -43042 -78533 -67617 -76447 -45662 5724 -41576
27065d1576j11281K6552J3521J0866L7690N4865J18369O6569O186n1846o3972
$$ -41576 -152857 -126305 -112784 -101918 -64228 -9363 109006 175575 181761 129915 65943
27054F5943N3390J4437l0980j36357J24858j3098m9963J0060N2896l7572J1745
$$ 65943 119333 133770 102790 -33567 91291 78193 28230 38290 91186 53614 65359
27043F5359M0585o6414L5786m1317N7069N1459K3354n0869o8317k2321q5028n9403
$$ 65359 105944 39530 75316 33999 91068 142527 165881 115012 46695 24374 -60654 -120057
27031a20057O4496J43826R487M4243m1666j42475o9829L9014q599M0130N2088
$$ -120057 -55561 88265 97752 141995 100329 -42146 -111975 -72961 -81560 -41430 10658
27020A0658l3466N492O3641K5767J386R47m0724l2635j19495n5619j3415m7973
$$ 10658 -22808 -17316 46325 72092 73478 74425 33701 1066 -118429 -174048 -187463 -235436
27008b35436J05336Q1197j0247J54083j5437L853j00333J04422Q9657K6280J3223
$$ -235436 -130100 -48903 -59150 94933 79496 83349 -16984 87438 177095 203375 216598
26997B16598l0645j11989l9175j7920m6073R965m9158O9423P5601J0418j20805
$$ 216598 185953 73964 34789 16869 -29204 -19239 -68397 1026 76627 87045 -33760
26986c3760K4104R471o793k6455P8071L5291L0439j06568n3154M3919m727L357
$$ -33760 -9656 -185 -6978 -33433 44638 79929 110368 3800 -49354 -5435 -10162 -6805
26974f805j1476K1816L6846k0553J7779J34162n541m6984j5063j7214p7599K3567
$$ -6805 -18281 3535 40381 19828 37607 171769 166228 119244 104181 86967 9368 32935
26962C2935Q4102j27856n1923l8335J47660J3874m596J3452o8497j08768n0304
$$ 32935 117037 -10819 -62742 -101077 46583 60457 55861 69313 816 -107952 -158256
26951a58256j0898M4885J11793J20587N4043o7020m0551K9099p1721p7441J0235
$$ -158256 -169154 -124269 -12476 108111 162154 95134 54583 83682 11961 -65480 -55245
26940e5245M3969j7840j0106R490L0033q3753J4803J16505j02226m5568m5478
$$ -55245 -11276 -29116 -39222 -29732 301 -83452 -68649 47856 -54370 -99938 -145416
26929a45416J43487P896j09881o0129J8443N8959R352q9502o265J03648M1323
$$ -145416 -1929 5967 -103914 -164043 -145600 -86641 -77289 -166791 -173056 -69408 -28085
26918b8085r6361K9925R6247l0313k6296Q4231J0289m1465m7430l1817L8068k2458
$$ -28085 -124446 -94521 1726 -28587 -54883 29348 39637 -1828 -49258 -81075 -43007 -65465
26906f5465k2353k1051l1361M6283R3204M8737K9295J3764K3383P77j3497J36796
$$ -65465 -87818 -108869 -140230 -93947 -743 47994 77289 91053 114436 115213 101716 238512
26894B38512N2583r4442q0480r7834m9912m9096J1697J52920Q2741n8701j04750
$$ 238512 291095 196653 116173 18339 -31573 -80669 -68972 83948 166689 107988 3238
26883C238j00261j02787j988P0618K3782R587K9835l5899p9788o0841L8539M1870
$$ 3238 -97023 -199810 -201798 -131180 -107398 -97811 -67976 -103875 -183663 -244504 -205965 -164095
26871a64095M9533J4009j7782j71152j3106Q5059J04207j1576l7985k7368L5856
$$ -164095 -114562 -100553 -118335 -289487 -302593 -217534 -113327 -124903 -162888 -190256 -154400
26860a54400O8663M3783K1799N4816k2354P3532J7449o1452j07155k0803m6093
$$ -154400 -85737 -41954 -20155 34661 12307 85839 103288 41836 -65319 -86122 -132215
26849a32215j09891N1877J26460K185n6032J16640K9903Q4096R6174j22861j12739
$$ -132215 -242106 -190229 -63769 -61584 -117616 -976 28927 113023 209197 86336 -26403
26838b6403m0761J4065j4799P4682O6181o1307j04386p8900p059P8905O629K6545
$$ -26403 -67164 -53099 -67898 6784 72965 11658 -92728 -171628 -178687 -99782 -93153 -66608
26826f6608k6150J0393N8967J25871j9172m037L6415j3238p6012m6881j8417K465
$$ -66608 -92758 -82365 -23398 102473 83301 79264 115679 102441 26429 -20452 -38869 -36404
26814c6404j5249l5627M7443M2544l2470j4946J00443J16069L236K4123R7221
$$ -36404 -51653 -87280 -39837 2707 -29763 -44709 55734 171803 175039 199162 296383
26803B96383q0283j63154r4725n5153o876j6220K1477J03132O9647P6041J549
$$ 296383 216100 52946 -41779 -96932 -103808 -120028 -98551 4581 74228 150269 151818
26792A51818n8520j12627M7856k8351J8052Q1229L9981o0477k4091R805J6178
$$ 151818 93298 -19329 28527 176 18228 99457 139438 78961 54870 64675 80853
26781H0853M1845M397J2253j30057k5562K7304M9847J32202J6016n1352j0445
$$ 80853 122698 127095 139348 9291 -16271 11033 60880 193082 209098 157746 147301
26770A47301L5598p2652q0091l1453m637k8141l0029J0154O4974p1635o4684R1216
$$ 147301 182899 110247 30156 -1297 -5934 -34075 -64104 -53950 11024 -60611 -125295 -34079
26758c4079M8357o1079l4371J88104l0147o2479o8400p0901k8762N4118J5287
$$ -34079 14278 -46801 -81172 106932 76785 14306 -54094 -124995 -153757 -99639 -84352
26747h4352N5489j01307K0192R9675M7950k293K4036M505j07501j8208P0784L0397
$$ -84352 -28863 -130170 -109978 -10303 37647 35354 59390 63895 -43606 -61814 8970 39367
26735C9367K7179o852k7948k5202N416p9325j4105q4871j07591J49061Q6680r1620
$$ 39367 66546 59694 31746 6544 11960 -67365 -81470 -166341 -273932 -124871 -38191 -129811
26723a29811L7779R0149N4243N1543k4834q9058K1111K8935Q271k89o7197o4133
$$ -129811 -92032 -1883 52360 103903 79069 -9989 11122 40057 48328 48039 -19158 -83291
26711h3291j0523P2291n0680j0159j1663P3801j1846q1938k5037R3779l1242M874
$$ -83291 -93814 -21523 -72203 -82362 -94025 -20224 -32070 -114008 -139045 -45266 -76508 -71634
26699g1634N7183Q8029k5525r5349n000N8607N9776l9036N9870N5397O5984r9336
$$ -71634 -14451 73578 48053 -47296 -52296 6311 66087 27051 86921 142318 208302 108966
26687A08966m3906j18541m8794O5654Q3179k8271N357m640M5980n824p3622Q6839
$$ 108966 65060 -53481 -102275 -36621 46558 18287 23644 19004 64984 59160 -14462 72377
26675G2377M1295L5134p2909n7954K4286l5162j00980j32173R7225N3612m195
$$ 72377 113672 148806 75897 17943 42229 7067 -93913 -226086 -128861 -75249 -79444
26664g9444p7475q5728l4760P7388M4417P4652N1322o2463J0454M7133J7458L5408
$$ -79444 -156919 -242647 -277407 -200019 -155602 -80950 -29628 -92091 -81637 -34504 -17046 18362
26652A8362P8193j11786l1958l0620K3240l3665M0751N3329o9801J17712m7283
$$ 18362 96555 -15231 -47189 -77809 -54569 -88234 -47483 5846 -63955 53757 6474
26641F474p6734r472o6841q123J51578L8214q7238m814k2044o1643J2426l1791
$$ 6474 -70260 -79732 -146573 -154696 -3118 35096 -52142 -56956 -79000 -140643 -128217 -160008
26629a60008K8366j942J3198K6364J6489L7771M1147K1477n1473n9217P748Q686
$$ -160008 -131642 -133584 -120386 -94022 -77533 -39762 1385 22862 -28611 -87828 -80080 -71394
26617g1394J0882n9761J148l0288J8273j8223N2278J37422N8511N7720q4906j01330
$$ -71394 -60512 -120273 -119125 -149413 -131140 -149363 -97085 40337 98848 156568 71662 -29668
26605b9668j68141n4066P4703J24489N4815j5279Q6587K8203o0842l2217J340
$$ -29668 -197809 -251875 -177172 -52683 2132 -13147 73440 101643 40801 8584 9924
26594I924R9524r0882j45038J00366J3699p1745j9217M4636L0305j9952K780J16485
$$ 9924 109448 18566 -126472 -26106 -12407 -84152 -103369 -58733 -28428 -48380 -45600 70885
26582G0885L0335Q187J0681q6385L630j6279K0749Q677p0529q0956O655P7296
$$ 70885 101220 109407 120088 33703 37333 21054 41803 50480 -20049 -101005 -94350 -17054
26570a7054O2124m0665m8300m3086m6405p0488n9659j2448O7775N1010R8048k574
$$ -17054 45070 4405 -43895 -86981 -133386 -203874 -263533 -275981 -208206 -157196 -59148 -61722
26558f1722O0362J1931n711L3456j459m1976k5742j51470m275K4552L1110J9187
$$ -61722 -1360 10571 4860 38316 36857 -5119 -30861 -182331 -186606 -162054 -130944 -111757
26546a11757P3035J33054L6621p1314l0487J7791p3827j19028j26915J831Q086
$$ -111757 -38722 94332 130953 59639 29152 46943 -26884 -145912 -272827 -270996 -262910
26535b62910L3967J09513J70248K2699k7860n224l2225j2381k6276p4241p758
$$ -262910 -228943 -119430 50818 73517 45657 40433 8208 -4173 -30449 -104690 -112448
26524a12448J4293K3018k6390o0372J06103J26255N8872q0137N3555K2590R616
$$ -112448 -98155 -75137 -101527 -161899 -55796 70459 129331 49194 102749 125339 134955
26513A34955j9252n9725L9174K6942j09433l0103L5566p7525m7669j3032J03630
$$ 134955 115703 55978 95152 122094 12661 -17442 18124 -59401 -107070 -120102 -16472
26502a6472P751O7279M6039j1940p2930p0839j02151o8588N3262q153L2213L7283
$$ -16472 -8721 58558 104597 92657 19727 -51112 -153263 -221851 -168589 -176742 -144529 -107246
26490a07246k5796M6661R4697Q1063p073k1419J49882L0926m5424j7257r2811
$$ -107246 -133042 -86381 8316 89379 82306 60887 210769 241695 196271 179014 86203
26479H6203j08469o315n9754o6J07493K4807n3279J6471q301L3269j6180m062
$$ 86203 -22266 -28581 -88335 -88401 19092 43899 -9380 7091 -1210 32059 15879 11817
26467A1817j9707m2441n1552n7667N3021J27386M2354M9687r02r2725n5171N6261
$$ 11817 -7890 -50331 -101883 -159550 -106529 20857 63211 112898 111996 19271 -35900 20361
26455B0361R3163M6715J9696n6837l6698l795l726l8265j02330j5810O3054O9611
$$ 20361 113524 160239 179935 123098 86400 82605 78879 40614 -61716 -77526 -14472 55139
26443E5139j9536J0749j2727n344J9342j14831k7264N4003L5871Q3446k8482j6803
$$ 55139 35603 46352 33625 28281 47623 -67208 -94472 -40469 -4598 78848 50366 33563
26431C3563j6313o1036J0636M5189N8603o2208l7830P2363m5902j6212l592M9467
$$ 33563 17250 -43786 -33150 12039 70642 8434 -29396 42967 -2935 -19147 -22739 26728
26419B6728M1995o4326Q640L0891M7526p0781o0775l6387l5730M8099J7139M7053
$$ 26728 68723 4397 13037 43928 91454 20673 -40102 -76489 -112219 -64120 -46981 72
26407G2L6898K7201m986n2879j26884K7189P6423j6996L4564J01520P9116Q5n8482
$$ 72 36970 64171 59185 6306 -120578 -93389 -16966 -33962 602 102122 181238 181323 122841
26394A22841j03962K4301l9460n4743k7717M1461J24088N0481o8997j48533l0503
$$ 122841 18879 43180 3720 -51023 -78740 -37279 86809 137290 68293 -80240 -110743
26383a10743P8519N9406N569M5950k2055l1618j34984l2960k4687p8882O6643
$$ -110743 -32224 27182 32751 78701 56646 25028 -109956 -142916 -167603 -246485 -179842
26372a79842J01578m3081k6768M7560o297L652n3276P0167M8911o3586l5517L7124
$$ -179842 -78264 -121345 -148113 -100553 -106850 -103198 -156474 -86307 -37396 -100982 -136499 -99375
26360i9375o4824P469K0743J11892l0971r5300M261N1915M6371l9160R030n512
$$ -99375 -164199 -156730 -135987 -24095 -55066 -150366 -146105 -94190 -47819 -86979 -77949 -83461
26348h3461Q172J2425K7601L3697O7063J6017n6458l565m1281N645j12577l4569
$$ -83461 -75289 -62864 -35263 -1566 65497 81514 25056 21491 -19790 -14145 -126722 -161291
26336a61291O5714r186J1387R6591j1660J1801J16552K9863m6563l9241R740P2506
$$ -161291 -95577 -104763 -93376 3215 -8445 3356 119908 149771 103208 63967 73707 146213
26324A46213n921j41253m5065j7583L6093J12945K0669p6624o3419J4889L2110
$$ 146213 140292 -961 -46026 -63609 -27516 85429 106098 29474 -33945 -19056 13054
26313A3054j6204L262J5311j18261O2036K0303J7736l4608K4577q5700o4436j4224
$$ 13054 -3150 112 15423 -102838 -40802 -20499 -2763 -37371 -12794 -98494 -162930 -177154
26301a77154M8764P4385Q4391J03026K4423K8107j22042n5747N5277J5523P210
$$ -177154 -128390 -54005 30386 133412 157835 185942 63900 8153 63430 78953 86163
26290H6163r678l8078M3663m3399o3354R7297O1489q42m6384k3665k3687O812
$$ 86163 76485 38407 82070 38671 -24683 72614 134103 133261 86877 63212 39525 46337
26278D6337p0373m3765j01194J6457Q3990k7696q92O1178k0038r658j4525Q8730
$$ 46337 -24036 -67801 -168995 -152538 -68548 -96244 -97136 -35958 -55996 -65654 -80179 8551
26266H551J20752p8544o025k7687j19663L7498R6660J32579p5067L712J6186l9065
$$ 8551 129303 50759 44734 17047 -102616 -65118 31542 164121 89054 92766 108952 69887
26254F9887n8337n5425L1135o7296m9998k4216L4781o4279l3625O5001O4634P0603
$$ 69887 11550 -43875 -12740 -80036 -130034 -154250 -119469 -183748 -217373 -152372 -87738 -17135
26242a7135j6385n8863j411L6532N6263M0168r6166j60960k7192j0252j3439j7833
$$ -17135 -33520 -92383 -93794 -57262 -999 39169 -56997 -217957 -245149 -255401 -268840 -286673
26230b86673J62832K30310L2800o6535m0172R0192l7076j03108j11199j19212
$$ -286673 -123841 106469 139269 72734 32562 122754 85678 -17430 -128629 -247841
26220b47841J10522Q2703j22163P742O3791Q6392k674m44J17847J0917j11387
$$ -247841 -137319 -54616 -176779 -169037 -105246 -18854 -21528 -21972 95875 106792 -4595
26209d595j23066j1005J00616m496k6842K1080L8906N8540O6348L2973j4480L5838
$$ -4595 -127661 -138666 -38050 -42546 -69388 -48308 -9402 49138 115486 148459 133979 169817
26197A69817o2106k6734k8871p4569j03690p5262l350K9790l6769k7497Q3654
$$ 169817 107711 80977 52106 -22463 -126153 -201415 -204765 -174975 -211744 -239241 -155587
26186a55587M2203Q5798Q616O753K1711M0458q0767m0031K1735N8037k3596p1286
$$ -155587 -113384 -27586 -18970 -12217 9494 49952 -30815 -70846 -49111 8926 -14670 -85956
26174h5956m99P4198J61480n6199r6054j01461J07867N6703k7883Q3626o3117
$$ -85956 -86455 -12257 149223 93024 -3030 -104491 3376 60079 32196 115822 52705
26163E2705m7064K363J2364j2427M7909P8122n8068m7562q571O0992k6868k4036
$$ 52705 5641 8004 20368 7941 55850 133972 75904 28342 19771 80763 53895 29859
26151B9859K6059M01Q885Q1147j25376r576l1346m9820K0917K0940k1335N8327
$$ 29859 55918 56319 65204 146351 20975 11399 -19947 -69767 -48850 -27910 -49245 9082
26139I082O0552r4168j12316L0372L2439J1533P3612P700J36859m1980j12154
$$ 9082 69634 -24534 -136850 -106478 -74039 -62506 11106 18806 155665 113685 1531
26128A531O7556L5849j62434o4144o1235k6173L5127l6310K9910P5074K4632K4163
$$ 1531 69087 104936 -57498 -121642 -182877 -209050 -173923 -210233 -180323 -105249 -80617 -56454
26116e6454k5448J4535m9393J23053J61966K971j51461O920l8421k3550K3132
$$ -56454 -81902 -67367 -116760 6293 168259 171230 19769 26689 -11732 -35282 -12150
26105a2150o8844k3811n314J7936M0033l3249Q7944K5920p3995p3466k1436k745
$$ -12150 -80994 -104805 -110119 -92183 -52150 -85399 2545 28465 -45530 -118996 -140432 -143177
26093a43177P7631J00912J2984o2960q1317N7834M3306o4574j54583O1374J85203
$$ -143177 -65546 35366 48350 -14610 -95927 -38093 5213 -59361 -213944 -152570 32633
26082C2633L9882K8868n4282J9006K1716o2861n9281Q4319P7505q0164j8186P8727
$$ 32633 72515 101383 47101 66107 87823 24962 -34319 50000 127505 47341 29155 107882
26070A07882j6510l5505J00127R7328j82525j28903r872O350O6956j4729l5565
$$ 107882 91372 55867 155994 253322 70797 -58106 -67978 -61628 5328 -9401 -44966
26059d4966j14358L4908J14291N9700K64M2837o177j3509p4217R967l5637p919
$$ -44966 -159324 -124416 -10125 49575 49839 92676 86499 72990 -1227 8740 -26897 -34816
26047c4816K104l153J6209N24N8302j32428J02315M0469m9495l3611l8969k0272
$$ -34816 -32712 -35865 -19656 -19132 39170 -93258 9057 49526 31 -33580 -72549 -92821
26035i2821N4906L3814p2380J9352O5615L0642k1803n5637O8264Q4378k1614q9650
$$ -92821 -37915 -4101 -76481 -57129 8486 39128 17325 -38312 29952 114330 92716 3066
26023C066o0517K1684l9673N4778K9688M7076J4130P069o1573J6665K2470N2208
$$ 3066 -57451 -35767 -75440 -20662 9026 56102 70232 77301 15728 32393 54863 107071
26011A07071n2183j0932p4715m5710j52043N8027n4821K2582K20973R1481j14002
$$ 107071 54888 43956 -30759 -76469 -228512 -170485 -225306 -202724 18249 109730 -4272
26000d272n3963j30532r3377j926J04147J42658M6034j2819P8965M9964N6761
$$ -4272 -58235 -188767 -282144 -284070 -179923 -37265 8769 -4050 74915 124879 181640
25989A81640j44774o3136l6862m1887n5145k4124N0451P8680P6507K3559m7182
$$ 181640 36866 -26270 -63132 -105019 -160164 -184288 -133837 -55157 21350 44909 -2273
25978b273j29099k9537K4874M1359N0869O2543m66J7341l6564j23622l3299J96270
$$ -2273 -131372 -160909 -136035 -94676 -43807 18736 18270 35611 -953 -124575 -157874 38396
25966C8396J04208m4697j24603J3065Q6592Q6498n7938n9454N5966J00771K5196
$$ 38396 142604 97907 -26696 -13631 72961 159459 101521 42067 98033 198804 224000
25955B24000o2818k7428j03520j1582Q111l9384l0637O989K1183Q5756K8473j31838
$$ 224000 161182 133754 30234 18652 26763 -12621 -43258 -36269 -15086 70670 99143 -32695
25943c2695q6681M7840j5082J02037Q8898O477J6848J9723J5676j8694k0931l9309
$$ -32695 -119376 -71536 -86618 15419 104317 110794 127642 147365 163041 144347 123416 84107
25931H4107n0190j46552Q872O6422k3826m6794K514J11618O8584n8147q2155m9556
$$ 84107 33917 -112635 -103763 -37341 -61167 -107961 -105447 6171 74755 16608 -65547 -115103
25919a15103P3428J01034m4672r0269o995k9734M4383q872n9677J5543J0956L4342
$$ -115103 -41675 59359 14687 -75582 -82577 -112311 -67928 -76800 -136477 -120934 -109978 -75636
25907g5636J51961L6201L6955M0028L0228p3964j26103K3622j1691l5025p0022
$$ -75636 76325 112526 149481 189509 219737 145773 19670 43292 31601 -3424 -73446
25896g3446j0894J0479p514j2672N9832J06944k4132n1821m144M8529j291j8666
$$ -73446 -84340 -73861 -81375 -94047 -34215 72729 48597 -3224 -7368 41161 39870 21204
25884B1204M4598J6472l661L5256n7422M9764M3051N3882j3467L0253K0972l4707
$$ 21204 65802 82274 78613 113869 56447 106211 149262 203144 189677 219930 240902 206195
25872B06195N6950r9821j8842O2701j65103j01116K6310m9902l6622J24750q337
$$ 206195 263145 163324 144482 207183 42080 -59036 -32726 -82628 -119250 5500 -2837
25861b837o1761p8132K8381M9495j749j4407n7204J3259R903N5609O8909k1888
$$ -2837 -64598 -142730 -114349 -64854 -66603 -81010 -138214 -124955 -115052 -59443 9466 -12422
25849a2422j38055L0328M336K1753K30O0065P6968P9580o3812k4789k2089k0104
$$ -12422 -150477 -120149 -115813 -94060 -93830 -33765 43203 122783 58971 34182 12093 -8011
25837h011J7145m8867n1074P6361N7329k800Q7381O7416L9949n997K2703p8253
$$ -8011 9134 -39733 -90807 -14446 42883 40083 127464 194880 234829 228832 251535 173282
25825A73282l1655k5547j19625k1079M9003j2940l078J25363m4450o2528K7484
$$ 173282 141627 116080 -3545 -24624 24379 11439 8361 133724 89274 26746 54230
25814E4230l5848j23545R6529j0030j2569J18353L2490l6459p6707K0780k3430
$$ 54230 18382 -105163 -8634 -18664 -31233 87120 119610 83151 6444 27224 3794
25803C794p3986r928O0135K0605j2638L93J9935L7839j4682j21446J62228J01461
$$ 3794 -70192 -80120 -19985 620 -12018 -11625 8310 46149 31467 -89979 72249 173710
25791A73710j8598R8509M5363j12269j06467m7154j38675r3338p201R0939J18514
$$ 173710 155112 253621 298984 186715 80248 33094 -105581 -198919 -206120 -115181 3333
25780C333J13903l4846o1183o2448J58424L6996j21469M6811N673p0922q869k0269
$$ 3333 117236 82390 21207 -41241 117183 154179 32710 79521 85194 14272 5403 -14866
25768a4866K9250P619j12677j28586J436J60136N3903N5204J3609N36K2018q3552
$$ -14866 14384 22003 -90674 -219260 -217824 -57688 -3785 51419 65028 65564 87582 4030
25756D030M5993L5547j41720m0182P9019k2001l3172k7179k5046Q8459J10109
$$ 4030 50023 85570 -56150 -96332 -17313 -39314 -72486 -99665 -124711 -36252 73857
25745G3857K7461n822l2046l8170p9648Q244M4269j8511Q6272j0496j26040R022
$$ 73857 101318 95496 63450 25280 -54368 -46124 -1855 -20366 65906 55410 -70630 -61608
25733f1608J0495r0258J1813L1147P1334N3918k1820o5609K4652J16813P1736
$$ -61608 -51113 -141371 -129558 -98411 -27077 26841 5021 -60588 -35936 80877 152613
25722A52613p8901m9646M2506N5881q8284q7887k3139P943K9777k4878j00026
$$ 152613 73712 24066 66572 122453 34169 -53718 -76857 -68914 -39137 -64015 -164041
25711a64041m5077P0129M7108M1128J0597P720M8019l4610M361K9961O0479R6227
$$ -164041 -209118 -138989 -91881 -50753 -40156 -32436 15583 -19027 -14666 15295 75774 172001
25699A72001J5456l1902Q045r3685q9609J9509L4089J1116k8689J5028k5802k6640
$$ 172001 187457 155555 163600 69915 -19694 -185 33904 45020 16331 31359 5557 -21083
25687b1083K4034P6258j22534q4405j0893K9915N514M6573J13957R2950l1164
$$ -21083 2951 79209 -43325 -127730 -138623 -108708 -103194 -56621 57336 150286 119122
25676A19122r2885k0267k385q935N7205M6113k3782l0852n017n3995m9858J19061
$$ 119122 26237 5970 3585 -5350 51855 97968 74186 43334 38317 -15678 -65536 53525
25664E3525J24434j04331j01506K8676n9462J221N4060J8220q0555l9663R2218
$$ 53525 177959 73628 -27878 798 -58664 -57443 -3383 14837 -65718 -105381 -13163
25653a3163P3686m2523n6044o4777k3245J5166j9124k2972J21631J18751n1521
$$ -13163 60523 18000 -38044 -102821 -126066 -110900 -130024 -152996 -31365 87386 35865
25642C5865k7376j7581k1394n045N1798J5580k6561k9687p8388j1629l3295k3454
$$ 35865 8489 -9092 -30486 -35531 16267 31847 5286 -24401 -102789 -114418 -147713 -171167
25630a71167p859M2584J27472k6026m2770P7166P5238K4725m2401r3061j4795
$$ -171167 -179026 -136442 -8970 -34996 -77766 -600 74638 99363 56962 -36099 -50894
25619e0894q4961J1178j1912L9875K9356P3288q405L0403j41392J517J7420M011
$$ -50894 -135855 -124677 -136589 -96714 -67358 5930 -2475 27928 -113464 -111947 -94527 -90516
25607i0516l77K6981M7715j7342o8067R2397k0594q5368M3093N8587Q137M6974
$$ -90516 -90893 -63912 -16197 -33539 -101606 -9209 -29803 -115171 -72078 -13491 -5354 41620
25595D1620n6743j14667J27899J01554m2007n8580j96847L1625J27260O0239P8755
$$ 41620 -15123 -129790 -1891 99663 57656 -924 -197771 -166146 -38886 21353 100108
25584A00108J11101r1770l9922j50278k0915M7092k7595r7063j7856M3038L7660
$$ 100108 211209 119439 79517 -70761 -91676 -44584 -72179 -169242 -187098 -144060 -106400
25573a06400q259m3686P3164O4591q4086M8808J76022J7012O734L5326j9665p0151
$$ -106400 -114659 -158345 -85181 -20590 -104676 -55868 120154 137166 143900 179226 159561 89410
25561H9410j5490j0486N4358J3304l1852J5096M7915p9154J6023L5947l8874J8229
$$ 89410 73920 63434 117792 131096 99244 114340 162255 83101 99124 135071 96197 114426
25549A14426M2668o2706q63J4795j3433l5867K5343N7997J9499j23847n0717p3629
$$ 114426 157094 94388 93525 108320 94887 59020 84363 142360 161859 38012 -12705 -86334
25537h6334k8964K9031Q1824L8025M8324J8268p6790n8566O0559m1050q2936p8971
$$ -86334 -115298 -86267 -4443 33582 81906 100174 23384 -35182 25377 -15673 -98609 -177580
25525a77580k6971J433j4055J9948k731Q0718O7660P1586J048l3170k4810o386
$$ -177580 -204551 -203118 -217173 -197225 -199956 -119238 -51578 20008 21056 -12114 -36924 -43310
25513d3310l8424J530R6450K6613O811O3543k9591j12783j5100j2656o9114j17443
$$ -43310 -81734 -80204 16246 42859 49670 113213 83622 -29161 -44261 -56917 -126031 -243474
25501b43474K2775R5206O9097O0905n3271l4441J7620M791P5539J8593O3605l2383
$$ -243474 -220699 -125493 -56396 4509 -48762 -83203 -65583 -60792 14747 33340 96945 64562
25489F4562p757L8350l7431r668N3319J00834m165j04350M78k6904K208j07159
$$ 64562 56805 95155 57724 48056 101375 202209 198044 93694 94172 67268 69476 -37683
25477c7683k7976J9512J4830l4374k9852Q6421K5885o06M9433k529l6567l8238
$$ -37683 -65659 -46147 -31317 -65691 -95543 -9122 16763 16157 65590 63061 26494 -11744
25465a1744r9733L0783K3695N2131j2014J7655r2529l9202J17066Q8705k46M2906
$$ -11744 -111477 -80694 -56999 -4868 -16882 773 -91756 -130958 -13892 74813 74567 117473
25453A17473J5755n3646l4866J2752k4272r7494k8040m4585j8219k9576L9146
$$ 117473 133228 79582 44716 57468 33196 -64298 -92338 -136923 -155142 -184718 -145572
25442a45572Q8219Q2116K6066q7663k1867m2866J02339J02824K1010j29757L5212
$$ -145572 -57353 24763 50829 -36834 -58701 -101567 772 103596 124606 -5151 30061
25431C0061l7513j38117j2084J04202J8426k5N4678j7106k8739Q577K3786L2571
$$ 30061 -7452 -145569 -157653 -53451 -35025 -35050 19628 2522 -26217 -17640 6146 38717
25419C8717N9320k1985q1725J19347M8213o3026j99126n1724J63637N5768j5445
$$ 38717 98037 76052 -5673 113674 161887 98861 -100265 -151989 11648 67416 51971
25408E1971l2440m2921j4427p4581K4100L3193R4674J1647L7797J0792k4082L4165
$$ 51971 19531 -23390 -37817 -112398 -88298 -55105 39569 51216 89013 99805 75723 109888
25396A09888k0253j35073j06585m2390J30820J47718P7082P276p5272q6818r4954
$$ 109888 89635 -45438 -152023 -194413 -63593 84125 161207 168483 93211 6393 -88561
25385h8561N6008N8833P1159P8531O9215r2387j30113k7899K9929M4807j8396
$$ -88561 -32553 26280 97439 175970 245185 152798 22685 -5214 24715 69522 51126
25374E1126k1053n0976j28330l2357L013K1345J43048K788p040l6691J05351K3609
$$ 51126 30073 -20903 -149233 -181590 -178577 -157232 -14184 -11396 -18436 -55127 50224 73833
25362G3833L61o9919q9706k3577N6755P5219P9088p8782q6157Q510J8740j6111
$$ 73833 74194 4275 -85431 -109008 -52253 22966 102054 23272 -62885 -54375 -35635 -51746
25350e1746J07036P848m0409l5674J01242M5787k2880q769n3186p5686J25981
$$ -51746 55290 63138 22729 -12945 88297 134084 111204 102435 49249 -26437 99544
25339I9544k4991M8997Q7013O6340q1202k0658L1212j28038j65921N7379M6932
$$ 99544 74553 123550 210563 276903 195701 175043 206255 78217 -87704 -30325 16607
25328A6607k4264r7197n0879q034J1352j3988N7358K0961m028p1712K7221J5915
$$ 16607 -7657 -104854 -155733 -163767 -152415 -166403 -109045 -88084 -92112 -163824 -136603 -120688
25316a20688L0191J04424K4347j23644k7737m9361J7817J3740q6985q5662O9811
$$ -120688 -90497 13927 38274 -85370 -113107 -162468 -144651 -130911 -217896 -303558 -233747
25305b33747P1900L7349O0572Q8987O8355J8289o7389q8436N0617O7034N7852
$$ -233747 -161847 -124498 -63926 25061 93416 111705 44316 -44120 6497 73531 131383
25294A31383o8971k4782K1991m7436l7334j3837n9419j5887J24237M5995J12212
$$ 131383 62412 37630 59621 12185 -25149 -38986 -98405 -114292 9945 55940 168152
25283A68152K5417k0850p4398l6048o997J07797m4560j33189l945J05431K1633
$$ 168152 193569 172719 98321 62273 55276 163073 118513 -14676 -18621 86810 108443
25272A08443l593p1882p7931Q5060K0735K4028q2327l5093M2770R262L0413r1022
$$ 108443 104850 32968 -44963 40097 60832 84860 2533 -32560 10210 19472 49885 -41137
25260d1137N96J15787k072n2641K2339o8407p6514J1538q617j142j0781o5523
$$ -41137 -40541 75246 73174 20533 42872 -25535 -102049 -90511 -99128 -100270 -111051 -176574
25248a76574K2766M868M6416J6027J542K0069N3465O3288K0525p294o7771j2897
$$ -176574 -153808 -148940 -102524 -86497 -84955 -64886 -11421 51867 72392 65098 -2673 -15570
25236a5570K1987J21655N1488j13946r1512l3552j1529m0418O958J13288J0980
$$ -15570 6417 128072 179560 65614 -25898 -59450 -70979 -111397 -104439 8849 19829
25225A9829j20095q0533J13523J45388l4104k0774N025r3139M7088K1336n6071
$$ 19829 -100266 -180799 -67276 78112 44008 23234 28259 -64880 -17792 3544 -52527
25214e2527J2299J00690m1767j35492Q6996L4551k2704m55N565q7491q4905k7428
$$ -52527 -40228 60462 18695 -116797 -29801 4750 -17954 -18409 -12844 -100335 -185240 -212668
25202b12668M8965Q9527N0072K7326N0235P3617L8235M6600m2214m4444M815q5498
$$ -212668 -163703 -74176 -24104 3222 53457 127074 165309 211909 169695 125251 130066 44568
25190D4568n0536N7396n585l2288j55652q6459Q4330J41418P4721k5859p3592
$$ 44568 -5968 51428 45843 13555 -142097 -228556 -144226 -2808 71913 46054 -27538
25179b7538p541r1174K8529J8204n8662p6520M5358O1710K6498O9389J6781j41785
$$ -27538 -35079 -126253 -97724 -79520 -138182 -214702 -169344 -107634 -81136 -11747 5034 -136751
25167a36751p672n4654M8934K5907M2671K4562P1197J58445K0103k7404j21247
$$ -136751 -144423 -199077 -150143 -124236 -81565 -57003 14194 172639 192742 165338 44091
25156D4091j00043j0309M5584l133L6101M550L5125L8856m4301R560N2829o1972
$$ 44091 -55952 -66261 -20677 -23810 12291 16841 51966 90822 46521 56081 108910 46938
25144D6938m4214m7276N7917R3222J726O0535k6088N4002J2363m3274Q9493m8979
$$ 46938 2724 -44552 13365 106587 108313 168848 142760 196762 209125 165851 255344 206365
25132B06365j40235K3475Q4195o0378m6657J1907k7035J7129j62974j01312J53472
$$ 206365 66130 89605 173800 113422 66765 78672 51637 68766 -94208 -195520 -42048
25121d2048J35712L4942j0036K858l5711R105n843l0222n8394n3275j3676J28097
$$ -42048 93664 128606 118570 121428 85717 94822 88979 58757 363 -52912 -66588 61509
25109F1509R5599L2524r0045r4211j040m0729k6862Q1373J1422q7979p8489R504
$$ 61509 157108 189632 99587 5376 4336 -36393 -63255 18118 29540 -58439 -136928 -127424
25097a27424l861l0096j10680K7775N9648Q5387P1049Q9562O6106n2804M406P2123
$$ -127424 -131285 -161381 -272061 -244286 -184638 -99251 -28202 61360 127466 74662 79068 151191
25085A51191l9090j02771o4279j0923L7625n5626R0711J59330J7312j54425K0291
$$ 151191 112101 9330 -54949 -65872 -28247 -83873 6838 166168 183480 29055 49346
25074D9346r55J4743J4426L449p4000k7469L7377M7168p2954J803k5866J7731
$$ 49346 48391 63134 77560 81009 7009 -20460 16917 64085 -8869 -7066 -32932 -15201
25062a5201R341k34423J2030R3302J29515P5179j40474m0767P3058L306l1962
$$ -15201 -5860 -240283 -228253 -134951 -5436 69743 -70731 -111498 -38440 -35134 -67096
25051f7096J09987m1552J4562K8787j9590j4262P540j2681L0249N7925J4990l8622
$$ -67096 42891 1339 15901 44688 25098 10836 18376 5695 35944 93869 108859 70237
25039G0237k8965o2860K0727O9837r1441n653j35298N3805m6460q279N0819O2329
$$ 70237 41272 -21588 -861 68976 -22465 -28118 -163416 -109611 -156071 -164350 -113531 -51202
25027e1202Q1337L5158m3641n8810j2493L8911J17821j3686O9305L3361L8820
$$ -51202 30135 65293 21652 -37158 -49651 -10740 107081 93395 162700 196061 234881
25016B34881q6019n2105j4403N3337k3879l8381r5858L6688M2248O3104l9878
$$ 234881 148862 96757 82354 135691 111812 73431 -22427 14261 56509 119613 79735
25005G9735n4542r570o9414R6858M7624o535m3977L1043N9817m3525n0041o0953
$$ 79735 25193 15623 -53791 43067 90691 84156 40179 71222 131039 87514 37473 -23480
24993b3480p6087K1779J18929L9576M3262O7947o2350o2046l6153O1229m782k6204
$$ -23480 -99567 -77788 41141 80717 123979 191926 129576 67530 31377 92606 87824 61620
24981F1620m0967n0029m1952O4315N4789k3434K146j5656j29572o119P0422L5342
$$ 61620 20653 -29376 -71328 -7013 47776 24342 26488 10832 -118740 -124859 -54437 -19095
24969a9095o3199J3623J2424J1257J8008n7253j3299J44434R9806n3078r1440
$$ -19095 -82294 -68671 -56247 -44990 -26982 -84235 -97534 46900 146706 93628 2188
24958B188r8329j9105O4837Q027K2827M0201j5759L9188P0104Q0074l03J8786
$$ 2188 -96141 -115246 -50409 -42382 -19555 20646 4887 44075 114179 194253 193950 212736
24946B12736m9789j0397O810P3879l251m1278q6972k7271l9748K1233o9647j05084
$$ 212736 162947 152550 159360 233239 229988 188710 101738 74467 34719 55952 -13695 -118779
24934a18779Q5136K543p1253Q9009N1879n9702O6640J29897L5695n6584o4594
$$ -118779 -33643 -31100 -102353 -13344 38535 -21167 45473 175370 211065 154481 89887
24923H9887j07423p5l0465N9379o337j275j4488R0251l3769q288n5045m8754q224
$$ 89887 -17536 -17611 -48076 11303 4966 3691 -10797 79454 45685 37397 -17648 -66402 -74626
24910g4626P7484m6379J8163l211p496p1972k9355J94614j3669j7676m1771o285
$$ -74626 2858 -43521 -25358 -28569 -36065 -108037 -137392 57222 43553 25877 -15894 -22179
24898b2179r1083M2489l6685R9817M1718j3573N1776q212L9818p7649o2993L8769
$$ -22179 -113262 -70773 -107458 -7641 34077 20504 72280 64068 103886 26237 -36756 2013
24886B013Q4270j1251j1861o231Q951o412p642Q0047O8558p295o2895l6795R016
$$ 2013 86283 75032 63171 56940 65891 59479 51837 131884 200442 193147 130252 93457 102473
24873A02473r5413K7864N8385m0387L4265L2160o3926L4934j2688j31250Q594
$$ 102473 7060 34924 93309 52922 87187 119347 55421 90355 77667 -53583 -44989
24862d4989l0960L2914p637q2360M7506O3729J05670j34347K2340Q2163J4836
$$ -44989 -75949 -43035 -50672 -133032 -85526 -21797 83873 -50474 -28134 54029 68865
24851F8865n7092p2539N3382P6092j28764j81252K8668N9467L8965M1170l5609
$$ 68865 11773 -60766 -7384 68708 -60056 -241308 -212640 -153173 -114208 -73038 -108647
24840a08647M5534N0608m5924j07564j8740J47022J93164q742j67593q955Q1077
$$ -108647 -63113 -12505 -58429 -165993 -184733 -37711 155453 146711 -20882 -29837 51240
24829E1240M8388N127j5871Q294l6213m3305j00330j00014L7805J5467o986L1649
$$ 51240 99628 104755 88884 97178 60965 17660 -82670 -182684 -144879 -129412 -136398 -104749
24817a04749N9394Q8621R1998q1121m3458M3535j56846J2408N0500j07290m6079
$$ -104749 -45355 43266 135264 54143 10685 54220 -102626 -90218 -39718 -147008 -193087
24806a93087J04614q5532m9896R4086k6956K2756k4705J7771Q7449m290K8687
$$ -193087 -88473 -174005 -223901 -129815 -156771 -134015 -158720 -140949 -53500 -57790 -29103
24795b9103K3288L7792L8859j32448r4963O766k5990n8430O1122K4181O9431J22145
$$ -29103 -5815 31977 70836 -61612 -156575 -149809 -175799 -234229 -173107 -148926 -79495 42650
24783D2650K9114j1357j16435j04399M8332P9150J9661K0036j3224j3753M4398
$$ 42650 71764 60407 -56028 -160427 -112095 -32945 -13284 6752 -6472 -20225 24173
24772B4173O2790l0683l8985M2244q1000l2313N139J47500R6790o3578r804m4355
$$ 24173 86963 56280 17295 59539 -21461 -53774 -48635 98865 195655 132077 122273 77918
24760G7918j37774o189k8746J7041o8810J7872N6054J7494L5738L0193L9684q4011
$$ 77918 -59856 -66045 -94791 -77750 -146560 -128688 -72634 -55140 -19402 10791 50475 -33536
24748c3536K7022Q4199p008n7233L1269R0502j4287j48743r2909K8187K6237K5883
$$ -33536 -6514 77685 70677 13444 44713 135215 120928 -27815 -120724 -92537 -66300 -40417
24736d0417L5470J698j4175l2427N673n2442j411P28j519O2107M978p8841N3838
$$ -40417 -4947 -3249 -17424 -49851 -44178 -96620 -98031 -97303 -98822 -36715 -31737 -110578 -56740
24723e6740L9971R0075N472k9087L4683O0477j0936m1585k8336q9413j36732L8537
$$ -56740 -16769 73306 78778 49691 84374 144851 133915 92330 63994 -25419 -162151 -123614
24711a23614K1895Q3586N2644Q0322m222l8237o1015k336Q1769M6386r9960o1893
$$ -123614 -101719 -18133 34511 114833 110611 72374 11359 9023 90792 137178 37218 -24675
24699b4675J93258O9533k6837K2575o8120q3231j20484j1056R7516K6722k9637
$$ -24675 168583 238116 211279 233854 165734 82503 -37981 -49037 48479 75201 45564
24688D5564o4708l5069L6633J14154j3246J4496N4319j19690J2901m5558r8110
$$ 45564 -19144 -54213 -17580 96574 83328 97824 152143 32453 45354 -204 -98314
24677i8314n8768Q912N5876K6260J52775O6643j41196l1534o0337j21468R8403
$$ -98314 -157082 -148170 -92294 -66034 86741 153384 12188 -19346 -79683 -201151 -102748
24666a02748J39902j3377K5238K1738j04332J642L6394J09566l4838k1268Q072
$$ -102748 37154 23777 49015 70753 -33579 -31937 4457 114023 79185 57917 65989
24655F5989p8936k7642k9130O0235K8477J1107n1374J1619R3999K6186m4209O0070
$$ 65989 -12947 -40589 -69719 -9484 18993 30100 -21274 -9655 84344 110530 66321 126391
24643A26391m9470j23930o7683o9649N5913J06300N7226n2991p0500O6791J7206
$$ 126391 76921 -47009 -114692 -184341 -128428 -22128 35098 -17893 -88393 -21602 -4396
24632d396j09771p7799K6020O7181l088J8795M9107L722L3160l2839m760k561
$$ -4396 -114167 -191966 -165946 -98765 -101853 -83058 -33951 -30229 2931 -29908 -34668 -37229
24620c7229j1120J2178M2029r2433l3375P1616N2997j1284O3139j12930m0514
$$ -37229 -48349 -36171 5858 -86575 -119950 -48334 4663 -6621 56518 -56412 -96926
24609i6926P9449m6734O8156j8496j22285L4002J49229K8508r0858n8466k6304
$$ -96926 -17477 -64211 3945 -14551 -136836 -102834 46395 74903 -15955 -74421 -100725
24598a00725L6583m6737l9219J03243n8547p1937k7014M9357l3524r7753M1873
$$ -100725 -64142 -110879 -150098 -46855 -105402 -177339 -204353 -154996 -188520 -286273 -244400
24587b44400J26384Q3331K0369L4320J05024J5999r0462k7567R9183L2456J6958
$$ -244400 -118016 -34685 -14316 20004 125028 141027 50565 22998 122181 154637 171595
24576A71595l0669n1177n7101k600j068p1854N4191N8479J22744m0854o6161l2237
$$ 171595 140926 89749 32648 30048 28980 -42874 11317 69796 192540 151686 85525 53288
24564E3288M8206j5958L235m5446Q4664k5097k9592k9794R1974L3980p7293j0629
$$ 53288 101494 85536 88771 43325 127989 102892 73300 43506 135480 169460 92167 81538
24552H1538O3938Q0600L5982M3867q9536p1596k1776p3346j3212M857L835N1998
$$ 81538 145476 226076 262058 305925 216389 144793 123017 49671 36459 41316 45151 97149
24540I7149m3104J2970p0456L7033P096R1655O2578q6334q7456n6871L1342N4099
$$ 97149 54045 67015 -3441 33592 40688 132343 194921 108587 21131 -35740 -4398 49701
24528D9701L3843Q9364k3919k04697j18016J10633J43856j5100M3869Q26k6182
$$ 49701 83544 172908 148989 -55708 -173724 -63091 80765 65665 109534 110360 84178
24517H4178J8330r1437q4681O4615L8674j5859l6743J01315J4753p2581Q6043
$$ 84178 102508 11071 -73610 -8995 29679 13820 -22923 78392 93145 20564 106607
24506A06607m435j07565q4973P5443L5672m6673q5647n3899K3564L2663M922M4793
$$ 106607 102172 -5393 -90366 -14923 20749 -25924 -111571 -165470 -141906 -109243 -104321 -59528
24494e9528J52291L9405p0765n3440n0412O5499m2310n719J9357N816N1468m4626
$$ -59528 92763 132168 61403 7963 -42449 23050 -19260 -24979 -5622 194 51662 7036
24482G036n7380Q9204J50652K8662o4651o2896M9780N5151L9138K1221m5392j56937
$$ 7036 -50344 38860 189512 218174 153523 90627 140407 195558 234696 255917 210525 53588
24470E3588o8848j6873M3565l7638k9207N8479K1907k3637o4167R775O1577j8770
$$ 53588 -15260 -32133 11432 -26206 -55413 3066 24973 1336 -62831 -53056 8521 -10249
24458a0249J0647n0834l8252J08562K6670q893k9020m2668K6239M5899J4459l8649
$$ -10249 398 -50436 -88688 19874 46544 37651 8631 -34037 -7798 38101 52560 13911
24446A3911O2106O1820j5115o7899o4051L3526r699p464j08827j05057L5511M7997
$$ 13911 76017 137837 122722 54823 -9228 24298 14599 7135 -101692 -206749 -171238 -123241
24434a23241J21464J40094P5233j74114j31983K9528J28386L3790q6823o5397
$$ -123241 -1777 138317 213550 39436 -92547 -63019 65367 99157 12334 -53063
24424e3063l4552k0605J09584Q6032L7171r6576j0683j3546M1010J47341N9351
$$ -53063 -87615 -108220 1364 87396 124567 27991 17308 3762 44772 192113 251464
24413B51464j05580M3423q090j7369p2885j16927L308J1752L5482K5599k3622
$$ 251464 145884 189307 181217 163848 90963 -25964 -22656 -10904 24578 50177 26555
24402B6555p5890j06262O6220Q0735j2823p7661m7820o9796N0826l2984P8112
$$ 26555 -49335 -155597 -89377 -8642 -21465 -99126 -146946 -216742 -165916 -198900 -120788
24391a20788J35954k5418k9326m737M9380J3705n7293q7588q290N8626K1326N675
$$ -120788 15166 -10252 -39578 -44315 5065 18770 -38523 -126111 -134401 -75775 -54449 -48774
24379d8774N1207L0238O203O439O2658J02988j68033j87886P5239j5724k2455
$$ -48774 2433 32671 38874 45313 107971 210959 42926 -144960 -69721 -85445 -107900
24368a07900M8618P0257j1006p165M640n3168p3314j7602N2158N6735j8611L851
$$ -107900 -59282 10975 -31 -7196 -2556 -55724 -129038 -146640 -94482 -37747 -56358 -52507
24356e2507j2171N136K363M53M4497M310n0561N6946M8098j3095l121k4031k2006
$$ -52507 -64678 -59542 -57179 -56726 -12229 -7919 -58480 -1534 46564 33469 30348 6317 -15689
24343a5689o9166l5766L6722R0454N2325J9111k9198j47737k0152P1217L2564
$$ -15689 -84855 -120621 -83899 6555 58880 77991 48793 -98944 -119096 -47879 -15315
24332a5315p2992m4801K2700o423K436O96m1287K3471k1141l7698j3828N325J28993
$$ -15315 -88307 -133108 -110408 -116831 -114395 -113699 -154986 -131515 -152656 -190354 -204182 -198857 -69864
24319f9864J1952K460L9370N7204K0506r357j3013j9934L1459k8050J8135q2508
$$ -69864 -57912 -55452 -16082 41122 61628 52271 39258 19324 50783 22733 40868 -41640
24307d1640j02559l7948R9419k4189J4587O3832L6525O6628J3799Q4664n1605
$$ -41640 -144199 -182147 -82728 -106917 -92330 -28498 8027 74655 88454 173118 121513
24296A21513p9908r1905Q8704p417o8781m7634j2189R3525N7568R340J07151M27
$$ 121513 41605 -50300 38404 30987 -37794 -85428 -97617 -4092 53476 62816 169967 170394
24284A70394q9960m9087O1285m018o3558k4297l7229r6617l9847k536L9056m8108
$$ 170394 80434 31347 92632 88614 25056 759 -36470 -133087 -172934 -175470 -136414 -184522
24272a84522k3001K5975m3038j1471P3776Q3522J23889M1977L206j12941p242
$$ -184522 -207523 -181548 -224586 -236057 -162281 -78759 45130 87107 90313 -22628 -29870
24261b9870K589L2809J52766J0899j09553q1456M19O846N3280N6928M5734o7133
$$ -29870 -27281 5528 158294 169193 59640 -21816 -21397 -14551 38729 95657 141391 74258
24249G4258j21395k2437N0311Q4778n5788o8125k056J00802L2364q557M2532N3426
$$ 74258 -47137 -69574 -19263 65515 9727 -58398 -60454 40348 72712 64155 106687 160113
24237A60113n4770o7157k5834M2451N2825L242R257o5743o407R838l4667J5237
$$ 160113 105343 38186 12352 54803 107628 110870 120127 54384 47977 57815 23148 38385
24225C8385K1536O3918k4023l9129m521M2643o789m3780J06701N3624n7587j16984
$$ 38385 59921 123839 99816 60687 56166 98809 92020 48240 154941 208565 150978 33994
24213C3994L0099N0745o7220q3145l1550M1888J14618K8105N973k5773j18774
$$ 33994 64093 114838 47618 -35527 -67077 -25189 89429 117534 123507 97734 -21040
24202b1040O741M7531L5763L0435N0245n5321j30329o5355o5110l0943L630P3551
$$ -21040 -14299 33232 68995 99430 149675 94354 -35975 -101330 -166440 -197383 -193753 -120202
24190a20202M0202J12176O1643J0391M114K2975K8679j6018J9033o1360p5731
$$ -120202 -80000 32176 93819 104210 108324 131299 159978 143960 162993 101633 25902
24179B5902j0871L9226Q445K1075j7931j62067k5483J01188R3900K9569j25513
$$ 25902 15031 54257 62702 83777 65846 -96221 -121704 -20516 73384 102953 -22560
24168b2560o6240L4667j7002P8964L7217J384N526n0064k9594N3423k9306o737
$$ -22560 -88800 -54133 -71135 7829 45046 46430 51956 1892 -27702 25721 -3585 -10322
24156a0322q2748J8882K7100J0037J4752J07041M8472M4513O748j00616j10628
$$ -10322 -93070 -74188 -47088 -37051 -22299 84742 133214 177727 184475 83859 -26769
24145b6769J8536P0082o2654J9713j3253n6416n9118n9403R6834J4242Q8048P3048
$$ -26769 -8233 61849 -805 18908 5655 -50761 -109879 -169282 -72448 -58206 29842 102890
24133A02890j08369l6722J1435K0622j3407o6956n0213n3926N7754Q5214j2501
$$ 102890 -5479 -42201 -30766 -10144 -23551 -90507 -140720 -194646 -136892 -51678 -64179
24122f4179o5058j4116M7705R5208k5368l8876r286K5464L8831l2810l7718o0041
$$ -64179 -129237 -143353 -95648 -440 -25808 -64684 -73970 -48506 -9675 -42485 -80203 -140244
24110a40244P9083J4647M2228l227o1360Q524n8587p6678Q0266L3204m5522J6615
$$ -140244 -61161 -46514 -4286 -7513 -68873 -60349 -118936 -195614 -115348 -82144 -127666 -111051
24098a11051K8519N3009o1983k8859n827L660m3692L9623M514O2275J01569Q9977
$$ -111051 -82532 -29523 -91506 -120365 -126192 -122532 -166224 -126601 -122087 -59812 41757 131734
24086A31734j17441J8508J09297P7838m7919o8630l0958j15956k776R0466Q1483
$$ 131734 14293 32801 142098 219936 172017 103387 72429 -43527 -46303 44163 125646
24075A25646M7096L418p9119l2470j46017j8645J2800Q2353Q2262P3000K5476
$$ 125646 172742 176160 97041 64571 -81446 -100091 -87291 -4938 77324 150324 175800
24064A75800o0747l7965K8187j3420j14429p8562L9993N0909L005K6178J35284
$$ 175800 115053 77088 105275 91855 -22574 -101136 -61143 -10234 -7229 18949 154233
24053A54233M1483j36845l6789Q743K0052O2893j8685m119n3832l8964M1879j6153
$$ 154233 195716 58871 22082 30825 50877 113770 95085 90966 37134 -1830 40049 23896
24041B3896m0075k0207K5858M1217M2977k5897o2068k3512j070k2593N8574N7454
$$ 23896 -16179 -36386 -10528 30689 73666 47769 -14299 -37811 -38881 -61474 -2900 54554
24029E4554O8281O1326j40724m7707L81P2727k5477q564k135m3451o938P1261
$$ 54554 122835 184161 43437 -4270 -3889 68838 43361 34797 32662 -10789 -17727 53534
24017E3534j3287K1667k9378K2749l1043l3642O1738l7061Q271P6326j6145j3556
$$ 53534 40247 61914 32536 55285 24242 -9400 52338 15277 23548 99874 83729 70173
24005G0173l736n0388j6928k4864j842M9718p564j6731n216J5283n4612P9576
$$ 70173 66437 16049 -879 -25743 -27585 22133 14569 -2162 -7378 7905 -46707 32869
23993C2869R9754k410j6854K4258k4613q0045m8583M2916m79N9670q3456l2786
$$ 32869 132623 130213 113359 137617 113004 32959 -15624 27292 26813 86483 3027 -29759
23981b9759O2157Q3768m275n4562K3316Q546m6433n7836M4345L3521k1545r2744
$$ -29759 32398 116166 111891 57329 80645 89191 42758 -15078 29267 62788 41243 -51501
23969e1501J39614O9507J0070p4129m1368r4428k2298l7584p2180K4836J2206
$$ -51501 88113 157620 167690 93561 52193 -42235 -64533 -102117 -174297 -149461 -137255
23958a37255J36P2089l1958j9723M5348O6041k1929L1380M3350L9642J9264l4141
$$ -137255 -137119 -65030 -96988 -116711 -71363 -5322 -27251 4129 47479 87121 106385 72244
23946G2244Q3943M7994p5420j55510j6952O3376p4251p8284p6536O7991P5687
$$ 72244 156187 204181 128761 -26749 -43701 19675 -54576 -132860 -209396 -141405 -65718
23935f5718K3933L3976O1860m6376l0034N1390K6522j520r5619j0741n7741L5865
$$ -65718 -41785 -7809 54051 7675 -22359 29031 55553 54033 -41586 -52327 -110068 -74203
23923g4203L9909k7917p8198N6562Q2991J8512l1638L9324K1754n9198P7852K3463
$$ -74203 -34294 -62211 -140409 -83847 -856 17656 -13982 25342 47096 -12102 65750 89213
23911H9213n1118L8250m1733j10249m1837L1871M0399n9550j8684J5967J46495
$$ 89213 38095 76345 34612 -75637 -117474 -85603 -45204 -104754 -123438 -107471 39024
23900C9024k9961m134J15811k6168o5547o8303L4656K8835n3068j13268o1101
$$ 39024 9063 4929 120740 94572 29025 -39278 -4622 24213 -28855 -142123 -203224
23889b03224N5785J33756K8369m4177l5811K4053O8175M7776M4842l0839K2760
$$ -203224 -147439 -13683 14686 -29491 -65302 -41249 26926 74702 119544 88705 111465
23878A11465p260O5621o4118q0219o0882n2036m9406L7904k594j6380L078L4133
$$ 111465 104205 169826 105708 25489 -35393 -87429 -136835 -98931 -101525 -117905 -114827 -80694
23866h0694L5272n2841j5491P0713J81610j8080J6896q878j61632j15034R9497
$$ -80694 -45422 -98263 -113754 -43041 138569 120489 137385 128507 -33125 -148159 -48662
23855d8662J43793o728K76p9667j13349K5105M4683N0931l4425K5913N7854l2577
$$ -48662 95131 88403 88679 9012 -104337 -79232 -34549 16382 -18043 7870 65724 33147
23843C3147o4317k9126j3685m204M7369L5278m9228p1931R9405Q3874R86p5385
$$ 33147 -31170 -60296 -73981 -78185 -30816 4462 -44766 -116697 -17292 66582 67568 -7817
23831g817K8491N692l6375J1117J7975M4162m9503O6984J6495q5095k3636P6089
$$ -7817 20674 26366 -10009 1108 19083 63245 13742 80726 97221 12126 -11510 64579
23819F4579p6426j7996M9593N273n2851q9201j10128P1801M1031K1512N6629J02223
$$ 64579 -11847 -29843 19750 25023 -27828 -117029 -227157 -155356 -114325 -92813 -36184 66039
23807F6039J09030L3304j00153o9434m4397l3746j2599K2658L2726n524k5844
$$ 66039 175069 208373 108220 38786 -5611 -39357 -51956 -29298 3428 -2096 -27940
23796b7940o6852J0113j0676l3236M6380j2949L003K0932L4238P3218j5819l6269
$$ -27940 -94792 -84679 -95355 -128591 -82211 -95160 -92157 -71225 -36987 36231 20412 -15857
23784a5857M9463J347O0319Q322o6756j10254J2978K8443Q9615Q3794n7748j07601
$$ -15857 33606 34953 95272 103594 36838 -73416 -60438 -31995 57620 141414 83666 -23935
23772b3935J8616J19749o202n0974j4229O3747q6053o9595L1682k6764q1757n4180
$$ -23935 -5319 114430 108228 57254 43025 106772 20719 -48876 -17194 -43958 -125715 -179895
23760a79895O5307R2059J7836J5416J12047k9444o8888o9867O9646Q2119o995
$$ -179895 -114588 -22529 -4693 10723 122770 93326 24438 -45429 24217 106336 99341
23749I9341n2760m5334m2338r1386M3964R9505K8401k745L6757j4920m2434N8304
$$ 99341 46581 1247 -41091 -132477 -88513 10992 39393 36648 73405 58485 16051 74355
23737G4355K9068O1997p6202j32994m8890L6256Q8809n7787K6128l6667o4138
$$ 74355 103423 165420 89218 -43776 -92666 -56410 32399 -25388 740 -35927 -100065
23726a00065l1761P3586O480o9213j01687N5953J33596P6549p948J2120m0956
$$ -100065 -131826 -58240 -51760 -120973 -222660 -166707 -33111 43438 35490 47610 6654
23715F654P665M2567j4224K4492o9866r8380Q3530J01646O6778l7134q0451q056
$$ 6654 14319 56886 42662 67154 -2712 -101092 -17562 84084 150862 113728 33277 25221
23703B5221L6864k4279j12154l1144Q0428Q4156n159o2580j2457K2790j9355o0800
$$ 25221 62085 37806 -74348 -105492 -25064 59092 53933 -8647 -21104 1686 -17669 -78469
23691g8469O184k0683m904O1894N0788o4449r4172N049O9833P7448P7981J6439
$$ -78469 -72285 -92968 -97872 -35978 14810 -49639 -143811 -138762 -68929 8519 86500 102939
23679A02939O2892q0559q4999r8198k7883R3933j3916n310l4719J42291j086j14631
$$ 102939 165831 85272 273 -97925 -125808 -31875 -45791 -51101 -85820 56471 55385 -59246
23667e9246j1962J8484j1570N3609L0325m9199j8619n43L0803o0299k1538p9464
$$ -59246 -71208 -52724 -64294 -10685 19640 -29559 -48178 -48721 -17918 -78217 -99755 -179219
23655a79219J11734L1939n4264k7727J0551J34926L9632n1568j9959j05143L6893
$$ -179219 -67485 -35546 -89810 -117537 -106986 27940 67572 16004 -3955 -109098 -72205
23644g2205p0887m2657K3811O8174L4752N8712K2085j04194j29296M1208O1167
$$ -72205 -143092 -185749 -161938 -93764 -59012 -300 21785 -82409 -211705 -170497 -109330
23633a09330N8601O2574l6375j09486M0424J1708q0022l0496N015o1340J7049
$$ -109330 -50729 11845 -24530 -134016 -93592 -81884 -161906 -192402 -187387 -248727 -231678
23622b31678R1454R7615n6344J7338R9652K6132J4829o391O4174m3307O9922Q5446
$$ -231678 -140224 -42609 -98953 -81615 18037 44169 58998 52607 116781 73474 143396 228842
23610B28842n5004r9100r4959m5247L3260J75914L1807L6494n0993n2345j1114
$$ 228842 173838 74738 -20221 -65468 -32208 143706 175513 212007 161014 108669 97555
23599I7555q971m428J8836k307L6488O1518k3173K6658m8561o6015o4360k3878
$$ 97555 88584 84156 102992 100685 137173 198691 175518 202176 153615 87600 23240 -638
23587f38l8447J0339J22703J3253n4243k8859p0420N7598j04963P27M9490m6332
$$ -638 -39085 -28746 93957 107210 52967 24108 -46312 11286 -93677 -92950 -43460 -89792
23575h9792M0406J0836R290Q7758n5675l7199O9632O4939J5178l5146k8800q3437
$$ -89792 -49386 -38550 -29260 58498 2823 -34376 35256 100195 115373 80227 51427 -32010
23563c2010j78269J1621O2329R651k6639M6597r774q9360L3950P9189M1308J03455
$$ -32010 -210279 -198658 -136329 -126678 -153317 -106720 -116494 -205854 -171904 -92715 -51407 52048
23551E2048J6979r0588j927N7337k0893J2364j1716L0786N8482l0565M429j701
$$ 52048 69027 -21561 -23488 33849 12956 25320 13604 44390 102872 72307 76736 75035
23539G5035j07946J6255P5119P4679m6968j35792o5834p9779m2510M8490N3178
$$ 75035 -32911 -16656 58463 133142 86174 -49618 -115452 -195231 -237741 -189251 -136073
23528a36073L1999J22466R5839P636L0579n4246m9012o4385L758q90L990q9874
$$ -136073 -104074 18392 114231 121867 152446 98200 49188 -15197 -11439 -12329 -8339 -98213
23516i8213K3168k084l9646L5449N5758M8109L1006j02987J4798P0382Q945n6033
$$ -98213 -75045 -77129 -116775 -81326 -25568 22541 53547 -49440 -34642 35740 44685 -11348
23504a1348M1745K3386N4884j5256k1096M3362n6954P2998J04511O0871K5404
$$ -11348 30397 53783 108667 93411 72315 115677 58723 131721 236232 297103 322507
23493C22507j22872n8990J0737l9410m9594o5660K8487P0683R605L9494j6334
$$ 322507 199635 140645 151382 111972 62378 -3282 25205 95888 105493 144987 128653
23482A28653j47788N61l979l1057n1184J04643J32770r98p0238k6926j7917M9754
$$ 128653 -19135 -18574 -22553 -53610 -104794 -151 132619 131621 61383 34457 16540 66294
23470F6294m3057L1993n0623R292R6818O5358J9502q0666k2745q371n7321j2608
$$ 66294 23237 55230 4607 13899 110717 176075 195577 114911 92166 83795 26474 13866
23458A3866p3798n6231n2303o2977L9450K7857J11990J59318J39189o4012j45139
$$ 13866 -59932 -116163 -168466 -231443 -191993 -164136 -52146 107172 246361 182349 37210
23447C7210O9810N34j11338p2875r25l6394l7349k8674k025N9069J24749Q1675
$$ 37210 107020 107554 -3784 -76659 -77584 -113978 -151327 -180001 -182026 -122957 1792 83467
23435H3467j51579o9027O5310N8491O3169K0483o9198j64777p8339J26562J21699
$$ 83467 -68112 -137139 -71829 -13338 49831 70314 1116 -163661 -242000 -115438 6261
23424F261N7666M2129K2721m9330j5624J8376K0473n0107k5534l3083q5444m8917
$$ 6261 63927 106056 128777 79447 63823 82199 102672 52565 27031 -6052 -91496 -140413
23412a40413q4591N5130J25922M1219q7258M1802O7014j13781m5378R2854P9190
$$ -140413 -225004 -169874 -43952 -2733 -89991 -48189 18825 -94956 -140334 -47480 31710
23401C1710J5414P491n8193j18826j908j0160K1628p9709k0729J00841J43214
$$ 31710 47124 54615 -3578 -122404 -124312 -134472 -112844 -192553 -213282 -112441 30773
23390C0773L5105K1660q2781j31400O0097P9310L751m5715l1434J3762l7241Q327
$$ 30773 65878 87538 4757 -126643 -66546 12764 16515 -29200 -60634 -46872 -84113 -75786
23378g5786O2900J4629l2129n9164l2071L0143J10485P7131o2386R5460p7878
$$ -75786 -12886 1743 -30386 -89550 -121621 -91478 19007 96138 33752 129212 51334
23367E1334j49443j8861j1221K3152j23589n3102Q8536J58393J28497q193j18955
$$ 51334 -98109 -116970 -128191 -105039 -228628 -281730 -193194 -34801 93696 85503 -33452
23356c3452M2950P3876M7178k3376m1285L4145K9597n649n9049Q514l0133k18
$$ -33452 9498 83374 130552 107176 65891 100036 129633 123984 64935 73449 43316 43098
23344D3098J7399l5680N5581k5666m5108k8681j00993O3889Q9171N688Q6468P9561
$$ 43098 60497 24817 80398 54732 9624 -19057 -120050 -56161 33010 38698 125166 204727
23332B04727p0616p3057j51207l0755R5564k8768j404m7135L243J28775j143o7522
$$ 204727 134111 61054 -90153 -120908 -25344 -54112 -55516 -102651 -99408 29367 28224 -39298
23320c9298r4906j3351l4996J37970N7870m0509L881J46143P1941r9416p0875
$$ -39298 -134204 -147555 -182551 -44581 13289 -27220 -23339 122804 194745 95329 24454
23309B4454l133m1630J569p0987j12028L5145O5554M184l2026l7531M6384N3099
$$ 24454 21321 -20309 -18740 -89727 -201755 -166610 -101056 -96872 -128898 -166429 -120045 -66946
23297f6946P6040M63l0098j26850J3164R0770q1132M0755M2161J81724J21933
$$ -66946 9094 9557 -20541 -147391 -134227 -43457 -124589 -83834 -41673 140051 261984
23286B61984J04659J0458j56727j26033l6126l1733j8882K4777R9354O2298Q5049
$$ 261984 366643 377101 220374 94341 58215 26482 7600 32377 131731 194029 279078
23275B79078J4386L3050j3153l3187J7302k7476q0637q6360p4325j7199M0370
$$ 279078 293464 326514 313361 280174 297476 270000 189363 103003 28678 11479 51849
23264E1849j7438j5001n373Q3L1205l2697r0441J07730q2000p1073M5189L283
$$ 51849 34411 19410 14037 14120 45325 12628 -77813 29917 -52083 -123156 -77967 -74684
23252g4684J01534M523m9902n9885o077K1241R8384N5868m9796Q2219j26458r4806
$$ -74684 26850 31373 -18529 -78414 -84491 -63250 35134 91002 41206 123425 -3033 -97839
23240i7839K4487l6416j1251R3340P14o6306m6250L7008k3118k2690J18123N8758
$$ -97839 -73352 -109768 -121019 -27679 -26965 -93271 -139521 -102513 -125631 -148321 -30198 28560
23228B8560k8671L3821l520m1035M3947P2510P0066p289k6340J38999o423q5601
$$ 28560 -111 33710 30190 -10845 33102 105612 175678 168389 142049 281048 274625 189024
23216A89024M9743N9749j47608j37599j5580m9486P9581O2785o3344r9755q8146
$$ 189024 238767 298516 150908 13309 -2271 -51757 27824 90609 27265 -72490 -160636
23205a60636M5782J0041l0P3372R9869K9114L6336M7573j1343M8328N7774M6322
$$ -160636 -114854 -104813 -104843 -31471 68398 97512 133848 181421 170078 218406 276180 322502
23193C22502M00453N67595O68942N62633k28758p45039o27918l66608j28151p3150
$$ 322502 722955 1290550 1959492 2522125 2293367 1548328 920410 553802 425651 352501
23183C52501q7163j52714k5371K9779p8315j4577J0734k3622k474N69J8059K6722
$$ 352501 265338 112624 87253 117032 38717 24140 34874 11252 8778 9347 27406 54128
23171E4128J8507K2229J5989k3401q3319M29J04943J1202j12068K3804k2267Q534
$$ 54128 72635 94864 110853 87452 4133 4562 109505 120707 8639 32443 10176 18710
23159A8710M3680k9589m9304L1524Q4002j8466K3906k7079l7331L753n5501K9126
$$ 18710 62390 32801 -16503 15021 99023 80557 104463 77384 40053 43806 -11695 17431
23147A7431M8896R8006M4770p6997j13943n3967J06381Q2914j4717l283l0917
$$ 17431 66327 164333 209103 132106 18163 -35804 70577 153491 138774 135491 104574
23136A04574N956o5225p1152O293M2155R5291Q46q6371k4502p0231L3486J34111
$$ 104574 110530 45305 -25847 -19554 22601 117892 118738 32367 7865 -62366 -28880 105231
23124A05231P47n682L1815l1676n2155p0859j4834P6652L9746N3489k5644m1904
$$ 105231 105978 100296 132111 100435 48280 -22579 -37413 39239 78985 132474 106830 64926
23112F4926R9850O8269p0102n3759K3122O962j32538o5329j5541o906Q0751M7757
$$ 64926 164776 233045 162943 109184 132306 139268 6730 -58599 -74140 -81046 -295 47462
23100D7462O2163K1671j27987m4375j06288L3497J29156N5496J4372l5953p45
$$ 47462 109625 131296 3309 -41066 -147354 -113857 15299 70795 85167 49214 48469
23089D8469K2766L1174R1721L0256r8326j37763r3378J5148l2285N9494O740j8305
$$ 48469 71235 102409 194130 224386 126060 -11703 -105081 -89933 -122218 -62724 -55984 -74289
23077g4289M588J57721M1959J9187K1645Q169j5432n4362k9107p9892j8167p7815
$$ -74289 -69701 88020 129979 149166 170811 178980 163548 109186 80079 187 -17980 -95795
23065i5795k9941R7758Q8856J3313k7889L9843o4688k7133l1560R4623m1377o0001
$$ -95795 -125736 -27978 60878 74191 46302 86145 21457 -5676 -37236 57387 16010 -43991
23053d3991O803j2652m0042l8626o3413r5517J91290J43532K7825p2915q3766
$$ -43991 -37188 -49840 -89882 -128508 -191921 -287438 -96148 47384 75209 2294 -81472
23042h1472n047N4651q8281l5845J46827M6418l3854j36726j31697M1856J28372
$$ -81472 -86519 -31868 -120149 -155994 -9167 37251 3397 -133329 -265026 -223170 -94798
23031i4798J02360L4148l6444N1230J08454J30356o5108p6147q0601K7048m590
$$ -94798 7562 41710 5266 56496 164950 295306 230198 154051 73450 100498 95908
23020I5908K0167j5478Q5550K0816J5526r1031j22337r6228P610Q656P5213k395
$$ 95908 116075 100597 186147 206963 222489 131458 9121 -87107 -79497 -70841 4372 1977
23008A977p295q1564L2325K3367k9599L814J12393J7430q951J0575N3106k1199
$$ 1977 -5318 -86882 -54557 -31190 -60789 -56975 55418 72848 63897 74472 127578 106379
22996A06379k1070Q7515K6514m5749n796k9927r8006o7437J06746K9925m3788
$$ 106379 85309 172824 199338 153589 147793 117866 19860 -47577 59169 89094 45306
22985D5306M0181N6636n177p0875r8117j131K952n52J17550j882L3228P1156K5243
$$ 45306 85487 142123 136946 66071 -32046 -33177 -30225 -30777 86773 84891 118119 189275 214518
22972B14518o6210L000j1421j34808N7515l551P3009L6843l8476K3653M9576q834
$$ 214518 148308 151308 139887 5079 62594 59043 132052 168895 130419 154072 203648 194814
22960A94814l2151j34205O0113L5649n6419l108J2367K4993k6937L8290M0942
$$ 194814 162663 28458 88571 124220 67801 64693 77060 102053 75116 113406 154348
22949A54348m9793j7421j09782r1368Q3690K9750Q662J0670l4519l065J3154l1525
$$ 154348 104555 87134 -22648 -114016 -30326 -576 8086 18756 -15763 -18828 -5674 -37199
22937c7199l0905M7684l1435l807P1383k2462j7093j27955O8159J09235l3094
$$ -37199 -68104 -20420 -51855 -55662 15721 -6741 -23834 -151789 -83630 25605 -7489
22926g489l9741q4345Q2887J24559J19905O5029j81757p1223j9236R2012k1171
$$ -7489 -47230 -131575 -48688 75871 195776 260805 79048 7825 -11411 80601 59430
22915E9430q2365j2876l3117k7202M084J0709M1809R2553O0725j00994r9117M357
$$ 59430 -22935 -35811 -68928 -96130 -92046 -81337 -39528 53025 113750 12756 -86361 -82004
22903h2004J9064J82683J33462o0585m5557j4411n8243k1808R7n4574p3365K6827
$$ -82004 -62940 119743 253205 192620 147063 132652 74409 52601 52698 -1876 -75241 -48414
22891d8414J8695J102M8429P1405K7934p2488j27024L98P1038K9436K6763L7933
$$ -48414 -29719 -28617 19812 91217 119151 46663 -80361 -79963 -8925 20511 47274 85207
22879H5207k6539j5439J09057P7769K6144M53M0814j20114m0476l5772n1208o318
$$ 85207 58668 43229 152286 230055 256199 256652 297466 177352 136876 101104 49896 43578
22867D3578j0688k4249R618J59777k0698o8101J1475j576L614l3004K292l9466
$$ 43578 32890 8641 18259 178036 157338 89237 100712 99136 102750 69746 72038 32572
22855C2572J5103j02082j16721N6410l9301L2278Q9675J33723K28274K1616m0603
$$ 32572 47675 -54407 -171128 -114718 -154019 -121741 -32066 101657 329931 351547 310944
22844C10944k9350o4868k32822k7812J1960l019R8085J36024L2561n5492m1950
$$ 310944 281594 216726 -16096 -43908 -31948 -34967 63118 199142 231703 176211 134261
22833A34261m6347O3906l8472l286K8528P2700L9914O2738p4447j08160K647n8266
$$ 134261 87914 151820 113348 110062 138590 211290 251204 313942 239495 131335 133982 75716
22821G5716k6663k9058K7872R7629J9584j13468n9633P8610J04056j6537j13942
$$ 75716 49053 19995 47867 145496 165080 51612 -8021 70589 174645 158108 44166
22810D4166j6510K9233j991K9542o096O868m6436R2142K14032o5453K0029K5324
$$ 44166 27656 56889 54898 84440 78344 85212 38776 130918 344950 279497 299526 324850
22798C24850p5396R866k4454q9468k0054R758Q2067l4353l6458l1489j5518M1044
$$ 324850 249454 259320 234866 145398 125344 135102 217169 182816 146358 114869 99351 140395
22786A40395j8248q541J24862l8092j35364j31173n6044O79O4045J7104J03017
$$ 140395 122147 113606 238468 200376 65012 -66161 -122205 -121526 -57481 -40377 62640
22775F2640P4979Q2953M6311j54596j22488N3122L0723J12596Q2082Q0735J3129
$$ 62640 137619 220572 266883 112287 -10201 42921 73644 186240 268322 349057 362186
22764C62186l6834K1514O3570M0130q2539j54786k12555j60684j28112N9592M4561
$$ 362186 325352 346866 410436 450566 368027 213241 686 -159998 -288110 -228518 -183957
22753a83957J21547J38316P4389P0481j6961J0574j1846J4940L149r9495K3308
$$ -183957 -62410 75906 150295 220776 203815 214389 202543 217483 220632 121137 144445
22742A44445J7226j02073k5562O074P2508M112q3241j21473l5404J14178J09337
$$ 144445 161671 59598 34036 40110 112618 116730 33489 -87984 -123388 -9210 100127
22731A00127K0780j8611O5302P5048m4545p786O2766m5452m4858N251o393L2333
$$ 100127 120907 102296 167598 242646 198101 190315 253081 207629 162771 168022 161629 193962
22719A93962O9529Q9712L5720j30055j38150R8790M0914L5176J32938p8849P9846
$$ 193962 263491 353203 388923 258868 120718 219508 260422 295598 428536 349687 429533
22708D29533L63015L50297O12286Q96197M31885n77848q11393n88819l22229j22985
$$ 429533 792548 1142845 1755131 2651328 3083213 2505365 1693972 1105153 782924 659939
22698F59939r5101m2603p3459o6029J26243L9026j9973l9595j83583l7641J04387
$$ 659939 564838 522235 448776 382747 508990 548016 528043 488448 304865 267224 371611
22687C71611K5820J06258P6237mN0552J0564J7236J16066o4223o5806o0342q2578
$$ 371611 397431 503689 579926 579922 630474 641038 658274 774340 710117 644311 583969 501391
22675E01391j5283M5860j42207K5347P9599J47620J71697Q4434J4701L9102l0905
$$ 501391 486108 531968 389761 415108 494707 642327 814024 898458 913159 952261 921356
22664I21356J02383J47777P6623k5949m2474K5628O5998J93383K23488q304j5014
$$ 921356 1023739 1171516 1248139 1222190 1179716 1205344 1271342 1464725 1688213 1679909 1664895
22653A664895Q5415J79477K40976J94809L38806K82808K89430L13169M02744N69256
$$ 1664895 1750310 1929787 2170763 2365572 2704378 2987186 3276616 3589785 3992529 4561785
22643D561785N72497O90342P87095Q77244J214411J615632K411353L383337M012713
$$ 4561785 5134282 5824624 6611719 7488963 8703374 10319006 12730359 16113696 20126409
22634B0126409N126689P841037J2426146K0223463L4530053O2699035J12355468
$$ 20126409 25253098 33094135 45520281 65743744 100273797 162972832 275328300
22627B75328300J60544901P3012120j15291406j68870055r8602130m7176109k5581196
$$ 275328300 435873201 508885321 393593915 224723860 126121730 78945621 53364425
22620E3364425j5398943r116524n065477l324625l270580l194784k596477j984120
$$ 53364425 37965482 28848958 23783481 20458856 17188276 13993492 11397015 9412895
22612I412895j576427j400606j083921p06810n12994l97489l12206k09910l11837
$$ 9412895 7836468 6435862 5351941 4645131 4132137 3734648 3422442 3212532 2900695
22603B900695r5355j30080k61806k04730j82305j20973j56843r6387o5869p4826
$$ 2900695 2805340 2675260 2413454 2208724 2026419 1905446 1748603 1652216 1586347 1511521
22593A511521r9633j20895j87940j83247n8478M9998M529L2350M3308j6688K9249
$$ 1511521 1411888 1290993 1103053 919806 861328 911326 915855 948205 991513 974825 1004074
22582A004074r5588o9969J9254m2571m6683j25140m8759j13876p6019J5257L1066
$$ 1004074 908486 838517 857771 815200 768517 643377 594618 480742 404723 419980 451046
22571D51046M152p3543j36900M6041m17J06320J59894j5940j59358M3101O8104
$$ 451046 455198 381655 244755 290796 290379 396699 556593 540653 381295 424396 492500
22560D92500m816j842j5139q4101j13932k3651K00020Q7832m142J39952L12705
$$ 492500 487684 485842 470703 386602 272670 249019 449039 536871 532729 672681 985386
22549I85386M98479Q84368M95098m17197q83325o07519k49786n7354j37060l6149
$$ 985386 1483865 2368233 2863331 2446134 1562809 955290 705504 648150 511090 474941
22539D74941p7589j6278J6244k1478p1405p5831n1442p4446L2385P962J5913J8699
$$ 474941 397352 381074 397318 375840 304435 228604 177162 102716 135101 143063 158976 177675
22527A77675P8706j3713q9578o6406m0266l2365Q4241J5207m4716q3232o6016
$$ 177675 256381 242668 153090 86684 46418 14053 98294 113501 68785 -14447 -80463
22516h0463N9263Q6905K3645l3041j49493n7067J41697R2528l130k0262N8051
$$ -80463 -21200 65705 89350 56309 -93184 -150251 -8554 83974 80844 60582 118633
22505A18633J72802l690l93K17801J72492P8548P9466j6499k13881j70079j74129
$$ 118633 291435 287745 287352 505153 677645 756193 835659 819160 605279 435200 261071
22494B61071k15528j09856k50097K4871Q0011K4123p2030l296J00390R2054J40908
$$ 261071 45543 -64313 -314410 -289539 -209528 -185405 -257435 -260731 -160341 -68287 72621
22483G2621J77994J10129K7195j10351q4912m3056K7091r167j336K6090k1051
$$ 72621 250615 360744 387939 277588 192676 149620 176711 167544 166208 192298 171247
22472A71247l2671j02526l6180j05570O348J8167N4629J3860j21538j3397J574
$$ 171247 138576 36050 -130 -105700 -99352 -81185 -26556 -12696 -134234 -147631 -146057
22461a46057m6075K9255J24870N5901J25322K5937k5007q8499j33270k7651l9179
$$ -146057 -192132 -162877 -38007 17894 143216 169153 144146 55647 -77623 -105274 -144453
22450a44453k5427N8714J53755j0043q5544J17559J44768q2332m5645j14982l4481
$$ -144453 -169880 -111166 42589 32546 -52998 64561 209329 126997 81352 -33630 -68111
22439f8111P9483N199l2714N394K7457k7532j12173P1681P3489O7395M9664P3625
$$ -68111 11372 16571 -16143 -10749 16708 -10824 -122997 -51316 22173 89568 139232 212857
22427B12857P8422J01346j38705j86193l6708o8386p2389j9156P8964O9030o6803
$$ 212857 291279 392625 253920 67727 31019 -37367 -109756 -128912 -49948 19082 -47721
22416d7721q0011l2315J49462J99818j4135k3139r8510j24042k11410L5410R7814
$$ -47721 -127732 -160047 -10585 189233 175098 151959 53449 -70593 -282003 -246593 -148779
22405a48779M2850J0553P1299M669M496K4180o4741k944P4827o446l9149k9360
$$ -148779 -105929 -95376 -24077 -19408 -14912 9268 -55473 -58417 16410 9964 -29185 -58545
22393e8545L5294R9610K2341j29899k3567J1330r3442K3808L2114J3624n6513
$$ -58545 -23251 76359 98700 -31199 -54766 -43436 -136878 -113070 -80956 -67332 -123845
22382a23845j0501m4622N5022K8878J0275J204k1747n7355M6650J49230m2951
$$ -123845 -134346 -178968 -123946 -95068 -84793 -83589 -105336 -162691 -116041 33189 -9762
22371i762q3756R4693M2028l8065o2748m5995p4866M8733K3680k4136k1537N7192
$$ -9762 -93518 1175 43203 5138 -57610 -103605 -178471 -129738 -106058 -130194 -151731 -94539
22359i4539J10484K5727L4021j2502N9221o4135j83462O379J54375K6771j66229
$$ -94539 15945 41672 75693 63191 122412 58277 -125185 -118806 35569 62340 -103889
22348a03889j6204J39630L8444o399o5686J6031m1807m6210J5969k3637R9209
$$ -103889 -120093 19537 57981 51582 -14104 1927 -39880 -86090 -70121 -93758 5451
22337E451N6907r433k485P4873L588j25730o3442P72M4510m0399l2595J05455
$$ 5451 62358 52925 50440 125313 128901 3171 -60271 -59499 -14989 -55388 -87983 17472
22325A7472P036j9988P617Q2070r441j41122o4708J42216Q5448q610o5894L7618
$$ 17472 24508 4520 12137 94207 84766 -56356 -121064 21152 106600 97990 32096 69714
22313F9714l7692j9247j03245n444M6433M5313P9136j3772K5483M2680K7982m1898
$$ 69714 32022 12775 -90470 -95914 -49481 -4168 74968 61196 86679 129359 157341 115443
22301A15443n5402l3227Q0983P0491M4754j01955j19862m1853O347K0799J36650
$$ 115443 60041 26814 107797 178288 223042 121087 1225 -40628 -34281 -13482 123168
22290A23168J06030J0476j61749p5270l8601m7726N627M861m7581P1600l1018
$$ 123168 229198 239674 77925 2655 -35946 -83672 -78045 -73184 -120765 -49165 -80183
22279h0183n9790M5999K781J21840l7154p4459J7152Q0446J05568N5383j06497
$$ -80183 -139973 -93974 -91193 30647 -6507 -80966 -63814 16632 122200 177583 71086
22268G1086j6115k4747l9345N779j6041j8260r5748j6736N8045R7113j5708R5399
$$ 71086 54971 30224 -9121 -3342 -19383 -37643 -133391 -150127 -92082 5031 -10677 84722
22256H4722p5325l4614J15805l5720r5338k4098M2142k9442L693j407O1877M1761
$$ 84722 9397 -25217 90588 54868 -40470 -64568 -22426 -51868 -48175 -49582 12295 54056
22244E4056P0539j61253r0200L3554L6286P3013J0731N9716J9491k9390m2205
$$ 54056 124595 -36658 -126858 -93304 -57018 15995 26726 86442 105933 76543 34338
22233C4338K855J2139j26j3469R6029k2156p7082m8631q9766k3943j5241P3320
$$ 34338 37193 49332 49206 35737 131766 109610 32528 -16103 -105869 -129812 -145053 -71733
22221g1733O0792l52R850O2612p5437p2283P1813m5592m4610P1431P4556j22698
$$ -71733 -10941 -11293 -1443 61169 -14268 -86551 -14738 -60330 -104940 -33509 41047 -81651
22209h1651p8864M268N4192K1714Q5499P1510p3256J9702R0723j7108r9771j7336
$$ -81651 -160515 -156247 -102055 -80341 5158 76668 3412 23114 113837 96729 -3042 -20378
22197b0378P3220R0357q661n2673K7603l0207L5159j17220k0797O7332J00114
$$ -20378 52842 143199 134538 81865 109468 79261 114420 -2800 -23597 43735 143849
22186A43849J32228J17075L00738L21458J78989J6618k81002l18335j87575j13270
$$ 143849 276077 393152 693890 1015348 1194337 1210955 929953 611618 424043 310773
22176C10773M6540k00764k20696P5166J00101K7366J1061j0535k0716k1227r087
$$ 310773 357313 156549 -64147 11019 111120 138486 149547 139012 118296 97069 87982
22165H7982l3974q4545l471J38235K8406n4400K7098p8450r7241Q4853J05533
$$ 87982 54008 -30537 -34008 104227 132633 78233 105331 26881 -70360 14493 120026
22154A20026o078o9087j03231j1324r3842r269J23047K1832m8045p666L6305j1289
$$ 120026 113948 44861 -58370 -69694 -163536 -172805 -49758 -27926 -75971 -83637 -47332 -58621
22142e8621O7579j3394l0331k5110j8990L5058o6575m1603R5546J4393o5146r098
$$ -58621 8958 -4436 -34767 -59877 -78867 -43809 -110384 -151987 -56441 -42048 -107194 -116292
22130a16292P6001p7187N2159o2145l3045J19739J47347j1652N1966l3084m7597
$$ -116292 -40291 -117478 -65319 -127464 -160509 -40770 106577 94925 146891 113807 66210
22119F6210j453j15707r6281j285J00607Q7544k1766l1306J7853n4828j951l3523
$$ 66210 64757 -50950 -147231 -148516 -47909 39635 17869 -13437 4416 -50412 -52363 -85886
22107h5886O9503M9328k1012M2206M2688j04909L1183N3264q045j31321P086L6854
$$ -85886 -16383 32945 11933 54139 96827 -8082 23101 76365 68320 -63001 -55915 -19061
22095a9061J5346R884M5625j9399r6903n0894K9050N9146k1084l5131J7603m0861
$$ -19061 -3715 6169 51794 32395 -64508 -115402 -86352 -27206 -48290 -83421 -65818 -106679
22083a06679p3264N7943K9016N0483o3981Q6943r602J4690R6696m6627o9398O0281
$$ -106679 -179943 -122000 -92984 -42501 -106482 -19539 -29141 -14451 82245 35618 -33780 26501
22071B6501Q076p7922j0827j0356J090J48119J06426N3153J5072j18762Q049J62760
$$ 26501 34577 -43345 -54172 -64528 -63438 84681 191107 244260 259332 140570 148619 311379
22059C11379N5736J5330M9693K78411N94570P84108M21470m07222q74058o45365
$$ 311379 367115 382445 432138 710549 1305119 2089227 2510697 2103475 1229417 584052
22049E84052l57393j86169r6703M8733J5382k9061k2592K5443O139K4405k5640
$$ 584052 226659 40490 -56213 -7480 7902 -21159 -43751 -18308 -12169 12236 -13404
22038a3404p252L3140l2453o3665j9316K7888O7458L2563o1782m6135r9582L5103
$$ -13404 -20656 12484 -19969 -83634 -102950 -75062 -7604 24959 -36823 -82958 -182540 -147437
22026a47437P0489J26309N3841J8332k5909k7593K1448n3915k2967j411m3829
$$ -147437 -76948 49361 103202 121534 95625 68032 89480 35565 12598 11187 -32642
22015c2642j1009J51041l7139p5665J265J08618q8119J3689J5931k3244J8841
$$ -32642 -43651 107390 70251 -5414 -4149 104469 16350 30039 45970 22726 41567
22004D1567k9357M0464R2761P3554m4674K3791L6675J512k211m0439o9541p8948
$$ 41567 12210 52674 145435 218989 174315 198106 234781 236293 234082 193643 124102 45154
21992D5154O1092J46369j09769j41980j5837n5750Q0983l0129p4032L0793m9497
$$ 45154 106246 252615 142846 866 -14971 -70721 10262 -19867 -93899 -63106 -112603
21981a12603N6607K9379o790J5097l3325L7774j670r1923K3628P7051R8693n2232
$$ -112603 -55996 -26617 -33407 -18310 -51635 -13861 -15531 -107454 -83826 -6775 91918 39686
21969C9686p5093l2091Q7217J7307l7659j28562k2348J13539K7972N3681O9705
$$ 39686 -35407 -67498 19719 37026 -633 -129195 -151543 -38004 -10032 43649 113354
21958A13354m3211n2601O3493j3617j17484q8395k3405J00713J03581R1Q254m4455
$$ 113354 70143 17542 81035 67418 -50066 -138461 -161866 -61153 42428 42519 50773 6318
21946F318m9560p3127J263O7831N6108K6852n0442n7865J36590R0995j5223J7158
$$ 6318 -43242 -116369 -115106 -47275 8833 35685 -14757 -72622 63968 154963 139740 156898
21934A56898j05249r1975L8524o6396o4950N1636K2348q8442q7305m414M5474
$$ 156898 51649 -40326 -1802 -68198 -133148 -81512 -59164 -147606 -234911 -239325 -193851
21923a93851P1490j2908l5167n6690L0045Q2960J00091R2659K9915L3224j88937
$$ -193851 -122361 -135269 -170436 -227126 -197081 -114121 -14030 78629 108544 141768 -47169
21912d7169L4593J11378q8089N822k7354k6853m8250K8173L3639j7990r60J3658
$$ -47169 -12576 98802 10713 16535 -10819 -37672 -85922 -57749 -24110 -42100 -43060 -29402
21900b9402n4884k5430m9721o7761K4837O9761M9214O7691O4943M8216n5489q3183
$$ -29402 -84286 -109716 -159437 -227198 -202361 -132600 -83386 -15695 49248 97464 41975 -41208
21888d1208n5753o9293Q2671n6363p2296P1097P7101j25096o3908L4330L8931
$$ -41208 -96961 -166254 -83583 -139946 -212242 -141145 -64044 -189140 -253048 -218718 -179787
21877a79787M8322N0391K6063O0228O6277p812r8760o7506K7329k0445n270J12124
$$ -179787 -131465 -81074 -55011 5217 71494 63682 -35078 -102584 -75255 -95700 -100970 11154
21865A1154P7573l1486j07671j05208j3743J05817O3092j02592k0352O5470L1784
$$ 11154 88727 57241 -50430 -155638 -169381 -63564 -472 -103064 -123416 -57946 -26162
21854b6162n9609Q8p8190N7280O382M511O7826r9826j576J28991J9313m6411Q357
$$ -26162 -85771 -85683 -163873 -106593 -100211 -95700 -27874 -127700 -129276 -285 19028 -27383 -19026
21841a9026J1173k5621j20112J3113J00812l8748l3227J1087J2633m4771P2959
$$ -19026 -7853 -33474 -153586 -140473 -39661 -78409 -111636 -100549 -87916 -132687 -59728
21830e9728M4098p8737N5915J37474N3802P0966J3637j18005p2498m1136N2423
$$ -59728 -15630 -94367 -38452 99022 152824 223790 237427 119422 46924 5788 58211
21819E8211N1053R1797J4740l2008p0838k9444n7155l9901m8825Q4469L3479k6543
$$ 58211 109264 201061 215801 183793 112955 83511 26356 -13545 -62370 22099 55578 29035
21807B9035M641Q9246j6990m0986q9548k2658M548N8857Q486J4742K2226K3658
$$ 29035 33676 122922 105932 64946 -24602 -47260 -42712 16145 24631 39373 61599 85257
21795H5257M6698K143m9611M0949k1924L9624k8267p0028o732K2405l4616l8464
$$ 85257 131955 134098 84487 125436 103512 143136 114869 44841 38109 60514 25898 -12566
21783a2566q6761O1675J09740K5867J537m5605L9441J00278j6312K4794j04286
$$ -12566 -99327 -37652 72088 97955 99492 53887 93328 193606 177294 202088 97802
21772I7802j82275P2111Q4908l3669N068n9801O9553m385q0314j8608N3684J46266
$$ 97802 -84473 -12362 72546 38877 43945 -15856 53697 49312 -31002 -49610 4074 150340
21760A50340K6749n0487r5345J1260R9281k2352j38428m6463k7587J9776L6603
$$ 150340 177089 126602 31257 42517 141798 119446 -18982 -65445 -93032 -73256 -36653
21749c6653k7380O3431Q7913k1158r536k6605m9041j07060p434N7393R1357M9280
$$ -36653 -64033 -602 87311 66153 56617 30012 -19029 -126089 -133523 -76130 15227 64507
21737F4507K1878J4006k9296O5637J324M0181k2236m7458r8909j36909J16358
$$ 64507 86385 100391 71095 136732 138056 178237 156001 108543 9634 -127275 -10917
21726a0917J18091j22586L4819K5714r95k1627j8119N9726L5360j72349j32495
$$ -10917 107174 -15412 19407 45121 44126 22499 4380 64106 99466 -72883 -205378
21715b05378n7768n2528P8897J11379N3923j3641p6736m2097O1662J16167R4283
$$ -205378 -263146 -315674 -236777 -125398 -71475 -85116 -161852 -203949 -142287 -26120 68163
21704F8163k1604K5920K7536M904j00517j00026P7563k2770j5429M151p7127m3395
$$ 68163 46559 72479 100015 104919 4402 -95624 -18061 -40831 -56260 -52109 -129236 -172631
21692a72631J93877P1967p1598p6687p669N9521k6876N5665M4257o2645L3162
$$ -172631 21246 93213 21615 -55072 -62741 -3220 -30096 25569 69826 7181 40343
21681D0343R5274L7633k0211p0002r0648J771J8011R9051L2682l2326r8671p6089
$$ 40343 135617 173250 153039 83037 -7611 -5840 12171 111222 143904 111578 12907 -63182
21669f3182n5795m8497o7882J3883N2826j3196J3699m8658K4370L2663o7925O3794
$$ -63182 -118977 -167474 -235356 -221473 -168647 -181843 -168144 -216802 -192432 -159769 -227694 -163900
21657a63900r926P9193p6379m3981J00070j6150L4661L0596M8000R2280K2124
$$ -163900 -173826 -94633 -171012 -214993 -114923 -131073 -96412 -65816 -17816 74464 96588
21646I6588q8371r5097l3152M1428O2856K6340K1437P3063l3043q2229o2881j7146
$$ 96588 8217 -86880 -120032 -78604 -15748 10592 32029 105092 72049 -10180 -73061 -90207
21634i0207N9425J3501M7474o3666m556R1013M3315N635o2303j76184j32237O6356
$$ -90207 -30782 -17281 30193 -33473 -38029 52984 96299 101934 39631 -136553 -268790 -202434
21622b02434M2305J9682qO4460Q7721Q0134K303j7415q5135K827R0373J5153r9230
$$ -202434 -160129 -140447 -140455 -75995 11726 91860 94163 76748 -8387 -5560 84813 99966 736
21609G36k1684m430L5371p2199J8102O1691J51877K5791j55825o7748N2051j5680
$$ 736 -20948 -25378 9993 -62206 -44104 17587 169464 195255 39430 -28318 23733 8053
21597H053j3493m318n8230l784K2337j9040j6123Q6865n7237q1208p0159O2133
$$ 8053 -5440 -9758 -67988 -71772 -49435 -68475 -84598 2267 -54970 -136178 -206337 -144204
21585a44204J17678J7062O812m5654J6913Q0019j2127M9120M3084k7197m4935
$$ -144204 -26526 -9464 -2652 -48306 -31393 48626 36499 85619 128703 101506 56571
21574E6571o1630n3284j128k6375j8012L470p8187j4143o193J08081R2930k4058
$$ 56571 -5059 -58343 -59471 -85846 -103858 -100388 -178575 -192718 -198911 -90830 2100 -21958
21562b1958N816m2537j2075O9979o032r7125L621R17R600M4634J0462L570K2823
$$ -21958 -16142 -58679 -70754 -775 -6807 -103932 -100311 -99394 -89794 -45160 -34698 -31128 -8305
21549h305n3177o1318L4599j10073j2687M7122J08084j3937P7675j6097j16838
$$ -8305 -61482 -122800 -88201 -198274 -210961 -163839 -55755 -69692 7983 -8114 -124952
21538a24952n4975J16700k9232k1146J3668N3669P8003K6489r8762j17219j7382
$$ -124952 -179927 -63227 -92459 -113605 -99937 -46268 31735 58224 -40538 -157757 -175139
21527a75139Q1305J30260k8405j14260J6420J54324M2937R896m7721o3864J1911
$$ -175139 -93834 36426 8021 -106239 -89819 64505 107442 117338 69617 5753 17664
21516A7664K1907M7689O1109n2313j9434L360j9381n2071P1536p6300o6430L7794
$$ 17664 39571 87260 148369 96056 76622 79982 60601 8530 80066 3766 -62664 -24870
21504b4870o4758k5666M2584j2717P9241J68967K34r7545L5115L1709K558q5541
$$ -24870 -89628 -115294 -72710 -85427 -6186 162781 163015 65470 100585 132294 134852 49311
21492D9311m9999L0141l6937m4135O6205J5423j6317K600O2128k1599p870L2817
$$ 49311 -688 29453 -7484 -51619 14586 30009 13692 16292 78420 56821 48951 81768
21480H1768j4308n3630j6783k2065r5198n7762N4172O4029L6134K7579N6265J9086
$$ 81768 67460 13830 -2953 -25018 -120216 -177978 -123806 -59777 -23643 3936 60201 79287
21468G9287m9885m0805m2856Q3706l585m8859k7553P833Q058l5748m7452J9794
$$ 79287 29402 -11403 -54259 29447 25862 -22997 -50550 -42717 -34659 -70407 -117859 -98065
21456i8065L33P4269N3569l2514p9582j6368O9331R4033l9898j8851p9124J0578
$$ -98065 -97732 -23463 30106 -2408 -81990 -98358 -29027 65006 25108 6257 -72867 -62289
21444f2289j4049j8911P243R0690P5807K3658Q8022L0658r1028j24285n3302m1975
$$ -62289 -76338 -95249 -88006 2684 78491 102149 190171 220829 129801 5516 -47786 -89761
21432h9761O0622J35345M642k3770J1860q6421n134o6541k4598n7633R687k9395
$$ -89761 -29139 106206 110848 87078 98938 12517 7383 -59158 -83756 -141389 -131702 -161097
21420a61097J2097R4984m2292o1455l53K0661m9571p5013P2107Q8300N7767j2512
$$ -161097 -149000 -54016 -96308 -157763 -158116 -137455 -187026 -262039 -189932 -101632 -43865 -56377
21408e6377o2368M8836O8518o2501k8130K7127l5099K4202P3272O1860J6268r6317
$$ -56377 -118745 -69909 -1391 -63892 -92022 -64895 -99994 -75792 -2520 59340 75608 -20709
21396b0709l5727q30M0944J1381l883L3670j1541o3037l7950P4083M9474l0617
$$ -20709 -56436 -57266 -16322 -4941 -8824 24846 13305 -49732 -87682 -13599 35875 5258
21384E258k1323j8647J9303N4006n075r8516o9522J6197O4178J8422K1612R84
$$ 5258 -16065 -34712 -15409 38597 33522 -64994 -134516 -118319 -54141 -35719 -14107 -13123
21372a3123R5708Q2341o1372r9526p5104L387K3449N4519Q945J8916L685m3776
$$ -13123 82585 164926 103554 4028 -71076 -67689 -44240 10279 19224 38140 41825 -1951
21360a951M374R515j14099o5209K2996M9752j7134l7322m2446Q8995M8172O5836
$$ -1951 2423 11938 -102161 -167370 -144374 -94622 -111756 -149078 -191524 -102529 -54357 11479
21348A1479n3326k8238L0402l5085k3920P8864N066r045K1177K8714o5394r5278
$$ 11479 -41847 -70085 -39683 -74768 -98688 -19824 -14758 -23803 -2626 26088 -39306 -134584
21336a34584p8534M695J05422K6830R798R924j8271K9793N3438J10759P8363o5417
$$ -134584 -213118 -208423 -103001 -76171 -66373 -56449 -74720 -44927 8511 119270 197633 132216
21324A32216j1641k4831j9102j2065r7478K7782M1899N4825o8711o0151p9402
$$ 132216 120575 95744 76642 64577 -32901 -5119 36780 91605 22894 -37257 -116659
21313a16659J9086O8327m9131M1184J7005n3712J7619j8355m6662N453J8770o2716
$$ -116659 -97573 -29246 -78377 -37193 -20188 -73900 -56281 -74636 -121298 -115845 -97075 -159791
21301a59791N8684L2221j09718N8112P5424Q931j02532J18596J03275r229o9347
$$ -159791 -101107 -68886 -178604 -120492 -45068 -36137 -138669 -20073 83202 73973 4626
21290D626L164J0095j9079r0260j07900Q2224M9715J10889Q2864O450J5531p4077
$$ 4626 7790 17885 -1194 -91454 -199354 -117130 -67415 43474 126338 132788 148319 74242
21278G4242o3564n7709m8186R5771N4786k8078m5627k2893p436M5407J7734L3382
$$ 74242 10678 -47031 -95217 554 55340 27262 -18365 -41258 -48694 -3287 14447 47829
21266D7829n4257m4780R3375k8727k0171R4786J280j15048n0961m0056r331l8606
$$ 47829 -6428 -51208 42167 13440 -6731 88055 89335 -25713 -76674 -116730 -126061 -164667
21254a64667L6636L8184j3202K1901n3422l1925k7432K5398M3462q5513m7571
$$ -164667 -128031 -89847 -103049 -81148 -134570 -166495 -193927 -168529 -125067 -210580 -258151
21243b58151P7285q323O2030M8331K4072J12871K7159r600k9845j24902o0912
$$ -258151 -180866 -189189 -127159 -78828 -54756 58115 85274 75674 45829 -79073 -139985
21232a39985K4401o2531P1389J53479N0948j06784j10381k2989l1407Q0080J53443
$$ -139985 -115584 -178115 -106726 46753 97701 -9083 -119464 -142453 -173860 -93780 59663
21221E9663M2858p2120r2607n42P6358j1611M543k192j0148r7509o9367P4066
$$ 59663 102521 30401 -62206 -62748 13610 1999 6542 4350 -5798 -103307 -172674 -98608
21209i8608R9352J9806n5643o0594J5511J5720O4070M1052Q0355Q375O8107k8782
$$ -98608 744 20550 -35093 -95687 -80176 -64456 -386 40666 121021 129396 197503 168721
21197A68721o5281o2096j04514L7904j9668n7953j157N4088n203J5587N0565Q3974
$$ 168721 103440 41344 -63170 -25266 -44934 -102887 -104044 -49956 -55159 -39572 10993 94967
21185I4967l303o7953j9921J0999l1236K5463l3311M7699K5206l2799J890Q734
$$ 94967 91664 23711 3790 14789 -16447 9016 -24295 23404 48610 15811 17701 26435
21173B6435q8909O2201N6733k2081J6283j07517r5063q8442L1342K8835O8237
$$ 26435 -62474 -273 56460 34379 50662 -56855 -151918 -240360 -209018 -180183 -111946
21162a11946J86341m2345q9098j13323J1346Q1983j1289j10265J41196J03502
$$ -111946 74395 32050 -57048 -170371 -159025 -77042 -88331 -198596 -57400 46102
21152D6102Q3132j00406q6262r1954r2018N4059P6024Q2872l2383K6107O2620
$$ 46102 129234 28828 -57434 -149388 -241406 -187347 -111323 -28451 -60834 -34727 27893
21141B7893P0166j68r9594j0326k0723o8779q8093J01433K9092m7028L7918K1128
$$ 27893 98059 97891 -1703 -12029 -32752 -101531 -189624 -88191 -59099 -106127 -68209 -47081
21129d7081j12302m2249O3655M9181J28433N1146n9016l2046j6855o0653l8782
$$ -47081 -159383 -201632 -137977 -88796 39637 90783 31767 -279 -17134 -77787 -116569
21118a16569J32261J36832J20430l0708j12818Q7155O8431q5250j8242M8647n5568
$$ -116569 15692 152524 272954 242246 129428 216583 285014 199764 181522 230169 174601
21107A74601r8033k0112N0456L3071M6595k9101j15851q7913j15298J5116J3800
$$ 174601 76568 56456 106912 139983 186578 157477 41626 -46287 -161585 -146469 -132669
21096a32669k5596o1022J46724R0954m3442p0128N3987M6314P5824L9736p3264
$$ -132669 -158265 -219287 -72563 18391 -25051 -95179 -41192 5122 80946 120682 47418
21085D7418j5807N4659k9157N5327k0012L0808N608n3585n0708r8884n3549L4970
$$ 47418 31611 86270 57113 112440 92428 123236 128844 75259 24551 -74333 -127882 -92912
21073i2912R1788n9021l7488M4808N7774O9210p7338o6464p1857P983J1873r550
$$ -92912 -1124 -60145 -97633 -52825 4949 74159 -3179 -69643 -141500 -133517 -121644 -131194
21061a31194Q6094O5911j7691q5957N3885R668j03920k3888L2496P0053K1766
$$ -131194 -45100 20811 3120 -82837 -28952 -19284 -123204 -147092 -114596 -44543 -22777
21050b2777o4074L4710M1000n7068L5126M1548l2568l9897J2068Q995K4202l952
$$ -22777 -86851 -52141 -11141 -68209 -33083 8465 -24103 -64000 -51932 -42937 -18735 -22687
21038b2687J6927o5212R672K8954M2529M6891k6075l753m8125K1856N5072o181
$$ -22687 -5760 -70972 -61300 -32346 10183 57074 30999 27246 -20879 977 56049 49868
21026D9868P6158O1193k1608q4584q1301P353p6537m6176O7333r3968j02907j8093
$$ 49868 126026 187219 165611 81027 -274 7079 -69458 -115634 -48301 -142269 -245176 -263269
21014b63269L4424M3072j8268K4875K11148O8650j27645m2485L7731k3213l4164
$$ -263269 -228845 -185773 -204041 -179166 31982 100632 -27013 -69498 -31767 -54980 -89144
21003h9144Q2130m326n3224n2683N3494K1669p7170j65J8530O2112l6894j56206
$$ -89144 -7014 -11340 -64564 -117247 -63753 -42084 -119254 -119419 -100889 -38777 -75671 -231877
20991b31877k3267J37259J33456N4098n1641m8978j27447n8813P1462l9539Q7057
$$ -231877 -255144 -117885 15571 69669 18028 -30950 -158397 -217210 -145748 -185287 -98230
20980i8230O0853p0576o8057L3098l2837l1665J17261M8170n2262o175r095N7148
$$ -98230 -37377 -107953 -176010 -142912 -175749 -207414 -90153 -41983 -94245 -100420 -109515 -52367
20968e2367M5933R7140Q9286K6977k4007j01572q1095n284M9780J0757k1307j7331
$$ -52367 -6434 90706 179992 206969 182962 81390 295 -4989 44791 55548 34241 16910
20956A6910J17394j3587k8426k4184J0457j00619J5394L1642o3675q3139l815
$$ 16910 134304 120717 92291 68107 78564 -22055 -6661 24981 -38694 -121833 -125648
20945a25648K26l4981N7140J13356p2306k185j6779R2283O1214J9631J243j93869
$$ -125648 -125422 -160403 -103263 10093 -62213 -64398 -81177 11106 72320 91951 93194 -100675
20933a00675q7185n5021k8401N9085P1182R3877J19865j00188j64958p467q188
$$ -100675 -187860 -242881 -271282 -212197 -141015 -47138 72727 -27461 -192419 -199886 -208074
20922b08074L8744k4725P1056J04387j7830J1505k2450j5355K6289p7506J5333
$$ -208074 -169330 -194055 -122999 -18612 -36442 -24937 -47387 -62742 -36453 -113959 -98626
20911i8626P1045J2490j3742Q4178m0170j04091o5879M265P6434K4192r175m9012
$$ -98626 -27581 -15091 -28833 55345 15175 -88916 -154795 -150530 -74096 -49904 -59079 -108091
20899a08091L1571Q7702o6011L3951M7286j43401L799M931J984R8602K0586o3699
$$ -108091 -76520 11182 -54829 -20878 26408 -116993 -113194 -108263 -106279 -7677 12909 -50790
20887e0790N213R087j1567K9274n1639j67185p3144J67721J22357M4780L9707
$$ -50790 -45577 -36490 -48057 -18783 -70422 -237607 -310751 -143030 -20673 24107 63814
20876F3814n2052N053l4605l1773m3565M402p694j7863J74457J21104J897r0748
$$ 63814 11762 16815 -17790 -49563 -93128 -88726 -96420 -114283 60174 181278 183175 92427
20864I2427j22069J7756m8157L7189J20294O8622o0961l2214M6455j0510o1290
$$ 92427 -29642 -11886 -60043 -22854 97440 166062 105101 72887 119342 108832 47542
20853D7542j43993o4222j2547R8460K9064P7402J09101K7051n3190r1930j3245
$$ 47542 -96451 -160673 -173220 -74760 -45696 31706 140807 167858 114668 22738 9493
20842I493l5297K8306R8089M2732n3123k4225j28119j07792L044L115J13943M3841
$$ 9493 -25804 2502 100591 143323 90200 65975 -62144 -169936 -166892 -163777 -49834 -5993
20830e993n1127J7173P276N065R8325M7019M081L7621j38371j35988L24K5671
$$ -5993 -57120 -39947 -32671 -27606 70719 117738 121819 159440 21069 -114919 -114595 -88924
20818h8924p2014j2451L0989O745K0057Q6154M2306J8263K1058M2063J1394K5939
$$ -88924 -160938 -173389 -142400 -135655 -115598 -29444 12862 31125 52183 94246 105640 131579
20806A31579j14365p5754k300n1562j8838K1489k1011J08473J13853M4663M6188
$$ 131579 17214 -58540 -60840 -112402 -131240 -109751 -130762 -22289 91564 136227 182415
20795A82415r962n5712j38474P5372J01686p3284n3788m0307p4055L5536P3753
$$ 182415 172453 116741 -21733 53639 155325 82041 28253 -12054 -86109 -50573 23180
20784B3180K954r353P5718j12752o4896l7043p7382P2490J32542m3726J6428j8259
$$ 23180 26134 16781 92499 -20253 -85149 -122192 -199574 -127084 5458 -38268 -21840 -40099
20772d0099q9235J6488r2660n5443J40535J00577O0400K8808j2284J7280N4800
$$ -40099 -129334 -112846 -205506 -260949 -120414 -19837 40563 69371 57087 74367 129167
20761A29167q6987L1116J7393q2942J0445J4838L3519q1510r7121N6470M4946
$$ 129167 42180 73296 90689 7747 18192 33030 66549 -14961 -112082 -55612 -10666
20750a0666k1959q8129R3166M4507k7342P880M4528l8877Q491K5570j3324j2459
$$ -10666 -32625 -120754 -27588 16919 -10423 -2543 41985 3108 11599 37169 23845 11386
20738A1386L195J03289o5034j44341O2149k1758J828o9560j8671J1625k7354Q807
$$ 11386 14581 117870 52836 -91505 -29356 -51114 -49286 -118846 -137517 -125892 -153246 -144439
20726a44439L3364q186P6141J08097J1164j6350M0723j47906L736k1451N713O8254
$$ -144439 -111075 -119261 -43120 64977 76141 59791 100514 -47392 -43656 -65107 -59394 8860
20714H860n0751L9172K4120J4305L8169L498q4190j0650J7359R5553K0002n0744
$$ 8860 -41891 -2719 21401 35706 73875 77373 -6817 -17467 -108 95445 115447 64703
20702F4703j4963l7408m2273r904K4836k8266n0952O8624J2752O283k3928M1073
$$ 64703 49740 12332 -29941 -39845 -15009 -43275 -94227 -25603 -12851 -6568 -30496 10577
20690A0577L988L113P5205k9276j47217r1682q2807n229l3495J4969J15589O1190
$$ 10577 14565 17678 92883 63607 -83610 -175292 -258099 -263328 -296823 -281854 -166265 -105075
20678a05075K6955j5854R631n3663J2459J9336m9273N2061P0248o326k7190l4835
$$ -105075 -78120 -93974 -84343 -138006 -125547 -106211 -155484 -103423 -33175 -39501 -66691 -101526
20666a01526J34148N3690o8525l3975q1960N6760K2209l7592P6887Q1203r8326
$$ -101526 32622 86312 17787 -16188 -98148 -41388 -19179 -56771 20116 101319 2993
20655B993k0269L6131p2066j25342q9279O5366P3382Q3304J13719L2778j5831
$$ 2993 -17276 18855 -53211 -178553 -267832 -202466 -129084 -45780 67939 100717 84886
20644H4886l2361J3103J00587N1617j05799m8276n0091n0575o62o0302L4036R0810
$$ 84886 52525 65628 166215 217832 112033 63757 13666 -36909 -37571 -97873 -63837 26973
20632B6973L5613K7727M1098j52n9322l6079N6139r2065r5460N9378o7051R660
$$ 26973 62586 90313 131411 131259 71937 35858 91997 -68 -95528 -36150 -103201 -93541
20620i3541K05785M8697q3931m1758p7304K2756q911o6577P04L2670k5084k6418
$$ -93541 112244 160941 77010 35252 -42052 -19296 -28207 -94784 -94080 -61410 -86494 -112912
20608a12912J28594Q2118q5309j24733O7979P4264J01059J8917m9442J6884o9070
$$ -112912 15682 97800 12491 -112242 -44263 30001 131060 149977 100535 117419 48349
20597D8349j43530p2565Q6695J36368r154j09013m7273k1326L9954Q2945N732
$$ 48349 -95181 -167746 -81051 55317 46163 -62850 -110123 -131449 -91495 -8550 -2818
20586b818k4696j6602N0244j2450M6397j0263p1072j10211k9573l1207M3554J12397
$$ -2818 -27514 -44116 6128 -6322 40075 29812 -41260 -151471 -181044 -212251 -168697 -56300
20574e6300L0258j4050L7777J0368p6296j30761K0057P7847l1782j3955K4952
$$ -56300 -26042 -40092 -2315 8053 -68243 -199004 -178947 -101100 -132882 -146837 -121885
20563a21885k388j0124O690K7876J7710N8049K8712o6520n9820j1282r0797O0148
$$ -121885 -124273 -134397 -127707 -99831 -82121 -24072 4640 -61880 -121700 -132982 -223779 -163631
20551a63631J554J8222R2180O1520J26274R238l0443r3516k572m2013k7993k6263
$$ -163631 -162077 -143855 -51675 9845 136119 145357 114914 21398 18826 -23187 -51180 -77443
20539g7443N8352j5178Q2301Q8100q7838r6617j47109r7603J30648Q5500R4369
$$ -77443 -19091 -34269 48032 136132 48294 -48323 -195432 -293035 -162387 -76887 17482
20528A7482O0836n5602K6048p4954j10203M1443L3122k8144J14464L4870q0413
$$ 17482 78318 22716 48764 -26190 -136393 -94950 -61828 -89972 24492 59362 -21051
20517b1051J13004J36743k0210k06429J9520r8240k0389K3394o2050K7539L1244
$$ -21051 91953 228696 208486 2057 21577 -76663 -97052 -73658 -135708 -108169 -76925
20506g6925J58456L357p5283N7762M2181m9295J8338j6713P938n7547q1689p76
$$ -76925 81531 84888 9605 67367 109548 60253 78591 61878 69816 12269 -69420 -70196
20494g0196n8530J174M4093K7727M6450K170J6960q67j460n373J8147k8238p7107
$$ -70196 -128726 -127552 -83459 -55732 -9282 -7112 9848 8981 7521 2148 20295 -7943 -85050
20481h5050L1686M0533q1033M7800M8065p754N0844l3054j98413J09308N9842
$$ -85050 -53364 -12831 -93864 -46064 2001 -5753 45091 12037 -186376 -77068 -17226
20470a7226L590O9282N7916j9257j52563j7129Q7224L2397o3050k6230k2909l0210
$$ -17226 -13636 55646 113562 94305 -58258 -75387 11837 44234 -18816 -45046 -67955 -98165
20458i8165p12M6468K6733q4081k0287j06659J8446m3891m537K1584P4470J06951
$$ -98165 -98877 -52409 -25676 -109757 -130044 -236703 -218257 -262148 -266685 -245101 -170631 -63680
20446f3680R2737J6645j0181j05223N1211l4770l2415L4748J3627J6737n0236
$$ -63680 29057 45702 35521 -69702 -18491 -53261 -85676 -50928 -37301 -20564 -70800
20435g0800m6894R0185L2887m7825l938O3613N0993k2298k451k9401m042p8384
$$ -70800 -117694 -27509 5378 -42447 -46385 17228 68221 45923 43472 14071 10029 -68355
20423f8355j33595J68649J86425j7267j13703m0994R8277K9712n7660L8009J02265
$$ -68355 -201950 -33301 153124 135857 22154 -18840 79437 109149 51489 89498 191763
20412A91763K7206n3754o048M1864K3120n1043j15073o5745j29251l0274M4929
$$ 191763 218969 165215 159167 201031 224151 173108 58035 -7710 -136961 -167235 -122306
20401a22306m1774R634Q9706n0144O3490R5195L8003Q377j5094k4348K3343O003
$$ -122306 -164080 -154446 -64740 -114884 -51394 43801 81804 90181 75087 50739 74082 80085
20389H0085k0172L4575J837j04273j03299o1277q8756N5420J03250P0850P0158
$$ 80085 59913 94488 96325 -7948 -111247 -172524 -261280 -205860 -102610 -31760 38398
20378C8398l9568n5289L8527j2342K1530M6907K880p9363k142P650J9412l9750
$$ 38398 -1170 -56459 -17932 -30274 -8744 38163 41043 -38320 -40462 -32812 -13400 -53150
20366e3150K4666L595k4762O9461J19381M9871o7148j82093M9132L6592J140m1964
$$ -53150 -28484 -24889 -49651 19810 139191 189062 121914 -60179 -11047 25545 26685 -15279
20354a5279p7465p9510j20034P1478K2698m3370k5538l900N0347R3411P8727J00418
$$ -15279 -92744 -172254 -292288 -220810 -198112 -241482 -267020 -270920 -220573 -127162 -48435 51983
20342E1983l1414O6255L653j4115n9211j24084j37881K0725M8141m369M7039N3916
$$ 51983 20569 86824 90477 76362 17151 -106933 -244814 -224089 -175948 -180317 -133278 -79362
20330g9362N9348J22136N6284n9178j00671k3384j2754k7061M0334J11060O7170
$$ -79362 -20014 102122 158406 99228 -1443 -24827 -37581 -64642 -24308 86752 153922
20319A53922J9461j08905q7990j07302j4378J34651R1489L7870M4650j57775p8490
$$ 153922 173383 64478 -23512 -130814 -145192 -10541 80948 118818 163468 5693 -72797
20308g2797j05830P4367j8799m8434J22354K9977j16037j3171K907Q539K6923
$$ -72797 -178627 -104260 -123059 -171493 -49139 -19162 -135199 -148370 -145463 -136924 -110001
20297a10001j9724P1454L3218p577m2479Q1271O7779j3362J1391l2780m9219n6489
$$ -110001 -129725 -58271 -25053 -32630 -75109 6162 73941 60579 71970 39190 -10029 -66518
20285f6518P869J00047P5934m5682o5768j2739j551k6857P4056N5359m1012p1507
$$ -66518 -58649 41398 117332 71650 5882 -6857 -8408 -35265 38791 94150 53138 -18369
20273a8369M2555L7948r051l1516J9678R2220k4066j684o6823o7641m8792m0928
$$ -18369 24186 62134 53083 21567 41245 133465 109399 107715 40892 -26749 -75541 -116469
20261a16469M4822L5939K2118J8649K9313j85401k7898P9293K4147n5081M3638
$$ -116469 -71647 -35708 -13590 5059 34372 -151029 -178927 -99634 -75487 -130568 -86930
20250h6930j727N0914O4069M105j1458n1591l5156O4158P3884J25618P241k39854
$$ -86930 -88657 -37743 26326 30431 18973 -32618 -67774 -3616 70268 195886 203127 -36727
20238c6727K0488N1013l3144K3210j05024j3000r1701q4876j693k9267J5156o8707
$$ -36727 -16239 34774 1630 24840 -80184 -93184 -184885 -269761 -271454 -300721 -285565 -354272
20226c54272q467J45687J00663K5689M1345M0762L9346j5086m6062j51770n7941
$$ -354272 -362739 -217052 -116389 -90700 -49355 -8593 30753 15667 -30395 -182165 -240106
20215b40106J22353Q2647j0571j78013N9764M4582j00990m0334J41515J52181
$$ -240106 -117753 -35106 -45677 -223690 -163926 -119344 -220334 -260668 -119153 33028
20205C3028J1758K087n754K1150R9313o0357n1065k1308J5065l1949m1965j02471
$$ 33028 44786 46873 41119 62269 161582 101225 50160 28852 43917 11968 -29997 -132468
20193a32468P318L385p699J24017R0124L2339l2068j24162j9787M0188o2448l0685
$$ -132468 -125150 -121765 -129464 -5447 84677 117016 84948 -39214 -59001 -18813 -81261 -111946
20181a11946K5687n7651j26279J568L6844O3895J48118P655K0792J02380o34j47683
$$ -111946 -86259 -143910 -270189 -268621 -231777 -167882 -19764 -12109 8683 111063 110429 -37254
20169c7254k6533J6274l6175m6433K8483j1961Q0527J05881J2213r8999n429o4897
$$ -37254 -63787 -47513 -83688 -130121 -101638 -113599 -33072 72809 85022 -13977 -19406 -84303
20157h4303L0856j3912J2712K6697m824N4483k2808p104N7490K0171L6157l5489
$$ -84303 -53447 -67359 -54647 -27950 -32774 21709 -1099 -8203 49287 69458 105615 70126
20145G0126j16537j4040R1875p0804j39494N2106J88481m548O2794j8291j12109
$$ 70126 -46411 -60451 31424 -39380 -178874 -126768 61713 57165 119959 101668 -10441
20134a0441p3663k7047L3000J34929L7980l8662L0308r76m3631m6079p2234n4491
$$ -10441 -84104 -111151 -78151 56778 94758 56096 86404 85428 41797 -4282 -76516 -131007
20122a31007K0608m9422j00466J31418N8601N3765o4636j273M9213p387o1534
$$ -131007 -110399 -159821 -260287 -128869 -70268 -16503 -81139 -82412 -33199 -40586 -102120
20111a02120J6844J2881R8199J14185p9521m258r827K530l2725l5975q0596j5335
$$ -102120 -85276 -72395 25804 139989 60468 56210 46383 48913 16188 -19787 -100383 -115718
20099a15718p191K1051L7593M923N0640P7452K7967N3943j37877j30008J68072
$$ -115718 -122909 -101858 -64265 -59342 -8702 68750 96717 150660 12783 -117225 50847
20088E0847R5555o1994k9438n573P595m6837k0219L0553m0671l1222p9641M3825
$$ 50847 146402 84408 54970 49397 56992 10155 -10064 20489 -20182 -51404 -131045 -87220
20076h7220K3025P238Q7262R604j05071l5226J9648m7639p294R1724K8062j09000
$$ -87220 -64195 -56957 30305 39909 -65162 -100388 -80740 -128379 -135673 -43949 -15887 -124887
20064a24887j00956p5115J0211O4120K1863J67886J65615j052n2758r907r4636
$$ -124887 -225843 -300958 -290747 -226627 -204764 -36878 128737 127685 74927 65020 -29616
20053b9616J38960J01964j16010j11412j8464J3394o557q4776l6104R3315n4863
$$ -29616 109344 211308 95298 -16114 -34578 -21184 -27741 -112517 -148621 -55306 -110169
20042a10169k8035o4368k1595J9376R2224Q2256M1254p407K5471r2337K6815M5418
$$ -110169 -138204 -202572 -224167 -204791 -112567 -30311 10943 3536 29007 -63330 -36515 8903
20030H903k7120j11015J26574Q7757l2820k7347N0216Q125o3063n4729p0279K725
$$ 8903 -18217 -129232 -2658 85099 52279 24932 75148 83273 20210 -34519 -104798 -102073
20018a02073P9340R1665O326q5622k8159k4102K5906k0493j8411l0255j6873L0365
$$ -102073 -22733 68932 75258 -10364 -38523 -62625 -36719 -57212 -75623 -105878 -122751 -92386
20006i2386K0075J8786N3965o499p6865J46922P0510j14139l2477K1810r302j5453
$$ -92386 -72311 -53525 440 -6059 -82924 63998 134508 20369 -12108 9702 400 -15053
19994a5053l6853J04714P7090j00397n6104O6452L5083K1500K7593r6153m7860
$$ -15053 -51906 52808 129898 29501 -26603 39849 74932 96432 124025 27872 -19988
19983a9988O3313J6516K3411j21467r064N941P2974J1152N2689l4454N4194l4013
$$ -19988 43325 59841 83252 -38215 -47279 -41338 31636 42788 95477 61023 115217 81204
19971H1204J7571N464j43387p9546k6755K241P7291M0129K485L912N6828l3508
$$ 81204 98775 104239 -39148 -118694 -145449 -143208 -65917 -25788 -23303 -19391 37437 3929
19959C929J3737o1001q5015O330P9435M920r9333l529L7658l7392l9304J2832
$$ 3929 17666 -43335 -128350 -122020 -42585 -37665 -136998 -140527 -102869 -140261 -179565 -166733
19947a66733L8724J02860J06624j755j09661l4299N4807l5752j2314L4762j013
$$ -166733 -128009 -25149 81475 79720 -29941 -64240 -9433 -45185 -57499 -22737 -23750
19936b3750M9259q8127m7187o0069M0453l9965M1042Q7088J11698J4742o4316
$$ -23750 25509 -62618 -109805 -169874 -129421 -169386 -128344 -41256 70442 85184 20868
19925B0868o4505J1740j5346j12417k4522Q2113J35591r2116j11449P3655Q6131
$$ 20868 -43637 -31897 -47243 -159660 -184182 -102069 33522 -58594 -170043 -96388 -10257
19914a0257K9210M2079n4693p4284m1108O7975L068N8215N3420k5363n1227O9645
$$ -10257 18953 61032 6339 -67945 -109053 -41078 -38010 20205 73625 48262 -2965 66680
19902F6680J06665M1034M3017m0218r6250j47288q794J9908m1252K5159M1206
$$ 66680 173345 214379 257396 217178 120928 -26360 -35154 -15246 -56498 -31339 9867
19891I867q2173l5232R9267o5451l2025M4810Q0564J0389J9493P0804O7238r9434
$$ 9867 -72306 -107538 -8271 -73722 -105747 -60937 19627 30016 49509 120313 187551 88117
19879H8117j52131Q1950O4545o7475r6055M6966k3762L411j2887j9424K4074n955
$$ 88117 -64014 17936 82481 15006 -81049 -34083 -57845 -54434 -67321 -86745 -62671 -68626
19867f8626J7174N4564p502l1188o4099j2442l8819M9703P5534l3646j10403K5741
$$ -68626 -51452 3112 -4390 -35578 -99677 -112119 -150938 -101235 -25701 -59347 -169750 -144009
19855a44009N3244Q17R1923M0967N7402p2127O1450K805L2156m8583l4354J3294
$$ -144009 -90765 -89948 1975 42942 100344 28217 89667 92472 124628 76045 41691 54985
19843E4985n633m7394R6001l0258M0558k3447L369j34630j5011O3252J8061M5766
$$ 54985 49352 1958 97959 67701 108259 84812 88181 -46449 -61460 1792 19853 65619
19831F5619o1492j03070O9512l6151L4264J5286q3410j03384Q2312J03999j9728
$$ 65619 4127 -98943 -29431 -65582 -31318 -16032 -99442 -202826 -120514 -16515 -36243
19820c6243L1323k3836j1179j5935O6215N4220r7503k0699J19442O7438l4977
$$ -36243 -4920 -28756 -39935 -55870 10345 64565 -32938 -53637 65805 133243 98266
19809I8266k353n0043n3786N3599r5319m836p200N3947N2131P924l1203K4752
$$ 98266 95913 45870 -7916 45683 -49636 -54472 -61672 -7725 44406 52330 21127 45879
19797D5879O8556M307l7948m2143k1447L7053k8916r6224K1461m4129k121l0954
$$ 45879 114435 118742 80794 38651 17204 54257 25341 -70883 -49422 -93551 -95672 -126626
19785a26626m0931q211K7519l2370o6922N1013J34337R6266N318l803M2389n7752
$$ -126626 -167557 -175768 -148249 -180619 -247541 -196528 -62191 34075 39393 35590 77979 20227
19773B0227p7826n3496L1633Q638J8173J010j5502k3408O2906J00889l2188k0925
$$ 20227 -57599 -111095 -79462 -70824 -52651 -51641 -67143 -90551 -27645 73244 41056 20131
19761B0131n4828J958J4452K9282j3498L9291Q491L5464K7121M5934K5066j03980
$$ 20131 -34697 -32739 -18287 10995 -2503 36788 45279 80743 107864 153798 178864 74884
19749G4884o9924o7802o6739J3445j5678O7581Q5006m1267J0641p5351K3421o335
$$ 74884 4960 -62842 -129581 -116136 -131814 -64233 20773 -20494 -9853 -85204 -61783 -68118
19737f8118M0093K0049o1274o713J30570J2530r9986r5585L5075K3539o4497q563
$$ -68118 -28025 -7976 -69250 -75963 54607 67137 -32849 -128434 -93359 -69820 -134317 -142880
19725a42880m69J33070J1014j06530p8712k9351N8873J5000O3882m3709n2864
$$ -142880 -143349 -10279 735 -105795 -184507 -213858 -154985 -139985 -76103 -119812 -172676
19714a72676J05736N3135J9266m9754M5262J53827O0111J971k8195M2944j9745
$$ -172676 -66940 -13805 5461 -44293 969 154796 214907 216878 188683 231627 211882
19703B11882j79662p8448N7542J43339j26949l7692m5078l7919K0437L2128k1138
$$ 211882 32220 -46228 11314 154653 27704 -9988 -55066 -92985 -72548 -40420 -61558
19692f1558M4410N1169m3037L5055l994L4706L6251n3169j12864q4151M0070N328
$$ -61558 -17148 34021 -9016 26039 22045 56751 93002 39833 -73031 -157182 -117112 -111784
19680a11784K6472J9683o3555L8688K5860O3477k3785J609R9160k1510k5812l1226
$$ -111784 -85312 -65629 -129184 -90496 -64636 -1159 -24944 -23335 75825 54315 28503 -2723
19668b723K4352o802p3006p7794j1734J45034O4169J2466o6020J4121q3034j3225
$$ -2723 21629 14827 -58179 -135973 -147707 -2673 61496 73962 7942 22063 -60971 -74196
19656g4196p385l6641K3901M2576n133j1518j1998l1692o0137j1447n5545J07370
$$ -74196 -81581 -118222 -94321 -51745 -56878 -68396 -80394 -112086 -172223 -183670 -239215 -131845
19644a31845N3104n75n797J4335L0320M13P8147J14170O8446M060q4247o802l871
$$ -131845 -78741 -79316 -85113 -70778 -40458 -40045 38102 152272 220718 224778 140531 133729 129858
19631A29858j04256q3369r5380k0177J5187K6187J5011N7853N4182K406j34156
$$ 129858 25602 -57767 -153147 -173324 -158137 -131950 -116939 -59086 -4904 -2498 -136654
19620a36654Q205o956R7839K8973j2392Q5369P2914J0785j17958k0250r0224p2011
$$ -136654 -128449 -135405 -37566 -8593 -20985 64384 137298 148083 30125 9875 -80349 -152360
19608a52360J0154l4323J1645Q7168O9492N9634M7980j16068m4134p1621K0435
$$ -152360 -142206 -176529 -164884 -77716 -8224 51410 99390 -16678 -60812 -132433 -111998
19597a11998R6560J29553j4448l1252j16316k0106K1025M6876n6825m581J14602
$$ -111998 -15438 114115 99667 68415 -47901 -68007 -46982 -106 -56931 -61512 53090
19586E3090J35794l3086j39227p6973o3322r185O3252j29751L6782J95503P1959
$$ 53090 188884 155798 16571 -60402 -123724 -132909 -69657 -199408 -162626 32877 104836
19575A04836m8124n7326L577j9889L0938p9012K7712J01132Q519l9471q1632q3664
$$ 104836 56712 -614 2963 -16926 14012 -65000 -37288 63844 72363 32892 -48740 -132404
19563a32404N0661Q3073K7824M366R068M8576k9622k3810L9517J8898l8299J9488
$$ -132404 -81743 1330 29154 33520 42588 91164 61542 37732 77249 96147 57848 77336
19551G7336P3762o2515p656q000m0037m6894K7898R9434q494p7266m0312j08667
$$ 77336 151098 88583 80927 72927 32890 -14004 13894 113328 104834 27568 -12744 -121411
19539a21411k6795M8024N1363l491K1300P731m0245p5182l5318k0834P1112J06858
$$ -121411 -148206 -100182 -48819 -52310 -31010 -23279 -63524 -138706 -174024 -194858 -123746 -16888
19527a6888Q8102J2866j3341Q7685R8647N2640q9049o861m0995j17899n8408k9655
$$ -16888 71214 84080 70739 158424 257071 309711 220662 213801 172806 54907 -3501 -33156
19515c3156J28043N423M0800M3583j4693p49r6484J8757J0400K1062K390J08436
$$ -33156 94887 100310 141110 184693 170000 169251 72767 91524 101924 122986 125376 233812
19503B33812N0667N1015j8631j26607k5537K6033l0046j8051j6886p8040p564
$$ 233812 284479 335494 316863 190256 164719 190752 160706 142655 125769 47729 40165
19492D0165j1188n858Q1635P7019m493K4443k8213N600k5537R099n6872j42695
$$ 40165 28977 23119 104754 181773 177280 201723 173510 179110 153573 162672 105800 -36895
19480c6895n9505J40420J01993R129j44160j66300R6009Q2875O0424R6133N1531
$$ -36895 -96400 44020 146013 155142 10982 -155318 -59309 23566 83990 180123 231654
19469B31654k7008j60512j34482k1565R1104N7128k1077o5627k964Q321O3375
$$ 231654 204646 44134 -90348 -111913 -20809 36319 15242 -50385 -53349 -45028 18347
19458A8347L6114m1464L7155L5295k9248j2759L6515m4618k9805k9218L8951q588
$$ 18347 54461 12997 50152 85447 56199 43440 79955 35337 5532 -23686 15265 6677
19446F677M2217O3976J07324K7487J2168M2921Q0066O3061j47823r9007L8084
$$ 6677 48894 112870 220194 247681 259849 302770 382836 445897 298074 199067 237151
19435B37151M6261K2155p8419r833j2315r161l2952j6710l97m5831R300O7718
$$ 237151 283412 305567 227148 217315 205000 195839 162887 146177 145780 99949 109249 176967
19423A76967P6807k9396j54085o9066N8115k1091k4173K1218J8579M400p7344
$$ 176967 253774 224378 70293 1227 59342 38251 14078 35296 53875 58275 -19069
19412a9069R4253J31443n9348j40126N9827M6802m9991q848q8502p4285K3768
$$ -19069 75184 206627 147279 7153 66980 113782 63791 54943 -33559 -107844 -84076
19401h4076L8994N4034P9990K9238j6523k8684j0639L3966r3525k8332L9916O8519
$$ -84076 -45082 8952 88942 118180 101657 72973 62334 96300 2775 -25557 14359 82878
19389H2878k1407m9394Q4119k8471j20917l4787N7904L8100L0637M9674M364m7232
$$ 82878 61471 12077 96196 67725 -53192 -87979 -30075 8025 38662 88336 92700 45468
19377D5468m9963m6394j32539k1418Q7091Q0611N8741o4656N551j2380J7702N5714
$$ 45468 -4495 -50889 -183428 -204846 -117755 -37144 21597 -43059 -37508 -49888 -32186 23528
19365B3528m923O5980J15265J006l0018r0473J0997P8453L4628M0500k4508m0274
$$ 23528 18605 84585 199850 200856 170838 80365 91362 169815 204443 244943 220435 180161
19353A80161K6438K8381o1948j62748j1765R6262M4824l3796J6279m5585J3071
$$ 180161 206599 234980 173032 10284 -1481 94781 139605 105809 122088 76503 89574
19342H9574l4067M2045Q9928L8908o2592l8137m5198n3898P6545O3202O9896M7008
$$ 89574 55507 97552 187480 226388 163796 125659 80461 26563 103108 166310 236206 283214
19330B83214j7220J04542O2196O4205J43440R3199j19253j95147p8506O3507J81453
$$ 283214 265994 370536 432732 496937 640377 733576 614323 419176 340670 404177 585630
19319E85630p0633j23636K5613J36700l7272P6425J05557J04052j8194p0661k3735
$$ 585630 514997 391361 416974 553674 516402 592827 698384 802436 784242 713581 689846
19308F89846r9369r1566o699l7837q3758j16882q3004Q8084j6879q1990j06441
$$ 689846 590477 498911 492212 454375 370617 253735 170731 258815 241936 159946 53505
19297E3505r7490J6976Q618m1694Q9783R6693P1307M1546m5392p1007O7591M2946
$$ 53505 -43985 -27009 -18391 -60085 29698 126391 197698 239244 193852 122845 190436 233382
19285B33382j11580m6789N0228O6966L5512r2869o4671l4350R731o6332m2126
$$ 233382 121802 75013 125241 192207 227719 134850 70179 35829 45560 -20772 -62898
19274f2898J43213P7926J8372j27920m1449N9919o9190J3401j4225L8597m2861
$$ -62898 80315 158241 176613 48693 7244 67163 -2027 11374 -2851 35746 -7115
19263g115m3516p393L2259K6504N8120j5755n4747p4861j1989J00781r499j1433
$$ -7115 -50631 -58024 -25765 739 58859 43104 -11643 -86504 -98493 2288 -7211 -18644
19251a8644j9669N4705j03920N5333J13318L761m2900k1014k8865N729l005l9713
$$ -18644 -38313 16392 -87528 -32195 81123 84884 41984 20970 -7895 -2166 -5171 -44884
19239d4884J0693J3191K0252j8994P0461Q2272O2534j7600l4044l6396N7951Q633
$$ -44884 -34191 -21000 -748 -19742 50719 132991 195525 177925 143881 107485 165436 174069
19227A74069q5048r1488M0689q975r9949J27514Q1325o4601q6223m688N0738M2459
$$ 174069 89021 -2467 38222 29247 -70702 56812 138137 73536 -12687 -17375 33363 75822
19215G5822J01435P5718n2584J0812p5054k8078N7599J564M7127P2916J04660
$$ 75822 177257 252975 200391 211203 136149 108071 165670 167234 214361 287277 391937
19204C91937J00614K31088K98542K74384M01037K78621o050J07646L90289P22644
$$ 391937 492551 723639 1022181 1296565 1697602 1976223 1970173 2077819 2468108 3190752
19194C190752M23304m68987o64215l33201N120L12856K23744k5222j57487k32473
$$ 3190752 3614056 3145069 2480854 2147653 2152773 2465629 2689373 2664151 2506664 2274191
19184B274191p6539L37520O10756O15697j44664r16119o34578k94600p7200o9421
$$ 2274191 2197652 2535172 3145928 3761625 3616961 2700842 2066264 1771664 1694464 1625043
19174A625043k82018m47549k72619j62374K1618K6974l7579J2434j46161j52378
$$ 1625043 1343025 895476 622857 460483 482101 509075 471496 483930 337769 185391
19164A85391j48495j3010P5840P9522k8368o9328m1800l3069J83490l0316N7079
$$ 185391 36896 23886 99726 179248 150880 81552 39752 6683 190173 159857 216936
19153B16936P5901n6344q6951o9303J5533L9161n449o4121O5232n9242l5497Q459
$$ 216936 292837 236493 149542 80239 95772 134933 129484 65363 130595 71353 35856 44315
19141D4315n4523K990p151k2590L5625N7334O0084K2463j8544p4327n4779L1824
$$ 44315 -10208 -7218 -14369 -36959 -1334 56000 116084 138547 120003 45676 -9103 22721
19129B2721M1853P6389J4817r41j0698l1781r1289m0415K3020L2056k7670N9821
$$ 22721 64574 140963 155780 154839 144141 112360 21071 -19344 3676 35732 8062 67883
19117F7883O6025l9867L5680n4232j14762R260O8242n210P3842J394k0041M8513
$$ 67883 133908 94041 129721 75489 -39273 -30013 38229 33019 106861 108255 88214 136727
19105A36727K5752q7824O97O2633K4247o6303m427J3175N3406p7382L5483l9582
$$ 136727 162479 74655 75352 137985 162232 95929 91502 104677 158083 80701 116184 76602
19093G6602j27539j22116l3589q4169P9578J26830M9837k7831J7808L1653l515
$$ 76602 -50937 -173053 -206642 -290811 -211233 -84403 -34566 -62397 -44589 -12936 -16451
19082a6451j6457n8572l4310M8245P1624n3263k0671O4257J60158m2643q2922
$$ -16451 -32908 -91480 -125790 -77545 -5921 -59184 -79855 -15598 144560 101917 18995
19071A8995n54O8492M9010R1973m8036j47755n941O5996N5002L20k0086J2590
$$ 18995 18441 86933 135943 227916 179880 32125 26184 92180 147182 147502 127416 140006
19059A40006L3093O8502K6769o6951m0814J1367Q1329L2717J3023o5805k7587
$$ 140006 173099 241601 268370 201419 160605 171972 253301 286018 299041 233236 205649
19048B05649N1012R9003j40915r5036J2912K6877P6882K1320j4331r003M40p0610
$$ 205649 256661 355664 214749 119713 132625 159502 236384 257704 243373 234370 234810 164200
19036A64200R818J3563J9746K3519j7683m6467N846r8184r5072Q0422K9307j07752
$$ 164200 174018 187581 207327 230846 213163 166696 172542 74358 -20714 59708 89015 -18737
19024a8737j6907O8940P3321M6988j8714j32547L0279Q9436K0509k027L5722P7005
$$ -18737 -35644 33296 106617 153605 134891 2344 32623 122059 142568 140541 176263 253268
19012B53268o1731j60675m305R3398O9196L5802J5228J17460Q3784P6271o4870
$$ 253268 191537 30862 26557 119955 189151 224953 240181 357641 441425 517696 452826
19001D52826J3945M1140P0611M5367K1471L775p1172r8088j14337o9027J44305
$$ 452826 466771 507911 578522 623889 645360 649135 577963 479875 365538 296511 440816
18990D40816J92185J09372p7921n7766L35L5076M8646J70259J53883q2851j98720
$$ 440816 633001 742373 664452 606686 607021 642097 690743 861002 1014885 932034 733314
18979G33314j90972n2740P0699Q0322k8253j15364m3339j71631r6419j17342L5983
$$ 733314 542342 489602 560301 640623 612370 497006 453667 282036 185617 68275 104258
18968A04258P1003P1658M1870j59844j08577J10680P1395M6083o5887j05340M9841
$$ 104258 175261 246919 288789 128945 20368 131048 202443 248526 182639 77299 127140
18957A27140L4503L7474l878N9231j1195p8197J51111O5033k00641N630L3109
$$ 127140 161643 199117 195239 254470 243275 165078 316189 381222 180581 186211 219320
18946B19320M1047o846o9158j31062N6790J22988p0131m7136N0814K3901l2584
$$ 219320 260367 253521 184363 53301 110091 233079 162948 115812 166626 190527 157943
18935A57943O927N5027o5939k0434m3397N2257l4517j3490K9719P7131o52o1498
$$ 157943 164870 219897 153958 133524 90127 142384 107867 94377 124096 201227 200575 139077
18923A39077L0697M9660P0424R5658j16539j12915k6384J1342k1074n4027K1999
$$ 139077 169774 219434 289858 385516 268977 156062 129678 141020 119946 65919 87918
18912H7918K1899k0912O1439M8853m5117j3867l6247J0434K3792k4269J12056
$$ 87918 109817 88905 150344 199197 154080 140213 103966 114400 138192 113923 225979
18901B25979J38566n8372j15883J7230J05858P1617Q9007J4446n194J8316Q2237
$$ 225979 364545 306173 190290 207520 313378 384995 474002 488448 483254 501570 583807
18890E83807R4394o8471p6801R9L8634R223l1721r9285K5229P2666L4910J1585
$$ 583807 678201 609730 532929 533028 571662 580885 549164 449879 475108 547774 582684 594269
18878E94269r9186R5186R6543j06181r0650n1504R4126O8726j4991r8998m0403
$$ 594269 495083 590269 686812 580631 489981 438477 532603 601329 586338 487340 446937
18867D46937L9773M8788M0147j19325j16762R3370L5580L607p5128l2618O7884
$$ 446937 486710 535498 575645 456320 339558 432928 468508 472115 396987 364369 432253
18856D32253N9714N7003J03482j0095j11991O292K9587j01989O653j5531O6362
$$ 432253 491967 548970 652452 642357 530366 536658 566245 464256 470909 455378 521740
18845E21740P2020l8884Q084L2137J29890J31837m671n940N6287J01497j03541
$$ 521740 593760 554876 562960 595097 724987 856824 852153 846213 902500 1003997 900456
18834I00456Q0435J51025J11559J95740O5505R4135J49370J85505J87794J44770
$$ 900456 980891 1131916 1243475 1439215 1504720 1598855 1748225 1933730 2121524 2266294
18824B266294P2526o9087J64131L26217N38396L79044K64498K53211L24802L66555
$$ 2266294 2338820 2269733 2433864 2760081 3298477 3677521 3942019 4195230 4520032 4886587
18814D886587O01949Q29601Q84609R07297J158717J712317K723190M575184P601991
$$ 4886587 5488536 6318137 7202746 8110043 9268760 10981077 13704267 18279451 25881442
18805B5881442J1965133J6009358J3000834J941639k892666N039864J8620297
$$ 25881442 37846575 53855933 66856767 68798406 65905740 70945604 89565901
18798H9565901K6345849J0442005j7519566k3501344r008675N943013J3032105
$$ 89565901 115911750 126353755 108834189 85332845 76324170 82267183 95299288
18791I5299288R484187J971132n594885j1788872p474083O822466K2129739K3298741
$$ 95299288 104783475 106754607 101159722 89370850 81896767 88719233 110848972 134147713
18783A34147713k822973k8289740k4734459q532769K344725P83763j1271942j8137824
$$ 134147713 131324740 103035000 78300541 69767772 72112497 72896260 61624318 43486494
18775D3486494j4338538q675641n155631l116702j665494j010690q98078r38359
$$ 43486494 29147956 20472315 15316684 12199982 10534488 9523798 8625720 7687361
18767G687361o79958j48767m58478q07281p30840n49603m64766n17450l80137
$$ 7687361 7007403 6858636 6400158 5592877 4862037 4312434 3847668 3330218 2950081
18758B950081j68883j07660K0282k07895k91434k30843j36438j13265j82362j86164
$$ 2950081 2781198 2673538 2693820 2485925 2194491 1963648 1827210 1713945 1531583 1345419
18748A345419k08403j48159l1305o8000n6863j50437K4417N613M3405Q7851P5026
$$ 1345419 1137016 988857 957552 889552 832689 682252 706669 712282 755687 843538 918564
18737I18564J0854k074L4282J09298M6041p3825Q315q7079k5466j19853m5678
$$ 918564 929418 927344 961626 1070924 1116965 1043140 1051455 964376 938910 819057 773379
18726G73379j7102n7146q2234K190O5076J2192o1086O4818L3213j0802l8249m7148
$$ 773379 756277 699131 616897 619087 684163 696355 635269 700087 733300 722498 684249 637101
18714F37101k8689R7131J2672j47152j50340j2576J02977j3278k5879r5752o2647
$$ 637101 608412 705543 718215 571063 420723 408147 511124 497846 471967 376215 313568
18703C13568J6195r3057n90L7668J7646j55946m036P2670J1525P0569L705O68
$$ 313568 329763 236706 236116 273784 291430 135484 131448 204118 215643 286212 289917 290585
18691B90585P592P3139P679j66387m721q9365j2971Q7005k1881m9080O0927O4775
$$ 290585 298177 371316 378995 212608 207887 118522 105551 192556 170675 121595 182522 247297
18679B47297Q6942P6721k5882q4532J030Q2266j9204J7569J9538K553l6508R4943
$$ 247297 334239 410960 385078 300546 301576 383842 364638 382207 401745 404298 367790 462733
18667D62733l2685l8172J11666O8902q1510p1489K8630O2960j8587R0107j1042
$$ 462733 430048 391876 503542 572444 490934 419445 448075 511035 492448 582555 571513
18656E71513r3462N290o685r6839l5330l9849k2881p9419j12034K863J7678j0141
$$ 571513 478051 483341 476656 379817 344487 304638 281757 202338 90304 93167 110845 100704
18644A00704J38941J08484o8398k4383r59J1491K6147n6258p5865n5095R8442
$$ 100704 239645 348129 279731 255348 254389 265880 292027 235769 159904 104809 203251
18633B03251M950J12462N930N0055m1897l3780j43674p0049J4315q369R7590K8925
$$ 203251 208201 320663 326593 376648 334751 300971 157297 87248 101563 93194 190784 219709
18621B19709o3160k5455R535j4635j1152M9731J33380M6602n91r4682q4477L511
$$ 219709 156549 131094 140629 125994 114842 164573 297953 344555 343964 249282 164805 168316
18609A68316n2299l3441R7634M5224k5756q1682m1415K0003J47165K8083k4290
$$ 168316 116017 82576 180210 225434 199678 117996 76581 96584 243749 271832 247542
18598B47542m8643O522m2138P0642r793P4928j5273q005P934J5870r6329n1133
$$ 247542 198899 205421 163283 233925 224132 299060 283787 275782 283716 299586 203257 152124
18586A52124Q4300m0481o8727J3826j376P756l8105k6405m1828q078P1200N6557
$$ 152124 236424 195943 127216 141042 139666 147422 109317 82912 41084 33006 104206 160763
18574A60763J5025K4499k9019M301N2718L939L1157J13145Q455j21751p8625O64
$$ 160763 175788 200287 171268 175569 228287 232226 263383 376528 384983 263232 184607 185271
18562A85271l3940L5237P9969N5804J3503p171j34111k7838M8077J51857L6356
$$ 185271 151331 186568 266537 322341 335844 328673 194562 166724 214801 366658 403014
18551D03014j9171n3536j9882K5465j730J08163n178N9260K0988m8474K7585O2972
$$ 403014 383843 330307 310425 335890 334160 442323 437145 496405 517393 468919 496504 559476
18539E59476r6823p5482k6163O7149M4137M1326Q086o0938M284k1672l7405N2858
$$ 559476 462653 387171 361008 428157 472294 513620 521706 460768 465052 443380 405975 458833
18527D58833J04377J64930J04282o4280k9071J38678L3408q4211Q8927O3129J44653
$$ 458833 563210 728140 832422 768142 739071 877749 911157 826946 915873 979002 1123655
18516A123655L16520M03858L58498K12543n9749j25239k6069K18606M50524P03607
$$ 1123655 1440175 1844033 2202531 2415074 2355325 2230086 2204017 2422623 2873147 3576754
18506C576754Q56906M18932m52310n35406j81332L63212Q51572O64521P8535j36330
$$ 3576754 4433660 4852592 4400282 3864876 3683544 4046756 4898328 5562849 5641384 5505054
18496E505054k06300n125M34602Q58076J012741M11368k19567N8678N03454Q86758
$$ 5505054 5298754 5293629 5728231 6586307 7599048 8010416 7790849 7849527 8352981 9239739
18486I239739J821770K877647M090913O434082J0648066J5789792J4798440o79140
$$ 9239739 11061509 13939156 18030069 24464151 35112217 50902009 65700449 65021309
18478F5021309j2367840q430428o12282P046023J6714982K9173502L3754868L291172
$$ 65021309 52653469 44223041 43610759 50656782 67371764 96545266 130300134 133591306
18470A33591306k9552249k2306393k922566J0715602J1752061K126482J44438
$$ 133591306 104039057 81732664 78810098 89525700 101277761 103404243 103548681
18463A03548681m296235j3840854p962101Q132315K3067743J9392702j6872919
$$ 103548681 99252446 85411592 77449491 85581806 108649549 128042251 111169332
18456A11169332l5026586k2947271j0312413k561853L706122R210187Q630570
$$ 111169332 76142746 53195475 42883062 40321209 44027331 53237518 61868088
18449F1868088n408083j6715071j3691140p926923m662581l032655k031575j203453
$$ 61868088 56460005 39744934 26053794 18126871 13464290 10431635 8400060 7196607
18441G196607p11502o44578n60426n26169n40523m23105l97007l47528k11457
$$ 7196607 6485105 5840527 5280101 4753932 4213409 3790304 3393297 3045769 2834312
18432B834312m1564p2866l22893l44420k96862j35557k8925P360o9277j20197
$$ 2834312 2792748 2719882 2396989 2052569 1755707 1620150 1591225 1598585 1529308 1409111
18422A409111j57663j94220k53460j11819j0342M3839m1055o5143o0154q7029
$$ 1409111 1251448 1057228 803768 691949 681607 725446 684391 619248 559094 472065
18412D72065j26562L472N2911P0166K5976l3529j02865N4383K0687j1657j00444
$$ 472065 345503 348975 401886 472052 498028 464499 361634 416017 436704 425047 324603
18401C24603m2062Q9075J15670J4196k3873k171N0921j04009j72016K3497J18269
$$ 324603 282541 371616 487286 501482 477609 475438 526359 422350 250334 273831 392100
18390C92100l2122j44254L9189N6015j30353j55175O8138K5511N2575n406o2118
$$ 392100 359978 215724 254913 310928 180575 25400 93538 119049 171624 166218 104100
18379A04100l1554N789O5327R0816K7849j7103m3378j9714R3253K2772j8725N9410
$$ 104100 72546 78335 143662 234478 262327 245224 201846 182132 275385 298157 279432 338842
18367C38842r1595j8722o221j12866o6360M3310J80111N9657j3213L724P121k3739
$$ 338842 247247 228525 222304 109438 43078 86388 266499 326156 312943 316667 323788 300049
18355C00049j18436N4261O4015m7515r4711o8681K6059J40321J70271j677K0626
$$ 300049 181613 235874 299889 252374 157663 88982 115041 255362 425633 423956 444582
18344D44582O2257N0221r5668j50015K055j8035n0524m9887P4259k9950l7773
$$ 444582 506839 557060 461392 311377 313432 295397 244873 194986 269245 239295 201522
18333B01522K3052n1972k5740k8581N4360J07331J0364O1003j05498j78224R0809
$$ 201522 224574 172602 146862 118281 172641 279972 290336 351339 245841 67617 158426
18322A58426Q97j1877M5272o5755l6420P2105M1827n970r4304M7064l1933l0689
$$ 158426 159323 147446 192718 126963 90543 162648 204475 198505 104201 151265 119332 88643
18310H8643M4450O3162k0853m2881o7867J2889O3307k2187p9464l0862O2644R6351
$$ 88643 133093 196255 175402 132521 64654 77543 140850 118663 39199 8337 70981 167332
18298A67332N3185l2608q0570j3992m2072k4581q5439R489Q0080L3797n1080J5608
$$ 167332 220517 187909 107339 93347 51275 26694 -58745 -49256 30824 64621 13541 29149
18286B9149Q8957L7009p0343J04815j02530J9345R6633Q1523j2308j32762n2518
$$ 29149 118106 155115 84772 189587 87057 106402 203035 284558 272250 139488 86970
18275H6970m6041Q7822J00526J28044N6540m9192J41026J47490p2004l038O9706
$$ 86970 40929 128751 229277 357321 413861 364669 505695 653185 581181 578143 647849
18264F47849P7681r8702p1855K301j42999L4698J85979K0385j3326o503o9296
$$ 647849 725530 626828 554973 557274 414275 448973 634952 655337 642011 635508 566212
18253E66212r5368J820J38890N0528R4799N3418j71945j13080l2077J03117J30827
$$ 566212 470844 472664 611554 662082 756881 810299 638354 525274 493197 596314 727141
18242G27141N841k27573k30782j91096n5788j17346j17088J7219J67786J31368
$$ 727141 732982 505409 274627 83531 27743 -89603 -206691 -189472 -21686 109682
18232A09682K67l4682O6593J6128P3528K1105r0259r0483o2784M6015J8198J902
$$ 109682 109949 75267 141860 157988 231516 252621 162362 71879 9095 55110 73308 75210
18220G5210K2946P1349M1210o6076r8698L757P3233r9923r4488m6999R5670J40797
$$ 75210 98156 169505 210715 144639 45941 49698 122931 23008 -71480 -118479 -22809 117988
18208A17988K6809O8984K1315j186m9688n6449L1587l2693P063l0003L0661k4931
$$ 117988 144797 213781 235096 233910 184222 127773 159360 126667 133730 103727 134388 109457
18196A09457q3469j105M2590K3497m9008o0036J1993N9335M8140Q325j2846K0416
$$ 109457 25988 24883 67473 90970 41962 -18074 -6081 53254 101394 109719 96873 117289
18184A17289Q251m0323L1343n0253R3432J26194j2927n7444K273R531N9690l4072
$$ 117289 125540 85217 116560 66307 159739 285933 273006 215562 217835 227366 287056 252984
18172B52984m9392L9850J5702Q058j6783o7541l9059J44152J5866k9838Q5727
$$ 252984 203592 243442 259144 267202 250419 182878 143819 287971 303837 273999 359726
18161C59726R0748n4096n9962p8758L251N0261O8457R7082N2349l3545Q3618J9332
$$ 359726 450474 396378 336416 257658 260909 311170 379627 476709 529058 495513 579131 598463
18149E98463k711n962J1031O89P6374O2836r656o9543K6658K423K3849J48209
$$ 598463 595752 589790 600821 601510 677884 740720 731064 661521 688179 690602 714451 862660
18137H62660M3902m9836l8564P2098J53028K40199Q5627J94294K34670N8952J39755
$$ 862660 906562 856726 818162 890260 1043288 1283487 1369114 1563408 1798078 1857030 1996785
18126A996785K19392L28887L61233K73683K60392L83052N16468P28609J038097
$$ 1996785 2216177 2545064 2906297 3179980 3440372 3823424 4339892 5068501 6106598
18117F106598J575236K201826L088500M495929O754311J1173924K0250031L7568963
$$ 6106598 7681834 9883660 12972160 17468089 24222400 35396324 55646355 93215318
18109I3215318O6287532R4829555K0055153r8235649q3051458l9696473j9307441
$$ 93215318 159502850 254332405 274387558 176151909 93100451 53403978 34096537
18102C4096537j0708433o510841l863787k391737j638404j419380j340802r76948
$$ 34096537 23388104 16877263 13013476 10621739 8983335 7563955 6223153 5246205
18094E246205p21456o47074n58824l64544l67158l12922k51549j43586j82739
$$ 5246205 4524749 3877675 3318851 2954307 2587149 2274227 2022678 1879092 1696353
18085A696353r3005m6491j12922j41373l9655l9074J7575p3621k4555K1017M7837
$$ 1696353 1603348 1556857 1443935 1302562 1262907 1223833 1241408 1167787 1143232 1164249 1212086
18074A212086r7180r4903o1901J007J57950J30951J66523O7772O2588j5625M4480
$$ 1212086 1114906 1020003 958102 959109 1117059 1248010 1414533 1482305 1544893 1529268 1573748
18063A573748l4056J1176q6211k70965j10512L3144j8429j41574k38165o3498
$$ 1573748 1539692 1550868 1464657 1193692 1083180 1116324 1097895 956321 718156 654658
18053F54658k8879p7434n2621p6612k2188R553r5967j18612L2904K6769l0491
$$ 654658 625779 548345 495724 419112 396924 406477 310510 191898 224802 251571 221080
18042B21080L9527r056o6788m2928r4270Q6271J16508O5330J7948j17163j9501
$$ 221080 260607 251551 184763 141835 47565 133836 250344 315674 333622 216459 196958
18031A96958Q3430j3577o0969k9265R2046Q8723m9630m1224l5129K3079j37494
$$ 196958 280388 266811 205842 176577 268623 357346 307716 266492 231363 254442 116948
18020A16948j79689j8397m7111k3993O8081Q8121l2792n6463O6186m8938K0181
$$ 116948 -62741 -81138 -128249 -152242 -84161 3960 -28832 -85295 -19109 -68047 -47866
18009d7866L5251q8210P0719J44653J95248m8905m1779o4521q148j06256n2733
$$ -47866 -12615 -100825 -30106 114547 309795 260890 219111 154590 146442 40186 -12547
17998a2547Q5527P5354j0719M4425P7002j2770n6471n4593j2138R628L8131P6428
$$ -12547 72980 148334 137615 182040 259042 246272 189801 135208 123070 132698 170829 247257
17986B47257J07441n2337r4498L8222N0168J9789O7971J3636o0642j4878j58034
$$ 247257 354698 302361 207863 246085 296253 316042 384013 397649 337007 322129 164095
17975A64095j0122j72312o7847J35717R657J5333j7083M4415j39731l8016l7694
$$ 164095 153973 -18339 -86186 49531 59188 74521 57438 101853 -37878 -75894 -113588
17964a13588P0020K0052J10207k3357P6964K098N983j4336J56540R9620k7865
$$ -113588 -43568 -23516 86691 63334 140298 142396 148379 134043 290583 390203 362338
17953C62338j22296o2791O1630Q9348l1516r1847l6410K2808p8762J70637K23530
$$ 362338 240042 177251 238881 328229 296713 204866 168456 191264 112502 283139 506669
17942E06669J09810n75j26721j16903J28727L5569m5192O1376l902l8027k2032
$$ 506669 616479 615904 489183 372280 501007 536576 491384 552760 548858 510831 488799
17931D88799P8552R8703Q5338p6476k07222j51445L1001q7670r9491M0594L5997
$$ 488799 567351 666054 751392 674916 467694 316249 347250 259580 160089 200683 236680
17920B36680k750q7473l8454m1317j52887R127N9222O0672R18K4062n4620n8018
$$ 236680 233930 146457 108003 66686 -86201 -77074 -17852 42820 43738 67800 13180 -44838
17908d4838j59893j43887N8895J28254O0103j1326K9303R2072k2486R728R9606
$$ -44838 -204731 -348618 -289723 -161469 -101366 -112692 -83389 8683 -13803 -4075 95531
17897I5531O6103r4609o835O2600M2685K9642l4056j9707k3114J6648q5609n3494
$$ 95531 161634 67025 60190 122790 165475 195117 161061 141354 118240 134888 49279 -4215
17885d215J834m2847m7741K615J16555M7904p3141j14019L7901K901P3389Q8290
$$ -4215 -2381 -45228 -92969 -90354 26201 74105 964 -113055 -75154 -72253 1136 89426
17873H9426L0846l6538j11616m3154j4320j6167K4374J6023j7173K3031n1760
$$ 89426 120272 83734 -27882 -71036 -85356 -101523 -77149 -61126 -78299 -55268 -107028
17862a07028K95L7640K1866q2724n0644N3266P8170R870k0269Q7299N3633N7132
$$ -107028 -106733 -69093 -47227 -129951 -180595 -127329 -49159 -39289 -59558 27741 81374 138506
17850A38506J1705l6407k045J7108q5071p5209J5881r6433j4724M6623N1905n4594
$$ 138506 150211 113804 111759 128867 43796 -31413 -15532 -111965 -126689 -80066 -28161 -82755
17838h2755n8883K709J42820O1364J5125j34822j17557Q9105P5181q2614j14322
$$ -82755 -141638 -138929 3891 65255 80380 -54442 -171999 -82894 -7713 -90327 -204649
17827b04649K7029O2583l6930N9624K0233R4036k5618j02482K6467j53270o6311
$$ -204649 -177620 -115037 -151967 -92343 -72110 21926 -3692 -106174 -79707 -232977 -299288
17816b99288R7618j0920N3540Q5581J32567J25540j5798n1554p3249L7090k0603
$$ -299288 -201670 -212590 -159050 -73469 59098 184638 168840 117286 44037 81127 60524
17805F0524j38082j8614J49788Q3260M9039r5424q3850r693l814o6335q6831j12798
$$ 60524 -77558 -96172 53616 136876 185915 90491 6641 -3052 -6866 -73201 -160032 -272830
17793b72830N2233K7194k5945K9409Q7039k4520M0990J2110N0714O8213M9371
$$ -272830 -220597 -193403 -219348 -189939 -102900 -127420 -86430 -74320 -23606 44607 93978
17782I3978j17726k6845J7872K6404J11925j03959j11420m9574M4514n380R5462
$$ 93978 -23748 -50593 -32721 -6317 105608 1649 -109771 -159345 -114831 -120211 -24749
17771b4749k642j33217l0650K6940j989L2518J17898m8344R4001Q1652o6407n9283
$$ -24749 -27391 -160608 -191258 -164318 -166307 -133789 -15891 -64235 29766 111418 45011 -14272
17759a4272k3294k666J32109J28737L4113k00034J0294M421j3532j4635o8185
$$ -14272 -37566 -40232 91877 220614 254727 54693 64987 69408 55876 41241 -26944
17748b6944l3795J1704k8124o3835K0127k7569N8156k8678p8519l356n3343N5833
$$ -26944 -60739 -49035 -77159 -140994 -120867 -148436 -90280 -118958 -197477 -200833 -254176 -198343
17736a98343N6642K7960l6128q3022j4834Q516M2917q7119K7081R9817M4950j40526
$$ -198343 -141701 -113741 -149869 -232891 -247725 -239209 -196292 -283411 -256330 -156513 -111563 -252089
17724b52089j2791N8565J07953M3872L5868J4662L9346O8536l069q2349o4413
$$ -252089 -264880 -206315 -98362 -54490 -18622 -3960 35386 103922 100853 18504 -45909
17713d5909N2326k186L2857K3229N6679j9284r2665l1147j85l9841K410N074L245
$$ -45909 6417 4231 37088 60317 116996 97712 5047 -26100 -26285 -66126 -63716 -58642 -55397
17700e5397j7287m860K3245J06985J00388m3517q3485j0488j8287m1205L8679
$$ -55397 -72684 -77544 -54299 52686 153074 109557 26072 15584 -2703 -43908 -5229
17689e229j353n7172n7042O9525M7375N8955K8274k3497m6763Q5670m9826Q053
$$ -5229 -6582 -63754 -120796 -51271 -3896 55059 83333 59836 13073 98743 48917 56970
17677E6970r0920l6999l7541n24J06092J23120l961L8643l8154o9653M2351k1163
$$ 56970 -33950 -70949 -108490 -109014 -2922 120198 116237 154880 116726 47073 89424 68261
17665F8261j33691J8343J6640M6790l8942l0354l0999j10616R6238Q3490K9511
$$ 68261 -65430 -47087 -30447 16343 -22599 -52953 -83952 -194568 -98330 -14840 14671
17654A4671L5820P1347L8103j6163n0428q3022k0610o4504K2370J24886j25026
$$ 14671 50491 121838 159941 143778 93350 10328 -10282 -74786 -52416 72470 -52556
17643e2556j08913R9642p5678q6984J2143r0294Q9952m006P2841N5143M7238r8817
$$ -52556 -161469 -61827 -137505 -224489 -212346 -302640 -212688 -216694 -143853 -88710 -41472 -140289
17631a40289j13900m1074J31066P6543M0570J22800L9278O0622L7759m246p0373
$$ -140289 -254189 -295263 -164197 -87654 -47084 75716 114994 175616 213375 209129 138756
17620A38756l9578n4119j5346j7074M3377J2857o2368J0621m3225k2573J23170
$$ 138756 99178 45059 29713 12639 56016 68873 6505 17126 -26099 -48672 74498
17609G4498J59136n9400k7371j2644k2267m7782M6828r2836p9038L2960J25158
$$ 74498 233634 174234 146863 134219 111952 64170 110998 18162 -60876 -27916 97242
17598I7242R194j57627p6152J9336k8762k4513k1167P5850k0320o3350R9455J21817
$$ 97242 106436 -51191 -127343 -108007 -136769 -161282 -182449 -106599 -126919 -190269 -90814 31003
17586C1003K1154o2875j12517M431K9200J9467l1203O0111O4212N8433r259k8880
$$ 31003 52157 -10718 -123235 -118804 -89604 -70137 -101340 -41229 22983 81416 72157 43277
17574D3277j1432Q84l8040R1281l8096K9070O8328k3552K3584k4164l5898L5021
$$ 43277 31845 32729 -5311 85970 47874 76944 145272 121720 145304 121140 85242 120263
17562A20263l1723L106K8062j2397L4767j0948p1837r0710m6215M4252O3409j6323
$$ 120263 88540 91646 119708 107311 142078 131130 59293 -31417 -77632 -33380 30029 13706
17550A3706m5648j9549R9271Q5734j17528m6746o7616r0609J21325o765r0895
$$ 13706 -31942 -51491 47780 133514 15986 -30760 -98376 -188985 -67660 -74425 -165320
17539a65320l3108L5810J33699J44290Q6480P8531R5104m3919j06009j3395N8743
$$ -165320 -198428 -162618 -28919 115371 201851 280382 375486 331567 225558 212163 270906
17528B70906k8007m4310r8373k0966l4694k9579L8220k8642n3544j26859N087
$$ 270906 242899 198589 100216 79250 44556 14977 53197 24555 -28989 -155848 -150761
17517a50761N3358M3059l0771l1467R9708N5921p9647j06934k8040n0826K8332
$$ -150761 -97403 -54344 -85115 -116582 -16874 39047 -40600 -147534 -175574 -226400 -198068
17506a98068J42563J31512r0912o6173P4002P3992l3046n3449n6815k2716J15776
$$ -198068 -55505 76007 -14905 -81078 -7076 66916 33870 -19579 -76394 -99110 16666
17495A6666r504l9219j726k5477K6690M7702n7685J0950P7568N6429K8419N4291
$$ 16666 7162 -32057 -33783 -59260 -32570 15132 -42553 -31603 45965 102394 130813 185104
17483A85104k0336k4024O504O5719M7114m4416l1826M957j7027j1257j36867n2983
$$ 185104 164768 140744 147248 212967 260081 215665 183839 188796 171769 160512 23645 -29338
17471b9338r2837j08315k092o901j4397J8126O5966O1838l1850k2822k9486j5626
$$ -29338 -122175 -230490 -232582 -239483 -253880 -235754 -169788 -107950 -139800 -162622 -192108 -207734
17459b07734J12194J12955l8056n8654K1846N801N516q9208K10Q4203K025M3532
$$ -207734 -95540 17415 -20641 -79295 -57449 -51648 -46132 -135340 -135130 -50927 -48902 -5370
17447e370M8398M7833J26953J91737L22409M04833J88927m67747m17282j31731
$$ -5370 43028 90861 217814 409551 731960 1136793 1325720 857973 440691 308960
17437C08960n6582r9130M2092k5082k8796P551l841O349j948l724o9691n9828
$$ 308960 252378 153248 195340 170258 141462 149013 145172 151521 149573 145849 76158 16330
17425A6330K9301P1691k1247l1921j263k2792K4721L3915N0537K6450p1927q0928
$$ 16330 45631 117322 96075 64154 62891 40099 64820 98735 149272 175722 103795 22867
17413B2867q4432l7228J1121K9435O0344k2983L9810Q3406K0448l6345k5853l6925
$$ 22867 -61565 -98793 -87672 -58237 2107 -20876 18934 102340 122788 86443 60590 23665
17401B3665k513l3343r0889p8889J4948N2326R1695L7218P879m9757n5038O1810
$$ 23665 21152 -12191 -103080 -181969 -167021 -114695 -23000 14218 22097 -27660 -82698 -20888
17389b0888J33628o1967j03195O509p461K269Q5858Q0280p0952q7477K5978j8018
$$ -20888 112740 50773 -52422 -45913 -53374 -51105 34753 115033 44081 -43396 -17418 -35436
17377c5436p4599l2186j4649n259n8414k8569P5538J67521J5100j2759J051J14891
$$ -35436 -110035 -142221 -156870 -162129 -220543 -249112 -173574 -6053 9047 -3712 -2661 112230
17365A12230O8152j07195p1010j449K6021k6986p4194k1853Q4263r831j53495
$$ 112230 180382 73187 2177 728 26749 -237 -74431 -96284 -12021 -21852 -175347
17354a75347l5707J33415L9298M2689k9247j2470k1346n7607r0230p0448M7941
$$ -175347 -211054 -77639 -38341 4348 -24899 -37369 -58715 -116322 -206552 -277000 -229059
17343b29059K4260O9158K28651L3316q0141j38876o6195J18410N9769N440K5086
$$ -229059 -204799 -135641 93010 126326 46185 -92691 -158886 -40476 19293 24733 49819
17332D9819M1672M2528r9037L8344m662N1104K3249j902j36084r1160Q5189L0730
$$ 49819 91491 134019 34982 73326 68664 119768 143017 141115 5031 -86129 -940 29790
17320B9790o7801j9049R4883n6244K9313L1877j6545o6540n8454m066J221n0907
$$ 29790 -38011 -57060 37823 -18421 10892 42769 26224 -40316 -98770 -102836 -101615 -152522
17308a52522n5614L6780N7649R748O1271J06214J41745J1597n1630l5521j15131
$$ -152522 -208136 -171356 -113707 -103959 -42688 63526 205271 216868 165238 129717 14586
17297A4586J0652L4645k7340l3366O4270O3631P498q3667p2552N103O2129p7682
$$ 14586 25238 59883 32543 -823 63447 127078 134576 50909 -21643 -16540 45589 -32093
17285c2093K242Q3736R223p3264l2922m2251m5471p0821L9706J9224M705O077
$$ -32093 -29851 53885 63108 -10156 -43078 -85329 -130800 -201621 -161915 -142691 -137986 -131909
17273a31909L9373N3282O3888M3909q956k7609l1764j1373k6897m3390q9073J5502
$$ -131909 -92536 -39254 24634 68543 59587 31978 214 -11159 -38056 -81446 -170519 -155017
17261a55017k0320j9781L7461K6823k3760K6695j9576m7247K0280L10L5667K0099
$$ -155017 -175337 -195118 -157657 -130834 -154594 -127899 -147475 -194722 -174442 -174132 -138465 -118366
17249a18366k7999k1802N0420m4078R9280R055o4057J5008Q0825o0160J184R765
$$ -118366 -146365 -168167 -117747 -161825 -62545 -53490 -117547 -102539 -21714 -81874 -80690 -70925
17237g0925k7601N8843J337m4325Q3803k7285p4292k2410N7669K4101l1998j17146
$$ -70925 -98526 -39683 -38346 -82671 1132 -26153 -100445 -122855 -65186 -41085 -73083 -190229
17225a90229j8763m726p9232P0311J95634Q95K2247n8126o8902J3581k9199K9459
$$ -190229 -208992 -213718 -292950 -222639 -27005 -26110 -3863 -61989 -130891 -117310 -146509 -117050
17213a17050J32665J7510j643L566p3516n4286p4123L5059J72971P8823N054j19488
$$ -117050 15615 33125 31482 35048 -38468 -92754 -166877 -131818 41153 119976 125030 5542
17201E542L5593n9140k3080K6531R0372j0465l2732q2889j5697J36066O1712k9350
$$ 5542 41135 -18005 -41085 -14554 75818 65353 32621 -50268 -65965 70101 131813 102463
17189A02463o1787m3090o6449N3912p8798r4058J22500L8850L8512L1787q7009
$$ 102463 40676 -2414 -68863 -14951 -93749 -187807 -65307 -26457 12055 43842 -43167
$$ [...]
##END NTUPLES=NMR SPECTRUM
##END=
