##TITLE=Analysis number 328805
Compound Code mo 07276
Project Code adrs
Chemist Name fudan
##JCAMPDX= 6.0         $$ Bruker NMR JCAMP-DX V2.0
##DATA TYPE= NMR SPECTRUM
##DATA CLASS= NTUPLES
##ORIGIN= Bruker BioSpin GmbH
##OWNER= nmr
$$ XWIN-NMR		Version 3.5
$$ Thu Jul  5 09:09:41 2007 GMT Daylight Time (UT+1h)  MAYBRIDGE\nmr@NMR_250MHZ
##.OBSERVE FREQUENCY= 250.131544655141
##.OBSERVE NUCLEUS= ^1H
##.ACQUISITION MODE= SIMULTANEOUS (DQD)
##.ACQUISITION SCHEME= undefined
##.AVERAGES= 16
##.DIGITISER RES= 18
##SPECTROMETER/DATA SYSTEM= dpx250
##.PULSE SEQUENCE= zg30
##.SOLVENT NAME= DMSO
##.SHIFT REFERENCE= (INTERNAL, DMSO, 0, 16.5689)
##AUDIT TRAIL= $$ (NUMBER, WHEN, WHO, WHERE, WHAT)
$$ ##TITLE= Audit trail, XWIN-NMR		Version 3.5
$$ ##JCAMPDX= 5.01
$$ ##ORIGIN= Bruker BioSpin GmbH
$$ ##OWNER= nmr
$$ C:\u/data/dgb/nmr/ADRS/430/pdata/1/auditp.txt
$$ ##AUDIT TRAIL=  $$ (NUMBER, WHEN, WHO, WHERE, WHAT)
(   1,<2007-07-05 09:09:19.83 +100>,<MAYBRIDGE\nmr>,<NMR_250MHZ>,
      <created by zg, POWCHK disabled, PULCHK disabled
       configuration hash MD5:
       76 6E 9A 78 1E 09 19 81 EC 84 63 8F B0 6A 59 2D
       data hash MD5: 64K
       28 B5 61 1D 95 F5 DC E1 2A 23 5D BF 1F E0 47 34>)
(   2,<2007-07-05 09:09:32.37 +100>,<MAYBRIDGE\nmr>,<NMR_250MHZ>,
      <Start of raw data processing
       ef LB = 0.3 FT_mod = 6 PKNL = 1 SI = 32K 
       data hash MD5: 32K
       EF 58 27 07 36 D5 54 5C 11 ED 49 52 9E 9B 9C 30>)
(   3,<2007-07-05 09:09:34.08 +100>,<MAYBRIDGE\nmr>,<NMR_250MHZ>,
      <apk 
       data hash MD5: 32K
       C0 2F 43 C3 D2 B2 78 61 60 E0 EE 5E E8 56 F6 54>)
(   4,<2007-07-05 09:09:34.82 +100>,<MAYBRIDGE\nmr>,<NMR_250MHZ>,
      <abs ABSG = 5 
       data hash MD5: 32K
       AC 45 18 B5 48 AD AA 6F 06 FB 51 9A 1C 2B 6B 40>)
$$ ##END=
$$ 
$$ hash MD5
$$ 12 12 AE 56 3F 39 00 44 E1 B3 81 54 B0 63 EE 3A
##$RELAX= 
##$RELAX= 
##$RELAX= 
##$RELAX= 
##$RELAX= 
##$RELAX= 
##$RELAX= 
$$ Bruker specific parameters
$$ --------------------------
##$DU= <C:\u>
##$EXPNO= 430
##$NAME= <ADRS>
##$PROCNO= 1
##$TYPE= <nmr>
##$USER= <dgb>
##$AMP= (0..31)
100 100 100 100 100 100 100 100 100 100 100 100 100 100 100 100 100 100 
100 100 100 100 100 100 100 100 100 100 100 100 100 100 
##$AQSEQ= 0
##$AQ_mod= 3
##$AUNM= <au_zg>
##$AUTOPOS= <3 >
##$BF1= 250.13
##$BF2= 250.13
##$BF3= 250.13
##$BF4= 250.13
##$BF5= 500.13
##$BF6= 500.13
##$BF7= 500.13
##$BF8= 500.13
##$BYTORDA= 1
##$CFDGTYP= 0
##$CFRGTYP= 5
##$CHEMSTR= <none>
##$CNST= (0..31)
1 1 145 1 1 1 1 1 1 1 1 1 1 1 1 1 1 1 1 1 1 1 1 1 1 1 1 1 1 1 1 1 
##$CPDPRG= <>
##$CPDPRG1= <>
##$CPDPRG2= <>
##$CPDPRG3= <>
##$CPDPRG4= <mlev>
##$CPDPRG5= <mlev>
##$CPDPRG6= <mlev>
##$CPDPRG7= <mlev>
##$CPDPRG8= <mlev>
##$CPDPRGB= <>
##$CPDPRGT= <>
##$D= (0..31)
0 1 0 0 0 0 0 0 0 0.06 0 0 0 0 0 0 0.0002 0 0 0 0 0 0 0 0 0 0 0 0 0 0 
0 
##$DATE= 1183622958
##$DBL= (0..7)
120 120 120 120 120 120 120 120 
##$DBP= (0..7)
150 150 150 150 150 150 150 150 
##$DBP07= 0
##$DBPNAM0= <>
##$DBPNAM1= <>
##$DBPNAM2= <>
##$DBPNAM3= <>
$$ [...]
##$SUBNAM7= <"">
##$SUBNAM8= <"">
##$SUBNAM9= <"">
##$SW= 20.6930455092707
##$SWIBOX= (0..15)
0 0 3 0 0 0 0 0 0 0 0 0 0 0 0 0 
##$SW_h= 5175.983436853
##$TD= 65536
##$TD0= 1
##$TE= 297.16
##$TE2= 300
##$TE3= 300
##$TEG= 300
##$TL= (0..7)
0 120 120 120 120 120 120 120 
##$TP= (0..7)
150 150 150 150 150 150 150 150 
##$TP07= 0
##$TPNAME0= <>
##$TPNAME1= <>
##$TPNAME2= <>
##$TPNAME3= <>
##$TPNAME4= <>
##$TPNAME5= <>
##$TPNAME6= <>
##$TPNAME7= <>
##$TPOAL= (0..7)
0.5 0.5 0.5 0.5 0.5 0.5 0.5 0.5 
##$TPOFFS= (0..7)
0 0 0 0 0 0 0 0 
##$TUNHIN= 0
##$TUNHOUT= 0
##$TUNXOUT= 0
##$USERA1= <user>
##$USERA2= <user>
##$USERA3= <user>
##$USERA4= <user>
##$USERA5= <user>
##$V9= 5
##$VALIST= <valist>
##$VCLIST= <CCCCCCCCCCCCCCC>
##$VD= 0
##$VDLIST= <DDDDDDDDDDDDDDD>
##$VPLIST= <PPPPPPPPPPPPPPP>
##$VTLIST= <TTTTTTTTTTTTTTT>
##$WBST= 1024
##$WBSW= 4
##$XGAIN= (0..3)
0 0 0 0 
##$XL= 0
##$YL= 0
##$YMAX_a= 251034
##$YMIN_a= -180386
##$ZGOPTNS= <>
##$ZL1= 120
##$ZL2= 120
##$ZL3= 120
##$ZL4= 120
##$ABSF1= 16.56892
##$ABSF2= -4.124254
##$ABSG= 5
##$ABSL= 3
##$ALPHA= 0
##$AQORDER= 0
##$ASSFAC= 0
##$ASSFACI= 0
##$ASSFACX= 0
##$ASSWID= 0
##$AUNMP= <proc_1d>
##$AZFE= 0.1
##$AZFW= 0.1
##$BCFW= 0
##$BC_mod= 0
##$BYTORDP= 0
##$COROFFS= 0
##$CY= 12.5
##$DATMOD= 1
##$DC= 0
##$DFILT= <>
##$DTYPP= 0
##$F1P= 14.0000005364418
##$F2P= -0.99999901652339
##$FCOR= 0.5
##$FTSIZE= 32768
##$FT_mod= 6
##$GAMMA= 0
##$GB= 0
##$INTBC= 1
##$INTSCL= 1
##$ISEN= 128
##$LB= 0.3
##$LEV0= 0
##$LPBIN= 0
##$MAXI= 10000
##$MC2= 0
##$MEAN= 0
##$ME_mod= 0
##$MI= 0
##$NCOEF= 0
##$NC_proc= -4
##$NLEV= 6
##$NOISF1= 0
##$NOISF2= 0
##$NSP= 0
##$NTH_PI= 0
##$NZP= 0
##$OFFSET= 16.56892
##$PC= 1
##$PHC0= -57.25702
##$PHC1= -3.90518
##$PH_mod= 1
##$PKNL= yes
##$PPARMOD= 0
##$PSCAL= 4
##$PSIGN= 0
##$REVERSE= no
##$SF= 250.129988263602
##$SI= 32768
##$SIGF1= 0
##$SIGF2= 0
##$SINO= 400
##$SIOLD= 32768
##$SREGLST= <1H.DMSO>
##$SSB= 0
##$STSI= 32768
##$STSR= 0
##$SW_p= 5175.98343685301
##$SYMM= 0
##$S_DEV= 0
##$TDeff= 65536
##$TDoff= 0
##$TI= <Analysis number 999999
Compound Code 99
Book Reference 9
Project Code 9>
##$TILT= no
##$TM1= 0
##$TM2= 0
##$TOPLEV= 0
##$USERP1= <user>
##$USERP2= <user>
##$USERP3= <user>
##$USERP4= <user>
##$USERP5= <user>
##$WDW= 1
##$XDIM= 32768
##$YMAX_p= 485270874
##$YMIN_p= -343234
$$ End of Bruker specific parameters
$$ ---------------------------------
##NTUPLES= NMR SPECTRUM
##VAR_NAME=  FREQUENCY,     SPECTRUM/REAL,   SPECTRUM/IMAG
##SYMBOL=    X,             R,               I
##VAR_TYPE=  INDEPENDENT,   DEPENDENT,       DEPENDENT
##VAR_FORM=  AFFN,          ASDF,            ASDF
##VAR_DIM=   32768,         32768,           32768
##UNITS=     HZ,            ARBITRARY UNITS, ARBITRARY UNITS
##FACTOR=    0.157963299565203, 1,           1
##FIRST=     4144.38379903269, 0,            0
##LAST=      -1031.59963782032, 0,           0
##MIN=       -1031.59963782032, -343234,     0
##MAX=       4144.38379903269, 485270874,    0
$$ Real data points
##PAGE= N=1
##DATA TABLE= (X++(R..R)), XYDATA
$$ [...]
22373 -56454 -12514 32077 67455 60863 34654 37290 -33125 27904 77566 34778 26941 87986
22361 87986 64016 7851 29969 -27873 -19717 36025 51152 4107 -21139 -33151 12185 -4301
22349 -4301 -26792 -62591 -116656 -104663 -37513 -12961 -15701 -96414 -126568 -59396 -44974 -24394
22337 -24394 -532 -218 4049 -15283 -50498 -1674 -2867 -7932 -49675 -48693 -52934 -19390 16607
22324 16607 10153 -18395 -54929 -42324 -51196 -42094 -55204 -88606 -109554 -137484 -168529 -208602
22312 -208602 -203376 -125021 -85623 -46106 -36335 -5991 -63467 -131220 -111782 -109981 -97580 -42932
22300 -42932 -55463 -135276 -119397 -75999 -30144 22089 10660 -41359 -120941 -115527 -47612 -14622
22288 -14622 -9905 14028 9741 29312 25476 9319 -13929 -32190 -27568 -43261 -35310 -26571 -70353
22275 -70353 -133520 -121010 -27078 972 -33680 -83097 -55504 37563 32656 17204 15359 62921
22263 62921 73575 35968 43765 29656 37848 70257 102352 69491 43982 34329 -10925 -10605 -23460
22250 -23460 -100024 -98945 -120544 -70894 -12523 15900 8473 29178 104188 87112 -4012 -36363
22238 -36363 -39844 -40146 2816 14328 44917 72408 25698 -40029 -32316 43874 75526 39698
22226 39698 -32686 -17731 -21979 -72302 -22241 -19841 -5352 100591 86943 67042 50399 80807
22214 80807 25627 -36074 -43414 -11539 41340 107331 22307 -18146 39168 71213 49929 81717
22202 81717 48220 31260 16653 50080 62947 -21065 -61124 18376 -25005 -14282 -37316 10188
22190 10188 89288 50189 11882 53418 68411 -38578 -110319 -166487 -133422 -99123 -47758
22179 -47758 -18746 -19499 -69311 -46640 -103302 -75604 -45594 -81780 -46234 -32737 -62917 -59010
22167 -59010 -59138 -49884 -81456 -121043 -174880 -128754 -67825 -17622 32392 90788 96212 12366
22155 12366 62112 16586 -71846 -126282 -173823 -193751 -133082 -74372 -40593 -62610 -41681 -83918
22143 -83918 -105478 -92411 -28946 -37410 -119229 -153765 -125623 -124554 -122596 -114158 -115844 -121799 -104634
22130 -104634 -69194 -75096 -83589 -23428 4725 5895 29406 -18209 -38678 -50582 -32189 6256
22118 6256 -5065 41783 93258 110087 146970 117997 92277 38681 -54000 -78930 -106263 -123637
22106 -123637 -94483 -69318 -109984 -137259 -149425 -109646 -29849 -22893 -43676 -39831 -25274 -15224
22094 -15224 -22582 -16026 4894 16857 -6884 40616 43079 -32196 -40668 -71399 -42683 36470
22082 36470 62840 53268 19514 -22476 -37802 -754 37701 44301 68506 66476 2275 7033
22070 7033 -6107 20622 -1731 -46718 -48717 -20755 -22663 -69801 -39247 -15266 -49797 -42975
22058 -42975 -30227 -24020 -33503 -63698 -72288 -39857 -34963 6632 62355 89648 37035 22503
22046 22503 61228 9156 -74751 -52679 -3817 -25730 -59651 -27754 17612 44649 90586 42211
22034 42211 35587 5177 6417 64765 104778 63251 20556 59858 72067 2682 -58562 -92353
22022 -92353 -61118 -75023 -36409 -57883 -128807 -113872 -52738 -62372 -11495 23443 17935 30168
22010 30168 95835 50143 -4002 469 -19703 -49903 -101924 -56097 -105041 -122639 -76043 -16001
21998 -16001 -53175 -70183 -680 -36436 -60216 -65009 -98498 -88165 -123599 -136936 -94911 -104073
21986 -104073 -178834 -125742 -53695 -57571 -15011 -5174 -21048 -37137 -67068 -115591 -96000 -82628
21974 -82628 -29254 29157 -5311 -51657 -51447 -87400 -123268 -182543 -248726 -224976 -163470 -105551
21962 -105551 -77390 -7115 58534 -18865 -33089 7260 -22582 -64365 -112375 -131817 -133167 -116365
21950 -116365 -125501 -127961 -92494 -60899 -10161 25172 801 -13681 13049 21896 109171 139849
21938 139849 84250 34604 21275 17855 14084 6641 -14147 -36824 -24077 -11043 -78651 -86608
21926 -86608 -25090 -29749 14959 37893 3427 -29787 -898 14511 26919 -45174 -100614 -71475
21914 -71475 -75953 -102939 -89749 -69884 -107381 -132688 -113605 -109391 -84342 -93145 -100295 -81804
21902 -81804 -80139 -91200 -70857 -49834 13523 11035 -30396 -110339 -146270 -112873 -86385 -99325
21890 -99325 -85215 -62179 4978 73054 79037 88979 72532 24614 21988 6370 17489 10997
21878 10997 -79039 -137221 -178851 -128703 -103989 -69882 40344 81369 21346 2947 -4086 29706
21866 29706 26640 47560 27617 -73562 -90403 -47223 -57251 -52845 -139199 -121967 -140727 -134430
21854 -134430 -125553 -163305 -147123 -130899 -83829 -14530 -4166 -83438 -55707 -51005 -63361 -38922
21842 -38922 26761 8332 -13662 -68173 -90521 -104482 -90712 -52958 -50794 -34982 -51928 -126186
21830 -126186 -170159 -82485 -57933 -108778 -90805 -65212 20870 -5530 -110125 -106231 -48543
21819 -48543 -62189 -69231 -24317 15879 41545 -9769 -22394 -16273 -50585 -48322 -89159 -136222
21807 -136222 -131727 -78894 -82146 -81403 -135515 -123833 -96467 -35340 28956 -28131 -88413 -55930
21795 -55930 -47553 -62814 -94475 -122791 -92378 -52215 -72585 -87428 -71639 770 13459 -38288
21783 -38288 -19048 37938 -8040 11790 58657 81623 51206 9312 -33915 -16327 -4257 -9550
21771 -9550 7275 -76864 -148220 -35894 28676 21247 -17559 -113450 -102540 -102297 -108559 -133411
21759 -133411 -137040 -86495 -69018 -61389 -54691 -147014 -157063 -94485 -82362 -134551 -80721 -25888
21747 -25888 -11422 72896 122515 81272 20037 -25247 -46410 -47864 516 -14402 6244 2774
21735 2774 -27785 11573 -2190 13173 -19302 -12256 -28559 -86819 -73404 -38173 -7563 -7639 -1915
21722 -1915 -33499 13728 72379 82234 52912 64425 113673 62414 -5680 -44650 -59425 -33024
21710 -33024 35072 67759 52390 32572 29122 59615 60980 29531 -11938 3518 13556 -77492
21698 -77492 -87235 -24224 -21234 20016 -31197 -23365 2626 -59785 -76958 -107401 -150431 -97096
21686 -97096 -115793 -104885 -131270 -92848 -98173 -174336 -165389 -114961 -29438 19040 59562 83745
21674 83745 19127 -61163 -124499 -142915 -112704 -67082 -71510 -74357 -67102 -83673 -66582 -33250
21662 -33250 27723 -1079 -120839 -83842 -66202 -143805 -150428 -114708 -104265 -121482 -145340 -86918
21650 -86918 -14982 -36919 -92459 -63506 -18931 23193 8297 45489 1000 -49649 -24125 -4465
21638 -4465 36922 23104 12482 -47659 -100133 -67123 -62601 -47330 -52009 -49090 -49655 -110932 -121100
21625 -121100 -97363 -29694 -13403 12827 -1194 -12657 44451 82784 -12523 -68487 -65246 -64693
21613 -64693 -109789 -136658 -97197 -53599 -61503 38124 2573 -4627 -63921 -85562 -43684 -5933
21601 -5933 -59450 -172318 -266096 -160006 -53404 -92962 -9800 30314 31502 132869 122145
21590 122145 28801 -6300 -11934 -2022 427 48864 52227 -862 -83232 -85729 -103522 -56629
21578 -56629 -15850 -2997 22188 -1080 -29487 -23815 -15674 -52430 -78812 -124363 -111979 -64950
21566 -64950 -83921 -120185 -91124 -85546 -52286 -41073 -65186 -74164 -50183 -82204 -90638 -29298
21554 -29298 -44579 -42582 -89291 -117585 -33761 13203 -24053 15346 -5636 -16463 -22642 -1004
21542 -1004 51910 32939 27392 25405 30579 22962 -42136 -32303 -72333 -134754 -92833 -71423 -37092
21529 -37092 -99651 -85447 5367 31413 22727 -31152 -136173 -94439 -64306 -67313 -35756 -25487
21517 -25487 -12249 -36912 -28435 7120 -53496 -69730 -59687 -46363 -89118 -119287 -129209 -109317
21505 -109317 -89005 -52953 -36969 -16071 -27473 -45538 -38129 -67563 -62180 -50154 -69735 -153192
21493 -153192 -225740 -144630 -56146 -86711 -64491 -28316 -67367 -52026 -11464 2383 -21439
21482 -21439 -68747 -65868 -99319 -2555 21296 35649 7137 -65330 -111160 -86149 -117746 -159406
21470 -159406 -131771 -70105 -29108 62926 28388 -5534 8893 -24729 -47790 -10728 -8150 38405
21458 38405 33724 -2742 -26752 -35752 -33617 49365 28632 13085 17560 45329 86638 40003
21446 40003 -97965 -70717 -71254 -78543 -23584 -13527 -22790 -31307 -68881 -96576 -57228 -74039
21434 -74039 -75545 -103102 -114078 -102156 -81280 -136974 -108498 -57157 -50375 -84072 -148211 -61526
21422 -61526 58009 92751 77305 -16161 -18113 -5362 -53468 -31938 -82104 -81943 -4821 1609
21410 1609 -3989 -32519 -58370 -52194 -52505 17922 -14688 -42180 -8554 -19767 -43189 -82530 -96376
21397 -96376 -48747 -2290 -81885 -171742 -195215 -164494 -100449 -61813 -37047 18868 -12409 -65859
21385 -65859 -84663 -42756 -39706 -82690 -76565 -73011 -65697 -79528 -42704 8795 -29261 -50017
21373 -50017 -45423 -43240 -81859 -78372 -64740 -41751 26200 62790 107136 136123 113333 49894
21361 49894 -35702 -65755 -49536 -21381 -69758 -96962 -86097 -85675 -66900 -117643 -122195 -93638
21349 -93638 -124110 -150885 -187948 -153031 -86697 -31120 -72466 -129197 -99524 -51774 -105779 -143957
21337 -143957 -62732 -44183 -58958 -78337 -8535 23342 34374 -17146 -27821 30298 13684
21326 13684 17677 -41800 -13780 -9662 18399 -31998 -29596 2884 19668 -1962 -49312 -120664
21314 -120664 -160981 -91278 -75560 -67471 -97966 -52081 -32593 1858 10553 -20675 3093 -152
21302 -152 8402 -24899 -69812 -98644 -57734 40443 69026 26549 60269 9539 -45592 -48726
21290 -48726 -35911 -52672 -40459 -27413 -69721 -87115 -76131 -2922 -3555 3713 -25916 -54976
21278 -54976 -33089 -29500 3552 11754 3936 60239 8557 -15022 -50199 -59829 -3846 -13920
21266 -13920 -44601 -4026 -20341 -18666 4966 -19527 -1140 -46213 -64535 -75989 -38817 12075
21254 12075 22198 -8826 -96612 -124270 -65814 -46842 -93836 -100160 -122663 -90634 42178 32021
21242 32021 -4515 50702 19658 -36344 -53722 -13299 5848 6938 10762 32666 -20821 -7904
21230 -7904 21566 9736 -10115 36813 23378 22137 -9684 -23374 -19366 -33844 -27534 -50162
21218 -50162 -13804 -32034 -7785 -79 -30038 -17923 -12855 -20175 -11025 -10540 -100225 -66999 61994
21205 61994 67221 33670 -119092 -195137 -175125 -127084 -108061 -80537 -120876 -88972 -91010 -106303
21193 -106303 -93828 11635 62541 10193 -55773 -58549 -22090 -15695 -5608 13845 -48259 -59651
21181 -59651 -48880 -42983 16452 60061 64946 95970 70816 59485 64263 42485 -26800 -68914
21169 -68914 -43214 21131 39876 19915 -33552 -45489 -48004 -62998 -7122 28648 50006 44554
21157 44554 60270 33938 -60429 -112631 3167 19358 986 -3479 51504 51950 14488 -10690
21145 -10690 -28762 -48979 -124230 -183347 -156699 -115585 -83486 -84080 -16678 20809 47994 34027
21133 34027 -71217 -55697 -32272 -28685 -22641 -58237 -133494 -118049 -38140 35653 43472 24655
21121 24655 -68026 -91364 -89533 -38439 6531 47409 28730 13265 3850 -2574 -15716 -10262
21109 -10262 -7310 -10668 -13420 -25122 35383 92261 116428 61874 -14164 -99293 -107852 -68798
21097 -68798 -13800 37899 -10054 -20869 -61382 -107198 -133470 -117213 -97836 -35725 17936 39276
21085 39276 22541 3838 3898 5753 -53690 -75223 -24264 -4772 26008 34740 63739 64414 -1083
21072 -1083 -9995 35750 70169 51749 36405 -36296 -78624 -97202 -97140 22359 61030 38035
21060 38035 48966 49841 17115 -12863 -43200 -47837 -16243 -54528 -18879 22428 3811 -21011
21048 -21011 -70190 15010 7339 -9122 -13636 48295 81957 57813 26832 33962 62497 55074
21036 55074 500 -35056 -63311 -75051 -65517 -106839 -136235 -74520 -49440 -43836 -23217 61010
21024 61010 106715 89869 70320 115635 42386 -11104 -91052 -141633 -91343 -63513 -32960 -38935
21012 -38935 27270 37971 5453 -26747 4415 -6554 -34782 -79547 -111857 -89842 -47434 16602
21000 16602 -22730 -77754 -120308 -140287 -111178 -95520 -62103 -88210 -70897 -18760 23223 34270
20988 34270 68104 94392 15380 8836 13041 -21653 -31851 15141 44818 79525 125909 121821
20976 121821 66354 31033 -2124 12087 -3692 64092 65922 85067 72889 128648 168197 162225
20964 162225 107725 15239 -47841 -38511 53704 93912 62327 56844 68023 131211 122148 53830
20952 53830 21946 37722 19036 -2959 -13406 -16263 35240 13847 9835 29333 54043 67823
20940 67823 41641 -5800 29647 81174 120457 81827 -7565 -27677 -29126 -31819 4053 16092
20928 16092 42506 22367 -13689 -19644 40716 31055 -56766 -54172 -12159 12037 -29778 -43325
20916 -43325 -6221 54228 30533 11605 -27231 -82249 -95834 -69029 -129900 -95982 -28314 -39838
20904 -39838 -33619 -75707 -108650 -125921 -123215 -109144 -60501 -52775 -90042 -101362 -65157 -36519
20892 -36519 -21588 -30884 -62207 -93939 -80872 -53395 -53819 7441 -20321 -31850 18095 17722 39354
20879 39354 -20387 -62430 -84155 -113176 -114523 -82821 -114068 -91269 -39670 10393 -37467 -66904
20867 -66904 -32339 -8835 -23258 -42939 -16708 -99 -12235 -2184 42159 28078 15803 10703
20855 10703 44242 106680 76487 1563 -54398 -54753 -78770 -95577 -136064 -83737 -57109 -23130
20843 -23130 12444 -33136 -47283 -47133 -43390 -27585 -3504 -41705 -51594 -58557 -71603 -53451 24494
20830 24494 -3566 15878 -7539 23709 87141 29036 -33138 36758 18323 22789 -16843 -30334
20818 -30334 -72043 -78370 -21269 32006 16351 -33897 -91308 -110144 -93789 -56587 -11889 5080
20806 5080 -28178 56569 88058 36410 -34924 -32414 31600 131459 128107 137088 111574 117585 150883
20793 150883 91552 59231 32667 66877 98172 6902 -19326 -16700 56914 86011 92358 64902
20781 64902 19098 11282 -11977 -21015 37574 23464 -1561 13404 -43846 -31139 -7836 -17161
20769 -17161 -50934 -8064 -21699 -101738 -123568 -77668 -54809 43045 87123 100284 60713 36420
20757 36420 -8549 -14140 7629 17446 16400 23622 -19209 -42507 -75630 -94200 -86959 -59167 13152
20744 13152 35512 -16855 -53660 397 84199 101161 98536 133546 100314 89945 65176 69
20732 69 -9189 -3949 12188 -11388 -18464 45418 149390 161483 171691 88060 28525 -1447 -5137
20719 -5137 35110 43011 -2113 -40964 -47655 -56174 -33610 -720 -61026 -43353 5592 24188
20707 24188 12045 82533 63426 22505 36759 -2497 4467 -25873 -7534 77373 135674 154905
20695 154905 126143 110618 90987 17409 38361 68324 37534 66522 69053 72776 66265 31887
20683 31887 -41023 -38324 -11720 6981 4238 4948 -14116 -20411 -54847 -65266 92166 158860
20671 158860 170952 94661 20334 29598 -36712 32051 32365 -9448 7259 40869 -3843 24834
20659 24834 18050 -52357 -68802 9248 -10891 -31414 -34140 -27736 -12669 36623 40138 -20516
20647 -20516 -67644 -108442 -163032 -97072 -43177 1575 96808 133600 71663 54280 38996 -1889
20635 -1889 7809 50200 77853 75111 19263 7638 20205 25558 4619 -34662 -56598 -102126
20623 -102126 -80545 -55921 -22447 14906 82927 68326 40028 -10117 -56967 -43590 40423
20612 40423 15125 -36439 -15141 60107 59754 31652 27243 8819 -22233 13318 48108 52818
20600 52818 75913 39202 15585 66138 59725 45428 24104 674 -38106 -47263 -3183 42538
20588 42538 78582 47642 -4314 40470 22411 -71380 -50946 1328 25893 37335 144505
20577 144505 172408 149360 94016 45307 80288 127037 133686 130557 161844 178952 131958 130276
20565 130276 162948 91087 56608 116288 162707 160500 143982 145020 113732 67689 71629 75791
20553 75791 114269 68774 21232 -40671 5803 90126 153191 154053 101951 41306 26121 33335
20541 33335 85682 92408 39793 -27800 -49747 -115753 -118355 -21619 128304 191038 169145 90181
20529 90181 3749 5555 74159 93180 113307 97831 44683 30006 26541 42941 59143 101300
20517 101300 72569 57584 64174 -31315 38901 147993 78227 -6586 29919 95593 70397
20506 70397 68979 34714 45871 70491 81551 55799 48849 49937 142385 128159 93127 102830
20494 102830 98516 127984 130214 100738 79854 64365 114652 111153 75878 105482 67356 58861
20482 58861 62037 105888 134485 193125 157270 86657 46586 -7821 38706 92234 120375 107791
20470 107791 121305 125916 105087 25907 35282 67641 158481 156324 115057 68094 77542 185462
20458 185462 158697 131125 155294 150521 96113 65290 39199 100331 136832 139182 207358 123989
20446 123989 17687 44230 76874 123368 185490 174370 171556 172093 135171 92720 131746 148364
20434 148364 212609 212528 227470 230856 183538 163626 114999 41142 61035 87789 44446 84022
20422 84022 88219 80316 141330 159062 119708 95745 105332 131011 103371 62946 93549 122179
20410 122179 23899 -21342 14048 21901 17593 14280 54478 83648 158516 212442 160071 50603
20398 50603 -20684 33214 78031 126918 70611 84285 133171 112734 134133 146449 149592 142060
20386 142060 113345 103473 79372 17967 39317 363 -66823 -12368 75742 101017 136920 155188
20374 155188 192287 166468 69385 -11475 18424 78722 114895 136769 93123 63328 87446
20363 87446 55284 99054 110251 26165 11580 114434 178795 195610 163512 181155 202348
20352 202348 216108 190141 172071 134278 92013 113810 157443 131840 99474 67391 97051
20341 97051 99233 130660 210228 293593 216482 146982 85753 90458 125935 104640 170817 201642
20329 201642 194282 171977 124684 141491 182997 249305 281901 300068 240634 217989 145024 90337
20317 90337 132820 135694 154317 154410 110590 101653 124810 183297 192444 168887 244455 213535 142454
20304 142454 150365 77364 1543 103618 161452 125204 124251 156026 155850 75639 19440 37261
20292 37261 42717 45842 47085 42706 128219 113536 119406 64502 58291 139601 147087 162167 130205
20279 130205 118433 121126 122622 146733 180332 192132 235697 331419 290513 227252 240980 264889
20267 264889 269882 238467 232027 225427 170255 129018 115748 135606 195864 203036 142185 118314
20255 118314 112976 90294 46152 100129 207504 197624 145582 162048 268325 325347 206335
20244 206335 99532 34494 -11308 37084 -25075 -4242 47948 92619 123187 146456 159351
20233 159351 192956 197852 194435 191560 182646 150987 130229 198995 265796 261089 210473 144575
20221 144575 126234 152844 185924 203381 225457 150452 114572 117579 106129 82453 161037 186922
20209 186922 143785 218294 231907 198064 126957 159513 223583 265499 228274 193518 141555
20198 141555 151595 197493 272702 247152 224473 222188 216432 213659 220909 251544 242884 265333
20186 265333 222047 247698 352272 366112 403607 404205 296339 229417 198706 229920 291046
20175 291046 281186 228969 249325 307002 376180 365023 235496 160836 188049 225244 239082
20164 239082 234432 215212 158011 203667 287186 302274 275096 304632 294598 260631 239791 183136
20152 183136 87454 117678 183522 266994 186957 181827 203900 283470 278876 235746 188679 203415
20140 203415 210715 199546 206589 212362 226211 181814 177592 202330 215737 217899 209138 209920 172192
20127 172192 218248 256120 255836 240053 233260 237382 225442 225780 275233 296418 290333 235138 258669
20114 258669 300679 296240 250172 214332 242181 294531 319423 311542 338865 314961 267400 205862
20102 205862 196882 141245 129074 218214 257435 270087 269407 302790 330533 363627 359343 367614
20090 367614 340952 333764 353522 285324 242984 241669 232330 257728 305481 298793 278993 298554
20078 298554 299812 308919 295011 275421 317612 347476 329290 270895 271067 331453 387728 404734
20066 404734 375549 353147 324833 390339 373018 368331 406716 403638 362422 333631 251027 337994
20054 337994 401183 392903 402156 423364 419815 357314 326715 342391 318678 370430 389541 370358
20042 370358 399359 370396 312950 310895 344817 322778 272684 271053 344201 435862 394455 316793
20030 316793 263588 283525 349099 376372 387516 350095 358555 358652 397495 507738 544322 480974
20018 480974 424358 379485 276046 275803 321997 411081 490060 482520 389119 392074 416317 443761
20006 443761 435890 443347 444759 461417 489483 396901 291159 253296 276997 306455 330253 373978
19994 373978 401169 438214 435522 441050 438204 388243 348528 333023 331870 334265 389154 411798
19982 411798 435969 463112 456678 459197 413183 492508 526742 532296 556758 610839 563262 508225
19970 508225 545779 607095 597237 555141 527593 510578 514763 512123 550120 585578 595761 594065
19958 594065 545070 548387 511252 475043 446063 451300 459238 479940 532288 624148 630213 576554
19946 576554 655450 654761 631536 624556 594213 546080 517143 459865 429989 453300 546454 598027
19934 598027 613780 606108 649100 649820 593214 585119 588267 639680 671593 695946 721519 743677
19922 743677 673932 638276 588906 580166 608602 602539 626739 650976 703100 752529 743969 800732
19910 800732 851329 884393 898810 826086 799484 844878 889113 887693 808983 807546 835579 866936
19898 866936 869627 874130 924994 951861 900026 849643 847743 826278 787531 781880 806708 783003
19886 783003 750122 684679 680670 698788 703071 675787 689567 763662 762465 788603 783949 754347
19874 754347 785393 760301 784746 761226 800961 814869 827221 924885 992162 1010673 1006119 976176
19862 976176 937429 915909 999038 1060455 1111286 1100288 1069307 1075577 1094999 1124824 1056509 1052640
19850 1052640 1072929 1032596 946735 1002494 1125004 1153143 1150301 1108915 1050228 1061076 1042769
19839 1042769 1037601 1039146 1007156 979337 999291 968857 932299 866821 861659 892235 945442 939647
19827 939647 960342 995830 1015397 1064432 1056667 1062769 1099755 1164212 1235488 1226269 1194684 1269990
19815 1269990 1257061 1172066 1120499 1125289 1113281 1095978 1129939 1165756 1125422 1092687 1140316
19804 1140316 1229800 1296720 1280178 1203867 1135787 1068213 1165270 1226021 1225357 1214569 1163717 1111950
19792 1111950 1105007 1090008 1089839 1070500 1034871 973528 1057493 1133242 1155519 1109951 1111974 1099831
19780 1099831 1117843 1155715 1183751 1196605 1101031 1115048 1136627 1190415 1188006 1211194 1229532
19769 1229532 1223216 1229462 1209448 1230047 1282402 1325709 1334777 1359895 1384800 1346845 1302165 1284262
19757 1284262 1336928 1380325 1399198 1420752 1410462 1442524 1449061 1469206 1450780 1411194 1353305
19746 1353305 1311388 1284848 1351857 1443438 1402075 1399107 1470918 1520856 1593238 1593708 1610615 1544797
19734 1544797 1509043 1506163 1486779 1490522 1481001 1465557 1452475 1516116 1566776 1628581 1635952 1570781
19722 1570781 1560289 1585103 1580785 1561310 1582664 1609230 1576909 1557277 1604832 1677888 1670005 1653181
19710 1653181 1744789 1757409 1703646 1663356 1661373 1690930 1733917 1805049 1783738 1765281 1809016
19699 1809016 1892548 1940439 1989951 2039727 2032034 1956763 1897067 1917731 1941147 1962966 2000445
19688 2000445 1974935 1980434 2017013 1988628 1983700 2015342 2023905 2073548 2098998 2084994 2114925 2153360
19676 2153360 2154396 2153221 2197947 2217052 2192746 2212682 2252928 2254139 2327964 2367696 2378248 2438854
19664 2438854 2394668 2377979 2394535 2405534 2444017 2414285 2352827 2435892 2553595 2556127 2553652
19653 2553652 2552831 2585859 2610521 2582919 2563891 2598138 2597281 2575461 2604921 2663243 2702472 2737915
19641 2737915 2769788 2748531 2798519 2840021 2785183 2773891 2748625 2781007 2812620 2848724 2919978
19630 2919978 2971387 3015482 3019218 2963885 3020126 3103361 3134448 3196360 3278094 3280118 3278919 3237415
19618 3237415 3167291 3215020 3223000 3268891 3347547 3417983 3495245 3453888 3469407 3406507 3356852
19607 3356852 3517508 3509483 3479028 3477718 3528938 3572870 3553834 3591575 3629330 3622835 3598614 3662994
19595 3662994 3665195 3699998 3717549 3705109 3750525 3857112 3916554 3988251 3978442 3965095 4006103
19584 4006103 4043587 4085911 4164126 4241730 4219797 4213289 4267077 4292635 4302842 4285560 4374328
19573 4374328 4431750 4398958 4405739 4412180 4584407 4675873 4644489 4708626 4772375 4822383 4864753
19562 4864753 4916202 4995580 4960085 4955067 4954157 4959310 5003959 5048939 5059523 5085181 5159870 5240274
19550 5240274 5308982 5378941 5389379 5453360 5469103 5506838 5550315 5556230 5657225 5744477 5777536
19539 5777536 5849728 5933527 5936305 5935543 5937220 5995122 5992097 6033640 6116379 6250553 6329830 6397967
19527 6397967 6408243 6411039 6369226 6424448 6509633 6535197 6553783 6567392 6597201 6654587 6711424
19516 6711424 6795348 6928046 7018876 7041057 7099297 7210144 7241662 7222235 7247022 7299417 7380873
19505 7380873 7436234 7456001 7501143 7564745 7619491 7708679 7766392 7814575 7775435 7734359 7806242
19494 7806242 7871915 7972951 8007365 8060069 8146845 8177162 8106778 8121381 8232391 8245803 8253082
19483 8253082 8316003 8333950 8368432 8429860 8512578 8544486 8488353 8499361 8508180 8540204 8647348
19472 8647348 8758286 8756120 8725965 8766618 8817521 8934769 9020182 9127016 9165944 9146390 9148805
19461 9148805 9201282 9298931 9343221 9338818 9307686 9240221 9308784 9444270 9471257 9458624 9446847
19450 9446847 9467416 9536802 9608763 9558137 9514162 9561805 9533086 9497244 9614599 9592183 9602557
19439 9602557 9667477 9799346 9845663 9868486 9865102 9935694 9905592 9851538 9888411 9979785 10066254
19428 10066254 10132621 10235985 10310797 10345878 10415828 10540864 10592122 10661306 10771976 10868987
19418 10868987 10953828 11101305 11277076 11424989 11580554 11816499 12093301 12406932 12818855
19409 12818855 13273999 13807322 14593327 15706997 17208129 19454631 22599140 26787485
19401 26787485 32253473 38757089 44299007 45382223 42332714 37857951 33845972 31653374
19393 31653374 31868129 34447267 39344570 46733442 56638456 66742626 69573949 63170868
19385 63170868 52672989 41793818 33201086 27324039 23409993 20809329 19028314 17721009
19377 17721009 16848798 16348435 16034485 15943891 15914141 15905300 15897519 15908017 16085718 16534640
19367 16534640 17344077 18574666 20382075 22784959 26190686 30935075 37373079 45867978
19359 45867978 56501550 67209331 71881255 68713272 62264269 56327329 53638639 55228565
19351 55228565 60925052 68564786 73215979 74525031 75017554 72943925 67104439 60742502
19343 60742502 56290674 55516222 58905133 65827557 73682814 75579448 68750446 57657721
19335 57657721 46029556 36558020 29864465 25302897 22035923 19646706 17951079 16660603
19327 16660603 15699748 15029347 14520750 14216907 14095091 14003794 13847855 13793234 13862148 14194069
19317 14194069 14871556 15975942 17498946 19736648 23086483 28078334 35073088 44471071
19309 44471071 56531825 68145067 70777059 63658399 52776877 42134494 34624495
19302 34624495 30558455 29291354 30193742 33035786 37579736 42613505 44060008 40159855
19294 40159855 33756437 27043851 21631191 17735889 14910215 12897230 11543941 10559461
19286 10559461 9886345 9276272 8759082 8320566 7962208 7589130 7208755 6920760 6639088
19277 6639088 6385382 6210933 6063163 5967878 5851216 5664762 5520522 5447437 5367301 5202340
19267 5202340 5101318 4954237 4793943 4739123 4671280 4623792 4523801 4422699 4335441 4303280
19257 4303280 4293336 4218569 4144721 4105307 4052041 3969387 3947631 3917412 3841013 3748285 3687440
19246 3687440 3649870 3691341 3725038 3688730 3627724 3610440 3615691 3575088 3566921 3536991 3544414 3443770
19234 3443770 3308689 3229573 3211916 3184136 3245465 3222335 3165564 3133895 3131333 3130367 3098462 3024836
19222 3024836 3053715 3036942 2983830 3021891 3001276 2962687 2900302 2839246 2800853 2776571 2810605
19211 2810605 2874555 2850383 2828094 2786111 2687930 2704742 2699423 2674332 2591558 2537766 2507668
19200 2507668 2453111 2420644 2399641 2388075 2331764 2340982 2309024 2341421 2349598 2311595 2347123 2330632
19188 2330632 2300510 2247441 2175230 2077261 2032183 2031543 1978488 1959172 1961871 1998223 1954474 1937161
19176 1937161 1951828 1946017 1936251 2011625 2057034 2083794 2091093 2034032 2013408 1987549 1970506 2017374
19164 2017374 2025473 1946312 1869569 1854921 1862219 1861276 1803231 1756651 1752813 1750033 1689207 1664258
19152 1664258 1706128 1704783 1710864 1733297 1729041 1698948 1653214 1608808 1606179 1628267 1647973 1702253
19140 1702253 1696565 1628608 1544697 1528544 1540393 1563834 1557540 1632148 1695674 1620690 1605204 1589010
19128 1589010 1531341 1489959 1518994 1549329 1585591 1628087 1578153 1500298 1397902 1342092 1384886
19117 1384886 1398091 1390318 1327644 1311797 1335039 1439678 1494496 1461083 1421354 1420010 1400946
19106 1400946 1413722 1370534 1448010 1451748 1452800 1500657 1485155 1479670 1439661 1365314 1356932 1368634
19094 1368634 1353913 1320362 1319122 1276370 1259049 1226584 1249915 1322385 1342644 1275046 1224785
19083 1224785 1200135 1228156 1245754 1273583 1205209 1137417 1109578 1167401 1301271 1324376 1252271
19072 1252271 1228900 1210576 1187547 1166614 1135531 1093896 1078991 1048179 1069130 1112389 1118605
19061 1118605 1163408 1138037 1117098 1081673 1042304 1022554 1034125 1112983 1148907 1160456 1167467
19050 1167467 1164906 1186154 1095349 1032062 1092235 1152324 1152980 1167702 1089592 1029089 980000 975849
19038 975849 1042736 1030210 1034104 991274 998425 1024664 971917 986685 993530 951609 902721 872392
19026 872392 891710 910976 922100 859779 845843 914327 968236 963455 939135 936854 834044 771290
19014 771290 870274 920870 900153 852773 816686 782870 832248 828016 799264 747216 795739 855808
19002 855808 892849 873639 823814 773145 765305 680228 646104 692059 704192 758420 785101 811997
18990 811997 796642 765080 761179 791405 805890 826626 840566 859241 881667 825873 761045 710686
18978 710686 748728 746730 672261 666303 664960 696150 762883 773693 670178 636973 635700 676664
18966 676664 672256 656315 672196 745654 789678 744944 737018 751750 683039 618775 693244 737622
18954 737622 724173 734193 686639 675758 655841 705484 696180 704810 682335 629000 615243 577593
18942 577593 577819 555716 588175 568892 596376 587785 601522 597676 608877 645155 621166 540809
18930 540809 559217 605894 601887 590534 584747 584280 584508 609010 580355 587163 648965 637305 608880
18917 608880 668277 691429 609234 544236 532631 535698 562056 565187 553357 547820 552627 537963
18905 537963 558845 584407 574046 536346 531386 565589 585896 548309 543419 501842 537962 539000
18893 539000 575104 683624 677026 662428 712237 683131 638117 655778 655609 701973 740566 709282
18881 709282 682585 697220 676126 604902 582805 589406 619627 599737 692251 732805 703635 641107
18869 641107 602081 560953 596319 674220 618429 542221 513647 497019 480082 452625 469062
18858 469062 486688 489807 524961 533124 522161 551416 592206 570111 558065 573569 567290 614227
18846 614227 698235 684227 709652 703949 712811 735155 681630 635533 702345 752224 826425 935945
18834 935945 953338 901033 835934 785814 703425 651715 662016 696211 689243 713194 679887 647305
18822 647305 668878 607260 550987 512629 559078 571792 597313 603007 579868 549732 560671 525133
18810 525133 510212 476608 449524 346863 332234 345618 395499 469512 458837 406800 421436
18799 421436 428515 521213 580523 574970 570261 543340 500495 552092 546479 466232 562072 624012
18787 624012 628427 656678 649246 695421 679208 598060 551595 481032 526541 592815 530736 430687
18775 430687 377248 425110 453541 389352 379694 374174 378920 390301 364328 355806 331360 362725
18763 362725 396620 373562 331221 316780 298942 276683 239512 277125 275311 278913 309138 301588
18751 301588 311413 354167 340755 344546 385665 402774 426829 440565 403397 340962 300947 295034
18739 295034 348920 383096 422330 345885 325364 405165 385207 346286 329368 373749 379106 315816
18727 315816 318091 256831 235917 269982 286892 265410 355261 351272 309638 232338 168403 236097
18715 236097 342602 387799 357811 343083 324305 365250 367675 380355 326472 254197 282635
18704 282635 331162 317708 346553 379347 418278 371698 385075 406592 314013 315387 295433 323621
18692 323621 308420 303124 340779 335606 329048 314475 252724 206041 203785 188015 214419 258740
18680 258740 247038 258756 363812 449559 379531 295321 290781 262091 250928 271460 194578
18669 194578 174744 222085 289756 298183 205361 185379 154899 144567 208176 232980 230253 233427
18657 233427 189161 216159 249421 257651 228395 286773 309573 261375 262337 219626 233583 254153
18645 254153 286421 302671 264291 206178 142779 120343 141121 156495 107036 86251 125579
18634 125579 160303 213698 240557 282617 326156 255721 156146 164714 202221 168706 144740 122192
18622 122192 172985 219231 231033 259600 268363 172731 93077 106117 107701 62354 67314 92400
18610 92400 193583 212213 235863 237602 217102 200948 102163 117192 199326 204902 155332 115108
18598 115108 65306 136213 91185 52770 73862 69404 26402 85610 183161 195698 165936 114756
18586 114756 144982 167418 77836 83206 114516 189448 180674 183524 191918 200222 194449 170323 143199
18573 143199 148502 98518 94260 134417 173348 209740 237322 267130 259296 226412 263769 240438
18561 240438 211036 100006 56794 16876 28557 74716 100612 163603 192020 181387 156950
18550 156950 118530 127885 164670 166749 173635 207635 194126 167404 133970 145472 211605 242530
18538 242530 242662 163522 98987 22892 1188 140260 140873 100305 101262 113412 93038 189462
18526 189462 221915 155689 186301 134614 84179 128714 196699 188802 205074 222817 186090 168985
18514 168985 161786 124909 119802 167503 198277 178443 132370 108318 138388 134879 149927 148432
18502 148432 152160 121129 97231 100880 109945 142161 159962 149016 181054 190821 143276 108434
18490 108434 166677 163635 188774 153044 141200 157913 137447 133061 122874 95559 58488 86408
18478 86408 145446 203659 193712 174699 195799 173383 171853 148130 132211 110935 153422 115257
18466 115257 104273 87026 117537 80391 56771 63895 19464 -15645 -33436 -10478 -16760 28062
18454 28062 24412 83856 164122 115812 107818 89465 78816 33403 42546 125266 215779 211251
18442 211251 170010 130652 146326 127576 80135 39084 73582 162473 199495 131988 133178 151486
18430 151486 136047 99611 117405 108731 97668 104230 98690 102197 90135 87629 120841 99855
18418 99855 142912 170558 186585 170963 173771 180237 176671 231862 218519 142149 122421 91674
18406 91674 118582 151243 169443 193688 137702 144034 66545 55617 124466 122401 129305 112363
18394 112363 77774 30780 40181 30423 39105 145445 138857 159200 137449 98366 139309 206821
18382 206821 158332 63234 55885 46927 114322 74425 47161 64615 120705 111310 153374 185911
18370 185911 190984 128160 85578 81480 90409 70223 66423 82431 63351 58262 56986 53443 29173
18357 29173 75950 163868 123151 125371 130374 116554 141350 58158 26685 70484 71885 87739
18345 87739 101869 48349 -9581 6101 6948 19515 55484 109420 135221 86801 95542 56128
18333 56128 37679 59236 17196 -17301 12689 74296 93341 52764 56226 -10914 -62592 17165
18321 17165 -6276 5903 -23160 17681 12307 30115 33611 -2307 58710 99953 152699 185872
18309 185872 153516 105252 42684 16678 69078 76223 106606 130785 104202 65580 46390 46932
18297 46932 67513 84338 56732 96643 67055 81389 73897 48584 43196 24277 437 -3447
18285 -3447 31807 68534 153984 176246 131569 124375 161507 164075 163044 125663 172840 228333
18273 228333 210337 180209 90533 84304 96135 76734 28681 63074 41653 21823 720 54215
18261 54215 88948 50150 -4173 -51119 24178 20152 70517 138373 160437 133063 97029 100731
18249 100731 116199 155052 106034 79607 24946 -27487 -21625 -8675 26170 53472 118133 130711
18237 130711 97264 43874 59226 141025 185876 244767 222248 184431 117450 89112 38140
18226 38140 31878 60070 82673 112334 87321 82246 57307 49608 86127 111369 55166 40843
18214 40843 69238 14056 -1508 79056 99713 91631 92247 89292 75157 82006 61374 39274 -44297
18201 -44297 -81410 -114387 -69939 -26801 -31019 14750 54871 69982 91224 81942 89079 61028
18189 61028 79634 73219 60997 111540 103374 79271 83361 18467 22207 91643 102205 137886
18177 137886 107407 34383 27321 -9435 4784 68130 106177 75920 -25969 12755 1141
18166 1141 -48210 -31572 25742 52099 42705 73828 128458 117599 96726 45586 77502 102006
18154 102006 80691 73196 85908 37537 34139 46928 23449 -20099 13138 -7435 -2447 -31707
18142 -31707 -41911 -38241 60412 88021 82231 112341 55393 17512 19589 34798 32816 60392
18130 60392 102142 122511 104584 8686 17242 104547 52403 -29354 -16021 -96918 -69025 -22634
18118 -22634 -8993 -12829 -18905 54695 45908 9409 55773 104541 92271 118517 111721 110087 99491
18105 99491 73987 47350 20927 39864 77776 86664 116159 135343 135465 192212 160122 144974
18093 144974 134347 63937 36796 31892 40687 90688 159778 166918 136223 103820 124920 81515
18081 81515 15483 -64100 -38481 -18132 -41019 17392 89036 41172 10240 15852 75408 25027
18069 25027 -64718 8533 121980 229928 176863 148206 129005 81985 44932 81861 136054
18058 136054 117153 77872 100558 101887 105486 101844 97817 88402 73406 78429 151861 178262 126228
18045 126228 111400 125089 173199 219033 168210 124901 106659 125657 177077 174006 81398 42433
18033 42433 10602 -31924 -55241 6878 55856 -911 -19662 14671 93354 123217 100276 134722
18021 134722 171368 187660 143202 150596 186675 145168 84278 69365 172376 160699 75939
18010 75939 40482 21297 32011 45780 45694 63105 138186 110589 119270 180338 199222 218147
17998 218147 312737 402021 401023 348135 342163 360232 297863 282344 225446 186528 85338 26058
17986 26058 21184 5328 -27671 -39723 -3611 22627 85951 87834 103400 80464 107998 213477
17974 213477 218830 159542 144281 121805 121719 68195 62202 82968 90970 52980 15986 42596 142931
17961 142931 122868 124582 133669 129096 143392 160472 182325 183470 171245 156732 179585 128970
17949 128970 170776 211145 202188 250898 222647 218790 241855 198232 145854 89396 95146 120633
17937 120633 97890 96746 129841 111082 82617 57650 46860 62980 62159 12734 16243 53297
17925 53297 85227 113573 128156 50853 57999 84045 85407 100997 29694 38469 12664 43568
17913 43568 176169 234582 188896 190177 149205 110136 82929 74944 145580 194556 171512 171859
17901 171859 120359 108399 90598 151107 108952 127775 167886 156113 139717 61933 -22074
17890 -22074 -8551 -13767 -28578 -40619 8657 77415 67493 45583 -23441 -76997 -21693 7698
17878 7698 30040 43338 7521 -24721 -42560 13324 89988 27107 -14106 20728 6217 -17951
17866 -17951 -22181 -668 63373 102229 120398 110615 91701 84464 83211 70667 43889 44660 107641
17853 107641 120954 69245 7658 -57786 -55549 5966 -8711 4234 76262 91594 80797 32941
17841 32941 24309 47534 90695 79490 31510 20157 77577 79006 -9488 -49250 34653 91245
17829 91245 94497 94326 9090 -54481 -25561 11940 28976 84616 119963 67613 -12062 -84298
17817 -84298 -66614 12016 23865 13394 -32242 -52672 -16693 14880 23977 41419 108371 94752
17805 94752 40603 31462 12802 -38106 -17789 27186 25617 -19308 -52007 -39796 13529 59501
17793 59501 34550 -40074 -24105 11895 -49314 -13237 -24180 -5948 22723 -32903 -12911 2667
17781 2667 -7322 -12650 -20578 20002 19686 33266 29563 49625 14224 -57198 -38141 -2212 59314
17768 59314 60733 61231 18021 -10875 25178 37626 -11260 -33181 -19772 8216 46984 12774
17756 12774 27632 -32851 -46760 -33427 -34663 -49331 -32251 -21620 35980 59622 3623 -51678
17744 -51678 -38067 28233 86353 108393 67089 57327 -4917 5511 -37966 -75506 -69033 -54854
17732 -54854 16120 74376 70641 30967 -12376 -3748 12387 -6969 -40902 -29922 -36905 -59272
17720 -59272 25663 61968 28594 -11947 -8406 -12129 -44583 -10318 -11197 -52434 -21548 -11116
17708 -11116 -63067 -112902 -125623 -72253 -6282 14106 -8356 -17889 -26611 6482 59724 145004
17696 145004 160303 136357 120823 68485 3456 55515 45476 1296 18226 43722 18041
17685 18041 37549 17602 25981 59380 68437 54603 16534 46115 51511 44312 72246 83282
17673 83282 76223 72969 40339 -12742 23116 106409 100850 110785 157312 168367 202278 221028
17661 221028 210117 217489 160944 137991 118706 113521 79900 93248 129140 124916 101325 64055
17649 64055 42181 43349 34263 54858 76903 66199 113059 78095 -2440 -22025 -3385 41584
17637 41584 12295 56891 120613 91033 69992 28425 2076 49823 7417 -63450 -26419 90497
17625 90497 151614 196791 142471 22004 65028 120010 129783 144235 184694 269384 373641
17614 373641 408195 377814 367927 272722 156651 153151 169631 104353 42605 56318 77945 103421
17602 103421 37648 -63934 -24008 14724 51784 12922 17239 73512 105544 143718 75749
17591 75749 53224 14970 -34991 59083 76722 133939 119502 33753 4018 -22055 -2520 1170
17579 1170 -6325 -41529 -53665 -50530 -58249 -27114 -8187 -54613 -59485 -31209 32577 108781 139299
17566 139299 169402 229836 257106 186168 186183 181549 162696 108131 50734 18550 34634 46902
17554 46902 90790 65950 123592 155234 120623 130705 123969 94741 48454 -3309 -25769 -40185
17542 -40185 85757 173586 157106 104732 60746 2091 31027 57949 86568 14432 -98796
17531 -98796 -92904 -16145 48975 112215 116600 2587 -30611 -2920 18696 20359 13305 55000
17519 55000 43782 37242 41891 8314 -2487 -21669 -58317 -26246 -46495 -104640 -27160 26663
17507 26663 16278 29654 10036 5845 30048 29520 23586 -42583 -11206 70738 93883 25221
17495 25221 -43743 -45912 -24358 -50530 -34329 -26567 -48827 -28428 -65759 -163319 -170239 -122135
17483 -122135 -88681 -126164 -126255 -99545 -94173 -57089 -112651 -82069 -29143 -68223 -13880 6688
17471 6688 22834 -60517 -99783 -76230 -83428 -67713 19653 -4435 1758 36820 9105 -40140
17459 -40140 -48233 -132729 -142369 -60602 -16825 -16036 15063 41370 51002 67569 60416 70764 3212
17446 3212 -1625 36086 -20751 -65766 -52816 -59251 -47143 -68006 -107955 -49901 25769 21110
17434 21110 65270 55256 30357 27569 -8002 -38083 -5815 68849 106187 111141 31148 98010
17422 98010 127620 90948 6801 -34957 -41730 8446 -13197 -29515 -72634 -32009 -4467 -41386
17410 -41386 699 -12047 -2951 15061 -69121 -130194 -81228 -30715 47357 64292 62453 103674
17398 103674 92353 7080 -49987 -414 20695 -2922 -39406 -64219 -101534 -104597 -95684 -124111
17386 -124111 -129548 -88670 -41841 13436 18250 52169 22371 -527 49697 116603 60381 6493
17374 6493 42620 45154 -7557 -54230 -38779 41300 78490 27768 -28794 -39793 -35868 -26429
17362 -26429 790 11820 -5581 20435 27 -43 -16467 -25745 -50431 -77535 -13848 27395
17350 27395 39242 52492 10477 29892 72839 58206 -32378 -51192 -64957 -55771 -14327 27051
17338 27051 -6205 -8664 -13086 10826 17137 49345 65344 18736 32090 142936 141440 78253
17326 78253 108065 83177 40939 14361 17854 32159 54076 48180 54177 119522 80924 67145
17314 67145 58360 67597 30593 57077 82625 66004 41613 98096 91553 73724 115093 76704
17302 76704 41759 76784 16089 32839 69154 47938 82691 85540 67774 76205 113284 77027
17290 77027 69480 -4349 -5245 17964 21537 18186 -5491 3068 66755 53854 107684 158213 130480
17277 130480 41751 86798 94790 90348 52085 61558 67973 72559 -6490 -20823 -15124 5353 51004
17264 51004 51404 52243 119773 141156 134774 128458 148890 194149 136846 61558 57113 65787 70488
17251 70488 52119 77423 83932 88539 46558 50433 69726 58329 96846 155585 193988 188904
17239 188904 176694 216616 202783 247811 271466 148602 96711 105851 118213 99361 88256
17228 88256 82676 21642 32831 21506 3215 14414 70213 106514 157957 166268 181846 124913
17216 124913 30943 11717 45374 86901 91041 169789 189636 137584 90829 60103 41034 92809
17204 92809 144643 157229 204009 234455 198636 161932 240599 265197 280257 254342 198943 145108
17192 145108 79993 67298 93926 159145 174433 195361 195322 269031 346554 371630 399640 405465
17180 405465 412195 355439 330240 328426 369565 459728 461498 511108 558834 589597 581950 650679
17168 650679 707903 723820 813057 1018250 1197772 1289169 1371218 1364870 1328380 1356265 1486763
17157 1486763 1581922 1683121 1818080 2056783 2462732 2914859 3386620 4004772 4797392 5842635
17147 5842635 7216471 9113834 11861094 15748096 21072948 28032002 36586748 45087650
17139 45087650 47756658 42890099 34566977 25774639 18772846 14096662 10954912 8769606
17131 8769606 7262211 6217064 5302702 4590128 4008279 3533764 3223667 2949803 2760846
17122 2760846 2639112 2590209 2551137 2549341 2697609 2969221 3181791 3402881 3532919 3496618
17112 3496618 3313013 3187167 3179527 3276049 3339576 3543092 3842477 4230579 4721252 5426309
17102 5426309 6176794 7040034 8344566 10119024 12458873 15664034 20079861 26467057
17094 26467057 35276193 47027150 62171045 79420120 90807352 87921058 74396276
17087 74396276 57331723 41872610 30609128 23023466 17948060 14415201 11872532 9920469
17079 9920469 8481913 7258295 6219904 5422460 4885879 4368675 3985958 3699459 3440879
17070 3440879 3282655 3226740 3281859 3349521 3443574 3478141 3406661 3182402 2891607 2640511
17060 2640511 2458831 2448897 2574436 2639387 2744152 2911560 3092054 3420638 3866388 4400341
17050 4400341 5024464 5932705 7258181 9088399 11633534 15262331 20224259 26680952
17042 26680952 34822730 42779155 44761467 39685878 31588836 23314012 16853654 12420414
17034 12420414 9524607 7625368 6263468 5242153 4388818 3774119 3224444 2747447 2445744
17025 2445744 2154240 1837249 1641395 1569834 1498527 1465146 1526161 1569233 1518434 1406380
17015 1406380 1268317 1214015 1102553 907209 795884 738307 698802 678034 636327 620967
17005 620967 610298 587076 575843 453355 392182 309952 276614 284289 288391 312024 350787 355953
16993 355953 365509 404645 372814 322621 296035 280842 234011 235920 248109 223337 166489 108366
16981 108366 145407 117620 129001 148563 159081 171980 228619 274285 235046 179050 129768
16970 129768 100621 85437 78425 114770 107125 178323 262907 264872 211231 185851 217536 203857
16958 203857 289706 307574 276294 263350 236108 245489 243332 221278 189737 121760 108919 130136
16946 130136 101779 57115 112223 155249 159856 121151 146396 134864 34906 43841 -29903 -29435
16934 -29435 -30637 -65747 -79010 -52090 -68770 -65097 -31270 18889 -16888 7467 38491 4667
16922 4667 -52538 -56416 -22390 -3135 18193 50556 52163 41842 30670 61173 66775 15464
16910 15464 5344 42020 60903 62474 44568 142389 185475 93127 1624 -66799 -106134 -147298
16898 -147298 -132148 -93017 -55425 -50178 -62263 -16083 -34605 -49400 -19935 23408 -9964 -54030
16886 -54030 -34343 10141 -14593 3713 16796 7597 -11631 15507 11213 -83603 -56978 -22308
16874 -22308 -72091 -32934 -14074 45811 43631 21501 -29002 -80553 -62699 -34897 -61268 -160397
16862 -160397 -250749 -156207 -103632 -111721 -92922 -114241 -104630 -127216 -72312 13518 -10898 616
16850 616 -34587 -49540 -17639 38780 25766 5380 -50439 1307 2584 7049 -97181 -96354 -30736
16837 -30736 34528 42841 4956 785 -7873 35443 34878 -9111 -36165 -26516 -25940 6046 -23036
16824 -23036 -49921 -90410 -79587 -32774 -108693 -113209 -96942 -83450 -84242 -98530 -97982 -71082 -49283
16811 -49283 -71277 -34063 -10831 -38408 -51670 -58211 -51818 -77831 -91277 -59118 -76077 -105737
16799 -105737 -109336 -44591 -37673 -105980 -78262 -65347 -24000 7926 -39226 -56834 -49692 -88253
16787 -88253 -95654 -100543 -159157 -181433 -193011 -144778 -107413 -28752 -50198 -35589 -59638 -66603
16775 -66603 -79640 -108431 -74833 -39827 -13621 10751 23232 46659 23760 11261 -15729 -33913
16763 -33913 -75022 -88087 -53177 -108331 -65874 -33881 42510 62746 31916 35552 10475 11100
16751 11100 -47293 -155729 -176781 -91155 10283 10380 -25553 4962 32143 27794 30312 47695
16739 47695 -45495 -116995 -65136 -35541 11230 62910 83683 53296 16003 1880 -106868
16728 -106868 -138566 -84052 -17602 -5732 -37852 -63667 -80969 -67699 -39490 3047 3030 -12977
16716 -12977 -8571 -8610 -66225 -66218 -17855 -69415 -130004 -77845 -29322 -49490 -65286 -47845 -79790
16703 -79790 -9819 25836 19422 -43892 -91730 -122441 -131451 -37780 17792 3511 -67014 -57341
16691 -57341 -43764 -46472 -93891 -114515 10057 34932 28327 55365 47082 17772 -10047 -2031
16679 -2031 -111341 -125196 -116335 -171418 -186792 -110720 -112598 -174416 -101378 -61090 -52005 -12906
16667 -12906 34175 79509 66888 -45554 -72493 -30813 1001 69369 51679 -26614 -5974
16656 -5974 -5737 -10906 -16941 -51626 -11848 -11280 -28953 -32697 2775 28600 14268 19397 37497
16643 37497 -2092 -27167 -5306 -77400 930 3369 19205 109251 91406 63491 9796 -68169
16631 -68169 -143898 -184423 -133524 -83958 -46199 -97459 -127224 -72904 -83799 -73005 -9326 -28769
16619 -28769 -53491 -70753 -56249 -23933 -4210 21680 37895 88018 129272 97102 40121 46886
16607 46886 93127 120097 129744 107758 113406 83066 1022 -62882 -85380 -46653 -92410 -166521
16595 -166521 -164454 -162489 -166133 -80428 -54602 -63939 -121970 -84424 -66648 -90512 -169010 -206738
16583 -206738 -162301 -126467 -137079 -108777 -47638 -46187 -66748 -48929 -21195 -26850 -12917 5649
16571 5649 5000 50947 90298 68701 50284 62175 72360 123541 153870 217774 257791 389194
16559 389194 419623 327083 223450 112149 100825 82951 23072 -37045 -73448 -11991 18057
16548 18057 5469 -45725 -43983 -33915 -9976 14025 27211 -7494 837 -53841 -9342 89454
16536 89454 53860 -29207 -48205 13207 12804 -4802 -71674 -64756 -9926 -12313 40445 126761
16524 126761 123941 40612 -6818 -15648 56269 99445 131703 124874 110077 132651 197553 186371
16512 186371 156284 156664 116457 43066 48907 50550 4002 -67179 -72751 -18882 -971 -60287
16500 -60287 -120492 -94989 -4594 -6539 -37478 -75631 -145840 -84416 -86420 -94806 -182649 -198248
16488 -198248 -127238 -48353 -75958 -118792 -143178 -105772 -81321 -60362 -80629 -118390 -136522
16477 -136522 -138759 -166079 -182341 -160387 -139400 -143326 -90314 -6867 -28443 -105638 -150419 -106343
16465 -106343 -67359 -34486 -24290 1135 -18413 -103680 -140360 -82874 -123479 -174278 -191440
16454 -191440 -130523 -73612 -70004 -75875 -85516 -78791 -119899 -125564 -90917 -89903 -143288 -190607 -154283
16441 -154283 -76131 -48399 -45162 -54798 -11300 8745 -27957 28786 11691 69232 152735 116133
16429 116133 34537 -33429 -61821 -49651 -22757 24067 62754 55951 75240 70659 47111 -16713
16417 -16713 -87768 -144283 -124541 -66751 -73111 -119921 -83080 -34329 -51043 -44554 -87417 -126943
16405 -126943 -127063 -76215 -831 36957 54404 -36586 -45118 -9182 64944 83850 80124 92940
16393 92940 13671 -24058 -41241 -5432 -36301 -14615 -67887 -116162 -139967 -152944 -136203 -106475
16381 -106475 -139989 -113541 -42163 -34593 -16570 -25532 -32205 -2073 8732 -25492 -120152 -82568
16369 -82568 -89156 -38964 -21675 -36367 -49766 -12510 -7877 84740 79617 25155 -25163 -96838
16357 -96838 -76719 -5313 -46889 -82369 -61450 -22242 -29733 -55301 -97042 -45260 -26198 -14143
16345 -14143 -30406 7312 1318 -56987 -98579 -108502 -65624 6503 604 -61637 -64587 -106953
16333 -106953 -134541 -118887 -85966 -88107 -56241 -31903 -80824 -53406 -59679 -74150 -70823 -88270
16321 -88270 -169629 -208433 -215606 -164674 -94682 -37767 -56297 -10034 -30646 -25194 -25075 22130
16309 22130 31782 -52912 -82151 27054 -20290 -37466 -25946 -37369 -39025 -68322 -78171 -41623
16297 -41623 -55728 -75273 -69816 -25431 4266 20049 -19062 -49777 -80978 -102125 -63623 -45351
16285 -45351 39962 43280 62306 11880 -30192 -73751 -58559 -17854 18839 31029 25198 -40452
16273 -40452 -92001 -88512 -84496 -82950 -48124 -60685 -31284 -61907 -111473 -168611 -183133 -111878
16261 -111878 -72632 -117155 -72365 -13286 20632 38621 8450 -5377 -31508 -51983 -46561 -59652
16249 -59652 -38026 -69257 -129749 -69818 -42110 -95066 -145466 -159420 -168448 -134928 -101576 -82373
16237 -82373 -40852 -47996 -21076 -60267 -98135 -127735 -158134 -82370 21864 13523 -51193 -69242
16225 -69242 -55751 -74665 -132734 -143137 -117761 -108053 -102003 -108309 -89308 -127277 -125737 -73642
16213 -73642 -35921 12316 2943 -20750 -18158 -3824 -70530 -84736 -75193 -135282 -111594 -56920
16201 -56920 -13201 -14038 37036 61840 65783 -6607 -35171 9476 4384 16190 14482 707 52296
16188 52296 -19293 -95691 -110987 -116813 -150646 -115181 -112991 -81731 -89863 -79764 -93198 -81404
16176 -81404 -62032 -31321 1628 -56802 -86792 -62221 37823 146944 37822 -18698 -23017
16165 -23017 -78494 -128276 -129907 -113386 -115784 -174481 -166070 -172037 -118784 8675 20798 -46284
16153 -46284 -56952 -25336 -52037 -72028 -49217 -19294 -20278 -69268 -108012 -106488 -117434 -69292
16141 -69292 13747 20592 -14027 -35715 -34901 -10953 -13172 -24054 15121 -12280 -51897 -128955
16129 -128955 -129216 -104570 -102495 -55399 -46256 -25853 -11746 -4652 -24712 -20571 12301 6125 14029
16116 14029 31248 -36189 -71576 -59466 -98440 -138445 -109918 -148182 -151380 -77648 -19942 -23863
16104 -23863 -34932 -837 -23013 -42733 -63752 -90602 -69140 -124751 -73963 -39253 -89817 -55073
16092 -55073 -98034 -151321 -81875 -76340 -119076 -111162 -110430 -110622 -49518 -41517 -14678 -17158 28418
16079 28418 19441 125150 109763 31248 -10917 12498 -50867 -70615 -28245 -64601 -126645 -72000
16067 -72000 15227 -11480 -6556 12939 33491 3208 14125 -21132 -22313 -6755 18727 67718
16055 67718 36158 27123 6108 -51501 -37541 -30073 -45728 -16835 20102 -14050 -87471 -112706
16043 -112706 -111819 -81310 -81015 -62852 -77444 -119469 -123242 -86674 -9885 -39101 -12415 -25332
16031 -25332 -42365 -22292 -43054 -73661 -107353 -139171 -174254 -188071 -143735 -150173 -141935 -138675
16019 -138675 -128691 -135659 -119694 -80834 -80458 -98047 -118056 -120662 -76223 -69937 -36632 -5494 22700
16006 22700 30321 47543 56713 85233 27171 -63499 -68598 -103759 -105880 -83023 -61024 -76361
15994 -76361 -70790 -104144 -136439 -131586 -64482 -62827 -114442 -160789 -165984 -129802 -110944 -87977
15982 -87977 -89000 -35970 -32342 -61194 -52983 6505 -32073 -31991 -41699 -46022 -64887 -73480 871
15969 871 8901 -44441 -118486 -105955 -38840 -24924 -68913 -83346 -32374 -54752 -50213 -59959 -69540
15956 -69540 -111585 -54931 -13954 -8339 -73552 -67402 -34350 -43366 -12538 18259 22145 16735 -36436
15943 -36436 -113880 -119205 -94426 -26788 -6882 20011 -9156 -86969 -130519 -105038 -36896 -69067
15931 -69067 -20519 -28326 -30014 -17992 -53179 -40544 -9175 11874 -2906 -45745 -87203 -94334
15919 -94334 -61436 -99852 -171592 -139802 -141615 -104573 -110937 -71884 -46259 -32012 4691 -15789
15907 -15789 -42692 -63945 -80708 -86459 -68776 -76769 -66997 -74957 -37838 2172 41588 -11185
15895 -11185 -60288 -74222 -99483 -95599 -59811 -79070 -108666 -81717 -49735 -9001 -4780 -30165
15883 -30165 -10263 40629 65869 66403 106105 94323 56261 -37325 -73206 -151193 -143502 -47194
15871 -47194 -50055 -55171 3985 53271 54088 21652 -20328 -15733 7527 4676 -40169 -79099 -102478
15858 -102478 -145782 -36900 17049 -79476 -82910 -39659 -43667 -94601 -95125 -78582 -77775 -47322
15846 -47322 -64151 -52899 -15192 -41084 -48816 545 49896 78168 91705 10120 -53384 28294
15834 28294 51263 18399 -26723 -20603 35809 33102 33260 24184 3341 39724 -18243 -25273 -814
15821 -814 -36230 -67640 -100439 -140183 -114020 -77277 -102048 -30854 36187 -8358 -39049 -63915
15809 -63915 -93035 -127398 -98876 -78425 -154275 -87793 -83225 -114463 -82235 -86865 -128911 -110909
15797 -110909 -155025 -118061 -86739 -85563 -112160 -151093 -97449 -72116 -75598 -117785 -129874 -147094
15785 -147094 -122890 -117680 -64323 -34906 -101799 -121077 -57748 19276 -13801 -42722 -11619 -71929
15773 -71929 -76948 -28015 29608 -12966 -35636 -1808 17962 -49221 -120876 -113752 -83772 -47357
15761 -47357 -39348 -34569 20197 13869 -22223 -56299 -64099 -124750 -98907 -56286 -62268 -38644 -42749
15748 -42749 -2594 -14903 -52437 -73383 -63053 -112525 -147376 -150720 -145304 -187403 -106791 -27828
15736 -27828 -37336 -81151 -83283 -31712 5863 -25971 -23444 -23309 -39295 -42983 -49160 -68780 -79008
15723 -79008 -59551 -73424 -75581 -74323 -31814 -40685 -24954 -93530 -122093 -46950 -31466 -125781
15711 -125781 -135419 -130997 -97853 -65077 -7554 -45897 -91568 -165286 -147949 -81737 -91607 -112288
15699 -112288 -182831 -173713 -135176 -60573 -34220 11320 62297 36289 -11305 -29695 -71743 -57269
15687 -57269 -30018 -72786 -109707 -115306 -113576 -77943 -56179 -24762 14147 59801 -8429 -36469
15675 -36469 -58571 -154533 -163300 -156969 -108575 -56649 -33312 -8848 -50496 18617 71014 101268
15663 101268 105338 103596 23988 -4450 24518 52196 24646 -55756 -136827 -130409 -93886 -51708
15651 -51708 -53328 -16266 30917 48932 69942 16093 -22925 -78255 -58299 -43851 -59815 -23936
15639 -23936 -67297 -58094 23623 40079 -4182 -79888 -94555 -73032 -84879 -113659 -60336 20913
15627 20913 35637 66748 99965 121405 124191 121614 5545 -81873 -66507 21235 29901 -30047
15615 -30047 9175 -1872 39417 63902 18049 -13812 1395 -73748 -70825 -74775 -90741 -85920
15603 -85920 -39037 -3575 -628 -48684 -26865 18880 52221 7666 -42734 -100470 -107362 -70935
15591 -70935 -30963 -912 -27342 -28895 -48013 -96756 -55266 -92974 -101288 -21675 84146 76585
15579 76585 66770 60947 -13221 -39130 -86470 -145674 -58876 7027 2930 3755 -29997 -70079 -90950
15566 -90950 -38121 -31428 -80160 -52596 -35837 -87565 -55674 -20717 -62425 -59085 24039 20050
15554 20050 58295 31171 32557 12499 7762 -21437 -89361 -147529 -156147 -78910 -112252 -160578
15542 -160578 -183595 -176642 -81497 -18199 -24009 -63405 -42844 1012 17922 1521 -42534 -17461
15530 -17461 -23732 -80465 -65963 -246 4240 -23431 -47578 -48059 -63196 -113391 -184338 -240524
15518 -240524 -175033 -117215 -113486 -113311 -83059 -61780 -65935 -65607 -80953 -108671 -114480 -16972 49969
15505 49969 118965 87887 -41483 -139583 -127262 -85946 -60664 -41758 -61170 -64960 -56752 -105186
15493 -105186 -123500 -92847 -57439 -81999 -96864 -53144 -47524 -130293 -144198 -162572 -174353 -180316
15481 -180316 -232979 -204755 -115493 20627 44337 -54474 -178097 -168518 -68131 -60770 -84381
15470 -84381 -89408 -119351 -152826 -100425 -29693 -47148 -119633 -57115 -18854 -64577 -123437 -94494
15458 -94494 -91938 -21654 -1696 -30445 -126501 -129635 -76039 19307 17533 10001 -18830 -62096
15446 -62096 -41262 4139 12669 -68833 -6526 -10856 -19837 -104575 -144591 -145376 -132132 -150080 -154821
15433 -154821 -154367 -104921 -96830 -105975 -97921 -75952 -79333 -78182 -35040 -25385 -36958 -89512 -62840
15420 -62840 -45970 -41132 12372 4181 -19738 -85585 -10146 16769 22190 7649 -3862 -32213
15408 -32213 -21150 -53238 -27042 43142 94427 74175 73441 34586 1623 -64625 -2320 90927
15396 90927 144025 120272 73327 31739 19392 21445 5319 3261 7032 58072 14573 -27526
15384 -27526 -129117 -164523 -151052 -185647 -190885 -150059 -135099 -113171 -132292 -173662 -131867 -42603
15372 -42603 -29985 -56540 -36713 -69562 -105654 -98666 -72010 -59279 -130592 -131669 -92686 -35380
15360 -35380 -20005 -64048 -90568 -69409 7694 12681 -33695 -47936 -107381 -130890 -105877 -69302
15348 -69302 -81502 -87455 -66555 -84397 -59272 -33335 -11362 175 50000 12786 845 14783
15336 14783 37137 65497 28912 44463 -5504 -43612 16262 60636 -46840 -17838 11390
15325 11390 29621 -6826 -56347 -73185 -50091 -44076 -77521 -47483 -4270 13538 -31605 -49527
15313 -49527 -79031 -126221 -137411 -128779 -67711 -5476 52703 57401 15236 -46052 -64082 -52238
15301 -52238 -18702 -41954 -80234 -78466 -33775 -8142 21170 -8793 -45186 -64647 5930 -33264
15289 -33264 -97858 -13863 22938 -23941 -24445 -184 27271 -29714 -52190 -72130 -9213 8140
15277 8140 1809 36297 -19819 -86460 -52722 -29960 -11913 -47009 -80038 -136753 -110465 -44304
15265 -44304 1412 3579 7970 -26368 -81495 17695 71549 78985 70290 -7467 -65723 -101017
15253 -101017 -75275 -16265 19273 26793 30685 16761 26093 47434 -67832 -103281 -110765 -132956
15241 -132956 -73105 -31452 -32018 -37219 30120 15600 -18690 -24236 -49996 -81296 -111671 -120900
15229 -120900 -178284 -145794 -89322 -59190 11683 -25380 -43192 -82326 -101689 -69956 -23767
15218 -23767 -15071 -8802 -99813 -53492 -37905 -27467 -42431 -2219 -3297 -12189 -15522 -33240 -22841
15205 -22841 52763 49569 -35675 -59218 -57150 -109512 -98663 -73201 -74660 -58972 -41886 -3342
15193 -3342 -13481 -70962 -87367 -27446 65714 123355 121580 42673 -77915 -108414 -66592 -34708
15181 -34708 -81765 -118889 -161673 -194352 -160084 -56381 3792 -43232 -18306 16678 -19857
15170 -19857 -51194 21018 90306 34083 -6692 -3311 -53885 -141278 -138956 -101657 -81853 -73685
15158 -73685 -47864 39881 47070 6594 -21560 -40224 -69130 -104484 -78219 -47342 -33364 -2271
15146 -2271 24549 50697 41074 13851 -67351 -50489 -51380 -35273 -27917 -64328 -51590 -47790 -20295
15133 -20295 -25994 -28734 18856 74960 38633 -7782 23376 6380 1088 22326 6922 -4385
15121 -4385 -794 -17159 -33223 -17725 -95285 -94359 -64716 -25842 -54552 -67714 -112572 -82914
15109 -82914 -100609 -100113 -59878 -48565 -25417 14643 46846 15346 -18810 -42254 -6710 3388
15097 3388 -33474 -74421 -124899 -120832 -89395 -105790 -93682 -36402 -122842 -143224 -35641 61844
15085 61844 69057 80189 100312 85118 76523 19487 18034 -56619 -140624 -190668 -116740 2401
15073 2401 36865 1297 -14511 44688 98821 95624 109857 56086 -42932 -91471 -62521 -17090
15061 -17090 -10355 -79003 -112524 -91200 -11923 23514 -5048 -28358 -26270 -35624 -31579 -55377
15049 -55377 -73284 -96211 -46187 -17984 -15594 -16733 -73861 -91395 -48588 -77576 -117771 -134745
15037 -134745 -133160 -150114 -107970 -3861 -7423 -19793 6040 66898 8142 -40561 -63010 -64986
15025 -64986 -82795 -78625 -53989 -18789 -54272 -37954 -11097 -26968 -508 -13351 -28851 975
15013 975 -4165 7770 36165 25000 21114 -9218 -17766 -54786 -77334 -28228 -8930 -4919 44214
15000 44214 54250 -14655 -68645 -90801 -69614 -126777 -156076 -137031 -88407 -17978 -7229 -27771
14988 -27771 -57099 -109368 -106767 -75990 -35679 21557 90236 32879 -28687 -63396 -124546 -96086
14976 -96086 -88334 -108123 -53886 -20811 -14858 -18507 -18757 -14590 45091 80960 27698 -21991 59822
14963 59822 81923 4523 -11258 -9701 -28346 -19724 42033 100539 92306 21597 -41661 -67388
14951 -67388 -42283 -16355 29190 21185 1047 -8257 -61469 -124132 -71249 19440 74441 29389
14939 29389 -19085 -63225 -112923 -146973 -70290 -14259 -91348 -93242 -22017 24181 -2075 -34849
14927 -34849 -14603 11562 17045 4677 -20889 -26931 -59828 -123470 -136147 -35443 3394 -30218
14915 -30218 -10820 -16841 -4523 -43029 -3791 61349 48986 -53263 -77870 -118210 -83474 -40125
14903 -40125 -35092 -88101 -120693 -131563 -124646 -35983 70539 81414 -17113 -57997 -35839 -29688
14891 -29688 51425 66036 119433 99586 87278 91601 30461 -40041 20859 36512 39548 -17826
14879 -17826 -75990 -56581 -101971 -93225 1942 46206 3452 -28432 -34377 -87121 -53775 -53526
14867 -53526 -38507 -23104 -59102 -105046 -75067 -26048 -75996 -80544 -80808 -70889 -31619 8149
14855 8149 115513 162965 88431 6378 -840 32394 46343 59184 89659 55033 -5332 7190
14843 7190 53053 3223 -87808 -86993 -117254 -89038 -87979 -150090 -123503 -81087 -119528 -176886
14831 -176886 -121907 -27480 47511 21895 3782 20004 34174 1294 6008 -18869 -66991 -34276
14819 -34276 59111 106918 33843 -12942 8012 -41158 -83564 -45024 -16416 -72522 -51758 -4060
14807 -4060 8494 6342 28745 68368 53346 31167 9269 39262 23398 -13142 -51726 -63517
14795 -63517 -78321 -82412 -15521 -9110 -6744 -32837 -27102 -12552 -35361 -70622 -60497 -110346
14783 -110346 -123007 -79810 -19875 -23218 -68221 -38582 -15133 -48105 -22777 -27570 -84493 -83489
14771 -83489 -47220 -23696 -32025 -97180 -151747 -141020 -91120 -67383 -9072 55531 -6541 -10109
14759 -10109 -31691 -48399 -16384 -11699 -34011 -81060 -15106 28971 67655 134019 110155 70958
14747 70958 60717 39277 72504 53422 -246 134 4622 97056 119548 52524 6762 -20603
14735 -20603 16336 57052 28926 24758 -14633 -70780 -62894 -28069 11669 50641 97359 99455
14723 99455 90973 78391 57752 39848 -11136 -54589 -80969 -48246 -24060 -13605 1699 27060
14711 27060 47882 -17027 -78818 -109671 -50756 -65367 -64695 -9652 -7820 60126 155251 119945
14699 119945 67855 15409 48109 27779 -26633 -8601 44109 44268 -11753 -55811 -77558 -125243
14687 -125243 -36357 -36781 -20644 -15479 -14889 -32849 -41539 -81570 -96475 -134280 -105011 -58837 -53991
14674 -53991 -51482 -144338 -133160 -57480 -56507 -60391 373 -3008 -10224 -43486 1770 62220 43110
14661 43110 44725 36673 2866 40828 84481 50105 -33690 -65275 -36429 42594 -9985 -75607
14649 -75607 -69635 -13375 25756 35710 69553 55933 74066 74301 67900 4968 24400 32011 27260
14636 27260 -20603 -63335 -30559 -63480 -56002 -43273 34069 38448 46511 37070 67487 57787 24302
14623 24302 52489 42582 12806 -26667 8568 74469 42886 -25664 -27309 -18258 -10946 21973
14611 21973 29277 76681 97464 24503 -96080 -128556 -33604 26435 72392 102252 162230 162465
14599 162465 60018 4527 26379 42272 78584 105834 112828 122478 35724 -83255 -111752
14588 -111752 -90730 -24925 24037 36747 708 -33244 -67368 -108344 -91030 -6678 44322
14577 44322 35105 30434 -16465 -40107 39574 78336 64408 20347 -53645 -5413 48562 57371
14565 57371 27680 21821 43848 57248 11855 -26923 -92204 -120213 -122624 -65893 -37344 -33515
14553 -33515 -48818 -10788 5601 -17230 -52415 -51003 -79821 -76706 -77329 -91135 -60161 -57813 -37644
14540 -37644 -47904 -27775 -39554 -19021 -38717 -83280 -104226 -30795 -21320 -18637 -39953 -30826
14528 -30826 -27690 17486 54763 100493 49420 -1649 -17738 -55754 -11268 -15847 -48280 -106809
14516 -106809 -67639 -60503 -57560 -100935 -94783 -145567 -191293 -177543 -127978 -88153 -60121 -2860
14504 -2860 -33365 -94534 -92149 -95484 -70907 -58034 -2158 60763 15853 -3158 -18548 -46618
14492 -46618 -40442 -33798 -87508 18089 95440 25611 -93057 -113740 -61407 -21926 -10182 -23425
14480 -23425 -8315 -70957 -47740 4149 56090 130478 154719 64165 3210 -18614 16916 10571
14468 10571 18013 -10395 -9788 5504 -22174 -41348 -103664 -55983 5591 16701 32922 48540
14456 48540 -11773 31713 93439 97296 -16077 -4890 49444 -18905 -24883 -59473 -2214 30559
14444 30559 -9303 -7081 12619 51359 126509 117561 110315 98067 54735 -10656 -58568 -90845
14432 -90845 -82375 -48715 -72906 -126466 -128448 -117011 -143885 -76975 -41387 -28484 15073 1917
14420 1917 -8496 -39286 -29384 -53276 -19288 39943 33132 -27223 -47706 -56600 -77825 -47729
14408 -47729 9603 24091 13746 49479 60365 54912 67657 28061 -12740 -56151 -58490 38432
14396 38432 60664 57730 75741 61033 148845 162934 106292 59654 -30603 -76480 -35300 1974
14384 1974 -10362 40364 81283 47388 42114 150600 121964 33960 -18636 13331 70452 69671
14372 69671 -24653 -114282 -151959 -111965 -106061 -75515 -56500 29945 1044 -37254 3710 66972
14360 66972 13632 -54440 -84941 -84601 -69084 -55622 -84075 -84684 -96202 -50916 -9570 -8518 -55734
14347 -55734 -17680 8534 -48075 -93939 -73643 -134833 -170394 -116730 -89162 -104249 -92386 -35056
14335 -35056 -78976 -91211 -18405 1964 -33259 -115900 -154351 -75413 -52684 -78442 -39202 -28145
14323 -28145 -55625 -43414 -11346 42286 31381 38070 19978 -17519 -58843 -88867 -109534 -56413
14311 -56413 24442 11523 -33148 -4350 31277 45685 -33082 -92801 -54394 -43858 -51131 -88854
14299 -88854 -107238 -60551 -19615 9709 12473 -64881 -45273 -76143 -76610 -26009 39867 45631
14287 45631 41982 5672 567 -1284 -26312 -64490 -17216 -13891 -39444 -12738 7420 17154 48858
14274 48858 8086 55490 62924 68938 29569 -50693 -86565 -39245 24833 44118 17561 11130
14262 11130 100957 147097 87460 -9363 -90774 -145709 -125528 -119383 -114027 -73113 -40487 -27730
14250 -27730 -52956 -54653 -80539 -114217 -91161 -44919 -37117 -70381 -82519 -121087 -120368 -37979
14238 -37979 -49225 10392 118567 84778 41867 120942 74262 38919 140392 98788 81078
14227 81078 27204 55698 130519 133387 85008 57150 30178 29580 3829 -7380 -31041 13203
14215 13203 90097 85838 35471 17545 -23605 -7644 -7444 22099 -40299 -76347 -31418 -37072
14203 -37072 -42395 18753 43404 20738 55144 26508 79813 162046 161470 116592 82741 93018
14191 93018 86988 49691 86284 25510 -42914 -70958 -80284 -81082 -84817 -66079 46520 100064
14179 100064 103182 117469 127175 86807 82507 120916 81961 -15808 1126 46224 34163 -4126
14167 -4126 -28047 12893 44979 96724 64811 54122 24961 -23923 -57135 -23787 39414 44883
14155 44883 22547 46736 69551 54603 36390 3877 11115 13008 -5725 18849 28473 102524
14143 102524 119558 70229 57085 98945 55419 10242 -12059 8632 28818 69016 106214
14132 106214 108357 63702 61694 136111 137232 45382 36659 68962 42058 7550 42649 30116
14120 30116 -2611 -36057 -27898 -36464 6031 -1522 38840 61192 68959 102849 31125 -16476
14108 -16476 -33091 -102923 -89642 -62364 4216 30956 44218 53880 14402 -20791 19759 21618
14096 21618 6579 11029 24777 24607 -67287 -99894 -73169 -916 217 -15875 -52520 -57789 -77131
14083 -77131 -74146 -18639 20047 6622 -17025 -42596 -61734 -43136 -5559 46502 32299 1326
14071 1326 50230 87287 118561 129512 48948 20456 89849 117934 38288 7989 -44845 -107688
14059 -107688 -66500 -9986 8019 12365 7424 -27793 -47067 -31862 -25008 -284 39758 115561
14047 115561 128739 139800 139430 64566 -58283 -37993 10096 67138 71717 108558 95866 116714
14035 116714 80823 6429 -6295 -6354 -51404 1067 20685 -39256 -83986 -42457 13182 42828
14023 42828 20619 -14926 -35500 -20406 12310 12851 37013 78900 28771 6245 23320 20512
14011 20512 47246 5169 19270 -24547 8567 76335 35796 -22537 -11309 30129 8189 -68104
13999 -68104 -41391 -15054 23643 45120 -16091 -49533 -26225 3719 -9233 -48775 -102739 -61516
13987 -61516 -4746 -42451 -51993 -45801 -35349 -59490 -74387 -33939 -24630 -16665 -3646 43572
13975 43572 66337 102597 25168 -34194 -65266 -425 9511 40559 8497 44419 80846 104092
13963 104092 81641 8534 17720 34754 8017 18500 66969 81282 67101 79113 109602 57093
13951 57093 21527 130452 127276 30041 931 2429 -52661 -10361 67323 61749 44926 16535
13939 16535 68650 63952 65990 55480 38408 3442 -50766 -84398 -59221 -13055 10186 -3189
13927 -3189 85416 115856 105180 157860 145606 96519 100705 95307 53503 -1566 -68064 -75581
13915 -75581 -32409 -15947 63592 90182 64465 83767 123730 89577 3514 -6325 79 99797
13903 99797 68207 36308 -9314 -81621 -78401 -38848 6856 22156 31935 67919 32628 9453
13891 9453 25382 12537 -5141 21385 5722 -19055 35189 132274 99952 38645 -48383 -22442
13879 -22442 -39843 -65189 -38747 -56336 -24204 60757 103982 99608 74120 29477 -6649 26027
13867 26027 33754 24290 76764 70439 34597 15439 -18361 -44780 -17555 9224 39701 134118
13855 134118 133565 91129 22540 6380 18148 23567 17325 31225 -9229 38765 71208 78166
13843 78166 39548 -51998 -75808 -50806 -68604 -48346 -76502 -32825 38483 -24618 -81896 -33401
13831 -33401 23195 2224 -49873 -60205 -95069 -95428 -50252 -27681 -24735 -72140 -67154 -85456
13819 -85456 -48318 -3429 -2189 -53198 -86682 -114373 -169581 -122522 7652 32497 24566 -28580
13807 -28580 -55012 24592 67757 28133 48640 99463 125422 135119 123731 48394 26340 31824
13795 31824 2290 -24007 -83591 -70017 -20009 17647 41795 42454 -7944 -27321 -25270 -42379
13783 -42379 -19531 38527 66029 12843 -10105 -1045 -15107 -15440 36077 54095 2808 47153
13771 47153 84801 109964 83009 51064 22033 16289 47395 122365 109458 70420 64535 76553
13759 76553 91427 100722 60185 35779 12293 -62748 -106368 -74005 -31959 18367 42695 -20271
13747 -20271 -50268 -4738 11297 6500 85072 67392 57407 39135 71488 125135 108159 110018
13735 110018 77987 91133 167924 220089 207755 129120 59786 19680 111769 158350 120259
13724 120259 81722 -10318 -20638 -113592 -115010 -52543 5943 60589 106541 92172 84906 122404
13712 122404 188934 189859 116025 -9377 -135614 -129652 -18363 4793 -26316 -43358 13505
13701 13505 6869 -39956 -102345 -106223 -24182 24287 69340 60167 49303 -27079 -70449 -12183
13689 -12183 17784 -5557 1180 -9567 17812 8872 -13914 -15631 -31563 -55609 -17154 38529
13677 38529 -21667 -61482 -18470 33077 78249 86763 84913 46240 -21040 6632 31839 4601
13665 4601 17182 35474 48511 -1065 15080 88716 125385 26386 -59926 -63339 -12041 -19937
13653 -19937 -41124 -58992 -21407 15681 21609 22011 -7057 -3207 -15818 -8309 42899 5974 -55097
13640 -55097 -36176 41137 33118 -6835 2171 -10563 -34084 -109901 -65619 79192 68350 26648
13628 26648 54044 58002 77754 115490 108637 61242 17033 2376 -2214 3666 -71147 -113736
13616 -113736 -40774 -96421 -87957 41873 132584 162817 121855 121314 64103 26473 30242 18179
13604 18179 5724 11913 59775 73335 48062 -30764 -78612 -56876 23215 109565 115179 33515
13592 33515 11681 6558 18312 28445 30743 -1250 -70223 -58589 -15143 -55863 -18279 24893
13580 24893 -2187 -21505 -2736 50348 41498 26010 39786 54671 20004 47244 111806 96906
13568 96906 72900 127617 188750 150827 70875 88188 59842 9591 61594 42455 314 -25088
13556 -25088 10289 102869 148250 176656 257207 264389 206559 137150 99406 16580 -37378 -38379
13544 -38379 -57133 -33656 3110 6117 -37109 5633 74166 74830 66387 66080 47855 103079 102370
13531 102370 27585 65435 66505 92257 118890 117219 72009 52739 20573 -9482 -8357 1803
13519 1803 48174 36499 80239 159311 178142 100157 113447 120917 112113 72579 -954 -15536
13507 -15536 -8286 -35984 -41706 -25176 -36164 -72728 -58199 5127 35959 -1136 -50159 -54715
13495 -54715 -16710 -5176 22309 15355 -23231 -54551 -67638 -68184 -65793 -35424 -47023 -48374 -68396
13482 -68396 10221 50369 112971 91114 34087 -491 -6788 77283 61296 28891 -3835 25062
13470 25062 42836 64073 41200 32253 44117 54971 28183 21782 27837 13934 -76814 -85011
13458 -85011 -51989 -19359 -19706 -20917 47591 139247 88183 68000 67739 44552 99503 151473 220719
13445 220719 195055 149806 156977 183498 141160 166450 113277 79249 61366 64908 120485 207024
13433 207024 182677 173303 179472 114418 112411 111812 137352 124764 120448 45734 -17006 9121 62323
13420 62323 23414 40220 128951 161123 114904 94399 115049 49213 58897 30096 42783 38866
13408 38866 -5648 -87148 -56915 -30325 -26611 -8043 -12922 76482 27940 80646 139114 79320
13396 79320 68324 64718 82482 30706 33371 8757 -40916 -10978 67988 106226 90354 94473
13384 94473 116847 96291 130388 148239 68158 20166 7873 31712 18830 63556 119853 137163
13372 137163 147386 178791 138003 22500 -9753 29833 93041 70425 45689 40530 80712
13361 80712 77991 104370 93440 74133 69541 89698 88322 82217 130210 135011 127627 146519 108692
13348 108692 85137 49409 51091 33911 28083 60958 26262 50949 52107 67064 54378 40621
13336 40621 1328 75989 81115 57441 48042 31247 111504 100088 35590 30405 27683 80457
13324 80457 94506 58377 54424 46782 764 78115 112803 62890 -24727 -8100 31911 54359
13312 54359 125118 114427 62215 72364 108767 110978 135732 144935 152933 166593 172456 92078
13300 92078 26471 2565 52873 65349 57321 40274 79852 70950 59764 78821 124720 164648
13288 164648 148584 141652 164734 159291 181842 179515 184895 79981 11681 34545 76689 84555
13276 84555 134477 97461 70194 93842 109866 103916 122280 181077 187465 199290 190292 116168
13264 116168 101713 122699 99496 138687 147416 100859 111562 74714 81284 110862 76693 26820
13252 26820 31761 72202 155424 155413 115578 140033 102878 150911 145380 26397 62545 112002
13240 112002 103329 102372 151996 176716 209409 127525 61947 63412 84671 106418 102446 114107
13228 114107 108240 132841 137827 144028 123240 139740 154133 116585 79038 90443 85343 97499
13216 97499 124000 130126 120379 106657 97041 138779 225209 224537 151422 160968 113132 161436 193379
13203 193379 217497 233196 234944 159307 108380 125999 74577 21746 104690 79334 51737 104630
13191 104630 191357 211573 238303 262547 218368 191555 191044 170113 147928 145061 145653 146455 113873
13178 113873 94019 190864 230108 212977 121767 57433 103584 97525 47657 57543 74628 139211
13166 139211 158392 158636 165181 115363 110586 60073 58834 72001 129046 148609 134491 135946 204817
13153 204817 253550 260911 267312 244403 282703 337786 253143 268659 326490 300465 343676 445680
13141 445680 576378 673387 774837 966395 1248017 1500090 1745448 2012655 2344035 2449997
13131 2449997 2233736 1955984 1581450 1239776 976082 814210 665142 555131 488386 446536
13121 446536 418181 415018 376938 302417 280204 296509 276674 322658 326617 308870 259228 218661
13109 218661 176056 157140 195528 246975 220663 191603 228679 194094 164892 172142 208647 173588
13097 173588 176163 191400 139791 132487 201814 226067 230452 133826 111875 172001 236339 223604
13085 223604 205397 199682 152331 120741 81649 67222 94568 139051 174236 185305 227254 242194
13073 242194 209884 254403 320298 375659 318003 274264 195145 130923 73353 63696 91563 173422
13061 173422 196687 133267 108194 159427 165570 173992 236451 203607 97904 70026 49407 62284
13049 62284 99886 161782 199371 210107 203497 209990 173410 174264 97330 63358 123202 182330
13037 182330 166564 160543 211497 192512 202510 242231 358972 455336 596324 665350 715904
13026 715904 711443 594472 497554 438548 372828 332286 294745 215104 165515 166287 128519 139926
13014 139926 216469 224967 187551 233357 309616 299212 233050 149741 136691 197308 222177 326067
13002 326067 416367 336779 264551 306407 212961 179476 169882 243165 267814 339469 368291 342122
12990 342122 266439 216657 310950 318962 339567 357721 488696 623928 721233 711533 652238
12979 652238 592247 559371 466836 341062 334323 355630 382880 388099 356826 355866 342485 304501
12967 304501 270310 333888 388092 313129 269488 307720 281174 266815 319711 329735 297432
12956 297432 328496 311523 339349 354724 342598 347812 394711 320040 278811 347203 430840 473175
12944 473175 504976 545527 472964 467041 407354 358819 422654 468382 465033 492816 472269 422555
12932 422555 338461 365597 447417 419154 348818 332728 307677 274181 251569 181877 191941
12921 191941 207829 267654 331825 350462 366407 382763 467934 480315 385354 339474 412404
12910 412404 393359 362383 346822 280795 276946 353109 377830 368095 416964 375506 318509 332273
12898 332273 344398 376187 405638 421276 396791 415215 415656 420111 413263 403645 436709 424492
12886 424492 426038 438471 457628 470286 399030 355068 387748 489016 508627 451953 431446
12875 431446 447759 447569 421053 484298 578166 570404 531590 496470 503758 571241 613533 650143
12863 650143 581190 597921 602823 584607 559649 588791 607695 656264 655233 704373 744594 735527
12851 735527 708511 692337 745201 763931 718593 645494 578626 530646 534166 610027 667452 711681
12839 711681 736568 717935 713017 719873 769207 839536 882342 914735 961387 1086458 1075321 1115102
12827 1115102 1177741 1235565 1274988 1185805 1183341 1149411 1129308 1062278 961543 933885 900935
12816 900935 924334 960551 1051206 1092606 1130000 1167963 1126096 998823 794824 587213 456622
12805 456622 548190 609681 564781 575013 734321 800591 824855 859678 839336 895349 928846
12794 928846 863587 837386 815552 880636 1011283 1094916 1151093 1225674 1328292 1301576 1289052
12783 1289052 1297757 1328401 1331620 1335802 1326620 1294109 1244299 1251612 1261921 1337362 1340519 1326801
12771 1326801 1307535 1413121 1456608 1667667 1850834 1972817 2217640 2403429 2454423 2318721
12761 2318721 2132859 1981977 1912972 1836915 1728488 1719730 1712458 1723864 1725881 1706768 1712578
12750 1712578 1695914 1731302 1790534 1840364 1860685 1921404 1960752 2063015 2171862 2155471 2166254
12739 2166254 2153977 2108123 2139004 2204487 2211866 2184256 2242594 2271856 2312323 2351785 2375162
12728 2375162 2408165 2492918 2584555 2622565 2602127 2642600 2805386 2963210 3080359 3309298
12718 3309298 3446903 3562168 3693643 3811608 3952223 4077825 4221935 4446897 4726703
12709 4726703 5007412 5280230 5488468 5697831 5907000 6222699 6599310 6993180 7430529
12700 7430529 7843088 8342019 8963500 9486757 10099550 10827842 11759644 12857692 13870367
12691 13870367 15042820 16489839 18210847 20204764 22461769 25139665 28421022 32391728
12683 32391728 37111642 42795477 49398254 57472542 67830857 81689544 100369574 125876071
12675 125876071 160776213 207706552 268520162 342758302 424000211 485270874 479856673
12668 479856673 418289477 334272238 252361697 188708037 143536762 111703895 89046415
12661 89046415 72645823 60521540 51499733 44522700 38687604 33548492 29059682 25279360
12653 25279360 22025307 19365601 17112887 15271954 13700554 12434206 11373116 10383736
12645 10383736 9421538 8657095 7918698 7267447 6730551 6224290 5814626 5465510 5085383
12636 5085383 4710671 4378893 4104467 3884145 3698462 3498258 3375118 3226236 3050928
12627 3050928 2937225 2833618 2735383 2659453 2564784 2466818 2382068 2275554 2169414 2083531
12617 2083531 1997090 1854337 1762974 1649079 1583120 1498182 1451179 1476391 1402127 1266280 1154416
12606 1154416 1139760 1191577 1190784 1140914 1054390 997813 974539 1013777 979131 866345 822609
12595 822609 857595 885749 885001 818436 820749 863309 780284 751798 817458 833950 849411 749793
12583 749793 681615 608799 588064 624690 646004 636510 650944 609527 543444 587488 581231 578699
12571 578699 548550 497813 511073 499789 531371 550940 529530 541375 606528 598839 593808 581633
12559 581633 625447 603836 642803 641787 594336 595104 582098 492794 497856 599688 622362 560449
12547 560449 587750 634079 653789 657393 615795 644380 621903 631685 728058 725977 694834 746270
12535 746270 728493 751861 684068 560015 394296 230277 105224 85169 125135 190180 239358
12524 239358 251810 238796 167551 49923 -25475 -45547 -117517 -179852 -220223 -275183 -281791
12513 -281791 -269856 -280325 -318248 -318628 -298366 -311092 -247069 -183142 -147830 -160717 -162113 -124570
12501 -124570 -117978 -96595 -145342 -120414 -109568 -117783 -117837 -95070 -71414 -57730 -33707 -33506 -54346
12488 -54346 -86694 -104533 -112599 -137217 -140656 -162084 -127570 -68530 -7793 42395 61568 80872
12476 80872 -6942 48414 45076 20670 49713 -19442 64604 159041 184092 97846 43802 66982
12464 66982 104140 105621 107997 122758 101858 98846 54423 32427 23027 10697 53274 31789
12452 31789 39263 707 10915 91266 127504 178983 193974 130251 111638 75336 58075 18519
12440 18519 68188 69733 56344 55049 8741 89622 147020 137291 120301 86119 79869 52345
12428 52345 30373 56601 131930 154190 125630 79227 80827 99325 111644 123468 92694 78550
12416 78550 23802 -92553 -65303 81500 146776 174342 190913 111171 56553 70822 130795
12405 130795 148699 169855 190109 168730 194653 235869 198815 68895 38265 137535 127316
12394 127316 108264 84999 80233 62722 38776 33777 53078 144822 228627 237602 237536 234649 218547
12381 218547 204834 240554 199701 92164 102254 140709 222230 206814 233209 262716 187787
12370 187787 81123 56663 45809 2495 -20449 -22000 16415 87108 169628 163739 137393 125335
12358 125335 100691 102622 104228 117721 73794 110847 163456 167590 118530 130261 182136 205772
12346 205772 176859 216349 201908 145606 113630 181998 283293 272699 148856 76696 39330
12335 39330 12980 -18451 -83543 -45292 45321 74456 94372 68485 54376 80300 100684 176719
12323 176719 214095 194992 188863 199450 228739 202314 82558 79091 149310 208504 190690 182907
12311 182907 189878 200937 251144 287164 247390 184583 130092 134658 180821 122768 102810 130233
12299 130233 212673 253254 239046 192806 188472 186666 259557 258344 186478 162302 150574 152826
12287 152826 203058 263074 220693 209052 269828 243397 226451 165656 184573 193520 154344 108390
12275 108390 141121 231683 248577 215386 253806 305451 241404 169967 201104 272186 247706
12264 247706 221156 253529 272528 238295 209352 232959 212336 205550 248528 184269 153546 138095
12252 138095 173610 218830 207533 129368 124554 176327 228446 211116 177097 219800 220730 177820
12240 177820 256966 279652 285982 269822 275761 296449 277149 258094 189482 185016 212050 221565
12228 221565 252669 254858 223756 242176 338257 377217 428012 393835 293967 282415 316852 366363
12216 366363 364075 347758 404761 401004 504304 560017 601783 641427 658188 728330 873541
12205 873541 982141 1099516 1325433 1702039 2124774 2426350 2651054 2630217 2341311 1989358
12195 1989358 1629857 1338354 1116459 962261 814656 746158 671004 625058 583167 515726
12185 515726 434842 453103 525015 522123 488621 420179 496166 545262 538955 551668 499404 462070
12173 462070 443124 450169 494847 530952 508400 504649 519112 448607 429990 469788 514274 532000
12161 532000 570027 532624 487953 495361 434508 374148 390757 444876 498488 453594 470217 497253
12149 497253 516633 542075 542856 465594 481716 495155 539214 563982 553907 493528 426127 430338
12137 430338 464329 529558 554728 524299 506614 528484 535656 597308 632894 594580 545014 550565
12125 550565 517466 567632 521800 501248 515979 539981 537594 536984 540505 515155 468777 509666
12113 509666 546683 586449 592547 657680 667156 686131 641100 611193 589198 644698 698851 695535
12101 695535 630164 662007 694113 671824 639847 613314 597136 650935 708120 753673 809456
12090 809456 756292 737788 757778 816854 804876 834945 907987 920862 905021 899793 878623 937278
12078 937278 961566 914409 909766 953713 986129 976426 941981 958362 990402 1038458 1017091 991124
12066 991124 1037016 1043113 1020584 1075586 1117003 1118916 1064513 1097551 1103427 1090723 1105350 1145633
12054 1145633 1186320 1239534 1225783 1237472 1284855 1313969 1334038 1360546 1385076 1443325 1492551
12043 1492551 1510343 1607894 1738633 1831209 2002939 2051100 1999374 1817020 1637653 1575806
12033 1575806 1575940 1565272 1605433 1618401 1623084 1634391 1684730 1684426 1723954 1752044 1694431 1792188
12021 1792188 1804670 1776512 1801789 1882080 1893016 1861925 1855698 1963088 2041878 2040115 2073577
12010 2073577 2199901 2284892 2281352 2329802 2451938 2517982 2461640 2469499 2462892 2449364 2453443 2421763
11998 2421763 2454276 2529872 2678693 2748568 2730065 2828999 2934675 3033383 3075474 3128512 3206147
11987 3206147 3205652 3232780 3282308 3340300 3400832 3555499 3724806 3815486 3851860 3973664 3992402
11976 3992402 4013438 4129147 4263377 4313867 4448924 4669204 4797787 4859865 4939212 5066618
11966 5066618 5217549 5303421 5442638 5568177 5652980 5819327 6007885 6165520 6347634 6516832
11956 6516832 6654177 6817775 6995033 7203626 7374406 7570071 7801009 8001410 8220750
11947 8220750 8477085 8737170 8934134 9119498 9371039 9728277 10015846 10265431 10468483
11938 10468483 10667220 10952229 11285286 11627754 11937827 12219290 12610197 12960620 13218366
11929 13218366 13513270 13888614 14176538 14478089 14768184 15126599 15516697 15757319 16036140
11920 16036140 16322469 16594238 16885649 17116138 17335685 17532350 17680890 17863653 18074762
11911 18074762 18202609 18261277 18341988 18391259 18396368 18341112 18279287 18129015 17953165 17862035 17757135
11900 17757135 17589588 17364650 17121788 16892658 16575203 16229789 15956439 15663796 15428942
11891 15428942 15195969 14883544 14533967 14169512 13849101 13575134 13214815 12852334 12470702
11882 12470702 12060723 11723561 11421956 11124718 10888246 10637496 10360774 10092232 9830233
11873 9830233 9534729 9273270 8990006 8712809 8495448 8222705 7899014 7636252 7434547
11864 7434547 7226959 7071957 6887045 6676284 6489101 6335906 6229548 6090751 5946408
11855 5946408 5760052 5585994 5412618 5294640 5161782 5045852 4971921 4858444 4683288 4545023
11845 4545023 4489988 4417949 4266241 4175266 4057917 3929450 3855230 3784915 3688678 3562791
11835 3562791 3451160 3363520 3245763 3209190 3183157 3154255 3100605 3048180 2973494 2864763 2828150
11824 2828150 2732550 2590974 2502166 2423752 2439658 2437273 2391392 2309427 2239579 2201960 2167508
11813 2167508 2065912 2050118 2066885 2069905 2043363 1976364 1846818 1726652 1689211 1757048 1784159
11802 1784159 1782759 1728910 1622140 1650979 1649279 1631879 1564574 1500400 1454904 1392768 1361428
11791 1361428 1371180 1413236 1352920 1345394 1254252 1261506 1292329 1311478 1307531 1220488 1135770 1092769
11779 1092769 1046065 1040451 1042860 1077111 1053822 1098886 1065124 1023241 1027954 1044404 1005616 992042
11767 992042 996564 983083 942954 894393 867364 871445 857231 905447 852104 874388 862310 896925
11755 896925 893303 895649 871745 800782 739609 735718 744890 695409 654158 707545 743759 733578
11743 733578 720238 711716 648342 645751 625150 569579 545021 507490 528780 567846 642444 669431
11731 669431 682251 697929 716209 666362 612626 620933 585058 548671 512256 515532 500614 560890
11719 560890 604280 562272 441559 459130 568195 571305 534059 527595 455259 429990 448029
11708 448029 507460 491375 460285 462316 455342 452254 470596 432161 439369 445219 399070 432938
11696 432938 439745 443389 466392 483160 460672 415638 372841 316902 363623 374090 347436 348473
11684 348473 409833 440336 425115 331825 291180 341812 379896 328746 289241 289504 224461 163231
11672 163231 178120 189549 223752 345218 395611 365498 352543 358835 376239 406287 447679
11661 447679 446420 391802 332055 315841 318795 284422 347568 346244 337610 346082 347125 271264 243348
11648 243348 243102 273496 288475 299616 325363 314619 271298 257471 245078 250319 216190 189090
11636 189090 189957 161249 121354 134131 125493 155429 183982 198685 156555 107531 120091 139223
11624 139223 148171 143110 114401 115641 145793 187463 227639 256501 221166 245994 227722 179721
11612 179721 216558 264686 229891 186163 240801 301261 283487 286882 256603 247503 184903 150275
11600 150275 94950 159062 146877 82238 65365 83126 114485 120595 94263 97499 159779 227760
11588 227760 206558 184041 182174 186020 160137 193128 234734 220869 199757 164340 96564 37930
11576 37930 58592 71675 108515 149029 92153 42251 107514 146290 227133 227545 178383 155959
11564 155959 100994 56233 71396 80581 133993 159080 124089 35555 70036 94239 61881 50551
11552 50551 40788 44074 65636 119572 124254 123966 135367 159579 125685 86298 59509 69001 -26256
11539 -26256 -42372 7810 33319 26676 85986 113995 94306 116978 93157 146144 159745 122735
11527 122735 50984 -13220 4875 70485 55874 31279 81500 138334 153419 108900 76703
11516 76703 72885 79420 125777 142032 178159 225642 220007 243512 202035 100745 53083 47771
11504 47771 7781 25353 -1706 1133 26802 14473 63110 74742 56722 88893 83553 17095
11492 17095 49350 102763 78239 47840 104465 57521 30677 94906 133576 137074 175762 197832
11480 197832 142419 105317 130513 63106 14709 21304 32153 106891 144643 192934 177374 123360
11468 123360 82937 90132 121673 126030 104054 86545 153862 189417 179922 137099 163872 139527
11456 139527 71321 15994 47302 100601 154319 169194 84272 23914 46346 81511 73758 72686
11444 72686 70179 32995 69432 150524 164739 148572 94621 49081 15006 33186 63753 90689
11432 90689 61077 24174 23481 32053 74051 128805 161408 100160 60793 39985 72174 48651
11420 48651 8006 -15261 -2823 -24264 -92418 -60454 5254 59083 98957 66596 1874 -32456
11408 -32456 12787 70438 48728 47466 103367 108724 103310 66914 69512 72142 57378 31669 80318
11395 80318 65445 -11741 -14549 -19668 -21163 -7223 65238 90750 79395 87315 118214 135735
11383 135735 144174 124260 207602 228358 260405 190018 131727 55365 40305 68387 88067 45230
11371 45230 4831 36013 98991 123679 120097 96587 32233 -1381 31179 32334 47324 19092
11359 19092 17385 101731 121711 105536 85616 10843 27996 100969 112864 67173 39158 85937
11347 85937 91861 86208 64408 68175 34993 29530 84423 25358 -36052 -70885 -40609 16297
11335 16297 91825 45410 48370 6195 10189 71128 69640 47107 42887 72192 91324 48085
11323 48085 105828 136893 100383 40977 -5157 6554 -18441 -18883 -10691 -3454 62802 134313
11311 134313 120563 59517 23053 86236 94716 70392 39128 63794 34093 90616 147142 127489
11299 127489 158337 168894 81505 44825 38604 17318 -11185 -12081 -28305 -102856 -174391 -158372
11287 -158372 -85862 -6135 -41294 -100095 -8635 -21260 -106652 -100396 -45795 -6151 4902 21662
11275 21662 41143 1908 -22463 -43647 -46164 -72679 -48661 -26774 -615 18542 51494 61754
11263 61754 88568 63269 21158 26014 50690 50211 34653 -8171 -50732 64413 93414 88065
11251 88065 63925 -23909 -80673 -41078 20503 19113 -26809 -36122 -28962 64341 77845 81978
11239 81978 84555 22028 -102306 -88272 -64959 -43796 24134 8286 -928 52961 48250 28564
11227 28564 42227 -2282 25644 26798 -21021 -57780 -55975 -36380 53738 85976 71563 26087
11215 26087 67 -12708 10290 -20937 -19027 -28150 -39325 1559 66162 26897 -26211 -63073
11203 -63073 -18335 30795 24296 23283 38632 11848 -7270 33137 51336 128478 132794 68857
11191 68857 88098 73773 27469 26045 20941 30583 69206 88713 127077 121956 137536 79720
11179 79720 -28190 -35007 6089 104185 158514 92137 72639 108816 60182 73886 129436 170562
11167 170562 126121 179884 159646 138863 90307 51289 -2299 113 -2006 -929 -11200 7739
11155 7739 28319 16544 -20936 -72943 -27879 -31416 -39170 6594 63764 72687 108846 171910
11143 171910 96165 16155 22782 -5088 -26493 -17653 -41805 -44284 23823 23965 97298 150360
11131 150360 182735 189140 127846 68083 13740 23261 68771 51803 36134 65736 79546 78400
11119 78400 46600 59882 40810 65546 84493 151819 157019 123625 96916 19026 -34499 -54100
11107 -54100 -59838 -37002 -50802 -22118 -23689 13085 51675 43065 -13439 -72535 -59352 4381
11095 4381 26749 61268 69479 60933 36655 -33276 -37706 24782 76197 89487 103932 87330
11083 87330 58744 115933 140135 98690 59849 52253 40283 25013 66716 44656 22969 60196
11071 60196 54952 66757 46127 18008 50170 166571 179139 100484 32322 44055 57863 100718
11059 100718 132585 92239 80215 104411 95729 125322 111020 132907 167113 164622 108689 108065
11047 108065 73490 102912 82541 154358 145820 192131 148001 139405 172953 188514 210604 288538
11035 288538 325355 362180 434578 420769 354909 347698 319151 312947 306792 290274 331165 370451
11023 370451 390018 392957 432137 487247 502323 485907 453882 418522 380963 368205 335363 306524
11011 306524 279839 324442 393760 475161 457477 455182 366259 227505 214904 244379 279525
11000 279525 283868 299199 264019 225450 176423 120955 161952 95348 86916 104257 116289 80268
10988 80268 15924 -26803 -33642 -81578 -80553 22396 84374 175667 179335 130829 118092 128739
10976 128739 73133 34853 50057 57779 49063 35621 60603 45193 19689 54732 57151 -4896
10964 -4896 1385 129410 144119 40340 7203 26268 64737 59562 74893 168838 143495 160449
10952 160449 147704 81952 10569 7326 60142 40208 36632 43572 89675 114462 47194 7649
10940 7649 72909 114782 102395 101708 113233 96563 73954 76289 54380 53832 56111 -25183 -39849
10927 -39849 8431 47662 80537 133825 122113 146822 147441 108877 94255 79280 68805 102377
10915 102377 105650 45393 45100 56591 64149 59471 56766 81586 116452 124552 162121 130347 105588
10902 105588 112094 141087 121475 45311 39982 45594 84835 89109 114492 210747 195113 165855
10890 165855 157723 141131 113781 79084 56031 53113 149270 192078 191978 161084 143824 174335
10878 174335 176947 96751 69338 46504 68351 98337 192483 211039 227521 185025 134141 150568
10866 150568 211935 131850 19536 57691 80331 113450 119820 148844 78889 11843 31474
10855 31474 90175 116692 115139 65006 102401 143656 99287 45213 -6878 -8746 75439 162355
10843 162355 185094 146459 91099 109687 87315 68398 70529 47284 10983 -1037 50481 26576
10831 26576 43442 95546 127397 108090 150509 171250 132768 89014 102370 142600 107559 52492
10819 52492 147170 207897 182405 147074 101534 118480 182018 165765 138914 116523 90185 67804
10807 67804 117650 166924 155016 190223 163634 162668 155601 184559 184972 200240 195883 175117 181483
10794 181483 146208 168953 183741 182643 248099 250986 268451 274819 261797 175174 76872 74508
10782 74508 87845 129554 233418 236715 155109 69890 127659 182492 234775 288961 301513 289794
10770 289794 192542 187436 193400 215038 233367 289982 307069 333776 343971 349431 367390 342191
10758 342191 343948 380824 401360 386502 382206 413609 442494 372911 306612 345789 404384 389661
10746 389661 336584 342039 376938 439026 509174 439882 388643 353555 359488 357797 364887 331447
10734 331447 325891 355449 404432 449028 492288 461014 367894 351017 344402 306656 348311 339719
10722 339719 306727 293541 299223 261071 260100 290551 253051 221768 223022 218549 225193 221081 220315
10709 220315 216001 248142 275896 317644 303483 266283 263150 300615 289662 306969 359228 289058
10697 289058 314860 335724 391924 421716 434567 405649 355849 426636 487709 502440 506308 468279
10685 468279 466243 491416 513465 506496 535037 607945 641533 641498 609223 589958 647684 664149
10673 664149 521406 446472 503793 598062 636101 612831 638475 581970 638175 678209 728007
10662 728007 778145 786344 741760 787442 851159 927677 936164 999402 1028776 1042974 1133281 1201628
10650 1201628 1207806 1239980 1229376 1239507 1306822 1386332 1359780 1415968 1484058 1505072 1571539
10639 1571539 1681744 1750887 1898420 2174755 2334910 2439889 2558724 2727590 3005774 3255618
10629 3255618 3427693 3733121 4164098 4541882 4991419 5538103 6253393 7150981 8359726
10620 8359726 9911906 11931563 14496301 17624487 21186928 24992408 28378427 30618936
10612 30618936 31372965 30939857 30284473 30167880 31064727 33299054 37041687 42262087 48858332
10603 48858332 55914103 61791687 64478511 63309583 59752257 55790240 52870955 51971113
10595 51971113 53641878 57686745 63956200 71897051 80130456 85867060 86415137 81575924
10587 81575924 73436189 64633685 57495334 52854374 50860879 51261765 53609299 57213386
10579 57213386 60866129 62682477 60903901 55599281 48408466 41232487 35442304 31364629
10571 31364629 28901205 27885024 27955425 28517852 28987947 28570481 26722227 23551963 19659084
10562 19659084 15830772 12559126 9911102 7906258 6446651 5352935 4533115 3826574
10554 3826574 3285570 2920358 2573327 2241657 1945121 1682863 1495238 1330110 1205135
10545 1205135 1062360 990962 980467 904711 840737 710889 622972 511017 473572 404202 347686
10534 347686 303866 339444 365246 307036 235345 196114 171167 164631 169029 131548 113268 122730
10522 122730 173636 174252 169750 128306 75261 51597 -10342 17631 43237 -10348 -36986 4815
10510 4815 6779 -12654 -10141 22426 8759 6558 12219 66157 101763 123537 86383 28275 39730
10497 39730 64416 25623 75481 117885 115790 83940 54144 -30833 -55372 -26466 -5971 -4458
10485 -4458 36830 72979 23904 -46280 -62928 39411 57391 -75230 -105668 -110034 -139257 -76881
10473 -76881 -42124 -11934 -3199 -11735 67058 71112 85746 140896 130667 63888 127129 139869
10461 139869 50951 -22840 -31917 -61163 -91221 -64917 -5812 -752 -3184 59471 43520 17457
10449 17457 -58805 -73517 -104472 -110681 -71906 -83392 -124966 -154029 -135022 -148485 -172730 -188523
10437 -188523 -246181 -264920 -252390 -183976 -118045 -157117 -181156 -199031 -218268 -270714 -222848
10426 -222848 -215388 -209006 -203352 -246892 -262073 -245087 -242849 -232566 -343234 -334353 -208666 -132961
10414 -132961 -166505 -152938 -136695 -155945 -156999 -227743 -325754 -324831 -224240 -138368 -104787 -126310
10402 -126310 -174645 -186461 -203243 -207365 -206839 -201798 -237740 -295848 -270781 -179963 -190835 -238052
10390 -238052 -217901 -184415 -142733 -135351 -188063 -191407 -76702 -57871 -101167 -135592 -117650 -80376
10378 -80376 -117760 -175153 -180868 -142283 -177944 -156468 -167500 -176080 -149657 -138557 -158988 -180545
10366 -180545 -178312 -175884 -133448 -92666 -68882 -94774 -86792 -105366 -118607 -149409 -146609 -177534
10354 -177534 -157996 -157369 -181055 -169302 -166825 -185459 -188599 -197337 -165165 -239582 -241412 -170478 -183899
10341 -183899 -201527 -197082 -154996 -143820 -148310 -116171 -79759 -78263 -85373 -112074 -76488 -56994
10329 -56994 -101152 -136320 -118301 -106470 -172447 -169834 -69871 -64288 -117599 -141433 -96816 -112204
10317 -112204 -141043 -157641 -165659 -68052 -39568 -64337 -94449 -93336 -89195 -109351 -132265 -173529
10305 -173529 -178971 -148559 -155508 -148808 -118455 -82883 -81668 -85282 -77921 -43590 -45916 -35743 -90367
10292 -90367 -83337 -112579 -182719 -213698 -178395 -151748 -117592 -95928 -66613 -88590 -53757 -28955
10280 -28955 9303 -33521 -26257 -37489 -113198 -130196 -164938 -132232 -57365 -42172 -94181 -104648
10268 -104648 -77860 -85086 -8527 -34809 -25091 -81439 -127566 -121965 -162585 -121401 -93946 -79445
10256 -79445 -110738 -98387 -102471 -137810 -121503 -123907 -159949 -196163 -253570 -279865 -189895 -188309
10244 -188309 -231550 -186759 -120164 -169447 -121961 -48679 -78928 -62574 -55136 -86911 -45213 -120561
10232 -120561 -201400 -121714 -81810 -78928 -51346 -81602 -117750 -120102 -100241 -58214 -22554 -12314
10220 -12314 -58375 -83855 -98782 -66195 -113754 -88919 -30418 -49560 -25197 -71387 -82976 -77809
10208 -77809 -3104 9484 -19213 16251 -18823 -79320 -65150 -69706 -65387 -106042 -121182 -57025
10196 -57025 -50054 -69895 -111958 -126307 -99754 -127233 -115815 -183355 -232527 -121356 -27077 23305
10184 23305 -11407 -38440 -42783 -37582 20767 110520 168936 162263 199414 112330 58864 63497
10172 63497 32236 71751 97556 111367 127697 155329 185250 251807 247697 214347 219667 179066
10160 179066 164675 130908 139907 226429 312259 380069 448131 472878 432149 373882 365886 387802
10148 387802 309257 311157 312632 252331 187827 250893 227910 209555 249394 228818 201082 169256
10136 169256 179990 140839 196873 152760 108873 124036 111307 36460 4611 56598 57539 -7515
10124 -7515 -59359 -116560 -58978 -45156 -92608 -80468 -99631 -111765 -125346 -83788 -67637 -24211
10112 -24211 11251 5148 10232 -24933 -68759 -35102 -26985 -74557 -51926 -52855 -34694 -7497 -49556
10099 -49556 -47139 -62565 -89063 -80178 -95537 -93665 -132005 -176144 -99610 -99969 -213291 -170440
10087 -170440 -101246 -151403 -192054 -184711 -146889 -98395 -87703 -30438 15214 -11198 -95780 -101244
10075 -101244 -107157 -103738 -83170 -45665 -25785 -79882 -110748 -166312 -148457 -108011 -105646 -73723
10063 -73723 -78804 -146019 -110020 -99936 -132581 -194149 -258474 -247091 -230481 -184450 -124014 -82163
10051 -82163 -66534 -106109 -158843 -124627 -81655 -68811 -42655 -29775 -11278 -56811 -64630 -69152
10039 -69152 -107658 -85928 -112572 -149409 -173117 -138806 -53231 -6344 13567 9525 12182 -20617
10027 -20617 -95099 -160659 -94559 -150545 -136710 -89747 -79372 -65775 -64876 -94948 -117378 -116298
10015 -116298 -130691 -117055 -118471 -92820 -56777 -33526 -62398 -139032 -171410 -133708 -115872 -185075
10003 -185075 -163616 -123462 -131268 -172798 -187767 -151153 -112966 -17519 15482 -6009 -20726 -116751
9991 -116751 -103177 -45601 -15608 -10572 -8512 15787 26544 52221 -8134 4324 26853 -49065
9979 -49065 -118282 -100635 -45230 502 18629 -39579 -78642 -90966 -95150 -163357 -133182 -101271
9967 -101271 -51277 -25131 -45318 -66056 -40670 -64248 -125741 -130598 -121571 -53556 -861 2062
9955 2062 -33474 -45719 -71175 -81845 -85590 -92707 -140142 -202621 -143344 -87661 -77321 -106720
9943 -106720 -97164 -88304 -100728 -114531 -116363 -98776 -82323 -78340 -96946 -132708 -94958 -52286
9931 -52286 -60124 35572 60591 21453 -69359 -75693 -62188 -60197 -92513 -67743 -47341 -44803 -86152
9918 -86152 -96025 -71915 -43707 -12243 -117700 -179779 -186723 -153433 -114548 -99472 -64712 -63315
9906 -63315 -105886 -172155 -153904 -103708 -151062 -151677 -31974 47899 120718 57190 -34496 -40973
9894 -40973 -13098 67461 48031 -70717 -124385 -131902 -66428 46996 58764 -62624 -67565 -19915
9882 -19915 -57772 -85567 -95601 -91888 -149754 -141967 -92398 -79700 -125849 -91613 -80173 -53775
9870 -53775 -40755 16055 41358 -35475 -101851 -53369 9272 5266 -2408 -8026 -68816 -39733
9858 -39733 -29386 -88117 -155585 -181051 -93538 -52039 -69054 -60868 -94577 -111469 -43880 32797
9846 32797 -10419 -82973 -98353 -119682 -138043 -147048 -179847 -116509 -16053 57953 5373 -24180
9834 -24180 -91581 -127677 -174295 -208931 -191069 -190395 -115854 -84592 -42442 -13263 -26915 22859
9822 22859 42929 10195 -49766 -94745 -121916 -167303 -162885 -78323 -103368 -68562 -29555 -29740
9810 -29740 -81773 -69490 -77295 -99405 -98447 -80117 -68133 -81082 -118727 -125821 -96761 -43368 6160
9797 6160 42782 -4603 -47186 16730 86331 117958 133389 80497 25499 10052 47342 182856
9785 182856 221162 226473 270324 291624 325070 486030 712321 1041391 1529577 2022387 2236974
9774 2236974 2046659 1603322 1180973 774520 467351 320193 226116 154879 121177 145844
9764 145844 148490 84803 39305 -12876 -50229 -61731 -24089 -4815 1177 29387 104857 85740
9752 85740 70885 30090 -43232 -73181 -46727 -36897 -65851 -73901 -89399 -72273 -87559 -84644
9740 -84644 -52583 -50983 -48665 -58249 -25458 -23280 -45605 -5416 -12981 -28515 -43154 -79003 -67279
9727 -67279 -40293 -51455 -82744 -118877 -103490 -110285 -97565 -97711 -11526 13154 12814 -3004 -37027
9714 -37027 -60757 -60709 -43593 -32419 -39690 -101865 -102677 -68326 8357 51441 -9564 17179 45147
9701 45147 -30031 -65636 -62588 -48470 -53747 -38220 -24322 -21345 27605 30711 -11684 6871 -1309
9688 -1309 -4938 11376 -2182 -4621 6394 25547 18008 -1887 -50496 -40229 -34184 -32684 -6295
9675 -6295 -15525 -30960 -54073 -68774 -33802 18797 -29023 -77940 -118392 -134668 -91559 -39755
9663 -39755 -54287 -98260 -71910 -7907 47554 44377 28470 42751 90293 110285 97848 149034
9651 149034 164200 164779 187251 127160 3459 -83139 -158792 -125141 -130453 -115728 -81018 -183635
9639 -183635 -175459 -150334 -113682 -52098 -64813 -32176 -14405 -74277 -44352 -28641 -30827 -74996
9627 -74996 -80554 -81881 -107273 -82042 -29057 4047 5545 -20604 -77475 -100511 -72749 -91294
9615 -91294 7473 16186 16738 30848 -8728 -81204 -114092 -160823 -155424 -108269 -189481 -168571 -71795
9602 -71795 -59671 -103030 -85789 -909 38798 10045 -17437 -46369 -51746 -25202 -37487 -38892
9590 -38892 -76502 -61004 -54260 -22596 -56002 -87820 -92491 -99707 -135103 -155068 -131842 -130063 -124118
9577 -124118 -129380 -112152 -89195 -74392 -55907 4975 19404 -7024 15042 -24097 -95446 -130670
9565 -130670 -105325 -80140 -75894 -62781 -36274 -18337 -29245 -72877 -128129 -101038 -59312 -38672
9553 -38672 21440 52731 15371 -10318 -5914 56721 71075 27249 -14956 -93897 -100277 -56033
9541 -56033 -22648 -7284 -85431 -137379 -185920 -197316 -114075 -62218 -70210 -118759 -165037 -141469
9529 -141469 -110291 -43842 -71776 -78238 -75674 -68439 -79598 -117 9817 15110 -12410 8419 -25377
9516 -25377 -6511 -39975 -109657 -53008 -6565 -18646 -22538 -30375 -77311 -13622 1364 -29135
9504 -29135 -73893 -111482 -96179 -131051 -142279 -77111 -53693 -78023 14083 77826 39359 73697
9492 73697 98467 92727 51256 18633 20980 -5728 -25724 3932 35655 42440 31822 45431
9480 45431 100436 50459 -44189 -80860 -26093 -36284 -52175 -66785 -99632 -125483 -108239 -117530
9468 -117530 -136513 -124781 -114856 -128542 -194158 -165976 -100909 -49305 -44919 -56286 -44105 -49476
9456 -49476 -97763 -91645 -111783 -105008 -88917 17457 12648 -15889 -15619 31667 6188 -42637 -110223
9443 -110223 -211710 -212916 -168964 -138883 -55716 35313 99241 85396 52729 -27260 -83274 -63069
9431 -63069 11694 31324 -9011 -43439 -57958 -8534 -7246 -33977 -28086 -49375 -39540 -38876 29925
9418 29925 80813 27921 13514 -21213 18310 96085 78948 14343 14675 14566 -1573 -62924 -72790
9405 -72790 -64295 -87094 -81343 -121880 -119960 -65822 -64602 -46428 -72773 -102462 -102253 -155298 -233447
9392 -233447 -235706 -122837 -128618 -149315 -91966 -25252 32619 -26974 -59151 -27309 -57617 -22059
9380 -22059 -6644 -78352 -90560 -36054 -30438 -60358 -57695 -40441 -9183 -21376 -21689 50841 28286
9367 28286 -32044 -12747 -29033 -59583 -29328 -29468 -11630 -572 2038 -6573 42097 -9462 -39412
9354 -39412 -19252 -28770 -96650 -60409 -33202 -31085 -14667 33212 11669 29767 31319 9109
9342 9109 -42474 -142630 -127114 -81136 -32269 -41358 -104328 -65256 7892 48365 -5110 -63197
9330 -63197 -96928 -61246 10023 50473 -5360 27153 -33962 -58323 -86606 -155929 -75311 -41531
9318 -41531 -96430 -110673 -22131 27117 15765 13864 29282 62989 -17908 -33160 79373 72279
9306 72279 -17290 -22901 20224 -37919 -38191 -42371 -437 -58746 -71874 -106200 -100009 -76605 25743
9293 25743 29630 13076 47273 87780 36763 651 -69181 -44636 -15551 -29864 -13071 -54226
9281 -54226 -28119 -1141 -41103 -86037 -78093 -89350 -93043 -20212 -2589 3670 30122 -38100
9269 -38100 -50560 -28112 -25691 -31215 -67784 -108837 -73021 -7379 -11291 -3049 59726 35603 -13365
9256 -13365 -27280 -10053 68017 21710 -41198 8629 -22203 -58926 -44266 -63619 -46673 -3542
9244 -3542 55759 36990 59200 98539 96991 42870 -2833 32558 19289 27967 64138 -14890
9232 -14890 -71294 -95045 -111918 -123004 -126534 -158921 -124653 -74113 -45495 406 68747 74518
9220 74518 46792 17494 7982 -46718 -1735 -45194 -102104 -68578 -88583 -26040 51312 56992
9208 56992 -6140 62682 72355 -7661 -15632 -39690 -20855 33476 34077 19319 -21488 -53498 -76023
9195 -76023 -47907 -33267 -31143 -67926 -31468 -25594 -19781 18557 21979 58266 3652 -37026 -48247
9182 -48247 -51681 -155576 -210982 -141632 -105569 -98119 -89239 -144589 -174704 -121469 -35012 -37825
9170 -37825 2220 4208 -32455 -39270 2670 61119 57228 10818 -31075 -56508 -15798 -612
9158 -612 36326 49887 71261 53442 -11661 -58642 -64065 -58558 1163 63080 109849 117368 81288
9145 81288 105357 139359 119480 61921 -11235 28013 56924 40784 -17780 -71587 -33142 -25747
9133 -25747 -15973 88578 197238 175571 150222 74831 81277 77241 58051 13166 -37001 -111747
9121 -111747 -80245 -17770 -21815 -52239 -32810 -36112 -74802 -84904 -20511 90910 125986 114197
9109 114197 91675 55581 22534 15448 14941 -41755 -43471 45738 99365 61280 34875 20917
9097 20917 30026 -1440 -104812 -149601 -146938 -71628 -44524 -40112 15800 -25710 3898 57445
9085 57445 77706 103576 90364 64298 30524 36419 18489 35101 45632 80759 75894 43369
9073 43369 -9071 -27748 -50078 12684 66352 85072 122291 115977 55957 54585 113773 80654
9061 80654 63571 99753 61772 35588 55572 33091 13757 22929 -33390 -33752 -33661 -32657 -28007
9048 -28007 -1663 -4674 40911 55755 54514 49188 48261 54807 55590 80668 56792 101897 117063
9035 117063 79348 128847 171869 87489 -5115 -21174 -40175 -54747 -9853 25347 78429 68499
9023 68499 96252 35636 24214 74253 120224 138291 97308 48258 6410 -29404 15299 34565
9011 34565 77396 69443 89824 105497 139719 144425 106094 53316 -15965 290 5465 -17637
8999 -17637 10735 1274 -10813 29438 50406 31707 41719 8656 140 -51174 -73850 -42122
8987 -42122 13828 9607 10198 -1079 -10584 -44612 -20086 -12349 24928 11887 -7058 457 22146
8974 22146 23127 75854 127650 144629 105516 92908 70941 39060 67783 95052 69042 117629
8962 117629 111350 88104 86816 76743 99631 32188 46958 93914 76561 75391 102090 65276
8950 65276 84111 154427 92439 70045 75395 122814 50224 31117 68484 62247 34709 36842
8938 36842 89314 94047 20193 -49243 -48210 -7067 -663 12287 61382 133509 131105 100685 84983
8925 84983 48965 44199 69097 108032 113616 88807 101964 28588 14611 16100 29981 -3971
8913 -3971 -14183 -23890 -16052 -22389 -6988 63496 64813 664 -34967 -21290 71140 95742 93567
8900 93567 15027 20136 21428 45101 120984 130498 82759 62466 36999 43355 -11746 -42894 40056
8887 40056 93421 138518 154962 161417 129895 133803 129910 124360 116416 85807 159222 124582 136591
8874 136591 132838 109775 128695 114264 84495 58533 59884 56647 36702 25034 95899 126087
8862 126087 86307 53483 131278 101660 41127 100080 168515 169555 78798 47564 56217 57620
8850 57620 21298 -3624 8343 20420 17093 48211 69607 128401 138480 99069 48538 15133
8838 15133 9656 22851 -14369 2276 17663 -39967 2471 -55940 -106729 -87165 -64216 -37293
8826 -37293 34530 89440 87655 93350 83896 31022 -11285 -4816 -6050 20308 85297 50411 35806
8813 35806 42832 37973 36533 21672 56229 40595 46231 14419 80995 133915 93553 47556 68622
8800 68622 70180 74240 64079 54350 102264 101333 68432 33400 48534 50565 109493 130981 129312
8787 129312 162705 106606 64825 100409 118718 115636 110216 85577 90721 49880 68667 113128
8775 113128 135667 119714 104025 119891 162851 175760 170116 182011 177644 103129 88864 120531
8763 120531 120564 62945 67579 71274 64510 71114 112455 112535 44198 -4334 529 -9112 26885 -5538
8749 -5538 22233 115228 181999 191110 196900 206836 125122 45712 -8742 46802 98479 113107 128318
8736 128318 73465 13385 -6952 19931 58094 101772 97942 110329 195948 172110 51969 90149
8724 90149 178582 198633 179467 144930 133444 134055 135621 105346 -12964 -55112 61142 79264
8712 79264 104071 106511 81444 72758 138247 179171 167731 98375 99951 138250 210620 187716
8700 187716 195934 220830 188849 214276 203727 172171 175372 176137 185120 186899 122529 62596 64440
8687 64440 99056 129507 233711 363623 394345 354428 291114 288517 259795 206056 169233 194261
8675 194261 184959 127041 141391 94452 119311 140860 167104 172541 195815 246134 253354 242565
8663 242565 172602 152159 162062 170298 176925 180306 256438 293367 286858 338144 351674 308531 232692
8650 232692 234748 238487 232652 249667 293402 276165 256532 292323 320834 312693 274302 254387
8638 254387 281926 285225 270093 230758 224001 199138 237774 279644 334270 355798 347349 295507
8626 295507 266757 311430 368847 360202 324183 350812 423310 500213 519401 524320 429986 417708
8614 417708 443110 416911 458217 523847 480823 502188 472165 433890 466789 576694 612187
8603 612187 637251 612047 552362 555958 565200 600062 637864 676140 727951 665256 644834 648854
8591 648854 655113 661289 720744 878109 950589 1035015 1129448 1127875 1210223 1301760 1373573 1441314
8579 1441314 1528722 1629865 1765317 1870652 2010018 2163812 2297880 2350949 2300334 2214630
8569 2214630 2094857 1973638 1904131 1763419 1577071 1416076 1248126 1150526 1073651 919873
8559 919873 840655 840250 739195 632260 585950 589042 584669 558069 453394 464301 475192 487183
8547 487183 464959 458225 462246 392771 335791 290009 263047 318734 370015 395091 443327 507588
8535 507588 490510 429071 530564 654304 725747 776513 814299 762300 639095 486739 395458
8524 395458 400276 397450 406834 479375 447978 338575 245280 259678 249601 227757 237162 187283
8512 187283 200896 217303 218059 230428 197263 136860 104360 166579 206079 180590 190083 231789
8500 231789 281848 283424 243226 247898 271760 317342 319602 324469 362967 350112 370831 473599
8488 473599 595446 724368 935994 1191209 1320549 1227680 1046583 817486 662516 555579
8478 555579 475416 415296 382533 300974 266087 222388 206443 243562 228736 180723 167633 218393
8466 218393 256205 254289 199542 175503 210321 242998 255784 250403 207352 207725 207797 147732 132567
8453 132567 124756 140802 119652 134692 182727 284328 289585 259252 231354 235349 318508 378648
8441 378648 462673 644691 748761 664275 534482 366693 249370 191022 182779 132595 146922
8430 146922 189269 204170 210214 162832 65753 79178 70681 85291 127729 180472 221469 173728
8418 173728 125483 134956 119366 125644 178863 113296 66948 72632 100410 98633 131877 178484
8406 178484 210177 249222 210549 146430 106708 157348 131975 113539 89379 -1393 5104 59770
8394 59770 104569 99906 89350 109159 51451 60329 124428 113647 32269 36699 107038 133230
8382 133230 141588 103642 89097 85254 134242 132180 47651 78010 115726 119855 147497 169467
8370 169467 140644 27531 26284 80360 72807 -7987 8321 87132 148899 178212 171252 134086
8358 134086 130227 125166 77844 73523 58212 -10135 14430 82615 129038 68798 101694 103122
8346 103122 -2789 -11417 -966 25943 54420 88967 129570 116490 102447 128869 205813 132049
8334 132049 103678 113013 68378 69042 120841 128211 166158 108960 31756 12615 -5809 -45718
8322 -45718 -35189 40963 86771 104462 93368 120391 92590 162539 191808 232113 209871 133625
8310 133625 88172 107957 130493 138627 108944 122806 162098 218465 255812 222607 232170 254734
8298 254734 242772 224560 142520 94460 43070 -19233 -23477 22870 81363 44955 29934 -34923
8286 -34923 -45430 -55609 -82930 -21810 63451 101242 75280 113161 177375 267039 227599 113756
8274 113756 22585 -15540 3786 47816 105018 113653 89371 18866 -22882 1997 48434 13320
8262 13320 43780 126557 126293 121029 128071 132554 91364 113917 161682 144916 231889 214703 145660
8249 145660 90100 28979 5729 60362 73914 45619 92187 101278 66176 106929 92442 35363
8237 35363 44276 40986 82174 90566 100594 100210 56843 28202 28041 -1378 13928 2166 -16259
8224 -16259 -11306 -35401 -35012 72997 126328 109730 83102 68758 78102 120590 115226 74669 90918
8211 90918 100938 131950 102131 84064 36558 46398 119292 124622 126267 117833 114608 104109 8814
8198 8814 10711 666 -18082 8335 83203 82198 50508 17255 46518 51741 43242 42444 63398
8185 63398 77696 98994 124762 96563 89825 48929 -23782 -37413 -105619 -78254 -60016 -13699
8173 -13699 34243 55490 83431 55212 9510 -94151 -100490 -35478 37171 78413 60012 58381
8161 58381 19491 -21138 -30205 23669 44962 14710 55289 79212 60093 30224 58785 63427
8149 63427 22123 19122 -16817 27929 125993 54435 53151 17934 1897 25961 16080 57994
8137 57994 133636 105838 48941 -845 38778 76467 58087 85567 77343 39531 -23182 -51093
8125 -51093 5635 44993 67821 75462 114192 95491 76093 101571 95976 70113 15041 -2559
8113 -2559 -5803 27843 148 319 59848 74353 91883 86849 173781 208160 135588 69556 45364
8100 45364 31020 19058 -13833 -34363 -60190 -28472 -9307 16860 42801 89240 147068 164383
8088 164383 130806 27846 7479 374 -12315 -44298 -62244 -14971 41561 79885 79805 66689
8076 66689 70927 117001 163800 218837 236204 188659 275562 271507 212943 110213 95789 115549
8064 115549 175752 190855 218809 209043 139851 61988 119780 123902 170428 171651 188991 221797
8052 221797 269279 225748 221509 182191 168211 115560 117291 123934 129723 146033 146401 148313 172374
8039 172374 95797 148542 81728 55474 65688 56352 77061 127286 148587 201367 256814 171565
8027 171565 115443 126627 224543 311243 338103 343669 324967 313297 299730 260093 269035 188632
8015 188632 198444 261148 218312 114377 155304 216464 228458 219720 215228 301240 329149 386039
8003 386039 449998 412466 456353 473226 433864 353403 243211 238053 280981 330999 372890 379877
7991 379877 359459 360377 354691 400546 458710 507911 600405 664287 610084 596430 547434 594171
7979 594171 593584 560860 573591 597773 674252 671729 615736 605768 599287 583231 546247 499200 423920
7966 423920 425992 467462 436040 382075 371339 365937 394347 339362 286874 246620 275209 293538
7954 293538 328989 341889 335296 298215 328779 417854 460282 441577 414141 398718 445761 463760
7942 463760 488798 549632 567051 547808 547292 507747 531874 615684 636800 592227 531121 489479
7930 489479 412159 317944 345545 400278 376451 351570 272704 216010 220693 256971 274707 260269
7918 260269 242174 216351 241331 210405 185938 209188 207212 242904 189459 216120 216242 187794
7906 187794 203096 186183 212490 182065 135776 160954 222385 203790 228810 212933 207288 225491
7894 225491 249965 210234 248488 245495 255349 211019 211880 165724 59623 -25832 -5648 82494
7882 82494 86324 54822 143219 237793 208196 189857 213151 182527 150506 190820 225833 265561
7870 265561 264782 317668 327531 353076 252985 172531 125471 58635 52665 52715 55359 42836 72703
7857 72703 96927 110797 90807 54256 44211 69787 112921 146778 138167 114169 106624 135346
7845 135346 66643 64157 89072 95429 92843 120455 151949 197531 204837 183889 169157 149098
7833 149098 123029 123560 84615 35938 63008 2793 -45021 46201 130142 110109 99365 54519
7821 54519 48997 95432 122263 47003 20196 56702 78988 24695 -45538 -38367 -13715 6280
7809 6280 -3051 41457 27359 59400 163767 79233 -16129 -47646 -9463 46712 15489 -19954
7797 -19954 -26403 22427 94366 118488 108454 86924 26499 29189 59036 85864 75653 2093
7785 2093 -12038 22434 32648 -13551 -7915 -6237 7063 40366 56813 40136 -47035 -68745
7773 -68745 -30463 33481 92746 32338 -10544 54253 36793 -41646 -2610 18128 21066 15872
7761 15872 72327 -13816 -55828 -55042 -60313 -43491 -105388 -62071 29408 127464 25444 -56543
7749 -56543 -21754 2930 874 -11800 21822 335 54743 49176 43192 -829 -67660 -103766
7737 -103766 -79677 -26294 -16020 -5730 -9675 -181 -50737 -88869 -100077 -43921 -4469 -32788
7725 -32788 -103478 -114355 -95637 -150296 -135889 -119552 -74194 -45032 -16391 -56024 -59474 -92148
7713 -92148 -72134 -46416 -101635 -91011 -67259 -27357 -16003 12238 -44379 -16136 -20737 52760
7701 52760 82544 55952 72455 92767 14637 -23459 -15446 -60414 -116843 -94493 -22309 29087
7689 29087 -5874 -1597 17638 61488 67583 37261 71500 76836 52096 -3277 56897 68532
7677 68532 236 -53089 -45989 -73508 -70665 -93386 -141636 -134363 -136357 -109604 -73656 -3969 51300
7664 51300 18692 42644 52186 -14677 -83040 -166968 -164612 -106161 -84904 -47640 -68779 -84371
7652 -84371 -119917 -114907 -72610 -82956 -78713 -74213 -114749 -99385 -83914 -71780 -52043 28451
7640 28451 60658 -33485 -73540 -72346 -57111 -44117 26265 31387 85880 150379 157181 112378
7628 112378 79365 59861 -19921 -79699 -131526 -164107 -127774 -89493 -94509 -120683 -126028 -131586
7616 -131586 -164108 -88163 -104989 -175198 -215746 -173783 -106253 -53261 -12088 20747 19504 16017
7604 16017 22613 -61594 -109300 -105220 -25452 -27467 -83125 -188118 -217657 -168678 -85652 -31307
7592 -31307 -27437 -4699 47459 43342 -65955 -96368 -53078 -19707 -11774 -5466 8908 -40602
7580 -40602 -51199 -38999 -29393 -5313 38011 20203 6040 2831 -6349 -2971 58552 84038 49528
7567 49528 4314 -28426 -9459 14373 -14279 -62850 -19305 13738 -6274 -42956 -51352 -46123
7555 -46123 10823 58512 35048 -7831 -5486 36690 17351 949 21818 16538 -24217 24616
7543 24616 19504 45469 92800 89543 50411 10694 -20050 -22442 -64034 -48475 -60336 -65360 -56285
7530 -56285 -45811 -15043 -11771 -67393 -111103 -73215 14847 -13196 -66347 -101725 -82280 15374
7518 15374 7402 44607 77290 63331 26847 66632 85588 93582 60328 17034 28120 43732
7506 43732 -35844 -24834 -7413 -9399 -22197 -35537 -32809 -71337 -115363 -122326 -17533 14663
7494 14663 22095 47522 21261 -3860 42410 51746 92491 83308 1280 13981 66730 82667
7482 82667 62182 48821 76241 104332 70573 58251 15880 -51667 -127777 -121895 -90846 -35233
7470 -35233 30278 13702 -61750 -90406 -67629 -5095 5582 -45680 -91592 -102446 -39341 2151
7458 2151 4432 3826 -19304 12585 36231 59096 67248 90256 92772 15383 -48458 -84590 -49850
7445 -49850 -84935 -123313 -115578 -61914 48213 74020 3972 -38490 -22999 -35450 -17910 42333
7433 42333 74947 13517 -40015 -10879 20168 -20991 4565 -8495 -43342 -3368 51263 95328
7421 95328 -3330 -61925 -55615 4426 -13918 -19879 -53317 -31378 37132 24128 6907 -39903
7409 -39903 -51076 -42836 -4394 2399 -28332 16043 46472 9362 22033 23831 71402 16153
7397 16153 87680 112146 82128 45802 29847 30071 -2837 -34526 10371 37327 58265 51875
7385 51875 56384 20314 -12345 39893 34220 39522 63618 23461 -25462 -114552 -169016 -162851 -120701
7372 -120701 -49508 7035 -27222 -39324 6921 -23748 -37794 -52850 -31142 11200 27139 28044
7360 28044 -6959 -60294 -101963 -123064 -79559 -62290 -74296 -42441 -101590 -139829 -100678 -103138
7348 -103138 -84033 -33976 -7689 -44550 -53385 -58530 -88426 -122170 -132481 -83426 29259 21462
7336 21462 -12768 -10104 19129 71402 64231 42823 -53991 -161727 -134388 -163631 -183878 -125503
7324 -125503 -130750 -58729 12761 6980 953 12920 14163 11420 37671 6237 13377 -44477 -93934
7311 -93934 -56963 -15342 4686 -95821 -70502 -17811 -31023 -56934 -55865 -64417 -50097 -39560
7299 -39560 -12145 52806 65194 -18919 -14774 -2588 12083 -3580 -27635 -29659 -27112 -69826
7287 -69826 -141933 -100138 -81290 -69273 -37969 -20078 -9684 -36276 -61409 -69692 -43542 3003
7275 3003 -38477 -105179 -120926 -104922 -98164 -60321 -64573 -52552 22346 8640 -28240 -18613 -21771
7262 -21771 -93436 -58831 37381 38286 -4074 -16765 -50686 -16991 -59965 -95274 -71297 -5584
7250 -5584 38029 -36112 -45899 -49112 -60335 -43732 22746 28158 14377 -58704 -116458 -75985 -11301
7237 -11301 26155 6016 -30472 -79776 -85500 -38586 -57696 -89552 -140742 -105035 -101014 -90667
7225 -90667 -78445 -99423 -92537 -55523 -134602 -139656 -97925 -116698 -91568 -95173 -81016 -18417
7213 -18417 -26398 -71219 -59717 -11207 46651 16151 19874 -17041 -43628 -97043 -60478 -22002
7201 -22002 18222 -17494 -73520 -73246 -24780 -11602 -10857 -29628 -15730 6816 15727 -51554 -51425
7188 -51425 -68134 -131418 -136104 -11831 12097 -16292 -14829 -28048 -25318 -24556 -25923 1003 54594
7175 54594 104573 30766 -56759 -109277 -100781 -75168 -66370 -50895 3005 -6031 -5115 -12783 -39097
7162 -39097 -3577 53502 45828 55716 85328 107310 206984 198914 167825 83682 55474 -17070
7150 -17070 -69028 -100248 -92130 -43889 -74936 -99281 -77679 41372 64699 44196 -8715 -3446
7138 -3446 -31550 -87270 -102715 -117964 -129017 -103254 -101835 -102882 -136499 -109836 -128775 -129875 -135809
7125 -135809 -111052 -67050 -52411 -41594 -99543 -147542 -113377 -103992 -117604 -109917 -54161 -81116
7113 -81116 -46428 62340 64963 27484 -70324 -126510 -87911 -95474 -112489 -74667 -31785 -38055
7101 -38055 -17515 50000 81295 115413 78410 43980 22473 32244 4952 -34400 -26743 -28171
7089 -28171 -48098 -59679 -45963 -10972 -48779 -63710 -46286 -11927 25289 -22173 -23360 5152
7077 5152 30960 46958 76846 107782 94608 16193 36409 -236 -29154 -16944 -31778 -60537
7065 -60537 -78147 -37979 10908 -25088 -8771 97119 103134 56539 -3485 -4722 38012 45657
7053 45657 10772 68280 62706 12479 32388 41944 40830 55654 40070 -56642 -150557 -127091
7041 -127091 -89084 4687 100316 6415 -43267 -23059 45701 81757 28743 -31012 -39468 4874
7029 4874 57865 24183 -78453 -67658 -126259 -132503 -142604 -103252 -81659 -15763 -2812 -58211
7017 -58211 -16284 11477 -1710 -9741 -83609 -127954 -122775 -34438 27345 75786 71160 16779
7005 16779 -57641 -91515 -72650 710 46452 56258 54436 42574 73643 10450 -38412 -44004
6993 -44004 -54561 -38063 -45113 -96765 -153395 -101177 -49684 -40019 22660 -25548 -76802 -75138
6981 -75138 -73702 -97200 -100886 -95562 -61400 -11713 -637 -2943 -18046 20791 51418 20064 -73714
6968 -73714 -182773 -163257 -90946 -63971 -40839 -4416 -39394 -79323 -20379 -47373 -26393 30554
6956 30554 40808 -45039 -130897 -38982 -28913 -29171 -23794 -57793 -77683 -65255 -68380 -96323 -96539
6943 -96539 -75412 -45881 -3366 -14823 24631 22717 -3801 -64024 -94875 -132508 -105030 -54977
6931 -54977 -29163 -30473 -3225 -1166 -53586 -155653 -105092 -73222 -79496 -73811 -74646 -41834 -3617
6918 -3617 16740 10942 -6348 -7220 -14459 -33045 -75215 -74150 21402 34312 29626 -24415 -34094
6905 -34094 -51340 -8762 11084 -57642 -30113 -54093 -72557 -72392 -37219 -6033 -33924 -59175
6893 -59175 -11555 -228 20885 22701 -11102 -22127 -34424 -23417 -21838 23308 24032 -30224 -97676
6880 -97676 -86067 12112 40081 42720 67440 69133 12982 -1537 25113 1618 -6858 -92856
6868 -92856 -118925 -44385 -47696 -90498 -128486 -78044 -27249 46026 50293 -28463 -34470 7040
6856 7040 11448 -10974 -16275 11765 -52159 -131929 -121924 -117702 -119772 -108971 -113857 -82048 -21283
6843 -21283 82856 91013 42276 62785 28734 -42247 -78568 -81136 -24343 40064 45799 38207
6831 38207 -1430 12346 45586 9930 24780 16751 -18957 -68725 -36615 -17259 -4392 12124
6819 12124 -618 -4089 -14244 26139 -14965 -1755 16683 29024 6835 30916 48321 28196
6807 28196 10726 -10308 15182 35848 57835 64704 -14411 -6815 -25886 -679 7949 7286 -38699
6794 -38699 -13693 22802 20854 -10586 5030 15657 78641 22706 -35070 -12253 -65488 -126468
6782 -126468 -145233 -114933 -76031 -3536 51435 19283 -69581 -7306 74343 66304 60048 75929
6770 75929 6854 -21949 -6739 42319 58708 3671 -113922 -136832 -62696 -31082 -49245 -67552
6758 -67552 -51958 19313 14523 -2378 34788 94489 60694 -64450 -20634 38474 -10593 -19292
6746 -19292 -2852 -20210 -4983 -20564 43310 64715 61389 66309 71504 31461 29770 53686 28261
6733 28261 61294 63516 -26878 -34214 -5459 64321 30268 -44248 -28864 -11270 -9871 -34039
6721 -34039 -32251 5395 -60957 -93274 -57400 27382 38207 -20204 -24613 -9091 -43375 -56400
6709 -56400 -6420 34997 31731 -7306 -22111 34077 52675 84263 41885 11326 30040 14561
6697 14561 -2918 41675 125951 107691 73157 64984 63453 47239 14887 11896 3762 -48149 -76624
6684 -76624 -18368 23693 32324 32343 -10623 -61866 -55501 -16221 -38933 -38859 -14482 -7260 78960 81653
6670 81653 103813 94308 35973 51763 152645 123965 90498 111071 120040 99676 59765 127517
6658 127517 129561 115854 87573 57391 23240 -17358 -48227 -32134 17518 75365 100278 126378
6646 126378 81903 26407 -15942 3421 -26483 20581 24929 110728 165710 108937 29713 -5758
6634 -5758 20493 59247 62448 151023 193000 128539 70296 85817 162420 157566 140121 109778
6622 109778 91162 112277 147686 152217 124440 96163 110912 121678 114583 88978 108284 117739
6610 117739 89513 95848 115838 87896 84589 193778 179806 146241 70298 69385 19949 -8645
6598 -8645 21495 75333 83684 106279 92607 81218 99642 218539 291063 323439 286450 185200
6586 185200 94831 119535 227391 228205 243836 239558 264523 283870 258125 229829 231899 243317
6574 243317 299955 327502 272294 237104 246521 245768 314417 389994 382746 386371 423737 432787 516889
6561 516889 529614 480363 449859 483276 550654 544479 487928 491678 520311 589394 600782 596615
6549 596615 620781 702985 744911 725445 726527 834172 910884 940853 1000986 1108029 1194671
6538 1194671 1184346 1186819 1218395 1307621 1351782 1372507 1392924 1411582 1402325 1402680 1314836 1245553
6526 1245553 1204435 1119570 1038187 950705 897646 838265 786045 709948 736437 719219 656580
6515 656580 634120 581147 545455 551778 598709 549861 532537 446910 447210 396325 324883 342025
6503 342025 364150 355461 400548 341101 262993 239915 212274 217293 261821 241738 184247 211906
6491 211906 243547 269698 203375 214100 236159 239779 253008 200461 148068 172423 218695 199412
6479 199412 214492 239146 224182 193091 126791 101064 55494 21822 76941 93197 79311 35051
6467 35051 96512 139359 93551 97833 88292 17136 81813 122921 160117 202758 202506 106823 78562
6454 78562 110100 128262 86746 2090 8160 -9320 43542 99395 102996 53012 24780 1004
6442 1004 -36390 -17418 4545 67406 79994 88806 104887 68804 45258 60211 33499 86256
6430 86256 97852 50643 17332 31178 -16138 -16769 29676 22488 -3155 42401 97553 142670
6418 142670 138120 144562 96972 103809 83130 71916 53838 39176 53290 11390 -25920 -59609
6406 -59609 -50050 -21103 20974 7760 3232 6917 31215 90198 81764 24661 -23375 20945 70576
6393 70576 96213 87970 110913 69372 62161 23455 -76483 -115226 -76941 -4559 61006 16850
6381 16850 -22198 86248 141057 105794 17324 -69817 -40361 46504 78955 41105 31884 32019
6369 32019 -16832 -43926 -48444 -27218 -37250 -52423 -46735 -108758 -48516 6887 -36891 -44474
6357 -44474 -126017 -135342 -130965 -101413 -124712 -74170 17665 -8027 -23658 42588 31593 6411
6345 6411 20969 -28722 -54604 -52500 -58468 -42024 -105111 -159526 -118415 -68190 -26378 -31441 -45589
6332 -45589 -41992 -27337 -47517 -42607 -87097 -116314 -120548 -111948 -89731 -96485 -91192 -154825 -194799
6319 -194799 -173067 -175582 -123059 -31262 -5002 -46484 -39795 -30795 -29081 -75573 -106209 -80833
6307 -80833 -49513 -52085 -57594 -67291 -80268 -88244 -89797 -97576 -69766 -44760 47925 103614 58437
6294 58437 -9854 -49268 -85296 -128676 -116112 -31919 6906 616 -57641 -74723 -111367 -80610
6282 -80610 -84592 -90245 -86512 10240 48562 -7779 23536 25574 30791 -34300 -99264 -33720 18671
6269 18671 15632 15561 -12915 -60059 -39223 -53377 -21085 -9287 16982 -60932 -93568 -119919 -142804
6256 -142804 -113651 -28295 -7910 -50320 -61971 3623 50651 19392 5893 -988 -59298 -58196
6244 -58196 -5078 -11722 -74483 -56000 3405 -1912 15680 41027 51854 55288 -25624 -52405
6232 -52405 -44663 13113 -15577 -49861 -101690 -122784 -74678 -49932 -38688 -9302 -14407 16609
6220 16609 10552 -36751 23841 39688 49951 71236 22077 -52884 -32604 3169 29874 5876
6208 5876 8004 -39323 -84221 -21116 78821 81764 67219 105564 53748 39261 27265 12923
6196 12923 9689 -26418 -29842 6810 -1416 -10033 61372 81406 64365 61393 36709 13122 -8852
6183 -8852 -13851 -10153 -43734 -20771 -61774 -57683 -67382 -128688 -53453 -36093 -94687 -45842 44396
6170 44396 60209 47463 57314 17783 -75998 -81030 -9437 -31238 -135440 -121811 -93613 -67401
6158 -67401 -68645 -38200 57094 58471 14410 -24424 -46543 25993 33946 -16520 -20629 -33557 -24310
6145 -24310 43117 16717 36132 98506 69548 50889 9065 -52609 -46735 -38620 -68116 -52554
6133 -52554 -48557 -95894 -58152 -17606 28028 22360 52713 48155 -6334 -28192 -54537 -44871 -18748
6120 -18748 -26125 -29582 -8276 21986 45557 26322 24847 -24055 -25074 22845 4316 27230 56554
6107 56554 -53245 -85012 -63231 -32064 -29300 -8444 -98622 -158901 -163634 -140488 -64943 -13175
6095 -13175 -75254 -146694 -165300 -143831 -64505 -62659 -84666 41530 74388 36439 -49453 -128920
6083 -128920 -124532 -81898 -94255 -100621 -47487 -40984 -61380 -29584 7784 -74939 -120956 -132653
6071 -132653 -142409 -61042 -61043 -103847 -124320 -153686 -110552 -85793 -32773 -31881 -14563 13822 25693
6058 25693 -8308 23949 92530 68985 870 -36882 -35327 -35272 -89550 -65205 -5802 27578 11867
6045 11867 -52264 -33756 17730 -20473 -58028 -80657 -126175 -136647 -99149 -40386 -13130 59224
6033 59224 86878 105304 83699 74876 74388 30760 50957 34959 33783 19744 13696 -14789 -1718
6020 -1718 6450 -58366 -152926 -97154 -45728 -19217 -58811 -106215 -77750 -14220 68602 105697
6008 105697 148215 150758 112061 52615 80789 67049 76008 122949 76183 91967 109128 160232
5996 160232 116930 95003 86342 107473 120542 53657 26554 -12398 -23088 -57145 -95275 -125052
5984 -125052 -102715 -109295 -107114 -52509 -74487 -43919 45065 5555 -48024 -32687 63883 130322
5972 130322 174775 103414 58605 -38574 -14255 24684 748 -24915 -31924 -28391 -60256 -97356
5960 -97356 -84762 -30180 18106 38536 3218 13151 9123 189 9830 56765 43172 30912 104963
5947 104963 91421 70694 36505 56677 112275 140663 90187 76813 45142 14542 36822 64524
5935 64524 60962 23491 34990 11223 -65980 -92715 -68955 -92608 -120143 -89484 -53527 -50731
5923 -50731 -49236 -20025 2040 43374 61115 13220 -4336 1682 8299 13898 70462 70744 13238
5910 13238 39703 34190 72136 97071 105079 142475 47166 29632 53901 5363 -43383 -40366
5898 -40366 -38577 17736 13293 -59938 -50068 -29107 -70432 -87747 -60487 12126 -27209 -121088
5886 -121088 -104071 -63998 -37563 -24837 52987 29344 12467 -7268 47766 59604 31691 -4114
5874 -4114 -9138 24706 37893 38470 13000 3855 18691 48239 103640 178135 134725 52283 56899
5861 56899 63916 42881 41763 108284 76851 16342 -44027 -88446 -14666 14643 36405 -10230
5849 -10230 -40752 -13553 -18215 27565 23412 -1383 -779 -37443 -27075 14900 73905 74577 105239
5836 105239 68617 27337 70443 74681 69152 142114 91273 54089 6296 27861 74028 52089
5824 52089 40305 22048 13212 4968 -12174 -33920 -48896 -32153 43744 7818 -4106 37528
5812 37528 69542 86717 39329 -1591 -25734 -8892 22444 16128 -901 -60429 -62120 -2099
5800 -2099 52082 24530 14351 126894 129396 107599 96615 95085 37200 24405 78130 38668
5788 38668 -37846 -29171 -5542 -33247 -30204 -75251 -108924 -115553 -110810 -34148 42073 35976 14938
5775 14938 30826 23435 32901 -5286 -44560 -61836 -79892 -44095 -73463 -48739 48350 59646
5763 59646 7957 -53729 -41179 -60965 -98806 -139343 -75185 -37757 10267 50471 65969 53613
5751 53613 60395 -3072 -41237 -6258 17161 1660 -4495 48298 66567 24275 2858 66187
5739 66187 52138 657 -306 15046 -31911 -28022 -19764 -17628 5667 26520 19141 53020 41486
5726 41486 -10264 -53873 -23243 -29962 -23279 -58887 -84013 -77309 -94316 -99634 -158881 -194192 -115625
5713 -115625 -26465 9318 -41144 -71950 -67667 -38617 -54587 -25692 -70087 -133175 -104067 -90084
5701 -90084 -136548 -31635 8196 -12439 -2422 -8100 -22003 -63677 -103619 -143262 -153208 -179140
5689 -179140 -195204 -184133 -116587 -79401 17837 30314 -12580 14329 21898 4487 -22948 -12784
5677 -12784 -29356 17107 78097 2429 -72138 -78679 -113313 -124748 -97770 -67212 -39591 -69028
5665 -69028 -132571 -195241 -169482 -52020 24109 38354 52151 25975 12790 6417 -69390 -145752
5653 -145752 -133734 -88552 -114614 -57444 16016 19600 -31953 -7631 -14573 -9689 4898 -8461
5641 -8461 -43874 -108680 -141034 -63884 -30769 -74515 -94408 -48192 -33221 -27160 -41880 -68938
5629 -68938 -41439 -16573 -25712 -91971 -75538 -13815 22304 25354 -19063 -68855 -48688 -11594
5617 -11594 29109 -4256 -67263 -42713 -15943 -39708 -17265 7596 19543 7111 29826 20791
5605 20791 -8207 22865 -37706 -142461 -152285 -91435 -114195 -98436 -63111 -65926 -8322 10482
5593 10482 34112 33398 -14695 -15936 -91328 -106488 -90204 -1193 28685 38204 21008 28929 36521
5580 36521 22472 -27891 -33667 9512 81903 99933 99021 131191 193184 140314 99296 96303 57457
5567 57457 39003 36019 64220 46597 -20855 -17018 -13477 -9697 -66768 -60213 -39318 -66691 -43471
5554 -43471 22222 30822 47219 29625 -3 -32420 -46659 -31493 -56346 -64073 -73898 -61250
5542 -61250 -86940 -145640 -117327 -46032 2944 38284 60269 68639 90465 45630 17894 -44782
5530 -44782 -20672 -16587 -26096 -30046 -37109 -19418 -12101 10199 15466 -14341 -28970 -11869 -32216
5517 -32216 3319 16678 43312 8623 16355 15566 11654 -72804 -22697 61511 27239 -32355 -71494
5504 -71494 -66709 -34089 -47159 -71579 -28896 8537 -21483 -76536 -83808 -93714 -134650 -108113
5492 -108113 -117885 -118148 -73808 -60746 -33556 27798 83376 58358 60145 -7379 -52355 -92873
5480 -92873 -70900 -28423 22091 24823 35031 -12520 12162 16806 -10376 -20200 -54952 -125945
5468 -125945 -107627 -81048 -81714 -52090 -21009 2061 -32004 7491 -9632 43939 115376 100716
5456 100716 -493 -2278 -41803 -42142 -62202 -28757 -36292 -82225 -86262 -97685 -170329 -151446
5444 -151446 -36256 -21243 -20257 -29506 -48745 -24518 34335 -5641 -45913 -22887 -29328 -11157
5432 -11157 -16381 -23009 -53272 -63880 -45119 -88859 -86858 -46248 -45850 -59386 -44719 -18555 9294
5419 9294 27105 13832 65708 64807 -11778 -55403 -92797 -135539 -120710 -170944 -190316 -140660
5407 -140660 -118837 -114655 -107350 -99333 1397 -6810 -89070 -93563 -19804 -41642 -30945 -38405 -47480
5394 -47480 -56793 -20164 -39905 -19104 47665 52412 77442 106095 89739 29001 21112 -4477
5382 -4477 -21553 -24596 -55527 -57083 -26353 5999 -31758 -112411 -187384 -166086 -154368 -102207
5370 -102207 -80698 -51740 -13850 -31850 4364 55339 69099 41749 94074 73935 -17033 -72349
5358 -72349 -66749 -31183 -8693 7938 -35876 -53992 -84669 -166226 -145187 -59614 32253 -10216
5346 -10216 -105692 -139488 -128271 -127938 -95225 -63822 -43686 -33595 -15021 16020 -20785 25903
5334 25903 3134 -26422 3878 24009 55082 15032 37741 83092 -13484 -83653 -35814 -776
5322 -776 61060 118390 67641 -21175 -3623 23969 6822 13928 -2923 -18994 -70406 -44501
5310 -44501 -25614 -92215 -134342 -142959 -124996 -144181 -96929 -71306 -59262 2795 58195 -15581
5298 -15581 -50666 2684 -57448 -61966 -78301 -78405 -53319 -22202 -10982 -22854 -31206 -99441 -75542
5285 -75542 -64439 -51277 379 -1799 -54860 -63460 -65149 -70714 -43709 -66131 -76596 32456
5273 32456 60364 -6890 -57943 -34392 -22387 -65393 -49927 -92805 -137335 -77990 -22543 43186
5261 43186 -17105 -54122 28467 78413 73348 22979 -72688 -76461 -5570 -13 21524 94533
5249 94533 8993 -26790 -38360 14573 15372 -20074 -47555 -109821 -111828 -64076 -13070 14045
5237 14045 24651 2477 -55213 -120712 -69815 20068 69868 109422 81759 -20157 -43030 -64739
5225 -64739 -33520 -19499 -71537 -69470 -18957 57959 64960 62760 39029 109197 173022 126628
5213 126628 151305 98486 30321 29389 41001 50147 20384 -31845 -60925 -77550 -85404 -109799
5201 -109799 -28238 26735 29854 39633 -17674 -43008 -105502 -109649 -142660 -151172 -75758 -61693
5189 -61693 -123369 -136453 -73310 -69641 -65689 -317 -2893 -89991 -107537 -59759 -56496 -31761 -24420
5176 -24420 -37292 -22128 2022 -23362 -35571 67187 76484 -7694 -39479 -44178 -68420 -101259
5164 -101259 -139067 -119297 -82776 -85051 -42511 -13575 -11330 12384 68269 48409 41882 60316
5152 60316 -33141 -100375 -90372 -54295 8391 22913 -54248 -81418 -87860 -40958 25756 46503
5140 46503 -79937 -87472 -64321 -44272 -51507 -40478 -49536 -28407 -45198 -93920 -125923 -29805
5128 -29805 -24143 -55658 -19764 -9085 -14310 -4456 11718 39303 28937 -48996 -51914 10099 51541
5115 51541 15247 -34615 -8595 -30559 -2974 97621 122352 112573 93729 92906 12488 -20926
5103 -20926 -7437 36522 -23746 -156607 -209244 -155342 -99861 -63878 38238 33706 -42921 -7015
5091 -7015 63320 51690 83375 83398 46293 65375 99872 73961 63498 62058 -5844 -15937 -31687
5078 -31687 -7831 369 34953 -13008 -19167 -25889 6411 -24385 4547 -3256 -22243 -44481 -118559
5065 -118559 -99705 -38338 -31481 -4743 -1629 -33170 -89110 -42380 18940 84081 85129 67258
5053 67258 8382 -5968 25780 -11578 24712 18647 -17314 -5012 49325 46355 6986 2928
5041 2928 37652 -33995 -19646 19823 -38056 -15180 13434 30099 44013 -22537 -20827 13268
5029 13268 8239 -32983 -63163 -26743 -22167 -46339 -83886 -101317 -161817 -107441 -31262 55100
5017 55100 71422 -3609 -22835 -57370 -59102 -41144 39660 123124 78085 16838 -17594 -55064
5005 -55064 -72092 -79413 -56478 -60617 -7691 11745 31877 17344 -29965 -36320 -28131 -37903 -56611
4992 -56611 -80529 -105386 -9866 6473 -39365 -34312 23224 -38642 5248 21165 -32317 -74305
4980 -74305 -47748 -13166 -36176 25538 104548 31456 29536 28153 -23679 -63832 -127941 -166573
4968 -166573 -107660 -42958 -52270 -59667 -91034 -84139 -74500 -39966 -26654 34815 42377 17257 -22450
4955 -22450 -98414 -136404 -128728 -106224 -77118 -88294 -125756 -52243 11102 10542 -66281 -59577 -50983
4942 -50983 -96119 -60080 12985 -115 -14551 -17312 -7011 -22035 14692 49164 -18555 -21487
4930 -21487 -39876 56925 123752 36535 26529 53588 10949 -38072 -24682 -17600 -34401 -13622
4918 -13622 72 -70134 -127675 -157545 -66951 47969 42937 50504 52099 9779 27271 -27753
4906 -27753 -14763 11427 38344 44346 11965 -2878 -21193 -22680 -23709 -30708 3081 34982 25920
4893 25920 -42459 -75410 -69962 7810 42994 68308 50701 -8370 -103377 -130800 -109172 -163515
4881 -163515 -140116 -97844 -50656 -1700 -12467 -99009 -129518 -120713 -147932 -142080 -91021 -81540
4869 -81540 -107022 -80716 -59200 -11323 -7129 -19919 6022 -1103 13356 37149 60478 55422
4857 55422 46684 84317 107253 30620 -6027 -32615 -52670 -67158 -170818 -208574 -113281 -57967
4845 -57967 -74904 -57882 -52100 12463 -30419 -68832 -52017 -50699 -148619 -140228 -91674 -91218 -84398
4832 -84398 -88497 -46777 -4662 29760 -28822 -71891 -80041 -46915 -21221 -40132 -103425 -69128
4820 -69128 3453 21984 44366 -14820 -46269 -34938 -57730 -51890 -21993 -62915 -86146 -24200
4808 -24200 -38265 -3357 18563 -14246 -36167 -32732 -57267 -117627 -116466 -51221 -55130 -64143 -75300
4795 -75300 -6121 69944 82785 26443 -28878 -10532 -19857 -28505 -9301 25866 11586 -40887
4783 -40887 -108872 -71597 24618 -21550 -89984 -112970 -84045 -21198 -14251 -11367 -1903 18527
4771 18527 47477 36605 13415 -31105 -67271 -79748 -135674 -127291 -94403 -76876 -128477 -65301
4759 -65301 44705 68804 20886 23969 24873 3004 666 -50701 -151103 -125319 -44662 -91248
4747 -91248 -135401 -103003 -22892 89 59861 70818 -35427 -4234 36628 -3835 -36032 -6587
4735 -6587 -23648 -35619 -24399 36254 74882 31796 -14952 -71462 -71381 -52585 22091 60770 51355
4722 51355 43080 -26787 -71513 -67244 -34954 -6633 -17552 -94230 -67594 -26512 -116158 -136125
4710 -136125 -44453 21616 7829 -63401 -69561 -55550 -41952 -60325 -72946 -73006 -47367 -22677
4698 -22677 -1011 49909 -1715 -63918 -40302 -14605 12316 11579 15824 7848 16730 4976 -39649
4685 -39649 -57896 -23664 -3158 28567 20194 23591 -5920 11874 -34275 -67959 -64178 -68547 -11219
4672 -11219 -46211 -88336 -126498 -108494 -50692 14872 64794 80816 115950 52356 17704 -11075
4660 -11075 -13225 -38121 -65626 -56481 -26021 -1712 12036 22757 36116 45748 -351 12954
4648 12954 32819 61073 39987 28615 36165 13005 3673 -4513 -24429 -9744 64863 39505
4636 39505 24388 14383 66897 114702 97054 83349 102231 90882 78916 63038 -7852 -54616
4624 -54616 -51921 -80782 -160767 -128334 -79527 -131116 -63433 -83181 -12524 21572 -30912 -47562
4612 -47562 -58327 -73925 -47819 5625 46273 86220 112699 50476 10319 40539 58034 -15175
4600 -15175 -2634 24945 29950 49188 12966 -77260 -52435 -49474 -67973 -70914 -86557 -14824
4588 -14824 61816 50764 50522 43384 32004 59282 83045 42642 9494 1173 7162 4134 -8225
4575 -8225 9366 28488 43377 42049 -31716 -44779 -27875 -24008 -63569 -64323 -51904 -46702 -31109
4562 -31109 37597 4798 -34293 8677 25246 34098 -63406 -89967 -104456 -47109 -13272 45182
4550 45182 63186 21084 -5288 -27252 4865 -10214 23736 15283 19861 35088 23073 51534
4538 51534 67300 65510 93441 27694 1999 -68953 -71878 -46225 -57365 19772 94326 60318
4526 60318 -23823 -80699 -22236 37518 40519 -19861 43074 42504 35734 78093 113646 27630 -25369
4513 -25369 -24509 -890 43932 52163 5495 30744 64665 -5316 -15088 10187 23469 25947 10251
4500 10251 -43895 -45617 -67696 -138539 -168618 -142631 -43954 -7231 -14186 -32900 -65092 -14491
4488 -14491 22756 -21929 -90434 -107944 -54907 44613 3056 -59564 -88505 -85241 -92185 -108652
4476 -108652 -86032 -91074 -66705 13489 -7056 -58455 -60865 -23846 -72865 -48720 -104698 -105124
4464 -105124 -76720 -26390 66298 40379 46401 -9178 -106796 -71613 -5824 -7240 -26669 -60875
4452 -60875 -82249 -65783 -42117 -40140 -85625 -77861 -3475 13431 12059 58693 82008 17335
4440 17335 -50316 -19018 -6665 -27790 -17593 -1044 78603 126008 131794 191828 138398 75933
4428 75933 78245 76591 12328 -21924 -99550 -73100 -13136 -5301 1998 24702 26727 5339 -67773
4415 -67773 -105661 -77380 -44744 -26522 -4215 1951 49442 46019 47406 6069 -2380 18382 24761
4402 24761 41482 13365 -42229 -72886 -72127 -32735 -54881 -67189 -53935 -70224 -86234 -65359
4390 -65359 -72790 -2307 57894 40618 24556 12614 23209 7915 -10070 -7828 -20539 -73608
4378 -73608 -61658 -48714 -88713 -89319 -67604 -43400 -37403 -26441 -1484 -25064 5368 -26098
4366 -26098 -23050 -7986 -60417 -70147 -21698 -27173 -33967 4179 39777 77102 113772 111402 13736
4353 13736 -97350 -83810 -85399 -78472 -79449 -74758 -66872 -39714 -42407 -54762 -52863 22146 31542
4340 31542 -9938 -85091 -71852 -56342 -43457 -117011 -119558 -96021 -59708 -64357 -9447 6752
4328 6752 -1549 -48970 -669 -52793 -70918 -25057 -73749 -77716 -33480 -39553 -46407 -48393 30370
4315 30370 70551 25981 -4580 -22496 -48063 -11784 -17499 -39194 -75132 -64116 -7668 -30072
4303 -30072 11472 -31279 -98605 -120911 -35778 9379 -7551 -98603 -68665 -44917 -15224 29703
4291 29703 99169 104215 116464 91484 79634 30165 -2333 7215 13653 57506 51389 39108 59719
4278 59719 -4892 10820 27815 4422 61822 60479 26526 -70796 -62085 -25200 -11088 -56750
4266 -56750 -54690 22143 33269 -47276 -25815 23871 83081 102584 72974 46650 54492 85990
4254 85990 79781 74405 125111 130058 102133 50321 56740 19978 16589 75493 78674 89362 15601
4241 15601 5695 27867 44313 44920 90250 78326 20312 34791 84586 48426 146947 217408
4229 217408 101524 -14283 -19576 -2951 -23513 -9571 44279 9386 3903 14635 67788 61322
4217 61322 65536 121986 101564 110649 67548 39176 79922 55370 33020 49255 13936 -52498
4205 -52498 -9271 16703 30008 -5518 642 11414 297 1194 -13705 -48134 -47796 -54304 -10245
4192 -10245 -39025 -47078 -26241 -16550 -12669 -92104 -105416 -70295 -27338 -9590 -44876 -91959
4180 -91959 -165701 -123012 10003 77241 47840 -1479 57920 45443 48866 52092 10288 -52092
4168 -52092 -46835 -21763 4953 -19314 -8167 88293 139704 160674 136798 131170 123975 96692
4156 96692 68417 34245 65797 22807 75147 37331 -87855 -149811 -107335 -117394 -147377 -77623
4144 -77623 -43470 -98502 -152905 -162669 -82767 -20131 1305 17411 46991 59247 155498 117110
4132 117110 61515 77769 33474 -52678 -42764 -19612 -30499 -16200 3670 -53815 -49422 -36315
4120 -36315 -41872 -28319 44372 55641 112598 95302 55131 2627 -22337 -62082 -125984 -132320
4108 -132320 -24554 44981 17991 -26782 -75001 -87818 -66748 -27475 33623 71242 83452
4097 83452 37052 47775 -5131 -685 -33376 -22949 7599 31855 -36117 -64926 2419 26936
4085 26936 63784 84324 74721 -10343 -49161 -11186 -16309 -31624 -26303 26485 76114 57969
4073 57969 -5932 -35540 -30167 -548 -4968 8021 -467 -47475 -92267 -82149 -81113 -37899 2482
4060 2482 22188 17189 23955 15252 6052 -8978 3992 -24923 -29157 -46325 -75566 -84269 -50706
4047 -50706 -51764 -38952 -21565 -57428 37935 68397 29775 -6331 1514 -45960 -85313 -56831
4035 -56831 21607 135577 115836 100004 25280 22206 64807 85530 31376 75948 34695 -52750
4023 -52750 -67034 -73128 -49234 -38379 -62966 -85786 -85173 -59123 -56115 -57680 -18143 2830 -40010
4010 -40010 -24341 4292 1315 22440 -12116 -30344 -58645 -21316 -61384 -107154 -46407 -62684
3998 -62684 -52760 8043 -3052 -69086 -139193 -126063 -1488 92324 116594 68647 85196 64156
3986 64156 31710 -6133 -8771 -36077 -77638 -94657 -66689 6586 43742 93786 133194 -3139
3974 -3139 -112752 -148003 -104366 -75583 -32142 31685 11999 4551 26566 62369 -13695 -69719
3962 -69719 -87615 -56053 22863 59840 36570 2161 31773 119895 146863 66263 29809 30445
3950 30445 -2971 926 -33641 -64487 -65126 -41894 37857 -5508 -44119 42354 129365 164916
3938 164916 154668 26258 -55436 -58564 -33796 17090 -20788 -70841 -28288 22269 80477 118035
3926 118035 130566 132097 113244 98831 114324 65139 58679 72411 70724 34814 -13850 -28210
3914 -28210 5220 12805 2124 -14737 35513 60360 55181 78206 93329 62949 40839 6367
3902 6367 -62923 -98519 -84956 -78975 -37423 -17166 -26806 7163 23917 26556 36607 -28377 -71441
3889 -71441 -69586 -36157 -35630 -34170 -575 -8186 -15168 -22397 -28464 37379 65767 91425 61172
3876 61172 24795 17708 53290 48822 49054 44707 783 -28752 -76101 -89162 -92547 -62508 -30651
3863 -30651 -36134 -16349 -11051 -39834 -80855 -104431 -94604 -89731 -85702 -80019 -52938 -62388 -85829
3850 -85829 -114165 -131224 -38728 82711 105561 69341 -4780 10282 -5418 -38785 -14881 33526
3838 33526 49957 30226 -29817 -66735 -114652 -118132 -82206 -55848 -62854 -51333 64 -45038
3826 -45038 -79833 -69777 -99921 -22511 74136 16614 -62960 17070 59004 113791 68572 69730
3814 69730 87974 68705 40647 58100 36783 23596 23893 28804 -20202 -65834 -72441 -84745 -55326
3801 -55326 -67391 -99145 -5709 57818 65785 -535 -35286 -75021 -120719 -118251 -112619 -44843
3789 -44843 -30634 -13166 5986 -37118 7303 56443 93966 100510 84125 60817 117876 122913
3777 122913 110060 52121 67179 117910 119170 142236 114183 103493 58938 58007 4687 -13847
3765 -13847 25118 29182 11763 11771 -29051 12659 44504 32742 23847 43678 36713 48944 50646
3752 50646 23204 70683 67845 -28505 -53511 -6491 -10447 13621 -37066 -69245 -54328 -43294
3740 -43294 -23237 -82243 -96365 -94552 -89365 -97900 -142974 -53934 38270 45632 55376 -4199 -25326
3727 -25326 -62182 16905 102896 51844 33798 57132 113738 145506 81088 32445 -64677 -55033
3715 -55033 -21548 -3864 -30811 -50208 -54629 -44012 26690 13469 15170 -28859 -17421 -12880
3703 -12880 11682 1983 -64316 -73718 -37026 -38518 -42614 -60060 -48054 -33184 -56028 -9137 13328
3690 13328 56127 106104 102279 87360 81029 14903 -79543 -72162 -93407 -103372 -28132 -43557 -78672
3677 -78672 -50352 -59643 -41915 -44343 -60798 -32815 44111 97660 79909 54195 56098 33287
3665 33287 -40882 -58443 -34860 -53673 -14321 45332 91677 124853 198440 136985 74052 -5178
3653 -5178 -86742 -85854 5372 26870 -42029 -127876 -132020 -73502 -690 39600 37925 10310 -18090
3640 -18090 -41280 -64856 -61519 -25351 -9981 5525 34758 11539 23025 -2980 22465 43302
3628 43302 62318 100 953 18058 -20184 52360 61610 22479 4501 16401 54873 9763
3616 9763 26128 36620 22486 -15459 -42678 -52432 -61022 -24071 -6083 40869 76503 109048
3604 109048 78355 71239 52162 24871 -11034 -17533 -60521 -55698 -28685 55930 34050 -34968
3592 -34968 -2163 74261 30201 70432 108028 82333 93383 45708 23077 78305 63272 3523
3580 3523 -30571 -84204 -86004 -46824 34928 67441 36637 95527 91088 73614 101636 66207
3568 66207 -1205 -38106 -61446 -82373 -77289 -54180 18737 76955 70234 89149 78679 25382
3556 25382 11193 8479 42697 21127 70610 65696 59778 60032 -70783 -103611 -70036 -123725 -146031
3543 -146031 -133096 -6216 60051 67905 86609 109346 92849 51325 34912 18090 -42763 -124288
3531 -124288 -152653 -71867 -668 -37006 -31826 28280 114743 20876 -8161 17338 9261 -13984
3519 -13984 -63627 -116007 -146163 -15608 61937 49524 66072 31211 29281 44011 -34873 -62465
3507 -62465 -39840 21073 -41916 -75134 -54514 -72738 -79805 -73680 -33543 -37770 -25116 23808
3495 23808 31018 66720 8850 25377 42504 49015 42759 102029 103798 29219 -39074 19296 125466
3482 125466 124865 31302 -35068 -62187 -33463 -11076 9731 23223 26773 29912 75473 82454 10956
3469 10956 -17907 19052 89524 72427 54128 96471 89612 -17192 -16715 33194 48795 82919
3457 82919 21425 -55947 -69922 -65292 -56085 -42515 -75484 -34896 50058 4223 -3691 14317
3445 14317 58254 63003 19574 -22968 -22670 36669 116 27090 107561 89754 27960 -91669
3433 -91669 -124496 -38276 -56587 -61636 -46369 -19155 45175 58838 34646 -23463 -39638 -30548
3421 -30548 -52032 -83438 -65907 -16765 20872 -4569 5760 58354 102251 65195 38972 20390
3409 20390 26493 94705 121130 87692 53443 -13416 -53862 -37647 -44471 21626 -2658 -49714
3397 -49714 -49010 9352 34212 -32931 23798 35572 -43506 -54555 -25844 -19889 3910 13974
3385 13974 41026 25929 -18561 17421 48286 46105 75266 54025 50761 55155 88923 59316
3373 59316 46501 67213 31983 78300 138168 124634 18467 -72940 -73042 -87931 -100572 -80670
3361 -80670 -17620 -46121 -48234 -5984 6330 40891 78959 55699 28272 15155 13880 40183
3349 40183 110912 122615 67376 -26682 -51100 -59889 -56877 -93223 -96112 -31609 -22270 -1150 32019
3336 32019 55161 58575 61751 74807 36691 -19460 -24510 -31584 -58345 -45086 -65737 -106911 -119099
3323 -119099 -124609 -117464 -119396 -71352 -88893 -94466 -61304 -38232 65180 72895 -14035 -5062 18408
3310 18408 26194 -10109 6422 16825 74840 166506 128155 21427 -34409 -43690 -75548 -114869
3298 -114869 -126868 -105902 -67699 -44661 -59300 -53706 -53838 -18810 42316 4305 -75814 -107434
3286 -107434 -56074 -64745 -19610 593 -14061 3688 -5552 11006 9941 -20134 7615 -94234
3274 -94234 -133884 -70644 -33761 -57081 -47538 -29591 -39492 -116957 -94864 -84213 -101421 -113223
3262 -113223 -83538 -115813 -129770 -104772 -69515 -87974 -106897 -102664 -53160 -101939 -84890 -49977
3250 -49977 -42358 4424 34386 34711 5174 -19942 -24868 -2500 -30814 -18125 52837 90311 102578
3237 102578 56461 -51097 -93983 -142390 -155620 -116638 -78723 24942 75922 16804 -44786
3226 -44786 -62664 -58764 -62363 -167 45905 -8422 -16043 -17394 -18127 -22252 48079 55857 31546
3213 31546 52125 90262 46563 -8148 39288 46509 35308 -14593 -17229 -9569 -30528 -4244
3201 -4244 13916 -37310 14800 40537 36056 35122 2503 -96471 -125842 -123460 -43262 -16531 -90938
3188 -90938 -56168 43556 88944 47056 8702 -18324 -1585 -28116 -33579 12923 58738 -4750
3176 -4750 -45983 15124 35461 90099 66185 14651 66022 33298 32764 45916 -45957 -62963
3164 -62963 -4019 10140 -9626 5494 5572 25595 89552 104152 91094 57136 67416 8452
3152 8452 3190 -9095 1156 56232 99883 82970 31293 67659 32820 -1087 32397 92281
3140 92281 163290 69862 25144 37958 -14665 18172 51638 59021 -748 6251 -41022 -84044
3128 -84044 -63755 -33947 -30816 7353 -1130 -19808 -27754 -28130 -45959 -35181 -76224 -22782 -12559
3115 -12559 -3648 6810 -28066 -25176 -30908 7417 2380 -45357 7765 9939 -61601 -122836 -92506
3102 -92506 7059 -14586 -35434 -35494 -11789 12417 11992 -8081 -20565 7297 38664 26194 -6715
3089 -6715 -56295 -14063 19706 14830 32859 108231 94676 10737 3888 19564 3365 36916
3077 36916 137714 164975 84507 40028 2621 26346 32590 31137 89653 108083 11343 -54766
3065 -54766 -39118 -56491 -50120 -3087 50439 31330 26461 -4692 43338 72833 37072 -40998
3053 -40998 -50326 -33847 -49147 -82109 -29518 12180 76864 68120 25060 28650 24692 1164 -3983
3040 -3983 -47523 -86551 -58205 -27756 28443 60604 29761 53208 84430 24232 -5414 27575
3028 27575 41521 43678 9139 -61721 -69720 -15477 19050 34429 65759 41215 18418 35009
3016 35009 47159 65945 54546 80224 74056 45488 71796 91526 56666 56971 57335 78179 57296
3003 57296 31963 -51953 -102784 -76246 -41504 -30933 -21789 -24824 -26413 -51138 -74511 -39434
2991 -39434 -43812 -70812 -59927 -24240 -51444 -11702 10297 49704 75993 36280 2664 4506
2979 4506 51447 23500 -10155 -12786 -12163 -55392 -75353 -59313 -91123 -24545 -14421 5237 81410
2966 81410 62641 5179 20325 -37685 -117903 -107768 -71736 -119920 -128482 -106113 -146905 -116929
2954 -116929 -94079 -91517 -131747 -53590 16307 16635 -27281 -33994 9067 31028 66269 95705
2942 95705 92863 7161 -32610 -11767 20419 18525 3813 -62735 -103127 -59641 -56307 -32504
2930 -32504 -1319 4188 -21881 -26094 9091 -31286 -37191 -9405 7701 -35478 -126510 -133274 -97078
2917 -97078 -81346 -53646 3779 95621 51193 -35739 -26677 18972 -31350 59946 118664 74674
2905 74674 4973 9150 62766 2263 -62682 -1847 80219 50131 25510 76976 89355 94975
2893 94975 64232 37967 -21507 -29288 -9985 -71929 -60656 19864 24399 35369 75064 20275
2881 20275 39076 77641 82754 50288 8678 16663 -33255 -16883 17460 37864 20407 -7871
2869 -7871 7813 -2785 9033 -29711 -60146 1799 50037 108369 138013 119305 49034 -54019
2857 -54019 -107602 -89870 -29918 -19096 -49768 -34274 86957 95326 110490 149142 124696 109990
2845 109990 34046 42820 79759 50885 45233 58570 -2550 7954 29051 41998 -5550 -20506
2833 -20506 -26722 -112752 -102925 -94580 -137628 -95056 -77795 -54235 11340 -30212 -46733 -1619
2821 -1619 21518 14609 30218 -29623 54086 69133 82759 25911 39534 83732 -18620 -82814
2809 -82814 -25469 58990 83377 20248 5807 35007 47265 -8116 -74001 7049 -13401 -39582
2797 -39582 -33968 -106 51887 66845 8395 59487 106988 132774 80140 49617 93826 90125
2785 90125 67700 41133 23666 -8099 -31126 -37603 -80542 -63466 26489 29727 2548 -85562
2773 -85562 -89371 -108211 -123969 -153983 -142559 -64615 -62977 -103118 -81912 -33796 -24473 38936
$$ [...]
##END NTUPLES=NMR SPECTRUM
##END=
