##TITLE=Analysis number 328646
Compound Code mo 07873
Book Reference 518/133
Project Code adrs
Chemist Name colinb
##JCAMPDX= 6.0         $$ Bruker NMR JCAMP-DX V2.0
##DATA TYPE= NMR SPECTRUM
##DATA CLASS= NTUPLES
##ORIGIN= Bruker BioSpin GmbH
##OWNER= nmr
$$ XWIN-NMR		Version 3.5
$$ Fri Jun 22 08:47:34 2007 GMT Daylight Time (UT+1h)  MAYBRIDGE\nmr@NMR_250MHZ
##.OBSERVE FREQUENCY= 250.131544655141
##.OBSERVE NUCLEUS= ^1H
##.ACQUISITION MODE= SIMULTANEOUS (DQD)
##.ACQUISITION SCHEME= undefined
##.AVERAGES= 16
##.DIGITISER RES= 18
##SPECTROMETER/DATA SYSTEM= dpx250
##.PULSE SEQUENCE= zg30
##.SOLVENT NAME= CDCl3
##.SHIFT REFERENCE= (INTERNAL, CDCl3, 0, 16.522)
##AUDIT TRAIL= $$ (NUMBER, WHEN, WHO, WHERE, WHAT)
$$ ##TITLE= Audit trail, XWIN-NMR		Version 3.5
$$ ##JCAMPDX= 5.01
$$ ##ORIGIN= Bruker BioSpin GmbH
$$ ##OWNER= nmr
$$ C:\u/data/dgb/nmr/ADRS/1780/pdata/1/auditp.txt
$$ ##AUDIT TRAIL=  $$ (NUMBER, WHEN, WHO, WHERE, WHAT)
(   1,<2007-06-22 08:47:07.66 +100>,<MAYBRIDGE\nmr>,<NMR_250MHZ>,
      <created by zg, POWCHK disabled, PULCHK disabled
       configuration hash MD5:
       76 6E 9A 78 1E 09 19 81 EC 84 63 8F B0 6A 59 2D
       data hash MD5: 64K
       0C C1 2A 5A A0 B0 EF DC 2E 23 74 21 A9 08 40 75>)
(   2,<2007-06-22 08:47:22.71 +100>,<MAYBRIDGE\nmr>,<NMR_250MHZ>,
      <Start of raw data processing
       ef LB = 0.3 FT_mod = 6 PKNL = 1 SI = 32K 
       data hash MD5: 32K
       FF 8F EF D8 B0 46 AB CA 7E E0 E8 D5 20 92 7A CE>)
(   3,<2007-06-22 08:47:24.63 +100>,<MAYBRIDGE\nmr>,<NMR_250MHZ>,
      <apk 
       data hash MD5: 32K
       9B 6A D5 68 77 B7 0E BD B7 C9 52 69 EB 0A C3 64>)
(   4,<2007-06-22 08:47:25.33 +100>,<MAYBRIDGE\nmr>,<NMR_250MHZ>,
      <abs ABSG = 5 
       data hash MD5: 32K
       0A CB 4F 34 42 50 47 C0 EC DB 4B 4D 07 A1 4B CB>)
$$ ##END=
$$ 
$$ hash MD5
$$ F5 94 02 8D A7 71 5E 51 E3 F0 C6 A5 44 7B 42 B2
##$RELAX= 
##$RELAX= 
##$RELAX= 
##$RELAX= 
##$RELAX= 
##$RELAX= 
##$RELAX= 
$$ Bruker specific parameters
$$ --------------------------
##$DU= <C:\u>
##$EXPNO= 1780
##$NAME= <ADRS>
##$PROCNO= 1
##$TYPE= <nmr>
##$USER= <dgb>
##$AMP= (0..31)
100 100 100 100 100 100 100 100 100 100 100 100 100 100 100 100 100 100 
100 100 100 100 100 100 100 100 100 100 100 100 100 100 
##$AQSEQ= 0
##$AQ_mod= 3
##$AUNM= <au_zg>
##$AUTOPOS= <2 >
##$BF1= 250.13
##$BF2= 250.13
##$BF3= 250.13
##$BF4= 250.13
##$BF5= 500.13
##$BF6= 500.13
##$BF7= 500.13
##$BF8= 500.13
##$BYTORDA= 1
##$CFDGTYP= 0
##$CFRGTYP= 5
##$CHEMSTR= <none>
##$CNST= (0..31)
1 1 145 1 1 1 1 1 1 1 1 1 1 1 1 1 1 1 1 1 1 1 1 1 1 1 1 1 1 1 1 1 
##$CPDPRG= <>
##$CPDPRG1= <>
##$CPDPRG2= <>
##$CPDPRG3= <>
##$CPDPRG4= <mlev>
##$CPDPRG5= <mlev>
##$CPDPRG6= <mlev>
##$CPDPRG7= <mlev>
##$CPDPRG8= <mlev>
##$CPDPRGB= <>
##$CPDPRGT= <>
##$D= (0..31)
0 1 0 0 0 0 0 0 0 0.06 0 0 0 0 0 0 0.0002 0 0 0 0 0 0 0 0 0 0 0 0 0 0 
0 
##$DATE= 1182498426
##$DBL= (0..7)
120 120 120 120 120 120 120 120 
##$DBP= (0..7)
150 150 150 150 150 150 150 150 
##$DBP07= 0
##$DBPNAM0= <>
##$DBPNAM1= <>
$$ [...]
##$SUBNAM7= <"">
##$SUBNAM8= <"">
##$SUBNAM9= <"">
##$SW= 20.6930455092707
##$SWIBOX= (0..15)
0 0 3 0 0 0 0 0 0 0 0 0 0 0 0 0 
##$SW_h= 5175.983436853
##$TD= 65536
##$TD0= 1
##$TE= 296.16
##$TE2= 300
##$TE3= 300
##$TEG= 300
##$TL= (0..7)
0 120 120 120 120 120 120 120 
##$TP= (0..7)
150 150 150 150 150 150 150 150 
##$TP07= 0
##$TPNAME0= <>
##$TPNAME1= <>
##$TPNAME2= <>
##$TPNAME3= <>
##$TPNAME4= <>
##$TPNAME5= <>
##$TPNAME6= <>
##$TPNAME7= <>
##$TPOAL= (0..7)
0.5 0.5 0.5 0.5 0.5 0.5 0.5 0.5 
##$TPOFFS= (0..7)
0 0 0 0 0 0 0 0 
##$TUNHIN= 0
##$TUNHOUT= 0
##$TUNXOUT= 0
##$USERA1= <user>
##$USERA2= <user>
##$USERA3= <user>
##$USERA4= <user>
##$USERA5= <user>
##$V9= 5
##$VALIST= <valist>
##$VCLIST= <CCCCCCCCCCCCCCC>
##$VD= 0
##$VDLIST= <DDDDDDDDDDDDDDD>
##$VPLIST= <PPPPPPPPPPPPPPP>
##$VTLIST= <TTTTTTTTTTTTTTT>
##$WBST= 1024
##$WBSW= 4
##$XGAIN= (0..3)
0 0 0 0 
##$XL= 0
##$YL= 0
##$YMAX_a= 343456
##$YMIN_a= -512733
##$ZGOPTNS= <>
##$ZL1= 120
##$ZL2= 120
##$ZL3= 120
##$ZL4= 120
##$ABSF1= 16.522
##$ABSF2= -4.171173
##$ABSG= 5
##$ABSL= 3
##$ALPHA= 0
##$AQORDER= 0
##$ASSFAC= 0
##$ASSFACI= 0
##$ASSFACX= 0
##$ASSWID= 0
##$AUNMP= <proc_1d>
##$AZFE= 0.1
##$AZFW= 0.1
##$BCFW= 0
##$BC_mod= 0
##$BYTORDP= 0
##$COROFFS= 0
##$CY= 12.5
##$DATMOD= 1
##$DC= 0
##$DFILT= <>
##$DTYPP= 0
##$F1P= 14.0000005364418
##$F2P= -0.99999901652339
##$FCOR= 0.5
##$FTSIZE= 32768
##$FT_mod= 6
##$GAMMA= 0
##$GB= 0
##$INTBC= 1
##$INTSCL= 1
##$ISEN= 128
##$LB= 0.3
##$LEV0= 0
##$LPBIN= 0
##$MAXI= 10000
##$MC2= 0
##$MEAN= 0
##$ME_mod= 0
##$MI= 0
##$NCOEF= 0
##$NC_proc= -3
##$NLEV= 6
##$NOISF1= 0
##$NOISF2= 0
##$NSP= 0
##$NTH_PI= 0
##$NZP= 0
##$OFFSET= 16.522
##$PC= 1
##$PHC0= -57.47604
##$PHC1= 8.164336
##$PH_mod= 1
##$PKNL= yes
##$PPARMOD= 0
##$PSCAL= 4
##$PSIGN= 0
##$REVERSE= no
##$SF= 250.13
##$SI= 32768
##$SIGF1= 0
##$SIGF2= 0
##$SINO= 400
##$SIOLD= 32768
##$SREGLST= <1H.CDCl3>
##$SSB= 0
##$STSI= 32768
##$STSR= 0
##$SW_p= 5175.98343685301
##$SYMM= 0
##$S_DEV= 0
##$TDeff= 65536
##$TDoff= 0
##$TI= <Analysis number 999999
Compound Code 99
Book Reference 9
Project Code 9>
##$TILT= no
##$TM1= 0
##$TM2= 0
##$TOPLEV= 0
##$USERP1= <user>
##$USERP2= <user>
##$USERP3= <user>
##$USERP4= <user>
##$USERP5= <user>
##$WDW= 1
##$XDIM= 32768
##$YMAX_p= 436129106
##$YMIN_p= -77997
$$ End of Bruker specific parameters
$$ ---------------------------------
##NTUPLES= NMR SPECTRUM
##VAR_NAME=  FREQUENCY,     SPECTRUM/REAL,   SPECTRUM/IMAG
##SYMBOL=    X,             R,               I
##VAR_TYPE=  INDEPENDENT,   DEPENDENT,       DEPENDENT
##VAR_FORM=  AFFN,          ASDF,            ASDF
##VAR_DIM=   32768,         32768,           32768
##UNITS=     HZ,            ARBITRARY UNITS, ARBITRARY UNITS
##FACTOR=    0.157963299565203, 1,           1
##FIRST=     4132.6476996994, 0,             0
##LAST=      -1043.33573715361, 0,           0
##MIN=       -1043.33573715361, -77997,      0
##MAX=       4132.6476996994, 436129106,     0
$$ Real data points
##PAGE= N=1
##DATA TABLE= (X++(R..R)), XYDATA
$$ [...]
15996B681482J7408N7222R6617J62610K29293K90420L84589M89054O24678P83060
15986E816433R77624J182584J350149J365621J132445N69164j50348o55542p72512
15977A0815618n99779l32135j35986j49153l83489o75556q85336r36319q41709
15968E876156p20244n87363m71975l76418k73701k07503j44770r2252o3932o812
15958B931186N9454J14746J50683J96014K42718L01335L94174N11162O30419P76608
15948F308499Q74726Q95996P84221N80860L98275L89892N74320P95632Q98885
15939A2501306P36681J88809o41901j366129j670858j622423j369072j081121
15931E675292q39231o31256m80254l52675k52657j70719j11004o5608k4587J78
$$ plain form
15996 2681482 2698890 2756112 2852729 3015339 3244632 3535052 3919641 4408695 5033373 5816433
15986 5816433 6794057 7976641 9326790 10692411 11824856 12394020 12243672 11588130 10815618
15977 10815618 10215839 9883704 9747718 9598565 9215076 8539520 7654184 6717865 5876156
15968 5876156 5155912 4568549 4096574 3720156 3446455 3238952 3094182 3001930 2937998 2931186
15958 2931186 2990640 3105386 3256069 3452083 3694801 3996136 4390310 4901472 5531891 6308499
15948 6308499 7183225 8079221 8863442 9444302 9842577 10232469 10806789 11602421 12501306
15939 12501306 13237987 13426796 12784895 11418766 9747908 8125485 6756413 5675292
15931 5675292 4836061 4204805 3724551 3371876 3119219 2948500 2837496 2771888 2747301 2747479
15921B747479L2303N7386R7138J58195K06417K87762L91378N20928O54894Q05047
15911E958927R69463J090505J093203Q92590N20118J54656r4947k38814m03141
15902I942560o73495r82444j137179j094895r32794p51417n65333m10148k94469
15893C100386k30602j52585q9587m9178q263M407J4646N3737R6586J53353K21443
15882C114343L13962M36886N58483P19288Q95200J107671J307391J456725J410324
15873A1320273J052402L17505o47841j409953j702176j620708j351545j061763
15865D896194q28754o30385m78053l66870k89443k21830j70869j15127p0920m7644
15855A676299m3628k7542l0210r115J2797K6140M3627O6174J20748J68731K23741
$$ plain form
15921 2747479 2779782 2837168 2934306 3092501 3298918 3586680 3978058 4498986 5153880 5958927
15911 5958927 6928390 8018895 9112098 10004688 10524806 10679462 10584515 10345701 9942560
15902 9942560 9269065 8286621 7149442 6054547 5121753 4370336 3805003 3394855 3100386
15893 3100386 2869784 2717199 2627612 2578434 2570171 2574578 2589224 2642961 2739547 2892900 3114343
15882 3114343 3428305 3865191 4423674 5142962 6038162 7145833 8453224 9909949 11320273
15873 11320273 12372675 12690180 12042339 10632386 8930210 7309502 5957957 4896194
15865 4896194 4067440 3437055 2959002 2592132 2302689 2080859 1909990 1794863 1723943 1676299
15855 1676299 1632671 1605129 1574919 1565804 1578601 1604741 1648368 1714542 1835290 2004021 2227762
15844B227762K90769L61994M71868N86310O65463O79557N60356K74040j63883
15835E954236n81128q17077q28473p21687n81456m49596l36521k46765j97867
15826A193666j46846j37345j16803q0739p7589m7923k4907k9154k5245m1119j6195
15815D49801l2162l7897k4276j4193k2030k0377j5551r615k1167k5903j8318j1656
15803A96656j3137j5587m635o188p173J1239j847k1162j1207r830n852O399j1888
15790A05788p306Q208N416m749j0483P49O286J0595l455j5970k8063k729K852
15777F7139R576P389K153j3897k458L821L17N984o439k225P544L083k0605j8845
15763D2537J4891N444N318r017k983J0497j972r097M863m610q832O96P238J4997
$$ plain form
15844 2227762 2518531 2880525 3352393 3938703 4604166 5283723 5844079 6118119 5954236
15835 5954236 5373108 4556031 3727558 3005871 2424415 1974819 1638298 1391533 1193666
15826 1193666 1046820 909475 792672 711933 634344 586421 561514 532360 507115 465996 449801
15815 449801 417639 379742 355466 341273 319243 298866 283315 273700 252533 226630 208312 196656
15803 196656 183519 167932 163297 157109 149936 161175 159328 138166 126959 117129 111277 117676 105788
15790 105788 98482 106690 112106 107357 96874 97623 103909 114504 111049 95079 67016 64287 67139
15777 67139 76715 84104 86257 72360 69902 73723 74040 80024 73585 71360 78904 81987 61382 42537
15763 42537 57428 62872 68190 59173 56190 66687 64715 55618 60481 55871 47039 47735 54973 69970
15749F9970M407l318J1462L735j0816n871j0105j5947R135O882o647J264Q021
15736F2172p748r020Q123N283K565j0737M535J0643N384j8326l15o639n451o68
15722C9801L955O601P203L099j1645j7265Q663J0523l553m627l110m684R924L720
15708D8605P908l83m456O409J373j19j138k947j1373q766M115J201n795l06J513
15693C5841n108J140J24M335k327P625l504J1174J1786k290o405l085l399J0924
15679E6831k304q153J205m408k636K886n175j5909K954j3746k5J8264J3611P64
15665D4159l981N801J2465n511r686N517j0153M71k65K544J4336K074j5138k400
15651D0233r462l522k507R193P261J2420M766l446r998j2221M862M802k669J654
$$ plain form
15749 69970 74377 71059 82521 86256 75440 69569 59464 43517 52652 59534 52887 54151 62172
15736 62172 54424 45404 53527 58810 61375 50638 55173 65816 71200 52874 52559 45920 40469 39801
15722 39801 43756 50357 57560 60659 49014 31749 40412 50935 47382 42755 39645 34961 44885 48605
15708 48605 56513 56130 51674 58083 59456 59337 58199 55252 43879 35113 39228 40429 34634 34328 35841
15693 35841 30733 31873 31997 36332 34005 41630 38126 49300 61086 58796 52391 49306 45907 56831
15679 56831 54527 46374 47579 43171 40535 43421 38246 22337 25291 11545 11520 29784 43395 44159
15665 44159 40178 45979 58444 52933 43247 48764 38611 39082 38817 41361 55697 57771 42633 40233
15651 40233 30771 27249 24742 33935 41196 53616 58382 54936 44938 32717 37579 42381 39712 41366
15637D1366R076R758l533n407o540l522Q934J0770P320o852j1970j0033j3087
15624B6280N448J768J2779M704N191L730N014n814j0652m681k495L943L739n665
15610D3289j038P119j567J776k0529l748J4626P051j589Q361R334n427L56Q040
15596F6054o010P60m796j1180K431m82N289q872K1145L7040J0320j7861o150J524
15582H9212j5907o356J4686M862p878L609l33r998l322m267J1138r410p466n642
15568E2928j3744J275J5342J3256k632j1364J3526K097m276q34J1010K958O987
15555H6529L580j299p55J321N020R511J3283M574j2662j3692l726j193k4240q017
15541E8234L716J2938R721N028N727M140Q505j246j934J6480K2159J463k601n59
$$ plain form
15637 41366 50442 60200 56667 51260 44720 41198 50132 60902 68222 61370 49400 39367 26280
15624 26280 31728 33496 46275 50979 56170 59900 64914 59100 48448 43767 41272 45215 48954 43289
15610 43289 42251 49370 47803 49579 29050 25302 39928 46979 45390 53751 63085 57658 58014 66054
15596 66054 60044 60804 56008 44828 47259 46777 52066 43194 64339 101379 111699 93838 87688 89212
15582 89212 73305 66949 81635 86497 78619 82228 81895 71897 68575 64308 75446 66036 58570 52928
15568 52928 39184 40459 55801 69057 66425 55061 68587 70684 66408 65574 76584 79542 86529
15555 86529 90109 88810 88055 89376 94396 103907 117190 121764 109102 95410 91684 90491 66251 58234
15541 58234 61950 74888 84609 89637 95364 99504 108009 106763 104829 121309 143468 144931 142330 141771
15527A41771K106L417K2379K9659J2929J7371K5787J1976r840j8629j7424o941
15515B14561j354J3310J7387J9535J1020O582j8213l8913k7674k8016q657P10
15503A60278M897o8J746o611k0545j4997k015o296j5450j6979J8542N951j230
15490A07223J967J2423J876J9356N752L365r15J1439j5347k8241j8085K1961R802
15477A32576J620P65r748k463m899r769J378R174P954n796p817j4241m773K069
15463I6030l583K619J562m675l361M690l89m576l746p161J4542J8907J5311j2103
15449A14067L153J3071J979j240R827J748q20O626j388Q70P81j0386j365n258
15435A31665M74l190j0303o750K336K939O155M455K718l205Q983J505J0206O482
$$ plain form
15527 141771 143877 147294 169673 199332 212261 229632 255419 267395 257555 238926 221502 214561
15515 214561 213207 226517 243904 263439 274459 281041 262828 223915 196241 168225 159568 160278
15503 160278 165175 165107 166853 160242 139697 124700 122685 116389 100939 83960 102502 108453 107223
15490 107223 109190 121613 123489 142845 148597 151962 151047 162486 147139 118898 100813 122774 132576
15477 132576 134196 134961 125213 122750 117851 108082 109460 118634 126588 120792 112975 98734 93961 96030
15463 96030 92447 95066 96628 91953 88592 93282 92893 88317 84571 77410 91952 110859 126170 114067
15449 114067 117220 130291 132270 131030 140857 142605 141785 148411 147023 147893 148674 138288 136923 131665
15435 131665 132139 128949 118646 111896 114232 117171 123326 127781 130499 127294 136277 137782 147988 154470
15421A54470J5343M976k712j302l716K53J8344L1957L1662J7274J168j3111j5058
15408B39548n724j9116M968J3615n083L60K2511l495j5655k7056l4873k4290K238
15395A47948J0352L238J108L526n222j1195j2801j5904o489O417L099l659K346
15382A22764J3974J0632K4089J7369M917O486O914R876j0295p607K781j0574j6364
15369A74962M120J2556J7694J4036P050J2604J3633K193o638J0469K5080J0986
15357B98745k943j4243j8931l021R06K107J5634L841L302j1381r446r546k0829
15344B34195j3424N138q933j4964l833q546O50j5866j1289q133j3480J310M895
15331A47720p797j5077m870M730J4461J2937l187L667p500l156j33n063J378M129
$$ plain form
15421 154470 169813 174789 172077 170775 167059 167312 185656 217613 249275 266549 267717 254606 239548
15408 239548 233824 214708 219676 233291 228208 228568 251079 247584 231929 204873 170000 145710 147948
15395 147948 158300 161538 162646 166172 160950 149755 136954 121050 114561 120978 124077 120418 122764
15382 122764 136738 147370 171459 188828 193745 200231 207145 217021 206726 199119 201900 191326 174962
15369 174962 179082 191638 209332 223368 230418 243022 256655 258848 252210 262679 287759 298745
15357 298745 295802 281559 262628 259607 260513 262620 278254 282095 285397 274016 264570 255024 234195
15344 234195 220771 225909 216976 202012 198179 189633 190283 174417 163128 154995 141515 142825 147720
15331 147720 139923 124846 119976 124706 139167 152104 148917 152584 145084 141928 141795 136732 138110 142239
15317A42239N073M129l714j4031l136J0505N876N353K099J8748M768m393n967
15304A67549J9310K3010O490M624N317J4708O075k801M655N058J9790J6474J686
15291B91945j7402r20k873Q198R004k599m01J0277O749m092j2518k7173j8699
15278B39496j5982p32j3000J0509J0914O002j2559j3970n627M537J3762m745p074
15265B11531k573m390N946J0648j1052j6639M465j317j0723j0537P877P318R79
15252A91533M538P810K821m436n780R554N601n75k551M480m212m124J2156J2171
15238B28986Q707M403j809K653o670P317q42J7286L232N593j246r875l443p491
15224B46801O016n289l516J6922K1694R63O273q522N178K510r309o609p75K015
$$ plain form
15317 142239 147312 151441 147727 133696 130560 141065 146941 152294 154393 173141 177909 173516 167549
15304 167549 186859 209869 216359 220983 226300 241008 247083 244282 248937 253995 273785 290259 291945
15291 291945 274543 273623 270750 278948 287952 285353 284952 295229 301978 297886 285368 258195 239496
15278 239496 223514 222782 209782 220291 231205 237207 224648 210678 205051 209588 223350 218605 211531
15265 211531 208958 204568 210514 221162 210110 193471 197936 196619 185896 175359 183236 190554 191533
15252 191533 196071 203881 206702 202266 196486 206040 211641 211066 208515 212995 208783 204659 216815 228986
15238 228986 237693 242096 240287 242940 236270 243587 242745 260031 263263 268856 267610 257735 254292 246801
15224 246801 252817 247528 244012 260934 282628 283591 289864 281342 286520 289030 279721 273112 272337 274352
15210B74352J8742j7668o220M013O895k850M988R329L939N641R659m598o304N098
15196C05016Q221J752p435O103J7420j504k130o061K122J4277p586p909Q360O210
15182C36856J0159m276L953O565J2832k117j2548k92j866K447J3419J2871J0850
15169C88853n368J1103N382J886n549j580M330R43j333Q166O861r174Q375R984
15155D22879L057L319m343j9823l352M999J1962R272m882Q506J0563J1265L742
15142D57164j747N184J7680N394O393J510j25n943L105J8217J1666J254R342J1494
15128E40588J733j896k166M39J6605O806J6108J0950P110J2785Q63n01N012j235
15114F13201J1726P813J6029J8376O262P288J1040J521J2665K6067M242J374J6437
$$ plain form
15210 274352 293094 275426 269206 273219 280114 277264 282252 291581 295520 301161 310820 306222 299918 305016
15196 305016 313237 314989 307554 313657 331077 329573 327443 321382 323504 337781 330195 322286 330646 336856
15182 336856 347015 342739 346692 353257 366089 363972 351424 351132 349266 351713 365132 378003 388853
15169 388853 383485 394588 399970 401856 396307 394727 399057 400000 398667 406833 413694 404520 412895 422879
15155 422879 425936 429255 424912 405089 401737 406736 418698 427970 423088 431594 442157 453422 457164
15142 457164 455417 460601 478281 483675 490068 491578 491453 485510 488615 506832 518498 519752 529094 540588
15128 540588 542321 540425 538259 538698 555303 562109 578217 589167 596277 609062 609925 609424 614436 613201
15114 613201 624927 632740 648769 667145 673407 680695 691735 693256 705921 731988 736230 737604 754041
15101G54041O592J0295J5078K8525J2762J5032Q184k177N798Q42K3131O927N367
15088H90397O267J7628J2769Q284J4898L3437K5102J4974K1997L6387L4222K1443
15076A137805K8671L1837M1274L4223M7522L8740M0640M2208N2134N1299M2577
15065A588930N0188N5757O4074Q7148J03429J34111J44188J35554J24897J42408
15055B630684J73711K40293L12792L90580M95882O79181R12187J177320J490932
15046H503562J861796K060404J452702o1526r05580m63752M51291J449054K529811
15037A6877762L690987M817942N434112L669245j530966n276263m685937k500851
15029B0496031n90411J093899K737440M143209M938412L369108j996071o401943
$$ plain form
15101 754041 760633 770928 786006 814531 827293 842325 850509 848332 854130 854972 878103 885030 890397
15088 890397 896664 914292 927061 935345 950243 983680 1008782 1023756 1045753 1082140 1116362 1137805
15076 1137805 1166476 1198313 1239587 1273810 1321332 1360072 1400712 1442920 1495054 1546353 1588930
15065 1588930 1639118 1694875 1758949 1846097 1949526 2083637 2227825 2363379 2488276 2630684
15055 2630684 2804395 3044688 3357480 3748060 4243942 4923123 5835310 7012630 8503562
15046 8503562 10365358 12425762 13878464 13816938 12911358 12447606 12898897 14347951 16877762
15037 16877762 20568749 25386691 30820803 34490048 32959082 27682819 22996882 20496031
15029 20496031 19905620 20999519 23736959 27880168 32818580 36187688 34191617 27789674
15021B7789674o194540m136901k414017j155616j31183O65788J111967P41326
15013A6276498q82584k420298k468265j810607j269559r10394o31610m28474k95369
15004E159338k08830j37759p3671k7054M159k0217j05957j19609r1087m1300j3014
14993D324999m261L3508P1770Q8323R0140M2234m7895n4103k514K0919L6002M3299
14981D642421M9439O2886P0676P6998N3734Q495J0361L7820N5819N2532N0185
14970E171366N6821O1679N1637N7669O3973N0615M6447O7181P4663P2408N3245
14959E827704N4251O8630N9102O9456O5141P1715Q4618R4078J15144J25924J27306
14948F763069J24150J20636J43474J81442K51123L19967M11746N48059P31589
$$ plain form
15021 27789674 21595134 17458233 15044216 13888600 13757417 14423205 15535172 16276498
15013 16276498 15393914 12973616 10505351 8694744 7425185 6514791 5883181 5454707 5159338
15004 5159338 4950508 4812749 4739078 4712024 4716183 4695966 4590009 4470400 4379313 4338013 4324999
14993 4324999 4320738 4354246 4426016 4514339 4604479 4646713 4598818 4544715 4542201 4563120 4599122 4642421
14981 4642421 4691860 4754746 4825422 4902420 4956154 4964649 4975010 5012830 5068649 5121181 5171366
14970 5171366 5228187 5289866 5341503 5399172 5463145 5513760 5560207 5627388 5702051 5774459 5827704
14959 5827704 5881955 5950585 6009687 6079143 6144284 6215999 6300617 6394695 6509839 6635763 6763069
14948 6763069 6887219 7007855 7151329 7332771 7583894 7903861 8315607 8863666 9595255
14939I595255R52716J219089J476265J637857J133488j12704p95894m16846L52478
14930A5041704J144276J984479K935249L879417M348880K898880j353106m392225
14922B6487554l871734k078761n20935Q36096K162419L292528L938272K659913
14914C2905352j710732n260976n070510l373120j973529r61263j45815M79965
14906A4889372Q49180N42051q04018k041365k049361j489473j046966p69964n72848
14897G506608m21992l36020k56570j93889j26594r0263o1166q1202j54656j74140
14887E610116j42876q9942n7945k7428Q804N2731Q5173J21894J32541J36571J85739
14876F015378K66239L98238N55532P81032J005444J123703J169713J457321J947514
$$ plain form
14939 9595255 10547971 11767060 13243325 14881182 16014670 15901966 15106072 14689226 15041704
14930 15041704 16185980 18170459 21105708 24985125 29334005 32232885 30879779 26487554
14922 26487554 22615820 20537059 20016124 20852220 23014639 26307167 30245439 32905352
14914 32905352 31194620 25933644 20863134 17490014 15516485 14555222 14409407 14889372
14906 14889372 15738552 16280603 15476585 13435220 11385859 9896386 8849420 8079456 7506608
14897 7506608 7084616 6748596 6492026 6298137 6171543 6081280 6020114 5938912 5784256 5610116
14887 5610116 5467240 5377298 5319353 5291925 5300729 5353460 5438633 5560527 5693068 5829639 6015378
14876 6015378 6281617 6679855 7235387 8016419 9021863 10145566 11315279 12772600 14720114
14867A4720114K221823J729281N83652K19259Q25535J381427K011561K975006
14859B6667658L808669K986382J2355k294427k716863j937977o98720L75067J351799
14850B7553943J790962Q80348j135188l638993m584202l525131k208137j252007
14842A3881595m34728Q8018k44956j414900k159102j928637j370394r14529o22526
14833D879841m50247l35671k64938k21341j66557j11639q6031o8979n2235l9411
14823C082792m3232m8557m1801j8366n186J7424N7654Q6828J08602R5696J29631
14812C421485K00014K45839L01395M11003N73520P50682R44291J019636J061297
14803H929162J357771J768153J925201J335096L77800L19732R74403J461484J987744
$$ plain form
14867 14720114 16941937 18671218 19254870 19474129 20299664 21681091 23692652 26667658
14859 26667658 30476327 33462709 33475064 31180637 28463774 26525797 25827077 26202144 27553943
14850 27553943 29344905 30225253 29090065 25451072 20866870 17341739 15133602 13881595
14842 13881595 13446867 13534885 13289929 11875029 9715927 7787290 6416896 5502367 4879841
14833 4879841 4429594 4093923 3828985 3607644 3441087 3329448 3243417 3174438 3122203 3082792
14823 3082792 3039560 2991003 2949202 2930836 2925650 2943074 3000728 3087556 3196158 3291854 3421485
14812 3421485 3621499 3867338 4168733 4579736 5153256 5903938 6848229 7867865 8929162
14803 8929162 10286933 12055086 13980287 15315383 15693183 16012915 16987318 18448802 20436546
14794B0436546K829470L402475K251002m87890k217291k345580j461027k79713
14786B2127992O37543J432556J640592O02335j441353l710033m152822k935824
14778A4200986j742569r36471k38746J57097k92063j487046k062704j717393j173720
14769D707371p96389n36795l80751k69748j97740j45753j38830j39050r9795p3394
14759A929126n5278m3838j8653k946O255l83m7924o9226o4663m2939l8536k7300
14747A523695j4834J3252J9784J2673j9362n5359n2300l8801m4838l8766l6903
14736A268241j6143M528k015k1084k4162l1579k8558l1426m0818n192r526p203
14724A055063l885m803j5054j3577j4774k778o240K96j570j863P2j2390k7482
$$ plain form
14794 20436546 23266016 26668491 28919493 28431603 26214312 23868732 22407705 22127992
14786 22127992 22765535 24198091 25838683 26441018 24999665 21289632 17136810 14200986
14778 14200986 12458417 11521946 11283200 11440297 11148234 9661188 7598484 5881091 4707371
14769 4707371 3910982 3374187 2993436 2723688 2525948 2380195 2241365 2102315 2002520 1929126
14759 1929126 1873848 1830010 1811357 1808411 1814666 1814283 1766359 1697133 1632470 1589531 1550995 1523695
14747 1523695 1508861 1522113 1541897 1554570 1535208 1479849 1427549 1388748 1343910 1305144 1268241
14736 1268241 1252098 1256626 1254611 1233527 1209365 1177786 1149228 1117802 1076984 1071792 1062266 1055063
14724 1055063 1051178 1046375 1031321 1017744 1002970 1000192 993952 994248 992678 990815 990887 978497 951015
14711I51015q019o681m736j2043N330P465j3550m856r950j868L938K9570K0672
14698I56287J6914q2j6236j8871l02n575N294K5001L4476M3927J1327l4236m1330
14685I76594m1853l3134q224K0573J8602K3249L2106K833l1091m4814n1785k1911
14673H41145r560N427j0493l853J1003L185j9326k2653j8024q859j4665l995J031
14660G50363r597j0221j321L88l125j6141n821K681j279n139m75j1980j4025j6106
14646F58202L13j5278k4120j5999K591K332k259J260r697j923l506r545j0940
14633E71431k970J776n398r646j0768O196P314m290o609J717j376r722j2854j0073
14619E14728N701j8223m747k911L106k1487j7940J034O129J141o796j5534q434
$$ plain form
14711 951015 942996 936315 931579 919536 924866 932331 918781 913925 903975 902107 906045 935615 956287
14698 956287 973201 973119 956883 938012 937710 932135 937429 962430 996906 1040833 1052160 1017924 976594
14685 976594 934741 901607 893383 913956 932558 955807 987913 990746 959655 914841 863056 841145
14673 841145 831585 837012 826519 822666 833669 836854 817528 794875 776851 767992 753327 749332 750363
14660 750363 740766 730545 729224 729612 726487 710346 704525 707206 705927 700788 700313 688333 674308 658202
14646 658202 658515 643237 619117 603118 605709 608041 605782 607042 597345 595422 591916 582371 571431
14633 571431 568461 570237 564839 555193 544425 550621 557935 553645 547036 548753 547377 537655 524801 514728
14619 514728 520429 502206 497459 494548 497654 476167 458227 459261 465390 466531 459735 444201 435767
14606D35767j6271r937M544J1066K150P039J460J662p511k0080j1349q973k398
14593C87169M068l029J0685L492k3656j3616M295N418j2018R646N879j4699j0267
14580C53367q878p887M546j7340l483O809m546q818o14P893N29K462k261p803
14566C13976j04p948o182k896l358N960L806p54P062n335m898J1190P937J5795
14552C34251k451q768j701Q945K3178J1874j2432j9347j0680P055J4671K8451
14540C73046K6504K1229j2393k8658j4473j37r893j9751j893J1182K8086L8861
14528D11710P721l8870l4675j9637k4109k8608j0389L326J2526N025J6115j2069
14516B88066k8293j0626k0593l067q153q149r08r045m770j605J2102J6465p302
$$ plain form
14606 435767 419496 409559 414103 425169 427319 434358 435818 437480 429969 409889 398540 389567 387169
14593 387169 391237 388208 398893 402385 378729 365113 369408 374826 362808 372454 378333 363634 353367
14580 353367 344489 336602 341148 323808 320325 327134 322588 313770 313156 321049 321578 324040 321779 313976
14566 313976 313872 305924 299742 296846 293488 299448 303254 302500 309562 304227 299329 310519 318456 334251
14552 334251 331800 323032 321331 330276 353454 365328 352896 333549 322869 329924 344595 373046
14540 373046 399550 420779 408386 379728 365255 365118 355225 335474 333581 344763 372849 411710
14528 411710 419431 380561 345886 326249 302140 273532 263143 266469 278995 284020 300135 288066
14516 288066 259773 249147 228554 225487 217334 209185 208277 199232 194462 192857 204959 221424 214122
14503B14122j5343j1546j03P547J644j1786l1424L292J0443J532j1391k244J3442
14490A68185J0033l661j7402j783J319L870j3168j2977k414K190K952N953q94
14477A42203j7633q610O35Q052P749N350N103j0835p717K824J891O893n090n93
14463A30222M126L878k003J527k661l619k073j0804K084M777P538R422Q3j1153
14449A31344J703J00l619Q501l454k568J6608P147J9174J3809K795j9245j4819
14436A57476l461J7028J3502J2126R721J2027K8294J9857r863k8088j8846j0528
14424A99245l239Q607J9539J0630O627J969j6185l5753j7481k2106j2483K26J187
14411A40783r47P415J1074m274j2199j1341j1506l671q778n36j634j7164k234
$$ plain form
14503 214122 198779 187233 187130 194677 196321 184535 153111 156403 166846 168378 156987 154743 168185
14490 168185 178218 174557 157155 155372 156691 160561 147393 134416 132002 134192 137144 143097 142203
14477 142203 124570 115960 116595 124647 132396 137746 142849 132014 124297 127121 129012 135905 130815 130222
14463 130222 134348 138226 136223 137750 135089 131470 129397 118593 120677 125454 132992 142414 142497 131344
14449 131344 133047 133147 129528 138029 134575 132007 148615 155762 174936 188745 191540 172295 157476
14436 157476 154015 171043 184545 196671 206392 218419 246713 266570 256707 228619 209773 199245
14424 199245 196006 204613 224152 234782 241409 243378 227193 191440 173959 151853 139370 139596 140783
14411 140783 139836 147251 158325 154051 141852 130511 119005 115334 106556 106020 104386 87222 84988
14398H4988jM706N502J535j3670o131M022N889J5052K0414j013j2098j4281j5214
14384G9700k335K1954P485l768j058p079l178O912j5884j5995J438J0410J0323
14371H8925J0654l810m45N439O356J0141m099J0254J0075k065j625J9848J1439
14358A61087l227Q196J065J1774J9118J4007L416K6699J1522j642l62J828o032
14345B47449k822j537O339K227r620q455j0839k0446j3272n100r902K317J0658
14332A86997J0306j3487j0970m162q778P104j6520j6950l571J3121J4413O120
14320A63623j0291k2840k4421j0226l890N229O744J5943j343k870J0243Q00L609
14307A30310K3432L4394J9115k620J360q158j254M880Q576J2379J6359J6784K9073
$$ plain form
14398 84988 84987 89693 95195 96730 83060 76929 80951 86840 101892 122306 121293 109195 94914 79700
14384 79700 77365 99319 106804 103036 101978 94899 91721 98633 82749 66754 68192 78602 88925
14371 88925 99579 95769 95324 100763 107119 117260 113161 123415 133490 131425 129800 149648 161087
14358 161087 157860 166056 167121 178895 198013 212020 215436 242135 253657 252015 251653 253481 247449
14345 247449 244627 243090 249429 251656 242036 233581 222742 202296 189024 183924 174022 176339 186997
14332 186997 197303 183816 172846 168684 159906 167010 150490 133540 129969 143090 157503 163623
14320 163623 153332 130492 106071 95845 91955 97184 103928 119871 118528 115658 125901 126701 130310
14307 130310 153742 188136 207251 204631 205991 197833 196579 201459 210035 222414 238773 255557 284630
14294B84630K6780Q157j2849M006K4405K6364J5103R206K1693J0192k024j0072
14282D05591k0957j8918o239J0176M143m056l111l503n0k7442k9240k8150j0502
14269B67742j1077j42j5419r894m516j4862p151l267O569O246j1799p366l577
14256A91487N443J2810R753N056r762j116K4348J2228o280J166L941j137M8j6821
14242B31164j3671J760j0369q875k3578k2417m510p985R979m410k0025m925M287
14229A26425k0328j3031L471k756m674n110L407J2073N27J067M334J5466j6195
14216A04676j2473j283M078N694j3839k0944p146J5385R047k423j8689j415j3052
14203D7616O482M386l759l476k622k13Q133K8171j5597j6430K742J773k543j616
$$ plain form
14294 284630 311410 319567 306718 310724 335129 361493 376596 385802 407495 417687 415663 405591
14282 405591 384634 365716 359477 369653 373796 369740 366629 363126 363076 335634 306394 278244 267742
14269 267742 256665 256523 241104 231210 226694 211832 204681 201414 207983 214229 202430 195064 191487
14256 191487 196930 209740 219493 224549 214787 213671 238019 250247 243967 245133 249074 247937 247985 231164
14242 231164 217493 219253 208884 200009 176431 154014 149504 141519 151498 147088 127063 122138 126425
14229 126425 106097 93066 96537 93781 89107 83997 87404 99477 100004 101071 105405 120871 104676
14216 104676 92203 90920 94998 100692 86853 65909 58763 74148 83195 80772 62083 60668 47616
14203 47616 54098 58484 54725 51249 48627 48414 56547 84718 69121 52691 55433 57206 54663 53047
14189E3047O052J768j1892P103K6454P75j4859l900l754l135p857N70o989J871
14175D5254J9770J3034k420p540l752J4578o608n160Q108r104J05L342q456N130
14161F6281l06M170R664O417n989r408m442q435n583R678o607n259L418J4944
14147F8543J5863p462j9442o952l011O249j222o499K441J0030Q995P494j803k148
14133G1076k774k9Q547J2754q285l645m067Q395r704J24K608m58p506q366j05
14118E8565P099K784j663L364o427p273k63J1619R065q001m174O880P642J801
14104H1018J2354j781o904K836P113J017k639r625O223M216j9392l771R864n636
14090G4893p6J6403P629J1352K437o118K886J4962n421J50l524j1942K411J3645
$$ plain form
14189 53047 59099 60867 48975 56078 82532 83307 68448 64548 60794 57659 49802 50372 43383 45254
14175 45254 65024 78058 75638 68098 64346 78924 72316 67156 75264 66160 66265 69607 61151 66281
14161 66281 65975 70145 79809 86226 80237 70829 66387 57952 52369 62047 55440 50181 53599 68543
14147 68543 84406 76944 57502 50550 47539 53788 52566 46067 48508 58538 67533 75027 73224 71076
14133 71076 68302 68273 76820 89574 81289 77644 73577 81972 72268 72392 75000 74542 67036 58670 58565
14118 58565 65664 68448 66785 70149 63722 56449 56186 67805 76870 68869 64695 71575 79217 81018
14104 81018 93372 91591 84687 87523 94636 95653 93014 83389 89612 93828 74436 70665 80529 74893
14090 74893 74817 91220 98849 110201 112638 106520 109406 124368 118947 119097 115573 103631 106042 119687
14076A19687O642M588J3183k1300l0939L148r25q80Q057J0952P181j669n818j2147
14062I9760r58n100j953q47J0051J545n87M35L689k432o878R199J0109J114l522
14047A13625N28J616M15j3234j1558J949P954n65j0228l511J7483K6296K143l1815
14033A01098j2358N341K5838J3864j1576M525j232M039O954o036N618M557Q141
14020A48773J677k002R602L47j0925m521l04J5390J4363l930K787J34n919o141
14006A59331p61J0349k877j0184J4055J5518n448J786J135J252q287n559J1121
13993A81431l30J0903K1747j1491N160Q790o042j7624N426K819j3083O197J2782
13980B06685J2503J3062M74l156j0972J0225K4553N044J846J1827J069J4729q103
$$ plain form
14076 119687 126329 130917 144100 122800 91861 95009 94084 93204 101261 112213 119394 117725 111907 99760
14062 99760 98802 93702 91749 90902 100953 102498 101911 102346 106035 103603 96725 105924 116033 117147 113625
14047 113625 114153 115769 116184 102950 91392 93341 101295 100730 90502 86991 104474 130770 132913 101098
14033 101098 88740 94081 119919 133783 122207 126732 125500 129539 136493 130457 136075 140632 148773
14020 148773 150450 148448 158050 158397 147472 142951 142647 158037 172400 168470 171257 171391 165472 159331
14006 159331 158570 168919 166042 155858 169913 185431 179983 181769 182904 184156 175869 170310 181431
13993 181431 181101 192004 213751 202260 207420 216210 210168 192544 197970 200789 187706 193903 206685
13980 206685 219188 232250 232724 229568 218596 228821 253374 258418 260264 272091 273160 287889 279786
13967B79786O257P415j06l636J3332J9426N685J332K5270J1935P319p259n367
13954C61389P336J4662J6179k427j268R533J6722K601K224q41P854R970L039Q667
13940D55640J1750J7500M007L082J3172J1213K1859L0853J0819J7468K3385J4795
13928F35543J1649L341J156J6735J3701K0524L2404K2766L4169K3124O480K0530
13916H42122J9667K1907L9412J9583L1578K2279K7731L3744J9815L6225N0727
13905A164790M3043L0799L5482K7527M4362P2012N2641O9241P4563Q6785J20985
13894A822230J38337J48568J30348O5043L6554Q6831J52400K20854K83708L48296
13884C433169M27179N05288N83878P51641R88888J241193J186072L92038n93268
$$ plain form
13967 279786 286043 293458 293352 289716 303048 322474 328159 329491 354761 366696 374015 366756 361389
13954 361389 368725 383387 399566 397139 395871 405404 422126 424727 426951 426110 433964 443934 446973 455640
13940 455640 467390 484890 488897 491979 505151 516364 538223 569076 579895 597363 620748 635543
13928 635543 647192 650533 651689 668424 682125 702649 735053 757819 791988 815112 821592 842122
13916 842122 861789 883696 923108 942691 974269 996548 1024279 1058023 1077838 1114063 1164790
13905 1164790 1207833 1238632 1274114 1301641 1346003 1418015 1470656 1539897 1614460 1701245 1822230
13894 1822230 1960567 2109135 2239483 2304526 2341080 2427911 2580311 2801165 3084873 3433169
13884 3433169 3860348 4365636 4949514 5701155 6690043 7931236 9117308 9509346 8916078
13875H916078p10526j72117M36734R52632J487560J870751J541117M03390q15010
13866A3910609j718412j755506j077496k91910L49206Q19782J045125P00563l38454
13857A1643507j201809j221907p82586l40091R920K50155M42925N73458O19757
13848I993329O79336Q56293J118091J433576J752844J671178Q21808M8513K47888
13839A8622856R63906J707183K370178L041460L468621L052056J842391N96630
13831C5665281k91679k67182L16927R52513J464445J841731J975188J363172k527
13822D3017869j031792j251755j216362j224838j243525j233386j172029j133744
13814C3510438j160205j220648j280770j315420j324161j305826j212717j039244
$$ plain form
13875 8916078 8205552 8033435 8470169 9422801 10910361 12781112 14322229 14725619 13910609
13866 13910609 12192197 10436691 9359195 9067285 9416491 10236273 11281398 11981961 11643507
13857 11643507 10441698 9219791 8437205 8097114 8107034 8357189 8800114 9373572 9993329
13848 9993329 10672665 11528958 12647049 14080625 15833469 17504647 18326455 18374968 18622856
13839 18622856 19586762 21293945 23664123 26705583 30174204 33226260 35068651 35665281
13831 35665281 35373602 35106420 35423347 36375860 37840305 39682036 41657224 43020396 43017869
13822 43017869 41986077 40734322 39517960 38293122 37049597 35816211 34644182 33510438
13814 33510438 32350233 31129585 29848815 28533395 27209234 25903408 24690691 23651447
13806B3651447q14169n53358k94754j8886K41850N27076P53834R50254J085477
13797B5528771J155063J143242J073751R50799Q40081P53628P46789P60182P09571
13788C3661877N84050L66014L3529l71737p54029j076248j300587j381889j399924
13779B8361056j388797j389034j437934j543808j639774j739252j775890j714529
13771A5732038j631416j501302j330424j178518j023572r08719p90403o77297
13763F690387n95987n30204m91775m18840l72010l53919l15421k65990k43678
13754C102563k19505j84292j88488j69626j44519j29616j22050j11868j15280
13745A717319j03734q6006q2669o7686p7171p6771n8487m9111n3082n7882m5193
$$ plain form
13806 23651447 22837278 22283920 21989166 21970280 22212130 22739206 23493040 24443294 25528771
13797 25528771 26683834 27827076 28900827 29851626 30691707 31445335 32192124 32952306 33661877
13788 33661877 34245927 34611941 34645470 34273733 33519704 32443456 31142869 29760980 28361056
13779 28361056 26972259 25583225 24145291 22601483 20961709 19222457 17446567 15732038
13771 15732038 14100622 12599320 11268896 10090378 9066806 8158087 7367684 6690387
13763 6690387 6094400 5564196 5072421 4653581 4281571 3927652 3612231 3346241 3102563
13754 3102563 2883058 2698766 2510278 2340652 2196133 2066517 1944467 1832599 1717319
13745 1717319 1613585 1527579 1444910 1377224 1300053 1223282 1164795 1115684 1062602 1004720 959527
13734I59527k7927k4815m2571n2892m1251j4263k7983l2899k1196p891k7209j4700
13722F23930l988k8077l0862j1041n130k5898k8161j1627j1052j1601j0851j9271
13710D26371j9078j3592j592p622r212j858M5p898j3532o194j670j1143j1972
13697C21053o248J769N36j3133j3321R08j514j704j0734j8958r927L462p599J2641
13683B57231M648j4476J979o124j5740j3114m868q977j1748k384L691N878R057
13670B05053K4284m129j1006K022j984o945k971m207N86J969o658n938m68L452
13656A93060N139p591m245J131K121j479j6972r987j2014j8579l070n161n539
13643A16814q33j978Q560l313J490o651J4265J5255k677j804L722N654o263q372
$$ plain form
13734 959527 931600 906785 864214 811322 770071 755808 727825 694926 673730 665839 638630 623930
13722 623930 619942 591865 561003 549962 544832 518934 490773 479146 468094 456493 445642 426371
13710 426371 407293 393701 392109 384487 375275 373417 373462 365564 352032 345838 344168 333025 321053
13697 321053 314805 316574 317110 303977 290656 291564 290050 288346 277612 258654 248727 252189 244590 257231
13683 257231 261879 247403 249382 243258 227518 214404 209536 200559 188811 186427 190118 195996 205053
13670 205053 229337 225208 214202 216224 214240 207295 204324 200117 200703 202672 196014 190076 189608 193060
13656 193060 198199 190608 186363 187494 189615 188136 171164 161177 149163 130584 127514 122353 116814
13643 116814 115981 114003 122563 119250 120740 114089 128354 143609 140932 139128 142850 148504 142241 133869
13629A33869R283J0082m972j3489p28l253p983Q724R752m241q954k191j0509q743
13615A06647k366j40n976j295J0648K194l199P881l465p100N503O359r207j4505
13601I1979m05J7961m321p642j375J031r844N052M515J3107J3538r419j5195k349
13587I6633P411L175P435J941L049l331n106p779N395k52p7N39P451o205O789
13572A17068N274o612q207o8m877N0l739j2649n022M170J589m867k0456p63N687
13557F6578J2669r8J3552J0573p211o670j4138q307j3532K406J1707O139q636
13544F5032j3912j357P138J5934o973M647P128Q356o161k3832O032L033n706j2266
13530D7093J6790M858L684J0854q066M758j2371q784O746J0057q566j5444j4708
$$ plain form
13629 133869 143152 153234 148262 134773 134045 130792 122809 131533 141285 137044 128090 125899 115390 106647
13615 106647 104281 104141 98165 96870 107518 109712 106513 114394 110929 103829 109332 115691 106484 91979
13601 91979 91574 109535 105214 97572 96197 97228 87384 92436 96951 110058 123596 114177 98982 96633
13587 96633 104044 107219 114654 116595 119644 116313 111207 103428 108823 108571 108494 109033 116484 110279 117068
13572 117068 122342 115730 107523 107455 102578 102628 98889 86240 81218 85388 86977 82110 61654 60891 66578
13557 66578 79247 79149 92701 103274 96063 89393 75255 66948 53416 55822 67529 73668 65032
13544 65032 51120 49763 56901 72835 65862 70509 77637 85993 79832 56000 62032 65065 59359 47093
13530 47093 63883 68741 72425 83279 75213 79971 67600 58816 65562 75619 67053 51609 36901
13517C6901K933Q503p019l46K350J597L024n40q854l521M939K040n994K465j234
13502C7244k3092K759Q748N191Q279j012k072n246K760N307q39M776M194M12j184
13487D6225q703o675J3406M374j272J512K20j0215N239J0428m489r908J4912P664
13473F2718k5498j8293R62M615l131J735l604p115J438J297K046J624q439p759
13459B596O550K1146j374j2533J5754J985J357N75j4700o228J1047K737L043J388
13445C3343k348O424j3672m22J455O670M027J81j2945p393q600j0373O966J0322
13431A3635M064k638m212O378q608m341J5046Q914R691l279r152p859P845O447
13417C1931m92N072p297q838Q559M736L138N769J4257n887j1204r345Q626J1000
$$ plain form
13517 36901 39834 48337 41318 40972 43322 44919 47943 47403 38549 35028 39967 42007 36013 38478 37244
13502 37244 14152 16911 25659 30850 39129 38117 36045 30799 33559 38866 38027 42803 46997 47409 46225
13487 46225 37522 30847 44253 48627 47355 48867 49087 38872 44111 54539 50050 40142 55054 62718
13473 62718 37220 18927 19889 24504 21373 23108 19504 12389 13827 15124 17170 18794 10355 2596
13459 2596 9146 30292 28918 16385 32139 34124 35481 36056 21356 15128 26175 28912 31955 33343
13445 33343 30995 37419 23747 23325 24780 31450 35477 35658 22713 15320 6720 -3653 3313 13635
13431 13635 17699 15061 10849 17227 8619 4278 19324 28238 37929 34650 25498 17639 25484 31931
13417 31931 31439 36511 29214 20376 28935 33671 36809 42578 56835 50948 39744 30399 39025 50025
13403E0025J0456O419j798R660N483o250j3933o118J475P673L213k224J1056J6320
13389I1457o153q943j0995p712o890l176J9061L87q323K803P296P395M403J2711
13375I3321K0588l644m340r953j278R263J2557J7160K1351K5283J5025Q191j7631
13362A85893o703J79J0172N322K334J3586R651O203J600o712l72J379P000r201
13348B20331j6336j5726o167J003j6989o420n533n722r576k557l305j135k584
13335A29284l686P557N730k476j0942J222J2605R829M691L320l199M753K1703
13322A80391J3664l221Q64M198L772k231j870n108j7172j2221K732n239l119j3739
13308A41701j3991q864l859p619j8595j6771j2080M053L108j6665k6880P261J6116
$$ plain form
13403 50025 60481 66900 65102 74762 80245 73995 60062 53944 55419 63092 66305 64081 75137 91457
13389 91457 85304 76361 65366 57654 50764 47588 66649 67036 58713 61516 68812 76207 80610 93321
13375 93321 113909 110265 105925 95972 94694 103957 116514 133674 155025 180308 195333 203524 185893
13362 185893 179190 179369 189541 194863 197197 210783 220434 226637 228237 221525 221153 222532 229532 220331
13348 220331 203995 188269 182102 183105 166116 159696 154163 148441 138865 136308 133003 131868 129284
13335 129284 125598 133155 138885 136409 125467 126689 139294 149123 153814 157134 153935 158688 180391
13322 180391 194055 190834 191698 195896 199668 197437 195567 190459 173287 161066 163798 158559 155440 141701
13308 141701 127710 118846 114987 107368 88773 72002 59922 63975 67083 50418 23538 30799 46915
13295D6915k192m087l215p236l377P349l358m204o550j37j897r162J3801K076
13281B4726K90m632m201Q52j408N617Q025J0991j4593j0041P275J250j9717q967
13267d533R269r155n720Q064J983J5232K122k833o06R089J0368J657j0804j7147
13253F986m204K641P13M464l133l796J0576o604k3600q822J8600J1958Q858n561
13239I076L274n456J424R85M733n96m050j5759j8796l498K1904k01q791P401m393
13224a2743j169r48O077J3018L904M992j150j2512P027J5269M286j1869k346J805
13210A3641Q160k230k017O90J0816m651j4407n00N756j6215K226P537K294l250
13196G850l839N543Q187j098l947O93K324j967N55J923J603K403o867l244K1300
$$ plain form
13295 46915 44723 40636 37421 30185 26808 34157 30799 26595 20045 19908 18011 8849 22650 24726
13281 24726 25016 20384 16183 17035 15627 21244 29269 40260 25667 15626 22901 24151 4434 -4533
13267 -4533 4736 -4419 -10139 -2075 -92 15140 17262 14429 13823 22912 33280 34937 24133 6986
13253 6986 2782 5423 6136 10600 7467 3671 14247 7643 -15957 -24779 -6179 5779 14637 9076
13239 9076 12350 6894 8318 9303 14036 13440 9390 -6369 -25165 -28663 -6759 -6960 -15751 -8350 -12743
13224 -12743 -13912 -14860 -8783 4235 8139 13131 11981 -531 6496 21765 26051 14182 11836 13641
13210 13641 21801 19571 17554 18244 29060 24409 10002 9502 15258 -957 1269 8806 11100 7850
13196 7850 4011 9554 17741 16643 12696 13389 15713 13746 14301 16224 17827 20230 13363 10119 31419
13181C1419K2388J8884K5600L8261O1034P1814O6847k118q5762p3203j6838J4497
13169A72823M9203P7413J07614J20650O4338l5225r3910j40503j08454l9952r800
13158A64197K0668L4478O7011P1639M041p7790q7899n8190r539j80J0856L746
13146A43038L2316N5850P2896O8008j543q1911p4084k9766j018L7075O4431Q2025
13134C67317J16533Q8561j8870p9048j36460j00800n0666j1619L289K5356L2869
13123B36462P0717L6053o3599r3896q3359l4052o311o805j468O35R51O594J2652
13110G4574O187k266J681j3198o644j23j599j360o586r594o721j909O436P410
13096D6288j430k2164j4077J1030K722j684j5443n489n117Q8J4174M14Q816m108
$$ plain form
13181 31419 53807 72691 98291 136552 197586 269400 336247 334129 248367 175164 158326 172823
13169 172823 222026 299439 407053 527703 592041 556816 462906 322403 213949 173997 164197
13158 164197 184865 219343 286354 357993 362034 284244 196345 138155 128616 128436 139292 143038
13146 143038 175354 231204 304100 372108 370565 288654 214570 184804 183786 220861 285292 367317
13134 367317 483850 572411 553541 474493 338033 237233 186567 174948 178237 203593 236462
13123 236462 307179 343232 279633 185737 102378 68326 62015 55210 53742 54377 55328 61922 74574
13110 74574 80761 78495 80176 66978 60334 60211 58612 57252 50666 41072 34351 32442 38878 46288
13096 46288 44858 22694 8617 19647 22369 20685 5242 -247 -5364 -5276 8898 9312 18128 14020
13082A4020J2684J5450K232j777K224m944k532j3946r196m575J5188K408M483
13069C1719j1533J0632P186k908J8039J5168q989m794k628k777p954j572O159
13056D5748j51n742p111n569j7335q651L858J4211J3332o134j1975R996K800j2374
13042A4903k091M62L681J624j4455O748Q706Q569j2225m864j568p533J1716M484
13028A8157n74N292J2868p321p773J19m677p040k280L021J3475J1114J3365j1934
13014C5812j2263p222J4031N586j3766p116p507o334m15m682K694M957m440L669
13000C004R428L113P836j2828k36q764n72J0633J3661r177k20l042k239p751J998
12985D844J663J2063j687k205K438m96n434j8535k484l390J8578K1418k498O775
$$ plain form
13082 14020 26704 42154 44386 42609 44833 39889 37357 23411 14215 9640 24828 27236 31719
13069 31719 20186 30818 38004 35096 53135 68303 59314 54520 51892 49115 41161 39589 45748
13056 45748 45597 39855 32744 27175 9840 1189 5047 19258 32590 26456 14481 24477 27277 14903
13042 14903 12812 13274 16955 18579 4124 10872 19578 28147 15922 11058 9490 1957 13673 18157
13028 18157 17583 22875 35743 28422 20649 20768 16091 9051 6771 9792 23267 34381 47746 35812
13014 35812 23549 16327 30358 35944 22178 15062 7555 1221 806 -3876 -1182 3775 -665 3004
13000 3004 12432 15545 23381 10553 10317 1553 981 11614 25275 16098 15878 12836 10597 2846 4844
12985 4844 6507 18570 16883 14678 17116 16620 11186 -7349 -9833 -13223 5355 26773 24275 31050
12971C1050K874p472q44Q236O779O601K722p187j1080M706J0794J2186J3968R294
12957H2627K835Q143J6763J0303J1830J4862K2778L7796K9271L0111L7877J7917
12945C23113J9264J9396K509j2747j8659l1272r722k1277l1205k286j9822k8661
12933A88631k5265k4644l339m368J1497J188j3000r016k516J0202P999k86r97
12920A36086K901l546L980J5951L079j469m029l509J6806J4809R713L135J4813
12907B08720J8903K5698L3099J9979J3433L1795K4922J9453N525J310K686j8834
12895C86689k5044l5972l1816l7288m7878m0449j9797l0398k2966p191l848l101
12883H0941r047k0013j9194J501P00j1082J337K90K110j3927j0832l675n053J876
$$ plain form
12971 31050 33924 26452 25608 33844 40623 47224 49946 42759 31679 36385 47179 59365 73333 82627
12957 82627 85462 93605 110368 120671 132501 147363 170141 207937 237208 267319 305196 323113
12945 323113 342377 361773 364282 351535 332876 301604 291882 270605 239400 237114 217292 188631
12933 188631 163366 138722 135383 131015 142512 143700 130700 121684 119168 129370 137369 137083 136086
12920 136086 138987 135441 139421 155372 158451 156982 152953 149444 166250 181059 190772 193907 208720
12907 208720 227623 253321 286420 306399 319832 351627 376549 396002 401527 402837 405523 386689
12895 386689 361645 325673 293857 256569 208691 168242 148445 118047 95081 87890 84042 80941
12883 80941 71894 51881 32687 34188 34888 23806 25143 25433 27543 13616 2784 -891 -5944 -4068
12869d068L826k618m677J6368J0110o148M507Q12l950M80j1951o025P619L181
12855G466k436q047j3053j6119k671J7608k143L591M100K435k429J0257J1051
12842I610q682p848j1760Q742J0683n197N22r868m536K2585J6041O49p640k420
12828A0881K528j030j46j2955j0238M038n471n644N873J1058j255N975k39j0841
12814g466O443J3491q507o195J064R823N142J42k680j486K691j1635r260K787
12800e646r77N441J1054j6645r367p594K227J1864P299L800j595m843k978M346
12786c614J5129L040q031j4503k1972J0544J6874R474k621j8822j6054N251J7082
12773h223J622M218l9M237J1587m943j432j005r001M41k102J5186J0234n968j7725
$$ plain form
12869 -4068 -242 -2860 -7537 8831 18941 12793 17300 18112 14162 14642 2691 -3334 4285 7466
12855 7466 5030 -3017 -16070 -32189 -34860 -17252 -19395 -15804 -11704 -9269 -11698 -1441 9610
12842 9610 928 -6920 -18680 -9938 745 -4452 -3930 -13798 -18334 4251 20292 20941 13301 10881
12828 10881 13409 12379 12233 -722 -10960 -6922 -12393 -18037 -12164 -1106 -2361 3614 3375 -7466
12814 -7466 -1023 12468 3961 -2234 -1170 8653 13795 13937 11257 9771 12462 827 -8433 -5646
12800 -5646 -6623 -1182 9872 -6773 -16140 -23734 -21507 -9643 -2344 1456 -139 -4982 -7960 -3614
12786 -3614 11515 14555 6524 -7979 -29951 -19407 -2533 6941 4320 -14502 -30556 -25305 -8223
12773 -8223 -6601 -2383 -2422 1815 13402 8459 7027 6022 -2979 -2538 -4640 10546 20780 14812 -2913
12758b913j6520q023L380P158J2517J1014K705m60n612J2672O454J202j2792p491
12744C291k228p775j891l412Q734K988o717r121p69M833k538n264k620J906q408
12729b8991J3545J677Q110R752q20N3M434n172n159j757Q328K195P843n895j679
12714F464l401l623L901m348k733k811m056O676P215j1094p357n180O695J7377
12700C725M329o890L344R241O369k995p025k723o121P346p588J837J1812K384
12686A7045j1559j1843O444M984r043M301J7448O108q37k787j2454l029l065N125
12672F838j0661j1950M817O505J3241j725q282j3091q676k7K0675J4933l595L929
12658A2931j1577j201P95j6145N095j608j816P26O061M566j3248L926O141N717
$$ plain form
12758 -2913 -19433 -27456 -24076 -16918 -4401 6613 9318 8858 3246 15918 22372 23574 10782 3291
12744 3291 1063 -6712 -8603 -12015 -3281 -293 -7010 -16131 -16900 -12067 -14605 -19869 -22489 -20583 -28991
12729 -28991 -15446 -13769 -5659 4093 3273 3326 7760 2588 -2571 -4328 4000 6195 14038 8143 6464
12714 6464 3063 -560 3341 -1007 -3740 -6551 -10607 -3931 3284 -7810 -15167 -20347 -13652 3725
12700 3725 8054 1164 4508 13749 20118 17123 10098 7375 1254 8600 1012 2849 14661 17045
12686 17045 5486 -6357 87 5071 -3972 329 17777 23885 23048 20261 7807 4778 1713 6838
12672 6838 -3823 -15773 -10956 -4451 8790 7065 -1217 -14308 -22984 -23011 -2336 12597 9002 12931
12658 12931 1354 153 948 -15197 -10102 -11710 -13526 -12800 -6739 -2173 -15421 -11495 -5354 363
12644C63L182L322o273J880j334l9k018J675N290M917p544o732R647K204j781
12629F759j2687K421r731l376K5547L370r283k53J2337l146r412k309R32R150
12615A0319J4174j441n747j869J4748n540j2484j0040p965M618M584P348O503
12602A7208L278j6707k0071R853k7M431J2511n010M414M275J783J5082m365j7524
12588I131j0019j2292p374J0958O969J631P854l413q219m863n138K732J1263O501
12574E721L420L27k1837l416R799J3033o675k877L865l881m067j012N128j536
12560d008L639n569N353J4603K847o316k555P359M47n518j4457n296k112m430
12546a6013n87J1367O843l115R423J711o086n558m36q297J2358J9425O058l393
$$ plain form
12644 363 3545 6867 594 2474 1140 1101 -917 758 6048 10965 3421 -3311 6336 8540 6759
12629 6759 -5928 -3507 -13238 -16614 8933 12303 3020 2767 15104 11958 2546 237 1169 10319
12615 10319 24493 23052 17305 15436 30184 24644 12160 2120 -5845 -1227 3357 10705 17208
12602 17208 20486 3779 -16292 -6439 -6466 -2035 10476 5466 9880 14155 15938 31020 26655 9131
12588 9131 -888 -13180 -20554 -9596 -2627 -996 6858 3445 -4774 -9637 -14775 -12043 -780 5721
12574 5721 9141 9468 -12369 -15785 -5986 7047 372 -2505 1360 -2521 -6588 -7600 -2472 -4008
12560 -4008 -369 -5938 -585 14018 16865 10549 7994 15353 15800 10282 -4175 -9471 -11583 -16013
12546 -16013 -16600 -5233 1610 -1505 7918 9629 3543 -2015 -2451 -10748 1610 21035 27093 23700
12532B3700j1361n94P110R911j303q840N206m506L200q51r901L352K415k910j198
12517A3430J1028l53n946k3447j564J4078k484O683j649j1319K536J0388j2473
12504a092p326J3582J4206p9q637N659m250j2342J906L409m97P200n761J423N43
12489G944o222J2447J3209J506J2610j0318j5139p165n39J3346P167q977p689
12476A2180O140L108j670k664n653n541j0108j751N355R074J0529P10J482q657
12462A2534k037O553R514K645r289q431l116j2770Q216J5330l318o633P510O930
12448B3638K060L12K544k560J67J756o803k451J4233Q233j2162j6849j522M418
12434A5014q60o792m283p437J1408M775n924M859k454L508j9j2249N370J2608
$$ plain form
12532 23700 12339 11745 18855 28766 27463 18623 23829 19323 22523 21672 11771 15123 17538 14628 13430
12517 13430 24458 24105 18159 -5288 -6852 7226 4742 11425 9776 -1543 993 11381 -1092
12504 -1092 -8418 5164 19370 19291 10654 16313 12063 -279 1627 5036 4539 11739 5978 7401 7944
12489 7944 1722 14169 27378 28884 41494 31176 16037 8872 8333 21679 28846 19869 12180
12476 12180 18320 21428 19758 17094 11441 5900 -4208 -5959 -604 8470 18999 19709 21191 12534
12462 12534 10497 17050 26564 29209 19920 11489 8373 -4397 3819 19149 15831 9198 16708 23638
12448 23638 25698 26010 28554 25994 26161 27917 21114 18663 32896 41129 28967 12118 10596 15014
12434 15014 14154 7362 3079 -4358 7050 11825 5901 10760 8306 11814 11795 -454 4916 17524
12420A7524K973j0414q521q710O048m876L004l64J6339J8672J3198J2519j920
12407E5472r433o992j274O143M546j7442K783K284m175j1945J8698n598N22n257
12393B8332K162N042k322j874R430R604r518p766q30j0j6154l327J0660o21R237
12378C2045K139j1752K41r230L529J993r21j1341K356J2858m311J1825J2209P902
12364D9542l102j0083l655M275j2088r387j183J3467K3850M502j4008j6335K216
12351B8011M977j1273r034k898P786L149L404p457o103K2974J3870J75j7838j934
12337B7809p475q748J543o596m373j0666L552J8813R290R860Q420l247j3020k0226
12323D936Q640N201K448l981m047J1804N061q657j4636p7K7140N181P995J2816
$$ plain form
12420 17524 20497 10083 1562 -7148 -1100 -5976 -2972 -3336 13003 31675 44873 57392 55472
12407 55472 46039 39047 37773 43916 48462 31020 33803 36087 31912 19967 38665 33067 33589 28332
12393 28332 30494 35536 33214 31340 40770 50374 40856 33090 32260 32250 16096 12769 23429 22808 32045
12378 32045 34184 22432 22673 13443 16972 18965 18044 6703 9059 21917 17606 29431 41640 49542
12364 49542 46440 36357 32702 36977 24889 15502 14319 27786 51636 56138 42130 25795 28011
12351 28011 32988 21715 12681 9783 17569 20718 24122 16665 10562 33536 47406 47581 29743 27809
12337 27809 20334 11586 13129 6533 2160 -8506 -4954 13859 23149 33009 41429 38182 25162 4936
12323 4936 13576 18777 21225 17244 13197 25001 30062 21405 6769 6692 33832 39013 47008 59824
12309E9824p805L17o235P063N104K972P180L553N38p19k0837j6547R577m087j1971
12294B7927N32Q659J5880N579J0123q649j6586r88J0705M47n153M083o301N2l052
12279D3258m121J5127M265J2850P981R846R85K2555J7689N111q976j3724j0373
12266A02473j2677m431P362n317n727r352r800K2628Q838j1206r797r257p891
12253E5846M045J5449j028k86j913o67l327o162J3366K0245O790J4175J5059J2484
12239A44076K2412L5631L8573K5067K4440J2542L44k3418k3098l1093m0587k9498
12227A55391k8482j5185j9265j9527l484l627J0898J3474n900j1827q823r969
12215E3674P837J6908J0720J0312J0258Q461o137M780R523J0366J0519M539K5725
$$ plain form
12309 59824 52019 52336 46101 53164 58268 61240 68420 71973 72511 71792 50955 34408 43985 39898 27927
12294 27927 28459 37118 52998 58577 68700 60051 43465 42477 53182 53629 48476 52559 46258 46310 43258
12279 43258 39137 54264 58529 71379 79360 89206 90191 112746 130435 135546 126570 112846 102473
12266 102473 89796 85365 92727 87410 81683 72331 62531 85159 93997 82791 72994 63737 55846
12253 55846 59891 75340 74312 74026 72113 71446 68119 61957 75323 95568 102358 116533 131592 144076
12239 144076 166488 202119 240692 265759 290199 302741 303085 279667 256569 225476 184889 155391
12227 155391 126909 111724 92459 72932 69448 65821 76719 90193 84293 72466 63643 53674
12215 53674 61511 78419 89139 99451 109709 118170 112033 116813 126336 136702 147221 151760 177485
12202A77485M4435L7067J8592J8598K3887K1024j3957k5135k1041k6413j6069
12191B38473k2103l7244j6888j384Q4k233m387M750J4852P310m808n145n120j0285
12177A55872M732n209k789j3358j5573l026o410L188l207L861O909J4401R078
12164A48469j828J7656K7760J3736L605M299n543L078k827k154Q34j958J2398
12151B17525J0104N106K2603J8589J0973J5671n077K776O638l491N298Q046q811
12138C05950j4881j5114j3131j3266k6196j0884k274j1988j1522j0466j4125J1486
12126A73589j360m610L164p351o307N561M206Q364O855J3093J8919J8549J5377
12113B48049R465N120P699L2606J6919L81J5152K7030R543N952o456K924J3243
$$ plain form
12202 177485 221920 258987 277579 296177 320064 341088 327131 301996 280955 254542 238473
12191 238473 216370 179126 162238 160854 160938 158705 154318 159068 173920 181230 176422 171277 166157 155872
12177 155872 160604 155395 152606 139248 123675 120649 114239 117427 114220 118081 124990 139391 148469
12164 148469 146641 164297 192057 205793 209398 213697 208154 211232 208405 206251 207085 205127 217525
12151 217525 227629 232735 255338 273927 284900 300571 295494 298270 304908 301417 306715 314761 305950
12138 305950 291069 275955 262824 249558 223362 212478 210204 198216 186694 176228 162103 173589
12126 173589 172229 167619 170783 163432 157125 162686 166892 175256 182111 195204 214123 232672 248049
12113 248049 257514 262634 270333 302939 319858 320239 335391 362421 371964 377916 371460 374384 387627
12100C87627Q881j7033k5660l5969l5169j2176j8529l2865j0527l658k949J531
12088B03504J973j1217n905j096M67r16L480k2819K730j1760P599R526K751K4773
12074B03090K0978N161n873j2168J0123K6586J2893P845J7703J0448j1869l0782
12062B54135k1107j4361O398M191J053o224r93J4662J8006P564J8201J5617K3514
12049C20656K5145M519j8862k7692l8960k1271j9498j901K3588Q857Q361J8350
12037B81292K8074L693Q627J13m527k08k1467k2635k3430O866J5538R089j882
12024B79143Q377J8377J3580L0069K7434L0302N2617P1823P4830R3687L1403m9031
12012F82611o6066m0640j1604J8478J4436K7210O4466P6518R5078J22863J71984
$$ plain form
12100 387627 396508 379475 353815 317846 282677 270501 251972 219107 208580 204922 201973 203504
12088 203504 205477 194260 188355 187259 187726 186810 190290 167471 170201 158441 166040 175566 178317 203090
12074 203090 224068 229229 223356 211188 221311 247897 260790 268635 286338 296786 284917 254135
12062 254135 233028 218667 225065 229256 230309 224085 223092 237754 255760 263324 281525 297142 320656
12049 320656 345801 350320 331458 303766 264806 243535 224037 222136 245724 254581 262942 281292
12037 281292 309366 313059 321686 321799 317272 317064 295597 272962 249532 256398 271936 281025 279143
12024 279143 287520 305897 319477 349546 376980 407282 459899 531722 606552 700239 731642 682611
12012 682611 616545 575905 564301 582779 597215 624425 688891 765409 860487 983350 1155334
12001A155334K11029J97409Q6043j7637j21857j86272j56556q1389r783P0709
11991A147030J44610K17859K99399L24229K79544K41894J67203Q1273M4769j1903
11981B935907j41901k25401k19235j20818r1198j26700j18606r0711j23064p9030
11971A599243j1612N231n9937r7938j11853r0414l6080J3830K2491M702p0137
11960A167526r4890p8357q7130o5830m2466p703N299j7145m2050l1328j390R179
11948G13715J9058L7663L4413Q588k9950m3374j9430j1904K0156K0315J1377L7752
11936G98379L7526M5238M7293L2992M8046N6864O9453Q0750Q6358R9660J49227
11925A551786J61305J79589K04050K35832K70675K99675L32093L48383L52330
$$ plain form
12001 1155334 1366363 1563772 1649815 1632178 1510321 1324049 1167493 1086104 1076321 1147030
11991 1147030 1291640 1509499 1808898 2133127 2412671 2654565 2821768 2903041 2947810 2935907
11981 2935907 2794006 2568605 2349370 2228552 2137354 2010654 1892048 1801337 1678273 1599243
11971 1599243 1587631 1592862 1532925 1434987 1323134 1232720 1196640 1210470 1232961 1237663 1167526
11960 1167526 1072636 994279 907149 841319 798853 791150 796449 779304 737254 705926 704536 713715
11948 713715 732773 770436 804849 813437 783487 740113 720683 708779 728935 749250 760627 798379
11936 798379 835905 881143 928436 961428 1009474 1066338 1135791 1216541 1302899 1402559 1551786
11925 1551786 1713091 1892680 2096730 2332562 2603237 2902912 3235005 3583388 3935718
11916C935718L25044K91204K15981J04583j2562j53439k60602l22207l37301l29087
11906C457332l02577k74103k30789j80696j38216j18902j00759p4666n2970m4448
11896A939206L332j377K7179M2697N7003Q5973J14026J24535J36325J70612K20049
11885B919560K58198L02788L57841M19083M94729N58849O13058O87283P32654
11876G344043P53642P05231N84108M17073J99332o0783l30474n52622o96278p58709
11866G604563p40184o90636n95762n08153m19393l40837k61980k12575j61457
11857C673586j17419o4256j4063M8603R3968J60132K03805K74834L80264M78399
11847E117853O00436P51964R43103J194534J494940J880402K294790K635398K724929
$$ plain form
11916 3935718 4260762 4551966 4767947 4872530 4859968 4706529 4445927 4123720 3786419 3457332
11906 3457332 3154755 2880652 2649863 2469167 2330951 2212049 2111290 2036624 1983654 1939206
11896 1939206 1942538 1941161 1968340 2011037 2068040 2154013 2268039 2392574 2528899 2699511 2919560
11885 2919560 3177758 3480546 3838387 4257470 4752199 5311048 5924106 6611389 7344043
11876 7344043 8097685 8802916 9387024 9804097 10003429 9942646 9612172 9059550 8363272 7604563
11866 7604563 6864379 6173743 5577981 5069828 4650435 4309598 4047618 3835043 3673586
11857 3673586 3556167 3491911 3477848 3526451 3620419 3780551 3984356 4259190 4639454 5117853
11847 5117853 5718289 6470253 7413356 8607890 10102830 11983232 14278022 16913420 19638349
11838A9638349K315731J296250j43842j428073k095351k169186j939463j616957
11830A3857458j320725j118683r73723q58838p40277o40314n26337m05555k76560
11821F996446j42232k4464J07313K48667M09023N67735P50934R44411J097927
11812A0955760J206713J322587J523392J908556K522327L298219M232219N151824
11804C2121597N804444N783448M618347K264742o82213l203605m551037m766626
11796C7389097m496106m236667l993069l543939k899901k195510j572271j098035
11788A3353599p76196n80444n34938n80176n72228m67946k56359m913K46577M84431
11778A0311407O75102Q37639R67604J082141J277310J622452K142228K858922
$$ plain form
11838 19638349 21954080 23250330 23106488 21678415 19583064 17413878 15474415 13857458
11830 13857458 12536733 11418050 10444327 9585489 8845212 8204898 7678561 7273006 6996446
11821 6996446 6854214 6829750 6937063 7185730 7594753 8162488 8913422 9857833 10955760
11812 10955760 12162473 13485060 15008452 16917008 19439335 22737554 26969773 32121597
11804 32121597 37926041 43709489 48327836 50592578 49910365 46706760 42155723 37389097
11796 37389097 32892991 28656324 24663255 21119316 18219415 16023905 14451634 13353599
11788 13353599 12577403 11996959 11462021 10881845 10309617 9841671 9585312 9580399 9826976 10311407
11778 10311407 10986509 11824148 12791752 13873893 15151203 16773655 18915883 21774805
11770B1774805L701573M547760N244052N531382N086740L783252J846111m10172
11762E1105503k484244m024224m917408n311454n255999m724971l893928l007115
11754A7486160k245518j642916j215436r63828r00571r36910r41842q53942p19997
11745G065200n42025l99939k78430j38098l4234O2732J68496K78476M32248N89489
11735G203915P76729J043557J349359J714478K115130K421998K518097K155463
11727B1298726J124832m04011j898008k783951k945208k620727k134521j655190
11719G981942j262450r72720p77625o26579n04829m35178l68151l05363k63588
11710B465459k11484j97409j65291j27857j27654j22093r5270p3597o8442n3458
$$ plain form
11770 21774805 25476378 30024138 35268190 40799572 45886312 49669564 51515675 51105503
11762 51105503 48621259 44597035 39679627 34368173 29112174 24387203 20493275 17486160
11754 17486160 15240642 13597726 12382290 11418462 10517891 9580981 8639139 7785197 7065200
11745 7065200 6523175 6123236 5844806 5706708 5672474 5735206 5903702 6182178 6614426 7203915
11735 7203915 7980644 9024201 10373560 12088038 14203168 16625166 19143263 21298726
11727 21298726 22423558 22019547 20121539 17337588 14392380 11771653 9637132 7981942
11719 7981942 6719492 5746772 4969147 4342568 3837739 3402561 3034410 2729047 2465459
11710 2465459 2253975 2056566 1891275 1763418 1635764 1513671 1418401 1344804 1276362 1222904
11700A222904m6196m6145m2962m9383j4822n131M712Q135J6312J4003j1419l0125
11688A019883p0142o7339n2265n8472m5883m2628l3404k8676l6515j9803n801
11677E58955k3289l4071k4224j2475j3658k2004j4623j7558j7769k6483k0801
11666C32000j1139j0597j0760L276j4442j6850r835j9449l449o914O432l908r136
11653B25229m717O827R028K118r207J2835J751p441L646O177P27k590J895J0571
11639B56849r735J698k255k8905j4847j6597m90q531j3116j1365n289j2612O603
11626A41408k0351j5150n978o098k345J6885J3779m139k1248l1238o056M579J0109
11613G4157R398J6108J0640l29N975L122o843N173J6162P092M011n434N347K989
$$ plain form
11700 1222904 1176708 1130563 1087601 1038218 1023396 1018265 1022977 1031112 1047424 1061427 1050008 1019883
11688 1019883 949741 882402 830137 771665 725782 683154 649750 621074 584559 564756 558955
11677 558955 535666 501595 477371 464896 451238 429234 414611 397053 379284 352801 332000
11666 332000 320861 310264 299504 302780 288338 271488 261653 242204 238755 231841 238273 234365 225229
11653 225229 220512 227339 236367 238485 229278 242113 243864 236423 240069 246246 246973 244383 246278 256849
11639 256849 247114 248812 246557 217652 202805 186208 185718 177187 164071 152706 147417 134805 141408
11626 141408 121057 105907 99929 93831 91486 108371 122150 118011 96763 65525 59469 64048 74157
11613 74157 83555 99663 110303 109974 115949 119071 112228 117401 133563 140655 144666 139232 144579 147568
11599A47568q145o294o263o536k3976j2331l874K708O454p619p278o75j4247j987
11585E7505L079J106j085r459N651r96q935m60K178J8490L351J7093J4979J762
11571A04259o848k316J2368j459M690N291l852q061o412J931p683j0150N384n057
11557H2085p86k763k636r158j3193k67j1696o063j7636n151J6620J6926N596N647
11543E7525R106k644k531q218m204K991M27J9353K4336P241N018P648K801N014
11529A23863O26R505L041J481p457j1840J92R181j4712L945k0556j5850r447p102
11515F4870L580J1013M944K6201M821P23Q651j6126r28K104k133k639O238l358
11501A07961O70L719j9199j902J5680M840j3167j2724K03j7723M980P863q202
$$ plain form
11599 147568 139423 133129 126866 120330 96354 84023 80149 82857 89311 81692 74414 73739 59492 57505
11585 57505 60584 61690 60605 51146 56797 55801 46866 46406 48584 67074 70425 87518 102497 104259
11571 104259 97411 95095 107463 106004 110694 115985 112133 104072 97660 99591 91908 81758 87142 82085
11557 82085 81299 78536 75900 66742 53549 53282 41586 35523 17887 12736 29356 46282 51878 57525
11543 57525 66631 63987 61456 53238 49034 52025 52452 71805 96141 103382 108400 116048 118849 123863
11529 123863 124489 133994 137035 138516 131059 119219 119411 128592 113880 117825 97269 81419 71972 64870
11515 64870 68450 79463 84407 110608 115429 116152 124803 108677 107749 109853 107720 105081 111319 107961
11501 107961 108631 112350 93151 91249 106929 111769 98602 85878 86081 68358 73338 81201 72999
11488G2999Q22R010J5506J1615m610o798M151j848j4244o559j126Q855P27q963
11474G9537N915j838R89p450j6829r277J0969N949J047M670N27J623m430o892
11460F4510Q50o271m410O838M985p413L592m465j865k223j10O699K329R207J0685
11445H2938J9J1518K984K625l413k134P326J1253J8476j0118n883K783J2553m084
11431A26843P443P16o008Q12k677j4577k2258p465q356j4422j6283j3258k045
11418B8465J0570K4130Q05j6434l95J7742P873j937K267Q165l95m365k059K4243
11404I8675J6098L884m394J4212K0352J149K1246K4847p435k5402j0831j2377
11392A40024j2449M36j2472j0293k795j4322J783J2331o521j5900K303J9778K316
$$ plain form
11488 72999 73821 82831 98337 109952 105342 98544 102695 100847 86603 80044 78918 87773 88500 79537
11474 79537 85452 83614 84603 77153 60324 51047 62016 67965 69012 73682 74209 75832 71402 64510
11460 64510 65360 59089 54679 61517 66502 59089 62681 58216 56351 54128 54018 60717 63046 72253 82938
11445 82938 82957 94475 97459 100084 96671 94537 101863 113116 131592 121474 115591 118374 130927 126843
11431 126843 134286 135002 128994 129806 127129 112552 90294 82829 74473 60051 43768 30510 28465
11418 28465 39035 63165 63970 47536 47141 64883 72756 70819 73086 81251 80856 76491 74432 98675
11404 98675 114773 118657 114263 128475 148827 149976 171222 196069 188634 163232 152401 140024
11392 140024 127575 128011 115539 105246 102451 88129 89912 102243 95722 79822 82125 101903 104219
11379A04219k87J0675K163j2026N194Q922Q593J167o81J4318J7579J4128K1479
11366A95443K0678K6425K9237M5465M1961J3990Q819j1560k5014l2707j1635l70
11354C00732j9433l1922l5714P501l102j434P952k452m10j2753p518k804J6172
11341B14815J0136R964K5158M1326L4691K7575L3541L9543K4839Q532j557j0415
11329D58148k1946j8141Q675K5287J0553j702l203j9590r808j0892j5581k5991
11317C75809k7741j9184m955k1m375M975K0606l99Q683J9042K4139J7565K7334
11304D41478L3957K5452K5162M0583L3915L2096M9747N3894M0549L1420K3421
11293H31674L992M730L210P001K1137K4746M0303M7641L8122M0730N3935M8319
$$ plain form
11379 104219 103932 114607 116770 104744 109938 118860 127453 128620 127939 142257 159836 173964 195443
11366 195443 216121 242546 271783 317248 359209 373199 382018 370458 345444 312737 301102 300732
11354 300732 281299 249377 213663 221164 218062 216628 224580 222128 221718 208965 201447 198643 214815
11341 214815 224951 234915 260073 301399 336090 363665 397206 436749 461588 470120 468563 458148
11329 458148 436202 418061 426736 452023 462576 460874 457671 438081 428273 417381 401800 375809
11317 375809 348068 328884 323929 323908 319533 324508 345114 344715 353398 372440 396579 414144 441478
11304 441478 475435 500887 526049 566632 600547 632643 682390 736284 776833 808253 831674
11293 831674 835666 840396 843606 850607 871744 896490 936793 984434 1022556 1063286 1117221 1165540
11281A165540P7592Q9769R5000J37019J54853J87169K41768K77300L32385M29500
11271C187895N35635O82338Q68108J100396J427170J834301K407191L201063M281169
11262A9525266N606590O911520P668294P373746N512683J489423l963851q202723
11254D1920948r414272q206097o150701m322055l006821k098358j536265j182631
11246F003748r54567p83565o31784n15014m04558l24661k97684k46701j86861
11237A658353j64065j47956j18072j04108r2295q3755n9946m1592m0709n5766
11227G50089n5925n1876m2575j8841k2903n4277l1474j3341j2122k5917j5049
11216D05789r931k5299k5217j6795q627j1886K115J238k9090j0615k509j0691
$$ plain form
11281 1165540 1243132 1332901 1427901 1564920 1719773 1906942 2148710 2426010 2758395 3187895
11271 3187895 3723530 4405868 5273976 6374372 7801542 9635843 12043034 15244097 19525266
11262 19525266 25131856 32043376 39711670 47085416 52598099 54087522 50123671 41920948
11254 41920948 32506676 24300579 18149878 13827823 10821002 8722644 7186379 6003748
11246 6003748 5049181 4265616 3633832 3118818 2714260 2389599 2091915 1845214 1658353
11237 1658353 1494288 1346332 1228260 1124152 1031857 948102 888156 846564 805855 750089
11227 750089 694164 642288 599713 580872 557969 503692 472218 458877 446755 420838 405789
11216 405789 395858 370559 345342 328547 319920 308034 310149 311387 282297 271682 269173 258482
11204B58482j053J8180K736M433j3881l0942j0529Q728J601J509n091L223L617
11191B41013J2157J3834l31n597P419J0244P227q859J254P377p338q500N947J0608
11177B86455j539M628j3357J1390R515r652P014K2734L1180L4571K1441Q026J7975
11164D30381J2578K9445L0619L0031K5097N5689O4762O4942R9690J32493J81127
11153A156854K43573L10611L92674N20155P17126R46043J209353J477820J533268
11144H507477J120392K26613q56295j611760j718190j392624r92814o84433m74288
11135B124078l07345k03451j47610j18393q2702p4197p8926o5659n1418l0182
11125I64195k0579J30K755J1057K6343L9758N1799Q4072J13693J26093J90477
$$ plain form
11204 258482 257429 275609 278345 282778 268897 237955 227426 236154 237755 239264 234173 237396 241013
11191 241013 253170 267004 266673 261076 268495 278739 285966 277107 278361 285738 278400 269900 275847 286455
11177 286455 284916 289544 276187 287577 297092 287440 294454 317188 348368 382939 404380 412406 430381
11164 430381 442959 472404 503023 533054 558151 613840 678602 743544 843234 975727 1156854
11153 1156854 1400427 1711038 2103712 2623867 3340993 4287036 5496389 6974209 8507477
11144 8507477 9627869 9854482 8998187 7386427 5668237 4275613 3282799 2598366 2124078
11135 2124078 1816733 1613282 1465672 1347279 1264577 1190380 1111454 1045795 994377 964195
11125 964195 943616 943746 946501 957558 983901 1023659 1075458 1159530 1273223 1399316 1589793
11114A589793K46701L12968M29017N63548P24751R46140J289630J758354K304916
11105A0165818K790663K829862J723067k22586j801696k699960k855912k385893
11097G543363j737796j210161q56335o19703m58338l44721k55841k09038j78676
11088A672754j39736j16597j04651r4930q9334p8246n0364m2141l0860j571P443
11077I31767J3867L7126N0012O7982J06320J35643K00812K42271L33349M39111
11067B558260N80379P68811R64592J115085J116583P80429J15055o50583j189454
11058F159157j304868j092989q04844n50689l91435k81459k01625j64669j24113
11049A242466j17070q4276q6086r4653p1724n7222k6360k4315k3972o566L7796
$$ plain form
11114 1589793 1836494 2149462 2578479 3142027 3866778 4812918 6102548 7860902 10165818
11105 10165818 12956481 15786343 17509410 17286824 15485128 12785168 9929256 7543363
11097 7543363 5805567 4595406 3739071 3119368 2661030 2316309 2060468 1851430 1672754
11088 1672754 1533018 1416421 1311770 1216840 1127506 1049260 998896 956755 925895 924324 931767
11077 931767 945634 982760 1032772 1100754 1207074 1342717 1543529 1785800 2119149 2558260
11067 2558260 3138639 3907450 4872042 5987127 7103710 7884139 7999194 7348611 6159157
11058 6159157 4854289 3761300 2956456 2405767 2014332 1732873 1531248 1366579 1242466
11049 1242466 1125396 1041120 955034 860381 788657 731435 705075 680760 656788 650222 688018
11038F88018L7502N6140P1935N7570k4380j17527j23067q7372l9062k7079j3292
11027D79386r556k3621l090o071J0079r322Q601Q547N296J3262K3380K1635J2952
11014E31478J3136L7258M6833L6286O1634P4749J11577J67325K39396L64447N17489
11003B201608O79675Q96043J266752J213820K27039q30071j641504j512975q92697
10994A607690m59144k44234j35472q6137n1162l1552m3330n9497k6440j6007k7725
10983D26990k3612k6541j8406r776L473O428L96O28J4731K0950j1337j559J0089
10970C92454J1330P499M479L0P034M868K0890K8155P675j089K2153J0636m362
10957E11752K3501J8915J9554K3869K7817K8603J4739K1953L3108L8245L9057
$$ plain form
11038 688018 725520 781660 853595 911165 886785 769258 646191 558819 519757 492678 479386
11027 479386 469830 446209 443119 437048 447127 437805 446406 454953 460249 473511 496891 518526 531478
11014 531478 544614 581872 628705 664991 726625 801374 912951 1080276 1319672 1684119 2201608
11003 2201608 2881283 3777326 5044078 6257898 6484937 5654866 4013362 2500387 1607690
10994 1607690 1148546 904312 768840 682703 631541 599989 556659 497162 470722 454715 426990
10983 426990 403378 376837 358431 348655 352128 358556 358952 359580 374311 395261 383924 382365 392454
10970 392454 403784 411283 415762 415792 422826 427694 448584 476739 484414 483325 505478 516114 511752
10957 511752 535253 554168 573722 597591 625408 654011 668750 690703 723811 762056 801113
10946H01113M0872L1678N5910P4699P8081P4131Q1913R4173R8174J17239J45610
10935A693593J65045J93192K17896K31057K83288L49749M17058N09899O32186
10926D692963P68888R38675J171285J503413J955734K548191L351996M397665
10918B1328810N608133O733803P266072O354994L350252j276180n596440p795940
10910C5973504p645064o213511m571466l245260k278738j597425j131998q13831
10902H476211n73323l97363k47119j13560L4253J93942L87038O40767R04996J156819
10892A0462661J324201J346254J173967R72104R98645J377255K161661L214108
10884B3030856M405614N574585O394889O484459N900869N373069N367230N051676
$$ plain form
10946 801113 841985 873663 929573 1004272 1082353 1156484 1238397 1332570 1430744 1547983 1693593
10935 1693593 1858638 2051830 2269726 2500783 2784071 3133820 3550878 4060777 4692963
10926 4692963 5461851 6400526 7571811 9075224 11030958 13579149 16931145 21328810
10918 21328810 26936943 33670746 40936818 47291812 50642064 49365884 43769444 35973504
10910 35973504 28328440 22114929 17543463 14298203 12019465 10422040 9290042 8476211
10902 8476211 7902888 7505525 7258406 7144846 7179099 7373041 7760079 8400846 9305842 10462661
10892 10462661 11786862 13133116 14307083 15279187 16277832 17655087 19816748 23030856
10884 23030856 27436470 33011055 39405944 45890403 51791272 57164341 62531571 67583247
10876F7583247K975576j131793n837770r199955j0129769r000942o912170m848132
10868B3498292l199858k014538j267092j017827j253536j624782j731359j526912
10860I862388j187832q62389o19426l95379k05620n5000P9520K16784L78323N29245
10850G740614P51112J034333J405818J919597K547382L365982M329267N320323
10842B8414428N944286N607383L722069L42224l610959o540056p215673o163283
10834B0500419m649799l341730k374168j710825j270176r75682p80067o52146
10826D745826n39452m54457l94752l48693k80746k27216j93625j46479j14243
10817B046163j15714j26019j34654j35642j16994j04273r8491p8978o4438o2344
$$ plain form
10876 67583247 70558823 69427030 63589260 54389305 44259536 35258594 28346424 23498292
10868 23498292 20298434 18283896 17016804 15998977 14745441 13120659 11389300 9862388
10860 9862388 8674556 7812167 7192741 6797362 6591742 6536742 6616262 6833046 7211369 7740614
10850 7740614 8491726 9526059 10931877 12851474 15398856 18764838 23094105 28414428
10842 28414428 34358714 39966097 43688166 44030390 40419431 33879375 26663702 20500419
10834 20500419 15850620 12508890 10134722 8423897 7153721 6178039 5397972 4745826
10826 4745826 4206374 3751917 3357165 3008472 2727726 2500510 2306885 2160406 2046163
10817 2046163 1930449 1804430 1669776 1534134 1417140 1312867 1214376 1135398 1070960 1008616
10807A008616n7500l7328l6052n2637n1986l6159l8267k7121k8468l2316k1019
10796E89763k0483j7150l27L148K017o765j0320l28k565l2475m1504l1141j0910
10783D20960J966j5485j4935r848p042k7182l0883r267k2042p65p432q310j6084
10770B53651j423J0142N442j926L749N578r707j7681N868J8721P595j9801R207
10757B69415R070L059j90J4828J1914Q16p313j748o167j9812l6576k5743j657
10744B09896k5263l966L186l603j7335j8853k3747k3274N603O855P982M585p363
10731A14703r618j1920m248O562J0619J1695N023J1601J4773K8900J8689J3197
10719B09976J0374M123J4127J0491P237k800M228k762k0274l7378k3493j0048
$$ plain form
10807 1008616 951116 913788 877736 825099 773113 736954 698687 671566 643098 610782 589763
10796 589763 569280 552130 551803 554951 556968 550203 539883 539555 536990 504515 463011 431870 420960
10783 420960 422926 407441 392506 382658 375616 348434 317551 308284 286242 285477 278045 269735 253651
10770 253651 252228 262370 267812 265886 269635 275213 265506 247825 253693 272414 280009 260208 269415
10757 269415 278485 281544 281354 296182 308096 308912 301599 299851 293684 273872 237296 211553 209896
10744 209896 184633 180667 183853 180250 162915 144062 120315 97041 102644 109499 117481 122066 114703
10731 114703 105085 93165 88917 95479 106098 117793 122816 134417 149190 178090 196779 209976
10719 209976 220350 224473 238600 249091 256328 253528 257756 254994 234720 197342 173849 163801
10707A63801k2423n068n737q124n917P01j0173j6113j1859P660N384K29p832j1869
10693G2660o749K181J1627K1747N016j3458l954L792j715R510L3428P381M773
10680A46239O020J7034M3255L6250K6037O3512P8316N6722R262q9796q2869n4463
10668B55519n0284m4275j9033q133k4747k5748M601N903j6239k079m785j506J7303
10655H6497K6005J0466N230O667m556M697L272k3893l0709j0985O264P096M019
10642I0070m586j384M69J5621J2415Q469P263J1439J7068J0712o045L98r187l048
10628A49674P229K797o892J0802L59p629k4187l6067k1498j1995p204j7521N700
10615D3568K0767J7251K929J1167P626J2971K2143K3307L8186L3706K2202J0803
$$ plain form
10707 163801 141378 136310 130573 122449 116532 117233 107060 90947 79088 86748 92132 92361 84529 72660
10693 72660 65911 68092 79719 101466 106482 93024 89070 92862 91147 100657 134085 141466 146239
10680 146239 152259 169293 212548 248798 274835 338347 416663 473385 482647 392851 309982 255519
10668 255519 205235 160960 141927 133794 109047 83299 87900 93803 77564 75485 70700 69194 86497
10655 86497 112502 122968 128198 134865 130309 135006 138278 114385 83676 72691 78955 86051 90070
10642 90070 85484 84100 84569 100190 112605 121074 128337 139776 156844 167556 161511 161909 152722 149674
10628 149674 156903 159700 152808 163610 163969 156340 132153 96086 74588 62593 55389 37868 43568
10615 43568 64335 81586 84515 95682 103308 116279 138422 161729 199915 233621 255823 266626
10603B66626P765K932p957K623o685k0755k4311j4257m687p801j2160m471r317
10590A67545k2224k2540K5k704j7554r035L054q286J0048P535p693j1528l075
10577H3568Q416N127k600J298J4728Q847J5554R872K325J45K6062P599K034j7904
10563A65071k320R431k173j2860J0296L795J1552J4922P589K0073M310l62J6105
10550B45429R656j3384n8243p2206n2324L3418Q4946O4011J7845j5160k4695n742
10538B13551j3152j2253Q580K4079J7621p19j7034m21N026n651Q898K3840R781
10525B62146j980q193j2566O265J2258R922k3938j5282J1467O162p241J3130Q346
10512B60496J4293K0665J7135J1929K724K5334J9211M506J3838O695K774J0175
$$ plain form
10603 266626 274391 277323 269366 271989 265304 244549 220238 205981 201294 193493 181333 176862 167545
10590 167545 145321 122781 122806 120102 102548 93513 96567 88281 98329 105864 98171 86643 83568
10577 83568 91984 97111 94511 95809 110537 119384 134938 144810 147135 147280 173342 180941 182975 165071
10563 165071 162751 172182 170009 157149 167445 171240 182792 197714 205303 225376 229686 229324 245429
10550 245429 255085 241701 183458 111252 58928 92346 177292 241303 259148 243988 219293 213551
10538 213551 200399 188146 196726 220805 238426 237707 220673 220252 225278 219627 228525 252365 262146
10525 262146 260166 251973 239407 245672 257930 267852 243914 228632 240099 246261 239020 252150 260496
10512 260496 274789 295454 312589 324518 327242 352576 371787 376293 390131 396826 399600 409775
10500D09775J4670N849J0967L4240L2150j0264j106J7465K8260M1336L9174L1712
10488F54228L1342J8118j2251j1991p056k974L050N972N482K4914M296j1747J1802
10475G13185K4275K7825K8370J8273J6648K8798M3394Q3670R1812P2415O9587
10464A218252P0341N6252N3134P5510Q6139R8449J08571Q5315R0197J26811J67050
10453B236021K08596K07317J53208Q0277P6297J38092K32883L01610L43257L88606
10443D366164M18625N09116O61987Q53846J007614J116784J180220R44108P13770
10434A1772234J026313J665597K425266L375631M645477O432569R009928J2612068
10426E2965083J7790660K5899149L8703985N6121679P5115073R2677592P6855885
$$ plain form
10500 409775 424445 430294 441261 475501 507651 497387 496281 513746 542006 583342 622516 654228
10488 654228 685570 703688 691437 679446 672390 669416 672466 678438 683920 708834 713130 701383 713185
10475 713185 737460 765285 793655 811928 828576 857374 900768 984438 1076250 1148665 1218252
10464 1218252 1288593 1344845 1397979 1473489 1559628 1658077 1766648 1851963 1942160 2068971 2236021
10453 2236021 2444617 2651934 2805142 2885419 2961716 3099808 3332691 3634301 3977558 4366164
10443 4366164 4784789 5293905 5955892 6809738 7817352 8934136 10114356 11058464 11772234
10434 11772234 12798547 14464144 16889410 20265041 24910518 31343087 40353015 52965083
10426 52965083 70755743 96654892 135358877 191480556 266595629 359273221 436129106
10419D36129106k0463034j12448365j09296184o9741891m0690964k4223650j4902331
10412D4362687r656494o755120m938935l649261k726754k093985j600106j177982
10404A1764050q47823o32475p41619j151183j247509r82643p10096n59945m36227
10395D454530l33698k50630j93920j65130j88383k23932k25743j83722j29070
10386B560302j14762j10657j19958j05398j05053p1375m1860n1696l5941l0571
10376A773031l6619k062L6276P4251J05000J58964J93354K37022K87532L27360
10366C154109K42693K7291k79538m78988m88659l95846k91226k15500j58915r8324
10356A017097o7733m3422l8203m6471m9977n4334m4657k6487j5078j8276l6563
$$ plain form
10419 436129106 415666072 303217707 193921523 124179632 83488668 59265018 44362687
10412 44362687 34706193 27951073 23012138 19362877 16636123 14542138 12942032 11764050
10404 11764050 10916227 10283752 9542133 8390950 7143441 6160798 5450702 4890757 4454530
10395 4454530 4120832 3870202 3676282 3511152 3322769 3098837 2873094 2689372 2560302
10386 2560302 2445540 2334883 2214925 2109527 2004474 1933099 1891239 1839543 1803602 1773031
10376 1773031 1736412 1734350 1770626 1844877 1949877 2108841 2302195 2539217 2826749 3154109
10366 3154109 3396802 3424093 3144555 2665567 2176908 1781062 1489836 1274336 1115421 1017097
10356 1017097 949364 905942 867739 821268 771291 716957 672300 645813 630735 612459 575896
10345E75896k8625j4944J964M755O080J2302m156j7100n371q014k0637l4712j6502
10332D50936j7576q931q670k5192j3802K005j019n414r627j5413j1615l541j9985
10319C12156k4701k4477l2302j4684j5370q425O952K053j105R859M328K2546J6758
10306B53588J0843J3939J783P647N383R638o31J3615L7756N2478O5986O9778O1257
10293F03060J7975n0326r1727j00923n6190l1007l3783k9330l3245k5626j3631
10282A55247P870J276J26Q929j0060j0820l653o544J77L273Q777N766j666O947
10268A65645k936p387N009J5208j673L332J2001K937j5749k210q697k364P254
10255A70370o885l223Q80k0979k1211l1704l1065j6708j8002p799r676r441r371
$$ plain form
10345 575896 547271 532327 534291 539046 545126 557428 553272 536172 530801 522787 502150 467438 450936
10332 450936 433360 424429 415759 390567 376765 378770 377751 372337 362710 347297 335682 332141 312156
10319 312156 287455 262978 230676 215992 200622 192197 199149 201202 200097 209956 214284 236830 253588
10306 253588 264431 278370 280153 287800 293183 302821 302190 315805 353561 406039 472025 541803 603060
10293 603060 621035 570709 478982 378059 321869 290862 257079 227749 194504 168878 155247
10282 155247 163117 164393 164519 173448 163388 152568 148915 142371 142548 145821 154598 160364 158698 165645
10268 165645 162709 155322 160331 175539 173866 177198 189199 192136 176387 174177 165480 163116 170370
10255 170370 163485 160262 161142 140163 118952 87248 56183 39475 21473 13674 3998 -5443 -14814
10242a4814j0601k0150k4279q153P20R94J4636K92J3125J5913L7240N3863L9228
10229I8014K4130J1402M091K577P664J0191K1319J3101k5007l7193j9055j0154
10217A01080k4642k6942j2725M55M988K1535J2425q850j0670n704L236r523r352
10204C5311K635J3370K8184J6947J0959o579M598n13p991n706n073J950m557p59
10190H2776l310M527M207n435Q67k806M234J0842J1823J2769j956j408R80J214
10176A19324J1097Q403J4747J4050j1254k9432k0415K0674J172q602O769j6567
10164A09966r314l578m062j522r515P91J6204j887N336j087p336j9346o065Q534
10150G7119r249j1846l988n975J948p881j2745l114O034j1063m928R915K163n062
$$ plain form
10242 -14814 -25415 -45565 -69844 -77997 -77277 -76283 -61647 -61355 -48230 -32317 4923 58786 98014
10229 98014 122144 133546 137637 140214 147878 158069 179388 192489 167482 130289 111234 101080
10217 101080 76438 49496 36771 37226 42214 63749 76174 67324 56654 50950 54186 44663 35311
10204 35311 37946 51316 79500 96447 107406 100827 105425 104912 96921 91215 86142 88092 83535 82776
10190 82776 79466 83993 88200 82765 83632 80826 85060 95902 107725 120494 118538 117130 118110 119324
10176 119324 130421 138824 153571 167621 156367 126935 106520 127194 128366 119764 126533 109966
10164 109966 100652 97074 93012 91490 81975 82766 98970 97083 102419 101332 93996 74650 68585 77119
10150 77119 67870 56024 52036 46061 48009 40128 27383 24269 30303 19240 14312 24227 26390 21328
10136B1328M668Q139l05Q503Q887k790L859P022j0035j1444k769N112P153k691
10122D4637k307M75k101j116K1487J9433J1976M535J1940J833Q317R825J7615
10109A46549J2339Q694N02J030P086O993L5720M8675N8279O7235J03566J79768
10097F76436K40810L45611M53794N75438O10964L37193k28146o68384p28244n13754
10087A101718l19643k10787j40712r7512o3718l0477k0499j7393k3020j6074j5451
10076A46432m486N358J325J0053J068k8078o877m430J3215Q976m883J1301r322
10063A39652j7256j6602l18j641r324k0304j6169n000m234n744n030M997M809
10050D7836k397K68l057r964K044J3261K912p381j1508N019L335J101j467q370
$$ plain form
10136 21328 25996 34135 33830 42333 51220 48430 52289 59311 49276 37832 35063 40175 47328 44637
10122 44637 42330 42805 40704 39588 61075 80508 92484 97019 108959 110792 119109 128934 146549
10109 146549 158888 167582 168084 169114 176200 183193 218913 267588 325867 393102 496668 676436
10097 676436 917246 1262857 1716651 2292089 2903053 3240246 3012100 2343716 1615472 1101718
10087 1101718 782075 571288 430576 333064 269346 238869 218370 200977 177957 161883 146432
10076 146432 141946 147304 148629 158682 159750 131672 124795 120365 133580 142556 137673 148974 139652
10063 139652 122396 105794 105476 103835 94511 74207 58038 53038 48804 43060 38030 43027 47836
10050 47836 45439 45707 42650 32686 34730 47991 50903 43522 32014 37033 40368 41469 40002 31632
10036C1632j0209N520n498K725O110R121O588K37j4072L144J0863j6814k518k753
10022B4076K814L34O360P452J3991j541j2018j139J0341J4536l967Q83L359J4631
10008H0112J9572K0641K0566K4638L3828M7822R2366J01806J36841K05180L08174
9997A091546M05645M70156L29514j82939n81895n37334l36756k02230j27127q1539
9987B47041n9067m5943l1950L606r405l0231j7154m960p549r504N930j664n474
9974C3676n87P340l2655j2176q19K3399J7853J1753P195Q71Q497Q552k168j3745
9960E6986j9714k527L979p3p308n749J3942K2638m062j3428j4901K340N41P022
9946C9686j961j4257k873m994p595l02Q707N012l782P470M668Q540Q036r652j5501
$$ plain form
10036 31632 21423 26943 21445 24170 30280 39401 45989 46226 32154 35298 46161 29347 26829 24076
10022 24076 26890 27224 33584 41036 55027 53486 41468 40329 50670 65206 61239 62122 65481 80112
10008 80112 99684 120325 140891 165529 199357 247179 339545 441351 578192 783372 1091546
9997 1091546 1497191 1967347 2296861 2113922 1532027 994693 657937 455707 328580 247041
9987 247041 187974 142031 110081 113687 104282 74051 56897 51937 44388 34884 40814 39150 33676
9974 33676 33089 40429 7774 -4402 -5221 18178 36031 47784 54979 55850 64347 72899 70731 56986
9960 56986 37272 34745 38724 38651 31343 25594 39536 62174 58112 44684 29783 32123 32664 39686
9946 39686 37725 23468 20595 15601 8006 7704 16411 21423 17641 25111 29779 38319 46355 36703 21202
9931B1202m628O532q72J4313Q011K489J7078K965j1799k3790j0295p119j1636
9918B451k102L208m493j4724j699k533M606N815p13j152P441j291J741o689n480
9903a5614o323p851J2644j767R10J2011P311J6566J0434k932j4633l543O89o12
9889G290j8980M16K61J0435L404M719L862l456j326p112j6822P251K966n2k079
9874i223J0110J120J1624P052M10p146J1671J1703j515l051O14j9128j4789M909
9860D361J6088P535J893m99K037j4280n531o941j307Q49L455j5197j85J552j6303
9845b2473o989j188J0566Q759J609J6259J4750N919k54R550r620k3694M567J0673
9831A8434L27k893j291P788l777M768J3368n145j5072p004j3362K616N120J040
$$ plain form
9931 21202 16574 23106 22234 36547 44558 47047 64125 67090 55291 31501 21206 14087 2451
9918 2451 349 3557 -936 -15660 -17359 -19892 -15286 -9471 -10184 -11336 -3895 -5186 -3445 -10134 -15614
9903 -15614 -21937 -29788 -17144 -18911 -18001 -5990 1321 17887 28321 25389 10756 7213 7902 7290
9889 7290 -11690 -11274 -11013 -578 2826 7545 11407 7951 6625 -487 -17309 -10058 -7092 -7144 -9223
9874 -9223 887 2007 13631 20683 21093 13947 25618 37321 35806 32755 33369 14241 -548 4361
9860 4361 20449 27984 29877 29378 31415 17135 11604 4663 3356 4205 7660 -7537 -7722 -6170 -22473
9845 -22473 -29462 -30650 -20084 -11325 -9716 6543 21293 27212 26958 36508 26888 3194 7761 18434
9831 18434 18761 15868 14577 22365 18588 23356 36724 31579 16507 9503 -3859 -1243 3877 4917
9817D917p385l57R976N424M716p019Q431L970m607j2350j2790J0632R346M189
9803A7093K656N210m601p111p057j1314k420M398Q186n045j981K927N765N466
9789A2172K473j0032K790l115n165n809l2R385J6873J4408j0842j1995M764k82
9775A5593J367Q62j8360j605K365J3810K2M980J981K917q106L170L498K4152L1183
9760G7829n008j2243j4169j0206N972J5649q770k2739k3317J671J0687J334l660
9747A3030o733r202p177J329J162J772Q419N177N231Q046J4610m837L429M776
9733C9032J726j7747j687j1979P20P362k400L751J2963o80j4472O34O794O258
9719C0275L32L582q36K892l297j8080p815J881O03k916o779o644k694O461J5161
$$ plain form
9817 4917 -2468 -2825 7151 12575 17291 10272 18703 22673 18066 5716 -7074 3558 12904 17093
9803 17093 19749 24959 20358 13247 6190 -5124 -7544 -3146 5040 -5 -1986 941 6706 12172
9789 12172 14645 4613 7403 4288 -877 -6686 -6718 2667 19540 33948 23106 11111 15875 15593
9775 15593 16960 17822 -538 -2143 222 14032 14054 19034 21015 23932 15826 18996 22494 46646 77829
9760 77829 72821 60578 46409 36203 42175 57824 49054 26315 2998 4669 15356 16690 13030
9747 13030 6297 -2905 -10082 -8753 -7591 -5819 2600 7777 13008 21054 35664 30827 34256 39032
9733 39032 40758 23011 21324 9345 10065 17427 15027 18778 31741 31061 16589 17223 24017 30275
9719 30275 30607 34189 33353 36245 32948 14868 7053 8934 9537 6621 -158 -6802 -9496 -3035 12126
9704A2126p166n722r265K527O231M984j3837M357p322j3032k704m491N798M780
9690b2736J594J0925Q457j787M245Q626M621j2883j788R358P429P911r968j2017
9676A987L453J2146L568J482p044p54P177L666J114Q060n322k2145J658Q370N103
9661B2519R6P343j4301k95l876M310O18m850q613J553M497q62L229k154K404J390
9645A3008p35j3150j750q790M514k55J3086N475p636n053M62Q654M403k926L485
9630A2792L658o871j494p400j0230l398K94K932J8221K350k873m289K966j0919
9616d261L232n086n720Q08j4536m340R080J7493J3272N063R473j120k325j1042
9602I991j0519p652Q21M753M876O453M269p824L488N460P423k953n495j1096j941
$$ plain form
9704 12126 4960 -762 -10027 -7500 -1269 3715 -10122 -5765 -13087 -26119 -28823 -33314 -27516 -22736
9690 -22736 -21142 -10217 -1760 -3547 698 9324 13945 1062 -726 8632 16061 23972 14004 1987
9676 1987 5440 17586 21154 22636 15592 14838 22015 25681 26795 34855 29533 7388 9046 17416 22519
9661 22519 22615 29958 15657 15362 11486 15796 16414 11564 2951 4504 9001 8139 11368 9214 11618 13008
9645 13008 12273 -877 -2627 -11417 -6903 -7158 5928 11403 3767 -1286 -824 7830 12233 9307 12792
9630 12792 16450 9579 8085 685 -9545 -12943 -12649 -9717 8504 10854 7981 3692 6658 -4261
9616 -4261 -1029 -6115 -11835 -11027 -25563 -29903 -20823 -3330 9942 15005 24478 23358 21033 9991
9602 9991 -528 -8180 -7359 -2606 2270 8723 12992 5168 8656 14116 21539 18586 13091 1995 54
9587E4J2827M039J20l332J0310P275j0088n595l576n278j1026R985k467O365R322
9572A8935n764l479j365K661n60o710o712j658N339P607r19j8588M285J2963K914
9557H949O876j608p987P466l280n820M469L687o462P052J8340K741j1936r928
9543A2559m434k770L613R48J187J991q233P729q710j0944O250R85J697M269K313
9528H450k221K497P848j018p018l764o749N697J7070P689j4073J254L107P833
9514B6602o821L5J523m451q431p608J240Q89o694k99R159J7059j906j0534r37
9499H826K462O816J7386m88q112j7249L430P361m26P741Q005k30m884J812J706
9484C4156p478j1913j3137N332N699M490m593k873P599K595Q68M25j424o331p400
$$ plain form
9587 54 12881 16920 17040 13708 24018 31293 21205 15610 12034 6756 -4270 5715 3248 9613 18935
9572 18935 13171 9692 8327 10988 10428 3718 -2994 -4652 687 8294 7375 -11213 -6928 6035 8949
9557 8949 15825 14217 6230 13696 10416 4596 9065 12752 6290 13342 31682 34423 22487 12559
9543 12559 8125 5355 8968 9916 11103 13094 4861 12590 3880 -7064 -814 171 1868 6137 8450
9528 8450 6229 8726 16574 15556 8538 4774 -1975 3722 20792 28481 14408 15662 18769 26602
9514 26602 19781 19816 21339 16888 8457 849 2089 2978 -3716 -4015 5144 22203 20297 9763 8826
9499 8826 11288 18104 35490 35002 26890 9641 13071 20432 20006 27747 35752 35522 30638 32450 34156
9484 34156 26678 14765 1628 6960 12659 17149 12556 9683 17282 19877 20745 21170 19746 13415 6015
9469F015Q30O745J3173L022j4883r165N008J054k659J407l012j5443q198j881
9455a7987l942P816N119R291j193R778N645J341j3029j623j854Q99K918m234J967
9440I12R013j4517Q64L968o201J3023k131q972j435j200K27k079Q099O089N020
9425A0680L820j0783L642J109L412j952o829L058Q475R80j1817j0164k257J2791
9411D165R622j0219L950K711N170m448j7592l912P271M146R160M909K405P716
9397B5054q100k453l122o04J0497J174l815Q469M877j187j1295o717n048L597
9383A1327O42M645k512L795j2766j9226m713K2163K1812j712j132L098P215L196
9369C5832j3773j1576o399n282K88M3O390j2105p439R542Q679P233K645K795l975
$$ plain form
9469 6015 6845 13590 26763 29785 14902 5737 10745 11799 9140 10547 7535 -7908 -16106 -17987
9455 -17987 -21929 -14113 -8994 297 -896 8882 14527 15868 2839 1216 -638 261 3179 -1055 912
9440 912 9925 -4592 -3728 240 -5961 7062 4931 -4041 -5476 -6676 -6449 -8528 -429 5660 10680
9425 10680 14500 3717 7359 8468 11880 9928 3099 6157 14632 15612 3795 -6369 -8626 4165
9411 4165 13787 3568 7518 10229 15399 10951 -6641 -10553 -3282 864 10024 14933 17338 25054
9397 25054 16954 14501 11379 10775 21272 22446 18631 27100 31977 30790 19495 12778 7730 11327
9383 11327 11969 16614 14102 17897 5131 -14095 -18808 3355 25167 23455 22323 25421 32636 35832
9369 35832 22059 10483 4084 -1198 -910 -867 5523 -6582 -14021 -4479 4200 11433 14078 16873 12898
9354A2898p181P403J0716j3871j0302L906J8517O004p08j309k936j730L083M75
9340B4965n177j888n985m970o617L116J4351K519m159P23j031q542l79R174n110
9325A0990l10J0831j6984Q58k105J35M755l100M080j477O426m470k179Q016o243
9310I223m794r41J7778k961R104j137p54n883P71K158k4883O3l713m969k844J0374
9294c408R528J4408K279N958L118r591m371k5191Q959J4381M358j5398k350L230
9280E910L874R971J3146n106r576j0492P212m266l686Q738J1533j301j1627n314
9266I016R638J0239J776n291j1925O034J073j520l777O197M915k274O20m214k759
9251A7748r174p612L018M62j0073p239Q023K528R098M174q28m894k067j2823l837
$$ plain form
9354 12898 5717 13120 23836 9965 -337 3569 22086 28090 27382 26073 23137 21407 24490 24965
9340 24965 19788 17900 11915 6945 328 3444 17795 20314 16155 16878 15847 7305 6926 16100 10990
9325 10990 10680 21511 4527 5385 3280 3415 8170 5070 9150 7673 14099 9629 7450 15466 9223
9310 9223 4429 3488 21266 18305 27409 26272 25518 19635 20406 22564 -2319 -2256 -5969 -10938 -13782 -3408
9294 -3408 6120 20528 22807 28765 31883 22292 17921 -7270 1689 16070 20428 5030 2680 5910
9280 5910 9784 19755 32901 27795 18219 7727 14939 10673 6987 15725 27258 25957 14330 9016
9266 9016 18654 28893 30669 25378 13453 19487 20560 19040 15263 21460 26375 24101 24721 20507 17748
9251 17748 8574 962 3980 4442 -5631 -12870 -4847 -2319 6779 10953 10125 5231 3164 -9659 -13496
9236a3496p98n03O862R158J6438K351j4434l06R974J4096k209j0906R366j3633
9222A1960n682K729N531m059Q415M752n829n973m378m384m598l110j722k129P662
9207h15K751j175M688K30Q278L928j4531j0367R697O799l793K683J1870r10j2800
9192F533P39J596L399N051r14k599j4951P031O141k553N075O581J701q00j3541
9177H489l502m032O443J7835o132o196N620K381J4103k1561j0426J0199l114k945
9163G162l791K750K890K048P407j407j6532n976J1700J5982n74L391J0516m599
9149C0967k4375p224N965R453J1083J352J0076n729j8443q368L014q19M905l318
9135H539Q109j470j810k954k860N140l476p089K647n591j346k566J4780J6615
$$ plain form
9236 -13496 -14294 -14797 -7935 1223 17661 20012 5578 5272 15246 29342 27133 16227 25593 11960
9222 11960 6278 9007 14538 10479 18894 23646 17817 11844 7466 3082 -1516 -4626 -6348 -8477 -815
9207 -815 1936 761 5449 5679 13957 17885 3354 -7013 2684 9483 5690 8373 20243 19333 6533
9192 6533 7272 8868 12267 17318 16404 13805 -1146 5885 12026 9473 14548 21129 22830 22030 8489
9177 8489 4987 955 7398 25233 19101 12905 18525 20906 35009 13448 3022 13221 10107 7162
9163 7162 3371 6121 9011 11059 18466 17059 527 -5449 6251 22233 21659 25050 35566 30967
9149 30967 6592 -632 5333 14786 25869 27221 37297 31568 13125 4757 7771 6952 11857 8539
9135 8539 16648 15178 13368 10414 7554 12694 9218 2129 4776 -815 -2161 -4727 10053 26668
9121B6668P796J2938M185j9114r817J082o609r656N817k058L249k040K262O489
9107B1192K451N188K574r677j9934O481J3691P522r681j2744p568J0559k093N798
9093A3759J80L307J1975L675j6831r1J5729O306R308J962j0349j1544k109p79
9079B4498K361O632l268K097r501l832k183O466j16j2336r619R559K666K244K354
9064A8022M369N906Q09L027J5576k888l2713j9378q31J1914K4708J546j3642j4429
9050A996J1179j809o988M300K0158K1733P493p845p865M66N433l775n80m961n511
9035C3424J521j44j678j4285j3257J0230L593m16m429l900M061Q855l515j3709
9021F351N111J3414j0539p020k097N209n549L459J3043J958j984J1556p89L279
$$ plain form
9121 26668 34464 47402 51587 32473 22656 23738 17129 7473 13290 11232 14481 12441 14703 21192
9107 21192 23643 28831 31405 21728 1794 8275 21966 29488 19807 7063 -505 10054 7961 13759
9093 13759 13939 17246 29221 32896 16065 15974 31703 38009 47317 49279 38930 27386 25277 24498
9079 24498 26859 33491 30223 32320 22819 18987 16804 23270 23154 10818 1199 10758 13424 15668 18022
9064 18022 22391 28297 29106 32133 47709 44821 12108 -7270 -8101 3813 28521 30067 16425 1996
9050 1996 13175 11366 4378 8678 28836 50569 58062 50217 42352 42818 48251 44476 43896 38935 33424
9035 33424 34945 34801 33123 18838 5581 15811 19404 18988 14559 10659 14720 23575 20060 6351
9021 6351 11462 24876 14337 7317 5220 10429 4880 8339 21382 23340 21356 32912 32123 35402
9007C5402j398J0083o450j6311M426p642r820L551j0769l515K1372R228M467j334
8993C1290j4566J2989J5590r375P9K278J253O387M15k0961l666k197J2037Q874
8979D0427L327N880J670l826j28J976m18j912l372l961m957K67Q303o383J341
8964C8234j550r569q339R389P020q93N159J947n217R443l954J9006m397M751o396
8949E4634m82K073j2218j8103j432P70o598o410j2799K369J0464J4860K0204Q826
8935E6158k4395m754R982J1765K781M13r364n018J806N481m54J765L412o967K518
8920D5129J1303L605J741k1145j2383L471O342P650n32j0854Q89l588J5602l616
8906D3614j4312K979R907M172r38o961M377R362o78m887N216o648m14o775J623
$$ plain form
9007 35402 34004 44087 37637 21326 25752 18110 8290 11841 1072 -2443 18929 28157 32624 31290
8993 31290 16724 29713 45303 35928 36007 38285 39538 45925 46340 25379 21713 19516 31553 40427
8979 40427 43754 49634 51304 47478 47350 49326 48908 46996 43624 39663 34706 34973 43276 36893 38234
8964 38234 36684 27115 18776 28165 35185 34292 39451 41398 36181 45624 41670 60676 56279 61030 54634
8949 54634 54152 56225 44007 25904 24472 25242 18644 12234 -565 1804 12268 27128 47332 56158
8935 56158 31763 27009 36991 48756 51537 51950 42586 37568 39374 44855 44401 46166 49578 42611 45129
8920 45129 56432 60037 61778 40633 28250 31721 38063 45713 45181 34327 35216 31628 47230 43614
8906 43614 29302 32281 42188 46360 45422 38461 42838 52200 51522 46635 51851 45203 44789 38014 39637
8891C9637o782j0781n321M595J5478Q159N981j066O620L919o893N821K27k1683
8877C7911j3802m168P859M744j490K0743K833p661j736k457K396J0617J103K250
8863E9142M248o14R662o84j7338j6286j6015P339q9K429N613n055L639j225L485
8848C8251j0898n11K2169J0404j9963j3243j5758j945Q714K235J1516L0002Q927
8835F9900p871k0011q21l26L293J8738M832J474o631o115k970Q866R483M748o116
8820G0473j4042m949j2039O638J0704J758K43J51m98O445j918j1853p452J0483
8806E4144J2219J4202r535j4345j3642N287K0247L610J65r285j413j238k772P951
8792F5595K534Q445j0205j0771n892J2922N094N248p90l063j2519n250L809N680
$$ plain form
8891 39637 32855 22074 16753 21348 36826 44985 50966 49900 56520 60439 53546 59367 59594 37911
8877 37911 24109 19941 27800 32544 31054 51797 54630 46969 45233 42776 45172 55789 56892 59142
8863 59142 63390 62776 72438 71754 54416 38130 22115 29454 29365 31794 37407 32352 35991 34766 38251
8848 38251 27353 26842 49011 59415 39452 26209 10451 8506 17220 19455 30971 60973 69900
8835 69900 62029 42018 41197 40871 44164 62902 67734 69208 62577 56462 53492 62358 71841 76589 70473
8820 70473 56431 51482 39443 46081 56785 58543 58786 58937 58439 64884 62966 51113 43661 54144
8806 54144 66363 80565 71030 56685 43043 48330 68577 72187 72352 63067 61654 60416 57644 65595
8792 65595 68129 76574 66369 55598 49706 62628 67722 72970 72180 69117 56598 51348 55157 60837
8778F0837K837J649L622j0158l168q847k233J1072J0933R394J461K689J1216O945
8764I8249o396M098K068J0420K1781K817j401R957K8842M847o875k185r000j4096
8750A43126r255k5354j0844O181J765m693m614p132m929j0524N833J4760K658
8737I6978j3530m446O139Q955q93J927n344l480J237m849M466J4825r554k655
8723H9776J3010q62q93Q387R385j4082j2791O924K539m973r880m853J380N962
8709H9029J4312k801P585l054j0161K819P617J459r254j525N432Q297J1246J2220
8695A33221k581L950r359K941r59k755o9O015J4729o115M281j0730j8385j445
8681A12739J8830M596k675k361p696j994n803j3597m041J5765K735r199K133Q445
$$ plain form
8778 60837 63674 65323 68945 58787 55619 46772 44539 55611 66544 75938 77399 80088 91304 98249
8764 98249 91853 95951 98019 108439 130220 133037 131636 141593 170435 175282 168407 166222 157222 143126
8750 143126 133871 108517 97673 103854 105619 100926 96312 89180 84251 73727 79560 94320 96978
8737 96978 83448 79002 85141 94096 93203 95130 89786 86306 87543 82694 87160 101985 92431 89776
8723 89776 102786 101924 101031 109418 118803 104721 91930 98854 101393 96420 86540 81687 83067 89029
8709 89029 103341 100540 108125 105071 94910 97729 105346 106805 97551 96026 101458 109755 121001 133221
8695 133221 130640 134590 125231 128172 127213 124458 124389 130404 145133 139018 143299 132569 114184 112739
8681 112739 131569 136165 133490 131129 123433 121439 115636 102039 97998 113763 116498 107299 109432 117877
8667A17877J1067k968J3499M764K64J051k674j433j3533j5345l96K370K1725J2579
8653A48847j196j386m2q133L320O072P781l023l011j521L089N952J061P918P805
8638A73533j8188j2059j1935p096Q183O661m250l156J3261K3137M610j2071j8479
8625A42151Q057Q026J3221j1456n897J1614R315j328o639j0203o244Q399J8558
8612A77574R885P536q836R530J0820J7910j3782k5002o744K284R549J3891L33
8599B04948n214k268L792J8106k338j381J053J7412K1363K195N769J5204P162
8586B85803P79R236P125o408j583J2106P780p926P281L440k32k953O151J8265
8572C38864o12k6186o070L861Q423L301J538Q549r520j791o119l860j3269J6319
$$ plain form
8667 117877 128944 125976 139475 144239 144503 145554 142880 141447 127914 112569 112173 114543 136268 148847
8653 148847 147651 146265 146223 138090 141410 147482 155263 152240 149229 147708 150797 156749 157810 165728 173533
8638 173533 155345 143286 131351 124255 132438 139099 134849 131693 144954 168091 172701 160630 142151
8625 142151 150208 158234 171455 159999 154102 165716 175031 173703 167064 156861 150617 159016 177574
8612 177574 187459 194995 186159 195689 206509 224419 210637 185635 178891 181175 190724 204615 204948
8599 204948 199734 197466 201258 219364 217026 215645 216698 234110 255473 257668 263437 278641 285803
8586 285803 286582 295818 302943 296535 294952 307058 314838 306912 314193 317633 317401 314448 320599 338864
8572 338864 338252 312066 305996 309857 318280 321581 323119 331668 322148 320357 314238 310378 297109 313428
8558C13428K032M737m131j4837K649K0099k045j4681j0373J9346J8347K0812J8330
8545C73713R634R199J7008K9656K7479Q492K996K386j9604k0477j3211m034j0875
8532D12362l690m043Q12m327p228n841j5411k0428l177J0745R315j440r020p660
8518C50969J1513Q404L732Q602M878J5225J1984K067j700k600Q060q052N881J3045
8504D32008k499K0077J2654Q056K3604O726O594J8098K8414J3869O046Q199J35
8491E81981j2468k4619o881k769n016R249J0617N786m48l781l100Q501J2367L387
8477E72806L878J253N227R779o414l319L489J6099J0374L720N312J0036J1474
8464F43714R12o346J2258K0085K3943J1376N480j2001P29N232L0516K2420Q345
$$ plain form
8558 313428 315460 320197 316066 301229 303878 323977 321932 307251 296878 316224 334571 355383 373713
8545 373713 383347 392546 409554 439210 466689 475181 478177 480563 460959 440482 427271 423237 412362
8532 412362 408672 404629 405441 401114 393886 388045 372634 352206 349029 359774 369089 367649 358629 350969
8518 350969 362482 370886 374618 383220 388098 403323 415307 417374 415674 413074 421134 413082 418963 432008
8504 432008 429509 449586 462240 470296 493900 500626 507220 525318 553732 567601 573647 581846 581981
8491 581981 569513 544894 538013 535244 530228 539477 550094 555880 555432 551651 548551 557052 569419 572806
8477 572806 576684 577937 583164 592943 586529 583210 586699 602798 613172 616892 622204 632240 643714
8464 643714 644626 638280 650538 670623 694566 705942 711422 699421 700150 705382 735898 758318 766663
8451G66663J4051R095J2488N757N531J6111J9188J2788O390k042J0280K6650J9447
8438I22397J2350J0379J0578K0130J3172L446J8236J7044J6500J3188J1031K4310
8426A092761L2676K8193J8184M615R030K4547L4133K7466K0405J9124K3459K3562
8414A358155K5293J0143K1933L1315L0267M1313K4699K2200K6030K9598M3014
8403A663960M0334K2592L3452M1656M6785L4528M5251M0323M0334M7127O0366
8392B116708N8561O0341L9402L9824N3920N6091N3167N4505O2291N7698O9374
8381B721882O6039Q7556Q0096Q5892P5598Q4323R0199Q6320Q7530Q2065R5479
8370C642979J16750J27209J22061J11449J21135J33517J44020J48416J31126J30574
$$ plain form
8451 766663 780714 789809 802297 808054 813585 829696 848884 861672 868062 866020 876300 902950 922397
8438 922397 934747 945126 955704 975834 989006 992452 1010688 1027732 1044232 1057420 1068451 1092761
8426 1092761 1125437 1153630 1171814 1176429 1185459 1210006 1244139 1271605 1292010 1311134 1334593 1358155
8414 1358155 1383448 1393591 1415524 1446839 1477106 1518419 1543118 1565318 1591348 1620946 1663960
8403 1663960 1704294 1726886 1760338 1801994 1848779 1883307 1928558 1968881 2009215 2056342 2116708
8392 2116708 2175269 2235610 2275012 2314836 2368756 2424847 2478014 2532519 2594810 2652508 2721882
8381 2721882 2787921 2875477 2955573 3041465 3117063 3201386 3291585 3377905 3465435 3547500 3642979
8370 3642979 3759729 3886938 4008999 4120448 4241583 4375100 4519120 4667536 4798662 4929236
8360D929236J56624J60064J69695J93595J91500K04206K10958K16918K32701K43344
8350F908841K37338K46663K73432K77134K83096K88100L04510L35270L23580L50105
8340I828069L71533L77762M04989M06933M26928M25488M28570M49752M58713M65035
8330A4043772M70290M77989M85297M70318M63397M50343M56032M21786L88194
8321A8127418L67535L47507L15603K66304K14552J82895J24513P6627L1417l1823
8311B0022548p9677j14562j72372k12029k56736l00021l34346l79732m05399m10528
8301A7357146m28522m59877m74697m67959m56217m76238m78687m75183m52619
8292A3187147m39760m29635m31147m07610m03735l91884l86066l63338l54377
$$ plain form
8360 4929236 5085860 5245924 5415619 5609214 5800714 6004920 6215878 6432796 6665497 6908841
8350 6908841 7146179 7392842 7666274 7943408 8226504 8514604 8819114 9154384 9477964 9828069
8340 9828069 10199602 10577364 10982353 11389286 11816214 12241702 12670272 13120024 13578737 14043772
8330 14043772 14514062 14992051 15477348 15947666 16411063 16861406 17317438 17739224 18127418
8321 18127418 18494953 18842460 19158063 19424367 19638919 19821814 19946327 20022954 20054371 20022548
8311 20022548 19942871 19828309 19655937 19443908 19187172 18887151 18552805 18173073 17767674 17357146
8301 17357146 16928624 16468747 15994050 15526091 15069874 14593636 14114949 13639766 13187147
8292 13187147 12747387 12317752 11886605 11478995 11075260 10683376 10297310 9933972 9579595
8283I579595l30857l26998l10228l11187k96568k71406k63102k41369k44161k47569
8273F736150k25581k04833j85760j90039k00393j85397j72835j75779j58500j47206
8263D889827j59318j44450j35408j29451j26812j13904j08277j16481j15841j00105
8253C639780r5453r6195q4672o9531q5448r4681q8726o5564p9539p7122p0192
8242B732657p1333p0689n8760m9433o0658n6902m9130n3926o0197n0257m7109
8231B104263m5490m8433k9794m1618m4078l4206k1889m0848m2844l0877l4899
8220A689287l4982l1668k8254k6903l3888l4405l4501k7159l0938k6628o511j1562
8208A361888k7094k2355l3905k8365M121j4904l1130r081p974k1826l0700j9991
$$ plain form
8283 9579595 9248738 8921740 8611512 8300325 8003757 7732351 7469249 7227880 6983719 6736150
8273 6736150 6510569 6305736 6119976 5929937 5729544 5544147 5371312 5195533 5037033 4889827
8263 4889827 4730509 4586059 4450651 4321200 4194388 4080484 3972207 3855726 3739885 3639780
8253 3639780 3544327 3448132 3363460 3293929 3208481 3113800 3025074 2959510 2879971 2802849 2732657
8242 2732657 2661324 2590635 2531875 2482442 2421784 2364882 2315752 2261826 2201629 2151372 2104263
8231 2104263 2058773 2010340 1980546 1938928 1894850 1860644 1838755 1797907 1755063 1724186 1689287
8220 1689287 1654305 1622637 1594383 1567480 1533592 1499187 1464686 1437527 1406589 1379961 1373450 1361888
8208 1361888 1334794 1312439 1278534 1250169 1254290 1239386 1208256 1199175 1191201 1169375 1138675 1118684
8196A118684k1276k0192O101j8381l1500k4085j3798j9259j9552j7986k77r180
8184I29299k1529m667n982k6008k5026n20q345j2040j0104k915j4809j1813o720
8171G78821j7453j4573k2767j3013O48j2195j1303j0225k135j9862j1687m73j3646
8158F30137j2823j1259j3376n261J852j2496j0130k169n582L370l281R286p567
8145E60701j4339q724j3538j2299l277J0961j1923k1913j0556J2051P300j3699
8133D80745l395r902k6780O857J1889o295l987l955j0678j6535j0352Q420R777
8120D25809k659j7953j7833q533k083M28M903J605K703J0202Q77k903j9692j3180
8106C61691j570R676k037k0537n852n431n096K158N952Q258k4j2209k1824K33
$$ plain form
8196 1118684 1097408 1077216 1083317 1064936 1033436 1009351 995553 976294 956742 938756 938479 929299
8184 929299 907770 903103 897121 871113 846087 845567 837222 825182 815078 812163 797354 785541 778821
8171 778821 761368 746795 724028 711015 711663 699468 688165 677940 675805 655943 644256 643783 630137
8158 630137 617314 606055 592679 587418 589270 576774 566644 564475 558893 562263 558982 568268 560701
8145 560701 546362 537638 524100 511801 508524 519485 507562 485649 475093 487144 494444 480745
8133 480745 477350 467448 440668 447525 459414 453119 449132 445177 434499 417964 407612 416032 425809
8120 425809 423150 405197 387364 378831 376748 377176 382079 383684 386387 396589 397466 394563 374871 361691
8106 361691 360121 369797 367760 347223 341371 335940 330844 333002 338954 347212 347188 334979 313155 313388
8092C13388J15L981o134J159R95J362O390Q72l229j109j1109n633r593k1122o341
8077B63992J0903K715J3823L782K884j2410o914l154K56k177Q078p400q752L643
8063B69269r718r532K12Q606l438J936K117J3573o636j2595L361M447P31j1499
8049B50834j4139j4861o868L082o103J097Q803K089l036j835j0139k299n950j0283
8035A90392N31n650M250J5637J297R680j73k2171o645n721M331K1141o902j407
8021A98590n815l506Q35J2427j467n867k436j5104p171k225k749o648q388J2680
8007A63156J2363J3090M866j6930j7548J2035J2437q714r189J3644L302j4083
7995A68429K0p45k274O66M845j4854j4322J0529Q538j9259p601J7774L950r081
$$ plain form
8092 313388 313503 317484 311350 312509 313504 314866 321256 322128 318899 317790 306681 301048 291455 270333 263992
8077 263992 274895 277610 291433 295215 298099 285689 278775 275621 275877 273700 281778 274378 265626 269269
8063 269269 259551 250019 250231 258837 255399 257335 259452 273025 266389 253794 257155 261602 262333 250834
8049 250834 236695 221834 214966 218048 211945 213042 221845 223934 220898 219063 208924 206625 200675 190392
8035 190392 190923 185273 189523 205160 206457 216137 215964 193793 187148 181427 185758 206899 199997 198590
8021 198590 192775 189269 190104 202531 201064 195197 192761 177657 170486 168261 165512 158864 150476 163156
8007 163156 175519 188609 193475 176545 158997 171032 183469 174755 165566 179210 182512 168429
7995 168429 168449 167704 165430 166096 170941 156087 141765 152294 160832 141573 133972 151746 155696 146615
7981A46615J7207P190j1881j5227O882P083j1361p925m558J7787J7163j4242j9160
7968A35573N993J0523l707r994O208j2611j2396O93m651o881N513L914Q504N367
7954A32048o152p720k184q39J586N97M552O612j4151J511J3178J332n649n713
7940A19008N508N017r905m573N728J3119j0844k3289j084P263R70j42J3213J362
7926A21351R842n122R893J4204J022j2057m008j5177j1290j1911m905R261l08
7913A00795J187j0998j838O173j278N731j1545j714J4465R963l279L739j7418
7900I3983r874O637J2471k417m431J2961L986M015j348q599j653Q560M141r470
7886A08962m578J7718J593l994o048P590M607j1894j3979j8385n088N312n694
$$ plain form
7981 146615 163822 171012 159131 143904 150786 157869 146508 138583 134025 151812 168975 154733 135573
7968 135573 141566 152089 148382 138388 144596 131985 119589 120282 115631 108750 114263 118177 126681 132048
7954 132048 125896 118176 115992 115153 116739 117336 121888 128500 114349 115860 129038 130370 124721 119008
7940 119008 124516 129533 119628 115055 120783 133902 123058 99769 98685 105948 106918 106776 119989 121351
7926 121351 131193 126071 135964 150168 151190 139133 135125 119948 108658 96747 91842 101103 100795
7913 100795 101982 90984 89146 95319 94041 99772 88227 86513 100978 110941 107662 111401 93983
7900 93983 84109 90746 103217 100800 96369 109330 113316 117331 115983 107384 105731 114291 118432 108962
7886 108962 104384 122102 123695 119701 113653 121243 125850 113956 99977 81592 76504 81816 76122
7873G6122q733j1713N522J1353J259j0392o058L98K940m92J0331p760l896J1997
7859G0878J2408l055N009J0772l766q224o869J803N572K246j877o435l86J966
7845H0042j0511N101j902l384q668j0820K1340P912O137j1697l696l364m098N643
7831F8035J0980k743k917M3L273R734K60L430p535m910R954o272k751r596j154
7816F7831o632j814P166K598P096J0444r060k777j2643p362m377j2512k04J2648
7802E0402k675q334J096O235M692j4493J927R574J0899K068P570J3118j3093j7988
7788E0998j1086L346K635J094j894L202J738M145p58l366q227Q971J4961j3021
7774E2738j8765N807k883N769P495L363O990n76P651Q464J2390j2346l627q094
$$ plain form
7873 76122 67389 55676 61198 72551 73810 63418 57360 57758 60698 60206 70537 62777 58881 70878
7859 70878 83286 80231 85240 96012 92246 84022 77153 78956 84528 86774 84897 78462 78076 80042
7845 80042 69531 74632 72730 69346 60678 49858 71198 79110 85247 73550 69854 66490 62392 68035
7831 68035 79015 76272 73355 73398 76671 86405 86665 90095 82560 77650 87604 81332 78581 68985 67831
7816 67831 61199 59385 66551 69149 76245 86689 77629 74852 62209 54847 50470 37958 37754 50402
7802 50402 47727 39393 40489 46724 51416 36923 38850 48424 59323 61391 68961 82079 68986 50998
7788 50998 39912 43258 45893 46987 45093 48295 50033 54178 53420 50054 41827 50798 65759 52738
7774 52738 33973 39780 36897 42666 50161 53524 60514 59938 67589 76053 88443 76097 72470 64376
7760F4376j0631o216l611P899l05j654j0880l507q713o919R079J663O267j1336
7746B5512l964k593P497k439N5N259O063j431l816J286O046m203R775Q27J461
7731D5335J1518k203K829J680j1016k424j5075r431O526R747k9Q999k658j5849
7717B7949q171P42L224J5733O904N078L901q663L282m164j1531N80N647j0395
7703C0116P044n59m975M645M176k317J72j0949p467r338n290N024J841P644J5143
7688C4910R474Q205j088j8704n226J096o556Q217J1132L843r705p424n851n3j1263
7673A1007L733K247m859J704J517l138j0478K690K252J4363J1286M802j757K108
7659C7477L428m738k955M138Q874N626n600k2615j4183J2854J4738K250q066m214
$$ plain form
7760 64376 53745 47529 43918 51817 51512 49858 38978 35471 26758 19839 28918 30581 36848 25512
7746 25512 21548 18955 26452 24013 24068 29327 35390 33959 30143 31429 37475 33272 43047 43874 45335
7731 45335 56853 54650 57479 59159 48143 45719 30644 21213 27739 37486 37457 46456 43798 27949
7717 27949 19778 20520 23744 39477 46381 51459 55360 46697 49979 45815 34284 34864 40511 30116
7703 30116 37160 36601 31626 36271 40447 38130 38302 27353 19886 10548 5258 10282 12123 19767 34910
7688 34910 44384 52589 51501 32797 27571 28667 22111 30328 41460 45303 35598 28174 22323 22270 11007
7673 11007 14740 16987 12128 13832 15349 12211 1733 4423 6675 21038 32324 37126 35369 37477
7659 37477 40905 36167 33212 37350 46224 51850 46250 23635 9452 22306 37044 39294 31228 27014
7645B7014kj1607L42Q931l174L60R355J8613n036j4940o735L783j063j5186J4814
7630B5469J8756m049o626o404J23J9634l932q891n166j1253k583J8769J0268k120
7616D1995n958m092O08o834j3020L624N332K806L414q650L255l725L390p327l104
7601A1714j865k065l241K46n897J0823L466j35R3p03J7602O41p713n550j0531
7586F885q099K384J8452J0890j5429J119J746p634K197j300J349J0618k188n185
7572A5805J1782k498N570o114n63J88P56l663J2241L81q565M04j408O571K527
7557C3414o47j9550p494N30l66J2053K404k683p897L364Q291R5k096o939j6115
7542c636n95R871J1117R371K825r776N361m3j0218k0489M061N607j031L266K265
$$ plain form
7645 27014 27012 15405 15747 24678 21504 21864 31219 49832 44796 29856 23121 26904 25841 10655 25469
7630 25469 44225 40176 33550 27146 27269 46903 42971 34080 28914 17661 15078 33847 44115 41995
7616 41995 36037 31945 32553 25719 12699 16323 21655 24461 27875 19225 22480 18755 22145 14818 11714
7601 11714 9849 7784 4543 4789 -1108 9715 13181 13046 13139 12436 30038 30679 22966 17416 6885
7586 6885 -1214 1170 19622 30512 15083 16202 17948 10314 12511 11211 12560 23178 20990 15805
7572 15805 27587 25089 30659 24545 23982 24170 24926 21263 33504 33885 25320 25724 24316 30887 33414
7557 33414 32767 13217 5723 6253 5887 17940 20344 17661 9764 13128 21419 21514 19418 12479 -3636
7542 -3636 -4231 5640 16757 26128 28953 19177 24538 24495 14277 -6212 -2151 3456 2425 5691 7956
7527G956j2469q82N898N388Q413k602l314K464J5289n026l379l17R139O366J1474
7512D4398k669n65p417J1909J50j7999j4964M7J2037l816n452N571n963j685n80
7497A3002l133n949N9L953k801N953J4406L789p336k892n758O929M099N645P707
7482C7673l443j1076j6147l411N78P931O10k341p091m533r205O645J2274J2222
7468B0686J7798r050q087j6782N749P96M973O632J5403l091j3366o670r070n256
7454F65J4530O027J037J1141N606o965M437k133j0448k092p971M803J1365L611
7440C3613j9311m257J3710K774j2274o163q87N877Q541p95p975j7348Q185J8211
7426B1901K114O479m011j7533J0242J4055J7112q458j3023k392n515J2R473J7078
$$ plain form
7527 7956 -4513 -5395 503 5891 14304 11702 8388 10852 26141 21115 17736 17419 26558 32924 44398
7512 44398 41729 41164 33747 45656 45806 27807 12843 12890 24927 21111 15659 21230 15267 13582 13002
7497 13002 9869 3920 3979 7932 5131 11084 25490 29279 21943 19051 13293 20222 24321 29966 37673
7482 37673 34230 23154 7007 3596 4174 12105 12715 10374 3283 -1250 -10455 -3810 8464 20686
7468 20686 38484 29434 21347 4565 10314 11110 16083 22715 38118 35027 21661 14991 5921 665
7454 665 15195 21222 22259 33400 39006 32041 36478 34345 23897 21805 13834 18637 30002 33613
7440 33613 14302 10045 23755 26529 14255 8092 7205 13082 21623 20828 12853 -4495 3690 21901
7426 21901 24015 30494 26483 8950 19192 33247 50359 41901 28878 26486 20971 20983 30456 47534
7412D7534j7187k9000N386J1709P862m14r488j2554j0250j513J2253M91N9k630
7398B258J6442R359k855J4799n550n33q687N379M059p679n590l557o524K079q833
7383D567j4288R158R591K223j432J0614L118j489r190K26k004k309n500j349L858
7368E794O407J0101j3349p182l729m684l408N924J8336P358J139j4274P170R063
7354B4666j0939L938J961p730J727P000n722n955J6286k917k0223K011J4506J4730
7340C3339K921j8810j949J0145n824M643o356j4403O958J6002r952j3985J2602
7327A5331P863k1505j1854l325K887J1463N959p729J1190p879o842n467o510Q031
7313h387J3469N835Q813q58j2678j0145J5766J2300j465k2825m698Q50o853P622
$$ plain form
7412 47534 30347 1347 6733 18442 26304 25890 16402 3848 -6402 -7915 4338 4829 4888 2258
7398 2258 18700 28059 25204 40003 34453 33920 25233 30612 34671 26992 21402 17845 11321 13400 4567
7383 4567 -9721 -563 9028 11251 9819 20433 23551 22062 12872 13098 11094 8785 3285 1936 5794
7368 5794 12201 22302 8953 1771 -1958 -6642 -10050 -4126 14210 21568 22707 8433 15603 24666
7354 24666 13727 17665 19626 11896 13623 20623 14901 8946 25232 22315 2092 4103 18609 33339
7340 33339 36260 17450 15501 25646 19822 24465 18109 3706 10664 26666 16714 2729 15331
7327 15331 23194 1689 -10165 -13490 -10603 860 6819 -910 10280 2401 -4441 -9908 -16418 -8387
7313 -8387 5082 10917 19730 18872 6194 -3951 11815 24115 22650 -175 -4873 -4023 -10876 -3254
7299c254l121R591J1222j0207J162J8933R14J118o941j1283P850n278q750n906
7285c950j486n789q864M251J3266J7248m695j307J0784J260K007q008l007J0812
7271B2522r296O228J757k0326k626P845l963m557L049j68J2326k671r214p577
7257f671J3380Q210K210M174n079j1617K019K548j0408l806P695O225L184N774
7243A7838m850K699K148l802o011m054j1776j649N725r596P581J2299Q491k616
7229A2427l122K755p881j0602Q947J091O63m881K190J0808J259o572R99o09j2695
7214e223m611R136J5544L222J995l139j4294P212l260r014k166J622r915j1072
7200b3963M175J4265J1676m311P981J5487p519n888j1380O523O901K745j25n868
$$ plain form
7299 -3254 -6375 3216 14438 4231 5393 24326 25240 26358 19417 8134 15984 10706 1956 -3950
7285 -3950 -5436 -11225 -20089 -15838 -2572 14676 9981 8674 19458 20718 22725 14717 11710 22522
7271 22522 13226 19454 21211 885 -1741 6104 2141 -2416 633 465 12791 10120 906 -6671
7257 -6671 6709 14919 17129 21303 16224 4607 6626 9174 -1234 -5040 2655 8880 12064 17838
7243 17838 12988 15687 17835 14033 8022 3968 -7808 -9457 -3732 -13328 -5747 6552 15043 12427
7229 12427 9305 12060 4179 -6423 2524 3615 4278 -603 1587 12395 13654 7082 8081 7472 -5223
7214 -5223 -9834 -698 14846 18068 20063 16924 2630 9842 6582 -2432 -4598 -2976 -12891 -23963
7200 -23963 -19788 -5523 6153 1842 9823 25310 17791 11903 523 7046 13947 16692 16567 10699
7186A0699l115K297l66j1047R404O400j300j3562N89j853n851J267Q251n94K987
7171D206n729J4476J7623L203n605n898p621j680M856K0868M651j6067j7229l436
7157F618L350J0003Q248R29p082k769J289K587j0251k142j360j2222n09J0208
7143F897N600N052p135j979O129r407n775m049O621K908k870j847P413l527j0345
7128f314J393P495k525J32l905o351R209P535J0845K985j2165o652l257m13j563
7113c551r805K1030J2675j705n871p459j0711n772m974M61J285q266j02J0156
7099a2609J8766P563R44K666m560n073P110q100J762n688K621l938R39L961l068
7084C296M842J7381l540j5963p035Q388K208R47m766j301j2297M972J8999n423
$$ plain form
7186 10699 7584 9881 9515 -1532 7872 14272 12972 -590 -1 -1854 -7705 -6438 1813 1219 4206
7171 4206 -1523 12953 30576 33779 28174 22276 14655 12975 17831 38699 43350 27283 10054 6618
7157 6618 9968 19971 28219 29148 22066 19297 20586 23173 12922 10780 9420 -2802 -3311 6897
7143 6897 12497 17549 10414 8435 14564 5157 -618 -4667 1954 4862 1992 145 7558 4031 -6314
7128 -6314 -4921 2574 49 181 -3724 -10075 -866 6669 17514 20499 8334 1682 -1575 -1988 -3551
7113 -3551 -13356 7674 20349 18644 12773 5314 -5397 -11169 -16143 -15682 -14397 -22663 -22765 -12609
7099 -12609 6157 13720 14664 17330 12770 7697 14807 6707 8469 2781 5402 1464 2403 6364 3296
7084 3296 8138 25519 21979 6016 -1019 7369 9577 10524 5758 4457 -7840 -2868 16131 10708
7070A0708l470k99p033Q725K457n837o347r102p81j483j153l195K0340J1830j879
7055A3481o534j2232l022J7734J051j1463p491p266N188l348J9546J519J110N560
7041A3833p720j6952j4718o165J2342J2869O585K231j4199j3274j40J0831Q989
7028e488j1728L678M139k856N968Q513m386Q175J5127j1635N619r577p564O022
7014D007R049j3009j4673J0552O527L196L244q308l64L586J0604P476o817j3829
7000A241l573M657J868N75N165j7808m785J3586L86j0534o311K5205Q78m093m948
6985A509j259m969J2149O85q043J019k006k884L312R555o169p015n847J0763J6816
6970A7616l534j019m53J16J0683j8217q007l519J2615J24m187N063J052j0369
$$ plain form
7070 10708 7238 6939 -94 8631 11088 5251 -1096 -10198 -10979 -12462 -13615 -16810 3530 15360 13481
7055 13481 6947 -5285 -8307 9427 10478 -985 -8476 -15742 -10554 -13902 5644 7163 8273 13833
7041 13833 6113 -10839 -25557 -31722 -19380 -6511 74 2305 -11894 -25168 -25308 -14477 -5488
7028 -5488 -17216 -13538 -9399 -12255 -6287 2226 -2160 6015 21142 9507 15126 5549 -2015 4007
7014 4007 13056 47 -14626 -4074 2453 5649 8893 585 221 3807 14411 21887 15070 1241
7000 1241 -2332 2325 4193 4768 9933 -7875 -12660 926 1312 -9222 -15533 9672 10550 6457 1509
6985 1509 250 -4719 7430 8115 72 1091 -915 -3799 -487 9068 2899 -4116 -9963 800 17616
6970 17616 14082 13063 12610 12726 23409 5192 -2815 -6334 6281 6405 2218 7281 8333 -2036
6956b036K282J2334k838j5575l496p271P786J3044M858o291O47J0560m267m630
6942E107K322M036J5753O118l689j0279k3645j3435R666N337O679l660o859j1874
6928a8423n440J6138O366Q071k256k157R936Q973o660m883j0497j4509q571J0721
6914a3191P459M841J3243Q895r677j0134j4255r9m349P859R916O969Q611J621
6900A7709k523N399J887j693q999m210o646l552N152j376Q21N472L667j3353O553
6885D308K807k485M500J9480J266j637j3930j5031J835R754j1110n118J622O390
6871B651L74N871l82l344o652j7898j4242p13J8580k518r136K37J0680J2678J2800
6856H986R396j0294j1131k0494j0858J2708J2743O867k702m30J2696p457J208
$$ plain form
6956 -2036 246 12580 9742 -5833 -9329 -16600 -8814 4230 9088 2797 3444 14004 9737 5107
6942 5107 7429 11465 27218 33336 29647 19368 -4277 -17712 -8046 -2709 3970 310 -6549 -18423
6928 -18423 -23863 -7725 -1359 6712 4456 2299 12235 21208 14548 9665 -832 -15341 -23912 -13191
6914 -13191 -5732 -891 12352 21247 11570 1436 -12819 -12918 -17267 -9408 508 7477 16088 17709
6900 17709 15186 20585 22472 20779 11780 7570 924 -2628 2524 1148 1969 7441 11108 -2245 4308
6885 4308 7115 4630 9130 28610 29876 28239 14309 -722 1113 10867 -243 -5361 -3739 2651
6871 2651 3025 8896 8514 5170 -1482 -19380 -33622 -34335 -15755 -18273 -27409 -27172 -16492 -3814 8986
6856 8986 18382 8088 -3043 -23537 -34395 -21687 -8944 -2077 -4779 -5209 7487 30 1238
6843A238P785j5548j4279l472L234L822J5029K434l656J569j0713j7361J0956
6830a8962J7678M28O828o286R230L418j1653J2969k389K178j2012j4998l194J0793
6816e972K147j0018M288J2042P708R695L220p496j2393J370o443r941l364J0481
6802d676N05J1814o850L630R529m265q171O853j1884K482L349N30q305q153J0594
6787c018J823j0526o859J724K0658O979j1934n207R526p362J63p97Q989J909n244
6772H24J1988n510j5604J468j318M239L272Q58L768o445K064p021O003k855j134
6757e403p314O431J9629Q24q251n880J1068K388j278j849q271k0414j5375K0569
6743a3126J0269r81M710M469k937r783l039J8954J5330o854j439n703R484R992
$$ plain form
6843 1238 9023 -6525 -20804 -24276 -21042 -17220 -2191 243 -3413 -1844 -12557 -29918 -18962
6830 -18962 -1284 -856 5972 -314 8916 12334 681 13650 11261 13439 1427 -13571 -16765 -5972
6816 -5972 -3825 -13843 -9555 2487 10195 19890 23110 15614 3221 4591 -1852 -11793 -15157 -4676
6802 -4676 -4171 7643 793 4423 13952 9687 1516 8369 -3515 -1033 2316 2846 -5459 -13612 -3018
6787 -3018 -1195 -11721 -18580 -16856 3802 10781 -1153 -6360 3166 -4196 -4033 -4830 4159 6068 824
6772 824 12812 7302 -8302 -6834 -8152 -3913 -641 217 3985 -2460 -396 -7417 -1414 -4269 -5403
6757 -5403 -12717 -6286 13343 14167 5916 36 11104 13492 12214 10365 2094 -18320 -33695 -13126
6743 -13126 -2857 -3838 872 5341 2404 -7379 -10418 8536 23866 17012 15573 9870 19354 29346
6729B9346j4080j5996M475Q082k135k060m767J465N133l845o928j4241M497N135
6715e919P214j3069r911J3179p689N80k754J516J2537J2616R344J5171R491p068
6701C5238j3488r670k607N920m779l564q394j5705r463K1782J3012K404q54j530
6687H302R892j2356p783N978q03k19J3425N104n904j5626q884J5346L803p641
6673B634M19J271K673J7191M527p983L400o244p044j0117j1643p499L720n636
6659b0331r7Q511J4730O102o8K886J4542R043j4578j5090P597p834M781n610m139
6644D45p175Q740p465Q12J478M125K237J2504O026j3514k5077r788O581J4069
6630f002R163n688o022R624J6719o284o128j6462j1618L867K753Q722m886o377
$$ plain form
6729 29346 15266 -730 3745 11827 9692 7632 2865 4330 9463 5618 -1310 -15551 -11054 -5919
6715 -5919 1295 -11774 -21685 -8506 -16195 -15615 -18369 -16853 -4316 8300 17644 32815 42306 35238
6701 35238 21750 12080 9473 15393 10614 7050 -1344 -17049 -26512 -4730 8282 10686 9832 8302
6687 8302 18194 5838 -1945 4033 3230 3011 16436 21540 15636 10 -8874 6472 10275 2634
6673 2634 3053 4324 6997 24188 28715 20732 24132 17888 10844 727 -10916 -18415 -14695 -20331
6659 -20331 -20428 -11917 2813 8915 8847 11733 26275 35318 20740 5650 13247 5413 10194 4584 445
6644 445 -6730 2010 -5455 -4643 -3165 960 3197 15701 21727 8213 -16864 -26652 -20071 -6002
6630 -6002 3161 -2527 -8549 1075 17794 11510 5382 -11080 -22698 -18831 -16078 -7356 -12242 -18619
6616a8619p244m17L989O925J2721n879p612r603O422R075Q357R07m132o676m785
6601a6571J295j720N90n943Q26p92O964P827k199j1107p561O057J3850J5355N277
6586A2148m150j892q975P12q024M91m359k314Q847O184j0814J444P693J792j2495
6571a3712m375K501J5313j319j4451l417R097M727n04L475L056p754K6J8245j025
6556I883l390r804J04P092N227q832j6074J345J2147l211K521J159o284L286J7088
6541A2257J1734J792j8758k2007p275Q09K110J473K960J4666J1209L24j0822k2661
6527b2189j009J483l24Q370J934Q806j375M61j1684o579R858P748L919N018m611
6512a74j3020n330J1970j0654j7062j406R215J1513j939J1465J4367j530p198
$$ plain form
6616 -18619 -25863 -26280 -22291 -15366 -2645 -8524 -16136 -25739 -19317 -10242 -1885 -978 -5110 -11786 -16571
6601 -16571 -15276 -16996 -16406 -22349 -21523 -22315 -15351 -7524 -9723 -20830 -28391 -22334 -8484 6871 12148
6586 12148 7998 6106 -2869 -2157 -10181 -9690 -14049 -16363 -7516 -1332 -12146 -10702 -3009 -1217 -13712
6571 -13712 -18087 -15586 -273 -1592 -16043 -19460 -10363 -5636 -6140 -2665 391 -7363 -7337 10908 9883
6556 9883 6493 -3311 -3207 3885 9112 280 -15794 -14449 -2302 -5513 -2992 -1833 -8117 -4831 12257
6541 12257 23991 25783 7025 -14982 -22257 -21448 -19338 -17865 -14905 -239 10970 11294 472 -22189
6527 -22189 -23198 -21715 -22039 -13669 -11735 -2929 -4304 -3843 -15527 -22106 -12248 -4500 -581 4437 -174
6512 -174 -13194 -18524 -6554 -17208 -34270 -35676 -26461 -14948 -16887 -5422 8945 7415 217
6499B17R62M772j1026m772P671K869J59J774R844K059m654k181o448l931K513
6484a72Q881j1594o688n192K054R050O156q182N335O66P894k044j092m772o516
6469f216J032m24n496o319O286O503n668m637J54Q289Q795P197n08m870j6526
6454a2408r602l422P751P456L813L048l89P253j122l440p730Q160J4368o625j7920
6439a0809l421o355l559Q515J7777j4847n072J9583J210r275j848n72j048N824
6425c897K899j0695L099J1277p387j117J8914J2288L808L452k06j5262o303j2555
6411a685m207p35K966K2366l236L706m397k2788n697j65M508j7255l868J8349
6397a2138J1864N655l335j1300M901J8649J6278O55q067j1406j748R16L48q369
$$ plain form
6499 217 1179 5951 -5075 -9847 -2176 693 852 2626 12470 14529 9875 7694 1246 -2685 -172
6484 -172 8709 -2885 -9573 -14765 -12711 -3661 2495 -5687 -352 314 8208 6164 5072 300 -6216
6469 -6216 -5184 -5608 -11104 -17423 -11137 -4634 -10302 -14939 -14785 -6496 2299 9496 8988 4118 -12408
6454 -12408 -22010 -25432 -17681 -10225 -6412 -3364 -3753 3500 2378 -1062 -8792 -632 13736 7111 -10809
6439 -10809 -14230 -20585 -24144 -15629 2148 -12699 -17771 1812 3022 -6253 -8101 -8673 -9721 -3897
6425 -3897 -998 -11693 -8594 2683 -4704 -5821 13093 25381 29189 32641 32435 17173 10870 -1685
6411 -1685 -5892 -6627 -3661 18705 15469 19175 14778 -8010 -13707 -13872 -9364 -26619 -30487 -12138
6397 -12138 -274 5381 2046 -9254 -4353 14296 30574 31229 23162 11756 10008 10924 11272 2903
6383B903j3866J1342J4249n121k2841j3857N313J3197J0858J46j0428J800K130
6370d175m262j6794j0089K621J7713J2917j0157J0975J5596m65k0308p854Q820
6357e462j3252j54L529q314q565k107J3516J8580p53l828n381k493O905J0110
6343B331P692j1248j23O959J386J9074q054J280p307o253K774j1179n431l2l653
6328a1784m235L615J341n205J0936J2725l946r511J5782j1958j2164j78k138l871
6314b0591J1189Q724l301n127J305K826r633O976Q551M358J462n022j1959n061
6300a5303J4769K044k059n099k173J40p271N391r918R609M014p693l24K4R1J9208
6284E450J069r187j508n783k350k200p160M058M88j978j3035j1729l963O579J7002
$$ plain form
6383 2903 -10963 379 14628 9507 -13334 -27191 -21878 -8681 2177 2323 -8105 -6305 -4175
6370 -4175 -8437 -25231 -35320 -32699 -14986 -2069 -12226 -1251 14345 13880 -6428 -14282 -5462
6357 -5462 -18714 -18868 -15339 -23653 -32218 -34325 -20809 -2229 -2982 -6810 -12191 -14684 -7779 2331
6343 2331 10023 -1225 -1348 5611 6997 26071 18017 19297 11990 5737 8511 -2668 -8099 -8131 -11784
6328 -11784 -16019 -12404 -11063 -16268 -5332 7393 3447 -6064 9718 -2240 -14404 -14582 -16720 -20591
6314 -20591 -9402 -678 -3979 -9106 -7801 -4975 -14608 -7632 919 5277 6739 1717 -10242 -15303
6300 -15303 -534 1510 -549 -5648 -7821 -7681 -14952 -9561 -19479 -9870 -5856 -13549 -13873 -13849 -13758 5450
6284 5450 6519 -2668 -4176 -9959 -12309 -14509 -21669 -17611 -17123 -19101 -32136 -43865 -47828 -41249 -24247
6269b4247J4182J936p671P66L471p298r06Q425J1813J4104j4865r124J610L764
6255d040M927K042M338o501o864l69j111M199j792m046O137K403O855Q111m799
6240I490K656N593R959k712j2846j9804r459P650j183R380J642O40Q865j218r593
6225i40j2129O020K236J752K009J5065N442l577O616n240j102q010j2372j1828
6211a6058L977m815l306N863P241k066L110r848j352N536J2620Q768k156o806
6197G08N356m433n547n339j355j836M85p9J2566P13p801r147L044M648M211Q636
6181D830Q520r414L18J2018j2049j7008m134o629m228M665k309k460p508J2288
6167b3100J274K084L748M641o33n736P478J010l666p916J2804P395M548l512J1446
$$ plain form
6269 -24247 -10065 -8129 -15800 -15034 -11563 -18861 -19767 -11342 471 14575 -290 -9414 -7804 -4040
6255 -4040 887 2929 7267 766 -6098 -6467 -7578 -3379 -5171 -9217 -3080 -677 6178 14289 9490
6240 9490 12146 17739 27698 24986 12140 -7664 -17123 -9473 -10656 -1276 366 1006 9871 8653 -940
6225 -940 -13069 -7049 -4813 -3061 -1052 14013 19455 15878 22494 17254 16152 8142 -4230 -16058
6211 -16058 -12081 -16896 -20202 -14339 -7098 -9164 -6054 -15902 -17254 -11718 902 9670 7514 708
6197 708 6064 1631 -3916 -9255 -10610 -12446 -11961 -12040 526 1239 -6562 -15709 -12665 -8017 -3806 4830
6181 4830 13350 3936 4254 16272 4223 -12785 -16919 -23548 -27776 -23111 -25420 -27880 -35388 -23100
6167 -23100 -21826 -19742 -15994 -11353 -11986 -17722 -10244 -9234 -12900 -20816 -8012 -617 3931 419 11865
6152A1865N74P846Q703j3238l267J1287q845p220M047j1701j4529P993L21P948
6138A784N120j916o718J95K326l077l630K640L894o003M002J860K798M138o522
6123H91K109J2187k105m718N327Q080l779j8048j4376L705o25K872o614n610q003
6108b8707Q220K690j4079M364K79N533J0576k759m75q527q190R633n570O887R973
6093a0152n90j1342N314J6077L230j634r306l600j2771L176q002R643k889N612
6079a7234K0290n700K0881O629L83N189J930j3230j4711l404m364p032l047M335
6065i085l848O514N33n975R817J5243K283J814L417m210j5541K73Nn033L041K130
6049A378Q12m324O013L621J675k568J852N93J421N68j9757qP015j1539J517n698
$$ plain form
6152 11865 12439 20285 28988 15750 12483 23770 14925 7705 11752 51 -14478 -6485 -6164 1784
6138 1784 6904 4988 -1730 -1535 791 -2286 -5916 -3276 618 -5385 -1383 477 3275 7413 891
6123 891 3000 15187 13082 8364 13691 21771 17992 -56 -14432 -10727 -11352 -8480 -15094 -20704 -28707
6108 -28707 -20487 -17797 -31876 -27512 -27233 -21700 -11124 -13883 -14358 -22885 -31075 -21442 -27012 -20125 -10152
6093 -10152 -10742 -22084 -16770 -693 2537 903 -8403 -12003 -24774 -21598 -29600 -19957 -22846 -17234
6079 -17234 3056 -2644 18237 24866 25249 30438 32368 19138 4427 1023 -3341 -10373 -13420 -9085
6065 -9085 -12933 -6419 -5886 -11861 -2044 13199 15482 17296 20713 16503 962 1235 1240 -3793 -752 1378
6049 1378 2190 -2134 3879 7500 9175 6607 8459 9052 10473 11041 -8716 -8724 -1709 -13248 -11731 -17429
6033a7429j1419R802J9954M903k481q584M440K146r451N198O158R402p280o607
6019a248j1222N333P863L097p349j255J10j1274n763J4561n058j6715R607J9312
6005aL298q486m75l273j3306p15J1045J0612J0455J7788O074j6079j9168N112
5991B881J888J4074k409j4077j129n618J4499J2641k24j3359n914J702m151P420
5977H224N223n912J3059l018K188k464n279j6250k047J1917k159m994J096J1068
5963A0652m016J447j4910q560P295j4923L898P223P950Q262M915q749j4275k632
5949a6423J079j351k685q329m93K610J1518m888j1068R107R72p295K590P125J2404
5934e127N263J0810J238j0757j1093q538N512J7313J1338j65p751J3980o775j5138
$$ plain form
6033 -17429 -28848 -19046 908 5811 3330 -5254 -814 1332 -8119 -2921 3237 12639 5359 -1248
6019 -1248 -12470 -7137 726 3823 -3526 -4781 -4671 -15945 -21708 -7147 -12205 -28920 -19313 -1
6005 -1 3297 -5189 -5664 -8937 -22243 -22958 -11913 -1301 9154 26942 33016 16937 -2231 2881
5991 2881 4769 18843 16434 2357 1228 -4390 10109 22750 22526 9167 3253 4955 804 8224
5977 8224 13447 7535 20594 17576 19764 17300 12021 -4229 -6276 5641 3482 -1512 -416 10652
5963 10652 6636 8083 -6827 -15387 -8092 -23015 -19117 -11894 -3944 4318 9233 484 -13791 -16423
5949 -16423 -15344 -16695 -19380 -27709 -28202 -25592 -14074 -18962 -30030 -20923 -19951 -27246 -24656 -17531 -5127
5934 -5127 136 10946 12184 1427 -9666 -18204 -12692 4621 15959 15794 8043 22023 15248 110
5920A10o723n056j513n452P36J6776J5125k513J831k0965p572R497M629M348K021
5905E279n61p12r967M564J6836k649O374k595o437q518l570J2883K455K118j539
5890A3961j6855j5464m904Q583J8515J2212J807j0421j4888l413M469J274P226
5877B102K360o398n282k840m16m770N879K0156n268o962k106M621o670k822M914
5862c502r412Q486J2542k526J619n40J340n073r073o595j920J5843K138n033P221
5847E515q148P69n340p634J8076J5704m468r317j2901J639n669J1208M684m801
5833f83k825j4144J0975L887p878k311R875O923J3468o65n942j610K644j4846
5819c132k450O064L799L0559n43o327p928j9352o969K7J284L167L622j0673j551
$$ plain form
5920 110 -6613 -11669 -13182 -18634 -17898 -1122 14003 11490 13321 -7644 -15216 -5719 -1090 3258 5279
5905 5279 4718 4006 -5961 -1397 15439 12790 19164 16569 10132 1614 -1956 10927 13382 15500 13961
5890 13961 -2894 -18358 -23262 -14679 3836 16048 17855 7434 -7454 -10867 -6398 -5124 2102
5877 2102 4462 -1936 -7218 -10058 -10474 -15244 -9365 10791 5523 -1439 -3545 1076 -5594 -8416 -3502
5862 -3502 -12914 -4428 8114 5588 7207 6667 8007 2934 -6139 -12734 -14654 1189 3327 -1706 5515
5847 5515 -2633 -1864 -7204 -14838 3238 18942 14474 5157 -7744 -6105 -11774 -566 4118 -683
5833 -683 -3508 -17652 -6677 -2790 -10668 -12979 -3104 3819 17287 16622 10680 9070 11714 -3132
5819 -3132 -5582 482 4281 34840 34297 27970 20042 690 -6279 -6252 -4968 -1801 1821 -8852 -10403
5804a0403l296j3130P759K3922L414j0363n880j472M223J1578M887M590n659j5446
5790e276o460M988J6548L321l014j463l802j5371O486M869j6108j8157J795J1467
5776b0177j131j2855R309J4450J1291K746j4110n241J2905K2265k397k4865j2762
5763b0572q22O401k434J0732J4728O709p14J4161l576j0204o623o088N10p654
5749e446m751o354l790P66K629P707o189q766J2378L632J4235k250k849q021j4921
5734b1990j068J0194R711o793p28J112L458m880j409m988J609J3274j391j6928
5720b0817q85O425J5970J0388J0349K962o736j3096l883j6196J703N479R422O020
5706G105j0384M914M463J467p968m843n463Q590l039Q866L801r242p815J3798
$$ plain form
5804 -10403 -13699 -26829 -19070 4852 8266 -2097 -7977 -9449 -5226 6352 11239 15829 10170 -5276
5790 -5276 -11736 -6748 9800 13121 10107 8644 4842 -10529 -4043 826 -15282 -33439 -31644 -20177
5776 -20177 -21308 -34163 -24854 -10404 887 3633 -10477 -15718 -2813 19452 17055 -7810 -20572
5763 -20572 -21394 -14993 -17427 -6695 8033 14742 14028 28189 24613 14409 7786 1698 2208 -5446
5749 -5446 -10197 -16551 -20341 -19575 -16946 -9239 -15428 -24194 -11816 -8184 6051 3801 952 -7069 -21990
5734 -21990 -23058 -12864 -3153 -9946 -10674 -9562 -6104 -10984 -12393 -17381 -15772 -2498 -3889 -20817
5720 -20817 -21702 -15277 693 11081 21430 24392 17656 4560 677 -15519 -13816 -8337 1085 7105
5706 7105 -3279 1635 6098 7565 -403 -5246 -10709 -2119 -5158 3708 7509 -1733 -9548 4250
5692D250o238L370k381j7120K665P617L414J0135o158o656J2075M983M460J511
5678A5927k0330R39k126j1255j1417M112m744P534J4657j780M846J7210L28O525
5664B0426n968q699O024m65m624L61L194L63m77j2799L665J388j697j0749l193
5649a3250J1084L886j1851o820k583N74j513M022L683Q849Q119L984j983j6817
5635a0616K954j0138R07O463p223j0144J4164M156p273k564N998K061Q834p998
5621a0419R306j514P57J0126m513j1062j2856P340J2098R573J516L083o714P253
5607A3974Q772q809j2327j6923j256o022k924J161N696M979k625R320k397P403
5593a978J637j0817q849r06R217N093j919K009K0968J0702j1107r301j4951J0261
$$ plain form
5692 4250 -1988 1382 -999 -18119 -15454 -7837 -4423 5712 -446 -7102 4973 9956 14416 15927
5678 15927 -4403 -3464 -5590 -16845 -28262 -24150 -28894 -21360 -6703 -8483 -3637 13573 13901 20426
5664 20426 14458 5759 11783 11318 6694 7055 10249 10612 10135 -2664 1001 2389 692 -10057 -13250
5649 -13250 -2166 1720 -10131 -16951 -19534 -18960 -20473 -16451 -12768 -3919 4200 8184 6201 -10616
5635 -10616 -7662 -17800 -16893 -10430 -17653 -27797 -13633 -9477 -16750 -19314 -13316 -11255 -2421 -10419
5621 -10419 -1113 -2627 -1870 8256 3743 -7319 -20175 -12835 -737 8836 10352 13435 6721 13974
5607 13974 22746 13937 1610 -15313 -16569 -22591 -25515 -24354 -18658 -13679 -16304 -6984 -9381 -1978
5593 -1978 -341 -11158 -20007 -20913 -11696 -6603 -8522 -6513 14455 25157 14050 4749 -10202 59
5579E9J3154L417L913q128k3665k3596l233P152K3278K0153n464k5640o079P216
5565a7463M002j22L738P160P321P530K911J589m949k068l923q352n132n72m306
5550a2636L85J795k91L146J73R714J133R179J1457q541r321n624j2579n688K926
5535a4772M450j01L897K116n839m512o146Q513R748j1450l742L459M12L799l161
5520a3329k326j598L558P897r25n728M850K337K754r08l687o38j986L835J574
5505d320r874k3896j229K3386J2810l678O111P385j1646M054j635M425j0883k828
5491a1818R018J7084O986J364j380k7584r163N389O771J297J4961P239P506l407
5477B4263j8932j4801K023M68K915K343l439M445o08Q331Q001j1373n550L147
$$ plain form
5579 59 13213 16630 20543 12415 -11250 -34846 -38079 -30927 -7649 12504 7040 -18600 -24679 -17463
5565 -17463 -13461 -13583 -9845 -2685 4636 12166 15077 16666 11717 9649 5726 -2626 -7758 -8330 -12636
5550 -12636 -12251 -10456 -10747 -7601 -7428 2286 3419 12598 24055 15514 6193 569 -12010 -17698 -14772
5535 -14772 -10322 -10423 -6526 -4410 -10249 -14761 -20907 -12394 -2646 -14096 -17838 -14379 -13967 -10168 -13329
5520 -13329 -15655 -17253 -13695 -5798 -6723 -12451 -7601 -5264 -2510 -3418 -7105 -7743 -9729 -5894 -4320
5505 -4320 -14194 -38090 -39319 -15933 -3123 -6801 -690 6695 -4951 -897 -2532 1893 -8990 -11818
5491 -11818 -2800 14284 21270 22634 21254 -6330 -15493 -10104 -3333 -2036 12925 20164 27670 24263
5477 24263 5331 -9470 -7447 -6979 -4064 -1721 -5160 -715 -1323 7008 15009 3636 -1914 1233
5463A233m087M79j768J2659o490o591q097n156J8833J3078K191m748K969J66n545
5448I126j2292j21k54o136K894P445J743K930j4054j148M373m658j4413R849N192
5433i524N440k991M951P024j4043j6654k451J0699k276N122L794j2605o353R83
5419b8884M992j933m938O216k966l004J1106O670J76J576Q096j830k648J0832
5405C461P534j326M790J364j2392k780K524J746r497k684J7244J0735j7593r828
5391f702N31J547n601J1646O167o86J3084J2010r488p707m734j157P189K984n911
5376A3172j0525l505j608l664o24k785m179K254N475M68P381J2283k873j1184
5362H6N603N771N355j435k0056j5085J647k102L151M17P039M053p74o435Q245
$$ plain form
5463 1233 -2854 -2375 -4143 8516 2026 -4565 -12662 -17818 1015 14093 16284 11536 14505 14671 9126
5448 9126 -3166 -3287 -3541 -9677 -6783 662 2405 5335 -8719 -9867 -5494 -10152 -24565 -14716 -9524
5433 -9524 -4084 -7075 -2124 4900 -9143 -25797 -28248 -17549 -19825 -14703 -10909 -23514 -29867 -28884
5419 -28884 -23892 -25825 -30763 -24547 -27513 -30517 -19411 -12741 -12565 -10989 -2893 -4723 -7371 3461
5405 3461 10995 9669 14459 15823 3431 651 3175 4921 -4576 -7260 9984 20719 3126 -6702
5391 -6702 -6171 -4624 -10225 1421 7588 6902 19986 31996 22508 14801 10067 8910 16099 19083 13172
5376 13172 2647 -858 -2466 -6130 -6754 -9539 -13718 -11464 -5989 -5521 1860 14143 11270 86
5362 86 5689 11460 16815 15380 -4676 -19761 -18114 -20216 -17065 -16648 -9609 -5556 -6330 -12765 -4520
5347d520R640J0750o01r328m251j4440p701M483Q383o369O202M186K552j6726
5333a7740o518L935O364N227P780K782k270J323j6202j6127K053J3888O776m813
5319a3542j955Q51k470K055L810L366R107J1773J5349J070j5190j9439j3532J892
5305a6855m981J0733j679O364r310j1299O912M284J1054j118Q70N235P906J2044
5291B0160j431k719n398N385J683O46j2189J4578J543l347L872j3993j6502l329
5277a1041J4958R04j5828j2257n175j728N331j127m245M399J532K088L170n945
5263b4964O427O050L522r314o749J0521J8892O8j0267n8l569n640J1326r275k301
5248a5331r90l671J198O840M239j746j327J094j662R575j383N924l996k016J4924
$$ plain form
5347 -4520 5120 15870 15269 5941 1690 -12750 -20451 -15968 -7585 -13954 -7752 -3566 -1014 -17740
5333 -17740 -24258 -20323 -13959 -8732 -952 1830 -440 883 -15319 -31446 -29393 -15505 -8729 -13542
5319 -13542 -15497 -14646 -17116 -15061 -11251 -7885 1222 12995 28344 29414 14224 -5215 -18747 -16855
5305 -16855 -21836 -11103 -12782 -6418 -15728 -27027 -20115 -15831 -4777 -5895 -5025 210 8116 20160
5291 20160 18729 16010 10612 15997 17680 18326 6137 20715 22258 18911 22783 8790 -7712 -11041
5277 -11041 3917 4821 -11007 -23264 -28439 -30167 -24836 -25963 -30208 -25809 -24277 -22189 -19019 -24964
5263 -24964 -18537 -12487 -8965 -18279 -25028 -14507 4385 4453 -5814 -5872 -9441 -15081 -3755 -13030 -15331
5248 -15331 -16321 -19992 -18794 -11954 -7715 -9461 -10788 -9694 -11356 -1781 -3164 2760 -1236 -3252 11672
5233A1672j2862o390P836q661o606O462%J5657P660j3852j0714r754N269J1111
5219c172j452j792m422L846k008j2463R555O077m127l274L807J1995L536M80J181
5204G767N844P846K254j0203q467P03r042Q928N295M092k145j845M545k416l98
5189A2758K0476J090j2609r063J215J218o19l035q742M232p794r232l6j414J532
5174a0023j190J442M153P263J235l407R91j926M581j319m321o94K381R186N657
5159A4009k606n194j1123q519j1723K878J7517O416l1l146O543n959l156j957
5145f051j3386k825j519R497m488m871Q419J2243R503j125M053o400L388j0812
5131d374j8485k128Q359J823Q87n330j0722j65J0763Q200O861l68Q511J818K89
$$ plain form
5233 11672 -1190 -7580 256 -8405 -15011 -8549 -8549 7108 14768 916 -9798 -19552 -14283 -3172
5219 -3172 -4624 -6416 -10838 -6992 -9000 -21463 -11908 -5831 -9958 -13232 -9425 2570 6106 6586 7767
5204 7767 13611 21457 23711 13508 5041 5744 -3298 5630 10925 15017 12872 11027 15572 13156 12758
5189 12758 33234 34324 21715 12652 13867 15085 14466 11431 2689 6921 -873 -10105 -10141 -11555 -10023
5174 -10023 -11213 -9771 -5618 1645 2880 -527 464 -1462 3119 1800 -2521 -3215 -834 8352 14009
5159 14009 11403 6209 -4914 -13433 -25156 -22278 -4761 1655 1624 -1522 5021 -938 -4094 -6051
5145 -6051 -19437 -22262 -23781 -14284 -18772 -23643 -15224 -2981 6522 5397 9450 3050 6438 -4374
5131 -4374 -22859 -24987 -16628 -14805 -13918 -19248 -29970 -30135 -19372 -11172 -4311 -4679 3832 5650 5939
5116E939k111m304j1442j389J074Q590L185j1597j418O568k03r544m708J851J1036
5101h473M401M741p720L887K608o314j827J3412N805n886j3510l571k030O324
5087h153K502R751J1032l208O184q209q840q742j8275j289K212J223J3127K614
5073h071j0850l011P23N593O033M680O27j1593M51L952j0387J2377N42j716n687
5058a6337N896R281Q364k84r644j5028j8985R040J1714P186J3106K904l21N791
5044A2683J28m575l755q034j167J2115J8893J959k2591o374n113J598l084O077
5030a240q940J465q135r261k867J4124J0445L485Q41J6477J290j7057j3147M340
5016h180O713L536k751m427p337j425M885p34j2131k881Q736O381k047N417K977
$$ plain form
5116 5939 3828 -476 -11918 -13307 -12233 -3643 -458 -12055 -13473 -6905 -7108 -16652 -21360 -19509 -8473
5101 -8473 -4072 669 -7051 -3164 -556 -6870 -8697 4715 10520 4634 -8876 -12447 -14477 -8153
5087 -8153 -5651 4100 15132 11924 18108 9899 1059 -7683 -25958 -27247 -25035 -23812 -10685 -8071
5073 -8071 -18921 -21932 -21209 -15616 -9583 -4903 -4276 -15869 -15418 -11466 -21853 -9476 -8934 -10650 -16337
5058 -16337 -10441 -1160 7204 6920 -2724 -17752 -36737 -27697 -15983 -8797 4309 7213 6892 12683
5044 12683 12811 8236 4481 -3553 -4720 7395 26288 28247 5656 -718 -5831 -4233 -7317 -1240
5030 -1240 -10180 -8715 -16850 -26111 -28978 -14854 -4409 -924 -83 16394 17684 627 -12520 -8180
5016 -8180 -1467 2069 -682 -5109 -12446 -13871 -8986 -9720 -21851 -24732 -15996 -9615 -11662 -6245 -3268
5001c268k547J0604J0388N761K662j1636o344j240l209j0625j102o179J4799Q384
4987F448o953q315L557J4543k585r401L666o32m420m897N712k570n83p804k584
4972a6818N886l534o477n119K351O024J392j0074O424P616L190M43j240j1977
4958b1913N05r97O267Q532o3P751J193j0674k331K341l650p602R360o628p194
4943b5103l677J1138Q690M654J974o801L3o833L678k151J1505J3265n985N745
4929A0132R08l13k260J183o477q275l141J7479m732k1059q873J4533J4255o608
4915c248j5248J1539K0201q008P468R860j2057r527q848m453N317n682n049q43
4901a8578L90n332O691J282r09Q584J1633J2389J427j1596m138j1704p133m345
$$ plain form
5001 -3268 -5815 4789 15177 20938 23600 11964 5620 4380 1171 -9454 -10556 -16735 -1936 6448
4987 6448 -505 -8820 -5263 9280 6695 -2706 960 328 -4092 -8989 -3277 -5847 -6430 -14234 -16818
4972 -16818 -10932 -14466 -20943 -26062 -23711 -17687 -16295 -26369 -19945 -12329 -9139 -8696 -9936 -21913
4958 -21913 -21408 -22405 -16138 -7606 -7669 82 1275 -9399 -11730 -9389 -13039 -20641 -11281 -17909 -25103
4943 -25103 -28780 -17642 -8952 -4298 -2324 -9125 -9092 -15925 -12247 -14398 -2893 10372 4387 10132
4929 10132 11040 10727 8467 9650 3173 -5102 -8243 9236 4504 -16555 -25428 -10895 3360 -3248
4915 -3248 -18496 -6957 13244 5236 12704 22564 10507 980 -7868 -12321 -7004 -12686 -17735 -18578
4901 -18578 -18188 -23520 -16829 -15547 -16456 -7872 3761 16150 17577 5981 1843 -9861 -16994 -21339
4887b1339M525L003M471j1912j9325M326J7120Q061k018K1834Q089L455N209q514
4873A6985q046j2245l667p026R152P411Q424j3177k4054k893K7109J0994o120
4860B847j0942p2J1916r950J079J0837L308o530m679M090j578j1500K247n998
4846a4925N075K681m011p95m195Q665K580k983p163J1714O390m653L343l259q998
4831a0534K15K867R54J512j0941Q245K232l073J618M5n602J1840J891R67m191
4816a955K932O413n299r267K958n311m806M086r369J706L758O114J411m331j765
4801a2725J0470J19M457J0501o264j6990L065l995R328r855l522l492L740M949
4787a0214M309O068O691N40j81n158l416q612q24p18L147J2763P219J952o287
$$ plain form
4887 -21339 -16814 -13811 -9340 -21252 -40577 -36251 -19131 -11070 -13088 8746 16835 20290 25499 16985
4873 16985 8939 -3306 -6973 -13999 -4847 2564 10988 -2189 -26243 -29136 -2027 8967 2847
4860 2847 -8095 -8167 3749 -6201 -5122 5715 9023 2493 -2186 1904 326 -11174 -8927 -14925
4846 -14925 -9850 -7169 -11180 -11975 -16170 -7505 -4925 -7908 -15071 -3357 3033 -1620 1723 -1536 -10534
4831 -10534 -10319 -7452 -6498 -4986 -15927 -7682 -5450 -8523 -6905 -6860 -12462 -622 1269 2236 -1955
4816 -1955 977 7390 2091 -7176 -4218 -9529 -14335 -10249 -19618 -17912 -14154 -8040 -6629 -10960 -12725
4801 -12725 -2255 -2136 2321 12822 6558 -10432 -7367 -11362 -2034 -11889 -15411 -18903 -15163 -10214
4787 -10214 -5905 163 6854 7394 7213 2055 -1361 -9973 -10797 -11515 -8368 4395 11614 13566 7279
4772G279n672q984o635k164n886L340J6353P416j0845q021n255M994J1667R724
4758G311k990p676j209K937J0395m932j6805o129j701Q220J0118N811O148k0357
4744a0859Q57M219k768l115M05k802q842m165J3887R092K749k967M716M218J591
4729F216O167r776j4860j304J7123Q154p944Q688l772j0116j3362r987J7733N374
4715a666l64p80j6439l308L060m85J0925J79J77j9847j1543J1144J411Q037J510
4700a7989r104L305o880P665J073n73J8917N310L005R528J0281o36q952j2491
4686B459j8761o97J0043o354n599M560l809J7648O918j471j54J968j2586l823
4672i658J2493K179r097k2061R615J5056J9275J637j370o656r082J239O995n085
$$ plain form
4772 7279 1607 -7377 -14012 -16176 -22062 -18722 -2369 5047 -5798 -13819 -19074 -14080 -2413 7311
4758 7311 4321 -3355 -4564 -1627 8768 3836 -12969 -19098 -20799 -12579 -2461 3350 9498 -10859
4744 -10859 -10002 -5783 -8551 -11666 -11261 -14063 -22905 -27070 -13183 -4091 -1342 -4309 407 4625 6216
4729 6216 12383 2607 -12253 -13557 3566 11720 3776 12464 8692 -1424 -14786 -24773 -7040 -1666
4715 -1666 -2030 -2810 -19249 -22557 -19497 -19982 -9057 -8878 -8701 -28548 -40091 -28947 -27536 -19499 -17989
4700 -17989 -27093 -23788 -30668 -23003 -21930 -22503 -3586 1724 4729 14257 24538 23902 14950 2459
4686 2459 -16302 -16999 -6956 -13310 -18909 -14349 -18158 -510 6408 4937 4783 6751 -5835 -9658
4672 -9658 2835 5014 -4083 -26144 -16529 -1473 17802 19439 18069 11413 2331 3570 10565 5480
4658E480r215l228n235j1034K609J9503k733j541Q305k134n379r992q3M248o052
4643a6481J3835r30r371J125k555L364J7138j872j3906o610l070J1838J0693O840
4629A0038p379m143k3685p480J0979J4103R877j3578j2045J0357K1096J2292k0386
4616D6j2975K674Q914J0932j0644j683Q803N208j750j0246j0050Q403r062k598
4602a4028J325Q682j716O196M969M556o628r516l483P665K620J0871l41j376J911
4587A1707M615r35k899j0146j0881N97o087N574J671J3090n3q180j1897m991m186
4572b3001N176O093J2834L575j9848j2923J8698P770j1200q662P494P650K732
4559c612Q02m971L174r918j224L787o488J1083Nj0780j6650J0041J1083l259q302
$$ plain form
4658 5480 -3735 -6963 -12198 -23232 -20623 -1120 -3853 -5394 2911 777 -4602 -14594 -14677 -10429 -16481
4643 -16481 -2646 -3576 -12947 -11822 -14377 -11013 6125 4253 -9653 -16263 -19333 -7495 3198 10038
4629 10038 2659 -1484 -25169 -32649 -21670 -7567 2310 -11268 -23313 -12956 8140 20432 46
4616 46 -12929 -10255 -1341 9591 -1053 -2736 6067 11275 9525 -721 -10771 -2368 -11430 -14028
4602 -14028 -12703 -4021 -5737 459 5428 9984 3356 -6160 -9643 -1978 642 11513 11172 9796 11707
4587 11707 16322 15387 12488 2342 -8539 -7942 -14029 -8455 -6784 6306 6253 -1927 -13824 -18815 -23001
4572 -23001 -17825 -11732 1102 4677 -15171 -28094 -9396 -1626 -12826 -21488 -13994 -6344 -3612
4559 -3612 -2810 -7781 -4607 -14525 -15749 -11962 -18450 -7367 -7362 -18142 -34792 -24751 -13668 -16927 -25229
4544b5229Q844O016n623j1797K2587O102j1932p509M924K2588K660n418O916R773
4530B2902j8356M167Q829J1681r342k2876j1898n653R411k875o216J8807J3375
4517A1956J697n122j942l488l041J52j210J33q380nk279K790k575l734o839L212
4501a8675R26N604J7541N987p283M659L995m423m025M102m051j6111J024J5358
4487D628L921p353j2599M329M509P582O026k028o42j653J79o834q352R641J2929
4472A4283o752L722O564m510j0698r812j0365N238L287R030J579q57J5090r033
4458F766r173O973M324r957p054l149q859q504K430J2476J9836m255k2731J205
4444a9672M796K1890J754m975j196r268m476m309J2705L250J119L636j5291j2153
$$ plain form
4544 -25229 -16385 -10369 -15992 -27789 -5202 900 -11032 -18541 -13617 8971 11631 6213 13129 22902
4530 22902 4546 8713 17542 29223 19881 -2995 -14893 -20546 -11135 -14010 -20226 -1419 11956
4517 11956 13653 8531 6589 3101 60 212 -998 -865 -9245 -9250 -11529 -8739 -11314 -15048 -21887 -18675
4501 -18675 -17749 -12145 5396 11383 4100 8759 12754 8331 4306 8408 4357 -11754 -10730 4628
4487 4628 8549 1196 -11403 -7074 -2565 5017 11043 9015 8373 6720 6899 65 -8287 1354 14283
4472 14283 7531 11253 17817 13307 2609 -7203 -17568 -12330 -9043 -13 1566 709 15799 6766
4458 6766 -2407 4566 8890 -1067 -8121 -11270 -20129 -28633 -26203 -13727 6109 1854 -20877 -19672
4444 -19672 -14876 7014 8768 3793 2597 -6671 -11147 -15456 -2751 499 1618 5254 -10037 -22190
4430b2190J5589o120j1307R039K2879P503k2j0911j0207L209J4J580q230o523
4416a5697j1243O440J7819R247j3652N538k741q534q587J0047K4669o94j1615
4403I97l384P585m231j0587o81P10J257L522Q879r973O522k43P42l502o350J894
4387f843O131L23o946Q205J423R362n598J51J3807k448q49K657j4295M349O66
4372A0095R66P995K173q556o408q298q67N195q339r32O319M826J920K462j004
4357G547m150j4801j482N503Q390N577lK679j830j2601J394R287m465o896m180
4342a0031j947J1079J7442K482l13m491j3524q42k363O492J0223J017l561j4633
4328b970K497o668j397j239J340o166l62N082l589J932r777J5870Q888J3430k174
$$ plain form
4430 -22190 -6601 -12721 -24028 -14989 7890 15393 15371 4460 -5747 -2538 -2524 -944 -9174 -15697
4416 -15697 -26940 -20500 -2681 6566 -7086 -1548 -4289 -12823 -21410 -11363 13306 12612 997
4403 997 -2387 5198 967 -9620 -10301 -9591 -8334 -4812 4067 -5906 616 373 1115 -2387 -8737 -6843
4387 -6843 -712 -389 -7335 870 2293 11655 6057 6208 20015 17567 16718 19375 5080 9429 10095
4372 10095 11061 19056 21229 12673 6265 -2033 -2900 2295 -6044 -6976 -657 4169 6089 8551 7547
4357 7547 3397 -11404 -12886 -7383 1007 6584 6581 9260 7430 -5171 -3777 5510 1045 -5851 -10031
4342 -10031 -11978 -899 16543 19025 18712 14221 697 -145 -2508 3984 14207 15224 11663 -2970
4328 -2970 -473 -7141 -8538 -9777 -8437 -14603 -14965 -9883 -13472 -11540 -21317 -5447 3441 16871 14697
4313A4697p997l892j4740k987k990N3O914J0049J3174J7813j5919p244P088m752
4299I267j8457j3526N876n970J387J2129K403l160o566j3250q721J7560J1640
4286i388q49q005j6744J2773N70O280J5412J4857l292j3223P956N773m559P537
4272A5098j1647j1493o720J6142R665r108N06M508j425o375o561J6723M734m686
4258I361k49n898k047k379q056o716L390l421J1825J8189o476l538j0390K583
4244c822N599m945r31j346P613M710K036R107J9273k241p566j8704o314j1323
4230h854p701l47M771n144k369P893l201n089m051o78K629M430J2283M170j4945
4215a6203l769K529J7948J369j5165n281P913j626P629K983P556o035J861k387
$$ plain form
4313 14697 6700 2808 -11932 -14919 -17909 -17856 -10942 -893 12281 30094 14175 6931 14019 9267
4299 9267 -9190 -22716 -16840 -22810 -21423 -9294 -6891 -10051 -16617 -29867 -38588 -21028 -9388
4286 -9388 -10237 -18242 -34986 -22213 -21643 -15363 49 14906 11614 -1609 6347 12120 7561 15098
4272 15098 3451 -8042 -14762 1380 11045 1937 2443 6951 5526 -849 -7410 9313 14047 9361
4258 9361 9112 3214 1167 -1212 -9268 -15984 -12594 -16015 -4190 13999 7523 3985 -6405 -3822
4244 -3822 1777 -3168 -4099 -5445 2168 6878 8914 18021 37294 35053 27487 8783 2469 -8854
4230 -8854 -16555 -16902 -12131 -17275 -19644 -11751 -14952 -20041 -24092 -24770 -22141 -17711 -5428 -1258 -16203
4215 -16203 -19972 -17443 505 1874 -13291 -18572 -10659 -12285 -4656 -1673 5883 -152 1709 -678
4201f78o298n934J4156L543j577m549j617k635q405j125O521j407R094P385P104
4186A3578j820j2169l947L373r87r847M420k834M323J660L978Q376M531j0624
4172B011n232O25J0739j304m453k425n025K654j958P143Q434l903J0828O958p869
4157A7223J563j4634j1880K645n852O353r127k224q02n948Q61J1525O513K660
4143a124P533K449L706M581n471P62j3556k90M141K783q530N117n990j4411p59
4128a9059J1257K990O602Q292P144J676M397J706q023J694q200r721J748j2261
4114i758j3376L822J3475J4795J4136L897k855r794j4342m182J399L527n613P135
4100B266J5146l724q18j0134j4290N39r589K626L782L038Q443q581j2209j2348
$$ plain form
4201 -678 -6976 -12910 1246 4789 3212 -1337 -2954 -5589 -13994 -15119 -8598 -10005 -911 6474 13578
4186 13578 11758 -411 -4358 -985 -1972 -11819 -7399 -10233 -5910 -4250 -272 8104 12635 2011
4172 2011 -3221 -2596 8143 6839 2386 -39 -5064 -2410 -4368 2775 11209 7306 18134 25092 17223
4157 17223 18786 4152 -7728 -5083 -10935 -4582 -13709 -15933 -16735 -22683 -21822 -10297 -3784 -1124
4143 -1124 6409 8858 12564 17145 11674 12436 -1120 -1410 2731 5514 -3016 2101 -3889 -18300 -19059
4128 -19059 -7802 -4812 1790 10082 17226 18902 23299 25005 16982 18676 10476 755 2503 -9758
4114 -9758 -23134 -19312 -5837 8958 23094 26991 24136 14342 0 -4182 -2783 744 -4869 2266
4100 2266 17412 13688 12870 2736 -11554 -11015 -20604 -17978 -14196 -11158 -2715 -11296 -23505 -35853
4086c5853L519P339J4628K994O531m054n443J799m676N629j759j035p020O55N138
4071a1608J2917m467M527N099m353n338m88O692n459j5483R075K039po97q960
4056a6511J2858J853j108J190O604n446J2320j68j4172j6160j667J6179O338R7
4042B207p000j922L646m354N310J3946n564N353R86P16M936j5418j2181n019L266
4027a1092o138j1194Q941P469j7466j577J1314J1147J9125J3359K162r430L204
4014A9824l595j8800k290l32L859J5807J315Q743k290m063r088m327O52Q11L742
3999I968O536k277p609j0392o707j0557J0597P814q258O917J8364R971j1230k1434
3985h297j791J9451k833Q699j6573k0397k158n169J773R163P809M210L855J1500
$$ plain form
4086 -35853 -32334 -24995 -10367 -7373 -842 -4896 -10339 -8540 -13216 -7587 -9346 -10381 -17401 -16746 -11608
4071 -11608 1309 -3158 1369 6468 2115 -3223 -3711 2981 -2478 -17961 -8886 -6847 -6854 -7551 -16511
4056 -16511 -3653 -1800 -2908 -1718 4886 -560 11760 11592 -2580 -18740 -20407 -4228 2110 2207
4042 2207 -4793 -6715 -3069 -7423 -2113 11833 6269 11622 12608 13324 18260 2842 -9339 -14358 -11092
4027 -11092 -17230 -28424 -19483 -12014 -29480 -31057 -19743 -8596 10529 23888 26050 16620 19824
4014 19824 16229 -2571 -4861 -5193 -1334 14473 15788 24531 22241 18178 9090 4763 5415 6226 9968
3999 9968 16504 14227 6618 -3774 -10481 -21038 -10441 -2627 -10885 -3968 14396 24367 13137 -8297
3985 -8297 -10088 9363 6530 15229 -1344 -21741 -23899 -29068 -27295 -18132 -10323 -6113 -2258 9242
3971I242q542k1676q138p617N203Q747J9856L721M602J0166j0393K30M869j597
$$ plain form
3971 9242 700 -20976 -29114 -36731 -31528 -22781 -2925 796 5398 15564 5171 5401 10270 8673
$$ [...]
##END NTUPLES=NMR SPECTRUM
##END=
