##TITLE=Analysis number 329570
Compound Code mo 08025
Project Code adrs
Chemist Name peted
##JCAMPDX= 6.0         $$ Bruker NMR JCAMP-DX V2.0
##DATA TYPE= NMR SPECTRUM
##DATA CLASS= NTUPLES
##ORIGIN= Bruker BioSpin GmbH
##OWNER= nmr
$$ XWIN-NMR		Version 3.5
$$ Thu Sep 27 11:06:06 2007 GMT Daylight Time (UT+1h)  MAYBRIDGE\nmr@NMR_250MHZ
##.OBSERVE FREQUENCY= 250.131544655141
##.OBSERVE NUCLEUS= ^1H
##.ACQUISITION MODE= SIMULTANEOUS (DQD)
##.ACQUISITION SCHEME= undefined
##.AVERAGES= 16
##.DIGITISER RES= 18
##SPECTROMETER/DATA SYSTEM= dpx250
##.PULSE SEQUENCE= zg30
##.SOLVENT NAME= DMSO
##.SHIFT REFERENCE= (INTERNAL, DMSO, 0, 16.522)
##AUDIT TRAIL= $$ (NUMBER, WHEN, WHO, WHERE, WHAT)
$$ ##TITLE= Audit trail, XWIN-NMR		Version 3.5
$$ ##JCAMPDX= 5.01
$$ ##ORIGIN= Bruker BioSpin GmbH
$$ ##OWNER= nmr
$$ C:\u/data/dgb/nmr/ADRS/2600/pdata/1/auditp.txt
$$ ##AUDIT TRAIL=  $$ (NUMBER, WHEN, WHO, WHERE, WHAT)
(   1,<2007-09-27 11:05:45.44 +100>,<MAYBRIDGE\nmr>,<NMR_250MHZ>,
      <created by zg, POWCHK disabled, PULCHK disabled
       configuration hash MD5:
       76 6E 9A 78 1E 09 19 81 EC 84 63 8F B0 6A 59 2D
       data hash MD5: 64K
       7F 4D D1 B5 64 B5 F4 E8 75 6C 38 FF D5 97 FE AB>)
(   2,<2007-09-27 11:05:57.16 +100>,<MAYBRIDGE\nmr>,<NMR_250MHZ>,
      <Start of raw data processing
       ef LB = 0.3 FT_mod = 6 PKNL = 1 SI = 32K 
       data hash MD5: 32K
       0D EA 5C AC FA 0C 60 38 B0 32 0B 0F 40 59 B0 E6>)
(   3,<2007-09-27 11:05:58.82 +100>,<MAYBRIDGE\nmr>,<NMR_250MHZ>,
      <apk 
       data hash MD5: 32K
       CA 51 71 35 8A 86 F6 1B ED EA 88 E4 5B 65 C3 D8>)
(   4,<2007-09-27 11:05:59.50 +100>,<MAYBRIDGE\nmr>,<NMR_250MHZ>,
      <abs ABSG = 5 
       data hash MD5: 32K
       2B 2D F0 7B 4F 71 88 DC 8B CA B3 DE 5E DE 03 52>)
$$ ##END=
$$ 
$$ hash MD5
$$ CE 6F CA E2 74 82 5E 3E 95 49 A0 B7 3D 76 52 BD
##$RELAX= 
##$RELAX= 
##$RELAX= 
##$RELAX= 
##$RELAX= 
##$RELAX= 
##$RELAX= 
$$ Bruker specific parameters
$$ --------------------------
##$DU= <C:\u>
##$EXPNO= 2600
##$NAME= <ADRS>
##$PROCNO= 1
##$TYPE= <nmr>
##$USER= <dgb>
##$AMP= (0..31)
100 100 100 100 100 100 100 100 100 100 100 100 100 100 100 100 100 100 
100 100 100 100 100 100 100 100 100 100 100 100 100 100 
##$AQSEQ= 0
##$AQ_mod= 3
##$AUNM= <au_zg>
##$AUTOPOS= <57 >
##$BF1= 250.13
##$BF2= 250.13
##$BF3= 250.13
##$BF4= 250.13
##$BF5= 500.13
##$BF6= 500.13
##$BF7= 500.13
##$BF8= 500.13
##$BYTORDA= 1
##$CFDGTYP= 0
##$CFRGTYP= 5
##$CHEMSTR= <none>
##$CNST= (0..31)
1 1 145 1 1 1 1 1 1 1 1 1 1 1 1 1 1 1 1 1 1 1 1 1 1 1 1 1 1 1 1 1 
##$CPDPRG= <>
##$CPDPRG1= <>
##$CPDPRG2= <>
##$CPDPRG3= <>
##$CPDPRG4= <mlev>
##$CPDPRG5= <mlev>
##$CPDPRG6= <mlev>
##$CPDPRG7= <mlev>
##$CPDPRG8= <mlev>
##$CPDPRGB= <>
##$CPDPRGT= <>
##$D= (0..31)
0 1 0 0 0 0 0 0 0 0.06 0 0 0 0 0 0 0.0002 0 0 0 0 0 0 0 0 0 0 0 0 0 0 
0 
##$DATE= 1190887544
##$DBL= (0..7)
120 120 120 120 120 120 120 120 
##$DBP= (0..7)
150 150 150 150 150 150 150 150 
##$DBP07= 0
##$DBPNAM0= <>
##$DBPNAM1= <>
##$DBPNAM2= <>
##$DBPNAM3= <>
$$ [...]
##$SUBNAM6= <"">
##$SUBNAM7= <"">
##$SUBNAM8= <"">
##$SUBNAM9= <"">
##$SW= 20.6930455092707
##$SWIBOX= (0..15)
0 0 3 0 0 0 0 0 0 0 0 0 0 0 0 0 
##$SW_h= 5175.983436853
##$TD= 65536
##$TD0= 1
##$TE= 295.16
##$TE2= 300
##$TE3= 300
##$TEG= 300
##$TL= (0..7)
0 120 120 120 120 120 120 120 
##$TP= (0..7)
150 150 150 150 150 150 150 150 
##$TP07= 0
##$TPNAME0= <>
##$TPNAME1= <>
##$TPNAME2= <>
##$TPNAME3= <>
##$TPNAME4= <>
##$TPNAME5= <>
##$TPNAME6= <>
##$TPNAME7= <>
##$TPOAL= (0..7)
0.5 0.5 0.5 0.5 0.5 0.5 0.5 0.5 
##$TPOFFS= (0..7)
0 0 0 0 0 0 0 0 
##$TUNHIN= 0
##$TUNHOUT= 0
##$TUNXOUT= 0
##$USERA1= <user>
##$USERA2= <user>
##$USERA3= <user>
##$USERA4= <user>
##$USERA5= <user>
##$V9= 5
##$VALIST= <valist>
##$VCLIST= <CCCCCCCCCCCCCCC>
##$VD= 0
##$VDLIST= <DDDDDDDDDDDDDDD>
##$VPLIST= <PPPPPPPPPPPPPPP>
##$VTLIST= <TTTTTTTTTTTTTTT>
##$WBST= 1024
##$WBSW= 4
##$XGAIN= (0..3)
0 0 0 0 
##$XL= 0
##$YL= 0
##$YMAX_a= 208033
##$YMIN_a= -384039
##$ZGOPTNS= <>
##$ZL1= 120
##$ZL2= 120
##$ZL3= 120
##$ZL4= 120
##$ABSF1= 16.522
##$ABSF2= -4.171173
##$ABSG= 5
##$ABSL= 3
##$ALPHA= 0
##$AQORDER= 0
##$ASSFAC= 0
##$ASSFACI= 0
##$ASSFACX= 0
##$ASSWID= 0
##$AUNMP= <proc_1d>
##$AZFE= 0.1
##$AZFW= 0.1
##$BCFW= 0
##$BC_mod= 0
##$BYTORDP= 0
##$COROFFS= 0
##$CY= 12.5
##$DATMOD= 1
##$DC= 0
##$DFILT= <>
##$DTYPP= 0
##$F1P= 14.0000005364418
##$F2P= -0.99999901652339
##$FCOR= 0.5
##$FTSIZE= 32768
##$FT_mod= 6
##$GAMMA= 0
##$GB= 0
##$INTBC= 1
##$INTSCL= 1
##$ISEN= 128
##$LB= 0.3
##$LEV0= 0
##$LPBIN= 0
##$MAXI= 10000
##$MC2= 0
##$MEAN= 0
##$ME_mod= 0
##$MI= 0
##$NCOEF= 0
##$NC_proc= -5
##$NLEV= 6
##$NOISF1= 0
##$NOISF2= 0
##$NSP= 0
##$NTH_PI= 0
##$NZP= 0
##$OFFSET= 16.522
##$PC= 1
##$PHC0= 155.8988
##$PHC1= 0
##$PH_mod= 1
##$PKNL= yes
##$PPARMOD= 0
##$PSCAL= 4
##$PSIGN= 0
##$REVERSE= no
##$SF= 250.13
##$SI= 32768
##$SIGF1= 0
##$SIGF2= 0
##$SINO= 400
##$SIOLD= 32768
##$SREGLST= <1H.DMSO>
##$SSB= 0
##$STSI= 32768
##$STSR= 0
##$SW_p= 5175.98343685301
##$SYMM= 0
##$S_DEV= 0
##$TDeff= 65536
##$TDoff= 0
##$TI= <Analysis number 999999
Compound Code 99
Book Reference 9
Project Code 9>
##$TILT= no
##$TM1= 0
##$TM2= 0
##$TOPLEV= 0
##$USERP1= <user>
##$USERP2= <user>
##$USERP3= <user>
##$USERP4= <user>
##$USERP5= <user>
##$WDW= 1
##$XDIM= 32768
##$YMAX_p= 366337855
##$YMIN_p= -703341
$$ End of Bruker specific parameters
$$ ---------------------------------
##NTUPLES= NMR SPECTRUM
##VAR_NAME=  FREQUENCY,     SPECTRUM/REAL,   SPECTRUM/IMAG
##SYMBOL=    X,             R,               I
##VAR_TYPE=  INDEPENDENT,   DEPENDENT,       DEPENDENT
##VAR_FORM=  AFFN,          ASDF,            ASDF
##VAR_DIM=   32768,         32768,           32768
##UNITS=     HZ,            ARBITRARY UNITS, ARBITRARY UNITS
##FACTOR=    0.157963299565203, 1,           1
##FIRST=     4132.6476996994, 0,             0
##LAST=      -1043.33573715361, 0,           0
##MIN=       -1043.33573715361, -703341,     0
##MAX=       4132.6476996994, 366337855,     0
$$ Real data points
##PAGE= N=1
##DATA TABLE= (X++(R..R)), XYDATA
$$ [...]
15564e2026L4260m3240P7485J45327j88514j28538n7980l2717K63266J46364m7225
15553A16462q3399j10311j8739l6234p3127m2237O0400J21026o9882o7462j2423
15542b15926P9424J22961J18064p5234m3585J3704r0729j4772O9631K75285q8625
15531A50198j51637O6422n7149r1082J9222N0569j60265o7602P9569K1356j80282
15520c20681J52109J41238L0122p0261l9365l7452N3390j58K24517L8957j69202
15509C214j82623r7656N8076J79470P2224m8136j29663K640J35415k2265o7817
15498i7121o766P8325J57391M3167p5940j30100J07176M8488O4353j5093n8783
15487A15097j02780j77223P6548l48J11783Q9539L2914K1715m5580q1705n4640
$$ plain form
15564 -52026 -17766 -61006 16479 161806 -26708 -155246 -213226 -245943 17323 163687 116462
15553 116462 33063 -77248 -95987 -132221 -205348 -247585 -187185 -66159 -136041 -203503 -215926
15542 -215926 -136502 -13541 104523 29289 -14296 -592 -91321 -106093 -36462 238823 150198
15531 150198 -1439 64983 7834 -83248 -64026 -13457 -173722 -241324 -161755 -140399 -320681
15520 -320681 -168572 -27334 2788 -67473 -106838 -144290 -90900 -91058 133459 172416 3214
15509 3214 -179409 -277065 -218989 -39519 32705 -15431 -145094 -142454 -7039 -29304 -97121
15498 -97121 -103887 -25562 131829 174996 99056 -31044 76132 124620 188973 173880 115097
15487 115097 12317 -164906 -88358 -88706 23077 112616 145530 167245 121665 39960 -14680
15476a4680O2938J17256M2899o2805k27617K9398O9375n8833J6753q4404n1668
15465a61388P5695K6419j83367q0937J29630O1131j7021R9477j22782j9961K98343
15454A05239n2390m4278N2722m9883N2010R5613L2139l9349j41936j84692m5628
15443b20433N4874K14996P5263j35895j30138j24179L0475R6917r8588j7452J1744
15432b42416P3990N184P2142L2980j0308p9432j11670O8318K93980J7544j58524
15421c8212j35352J23204J08054n7148l8792J29994M7930r2588J08426j06545
15411D8971p7067M0849J00028L2513l1682N737O7581j17385n8852j07004K05275
15400A08964Q5970k47543k7851P2934j0737J05581O1932j10139k4354j62520L0623
$$ plain form
15476 -14680 48258 165514 208413 145608 -82009 -52611 16764 -42069 -25316 -109720 -161388
15465 -161388 -85693 -59274 -242641 -323578 -193948 -132817 -149838 -50361 -173143 -193104 105239
15454 105239 52849 8571 61293 11410 63420 159033 191172 151823 9887 -174805 -220433
15443 -220433 -165559 49437 124700 -11195 -141333 -265512 -235037 -138120 -236708 -254160 -242416
15432 -242416 -168426 -163242 -91100 -58120 -68428 -147860 -259530 -191212 102768 120312 -38212
15421 -38212 -173564 -50360 57694 546 -38246 91748 139678 47090 155516 48971
15411 48971 -28096 12753 112781 145294 113612 119349 186930 69545 10693 -96311 108964
15400 108964 194934 -52609 -80460 -7526 -18263 87318 149250 39111 14757 -147763 -117140
15389a17140K9020L9330K1967L6267P0053q0236j90944J11309J93486J74303M2791
15378C30206K3012k3351k33573n9385K4754r7446J1483L0473n4972K1914j50856
15367a77741P1692N015o7972m4384p5382l3633J38161K1482J7841p8268j29515
15356c52704M532J90743J35110j33737k00335N6065J50537J85338J41660k9682
15346A47527M8547r1563j10904J36367K6918N1381J23556j00593j95684p2827
15336c7275j06642r6312r9739N5944k2042o4932L7268J71307P1937N9556R5015
15325F4085O4878j1647j29598m3701O1632r2427p5917j28536l8194Q0531J84739
15314f4155Q9939J21957J3095P678n6561P426j09341j65918j36258J74625J23266
$$ plain form
15389 -117140 -88120 -48790 -26823 9444 79497 -739 -191683 -80374 113112 287415 330206
15378 330206 353218 329867 96294 36909 61663 -35783 -24300 6173 -48799 -26885 -177741
15367 -177741 -106049 -101034 -169006 -213390 -288772 -322405 -184244 -162762 -144921 -223189 -352704
15356 -352704 -348172 -157429 -22319 -156056 -356391 -300326 -149789 35549 177209 147527
15346 147527 196074 104511 -6393 129974 156892 208273 331829 231236 35552 -37275
15336 -37275 -143917 -240229 -339968 -284024 -306066 -370998 -333730 -162423 -90486 -30930 64085
15325 64085 128963 117316 -12282 -55983 5649 -86778 -162695 -291231 -329425 -248894 -64155
15314 -64155 25784 147741 160836 168514 111953 119379 10038 -155880 -292138 -117513 5753
15303E753J42486Q1028n2887p4818K9242j56580n5214M625n1913N4695Q9898k9927
15291a3612N7312n6142K569J0800q133p3956l5320q8586N010J5053j6155Q0280
15279a20880J54598J22411J4o5462r5375l0462R0352O2331J41372j50835J6438
15268A24502K538Q270J7468j29708j57541n5904j8297L11539J78021k01095N2225
15257A32018J28631o3303j00509K431o8097n1061n7019j6310K9845J61068j60624
15246f2930j49844r7483M1559m211K51075O7108L8915l5237l2753r719J24435
15235A30915l791N877j35058m6017P1506K7621N0825K8055l9373P3416L2165K2002
15223B18143o4943p3744j97241r6650p733p6854Q8574L27833J26187j3869r6267
$$ plain form
15303 5753 148239 229267 176380 101562 130804 -25776 -80990 -76365 -128278 -73583 16315 -13612
15291 -13612 43700 -12442 -9873 927 -7206 -81162 -116482 -205068 -200058 -185005 -201160 -120880
15279 -120880 33718 156129 156143 90681 -4694 -35156 55196 117527 258899 108064 124502
15268 124502 127040 135310 152778 23070 -134471 -190375 -208672 102867 280888 79793 132018
15257 132018 260649 197346 96837 99268 31171 -19890 -76909 -93219 -63374 97694 -62930
15246 -62930 -212774 -310257 -268698 -272909 -21834 45274 84189 48952 16199 6480 130915
15235 130915 127124 133001 -2057 -48074 23432 51053 101878 129933 90560 163976 196141 218143
15223 218143 153200 79456 -117785 -214435 -222168 -299022 -210448 117385 243572 229703 133436
15212A33436l8310j27287k17702o6931J06646J16002Q5067L6915J6237K4274m1636
15201B6711j18501j58962m1756q9604M4196L9786K33166K24666J74120M0641O1796
15190D36259k7490l6148j42573j46593j23515n363j15118m9437Q5692P628R8416
15179a8242J25771j69735j44470j8604Q0255J2128j94562l1583J00361K45714
15169a2967J31325K5657k10888j12485K83196K26221K9834m9753m32j32370j54087
15158B3251m8398M2827P3728J14188J41970q220m6333j04406j76670Q9784N9618
15147A61339L4834j94570k28442k6210K06955K92781J37503J81897n4814k20918
15137B90355j53453j05444j3211j1029K693p5460o6105J4305r723N2846J54624
$$ plain form
15212 133436 95126 -32161 -249863 -316794 -210148 -94146 -9079 27836 44073 68347 26711
15201 26711 -91790 -250752 -292508 -382112 -337916 -298130 -64964 159702 333822 374463 436259
15190 436259 408769 372621 230048 83455 -40060 -45423 -160541 -209978 -124286 -116658 -18242
15179 -18242 107529 -62206 -206676 -225280 -145025 -132897 -327459 -359042 -258681 -12967
15169 -12967 118358 144015 -66873 -179358 103838 330059 359893 310140 309708 177338 23251
15158 23251 -25147 17680 91408 205596 347566 339346 293013 188607 11937 101721 161339
15147 161339 196173 1603 -226839 -253049 -46094 246687 384190 566087 511273 290355
15137 290355 136902 31458 18247 7218 9911 -65549 -131654 -117349 -127072 -74226 80398
15126H0398m166o1101j05622r5451R7493J12730P4554p2231n234O9234j0503j37529
15114e7428M4328J2685j13108J6726K8657j34225l0719M4746L8929p2816O0015
15103a62210n3788M3915k9808r2495O6478Q0102Q9724j07089L7735Q9937K14863
15092A77364K2246m908p5042j73869r7745K0497j2815J3384n8504n0108j5524
15081b55024M3266Q746J12123m7842K6341J08365M564J28407l6707j02134P74
15070i121j40443L4779K3176q3377o7035K6748Q8651K9921K4872Q8207K49073
15059B65451j59098j22660o560k1968J07022L4173N1933q2785j31231L924r601
15048g1400J25614J062l9668M268j56953j46122M9270J53838N9575L7347R5618
$$ plain form
15126 80398 76232 15131 -90491 -185942 -88449 24281 98835 26604 21370 90604 80101 -57428
15114 -57428 -13100 -415 -113523 -96797 -68140 -202365 -233084 -188338 -149409 -222225 -162210
15103 -162210 -215998 -172083 -201891 -294386 -227908 -147806 -58082 -165171 -127436 -37499 177364
15092 177364 199610 194702 119660 -54209 -151954 -131457 -144272 -130888 -189392 -239500 -255024
15081 -255024 -211758 -203012 -90889 -138731 -112390 -4025 539 128946 92239 -9895 -9121
15070 -9121 -149564 -114785 -91609 -174986 -242021 -215273 -126622 -96701 -71829 16378 265451
15059 265451 106353 -16307 -22867 -44835 62187 96360 148293 65508 -65723 -61799 -71400
15048 -71400 54214 55276 15608 19876 -137077 -283199 -233929 -80091 -20516 16831 112449
15037A12449J2393m0226n0342P0129Q1090j3828L2279p2986j62595J7138P9525
15026F5026n3865j6577L1773L891L0235k5742q223L6967J11688K0056l7114p7513
15014H0602P1287L3813m2730j15270M1576N9388j3306r6656n5785l5115j16769
15003a88965j30760Q6304p7631r2355L5791J6572K33153P8665n9222M7028r7262
14992a48682J05175J84071j33617p0576O6578P9538J8776l5399P1123j537J40617
14981B76067P6791j66788r4781J146k19101o2174q8884N0937l5736m6870K5492
14970b83901J50982J0950P0808K02298J53961J25629j19002j68951n2724r2903
14960b853q2814o7289J27N6907N9125J33999p0061j26586N4145N9316j70093j13245
$$ plain form
15037 112449 124842 84616 34274 104403 185493 171665 203944 130958 -31637 -14499 65026
15026 65026 11161 -5416 26357 30248 60483 34741 26518 63485 175173 195229 158115 80602
15014 80602 151889 185702 142972 27702 69278 128666 115360 18704 -37081 -72196 -188965
15003 -188965 -319725 -233421 -311052 -403407 -367616 -351044 -117891 -39226 -98448 -51420 -148682
14992 -148682 -43507 140564 6947 -63629 2949 82487 101263 65864 136987 135450 276067
14981 276067 352858 186070 91289 92435 -126666 -188840 -277724 -226787 -262523 -309393 -283901
14970 -283901 -132919 -121969 -51161 151137 305098 430727 311725 142774 90050 -2853
14960 -2853 -85667 -152956 -152829 -95922 -36797 97202 27141 -99445 -45300 14016 -156077 -269322
14948b69322p89K6671J45548J97691J24782N683q6546o6630l6326l9205K2924
14937B4481K5567j0164j8742l8513p7010n9941N1836J03249J24862O8962K4214
14926B18801M1892P860n4147j58967q1553j051K59809k0282j78612r3048j540
14915f0838J9546Q1233m7660k3597o3516J65646L18319n0326k38343l0586L7057
14904A06935j23458M087K2922M9793K84442O8590j99434k20697j7290L591m372
14893b4891K6663o1839J49065J97765m6691j69834L8019O7904p8270k3002R9125
14882A74014j26160N763l641P0121M3411p3149n4093q160p965j65705j8766L8470
14870a25860K9203M3012p8733j2467M7094K15086J28109P9669N7620q2329j28745
$$ plain form
14948 -269322 -270111 -243440 -97892 99799 224581 230264 143718 77088 40762 1557 24481
14937 24481 50048 39884 21142 -17371 -94381 -154322 -102486 763 125625 194587 218801
14926 218801 260693 268553 214406 55439 -26114 -27165 232644 212362 33750 -59298 -60838
14915 -60838 -41292 39941 -7719 -31316 -94832 70814 389133 338807 100464 69878 106935
14904 106935 -16523 -12436 10486 60279 344721 413311 213877 -6820 -24110 -20519 -24891
14893 -24891 1772 -60067 88998 286763 240072 70238 108257 176161 97891 74889 174014
14882 174014 47854 53617 49976 120097 163508 90359 36266 28106 20141 -145564 -164330 -125860
14870 -125860 -96657 -53645 -132378 -144845 -97751 117335 245444 325113 382733 300404 171659
14859A71659n9784L5540N635J2351l1010n842J24565r7477k7645R3353j25788
14848I5557j7889J95496o4308n1311N4409L6346N2336j9309j97984k23821j09602
14837b50080Q3852K40823O8271J16169J9649j34895k6224M7947l4598r8304M0364
14826G2974k0579n9124o350n0975N4761j30896K3982J79764Q7337Q2907l5728
14815A98073q7498j53279k1553J22941O4460o2433j91970k9744J27399r5597p8490
14804b07691P1804J24685J37273J36066l3172j22683l9444l0686n8666j42199
14794a64713J11666J80557J27577q271j40322j86133J65355K6780J5213j2164
14784A15545j48613M707R573J06296j2830k9706n9681r9707j9906R0333K358K4097
$$ plain form
14859 171659 111875 147415 153050 165401 134391 128549 253114 155637 127992 221345 95557
14848 95557 77668 273164 208856 157545 211954 248300 300636 281327 83343 -140478 -250080
14837 -250080 -166228 74595 142866 259035 278684 143789 117565 165512 130914 32610 72974
14826 72974 52395 -6729 -13079 -64054 -9293 -140189 -116207 63557 150894 233801 198073
14815 198073 110575 -42704 -64257 58684 123144 60711 -131259 -161003 -33604 -129201 -207691
14804 -207691 -135887 -11202 126071 262137 228965 106282 66838 36152 -22514 -164713
14794 -164713 -53047 127510 255087 246816 106494 -79639 85716 112496 127709 115545
14784 115545 -33068 -28361 -18788 87508 74678 44972 -14709 -114416 -134322 -43989 -41631 -17534
14772a7534K47239M4063k9382r1278j57185j31782J37428j0956l6117P1641l1763
14761e626j01126L2808P9900P4418P2845p8689N62J85088j11860q9370J62054
14750B21004j4329r2099K6700R2486N689j57654j5301n3771O2835R5781Q3563
14739B54904M3184j45743q7508p4678N1661l7482K0567N5006L5280p6405j4022
14728B4764P1564k2877M7385Q0648p2129j01048q302J56972L8107M2337K5416
14717B82837r2128K00331j9422j62063Q150k5531N6909k04229m570J07799R6642
14706B44725j5969P3271j08310j97019Q5510o0182Q3199K9060r578k7364J35664
14695B33007K1170j01034j37042l4087j67387J03053K65223N1658j45902K19888
$$ plain form
14772 -17534 229705 273768 244386 153108 -4077 -135859 1569 -9387 -45504 26137 -5626
14761 -5626 -106752 -73944 5956 80374 153219 74530 75092 260180 148320 58950 221004
14750 221004 206675 114576 141276 233762 239451 81797 66496 12725 75560 171341 254904
14739 254904 298088 152345 64837 -9841 41820 4338 24905 79911 115191 38786 24764
14728 24764 96328 73451 120836 201484 129355 28307 20005 176977 215084 257421 282837
14717 282837 190709 391040 371618 209555 217705 192174 249083 44854 40284 148083 244725
14706 244725 228756 302027 193717 -3302 82208 22026 105225 134285 124707 97343 233007
14695 233007 254177 153143 16101 -17986 -185373 -82320 182903 234561 88659 308547
14685C08547Q6429r3047r1569j51088L8342R0474l9268j05414p6353j20646J12037
14674d1556N4625K8304J6877o0351N8868J08813J21994N297r1412k5179o9865
14663A06415p9418j7044J7470N0253J2717n6903J24854l6562j17482K7264N0863
14652H2427N7650J76958J20341l2667o0373j69861j40503J76971K9747j10191
14642A30499k29633k70708J69149K80438M6729J563J63933K4434k25741P4257
14632A64920J5292K6564j77288p9695m2305P1370K15659J26695p1414k4843J5578
14621B40533p3929k0960J27202P3171j69953j23432N4635J25946J43381p2602
14611C03992j19478L6465J07755M4776o9453j44799p0771R8905R3388j1410J18162
$$ plain form
14685 308547 394976 301929 210360 59272 97614 188088 148820 43406 -32947 -153593 -41556
14674 -41556 13069 41373 58250 -2101 56767 165580 287574 292871 201459 176280 106415
14663 106415 26997 9953 27423 77676 90393 33490 158344 121782 4300 31564 82427
14652 82427 140077 317035 437376 404709 344336 174475 33972 210943 240690 130499
14642 130499 -99134 -369842 -200693 79745 126474 128037 291970 316404 90663 164920
14632 164920 180212 206776 29488 -50207 -92512 -21142 194517 321212 249798 224955 240533
14621 240533 166604 145644 272846 346017 176064 52632 107267 233213 376594 303992
14611 303992 184514 220979 328734 373510 304057 159258 88487 187392 280780 269370 387532
14600C87532l1060k25370j99231m1901Q7990M6287N2745O4116Q6592J00643J44284
14589D72627N9247p0588m3242l5039N3541J962r0733k75651o5953k1048L3527
14578A8650M807J87414J06724j20307j28624J33509j99560j70740q3976J53557
14568i8546N479J02163J09336R809Q0537m2622J1687M258o904k7170J27957J51566
14556D27550m9894j40598L367K8435p815j57971r8427R8001r381j44583K930J34089
14544H5703M1030n2962J50261k5895j32397J36124Q3520Q4222M3316k3964Q0568
14533D69526L2467j52211j46860K0675j44015j05547K4875K8547m2096J85708
14523A71069J29129j56450p6511M8201P8665k08093J20284K32191L3846k19142
$$ plain form
14600 387532 356472 131102 -68129 -110030 -22040 24247 76992 141108 227700 328343 472627
14589 472627 531874 461286 418044 383005 436546 438508 347775 72124 6171 -14877 18650
14578 18650 23457 210871 317595 197288 68664 202173 2613 -168127 -252103 -98546
14568 -98546 -93067 9096 118432 128241 208778 166156 177843 182101 175197 148027 275984 427550
14556 427550 377656 237058 240425 268860 261045 103074 4647 102648 93267 -51316 -48386 85703
14544 85703 126733 73771 224032 198137 65740 201864 285384 369606 412922 388958 469526
14533 469526 501993 349782 202922 223597 79582 -25965 -1090 27457 -14639 171069
14523 171069 300198 143748 67237 115438 194103 -13990 106294 338485 372331 153189
14513A53189j3156q5764r9510O9299J88431o7573n3311m0362m6830J15413j9584
14502A00242q0929n8984J5103R4691J51728L891J61505m3863j30504l0826K3615
14491B05669Q5459k02430j3036K3873O0067L45264j7970j94765k6700j11530O459
14480A60360P4835J42359r7563j18157j04238j04741p3895J15691K29674N5369
14470B79694j6760j02372P5032p0567n1945j1739J34431J24371R428R863q0851
14459B98585Q6477j03327j593K1224m2542o0274l1531M0804R6343r8581M237P0423
14447B80245k61920j42725J20343J7304M5484R4534P5095R1077L171K7315J56270
14436E06193N3452k4690j24444j54246Q718L5603m8373J01077O8962M1133j70569
$$ plain form
14513 153189 140033 54269 -45241 24058 212489 144916 91605 51243 4413 119826 100242
14502 100242 19313 -39671 -24568 70123 221851 225742 387247 343384 212880 182054 205669
14491 205669 291128 88698 75662 99535 159602 504866 486896 292131 265431 153901 160360
14480 160360 235195 377554 279991 161834 57596 -47145 -121040 -5349 224325 279694
14470 279694 262934 160562 235594 165027 113082 101343 235774 360145 369573 379436 298585
14459 298585 385062 281735 280142 301366 258824 198550 167019 207823 304166 205585 209822 280245
14447 280245 18325 -124400 -4057 13247 58731 153265 228360 319437 322608 349923 506193
14436 506193 559645 534955 410511 256265 264983 300586 252213 353290 422252 463385 292816
14425B92816k7446R2147l7675O6445k00246p900M1941K0307j44968r6158J1554
14414A0817P4758M5286j08962j30165Q4783k9889J62264R8395Q762p1118L0060
14403A74991P6830o9596j24565l0499K16430o1841j23243j4731N3946P2705k8202
14392A42225O4085m3254p0949J46397J51623j05979P364r7658J03857P6529j55429
14381B18811j97737m7229o7210J97494J85626J10100r7406q4912J6831j51326
14371H3042k9608N4487j65407q0304J96549K11884N5507J78516j52744k64805
14361H7117Q0060K23384P383j57198l3241J21579P0183k3511m5196q5233K4319
14350B69646l7360K3489M4734J49741R3961K4844r4395k54232j65254j28375n330
$$ plain form
14425 292816 265370 357517 319842 386287 186041 178141 220082 240389 95421 -737 10817
14414 10817 85575 130861 21899 -108266 -23483 -53372 108892 207287 216049 144931 174991
14403 174991 251821 182225 57660 27161 243591 181750 58507 43776 97722 170427 142225
14392 142225 206310 163056 92107 238504 390127 284148 291512 193854 297711 374240 218811
14381 218811 21074 -26155 -93365 104129 289755 399855 302449 217537 234368 83042
14371 83042 53434 107921 -57486 -137790 58759 270643 326150 504666 351922 87117
14361 87117 167177 390561 397944 240746 207505 329084 399267 375756 330560 245327 269646
14350 269646 232286 255775 300509 450250 544211 569055 474660 220428 55174 -73201 -78531
14339g8531J2454J37957Q1514O8027L19448L837J032j73716k00958n1625K2291
14328A41730J05066J00737L0563L0267k11145j77402P9232J88138K21764J61509
14318F70459j17891k09095k0286O7386L5794j0049j07950j27234n7691K09856
14308C33299J24714J4372j26875k32688k08076J38289J41975r7738k6932R5456
14298A55796J2415j96347J11490J39793j18182L8597M6802J29223J2151r3244
14288B38494m2554o9842j6437j44469J06057K02938K3993j57455j81066m982M9311
14277C988O3456L0010J80207J27713q0341j07753J10851J67797J63686j02625
14267E56989m4645p2383j6488J43697J28406M2288j73772J472k9186j4658J07240
$$ plain form
14339 -78531 -66077 71880 153394 221421 540869 544706 545738 372022 171064 119439 141730
14328 141730 246796 347533 378096 408363 197218 19816 99048 287186 508950 670459
14318 670459 552568 343473 323187 390573 426367 416318 308368 181134 123443 333299
14308 333299 458013 472385 345510 112822 -95254 43035 185010 87272 60340 155796
14298 155796 168211 -28136 83354 223147 104965 143562 190364 319587 331738 238494
14288 238494 195940 126098 109661 -34808 71249 274187 298180 140725 -40341 -45323 3988
14277 3988 67444 97454 277661 405374 325033 217280 328131 495928 659614 556989
14267 556989 512344 439961 423473 567170 695576 737864 564092 565564 536378 521720 628960
14256F28960m8810j35093K8609m4788r8185J17297J65079J03403j14951j12862
14246D88659q0560k1364p7126M6707N2704o667n219J48224N3515N3570K2901K3601
14234F98945J7107j34623L7675j51301m5883k2327J18760K07637J13563J78289
14224A017842N087j58633j51594L8322J43110J19731J19085p0421r5789o7343
14214H99397J53535N9249L5225P3242P6185n8939L9826J66472J07942l4825M6679
14203A563988N2695O0020K12971Q6534J56186J38780J7257K03094J48687J67933
14193B808145M45618K34365P2440J87758L82539L35198L92221M09443L62987K47972
14183E878686M59120L80765M01347M18822M73933K39278K01165L22954L22663
$$ plain form
14256 628960 580150 445057 473666 428878 330693 447990 613069 716472 601521 488659
14246 488659 408099 386735 309609 356316 409020 402353 397134 545358 598873 652443 675344 698945
14234 698945 716052 581429 619104 467803 421920 399593 518353 725990 839553 1017842
14224 1017842 1022929 864296 712702 751024 894134 1013865 1132950 1062529 966740 899397
14214 899397 1052932 1112181 1147406 1220648 1296833 1237894 1277720 1444192 1552134 1517309 1563988
14203 1563988 1616683 1676703 1889674 1976208 2132394 2271174 2288431 2491525 2640212 2808145
14193 2808145 3253763 3488128 3560568 3748326 4130865 4466063 4858284 5267727 5630714 5878686
14183 5878686 6337806 6718571 7119918 7538740 8012673 8251951 8453116 8776070 9098733
14174I098733M17561N36492L86531K19181K23803J82700N66425M59299K64813
14165A2355538J68593J43460J48414L18976J95448K90078M11495K19147l3112
14156A4218037K60229M31519L47582M56775M36845M81321L99723K84437K37875
14147A7554343L80235N14137K92600K03704K33916K19761J13875K29117J80378
14138A9922066J32524J40390j22892K09066L5013l05372k74288p5525j22157l81393
14128A9157432k93297k40941l17527m25481l28994m59465m87559j57983k03664
14119A6242521l75937l42670l13963k89215k26429j53380k37155n72954l66610
14110A3364208p4078k52691k18149q8895l51085m35825k90166l00530j55251l10141
$$ plain form
14174 9098733 9516294 10052786 10439317 10658498 10882301 11065001 11631426 12090725 12355538
14165 12355538 12524131 12667591 12816005 13134981 13330429 13620507 14032002 14251149 14218037
14156 14218037 14478266 14909785 15257367 15714142 16150987 16632308 17032031 17316468 17554343
14147 17554343 17934578 18448715 18741315 18945019 19178935 19398696 19512571 19741688 19922066
14138 19922066 20054590 20194980 20072088 20281154 20316167 20010795 19736507 19660982 19538825 19157432
14128 19157432 18864135 18623194 18305667 17880186 17551192 17091727 16604168 16446185 16242521
14119 16242521 15866584 15523914 15209951 14920736 14694307 14540927 14303772 13730818 13364208
14110 13364208 13290130 13037439 12819290 12730395 12379310 11943485 11653319 11352789 11197538 10887397
14100A0887397m58680m63056l71283m20553k69480l75959l81818l36174m88536
14091G321858n53273n56821l63771k05465k99663k04704j32573k68840m68546
14082D268202m06452m68642k02655j13412r6531q9043j14490k16624j68499p4984
14072B316870o9049r4226k52165j56545O7472j33724j7624n1407q3364j88895
14062A337343k7738n2995n3276j5439K0009r189q2666j82735j08868O9854j59288
14051G35012j61375j55043O9743M5729J39992J10499j6657j9549q7216j38736
14041E22399L1482J47047J37140K7370J23461j07092j35593k09393j30673O4625
14031D70773O1693j0475N8120P4160j29731j39601K26570K88203M8812j17723
$$ plain form
14100 10887397 10428717 9965661 9594378 9173825 8904345 8528386 8146568 7810394 7321858
14091 7321858 6768585 6211764 5847993 5642528 5342865 5138161 5005588 4736748 4268202
14082 4268202 3861750 3393108 3190453 3077041 2980510 2891467 2776977 2560353 2391854 2316870
14072 2316870 2247821 2153595 1901430 1744885 1812357 1678633 1661009 1609602 1526238 1337343
14062 1337343 1309605 1256610 1203334 1187895 1207904 1198715 1116049 933314 824446 894300 735012
14051 735012 573637 418594 488337 534066 674058 784557 767900 748351 661135 522399
14041 522399 553881 700928 838068 865438 988899 881807 746214 536821 406148 470773
14031 470773 532466 521991 580111 654271 524540 384939 611509 899712 948524 830801
14021H30801j20255j37035r0693l5538K66363L5882j24165l7081J17875L4483
14011G40637k7709k9817n3680k0644m9164n1719N801J16848l7254j4209R6944
14000F76034J18436M9455k4443q3865j07951p8275L9972l2313j24035J41456M0685
13989F15156L2606J13674j16654p5467p1992o2587m0676j04868J23088J38963
13979E51243J40123L5551J2161K8084n4607n2463k7426J12775j04298j74707j54455
13968C11981J7061P6165K41831o6769o1742j28214P7678O4049N0617k24930j12516
13957B45211Q8164Q9780R3940q5274k9903O2292J73623K1009J44418n5991k52504
13946D94765j21243k898j15196j22236r8815M5877l0152K5807M3361M0048m2476
$$ plain form
14021 830801 710546 573511 482818 447280 713643 749525 625360 588279 706154 740637
14011 740637 712928 683111 629431 608787 559623 507904 513705 630553 593299 579090 676034
14000 676034 794470 843925 819482 735617 627666 549391 589363 557050 433015 574471 615156
13989 615156 647762 761436 644782 569315 497323 434736 394060 289192 412280 551243
13979 551243 691366 726917 739078 767162 712555 660092 632666 745441 641143 466436 311981
13968 311981 329042 405207 647038 580269 518527 390313 467991 532040 582657 357727 245211
13957 245211 333375 423155 517095 431821 401918 464210 637833 658842 803260 747269 494765
13946 494765 373522 370624 255428 133192 34377 80254 50102 75909 119270 159318 116842
13935A16842Q3751j2711R271J19318q4374K5390k367o9270O0285J19406l1083
13924C34458j54636j50981R2408J41284L5980n4916o1245q8390K0301J68173J57065
13913D39501O3664j52931k29736q5935R0361J10593O94L5907j5870q6376K61705
13902D31577L8111k4197K4058J6069p6516j4200n8766Q1572Q2728r0289M297J31015
13890E45459Q2414O9988L1780j19326k888O9217m836j59664O0371m675r2399k18829
13878B56612M412K44508K15585j04777l0598m2099o1490o3810K0279M470J53935
13867E97027j37708M7272P3041j18716j3164O9509n2952j88351J05578M885N6662
13856D43083K05202p1115j13836O4780m9520j60862O8839J51385J00272j77174
$$ plain form
13935 116842 200593 187882 197153 316471 232097 257487 255120 185850 246135 365541 334458
13924 334458 179822 28841 121249 262533 298513 243597 182352 93962 114263 282436 439501
13913 439501 503165 350234 120498 34563 124924 235517 236211 272118 256248 169872 431577
13902 431577 469688 445491 469549 485618 409102 394902 336136 417708 500436 410147 414444 545459
13890 545459 627873 697861 729641 610315 607427 676644 671808 512144 572515 567840 475441 256612
13878 256612 261024 505532 721117 616340 585742 543643 482153 418343 438622 443092 597027
13867 597027 459319 506591 579632 460916 447752 517261 464309 275958 381536 386421 443083
13856 443083 648285 577170 463334 528114 478594 317732 386571 537956 638228 461054
13846D61054M4028r742k4231n16R63n186l067p8672q563m5440j08477Q4572J04282
13833D11005J86416J16023j45809k0429O9837m9513j83740O3967J8128J20431
13823E86316J6166r1811o324p3183P2814O4276j8403j34593l0556m3036M805J86296
13811E32767n5723j75052J82298k4083j2292m3923p3325J37685J00250j18511
13801D50091R2710J26134o2908L0071N1N349q1219m020J1037k12617M1955M7748
13789D44382n7099K1041J8411k905l2660L0418k280N9089o7374M6048J94296p1878
13777E79489j9042r3974K0466j2594n0083r8738J82946P9988L0421l4698R9587
13766F83768l5154j7505m5484j36133n7277Q8549J44916o4365Q6063r4895p4003
$$ plain form
13846 461054 505082 495340 471109 470593 471556 466370 463303 384631 376068 330628 222151 306723 411005
13833 411005 597421 713444 567635 547206 617043 567530 383790 447757 465885 586316
13823 586316 602482 510671 504347 431164 503978 568254 549851 415258 384702 341666 346471 532767
13811 532767 477044 301992 484290 460207 447915 403992 330667 468352 568602 450091
13801 450091 542801 668935 606027 636098 636149 641498 560279 556259 567296 354679 396634 444382
13789 444382 387283 408324 426735 423830 391170 421588 419308 478397 411023 457071 651367 579489
13777 579489 560447 466473 486939 474345 424262 325524 508470 588458 618879 584181 683768
13766 683768 648614 631109 585625 449492 392215 480764 625680 561315 647378 552483 478480
13755D78480j1518p9241R7096J22656N655O2665j65261j39242j35621j88725K15532
13744B62476J49341l3049k7737R0364J15863m060p8083J46884l6387P2914q1912
13733E76614k01230J6354N6402J0829J6842r7515J27035O1K5582R2892R2031L4172
13721G50069J77961o0071j45777j42727m6726J07697J23364l9676M3457l2220
13711G35351j10810J70513Q7948n9134j29762K2365J34310P0925l558j62352j28694
13700F27102m8660K0583J74522L1330N7368m0252j97707J08314N6988J22835O517
13689I18940j06839j62278m3043m3530O2203J29422J16876n6365O3480j2067q6673
13678G80126L1381J0359J53600J25357m2782q6749j41561p6808L02552m8012j87357
$$ plain form
13755 478480 466962 387721 484817 607473 613128 675793 510532 371290 235669 46944 262476
13744 262476 411817 378768 351031 441395 557258 553198 475115 621999 585612 658526 576614
13733 576614 375384 391738 448140 458969 475811 378296 505331 505392 530974 623866 715897 750069
13721 750069 928030 867959 722182 579455 532729 640426 763790 724114 767571 735351
13711 735351 624541 795054 883002 823868 694106 716471 850781 921706 918148 755796 627102
13700 627102 578442 599025 773547 804877 862245 821993 624286 732600 789588 912423 918940
13689 918940 812101 649823 606780 563250 625453 754875 871751 815386 878866 866799 780126
13678 780126 811507 821866 975466 1100823 1058041 971292 829731 752923 1055475 1007463 820106
13667H20106k3498R907j31951M2421J08671j41313q1530L7652J83504Q171J732
13656H33872J18608j650j24109j54798k2379R8831J11841J6772N7755k7051P3919
13645I81611q430O9491k59063j06506n2218J44634K15290Q3700j27776L788O8840
13634A013361J07166K1491K2792N3428R557j0003p372N8320Q5987m9187k02166
13623A103374J12869J34551p8287O7984M1591R5351J60582M2987o9544L6601P7986
13612A726045O1921j95488o2317N1710m0172K0047m9319O5899P9335K54980P3889
13601A986530o4896K0817P9410J14949O5613J33030J06122O2006J15928K54842
13591B874351P1867J14895R2072N6734l5199J48122K23140K51819Q6946R9417
$$ plain form
13667 820106 796608 806515 674564 716985 825656 684343 602813 640465 823969 832140 833872
13656 833872 952480 950830 826721 671923 649544 748375 860216 876988 934743 907692 981611
13645 981611 973181 1042672 783609 677103 624885 769519 984809 1068509 940733 944521 1013361
13634 1013361 1120527 1142018 1164810 1218238 1227795 1217792 1210420 1268740 1354727 1305540 1103374
13623 1103374 1216243 1350794 1272507 1340491 1382082 1477433 1638015 1681002 1611458 1648059 1726045
13612 1726045 1787966 1592478 1530161 1581871 1541699 1561746 1512427 1578326 1657661 1912641 1986530
13601 1986530 1921634 1942451 2021861 2136810 2202423 2335453 2441575 2503581 2619509 2874351
13591 2874351 2946218 3061113 3153185 3209919 3174720 3322842 3545982 3797801 3884747 3984164
13581C984164L64769K35580R0791J97423N10294L02519Q6040L60231L15983L28867
13571F776661L05326L58953M08413L84090L87452K08848J31164J57352M07147
13562I525406L02208K06374L66587J69733J64801N3461P2974P4836K54770J70121
13552A1361271L12170K47160J90597J24540J56683P3573P2569K23385Q6916J5641
13542A2864505J2057J70559K47419J46552N6628O7814L05509L69070L66377L66963
13532A4973453M66271M13859N67721P22001Q78000R05731J004159R07567R07044
13523B1745806J143006J237605J403731J593231J489033J262968J358964J333294
13515C2567638J058413R56958Q53052O41757K38252j30207l04353l83674o18004
$$ plain form
13581 3984164 4348933 4584513 4675304 4872727 5383021 5685540 5771580 6131811 6447794 6776661
13571 6776661 7081987 7440940 7849353 8233443 8620895 8829743 8960907 9118259 9525406
13562 9525406 9827614 10033988 10400575 10570308 10735109 10788570 10861544 10936380 11191150 11361271
13552 11361271 11673441 11920601 12111198 12235738 12392421 12465994 12538563 12761948 12848864 12864505
13542 12864505 12876562 13047121 13294540 13441092 13497720 13565534 13871043 14240113 14606490 14973453
13532 14973453 15439724 15853583 16421304 17143305 18021305 18927036 19931195 20838762 21745806
13523 21745806 22888812 24126417 25530148 27123379 28612412 29875380 31234344 32567638
13515 32567638 33626051 34583009 35436061 36077818 36316070 36185863 35881510 35497836 34879832
13506C4879832p09643p42200p52259q31686q57569q41817p07086o03102o69086
13497B8165384o38777m05024m04951k27883k95154k52872k78175k19838j54385
13488B5288325j76583l77161m84100k32130l56073l72233k42865n65779m57436
13479B2023965j85864l64909m02964n85653n86740o05472m97061l81591k68457
13470A8145254m05550m41945m99979l05804l83841k33184j96136q097j05524k010
13460A5563184R2668j29758j56187k5014J80695J59858K64845L7964J62745K23532
13450A6374532J65969M58484K03952O8208L95058M68755K49870l3691J96529K21648
13440A8769314P2231J27760K30610J13059J56034J94201J09150r8987o3927k02996
$$ plain form
13506 34879832 34170189 33427989 32675730 31844044 30986475 30144658 29437572 28834470 28165384
13497 28165384 27526607 27121583 26716632 26488749 26193595 25940723 25662548 25442710 25288325
13488 25288325 25111742 24734581 24250481 24018351 23662278 23290045 23047180 22481401 22023965
13479 22023965 21838101 21473192 21070228 20484575 19897835 19292363 18795302 18413711 18145254
13470 18145254 17739704 17297759 16797780 16491976 16108135 15874951 15678815 15670718 15565194 15563184
13460 15563184 15655852 15526094 15369907 15344893 15525588 15685446 15950291 15988255 16151000 16374532
13450 16374532 16540501 16998985 17202937 17271145 17666203 18134958 18384828 18351137 18547666 18769314
13440 18769314 18841545 18969305 19199915 19312974 19469008 19663209 19772359 19673372 19609445 19406449
13430A9406449k52999j18324j9316k19620r4253k09209k15850l75835l67140m1090
13420A7492813j98764k24737j92794k75937m64158k42846L2618k78639l32333
13411A5315223j04522m0801j05068q7535j08367k250O3539m0609J81110J77702
13401A5248422K00348J94528K31222J60121L25543K51754J83996K40385K48153
13392A7284472L85862N7202K23780K13745N5760J70728n5791j25829j62419n3945
13382A7993565P6971m553q0362q0758l18321l66028l76425l91626l81873j99564
13372A5871026j89016k97001l00342k52752k88228l7669L1876L7617n2664J34989
13362A4657836J10890J00786Q8242J37439mJ73217K01568K17992K02949M63899
$$ plain form
13430 19406449 19153450 19035126 19015810 18796190 18701937 18492728 18276878 17901043 17533903 17492813
13420 17492813 17294049 17069312 16876518 16600581 16136423 15893577 15926195 15647556 15315223
13411 15315223 15210701 15169900 15064832 14977297 14868930 14866680 14930219 14889610 15070720 15248422
13401 15248422 15448770 15643298 15874520 16034641 16360184 16611938 16795934 17036319 17284472
13392 17284472 17670334 17727536 17951316 18165061 18220821 18391549 18335758 18209929 18047510 17993565
13382 17993565 18070536 18065983 17985621 17904863 17586542 17220514 16844089 16452463 16070590 15871026
13372 15871026 15682010 15385009 15084667 14831915 14543687 14506018 14537894 14575511 14522847 14657836
13362 14657836 14768726 14869512 14957754 15095193 15095189 15268406 15469974 15687966 15890915 16354814
13352A6354814L7595o8503J21592J21055j12793j26496k25780n5016j54974l16361
13342A5575133k03413m56082l65221m67114l71770m58819m38697m31131l88298
13333A1994588m84671n36701m31590m76120o49744l89037m25050m29108l48212
13324G824355l32256l68989m94958k85533k70875m94953l41437j79027k00425
13315D855902k06438p2163j82637k12148k1425q2918j86138p7380O8954O8696
13305C952305o4235p7983q4250k60999k48811R5774r4807j54023j27412j41468
13295B794091M8816J77006o1700r3645k12597j40554p1909j74147j12676R1406
13285B244091P782o2803j38804L0647j91394j03967l3544k15629j42187M2017
$$ plain form
13352 16354814 16392409 16323906 16445498 16566553 16453760 16327264 16101484 16046468 15891494 15575133
13342 15575133 15371720 14915638 14550417 14083303 13711533 13252714 12814017 12382886 11994588
13333 11994588 11509917 10973216 10541626 10065506 9415762 9026725 8601675 8172567 7824355
13324 7824355 7492099 7123110 6628152 6342619 6071744 5576791 5235354 5056327 4855902
13315 4855902 4649464 4577301 4394664 4182516 4161091 4078173 3892035 3814655 3883609 3952305
13305 3952305 3888070 3810087 3725837 3464838 3216027 3311801 3216994 3062971 2935559 2794091
13295 2794091 2842907 3019913 2958213 2864568 2651971 2511417 2439508 2265361 2152685 2244091
13285 2244091 2251873 2189070 2050266 2080913 1889519 1785552 1752008 1536379 1394192 1436209
13275A436209N8318l7369o3811J7157J3973P9405j02333p2009J0179o4058j14132
13264A161529q6926L2325o0841M737M9138O0626L4694L2946r2114m6922N2898
13253A142090n6284K9598m3071n1806J76018j7258r3869k96329M5600J00448j62860
13242G72277K8661J21901J42143k1675K3874k38115K522o943K7183M3812n8016
13231H37624J6868q2252j56105o3755M7978P9877J00285K5134m3J3192R8840j77112
13219G40531j32785J24679j0763P3735o2826o7964K57407J40727m5758j52378
13209H64605k15934q0216O9091P2624J41575O4237L7002J39952M7922r4279j9417
13198A027162j42130r1043L7215J36033q3325l8480J5742O431j13011k49529o4767
$$ plain form
13275 1436209 1494527 1457158 1393347 1410504 1424477 1503882 1401549 1329540 1339719 1275661 1161529
13264 1161529 1074603 1106928 1046087 1050824 1099962 1160588 1195282 1228228 1136114 1089192 1142090
13253 1142090 1085806 1115404 1072333 1020527 1196545 1179287 1085418 789089 834689 935137 772277
13242 772277 800938 922839 1064982 1043307 1067181 829066 831588 824645 851828 895640 837624
13231 837624 854492 772240 616135 552380 600358 680235 780520 805654 805611 818803 917643 740531
13219 740531 607746 732425 721662 795397 732571 664607 922014 1062741 1016983 864605
13209 864605 648671 568455 637546 710170 851745 915982 952984 1092936 1140858 1046579 1027162
13198 1027162 885032 793989 831204 967237 883912 845432 861174 867605 754594 505065 440298
13187D40298J8339K9465K4233J52597J03304Q535l2634J2308j17151m5250l426
13176E90618O0744j80844l5207J43688o7488J39763J47748j18137q4068K0931
13166F17748n4263O5862K9679L3984O6904M0814j5141J10372K4185j73256p8715
13155F68173j16125n919O5170M7351N0300J01494L8336o7243j24234o1194N2417
13144F48526j5359o019O177J20583j5963j57604o269K02071L078p7442j7146l9606
13132F45027J13426l7130k27257J2398J18387m7802j09447J08030J9076m7980
13122E46728J02433M8434l9754P9394O7844k1553K331l38m6795j0136O571q0321
13110F54838m1191k1362J19351J12918K380q8321m7967K6381N1262J01427N6960
$$ plain form
13187 440298 458637 488102 512335 664932 768236 776771 744137 756445 639294 594044 590618
13176 590618 651362 470518 435311 578999 511511 651274 799022 680885 596817 617748
13166 617748 563485 629347 659026 693010 759914 800728 785587 895959 920144 746888 668173
13155 668173 552048 546129 611299 658650 708950 810444 848780 781537 657303 596109 648526
13144 648526 633167 627148 633325 753908 737945 580341 574072 776143 779221 701779 684633 645027
13132 645027 758453 721323 494066 506464 624851 577049 467602 575632 594708 546728
13122 546728 649161 697595 657841 737235 805079 783526 785857 785519 738724 728588 735159 654838
13110 654838 613647 592285 711636 824554 826934 738613 690646 717027 768289 869716 926676
13099I26676p32m0152R8004J6771O1630M9275j01293j14309R025Q2550J96878
13088A184323R1002j6690j10604j58529j21726j9576n9539j21233J3079M8545
13078G29052J55504O4844j20518n5060J80876m5394N3128P5286j42235m8891k3697
13067H22895J1580L1105O3786M742o8655K0926j15610q4202Q5028Q2317J02111
13056I56023M692k5557Q2487o399q4935k7571J19934Q5279N9557q3693k5884j09343
13044I44590L6674R3299j40423n9937R1244l1402j41p977Q9334J79268p1340j54821
13032I68368N705K66241J1339j40344n4034Q550k1297j7243O1868p2890J15729
13021A131992R1062L5990k5098r4675o5439N0881O8928L2872k26866o7414K03035
$$ plain form
13099 926676 925944 885792 983796 1000567 1062197 1111472 1010179 895870 904895 987445 1184323
13088 1184323 1275325 1258635 1148031 989502 867776 848200 788661 667428 680507 729052
13078 729052 884556 949400 828882 773822 954698 909304 962432 1037718 895483 846592 822895
13067 822895 834475 865580 929366 934108 865453 886379 770769 686567 771595 853912 956023
13056 956023 960715 935158 1017645 1011246 926311 898740 1018674 1103953 1163510 1079817 1053933 944590
13044 944590 981264 1074563 934140 874203 965447 934045 933904 925927 1015261 1194529 1123189 968368
13032 968368 974073 1240314 1251653 1111309 1057275 1065825 1044528 1027285 1089153 1016263 1131992
13021 1131992 1223054 1259044 1233946 1139271 1073832 1124713 1193641 1226513 999647 932233 1135268
13010A135268J05234J740L7146m2115o8634j14274J4304J98192N212O2542K0470
12999A355085J10665M3724m1062J74224j0482j24644N8368K2725m0651J60109
12989A708061K4775n4551J70836J15577n6804L573J04281o135j02206J6551J94775
12978B118733J38617J01623M5914J77290J54808J94979K5939J3666J63834k3110
12968C112293m1684J00579K9526j6394k03333j7641K67573K79803j4532K0959
12958C517149L35564J63301J77973J00297n3025J20314L26784L1583j01996J55186
12948D773130L2144J74399J34577K26406J65691K45028K07989k1783O7581J94153
12938F199315J21890K32780n4950j82809P0711K08360P6135j3559o5177r4789
$$ plain form
13010 1135268 1240502 1242242 1279388 1237273 1168639 1054365 1068669 1266861 1272073 1334615 1355085
12999 1355085 1465750 1509474 1468412 1642636 1632154 1507510 1565878 1588603 1547952 1708061
12989 1708061 1732836 1678285 1849121 1964698 1907894 1911467 2015748 2009613 1907407 1923958 2118733
12978 2118733 2257350 2358973 2404887 2582177 2736985 2931964 2957903 2971569 3135403 3112293
12968 3112293 3070609 3171188 3200714 3184320 2980987 2963346 3230919 3510722 3496190 3517149
12958 3517149 3852713 4016014 4193987 4294284 4241259 4361573 4688357 4719940 4617944 4773130
12948 4773130 4805274 4979673 5114250 5340656 5506347 5751375 5959364 5937581 6005162 6199315
12938 6199315 6321205 6553985 6499035 6316226 6386937 6595297 6671432 6657873 6592696 6497907
12928F497907J9761L3096L756j00538j62398K0923q588j0544r2209k76316k53465
12917E671385p4597J05157o9739j04690j6666J6248j60181j37688p9962k20827
12907D928440j74219j78446j65297q8874K52655L41898Q4623j22700j08674j23378
12897D646028k4676P2047j2488j04164L4669J37748J562j0542p4944J35874J73725
12886D974839J31598R9572J75533J49196J40347K69482J85165K36677L15399K15298
12876F893106n9986J05726L04372K65740J81169J62412J33869K32270K21282J97258
12866H637218J54971J82344K58733J58459K18171J99734k317l1231R3128J41748
12856A0010958K34509R1118L31224K08717J0614Q2460J62118J89595N2918J71262
$$ plain form
12928 6497907 6517668 6550764 6554520 6453982 6291584 6312507 6303919 6293375 6201166 5924850 5671385
12917 5671385 5596788 5701945 5632206 5527516 5510850 5527098 5366917 5229229 5149267 4928440
12907 4928440 4754221 4575775 4410478 4321604 4574259 4916157 5000780 4878080 4769406 4646028
12897 4646028 4621352 4693399 4680911 4576747 4611416 4749164 4750726 4740184 4665240 4801114 4974839
12886 4974839 5106437 5206009 5381542 5530738 5671085 5940567 6125732 6362409 6677808 6893106
12876 6893106 6833120 6938846 7243218 7508958 7690127 7852539 7986408 8218678 8439960 8637218
12866 8637218 8792189 8974533 9233266 9391725 9609896 9809630 9807313 9776082 9869210 10010958
12856 10010958 10245467 10336585 10667809 10876526 10887140 10969600 11131718 11321313 11374231 11545493
12846A1545493N8184k2012J16800P9719M3473J33476J00841k3410k46405k16132
12836A1570027j59073k26085J7147n3729k98048j50470j91910m4325j89126r8050
12826A0176358l58583l55811m70751n2778J8561j96435j82054k66544j49208j73602
12816G989153l17570m89867l66055k22607K1003j80120j71835k02393J870R4676
12806F156255k88088k29281m2000j07212k45691k52032o8485Q4380J12730J8044
12796E138620k42108j84525J43092P9583P0309k1973l5126j3073J15801J20236
12786E170836Q1258L7828Q6194K15586O818q0758J47191J03744K87326J23171
12776F179194Q9211P6985J40691j99320k0181K46822P6794J62547J76174J55339
$$ plain form
12846 11545493 11603677 11581665 11698465 11778184 11821657 11955133 12055974 12032564 11786159 11570027
12836 11570027 11410954 11184869 11202016 11148287 10850239 10699769 10507859 10463534 10274408 10176358
12826 10176358 9817775 9461964 8991213 8938435 8956996 8760561 8578507 8311963 8162755 7989153
12816 7989153 7671583 7181716 6815661 6593054 6614057 6433937 6262102 6059709 6061579 6156255
12806 6156255 5868167 5638886 5596886 5489674 5243983 4991951 4923466 5007846 5120576 5138620
12796 5138620 4896512 4711987 4855079 4934662 5004971 4982998 4947872 4934799 5050600 5170836
12786 5170836 5252094 5289922 5376116 5591702 5598520 5517762 5664953 5768697 6056023 6179194
12776 6179194 6268405 6345390 6486081 6286761 6266580 6513402 6590196 6752743 6928917 7084256
12766G084256K18748j09611r4968m6840K3942K00739J62801Q700P0332J4416k1750
12755G510765K1156j68774j00640j8723j32798m3321k8396K3638j14381j12155
12745F836371M7504j18918l02631q5837J28022m9857l5655j49438l98629j49835
12735E721097K9627j47161k32533k48664j48228j59288j64868q756j79009j78827
12725D283390k52665j85923r1098j66011p1508r1508k09991j71815j04128P736
12715B946479j15448r1034J5358j18328n1146j02663K4355J40339q5748j31798
12705B430366j12419M1465j45503p5977j9803q1757l3143K03553J32550k81500
12695B057832k00929N1510J22179j03644k7485J1753r8821J6654k1269M9078J7170
$$ plain form
12766 7084256 7303004 7193393 7098425 7051585 7075527 7276266 7439067 7447767 7518099 7532515 7510765
12755 7510765 7531921 7363147 7262507 7243784 7110986 7067665 7039269 7062907 6948526 6836371
12745 6836371 6883875 6764957 6462326 6376489 6504511 6454654 6418999 6269561 5870932 5721097
12735 5721097 5750724 5603563 5371030 5122366 4974138 4814850 4649982 4641226 4462217 4283390
12725 4283390 4030725 3844802 3753704 3587693 3516185 3424677 3214686 3042871 2938743 2946479
12715 2946479 2831031 2739997 2755355 2637027 2585881 2483218 2507573 2647912 2562164 2430366
12705 2430366 2317947 2359412 2213909 2137932 2118129 2036372 2003229 2206782 2339332 2057832
12695 2057832 1856903 1908413 2030592 1926948 1899463 1911216 1812395 1829049 1807780 1856858 1874028
12684A874028j90715j09591J56166p5387J34104P2550j0490N6567j37381O7414
12674A837265k6856j32620J7322j23788o4100R1722J34412J505o1154j14137k8624
12663A530947k34359k6596J12648K37468J08577j52246P1808Q5635K0666j18065
12653A636483j03590k9585j86160k7415J60055R6146o2454P7868M390l3953p5691
12642A456094J01969N606P3858R6971J24118l4816k2181j27574o3283J16251j5968
12631A711045p3089l7709l466j65434K7699R5523J25382J82259l3270j61751O9049
12620A736238N7646k05239j21638J61832J4362l6193p1551J80029L9340r832j38620
12609A606374p0335N5270M4742N0997q3185O502J55899L1453m4654k04196k05699
$$ plain form
12684 1874028 1683313 1573722 1729888 1654501 1788605 1861155 1850665 1907232 1769851 1837265
12674 1837265 1810409 1677789 1695111 1571323 1507223 1598945 1733357 1734862 1673708 1559571 1530947
12663 1530947 1296588 1269992 1382640 1620108 1728685 1576439 1648247 1733882 1754548 1636483
12653 1636483 1532893 1503308 1317148 1289733 1449788 1545934 1483480 1561348 1565738 1531785 1456094
12642 1456094 1558063 1563669 1637527 1734498 1858616 1823800 1801619 1674045 1610762 1727013 1711045
12631 1711045 1637956 1600247 1596781 1431347 1459046 1554569 1679951 1862210 1828940 1667189 1736238
12620 1736238 1793884 1588645 1467007 1628839 1643201 1607008 1535457 1715486 1754826 1744994 1606374
12609 1606374 1536039 1591309 1636051 1687048 1603863 1610365 1766264 1797717 1753063 1548867 1343168
12598A343168Q3087N6296N3710M0811J2436M9481J31304J0029J4142J6539r4486
12587A716517J26450J39932O4188k5625n3381k88494m3489R8135J29061J1488
12577A874782k5642R2793r7645j29910J54176L10673o8985J6767j7728q4620K503
12566B027164o0265O7054J5920J1450j67429q0665J6169N4369P5681J49540o2397
12555B046591m0022J655p727n3777J18083N4423r3783r0279Q760j07625o0266
12544A776033j05151P5433m9274J97371O7867K7376n5594k08480M2450M5289l7528
12533A775792k9221p4533J98524J07546J10173N0180m8259N5104m2922Q9971R1524
12522B283879J05032o2583q6642j4453n5783N5643O9116j46938m5256J01738j56187
$$ plain form
12598 1343168 1426255 1482551 1536261 1577072 1589508 1638989 1770293 1780322 1794464 1811003 1716517
12587 1716517 1842967 1982899 2047087 2021462 1968081 1679587 1636098 1734233 1863294 1874782
12577 1874782 1849140 1941933 1844288 1714378 1868554 2179227 2110242 2127009 2109281 2024661 2027164
12566 2027164 1966899 2033953 2049873 2061323 1893894 1813229 1829398 1883767 1959448 2108988 2046591
12555 2046591 2006569 2008224 2000497 1946720 2064803 2119226 2025443 1935164 1943924 1836299 1776033
12544 1776033 1670882 1746315 1697041 1894412 1962279 1989655 1934061 1725581 1768031 1813320 1775792
12533 1775792 1746571 1672038 1870562 1978108 2088281 2138461 2090202 2145306 2102384 2192355 2283879
12522 2283879 2388911 2326328 2239686 2225233 2169450 2225093 2294209 2147271 2102015 2203753 2047566
12511B047566k4672J25124O5381R4173l0876r8983O9061J25553K3112K2214N6906
12500B474559o4060M5312l0101P0616q5501q8297M8538K4075k5211Q1102L6972
12489B488004J35011k4712k5306R6739k12480J1275J19688r6061J24273P4855
12479B691286j46412l2082m1615k3709L58775J29933j40620k03422O9950K16646
12469B878730J32572J2408M1145J38129M3380J84195J28129L4964j87916j67502
12459C238234j4480J32161P4508J67628J97351Q9451K29194K08284J49474P9704
12449D551509J20238J38345J99076L53594K94110K21737J04482K43535M22614
12440F649240M29782L64969L33113K07715K94988K99896L54152P18944M87490
$$ plain form
12511 2047566 2022894 2148018 2213399 2307572 2276696 2177713 2246774 2372327 2395439 2417653 2474559
12500 2474559 2410499 2455811 2425710 2496326 2410825 2322528 2371066 2395141 2369930 2451032 2488004
12489 2488004 2623015 2598303 2572997 2669736 2457256 2468531 2588219 2492158 2616431 2691286
12479 2691286 2544874 2512792 2471177 2447468 2806243 2936176 2795556 2592134 2662084 2878730
12469 2878730 3011302 3023710 3064855 3202984 3246364 3430559 3558688 3593652 3405736 3238234
12459 3238234 3223754 3355915 3430423 3598051 3795402 3884853 4114047 4322331 4471805 4551509
12449 4551509 4671747 4810092 5009168 5362762 5656872 5878609 5983091 6226626 6649240
12440 6649240 7079022 7443991 7777104 7984819 8279807 8579703 8933855 9652799 10140289
12431A0140289M25802N59878N64580M43730M54030M73423M57259L91757M46090
12422A4356838L59526M25601M58571L24509K26683J04443J50883J05407J3009
12413A6525470J04089l2636M5103j49414l23601k48589j38938k82682m06323l06743
12403A4785736j88088l67687p12268o33560n07806l44121k85600l48327m76731
12394A0921548m09502l60762m11724m34503k27407l14096l93060k71159j30752
12385G968583j34398k96595k39901j82993j45534p55j62589j70093j31781j39546
12375F364398j22013N7217P8885J3852J60966J62985N0760L6905K19296K96881
12365G320132O7666o4741K28051K66033K13187M75606M88325J38202K25354M91540
$$ plain form
12431 10140289 10566091 11125969 11690549 12134279 12588309 13061732 13518991 13910748 14356838
12422 14356838 14716364 15141965 15600536 15925045 16151728 16256171 16407054 16512461 16525470
12413 16525470 16629559 16596923 16642026 16492612 16169011 15920422 15781484 15498802 15092479 14785736
12403 14785736 14597648 14229961 13517693 12884133 12376327 12032206 11746606 11398279 10921548
12394 10921548 10512046 10151284 9739560 9305057 9077650 8763554 8370494 8099335 7968583
12385 7968583 7834185 7537590 7297689 7114696 6969162 6968407 6805818 6635725 6503944 6364398
12375 6364398 6242385 6299602 6378487 6392339 6553305 6716290 6767050 6803955 7023251 7320132
12365 7320132 7387798 7323057 7551108 7817141 8030328 8505934 8994259 9132461 9357815 9849355
12355I849355N66616L27754M35183M33997M83891O11150O27786N94324O34652
12346A4564708M80301M99376O06459O54314N19456N32164M61538L51376L42203
12337A9011895M32943L53433K94076L00707J27453r5291k06888j11366l94542
12328A9712420l06281j98377k58906l62513n55698o47641l45208l03242o19002
12319A6115552p16886n40422m77284n19384n76068n56275n26419m97170m22093
12310A1283551m72620n14206m10158l47301k93116l81730o07699l59383k84357
12301G612981j78641k83994k54014j80759p861j81358k62338o3946q9480j56125
12291E954465l6383r4266o7371j30782k9924r9306k57796n8234n5196K3204J86133
$$ plain form
12355 9849355 10415971 10743725 11178908 11612905 12096796 12707946 13335732 13930056 14564708
12346 14564708 15045009 15544385 16150844 16805158 17324614 17856778 18318316 18669692 19011895
12337 19011895 19444838 19798271 20092347 20393054 20520507 20425216 20218328 20106962 19712420
12328 19712420 19406139 19207762 18948856 18586343 18030645 17383004 17037796 16734554 16115552
12319 16115552 15398666 14858244 14380960 13861576 13285508 12729233 12202814 11705644 11283551
12310 11283551 10810931 10296725 9886567 9539266 9246150 8864420 8256721 7897338 7612981
12301 7612981 7434340 7150346 6896332 6715573 6707712 6526354 6264016 6200070 6110590 5954465
12291 5954465 5918082 5823816 5756445 5625663 5595739 5496433 5238637 5180403 5125207 5148411 5334544
12280E334544N5407J07311J29705K5982k37015k02444j03761j06305j03198j17049
12270D783177M3445m1620M6762N677o3015J3683r7999r9258L3838O3787q2246
12259D606231L3534K28477N8481P4356K556j22566j30869l9514j94912J4121J14478
12248D644373j1844r4574l4333Q4398k2860R308l4752n3086J09261L9338P6736
12237D711965q071J1524J3665j38693M0869N0123q0017M5306O8478J07446l5406
12226D787189K9194k2701J93240P2511o4158N5344R4291j5696J38256j57443j71431
12215D938596J20593J67560J54660p2062J0433k8912j41166j38395j06224r9270
12205D805813Q3294K58498R8532J69001J71794r3916J4138N1693j54327M3502
$$ plain form
12280 5334544 5389951 5497262 5626967 5652949 5415934 5213490 5109729 5003424 4900226 4783177
12270 4783177 4826622 4785002 4831764 4837441 4774426 4788109 4690110 4590852 4624690 4688477 4606231
12259 4606231 4639765 4868242 4926723 5001079 5003635 4881069 4750200 4710686 4515774 4529895 4644373
12248 4644373 4632529 4537955 4503622 4588020 4565160 4574468 4539716 4486630 4595891 4635229 4711965
12237 4711965 4703894 4715418 4729083 4590390 4631259 4681382 4601365 4646671 4715149 4822595 4787189
12226 4787189 4816383 4793682 4986922 5059433 4995275 5050619 5144910 5129214 5267470 5110027 4938596
12215 4938596 5059189 5226749 5381409 5309347 5319780 5290868 5149702 5011307 4905083 4805813
12205 4805813 4889107 5147605 5246137 5415138 5586932 5493016 5507154 5558847 5404520 5448022
12195E448022N0541M652Q447J48110L0112m3107j4053N1093L5566N6643L4372
12184E810398K9054P4417J22667J32055L7778j42186P4210O6174l0370j35722
12174F038475j00376l5083J55342R6447n6538Q855N094J06180O9228k4930j34688
12163F128006J18093J14964N0259r419n6058p103K3848K4462J5977j20110O648
12152F289567K38426K53171j6628q5961p0298J45646J04231m4736N4354J95769
12142G063541J38314N4659O646J18578P7139n438j38919M3408J27889M7376l9868
12131G493325P4413J21620L8111Q1676J3587L8912j59896k0534J64497j2822N0194
12120G883083J03964q863l0670J6563J33186J11854k6963P3146J02833l2002J7187
$$ plain form
12195 5448022 5498563 5503215 5511662 5659772 5689884 5646777 5632724 5683817 5719383 5776026 5810398
12184 5810398 5839452 5913869 6036536 6168591 6206369 6064183 6138393 6204567 6174197 6038475
12174 6038475 5938099 5903016 6058358 6154805 6098267 6107122 6112216 6218396 6287624 6262694 6128006
12163 6128006 6246099 6361063 6411322 6401903 6345845 6338742 6362590 6387052 6403029 6282919 6289567
12152 6289567 6527993 6781164 6764536 6678575 6608277 6753923 6858154 6813418 6867772 7063541
12142 7063541 7201855 7256514 7263160 7381738 7458877 7453439 7314520 7357928 7485817 7533193 7493325
12131 7493325 7567738 7689358 7727469 7809145 7822732 7861644 7701748 7681214 7845711 7832889 7883083
12120 7883083 7987047 7978184 7947514 7964077 8097263 8209117 8182154 8255300 8358133 8326131 8343318
12109H343318j919J3805j08029n7518J87019k8238r612j1197J82386P6207J81759
12098H767981N0578l6847j22725r4904J21544J02558k8570n6961R1418K40650
12088I034722J80865n1421o3345O3993J18782Q4359J42028J53750K5652J80882
12078I870267K2840k1092j94943J20453P0855P9583J30963n6032p3964O7348L4491
12067A0050769R8101M2407l8128j25552K28497J24030J4593j31801n0096M2570
12057A0255390P6279N7702J88603M2692N7286J28984O1336j03910n3625L9096
12047A0749833J90680k402K5571j1764J25359R2963K6594m2810J68986J29231
12037A1452241N2692j09860j38366n8865J34667L1778J1635J08594J56255K47398
$$ plain form
12109 8343318 8341399 8355204 8247175 8189657 8376676 8348438 8338826 8327629 8510015 8586222 8767981
12098 8767981 8818559 8781712 8658987 8564083 8685627 8788185 8759615 8702654 8794072 9034722
12088 9034722 9215587 9164166 9100821 9164814 9283596 9367955 9509983 9663733 9689385 9870267
12078 9870267 9893107 9872015 9677072 9797525 9868380 9947963 10078926 10022894 9948930 10016278 10050769
12067 10050769 10148870 10191277 10153149 10027597 10256094 10380124 10394717 10262916 10212820 10255390
12057 10255390 10331669 10389371 10577974 10620666 10677952 10806936 10868272 10764362 10710737 10749833
12047 10749833 10940513 10938111 10963682 10951918 11077277 11170240 11196834 11154024 11323010 11452241
12037 11452241 11504933 11395073 11256707 11197842 11332509 11364287 11375922 11484516 11640771 11888169
12027A1888169J80802l3961n5997j4211P399Q2283K31012J8927j6366k7318O967
12016A2267706L8433L5399r1869L4133J94807J34014J5888l03560j19173J37108
12006A2342886m6683L8377J38342L15169J78177O6407N9327M1003J76789O9523
11996A3379317Q2238K2063M5028o3231m6926L9644k4049O977k73504J0010L0891
11985A3208458O7575K5660o811J33945M3348O0239Q1812M2333l8290L01206N0571
11974A3970046j4807k1018l7427J13850J26355j09863r3914J2448J09782O1389
11964A4116841r2659Q4752J55122J94675J86593J65151N7672N1004l087j1546
11954A4904518k06934l7318J43236J18522j7865k8383J45404Q5436J09788J41356
$$ plain form
12027 11888169 12068971 12035010 11979013 11964802 11972201 12054484 12285496 12304423 12288057 12260739 12267706
12016 12267706 12306139 12341538 12249669 12283802 12478609 12612623 12628511 12324951 12205778 12342886
12006 12342886 12296203 12334580 12472922 12788091 12966268 13032675 13092002 13133005 13309794 13379317
11996 13379317 13461555 13483618 13528646 13465415 13418489 13458133 13434084 13441061 13167557 13177567 13208458
11985 13208458 13276033 13301693 13294882 13428827 13472175 13532414 13614226 13656559 13618269 13919475 13970046
11974 13970046 13955239 13934221 13896794 14010644 14136999 14027136 13933222 13945670 14055452 14116841
11964 14116841 14024182 14108934 14264056 14458731 14645324 14810475 14868147 14919151 14916064 14904518
11954 14904518 14697584 14660266 14803502 14922024 14904159 14875776 15021180 15106616 15216404 15357760
11944A5357760R644r189J53260K21004k1936j43252O1478K11631K04882K0562
11934A6065844Q7682K2700j20790o3309J35403P1790M8070P2357n4026J70969
11924A6436690J44340k0186l4527l7164J52246J75298k1056k23703k0098K08426
11914A6760266J42130L7541R6346n4517n7937m2496J11916r2261j72691j85814
11904A6542483j23185m4802j0265J2240k06114j41693j15656M2574j5832j23792
11894A5815958q8247o584m3998K208j1241P1294j33828r7237P0265k4363j26683
11883A5427544j26338j6533N8539j70145j11188J43937J35190j59833q0192p9608
11873A5021373j0925J68175J54836n7867L4958M3516j16721k16074j79269K70722
$$ plain form
11944 15357760 15367404 15358215 15511475 15732479 15710543 15567291 15628769 15840400 16045282 16065844
11934 16065844 16153526 16176226 16055436 15992127 16127530 16199320 16247390 16319747 16265721 16436690
11924 16436690 16581030 16560844 16526317 16489153 16641399 16816697 16795641 16571938 16551840 16760266
11914 16760266 16902396 16939937 17036283 16981766 16923829 16881333 16993249 16900988 16728297 16542483
11904 16542483 16419298 16374496 16364231 16376471 16170357 16028664 15913008 15955582 15939750 15815958
11894 15815958 15727711 15721127 15677129 15679337 15668096 15739390 15605562 15508325 15578590 15554227 15427544
11883 15427544 15301206 15284673 15343212 15173067 15061879 15205816 15341006 15181173 15100981 15021373
11873 15021373 15010448 15178623 15333459 15275592 15310550 15354066 15237345 15021271 14842002 15112724
11863A5112724M27581K26888k9637N8559l2002L1666J94202Q0577j04773K3120
11853A5988905J43974R9105J49504J00280N1090J31939K38719J19742m0297M0096
11843A7023057q9117J5760m9336k3643N0278J01676p4897m4391O8037Q1685j18231
11832A6940878Q4295p9192j95301j96475o4144j45138q128M32j01078j30842j67817
11821A5937490j92579q7749l9982j54979n5205j26183l06870k48019R239k69642
11811A4465521l48516r8909j25840j64958k55141l04497p5273Q2966r9634m10522
11801A2665197k22099L3126L309j00283j46827j5846P2649q1224j72508j88810
11791A1846684J51493m3564j23920r7634l3227J01684Q3959M6962k28123j07562
$$ plain form
11863 15112724 15540305 15767193 15737556 15796115 15764113 15795779 15989981 16070558 15965785 15988905
11853 15988905 16132879 16231984 16381488 16481768 16532858 16664797 16903516 17023258 16982961 17023057
11843 17023057 16933940 16949700 16900364 16876721 16926999 17028675 16953778 16909387 16977424 17059109 16940878
11832 16940878 17025173 16945981 16750680 16554205 16490061 16344923 16336795 16337227 16236149 16105307 15937490
11821 15937490 15744911 15657162 15617180 15462201 15406996 15280813 14973943 14725924 14735163 14465521
11811 14465521 14117005 14018096 13892256 13727298 13472157 13167660 13092387 13175353 13075719 12665197
11801 12665197 12443098 12476224 12479533 12379250 12232423 12216577 12289226 12208002 12035494 11846684
11791 11846684 11998177 11954613 11830693 11733059 11699832 11801516 11885475 11932437 11704314 11596752
11781A1596752j112J14110J06115Q8515l2708J2890J01795L4085r6542P9933J69077
11770A2172910J85099j7785k27714k34919P424J09526P9844j08587n7159J3838
11760A1922477P5157j47189k0753Q6181M2815J0696M2418k0893J12831L1365J30700
11749A2265805j24425o0856k2695K43009K7341r6418n036k899q1137j16805j11188
11738A1914696j24603J35054k109j55612L5294K68426J73130k08457j30724Q2308
11728A1987403K3947O2266m1950K8939J5952L8645L5040Q9567O3507R3016J20182
11717A2516514l6096R6490K19469J22394K01462Q2768J87971Q1659J43231R3793
11707A3709655R3184J60473K76573k0403J13726K16297J66728J38121n1156J64876
$$ plain form
11781 11596752 11595640 11709750 11815865 11904380 11871672 11884562 11986357 12020442 11923900 12003833 12172910
11770 12172910 12358009 12340224 12112510 11877591 11885015 11994541 12074385 11965798 11908639 11922477
11760 11922477 11997634 11850445 11829692 11915873 11958688 11969384 12011802 11990909 12103740 12135105 12265805
11749 12265805 12141380 12080524 12057829 12300838 12328179 12231761 12226725 12223826 12142689 12025884 11914696
11738 11914696 11790093 11925147 11923038 11767426 11802720 12071146 12244276 12035819 11905095 11987403
11728 11987403 12011350 12073616 12031666 12060605 12076557 12115202 12150242 12239809 12303316 12396332 12516514
11717 12516514 12480418 12576908 12796377 12918771 13120233 13203001 13390972 13472631 13615862 13709655
11707 13709655 13802839 13963312 14239885 14219482 14333208 14549505 14716233 14854354 14803198 14968074
11697A4968074K23708J01889K15069n4886n3916J13872N1407l1666m0902p6211
11687A5416438o0413J3236m6341k532J82630N2830o1858N908J3009j9953k8115
11676A5464839p83j8081R5733m564K9804k5362J9132r9155j12643j18431N445
11665A5235934K5677l5503K5442M2486J52732J38381j3191J16447J21089K48490
11655A6057984L04559K69615J03947K17570J46618J49857K75673L62897K92066
11646A8180786K80482K67555L52107L45088L08080M48078L72578M25691L16518
11637B1296963N04515N35920N09427L67714L92513O66193N79658M87330M29349
11628B5769582O51919N74489O02887N62862M77267N24803O08618N09072O39431
$$ plain form
11697 14968074 15191782 15293671 15508740 15453854 15399938 15513810 15565217 15533551 15492649 15416438
11687 15416438 15356025 15369261 15322920 15320388 15503018 15555848 15493990 15499898 15512907 15492954 15464839
11676 15464839 15464056 15445975 15541708 15537144 15566948 15541586 15560718 15461563 15348920 15230489 15235934
11665 15235934 15261611 15226108 15251550 15294036 15446768 15585149 15571958 15688405 15809494 16057984
11655 16057984 16362543 16632158 16736105 16953675 17100293 17250150 17525823 17888720 18180786
11646 18180786 18461268 18728823 19080930 19426018 19734098 20182176 20554754 20980445 21296963
11637 21296963 21801478 22337398 22846825 23214539 23607052 24273245 24852903 25340233 25769582
11628 25769582 26421501 26995990 27598877 28161739 28639006 29163809 29772427 30281499 30920930
11619C0920930N86121M55968L35494K01069J6753j73953k44421k69745n98199
11610C1230017p86688m89664m93949o40815m47082n47639n39530l79109l85669
11601B6519872m33654l97466l85838k07615J80132p6923M9136M15802K66309R8201
11591B6027956J40441K82130L75910M40204L72691K08575J36118m5812J25484
11582B8063697l0213r9526k20518l89806n55791o38108m87146n93744p03474p90331
11572B3555040n62857n51446n23214o02611n43211n30281k60918k40753m42025
11563A9297724l52210l7836j07674k27370l02767j58449n3626n0365q9368P5617
11553A7993676R892n2872J95508L19282N0690M4576J73223J50267L33708J81864
$$ plain form
11619 30920930 31507051 31963019 32298513 32499582 32516335 32342382 32097961 31828216 31230017
11610 31230017 30443329 29953665 29459716 28818901 28371819 27824180 27284650 26905541 26519872
11601 26519872 26086218 25688752 25302914 25095299 25275431 25198508 25247644 25663446 25929755 26027956
11591 26027956 26168397 26450527 26826437 27266641 27639332 27847907 27984025 27938213 28063697
11582 28063697 28033484 27933958 27713440 27323634 26767843 26129735 25642589 25048845 24345371 23555040
11572 23555040 22992183 22440737 21917523 21314912 20771701 20241420 19980502 19739749 19297724
11563 19297724 18945514 18907678 18800004 18572634 18269867 18111418 18057792 18007427 17918059 17993676
11553 17993676 18003568 17950696 18146204 18465486 18516176 18560752 18733975 18884242 19217950 19399814
11543A9399814J48126K70662K29851J68098L44439L98690K31378J52088K0815
11534B1363961j47297j94738j02244j30087m25701n51826n76760o20459n63265
11525A8051584n44787m41133o61057n87099n17339n67357n07091k91428k78346
11516A3655947k98295j35974n8831j15167l0100J42591J61051P0659J74782L38904
11506A3905567L59934J02830K07951K11471J28219N673k43181j57908j09525j70012
11496A4241019n83955p21227p78165l93204n81707o36672l91048m58545m27920
11487I268576j80853m87414o07198m54086n15090m48201k05813k42883l92867
11478E734171l53029q6112j83305o9087j04217j57077k87666j32413j4283k23537
$$ plain form
11543 19399814 19547940 19818602 20048453 20216551 20560990 20959680 21191058 21343146 21363961
11534 21363961 21216664 21021926 20919682 20789595 20363894 19812068 19235308 18614849 18051584
11525 18051584 17506797 17065664 16404607 15817508 15300169 14732812 14225721 13934293 13655947
11516 13655947 13357652 13221678 13162847 13047680 13017580 13160171 13321222 13391881 13566663 13905567
11506 13905567 14265501 14368331 14576282 14787753 14915972 14921645 14678464 14520556 14411031 14241019
11496 14241019 13657064 12935837 12157672 11764468 11182761 10546089 10155041 9696496 9268576
11487 9268576 9087723 8600309 7993111 7539025 7023935 6575734 6369921 6127038 5734171
11478 5734171 5381142 5295030 5111725 5042638 4938421 4781344 4493678 4361265 4346982 4123445
11468D123445j31994q1906j5556n5648j38521j17599l5567J08613j5479K0474
11458C660262j16291k59969j1642J05151m7513k46201K9908j39284j08035P7496
11448B943882N3482J9454k7245r6708r9030l6907l2702m958J1007m9056p7086
11437B604133J8989J47825J19387m1911j46225k6551K5354j71356j88895M4464
11427B385214q4619N9247N9923j91305k4151P7478J68690J77843J17075J21589
11417B866984r5452k55762j24624k1828L2411P3037n1613o2656L5518J6678M6080
11406B458773N1301k816L3095k22331j00501k9890r7814K5765O7392m4792N8706
11395B196888j7483p5731L7746P258o3938j06336j86347j86838J4530L5304J62605
$$ plain form
11468 4123445 3991451 3909545 3893989 3838341 3699820 3582221 3546654 3655267 3639788 3660262
11458 3660262 3543971 3284002 3272360 3377511 3329998 3083797 3113705 2974421 2866386 2943882
11448 2943882 2997364 3016818 2989573 2892865 2793835 2756928 2724226 2719268 2730275 2681219 2604133
11437 2604133 2623122 2770947 2890334 2848423 2702198 2675647 2701001 2529645 2340750 2385214
11427 2385214 2300595 2359842 2419765 2228460 2204309 2281787 2450477 2628320 2745395 2866984
11417 2866984 2771532 2515770 2391146 2369318 2401729 2474766 2423153 2360497 2396015 2412693 2458773
11406 2458773 2510074 2507258 2540353 2318022 2217521 2187631 2089817 2115582 2182974 2138182 2196888
11395 2196888 2179405 2103674 2141420 2148678 2084740 1978404 1792057 1605219 1619749 1655053 1817658
11384A817658K38893j9329r9916J09828N6026Q0720o0740Q5292q9579j16772j08044
11373A894037J60086p3008j19164p57l2753p4300n1943J74515J13617Q1501K0835
11362B092666n0683J21753k7425j02528n9929m491m9328N874j47448m3667K34130
11351A968924J30027J4694k15750j36322N8137K3311k6906L1967r1794N0274J59362
11340A965924l3882k3589l5020K4769Q7625n8236j06603P7275O8390J22768r2478
11329A996943j06197j2026j0058L5486M2367r7178n8646j7159j11448L7175l1124
11318A668135j7727M1055P3122j01498k2948J85362Q1869K18294O2713p0358j49440
11307A968579O6550l1572N767k7752j70985K06634L9121L9572M8014j29069k30881
$$ plain form
11384 1817658 2056551 2037222 1937306 2047134 2103160 2183880 2123140 2208432 2118853 2002081 1894037
11373 1894037 2054123 1981115 1861951 1861194 1828441 1754141 1702198 1876713 1990330 2071831 2092666
11362 2092666 2041983 2163736 2136311 2033783 1973854 1969363 1920035 1925909 1778461 1734794 1968924
11351 1968924 2098951 2113645 1897895 1761573 1819710 1843021 1816115 1848082 1756288 1806562 1965924
11340 1965924 1932042 1908453 1873433 1898202 1985827 1927591 1820988 1898263 1966653 2089421 1996943
11329 1996943 1890746 1878720 1868662 1904148 1946515 1849337 1790691 1773532 1662084 1699259 1668135
11318 1668135 1650408 1691463 1764585 1663087 1640139 1825501 1907370 2125664 2188377 2118019 1968579
11307 1968579 2035129 2003557 2009324 1981572 1810587 2017221 2056342 2095914 2143928 2014859 1783978
11296A783978J21478K04016R9400Q2735l30253N5824L0928Q7631J46160J83848
11286B465745K347r3425K6310J14856k2606r0266J77106J14361N3070M289j45337
11275B606450l6882J07155J67341J49715J07342O9186R9458J46515k3515O138
11265C398903K15572p2622m3386J97487J490j47369J28343K95184K21892R4566
11255D290060L4640L1601R9654K5906J05779J01283J66836L69287J40771k1504
11245E344313j41978J15571J91399L71949L03739J5110R1198K50604K01614K07695
11235F951214O7798j10794N6634L4095J52995J82711M6202l8251N1225O3788P1884
11224G529501j2905O6974K3314L0780l5423J6896M2593J49159K5449j52509j74113
$$ plain form
11296 1783978 1905456 2109472 2208872 2291607 1961354 2017178 2048106 2135737 2281897 2465745
11286 2465745 2468092 2374667 2400977 2515833 2493227 2402961 2580067 2694428 2747498 2751787 2606450
11275 2606450 2569568 2676723 2844064 2993779 3101121 3170307 3269765 3416280 3392765 3398903
11265 3398903 3614475 3541853 3498467 3695954 3697444 3550075 3678418 3973602 4195494 4290060
11255 4290060 4324700 4356301 4455955 4481861 4587640 4688923 4855759 5225046 5365817 5344313
11245 5344313 5202335 5317906 5509305 5881254 6184993 6200103 6291301 6541905 6743519 6951214
11235 6951214 7019012 6908218 6964852 6998947 7151942 7334653 7380855 7342604 7393829 7457617 7529501
11224 7529501 7516596 7583570 7606884 7637664 7602241 7619137 7661730 7810889 7836338 7683829 7509716
11213G509716K6563J35745r5061j20873m8099l3718p335j0568l4786j3961M7273
11202G354896r2233j88917J18480J70311p2800j51106J5456J42583K1319J9555
11192G337544N7569L4785k8008J06951J40988J14622r015K2764L9737J08752O6286
11181G992975J22674J20721n8688j06087M6922J44671Q4284K09997J13217J07261
11171H777947L0198M4104J43515q3253j56331j32309J84839L06856J37977Q1819
11161I335362L1203K39432J73841p6915r1659L2585P5151J61108J34627K71152
11151A0285887P2927p6745J66746J01221n9280p4733m9962N3079J79617p4843
11141A0523914m8209O6772K8299j52533k92839j32049L5708o1441O8423N8405
$$ plain form
11213 7509716 7536279 7672024 7576963 7456090 7407991 7374273 7366938 7356370 7321584 7307623 7354896
11202 7354896 7262663 7073746 7192226 7362537 7289737 7138631 7154087 7296670 7317989 7337544
11192 7337544 7395113 7429898 7401890 7508841 7649829 7764451 7755436 7778200 7817937 7926689 7992975
11181 7992975 8115649 8236370 8177682 8071595 8118517 8263188 8347472 8557469 8670686 8777947
11171 8777947 8808145 8852249 8995764 8912511 8756180 8623871 8808710 9115566 9253543 9335362
11161 9335362 9366565 9605997 9779838 9702923 9611264 9643849 9719000 9880108 10014735 10285887
11151 10285887 10358814 10282069 10448815 10550036 10490756 10416023 10366061 10419140 10598757 10523914
11141 10523914 10475705 10542477 10570776 10418243 10125404 9993355 10029063 9967622 10036045 10094450
11131A0094450k79607r3906o4242Q732j44785n6984L7266j32770L2900q2123l22900
11120H996031j02141m9875k46671r7610j64004j55804j6678j03914M8171n3027
11110H054478j71902l6006j21573l998k41897k96570j66660p1792J5459q0237
11100F879302k68798j49057l25616m46133j11737j05311q8600j30212L3482k4843
11090E262477q4232j46788j67590l11286j31359J25612P0380K9293m6982K7912
11080D627437m9818k08988l3453K81824J71018j05344l6516O0832J38239L5239
11070D880470K26268K5419k24467k6741J28146o0981N0611q3393J50980L1508
11060E097820k4452l6563n6800o7124j24225o4727J3746l6208n2534R4389L1944
$$ plain form
11131 10094450 9814843 9720937 9656695 9665427 9520642 9463658 9500924 9368154 9401054 9318931 8996031
11120 8996031 8893890 8844015 8597344 8499734 8335730 8179926 8163248 8059334 8107505 8054478
11110 8054478 7882576 7846570 7724997 7720999 7479102 7182532 7015872 6944080 6959539 6879302
11100 6879302 6610504 6461447 6135831 5689698 5577961 5472650 5384050 5253838 5287320 5262477
11090 5262477 5178245 5031457 4863867 4552581 4421222 4546834 4617214 4646507 4599525 4627437
11080 4627437 4577619 4368631 4335178 4617002 4788020 4682676 4646160 4706992 4845231 4880470
11070 4880470 5106738 5132157 4907690 4880949 5009095 4948114 4998725 4915332 5066312 5097820
11060 5097820 5073368 5036805 4980005 4912881 4788656 4723929 4737675 4701467 4648933 4743322 4775266
11049D775266J81887J19189q0677j34319j66891j64628j40563J2614N554m3202
11039D364230M0375J58065J03146o4145J9744J5123k45237j68943j16501j43151
11029C962706j6632q3281K10058K72071K29149M0308j46349j36133k57949m79320
11019C594628j66650k88715o7865L3340J71119R537q7379j86522j29843k4202
11009B857448j89218j72386o7015j50732O420J46909j67892k56859J19352J3374
10999B139401k02593k73909k54662j89794p2007R6797m6790k09159j55265N7259
10989H89278P7923r4992m9327Q507P7254K5740J94951j08423n8958m3376j43553
10978G75024p2563o4763J8687J54114J64299q0878K4486K9288j58476j15498j9706
$$ plain form
11049 4775266 4957153 5076342 4995665 4861346 4694455 4529827 4389264 4401878 4407432 4364230
11039 4364230 4404605 4562670 4665816 4601671 4621415 4636538 4391301 4222358 4105857 3962706
11029 3962706 3946074 3862793 4072851 4344922 4574071 4614379 4468030 4331897 4073948 3594628
11019 3594628 3427978 3139263 3071398 3104738 3275857 3285394 3198015 3011493 2881650 2857448
11009 2857448 2668230 2495844 2428829 2278097 2284517 2431426 2263534 2006675 2126027 2139401
10999 2139401 1936808 1662899 1408237 1218443 1146436 1243233 1196443 987284 832019 889278
10989 889278 967201 872209 822882 831389 908643 934383 1129334 1020911 961953 918577 775024
10978 775024 702461 637698 656385 810499 974798 893920 918406 947694 789218 673720 654014
10967F54014l129J56465K7794r8727j94026P133J31680O6864N6583q1636O0673
10956G83688J64072J35522j68357j47307j7798m0399l2683N6106K683K67659J1952
10945A015138j84403r7090k1186J8271L6626j17272K4452k9400O3485J62250M8808
10934I19679J14869q2959j88310l5112O6541j25130k81667J326N0478P0675J1151
10923E21541J28099K4650L88L2546J10105p532r1449m9474m1293m8819p4078q8666
10911D16018J52074J12659o6045m4557J07451k1438N247O3830o1641j31046K4377
10900E56929l9384L6693Q8824O1137j2553j26065m0889J84961m042j10260j90292
10889D05059K8723K41328J29379K194j88163p682j23694m5800J16252J611j435
$$ plain form
10967 654014 650885 807350 835144 736417 542391 549524 681204 748068 804651 723015 783688
10956 783688 947760 1083282 914925 767618 749820 709421 676738 732844 735527 1003186 1015138
10945 1015138 830735 733645 712459 730730 767356 650084 674536 645136 708621 870871 919679
10934 919679 1034548 951589 763279 728167 794708 669578 387911 389237 439715 510390 521541
10923 521541 649640 674290 674678 707224 817329 809797 718348 668874 627581 578762 504684 416018
10911 416018 568092 680751 614706 570149 677600 656162 661409 725239 663598 532552 556929
10900 556929 517545 554238 643062 704199 691646 565581 524692 709653 705611 595351 405059
10889 405059 433782 675110 804489 806683 618520 610838 487144 441344 557596 559207 557772
10878E57772J69027N521j12444N9398J3576n7794Q6758p3l8129N9269j73534j19955
10866D49392o5021J60686K02009K51445P5911J03180j32065j24488j20676J09070
10856I09443j61516q3531J84935q4904O9540J02712K1839j74850P0807j2445p9562
10845G62468Q3192M571r1663k7042P816n0377j49959N1166N7159r6592M0980J60891
10833G52610M9660J18278M3607O3665l4723k16329j60657L4260J70627J25040
10823I46038J3450j04303Q6286r030r1928j05824R9826J52748O0953p0991O2283
10812A039508r1224J19777J38014R7846R8945J2728k34370j19211r3589J06990
10802A075414j5524M074M8988j9653j58012r0232N736l6342n9882n8621J51521
$$ plain form
10878 557772 726799 732320 619876 679274 692850 635056 721814 721741 683612 742881 569347 449392
10866 449392 384371 545057 747066 998511 1074422 1177602 1045537 921049 800373 909443
10856 909443 747927 664396 849331 764427 833967 936679 958518 783668 854475 842030 762468
10845 762468 845660 850231 758568 731526 739342 688965 539006 590172 647331 550739 591719 752610
10833 752610 802270 920548 964155 1027820 993097 776768 616111 650371 820998 946038
10823 946038 959488 855185 941471 932441 840513 734689 834515 987263 1048216 977225 1039508
10812 1039508 948284 1068061 1206075 1303921 1402866 1415594 1181224 1062013 968424 1075414
10802 1075414 1059890 1063964 1112952 1093299 935287 845055 850791 814449 754567 695946 847467
10791H47467O957j84672Q9215N3921m1564n4783p0468o2695K84520R9705M0914
10780A008517Q9807n9084n7026q6678j88024q616J43947P2932J20957j02350j67691
10769G66691j57308l5182R9893q9410j31498k0344J77677K49644K4869K9488o468
10758I08052q6400M55l5322j05256P0721N420m3332J01464o6431k17500J0251
10747E42122L34148J07143j43980j33587n9004J28220J25279P6380k0445R0512
10737A046788l0556N765l6803j70676k32443L451N6444R4838N1889J39403J46993
10726A075093l3439O4029m6153n7550n7697q4000Q6703J62852n0544r0205r4114
10715H74975L5727K33751m4523o0240j502O1762o2210l1499L5587J85549J11152
$$ plain form
10791 847467 854424 669752 758967 812888 771324 716541 646073 583378 867898 967603 1008517
10780 1008517 1098324 1039240 982214 895536 707512 698896 842843 915775 1036732 934382 766691
10769 766691 609383 574201 674094 584684 453186 432842 610519 860163 885032 914520 908052
10758 908052 821652 822107 786785 681529 752250 757670 714338 815802 749371 531871 542122
10747 542122 876270 983413 839433 705846 646842 775062 900341 976721 956276 1046788
10737 1046788 1016232 1021997 985194 814518 582075 585526 641970 736808 788697 928100 1075093
10726 1075093 1041654 1105683 1059530 1001980 944283 860283 946986 1109838 1059294 969089 874975
10715 874975 910702 1144453 1099930 1039690 1038188 1099950 1037740 1006241 1041828 1227377 1338529
10704A338529M3975j53196j99151R5170P5840K9640j12105P2767O4804J65016
10694A421289k1972m4089o799l4099o7781Q0845L2765O0597J2296k2082J53373
10683A564343Q1288l4931M7226K708P8111k6268q7493j45296J35452L0429J27640
10672A773209N6137j93216N4156j08092N5697J50240j4675J0931m3197K47295
10662A988485j03762J1329J90969J74882P0213R4781M5268L4296P2482O701m4544
10651B541100P2767Q0175K39291K39022P7751J33587J26234R8419L3473K41424
10641C883243L90095M24594K77027M42165L97962N49451O64544P25976P28925
10632H483982O77727N86682Q39414J238996J453870J638260K421480L378491M600390
$$ plain form
10704 1338529 1382504 1229308 1030157 1125327 1201167 1230807 1118702 1191469 1256273 1421289
10694 1421289 1399317 1355228 1348429 1314330 1246549 1327394 1360159 1420756 1433052 1410970 1564343
10683 1564343 1645631 1610700 1657926 1660634 1738745 1712477 1624984 1479688 1615140 1645569 1773209
10672 1773209 1829346 1636130 1690286 1582194 1637891 1788131 1773456 1784387 1741190 1988485
10662 1988485 1884723 1896052 2087021 2261903 2332116 2426897 2472165 2506461 2578943 2585644 2541100
10651 2541100 2613867 2694042 2933333 3172355 3250106 3383693 3509927 3608346 3641819 3883243
10641 3883243 4273338 4697932 4974959 5417124 5815086 6364537 7029081 7755057 8483982
10632 8483982 9161709 9748391 10587805 11826801 13280671 14918931 17340411 20718902 25319292
10623B5319292O232991Q743270J1627874J4866482J7491783J7470585J3450734
10616A15203011N720904j952383n666758n111331j507543M237009J1070672J9216575
10608A41210156K8150700L4725407L4130705K2434818J915740j6406722k3365754
10601B22795050j9941481j1392468p71227J1242736K4287242L6661751M3800040
10594C06681643L9694641J9961571j0960317l6097607m3715737l8239344k7289539
10587B10035311j5011934k998073Q232787J7677442K2456049J8423087L812671
10580B62627340j7040502l2101527l5134689k9701714k1438838j3253462o183586
10573A07773022k33973L793738N324963K785390l544678j1485190j6579752j7424958
$$ plain form
10623 25319292 31552283 40295553 51923427 66789909 84281692 101752277 115203011
10616 115203011 120923915 118971532 113304774 108193443 106685900 110922909 121993581 141210156
10608 141210156 169360856 204086263 238216968 260651786 262567526 246160804 222795050
10601 222795050 202853569 191461101 190689874 201932610 226219852 262881603 306681643
10594 306681643 346376284 366337855 355377538 319279931 275564194 237324850 210035311
10587 210035311 195023377 192025304 200258091 217935533 240391582 258814669 262627340
10580 262627340 245586838 213485311 178350622 148648908 127210070 113956608 107773022
10573 107773022 107539049 111332787 116657750 119443140 115898462 104413272 87833520 70408562
10565G0408562j5344865j2211396r331382p056350n122286l936254k922558k547300
10557A1936171j840278j299623j279842r23094p23998o49283o17735m41780m24439
10548C736099k78307l09190l51251j43110l9501k83303k67078k35686M874n8134
10538A775413k28727k06167j37632J964N8319o4095j26621k0134j49879p616j9607
10527H75218q1258R54K10114j40639q5249K1627j67939r8049J25952N3420r4484
10516F19667m5473L2489P8152q656L5583l0236K131k29681q4557K62741R976r8010
10504E44126p0687j94476l0317o0107O7457O7654K2326j29817j15706J40265J34587
10493C75305o8793K794K9695o7795j32575k20668j27769L9361K88172Q0521n4579
$$ plain form
10565 70408562 55063697 42852301 33520919 26464569 21342283 17406029 14483471 11936171
10557 11936171 10095893 8796270 7516428 6593334 5869336 5220053 4602318 4160538 3736099
10548 3736099 3457792 3148602 2797351 2654241 2614740 2331437 2064359 1828673 1833547 1775413
10538 1775413 1546686 1340519 1202887 1204851 1263170 1199075 1072454 1052320 902441 894825 875218
10527 875218 793960 794914 1005028 864389 779140 800767 632828 534779 660731 714151 619667
10516 619667 574194 606683 684835 676179 711762 681526 683657 453976 369419 632160 642136 544126
10504 544126 473439 278963 248646 188539 255996 323650 345976 216159 100453 240718 375305
10493 375305 306512 309306 339001 271206 138631 -82037 -209806 -170445 117727 198248 143669
10482A43669n5524q5383N6337K83069r169j53736l5174q353J14444J05894r8331
10471B57743O4685K322j3509R3439M569J5063J35331K16169J01374K14953K65719
10460A357858J60972K11415P5547j01190m55525l31271k51177o1017J35335j93810
10450E47137m2084O6733k5165j02118o3551m9173m5962o6831L4342R8475n0561
10439C01242p5765J675N962M6495j3635r3127N6678j18991j74204M0335K7395
10428D060k5261r9029L6486j4605m9461l4394J20379P6414J18609L987j85198
10417d8013m189l5939j6609N8900N426q0047M2735o1538j14218J51948R5448j6698
10405b2794n6340l9122j8502o6893o6247m8116J7640N1164r2457n4352K45168
$$ plain form
10482 143669 88145 2762 59099 342168 332999 179263 144089 135736 250180 356074 257743
10471 257743 322428 324750 311241 404680 409249 424312 559643 775812 877186 1092139 1357858
10460 1357858 1518830 1730245 1805792 1704602 1249077 917806 666629 605612 740947 547137
10450 547137 505053 571786 546621 444503 380952 331779 285817 218986 253328 351803 301242
10439 301242 225477 227152 233114 279609 265974 172847 229525 110534 -63670 -23335 4060
10428 4060 -21201 -120230 -83744 -98349 -147810 -182204 -61825 14589 133198 137185 -48013
10417 -48013 -52202 -88141 -104750 -45850 -40424 -120471 -77736 -139274 -253492 -101544 -6096 -22794
10405 -22794 -79134 -118256 -136758 -203651 -269898 -318014 -300374 -249210 -341667 -396019 -150851
10394a50851J18390o2467r7075M3168J2287j24436k8257O9028p455N9954J8419
10383a49295j53494N3514J41465j32729n8396m6057L4152M4889k9465l3563j2717
10372c41696o7708L8881R8607J4048j62185J31522k5863J12624N0202n5754k4761
10361b32083J91581k250k14287l0654N3059k6117n8167M6237J02772j9312l9950
10350b29171J54640N8226N1652J28555l3874j06233j7461P4216k1001j16414j69300
10339b26165j5915K15740M7990j50403M258o6347L8686O955K0946j29871K1943
10328b32183J01984J16235l0801j75453j31516M6773j4350J2011J87368K9587
10318i0345q7775M0769P3744j13658K6281m0642O9508n846m2824n319n1244N9228
$$ plain form
10394 -150851 -32461 -94928 -192003 -148835 -136548 -260984 -289241 -220213 -227668 -167714 -149295
10383 -149295 -302789 -249275 -107810 -240539 -298935 -344992 -310840 -265951 -295416 -328979 -341696
10372 -341696 -409404 -370523 -271916 -257868 -420053 -288531 -314394 -201770 -151568 -207322 -232083
10361 -232083 -40502 -42752 -257039 -287693 -234634 -260751 -318918 -272681 -169909 -189221 -229171
10350 -229171 -74531 -16305 35347 163902 130028 23795 6334 80550 59549 -56865 -226165
10339 -226165 -242080 -26340 21650 -128753 -124495 -190842 -152156 -145201 -124255 -254126 -232183
10328 -232183 -130199 -13964 -44765 -220218 -351734 -304961 -319311 -307300 -119932 -90345
10318 -90345 -178120 -137351 -63607 -177265 -150984 -191626 -122118 -127964 -170788 -176107 -227351 -168123
10306a68123Q9127K4705j8806j07711j26832Q6344J88894R2514j43189j48428
10296b31505Q037K97983K18406K0409j01880n5075k00095L4537R1416j22177j04294
10285a44238L6330M2182N0572l9975j93686n0797P3995J36520K05689l2522P7382
10274A61452l9015k0593o6514j9440p2900j95579q2556R3983P6010l2939N3479
10263a44612Q8199K9011l6602j8918J07253l5826j30495o9458J85729K25O3629
10252C8135N4538J59928J17810r9647j31916Q8020J40363m9571k8993k38074j14240
10241f3647j50761l2805K5962j7680L635J0214k19068r8662Q7715Q4055L8811
10230c32231P7915K54859k0178l4725M0665j62160j69038J23899K06654p8997
$$ plain form
10306 -168123 -78996 -54291 -73097 -180808 -307640 -221296 -32402 60112 -83077 -231505
10296 -231505 -223468 74515 292921 313330 211450 156375 -43720 -9183 82233 -39944 -144238
10285 -144238 -107908 -65726 -15154 -55129 -248815 -299612 -225617 -89097 116592 84070 161452
10274 161452 122437 101844 35330 15890 -57010 -252589 -335145 -241162 -165152 -198091 -144612
10263 -144612 -56413 -27402 -64004 -82922 24331 -11495 -141990 -211448 -25719 -25494 38135
10252 38135 92673 252601 370411 270764 138848 226868 367231 317660 288667 50593 -63647
10241 -63647 -214408 -247213 -221251 -238931 -235296 -225082 -444150 -542812 -455097 -371042 -332231
10230 -332231 -254316 543 -19635 -54360 -13695 -175855 -344893 -220994 -14340 -93337
10220i3337j76525l266o1504Q2054J79534J94938k38558r1394m5199N4175L7059
10209a62023L7551K9185N8864j02478j10080M3726J03963N0168K5586J09758N0417
10198A34637j10828j06329j0112M7498M1227o164J40404K4903r831n8685Q5959
10187A72679q1869q4851J15406J21925J9482N9790J41508J72278J71625P30k5602
10176G83101q1008l492Q080L5140J60754O5377J88573L86836J71780j09074j08534
10165A497533j09434k65104j92448J34115J35172J15505K35965L01187J39470
10156A991961J09519N2971j81728k41803k31850k57329r8782k30493J09900K83435
10146A305801L32325M4451n3077p7037l62476k58933j42197l02574n0294K7258
$$ plain form
10220 -93337 -269862 -273128 -334632 -252578 -73044 121894 -116664 -208058 -253257 -199082 -162023
10209 -162023 -124472 -95287 -36423 -138901 -248981 -205255 -101292 -51124 -25538 84220 134637
10198 134637 23809 -82520 -92632 -45134 -3907 -10071 130333 155236 145405 86720 172679
10187 172679 90810 5959 121365 243290 262772 322562 464070 636348 807973 808703 783101
10176 783101 702093 698601 706681 741821 902575 967952 1156525 1543361 1715141 1606067 1497533
10165 1497533 1388099 1122995 930547 1064662 1199834 1315339 1551304 1852491 1991961
10156 1991961 2101480 2154451 1972723 1730920 1499070 1241741 1142959 912466 1022366 1305801
10146 1305801 1638126 1682577 1629500 1552463 1189987 931054 788857 486283 435989 463247
10136D63247J42957M4928q4884j06188O1960o5590o7190L4109j96146k68368Q792
10125c2373J37700l6164j30168j7585j5679J05813J57742Q3474r3109k2401o494
10114A30756p9768N5657j10827N8578J12700Q5968M9080j30930n7669k1041K652
10103I5156N8736J71099m5659k28412j28759q113j1210N5301j45386J40169J98494
10092A51416J14968j99232j83227m8318j8351j5629p8923O5940J27521J31000
10082D7165P5892o6369o4634J59828J19787l3629n2081P3533J02727J30660j29047
10071C63832o7999k6308J88653J14234J08204J06846P6877J49151L31481L83010
10061A727981L11192N67615Q66985J072981J305127J538237J392492J288041J339727
$$ plain form
10136 463247 606204 651132 566248 460060 522020 456430 389240 423349 227203 -41165 -32373
10125 -32373 105327 69163 -61005 -78590 -94269 11544 169286 252760 159651 137250 130756
10114 130756 50988 106645 -4182 54396 167096 253064 302144 171214 113545 92504 95156
10103 95156 153892 324991 279332 50920 -77839 -85952 -97162 -41861 -187247 -47078 151416
10092 151416 266384 67152 -116075 -164393 -182744 -198373 -277296 -211356 -83835 47165
10082 47165 123057 56688 -7946 151882 271669 238040 185959 259492 362219 492879 363832
10071 363832 295833 269525 458178 572412 680616 787462 864339 1013490 1344971 1727981
10061 1727981 2039173 2606788 3473773 4546754 5851881 7390118 8782610 10070651 11410378
10052A1410378J085915L91010k87281p78095r90087j303457j396133j413147j524254
10043E194849j223043q46813n89582n59086n26993m22542m4435q9186k85807j60989
10033D46373n0233j70971j0312J01633m0765Q1555j38941r6179J42174J38436
10023D02770q603n6437j94316j31105M947p9411N8914r960k5247J8818j00895
10012a20525j40018J52181k4376j27438L5783j13488r0803p1515J10084l3616
10002d23731N9540K02461O4281J20200K2767o5506n2847j1528o2954k0684P500
9991a60501J12515K03594j67763k00024J6728J04854M3948O7045p1808j94952
9981b46364k095K62102Q4347M757K5250p2588j28375o5146O9317P9900j01584
$$ plain form
10052 11410378 12496293 12887303 12600022 11821927 10831840 9528383 8132250 6719103 5194849
10043 5194849 3971806 3124993 2535411 1976325 1449332 1026790 982355 893169 607362 446373
10033 446373 396140 225169 214857 316490 275725 357280 218339 122160 264334 402770
10023 402770 394167 337730 143414 12309 17256 -62155 -3241 -13201 -38448 -19630 -120525
10012 -120525 -260543 -108362 -132738 -260176 -224393 -337881 -428684 -500199 -390115 -423731
10002 -423731 -364191 -161730 -97449 22751 45518 -19988 -72835 -84363 -147317 -168001 -160501
9991 -160501 -47986 155608 -12155 -212179 -195451 -90597 -46649 20396 -51412 -246364
9981 -246364 -248459 13643 97990 102747 127997 55409 -72966 -138112 -68795 11105 -90479
9970i0479L861r053L0747J07156j8304o8768R6953P367J1544m0523j7242m3011
9958b9752o5423k1199p712p1837J1925O8841Q6756Q023j24784j17171K7805Q5899
9946a48629J70234J12440k3748J0256m5889j42879J8973Q852m3229j91256J28297
9935a46578J59477J5173J7203L9716M7106J12260L0388L4274p8496m3328p3903
9924A13292j93672q6519L9377j30980J02618j23588O2054K19802j5330o1232j52530
9913b26708P5K47802P0345o4310q8639j22228j07426N4798M6032k2196k3722j06178
9901c42355O3046P3983J32635J75215j4798k84062O2437N987k0599j28221P8843
9890a97889K60419J16659L1407l9908j51821j08199L4040K05573J19475j31119
$$ plain form
9970 -90479 -86618 -95671 -64924 42232 23928 -44840 52113 59480 71024 30501 13259 -29752
9958 -29752 -95175 -116374 -124086 -195923 -183998 -115157 -28401 -20378 -145162 -262333 -234528 -148629
9946 -148629 21605 134045 110297 120553 74664 -68215 -49242 -40390 -83619 -274875 -146578
9935 -146578 12899 28072 45275 84991 132097 244357 274745 309019 230523 187195 113292
9924 113292 -80380 -166899 -127522 -258502 -155884 -279472 -217418 2384 -12946 -74178 -226708
9913 -226708 -226633 21169 91514 27204 -61435 -183663 -291089 -236291 -190259 -212455 -236177 -342355
9901 -342355 -279309 -205326 -72691 102524 87726 -196336 -133899 -127912 -148511 -276732 -197889
9890 -197889 62530 179189 210596 170688 18867 -89332 -55292 150281 269756 138637
9880A38637j08284Q4301J02254p6576p9876k6715R7336Q7424j45235j02184M6356
9869A7438J28024k6540l8938j67398n1618J97427N250p7415j31929N5222n7195
9858a47672M4427K92419r320j45530P0645j72100p9961P8092l6006l5764m4684
9847a85454m6811o98M1009J75466J27825R5659N9147k01550k48296n2793J40107
9836i6389M0812P3989P2921j3506j18001P4075J05615k35965j1262O0447l2169
9825g9433K566j60228j44905P0224j06830O2378K15608K22742N0930k23460r80
9814i1388j4589j24066m0507R4110j74018n0641K7836o2347K1671J82861J49861
9803h1217K5363O7700L2873j2608o4076O8415J8933N2951L7977m2894k22016m1915
$$ plain form
9880 138637 30353 114654 216908 140332 60456 33741 131077 218501 73266 -28918 17438
9869 17438 145462 118922 79984 -87414 -139032 58395 63645 -13770 -145699 -90477 -147672
9858 -147672 -103245 189174 179854 34324 104969 -67131 -147092 -69000 -105006 -140770 -185454
9847 -185454 -232265 -232963 -191954 -16488 111337 206996 266143 64593 -183703 -236496 -96389
9836 -96389 -55577 18412 91333 77827 -40174 33901 139516 -96449 -107711 -47264 -79433
9825 -79433 -76867 -237095 -382000 -311776 -418606 -356228 -140620 82122 133052 -90408 -91388
9814 -91388 -105977 -230043 -270550 -176440 -350458 -401099 -373263 -435610 -413939 -231078 -81217
9803 -81217 -55854 11846 44719 32111 -31965 36450 55383 108334 146311 103417 -118599 -160514
9791a60514K07591P6464k33275o7724J13709l6314L9232L3745J06136J43381l213
9780B19218j77888k6780J5966j397j35131J5117J03241M2968n0915k11977j82596
9769c90174k5254P6464K15959J44910K04813M0473n5156r7451r8201K5974j9081
9758B3276J2252M2159J15951n8749j16770j6680k2689q874r4726l1339Q1641q8812
9746a63360n9610K73758R872K3509j07515J55232Q1047r5365j06801r6026m9968
9735a35227j3339P1743J38455r1189K8653J35660J38495J682l00756o5994P752
9724h4065j22338j1336j82043n1853L3013J55180J88084K13888K53931k2955l85870
9713a6364k45883M3368J02586J01608L7084N4036P6441m4803r1398R0836J09894
$$ plain form
9791 -160514 47077 123541 -109734 -177458 -63749 -100063 -60831 -27086 79050 222431 219218
9780 219218 41330 14550 30516 29119 -106012 -90895 12346 55314 4399 -207578 -390174
9769 -390174 -415428 -338964 -123005 21905 226718 267191 212035 114584 16383 42357 23276
9758 23276 35528 77687 193638 134889 18119 1439 -21250 -30124 -124850 -156189 -74548 -163360
9746 -163360 -222970 50788 60660 84169 -23346 131886 212933 117568 10767 -85259 -135227
9735 -135227 -148566 -76823 61632 -29557 -904 134756 273251 274933 -25823 -91817 -84065
9724 -84065 -206403 -217739 -399782 -451635 -418622 -263442 -75358 138530 392461 369506 -16364
9713 -16364 -262247 -218879 -116293 -14685 22399 76435 152876 108073 16675 107511 217405
9702B17405J22231J789o7260J2346j3782p4471J9360r8693k73165q0523k3680
9691b58443J25475N0354p723j9943j14388L9666K9681J23404L0177J56824J66813
9680C21897r3630k16578m9002j00450J79551l7291o9768P9694J73162K6452J1834
9669B25871j12746n9980L4289n4957k4062N5014K45973k7827j58247l1214J52438
9658B44552J21633J94740N44158N05886m5306m53713l35732k26435k91503j35846
9648A22434j91249J45597O457o8524j26604n594J30903J54560N2417p5497M8500
9637A93400O2636l2890j43857q6290m2641n8195J6452K9387N3586k0648O2204
9626C3144J47511J12900o3o2355o5806o0552M8274m0707l2680P4899j512n9422
$$ plain form
9702 217405 339636 341425 274165 286511 272729 198258 217618 118925 -154240 -234763 -258443
9691 -258443 -132968 -82614 -90337 -110280 -224668 -185002 -155321 -31917 -1740 155084 321897
9680 321897 228267 11689 -37313 -137763 41788 4497 -65271 14423 187585 214037 225871
9669 225871 113125 53145 87434 32477 8415 63429 309402 281575 123328 92114 244552
9658 244552 366185 560925 1105083 1610969 1565663 1111950 776218 549783 258280 122434
9648 122434 -68815 76782 83239 14715 -111889 -117483 13420 167980 220397 144900 193400
9637 193400 256036 223146 79289 -7001 -49642 -107837 -91385 -61998 -8412 -29060 33144
9626 33144 180655 293555 293492 231137 165331 104779 153053 112346 79666 154565 153053 93631
9614I3631P3265j25110j31250p4682J19424n3411J15401M3324Q1791Q2428j16003
9603A08808l4657M6635j41478L540l6317J66782r878m5946p3807P0273J04320
9592A58275N7171R808j23082j9728K1356N0881J02430k1281P2618J6251m8989
9581B75710j20471j2891R112j01842K8401K0433J353j34182O4128Q5535m2648
9570G2638j71963P488p1721J67126J39603J8834l06259L0697J65930N6534j03230
9559E677J0288J09485j69338j07372J61288R7918J14452P4216K2855J469j07375
9548B13563p0472j42967k49827J23183J42352R0118j62323n3872J50837J65382
9538B05974P8518O9210o9128o4776J9454J11156j58494j54569m5173J7344J55965
$$ plain form
9614 93631 166896 41786 -89464 -164146 -44722 -98133 17268 60592 142383 224811 108808
9603 108808 74151 120786 -20692 -17152 -53469 113313 103435 57489 -16318 53955 158275
9592 158275 215446 225254 102172 82444 103800 154681 257111 235830 308448 324699 275710
9581 275710 155239 142348 151460 49618 78019 98452 99805 -34377 29751 115286 72638
9570 72638 -99325 -91837 -163558 3568 143171 162005 -144254 -113557 52373 108907 5677
9559 5677 15965 125450 -43888 -151260 10028 107946 222398 296614 319469 320938 213563
9548 213563 143091 124 -249703 -126520 15832 105950 -56373 -110245 40592 205974
9538 205974 284492 353702 284574 219798 239252 350408 191914 37345 -7828 9516 165481
9527A65481Q8532j54261l2108j33777j16253J22583k214K92908J34372j14810
9517B50453j0059j8706m4274l5191J02613K2919l7398j10859q7521Q3173Q9063
9506B04213l0283m4939j10726j68413L7340j0033Q3778n764P2000J89241J74628
9495C91042r8102L449O961m8920N3665K7339o07j92660j24082P5868o4755k5907
9483C291m6876k5063j6730M6307J8413J16217p9928o2926N2499P4694M511n7528
9471B6881N6385r4926J1166M2838j3555J64149l4478K538N3913K5475r4977J08549
9459B53958Q6613j62933r4525J67389n8249O9j36199j32029r7820P8772J70548
9448G5594J17376q0033k22146q5717J61257K84138J60365L0307j65443j39163
$$ plain form
9527 165481 254013 99752 67644 -66133 -182386 -59803 -62017 230891 365263 250453
9517 250453 240394 221688 177414 142223 244836 267755 230357 119498 31977 115150 204213
9506 204213 173930 128991 18265 -150148 -112808 -122841 -39063 -44827 27173 216414 391042
9495 391042 292940 296389 303350 254430 308095 335434 334827 142167 18085 93953 29198 3291
9483 3291 -43585 -68648 -85378 -39071 -20658 95559 15631 -47295 5204 79898 84409 26881
9471 26881 83266 -11660 -494 42344 28789 192938 158460 160998 214911 240386 145409 253958
9459 253958 340571 177638 83113 250502 192253 192322 56123 -75906 -173726 -94954 75594
9448 75594 192970 112937 -109209 -194926 -33669 250469 410834 441141 275698 136535
9438A36535n5691p2183j19597m1249M9663J80503Q102O1874O7545M319j17464
9427A02357O1477j5872L3537O805j3589M945q0320R8071J57300m9299k1704M6935
9415C30643q4519j47231j15464J1322p2209j70937j33286O033J87011N1921n7666
9404a94382J23714q668N5064J66416l7563J5076l6771K01916J39826l23146j50227
9393d8745N4014R6004J33587J15468j36597q2846k7045m3832j0262j57052M6301
9382f1005J83709R0188l689J8064P4630M7189j22422j05506M1963k7795J37370
9371B72696M3849j12621k5308j83615j80814m5708J81465J85134j09168K3283
9361D9193J86899K5136o8621j59625q8090m4353p8209j8566J09307J49486K99938
$$ plain form
9438 136535 80844 8661 -110936 -152185 -102522 77981 86083 147957 215502 219821 102357
9427 102357 163834 147962 181499 188304 174715 179660 99340 197411 354711 305412 283708 330643
9415 330643 246124 98893 -16571 -5249 -77458 -248395 -381681 -375648 -188637 -136716 -194382
9404 -194382 -70668 -79336 -24272 142144 104581 119657 82886 284802 424628 101482 -48745
9393 -48745 5269 101273 234860 350328 213731 130885 103840 60008 49746 -107306 -61005
9382 -61005 122704 212892 209203 227267 301897 349086 226664 121158 163121 135326 272696
9371 272696 316545 203924 178616 -4999 -185813 -231521 -50056 135078 25910 49193
9361 49193 236092 261228 192607 32982 -55108 -99461 -177670 -196236 -86929 62557 362495
9350C62495o6842j92083j16737N5245k170j63868k460M4725K29856J90007J47234
9339D85402l4318m9834j96513k24436K3779n7382K696J30139L4258o2278k21107
9328a69594p1849n883J53642K17339k9992o0903P3233j582q4390L2049J66780
9317B18850K6174J0608k5540j82943r0521k06683J93669O8605m8448Q1132J66394
9306B11297q5380o7571j1546k6411m9543J51232m7205p8624j7173q6210m8374
9295a55508O5792J51485O4302P6447P4782K1319M8442M3560O2255n9330j79831
9284B13715l7604j25557k157k2360k6359j32939o175J49274P3389Q8251j25972
9273D5506j89555j68700K2826J75598L02608K3772j22373m0479O960J20012J62289
$$ plain form
9350 362495 295653 103570 -13167 42078 39908 -123960 -126420 -81695 148161 338168 485402
9339 485402 451084 401250 204737 -19699 4080 -53302 -50606 79533 113791 51513 -169594
9328 -169594 -241443 -247326 -93684 123655 93663 32760 105993 104411 20021 52070 218850
9317 218850 245024 255632 230092 47149 -43372 -250055 -56386 12219 -36229 44903 211297
9306 211297 125917 58346 46800 20389 -29154 122078 74873 -3751 -20924 -107134 -155508
9295 -155508 -89716 61769 126071 202518 277300 298619 347061 390621 452876 393546 213715
9284 213715 176111 50554 48397 26037 -322 -133261 -139436 9838 83227 171478 45506
9273 45506 -144049 -312749 -289923 -114325 188283 212055 89682 49203 56163 176175 338464
9262C38464q0599j40329j04256J23024N0763L332j24851p640o5752o4508k6843
9251i9195o3567L3210M7603r770o6690r1552o1481j8715J42569k733p725K6289
9239a71757p1773p7648n5228J72933N6991K9054r6061J11531j10736j04793J42570
9228a74917N0160R6356j00719Q2301l4305l2254j4313K7337j15406P5361K7638
9217a12761j01730n6539J76711L9682n6979J10206o2587o3649j01804J40694K09594
9206A20838j92820j94591j6869j572K05849k3514r1837L4872n3346M3258O0406
9195a09326P142l7148J18899o2955R6168J05143r1149K4645L1733j73843j46243
9184b36934L5341R993N0477J9605j66905o1662O2763J13422K0626M1600l9460
$$ plain form
9262 338464 257865 117536 13280 136304 187067 190399 65548 57908 -7844 -72352 -99195
9251 -99195 -162762 -129552 -81949 -91719 -158409 -249961 -311442 -330157 -187588 -190321 -198046 -171757
9239 -171757 -243530 -321178 -376406 -203473 -146482 -117428 -213489 -101958 -212694 -317487 -174917
9228 -174917 -124757 -28401 -129120 -46819 -81124 -113378 -127691 -100354 -215760 -140399 -112761
9217 -112761 -214491 -271030 -94319 -54637 -111616 -1410 -63997 -127646 -229450 -88756 120838
9206 120838 -71982 -266573 -283442 -285014 -79165 -102679 -194516 -159644 -212990 -169732 -109326
9195 -109326 -102184 -139332 -20433 -83388 12780 117923 26774 51419 83152 -90691 -236934
9184 -236934 -201593 -191600 -141123 -121518 -288423 -350085 -287322 -173900 -153274 -111674 -151134
9173a51134P9139L2359r2958O3978J20521Q5081k1729q4903L8240L4662M986J89127
9161B97369M3430o0807O3491j14320l60223k0207J58407J63138R6493K0887l3659
9150B53999j43681j94834j28441P2828J44018J25094j78746j23698O8198K21183
9140A15920N4554M1231j31054j90227o3934j06329J31052L6455j95379K8419J08674
9129a70618P1451L9515K2479p9351j11473J47479J69778k00701j12247R6896J76194
9118D9402J57708k8350r415J29802j790j74368J4107k1099M8939J3304o9102j04177
9106D961n4883j19884N3685J40107o2911q8826r8458P3476J75383K3412P8538
9095A24600J66813l1178k68979P7654J62545Q86p3396L2541j36996j36209O1333
$$ plain form
9173 -151134 -71995 -39636 -132594 -68616 51905 136986 115257 30354 68594 103256 108242 297369
9161 297369 340799 279992 343483 229163 -131060 -151267 7140 170278 266771 287658 253999
9150 253999 110318 -84516 -212957 -140129 3889 128983 -49763 -173461 -105263 115920
9140 115920 170474 211705 80651 -109576 -173510 -279839 -148787 -112332 -307711 -279292 -170618
9129 -170618 -99167 -59652 -37173 -116524 -227997 -80518 89260 -111441 -223688 -126792 49402
9118 49402 207110 178760 169345 299147 297357 122989 137096 115997 164936 178240 109138 4961
9106 4961 -49922 -169806 -116121 23986 -38925 -127751 -226209 -152733 22650 46062 124600
9095 124600 291413 260235 -8744 68910 231455 232341 158945 191486 54490 -81719 -20386
9084b0386J50120K7690o4395k0399o5120p7689N9439l8260L4093R7589j8011j48306
9072h3635P810n9420m635P6828Q3690r5849N312J66316J68294J5737J3776O619
9060C00843J7518l2257J37965J08450j61173l10249k03292j1072J91877q259l5288
9049d937K6814P3307M7379J04159q1627n5301k7449J06767J13552o3631j46339
9038I2694k6951n59j67906K8309K42235j22633j26672Q0363J60183J14327j9153
9027B54237q8237r4903j03421J87427j6655j63376N1846J7608M1640j8513l7300
9016C0353m4985L3534J22012J50394j91878k3133O979n8805K2809N4456k4971
9005G6765q0682j67871l3667J00921K44089j4074j46839P6407Q405N211R854n8119
$$ plain form
9084 -20386 129734 157424 93029 72630 7510 -70179 -10740 -49000 -14907 82682 64671 -83635
9072 -83635 -75825 -135245 -139880 -63052 20638 -75211 -69899 96417 264711 280448 294224 300843
9060 300843 318361 286104 424069 532519 371346 61097 -142195 -153267 38610 30351 -4937
9049 -4937 21877 95184 142563 246722 165095 109794 82345 189112 302664 239033 92694
9038 92694 65743 65184 -102722 -74413 167822 45189 -81483 -1120 159063 273390 254237
9027 254237 166000 71097 -32324 155103 138448 -24928 26918 44526 86166 67653 30353
9016 30353 -14632 18902 140914 291308 99430 76297 83276 24471 47280 101736 76765
9005 76765 -3917 -171788 -205455 -104534 139555 125481 -21358 55049 63454 68665 78519 20400
8993B0400j81255J1801M0559j19515P1054N8468K5875p7464j9104M827O8519P1587
8981b4248M3708L3186j0004j12598J90584Q8623m2466K801m3899k8790m2583M5055
8969I9369j45547j55477n9644K32569j7882P3719n064n0921m8601K1874J11184
8958E5579J38705J72274N46j20659j21045j9270P7246j9435J22044N6962m4540
8947B98407n9101j16832k1193L2512M3202r767j65655p9367O0523J67313P0667
8936B20709Q2136n221j96654K8021K33050J04293j09940j90007P0800m8297N794
8925A94684l8627j13864K0038R7498J4682r3933J3409o7777o241L1714M1570O9370
8913A62523M6018j84056p3637R7306M2830J25301k57584n0238J40370J40232J0709
$$ plain form
8993 20400 -160855 -149054 -108495 -228010 -156956 -98488 -72613 -150077 -169181 -164354 -95835 -24248
8981 -24248 19460 52646 42642 -69956 120628 209251 166785 169586 125687 96897 54314 99369
8969 99369 -46178 -201655 -261299 -28730 -46612 27107 22043 -28878 -77479 -55605 55579
8958 55579 194284 366558 367104 246445 125400 106130 183376 163941 285985 342947 298407
8947 298407 239306 122474 101281 133793 176995 167228 1573 -77794 -17271 150042 220709
8936 220709 302845 297624 100970 128991 362041 466334 356394 166387 237187 188890 194684
8925 194684 156057 42193 62231 159729 174411 80478 93887 26110 19869 51583 93153 162523
8913 162523 208541 24485 -49152 48154 90984 216285 -41299 -91537 48833 189065 199774
8902A99774k22599j03509K35524R7955J81879m389j24752O9903p5417k26969o0040
8891c2640p2205L9715n5821Q5358O9726N001R0131j7943k5258N8100l3469k2378
8879H8317r9205J983r686P0322L7166L3368m8438J63632M2867j33851k0329j298
8867A24848R0301n9942n4747j6950J8539q9296M9129J53640K11156O8807j72118
8856C23367Q7180K7125r2313k54453j04766n6696N477k176J18704Q4133l7635
8845I7947J40521k4038K8130J08124m0817m0470l4512J34157m4843j55286m5530
8834A23383L575p7143N2942n2505N5676L9555J27484J0144m7032o4792q6738P7971
8822A62520l3734j02053n9102J17469J83892N8585k81620j3477O5286O7863j09407
$$ plain form
8902 199774 -22825 -126334 109190 207145 389024 384635 259883 329786 254369 27400 -32640
8891 -32640 -104845 -65130 -120951 -35593 34133 39134 129265 111322 86064 144164 110695 88317
8879 88317 -10888 -8905 -18591 51731 88897 122265 73827 237459 280326 146475 126146 124848
8867 124848 215149 155207 100460 83510 102049 12753 61882 215522 426678 495485 323367
8856 323367 410547 437672 345359 90906 -13860 -70556 -65079 -67255 51449 135582 97947
8845 97947 238468 214430 242560 350684 309867 269397 234885 369042 324199 168913 123383
8834 123383 126958 49815 102757 50252 105928 145483 272967 283111 236079 171287 84549 162520
8822 162520 128786 26733 -32369 85100 268992 327577 45957 32480 97766 165629 56222
8811E6222j02613N4393J24728J6228j10064j2209k0054j62780n4065J04956K77879
8800A72621J91527q1726j00780n6006k8953j7557r6599J54688J51240J6011r8426
8789B06040p8839m1040m9092M5429k5098k7631m3425m7501J5408J47132K8490
8778A29873L2832M8355j10205J2243J49170K23360p3403o6750J5522k9627M6183
8767C77553Q6784p6127j30396Q1177k68125j43227j02556P5026K40039K08468
8757C48616L6914j92821j64933n9543p0154J53960N5509K7580j0922j06081p5887
8746e7762J9836j5284k0316P8853L1526J6006O9732L4737k1568l4993m7731r906
8734D3130k7349r6275k4688p634J60333K0746l5399Q2370Q1240j12727o3714K5350
$$ plain form
8811 56222 -46391 8002 132730 148958 38894 26685 6631 -156149 -210214 -105258 172621
8800 172621 364148 282422 181642 125636 96683 79126 -17473 137215 288455 304466 206040
8789 206040 127201 86161 37069 82498 57400 29769 -13656 -61157 -45749 101383 129873
8778 129873 162705 211060 100855 113098 262268 485628 412225 345475 360997 331370 377553
8767 377553 464337 388210 257814 338991 70866 -72361 -174917 -99891 140148 348616
8757 348616 385530 192709 27776 -31767 -101921 52039 107548 135128 124206 18125 -57762
8746 -57762 -37926 -53210 -73526 5327 36853 52859 122591 157328 135760 100767 53036 43130
8734 43130 15781 -80494 -105182 -112816 47517 68263 32864 115234 196474 83747 20033 45383
8722D5383J23955n0771J9945O9899j31273J06169K01454K2759j61977j28084j43284
8711b5825k08941O4010J36225J57845j1501j79941K6328K00333q264Q1547J04863
8700C36679k99j82681j36407j97692K50774K36308m1481l1259L1512P8205r0586
8689B53073l9620q3072o7530n9732J49836J13603j12007j76845K6378K3087p7895
8678e0724J93663K12424M2761q8063j91766p6181J16483O8498j17112p7487J08444
8667A40940J71111o726r000j72846n5681O5603M4412P6649k3363j26243N9633
8656A64489K4537j28904J2623N118K069P961J74137J12855k7937j1415J06438
8645D41971M0577p9379j18100j00144p9253O6336K2838j13235P1692M4187N766
$$ plain form
8722 45383 169338 118567 138512 208411 77138 183307 384761 407520 245543 117459 -25825
8711 -25825 -234766 -170756 -34531 123314 111813 -68128 -41800 158533 150269 231816 336679
8700 336679 336380 153699 17292 -180400 70374 306682 265201 233942 265454 343659 253073
8689 253073 213453 130381 62851 3119 152955 266558 154551 -22294 4084 27171 -50724
8678 -50724 142939 355363 398124 310061 118295 42114 158597 227095 109983 32496 140940
8667 140940 312051 305325 296325 123479 67798 133401 177813 254462 231099 104856 164489
8656 164489 189026 60122 72745 77863 79932 87893 262030 374885 346948 335533 441971
8645 441971 482548 403169 285069 184925 105672 172008 194846 81611 153303 197490 203256
8634B03256j42673j59666j22912k9558N5640J38288J65902J6852n6010Q9340j5956
8623A42503o0411P5489P2535l4368J13141J47821l5951k9039k07456j50175r6084
8612f1995o3927m177J02618J93252J5296J48213k1320j39683o1271Q754j1007
8601A04753j45371Q7309l837p1703O8386K41338L8906p5828j62693j13938L8549
8590E871k3458J42743J44387l2872R739R8616o9428K9174O3410j17282N487P0209
8578C26596J665J98544J6044L5362j37095Q8522m7746k00254j07953j07933j2586
8567E3166J1044J39719J54199P8725M0196j47334N8968j54829L769j25557o6298
8556D5768J95707M8481m9722j39852p1383J77455K7482l4751k9197o0755j18452
$$ plain form
8634 203256 60583 -99083 -221995 -251553 -195913 -57625 108277 125129 69119 158459 142503
8623 142503 82092 157581 230116 195748 308889 456710 420759 391720 184264 34089 -61995
8612 -61995 -125922 -130099 -27481 165771 181067 329280 307960 168277 107006 115760 104753
8601 104753 -40618 46691 42854 -28849 39537 280875 319781 243953 81260 -32678 5871
8590 5871 -17587 125156 269543 236671 246410 345026 275598 304772 368182 250900 256387 326596
8578 326596 328261 526805 542849 578211 441116 529638 481892 281638 173685 65752 53166
8567 53166 64210 203929 358128 436853 477049 329715 388683 233854 237623 112066 45768
8556 45768 241475 289956 240234 100382 28999 206454 233936 199185 169988 109233 -9219
8545i219O7239P2785J12604O1935P3648J02977p5301r8518j54788P3722J50286
8534C77370J57440Q1529k1336q5173J2392L9662o9893m976P6021m8125j84610
8523C30301j5175J02036q388j93764j47993j09476J55277O5941K3241j2592J6116
8512B05524o3603R9798M1633P6524m9382j07691J19649L171j87279O0751J43346
8501C42441K12087L1083m0308R9468O3180k03378o6889L0672J6997o3274l1887
8490C90192J99329J71725j80394k69040j84907k4379P4539J7338P4268J59002
8480D27673N8120O5186k2974k19745l3425J22724J62043Q2628J23377p6740j91911
8469D96956m6197J25276J15554l5960j26228j68365N006K10165O8671j01822j99926
$$ plain form
8545 -9219 58020 130805 243409 305344 378992 481969 406668 308150 153362 227084 377370
8534 377370 534810 616339 595003 509830 522222 561884 491991 487015 563036 514911 330301
8523 330301 315126 417162 408774 215010 67017 -42459 112818 178759 202000 189408 205524
8512 205524 141921 241719 283352 359876 310494 202803 322452 325623 138344 199095 342441
8501 342441 554528 585611 545303 644771 707951 504573 437684 468356 485353 422079 390192
8490 390192 589521 761246 580852 311812 126905 102526 177065 194403 268671 427673
8480 427673 485793 550979 528005 308260 274835 397559 559602 642230 765607 688867 496956
8469 496956 450759 576035 691589 655629 529401 361036 366042 576207 644878 543056 343130
8458C43130K102Q7187J21318R5715j18328K9054j7791k0854l0827R4802M1932
8447F27440K0714K4502o8619K61256J04513o7779q7556n7595Q1035J47843K47906
8436A233660P0170O1079J11884N2155R6412J91476K75949K63892L81074M85025
8426C222776P23347J326476J761263K354955L197123L304159K503136L76338k207618
8417A6561955l289446l110816k553145k001012j252330j020777p31371l33327
8409B269731k54495k57365k25824j01784r0874q1363o593J98664j12680l53535
8399I83882j03803Q4412r5294r0684R4876K98996J37749Q8593J23209L05007K18877
8388B045820L5201J8327J41401L24879M94911M68331R06906J147191J529914K360751
$$ plain form
8458 343130 345232 432419 553737 649452 531124 560178 542387 521533 490706 585508 627440
8447 627440 648154 672656 604037 865293 969806 902027 814471 756876 837911 985754 1233660
8436 1233660 1303830 1364909 1476793 1528948 1625360 1816836 2092785 2356677 2737751 3222776
8426 3222776 3946123 5272599 7033862 9388817 12585940 15890099 18393235 18769573 16561955
8417 16561955 13272509 10161693 7608548 5607536 4355206 3334429 2603058 2269731
8409 2269731 2015236 1757871 1532047 1430263 1339389 1258026 1251433 1450097 1337417 983882
8399 983882 880079 964491 869197 778513 873389 1172385 1310134 1398727 1521936 1826943 2045820
8388 2045820 2081021 2099348 2240749 2565628 3060539 3528870 4435776 5582967 7112881 9473632
8378I473632L123094L276042K104070j77133k292538l071594k817533k281307
8370G336733j751686j235005r04599o27589n44730k32685k40900j96541j78315
8361A424683j18757q6813J8609q1654q8839j4355j44467o1058m1495m4065o7109
8350F94680k9200j0420m0720N7540n7025J16738J85632J3788o6594j52750j86369
8339E25300p3791l08129L8052L03432J33309N3558J09107j58339j87134n4350
8329C81015M0832Q9256q9662j68982J09973K02442M9631n7154j07986q1704J1263
8318C78924n0533l3125n2099p5542o9193N8954K24644J55566R7702j2635k92754
8307C29909j54097J2253K9208M6162O9295K46766J66693q4723o4864M0309j08091
$$ plain form
8378 9473632 12596726 15872768 17976838 17799705 15507167 12435573 9618040 7336733
8370 7336733 5585047 4350042 3445443 2817854 2273124 2040439 1799539 1602998 1424683
8361 1424683 1305926 1219113 1237722 1156068 1067229 1052874 908407 847349 805854 761789 694680
8350 694680 665480 655060 614340 671880 614855 731593 917225 931013 864419 711669 525300
8339 525300 451509 143380 181432 484864 618173 671731 780838 622499 435365 381015
8329 381015 421847 511103 421441 252459 362432 564874 614505 557351 449365 367661 378924
8318 378924 328391 295266 243167 167625 98432 157386 382030 537596 635298 622663 329909
8307 329909 175812 188065 217273 263435 332730 579496 746189 661466 596602 636911 528820
8296E28820r6608O2774J3214j62184k0617N8002K06670r3831K492K973j77892
8285C23813k1613J14056L7252L6N2459J40645l9876j30708J4991J30510J12124
8274G33689N951K0747R7072j45549j83012k3468K5886j05122j12122J7265k1728
8263C09609J07523R0534J4726J16993k03648J02498O2150j1094j17709J2574J30469
8252F14625k27480n0082j9810R4584j05583J42782J2062L3799J6777P386l7601
8241D81459l8523l8968M6290j12764j449J84353j1744p892r895q1372j56609O9515
8229C22401J22668R9569J0357j12734o6888k1711J67502O9115r6884j71111r0979
8218B31305j08384J47109J18125L1845p1500P8521l5187o6254K4184K22835J7068
$$ plain form
8296 528820 432212 494986 508200 346016 325399 383401 590071 496240 498732 501705 323813
8285 323813 302200 416256 453508 453544 506003 646648 606772 476064 491055 621565 733689
8274 733689 739640 760387 857459 711910 528898 505430 531316 426194 314072 331337 309609
8263 309609 417132 507666 522392 639385 435737 538235 600385 589291 471582 484156 614625
8252 614625 387145 337063 317253 411837 306254 449036 461098 494897 511674 519060 481459
8241 481459 442936 403968 450258 337494 336045 520398 508654 500762 490867 409495 252886 322401
8229 322401 445069 544638 554995 442261 375373 353662 521164 590279 493395 322284 231305
8218 231305 122921 270030 388155 420000 348500 427021 391834 325580 349764 572599 589667
8207E89667m4875o1223j83163r4301k9682J31310L07136L4682j91378j35985J28528
8196D50716N902O0294R7967P6716m9254j0243r1281r0512q972m6960Q4466Q7902
8184E66741M2122q6588n3597j71117p8549P2636R0364j9599k9433O8057Q4063
8173D85100l4243j82982j73305J22200N7592J83851O6582o0803q2174R2695J74762
8162F49275O6056j88744k44281j13856j05551o6645J90193Q6045J3141mk9743
8151B55886P4435N1898N9334J38161j18213o4178L4470j31465j62126L0084l9183
8140A29103J52720R7287j11501n9422k2745M9868k68931M977J73502K17120m2557
8129C19421k6376j76338J40787O7000o1248j86597o3932k5832k16138Q5265J42819
$$ plain form
8207 589667 544792 483569 300406 206105 176423 307733 614869 649551 458173 322188 450716
8196 450716 456618 516912 614879 691595 642341 632098 540817 450305 441333 394373 478839 566741
8184 566741 608863 522275 468678 297561 219012 291648 382012 362413 332980 401037 485100
8173 485100 450857 267875 94570 216770 274362 458213 524795 463992 381818 474513 649275
8162 649275 715331 526587 282306 168450 62899 -3746 186447 272492 285633 285629 255886
8151 255886 330321 382219 441553 579714 461501 397323 431793 300328 138202 168286 129103
8140 129103 281823 379110 267609 208187 185442 235310 -33621 -28644 144858 361978 319421
8129 319421 293045 116707 257494 324494 263246 76649 12717 -13115 -229253 -143988 -1169
8118a169K06908N7485L0292R6884j2539j8614k8370o0121q7567m4248L2865N2696
8106B24502J3052j34127j05475J58174R4734O1703r0898j35130L2491m2524J36391
8095B12893l3753j76024n9021k9666L3896N3780Q9162Q4509r7973J14255j6513
8084A75545j60904R416J08114K6605k1059k2789o2126J2286m1204K3655P5660
8073A23199j58770M4888L2454N8323J36374p2016l2137O4653J10374K1398j03344
8062B25396R688J0821J8709j1123j98349k1165j27604k396J85576P7344j9790
8051A47107j52461L783P8734J03028J2300L6996l5061K495L4203J6623M9707n1428
8039B46026J7044p4587l56302J34043J50396k2574P1400o4594j2967j07193j10663
$$ plain form
8118 -1169 205739 263224 293516 390400 377861 359247 330877 270756 183189 138941 171806 224502
8106 224502 237554 103427 -2048 156126 250860 312563 221665 86535 119026 76502 212893
8095 212893 179140 3116 -55905 -85571 -51675 2105 91267 175776 77803 192058 175545
8084 175545 14641 24057 132171 158776 137717 114928 52802 65088 23884 47539 123199
8073 123199 -35571 9317 41771 100094 236468 164452 132315 196968 307342 328740 225396
8062 225396 235084 245905 264614 253491 55142 33977 -93627 -96023 89553 166897 147107
8051 147107 -5354 -1571 77163 180191 192491 229487 194426 196921 231124 247747 297454 246026
8039 246026 263070 188483 -167819 -33776 116620 94046 165446 100852 87885 -19308 -129971
8028a29971o9956J82697L788J3830J64082K23680r7415o0512j42024k9699L6098
8017I4598m26P6261N4675J03299o5890m9745Q2918n9514q7183j0313j43852J842
8005c330R652j1840L5970j1238J04018L7851r9395j57058O9527J6959L2298J02070
7993A25484P7928p5986l0788r3399j3880J05734P6842L6360q9705Q8261K0493
7982B27344J57488l6357k29798j23125q047J01031j7328J2507k29616J310J41811
7971b780K7705J12995O5393P5130j0666j42053n7973j00603j295J65372J9805
7960A51030K0902L3029q7391J12891o5458k14955j62125n7792l4562n5624l646
7949c63701J24643N7626K7726L3749l0654n613q6299L2110J26605M4491j32893
$$ plain form
8028 -129971 -199927 -17230 -13442 388 164470 388150 290735 230223 88199 58500 94598
8017 94598 94172 170433 225108 328407 262517 212772 295690 236176 148993 138680 -5172 -3330
8005 -3330 6322 -5518 30452 19214 123232 161083 61688 -95370 -25843 -8884 23414 125484
7993 125484 203412 127426 96638 3239 -10641 95093 171935 208295 118590 206851 227344
7982 227344 384832 348475 118677 -4448 -12495 88536 71208 83715 -145901 -144591 -2780
7971 -2780 24925 137920 203313 278443 267777 125724 67751 -32852 -34147 131225 151030
7960 151030 171932 204961 117570 230461 165003 -49952 -212077 -269869 -304431 -360055 -363701
7949 -363701 -239058 -181432 -153706 -119957 -150611 -156224 -242523 -210413 -83808 -39317 -172210
7938a72210j12429J35871J7380r1443J12264Q437K19453K5342j8939l7125p7600
7927I001O7595O0013L5800J03653J33006j20815l7087l7466k7796o5045J57450
7916B78309J03315r5170j59836k5098Q7348j5852l3820N3652R2010P9405p2178
7905B92085j03023j59876k04515M3487J841N6043O024l3479m4956P5036J04980
7894C3647J63436j35706j66013l5042p666P3087N3815k5888j68045J7675N0595
7883a46105k2252P2606J00356k8871o8462q0647M7127J02930j45708m6624K0005
7872a95645J52609q7670n2330L8647M9864m526J1306j1484R4509j4268m9300O7144
7860a144J35128L3992k8798P8358J8824j47011j54260k0099N3250p8229O6050
$$ plain form
7938 -172210 -284639 -148768 -131388 -222831 -110567 -102130 117323 142665 123726 86601 9001
7927 9001 76596 136609 172409 276062 409068 288253 251166 213700 185904 120859 278309
7916 278309 381624 286454 126618 101520 188868 173016 139196 192848 284858 364263 292085
7905 292085 189062 29186 -175329 -131842 -130001 -73958 -67934 -101413 -146369 -71333 33647
7894 33647 197083 61377 -104636 -139678 -147344 -74257 -20442 -46330 -214375 -196700 -146105
7883 -146105 -168357 -95751 4605 -24266 -92728 -173375 -126248 -23318 -169026 -215650 -195645
7872 -195645 -43036 -130706 -183036 -144389 -94525 -99051 -87745 -99229 -4720 -18988 -68288 -1144
7860 -1144 133984 167976 139178 217536 236360 89349 -64911 -85010 -31760 -109989 -43939
7849d3939N1591O2238p693l5212j4117J92147K0998o8182m7588j19626R936l6623
7837c6070Q5225N3763j7124q3281M0220O7235L1181j51740j76581j23388J30730
7826a79830J5884p9252J30325J88808j31989j18840K4341Q3215O9837M1785n7866
7815a3582n1421m2851O9792N0147J05218R7487M7217q1194j3957N986l3614j5126
7803A24102J092n385j39052j39055l2664R1922J70053J47336m1793j57320L1561
7792E0797K588m8529k9255o7722j2239O1799J86551J63754J39118m4561k4390
7781C77911K2049j71509j51476M9583M3159l8193k8359j33652o5140J08250J98102
7770B10725P3519j24514j22857j5494l2961K2239O2469J9150R6495J8355M1710
$$ plain form
7849 -43939 7652 69890 62197 26985 12868 205015 226013 157831 110243 -9383 553 -36070
7837 -36070 49155 102918 85794 2513 42733 109968 141149 -10591 -187172 -310560 -179830
7826 -179830 -163946 -243198 -112873 75935 -56054 -174894 -150553 -67338 2499 44284 -13582
7815 -13582 -65003 -107854 -38062 12085 117303 214790 262007 180813 166856 172842 139228 124102
7803 124102 125194 119809 -19243 -158298 -190962 -99040 71013 218349 176556 19236 50797
7792 50797 53385 4856 -24399 -92121 -104360 -42561 143990 307744 446862 402301 377911
7781 377911 399960 228451 76975 126558 169717 131524 103165 -30487 -95627 12623 210725
7770 210725 284244 159730 36873 21379 -11582 10657 73126 92276 188771 207126 248836
7759B48836k7088m9114J28155J1977K6680r4376j38511j01394Q2365R259o2419
7748C4370p9081O0280j26239L527P3292j4632O3732O4752m9190J66866j29560
7737F8117j89410J27621K16559J67585j32739k0655L7651N2762Q1997j48947p8027
7726A82514J08467k1834j5318J8774m3895j38166j31520j05035J61806J95287
7716B11080j4540j83262M9840o4524m0991O0373m6952M5024j20278J06067J48502
7705A50339j14939j03783j46844q082R6493Q9234K32682J33579j29999k04250
7695e570k0352j11827j78076N7111J05584J91313J15556m7419j81171r6792J15530
7684e6113J09526K55717R6011j57051k9458p2940k4526L2747k2108P1464m0475
$$ plain form
7759 248836 221748 172634 300789 312766 339446 245070 106559 5165 87530 96789 34370
7748 34370 -44711 15569 -110670 -107143 -33851 -48483 15249 80001 30811 197677 68117
7737 68117 -121293 6328 222887 390472 257733 237078 274729 327491 409488 260541 182514
7726 182514 290981 269147 253829 272603 228708 90542 -40978 -146013 15793 211080
7716 211080 196540 13278 63118 -1406 -42397 17976 -28976 16048 -104230 1837 150339
7705 150339 35400 -68383 -215227 -223309 -126816 -37582 195100 328679 198680 -5570
7695 -5570 -25922 -137749 -315825 -258714 -153130 38183 153739 106320 -74851 -171643 -56113
7684 -56113 53413 309130 405141 248090 218632 145692 121166 153913 131805 203269 162794
7673A62794j26081j56068O9138J31206O2593o0181p4870k2869Q1298M7360K43149
7662C57469O232j15767k52173m4278J18361K7973N9693P0870J32339k25971k44371
7651a09623j7784L5209j4188J6511J32814P683J40455K33877r2477k1211o0857
7640B50409j2579r7176j61736j09876J34034J62692J37971J22165o3913J2320
7630C74311j04357j18966J7301j62007l5182p0497o0674Q4289J14962J29421r6224
7619G2377j13150M6015L0846P5347M0914m195J488K1861l6829J18142r3496l09800
7607a50480q8045J0544l7601L13280L17517j7389j96841j36715K7101p582p2692
7596c8903J75418k7017j9076m5677N1345m6437j06615N3443M1090j25491N5507
$$ plain form
7673 162794 36713 -119355 -50217 80989 143582 83401 8531 -14338 66960 114320 357469
7662 357469 363701 247934 -4239 -48517 69844 97817 157510 228380 360719 134748 -109623
7651 -109623 -127407 -92198 -106386 -89875 42939 50622 191077 424954 332477 311266 250409
7640 250409 237830 140654 -21082 -130958 3076 165768 303739 425904 361991 374311
7630 374311 269954 150988 168289 6282 -28900 -99397 -160071 -75782 39180 168601 72377
7619 72377 -40773 5242 36088 111435 152349 148154 149642 171503 134674 252816 159320 -150480
7607 -150480 -238525 -227981 -265582 47698 365215 347826 150985 14270 41371 33789 -38903
7596 -38903 136515 109498 90422 44745 96090 49653 -56962 -3519 37571 -87920 -32413
7585c2413O8115P7817j5613j38321q7352j22119Q1947O8053K3910k9965j3563
7574a19504j042J7426J3792M9076q6512O0325K5585J27093k0103k9771K06514
7563B42879J11706o3572j9281l5688j98782j50661k8939R0400K17136J07416k38800
7552C3814l1255M5843j6411m4609q7134q9510J23900N9858J81156Q8001j75152
7541H8501n0366K51656J63914k24890j08494L2746M4163O7379l0910k5468j47022
7530F1209Q4548o396N0930K53095l9170j83797j85500j08140O4796K37153O9023
7519B97751j24113j51359K0991r0673j17228m5587J16569M5264J15869J27747
7509A95231J9953l5907p7766n5066j58615j01349k0474L7046j0377J58496j3747
$$ plain form
7585 -32413 35702 113519 97906 -40415 -127767 -249886 -167939 -99886 -75976 -105941 -119504
7574 -119504 -120546 -103120 -89328 -40252 -126764 -66439 -40854 86239 66136 36365 242879
7563 242879 354585 291013 271732 236044 37262 -113399 -142338 -51938 165198 272614 33814
7552 33814 2559 48402 31991 -12618 -99752 -189262 -65362 -5504 175652 263653 88501
7541 88501 38135 289791 453705 228815 120321 153067 197230 264609 233699 208231 61209
7530 61209 145757 139361 190291 443386 404216 220419 34919 -73221 -8425 228728 297751
7519 297751 173638 22279 43270 -47403 -164631 -210218 -93649 -48385 67484 195231
7509 195231 215184 179277 101511 46445 -112170 -213519 -233993 -196947 -207324 -48828 -62575
7498f2575R8172Q7078J05138l4260J58R1060N8377q9070j45452q9191J1391n3227
7486b2401m4745r2135J0605J30602M1940M3022Q9865J57102O3346k15088p3312
7475H8801L1591Q975j26746O4387J70162P0129n6428K5411q8993j45874L197O74
7463D5286j31225l7346O2289N6578j36651j48293P1246J65821o3105J01321J22066
7452A07987o8356l4176q4501j21860m6385J01669J80360o9041k22500j90756J21713
7441c25846O5195j03480J27805J29455k5826r2432J30512K26506o4854j91061
7431a24026Q782j52577l8180P795j32353J3309L385R7554J15630K19270M8991
7420F7580j0084K1065j86894k6753J47876k9152j64014n0191J77178J03912O5150
$$ plain form
7498 -62575 35597 122675 227813 193553 193711 284771 343148 254078 108626 19435 30826 -22401
7486 -22401 -67146 -159281 -148676 -18074 23866 66888 156753 313855 377201 162113 88801
7475 88801 120392 129367 2621 67008 237170 307299 250871 276282 187289 41415 44612 45286
7463 45286 -85939 -123285 -60996 -4418 -141069 -289362 -218116 -52295 -115400 -14079 107987
7452 107987 39631 5455 -79046 -200906 -247291 -145622 34738 -34303 -256803 -447559 -325846
7441 -325846 -260651 -364131 -236326 -106871 -132697 -225129 -94617 131889 67035 -124026
7431 -124026 -115244 -267821 -306001 -298206 -430559 -417250 -413865 -316311 -200681 18589 67580
7420 67580 57496 78561 -108333 -135086 12790 -16362 -180376 -230567 -53389 50523 115673
7409A15673J9196q858n1463j63244J41822m0562R421j196q832O7595R020j69598
7397h1026j0296Q629O7296O4948J23245R4228o5619j47476K1339M6312J9529o9908
7385G1201M1137k187j6810O1316P9180p339k87067j38301J49115M1955j01858
7374a09658j00230J04515P478J09948P2244j08047N7873j07054N3092O0222n785
7363C4598j45309K9618P5836j23842L7715J98623o5486k8784M7483J70112j8944
7352B11620j81594o3102j21898n8159M9012Q2494O9654Q2161p5263l4865N2179
7341A2239J9474P7917j32622J23793j54216k06101M0765l6243n3222K7805k7349
7330c07760N9989J51738n1795L0865N6869o2968n614O5680J55893j29130k26469
$$ plain form
7409 115673 134869 126011 74548 -88696 53126 12564 21985 20789 11957 79552 88572 -81026
7397 -81026 -91322 -82693 -15397 49551 172796 267024 201405 53929 75268 121580 141109 71201
7385 71201 112338 110151 93341 154657 233837 226498 -60569 -198870 -49755 -7800 -109658
7374 -109658 -209888 -105373 -97895 12053 84297 -23750 34123 -72931 -19839 40383 34598
7363 34598 -110711 -81093 -5257 -129099 -91384 107239 41753 12969 60452 230564 211620
7352 211620 30026 -33076 -154974 -213133 -164121 -81627 -11973 70188 -5075 -39940 12239
7341 12239 31713 109630 -22992 100801 -53415 -259516 -218751 -254994 -308216 -280411 -307760
7330 -307760 -247771 -96033 -147828 -116963 -60094 -123062 -128676 -62996 92897 -36233 -262702
7319b62702K6414N5643K307R3707J67423K8769Q8596j16423j93772j78466J36630
7308a51874J35182P5670m6459q5039K0920L4608n5227L6198J36242J21003j05068
7297A16156j84665j40564P1332J92335R7926p2149r1402m5536j300K7655K6498
7286c714j37811j7507j0007R3012J22792O1491j0422J0951j29051o7202k8186
7275a15654O6705M3005J06885R635j85826n2294n2945k4065K02853J29685q6626
7264D1358j59204K7633K75172N2352k5589k72401n0559m7097O7925J12587m9744
7253b7567r5159J976O1864K8152j13874j1866J11971k17928O358K25883P115r2948
7241a16023M9684k2630m7002n4064N437M7332j40365Q180n7578M657N9980P8177
$$ plain form
7319 -262702 -236288 -180645 -178338 -84631 82792 111561 200157 83734 -110038 -288504 -151874
7308 -151874 -16692 58978 12519 -72520 -51600 -16992 -72219 -36021 100221 221224 116156
7297 116156 -68509 -209073 -137741 54594 152520 80371 -11031 -56567 -57867 -30212 -3714
7286 -3714 -141525 -159032 -169039 -76027 46765 108256 97834 108785 -20266 -87468 -115654
7275 -115654 -48949 -5944 100941 110576 -75250 -127544 -180489 -204554 -1701 127984 41358
7264 41358 -117846 -90213 184959 237311 211722 -60679 -111238 -158335 -90410 22177 -27567
7253 -27567 -122726 -120750 -58886 -30734 -144608 -156474 -44503 -262431 -256073 -30190 -23075 -116023
7241 -116023 -66339 -88969 -135971 -190035 -184598 -137266 -277631 -269451 -327029 -322372 -262392 -184215
7229a84215o9041O354K6690J59836l3984J13915J59377J53894j95100l196R6034
7218B30564m149P2511p3185L9304O0519j94967L7699J16739r1428L4044J29418
7207C57069P9434j15340k2453j05641j25189Q0835n0187j40460K1782J03077k9426
7196E3501r8302j27540j0202J64694J4355j59767j46515Q1326K44286J83577J05507
7185C04920j00532j46491k45804K8007r5618R1974J35849N6381M1259j77831L608
7174a04278M8227l9564n1714m9223P8760J02194j02023p6429N2041j4098J18453
7163c7654K31033n4614k00378j86741P886J74185O4195p449M4289k65489M1237
7152a89500j7418k0473L7295J57968L0995j726N4809O018j52162m6408N5626o7799
$$ plain form
7229 -184215 -253256 -246902 -220212 -60376 -94360 19555 178932 332826 137726 134530 230564
7218 230564 226415 298926 225741 265045 325564 130597 168296 285035 193607 227651 357069
7207 357069 436503 321163 298710 193069 67880 148715 98528 -41932 -20150 82927 53501
7196 53501 -44801 -172341 -182543 -17849 -3494 -163261 -309776 -228450 15836 199413 304920
7185 304920 204388 57897 -187907 -159900 -255518 -163544 -27695 28686 69945 -107886 -104278
7174 -104278 -56051 -95615 -147329 -196552 -117792 -15598 -117621 -194050 -142009 -156107 -37654
7163 -37654 193379 138765 -61613 -248354 -240468 -66283 -2088 -9537 34752 -230737 -189500
7152 -189500 -206918 -227391 -190096 -32128 -1133 -2859 51950 57968 -94194 -140602 -84976 -152775
7140a52775J64315O4041j19779l8069J96684M0133j43794p8654Q0108j9339j0774
7129a7903J3700j6933j07667j147o7215M9102j859J4162J04675l3932k40102j4380
7117c19499Q2625l1549k17356K82620J27534J1755r258P5011Q0713L3307j01103
7106A4800n616J00876j19749k3384Q5856M5422R0039R333j23578j38432M475O3194
7094C236J02657j20501o3947k7048J01460J507m424Q0110Q5764r1425j94446N8512
7082f8545K49757J04751n0572K7536j30424j98019j07323Q1793N6443R8204o0438
7071C163M4963k1973k24628j18366N7333J31880J10456N1134j18434J60949L2612
7060A09089l2626o6656o0544N0540n0923p2693J65888J93884j1896n5660L2681
$$ plain form
7140 -152775 11540 75581 -44198 -82267 114417 154550 10756 -67898 12210 -7129 -17903
7129 -17903 -4203 -21136 -128803 -129950 -197165 -148063 -149922 -135760 -31085 -65017 -305119 -319499
7117 -319499 -236874 -268423 -485779 -203159 -75625 -63870 -73128 1883 82596 115903 14800
7106 14800 9184 110060 -9689 -33073 52783 98205 188244 197577 73999 -64433 -59958 3236
7094 3236 105893 -14608 -78555 -105603 -4143 -2636 -7060 73050 158814 67389 -127057 -68545
7082 -68545 181212 285963 235391 262927 132503 -65516 -172839 -91046 -34603 63601 3163
7071 3163 48126 26153 -198475 -316841 -259508 -127628 -17172 33962 -84472 76477 109089
7060 109089 76463 9807 -50737 -197 -51120 -123813 42075 235959 224063 168403 201084
7049B01084m0581j856k7078j32947n3102p1668j07411L6921L0654K4903L6305
7038a04776p2700N3946J67909J58587m9118k42693n8378J5766P9761O6188j5554
7027a062J6992O5829K0298q635K9121J87039J1990j03181k44202o0605O7579N7728
7015C8891j03670r2957Q9739L1182o8479j39350L2432K55510Q584q4315o2358
7004i4791J35893P5031j3086j4459j08273N3875n9791k51695q2270J77711J24964
6993e6891r6534R432L4927j60177Q1505L5670R157J87368j04049q9706R248O6207
6981g3843N3404N6015r7861J4364j24648j07462m3174n3225P9755J83402j06444
6970b19717l9441J09207N8951o3280j0626n5274o8730m4902P7243P0982K0095
$$ plain form
7049 201084 160503 158647 131569 -1378 -54480 -126148 -233559 -196638 -165984 -141081 -104776
7038 -104776 -177476 -123530 44379 202966 153848 -88845 -147223 -131457 -51696 14492 -1062
7027 -1062 15930 81759 102057 93422 122543 309582 321572 218391 -25811 -86416 -18837 38891
7015 38891 -64779 -157736 -67997 -36815 -105294 -244644 -212212 43298 51882 -32433 -94791
7004 -94791 41102 116133 103047 88588 -19685 34190 -25601 -277296 -359566 -181855 -56891
6993 -56891 -153425 -143993 -109066 -269243 -187738 -152068 -142911 44457 -59592 -149298 -140050 -73843
6981 -73843 -20439 35576 -62285 -47921 -172569 -280031 -323205 -376430 -296675 -113273 -219717
6970 -219717 -259158 -149951 -91000 -154280 -164906 -220180 -288910 -333812 -256569 -185587 -165492
6959a65492j02676M3821K49053K04290k4733j21978P021j16460k7666r6001j08502
6948b59323l1337J03372J60018Q1564L1159o9603N1849O0464p3690j61952q8858
6937a96337O7784L8914J15476J15765k31975q5451k1635l2299P7323R8404l6063
6926i0094M99N5364J24719n0063j25395k6010j3453j35906q7654L9999K77221
6915c0773M3220m2796L8130q1217k954j2158j30516o094P5154j92565n703O7357
6903b80915P2086L2500p2654l3386k0798J37780n5446M2247K6144N4918o2857
6892a60381j09675J60784K37670n7196o4237K042J28338K5909k11806M7855j01994
6881a02691j57966J36237K32579o5994l3602j39173j3501L572L2941k9287N2127
$$ plain form
6959 -165492 -268168 -224347 24706 228996 204263 82285 89306 -27154 -54820 -150821 -259323
6948 -259323 -290660 -187288 -27270 54294 85453 15850 67699 128163 54473 -107479 -196337
6937 -196337 -128553 -89639 25837 141602 -90373 -175824 -197459 -229758 -152435 -54031 -90094
6926 -90094 -89595 -34231 90488 40425 -84970 -110980 -124433 -260339 -347993 -307994 -30773
6915 -30773 12447 -30349 7781 -73436 -76390 -88548 -219064 -225158 -150004 -342569 -348272 -280915
6903 -280915 -208829 -176329 -248983 -282369 -303167 -165387 -220833 -178586 -152442 -97524 -160381
6892 -160381 -270056 -109272 128398 71202 6965 9007 137345 163254 -48552 -697 -102691
6881 -102691 -260657 -124420 108159 42165 8563 -130610 -144111 -140539 -107598 -136885 -84758
6870h4758o454r281O9168L07358Q1772j69408k66734j99563R1719l7502m9350
6859b73033J74920J30159l070j73616j31593J61220j5262O225l7326n3210K9048
6848a85538J11389J10970m0769l5264j12148O9491o5356j11526P6798R3384J75283
6837H6714l9865R5841J9804j03354J17428n5137j54212J5706k2236J06261J03326
6826A70276j4037k93978p9599N916r8008K6368P9399O93O8038J29372J8589r5278
6814h2249N6815J19832M915j17740m7636m6398L313q437k798n5676j63585O0026
6802b79618J74749n2775K0283L5923K2219o523o3966m3099J755J06349r7831R7994
6790h4540j48765M0424J81865P6220P8228r4056n3987Q0625q734m564p1120j08447
$$ plain form
6870 -84758 -91212 -100493 -31325 276033 357805 188397 -78337 -277900 -186181 -223683 -273033
6859 -273033 -98113 32046 28976 -144640 -276233 -115013 -130275 -124050 -161376 -214586 -185538
6848 -185538 -74149 36821 -3948 -39212 -151360 -81869 -147225 -258751 -181953 -88569 86714
6837 86714 46849 142690 162494 59140 176568 121431 -32781 -17075 -39311 66950 170276
6826 170276 156239 -137739 -217338 -211422 -309430 -283062 -203663 -202970 -134932 -5560 13029 -82249
6814 -82249 -25434 94398 99313 -18427 -66063 -112461 -109148 -117585 -120383 -176059 -339644 -279618
6802 -279618 -104869 -157644 -137361 -101438 -79219 -85742 -149708 -192807 -191052 -84703 -182534 -84540
6790 -84540 -233305 -192881 -11016 65204 143432 49376 -4611 76014 67280 62716 -8404 -116851
6778a16851L2707L8109j49025L2433O1573l2195p0391j76549J65212J67897J8712
6767b8368r984K20293J87966N444k68948j34028j61505J6271o2008r5263l5859
6756c65989J05733J93470j5471P615k2549p9940N7753k8654N7557l0062P6319
6745d4218K4301j90816N3131P3517K8328N5478J70673J63773o690j43990k6952
6734A56535l0280K6053N9737Q4382j81657j2285j87032j41409m3063J48730J32776
6723A2487j35696o082Q9813n9390J42035J59406n4857J36906J19017p855j33229
6712B62555O1872J5202j98889j68457m257K16749J07207m4436r5793k73923o9044
6701a91214M7834J3585j06275J48076K12433J15775p6806j09960n7713P2333q0053
$$ plain form
6778 -116851 -84144 -46035 -195060 -162627 -101054 -133249 -203640 -380189 -214977 -47080 -28368
6767 -28368 -38352 181941 369907 375351 106403 -27625 -189130 -172859 -234867 -330130 -365989
6756 -365989 -260256 -66786 -82257 -74642 -97191 -177131 -119378 -148032 -90475 -120537 -44218
6745 -44218 -19917 -210733 -157602 -84085 -55757 -279 170394 334167 327477 183487 156535
6734 156535 126255 152308 212045 296427 114770 102485 -84547 -225956 -269019 -120289 12487
6723 12487 -123209 -129291 -39478 -98868 43167 202573 147716 284622 403639 395784 262555
6712 262555 324427 339629 140740 -27717 -31974 184775 291982 247546 151753 -122170 -191214
6701 -191214 -143380 -129795 -236070 -87994 124439 240214 163408 53448 -4265 68068 -11985
6690a1985j64037k1588O2142L6688K183K6941R4619K60803q6625N1262m856j57976
6678H7571j05079J73295p6274j54808L7150L6280R5463o0814k9100m6406q5017
6667a27739O3265n7036J06313J02166O681q4787q5165m2384Q9339J53652J40933
6656B65238L439N7949n8532K0190p7008k01992M282J48573J53720N6757j57947
6645B14669j34392o1847M4635M8365L8168R37j31046M1163J41204k0331j72634
6634H891j55795J44511J21580P2403Q0618j68057q0618O8271l5884K1833j02172
6623b4419k05701j817j1664L4711J02610J24443N1797l2255k3434O8996m5384
6612C7883l9909m8818p1479j2426q7276O4353R5655l0649j07713K0438K0581J96284
$$ plain form
6690 -11985 -176022 -197610 -135468 -98780 -96597 -69656 24963 285766 199141 250403 245547 87571
6678 87571 -17508 155787 79513 -75295 -38145 -1865 93598 32784 3684 -42722 -127739
6667 -127739 -64474 -121510 -15197 86969 93650 8863 -76302 -118686 -29347 124305 265238
6656 265238 268677 326626 268094 288284 211276 9284 13566 162139 315859 372616 214669
6645 214669 80277 18430 63065 111430 149598 150535 19489 60652 201856 181525 8891
6634 8891 -146904 -2393 119187 191590 272208 104151 23533 91804 55920 77753 -24419
6623 -24419 -230120 -231937 -243601 -208890 -106280 18163 69960 37705 14271 83267 37883
6612 37883 -2026 -50844 -122323 -134749 -222025 -157672 -62017 -92666 -200379 -179941 -159360 36924
6600C6924Q5539n7106j07930M7873N0706p0424R7567J74728l1185j17838k5925
6589H2929J04305q4664p7006o2540q1321n3026J11353K5918O3107m945o8371k01651
6577b45912j45319J42538N5394K0562J11817j1787k4028L986J78319l1407j5059
6566C9104J42120j8369l3415q4616m4329J84653j17647j23609q5280J9105J12512
6555i771P9799K3688k5399j30306O8555J64507O715j11895J44458o4515j06856
6544C8980p0941m0301j17091k5676J99105J67940M7973J24142O2225o2729j39814
6533A83813L942j4235r3977q1414j3280j22324J5598K06274j74523m8875j2977
6522a51978K6680O6734O8049L9844j59318j33478N2264J37632k1777R6078Q0518
$$ plain form
6600 36924 122463 65357 -42573 5300 56006 -14418 83149 257877 226692 108854 82929
6589 82929 187234 102570 25564 -36976 -118297 -171323 -59970 -34052 29055 24110 -44261 -245912
6577 -245912 -391231 -248693 -193299 -172737 -60920 -72707 -96735 -92749 85570 54163 39104
6566 39104 181224 162855 129440 44824 495 185148 67501 -56108 -141388 -122283 -9771
6555 -9771 70028 93716 68317 -61989 6566 171073 177788 65893 210351 145836 38980
6544 38980 -31961 -72262 -189353 -215029 -15924 152016 199989 324131 386356 323627 183813
6533 183813 187755 173520 79543 -1871 -15151 -137475 -121877 84397 -90126 -139001 -151978
6522 -151978 -125298 -58564 9485 49329 -109989 -243467 -191203 -53571 -75348 20730 101248
6511A01248j70180j52076M699P5819J94799J3873j88093j0086J06340J74424j36734
6500A4033m1726r4247J25390N2393R0258P9021j36346q7277n4116m512o3816J58309
6488C7364J10877K4798j45213J8040m4923O7207J19135o0509j8484Q978j865J3303
6476A28708L4941Q5336j9738m0291p8638j80410K5317M6898L4707k20767p2855
6465b56792J11526N6028N0104N1409K8305j54490j78407O9928K5340N2399L1697
6454a12953p1654K391j3423J47321J78725L2409l1290j9616O0476k69614m8330
6443a45558J13556j615K209j7895M9331O6689Q3648N6064L0325J7804j03722k4836
6431A26000j53766n1443L0907J06162R1331K07806j10391j7679l4694P7884l9628
$$ plain form
6511 101248 -68932 -221008 -216309 -140490 54309 68182 -119911 -129997 -23657 150767 14033
6500 14033 -27693 -121940 3450 55843 146101 225122 88776 1499 -52617 -57129 -120945 37364
6488 37364 148241 173039 27826 45866 943 68150 187285 126776 108292 117270 115405 128708
6476 128708 163649 248985 229247 188956 110318 -70092 -44775 2123 36830 -183937 -256792
6465 -256792 -145266 -89238 -39134 12275 40580 -113910 -292317 -222389 -197049 -144650 -112953
6454 -112953 -184607 -182216 -195639 -48318 130407 162816 131526 111910 172386 -97228 -145558
6443 -145558 -32002 -33617 -31408 -49303 28 66717 150365 206429 236754 254558 150836 126000
6431 126000 -27766 -79209 -48302 57860 149191 356997 246606 228927 194233 272117 232489
6420B32489k39182j70248P9363P0916R7695K669j37983J0077m8829L5672o0454
6409a27815m6424L1650j4780R8487n5439q2570m5468P6013Q6620J40595J0040
6398G0909r868p6872J7894K1408o725J7325Q2610K5597j18513j45412q6548N8637
6386a49558j0366p1159p235P3609N2598K6652M4332M5770J5131L6033J35287j17393
6374G3701k43609J03848j7971j16661J48221P9546j6378K18044J80590q8785k08784
6363A11762k65222j70506K06537J13838K3885K1920q0309p3567k5220J04266N8964
6352B6348M6418M9791m9418m7435l1877n9646k8192l9573j9641O4392J36554Q5402
6340A33123M6073m4922K3349l7199k2924o7787k18851j5854n4071j8949K8168
$$ plain form
6420 232489 -6693 -176941 -97578 -26662 71033 73702 -64281 -54204 -103033 -67361 -127815
6409 -127815 -174239 -142589 -157369 -58882 -114321 -196891 -242359 -166346 -79726 60869 70909
6398 70909 61041 -15831 2063 23471 16746 34071 116681 142278 23765 -121647 -208195 -149558
6386 -149558 -159924 -231083 -238318 -164709 -112111 -85459 -41127 4643 19774 55807 191094 73701
6374 73701 -169908 -66060 -84031 -200692 -52471 27075 10697 228741 409331 320546 111762
6363 111762 -153460 -323966 -117429 -3591 20294 42214 -38095 -111662 -136882 -32616 26348
6352 26348 72766 122557 73139 25704 -6173 -65819 -94011 -133584 -153225 -88833 47721 133123
6340 133123 179196 134274 157623 120424 97500 29713 -189138 -204992 -259063 -278012 -249844
6329b49844K93073J55167N3753O0733Q7645n7259m4525n7584k13097p2537J21516
6318G7041p0105k34190j87743L2227K08636p1957r184L03076J14563p8275p4448
6307I641J61454K3260p1138j6406p010N2153j55050j66651Q8572J30105n2805
6296c875j78772o9610P6250J6107J0806m4593o8628q1209K54743K41256J53407
6285C05882m9856j79679l833M9120q233r5433p7173P9890Q0878O7631M5159o4803
6273A49550n025o3754m0873k8588Q312l5177n4078R591j55558P6672M4802P1338
6261b2788P9902j2086j26745j89321j31545J99135O3170k1815q1010Q2018r5144
6250b56229p9304P3390J14311K22263J44025o671p3346j16819l20730l0760l5075
$$ plain form
6329 -249844 43229 198396 252149 312882 400527 343268 298743 241159 28062 -44475 77041
6318 77041 6936 -227254 -414997 -382770 -174134 -246091 -255275 47801 162364 84089 9641
6307 9641 171095 194355 123217 106811 99801 151954 -3096 -169747 -81175 48930 -3875
6296 -3875 -182647 -252257 -176007 -159900 -149094 -193687 -262315 -343524 -88781 152475 305882
6285 305882 256026 76347 72514 121634 113401 17968 -59205 20685 101563 169194 214353 149550
6273 149550 144525 80771 39898 11310 19622 -15555 -69633 -60042 -215600 -138928 -94126 -22788
6261 -22788 57114 45028 -81717 -271038 -402583 -203448 -140278 -162093 -243103 -161085 -256229
6250 -256229 -335533 -262143 -147832 74431 218456 211785 138439 21620 -299110 -329870 -364945
6239c64945O8164n8595l4586N1096O1220r6276o0951P1578N4678J48949q5353
6228b45021P6293l4175K3202J1593N3165j82193r4477J05752P8927l1871j21414
6217c60219J0583O9486J25405J60644o147j57927N72P2789J15010Q3133P9901
6206A93230j38629m2354O3034J34063L866j25299L456P4017R6711j1417j04002
6195A46676j06740J2270k6156J6309l5400n5232n3050K7011K974m5792O781K8777
6183h1572Q4464l8205q9399k9165J62779O2911j2204j4154J13326j4701j75448
6172c1368J65452K6005m1142r2441l2140L295l6432l2946j34376j63336K5955
6161c43474J7495J32291J17634O151m5793L530p1009J04845K5802o6015p8300
$$ plain form
6239 -364945 -296781 -355376 -389962 -338866 -277646 -373922 -434873 -363295 -308617 -159668 -245021
6228 -245021 -168728 -202903 -179701 -168108 -114943 -297136 -391613 -285861 -206934 -238805 -360219
6217 -360219 -349636 -280150 -154745 5899 -248 -158175 -157603 -84814 30196 113329 193230
6206 193230 54601 12247 75281 209344 213210 87911 91367 165384 262095 250678 146676
6195 146676 39936 52206 26050 42359 6959 -48273 -101323 -74312 -71338 -117130 -110349 -81572
6183 -81572 2892 -35313 -124712 -153877 8902 71813 59609 45455 158781 144080 -31368
6172 -31368 134084 160089 118947 26506 -5634 -2339 -38771 -71717 -206093 -369429 -343474
6161 -343474 -325979 -193688 -76054 -69903 -115696 -112166 -183175 -78330 -52528 -118543 -196843
6150a96843K5286k5997m7005M464R7273Q1062J42201K8613J9617j04523j13207
6139h9059J16807J4031o2600j3272Q217j7823j2077M4244m7319j27677J61216
6128b5312J89586n6258P461N1945l5129j52241M5503l0607J9846j14089k18919
6117c18214o2058m1659J33802M1089k6000n3916R3334O1062m9188P5085L6044
6106a10619R3487K07318m4288N3310K4492M519k1617o8349n1087R310m5370J8414
6094F9520j0472j9643q6122k4349K10506K8034r7023o6213K9285J0614J74390
6083B18527L8328q172j54752L6516L2640j34287j64455p1325J50859R0265m8120
6072a3976p3712K3823o7859k9818q908M0849j13703r5124J27399J02798Q8999
$$ plain form
6150 -196843 -171557 -197554 -244559 -240095 -142822 -61760 80441 109054 128671 24148 -89059
6139 -89059 27748 41779 -20821 -34093 -25876 -43699 -55776 -11532 -58851 -186528 -25312
6128 -25312 164274 108016 115477 167422 132293 -19948 25555 -5052 14794 -99295 -318214
6117 -318214 -380272 -421931 -288129 -247040 -273040 -326956 -233622 -172560 -221748 -146663 -110619
6106 -110619 -17132 190186 145898 199208 223700 228219 206602 138253 87166 96476 51106 69520
6094 69520 59048 39405 -46717 -71066 139440 167474 70451 4238 33523 44137 218527
6083 218527 256855 248683 93931 130447 163087 28800 -135655 -206980 -56121 34144 -13976
6072 -13976 -87688 -63865 -131724 -161542 -170450 -129601 -243304 -338428 -211029 -108231 -19232
6061a9232m5692k6148K9152R2209N7592j67466K9595J02813n5473k19382J7150
6050b04882L16129J99291O5176k74160q0900n703R5585O3717o7247m4357M970
6039F7619j30146l9101M9693p2305j48071j7570J46717J12147l1613K17971l1521
6028A23820r8704o7204K5300Q379K5908j24693P004n4774K0659p4414R4414J89237
6016G4932O9955k3753q6156r0636l8401K16496J17997N6132N1191q935k07363
6005A31459n6169j00854O1685R6704P6514R8054J13031N278j366r8290m5241j2673
5993B68132j0488r6637o5537P1291q2956M7023O5254n6956J72529l90j0634J10683
5981D11314n2934j00025o1291k24325k4100P0234L5019j2400J56796k2184j78431
$$ plain form
6061 -19232 -64924 -91072 -61920 30289 87881 -79585 -49990 52823 -2650 -222032 -204882
6050 -204882 111247 310538 375714 101554 20654 14951 110536 174253 107006 62649 67619
6039 67619 -62527 -101628 -51935 -124240 -272311 -289881 -143164 -31017 -62630 155341 123820
6028 123820 25116 -42088 -16788 -8409 17499 -107194 -100190 -154964 -134305 -208719 -114305 74932
6016 74932 144887 121134 34978 -55658 -94059 122437 240434 296566 347757 338822 131459
6005 131459 75290 -25564 36121 132825 209339 307393 420424 425702 424336 326046 280805 268132
5993 268132 257644 161007 95470 166761 83805 130828 196082 139126 311655 311265 300631 411314
5981 411314 358380 258355 197064 -27261 -51361 18873 53892 41492 198288 176104 -2327
5970b327j30640j30489p8361M6027K79266O8392j67839O5869R5445J5006o0997
5959f48J51436Q6252j74373q0517J18487K3809j38253M16K68468M3531p4672k6894
5947A97042n8640j48397q8119J07759j96539m6468J65753J92333n9294j05337
5937c9907J47807J13275m0066p337n5583j25268p696J13778J80950j4631j46777
5926A18545m0544J02956q7303k05863j60622J33800J67921J5968O9416o5632m5400
5915C242Q7853r6318j33803j23870K07301K12970o1480j42074q4853K519J85568
5904E7055L5710k5847M2534J3726N5377q4501q0590k9535J15982p8423l68Q7266
5892A08386o947j86072k20947o118J24004q5994L5561J53079Q1898J57415j07609
$$ plain form
5970 -2327 -132967 -263456 -341817 -295790 -16524 51868 -115971 -50102 45343 60349 -648
5959 -648 150788 237040 62667 -17850 100637 124446 -13807 -13391 255077 298608 223936 197042
5947 197042 138402 -9995 -98114 9645 -186894 -233362 -67609 124724 65430 -39907
5937 -39907 107900 221175 181109 173772 118189 -7079 -14775 99003 279953 265322 118545
5926 118545 78001 180957 93654 -112209 -272831 -139031 28890 44858 114274 48642 3242
5915 3242 91095 -5223 -139026 -262896 -55595 157375 95895 -46179 -131032 -128513 57055
5904 57055 92765 66918 109452 123178 178555 94054 13464 -16071 99911 21488 21120 108386
5892 108386 101439 -84633 -305580 -311698 -187694 -273688 -238127 -85048 -3150 154265 46656
5881D6656k16317L7370J45025R6345j42360j20806J23276Q9128M6046o8635k5121
5870A0607Q680l0626k5866J17288n3288k47912L223O9392q4128j26874j0694J18652
5858b51546K07019j7324n3668P4177j09118j34254J31458J87722k4260j53349
5848a43143j1225J61578l0036p5982q2013N4008J15180l1180k0470P31mn653p3097
5835a41306j7463J02879J02219j15353p4806J84931l8557n2080K9277M4901j11708
5824h7066j32060J52797o3343k1603P2890J6316n1139K8036R0142l2765N2617
5813B4822K46567J5318p3987j83026p3203R5537J10377n3364o6445n2071K6342
5802A6867N5639P4306j43886M4057J05773O1589k40156k7880l3316j07102J72409
$$ plain form
5881 46656 -169661 -132291 12734 109079 -33281 -154087 -30811 58317 104363 35728 10607
5870 10607 19287 -11339 -37205 80083 26795 -221117 -217894 -148502 -232630 -359504 -370198 -251546
5858 -251546 -44527 -61851 -115519 -41342 -150460 -284714 -153256 34466 10206 -143143
5848 -143143 -154368 7210 -22826 -98808 -180821 -126813 -11633 -42813 -63283 -62552 -62556 -68209 -141306
5835 -141306 -158769 -55890 46329 -69024 -143830 41101 2544 -49536 -20259 24642 -87066
5824 -87066 -219126 -66329 -129672 -151275 -78385 -62069 -113208 -85172 4970 -27795 24822
5813 24822 271389 286707 212720 29694 -43509 52028 162405 109041 42596 -9475 16867
5802 16867 72506 146812 2926 46983 152756 214345 -25811 -53691 -87007 -194109 -21700
5791b1700L0457J7589J02033K30304j61318k53707N2618M0715M1062P4903K6606
5780A79562p4590k01196j96318j15467K14064J15478K0997J02707J3584o6186
5770g365J28343j6278k3449l9741o4563j64987J00019O8111J43199n5558j33731
5759f6000K3404O6205j72681j06532O2540J4883P743n1081m2078J78383N8947
5748b6267M0475K19633K6378k55431j16742k0213Q9020l4498j50705l2821j5740
5737b76911j68479Q7890J01513j09946r9434R1945J11411L8607K06026j0734O1449
5726C3337r34o7699o7250p5581l0144J59064J02666q9646L2464p4732q2276p029
5714a67760n5833O9806J3648M2013J45721q5365q6930j32927j2370K009l2821
$$ plain form
5791 -21700 8757 26346 128379 358683 197365 -56342 -3724 36991 78053 152956 179562
5780 179562 104972 -96224 -292542 -408009 -193945 -78467 -57470 45237 58821 -7365
5770 -7365 120978 104700 81251 41510 -23053 -188040 -88021 -19910 123289 67731 -66000
5759 -66000 -42596 23609 -149072 -255604 -193064 -178181 -170438 -221519 -263597 -85214 -26267
5748 -26267 14208 233841 260219 4788 -111954 -132167 -43147 -77645 -228350 -261171 -276911
5737 -276911 -445390 -357500 -255987 -365933 -465367 -373422 -262011 -223404 -17378 -28112 33337
5726 33337 32403 -35296 -102546 -178127 -208271 -49207 53459 -36187 -3723 -78455 -160731 -167760
5714 -167760 -223593 -153787 -140139 -98126 47595 -37770 -124700 -257627 -269997 -267988 -300809
5703c00809J27272R1724R4666R7278J06013j42444j26806m5091j01555P1776k3973
5692a51949Q5437N2497J28349j725j86063P8438J09112j07735n2789L900k3305
5681f5833J28844O9855O3304o5017r9370k2889j52456j36043J05847J80127J08443
5670A14812J02953j59319n0511p7271J52416Q2096M7995J7940m6351j43964k58966
5659b18170n6955Q4096M631K37108L1930j76749j3297M5089p1415m7451K2582
5648a58601p218J7461Q5527L1917p597O1721L3872j39792j5514l7023J10206M2117
5636A7076o824K40834K8108j54743k17017j41515J12125K3863J20258O5366r5402
5625g871M3315J12817P8152j93909j79789Q0701J09376j87408k3691Q6431L8499
$$ plain form
5703 -300809 -173537 -81813 12853 110131 216144 73700 -53106 -98197 -199752 -127976 -151949
5692 -151949 -66512 -14015 114334 112609 -73454 4984 114096 6361 -46428 -42528 -65833
5681 -65833 63011 132866 196170 131153 31783 8894 -143562 -279605 -173758 6369 114812
5670 114812 217765 58446 7935 -69336 83080 165176 213171 231111 184760 40796 -218170
5659 -218170 -275125 -191029 -186398 50710 82640 -94109 -107406 -62317 -133732 -181183 -158601
5648 -158601 -165819 -148358 -62831 -30914 -38511 23210 57082 -82710 -98224 -135247 -25041 17076
5636 17076 10252 251086 279194 124451 -92566 -234081 -121956 -98093 22165 87531 -7871
5625 -7871 35444 148261 226413 32504 -147285 -66584 42792 -144616 -168307 -81876 -43377
5614d3377J6179K33148j3466k9761j47581J52869J98152m4204k92817j68938j235
5603a41031k1266J8220m3328k3688R3557m0938r2949J53812L055k2228L4033Q3917
5591A166k79J20779j46175k06596j0343J41575k071p4444L257j252j6310o2657
5579b53350m0109o9144J22972k315k4071o634q7939J1107K07407P737o068j1737
5567a52144J33128O7875o956K6349m2887j29534q8525J7067J2779J438j42971
5556c04381J8001O1347J39001l4438O9264k0328k5677P1770j21557m2442n5453
5545b44893j85825J76140J35208J99497K4599j448k1677Q527J37331l4595N7007
5534B49871q5479r5516q6191J59645J6516p2358p8619j25559k05967J89745P7399
$$ plain form
5614 -43377 -27198 205950 192484 162723 15142 168011 366163 321959 29142 -139796 -141031
5603 -141031 -162297 -144077 -187405 -211093 -117536 -158474 -251423 -97611 -94556 -116784 -82751 1166
5591 1166 887 121666 -24509 -231105 -241448 -99873 -101944 -176388 -173131 -174383 -190693 -253350
5579 -253350 -293459 -362603 -239631 -241946 -266017 -272651 -360590 -349483 -142076 -134339 -140407 -152144
5567 -152144 -19016 48859 41903 68252 25365 -104169 -192694 -175627 -162848 -161410 -304381
5556 -304381 -286380 -225033 -86032 -120470 -51206 -71534 -97211 -25441 -146998 -189440 -244893
5545 -244893 -430718 -254578 -119370 80127 104726 103278 81601 90128 227459 192864 249871
5534 249871 164392 68876 -17315 142330 158846 86488 7869 -117690 -323657 -133912 -56513
5523e6513q1147K0046m2491k7902J73891J7533k33911M0003J83615O9650M4915
5512A07689J675j8596r3173k9527J3050j5036K560J11603q6936L9876J44015L627
5500A80827k24614j36761K5426j16051j8996k952Q0457J34160J75918Q6679q1413
5489A02680p6978j6049p6741l5630J119k4025q6303J10746P7287Q9430K8552K9950
5477A24038K7721P145r7700j76092J0996J49886o8723j10672K06669K9067l02582
5466b00247o7900J47338R0941R8963J79475K9010j87758n5528o8146j43865P6895
5455a00822M02P5795r787m830q381m5298K4142M072k0820K4958j9253q0966m482
5442a65270M5746j9888n0472l0875k2205k1981L2945J71583O231q0351l1547J89181
$$ plain form
5523 -56513 -137660 -117614 -160105 -188007 -14116 3417 -230494 -190491 -6876 62774 107689
5512 107689 109364 90768 -2405 -31932 -18882 -33918 -31358 80245 -6691 33185 177200 180827
5500 180827 -43787 -180548 -155122 -271173 -290169 -293121 -212664 -78504 97414 184093 102680
5489 102680 25702 9653 -67088 -102718 -101599 -125624 -211927 -101181 -23894 65536 94088 124038
5477 124038 151759 158904 61204 -114888 -103892 45994 -22729 -133401 73268 102335 -200247
5466 -200247 -268147 -120809 -29868 69095 248570 277580 89822 34294 -33852 -177717 -100822
5455 -100822 -100420 -24625 -34412 -39242 -47623 -92921 -68779 -64707 -85527 -60569 -79822 -160788 -165270
5442 -165270 -119524 -139412 -189884 -220759 -242964 -264945 -232000 -60417 -54186 -134537 -166084 23097
5430B3097J6075n9688K6086N1771k5554q6754L2027j9452q9460k4197K7535l1407
5418a59921O9709k8319K2552J7567N99o4856n1639Q3849N3781O4112o7451j6749
5406g6766L1386n6104j0164P449N066n1076q1423l5379K09283l3667m9313J68686
5394B7978J30210q5532j12729m9257J3305l0079k6736J01497l1382r4262J8118
5383a38869K10941J06994K0009n5946j11102k22559j62069l1470l0775p6199J03904
5372c87141K02573K00314J84640L6025j31815k37329N7684N5843M1225j06531
5362h4512j42359K1294r8248Q88J33772j15599L8187J26578J46529k06842l14998
5351d95310K679N0264L2402J10809K10198Q2993J7754L8795L0502p2561L3421
$$ plain form
5430 23097 39172 -20516 5570 57341 31787 -54967 -22940 -42392 -131852 -156049 -128514 -159921
5418 -159921 -90212 -118531 -95979 -78412 -77813 -142669 -194308 -110459 -56678 7434 -60017 -76766
5406 -76766 -45380 -101484 -111648 -104199 -99133 -150209 -231632 -267011 -57728 -91395 -140708 27978
5394 27978 158188 72656 -40073 -89330 -76025 -106104 -132840 -31343 -62725 -156987 -138869
5383 -138869 72072 179066 199075 143129 32027 -190532 -352601 -384071 -414846 -491045 -387141
5372 -387141 -184568 15746 200386 236411 104596 -132733 -75049 -19206 22019 -84512
5362 -84512 -226871 -205577 -303825 -302937 -169165 -284764 -246577 -119999 26530 -180312 -495310
5351 -495310 -492631 -442367 -409965 -299156 -88958 -5965 11789 50584 81086 8525 41946
5340D1946l347q9339r7209m4196K2835J56091o6668K5588l9548Q4153n0998m2292
$$ plain form
5340 41946 38599 -50740 -147949 -192145 -169310 -13219 -79887 -54299 -93847 -9694 -60692 -102984
$$ [...]
##END NTUPLES=NMR SPECTRUM
##END=
