##TITLE=Analysis number 326602
Compound Code mo 08104
Project Code adrs
Chemist Name chemcon
##JCAMPDX= 6.0         $$ Bruker NMR JCAMP-DX V2.0
##DATA TYPE= NMR SPECTRUM
##DATA CLASS= NTUPLES
##ORIGIN= Bruker BioSpin GmbH
##OWNER= nmr
$$ XWIN-NMR		Version 3.5
$$ Thu Feb 15 09:20:43 2007 GMT Standard Time (UT+0h)  MAYBRIDGE\nmr@NMR_250MHZ
##.OBSERVE FREQUENCY= 250.131544655141
##.OBSERVE NUCLEUS= ^1H
##.ACQUISITION MODE= SIMULTANEOUS (DQD)
##.ACQUISITION SCHEME= undefined
##.AVERAGES= 16
##.DIGITISER RES= 18
##SPECTROMETER/DATA SYSTEM= dpx250
##.PULSE SEQUENCE= zg30
##.SOLVENT NAME= DMSO
##.SHIFT REFERENCE= (INTERNAL, DMSO, 0, 16.522)
##AUDIT TRAIL= $$ (NUMBER, WHEN, WHO, WHERE, WHAT)
$$ ##TITLE= Audit trail, XWIN-NMR		Version 3.5
$$ ##JCAMPDX= 5.01
$$ ##ORIGIN= Bruker BioSpin GmbH
$$ ##OWNER= nmr
$$ C:\u/data/dgb/nmr/ADRS/900/pdata/1/auditp.txt
$$ ##AUDIT TRAIL=  $$ (NUMBER, WHEN, WHO, WHERE, WHAT)
(   1,<2007-02-15 09:20:25.19 +000>,<MAYBRIDGE\nmr>,<NMR_250MHZ>,
      <created by zg, POWCHK disabled, PULCHK disabled
       configuration hash MD5:
       49 4B E0 1D 92 C2 6B 37 9F E6 65 BC 52 41 86 1D
       data hash MD5: 64K
       84 1A 12 5F 1C 6B CD 8A 36 53 F4 8D E4 50 4F 9C>)
(   2,<2007-02-15 09:20:35.91 +000>,<MAYBRIDGE\nmr>,<NMR_250MHZ>,
      <Start of raw data processing
       ef LB = 0.3 FT_mod = 6 PKNL = 1 SI = 32K 
       data hash MD5: 32K
       10 F0 7F E2 E9 17 E7 9D 24 C0 15 FC 11 E4 24 B7>)
(   3,<2007-02-15 09:20:37.85 +000>,<MAYBRIDGE\nmr>,<NMR_250MHZ>,
      <apk 
       data hash MD5: 32K
       64 70 AD 44 8C AC 68 F2 11 B2 DE 12 90 46 0F 0A>)
(   4,<2007-02-15 09:20:38.61 +000>,<MAYBRIDGE\nmr>,<NMR_250MHZ>,
      <abs ABSG = 5 
       data hash MD5: 32K
       72 0E 0E 62 71 CD 1B C3 4A ED 04 38 84 21 30 87>)
$$ ##END=
$$ 
$$ hash MD5
$$ 95 C4 73 4A D8 91 37 3E B9 B9 FC 06 F4 24 DE 14
##$RELAX= 
##$RELAX= 
##$RELAX= 
##$RELAX= 
##$RELAX= 
##$RELAX= 
##$RELAX= 
$$ Bruker specific parameters
$$ --------------------------
##$DU= <C:\u>
##$EXPNO= 900
##$NAME= <ADRS>
##$PROCNO= 1
##$TYPE= <nmr>
##$USER= <dgb>
##$AMP= (0..31)
100 100 100 100 100 100 100 100 100 100 100 100 100 100 100 100 100 100 
100 100 100 100 100 100 100 100 100 100 100 100 100 100 
##$AQSEQ= 0
##$AQ_mod= 3
##$AUNM= <au_zg>
##$AUTOPOS= <52 >
##$BF1= 250.13
##$BF2= 250.13
##$BF3= 250.13
##$BF4= 250.13
##$BF5= 500.13
##$BF6= 500.13
##$BF7= 500.13
##$BF8= 500.13
##$BYTORDA= 1
##$CFDGTYP= 0
##$CFRGTYP= 5
##$CHEMSTR= <none>
##$CNST= (0..31)
1 1 145 1 1 1 1 1 1 1 1 1 1 1 1 1 1 1 1 1 1 1 1 1 1 1 1 1 1 1 1 1 
##$CPDPRG= <>
##$CPDPRG1= <>
##$CPDPRG2= <>
##$CPDPRG3= <>
##$CPDPRG4= <mlev>
##$CPDPRG5= <mlev>
##$CPDPRG6= <mlev>
##$CPDPRG7= <mlev>
##$CPDPRG8= <mlev>
##$CPDPRGB= <>
##$CPDPRGT= <>
##$D= (0..31)
0 1 0 0 0 0 0 0 0 0.06 0 0 0 0 0 0 0.0002 0 0 0 0 0 0 0 0 0 0 0 0 0 0 
0 
##$DATE= 1171531224
##$DBL= (0..7)
120 120 120 120 120 120 120 120 
##$DBP= (0..7)
150 150 150 150 150 150 150 150 
##$DBP07= 0
##$DBPNAM0= <>
##$DBPNAM1= <>
##$DBPNAM2= <>
##$DBPNAM3= <>
$$ [...]
##$SUBNAM7= <"">
##$SUBNAM8= <"">
##$SUBNAM9= <"">
##$SW= 20.6930455092707
##$SWIBOX= (0..15)
0 0 3 0 0 0 0 0 0 0 0 0 0 0 0 0 
##$SW_h= 5175.983436853
##$TD= 65536
##$TD0= 1
##$TE= 295.16
##$TE2= 300
##$TE3= 300
##$TEG= 300
##$TL= (0..7)
0 120 120 120 120 120 120 120 
##$TP= (0..7)
150 150 150 150 150 150 150 150 
##$TP07= 0
##$TPNAME0= <>
##$TPNAME1= <>
##$TPNAME2= <>
##$TPNAME3= <>
##$TPNAME4= <>
##$TPNAME5= <>
##$TPNAME6= <>
##$TPNAME7= <>
##$TPOAL= (0..7)
0.5 0.5 0.5 0.5 0.5 0.5 0.5 0.5 
##$TPOFFS= (0..7)
0 0 0 0 0 0 0 0 
##$TUNHIN= 0
##$TUNHOUT= 0
##$TUNXOUT= 0
##$USERA1= <user>
##$USERA2= <user>
##$USERA3= <user>
##$USERA4= <user>
##$USERA5= <user>
##$V9= 5
##$VALIST= <valist>
##$VCLIST= <CCCCCCCCCCCCCCC>
##$VD= 0
##$VDLIST= <DDDDDDDDDDDDDDD>
##$VPLIST= <PPPPPPPPPPPPPPP>
##$VTLIST= <TTTTTTTTTTTTTTT>
##$WBST= 1024
##$WBSW= 4
##$XGAIN= (0..3)
0 0 0 0 
##$XL= 0
##$YL= 0
##$YMAX_a= 276980
##$YMIN_a= -334894
##$ZGOPTNS= <>
##$ZL1= 120
##$ZL2= 120
##$ZL3= 120
##$ZL4= 120
##$ABSF1= 16.522
##$ABSF2= -4.171173
##$ABSG= 5
##$ABSL= 3
##$ALPHA= 0
##$AQORDER= 0
##$ASSFAC= 0
##$ASSFACI= 0
##$ASSFACX= 0
##$ASSWID= 0
##$AUNMP= <proc_1d>
##$AZFE= 0.1
##$AZFW= 0.1
##$BCFW= 0
##$BC_mod= 0
##$BYTORDP= 0
##$COROFFS= 0
##$CY= 12.5
##$DATMOD= 1
##$DC= 0
##$DFILT= <>
##$DTYPP= 0
##$F1P= 14.0000005364418
##$F2P= -0.99999901652339
##$FCOR= 0.5
##$FTSIZE= 32768
##$FT_mod= 6
##$GAMMA= 0
##$GB= 0
##$INTBC= 1
##$INTSCL= 1
##$ISEN= 128
##$LB= 0.3
##$LEV0= 0
##$LPBIN= 0
##$MAXI= 10000
##$MC2= 0
##$MEAN= 0
##$ME_mod= 0
##$MI= 0
##$NCOEF= 0
##$NC_proc= -5
##$NLEV= 6
##$NOISF1= 0
##$NOISF2= 0
##$NSP= 0
##$NTH_PI= 0
##$NZP= 0
##$OFFSET= 16.522
##$PC= 1
##$PHC0= 186.3558
##$PHC1= 65.05891
##$PH_mod= 1
##$PKNL= yes
##$PPARMOD= 0
##$PSCAL= 4
##$PSIGN= 0
##$REVERSE= no
##$SF= 250.13
##$SI= 32768
##$SIGF1= 0
##$SIGF2= 0
##$SINO= 400
##$SIOLD= 32768
##$SREGLST= <1H.DMSO>
##$SSB= 0
##$STSI= 32768
##$STSR= 0
##$SW_p= 5175.98343685301
##$SYMM= 0
##$S_DEV= 0
##$TDeff= 65536
##$TDoff= 0
##$TI= <Analysis number 999999
Compound Code 99
Book Reference 9
Project Code 9>
##$TILT= no
##$TM1= 0
##$TM2= 0
##$TOPLEV= 0
##$USERP1= <user>
##$USERP2= <user>
##$USERP3= <user>
##$USERP4= <user>
##$USERP5= <user>
##$WDW= 1
##$XDIM= 32768
##$YMAX_p= 572645708
##$YMIN_p= -11546488
$$ End of Bruker specific parameters
$$ ---------------------------------
##NTUPLES= NMR SPECTRUM
##VAR_NAME=  FREQUENCY,     SPECTRUM/REAL,   SPECTRUM/IMAG
##SYMBOL=    X,             R,               I
##VAR_TYPE=  INDEPENDENT,   DEPENDENT,       DEPENDENT
##VAR_FORM=  AFFN,          ASDF,            ASDF
##VAR_DIM=   32768,         32768,           32768
##UNITS=     HZ,            ARBITRARY UNITS, ARBITRARY UNITS
##FACTOR=    0.157963299565203, 1,           1
##FIRST=     4132.6476996994, 0,             0
##LAST=      -1043.33573715361, 0,           0
##MIN=       -1043.33573715361, -11546488,   0
##MAX=       4132.6476996994, 572645708,     0
$$ Real data points
##PAGE= N=1
##DATA TABLE= (X++(R..R)), XYDATA
$$ [...]
15642A176323l4853N3767P700Q460P0606l3354j01157l3596J5760L8087O5444
$$ 1176323 1141470 1195237 1202937 1211397 1282003 1248649 1147492 1113896 1129656 1167743 1233187
15631A233187L8459k0518l6003k4686j1362K6242N2870l5401l5647J2161l5255
$$ 1233187 1271646 1251128 1215125 1190439 1179077 1205319 1258189 1222788 1187141 1199302 1164047
15620A164047l2659J2055k4555L0683Q3760k4679m1277l6046k6625P5805L0017
$$ 1164047 1131388 1143443 1118888 1149571 1233331 1208652 1167375 1131329 1104704 1180509 1210526
15609A210526p8973L0775j688M458J32300L4451K4982j5891j32783m6016J12374
$$ 1210526 1131553 1162328 1160640 1165098 1297398 1331849 1356831 1340940 1208157 1162141 1274515
15598A274515K4625k0884j6528k4540K6125M8693J3188J1414n6437j1152N2360
$$ 1274515 1299140 1278256 1261728 1237188 1263313 1312006 1325194 1336608 1280171 1269019 1321379
15587A321379n3326o5048O701P0432J6985J4059K8064o7158Q627m4463K6874L1683
$$ 1321379 1268053 1203005 1209706 1280138 1297123 1311182 1339246 1272088 1280715 1236252 1263126 1294809
15575A294809l8695j06047j2849J19188L1123L4138J4818L7282k7634M464O5017
$$ 1294809 1256114 1150067 1137218 1256406 1287529 1321667 1336485 1373767 1346133 1350597 1415614
15564A415614J4904k9654p9878r915L7096K5381j9812k9693j05850J7432P0105
$$ 1415614 1430518 1400864 1320986 1311071 1348167 1373548 1353736 1324043 1218193 1235625 1305730
15553A305730L2408K8916l7258m5159N24R308Q8377J7560o6251j4070J3853m2004
$$ 1305730 1338138 1367054 1329796 1284637 1285161 1294469 1382846 1400406 1334155 1320085 1333938 1291934
15541A291934M7563P955k7547m7092M7355M7059m209l5984M6059J1585j04376
$$ 1291934 1339497 1347452 1319905 1272813 1320168 1367227 1363018 1327034 1373093 1384678 1280302
15530A280302N5873M7020N35m3567j4647n5327J2277J534L1321P165O1839N4868
$$ 1280302 1336175 1383195 1383730 1340163 1325516 1270189 1282466 1284000 1315321 1322486 1384325 1439193
15518A439193O122m7280m3857r936J6187k0779M3662L2501j2403m2712p0570N0711
$$ 1439193 1445315 1398035 1354178 1344242 1360429 1339650 1383312 1415813 1403410 1360698 1290128 1340839
15506A340839M2858M6444L4242j2014p7149o3559J1786Q5505M9108m735L2636
$$ 1340839 1383697 1430141 1464383 1452369 1375220 1311661 1323447 1408952 1458060 1453325 1485961
15495A485961j4270J9370K7814K781n8883p3748j2978M4493M2294L438K649J4759
$$ 1485961 1471691 1491061 1518875 1521656 1462773 1389025 1376047 1420540 1462834 1466272 1468921 1483680
15483A483680q648j7411N0591l952J9408q859N3446L1027j1075J238n2958o6539
$$ 1483680 1475032 1457621 1508212 1504260 1523668 1514809 1568255 1599282 1588207 1589445 1536487 1469948
15471A469948j4019K9367k759o764j8088M1189O8574q440j6214P0069M73j08482
$$ 1469948 1455929 1485296 1482537 1475773 1457685 1498874 1567448 1559008 1542794 1612863 1613336 1504854
15459A504854L5458Q140j5970L3094K0279L0497R065k0496k8833P8908J7970n2150
$$ 1504854 1540312 1548452 1532482 1565576 1585855 1616352 1625417 1604921 1576088 1654996 1672966 1620816
15447A620816j00085N6806L8453L7064o011k8972l9482L4453k4783k6325K8948
$$ 1620816 1520731 1577537 1615990 1653054 1647043 1618071 1578589 1613042 1588259 1561934 1590882
15436A590882J1227P925J1820P1363O2259L356o1617n6666M2653N7863j6904l0768
$$ 1590882 1602109 1610034 1621854 1693217 1755476 1758832 1697215 1640549 1683202 1741065 1724161 1693393
15424A693393K9911m9355k9950m9392k6246L055j2142j9740O2682k34o673J4515
$$ 1693393 1723304 1673949 1643999 1594607 1568361 1571416 1559274 1539534 1602216 1601982 1595309 1609824
15412A609824J4432j4739L1069L2271j3540j3319L4067m3229k0029j0729n7969
$$ 1609824 1624256 1609517 1640586 1672857 1659317 1645998 1680065 1636836 1616807 1606078 1548109
15401A548109J7046Q6915M4426m888n1103n4356O2924K233j5026J7215J8731K8330
$$ 1548109 1565155 1652070 1696496 1691608 1640505 1586149 1649073 1651306 1636280 1653495 1672226 1700556
15389A700556P0040m244j00597l4180P7754l4456j6294K4702k3863K2384J9333
$$ 1700556 1770596 1766352 1665755 1631575 1709329 1674873 1658579 1683281 1659418 1681802 1701135
15378A701135l346j7011L0085J3985P3363k3401r6475L150m3154l1505J34918
$$ 1701135 1697789 1680778 1710863 1724848 1798211 1774810 1678335 1681485 1638331 1606826 1741744
15367A741744Q4356m4829N0173J2987m4395j9752j3666n5059k9446N929K8959
$$ 1741744 1826100 1781271 1831444 1844431 1800036 1780284 1766618 1711559 1682113 1688042 1717001
15356A717001J1102l1147K3857N3912k0426p8246j893k1508M0685J5558q1979
$$ 1717001 1728103 1696956 1720813 1774725 1754299 1676053 1674160 1652652 1693337 1708895 1626916
15345A626916r918K2564j1111P1225K8585J8236l9533L1018m125J342J8379J6112
$$ 1626916 1616998 1639562 1628451 1699676 1728261 1746497 1706964 1737982 1733857 1735199 1753578 1769690
15333A769690L0207Q2860J4663n3089M2133K850n0427o4064k5645o662p1631K2954
$$ 1769690 1799897 1882757 1897420 1844331 1886464 1889314 1838887 1774823 1749178 1742516 1670885 1693839
15321A693839L2577l1449k9706M351m283l6694J9837O6714J01349O4815N0670
$$ 1693839 1726416 1694967 1665261 1669612 1665329 1628635 1648472 1715186 1816535 1881350 1932020
15310A932020L8217o4745r1242j235k984P4476K8303l1382R118p2163o2641J6755
$$ 1932020 1970237 1905492 1814250 1813015 1810031 1884507 1912810 1881428 1890546 1818383 1755742 1772497
15298A772497j4735J5695n2624K3895M5844m4393M9283P0585N034j5470o0679
$$ 1772497 1757762 1773457 1720833 1744728 1790572 1746179 1795462 1866047 1871081 1855611 1794932
15287A794932L5874J5327n3913L0306J8624o6728P7610l0434J9419J2394j6265
$$ 1794932 1830806 1846133 1792220 1822526 1841150 1774422 1852032 1821598 1841017 1853411 1837146
15276A837146O5056O778m7805J9877n3710N5761M1254O911m7628n4550O007N8782
$$ 1837146 1902202 1908980 1861175 1881052 1827342 1883103 1924357 1931268 1883640 1829090 1835097 1893879
15264A893879L917n4027M5429j0198k6428k7758K9286M2051k1861n3160K6717
$$ 1893879 1897796 1843769 1889198 1879000 1852572 1824814 1854100 1896151 1874290 1821130 1847847
15253A847847j8002j11304k4315J20420O6040K3341O623j5100M4961q6678J1115
$$ 1847847 1829845 1718541 1694226 1814646 1880686 1904027 1910650 1895550 1940511 1853833 1864948
15242A864948L3564J0979n207R3383O3300m5925r2902j1984J2097Q865j3189J4853
$$ 1864948 1898512 1909491 1904284 1997667 2060967 2015042 1922140 1910156 1922253 1931118 1917929 1932782
15230A932782j390k0512L9383O0413K8446k1527J73n8303J1498N9913J8649q062
$$ 1932782 1931392 1910880 1950263 2010676 2039122 2017595 2017768 1959465 1970963 2030876 2049525 2041463
15218B041463O737k7936q9390k3373j5356k8428L0541N8661j2037k3349n2568
$$ 2041463 2048200 2020264 1930874 1907501 1892145 1863717 1894258 1952919 1940882 1917533 1864965
15207A864965Q5302l9357j7701N7117N0960k755r4502J216R977K205Q6706J0129
$$ 1864965 1950267 1910910 1893209 1950326 2001286 1998531 1904029 1905245 1915222 1917427 2004133 2014262
15195B014262k4254n9213j4377J5j2186L6074K9236k6378K2552j9467N0417m0488
$$ 2014262 1990008 1930795 1916418 1916433 1904247 1940321 1969557 1943179 1965731 1946264 1996681 1956193
15183A956193o2654L0527L9447l2111j7744j2634N4124K9086k7364L6788k8570
$$ 1956193 1893539 1924066 1963513 1931402 1913658 1901024 1955148 1984234 1956870 1993658 1965088
15172A965088j04185K4398J02961M2343N012N9137m3887n3784L4339J12280l8588
$$ 1965088 1860903 1885301 1988262 2030605 2035617 2094754 2050867 1997083 2031422 2143702 2105114
15161B105114L3429L6725l4672j04165m7388L1128N4764N6783o00l9447j3802
$$ 2105114 2138543 2175268 2140596 2036431 1989043 2020171 2074935 2131718 2131118 2091671 2077869
15150B077869L3358J08039q6803q109P9102l5471K7979M122R730k7891n9640M4625
$$ 2077869 2111227 2219266 2132463 2124354 2203456 2167985 2195964 2200086 2209816 2181925 2122285 2166910
15138B166910p146K5947L774K0420O974q9008n7705O0253L8921M5043K0508o0806
$$ 2166910 2159764 2185711 2189485 2209905 2216879 2127871 2070166 2130419 2169340 2214383 2234891 2174085
15126B174085m4562L0346q62J1989M5845k7658M951K8613K3888L8577q360n4930
$$ 2174085 2129523 2159869 2159007 2170996 2216841 2189183 2194134 2222747 2246635 2285212 2276852 2221922
15114B221922P486K1605p994L0646J1995o162O405K7642k9045o8309o632l3971
$$ 2221922 2229408 2251013 2243019 2273665 2285660 2279498 2285903 2313545 2284500 2216191 2209559 2175588
15102B175588K7157Q9212K9756o9r818j2836n0521J8332J4746N324N8890O134
$$ 2175588 2202745 2291957 2321713 2321644 2311826 2298990 2248469 2266801 2281547 2286871 2345761 2351895
15090B351895o3645N3915J09204N3900R7092J37651j8775P072Q2505O5882N6254
$$ 2351895 2288250 2342165 2451369 2505269 2602361 2740012 2721237 2728309 2810814 2876696 2932950
15079B932950L8801R2231J37780P1688R5289M3154M0681P305n5034m8940m4795
$$ 2932950 2971751 3063982 3201762 3273450 3368739 3411893 3452574 3459879 3404845 3355905 3311110
15068C311110j04683k54106j25792L7041j174m0956j25802J0363L1073k022n3004
$$ 3311110 3206427 2952321 2826529 2863570 2862396 2821440 2695638 2706001 2737074 2735052 2682048
15057B682048l0652l2796J1752M2533m5781p3083n752M8033P0649m9250q5504
$$ 2682048 2651396 2618600 2630352 2672885 2627104 2554021 2548269 2596302 2666951 2617701 2532197
15046B532197j3593K444L6614J0552l1051p6260l1437M7282j4897J118N2239k723
$$ 2532197 2518604 2521048 2557662 2568214 2537163 2460903 2429466 2476748 2461851 2462969 2515208 2512485
15034B512485m7011o2574M9829K7959l5433J9421j3815o99L6936J6795n6094q662
$$ 2512485 2465474 2402900 2452729 2480688 2445255 2464676 2450861 2450162 2487098 2503893 2447799 2439137
15022B439137M0464J5523n4369O4363O1839L552J0847J7803K3182q607O363k8766
$$ 2439137 2479601 2495124 2440755 2505118 2566957 2570509 2581356 2599159 2622341 2613734 2620097 2591331
15010B591331j6810o0762l4936K2486L3196m2590P653J2045J3525k9326j6760
$$ 2591331 2574521 2513759 2478823 2501309 2534505 2491915 2499568 2511613 2525138 2495812 2479052
14999B479052N7891L9249J11766j0338j7663r2001j11831j4350O6986L4422K5049
$$ 2479052 2536943 2576192 2687958 2677620 2659957 2567956 2456125 2441775 2508761 2543183 2568232
14988B568232J1872k8806m3686k2578P7302k4935O136M3809P3714l4763p9035
$$ 2568232 2580104 2551298 2507612 2485034 2562336 2537401 2543537 2587346 2661060 2626297 2547262
14977B547262K3896L2882K98p330r454J518k4465N0374P1484L3780L1673J7111
$$ 2547262 2571158 2604040 2604338 2597008 2587554 2589072 2564607 2614981 2686465 2720245 2751918 2769029
14965B769029j2186M3332n884j9821j4010k8962n3878M570J2089J29018J06770
$$ 2769029 2756843 2800175 2794291 2774470 2760460 2731498 2677620 2682190 2694279 2823297 2930067
14954B930067O686k867K1977J6825p4408L3942L1838k435L6525J0138q6918l8018
$$ 2930067 2936753 2933886 2955863 2972688 2898280 2932222 2964060 2961625 2998150 3008288 2921370 2883352
14942B883352L1357O4561M4220j5136j0498J5272k4884r940K1576L8865L2615
$$ 2883352 2914709 2979270 3023490 3008354 2997856 3013128 2988244 2978304 2999880 3038745 3071360
14931C071360M1076K0699k117j3805O544j2995j6299k3501k453j0201l2127r6954
$$ 3071360 3112436 3133135 3131018 3117213 3123757 3110762 3094463 3070962 3068509 3058308 3026181 2929227
14919B929227M85j9610n1720N1563p908k661J8941n2806n0336L5140N0157k0974
$$ 2929227 2929712 2910102 2858382 2909945 2902037 2899376 2918317 2865511 2815175 2850315 2900472 2879498
14907B879498j0315L427L787m7834P9733N2902m6473O364m8538q691K8773L5191
$$ 2879498 2869183 2872610 2876397 2828563 2908296 2961198 2914725 2921089 2872551 2863860 2892633 2927824
14895B927824p6511r2728J8835N8820K997J6757J1328K7171j6053m3405P0153
$$ 2927824 2851313 2758585 2777420 2836240 2839237 2855994 2867322 2894493 2878440 2835035 2905188
14884B905188P8406K0900K3868J4081o2069j15100n8998K5415P0412J3734l243
$$ 2905188 2983594 3004494 3028362 3042443 2980374 2865274 2806276 2831691 2902103 2915837 2912594
14873B912594j1263q491j6585o1954n0126K9681Q5435O402l1415K9116N3169O435
$$ 2912594 2901331 2892840 2876255 2814301 2764175 2793856 2879291 2885693 2854278 2883394 2936563 2942998
14861B942998l9468P583n6225N24J5979K6269m7782N3365M3988m6404K3282P2365
$$ 2942998 2903530 2911113 2854888 2855412 2871391 2897660 2849878 2903243 2947231 2900827 2924109 2996474
14849B996474Q703K7058J21205N8642k1859k3953J4398O3280k077p8661r6006
$$ 2996474 3005177 3032235 3153440 3212082 3190223 3166270 3180668 3243948 3241871 3163210 3067204
14838C067204p7133m7063n4000n9065J04329k0315q4740k0747m9739j9361M1240
$$ 3067204 2990071 2943008 2889008 2829943 2934272 2913957 2829217 2808470 2758731 2739370 2780610
14827B780610O8973o265p6061K7783K1729k914N504o2155j8510L2426q56l3297
$$ 2780610 2849583 2843318 2767257 2795040 2816769 2813855 2819359 2757204 2738694 2771120 2770264 2736967
14815B736967K1112m3760J7460J07478M5840L6561q637L2226n8669q209l7644
$$ 2736967 2758079 2714319 2731779 2839257 2885097 2921658 2913021 2945247 2886578 2878369 2840725
14804B840725r633K9040k7928R6503O211l135j7088m9088j29227l384N8101K9970
$$ 2840725 2831092 2860132 2832204 2928707 2934918 2931783 2914695 2865607 2736380 2732996 2791097 2821067
14792B821067K023M5493J2570O381P9013J4647N5593n0667r203o2588Q2471R6629
$$ 2821067 2823090 2868583 2881153 2887534 2966547 2981194 3036787 2986120 2976917 2914329 2996800 3093429
14780C093429k838j391n863L0452K3016r518n6208p5785p526K5965p1354P585
$$ 3093429 3090591 3089200 3083337 3113789 3136805 3127287 3071079 2995294 2987768 3013733 2942379 2949964
14768B949964M4952j5865j9813q4203J365M0033J30610J00587j799J3272m3610
$$ 2949964 2994916 2979051 2959238 2875035 2876400 2916433 3047043 3147630 3145831 3159103 3115493
14757C115493L5704J13637Q0933k5731P8360J03908O2082P3110N4158k9475p2984
$$ 3115493 3151197 3264834 3345767 3320036 3398396 3502304 3564386 3637496 3691654 3662179 3589195
14746C589195P303K5425M2151m510k100N4183J03794n8743p1154k7481l5480M6198
$$ 3589195 3596498 3621923 3664074 3659564 3657464 3711647 3815441 3756698 3685544 3658063 3622583 3668781
14734C668781J1107r54j1380J6618J7360p453R0880J8704l8K236O065N1515Q753
$$ 3668781 3679888 3678934 3667554 3684172 3701532 3694079 3784959 3803663 3803625 3805861 3811926 3863441 3872194
14721C872194l6393L3144N9121M6097O4326K0608K2552K774R775O5716Q1314J2709
$$ 3872194 3835801 3868945 3928066 3974163 4038489 4059097 4081649 4084423 4094198 4159914 4241228 4253937
14709D253937O1136L3074L6425k1613l6469J00047J15645J00272Q7135J10769
$$ 4253937 4315073 4348147 4384572 4362959 4326490 4426537 4542182 4642454 4729589 4840358
14699D840358J12379R0408J06476Q3137J5131O455J5335M9308K53944J46010J05340
$$ 4840358 4952737 5043145 5149621 5232758 5247889 5254344 5269679 5318987 5572931 5718941 5824281
14688E824281J05345J81522K11977K24406J95618J07530J11493J60866K06645
$$ 5824281 5929626 6111148 6323125 6547531 6743149 6850679 6962172 7123038 7329683
14679G329683L36028L71373K15505J55924L34645L36769L44646L41365L65936
$$ 7329683 7665711 8037084 8252589 8408513 8743158 9079927 9424573 9765938 10131874
14670A0131874M38408M32847N17491N65252O60283P26767P28458P46288Q84479
$$ 10131874 10570282 11003129 11520620 12085872 12746155 13472922 14201380 14947668 15832147
14661A5832147J039172J118978J234894J273678J407634J687287J910715K049009
$$ 15832147 16871319 17990297 19225191 20498869 21906503 23593790 25504505 27553514
14653B7553514K419704K651394L058925L407153L838257M318251M876383N671396
$$ 27553514 29973218 32624612 35683537 39090690 42928947 47247198 52123581 57794977
14645E7794977O503031P468104Q570083R944511J1570236J3259574J4992832J6819760
$$ 57794977 64298008 71766112 80336195 90280706 101850942 115110516 130103348 146923108
14637A46923108J8492498J9705624J9911326J8772921J6018929J1732238O087089
$$ 146923108 165415606 185121230 205032556 223805477 239824406 251556644 257643733
14630B57643733l60186o529356j1447673j4901482j6839070j7404810j6841641
$$ 257643733 257283547 250754191 239306518 224405036 207565966 190161156 173319515
14623A73319515j5796101j4558076j3013937j1502661j0333537r197394q156835
$$ 173319515 157523414 142965338 129951401 118448740 108115203 98917809 90760974
14616I0760974p174061o395941n788595n257443m632082m185836l814885l365985
$$ 90760974 83586913 77190972 71402377 66144934 61512852 57327016 53512131 50146146
14608E0146146l092458k805136k487881k379167k127871j904981j695009j611866
$$ 50146146 47053688 44248552 41760671 39381504 37253633 35348652 33653643 32041777
14600C2041777j402263j335621j291992j151667j068603j026250j011969q91153
$$ 32041777 30639514 29303893 28011901 26860234 25791631 24765381 23753412 22862259
14592B2862259p71985p08284o29506p05190o10906n44240m93504n37546n47515
$$ 22862259 22090274 21381990 20752484 20047294 19436388 18892148 18398644 17861098 17313583
14583A7313583n35294l63556l78494l69183l36508l20016l14419k51200k59160
$$ 17313583 16778289 16414733 16036239 15667056 15330548 15010532 14696113 14444913 14185753
14574A4185753k56795k54824k29897k50323k82313k22546k06260j81311j71242
$$ 14185753 13928958 13674134 13444237 13193914 12911601 12689055 12482795 12301484 12130242
14565A2130242j16750j37280j55203j92139j93412j76132k12257j96707k07995
$$ 12130242 12013492 11876212 11721009 11528870 11335458 11159326 10947069 10750362 10542367
14556A0542367j28704p3241j38365j24331j27799n3156q0267r5636p2064l5350
$$ 10542367 10413663 10340422 10202057 10077726 9949927 9896771 9816504 9720868 9648804 9613454
14546I613454m3694p1817j09831j41885q5758o2851j4852n4058j22971j14415
$$ 9613454 9569760 9497943 9388112 9246227 9160469 9097618 9082766 9028708 8905737 8791322
14536H791322p8352M2240k6201j57064j27269j4152n6952n2940o2318p5836p1879
$$ 8791322 8712970 8755210 8729009 8571945 8444676 8430524 8373572 8320632 8258314 8182478 8110599
14525H110599l9749l8326k8224m3381p3859q6136p2737p6822m4890p8487m9224
$$ 8110599 8070850 8032524 8004300 7960919 7887060 7800924 7728187 7651365 7606475 7527988 7478764
14514G478764N0727k9825o6289K0806K1132O8216j2860q5570l7378n0710J7693
$$ 7478764 7529491 7499666 7433377 7454183 7475315 7543531 7530671 7445101 7407723 7357013 7374706
14503G374706Q5560Q6842l2938l6151K4876l2983k4383m8618l9037o5264l7870
$$ 7374706 7460266 7547108 7514170 7478019 7502895 7469912 7445529 7396911 7357874 7292610 7254740
14492G254740L3159m2597n6596k7599k6643J849m8502l57n4478j8061R599j3688
$$ 7254740 7287899 7245302 7188706 7161107 7134464 7136313 7087811 7087454 7032976 7014915 7024514 7010826
14480G010826J3642L2870j4346j6726m9379m2911o2080M8681O7123p7687L8271
$$ 7010826 7024468 7057338 7042992 7026266 6976887 6933976 6871896 6920577 6987700 6910013 6948284
14469F948284K1193p1767l7190m8016m0713l4691N2686L9463k2780m6801j19779
$$ 6948284 6969477 6897710 6860520 6812504 6771791 6737100 6789786 6829249 6806469 6759668 6639889
14458F639889o7397K5094P6794k5375m6948p098m8829p4840J5049o7033N5665
$$ 6639889 6572492 6597586 6674380 6649005 6602057 6594959 6546130 6471290 6486339 6419306 6474971
14447F474971J39221P876o4579P1782P3331O641K7258o1966j08027L5094J42767
$$ 6474971 6614192 6622068 6557489 6629271 6702602 6709243 6736501 6674535 6566508 6601602 6744369
14436F744369m4953j23008p9680n7021M6586R7713K7564n6845m1252r027K7731
$$ 6744369 6699416 6576408 6496728 6439707 6486293 6584006 6611570 6554725 6513473 6504446 6532177
14425F532177L4587l5925j04459n5325p4507O3585k3259q1284q519N27M4070N047
$$ 6532177 6566764 6530839 6426380 6371055 6296548 6360133 6336874 6255590 6247071 6247598 6291668 6296715
14413F296715j3249J7896n848j7468j8499j0469M1435K1926j8658O297K5143j3099
$$ 6296715 6283466 6301362 6295514 6278046 6259547 6249078 6290513 6312439 6293781 6300078 6325221 6312122
14401F312122R206m1581l0743J9545m5504O193j2559j7857J6851k3205k4601K3314
$$ 6312122 6321328 6279747 6249004 6268549 6223045 6229238 6216679 6198822 6215673 6192468 6167867 6191181
14389F191181j0286q0745l2999L3336J1954L9434r295N5214L292m7911l4031n1792
$$ 6191181 6180895 6100150 6067151 6100487 6112441 6151875 6142580 6197794 6201086 6153175 6119144 6067352
14377F067352O7560j6966m7577P5640O9381k8095q607O8810o650n5027q690N5102
$$ 6067352 6134912 6117946 6070369 6146009 6215390 6187295 6178688 6247498 6240848 6185821 6177131 6232233
14365F232233j0645j2420J2641p6986p310O4869L2410L4465j2407n3613j09768
$$ 6232233 6221588 6209168 6221809 6144823 6137513 6202382 6234792 6269257 6256850 6203237 6093469
14354F093469k4629q122J079L3537N315R2k8677J3880P3097O4318n0154k6922
$$ 6093469 6068840 6060718 6061797 6095334 6100649 6100741 6072064 6085944 6159041 6223359 6173205 6146283
14342F146283j3648o3823n879Q349j1951K4713m5198L826M9451L6905M6979Q498
$$ 6146283 6132635 6068812 6062933 6071282 6059331 6084044 6038846 6042672 6092123 6129028 6176007 6184505
14330F184505k2549n2410m6565J2706Q0618J3553M2614l9643p4872k4791l0590
$$ 6184505 6161956 6109546 6062981 6075687 6156305 6169858 6212472 6172829 6097957 6073166 6042576
14319F042576j7337R170M8335O2020K1655l0109j5430p5489L552N5105O2606j2338
$$ 6042576 6025239 6034409 6082744 6144764 6166419 6136310 6120880 6045391 6048943 6104048 6166654 6154316
14307F154316o6370j9593K3014j5479j3690K2158P012m723m2859o7003R4170P0863
$$ 6154316 6087946 6068353 6091367 6075888 6062198 6084356 6091368 6086645 6043786 5976783 6070953 6141816
14295F141816m8574J0256m093J0274k7683l3512J4032m9362J8565L9553O262J0071
$$ 6141816 6093242 6103498 6099405 6109679 6081996 6048484 6062516 6013154 6031719 6071272 6077534 6087605
14283F087605j4636m2602j1070R756K3119j9174M0508j2941n2042L0616M156M243
$$ 6087605 6072969 6030367 6019297 6029053 6052172 6032998 6073506 6060565 6008523 6039139 6043295 6047538
14271F047538J2210O9331R6306O0078j44443j66241j0272L7647O4295J825K3931
$$ 6047538 6059748 6129079 6225385 6285463 6141020 5974779 5964507 6002154 6066449 6068274 6092205
14260F092205k9178m8718o3946J22511J07717j3900q7114p3911J1518P3500j4472
$$ 6092205 6063027 6014309 5950363 6072874 6180591 6166691 6079577 6005666 6017184 6090684 6076212
14249F076212p4099o2558N1395P5087R8455k2478o9547n8124j1104J2804P4777
$$ 6076212 6002113 5939555 5990950 6066037 6164492 6142014 6072467 6014343 6003239 6016043 6090820
14238F090820N339J4787J6650p707J061K7561J9211j19496o2892J06233K4877
$$ 6090820 6096159 6110946 6127596 6119889 6120950 6148511 6167722 6048226 5985334 6091567 6116444
14227F116444k6938j2110j1405m908M7415M8868M0888j286J7860j7357m8645n4823
$$ 6116444 6089506 6077396 6065991 6061083 6108498 6157366 6198254 6196968 6214828 6197471 6148826 6094003
14215F094003L5549R706j06116N7397M0664O6582K7965O798p563n1959R999N891
$$ 6094003 6129552 6139258 6033142 6090539 6131203 6197785 6225750 6232548 6224985 6173026 6183025 6188916
14203F188916n5493L7251J22001Q9388J423m2550j8374P5350N6961N8303M1223
$$ 6188916 6133423 6170674 6292675 6382063 6383486 6340936 6322562 6397912 6454873 6513176 6554399
14192F554399N8884N7998J05843O0489Q3810P2518J8504R0405M8782j5869l3337
$$ 6554399 6613283 6671281 6777124 6837613 6921423 6993941 7012445 7102850 7151632 7135763 7102426
14181G102426j1303m3916m1467k6833q0569p4018q3148j14020j7354j6743L7173
$$ 7102426 7091123 7047207 7005740 6978907 6898338 6824320 6741172 6627152 6609798 6593055 6630228
14170F630228J8377j16621o2175n7635m2205o1565Q4188L4527m5687j13667p5240
$$ 6630228 6648605 6531984 6469809 6412174 6369969 6308404 6392592 6427119 6381432 6267765 6192525
14159F192525L0848J07065j2677p1242M4728O7598l3928p1714P934q320k5928
$$ 6192525 6223373 6330438 6317761 6246519 6291247 6358845 6324917 6253203 6261137 6252817 6226889
14148F226889P86j6768j387P1756Q317k0981o3240J9550N432m5088k0742n648
$$ 6226889 6227675 6210907 6209520 6281276 6289593 6268612 6205372 6224922 6230354 6185266 6164524 6158876
14136F158876q3804O0299j5900k2314o986N422o781k376K5525l0144l4866M7775
$$ 6158876 6075072 6135371 6119471 6097157 6090171 6095593 6088812 6086436 6111961 6081817 6046951 6094726
14124F094726j1361m2150l1770J6079P9212J6465j8760m1400K8741o243O2156
$$ 6094726 6083365 6041215 6009445 6025524 6104736 6121201 6102441 6061041 6089782 6083539 6145695
14113F145695q1595m3007M8958O3951Q6885J3773L0607k9927l8413j8986O096
$$ 6145695 6064100 6021093 6070051 6134002 6220887 6234660 6265267 6235340 6196927 6177941 6184037
14102F184037K1915J8139j3313j9127L9352j8761k1306m5798l4425m1262J4585
$$ 6184037 6205952 6224091 6210778 6191651 6231003 6212242 6190936 6145138 6110713 6069451 6084036
14091F084036j1326j914Q1575j9298p060J6784m4218m5356O4653M4676O47P677
$$ 6084036 6072710 6070796 6152371 6133073 6126013 6142797 6098579 6053223 6117876 6162552 6163199 6170876
14079F170876j3648k1529j0657j13270L140J04714M8964J0126N628K0661M1567
$$ 6170876 6157228 6135699 6125042 6011772 6014912 6119626 6168590 6178716 6184344 6205005 6246572
14068F246572k2736L8j8881M4978M2933M768l7528m1614l5750k3639j0073M0295
$$ 6246572 6223836 6223874 6204993 6249971 6292904 6297672 6260144 6218530 6182780 6159141 6149068 6189363
14056F189363j02097j9856Q2613K148o0909K4596P258m2325l920O9640K4680J7572
$$ 6189363 6087266 6067410 6150023 6152171 6091262 6115858 6123116 6080791 6076871 6146511 6171191 6188763
14044F188763K2981n938m0305j1501O6916j0805k6396K0581n1719Q437L3539p2291
$$ 6188763 6211744 6205806 6165501 6154000 6220916 6210111 6183715 6204296 6152577 6161014 6194553 6122262
14032F122262K3586K4946P054j3465L547m1642l27l6096l3382O2331Q1362N4359
$$ 6122262 6145848 6170794 6177848 6164383 6167930 6126288 6125961 6089865 6056483 6118814 6200176 6254535
14020F254535o0912j28503M3988P7438k2129q4876n574N3777J3594n4926J0908
$$ 6254535 6193623 6065120 6109108 6186546 6164417 6079541 6073967 6127744 6141338 6086412 6097320
14009F097320J6147l5059n372J2255K9048M3623l5054K4312j5598j9285k069j3460
$$ 6097320 6113467 6078408 6073036 6085291 6114339 6157962 6122908 6147220 6131622 6112337 6110268 6096808
13997F096808L6921k0775k6913J5291k9202Q3169R9051k8459l2838n3006p7092
$$ 6096808 6133729 6112954 6086041 6101332 6072130 6155299 6254350 6225891 6193053 6140047 6062955
13986F062955j007O189J3978p8440j4567J7010Q6860N4262M907o8325l3161l6014
$$ 6062955 6061948 6068137 6082115 6003675 5989108 6006118 6092978 6147240 6152147 6083822 6050661 6014647
13974F014647L5232k8525o5533J6681o487M0438N3546P1022R834k2523j4880J5823
$$ 6014647 6049879 6021354 5955821 5972502 5966015 6006453 6059999 6131021 6140855 6118332 6103452 6119275
13962F119275P2201M1761q1840k7757q452J8244N0194R599q2820j7074N767K6260
$$ 6119275 6191476 6233237 6151397 6123640 6115188 6133432 6183626 6193225 6110405 6093331 6099098 6125358
13950F125358J0345K5802k7339j2488N2047O6144j0254J4771m4415j6162p8296
$$ 6125358 6135703 6161505 6134166 6121678 6173725 6239869 6229615 6244386 6199971 6183809 6105513
13939F105513j2616j2102j4237L5121P9427N1764q1911j02914n3372l5142K0367
$$ 6105513 6092897 6080795 6066558 6101679 6181106 6232870 6150959 6048045 5994673 5959531 5979898
13928E979898J27321O9335j4334l9082p105j6573r3826O1625P0865P0695o5247
$$ 5979898 6107219 6176554 6162220 6123138 6116033 6099460 6005634 6067259 6138124 6208819 6143572
13917F143572j9482N4559J2142J7852Q5794K5277j0840l426q9999p0579l5423
$$ 6143572 6124090 6178649 6190791 6208643 6294437 6319714 6308874 6305448 6215449 6144870 6109447
13906F109447k3148M2288M3574k9233j1176J0070q2603o8849m7072O5K3403L8671
$$ 6109447 6086299 6128587 6172161 6142928 6131752 6141822 6059219 5990370 5943298 5943363 5966766 6005437
13894F005437K3994p683K7658K2597K0611j3688n7054k8173m7662N424N5568K0038
$$ 6005437 6029431 6021748 6049406 6072003 6092614 6078926 6021872 5993699 5946037 5951461 6007029 6027067
13882F027067K1024J0877M3099k0639k3541o926k3852L1930J4238l0170P0525
$$ 6027067 6048091 6058968 6102067 6081428 6057887 6050961 6027109 6059039 6073277 6043107 6113632
13871F113632n9181n0403q706J8263l944j4401K4515N0288n9848o6354j3033k5879
$$ 6113632 6054451 6004048 5995342 6013605 6009661 5995260 6019775 6070063 6010215 5943861 5930828 5904949
13859E904949O0830K6345m5379l271m8241o955Q8119J1298l928J0003M2977q565
$$ 5904949 5965779 5992124 5946745 5943474 5895233 5888278 5976397 5987695 5983767 5993770 6036747 6028182
13847F028182j5147P660L1388O27P942P4429l2758l5625l3403k3990n4595o8886
$$ 6028182 6013035 6020695 6052083 6052710 6060652 6135081 6102323 6066698 6033295 6009305 5954710 5885824
13835E885824J1018J59974Q5199p7843o144J1398q1236K6100L4523n227K6407
$$ 5885824 5896842 6056816 6142015 6064172 6058028 6069426 5988190 6014290 6048813 6043586 6069993
13824F069993r33M465J6327j03802l5919j7692r0346n843k1495j7747J583N2643
$$ 6069993 6069060 6073525 6089852 5986050 5950131 5932439 5842093 5836250 5814755 5797008 5798591 5851234
13812E851234L9914Q4644M0772n5177j10356l5695K2219O2248K4069K1322k900
$$ 5851234 5891148 5975792 6016564 5961387 5851031 5815336 5837555 5899803 5923872 5945194 5942294
13801E942294j3121k3368K8414L9567J8650k4279o977l1132l6988r067L3845K2338
$$ 5942294 5929173 5905805 5934219 5973786 5992436 5968157 5961180 5930048 5893060 5883993 5917838 5940176
13789E940176P765p1777Q246J4473L5543m9838m2305k5300O600K6833k0843r815
$$ 5940176 5947941 5876164 5884410 5898883 5934426 5884588 5842283 5816983 5823583 5850416 5829573 5819758
13777E819758J0181P3424J9145m1572k7334q684N0863R511p0803l7765L4023k3559
$$ 5819758 5829939 5903363 5922508 5880936 5853602 5844918 5895781 5905292 5834489 5796724 5830747 5807188
13765E807188l6017L3099J5950K6504j132P978Q0953Q3109P3113l6621j40363
$$ 5807188 5771171 5804270 5820220 5846724 5845592 5853570 5934523 6017632 6090745 6054124 5913761
13754E913761q0493k2927M6260p5220L8420j8164p1964k2868k0212N5365J26944
$$ 5913761 5833268 5810341 5856601 5781381 5819801 5801637 5729673 5706805 5686593 5741958 5868902
13743E868902N6441m160p3135n729m6755j6590K5213k3408m8868R986k4570K4448
$$ 5868902 5925343 5921183 5848048 5842319 5795564 5778974 5804187 5780779 5731911 5741897 5717327 5741775
13731E741775M4881J1331l8122m0860m1364j05406L4941J02488R1358L3205L5072
$$ 5741775 5786656 5797987 5759865 5719005 5677641 5572235 5607176 5709664 5801022 5834227 5869299
13720E869299j9927l7757o7325j9728k8266K832k2486l5574J1976N8815M2916
$$ 5869299 5849372 5811615 5744290 5724562 5696296 5699128 5676642 5641068 5653044 5711859 5754775
13709E754775K3457j9808J3363J0724n8016q2008l008l4492q503K2612O453r552
$$ 5754775 5778232 5758424 5771787 5782511 5724495 5642487 5639479 5604987 5596484 5619096 5625549 5615997
13697E615997j095L8835K5389n5591l3949P8442O2675k7048l0604m5420N1236
$$ 5615997 5614902 5653737 5679126 5623535 5589586 5668028 5730703 5703655 5673051 5627631 5678867
13686E678867L1170K8182o2528j1906J5954o8031j074R1079k5702J2089J1359
$$ 5678867 5710037 5738219 5675691 5663785 5679739 5611708 5610634 5701713 5676011 5688100 5699459
13675E699459M7154k030k6497K5232k1531o9306p5493n140m0278J38586K2348
$$ 5699459 5746613 5744583 5718086 5743318 5721787 5652481 5576988 5571848 5531570 5670156 5692504
13664E692504m1767q9083n933l4833J2448M6552k6003L6849Q6113L2686n1302
$$ 5692504 5650737 5561654 5555721 5520888 5533336 5579888 5553885 5590734 5676847 5709533 5658231
13653E658231k2523j6947j8175o5858o0163O437j2772k292l1732k9466k5229L6855
$$ 5658231 5635708 5618761 5600586 5534728 5474565 5481002 5468230 5465938 5434206 5404740 5379511 5416366
13641E416366J05495k8947o9983Q388N7914O3213L0345p155K0045k526R517j2648
$$ 5416366 5521861 5492914 5422931 5431319 5489233 5552446 5582791 5575636 5595681 5593155 5602672 5590024
13629E590024K7228o5276n7928L6078M1526N2357l9130j19729m1464M163N6926
$$ 5590024 5617252 5551976 5494048 5530126 5571652 5624009 5584879 5465150 5423686 5427849 5484775
13618E484775r8q2558L8509J48041r4259r3240j3986N888K224J6430n0042k7326
$$ 5484775 5484677 5402119 5440628 5588669 5494410 5401170 5387184 5393072 5395296 5411726 5361684 5334358
13606E334358J3200m713M7153K2405k3946O2216j1102l669j3266n8526k8357L4132
$$ 5334358 5347558 5342845 5389998 5412403 5388457 5450673 5439571 5435902 5422636 5364110 5335753 5369885
13594E369885k7380L0416N233m1376Q032l6094j4075O6884O0851p2604n1467J0360
$$ 5369885 5342505 5372921 5378154 5336778 5344810 5308716 5294641 5361525 5422376 5349772 5298305 5308665
13582E308665k3293Q2943M0196r647l5783m2342p265K6912l2194k4569l083J6230
$$ 5308665 5285372 5368315 5408511 5398864 5363081 5320739 5313474 5340386 5308192 5283623 5280540 5296770
13570E296770m9430P0042m1192n9325P774j676j3934O2592P220M781j8213Q705
$$ 5296770 5247340 5317382 5276190 5216865 5224639 5222963 5209029 5271621 5278841 5283622 5265409 5274114
13558E274114K6124j9011l9475r6906M4422P0422j3812j2903j8150N4429J1186
$$ 5274114 5300238 5281227 5241752 5144846 5189268 5259690 5245878 5232975 5214825 5269254 5280440
13547E280440k7327p5845j7378o36o6914J05741Q2596r491j8590J4203j8244J924
$$ 5280440 5253113 5177268 5159890 5159254 5092340 5198081 5280677 5271186 5252596 5266799 5248555 5250479
13535E250479m7994O892P9568k954o545j34717k7090O6111P6444l3509j04640
$$ 5250479 5202485 5209377 5288945 5285991 5279446 5144729 5117639 5183750 5260194 5226685 5122045
13524E122045K7794L6645j0570J7981n8373j2149r071N0765R391J5216m4306p9419
$$ 5122045 5149839 5186484 5175914 5193895 5135522 5123373 5114302 5165067 5174458 5189674 5145368 5065949
13512E065949n2864N8052Q726R5979M1154n2188R249m4910o5738m3057J15814
$$ 5065949 5013085 5071137 5079863 5175842 5216996 5164808 5174057 5129147 5063409 5020352 5136166
13501E136166K0888m6869n2197p667o1406M1956O7942k8251r5237j2840l020J525
$$ 5136166 5157054 5110185 5057988 5050321 4988915 5030871 5098813 5070562 4975325 4962485 4959465 4960990
13489D960990J9379k9144k2260L6335N2543J9210L4071j8527p1745l4277j3781
$$ 4960990 4980369 4951225 4928965 4965300 5017843 5037053 5071124 5052597 4980852 4946575 4932794
13478D932794l555L0506K7121m5759K9502j09996r7654O3211M8460N7225R625
$$ 4932794 4929239 4959745 4986866 4941107 4970609 4860613 4762959 4826170 4874630 4931855 4941480
13467D941480l4685m4431Q6157K5356J897r5752k4230O7991P183L9567p4865K5201
$$ 4941480 4906795 4862364 4948521 4973877 4975774 4880022 4855792 4923783 4930966 4970533 4895668 4920869
13455D920869J00314L1067l0625J0020j4083K0988m7995m4754m7909l683J0194
$$ 4920869 5021183 5052250 5021625 5031645 5017562 5038550 4990555 4945801 4897892 4894209 4904403
13444D904403n2072j5717l0384L5388N0504q729o9799K6O1940j7209l4952J7600
$$ 4904403 4852331 4836614 4806230 4841618 4892122 4883393 4813594 4813620 4875560 4858351 4823399 4840999
13432D840999M1820l2461K9248L3399m5510k7582j8718j9918k2576m4826L1887
$$ 4840999 4882819 4850358 4879606 4913005 4867495 4839913 4821195 4801277 4778701 4733875 4765762
13421D765762N6239O6107l1426o6461m4548n9685l780P7153l184l6894L6253J07695
$$ 4765762 4822001 4888108 4856682 4790221 4745673 4685988 4682208 4759361 4756177 4719283 4755536 4863231
13409D863231l1887n4737l8166O193q027K6472N8576j5465l3191o423k4298l6944
$$ 4863231 4831344 4776607 4738441 4744634 4736607 4763079 4821655 4806190 4772999 4766576 4742278 4705334
13397D705334k1772N094K6601M8814J8984n5690o0709k2919P787J07741k0188
$$ 4705334 4683562 4688656 4715257 4764071 4783055 4727365 4666656 4643737 4651524 4759265 4739077
13386D739077j37000n7842N5482M5111n9160k4421L1721N9395L8074N548M0719
$$ 4739077 4602077 4544235 4599717 4644828 4585668 4561247 4592968 4652363 4690437 4695985 4736704
13375D736704n6381q2608K5835q753j9800j4394L2447N8176l1508J0044l3076
$$ 4736704 4680323 4597715 4623550 4614797 4594997 4580603 4613050 4671226 4639718 4649762 4616686
13364D616686o629L4542j8118m0860l9367m9N8479K3386R248N7843N3080J8892
$$ 4616686 4610057 4644599 4626481 4585621 4546254 4546205 4604684 4628070 4637318 4695161 4748241 4767133
13352D767133j00416j30772j7055P0777J2593o4626l5356L778K6510L417j8568
$$ 4767133 4666717 4535945 4518890 4589667 4602260 4537634 4502278 4506056 4532566 4535983 4517415
13341D517415p0635r6880N6773K4595p9958J3683N6662J5686K5022n8458l4562
$$ 4517415 4446780 4349900 4406673 4431268 4351310 4364993 4421655 4437341 4462363 4403905 4369343
13330D369343K7863k0710j3919J05552M0371m2370j4857q4245m5168J4740m5623
$$ 4369343 4397206 4376496 4362577 4468129 4508500 4466130 4451273 4367028 4321860 4336600 4290977
13319D290977J5410L7624M7186m5484n424j3091n9424K1877m086N3322N9514J8350
$$ 4290977 4306387 4344011 4391197 4345713 4340289 4327198 4267774 4289651 4285565 4338887 4398401 4416751
13307D416751O823K4068K9067m2214l1274r7044j1006J5709n4348Q421J25710
$$ 4416751 4423574 4447642 4476709 4434495 4403221 4306177 4295171 4310880 4256532 4264953 4390663
13296D390663N2621l5778l1100l7639O079p889J8617n0750l3467L7138K7953l6266
$$ 4390663 4443284 4407506 4376406 4338767 4344846 4336957 4355574 4304824 4271357 4308495 4336448 4300182
13284D300182N3226O0500J8059k325o7459p4656j8133K6360Q8879j3006p8893
$$ 4300182 4353408 4413908 4431967 4429642 4362183 4287527 4269394 4295754 4384633 4371627 4292734
13273D292734n0053L0373L1850l5465k1193p960J1904r0771l7173N5791N1636
$$ 4292734 4242681 4273054 4304904 4269439 4248246 4240286 4252190 4161419 4124246 4180037 4231673
13262D231673L5366p559o753l3758o2411j1825p664o866l2417q426l0642k8108
$$ 4231673 4267039 4259480 4252727 4218969 4156558 4144733 4137069 4130203 4097786 4089360 4058718 4030610
13250D030610J8364O6821k054p805p0328l6474J28623O3204k395L6124N569n3638
$$ 4030610 4048974 4115795 4113741 4105936 4035608 3999134 4127757 4190961 4188566 4224690 4230259 4176621
13238D176621j9546n6415P7868l322j8433P0634M8003l5429r1821k4591O7198
$$ 4176621 4157075 4100660 4178528 4175206 4156773 4227407 4275410 4239981 4148160 4123569 4190767
13227D190767M969p7062n0115o6469m6253n973P5184O4035j620K6760J6207k1342
$$ 4190767 4195736 4118674 4068559 4002090 3955837 3949864 4025048 4089083 4087463 4114223 4130430 4109088
13215D109088j18145o6700P3844N5434q8802k8703Q5880J356q3011j8188L5047
$$ 4109088 3990943 3924243 3998087 4053521 3964719 3936016 4021896 4023252 3940241 3922053 3957100
13204C957100n5858j7158q8025M3216M4936O2016L2053l5307o3563j9640J2210
$$ 3957100 3901242 3884084 3796059 3839275 3884211 3946227 3978280 3942973 3879410 3859770 3871980
13193C871980r351J596L8323R0439L0692j7729j4517m4556n465n907K8490k2777
$$ 3871980 3862629 3864225 3902548 3992987 4023679 4005950 3991433 3946877 3941412 3935505 3963995 3941218
13181C941218l9397l1962k1801M7465K211r456n7859o6358M0121L8413M9978n775
$$ 3941218 3901821 3869859 3848058 3895523 3897734 3888278 3830419 3764061 3804182 3842595 3892573 3886798
13169C886798l4836m5648m2497m461R9319M0972m0539m2161k9484P052p463O6450
$$ 3886798 3851962 3806314 3763817 3759356 3858675 3899647 3859108 3816947 3787463 3794515 3787052 3853502
13157C853502K7247p7577p2698J9718J02149M6835m8451q8868k4215O855K6759
$$ 3853502 3880749 3803172 3730474 3750192 3852341 3899176 3850725 3761857 3737642 3744497 3771256
13146C771256N7552l9185n9946P7035J7579l7750k0851l3032J6595O6162j8211
$$ 3771256 3828808 3789623 3729677 3806712 3824291 3786541 3765690 3732658 3749253 3815415 3797204
13135C797204m337L1504j3775L052K8890n0334q1349r49K9175M2624P9842n9042
$$ 3797204 3792867 3824371 3810596 3813648 3842538 3792204 3710855 3709906 3739081 3781705 3861547 3802505
13123C802505l8132L791M010o663k2751L2256j1392Q7156P861j04300p5406l5914
$$ 3802505 3764373 3768164 3772174 3765511 3742760 3775016 3763624 3850780 3858641 3754341 3678935 3643021
13111C643021O0997L0938k5201J3202n4168p572j7872M1011K7101k6802p5195
$$ 3643021 3704018 3734956 3709755 3722957 3668789 3661217 3643345 3684356 3711457 3684655 3609460
13100C609460L6814k2031j24702j1201N7388P874K5464L8812M9476J5243K4177
$$ 3609460 3646274 3624243 3499541 3488340 3545728 3553602 3579066 3617878 3667354 3682597 3706774
13089C706774O2415L0809j4798j08394n4102O2598k3686o2264k2541J6608K4193
$$ 3706774 3769189 3799998 3785200 3676806 3622704 3685302 3661616 3599352 3576811 3593419 3617612
13078C617612k3068J0931m5819n9744j1092j9470q127L7500N542l4966N2704m8958
$$ 3617612 3594544 3605475 3559656 3499912 3488820 3469350 3461223 3498723 3504265 3469299 3522003 3473045
13066C473045m862K9442L5835L2506k5357L4489K4925k0800K0035l5671q6137
$$ 3473045 3468183 3497625 3533460 3565966 3540609 3575098 3600023 3579223 3599258 3563587 3477450
13055C477450p8405q6639J8993O9109L3943l2041n1871P1507M9054K0143k0574
$$ 3477450 3399045 3312406 3331399 3400508 3434451 3402410 3350539 3422046 3471100 3491243 3470669
13044C470669K024J2296K0498M357M5988m4754j2006N054J646j6696m5769j9173
$$ 3470669 3472693 3484989 3505487 3509844 3555832 3511078 3499072 3504126 3505772 3489076 3443307 3424134
13032C424134k0332J5074j6977n7502k7143Q5735L3025l5649j6780J8545K4866
$$ 3424134 3403802 3418876 3401899 3344397 3317254 3402989 3436014 3400365 3383585 3402130 3426996
13021C426996n2577o2211J2588M9786J7103Q739j7608r965m2799J0970k0511n5249
$$ 3426996 3374419 3312208 3324796 3374582 3391685 3400424 3382816 3372851 3330052 3341022 3320511 3265262
13009C265262k9901N2736j3157o24k5420r9773K7587Q6474P9322k7399m4557k7581
$$ 3265262 3235361 3288097 3274940 3274316 3248896 3149123 3176710 3263184 3342506 3315107 3270550 3242969
12997C242969L2474N3205K5452l3109K0923J9088l5317k858j9339o6975j4981
$$ 3242969 3275443 3328648 3354100 3320991 3341914 3361002 3325685 3322827 3303488 3236513 3221532
12986C221532M0935n539o5744n2838M4277R19j8954l8152K4832R9981O3593l3492
$$ 3221532 3262467 3256928 3191184 3138346 3182623 3183542 3164588 3126436 3151268 3251249 3314842 3281350
12974C281350n9246k7337P5700O7950m3828n6248K5638j4940o7423r410L7618
$$ 3281350 3222104 3194767 3270467 3338417 3294589 3238341 3263979 3249039 3181616 3172206 3209824
12963C209824K2896J2709J195R499n4902m4647n5921L5343K2580m8699j8219K8495
$$ 3209824 3232720 3245429 3246624 3256123 3201221 3156574 3100653 3135996 3158576 3109877 3091658 3120153
12951C120153j6819m7803L921J16076q868q4470q9719L7481O2847K9175K2961
$$ 3120153 3103334 3055531 3059452 3175528 3166660 3082190 2992471 3029952 3092799 3121974 3144935
12940C144935j8174N538R035m7529m5104J4635O2834q599J1363p475n5001j9428
$$ 3144935 3126761 3132299 3141334 3093805 3048701 3063336 3126170 3117571 3128934 3121459 3066458 3047030
12928C047030K3090j3730L2070k2257j03807J6859M1947j2694m1325L4042K9745
$$ 3047030 3070120 3056390 3088460 3066203 2962396 2979255 3021202 3008508 2967183 3001225 3030970
12917C030970k1864L0011k375j3535j8613n5460j5535J04085j9057l2744L1931
$$ 3030970 3009106 3039117 3036742 3023207 3004594 2949134 2933599 3037684 3018627 2985883 3017814
12906C017814M3935P763J2018m5282p8832J3913k6965M7833K7499m0659J309j7101
$$ 3017814 3061749 3069512 3081530 3036248 2957416 2971329 2944364 2992197 3019696 2979037 2980346 2963245
12894B963245N6322K8444r0672j05480p2357m6264O6824K8821l549N9918q004
$$ 2963245 3019567 3048011 2957339 2851859 2779502 2733238 2800062 2828883 2825334 2885252 2877248
12883B877248m1572r932L9789M803K0349M451o7341m5163L3208j288m4299l3510
$$ 2877248 2835676 2825744 2865533 2870336 2890685 2895136 2827795 2782632 2815840 2814552 2770253 2736743
12871B736743R9753M8610m9713k9104N5973M2628O0439L0683k3125N5687N5041
$$ 2736743 2836496 2885106 2835393 2806289 2862262 2904890 2965329 2996012 2972887 3028574 3083615
12860C083615K9925L7142R7532O3144J21577K40902J13020N545j31225j49818
$$ 3083615 3113540 3150682 3248214 3311358 3432935 3673837 3786857 3792402 3661177 3511359
12850C511359m5264j47960q7620m3663j00477o1379R834O1939L6703L6393J63390
$$ 3511359 3466095 3318135 3230515 3186852 3086375 3024996 3034830 3096769 3133472 3169865 3333255
12839C333255J23350l9876J401M4680P7422J70651J56690J50755J7656O6466L08815
$$ 3333255 3456605 3416729 3418130 3462810 3540232 3710883 3867573 4018328 4035984 4102450 4411265
12828D411265M31198M32935L26548L49558L71578K27308J36574p3526j70659k67134
$$ 4411265 4842463 5275398 5601946 5951504 6323082 6550390 6686964 6613438 6442779 6175645
12818F175645l14642l37253k81490k92006k87661k13091j82799j83217j43718
$$ 6175645 5861003 5523750 5242260 4950254 4662593 4449502 4266703 4083486 3939768
12809C939768j39587p4603m2421p0483k29135j06891J1729l2398q7418j7781n4794
$$ 3939768 3800181 3725578 3683157 3612674 3383539 3276648 3288377 3255979 3168561 3150780 3095986
12798C095986j3947L1591n6455J1376M6324j4678j25992l9501K4041m1143N248
$$ 3095986 3082039 3113630 3057175 3068551 3114875 3100197 2974205 2934704 2958745 2917602 2922850
12787B922850k448J4039J3048N677m3952m0249l7438m5265o745L3046N8988l8830
$$ 2922850 2920402 2934441 2947489 2953166 2909214 2868965 2831527 2786262 2779517 2812563 2871551 2832721
12775B832721n5059l8028p8836l6830J7351M1518m894J5336k2064m96K6300O070
$$ 2832721 2777662 2739634 2660798 2623968 2641319 2682837 2677943 2693279 2671215 2670719 2697019 2703089
12763B703089K3557k9424o1108n5509L3274M1555L2940J3374L5576J20676l1869
$$ 2703089 2726646 2697222 2636114 2580605 2613879 2655434 2688374 2701748 2737324 2858000 2826131
12752B826131n8692l4284J0452p7329j5086k0380l516l6924j06462p848O4270
$$ 2826131 2767439 2733155 2743607 2666278 2651192 2630812 2627296 2590372 2483910 2476062 2540332
12741B540332L2240L1266q0515K453N319j5386o7912P5534O3K1590L1615l4275
$$ 2540332 2572572 2603838 2523323 2525776 2531095 2515709 2447797 2523331 2523394 2544984 2576599 2542324
12729B542324m3085k3503J9671N4914J636r1078K8035j4303j6945l968n7727l5645
$$ 2542324 2499239 2475736 2495407 2550321 2551957 2460879 2488914 2474611 2457666 2453698 2395971 2360326
12717B360326J37734R5343k8323p4072p5964m6557k3560j9041K8578L8365J8350
$$ 2360326 2498060 2593403 2565080 2491008 2415044 2368487 2344927 2325886 2354464 2392829 2411179
12706B411179o3557Q129M1674J8859J3228k1451O209L290K1992k9657n3291q1567
$$ 2411179 2347622 2355751 2397425 2416284 2429512 2408061 2414270 2417560 2439552 2409895 2356604 2275037
12694B275037M4666M2259P0499Q057k0500j0184L8428M6317k936n6450K783M9170
$$ 2275037 2319703 2361962 2432461 2440518 2420018 2409834 2448262 2494579 2491643 2435193 2437976 2487146
12682B487146n7549M431K9793j11883o3713Q105N5741N5594L5762M4103k443k848
$$ 2487146 2429597 2434028 2463821 2351938 2288225 2296330 2352071 2407665 2443427 2487530 2485087 2482239
12670B482239j0085L0648l4111J2869p00l8748L3924j8093j21100o3166n2771
$$ 2482239 2472154 2502802 2468691 2481560 2480860 2442112 2476036 2457943 2336843 2273677 2220906
12659B220906n5822O1530P0142M4391o7722J2130L5651p5839m7558O0308N7911
$$ 2220906 2165084 2226614 2296756 2341147 2273425 2285555 2321206 2245367 2197809 2258117 2316028
12648B316028j8741R854k2029J3604J6692l42K8429K2224n330p6995J5041N3037
$$ 2316028 2297287 2307141 2285112 2298716 2315408 2315066 2343495 2365719 2360389 2283394 2298435 2351472
12636B351472k1276n1117P2291M6652K084P1910P8995M7640m8643j664r0107j15608
$$ 2351472 2330196 2279079 2351370 2398022 2400106 2472016 2551011 2598651 2550008 2548344 2458237 2342629
12624B342629O8900O5933n2553p8955o2968m1559M1772J4252l1865j1312k519
$$ 2342629 2411529 2477462 2424909 2345954 2282986 2241427 2283199 2297451 2265586 2254274 2251755
12613B251755r991l1046j2542M3769L749k1787m0127N2413L0609l7622m1873l5370
$$ 2251755 2241764 2210718 2198176 2241945 2245694 2223907 2183780 2236193 2266802 2229180 2187307 2151937
12601B151937l1978l1817k3341O0408O7320M218K2730m6640k999l2532j03377
$$ 2151937 2119959 2088142 2064801 2125209 2192529 2196747 2219477 2172837 2169838 2137306 2033929
12590B033929o3711L5189M2627p36l8631j3283m6202j9474j0863N4274M7403l5251
$$ 2033929 1970218 2005407 2048034 2047298 2008667 1995384 1949182 1929708 1918845 1973119 2020522 1985271
12578A985271o0170Q3007M4053L3498r371k5672K4308O7625Q570n1627l2473K6685
$$ 1985271 1925101 2008108 2052161 2085659 2076288 2050616 2074924 2142549 2151119 2099492 2067019 2093704
12566B093704J7980J8318k5455l9239P4274q3038n5592p876O1599m6431O463O845
$$ 2093704 2111684 2130002 2104547 2065308 2139582 2056544 2000952 1993076 2054675 2008244 2014707 2021552
12554B021552J7919m03O5144J6895l7166J6559N5356J4529r7677n5185n3598J5051
$$ 2021552 2039471 2039068 2104212 2121107 2083941 2100500 2155856 2170385 2072708 2017523 1963925 1978976
12542A978976r4313N363P0200O0702J29661J0852r2869n4111n2179o1545L1887
$$ 1978976 1884663 1890026 1960226 2020928 2150589 2161441 2068572 2014461 1962282 1900737 1932624
12531A932624Q7847O3144l3779q5509l9295k7127K0523P92lM6674R584R402K2732
$$ 1932624 2020471 2083615 2049836 1964327 1925032 1897905 1918428 1919220 1919217 1965891 1975475 1984877 2007609
12518B007609m3914l1672m5214k2577O6410L2778m5891l2344j4730r3300j9950
$$ 2007609 1963695 1932023 1886809 1864232 1930642 1963420 1917529 1885185 1870455 1777155 1757205
12507A757205J18328O2002m5781M748l6523r0807q236R7737K7538P139j3718o8604
$$ 1757205 1875533 1937535 1891754 1896502 1859979 1769172 1760936 1858673 1886211 1893350 1879632 1811028
12495A811028L9422O7666J4455k3583n8199j98952L5069R1710J690L0728L4384
$$ 1811028 1850450 1918116 1932571 1908988 1850789 1651837 1686906 1778616 1780306 1811034 1845418
12484A845418K4748j732j9N3531k8197l9402L6020L441P620K1598m0772k9152
$$ 1845418 1870166 1868434 1868415 1921946 1893749 1854347 1890367 1893808 1901428 1923026 1882254 1853102
12472A853102K4008k1228n5382q2477k9171N1728N8007j0019k4588p2406K0274
$$ 1853102 1877110 1855882 1800500 1718023 1688852 1740580 1798587 1788568 1763980 1691574 1711848
12461A711848P3875O703K6508j6151o7019p2083Q039N1482l440N350M9764O7494
$$ 1711848 1785723 1792426 1818934 1802783 1735764 1663681 1671720 1723202 1719762 1725112 1774876 1842370
12449A842370O2791J687J1060q5694m4082K874j1185l1756j9731M4394M1972J1434
$$ 1842370 1905161 1906848 1917908 1832214 1788132 1791006 1779821 1748065 1728334 1772728 1814700 1826134
12437A826134q072l0803Q711j3605O912L957J345k5641j02975n9931k2432J4496
$$ 1826134 1818062 1787259 1795970 1782365 1789277 1793234 1794579 1768938 1665963 1606032 1583600 1598096
12425A598096J0118O559J3166m0999k940M6850P7126P5446M0368j3310j1689q4671
$$ 1598096 1608214 1614773 1627939 1586940 1584000 1630850 1707976 1783422 1823790 1810480 1798791 1714120
12413A714120k4063o8536J9054N6396J8383o1005M8240o124n7381J5710k7253
$$ 1714120 1690057 1621521 1640575 1696971 1715354 1654349 1702589 1696465 1639084 1654794 1627541
12402A627541P8984J4219r9323p3523J8361J6378O4106N7285K8985n7691l8020
$$ 1627541 1706525 1720744 1621421 1547898 1566259 1582637 1646743 1704028 1733013 1675322 1637302
12391A637302k3754L9154J0655n247j5612J4700p042m8121j2924Q441J4225O7578
$$ 1637302 1613548 1652702 1663357 1658110 1642498 1657198 1650156 1602035 1589111 1597552 1611777 1679355
12379A679355K8273q0101l7627k4049n2933Q3681R0740M8897Q2986o5531n6996
$$ 1679355 1707628 1627527 1589900 1565851 1512918 1596599 1687339 1736236 1819222 1753691 1696695
12368A696695k5186o647j00925k0523j09p5946n3654K7580N3773O1865l0241J872
$$ 1696695 1671509 1664862 1563937 1543414 1543305 1467359 1413705 1441285 1495058 1556923 1526682 1528554
12356A528554J49353N9022l4883m7386l8173q044K8558m9249j0496K3452R1840
$$ 1528554 1677907 1736929 1702046 1654660 1616487 1608443 1637001 1587752 1577256 1600708 1692548
12345A692548M0267j15998k8566j7336O6861Q564p6929j6516p9138n9179P9733
$$ 1692548 1732815 1616817 1588251 1570915 1637776 1646340 1569411 1552895 1473757 1414578 1494311
12334A494311L9338N6630m114l0135K2572M3565O349p1659K609n5549m8415R728
$$ 1494311 1533649 1590279 1586165 1556030 1578602 1622167 1628516 1556857 1559466 1503917 1455502 1465230
12322A465230P7009j4858o47K886m8498k2498L4458L2639j7823J7695k6480m3469
$$ 1465230 1542239 1527381 1526734 1529620 1481122 1458624 1493082 1525721 1507898 1525593 1499113 1455644
12310A455644M2262M4868j1964p8894j2105N6925M1480K6477o6438J9616L2394
$$ 1455644 1497906 1542774 1530810 1451916 1439811 1496736 1538216 1564693 1498255 1517871 1550265
12299A550265k8001q3999R36K6533R0290k378J8692N466j5530l3419k051n1854
$$ 1550265 1522264 1438265 1439201 1465734 1556024 1553646 1572338 1577804 1562274 1528855 1526804 1474950
12287A474950k0568K1609l366M32n5046K3955P132k689n893j5634N1543k1625
$$ 1474950 1454382 1475991 1472625 1473057 1418011 1441966 1449098 1446409 1440516 1424882 1476425 1454800
12275A454800p1713r1667L7072k6840Q927M834L4573M3786l0831N249N5153K9391
$$ 1454800 1383087 1291420 1328492 1301652 1310579 1315413 1349986 1393772 1362941 1368190 1423343 1452734
12263A452734l1746m1761L5686K4182p0705n215k817j1023J7757L8898K5319l1188
$$ 1452734 1420988 1379227 1414913 1439095 1368390 1363175 1360358 1349335 1367092 1405990 1431309 1400121
12251A400121l336P200k0215l5778n8519K4658R85j280l7206K2812J8940l7953
$$ 1400121 1396785 1403985 1383770 1347992 1289473 1314131 1315116 1313836 1276630 1299442 1318382 1280429
12239A280429N0142j3106j7986q669L0044O1451J9128k34n642p884p1548K431
$$ 1280429 1330571 1317465 1299479 1290810 1320854 1382305 1401433 1401199 1395557 1387673 1316125 1318556
12227A318556l9414j3598k8059K2323O0758K6781J1070j5195N7795L5504j17062
$$ 1318556 1279142 1265544 1237485 1259808 1320566 1347347 1358417 1343222 1401017 1436521 1319459
12216A319459q9616O2126j7934K6130J8032j6188o914o1388j1112M085K1217L4187
$$ 1319459 1229843 1291969 1274035 1300165 1318197 1302009 1295095 1233707 1222595 1226680 1247897 1282084
12204A282084n3444r0190N2120J01392L5384j6784r0j4352K6232K9383L828p0621
$$ 1282084 1228640 1138450 1190570 1291962 1327346 1310562 1310472 1296120 1322352 1351735 1355563 1284942
12192A284942l5078J3443k0660K2154j6387J6075m4744M1397L7482K9700L7036
$$ 1284942 1249864 1263307 1242647 1264801 1248414 1264489 1219745 1261142 1298624 1328324 1365360
12181A365360P172J7655j9736n0150l4069R9293j8729j6980K0793n9228o6172
$$ 1365360 1372532 1390187 1370451 1320301 1286232 1385525 1366796 1349816 1370609 1311381 1245209
12170A245209k606J2870K7587k7663o5305K4462r957q3596o2212r823L8484K0924
$$ 1245209 1242603 1255473 1283060 1255397 1190092 1214554 1204597 1121001 1058789 1048966 1087450 1108374
12158A108374J07630Q2553n824o4908k5987J8354j1217p8126m9777o1106K5233
$$ 1108374 1216004 1298557 1292733 1227825 1201838 1220192 1208975 1130849 1081072 1019966 1045199
12147A045199L4144j8167m4096k2668M0343n595K3588N011K5174j4371l7364l2975
$$ 1045199 1079343 1061176 1017080 994412 1034755 1029160 1052748 1057759 1082933 1068562 1031198 998223
12135I98223O6266J00468l0602k1199m595j5423j3006L6010P0853n9145j12678
$$ 998223 1064489 1164957 1134355 1113156 1108561 1093138 1080132 1116142 1186995 1127850 1015172
12124A015172l3307J42265L4501m5990J8804L4701j5494l8318K1205n957q7715
$$ 1015172 981865 1124130 1158631 1112641 1131445 1166146 1150652 1112334 1133539 1127582 1039867
12113A039867n6103K1857J8127o7193k3493Q038L2118j5538J7271M840n3369K1187
$$ 1039867 983764 1005621 1023748 956555 933062 941100 973218 957680 974951 979791 926422 947609
12101I47609O8527p48j3978q1430k3734K2233J8639K4503j5447M4244n4713l7959
$$ 947609 1016136 1015388 1001410 919980 896246 918479 937118 961621 946174 990418 935705 897746
12089H97746O4352K7394K922j4093p5359k9452N2708L6709O8386k1019l2632m2572
$$ 897746 962098 989492 992414 978321 902962 873510 926218 962927 1031313 1010294 977662 935090
12077I35090p7909n8549q652L4074Q1751K1806P484L1878R8703J1003j05881L055
$$ 935090 857181 798632 789980 824054 905805 927611 935095 966973 1065676 1076679 970798 973853
12065I73853k1276N948L9946p1372l0620O586n2850K2603L9564M4617L0992k4584
$$ 973853 952577 958525 998471 927099 896479 903065 850215 872818 912382 956999 987991 963407
12053I63407k3453N4564J9860j76m2090j5833o3137m8929j2508j7402l1302J5127
$$ 963407 939954 994518 1014378 1014202 972112 956279 893142 844213 831705 814303 783001 798128
12041G98128K2336p1437R631L2292P9830M5896P2895j8369J1521J5778L1897M215
$$ 798128 820464 749027 758658 790950 870780 916676 989571 971202 982723 998501 1030398 1034613
12029A034613n1630k3612M3711n7897n1698l3167k0387p324M320L6699O124m6969
$$ 1034613 982983 959371 1003082 945185 893487 860320 839933 832609 836929 873628 879752 832783
12017H32783m0241P2444k6602K5883k064M034q401q05O2419M6443m4020n2715
$$ 832783 792542 864986 838384 864267 862203 866237 857836 857031 919450 965893 921873 869158
12005H69158o9263J4339Q636j6137N9143m5782m1733m9976k1387P0208O2059N2450
$$ 869158 799895 814234 822870 806733 865876 820094 778361 728385 706998 777206 839265 891715
11993H91715K6179K4554o4959p8515j3967k8182p5839P519P0718M7302j4018o2847
$$ 891715 917894 942448 877489 798974 785007 756825 680986 688505 759223 806525 792507 729660
11981G29660m5979l6556Q4719K9892l21L4900l1183k7462K5818j1773Q3994J7319
$$ 729660 683681 647125 731844 761736 761415 796315 765132 737670 763488 751715 835709 853028
11969H53028l0218m558l4151p264J5713o4161r262J2922K771n418M629M2176K4948
$$ 853028 822810 818252 784101 776837 792550 728389 719127 732049 734820 729402 734031 776207 801155
11956H01155o5258j3983k1209p1100L7871K8026l5613Q442P8506L4102k514m0789
$$ 801155 735897 721914 700705 629605 667476 695502 659889 668331 746837 780939 778425 737636
11944G37636k7221l676L1824L1668K1564K3539o3971k548j7893l6790n9008M630
$$ 737636 710415 706739 738563 770231 791795 815334 751363 748815 730922 694132 635124 639754
11932F39754m3869J1141L9370J852J9598K3999O5563k4176r1230j8622L5128J950
$$ 639754 595885 607026 646396 648248 667846 691845 757408 733232 642002 623380 658508 660458
11920F60458J2004M2707N5787o1046p3423k6263J9842L1428N5115P437j1289o516
$$ 660458 672462 715169 770956 709910 636487 610224 630066 661494 716609 724046 712757 706241
11908G06241k6939J4509M700n4605L4567M4359j8679J1696j3047P028o0153l6173
$$ 706241 679302 693811 698511 643906 678473 722832 704153 715849 702802 709830 649677 613504
11896F13504o3913O0441O9360M6834J8532j3021j6485p5325p6228K4303o476J3683
$$ 613504 549591 610032 679392 726226 744758 731737 715252 639927 563699 588002 581526 595209
11884E95209N8561n1269K3566N7899m1518J11897L0780o0274L3992m3044n6631
$$ 595209 653770 602501 626067 683966 642448 754345 785125 724851 758843 715799 659168
11873F59168J3030P3455p442o1218l0080m18K7465j5720m0314l6238K7738q762
$$ 659168 672198 745653 738211 676993 646913 646495 673960 658240 617926 581688 609426 600664
11861F00664J092L9041K070M1953o286j02795m2327Q9470l4196r6572m0697L2588
$$ 600664 601756 640797 642867 684820 678534 575739 533412 622882 588686 492114 451417 484005
11849D84005O5442k3478K7331J0128m2878m9898K1290L508Q4993p71o5924o4558
$$ 484005 549447 525969 553300 563428 520550 470652 491942 495450 580443 579672 513748 449190
11837D49190J7563K8175J2854M8421r789j057N3026O1542J5526L8771m7383j18785
$$ 449190 466753 494928 507782 556203 546414 545357 598383 659925 675451 714222 666839 548054
11825E48054J0108M3442m4021J2091k5239Q855k8423j5705j1924O2655M3868M2750
$$ 548054 558162 601604 557583 569674 544435 553290 524867 509162 497238 559893 603761 646511
11813F46511Q6649n3382r6595j0787l8792J3096K3107n4692L1623n4829q7118
$$ 646511 733160 679778 583183 572396 533604 546700 569807 515115 546738 491909 404791
11802D04791R296P9700J5064J8109K86m266m0425O04l9595q1115K9520P1403q747
$$ 404791 414087 493787 508851 526960 527246 522980 482555 483159 443564 362449 391969 463372 454625
11789D54625n0885j7579K7401j9769M4265R62m1986J0275N6629L5191m2706l9724
$$ 454625 403740 386161 413562 393793 438058 439020 397034 407309 463938 499129 456423 416699
11777D16699P922o6096j0509L4019n7270N3325K325k9059J7561M5047K5037p8782
$$ 416699 424621 358525 348016 382035 324765 378090 380415 351356 368917 413964 439001 360219
11765C60219m5057l1774P1765n1611J4608O7805P5485J2682k2178o1893n8874
$$ 360219 315162 283388 355153 303542 318150 385955 461440 474122 451944 390051 331177
11754C31177K531k3184l8373M5082j8951O91J1746O8064k6398k2671q3779J1488
$$ 331177 333708 310524 272151 317233 298282 298973 310719 378783 352385 329714 245935 257423
11742B57423l582k682O574l942m001L5668P1600P0429n2886j04399q503M8346
$$ 257423 253841 251159 257733 253791 249790 285458 357058 427487 374601 270202 261699 310045
11730C10045J08264L2524j61172l5730o5617L8669K2525L8368L631n474j8228
$$ 310045 418309 450833 289661 253931 188314 226983 249508 287876 291507 286033 267805
11719B67805k8502m409J0642K4534O0076K1609o3872J2455R196j2070M6795k7213
$$ 267805 239303 234894 245536 270070 330146 351755 287883 300338 309534 297464 344259 317046
11707C17046l63r1010k531k6997J6152M8038q901M459k8283l2120P608K0202l6170
$$ 317046 316683 225673 223142 196145 212297 260335 251434 255893 227610 195490 203098 223300 187130
11694A87130j0878j2989K92j5962l9662K1145N1537l816M2380k3670R359Q3957
$$ 187130 176252 163263 163555 147593 107931 129076 180613 176797 219177 195507 204866 288823
11682B88823N6551k5774l4332j9025J3390L2217J1772o4882r5061o926P2092l9555
$$ 288823 345374 319600 285268 266243 279633 311850 323622 258740 163679 156753 228845 189290
11670A89290p0923K4872Q3303p8020l6364J8516J04518L138o6412r5785l4336
$$ 189290 118367 143239 226542 148522 112158 130674 235192 238330 171918 76133 41797
11659D1797M7023K3194n4383N0408R2275M1685k9048j1085l1580K533k8800o9441
$$ 41797 88820 112014 57631 108039 200314 241999 212951 201866 170286 172819 144019 74578
11647G4578j6437M8695P4132k0075k3863Q3955j1680n6148l7139L8643M1023j3981
$$ 74578 58141 106836 180968 160893 137030 220985 209305 153157 116018 154661 195684 181703
11635A81703j7627m6227n8143K4090O6428K0074q001J4753k5191P6673L9494L7773
$$ 181703 164076 117849 59706 83796 150224 170298 162297 177050 151859 228532 268026 305799
11623C05799N0139N8522K5910J08691J73481J59820N3136L5145k03612j69382
$$ 305799 355938 414460 440370 549061 722542 882362 935498 970643 767031 597649
11613E97649r1258n4071n3498m358j0466o9122j14943m3121N7678k7818j2903
$$ 597649 506391 452320 398822 394464 383998 314876 199933 156812 214490 186672 173769
11602A73769j2766M7457j8614q8729p049l4575J5761P1262P7113p3387m1640m788
$$ 173769 161003 208460 189846 101117 94068 59493 75254 146516 223629 150242 108602 103814
11590A03814j2349p290j0364O6633L6506m1272l8732l2063j0619l6303l1781m0878
$$ 103814 91465 84175 73811 140444 176950 135678 96946 64883 54264 17961 -13820 -54698
11578e4698k919J2011K9226J1753K7647p244p993K7215J3208K5316J9988q4346
$$ -54698 -57617 -45606 -16380 -4627 23020 15776 7783 34998 48206 73522 93510 9164
11566I164n2633N7208L7154N5238L7050r0187r3223J5196L7982O1538L6999n5694
$$ 9164 -43469 13739 50893 106131 143181 52994 -40229 -25033 12949 74487 111486 55792
11554E5792k2335l4691k3938J6941O1099l3176n6142n0028m0529K0529M3924L4397
$$ 55792 33457 -1234 -25172 -8231 52868 19692 -36450 -86478 -127007 -106478 -62554 -28157
11542b8157P5760m5375k0295l4345n9667J685L2891J4258J3418l9542r570O5115
$$ -28157 47603 2228 -18067 -52412 -112079 -110394 -77503 -63245 -49827 -89369 -98939 -33824
11530c3824Q8153n6928l9669K2876K8195p174J2475J9678K1908j1731p3051M9667
$$ -33824 54329 -2599 -42268 -19392 8803 1629 14104 33782 55690 43959 -29092 20575
11518B0575J5732Q953j3916o3191q6979p633O4592P814m8821K320K2976J5743
$$ 20575 36307 45260 31344 -31847 -118826 -126459 -61867 -54053 -102874 -100554 -77578 -61835
11506f1835m0807N810N5147m8746J5959O5244k0370J2326n1784l6830k8164M970
$$ -61835 -102642 -96832 -41685 -90431 -74472 -9228 -29598 -17272 -69056 -105886 -134050 -129080
11494a29080K3961j8714m7983O73N4942J2614M403k8619k4634M621o3801j2801
$$ -129080 -105119 -123833 -171816 -171143 -116201 -103587 -99184 -127803 -152437 -147816 -211617 -224418
11482b24418N7832L8990k6328l659j1521j3117M5530L0922o0766r8923k3954l8048
$$ -224418 -166586 -127596 -153924 -157583 -169104 -182221 -136691 -105769 -166535 -265458 -289412 -327460
11470c27460K0390L2788p127K239M2948J28164k0612j00220j9480K0390L6669
$$ -327460 -307070 -274282 -281409 -279170 -236222 -108058 -128670 -228890 -248370 -227980 -191311
11459a91311J0292q1748M505J0595j8156L547j2019j2993J361N1837J0009o9390
$$ -191311 -181019 -262767 -258262 -247667 -265823 -262276 -274295 -287288 -285927 -234090 -224081 -293471
11447b93471R516R470L7673q714r7970j6176k9966n6163L9678L5549R2238R6357
$$ -293471 -283955 -274485 -236812 -245526 -343496 -359672 -389638 -445801 -406123 -370574 -278336 -181979
11435a81979k1839j9621m6050p2682j13565K8745J08171J236J8701P2108o991
$$ -181979 -203818 -223439 -269489 -342171 -455736 -426991 -318820 -317584 -298883 -226775 -233766
11424b33766o2396n6398q2312L6203P2706K3862L66o6224o7503o7132M1550j731
$$ -233766 -296162 -352560 -434872 -398669 -325963 -302101 -301735 -367959 -435462 -502594 -461044 -462775
11412d62775O6299L8910K4614k4000m8721N1112O6068m5607K9340J1278J5815
$$ -462775 -396476 -357566 -332952 -356952 -405673 -354561 -288493 -334100 -304760 -293482 -277667
11401b77667p9028l3882J4801R5863m8056n145j4874O968J7235M520k1229m8258
$$ -277667 -356695 -390577 -375776 -279913 -327969 -333114 -347988 -341020 -323785 -319265 -340494 -388752
11389c88752l956j9333j5884l8711L0659K0707K1216l6068j7087m4311Q4117J12514
$$ -388752 -392708 -412041 -427925 -466636 -435977 -415270 -394054 -430122 -447209 -491520 -407403 -294889
11377b94889R804j3765l9034q2092m1953j665j7262M5211N4759n3396N2024J30267
$$ -294889 -285085 -298850 -337884 -419976 -461929 -463594 -480856 -435645 -380886 -434282 -382258 -251991
11365b51991o8793k3233n441n1394m5406O6015K3491k0676L8940O813r9290j4860
$$ -251991 -320784 -344017 -349458 -400852 -446258 -380243 -356752 -377428 -338488 -331675 -430965 -445825
11353d45825O8596L947j23300n8426k172o389k6544J31262J24590J6708q1020
$$ -445825 -377229 -373282 -496582 -555008 -557180 -563569 -590113 -458851 -334261 -317553 -398573
11342c98573q4117k397n5239R992K0008N8021J8412q1829l5070K97J9886k5005
$$ -398573 -482690 -485087 -540326 -530334 -510326 -452305 -433893 -515722 -550792 -550495 -530609 -555614
11330e55614o6801M997K4186m0084K4850P865L9248k5158j1201L1135n1072l5251
$$ -555614 -622415 -617418 -593232 -633316 -608466 -600601 -561353 -586511 -597712 -566577 -617649 -652900
11318f52900L2577N0703L3229N758l8658n2583M3321N4122j8993m1586l5159L3186
$$ -652900 -620323 -569620 -536391 -530633 -569291 -621874 -578553 -524431 -543424 -585010 -620169 -586983
11306e86983M1991p6269l2596M289O4616p2454o2020R4049k146r1983J3042M6946
$$ -586983 -544992 -621261 -653857 -649568 -584952 -657406 -719426 -625377 -627523 -719506 -706464 -659518
11294f59518N3280R1398Q2675n7254r7072l6251N8687J0685J0192M8878k0551
$$ -659518 -606238 -514840 -432165 -489419 -586491 -622742 -564055 -553370 -543178 -494300 -514851
11283e14851n2167l4720j1041j27367o5500k0557O1453R9879k096o5234p6705
$$ -514851 -567018 -601738 -612779 -740146 -805646 -826203 -764750 -664871 -666967 -732201 -808906
11272h08906p196O394J22018N2356l3204m1244L9548M0088o9352k9175O5491l6609
$$ -808906 -816102 -809708 -687690 -635334 -668538 -709782 -670234 -630146 -699498 -728673 -663182 -699791
11260f99791l3082j2953P4123j2045j4826l8926J79K129k9898O567J6145n5713
$$ -699791 -732873 -745826 -671703 -683748 -698574 -737500 -737321 -735192 -765090 -758523 -742378 -798091
11248g98091r000N3996K7513j9181k7316l0893n4935p131J7528l8040p2933L4521
$$ -798091 -807091 -753095 -725582 -744763 -772079 -802972 -857907 -865038 -847510 -885550 -958483 -923962
11236i23962K3843O3509l0153m1977K525K162j9993k6691j2964l3240M638L1859
$$ -923962 -900119 -836610 -866763 -908740 -906215 -904053 -924046 -950737 -963701 -996941 -992303 -960444
11224i60444o0333N3023J6069j7057L2995q081K191m5901k0419k4519m0232P6827
$$ -960444 -1020777 -967754 -951685 -968742 -935747 -943828 -941637 -987538 -1007957 -1032476 -1072708 -995881
11212i95881M1042l545L9364M9436J9135p6797L2172Q5214P1442J28846K06933
$$ -995881 -954839 -958384 -919020 -869584 -850449 -927246 -895074 -809860 -738418 -609572 -402639
11201d02639L79461M52880M13936J70409P3293j42005m33231m23323l17810k43747
$$ -402639 -23178 429702 843638 1014047 1087340 945335 512104 88781 -229029 -472776
11191d72776r5167l4186o0989j9689k5195q9613j8459j1648l1398l1756O896L7959
$$ -472776 -567943 -602129 -663118 -682807 -708002 -797615 -816074 -827722 -859120 -890876 -883980 -846021
11179h46021J08322m1367j6159O6118O0115J15802K07699J50375K897j6737l118
$$ -846021 -737699 -779066 -795225 -729107 -668992 -553190 -345491 -195116 -192219 -208956 -212074
11168b12074j20081j42231j02995j05309m6072q9621l0491n4547p092m478n4463
$$ -212074 -332155 -474386 -577381 -682690 -728762 -818383 -848874 -903421 -910513 -914991 -969454
11157i69454p7697k816N4200r97J154j5902p5437l4696j8952r135J8360Q2250
$$ -969454 -1047151 -1049967 -995767 -996764 -995610 -1011512 -1086949 -1121645 -1140597 -1149732 -1131372 -1049122
11145a049122L2754K3694K1344k4631n7872o9295M6945K9204j6601o1389o458
$$ -1049122 -1016368 -992674 -971330 -995961 -1053833 -1123128 -1076183 -1046979 -1063580 -1124969 -1131427
11134a131427r423m5398j2853K8510Q6969R652k8749k9267j07495m0137M9179
$$ -1131427 -1140850 -1186248 -1199101 -1170591 -1083622 -1073970 -1102719 -1131986 -1239481 -1279618 -1230439
11123a230439O7449M3325K3682o2749O0368L375K5632l996j4532p4873N0166Q5170
$$ -1230439 -1162990 -1119665 -1095983 -1158732 -1098364 -1094989 -1069357 -1073353 -1087885 -1162758 -1112592 -1027422
11111a027422l3015j64236q9601m1460P47N5160p451N7207N9199j8831k8564m4620
$$ -1027422 -1060437 -1224673 -1314274 -1355734 -1354987 -1299827 -1307278 -1250071 -1190872 -1209703 -1238267 -1282887
11099a282887N8848j6218o6710j0954J742K9038N735n3958j1436L7770l4824n4590
$$ -1282887 -1224039 -1240257 -1306967 -1317921 -1316179 -1287141 -1281406 -1335364 -1346800 -1309030 -1343854 -1398444
11087a398444N6595J5960l3132K0982J7425q947k9793p119P1902N2591K451J682
$$ -1398444 -1341849 -1325889 -1359021 -1338039 -1320614 -1329561 -1359354 -1366473 -1294571 -1241980 -1239529 -1237847
11075a237847m7639j1141K0880J4210m9572n0319r1949k4156k3366j1981L0326
$$ -1237847 -1285486 -1296627 -1275747 -1261537 -1311109 -1361428 -1453377 -1477533 -1500899 -1512880 -1482554
11064a482554M6535L8684J1439N25K4340K6471L5962j1206J0234L9662K4678M82
$$ -1482554 -1436019 -1397335 -1385896 -1385371 -1361031 -1334560 -1298598 -1309804 -1299570 -1259908 -1235230 -1234748
11052a234748O0342N9399P8911J4011N5158O3747n4923K8008J8807q543K2681
$$ -1234748 -1174406 -1115007 -1036096 -1022085 -966927 -903180 -958103 -930095 -911288 -919831 -897150
11041h97150O2297n0699p2534q7545P7401J30034N2698L7872P8385Q4280K840
$$ -897150 -834853 -885552 -958086 -1045631 -968230 -838196 -785498 -747626 -669241 -584961 -582121
11030e82121m8424m9762r0524j8376N6982M7675M9208J11644J18475M0717l2278
$$ -582121 -630545 -680307 -770831 -789207 -732225 -684550 -635342 -523698 -405223 -364506 -396784
11019c96784k6630q5390j59570j39055j52828k9812K1353J02696O2552j412k3333
$$ -396784 -423414 -508804 -668374 -807429 -960257 -990069 -968716 -866020 -803468 -804880 -828213
11008h28213O34m575r2971q0601j00990o0050o5084n9605k5772l147O8766m8371
$$ -828213 -827579 -832154 -925125 -1005726 -1106716 -1166766 -1231850 -1291455 -1317227 -1320374 -1251608 -1299979
10996a299979J7009l9230n0342j1346q9523q7140j19358n200L2570l7136j07118
$$ -1299979 -1282970 -1322200 -1372542 -1383888 -1473411 -1560551 -1679909 -1685109 -1652539 -1689675 -1796793
10985a796793N6366M4991n1818l9520l5310j5269N161q5041o754m1170k9319m7066
$$ -1796793 -1740427 -1695436 -1747254 -1786774 -1822084 -1837353 -1832192 -1917233 -1923987 -1965157 -1994476 -2041542
10973b041542M9595P4141O235o8368K9488M2168j9746p6406j2647N6009m2754
$$ -2041542 -1991947 -1917806 -1911571 -1979939 -1950451 -1908283 -1928029 -2004435 -2017082 -1961073 -2003827
10962b003827l0769L6712P6049K6197J38613M3749O8700J61308K33130L40008
$$ -2003827 -2034596 -1997884 -1921835 -1895638 -1757025 -1713276 -1644576 -1483268 -1250138 -910130
10952i10130L03175J65044J51957N7415k2847j08787k66575k75232k23829j78081
$$ -910130 -606955 -441911 -289954 -232539 -255386 -364173 -630748 -905980 -1129809 -1307890
10942a307890n2740j6198J3412J06967J36228J53178K44569J82550K53272L75144
$$ -1307890 -1360630 -1376828 -1363416 -1256449 -1120221 -967043 -722474 -539924 -286652 88492
10932H8492L02877K07560J45572Q035j34144k36124k69128l41231k30483j72300
$$ 88492 391369 598929 744501 752536 618392 382268 113140 -228091 -458574 -630874
10922f30874j63380j85226j69927j39951r0622j32444j01154J3586k4265j6774
$$ -630874 -794254 -979480 -1149407 -1289358 -1379980 -1512424 -1613578 -1599992 -1624257 -1641031
10912a641031l5227p1817j08328j32087q1055n3820m5028k9995K6703Q057j5586
$$ -1641031 -1676258 -1748075 -1856403 -1988490 -2069545 -2123365 -2168393 -2198388 -2171685 -2163628 -2179214
10901b179214J955k0645k4700k1310n3439O937N362l9744j109k4137J7768l474
$$ -2179214 -2177259 -2197904 -2222604 -2243914 -2297353 -2290416 -2285054 -2324798 -2325907 -2350044 -2332276 -2335750
10889b335750l8983m366L1243q4509m3845m4735o324J2609n8931J0850j1870m1198
$$ -2335750 -2374733 -2379099 -2347856 -2432365 -2476210 -2520945 -2527269 -2514660 -2573591 -2562741 -2574611 -2615809
10877b615809j3987j3624o5615l2246J4969n6356j4960J21699J4662l7014q7799
$$ -2615809 -2629796 -2643420 -2709035 -2741281 -2726312 -2782668 -2797628 -2675929 -2661267 -2698281 -2786080
10866b786080m1314J0985J3033L051J401K9636K6266j8879k7421l3321K8996J8016
$$ -2786080 -2827394 -2816409 -2803376 -2800325 -2798924 -2769288 -2743022 -2761901 -2789322 -2822643 -2793647 -2775631
10854b775631o830J250l1776J0248k0513o3331j7948k7875K1289r3179m9763L3709
$$ -2775631 -2782461 -2781211 -2812987 -2802739 -2823252 -2886583 -2904531 -2932406 -2911117 -3004296 -3054059 -3020350
10842c020350k5176j7437J4198M8786l3284r5414k551P6541r65r1996p5538o6738
$$ -3020350 -3045526 -3062963 -3048765 -2999979 -3033263 -3128677 -3131228 -3054687 -3055652 -3147648 -3223186 -3289924
10830c289924J5709M9877k0227n3578k338K4376q9708p3279k0909J3958j690l848
$$ -3289924 -3274215 -3224338 -3244565 -3298143 -3300481 -3276105 -3365813 -3439092 -3460001 -3446043 -3447733 -3451581
10818c451581J3884l758N366L9550j06384q5797N458O550J4899N565L0099p2646
$$ -3451581 -3437697 -3441455 -3436089 -3396539 -3502923 -3588720 -3583262 -3576712 -3561813 -3556248 -3526149 -3598795
10806c598795k1003m1293r2090n523l9711l4144L4153k5228J5532m6052n7447
$$ -3598795 -3619798 -3661091 -3753181 -3758704 -3798415 -3832559 -3798406 -3823634 -3808102 -3854154 -3911601
10795c911601J6659J6317r7919p4683j9602k9122O081O957J0753M9763K5295M9681
$$ -3911601 -3894942 -3878625 -3976544 -4051227 -4070829 -4099951 -4093870 -4086913 -4076160 -4026397 -4001102 -3951421
10783c951421K9651L2757Q342K7715m5597j24306l3914M646m7838l7651k5668
$$ -3951421 -3921770 -3889013 -3880671 -3852956 -3898553 -4022859 -4056773 -4052127 -4099965 -4137616 -4163284
10772d163284n9645j04924j8495k17p020m3943l9002J959r2034j02947K8102k4811
$$ -4163284 -4222929 -4327853 -4346348 -4346565 -4353585 -4397528 -4436530 -4434571 -4526605 -4629552 -4601450 -4626261
10760d626261p3340N065j08091p7295L5242p2231r6288l4612K1785J2170n7126
$$ -4626261 -4699601 -4694536 -4802627 -4879922 -4844680 -4916911 -5013199 -5047811 -5026026 -5013856 -5070982
10749e070982l1158j0277K1367Q731j14913n0754l8033r9292l1433L516J2501
$$ -5070982 -5102140 -5112417 -5091050 -5082319 -5197232 -5247986 -5286019 -5385311 -5416744 -5413228 -5400727
10738e400727l7099q638r4494m6123K4440N659l2014p47K6656K1556q4808j03363
$$ -5400727 -5437826 -5446464 -5540958 -5587081 -5562641 -5556982 -5588996 -5589743 -5563087 -5541531 -5626339 -5729702
10726e729702n4415j7710p0887j22166o6179n9344k8416p5877L2784R5978p4336
$$ -5729702 -5784117 -5801827 -5872714 -5994880 -6061059 -6120403 -6148819 -6224696 -6191912 -6095934 -6170270
10715f170270o7487p039k5688j8702L1944n904J400q5625m0950J9227k9422r1227
$$ -6170270 -6237757 -6244796 -6270484 -6289186 -6257242 -6263146 -6261746 -6347371 -6388321 -6369094 -6398516 -6489743
10703f489743j6542M90l373j2643p1632k7712p5957j48851j03108k7171k2970
$$ -6489743 -6506285 -6505795 -6509168 -6521811 -6593443 -6621155 -6697112 -6845963 -6949071 -6976242 -6999212
10692f999212j07079p8750q6078n7313n4629m255k0948p4308j92225j92356r4514
$$ -6999212 -7106291 -7185041 -7271119 -7328432 -7383061 -7387316 -7408264 -7482572 -7674797 -7867153 -7961667
10681g961667m43q9979j31039o2196m7839q8369q5040l1439o8680q4792j17849
$$ -7961667 -7962110 -8052089 -8183128 -8245324 -8293163 -8381532 -8466572 -8498011 -8566691 -8651483 -8769332
10670h769332r3781o2170j84487j16642n5589j47777j42188m5489j16080j47651
$$ -8769332 -8863113 -8925283 -9109770 -9226412 -9282001 -9429778 -9571966 -9617455 -9733535 -9881186
10660i881186j15601j06643j24691j58422q7888m6528J4461K6434R3520R3501
$$ -9881186 -9996787 -10103430 -10228121 -10386543 -10474431 -10520959 -10506498 -10480064 -10386544 -10293043
10650a0293043n6194m6323J5279j9965j03419j11155r5173o2422p0880l6149l8633
$$ -10293043 -10349237 -10395560 -10380281 -10400246 -10503665 -10614820 -10709993 -10772415 -10843295 -10879444 -10918077
10639a0918077j10886o8397m5941q5653p1452n5565M3543L2956Q0679r063j67763
$$ -10918077 -11028963 -11097360 -11143301 -11228954 -11300406 -11355971 -11312428 -11279472 -11198793 -11207856 -11375619
10628a1375619j03611o7258L0882K51088M81647Q16697J243729J992409K977131
$$ -11375619 -11479230 -11546488 -11515606 -11264518 -10782871 -9966174 -8722445 -6730036 -3752905
10619c752905M187358N731346P446088Q635840Q487990O550141L235798N3151
$$ -3752905 434453 6165799 13611887 22247727 30735717 37285858 40521656 40574807
10611D0574807j752084j830597k84477K514913O105959J0350287J4830807J7917929
$$ 40574807 38822723 36992126 36707649 39222562 45328521 55678808 70509615 88427544
10603H8427544J7147083J1349816K623941n171463r019115q357746m685874M85129
$$ 88427544 105574627 116924443 119548384 114376921 105357806 97000060 92314186 92799315
10595I2799315O571104J3327041J9501541K2934059K0300858J0405754k828912
$$ 92799315 99370419 112697460 132199001 155133060 175433918 185839672 183010760
10588A83010760j3828958j8714979j7529686j2955391p139514j188356M520207
$$ 183010760 169181802 150466823 132937137 119981746 112842232 111653876 116174083
10581A16174083R247045J1331098Q989601J974466o758967j3446038j5759658
$$ 116174083 125421128 136752226 145741827 147716293 140957326 127511288 111751630
10574A11751630j4214542j0709976o969084l661462q06998J161572J842293N63072
$$ 111751630 97537088 86827112 79858028 76196566 75389568 76551140 78393433 78956505
10566G8956505k421784n658476q062280q921882q183428o827632n330097m193017
$$ 78956505 76534721 70876245 62813965 53892083 45708655 38881023 33550926 29357909
10558B9357909l262735k385787j840973j321759q69131n42498k10806L679K70354
$$ 29357909 26095174 23709387 21868414 20546655 19677524 19135026 18924220 18927899 19198253
10549A9198253N62641Q36735J087196J272289J440264J824824K301329K906304
$$ 19198253 19760894 20597629 21684825 22957114 24397378 26222202 28523531 31429835
10541C1429835L841684N014996O404726Q146085J0439593J3350420J7032081K1808984
$$ 31429835 35271519 40286515 46691241 54837326 65276919 78627339 95659420 117468404
10533A17468404K7957250L5667152M4896981N5169930O4719944P0510530O8563923
$$ 117468404 145425654 181092806 225989787 281159717 345879661 416390191 484954114
10526D84954114N5319701L1096591J275302k6461608m5667495n4253095n4402214
$$ 484954114 540273815 571370406 572645708 546184100 500516605 446263510 391861296
10519C91861296m9682145m3178122l6560452l0713625k5761209k1525813j8164029
$$ 391861296 342179151 299001029 262440577 231726952 205965743 184439930 166275901
10512A66275901j5513010j3266262j1495419r896753q586939p490009o510132
$$ 166275901 150762891 137496629 126001210 116104457 107517518 100027509 93517377
10505I3517377n712724n061880m464978m092940l851464l605010l400663l347763
$$ 93517377 87804653 82742773 78277795 74184855 70333391 66728381 63327718 59979955
10497E9979955k972270k660558k564379k319461k141609k041133j875381j653370
$$ 59979955 57007685 54347127 51782748 49463287 47321678 45280545 43405164 41751794
10489D1751794j528715j454020j364630j255945j104021j006517j039511r72480
$$ 41751794 40223079 38769059 37404429 36148484 35044463 34037946 32998435 32025955
10481C2025955q97310r02679q05062p07057o41659o43275n76390n05644n81051
$$ 32025955 31128645 30225966 29420904 28713847 28072188 27428913 26852523 26346879 25765828
10472B5765828o64397n88922m96191n25007m17588m21534m23012m18619l49122
$$ 25765828 25101431 24512509 24016318 23491311 23073723 22652189 22229177 21810558 21461436
10463B1461436l03323k97281l66166m67046m12552l73064k95122k44455l03446
$$ 21461436 21158113 20860832 20494666 20027620 19615068 19242004 18946882 18702427 18398981
10454A8398981l13835j92025j85179k70508k54045j89246j99197k45150k37002
$$ 18398981 18085146 17893121 17707942 17437434 17183389 16994143 16794946 16549796 16312794
10445A6312794j81799j80367k17515k67121l20643k42834j79827q9587p1795r5110
$$ 16312794 16130995 15950628 15733113 15465992 15145349 14902515 14722688 14633101 14561306 14466196
10435A4466196j33486j77016j80320k31655q3429l0133m558q935p7331j24210
$$ 14466196 14332710 14155694 13975374 13743719 13660290 13630157 13625599 13616664 13539333 13415123
10425A3415123j10134j06930k82029k70800l00391j42703j51111j54659j62583
$$ 13415123 13304989 13198059 12916030 12645230 12344839 12202136 12051025 11896366 11733783
10416A1733783j50777o8182j50106k15871j77579j09760j24168j56510j32357
$$ 11733783 11583006 11514824 11364718 11148847 10971268 10861508 10737340 10580830 10448473
10407A0448473q5010j33187j42994p4087j11076n9628J0225J8873j4184n049Q9179
$$ 10448473 10363463 10230276 10087282 10013195 9902119 9842491 9852716 9871589 9857405 9852356 9941535
10396I941535J32920Q3185L5513j04507o8546K1856o6469j06584p5707j01438
$$ 9941535 10074455 10157640 10193153 10088646 10020100 10041956 9975487 9868903 9793196 9691758
10386I691758o9806j41794j36552r2105l3932l9169j09196p7133n2304p7521j21127
$$ 9691758 9621952 9480158 9343606 9251501 9217569 9178400 9069204 8992071 8939767 8862246 8741119
10375H741119M582o7370j71318m8093J0315K4808m4647j23359j40110L2576K7615
$$ 8741119 8745701 8678331 8507013 8458920 8469235 8494043 8449396 8326037 8185927 8218503 8246118
10364H246118j37718r3826l706o025q3542m8346j26659m9268m3612n8895j7825
$$ 8246118 8108400 8014574 8010868 8004843 7921301 7872955 7746296 7697028 7653416 7594521 7576696
10353G576696R133p2069n2233o6660n3859n3568o472j10505m4396l1868K9024
$$ 7576696 7585829 7513760 7461527 7394867 7341008 7287440 7280968 7170463 7126067 7094199 7123223
10342G123223L1827p0902m2341m224j2655K6655O1312K3342k3620n5697m6114
$$ 7123223 7155050 7084148 7041807 7037583 7024928 7051583 7112895 7136237 7112617 7056920 7010806
10331G010806p2851r5624p8618p007L061j05972k3478l0638o8442p9410l3453
$$ 7010806 6937955 6842331 6763713 6756706 6759767 6653795 6630317 6599679 6531237 6451827 6418374
10320F418374q8351n6587O7132K0848K5676m2885j03215r3321r8029n438K4778
$$ 6418374 6330023 6273436 6340568 6361416 6387092 6344207 6240992 6147671 6049642 6044204 6068982
10309F068982p5338p3942K2240K2999r154r072j4297P598o0131o1183q6355K2991
$$ 6068982 5993644 5919702 5941942 5964941 5955787 5946715 5932418 5940016 5879885 5818702 5732347 5755338
10297E755338k2047j06025r9018J1841Q8737m2850j11620j7899K9644k1239k4996
$$ 5755338 5733291 5627266 5528248 5540089 5628826 5585976 5474356 5456457 5486101 5464862 5439866
10286E439866m0741n9849j1950l981K1255n7165k2318M6753o952m0916r59M788
$$ 5439866 5399125 5339276 5327326 5323345 5344600 5287435 5265117 5311870 5304918 5264002 5263043 5267831
10274E267831j7570m3422m8615N4315N7004n9191o4787n042r6134m1011O7455
$$ 5267831 5250261 5206839 5158224 5212539 5269543 5210352 5145565 5140523 5044389 5003378 5070833
10263E070833k603o0624p2852J5841o780J9630J0387m0380r9104p0319n8165L1049
$$ 5070833 5068230 5007606 4934754 4950595 4943815 4963445 4973832 4933452 4834348 4764029 4705864 4736913
10251D736913L8716m8881j2195P4945l910n7907p4566m6465l1556k4040O4590
$$ 4736913 4775629 4726748 4714553 4789498 4785588 4727681 4653115 4606650 4575094 4551054 4615644
10240D615644k6466J8033j4174j5007p9480j982J0264l9549q9878r214N8480l7469
$$ 4615644 4589178 4607211 4593037 4578030 4498550 4496568 4506832 4467283 4377405 4368191 4426671 4389202
10228D389202J487l4218j28226q7162P304M5268O4216J7768q363k4195q7201O655
$$ 4389202 4390689 4356471 4228245 4141083 4148387 4193655 4257871 4275639 4267276 4243081 4155880 4162535
10216D162535l1686J5906P6169n3905k4854k4146k1888m3599o3954K1634N8228
$$ 4162535 4130849 4146755 4222924 4169019 4144165 4120019 4098131 4054532 3990578 4012212 4070440
10205D070440K4030l1592l0567j2224J812O028n1550o1732j6853P6277L5677q5451
$$ 4070440 4094470 4062878 4032311 4020087 4021899 4027927 3976377 3914645 3897792 3974069 4009746 3924295
10193C924295n4365n649K6366j178k968R035m7057p5875P9489N6786l4394k4790
$$ 3924295 3869930 3864281 3890647 3889469 3886501 3895536 3848479 3772604 3852093 3908879 3874485 3849695
10181C849695N963j4224l6371Q1258J06685O1471m717k3359O059P292m9271n6121
$$ 3849695 3855658 3841434 3805063 3886321 3993006 4054477 4049760 4026401 4032460 4039752 3990481 3934360
10169C934360J01140J18903J13275L5013o873l1876j55798q1831O3230l6938N1252
$$ 3934360 4035500 4154403 4267678 4302691 4295818 4263942 4108144 4026313 4089543 4052605 4103857
10158D103857L0387Q0664J40853K05801J72367j7627r7802j09951j40099j32512
$$ 4103857 4134244 4214908 4355761 4561562 4733929 4716302 4618500 4508549 4368450 4235938
10148D235938j03529r7046Q7319J00637K7768Q2548O0583n1910q2525r6808k2096
$$ 4235938 4132409 4035363 4122682 4223319 4251087 4333635 4394218 4342308 4259783 4162975 4140879
10137D140879k1293r2436L8629M551l1109n8379j4151O7192J594p7758j188O7144
$$ 4140879 4119586 4027150 4065779 4070330 4039221 3980842 3966691 4033883 4035477 3957719 3956531 4023675
10125D023675M8508J08372M1967J85981K12430J91930K82206L01416L88395L05949
$$ 4023675 4072183 4180555 4222522 4408503 4620933 4812863 5095069 5396485 5784880 6090829
10115F090829J32963l9075j01769j50662k01962k37894k26580k87160k39395r6243
$$ 6090829 6223792 6184717 6082948 5932286 5730324 5492430 5265850 4978690 4739295 4643052
10105D643052j49454j30372j33132r0799m5910m1835j11730j22187n1465k8887
$$ 4643052 4493598 4363226 4230094 4139295 4093385 4051550 3939820 3817633 3766168 3737281
10095C737281m5934k0482k4896m9265M523L3665k7697j07728o2262m5451m0500
$$ 3737281 3691347 3670865 3645969 3596704 3601227 3634892 3607195 3499467 3437205 3391754 3351254
10084C351254N465j2810K2800K8182O26R928q314K3409q6222j8309O0872J0220
$$ 3351254 3356719 3343909 3366709 3394891 3395517 3405445 3397131 3420540 3334318 3316009 3376881 3387101
10072C387101r6229p810l5716o2733q370j6545R766J19729N710k2322p8952p3295
$$ 3387101 3290872 3283062 3247346 3184613 3176243 3159698 3169464 3289193 3294903 3272581 3193629 3120334
10060C120334N5465M5969K6423o8069p0495m5237J8707M5236N813k1942o3855
$$ 3120334 3175799 3221768 3248191 3180122 3109627 3064390 3083097 3128333 3134146 3112204 3048349
10049C048349k864L0561K7912k1267q5310m6784N0247K0262l1484R717j3653k0969
$$ 3048349 3045485 3076046 3103958 3082691 2997381 2950597 3000844 3021106 2989622 2999339 2985686 2964717
10037B964717L2860p405P6540o2483n6857o4126l5950K6481m0811j4997k0826
$$ 2964717 2997577 2990172 3066712 3004229 2947372 2883246 2847296 2873777 2832966 2817969 2797143
10026B797143l1364o3289m409P510n5646j9798J31971Q262m9866O551r680k4634
$$ 2797143 2765779 2702490 2698081 2705591 2649945 2630147 2762118 2770380 2720514 2727065 2717385 2692751
10014B692751r1750o93L7417M7938L3753J0113k9483J2066P1788R0671n5561k6707
$$ 2692751 2601001 2600308 2637725 2685663 2719416 2729529 2700046 2712112 2783900 2874571 2819010 2792303
10002B792303r0398l2727J6811J7470m6821J7858O6384N317n768K0366L0914j0617
$$ 2792303 2701905 2669178 2685989 2703459 2656638 2674496 2740880 2746197 2740429 2760795 2791709 2781092
9990B781092r5432j33899k4381j0336K1299J06740k4392k3927Q1603k8806j28272
$$ 2781092 2685660 2551761 2527380 2517044 2538343 2645083 2620691 2596764 2678367 2649561 2521289
9979B521289l9690L1427j5833p859l8220n9893P5234M9154Q787r0820j5508j5803
$$ 2521289 2481599 2513026 2497193 2489334 2451114 2391221 2466455 2515609 2524396 2433576 2418068 2402265
9967B402265l1651P670M4569L7608L7211M0730K2981q2840r701M7203l7067J8920
$$ 2402265 2370614 2378284 2422853 2460461 2497672 2538402 2561383 2478543 2468842 2516045 2478978 2497898
9955B497898J8838k9527n2863m030m7835q629J5720N794K9130O2535n1283l4569
$$ 2497898 2516736 2487209 2434346 2430316 2382481 2373852 2389572 2395366 2424496 2487031 2435748 2401179
9943B401179J6558j0540L6748n6832l2121N1351J6724l386L6281p127O9582J0636
$$ 2401179 2417737 2407197 2443945 2387113 2354992 2406343 2423067 2419681 2455962 2448835 2518417 2529053
9931B529053o8130r2518k2761O6601j1430R100k1820Q67r5950l4059K9807m4377
$$ 2529053 2460923 2368405 2345644 2412245 2400815 2409915 2388095 2388962 2293012 2258953 2288760 2244383
9919B244383r5145j690L3765M2156O2431J6524K1339l1870r4123J4601N9857L2036
$$ 2244383 2149238 2147548 2181313 2223469 2285900 2302424 2323763 2291893 2197770 2212371 2272228 2304264
9907B304264l3571R374O1181J6271k6018k7065p7608J8946L6631j5499J1692o216
$$ 2304264 2270693 2280067 2341248 2357519 2331501 2304436 2226828 2245774 2282405 2266906 2278598 2272382
9895B272382m4911M3947k1608M897k6712K6184J2716k6074o2280p8547L6748J35965
$$ 2272382 2227471 2271418 2249810 2254707 2227995 2254179 2266895 2240821 2178541 2099994 2136742 2272707
9883B272707L0170m5251N2162k8612K5728j1374n1135j56552k8038K7003O988
$$ 2272707 2302877 2257626 2309788 2281176 2306904 2295530 2244395 2087843 2059805 2086808 2093796
9872B093796L8555N6418R0870p081n0527j3995k3170O5081K8249p2871m9894n6536
$$ 2093796 2132351 2188769 2279639 2272558 2222031 2208036 2184866 2249947 2278196 2205325 2155431 2098895
9860B098895L0709L3742l0069j0684j02l5572J05202N3762l1231l1327k6264k7463
$$ 2098895 2129604 2163346 2133277 2122593 2122491 2086919 2192121 2245883 2214652 2183325 2157061 2129598
9848B129598q260l1009Q011N1362l4905j939r961j9577j05665p7616N9592n5m7650
$$ 2129598 2121338 2090329 2098340 2149702 2114797 2112858 2102897 2083320 1977655 1900039 1959631 1959576 1911926
9835A911926K4856N8866N0592j0386n688n7322L7303L3049k7395J9670J7578M5120
$$ 1911926 1936782 1995648 2046240 2035854 2030166 1972844 2010147 2043196 2015801 2035471 2053049 2098169
9823B098169J5092j8608N88p9754o7126M3593r967n07o5430o858L2991L778n7378
$$ 2098169 2113261 2094653 2095241 2015487 1948361 1991954 1981987 1981480 1916050 1909192 1942183 1945961 1888583
9810A888583p0792P6407R6989J8225k7251K3451l5962m1991q2904K8765M8811
$$ 1888583 1817791 1894198 1991187 2009412 1982161 2005612 1969650 1927659 1844755 1873520 1922331
9799A922331J3032K4831M5121L7425m2367m9212j9924p0882r7950r755J4899l8795
$$ 1922331 1935363 1960194 2005315 2042740 2000373 1951161 1931237 1860355 1762405 1752650 1767549 1728754
9787A728754N9959L7172m8651m9485O3980O3158l1891l574m216L6591J02081j8921
$$ 1728754 1788713 1825885 1777234 1727749 1791729 1854887 1822996 1819422 1815206 1851797 1953878 1934957
9775A934957J5801p3634q9806O9861K5568N5099N830q1106k4636n4758j9003O153
$$ 1934957 1950758 1877124 1787318 1857179 1882747 1937846 1943676 1862570 1837934 1783176 1764173 1770326
9763A770326R339j8667L1336j0222j7139K2988j0698m3585j676P7644k161j6504
$$ 1770326 1779665 1760998 1792334 1782112 1764973 1787961 1777263 1733678 1732002 1809646 1807485 1790981
9751A790981o9853R0851J13971p8160l1841p756j5420O5842k1011m1260O3865
$$ 1790981 1721128 1811979 1925950 1847790 1815949 1808193 1792773 1858615 1837604 1796344 1860209
9740A860209q109k8413K7352Q5161K6851m3564o3967k6441N166l872r6502K3396
$$ 1860209 1852100 1823687 1851039 1936200 1963051 1919487 1855520 1829079 1834245 1830373 1733871 1757267
9728A757267k5487n2030j5260M5674r09P469K0511J635Q3804N5140q2499n6712
$$ 1757267 1731780 1679750 1664490 1710164 1709255 1716724 1737235 1738870 1822674 1877814 1795315 1738603
9716A738603l1072q485k5329n591J9240J0601J5027L2638N1275m5601l4692p5087
$$ 1738603 1707531 1699046 1673717 1668126 1687366 1697967 1712994 1745632 1796907 1751306 1716614 1641527
9704A641527j0616L2935n7602J909k8632N1154R3743P4913k9777n1611j2956o4574
$$ 1641527 1630911 1663846 1606244 1608153 1579521 1630675 1724418 1799331 1769554 1717943 1704987 1640413
9692A640413K4456P8183K5802J6262M5040J1723K9657n771L9165l9276n4411j3264
$$ 1640413 1664869 1743052 1768854 1785116 1830156 1841879 1871536 1865765 1904930 1865654 1811243 1797979
9680A797979p3860M4876L0557j9814j32921k8056J0589L9038l2133n3834l775
$$ 1797979 1724119 1768995 1799552 1779738 1646817 1618761 1629350 1668388 1636255 1582421 1578646
9669A578646R115q930L9032J0134J1168O330m2322n6002K2138K7061Q3191K7858
$$ 1578646 1587761 1578831 1617863 1627997 1639165 1645495 1603173 1547171 1569309 1596370 1679561 1707419
9657A707419N2461P6348k8646o2377m4597N0537N0670n7902p8285Q604l4880l6314
$$ 1707419 1759880 1836228 1807582 1745205 1700608 1751145 1801815 1743913 1665628 1674232 1639352 1603038
9645A603038O5335q867o25Q4671k6698p1557n3475N2799K9664o7308l4565k7920
$$ 1603038 1668373 1659506 1658881 1743552 1716854 1645297 1591822 1644621 1674285 1606977 1572412 1544492
9633A544492L9035l7063l5554n6702q266M2876J663k414k7821J9862M0896Q3590
$$ 1544492 1583527 1546464 1510910 1454208 1445942 1488818 1490481 1488067 1460246 1480108 1521004 1604594
9621A604594K1025J03986N4892n8155k3893N835j7318n4934k3258l624m5514K4248
$$ 1604594 1625619 1729605 1784497 1726342 1702449 1708284 1690966 1636032 1612774 1609150 1563636 1587884
9609A587884L4152n3383j6837Q149n2702q969O808p1439N8696L9241Q422k985
$$ 1587884 1622036 1568653 1551816 1559965 1507263 1498294 1505102 1433663 1492359 1531600 1540022 1537037
9597A537037M3379j5723n5952j1081K799q6323p1884l1847O8983R2716P7913m2460
$$ 1537037 1580416 1564693 1508741 1497660 1500459 1414136 1342252 1310405 1379388 1472104 1550017 1507557
9585A507557l7519k9895n1572p562O7931M0001P0564J252m0465k0204l4983L8751
$$ 1507557 1470038 1440143 1388571 1381009 1448940 1488941 1559505 1560757 1520292 1500088 1465105 1503856
9573A503856K5169k6231n6184l6576M9999O5866N4434k4745o6350k5876J8105
$$ 1503856 1529025 1502794 1446610 1410034 1460033 1525899 1580333 1555588 1489238 1463362 1481467
9562A481467P621N0054K5761N192n9911j23079k7248K0019M1276Q1177m2141l1100
$$ 1481467 1489088 1539142 1564903 1570095 1510184 1387105 1359857 1379876 1421152 1502329 1460188 1429088
9550A429088k3890M0739K0597M0466L2666n3217J7531r213R466l8817j861K6386
$$ 1429088 1405198 1445937 1466534 1507000 1539666 1486449 1503980 1494767 1504233 1465416 1463555 1489941
9538A489941P4166o1009r0552Q0942M888m0707k2122K3151K3189m0652m0963m0441
$$ 1489941 1564107 1503098 1412546 1493488 1498376 1457669 1435547 1458698 1481887 1441235 1400272 1359831
9526A359831o415M918M5106Q647L6510J0543k3544k641j4951n3668l3526l5145
$$ 1359831 1353416 1358334 1403440 1412087 1448597 1459140 1435596 1432955 1418004 1364336 1330810 1295665
9514A295665J5017L3157L6074k9326p2502M8837O3087j7168m18Q5471n4749j4764
$$ 1295665 1310682 1343839 1379913 1350587 1278085 1326922 1390009 1372841 1372423 1457894 1403145 1388381
9502A388381K5719j2331k9126l0020O3187O8506J1181o5130n8967n0154J4806
$$ 1388381 1414100 1401769 1372643 1342623 1405810 1474316 1485497 1420367 1361400 1311246 1326052
9491A326052P8771L6286r4896j7551O326j62m5848j6529J2696Q868L7186K2417
$$ 1326052 1404823 1441109 1346213 1328662 1334988 1334826 1288978 1272449 1285145 1294013 1331199 1353616
9479A353616q3101L523M0027L6659K5453P48K2508o7439o7484m1330O9406K1258
$$ 1353616 1270515 1274038 1314065 1350724 1376177 1376925 1399433 1331994 1264510 1223180 1292586 1313844
9467A313844M1143o6350J6697m663k9113n9781N3569n4J9109j6674m9578J00956
$$ 1313844 1354987 1288637 1305334 1300671 1271558 1211777 1265346 1265292 1284401 1267727 1218149 1319105
9455A319105J20225l1069r0943o3834J8139O3792k0052k3351q689L2108J6465
$$ 1319105 1439330 1408261 1317318 1253484 1271623 1335415 1315363 1292012 1283323 1315431 1331896
9444A331896l5113L2106K5435l8478p0756L1800O466L760l102o2747M8054N863
$$ 1331896 1296783 1328889 1354324 1315846 1245090 1276890 1283356 1287116 1284014 1221267 1269321 1275184
9432A275184Q908k5062O911m5757K3931J6215N0038K5081l1886M940o091J2472
$$ 1275184 1284092 1259030 1265941 1220184 1244115 1260330 1310368 1335449 1303563 1308503 1302412 1314884
9420A314884l7876O0159M2128L8923l1138k694k7396l8803L991l6009k9447L1289
$$ 1314884 1277008 1337167 1379295 1418218 1387080 1384386 1356990 1318187 1322178 1286169 1256722 1288011
9408A288011j0885J0355k3524j8836j639K7814j5211n0972n0483N8173K1746k7226
$$ 1288011 1277126 1287481 1263957 1245121 1243482 1271296 1256085 1205113 1154630 1212803 1234549 1207323
9396A207323O0722K5425m1719j0367J4886k5414Q8398L4199o6050j4385k5654
$$ 1207323 1268045 1293470 1251751 1241384 1256270 1230856 1319254 1353453 1287403 1273018 1247364
9385A247364l958L8688L7999L6363l3795Q54p448r7443K647M6877M0007j09517
$$ 1247364 1243406 1282094 1320093 1356456 1322661 1323515 1316067 1218624 1221271 1268148 1308155 1198638
9373A198638j14876J4769N3453J5598k6487O841P0297L8844k39k7475o0837M2429
$$ 1198638 1083762 1098531 1151984 1167582 1141095 1147936 1218233 1257077 1256838 1229363 1168526 1210955
9361A210955K6403K6350K7979k4678N442P2517r701o893k7311k2608j5258j3326
$$ 1210955 1237358 1263708 1291687 1267009 1272451 1344968 1335267 1328374 1301063 1278455 1263197 1249871
9349A249871m2912J6394R162M190l2367j1194J2581K9510r009o8394K372O7890
$$ 1249871 1206959 1223353 1232515 1236705 1204338 1193144 1205725 1235235 1226226 1157832 1160204 1228094
9337A228094k2691j4749j668n3397J3277Q5335m2179l3523L9024L6710o209L4084
$$ 1228094 1205403 1190654 1188986 1135589 1148866 1234201 1192022 1158499 1197523 1234233 1228024 1262108
9325A262108k4715l5720M475q241j2317J2228n646k4259o0118p122J9852k6607
$$ 1262108 1237393 1201673 1206148 1197907 1185590 1197818 1192172 1167913 1107795 1100673 1120525 1093918
9313A093918O7376P639j3430j6830O0229l591j6573K4356n3027M9673K2722n8094
$$ 1093918 1161294 1168933 1155503 1138673 1198902 1195311 1178738 1203094 1150067 1199740 1222462 1164368
9301A164368k843M304Q429K3666J5601o6131l4213L5999k1974n3440J2744M7927
$$ 1164368 1161525 1165829 1174258 1197924 1213525 1147394 1113181 1149180 1127206 1073766 1086510 1134437
9289A134437L2583K2282q9461m8304o892n653P9223J5314k6415n0689k8452j029
$$ 1134437 1167020 1189302 1099841 1051537 1044645 1038992 1118215 1133529 1107114 1056425 1027973 1026944
9277A026944L0148O7324l4431o9755o3216J2683Q951O8773Q8797m4987K1718N7497
$$ 1026944 1057092 1124416 1089985 1020230 957014 969697 978648 1047421 1136218 1091231 1112949 1170446
9265A170446l5320r606p594k2427L696M0968j0717K8141r303j18629k5625J3315
$$ 1170446 1135126 1125520 1117926 1095499 1099195 1140163 1129446 1157587 1148284 1029655 1004030 1017345
9253A017345J4189J22478j3478j01603k767m879L4420K8277q2598p888P2190J02232
$$ 1017345 1031534 1154012 1140534 1038931 1036164 1031285 1065705 1093982 1011384 1003496 1075686 1177918
9241A177918n176m4679q0880J0237J7840J6455j1429K1109j4374L6059n5277N7472
$$ 1177918 1172742 1128063 1047183 1057420 1075260 1091715 1080286 1101395 1087021 1123080 1067803 1125275
9229A125275m0193l3584j4967P4192K023l0270k2280k2310k2181k0015j66k66
$$ 1125275 1085082 1051498 1036531 1110723 1112746 1082476 1060196 1037886 1015705 995690 995524 995258
9217I95258J6847J42044Q6525l7116r8997m4022O9251m0356k2530M4926o807L8297
$$ 995258 1012105 1154149 1240674 1203558 1104561 1060539 1129790 1089434 1066904 1111830 1105023 1143320
9205A143320M36j14891p6688N6612O0891k99l9471j9959l7568P2925l2804o5378
$$ 1143320 1143756 1028865 952177 1008789 1069680 1069381 1029910 1009951 972383 1045308 1012504 947126
9193I47126K2612j4207K8882J1958K2760l0483j9359O481L3352m0757Q2319O3790
$$ 947126 969738 955531 984413 996371 1019131 988648 969289 975770 1009122 968365 1050684 1114474
9181A114474j20617M2147P8316l3139p6133k7161J03743k832k583q1678l8654
$$ 1114474 993857 1036004 1114320 1081181 1005048 977887 1081630 1078798 1076215 994537 955883
9170I55883n116P0121L5200l6615K2043L1995j3864n4004k4096j0582l6195L0843
$$ 955883 950767 1020888 1056088 1019473 1041516 1073511 1059647 1005643 981547 970965 934770 965613
9158I65613P690J9481l2544n561l3855q2825L5459O4456J8061O4926M5500j2985
$$ 965613 973303 992784 960240 954679 920824 837999 873458 937914 955975 1020901 1066401 1053416
9146A053416m4515m5201r97K7775p4087j16611L1198L2379j5078J2396J7972L4746
$$ 1053416 1008901 963700 962703 990478 916391 799780 830978 863357 848279 860675 878647 913393
9134I13393N2923j8625K3579L4126k184m8817r770N6217K928k0391j2601J5368
$$ 913393 966316 947691 971270 1005396 1003212 954395 944625 1000842 1003770 983379 970778 986146
9122I86146K2801o0222k5723N9167K222n3773j4767P3467K9364k5470q052m2282
$$ 986146 1008947 948725 923002 982169 984391 930618 915851 989318 1018682 993212 985160 942878
9110I42878l7181o4252n0119L5921J7014k1284O2054R3373Q2475j221n0516j2658
$$ 942878 905697 841445 791326 827247 844261 822977 885031 978404 1060879 1059658 1009142 996484
9098I96484k2447n0860N0152N6716L2486o3206q7866p94Q883r634l5607p8431
$$ 996484 974037 923177 973329 1030045 1062531 999325 911459 910665 919548 909914 874307 795876
9086G95876J16047L6620m4034m7261N205N5420j3969l236l4050p622K3798p6638
$$ 795876 911923 948543 904509 857248 862453 917873 903904 900668 866618 858996 882794 806156
9074H06156L4946Q8701J12848j5476o0192R590K61n3949n338k0555K069O5708
$$ 806156 841102 929803 1042651 1027175 966983 976573 976834 922885 917547 896992 899061 964769
9062I64769P9161k6058j1285q527m0837l8110l8096J1067j8022j5898J1842l4391
$$ 964769 1043930 1017872 1006587 998060 957223 919113 881017 892084 874062 858164 870006 835615
9050H35615N5462O5095j5536l8650j2224M2832K3423O404j8006k9056l7087n2518
$$ 835615 891077 956172 940636 901986 889762 932594 956017 962421 944415 915359 878272 825754
9038H25754j6656O9894N5178k483K2076M5674J7980n8342j17100n5521q4J30608
$$ 825754 809098 878992 934170 931687 953763 999437 1017417 959075 841975 786454 786370 916978
9026I16978J4976k9743j26559l2465M333J4810J17461O7537L5640m6479j7537
$$ 916978 931954 902211 775652 743187 747520 762330 879791 947328 982968 936489 918952
9015I18952K3834p2996o3696O3054L8072m9J0136m7460l4785j2652l7265L3052
$$ 918952 942786 869790 806094 869148 907220 907171 917307 869847 835062 822410 785145 818197
9003H18197Q8932l5579o886J5619N1920J822k8170o3757L1571O615n5056L2855
$$ 818197 907129 871550 864664 880283 932203 934025 905855 842098 873669 880284 825228 858083
8991H58083p930m8389J8384J1864J01376K9898n1510m2835l0612k754N6214L5534
$$ 858083 850153 801764 820148 832012 933388 963286 911776 868941 838329 835575 891789 927323
8979I27323J4695p843k9917o2532K2182N233O318K9184j8042n6876m2851k2249
$$ 927323 942018 934175 904258 841726 863908 869141 875459 904643 886601 829725 786874 764625
8967G64625N7375O0166j2046p5052K4153P0476k3852r9128m0976P7923K8567j8837
$$ 764625 822000 882166 870120 795068 819221 889697 865845 766717 725741 803664 832231 813394
8955H13394K1355n0764l0734J9167M798N0607J4655l1231N3239K9802K733j8570
$$ 813394 834749 783985 753251 772418 777216 827823 842478 811247 864486 894288 897021 878451
8943H78451l0535j8132p6476K9296O6080K6605o422M527q4299l8735M8972Q4355
$$ 878451 847916 829784 753308 782604 848684 875289 868867 873394 789095 750360 799332 883687
8931H83687J8815J9940k5578l0675O8222M4392J12l861L1423L175n3476l2452
$$ 883687 902502 922442 896864 866189 934411 978803 978915 975054 1006477 1009652 956176 923724
8919I23724o0987m852l8668L5742L5876k0185j828J900m5257p4890M7485O6367
$$ 923724 862737 857885 819217 854959 890835 870650 868822 870722 825465 750575 798060 864427
8907H64427m4628O085L2188m2865l3914k6991k2307l0710M4353R4989L4771o3498
$$ 864427 819799 825884 858072 815207 781293 754302 731995 701285 745638 840627 875398 811900
8895H11900j22559P0658K3270n0731L7537L0002M397j8338L4414J14109M1521
$$ 811900 689341 759999 783269 732538 770075 800077 804474 786136 820550 934659 976180
8884I76180n8657q9716o5237k9432p339J1413O314J00340J24682n6491r2982l244
$$ 976180 917523 827807 762570 733138 725799 737212 743526 843866 968548 912057 819075 815831
8872H15831o1806o7757J0906M2393m0221l3833P769J9801Q9261j0049p2184O3796
$$ 815831 754025 686268 697174 739567 699346 665513 673282 693083 782344 772295 700111 763907
8860G63907K9571m7455L8700n080O5208l0710q3702P584J6864m4199j6797N262
$$ 763907 793478 746023 784723 779643 844851 814141 730439 738023 754887 710688 693891 699153
8848F99153M7080k7150j23652L6705P1417O3734J741o1630O510j9162k6214K5708
$$ 699153 746233 719083 595431 632136 703553 767287 769028 707398 713908 694746 668532 694240
8836F94240L2714J5325j7139m4221K710P9738K8713N4387L2793m9259r9863M2717
$$ 694240 726954 742279 725140 680919 683629 763367 792080 846467 879260 830001 730138 772855
8824G72855L7603m9231K1181R2819M0546j26504p9285o5115M5097P5566m4287
$$ 772855 810458 761227 782408 875227 915773 789269 709984 644869 689966 765532 721245
8813G21245J4406Q0818o7836k9745J2383L5321K6973m9912K5058m6441M6684N4448
$$ 721245 735651 816469 748633 718888 731271 766592 793565 743653 768711 722270 768954 823402
8801H23402j14838j6609N3337J2557k389l8167J5648M5265Q377k2359q342N4833
$$ 823402 708564 691955 745292 757849 755460 717293 732941 778206 786583 764224 755882 810715
8789H10715l3656n0241o810L5534j7126l1000R4681M795j01869r011J27657L9445
$$ 810715 777059 726818 720008 755542 738416 707416 802097 806892 705023 696012 823669 863114
8777H63114n4455r473j11403m1177j4047J21666L0188K5970o4517J0071m7790
$$ 863114 808659 799186 687783 646606 632559 754225 784413 810383 745866 755937 708147
8766G08147o0694O0635l3300m9215m3877L4639N4082n6029q539J10098P8187q037
$$ 708147 647453 708088 674788 625573 581696 616335 670417 614388 605849 715947 794134 786097
8754G86097k9204m8562p1197Q1211L4129L1657J72l2693j6459q2761k3192K5157
$$ 786097 756893 708331 637134 718345 752474 784131 784303 751610 735151 652390 629198 654355
8742F54355N4702J3648L4246M5269K079l9834p735k8483o899J1902j6827r2275
$$ 654355 709057 722705 756951 802220 804299 764465 756730 728247 721348 733250 716423 624148
8730F24148M9782Q211m4415j8177K2622M9417O197q0010j3421J27743Q3650l3988
$$ 624148 673930 682141 637726 619549 642171 691588 697785 617775 604354 732097 815747 781759
8718G81759k9951q7170n9201N3765P081N5895R2935M311o0199M2716J3604p0301
$$ 781759 751808 664638 605437 659202 666283 722178 815113 819424 759225 801941 815545 745244
8706G45244K06K7289K5554N430q867k7664k8428o977j2833p3852L3561j9421M6666
$$ 745244 745450 772739 798293 803723 794856 767192 738764 731787 718954 645102 678663 659242 705908
8693G05908l249p970Q0321o4043k2031O0320O2710J8626r4266m9369R464j3690
$$ 705908 702659 694689 775010 710967 688936 749256 811966 830592 736326 686957 696421 682731
8681F82731p800o721M1112J3510k1444l6950P3369P3985n0127J8709K1246r1111
$$ 682731 674931 668210 709322 722832 701388 664438 737807 811792 761665 780374 801620 710509
8669G10509o0079j0610N5971P213O685R316J0585l5438q2R465O1735J7011q2600
$$ 710509 650430 639820 695791 703004 709689 719005 729590 694152 694070 703535 765270 782281 699681
8656F99681n9547N6605N6975K6864m5279o5173J9026J02940k5387p701j5131k0751
$$ 699681 640134 696739 753714 780578 735299 670126 689152 792092 766705 759004 743873 723122
8644G23122j3414j0001j3724j2764k6044n0246k1146L1396J8341M0736K7552j7660
$$ 723122 709708 699707 685983 673219 647175 596929 575783 607179 625520 666256 693808 676148
8632F76148p9308K5499O6278R6o957n1699n2176K777R2371N4884O3105m3368j4407
$$ 676148 596840 622339 688617 688713 681756 630057 577881 580658 673029 727913 791018 747650 733243
8619G33243J1767j65458m7761J9801J4680K3842j1256q3714j8727M7624J12640
$$ 733243 745010 579552 531791 551592 566272 590114 578858 495144 476417 524041 636681
8608F36681J01109R1963M4627l8191n8354o1884K6435n3925n2977N2181P6462
$$ 636681 737790 829753 874380 836189 777835 715951 742386 688461 635484 687665 764127
8597G64127K5340j1304n6230j2281p406K3380m0801n6232J676J9226M4968k0515
$$ 764127 789467 778163 721933 709652 702246 725626 684825 628593 630269 649495 694463 673948
8585F73948m1434P1439L8889Q173k9162m533N824m6074j736K6732J671j8531M5311
$$ 673948 632514 703953 742842 751015 721853 717320 723144 677070 675334 702066 703737 685206 730517
8572G30517Q446o4655m8254L6368L1721M014O4878M2656j2647k3876l2187J299
$$ 730517 738963 674308 626054 662422 694143 698157 763035 805691 793044 769168 736981 738280
8560G38280m8425j536M8859k3790j00891J723P0377K4000n7862N6936M7540j7753
$$ 738280 689855 688319 737178 713388 612497 614220 684597 708597 650735 707671 755211 737458
8548G37458n170q4645j23013J468K0072O962j3255N0280P537P716M4221R4288
$$ 737458 732288 647643 524630 526098 546170 553132 539877 590157 597694 605410 649631 743919
8536G43919M0505m9056j12652J0847N0126L7320M4445K9780j2529p0958k037O993
$$ 743919 784424 735368 622716 633563 683689 721009 765454 795234 782705 711747 709710 716703
8524G16703k1228N7405j5221r1107l2784o0626K1929O803Q5640l343q3911k8791
$$ 716703 695475 752880 737659 646552 613768 553142 575071 581874 667514 664171 580260 551469
8512E51469P9244J3909N151P6939j7997o2915K7024J6858r8787n9073j1100O1025
$$ 551469 630713 644622 649773 726712 708715 645800 672824 689682 590895 531822 520722 581747
8500E81747P9398k5814j4340P4202m8912l2694n205J3877l3911J2815R634K0298
$$ 581747 661145 635331 620991 695193 646281 613587 608382 622259 588348 601163 610797 631095
8488F31095o1495P137Q9115N0197o0427n9245J3482k1751j6447j1695J207R3009
$$ 631095 569600 576737 665852 716049 655622 596377 609859 588108 571661 559966 561173 654182
8476F54182N2627j6279O3437k4185j05006n6870J6565L7743l87l6360k2880J1807
$$ 654182 706809 690530 753967 729782 624776 567906 584471 622214 621827 585467 562587 574394
8464E74394L817l7415J3735M0503M7597k2270o0510n4209K9146N7812P846k5623
$$ 574394 578211 540796 554531 595034 642631 620361 559851 505642 534788 592600 600446 574823
8452E74823J8644K0487Q2437K7319l2272J6785J0184o9131l1455O4801M4034l5100
$$ 574823 593467 613954 696391 723710 691438 708223 718407 649276 617821 682622 726656 691556
8440F91556j05525o8840J4406J1602n2471K6804R2340k2475P480p5844J9074N3622
$$ 691556 586031 517191 531597 543199 490728 517532 609872 587397 594877 519033 538107 591729
8428E91729J2421K9074J1324K7935M9800r2033j32584l7511r880M4803L1699J9762
$$ 591729 604150 633224 644548 672483 722283 630250 497666 460155 450275 495078 526777 546539
8416E46539l455O9744j5630n7233J4452j7631k8569k4174K6380p7920O0382M1712
$$ 546539 543084 612828 597198 539965 554417 536786 508217 484043 510423 432503 492885 534597
8404E34597p4557K1241P5132O3600n0113j08694k4922M5466j8345L5077m7019
$$ 534597 460040 481281 556413 620013 569900 461206 436284 481750 463405 498482 451463
8393D51463K6546O2268k6719J00932J5245n4988J5354Q70L700n4094n908J0372
$$ 451463 478009 540277 513558 614490 629735 574747 590101 590971 594671 540577 534669 545041
8381E45041m0778L8126j8255J01778m076n6015m4436n8028R91J7529k2082l3465
$$ 545041 504263 542389 524134 625912 621836 565821 521385 463357 464348 481877 459795 426330
8369D26330l4148L1955N3205L5145j1458o0157M8849M8539l0103J4261K4162l474
$$ 426330 392182 424137 477342 512487 501029 440872 489721 538260 508157 522418 546580 543106
8357E43106L7038j9130k4015M9852N3159M9528k0024L5554K8837j2678l7248n0518
$$ 543106 580144 561014 536999 586851 640010 689538 669514 705068 733905 721227 683979 633461
8345F33461l2571q1547J9467N9725k5538J5879K7803p670q622J6542O816l7995
$$ 633461 600890 519343 538810 598535 572997 588876 616679 609009 600387 616929 623745 585750
8333E85750m529M817k3722n0936J05899L853o7647n4186l1352M1294M0192J9740
$$ 585750 581221 586038 562316 511380 617279 621132 553485 499299 467947 509241 549433 569173
8321E69173n1668K4430l4846r7247Q946n694M5794Q8837L2730J4179K3058j3482
$$ 569173 517505 541935 507089 409842 418788 413094 458888 547725 580455 594634 617692 604210
8309F04210l8297n5287L4352M8171L8310k7025j4580m4450P1618n235p7507n7781
$$ 604210 565913 510626 544978 593149 631459 604434 589854 545404 617022 611787 534280 476499
8297D76499M2040Q7723j4441q4490k078P0643L6364R7n0342J3523j8990R546K1281
$$ 476499 518539 606262 591821 507331 505253 575896 612260 612357 562015 575538 556548 566094 587375
8284E87375m4921j52012P114J6524J8405K3790l1801K8422o14p8624N5011O7470
$$ 587375 542454 390442 397556 414080 432485 456275 424474 452896 452282 373658 428669 496139
8272D96139l5953m3099O110k3039N3816K7812J7956l8351j3689N6956K8342R141
$$ 496139 460186 417087 423197 400158 453974 481786 499742 461391 447702 504658 533000 542141
8260E42141m5905M1929J06270n0364r0770j1777N7102K0913m6622l5389k2824
$$ 542141 496236 538165 644435 594071 503301 491524 548626 569539 522917 487528 464704
8249D64704l6761K847M9252R381P448k6201J6554J13034R6734n7943J1323j552
$$ 464704 427943 430790 480042 489423 496871 470670 487224 600258 696992 639049 650372 648820
8237F48820n6518l3736m7577n0653L815P6606L612l4572L5145O033r569n0562
$$ 648820 592302 558566 510989 460336 464151 540757 544369 509797 544942 550975 541406 490844
8225D90844O67K1556k9445k8720N635J25842J08498o2335m936N8107j7259j9131
$$ 490844 491511 513067 483622 454902 460537 586379 694877 632542 627606 685713 668454 649323
8213F49323o6748l480j0170n7179k5744n42p0965r4698Q000J10372j1980l0746
$$ 649323 582575 579095 568925 511746 486002 485460 414495 319797 327797 438169 426189 395443
8201C95443L7701O3313N413M0356m586k7558l4919J2770J5289M9284r51o1945
$$ 395443 433144 496457 501870 542226 537640 510082 475163 487933 503222 552506 551555 489610
8189D89610p816K084J2456o6q46j5296J3286O0392k9057p6900k1830N8814P2977
$$ 489610 481794 483878 496334 496268 495422 480126 493412 553804 524747 447847 426017 484831 557808
8176E57808J37747K7032n3376l5657K3515m9444p306J6988o6939r2429n5638Q2047
$$ 557808 695555 722587 669211 633554 657069 607625 600319 617307 550368 457939 402301 484348
8164D84348K9670j5834k8059L3312Q816L518Q3259Q848j1041l3069R249J12732
$$ 484348 514018 498184 470125 503437 512253 515771 599030 607878 596837 563768 573017 685749
8152F85749K1642o6887k0221l7568m2776J632O7284p169J9248J7824q7162l544
$$ 685749 707391 640504 620283 582715 539939 541571 608855 601686 620934 638758 551596 548052
8140E48052K303n3879j3714k0577J5418Q7675N9118m2194p5951J7836L2462j4927
$$ 548052 550355 496476 482762 462185 477603 565278 624396 582202 506251 524087 556549 541622
8128E41622o1252j2459Q6013L0311m7717q221j5838l2335J03494N1851n8352j13331
$$ 541622 480370 467911 553924 584235 536518 528297 512459 480124 583618 635469 577117 463786
8116D63786k9152M3784J5383M7280r6699l1547L0721j0859N0701L4823K9286j5191
$$ 463786 434634 478418 493801 541081 444382 412835 443556 432697 483398 518221 547507 532316
8104E32316n8629P4602n0871n9060M0534n0423K3791N6475k7039p4589L8451n825
$$ 532316 473687 548289 497418 438358 478892 428469 452260 508735 481696 407107 445558 439733
8092D39733n1279M8974O5856K3244k5239J1148J1108o053m2134O764K1464j0585
$$ 439733 388454 437428 503284 526528 501289 512437 523545 517492 475358 482122 503586 493001
8080D93001N1073q0034n9431R246J6470O5875O406o6208j5573M7807K4945J0271
$$ 493001 544074 464040 404609 413855 430325 496200 502606 436398 420825 468632 493577 503848
8068E03848k2496N1955M9156L0133o5142l8299M6991l5677o0522j5568K5660r241
$$ 503848 481352 533307 582463 612596 547454 509155 556146 520469 459947 444379 470039 460798
8056D60798L2176L0218L7691n4905k7459L9644M0660j08721m9498K6956P3992
$$ 460798 492974 523192 560883 505978 478519 518163 558823 450102 400604 427560 501552
8045E01552O1370q498m189l5455l9755k1326j01067R6580K7119q9968J8112N101
$$ 501552 562922 554424 550235 514780 475025 453699 352632 449212 476331 386363 404475 409576
8033D09576J7736O1174J1575K5343l5865N6207P763l0930q2272L5850j4051o8034
$$ 409576 427312 488486 500061 525404 489539 545746 553509 522579 440307 476157 462106 394072
8021C94072J5173K7202n9718r132P0608K4662j6487j15158N526M192l4494N7817
$$ 394072 409245 436447 376729 367597 438205 462867 446380 331222 336748 340940 306446 364263
8009C64263M1693L7557K446N4612N6627p7338m9124K205R6006L8895n6342j26530
$$ 364263 405956 443513 445959 500571 557198 479860 430736 432941 528947 567842 511500 384970
7997C84970O0954M2253k7743p0412m1649N848J5470K1758k8024p240P5777K8489
$$ 384970 445924 488177 460434 390022 348373 354221 369691 391449 363425 356185 431962 460451
7985D60451l6170k2345M9751J8759m5765Q83l1160K0439K122j9504O6698P051
$$ 460451 424281 401936 451687 470446 424681 425564 394404 414843 416965 397461 464159 471210
7973D71210l0095N8084M524k197K0011k035J3055o2169k0677q2910j6428J7511
$$ 471210 441115 499199 503723 501526 521537 519502 532557 470388 449711 366801 350373 367884
7961C67884K2238l1391O683P9989L6981j0873J2171K1290j020l5022L181K1388
$$ 367884 390122 358731 365414 445403 482384 471511 483682 504972 503952 468930 472111 493499
7949D93499L3789J8035N5950q924m6572k5556M0727n5480o7215k2246m985j5187
$$ 493499 527288 545323 601273 592349 545777 520221 560948 505468 438253 416007 411022 395835
7937C95835K760R3954j5020j5476p0368j30508Q510R4257M7690K0944j3163q173
$$ 395835 398595 492549 477529 462053 391685 261177 269687 363944 411634 432578 419415 411242
7925D11242j8598j0661l3382K0302R888L5496j5485p1242K4331M278L5799o1811
$$ 411242 392644 381983 348601 368903 378791 414287 398802 327560 351891 356169 391968 330157
7913C30157j5164N1608M1910o1151r0726L683P2863L0500J0748J1839k8776k9377
$$ 330157 314993 366601 408511 347360 256634 260317 333180 363680 374428 386267 357491 328114
7901C28114j0869k0618Q6651N3619R03j4674L4766m9929M3611M9892k3840j6870
$$ 328114 317245 296627 383278 436897 437800 423126 457892 407963 451574 501466 477626 460756
7889D60756O618M9731n9365j38117J3329L1726k1081N1527k1237j8213k7995k9703
$$ 460756 467374 517105 457740 319623 332952 364678 343597 395124 373887 355674 327679 297976
7877B97976L2957N2666p6171l6406K6836P4005n4530l4820J4258J8305r824m5094
$$ 297976 330933 383599 307428 271022 297858 371863 317333 282513 296771 315076 305252 260158
7865B60158J2983J01360Q4056L872m7759j9244N9962P0120L7288l0087m6182j09307
$$ 260158 273141 374501 458557 462429 414670 395426 455388 525508 562796 532709 486527 377220
7853C77220r3559o3143J6951O4405l5860p5471j2868J31504j742K8165N5756m5251
$$ 377220 283661 220518 237469 301874 266014 190543 177675 309179 307437 335602 391358 346107
7841C46107o8790R4878O4319O333q4895o5917R3452j1046Q4397k620k7236m2150
$$ 346107 277317 372195 436514 442847 357952 292035 385487 374441 458838 456218 428982 386832
7829C86832k2803Q3748O0138r2609p7802k647m6953p3522j6786P5984j6613L1880
$$ 386832 364029 447777 507915 415306 337504 334857 287904 214382 197596 273580 256967 288847
7817B88847N8442K2027j0597m5871O4038J3214p4604m1536J7222M1726M1901l9519
$$ 288847 347289 369316 358719 312848 376886 390100 315496 273960 291182 332908 374809 335290
7805C35290n2033J07734N475r5294O9782Q7071J9834R020o8334m6985N9866j04848
$$ 335290 283257 390991 396466 301172 370954 458025 477859 486879 418545 371560 431426 326578
7793C26578L9352N3103M4345k0723m6689l9288l9998O024M8636P3918J5061r9356
$$ 326578 365930 419033 463378 442655 395966 356678 316680 322704 371340 445258 460319 360963
7781C60963n4425L4699k2645J1444P0546J0294j1020M6362J9466o4364o885k8428
$$ 360963 306538 341237 318592 330036 400582 410876 399856 446218 465684 401320 394435 366007
7769C66007L8071n293m7915o8181n8390O5006O6422k3369L7500j9635p7629j853
$$ 366007 404078 398785 350870 282689 224299 289305 355727 332358 369858 350223 272594 270741
7757B70741K7075P4401Q4605n5561r7621j0874J340M376J100O2925N2252m0465
$$ 270741 297816 372217 456822 401261 303640 292766 294106 298482 299582 362507 414759 374294
7745C74294r1220O704J4652Q3677K3147q4300k0344N0944r3317l1957M6650K4435
$$ 374294 283074 289778 304430 388107 411254 326954 306610 357554 264237 232280 278930 303365
7733C03365J502m0800J2050q13k2169J2116k0228K8803j5785O1210J00697L1274
$$ 303365 304867 264067 276117 275304 253135 265251 245023 273826 258041 319251 419948 451222
7721D51222n1610r5397n1562N8717Q9807N1853m8725q2455o3876J4217K5570J1806
$$ 451222 399612 304215 252653 311370 401177 453030 404305 321850 257974 272191 297761 309567
7709C09567O7527L1971j4312m2307k0027q983o8438o4744j8342O5584n993l541
$$ 309567 377094 409065 394753 352446 332419 323436 254998 190254 171912 237496 231503 227962
7697B27962L4192j4884L4124K7593N5032J28760J9849n8973m8724o1656o3526
$$ 227962 262154 247270 281394 308987 364019 492779 512628 453655 404931 343275 279749
7686B79749l1314k4230J1357K7323j3830R2369K2J1815Q8021j2828q0299l5338
$$ 279749 248435 224205 235562 262885 249055 341424 341446 353261 441282 428454 348155 312817
7674C12817M9323J19730K5376p6149r4406q0333l8337N5026Q8271J2307q582J0647
$$ 312817 362140 481870 507246 431097 336691 256358 218021 273047 361318 373625 365043 375690
7662C75690J1605l3561o1572M1662k6539m1198o9300l000L2180K7482j6432j5441
$$ 375690 387295 353734 292162 333824 307285 266087 196787 193787 225967 253449 237017 221576
7650B21576O2581O6942L7266l0357l2799m2605J0404j8907k5547L8507J9028q970
$$ 221576 284157 351099 388365 358008 325209 282604 293008 274101 248554 287061 306089 297119
7638B97119J5180k4519j9977K646N1488J2051O2294J2460j04043m5419K5543j8353
$$ 297119 312299 287780 267803 270449 321937 333988 396282 408742 304699 259280 284823 266470
7626B66470j035O9790P8059m2680l9779K7246j01984j1071L9050P4169K3594N6783
$$ 266470 265435 335225 413284 370604 330825 358071 256087 245016 284066 358235 381829 438612
7614D38612M0819o5759m5100L318l6806o0363l4245K3373j4523M4396J08405K9014
$$ 438612 479431 413672 368572 371890 335084 274721 240476 263849 249326 293722 402127 431141
7602D31141r4484K8919K8749k1837m4888n5995J4257j3505L4067M9793O2714M7206
$$ 431141 336657 365576 394325 372488 327600 271605 285862 272357 306424 356217 418931 466137
7590D66137q7474r4859M5164N7782j1792n2273M0099m9875l0784J2642L056J3124
$$ 466137 378663 283804 328968 386750 374958 322685 362784 312909 282125 294767 297823 310947
7578C10947K4544j9063k7753K764k2115J5801J626l0163J02488k711j71Q5451
$$ 310947 335491 316428 288675 291439 269324 285125 286751 256588 359076 356365 356194 441645
7566D41645r2840k9849M1537l5432n8223n5982L8424J13147p172m1695K9694j8222
$$ 441645 348805 318956 360493 325061 266838 210856 249280 362427 355255 313560 343254 325032
7554C25032p537l8930l4710L1088j0371L3889P3466o3731m5322m130J51179O9675
$$ 325032 317495 278565 243855 274943 264572 298461 371927 308196 262874 258744 409923 479598
7542D79598n6310m3395n8688n8416O687P9402k1107k0989Q3722k5234p3988M6176
$$ 479598 423288 379893 321205 262789 269476 348878 327771 306782 390504 365270 291282 337458
7530C37458P607m8279J206J8893M4362m6701L2551J5698q834l4662l6157r3566
$$ 337458 345065 296786 297992 316885 361247 314546 347097 362795 353961 319299 283142 189576
7518A89576K2863K7205L7171N1483R7785P2950l0760j18769l6717l020K2206J680
$$ 189576 212439 239644 276815 328298 426083 499033 468273 349504 312787 309767 331973 333653
7506C33653N7875Q667r88o7704o1285J4147n1564L8502K3006n0865k5094M4199
$$ 333653 391528 400195 399207 331503 270218 284365 232801 271303 294309 243444 218350 262549
7494B62549k058o7363J2852P0947L7381M9245J0864L8476j499K1870l9394p8091
$$ 262549 260491 193128 205980 276927 314308 363553 374417 412893 411394 433264 393870 315779
7482C15779j7893j2449k4856o8927k9800K5062P3826O0831k2184j5265m858J3254
$$ 315779 297886 285437 260581 191654 161854 186916 260742 321573 299389 284124 279266 292520
7470B92520P5301M555m3943L539K7768L1060n8572J3296l8503J4064M6312r9738
$$ 292520 367821 372376 328433 331972 359740 390800 332228 345524 307021 321085 367397 267659
7458B67659r7114P130N2492K4341k0936L9707J6914k7634N0248k1883q4022l2006
$$ 267659 170545 177675 230167 254508 233572 273279 290193 262559 312807 290924 206902 174896
7446A74896P1791R8056l4642l2551q408r2840J803N5241O7258J6022M0365j6796
$$ 174896 246687 344743 310101 277550 269142 176302 178105 233346 300604 316626 356991 340195
7434C40195m0495n7181l3332O1193K5533R243n8225O618N7498O1009k1819l5347
$$ 340195 299700 242519 209187 270380 295913 305156 246931 253549 311047 372056 350237 314890
7422C14890L8204o2322L018J1087K49l8380r557Q1276L5744n4471K8702m6721
$$ 314890 353094 290772 293790 304877 305126 266746 257189 338465 374209 319738 348440 301719
7410C01719n7537q456J9819L7620L3122k824J9089K371q5289r272P9207o4129
$$ 301719 244182 235726 255545 293165 326287 323463 342552 344923 259634 250362 329569 265440
7398B65440n0548K5510q171K3840j8470n904P6098k3589j7162l2393O9531K0999
$$ 265440 214892 240402 232231 256071 237601 231697 307795 284206 267044 234651 304182 325181
7386C25181j1279k4543K0754j5936p3672q6725r0013K5029R8474J4527q6452k946
$$ 325181 313902 289359 310113 294177 220505 133780 43767 68796 167270 181797 95345 92399
7374I2399K0559K4147P0929N3745P1189l8154r5676J0979O2829O2810R8366r335
$$ 92399 112958 137105 208034 261779 332968 294814 199138 210117 272946 335756 434122 424787
7362D24787N1856J2385k228r6669j39740K4766K6295M8866K6142j4561k2662m9595
$$ 424787 476643 489028 486800 390131 250391 275157 301452 350318 376460 361899 339237 289642
7350B89642R419j4228m9480K2618L7618L5251k3359n4431q0054r751K8379M8126
$$ 289642 299061 284833 235353 257971 295589 330840 307481 253050 172996 163245 191624 239750
7338B39750N0593m8114L1539r50Q132O8998k633o2256k413J1339k242q3547J18462
$$ 239750 290343 242229 273768 272818 280950 349948 347315 285059 282646 293985 291743 208196 326658
7325C26658Q0857r580r46r498l5853n875m1730j06816N2618Q4276j8409n5625
$$ 326658 407515 397935 396989 387491 351638 345763 304033 197217 249835 334111 315702 260077
7313B60077q7166N326L0840n9152l5015O2293N4284l8265j33J7789K267J0975
$$ 260077 172911 178237 209077 149925 114910 177203 231487 193222 193089 210878 213145 224120
7301B24120m7451m4643K7612j2419J5898K1567N2153J29071j4870m6658j5781
$$ 224120 176669 132026 159638 147219 163117 184684 236837 365908 351038 304380 288599
7290B88599j1762J2147O5753J7381r0953k6636p839j2258j828k5096j7587j2548
$$ 288599 276837 288984 354737 372118 281165 254529 246690 234432 232604 207508 189921 177373
7278A77373k1980J5439O2041N5603J7080m4200l3875m7585o6397L0182Q8214O2857
$$ 177373 155393 170832 232873 288476 305556 261356 227481 179896 113499 143681 231895 294752
7266B94752j9811L2542o518q581K3483o4229N431N134m873l1382j06337J1354
$$ 294752 274941 307483 300965 292384 315867 251638 257069 262203 257330 225948 119611 130965
7254A30965M7154J30865L864n4453n6692o0599K1409N1576K2144R993j283L8034
$$ 130965 178119 308984 312848 258395 201703 141104 162513 214089 236233 246226 244943 282977
7242B82977L1273p8008L392K7781k1024L410L807l1100N247L8975K9322l2988
$$ 282977 314250 236242 239634 267415 246391 249801 253608 222508 227755 266730 296052 263064
7230B63064O312K6938K0626K4681p894J6616m6412j12204l2373L5101k1230N543
$$ 263064 269376 296314 316940 341621 333727 350343 303931 191727 159354 194455 173225 178768
7218A78768N2180J08499j9314m0787m0949p5412j24919J1313J21236J4894O0357
$$ 178768 230948 339447 320133 279346 238397 162985 38066 49379 170615 185509 245866
7207B45866r747q05K6835k305p1950n8038K7615P9875j0671r3355M5622N4398
$$ 245866 236119 235314 262149 259844 187894 129856 157471 237346 226675 133320 178942 233340
7195B33340r185p0194M5397N7658M4584L7825o9717m5764n5323n6707R8782l650
$$ 233340 224155 153961 199358 257016 301600 339425 269708 223944 168621 111914 210696 207046
7183B07046m723J4983P216J39803j6308m8011j1633p0496j3405l8859K2248R1741
$$ 207046 202323 217306 224522 364325 348017 300006 288373 217877 204472 165613 187861 279602
7171B79602k4597n7328p831o808O7177L8305m9279p3875J0668L4197K7473k4967
$$ 279602 255005 197677 189846 183038 250215 288520 239241 165366 176034 210231 237704 212737
7159B12737k7380J857K1543N3840j1616o318M0190m9510k9243K8447j5357m9162
$$ 212737 185357 187214 208757 262597 250981 244663 284853 235343 206100 234547 219190 170028
7147A70028j8751j2747k0170M9101R4776J09143m2961n6278k8723j2032r0214
$$ 170028 151277 138530 118360 167461 262237 371380 328419 272141 243418 231386 141172
7136A41172k1445J6298k5142L9698P0797K3901M6377K5008M9262K6571n0138j21741
$$ 141172 119727 136025 110883 150581 221378 245279 291656 316664 365926 392497 342359 220618
7124B20618o2178J2842K4158r340O2461j1046n8877l8592Q7149J1264k3370J3633
$$ 220618 158440 171282 195440 186100 248561 237515 178638 140046 227195 238459 215089 228722
7112B28722m3171k2446l4891M7552m174m0224m8200K5783j062m10Q2953P0233
$$ 228722 185551 163105 128214 175766 171592 131368 83168 108951 107889 107479 190432 260665
7100B60665j2988K803N1792o9299j2237M6774M1806N4431K3878m1497n2835k4788
$$ 260665 247677 250480 302272 232973 220736 267510 309316 363747 387625 346128 293293 268505
7088B68505k4296o1539J3267j7039N1055N2727j579R816M2894m8233L4756Q4841
$$ 268505 244209 182670 195937 178898 229953 282680 281101 290917 333811 285578 320334 405175
7076D05175m6359m8101j5643j649j0643n0904j36389p696N7237L8076p9798j6334
$$ 405175 358816 310715 295072 293423 282780 231876 95487 87791 145028 183104 103306 86972
7064H6972Q1445O3021o1192j0091l3473j9044l120L9218M2948J1827N5668J4057
$$ 86972 168417 231438 170246 160155 126682 107638 104518 143736 186684 198511 254179 268236
7052B68236o173p1353O7681Q3262m2069l6133j5604N9781k0560j32000O8345P7288
$$ 268236 262063 190710 258391 341653 299584 263451 247847 307628 287068 155068 223413 300701
7040C00701j5243k0730l915Q3k9774m203J5966k1942O2157l8011K7648K6497m755
$$ 300701 285458 264728 260813 260896 231122 226919 242885 220943 283100 245089 272737 299234 294479
7027B94479k8943k3330K2749J6780J602p1910q8741l4828Q2656J07044K3323J7570
$$ 294479 265536 242206 264955 281735 283337 211427 122686 87858 170514 277558 300881 318451
7015C18451n2206o1787k7789q9J4912K8815m1081m6757l249O7544O7602l8497
$$ 318451 266245 204458 176669 176580 191492 220307 179226 132469 129220 196764 264366 225869
7003B25869o687j8289q863m6158k4652O9950L3238K498l7551k8466O435N4711
$$ 225869 219182 200893 192030 145872 121220 191170 224408 226906 189355 160889 167324 222035
6991B22035M3356O4834j2828N3542k0361n4149j8974l4221m1208j9566j4668m9401
$$ 222035 265391 330225 317397 370939 350578 296429 277455 243234 202026 182460 167792 118391
6979A18391q075M8366J3017K2661N669N3409J0238n1140j07134l2284N5822Q800
$$ 118391 110316 158682 171699 194360 200029 253438 263676 212536 105402 73118 128940 137740
6967A37740K8535M4137L0925L9657P0714P573j01136o4511K3557J6057o7792k8648
$$ 137740 166275 210412 241337 280994 351708 359281 258145 193634 217191 233248 165456 136808
6955A36808m3P1502O9205J4143r388r5620J3692N4510p7832m715O4640N6404M9318
$$ 136808 136765 208267 277472 291615 282227 186607 200299 254809 176977 172262 236902 293306 342624
6942C42624l968r6434m2786j9738n1060M0571N6293K2909M6424O0017k8489p8572
$$ 342624 338656 242222 199436 179698 128638 169209 225502 248411 294835 354852 326363 247791
6930B47791l826j9682J0516m1506m5716Q162L7865l3609o7533J2707P1821K8138
$$ 247791 243965 224283 234799 193293 147577 155739 193604 159995 92462 105169 176990 205128
6918B05128L9936M8771n7892o7701K1816L6927N66j3509o2892J6564j0153l6283
$$ 205128 245064 293835 235943 168242 190058 226985 227551 214042 151150 167714 157561 121278
6906A21278J7958M2247L828Q848M9892J1617l0177m3571J9900R0159n8552o2441
$$ 121278 139236 181483 185311 194159 244051 255668 225491 181920 201820 291979 233427 170986
6894A70986K2406Q7689j2009o5567P3698J13044l1735r8262J4241j1345l7471
$$ 170986 193392 281081 269072 203505 277203 390247 358512 260250 274491 263146 225675
6883B25675o0074j6388m2300O2610k82p2424k9102P7752N8830o2660l3273L0888
$$ 225675 165601 149213 106913 169523 169241 96817 67715 145467 204297 141637 108364 139252
6871A39252J8313K1004K1088J7941o137j0383k462j3364j705O0940o2134q830
$$ 139252 157565 178569 199657 217598 211461 201078 198616 185252 183547 244487 182353 173523
6859A73523K1516k0497m9129M5031K2169j2389m791O4958o9621m3070l7208J3495
$$ 173523 195039 174542 125413 170444 192613 180224 175433 240391 170770 127700 90492 103987
6847A03987O4418J8790Q4281o8879q4334p8677M5255J3793K7333N5733j0751K9563
$$ 103987 168405 187195 271476 202597 118263 39586 84841 98634 125967 181700 170949 200512
6835B00512o4022p2187j4129r611L2138R4221l6320j5079O8152N5764p0082k5859
$$ 200512 136490 64303 50174 40563 72701 166922 130602 115523 183675 239439 169357 143498
6823A43498l653R0924K1466l0331n0489j3387n3543j0276o070J14926p851J4066
$$ 143498 139845 230769 252235 221904 171415 158028 104485 94209 88139 203065 195214 209280
6811B09280k3245m5465l6614n1073M5900k0029k8080M7702P379k1184m4799L4077
$$ 209280 186035 140570 103956 52883 98783 78754 50674 98376 105755 84571 39772 73849
6799G3849M1013p341p7456N7966P7777K966M823o45j498p674k6632K6546M686
$$ 73849 114862 107521 30065 88031 165808 168774 173597 172952 171454 163780 137148 163694 168380
6786A68380N614k6399k5240R7752M7373o1618o2843l7932j4860L8722M2581M6217
$$ 168380 173994 147595 122355 220107 267480 205862 143019 105087 90227 128949 171530 217747
6774B17747K7536K8829m2461q1195l3971p3801m1299J4476N4367J04085J6141
$$ 217747 245283 274112 231651 150456 116485 42684 1385 15861 70228 174313 190454
6763A90454N746j5278L1371R177j8691K2766q8268M65r985j888O3173N8952N72
$$ 190454 196200 180922 212293 221470 202779 225545 137277 137742 127757 125869 189042 247994 248566
6750B48566o2211L5160k4604J771J9986m4384n5802P7087L5759j8770j1856M9715
$$ 248566 186355 221515 196911 198682 218668 174284 118482 195569 231328 212558 200702 250417
6738B50417K0130j1226l2042K0219l3471l2293N8431R5493l2112p0241n3249L993
$$ 250417 270547 259321 227279 247498 214027 181734 240165 335658 303546 233305 180056 184049
6726A84049q1253l3012k1782J21443O2876m061k3921o2638L1283J8737K9272R171
$$ 184049 102796 69784 48002 169445 232321 228260 204339 141701 172984 191721 220993 230164
6714B30164r4050k2288R0340N1248k592o5436p1485R933K5022J7115K892L530
$$ 230164 136114 113826 204166 255414 252822 187386 115901 125834 150856 167971 170863 174393
6702A74393K5982J6510m0995m7366N6492P2244J9681n3774j01479j3424R9255
$$ 174393 200375 216885 175890 128524 185016 257260 276941 223167 121688 108264 207519
6691B07519k8483l2388M2101n4015m7908L0817J7528j7264k3739K5223J18713
$$ 207519 179036 146648 188749 134734 86826 117643 135171 117907 94168 119391 238104
6680B38104m4502p8239J4211r626K8537J6231l8222J450n6520r479N0427O4005
$$ 238104 193602 115363 129574 119948 148485 164716 126494 127944 71424 61945 112372 176377
6668A76377j2615o5270k6338R6193L1503k4403n3254j01808j1343J2552j8184
$$ 176377 163762 98492 72154 168347 199850 175447 122193 20385 9042 21594 3410
6657C410L9303P270O0948l83K3587k746O19n8346q685P3561l0008j5996R502n2257
$$ 3410 42713 49983 110931 110548 134135 131389 132008 73662 64977 138538 108530 92534 102036 49779
6643D9779j05209m1820J43969R9882m7376q9219o9380O9320O8796j870L015J2185
$$ 49779 -55430 -97250 46719 146601 99225 10006 -59374 9946 78742 76872 79887 92072
6631I2072J849L0673K1039j33o6581j21930l3050K2731K7218J0336O0244L1868
$$ 92072 93921 124594 145633 145500 78919 -43011 -76061 -53330 -26112 -15776 44468 76336
6619G6336J0487J8056N1969N4067o7739J3282J05898J0594o6635r1183N089P6234
$$ 76336 86823 104879 156848 210915 143176 156458 262356 272950 206315 115132 120221 196455
6607A96455O588N0039Q4509k4076l6017m9133J489j574M0805M8224j9556r1220
$$ 196455 203043 253082 337591 313515 277498 228365 229854 228280 269085 317309 297753 206533
6595B06533r8019r955M3525K8903J5674P746k0417o072n6267m1688R233J0560
$$ 206533 108514 98559 142084 170987 186661 194407 173990 167918 111651 69963 79196 89756
6583H9756l5653P1671P9456l679N814m8360l7042j2655j0187J5365l158R3895
$$ 89756 54103 125774 205230 201551 207365 159005 121963 109308 99121 114486 111328 205223
6571B05223K7367m8831n6628j9239L1237N9494l0321L7604p5949n9843O4570N1631
$$ 205223 232590 183759 127131 107892 139129 198623 168302 205906 129957 70114 134684 186315
6559A86315O0859k8560j16176m1893k2613l3315N477R399o901P138K4087M2099
$$ 186315 247174 218614 102438 60545 37932 4617 10094 19493 12592 19730 43817 85916
6547H5916L8088l7129K9101k940M0476m7084l6805q059J0875P326P2870r251r3278
$$ 85916 124004 86875 115976 113036 153512 106428 69623 61564 72439 79765 152635 143384 50106
6534E0106O74K2167j1564O3475R4157M1759j49123l5038P9417J3745m7421j4644
$$ 50106 50780 72947 61383 124858 219015 260774 111651 76613 156030 169775 122354 107710
6522A07710O847n9841K922N5722J8827p056M970j3750r708p4576j5353J03975
$$ 107710 114557 54716 57638 113360 132187 125131 130101 116351 106643 32067 16714 120689
6510A20689O8080L6264k9668m9252K4516J1630J2315L4242k2090L2938O768p7766
$$ 120689 188769 225033 195365 146113 170629 182259 194574 228816 206726 239664 246432 168666
6498A68666m9663K8710m505J0721K6227k8037l9253K9891j7183l0072J2945K0958
$$ 168666 119003 147713 143208 153929 180156 152119 112866 142757 125574 95502 108447 129405
6486A29405M1202P6424L4688j9897Q933K1614O593o8060l2263n7680m9381o132
$$ 129405 170607 247031 281719 261822 270755 292369 298962 230902 198639 140959 91578 85446
6474H5446M3288M8316l3627K271J7601J5019J4060K1238p0790m5225j7381r6250
$$ 85446 128734 177050 143423 145694 163295 178314 192374 213612 142822 97597 80216 -16034
6462a6034R388N1038J2616j0788R212k5104j6659L5741O0689M1371j8466k7602
$$ -16034 -6646 44392 57008 46220 55432 30328 13669 49410 110099 151470 133004 105402
6450A05402l845j5938M2947l7506J0040Q8741m2704l1919l8463K6624j0419l808
$$ 105402 101557 85619 128566 91060 101100 189841 147137 115218 76755 103379 92960 89152
6438H9152j4869K3694l9406k0215j2361M765l9508J6819Q8903K6022Q080J0445
$$ 89152 74283 97977 58571 38356 25995 30760 -8748 8071 96974 122996 131076 141521
6426A41521N7999M1366j0861J496k4047l0104J1887O8040O5690m1473p5764J0105
$$ 141521 199520 240886 230025 231521 207474 177370 189257 257297 322987 281514 205750 215855
6414B15855l8534K7045N4537n7153j04014j2694R0568K4309p1765K8492K5066
$$ 215855 177321 204366 258903 201750 97736 85042 175610 199919 128154 156646 181712
6403A81712o0955l8872L9391L9521l6194j18572k1459K1443M2410K3508K5919
$$ 181712 120757 81885 121276 160797 124603 6031 -15428 6015 48425 71933 97852
6392I7852L6086l8623J4096J6428j3457O437J1894j0971k36k5517j6434J13283
$$ 97852 133938 95315 109411 125839 112382 118819 130713 119742 119506 93989 77555 190838
6380A90838N6001k0745p2359l5760m676l9613K7261J2498j05475P03M5577J9638
$$ 190838 246839 226094 153735 117975 113299 73686 100947 113445 7970 8673 54250 73888
6368G3888N8384o8592n4607n250J04655N2570k6271l2067m408m8742P193J5177
$$ 73888 132272 63680 9073 3823 108478 161048 134777 102710 98302 49560 56753 71930
6356G1930m8509K7375j1372j4500N1148N51L2392M2166n0293J1703O2960L9185
$$ 71930 23421 50796 39424 24924 76072 76623 109015 151181 100888 112591 175551 214736
6344B14736o869m8741k0052J0644l6726j11538J8211N5080M6007N1447J5659n0265
$$ 214736 207867 159126 139074 149718 112992 1454 19665 74745 120752 172199 187858 137593
6332A37593q2886n1641J8924R703M0474R12n4555K5630K1232P008p9121l4631
$$ 137593 54707 3066 21990 31693 72167 73079 18524 44154 65386 72394 -6727 -41358
6320d1358L1490n5395L3905J06362L5131M5285l451k0021j7733j7781L3482j4221
$$ -41358 -9868 -65263 -31358 75004 110135 155420 151969 131948 114215 96434 129916 115695
6308A15695n6310q0765o4638O3617J33054P0199l8198j4517m4674N1895K6805
$$ 115695 59385 -21380 -86018 -22401 110653 180852 142654 128137 83463 135358 162163
6297A62163L138o2654j921m2888j928J2419K2654k1720J6011m3363O000J0777
$$ 162163 165301 102647 100726 57838 55910 68329 90983 69263 85274 41911 47911 58688
6285E8688k7407K7846N4004L1086k5889p8035J1889L966k0642J7348J9933M4048
$$ 58688 31281 59127 113131 144217 118328 40293 52182 56148 35506 52854 72787 116835
6273A16835M1203k2686L677P3139k2138o3750L8608K0167n0078k0000o616n6097
$$ 116835 158038 135352 139029 212168 190030 126280 164888 185055 134977 114977 108361 52264
6261E2264j4495J4608M5292k0190j2463j2311n1204J03541L4582n5427M8145J0622
$$ 52264 37769 52377 97669 77479 65016 52705 1501 105042 139624 84197 132342 142964
6249A42964L5484q3659k1751N423J679k1535k3024M2223J8856n185L944O1153
$$ 142964 178448 94789 73038 78461 80140 58605 35581 77804 96660 91475 95419 156572
6237A56572m0053O6354J2841j21556q2886L8793Q6042O7237o112k9078l3349P5026
$$ 156572 116519 182873 195714 74158 -8728 30065 116107 183344 177232 148154 114805 189831
6225A89831j5725m0251l6014N5960p48p7331j19806j7805N7230Q4061N7887j18540
$$ 189831 174106 133855 97841 153801 153053 75722 -44084 -61889 -4659 79402 137289 18749
6213A8749m6802O4821j8947L6605L3729m2370q0088N0582k7037J1158M7893k7341
$$ 18749 -28053 36768 17821 54426 88155 45785 -34303 16279 -10758 400 48293 20952
6201B0952L230R0120J808k8945J3114K3114M409K3032m2311p8217n21p184L9696
$$ 20952 24182 114302 116110 87165 100279 123393 127802 150834 108523 30306 29785 22601 62297
6188F2297P6448K9658j029M3067j0280J29k3628r6753l1081J1494K8880J06615
$$ 62297 138745 168403 167374 210441 200161 200290 176662 79909 48828 60322 89202 195817
6176A95817o555k5670k8226p0615r3178P2239R2951M6530q0653k3531N5154k7906
$$ 195817 189262 163592 135366 64751 -28427 43812 136763 183293 102640 79109 134263 106357
6164A06357m2174P032Q732o1631L8222N8356k4914J9316k9566J3977l7564Q003
$$ 106357 64183 71215 79947 18316 56538 114894 89980 109296 79730 93707 56143 64146
6152F4146L5840K1245K6369n271m2560L4522K5507j8709j48619j0767P1852J8358
$$ 64146 99986 121231 147600 142329 99769 134291 159798 141089 -7530 -18297 53555 71913
6140G1913l170K5207L054l0989R560j01686q1085L7909L5276J446O1160L2747
$$ 71913 68743 93950 97004 66015 75575 -26111 -107196 -69287 -34011 -32565 28595 61342
6128F1342j1716l3986m5879J2523K3999J5907J31694K2917n7854n0824R621N2589
$$ 61342 49626 15640 -30239 -17716 6283 22190 153884 176801 118947 68123 77744 130333
6116A30333L3574n9442K0721M0565r9611J5076N2622J1287l7974K5729M8329j2456
$$ 130333 163907 104465 125186 165751 66140 81216 133838 145125 107151 132880 181209 168753
6104A68753K0619L0912m9467L8033o0829m0609J2443M4378k9047l9759P8546P7224
$$ 168753 189372 220284 170817 208850 148021 107412 119855 164233 135186 95427 173973 251197
6092B51197k0147l3080m8872r4847k0279n931O5270j8654m5228O5952K5165k0265
$$ 251197 231050 197970 149098 54251 33972 28041 93311 74657 29429 95381 120546 100281
6080A00281k9327O495O7880q95l8786p519N6241l093k1238m5109p4704l6692R4249
$$ 100281 70954 77449 145329 144434 105648 98129 154370 151277 130039 84930 10226 -26466 67783
6067F7783K7671J0646J4101q895k3373l563K5610l1330k2263p015m345l1016L5705
$$ 67783 95454 106100 120201 111306 87933 84370 109980 78650 56387 49372 45027 14011 49716
6054D9716j4118o7300M6507O1542M7051N1671j4067j5440j9609m1114p655O5288
$$ 49716 35598 -31702 14805 76347 123398 175069 161002 145562 125953 84839 77184 142472
6042A42472P01J8741j5456l4882p53l4307J01419O6353n2331j05606o874J3254
$$ 142472 143173 161914 146458 111576 110823 76516 177935 244288 191957 86351 79477 92731
6030I2731l0784K848K6310j4722J1855K3976m4327j2791O963n3936N048Q7791
$$ 92731 61947 64795 91105 76383 88238 112214 67887 55096 62059 8123 13171 100962
6018A00962k2412j1478p145k9045N7534J2582k6362l2889K3708p4986m378O6442
$$ 100962 78550 67072 59927 30882 88416 100998 74636 41747 65455 -9531 -13909 52533
6006E2533k3914j1433K6650M005m7505j4799j4615L2803N7330P646p555k2621
$$ 52533 28619 17186 43836 47841 336 -14463 -29078 3725 61055 68701 61146 38525
5994C8525R1763J3224p2992o5429k0110l8684q070L7622J1679K5923R8433N2883
$$ 38525 130288 143512 70520 5091 -15019 -53703 -61773 -24151 -12472 13451 111884 164767
5982A64767m347m1165m5829L750O3148o719N1126N230r4387l521j1057n0474m8488
$$ 164767 160420 119255 73426 77176 140324 133605 184731 189961 95574 92053 80996 30522 -17966
5969a7966q942M2230M7035m8683J8969p638r546J6832k2629k7073q560N6492M3310
$$ -17966 -26908 15322 62357 13674 32643 25005 15459 32291 9662 -17411 -25971 30521 73831
5956G3831l4332m1138n8734K3128L0868J98K9803k7094L2591J4918j438P2695
$$ 73831 39499 -1639 -60373 -37245 -6377 -6179 23624 -3470 29121 44039 42601 115296
5944A15296k3091p2702o0889L8525M6978l1500o6838O0274j1658r5231J2201J5913
$$ 115296 92205 19503 -41386 -2861 44117 12617 -54221 6053 -5605 -100836 -88635 -72722
5932g2722N3845L5743p73n4135j3465J20008J6222Q5278j6849q4584q6255k8622
$$ -72722 -18877 16866 16093 -38042 -51507 68501 84723 170001 153152 68568 -17687 -46309
5920d6309P2901R7962J3705L3504L9860N77j8631q4497j64171N907Q2732J5974
$$ -46309 26592 124554 138259 171763 211623 212200 193569 109072 -55099 -49192 33540 49514
5908D9514o1067j2876k0903o36K6340J0239J6367J07636K9849j08234n5669Q0464
$$ 49514 -11553 -24429 -45332 -45968 -19628 -9389 6978 114614 144463 36229 -19440 61024
5896F1024m6760j7160K2223R763l3749j6056M3594J1623M648L7490J03479m3479
$$ 61024 14264 -2896 19327 29090 -4659 -20715 22879 34502 39150 76640 180119 136640
5884A36640q0984o0438p1113K1633k594j3348L4726J2530k8946L5634N384K3817
$$ 136640 55656 -4782 -75895 -54262 -56856 -70204 -35478 -22948 -51894 -16260 -10876 12941
5872A2941O9474m250l7363k8388k2364l2258Q7767L5925j11374R020M8416J1978
$$ 12941 82415 78165 40802 12414 -9950 -42208 45559 81484 -29890 -20870 27546 39524
5860C9524l2929l994n2349m0059J9942R2632O7015R6535m3222q1716m6293l8279
$$ 39524 6595 2601 -49748 -89807 -69865 22767 89782 186317 143095 61379 15086 -23193
5848b3193Q9822L2610l1755o1059L3394J1032l0708P3158l1273j3028l7666o2661
$$ -23193 66629 99239 67484 6425 39819 50851 20143 93301 62028 49000 11334 -51327
5836e1327Q2403R4098l2566k1076R555n0949j695J7885l692j754q2026J1255j3651
$$ -51327 31076 125174 92608 71532 81087 30138 28443 46328 42636 40882 -41144 -29889 -43540
5823d3540K6799N5815Q329r953K0566p2199k1493K9343Q4942J08784q4323j00770
$$ -43540 -16741 39074 47403 37450 58016 -14183 -35676 -6333 78609 187393 103070 2300
5811B300l5543o087J9660l1980o7301O4470N0692Q5930L5995r0652j5554O571
$$ 2300 -33243 -39330 -19670 -51650 -118951 -54481 -3789 82141 118136 27484 11930 18501
5799A8501k4215L151n4401j6933J12349J1295k9229j9803N2969Q5216L872n5352
$$ 18501 -5714 -2563 -56964 -73897 38452 49747 20518 715 53684 138900 142772 87420
5787H7420m0918n849M1296J6668o4562L4158K3063n4621J579k3415L2045m7948
$$ 87420 46502 40653 81949 98617 34055 68213 91276 36655 38234 14819 46864 -1084
5775a084j1371L2094P0606J8046k8594m6605K6328q513o4308J2868m025J0508
$$ -1084 -12455 19639 90245 108291 79697 33092 59420 50907 -13401 -533 -4558 5950
5763E950J3169n230j094N0643k2939K3028j9318R639J6876K6705m227L0316k6415
$$ 5950 19119 13889 12795 63438 40499 63527 44209 53848 70724 97429 93202 123518 97103
5750I7103m0586r312r654J4247J8181o7662M8515J5307J5031p15m3261p3265J916
$$ 97103 56517 47205 37551 51798 69979 2317 50832 66139 81170 80455 37194 -36071 -34155
5737c4155J7036Q8714J2332o5310m5635L6055L8773N3772L5158k5234k1539j1744
$$ -34155 -17119 71595 83927 18617 -27018 9037 47810 101582 136740 111506 89967 78223
5725G8223J5157k1479l8667P4941l2963l8684M8307K768n123o4770J8790O4135
$$ 78223 93380 71901 33234 108175 75212 36528 84835 87603 82480 17710 36500 100635
5713A00635J3776J5312l0481k7854L0143K1536L972m914K6512l7173l5192r0780
$$ 100635 114411 129723 99242 71388 101531 123067 127039 122125 148637 111464 76272 -14508
5701a4508J6643k181o6573K3534M8123O312n4980j036P5704k0478m2345j0972
$$ -14508 2135 -46 -66619 -43085 5038 11350 -43630 -44666 31038 10560 -31785 -42757
5689d2757M6847Q2267K0215m8080j19386m0297K3338O0054q899n1579O2763L8299
$$ -42757 4090 86357 106572 58492 -60894 -101191 -77853 -17799 -26698 -78277 -15514 22785
5677B2785K8602K0853j8365o8341l036O5981J6898j8407j9033J11871P6714j4879
$$ 22785 51387 72240 53875 -14466 -17502 48479 65377 46970 27937 139808 216522 201643
5665B01643n3685J9072l8478j47614J3423L1526K6532O9192l9104q5628p5524
$$ 201643 147958 167030 128552 -19062 -5639 25887 52419 121611 82507 -3121 -78645
5654g8645m2567N8479M2707n1918r771L3502L9115O9195J6870l7002K8516L0821
$$ -78645 -121212 -62733 -20026 -71944 -81715 -48213 -9098 60097 76967 39965 68481 99302
5642I9302j9130k8987l0067k9037k2102M5282N68L1003p113j6969L0273k4798
$$ 99302 80172 51185 21118 -7919 -30021 15261 15829 46832 39719 22750 53023 28225
5630B8225j03779j7804K3420M0560L3041J6097J9184O4116L7366J5116N2560n9622
$$ 28225 -75554 -93358 -69938 -29378 3663 19760 38944 103060 140426 155542 208102 148480
5618A48480n7294m6765n510p4062p6891l1648m5648n098N7044K3177l9978L1786
$$ 148480 91186 44421 38911 -35151 -112042 -143690 -189338 -194436 -137392 -114215 -154193 -122407
5606a22407J3385M9739Q7273M507N971j5821M1223K0720o2683k1803j5773k3537
$$ -122407 -109022 -59283 27990 32497 38468 22647 63870 84590 21907 104 -15669 -39206
5594c9206K0270M4800k8536m6761N4980N2920L268l0740Q248n08L4986k206R654
$$ -39206 -18936 25864 -2672 -49433 5547 58467 61735 30995 39243 38735 73721 71515 81169
5581H1169k545k8032o1463o0430N2805Q962k9355L1555M3767O305m8096K258j5041
$$ 81169 78624 50592 -10871 -71301 -18496 -9534 -38889 -7334 36433 42738 -5358 -3100 -18141
5568a8141o0683N7157L1668o2173k0129m1715k7624N7980J00691N4624k1289P5991
$$ -18141 -78824 -21667 10001 -52172 -72301 -114016 -141640 -83660 17031 71655 50366 126357
5556A26357J4598M5041l2807J9468K8490m9869r7194r868L4144M3465m2937r9034
$$ 126357 140955 185996 153189 172657 201147 151278 54084 44216 78360 121825 78888 -20146
5544b0146l1269P0429L3189n515j296j4671N539j6107J1552K3245m1762K8118
$$ -20146 -51415 19014 52203 46688 45392 30721 36260 20153 31705 54950 13188 41306
5532D1306J9067o5640l0836O2619Q13O719q331j3850o0578r844M4191N8594p2237
$$ 41306 60373 -5267 -36103 26516 27329 34048 25717 11867 -48711 -58555 -14364 44230 -28007
5519b8007p2772L2412J8548L9457l0243l8814l9630j4084N5528J9373L2458L754
$$ -28007 -100779 -68367 -49819 -10362 -40605 -79419 -119049 -133133 -77605 -58232 -25774 -22020
5507b2020K3747N7319K3012q9603p3978l3163K9668R1978J4165n794K9726O4006
$$ -22020 1727 59046 82058 -7545 -81523 -114686 -85018 6960 21125 15331 45057 109063
5495A09063J4128n2562j8449N7670Q938q6652j3665r097N1192K7646L0125k9787
$$ 109063 123191 70629 52180 109850 118788 32136 18471 9374 60566 88212 118337 88550
5483H8550q4178p544K9883K8392j19238l412J00810J9503j508k3606J5480m5237
$$ 88550 4372 -3172 26711 55103 -64135 -67547 33263 52766 51258 27652 43132 -2105
5471b105j04707J1971J01027J6189J4325M4221J3616q3111j5672r276O521O0676
$$ -2105 -106812 -94841 6186 22375 36700 80921 94537 11426 -4246 -13522 -7001 53675
5459E3675N7804K7427P6473p74j24384q4898k289K4379M3841k9034o387l4314
$$ 53675 111479 138906 215379 214605 90221 5323 3034 27413 71254 42220 35833 1519
5447A519j04801l5912N0404m6185o318R4653N551R972N8472J08337k8043J897
$$ 1519 -103282 -139194 -88790 -134975 -141293 -46640 -41089 -31117 27355 135692 107649 109546
5435A09546L6117m9852n8326O580O760k8589k997J3586L3055m786n9177L9492
$$ 109546 145663 95811 37485 44065 50825 22236 19239 32825 65880 61094 1917 41409
5423D1409J3177r6012q7105O5445M7406L674j7093M1240K4555J6398J6548l9955
$$ 41409 54586 -41426 -128531 -63086 -15680 -12006 -29099 12141 36696 53094 69642 29687
5411B9687j54005K6453N2523L4827j3755j1521P090J678K5401k448L8632N1303
$$ 29687 -124318 -97865 -45342 -10515 -24270 -35791 -28701 -27023 -1622 -4070 34562 85865
5399H5865J5426o7371n4265o8982o22J9425K3944O9628K3427J3595L5098M6354
$$ 85865 101291 33920 -20345 -89327 -89949 -70524 -46580 23048 46475 60070 95168 141522
5387A41522l2203n0353M9232n0357m7689l1735L3414K8870J1269m1253m8707p647
$$ 141522 109319 58966 108198 57841 10152 -21583 11831 40701 51970 10717 -37990 -45637
5375d5637J0889M4212N4480p2231l8397j1876N1939J8294k649k8913k0592j2380
$$ -45637 -34748 9464 63944 -8287 -46684 -58560 -6621 11673 9024 -19889 -40481 -52861
5363e2861K7167R374K1202k4911K2263P5035n0023l902O2120q69L418p6003n9969
$$ -52861 -25694 -16320 4882 -20029 2234 77269 27246 23344 85464 84595 88013 12010 -47959
5350d7959J1268L1971n5299R564O8252J5393L1356k1754j6769k0875P355l8321
$$ -47959 -36691 -4720 -60019 -50455 17797 33190 64546 42792 26023 5148 12503 -25818
5338b5818j0388j3885j5205J9182Q4720j0065l7816l3830O683K6393J2046k7103
$$ -25818 -36206 -50091 -65296 -46114 38606 28541 -9275 -43105 -36422 -10029 2017 -25086
5326b5086M463K1070P7716K1730n9193k5078m8631n9320J8940O3878R950L6865
$$ -25086 -20623 447 78163 99893 40700 15622 -33009 -92329 -73389 -9511 439 37304
5314C7304P1837n041m7801n1152M6653P446o9551J9576M2733K1030p8246l5673
$$ 37304 109141 104100 56299 5147 51800 59246 -10305 9271 52004 73034 -5212 -40885
5302d0885j7356M3839Q4605J0273J72P0661M8571q0379o7830k6916q5077j4643
$$ -40885 -58241 -14402 70203 80476 80648 151309 199880 119501 51671 24755 -60322 -74965
5290g4965P5099P1048K9696q859j03126k9282l759k4166J5644Q3625R8562m760
$$ -74965 134 71182 100878 92019 -11107 -40389 -44148 -68314 -52670 30955 129517 124757
5278A24757m5531o3630j6429o5356n4943J9073M0958M1506j0991O3255n2589m9282
$$ 124757 79226 15596 -833 -66189 -121132 -102059 -61101 -19595 -30586 32669 -19920 -69202
5266f9202L9990o4071K2956P9200O0545N356L0231k039p0227n6837N0464K3466
$$ -69202 -29212 -93283 -70327 8873 69418 74774 105005 102966 32739 -24098 26366 49832
5254D9832p0048J77M3141O7669n5673j8082o5707m0424N811P957M0412k8391O1501
$$ 49832 -20216 -20039 23102 90771 35098 17016 -48691 -89115 -83304 -75347 -34935 -63326 -1825
5241a825O4242o5574l0426n5662N901J1018k3459L071O0636k3101J9530j3115
$$ -1825 62417 -3157 -33583 -89245 -83344 -72326 -95785 -92714 -32078 -55179 -35649 -48764
5229d8764K1225L9790p66R7099L3639r8434o3766j4242J5937N8615J3329l3088
$$ -48764 -27539 12251 11485 108584 142223 43789 -19977 -34219 -18282 40333 53662 20574
5217B0574o0970l630N5617J7546j832K2673m473m3681r4225m4885K1649o8908
$$ 20574 -40396 -44026 11591 29137 27305 49978 45505 1824 -92401 -137286 -115637 -184545
5205a84545K0804M3438L2571P3017M4242p8116k7233j8487O3481M3170o0660o1470
$$ -184545 -163741 -120303 -87732 -14715 29527 -48589 -75822 -94309 -30828 12342 -48318 -109788
5193a09788M9194K6938O717r3874k6344L9429K0948K6325P8955j3918K5644J1230
$$ -109788 -60594 -33656 -26939 -120813 -147157 -107728 -86780 -60455 18500 4582 30226 41456
5181D1456o789N2917k6782m5145J8670j6268o2874K0594L5795M1728L0488r547
$$ 41456 34667 87584 60802 15657 34327 18059 -44815 -24221 11574 53302 83790 74243
5169G4243k2438j6083k5342p0850M1033K3697M2594O8417k4511j42749L874N9440
$$ 74243 51805 35722 10380 -60470 -19437 4260 46854 115271 90760 -51989 -48115 11325
5157A1325m7864j3843m4947m3955J6684O2421J4459M2601O597j0156j06840k5174
$$ 11325 -36539 -50382 -95329 -139284 -122600 -60179 -45720 -3119 3478 -6678 -113518 -138692
$$ [...]
##END NTUPLES=NMR SPECTRUM
##END=
