##TITLE=Analysis number 328270
Compound Code mo 08192
Project Code adrs
Chemist Name butt park
##JCAMPDX= 6.0         $$ Bruker NMR JCAMP-DX V2.0
##DATA TYPE= NMR SPECTRUM
##DATA CLASS= NTUPLES
##ORIGIN= Bruker BioSpin GmbH
##OWNER= nmr
$$ XWIN-NMR		Version 3.5
$$ Fri May 18 12:14:53 2007 GMT Daylight Time (UT+1h)  MAYBRIDGE\nmr@NMR_250MHZ
##.OBSERVE FREQUENCY= 250.131544655141
##.OBSERVE NUCLEUS= ^1H
##.ACQUISITION MODE= SIMULTANEOUS (DQD)
##.ACQUISITION SCHEME= undefined
##.AVERAGES= 16
##.DIGITISER RES= 18
##SPECTROMETER/DATA SYSTEM= dpx250
##.PULSE SEQUENCE= zg30
##.SOLVENT NAME= DMSO
##.SHIFT REFERENCE= (INTERNAL, DMSO, 0, 16.5204)
##AUDIT TRAIL= $$ (NUMBER, WHEN, WHO, WHERE, WHAT)
$$ ##TITLE= Audit trail, XWIN-NMR		Version 3.5
$$ ##JCAMPDX= 5.01
$$ ##ORIGIN= Bruker BioSpin GmbH
$$ ##OWNER= nmr
$$ C:\u/data/dgb/nmr/ADRS/1240/pdata/1/auditp.txt
$$ ##AUDIT TRAIL=  $$ (NUMBER, WHEN, WHO, WHERE, WHAT)
(   1,<2007-05-18 12:14:28.59 +100>,<MAYBRIDGE\nmr>,<NMR_250MHZ>,
      <created by zg, POWCHK disabled, PULCHK disabled
       configuration hash MD5:
       76 6E 9A 78 1E 09 19 81 EC 84 63 8F B0 6A 59 2D
       data hash MD5: 64K
       59 F4 C9 17 CC B4 AA 53 22 C9 BA DF 74 28 EE 5C>)
(   2,<2007-05-18 12:14:42.50 +100>,<MAYBRIDGE\nmr>,<NMR_250MHZ>,
      <Start of raw data processing
       ef LB = 0.3 FT_mod = 6 PKNL = 1 SI = 32K 
       data hash MD5: 32K
       56 06 FF C1 0A F7 0F 30 30 97 33 32 8A 67 A5 E8>)
(   3,<2007-05-18 12:14:44.06 +100>,<MAYBRIDGE\nmr>,<NMR_250MHZ>,
      <apk 
       data hash MD5: 32K
       8E 08 FB E7 D0 10 7C 8F C4 11 3D 26 80 DB 66 35>)
(   4,<2007-05-18 12:14:44.98 +100>,<MAYBRIDGE\nmr>,<NMR_250MHZ>,
      <abs ABSG = 5 
       data hash MD5: 32K
       26 A0 3F 67 B1 4B 99 24 F7 1B D3 9B 2F 2E 21 DB>)
$$ ##END=
$$ 
$$ hash MD5
$$ CF 8A B1 10 C6 B5 A0 0B C8 A3 C4 0B F0 1C 84 0B
##$RELAX= 
##$RELAX= 
##$RELAX= 
##$RELAX= 
##$RELAX= 
##$RELAX= 
##$RELAX= 
$$ Bruker specific parameters
$$ --------------------------
##$DU= <C:\u>
##$EXPNO= 1240
##$NAME= <ADRS>
##$PROCNO= 1
##$TYPE= <nmr>
##$USER= <dgb>
##$AMP= (0..31)
100 100 100 100 100 100 100 100 100 100 100 100 100 100 100 100 100 100 
100 100 100 100 100 100 100 100 100 100 100 100 100 100 
##$AQSEQ= 0
##$AQ_mod= 3
##$AUNM= <au_zg>
##$AUTOPOS= <8 >
##$BF1= 250.13
##$BF2= 250.13
##$BF3= 250.13
##$BF4= 250.13
##$BF5= 500.13
##$BF6= 500.13
##$BF7= 500.13
##$BF8= 500.13
##$BYTORDA= 1
##$CFDGTYP= 0
##$CFRGTYP= 5
##$CHEMSTR= <none>
##$CNST= (0..31)
1 1 145 1 1 1 1 1 1 1 1 1 1 1 1 1 1 1 1 1 1 1 1 1 1 1 1 1 1 1 1 1 
##$CPDPRG= <>
##$CPDPRG1= <>
##$CPDPRG2= <>
##$CPDPRG3= <>
##$CPDPRG4= <mlev>
##$CPDPRG5= <mlev>
##$CPDPRG6= <mlev>
##$CPDPRG7= <mlev>
##$CPDPRG8= <mlev>
##$CPDPRGB= <>
##$CPDPRGT= <>
##$D= (0..31)
0 1 0 0 0 0 0 0 0 0.06 0 0 0 0 0 0 0.0002 0 0 0 0 0 0 0 0 0 0 0 0 0 0 
0 
##$DATE= 1179486867
##$DBL= (0..7)
120 120 120 120 120 120 120 120 
##$DBP= (0..7)
150 150 150 150 150 150 150 150 
##$DBP07= 0
##$DBPNAM0= <>
##$DBPNAM1= <>
##$DBPNAM2= <>
$$ [...]
##$SUBNAM7= <"">
##$SUBNAM8= <"">
##$SUBNAM9= <"">
##$SW= 20.6930455092707
##$SWIBOX= (0..15)
0 0 3 0 0 0 0 0 0 0 0 0 0 0 0 0 
##$SW_h= 5175.983436853
##$TD= 65536
##$TD0= 1
##$TE= 683.16
##$TE2= 300
##$TE3= 300
##$TEG= 300
##$TL= (0..7)
0 120 120 120 120 120 120 120 
##$TP= (0..7)
150 150 150 150 150 150 150 150 
##$TP07= 0
##$TPNAME0= <>
##$TPNAME1= <>
##$TPNAME2= <>
##$TPNAME3= <>
##$TPNAME4= <>
##$TPNAME5= <>
##$TPNAME6= <>
##$TPNAME7= <>
##$TPOAL= (0..7)
0.5 0.5 0.5 0.5 0.5 0.5 0.5 0.5 
##$TPOFFS= (0..7)
0 0 0 0 0 0 0 0 
##$TUNHIN= 0
##$TUNHOUT= 0
##$TUNXOUT= 0
##$USERA1= <user>
##$USERA2= <user>
##$USERA3= <user>
##$USERA4= <user>
##$USERA5= <user>
##$V9= 5
##$VALIST= <valist>
##$VCLIST= <CCCCCCCCCCCCCCC>
##$VD= 0
##$VDLIST= <DDDDDDDDDDDDDDD>
##$VPLIST= <PPPPPPPPPPPPPPP>
##$VTLIST= <TTTTTTTTTTTTTTT>
##$WBST= 1024
##$WBSW= 4
##$XGAIN= (0..3)
0 0 0 0 
##$XL= 0
##$YL= 0
##$YMAX_a= 342333
##$YMIN_a= -328462
##$ZGOPTNS= <>
##$ZL1= 120
##$ZL2= 120
##$ZL3= 120
##$ZL4= 120
##$ABSF1= 16.52036
##$ABSF2= -4.172812
##$ABSG= 5
##$ABSL= 3
##$ALPHA= 0
##$AQORDER= 0
##$ASSFAC= 0
##$ASSFACI= 0
##$ASSFACX= 0
##$ASSWID= 0
##$AUNMP= <proc_1d>
##$AZFE= 0.1
##$AZFW= 0.1
##$BCFW= 0
##$BC_mod= 0
##$BYTORDP= 0
##$COROFFS= 0
##$CY= 12.5
##$DATMOD= 1
##$DC= 0
##$DFILT= <>
##$DTYPP= 0
##$F1P= 14.0000005364418
##$F2P= -0.99999901652339
##$FCOR= 0.5
##$FTSIZE= 32768
##$FT_mod= 6
##$GAMMA= 0
##$GB= 0
##$INTBC= 1
##$INTSCL= 1
##$ISEN= 128
##$LB= 0.3
##$LEV0= 0
##$LPBIN= 0
##$MAXI= 10000
##$MC2= 0
##$MEAN= 0
##$ME_mod= 0
##$MI= 0
##$NCOEF= 0
##$NC_proc= -3
##$NLEV= 6
##$NOISF1= 0
##$NOISF2= 0
##$NSP= 0
##$NTH_PI= 0
##$NZP= 0
##$OFFSET= 16.52036
##$PC= 1
##$PHC0= -67.44746
##$PHC1= 4.87749
##$PH_mod= 1
##$PKNL= yes
##$PPARMOD= 0
##$PSCAL= 4
##$PSIGN= 0
##$REVERSE= no
##$SF= 250.13000040882
##$SI= 32768
##$SIGF1= 0
##$SIGF2= 0
##$SINO= 400
##$SIOLD= 32768
##$SREGLST= <1H.DMSO>
##$SSB= 0
##$STSI= 32768
##$STSR= 0
##$SW_p= 5175.98343685301
##$SYMM= 0
##$S_DEV= 0
##$TDeff= 65536
##$TDoff= 0
##$TI= <Analysis number 999999
Compound Code 99
Book Reference 9
Project Code 9>
##$TILT= no
##$TM1= 0
##$TM2= 0
##$TOPLEV= 0
##$USERP1= <user>
##$USERP2= <user>
##$USERP3= <user>
##$USERP4= <user>
##$USERP5= <user>
##$WDW= 1
##$XDIM= 32768
##$YMAX_p= 401505287
##$YMIN_p= -99719
$$ End of Bruker specific parameters
$$ ---------------------------------
##NTUPLES= NMR SPECTRUM
##VAR_NAME=  FREQUENCY,     SPECTRUM/REAL,   SPECTRUM/IMAG
##SYMBOL=    X,             R,               I
##VAR_TYPE=  INDEPENDENT,   DEPENDENT,       DEPENDENT
##VAR_FORM=  AFFN,          ASDF,            ASDF
##VAR_DIM=   32768,         32768,           32768
##UNITS=     HZ,            ARBITRARY UNITS, ARBITRARY UNITS
##FACTOR=    0.157963299565203, 1,           1
##FIRST=     4132.23789034074, 0,            0
##LAST=      -1043.74554651227, 0,           0
##MIN=       -1043.74554651227, -99719,      0
##MAX=       4132.23789034074, 401505287,    0
$$ Real data points
##PAGE= N=1
##DATA TABLE= (X++(R..R)), XYDATA
$$ [...]
18927F7607M2857L1759K8620K3473M6751P0832J19261J03286O7117M0411j1983
18916F29991o3705r3281j02388o8811o0295n1388k0071l700j9723l7546l0692
18905G8391j2195j185R821j9500l5209k1037N7400J947l6825L044L03k954K841
18892B4842M562j976j0470m259M20R308K7522l0930q568K6231P3M553l815Q006
18878D5499L1122J2545r061j9914k1616j3892P235L704k0451m985J5225J8705
18866D4116O532J7757k0493l4841j3398O593j0035j8263M020K6047J3081j1356
18854I760o199K605L5023J6774o021r422p301k6091k0588J9332o46l0685j4642
18841c8101L2328K2134j7749P905P793j8672J6368l74J9783q127j2875K3441M627
$$ plain form
18927 67607 110464 142223 170843 194316 241067 311899 431160 534446 601563 641974 629991
18916 629991 566286 473005 370617 301806 241511 190123 170052 166352 146629 109083 78391
18905 78391 66196 65011 74832 55332 20123 -914 56486 58433 21608 24652 24955 22001 24842
18892 24842 29404 27428 16958 12699 13119 22427 49949 19019 10451 36682 36755 41308 37493 45499
18878 45499 76621 89166 80105 60191 38575 24683 31918 35622 15171 10186 25411 44116
18866 44116 50648 68405 47912 13071 -327 6266 -3769 -22032 -18012 8035 21116 9760
18854 9760 3561 6166 41189 57963 51942 42520 35219 9128 -11460 7872 7226 -23459 -38101
18841 -38101 -5773 16361 -1388 6517 14310 -4362 12006 11632 31415 23288 10413 33854 38481
18828C8481n556j8692k3863k855L273j687L7505M062k9675J0476J2484o057n703
18815A2193j0910J4869J0205j5715Q699n841k021O625K8087K1341j7167j203M2
18802D9204R83L29N865j6085j8924k1434J0609J8881q332J9817N410k5556O832
18789B7599L669O648r417R770J9512L400J010J7800L4076K2268M518L0457M8062
18776B19372J0341j901j7782j1878k1436l0067j6062J8888L6681L4156L0383P559
18764B58254j3515m5111l8151k0390l7804q698J5215M42j5182l8905l5983j6983
18752C189j4947n67J6932J5779Q445K9822n607r925j4727j6115R754J0871M645
18739C7549L508O057P475l617R027N204L709J7605Q811k63m236R665J4098M5173
$$ plain form
18828 38481 32925 14233 -9630 -12485 -9212 -10899 26606 30668 993 11469 23953 17896 12193
18815 12193 1283 16152 26357 10642 19341 13500 11479 18104 46191 67532 50365 49162 49204
18802 49204 50187 50516 56381 40296 21372 -62 10547 29428 21096 40913 46323 20767 27599
18789 27599 31268 37916 28499 38269 57781 61181 62191 79991 114067 136335 140853 171310 219372
18776 219372 229713 227812 210030 198152 176716 146649 130587 149475 186156 220312 250695 258254
18764 258254 244739 199628 161477 141087 103283 94585 109800 110242 95060 56155 20172 3189
18752 3189 -11758 -12325 4607 20386 28831 58653 53046 43121 28394 12279 22033 32904 37549
18739 37549 41057 47114 54589 50972 59999 65203 68912 86517 95328 95065 90829 100494 114592 159765
18725A59765N490L6538M330Q633J6960j467m5427m6392j2452K3057L639K1114
18713A73788N916j7660j0737k6273l4847M935k0447j5325j6330l0971R996J5857
18701C7902p374M183j2191j8198J3225O363J7185k7010M905J5414J53l9007j3789
18688a8239K1181J0250n878r531K7574L2285l913M148O973j2520k8573k962p124
18675A3671k0757k5305p09K6393J1462J2446j346j944k427K873j7079j991P274
18662B561N034R053R134n848l5768N340J130M251J4152r211k1180k519O924J0537
18648f410L4031k073j1256R243k2384j3253m268R951L619L164J0957j9281p254
18635a5214p377R681J8014J6785P587k5570l564L584k354O598q486J7801k5710
$$ plain form
18725 159765 165255 201793 206123 214756 231716 230249 184822 138430 125978 149035 152674 173788
18713 173788 179704 162044 151307 125034 90187 95122 74675 59350 43020 12049 22045 37902
18701 37902 30528 34711 22520 4322 17547 23910 41095 14085 18990 34404 34557 -4450 -18239
18688 -18239 2942 13192 7314 -2217 25357 57642 53729 57877 64850 52330 23757 20795 13671
18675 13671 -7086 -32391 -33100 -6707 4755 17201 15855 13911 11484 14357 -2722 -4713 2561
18662 2561 7595 16648 25782 19934 -15834 -10494 -9364 -5113 9039 -172 -21352 -23871 -16947 -6410
18648 -6410 27621 25548 14292 23535 1151 -12102 -16370 -6419 -2800 364 11321 -7960 -15214
18635 -15214 -22591 -12910 5104 21889 29476 3906 342 3926 1572 8170 -316 17485 -8225
18622h225l836q960m216k518j2730K3563K5830m296J7172j8322j0895j4959j2288
18609c4680M262k618J5862K2178l506J9266l357p885Q455j1512l424K4128j1494
18596A5675j86J5793j8114j1684j0684j4826j6414m246N560K4556J4873j7786
18584a7483j113J3179p102l8533r630J6652l067K843K0382K7841J0j8546j2566
18571b7133K832K497O60J1594n862j9890l5357n64M46J0538J2768M398L715j1293
18557e0651r335j4718J9387L3916J8563J0694P028j5493K820O353n904m1940j2106
18544e1386J2470J1909R386j4069j6121L3935J2431J1938k9064l7821k4828J0122
18532g1098K1952J5960K3231K0418Q584m573r130j0536k0119J3680j0612j7247
$$ plain form
18622 -8225 -12061 -21021 -25237 -27755 -40485 -16922 8908 4612 21784 3462 -7433 -22392 -34680
18609 -34680 -30418 -33036 -17174 5004 1498 20764 17407 9522 17977 6465 3041 27169 15675
18596 15675 15489 31282 13168 1484 -9200 -24026 -40440 -44686 -39126 -14570 303 -17483
18584 -17483 -18596 -5417 -12519 -51052 -60682 -44030 -47097 -44254 -23872 3969 3979 -14567 -27133
18571 -27133 -24301 -21804 -21144 -9550 -15412 -35302 -70659 -71223 -70777 -60239 -47471 -43073 -39358 -50651
18557 -50651 -59986 -74704 -55317 -21401 -2838 7856 14884 -609 2211 8564 2660 -39280 -51386
18544 -51386 -38916 -27007 -17621 -31690 -47811 -13876 -1445 10493 -18571 -56392 -81220 -71098
18532 -71098 -49146 -33186 -9955 10463 19047 14474 5344 -5192 -25311 -11631 -22243 -39490
18520c9490o737k2511o070K5035R406P48J7679N020k1563J3416Q95J2987J0441
18507g44k3235J2853J0694J3515k5880r878j6823K2492Q042r354J2873j0190J2073
18494c562j847q481l130K102r13j3180p43J3012L4630P482q376P377l584j5960
18480D827m032k5973r439l918q038j1566K262K2860R371j181P050J0091J7827
18467A0141j1451k7850l431K3911K7142K1733N21j9390l0071n423m010j7661l199
18454c9038n950P394O427N049J3215M241j9533L725R211Q704J1220j44j0663r042
18440a5184L895L7123J1795o621k0681j7215N685J4895l383j8652k8170J911l
18427c4605J6563J635Q37J4563M702J192j7420Q008J1149J6286k5748K2914j3602
$$ plain form
18520 -39490 -46227 -68738 -74808 -49773 -40367 -39619 -21940 -16920 -38483 -25067 -24172 -11185 -744
18507 -744 -23979 -11126 -432 13083 -12797 -22675 -39498 -17006 -8964 -18318 -5445 -15635 -3562
18494 -3562 -5409 -13890 -17020 -14918 -15831 -29011 -29754 -16742 17888 25370 16994 24371 20787 4827
18480 4827 795 -25178 -34617 -38535 -46573 -58139 -55877 -33017 -23646 -24827 -17777 -7686 10141
18467 10141 -1310 -29160 -32591 -8680 18462 40195 40716 21326 -8745 -14168 -18178 -35839 -39038
18454 -39038 -44988 -37594 -31167 -26118 -12903 -8662 -28195 -24470 -15259 -6555 4665 4521 -6142 -15184
18440 -15184 -11289 25834 37629 31008 10327 -6888 -1203 13692 10309 -8343 -36513 -34602 -34605
18427 -34605 -18042 -16407 -15570 -1007 3695 4887 -12533 -4525 6624 22910 -2838 20076 6474
18414F474m0887J0521K0222j824j085J8698J6372J1478k3194j0076J6755N648
18402B9102K3n00L175N277o784k9011r225N458j9841o71K6565J1189q714R8k6345
18387b0204j0721L2865M903r62k674k840l748j1889L622J491J4874M561K708k786
18373I200j4965o44K7366P257m985M09O387j7153j7937n767k7624k8243J3723
18360e2976J9536j3459N847J8624K1396K047j9969l511J911q502j9066J1693J5182
18347b1247j7297J3100M167L3206J4098k041l230Q575j8267k2069j3953K845Q131
18334a3982L0151J790l0966J7023J9889M18k1845l464J800K6963K597l515j7895
18321H964j2482J3974j838N436J7954J100j9032j1609k3235N134K375k5774p191
$$ plain form
18414 6474 -34413 -23892 -3670 -5494 -6579 12119 28491 39969 16775 6699 23454 29102
18402 29102 29125 28625 31800 37077 30293 1282 -7943 -2485 -22326 -22997 3568 14757 6043 6141 -20204
18387 -20204 -30925 1940 6843 5881 3207 367 -3381 -15270 -11648 -10157 4717 9278 11986 9200
18373 9200 -5765 -6409 20957 28214 23229 23638 30025 12872 -5065 -10832 -38456 -66699 -52976
18360 -52976 -33440 -46899 -41052 -22428 -1032 1015 -18954 -22465 -20554 -29056 -48122 -36429 -21247
18347 -21247 -38544 -25444 -21277 11929 26027 23986 20756 29331 11064 -11005 -24958 -22113 -13982
18334 -13982 16169 17959 -13007 4016 23905 24323 2478 -986 814 27777 30374 26859 8964
18321 8964 -3518 10456 8618 14054 32008 33108 14076 2467 -20768 -15634 -13259 -39033 -46224
18308d6224K612L981R833j8599k5228L2777J3362J1032j0412R562J3782J3625
18296A0103O95j4235j3889J9405j3008k3462l674o383K3891P812j0012r213L0217
18283a753l842m435L873J8455j0068l913K4376J7409k626j1776j813O05j6327
18270H165j0591Q385K0996K1750j3875j7368J2569k7085j5412J9728j7511K682
18258g567O587r484K3119n364j4347J9o49m408p016q092K5480J6470j2785J1943
18244A3906l6671k2804P333L786j3668p896K3536K763l540k979p13q976k571O321
18230d2173R19j3783L449M446j1955K0817J5967N755J9896P64p872R897m361k0139
18216a8373j1874Q918m272K1533l398Q108K722j9364j8436J5777J604J0840J9597
$$ plain form
18308 -46224 -43612 -39631 -29798 -48397 -73625 -40848 -27486 -16454 -26866 -17304 -3522 10103
18296 10103 10798 -3437 -17326 2079 -10929 -34391 -38065 -44448 -20557 -12745 -22757 -31970 -1753
18283 -1753 -5595 -10030 -6157 12298 2230 -1683 22693 40102 37476 25700 23887 24492 8165
18270 8165 -2426 5959 26955 48705 34830 17462 30031 2946 -12466 7262 -10249 -7567
18258 -7567 -980 -10464 12655 7291 -7056 -7037 -7686 -12094 -19110 -27202 -1722 14748 1963 13906
18244 13906 -22765 -45569 -38236 -34450 -48118 -56014 -32478 -29715 -33255 -36234 -36947 -45923 -48494 -42173
18230 -42173 -41254 -55037 -51588 -47142 -59097 -38280 -22313 -16558 3338 4102 -3770 6127 1766 -18373
18216 -18373 -30247 -21329 -25601 -4068 -7466 642 3364 -16000 -34436 -18659 -17055 -6215 13382
18203A3382o264j4224j878J4778j7850k1821P293L454j3043j2088R026Q930k524
18190c2829O191P007K15O563o773l366j013j8051J0570K4322J5056L309j0051
18177A150R425j0928k3536l688o35J3490O495q931m621P856N879J1496N763J2927
18163B2142L545n627o864n9J0467j6466j2935l422Q901J7896K2090o234o760p471
18149A9203r116K8716k1725j8589J0164M70j374J921j4003l843L292Q863q877
18136d898l004l340j6219j8988J9997L1556J2453l0254k4958K2416L2038K0549
18124C7348N527n983j3590l5086q216L1651j5868j5826J0693Q110r832J541K5806
18111A6275L1947j9246m651j1975K1079K2423k0110o250Q911J2000O122J182m452
$$ plain form
18203 13382 7118 -7106 -8984 5794 -12056 -33877 -26584 -23130 -36173 -48261 -39235 -30305 -32829
18190 -32829 -26638 -19631 -19416 -12853 -19626 -22992 -24005 -42056 -31486 -7164 7892 11201 1150
18177 1150 10575 -353 -23889 -27577 -28212 -14722 -8227 -17158 -21779 -13923 -8044 3452 9215 22142
18163 22142 25687 20060 13196 13137 23604 7138 -5797 -9219 -318 17578 39668 33434 26674 19203
18149 19203 10087 38803 17078 -1511 8653 9123 7749 9670 -4333 -8176 -4884 3979 -4898
18136 -4898 -7902 -11242 -27461 -46449 -26452 5104 17557 -12697 -37655 -15239 16799 37348
18124 37348 42875 36892 23302 -11784 -20000 11651 -4217 -20043 -9350 -1240 -11072 -9531 16275
18111 16275 48222 28976 24325 12350 33429 55852 35742 29492 38403 50403 56525 57707 53255
18098E3255j7326M224k0390J0556P924J2665J0878j6263k8918j8375O558k710
18086B078j3879Q410J0014q303k162l2357k660n329M359k695L2552J0390J8162
18073A8580J6276j8232m564l3672k2836K246K621K0422m567j2685J8141k0693
18061c8963j0913R025O343J9864q068N655J8717J949J578K4445k5400j6709k0634
18048c3111O222K0147J8551J5538K3101M579l4510k5192k5067L1529L825k6387
18036b0775n56j1503j0256L441K5616K0306O749o19O891l666j6549j4696m717
18023b0334K1193m012r322r862k0934j6087K3929o458M186L0404R125N328j0886
18010c730O460p813l0862j9597K4931L3444J0058n667K5663j2587l0018q796J710
$$ plain form
18098 53255 35929 40153 19763 30319 38243 50908 61786 45523 16605 -1770 4788 2078
18086 2078 -11801 -3391 6623 -1680 -3842 -36199 -38859 -44188 -39829 -42524 -9972 418 18580
18073 18580 34856 16624 12060 -21612 -44448 -42202 -39581 -19159 -23726 -36411 -18270 -38963
18061 -38963 -49876 -40851 -34508 -14644 -22712 -17057 1660 3609 5187 29632 4232 -12477 -33111
18048 -33111 -26889 -6742 11809 27347 50448 55027 20517 -4675 -29742 1787 5612 -20775
18036 -20775 -21331 -32834 -43090 -39649 -14033 6273 13022 12403 19294 15628 -921 -15617 -20334
18023 -20334 859 -3153 -12475 -22337 -43271 -59358 -35429 -41887 -37701 -7297 1828 7156 -3730
18010 -3730 2730 -5083 -35945 -55542 -30611 2833 12891 7224 32887 20300 -9718 -18514 -16804
17997a6804j1700K1345K6503N534k0801l5982m478J3929j2705k914n181J5261
17985b7993N857J264p022l922J8418q903j3075J3737k2586j3339J4524R427j1345
17972d4958M279J0863J023L7977J980q35J7557p309L307R041q295j3735J6117
17959B7012N999n246k6391l7250j682p722J188j179l750K2770J3269P711j7731
17946b3002k86J4388j0073J5999n854k7376k0224L8524L5531k1285k4375L0746
17934B713J0304l3881K0037J8554j2282j2246P749M982m788q01J0645j5888j9858
17921b4760J2849j3225J4252p458Q542l031K167j5606j1154J3623J4631o614k5890
17908d1674J0114J5697K2365p451j7270k7432j6113K2244L1104J2662K6783o621
$$ plain form
17997 -16804 -28504 -7159 19344 24878 4077 -31905 -36383 -22454 -35159 -38073 -43254 -27993
17985 -27993 -22136 -20872 -27894 -31816 -13398 -22301 -35376 -21639 -44225 -57564 -43040 -33613 -44958
17972 -44958 -40679 -29816 -28793 9184 11164 10329 27886 20577 23884 32925 24630 10895 27012
17959 27012 33011 27765 1374 -35876 -37558 -45280 -44092 -45271 -49021 -26251 -12982 -5271 -23002
17946 -23002 -23288 -8900 -18973 -2974 -8828 -36204 -56428 -17904 17627 -3658 -28033 2713
17934 2713 13017 -20864 -827 17727 5445 -6801 948 5930 1142 341 10986 -4902 -24760
17921 -24760 -11911 -25136 -10884 -18342 -9800 -12831 -10664 -26270 -37424 -23801 -9170 -15784 -41674
17908 -41674 -31560 -15863 6502 -949 -18219 -45651 -61764 -39520 -8416 4246 31029 24408
17896B4408k5595l7402L134R126o109l574K2636j1418k4969J4984K4265N431j2509
17883a7592m038Q667K3958N589j5655J2761N261k4626k1805L0435L859L702J3857
17870B4373K835q377j9520L917j125k8141K917K4231J8247K3057k2418k4325q319
17857a2648O724J9282r836l6718k9099J1022K1337O609J784j2710k0652J0726
17845d4179J1614K2935J1123J826K4087q2r162k0448l778J1449K0019j0577n162
17832I665M799o256j8493J0446k201J0330j9457j4041J2055K2578J4453J0278
17820C4156K1709q017k3836k2753p86o931J2211M2343p780m1102r402J9333j039
17807H106o903J817r774K45J7806l397J401J79l0060k8332J9599K624r044J5458
$$ plain form
17896 24408 -1187 -38589 -35455 -26329 -32438 -36012 -13376 -24794 -49763 -34779 -10514 -5083 -17592
17883 -17592 -21630 -12963 10995 16584 929 13690 18951 -5675 -27480 2955 6814 10516 24373
17870 24373 27208 18831 -689 3228 2103 -26038 -23121 1110 19357 42414 19996 -4329 -12648
17857 -12648 -5924 13358 3522 -33196 -62295 -51273 -29936 -23327 -21543 -34253 -54905 -44179
17845 -44179 -32565 -9630 1493 3319 27406 27324 18162 -2286 -6064 5385 25404 14827 9665
17832 9665 14464 8208 -10285 161 -2040 8290 -11167 -25208 -13153 9425 23878 34156
17820 34156 55865 47848 24012 1259 473 -6458 5753 48096 40316 -786 -10188 9145 8106
17807 8106 1203 3020 -6754 -6509 11297 7900 9301 9480 -20580 -48912 -29313 -26689 -35733 -20275
17793b0275K2124j5371r896J4456M146j6845J6376M1240K4205p230j7987K7740
17781F2683J4351r48l5546k6957j7682L4611K6653j0392k8596j5925L028j7501
17769a2221j2134J1271J0288M831L345j1818j16q784j0056O185J8810K654k168
17756H7j0725L362L4275J976j4945k8578m986l332O948Q328K0818l815r626l774
17742c987L89O896J7716r419l492L0350r205k8843m053J3046K4067j506P643r58
17728C8644q963N723J5024m855j3687Q676R516k6157j3642j6692J2014o894k6866
17715b8159J2847J2611j6771J8011L0048k2303m104K4048J5570q80j6439j4285
17703A0194j5716j3055o653R877q379j3108M2448J6692k5566p868q933n101k1596
$$ plain form
17793 -20275 1849 -13522 -23418 -8962 -4816 -21661 -5285 35955 60160 52930 34943 62683
17781 62683 77034 76086 40540 13583 -4099 30512 57165 46773 18177 2252 5280 -12221
17769 -12221 -24355 -13084 -2796 2035 5380 -6438 -6554 -15338 -25394 -19209 -399 2255 87
17756 87 -10638 -7276 26999 28975 14030 -14548 -19534 -22866 -15918 -7590 13228 9413 -213 -3987
17742 -3987 -3598 3298 21014 11595 8103 38453 29248 405 -3648 9398 33465 31959 39602 38644
17728 38644 29681 35404 50428 45573 31886 40562 50078 23921 10279 -6413 5601 -1293 -28159
17715 -28159 -15312 -2701 -19472 -1461 28587 6284 2180 26228 41798 40918 24479 10194
17703 10194 -5522 -18577 -25230 -15353 -23732 -36840 5608 22300 -3266 -11134 -20067 -25168 -46764
17690d6764M054N877K8215j75l789M044q247r993l557J7579j6937j9303K8452
17677b0544N096K1664k10k0131k2197L3340o983M167R497j5276m208K3192J5964
17664B3371j8708j8647J1786m1076M806K8970o619k335N608j3773J0156J741M4858
17651C0138n14n588k8371l1104r93K8573L6628J6988k4111k9567j6798o844j3895
17638d5458J7990J4440L9198J9259O268p591j4799j0265l5539j3143J0918L3557
17626A4835l906J2147J3011k8413j0149m512q385j1220j7375K6827J0320o714
17614a3534k062P571N187M013q371r126n957k267K2733Q313j611n300K379p367
17600e399P217J5972q741q611M346J8341K8169J2102J0259j4699j8071l5076k7546
$$ plain form
17690 -46764 -42710 -36833 -8618 -8793 -12582 -8538 -16785 -26778 -30335 -12756 -29693 -48996 -20544
17677 -20544 -15448 6216 6006 -14125 -36322 -2982 -9965 -5798 3699 -11577 -15785 7407 23371
17664 23371 4663 -13984 -2198 -43274 -38468 -9498 -16117 -18452 -12844 -26617 -16461 -14720 30138
17651 30138 29624 24036 -4335 -35439 -36432 -7859 28769 45757 21646 -7921 -24719 -31563 -45458
17638 -45458 -27468 -13028 26170 45429 51697 44106 29307 19042 -16497 -29640 -18722 14835
17626 14835 10929 23076 36087 7674 -2475 -6987 -15372 -26592 -43967 -17140 -6820 -13534
17614 -13534 -15596 -8025 -2838 1175 -7196 -16322 -22279 -24546 -1813 6500 4889 -411 1968 -5399
17600 -5399 1818 17790 9049 438 4784 23125 51294 63396 73655 58956 40885 5809 -21737
17587b1737j2805j4563m762J9816j669L4230J3794k1155j0610l620j4395n453
17575d2929k082R986p83J5071J0910R332j8943p306O618j519Q076J3393K4979
17562B4803n102p679n281Q594J0594o984j0726n520K7601j4869n066N873j177
17549A5061j2272J0804P022J0788j4133K495R13J4102k2656J1051J2681j1747
17537B4109j997l899r23l067K4466J4577m477l4846l9389k9385J5540L2072k7350
17524c4569m114L4654r532j0527R306K2872K8435J1340j7867P819J6705K2275
17512G6797q939k6094k1089R568J4295j3829j1070J4791K0930J647j2420j2440
17500C2147m240m028J7925j992j7077k9657k9832R011K4388J7184k689o293R12
$$ plain form
17587 -21737 -34542 -49105 -53867 -34051 -35720 -1490 12304 -8851 -19461 -23081 -37476 -42929
17575 -42929 -45011 -35025 -35808 -20737 -9827 -495 -19438 -26744 -20126 -21645 -13569 -176 24803
17562 24803 19701 12022 6741 15335 25929 18945 8219 2699 30300 15431 10365 16238 15061
17549 15061 2789 13593 20615 31403 17270 19765 20678 34780 12124 23175 35856 24109
17537 24109 22112 18213 17290 14223 38689 53266 48789 13943 -25446 -54831 -39291 -7219 -34569
17524 -34569 -38683 -4029 -13561 -24088 -14782 8090 36525 47865 29998 37817 54522 76797
17512 76797 67858 41764 20675 30243 44538 30709 19639 34430 55360 57007 44587 32147
17500 32147 27907 23879 41804 39812 22735 -6922 -36754 -27743 -3355 13829 11140 4847 5759
17487E759l768Q628M55Q281J2643M669q25R811j5979k1934K0813M236R668l8467
17473C990j301K7156k064j902o366k0440j6274j449J2962K3164R066J7772R612
17460E3926j7920k8572k3519P906J2772J7557N449j3662k3315j3889L4197J8100
17448B9030j1858j6605j7815j2021l657J8617k246L717K198P644j1140m980k886
17435b2002J2198j4976M625k2720R864L3180L0000l506M677P571m417j6795R629
17422B7328j7952m4318k2487P274J3698P773L2368k8329k5338O796J0424L1149
17410a614j3125l126Q539j15J2486m138j8570J0327n932K644J1583n62j8611j5699
17396c5913O216Q321j54j3810P911K1762L856j5891R757Q912k1126j2394Q616
$$ plain form
17487 5759 1991 10619 11074 19355 31998 36667 35842 45653 29674 7740 28553 32789 42457 3990
17473 3990 2689 29845 27781 25879 19513 -927 -17201 -18650 -5688 17476 26542 44314 53926
17460 53926 36006 7434 -16085 -8179 4593 22150 27599 13937 -9378 -23267 10930 29030
17448 29030 17172 567 -17248 -29269 -32926 -14309 -16555 -12838 -10640 -2996 -14136 -19116 -22002
17435 -22002 -9804 -24780 -20155 -42875 -33011 169 30169 26663 31340 38911 34494 17699 27328
17422 27328 9376 -34942 -57429 -50155 -36457 -28684 3684 -24645 -49983 -43187 -32763 -1614
17410 -1614 -14739 -17865 -9326 -9441 3045 -1093 -19663 -9336 -15268 -12624 -1041 -1603 -20214 -35913
17396 -35913 -29697 -21376 -21530 -35340 -27429 -5667 -1811 -17702 -7945 967 -20159 -32553 -23937
17383b3937q509M215Q842r427L75K380r766J6386L582j2465K2984K1124j3024
17370B760o392j100q705m048J0683J7300Q852m113K60O091J5171L235l7045l2802
17356b9853j8122O745J2830K75J5111p597l0843k659J4956M3404O584l4563K640
17343b1092p608k5116M241J3460K534k319o266R257l60k933J1465J3504k922K161
17329a1994K5005n818j6344Q864j8299P129K9000j9035Q71Q037j3592p320J3730
17316B34K2698j8562k5943k6830J8018j0095K1409M0591Q839j2500j1299l010
17304C550l41o8P379k7J1061M0206J3886j8616k3693j2176n889r992j0729R147
17290C698Q665K0875J6805j7114p058k60k982o869j5724j1313j1570J3718Q894
$$ plain form
17383 -23937 -32446 -28231 -19389 -28816 -28441 -26061 -35827 -19441 -15859 -28324 -5340 15784 2760
17370 2760 -3632 -4732 -13437 -17485 -6802 10498 19350 15237 15497 21588 36759 39994 2949 -29853
17356 -29853 -47975 -41230 -28400 -28125 -13014 -20611 -51454 -54113 -39157 4247 10831 -23732 -21092
17343 -21092 -28700 -53816 -49575 -36115 -33581 -35900 -42166 -32909 -33269 -36202 -24737 -11233 -14155 -11994
17329 -11994 13011 7193 -9151 -287 -18586 -11457 17543 -1492 -621 7416 -6176 -13496 234
17316 234 22932 4370 -21573 -48403 -30385 -40480 -19071 21520 30359 17859 6560 3550
17304 3550 3209 3141 10520 10493 21554 61760 75646 57030 33337 21161 15272 5280 -5449 3698
17290 3698 12363 33238 50043 32929 25871 25611 22629 15760 36 -11277 -22847 -9129 -235
17277b35K7785p411j3902j1432J0792r599k8041j0224P885L2245R456Q308J9985
17264C5612j6404k6989J0503Q953J2290M873j4493N262k5897m556L047n922j6900
17251c0621J5674J4175r19l303J322J4974j4252r308j1493J9918R32K594j0711
17238a1018n340N750l183n781j509J1057J2745n28k831J5462K9032j8047n098
17225B0711N033n958m248k0945R637R083P924j9953l636J0947M710M882J9881
17212C8068j3201j7130k387o618j9644r948j113L1588l122J517K0896l764j4692
17199D50n401n203M792O326N651N397k9301Q349n381j487K315r838m416Q721J4689
17184d337o999J0901J1416K95l8801r578J463P880m266K9847K4761j2518p696
$$ plain form
17277 -235 27550 20139 6237 -5195 5597 -4002 -32043 -42267 -34382 -2137 7319 15627 35612
17264 35612 19208 -7781 2722 11675 23965 28838 14345 19607 -6290 -10846 -7799 -13721 -30621
17251 -30621 -14947 -772 -1691 -4994 -3672 11302 -2950 -12258 -23751 -3833 -2901 -307 -11018
17238 -11018 -16358 -10608 -13791 -19572 -21081 -10024 2721 2193 -638 14824 43856 25809 20711
17225 20711 25744 19786 15538 -5407 4230 13313 21237 1284 -2352 8595 13305 18187 38068
17212 38068 24867 7737 5350 -1268 -20912 -30860 -31973 -385 -3507 -1990 18906 15142 450
17199 450 -4951 -10154 -5362 964 6615 12012 -17289 -8940 -14321 -15808 -13493 -23331 -27747 -19026 -4337
17184 -4337 -11336 -435 10981 11276 -27525 -37103 -35640 -27760 -32026 -2179 22582 10064 2368
17171B368m3172m570K2393J6741J6753j5547j6038l4406m600K0637J3219k5276
17159e1498K2595J9053k8982n739J527K7612M2391P597j1136l1780n07J9544q481
17146B196k256j3159j9319J3648J3142j8046K2649M017n274k599J871K0389M586
17133B1845O040j5618j4089j5325k1636j565p947J2226l656q179J5154J6650j1539
17120b7639l558P347Q197o492n874j9437K0774J8479k5289j405J0848K1186R615
17107F752m768q692K562j6983P864J1171L5208k6579l4777k5377k08L6392K9674
17094A2239J8872M105j7301l9281l328k5138j9730K3677M2601O31j4386j4890
17082c1929Q551N047N32J2112J4572Q583n360j9417n318J2642R525Q267J208P934
$$ plain form
17171 2368 -40804 -45374 -22981 -6240 10513 -5034 -21072 -55478 -60078 -39441 -26222 -51498
17159 -51498 -28903 -9850 -38832 -44571 -43044 -15432 26959 34556 23420 -8360 -8867 10677 2196
17146 2196 -60 -13219 -32538 -18890 -5748 -23794 -1145 2872 -2402 -5001 -3130 17259 21845
17133 21845 27885 12267 -1822 -17147 -38783 -40348 -48295 -36069 -39725 -47904 -32750 -16100 -27639
17120 -27639 -31197 -23850 -15653 -22145 -28019 -47456 -26682 -8203 -33492 -34897 -24049 -2863 6752
17107 6752 1984 -6708 -4146 -21129 -13265 -2094 33114 6535 -28242 -53619 -53827 -17435 12239
17094 12239 31111 35216 17915 -21366 -24694 -49832 -69562 -45885 -3284 -2653 -17039 -31929
17082 -31929 -23378 -18331 -17799 -5687 8885 17468 12108 -7309 -12627 15 9540 17807 19015 26949
17068B6949k026j7377K5733J3905K678k1856k7933l536j541J3228J2006N01k7343
17055f612j9934k2202k0619L452K9812L859m66L6002Q160J1300j0282n01J6392
17042B8361O131j7785l0994l712q703M23p028M610n328j2528K8138j205j1269
17029c0889Q41J9978J4480L36L049R7j4195j1053p553M095r047O017J5990q169
17015a6023j054N904m503r199j2429O846m335L990J8849K641k7017J1447J2081
17002a2802J4623L3930J0425l4981r975j407j9828Q48K3561M0753N10n4441j5586
16989b4370K6514J7419j7422l5014k884K4509O748j0447K638q301j9646l612o760
16976e0628J4809J5974j7296J8574m074J1830R198O947j7168k455l211l14j085
$$ plain form
17068 26949 24923 7546 33279 47184 49862 28006 73 -3463 -5004 8224 20230 20731 -6612
17055 -6612 -26546 -48748 -69367 -65915 -36103 -32244 -32710 3292 11452 22752 12470 11969 28361
17042 28361 34492 16707 -14287 -17999 -26702 -26279 -33307 -28697 -34025 -46553 -18415 -19620 -30889
17029 -30889 -30048 -10070 4410 4746 7795 7892 -6303 -17356 -24909 -20814 -29861 -23844 -7854 -16023
17015 -16023 -17077 -11173 -15676 -24875 -37304 -30458 -34793 -30803 -11954 -9313 -36330 -24883 -12802
17002 -12802 1821 35751 46176 11195 1220 -187 -20015 -19167 4394 45147 45657 -8784 -24370
16989 -24370 2144 19563 2141 -32873 -35757 -11248 -4500 -14947 -12309 -20610 -40256 -43868 -50628
16976 -50628 -35819 -19845 -37141 -18567 -22641 -10811 -1613 5334 -11834 -14289 -17500 -17814 -18899
16963a8899L563j5658L775K8950L2852J41k2292l0381k745J0046q271P377J3667
16950B125K0661J0089k4141k4047l990j99J8040j2949m73J3817J6909K923m658
16937A4107r862k8614L629L3812M576o787P124l748j7725k1298l19J1608q067
16924b1564L1827J4796j2505k3515p434m707l080K2316O114r004m7518m26J8243
16911c6457R963j6578N769K0264K2315m779J4217J608l024m28m016q315k9943
16898b9404p180K0867J3684k5710p887K9687j0468j2365j368P84L016j8746q41
16885d5931o079K0084L2813j6403k3723l084j4319M944L0382K5413R149p064k1174
16872a4992j6978K4115J1109j7088j0689J9375K9568k2465k2139j1475R975p474
$$ plain form
16963 -18899 -15336 -30994 -27219 1731 34583 34724 12432 -17949 -20694 -10648 -18919 -11542 2125
16950 2125 22786 32875 8734 -15313 -19303 -19502 -1462 -14411 -14884 -1067 15842 18765 14107
16937 14107 4245 -24369 -20740 13072 17648 10861 17985 14237 -3488 -24786 -25105 -13497 -21564
16924 -21564 10263 25059 12554 -10961 -18395 -23102 -26182 -3866 2248 -6756 -54274 -54700 -36457
16911 -36457 -26494 -43072 -37303 -17039 5276 497 14714 16322 13298 12870 8854 539 -29404
16898 -29404 -36584 -15717 -2033 -27743 -35630 -5943 -16411 -28776 -30144 -29360 -26344 -45090 -45931
16885 -45931 -52010 -31926 887 -15516 -39239 -42323 -56642 -51698 -21316 4097 13246 6182 -14992
16872 -14992 -31970 -7855 3254 -13834 -24523 -5148 24420 1955 -20184 -31659 -21684 -29158
16860b9158R28J838J9909n384M538K0311j1113j3004Q074J1224j4399j4336J989
16847a8583p227j4803o615J4735K0616M9925R24k6905q789o182q523J3515j3750
16834a1662k9427K7199K7960m759j8563J4154Q057O560k4668m177j6139J5026
16822a0439J3268j4993L643P363l461l4292j9462J9565K3973O910N95J5496L2880
16809D1046k2417p578O953j9668o012Q792m817j9988n403K108N657n737k7729
16796e4793N726J9056M6671J7177k6117O239R795r784O151r056k2581l1651j050
16783d4217O313J2000P44O162j5129N343K1421J5219l3405N658N517L996r733
16770b0111J5060L8326j4250k5688j861J2104Q839P588K9418k1280l7074J7724
$$ plain form
16860 -29158 -28230 -26392 -6483 -11867 -7329 12982 1869 -11135 -3061 8163 -6236 -20572 -18583
16847 -18583 -25810 -40613 -47228 -32493 -11877 38048 38972 12067 3278 -2904 -11427 2088 -11662
16834 -11662 -41089 -13890 14070 9311 -9252 4902 12959 19519 -5149 -9326 -25465 -10439
16822 -10439 2829 -12164 -8521 -1158 -4619 -38911 -58373 -38808 -14835 -7925 -7330 8166 41046
16809 41046 18629 11051 18004 -1664 -7676 1116 -3701 -23689 -29092 -26984 -21327 -27064 -54793
16796 -54793 -49067 -30011 16660 33837 7720 13959 23754 13970 20121 11065 -11516 -43167 -44217
16783 -44217 -37904 -25904 -25160 -18998 -34127 -28784 -7363 7856 -25549 -19891 -14374 -10378 -20111
16770 -20111 -5051 33275 19025 -6663 -8524 3580 12419 20007 49425 28145 -8929 8795
16758H795J2559k138N790j1301k3389J8247K1549j566k8037L359o151j7372m224
16745b3879K8570j747R073L4243M601k7801j8950J5059j4416j6570Q266J6973
16733A3422q292q23K8492K50p912J6917J2210j5854k0788M226j8750l2084J0504
16720a8482m443J3905j9661j1767p712K0136J8447Q572M038k5401j6796R53m1138
16707g9349m672L2286K1174k0797J8917R368J7909L234m998R145L360O103j873
16694I807j4498j0151M157J7503J3663J0271J0133l787J6321L491j1501K8489
16682G3898l0399l0881r513J6426R117N608n906j5907k2936r374j7799j4697K2682
16669b9681J7984J8911q405R054K7532k713r180j7729j9256j5882p526P588j0339
$$ plain form
16758 8795 21354 19216 25006 13705 -9684 8563 30112 28546 509 3868 -2283 -19655 -23879
16745 -23879 4691 2944 12017 46260 50861 23060 4110 19169 4753 -11817 -3551 13422
16733 13422 5130 4307 32799 33049 25137 42054 54264 38410 17622 21848 3098 -28986 -18482
16720 -18482 -22925 -9020 -28681 -40448 -48160 -28024 -9577 -1005 3033 -22368 -39164 -38211 -79349
16707 -79349 -84021 -51735 -30561 -51358 -32441 -23073 -5164 -1930 -6928 2217 5577 11680 9807
16694 9807 -4691 -14842 -10685 6818 20481 30752 40885 37098 53419 56910 45409 73898
16682 73898 43499 12618 3105 19531 28648 34256 28350 12443 -10493 -19867 -37666 -52363 -29681
16669 -29681 -11697 7214 -1191 7863 35395 32682 23502 5773 -13483 -29365 -36891 -29303 -39642
16656c9642M42J7771K4592P701Q08j4806k0995j625K2470J8331N104p679j8245
16643e773k7464J3199O201K3423L3226J1563m722l2459p942j0605k5907J5358
16631a1902m20k2274J2810N031K8033j727O430K1134j3896l3238M602O795m484
16618c106J0487K2627o731k2692K601K5840J186k6892l4185o164R073j0920J7182
16605b1694L6986l0730m234j3783k0491j4999m72J0173J0553j0905J8558J8219
16593b2819o923J0848k24Q695Q900R598J7198K9187J0748k3622J5253m239m9940
16580B660k6758J2280K1456k190j8167K0389K1621p322j4781R284p576j5678j8565
16567b3347k34n562k460o57J3297J605j5782P211p539l137M655k6849J045L1431
$$ plain form
16656 -39642 -39200 -21429 3163 10864 11672 -3134 -24129 -25754 -3284 15047 20151 12472 -5773
16643 -5773 -33237 -20038 -13837 9586 42812 54375 49653 17194 9252 -1353 -27260 -11902
16631 -11902 -12322 -34596 -21786 -16755 11278 9551 15981 37115 23219 -10019 -5417 1378 -3106
16618 -3106 7381 30008 23277 585 3186 29026 30212 3320 -30865 -37029 -27956 -38876 -21694
16605 -21694 15292 -15438 -19672 -33455 -53946 -68945 -69417 -59244 -48691 -59596 -41038 -22819
16593 -22819 -29742 -18894 -19118 -10423 -1523 8075 25273 54460 65208 41586 56839 52600 2660
16580 2660 -24098 -11818 9638 7448 -10719 9670 31291 23969 9188 18472 10896 -4782 -23347
16567 -23347 -23581 -29143 -31603 -32260 -18963 -17358 -33140 -25929 -33468 -36605 -31950 -58799 -57754 -26323
16553b6323J5998j742J867K7760q108l8309q406m825N503K884j7248J0962L0833
16540i154p871j7233J2143J1959j6681K050K972Q972l047j0569M876Q74J8549
16527b160J7777L718k8517j9457j57R635O194K438k7339J1689q253q653L00J5208
16513b7577L5164J6500l6452k2328J6174J3362k3291k3088J0769K6519M891K605
16501f752n774j0663R271R613K3037o08n87k889p588j7933j964J2302K0390j7141
16487B714q985J5555j7329r169p522j4324q795Q019q67K8708J4322J0572k500
16474A0399j5488j8978k283L0319j908P157K7049k550k2589j9516l801m294J7565
16461A082K1879Q128O226O498q590j6823p995q122p486Q115q836r499Q488k160
$$ plain form
16553 -26323 -10325 -12067 -10200 17560 9452 -28857 -37263 -42088 -36585 -33701 -50949 -39987 -9154
16540 -9154 -17025 -34258 -22115 -10156 -26837 -24787 -21815 -12843 -15890 -26459 -21583 -20709 -2160
16527 -2160 15617 19335 -9182 -28639 -28796 -19161 -12967 -10529 -37868 -26179 -34432 -43085 -42785 -27577
16513 -27577 7587 24087 -12365 -34693 -18519 -5157 -28448 -51536 -40767 -14248 -9357 -6752
16501 -6752 -12526 -23189 -13918 -4305 18732 18124 17537 14648 7060 -10873 -12837 -535 19855 2714
16487 2714 -6271 9284 -8045 -17214 -24736 -39060 -47855 -39836 -40703 -11995 2327 12899 10399
16474 10399 -5089 -24067 -26350 3969 2061 9218 36267 33717 11128 -8388 -12189 -16483 1082
16461 1082 22961 31089 37315 43813 35223 18400 10405 2283 -5203 2912 -5924 -15423 -6935 -9095
16447i095j6009N113o451j8082n648K06J5937k340J7939J741o645J2540J6385
16434E591Q003j673l5288M5051l793n3642k5878K5987Q525p530l703J2562M5992
16421B0204J0046J7793l976j4451k1589N338j0356Q031J7789r804j9467j7377
16409a7819K30J0234k1496J6731K1006j1851p126L882j9728l1270k2048J8249
16397f1006K9119L9443K211k696k1396j6428m652L9235J0150J918j0785P502J5473
16384B8088j2373N594l348N998j286m6287m1336M392O28q930J6132K4314J7241
16371a1173k2241q610K0004J0684J3119j794J7140K769q522j7145J067J319J6730
16358A3347J6372k5406k5945K5310L9775j5073j0635k05q916l8273j5533K4663
$$ plain form
16447 -9095 -25104 -19991 -26442 -44524 -50172 -49966 -34029 -36369 -18430 -16689 -23334 -10794 5591
16434 5591 13594 11921 -23367 21684 17891 -35751 -61629 -35642 -27117 -34647 -38350 -25788 20204
16421 20204 30250 48043 44067 29616 8027 13365 3009 11040 28829 19025 -442 -17819
16409 -17819 -17589 -7355 -28851 -12120 8886 -2965 -10091 -6209 -25937 -57207 -79255 -61006
16397 -61006 -31887 7556 9767 7071 -14325 -30753 -35405 3830 13980 15898 5113 12615 28088
16384 28088 15715 21309 17961 23959 22673 -23614 -64950 -60558 -59930 -68860 -52728 -28414 -11173
16371 -11173 -33414 -42024 -22020 -11336 1783 -11 17129 19898 11376 -5769 -4702 -3383 13347
16358 13347 29719 4313 -21632 3678 43453 28380 17745 17540 8624 -29649 -45182 -20519
16346b0519L3601M860j1488j0928l286J2915N846j3599P946J1741R741Q039j8698
16333A6171j6544P030N088j9690o533N29M309L3533K964l3221L841M177J6040
16320A7694k227k486l979j5029P479j7003N590K9156Q021J024J930r896P709j4612
16306A3371k8152p15L13o198j249J3191q187K4984L6453K075k9565j5372J2004
16293A2953J0518k7898m102K4462N621j044J2976j9967o615J2321K836j3461j974
16280F626j908j3901R233J9153k7346k6530J1721L941j521K4891P388k9078n983
16267b3314K2735M253j1486Q826j1579L843J1870M73j2651N962N757j6898j2317
16254b4526j2512Q289K6958N425n405j110R347L422j4762j3348R866J4206J1797
$$ plain form
16346 -20519 13082 17942 6454 -4474 -7760 5155 11001 -2598 5348 17089 26830 34869 16171
16333 16171 -373 6657 11745 -7945 -14478 -13949 -9640 23893 26857 -6364 -2523 1654 17694
16320 17694 15467 12981 9002 -6027 1452 -15551 -9961 19195 27216 28240 30170 20274 27983 13371
16306 13371 -14781 -15496 -15183 -21381 -22630 -9439 -17626 7358 43811 45886 16321 949 12953
16293 12953 23471 -4427 -8529 15933 21554 20510 33486 13519 6904 19225 22061 8600 6626
16280 6626 4718 -9183 50 19203 -8143 -34673 -22952 -19011 -20532 4359 11747 -17331 -23314
16267 -23314 -579 3674 -7812 1014 -10565 -6722 5148 5621 -7030 -1068 4689 -12209 -24526
16254 -24526 -37038 -28749 -1791 3634 -1771 -2881 6466 9888 -4874 -18222 -8356 5850 17647
16241A7647M6746Q345k9359k1711m314N946P490l51o523K0472j0475n0158j9430
16228c5675J6933K2772J244k6278l4267p882K7485k542K0706K957j64j575J74
16215a6112l664J0862j877k7478J2280J3928j6998Q865J7661J0142k975k582n716
16202c664O069J571K389Q323R29j8661N608N77J8770J0436l1130k9718n36J2742
16188a6295j740J3040k3187l3713O379L3146o79j5993n297K9388O360p343j3184
16175b9118p039p127J7974K0476j2119k0412m853K1241K3002J6126Q804j3591
16163A3364j35j0089l420j9075j1541P383r145j266M113J202R038j7403j0437
16150d7411K7556J4636M708J7316K9613k1706j5706N876J9809j431k0583j0322
$$ plain form
16241 17647 64393 72738 43379 21668 17354 23300 30790 30439 23916 44388 33913 -16245 -35675
16228 -35675 -18742 4030 5274 -21004 -55271 -63153 -35668 -38210 -17504 -14547 -14711 -16286 -16112
16215 -16112 -19776 -8914 -10791 -38269 -25989 -12061 -29059 -20194 -2533 7609 4634 2052 -3664
16202 -3664 2405 3976 6365 14688 15617 -3044 2564 3141 21911 32347 1217 -28501 -29037 -16295
16188 -16295 -18035 -4995 -28182 -61895 -55516 -22370 -23049 -39042 -44339 -14951 -8591 -15934 -29118
16175 -29118 -36157 -43284 -25310 -4834 -16953 -37365 -42218 -20977 2025 18151 26955 13364
16163 13364 13229 3140 -280 -19355 -30896 -23513 -32658 -33924 -29811 -28609 -19571 -36974 -47411
16150 -47411 -19855 -5219 -511 16805 46418 24712 9006 14882 34691 33260 12677 2355
16138B355l637k813K185Q878R042p708o257J0922j5606p387K221J3263K233r257
16124a566j4636K4492L2822n444J1846j2468p19l455l819k0537J0082l8N254n408
16110A6406O614j1127r272J0376J935J4616J734N107j5496n873K2511J7492m873
16097E0150k8328k2028j135j099l43L650p824j2950J7854Q360K153n373k0988
16084a7901L1684J8664k8680k4874K5896J1825K694o196l034j1147J2149J8857
16072B9937Q387J2097k2652l2015j3631o856L4408j6233j2179Q035K3406J566
16060A4270J5934q380m2753J8631j440k3521j7720J1929N226j3472K0521K5797
16048E022J6311J535j7847j4752J5926q582k901K4933k7297n323k2304M226J291
$$ plain form
16138 2355 -1282 -4095 -1910 6968 16010 8302 2045 12967 -2639 -10026 -7805 5458 7691 -1566
16124 -1566 -16202 8290 41112 35668 47514 35046 34327 30872 27053 6516 16598 16560 21814 16406
16110 16406 23020 11893 2621 12997 14932 29548 31282 36389 20893 15020 37531 55023 50150
16097 50150 21822 -206 -1341 -2440 -2783 867 -6957 -19907 -2053 6307 8460 3087 -17901
16084 -17901 13783 32447 3767 -21107 4789 16614 19308 13112 10078 -1069 11080 29937
16072 29937 38324 50421 27769 -4246 -17877 -24733 9675 -6558 -18737 -10702 12704 14270
16060 14270 30204 21824 -20929 -2298 -3738 -27259 -44979 -33050 -27824 -41296 -20775 5022
16048 5022 21333 22868 5021 -9731 6195 -2387 -5288 19645 -7652 -12975 -35279 -31053 -29762
16035b9762n558n220k439J5121K4694N264j2036Q848O270L776k5776j4757N517
16022b6058L0252J3325l0446k7004P161M6106Q140k2032k947r866j5764J944K2532
16009d657K992o608J6430K302o962J2061j685j317Q182R442J7457m452l5414j5185
15995g414J2240K1954J0432o870j8042r744p868m070L2613O690j7817p652k6054
15982b1602J6392L1801J3406l025J4241l388m9421l5910K543M1780K5174j0738
15970B1253j7102R573L5412J5735k0224O38p403k4183n32j3633J5688J9767q165
15957B6824p093l6020k0862O71K5315j9475J5740J2504j3560j0588k299J6174
15945a2669j0421j7354P706Q825J5002j5676k2313J1166J6744K214j1549j8720
$$ plain form
16035 -29762 -35320 -40540 -42979 -27858 -3164 2100 -9936 -1088 5182 8958 -16818 -31575 -26058
16022 -26058 4194 17519 -12927 -39931 -32770 13336 21476 -556 -3503 -13369 -29133 -27189 -4657
16009 -4657 -1665 -8273 8157 10459 3497 15558 13873 12556 20738 30180 47637 43185 7771 -7414
15995 -7414 4826 26780 37212 30342 12300 2556 -5312 -9382 23231 29921 12104 4452 -21602
15982 -21602 -5210 26591 39997 36972 51213 47825 -1596 -37506 -34963 6817 31991 21253
15970 21253 4151 13724 49136 64871 44647 45285 37882 13699 13167 -466 15222 34989 26824
15957 26824 19731 -16289 -37151 -36480 -11165 -30640 -14900 -2396 -15956 -26544 -28843 -12669
15945 -12669 -23090 -40444 -32738 -23913 -8911 -24587 -46900 -35734 -18990 -16776 -28325 -47045
15933d7045p304J890m95J8171J2010J1707j406J8313J4848l0038j2142Q238K3080
15920I827R171j9845k9608K3409L4699N116j9845m7454l9393j0976K3995K8711
15908c2193k321k4441q832j2768k697O355J2969Q746K6139o085o817j3078r721
15895f4744L4715K241j0438M477L956j3649l603K4697J9344r62q204J1355m366
15882e181m283j7237j3868J9792j851J6789J1686k9038j6776M228J9113k26j8253
15869c5105o871R719j7679L3149K0697j7397o345K2410K7973o803J1237O899J549
15856D3433k7561k3594m0171J4485J9957K4397L3348r449l0858m1066L742K1358
15844a1979K49J0408j39k055p318l1389K0361L6635J770n881K2185k3178j1207
$$ plain form
15933 -47045 -54349 -52459 -52954 -34783 -22773 -11066 -12472 5841 20689 -9349 -21491 -13253 9827
15920 9827 18998 -847 -30455 -7046 27653 32769 12924 -34530 -73923 -84899 -60904 -32193
15908 -32193 -34514 -58955 -67787 -80555 -83252 -76897 -63928 -55182 -29043 -35128 -41945 -55023 -64744
15895 -64744 -30029 -27788 -38226 -33749 -29793 -43442 -47045 -22348 -3004 -3966 -12170 -815 -5181
15882 -5181 -9464 -26701 -40569 -20777 -22628 -5839 5847 -23191 -39967 -35739 -16626 -16852 -35105
15869 -35105 -41976 -32257 -49936 -16787 3910 -13487 -19832 2578 30551 23748 34985 41884 43433
15856 43433 15872 -7722 -47893 -33408 -13451 10946 44294 34845 3987 -37079 -33337 -11979
15844 -11979 -11730 -1322 -1461 -3516 -10834 -42223 -21862 14773 16543 10662 32847 9669 -1538
15831a538J5887J608M999j0762k235J0093j4902K4105o443j2182K6995J6933j5516
15818C7042k8958j8420J9002O216M748n536Q419o355L47j7611k302q723J2111
15805b0K1759K5320k998J161r438k5133J238j6998k9616P986J8197l979M819j3551
15791b1253l176J1886J5363k5324l822k196k0423K9486K5017M707L114n152m336
15778C891J9246N172j7896R223J6648j5091j4722M790P052p471l7l5679r103J1924
15764b2053p621P530J1101j6549R396N691J988M485R311j1446O771J2542J5172
15751B6318K5973l3689l3266j6733j7414J9203K4374j09j1502l064N319r468K5217
15738A159J5009j3408k4660j3768O714K8267P919R052R38P08j0183m635J3412
$$ plain form
15831 -1538 14349 15957 20956 10194 7959 18052 3150 27255 20812 8630 35625 52558 37042
15818 37042 8084 -10336 8666 14882 19630 14094 22513 16158 16505 -1106 -3408 -12131 -20
15805 -20 21739 47059 44061 45222 35784 10651 11889 -5109 -34725 -26739 -8542 -12521 -7702 -21253
15791 -21253 -24429 -12543 2820 -22504 -26326 -28522 -48945 -19459 5558 10265 13379 8227 3891
15778 3891 23137 28309 10413 19636 36284 21193 6471 11261 18313 10842 10805 -24874 -33977 -22053
15764 -22053 -29674 -22144 -11043 -27592 -18196 -12505 -10517 -6032 3279 -8167 -1396 11146 26318
15751 26318 52291 18602 -14664 -31397 -48811 -29608 -5234 -5343 -16845 -19909 -14590 -24058 1159
15738 1159 16168 2760 -21900 -35668 -28954 -687 7232 16284 17222 17930 7747 3112 16524
15725A6524J2794M866m142q417J8208k0721j7694J8872j4300j4801k369J2565
15713A385Q941p263Q477L431p273j2855J431J6915J8653J5426K357q652p305k4087
15699I581j3291J9363l62j4389J9398L387R990k7795j2080j6236J328N01r554
15686c0159P642J5643J1928K793q110k62K661J2005Q67m855k0206K505J7855l989
15672F318J380J2609J5225k719k4108k974K1146j7163j0105j3846p925K0166J4862
15659A2866l8447j3433K1486K6128K8752L4286l864j2363k9787k8465n001O138
15647a704K335M421j458J527J2852p205N776o683k1287p360q186M716J5766j8471
15633b4961k0169l051K6812k566J9468k1787l5312P328J2145r471q328O11J2867
$$ plain form
15725 16524 29318 34184 30042 21625 39833 19112 1418 20290 5990 -8811 -11180 1385
15713 1385 10326 3063 11540 14971 7698 -5157 -3726 13189 31842 47268 49625 40973 33668 9581
15699 9581 -3710 15653 15291 902 20300 23687 33677 5882 -6198 -22434 -21106 -20605 -30159
15686 -30159 -22517 -6874 5054 7847 -263 -525 2136 14141 15008 10153 -10053 -7548 10307 6318
15672 6318 7698 20307 35532 32813 8705 5731 26877 9714 -391 -14237 -22162 -1996 12866
15659 12866 -25581 -39014 -17528 8600 37352 71638 67774 55411 25624 -2841 -7842 -1704
15647 -1704 631 5052 3594 5121 17973 10768 16544 9861 -11426 -18786 -26972 -22256 -6490 -24961
15633 -24961 -45130 -48181 -21369 -23935 -4467 -26254 -61566 -54238 -42093 -51564 -59892 -59281 -46414
15620d6414M2882K9727L543k5072k6163K556O005J2954J1127j8574J6945m316
15608E200J5319j1748k8867O838K3731J893j343j6788j4673k450j0449Q325L5392
15595A0380K0712O950l1029J1146k4440j0593L5769j5312r279j0402j9618L362
15583c2354N608N78M51l751j2879J2171j2277o840R567k477K3887L8187J1975
15570C1846n702N43j958l7556j8281L3806K4566j3411k2195j5808J3618N934r205
15557a3803n89O686Q811K5371j0451O214R427j5356J219K9485r346q997l644m457
15543B0570j1385K223M132J2758R305k1462k0422J5512j1572j4297p694J2745
15531i587M433J5345N035r303J7J1953k0398L023k1549r261L8995K8576J305k359
$$ plain form
15620 -46414 -3532 26195 29738 4666 -21497 -18941 -12936 18 11145 -7429 9516 5200
15608 5200 20519 8771 -20096 -13258 10473 12366 11023 -5765 -20438 -22888 -33337 -25012 10380
15595 10380 31092 38042 7013 18159 -6281 -16874 18895 3583 -5696 -16098 -35716 -32354
15583 -32354 -26746 -26168 -25717 -29468 -42347 -30176 -42453 -49293 -39726 -42203 -18316 19871 31846
15570 31846 26144 26687 24729 -12827 -31108 2698 27264 13853 -8342 -24150 -10532 -4598 -13803
15557 -13803 -14392 -7706 1105 26476 16025 22239 31666 16310 17529 47014 37668 28671 25027 20570
15543 20570 9185 11408 15540 28298 37603 16141 -4281 11231 -341 -14638 -22332 -9587
15531 -9587 -5154 10191 15226 5923 5940 17893 -2505 518 -21031 -30292 8703 37279 38584 36225
15517C6225m413k792l853j3056k770r904j704J5235R461J9144j2659j3756K115
15504A7273j0766r189J295J7213J1977R244J7937k3036k4503q070j9705M825J3967
15491a538Q833N097j6649k0558k342J4351O906K2863K3644j3059j4788K885J3333
15478B8978K7955P566r698j9724l2934J0017K3473k0378l0600m393M794O148m904
15465a3700j627P416Q994o616j9846J9890M1617j5485l227j5667k513r977k5742
15452c6483J2824J1879J0149K5611J4888k3946j2721j0860K990J2425J5503j2154
15440A0105k0294k3852o695K2788K4842O871M376o349l5046j0782j22K3364P322
15427c472K558j0778j709Q58K4884J1718k8644p288J2803J8269n560M860n074
$$ plain form
15517 36225 31812 29020 25167 12111 9341 -563 -2267 12968 22429 41573 28914 15158 17273
15504 17273 6507 -2682 -1387 15826 27803 37047 54984 31948 7445 -625 -20330 -15505 -1538
15491 -1538 7295 12392 -4257 -24815 -27157 -12806 -5900 16963 40607 27548 12760 15645 28978
15478 28978 56933 64499 54801 35077 2143 12160 35633 15255 -15345 -19738 -14944 -8796 -13700
15465 -13700 -15327 -7911 1083 -5533 -25379 -5489 36128 20643 17416 1749 -764 -10741 -36483
15452 -36483 -23659 -11780 -1631 23980 38868 14922 2201 -8659 -5669 6756 22259 10105
15440 10105 -10189 -34041 -40736 -17948 6894 13765 18141 11792 -23254 -34036 -34158 -10794 -3472
15427 -3472 -914 -11692 -13401 -12543 12341 24059 -4585 -11873 930 19199 13639 18499 13425
15414A3425k9217j0093J8045l970J306J2680j844K130j1941j9046k3517J6184
15402c5858K8332k960L094k433j2064m995l628K1280j2360k62K7254K0017M984
15389C0401j27k3773J9463J2819o999j9321k9814j805O65J5023l7277R396K9335
15376b014k4487o840K1982J4779J4970j3390k3279j385J55J1070L874M913K4137
15363B4485K576j6362l4933k4067R419K8390K1234J5371k1954j0255K3814K3109
15351D0827P708k3426k9219k0381m0506R691K6923k381j4353j3358J7789R59l838
15338d3565J8976J0888l858m166P65J6325P097r336J4570P058k0523o375O358
15325e786m936j772k4758K6941K0134J0160k0894l7005J1401J8021Q907k3048
$$ plain form
15414 13425 -15792 -25885 -7840 -11810 -10504 2176 332 2462 -9479 -28525 -52042 -35858
15402 -35858 -7526 -10486 -7392 -9825 -21889 -26884 -30512 -9232 -21592 -21854 5400 25417 30401
15389 30401 30274 6501 25964 38783 31784 12463 -17351 -19156 -18491 -3468 -40745 -31349 -2014
15376 -2014 -26501 -33341 -11359 3420 18390 5000 -18279 -19664 -19509 -8439 -4565 348 24485
15363 24485 27061 10699 -24234 -48301 -38882 -10492 10742 26113 4159 -6096 17718 40827
15351 40827 48535 25109 -4110 -24491 -64997 -55306 -28383 -30764 -45117 -58475 -40686 -39727 -43565
15338 -43565 -24589 -13701 -17559 -21725 -20960 -4635 2462 -6874 7696 14754 -5769 -12144 -5786
15325 -5786 -10722 -12494 -37252 -10311 9823 19983 -911 -37916 -26515 -8494 413 -22635
15313b2635k6112J5343J0863J7447k2244p817K11J8152M786j8103J0009K9335
15301I235J8514p093j8658P365j831l713K7444J1311o993j8323j6234j9147j8925
15288c7048j0701K3234M540J4390m613j9892J9269K3221l3784l2247Q579P47k098
15275d6403P789L1106j1409k3436J1034J3979j2050l796J0546J4476M875p180
15263a0469n54J570J1796L198j6177j1358j6518M448r728j7763P905K8708m585
15250b9527j9311K6997L1860j1286J194O808O65P634j6672j4269o466L296J1801
15237g276M3J687Q603j203j0066j6217m104J523J2795K3278J3781j7099j9841
15224a4096J7021O107n024J372J3238j5746m057J2674j5142j9761j5952J8664
$$ plain form
15313 -22635 -48747 -33404 -22541 -5094 -27338 -35155 -34944 -16792 -12006 -30109 -20100 9235
15301 9235 27749 20656 1998 9363 7532 3819 31263 42574 35581 17258 1024 -18123 -37048
15288 -37048 -47749 -24515 -19975 -5585 -10198 -30090 -10821 12400 -21384 -53631 -45052 -44305 -46403
15275 -46403 -38614 -7508 -18917 -42353 -31319 -17340 -29390 -33186 -22640 -8164 -3289 -10469
15263 -10469 -11023 -9453 2343 5541 -10636 -21994 -38512 -34064 -43792 -61555 -53650 -24942 -29527
15250 -29527 -48838 -21841 10019 -1267 -73 6735 7400 15034 -1638 -15907 -22373 -19077 -7276
15237 -7276 -7233 -5546 3057 1854 -8212 -24429 -28533 -27010 -14215 9063 22844 5745 -14096
15224 -14096 2925 9032 4008 5380 18618 2872 -1185 11489 -3653 -23414 -39366 -20702
15212b0702K3739M6689q099l0572j949j8352r791j2415q1K3542P172o030j1014
15199a7863p624q547J0441J2539k284l386j5255l1414J3432K9458O994j3528J1381
15186a5656J0325J1126L3316N022k2552L362L559j977k2434k32k2143p799j603
15173b7686J2340J8181K167j0683l961k806m546N528j2745m074j1142R318J508
15160b8601N943k313J4577n538j9020M0860J6863L910k8253J5052P195m752J6811
15147C2734o40j2307p135r749l3345J2280Q958O949j0993k8286o277K9064L6389
15134A7642Q390j3886K52O189M734M406K049R492l929j8923k4053O38J3664M176
15120A0841j8563q1j190j2328R559K2198p311K3030J0754j7815j4555k4111m950
$$ plain form
15212 -20702 3037 49726 41627 11055 9106 -9246 -19037 -31452 -31533 -7991 -819 -6849 -17863
15199 -17863 -25487 -34034 -23593 -11054 -13338 -16724 -31979 -63393 -49961 -20503 -13509 -27037 -15656
15186 -15656 -5331 5795 39111 44133 21581 24943 28502 26525 4091 3859 -18284 -26083 -27686
15173 -27686 -15346 2835 5002 -5681 -9642 -12448 -16994 -11466 -24211 -28285 -39427 -30109 -28601
15160 -28601 -22658 -24971 -10394 -15932 -34952 5908 22771 26681 -1572 13480 20675 15923 32734
15147 32734 32094 19787 12652 2903 -30442 -18162 -9204 -2255 -13248 -41534 -47811 -18747 17642
15134 17642 26032 12146 12398 18587 23321 27727 29776 39268 35339 16416 -7637 -6999 6665 10841
15120 10841 -7722 -7803 -8993 -21321 -11762 10436 3125 26155 36909 19094 4539 -19572 -24522
15107b4522j5718j831K2053Q083N601J5385J5661J1953p540l6999m9267N609K5809
15094b5723K953q084J0262q410q582j1424p926L3655Q707K69K0468K3870j4867
15081A5168k3484n002j6701K3248K4853P375Q532j4097k5051m907R880J2234L1782
15068D3830j6788j0531P851j5039l3831l796J8017K064r337K630M350k0115q321
15055c9016L810R282J020L0850K328O208j3271J142j3398k4169K003K2297O515
15042d399O591r074l440k2487J1448k0531k2399K5417L0852K3131o900o335k860
15029i86k0291j211j0085l2952q929J808L6592Q658J0698j1948M882L257j3389
15016c3896k0157J363J2219L374P375k911L077q42K1415J2089k733k541J0302
$$ plain form
15107 -24522 -40240 -42071 -20018 -11935 -6334 9051 24712 36665 29125 -7874 -57141 -51532 -25723
15094 -25723 -22770 -30854 -20592 -29002 -37584 -49008 -56934 -23279 -14572 -14303 6165 30035 15168
15081 15168 -8316 -13318 -30019 -6771 18082 25457 33989 19892 -5159 -10066 -186 12048 43830
15068 43830 27042 16511 24362 9323 -24508 -28304 -10287 -8223 -17560 -14930 -10580 -30695 -39016
15055 -39016 -35206 -25924 -24904 5946 8274 14482 1211 2353 -11045 -35214 -33211 -10914 -4399
15042 -4399 2192 -6882 -10322 -32809 -21361 -41892 -64291 -38874 -8022 15109 8209 1874 -986
15029 -986 -21277 -22488 -32573 -65525 -74454 -72646 -36054 -27396 -16698 -28646 -23764 -20507 -33896
15016 -33896 -54053 -52690 -40471 -37097 -29722 -32633 -29556 -30398 -8983 3106 373 -2168 8134
15003H134J3322J0415m1812k4966q510n700J2963K1964K1387R643r969L876K3474
14990C4221J055p263p064j2289K696O691j7954n305L1631P102J6900k1285j6779
14977A2357K1631J089k9089r953j1373j0583K1995L7513K5158J1130k1525m639
14965D3711o657j6334q641r549j2764R165o365L693j1755k0562N277J3017N689
14952a2075p244J1153J2315o272j3286N522o70M253P067p235q462J6631j4098
14939a2401Q874J7774k9915k1268K4266Q997K443k672m152J5778K0777L058j5908
14926A5651m483K2620N168k038K514j2392l4870r927M356N545p637P043L2167
14913B3717J5502m5013j0350j9798k2368J1277o071R10K508J1207P236Q896J5579
$$ plain form
15003 8134 21456 31871 -9941 -34907 -43417 -49117 -36154 -14190 7197 16840 6871 10747 34221
14990 34221 35276 28013 20949 8660 11356 18047 93 -5212 26419 33521 50421 29136 12357
14977 12357 33988 35077 5988 -3965 -15338 -25921 -3926 33587 58745 69875 48350 43711
14965 43711 37054 20720 12079 2530 -10234 -1069 -7434 -3741 -15496 -36058 -30781 -17764 -12075
14952 -12075 -19319 -8166 4149 -2123 -15409 -9887 -10557 -6304 763 -6472 -14934 1697 -12401
14939 -12401 -3527 14247 -15668 -36936 -12670 -3673 -1230 -3902 -8054 7724 28501 31559 15651
14926 15651 11168 33788 38956 36918 39432 27040 -7830 -17757 -13401 -7856 -15493 -8450 23717
14913 23717 39219 -5794 -16144 -35942 -58310 -47033 -53104 -52194 -49686 -38479 -31243 -22347 -6768
14900f768R971k3204Q811J5828O688j7711o281l177R383N936q121N665J4331J0289
14886B1640q533l028n323J3345j1m532q299q325Q726J5302j2631j3299L0766r524
14872A6274m643O095Q943j6580k4794J4311O642M205r270j2185n687J0744K8786
14859B2841j0885l6538K4608K2185k967k2181N510J276k4628j6807P590L6205
14847F209M504M022K0896N18k2966j8373k126r511k2653K3325J8877j4721J9687
14834G688K1688l1669l1606J1621J8918J7845K4390j4535j7405R772j3339k2714
14822a9346j3334Q427K8723J7996N528m710k7402p451k9064J1422J2645K136j4617
14809b9047K0240J2980M013P401K8344k161m596j565j0995K1781j9396n073j0883
$$ plain form
14900 -6768 3203 -20001 -11190 4638 11326 -6385 -12666 -15843 -6460 -524 -8645 -2980 11351 21640
14886 21640 13107 10079 4756 18101 18090 13558 5259 -3066 5660 20962 8331 -4968 25798 16274
14872 16274 11631 17726 26669 10089 -14705 -394 6248 10453 1183 -11002 -16689 -5945 22841
14859 22841 11956 -24582 26 22211 19244 -2937 2573 3849 -20779 -37586 -29996 6209
14847 6209 10713 14735 35631 36149 13183 -5190 -7316 -16827 -39480 -16155 2722 -11999 7688
14834 7688 29376 -2293 -33899 -22278 -3360 14485 38875 24340 6935 16707 3368 -19346
14822 -19346 -32680 -24253 4470 22466 27994 23284 -4118 -11569 -40633 -29211 -16566 -14430 -29047
14809 -29047 -8807 4173 8186 15587 43931 41770 37174 35609 24614 46395 26999 21926 11043
14796A1043r054N440p825M123O862J8362j3541k3755q383K1183o14k677j115r566
14782i517j9971O252L3624K2460M321j9088R17M104J0439k3863m786l0386l475
14769b8969L3012j9355j2039J1424J2959J542L5999R882k5978j6082J396K1216
14757B5007K0283J3925j4670k5342j2614j1297j1530q603O07o422J4800J1482
14745d374J1373j2889j0489R518L895J402n229k6266r963j208L6058N985k9873
14732c2060N507L8555K7369J6633J549m96j1855J2861m524j5734j8067j7908q430
14719f600p559o294J2790r481Q972K6413j7375j517K217k4267J5414K8204k2981
14706b064l1804J2631K3398O253K963l722N089q457P089J7331j4385j1377l486
$$ plain form
14796 11043 1989 7429 -396 3727 10589 28951 15410 -8345 -16728 4455 3841 1164 49 -9517
14782 -9517 -29488 -23236 10388 32848 37169 18081 18998 23102 33541 9678 4892 -25494 -28969
14769 -28969 4043 -15312 -27351 -15927 -2968 -1426 34573 44455 18477 2395 3791 25007
14757 25007 45290 59215 44545 19203 6589 -4708 -16238 -24841 -24234 -30656 -15856 -4374
14745 -4374 6999 -5890 -16379 -6861 -2966 -1564 -6793 -33059 -43022 -44230 -8172 -2187 -32060
14732 -32060 -26553 12002 39371 56004 57553 57057 45202 58063 53539 37805 19738 1830 -6600
14719 -6600 -14159 -20453 -7663 -17144 -8172 18241 866 -651 1566 -22701 -7287 20917 -2064
14706 -2064 -33868 -21237 2161 8414 11377 7655 12744 4287 11376 28707 14322 2945 -541
14693e41R261J6877k0247j8113Q432Q123J8640k639P177N575k0033m032r328J3748
14679A2900l66j2083Q420J0284J2343O058l1574J1076j9603k5339J3276L1220
14667A6612n287j4800P596J5560l877J3875J838o769l3336k636M898N149P910
14654F733N999L6758p590k0438j2546L2949r718j56o811j4872l136j4800j4929
14641b2557j4009J723J438M668P038j4076K1240M7074k87k5133k0208L856J9526
14628A0293L426r375j0932Q673l877K2639R70m445j7679J7223J5480k3510m9574
14615d0688n150Q737J0282J4219K2182L621j5297J0152k669r543R535o938j2443
14602a4000J4555J5421j0002p604R071J062r171J7647J2054k800M281O809j5905
$$ plain form
14693 -541 8720 25597 5350 -12763 -4331 3792 22432 19793 26970 32545 12512 8480 -848 12900
14679 12900 12534 451 8871 19155 31498 37556 5982 17058 -2545 -27884 -14608 16612
14667 16612 11325 -3475 4121 19681 15804 29679 31517 24748 -8588 -11224 -6326 -1177 6733
14654 6733 12732 49490 41900 21462 8916 41865 32147 31991 25180 10308 7172 -7628 -22557
14641 -22557 -36566 -34843 -33405 -28737 -21699 -35775 -14535 32539 32252 7119 -13089 -9233 10293
14628 10293 13719 4344 -6588 2085 -1792 20847 21817 17372 -307 16916 32396 8886 -40688
14615 -40688 -45838 -37101 -26819 -12600 9582 13203 -2094 8058 5389 -4154 5381 -1557 -14000
14602 -14000 555 15976 5974 -1630 7441 8503 -668 16979 29033 26233 30514 37323 21418
14589B1418O483K0444K7441k9065n5294j0408j6593o489L730M256m907O065R290
14576b3629p634K1270M2824J056J5642r488m826r903p616k901J204J0716j3335
14563A3380m67o326K134p993k0152j538L1288J2141q983J6375J1823k1084j3255
14550G343r879R996K3200r636j9041n357K2671P897j0644j4430q318j4787K3444
14537B459K2020N744Q723j2945p989K192K1372J4520m645j8293j5006K276j6854
14524C574o569J7955J2054p928l56j0494J44j0394r507J433p288m958j346J5774
14510g906J255j108J0326R885J4058j2448j6367j0209P540K792k0536j1161j3496
14497d7375j0476J7846L8694k664r690J2873K9011j6392k1711l158j4459j1056
$$ plain form
14589 21418 27901 48345 75786 46721 -8573 -18981 -35574 -42063 -38333 -34077 -38984 -32919 -23629
14576 -23629 -31263 -9993 32831 33887 49529 40041 35215 25312 17696 14795 15999 26715 13380
14563 13380 12913 6587 8721 728 -19424 -20962 10326 22467 13484 29859 41682 20598 7343
14550 7343 -2536 7460 30660 21024 1983 -3374 19297 27194 16550 2120 -6198 -20985 2459
14537 2459 24479 30223 38946 26001 18012 20204 41576 56096 51451 33158 18152 20428 3574
14524 3574 -2995 14960 27014 19086 18730 8236 8380 -2014 -11521 -10088 -17376 -22334 -23680 -7906
14510 -7906 -6651 -7759 2567 12452 26510 14062 -2305 -12514 -4974 -2182 -22718 -33879 -47375
14497 -47375 -57851 -40005 -1311 -3975 -13665 -792 28219 11827 -9884 -13042 -27501 -38557
14485c8557J6635K4977j520K4328J8140O089j9909k8112l0151j1415J3193j746
14473b8048k0951r670L1261L7611J9648l0628m8172k6975K225L7222P547r936
14461c8866K920L2766K2358M12m3055j0164k5568J6668O728M0060J0113j4305
14449F7K370P01o313J2015K795j5146j386L0591J4653J1232J877j2230o636j2013
14435B2577k862q702L704k3105o085p824J8154J2155k7180k7090J120M7135M7050
14422D9047J1113k7726m849R808j6208r257j3339J4108J8815j122p786P497J8043
14409D8144J6130l1065l2920j2136j815l3938K43J8647L1722m11o997l128J435
14396f089J1109j1213R465q801k102J1774J3427J8737p878k6533N002Q088l853
$$ plain form
14485 -38557 -21922 3055 1535 25863 44003 50092 30183 2071 -28080 -39495 -26302 -28048
14473 -28048 -48999 -58669 -27408 10203 29851 -777 -48949 -75924 -73699 -36477 -28930 -38866
14461 -38866 -35946 -3180 19178 19590 -23465 -33629 -59197 -42529 -35801 4259 14372 67
14449 67 2437 3138 -3175 8840 11635 -3511 -4897 25694 40347 51579 53456 41226 34590 22577
14435 22577 19715 11013 14717 -8388 -14473 -22297 -4143 8012 -19168 -46258 -45138 1997 49047
14422 49047 60160 32434 27585 37393 21185 11928 -1411 12697 31512 30390 22604 30101 48144
14409 48144 64274 33209 289 -11847 -13662 -47600 -47357 -28710 3012 2601 -4396 -7524 -6089
14396 -6089 5020 -6193 3272 -5529 -7631 4143 17570 36307 28429 1896 6898 14986 11133
14383A1133k3383J6933p116P744J0778K0943K6195Q67k2249L034J17j3002j4177
14370A7817M619P218p91N549J180k026k0704k8486j440J0502K916O787N182J68
14356H491m636r75k5944J3470K7417n808k0649K658o054N620k0077L8025L1065
14343D2603o334l8687k6232J1148L1289R243n65k4882j3173L5654K4156M007J083
14330D9310k247m3970m3753j0351J5127K4256P925m781l430Q705j9531R533j3074
14317b6281Q958K5831n73j1237q976L6101L5711k0668j7426J2082J3515k0009
14305B7028j535M39o435Q774o817j9496j5227J9447J2514l0911k1887K3535M584
14292e987K0817J9990J2793l509k2440o353j778k8991j9016K6756R258P196J0596
$$ plain form
14383 11133 -12250 4683 -2433 5311 16089 37032 63227 64094 41845 44879 44996 31994 17817
14370 17817 22436 29654 28863 34412 35592 33566 12862 -15624 -17064 -6562 -3646 3141 8323 8491
14356 8491 3855 2880 -23064 -9594 17823 12015 -8634 -5976 -12030 -6410 -26487 11538 42603
14343 42603 36269 -2418 -28650 -17502 13787 23030 22465 -2417 -15590 20064 44220 48227 49310
14330 49310 47063 3093 -40660 -51011 -35884 -11628 -3703 -8484 -11914 -3209 -22740 -13207 -26281
14317 -26281 -17323 8508 7935 -3302 -12278 23823 59534 38866 21440 33522 47037 27028
14305 27028 25493 25932 19497 28271 21454 1958 -13269 6178 18692 -12219 -34106 -10571 -5987
14292 -5987 14830 34820 47613 44104 21664 15311 13533 -15458 -34474 -7718 1540 8736 19332
14279A9332l4986j6532J2670K0681Q919R188K1467o190n085K0077J4135l1288
14267C2388n475L743o587l199J7261O4J451j8369j4531J0787n056J5953o015j030
14253B1385j6056P911K541J858j324K2324O488k8826j6563J3113l81J365J0649
14240B4484k6668j4729J0558P980j9043J1803J7922J5111K0191l993j1013j0984
14228B1619o163J2453J1620l0415J581j9842O56O907J3687J0248Q737J0973l0336
14215A1725P904J4280M320j8578k7302J0813M1290K148k3663l0672q923O835J6271
14202F448j7835K3397K4933K30k4336l9551p249J1135L6770J9043l260k7734j8937
14189a6946q72l778m693J9621K8943Q320j0627k4820l4613L811J3655K3732J2911
$$ plain form
14279 19332 -15654 -32186 -19516 1165 10084 19272 40739 34549 29464 49541 63676 32388
14267 32388 26913 30656 24069 20870 38131 38195 39646 21277 6746 17533 12477 28430 22415 21385
14253 21385 5329 13240 15781 17639 16315 38639 45127 16301 -262 12851 12470 13835 24484
14240 24484 -2184 -16913 -6355 1625 -17418 -5615 12307 27418 47609 43616 32603 21619
14228 21619 15456 27909 39529 9114 10695 -9147 -8491 -1584 12103 22351 31088 42061 11725
14215 11725 19629 33909 38229 19651 -7651 3162 44452 46600 22937 -7735 -16658 -9823 6448
14202 6448 -11387 12010 36943 37173 12837 -26714 -33963 -22828 13942 32985 29725 1991 -16946
14189 -16946 -17818 -21596 -26289 -6668 22275 30595 19968 -4852 -39465 -35654 -21999 1733 14644
14176A4644j8698m409K0934m915k523M904k2230K914n522J0875J0708j188N938
14163A1432J7204R411K8583P361k1546k2224k8859k2866J2817O833J2227J4210
14151B4583o721O961k0864k8177l088K6481J4544P562J6765n231q960j5053o52
14138H150K8223R600j0261j6055J604J7325J1463j821j3803K4528Q260M26J784
14125F9423p543j4352j143J354l342l261J3803l6114k7804J236P101Q029K5226
14112C2613j0004R306P761K2107P555j6472m58l688j9474n19J176j170m108K4808
14098D9433J7415j7771m1392n66K8830N704k2696k7666j2984M08K1375k464L960
14085A586r118m463L0212M862K0265j3878k4201k0841K612J7660K0478J8019j4136
$$ plain form
14176 14644 -4054 -8463 12471 7556 5033 9937 -12293 -9379 -14901 -4026 6682 5494 11432
14163 11432 28636 38047 66630 73991 52445 30221 1362 -21504 -8687 -1854 10373 24583
14151 24583 17862 24823 3959 -24218 -27306 -825 13719 21281 38046 32815 23855 8802 8150
14138 8150 36373 45973 35712 19657 21261 38586 50049 48228 34425 58953 67213 67639 69423
14125 69423 61880 47528 46385 47739 44397 41136 54939 18825 -8979 -7743 -642 7387 32613
14112 32613 22609 31915 39676 61783 69338 52866 52408 48720 29246 28727 29903 28733 24625 49433
14098 49433 66848 49077 7685 7119 35949 41653 18957 -8709 -21693 -21285 90 -2374 1586
14085 1586 -7532 -11995 18217 23079 43344 29466 5265 -15576 -12964 4696 25174 43193 29057
14072B9057P5j916j2380p338q398J7087N608J1831J0708m661j7906j568r51j4626
14058D622l647L867j1230k1301m667m018o564k436J3683J4439K3962N097J4481
14045B6288M050k1252k015R94j5069R015R539J519J50J2046p620o779O868j5288
14031B446J5423M070k4039j1416P386j2529J21M2742J7939j3062j1569K7415L6832
14018H1759P326j0414l7111k2574j2730j467O124o976k3196K356L633j2421J1521
14005a4170M040k160j0233M662L9826n490k5887j7234K467M206j5O741l679Q876
13991h050Q283P677K280J5556J755k2597p214Q786j4500m115K0905L3964O530
13978D9260j3212J4303k5560k3436j584n077P449K99j4728J1488J6463J3328l657
$$ plain form
14072 29057 29132 27216 14836 7498 -900 16187 21795 33626 44334 39673 21767 20199 19248 4622
14058 4622 975 4842 -6388 -27689 -32356 -36374 -42938 -45374 -31691 -17252 6710 11807 26288
14045 26288 30338 9086 7071 8065 -7004 2011 11550 13069 13219 25265 17645 10866 17734 2446
14031 2446 17869 21939 -2100 -13516 -6130 -18659 -18538 24204 42143 29081 17512 44927 81759
14018 81759 89085 78671 41560 18986 6256 4789 10913 3937 -19259 -16903 -13270 -25691 -14170
14005 -14170 -10130 -12290 -22523 -17861 21965 16475 -9412 -26646 -24179 -19973 -19988 -13247 -16926 -8050
13991 -8050 233 7910 10190 25746 27501 4904 -2310 6476 -8024 -12139 8766 42730 49260
13978 49260 36048 50351 24791 1355 -229 -5306 2143 2442 -12286 -798 15665 28993 25336
13965B5336j4375l658q274k59R267O780r661j8764p352p34J2767J8772K6385k5727
13951A0503j2234j2353P711K015n214L5868J8001O670N104j6866j473j3147l69
13938B4216k1859j5388Q102J4183K1167k1448q678L003J1210k1600k0274K1084
13926f282K0966L8420J2759j3453j3548k0026R808Q22O339N749k2586j112N029
13913B2885j6918J8850K225r348l215l7003j2898J5051m691j721K3424J6030j9775
13900g104q943J5980Q963M783J3537p429n55N989j8825n748N866K2211K947J5408
13886D7080K0003N15l3681l1943m082j7544Q495K3923k060p622j3386O668K8223
13873B4589Q565J1072l5699j6161L4853J0380m511k600n328j4368j354P897K0649
$$ plain form
13965 25336 10961 7303 -971 -1230 8037 14817 5156 -13608 -20960 -21694 -8927 9845 36230 10503
13951 10503 -1731 -14084 -6373 -4358 -9572 26296 44297 50967 56071 39205 37732 24585 24216
13938 24216 2357 -13031 -4929 9254 30421 8973 295 3298 14508 -7092 -27366 -6282
13926 -6282 14684 53104 65863 52410 38862 18836 28644 29466 35805 41554 18968 17856 22885
13913 22885 5967 24817 27042 17694 14479 -22524 -35422 -20371 -25062 -26783 -3359 12671 -7104
13900 -7104 -16047 -67 8896 13679 27216 19787 19232 25221 6396 648 6514 28725 31672 47080
13886 47080 67083 67598 33917 1974 -2108 -19652 -11157 12766 10706 3084 -10302 -3634 24589
13873 24589 33154 44226 8527 -7634 27219 37599 33088 30488 25160 10792 9438 17335 37984
13860C7984q757j3588K7894J2888n086q586m0410p455J0423m874l4845n752L1529
13847h635L4154L9778j1195j3035j906M699j1807k0528J0175K965p629K8377J8914
13834F4327k0823m200k009q702j3502R498J5007k708J6555M434K527k0661k085
13821C7658K0280k827k8289p229J0192k191Q051p408J54J2179k0813l0356k2222
13808c2821J1348J1046P308J6944l730k6820l242L1519Q367J2143J6487j082j5552
13795C1915k3680Q866J8304J6583j6117j9204K3964l760l1028l141J8233k54K8131
13782D8812K4535r807j2254K206j2651q069k5908j2305l588j5429Q864j8942J368
13769c3168K9608p13L939J2795J1209J3178k65l308n091M739L5303J8345l0740
$$ plain form
13860 37984 29227 15639 43533 56421 51335 42749 2339 -5116 5307 433 -34412 -40164 -8635
13847 -8635 25519 65297 54102 41067 39161 43860 32053 11525 21700 24665 17036 45413 64327
13834 64327 43504 39304 37295 28593 15091 24589 39596 36888 53443 57877 60404 39743 37658
13821 37658 57938 55111 26822 19593 29785 27594 35645 28237 28391 40570 19757 -10599 -32821
13808 -32821 -21473 -10427 -3119 13825 10095 -16725 -19967 11552 19919 32062 48549 47467 31915
13795 31915 8235 17101 35405 51988 35871 16667 40631 36871 5843 2702 20935 20681 48812
13782 48812 73347 63540 51286 53492 40841 32772 6864 -5441 -9029 -24458 -15594 -34536 -33168
13769 -33168 -3560 -4273 -334 12461 23670 36848 36583 33275 28184 32923 68226 86571 55831
13756E5831k6866l713J0620j5922K884P709J8293K1435j2138m4528k204K4989
13744C6390J8972J9045K738j1081k8030q726j3719K2k061j8287j9066J1185L8455
13731B5837K1437k3044m527J3052j3661O359K144N75L786n287J0498J1840L28
13718D9337k6149r333J86J2530J777m135K121j4148o58J8835J5663j2951J527
13705C4602K4766N344l8402M487j4463k389R638N200P678O233L488j2632k5029
13692H521J5794K332l6718p6K0443O146j1938K137J7022k0239q653O6j5840L3170
13678A2167L49J0189l279k5708j3550r8J5628m826j3919K009K6217J9910L426
13665B8515o660j8401N308K0295K3718m767j1754J746J2321J7605l8598j2504
$$ plain form
13756 55831 28965 25252 35872 19950 22834 30543 48836 70271 58133 13605 11401 36390
13744 36390 55362 74407 77145 66064 38034 29308 15589 15611 13550 -4737 -23803 -12618 25837
13731 25837 47274 24230 19703 32755 19094 25453 27597 28172 31958 26671 37169 49009 49337
13718 49337 23188 13855 14041 26571 28348 24213 26334 12186 11528 30363 46026 33075 34602
13705 34602 59368 64712 26310 30797 16334 13945 23583 28783 36461 42694 46182 33550 8521
13692 8521 24315 26647 -10071 -10147 10296 16442 4504 6641 23663 3424 -5229 -5163 -21003 12167
13678 12167 12516 22705 19426 -6282 -19832 -19930 -4302 -9128 -23047 -21038 5179 25089 28515
13665 28515 21855 3454 8762 29057 52775 48008 36254 38000 50321 67926 29328 16824
13653A6824q684M697J323J0573K1396Q008J1524J9617j7414K182J0102k0284k2667
13640C7197k2594L1332K1731N120k7094j2406J6119j1642J979j7189k765k543
13628A7245Q389O895l305o099K4118o04p705J6442J8609n157o925j2780k7648
13615B1475J4450m218j4391R485j6513R536J4256J9153K725O061P168j6612q350
13602D4225K980m500k1079M10R385j2682q721L335O446L978q78o532J8335j0140
13588B4562j7183J1031m071p255k0014m311J7449K915J1652L0610J9555q652o563
13575D9725k885O895M119O754l5403n3275O285Q063J078j884J113L7976j6026
13562A2535P483K0606j7556O35K3458q543j1246q66n750J2846r02k2940j3842
$$ plain form
13653 16824 8140 12837 14160 24733 46129 54137 65661 85278 67864 70046 80148 59864 37197
13640 37197 14603 45935 67666 72786 45692 33286 49405 37763 39742 22553 19788 17245
13628 17245 25634 32529 29224 23125 47243 46639 38934 55376 73985 68828 61903 49123 21475
13615 21475 35925 31707 17316 26801 10288 19824 34080 53233 55958 62019 69187 52575 44225
13602 44225 47205 42705 21626 22036 31421 18739 10018 13353 19799 23777 22899 16367 34702 24562
13588 24562 7379 18410 14339 7084 -12930 -17241 208 3123 14775 45385 64940 56288 49725
13575 49725 46840 53735 57854 64608 29205 -24070 -17785 -9722 -8644 -10528 -9415 28561 12535
13562 12535 20018 40624 23068 23703 47161 38618 27372 26506 20756 33602 32700 9760 -4082
13549d082k302j4879j5256L743K3386K9327K8031J919N276j5954j2388M57J8965
13536D6243K2221k1379j4256k4428p057K0685N076r16m437j1955K888K0822K1851
13523E5358K4589j6973l931j9427k9914K96J5392K162l005q7l677Q256M0479J2354
13509H1872q345p296j2569p534O077l719j2570Q108K8289N830J4759Q819j4957
13496H6764k2024j7746K849J1112r72j151o851J904L149k62k4269N775J3878J327
13482E3483k1081o115J6974j337k1381K1747p665J4526J1818k8020r391M145k705
13469B4998J6366O519j0384p562k077l282J8325J771n416k131L149j266l1005
13456H005K907K4129K4929j4042j7286J7024J4804j0865j1744L933k502o084o431
$$ plain form
13549 -4082 -6384 -21263 -36519 -32776 -9390 19937 47968 49887 55163 39209 26821 27278 46243
13536 46243 68464 47085 32829 8401 1344 22029 27105 26189 21752 9797 12685 33507 55358
13523 55358 79947 62974 59043 39616 9702 9998 25390 27552 24547 24460 20783 29039 69518 81872
13509 81872 73527 66231 53662 46128 52205 48486 35916 44024 72313 78143 92902 101721 86764
13496 86764 64740 46994 49843 60955 59983 58832 51981 53885 57034 56772 32503 38278 52156 53483
13482 53483 32402 26287 43261 41924 20543 42290 34625 49151 60969 32949 23558 27703 24998
13469 24998 41364 47883 37499 29937 27860 24578 42903 44674 39258 37127 40276 39010 8005
13456 8005 10912 35041 59970 45928 28642 45666 60470 49605 37861 41794 39292 33208 26777
13443B6777M840K5281J0066k932j1623j1124l881j7086K3653j2803q314K268r248
13430A5874j9270K0574L5807J1660l0658K3506R967L173J029r033k5028k1162
13418A6439l283n45J3136Q826M772j0790j0454N988N061K254J3570L0274P23p076
13404F8895o097J551j1181j4766k4719J2854K3881K3000J3066m1859k1200N894
13392B9319j6630J7798o089P834J5898m851j787K855p407O150J6587J3239o093
13379F6823j3692N895j8137k6607o363p709J0728Q217q015m380L7092L5677j2133
13366F7396j005K6690P489n476l2325j6918m073n517Q03J0034K531Q138J5379
13353G3146R095Lj656m502K48j2242j7728o980q253j2683P168K5668L4198J8307
$$ plain form
13443 26777 31617 56898 66964 64032 52409 41285 37404 20318 43971 31168 22854 25122 15874
13430 15874 -3396 17178 52985 64645 33987 57493 67460 70633 71662 62629 37601 16439
13418 16439 13156 12611 25747 34573 39345 28555 18101 24089 29150 31404 44974 75248 75971 68895
13404 68895 62798 64349 53168 38402 13683 26537 50418 73418 86484 44625 23425 29319
13392 29319 12689 30487 24398 32232 48130 43279 41492 44347 36940 43090 59677 72916 66823
13379 66823 53131 59026 40889 14282 7919 210 10938 19155 11140 6760 43852 79529 67396
13366 67396 66391 93081 100570 95094 62769 45851 41778 36261 37064 47098 49629 57767 73146
13353 73146 82241 82244 80588 76086 76334 64092 46364 39384 31131 18448 25616 51284 85482 103789
13339A03789j54q766l062J9891J0337p402k0655j1651L954J3600L997l5965r212
13326E8701K9492p787j0765j4210J7704J9861j0544o048j2525J5195J9441J178
13314I9693r05J0700K0307O09K7750K3719L406J6006M6849M0380K3610N5687P2670
13301D40481J11702J67594J87385K36611L03813L10281J62681j11516k72723l19064
13291A217245k48678j82133j56229j54927o2437n2149o1153m1324j2026J848j7459
13280B30578k2780J3658j2083k3781l4350j7831r113Q180j4802J5963K278l8888
13268I7029l3253j1506j643R519K3055n378Q655p20l528k744l1036n259J4952
13255E8143j9219k445J4713K0003J612j9680j0396K6185q710l573L4436K1516
$$ plain form
13339 103789 103635 94869 91807 111698 122035 114633 93978 82327 86281 99881 103878 67913 58701
13326 58701 88193 80406 69641 55431 73135 92996 82452 76404 63879 79074 98515 99693
13314 99693 98788 109488 129795 130404 158154 181873 185279 201285 248134 288514 312124 367811 440481
13301 440481 552183 719777 907162 1143773 1447586 1757867 1920548 1809032 1536309 1217245
13291 1217245 968567 786434 630205 475278 412841 360692 299539 258215 246189 248037 230578
13280 230578 207798 221456 209373 185592 151242 133411 124298 132478 117676 133639 135917 97029
13268 97029 63776 52270 50627 60146 83201 77823 86478 85758 82230 79486 48450 43191 58143
13255 58143 38924 36479 51192 71195 72807 53127 42731 68916 60206 56633 91069 112585
13243A12585P981k9686Q057l1478j9202l491p236N212J3661Q856j5126K924q964
13230D4093q924J9891J8932k1740k8700m447j7223m330K2465J2460O097L0477
13218F9051J1035p927j2163J2069P170o550p57l2308j7235J3642J2098N719j2124
13205D1720J6466M0480m752K86j1326p938Q724J8690L1300j5501l3874l8478J3235
13192E9032O361J7396K9218k934j628k246j2615K0886O456k2855m7733k2087q973
13179A8278j413K5122N6208L0269o563o086n429k3703j1490j1727j1824m009K9747
13166G7380M730K4456J8687j8800l5711o408J6044O644K2064j078j5629P798J704
13153A01881o262J3847J3894j055j937n821J2009k0203M149R507j6132o670J3406
$$ plain form
13243 112585 120566 90880 98937 67459 48257 44766 37530 42742 56403 65259 50133 53057 44093
13230 44093 35169 55060 73992 52252 23552 19105 1882 -2448 20017 32477 38574 69051
13218 69051 80086 72159 59996 72065 79235 72685 71928 39620 22385 36027 48125 53844 41720
13205 41720 58186 98666 93914 94200 82874 74936 83660 102350 133650 118149 84275 45797 59032
13192 59032 65393 82789 112007 109073 107445 105199 92584 113470 119926 97071 49338 27251 18278
13179 18278 16865 41987 98195 128464 121901 115815 110386 86683 75193 63466 51642 47633 77380
13166 77380 82110 106566 125253 106453 70742 64334 80378 87022 109086 108008 92379 100177 101881
13153 101881 95619 109466 123360 122305 120368 114547 126556 106353 110502 120009 103877 97207 110613
13140A10613L3994K4240J4166M369O195j647j3122m2218k3980P671R905j7983
13128A12203j8025j553P054K0905k929j451k7400k3858m442K1459J0031k7232
13116F4762J9636L2581N205K65K786R627j0818k2953N715L756j2444o885j9478
13103G1755M606J9819K3001j9118K7737K6646k761j520K3387L8410O796m3047
13091A75711k4580J7574P847M822K2820n521l445l978m260j1297J1367N955K6531
13078B19546p609l25J8162L490k886j2930k5425k7200r527p670n562K188M330
13065A48582J0802j3664K730K985j4971J1555J0883J4264k7385o921k11j0123
13053A28526J5991K0460j0747K669r31K0516P571l0296o377J3343q713J0072N535
$$ plain form
13140 110613 144607 168847 183013 187382 193577 191930 178808 136590 112610 120281 130186 112203
13128 112203 94178 92625 99679 120584 117655 116204 88804 64946 60504 81963 91994 64762
13116 64762 84398 116979 122184 122449 125235 134862 124044 101091 106806 110562 98118 91233 71755
13103 71755 76361 96180 119181 100063 127800 154446 151685 150165 173552 211962 218758 175711
13091 175711 151131 168705 176552 181374 204194 198673 195228 191250 186990 175693 187060 193015 219546
13078 219546 211937 211612 229774 233264 230378 217448 192023 164823 155296 147626 142064 144252 148582
13065 148582 159384 145720 148450 151435 136464 148019 158902 173166 145781 138860 138649 128526
13053 128526 144517 164977 154230 156899 155968 176484 184055 153759 147382 160725 152012 162084 167619
13040A67619m313K7422K9533J207l6007j5097J3078o762j8635k5604L924J8370
13028A54735j102O828l576r270l1542j7685r55n671J5269L1682M071j8269j291
13015A23224j2942l1667k1122R935M7292J7964L844n534M3753M266o434N642j6472
13002A61749p555j3032J2611R473m932j359j0508k534J2221n798j2413J3260L4149
12989A85332K7823P1348O9665N3373K1291k8591m7806m6311j6804k5007j5319
12978B48994j3376Q605K1594k422K823J2429J957N947m645J1661q022R052J1781
12965C06378p886L1193J23799K06319J37593L4247p411p8861j46852j87471j51019
12954B60029j21560o7470k9592j0040M8345O3226Q2694M7253L7352M288J5715
$$ plain form
13040 167619 163306 190728 220261 221468 185461 170364 183442 176680 158045 132441 136365 154735
13028 154735 153633 160461 156885 147615 116073 98388 97433 91762 107031 138713 142784 124515 123224
13015 123224 110282 78615 57493 67428 114720 132684 136528 130994 174747 179013 172579 178221 161749
13002 161749 154194 141162 153773 163246 158314 156955 146447 143913 156134 150336 137923 151183 185332
12989 185332 213155 284503 354168 407541 428832 400241 352435 306124 289320 264313 248994
12978 248994 235618 244223 265817 263395 266218 278647 280604 286551 281906 293567 285545 294597 306378
12965 306378 298492 329685 453484 659803 797396 831643 824232 745371 598519 411048 260029
12954 260029 138469 70999 41407 31367 79712 142938 225632 272885 310237 314525 330240
12943C30240j1772L118J115P142J5077J2668J5946L0013L1119j3883j0855J2298
12931D22226M3070M2814K7505q581L120j5921k428K9063k0632N519K8692J0457
12919E64904M721K0061k551J6385P417p635Q526J4895N995K454L2178M6946L8931
12906G53227L1980K6639K1057M3261K715p361L4008M1322R396M8593K8844K5535
12894A059216j140q085K7028N1794O8813Q9358O8211M3995P2256Q8480O6291N0830
12882A677047M0686L9037O2441O7646R5648J11742P0046P6613R2268Q1783R8474
12871B513431J33873J43214J38222J30441J40534J84232K02073J97266K07596
12862C990882K27175K83331L23281L56515M05434M58860N53961O23527O88854
$$ plain form
12943 330240 318468 321586 322701 329843 344920 357588 373534 403547 434666 420783 409928 422226
12931 422226 465296 508110 535615 527034 530154 514233 511805 540868 520236 525755 554447 564904
12919 564904 569625 589686 587135 603520 610937 603302 611828 626723 632718 635172 667350 714296 753227
12906 753227 785207 811846 832903 876164 878879 871518 905526 946848 956244 1004837 1033681 1059216
12894 1059216 1058076 1049991 1077019 1128813 1197626 1286984 1355195 1399190 1471446 1559926 1626217 1677047
12882 1677047 1717733 1756770 1819211 1886857 1982505 2094247 2164293 2240906 2333174 2414957 2513431
12871 2513431 2647304 2790518 2928740 3059181 3199715 3383947 3586020 3783286 3990882
12862 3990882 4218057 4501388 4824669 5181184 5586618 6045478 6599439 7222966 7911820
12853G911820P68548Q41630R89987J109744J261539J545583J939964K395029K901382
12844B1665226L500921M070267M662141N717645P558530J0355405J4415282K0298882
12836I2244299K8875958M1134291N6659636P1691683P4787864L6111556l2119074
12829C69386213o6818472p4577005o0033069m2504859k9404955k0491031j4572664
12822F0984158j0599347p830140n929325m666959m003274l559684l113967k616813
12814A8664649k220862j919402j619282j377275j188532r91031q05116o98141
12806G845008n92290n21957m85006m45959m25015l90104l67799l25146k61686
12797D030046k41728k08474j89043j79114j72443j58773j57319j37488j31256
$$ plain form
12853 7911820 8680368 9521998 10511985 11621729 12883268 14428851 16368815 18763844 21665226
12844 21665226 25166147 29236414 33898555 39616200 47174730 57530135 71945417 92244299
12836 92244299 121120257 162254548 218914184 290605867 365393731 401505287 369386213
12829 369386213 302567741 227990736 167957667 125452808 96047853 75556822 60984158
12822 60984158 50384811 42554671 36625346 31958387 27955113 24395429 21281462 18664649
12814 18664649 16443787 14524385 12905103 11527828 10339296 9348265 8543149 7845008
12806 7845008 7252718 6730761 6245755 5799796 5374781 4984677 4616878 4291732 4030046
12797 4030046 3788318 3579844 3390801 3211687 3039244 2880471 2723152 2585664 2454408
12788B454408j55439j20196j01216j12283r0012n2086n1761q3490p7502o0541
12778A549882n4068n4409o9016l5521l0690n777M022k2636l6058m8344n4301j7614
12766A125470m7289m5215k7721j7851k5433l1850k6732n1542m6513k9422l7576
12755G38326P954L0918r671j0863l9418n4631m8419k5022j4620n257J5845J0496
12743E95638j7698j0157q263k5392j2325j081l588L826l5636m4713k8664n203
12731D06744J5681L0526Q385m053j7488N449J0615J4852K1869k3328j8996J520
12719D51776k0888K751M7438O917J9077K2395M8331P7296P4005R9598K8796n2584
12707H04908q4417j09944j21548j35191j09235m0939K4586N4577P7850Q1030P7480
$$ plain form
12788 2454408 2298969 2178773 2077557 1965274 1875262 1823176 1771415 1687925 1610423 1549882
12778 1549882 1495814 1441405 1372389 1336868 1306178 1300401 1304423 1281787 1245729 1197385 1143084 1125470
12766 1125470 1078181 1032966 1005245 987394 961961 930111 903379 851837 805324 775902 738326
12755 738326 746280 777198 767527 756664 717246 662615 614196 589174 574554 569297 585142 595638
12743 595638 577940 567783 559520 534128 521803 520722 517134 520960 485324 440611 411947 406744
12731 406744 422425 452951 461336 457283 439795 445244 455859 470711 492580 469252 450256 451776
12719 451776 430888 433639 481077 487994 507071 529466 577797 655093 729098 828696 857492 804908
12707 804908 720491 610547 488999 353808 244573 203634 228220 282797 360647 441677 519157
12696E19157R5614J25121R6765J3641n1267j07103j40106q2691o0995l1413m5918
12685C30805m2436j5584r418j1125k1868j6917l7933n5509k3383Q64L3475P8905
12673B09876L4920K5807K8496j335J9607J1966J0420k5501q750J3114O523P885
12661C33028L3204P3021P9550O9921K1380m7325r2847o3789l2439j3708k1850
12650C38146j7567n377j986K0042k2729k1791j184O445M3165J9739M372L699l6483
12637C28491l2970j4978k6517l8306l1728k0294j1395J0632q043P4j7347l586
12625A34033j8578k2525P459J4711J6212K2877n744k1378q841j8320l867k673
12613I3366J3439J2269Q727M196k8731P575m00m7734J7056K6066m691j0997j2258
$$ plain form
12696 519157 614771 739892 836657 850298 799031 691928 551822 469131 408136 376723 330805
12685 330805 288369 272785 263367 252242 230374 213457 175524 120015 96632 97496 130971 209876
12673 209876 244796 270603 299099 297764 317371 329337 339757 314256 305506 318620 325143 333028
12661 333028 366232 439253 518803 588724 610104 562779 469932 406143 373704 359996 338146
12650 338146 320579 315202 313216 333258 310529 288738 287554 293999 337164 356903 361275 364974 328491
12637 328491 295521 280543 254026 215720 183992 163698 152303 162935 154892 154966 137619 134033
12625 134033 115455 92930 100389 115100 131312 154189 148445 127067 118226 99906 96039 93366
12613 93366 106805 119074 127801 131997 103266 110841 110441 62707 79763 105829 101138 90141 77883
12600G7883P92J1703P615K829K5J0183K559l18j1585L114J6626m386k1008Q855
12586A04887K4880K1722p200m987J5151K3924L736m7098l1519K373K4296J9205
12574A49370j7660j6094q386J9962k952m787Q440J485j4760k2509J4324L5484
12562A41917n959l6802q584K038Q754j7266K068J5901J5514j9620j5354j6912
12550F5695J5437Q704n844J4371J1882J230L0340k2k127k6611k3408j5011j1172
12537F3464K2793J7595J937J957J7579l0871k1911k5814k5554l7086k3853M964
12525c4800L8957J7060j8672K4594J2597J1981K682K829P013j611K1001n079j8332
12512F0220o760l955j5803J5582M894Q681j325k1073j2044L0598J8327q926j6653
$$ plain form
12600 77883 78675 90378 97993 100822 100847 111030 113589 113271 101686 104800 121426 117040 96032 104887
12586 104887 129767 151489 144289 139302 154453 178377 182113 135015 103496 105869 130165 149370
12574 149370 131710 115616 107230 127192 124240 119453 127893 129378 114618 92109 106433 141917
12562 141917 135958 99156 90572 92610 101364 84098 86166 102067 117581 97961 82607 65695
12550 65695 81132 89836 83992 98363 110245 111475 141815 141793 139666 113055 89647 74636 63464
12537 63464 86257 103852 105789 107746 125325 94454 72543 46729 21175 -15911 -39764 -34800
12525 -34800 4157 21217 2545 27139 39736 51717 54399 57228 64241 62630 83631 78552 60220
12512 60220 53460 49505 33702 49284 54178 62859 61534 40461 28417 59015 77342 68416 51763
12499E1763k0841m103M7497M5777k9563k1755k2933J9208Q223J9355L9197j5408
12487A16417k7870q932j9353j5337P120K4016K3729j2851j105j040j0488O935
12475H1241K7912r931j5119j1352K3076k5079n999M475k4283l8054J1200L846
12463B1933J1611P535K9038k161N073q368J144R290j5881L771j2044j667k4914
12450B4360N43M6070P253K613k2308j4408K2395K2530m848J9805J7850j6251N686
12437A11290K82r205j815O109K3492n003j6279m534M590m62j0083j4831k387J269
12423H2433j5187k134M1103J0265k374j6699J7404j6829j9094J2463K3343O560
12411A21254q969k443k5216j7079Q938Q302L1525N016j3627j4579P377j4296O176
$$ plain form
12499 51763 30922 26819 74316 120093 90530 68775 45842 65050 73273 92628 131825 116417
12487 116417 88547 79615 60262 44925 52045 76061 99790 86939 85834 84794 74306 81241
12475 81241 109153 99222 84103 72751 95827 70748 64749 69224 44941 6887 18087 21933
12463 21933 33544 41079 70117 67956 73029 64661 65805 75095 59214 62985 50941 49274 24360
12450 24360 24903 70973 78226 80839 58531 44123 66518 89048 84200 104005 121855 105604 111290
12437 111290 111572 102367 100552 106661 130153 125150 108871 104337 108927 108465 98382 83551 81164 82433
12423 82433 67246 65112 106215 116480 114106 97407 114811 97982 78888 91351 114694 121254
12411 121254 112285 109842 84626 67547 76485 84787 116312 121328 107701 93122 100499 86203 92379
12398I2379K6405l0576J023O461l0593J7577L0628J0972o701L243k431K624r763
12385A11248j1686p6L380N574J2991K565K3469K0124K7124J7334o160J2117K9148
12372B47152L1895k005P91L0007M4501O1696P0496Q4645J53922J86335K13457
12361A122892K90214L17254J77209p1919k35537k83641k71699k05196j86227j28917
12351E24433q1987l9233l3898l7733j9454l8067m4462m6421j7979j6157j2915
12340A36127J5938m774L420P11k6150j6407J2204K437J1292k9267Q87K3592p9
12327A29931r726j2863j6302j1239J9519P170J7189l5179j2569L7626J0367j6937
12315A06987J8824K7110j9499l509K1222p487J0269J1742k4149l7502K9j8415
$$ plain form
12398 92379 118784 88208 89231 95692 65099 82676 113304 124276 117575 120818 118387 121011 111248
12385 111248 99562 99486 102866 108440 121431 123996 147465 167589 194713 212047 205887 218004 247152
12372 247152 279047 277042 277833 307840 352341 414037 484533 569178 723100 909435 1122892
12361 1122892 1413106 1730360 1907569 1835650 1600113 1316472 1044773 839577 653350 524433
12351 524433 442446 403213 369315 331582 312128 274061 229599 183178 165199 149042 136127
12340 136127 152065 147291 150711 151422 125272 108865 121069 123506 134798 105531 106418 130010 129931
12327 129931 120205 107342 91040 79801 99320 106490 123679 88500 75931 113557 123924 106987
12315 106987 125811 152921 133422 129913 151135 143648 153917 165659 141510 104008 104037 85622
12303H5622q683J1164O169L38j5537q863L4867o502p834N404R756j0506k1418
12290G3977K1607k1451K01P06J1841K6690Q306K8271K5950j3874l1494j2537j0813
12277A07380J4800j5133J4511J1819M888j0147n1281j6933L0990K0674J0837J5903
12265A38308L544j157j0693j559n790o829K6034N834m998j9558P975J6865o56
12252A47320j7055l3083J5334J8762L6744J1605l6524j6965J4278M302R28R745
12240A55391j9909r42j6565J2285L5970j1099k9423J0385J4647j6781j9453J6607
12228A31113O004O151J5424o692n087j7665j0194P76M388P555k1766R22K7330
12215A38259J7285L0114R320j5612r113p77k9022j5555J0114m51J1213Q755L194
$$ plain form
12303 85622 76939 88103 94272 94610 79073 70210 105077 98575 90741 96145 105901 95395 73977
12290 73977 95584 74133 74334 75040 86881 113571 121877 150148 176098 162224 130730 118193 107380
12277 107380 122180 107047 121558 133377 138265 128118 76837 59904 90894 111568 122405 138308
12265 138308 141852 140695 130002 128443 122653 115824 141858 147692 142694 123136 131111 147976 147320
12252 147320 130265 97182 112516 131278 168022 179627 143103 126138 140416 144718 145646 155391
12240 155391 135482 134540 117975 130260 166230 155131 125708 136093 150740 133959 114506 131113
12228 131113 137117 143268 158692 152000 146913 129248 119054 119830 124218 131773 110007 110929 138259
12215 138259 155544 185658 194978 179366 170253 169476 140454 124899 135013 134562 145775 154530 157724
12202A57724J815r829j5497J3835R414J1513J301J4409J6315k6488p565l02N408
12189A72053n249K0950K4163J3023J1707J0677R774J1225j290p234n993j7720
12177B36086N135K5627K0559j6031l0208k6209O687J9433m265n1025J4933L5257
12165B35979J1172k2835j7322J0433q100j2884J5662k6124r727K5516J6539j626
12153B16683J1022K3453L0784j21k0732k8895k1959J2667J1471K965k1759l406
12141B12173K9915J4579j2683J7476J7233j5574q181n605j1377J5445q54j4261
12129B38286p33L1095L219j8341J5523J5763J3875j2778o354L5814N685K188q74
12116C22368j4147j636O492J8492K7344j3728k8500j4805k0577J5706N797J4089
$$ plain form
12202 157724 159539 149710 134213 148048 157462 168975 170276 184685 201000 174512 166947 166645 172053
12189 172053 166804 187754 211917 224940 236647 247324 257098 268323 267033 259799 253806 236086
12177 236086 241221 266848 287407 271376 241168 214959 221646 241079 236814 185789 200722 235979
12165 235979 247151 224316 206994 217427 209327 196443 212105 185981 176254 201770 218309 216683
12153 216683 227705 251158 281942 281821 261089 232194 210235 222902 234373 237338 215579 212173
12141 212173 242088 256667 243984 261460 278693 263119 254938 249333 237956 253401 252547 238286
12129 238286 237553 268648 271867 253526 269049 284812 298687 285909 279555 315369 321054 323242 322368
12116 322368 308221 306585 313077 331569 358913 345185 316685 301880 281303 297009 302806 316895
12104C16895K1941K5331M449p490P92J1015O348j0709j5018J56J534K1796r66
12091C76074Q253K4112r652Q848k275Q507K1742j207l538P325j626N788k5575
12078D16776R1r9J3393K6680l625k0332K989J0162K916j530K9601J7090R734J5346
12064E19192J6847n208k5863N588J7455l88M319K2504K2136K5995J3766J7063
12052F33406J995L252r285k0423J3116J9228J4782K4965L6324k8747j6114K0198
12040F92697j3946R901L3697K8425L8055J7830j4229J1614r772J9897j282M767
12028H17654J0002J4787J3986K3457M5471J1284j1967P475K2020K0819J0539K6630
12016A012157J8334M1150J1273j4063r352K9558M3636M1981M5560J8656J955k5926
$$ plain form
12104 316895 338836 364167 368616 361126 361918 372933 379281 368572 353554 353710 355244 377040 376074
12091 376074 384327 408439 398787 407635 405360 413867 435609 434402 430864 438189 436563 442351 416776
12078 416776 416867 416768 430161 456841 453216 432884 435873 446035 448951 447421 477022 494112 503846 519192
12064 519192 536039 530831 504968 510556 528011 527623 531942 554446 576582 602577 616343 633406
12052 633406 635401 638653 629368 608945 622061 641289 656071 681036 717360 688613 672499 692697
12040 692697 678751 688652 722349 750774 788829 806659 792430 804044 794272 814169 812887 817654
12028 817654 827656 842443 856429 879886 925357 936641 924674 932149 954169 974988 985527 1012157
12016 1012157 1030491 1071641 1082914 1068851 1059499 1089057 1132693 1174674 1220234 1238890 1240845 1214919
12004A214919L488M0138K4843L4103M1518J2786M8584M5386R572K5163K5139M8947
11992A574586M2130N2071M4024J5503P757M7673O1466L7231L3353L5897N4529
11981B006220M0815N1934K5815N3279R0286N7812P8982L4028M0612P1866N8877
11970B610526M8177Q3696P0398L7526M6787M9950O3554J19359J07554R2453Q1374
11959C411354P8951Q0849R3887P1997J02187J39298J40512J45993Q7103R8477
11949D450608J45005J53443J28992J50422J36434J38112J35726J55680J63335
11940E757757J72607J38971J53726J59191J26187J61244J33480J40094J65742
11931G108999J51504J61829J28800J46101J56938J35810J35410J20859J18377
$$ plain form
12004 1214919 1218407 1258545 1283388 1317491 1359009 1371795 1420379 1465765 1475337 1500500 1525639 1574586
11992 1574586 1616716 1668787 1712811 1728314 1736071 1783744 1845210 1882441 1915794 1951691 2006220
11981 2006220 2047035 2098969 2124784 2178063 2268349 2326161 2405143 2439171 2479783 2551649 2610526
11970 2610526 2658703 2742399 2812797 2850323 2897110 2947060 3010614 3129973 3237527 3329980 3411354
11959 3411354 3490305 3571154 3665041 3737038 3839225 3978523 4119035 4265028 4352131 4450608
11949 4450608 4595613 4749056 4878048 5028470 5164904 5303016 5438742 5594422 5757757
11940 5757757 5930364 6069335 6223061 6382252 6508439 6669683 6803163 6943257 7108999
11931 7108999 7260503 7422332 7551132 7697233 7854171 7989981 8125391 8246250 8364627
11922H364627J19749P7999O3993P0237P3032P2653J5727L1756J4751j2015k8764
11911H863745k6751l9013n5012l1035p6988r0346p3466r6328j01210q1191r2628
11900H099777j19338j43437j41225j31900j49157j69763j38520j22537j26863
11891F857037j25928j53974j61580j53144j46713j15085j30337j10388j39630
11882E620258j67877j53725j21438j25075j06316j20459r7144r9825j05342j17798
11872D405259r2740j13085j22500j06646q9629r4063r7993q6847j13434r5974
11862C392348p9746o2170m9555p4909p1577p8252q7855j08845r5524o2101k0870
11851B600944n9803q0350m8348k2044m9623o9580p2851q8645n5094j5944k4560
$$ plain form
11922 8364627 8484376 8562375 8626368 8696605 8769637 8842290 8858017 8889773 8904524 8892509 8863745
11911 8863745 8836994 8797981 8742969 8711934 8634946 8544600 8471134 8374806 8273596 8192405 8099777
11900 8099777 7980439 7837002 7695777 7563877 7414720 7244957 7106437 6983900 6857037
11891 6857037 6731109 6577135 6415555 6262411 6115698 6000613 5870276 5759888 5620258
11882 5620258 5452381 5298656 5177218 5052143 4945827 4825368 4728224 4628399 4523057 4405259
11872 4405259 4312519 4199434 4076934 3970288 3880659 3786596 3688603 3601756 3488322 3392348
11862 3392348 3312602 3250432 3200877 3125968 3054391 2976139 2888284 2779439 2683915 2621814 2600944
11851 2600944 2541141 2460791 2412443 2390399 2340776 2271196 2198345 2109700 2054606 2038662 2014102
11840B014102n5588m2329n1106l6832j9420k2285l7721o0103l1550j4883m9698
11829A592587m2570k5111l7291k631l2817n6288m2236j8361l221n5624n5646N633
11817A226424O413j4987l5013k0540l620j3611n374l8530m9403l1410k0068k8284
11805I71997l1214j5870k3537j085Q699r06j5403j0698l5667P151J7475k8425
11793H42517m7521j6285l0440N076n59N87n620j6037k7762r832r041J0151j1083
11780F84151m2155q809n639l89k1939j7281R522q65k0044j1630J0700l027j3621
11767E58974j795N13M669q179r374j0410k5582j8447j4912J2003j1514j9072K468
11754D59342J8477J5320k650j9129k1016l6118J513J7346J5027l829l5287M341
$$ plain form
11840 2014102 1958514 1916185 1865079 1828247 1808827 1786542 1748821 1688718 1657168 1642285 1592587
11829 1592587 1550017 1524906 1487615 1484984 1452167 1395879 1353643 1335282 1332061 1276437 1220791 1226424
11817 1226424 1232837 1217850 1182837 1162297 1158677 1145066 1139692 1101162 1051759 1020349 1000281 971997
11805 971997 940783 924913 901376 900291 908990 908084 892681 881983 846316 853467 870942 842517
11793 842517 794996 778711 748271 753347 752788 753375 747755 731718 703956 694124 685083 695234 684151
11780 684151 641996 633187 627548 627159 605220 587939 597461 596596 576552 564922 575622 572595 558974
11767 558974 557179 557692 562361 554182 544808 534398 508816 490369 475457 487460 475946 456874 459342
11754 459342 477819 493139 490489 471360 450344 414226 415739 433085 448112 444283 408996 413337
11742D13337J5064P996M071j0464o921r705m0583k2386o210k457j2795k8506l640
11729B96801J01N328j1459j2047j780J31L1023j4995K248K9693K2980Q667p281
11716C49410m9499k9346J0957L1825K1083j8607l9905k0223O981o034Q162J9308
11704B84112l1955o364r168J6512J2322j1644J3308j7457j9361J5602J8399J9535
11692B83841K3911m255k8757p744Q241J681j1923J065M249k8786k9230O775m729
11679B14339l6475k349K5497M4596j970k1835n2907L809K6535R852r371N445m970
11666B00196J114j0847R73j6302k3693j0362M408R470M013M841j8040K736L2384
11653A80891K2531J9304k1422O37l953N119J0259M8093K1622L1672N4372O5848
$$ plain form
11742 413337 428401 436397 440468 430004 423083 413378 372795 350409 344199 341742 328947 300441 296801
11729 296801 296902 302230 290771 278724 276944 277075 308098 293103 295351 325044 348024 356691 349410
11716 349410 299911 270565 281522 313347 334430 315823 275918 255695 262676 256642 264804 284112
11704 284112 252157 245793 236625 253137 265459 253815 267123 249666 230305 245907 264306 283841
11692 283841 307752 303497 274740 266996 275237 276918 264995 266060 270309 241523 212293 219068 214339
11679 214339 177864 175515 201012 245608 243638 221803 168896 172705 199240 209092 199721 205166 200196
11666 200196 201310 190463 191436 175134 151441 141079 145487 154957 158970 163811 145771 148507 180891
11653 180891 203422 222726 201304 201941 197988 203107 213366 261459 283081 314753 369125 434973
11641D34973Q3016p18m6529l6957n8339l1627k3795k5256k6370l1740j6115r104
11629B11439l0569j8736p417J6094k143l922K591P419j8712j7176j034N526K0583
11616A63943Q181l1404j3672m67j5046J4191K1933K617j8728J3856K1013Q70j1378
11603A55909j6448j9922p256m387Q562K3030J570l449j4937m271K2575R478k0903
11590A29551j5051J3326j6579N027K0946k927k1157O429j0369m1329J1323J3669
11578I2859j2385J0030j0872l124P375j5203J9721M1750J7210J7976r567j3683
11566A42087j0239j6407j0396m42Q54l0082l632L1172J9943M492j0660k7098k7510
11553F2082N962n518j4478j1064m474K2219L9958q449J376j4974L3087K4126k2556
$$ plain form
11641 434973 517989 517271 470742 433785 375446 343819 320024 294768 268398 236658 220543 211439
11629 211439 180870 162134 154717 170811 168668 164746 167337 174756 156044 138868 137834 143360 163943
11616 163943 172124 140720 127048 126581 111535 125726 147659 150276 131548 145404 166417 167287 155909
11603 155909 139461 119539 112283 107896 116458 139488 141058 137609 122672 118401 140976 150454 129551
11590 129551 114500 127826 111247 116274 137220 134293 113136 119565 109196 67867 79190 92859
11578 92859 80474 90504 79632 76508 83883 68680 88401 130151 147361 165337 155770 142087
11566 142087 131848 115441 105045 104603 105457 75375 71743 102915 122858 127350 116690 89592 62082
11553 62082 68044 62526 48048 36984 32510 54729 94687 86238 87614 72640 105727 129853 107297
11540A07297m4051j9285r23L4444L0781K935m717p438l0973p201K2146J5170j3069
11527H5116r190O604j0487J0621k901K5211K1852j6282j9847Q256J9530Q596o343
11514A20736L070m558o175j3700n4392J04K8374J7394o66l8816k3815q90J1156
11501C7822J8430J5154J7559N025j540K1837n655k6382j4173J4575L013K1527
11489A07192L448n1031j8746J6981l984n404K2204j445j0650r027J2993P488j7123
11476E2896L39P880J231k2356k1492O443J8504J2734J4950n897L2820n357l4890
11463E7805j3492q334K873M374N274m456m704j1740k507J4047K0582q74j1963
11450D6885j8294n260J0815J3895J5280J1039K0431J0016q573k1627k0565j070
$$ plain form
11540 107297 63246 43961 43038 77482 108263 111198 106481 99043 68070 60869 83015 98185 85116
11527 85116 75926 82530 72043 82664 79763 104974 126826 110544 90697 98953 118483 127079 120736
11514 120736 123806 119248 113073 99373 44981 45085 73459 90853 90187 51371 27556 26666 37822
11501 37822 56252 71406 88965 93990 92450 114287 108632 82250 68077 82652 85665 107192
11489 107192 110640 59609 40863 57844 53860 48456 70660 69215 58565 49538 62531 70019 52896
11476 52896 53235 61115 62346 39990 18498 24941 43445 56179 71129 65232 98052 92695 57805
11463 57805 44313 35979 38852 43226 48500 44044 39340 27600 25093 39140 59722 58848 46885
11450 46885 28591 23331 34146 48041 63321 74360 94791 104807 96234 74607 54042 52972
11438E2972P360q361O749J9068j8902J0449l918j2406J2009j0616k8860M890Q719
11425C9153L1794L378r937J4952Q142m838m500j2516P913J6687k3783l49P994
11412G4090r105j1049L551o110k0090j833J2769p83O741J0935q46j6109J3113
11399E5274J6090l518L949j9679j3345J2779K4840n395j6329k5907N716L973K0576
11386E9024J620l9900j2905L0085M9111j7322j8690p502O997M073Q138K26P09
11373F3664J7719m17J2812o287l0794q646L862L516N458N761j4597k0931QK5732
11359E6860R3k9048m0397k2747J7026K0718L1391L3910J582j7908j8490j533k102
11346B9355j6462J6385o271j2231P104M127K4129J552j0905q72J8462K3643j8971
$$ plain form
11438 52972 60332 51971 58720 77788 58886 69335 65417 53011 65020 54404 25544 30434 39153
11425 39153 70947 74325 64388 79340 87482 82644 78144 65628 73541 90228 66445 66096 74090
11412 74090 64985 53936 57487 51377 31287 29454 42223 41440 48181 59116 58270 42161 55274
11399 55274 71364 67846 71795 52116 38771 51550 76390 70995 54666 28759 34475 38448 59024
11386 59024 60644 20744 7839 37924 87035 69713 51023 43521 50518 54591 62729 62955 63664
11373 63664 81383 80966 93778 87491 56697 48051 51913 55429 60887 66648 52051 31120 31128 56860
11359 56860 56953 27905 -12492 -35239 -18213 2505 33896 67806 69388 51480 32990 31457 29355
11346 29355 12893 29278 23007 10776 17880 22007 46136 47688 36783 35911 54373 78016 59045
11333E9045j3546J5627j0013j0740L726K2987L3221j9011j8296j9979j4253R383
11321C8151p14m557J2671r158J1235j3466n0821p001j26Q4L8428J1909j4819k793
11307I023P885K9330n640l1462j0294L946M767k4567m940L562J2651K6511K6779
11294D7551R128M80l862O665K1936j4578k2070J5722o091k1892M369J3017L680
11281E4055l1961k6175P351J957k4230j1705M5982J9451k406j9848O741j6706
11269B506j5245J7238m216K0047m679R035k635N055o242q875J405K8904J1789
11256E4087j3624j8278K2048l66p521o746k411k6929K5733L3193n773K133N4j876
11242E3724K67j2262k6078j9932K7109Q462l385Q806k8222l24L8917K6094j9307
$$ plain form
11333 59045 45499 61126 51113 40373 44099 67086 100307 81296 63000 43021 28768 38151
11321 38151 37437 32880 45551 36393 47628 34162 -16659 -23660 -23786 -23702 14726 26635 11816 9023
11307 9023 16908 46238 40598 9136 -1158 2788 7555 -17012 -21952 -18390 -5739 20772 47551
11294 47551 56679 57159 53297 59962 81898 67320 45250 60972 54881 32989 37358 50375 54055
11281 54055 22094 -4081 3270 5227 -19003 -30708 15274 34725 32319 12471 19212 2506
11269 2506 -12739 4499 283 20330 15651 24686 22051 27106 20864 11989 13394 42298 54087
11256 54087 40463 22185 44233 43867 36346 29600 27189 260 25993 59186 53413 55546 55600 53724
11242 53724 53991 41729 15651 -4281 22828 31290 27905 36711 8489 8165 47082 73176 53869
11229E3869l7898m604J4748J2567N633n618j5031j3480J7203M881k9496l1467
11217b8693Q842J3359j3876J8655M8636J6970j0317j3037P298o855K4813Q325
11205G4120K709k665J1730l1085j3299Q121L645j735L675j2400n100J3701J2566
11192F3983L51j5571p509N244O856p921P452J2419j2400k9569O335J8013J300
11179D8983K2692J7729j9480j2568p699k8410l3805O80K6039L0634J3981J0548
11167F9324L68n881n284j4638j6785L1588q89j9248k6814J0937N979m492q847
11154A5318J3322J9221R909O869K9374p895j6129o669k6104k0948m112m604j6564
11141i012J2976J6982O715j1810j4409R17N457O689P339j0809J8571K2792K0877
$$ plain form
11229 53869 15971 11367 26115 38682 44315 38697 23666 10186 27389 32270 2774 -28693
11217 -28693 -19851 -6492 -20368 -1713 46923 63893 53576 40539 47837 40982 65795 74120
11205 74120 76829 74164 85894 54809 41510 49631 53276 51541 55216 42816 37716 51417 63983
11192 63983 64334 48763 41254 46498 53354 45433 52885 65304 52904 23335 29670 47683 48983
11179 48983 71675 89404 69924 57356 49657 21247 -12558 -11878 14161 44795 58776 69324
11167 69324 69692 63811 58527 43889 27104 58692 57803 38555 11741 22678 28657 24165 15318
11154 15318 28640 47861 57770 64639 94013 86118 69989 63320 37216 16268 12156 7552 -9012
11141 -9012 3964 20946 27661 15851 1442 2359 7816 14505 21844 11035 29606 52398 73275
11128G3275m1711k602J2407j0724J4465j0766J0622K5828o268j2504r939k3690
11116A8393j3148K530J7172K4130J0280j8839k7470q66P120L2035Q401j2028j5264
11103C2446j9491L832j4885k743P826L8581J236j5688j3579J6927K2250j1853
11091D4859K734j2164j5183j8868o59J6340K095k061J0109L399J3371J5402r339
11078E0035k1393j1063j565O427J4064K6567O093j3863l4293j6299J4708J371
11066B0789k3060R691K6628K1831J7449j5900l1463k3214J8950J8100N397J0717
11054E5915J8322O744K2413J7334k214p361J6614J660M5280N4122J9761m084k2319
11041B22187J069n302l7759k0209K2304J9896L9731M6125L2596J0549R53q451
$$ plain form
11128 73275 31564 28962 41369 30645 45110 34344 44966 70794 64526 52022 42083 18393
11116 18393 5245 7775 24947 49077 59357 40518 13048 12182 19302 51337 59738 47710 32446
11103 32446 12955 16787 1902 -841 6985 45566 46802 31114 17535 34462 56712 44859
11091 44859 47593 35429 20246 1378 719 17059 19154 17093 27202 30601 43972 59374 50035
11078 50035 28642 17579 16014 22441 36505 63072 69165 55302 21009 4710 19418 20789
11066 20789 -2271 7420 34048 55879 73328 57428 25965 2751 21701 39801 45198 55915
11054 55915 74237 80981 103394 120728 118514 111153 127767 129427 174707 228829 248590 244506 222187
11041 222187 223256 217954 180195 159986 182290 202186 241917 288042 320638 331187 332140 323689
11029C23689k4258k5017k344J8014J3286K7782N7476Q7939P0311J9191m4075p4458
11017D47536o0221n9693l4335M508J3318K8506K7457J8778J4308n439m8411o0829
11005B85483m3169k3202J6629p507j9307j567L3329J8010R44k7748m8790j3330
10993A69775m2891l4619n661j1926k1497n136K014M039K0061J1400k0462p286
10981E7811Q648j3849l5127k4253K6193k78j89m072K862K9151K3218m30k3982
10968D5703k5041J3969J2631k142m6318p960K7844L2190J5012J926m051j1013
10956E2750m85q563j6188J4621L667j2843K3626j6340j2958L629j574J217Q172
10943C8731k528Q017r722k8304k7757K549J6545L0592K0850L2385m484j8889q753
$$ plain form
11029 323689 299431 274414 272070 290084 303370 331152 388628 476567 546878 566069 521994 447536
11017 447536 387315 327622 293287 297795 311113 339619 367076 385854 400162 394723 346312 285483
11005 285483 242314 219112 235741 228234 208927 207360 240689 258699 259643 231895 183105 169775
10993 169775 126884 92265 86604 74678 53181 48045 50059 54098 74159 85559 65097 57811
10981 57811 66459 52610 17483 -6770 19423 19145 18956 14884 17746 46897 70115 69685 45703
10968 45703 20662 34631 47262 45120 -1198 -9158 18686 50876 65888 67814 63763 52750
10956 52750 52265 43702 27514 42135 45802 32959 56585 40245 27287 30916 29342 30559 38731
10943 38731 36203 44220 34498 6194 -21563 -19014 -2469 28123 48973 81358 76874 57985 49232
10930D9232P715p50k1538Q628J0942o809j1083n979J9558k803Q770M566l446J0899
10916F7902j0140O846m321k8144j7999m469j2949K0263L4081R742N056j6156j5346
10903C4366p483j750J884N984J4849J0696Q467j6380p082O327k397O596J722j6673
10889C9126j4618P501J284r725O570n737J9328J6877q486j5300j191l742m474
10876B7413j8714P40N332K7690K5640N171q969j9456n937Q869K1655N689m447
10863G0676r198R654J2609o30J0618K4500Q874J775p397m7898q321r181J8740
10850G4821L1106K9357J4138j1208j5267j8075j2444o705j8725k3597R633K8960
10838H1994l238J4226k674l430r846L292r966k558L714P607k498N404k3951j7211
$$ plain form
10930 49232 56947 56197 34659 43287 54229 47420 36337 30358 49916 47113 55883 60449 57003 67902
10916 67902 57762 64608 60287 32143 14144 9675 -3274 16989 51070 60812 65868 49712 34366
10903 34366 26883 25133 27017 33001 47850 58546 67013 50633 43551 49878 47481 54077 55799 39126
10889 39126 24508 32009 33293 23568 30138 24401 43729 60606 52120 36820 35629 31887 27413
10876 27413 8699 9439 14771 42461 68101 73272 64303 44847 38910 47779 69434 75123 70676
10863 70676 61478 71132 83741 83111 93729 118229 127103 128878 121481 73583 65262 56081 74821
10850 74821 105927 135284 149422 138214 122947 104872 92428 85723 66998 43401 53034 81994
10838 81994 78756 92982 90308 86878 77032 80324 70358 67800 71514 79121 76623 82027 58076 40865
10824D0865O190J1520K416j3281N043R833k9327J3587J8495o593p919J0240K828
10811F3897k0021O270J4854k282n559O665L717N368l650j5141r481j144r139l947
10797C0407J2296L590j1810r512L299p374O483J4023R231J3219J2583j1807k032
10784F2596M032J364r815k2150n543M556M629k6126r216J3582O465p577J0699
10771B7496K7439N127m6045l2933k077J7421j019J2268J5798M366p424J4285N766
10758D0468j1756K2561L7993k4682l0665N305K4648Q450p299j2337J7086M3030
10746A12802J8822j4928j3113K94K3201l544j3454j0434J1361q835l017M0349
10734A39504K3712K1667K2713P220j1544l5564j7682J48q125l7933l9552L0073
$$ plain form
10824 40865 47055 58575 60991 47710 52753 62586 33259 46846 65341 58748 50829 61069 63897
10811 63897 43876 50146 65000 62718 57159 63824 67541 72909 69259 54118 44637 43493 34354 30407
10797 30407 42703 46293 34483 24971 28270 20896 27379 41402 50633 63852 76435 64628 62596
10784 62596 66628 67992 58177 36027 30484 35040 39669 13543 4327 17909 24374 16797 27496
10771 27496 54935 60062 14017 -18916 -20993 -3572 -4591 7677 23475 27841 20417 34702 40468
10758 40468 28712 51273 89266 64584 33919 39224 63872 72322 65023 52686 69772 112802
10746 112802 131624 116696 103583 103877 127078 123534 110080 99646 111007 102172 99155 139504
10734 139504 163216 184883 207596 214816 203272 167708 150026 150174 142049 104116 64564 94637
10722I4637Q137K9210M7140L5120K9266M78m6214n6513m6805l1240j0577j0441
10710D2198J9550L5856L4471N0081l150j6877j0930k0260j7389k138R658J087
10698A22157K8656J2885j2341Q532J8126J3197l2780j4343J7644M15q06l418K2622
10685A80546M753l7485j1824J6162N7014J5799p877K2847n715J7900j5985j0799
10673B25336J3083O868l3038q650L8169L8661L737J787n679K39M8808K2102L977
10660C55400o20J9073k02M14K5413J8156J5J5956L0534j0674J7482J4911K7249
10647E13107L1702L2283M2005M3302L3332L2885M6985L3008P5337R1523P4788
10636A050257M8916J04332J65450J97160J86445J78988J65571J80052J49712J62114
$$ plain form
10722 94637 102774 131984 179124 214244 243510 243988 197774 141261 94456 63216 52639 42198
10710 42198 61748 97604 132075 182156 179006 162129 151199 130939 113550 111412 121070 122157
10698 122157 150813 163698 151357 159889 178015 191212 158432 144089 161733 162148 161342 157924 180546
10685 180546 185299 147814 135990 152152 209166 224965 217088 239935 234220 252120 236135 225336
10673 225336 238419 245287 212249 203599 241768 280429 284166 285953 280274 280513 329321 351423 355400
10660 355400 354780 373853 373651 374065 399478 417634 417649 433605 464139 453465 470947 485858 513107
10647 513107 544809 577092 619097 662399 695731 728616 775601 808609 883946 975469 1050257
10636 1050257 1099173 1203505 1368955 1566115 1752560 1931548 2097119 2277171 2426883 2588997
10626B588997K13948L17689M41803O22260Q43177J123221J539459K040435K707039
10617A2438028L503951M114391M086599K951672J035474o57201j442513j218822
10609B4811579l05310J043879K675609M611576O740256Q363699Q076416M773851
10601F0791555k65745m242921n640848m766795k582342M5503K884643N902001
10593E2125051Q845227J0741486R536129L957578l591581q958014j0550293r048110
10585E3057473o207728l166588l27842K312617M614638N741049M520945M36621
10577F0981185m538875p737104q298673o933827m855746k846625j147323K04147
10569B4827159J168628J471320P61357r36060k821555l994097m149188l605311
$$ plain form
10626 2588997 2802945 3120634 3562437 4184697 5027874 6151095 7690554 9730989 12438028
10617 12438028 15941979 20056370 24142969 27094641 28130115 27472914 26030401 24811579
10609 24811579 24506269 25550148 28225757 32837333 39577589 47941288 56017704 60791555
10601 60791555 60525810 56282889 50642041 45875246 43292904 43338407 46223050 52125051
10593 52125051 60970278 71711764 81247893 85205471 81613890 72655876 62105583 53057473
10585 53057473 46849745 43683157 43355315 45667932 50282570 56023619 60544564 60981185
10577 60981185 56442310 48705206 40406533 33472706 28616960 25770335 24623012 24827159
10569 24827159 25995787 27467107 28228464 27292404 24470849 20476752 16327564 12722253
10561A2722253k818380k099657j548364j122843q28778o11507m88439l73365k95712
10552B535208k70804k33537j91311j85344j86563j47595q9974j35311j05543o8102
10542I21124m7100m3643n1923m5643m4288o9870o1900j6650j6783j5327Q111J7085
10530E33193l5994k1037l0210n6760m1326j4889p651m568K149j3788l0991j5474
10518B62654n273l0373j4197j0473N105N162j092Q758J6587L1388n754M755j1112
10505B56135l32J1452l2978k3107P911j8292k8710K746J042K0812r533l3357j2919
10492A40870k4311p37J6119K3652J0703q178l121k5606K112K5165K0801O82k026
10479A76125n128r019q338P819k175j6789l201j435J2792M0744Q603J8247N405
$$ plain form
10561 12722253 9903873 7804216 6255852 5133009 4304231 3692724 3204285 2830920 2535208
10552 2535208 2264404 2030867 1839556 1654212 1467649 1320054 1230080 1094769 989226 921124
10542 921124 874024 830381 778458 732815 688527 618657 556757 540107 523324 507997 516108 533193
10530 533193 497199 476162 445952 389192 347866 332977 325326 320758 322907 309119 278128 262654
10518 262654 257381 227008 212811 202338 207443 212605 211513 220271 236858 268246 262492 267247 256135
10505 256135 255803 267255 234277 211170 219081 200789 172079 174825 175867 196679 187146 153789 140870
10492 140870 116559 115822 131941 155593 166296 158118 154997 129391 131503 156668 177469 178151 176125
10479 176125 170997 161978 153640 161459 159284 142495 139294 137859 150651 191395 199998 218245 223650
10466B23650m1635l4296r596L81q858P379J3079n520J1588L9229M716j0048M009
10453A94078k5004j7907k4713l1888p65k269j8048j234L2966L4152n927l3324
10441A00117j6771k8972j1846J4042o473k4430J6302K4962K8884k871j5588k2582
10429E4774k1324N503n09l137j823j0946N42j0063j121K5345J5029M534R958K0749
10415H7511K1252J961n359l0433l304j7552j209l435j2832P795J1918j1090L161
10402D8384J6649J0123m587J2364p531J0991p25k6775j6211q037j8031J2381l3088
10389d093j3447J0941J0716L4236J7728J1174J3133J5517l1261l9639Q572R715
10377D3292k8211k1591J2726R929j1892M231J5222K3299k586j1548j8271j9788
$$ plain form
10466 223650 182015 147719 138123 138504 129646 137025 150104 144584 156172 195401 200117 190069 194078
10453 194078 169074 151167 126454 94566 93801 91532 73484 72250 105216 139368 133441 100117
10441 100117 83346 54374 42528 56570 50097 25667 41969 66931 95815 92944 77356 54774
10429 54774 33450 38953 38444 35307 33484 22538 23080 13017 11896 37241 52270 56804 66762 87511
10415 87511 108763 110724 105365 74932 71628 54076 52867 49432 36600 44395 56313 45223 48384
10402 48384 65033 75156 70569 82933 75402 86393 85668 58893 42682 34645 16614 28995 -4093
10389 -4093 -17540 -6599 4117 38353 56081 67255 80388 95905 64644 25005 33577 43292
10377 43292 15081 -6510 6216 16145 4253 8484 23706 47005 44419 32871 14600 -5188
10365e188q050j8980O431K7415j697q832m690K0164J1161J407k907N162P900o665
10351B2631k819M046k727j0859J3380L495o357n671K5826J265J9119r941k6018
10338B5370k2388J1532K435k1153R530J2184j9406n376J2171J7930J3505K4948
10326F1282J8469k9580m4885L353K4592O844k1684j3182N318O05r596J8871J8082
10313C8489j7643p262m799J9156L949j6016j2687J9047K8005j1228k3701P57P668
10300B3735K613j9517j7171J2103q215K373J5061o940k6451M624n30n33L1625
10287A2777J1357j3583j5166L829n20j3347J72K0331K1228N934O69N20j2869k3882
10273b550J2111J2987o227j4391j6401k2663J3619K5802R720J0142l05R196k8656
$$ plain form
10365 -5188 -13238 -32218 -25787 1628 -69 -8901 -13591 6573 17734 19141 16234 21396 29296 22631
10351 22631 19812 23858 21131 10272 23652 27147 20790 15119 40945 42210 61329 51388 25370
10338 25370 2982 14514 16949 -4204 5326 17510 -1896 -7272 4899 22829 36334 61282
10326 61282 79751 50171 5286 8639 33231 40075 18391 5209 10527 11132 1536 20407 38489
10313 38489 20846 13584 8785 27941 31890 15874 3187 22234 50239 39011 15310 16067 23735
10300 23735 26348 6831 -10340 1763 -6452 -4079 10982 4042 -22409 -17785 -18315 -18848 12777
10287 12777 24134 10551 -4615 -786 -1306 -14653 -14481 5850 27078 33012 33681 34201 21332 -2550
10273 -2550 9561 22548 16321 1930 -14471 -37134 -23515 2287 12007 22149 21844 31040 2384
10260B384j4281J0583O471J4271K5930J1741j5215j1659n043p032k5514J4529
10248G165j1268M943J2076j6429q719L7312R436k0451M5082l922j5795L160K8120
10235G0710J920N262j492j2860j0763j0073q712m53m155q112k7341J8612K2747
10222C5290n869l980j1394R473r440j34K074k4517k277O253R219m659k3110r035
10208c2106N205K1070r841j898J2725K523j027j5138J6260Q626K1760q03m466
10195B2890j6978K3063J3833j4720j3347k4799j4652K97J5958J5621L2821L2315
10183G2302J8736L2627M7544M339N342M8K763K2832j905l4762l442P368j542J29
10169A72379L3464M8320M8852N4291j0259l9471n9678l6171o950K2272J1424M8441
$$ plain form
10260 2384 -11897 -1314 5157 19428 45358 57099 41884 30225 25182 18150 -7364 7165
10248 7165 -4103 840 12916 -3513 -12232 25080 34516 14065 59147 55225 39430 42590 70710
10235 70710 72630 77892 76400 63540 52777 42704 33992 33539 29384 21272 -6069 12543 35290
10222 35290 29421 25441 14047 23520 14080 13946 16020 -8497 -10774 -4521 4698 39 -23071 -32106
10208 -32106 -26901 -5831 -15672 -17570 -4845 -2322 -3349 -18487 -2227 6399 28159 27356 22890
10195 22890 5912 28975 42808 28088 14741 -10058 -24710 -24413 -8455 7166 39987 72302
10183 72302 91038 123665 171209 175548 180890 180938 183701 206533 204628 169866 166424 173792 172250 172379
10169 172379 205843 254163 303015 357306 347047 307576 247898 211727 204777 227049 238473 286914
10157B86914M8571M9642N1444M9455j2038l1552p2841p0301n2133j1006J85o612
10145B29728J3125M1389O2388q134j0569j6917n7577q9344k0208j4945l1519J6445
10133A13862K4444J7547O479j528K774l2739n6695j4613k3815m4904J7026J2996
10121B0834N943J748j9234k0932M273K3486j1156J1520J8737K0524k4828j5017
10109A5898p609j8709j4644R258L1802J5225L417l5312l092K0033l262K065J1511
10096B6581k2225R975o870j0868L186J6355O078k2607j5583J1225P904r796j8678
10083b5323r168J0425l916K0720r047J2291K1293p898K827r001P056L2035J6736
10070E9030J125k0684j6602J3934j0440k551k789l3965k9137P732R20J0408q209
$$ plain form
10157 286914 335485 385127 436571 486026 473988 442436 369595 299294 247161 236155 236340 229728
10145 229728 242853 284242 346630 338496 327927 311010 253433 164089 143881 128936 97417 113862
10133 113862 138306 155853 162332 160804 163578 130839 74144 59531 35716 -9188 7838 20834
10121 20834 26777 28525 9291 -11641 -7368 16118 4962 16482 35219 55743 30915 15898
10109 15898 8289 -10420 -25064 -15806 15996 31221 34638 -674 -3766 16267 13005 15070 26581
10096 26581 4356 14331 7461 -3407 -221 16134 22212 -395 -15978 -4753 3151 -6645 -25323
10083 -25323 -34491 -24066 -27982 -7262 -16309 -4018 17275 9377 12204 3203 10259 42294 59030
10070 59030 60155 39471 22869 36803 26363 23812 21023 -12942 -42079 -34347 -33427 -23019 -31228
10057c1228r680o61J8103m712J8437N507r588P057R302q943N2J4754J3577j7800
10043D177k2327J2128J3668k2527J371J8419l867j4046K6246L4042M210k915k0286
10030B8293k2612r902R493J1180k2234k8481q690l279Q072q751j468K8921J2742
10017f716j7724j0233J9761J1500o299M587j680k5522j9688j984L3069J7349r197
10004a2777P844k629M002K2012n532n72J4184j133p960j8136k1949N709J8386
9991A449P331p509j1798R540O278k911k2701R668M921j9970j2635P801J5227q06
9977a6115j9817L916K2072J390j552k0764N218O23J0916M1524o690j8852k2810
9964b0941j4852Q677R524j3922k808k335K3098J299p792j7144j1360M5l90J4093
$$ plain form
10057 -31228 -40908 -41569 -23466 -28178 -9741 -4234 -13822 -6765 2537 -6406 -6354 8400 21977 4177
10043 4177 -18150 -6022 7646 -14881 -13510 4909 1042 -13004 13242 47284 51494 48579 28293
10030 28293 5681 -4221 5272 16452 -5782 -34263 -42953 -46232 -38160 -46911 -48379 -19458 -6716
10017 -6716 -24440 -34673 -14912 -3412 -9711 -5124 -6804 -32326 -52014 -53998 -20929 -3580 -12777
10004 -12777 -4933 -7562 -3560 18452 12920 12348 26532 25399 17439 -697 -22646 -16937 1449
9991 1449 8780 1271 -10527 -987 5291 2380 -20321 -10653 -5732 -25702 -38337 -30536 -15309 -16115
9977 -16115 -35932 -32016 -9944 -8554 -10106 -30870 -25652 -25029 -14113 27411 20721 1869 -20941
9964 -20941 -35793 -27116 -17592 -31514 -34322 -36657 -13559 -12260 -20052 -37196 -48556 -48511 -48901 -34808
9950c4808J2434m32j85M514J7591M1699J3581l1969j4629L32Q273l457j1904j0651
9936i611j3704J6397K1348j2832O234l011l8052n89J8227Q33K674L6182J2460
9923C6556q730k3843K283j5840J544J0587J2331J7194P816J468k7513q719q190
9910c056Q57n089Q867K1547p54k5077l625j160j1248L120J0972J8977N684m376
9896A5639J8496J203j8697n569m383p381q311j5126k148J1241O375J1351k3997
9883b1307K762p077K5754J3884j893K29L79j2659m609J5370P868K911R022J2655
9869D3289k0481l048j5768P346k6650L103K648Q984J7182l565j0592N664p056
9856A056l386P844r601j5497j013k182K3058K1933j4943k4173m496o09j6064Q093
$$ plain form
9950 -34808 -22374 -22806 -22991 -18477 -886 40813 54394 22425 7796 8128 16401 12944 1040 -9611
9936 -9611 -23315 -6918 14430 1598 7832 4821 -33231 -33820 -15593 -14760 -12086 24096 36556
9923 36556 27826 3983 6266 -9574 -8030 2557 14888 32082 39898 41366 13853 5134 -3056
9910 -3056 -2199 -7288 1579 23126 22372 -2705 -6330 -7490 -18738 -15618 -4646 14331 20015 15639
9896 15639 34135 35338 16641 11072 6689 -692 -9003 -24129 -26277 -15036 -8661 2690 -21307
9883 -21307 -18545 -25622 132 14016 12123 12352 12731 72 -4537 10833 18701 21612 30634 43289
9869 43289 22808 19760 3992 11338 -15312 -12209 -9561 -577 16605 13040 2448 8112 1056
9856 1056 -2330 5514 -4087 -19584 -20597 -22779 279 22212 7269 -16904 -21400 -22009 -38073 -29980
9842b9980P61J5858O259k912r111p829n257J4165R920j8081J1907K7834o039J6502
9828B3997R468r759k089K941J6740p714j870L854K166l9451k831j2629k4122J5214
9814b6085K1250r162p235P466O731J259Q481J5352M775k4655n616M205J627K975
9800A368L128P807j2817j5863R69K6946p680j5169k8878j4478K5321K8449J961
9787A064j0750o227j2112J1540P19Q627K3653Q611J0213J0771l9937j5696k6844
9774c6368j4740K0796R463k9466k656n757N481L776Q393l861J2673j15j603Q325
9760b5659N854n367P19M7285m883k9540N41K815K604N205k287J0436j8052m545
9746a4874l2826k3350j645K5714q134J2248L6742O143p272l843J6683Qm154o179
$$ plain form
9842 -29980 -29219 -13361 -7102 -10014 -19125 -26954 -32211 -18046 -8126 -26207 -14300 13534 7495 23997
9828 23997 33465 23706 21617 24558 41298 33584 31714 35568 37734 -1717 -4548 -17177 -41299 -26085
9814 -26085 -4835 -13997 -21232 -13766 -7035 -5776 2705 18057 22832 -1823 -7439 -3234 -1607 1368
9800 1368 4496 12303 -514 -16377 -15408 11538 3858 -11311 -40189 -54667 -29346 -897 1064
9787 1064 -9686 -15913 -28025 -16485 -15766 -7139 16514 25125 35338 46109 6172 -9524 -36368
9774 -36368 -51108 -30312 -20849 -50315 -52971 -58728 -53247 -49471 -41078 -44939 -32266 -32381 -33984 -25659
9760 -25659 -19805 -25172 -24453 22832 17949 -11591 -11050 -8235 -5631 -426 -2713 7723 -10329 -14874
9746 -14874 -47700 -71050 -72695 -46981 -55115 -42867 -6125 18 -7254 -11097 5586 5594 1440 -4739
9732d739L471J6112j3491k4156k1414K3061J7999K939r342j1610J1344j7522j9490
9719d6838J5549J250q488M39J5650J4470r772l677J9024J4791j6632j250R598
9706D114R608j1009j0731R446r795J817J7747k3302j8355J3618K1595l453R964
9693A1264M38j5762J657R575K5371J6700k3374j4276R267L2k740k7941p642m736
9679b2167j3306k781P692q84r161K7231o935J1902M5418L0030L299j9494m87m756
9665D5601N900k0834j3155O978m237O488J7486K3835K651k0554m7265j918K3825
9652B4801J5472J680R736L5918J2350Q72k2635k9616j1123J207J4630k7148o109
9639B0035j7043r846O314k467q460Q590J8311J1996k0944m073j760J3113K541
$$ plain form
9732 -4739 -1268 14844 1353 -22803 -44217 -21156 -3157 -218 -9560 -21170 -9826 -27348 -46838
9719 -46838 -31289 -30039 -38527 -38088 -22438 -7968 -17740 -21417 -2393 12398 -4234 -5484 4114
9706 4114 13722 2713 -8018 1428 -8367 -6550 11197 -12105 -30460 -16842 4753 1300 11264
9693 11264 11702 -4060 -2403 7172 32543 49243 25869 11593 20860 20892 18152 -9789 -17431 -22167
9679 -22167 -35473 -38254 -30562 -31446 -40607 -13376 -20311 -8409 37009 67039 70338 50844 50357 45601
9665 45601 51501 30667 17512 24490 20253 26741 44227 68062 70713 50159 2894 976 24801
9652 24801 40273 41953 51689 87607 99957 100829 78194 48578 37455 38662 53292 26144 20035
9639 20035 2992 -6854 -540 -3007 -11467 -2877 15434 27430 6486 2413 653 13766 16307
9626A6307j7496j4346k0519m529J9955M2616J6527l2101k9653J2267o719j6480
9614c4171J5840P223J2857J7933J3111j7114l3946j2932r218M259k37l004j0433
9601d9832N266K3228K0814j2380j9690J9672m644j8418r498K1196K0439j053K4074
9588A9174K5002j4579k8280k952j1328j9702l709k5632L003L7356K7244Q484K531
9575A6612j8527k9496J957O60J6009k124m639J0748K631j3567r463K2607R654
9562C062P821l036J6104L1214j2473k7136k0350l202K281J69j5437l7265P815
9549e0433R620J3610J3595k3303n610K2378M4721k7203j9996k6605j1396J0714
9537d9908K1661K5356J1946R731P284j9904l0912j2495k102J1977P952R842J2446
$$ plain form
9626 16307 -1189 -15535 -36054 -40583 -20628 21988 38515 6414 -23239 -10972 -17691 -34171
9614 -34171 -18331 -11108 1749 19682 32793 15679 -18267 -31199 -40417 -36158 -36395 -39399 -49832
9601 -49832 -44566 -21338 -524 -12904 -32594 -12922 -17566 -35984 -45482 -24286 -3847 -4900 19174
9588 19174 44176 29597 1317 -1635 -12963 -32665 -36374 -62006 -59003 -21647 5597 14081 16612
9575 16612 -1915 -31411 -29454 -28794 -12785 -14909 -19548 -8800 -6169 -19736 -29199 -6592 3062
9562 3062 10883 7847 23951 55165 42692 15556 -4794 -7996 -5715 -5546 -20983 -58248 -50433
9549 -50433 -40813 -27203 -13608 -36911 -42521 -20143 24578 -2625 -22621 -49226 -60622 -49908
9537 -49908 -28247 -2891 9055 18786 26070 6166 -24746 -37241 -39343 -27366 -19414 -9572 2874
9524B874J8115l528m3540j4793J4439L863l526j1796Q598K8948m079r251O438
9511g238J5602K4387j8204K1578K3979l2701j5922J5048K4660K1707J441l2585
9499D1752l1051k5443o257J2148J4980J6594P134Q805k3138m2045k2620R251K1404
9486a8486L0874J2038j6973J2764o003J6413J1552l942k4675o2108j7389K6070
9474c9865J1721M363L597P645J9202k2760k9794n002K374K8666M3374j573l4090
9461a2142j529J0637k356N820L019j1787K5461J9147q134J6844j4562m8866j8246
9448c6694K0264J7206N740k3686k1823j5481P291J1681K0140j256m789j4836O329
9435b9914K1238K3379L2916K249j9264k4255m824J268j2836J4381J2396K2592
$$ plain form
9524 2874 20989 17461 -26079 -40872 -26433 -22570 -26096 -37892 -29294 -346 -4425 -13676 -7238
9511 -7238 8364 32751 14547 36125 60104 27403 11481 26529 51189 72896 74337 41752
9499 41752 10701 -14742 -20999 -8851 6129 22723 29857 38662 15524 -26521 -49141 -39890 -18486
9486 -18486 12388 24426 7453 20217 14214 30627 42179 38237 13562 -48546 -65935 -39865
9474 -39865 -28144 -23781 -20184 -12539 6663 -16097 -45891 -50893 -48519 -19853 23521 21948 -12142
9461 -12142 -13671 -3034 -5390 430 3449 -8338 17123 36270 28136 44980 30418 -18448 -36694
9448 -36694 -16430 776 6516 -17170 -38993 -54474 -47183 -35502 -15362 -16618 -21407 -36243 -29914
9435 -29914 -8676 14703 47619 49868 30604 6349 1525 2793 -10043 4338 16734 39326
9423C9326k512k7561L737K4492n676p489j4484r772k781j6112J81q00Q576K7092
9409A6217o468P294L1051k0387l0214k585J7002J2354o307l7050n223J0427J0000
9396c889j1025K026K6033l4929k4116L433L0158J6430l777l258M32k3826q191
9383c4499J387J6473J9646j52k039p920k0693q935k689n470J0748M7325q900k8887
9369b4605L769J2909p728J0862K1218m996j8310N229J7508j2715L983J9230j325
9356B5029P511n104p649j9099n676j3718q81N683l364O888j622L7169K0384l703
9342D1848k2942m0427o687J4648K8432n525j9354m402J5358J9j9453K552l92O46
9328a5679K8417J3937n430j5310K249k7902m848R428R80k676k7008R192J0610
$$ plain form
9423 39326 36814 9253 12990 37482 31806 24317 9833 61 -2720 -18832 -18651 -19451 -10875 16217
9409 16217 9749 17043 48094 27707 -2507 -5092 11910 24264 17957 -19093 -24316 -13889 -3889
9396 -3889 -14914 -12888 13145 -21784 -45900 -42467 -12309 4121 344 -2914 -2482 -26308 -34499
9383 -34499 -33112 -16639 3007 2855 816 -7104 -27797 -36732 -39421 -44891 -34143 13182 4282 -24605
9369 -24605 -20836 -7927 -15655 -4793 16425 11429 -6881 -1652 15856 3141 7124 26354 25029
9356 25029 32540 27436 19787 688 -4988 -18706 -19587 -13904 -17268 -10380 -12002 25167 45551 41848
9342 41848 18906 -21521 -28208 -13560 14872 9347 -10007 -14409 949 968 -18485 -15933 -16325 -15679
9328 -15679 12738 26675 21245 5935 8184 -19718 -24566 -15138 -14158 -16834 -43842 -34650 -24040
9315b4040K51n377K9059K488l6437j1145K2659M458J2708L0819Q834J7779k0055
9302C2001k2287p171M134l346j7914K3900k8776n998J5859Q49j989R835J192l758
9288c469J0163j3525m992p262O086K307l05q615l136K1125J7065j5207R429K5254
9274C4918L818k8039k3138O804p53L0754k0893l6743J8817R271j2446m198J1313
9261a0515L951O806J0372K2520k298m5941Q557K7311P004R047m857j2512l768
9248A5677j1966q946j7822m949J4171J7514k1047q531M1470J6554k6772l9516
9236c4163L99J7183q641P756K1630Q290M396j0909l2394k0620J3114K9328j3323
9223a7954k0759K9884J3044R470l2720p825N066l162l4254j685J9936j6550J0861
$$ plain form
9315 -24040 -23789 -29166 -107 2381 -34056 -45201 -22542 -18084 -5376 25443 34277 52056 32001
9302 32001 9714 2543 6677 3331 -14583 9317 -19459 -25457 -9598 -8749 -10738 -903 289 -3469
9288 -3469 6694 -6831 -11823 -19085 -12999 -10692 -10997 -19612 -22748 -1623 15442 235 9664 34918
9274 34918 38736 10697 -12441 -5637 -6390 24364 3471 -33272 -14455 -5184 -17630 -21828 -10515
9261 -10515 -6564 242 10614 33134 30836 -15105 -6548 20763 27767 36814 31957 19445 15677
9248 15677 3711 -5235 -23057 -28006 -13835 3679 -17368 -25899 15571 32125 5353 -34163
9236 -34163 -33764 -16581 -25222 -17466 4164 12454 16850 5941 -26453 -47073 -33959 -4631 -17954
9223 -17954 -38713 -8829 4215 13685 -19035 -26860 -21794 -24956 -59210 -60895 -40959 -57509 -46648
9210d6648r486N687J4551J7282O941J4857j555j2626q699L6495J8714j647k1734
9197A2132j9708J0730j1950j4640J8723j4208j3394r362K4193K7267l2486j1938
9185c4641O072J281J1030O344j6656r573P776J9144L581j4716o409J9349J1187
9172C769o723k2P539j2493q57K3449J077r303J3202Q673J9763O185k4835j5006
9158A4418N622J5215p007k0857l1310j4931K9674m107j9088K2327L863R067J7247
9145B0133k1355j6826j9708J8545R091n317o386k3855J1734L390K2659K9624k3194
9132a465l1090k868j2403J8169K7638L355L08j1052k9177k5828L3336P81j2151
9119d2447K3332L562M1574K0733m3538k5574J5677K1220k9558j6770k1343P860
$$ plain form
9210 -46648 -56134 -50447 -35896 -18614 -11673 3184 1629 -10997 -19696 16799 35513 33866 12132
9197 12132 -7576 3154 -8796 -23436 -4713 -18921 -32315 -41677 -17484 9783 -22703 -34641
9185 -34641 -28569 -27288 -16258 -9914 -26570 -36143 -28367 -9223 -5642 -20358 -26767 -7418 3769
9172 3769 -2954 -2976 4563 -7930 -8787 14662 15739 6436 19638 28311 48074 54259 29424 14418
9158 14418 20040 35255 28248 7391 -23919 -38850 -9176 -13283 -32371 -10044 -6181 2886 20133
9145 20133 -1222 -18048 -37756 -19211 -10120 -15437 -21823 -45678 -33944 -30554 -7895 21729 -1465
9132 -1465 -32555 -35423 -47826 -29657 -2019 1336 1644 -9408 -38585 -64413 -31077 -30296 -42447
9119 -42447 -19115 -15553 26021 46754 3216 -22358 -6681 14539 -15019 -31789 -53132 -45272
9107d5272J6623N429J458K306k3048N26J2751j0142l715L9789M1845j4363l162
9094B1025K67j4628j2949J1863j1046J415J9963j428J459j9457k4407J5489J4182
9081A748q575j5664J6432L630N398J4852J6570P839P920l0053m5101q248j7306
9068e0558J2844O460j920P462P207K03J4063m066Q449K1838J115p792J9291k949
9054C1647k2101l3363l409J6672o538M105O107j9632L84K4462o325l0184J0652
9041b7523J1347K7866J3565J2034j877j9524p021q200K54o803J7631J8570r183
9028B1136l550j940n717J0040K808j4902j9226P622K0663j8946M249k154j606
9015a523L750q574K4764J4549p791j3876j3099k0008k9872p701K4684N0956j9735
$$ plain form
9107 -45272 -28649 -23220 -21762 -19456 -42504 -41978 -29227 -39369 -43084 -3295 38550 24187 21025
9094 21025 21292 6664 -6285 5578 -5468 -4053 15910 14482 15941 -3516 -27923 -12434 1748
9081 1748 -6827 -22491 -6059 -2429 2969 17821 34391 42230 50150 20097 -25004 -33252 -50558
9068 -50558 -37714 -31254 -33174 -25712 -18505 -18302 -4239 -8305 144 21982 23097 15305 34596 31647
9054 31647 9546 -23817 -27226 -10554 -17092 -12987 -6880 -26512 -26128 -1666 -7991 -38175 -27523
9041 -27523 -16176 11690 25255 37289 35412 15888 8867 667 921 -5882 11749 30319 21136
9028 21136 17586 15646 9929 19969 22777 7875 -11351 -3729 16934 -2012 2237 83 -1523
9015 -1523 2227 -6347 18417 32966 25175 11299 -1800 -21808 -51680 -59381 -34697 16259 -3476
9002c476M582J2437j4141q137p948Q079n863r739j7277n099J0639K3810l2145
8989d4278j8194L5882L7441r688L067O863J498j2332P434j828l05N096N134J6550
8975C2340k9699j6646l094J3693j1808j1967j7495j0123j4185L5122j938Q188
8963b7612J1136p558R450m853O914J8007m471k4149j0438l35J6620j1435J3117
8950a5607K3259j8800j4021J8140J9887K1178N634j1713K649p476j5238J6990
8938B4882J6236l9231n213J1251j4134P972n051l625p984j5466k914j1667p41
8925d5685J0158J9105j8040M380J7407j009L0593J4937j5649k6664j9742m578
8913c4787R343J3066J4409n28j6424k1570L0399J0394J9400J8259j2187K3253
$$ plain form
9002 -3476 1106 13543 -598 -8735 -16683 -8604 -14467 -24206 -41483 -46582 -35943 -12133 -44278
8989 -44278 -62472 -26590 10851 1163 4230 11093 12591 259 7693 5865 5560 10656 15790 32340
8975 32340 2641 -14005 -17099 -3406 -15214 -27181 -44676 -54799 -68984 -33862 -35800 -27612
8963 -27612 -16476 -24034 -14584 -19437 -12523 5484 1013 -23136 -33574 -33909 -17289 -28724 -15607
8950 -15607 7652 -11148 -25169 -7029 12858 34036 39670 27957 30606 23130 7892 24882
8938 24882 41118 1887 -3326 7925 -6209 1763 -3288 -6913 -14897 -30363 -33277 -44944 -45685
8925 -45685 -35527 -16422 -34462 -30082 -12675 -13684 16909 31846 16197 -10467 -30209 -34787
8913 -34787 -25444 -12378 2031 1503 -14921 -36491 -6092 4302 23702 41961 29774 53027
8901E3027j1736k8174j0752o300N623n549q008J1624N294k5009l3380r583K6713
8888c6210K8671j654j0863J9094R533j7500j3509J5048J8823j2427K0960N540
8876B5506q978k4269J3691J6800J530K8753l203l221m0753j8640K116m88j2135
8863b3291k9635K2605K0940L5210k538j0627j5032j1368r783r549j038N09J8386
8850a5211N832m895M206J511p078j3817r95o16J412K8900K139k7284p281J1135
8836b2042k2549q221J6112K1829m160Q897k0521j596M3112K69j8118k7132j2213
8823d6333K6863Q768M0969K6865M991m3541m9072O65j5070o964K111L946J6627
8810b9175K0205J0012m2373J386K7822J674l7019K9720L7742P604j4188k6249
$$ plain form
8901 53027 41291 13117 2365 -3935 1688 -3861 -11869 -245 5049 -19960 -53340 -62923 -36210
8888 -36210 -7539 -9193 -20056 -962 8571 -8929 -22438 -7390 11433 -994 19966 25506
8876 25506 16528 -7741 5950 22750 24280 53033 49830 46609 5856 -12784 -10668 -11156 -23291
8863 -23291 -52926 -30321 -9381 25829 23291 12664 -2368 -13736 -23519 -33068 -34106 -33597 -15211
8850 -15211 -9379 -14274 -10068 -8557 -15635 -29452 -30447 -31063 -29651 -751 1388 -25896 -33177 -22042
8836 -22042 -44591 -52812 -36700 -14871 -19031 -10134 -30655 -32251 10861 11130 -6988 -34120 -46333
8823 -46333 -19470 -10702 30267 57132 62123 18582 -30490 -29825 -44895 -51859 -49748 -45802 -29175
8810 -29175 -8970 1042 -41331 -39945 -12123 -10449 -47468 -17748 19994 27598 13410 -12839
8798a2839N400K9449R537k5012p775R90j5823j711j9115P254K3915j5880j6906
8785c8516m972q636P562J5585K3702k0674j681K4167N48j294l3972l0991J000
8772f8172L2936J7034M8765K3786l6083j8231J0822l0949N433J56k3170j2142
8760d9815K7551M3239M082j3501r561j1954k5644J3220j5980n065P30J4702R395
8747a8601j3061J834J8389p197J6816l571n366L120M776O135j3984L665J1459
8734D414K5170J9542j0766l1126k8296J9752J9562j143j6650l2955L2074K4396
8722B3974o130M767Q217P018j952Q340j5372J4655j1178l232Q632r974j0017Q688
8708B6436K127j3906Q934P972k7252J1712K678P124P053j2973n415l2242K478
$$ plain form
8798 -12839 -7439 22010 31547 6535 -1240 -250 -16073 -17784 -36899 -29645 -5730 -21610 -38516
8785 -38516 -43488 -52124 -44562 -28977 -5275 -25949 -27630 -3463 -2915 -4209 -38181 -69172 -68172
8772 -68172 -35236 -18202 30563 54349 18266 35 10857 -20092 -14659 -14503 -37673 -49815
8760 -49815 -22264 20975 25057 11556 1995 -9959 -35603 -22383 -38363 -43428 -42698 -27996 -18601
8747 -18601 -31662 -29828 -11439 -18636 -1820 -5391 -10757 -7637 -2861 3274 -10710 -7045 4414
8734 4414 29584 49126 38360 7234 -21062 -1310 18252 17109 459 -32496 -422 23974
8722 23974 17844 22611 30828 37846 35894 44234 28862 43517 32339 29107 37739 27765 17748 26436
8708 26436 28563 14657 23591 31563 4311 16023 18701 25825 32878 19905 14490 -17752 -15274
8695a5274J3038O603k745o794K138j2615J0066k3482K172M764P690J2944o603
8682h098L193J7908J430o513J9415j8708j6001J207k2148p700R596N656R451J2402
8668A090N473j8157J370M881l567k2209L0933n651j9032Q018Q278j1336k607J8151
8654d365J4437j7793l7611k631O606L157R575O841J3940m282K889o606n815j3869
8640c5527R603O95j7961k0394k31K8309K4641O711J6949r746j3243R647K0663
8627B0116n926n463k8221L209P512j2089K017L283j0559j254J549J6783O753k2112
8613b4402J2907n718j9799r475L8113L6364Q552o925k3764k1545K1398q605q518
8600a1417J3680k3233j2654K4906K4768l1351q211J920R993J6153j0639k4870
$$ plain form
8695 -15274 -2236 4367 1622 -5172 -3034 -15649 -5583 -29065 -26893 -22129 -14439 -1495 -8098
8682 -8098 -4905 13003 14433 7920 27335 8627 -7374 -6167 -28315 -36015 -26419 -20763 -11312 1090
8668 1090 6563 -11594 -10224 -5343 -8910 -31119 -186 -5837 -24869 -16851 -8573 -19909 -22516 -4365
8654 -4365 10072 -7721 -45332 -47963 -41357 -38200 -28625 -21784 -7844 -12126 -9237 -15843 -21658 -35527
8640 -35527 -25924 -25229 -43190 -63584 -63815 -35506 -10865 -4154 12795 3049 -10194 -547 20116
8627 20116 14190 8727 -19494 -16285 -8773 -20862 -18845 -15562 -26121 -27375 -25826 -9043 -2290 -24402
8613 -24402 -11495 -17213 -37012 -46487 -8374 27990 36542 29617 5853 -15692 5706 -2899 -11417
8600 -11417 2263 -20970 -33624 -8718 16050 -15301 -23512 -21592 -11599 4554 -6085 -30955
8588c0955Q273m823O269k331J394J7345q305L4832K1707j6061l0519o107K0564
8575A1283J6751j3631n084O045N821j3691l828j580m641k969j515k1308K4252
8562d095J9747j1006j1135k470K3004O916l841k749J3818p05J1870O431j0596
8549C5189j0396J0764P18o756m962J8684J4772l562j2145j9147k116o761k294
8536A1988j1222M274J0503L174m541o984l3286O605J2132P355J6733M626R315
8523C0672j0258l8477p689R619K1683M4655m123k6653p946l6862M271m68K7292
8510E716K1702J3436J3856j0695Q016J3377J7203j5173l3853L697O72k8652j8318
8497i016Q022l885r264J7374O443J2865R048k1563K4443M660k1991M416l854k903
$$ plain form
8588 -30955 -22682 -27505 -21236 -23567 -22173 -4828 -13133 21699 43406 27345 -3174 -9281 11283
8575 11283 28034 14403 9319 15364 21185 7494 3666 2086 -2555 -5524 -7039 -28347 -4095
8562 -4095 15652 4646 -6489 -8959 14045 20961 17120 14371 28189 27484 39354 45785 35189
8549 35189 24793 35557 36275 29519 24557 43241 58013 54451 42306 23159 21043 14282 11988
8536 11988 766 5040 15543 18717 14176 7192 -26094 -19489 -7357 -2 16731 21357 30672
8523 30672 20414 -18063 -25752 -16133 5550 50205 46082 19429 11483 -25379 -21108 -21576 5716
8510 5716 27418 40854 54710 44015 52031 65408 82611 67438 33585 37282 37954 9302 -9016
8497 -9016 -994 -4879 -14143 3231 9674 22539 31587 10024 34467 39127 17136 21552 17698 14795
8483A4795j8042j7025K916N976n927j3658L337J5932L681J0948M0400n893k3191
8470A4249r052j2637p067k5514m040K1428j0010Q784M2822M2375J3043k811l3197
8457C8373k7423J1672R756j4629j4150j253K3031O914K443K119J1504O532j227
8444E3662k4237j6525l927j8371o322L8417J7213J3046J3513p338k2914k3344
8432A2873j9386q987l0671j65K6223J3708N9L6310n849J3500k6591j3172O385
8419D237J7470P139O593j8640l0735L852M214Q243J8012J6037j6278O737l650
8406B3231l80N076J325M932K117j5793j8312J5021M904J1201k3188P984k3729
8393e611k6078J5991K4756J1121n196k8539k1598p343K2225n65o186M90j3746
$$ plain form
8483 14795 -3247 -20272 -17356 -11380 -17307 -30965 -27628 -11696 -8015 2933 43333 37440 14249
8470 14249 5197 -7440 -14507 -40021 -44061 -22633 -32643 -23859 18963 61338 74381 71570 38373
8457 38373 10950 22622 32378 17749 3599 2346 25377 32291 34734 36853 48357 54889 53662
8444 53662 29425 12900 8973 -9398 -15720 22697 39910 52956 66469 59131 36217 12873
8432 12873 -6513 -15500 -46171 -46336 -20113 -6405 -6346 29964 24115 37615 11024 -2148 4237
8419 4237 21707 28846 35439 16799 -13936 -10084 -5870 2373 20385 36422 20144 26881 23231
8406 23231 22851 27927 29252 34184 36301 20508 2196 17217 22121 33322 10134 18118 -5611
8393 -5611 -31689 -15698 9058 20179 14983 -13556 -35154 -42497 -20272 -20837 -27023 -26533 -40279
8380d0279J9118L0846l756P30k0298K000K59K2240J2040p820j1550k4427m571
8367b5468M515j1205m440Q224l07L7852J4422k2597k2388j0935L1809J4312N016
8354A8810J4002n606k9862m992J4827J3860j5082j4567J1554L6611Q932l3392
8342A5095k7518K6309K2457l911l3226l0855j6388n964L484P686N635P895J6299
8329a3002L3598J6641k0389l6230q718M621k5742J969K5305J0368K9011k3875
8317f443j3389K1472l887j9248k0181j903J4983K3174J2899q635K5104J1378j2119
8304B3205J1438k527k9020K0782J1110k2464k9889l0146O497J5668k708m863Q455
8291b4462J6888j1451J008j0484k0969J8556J3724J1268j2610J1689q574J0109
$$ plain form
8380 -40279 -21161 9685 5929 6659 -13639 -11639 -11380 10860 22900 15080 3530 -20897 -25468
8367 -25468 -20953 -32158 -36598 -28374 -28681 9171 23593 996 -21392 -32327 -518 13794 18810
8354 18810 32812 27206 -2656 -7648 7179 21039 5957 -8610 2944 39555 48487 15095
8342 15095 -12423 13886 36343 32432 -794 -31649 -48037 -54001 -50517 -42831 -37196 -29301 -13002
8329 -13002 20596 37237 16848 -19382 -28100 -23479 -49221 -47252 -21947 -11579 17432 -6443
8317 -6443 -19832 1640 -2247 -21495 -41676 -43579 -28596 -5422 7477 -1158 23946 35324 23205
8304 23205 34643 32116 3096 23878 34988 12524 -17365 -47511 -41014 -25346 -28054 -32917 -24462
8291 -24462 -7574 -19025 -18017 -28501 -49470 -30914 -17190 -5922 -18532 -6843 -15417 -5308
8279e308O289K0989L8537J876k8194j3060j7955k8798j2125L8520K505j9957R402
8266g279Q373j9885O58j6315j3684K4528L2563K1041j6743j5587K4474J1774j8438
8253A5480q922r498J0848P298J8462j5267r535k702k3890p671L4101J7532L034
8240B9270J27k5362k8884k5056L16L6262m826r140n562k0104J3903J1848q292
8227c5500j5840L1229O411q232O870K6554M886R559J0293k4986J3655O23k4821
8214G01j8544j0689K2761K7307L76j19l099l4278R026K6647J4756l327M446k6189
8200I775j9475k308J8295J8858j736j1801j2797O48J594m413p114o080l882J3520
8186f916K2243P184q091O620J7349o692R37l4475O364O134J7631L045j8937K953
$$ plain form
8279 -5308 981 21970 60507 62383 34189 21129 3174 -25624 -37749 771 3276 -16681 -7279
8266 -7279 1094 -18791 -18133 -34448 -48132 -23604 8959 30000 13257 -2330 22144 33918 15480
8253 15480 6558 -2940 7908 15206 33668 18401 8866 6164 -17726 -25397 8704 26236 29270
8240 29270 29397 4035 -24849 -49905 -49589 -13327 -18153 -27293 -32855 -52959 -39056 -27208 -35500
8227 -35500 -51340 -20111 -13700 -21932 -15062 11492 16378 25937 36230 11244 24899 25522 701
8214 701 -17843 -28532 -5771 21536 21912 21793 18694 -15584 -6558 20089 34845 31518 35964 9775
8200 9775 -9700 -12008 6287 25145 23409 11608 -1189 -541 1053 -3360 -10474 -16554 -20436 -6916
8186 -6916 15327 22511 14420 21040 38389 31697 32634 -1841 4523 10657 28288 31333 12396 15349
8172A5349L150P497p702j8537J089j348j6842r926O925K292N071j4203k8857J3686
8158d2356K4117J1721M895J5114j2918J9171K6397k0779k0091P860J0058p116
8146A6073O557r972j2904k5074l14K1051J5957k009m281j7380k2377J1122R078
8133a4473q220l620L0368J2959J3805j2143k2755q502p92M460l295J838K396O82
8119g292r30J9626k5617k0256K8297n979j0841q77r624j3160l319n400q622L7519
8105b6475J3141Q530l432j8445k224K149J5128J3776k841k256N76O179J0108j0479
8091C435K551K179J4189K6757M230k8414n557j2372n35J8501j2970j6755K7032
8078B2271J7395J2574J813p549m1927r515J0746j1475J5026l1535j6687K0736
$$ plain form
8172 15349 18499 25996 18294 -243 846 -502 -17344 -27270 -20345 -18053 -12982 -27185 -56042 -42356
8158 -42356 -18239 -6518 -1623 13491 573 19744 46141 25362 5271 13131 23189 16073
8146 16073 22630 12658 -246 -25320 -25634 -4583 11374 9365 5084 -12296 -34673 -23551 -14473
8133 -14473 -22693 -26313 4055 17014 30819 18676 -4079 -12581 -13373 -8913 -12208 -10370 -7974 -7292
8119 -7292 -8222 11404 -14213 -34469 -6172 -12151 -22992 -23869 -33493 -46653 -49972 -55372 -63994 -26475
8105 -26475 -13334 -4804 -8236 -26681 -28905 -26756 -11628 2148 -693 -2949 -2373 3806 13914 3435
8091 3435 5986 8165 22354 49111 53341 24927 19370 6998 6463 24964 11994 -4761 22271
8078 22271 39666 52240 54053 46504 4577 -4938 5808 -5667 9359 -22176 -38863 -18127
8066a8127J5495o333j3579k0965J2533m897j1208J528J1100k7244N177K8788K198
8053b5534J1809K9234L7039j1520k1122k2004p944P517k6547L382J7912N425l265
8040e618l099k741J6530K4460O369j1181p798q19j8690k0150p523K7617L4736
8027C2093P491n945q169J0484k1036j936k9094q35O892J0743L4813J51l7159N058
8013C551k47K219P602r682k6793J8851L0201q674j2061k8092l403l564j4322L677
7999d0737J6689o63j2276K0747K6412L349k3145q304L788j7307k460n570J1701
7986b7776j2608j6485J7923J9277Q930J5670j3367j0917l391J6594Q530R284l41
7973A1323p081m396o311P653J4600M37l022m3498p632J0599P048J1580K3379j1388
$$ plain form
8066 -18127 -2632 -8965 -22544 -43509 -30976 -35873 -47081 -45553 -34453 -61697 -56520 -27732 -25534
8053 -25534 -13725 15509 52548 41028 19906 -2098 -10042 -2525 -29072 -25690 -7778 -2353 -5618
8040 -5618 -8717 -11458 5072 29532 35901 24720 16922 16103 -2587 -22737 -30260 -2643 32093
8027 32093 39584 33639 25470 35954 14918 12982 -16112 -16947 -10055 688 35501 35652 -1507 3551
8013 3551 3304 5523 13125 3443 -23350 -4499 25702 17028 4967 -23125 -26528 -30092 -44414 -40737
7999 -40737 -24048 -24711 -36987 -16240 10172 13521 -9624 -17928 -14140 -31447 -33907 -39477 -27776
7986 -27776 -40384 -56869 -38946 -19669 -10739 4931 -8436 -19353 -22744 -6150 2380 11664 11323
7973 11323 4242 -154 -6465 1188 15788 16225 13203 -30295 -37927 -27328 -20280 -8700 14679 3291
7959C291p82O91K028M682k096l367J0446k1591Q266K0604j1553k450K840j621
7945I388K3275j7831l1868M274k08j006J8089l5712j7139J7502R471N15K8274
7932G024k199j5719q340l874q74K5041K2259J0127p338O016j5705O09j0777o703
7918d53P156O293j054j1513l3178J1346j519j0408J3899K0725N569j0497n745
7905i379J98J6343j2717k5391K2529m88k1249J0673J4465K2760L132k533J2263
7892C0606k901o01l8281n056J044r961J5833O151l11j22P716m951l173J4008k859
7877G142j1026J1801J1854J4838j0261k975k1447l927k4317j7040r937L669J3597
7864c8029k515J3702P059j7557J7257K0229p856Q24o526m176j8754q486k1716
$$ plain form
7959 3291 2509 3200 5228 9910 7814 4447 14893 -6698 1568 22172 10619 8169 11009 9388
7945 9388 32663 14832 -17036 -12762 -12970 -13976 4113 -31599 -48738 -31236 -21765 -21250 7024
7932 7024 4825 -10894 -19234 -23108 -23982 1059 23318 33445 26107 32123 16418 17027 6250 -453
7918 -453 6703 12996 11942 429 -32749 -21403 -22922 -33330 -19431 1294 6863 -3634 -9379
7905 -9379 -9181 7162 -5555 -30946 -8417 -8905 -30154 -19481 -5016 17744 20876 18343 30606
7892 30606 27705 27104 -11177 -16233 -15189 -25150 -9317 -3166 -3477 -3599 4117 -834 -4007 10001 7142
7877 7142 -3884 7917 19771 34609 24348 21373 -74 -4001 -28318 -45358 -55295 -51626 -38029
7864 -38029 -40544 -26842 -19783 -37340 -20083 146 -7710 -6886 -13412 -17588 -36342 -44828 -66544
7851f6544K0726J7148R068R027o904j9409j7170j720L2145K7030r001L821K0378
7838A8595P854r596j4136k7479o132K7854M2302O149j5761j5528l0170m968j34
7825b1150j000K1666K3199k789J3580l811j1447l462j1549j4303l673J4046K3135
7812B2442K367j4532l0372j126J982J7499J7196n477l8432k0702l552O031J411
7799d5265R476M150L3887Q537J8842m441k2196k400N731O03r619o922K2519M419
7785A7321l6148o548J6735Q054j7611M80l473J895P383M25J2874K3217r84j2160
7771A1460J6905K4048k1763n066k934j3292J876k4890l7090K3203J6379J2139
7759I75K2970J727o640j8858o790k1008j5186k243j8824J771M1967M3210M53O454
$$ plain form
7851 -66544 -45818 -28670 -19602 -10575 -17479 -36888 -54058 -55778 -23633 3397 -5604 -1783 18595
7838 18595 26449 16853 2717 -24762 -30894 -3040 39262 45411 29650 14122 -16048 -21016 -21150
7825 -21150 -22150 -484 22715 19926 33506 29695 18248 14786 3237 -11066 -14739 -693 22442
7812 22442 24809 10277 -20095 -21221 -19239 -1740 15456 9979 -28453 -49155 -52707 -46676 -45265
7799 -45265 -35789 -31639 2248 10785 29627 25186 2990 590 6321 6924 -2695 -9617 12902 17321
7785 17321 -18827 -25375 -8640 -586 -18197 -17717 -21190 -19295 -11912 -11487 1387 24604 23620 11460
7771 11460 28365 52413 30650 25584 22650 9358 11234 -13656 -50746 -27543 -11164 975
7759 975 23945 25672 19032 174 -6616 -27624 -42810 -45053 -63877 -62106 -20139 23071 23524 29978
7745B9978j7282j7324j1247l254K2540r145k354n639j9536J163J424j3516j5059
7732e9251N309K0912J7438k2428l7736r277j3279K3816J8531R70N62J8039p565
7719d3959J1992J8706J6907K183o335j6533n560j120J4335L303J4818k4143m490
7706a9896J2226r454m883J8375R827j3361j7558K6308k422k5185j2252j4348J9454
7693c3169K1159n00J5187R449j6421p374N242Q238n660R78j6481N562J4865l089
7679b014j9409P58J5439O012p106k4614k1363K7872L2076q33k4339k6210k3237
7666f6968O152K1835P768K8448L1702J6994k5116j5811j4808N232J7679q727m186
7653A94j8049j1759J7197n914L074j3118j1496R426K1168j5424l7339n674Q414
$$ plain form
7745 29978 12696 -4628 -15875 -19129 3411 -5734 -8088 -13727 -33263 -32100 -30676 -44192 -59251
7732 -59251 -53942 -33030 -15592 -38020 -75756 -85033 -98312 -74496 -55965 -54995 -54433 -36394 -43959
7719 -43959 -31967 -13261 3646 5829 -506 -17039 -22599 -23719 -9384 -6081 8737 -15406 -19896
7706 -19896 -7670 -17124 -22007 -3632 6195 -7166 -24724 1584 -838 -26023 -38275 -52623 -33169
7693 -33169 -12010 -12510 2677 12126 -4295 -11669 -6427 1811 -3849 -2871 -19352 -13790 1075 -2014
7679 -2014 -21423 -20665 -5226 786 -6320 -30934 -52297 -24425 7651 6818 -17521 -43731 -66968
7666 -66968 -60816 -38981 -31213 -2765 28937 45931 20815 5004 -9804 -4572 13107 4380 194
7653 194 -17855 -29614 -12417 -18331 -15257 -28375 -39871 -30445 -9277 -24701 -62040 -67714 -59300
7640e9300J163K0429K2493k16J3793l947J3558j3093O853m861O920K1776m940
7627B0628k7242N262L116l527K545l253K891j0048l137M238O462J3384L110n462
7613H967n767L961J507k6942j3985j100K5352K5834r516p597K6534l790J614j3031
7599A2041j6547P544O129q189J6394N236O718J115Q544M812j7678j2521J1409
7586B5007J2415J41n44J217r150L262k9358r700K915L424l805Q514J2923P854
7572B5115O192J3018l685j7805O387l098m780k5211L587j3744J629R320J5833
7559A2758L564j958K2411k200j2982k3589k4680n742K167O836N035J2305K2744
7546A6669J4551l2953l0635j3538k0404o626M3695K0735j7661R079J7513p308
$$ plain form
7640 -59300 -58137 -37708 -15215 -15431 -1638 -5585 7973 -5120 1733 -3128 3792 25568 20628
7627 20628 -6614 -1352 1764 -1763 782 -2471 420 -9628 -12765 -8527 -2065 11319 14429 8967
7613 8967 3200 7161 8668 -18274 -32259 -33359 -8007 17827 8311 714 27248 23458 25072 12041
7599 12041 -4506 3038 9167 978 17372 22608 29326 30441 38985 43797 26119 13598 25007
7586 25007 37422 37563 37019 38236 29086 32348 2990 -6710 -3795 -371 -4176 4338 17261 25115
7572 25115 31307 44325 40640 22835 29222 26124 21344 -3867 -280 -14024 -12395 -3075 12758
7559 12758 16322 14364 36775 34575 21593 -1996 -26676 -32418 -30251 -23415 -18380 -6075 16669
7546 16669 31220 -1733 -32368 -45906 -66310 -72936 -29241 -8506 -26167 -17088 425 -6883
7534f883r262K5593O259j2976m025j871n693j2981l9215j6733M3974N3109J8851
7521C8147j438J3766j4331K789o244m5442o939R828J1205N904n57l360l32P494
7507A0490J5822J9277j5533l8018M048K9546Q110q557K7570q541q743R25j2868
7494B3528J385p830j0533k9695p09K1485P136j0521M563L140k40l240k003j017
7480d551J668j2012k582l011J9444J5378j767j0073p04o629k413J9779N678j7373
7466H32R770K295j9303k5981j1793J5499K2690J1954j5349l2458K996J912k716
7453c9652K6877r633l0551o21K7116K9074O270K045n6k49j6533k2507n574K6106
7439g888J0998J6511Q694k0661o320q292O44j4694j1521l5004m407K0695k1623
$$ plain form
7534 -6883 -16145 9448 15707 2731 -1294 -3165 -8858 -21839 -61054 -77787 -33813 19296 38147
7521 38147 36709 50475 36144 38933 32689 -12753 -19692 -9864 1341 7245 6688 3328 2996 10490
7507 10490 26312 45589 30056 -7962 -3914 25632 33742 25185 52755 44214 35471 36396 23528
7494 23528 24913 17083 6550 -23145 -23854 -2369 4767 -5754 -1191 1949 1709 -1531 -3534 -4551
7480 -4551 -2883 -14895 -17477 -20488 -1044 14334 12567 2494 1790 -4839 -7252 12527 18205 832
7466 832 10602 12897 -6406 -32387 -44180 -28681 -5991 5963 -9386 -41844 -38848 -36936 -39652
7453 -39652 -12775 -22408 -52959 -53580 -26464 2610 8880 10925 10869 10620 -5913 -28420 -33994 -7888
7439 -7888 3110 19621 28315 7654 1334 -6958 -6314 -21008 -32529 -67533 -71940 -51245 -72868
7426g2868k6851K1611N7106J1100J2700q300K584J3429K1063m862o936j8695j6507
7413a5426n181J7361j3428j8039j826R09J7808J3468J0897k2588O379L516L98
7400e752Q271K555J9515j6222r487k8150k4618K764P043J8147J0939Q71L219J8399
7386G494O375k555j7501o415n454J7333j947J2547j4181r899k51J2897K4299r925
7372A2817l801J0744n269k9411j6911q945j494m18J3949K439q614K2092N099m535
7358a2258P190L846L0k7998l4491n853j1755K5172L6614L9449J7216j250L541
7345C9453r811m6775j2509o71J2139K6284J7098j9882N973n534m4324j6666L082
7332e2143J0646j3842J3686K7490J4580j4217k7065J0002J9119M27k09k0548J9955
$$ plain form
7426 -72868 -99719 -78108 -21002 -9902 2798 -5502 -2918 10511 31574 26712 19776 1081 -15426
7413 -15426 -20607 -3246 -16674 -34713 -36539 -35630 -17822 -4354 6543 -16045 -9666 -6150 -5752
7400 -5752 2519 5074 24589 8367 -1120 -29270 -53888 -51124 -44081 -25934 -14995 -14124 -10905 7494
7386 7494 13869 11314 -6187 -12602 -18056 -723 -2670 9877 -4304 -14203 -14454 -1557 22742 12817
7372 12817 9016 19760 14491 -14920 -31831 -40776 -42270 -42688 -28739 -26300 -34914 -12822 -7723 -12258
7358 -12258 -5068 -1222 -1192 -29190 -63681 -69534 -81289 -56117 -19503 19946 37162 35912 39453
7345 39453 29642 -17133 -29642 -30313 -18174 8110 25208 5326 11299 5765 -38559 -55225 -52143
7332 -52143 -41497 -55339 -41653 -14163 417 -13800 -40865 -30863 -11744 -11317 -11526 -32074 -12119
7319a2119K2214o175j3868j5613P894J5171L321R573l030j4815j1648k283j9146
7306d0524M941j6630r460K7855M521l9144o254k581J0295J7519J3948L6069J2843
7293A3398k644J6878J1533M640k1618k8750J2370K1895m760k0447j8501k071O61
7280a7416J3545j1970k2617l510K5517K2577N515j3592k5546J0207K3701n138
7268A273q651R4q242p754P54j5694J3784L6526j19p883l740L2295j1808K579n074
7253A8340P846J1072K751j5000J4221J373k1132l8699j6675N80J2646q21L970
7240a9528N136p259J0195K895Q976j366j6144k1709O450J3524j4973L1916J3014
7227A1127Q118K7056j9121l279Q711m324j7467M087q072m380J6371O298O569M721
$$ plain form
7319 -12119 10095 3920 -9948 -25561 -17667 -2496 825 10398 7368 -7447 -19095 -21378 -40524
7306 -40524 -35583 -52213 -61673 -33818 -29297 -68441 -74695 -77276 -66981 -49462 -35514 555 13398
7293 13398 10754 27632 39165 43805 22187 -6563 5807 27702 22942 2495 -16006 -18077 -17416
7280 -17416 -3871 -15841 -38458 -41968 -16451 6126 11641 -1951 -27497 -17290 6411 1273
7268 1273 -7378 -7284 -15526 -23280 -22526 -38220 -24436 12090 11971 4088 348 32643 20835 23414 18340
7253 18340 26186 37258 40009 25009 39230 40603 19471 -19228 -35903 -35323 -22677 -23498 -19528
7240 -19528 -14392 -21651 -11456 -8561 415 -951 -17095 -38804 -32354 -18830 -33803 -1887 11127
7227 11127 19245 46301 27180 23901 32612 28288 10821 14908 6836 2456 18827 25125 31694 36415
7213C6415k8448j8498k422j2342K651J5426J3414j5461q64O852j7537O155N102
7200i557J3058J0613k1609k2354R965K6038k1216k0761M621K0962M742K0689k1047
7187e856k1628J9531q457k4809J1616M073J451k893p828r312j540K762J3573M3504
7173A4187K2030J1626k8917l8331j7894J000k193n355L2870N366l92M081N134
7160C212j4912k6136J2525J298k259O909j0797N910K5485J4381j1342J5467M484
7147B4225j9106j1697j1253J2092J0921J5399j5753M219J3034j2379p258m485
7135b041m211j8692j5647j930k687K5625J5726J460k1731J8714L8952j286m9086
7122a6834k3982k1505R356L3026N57L499P022J4676J229J79j2081p560j7514p128
$$ plain form
7213 36415 7967 -10531 -12953 -25295 -22644 -7218 6196 -9265 -10129 -3277 -20814 -14659 -9557
7200 -9557 3501 14114 -7495 -29849 -19884 6154 -15062 -35823 -31202 -10240 -5498 15191 -5856
7187 -5856 -27484 -7953 -16410 -41219 -29603 -25530 -24079 -26972 -34800 -44112 -45652 -42890 -29317 14187
7173 14187 36217 47843 18926 -19405 -37299 -36299 -38492 -43847 -10977 -5611 -6003 -1922 3212
7160 3212 -11700 -37836 -25311 -24013 -26272 -19363 -30160 -24250 1235 15616 4274 19741 24225
7147 24225 5119 -6578 -17831 -5739 5182 20581 4828 9047 22081 9702 2444 -2041
7135 -2041 -6252 -24944 -40591 -42521 -45208 -19583 -3857 -2397 -24128 -5414 33538 32252 -16834
7122 -16834 -40816 -62321 -52965 -19939 -19382 -15883 -8861 5815 7044 7223 -4858 -12418 -29932 -37060
7108c7060N236j0910j6924P231M3532N812J2807j4612J1158j0235Q559K6j404
7095C216J6083R394j1570k4164j1035j2030J4167n556j9559Q639N581K3417j443
7082d860Q980m241n1222L5356L301p143K4338J6135M670j4444K859p218q919L1234
7068B8826o196r311r69J3596n559j6845k338j8382k1569n948n493L1194J6994
7055b000J3882m955k1156K3367R661k0589k1896J4220J1612K1651J1944k0007
7043A5734k8842Q046J7145r221j8242k683l0182q718M4896P719P291L133Q297
7030A4373K2400j8629l0319O670K17j8103j0298r716M292J1698k729J6679M4787
7017C1322N707K121k726l32k2347p250m296j0944K0655J2932k0027m873J5346
$$ plain form
7108 -37060 -31824 -42734 -59658 -52427 -8895 -3083 9724 -4888 6270 -3965 4594 4620 3216
7095 3216 19299 28693 17123 -7041 -18076 -30106 -15939 -21495 -41054 -32415 -26834 -3417 -4860
7082 -4860 4120 -121 -51343 -15987 -12686 -19829 4509 20644 25314 10870 13729 6511 -2408 28826
7068 28826 22630 13319 12350 25946 20387 3542 1204 -17178 -38747 -44695 -50188 -18994 -2000
7055 -2000 11882 6927 -14229 9138 18799 -1790 -23686 -9466 2146 23797 35741 15734
7043 15734 -13108 -5062 12083 2862 -15380 -18063 -48245 -56963 -12067 -4348 2943 6076 14373
7030 14373 36773 18144 -12175 -5505 -5288 -23391 -33689 -43405 -39113 -27415 -30144 -13465 31322
7017 31322 37029 39150 36424 36092 13745 6495 2199 -8745 11910 24842 4815 -58 15288
7004A5288j7456j6091O047p569m406J2326P197M492j7489N720J1488j1589k210
6991a4252j6544r018J2659J4490J2665J2341j1449p022J0023L404M6685L1568
6979H5550j405k9299k9093K069j4001K1487O226j8374j5163m4813k0404L3966
6967b3254L2195J944j2194j3868Q151m498N734R668K7416m872m4381O676K177
6954i106K747J6813j1944L303j6905O654j181J2446q801L5253L4193J789l0350
6941C4911j283m665k4276j5424k6316k7276q273J1746K4224K4993J0648P306J996
6928H311k0142k1902n299M343J6478K4602K0360j2662k480L282J4743n84j242
6915B7808O627K024r532j045n410J719J3985j8637k5562k2659Q501K0812n744
$$ plain form
7004 15288 -2168 -18259 -12212 -19781 -24187 -11861 -4664 -172 -17661 -11941 -453 -12042 -14252
6991 -14252 -30796 -39814 -27155 -12665 0 12341 892 -6130 3893 7297 53982 85550
6979 85550 84145 54846 25753 27822 13821 35308 41534 23160 7997 -36816 -57220 -23254
6967 -23254 8941 10885 -1309 -15177 -7026 -11524 -5790 3878 31294 26422 -17959 -11283 -9106
6954 -9106 -6359 10454 -1490 1813 -15092 -8438 -9619 2827 -5974 29279 63472 65261 34911
6941 34911 33628 28963 4687 -10737 -37053 -64329 -72602 -60856 -36632 -11639 -991 6315 8311
6928 8311 -11831 -33733 -39032 -34689 -18211 6391 26751 14089 11609 14891 29634 29050 27808
6915 27808 34435 36459 26927 25882 20472 22191 36176 17539 -8023 -30682 -22181 -1369 -7113
6902g113q842p24L1502R682k7599j7451l464M038P048j2087Q26K2921m719j9620
6888b5602j2849J4408J5734j3555j8982o446J5579J6634j1418K5556J5675R208
6876B3942j5485k09j782l158r269L396K5978L663k5218o551l988P293l842J7600
6862A2370Q386k6278k740o025J317l935j5114j2872N166K6048N666m761J5583
6849B811k44j2107q742j1738k642J9516R263n619L6933J3120j8735j8801J673
6836D688J0944K517j7717L912K1925J3179q358k1388k8397q281P582o827L359
6823b2862L4920J6982l505L1550R560o2448J0950K241l980j0429k0018J3326m58
6810d171J716K0514r881k076j495j6947l866J3480k2842k9168R399l793N409K5775
$$ plain form
6902 -7113 -15955 -16679 14823 24505 -3094 -20545 -24009 -19971 -12923 -25010 -24184 -1263 -5982 -25602
6888 -25602 -38451 -24043 -8309 -21864 -40846 -47292 -31713 -15079 -26497 -941 14734 23942
6876 23942 8457 8248 6466 3308 -5961 -2565 23413 27076 1858 -4693 -8681 -1388 -5230 12370
6862 12370 20756 -5522 -8262 -14287 -12970 -16905 -32019 -44891 -39725 -13677 -8011 -12772 2811
6849 2811 2567 -9540 -18282 -30020 -32662 -13146 -3883 -9502 27431 40551 21816 3015 4688
6836 4688 15632 18149 432 4344 26269 39448 31090 9702 -18695 -26976 -19394 -26221 -22862
6823 -22862 12058 29040 25535 57085 66645 4197 15147 17388 13408 2979 -17039 -3713 -4171
6810 -4171 -2455 18059 8178 6102 4607 -12340 -16206 -2726 -25568 -54736 -45337 -49130 -43721 -17946
$$ [...]
##END NTUPLES=NMR SPECTRUM
##END=
