##TITLE=Analysis number 328808
Compound Code mo 08275
Project Code adrs
Chemist Name fudan
##JCAMPDX= 6.0         $$ Bruker NMR JCAMP-DX V2.0
##DATA TYPE= NMR SPECTRUM
##DATA CLASS= NTUPLES
##ORIGIN= Bruker BioSpin GmbH
##OWNER= nmr
$$ XWIN-NMR		Version 3.5
$$ Thu Jul  5 10:11:55 2007 GMT Daylight Time (UT+1h)  MAYBRIDGE\nmr@NMR_250MHZ
##.OBSERVE FREQUENCY= 250.131544655141
##.OBSERVE NUCLEUS= ^1H
##.ACQUISITION MODE= SIMULTANEOUS (DQD)
##.ACQUISITION SCHEME= undefined
##.AVERAGES= 16
##.DIGITISER RES= 18
##SPECTROMETER/DATA SYSTEM= dpx250
##.PULSE SEQUENCE= zg30
##.SOLVENT NAME= DMSO
##.SHIFT REFERENCE= (INTERNAL, DMSO, 0, 16.522)
##AUDIT TRAIL= $$ (NUMBER, WHEN, WHO, WHERE, WHAT)
$$ ##TITLE= Audit trail, XWIN-NMR		Version 3.5
$$ ##JCAMPDX= 5.01
$$ ##ORIGIN= Bruker BioSpin GmbH
$$ ##OWNER= nmr
$$ C:\u/data/dgb/nmr/ADRS/460/pdata/1/auditp.txt
$$ ##AUDIT TRAIL=  $$ (NUMBER, WHEN, WHO, WHERE, WHAT)
(   1,<2007-07-05 10:11:31.86 +100>,<MAYBRIDGE\nmr>,<NMR_250MHZ>,
      <created by zg, POWCHK disabled, PULCHK disabled
       configuration hash MD5:
       76 6E 9A 78 1E 09 19 81 EC 84 63 8F B0 6A 59 2D
       data hash MD5: 64K
       B6 55 67 66 BB 7B 74 70 28 06 7E CA CD 73 C8 9E>)
(   2,<2007-07-05 10:11:45.80 +100>,<MAYBRIDGE\nmr>,<NMR_250MHZ>,
      <Start of raw data processing
       ef LB = 0.3 FT_mod = 6 PKNL = 1 SI = 32K 
       data hash MD5: 32K
       20 36 97 77 09 D3 F9 A6 92 D3 5E EC 59 94 1A F6>)
(   3,<2007-07-05 10:11:47.44 +100>,<MAYBRIDGE\nmr>,<NMR_250MHZ>,
      <apk 
       data hash MD5: 32K
       35 B1 73 08 D7 C5 C6 4C 15 53 BF BA 82 AF 9D 85>)
(   4,<2007-07-05 10:11:48.15 +100>,<MAYBRIDGE\nmr>,<NMR_250MHZ>,
      <abs ABSG = 5 
       data hash MD5: 32K
       6E 0E 27 44 41 3A C7 1B 07 C9 BB 7D CD 10 A8 63>)
$$ ##END=
$$ 
$$ hash MD5
$$ BB 86 43 62 8E 7E D2 92 DF 33 85 9C 3B D8 12 00
##$RELAX= 
##$RELAX= 
##$RELAX= 
##$RELAX= 
##$RELAX= 
##$RELAX= 
##$RELAX= 
$$ Bruker specific parameters
$$ --------------------------
##$DU= <C:\u>
##$EXPNO= 460
##$NAME= <ADRS>
##$PROCNO= 1
##$TYPE= <nmr>
##$USER= <dgb>
##$AMP= (0..31)
100 100 100 100 100 100 100 100 100 100 100 100 100 100 100 100 100 100 
100 100 100 100 100 100 100 100 100 100 100 100 100 100 
##$AQSEQ= 0
##$AQ_mod= 3
##$AUNM= <au_zg>
##$AUTOPOS= <10 >
##$BF1= 250.13
##$BF2= 250.13
##$BF3= 250.13
##$BF4= 250.13
##$BF5= 500.13
##$BF6= 500.13
##$BF7= 500.13
##$BF8= 500.13
##$BYTORDA= 1
##$CFDGTYP= 0
##$CFRGTYP= 5
##$CHEMSTR= <none>
##$CNST= (0..31)
1 1 145 1 1 1 1 1 1 1 1 1 1 1 1 1 1 1 1 1 1 1 1 1 1 1 1 1 1 1 1 1 
##$CPDPRG= <>
##$CPDPRG1= <>
##$CPDPRG2= <>
##$CPDPRG3= <>
##$CPDPRG4= <mlev>
##$CPDPRG5= <mlev>
##$CPDPRG6= <mlev>
##$CPDPRG7= <mlev>
##$CPDPRG8= <mlev>
##$CPDPRGB= <>
##$CPDPRGT= <>
##$D= (0..31)
0 1 0 0 0 0 0 0 0 0.06 0 0 0 0 0 0 0.0002 0 0 0 0 0 0 0 0 0 0 0 0 0 0 
0 
##$DATE= 1183626691
##$DBL= (0..7)
120 120 120 120 120 120 120 120 
##$DBP= (0..7)
150 150 150 150 150 150 150 150 
##$DBP07= 0
##$DBPNAM0= <>
##$DBPNAM1= <>
##$DBPNAM2= <>
##$DBPNAM3= <>
$$ [...]
##$SUBNAM7= <"">
##$SUBNAM8= <"">
##$SUBNAM9= <"">
##$SW= 20.6930455092707
##$SWIBOX= (0..15)
0 0 3 0 0 0 0 0 0 0 0 0 0 0 0 0 
##$SW_h= 5175.983436853
##$TD= 65536
##$TD0= 1
##$TE= 297.16
##$TE2= 300
##$TE3= 300
##$TEG= 300
##$TL= (0..7)
0 120 120 120 120 120 120 120 
##$TP= (0..7)
150 150 150 150 150 150 150 150 
##$TP07= 0
##$TPNAME0= <>
##$TPNAME1= <>
##$TPNAME2= <>
##$TPNAME3= <>
##$TPNAME4= <>
##$TPNAME5= <>
##$TPNAME6= <>
##$TPNAME7= <>
##$TPOAL= (0..7)
0.5 0.5 0.5 0.5 0.5 0.5 0.5 0.5 
##$TPOFFS= (0..7)
0 0 0 0 0 0 0 0 
##$TUNHIN= 0
##$TUNHOUT= 0
##$TUNXOUT= 0
##$USERA1= <user>
##$USERA2= <user>
##$USERA3= <user>
##$USERA4= <user>
##$USERA5= <user>
##$V9= 5
##$VALIST= <valist>
##$VCLIST= <CCCCCCCCCCCCCCC>
##$VD= 0
##$VDLIST= <DDDDDDDDDDDDDDD>
##$VPLIST= <PPPPPPPPPPPPPPP>
##$VTLIST= <TTTTTTTTTTTTTTT>
##$WBST= 1024
##$WBSW= 4
##$XGAIN= (0..3)
0 0 0 0 
##$XL= 0
##$YL= 0
##$YMAX_a= 345491
##$YMIN_a= -207112
##$ZGOPTNS= <>
##$ZL1= 120
##$ZL2= 120
##$ZL3= 120
##$ZL4= 120
##$ABSF1= 16.522
##$ABSF2= -4.171173
##$ABSG= 5
##$ABSL= 3
##$ALPHA= 0
##$AQORDER= 0
##$ASSFAC= 0
##$ASSFACI= 0
##$ASSFACX= 0
##$ASSWID= 0
##$AUNMP= <proc_1d>
##$AZFE= 0.1
##$AZFW= 0.1
##$BCFW= 0
##$BC_mod= 0
##$BYTORDP= 0
##$COROFFS= 0
##$CY= 12.5
##$DATMOD= 1
##$DC= 0
##$DFILT= <>
##$DTYPP= 0
##$F1P= 14.0000005364418
##$F2P= -0.99999901652339
##$FCOR= 0.5
##$FTSIZE= 32768
##$FT_mod= 6
##$GAMMA= 0
##$GB= 0
##$INTBC= 1
##$INTSCL= 1
##$ISEN= 128
##$LB= 0.3
##$LEV0= 0
##$LPBIN= 0
##$MAXI= 10000
##$MC2= 0
##$MEAN= 0
##$ME_mod= 0
##$MI= 0
##$NCOEF= 0
##$NC_proc= -4
##$NLEV= 6
##$NOISF1= 0
##$NOISF2= 0
##$NSP= 0
##$NTH_PI= 0
##$NZP= 0
##$OFFSET= 16.522
##$PC= 1
##$PHC0= -62.92353
##$PHC1= 5.972512
##$PH_mod= 1
##$PKNL= yes
##$PPARMOD= 0
##$PSCAL= 4
##$PSIGN= 0
##$REVERSE= no
##$SF= 250.13
##$SI= 32768
##$SIGF1= 0
##$SIGF2= 0
##$SINO= 400
##$SIOLD= 32768
##$SREGLST= <1H.DMSO>
##$SSB= 0
##$STSI= 32768
##$STSR= 0
##$SW_p= 5175.98343685301
##$SYMM= 0
##$S_DEV= 0
##$TDeff= 65536
##$TDoff= 0
##$TI= <Analysis number 999999
Compound Code 99
Book Reference 9
Project Code 9>
##$TILT= no
##$TM1= 0
##$TM2= 0
##$TOPLEV= 0
##$USERP1= <user>
##$USERP2= <user>
##$USERP3= <user>
##$USERP4= <user>
##$USERP5= <user>
##$WDW= 1
##$XDIM= 32768
##$YMAX_p= 312516730
##$YMIN_p= -300054
$$ End of Bruker specific parameters
$$ ---------------------------------
##NTUPLES= NMR SPECTRUM
##VAR_NAME=  FREQUENCY,     SPECTRUM/REAL,   SPECTRUM/IMAG
##SYMBOL=    X,             R,               I
##VAR_TYPE=  INDEPENDENT,   DEPENDENT,       DEPENDENT
##VAR_FORM=  AFFN,          ASDF,            ASDF
##VAR_DIM=   32768,         32768,           32768
##UNITS=     HZ,            ARBITRARY UNITS, ARBITRARY UNITS
##FACTOR=    0.157963299565203, 1,           1
##FIRST=     4132.6476996994, 0,             0
##LAST=      -1043.33573715361, 0,           0
##MIN=       -1043.33573715361, -300054,     0
##MAX=       4132.6476996994, 312516730,     0
$$ Real data points
##PAGE= N=1
##DATA TABLE= (X++(R..R)), XYDATA
$$ [...]
$$ plain form
25084 1406327 1400496 1403037 1398741 1351567 1301420 1312649 1333945 1274269 1265452 1273099 1294070 1265182
25072 1265182 1233292 1250514 1293269 1244434 1237929 1305543 1353273 1359950 1327765 1265303 1236917 1234496
25060 1234496 1296458 1310171 1282019 1276807 1263013 1231994 1260113 1311919 1318217 1279593 1216708 1219078
25048 1219078 1199563 1208955 1283105 1203787 1184302 1210253 1198607 1175828 1183395 1189058 1173916 1187648
25036 1187648 1194075 1256363 1311904 1310776 1251029 1197016 1226824 1227869 1238837 1214997 1245344 1249507
25024 1249507 1275301 1249482 1271655 1217310 1232035 1228298 1253306 1265095 1238638 1263165 1319354
25013 1319354 1283468 1234858 1182092 1131731 1107611 1143826 1175912 1199183 1158738 1129550 1166321
25002 1166321 1180274 1136024 1171834 1195396 1174532 1159853 1102821 1108547 1070168 1079703 1077214 1103584
$$ packed form
25084A406327n831K541m296m7174n0147J1229K1296n9676q817P647K0971k8888
25072A265182l1890J7222M2755m8835o505O7614M7730O677l2185o2462k8386k421
25060A234496O1962J3713k8152n212j3794l1019K8119N1806O298l8624o2885K370
25048A219078j9515R392P4150p9318j9485K5951j1646k2779P567N663j5142J3732
25036A187648O427O2288N5541j128n9747n4013K9808J045J0968k3840L0347M163
25024A249507K5794k5819K2173n4345J4725l737K5008J1789k6457K4527N6189
25013A319354l5886m8610n2766n0361k4120L6215L2086K3271m0445k9188L6771
25002A166321J3953m4250L5810K3562k0864j4679n7032N726l8379R535k489K6370
$$ plain form
24990 1103584 1101836 1075244 1088504 1111758 1065845 1066794 1135805 1137048 1113663 1085611 1085060 1108000
24978 1108000 1077708 1087651 1071654 1060845 1023550 985085 974371 971379 990911 971465 965265 1000405
24966 1000405 1009298 996698 1015119 950451 953424 1012669 1000649 1011526 1061476 1131868 1143270 1098831
24954 1098831 1111185 1113005 1092855 1056469 1033060 1039990 1113157 1081752 1065005 1034890 1016689 1002395
24942 1002395 1015189 1057643 1080396 1011437 996801 1040017 1041783 1040954 1026919 1046848 1020685 1001827
24930 1001827 999056 986272 1052699 1110744 1059604 1039780 1089597 1094279 1073606 988987 1009977 1022936
24918 1022936 988240 973462 1028006 1044520 1026371 977460 1010469 1078239 1071531 1061885 1081049 1061591
24906 1061591 1055423 1115803 1080599 999065 953502 981788 922408 920595 974024 1013831 1025274 1023718
$$ packed form
24990A103584j748k6592J3260K3254m5913R49O9011J243k3385k8052n51K2940
24978A108000l0292R943j5997j0809l7295l8465j0714k992J9532j9446o200L5140
24966A000405Q893j2600J8421o4668K973N9245j2020J0877M9950P0392J1402m4439
24954A098831J2354J820k0150l6386k3409O930P3167l1405j6747l0115j8201j4294
24942A002395J2794M2454K2753o8959j4636M3216J766q29j4035J9929k6163j8858
24930A001827k771j2784O6427N8045n1140j9824M9817M682k0673q4619K0990J2959
24918A022936l4696j4778N4544J6514j8149m8911L3009O7770o708r646J9164j9458
24906A061591o168O0380l5204q1534m5563K8286n9380j813N3429L9807J1443j556
$$ plain form
24894 1023718 999466 966200 922528 908575 947765 1024588 1032874 1027027 1019391 1034652 995546 994824
24882 994824 1009433 1018202 1098706 1146040 1067506 1035263 1024440 1030853 1053126 1078906 1057508 986814
24870 986814 996627 1050780 1058424 1086252 1042218 990476 1001338 1012290 1083327 1127234 1082309 1092094
24858 1092094 1069393 1048647 1059122 1081752 1035166 994127 1006952 995503 1007675 993426 965859
24847 965859 1031968 1071736 1047760 1068392 1116744 1123842 1062342 1097094 1132479 1158148 1204846 1225852
24835 1225852 1179100 1125093 1114636 1147411 1143373 1094715 1079232 1053700 1068735 1108462 1102056 1085269
24823 1085269 1115604 1131680 1155764 1170737 1144924 1205653 1221846 1179879 1184279 1245235 1296194
24812 1296194 1323934 1276855 1212635 1186299 1229535 1233645 1178895 1153602 1116029 1123279 1165149 1170855
$$ packed form
24894A023718k4252l3266m3672j3953L9190P6823Q286n847p636J5261l9106p22
24882I94824J4609Q769Q0504M7334p8534l2243j0823O413K2273K5780k1398p0694
24870I86814R813N4153P644K7828m4034n1742J0862J0952P1037M3907m4925R785
24858A092094k2701k0746J0475K2630m6586m1039J2825j1449J2172j4249k7567
24847I65859O6109L9768k3976K0632M8352P098o1500L4752L5385K5669M6698K1006
24835A225852m6752n4007j0457L2775m038m8658j5483k5532J5035L9727o406j6787
24823A085269L0335J6076K4084J4973k5813O0729J6193m1967M400O0956N0959
24812A296194K7740m7079o4220k6336M3236M110n4750k5293l7573P250M1870N706
$$ plain form
24800 1170855 1166335 1108208 1098165 1094247 1117606 1128307 1110313 1070252 1044968 1061397 1044632 1047992
24788 1047992 1025542 1055394 1075955 1047141 1097529 1163053 1150445 1087600 1017245 1020615 1051766
24777 1051766 1049868 1053514 999269 916495 952637 967990 926637 917568 932613 931994 857153 887010
24765 887010 950126 956485 932179 951449 1000861 992940 973258 950774 967650 971048 940871 861951
24753 861951 834354 823652 810224 810921 791163 764804 750660 849899 885628 876602 914161 900386
24741 900386 834800 742649 729576 730057 719899 813324 829114 849543 815787 783586 739979 717368
24729 717368 709903 719559 748832 769822 763208 733680 645745 662816 736306 735988 712415 770375
24717 770375 806170 808614 817082 778674 706905 684090 688908 703033 699275 672974 679249 610931
$$ packed form
24800A170855m520n8127j0043l918K3359J0701j7994m0061k5284J6429j6765L360
24788A047992k2450K9852K0561k8814N0388O5524j2608o2845p0355L370L1151
24777A051766j898L646n4245q2774L6142J5353m1353r069J5045o19p4841K9857
24765H87010O3116O359k4306J9270M9412p921j9682k2484J6876L398l0177p8920
24753H61951k7597j0702j3428O97j9758k6359j4144R9239L5729r026L7559j3775
24741I00386o5586r2151j3073M81j0158R3425J5790K0429l3756l2201m3607k2611
24729G17368p465R656K9273K0990o614k9528q7935J7071P3490l18k3573N7960
24717G70375L5795K444Q468l8408p1769k2815M818J4125l758k6301O275o8318
$$ plain form
24705 610931 606793 610597 634597 638999 725014 730008 708161 658263 628321 663585 740095 757323
24693 757323 763365 793227 791147 728647 748855 779371 752487 708947 699925 712816 770725 802038
24681 802038 829760 759292 702592 652662 653255 666702 641006 671418 722574 721132 671835 697883
24669 697883 703084 665106 641597 660212 686461 770810 775541 799787 801267 802819 745513 719386
24657 719386 739816 741132 682024 681768 713204 757496 763490 696936 692969 685131 699600 664593 617740
24644 617740 634867 612885 541945 552747 601780 573289 557542 606747 678524 666713 608637
24633 608637 588021 653584 678143 681472 641653 590230 590345 553710 570177 587477 617438 609663
24621 609663 583018 602692 607711 582323 595648 642061 710801 738738 680987 617611 588830 588350
$$ packed form
24705F10931m138L804K4000M402Q6015M994k1847m9898k9942L5264P6510J7228
24693G57323O042K9862k080o2500K0208L0516k6884m3540r022J2891N7909L1313
24681H02038K7722p0468n6700m9930N93J3447k5696L0412N1156j442m9297K6048
24669F97883N201l7978k3509J8615K6249Q4349M731K4246J480J552n7306k6127
24657G19386K0430J316n9108k56L1436M4292N994o6554l967p838J4469l5007m6853
24644F17740J7127k1982p0940J0802M9033k8491j5747M9205P1777j1811n8076
24633F08637k0616O5563K4559L329l9819n1423J15l6635J6467J7300K9961p775
24621F09663k6645J9674N019k5388J3325M6413O8740K7937n7751o3376k8781m80
$$ plain form
24609 588350 599184 609633 579173 551417 523453 530214 555688 566509 570404 587477 631014 599992
24597 599992 540582 531782 547880 568308 587876 615637 599197 608792 646296 637400 575158 547970
24585 547970 570239 549681 480073 456385 462242 466980 477504 471831 435647 435934 440086 477557 494940
24572 494940 483926 411179 368748 383075 397773 442598 433113 435502 429583 421667 449278 446709
24560 446709 459944 459068 486854 454129 418442 424173 431093 475813 536509 564178 534872 521532
24548 521532 499401 445619 455177 483266 447592 465583 459344 460766 526902 581027 593942 519587
24536 519587 435078 423695 431223 405515 418426 452423 455816 497470 507611 438939 369374 415123
24524 415123 437169 491174 485610 464822 519823 510083 449104 385548 353206 402512 405133 414534
$$ packed form
24609E88350J0834J0449l0460k7756k7964O761K5474J0821L895J7073M3537l1022
24597E99992n9410q800J6098K0428J9568K7761j6440R595L7504q896o2242k7188
24585E47970K2269k0558o9608k3688N857M738J0524n673l6184K87M152L7471J7383
24572D94940j1014p2747m2431J4327J4698M4825r485K389n919p916K7611k569
24560D46709J3235q76K7786l2725l5687N731O920M4720O0696K7669k9306j3340
24548E21532k2131n3782R558K8089l5674J7991o239J422O6136N4125J2915p4355
24536E19587q4509j1383P528k5708J2911L3997L393M1654J0141o8672o9565M5749
24524D15123K2046N4005n564k0788N5001r740o0979o3556l2342M9306K621R401
$$ plain form
24512 414534 404636 396288 379092 378991 368134 353641 314888 290969 291323 337404 401614 439138 495478
24499 495478 538452 489063 454271 474537 434013 437385 466795 416332 435277 454665 454817 512103
24487 512103 587140 511965 453730 426723 456050 462693 460198 421311 365867 376073 435625 471029
24475 471029 453448 413285 449438 447807 388361 352637 359148 407476 495747 519905 466826 465571
24463 465571 461583 422456 333533 367798 345426 399963 442426 375734 358127 379837 394443 370489
24451 370489 366609 372101 386318 423389 416533 396005 396084 370914 371776 379770 374249 428539 447480
24438 447480 454136 447736 360275 324329 368181 396249 426338 388107 393258 386615 366715 391163
24426 391163 429180 462321 441857 378146 378354 390819 412232 439798 490414 524461 498931 483149
$$ packed form
24512D14534r898q348j7196j01j0857j4493l8753k3919L54M6081O4210L7524N6340
24499D95478M2974m9389l4792K0266m0524L372K9410n0463J8945J9388J52N7286
24487E12103P5037p5175n8235k7007K9327O643k495l8887n5444J0206N9552L5404
24475D71029j7581m0163L6153j631n9446l5724O511M8328Q8271K4158n3079j255
24463D65571l988l9127q8923L4265k2372N4537M2463o6692j7607K1710J4606k3954
24451C70489l880N492J4217L7071o856k0528P9k5170Q62P994n521N4290J8941
24438D47480O656o400q7461l5946M3852K8068L0089l8231N151o643j9900K4448
24426C91163L8017L3141k0464o3711K08J2465K1413K7566N0616L4047k5530j5782
$$ plain form
24414 483149 447766 455347 461471 488128 510888 482082 464449 442489 412755 394997 370375 378948
24402 378948 376359 339421 288197 270571 313685 371932 417276 484958 531554 496130 449255 452133
24390 452133 385454 329055 296595 338199 312729 295921 261879 262723 285791 295723 331162 367271
24378 367271 375011 340698 317273 315930 346592 359670 382145 376507 385119 382136 398283 338767
24366 338767 326112 282874 299168 352736 333304 321412 346337 351188 334906 304914 321352 303155
24354 303155 350682 325291 273805 293355 346730 401458 342723 384508 398847 363994 432777
24343 432777 428528 387879 340982 392464 406784 381603 405619 417618 449819 379842 308543 290636
24331 290636 318018 294896 307687 339861 336315 315209 340228 401324 392310 400784 337293 334113
$$ packed form
24414D83149l5383P581O124K6657K2760k8806j7633k1960k9734j7758k4622Q573
24402C78948k589l6938n1224j7626M3114N8247M5344O7682M6596l5424m6875K878
24390D52133o6679n6399l2460M1604k5470j6808l4042Q44K3068R932L5439L6109
24378C67271P740l4313k3425j343L0662J3078K2475n638Q612k983J6147n9516
24366C38767j2655m3238J6294N3568j9432j1892K4925M851j6282k9992J6438j8197
24354C03155M7527k5391n1486J9550N3375N4728n8735M1785J4339l4853O8783
24343D32777m249m0649m6897N1482J4320k5181K4016J1999L2201o9977p1299j7907
24331B90636K7382k3122J2791L2174l546k1106K5019O1096r014Q474o3491l180
$$ plain form
24319 334113 365738 376095 312157 309698 308145 274008 210973 137761 157347 229539 263689 332272
24307 332272 339820 297303 298670 323642 351927 384664 426999 428778 426822 433894 495655 450087
24295 450087 340354 350452 327494 320711 274573 262969 313659 352550 337637 288755 313929
24284 313929 314600 320536 349346 423932 441047 333047 335389 357195 312932 337959 363630 338555
24272 338555 298919 328713 350645 364849 353517 379753 369428 315831 286330 266986 229037
24261 229037 265378 280409 277441 265536 240375 268709 238735 234400 248261 202783 200322 250130
24249 250130 269629 247315 283403 329273 315608 304279 297186 316244 295928 289932 345903 361504
24237 361504 357726 271346 213062 250227 292216 306539 311936 335067 342325 289937 319306 325269
$$ packed form
24319C34113L1625J0357o3938k459j553l4137o3035p3212J9586P2192L4150O8583
24307C32272P548m2517J367K4972K8285L2737M2335J779j956P072O1761m5568
24295D50087j09733J0098k2958o783m6138j1604N0690L8891j4913m8882K5174
24284C13929O71N936K8810P4586J7115j08000K342K1806m4263K5027K5671k5075
24272C38555l9636K9794K1932J4204j1332K6236j0325n3597k9501j9344l7949
24261B29037L6341J5031k968j1905k5161K8334k9974m335J3861m5478k461M9808
24249B50130J9499k2314L6088M5870j3665j1329p093J9058k0316n996N5971J5601
24237C61504l778q6380n8284L7165M1989J4323N397K3131P258n2388K9369N963
$$ plain form
24225 325269 337287 392738 370834 342774 287577 279638 246943 225623 270578 270561 236308 258917
24213 258917 261601 254935 288810 276478 320985 299024 328104 401634 411391 402215 354955 279577
24201 279577 273083 293252 290173 286751 238847 196307 248450 264496 299239 349404 341845 309308
24189 309308 314717 278105 258531 277812 250166 203017 167979 120770 165571 229225 211716 225479
24177 225479 253607 263229 214757 191878 159023 139751 143259 203103 263210 240289 229381 169040
24165 169040 166571 192066 182598 198730 332354 307585 299482 282085 245353 216354 213510 248118
24153 248118 263944 275688 263524 260895 237634 191897 204545 280206 337092 314255 318366 305800
24141 305800 316522 355826 252935 214850 273855 302597 276243 264592 271629 262078 251632 204075
$$ packed form
24225C25269J2018N5451k1904k8060n5197p939l2695k1320M4955j7l4253K2609
24213B58917K684o666L3875j2332M4507k1961K9080P3530R757r176m7260p5378
24201B79577o494K0169l079l422m7904m2540N2143J6046L4743N0165p559l2537
24189C09308N409l6612j9574J9281k7646m7149l5038m7209M4801O3654j7509J3763
24177B25479K8128R622m8472k2879l2855j9272L508N9844O0107k2921j0908o0341
24165A69040k469K5495r468J6132J33624k4769q103j7397l6732k8999k844L4608
24153B48118J5826J1744j2164k629k3261m5737J2648P5661N6886k2837M111j2566
24141C05800J0722L9304j02891l8085N9005K8742k6354j1651P037r551j0446m7557
$$ plain form
24129 204075 212099 258921 202889 152166 189615 199416 202436 251814 260711 344749 319025 314924
24117 314924 232040 184593 219367 264853 287981 332710 289669 241542 229964 237764 241933 271367
24105 271367 254684 176328 192944 157748 222245 274969 272520 236753 217768 274840 288726 298640
24093 298640 280564 279665 240613 151705 163328 173609 196092 229723 232795 145764 144222 156579
24081 156579 180427 180685 224772 246573 197252 239128 259340 204399 172949 180111 239318 247705
24069 247705 205337 218097 193544 225322 248205 221734 256490 323005 314630 264959 250714 244826
24057 244826 217038 180263 128421 161528 162512 129784 114912 122352 94825 139959 183958 198585
24045 198585 231945 213411 239110 250187 175598 152238 196381 288629 349505 301551 256574
$$ packed form
24129B04075Q024M6822n6032n0723L7449R801L020M9378Q897Q4038k5724m101
24117C14924q2884m7447L4774M5486K3128M4729m3041m8127j1578P800M169K9434
24105B71367j6683p8356J6616l5196O4497N2724k449l5767j8985N7072J3886R914
24093B98640j8076q99l9052q8908J1623J0281K2483L3631L072q7031j542J2357
24081A56579K3848K58M4087K1801m9321M1876K0212n4941l1450P162N9207Q387
24069B47705m2368J2760k4553L1778K2883k6471L4756O6515q375m9671j4245n888
24057B44826k7788l6775n1842L3107R84l2728j4872P440k7527M5134M3999J4627
24045A98585L3360j8534K5699J1077p4589k3360M4143R2248O0876m7954m4977
$$ plain form
24034 256574 265474 267566 210326 183107 225618 283251 244661 300578 345915 308646 291203 273509
24022 273509 254133 215680 202394 281183 342705 339824 264420 243984 192199 158230 132920 122611
24010 122611 166969 276662 339828 293957 272208 196147 193124 212281 193934 211319 270768
23999 270768 258960 236676 228619 236024 269928 196240 174917 204789 268575 251094 224428 257376
23987 257376 290533 322241 252551 209942 218011 171259 141166 174517 179372 168013 238062 248696
23975 248696 235974 209588 125072 110963 79451 113399 145014 155988 194417 190525 158908 140665
23963 140665 150773 140283 125966 133490 137088 124000 211001 206764 122040 131404 200679 236308
23951 236308 260025 257716 259572 221491 165848 167203 157109 223985 263390 219778 251577 269066
$$ packed form
24034B56574Q900K092n7240k7219M2511N7633l8590N5917M5337l7269j7443j7694
24022B73509j9376l8453j3286P8789O1522k881p5404k0436n1785l3969k5310j0309
24010A22611M4358J09693O3166m5871k1749p6061l023J9157j8347J7385N9449
23999B70768j1808k2284q057P405L3904p3688k1323K9872O3786j7481k6666L2948
23987B57376L3157L1708o9690m2609Q069m6752l0093L3351M855j1359P0049J0634
23975B48696j2722k6386q4516j4109l1512L3948L1615J0974L8429l892l1617j8243
23963A40665J0108j0490j4317P524L598j3088Q7001m237q4724R364O9275L5629
23951B36308K3717k309J856l8081n5643J355j0094O6876L9405m3612L1799J7489
$$ plain form
23939 269066 189285 181728 198130 214359 247823 221070 175957 141721 172063 146436 171090 221104
23927 221104 246751 206739 158358 172941 185834 168614 143878 100399 162158 207008 170589
23916 170589 199324 185245 171366 187877 145472 85867 75535 129226 193351 180278 142316
23905 142316 205843 228936 262736 260884 204932 150997 114047 118279 138520 124980 147802 247259
23893 247259 227629 244216 220599 167659 130023 162923 162635 169167 141016 133901 103366 114043
23881 114043 161980 157992 163425 201140 225100 175008 120713 143360 176346 212313 194505 161829
23869 161829 141916 90081 107293 150734 165249 155253 160316 140668 201367 128099 92228 135941
23857 135941 199720 173143 136133 193238 179417 168804 147910 139898 98148 95118 92644 62569
$$ packed form
23939B69066p9781p557J6402J6229L3464k6753m5113l4236L0342k5627K4654N0014
23927B21104K5647m0012m8381J4583J2893j7220k4736m3479O1759M4850l6419
23916A70589K8735j4079j3879J6511m2405n9605j0332N3691O4125j3073l7962
23905A42316O3527K3093L3800j852n5952n3935l6950M232K0241j3540K2822R9457
23893B47259j9630J6587k3617n2940l7636L2900k88O532k8151p115l0535J0677
23881A14043M7937l988N433L7715K3960n0092n4295K2647L2986L5967j7808l2676
23869A61829j9913n1835J7212M3441J4515r996N063j9648O0699p3268l5871M3713
23857A35941O3779k6577l7010N7105j3821j0613k0894q012m1750l030k474l0075
$$ plain form
23845 62569 102413 112535 114671 164620 195488 173405 163114 164216 131341 176718 146165 93051
23833 93051 82085 99971 121223 118507 135847 137759 92877 121866 150931 153917 158289 108383
23821 108383 68224 84159 129688 143822 149865 193535 179788 174745 129336 174905 211057 192659
23809 192659 179221 172968 157894 187522 174938 149122 131707 137458 149033 124527 128729 164784
23797 164784 156570 72934 60532 79733 112522 125046 75275 62096 98700 141903 164372 164188
23785 164188 187508 190391 151352 126264 85329 104677 111039 101502 140171 181535 184129 142508
23773 142508 117498 81067 60407 151724 119712 92115 142320 154759 141705 183204 189721 183872
23761 183872 171900 183704 176170 177958 195401 189679 125369 84698 113571 118880 116538 159125
$$ packed form
23845F2569L9844J0122K136M9949L0868k2083j0291J102l2875M5377l0553n3114
23833I3051j0966J7886K1252k716J7340J912m4882K8989K9065K986M372m9906
23821A08383m0159J5935M5529J4134O043M3670j3747n043m5409M5569L6152j8398
23809A92659j3438o253j5074K9628j2584k5816j7415N751J1575k4506M202L6055
23797A64784q214q3636j2402J9201L2789J2524m9771j3179L6604M3203K2469j84
23785A64188K3320K883l9039k5088m0935J9348O362r537L8669M1364K594m1621
23773A42508k5010l6431k0660R1317l2012k7597N0205J2439j3054M1499O517n849
23761A83872j1972J1804p534J788J7443n722o4310m0671K8873N309k342M2587
$$ plain form
23749 159125 202129 206777 232905 189492 128030 107589 63498 77731 87950 100185 130368 213244
23737 213244 233920 146464 61507 17428 65277 123548 135879 117259 90022 88494 104438 109591
23725 109591 120853 124560 150187 193344 217452 105894 101369 163389 230532 248289 178724 152500
23713 152500 141246 172361 189556 203335 118460 101570 89696 66599 77085 92336 122468
23702 122468 147433 107411 100055 70276 38878 78219 121541 127925 106351 124637 164480 162678
23690 162678 167632 117045 127313 61916 28717 18933 57402 86352 152440 169759 157214 139860
23678 139860 169359 111411 78867 71990 109344 117348 125942 89099 96474 87964 141200 142495 138991
23665 138991 190826 237621 230925 185386 162080 151110 88459 60275 42115 53937 32267 90146
$$ packed form
23749A59125M3004M648K6128m3413o1462k0441m4091J4233J0219J2235L0183Q2876
23737B13244K0676q7456q4957m4079M7849N8271J2331j8620k7237j528J5944N153
23725A09591J1262L707K5627M3157K4108j11558m525O2020O7143J7757o9565k6224
23713A52500j1254L1115J7195J3779q4875j6890j1874k3097J0486J5251L0132
23702A22468K4965m0022p356k9779l1398L9341M3322O384k1574J8286L9843j802
23690A62678M954n0587J0268o5397l3199r784L8469K8950O6088J7319j2545j7354
23678A39860K9499n7948l2544o877L7354Q004Q594l6843P375q510N3236J295l504
23665A38991N1835M6795o696m5539k3306j0970o2651k8184j8160J1822k1670N7879
$$ plain form
23653 90146 138745 202149 230679 231384 175731 150309 173866 189047 144972 140145 111085 87924
23641 87924 70306 45129 46836 90674 48158 38098 69360 99029 128967 157708 172989 116388
23629 116388 160770 188229 138985 160068 178573 112246 101927 73996 66383 99584 153473 196083
23617 196083 251070 256885 182513 131310 118467 129676 71061 43807 17584 55292 42600 34950
23605 34950 119230 132225 91789 37286 -8170 34848 111684 100726 92199 124359 121603 110933
23593 110933 101391 75655 89709 159113 170300 141458 88017 72470 71790 93225 97381 121533
23581 121533 142724 127007 63241 32606 9330 26652 85432 108716 46329 5516 -48423
23570 -48423 3216 81187 129846 112934 111530 131789 139241 112056 101997 124460 127444 75671
$$ packed form
23653I0146M8599O3404K8530P05n5653k5422K3557J5181m4075m827k9060k3161
23641H7924j7618k5177J707M3838m2516j0060L1262K9669K9938K8741J5281n6601
23629A16388M4382K7459m9244K1083J8505o6327j0319k7931p613L3201N3889M2610
23617A96083N4987N815p4372n1203j2843J1209n8615k7254k6223L7708j2692p650
23605C4950Q4280J2995m0436n4503m5456M3018P6836j0958q527L2160k756j0670
23593A10933r542k5736J4054O9404J1187k8842n3441j5547o80K1435M156K4152
23581A21533K1191j5717o3766l0635k3276J7322N8780K3284o2387m0813n3939
23570d8423N1639P7971M8659j6912j404K0259P452k7185j0059K2463K984n1773
$$ plain form
23558 75671 72749 121489 138594 204446 176371 172622 173177 126141 99094 85207 40842 114214
23546 114214 149842 125131 148012 122656 151403 160250 125746 152039 173705 189189 152005 88339
23534 88339 61482 53831 99323 74141 81735 54253 43684 84300 95196 116833 66173 16943
23522 16943 15271 2457 -12809 -7138 79101 84411 106186 107927 97699 138381 161255 136159
23510 136159 95010 126035 176796 166623 164841 188613 187064 149796 141563 156174 82072 75360
23498 75360 82375 113300 102850 111117 43529 10604 53767 107815 135261 126122 111218 89275
23486 89275 18307 -11453 35643 124290 117994 123127 116893 114745 100797 95567 108221 98032 103556
23473 103556 127170 172030 183567 125094 137133 167041 162546 222511 209807 176313 121117 48316
$$ packed form
23558G5671k922M8740J7105O5852k8075l749N55m7036k7047j3887m4365P3372
23546A14214L5628k4711K2881k5356K8747Q847l4504K6293K1666J5484l7184o3666
23534H8339k6857p651M5492k5182P594k7482j0569M0616J0896K1637n0660m9230
23522A6943j672j2814j5266N671Q6239N310K1775J741j0228M0682K2874k5096
23510A36159m1149L1025N0761j0173j782K3772j549l7268q233J4611p4102o712
23498G5360P015L0925j0450Q267o7588l2925M3163N4048K7446r139j4904k1943
23486H9275p0968k9760M7096Q8647o296N133o234k148j3948n230J2654j0189N524
23473A03556K3614M4860J1537n8473J2039K9908m495N9965j2704l3494n5196p2801
$$ plain form
23461 48316 68190 109922 104426 101401 73685 63167 85864 60362 42679 76908 96628 123148
23449 123148 131684 78273 -11525 -11872 53370 140303 157880 130825 145709 107223 149131 136746
23437 136746 143607 138132 93679 69010 65036 67409 92404 148122 145334 150356 65338 65837 81776
23424 81776 93993 114267 91824 86389 147759 180780 187233 176630 130166 103876 112926 115638
23412 115638 144432 160420 140624 129189 68384 86273 127350 108729 100716 151269 102948 6311
23400 6311 8028 53311 95183 119424 131638 74334 76867 83642 36898 23431 53078 14772
23388 14772 2396 55407 69173 72666 116474 94591 47034 41256 53760 14781 5185 59298
23376 59298 55684 -6673 -20741 -88666 -36788 55233 74213 56985 27159 -9520 -42653 -6419
$$ packed form
23461D8316J9874M1732n496l025k7716j0518K2697k5502j7683L4229J9720K6520
23449A23148Q536n3411q9798l47O5242Q6933J7577k7055J4884l8486M1908j2385
23437A36746O861n475m4453k4669l974K373K4995N5718k788N022q5018M99J5939
23424H1776J2217K0274k2443n435O1370L3021O453j0603m6464k6290R050K712
23412A15638K8794J5988j9796j1435o0805J7889M1077j8621q013N0553m8321r6637
23400F311J717M5283M1872K4241J2214n7304K533O775m6744j3467K9647l8306
23388A4772j2376N3011J3766L493M3808k1883m7557n778J2504l8979r596N4113
23376E9298l614o2357j4068o7925N1878R2021J8980j7228k9826l6679l3133L6234
$$ plain form
23364 -6419 39735 39463 50732 62042 81183 74891 74062 111650 123148 59006 38536 63252 59655
23351 59655 100400 82067 20044 -40809 -34870 15686 74139 126082 119674 57741 37213 9084
23339 9084 20141 437 -10533 41776 46030 22984 -11326 7846 27588 54146 64228 92325
23327 92325 80728 10627 41528 108091 102984 80877 44405 56287 92260 133855 110875 93461
23315 93461 87066 120206 167762 159922 146175 113934 157192 134676 115507 76762 65284 70235
23303 70235 73297 93750 138177 155011 108156 29458 127 -15479 9279 36706 13022 39800
23291 39800 74692 25084 41200 76604 69055 60745 39088 27191 -3620 20048 75768 91947
23279 91947 68412 40341 34602 104886 79316 28513 77240 72483 62898 27187 54845 103667
$$ packed form
23364f419M6154k72J1269J1310J9141o292q29L7588J1498o4142k0470K4716l597
23351E9655M0745j8333o2023o0853N939N0556N8453N1943o408o1933k0528k8129
23339I084J1057j9704j0970N2309M254k3046l4310J9172J9742K6558J0082K8097
23327I2325j1597p0101L0901O6563n107k2107l6472J1882L5973M1595k2980j7414
23315I3461o395L3140M7556p840j3747l2241M3258k2516j9169l8745j1478M951
23303G0235L062K0453M4427J6834m6855p8698k9331j5606K4758K7427k3684K6778
23291C9800L4892m9608J6116L5404p549q310k1657j1897l0811K3668N5720J6179
23279I1947k3535k8071n739P0284k5570n0803M8727m757r585l5711K7658M8822
$$ plain form
23267 103667 83453 89144 67979 56196 87510 74671 19657 13555 24129 96311 98732 90496
23255 90496 153083 165877 91520 70813 104381 111201 87909 84401 80347 48856 20883 48357
23243 48357 98748 96775 75330 12528 -17603 4462 3404 10013 48058 35006 52382 100428
23231 100428 65275 54910 97189 132109 152629 167047 129256 110399 131494 110227 62019
23220 62019 64498 21656 28753 25401 63692 50153 81392 84346 111009 89621 92723 89299 44321
23207 44321 64937 83278 74884 48680 38057 76458 99581 93473 51303 91281 83029 111047
23195 111047 106972 37472 32584 50127 58350 45206 27936 -33961 -56554 -59178 15380 22478
23183 22478 4759 -7670 49578 112919 64428 76485 138101 146970 115376 98975 79778 33852
$$ packed form
23267A03667k0214N691k1165j1783L1314j2839n5014o102J0574P2182K421q236
23255I0496O2587J2794p4357k0707L3568O820k3292l508m054l1491k7973K7474
23243D8357N0391j973k1445o2802l0131K2065j058O609L8045j3052J7376M8046
23231A00428l5153j0365M2279L4920K0520J4418l7791j8857K1095k1267m8208
23220F2019K479m2842P097l352L8291j3539L1239K954K6663k1388L102l424m4978
23207D4321K0616J8341q394k6204j0623L8401K3123o108m2170L9978q252K8018
23195A11047m075o9500m888J7543Q223j3144j7270o1897k2593k624P4558P098
23183B2478j7719j2429N7248O3341m8491J2057O1616Q869l1594j6401j9197m5926
$$ plain form
23171 33852 51497 88281 83254 7812 -49222 -28616 -34343 -62835 -38068 34705 48213 46420
23159 46420 30912 -42327 -25446 42897 34300 -8927 24365 71458 105560 80891 67706 108446
23147 108446 155928 117510 70314 28994 33723 55148 52239 127640 78943 10105 -40947 21216
23135 21216 60309 53319 -2696 -44495 3556 -19127 -25303 -7467 -1781 31247 20039 16244
23123 16244 60628 91027 98453 98460 40362 -23952 -35321 -25491 14850 66538 50812 58214 73013
23110 73013 43774 4013 62210 81322 51472 76449 79699 60255 58819 105981 97467 57302
23098 57302 47999 29132 -31676 -23935 -21732 -9158 95148 87788 35126 29799 14505 43852
23086 43852 50394 39524 53015 29312 36178 33655 48962 65887 104603 95267 54434 74760
$$ packed form
23171C3852J7645L6784n027p5442n7034K0606n727k8492K4767P2773J3508j793
23159D6420j5508p3239J6881O8343q597m3227L3292M7093L4102k4669j3185M0740
23147A08446M7482l8418m7196m1320M729K1425k909P5401m8697o8838n1052O2163
23135B1216L9093o990n6015m1799M8051k2683o176J7836N686L3028j1208l795
23123A6244M4384L0399P426Pn8098o4314j1369R830M0341N1688j5726P402J4799
23110G3013k9239l9761N8197J9112k9850K4977L250j9444j436M7162q514m0165
23098E7302r303j8867o0808P741K203J2574J04306p360n2662n327j5294K9347
23086D3852O542j0870J3491k3703O866k523J5307J6925L8716r336m0833K0326
$$ plain form
23074 74760 99838 108889 77811 67599 61567 82453 93577 165268 140609 76367 -2314 -2007
23062 -2007 66756 119071 110431 116871 104266 101095 61019 50058 28863 -7535 22065 68044
23050 68044 70977 32726 4224 37565 22281 -40066 -118469 -106027 -71275 -110663 -84621 -19160
23038 -19160 25536 37680 -18419 -87991 -100536 -51898 -33813 -47423 -78910 -60628 -7896 78077
23026 78077 99547 74445 63226 62573 39828 30383 56174 17244 -35271 -99599 -63928 -22087
23014 -22087 -58015 -68071 -29046 25248 47895 57453 76741 40987 25536 19431 81251 31486
23002 31486 36253 81301 79172 9501 -21154 -20556 -9108 55533 71788 85943 44682 27661
22990 27661 6273 -55429 -93373 -77437 -74032 -115706 -59460 -27101 -45262 -107504 -40309 28013
$$ packed form
23074G4760K5078R051l1078j0212o032K0886J1124P1691k4659o4242p8681L07
23062b007O8763N2315q640O440j2605l171m0076j0961k1195l6398K9600M5979
23050F8044K933l8251k8502L3341j5284o2347p8403J2442L4752l9388K6042O5461
23038a9160M4696J2144n6099o9572j2545M8638J8085j3610l1487J8282N2732Q5973
23026G8077K1470k5102j1219o53k2745r445K5791l8930n2515o4328L5671M1841
23014b2087l5928j0056L9025N4294K2647R558J9288l5754j5451o105O1820m9765
23002C1486M767M5048k129o9671l0655N98J1448O4641J6255J4155m1261j7021
22990B7661k1388o1702l7944J5936L405m1674N6246L2359j8161o2242O7195O8322
$$ plain form
22978 28013 20090 29130 -27512 -52424 -22483 -9409 22739 48637 13196 9407 -5273 -55352
22966 -55352 -40719 -10728 -24700 -64699 -8517 67108 122745 108774 74027 13889 42121 28538
22954 28538 52300 80209 83364 88202 73244 52850 101085 125111 82372 79273 16172 -47605
22942 -47605 -116976 -100979 -100664 -82951 -77717 -50002 -2796 85105 137390 80103 60933 106175
22930 106175 64097 18659 31267 58505 29451 52072 41408 76543 8025 -52329 -22090
22919 -22090 2420 8465 13256 -97683 -125027 -83134 13053 21005 77507 72560 -14796 -1591
22907 -1591 -17501 -46466 -16929 -559 -16023 -14212 -13538 -2076 -909 -9544 -17640 43145 -1393
22894 -1393 2426 53218 88939 102826 85402 141013 119359 48613 91128 97243 43690 44124 65532
$$ packed form
22978B8013p923R040n6642k4912K9941J3074L2148K5898l5441l789j4680n0079
22966e5352J4633K9991j3972l9999N6182P5625N5637j3971l4747o0138K8232j3583
22954B8538K3762K7909L155M838j4958k0394M8235K4026m2739l099o3101o3777
22942d7605o9371J5997L15J7713N234K7715M7206Q7901N2285n7287j9170M5242
22930A06175m2078m5438J2608K7238k9054K2621j0664L5135o8518o0354L0239
22919b2090K4510O045M791j10939k7344M1893R6187P952N6502m947q7356J3205
22907a591j5910k8965K9537J6370j5464J811O74J1462J167q635q096O0785m4538
22894a393L819N0792L5721J3887j7424N5611k1654p0746M2515O115n3553M34K1408
$$ plain form
22881 65532 76489 65158 19879 12431 6239 77758 104802 8976 -17653 -21597 -11917 4475
22869 4475 4522 2022 -54548 -109366 -117657 -47997 -34156 -34773 -78286 -104476 -130174 -56924 -23894
22856 -23894 27218 72462 114276 227265 159755 68787 37581 31620 62572 85012 98842 94686
22844 94686 84883 90277 85073 103626 63656 4247 49946 60098 -1244 -19286 -18240 -49594
22832 -49594 -65067 -106273 -116530 -63979 -10067 10539 -10258 53635 86902 77163 104407 38316
22820 38316 13870 21779 13876 39689 37956 596 31248 -19161 -104560 -38127 -56108 -68365
22808 -68365 -34651 -31485 -71658 -39045 46082 69848 37120 52233 70104 89099 18973 -18681
22796 -18681 49291 82005 74796 12168 10911 -9281 -49871 -75619 -74462 -79200 -73560 -95741 -97431
$$ packed form
22881F5532J0957j1331m5279p448o192P1519K7044r5826k6629l944R680J6392
22869D475M7k500n6570n4818q291O9660J3841o17m3513k6190k5698P3250L3030
22856b3894N1112M5244M1814J12989o7510r0968l1206n961L0952K2440J3830m156
22844I4686r803N394n204J8553l9970n9409M5699J0152o1342j8042J046l1354
22832d9594j5473m1206j0257N2551N3912K0606k0797O3893L3267r739K7244o6091
22820C8316k4446P909p903K5813j733l7360L0652n0409q5399O6433j7981j2257
22808f8365L3714L166m0173L2613Q5127K3766l2728J5113J7871J8995p0126l7654
22796a8681O7972L2714p209o2628j257k0192m0590k5748J157m738N640k2181j690
$$ plain form
22783 -97431 -65924 14600 35487 76092 73279 48470 23051 74597 144975 186163 182501 128266
22771 128266 69395 68970 69577 44143 15625 -52560 -78320 -59025 -12447 50797 18411 -1774
22759 -1774 -15862 -8472 -18525 -9597 45649 83528 103983 108915 30809 -33254 -24180 -42896 -47846
22746 -47846 -42745 -27143 -79244 -142348 -138042 -90365 -26433 37877 74388 33810 -23675 -55388
22734 -55388 -38523 37585 50642 -33599 6558 72475 82740 97953 111542 73450 70213 103313
22722 103313 147924 100219 -12385 13575 67481 59179 21684 -13911 -58804 -79975 -47207
22711 -47207 8672 39534 35339 11709 -38337 -45427 -67206 -165704 -215115 -84998 -35602 -81040
22699 -81040 -67524 -13338 42036 77789 100794 108838 47719 22106 54698 68985 63672 7773
$$ packed form
22783i7431L1507Q0524K0887M0605k813k4809k5419N1546P0378M1188l662n4235
22771A28266n8871m25O07k5434k8518o8185k5760J9295M6578O3244l2386k0185
22759a774j4088P390j0053Q928N5246L7879K0455M932p8106o4063R074j8716m950
22746d7846N101J5602n2101o3104M306M7677O3932O4310L6511m0578n7485l1713
22734e5388J6865P6108J3057q4241M0157O5917J0265J5213J3589l8092l237L3100
22722A03313M4611m7705j12604K5960N3906q302l7495l5595m4893k1171L2768
22711d7207N5879L0862m195k3630n0046p090k1779r8498m9411J30117M9396m5438
22699h1040J3516N4186N5374L5753K3005Q044o1119k5613L2592J4287n313n5899
$$ plain form
22687 7773 -49637 -18540 -6772 -30444 -33095 -47342 -16115 13799 7614 -13869 -80897 -111853
22675 -111853 -147148 -56442 30620 22365 -30170 -91878 -89935 7399 -26826 -70257 -81666 -21482
22663 -21482 61735 90470 58753 35014 71393 22365 -41242 -46277 -57794 -12528 4289 -44003
22651 -44003 -81848 -60762 -3275 -15952 -19086 13049 55417 76395 66383 18387 22636 -12628
22639 -12628 9578 27086 4502 8002 3963 -55056 -3555 -1856 -34547 -64281 -67883 -54635
22627 -54635 -40065 -71661 -90929 -37080 1579 24733 16658 20104 -24805 -61170 -12694 -13793
22615 -13793 11378 35352 2368 -36484 -37758 -35198 139 12853 22873 -4261 14353 -16154
22603 -16154 -61221 -67580 -20846 42877 69805 58348 72617 114279 131633 82437 8840 -34622
$$ packed form
22687G773n7410L1097J1768k3672k651j4247L1227K9914o185k1483o7028l0956
22675a11853l5295R0706Q7062q255n2535o1708J943R7334l4225m3431j1409O0184
22663b1482Q3217K8735l1717k3739L6379m9028o3607n035j1517M5266J6817m8292
22651d4003l7845K1086N7487j2677l134L2135M2368K0978j0012m7996M249l5264
22639a2628K2206J7508k2584L500m039n9019N1501J699l2691k9734l602J3248
22627e4635J4570l1596j9268N3849L8659K3154q075L446m4909l6365M8476j099
22615a3793K5171K3974l2984l8852j274K560L5337J2714J0020k7134J8614l0507
22603a6154m5067o359M6734O3723K6928j1457J4269M1662J7354m9196p3597m3462
$$ plain form
22591 -34622 -30116 -23511 -30798 14734 1233 11381 35145 -20599 -16408 18846 71112 56475
22579 56475 27017 17543 -25142 -31059 -6756 -13543 -52219 -37290 40931 4211 -37792 -68919
22567 -68919 -81355 -96074 -60614 -34778 -36299 -17926 -47668 -75928 -61075 -46110 -20973 46330
22555 46330 69054 -311 8589 46505 55887 7829 -81730 -100953 -116472 -95451 -104027 -73470
22543 -73470 -64207 -49936 -16478 10864 34118 -933 4622 38692 72222 71217 41549 -3768
22531 -3768 -47745 -21256 46048 40432 16810 -16113 -3763 11914 45656 28358 -60570 -121320
22519 -121320 -132429 -77464 -2665 -8215 13632 42313 46076 26532 35875 -21040 -103750 -143098
22507 -143098 -147794 -114765 -61487 -12808 -7128 54312 10277 5789 14666 65050 49200 47085
$$ packed form
22591c4622M506O605p287M5532j3501J0148K3764n5744M191L5254N2266j4637
22579E6475k9458r474m2685n917K4303o787l8676J4929P8221l6720m2003l1127
22567f8919j2436j4719L5460K5836j521J8373k9742k8260J4853J4965K5137O7303
22555D6330K2724o9365Q900L7916R382m8058q9559j9223j5519K1021q576L0557
22543g3470R263J4271L3458K7342K3254l5051N555L4070L3530j005k9668m5317
22531c768m3977K6489O7304n616k3622l2923J2350J5677L3742j7298q8928o0750
22519a21320j1109N4965P4799n550K1847K8681L763j9544R343n6915q2710l9348
22507a43098m696L3029N3278M8679N680O1440m4035m488Q877N0384j5850k115
$$ plain form
22495 47085 81210 107805 92802 57671 55633 8250 -33096 -21523 22347 -22501 -32805 23268
22483 23268 1962 -101739 -124484 -52545 762 -6677 22204 19288 15849 -15593 -35220 -90064
22471 -90064 -130151 -140243 -148294 -114197 -112415 -113228 -58215 -13321 7753 41338 11246 -29756
22459 -29756 -1461 -2557 -28236 -6995 7243 42446 8289 -7498 -41664 40295 57409 7899
22447 7899 -59493 -81822 -31311 66327 35261 -30273 -54440 -89116 -121382 -108275 -44919 -22313
22435 -22313 -23083 -47739 -37213 22923 -53892 -64068 7988 2586 -62106 -94341 -77335 -62521
22423 -62521 -69856 -65663 -28907 1588 -10274 -35712 -10292 49821 35680 52709 30128 4798
22411 4798 -31273 -49349 -84895 -60548 -7142 24296 5068 31622 52462 67042 57415 -6839
$$ packed form
22495D7085L4125K6595j5003l5131k038m7383m1346J1573M3870m4848j0304N6073
22483B3268k1306j03701k2745P1939N3307p439K8881k916l439l1442j9627n4844
22471i0064m0087j0092q051L4097J782q13N5013M4894K1074L3585l0092m1002
22459b9756K8295j096k5679K1241J4238L5203l4157j5787l4166Q1959J7114m9510
22447G899o7392k2329N0511R7638l1066o5534k4167l4676l2266J3107O3356K2606
22435b2313p70k4656J0526O0136p6815j0176P2056n402o4692l2235J7006J4814
22423f2521p335M193L6756L0495j1862k5438K5420O0113j4141J7029k2581k5330
22411D798l6071j8076l5546K4347N3406L1438j9228K6554K0840J4580r627o4254
$$ plain form
22399 -6839 -50405 -39459 51819 87557 49363 47377 66222 77894 86286 75998 62818 1946
22387 1946 -35243 -52180 -55777 -37611 -39041 1991 8952 12597 -17588 -6980 12211 19583 -16592
22374 -16592 35745 65825 68518 61763 -6998 -2424 13784 -29237 -37703 -50830 -41846 -20999 -50498
22361 -50498 -65914 -36561 25569 69759 24490 14314 -26377 -40199 -37555 -40413 -17614 -37195
22349 -37195 -37669 -24984 -15329 -41629 -27859 -142 -19153 25501 51300 20365 3982 -13653
22337 -13653 -73671 -71459 -45224 -53365 -63232 -67827 -99563 -62201 -55619 -8325 -2441 22568 31575
22324 31575 36924 19516 -4320 -22689 -18616 -40926 -15099 -49872 -115908 -142050 -96094 -82173
22312 -82173 -67134 -53598 -9503 -36225 -72209 -72125 -90867 -52825 -30173 -6883 18576 -16723
$$ packed form
22399f839m3566J0946R1278L5738l8194j986J8845J1672Q392j0288j3180o0872
22387A946l7189j6937l597J8166j430M1032O961L645l0185J0608J9191P372l6175
22374a6592N2337L0080K693o755o8761M574J6208m3021q466j3127Q984K0847k9499
22361e0498j5416K9353O2130M4190m5269j0176m0691j3822K644k858K2799j9581
22349c7195m74J2685R655k6300J3770K7717j9011M4654K5799l0935j6383j7635
22337a3653o0018K212K6235q141r867m595l1736L7362O582M7294N884K5009R007
22324C1575N349j7408k3836j8369M073k2310K5827l4773o6036k6142M5956J3921
22312h2173J5039J3536M4095k6722l5984Q4j8742L8042K2652K3290K5459l5299
$$ plain form
22300 -16723 37634 100195 56002 43020 19951 -2028 -34190 -34211 1492 -17468 -66571 -98308
22288 -98308 -127169 -77171 13186 -1531 50371 72150 121983 101485 92761 33588 -12172 7701
22276 7701 41500 79753 46663 48429 6040 -57524 -100822 -89644 -93130 -127220 -55265 -8581
22264 -8581 -71285 -132463 -131090 -66606 -27288 -52011 -64565 -62657 -49203 -36173 -8272 35077
22252 35077 53959 -15589 -15737 -17451 -3438 6815 6156 41054 44465 61254 45302 -40489 -46778
22239 -46778 -54208 -36605 -33861 -79293 -63283 -61601 -64667 -77216 -96573 -45395 21543 12432 -7574
22226 -7574 -32675 -22082 24254 61039 41672 55798 -1719 -38125 -66483 -66906 -56024 27749
22214 27749 51554 29706 38093 -20488 -16550 -36222 -16362 -8622 -8687 -25383 -68401 -80629 -105246
$$ packed form
22300a6723N4357O2561m4193j2982k3069k1979l2162k1L5703j8960m9103l1737
22288i8308k8861M9998R0357j4717N1902K1779M9833k0498q724n9173m5760J9873
22276G701L3799L8253l3090J766m2389o3564m3298J1178l486l4090P1955M6684
22264h581o2704o1178J373O4484L9318k4723j2554J908J3454J3030K7901M3349
22252C5077J8882o9548j48j714J4013J0253o59L4898L411J6789j5952q5791o289
22239d6778p430J7603K744m5432J6010J682l066j2549j9357N1178O6938r111k0006
22226g574k5101J0593M6336L6785j9367J4126n7517l6406k8358m23J0882Q3773
22214B7749K3805k1848Q387n8581L938j9672J9860P740o5j6696m3018j2228k4617
$$ plain form
22201 -105246 -111495 -119061 -105324 -45021 17607 65823 49888 31103 39717 -20939 -102367 -107698
22189 -107698 -100927 -63638 -41404 -17048 -4740 -17077 -41981 -30265 -39193 -48143 -28443 -2499
22177 -2499 -25726 -47277 -76186 -49220 -57311 -97651 -66882 -17302 36088 -31045 -78984 -31399
22165 -31399 -24812 -16569 -13784 4175 -25653 -69008 -77982 -8454 8943 6867 -68593 -51946 7208
22152 7208 25272 94196 93846 70473 8156 7793 -20249 -51271 -70594 -48624 -13493 -25854 22459
22139 22459 58605 66926 25606 -1483 -19804 -56644 -66862 -136080 -151280 -112755 8408 30470
22127 30470 49759 38065 14559 -33081 -69293 -37860 -107273 -116578 -123235 -88815 -63938 -72121
22115 -72121 -71321 -72463 -62970 -34442 14148 80814 64617 -6669 4807 43863 9506 -10669
$$ packed form
22201a05246o249p566J3737O0303O2628M8216j5935j8785Q614o0656q1428n331
22189a07698O771L7289K2234K4356J2308j2337k4904J1716q928q950J9700K5944
22177b499k3227k1551k8909K6966q091m0340L0769M9580N3390o7133m7939M7585
22165c1399O587Q243K785J7959k9828m3355q974O9528J7397k076p5460J6647N9154
22152G208J8064O8924l50k3373o2317l63k8042l1022j9323K1970L5131j2361M8313
22139B2459L6146Q321m1320k7089j8321l6840j0218o9218j5200L8525J21163K2062
22127C0470J9289j1694k3506m7640l6212L1433o9413r305o657L4420K4877q183
22115g2121Q00j142R493K8528M8590O6666j6197p1286J1476L9056l4357k0175
$$ plain form
22103 -10669 -13669 -18675 -43329 -28166 -36460 -12372 -20228 -83422 -126554 -86734 -106522 -118167
22091 -118167 -51787 -55119 -31014 -21754 9603 43417 -11035 -41496 -19583 -17107 -29572 -67915
22079 -67915 -127450 -141066 -113930 -97700 -67046 -64459 -73914 -55096 -37797 613 33784 -20745
22067 -20745 -68442 -89693 -111059 -93863 -118917 -113473 -23668 -11870 -30414 -72437 -123028 -126169
22055 -126169 -62662 -43362 -91485 -99409 -95991 -48471 -14662 -61579 -48660 -66810 -31525 -31608
22043 -31608 -44268 -41391 -25644 -50337 -64922 -31360 -87102 -69509 -40633 -74446 -77278 -92201
22031 -92201 -69125 -100469 -31728 31880 39709 49678 50423 33729 57103 93783 83059 75579 63144
22018 63144 34267 40423 14287 -19501 -32575 -106600 -77430 -25959 -44387 -23823 -6563 -2539
$$ packed form
22103a0669l000n006k4654J5163q294K4088p856o3194m3132L9820j9788j1645
22091a18167O6380l332K4105R260L1357L3814n4452l0461K1913K476j2465l8343
22079f7915n9535j3616K7136J6230L0654K587r455J8818J7299L8410L3171n4529
22067b0745m7697k1251k1366J7196k5054N444Q9805J1798j8544m2023n0591l141
22055a26169O3507J9300m8123p924L418M7520L3809m6917J2919j8150L5285q3
22043c1608j2660K877J5747k4693j4585L3562n5742J7593K8876l3813k832j4923
22031i2201K3076l1344O8741O3608P829R969P45j6694K3374L6680j0724p480j2435
22018F3144k8877O156k6136l3788j3074p4025K9170N1471j8428K0564J7260M024
$$ plain form
22006 -2539 7354 29560 25421 44248 41383 -40125 -75145 -455 -41878 -74368 -102774 -82756
21994 -82756 -49230 -35769 21829 -31883 -14579 42903 18675 -69328 -86398 -71426 -75467 -78358
21982 -78358 -99461 -78929 -52283 -25411 6798 43148 57326 56337 5963 -56025 -80366 15041
21970 15041 23497 7516 53828 18450 -8499 -31647 -19894 -37169 -31499 -27158 -18537 22217
21958 22217 -20825 -31943 64307 93963 13011 -94898 -184475 -199330 -136815 -111363 -126671
21947 -126671 -125277 -38716 21418 -1566 -13748 -16285 -46902 -45216 -17268 -24814 -11326 -33356
21935 -33356 -21664 -48887 2425 47128 65361 38257 62231 45598 36722 -6818 -35107 -38000
21923 -38000 -10596 22820 17401 -12307 -13419 -17462 25628 9064 -12652 33135 -23246 -19254
$$ packed form
22006b539R893K2206m139J8827k865q1508l5020P4690m1423l2490k8406K0018
21994h2756L3526J3461N7598n3712J7304N7482k4228q8003j7070J4972m041k891
21982g8358k1103K0532K6646K6872L2209L6350J4178r89n0374o1988k4341R5407
21970A5041Q456j5981M6312l5378k6949k3148J1753j7275N670M341Q621M0754
21958B2217m3042j1118R6250K9656q0952j07909q9577j4855O2515K5452j5308
21947a26671J394Q6561O0134k2984j2182k537l0617J686K7948p546J3488k2030
21935c3356J1692k7223N1312M4703J8233k7104K3974j6633q876m3540k8289k893
21923c8000K7404L3416n419k9708j112m043M3090j6564k1716M5787n6381L992
$$ plain form
21911 -19254 864 29582 31181 13683 -55139 -66045 -37831 -9794 -52967 -30873 -327 20099
21899 20099 10450 14926 -46261 -62592 12579 -7737 -29637 -13457 72979 72894 26435 -44002 -76835
21886 -76835 -79897 -70299 -59855 -65671 -25113 -1980 -67189 -92114 -10271 25011 -4326 -20671
21874 -20671 -49427 -56713 4162 20801 41216 -2190 -1716 12874 28181 49114 52403 105368
21862 105368 60198 -21184 -36570 -83235 -62597 -23153 14090 22133 -16030 -90739 -65050 -6496
21850 -6496 33098 -10255 -44057 1687 -14219 -66817 -50339 -26528 -16034 -46355 -109071 -153336
21838 -153336 -178979 -150719 -150162 -70315 -24790 -84999 -122791 -149209 -160878 -65717 -1208 40477
21826 40477 782 -5956 -44265 -136649 -199735 -150616 -50164 -9605 -7328 -53509 -87722 -100352
$$ packed form
21911a9254K0118K8718J599j7498o8822j0906K8214K8037m3173K2094L0546K0426
21899B0099r649M476o1187j6331P5171k0316k1900J6180Q6436q5m6459p0437l2833
21886g6835l062R598J0444n816M0558K3133o5209k4925Q1843L5282k9337j6345
21874b0671k8756p286O0875J6639K0415m3406M74J4590J5307K0933L289N2965
21862A05368m5170q1382j5386m6665K0638L9444L7243Q043l8163p4709K5689N8554
21850f496L9594m3353l3802M5744j5906n2598J6478K3811J0494l0321o2716m4265
21838a53336k5643K8260N57P9847M5525o0209l7792k6418j1669R5161O4509M1685
21826D0477l9695o738l8309r2384o3086M9119J00452M0559K277m6181l4213j2630
$$ plain form
21814 -100352 -99098 -34225 -22970 -50654 -85471 -60317 -53830 -35329 -32771 22506 2353 -20436
21802 -20436 -71722 -83898 -11319 37311 857 13261 10597 -61157 -66471 -100892 -141689 -109777
21790 -109777 -136289 -125810 -109147 -114434 -128752 -71478 871 66295 97543 58498 42633 -944
21778 -944 -52911 -57778 -47001 -19654 -6665 17092 -3295 -55026 -55299 -25522 -15940 15062 -46531
21765 -46531 -18119 -11601 -37956 -31872 -49227 -115911 -86384 13452 33535 34855 46223 -19984
21753 -19984 -21939 5961 -30174 -76618 -68966 -48000 -35064 -23552 6842 16661 7250 -20961
21741 -20961 -56939 -53529 -76583 -141316 -161845 -188058 -153058 -109166 -87841 -88992 -86450 -74035
21729 -74035 -67809 -56750 -19896 10556 14988 8641 -33077 -75057 -110433 -168420 -157576 -130967
$$ packed form
21814a00352J254O4873J1255k7684l4817K5154O487J8501K558N5277k0153k2789
21802b0436n1286j2176P2579M8630l6454J2404k664p1754n314l4421m0797L1912
21790a09777k6512J0479J6663n287j4318N7274P2349O5424L1248l9045j5865m3577
21778i44n1967m867J0777K7347J2989K3757k0387n1731k73K9777R582L1002o1593
21765d6531K8412O518k6355O084j7355o6684K9527R9836K0083J320J1368o6207
21753a9984j955K7900l6135m6444P652K0966J2936J1512L0394R819r411k8211
21741b0961l5978L410k3054o4733k0529k6213L5000M3892K1325j151K542J2415
21729g4035O226J1059L6854L0452M432o347m1718m1980l5376n7987J0844K6609
$$ plain form
21717 -130967 -57286 -49913 -49118 -32802 10257 16049 26242 21337 41552 3568 -7235 13681
21705 13681 -60450 -111487 -117204 -103070 -34300 -26323 -17595 4945 -48350 -32320 -30052 -20699 -43933
21692 -43933 -38176 -20916 -49458 -68619 -61918 -50183 -56374 -60664 -10123 -9222 -62357 -136416 -150234
21679 -150234 -89125 -99686 -99522 -48377 15400 25545 11057 -1170 26542 -24358 8961 48892
21667 48892 6640 -55917 -62193 -42368 -22271 10166 61254 41585 54466 107224 100637 -7391
21655 -7391 -13678 13264 63894 73455 86875 64883 50513 24809 -29719 -46322 -70329 -96720
21643 -96720 -112772 -40586 -39872 -17777 -33098 -110255 -145878 -106466 -93854 -92561 -74553 -54171
21631 -54171 -98143 -78387 -65956 -62904 -68227 -47487 -67395 -23965 -33489 -41282 -1465 12754
$$ packed form
21717a30967P3681P373P95J6316M3059N792J0193m905K0215l7984j0803K0916
21705A3681p4131n1037n717J4134O8770P977Q728K2540n3295J6030K268R353k3234
21692d3933N757J7260k8542j9161O701J1735o191m290N0541R01n3135p4059j3818
21679a50234O1109j0561J64N1145O3777J0145j4488j2227K7712n0900L3319L9931
21667D8892m2252o2557o276J9825K0097L2437N1088j9669J2881N2758o587j08028
21655g391o287K6942N0630R561J3420k1992j4370k5704n4528j6603k4007k6391
21643i6720j6052P2186P14K2095j5321p7157l5623L9412J2612J293J8008K0382
21631e4171m3972J9756J2431L052n323K0740j9908M3430r524p793L9817J4219
$$ plain form
21619 12754 1056 18742 3655 -5780 -45556 -50399 -40658 -56103 -62248 -135454 -144645 -114878 -89741
21606 -89741 -79905 -88516 -60327 -69450 -104508 -128280 -72766 -10064 -36011 -80680 -62030 -57275
21594 -57275 -9764 -1615 -43243 -89158 -86296 -55267 -36742 -89954 -107094 -103612 -77575 -85952
21582 -85952 -39646 23827 15517 41177 71250 11645 -38243 -59844 -55251 -55928 -63686 -37446 -40818
21569 -40818 -57997 -25157 -34833 -60569 -107525 -133788 -130752 -80654 -45040 -24322 -73909 -87601
21557 -87601 -43449 -3384 -18054 -23421 -2276 6555 25464 -25273 -41929 -58738 -67015 -119689
21545 -119689 -128132 -54057 -35624 -139424 -156344 -140976 -142873 -86788 -66575 -63466 -124911 -140417
21533 -140417 -16783 -7426 -15998 64 -53815 -100491 -50066 -11368 -47554 -24141 -7984 -22278
$$ packed form
21619A2754j1698J7686j5087r435l9776m843R741j5445o145p3206r191K9767K5137
21606h9741R836q611K8189r123l5058k3772N5514O2702k5947m4669J8650M755
21594e7275M7511Q149m1628m5915K862L1029J8525n3212j7140L482K6037q377
21582h5952M6306O3473q310K5660L0073n9605m9888k1601M593o77p758K6240l372
21569d0818j7179L2840r676k5736m6956k6263L036N0098L5614K0718m9587j3692
21557h7601M4152M0065j4670n367K1145Q831J8909n0737j6656j6809q277n2674
21545a19689q443P4075J8433j03800j6920J5368j897N6085K0213L109o1445j5506
21533a40417J23634R357q572J6062n3879m6676N0425L8698l6186K3413J6157j4294
$$ plain form
21521 -22278 -12152 37153 63711 12827 -3304 32619 23739 -60381 -74771 -65849 -74029 -37676
21509 -37676 -11070 -23118 45 -14177 -52567 -36894 2905 -13121 -21502 -15608 -16994 -64697
21497 -64697 -132176 -130892 -110083 -71569 -12786 -45471 -104303 -87878 -35931 -14162 -10049 -58004
21485 -58004 -87183 -153439 -179777 -155119 -144279 -98812 -70578 -75036 -77312 -125523 -101779 -131173
21473 -131173 -130839 -170236 -191269 -125156 -31216 16545 40732 19879 -3611 -44434 -27643 5887
21461 5887 15914 5195 -40859 -72222 -90591 -109645 -93353 -101072 -81385 -39403 -74198 -85336
21449 -85336 -62799 -23101 54324 81029 56214 -26399 -30136 -16408 -25262 -45228 -14562 -67265
21437 -67265 -50583 -58704 -48399 15524 8071 37935 -10967 -64862 -123264 -118787 -44402 -31144
$$ packed form
21521b2278J0126M9305K6558n0884j6131L5923q880q4120j4390Q922q180L6353
21509c7676K6606j2048K3163j4222l8390J5673L9799j6026q381N894j386m7703
21497f4697o7479J284K0809L8514N8783l2685n8832J6425N1947K1769M113m7955
21485e8004k9179o6256k6338K4658J0840M5467K8234m458k276m8211K3744k9394
21473a31173L34l9397k1033O6113R3940M7761K4187k0853k3490m0823J6791L3530
21461E887J0027j0719m6054l1363j8369j9054J6292p719J9687M1982l4795j1138
21449h5336K2537L9698P7425K6705k4815q2613l737J3728q854j9966L0666n2703
21437f7265J6682q121J0305O3923p453K9864m8902n3895n8402M477P4385J3258
$$ plain form
21425 -31144 -5761 12308 -42260 -99251 -72757 -47926 8940 79951 104126 84694 37711 10749
21413 10749 19759 -34722 15045 58822 38382 -10645 -20443 9570 28072 -9203 21491 81061
21401 81061 104034 55277 -17857 -50585 -65763 -53291 -33866 -31644 -63335 -36384 -29805 -45081
21389 -45081 -70635 -62870 -59854 -93559 -127827 -65975 -37888 -56395 -34815 -50653 -87000 -47108
21377 -47108 -15607 7 6613 -10877 -119494 -133264 -115459 -52698 38812 22418 -30393 -23680
21365 -23680 -55038 -96314 -75990 -65320 -30918 -30329 -38961 -25497 -47507 -61273 -58878 -48883 -80863
21352 -80863 -102105 -114151 -108824 -127016 -157367 -150154 -151690 -148946 -52417 -43195 -15038 -7436 -32043
21339 -32043 -52800 -38720 -55969 -104776 -108751 -92591 -104316 -155440 -146876 -63576 -53736 7343
$$ packed form
21425c1144K5383J8069n4568n6991K6494K4831N6866P1011K4175j9432m6983k6962
21413A0749R010n4481M9767M3777k0440m9027r798L0013J8502l7275L0694N9570
21401H1061K2973m8757p3134l2728j5178J2472J9425K222l1691K6951O579j5276
21389d5081k5554P765L016l3705l4268O1852K8087j8507K1580j5838l6347L9892
21377d7108L1501J5614O606j7490j08617j3770J7805O2761R1510j6394n2811O713
21365b3680l1358m1276K0324J0670L4402N89q632J3464k2010j3766K395R995l1980
21352h0863k1242j2046N327j8192l0351P213j536K744R6529R222K8157P602k4607
21339c2043k0757J4080j7249m8807l975J6160j1725n1124Q564Q3300R840O1079
$$ plain form
21327 7343 50412 2951 -70359 -57220 29423 27332 -9915 -44155 -107177 -87765 39320 77227
21315 77227 52085 3513 -33895 -60771 -49957 616 -16870 -4594 -62062 -67196 -80065 -84205
21303 -84205 -42844 -40478 -38099 -68916 -42733 -79722 -95689 -43249 -26734 -64242 -100287 -126933
21291 -126933 -76387 -55198 -26926 -55660 -29383 -57474 -111398 -102463 -50530 -62361 -97977 -100567
21279 -100567 -74625 -57125 -60086 -85126 -94780 -93627 -102790 -56032 -32140 -45264 -62836 -73451
21267 -73451 -72687 -17244 9475 -25605 15661 12694 -49819 -75539 -91822 -140944 -101119 -39950
21255 -39950 -12465 -14737 25561 16728 -38061 -96644 -117672 -116939 -96758 -64276 -79477 -70140 -43028
21242 -43028 -53336 -92898 -63531 -40988 -107046 -120694 -44278 -28500 -102172 -89329 -73689 -25583
$$ packed form
21327G343M3069m7461p3310J3139Q6643k091l7247l4240o3022J9412J27085L7907
21315G7227k5142m8572l7408k6876J0814N0573j7486J2276n7468n134j2869m140
21303h4205M1361K366K379l0817K6183l6989j5967N2440J6515l7508l6045k6646
21291a26933N0546K1189K8272k8734K6277k8091n3924Q935N1933j1831l5616k590
21279a00567K5942J7500k961k5040r654J153r163M6758K3892j3124j7572j0615
21267g3451P64N5443K6719l5080M1266k967o2513k5720j6283m9122L9825O1169
21255c9950K7485k272M0298q833n4789n8583k1028P33K0181L2482j5201R337K7112
21242d3028j0308l9562K9367K2543o6058j3648P6416J5778p3672J2843J5640M8106
$$ plain form
21230 -25583 -12741 -72873 -59334 -61854 -6118 61198 3644 -64862 -72070 -4636 14203 7862
21218 7862 5298 689 14049 -75380 -53484 -15983 -32532 -45707 -30613 25664 -7608 -23327
21206 -23327 4609 51703 39334 -46869 -20114 35187 67299 108003 94990 51687 38432 34261
21194 34261 16660 -25328 -39158 -53626 -61951 -133716 -137591 -162344 -93743 -114981 -160206 -175066
21182 -175066 -182876 -114456 -115160 -204904 -208573 -117948 -66450 -81637 -14011 42353 27231 -30989
21170 -30989 -60045 -69676 -37492 -41311 -5693 -7841 -3422 -34753 -94669 -74980 -30838 -26950 -23777
21157 -23777 -51608 -64594 -55277 -30412 -54192 -70000 -71149 15191 43709 -25680 -16385 -13108
21145 -13108 -29668 -74580 -102817 -116265 -125698 -176034 -119314 -72015 -60307 -61194 -69814 -30227
$$ packed form
21230b5583J2842o0132J3539k520N5736O7316n7554o8506p208O7434J8839o341
21218G862k564m609J3360q9429K1896L7501j6549j3175J5094N6277l3272j5719
21206b3327K7936M7094j2369q6203K6755N5301L2112M0704j3013m3303j3255m171
21194C4261j7601m1988j3830j4468q325p1765l875k4753O8601k1238m5225j4860
21182a75066p810O8420p04q9744l669R0625N1498j5187O7626N6364j5122n8220
21170c0989k9056r631L2184l819L5618k148M419l1331n9916J9689M4142L888L173
21157b3777k7831j2986R317K4865k3780j5808j149Q6340K8518o9389R295L277
21145a3108j6560m4912k8237j3448r433n0336N6720M7299J1708q87q620L9587
$$ plain form
21133 -30227 -29 4271 5191 -19795 -53832 -90218 -102315 -67698 -55006 -77567 -79152 -38862
21121 -38862 -39529 -108715 -175051 -197809 -139071 -83023 -126556 -138935 -115676 -60216 -37745 -95198
21109 -95198 -104230 -25904 2360 -48012 -46305 -12827 -10691 -33826 -38566 634 -9425 -51483
21097 -51483 -49129 -55193 -89210 -62969 -12901 -31192 -76508 -87646 -13133 11880 19110 24361
21085 24361 13153 -84752 -113800 -73617 -97832 -86938 -26313 -41750 -76412 -117298 -121225 -95674
21073 -95674 -128227 -94364 -16217 -29365 -44233 -84434 -86548 -64656 -61573 -28030 -45000 -67186
21061 -67186 -64937 -108528 -106325 -66059 -56489 -110116 -133297 -130110 -85300 -44150 -53201 -131337 -142577
21048 -142577 -108330 -76246 -23717 20742 68819 57692 37984 54301 61237 76751 50770 -43840
$$ packed form
21133c0227L0198M300R20k4986l4037l6386j2097L4617J2692k2561j585M0290
21121c8862o67o9186o6336k2758N8738N6048m3533j2379K3259N5460K2471n7453
21109i5198r032P8326K8264n0372J707L3478K136k3135m740L9200j0059m2058
21097e1483K354o064l4017K6241N0068j8291m5316j1138P4513K5013P230N251
21085B4361j1208r7905k9048M0183k4215J0894O0625j5437l4662m0886l927K5551
21073i5674l2553L3863P8147j3148j4868m0201k114K1892L083L3543j6970k2186
21061f7186K249m3591K203M0266R570n3627k3181L187M4810M1150r051p8136j1240
21048a42577L4247L2084N2529M4459M8077j1127j9708J6317O936J5514k5981r4610
$$ plain form
21036 -43840 -87536 -85757 -52586 -44349 -58194 -49747 -44709 -18666 -19417 -53879 -47714 -59464 -86558
21023 -86558 -101385 -90588 -63629 -71122 -64459 -66171 -26433 -36436 -47464 -808 -37856 -89553
21011 -89553 -78556 -70129 -74358 -69453 -22300 -20097 -68450 -33344 -29073 -55194 -67942 -77360 -63314
20998 -63314 -132024 -187771 -168606 -63271 -58117 -131585 -125556 -103240 -127558 -117124 -119544 -77127
20986 -77127 -38800 -17481 5787 4024 -4967 2593 3849 -45174 -73414 -64296 -11260 -93743 -90741
20973 -90741 1012 50792 8597 -3499 20648 -9992 -20695 -15565 -57215 -94020 -136621 -161091
20961 -161091 -135747 -85853 -50948 -38765 -121506 -82535 -68229 -71267 -97975 -124024 -109742 -132493
20949 -132493 -67597 -32115 -65271 -84399 -108901 -25415 -10280 -70049 -93200 -112745 -95169
$$ packed form
21036d3840m3696J779L3171Q237j3845Q447N038K6043p51l4462O165j1750k7094
21023h6558j4827J0797K6959p493O663j712L9738j0003j1028M6656l7048n1697
21011h9553J0997Q427m229M905M7153K203m8353L5106M271k6121j2748r418J4046
20998f3314o8710n5747J9165J05335N154p3468O029K2316k4318J0434k420M2417
20986g7127L8327K1319K3268j763q991P560J256m9023k8240R118N3036q2483L002
20973i0741R1753M9780m2195j2096K4147l0640j0703N130m1650l6805m2601k4470
20961a61091K5344M9894L4905J2183q2741L8971J4306l038k6708k6049J4282k2751
20949a32493O4896L5482l3156j9128k4502Q3486J5135n9769k3151j9545J7576
$$ plain form
20938 -95169 -84136 -74918 -41678 -37695 -89681 -143340 -81080 20163 22489 -7012 9571 8193
20926 8193 -11404 -20462 -7327 -43600 -100304 -80588 -46789 -44323 -50009 -24496 -32505 -35012 -87047
20913 -87047 -138556 -100732 -100665 -56621 -35182 -26838 -24171 -55936 -94174 -36195 10930 -14419 8512
20900 8512 -26462 -14580 -19434 -53423 -26114 3042 -41365 -52665 -19884 -28646 -63290 -32005
20888 -32005 -25396 -30376 -46797 -36514 -53387 -65083 -77502 -34171 -17416 -519 6005 36738
20876 36738 17005 -45720 -71370 -105735 -99814 -70002 -77174 -38041 -36429 -126662 -147522 -91047
20864 -91047 -28492 -49927 -57197 -45752 -100684 -91043 5980 26878 -31364 -51439 -32596 -57477
20852 -57477 -63770 -58427 -99249 -64568 -55567 40766 83151 61426 21208 -34364 -79079 -109494
$$ packed form
20938i5169J1033R218L3240L983n1986n3659O2260J01243K326k9501J6583j378
20926H193j9597r058J3135l6273n6704J9716L3799K466n686K5513q009k507n2035
20913h7047n1509L7824O7M4044K1439Q344K667l1765l8238N7979M7125k5349K2931
20900H512l4974J1882m854l3989K7309K9156m4407j1300L2781q762l4644L1285
20888c2005O609m980j6421J0283j6873j1696j2419M3331J6755J6897O524L0733
20876C6738j9733o2725k5650l4365N921K9812p172L9133J612r0233k0860N6475
20864i1047O2555k1435p270J1445n4932R641R7023K0898n8242k0075J8843k4881
20852e7477o293N343m0822L4681R001R6333M2385k1725m0218n5572m4715l0415
$$ plain form
20840 -109494 -117367 -86881 -109736 -134942 -124299 -124827 -96566 -52908 -84872 -99919 -112464 -86663
20828 -86663 -48051 -125694 -146308 -113728 -180697 -185170 -176838 -133023 -78967 -95640 -140358 -170160
20816 -170160 -141532 -58922 18616 811 -20961 -9131 -32647 -64013 -104209 -105166 -74264 -53339
20804 -53339 -66326 -119359 -76315 14971 30632 -16668 -55982 -89233 -119132 -149025 -209386 -197730
20792 -197730 -85311 -36322 -42209 -42352 -78430 -101664 -138353 -154163 -112543 -52918 -52877 -107167
20780 -107167 -89333 -53510 10010 23164 -89665 -168024 -149211 -143664 -130075 -104203 -45678
20769 -45678 -8396 17201 -24351 -29196 -60449 -51066 -26443 -37495 -58657 -79064 -124637 -54719
20757 -54719 -29825 -78064 -89007 -39373 26181 39856 29111 -14154 -9087 -37171 -46771 -68179
$$ packed form
20840a09494p873L0486k2855k5206J0643n28K8261M3658l1964j5047j2545K5801
20828h6663L8612p7643k0614L2580o6969m473Q332M3815N4056j6673m4718k9802
20816a70160K8628Q2610P7538j7805k1772J1830k3516l1366m0196r57L0902K0925
20804e3339j2987n3033M3044R1286J5661m7300l9314l3251k9899k9893o0361J1656
20792a97730J12419M8989n887j43l6078k3234l6689j5810M1620N9625M1n4290
20780a07167J7834L5823O3520J3154j12829p8359J8813N547J3589K5872N8525
20769d5678L7282K5597m1552m845l1253R383K4623j1052k1162k0407m5573O9918
20757e4719K4894m8239j0943M9634O5554J3675j0745m3265N067k8084r600k1408
$$ plain form
20745 -68179 -105896 -109577 -72310 -84592 -116901 -140788 -86932 -654 -14307 -72019 -90254 -61263
20733 -61263 -81612 -111085 -169207 -162473 -165112 -164221 -152894 -136757 -72458 -46467 -95211 -104410 -87138
20720 -87138 -8481 22225 -39915 -115284 -126181 -56380 73459 105084 35574 -20293 -11583 -9317
20708 -9317 16474 -12831 -38635 -9371 176 -8894 -19420 -2353 47246 24673 -50231 -76103
20696 -76103 5149 -54449 -127966 -125156 -162430 -95336 -68028 -55562 -31742 56862 58543 -20242
20684 -20242 -70546 -75198 -68057 -66558 -71291 -126593 -158919 -148589 -135078 -83988 -25726 -47212
20672 -47212 -18941 -13533 10762 31821 75755 80119 50846 12173 -29002 -6480 17180 33072
20660 33072 1249 -42189 -61414 -44873 -42046 -40675 -75445 -51391 -29245 -69940 -112434 -146035
$$ packed form
20745f8179l7717l681L7267j2282l2309k3887N3856Q6278j3653n7712j8235K8991
20733f1263k0349k9473n8122O734k639Q91J1327J6137O4299K5991m8744r199J7272
20720h7138P8657L0706o2140p5369j0897O9801J29839L1625o9510n5867Q710K266
20708i317K5791k9305k5804K9264R547r070j0526J7067M9599k2573p4904k5872
20696g6103Q1252n9598p3517K810l7274O7094K7308J2466K3820Q8604J681p8785
20684b0242n0304m652P141J499m733n5302l2326J0330J3511N1090N8262k1486
20672d7212K8271N408K4295K1059M3934M364k9273l8673m1175K2522K3660J5892
20660C3072l1823m3438j9225J6541K827J371l4770K4054K2146m0695m2494l3601
$$ plain form
20648 -146035 -133790 -75369 -73688 -46729 -14601 -18531 -41907 -67418 -51986 -54772 -45225 -37103
20636 -37103 -61260 -62100 -91624 -101662 -45480 610 -50514 -91637 -46384 -28721 -2174 41760
20624 41760 34506 -14725 -29949 -49699 -63522 -63421 -10990 -12147 -39046 -22754 -58514 -15100
20612 -15100 17041 34530 -16735 -98392 -122265 -116550 -135478 -158287 -132062 -130908 -160333 -169410
20600 -169410 -161342 -129565 -189849 -156468 -96656 -110577 -146615 -133326 -104863 -137533 -131771 -116177
20588 -116177 -120115 -115780 -107782 -103895 -32651 -4440 -18929 -10547 -34177 -74262 -105012 -85018
20576 -85018 -61486 -67405 -91604 -111325 -82559 -103880 -155280 -111102 -93883 -109539 -148332 -119180
20564 -119180 -92469 -140311 -144983 -54909 -12012 -28046 -118953 -115801 -72926 -59201 -14608 6117
$$ packed form
20648a46035J2245N8421J681K6959L2128l930k3376k5511J5432k786R547Q122
20636c7103k4157q40k9524j0038N6182M6090n1124m1123M5253J7663K6547M3934
20624D1760p254m9231j5224j9750j3823J01N2431j157k6899J6292l5760M3414
20612a5100L2141J7489n1265q1657k3873N715j8928k2809K6225J154k9425r077
20600a69410Q068L1777o0284L3381N9812j3921l6038J3289K8463l2670N762J5594
20588a16177l938M335P998L887P1244K8211j4489Q382k3630m0085l0750J9994
20576h5018K3532n919k4199j9721K8766k1321n1400M4178J7219j5656l8793K9152
20564a19180K6711m7842m672R0074M2897j6034r0907L152M2875J3725M4593K0725
$$ plain form
20552 6117 4188 11174 958 -27217 -58098 -76336 -69923 -100704 -92321 -93077 -97113 -62816 -22976
20539 -22976 -61653 -83983 -45564 10204 42693 72643 24846 -32226 -50649 5710 32900 1704
20527 1704 5066 -28225 -57701 -43789 -47148 14468 39877 -10574 -69258 -92037 -93706 -67862
20515 -67862 228 2563 -4699 -11638 -56541 -71768 -20080 8237 -61048 -60714 -58928 -61918 -45620
20502 -45620 -63835 -47079 -46277 -76379 -115243 -111795 -98730 -57294 -33937 -29523 15276 8236 -60276
20489 -60276 -80571 -113750 -96495 -59753 -77970 -108704 -105887 -96178 -85696 -67080 -66374 -65757 -5107
20476 -5107 -25922 -52208 -2010 -12218 -37310 -45970 -41055 -17697 -39210 -2804 12147 46558
20464 46558 70683 32718 27686 50304 -26170 -15544 62831 36702 464 12358 12895 7337
$$ packed form
20552F117j929O986j0216k8175l0881j8238O413l0781Q383p56m036L4297L9840
20539b2976l8677k2330L8419N5768L2489K9950m7797n7072j8423N6359K7190l1196
20527A704L362l3291k9476J3912l359O1616K5409n0451n8684k2779j669K5844
20515f7862O8090K335p262o939m4903j5227N1688K8317o9285L34J786k990J6298
20502d5620j8215J6756Q02l0102l8864L448J3065M1436K3357M414M4799p040o8512
20489f0276k0295l3179J7255L6742j8217l0734K817R709J0482J8616P06O17O0650
20476e107k0815k6286N0198j0208k5092q660M915K3358k1513L6406J4951L4411
20464D6558K4125l7965n032K2618p6474J0626P8375k6129l6238J1894N37n558
$$ plain form
20452 7337 -37280 -77586 -49492 -92310 -111330 -65740 -11230 -1172 -21338 -13049 25213 29701
20440 29701 72133 34559 -77156 -124397 -79181 -68809 -69946 -85249 -26275 -42115 -55443 -604
20428 -604 36483 67804 21355 -31745 -31836 37240 73582 92987 69005 25187 -41322 -89816 -71012
20415 -71012 -50176 -9796 4071 -10306 -29043 -80945 -84758 -113888 -90228 -70125 -131429 -141990
20403 -141990 -97305 -85107 -15456 26647 -33085 -51805 -59868 -127038 -108719 -42677 -42211 -8013
20391 -8013 -21215 -55591 -88968 -75361 -76472 -96301 -141101 -117765 -116780 -120460 -82077 -107700 -117581
20378 -117581 -111464 -127867 -163066 -151150 -175373 -158264 -110323 -98956 -91761 -10352 -31549 -55709
20366 -55709 -54715 -21935 -1473 -2078 -59234 -83814 -91332 -51410 -35373 -4659 -5708 10986 -8199
$$ packed form
20452G337m4617m0306K8094m2818j9020M5590N4510J0058k0166Q289L8262M488
20440B9701M2432l7574j11715m7241M5216J0372j137j5303N8974j5840j3328N4839
20428f04L7087L1321m6449n3100r1O9076L6342J9405k3982m3818o6509m8494J8804
20415g1012K0836M0380J3867j4377j8737n1902l813k9130K3660K0103o1304j0561
20403a41990M4685J2198O9651M2103n9732j8720q063o7170J8319O6042M66L4198
20391h013j3202l4376l3377J3607j111j9829m4800K3336R85l680L8383k5623r881
20378a17581O117j6403l5199J1916k4223J7109M7941J1367P195Q1409k1197k4160
20366e5709R94L2780K0462o05n7156k4580p518L9922J6037L0714j049J6694j9185
$$ plain form
20353 -8199 -29183 -54403 -57400 -41725 -58122 -63355 -103343 -97434 -121151 -149942 -72269 27997
20341 27997 -40880 -75923 -73075 -49203 -75055 -98199 -122806 -127762 -89745 -107487 -92255 -59090
20329 -59090 -43356 -59251 -31607 -39436 -38461 -75607 -25059 -12502 -11254 -19072 1542 -7348 -10118
20316 -10118 -27518 -121651 -113054 -60437 -62278 -36042 -6892 28067 -29590 -38300 -73070 -136015
20304 -136015 -137581 -94889 -89965 -72910 -60205 -55431 -67624 -74299 -12220 -23920 -23574 93 21151
20291 21151 24584 -17162 -58446 -73949 -106215 -176513 -178577 -189765 -127035 -60953 -50684 -35076
20279 -35076 -4108 -73723 -46684 -46092 -76855 -93028 -126010 -165508 -117670 -126240 -99190 -67310
20267 -67310 -83313 -33231 45645 70776 66133 86440 78881 36460 -14008 -19268 -77840 -89648
$$ packed form
20353h199k0984k5220k997J5675j6397n233l9988N909k3717k8791P7673J00266
20341B7997o8877l5043K848K3872k5852k3144k4607m956L8017j7742J5232L3165
20329e9090J5734j5895K7644p829R75l7146N0548J2557J248p818K0614q890k770
20316a0118j7400r4133Q597N2617j841K6236K9150L4959n7657q710l4770o2945
20304a36015j566M2692M924J7055J2705M774j2193o675O2079j1700L46K3667K1058
20291B1151L433m1746m1284j5503l2266p0298k064j1188O2730O6082J0269J5608
20279c5076L0968o9615K7039N92l0763j6173l2982l9498M7838q570K7050L1880
20267f7310j6003N0082P8876K5131m643K0307p559m2421n0468n260n8572j1808
$$ plain form
20255 -89648 -35333 -65283 -106984 -129496 -144647 -172005 -173994 -130613 -97609 -127378 -92945 -84131
20243 -84131 -61760 -34887 36317 11488 -13657 13669 -7206 -38700 -17333 -69747 -56019 15265
20231 15265 16006 -61998 -69509 -57670 -106237 -68166 -59212 -56439 -44544 -53748 44923 78668 36228
20218 36228 -27461 -55192 4696 -29301 -33063 -2766 17323 -61428 -104871 -97030 -118382 -133183
20206 -133183 -88012 -85479 -65245 -20919 25771 31878 -17100 -25884 3172 -11254 -78649 -80072
20194 -80072 -40942 -49384 -74490 -24043 18928 -13960 -57267 -49182 -54605 -107413 -112138 -106420 -78169
20181 -78169 -6065 4713 -13551 -14624 25349 545 -63253 -97732 -121926 -128767 -96229 -51904
20169 -51904 5887 35149 34670 12176 -53571 -51841 -1209 -2542 -12956 -7478 -7673 -17587 34033
$$ packed form
20255h9648N4315k9950m1701k2512j5151k7358j989M3381L3004k9769L4433Q814
20243h4131K2371K6873P1204k4829k5145K7326k0875l1494K1367n2414J3728P1284
20231A5265P41p8004p511J1839m8567L8071Q954K773J1895r204R8671L3745m2440
20218C6228o3689k7731N9888l3997l762L0297K0089p8751m3443P841k1352j4801
20206a33183M5171K533K0234M4326M6690O107m8978q784K9056j4426o7395j423
20194h0072L9130q442k5106N0447M2971l2888m3307Q085n423n2808m725N718K8251
20181g8169P2104J0778j8264j073L9973k4804o3798l4479k4194o841L2538M4325
20169e1904N7791K9262m79k2494o5747J730N0632j333j0414N478j95r914N1620
$$ plain form
20156 34033 399 -45095 -45983 -51618 -25286 -34996 -44086 -49062 -37315 -808 46726 52825 -40344
20143 -40344 -44033 -316 -8141 -64673 -108578 -100702 -69476 -49329 -60846 -37476 1445 -24847
20131 -24847 -101203 -86893 -19548 -38182 -91471 -81573 -71777 -74402 -60122 -23337 -22142 -35355
20119 -35355 -49654 -26605 -96574 -120181 -96878 -45302 -38133 -102664 -173447 -152670 -106700 -72346
20107 -72346 -98170 -91713 -88330 -74234 -84726 -103653 -106351 -91723 -83452 -53857 -24952 10663
20095 10663 26815 -9027 -45723 -76532 -139829 -137527 -128394 -114244 -120016 -96247 -105694 -58308
20083 -58308 -28363 14875 5566 -24481 -76263 -78821 -72730 -49060 -46305 -44015 -68877 -72745 -41585
20070 -41585 -59464 -106238 -97025 -74338 -89968 -58480 -14006 -51467 -47385 -63407 -130435 -132299
$$ packed form
20156C4033l3634m5494q88n635K6332r710r090m976J1747L6507M7534O099r3169
20143d0344l689M3717p825n6532m3905P876L1226K0147j1517K3370L8921k6292
20131b4847p6356J4310O7345j8634n3289R898R796k625J4280L6785J195j3213
20119c5355j4299K3049o9969k3607K3303N1576P169o4531p0783K0777M5970L4354
20107g2346k5824O457L383J4096j0492j8927k698J4628Q271K9595K8905L5615
20095A0663J6152l5842l6696l0809o3297K302R133J4150n772K3769r447M7386
20083e8308K9945M3238r309l0047n1782k558O091K3670K755K290k4862l868L1160
20070d1585j7879m6774R213K2687j5630L1488M4474l7461M082j6022o7028j864
$$ plain form
20058 -132299 -144627 -144584 -51991 16931 -26792 -71949 -84621 -109800 -111459 -150939 -114476 -85902
20046 -85902 -88677 -112427 -110517 -115171 -125157 -103950 -122885 -55898 -46157 -31550 -62138 -83481 -83590
20033 -83590 -45131 -6962 -36143 -67795 -100063 -142607 -137690 -119237 -71369 -59213 -59729 -65052
20021 -65052 -55079 -24963 8187 18105 45562 41642 -7726 -14481 -52380 -128903 -89272 -24775
20009 -24775 -37169 -50807 -28989 18436 16107 -23044 -76626 -111780 -38088 -70984 -100323 -43338
19997 -43338 -25160 74931 140570 87834 106961 150922 176742 189816 221896 244751 300146
19986 300146 387204 455010 543303 669534 765976 845711 985665 1055905 1119392 1014542 835936
19975 835936 671969 539536 489351 405835 342379 307552 287455 204708 151438 105156 127535
$$ packed form
20058a32299j2328M3R2593O8922m3723m5157j2672k5179j659l9480L6463K8574
20046h5902k775k3750J910m654r986K1207j8935O6987R741J4607l0588k1343j09
20033h3590L8459L8169k9181l1652l2268m2544M917J8453M7868J2156n16n323
20021f5052R973L0116L3150R918K7457l920m9368o755l7899p6523L9631O4497
20009b4775j2394j3638K1818M7425k329l9151n3582l5154P3692l2896k9339N6985
19997d3338J8178J00091O5639n2736J9127M3961K5820J3074L2080K2855N5395
19986C00146Q7058O7806Q8293J26231R6442P9735J39954P0240O3487j04850j78606
19975H35936j63967j32433n0185q3516o3456l4827k0097q2747n3270m6282K2379
$$ plain form
19964 127535 123471 157558 168606 151112 104647 55940 -13521 -59360 -6050 6595 1710 62425
19952 62425 75016 49364 62999 98528 87657 61194 26267 7434 50125 59103 44769 33137
19940 33137 85271 51527 26368 11020 4125 18191 87696 104419 -27465 -81487 -6800 13933
19928 13933 23244 18733 4114 59653 52653 58194 26430 -19161 -26901 -62578 -105824 -48565 -15946
19915 -15946 -17491 -63470 -84366 -128629 -147195 -132863 -65035 -66155 -77392 -66257 -60917 -56061
19903 -56061 -84178 -40294 -94330 -130848 -62902 22214 92780 75231 40410 21067 38961 24111
19891 24111 -19081 21077 15450 17932 -13364 -53501 -66857 -28318 -1952 39681 25901 -19080
19879 -19080 -59250 -44975 -85156 -131755 -184586 -135761 -111432 -50336 -38749 -52787 -5044 17189
$$ packed form
19964A27535m064L4087J1048j7494m6465m8707o9461m5839N3310J2645m885O0715
19952F2425J2591k5652J3635L5529j0871k6463l4927j8833M2691Q978j4334j1632
19940C3137N2134l3744k5159j5348o895J4066O9505J6723j31884n4022P4687K0733
19928A3933R311m511j4619N5539p000N541l1764m5591p740l5677m3246N7259L2619
19915a5946j545m5979k0896m4263j8566J4332O7828j120j1237J1135N340M856
19903e6061k8117M3884n4036l6518O7946Q5116P0566j7549l4821j9343J7894j4850
19891B4111m3192M0158n627K482l1296m0137j3356L8539K6366M1633j3780m4981
19879a9080m0170J4275m0181m6599n2831M8825K4329O1096J1587j4038M7743K2233
$$ plain form
19867 17189 25306 -41465 -54291 -43289 -119035 -123727 -91434 -86200 -112938 -83887 -67884 -108532
19855 -108532 -126411 -122813 -118320 -42298 -24251 -31983 -54399 -62449 -83365 -96109 -121461 -167107
19843 -167107 -190305 -221470 -144322 -77823 -17841 9646 41950 64268 26731 -43077 -60476
19832 -60476 -80610 -88696 -75152 -57208 -55991 -38843 -32569 -7788 -19599 -80105 -80995 -48567 -7601
19819 -7601 -26234 -40909 -102101 -119840 -114502 -99380 33308 12852 7350 31227 -32834 -17952
19807 -17952 -32393 -6030 25123 -10858 -48831 -48719 -31889 -14920 -47090 -53766 -429 47516
19795 47516 -25706 -101500 -116624 -74 26891 18480 -6717 -15764 -37355 -41282 -26197 12036
19783 12036 -53386 -68951 -10767 33730 6411 -78677 -140738 -100710 -112197 -121382 -85662 -49484
$$ packed form
19867A7189Q117o6771j2826J1002p5746m692L2293N234k6738K9051J6003m0648
19855a08532j7879L598M493P6022J8047p732k2416q050k0916j2744k5352m5646
19843a67107k3198l1165P7148O6499N9982K7487L2304K2318l7537o9808j7399
19832f0476k0134q086J3544J7944J217J7148O274K4781j1811o0506q90L2428M0966
19819g601j8633j4675o1192j7739N338J5122J32688k0456n502K3877o4061J4882
19807a7952j4441K6363L1153l5981l7973J12J6830J6969l2170o676N3337M7945
19795D7516p3222p5794j5124J16550K6965q411k5197r047k1591l927J5085L8233
19783A2036o5422j5565N8184M4497k7319q5088o2061M0028j1487r185L5720L6178
$$ plain form
19771 -49484 -47649 -79666 -7350 53719 68703 92533 58094 -12245 -19287 -1666 -101855 -132330
19759 -132330 -67751 -29634 -12383 -76366 -82101 -65583 -24777 21080 9975 -46939 -38395 -46371
19747 -46371 -87962 -125116 -133489 -121245 -55445 -5058 28840 49998 76585 83868 89840 70465
19735 70465 57814 52669 86320 61195 -8139 -38080 -47489 -70123 -50347 -43660 -26021 -11374
19723 -11374 -6410 29638 43455 32674 -92582 -157934 -129023 -164647 -84329 -48014 203 21927
19711 21927 2468 -69546 -18598 61152 105406 74052 70651 29925 38085 54005 31261 -12796
19699 -12796 -34917 -1032 -7614 -69023 -67811 -79737 -33928 12065 11149 9360 46444 18210 4945
19686 4945 -25904 -57272 -82721 -66964 -44405 -25087 -3047 -56443 -135087 -117317 -12361 16654
$$ packed form
19771d9484J835l2017P2316O1069J4984K3830l4439p0339p042J7621j00189l0475
19759a32330O4579L8117J7251o3983n735J6518M0806M5857j1105n6914Q544p976
19747d6371m1591l7154q373J2244O5800N0387L3898K1158K6587P283N972j9375
19735G0465j2651n145L3651k5125o9334k9941r409k2634J9776O687J7639J4647
19723a1374M964L6048J3817j0781j25256o5352K8911l5624Q0318L6315M8217K1724
19711B1927j9459p2014N0948P9750M4254l1354l401m0726Q160J5920k2744m4057
19699a2796k2121L3885o582o1409J212j1926M5809M5993r16j789L7084k8234j3265
19686D945l0849l1368k5449J5757K2559J9318K2040n3396p8644J7770J04956K9015
$$ plain form
19674 16654 387 -42362 -66300 -15774 43035 76276 81767 125435 107254 107930 71311 22758
19662 22758 974 -21100 -32224 5943 31016 -31181 -39835 55776 85100 110642 47668 4532
19650 4532 3152 35770 36989 34044 12573 17483 -714 -50690 -55735 -35757 36196 39304 -8281
19637 -8281 -45796 -50700 -17580 40083 75190 90557 121996 125411 96719 90964 44775 17362
19625 17362 26680 -4339 -32701 12942 58160 37089 33285 20561 2832 -37911 -48955 -54903
19613 -54903 -24376 6632 -26801 -63914 -77896 -35432 47641 45313 44408 66695 39586 33707
19601 33707 32028 -28536 -62180 -14079 -30549 -6697 -7012 -40214 -10871 -9904 -41988 4995 28974
19588 28974 69024 125825 97443 33317 39923 40669 24890 -12300 -68952 -96596 -173420 -179852
$$ packed form
19674A6654j6267m2749k3938N0526N8809L3241N491M3668j8181O76l6619m8553
19662B2758k1784k2074j1124L8167K5073o2197q654R5611K9324K5542o2974m3136
19650D532j380L2618J219k945k1471M910j8197m9976n045J9978P1953L108m7585
19637h281l7515m904L3120N7663L5107J5367L1439L415k8692n755m6189k7413
19625A7362R318l1019k8362M5643M5218k1071l804j2724j7729m0743j1044n948
19613e4903L0527L1008l3433l7113j3982M2464Q3073k328r05K2287k7109n879
19601C3707j679o0564l3644M8101j6470K3852l15l3202K9343R67l2084M6983K3979
19588B8974M0050N6801k8382o4126O606P46j5779l7190n6652k7644p6824o432
$$ plain form
19576 -179852 -97169 -14372 5584 29086 23200 -46731 -154625 -169435 -147943 -62106 -23594
19565 -23594 -37626 -11021 5260 56342 38993 2035 -17908 -16198 42000 36414 60273 53666
19553 53666 28899 -46524 -83444 -58586 -37878 -25799 -59056 -42500 -21684 -35149 -98470 -56991
19541 -56991 -60774 -39758 -11980 -6489 3159 -29520 -25193 8429 14828 5808 24698 87134 54146
19528 54146 -53136 -112005 -99619 -90421 -120095 -166280 -243937 -278304 -300054 -290099 -211486 -122662
19516 -122662 -16714 84728 145212 211950 310400 357605 384897 379307 321018 232452 189342
19505 189342 208625 232033 276077 279151 320109 321142 253235 191204 223183 214745 171338 197003
19493 197003 209893 218421 291075 232578 203587 201739 203459 178893 218379 220322 191779 178857
$$ packed form
19576a79852Q2683Q2797J9956K3502n886o9931j07894j4810K1492Q5837L8512
19565b3594j4032K6605J6281N1082j7349l6958j9943J710N8198n586K3859o607
19553E3666k4767p5423l6920K4858K0708J2079l3257J6556K0816j3465o3321M1479
19541e6991l783K1016K7778N491R648l2679M327L3622O399r020J8890O2436l2988
19528E4146j07282n8869J2386R198k9674m6185p7657l4367k1750R955P8613Q8824
19516a22662J05948J01442O0484O6738R8450M7205K7292n590n8289q8566m3110
19505A89342J9283K3408M4044L074M0958J033o7907o2031L1979q438m3407K5665
19493A97003J2890Q528P2654n8497k8991j848J720k4566L9486J943k8543j2922
$$ plain form
19481 178857 192213 277663 333172 309578 289650 308286 344052 399220 447520 503335 444607
19470 444607 463375 531594 565553 628901 653152 714654 748663 713741 651716 613321 606658 594411
19458 594411 612739 632967 647103 618756 625230 645203 704604 742958 710352 728980 767986 834861
19446 834861 857508 824708 791864 839956 941648 1009639 1063041 1128899 1234817 1332176 1379228
19435 1379228 1386236 1457330 1505283 1555962 1567125 1619547 1709406 1848957 1975759 2070803 2209173
19424 2209173 2367406 2534311 2748306 2929739 3174093 3550960 3977520 4428845 5005464
19415 5005464 5647822 6379732 7107843 7824785 8558908 9286932 10022327 10572922 10947662
19406 10947662 11243126 11542920 12068232 12976870 14276837 16023397 18247872 21187208 25000064
$$ packed form
19481A78857J3356Q5450N5509k3594j9928J8636L5766N5168M8300N5815n8728
19470D44607J8768O8219L3959O3348K4251O1502L4009l4922o2025l8395o663j2247
19458E94411J8328K0228J4136k8347O474J9973N9401L8354l2606J8628L9006O6875
19446H34861K2647l2800l2844M8092J01692O7991N3402O5858J05918R7359M7052
19435A379228P008P1094M7953N0679J1163N2422Q9859J39551J26802R5044J38370
19424B209173J58233J66905K13995J81433K44354L76867M26560M51325N76619
19415E005464O42358P31910P28111P16942P34123P28024P35395N50595L74740
19406A0947662K95464K99794N25312R08638J299967J746560K224475K939336L812856
$$ plain form
19397 25000064 30064847 36969853 46620992 60254528 79774937 107662425 146134578
19390 146134578 195440386 249983238 295184244 312516730 293203514 246092038 190372162
19383 190372162 141298574 104332311 78112699 59683787 46664862 37311317 30472092
19376 30472092 25324587 21434292 18546624 16354306 14540514 13017911 11850364 11001504
19368 11001504 10536971 10273453 10154157 9979305 9564777 8973166 8278287 7579770 6787915
19359 6787915 5990613 5262125 4579616 4017275 3541878 3179549 2927939 2655085 2453677
19350 2453677 2309889 2155714 1992602 1827865 1694049 1577888 1521008 1513765 1414022 1298110
19340 1298110 1218270 1251157 1278650 1243613 1153070 1114386 1076683 1008587 976743 926077 839573
$$ packed form
19397B5000064N064783O905006R651139J3633536J9520409K7887488L8472153
19390A46134578M9305808N4542852M5201006J7332486j9313216m7111476n5719876
19383A90372162m9073588l6966263k6219612j8428912j3018925r353545o839225
19376C0472092n147505l890295k887668k192318j813792j522603j167547q48860
19368A1001504m64533k63518j19296j74852m14528n91611o94879o98517p91855
19359F787915p97302p28488o82509n62341m75397l62329k51610k72854k01408
19350B453677j43788j54175j63112j64737j33816j16161n6880p243r9743j15912
19340A298110p9840L2887K7493l5037r0543l8684l7703o8096l1844n0666q6504
$$ plain form
19329 839573 820283 837000 789688 697876 647626 614285 598824 566718 552525 517905 497658
19318 497658 512854 493605 466179 406420 391135 381079 350585 333474 340765 351613 329864 276898
19306 276898 273160 285811 321243 316734 240734 221502 240139 272836 258936 244990 233453 223938
19294 223938 190676 172237 182177 134355 115775 104958 91997 144440 200736 196962 136226 85637
19282 85637 83849 100283 98613 86180 104451 122674 77813 49285 85716 112275 105391 60707
19270 60707 69536 120603 154461 115651 29232 40136 34531 52628 29244 -46226 52119 195666
19258 195666 295316 470430 591603 631792 682020 726906 738001 669092 615270 546535 447047
19247 447047 358806 332267 290518 259792 182290 114310 167260 211281 242271 209063 146465
$$ packed form
19329H39573j9290J6717m7312r1812n0250l3341j5461l2106j4193l4620k0247
19318D97658J5196j9249k7426n9759j5285j0056l0494j7111P291J0848k1749n2966
19306B76898l738J2651L5432m509p6000j9232J8637L2697j3900j3946j1537r515
19294B23938l3262j8439R940m7822j8580j0817j2961N2443N6296l774o0736n0589
19282H5637j788J6434j670j2433J8271J8223m4861k8528L6431K6559o884m4684
19270F0707Q829N1067L3858l8810q6419J0904n605J8097k3384p5470R8345J43547
19258A95666R9650J75114J21173M0189N0228M4886J1095o8909n3822o8735r9488
19247D47047q8241k6539m1749l0726p7502o7980N2950M4021L0990l3208o2598
$$ plain form
19236 146465 168413 173696 173900 162786 186871 226206 253914 226859 211065 139788 107558 101950
19224 101950 91848 118017 119833 79385 105342 127143 105756 81267 53857 80704 74704 47347
19212 47347 26312 -12857 -36427 14427 51872 23262 47216 57120 23531 33111 43460 11799
19200 11799 37867 121349 125322 114061 151687 163801 161008 175030 132458 111747 88796 81382
19188 81382 73685 94561 85752 45237 78316 93258 90925 153448 179342 102801 51248 44962
19176 44962 3028 14668 59076 44134 -19120 9091 84174 93880 48760 -20423 42976 74720
19164 74720 75762 59358 67641 29750 3975 6281 -1848 -25915 -44812 -49353 -38286 -79971 -14875
19151 -14875 49295 54848 80463 94124 48003 11838 7473 -10870 12430 98239 123038 62640
$$ packed form
19236A46465K1948N283K04j1114K4085L9335K7708k7055j5794p1277l2230n608
19224A01950j0102K6169J816m0448K5957K1801k1387k4489k7410K6847o000k7357
19212D7347k1035l9169k3570N0854L7445k8610K3954R904l3589R580J0349l1661
19200A1799K6068Q3482L973j1261L7626J2114k793J4022m2572k0711k2951p414
19188H1382p697K0876q809m0515L3079J4942k333O2523K5894p6541n1553o286
19176D4962m1934J1640M4408j4942o3254K8211P5083R706m5120o9183O3399L1744
19164G4720J042j6404Q283l7891k5775K306q129k4067j8897m541J1067m1685O5096
19151a4875O4170N553K5615J3661m6121l6165m365j8343K3300Q5809K4799o0398
$$ plain form
19139 62640 63367 73692 68643 61467 -10259 -44032 23052 34303 17769 21825 -3133 19335 23783
19126 23783 32520 78501 89295 133927 78048 24171 -40144 -39490 10575 61280 95826 97246
19114 97246 80348 100283 106095 97192 21263 -48715 -59100 1997 28089 49538 86637 87157
19102 87157 47225 45679 65944 64973 78156 51710 36638 39146 29251 17019 56118 20267 -34057
19089 -34057 -18862 52627 72499 90195 -5792 -73516 -57846 27076 42153 58214 55937 -28343
19077 -28343 -73568 -116840 -125098 -114730 -93133 -69079 -73178 -86904 -48387 -6262 35140 18735
19065 18735 -29614 -56513 -44753 9807 23021 -22927 29140 74514 50586 23581 -2301 4215
19053 4215 75321 93445 29862 11457 -7102 6967 6749 -10695 -24993 -23109 -11177 -48746
$$ packed form
19139F2640P27J0325n049p176p1726l3773O7084J1251j6534M056k4958K2468M448
19126B3783Q737M5981J0794M4632n5879n3877o4315O54N0065N0705L4546J420
19114I7246j6898J9935N812q903p5929o9978j0385O1097K6092K1449L7099N20
19102H7157l9932j546K0265r71J3183k6446j5072K508r895j2232L9099l5851n4324
19089c4057J5195P1489J9872J7696r5987o7724J5670Q4922J5077J6061k277q4280
19077b8343m5225m3272q258J0368K1597K4054m099j3726L8517M2125M1402j6405
19065A8735m8349k6899J1760N4560J3214m5948N2067M5374k3928k7005k5882O516
19053D215P1106J8124o3583j8405j8559J4069k18j7444j4298J884J1932l7569
$$ plain form
19041 -48746 -31030 -10308 19059 92637 184451 129153 100937 141244 237320 341811 383407
19030 383407 400557 411620 479052 464554 425212 451767 443500 381913 336107 322226 317099 248599
19018 248599 168068 139110 90261 103446 81423 96372 99739 81454 95458 97779 67570 63742
19006 63742 78515 4074 696 19640 -6314 -51537 -77826 -21875 41244 42431 8069 10643
18994 10643 -540 65741 152687 187029 130381 135811 139443 111674 96473 87172 136675 200347
18982 200347 294780 347783 386716 383733 426494 479285 488964 475374 439695 473760 519988 491887
18970 491887 484777 407845 351805 272364 187850 89673 71865 126693 147815 71434 -6868 16394
18958 16394 97126 117249 68946 66242 54715 -10990 -32434 36861 71162 87363 28945 12767
$$ packed form
19041d8746J7716K0722K9367P3578R1814n5298k8216M0307R6076J04491M1596
19030C83407J7150J1063O7432j4498l9342K6555q267o1587m5806j3881n127o8500
19018B48599q0531k8958m8849J3185k2023J4949L367j8285J4004K321l0209l828
19006F3742J4773p4441l378J8944k5954m5223k6289N5951O3119J187l4362K574
18994A0643j1183O6281Q6946L4342n6648N430L632k7769j5201r301M9503O3672
18982B00347R4433N3003L8933k983M2761N2791R679j3590l5679L4065M6228k8101
18970D91887p110p6932n6040p9441q4514r8177j7808N4828K1122p6381p8302K3262
18958A6394Q0732K0123m8303k704j1527o5705k1444O9295L4301J6201n8418j6178
$$ plain form
18946 12767 29247 37674 49719 50770 43989 38606 5412 3442 45949 46792 28285 94162 92192
18933 92192 67524 100797 110400 88207 80699 123797 136464 74699 85151 140136 174936 180831
18921 180831 115427 41080 48360 46641 30171 75387 104636 39931 -32740 -7432 16501 41263
18909 41263 45916 37368 24188 11576 28167 13236 6143 52535 18002 -8463 -32182 -68213
18897 -68213 -106162 -108641 -71073 47158 88997 53687 52087 33925 25058 -9730 -1891 -26458
18885 -26458 -53629 -37271 -1204 109970 136562 36362 -47790 -68781 -40807 73314 150788
18874 150788 119751 88670 40587 17145 -12677 -22826 21479 39178 36742 794 -75136 -48549
18862 -48549 -55904 -90240 -94196 -60292 18609 41459 45753 3300 1288 10496 33258 71802 51584
$$ packed form
18946A2767J6480Q427J2045J051o781n383l3194j970M2507Q43j8507O5877j970
18933I2192k4668L3273R603k2193p508M3098J2667o1765J0452N4985L4800N895
18921A80831o5404p4347P280j719j6470M5216K9249o4705p2671K5308K3933K4762
18909D1263M653q548j3180j2612J6591j4931p093M6392l4533k6465k3719l6031
18897f8213l7949k479L7568J18231M1839l5310j600j8162q867l4788P839k4567
18885b6458k7171J6358L6067J11174K6592j00200q4152k0991K7974J14121P7474
18874A50788l1037l1081m8083k3442k9822j0149M4305J7699k436l5948p5930K6587
18862d8549p355l4336l956L3904P8901K2850M294m2453k012R208K2762L8544k0218
$$ plain form
18849 51584 39890 69062 59398 14933 -59318 -55732 -29924 -36023 -15041 -1758 17207 -415
18837 -415 -22925 13003 66306 140924 220741 315839 360138 439438 450230 417664 385446 443101
18825 443101 457243 451605 439520 331709 283723 218994 213842 137450 80257 98794 118562 167510
18813 167510 211838 171333 157922 208999 221336 230204 226639 199114 207230 227811 266221 325108
18801 325108 328884 236649 234158 347979 390773 458989 578785 747982 846077 1003757 1189237
18790 1189237 1330330 1306591 1313550 1265460 1133587 1048732 991372 954360 902278 841230 887102
18779 887102 855824 807177 818962 784411 703012 552101 479378 451093 423721 295341 281383
18768 281383 263322 236920 202703 157764 108421 63946 105571 133094 114557 50923 57334 90031
$$ packed form
18849E1584j1694K9172r664m4465p4251L586K5808o099K0982J3283J8965j7622
18837d15k2510L5928N3303P4618P9817R5098M4299P9300J0792l2566l2218N7655
18825D43101J4142n638j2085j07811m7986o4729n152p6392n7193J8537J9768M8948
18813A67510M4328m0505j3411N1077J2337Q868l565k7525Q116K0581L8410N8887
18801C25108L776r2235k491J13821M2794O8216J19796J69197R8095J57680J85480
18790A189237J41093k3739O959m8090j31873q4855n7360l7012n2082o1048M5872
18779H87102l1278m8647J1785l4551q1399j50911p2723k8285k7372j28380j3958
18768B81383j8061k6402l4217m4939m9343m4475M1625K7523j8537o3634O411L2697
$$ plain form
18756 90031 161585 209173 191880 151410 94589 186200 241058 242718 238433 171983 108129 112653
18744 112653 111376 125889 91338 114928 141095 63477 24077 30171 62880 54081 16649 -47526
18732 -47526 -35741 -46908 -48190 -12958 -1043 15024 54863 80018 121618 108907 95814 123294
18720 123294 57874 -44707 -68376 -16421 -9529 -56290 -12950 60186 20570 42961 85908
18709 85908 50869 -6878 -56508 -37002 28387 97384 49878 42578 88562 94311 83714 131136
18697 131136 170013 185619 192499 125858 74692 56046 99255 130496 117188 64475 44737 36426
18685 36426 29922 42371 62243 18711 -41896 -15746 39320 66178 23441 16991 47520 31472
18673 31472 51679 61093 100285 74380 10357 -22649 -9554 -5387 -30319 -76964 -39039 -13111
$$ packed form
18756I0031P1554M7588j7293m0470n6821R1611N4858J660m285o6450o3854M524
18744A12653j277J4513l4551K3590K6167p7618l9400O094L2709q799l7432o4175
18732d7526J1785j1167j282L5232J1915J6067L9839K5155M1600j2711j3093K7480
18720A23294o5420j02581k3669N1955O892m6761M3340P3136l9616K2391M2947
18709H5908l5039n7747m9630J9506O5389O8997m7506p300M5984N749j0597M7422
18697A31136L8877J5606O880o6641n1166j8646M3209L1241j3308n2713j9738q311
18685C6426o504J2449J9872m3532o0607K6150N5066K6858m2737o450L0529j6048
18673C1472K0207R414L9192k5905o4023l3006J3095M167k4932m6645L7925K5928
$$ plain form
18661 -13111 66670 43327 10342 74172 51015 -8320 -72452 -67594 -28900 -9600 -46237 -62604
18649 -62604 -123510 -134376 -169850 -178354 -207261 -196288 -113859 -61524 -28708 -18162 -5161 80042
18637 80042 174774 188498 195839 233117 273087 300827 360310 291023 220490 193722 172455 197721
18625 197721 225614 175629 137060 127323 248550 273316 238873 266717 305962 324171 290990
18614 290990 273871 318142 350877 353527 314429 326228 346636 352442 303562 216202 158216 172037
18602 172037 167004 114539 118097 113014 92597 61662 30880 -11536 -42687 18242 147484 228035
18590 228035 237446 220954 224464 240196 333333 387831 427835 468783 518539 559074 554188 550404
18578 550404 551710 542045 515118 466209 447727 451841 410738 451481 486955 554826 563963 570707
$$ packed form
18661a3111P9781k3343l2985O3830k3157n9335o4132M858L8694J9300l6637j6367
18649f2604o0906j0866l5474q504k8907J0973Q2429N2335L2816J0546J3001Q5203
18637H0042R4732J3724P341L7278L9970K7740N9483o9287p0533k6768k1267K5266
18625A97721K7893m9985l8569r737J21227K4766l4443K7844L9245J8209l3181
18614B90990j7119M4271L2735K650l9098J1799K0408N806m8880q7360n7986J3821
18602A72037n033n2465L558n083k0417l0935l0782m2416l1151O0929J29242Q0551
18590B28035R411j6492L510J5732R3137N4498M0004M0948M9756M0535m886l784
18578E50404J306r665k6927m8909j8482M114m1103M0743L5474O7871R137O744
$$ plain form
18566 570707 629814 623795 616290 677776 765598 822680 795094 763817 820541 923892 939777 921116
18554 921116 879844 870206 909198 910900 918822 1038704 1081452 1114744 1167415 1258012 1329551 1443072
18542 1443072 1554974 1678414 1865040 2044800 2198548 2330526 2529443 2797506 3099701
18533 3099701 3460893 3778368 3949092 4088450 4337752 4742280 5371525 6082279 6846751
18524 6846751 7921055 9452823 11639186 14804798 19433349 26494818 37446878 53743846
18516 53743846 75442801 97711121 108079296 101439289 91026225 89665525 99987678
18509 99987678 115199332 117662423 97131553 68720824 46559468 32515456 23881579
18502 23881579 18346719 14578826 11946929 10103736 8805598 7849788 7009975 6371769
$$ packed form
18566E70707N9107o019p505O1486Q7822N7082k7586l1277N6724J03351J5885j8661
18554I21116m1272r638L8992J702P922J19882M2748L3292N2671R0597P1539J13521
18542A443072J11902J23440J86626J79760J53748J31978J98917K68063L02195
18533C099701L61192L17475J70724J39358K49302M04528O29245P10754P64472
18524F846751J074304J531768K186363L165612M628551P061469J0952060J6296968
18516E3743846K1698955K2268320J0368175o640007j0413064j360700J0322153
18509I9987678J5211654K463091k0530870k8410729k2161356j4044012q633877
18502B3881579n534860l767893k631897j843193j298138r55810q39813o38206
$$ plain form
18494 6371769 5946849 5675053 5605392 5639778 5600217 5434844 5214438 5050293 5002306 5048339
18484 5048339 5155178 5377167 5675105 5924492 6152856 6337458 6649464 7148284 7767449
18475 7767449 8426331 9164849 10244422 11809851 14066507 17329342 22085075 29397827
18467 29397827 40907527 58725882 84157939 113737158 133089757 128314676 112494924
18460 112494924 104976976 111561568 126367804 133556221 117756558 87684366 60451790
18453 60451790 41982940 30446274 23169478 18423635 15253938 13038658 11423074 10315528
18445 10315528 9395272 8522774 7679772 6986333 6344561 5723800 5117030 4505066 4014197
18436 4014197 3657663 3367585 3198342 3152110 3154994 3226327 3361020 3554808 3831614 3959249
$$ packed form
18494F371769m24920k71796o9661L4386l9561j65373k20406j64145m7987M6033
18484E048339J06839K21989K97938K49387K28364J84602L12006M98820O19165
18475G767449O58882P38518J079573J565429K256656L262835M755733P312752
18467B9397827J1509700J7818355K5432057K9579219J9352599m775081j5819752
18460A12494924p517948O584592J4806236P188417j5799663l0072192k7232576
18453F0451790j8468850j1536666p276796m745843l169697k215280j615584j107546
18445A0315528r20256q72498q43002o93439o41772o20761o06770o11964m90869
18436D014197l56534k90078j69243m6232K884P1333J34693J93788K76806J27635
$$ plain form
18426 3959249 3821308 3423361 2908579 2327317 1970263 1740250 1595377 1536620 1494426 1429876
18416 1429876 1451973 1607578 1790260 1987221 2139491 2120213 2073436 2208081 2538558 2846716
18406 2846716 2782226 2377588 1999924 1853910 1845988 1780963 1473324 1087615 864843 693324
18396 693324 609801 511189 457398 398009 385853 471018 589252 607600 628457 733785 786450
18385 786450 894217 961612 1062671 1176140 1215568 1217849 1355492 1460756 1576513 1696878
18375 1696878 1720515 1564286 1417121 1279007 1157234 1161358 1147039 1216687 1306565 1382879 1567371
18364 1567371 1838835 2135786 2455438 2689198 2629280 2536206 2624391 2918195 3302764 3365920
18354 3365920 3002491 2563820 2380997 2343215 2429059 2240036 1918040 1668141 1582659 1600884
$$ packed form
18426C959249j37941l97947n14782n81262l57054k30013j44873n8757m2194o4550
18416A429876K2097J55605J82682J96961J52270j9278m6777J34645L30477L08158
18406B846716o4490m04638l77664j46014p922o5025l07639l85709k22772j71519
18396F93324q3523r8612n3791n9389j2156Q5165J18234J8348K0857J05328N2665
18385G86450J07767O7395J01059J13469L9428K281J37643J05264J15757J20365
18375A696878K3637j56229j47165j38114j21773M124j4319O9648Q9878P6314J84492
18364A567371K71464K96951L19652K33760n9918r3074Q8185K93804L84569O3156
18354C365920l63429m38671j82823l7782Q5844j89023l21996k49899q5482J8225
$$ plain form
18344 1600884 1594940 1559838 1542186 1540642 1606822 1757497 1880952 1993768 2155458 2377376 2679022
18333 2679022 3014430 3279839 3488745 3634861 3773274 4033279 4365926 4691407 5030500
18324 5030500 5404177 5928135 6736738 7789335 9176395 11000300 13742903 18096354 24857457
18315 24857457 35171881 50256213 70646704 92861990 106168482 103314686 93120308
18308 93120308 88696818 94970809 107120619 110987609 95846555 70331914 48266465
18301 48266465 33697846 24657881 18859936 14945949 12354292 10558335 9287616 8432864
18293 8432864 7796040 7233581 6837611 6544052 6280111 6146602 6114807 6224052 6406155 6461580
18283 6461580 6354916 6126827 5968816 6002502 6166858 6478025 6765490 7094418 7594670 8391831
$$ packed form
18344A600884n944l5102j7652j544O6180J50675J23455J12816J61690K21918L01646
18333B679022L35408K65409K08906J46116J38413K60005L32647L25481L39093
18324E030500L73677N23958Q08603J052597J387060J823905K742603M353451O761103
18315B4857457J0314424J5084332K0390491K2215286J3306492k853796j0194378
18308I3120308m423490O273991J2149810L866990j5141054k5514641k2065449
18301D8266465j4568619r039965n797945l913987k591657j795957j270719q54752
18293H432864o36824n62459l95970k93559k63941j33509l1795J09245J82103N5425
18283F461580j06664k28089j58011L3686J64356L11167K87465L28928N00252P97161
$$ plain form
18273 8391831 9603223 11164636 13294443 16393961 21100243 28543324 40264214 58292575
18265 58292575 84125366 115370364 139355862 140143596 123735691 110587794 110727083 120878228
18257 120878228 127842723 116845080 90329458 63230363 43715277 31335107 23362673
18250 23362673 18005993 14321136 11680633 9861975 8575575 7553527 6715196 6018839
18242 6018839 5507011 4993727 4540814 4283817 4024267 3770420 3533841 3196417 2832977
18233 2832977 2534066 2278046 2071567 1903285 1718760 1532344 1475403 1435790 1294953 1109903
18223 1109903 990480 952364 901052 869031 826823 784166 743778 691054 625688 613984 609263
18212 609263 581829 500335 519849 561091 488834 451502 383661 376364 372171 361541 364626 376170
$$ packed form
18273H391831J211392J561413K129807L099518M706282P443081J1720890J8028361
18265E8292575K5832791L1244998K3985498P87734j6407905j3147897J39289J0151145
18257A20878228O964495j0997643k6515622k7099095j9515086j2380170p972434
18250B3362673n356680l684857k640503j818658j286400j022048q38331o96357
18242F018839n11828n13284m52913k56997k59550k53847k36579l37424l63440
18233B832977k98911k56020k06479j68282j84525j86416n6941l9613j40837j85050
18223A109903j19423l8116n1312l2021m2208m2657m0388n2724o5366j1704m721
18212F09263k7434q1494J9514M1242p2257l7332o7841p297m193j0630L085J1544
$$ plain form
18200 376170 349163 281935 261320 225591 232025 274537 302096 338724 372211 375196 328815 258917
18188 258917 220147 172221 136516 175599 238168 289205 292759 303965 362694 412219 457577 436972
18176 436972 395259 430506 505258 486763 462389 475081 435434 435083 393747 339444 336985 367406
18164 367406 290712 235067 218167 204195 214204 246965 214162 197668 255362 297532 304967 258741
18152 258741 260627 235080 195768 198446 210847 219365 210578 104696 104263 116826 93541 46663
18140 46663 51164 60460 68040 101453 60983 56105 121567 186557 273061 336631 389706 442414
18128 442414 441697 486854 545330 638237 639847 598417 634842 611729 505055 434155 471518 477441
18116 477441 414992 392346 366906 373707 395782 426945 369584 334428 300031 332386 386187 394380
$$ packed form
18200C76170k7007o7228k0615l5729O434M2512K7559L6628L3487K985m6381o9898
18188B58917l8770m7926l5705L9083O2569N1037L554J1206N8729M9525M5358k0605
18176D36972m1713L5247P4752j8495k4374J2692l9647l51m1336n4303k459L0421
18164C67406p6694n5645j6900j3972J0009L2761l2803j6494N7694M2170P435m6226
18152B58741J886k5547l9312K678J2401Q518q787j05882m33J2563k3285m6878
18140D6663M501R296P580L3413m0470m878O5462O4990Q6504O3570N3075N2708
18128D42414p17M5157N8476R2907J610m1430L6425k3113j06674p0900L7363N923
18116D77441o2449k2646k5440O801K2075L1163n7361l5156l4397L2355N3801Q193
$$ plain form
18104 394380 363879 280827 266783 255445 248337 263250 266366 299759 317067 294185 252084 337939
18092 337939 444760 599127 796386 912587 943571 927424 957914 970570 957875 861903 704676
18081 704676 602412 560777 426906 315939 269291 258342 247787 324601 319165 305377 385393
18070 385393 461352 531242 577511 732358 962735 1356543 1775696 1967750 1776624 1596246
18060 1596246 1591052 1764532 1911395 1695000 1235671 877668 682003 541677 431116 388681
18050 388681 343276 329462 383468 432014 368289 268960 250132 291486 328895 477718 613027
18039 613027 671021 789119 811752 775608 744237 723994 696801 534044 386579 275966 174425
18028 174425 70906 49644 57425 114895 223086 383204 524674 654095 773914 932830
$$ packed form
18104C94380l0501q3052j4044j1338p108J4913L116L3393J7308k2882m2101Q5855
18092C37939J06821J54367J97259J16201L0984j6147L0490J2656j2695r5972j57227
18081G04676j02264m1635j33871j10967m6648j0949j0555P6814n436j3788Q0016
18070C85393P5959O9890M6269J54847K30377L93808M19153J92054j91126j80378
18060A596246n194J73480J46863k16395m59329l58003j95665j40326j10561m2435
18050C88681m5405j3814N4006M8546o3725r9329j8828M1354L7409J48823J35309
18039F13027N7994J18098K2633l6144l1371k0243k7193j62757j47465j10613j01541
18028A74425j03519k1262P781N7470J08191J60118J41470J29421J19819J58916
$$ plain form
18018 932830 1304339 1845883 2441570 2694752 2472822 2170142 2105703 2369428 2529354 2148703
18008 2148703 1509872 1051714 759908 644426 640263 640853 668856 655213 692792 656098 601262
17997 601262 567518 549005 509203 504751 530724 594826 551801 477608 529656 515976 462847 490461
17985 490461 504407 563871 611960 570823 549855 437011 378633 277467 148782 162816 275763
17974 275763 386721 485569 537258 631308 696600 673737 680286 648109 635670 612707 603030 567116
17962 567116 608137 656477 698327 624057 604955 627389 629086 714707 864774 898672 933225
17951 933225 1060482 1177307 1263966 1290859 1279493 1202703 1178022 1204345 1186694 1176065 1210208
17940 1210208 1183250 1151201 1101960 1070909 1054986 1101737 1244374 1452212 1584844 1659493 1737224
$$ packed form
18018I32830L71509N41544N95687K53182k21930l02680o4439K63725J59926l80651
18008B148703o38831m58158k91806j15482m163N90K8003j3643L7579l6694n4836
17997F01262l3744j8513l9802m452K5973O4102m3025p4193N2048j3680n3129K7614
17985D90461J3946N9464M8089m1137k0968j12844n8378j01166j28685J4034J12947
17974B75763J10958R8848N1689R4050O5292k2863O549l2177j2439k2963r677l5914
17962E67116M1021M8340M1850p4270j9102K2434J697Q5621J50067L3898L4553
17951I33225J27257J16825Q6659K6893j1366p6790k4681K6323j7651j0629L4143
17940A210208k6958l2049m9241l1051j5923M6751J42637K07838J32632P4649P7731
$$ plain form
17929 1737224 1704284 1659312 1647703 1551128 1395790 1312502 1346590 1435678 1474629 1526175 1605265
17918 1605265 1643458 1695290 1839263 1945888 2064535 2220230 2396662 2696777 3046399 3455694
17908 3455694 3949112 4570832 5384997 6337828 7706918 9671620 12469728 16547158 22725858
17899 22725858 32326314 46779798 67213035 91560702 111000548 115158599 101828943
17892 101828943 77712232 54317901 37424662 26583698 19830780 15502044 12663678
17885 12663678 10731740 9345639 8277211 7464216 6834453 6339569 5817163 5333254 4900351
17876 4900351 4530518 4205210 3854049 3562012 3384933 3352950 3323951 3390433 3520932 3667494
17866 3667494 3842105 4094256 4460409 4887990 5363839 5842191 6450456 7202207 8053498
$$ packed form
17929A737224l2940m4972j1609r6575j55338q3288L4088Q9088L8951N1546P9090
17918A605265L8193N1832J43973J06625J18647J55695J76432L00115L49622M09295
17908C455694M93418O21720Q14165R52831J369090J964702K798108M077430O178700
17899B2725858R600456J4453484K0433237K4347667J9439846M158051j3329656
17892A01828943k4116711k3394331j6893239j0840964o752918m328736k838366
17885A2663678j931938j386101j068428q12995o29763m94884n22406m83909m32903
17876D900351l69833l25308l51161k92037j77079l1983k8999O6482J30499J46562
17866C667494J74611K52151L66153M27581M75849M78352O08265P51751Q51291
$$ plain form
17857 8053498 9113045 10499060 12355546 15128281 19020221 24792687 33532553 46759687
17849 46759687 66115572 91793029 119776364 142573354 155493776 155937874 143652073
17842 143652073 121281700 93215020 66803802 47098305 34031364 25491628 19770176
17835 19770176 15844376 13078864 11136318 9613887 8377262 7384561 6568935 5907629
17827 5907629 5342555 4810745 4352709 3948168 3658164 3446499 3276699 3163618 3111764 3042376
17817 3042376 3087035 3230379 3395900 3648410 3863852 4100387 4369456 4610851 4822584 4987424
17807 4987424 5197594 5600150 6202640 7087003 8463423 10568012 13829444 18873223 26745879
17798 26745879 38565449 54511943 71516037 81487973 78918064 64875102 46651076
$$ packed form
17857H053498J059547J386015J856486K772735L891940N772466Q739866J3227134
17849D6759687J9355885K5677457K7983335K2796990J2920422M44098j2285801
17842A43652073k2370373k8066680k6411218j9705497j3066941q539736n721452
17835A9770176l925800k765512j942546j522431j236625r92701q15626o61306
17827E907629n65074n31810m58036m04541k90004k11665j69800j13081n1854o9388
17817C042376M4659J43344J65521K52510K15442K36535K69069K41395K11733J64840
17807D987424K10170M02556O02490Q84363J376420K104589L261432N043779P872656
17798B6745879J1819570J5946494J7004094R971936k569909j4042962j8224026
$$ plain form
17791 46651076 31818040 22282653 16617103 13098404 10655583 8850841 7235955 5938292
17783 5938292 4926894 4183648 3662440 3271317 2943171 2631160 2373627 2181037 2093114
17774 2093114 1956447 1834560 1732285 1596125 1511956 1439087 1397320 1355724 1360973 1432703 1508306
17763 1508306 1596692 1633525 1570180 1511867 1429672 1353998 1332501 1198476 1056774 876345 756525
17752 756525 748616 730873 657319 634713 636023 653192 725733 843883 931552 1103164 1429443
17741 1429443 1852682 2288076 2590392 2870069 2946391 2704545 2347003 1929316 1493845 1169858
17731 1169858 955464 764705 584418 525035 504031 439620 437774 446643 418126 390855 285971
17720 285971 198642 152403 183371 242346 297533 388718 442295 491970 545087 603381 540888
$$ packed form
17791D6651076j4833036r535387n665550l518699k442821j804742j614886j297663
17783E938292j011398p43246n21208l91123l28146l12011k57533j92590q7923
17774B093114j36667j21887j02275j36160q4169p2869m1767m1596N249P1730P5603
17763A508306Q8386L6833o3345n8313q2195p5674k1497j34025j41702j80429j19820
17752G56525p909j7743p3554k2606J310J7169P2541J18150Q7669J71612L26279
17741A429443M23239M35394L02316K79677P6322k41846l57542m17687m35471l23987
17731A169858k14394j90759j80287n9383k1004o4411j846Q869k8517k7271j04884
17720B85971q7329m6239L0968N8975N5187R1185N3577M9675N3117N8294o2493
$$ plain form
17709 540888 508010 471756 421890 377924 332754 323501 310710 299559 297718 206866 197361 288787
17697 288787 294192 281539 332622 418522 506540 636892 898631 1223104 1416533 1467452 1417035
17686 1417035 1113773 791635 558625 419344 399279 355315 318284 286439 225619 197295
17676 197295 190783 177944 122781 185782 211071 171794 82868 74377 69940 111716 94980 149133
17664 149133 225727 295448 308355 290871 319260 322460 326963 323722 327727 305140 243185 172038
17652 172038 160529 170953 173254 171953 179125 193039 176978 182109 223205 252058 249581 189975
17640 189975 139629 181134 194709 149972 149023 136684 123695 125869 119846 182619 210806 231749
17628 231749 199064 195593 210752 188198 178306 169296 177774 150299 132555 133871 185209 173905
$$ packed form
17709E40888l2878l6254m9866m3966m5170r253j2791j1151j841r0852r505R1426
17697B88787N405j2653N1083Q5900Q8018J30352K61739L24473J93429N0919n0417
17686A417035l03262l22138k33010j39281k0065m3964l7031l1845o0820k8324
17676A97295o512j2839n5163O3001K5289l9277q8926q491m437M1776j6736N4153
17664A49133P6594O9721J2907j7484K8389L200M503l241M005k2587o1955p1147
17652A72038j1509J0424K301j301P172J3914j6061N131M1096K8853k477n9606
17640A89975n0346M1505J3575m4737r49j2339j2989K174o023O2773K8187K0943
17628B31749l2685l471J5159k2554r892r010Q478k7475j7744J316N1338j1304
$$ plain form
17616 173905 100716 31392 6182 -19288 36744 91836 103154 58573 52123 79367 64824 54297
17604 54297 99455 98697 49264 42991 10172 30986 55065 33572 26993 43707 15281 -34245
17592 -34245 -12186 10784 -14330 -24145 -20357 -14689 -14184 -39522 -49243 -50424 -10712 7789 -10108
17579 -10108 -61659 -45911 -25742 -7072 -41752 -11105 37399 35929 121944 178959 209817 303520
17567 303520 413759 580834 668835 679345 643034 661666 689611 632246 437845 309004 269995
17556 269995 204450 114227 83091 77153 38628 -9760 -50480 -8306 70174 57512 16394 27026
17544 27026 67457 70921 46616 26837 61448 27122 -11572 -18548 -14896 -23522 -17296 -18873 3930
17531 3930 28047 88264 109959 49155 42222 22858 -2664 2119 42326 74980 107556 162641
$$ packed form
17616A73905p3189o9324k5210k5470N6032N5092J1318m4581o450K7244j4543j0527
17604E4297M5158p58m9433o273l2819K0814K4079k1493o579J6714k8426m9526
17592c4245K2059K2970k5114r815L788N668N05k5338r721j181L9712J8501j7897
17579a0108n1551J5748K0169J8670l4680L0647M8504j470Q6015N7015L0858R3703
17567C03520J10239J67075Q8001J0510l6311J8632K7945n7365j94401j28841l9009
17556B69995o5545r0223l1136n938l8525m8388m0720M2174P8480j2662m1118J0632
17544B7026M0431L464k4305j9779L4611l4326l8694o976L652q626O226j577K2803
17531C930K4117O0217K1695o0804o933j9364k5522M783M0207L2654L2576N5085
$$ plain form
17519 162641 268077 446999 613081 747026 743194 670878 596787 596095 658133 614813 432250
17508 432250 297134 235299 227753 184213 154283 122181 118900 77207 41829 -4851 -8976 54071
17496 54071 75486 64013 56409 -832 -17531 -25045 -58044 -85097 -77658 -79865 -22137 2177
17484 2177 8592 -34147 -41576 -45550 -53197 -86078 -59743 -15785 45024 49381 -30004 -58273 -86619
17471 -86619 -37617 -11522 -7154 28292 28095 50816 61124 -3644 -12872 37217 67039 -14604
17459 -14604 -59908 -115722 -72449 -23484 -67875 -111917 -100622 -81778 -26253 -5852 5520 34078
17447 34078 -2756 18153 33595 49251 31067 20477 74120 65961 64568 148309 125771 42559
17435 42559 60719 90669 65602 16384 -25147 -10730 9520 73622 130819 134095 69120 51891
$$ packed form
17519A62641J05436J78922J66082J33945l832p2316p4091o92O2038m3320j82563
17508D32250j35116o1835p546m3540k9930l2102l281m1693l5378m6680m125O3047
17496E4071K1415j1473p604n7241j6699p514l2999k7053P439k207N7728K4314
17484B177O415m2739p429l974p647l2881K6335M3958O0809M357p9385k8269k8346
17471h6619M9002K6095M368L5446j97K2721J0308o4768r228N0089K9822q1643
17459a4604m5304n5814M3273M8965m4391m4042J1295J8844N5525K0401J1372K8558
17447C4078l6834K0909J5442J5656j8184j0590N3643q159j393Q3741k2538q3212
17435D2559J8160K9950k5067m9218m1531J4417K0250O4102N7197L276o4975j7229
$$ plain form
17423 51891 5832 -37568 -15228 158 41887 33041 37758 -3070 -16819 -22411 -18238 -31242
17411 -31242 -38293 -10539 -43571 -103439 -75868 -52878 -82171 -35172 68888 106084 36626 9990
17399 9990 20265 23519 22430 33003 -7993 -9852 14698 88439 126206 84004 90516 133595 130079
17386 130079 124856 136929 111459 130980 159075 174097 214709 306186 365434 367114 334978 267783
17374 267783 266969 215830 141845 107625 108739 100895 96038 50924 15804 13861 8632 32479 62200
17361 62200 50842 90480 33668 -3815 -17874 -38868 30660 62654 53467 3673 43645 84009
17349 84009 97155 116439 113032 67165 19846 -6494 -21683 51397 91902 62437 29163 36342
17337 36342 52202 159750 258476 264343 317418 431409 513684 592644 577555 569599 523983 447404
$$ packed form
17423E1891m6059m3400K2340J5386M1729q846M717m0828j3749n592M173j3004
17411c1242p051K7754l3032n9868K7571K2990k9293M6999J04060L7196o9458k6636
17399I990J0275L254j089J0573m0996j859K4550P3741L7767m2202O512M3079l516
17386A30079n223J2073k5470J9521K8095J5022M0612R1477N9248J680l2136o7195
17374B67783q14n1139p3985l4220J114p844m857m5114l5120j943n229K3847K9721
17361F2200j1358L9638n6812l7483j4059k0994O9528L1994r187m9794L9972M0364
17349H4009J3146J9284l407m5867m7319k6340j5189P3080M0505k9465l3274P179
17337C6342J5860J07548R8726N867N3075J13991Q2275P8960j5089p956m5616p6579
$$ plain form
17325 447404 414293 345159 267033 228215 230861 228775 175847 144116 133422 128152 75370 40674
17313 40674 32195 110058 82123 57006 37036 61692 65267 74556 74239 48429 9661 8375 7086
17300 7086 9193 30586 -26771 -89810 -54999 3995 35645 -5866 -29212 -54833 -27961 -33491
17288 -33491 -43220 31815 59435 123306 208007 200891 226264 264643 286911 261920 243979 235537
17276 235537 201089 214682 184929 166482 119437 60420 59857 82214 69550 23549 18642 33126
17264 33126 96686 113209 78066 85501 48357 21026 23865 35030 16744 19633 91786 95867
17252 95867 70115 7305 -41364 -50984 -11317 -18058 -26583 12344 16859 7276 13753 -17283 -82146
17239 -82146 -77845 -36906 -30489 -72805 -84037 -108336 -70431 65885 80865 103604 151478 93656
$$ packed form
17325D47404l3111o9134p8126l8818K646k086n2928l1731j0694n270n2782l4696
17313D0674q479P7863k7935k5117j9970K4656L575R289l17k5810l8768j286j289
17300G086K107K1393n7357o3039L4811N8994L1650m1511k3346k5621K6872n530
17288c3491r729P5035K7620O3871Q4701p116K5373L8379K2268k4991j7941q442
17276B35537l4448J3593k9753j8447m7045n9017n63K2357j2664m6001m907J4484
17264C3126O3560J6523l5143P435l7144k7331K839J1165j8286K889P2153M081
17252I5867k5752o2810m8669r620L9667o741q525L8927M515r583O477l1036o4863
17239h2146M301M0939O417m2316j1232k4299L7905J36316J4980K2739M7874n7822
$$ plain form
17227 93656 19285 12486 33730 39338 50861 -1933 -22907 4262 13537 -1633 -16542 -18736
17215 -18736 17506 8034 12160 -14570 34525 56388 7793 -37686 -22696 -34743 -74223 -63547
17203 -63547 -66073 -54688 -88651 -118613 -109844 -54361 -13433 -7861 32005 61435 116889 89192
17191 89192 49688 4014 -48337 -51812 -33636 -55124 -66055 -60369 -47059 -25087 4140 51729
17179 51729 36325 -17628 -16211 -1830 6394 -30434 -41202 -53453 -149603 -143129 -94024 -63500
17167 -63500 -25226 -42764 -74218 -80557 -51070 -16054 -42453 -97150 -140020 -140866 -88613 -79148
17155 -79148 -77846 -74668 -17516 5005 -58688 -36445 -67403 -107247 -75575 -78642 -60810 -34750
17143 -34750 -29365 -7249 3822 35122 27945 3456 -14354 -43964 -87055 -43273 -32146 -67396
$$ packed form
17227I3656p4371o799K1244N608J1523n2794k0974K7169R275j5170j4909k194
17215a8736L6242r472M126k6730M9095K1863m8595m5479J4990j2047l9480J0676
17203f3547k526J1385l3963k9962Q769N5483M0928N572L9866K9430N5454k7697
17191H9192l9504m5674n2351l475J8176k1488j0931N686J3310K1972K9227M7589
17179E1729j5404n3953J417J4381Q224l6828j0768j2251r6150O474M9105L0524
17167f3500L8274j7538l1454o339K9487L5016k6399n4697m2870q46N2253R465
17155g9148J302L178N7152K2521o3693K2243l0958l9844L1672l067J7832K6060
17143c4750N385K2116J1071L1300p177k4489j7810k9610m3091M3782J1127l5250
$$ plain form
17131 -67396 -44256 -4412 -22502 -6929 20753 80759 111345 39037 -46808 -75416 -62030 -44557
17119 -44557 -4175 21172 -39804 -37155 -38277 -64661 -36834 27032 2083 3177 41066 74946
17107 74946 89584 35322 -5715 -3441 35496 18429 -6208 2344 48498 95592 50051 27869
17095 27869 34293 -35453 -71988 -138378 -89194 -33991 -41746 -52330 -7902 -25287 -69972 -56310
17083 -56310 9493 33434 -12662 3250 -46840 -70299 -46841 -52092 808 37405 33042 -3906
17071 -3906 -23918 -6051 6276 6610 -1022 24853 11771 1536 -6331 9985 -18935 -74286 -29022
17058 -29022 464 -29446 -33490 -6444 -54128 -75228 -106863 -70227 -75996 -58091 -10015 -13354
17046 -13354 43537 16610 -67962 -63668 -35470 -6766 -53334 -61548 -30559 -38127 -49786 -22775
$$ packed form
17131f7396K3140L9844j8090J5573K7682O0006L0586p2308q5845k8608J3386J7473
17119d4557M0382K5347o0976K649j122k6384K7827O3866k4949J094L7889L3880
17107G4946J4638n4262m1037K274L8937j7067k4637Q552M6154M7094m5541k2182
17095B7869O424o9746l6535o6390M9184N5203p755j0584M4428j7385m4685J3662
17083e6310O5803K3941m6096J5912n0090k3459K3458n251N2900L6597m363l6948
17071c906k0012J7867J2327L34p632K5875j3082j0235p867J6316k8920n5351M5264
17058b9022K9486k9910m044K7046m7684k1100l1635L6636n769J7905M8076l339
17046a3354N6891k6927q4572M294K8198K8704m6568q214L0989p568j1659K7011
$$ plain form
17034 -22775 30485 34363 -47183 -61144 -46218 -15254 -18968 24007 110461 88556 69668 80810
17022 80810 69724 10521 27866 58187 21305 16063 -25098 -8186 -21535 -6187 -83711 -137949
17010 -137949 -154402 -125155 -126780 -127172 -66016 -37954 -5345 -27113 -57058 -67152 -70206 -85580
16998 -85580 -33969 22624 30413 19518 28264 36879 -21699 -26169 17529 8485 26774 14849 28298
16985 28298 -5052 -17812 -6638 1066 24315 -2659 -47702 -35954 -88330 -64647 -30588 -4475
16973 -4475 -50395 -79432 -47639 -2669 14945 -24823 -41647 -28931 -66573 -37604 -17232 -10411
16961 -10411 -40924 -93245 -101866 -51900 8217 13692 -14547 -64280 -92854 -102617 -87714 -81901
16949 -81901 -98698 -117215 -88783 -37948 54204 132356 78396 57637 44950 69707 15329 33983
$$ packed form
17034b2775N3260L878q1546j3961J4926L0964l714M2975Q6454k1905j8888J1142
17022H0810j1086n9203J7345L0321l6882n242m1161J6912j3349J5348p7524n4238
17010a37949j6453K9247j625l92O1156K8062L2609k1768k9945j0094l054j5374
16998h5580N1611N6593P789j0895Q746Q615n8578m470M3698r044J8289j1925J3449
16985B8298l3350j2760J1174P704K3249k6974m5043J1748n2376K3683L4059K6113
16973d475m5920k9037L1793M4970J7614l9768j6824J2716l7642K8969K0372O821
16961a0411l0513n2321q621M9966O0117N475k8239m9733k8574r763J4903N813
16949h1901j6797j8517K8432N0835R2152P8152n3960k0759j2687K4757n4378J8654
$$ plain form
16937 33983 17929 -19945 -64908 -54170 -62561 -59452 -80239 -83667 -92386 -123765 -165943 -130216
16925 -130216 -135531 -137662 -81765 -78404 -56157 3994 18130 -9187 -17100 -10219 -26304 -76169
16913 -76169 -62865 -44450 -54498 -23556 -29357 -30966 -73855 -117197 -146918 -163410 -155659 -98044
16901 -98044 -112523 -143359 -189744 -120340 -75289 -59247 -43629 -46747 -75973 -80050 -51184 -23754
16889 -23754 -37172 -79265 -71014 -100809 -136762 -111066 -135530 -113254 -115252 -59940 -22685 -25515
16877 -25515 -22380 -38505 29533 63144 71488 14034 -40639 -36104 -104710 -84287 -57506 -15143
16865 -15143 19185 28640 -15835 -65049 -46576 -54905 -57438 -34860 8061 -38818 -118342 -153490
16853 -153490 -120861 -137695 -126439 -130534 -127424 -150564 -119148 -82722 -77045 -80734 -55181 -14784
$$ packed form
16937C3983j6054l7874m4963J0738q391L109k0787l428q719l1379m2178L5727
16925a30216n315k131N5897L361K2247O0151J4136k7317p913O881j6085m9865
16913g6169J3304J8415j0048L0942n801j609m2889m3342k9721j6492P751N7615
16901i8044j4479l0836m6385O9404M5051J6042J5618l118k9226m077K8866K7430
16889b3754j3418m2093Q251k9795l5953K5696k4464K2276j998N5312L7255k830
16877b5515L135j6125O8038L3611Q344n7454n4673M535o8606K0423K6781M2363
16865a5143L4328R455m4475m9214J8473q329k533K2578M2921m6879p9524l5148
16853a53490L2629j6834J1256m095L110k3140L1416L6426N677l689K5553M0397
$$ plain form
16841 -14784 -67516 -97056 -57603 -56088 -42659 -23776 -42262 -31340 -45968 -55768 -81963 -63470
16829 -63470 -10724 -44650 -13151 16284 12792 40342 54520 -21830 -66882 -28031 -29071 -68512
16817 -68512 -98188 -100663 -36578 -61470 -108712 -134321 -161797 -124713 -88132 -61850 -90711 -61215
16805 -61215 -9045 -2088 6200 -17696 -28368 -38874 -56320 -90545 -74538 -90901 -100658 -79549
16793 -79549 -47828 -84722 -50978 -4792 -54616 -56075 -85836 -91826 -57731 -60855 -44251 5529
16781 5529 62767 65906 4160 -20384 -34979 25329 38990 -15866 43774 119801 143016 220871
16769 220871 334144 490232 708004 915430 1011311 961984 932765 919284 987234 1140231
16759 1140231 1126474 1008065 872371 786488 760786 844975 1033986 1222246 1313770 1210881
$$ packed form
16841a4784n2732k9540L9453J515J3429J8883j8486J0922j4628r800k6195J8493
16829f3470N2746l3926L1499K9435l492K7550J4178p6350m5052L8851j040l9441
16817f8512k9676k475O4085k4892m7242k5609k7476L7084L6581K6282k8861K9496
16805f1215N2170O957Q288k3896j0672j0506j7446l4225J6007j6363r757K1109
16793g9549L1721l6894L3744M6186m9824j459k9761n990L4095l124J6604M9780
16781E529N7238L139o1746k4544j4595O0308J3661n4856N9640P6027K3215P7855
16769B20871J13273J56088K17772K07426R5881m9327k9219j3481O7950J52997
16759A140231j3757j18409j35694q5883k5702Q4189J89011J88260R1524j02889
$$ plain form
16749 1210881 1142653 1271275 1555107 1812311 1801449 1521884 1244578 1137077 1161114 1186847
16739 1186847 1202275 1021579 831373 784979 794025 839228 946986 1064389 1077115 918926
16729 918926 828703 885070 956884 960371 797361 547429 366422 302395 224765 154486 142979
16718 142979 113353 73449 123872 168197 85441 13117 -6387 8222 -17339 -3555 15626
16707 15626 31868 89684 100057 98458 96212 103282 32133 -12673 -43590 -56347 -38563 21108
16695 21108 44148 3469 15070 -23298 -42453 -68972 -65401 -6376 35997 58643 41767 25985
16683 25985 64198 84419 66059 8147 -12106 -19039 20656 55093 62824 82400 82266 76329 24149
16670 24149 -6961 17721 37051 57328 17938 4 69220 42743 3179 -7909 -12944 -5711
$$ packed form
16749A210881o8228J28622K83832K57204j0862k79565k77306j07501K4037K5733
16739A186847J5428j80696j90206m6394R046M5203J07758J17403J2726j58189
16729I18926r0223N6367P1814L487j63010k49932j81007o4027p7630p0279j1507
16718A42979k9626l9904N0423M4325q2756p2324j9504J4609k5561J3784J9181
16707A5626J6242N7816J0373j599k246P070p1149m4806l0917j2757J7784N9671
16695B1108K3040m0679J1601l8368j9155k6519L571N9025M2373K2646j6876j5782
16683B5985L8213K0221j8360n7912k0253o933L9695L4437P731J9576j34n937n2180
16670B4149l1110K4682J9330K0277l9390j7934O9216k6477l9564j1088n035P233
$$ plain form
16658 -5711 23016 14065 -17560 -47467 -46338 7440 29309 35278 13313 -17098 14442 4881 -1603
16645 -1603 19160 -7055 -10536 -15795 -49846 -26411 -44333 -87162 -62677 -100291 -91525 -60562
16633 -60562 -38528 -26724 -35577 13372 18815 -13443 -27466 -50636 -60284 -30078 32206 10734
16621 10734 -21782 -89013 -96792 -63259 -56288 -57414 -60932 -7542 53385 58189 60627 54827 44308
16608 44308 -21487 18938 -6816 -35188 -16855 41709 60939 23896 -27518 -48822 -55468 -46484
16596 -46484 -1928 -22666 12077 6125 -33733 -66601 -109778 -83221 -36562 -76224 -117531 -109704
16584 -109704 -102154 -67497 -55288 -104058 -79653 -27414 -21391 -77508 -91419 -44783 -82145 -148153
16572 -148153 -133092 -78164 -43863 -41331 -38140 -48575 -28690 -5973 -34487 -67935 -4422 -14428
$$ packed form
16658e711K8727q951l1625k9907J129N3778K1869N969k1965l0411L1540r561o484
16645a603K0763k6215l481n259l4051K3435j7922m2829K4485l7614Q766L0963
16633f0562K2034J1804q853M8949N443l2258j4023k3170r648L0206O2284k1472
16621A0734l2516o7231p779L3533O971j126l518N3390O0927M804K438n800j0519
16608D4308o5795M0425k5754k8372J8333N8564J9230l7043n1414k1304o646Q984
16596d6484M4556k0738L4743n952l9858l2868m3177K6557M6659l9662m1307P827
16584a09704P550L4657J2209m8770K4405N2239O023n6117j3911M6636l7362o6008
16572a48153J5061N4928L4301K532L191j0435J9885K2717k8514l3448O3513j0006
$$ plain form
16560 -14428 -90117 -116035 -77883 -85762 -163515 -145284 -87950 -65082 -54217 -41055 -53318 -76380
16548 -76380 -113530 -49936 -19924 -365 35931 70116 11554 -81000 -135073 -86616 -21637 -54001
16536 -54001 -85758 -70565 -48572 -28601 -12096 -22485 -71424 -107138 -62997 -99231 -137514 -105293
16524 -105293 -53952 -51722 -97109 -104772 -111415 -98646 -87131 -124307 -146740 -106425 -107819 -115720
16512 -115720 -85749 -59622 -52708 -55714 -95604 -157590 -184787 -121613 -86945 -43987 -38514 -36211
16500 -36211 -22721 -38248 -35296 -24620 30402 34946 20846 31397 27755 8262 37859 1794
16488 1794 -11171 -55704 -31854 -21498 -24801 -34885 -44228 30162 127753 117828 94905 55679
16476 55679 24913 -44446 -44091 -39125 -15888 -49528 -126996 -103233 -14889 44602 76099 57054
$$ packed form
16560a4428p5689k5918L8152p879p7753J8231N7334K2868J0865J3162j2263k3062
16548g6380l7150O3594L0012J9559L6296L4185n8562r2554n4073M8457O4979l2364
16536e4001l1757J5193K1993J9971J6505j0389m8939l5714M4141l6234l8283L2221
16524a05293N1341K230m5387p663o643J2769J1515l7176k2433M0315j394p901
16512a15720K9971K6127O914l006l9890o1986k7197O3174L4668M2958N473K303
16500c6211J3490j5527K952J0676N5022M544j4100J0551l642j9493K9597l6065
16488A794j2965m4533K3850J0356l303j0084r343P4390R7591r925k2923l9226
16476E5679l0766o9359L55M966K3237l3640p7468K3763Q8344N9491L1497j9045
$$ plain form
16464 57054 8455 -40191 -55914 -93067 -61578 -20032 10940 2512 -36120 -46239 -60430 -89172
16452 -89172 -106825 -107176 -139266 -122016 -93278 -65817 -38244 -49750 -68780 -14810 36336 56514
16440 56514 16592 25966 -6965 -16509 -93004 -116396 -196293 -194540 -102210 -88237 -158198 -139126
16428 -139126 -59494 -6983 19087 252 504 -27801 -32776 6212 -13798 -83966 -89420 -13883
16416 -13883 49031 34520 11091 18797 7066 -15480 -48757 -77240 -10054 25317 52559 63594
16404 63594 37681 16409 35942 7689 -57818 -83368 -68772 -39912 12687 8009 72322 93401
16392 93401 38597 9849 6246 -20190 -27045 -70333 -39659 -28741 -49191 -94379 -80599 -25970
16380 -25970 12462 -3305 -51341 -119637 -101872 -42803 997 75128 69804 64421 23936 -41183
$$ packed form
16464E7054m8599m8646j5723l7153L1489M1546L0972q428l8632j0119j4191k8742
16452h9172j7653l51l2090J7250K8738K7461K7573j1506j9030N3970N1146K0178
16440E6514l9922R374l2931r544p6495k3392p9897J753R2330J3973o9961J9072
16428a39126P9632N2511K6070j8835K52k8305m975L8988k0010p0168n454P5537
16416a3883O2914j4511k3429P706j1731k2546l3277k8483O7186L5371K7242J1035
16404F3594k5913k1272J9533k8253o5507k5550J4596K8860N2599m678O4313K1079
16392I3401n4804k8748l603k6436o855m3288L0674J0918k0450m5188J3780N4629
16380b5970L8432j5767m8036o8296J7765N9069M3800P4131n324n383m0485o5119
$$ plain form
16368 -41183 -103114 -154247 -96769 -79578 -93103 -85225 -4383 42627 9195 -34952 -3867 -894
16356 -894 -31169 -36055 -13809 -68 42825 52738 37979 17878 33963 -34573 -84125 -28207
16344 -28207 45232 52387 57146 -1171 30773 52650 25607 58540 9727 -36244 -87626 -102358
16332 -102358 -62010 -30889 50044 24446 -32172 -14864 -22886 -8178 -16226 -38266 3541 -26933
16320 -26933 38465 44649 44845 32186 5463 -10687 -41878 -41450 -58758 -65561 -21942 -21666 -15470
16307 -15470 -38758 -47300 -35727 43061 4958 -56598 -999 34269 40044 -40680 -94830 -51347
16295 -51347 -101181 -113973 -109578 -82730 -25083 -26767 -86283 -68861 -88974 -136329 -165808 -76399
16283 -76399 -2122 -1680 7133 54214 59130 38111 -21108 -72352 -97058 -71558 -82655 -121788
$$ packed form
16368d1183o1931n1133N7478J7191j3525P878Q0842M7010l3432m4147L1085K973
16356h94l0275m886K2246J3741M2893R913j4759k0101J6085o8536m9552N5918
16344b8207P3439P155M759n8317L1944K1877k7043L2933m8813m5971n1382j4732
16332a02358M0348L1121Q0933k5598n6618J7308q022J4708q048k2040M1807l0474
16320b6933O5398O184J96j2659k6723j6150l1191M28j7308o803M3619K76O196
16307a5470k3288q542J1573P8788l8103o1556N5599L5268N775q0724n4150M3483
16295e1347m9834j2792M395K6848N7647j684n9516J7422k0113m7355k9479Q9409
16283g6399P4277M42Q813M7081M916k1019n9219n1244k4706K5500j1097l9133
$$ plain form
16271 -121788 -163690 -103230 -513 16314 18790 27001 26948 22080 -24459 -84572 -110961 -129692
16259 -129692 -102248 -94999 -45852 8687 -13213 -57423 -168365 -189967 -119614 -74752 -95665
16248 -95665 -74667 -56745 -107596 -146864 -177379 -115452 -36067 13954 -55458 -108293 -73933 -54972
16236 -54972 -63284 -50512 33 65879 106913 44383 16078 55802 -4690 -77148 -113227 -26522
16224 -26522 12974 -8404 -36932 -81215 -98445 -1603 37552 30351 14066 2100 12556 26989
16212 26989 -13314 -17052 -24935 -27768 17087 -24905 -56152 -41508 27115 44361 49177 15435
16200 15435 -47645 -92515 -96900 -29861 18694 -27923 -3231 57621 31910 -28842 -55822 -31218
16188 -31218 -65834 -121555 -70078 -60205 -22246 -30991 -3570 40058 13699 -40117 -9722 -51285
$$ packed form
16271a21788m1902O0460J02717J6827K476Q211n3m868m6539o0113k6389j8731
16259a29692K7444P249M9147N4539k1900m4210j10942k1602P0353M4862k0913
16248i5665K0998J7922n0851l9268l0515O1927P9385N0021o9412n2835L4360J8961
16236e4972q312J2772N0545O5846M1034o2530k8305L9724o0492p2458l6079Q6705
16224b6522L9496k1378k8528m4283j7230R6842L9155p201j6285j1966J0456J4433
16212B6989m0303l738p883k833M4855m1992l1247J4644O8623J7246M816l3742
16200A5435o3080m4870m385O7039M8555m6617K4692O0852k5711o0752k6980K4604
16188c1218l4616n5721N1477R873L7959q745K7421M3628k6359n3816L0395m1563
$$ plain form
16176 -51285 -61424 -26670 -3126 -13985 -17789 -44807 -26600 6371 8706 -12288 -30084 -29440
16164 -29440 -31764 -62010 -49595 -23015 755 5260 -37543 -74420 -91526 -82714 -58092 -55422
16152 -55422 -71807 -69066 -45400 -74374 -99499 -101018 -39143 10033 2910 26308 -10792 -74037
16140 -74037 -107464 -68291 -33193 -30748 -24280 -52082 9677 43966 42802 -1736 -30399 -103041
16128 -103041 -72434 39840 24523 -28802 -48021 -45816 -73134 -97622 -69199 -33420 -72576
16117 -72576 -59280 2694 45015 31153 48243 50426 -5091 -37767 -54643 -32984 -60258 -65810
16105 -65810 -79098 -75987 -43310 -74365 -99759 -62821 -35258 -48098 -43453 42905 77081 70104
16093 70104 24597 67527 65077 -15304 -35634 -29061 -6331 75682 70464 107500 118337 47581
$$ packed form
16176e1285j0139L4754K3544j0859l804k7018J8207L2971K335k0994j7796O44
16164b9440k324l0246J2415K6580K3770M505m2803l6877j7106Q812K4622K670
16152e5422j6385K741K3666k8974k5125j519O1875M9176p123K3398l7100o3245
16140g4037l3427L9173L5098K445O468k7802O1759L4289j164m4538k8663p2642
16128a03041L0607J12274j5317n3325j9219K205k7318k4488K8423L5779l9156
16117g2576J3296O1974M2321j3862J7090K183n5517l2676j6876K1659k7274n552
16105f5810j3288L111L2677l1055k5394L6938K7563j2840M645Q6358L4176o977
16093G0104m5507M2930k450q0381k0330O573K2730Q2013n218L7036J0837p0756
$$ plain form
16081 47581 86383 99120 84907 35956 -16031 20882 60175 36284 -8803 -453 16652 75975
16069 75975 43420 9177 4045 -18785 2852 -41135 -32467 -71386 -76609 -116419 -136210 -112675
16057 -112675 -66052 -55647 -62198 -95965 -91336 -84350 -67631 -50125 15554 65393 46771 9144
16045 9144 8743 33863 49802 8798 -7355 49163 -36819 -41348 -59361 -121103 -99363 -107199 -116519
16032 -116519 -60572 -83192 -114792 -111908 -77081 38987 46170 22679 19939 -21996 -9315 13131
16020 13131 3596 -67757 -176100 -225098 -176962 -130198 -150846 -98292 -27253 -49805 -127727 -107909
16008 -107909 -54548 -63089 -117597 -111315 -110495 -144548 -168381 -93987 -14914 -15686 -50090 -63456 -67534
15995 -67534 -75430 -80871 -55964 -47396 -96257 -151313 -181341 -171765 -113455 -118507 -88720 -56705 -63640
$$ packed form
16081D7581L8802J2737j4213m8951n1987L6913L9293k3891m5087Q350J7105N9323
16069G5975l2555l4243n132k2830K1637m3987Q668l8919n223l9810j9791K3535
16057a12675M6623J0405o551l3767M629O986J6719J7506O5679M9839j8622l7627
16045I144m01K5120J5939m1004j6153N6518q5982m529j8013o1742K1740p836r320
16032a16519N5947k2620l1600K884L4827J16068P183k3491k740m1935J2681K2446
16020A3131r535p1353j08343m8998M8136M6764k0648N2554P1039k2552p7922J9818
16008a07909N3361q541n4508O282Q20l4053k3833P4394P9073p72l4404j3366m078
15995f7534p896n441K4907Q568m8861n5056l0028R576N8310n052K9787L2015o935
$$ plain form
15982 -63640 -51292 -38041 -19877 26462 -13303 -53144 -2037 27363 3467 -24679 16932 61532
15970 61532 19512 22918 -24678 -20150 12395 28325 -27197 -63873 -40437 -32355 -23717 -63993
15958 -63993 -123319 -105511 -69285 -53509 -49981 2526 26563 -9893 2969 53350 105348 79308
15946 79308 14857 -22612 12042 22777 -6090 -3227 -4574 -78305 -114689 -88152 -120046 -90071
15934 -90071 -78502 -103580 -127389 -92835 -75179 -92398 -61105 489 3775 42262 32006 -13960
15922 -13960 -54924 -54975 -49500 -41910 -40467 -46510 -46017 -6750 -38450 -66897 -21192 -21768 -19936 -38102
15908 -38102 -69509 -37397 -17647 -1715 18749 47515 52745 34112 15659 29140 60119 124449
15896 124449 91761 22319 -21525 463 -11073 -52870 -73928 -64765 -2787 35573 50530 51391
$$ packed form
15982f3640J2348J3251J8164M6339l9765l9841N1107K9400k3896k8146M1611M4600
15970F1532m2020L406m7596M528L2545J5930n5522l6676K3436Q082Q638m0276
15958f3993n9326J7808L6226J5776L528N2507K4037l6456J2862N0381N1998k6040
15946G9308o4451l7469L4654J0735k8867K863j347p3731l6384K6537l1894K9975
15934i0071J1569k5078k3809L4554J7656j7219L1293O1594L286L8487j0256m5966
15922a3960m0964n1N475P590J443o043M93L9267l1700k8447M5705n76J832j8166
15908c8102l1407L2112J9750J5932K0464K8766N230j8633j8453J3481L0979O4330
15896A24449l2688o9442m3844K1988j1536m1797k1058R163O1978L8360J4957Q61
$$ plain form
15884 51391 16956 -30639 -99813 -93392 -76135 -63561 -1100 6223 -6553 -41921 -51479 -25888
15872 -25888 -68420 -71426 -42036 -72010 -133240 -131719 -69499 -10578 -10531 -35078 -68889 -74633 -16092
15859 -16092 -29540 -32214 -3707 -3986 -23887 1156 37290 18029 -81011 -133780 -92380 -111251
15847 -111251 -81581 -77337 -81628 -72167 -64235 -38776 -41991 -93130 -109609 -151037 -95825 -114040
15835 -114040 -126250 -95704 -103825 -45293 -23228 6604 17749 37913 60574 19554 -12628 -20276
15823 -20276 38909 17634 41262 6196 29189 12391 41431 38533 26127 -8990 -49123 -75221
15811 -75221 -58995 6364 -26640 -86866 -96395 -23039 -54437 -42460 -65561 -56241 -42812 16956
15799 16956 4695 -37175 30050 2330 -25536 -50749 -57535 -94542 -138057 -150721 -184409 -179545
$$ packed form
15884E1391l4435m7595o9174O421J7257J2574O2461P323j2776l5368r558K5591
15872b5888m2532l006K9390k9974o1230J521O2220N8921M7k4547l3811n744N8541
15859a6092j3448k674K8507k79j9901K5043L6134j9261r9040n2769M1400j8871
15847a11251K9670M244m291R461P932K5459l215n1139j6479m1428N5212j8215
15835a14040j2210L0546q121N8532K2065K9832J1145K0164K2661m1020l2182p648
15823b0276N9185k1275K3628l5066K2993j6798K9040k898j2406l5117m0133k6098
15811g5221J6226O5359l3004o0226r529P3356l1398J1977k3101R320J3429N9768
15799A6956j2261m1870O7225k7720k7866k5213o786l7007m3515j2664l3688M864
$$ plain form
15787 -179545 -110685 -84865 -62942 10915 30772 -31679 -17058 12052 31416 -12467 -35184
15776 -35184 -47105 -13551 -28315 -26326 -49100 -67158 -43668 -21966 -42996 -83883 -95934 -54872
15764 -54872 -80585 -144185 -78003 -34729 -29086 -30477 -29220 -38462 74 28769 10746 -4968
15752 -4968 11912 -8293 29796 113922 169270 155842 50199 2805 -16821 -50971 -56551 -34051
15740 -34051 -20111 -7887 -39311 -47191 -33043 -2988 -14536 -81610 -16876 43603 51079 34734
15728 34734 10531 22684 8919 -23977 -28034 -34199 -28686 -15523 14746 36656 51966 -3215
15716 -3215 -23262 -17260 27322 58445 74942 80495 66172 39723 -19813 -48944 -37781 -31505
15704 -31505 -16112 -17246 -6898 4830 -18124 -39163 -17918 -38332 -71871 -69808 -85329 -79911
$$ packed form
15787a79545O8860K5820K1923P3857J9857o2451J4621K9110J9364m3883k2717
15776c5184j1921L3554j4764J989k2774j8058K3490K1702k1030m0887j2051M1062
15764e4872k5713o3600O6182M3274N643j391J257r242L8536K8695j8023j5714
15752d968J6880k0205L8089Q4126N5348j3428j05643m7394j9626l4150n580K2500
15740c4051J3940J2224l1424p880J4148L0055j1548o7074O4734O0479P476j6345
15728C4734k4203J2153j3765l2896m057o165N513J3163L0269K1910J5310n5181
15716c215k0047O002M4582L1123J6497N553j4323k6449n9536k9131J1163O276
15704c1505J5393j134J0348J1728k2954k1039K1245k0414l3539K063j5521N418
$$ plain form
15692 -79911 -81601 -60236 -61044 -48510 -6919 -7507 -11329 -15890 -1444 50120 85208 68179 31714
15679 31714 12437 10366 41737 61588 85017 91576 62479 24520 32209 67067 62374 68325 33166
15666 33166 -42906 -66220 -61626 -48539 -78888 -42391 7027 -1272 -10425 -9702 53270 54173 38553
15653 38553 -5710 -3402 -6754 37130 41052 44010 70020 49862 577 -6078 -14245 -61240 -50604
15640 -50604 -58280 -5029 25640 41048 60161 50943 32005 19054 39307 2281 -52306 -97291
15628 -97291 -96540 -69893 7567 -46948 -33199 -50923 -28233 -75728 -94102 -76175 -73162 -68485
15616 -68485 -26989 28352 24569 -24130 -73116 -69288 -69532 -37260 -16517 -34730 15206 22732 -7535
15603 -7535 -26868 48577 26590 -11968 -2810 4178 -16791 -29172 -5019 -4692 -11620 -62363 -77459
$$ packed form
15692g9911j690K1365q08J2534M1591n88l822m561J4446N1564L5088j7029l6465
15679C1714j9277k071L1371J9851K3429O559k9097l7959P689L4858m693N951l5159
15666C3166p6072k3314M594J3087l0349L6497M9418q299r153P23O2972R03j5620
15653C8553m4263K308l352M3884L922K958K6010k0158m9285o655q167m6995J0636
15640e0604p676N3251L0669J5408J9113r218j8938j2951K0253l7026n4587m4985
15628i7291P51K6647P7460n4515J3749j7724K2690m7495j8374J7927L013M677
15616f8485M1496N5341l783m8699m8986L828k44L2272K0743j8213M9936P526l0267
15603g535j9333P5445k1987l8558R158O988k0969j2381K4153L27o928n0743j5096
$$ plain form
15590 -77459 -8893 6128 -1196 -3429 -31851 955 33193 15237 47650 65442 68104 77221
15578 77221 40456 1664 -31036 -85516 -172732 -139209 -78125 -72766 -46880 -23847 32737 52449
15566 52449 17043 15917 8179 16892 -34878 -42857 -21197 30858 73560 61996 49466 54001 64495
15553 64495 60876 20227 14921 52339 45739 -14569 -51980 -64884 -49207 -91722 -111050 -92942
15541 -92942 -49578 6886 -17230 -17791 -54484 -115651 -145687 -89492 -53498 -48548 -26668 -22229
15529 -22229 -7536 19251 37630 516 -40853 -77914 -65152 -61289 -18632 -11425 -43319 22310
15517 22310 43845 25794 -47983 -59412 -32182 -21555 88168 132666 143109 132299 73993
15506 73993 54647 28562 14509 39459 46226 34332 26384 4583 9058 -28726 -22624 -12510
$$ packed form
15590g7459O8566J5021p324k233k8422L2806L2238j7956L2413J7792K662R117
15578G7221l6765l8792l2700n4480q7216L3523O1084N359K5886K3033N6584J9712
15566E2449l5406j126p738Q713n1770p979K1660N2055M2702j1564j2530M535J0494
15553F4495l619m0649n306L7418o600o0308l7411j2904J5677m2515j9328J8108
15541i2942M3364N6464k4116n61l6693o1167l0036N6195L5994M950K1880M439
15529b2229J4693K6787J8379l7114m1369l7061J2762L863M2657P207l1894O5629
15517B2310K1535j8051p3777j1429K7230J0627J09723M4498J0443j0810n8306
15506G3993j9346k6085j4053K4950O767j1894p948k1801M475l7784O102J0114
$$ plain form
15494 -12510 34211 33938 16124 54250 69088 68451 73673 63179 11052 44007 17566 -11011 25666
15481 25666 59537 84534 62693 621 -8692 25314 48991 102674 88498 20507 -4934 21456
15469 21456 79668 105915 184916 196749 184123 216725 190253 183412 177477 159025 146722 114711
15457 114711 150631 134968 107231 53616 47145 9823 7684 19458 59838 43125 38064 28450
15445 28450 72880 119254 137100 157951 95373 59533 51339 27841 38742 61070 56577 63057
15433 63057 89318 105585 80041 78142 38313 23718 86835 113003 85523 40377 -20998 -17583
15421 -17583 -37260 -16688 33691 11779 17954 45152 26123 28828 85125 94698 81194 25692
15409 25692 21659 8048 2699 -35065 -36277 -22826 48169 44712 43035 30698 20214 27353 -9179
$$ packed form
15494a2510M6721k73j7814L8126J4838o37N222j0494n2127L2955k6441k8577L6677
15481B5666L3871K4997k1841o2072r313L4006K3677N3683j4176o7991k5441K6390
15469B1456N8212K6247P9001J1833j2626L2602k6472o841n935j8452j2303l2011
15457A14711L5920j5663k7737n3615o471l7322k139J1774M0380j6713n061r614
15445B8450M4430M6374J7846K0851o2578l5840q194k3498J0901K2328m493O480
15433F3057K6261J6267k5544j899l9829j4595O3117K6168k7480m5146o1375L415
15421a7583j9677K0572N0379k1912O175K7198j9029K705N6297R573j3504n5502
15409B5692m033j3611n349l7764j212J3451P0995l457j677j2337j0484P139l6532
$$ plain form
15396 -9179 -16441 -9459 -22368 -24763 -13148 -52790 -113028 -70663 4548 9897 -13809 -80037 -56412
15383 -56412 -19044 -42798 -33827 -30210 -21329 -17031 -53876 -65126 -61978 -27693 -56088 -101291 -71637
15370 -71637 -75266 -118414 -72227 -5735 67384 77682 78119 101197 44590 -21740 -43690 -80951
15358 -80951 -84147 -11599 53568 61242 16530 11829 75417 55093 50979 -38539 -123944 -125734 -111360
15345 -111360 -73348 -27762 13699 16688 21739 17823 -13045 -66620 -56007 -46761 -17503 12258
15333 12258 4468 90 32146 -11303 -81971 -51610 -496 -1590 -28832 -59321 -64020 -95479
15321 -95479 -77007 -32819 -20576 -38671 -47546 11859 60018 28659 22764 32842 -33543 -74403
15309 -74403 -66450 -37034 -7742 -32727 -52933 -104756 -90492 -71691 -86740 -65573 -2077 48848
$$ packed form
15396i179p262O982j2909k395J1615l9642o0238M2365P5211N349k3706o6228K3625
15383e6412L7368k3754Q971L617Q881M298l6845j1250L148L4285k8395m5203K9654
15370g1637l629m3148M6187O6492P3119J0298M37K3078n6607o6330k1950l7261
15358h0951l196P2548O5167P674m4712m701O3588k0324m114q9518q5405j790J4374
15345a11360L8012M5586M1461K989N051l916l0868n3575J0613R246K9258K9761
15333A2258p790m378L2056m3449p0668L0361N1114j094k7242l0489m699l1459
15321i5479J8472M4188J2243j8095q875N9405M8159l1359n895J0078o6385m0860
15309g4403P953K9416K9292k4985k0206n1823J4264J8801j5049K1167O3496N0925
$$ plain form
15297 48848 28434 13615 3979 25730 23740 8825 -41982 -19595 -11586 -5545 48872 43542 75129
15284 75129 44118 22762 14546 -33837 -77871 -92352 -59666 -104473 -121223 -65456 -19065 -35345
15272 -35345 -71300 -74820 -85367 -29924 16328 24900 64794 93291 87407 12904 -19187 13887
15260 13887 -1894 -14046 13428 39321 60836 75382 49445 -14759 727 16089 9735 63516
15248 63516 69249 5407 -51487 -52874 -14308 22764 113806 143498 68365 36839 75793 83181
15236 83181 83066 76813 65888 29301 -26370 -65851 -55300 -31362 -25970 -764 65693 31990
15224 31990 56180 80124 88225 98346 46118 55984 35458 56674 2827 -20438 3248 6474
15212 6474 23866 25454 -18427 -28539 -30270 -13214 -1976 14623 14342 16723 48108 38371 -13179
$$ packed form
15297D8848k0414j4819r636K1751j990j4915n0807K2387Q009O041N4417n330L1587
15284G5129l1011k1356q216m8383m4034j4481L2686m4807j6750N5767M6391j6280
15272c5345l5955l520j0547N5443M6252Q572L9894K8497n884p4503l2091L3074
15260A3887j5781j2152K7474K5893K1515J4546k5937o4204J5486J5362o354N3781
15248F3516N733o3842n6894j387L8566L7072R1042K9692p5133l1526L8954P388
15236H3181j15o253j0925l6587n5671l9481J0551K3938N392K5206O6457l3703
15224C1990K4190K3944Q101J0121n2228R866k0526K1216n3847k3265K3686L226
15212F474J7392J588m3881j0112j731J7056J1238J6599k81K381L1385r737n1550
$$ plain form
15199 -13179 -5113 31155 10634 -43778 -74609 -54551 -32490 -19217 -7597 29778 44545 40836
15187 40836 43283 61236 85250 84622 99081 141229 88818 630 -15309 28671 37571 -2258
15175 -2258 -34845 -50827 -67642 -19147 66928 74444 64549 113562 124409 40831 34537 19537
15163 19537 52510 27781 17693 49872 22928 21884 -4852 30075 41873 32399 15316 24761
15151 24761 61885 30059 27639 85978 78661 83361 52000 27561 -17870 -30437 -49953 -91540
15139 -91540 -92228 -30981 -9640 -9745 -7544 31391 14190 51607 64885 -3569 -29037 -38679 -12944
15126 -12944 -34599 40332 140694 91521 56443 99336 85300 24417 -7086 44507 110960
15115 110960 111657 17360 4313 42601 67800 53967 56740 29535 -19108 -19541 -73339 -120247
$$ packed form
15199a3179Q066L6268k0521n4412l0831K0058K2061J3273J1620L7375J4767l709
15187D0836K447J7953K4014o28J4459M2148n2411q8188j5939M3980Q900l9829
15175b258l2587j5982j6815M8495Q6075P516r895M9013J0847q3578o294j5000
15163A9537L2973k4729j0088L2179k6944j044k6736L4927J1798r474j7083R445
15151B4761L7124l1826k420N8339p317M700l1361k4439m5431j2567j9516m1587
15139i1540o88O1247K1341j05K201L8935j7201L7417J3278o8454k5468r642K5735
15126a2944k1655P4931J00362m9173l5078M2893j4036o0883l1503N1593O6453
15115A10960O97r4297j3047L8288K5199j3833K773k7205m8643m33n3798m6908
$$ plain form
15103 -120247 -82427 -45232 29144 76425 57229 -51639 -101048 -39463 -885 -16603 523
15092 523 34620 36856 79751 50197 28820 41362 95578 160999 140580 11905 -29391 -45617
15080 -45617 -13142 -40988 -43581 41900 51006 -23328 -13125 -9331 -12190 -5764 31024 55256 27777
15067 27777 15311 19712 15095 9019 -25113 21704 2231 -41744 -29961 -5291 -8594 -37595
15055 -37595 -6331 15620 3809 8017 13164 2679 -21628 17121 32677 -27177 -9509 -17299
15043 -17299 -23543 26409 64535 86060 60934 48051 28534 67080 57205 25427 -6088 -19034
15031 -19034 34399 -4888 -6382 -41781 -78026 -34041 60781 106015 132850 69358 59898 62528
15019 62528 73476 71269 51087 45792 53335 59031 62977 41391 46949 26697 72224 81511 70267
$$ packed form
15103a20247L7820L7195P4376M7281j9196j08868m9409O1585L8578j5718J7126
15092E23L4097K236M2895k9554k1377J2542N4216O5421k0419j28675m1296j6226
15080d5617L2475k7846k593Q5481R106p4334J0203L794k859O426L6788K4232k7479
15067B7777j2466M401m617o076l4132M6817j9473m3975J1783K4670l303k9001
15055c7595L1264K1951j1811M208N147j0485k4307L8749J5556n9854J7668p790
15043a7299o244M9952L8126K1525k5126j2883j9517L8546r875l1778l1515j2946
15031a9034N3433l9287j494l5399l6245M3985R4822M5234K6835o3492r460K630
15019F2528J0948k207k0182n295P543N696L946k1586N558k0252M5527R287j1244
$$ plain form
15006 70267 53498 12542 25363 48769 5591 -26035 -26672 -21471 -22658 -50498 -16491 41446
14994 41446 19558 9 4610 -19110 -37984 -87423 -108363 -47913 -21278 -6631 45292 62782
14982 62782 37770 46785 84588 81368 136029 181064 146388 95228 78798 74952 112333 70773
14970 70773 48877 11304 8856 4898 38682 43938 98071 83498 56918 21713 20689 20228 53376
14957 53376 52767 22874 23069 43388 66544 87000 22669 -4247 -29263 -37275 -82321 -28392 53645
14944 53645 73599 9467 -15559 3580 17405 -889 -9252 -12350 -9474 -38768 -8180 39815
14932 39815 92244 78127 99697 57813 10631 -5855 -14074 32009 63780 39038 34944 -19744
14920 -19744 -22576 20050 -7808 25756 61070 27614 29809 30324 11118 28408 16923 -61139
$$ packed form
15006G0267j6769m0956J2821K3406m3178l1626o37N201j187k7840L4007N7937
14994D1446k1888j9549M601k3720j8874m9439k0940O0450K6635J4647N1923J7490
14982F2782k5012R015L7803l220N4661M5035l4676n1160j6430l846L7381m1560
14970G0773k1896l7573k448l958L3784N256N4133j4573k6580l5205j024m61L3148
14957E3376o09k9893J95K0319K3156K0456o4331k6916k5016q012m5046N3929Q2037
14944E3645J9954o4132k5026J9139J3825j8294q363l098K876k9294L0588M7995
14932C9815N2429j4117K1570m1884m7182j6486q219M6083L1771k4742m094n4688
14920a9744k832M2626k7858L3564L5314l3456K195N15j9206J7290j1485p8062
$$ plain form
14908 -61139 -37880 -12268 1768 33347 65808 32662 63886 131957 87875 57819 28830 16174
14896 16174 62681 75359 116139 85508 46221 75489 142270 116012 58084 63208 95907 83222
14884 83222 99604 97397 80975 80999 46239 54517 56710 62070 53155 111465 85918 58335 12696
14871 12696 29154 85940 98822 139357 146740 145326 136300 69414 41819 7243 8834 34182
14859 34182 102329 137710 144808 133446 124164 112128 77256 101296 142584 80927 20389 24446
14847 24446 40530 4771 11399 50920 40027 -14 -77537 -28510 57786 85247 113978 157537
14835 157537 80462 84007 123454 87298 86894 139845 114289 78246 72748 68526 37566 16546
14823 16546 49359 34558 28981 61575 54829 32316 13329 -15071 -20548 4626 25114 34845
$$ packed form
14908f1139K3259K5612J4036L1579L2461l3146L1224O8071m4082l0056k8989j2656
14896A6174M6507J2678M0780l0631l9287K9268O6781k6258n7928N124L2699j2685
14884H3222J6382k207j6422K4l4760Q278K193N360q915N8310k5547k7583m5639
14871A2696J6458N6786J2882M0535P383j414r026o6886k7595l4576J591K5348
14859C4182O8147L5381P098j1362r282j2036l4872K4040M1288o1657o0538M057
14847B4446J6084l5759O628L9521j0893m0041p7523M9027Q6296K7461K8731M3559
14835A57537p7075L545L9447l6156m04N2951k5556l6043n498m222l0960k1020
14823A6546L2813j4801n577L2594o746k2513j8987k8400n477K5174K0488R731
$$ plain form
14811 34845 26688 -2366 -14276 13741 27835 31229 23646 13240 46672 16405 63643 109510
14799 109510 88770 46187 4352 304 6278 20475 9271 20996 60192 98859 182559 218044
14787 218044 135317 23305 -19836 -19369 1179 21440 21317 558 56209 152609 167517 99805
14775 99805 35649 23678 85857 124409 54541 79765 134503 110358 31652 -21082 -81882 -61157
14763 -61157 -294 66445 52808 92541 104275 63317 -19083 26397 119008 91080 93788 106420
14751 106420 109804 102533 107866 122768 82149 28113 31602 60674 14601 19627 34977 36160 -29253
14738 -29253 -48734 -19318 6744 47132 46962 5134 -23392 -55314 -65591 -49967 -54707 -71678
14726 -71678 -56726 -19032 10950 2124 -16673 13739 37069 40210 29405 53642 18337 -9112
$$ packed form
14811C4845q157k9054j1910K8017J4094L394p583j0406L3432l0267M7238M5867
14799A09510k0740m2583m1835m048N974J4197j1204J1725L9196L8667Q3700L5485
14787B18044q2727j12012m3141M67K0548K0261j23k0759N5651R6400J4908o7712
14775I9805o4156j1971O2179L8552o9868K5224N4738k4145p8706n2734o0800K0725
14763f1157O0863O6739j3637L9733J1734m0958q2400M5480R2611k7928K708J2632
14751A06420L384p271N333J4902m0619n4036L489K9072m6073N026J5350J183o5413
14738b9253j9481K9416K6062M0388j70m1828k8526l1922j0277J5624m740j6971
14726g1678J4952L7694K9982q826j8797L0412K3330L141j0805K4237l5305k7449
$$ plain form
14714 -9112 7565 -19495 17765 71602 52266 88422 88852 86759 109132 153386 127436 79817
14702 79817 55748 66712 62347 -15176 -2418 62560 64513 51806 65660 81889 93695 46890
14690 46890 13434 -17896 52621 77431 73926 58724 41169 46235 92380 122665 128248 162983
14678 162983 171829 134530 74465 87217 81169 74542 94006 67714 15448 11925 -27603 -68274
14666 -68274 -69523 -27675 17039 14265 22627 43888 56881 68305 30382 -4497 12061 51578
14654 51578 71065 57510 -6362 -49096 -13781 27334 24939 -1215 610 28495 21356 25112
14642 25112 19110 44697 109336 116944 61933 86360 79731 61796 59755 57633 41656 -20899 -62054
14629 -62054 -31444 33568 17231 59969 87281 44805 12805 43487 22495 34763 34122 50250
$$ packed form
14714i112J6677k7060L7260N3837j9336L6156M30k093K2373M4254k5950m7619
14702G9817k4069J0964m365p7523J2758O4978J953j2707J3854J6229J1806m6805
14690D6890l3456l1330P0517K4810l505j5202j7555N066M6145L0285N583L4735
14678A62983Q846l7299o0065J2752o048o627J9464k6292n2266l523l9528m0671
14666f8274j249M1848M4714k774Q362K1261J2993J1424l7923l4879J6558L9517
14654E1578J9487j3555o3872m2734L5315M1115k395k6154J825K7885p139L756
14642B5112o002K5587O4639P608n5011K4427o629j7935k041k122j5977o2555m1155
14629f2054L0610O5012j6337M2738K7312m2476l2000L0682k0992J2268o41J6128
$$ plain form
14617 50250 49991 -39580 -57251 -11931 21382 68710 39007 43067 69746 115562 74111 49143
14605 49143 46910 37257 48896 50252 20945 17420 8211 7189 17563 42862 40866 28876 87622
14592 87622 50131 -12211 6602 13389 -16773 -51504 -15518 34305 6985 -23999 -59321 -65905
14580 -65905 -88128 -30435 -74759 -105799 -83485 -31674 34424 46203 31838 23974 -1569 35765
14568 35765 64713 83485 24197 12871 69418 116640 160647 153252 85503 66220 55847 138789
14556 138789 188550 146070 90987 1108 -28057 -61282 -33192 67402 25169 -101645 -91613
14545 -91613 -91927 -74836 -41104 -36023 -56764 -47136 -20253 -19734 2739 45321 41647 62664 89789
14532 89789 127868 115190 53462 4159 -9472 11101 101176 173887 171974 143416 86271 81766
$$ packed form
14617E0250k59q9571j7671M5320L3313M7328k9703M060K6679M5816m1451k4968
14605D9143k233r653J1639J356k9307l525r209j022J0374K5299j996j1990N8746
14592H7622l7491o2342J8813O787l0162l4731L5986M9823k7320l0984l5322o584
14580f5905k2223N7693m4324l1040K2314N1811O6098J1779j4365p864k5543L7334
14568C5765K8948J8772n9288j1326N6547M7222M4007p395o7749j9283j0373Q2942
14556A38789M9761m2480n5083q9879k9165l3225K8090J00594m2233j26814J0032
14545i1613l14J7091L3732N081k0741R628K6883N19K2473M2582l674K1017K7125
14532H9789L8079j2678o1728m9303j3631K0573R0075P2711j913k8558n7145m505
$$ plain form
14520 81766 57406 97713 129039 87198 57474 63059 109208 77225 103412 119133 28004 34396
14508 34396 90878 91475 39445 24047 54237 74608 66794 47075 43141 46301 -13577 -63902 -5053
14495 -5053 43244 58117 76694 60598 57650 63745 69113 87724 121510 116366 74681 29134 94353
14482 94353 147353 166338 162232 118736 100322 -6411 -24670 13371 -8919 2757 66276 78233
14470 78233 75567 119036 149872 135147 101484 64842 51088 98908 93757 95458 116629 123183
14458 123183 132561 23595 -9196 39946 70229 48337 20669 -24679 -39695 -19989 26196
14447 26196 33717 46710 32771 -23635 -39653 -9542 65002 44422 92726 121867 65059 59504
14435 59504 73934 10237 8895 106390 182685 182290 161123 124830 79996 103954 125169 83273
$$ packed form
14520H1766k4360M0307L1326m1841k9724N585M6149l1983K6187J5721r1129O392
14508C4396N6482N97n2030j5398L0190K0371p814j9719l934L160n9878n0325N8849
14495e053M8297J4873J8577j6096k948O095N368J8611L3786n144m1685m5547O5219
14482I4353N3000J8985m106m3496j8414j06733j8259L8041k2290J1676O3519J1957
14470G8233k666M3469L0836j4725l3663l6642j3754M7820n151J701K1171O554
14458A23183R378j08966l2791M9142L0283k1892k7668m5348j5016J9706M6185
14447B6196P521J2993j3939n6406j6018L0111P4544k0580M8304K9141n6808n555
14435E9504J4430o3697j342R7495P6295l95k1167l6293m4834K3958K1215m1896
$$ plain form
14423 83273 71450 98624 108209 82710 47546 91909 129343 134427 134032 114020 132439 128110 108561
14410 108561 76194 65122 77605 68102 66715 49440 27383 24285 51297 71172 57563 20156
14398 20156 30019 70763 73645 32352 20254 15514 75560 151037 199555 129248 97401 56306
14386 56306 38201 36162 43652 45441 52404 95798 64205 15564 29514 36036 16176 82477 104064
14373 104064 108752 136818 175599 142818 95953 125798 111866 74015 81140 71735 146847 225215
14361 225215 174164 114240 57570 88074 105584 78200 84278 104038 143969 153950 117544 88332
14349 88332 99799 130097 78589 40929 75974 60074 64874 85339 66533 47794 68464 37764
14337 37764 64429 106344 102293 59199 82046 122474 137965 118284 94028 93280 77293 113767
$$ packed form
14423H3273j1823K7174R585k5499l5164M4363L7434N084l95k0012J8419m329j9549
14410A08561l2367j1072J2483r503j387j7275k2057l098K7012J9875j3609l7407
14398B0156R863M0744K882m1293j2098m740O0046P5477M8518p0307l1847m1095
14386E6306j8105k039P490J789O963M3394l1593m8641J3950O522j9860O6301K1587
14373A04064M688K8066L8781l2781m6865K9845j3932l7851P125r405P5112P8368
14361B25215n1051n9924n6670L0504J7510k7384O078J9760L9931R981l6406k9212
14349H8332J1467L0298n1508l7660L5045j5900M800K0465j8806j8739K0670l0700
14337C7764K6665M1915m051m3094K2847M0428J5491j9681k4256p48j5987L6474
$$ plain form
14325 113767 108169 30933 29647 117845 156619 119957 85422 101757 81328 63967 70088 113802
14313 113802 119987 168629 184970 156770 129569 116560 197646 238344 215932 191561 148738 167032
14301 167032 182737 126122 59729 16410 7067 75141 118533 113244 118853 103515 48926 10099
14289 10099 -6485 17749 972 -18696 -19506 34825 68747 90450 95238 141833 207911 221488
14277 221488 182835 150734 93549 96382 137786 160990 119925 132464 163581 179906 120248 96187
14265 96187 104734 97060 91152 100218 130364 151739 163703 143657 129420 173622 233328 188253
14253 188253 105145 107087 121239 125847 174303 229266 223450 189988 145791 124696 102358 106420
14241 106420 116548 141652 114046 70860 72869 73151 62019 41771 81481 105261 85877 72655
$$ packed form
14325A13767n598p7236j286Q8198L8774l6662l4535J6335k0429j7361O121M3714
14313A13802O185M8642J6341k8200k7201j3009Q1086M0698k2412k4371m2823J8294
14301A67032J5705n6615o6393m3319r343O8074M3392n289N609j5338n4589l8827
14289A0099j6584K4234j6777j9668q10N4331L3922K1703M788M6595O6078J3577
14277B21488l8653l2101n7185K833M1404K3204m1065J2539L1117J6325n9658k4061
14265I6187Q547p674n908R066L0146K1375J1964k0046j4237M4202N9706m5075
14253A88253q3108J942J4152M608M8456N4963n816l3462m4197k1095k2338M062
14241A06420J0128K5104k7606m3186K009K82j1132k0248L9710K3780j9384j3222
$$ plain form
14229 72655 63378 99537 135112 149235 191316 175069 140528 157566 136240 100809 84883 74593
14217 74593 38493 16247 19535 9524 1329 -31713 23001 60810 145140 192061 171721 149503
14205 149503 129819 111695 98130 64606 48335 25816 7208 40729 40929 72872 93623 63277
14193 63277 11641 23832 17458 41344 17269 30299 78678 96836 134654 135310 123448 142768
14181 142768 145959 163783 169369 155083 196051 205398 167208 141229 95222 74197 59549 37029
14169 37029 44990 95908 75870 63685 73877 78776 32116 40889 83554 38989 23799 63647
14157 63647 101755 73102 57896 104061 118556 119781 114433 164615 147899 83029 130515 112988
14145 112988 44457 33370 52259 72220 87515 77365 84663 98047 85689 74504 93434 78727
$$ packed form
14229G2655r277L6159L5575J4123M2081j6247l4541J7038k1326l5431j5926j0290
14217G4593l6100k2246L288j0011q195l3042N4714L7809Q4330M6921k0340k2218
14205A49503j9684j8124j3565l3524j6271k2519j8608L3521K00L1943K0751l0346
14193F3277n1636J2191o374K3886k4075J3030M8379J8158L7818O56j1862J9320
14181A42768L191J7824N586j4286M0968R347l8190k5979m6007k1025j4648k2520
14169C7029P961N0918k0038j2185J0192M899m6660Q773M2665m4565j5190L9848
14157F3647L8108k8653j5206M6165J4495J225n348N0182j6716o4870M7486j7527
14145A12988o8531j1087J8889J9961J5295j0150P298J3384j2358j1185J8930j4707
$$ plain form
14133 78727 114266 114641 99347 82195 82501 96236 140563 184234 164376 122276 63880 45391
14121 45391 137385 196726 154086 180423 153833 157312 143128 178595 269904 232026 200093 153579
14109 153579 146998 104661 77742 122527 201428 196662 182024 172691 164514 112606 93290 66384
14097 66384 53524 59038 52639 23067 50748 92131 41792 30531 51548 64529 118662 65364
14085 65364 47319 64919 38306 50760 65912 105410 145240 129647 130969 163115 179427 180314
14073 180314 100572 53228 24735 45016 109622 146778 147842 142359 94681 85223 85274 127916 157258
14060 157258 175310 154319 67334 75352 97678 96283 91201 61412 63665 72972 68729 73149 94223
14047 94223 98293 150787 198919 195271 174772 123206 58795 58883 75335 86179 59174 89673 124619
$$ packed form
14133G8727L5539L75j5294j7152L06J3735M4327M3671j9858m2100n8396j8489
14121D5391R1994N9341m2640K6337k6590L479j4184L5467R1309l7878l1933m6514
14109A53579o581m2337k6919M4785P8901m766j4638r333q177n1908j9316k6906
14097F6384j2860N514o399k9572K7681M1383n0339j1261K1017J2981N4133n3298
14085F5364j8045J7600k6613J2454J5152L9498L9830j5593J322L2146J6312Q87
14073A80314p9742m7344k8493K0281O4606L7156J064n483m7678r458N1M2642K9342
14060A57258J8052k0991q6985Q018K2326j395n082k9789K253R307m243M420K1074
14047I4223M070N2494M8132l648k0499n1566o4411Q8J6452J0844k7005L0499L4946
$$ plain form
14034 124619 115562 131309 92481 145919 202242 182344 124810 151777 161933 191059 170024 129699
14022 129699 142894 137266 96584 118339 125621 169080 179030 194942 136090 87638 62507 99147
14010 99147 88581 82657 97094 200001 242285 247232 174931 114174 122980 120570 167153 108186
13998 108186 90353 143420 211775 154960 145939 177241 208860 198092 174090 133995 70064 69819
13986 69819 78151 39907 71543 82006 101981 123643 144694 136109 87273 67565 62056 3016
13974 3016 868 55162 115628 97912 60312 105112 166562 138722 100779 71170 74201 113602
13962 113602 170167 184684 203561 140699 48153 26759 82835 114360 64323 26125 36505
13951 36505 89768 118262 118505 143668 110499 70095 81753 132961 190854 189024 129219 117022
$$ packed form
14034A24619r057J5747l8828N3438N6323j9898n7534K6967J0156K9126k1035m0325
14022A29699J3195n628m0682K1755P282M3459R950J5912n8852m8452k5131L6640
14010I9147j0566n924J4437J02907M2284M947p2301o0757Q806k410M6583n8967
13998A08186j7833N3067O8355n6815r021L1302L1619j0768k4002m0095o3931k45
13986F9819Q332l8244L1636J0463J9975K1662K1051q585m8836j9708n509n9040
13974C016k148N4294O0466j7716l7600M4800O1450k7840l7943k9609L031L9401
13962A13602N6565J4517J8877o2862r2546k1394N6076L1525n0037l8198J0380
13951C6505N3263K8494K43K5163l3169m0404J1658N1208N7893j830n9805j2197
$$ plain form
13939 117022 123465 77735 82061 137670 186738 239252 185631 155258 152023 172704 139114 57734
13927 57734 49682 52420 84628 95693 65644 22476 26772 54320 87515 130551 107674 104815
13915 104815 71794 53380 67995 28839 79139 139785 152965 160754 200750 216245 201274 217203
13903 217203 226316 241872 141024 73725 76713 105771 179620 243680 283854 280766 257867 270514
13891 270514 301125 232685 144318 139354 160210 138335 109799 172160 193167 144678 106060 160438
13879 160438 174579 190484 229461 240177 237763 186419 228353 243947 181234 122591 103663 101725
$$ packed form
13939A17022O443m5730M326N5609M9068N2514n3621l0373l235K0681l3590q1380
13927E7734q052K738L2208J1065l0049m3168M296K7548L3195M3036k2877k859
13915A04815l3021j8414J4615l9156N0300O0646J3180P789L9996J5495j4971J5929
13903B17203R113J5556j00848o7299K988K9058P3849O4060M0174l088k2899J2647
13891B70514L0611o8440q8367m964K0856k1875k8536O2361K1007m8489l8618N4378
13879A60438J4141J5905L8977J0716k414n1344M1934J5594o2713n8643j8928j938
$$ [...]
##END NTUPLES=NMR SPECTRUM
##END=
