##TITLE=Analysis number 329705
Compound Code mo 08295
Book Reference 510/86
Project Code adrs
Chemist Name jimp
##JCAMPDX= 6.0         $$ Bruker NMR JCAMP-DX V2.0
##DATA TYPE= NMR SPECTRUM
##DATA CLASS= NTUPLES
##ORIGIN= Bruker BioSpin GmbH
##OWNER= nmr
$$ XWIN-NMR		Version 3.5
$$ Mon Sep 24 12:20:48 2007 GMT Daylight Time (UT+1h)  MAYBRIDGE\nmr@NMR_250MHZ
##.OBSERVE FREQUENCY= 250.131544655141
##.OBSERVE NUCLEUS= ^1H
##.ACQUISITION MODE= SIMULTANEOUS (DQD)
##.ACQUISITION SCHEME= undefined
##.AVERAGES= 16
##.DIGITISER RES= 18
##SPECTROMETER/DATA SYSTEM= dpx250
##.PULSE SEQUENCE= zg30
##.SOLVENT NAME= CDCl3
##.SHIFT REFERENCE= (INTERNAL, CDCl3, 0, 16.4515)
##AUDIT TRAIL= $$ (NUMBER, WHEN, WHO, WHERE, WHAT)
$$ ##TITLE= Audit trail, XWIN-NMR		Version 3.5
$$ ##JCAMPDX= 5.01
$$ ##ORIGIN= Bruker BioSpin GmbH
$$ ##OWNER= nmr
$$ C:\u/data/dgb/nmr/ADRS/2200/pdata/1/auditp.txt
$$ ##AUDIT TRAIL=  $$ (NUMBER, WHEN, WHO, WHERE, WHAT)
(   1,<2007-09-24 12:20:25.79 +100>,<MAYBRIDGE\nmr>,<NMR_250MHZ>,
      <created by zg, POWCHK disabled, PULCHK disabled
       configuration hash MD5:
       76 6E 9A 78 1E 09 19 81 EC 84 63 8F B0 6A 59 2D
       data hash MD5: 64K
       38 6C AF 16 25 F1 F7 47 C7 BE D8 10 F2 9E C3 33>)
(   2,<2007-09-24 12:20:37.85 +100>,<MAYBRIDGE\nmr>,<NMR_250MHZ>,
      <Start of raw data processing
       ef LB = 0.3 FT_mod = 6 PKNL = 1 SI = 32K 
       data hash MD5: 32K
       E9 C7 9A FD 72 11 B0 C0 93 8F 62 0B 35 2A 86 14>)
(   3,<2007-09-24 12:20:40.14 +100>,<MAYBRIDGE\nmr>,<NMR_250MHZ>,
      <apk 
       data hash MD5: 32K
       21 83 07 D8 3F 3C AF B7 49 EE 40 64 21 69 64 0E>)
(   4,<2007-09-24 12:20:40.85 +100>,<MAYBRIDGE\nmr>,<NMR_250MHZ>,
      <abs ABSG = 5 
       data hash MD5: 32K
       2B F4 2F A7 27 C7 D8 4A EA F2 BF 76 12 FF EA 3D>)
$$ ##END=
$$ 
$$ hash MD5
$$ 02 60 B0 D4 AE DE AE B7 EA CA 60 30 EC E6 6B 07
##$RELAX= 
##$RELAX= 
##$RELAX= 
##$RELAX= 
##$RELAX= 
##$RELAX= 
##$RELAX= 
$$ Bruker specific parameters
$$ --------------------------
##$DU= <C:\u>
##$EXPNO= 2200
##$NAME= <ADRS>
##$PROCNO= 1
##$TYPE= <nmr>
##$USER= <dgb>
##$AMP= (0..31)
100 100 100 100 100 100 100 100 100 100 100 100 100 100 100 100 100 100 
100 100 100 100 100 100 100 100 100 100 100 100 100 100 
##$AQSEQ= 0
##$AQ_mod= 3
##$AUNM= <au_zg>
##$AUTOPOS= <24 >
##$BF1= 250.13
##$BF2= 250.13
##$BF3= 250.13
##$BF4= 250.13
##$BF5= 500.13
##$BF6= 500.13
##$BF7= 500.13
##$BF8= 500.13
##$BYTORDA= 1
##$CFDGTYP= 0
##$CFRGTYP= 5
##$CHEMSTR= <none>
##$CNST= (0..31)
1 1 145 1 1 1 1 1 1 1 1 1 1 1 1 1 1 1 1 1 1 1 1 1 1 1 1 1 1 1 1 1 
##$CPDPRG= <>
##$CPDPRG1= <>
##$CPDPRG2= <>
##$CPDPRG3= <>
##$CPDPRG4= <mlev>
##$CPDPRG5= <mlev>
##$CPDPRG6= <mlev>
##$CPDPRG7= <mlev>
##$CPDPRG8= <mlev>
##$CPDPRGB= <>
##$CPDPRGT= <>
##$D= (0..31)
0 1 0 0 0 0 0 0 0 0.06 0 0 0 0 0 0 0.0002 0 0 0 0 0 0 0 0 0 0 0 0 0 0 
0 
##$DATE= 1190632824
##$DBL= (0..7)
120 120 120 120 120 120 120 120 
##$DBP= (0..7)
150 150 150 150 150 150 150 150 
##$DBP07= 0
##$DBPNAM0= <>
##$DBPNAM1= <>
$$ [...]
##$SUBNAM7= <"">
##$SUBNAM8= <"">
##$SUBNAM9= <"">
##$SW= 20.6930455092707
##$SWIBOX= (0..15)
0 0 3 0 0 0 0 0 0 0 0 0 0 0 0 0 
##$SW_h= 5175.983436853
##$TD= 65536
##$TD0= 1
##$TE= 296.16
##$TE2= 300
##$TE3= 300
##$TEG= 300
##$TL= (0..7)
0 120 120 120 120 120 120 120 
##$TP= (0..7)
150 150 150 150 150 150 150 150 
##$TP07= 0
##$TPNAME0= <>
##$TPNAME1= <>
##$TPNAME2= <>
##$TPNAME3= <>
##$TPNAME4= <>
##$TPNAME5= <>
##$TPNAME6= <>
##$TPNAME7= <>
##$TPOAL= (0..7)
0.5 0.5 0.5 0.5 0.5 0.5 0.5 0.5 
##$TPOFFS= (0..7)
0 0 0 0 0 0 0 0 
##$TUNHIN= 0
##$TUNHOUT= 0
##$TUNXOUT= 0
##$USERA1= <user>
##$USERA2= <user>
##$USERA3= <user>
##$USERA4= <user>
##$USERA5= <user>
##$V9= 5
##$VALIST= <valist>
##$VCLIST= <CCCCCCCCCCCCCCC>
##$VD= 0
##$VDLIST= <DDDDDDDDDDDDDDD>
##$VPLIST= <PPPPPPPPPPPPPPP>
##$VTLIST= <TTTTTTTTTTTTTTT>
##$WBST= 1024
##$WBSW= 4
##$XGAIN= (0..3)
0 0 0 0 
##$XL= 0
##$YL= 0
##$YMAX_a= 410381
##$YMIN_a= -398079
##$ZGOPTNS= <>
##$ZL1= 120
##$ZL2= 120
##$ZL3= 120
##$ZL4= 120
##$ABSF1= 16.45152
##$ABSF2= -4.241652
##$ABSG= 5
##$ABSL= 3
##$ALPHA= 0
##$AQORDER= 0
##$ASSFAC= 0
##$ASSFACI= 0
##$ASSFACX= 0
##$ASSWID= 0
##$AUNMP= <proc_1d>
##$AZFE= 0.1
##$AZFW= 0.1
##$BCFW= 0
##$BC_mod= 0
##$BYTORDP= 0
##$COROFFS= 0
##$CY= 12.5
##$DATMOD= 1
##$DC= 0
##$DFILT= <>
##$DTYPP= 0
##$F1P= 14.0000005364418
##$F2P= -0.99999901652339
##$FCOR= 0.5
##$FTSIZE= 32768
##$FT_mod= 6
##$GAMMA= 0
##$GB= 0
##$INTBC= 1
##$INTSCL= 1
##$ISEN= 128
##$LB= 0.3
##$LEV0= 0
##$LPBIN= 0
##$MAXI= 10000
##$MC2= 0
##$MEAN= 0
##$ME_mod= 0
##$MI= 0
##$NCOEF= 0
##$NC_proc= -2
##$NLEV= 6
##$NOISF1= 0
##$NOISF2= 0
##$NSP= 0
##$NTH_PI= 0
##$NZP= 0
##$OFFSET= 16.45152
##$PC= 1
##$PHC0= 135.6224
##$PHC1= 32.50621
##$PH_mod= 1
##$PKNL= yes
##$PPARMOD= 0
##$PSCAL= 4
##$PSIGN= 0
##$REVERSE= no
##$SF= 250.130017627837
##$SI= 32768
##$SIGF1= 0
##$SIGF2= 0
##$SINO= 400
##$SIOLD= 32768
##$SREGLST= <1H.CDCl3>
##$SSB= 0
##$STSI= 32768
##$STSR= 0
##$SW_p= 5175.98343685301
##$SYMM= 0
##$S_DEV= 0
##$TDeff= 65536
##$TDoff= 0
##$TI= <Analysis number 999999
Compound Code 99
Book Reference 9
Project Code 9>
##$TILT= no
##$TM1= 0
##$TM2= 0
##$TOPLEV= 0
##$USERP1= <user>
##$USERP2= <user>
##$USERP3= <user>
##$USERP4= <user>
##$USERP5= <user>
##$WDW= 1
##$XDIM= 32768
##$YMAX_p= 413655030
##$YMIN_p= -168830
$$ End of Bruker specific parameters
$$ ---------------------------------
##NTUPLES= NMR SPECTRUM
##VAR_NAME=  FREQUENCY,     SPECTRUM/REAL,   SPECTRUM/IMAG
##SYMBOL=    X,             R,               I
##VAR_TYPE=  INDEPENDENT,   DEPENDENT,       DEPENDENT
##VAR_FORM=  AFFN,          ASDF,            ASDF
##VAR_DIM=   32768,         32768,           32768
##UNITS=     HZ,            ARBITRARY UNITS, ARBITRARY UNITS
##FACTOR=    0.157963299565203, 1,           1
##FIRST=     4115.01921767425, 0,            0
##LAST=      -1060.96421917876, 0,           0
##MIN=       -1060.96421917876, -168830,     0
##MAX=       4115.01921767425, 413655030,    0
$$ Real data points
##PAGE= N=1
##DATA TABLE= (X++(R..R)), XYDATA
$$ [...]
$$ plain form
14932 14218 3297 -10999 -6958 -6654 -1598 10662 7774 5008 3595 10459 13397 5080 8889 7307
14918 7307 5671 11443 23218 24003 17928 10482 15604 19525 20718 5640 -3594 -2799 2100 4800 15362
14903 15362 27301 24996 12183 20177 14185 -9675 -31133 -11044 20361 20304 8616 3414 -516
14890 -516 -6400 -12214 -547 8092 9315 9590 13576 6429 18099 17050 16836 20306 3821 -4049 -2438
14875 -2438 9602 21090 22030 12457 1903 -8589 2058 162 3538 2291 731 5862 -4684
14862 -4684 -14356 -5164 314 4647 1503 -998 -17974 -36340 -28828 -3502 13976 14407 3989 5699
14848 5699 9674 12203 1396 -7638 -7782 3266 6593 3399 14843 12374 -7756 -11373 -11395 4780
14834 4780 15509 15170 10111 14492 12697 6903 970 -3175 -15598 -30210 -21228 -3549 -822 7459
$$ packed form
14932A4218j0921j4296M041L04N056J2260k888k766j413O864K938q317L809j582
14918G307j636N772J1775P85o075p446N122L921J193j5078r234P95M899K700J0562
14903A5362J1939k305j2813P994n992k3860k1458K0089L1405n7j1688n202l930
14890e16n884n814J1667Q639J223K75L986p147J1670j049k14L470j6485p870J611
14875b438J2040J1488R40r573j0554j0492J0647j896L376j247j560N131j0546
14862d684r672R192N478M333l144k501j6976j8366P512K5326J7478M31j0418J710
14848E699L975K529j0807r034j44J1048L327l194J1444k469k0130l617k2J6175
14834D780J0729l39n059M381j795n794n933m145j2423j4612Q982J7679K727Q281
$$ plain form
14820 7459 11473 5732 1184 3122 11599 17591 7993 8423 6113 -12968 -21897 -16891 -5824 3485
14806 3485 -8530 -18950 -7046 -1197 392 -8363 1079 17100 3814 -961 8818 14940 19936
14793 19936 26071 22982 13752 4364 7853 18225 8474 5842 10937 27344 30052 28136 35989 42682
14779 42682 38375 19628 5965 5365 -10581 -2500 2690 -12804 -13970 -3460 15399 31537 45317
14766 45317 50777 48322 29618 6583 2607 -606 -8905 -4475 -15759 -27122 -23947 -14378 7381
14753 7381 4906 8415 8657 1591 -3670 -8043 -12606 -7870 -7530 -15561 -6373 -1629 3335 3431 -2310 7291
14737 7291 16799 14241 -1786 -18165 -29015 -26893 -32857 -34935 -35580 -14994 -1563 2125 1488 775
14723 775 12080 25762 8872 -8227 -19474 -20312 -15942 -15779 -16984 -24262 -20089 -31937 -35260 -25880
$$ packed form
14820G459M014n741m548J938Q477N992r598M30k310j9081q929N006J1067R309
14806C485j2015j0420J1904N849J589q755R442J6021j3286m775R779O122M996
14793A9936O135l089r230r388L489J0372r751k632N095J6407K708j916P853O693
14779D2682m307j8747j3663o00j5946Q081N190j5494j166J0510J8859J6138J3780
14766D5317N460k455j8704k3035l976l213q299M430j1284j1363L175R569K1759
14753G381k475L509K42p066n261m373m563M736L40q031R188M744M964R6n741R601
14737G291R508k558j6027j6379j0850K122n964k078o45K0586J3431L688o37p13
14723G75J1305J3682j6890j7099j1247q38M370J63j205p278M173j1848l323R380
$$ plain form
14709 -25880 -22716 -13717 1189 3195 -1100 5179 11055 10154 3432 -3083 -13045 -4652 -919 -4994
14695 -4994 -559 3145 9336 13168 -909 -14622 -10337 -3578 1296 14509 13320 20634 12411 6725
14681 6725 2548 7971 21493 17480 17529 17894 21409 30457 24465 11453 6884 -4659 -6432 -2587 -951
14666 -951 14500 10509 5788 3117 -2740 -9042 -11983 -6338 4243 10475 10293 20469 27591 16123
14652 16123 23178 36438 27189 27469 28589 40218 36902 33290 29737 13478 10314 10564 299 -10408
14638 -10408 -16828 -6538 -1618 -3918 -2439 9802 13389 7157 -3986 2764 15429 19843 13346
14625 13346 6294 -3618 -2873 -7098 -10257 900 2238 5680 13738 11849 7142 -1104 7154 8653
14611 8653 3057 -11125 -16061 -26988 -43884 -38797 -27410 -8641 655 -6261 -9111 -9666 -10655 680
$$ packed form
14709b5880L164Q999J4906K006m295O279N876r01o722o515r962Q393L733m075
14695d994M435L704O191L832j4077j3713M285O759M874J3213j189P314q223n686
14681F725m177N423J3522m013M9L65L515R048n992j3012m569j1543j773L845J636
14666i51J5451l991m721k671n857o302k941N645J0581O232j82J0176P122j1468
14652A6123P055J3260r249K80J120J1629l316l612l553j6259l164K50j0265j0707
14638a0408o420J0290M920k300J479J2241L587o232j1143O750J2665M414o497
14625A3346p052r912P45m225l159J1157J338L442Q058j889m707q246Q258J499
14611H653n596j4182m936j0927j6896N087J1387J8769R296o916k850n55r89J1335
$$ plain form
14597 680 15353 22207 11216 6835 8279 3261 4213 3529 -13852 -17107 -17800 -5649 8927 11590
14583 11590 8463 13875 12526 -846 4560 19115 23560 20419 20288 16247 4225 -5523 5421 9163
14569 9163 11479 11758 16134 10238 -3644 -7943 -1247 5477 8000 -4575 -10215 -11150 -1300 -1488 -25696
14554 -25696 -22903 6963 13852 15552 9354 12658 11753 19444 19644 1167 -522 3092 -4212 -13296
14540 -13296 -8163 12096 33304 26433 17754 88 -15127 -27548 -16010 -17134 -17599 -21585 -15959
14527 -15959 -1730 12978 6494 -4624 1829 5806 -5789 -12345 -4454 -3427 -10809 -12557 -14933
14514 -14933 -24205 3529 15627 20400 23598 20316 -2373 -4225 14647 11219 20041 15899 -7576
14501 -7576 -8323 -6670 88 14513 -760 -10754 6136 18620 13766 15922 22514 3118 -440 25077
$$ packed form
14597F80J4673O854j0991m381J444n018R52o84j7381l255o93J2151J4576K663
14583A1590l127N412j349j3372N406J4555M445l141j31m041j2022r748J0944L742
14569I163K316K79M376n896j3882m299O696O724K523j2575n640r35R850j88k4208
14554b5696K793K9866O889J700o198L304r05P691K00j8477j689L614p304r084
14540a3296N133K0259K1208o871q679j7666j5215j2421J1538j124m65l986N626
14527a5959J4229J4708o484j1118O453L977j1595o556P891J027p382j748k376
14514a4933r272K7734J2098M773L198l282k2689j852J8872l428Q822m142k3475
14501g576p47J653O758J4425j5273r994J6890J2484m854K156O592j9396l558K5517
$$ plain form
14487 25077 34725 35941 28171 25628 20111 9355 -8534 -22897 -12421 1089 -6090 -15432 -7660
14474 -7660 -6041 2445 7983 6896 11710 -950 -6912 2323 4185 15779 15173 8203 -9227 -28317
14460 -28317 -27957 -2571 816 -491 653 -499 5629 4330 9710 21394 14126 14067 13100 8273 -727
14445 -727 -10451 -22229 -15434 -17976 -25490 -20228 -5860 18073 11343 -1514 -20506 -31936 -24770
14432 -24770 -18831 -9316 4192 8805 2466 3207 3920 -2155 -9213 -2599 -6762 -13218 -10580 -3444 115
14417 115 -1788 -5566 9722 14464 10065 2755 14167 13625 11354 11101 5162 1384 -7486 -5163 -2384
14402 -2384 3596 1137 17822 8883 -924 -7250 8343 16022 8236 16200 21608 8841 1025 1253
14388 1253 -767 -2049 2819 -5508 -14438 -9906 -9930 3964 22906 33616 23578 14205 7486 -5622
$$ packed form
14487B5077R648J216p770k543n517j0756j7889j4363J0476J3510p179r342P772
14474g660J619Q486N538j087M814j2660n962R235J862J1594o06o970j7430j9090
14460b8317L60K5386L387j307J144j152O128j299N380J1684p268n9r67m827r000
14445g27r724j1778O795k542p514N262J4368K3933o730j2857j8992j1430P166
14432b4770N939R515J3508M613o339P41P13o075p058O614m163o456K638P136L559
14417A15j903l778J5288M742m399p310J1412n42k271k53n939l778q870K323K779
14402b384N980k459J6685q939r807o326J5593P679p786P964N408j2767p816K28
14388A253k020j282M868q327q930M532k4J3894J8942J0710j0038r373o719j3108
$$ plain form
14374 -5622 -17226 -5673 -9179 -16095 -5728 9391 13632 10001 16859 23195 35917 30021 23996
14361 23996 27374 30197 14573 11083 11387 8620 -5436 -1795 143 10948 19892 20323 32563 34769
14347 34769 21880 10923 25304 20794 7862 6356 12196 8377 12866 20957 12498 17631 25485
14334 25485 9973 1823 11838 17039 6795 13432 14591 10571 10344 9635 15865 5525 -6925 -5887
14320 -5887 -1940 -3043 5216 -1622 -1199 16477 12286 14261 13062 5973 1696 6629 -6507 -7220 -5159
14305 -5159 -6786 -6535 -993 -2169 -18203 -23021 -10002 -13840 -22846 -25373 -25381 -13400 780 -5751 -16919
14290 -16919 -13231 646 656 4868 16967 10965 8086 11291 11891 23452 13602 -575 -12691 -17647
14276 -17647 -9241 -11929 5038 1518 412 1603 7107 19008 16480 25820 17060 9791 22313 17581
$$ packed form
14374e622j1604J1553l506o916J0367J5119M241l631O858O336J2722n896o025
14361B3996L378K823j5624l490L04k767j4056L641J938J0805Q944M31J2240K206
14347C4769j2889j0957J4381m510j2932j506N840l819M489Q091q459N133P854
14334B5485j5512q150J0015N201j0244O637J159m020k27p09O230j0340j2450J038
14320e887L947j103Q259o838M23J7676m191J975j199p089m277M933j3136p13K061
14305e159j627K51N542j176j6034m818J3019l838r006k527qJ1981J4180o531j1168
14290a6919L688J3877J0M212J2099o002k879L205O00J1561r850j4177j2116m956
14276a7647Q406k688J6967l520j106J191N504J1901k528R340q760p269J2522m732
$$ plain form
14262 17581 6186 -3212 -5227 -3369 3555 17770 19405 4659 18340 20754 9488 2727 -820
14249 -820 -10355 -313 19314 15339 13788 22747 28089 12190 6986 2272 -2510 9722 18440 17664
14235 17664 28676 27998 7052 9294 16949 17749 14361 5111 -11507 -3313 15630 17052 11892 11603
14221 11603 7652 14071 14254 1293 -4734 8962 12455 7146 -4502 -11460 -20958 -28605 -26828 -29909
14207 -29909 -31575 -5565 15511 28119 30106 22181 1372 3053 11943 15006 6214 834 -3969
14194 -3969 -7621 14287 30715 24128 20120 9788 4820 -6843 -10561 -3027 -7610 -9772 -10742 -13910
14180 -13910 -20070 -17429 -8129 -22213 -19305 14439 27227 18427 12171 6672 4246 2152 279 -7824
14166 -7824 7593 15216 15602 18039 17670 12331 879 3271 15555 17871 10396 -2236 -10430 -5631
$$ packed form
14262A7581j1395r398k015J858O924J4215J635j4746J3681K414j1266o761l547
14249h20r535J0042J9627l975j551Q959N342j5899n204m714m782J2232Q718p76
14235A7664J1012o78k0946K242P655Q00l388r250j6618Q194J8943J422n160k89
14221A1603l951O419J83j2961o027J3696L493n309j1648o958r498p647J777l081
14207b9909j666K6010K1076J2608J987p925k0809J681Q890L063q792n380m803
14194c969l652K1908J6428o587m008j0332m968j1663l718P534m583k162r70l168
14180a3910o160K641R300j4084K908L3744J2788q800o256n499k426k094j873q103
14166g824J5417P623L86K437l69n339j1452K392J2284K316p475j2632q194M799
$$ plain form
14152 -5631 -1436 10651 17321 6967 3551 9323 17644 8136 2018 3641 -380 -2813 5620 10823
14138 10823 11157 9856 9558 7689 13058 -1317 -14464 -21982 -15729 1582 15335 18955 14987 18398
14124 18398 25635 7102 8577 -1597 -12794 -19196 -11679 -10814 2673 17731 38360 39472 30086
14111 30086 19329 12995 31505 42915 40363 29663 25278 3286 -2125 6762 15064 11196 8566
14098 8566 6116 -9011 -22847 -23845 -19171 2823 16369 31731 35279 41310 31502 22701 23619 11783
14084 11783 22619 29857 28667 14203 17135 42477 39333 28127 30547 20712 21620 22421 14282 12565
14070 12565 16175 9960 18777 28935 25210 42099 38063 28746 27741 22059 23285 21929 13446 19432
14056 19432 28057 2384 -16658 -23308 -13343 -6008 -6679 -983 -3852 -2417 -4397 -10379 1707 -4068
$$ packed form
14152e631M195J2087O670j0354l416N772Q321r508o118J623m021k433Q433N203
14138A0823L34j301k98j869N369j4375j3147p518O253J7311J3753L620l968L411
14124A8398P237j8533J475j0174j1197o402P517Q65J3487J5058K0629J112r386
14111C0086j0757o334J8510J1410k552j0700m385k1992n411Q887Q302l868k630
14098H566k450j5127j3836r98M674K1994J3546J5362L548O031r808q801R18j1836
14084A1783J0836P238j190j4464K932K5342l144j1206K420r835R08Q01q139j717
14070A2565L610o215Q817J0158l725J6889m036r317j005n682J226j356q483N986
14056A9432Q625k5673j9042o650R965P335o71N696k869J435j980n982J2086n775
$$ plain form
14042 -4068 -5213 -5483 2820 3371 34 -2405 -1878 14102 14426 9833 8628 14207 23833 23846 19514 11393
14026 11393 6243 -1101 520 -3757 -5303 -3233 -7909 -270 98 1959 3888 4479 5279 1753 -2797
14011 -2797 13112 25898 27348 33195 14957 -5773 -2658 -1647 -2754 6221 11757 16994 17312 15496
13997 15496 21472 13682 5332 1328 2457 -11722 -19680 -4259 15857 25684 26370 21053 5030 11310
13983 11310 17858 27483 13987 598 8155 20052 32746 28139 24098 27901 27530 20909 28428 20381
13969 20381 9815 5699 7841 20427 22710 9413 903 3025 -3761 924 6291 11897 8612 15585
13955 15585 18271 5578 4830 25575 20541 8426 13238 20007 10051 -4116 -21431 -12026 -3605
13942 -3605 5379 20042 20636 16331 8952 4763 7557 8003 -55 -5933 3855 11893 9112 8178 28167
$$ packed form
14042d068j145k70Q303N51l337k439N27J5980L24m593j205N579R626J3m332q121
14026A1393n150p344J621m277j546K070m676P639L68J861J929N91Q00l526m550
14011b797J5909J2786J450N847j8238k0730L115J011j107Q975N536N237L18j816
13997A5496N976p790q350m004J129j4179p958J5421K0116R827O86n317j6023O280
13983A1310O548R625j3496j3389P557J1897J2694m607m041L803l71o621P519q047
13969B0381j0566m116K142J2586K283j3297q510K122o786M685N367N606l285O973
13955A5585K686j2693p48K0745n034j2115M812O769r956j4167j7315R405Q421
13942c605Q984J4663N94m305p379m189K794M46q058n878R788Q038k781r34J9989
$$ plain form
13927 28167 32989 36632 33472 30596 28299 21952 10759 -2240 -5460 3214 10999 20677 20502 14862
13913 14862 15885 13335 10307 15595 18329 6894 10511 15747 36572 42238 34492 22063 20972 20261
13899 20261 20020 23954 22553 16982 9413 5867 15309 2255 -4358 13197 15224 20210 30346 26367
13885 26367 15761 595 1256 11340 17868 27933 24538 19126 21330 13346 14915 15808 13920 19416
13871 19416 22498 15495 13629 29743 26431 12662 15557 31072 30007 33688 33325 23478 586 -10547
13857 -10547 -1481 15988 21602 21988 29787 15850 14416 19212 26430 25213 8869 12443 28450 34172
13843 34172 19917 24720 26438 22884 27368 17342 13788 11558 10595 8221 12249 23311 28745 30643
13829 30643 34086 40292 37024 38439 45666 37915 29242 36911 35374 17766 22485 25046 9534 6371
$$ packed form
13927B8167M822L643l160k876k297o347j1193j2999l220Q674P785R678j75n640
13913A4862J023k550l028N288K734j1435L617N236K0825N666p746j2429j091p11
13899B0261k41L934j401n571p569l546R442j3054o613J7555K027M986J0136l979
13885B6367j0606j5166O61J0084O528J0065l395n412K204p984J569Q93j888N496
13871A9416L082p003j866J6114l312j3769K895J5515j065L681l63r847k2892j1133
13857a0547R066J7469N614L86P799j3937j434M796P218j217j6344L574J6007N722
13843C4172j4255M803J718l554M484j0026l554k230r63k374M028J1062N434J898
13829C0643L443O206l268J415P227p751q673P669j537j7608M719K561j5512l163
$$ plain form
13815 6371 11279 13911 18415 42685 65878 64385 48142 43106 30426 27458 11813 -168 -2210
13802 -2210 -3218 7646 25131 19264 23520 20938 24865 44954 39488 34122 14664 11522 9761 25622
13788 25622 29221 23282 27640 39110 53512 66049 60337 42892 29550 35973 34732 36112 40188
13775 40188 32093 33098 20371 5511 1222 15910 16720 8340 7729 10982 19008 19846 15571 15290 4870
13760 4870 4357 5346 1579 3501 -1152 6627 2077 8958 12882 12276 5512 3338 2166 17616 36463
13745 36463 41266 42817 34466 25227 15881 11299 2040 3540 10351 5527 -3168 -613 -4488 3581
13731 3581 9813 9592 9039 16231 25035 19276 14413 23831 42382 50266 41318 37941 46553 47904 38395
13716 38395 27336 43207 50865 36982 17811 27847 41907 45639 40134 35518 36769 48385 57103
$$ packed form
13815F371M908K632M504K4270K3193j493j6243n036j2680k968j5645j1981k042
13802b210j008J0864J7485n867M256k582L927K0089n466n366j9458l142j761J5861
13788B5622L599n939M358J1470J4402J2537n712j7445j3342O423j241J380M076
13775D0188q095J005j2727j4860m289J4688Q10q380o11L253Q026Q38m275k81j0420
13760D870n13R89l767J922m653P779m550O881L924o06o764k174j172J5450J8847
13745C6463M803J551q351r239r346m582r259J500O811m824q695K555l875Q069
13731C581O232k21n53P192Q804n759m863R418J8551P884q948l377Q612J351r509
13716C8395j1059J5871P658j3883j9171J0036J4060L732n505m616J251J1616Q718
$$ plain form
13703 57103 50361 45249 50074 37121 23993 33071 37631 29494 28326 24548 16039 6049 15238 19299
13689 19299 23660 33151 30266 21925 17419 24463 38785 36905 28724 21565 16193 10387 2184 22143
13675 22143 35118 36634 34810 44381 52789 65996 56004 54475 59161 60045 40460 33884 29251 10799
13661 10799 12575 15821 26767 28042 37140 28550 16818 29193 28972 25176 23352 23099 36660 52964
13647 52964 45776 27683 26242 39938 34329 49239 60224 47949 34797 25087 20342 44974 53564
13634 53564 44873 45795 41778 36091 26073 21756 39444 41186 35442 24453 10365 15015 17877 26381
13620 26381 27074 21519 25293 33769 44370 29844 17217 33825 54226 56444 51183 61090 81349
13607 81349 73944 53754 38432 33650 38792 28041 28000 37942 37197 31016 39558 57972 56047 39108
$$ packed form
13703E7103o742n112M825j2953j3128R078M560q137j168l778q509r990R189M061
13689A9299M361R491k885q341m506P044J4322j880q181p159n372n806q203J9959
13675B2143J2975J516j824R571Q408J3207r992j529M686Q84j9585o576m633j8452
13661A0799J776L246J0946J275R098q590j1732J2375k21l796j824k53J3561J6304
13647E2964p188j8093j441J3696n609J4910J0985j2275j3152r710m745K4632Q590
13634E3564q691R22m017n687j0018m317J7688J742n744j0989j4088M650K862Q504
13620B6381O93n555L774Q476J0601j4526j2627J6608K0401K218n261R907K0259
13607H1349p405k0190j5322m782N142j0751m1R942p45o181Q542J8414j925j6939
$$ plain form
13593 39108 34085 39794 41327 40720 55019 61455 63717 59302 57635 48027 42230 33417 33834 39293 36217
13578 36217 40323 53803 43035 45386 56455 60597 34989 35835 43624 41705 45414 50608 56536 70635
13564 70635 67000 70396 61350 50930 44334 32791 41009 52347 69880 81861 76944 52712 39668
13551 39668 38088 46422 47605 37389 29657 29994 40397 52001 51527 47270 50389 80095 100680 92167
13537 92167 84864 81525 78080 55661 41098 40053 50327 62104 80106 68098 75137 85407 87709
13524 87709 86386 82098 60876 46440 62380 67341 76766 92318 98788 91568 73402 67400 68831
13511 68831 63817 54000 48491 52554 66407 76882 78936 77847 69689 64413 62255 77138 83609 77276
13497 77276 72759 81993 95616 91917 82331 56653 49873 50360 56169 73814 76852 77413 73918 76421
$$ packed form
13593C9108n023N709J533o07J4299O436K262m415j667r608n797q813M17N459l076
13578C6217M106J3480j0768K351J1069M142k5608Q46P789j919L709N194N928J4099
13564G0635l635L396r046j0420o596j1543Q218J1338J7533J1981m917k4232j3044
13551C9668j580Q334J183j0216p732L37J0403J1604m74m257L119K9706K0585q513
13537I2167p303l339l445k2419j4563j045J0274J1777J8002j2008P039J0270K302
13524H7709j323m288k1222j4436J5940M961R425J5552O470p220j8166o002J431
13511F8831n014r817n509M063J3853J0475K054j089q158n276k158J4883O471o333
13497G7276m517R234J3623l699r586k5678o780M87N809J7645L038N61l495K503
$$ plain form
13483 76421 76724 67931 58687 59833 64425 68986 66033 47749 46137 43464 41971 48535 47939 66854
13469 66854 80502 88082 79771 71409 79062 86804 86060 74941 71003 73086 77368 84863 84706 94348
13455 94348 109443 110321 109380 111654 113887 114747 104442 107558 118971 130949 117192 103291 97572 87505
13441 87505 83071 85586 85744 87790 82423 89876 82599 75692 72463 89717 100211 91584 73620 72252
13427 72252 76727 80150 77570 68798 81342 97385 95631 100094 107642 99559 101305 90691 93493 84338
13413 84338 76330 75116 87569 94180 94378 105882 96050 89481 98232 95163 92153 78756 71326 64951
13399 64951 73070 80658 85675 83830 73965 75421 102533 108817 109111 114890 119813 115789 111300 93692
13385 93692 89369 94656 87694 74637 82060 93107 90572 82128 77614 84547 89651 90741 99743 119348
$$ packed form
13483G6421L03q793r244J146M592M561k953j8284j612k673j493O564n96J8915
13469F6854J3648P580q311q362P653P742p44j1119l938K083M282P495j57R642
13455I4348J5095Q78r41K274K233Q60j0305L116J1413J1978j3757j3901n719j0067
13441H7505m434K515J58K046n367P453p277o907l229J7254J0494q627j7964j368
13427G2252M475L423k580q772J2544J6043j754M463P548q083J746j0614K802r155
13413H4338q008j214J2453O611J98J1504r832o569Q751l069l010j3397p430o375
13399F4951Q119P588N017j845r865J456K7112O284K94N779M923m024m489j7608
13385I3692m323N287o962j3057P423J1047k535q444m514O933N104J090R002J9605
$$ plain form
13371 119348 115153 95128 88967 95251 101807 104639 107704 110431 122487 111752 90550 91632 102904
13358 102904 129654 125470 118162 114185 108678 108831 110334 113715 113438 107530 107401 120488 129899 142034
13344 142034 128170 120511 130792 147759 129851 128712 153247 160159 146487 134160 129978 137728
13332 137728 144100 136695 140622 135878 119116 122659 121917 114494 120481 121247 135981 146256 137566 126958
13318 126958 123406 142174 153276 152971 144934 143538 150366 143200 141454 143548 147936 140908 133944 144968
13304 144968 152638 149034 152897 150371 153641 156467 161350 169340 171978 170422 170509 162339 162410 165105 149278
13289 149278 159283 171378 183859 178757 168230 171418 176552 171951 170975 170226 159322 160662 170747
13276 170747 184750 196752 194889 180699 174466 185111 207351 212295 191777 182808 191191 194090 198060
$$ packed form
13371A19348m195k0025o161O284O556K832L065K727J2056j0735k1202J082J1272
13358A02904K6750m184p308l977n507J53J503L381k77n908j29J3087R411J2135
13344A42034j3864p659J0281J6967j7908j139K4535O912j3672j2327m182P750
13332A37728O372p405L927m744j6762L543p42p423N987P66J4734J0275q690j0608
13318A26958l552J8768J1102l05q037j396O828p166j746K094M388p028o964J1024
13304A44968P670l604L863k526L270K826M883P990K638j556Q7q170P1K695j5827
13289A49278J0005J2095J2481n102j0527L188N134m601r76p49j0904J340J0085
13276A70747J4003J2002j863j4190o233J0645K2240M944k0518q969Q383K899L970
$$ plain form
13263 198060 198290 204726 190946 182395 196739 207046 216229 228454 230979 223758 219206 242126 247816
13250 247816 249423 235190 226889 216306 208720 234307 242815 231798 234791 247387 257280 255045 264441
13237 264441 265914 262520 279472 279935 272825 283429 294222 271513 273799 288590 308282 311842 305535
13224 305535 304276 313356 311360 314389 321600 308804 305800 317552 335696 338326 324517 331765 332374
13211 332374 329158 328993 336804 339881 340294 334505 349071 362525 365601 370645 376064 372352 387522 397021
13197 397021 401248 417867 432468 433020 439271 434472 431052 446001 470051 475769 475533 485500 499993
13184 499993 497005 487133 481318 489727 520097 558787 617150 698884 756206 771465 755077 711770
13172 711770 665136 618804 597676 614317 626840 624425 623016 626657 642277 653937 677554 702546
$$ packed form
13263A98060K30O436j3780q551J4344J0307R183J2225K525p221m552K2920N690
13250B47816J607j4233q301j0583p586K5587Q508j1017K993J2596R893k235R396
13237B64441J473l394J6952M63p110J0604J0793k2709K286J4791J9692L560o307
13224C05535j259R080j996L029P211j2796l004J1752J8144K630j3809P248O09
13211C32374l216j65P811L077M13n789J4566J3454L076N044N419l712J5170R499
13197C97021M227J6619J4601N52O251m799l420J4949K4050N718k36R967J4493
13184D99993k988r872n815Q409L0370L8690N8363Q1734N7322J5259j6388m3307
13172G11770m6634m6332k1128J6641J2523k415j409L641J5620J1660K3617K4992
$$ plain form
13160 702546 720813 724510 740755 766525 793883 826232 840398 838174 852717 871336 900940 924525
13148 924525 944143 969643 1001557 1029895 1052368 1064359 1093230 1130498 1165121 1203777 1237221
13137 1237221 1268476 1313591 1364204 1406942 1459759 1525775 1585728 1647787 1709713 1762855 1836090
13126 1836090 1898289 1963268 2044673 2130314 2217151 2305550 2387966 2490044 2577335 2657461 2749327
13115 2749327 2849131 2939974 3029145 3128183 3231935 3331027 3416193 3496146 3581252 3665410 3747443
13104 3747443 3815857 3893180 3952896 4017762 4080020 4159679 4232968 4298776 4365013 4440187 4531217
13093 4531217 4625490 4717714 4807607 4869505 4939501 5013569 5102403 5192847 5260629 5311669 5355203
13082 5355203 5391281 5411921 5423633 5421964 5416204 5395256 5374836 5349958 5316418 5264511 5222811 5189606
$$ packed form
13160G02546J8267L697J6245K5770K7358L2349J4166k224J4543J8619K9604K3585
13148I24525J9618K5500L1914K8338K2473J1991K8871L7268L4623L8656L3444
13137A237221L1255M5115N0613M2738N2817O6016N9953O2059O1926N3142P3235
13126A836090O2199O4979Q1405Q5641Q6837Q8399Q2416J02078Q7291Q0126R1866
13115B749327R9804R0843Q9171R9038J03752R9092Q5166P9953Q5106Q4158Q2033
13104C747443O8414P7323N9716O4866O2258P9659P3289O5808O6237P5174R1030
13093D531217R4273R2224Q9893O1898O9996P4068Q8834R0444O7782N1040M3534
13082E355203L6078K0640J1712j669n760k0948k0420k4878l3540n1907m1700l3205
$$ plain form
13070 5189606 5132024 5080575 5025715 4976996 4924427 4871611 4813379 4751365 4706725 4680722 4658323
13059 4658323 4625861 4580641 4547319 4519891 4480073 4450741 4427980 4395180 4344521 4302723 4253214
13048 4253214 4210329 4171650 4128206 4088974 4051577 4044178 4034230 4013438 3988363 3994305 4002947 4004935
13036 4004935 4019904 4040265 4069764 4097764 4120205 4151977 4201239 4244784 4274786 4326664 4386024
13025 4386024 4435953 4466225 4511980 4570725 4624674 4675169 4715000 4765272 4817793 4876740 4915696
13014 4915696 4943920 4990485 5045328 5107481 5166564 5211901 5264054 5321428 5382658 5431202 5491991
13003 5491991 5556657 5607587 5654686 5686029 5725773 5766867 5799580 5824659 5828050 5828072 5809307 5780211
12991 5780211 5732504 5671647 5615149 5551607 5475666 5384576 5289117 5204369 5134417 5058108 4964976
$$ packed form
13070E189606n7582n1449n4860m8719n2569n2816n8232o2014m4640k6003k2399
13059D658323l2462m5220l3322k7428l9818k9332k2761l2800n0659m1798m9509
13048D253214m2885l8679m3444l9232l7397p399r948k0792k5075N942Q642J988
13036D004935J4969K0361K9499K8000K2441L1772M9262M3545L0002N1878N9360
13025D386024M9929L0272M5755N8745N3949N0495L9831N0272N2521N8947L8956
13014D915696K8224M6565N4843O2153N9083M5337N2153N7374O1230M8544O0789
13003E491991O4666N0930M7099L1343L9744M1094L2713K5079L391K2j8765k9096
12991E780211m7707o0857n6498o3542p5941r1090r5459q4748o9952p6309r3132
$$ plain form
12980 4964976 4879673 4785263 4693098 4609331 4532131 4468041 4383071 4291210 4211152 4128492 4031593
12969 4031593 3964321 3864927 3773753 3706121 3613840 3499287 3406707 3306748 3199856 3092979 2989590
12958 2989590 2888371 2793782 2687528 2568911 2447525 2350150 2265936 2169943 2088081 2012774
12948 2012774 1933971 1865425 1801007 1736711 1660380 1595856 1554152 1502977 1443894 1382809 1320851
12937 1320851 1270674 1234408 1177405 1124071 1094621 1072038 1041347 1003766 971717 938105 908279
12926 908279 864981 827465 784099 742432 724891 729747 719033 692277 677056 653332 635768 632026
12914 632026 618006 600187 581243 564395 546606 520765 499217 486345 482816 471221 452270 432134
12902 432134 423545 416509 414572 395296 358243 336530 329783 328105 316528 303659 294938 298007 306849
$$ packed form
12980D964976q5303r4410r2165q3767p7200o4090q4970r1861q0058q2660r6899
12969D031593o7272r9394r1174o7632r2281j14553r2580r9959j06892j06877j03389
12958B989590j01219r4589j06254j18617j21386r7375q4214r5993q1862p5307
12948B012774p8803o8546o4418o4296p6331o4524m1704n1175n9083o1085o1958
12937A320851n0177l6266n7003n3334k9450k2583l0691l7581l2049l3612k9826
12926I08279m3298l7516m3366m1667j7541M856j0714k6756j5221k3724j7564l742
12914F32026j4020j7819j8944j6848j7789k5841k1548j2872l529j1595j8951k0136
12902D32134q589p036j937j9276l7053k1713o747j678j1577j2869q721L069Q842
$$ plain form
12889 306849 296451 272292 271471 263020 248387 251720 257338 263432 254937 233648 218916 202598 181787
12876 181787 186284 206402 212651 196638 180660 166283 161891 174976 179887 175836 174809 160881 151700
12863 151700 140797 133815 131124 127232 134870 141606 155659 150158 132877 114982 106851 106489 111612
12850 111612 119026 119425 101425 95852 101515 105871 98990 98592 106822 115063 98338 98216 90725 83294
12836 83294 76731 59274 61572 58674 53178 58924 49940 40211 50373 58213 63849 44109 34251 42318
12822 42318 43652 54189 68255 65657 53753 64656 59213 56418 53102 48494 59482 49129 43214
12809 43214 21304 14861 29511 46462 49014 38480 52157 48772 37731 37607 45179 40331 47215
12796 47215 39002 17163 14000 28633 43508 43547 38105 39121 30667 36162 53409 39739 23195
$$ packed form
12889C06849j0398k4159q21q451j4633L333N618O094q495k1289j4732j6318k0811
12876A81787M497K0118O249j6013j5978j4377m392J3085M911m051j027j3928r181
12863A51700j0903o982k691l892P638O736J4053n501j7281j7895q131l62N123
12850A11612P414L99j8000n573N663M356o881l98Q230Q241j6725j22p491p431
12836H3294o563j7457K298k898n496N746q984r729J0162P840N636j9740r858Q067
12822D2318J334J0537J4066k598j1904J0903n443k795l316m608J0988j0353n915
12809D3214k1910o443J4650J6951K552j0534J3677l385j1041j24P572m848O884
12796D7215q213k1839l163J4633J4875L9n442J016q454N495J7247j3670j6544
$$ plain form
12783 23195 13984 28821 26301 14310 35535 39812 20200 9739 14864 23761 17800 17781 14512 5564
12769 5564 -1765 1915 8778 2085 8513 12155 5713 -9453 -9477 -4058 -13112 -14791 -7016 -5918 2618
12754 2618 16469 30616 38540 37409 38271 32574 31908 24550 32708 41474 38249 22874 20794 22247
12740 22247 18106 23057 18239 3662 -267 5104 3099 481 3193 7064 1469 7022 21374 25629
12726 25629 25652 21703 7518 -99 6776 3582 9831 12589 924 -6308 -5884 10076 17378 8417
12712 8417 -2138 -1445 -1390 10995 14257 4684 -4170 -4882 -10668 -1436 12784 13713 6033 5262 6265
12697 6265 548 7253 18987 20443 15826 20283 27225 24855 35804 34061 32353 26554 14229 1811
12683 1811 6527 9943 12012 19595 9423 3347 5122 9138 12690 15617 6962 -5110 -4314 -7583
$$ packed form
12783B3195r211J4837k520j1991K1225M277j9612j0461N125Q897n961j9l269q948
12769E564p329L680O863o693O428L642o442j5166k4N419r054j679P775J098Q536
12754B618J3851J4147P924j131Q62n697o66p358Q158Q766l225j5375k080J453
12740B2247m141M951m818j4577l929N371k005k618K712L871n595N553J4352M255
12726B5629K3l949j4185p617O875l194O249K758j1665p232M24J5960P302q961
12712H417j0555O93N5J2385L262r573q854p12n786R232J4220R29p680p71J003
12697F265n717O705J1734J456m617M457O942k370J0949j743j708n799j2325j2418
12683A811M716L416K069P583j0172o076J775M016L552K927q655j2072P96l269
$$ plain form
12669 -7583 8486 22266 20566 5041 1702 -5363 -12144 -13785 -4254 7840 10993 6500 11136 2240
12655 2240 -11395 -548 13874 17649 35982 19842 -3624 -2799 9139 23809 30380 16298 -3865
12642 -3865 -16780 -19801 -11304 -13857 2946 13416 16218 18215 25682 16787 22191 25860 28724 18577
12628 18577 24081 13662 5018 18208 18296 21628 21986 13140 3023 681 11633 17456 4241 -7888
12614 -7888 -8746 -5549 -5465 2026 -4482 -8927 4816 22070 18393 12837 11929 9192 10582 13091 9501
12599 9501 6451 16288 20482 32763 34795 21623 4444 -5650 -7587 -9478 -11338 -4469 -1345 -2994
12585 -2994 -2199 1273 3935 1043 -118 929 4050 11723 17773 17529 22846 23423 9949 3336 9304
12570 9304 11148 18960 34723 39941 35168 29833 22110 24537 25692 12988 3292 11824 29873 22768
$$ packed form
12669g583J6069J3780j700j5525l339p065o781j641R531J2094L153m493M636q896
12655B240j3635J0847J4422L775J8333j6140k3466Q25J1938J4670O571j4082k0163
12642c865j2915l021Q497k553J6803J0470K802J997P467q895N404L669K864j0147
12628A8577N504j0419q644J3190Q8L332L58q846j0117k342J0952N823j3215j2129
12614g888q58L197Q4P491o508m445J3743J7254l677n556r08k737J390K509l590
12599I501l050R837M194J2281K032j3172j7179j0094j937j891j860O869L124j649
12585b994P95L472K662k892j161J047L121P673O050k44N317N77j3474o613N968
12570I304J844P812J5763N218m773n335p723K427J155j2704r696Q532J8049p105
$$ plain form
12556 22768 16886 5630 12427 15684 25983 23903 25024 18079 31583 51893 39091 24945 14016
12543 14016 12632 9702 17321 16262 14165 27102 35740 28710 36500 41931 40657 39610 33515 38468
12529 38468 29382 27414 19471 9014 3553 20865 32932 42241 37740 26607 23042 22110 21754 22517
12515 22517 20961 17406 14366 16877 18291 29935 25398 23995 20463 18608 10801 10822 22058 30051
12501 30051 27220 28460 35628 35767 32835 35551 22140 22739 27094 12169 -2732 4072 13293 5179
12487 5179 -5240 -8349 2141 11965 12682 13484 9299 -1219 -14632 -16845 -18627 -14796 -17836 -7726
12473 -7726 15792 25838 11195 7819 22131 9740 -6112 -881 13149 26772 20310 26905 34229
12460 34229 19926 3327 5170 15929 17093 8610 810 8198 28376 24334 5530 -4245 2020
$$ packed form
12556B2768n882j1256O797L257J0299k080J121o945J3504K0310j2802j4146j0929
12543A4016j384k930P619j059k097J2937Q638p030P790N431j274j047o095M953
12529C8468r086j968p943j0457n461J7312J2067R309m501j1133l565r32l56P63
12515B2517j556l555l040K511J414J1644m537j403l532j855p807K1J1236P993
12501C0051k831J240P168J39k932K716j3411N99M355j4925j4901O804R221q114
12487E179j0419l109J0490R824P17Q02m185j0518j3413k213j782L831l040J0110
12473g726K3518J0046j4643l376J4312j2391j5852N231J4030J3623o462O595P324
12460C4229j4303j6599J843J0759J164q483p800P388K0178m042j8804r775O265
$$ plain form
12447 2020 26905 20905 8868 -1393 24 4540 2379 3287 1703 6365 13666 -1716 -4219 1900
12433 1900 9316 -626 -448 11267 -5880 -27161 -36455 -45776 -43419 -31357 -18287 -11996 -10328 -7647
12419 -7647 -1503 3883 10628 1089 -11991 -15739 -10702 -12393 -13487 -6951 -8011 -18939 -26749 -30767
12405 -30767 -19474 -12683 -6486 -6949 -11506 -16043 -13619 -14833 1252 18407 15239 3636 -9801
12392 -9801 -2251 7038 13624 13635 13332 8470 10018 495 -10309 -14525 -16210 -25742 -29349 -26272 -22258
12377 -22258 -19728 -2137 5497 2912 -1493 -4955 7240 5481 -18865 -18959 -16425 -12943 -27163 -23089
12363 -23089 -20297 -3109 8216 -1893 6391 16963 6501 -1151 2073 10503 12771 1686 -9484
12350 -9484 -19797 -16666 -17431 -21787 -36417 -38525 -37350 -33111 -26138 -24928 -14848 -3603 -5047 -17182
$$ packed form
12447B020K4885o000j2037j0261J417M516k161R08j584M662P301j5382k503O119
12433A900P416r942J78J1715j7147k1281r294r321K357J2062J3070O291J668K681
12419g647O144N386O745r539j3080l748N037j691j094O536j060j0928p810m018
12405c0767J1293O791O197m63m557m537K424j214J6085J7155l168j1603j3437
12392i801P550R289O586J1l03m862J548r523j0804m216j685r532l607L077M014
12377b2258K530J7591P634k585m405l462J2195j759k4346r4K534L482j4220M074
12363b3089K792J7188J1325j0109Q284J0572j0462p652L224Q430K268j1085j1170
12350i484j0313L131p65m356j4630k108J175M239O973J210J0080J1245j444j2135
$$ plain form
12336 -17182 -22860 -27574 -32641 -24418 -18582 -13957 -27888 -26202 -17391 -10913 -13207 -15026 -19523 -31884
12322 -31884 -30533 -27767 -26672 -31705 -28067 -25874 -13297 -11672 -17067 -12024 -4363 -13451 168 6139
12308 6139 -5561 -7533 -9276 3184 11057 9410 5310 1308 -92 -2604 -9985 12218 1262 -10381
12294 -10381 -12226 -15283 -37287 -37098 -33606 -23425 -15044 -2859 7526 15594 28026 9216 -10831
12281 -10831 -3611 -10375 -13056 -20185 -30529 -28777 -35065 -11941 5560 3211 -7045 -13345 -26073
12268 -26073 -42118 -38864 -27892 -28576 -37842 -45478 -35740 -13360 1885 1920 1569 -1016 1645 -2122
12254 -2122 -5598 -5084 -5334 -14198 -27086 -17502 13237 30607 24941 21051 9332 7943 4185 -4163
12240 -4163 4722 8104 -1124 -7495 -1038 5833 10738 -6086 -16756 -26285 -20275 -21000 -27476 -28207 -19677
$$ packed form
12336a7182n678m714n067Q223N836M625j3931J686Q811O478k294j819m497j2361
12322c1884J351K766J095n033L638K193J2577J625n395N043P661r088J3619N971
12308F139j1700j972j743J2460P873j647m100m002j400k512p381K2203j0956j1643
12294a0381j845l057k2004J89L492J0181Q381J2185J0385Q068J2432j8810k0047
12281a0831P220o764k681p129j0344J752o288K3124J7501k349j0256o300j2728
12268b6073j6045L254J0972o84r266p636R738K2380J5245L5l51k585K661l767
12254b122l476N14k50q864j2888R584L0739J7370n666l890j1719j389l758q348
12240d163Q885L382r228o371O457O871M905j6824j0670r529O010p25o476p31Q530
$$ plain form
12225 -19677 -18159 -20827 -39124 -40818 -25236 -31360 -46526 -31729 -24434 -22653 -8313 6726 10360
12212 10360 -1319 -561 2427 7622 4901 9190 6475 -6801 -4839 2930 -1427 -14720 -4179 10163
12198 10163 8850 4946 7802 21872 23714 14007 20205 24388 20615 15170 23158 43195 75463 118013
12184 118013 151205 150003 127646 86923 57864 45571 46246 31447 22126 16494 1583 -4762 -11339
12171 -11339 -22666 -9454 14413 14334 12854 -2129 -30128 -34055 -11875 5720 6626 18528 10661
12158 10661 301 7471 -2152 -3645 7074 20973 23145 22676 25215 44829 65235 56611 72201
12145 72201 100418 135305 196038 275309 396268 516669 534616 462010 348425 250963 176425
12134 176425 121307 90659 87395 89294 65899 51227 47200 53872 59473 54090 44039 30387 40905
$$ packed form
12225a9677J518k668j8297j694J5582o124j5166J4797P295J781J4340J5039L634
12212A0360j1679P58K988N195k721M289k715j3276J962P769m357j3293J0541J4342
12198A0163j313l904K856J4070J842r707O198M183l773n445P988K0037L2268M2550
12184A18013L3192j202k2357m0723k9059j2293O75j4799r321n632j4911o345o577
12171a1339j1327J3212K3867p9j480j4983k7999l927K2180J7595R06J1902p867
12158A0661j0360P170r623j493J0719J3899K172m69K539J9614K0406q624J5590
12145G2201K8217L4887O0733P9271J20959J20401J7947p2606j13585r7462p4538
12134A76425n5118l0648l264J899k3395j4672m027O672N601n383j0051j3652J0518
$$ plain form
12121 40905 46233 41256 37177 30588 11227 5442 20259 23441 20960 22201 19786 24418 30859 21816
12107 21816 17914 24395 35702 61592 67193 82110 96981 123708 174068 236073 341430 477639
12095 477639 557249 497396 384333 273481 178299 120667 107146 88606 61206 54443 56468
12084 56468 51364 39847 25756 21319 24459 21514 12013 19371 32668 47717 53152 46293 30881
12071 30881 21178 18038 16304 30112 46620 32357 23146 14076 25388 33543 24589 11889 13390
12058 13390 17843 16666 38930 65318 78533 113029 165996 188528 170224 134280 124542 108754
12046 108754 80330 68111 57157 33823 8756 -931 13801 20578 23470 15095 -942 -19544
12034 -19544 -14023 -3364 -16630 -19913 2869 736 -7858 -6610 1805 1106 5717 6892 -2097 1155
$$ packed form
12121D0905N328m977m079o589j9361n785J4817L182k481J241k415M632O441r043
12107B1816l902O481J1307K5890N601J4917J4871K6727N0360O2005J05357J36209
12095D77639P9610n9853j13063j10852r5182n7632j3521j8540k7400o763K025
12084E6468n104j1517j4091m437L140k945r501P358J3297J5049N435o859j5412
12071C0881r703l140j734J3808J6508j4263r211r070J1312Q155q954j2700J501
12058A3390M453j177K2264K6388J3215L4496N2967K2532j8304l5944r738j5788
12046A08754k8424j2219j0954k3334k5067r687J4732O777K892q375j6037j8602
12034a9544N521J0659j3266l283K2782k133q594J248Q415o99M611J175q989L252
$$ plain form
12020 1155 -1369 1792 14954 17530 34069 52173 56026 49195 62342 85088 98256 101639 90665
12007 90665 82403 57852 30777 11614 3105 9391 -183 7101 4626 -3378 -5028 -3809 -10106 -19560
11993 -19560 -34606 -24349 -11468 -595 6552 8150 11190 2603 -3612 -11629 -11630 -677 9667 16188
11979 16188 12936 9645 14031 28953 27445 16781 29652 56131 61261 68693 78156 95235 117902
11966 117902 136515 126282 103440 92534 101908 91624 65582 38822 28114 22273 22360 23477 23061
11953 23061 18981 20353 20597 16573 14257 21031 16853 -4915 -10536 680 -6224 -8580 -5676 2963
11939 2963 5699 4327 7137 12939 -3124 -743 6340 14138 5189 -6206 -10593 10111 35206 29889
11925 29889 28535 40823 65421 79952 86548 89844 91783 74691 56875 31688 18981 21814 33981
$$ packed form
12020A155k524L161J3162K576J6539J8104L853o831J3147K2746J3168L383j0974
12007I0665q262k4551k7075j9163q509O286r574P284k475q004j650J219o297r454
11993a9560j5046J0257J2881J0873P147J598L040q587o215q017jJ0953J0344O521
11979A6188l252l291M386J4922j508j0664J2871K6479N130P432R463J7079K2667
11966A17902J8613j0233k2842j0906R374j0284k6042k6760j0708n841Q7J117m16
11953B3061m080J372K44m024k316O774m178k1768n621J1216o904k356K904Q639
11939B963K736j372K810N802j6063K381P083P798q949j1395m387K0704K5095n317
11925B9889j354J2288K4598J4531O596L296J939j7092j7816k5187j2707K833J2167
$$ plain form
11912 33981 28650 13010 -7382 -1300 3224 13353 20568 6925 -311 -10692 -11496 -19581 -20003 -10588
11898 -10588 -2692 2746 2180 -5075 7239 16172 22034 25876 30403 28323 13798 4228 7140 7378
11884 7378 11101 21608 16837 17972 -1438 -2702 11082 12765 4991 1458 4644 -4040 -9637 -4823
11870 -4823 -13702 -1341 2467 -3439 869 6514 6681 9668 21969 21585 26371 5590 -6381 -12894
11856 -12894 -11374 -2063 9739 9298 7629 6025 541 11588 20831 20372 24101 35713 36974 18554
11842 18554 8485 -308 4358 3575 -1851 7929 8877 1249 1546 10602 26656 30167 20794 26836 25942
11827 25942 33265 29255 35836 46204 45844 32043 16121 6300 12612 8413 6408 12652 9836 8567
11813 8567 30299 36783 30095 33692 33241 52854 54315 32719 22223 30872 43094 43133 58649 62422
$$ packed form
11912C3981n331j5640k0392O082M524J0129P215j3643p236j0381q04q085m22R415
11898a0588P896N438n66p255J2314Q933N862L842M527k080j4525r570K912K38
11884G378L723J0507m771J135j9410j264J3784J683p774l533L186q684n597M814
11870d823q879J2361L808n906M308N645J67K987J2301l84M786k0781j1971o513
11856a2894J520R311J1802m41j669j604n484J1047R243m59L729J1612J261j8420
11842A8554j0069q793M666p83n426R780R48p628K97R056J6054L511r373O042q94
11827B5942P323m010O581J0368l60j3801j5922r821O312m199k005O244k816j269
11813H567K1732O484o688L597m51J9613J461k1596j0496Q649J2222L9J5516L773
$$ plain form
11799 62422 61006 60518 43669 27270 22526 16952 14400 26849 28752 32189 23974 10040 10670 23950
11785 23950 34567 29452 29300 29664 32578 23448 16578 11579 38050 46234 33463 23967 36913 32707
11771 32707 23668 23604 38203 39359 40590 37054 39290 34545 43949 56009 53842 41013 34578 48780
11757 48780 48031 54905 52771 44475 35049 40928 62180 72064 78359 67953 58099 64671 64212 72331
11743 72331 70810 58266 49913 46518 29105 22597 38514 46619 50351 61193 54788 56696 52231
11730 52231 47072 40280 34885 43495 47491 52571 52243 51795 62201 63958 52541 51544 55653 54055 63550
11715 63550 70864 54296 48925 58900 61876 53513 45435 29495 23832 8094 12149 3742 10663 21347
11701 21347 22308 8463 18461 48618 55313 48365 53452 48659 39754 41503 34148 16771 15671 25994
$$ packed form
11799F2422j416m88j6849j6399m744n574k552J2449J903L437q215j3934O30J3280
11785B3950J0617n115j52L64K914r130o870m999K6471Q184j2771r496J2946m206
11771C2707r039o4J4599J156J231l536K236m745R404J2060k167j2829o435J4202
11757D8780p49O874k134q296r426N879K1252R884O295j0406r854O572m59Q119
11743G2331j521j2544q353l395j7413o508J5917Q105L732J0842o405J908m465
11730E2231n159o792n395Q610L996N080l28m48J0406J757j1417r97M109j598R495
11715F3550P314j6568n371R975K976q363q078j5940n663j5738M055q407O921J0684
11701B1347R61j3845R998L0157O695o948N087m793q905J749p355j7377j100J0323
$$ plain form
11687 25994 29377 30398 38678 52040 32149 36750 42824 46189 38619 44942 52490 61806 62125 62855
11673 62855 59562 66076 62398 55461 42814 55369 48265 47168 42379 42174 44484 44588 34145 40804
11659 40804 41254 37157 41250 42457 58499 47501 44689 51498 52633 58902 72928 59685 57084 57028
11645 57028 53416 33840 37276 53304 36498 31394 34599 35351 37141 49037 52361 43205 25267
11632 25267 19240 22940 39285 31034 28550 27729 37345 41403 36831 53471 53984 59367 58223 66380
11618 66380 70804 57544 51249 38755 32683 39453 50928 50471 44582 53628 46228 44243 39990 30963
11604 30963 42972 64519 75522 72719 63030 58374 60858 67745 82318 64076 53154 37899 35883
11591 35883 53073 68743 63664 59891 67417 55452 46002 43051 52243 73686 77135 68355 66485
$$ packed form
11687B5994L383J021Q280J3362j9891M601O074L365p570O323P548R316L19P30
11673F2855l293O514l678o937j2647J2555p104j097m789k05K310J04j0443O659
11659D0804M50m097M093J207J6042j0998k812O809J135O269J4026j3243k601n6
11645E7028l612j9576L436J6028j6806n104L205P52J790J1896L324r156j7938
11632B5267o027L700J6345q251k484q21R616M058m572J6640N13N383j144Q157
11618F6380M424j3260o295j2494o072O770J1475m57n889R046p400j985m253r027
11604C0963J2009K1547J1003k803r689m656K484O887J4573j8242j0922j5255k016
11591C5883J7190J5670n079l773P526j1965r450k951R192K1443L449q780j870
$$ plain form
11578 66485 60167 46370 57350 72866 72700 77037 65579 74162 86912 82924 70867 63009 71042
11565 71042 85988 89303 84941 93953 93104 96890 86822 92376 93809 93467 85411 83991 94368 98325
11551 98325 90826 88635 99847 104037 101562 98065 101996 100449 81029 75828 71977 70914 81018 87281
11537 87281 70070 70976 82205 83867 83513 87199 94531 103718 106014 114819 127666 116665 110468 108148
11523 108148 112113 118241 114612 92989 72062 75262 89575 94586 90987 116664 128158 113611 116376
11510 116376 105604 106100 106317 109890 128680 126640 123329 137274 138065 134041 130007 111831 94936 99224
11496 99224 113902 122817 141878 148336 148747 163660 179342 137204 139763 147340 149393 156211 180855
11483 180855 191460 195451 197269 206001 212799 211649 192735 178092 173006 179290 173897 178541 184816
$$ packed form
11578F6485o318j3797J0980J5516j66M337j1458Q583J2750l988j2057p858Q033
11565G1042J4946L315m362R012q49L786j0068N554J433l42q056j420J0377L957
11551I8325p499k191J1212M190k475l497L931j547j9420n201l851j063J0104O263
11537H7281j7211R06J1229J662l54L686P332R187K296Q805J2847j1001o197k320
11523A08148L965O128l629k1623k0927L200J4313N011l599K5677J1494j4547K765
11510A16376j0772M96K17L573J8790k040l311J3945P91m024m034j8176j6895M288
11496I9224J4678Q915J9061O458M11J4913J5682m2138K559P577K053O818K4644
11483A80855J0605L991J818Q732O798j150j8914j4643n086O284n393M644O275
$$ plain form
11470 184816 206809 207901 201545 193635 183342 189946 217451 223197 228857 247973 270801 271425 279535
11457 279535 283258 279934 273230 271600 292695 302250 297531 288989 302359 322488 336132 340516 351202
11444 351202 350382 357696 358717 372068 382892 389234 410728 419031 427647 451963 475557 500805 541928
11431 541928 561232 580383 597224 637589 672382 710778 757179 811896 875312 932403 994160
11420 994160 1066658 1143950 1236044 1331333 1446348 1565284 1705643 1853095 2017666 2212833
11410 2212833 2427298 2658693 2924449 3192717 3462906 3734204 4003482 4234633 4425406
11401 4425406 4578164 4670545 4703851 4674827 4597732 4507765 4409684 4331851 4268236 4225945 4231882
11390 4231882 4250330 4295282 4394693 4524561 4663254 4811047 4955599 5055213 5119561 5121204 5052933
$$ packed form
11470A84816K1993J092o356p910j0293O604K7505N746N660J9116K2828O24Q110
11457B79535L723l324o704j630K1095R555m719q542J3370K0129J3644M384J0686
11444C51202q20P314J021J3351J0824O342K1494Q303Q616K4316K3594K5248M1123
11431E41928J9304J9151J6841M0365L4793L8396M6401N4717O3416N7091O1757
11420I94160P2498P7292R2094R5289J15015J18936J40359J47452J64571J95167
11410B212833K14465K31395K65756K68268K70189K71298K69278K31151J90773
11401D425406J52758R2381L3306k9024p7095q9967r8081p7833o3615m2291N937
11390D231882J8448M4952R9411J29868J38693J47793J44552R9614O4348J643o8271
$$ plain form
11379 5052933 4893430 4676442 4426243 4152621 3865202 3595968 3336906 3089021 2870788
11370 2870788 2666053 2476591 2304202 2172827 2056488 1941079 1854700 1788990 1727218 1680871
11360 1680871 1639319 1612552 1599165 1590946 1595799 1604917 1618366 1646467 1701043 1771408 1836279 1907658
11348 1907658 1977720 2070435 2189616 2336216 2503228 2685305 2901226 3123826 3371757 3659638
11338 3659638 3981435 4324414 4672886 5035464 5384739 5706156 5991737 6225250 6373678
11329 6373678 6452104 6490945 6515901 6536471 6568608 6602135 6694451 6850000 7070275 7343883 7659353
11318 7659353 8015395 8390918 8750679 9055377 9292366 9426833 9424762 9312064 9090651 8796277
11308 8796277 8446861 8077245 7675901 7308515 6977287 6712173 6508236 6341920 6224202
$$ packed form
11379E052933j59503k16988k50199k73622k87419k69234k59062k47885k18233
11370B870788k04735j89462j72389j31375j16339j15409q6379o5710o1772m6347
11360A680871m1552k6767j3387q219M853R118J3449K8101N4576P0365O4871P1379
11348A907658P0062R2715J19181J46600J67012J82077K15921K22600K47931K87881
11338C659638L21797L42979L48472L62578L49275L21417K85581K33513J48428
11329F373678P8426L8841K4956K0570L2137L3527R2316J55549K20275K73608L15470
11318G659353L56042L75523L59761L04698K36989J34467k071j12698k21413k94374
11308H796277l49416l69616m01344l67386l31228k65114k03937j66316j17718
$$ plain form
11299 6224202 6152145 6087223 6012403 5940955 5841453 5679092 5471820 5220918 4920517 4598590
11289 4598590 4280857 3966282 3671888 3382698 3119481 2890186 2676612 2494381 2333021
11280 2333021 2190386 2058487 1945298 1848992 1773998 1692715 1626176 1576380 1545990 1514528 1501583
11269 1501583 1500521 1504059 1520636 1535409 1564641 1589046 1633386 1688462 1757365 1845849 1952429
11258 1952429 2086190 2233081 2389482 2569263 2775281 3002779 3257425 3539847 3823455
11249 3823455 4130089 4451429 4752028 5022668 5241571 5387668 5471252 5507148 5536091 5576820
11239 5576820 5637981 5726105 5818530 5892496 5914279 5860664 5752081 5629747 5503347 5421011 5382334
11228 5382334 5381772 5409269 5411361 5371765 5310975 5188368 5013974 4819058 4626342 4432405 4284746
$$ packed form
11299F224202p2057o4922p4820p1448r9502j62361k07272k50902l00401l21927
11289D598590l17733l14575k94394k89190k63217k29295k13574j82231j61360
11280B333021j42635j31899j13189r6306p4994q1283o6539m9796l0390l1462j2945
11269A501583j062L538J6577J4773K9232K4405M4340N5076O8903Q8484J06580
11258A952429J33761J46891J56401J79781K06018K27498K54646K82422K83608
11249C823455L06634L21340L00599K70640K18903J46097Q3584L5896K8943M0729
11239E576820O1161Q8124R2425P3966K1783n3615j08583j22334j26400q2336l8677
11228E382334n62K7497K092l9596o0790j22607j74394j94916j92716j93937j47659
$$ plain form
11217 4284746 4188767 4162147 4233819 4405736 4670251 4982355 5240949 5348697 5230049 4880965
11207 4880965 4361953 3785932 3243926 2797380 2443107 2151224 1930937 1778576 1658348
11198 1658348 1558727 1485206 1430168 1387848 1376265 1396590 1444880 1511343 1607747 1757166 1966177
11187 1966177 2239927 2488085 2663122 2709318 2627880 2445785 2216210 2000500 1827016 1699044
11177 1699044 1656288 1694744 1809294 2000232 2291692 2684069 3183067 3732660 4220668 4510458
11167 4510458 4531659 4283405 3834856 3305016 2811841 2414926 2135273 1933157 1799936 1732524
11157 1732524 1715470 1723081 1774233 1843932 1961376 2124248 2377912 2711545 3150311 3751398
11147 3751398 4553235 5566947 6712788 7774075 8504236 8703760 8325261 7503649 6424476
$$ packed form
11217D284746r5979k6620P1672J71917K64515L12104K58594J07748j18648l49084
11207D880965n19012n76021n42006m46546l54273k91883k20287j52361j20228
11198A658348r9621p3521n5038m2320j1583K0325M8290O6463R6404J49419K09011
11187A966177K73750K48158J75037M6196q1438j82095k29575k15710j73484j27972
11177A699044m2756L8456J14550J90938K91460L92377M98998N49593M88008K89790
11167D510458K1201k48254m48549n29840m93175l96915k79653k02116j33221o7412
11157A732524j7054P611N1152O9699J17444J62872K53664L33633M38766O01087
11147C751398Q01837J013712J145841J061287P30161J99524l78499q21612j079173
$$ plain form
11138 6424476 5320613 4359651 3606089 3048547 2651798 2377463 2181690 2043399 1952902
11129 1952902 1899727 1864483 1869345 1951534 2048590 2199750 2451991 2819653 3298591 3838818
11119 3838818 4356862 4780100 4998483 4980704 4680161 4164058 3568110 3016446 2579778 2230938
11109 2230938 1973395 1805706 1720979 1712271 1823366 2036933 2327116 2612912 2811872 2851082
11099 2851082 2714757 2446654 2100396 1773722 1482965 1256157 1106537 1025980 977020 944210
11089 944210 920372 935537 965234 1008549 1074428 1181365 1320580 1524402 1806694 2190657
11079 2190657 2699519 3306314 3933023 4442041 4682596 4616927 4269897 3718899 3083150 2495474
11069 2495474 2025327 1677853 1429979 1261739 1147390 1059059 999542 978333 956195 941989
$$ packed form
11138F424476j103863r60962p53562n57542l96749k74335j95773j38291r0497
11129A952902n3175l5244M862Q2189R7056J51160K52241L67662M78938N40227
11119C838818N18044M23238K18383j7779l00543n16103n95948n51664m36668l48840
11109B230938k57543j67689q4727q708J11095K13567K90183K85796J98960L9210
11099B851082j36325k68103l46258l26674k90757k26808j49620q0557m8960l2810
11089I44210k3838J5165K9697M3315O5879J06937J39215K03822K82292L83963
11079B190657N08862O06795O26709N09018K40555o5669l47030n50998o35749n87676
11069B495474m70147l47474k47874j68240j14349q8331n9517k1209k2138j4206
$$ plain form
11059 941989 964744 1000965 1062321 1166730 1329633 1538765 1784459 2027707 2243737 2378334
11049 2378334 2382672 2243148 1992817 1696622 1424158 1175550 950363 776736 663406 573945
11039 573945 486496 423268 373940 326641 295548 257193 242287 238386 209917 179716 154405 131473
11027 131473 115018 122450 115547 104228 103383 91384 96797 82378 68773 69719 70393 64669 61826 51068
11013 51068 33271 28855 31750 37749 39252 34084 39468 34887 38354 31850 26129 29143 24194 19971
10999 19971 21121 28494 35613 25337 26106 32986 30353 31704 38814 38174 30733 23134 21118 29728 22309
10984 22309 11104 4127 17509 27194 26353 35324 33899 18129 7257 15946 32861 41141 30094
10971 30094 16574 19425 26806 42175 48991 50419 38951 28511 25449 30820 33440 22830 27500
$$ packed form
11059I41989K2755L6221O1356J04409J62903K09132K45694K43248K16030J34597
11049B378334M338j39524k50331k96195k72464k48608k25187j73627j13330q9461
11039E73945q7449o3228m9328m7299l1093l8355j4906l901k8469l0201k5311k2932
11027A31473j6455P432o903j1319q45j1999N413j4419j3605R46O74n724k843j0758
11013E1068j7797m416K895N999J503n168N384m581L467o504n721L014m949m223
10999A9971J150P373P119j0276P69O880k633J351P110o40p441p599k016Q610p419
10984B2309j1205o977J3382R685q41Q971j425j5770j0872Q689J6915Q280j1047
10971C0094j3520K851P381J5369O816J428j1468j0440l062N371K620j0610M670
$$ plain form
10958 27500 36913 41061 35521 36202 31724 18217 15588 39690 28579 27277 40060 53189 50419
10945 50419 56210 64532 47662 27451 27233 31688 42622 44193 48510 39749 26863 26822 38626 43443
10931 43443 43497 36436 22659 25990 36684 22976 24793 29449 25972 32894 24095 15150 27806 50743
10917 50743 52502 34726 33287 50611 40846 18057 19545 28356 40389 50675 65833 59132 40197
10904 40197 41683 30113 38911 53501 52312 43092 37902 40362 41346 41398 44719 38678 32104 31012 27807
10889 27807 16255 29186 41052 43838 37949 49323 50440 66684 76594 75020 79629 90153 85128
10876 85128 71548 50714 54122 65654 74345 81768 68030 66872 68827 60912 53767 45460 38785
10863 38785 42049 46459 43560 29578 25475 34873 32652 27989 35131 49118 58081 54658 45902 37571
$$ packed form
10958B7500R413M148n540O81m478j3507k629K4102j1111j302J2783J3129k770
10945E0419N791Q322j6870k0211k18M455J0934J571M317q761j2886m1J1804M817
10931D3443N4p061j3777L331J0694j3708J817M656l477O922q799q945J2656K2937
10917E0743J759j7776j439J7324r765k2789J488Q811J2033J0286J5158o701j8935
10904D0197J486j1570Q798J4590j189r220n190K460R84N2L321o041o574j092l205
10889B7807j1552J2931J1866K786n889J1374J117J6244R910j574M609J0524n025
10876H5128j3580k0834L408J1532Q691P423j3738j158J955p915p145q307o675
10863C8785L264M410k899j3982m103R398k221m663P142J3987Q963l423q756q331
$$ plain form
10849 37571 28531 29751 35638 39184 41726 48238 46552 31028 27377 33767 33781 27281 17609 23478 46062
10834 46062 45864 47461 55934 44281 42776 36206 18670 23509 21395 17853 19833 29234 33735 29327
10820 29327 38409 38782 31741 23081 24402 18194 6007 15941 30298 24977 36408 35044 38161 41047
10806 41047 34715 44847 51364 52309 45246 44933 40255 52184 66019 64012 58803 50767 53141 53042 58795
10791 58795 54396 36404 22995 31790 38533 36861 34791 36070 48703 54976 51938 53232 41024
10778 41024 30903 32877 30937 28139 25760 38012 44856 33603 34175 32827 23649 20017 19823 17817
10764 17817 19625 29965 33577 35569 38398 41830 44519 38729 53628 64662 70675 59826 43408
10751 43408 18079 -4535 -8410 20156 39799 39067 45795 40943 47851 54778 43294 32204 18849
$$ packed form
10849C7571r040J220N887L546K542O512j686j5524l651O390J4o500r672N869K2584
10834D6062j98J597Q473j1653j505o570j7536M839k114l542J980R401M501m408
10820B9327R082L73p041q660J321o208j2187R934J4357n321J1431j364L117K886
10806D1047o332J0132O517R45p063l13m678J1929J3835k007n209q036K374r9N753
10791E8795m399j7992j3409Q795O743j672k070J279J2633O273l038J294j2208
10778D1024j0121J974j940k798k379J2252O844j1253N72j348r178l632j94k006
10764A7817J808J0340L612J992K829L432K689n790J4899J1034O013j0849j6418
10751D3408k5329k2614l875K8566J9643p32O728m852O908O927j1484j1090j3355
$$ plain form
10738 18849 14612 10415 11517 5363 11984 23443 47767 55476 70062 71262 46656 34622 35865
10725 35865 31991 27028 20300 12392 13372 2062 8902 27174 49121 51237 52786 54517 47840 39443
10711 39443 49968 59641 52739 42623 53828 58001 57227 55611 57740 69572 68930 60787 66954 67134
10697 67134 45759 26301 20742 27777 21679 31173 44558 60213 82315 85242 77756 74094 60254
10684 60254 36425 12789 24014 34411 36142 22468 3320 268 17726 17532 10720 16036 12837
10671 12837 17233 22894 42804 53865 64424 76575 77652 67155 70457 67319 68383 53332 55276
10658 55276 65451 66295 58613 44476 37472 43103 34429 24859 28751 38559 53759 73507 72827 74996
10644 74996 72977 65340 71989 57445 36713 32784 24667 27059 34096 24477 17268 25663 27452 36428
$$ packed form
10738A8849m237m197J102o154O621J1459K4324P709J4586J200k4606j2034J243
10725C5865l874m963o728p908R80j1310O840J8272K1947K116J549J731o677q397
10711C9443J0525R673o902j0116J1205M173p74j616K129J1832o42q143O167J80
10697F7134k1375j9458n559P035o098R494J3385J5655K2102K927p486l662j3840
10684F0254k3829k3636J1225J0397J731j3674j9148l052J7458j94o812N316l199
10671A2837M396N661J9910J1061J0559J2151J077j0497L302l138J064j5051J944
10658E5276J0175Q44p682j4137p004N631q674r570L892R808J5200J9748o80K169
10644G4996k019p637O649j4544k0732l929q117K392P037r619p209Q395J789Q976
$$ plain form
10630 36428 37049 37001 38482 49698 60007 81691 111285 111342 127498 137392 146150 137696 120669 116698
10616 116698 95844 68322 42159 50705 54668 41004 27774 26023 27821 32652 37550 38193 42377
10603 42377 41120 30382 35032 39838 41164 51327 54167 59104 68548 61692 64343 55638 35076 38913
10589 38913 43679 32825 29931 29256 40265 39826 53120 60342 59048 77411 112231 126364 105418
10576 105418 89901 75799 61220 49639 48779 55911 46910 28993 24110 28624 34097 39133 40854
10563 40854 45686 49436 49556 70916 85925 115289 140741 164640 183562 199848 210402 212999 210781
10550 210781 181664 153354 121035 92328 77621 61364 61191 61224 52215 47920 37436 33485 44603
10537 44603 50653 42564 45870 54756 60445 76297 74500 79177 90337 97745 81835 69788 83090
$$ packed form
10630C6428O21m8J481J1216J0309K1684K9594N7J6156R894Q758q454j7027l971
10616A16698k0854k7522k6163Q546L963j3664j3230j751J798M831M898O43M184
10603D2377j257j0738M650M806J326J0163K840M937R444o856K651q705k0562L837
10589C8913M766j0854k894o75J1009m39J3294P222j294J8363L4820J4133k0946
10576A05418j5517j4102j4579j1581q60P132r001j7917m883M514N473N036J721
10563D0854M832L750J20K1360J5009K9364K5452K3899J8922J6286J0554K597k218
10550B10781k9117k8310l2319k8707j4707j6257j73L3r009m295j0484l951J1118
10537D4603O050q089L306Q886N689J5852j797M677J1160P408j5910j2047J3302
$$ plain form
10524 83090 88384 70169 64061 43008 30011 28679 24437 28917 33693 26620 22383 22560 37792 51004
10510 51004 57437 58710 65434 64940 57128 48801 26352 14964 5841 15251 25217 25065 30366 22338
10496 22338 19499 26806 20190 23678 27009 33572 38510 47077 68283 94274 111112 123865 125816
10483 125816 119019 123676 123346 106016 91156 66458 42610 18290 -2200 9185 19762 23403
10471 23403 25840 23462 14541 2190 -6640 -8741 9448 18552 37658 61661 57781 58427 68001 76762
10457 76762 69255 50350 44410 56472 32061 16325 18802 6132 -842 -423 12972 12059 12166 17774
10443 17774 7489 427 19407 22708 12145 10317 18359 25084 38860 17559 9013 19393 29544
10430 29544 36453 35938 29092 35276 41405 39328 29486 26185 9231 9314 10396 10187 2104 7259 20623
$$ packed form
10524H3090N294j8215o108k1053j2997j332m242M480M776p073m237J77J5232J3212
10510E1004O433J273O724m94p812q327k2449j1388r123R410R966j52N301q028
10496B2338k839P307o616L488L331O563M938Q567K1206K5991J6838J2753J951
10483A25816o797M657l30j7330j4860k4698k3848k4320k0490J1385J0577L641
10471B3403K437k378q921j2351q830k101J8189R104J9106K4003l880O46R574Q761
10457G6762p507j8905n940J2062k4411j5736K477j2670o974M19J3395r13J07N608
10443A7774j0285p062J8980L301j0563j828Q042O725J3776k1301q546J0380J0151
10430B9544O909n15o846O184O129k077r842l301j6954Q3J082k09q083N155J3364
$$ plain form
10415 20623 4066 -15685 -7342 -4210 303 8215 13106 9685 250 -2618 -5470 -15488 -27825
10402 -27825 -37077 -31934 -21562 -25044 -22995 -25199 -27283 -24897 -17318 -10699 -5653 -13972 -15514 -655
10388 -655 14655 14843 18517 33636 43307 54143 59795 62288 77849 79985 79584 77384 72061 62068
10374 62068 65119 63451 50940 56060 54392 50725 45540 37438 22922 9748 11014 10956 13513 23206
10360 23206 17169 14434 7505 -783 -1304 8078 15943 10312 8695 -3995 -25021 -26177 -10325 6622
10346 6622 8571 -361 -4861 -1394 -4147 -6890 5473 9585 23706 24555 28654 43351 49857 57843
10332 57843 61970 59607 51231 47018 64301 80598 77621 73550 76445 73264 65269 53617 40809
10319 40809 40765 31184 26911 34095 32313 35472 31751 30224 42292 45960 41486 44342 53771 56601 58241
$$ packed form
10415B0623j6557j9751Q343L132M513P912M891l421r435k868k852j0018j2337
10402b7825r252N143J0372l482K049k204k084K386P579O619N046q319j542J4859
10388f55J5310J88L674J5119R671J0836N652K493J5561K136m01k200n323r993
10374F2068L051j668j2511N120j668l667n185q102j4516j3174J266n8K557R693
10360B3206o037k735o929q288n21R382P865n631j617j2690k1026j156J5852J6947
10346F622J949q932m500L467k753k743J2363M112J4121Q49M099J4697O506P986
10332E7843M127k363q376m213J7283J6297k977m071K895l181p995j1652j2808
10319D0809m4r581m273P184j782L159l721j527J2068L668m474K856R429K830J640
$$ plain form
10304 58241 47534 29241 25868 29815 20238 21085 24444 29003 48828 49575 39876 32018 34895 37503
10290 37503 35399 29918 22878 23714 36913 19806 3545 11848 24816 32759 36484 38337 39945 50249
10276 50249 54321 52653 37619 32674 34693 22410 14201 15082 8689 14390 17709 25850 30399 34843
10262 34843 29442 23859 20559 17874 14426 5465 19369 25322 22681 31413 30633 45920 47416 41869
10248 41869 44669 41356 55386 63614 68869 60723 49940 48998 60248 59300 56049 58426 55471 56558
10234 56558 53678 51683 36941 35219 46440 52424 66257 61150 40946 45053 40854 28646 29303
10221 29303 30308 39856 39816 27488 25155 27429 39455 35436 42830 58499 60824 45471 49727 47375
10207 47375 43034 45868 47972 49024 46342 58309 53469 47254 39889 25612 26088 28135 28782 36780
$$ packed form
10304E8241j0707j8293l373L947r577Q47L359M559J9825P47r699p858K877K608
10290C7503k104n481p040Q36J3199j7107j6261Q303J2968P943L725J853J608J0304
10276E0249M072j668j5034m945K019j2283q209Q81o393N701L319Q141M549M444
10262C4843n401n583l300k685l448q961J3904N953k641Q732p80J5287J496n547
10248D1869K800l313J4030Q228N255q146j0783r42J1250r48l251K377k955J087
10234E6558k880j995j4742j722J1221N984J3833n107k0204M107m199j2208O57
10221B9303J005R548m0j2328k333K274J2026m019P394J5669K325j5353M256k352
10207D7375m341K834K104J052k682J1967m840o215p365j4277M76K047O47P998
$$ plain form
10193 36780 29874 15686 18932 11324 11828 9851 22608 35549 35838 31496 36047 18556 10354 15284
10179 15284 2319 -9269 -2504 2302 1529 9753 15797 21644 10523 6127 6383 1706 6192 25150
10165 25150 22958 12515 8043 2851 6218 22757 24772 22370 24774 25667 19987 14204 9538 17580
10151 17580 27060 15001 7332 18497 31427 16149 13845 23905 15325 6421 9231 -5724 -3523
10138 -3523 9946 17628 14796 9827 9229 8465 18425 33961 38041 25346 15136 21261 22209 25400
10124 25400 13254 9146 5404 12553 4491 -5105 12576 33217 50286 26034 2089 575 29217
10111 29217 39146 47282 46613 43328 31404 40827 35972 15131 -5733 -5838 9690 8145 4238 10352
10097 10352 25519 16414 2 -6571 1904 20453 31108 19492 28020 46865 63312 53471 22047
$$ packed form
10193C6780o906j4188L246p608N04j977J2757J2941K89m342M551j7491q202M930
10179A5284j2965j1588O765M806p73Q224O044N847j1121m396K56m677M486J8958
10165B5150k192j0443m472n192L367J6539K015k402K404Q93n680n783m666Q042
10151A7580R480j2059p669J1165J2930j5278k304J0060q580q904K810j4955K201
10138c523J3469P682k832m969n98p64R960J5536M080j2695j0210O125R48L191
10124B5400j2146m108l742P149q062r596J7681K0641J7069k4252k3945j514K8642
10111B9217R929Q136o69l285j1924R423m855k0841k0864j05J5528j545l907O114
10097A0352J5167r105j6412o573Q475J8549J0655j1616Q528J8845J6447r841l1424
$$ plain form
10084 22047 24309 26979 20992 15968 42532 40300 24498 23971 29240 40461 36435 37506 46020 46544
10070 46544 50357 40302 39919 57274 55428 43601 39650 46727 31623 26699 40626 26994 19862
10057 19862 26707 34020 48323 62350 58299 55964 53987 64098 62807 75989 73306 66858 68322
10044 68322 70431 58427 58264 65213 77439 68838 70138 66672 70499 64068 53961 49081 40649 61030
10030 61030 66379 57814 41103 45095 59694 86343 102648 105754 83371 70197 79790 76042 62274
10017 62274 58685 74247 84383 84220 81044 92046 94410 94281 92434 95068 87839 77628 87853 95757
10003 95757 106619 103038 99824 114341 117146 118251 121166 115288 121027 134885 144455 155896 157353
9990 157353 149773 157274 160709 151968 152907 162624 176766 188746 191293 187282 209641 231966 230007 231039
$$ packed form
10084B2047K262K670n987n024K6564k232j5802n27N269J1221m026J071Q514N24
10070D6544L813j0055l83J7355j846j1827l951P077j5104m924J3927j3632p132
10057A9862O845P313J4303J4027m051k335j977J0111j291J3182k683o448J464
10044F8322K109j2004j63O949J2226q601J300l466L827o431j0107m880q432K0381
10030F1030N349q565j6711L992J4599K6649J6305L106k2383j3174R593l748j3768
10017F2274l589J5562J0136j63l176J1002K364j29j847K634p229j0211J0225P904
10003I5757J0862l581l214J4517K805J105K915n878N739J3858R570J1441J457
9990A57353p580P501L435q741R39R717J4142J1980K547m011K2359K2325j959J032
$$ plain form
9976 231039 246015 236486 222985 235939 240857 247365 268352 277872 295199 300297 306489 338819 363690
9963 363690 386578 423308 464615 498904 530147 570734 619106 680493 739293 802265 881818 980300
9951 980300 1095827 1226725 1353098 1484834 1606981 1724175 1839643 1936959 2028016 2101766
9941 2101766 2179235 2280228 2368125 2432820 2474173 2520429 2562164 2592470 2613302 2675578 2770432
9930 2770432 2886891 3024340 3209086 3427988 3654996 3903277 4146610 4393896 4649030 4866261
9920 4866261 5048558 5203457 5318294 5396392 5416890 5389150 5338530 5278274 5195643 5087423 4967983
9909 4967983 4856617 4762012 4678224 4617753 4602705 4632148 4697585 4791814 4916464 5027565 5160200
9898 5160200 5280696 5378688 5459716 5515249 5556524 5552750 5491498 5401940 5269686 5091344 4882414
$$ packed form
9976B31039J4976r529j3501J2954M918O508K0987R520J7327N098O192L2330K4871
9963C63690K2888L6730M1307L4289L1243M0587M8372O1387N8800O2972P9553R8482
9951I80300J15527J30898J26373J31736J22147J17194J15468R7316R1057P3750
9941B101766P7469J00993Q7897O4695M1353M6256M1735L0306K0832O2276R4854
9930B770432J16459J37449J84746K18902K27008K48281K43333K47286K55134K17231
9920D866261J82297J54899J14837P8098K0498k7740n0620o0256q2631j08220j19440
9909D967983j11366r4605q3788o0471j5048K9443O5437R4229J24650J11101J32635
9898E160200J20496R7992Q1028N5533M1275l774o1252q9558j32254j78342k08930
$$ plain form
9887 4882414 4660090 4430891 4210232 3986558 3788133 3611608 3462405 3343346 3244757 3191638
9877 3191638 3183155 3190926 3199953 3236147 3268709 3298805 3329904 3376363 3428301 3500323 3604561 3734422
9865 3734422 3863001 3991920 4096965 4170990 4213434 4237167 4255604 4259880 4257513 4296166 4340966
9854 4340966 4398466 4450223 4485335 4495271 4489174 4492593 4526506 4615360 4726476 4876673 5085580
9843 5085580 5355053 5672363 6018770 6367344 6730215 7112486 7470429 7784087 8031130 8216918
9833 8216918 8362136 8438989 8437601 8402075 8330417 8228529 8088213 7918064 7722377 7518048
9823 7518048 7317718 7159424 7054968 7000606 7028873 7108223 7229071 7389751 7535175 7691076
9813 7691076 7840263 7968242 8064009 8127355 8156420 8114263 8004359 7827334 7592991 7317769
$$ packed form
9887D882414k22324k29199k20659k23674j98425j76525j49203j19059r8589n3119
9877C191638q483P771R027L6194L2562L0096L1099M6459N1938P2022J04238J29861
9865C734422J28579J28919J05045P4025M2444K3733J8437M276k367L8653M4800
9854D340966N7500N1757L5112R936o097L419L3913Q8854J11116J50197K08907
9843E085580K69473L17310L46407L48574L62871L82271L57943L13658K47043J85788
9833H216918J45218P6853j388l5526p1658j01888j40316j70149j95687k04329
9823G518048k00330j58294j04456n4362K8267P9350J20848J60680J45424J55901
9813G691076J49187J27979R5767O3346K9065m2157j09904j77025k34343k75222
$$ plain form
9803 7317769 6971750 6615753 6246450 5873323 5525309 5187464 4870633 4587330 4367635 4201511
9793 4201511 4074909 3967860 3879900 3810407 3728427 3639468 3554911 3444455 3326343 3219328
9783 3219328 3115265 3000142 2881520 2752250 2598979 2412850 2223251 2035979 1853145 1680535
9773 1680535 1515072 1366761 1254035 1162568 1060915 963011 893162 835635 776501 741076 709198
9762 709198 683249 662163 625620 590017 542937 527165 522030 510222 491781 455895 417931 393780
9750 393780 388900 372881 366987 362106 352305 344047 334818 334779 323278 315516 315861 318095 313796 294642
9736 294642 291784 306666 311217 311393 310533 303863 307390 312961 310396 304148 299407 300525 310553 308271
9722 308271 314182 325648 337546 339504 355158 372210 383810 381368 358895 356479 373644 392894
$$ packed form
9803G317769l46019l55997l69303l73127l48014l37845l16831k83303k19695j66124
9793D201511j26602j07049q7960o9493q1980q8959q4557j10456j18112j07015
9783C219328j04063j15123j18622j29270j53271j86129j89599j87272j82834j72610
9773A680535j65463j48311j12726r1467j01653r7904o9849n7527n9134l5425l1878
9762G09198k5949k1086l6543l5603m7080j5772n135j1808j8441l5886l7964k4151
9750C93780m880j6019n894m881r801q258r229l9j1501p762L45K234m299j9154
9736B94642k858J4882M551J76q60o670L527N571k565o248m741J118J0028k282
9722C08271N911J1466J1898J958J5654J7052J1600k442k2473k416J7165J9250
$$ plain form
9710 392894 392160 391163 394052 382193 385138 376162 373538 395467 414356 417238 427993 430572 417398 411086
9696 411086 416109 427697 432432 431078 424393 429956 440247 435223 431635 419596 427238 426308 406560 384305
9682 384305 366352 366311 359260 365970 370624 370967 386947 382620 368209 373531 376985 385530 385385 387571 378864
9667 378864 357428 354773 365644 362695 363510 346920 330947 325213 328150 328452 328385 338341 327040 323444
9653 323444 319500 326333 330337 332276 331746 319627 320809 333131 346919 363624 365720 374685 369598 371416
9639 371416 376552 386139 399665 399892 393797 399252 419737 436754 444307 437584 457446 471257 473558
9626 473558 470570 474052 494540 519744 533497 554408 574065 586527 596211 626968 656382 697493
9614 697493 758160 828625 856040 896655 955826 1033225 1119147 1208849 1319425 1448126 1615175
$$ packed form
9710C92894p34r97K889j1859K945q976k624K1929J8889K882J0755K579j3174o312
9696D11086N023J1588M735j354o685N563J0291n024l588j2039P642r30j9748k2255
9682C84305j7953m1p051O710M654L43J5980m327j4411N322L454Q545j45K186q707
9667C78864k1436k655J0871k949Q15j6590j5973n734K937L02o7R956j1301l596
9653C23444l944O833M004J939n30j2119J182J2322J3788J6705K096Q965n087J818
9639C71416N136R587J3526K27o095N455K0485J7017P553o723J9862J3811K301
9626D73558k988L482K0488K5204J3753K0911J9657J2462R684L0757K9414M1111
9614F97493O0667P0465K7415M0615N9171P7399Q5922Q9702J10576J28701J67049
$$ plain form
9603 1615175 1819132 2074885 2400985 2800127 3262571 3783448 4274698 4649442 4825376 4771114
9593 4771114 4504123 4104242 3678253 3277949 2919619 2636895 2407453 2217632 2094475 2003356
9583 2003356 1934977 1896024 1878099 1882270 1913914 1978375 2095902 2254826 2462857 2739149 3126188
9572 3126188 3586547 4090131 4577231 4908566 4966012 4784246 4412589 3936826 3444468 2996614
9562 2996614 2626457 2325252 2072351 1846119 1662087 1529167 1432210 1332782 1262835 1220200
9552 1220200 1180578 1155897 1132187 1109842 1112500 1131937 1140744 1172458 1209635 1260766 1340630 1439440
9540 1439440 1568558 1717303 1900437 2131976 2417880 2769695 3215576 3766067 4422165 5195408
9530 5195408 6046867 6911134 7687605 8215253 8366293 8155978 7675136 7048959 6380737 5764876
$$ packed form
9603A615175K03957K55753L26100L99142M62444N20877M91250L74744J75934n4262
9593D771114k66991l99881m25989m00304l58330k82724k29442j89821j23157r1119
9583B003356o8379l8953j7925M171L1644O4461J17527J58924K08031K76292L87039
9572C126188M60359N03584M87100L31335N7446j81766l71657m75763m92358m47854
9562B996614l70157l01205k52901k26232j84032j32920r6957r9428o9947m2635
9552A220200l9622k4681k3710k2345K658J9437Q807L1714L7177N1131P9864R8810
9540A439440J29118J48745J83134K31539K85904L51815M45881N50491O56098P73243
9530E195408Q51459Q64267P76471N27648J51040k10315m80842o26177o68222o15861
$$ plain form
9520 5764876 5258983 4884026 4634656 4473337 4406785 4465199 4628314 4884187 5201070 5551938
9510 5551938 5865343 6087976 6250240 6377530 6559713 6863055 7337458 7951191 8569097 9061952
9500 9061952 9285656 9169793 8726830 8055485 7268867 6473622 5745955 5139044 4662940 4297558
9490 4297558 4022093 3857421 3799802 3820080 3910603 4041823 4151362 4197893 4109749 3896915
9480 3896915 3579129 3218363 2876048 2571815 2317682 2111322 1982522 1891660 1832770 1795174
9470 1795174 1790290 1844685 1938461 2039246 2178534 2364291 2610546 2931179 3315497 3754919
9460 3754919 4199285 4551666 4745601 4737878 4600359 4382710 4121973 3910646 3748972 3658999
9450 3658999 3649467 3723674 3917217 4217575 4632373 5124668 5659068 6211230 6686287 6984404
$$ packed form
9520E764876n05893l74957k49370j61319o6552N8414J63115K55873L16883L50868
9510E551938L13405K22633J62264J27290J82183L03342M74403O13733O17906M92855
9500I061952K23704j15863m42963o71345p86618p95245p27667o06911m76104l65382
9490D297558k75465j64672n7619K0278R0523J31220J09539M6531q8144k12834
9480C896915l17786l60766l42315l04233k54133k06360j28800r0862n8890l7596
9470A795174m884N4395R3776J00785J39288J85757K46255L20633L84318M39422
9460C754919M44366L52381J93935p723j37519k17649k60737k11327j61674q9973
9450C658999r532P4207J93543L00358M14798M92295N34400N52162M75057K98117
$$ plain form
9440 6984404 7055303 6898155 6604086 6291895 6026921 5898736 5912271 6004901 6063687 6017390
9430 6017390 5838202 5518494 5118902 4707808 4354043 4087434 3900383 3808588 3817768 3915494
9420 3915494 4117523 4415318 4785753 5216037 5622925 5880259 5914549 5702697 5277396 4730885
9410 4730885 4147326 3599310 3110665 2712197 2385109 2121845 1898675 1700451 1544595 1422343
9400 1422343 1329764 1251722 1177580 1126286 1090443 1041281 996629 973126 954851 944819 938102 927393
9388 927393 916539 930930 957333 1001765 1066086 1125736 1213466 1316203 1438279 1591977 1779090
9377 1779090 1990123 2238800 2534195 2825925 3054777 3131617 3036601 2819489 2534331 2215679
9367 2215679 1946716 1728449 1549417 1422131 1339392 1276264 1235557 1229927 1232078 1238283 1268865
$$ packed form
9440F984404P0899j57148k94069l12191k64974j28185J3535R2630N8786m6297
9430F017390j79188l19708l99592m11094l53765k66609j87051r1795R180R7726
9420C915494K02029K97795L70435M30284M06888K57334L4290k11852m25301n46511
9410D730885n83559n48016m88645l98468l27088k63264k23170j98224j55856j22252
9400A422343r2579p8042p4142n1294l5843m9162m4652k3503j8275j0032o717j0709
9388I27393j0854J4391K6403M4432O4321N9650Q7730J02737J22076J53698J87113
9377A779090K11033K48677K95395K91730K28852P6840r5016k17112k85158l18652
9367B215679k68963k18267j79032j27286q2739o3128m0707n630K151O205L0582
$$ plain form
9356 1268865 1311211 1376928 1481161 1606656 1753890 1938242 2171262 2431730 2729743 3010397
9346 3010397 3211112 3291079 3234651 3074183 2854430 2653836 2504213 2372128 2316981 2297960
9336 2297960 2288972 2272521 2247482 2179343 2073934 1941494 1789728 1630421 1461303 1321619
9326 1321619 1198511 1097131 1025903 972891 932054 905910 901302 884444 886729 874034 864196 844189
9314 844189 820374 786336 749072 711856 680861 664346 645365 616278 586295 557860 533223 530010
9302 530010 530813 531860 543695 542034 533825 535948 543976 549906 554628 556801 549198 553750 568126 564552
9288 564552 565343 564774 577397 586726 569905 549097 542913 556471 592502 618020 640974 647914 665091
9275 665091 686683 720199 739667 739791 729554 703349 686525 671338 655086 642939 631321 619869
$$ packed form
9356A268865M2346O5717J04233J25495J47234J84352K33020K60468K98013K80654
9346C010397K00715P9967n6428j60468k19753k00594j49623j32085n5147j9021
9336B297960q988j6451k5039o8139j05409j32440j51766j59307j69118j39684
9326A321619j23108j01380p1228n3012m0837k6144m608j6858K285j2695r838k0007
9314H44189k3815l4038l7264l7216l0995j6515j8981k9087k9983k8435k4637l213
9302E30010Q03J047J1835j661q209K123Q028N930M722K173p603M552J4376l574
9288E64552P91n69J2623R329j6821k0808o184J3558L6031K5518K2954O940J7177
9275F65091K1592L3516J9468J24j0237k6205j6824j5187j6252j2147j1618j1452
$$ plain form
9263 619869 616168 608619 613718 615535 602825 600953 600408 584552 574676 566332 561504 570950 564201 563352
9249 563352 582060 591701 595723 599214 580923 544471 463443 355736 250440 199803 188609 231112
9237 231112 282939 341010 422165 470985 485362 496471 493015 505480 514688 506462 510798 505618 496719
9224 496719 469142 445029 442477 445367 420327 406749 417294 430151 432018 425557 423301 437698 457938
9211 457938 454784 454673 451257 459029 480287 504997 548974 568072 580207 585859 591372 589903 592911
9198 592911 598733 611334 620581 639353 653863 682805 744099 803689 850656 871965 864974 830943
9186 830943 776962 732254 691724 649435 618973 588477 549131 535154 525439 520828 524942 556074
9174 556074 570307 547357 518790 514334 495401 484002 487410 490331 486388 491123 487664 490838 504518
$$ packed form
9263F19869l701p549N099J817j2710j872n45j5856r876q344m828R446o749q49
9249E63352J8708R641M022L491j8291l6452q1028j07707j05296n0637j1194M2503
9237B31112N1827N8071Q1155M8820J4377J1109l456J2465R208q226M336n180q899
9224D96719k7577k4113k552K890k5040j3578J0545J2857J867o461k256J4397K0240
9211D57938l154j11l416P772K1258K4710M3977J9098J2135N652N513j469L008
9198E92911N822J2601R247J8772J4510K8942O1294N9590M6967K1309o991l4031
9186H30943n3981m4708m0530m2289l0462l0496l9346j3977r715m611M114L1132
9174E56074J4233k2950k8567m456j8933j1399L408K921l943M735l459L174J3680
$$ plain form
9161 504518 509649 504109 500553 507362 490544 465002 448962 456422 453106 419298 392549 359456 329531
9148 329531 294358 277403 293090 302142 311197 322373 324150 306400 288096 270108 270587 274433 284931
9135 284931 313316 342875 373970 399643 410910 419111 409548 408784 423839 403524 384881 377208 393997
9122 393997 407578 431421 442955 448838 457002 455598 455269 451852 428258 422434 422390 407859 406192 415097
9108 415097 419117 412740 390630 375733 382834 396099 407417 399700 394640 387682 382662 379953 377907
9095 377907 383024 377560 375866 382232 378209 364956 358460 360615 363951 370642 371193 375517 381627 377384
9081 377384 361338 351152 341615 342229 336306 314268 283301 269484 262148 244946 245518 263136 285235
9068 285235 293639 326109 353199 374303 402753 409644 389144 365546 341032 330558 310106 309386
$$ packed form
9161E04518N131n540l556O809j6818k5542j6040P460l316l3808k6749l3093k9925
9148C29531l5173j6955J5687R052R055J1176J777j7750j8304j7988M79L846J0498
9135B84931K8385K9559L1095K5673J1267Q201r563p64J5055k0315j8643p673J6789
9122C93997J3581K3843J1534N883Q164j404l29l417k3594n824m4j4531j667Q905
9108D15097M020o377k2110j4897P101J3265J1318p717n060o958n020k709k046
9095C77907N117n464j694O366m023j3253o496K155L336O691N51M324O110m243
9081C77384j6046j0186r537O14n923k2038l0967j3817p336j7202N72J7618K2099
9068B85235Q404L2470K7090K1104K8450O891k0500k3598k4514j0474k0452p20
$$ plain form
9056 309386 319682 319133 316801 328771 329442 326510 325973 325173 306105 286376 281181 273233 275190 282395
9042 282395 280854 275485 285421 295191 308955 325299 351531 371594 377637 388454 405493 414339 410854
9029 410854 417088 436631 439456 430897 414563 393150 390282 389414 408975 421200 426961 432944 430726
9016 430726 433244 460476 487525 515380 520547 516310 524888 519915 505807 507840 498357 490910 489048
9003 489048 473091 470932 481114 502426 516809 545743 574308 593799 610498 620326 638688 677369
8991 677369 706769 736589 765445 794756 809941 824491 875114 936395 995667 1062897 1154842 1249264
8979 1249264 1315081 1362516 1402574 1447727 1507078 1570328 1635849 1729185 1865614 2043681 2246497
8968 2246497 2435626 2611064 2792077 2988630 3232714 3500740 3812456 4182774 4605019 5102731
$$ packed form
9056C09386J0296n49k332J1970O71k932n37q00j9068j9729n195p948J957P205
9042B82395j541n369R936R770J3764J6344K6232K0063O043J0817J7039Q846l485
9029D10854O234J9543K825q559j6334k1413k868q68J9561J2225N761N983k218
9016D30726K518K7232K7049K7855N167m237Q578m973j4108K033r483p447j862
9003D89048j5957k159J0182K1312J4383K8934K8565J9491J6699R828J8362L8681
8991F77369K9400K9820K8856K9311J5185J4550N0623O1281N9272O7230R1945R4422
8979A249264O5817M7435M0058M5153N9351O3250O5521R3336J36429J78067K02816
8968B246497J89129J75438J81013J96553K44084K68026L11716L70318M22245M97712
$$ plain form
8958 5102731 5696869 6388877 7180340 8102621 9247346 10693728 12518703 14731946 17363260
8949 17363260 20445585 23876617 27563608 32029757 37939742 45992801 57100348 72605679
8941 72605679 95006260 129203441 183317227 264826493 360173810 413655030 395767551
8934 395767551 335195949 255696962 182711508 130631226 97077375 75577010 61223758
8927 61223758 51131688 43838294 38452209 34381148 31278725 28706354 26434760 24618005
8919 24618005 23466837 23223751 23859629 25233843 26896484 26840265 24533873 21292276 17979788
8910 17979788 15394081 13600446 12106995 10654993 9247483 7979914 6963911 6212513
8902 6212513 5661641 5207802 4820434 4451059 4087781 3765653 3485645 3216687 2991526 2818392
$$ packed form
8958E102731N94138O92008P91463R22281J144725J446382J824975K213243K631314
8949A7363260L082325L431032L686991M466149N909985Q053059J1107547J5505331
8941G2605679K2400581L4197181N4113786Q1509266R5347317N3481220j7887479
8934C95767551o0571602p9498987p2985454n2080282l3553851k1500365j4353252
8927F1223758j0092070p293394n386085m071061l102423k572371k271594j816755
8919B4618005j151168k43086O35878J374214J662641n6219k306392l241597l312488
8910A7979788k585707j793635j493451j452002j407510j267569j016003p51398
8902F212513n50872m53839l87368l69375l63278l22128k80008k68958k25161j73134
$$ plain form
8892 2818392 2660632 2534068 2435831 2364464 2280289 2171105 2085579 2007652 1919939 1847223 1783201
8881 1783201 1732340 1683107 1636790 1588345 1534477 1513572 1531691 1522196 1494910 1443198 1379236 1319924
8869 1319924 1246731 1177899 1126686 1072556 1036778 1003052 979439 960776 925699 902071 890002
8858 890002 871974 846724 838290 826037 795815 773948 750155 719284 710656 730980 723912 688429
8846 688429 659228 638812 642215 627202 616871 604812 592908 583449 578867 592612 615958 627429
8834 627429 624751 601557 590706 594012 593173 585362 582140 589539 574936 556505 532307 518567 509679
8821 509679 504611 488974 476145 488805 489302 506061 516892 515367 522403 525334 519668 516326 492150
8808 492150 483598 479831 473249 472115 481468 497451 508786 509129 509944 508028 506029 487341 481673 464770
$$ packed form
8892B818392j57760j26564r8237p1367q4175j09184q5526p7927q7713p2716o4022
8881A783201n0861m9233m6317m8445n3868k0905J8119r495k7286n1712o3962n9312
8869A319924p3193o8832n1213n4130l5778l3726k3613j8663l5077k3628j2069
8858H90002j8028k5250q434j2253l0222k1867k3793l0871q628K0324p068l5483
8846F88429k9201k0416L403j5013j0331j2059j1904r459m582J3745K3346J1471
8834F27429k678k3194j0851L306q39p811l222P399j4603j8431k4198j3740q888
8821E09679n068j5637j2829J2660M97J6759J0831j525P036K931n666l342k4176
8808D92150q552l767o582j134R353J5983J1335L43Q15j916j999j8688n668j6903
$$ plain form
8794 464770 452154 442491 415926 406175 417050 425557 418486 398519 406959 424910 452964 463379 450472
8781 450472 460320 439293 421232 419514 404357 388217 380474 376630 367924 353029 345208 355321 347170
8768 347170 320125 324170 328678 331563 325381 316001 302550 288199 262319 245315 250030 253816 238241
8755 238241 229975 218545 223970 225618 220445 224755 240811 248420 263464 285572 282198 255016 230803
8742 230803 217138 212914 209077 238574 267293 278973 305307 320252 345392 371112 371049 343816 318257
8729 318257 318714 320856 343482 352919 336542 331204 324643 309774 298405 273638 258674 266146 275861
8716 275861 276097 273301 278140 273583 265256 275129 281298 300164 311250 301875 289786 302195 310180 306437
8702 306437 304496 287855 278282 274741 270384 274774 283010 293399 300131 290378 296583 291201 274402 262569
$$ packed form
8794D64770j2616r663k6565r751J0875Q507p071j9967Q440J7951K8054J0415j2907
8781D50472R848k1027j8061j718j5157j6140p743l844q706j4895p821J0113q151
8768C47170k7045M045M508K885o182r380j3451j4351k5880j7004M715L786j5575
8755B38241q266j1430N425J648n173M310J6056P609J5044K2108l374k7182k4213
8742B30803j3665m224l837K9497K8719J1680K6334J4945K5140K5720o3k7233k5559
8729C18257M57K142K2626R437j6377n338o561j4869j1369k4767j4964P472R715
8716B75861K36k796M839m557q327R873O169J8866J1086r375j2089J2409P985l743
8702C06437j941j6641r573l541m357M390Q236J0389O732r753O205n382j6799j1833
$$ plain form
8688 262569 252476 246168 254503 257738 235492 217600 231112 244063 243240 227543 201319 193239 189752
8675 189752 184448 181209 184283 188710 184927 182205 175294 179793 189169 194517 202524 205659 197232 202586
8661 202586 196669 195494 190624 188796 195087 194839 190004 182003 180016 185202 174900 179082 171375 177915
8647 177915 184384 201144 203425 190207 190547 205693 212722 204947 214047 231944 271414 308532 356572
8634 356572 434507 503408 531472 543539 514870 433876 355622 294626 253647 245112 241589 235316
8622 235316 230691 225342 207534 206074 207742 201396 189972 186420 191394 179218 170834 171464 188507 198371
8608 198371 192351 186152 174394 175195 180370 175441 176582 178894 177151 178664 184473 175638 177923 199568
8594 199568 200017 197922 193551 190074 189476 194696 194515 174821 173306 165254 164969 163660 152151 152984 169696
$$ packed form
8688B62569j0093o308Q335L235k2246j7892J3512J2951q23j5697k6224q080l487
8675A89752n304l239L074M427l783k722o911M499R376N348Q007L135q427N354
8661B02586n917j175m870j828O291k48m835q001j987N186j0302M182p707O540
8647A77915O469J6760K281j3218L40J5146P029p775R100J7897L9470L7118M8040
8634C56572P7935O8901K8064J2067k8669q0994p8254o0996m0979q535l523o273
8622B35316m625n349j7808j460J668o346j1424l552M974j2176q384O30J7043R864
8608A98371o020o199j1758Q01N175m929J141K312j743J513N809q835K285K1645
8594A99568M49k095m371l477n98N220j81j9694j515q052k85j309j1509Q33J6712
$$ plain form
8579 169696 188713 188436 184732 190783 192178 194107 223108 250515 267565 296143 335035 418947 545295
8566 545295 698600 755928 689024 582772 474408 385110 337150 314642 291777 281504 269422
8555 269422 270795 277294 273223 258982 258773 267644 285334 307011 328941 337387 357947 400013 445926
8542 445926 485319 547237 627114 735773 868374 1001650 1141995 1270635 1382882 1461950
8532 1461950 1509180 1504962 1449147 1368736 1268412 1167294 1061601 995891 1000712 1121879 1382136
8521 1382136 1540162 1437931 1211672 932174 698511 556505 469892 418403 397322 376809
8511 376809 368351 355109 334399 326232 336310 321508 285074 261536 270592 265614 240657 217581
8499 217581 221876 229308 226836 219214 213782 204783 201903 206581 208007 202636 194953 197327 188810 187777
$$ packed form
8579A69696J9017k77l704O051J395J929K9001K7407J7050K8578L8892Q3912J26348
8566E45295J53305N7328o6904j06252j08364q9298m7960k2508k2865j0273j2082
8555B69422J373O499m071j4241k09Q871J7690K1677K1930Q446K0560M2066M5913
8542D45926L9393O1918P9877J08659J32601J33276J40345J28640J12247P9068
8532A461950M7230m218n5815q0411j00324j01118j05693o5710M821J21167K60257
8521A382136J58026j02231k26259k79498k33663j42006q6613n1489k1081k0513
8511C76809q458j3242k0710q167J0078j4802l6434k3538R056m978k4957k3076
8499B17581M295P432k472p622n432q999k880M678J426n371p683K374q517j033
$$ plain form
8485 187777 201415 221826 243762 263117 300439 350909 420714 560720 697308 740899 687150
8474 687150 578655 454803 360542 298949 277953 267315 251848 239229 234947 216330 210063 205549
8462 205549 186764 194963 200334 198860 176855 162466 164397 167555 165835 157629 158279 161572 166454 152279
8448 152279 143005 145987 142723 132140 143490 147358 138782 139627 143673 128246 123088 135996 124028
8435 124028 115441 124882 126814 117069 125516 131538 127716 126616 120106 111454 109664 111261 101999 98325
8421 98325 109466 117447 121882 109219 112443 121704 142718 148139 140870 144243 148843 155791 154233 161640
8407 161640 151606 147662 154713 150689 155248 159671 158208 175014 177025 169016 152521 139659 146170
8394 146170 168307 168724 181713 192524 184369 181320 179384 171470 161156 152959 138202 127879 130716
$$ packed form
8485A87777J3638K0411K1936J9355L7322N0470O9805J40006J36588M3591n3749
8474F87150j08495j23852r4261o1593k0996j0638j5467j2619m282j8617o267m514
8462B05549j8785Q199N371j474k2005j4389J931L158j720q206O50L293M882j4175
8448A52279r274K982l264j0583J1350L868q576Q45M046j5427n158J2908j1968
8435A24028q587R441J932r745Q447O022l822j100o510q652j790J597r262l674
8421I8325J1141P981M435j2663L224R261K1014N421p269L373M600O948j558P407
8407A61640j0034l944P051m024M559M423j463J6806K011q009j6495j2862O511
8394A46170K2137M17J2989J0811q155l049j936p914j0314q197j4757j0323K837
$$ plain form
8381 130716 141592 135394 119402 117522 130154 121585 108396 99715 92772 95709 105509 89034 88989 109321
8367 109321 120090 108912 105044 87224 92737 117745 120077 112478 121778 114888 107051 95532 77781
8354 77781 72935 90632 79867 70825 65373 66107 76665 85357 78428 65362 65671 72693 66938 69587
8340 69587 73002 74030 56145 50679 77144 101816 108055 106086 98533 97328 100812 93338 92094 93395
8326 93395 107231 119019 104713 115642 129358 116576 114440 101371 99570 111328 120650 141371
8314 141371 140101 141658 137853 115888 110033 115174 107087 97790 93523 102738 109254 92792 79806 70012
8300 70012 88192 100991 93377 90419 78460 83273 99441 94801 75955 57915 39299 35898 47506
8287 47506 55791 51346 50409 48524 32007 13882 14030 18022 32424 32960 15907 -5482 2557 14467
$$ packed form
8381A30716J0876o198j5992j880J2632q569j3189q681o943K937R800j6475m5K0332
8367A09321J0769j1178l868j7820N513K5008K332p599R300o890p837j1519j7751
8354G7781m846J7697j0765r042n452P34J0558Q692o929j3066L09P022n755K649
8340F9587L415J028j7885n466K6465K4672O239j969p553j205L484p474j244J301
8326I3395J3836J1788j4306J0929J3716j2782k136j3069j801J1758R322K0721
8314A41371j270J557l805k1965n855N141q087r297m267R215O516j6462j2986r794
8300G0012J8180J2799p614k958j1959M813J6168m640j8846j8040j8616l401J1608
8287D7506Q285m445r37j885j6517j8125J48L992J4402N36j7053k1389Q039J1910
$$ plain form
8273 14467 26118 27612 17168 31287 44155 42185 35576 40474 33073 46524 60862 59111 57005
8260 57005 41269 43679 41589 30548 25381 40904 48731 49498 55971 56598 55447 59195 52580 50917
8246 50917 40396 38960 39371 23118 28471 43646 41026 46090 58231 56479 67637 66578 60093 57597
8232 57597 77056 85530 66045 49234 48964 56023 42471 26424 33490 28708 29263 34130 31126 32133
8218 32133 27576 24555 19439 33760 47719 29174 18040 21819 22496 20450 26500 28013 14218 6700
8204 6700 16903 22814 22851 23370 14365 7049 12919 7999 -2032 5757 5185 11385 25434 32917 21300
8189 21300 22363 31927 24557 27361 31036 49026 54430 34999 24392 17358 20977 11616 1162 10083
8175 10083 25743 35853 20338 1720 -8669 -5741 5039 19928 21923 7787 10665 2976 3214
$$ packed form
8273A4467J1651J494j0444J4119J2868j970o609M898p401J3451J4338j751k106
8260E7005j5736K410k090j1041n167J5523P827P67O473O27j151L748o615j663
8246E0917j0521j436M11j6253N353J5175k620N064J2141j752J1158j059o485k496
8232E7597J9459Q474j9485j6811k70P059j3552j6047P066m782N55M867l004J007
8218C2133m557l021n116J4321J3959j8545j1134L779O77k046O050J513j3795p518
8204F700J0203N911L7N19r005p316N870m920j0031P789n72O200J4049P483j1617
8189B1300J063R564p370K804L675J7990N404j9431j0607p034L619r361j0454Q921
8175A0083J5660J0110j5515j8618j0389K928J0780J4889J995j4136K878p689K38
$$ plain form
8162 3214 4007 7767 13071 14838 9846 2431 2171 -3057 -655 521 155 17202 17328 24321 11111
8147 11111 3954 16120 22190 26572 33584 24128 20436 36545 47532 20864 -6807 -7095 2445 14898
8133 14898 32021 21140 5492 10426 13056 8283 8642 25997 38370 40169 32109 23678 14259 22981
8119 22981 22791 12833 12906 21187 17809 19691 14671 8808 7144 22276 25223 22735 20058 20555 22296
8104 22296 28266 30930 26826 33984 27503 15294 7831 13417 15315 27376 26661 35777 40412 25126
8090 25126 6981 -11129 -13982 5745 13137 4232 8545 759 -933 -2461 713 -7677 -5026 514
8076 514 -8298 -2749 16438 8711 698 -20400 -22162 -10691 -9103 4495 14117 26143 18698 13434
8062 13434 -6003 -19107 -13789 -11703 -1189 -7491 1577 30970 37123 28718 30213 31337 22764 11532
$$ packed form
8162C214P93L760N304J767m992p415k60n228K402J176l66J7047J26O993j3210
8147A1111p157J2166O070M382P012r456l692J6109J0987k6668k7671k88R540J2453
8133A4898J7123j0881j5648M934K630m773L59J7355J2373J799q060q431r419Q722
8119B2981j90r958P3Q281l378J882n020n863j664J5132K947k488k677M97J741
8104B2296N970K664m104P158o481j2209p463N586J898J2061p15R116M635j5286
8090B5126j8145j8110k853J9727P392q905M313p786j692j528L174q390K651N540
8076E14q812N549J9187p727q013k1098j762J1471J588J3598R622J2026p445n264
8062A3434j9437j3104N318K086J0514o302R068K9393O153q405J495J124q573j1232
$$ plain form
8048 11532 16151 21615 2854 -1933 3941 15046 16126 14342 25132 10075 5278 15936 28698
8035 28698 17495 14417 14993 13857 23863 28575 15390 7016 16300 13725 25811 26098 18161 10589
8021 10589 13824 28518 40814 49767 45524 31112 20155 20519 21691 33882 35004 24861 11016
8008 11016 1605 13223 22419 36255 40828 37926 28524 32728 32112 23332 15549 17784 5616 6070
7994 6070 16290 20329 27395 21126 12716 6813 7001 4471 -1032 993 3025 10595 17633 16647 10912
7979 10912 12152 10002 23329 25497 31252 23791 15369 2836 5881 6957 16730 11413 20972 29962
7965 29962 26125 9151 1533 14670 21787 27124 26765 33959 44153 41782 20851 8226 9801 22155
7951 22155 16499 22657 30412 36547 30326 37642 46377 38292 31875 21568 18860 25292 28893 24405
$$ packed form
8048A1532M619N464j8761m787N874J1105J080j784J0790j5057m797J0658J2762
8035B8698j1203l078N76j136J0006M712j3185q374R284k575J2086K87p937p572
8021A0589L235J4694J2296Q953m243j4412j0957L64J172J2191J122j0143j3845
8008A1016r411J1618R196J3836M573k902r402M204o16q780p783K235j2168M54
7994F070J0220M039P066o269q410n903J88k530n503K025K032P570P038r86n735
7979A0912J240k150J3327K168N755p461q422j2533L045J076R773n317R559Q990
7965B9962l837j6974p618J3137P117N337l59P194J0194k371k0931j2625J575J2354
7951B2155n656O158P755O135o221P316Q735q085o417j0307k708O432L601m488
$$ plain form
7937 24405 20837 24664 28947 24578 20174 15692 14808 23807 23651 33405 35874 16866 5679 -2595 -5936
7922 -5936 9731 18607 13822 11327 12807 18473 6210 5383 9584 11717 7084 21616 16397 6913
7908 6913 6936 16824 22489 17715 9634 16067 14859 11851 6156 13952 22587 29182 15961 3056 2715
7893 2715 -12138 -21485 -5789 7568 24502 35766 27438 24307 7752 5477 1250 -6370 -15688
7880 -15688 874 7877 9057 8980 12678 2058 -12070 -827 21724 20782 17574 20403 26316 17896
7866 17896 22410 27941 12586 -1063 -1480 1817 -6325 -4051 -8100 2496 6983 15751 11879 21977
7852 21977 7314 -4585 243 2561 -2643 1294 7819 -3349 -19821 -6150 6460 12028 9656
7839 9656 16410 18576 10535 -7966 -7663 4433 439 -5646 8722 26432 27830 13805 2616 -653
$$ packed form
7937B4405l568L827M283m369m404m482q84Q999j56R754K469j9008j1187q274l341
7922e936J5667Q876m785k495J480N666j2263q27M201K133m633J4532n219r484
7908F913K3R888N665m774q081O433j208l008n695P796Q635O595j3221j2905l41
7893B715j4853r347J5696J3357J6934J1264q328l131j6555k275m227p620r318
7880a5688J6562P003J180p7L698j0620j4128J1243K2551r42l208K829N913q420
7866A7896M514N531j5355j3649m17L297q142K274m049J0596M487Q768l872J0098
7852B1977j4663j1899M828K318n204L937O525j1168j6472J3671J2610N568k372
7839I656O754K166q041j8501L03J2096l994o085J4368J7710J398j4025j1189l269
$$ plain form
7825 -653 5176 8126 -1019 742 2491 5175 -1839 -24696 -34369 -21133 -13599 -10419 -15706 -17858 -9656
7810 -9656 -2983 -8245 2115 9586 3375 -1715 -16185 -13240 -1827 -11790 -22150 -12686 -2758 -3016
7796 -3016 5971 21590 17385 16944 13321 19225 21133 30874 37102 35016 31585 17151 4592 4325 18234
7781 18234 35959 44134 32634 19554 18779 18053 16857 18038 27463 29285 21483 26137 30293 28145
7767 28145 18745 10156 -1861 1004 -11564 -26997 -30020 -19209 -16203 -13270 -2348 7141 5300
7754 5300 -7975 -15989 -12294 -7838 5469 8829 19371 28218 23488 4018 -5163 -8618 5403 -17348
7740 -17348 -26101 -35466 -40608 -40577 -17707 -33 2364 4515 4574 -738 -1031 18425 29930 17474 702
7725 702 -14603 -14665 -16269 -8401 -2103 -10752 2643 9615 -3337 -18008 -26431 -27434 -36022 -28727 -17679
$$ packed form
7825f53N829K950r145J761J749K684p014k2857r673J3236P534L180n287k152Q202
7810i656O673n262J0360P471o211n090j4470K945J1413r963j0360R464R928k58
7796c016Q987J5619m205m41l623N904J908R741O228k086l431j4434j2559k67J3909
7781A8234J7725Q175j1500j3080p75p26j196J181R425J822p802M654M156k148
7767B8145r400q589j2017K865j2568j5433l023J0811L006K933J0922R489j841
7754E300j3275q014L695M456J3307L360J0542Q847m730j9470r181l455J4021k2751
7740a7348q753r365n142L1K2870J7674K397K151N9n312k93J9456J1505j2456j6772
7725G02j5305o2j604P868O298q649J3395O972j2952j4671q423j003q588P295J1048
$$ plain form
7710 -17679 -10665 -20813 -22849 -17070 5505 3379 -22395 -12882 -5108 10233 21323 21907 26432 9587
7696 9587 -8446 -7441 11626 12011 3485 -814 12509 6819 -5488 2986 -1170 13606 21667 19883
7682 19883 -730 -7444 -5341 -7009 -12806 -2505 -4393 -17825 -13058 9483 12229 -916 -7828
7669 -7828 -9328 -11542 -17611 -12290 -13454 -16207 -19386 -8910 131 7493 3491 -9999 -21622 -13935
7655 -13935 -19419 -19533 -19312 -20189 -17011 -7553 -11559 12219 12905 -2103 883 2422 -10862 -12123 -3531
7640 -3531 -2039 -600 -217 -6877 -18261 -12305 -11738 -21428 -9065 19067 24175 24423 23442 27058 23769
7625 23769 12624 4423 -9834 -9486 -14793 -3481 8822 10634 8115 -5102 -19820 -14414 -5473
7612 -5473 -6626 6044 8313 12572 10942 -880 -4552 10875 5973 9270 13442 -14 -1683 12289
$$ packed form
7710a7679P014j0148k036N779K2575k126k5774R513P774J5341J1090N84M525j6845
7696I587j8033J005J9067L85q526m299J3323n690j2307Q474m156J4776Q061j784
7682A9883k0613o714K103j668n797J0301j888j3432M767K2541K746j3145o912
7669g828j500k214o069N321j164k753l179J0476R041P362m002j3490j1623P687
7655a3935n484j14K21q77L178R458m006K3778O86j5008K986J539j3284j261Q592
7640c531J492J439L83o660j1384N956N67r690J2363K8132N108K48r81L616l289
7625B3769j1145q201j4257L48n307J1312J2303J812k519j3217j4718N406Q941
7612e473j153J2670K269M259j630j1822l672J5427m902L297M172j3456j669J3972
$$ plain form
7598 12289 2270 -5629 1403 5890 8699 18300 21105 10476 18211 26034 20046 14460 16270 22378
7584 22378 11295 -1478 1474 8087 2555 4369 8326 5068 5816 5062 -5283 -8477 1006 -969
7570 -969 -4411 7810 5891 2179 -21097 -32569 -25844 -10335 624 4834 -5329 -5000 -7338 -19971
7556 -19971 -18774 -16932 -20301 -15422 -11852 -17069 -10400 285 3081 -6801 -23215 -23990 -7297 5670
7542 5670 -5623 -16990 -7359 1289 3372 5123 971 -8065 -15812 -14766 515 3718 16494 27656
7528 27656 6227 -12058 -14617 -14515 -10680 2419 2400 -650 18561 42428 41741 28483 10551 4682
7514 4682 4679 1862 7840 680 1581 5889 6463 327 6952 9622 1331 -976 189 7304 7056 -7731
7498 -7731 -13593 860 -8353 1196 13136 -1013 -7831 -9856 4845 18509 14642 5653 -920 11998
$$ packed form
7598A2289j0019p899P032M487K809R601K805j0629P735P823n988n586J810O108
7584B2378j1083j2773K952O613n532J814L957l258P48p54j0345l194R483j975
7570i69l442J2221j919l712k3276j1472O725J5509J0959M210j0163L29k338j2633
7556a9971J197J842l369M879L570n217O669J0685K796r882j6414p75J6693J2967
7542E670j1293j1367R631Q648K083J751m152r036p747J046J5281L203J2776J1162
7528B7656k1429j8285k559J02L835J3099j9l050J9211K3867o87j3258j7932n869
7514D682lk817N978p160R01M308N74o136O625K670q291k307J165P115k48j4787
7498g731n862J4453r213R549J1940j4149o818k025J4701J3664l867q989o573J2918
$$ plain form
7484 11998 11205 12743 13444 18124 14195 840 -5320 -12716 -8132 1908 1322 -834 -2399 -9466 -14960
7469 -14960 -19436 -12740 1172 19511 13605 4678 7838 -1391 -5803 -4111 6344 11446 11700 1158
7455 1158 -7873 -2941 -5417 -10492 -13628 -16744 4279 16349 433 -2716 1935 -6808 -8382 -12014
7441 -12014 -12606 -131 25240 26737 15543 4627 8742 503 -3126 4656 12793 16359 10280 2215
7427 2215 -9374 2385 13517 4873 1199 8691 18965 17994 18052 9358 4639 -7852 -8909 -7517
7413 -7517 -2962 -4274 2780 7940 1674 -4549 -3850 -5043 3316 3923 -5555 -193 652 5580 1833 -11726
7397 -11726 -4972 7896 9618 5550 -1617 4597 233 -5220 -3547 1716 3636 -7648 16087 24143
7383 24143 22123 22004 17425 14017 8052 -7110 -11362 1238 1023 -11021 -5322 -7855 -9550 -17234
$$ packed form
7484A1998p93J538P01M680l929j3355o160p396M584J0040n86k156j565p067n494
7469a4960m476O696J3912J8339n906q927L160r229m412J692J0455N102K54j0542
7455A158r031M932k476n075l136l116K1023J2070j5916l149M651q743j574l632
7441a2014n92J2475K5371J497j1194j0916M115q239l629P782Q137L566o079q065
7427B215j1589J1759J1132q644l674P492J0274r71N8q694m719j2491j057J392
7413g517M555j312P054N160o266o223O99j193Q359O07r478N362Q45M928l747j3559
7397a1726O754J2868J722m068p167O214m364n453J673N263J920j1284K3735Q056
7383B4143k020j19m579l408n965j5162m252J2600k15j2044N699k533j695p684
$$ plain form
7369 -17234 -25428 -16914 -3098 6262 6889 7790 -14746 -16960 -34255 -43967 -40975 -36862 -22804 5937
7355 5937 -9023 -25419 -22243 -11527 -10314 -7723 -16200 -21680 -17234 -9437 2690 20059 18589 15355
7341 15355 10335 -11040 -13241 -7394 -23726 -8304 -9160 -8970 2444 12875 11351 12623 17098 16970
7327 16970 6888 5274 906 3981 14635 4824 3619 2792 5721 4612 7699 -10725 -6665 564
7313 564 7967 23307 15846 12097 14743 8248 9078 6743 17652 18816 7618 -9040 -16030 -18415
7299 -18415 -2347 3912 8606 12118 147 5469 7064 9709 9462 -9853 -7690 171 -7157 -18879
7285 -18879 -8408 882 -613 12687 15174 2623 -4008 12687 14123 24770 16815 20008 9764
7272 9764 4180 5001 -2049 -10420 738 -10681 -21821 -23143 -16897 -10917 7715 17943 19156 16201
$$ packed form
7369a7234q194Q514J3816R360O27R01k2536k214j7295r712K992M113J4058K8741
7355E937j4960j6396L176J0716J213K591q477n480M446P797J2127J7369j470l234
7341A5355n020k1375k201N847j6332J5422q56J90J1414J0431j524J272M475j28
7327A6970j0082j614m368L075J0654r811j205q27K929j109L087j8424M060P229
7313E64P403J5340p461l749K646o495Q30k335J0909J164j1198j6658o990k385
7299a8415J6068O259M694L512j1971N322J595K645k47j9315K163P861p328j1722
7285a8879J0471R290j495J3300K487j2551o631J6695J436J0647p955L193j0244
7272I764n584Q21p050q371J1158j1419j1140j322O246N980J8632J0228J213k955
$$ plain form
7258 16201 22760 9226 -5914 -17179 -10595 -5010 6525 17375 14286 21989 32877 34271 28542
7245 28542 17127 20341 24602 14332 10441 137 2104 19320 26973 23463 25390 13807 -1250
7232 -1250 9319 11875 20762 20309 6811 -362 186 -3305 -2703 -7252 -1649 -19425 -27001 -19921 -4933
7217 -4933 -886 7200 7777 -7156 -28566 -24055 -17040 -12613 -7986 -16032 -22451 888 13037 18458
7203 18458 22211 23241 10717 8195 -5699 -1987 12413 10671 5271 5288 3761 3058 -18089 -27437
7189 -27437 -26365 -31651 -28346 -22514 -8769 6446 3473 9216 18527 18463 17229 19691 32454 21799
7175 21799 -618 -15460 -1278 7678 3354 -3150 -1702 -344 -14057 -11141 -10842 -12901 -1964 4152
7161 4152 -2182 -6374 -1608 3339 13807 10202 -4083 2751 12900 6219 12539 15675 16987 17218
$$ packed form
7258A6201O559j3534j5140j1265O584N585J1535J0850l089P703J0888J394n729
7245B8542j1415L214M261j0270l891j0304J967J7216P653l510J927j1583j5057
7232a250J0569K556Q887m53j3498p173N48l491O02m549N603j7776p576P080J4988
7217d933M047Q086N77j4933k1410M511P015M427M627q046o419K3339J2149N421
7203A8458L753J030j2524k522j3894L712J4400j742n400J7j527p03k1147r348
7189b7437J072n286L305N832J3745J5215k973N743R311o4j234K462J2763j0655
7175B1799k2417j4842J4182Q956m324o504J448J358j3713K916K99k059J0937O116
7161D152o334m192M766M947J0468l605j4285O834J0149o681O320L136J312K31
$$ plain form
7147 17218 21316 35284 46337 35067 30923 25803 18484 7625 6472 19064 11310 -234 9299
7134 9299 11860 16057 9984 15095 13290 1049 6880 15117 17421 24158 12225 20419 13901 1894
7120 1894 -13445 -22835 -1143 119 -858 -377 -13720 2544 24130 24420 11155 10956 -815 -8064
7106 -8064 -3438 11929 6617 -3469 16695 11553 -5709 -17944 -22361 -18768 -30980 -29719 -21890
7093 -21890 2698 -5386 -17816 -14007 -9055 6117 5641 7070 -312 -10183 -14556 -15241 -26852 -27757
7079 -27757 -22896 -10916 5647 6848 -3054 -14570 -15168 -10060 -20196 -30564 -33799 -25592 -28307 -38957
7065 -38957 -39305 -26423 -24995 -22640 -16052 -17451 -38388 -58572 -43009 -17311 -5962 -12197 -17737
7052 -17737 -9321 -6954 -5045 -3893 11250 4445 7903 16518 24248 23385 2560 997 20443 15315
$$ packed form
7147A7218M098J3968J1053j1270m144n120p319j0859j153J2592p754j1544R533
7134I299K561M197o073N111j805j2241N831Q237K304O737j1933Q194o518j2007
7120A894j5339r390K1692J262r77M81j3343J6264K1586K90j3265j99j1771p249
7106h064M626J5367n312j0086K0164n142j7262j2235m417L593j2212J261P829
7093b1890K4588q084j2430L809M952J5172m76J429p382r871m373o85j1611r05
7079b7757M861J1980J6563J201r902j1516n98N108j0136j0368l235Q207k715j0650
7065c8957l48J2882J428K355O588j399k0937k0184J5563K5698J1349o235n540
7052a7737Q416K367J909J152J5143o805L458Q615P730q63k0825j563J9446n128
$$ plain form
7038 15315 5777 14138 33595 30298 14197 7643 -4895 -11968 -3502 5964 3606 13856 -1133
7025 -1133 -8366 -4563 -7519 2640 3970 -5614 -17391 -21385 -18271 -22292 -7329 15684 15866 16958
7011 16958 11421 -9383 1256 9554 -5590 390 9021 10612 18449 24340 17837 11252 16698 33299
6997 33299 21626 16649 14021 7842 8624 5945 1895 6134 13779 6267 1937 4009 13818 23276 12557
6982 12557 5851 23681 32105 26166 8790 1077 524 -13131 -27683 -24920 -15646 -21010 -30919 -39253
6968 -39253 -37008 -30523 -16655 3449 14 -683 -7711 -31585 -39621 -21251 -4342 16561 21680
6955 21680 6915 -7317 -14925 -11781 -8538 -4229 -3228 377 2781 3669 3851 2715 -5519 -8751 6176
6940 6176 5498 14700 19476 18735 11035 15531 23088 22140 13502 11851 18972 9190 -998 -4888 -16940
$$ packed form
7038A5315r538Q361J9457l297j6101o554j2538p073Q466R466k358J0250j4989
7025a133p233L803k956J0159J330r584j1777l994L114m021J4963K3013J82J092
7011A6958n537k0804J0639Q298j5144N980Q631J591P837N891o503o585N446J6601
6997C3299j1673m977k628o179P82k679m050M239P645p512m330K072R809R458j0719
6982A2557o706J7830Q424n939j7376p713n53j3655j4552K763R274n364r909q334
6968c9253K245O485J3868K0104l435o97p028k3874q036J8370J6909K0903N119
6955B1680j4765j4232p608L144L243M309J001L605K404Q88J82j136q234l232J4927
6940F176o78R202M776p41p700M496P557r48q638j651P121r782j0188l890j2052
$$ plain form
6925 -16940 -22676 -8016 -12158 -19825 -22933 -6232 -1812 2557 160 -7165 -6485 -8525 -4737 5144
6911 5144 -10233 -18064 -17248 -14532 -8377 -7805 -18791 -37865 -30084 1454 8327 549 -1192 -3959
6897 -3959 -8346 -22413 -24882 -351 6432 3384 -2361 539 2159 1495 6210 -10008 -19422 -11349
6883 -11349 -22751 -11899 18511 12304 -2074 685 12378 1345 -4140 -201 -5422 7436 -812
6870 -812 -22574 -32521 -29247 -21517 -15301 -6853 -4626 4565 12578 1739 6451 5844 18565 1414
6856 1414 -23550 -31831 -29227 -19641 3348 5708 -6126 -11212 -13933 -19184 -19074 3693 8183 -3231
6842 -3231 -629 6287 9767 5015 17594 19738 7694 10458 11988 15472 3756 -6920 -499 841
6828 841 -2421 -14507 -23743 -19445 -9043 -8865 -8597 -6865 -12273 -23232 -24019 -11858 2527 8720 -6267
$$ packed form
6925a6940n736J4660m142p667l108J6701M420M369k397p325O80k040L788R881
6911E144j5377p831Q16K716O155N72j0986j9074P781L1538O873p778j741k767
6897c959m387j4067k469K4531O783l048n745K900J620o64M715j6218r414Q073
6883a1349j1402J0852L0410o207j4378K759J1693j1033n485L939n221J2858q248
6870h12k1762r947L274P730O216Q448K227R191Q013j0839M712o07J2721j7151
6856A414k4964q281K604R586K2989K360j1834n086k721n251J10K2767M490j1414
6842c231K602O916L480m752J2579K144j2044K764J530L484j1716j0676O421J340
6828H41l262j2086r236M298J0402J78K68J732n408j0959p87J2161J4385O193j4987
$$ plain form
6813 -6267 -21655 -5780 1215 3192 1530 -1019 4353 6552 10606 16657 19024 24781 11458 5418
6799 5418 15532 5997 5585 4432 -7492 -9422 4160 5231 8556 2043 -12062 -13774 -17247 -3092
6785 -3092 3384 7754 18819 15247 -11690 -13790 -3682 6753 15092 15615 12556 17520 19988 12708
6771 12708 -1815 3856 6001 689 -1333 3425 14077 19912 38165 31250 14736 5183 2635 7927
6757 7927 7454 3593 2847 3462 11380 20528 16095 11780 12626 14767 4510 7218 14030 15363 4245
6742 4245 6462 18935 16975 17572 14708 -3320 -3576 113 8400 3678 -11949 -13458 -4321 -16027
6728 -16027 -18421 -1580 17015 16711 34257 66423 92806 108249 154384 227508 326605 396255
6716 396255 375345 301728 215916 138957 93979 68736 37826 24823 24956 28514 29119 23421 7960
$$ packed form
6813f267j5388J5875O995J977j662k549N372K199M054O051K367N757j3323o040
6799E418J0114r535m12j153j1924j930J3582J071L325o513j4105j712l473J4155
6785c092O476M370J1065l572k6937k100J0108J0435Q339N23l059M964K468p280
6771A2708j4523N671K145n312k022M758J0652N835J8253o915j6514r553k548N292
6757G927m73l861p46O15P918R148m433m315Q46K141j0257K708O812J333j1118
6742D245K217J2473j960N97k864j8028k56L689Q287m722j5627j509R137j1706
6728a6027k394J6841J8595l04J7546L2166K6383J5443M6135P3124R9097O9650
6716C96255k0910p3617q5812p6959m4978k5243l0910j3003J33L558O05n698j5461
$$ plain form
6703 7960 1997 -2040 4464 5730 -7521 -4746 -13244 2638 28290 30731 18551 7014 -9037
6690 -9037 -12874 1904 611 -6198 -7086 -2521 -6339 -3973 -6226 -3768 9098 13366 -6865 -25318
6676 -25318 -9848 -5560 -8071 -2154 7446 2665 -12151 -18292 -18154 3038 20903 17955 3780 -11828
6662 -11828 -18814 -23158 -17118 -8462 -11382 6480 8504 6845 -2002 -13284 -7359 8761 7183 -846
6648 -846 -5549 8324 3911 7094 13714 7883 12013 16826 21672 23394 15409 -188 -2795 7475
6634 7475 14282 8574 13366 20697 22197 10639 1274 -16304 -14763 -12734 -22828 -10410 -5940 -11794
6620 -11794 26 -470 -4803 -17898 -13250 7019 20275 14729 19022 6751 -6567 -6785 -1171 1781
6606 1781 1814 -9996 -8630 -5799 -1834 -5199 -14872 -2588 -1551 -8420 -8923 -16486 -18528 -16210 -6195
$$ packed form
6703G960n963m037O504J266j3251K775q498J5882K5652K441j2180j1537j6051
6690i037l837J4778j293o809q88M565l818K366k253K458J2866M268k0231j8453
6676b5318J5470M288k511N917R600m781j4816o141J38K1192J7865k948j4175j5608
6662a1828o986m344O040Q656k920J7862K024j659q847j1282N925J6120j578q029
6648h46m703J3873m413L183O620n831M130M813M846J722p985j5597k607J0270
6634G475O807n708M792P331J500j1558r365j7578J541K029j0094J2418M470n854
6620a1794J1820m96m333j3095M648K0269J3256n546M293j2271j3318k18N614K952
6606A781L3j1810J366K831L965l365r673J2284J037o869n03p563k042K318J0015
$$ plain form
6591 -6195 -5208 2340 5242 8579 11311 -3017 -1089 -504 4819 8116 5280 6016 14044 23806 23765 4928
6575 4928 -21214 -32310 -26512 -16019 -1298 8221 6213 856 -5181 -360 638 3422 6683 10492
6561 10492 6685 -5433 -6835 -12910 -10011 -7033 -6654 -1110 -5101 -17682 -25051 -19663 -9257 -4399
6547 -4399 8722 5583 -3332 4587 17015 4276 -7641 -9117 -10574 -434 -4536 -3767 5704 -765
6533 -765 144 -2768 -4408 -13648 -20604 -13897 -6199 -1958 226 9735 19323 6657 2048 5007 6573
6518 6573 5020 2684 -13613 -206 -2740 -18921 -25610 -28441 -24530 -6771 618 1286 11322 9182
6504 9182 2255 -2863 -9166 -5691 -4052 615 2071 -1575 -9962 -14741 -22348 -6108 -2473 -11797 -22360
6489 -22360 -18420 -11218 307 11958 10535 1067 17452 33174 5172 -15656 -12801 810 17146
$$ packed form
6591f195R87P548K902L337K732j4328J928N85N323L297k836P36Q028R762m1j8837
6575D928k6142j1096N798J0493J4721R519k008n357o037M821R98K784L261L809
6561A0492l807j2118j402o075K899K978L79N544l991j2581p369N388J0406M858
6547d399J3121l139q915P919J2428j2739j1917j476j457J0140m102P69R471o469
6533g65R09k912j640r240o956O707P698M241K184R509R588j2666m609K959J566
6518F573j553k336j6297J3407k534j6181o689k831L911J7759P389O68J0036k140
6504I182o927n118o303L475J639M667J456l646q387m779p607J6240L635r324j0563
6489b2360L940P202J1525J1651j423r468J6385J5722k8002k0828K855J3611J6336
$$ plain form
6476 17146 16481 11115 19783 10915 2853 6637 7025 -10102 -14126 -21403 -23121 -16880 -10861 -18168 -7732
6461 -7732 1942 -9651 -19260 -22894 -20053 -15376 -10437 -14149 -14868 -8326 -11127 5287 -8 -13507
6447 -13507 -5081 1046 -3992 4572 4780 -3149 -9534 -3923 -4322 -13353 -7593 16792 18043 4203 5069
6432 5069 6628 -2983 -4210 -7176 -23395 -12954 -5247 3141 10090 17142 10224 -15945 -18092 -9715
6418 -9715 -10091 -10550 -16804 -27067 -30379 -22614 -7700 -2773 -12071 -6748 -2792 -4336 -2232 12826 -2270
6403 -2270 -13225 -5741 -6701 -3886 -5253 -20359 -25646 -879 17154 5310 -11840 -13484 -4131 -9792
6389 -9792 -5030 -1455 -10329 -17642 -16509 -8586 -1190 -8945 -3939 14275 11134 -3780 -10248 -20106
6375 -20106 -9824 -4106 -3103 3644 17539 21352 3035 -10039 -5284 -13304 -11681 -6028 -22790
$$ packed form
6476A7146o65n366Q668q868q062L784L88j7127m024p277j718O241O019p307J0436
6461g732R674j1593r609l634K841M677M939l712p19O542k801J6414n295j3499
6447a3507Q426O127n038Q564K08p929o385N611l99r031N760K4385J251j3840Q66
6432E069J559r611j227k966j6219J0441P707Q388O949P052o918k6169k147Q377
6418i715l76m59o254j0263l312P765J4914M927r298N323L956j544K104J5058j5096
6403b270j0955P484r60K815j367j5106n287K4767J8033j1844j7150j644R353n661
6389i792M762L575q874p313J133P923P396p755N006J8214l141j4914o468r858
6375b0106J0282N718J003O747J3895L813j8317j3074M755q020J623N653j6762
$$ plain form
6362 -22790 -23012 -21884 -8687 -3830 4540 6343 -4261 -9633 -11966 -3751 -17112 -23911 -8702 -11596
6348 -11596 -13550 -27506 -41582 -44564 -14018 2853 10031 -325 -7777 -7399 -1357 -6620 -18225
6335 -18225 -8478 6952 3095 875 -5160 -13899 -13102 -22882 -22144 -11850 -15761 -10092 -19378 -23158 -17323
6320 -17323 -4017 -11865 -20007 -19387 -13032 -12362 -2530 14992 15341 18685 14200 3113 974 8019 17409
6305 17409 16993 21387 32641 21278 352 -8506 1442 -5853 -8993 -4645 1155 285 1906 2477 5195
6290 5195 -2905 5977 -5927 3268 20311 9831 547 190 -3357 -7640 -3350 -6480 -2447 3150
6276 3150 -19253 -31786 -21788 -19756 -31602 -17472 -5527 -8575 -7084 -8421 -5262 -1930 -4999 -21052
6262 -21052 -22696 -6121 8360 11191 16137 8283 1066 1511 -2297 -4199 -3353 -4819 -5289 -10224 -19743
$$ packed form
6362b2790k22J128J3197M857Q370J803j0604n372k333Q215j3361o799J5209k894
6348a1596j954j3956j4076k982L0546J6871P178j0356p452L78O042n263j1605
6335a8225R747J5430l857k220o035q739P97r780P38J0294l911N669r286l780N835
6320a7323J3306p848q142O20O355O70R832J7522L49L344m485j1087k139P045R390
6305A7409m16M394J1254j1363k0926q858R948p295l140M348N800q70J621N71K718
6290E195q100Q882j1904R195J7043j0480r284l57l547m283M290l130M033N597
6276C150k2403j2533R998K032j1846J4130J1945l048J491j337L159L332l069j6053
6262b1052j644J6575J4481K831M946p854p217M45l808j902Q46j466m70m935r519
$$ plain form
6247 -19743 1614 -5046 -16190 -12484 -10358 -17751 -34517 -34057 -32035 -10693 5870 -13111 -33874
6234 -33874 -29571 -22618 -18221 -10831 -3310 2929 35 -2954 -1196 -7735 -10264 -6969 -7304 -7277 4026
6219 4026 17949 24640 3759 -7172 -2012 -8505 -17681 -28387 -38435 -25072 -11908 -5728 -3609
6206 -3609 956 1527 -3966 -7657 -12686 4820 6860 6730 -4464 -5926 -2969 -6932 -12370 -2147 -2194
6191 -2194 7466 14304 18984 15669 18734 12824 34 9083 3248 -2402 16282 22551 3878 5159
6177 5159 7239 7055 -55 -4316 -8124 -8484 -11145 -6458 4033 7710 3104 902 -3970 -21926 -19514
6162 -19514 -18609 -25217 -10701 738 -7563 -13201 -18440 -24013 -16935 -16615 -25388 -22814 -13327 -12769 -6484
6147 -6484 -2602 -6916 389 -787 -3629 -36 -10782 -20848 -17434 -10840 -9431 -9711 -15425 -700
$$ packed form
6247a9743K1357o660j1144L706K126p393j6766M60K022K1342J6563j8981k0763
6234c3874M303O953M397P390P521O239k894k989J758o539k529L295l35K7J1303
6219D026J3923O691k0881j0931N160o493r176j0706j0048J3363J3164O180K119
6206c609M565N71n493l691n029J7506K040j30j1194j462K957l963n438J0223m7
6191b194R660O838M680l315L065n910j2790R049n835n650J8684O269j8673J281
6177E159K080j84p110m261l808l60k661M687J0491L677m606k202m872j7956K412
6162a9514R05o608J4516J1439q301n638n239n573P078L20q773K574R487N58O285
6147f484L882m314P305j176k842L593j0746j0066L414O594J409k80n714J4725
$$ plain form
6133 -700 7439 12216 13711 14548 -2587 -8303 -17715 -20121 -27650 -21037 -14296 -18327 -10529 2180 10947
6118 10947 6096 990 8851 10209 15938 14071 2697 -3772 -4535 -7523 -13818 -18514 -19348 -15624 -7680
6103 -7680 -10936 -8753 -7321 3918 3715 376 4482 8168 2358 -19258 -21600 -18187 -4903 3663
6089 3663 -906 9281 12750 1511 -18661 -22561 -18010 -9855 -11194 -19966 -23882 -16744 -1279 7741
6075 7741 -229 3839 575 -367 4861 6679 -659 -11228 705 13984 14618 16189 14141 478
6061 478 -9997 -15229 -1742 6339 3200 -11641 -27102 -22786 -6705 7961 304 -4157 -1318 1298
6047 1298 -2293 -7299 -10064 -10565 -3380 4513 9418 13451 17872 18593 16638 30834 29939 24390 21481
6032 21481 28243 26695 17919 -1306 -8270 -5235 9517 11508 8941 24103 22600 13532 17571 -183
$$ packed form
6133g00Q139M777J495Q37j7135n716r412k406p529O613O741m031P798J2709Q767
6118A0947m851n106P861J358N729j867j1374o469p63k988o295m696q34L724P944
6103g680l256K183J432J1239k03l339M106L686n810k1616k342L413J3284Q566
6089C663m569J0187L469j1239k0172l900M551Q155j339q772l916P138J5465R020
6075G741p970M068l264r42N228J818p338j0569J1933J3279O34J571k048j3663
6061D78j0475n232J3487Q081l139j4841j5461M316J6081J4666p657m461K839K616
6047A298l591n006k765n01P185P893M905M033M421P21j955J4196q95n549k909
6032B1481O762j548q776j9225o964L035J4752J991k567J5162j503r068M039j7754
$$ plain form
6018 -183 -18358 -17955 -22430 -15129 -8789 -7662 -2764 -9076 -19310 -25264 -25343 -9365 -16492 -15640 -11761
6003 -11761 -18153 -26605 -32202 -20735 -3646 7606 15778 7734 -3857 -11261 1351 14919 7862
5990 7862 9413 3901 -13254 -14445 -11480 -25292 -15892 2655 -5045 -10154 -14652 -19179 -7709 -3028
5976 -3028 -9169 -12081 -12775 -10656 -23573 -29969 -21352 -21000 -26902 -14381 -27275 -32410 -23211 -6255
5962 -6255 9428 16093 17135 13856 16095 -916 -11991 -20234 -14511 -18235 -7695 22237 30763 26294
5948 26294 12806 -806 1689 -8898 -14646 -3158 -3440 -8184 2074 13420 7247 1944 3306
5935 3306 2804 -2993 -11700 -25228 -16424 -2782 3868 -1152 3066 4367 13724 19755 11745 -583
5921 -583 11505 14458 326 -11513 -20035 -29627 -26372 260 4764 -11707 -9861 -3246 -3376 -15195
$$ packed form
6018a83j8175M03m475P301O340J127M898o312j0234n954p9J5978p127Q52L879
6003a1761o392q452n597J1467J7089J1252Q172q044j1591p404J2612J3568p057
5990G862J551n512j7155j191K965j3812R400J8547p700n109m498m527J1470M681
5976c028o141k912o94K119j2917o396Q617L52n902J2521j2894n135R199J6956
5962f255J5683O665J042l279K239j7011j1075q243N723l724J0540K9932Q526m469
5948B6294j3488j3612K495j0587n748J1488k82m744J0258J1346o173n303J362
5935C306n02n797q707j3528Q804J3642O650n020M218J301R357O031q010j2328
5921e83J2088K953j4132j1839q522r592L255K6632M504j6471J846O615j30j1819
$$ plain form
5907 -15195 5777 14771 -2415 -8015 -10929 -11802 -6280 563 226 -5736 -10009 -25605 -25877 -34828 -26355
5892 -26355 -7257 1147 3339 7371 22190 33162 26526 9457 3975 395 2135 -1282 4667 2851
5878 2851 7931 11747 3987 -914 1381 1840 -7453 -7512 -2832 -7846 6809 16596 21775 15997 8548
5863 8548 -6952 -7371 2539 -1733 4807 1495 -11278 -16010 -20019 -5927 6846 6095 17270 30306
5849 30306 20542 13837 8942 -8346 -3457 4096 18070 12161 7341 -7876 -1152 -24 -12343 -17803
5835 -17803 -14908 -31086 -38068 -981 16157 7548 -1404 -2664 -2872 310 6847 2914 -8657 -10039
5821 -10039 -10265 -20318 -21493 -8316 -3638 845 9387 683 -16280 -16191 -285 11224 9444 -5674
5807 -5674 -14612 -16029 -15910 -10737 1653 9182 5026 21118 21793 1204 -5775 -14158 -17104 -16370 -16177
$$ packed form
5907a5195K0972Q994j7186n600k914q73N522O843l37n962m273j5596k72q951Q473
5892b6355J9098Q404K192M032J4819J0972o636j7069n482l580J740l417N949j816
5878B851N080L816p760m901K295M59r293n9M680n014J4655R787N179n778p449
5863H548j5500m19R910m272O540l312j2773m732m009J4092J2773p51J1175J3036
5849C0306r764o705m895j7288M889P553J3974n909m820j5217O724J128j2319n460
5835a7803K895j6178o982L7087J7138q609q952j260k08L182O537l933j1571j382
5821a0039k26j0053j175J3177M678M483Q542q704j6963Q9J5906J1509j780j5118
5807e674q938j417J19N173J2390P529m156J6092O75k0589o979q383k946P34J93
$$ plain form
5792 -16177 -10434 5959 -2411 -4270 3362 7433 14580 15293 16885 11201 -5701 -22308 -16301 -15869
5778 -15869 -32004 -33257 -22515 -10599 -9279 -2069 3073 -5305 -15749 -14189 -12808 5155 16948
5765 16948 23073 28802 23388 9876 10311 4032 99 -11377 -15582 -3898 -15864 -26533 -25741 -39350
5751 -39350 -24792 -1889 6278 -1346 -2638 -3927 -8679 -1469 1648 -4302 -6031 -3399 -11279 -2354
5737 -2354 -4752 -11316 -19079 -13004 -12336 -18635 -32596 -28402 -30483 -27635 -7404 -552 -918 4046 6041
5722 6041 9196 5684 432 -175 -9241 -5392 1489 925 2584 14343 18874 2500 -7301 -10688 -9130
5707 -9130 -4193 4711 14449 1412 -3508 -2097 -8436 -17839 -4007 8033 5599 1101 19679 18066
5693 18066 24782 25323 18931 24459 23140 3123 4536 10731 5447 20611 13646 -6757 -4967 3974
$$ packed form
5792a6177N743J6393q370j859P632M071P147P13J592n684j6902j6607O007M32
5778a5869j6135j253J0742J1916J320P210N142q378j0444J560J381J7963J1793
5765A6948O125N729n414j3512M35o279l933j1476m205J1684j1966j0669P92j3609
5751c9350J4558K2903Q167p624j292j289m752P210L117n950j729K632p880Q925
5737b354k398o564p763O075O68o299j3961M194k081K848K0231O852l66M964J995
5722F041L155l512n252o07r066L849O881n64J659J1759M531j6374r801l387J558
5707i130M937Q904R738j3037m920J411o339r403J3832J2040k434m498J8578j613
5693A8066O716N41o392N528j319k0017J413O195n284J5164o965k0403J790Q941
$$ plain form
5679 3974 -5166 130 -9036 -22886 -18517 -11748 -6048 -15670 2342 17622 11169 9047 8625 -4447
5665 -4447 -9914 -3347 -213 3507 1941 -6809 -20821 -20627 -27477 -23824 -24768 -30768 -11607 -11490 -5633
5650 -5633 3038 -4533 -18499 -6307 -475 828 5143 1886 2082 -14326 -15502 -12042 -3304 -9179
5636 -9179 -12320 -14143 -9980 -4025 -17771 -10910 15799 24979 21316 7623 10134 9221 5581 -5330
5622 -5330 -12394 -22493 -24774 -20054 -23490 -27563 -5714 508 -8218 -6428 -3363 3247 -3365 -10367
5608 -10367 -8745 -7199 -2453 -2156 -16284 -25093 -22634 -9552 1787 -718 -5013 -1442 -9544 -12021
5594 -12021 -7258 16883 21340 18351 2764 -15491 -17173 -14991 -15423 -29280 -33070 -27171 -25761 -33573
5580 -33573 -32723 -9672 8861 1518 -4619 -9138 -12775 -3627 9395 8213 3043 -8332 -17697 -21822
$$ packed form
5679C974r140N296r166j3850M369O769N700r622J8012J5280o453k122m22j3072
5665d447n467O567L134L720j566q750j4012J94o850L653r44o000J9161J17N857
5650e633Q671p571j3966J2192N832J303M315l257J96j6408j176L460Q738n875
5636i179l141j823M163N955j3746O861K6709R180l663j3693K511r13l640j0911
5622e330p064j0099k281M720l436m073K1849O222q726J790L065O610o612p002
5608a0367J622J546M746K97j4128q809K459J3082J1339k505m295L571q102k477
5594a2021M763K4141M457k989j5587j8255j682K182m32j3857l790N899J410p812
5580c3573Q50K3051J8533p343o137m519l637R148J3022j182n170j1375r365m125
$$ plain form
5566 -21822 -22841 -14669 -10777 -3096 -2011 -18229 -32105 -15047 -251 -2202 -20788 -30273 -42756
5553 -42756 -32417 -9923 -2897 -3312 2729 -6317 -8960 -14229 -6735 5988 1733 -22383 -21368 -13661
5539 -13661 -13863 -9097 -7465 2632 2663 2857 -4161 -8204 -7748 -1289 -3689 -12756 -1927 5158 3357
5524 3357 2409 -1723 -8466 -17829 -11950 -186 18115 20796 8683 980 3299 4747 -7442 -8399
5510 -8399 4533 -122 2306 -233 -373 -5606 -1311 4451 -5330 -12889 -10003 -9601 -7606 -7570 4500
5495 4500 9953 -3471 -7725 2620 787 -12925 1338 11384 -5137 -10524 10488 19181 3723
5482 3723 -5314 1701 11276 19580 20222 15689 2420 -8140 -3770 -12800 -15649 -17454 -11412 -2373 6033
5467 6033 10551 7498 8892 5243 -13425 -11747 -5184 24 -13156 -19870 -15436 271 8270 5463
$$ packed form
5566b1822j019Q172L892P681J085j6218j3876J7058J4796j951j8586r485j2483
5553d2756J0339K2494P026m15O041r046k643n269P494J2723m255k4116J015P707
5539a3661k02M766J632J0097L1J94p018m043M56O459k400r067J0829P085j801
5524C357r48m132o743r363N879J1764J8301K681j2113p703K319J448j2189r57
5510h399J2932m655K428k539j40n233M295N762r781p559K886M02J995L6J2070
5495D500N453j3424m254J0345j833j3712J4263J0046j6521n387K1012Q693j5458
5482C723r037P015R575Q304O42m533j3269j0560M370r030k849j805O042R039Q406
5467F033M518l053J394l649j8668J678O563N208j3180o714M434J5707P999k807
$$ plain form
5453 5463 -23077 -28529 -13515 7161 24890 17688 13999 14273 1077 -9649 -8778 -22555 -2690
5440 -2690 5407 6663 4056 6245 21220 26534 7163 -2865 -11356 -17036 -11736 -10162 -17533 -11845
5426 -11845 450 -3076 -6187 -25346 -12494 -5682 -2488 -8461 -9571 -4819 -8353 -10280 -20004 -29891
5412 -29891 -23525 -18484 -20214 -22836 -17902 -8878 -12358 -11995 1139 5108 3034 -10857 -16083 -10466
5398 -10466 10165 24932 20845 7846 1728 2809 4552 5291 11839 10209 -9066 -24067 -16512 -15192
5384 -15192 -24892 -25813 -8150 -5884 -21307 -12773 -6970 -7926 -10507 -30399 -28186 -24391 -9052 -12401
5370 -12401 -14063 -5693 4919 -4843 -10519 -17130 -11775 11855 14503 16903 5498 4118 -6532 -13166
5356 -13166 -11377 -12768 -27946 -28956 -16863 -12524 -7176 -10320 -9491 -6059 -1991 2352 5346 9038
$$ packed form
5453E463k8540n452J5014K0676J7729p202l689K74j3196j0726Q71j3777J9865
5440b690Q097J256k607K189J4975N314j9371j0028q491n680N300J574p371N688
5426a1845J2295l526l111j9159J2852O812L194n973j110M752l534j927r724r887
5412b9891O366N041j730k622M934R024l480L63J3134L969k074j3891n226N617
5398a0466K0631J4767m087j2999o118J081J743P39O548j630j9275j5001P555J320
5384a5192r700r21J7663K266j5423Q534N803r56k581j9892K213L795J5339l349
5370a2401j662Q370J0612r762n676o611N355K3630K648K400j1405j380j0650o634
5356a3166J789j391j5178j010J2093M339N348l144Q29L432M068M343K994L692
$$ plain form
5342 9038 20582 15572 2706 -5669 -5127 9344 3988 1295 -7970 -19382 -23394 -21063 -20688 -18794
5328 -18794 -8630 -7927 -4090 -15546 -23187 -24744 -16298 2137 1412 -1674 1958 -8095 -8457 2135
5314 2135 14001 13017 -2405 -17067 -17906 -6917 -6204 -5282 -16535 -9889 89 -1998 10852 17416
5300 17416 11263 11541 11413 7095 -2884 1535 4920 -5558 -7177 -23243 -20998 -10782 -8630 -13169
5286 -13169 -5952 7356 1075 -4441 -3037 -6912 -10458 -16349 -23869 -27277 -30180 -25796 -23897 -20009
5272 -20009 -7119 -2964 -1242 -797 13620 19305 -1191 -21200 -13612 -12433 -18165 -20726 -22323 -31188
5258 -31188 -26344 -24474 -15716 -7316 -2895 -4620 -19909 -10483 -7419 -5422 -953 17711 20704 11284
5244 11284 7719 29090 27018 22302 23440 29705 25056 18690 16062 12234 13875 14878 -1084 -16087
$$ packed form
5342I038J1544n010j2866q375N42J4471n356k693r265j1412m012K331L75J894
5328a8794J0164P03L837j1456p641j557Q446J8435p25l086L632j0053l62J0592
5314B135J1866r84j5422j4662q39J0989P13R22j1253O646R978k087J2850O564
5300A7416o153K78j28m318r979M419L385j0478j619j6066K245J0216K152m539
5286a3169P217J3308o281n516J404l875l546n891p520l408k903M384J899L888
5272b0009J2890M155J722M45J4417N685k0496k0009P588J179n732k561j597q865
5258c1188M844J870Q758Q400M421j725j5289R426L064J997M469J8664K993r420
5244A1284l565K1371k072m716J138O265m649o366k628l828J641J003j5962j5003
$$ plain form
5230 -16087 -2286 7687 -10199 770 -4240 -10 2814 -1443 -12085 -193 7325 -1259 2478
5217 2478 -4082 -5867 1389 7966 6640 14161 -7069 -25053 -34608 -34606 -32840 -14994 -1689 7931 11183
5202 11183 10134 2415 -5849 3967 10608 8398 12344 12058 3595 1021 -1794 4025 -4561 3531 13375
5187 13375 2680 1657 -7885 -289 21148 11941 -3389 -959 -7381 -6284 13098 12184 7673 -508
5173 -508 -1459 885 6659 1729 -2207 4299 -1238 -16126 -28900 -13830 1836 -6182 -1034 6388
5159 6388 -3855 -11218 -12164 -11262 -18478 -25177 -15268 651 5685 9078 17871 16442 12020 10345 1997
5144 1997 3148 5872 5516 10080 10194 -486 -5584 -18672 -20664 -24566 -17386 -1991 7344 14051 25361
5129 25361 16713 9871 7637 12116 -2571 -3456 14838 12621 4218 -979 -2334 730 -1494 -3828
$$ packed form
5230a6087J3801R973j7886J0969n010M230K824m257j0642J1892P518q584L737
5217B478o560j785P256O577j326P521k1230j7984r555KJ766J7846J3305R620L252
5202A1183j049p719q264R816O641k210L946k86q463k574k815N819q586Q092R844
5187A3375j0695j023r542P596K1437r207j5330K430o422J097J9382r14m511q181
5173e08r51K344N774m930l936O506n537j4888j2774J5070J5666q018N148P422
5159F388j0243p363r46R02p216o699R909J5919N034L393Q793j429m422j675q348
5144A997J151K724l56M564J14j0680n098j3088j992l902P180J5395R335O707J1310
5129B5361q648o842k234M479j4687q85J8294k217q403n197j355L064k224k334
$$ plain form
5115 -3828 -3434 -7116 -8159 1832 -5300 -5402 12397 12432 14073 13248 19594 32155 29022 8915 -8740
5100 -8740 -5740 -2470 8916 -1913 -14911 -18030 -21158 -15663 -3114 1007 -9144 -6006 934 -9712
5086 -9712 -19561 -3817 8429 5871 5003 1714 -10172 -22512 -7297 6689 21107 31646 12982
5073 12982 -5699 -17334 -22234 -18628 -13333 -12551 -14213 -10781 4763 -2037 -10430 1465 7634 3326
5059 3326 -1550 -12212 -9079 4990 15576 5206 -7274 -16077 -8816 4823 5536 -11295 -13133
5046 -13133 -4539 -15405 -21817 -7183 -601 -4782 -7660 -7212 -11354 -4737 8778 -8225 -15867 -10642
5032 -10642 -11219 -6949 -11287 -16364 -22996 -27271 -14186 -4927 -4380 -13428 -22208 -8849 -8908 -19779 -5586
5017 -5586 7707 4651 1744 589 -1416 513 14571 31109 14062 5260 -1828 -8927 855 5029
$$ packed form
5115c828L94l682j043R991p132j02J7799L5J641q25O346J2561l133k0107j7655
5100h740L000L270J1386j0829j2998l119l128N495J2549M121j0151L138O940j0646
5086i712r849J5744J2246k558q68l289j1886j2340J5215J3986J4418J0539j8664
5073A2982j8681j1635m900L606N295P82j662L432J5544o800q393J1895O169m308
5059C326m876j0662L133J4069J0586j0370j2480q803P261J3639P13j6831j838
5046a3133Q594j0866o412J4634O582m181k878M48m142O617J3515j7003p642N225
5032a0642n77M270m338n077o632m275J3085R259N47r048q780J3359n9j0871J4193
5017e586J3293l056k907j155k005J929J4058J6538j7047q802p088p099R782M174
$$ plain form
5003 5029 -1109 -11736 -5980 1063 13296 10038 -1519 53 4654 -2836 -3074 -3833 5171 -550 -1977
4988 -1977 -15961 -23708 -25639 -22830 -20234 -11706 -12003 -12154 -13320 -6498 -7767 -9704 -11116 -11345 -4074
4973 -4074 3711 -189 -2702 -1320 -6549 -11771 -11970 -11276 -2325 764 213 -3000 -6639 1123 -558 -2623
4957 -2623 9591 18942 12702 7417 -10929 -18446 -21668 -15260 4760 -5551 -7228 -12443 -20352 -13723
4943 -13723 -1378 6764 12641 11804 8704 3006 10790 1395 -11261 -33235 -34920 -29425 -18794 -14793
4929 -14793 -18844 -29059 -29737 -20545 -18893 -16505 -7375 -6883 -13844 4162 18824 14537 1570 1927
4915 1927 2036 5931 -8251 -7105 -4609 -2946 -12833 -23219 -22254 -24324 -18739 -9852 705 54 6323
4900 6323 14671 3651 -11456 -8473 3575 15333 15707 20711 17365 11036 13736 29202 43413 41832
$$ packed form
5003E029o138j0627N756P043J2233l258j1557J572M601p490k38p59R004n721j427
4988a977j3984p747j931K809K596Q528k97j51j166O822j269j937j412k29P271
4973d074P785l900k513J382n229n222j99O94Q951L089n51l213l639P762j681k065
4957b623J2214R351o240n285j8346p517l222O408K0020j0311j677n215p909O629
4943a3723J2345Q142N877q37l100n698P784r395j2656k1974j685N495J0631M001
4929a4793m051j0215o78R192J652K388R130M92o961J8006J4662m287j2967L57
4915A927J09L895j4182J146K496J663r887j0386R65k070N585Q887J0557o51O269
4900F323Q348j1020j5107K983J2048J1758L74N004l346o329K700J5466J4211j581
$$ plain form
4886 41832 40614 32200 9930 9258 17672 23029 23458 27126 31462 22587 13918 7198 -2221 2672 26901
4871 26901 24039 10388 2984 2820 9842 8423 -18300 -36363 -27493 -22467 -10859 -9006 -25556 -23974
4857 -23974 -23860 -20084 -21958 -17601 -19758 -22927 -11414 -13814 -12513 -8363 -7934 -6683 -18397 -24097 -33989
4842 -33989 -29297 -17978 -7712 -4737 -10648 -9818 -539 6980 -2645 2339 13613 17672 1081 -13214
4828 -13214 -22150 -10577 -10742 -11247 -22795 -21571 -20825 -21381 -3544 4166 -12304 -25021 -15829 -2484
4814 -2484 -2087 4806 10448 3455 6199 12326 7502 6315 16347 27944 30685 18508 5145 2043
4800 2043 4362 12245 22801 21416 14977 12788 16704 21960 18463 5872 -172 -2190 -8089 -12844
4786 -12844 -13950 -16486 -9613 -4553 -11764 -11753 5611 11971 -6017 -8374 -4451 3753 4293 -9838 -13098
$$ packed form
4886D1832j218q414k2270o72Q414N357M29L668M336q875q669o720r419M893K4229
4871B6901k862j3651p404j64P022j419k6723j8063Q870N026J1608J853j6550J582
4857b3974J14L776j874M357k157l169J1513k400J301M150M29J251j1714n700r892
4842c3989M692J1319J0266K975n911Q30R279P519r625M984J1274M059j6591j4295
4828a3214q936J1573j65n05j1548J224P46n56J7837P710j6470j2717R192J3345
4814b484L97O893N642o993K744O127m824j187J0032J1597K741j2177j3363l102
4800B043K319P883J0556j385o439k189L916N256l497j2591o044k018n899m755
4786a2844j106k536O873N060p211J1J7364O360j7988k357L923Q204N40j4131l260
$$ plain form
4771 -13098 -2193 4294 -4527 -21418 -14047 -7894 -6649 -3842 -6856 407 -4057 -8426 -15392 -22681
4757 -22681 -17795 -5105 -1839 -9411 8228 18550 4549 -13221 -17907 -14174 -3815 3927 14177
4744 14177 7444 2701 763 4806 3025 -12555 -12705 -10147 -22856 -34210 -32211 -19013 -3369 -1722
4730 -1722 -6399 -6856 3508 5793 -134 -9757 3423 12497 17098 9902 -6753 -4549 -6315 -2130
4716 -2130 -8286 -9482 7782 11988 7554 1106 -3750 -11282 -11710 -12438 -4105 -10013 -17476 -18695 -20362
4701 -20362 -36808 -38970 -23004 -18545 -25056 -24040 -23289 401 10955 2785 3514 8039 18737 4282
4687 4282 -12657 -15056 -22708 -16674 480 4297 5214 8165 14612 3281 -15742 -18857 5419 5393
4673 5393 1761 -2735 -8311 -3483 -11058 -3946 10899 15524 -270 -22495 -39353 -28610 -22183 -18389
$$ packed form
4771a3098J0905O487q821j6891P371O153J245K807l014P263m464m369o966p289
4757b2681M886J2690L266p572J7639J0322j4001j7770m686L733J0359P742J0250
4744A4177o733m743j938M043j781j5580j50K558j2709j1354J999J3198J5644J647
4730a722m677m57J0364K285n927r623J3180R074M601p196j6655K204j766M185
4716b130o156j196J7264M206m434o448m856p532m28p28Q333n908p463j219j667
4701b0362j6446k162J5966M459o511J016P51K3690J0554q170P29M525J0698j4455
4687D282j6939k399p652O034J7154L817R17K951O447j1331j9023l115K4276k6
4673E393l632m496n576M828p575P112J4845M625j5794k2225j6858J0743O427L794
$$ plain form
4659 -18389 -13149 -2239 9597 21510 26666 19737 -596 -13599 -3009 -6656 -10159 -10650 -2883
4646 -2883 3489 -16761 -38064 -34122 -31882 -27733 -30437 -36814 -34061 -13351 1191 -4404 -7965 -4886
4632 -4886 -9770 -24204 -16972 -10986 -6473 3573 2361 -2601 -3368 -7464 -12646 -25325 -23707 -21315
4618 -21315 -34097 -22131 -12047 -14543 -8361 -2124 -18736 -13570 -11101 -16629 -10788 -2407 -5019 -25382
4604 -25382 -27660 -26472 -18546 -15191 -8185 -16803 -18863 -3989 11374 -2496 -13993 -17379 -13003 -12784
4590 -12784 -20497 -10857 -9774 -7080 -17723 -20881 -20562 -21036 -12663 -4988 -4503 -10768 -20671 -13434 -4891
4575 -4891 -8278 -3383 -12678 -16238 -30478 -29711 -8969 -9599 -18479 -21025 -13728 2825 17862 11665
4561 11665 3621 -10985 -39400 -55224 -48709 -36937 -23400 -24005 -22998 -26020 -23817 -21276 -19183 -8712
$$ packed form
4659a8389N240J0910J1836J1913N156o929k0333j3003J0590l647l503m91P767
4646b883O372k0250k1303L942K240M149k704o377K753K0710J4542n595l561L079
4632d886m884j4434P232N986M513J0046j212m962p67m096n182j2679J618K392
4618b1315j2782J1966J0084k496O182O237j6612N166K469n528N841Q381k612k0363
4604b5382k278J188P926L355P006q618k060J4874J5363j3870j1497l386M376K19
4590a2784p713R640J083K694j0643l158L19m74Q373P675M85o265r903P237Q543
4575d891l387M895r295l560j4240P67K0742o30q880k546P297J6553J5037o197
4561A1665q044j4606k8415j5824O515J1772J3537o05J007l022K203K541K093J0471
$$ plain form
4547 -8712 6528 6789 -11925 -13903 -3367 3399 7254 15695 16445 20152 11728 -4129 6845 13722
4533 13722 3678 250 12537 16623 17883 17897 15157 9899 -4273 -6937 -15747 -20849 -14777 -24517
4519 -24517 -33727 -27407 2711 5240 -5928 -8430 -6621 -8644 -8255 -10790 -4716 3387 13576 10983
4505 10983 -1127 -11932 -13758 -4452 742 -2698 -8553 -6238 4986 -7188 -17874 -30159 -19711
4492 -19711 -13627 -9328 3900 -5991 -6807 -2704 -13277 -9083 9469 11830 5699 3511 1040 -432
4478 -432 -1176 -2631 -8609 -12796 -4853 -9579 -10916 -12312 -20438 -14529 -10567 -7609 -15215 -24329 -24450 -9350
4462 -9350 -19121 -27484 -22059 -22293 -15683 -18143 -24109 -40073 -40373 -27768 -21253 -19433 -13066 -10507 -8025
4447 -8025 1118 3827 2188 5148 12004 11051 4609 5902 16484 10200 -15400 -23792 -22379 -19519 -16116
$$ packed form
4547h712J5240K61j8714j978J0536O766L855Q441P50L707q424j5857J0974O877
4533A3722j0044l428J2287M086J260J4k740n258j4172k664q810n102O072r740
4519b4517r210O320L0118K529j1168k502J809k023L89k535O074Q103J0189k593
4505A0983j2110j0805j826R306N194l440n855K315J1224j2174j0686j2285J0448
4492a9711O084M299J3228r891q16M103j0573M194J8552K361o131k188k471j472
4478d32p44j455n978m187P943m726j337j396q126N909L962K958p606r114j21J5100
4462i350r771q363N425k34O610k460n966j5964l00J2605O515J820O367K559K482
4447h025R143K709j639K960O856r53o442J293J0582o284k5600q392J413K860L403
$$ plain form
4432 -16116 -6933 1015 7141 14392 17269 21944 15777 10231 11943 20644 5991 3489 9751 17902
4418 17902 19321 10439 3500 7702 4070 -1703 6157 12327 -1740 -4959 -6276 -10395 893 7734
4404 7734 -2225 8965 17627 3670 -15245 -13997 -19980 -13131 -8425 -8508 3599 -4765 -9600 -11197
4390 -11197 -12487 -10002 -13959 -14534 -20503 -4099 19885 13277 -1447 3904 16019 23403 11809 7825
4376 7825 5339 6133 7636 4896 -2741 2952 13383 3202 -6790 -15895 -15321 -13773 -3897 2101 -2775
4361 -2775 -5129 798 7613 9244 18029 17119 -870 -18704 -19381 -15773 -19162 -4556 -6186 -13967 -12935
4346 -12935 -5688 1166 3927 -3930 -8506 -11210 -27066 -20421 -13640 -17427 -4796 1290 -5990 -3628
4332 -3628 -967 25824 26670 21884 9787 4813 -3547 -13981 -24719 -35092 -21112 -19787 -26706 -22809
$$ packed form
4432a6116R183P948O126P251K877M675o167n546J712Q701j4653k502O262Q151
4418A7902J419q882o939M202l632n773P860O170j4067l219j317m119J1288O841
4404G734r959J1190Q662j3957j8915J248n983O849M706q3J2107q364m835j597
4390a1197j290K485l957n75n969J6404K3984o608j4724N351J2115P384j1594l984
4376G825k486P94J503k740p637N693J0431j0181r992r105N74J548R876N998m876
4361b775k354N927O815J631Q785r10j7989j7834o77L608l389J4606j630p781J032
4346a2935P247O854K761p857m576k704j5856O645O781l787J2631O086p280K362
4332c628K661K6791Q46m786j2097m974q360j0434j0738j0373J3980J325o919L897
$$ plain form
4318 -22809 -30060 -27184 -34304 -33248 -18141 -10027 -9566 -3593 -2214 -1401 10158 -7584 -7540 -2316 1174
4303 1174 -774 -5640 -10174 -11988 -7762 -2670 -8688 -12842 -8607 790 3500 8821 8158 2548 -17286
4288 -17286 -29311 -34218 -29601 -34531 -22259 -16498 -19189 -19801 -19428 -21052 -16626 -8406 -3849 3235 7004
4273 7004 11090 21151 8284 -2933 -11218 -6871 -21130 -7758 12601 4278 -9345 -11747 -12577
4260 -12577 -10203 -1795 4217 -7780 -27958 -27916 -11269 701 3320 4055 6859 3417 11427 20544
4246 20544 6200 8014 15982 14642 13457 20240 11388 4546 5873 10448 12324 16690 15150 16224
4232 16224 27159 38477 34152 14485 -12006 -29174 -37504 -32165 -21075 -1195 9364 2565 -15965
4219 -15965 -5930 -15575 -5942 5407 -3795 -11096 -5386 -2881 -2561 -3927 -4330 -7084 -15484 -21941 -24566
$$ packed form
4318b2809p251K876p120J056J5107Q114M61N973J379Q13J1559j7742M4N224L490
4303A174j948m866m534j814M226N092o018m154M235R397K710N321o63n610j9834
4288a7286j2025m907M617m930J2272N761k691o12L73j624M426Q220M557P084L769
4273G004M086J0061j2867j1217q285M347j4259J3372K0359q323j3623k402q30
4260a2577K374Q408O012j1997k0178M2J6647J1970K619P35K804l442Q010R117
4246B0544j4344J814P968j340j185O783q852o842J327M575J876M366j540J074
4232A6224J0935J1318m325j9667k6491j7168q330N339J1090J9880J0559o799j8530
4219a5965J0035r645R633J1349r202p301N710K505L20j366m03k754q400o457k625
$$ plain form
4204 -24566 -22045 -13871 -4018 5940 -736 35 6848 9469 -95 -10852 -19156 -27436 -32521 -29427 -14843
4189 -14843 -3940 -12738 -13912 -23975 -15436 -1048 1432 21474 21170 11115 11006 5400 -779 -5620
4175 -5620 11144 5302 -12557 2315 5127 -1934 -700 1831 523 -12974 -11402 6538 7244 -3346
4161 -3346 -2983 -9895 -17483 -15630 -10168 -6947 -17339 -10511 1360 3551 -11502 -13079 -6650 -2069
4147 -2069 -8357 -23185 -20948 -7374 7876 18065 10615 7173 15455 1805 -1278 -4962 -10460 -7773
4133 -7773 -7007 -11455 -2398 -2655 -4852 5955 -3303 -4801 -6950 -3162 8267 18135 12237 18406 12532
4118 12532 6678 6186 1388 -6851 -3099 5570 4900 -4772 -8162 -15346 -5066 4177 2420 -11180 -18906
4103 -18906 -21886 -31171 -38739 -41285 -30737 -27366 -15111 -21377 -17982 -12446 -6048 -6496 -12037 -22340
$$ packed form
4204b4566K521Q174R853R958o676P71O813K621r564j0757q304q280n085L094J4584
4189a4843J0903q798j174j0063Q539J4388K480K0042l04j0055j09n606o179m841
4175e620J6764n842j7859J4872K812p061J234K531j308j3497J572J7940P06j0590
4161c346L63o912p588J853N462L221j0392O828J1871K191j5053j577O429M581
4147b069o288j4828K237J3574J5250J0189p450l442Q282j3650l083l684n498K687
4133g773P66m448R057k57k197J0807r258j498k149L788J1429R868n898O169n874
4118A2532n854m92m798q239L752Q669o70r672l390p184J0280R243j757j3600p726
4103a8906k980r285p568k546J0548L371J2255o266L395N536O398m48n541j0303
$$ plain form
4089 -22340 -30020 -20620 -12966 -4847 -4070 -3720 -5319 -12987 -6208 3956 3842 -13706 -28712 -20354 -4793
4074 -4793 4142 8351 13936 1040 -3928 -4529 -12204 -2260 12333 16041 15941 18430 6309 6985 2411
4059 2411 -3838 20 4075 -10995 -18058 -6737 -2951 2516 7646 -3870 -1118 5129 17713 11579
4045 11579 -2818 -13877 -10372 -14608 -8752 -6802 5326 6104 -45 -8208 -10762 -3616 -7510 -2324
4031 -2324 18530 10780 8626 9675 -1158 -11402 -6968 2186 2938 -1057 6578 9935 7399 6142
4017 6142 -380 1484 -5086 -5517 8579 -5246 -10287 -19586 -13669 -792 7265 1915 -14489 -1078
4003 -1078 3559 1483 2791 -596 -1803 7304 7101 4453 -1658 790 13896 14541 2533 12325 9053
3988 9053 1592 5535 1109 -14405 -21702 -15163 -12332 -2683 12550 9583 3420 -3102 -13847 -8319
$$ packed form
4089b2340p680R400P654Q119P77L50j599p668O779J0164j14j7548j5006Q358J5561
4074d793Q935M209N585j2896m968o01p675R944J4593L708j00K489j2121O76m574
4059B411o249L858M055j5070p063J1321L786N467N130j1516K752O247J2584o134
4045A1579j4397j1059L505m236N856J950J2128P78o149q163k554P146l894N186
4031b324K0854p750k154J049j0833j0244M434R154P52l995P635L357k536j257
4017F142o522J864o570m31J4096j3825n041r299N917J2877Q057n350j6404J3411
4003a078M637k076J308l387j207R107k03k648o111K448J3106O45j2008R792l272
3988I053p461L943m426j5514p297O539K831R649J5233k967o163o522j0745N528
$$ plain form
3974 -8319 -9346 -11215 -14727 -16038 -3719 -2573 5206 5478 8036 27921 20800 12790 13377 6727 14608
3959 14608 25278 11576 5212 10316 10592 9615 12418 12203 26044 31017 13459 -2096 -1970 -1595 234
3944 234 -12842 -13381 7118 14746 5900 15232 15978 21528 18152 3367 -3674 3407 -1961 -9802 -10047
3929 -10047 -7573 -6625 -6102 -10945 -23821 -13369 5478 10170 5783 1739 -1696 -1675 -1082 -5864 -5068
3914 -5068 -9718 -15735 -10 14378 18582 9365 3276 -8918 -2771 5203 9387 7636 -4805 -800
3900 -800 2299 -8026 -7473 -10419 -12823 -8144 -10443 2522 4823 -3053 2295 -6694 -46 -7664 -12893
3885 -12893 -7811 -2065 78 8682 6182 -1537 -10377 -5232 -6230 -1138 -5830 -15359 -27575 -25503 -17402
3870 -17402 -22013 -12958 -20392 -15441 -17104 -22707 -10834 -4535 -3271 6836 3012 25 7342 6137
$$ packed form
3974h319j027j869l512j311J2319J146P779K72K558J9885p121q010N87o650P881
3959A4608J0670j3702o364N104K76r77K803k15J3841M973j7558j5555J26L75J829
3944B34j3076n39K0499P628q846R332P46N550l376j4785p041P081n368p841k45
3929a0047K474R48N23m843j2876J0452J8847M692m387m044l435K1N93m782P96
3914e068m650o017J5725J4388M204r217o089j2194O147P974M184j751j2441M005
3900h00L099j0325N53k946k404M679k299J2965K301p876N348q989O648p618n229
3885a2893N082N746K143Q604k500p719q840N145r98N092m692r529j2216K072Q101
3870a7402m611R055p434M951j663n603J1873O299J264J0107l824k987P317j205
$$ plain form
3856 6137 11039 15774 9941 -6420 -6857 -6564 -12512 -677 10958 19662 16816 17608 6998 12822 4958
3841 4958 2116 -3441 -3579 11556 3104 -5795 -9320 -6718 -350 -14467 -23549 -9820 7073 20493
3827 20493 23144 11299 14078 9205 19788 23246 19846 8947 14244 17006 15690 20437 31370 26785
3813 26785 16116 19810 14588 5605 -20 -10048 -9055 -3669 -12120 -8900 6938 15031 13139 3405
3799 3405 -17877 -25648 -27461 -9056 -2363 -12771 -19386 -11571 -9059 -6484 -8141 -4427 -3502 -13083
3785 -13083 -13677 -15930 -14987 -8255 -15313 -15939 -14246 -16346 -3273 5943 -185 -16925 -5139 368 7287
3770 7287 8698 -2947 1882 788 -15091 -19817 -12897 3488 22032 -1168 -7692 -8364 -7328 2648
3756 2648 -5915 -20677 -21576 -4957 7146 5180 9483 9549 -4284 -3518 18708 14378 6132 6697 -10978
$$ packed form
3856F137M902M735n833j6361m37K93n948J1835J1635Q704k846P92j0610N824p864
3841D958k842n557j38J5135q452q899l525K602O368j4117r082J3729J6893J3420
3827B0493K651j1845K779m873J0583L458l400j0899N297K762j316M747J0933m585
3813B6785j0669L694n222q983n625j0028R93N386q451L220J5838Q093j892r734
3799C405k1282p771j813J8405O693j0408o615P815K512K575j657L714R25r581
3785a3083n94k253R43O732p058o26J693k100J3073R216o128j6740J1786N507O919
3770G287J411j1645M829j094j5879m726O920J6385J8544k3200o524o72J036R976
3756B648q563j4762q99J6619J2103j966M303O6j3833P66K2226m330q246N65j7675
$$ plain form
3741 -10978 -876 7962 3420 7416 11881 17065 12512 15218 24695 26759 10736 2860 12650 22457
3727 22457 8211 6159 15917 29882 30949 18753 2811 4736 6151 12401 15316 6013 -8343
3714 -8343 -13880 6108 12585 7093 -21434 -13823 6680 2472 1782 -6397 -13059 -6074 -23003 -22949 -6015
3699 -6015 -3935 3871 4457 -4424 -2842 -8588 -21375 -6923 -11868 -26490 -16625 -6932 4075 1427
3685 1427 369 12155 9955 2267 -7394 -15343 -16021 -26283 -12455 -22465 -29321 -9119 -4059 -4766
3671 -4766 -317 -1574 18147 21299 27395 17835 16121 13386 15055 5895 -3499 -3286 -16521 -13400 -6751
3656 -6751 -5080 -3705 -4271 -10977 -3932 759 -3131 -9406 2601 777 -2943 -8640 -10246 663 2203
3641 2203 -3100 -8470 -227 11805 5878 -8751 -24253 -29369 -32387 -22417 -26877 -21580 -19594 -31175
$$ packed form
3741a0978J0102Q838m542L996M465N184m553K706R477K064j6023p876R790R807
3727B2457j4246k052R758J3965J067j2196j5942J925J415O250K915r303j4356
3714h343n537J9988O477n492k8527P611K0503m208o90q179o662O985j6929N4J6934
3699f015K080P806N86q881J582n746j2787J4452m945j4622R865R693J1007k648
3685A427j058J1786k200p688r661p949o78j0262J3828j0010o856K0202N060p07
3671d766M449j257J9721L152O096r560j714k735J669r160r394K13j3235L121O649
3656f751J671J375n66o706P045M691l890o275J2007j824l720n697j606J0909J540
3641B203n303n370Q243J2032n927j4629j5502n116l018R970m460N297J986j1581
$$ plain form
3627 -31175 -26526 -25283 -9637 5817 11761 13126 19787 14373 -1752 -5021 6482 -3554 -10939
3614 -10939 2503 10985 20759 15347 9052 7730 1239 -12770 -9525 2224 -1025 -5660 -1656 -5132
3600 -5132 -4626 -470 -15569 -33745 -28261 -31077 -22356 -14393 -10198 -8702 -14649 -18033 -28019 -20187 3145
3585 3145 1782 -24526 -37497 -35002 -24204 -19700 -15436 10354 19913 21983 25028 13868 8485 1571
3571 1571 9334 -1640 428 558 13796 -955 -15895 -6835 -2190 -3073 2565 -8073 -6766 -13858
3557 -13858 -9862 -3201 4959 15238 14273 19825 14664 1384 -8303 -11815 -13644 -8824 -6429 -128
3543 -128 -865 -5527 -6171 4928 8045 8605 -6326 16 -3081 -10176 -2136 11677 10079 3363 8748
3528 8748 -5749 -17391 -13006 8160 17451 4436 -3337 -5252 1129 4765 522 -2023 135 -3242
$$ packed form
3627c1175M649J243J5646J5454N944J365O661n414j6125l269J1503j0036p385
3614a0939J3442Q482R774n412o295j322o491j4009L245J1749l249m635M004l476
3600e132N06M156j5099j8176N484k816Q721P963M195J496n947l384r986P832K3332
3585C145j363k6308j2971K495J0798M504M264K5790R559K070L045j1160n383o914
3571A571P763j0974K068J30J3238j4751j4940R060M645q83N638j0638J307p092
3557a3858L996O661Q160J0279r65N552n161j3280r687l512j829M820K395O301
3543a28p37m662o44J1099L117N60j4931O342l097p095Q040J3813j598o716N385
3528H748j4497j1642M385K1166R291j3015p773j915O381L636m243k545K158l377
$$ plain form
3514 -3242 8656 23318 23773 13610 7993 4983 2378 7964 20975 28356 7851 7817 15015 16217
3500 16217 13968 17229 10306 4790 -591 -1535 -1106 -2491 -792 -3974 -6669 -23504 -27315 -29340 -21794
3485 -21794 427 7319 2890 -643 -3337 -1230 -15077 -19974 -5437 6510 14803 29176 19302
3472 19302 5411 -6292 -16683 -12857 -7522 -20422 -38296 -27202 -17108 -7071 -3151 5809 -1073
3459 -1073 -5589 -14100 -18636 -29310 -17546 -3281 7586 7148 -4523 -20658 -25935 -34206 -26683 -11462
3445 -11462 -10913 -8475 -14452 -4200 19565 19574 6592 3895 2599 1037 8741 8289 -17284 -26089 -17840
3430 -17840 1064 14213 18449 8882 -10268 -20509 -16531 -17454 -18144 -12659 -12037 -23529 -23662 -14587
3416 -14587 -10849 -9966 -6560 -5694 -9721 -15796 -15954 -17759 -25954 -19457 -14822 -13792 -19168 -8844 9713
$$ packed form
3514c242J1898J4662M55j0163n617l010k605N586J3011P381k0505l4P198J202
3500A6217k249L261o923n516n381r44M29j385J699l182k695j6835l811k025P546
3485b1794K2221O892m429l533k694K107j3847m897J4537J1947Q293J4373r874
3472A9302j3891j1703j0391L826N335j2900j7874J1094J0094J0037L920Q960o882
3459a073m516q511m536j0674J1764J4265J0867m38j1671j6135n277q271P523J5221
3445a1462N49K438n977J0252K3765Rj2982k697j296j562P704m52k5573q805Q249
3430a7840J8904J3149M236r567j9150j0241L978r23o90N485O22j1492j33R075
3416a4587L738Q83L406Q66m027o075j58j805q195O497M635J030n376J0324J8557
$$ plain form
3401 9713 1511 8267 -10361 -6105 3877 -134 -8814 -1967 12166 -13786 -23006 -15352 -2048 7881
3387 7881 18290 17196 16172 11944 8662 2415 -3105 -12995 -8650 -10496 -12479 -7579 -5591 -5768 -13616
3372 -13616 -8496 -11256 -9409 -11582 -10111 -1118 8369 18830 -176 -18172 -37844 -26941 -13576
3359 -13576 -18460 -9990 -3054 10100 6149 -1200 -11786 -18408 -11471 3552 16469 -7136 -13193
3346 -13193 -10966 -19380 -12234 -408 3897 18177 7424 1330 2769 -12019 -1860 11712 9780
3333 9780 7370 9955 207 -2692 -3676 1796 2650 -1953 6687 26260 53674 38456 29415 33398 14203
3318 14203 -863 -7209 -7117 7744 5650 -767 -17970 -31166 -13896 7767 -787 -8359 -12425 -16136
3304 -16136 -11459 3517 15418 4996 501 -5265 -3988 4257 7021 14791 9172 -2172 -14560
$$ packed form
3401I713q202O756j8628M256R982m011q680O847J4133k5952r220P654J3304R929
3387G881J0409j094j024m228l282o247n520r890M345j846j983M900J988j77p848
3372a3616N120k760J847k173J471Q993R487J0461j9006j7996j9672J0903J3365
3359a3576m884Q470O936J3154l951p349j0586o622O937J5023J2917k3605o057
3346a3193K227q414P146J1826M305J4280j0753o094J439j4788J0159J3572j932
3333I780k410K585r748k899r84N472Q54m603Q640J9573K7414j5218r041L983j9195
3318A4203j5066o346R2J4861k094o417j7203j3196J7270K1663q554p572m066l711
3304a6136M677J4976J1901j0422m495n766J277Q245K764P770n619j1344j2388
$$ plain form
3291 -14560 -27962 -18235 -8143 -2896 -1422 3298 -10842 2041 11796 8961 12094 30186 26103
3278 26103 5509 -554 -3569 -2294 -10625 -17569 -18543 -11657 -1374 4986 9395 15500 11888 10276
3264 10276 3958 -4683 -20348 -29716 -22184 1791 6366 3135 3651 -5432 -15633 -19857 -20714 -17074
3250 -17074 -15849 -19437 -13136 -22218 -15917 -8427 1281 -2543 -4154 -13366 -5154 9769 768 -474
3236 -474 2717 -15338 -10437 -6604 -26107 -18826 -14913 1187 2025 -6039 427 132 -4476 -12073 -19156
3221 -19156 -7594 8736 9216 992 -15900 -14288 -3753 141 -20158 -28686 -30989 -33764 -31944 -39623
3207 -39623 -40859 -25666 -25704 -14390 3922 4390 7056 1462 -7899 1323 15033 9610 3682 4255 17482
3192 17482 8186 1885 5425 448 10090 12623 12500 -1523 -5781 -19502 -20760 -23253 -13005 4653
$$ packed form
3291a4560j3402R727J0092N247J474M720j4140J2883R755k835L133J8092m083
3278B6103k0594o063l015J275q331o944r74O886J0283O360M409O105l612j612
3264A0276o318q641j5665r368P532K3975M575l231N16r083j0201m224q57L640
3250a7074J225l588O301r082O301P490R708l824j611r212Q212J4923r001j242
3236d74L191j8055M901L833j9503P281L913J6100Q38q064O466k95m608p597p083
3221a9156J1562J6330M80q224j6892J612J0535L894k0299q528k303k775J820p679
3207c9623j236J5193l8J1314J8312M68K666n594r361R222J3710n423n928N73J3227
3192A7482r296o301L540m977R642K533j23j4023m258j3721j258k493J0248J7658
$$ plain form
3178 4653 15842 9635 7851 -1066 -8476 2167 10425 11937 -5863 3520 11839 11453 13736 8441
3164 8441 -16508 -22863 -24607 -36090 -26843 -24492 -6277 3742 -1969 -2664 6965 13060 4793 -7398
3150 -7398 -12566 -9711 -7192 -2703 -10714 -6411 2996 5736 -6107 102 1871 -2480 -10646 -10146 -4511
3135 -4511 -1256 321 -2686 -13602 -12633 -16696 2778 8757 -839 -4692 -6138 -7208 -11757 -4247 -6305
3120 -6305 -8920 -6665 -5528 1922 8007 24893 21754 17268 2413 -5111 -3369 -12660 -6043 -1190
3106 -1190 -1636 2335 1084 -11512 -20674 5765 25077 31591 23200 -320 -3245 1677 7565 9496
3092 9496 14649 12994 9821 32102 24490 20427 27251 21769 -3091 2036 13709 20431 17031 17274
3078 17274 -4130 -16122 -14647 -4452 714 -4458 -6051 -7889 -285 8674 14119 17869 12127 24650
$$ packed form
3178D653J1189o207j784q917p410J0643Q258J512j7800R383Q319l86K283n295
3164H441k4949o355j744j1483R247K351J8215J0019n711o95R629O095q267j2191
3150g398n168K855K519M489q011M303R407K740j1843O209J769m351q166N00N635
3135d511L255J577l007j0916R69m063J9474N979r596l853j446j070m549P510k058
3120f305k615K255J137P450O085J6886l139m486j4855p524J742r291O617M853
3106a190m46L971j251j2596r162K6439J9312O514q391k3520k925M922N888J931
3092I496N153j655l173K2281p612m063O824n482k4860N127J1673O722l400K43
3078A7274k1404j1992J475J0195N166n172j593j838P604Q959N445L750n742J2523
$$ plain form
3064 24650 21270 7421 4352 12765 1474 527 23348 17696 4820 2059 -1013 4455 11008 5544
3050 5544 -3552 -632 9205 3115 -2201 -1797 4932 11044 8976 6584 -9521 -19575 2262 4676
3036 4676 1117 13545 11908 21575 25428 20205 6731 -3837 -9642 2904 12138 12673 19354 18655
3022 18655 16762 15864 4633 -15836 -9635 9164 9311 -18021 -28686 -10805 10584 27401 27802
3009 27802 11551 2904 1293 -3245 -5410 -17692 -26817 -27308 -5035 -7905 -252 10486 9989 10530
2995 10530 3911 11833 23157 23091 17990 7347 426 47 3230 1993 2801 13845 33123 40193 26997
2980 26997 26742 17962 1644 -6201 -9906 -1047 2546 -471 -9487 -17601 -16078 -18855 -19197 -30972 -21939
2965 -21939 -18441 -16034 -19073 -26193 -20335 -10285 -15435 -8543 6739 15259 11744 -3102 -13271 -13362
$$ packed form
3064B4650l380j3849l069Q413j1291r47K2821n652j2876k761l072N468O553n464
3050E544r096K920R837o090n316M04O729O112k068k392j6105j0054K1837K414
3036D676l559J2428j637R667L853n223j3474j0568n805J2546R234N35O681o99
3022A8655j893q98j1231k0469O201J8799J47k7332j0665J7881K1389J6817M01
3009B7802j6251q647j611m538k165j2282r125m91K2273k870P653J0738m97N41
2995A0530o619P922J1324o6n101j0643o921l79L183j237Q08J1044J9278P070j3196
2980B6997k55q780j6318p845l705Q859L593l017r016q114J523k777l42j1775R033
2965b1939L498K407l039p120N858J0050n150O892J5282Q520l515j4846j0169r1
$$ plain form
2951 -13362 -5087 -3768 4098 -4057 -19669 -14941 -17835 -7010 -11976 -8955 2632 1888 -31 -489
2937 -489 1902 -29 -13309 -28135 -37719 -29942 -19571 -25218 -35806 -19647 -3448 -2176 12815
2924 12815 13980 9891 3942 6508 6598 5249 15449 19405 10767 24164 25234 15296 2120 6650
2910 6650 11597 30668 33142 19851 10955 17667 14887 10259 -2577 -5753 -17504 -15242 -2040 2760
2896 2760 352 -22879 -14654 -3633 -1581 -9152 -16241 -21017 -23557 -22100 -21684 -24672 -31915 -14771
2882 -14771 -7436 -18060 -20660 -28892 -22984 -22774 -19658 2060 17800 15244 8944 9920 1105 -8772
2868 -8772 7217 12599 -5951 -10778 -4138 6761 4975 -17849 -30660 -14209 -4445 -8819 -14376
2855 -14376 -3080 -4840 -9336 -3484 1902 8710 -13788 -14631 -12245 -13715 -3553 -3428 2782 10134
$$ packed form
2951a3362Q275J319P866q155j5612M728k894J0825m966L021J1587p44j919m58
2937d89K391j931j3280j4826r584P777J0371n647j0588J6159J6199J272J4991
2924A2815J165m089n949K566R0j349J0200L956q638J3397J070r938j3176M530
2910F650M947J9071K474j3291q896O712k780m628j2836l176j1751K262J3202M800
2896B760k408k3231Q225J1021K052p571p089m776k540J457M16k988p243J7144
2882a4771P335j0624k600q232N908K10L116K1718J5740k556o300R76q815r877
2868h772J5989N382j8550m827O640J0899j786k2824j2811J6451R764m374n557
2855a4376J1296j760m496N852N386O808k2498q43K386j470J0162J25O210P352
$$ plain form
2841 10134 3920 11685 12417 9834 6073 10297 6720 -2402 -13881 -11310 5037 11539 14666 14924 1368
2826 1368 -16388 -16705 2131 16505 15988 11042 4230 -5489 -1160 -4963 -3629 -20134 -31050 -19335
2812 -19335 -905 -1056 3848 7738 13875 17948 12349 9265 14947 11894 -4315 -897 19 5207 -1402
2797 -1402 -4270 1303 9286 -50 -1898 -10988 -372 -6726 -13297 6619 10502 4753 1719 -3240
2783 -3240 -167 -6009 -6617 -6297 266 14543 4764 345 8017 -699 -4754 -7157 -2279 6502 12558
2768 12558 7452 -286 9248 24283 13033 1088 1757 10405 20158 19323 14251 2672 9704 13371
2754 13371 4703 17980 19760 8605 2017 -9478 -10009 -8469 -15662 -22429 -17664 -12555 -15033 -1591
2740 -1591 -8256 -5916 15122 20224 15607 11917 8547 -5448 -17640 -18643 -20765 -11469 -8177 252
$$ packed form
2841A0134o214P765P32k583l761M224l577r122j1479K571J6347O502L127K58j3556
2826A368j7756l17J8836J4374n17m946o812r719M329l803J334j6505j0916J1715
2812a9335J8430j51M904L890O137M073n599l084N682l053j6209L418R16N188o609
2797a402k868N573P983r336j848r090J0616o354o571J9916L883n749l034m959
2783c240L073n842o08L20O563J4277r779m419P672q716m055k403M878Q781O056
2768A2558n106p738R534J5035j1250j1945O69Q648R753q35n072j1579P032L667
2754A3371q668J3277J780j1155o588j1495n31J540p193o767M765N109k478J3442
2740a591o665K340K1038N102m617l690l370j3995j2192j003k122R296L292Q429
$$ plain form
2726 252 5337 -2615 131 9388 -4434 -13276 -15240 -11374 -3109 9443 18055 25951 20697 6155
2712 6155 -13316 -16304 -18267 -13659 7500 9591 -14646 -18784 -11351 1254 13065 10987 8523 1130
2698 1130 14726 8718 30022 36056 1971 6631 5449 -12129 -16755 -11809 -14123 -3932 4095 -1490
2684 -1490 -15748 -27410 -19094 -16215 -18963 -19758 -22922 -13822 -18856 -12481 -2485 16173 19342 22609
2670 22609 14699 8582 18724 14259 10818 8258 -12930 -20748 -7261 -6402 -7906 -1656 -5327 -1225
2656 -1225 3736 1865 -2434 -6364 -1124 9247 19464 21985 36260 23449 -5748 -9963 -4088 6531
2642 6531 4457 2582 7284 4429 -2668 -5382 -23800 -32472 -18204 -13526 -5797 1676 -1393 -510 2554
2627 2554 11895 7001 9696 16477 21796 15895 610 -14528 -12970 -21217 -16475 -15677 -28048 -15466
$$ packed form
2726B52N085p952K746R257j3822q842j964L866Q265J2552Q612P896n254j4542
2712F155j9471k988j963M608K1159K091k4237m138P433J2605J1811k078k464p393
2698A130J3596o008K1304O034l4085M660j182j7578m626M946k314J0191Q027n585
2684a490j4258j1662Q316K879k748p95l164R100n034O375R996J8658L169L267
2670B2609p910o117J0142m465l441k560k1188p818J3487Q59j504O250l671M102
2656a225M961j871m299l930N240J0371J0217K521J4275j2811k9197m215N875J0619
2642F531k074j875M702k855p097k714j8418q672J4268M678P729P473l069Q83L064
2627B554R341m894K695O781N319n901j5285j5138J558q247M742P98j2371J2582
$$ plain form
2613 -15466 -1255 5302 12430 1417 -18041 -21924 -11555 -16427 -13096 -7581 -5634 3569 -3806 -7898
2599 -7898 15326 21727 18360 24108 9407 5374 4362 2722 3603 10394 1876 7326 -4833 -3841 9846
2584 9846 5009 -8681 -14892 -10119 -4530 8004 25825 30725 23378 14070 18532 18639 9510 12829
2570 12829 -10536 -25609 -17575 -9675 -2963 2676 4025 6494 -6158 -8345 -9821 -13117 -5535 -8604
2556 -8604 -5584 161 5552 14393 15864 1390 -4988 -11832 -7802 13127 20676 28701 32947 26140
2542 26140 11385 595 4216 -1323 -5086 5973 12848 21918 16483 15741 22352 33026 26632 25463
2528 25463 20172 23241 15014 16855 16033 13749 14529 23961 26208 22098 13112 6489 13161 7513 2887
2513 2887 -1428 -7995 853 6634 19286 28839 28020 21767 11912 -193 -4584 -8298 -14254 -18363 -15597
$$ packed form
2613a5466J4211O557P128j1013j9458l883J0369m872L331N515J947R203p375m092
2599g898K3224O401l367N748j4701m033j012j640Q81O791q518N450j2159R92J3687
2584I846m837j3690o211M773N589J2534J7821M900p347r308M462J07r129L319
2570A2829k3365j5073Q034P900O712N639J349K469j2652k187j476l296P582l069
2556h604L020N745N391Q841J471j4474o378o844M030K0929P549Q025M246o807
2542B6140j4755j0790L621n539l763J1059O875R070n435p42O611J0674o394j169
2528B5463n291L069q227J841q22k284P80R432K247m110q986o623O672n648m626
2513B887m315o567Q848N781J2652R553q19o253r855j2105m391l714n956m109K766
$$ plain form
2498 -15597 -12574 -3108 788 -3732 -8433 184 10620 17848 28710 28761 11933 2984 6567 10192
2484 10192 11005 -825 -14874 -19272 -20695 -19531 -24640 -22523 3869 5014 4381 7498 25898 21886
2470 21886 24684 30539 23416 16361 1882 -10152 -1965 5210 8337 18395 33415 36801 19655
2457 19655 3227 -6887 -22643 -28083 -20703 -16828 2717 20921 28811 23594 10226 19509 8749
2444 8749 -9132 -23548 -18210 -1411 4998 23086 11097 -18739 -23655 -26804 -27331 -21700 -9587
2431 -9587 704 -1450 -2162 710 23001 26529 19565 3101 -3487 5211 2768 9255 15540 13487
2417 13487 2793 -14407 -26236 -12237 -7842 -5440 -2746 -2214 -12493 -11411 8616 9581 2920 2507
2403 2507 1793 14893 10830 4331 -25596 -21855 2784 10002 9737 12393 17794 11754 4440 -6091
$$ packed form
2498a5597L023R466L896m520m701Q617J0436P228J0862N1j6828q949L583L625
2484A0192Q13j1830j4049m398j423J164n109K117K6392J145o33L117J8400m012
2470B1886K798N855p123p055j4479j2034Q187P175L127J0058J5020L386j7146
2457A9655j6428j0114j5756n440P380L875J9545J8204P890n217j3368R283j0760
2444H749j7881j4416N338J6799O409J8088j1989k9836m916l149n27N631J2113
2431i587J0291k154p12K872K2291L528o964j6464o588Q698k443O487O285k053
2417A3487j0694j7200j1829J3999M395K402K694N32j0279J082K0027R65o661m13
2403B507p14J3100m063o499k9927L741K4639P218k65K656N401o040p314j0531
$$ [...]
##END NTUPLES=NMR SPECTRUM
##END=
