##TITLE=Analysis number 329786
Compound Code rf 04619
Project Code adrs
Chemist Name aci
##JCAMPDX= 6.0         $$ Bruker NMR JCAMP-DX V2.0
##DATA TYPE= NMR SPECTRUM
##DATA CLASS= NTUPLES
##ORIGIN= Bruker BioSpin GmbH
##OWNER= nmr
$$ XWIN-NMR		Version 3.5
$$ Thu Sep 27 11:52:10 2007 GMT Daylight Time (UT+1h)  MAYBRIDGE\nmr@NMR_250MHZ
##.OBSERVE FREQUENCY= 250.131544655141
##.OBSERVE NUCLEUS= ^1H
##.ACQUISITION MODE= SIMULTANEOUS (DQD)
##.ACQUISITION SCHEME= undefined
##.AVERAGES= 16
##.DIGITISER RES= 18
##SPECTROMETER/DATA SYSTEM= dpx250
##.PULSE SEQUENCE= zg30
##.SOLVENT NAME= CDCl3
##.SHIFT REFERENCE= (INTERNAL, CDCl3, 0, 16.522)
##AUDIT TRAIL= $$ (NUMBER, WHEN, WHO, WHERE, WHAT)
$$ ##TITLE= Audit trail, XWIN-NMR		Version 3.5
$$ ##JCAMPDX= 5.01
$$ ##ORIGIN= Bruker BioSpin GmbH
$$ ##OWNER= nmr
$$ C:\u/data/dgb/nmr/ADRS/2660/pdata/1/auditp.txt
$$ ##AUDIT TRAIL=  $$ (NUMBER, WHEN, WHO, WHERE, WHAT)
(   1,<2007-09-27 11:51:50.40 +100>,<MAYBRIDGE\nmr>,<NMR_250MHZ>,
      <created by zg, POWCHK disabled, PULCHK disabled
       configuration hash MD5:
       76 6E 9A 78 1E 09 19 81 EC 84 63 8F B0 6A 59 2D
       data hash MD5: 64K
       F0 C0 A3 D0 D3 8C 6B 62 18 35 89 25 C2 DB 67 0D>)
(   2,<2007-09-27 11:52:01.57 +100>,<MAYBRIDGE\nmr>,<NMR_250MHZ>,
      <Start of raw data processing
       ef LB = 0.3 FT_mod = 6 PKNL = 1 SI = 32K 
       data hash MD5: 32K
       DB FD 2A 37 B0 29 8C 28 D5 13 9F 03 99 AB 75 0D>)
(   3,<2007-09-27 11:52:03.29 +100>,<MAYBRIDGE\nmr>,<NMR_250MHZ>,
      <apk 
       data hash MD5: 32K
       ED F8 B6 DC A0 5C A6 35 FF 8A D6 91 EE 42 80 54>)
(   4,<2007-09-27 11:52:04.21 +100>,<MAYBRIDGE\nmr>,<NMR_250MHZ>,
      <abs ABSG = 5 
       data hash MD5: 32K
       23 61 7F 1B 66 D4 DF C6 13 7F 7C BE 71 22 9E 41>)
$$ ##END=
$$ 
$$ hash MD5
$$ 50 EA CE 1E CE E4 C5 CD 66 F8 07 F4 FA 8E 78 1B
##$RELAX= 
##$RELAX= 
##$RELAX= 
##$RELAX= 
##$RELAX= 
##$RELAX= 
##$RELAX= 
$$ Bruker specific parameters
$$ --------------------------
##$DU= <C:\u>
##$EXPNO= 2660
##$NAME= <ADRS>
##$PROCNO= 1
##$TYPE= <nmr>
##$USER= <dgb>
##$AMP= (0..31)
100 100 100 100 100 100 100 100 100 100 100 100 100 100 100 100 100 100 
100 100 100 100 100 100 100 100 100 100 100 100 100 100 
##$AQSEQ= 0
##$AQ_mod= 3
##$AUNM= <au_zg>
##$AUTOPOS= <3 >
##$BF1= 250.13
##$BF2= 250.13
##$BF3= 250.13
##$BF4= 250.13
##$BF5= 500.13
##$BF6= 500.13
##$BF7= 500.13
##$BF8= 500.13
##$BYTORDA= 1
##$CFDGTYP= 0
##$CFRGTYP= 5
##$CHEMSTR= <none>
##$CNST= (0..31)
1 1 145 1 1 1 1 1 1 1 1 1 1 1 1 1 1 1 1 1 1 1 1 1 1 1 1 1 1 1 1 1 
##$CPDPRG= <>
##$CPDPRG1= <>
##$CPDPRG2= <>
##$CPDPRG3= <>
##$CPDPRG4= <mlev>
##$CPDPRG5= <mlev>
##$CPDPRG6= <mlev>
##$CPDPRG7= <mlev>
##$CPDPRG8= <mlev>
##$CPDPRGB= <>
##$CPDPRGT= <>
##$D= (0..31)
0 1 0 0 0 0 0 0 0 0.06 0 0 0 0 0 0 0.0002 0 0 0 0 0 0 0 0 0 0 0 0 0 0 
0 
##$DATE= 1190890309
##$DBL= (0..7)
120 120 120 120 120 120 120 120 
##$DBP= (0..7)
150 150 150 150 150 150 150 150 
##$DBP07= 0
##$DBPNAM0= <>
##$DBPNAM1= <>
##$DBPNAM2= <>
##$DBPNAM3= <>
$$ [...]
##$SUBNAM7= <"">
##$SUBNAM8= <"">
##$SUBNAM9= <"">
##$SW= 20.6930455092707
##$SWIBOX= (0..15)
0 0 3 0 0 0 0 0 0 0 0 0 0 0 0 0 
##$SW_h= 5175.983436853
##$TD= 65536
##$TD0= 1
##$TE= 296.16
##$TE2= 300
##$TE3= 300
##$TEG= 300
##$TL= (0..7)
0 120 120 120 120 120 120 120 
##$TP= (0..7)
150 150 150 150 150 150 150 150 
##$TP07= 0
##$TPNAME0= <>
##$TPNAME1= <>
##$TPNAME2= <>
##$TPNAME3= <>
##$TPNAME4= <>
##$TPNAME5= <>
##$TPNAME6= <>
##$TPNAME7= <>
##$TPOAL= (0..7)
0.5 0.5 0.5 0.5 0.5 0.5 0.5 0.5 
##$TPOFFS= (0..7)
0 0 0 0 0 0 0 0 
##$TUNHIN= 0
##$TUNHOUT= 0
##$TUNXOUT= 0
##$USERA1= <user>
##$USERA2= <user>
##$USERA3= <user>
##$USERA4= <user>
##$USERA5= <user>
##$V9= 5
##$VALIST= <valist>
##$VCLIST= <CCCCCCCCCCCCCCC>
##$VD= 0
##$VDLIST= <DDDDDDDDDDDDDDD>
##$VPLIST= <PPPPPPPPPPPPPPP>
##$VTLIST= <TTTTTTTTTTTTTTT>
##$WBST= 1024
##$WBSW= 4
##$XGAIN= (0..3)
0 0 0 0 
##$XL= 0
##$YL= 0
##$YMAX_a= 342704
##$YMIN_a= -404652
##$ZGOPTNS= <>
##$ZL1= 120
##$ZL2= 120
##$ZL3= 120
##$ZL4= 120
##$ABSF1= 16.522
##$ABSF2= -4.171173
##$ABSG= 5
##$ABSL= 3
##$ALPHA= 0
##$AQORDER= 0
##$ASSFAC= 0
##$ASSFACI= 0
##$ASSFACX= 0
##$ASSWID= 0
##$AUNMP= <proc_1d>
##$AZFE= 0.1
##$AZFW= 0.1
##$BCFW= 0
##$BC_mod= 0
##$BYTORDP= 0
##$COROFFS= 0
##$CY= 12.5
##$DATMOD= 1
##$DC= 0
##$DFILT= <>
##$DTYPP= 0
##$F1P= 14.0000005364418
##$F2P= -0.99999901652339
##$FCOR= 0.5
##$FTSIZE= 32768
##$FT_mod= 6
##$GAMMA= 0
##$GB= 0
##$INTBC= 1
##$INTSCL= 1
##$ISEN= 128
##$LB= 0.3
##$LEV0= 0
##$LPBIN= 0
##$MAXI= 10000
##$MC2= 0
##$MEAN= 0
##$ME_mod= 0
##$MI= 0
##$NCOEF= 0
##$NC_proc= -2
##$NLEV= 6
##$NOISF1= 0
##$NOISF2= 0
##$NSP= 0
##$NTH_PI= 0
##$NZP= 0
##$OFFSET= 16.522
##$PC= 1
##$PHC0= 162.7404
##$PHC1= 6.310452
##$PH_mod= 1
##$PKNL= yes
##$PPARMOD= 0
##$PSCAL= 4
##$PSIGN= 0
##$REVERSE= no
##$SF= 250.13
##$SI= 32768
##$SIGF1= 0
##$SIGF2= 0
##$SINO= 400
##$SIOLD= 32768
##$SREGLST= <1H.CDCl3>
##$SSB= 0
##$STSI= 32768
##$STSR= 0
##$SW_p= 5175.98343685301
##$SYMM= 0
##$S_DEV= 0
##$TDeff= 65536
##$TDoff= 0
##$TI= <Analysis number 999999
Compound Code 99
Book Reference 9
Project Code 9>
##$TILT= no
##$TM1= 0
##$TM2= 0
##$TOPLEV= 0
##$USERP1= <user>
##$USERP2= <user>
##$USERP3= <user>
##$USERP4= <user>
##$USERP5= <user>
##$WDW= 1
##$XDIM= 32768
##$YMAX_p= 387826798
##$YMIN_p= -121769
$$ End of Bruker specific parameters
$$ ---------------------------------
##NTUPLES= NMR SPECTRUM
##VAR_NAME=  FREQUENCY,     SPECTRUM/REAL,   SPECTRUM/IMAG
##SYMBOL=    X,             R,               I
##VAR_TYPE=  INDEPENDENT,   DEPENDENT,       DEPENDENT
##VAR_FORM=  AFFN,          ASDF,            ASDF
##VAR_DIM=   32768,         32768,           32768
##UNITS=     HZ,            ARBITRARY UNITS, ARBITRARY UNITS
##FACTOR=    0.157963299565203, 1,           1
##FIRST=     4132.6476996994, 0,             0
##LAST=      -1043.33573715361, 0,           0
##MIN=       -1043.33573715361, -121769,     0
##MAX=       4132.6476996994, 387826798,     0
$$ Real data points
##PAGE= N=1
##DATA TABLE= (X++(R..R)), XYDATA
$$ [...]
23557 4172 11102 21286 21946 23497 28661 11062 14644 16363 12845 1213 -8496 -32945 -19897 -5514
23543 -5514 5614 14311 22694 26041 7856 20512 38504 38876 25397 29399 31899 2618 -9708
23530 -9708 3217 5485 -10277 -21689 -12693 8315 -7664 -13626 71 3292 -2959 -10492 -3166
23517 -3166 -15274 6946 26867 24273 6099 -19548 -30232 -21164 -10235 -28620 -49171 -39897
23505 -39897 -27392 -17457 4595 36304 28582 -590 -5907 762 29305 36720 30913 12323 -2097
23492 -2097 -15464 -12042 -10788 -22868 -6524 -12451 -14836 -2574 2928 -4935 5092 3693 -13125
23479 -13125 7173 5459 -10984 4460 19733 -5700 -37761 -61932 -42176 -35281 -28417 -28322 -19575
23466 -19575 998 -5567 6328 3117 2100 9401 1678 -3319 730 -2745 38483 58842 52299
23453 52299 26873 21005 -4938 -29186 -20652 -13411 -2405 6092 22065 40239 41322 15030 16572
23440 16572 8357 -4894 1067 -1161 -1663 504 5429 21766 24656 23098 17771 -4008 -2909 -3046
23426 -3046 -23243 -21300 -38768 -39106 -14039 -6059 -36075 -41413 -30423 -40456 -33321 -28975 -11940
23413 -11940 3011 -3361 -10803 -12524 -8772 -9415 -17408 -23105 -11521 -3364 11588 14056 8035 -1132
23399 -1132 10690 387 -25510 -31850 3063 19308 22173 -2879 -8475 -5445 -9166 -2068 6476
23386 6476 24469 23332 21967 18968 17145 22823 6416 6321 21228 20512 4073 -2839 20524 51971
23372 51971 47234 34220 9044 19857 33960 9270 10585 12236 7464 27282 36310 18256 5979
23359 5979 -2293 -15524 -22713 -22607 -34115 -38735 -27384 -25583 -20635 9434 19971 15477 11847 6472
23345 6472 3592 33572 42609 14863 4908 5774 4805 11592 3151 -4741 15797 20573 556 -20536
23331 -20536 -30088 -23895 6240 27424 15850 11794 23220 5887 -1027 585 -12258 -16616 -10708
23318 -10708 -10492 -25083 -37007 -37127 -21157 -12652 10506 4153 677 -9660 -10773 -922 8365 -21236
23304 -21236 -25179 -15406 -8909 -9575 -25029 -27348 -139 21804 24662 27087 19919 10216 18364 30505
23290 30505 45101 13094 -24398 -26379 -36454 -43344 -39420 -35878 -18503 8873 20162 26356 12855
23277 12855 570 1932 4621 31801 27312 15382 20754 39145 46519 40083 27410 22569 20921
23264 20921 12555 24991 19602 -6569 9240 26736 39634 31987 17940 -8170 -23976 -32426
23252 -32426 -24180 -12456 -18652 -34001 -27888 -32906 -30487 -28661 -26662 -12054 2971 15904 22972
23239 22972 5524 -7879 -25733 -22638 -20852 -16301 -23938 -19327 -14498 852 9588 7549 6948 14293
23225 14293 14266 2291 1869 -22585 -29672 -8843 -9179 -11863 -19678 -29207 1313 26082 21701 -1321
23211 -1321 9581 -9672 -16642 -1602 -9734 -12580 -10283 -1204 15143 15373 3387 22617 10681
23198 10681 2487 8136 14224 45236 40118 31440 25910 2680 -1305 4828 -5950 -6252 9136 26407
23184 26407 37204 19558 15293 14010 30686 18714 7356 -9656 -16742 -14283 9231 5899 4312
23171 4312 17436 17706 21542 12365 -13767 -30939 -27577 -5172 1030 -2914 -12779 -16951 -13742 -22891
23157 -22891 -764 18778 21382 1 7908 2824 12931 28178 34956 19820 10533 -1968 -5558
23144 -5558 2772 -14054 -21414 -11280 3251 10072 10186 13764 -6017 -13124 1055 1995 -12797 5500
23130 5500 19626 38889 43570 20430 12332 12141 -357 2112 -21252 -6553 -21006 -8487 20906
23117 20906 21214 -6269 -35705 -26787 -13159 -3866 -5697 2668 -17135 -43670 -44329 -22022 3200
23104 3200 20345 21857 20647 18898 519 4698 13532 5881 -140 -9357 -10630 8380 -13732 4634
23090 4634 21501 924 -11713 -9290 5352 10149 10027 -12591 -20244 -14332 2665 20660 8680
23077 8680 3943 -4574 11166 23105 8625 12847 835 -3600 -10533 -9559 619 1707 -7702 2104
23063 2104 3091 10531 2284 19446 26776 9996 1507 2789 5441 22 11438 14335 -13037 -18986
23049 -18986 -4433 -14961 -14037 -6724 -22716 -22398 1819 28973 51287 33828 6170 -5910 -4895
23036 -4895 -156 3969 5071 3839 5135 4328 7376 -6543 -12084 -4225 -1654 7862 4271 2828 496
23021 496 -2463 -13592 -1747 -14494 -26403 -17746 -26354 -17446 -11366 -5327 959 -272 -6059 8088
23007 8088 16082 13625 16174 38331 45009 35953 34712 28149 14803 14828 7010 2892 7396 24278
22993 24278 23830 9836 10863 17683 23927 -706 -17114 83 21714 37358 27834 10328 234
22980 234 -20305 -17365 -2091 15825 23202 24013 9779 -3480 -14134 -15713 -11576 -3670 12766
22967 12766 21813 17484 -770 -8524 -15855 -5224 4533 -36545 -32120 -8428 -9196 2756 5510
22954 5510 16341 16984 12165 3677 -990 2058 -1320 -16247 -24517 -34447 -25972 -13833 -16344 10410
22940 10410 3279 -9253 -24353 -20485 2886 13112 23022 40802 57445 36266 11756 13844
22928 13844 22341 17727 17775 4059 4508 -5847 2563 1044 7970 23580 15417 18040 8061 -3006
22914 -3006 -3434 451 10766 12329 17493 19120 31552 48257 44085 26772 26780 3506 -1831 -3479
22900 -3479 -3961 -17612 -908 -7633 8168 29771 26551 1060 -16382 -33582 -24459 10379 15500
22887 15500 9007 3244 18099 34032 27322 25377 2108 -9416 -39850 -23500 2712 1156 -3809
22874 -3809 -4885 -14214 -29253 -13739 -14498 -24278 -12559 -417 8353 11134 -5591 -18584 -19487 -7378
22860 -7378 5470 22655 26497 21805 31098 10360 8130 8443 19036 25881 26034 39856 30136 5930
22846 5930 -4670 -12716 -16006 -20843 1286 1397 1920 27751 19121 4573 4232 6543 7895 24325
22832 24325 43721 40988 34084 19264 -6373 -22165 -4314 -2839 -8891 -3924 3193 207 -5497
22819 -5497 17246 36074 33748 36151 31738 211 -26929 -27682 -6938 25444 15484 5420 3189
22806 3189 -2386 1820 -7394 5794 35908 44992 38526 39210 33258 22425 -1304 -12010 -6810 -7042
22792 -7042 -15481 -3542 547 -11597 -10781 23428 20501 -16585 -34081 -32091 -22005 10890 21315
22779 21315 14020 -683 -1384 -9700 -2518 -11399 -33312 -37954 -18351 -6853 1799 14541 28011
22766 28011 21443 -12693 -22726 -31858 -33782 -15095 -12534 -11875 -9762 -1199 -20482 -45203 -57409
22753 -57409 -45498 -30251 857 18150 14091 15624 17241 14143 8895 20157 5108 -30405 -22638
22740 -22638 -24591 6220 25871 -6827 -9941 7147 12977 3790 17590 2696 -24021 -28674 -22072
22727 -22072 -4763 10721 -9364 -14689 -15309 6939 19319 6120 -15445 -21871 -3786 12470
22715 12470 27800 25179 22758 17377 23605 27418 11360 -5659 989 17847 14588 10849 -8550
22702 -8550 -26595 -27389 -24285 -13165 8548 2583 -9856 -8575 -13684 -13219 -14122 -12805 3311 1733
22688 1733 -4036 10980 13124 20740 14088 15579 22109 16878 21622 14546 5262 -79 -3828 1341
22674 1341 16198 44044 36402 28327 34780 27511 -7573 -9778 1874 -1598 -5593 -13917 -14727 -10804
22660 -10804 -21439 -25697 -19922 -17573 -14581 951 13164 5537 5144 26356 18256 27461 20432 9788
22646 9788 -5913 -22554 -23337 -5626 308 4626 30627 42381 54110 51159 24658 11752 16206
22633 16206 14352 27644 28209 15112 9853 10908 6629 3296 -7466 -11146 -17546 -25498 -22808 -10142
22619 -10142 -6817 8183 27790 20868 14568 21046 28439 10206 -17382 -20872 -4957 6935 20279
22606 20279 19942 17244 13680 -8114 -13868 -24423 -34690 -25468 -29457 -23162 -20835 -29409 -25368 3839
22592 3839 9393 5162 17358 20053 10223 1784 5757 4609 -15692 -16360 -32066 -22556 -1144 2360
22578 2360 13351 12262 11178 -6854 -28152 -7353 8034 13789 33784 51746 46028 34649 18804
22565 18804 24708 55498 51582 41775 22983 10604 125 14155 9337 -1040 -21137 -19250 -26352
22552 -26352 -17787 -2499 -14129 -17317 1689 29686 24565 23039 52429 50792 48236 43838 31866
22539 31866 23944 21605 32692 17783 -1244 -28247 -35313 -17555 -9047 -15323 -2000 12905 7535
22526 7535 1632 5659 11972 21225 19023 26338 29039 9048 -10493 -19559 -1060 13671 12329 25607
22512 25607 30140 26379 35741 17410 5148 20205 -5917 -3574 20183 21094 26231 43130 50390
22499 50390 33565 16617 10340 -9822 -8189 6480 -5554 6513 19273 11429 6223 -374 -18028
22486 -18028 -17046 -14021 -16727 -22826 -31907 -26574 -15132 -35195 -41584 -18598 933 9163 13726 7203
22472 7203 -16798 -6087 4430 -4839 -10902 -9092 -12500 -31952 -32652 -343 3078 -14097 -14994 -11545
22458 -11545 -16795 -20173 -15708 6988 -5123 -1896 6303 24975 18158 -2674 762 -5508 -14677
22445 -14677 4679 21591 26834 24333 43160 39155 17892 7774 8566 8831 10005 10790 -12155 -28200
22431 -28200 -30812 -20069 3209 -7387 -8587 9274 17152 17702 10018 -4500 -6092 8477 -3973
22418 -3973 1715 9158 23408 30526 3541 -3848 -16419 -13644 -1244 -11932 -21529 -21914 6084
22405 6084 11531 15148 12226 -12467 -33656 -17999 8031 -4974 -20893 -8967 -74 -4402 -10446
22392 -10446 9045 47018 48819 14587 4601 15093 11218 7372 13495 16473 20962 27537 30494
22379 30494 24339 7336 -13257 3295 14574 22597 13561 7463 23931 31211 28746 12731 5898
22366 5898 10906 11449 2579 11012 30208 37486 33777 27383 36904 34430 23292 17111 3821 9479
22352 9479 21395 11082 -648 16140 8466 -10600 -9211 12339 13723 8315 9807 -1319 -572
22339 -572 13486 48798 50684 26686 17927 1338 -7360 10693 31332 30055 24791 11628 -10651
22326 -10651 -12586 -1329 -9444 -26709 -22970 -13309 -19737 -115 9216 15975 30470 28008 27818 10523
22312 10523 -10771 -7275 -5580 -590 -629 7845 8676 1168 3658 6630 -8718 -26161 -13265 -1759
22298 -1759 -11820 5728 23434 50199 34191 3239 -6572 -11678 -4793 -1968 13535 1433 -9592
22285 -9592 -17592 -22386 -16438 -16457 -23411 -21732 -9072 -792 25097 23032 14533 2403 -7019 -16474
22271 -16474 -7898 -21866 -26017 -19253 -9079 -2716 -4641 1543 4837 -2356 513 -5025 -14173 1664
22257 1664 9399 -26929 -43357 -29900 -24352 -25110 -7101 -20964 -33328 -30895 -13811 -29194 -19893
22244 -19893 -10306 -11905 -19567 -25620 -36234 -30247 -22574 -9890 21240 31921 51744 41563 15962
22231 15962 13559 6815 9174 -7661 -11700 1004 679 7451 -1623 -2581 -2684 7596 32581 46896
22217 46896 56489 60531 37840 18989 12086 8195 -24052 -22499 -2237 21680 14326 22536 19656
22204 19656 -58 -7283 2064 3182 9776 19484 16550 11196 7541 -497 -9363 -26926 -34657 -17852
22190 -17852 -8414 -10470 -17210 -14800 17902 29140 28860 38141 37627 21673 13434 22017 7846 -11936
22176 -11936 -866 17535 22745 36923 22589 12986 -4185 12656 24911 22940 25528 26043 28402
22163 28402 13071 2914 1322 -12828 -2247 250 2359 -13429 -23537 -20194 10618 10639 -18344
22150 -18344 -20050 -11088 -6038 -8378 -10153 -648 1598 -3545 -3327 -61 15846 11967 2951 -1800
22136 -1800 -11364 -1261 -9105 -14957 -14578 -8536 13010 28762 3311 -21840 -20455 -18095 -828
22123 -828 14597 21255 9061 3518 16591 22681 8103 -3830 5871 16001 20036 22679 13055
22110 13055 28150 21125 13401 6247 21165 21655 4150 6999 10287 -4038 6502 21131 34653
22097 34653 21228 -5720 -7652 -4199 -1087 -2251 18691 11093 -6049 -4343 -15646 -29891 -26274
22084 -26274 -20989 -23855 -35678 -17095 2289 18164 24020 20301 32902 52444 25444 -9871
22072 -9871 -27144 -25826 -26009 -18030 -13748 -14776 -2680 11769 12352 -3227 -7220 23432 21982 12910
22058 12910 7789 -1731 3322 3456 -220 11580 35330 23439 -5453 -10898 -4750 -1364 2456 7608
22044 7608 22834 -10887 -14139 6329 -4165 4674 17079 24695 847 -8744 -3165 -7665 -12569
22031 -12569 3271 14080 20961 31346 52135 55135 27957 22941 34900 7150 -23205 -12379
22019 -12379 -14618 -29788 -28480 -23009 -21898 -13462 9633 7357 5380 6231 1805 8761 18894 31182
22005 31182 27650 10513 -4042 -13089 -21519 -11711 14661 26519 37053 27605 29134 36583 42649
21992 42649 31690 8606 -6852 -7297 -6097 -7798 -10698 15912 36595 49696 23387 -5635 3020
21979 3020 4198 12224 33975 31091 23497 27375 22144 15865 -3392 8868 18889 27785 37210 47163
21965 47163 42993 45130 28391 4200 10089 29062 54334 35944 14135 -13048 -20405 -19572 -34651
21952 -34651 -24979 -14874 -19019 -34795 -32713 -8935 -3477 -13271 -750 11082 9159 1598 9728
21939 9728 7196 8165 -6497 -14146 -12703 -21049 -8282 3943 -2972 -21771 -26783 -26744 -30088 -2904
21925 -2904 16882 18407 17440 7566 12003 8212 13336 22285 15533 27173 26260 3692 -15382 14852
21911 14852 16335 23552 24122 14048 -1872 -18329 -23370 24 9263 13507 25711 24751 19656 13686
21897 13686 15649 5803 1144 252 -13135 -6787 10831 18212 22416 21666 31245 34266 19102 -12472
21883 -12472 -18948 -7730 6431 -6188 840 475 -4541 1755 5299 3600 -1179 10922 21717
21870 21717 21846 36607 54627 42257 19063 18066 31350 25402 17027 3853 7372 11740 16661
21857 16661 19512 12917 11805 11177 24120 13980 -11977 -1111 31169 47393 35263 16328 24144
21844 24144 19336 26300 13389 -1019 -2603 -20957 -13450 -15050 -15089 -22180 -15083 -22215 -20263 -35072
21830 -35072 -5923 19558 26979 17856 15419 25208 37229 38317 30101 -3020 -27206 -32825 -24576
21817 -24576 -17422 1700 7919 8824 24199 24845 38650 40159 31383 42996 42538 23078 3909 -11516
21803 -11516 -4010 31812 50671 51639 52035 23222 19703 10270 -2962 -15123 -15950 -11807 -16562 -18858
21789 -18858 -3439 -2096 6002 821 -24958 -19453 -15231 -9938 10509 22044 25748 28708 20745
21776 20745 9963 1718 14809 14251 -9211 -37432 -10802 17537 27052 24258 24999 20841 23652
21763 23652 15968 22283 35530 25167 -12940 -14820 -1915 8566 21688 23187 19703 21341 6285
21750 6285 -184 -19995 -9844 9534 8340 8238 -2984 -17104 -10501 -6134 -4604 5608 13856
21737 13856 5922 1978 11695 -5319 -4146 -2937 -5348 -24364 -12573 -24599 -26460 -3822 3331
21724 3331 922 18631 24169 23864 29419 35065 31733 18280 21445 42131 32127 5936 -6734
21711 -6734 -9872 2577 23126 41500 20188 8675 11080 12540 6165 21332 18609 -8472 -15045
21698 -15045 -768 13189 12194 27696 25835 18810 32938 39191 44648 24654 -1018 -4727 13096
21685 13096 8315 9161 18616 51405 65581 66442 57490 29845 20921 9893 11914 23338 27588 13671
21671 13671 1437 1073 23874 32596 29904 4424 31071 70982 114945 146247 173492 180343 194055
21658 194055 192303 206148 218498 210088 197633 189125 183846 184339 183249 179772 175733 177106 186687 196182
21644 196182 204265 189227 148043 116632 105634 87012 61783 57408 41574 57963 72109 76650
21632 76650 51562 43770 47131 54247 75611 69547 63394 75016 60742 42041 20986 13014 17828
21619 17828 14721 16243 1607 16083 39471 47378 40780 25388 36977 41313 15080 3636 5064
21606 5064 -23631 -32790 -23787 -14054 3096 11841 24356 30503 18594 24018 33733 31762 38782 34538
21592 34538 57879 58806 41728 24671 31386 51783 44566 6230 -1154 -4407 -11234 -2649 -1609
21579 -1609 -1640 3816 15784 21585 23994 25012 17005 17930 3341 20486 27747 50232 35909 32682
21565 32682 34528 19481 21059 11183 17752 36436 38265 36363 41989 28443 43237 41583 23695
21552 23695 7518 13174 4780 6809 3819 16170 28220 16293 -14311 -22057 8708 21237 12544
21539 12544 3779 8872 9522 14578 24639 39329 53022 66636 57166 24841 22331 28503 33907
21526 33907 10534 -13902 -10206 4757 7067 14061 33260 33375 35986 44616 43364 54498 44125
21513 44125 38805 28240 41517 57358 47280 47118 24071 11637 508 -24553 -7889 7845
21501 7845 37031 49198 43729 33868 21838 26795 32370 29815 16533 35976 45987 22724 8534
21488 8534 31991 46553 29985 25569 10955 -900 8384 29259 16719 12813 19069 31787 47281
21475 47281 48487 23842 5058 18553 25364 11512 -140 1580 8771 6798 -1201 6299 18644
21462 18644 12644 18271 33094 31400 35884 41035 29713 18844 15049 20363 35681 41390 49355
21449 49355 53311 47441 23662 3867 5077 23678 26178 42652 47450 52684 38445 48927 46454
21436 46454 39102 48322 52974 32894 20322 24151 45259 50637 41096 30186 20146 8966 -2654
21423 -2654 -2589 17234 54411 61746 38096 21813 16247 18148 14840 16703 16635 15442 24282 47553
21409 47553 42899 40190 33425 31325 39775 48617 34521 38834 50497 53607 49128 54498 61786 49536
21395 49536 36538 21090 10460 13927 13946 32038 39539 49232 36366 45653 50478 39094 40399
21382 40399 39389 40463 54101 58774 28561 42285 59390 42242 24628 7862 14241 40651
21370 40651 45824 65786 64163 72039 77820 60727 53565 50134 42945 58208 71534 55524 51444
21357 51444 44163 16956 22530 56788 69214 57371 40136 17731 33492 39702 24963 25114 34171
21344 34171 44175 34527 22247 21247 41716 60468 58204 54842 41324 3332 -18258 -9558 18948
21331 18948 39212 53816 76639 78431 91213 91555 68167 63337 77311 72043 56327 52776 53986
21318 53986 79972 69229 41112 58551 67700 81475 114127 96166 63265 60634 78178 83218
21306 83218 75241 55006 51807 64422 59370 66831 69330 49175 54538 51503 48671 37116 36068
21293 36068 40458 51174 48217 52116 64668 63335 75607 65756 53907 32243 20689 28399 40125
21280 40125 51303 50344 74687 101564 111259 102442 96050 85041 70521 66562 67689 62359 74465
21267 74465 83912 71939 63678 68474 78180 73552 57377 59012 69512 77312 67519 63104 83178
21254 83178 96427 95166 107852 101956 93129 103593 98797 107876 105474 104163 105920 89511 85744
21241 85744 91516 91900 97561 96253 104674 123520 126372 121703 105357 102733 110529 94266 97386 113799
21227 113799 148449 167462 166648 176243 177049 183579 216194 260737 277381 304099 325815 300702 264760
21214 264760 252464 240914 232934 245352 243445 247510 254969 257422 267878 292592 339347 338752 339624
21201 339624 349417 354137 353980 355921 326511 322723 327122 321072 337622 345818 353791 380616 444845
21188 444845 489214 521876 546438 547871 526895 508701 521268 535952 523161 518567 505348 518080
21176 518080 535172 550159 563795 532847 498985 468579 428303 390314 368795 358746 333365
21165 333365 291199 275188 284064 265523 257773 264780 281741 290242 256225 238942 234628 240576 241663
21152 241663 266252 281201 281032 280268 287540 296745 317522 312258 298262 313943 310190 321289 325115
21139 325115 315892 315495 323715 325302 338710 336403 363007 364394 356229 384399 401041 380538 369925
21126 369925 391807 413198 436720 466237 479536 495007 531057 558480 562539 594258 646551 675616
21114 675616 722016 756903 806847 848602 898052 942768 972810 1025553 1083097 1128915 1159633
21103 1159633 1196199 1249227 1310270 1358400 1451915 1570459 1689936 1830236 1962102 2080572
21093 2080572 2240126 2420419 2583624 2751954 2945069 3135967 3370029 3666325 4021985
21084 4021985 4455267 5027234 5708286 6536004 7559045 8814938 10408207 12408625 14963037
21075 14963037 18152348 21947898 26089696 30059344 33196814 35005410 35201583 34075258
21067 34075258 32252103 30400120 29168057 28941951 29861663 31664716 33849179 35709644
21059 35709644 36523547 35796442 33529977 30077054 26063252 22095058 18528324 15539782
21051 15539782 13092153 11148758 9571364 8295362 7258406 6391350 5685534 5083323
21043 5083323 4574347 4136790 3790019 3496513 3219779 2983985 2787750 2600827 2430217
21034 2430217 2271410 2102134 1952785 1809460 1690566 1569608 1490994 1417065 1319120 1256581
21024 1256581 1221374 1203006 1166145 1106651 1025532 966120 908798 853207 814630 740500 663250
21013 663250 630430 612368 590730 588379 576507 558315 531002 495074 473616 441146 405296 407960
21001 407960 390058 374757 359581 320687 318359 321477 308541 300753 291242 306670 290085 276780
20989 276780 254511 242139 248774 242389 236665 233962 225644 208594 211155 200592 174158 155413 167802
20976 167802 177424 160384 154355 155618 162056 179791 194527 183790 166613 145836 149976 147430 140936
20963 140936 166135 162353 123378 97475 103021 91208 92572 88346 105627 103701 99324 101745 85946
20950 85946 84155 86939 77178 86191 93824 74250 72882 98114 110462 95544 68294 54661 44846
20937 44846 95504 103708 71709 53779 47331 55832 83533 82429 67654 59802 49920 42839 40103
20924 40103 36167 41644 67544 76090 68845 75157 68284 54805 61469 85429 89481 71101 55250
20911 55250 58443 52011 40742 61754 81402 81645 78429 83940 68576 72073 71031 64064 63364 57231
20897 57231 80495 94089 78386 49434 47173 52193 60198 64860 76836 66317 62746 55097 45667
20884 45667 43824 57579 87052 111683 110159 86965 90515 99615 89599 86975 92938 98913 84025
20871 84025 60557 61985 42082 33763 43519 33424 46462 63549 66511 65114 60315 58692 69629
20858 69629 77139 78426 80239 86701 84924 72088 60560 64856 58463 34138 36372 53012 57511
20845 57511 64759 49820 40554 46889 38162 35705 50700 31405 19670 30047 41548 37257 46527
20832 46527 68850 72612 73685 67105 76551 89081 95593 80247 60901 48471 74157 79002 59815
20819 59815 56927 55646 47689 71006 84236 103681 104241 94439 101299 101795 88134 78901 80171 94250
20805 94250 95968 102820 96174 85515 77109 68585 69574 73049 72382 63798 49198 45274 50107 69820
20791 69820 98408 96171 73348 75011 64761 60755 49358 61042 75885 67381 69956 86381 103524
20778 103524 125087 120044 97913 89859 92721 101229 111224 148539 147329 113229 119283 140206 143253
20765 143253 142277 143948 130059 111782 96805 83785 82515 115394 125912 110932 133872 156597
20753 156597 163410 155759 166151 148372 127750 131702 115828 119830 126318 121624 130039 164755 166551
20740 166551 157852 135526 112998 147835 172513 192221 186893 164565 170699 161036 152281 144943 155435
20727 155435 157551 154652 156063 181340 188859 193785 181729 164988 192318 202966 181409 181756 191476
20714 191476 210080 227763 222045 223719 196118 169067 155818 176573 200876 198257 211929 219370
20702 219370 235122 240256 219546 215016 232918 242976 278401 313068 320226 292062 269057 272766
20690 272766 294205 293324 299682 316097 320622 326839 345026 372545 368050 371232 405569 424350 438814
20677 438814 457523 478516 494977 489704 493940 523827 551452 563533 606409 659441 704314 735858
20665 735858 766931 819393 877407 973419 1064136 1133638 1195609 1247250 1308101 1364487 1436802
20654 1436802 1545700 1619451 1713329 1785745 1862835 1955482 2063783 2187755 2345707 2521835
20644 2521835 2711182 2931171 3205746 3494110 3806527 4156444 4580354 5067170 5627661
20635 5627661 6301904 7164305 8310234 9806116 11744972 14228373 17357207 21092474
20627 21092474 25186850 29046481 32004691 33503283 33275580 31555900 28922927 26088470
20619 26088470 23631685 21920074 21125164 21300299 22469335 24592840 27480815 30668970
20611 30668970 33466404 35125754 35118463 33352441 30178888 26254872 22219841 18510521
20603 18510521 15371886 12821889 10814260 9248014 8007569 7012587 6196908 5516010
20595 5516010 4952913 4498759 4097978 3748139 3419655 3115619 2836980 2602898 2392742
20586 2392742 2204568 2008751 1852895 1684010 1569237 1465691 1384454 1324706 1282118 1230471
20576 1230471 1200893 1159402 1109523 1062864 1013298 950607 869857 800401 740004 685248 648999
20565 648999 607127 575909 552998 530693 509716 475471 469392 438607 405313 412591 399067 399185
20553 399185 409272 452299 480486 495964 503421 468359 403710 344411 335361 332752 325662 339750
20541 339750 350643 356187 378400 405999 433291 443314 412824 362880 315638 268852 260776 262363
20529 262363 230714 226157 242829 258627 291859 318365 298279 265852 214818 168248 147999 138817
20517 138817 126975 139869 126513 120554 101803 111180 130650 132591 117793 114952 118958 120430 127178
20504 127178 128546 98102 70985 80023 80603 95216 82135 65010 76543 76774 87590 101585 115734
20491 115734 126887 112190 112887 121390 116830 100127 110721 114197 128076 146026 178813 200869
20479 200869 219078 245612 262160 251756 237033 250412 243871 234528 227635 221026 225620 229337 237608
20466 237608 248412 258807 265299 263140 223166 176356 156958 139855 125762 116892 129814 113871
20454 113871 94387 89454 82802 94388 104225 98410 65267 56376 62265 54862 51617 65016 73068
20441 73068 74695 65878 43865 34760 49251 56892 80316 86607 63255 21388 12134 20300 26264
20428 26264 58212 68136 67469 45148 19553 36035 42689 32499 33941 23078 7912 2700 -8686
20415 -8686 -17312 -11676 -8539 -9967 -10231 49 -3847 -690 11028 48565 62990 49315 53723 65675
20401 65675 69701 57317 52138 19190 12897 20132 10491 -1538 12546 1484 -8647 -8563 1302
20388 1302 5855 13814 11651 9579 5749 16935 15442 24282 8487 12595 13835 11626 17851 22720
20374 22720 30752 46289 36581 35244 27308 23099 22809 28234 19620 35319 46107 31255 27142 20621
20360 20621 23192 20376 21631 13377 21750 11402 3076 27168 24223 11150 18922 11616 31043
20347 31043 29351 35809 50297 59934 51864 34335 30033 26513 10754 9317 14587 33239 44420
20334 44420 45773 41993 19661 1157 6494 23681 20220 28764 19125 -10660 -14510 -11242 -751
20321 -751 19669 30367 25137 18380 18410 29378 45900 64846 71672 49957 47779 36344 20548
20308 20548 18427 4721 9780 39932 36343 10108 -11365 -2192 18511 32040 36429 21597 11185
20295 11185 2435 5303 -12804 -20321 -12691 -6026 1680 1693 -12961 -7802 5576 -1655 -1196 -1222 6874
20280 6874 7603 1012 13846 29801 19557 19441 13156 17315 17836 -12034 -15799 -24326 -25011 -17897 10998
20265 10998 9271 12160 20583 21413 15256 20408 29574 16833 6950 18285 41365 37133 47933 67989
20251 67989 61903 57549 42936 47094 42661 40464 15245 -817 -6392 10802 17551 2169 -10631
20238 -10631 7075 35203 49268 50317 36011 24343 11737 11157 7144 12518 2239 3847 4804
20225 4804 14323 27585 42658 51063 37370 20220 1938 8771 6360 26254 58042 44320 31124
20212 31124 20435 21652 24034 39734 47343 31055 14099 14444 19763 26093 32086 34911 25212 21566
20198 21566 31545 27075 49987 60838 35933 27077 22203 35852 49342 42609 38245 51911 43368
20185 43368 33060 29490 11903 25513 29156 17201 38612 62231 51345 55245 56448 61865 69215
20172 69215 73934 65644 47922 37832 47258 64796 102459 158699 249559 336798 372845 370417
20160 370417 321798 252043 190954 169672 150807 147782 199106 305108 390120 457452 507501
20149 507501 550089 552536 514917 441823 338633 256459 195116 164113 161965 194879 243812 309413
20137 309413 386690 415873 385723 333633 221546 137484 103578 111607 127130 114727 107833 108676
20125 108676 115376 114980 101577 100771 95988 106563 85851 85561 82722 107607 120002 120796 132153 126335
20111 126335 90533 90471 121851 123608 91919 83493 65919 68366 81357 69592 66069 57720 55127
20098 55127 34659 42543 49992 64729 67880 77805 90137 94655 85367 87313 100578 98478 65390
20085 65390 81691 93453 87101 87300 96865 110872 110719 95821 103851 121916 112616 99418 98646 91029
20071 91029 86093 86778 89270 95307 120035 142720 143642 140727 127277 125338 116266 114783 138180 131225
20057 131225 132583 145609 158784 181772 177015 189743 201864 202984 159502 151854 182158 206549
20045 206549 244688 250061 246535 249962 254684 285174 329664 386076 406626 426195 434075 447366
20033 447366 464388 516430 576804 644345 729158 860184 985936 1128992 1239161 1325609 1403923
20022 1403923 1491101 1628043 1827481 2042667 2309118 2680273 3224344 4076596 5432975
20013 5432975 7623906 11414192 17806230 26617033 33368360 34094671 30233168 23067312
20005 23067312 16812234 13423576 12194638 12589118 14851715 19847919 28344490 38432451
19997 38432451 45446683 49868006 51575470 48022807 41416693 33064358 23942092 17518702
19989 17518702 14040085 12567379 12725034 14839778 19591237 26823143 32570861 32708074
19981 32708074 28492422 21040174 14130413 9811251 7234222 5563601 4410147 3597741
19973 3597741 3027034 2651757 2384456 2182072 1984853 1779357 1597424 1420696 1238337
19964 1238337 1067367 894041 753975 668961 611551 549300 493634 442057 426566 378244 364518
19953 364518 344894 286984 230963 208179 214199 222912 225175 193103 171978 170090 176330 183253 158968
19940 158968 135217 114990 111417 98513 96608 117111 123337 112721 86498 67033 55132 58747
19928 58747 74087 94299 73368 49177 46888 26952 19532 29430 29707 28605 43434 48541 43741
19915 43741 36667 24379 27105 23207 23377 16123 11629 -7480 -16613 -4945 1745 10518 27865 23424
19901 23424 31257 43162 46998 25361 25059 -3526 -32300 -30348 -10242 -17772 -24269 -24161 -4977
19888 -4977 14382 -5341 -15804 -2062 -620 14989 13234 8572 -3379 -3141 12997 601 -12585
19875 -12585 -2339 -12695 -19736 -15520 -2331 -9927 -10051 -25351 -49559 -46185 -37049 -33249 -17908
19862 -17908 7594 22770 14976 4570 3936 -19534 -20649 -11137 -22649 -17784 3686 3692 2289 2104
19848 2104 2799 -6532 -24937 -33055 -12617 -13598 -3551 -14268 -8978 1329 -11155 -19388 -7739
19835 -7739 -15051 -4120 4457 -2282 6764 -8807 -13463 7254 8365 16476 14906 12601 15983 4739
19821 4739 -11353 -22042 -54917 -48087 -36117 -8192 12151 6653 20098 33235 22672 11984
19809 11984 7704 -3378 -17670 -36733 -44103 -53841 -51297 -35608 -15683 -19008 -28037 -21707 -23634
19796 -23634 -27471 -49934 -47919 -31338 -56125 -61656 -52179 -43374 -39704 -31474 -10992 -12217 -18883
19783 -18883 -10689 -28332 -17332 -6366 -4330 -11171 13471 9208 -10946 -20580 -31996 -30985 -33272
19770 -33272 -46887 -52247 -33630 -26631 -40352 -37947 -19723 -782 6294 -2551 -15371 -9080 1985
19757 1985 -4073 6098 2662 -8947 -16885 -18150 -23016 -6248 12074 2239 14000 19664 35872
19744 35872 28013 -1646 -18288 -18970 -24582 -18699 -2526 -9995 -15203 -12951 -370 4550 2566 -9940
19730 -9940 -23051 -23726 -31124 -28843 -34817 -34845 -34366 -20708 -19729 -17458 -9306 520 -13320 -28131 -5954
19715 -5954 -9133 -14890 894 5168 -20402 -25603 -19343 -6060 -27065 -37052 -38513 -18689 -2805
19702 -2805 1060 14398 -3016 -12841 -14852 -37 -9618 884 12885 11090 5531 15006 24719
19689 24719 19347 15339 5067 1793 21705 34865 29244 24487 15024 -1828 -19294 -7304 5369
19676 5369 -15461 4762 4109 3014 10618 -5325 -10655 -14693 -25779 -18338 -31565 -42336 -54144
19663 -54144 -43245 -22160 -2411 3206 -628 -16281 -13256 -22139 -28637 -48896 -42467 -24548 -12260
19650 -12260 4937 17266 4372 -10786 -16119 -37236 -27581 -14391 1675 14840 3779 2027
19638 2027 -2983 -25959 -31655 -13364 -1366 -3125 -21575 -52457 -31056 -9616 -22228 -19070 -19896
19625 -19896 -19648 -13722 -19937 -22456 -29752 -30528 -12537 8619 2051 -19752 -30939 -43217 -46483 -32741
19611 -32741 -21677 -11316 -9554 -28889 -17286 -18812 -43136 -42914 -15203 -8376 -18092 -19416 -13436
19598 -13436 -11299 -2746 11683 14675 22872 17924 11850 20031 -195 -38298 -48008 -32204 -39532
19585 -39532 -31262 -28621 -29359 -27467 -11338 -14567 -22084 -35625 -34230 -34172 -8755 4303 -5105 -35772
19571 -35772 -34042 -27069 -40791 -30107 -28609 -34366 -10021 -18818 -11994 -16770 -21038 -15575 4623
19558 4623 -13490 -18701 -30039 -32405 -12743 -17668 -10736 4577 -3478 -5753 -10712 -23724 -43151
19545 -43151 -46835 -33736 -25408 1601 -16539 -38636 -47378 -28569 -18466 -14424 -9403 -13994 -10646
19532 -10646 1437 -16026 -36383 -25377 -14104 -25273 -7559 18296 12931 19447 46997 44055
19520 44055 25088 5995 -16889 -43665 -54770 -55252 -17335 -23584 -25173 -9251 -12136 -14057 -10755
19507 -10755 2243 467 -19636 -31913 -13872 -7047 -10961 -37047 -43045 -33394 -33135 -22553 -10511
19494 -10511 -909 -5693 -974 12401 10213 -7497 -12775 -7017 -26971 -39447 -42645 -43221 -34504 -31491
19480 -31491 -25664 -7904 1191 -3101 -11035 -3603 19274 -2260 545 -1330 -14112 -14099 -3472 -656
19466 -656 21105 44999 71025 96551 119573 164525 162045 126378 80328 39226 39072 49856 61607
19453 61607 62903 101019 154575 204793 245866 277005 281013 253082 220958 153963 107794 73902
19441 73902 61470 75757 52272 47094 88926 126605 148381 125210 129289 105417 54237 50777
19429 50777 71139 63505 38355 17131 456 13681 18992 -857 -9401 -7338 -13641 -23528 -51636
19416 -51636 -59037 -45328 -50997 -60621 -62296 -40641 -28860 -14724 -11460 -19146 -4110 7964 -10086
19403 -10086 -17299 -37801 -55738 -35117 -27624 -36744 -31344 -25994 -46962 -32072 -32514 -25427 -16643
19390 -16643 -12251 -15479 -1588 29519 25495 13949 2954 1910 14496 6090 -19831 -46666 -45162
19377 -45162 -35041 -31174 -22399 -38171 -48288 -39172 -53342 -58298 -48495 -41568 -45611 -51198 -47628
19364 -47628 -14939 17176 -1786 -21524 526 9013 -383 -763 -17637 -9765 5948 -2738 -8850
19351 -8850 16716 17765 18555 14667 3966 -18194 -12980 -4176 -10234 -34318 -56645 -55744 -23730 -9115
19337 -9115 -11988 -29673 -51731 -43183 -37289 -46871 -56189 -52161 -29849 -14643 -5996 -13645 -32028
19324 -32028 -38692 -29594 -20196 -22406 -22075 -29919 -33197 -29998 200 -19957 -31695 -42202 -37880 -19786
19310 -19786 -25261 -52544 -48726 -29369 8786 12376 2441 -15100 -25755 -26133 -15717 7364 23190
19297 23190 26463 23985 34674 22059 4342 -1270 -5390 -13933 -25256 -11599 -13766 -19010 -8258
19284 -8258 -6519 -19913 -32683 -32121 -36447 -19970 -4676 -12034 -31967 -30860 -21844 -23879 -45599
19271 -45599 -36079 811 19717 21162 12084 147 4181 779 -9482 -24018 -27375 -34735 -38344
19258 -38344 -49501 -47351 -33218 -30206 -4215 -6188 -18228 -5196 -15640 -12517 -13075 -7464 -12087
19245 -12087 -11863 -5044 -8336 1704 23640 16794 7981 -3263 10229 -3654 -36524 -26413 -5640
19232 -5640 -9735 -7875 -16301 -12411 -36282 -42825 -30743 -26765 -43265 -51990 -42478 -37441 -28717 -12928
19218 -12928 -11388 18759 18363 3343 -8586 -2453 -3610 -7776 6769 -2819 7228 2638 24
19205 24 6400 -24564 -25361 -18961 -17014 -13839 -6652 -12832 2829 -10832 -21928 -23226 -57998 -60528
19191 -60528 -35837 -40299 -40994 -19630 -5400 -23532 -35366 -22968 -13575 -13747 -7831 -1221 -4637
19178 -4637 -19108 -16573 4382 8050 4642 20568 28877 44923 41110 17956 -15265 -15034 4163
19165 4163 -30613 -32494 -5716 -15555 -6588 7746 15244 21208 21234 18661 -931 -16923 -38844 -42812
19151 -42812 -34219 -15499 14852 20217 -2940 -35702 -30316 -29934 743 26543 12102 -24605 -41660
19138 -41660 -59179 -57311 -50155 -43094 -12503 -109 3510 -8507 -46406 -50772 -42299 -17414 -4620
19125 -4620 -13875 -26072 -19857 -2849 18723 15004 9404 14505 2105 3512 205 -8299 -26539
19112 -26539 -3231 631 -17267 -34208 -29555 -31577 -32361 -27692 -11896 -4630 -4542 -16559 -15653 -5079
19098 -5079 23166 22557 17890 -6954 -26919 7704 23608 18577 11261 1140 12809 24506 35303
19085 35303 8630 -19984 -23438 -13290 -30723 -32164 -38719 -59949 -54087 -35280 -31851 -32178 -13709
19072 -13709 -24524 -37554 -33325 -19179 -30190 -23808 -10132 -13323 -36243 -21692 39 9172
19060 9172 -12669 -22092 19798 41747 41393 26811 4331 -13813 -59732 -51206 -24802 -27296 -17506
19047 -17506 10247 31225 44144 25145 -2591 -22918 -39280 -40556 -45230 -41086 -61042 -55641
19035 -55641 -42843 -31102 -29696 -39525 -29812 -2702 -12699 -14005 -8851 -8736 -5634 -27279 -22767 -22907
19021 -22907 -13701 -17803 -28688 -39832 -39356 -35434 -25178 -35638 -12979 -1981 2629 13253 3180
19008 3180 -6961 -3948 -16717 -23270 -20988 13915 26882 13026 -5956 -23939 -33109 -18294 -22066
18995 -22066 -41163 -52001 -48705 -48686 -49187 -42051 -41277 -29366 -920 6478 3601 -9650 -19785 -6207
18981 -6207 -14141 -19920 -33526 -43663 -7224 13747 10792 -5234 1779 10033 -15260 -26814 -13512
18968 -13512 -32621 -35057 -18526 -17723 -27512 -30059 -30858 -29838 -24855 -40954 -47887 -15829 -6341 1670
18954 1670 -18107 -40277 -9973 27931 32869 -3380 -22470 -13284 -498 17149 21329 16656 8009
18941 8009 -8885 -17427 -11441 -26011 -21867 22613 15292 1865 11592 2491 -721 -4648 -740 7881
18927 7881 16694 12494 5952 -1030 -22774 -20584 -5959 -4997 7523 8211 -7921 -5354 -2514 -13394
18913 -13394 6522 -7069 3854 18026 29177 16296 -978 -11338 -35753 -54083 -59390 -40463
18901 -40463 -37745 -38007 -31726 -42957 -37339 -37321 -27814 -29140 -28904 -27696 -32653 -40417 -44447 -35995 -36866
18886 -36866 -36324 -11461 -2371 464 7057 4672 -11548 -20702 -19262 -2529 3887 1329 9025 19914
18872 19914 25549 4136 -2203 -822 16584 27290 21243 17549 4155 22563 14375 4118 11352
18859 11352 17487 30558 15172 -3441 -2071 -2327 9103 11358 -4914 8154 -1069 -25943 -30555
18846 -30555 -1019 16572 11509 -20595 -15651 -20061 -31103 -13498 19819 13500 -17888 -32286
18834 -32286 -38483 -39814 -39376 -19395 -15206 -16197 -4068 -11390 -15669 -13380 -26613 -33388 -29903 -35065
18820 -35065 -32869 -47325 -37897 -23931 -11388 9020 15095 -13560 -24830 -12742 -3023 -18671
18808 -18671 -35877 -41115 -31642 -15173 -12123 -18452 -21806 -18340 -29097 -31159 -32424 -10170 -362
18795 -362 16015 27909 15775 6947 -4564 -9811 -4056 -4558 -7873 -2798 714 -14162 -24133 -8714
18781 -8714 -18240 -27767 -10578 -8322 -14646 -17321 -9867 -3847 -1787 -4759 2859 49428 106522 138841
18767 138841 132871 112712 79602 46077 5765 -12868 -2911 -12345 -31515 -38667 -27223 -42610
18755 -42610 -22260 -10233 -17170 -31482 -14007 -19862 -9876 2150 -8087 -1675 5778 3481 17980
18742 17980 5969 6503 3961 6045 6649 -22120 -26380 -21284 -40941 -42701 -27419 -29221 -23281 -9993
18728 -9993 5466 19861 1432 -30977 -19927 -9731 -19220 -24411 -13705 -8067 -14441 -36003 -32266
18715 -32266 -8442 7791 6467 -16908 -37325 -42647 -27970 -23414 -21062 -24147 -38565 -30928 -14490
18702 -14490 1236 8500 8686 2687 6706 11949 -13226 -8876 -8727 -9688 -14362 -4008 -2296 -1113
18688 -1113 3744 -956 -15811 -3449 7648 11147 -11936 -3471 -9304 -27700 -32205 -20352 -14494
18675 -14494 -19392 -6126 -18228 -27976 -47867 -34211 -5033 -21386 -26601 -40042 -39118 -32501 -50624
18662 -50624 -32388 -22054 -12346 -19321 -16645 -25578 -26076 -16062 -21791 -19166 -21813 -4179 679 7281
18648 7281 8220 -7176 -24220 -18893 -25747 -17421 -21948 -21433 -12983 -12994 -17435 -18501 -14202 -22956 -37570
18633 -37570 -49166 -37406 -25744 -23752 -41468 -38212 -15196 -12397 -18024 -9645 -16184 -6971 -28453
18620 -28453 -30768 -29453 -36309 -34098 -41477 -39846 -27422 -15977 -3149 -3085 7750 -11042 -18350 -34761
18606 -34761 -42692 -8590 7580 12615 12350 -390 4174 8257 5575 25016 16224 10773 5328 2587
18592 2587 -472 -4386 -11368 -13947 -13 3415 -762 -14387 -24667 -23926 -48032 -59510 -39391
18579 -39391 -24075 -19662 -7874 -13368 -20528 -28596 -28257 -40120 -56051 -28949 -26036 -34088 -28914
18566 -28914 -15715 12243 9775 -481 -3785 3973 6960 -7042 -14611 -13404 -11823 -25014 -17713
18553 -17713 -12460 -22396 -36968 -18563 -31915 -33940 -20217 -8741 -31861 -33857 -33334 -25677 -22384
18540 -22384 -15876 -44862 -59138 -44811 -41743 -54131 -60633 -53633 -47575 -48537 -35224 -7183 18224
18527 18224 10063 11905 -10171 -26496 -27536 -35434 -26923 -40331 -41105 -47451 -33893 -27168 -31899 -23870
18513 -23870 -32825 -30869 -9802 -11136 -16413 -34310 -36662 -23496 -9843 -14418 -1129 667 -17743
18500 -17743 -40971 -32517 -26193 -24277 -24309 -5245 5167 2441 -24016 -46963 -54829 -49798 -30424
18487 -30424 -21904 -8152 -6810 -12159 -15509 2033 -1810 10067 4738 -20399 -44761 -29612 -16101
18474 -16101 -20370 -25102 -27741 -17246 -21520 -10865 -6695 -3462 -15157 -20572 -40635 -38782 -33351
18461 -33351 -44846 -36202 -12251 -4764 -16382 -9243 -2569 -6483 4554 -6394 -9440 -2296 8445
18448 8445 6359 3716 -5809 -13400 1600 24469 21057 11164 11761 -7281 -24706 -33352 -35098 -28103
18434 -28103 -1605 9282 19498 19505 -1450 -31654 -47434 -41416 -27192 -32515 -31278 -28329 -41898
18421 -41898 -48386 -37602 -10987 -14469 -41822 -70737 -58554 -36208 -5305 16165 -3160 -22212
18409 -22212 -33699 -43706 -47961 -50026 -44771 -32110 -28387 -34893 -22677 2964 2852 -18718 69
18396 69 24774 15480 11533 5507 -6263 -10374 1684 -10941 -5821 5132 -16375 -8893 -4677 -15095
18382 -15095 -16783 -21087 -23997 -24090 -3280 7523 -25530 -41052 -29294 -8580 -21275 -31156 -20905
18369 -20905 -16300 440 -2460 -10584 -3190 9322 22929 2031 3239 3851 10327 15329 358
18356 358 -17022 -6829 1755 -12198 -17248 -12296 10781 30574 24917 9174 14810 9908 -4266
18343 -4266 -25186 -13101 -828 -2832 1824 -2964 -11388 -24611 -18911 -13919 -18824 -21980 465
18330 465 16710 11745 22693 27943 4246 -14643 -13851 -9057 -9862 13264 23333 3772 -5826 -4532
18316 -4532 -11999 -26442 -42983 -26022 -7766 -15465 -19669 -11993 14484 6539 -1587 10307 12271
18303 12271 18417 29318 36023 46433 40189 9044 -14287 -18011 -27832 -21078 948 -12413 -50256
18290 -50256 -32874 -11782 -18622 -12497 -5029 -16664 -19925 -12908 5049 -10241 -2674 18707 3563
18277 3563 -30173 -28726 -15257 -24090 -12778 8138 771 -14812 6643 11420 4639 -6454 -18456
18264 -18456 -24458 -37515 -76095 -88286 -60728 -31507 -1833 -1823 -31274 -22755 -18964 -12331 -5185
18251 -5185 9008 14287 4930 7360 -2259 -20961 -17679 1806 7615 14230 12446 36126 47406
18238 47406 17428 7694 40595 70036 63309 49348 33149 19175 -2665 -3792 13678 18814
18226 18814 11050 -7115 -24929 -35300 -37743 -41902 -34176 -15595 4531 13813 24193 13612 8948
18213 8948 22715 29550 24406 41168 47737 21487 20111 23607 1625 12471 22685 40034 43500
18200 43500 29452 26566 13997 16258 26807 -4405 -15021 -4293 11869 -47 1741 26652
18188 26652 36731 29223 25560 30832 36410 39524 44178 47178 22905 7522 11086 3638 13962
18175 13962 26176 34700 31269 40057 43855 27091 24024 21871 26329 34706 47826 38061 35484 28538
18161 28538 37016 53688 53001 36323 22265 15211 22127 35779 51042 57027 48066 15842 4975
18148 4975 15070 50207 95770 89985 64800 67900 87772 103365 137461 160788 144225 132136
18136 132136 132791 162423 164181 161336 168299 216285 266097 298754 317557 342744 408345 476688
18124 476688 519674 572013 666054 794998 959769 1147705 1390267 1762567 2351104 3259570
18114 3259570 4815297 7777928 13327317 22525457 32526260 35842196 32834720 24850036
18106 24850036 15531923 9654842 6499423 4694268 3547023 2771429 2238104 1853923
18098 1853923 1538506 1307017 1134336 990311 850639 730562 633761 559693 473016 402765
18088 402765 365723 323372 286749 264319 227432 189273 178888 179275 145946 145662 143089 145748 141872
18075 141872 125282 101009 81222 67040 56298 60793 69359 68751 67063 72028 51206 31205 10288
18062 10288 1231 15761 37639 33227 31273 45025 46363 51291 38224 25147 12129 2513 -7882
18049 -7882 -12197 -11135 3055 10886 16742 17767 -9808 -19216 -33658 -24863 -27447 -45012 -2907
18036 -2907 35064 9485 -15854 4793 9039 -9849 -12453 14587 24962 21646 14328 9486 -4200
18023 -4200 4315 3026 3992 11789 7424 -1191 6785 -2142 -32961 -25080 -20375 -38626 -46205 -13610
18009 -13610 -9269 16907 18257 7733 13932 -624 -20998 -13887 -12575 -892 17177 4270 2943
17996 2943 5858 1366 386 -5470 -26451 -60681 -56083 -38673 -17617 -12712 3371 18137 -1047
17983 -1047 -35565 -52623 -38007 8998 33124 17184 4575 6677 7000 -7651 -7650 -7968 -14397 -19300
17969 -19300 -29436 -21976 -4100 -108 -20350 -26901 -35315 -44660 -36516 -33272 -40014 -22219 -12108
17956 -12108 -3295 -13852 -38540 -41869 -25423 -23750 -35808 -16025 -12555 -11252 586 7980 14119
17943 14119 28453 19553 2812 12902 8228 -13814 4968 6316 -8916 -8823 -14463 -18590 -24111
17930 -24111 -24604 -17146 -1230 -4683 -6480 -2586 -9880 -4956 -13320 -22443 -27285 -35920 -30405 -37220
17916 -37220 -55101 -57682 -40421 -18545 -17751 -22180 -29756 -17618 -891 -1601 -16589 -20888 -12701
17903 -12701 -6907 18467 14526 25831 19967 19544 13525 17079 30299 29286 21763 10423 1503 14776
17889 14776 16368 17768 13914 -9206 3942 -681 -34685 -50040 -33269 -9238 8552 32700
17877 32700 -4450 -24500 -24029 -29586 -42460 -53368 -55130 -52737 -27689 -14868 -27854 -21837 -19207
17864 -19207 -12435 -3547 21263 29843 10955 -15862 -26066 -9993 15237 -4269 -10439 -6026 19840
17851 19840 -736 -13066 -22600 -37913 -57159 -50755 -22512 9158 -962 -28460 -24953 7726
17839 7726 882 -7950 -6556 -10655 -10906 -8671 -23430 -18793 -12528 -9462 9078 27903 16391 -14899
17825 -14899 -12880 12658 24987 28605 7943 -14727 -16017 -25812 -16945 -34198 -37945 -33805 -13680
17812 -13680 -2383 -16244 -32255 -43782 -35088 -29960 -32471 -14076 -21019 -35080 -36934 -31740 -17446
17799 -17446 -12745 3966 29734 20404 4289 -10575 -7033 -21102 -45044 -50345 -52408 -33151 -22424
17786 -22424 -31140 -38594 -42556 -18662 -26095 -40503 -27008 -9287 4667 21491 7163 -12646
17774 -12646 -5593 -5968 -24051 -14925 -17872 -26765 -18414 -27929 -35948 -24785 -28572 -16083 -22080 -27869
17760 -27869 -38301 -19685 -7205 -9642 -20100 -8172 2967 9744 -4263 -34945 -40577 -44399
17748 -44399 -20362 -3459 -4754 -20661 -14833 -17716 -9459 1818 -8641 -8738 -20315 -15759 -20289
17735 -20289 -27048 -44251 -26036 -2254 9393 145 1236 9444 17833 -19184 -36589 -8808 11776
17722 11776 -3386 -9977 962 -12427 -13234 -31528 -44106 -29293 -21680 -22103 -43841 -38248 -15578
17709 -15578 -7200 -16287 -22238 -25043 -29089 -23747 -37498 -33455 -12925 2951 8906 9006 8454 -15832
17695 -15832 -23144 -23585 -18221 -25344 -21426 -17658 -8368 -17927 -18131 -13695 -31942 -42586 -37750 -14726
17681 -14726 -14795 -28698 -17290 -4032 -10513 -13629 -13179 -24281 -31083 -9701 -13531 -18567 -24016 -36482
17667 -36482 -19265 -7248 -8058 -19428 -34217 -18125 -26556 -40506 -35395 -31406 -23755 7525 34739
17654 34739 21471 -6133 -15207 -23926 -28325 -35254 -27175 -14433 -22826 -18190 -4740 3960 -15747
17641 -15747 -22467 -18326 -20006 11213 41684 22270 -6328 -12074 -682 -7935 -22063 -35127 -29819
17628 -29819 -23333 -14780 -9861 -13432 6547 21661 8500 -13505 -17731 -11689 -4346 8505 1278
17615 1278 841 -5717 -8979 -2654 -18411 -39671 -33356 -30788 -40070 -26402 -26251 -25166 -17044 -34806
17601 -34806 -49650 -36909 -25633 -11956 13050 21046 19550 12830 1453 8476 23117 24104 11254
17588 11254 9092 16064 18233 28350 23995 5928 -4100 2410 -5006 -34987 -42094 -44452 -44382 -29388
17574 -29388 -18694 -2663 -20556 -53069 -72769 -62459 -63727 -35570 -23734 -13090 -18001 -44332
17562 -44332 -26965 7930 20875 23517 5200 1667 1050 -14947 -56091 -50844 -40270 -24728 -32654
17549 -32654 -32753 -46086 -35463 -29982 -15159 -2812 -3555 9448 11610 -4959 -1326 -9383 -24255
17536 -24255 -33282 -18423 -20660 -7720 708 6850 944 8758 3420 -2200 -6259 -5428 -22737 -19074
17522 -19074 -18473 -23682 -22068 -27825 -21676 -13288 -14251 -9434 -26274 -35479 -15136 -18864 917 14664
17508 14664 15569 5229 -223 1883 1028 -9197 -20072 9558 18814 28209 39570 38545 8051
17495 8051 -28034 -32178 -16858 -24587 -25635 -18770 -17604 -31638 -30734 -23691 -19926 -16874 -32359 -43390
17481 -43390 -26371 -5499 -8578 -31396 -24990 7800 21063 757 -18259 -3754 -8135 7146
17469 7146 16870 10994 7636 5653 -18293 -41163 -18947 -9758 -10775 -1284 5814 1754 314 2054
17455 2054 10664 4904 -17659 -22828 -18541 -1990 18679 29652 21018 17780 61936 126340 178828
17442 178828 181580 148324 105135 64526 48763 34435 28469 27329 32050 18378 18493 30618 14517
17429 14517 -2064 -14671 -13450 10747 16254 16284 -996 -16513 -20765 -23192 -24231 -42160 -26420
17416 -26420 -17749 -3053 -7698 -28496 -33188 -19688 -12463 -15619 -15068 -4859 -8807 -9239 -28079 -16019
17402 -16019 -481 -4216 -14895 -6931 -5748 -32500 -19296 -2194 9365 17508 6446 -20897
17390 -20897 -48436 -49744 -40131 -25704 -23845 -32594 -26548 -33186 -28254 -17898 -25731 -17000 -5877
17377 -5877 -23648 -19498 -6402 -7708 -16900 -15304 -1426 -4819 -28397 -39333 -32675 -17949 -18755
17364 -18755 -2473 18686 8369 -22239 -12862 -3774 14273 17046 3144 6224 10420 4007 -16433
17351 -16433 -29598 -11328 -11811 -12772 -18861 -26839 -5999 13003 32059 8554 -5800 78 8342
17338 8342 4310 -1111 2513 25542 23114 8911 18127 12860 6831 6101 -15643 -16937 -23926 -45572
17324 -45572 -46806 -18096 9275 22359 24758 18326 8984 22551 4897 5036 3419 -13878 -19966
17311 -19966 -13713 -33365 -47527 -40275 -30059 -35897 -55465 -45626 -38595 -31138 -21931 -19405 -24264
17298 -24264 -49317 -48914 -55471 -58118 -38758 -32078 -29647 -31001 -52353 -51213 -39422 -14747 6235
17285 6235 26205 -2115 -16090 -1214 -8301 -5312 -20483 -18108 -26285 -25316 -13086 10574 11993
17272 11993 -11659 -51082 -39066 -19798 -19887 -44359 -49870 -35527 -28384 -19468 -11910 -16668 -19633
17259 -19633 -32945 -48801 -35203 -33699 -42110 -26562 6556 17645 -5611 -27025 -27625 -4931
17247 -4931 18719 16014 -11341 -434 1410 -8094 -26105 -10616 24042 33857 28510 17945 19577
17234 19577 29412 41533 12574 2373 18611 12716 -3585 -7153 4381 15428 11257 7020 -2627
17221 -2627 -5151 -11891 12605 14794 -2535 -12094 -15467 -20221 -18286 1526 9946 -12271 -19761 -17060
17207 -17060 -3075 -15394 -16644 380 9974 5378 -3034 -8983 -21316 -15252 -32909 -36765 -24735
17194 -24735 -34093 -17233 -3805 -190 -30829 -47207 -38691 -1136 6428 705 -2058 10959 -2166
17181 -2166 -6471 -12096 -21853 -21783 -13487 2293 7485 4497 23915 49624 42431 13369 6263 5515
17167 5515 -17453 -43761 -23354 -13044 -14539 -17457 -18409 6538 17796 10734 -2792 -13278 -21497
17154 -21497 -27576 -16561 -4882 -13242 -3650 -9459 -32138 -26287 -6679 -22491 -8711 -4859 -2206
17141 -2206 1987 3977 -3302 -14464 -512 10970 2049 12342 18478 12252 -2991 -18200 -17089
17128 -17089 -5447 -3871 -10599 9224 -8073 -27397 -25939 -37391 -27004 -24790 -15505 -1093 6316
17115 6316 2683 -10675 -1708 -21198 -17387 -22085 -22063 -13438 -7840 -3059 -15391 -18607 -23555 -11844
17101 -11844 -10241 -23379 -25609 -29873 -16401 -19984 -5036 -2875 16592 25189 112 -14840 -15663
17088 -15663 -19376 -23516 -35593 -22715 -17732 -16987 11307 6223 -7470 -2854 19171 23118 21110
17075 21110 -8640 -14764 -305 2510 2880 -700 -14996 -1354 5808 -6167 -4600 -1607 -35025
17062 -35025 -42132 -34784 -25722 -23432 -36635 -61471 -96464 -78630 -46924 -34262 -29834 -33452 -26610
17049 -26610 -23522 -17323 -23405 -11693 989 4501 12959 19892 46 -17944 -3131 -2413 -16914
17036 -16914 -44193 -46598 -24137 -5707 4821 -5981 -8705 1091 -8634 -21305 -30655 -32895 -30402
17023 -30402 -19810 -8325 -25574 -18073 -9235 -7605 -7519 1788 9481 -1311 -10470 -49211 -40241 -33735
17009 -33735 -35503 -47866 -55952 -68400 -64120 -47195 -28673 -23020 -12749 -11366 -21693 -10797 1333
16996 1333 -6298 -18198 -50168 -44845 -38528 -25173 3553 14972 15077 6352 5383 -2959 -22919 -25728
16982 -25728 -33725 -30674 -36688 -14596 7780 7512 -21121 -39012 -19249 -13715 -19995 -12940 -18248
16969 -18248 -18187 -9114 -12921 -23478 -29933 -11841 -2546 211 -17665 -19998 -22810 -22919 -44624 -46660
16955 -46660 -33753 -16241 1710 -5572 -31158 -41995 -42142 -31937 -16498 -30478 -29571 -39206 -18177
16942 -18177 -3617 -8564 -10453 -20233 -16611 -33147 -39595 -34943 -14445 -23501 -41716 -50442 -50118 -58300
16928 -58300 -58319 -51581 -39374 -15767 4020 -9999 -19419 -27171 -12831 -17660 -20644 -27931 -37331 -6691
16914 -6691 -5978 -19522 -16047 -19906 -39629 -19336 -23634 3075 32986 20632 -870 -6772 -12358
16901 -12358 -543 9968 7283 -1113 -30253 -54295 -46438 -62140 -43655 -34480 -13453 8849
16889 8849 5068 7502 -2024 -17160 -12533 -1575 978 3949 10840 -1232 -7034 -24172 -23750 -37247
16875 -37247 -37540 -39964 -49773 -39049 -22713 -26585 -22127 -11489 -34216 -26015 -10671 -6172 -5620 -13919
16861 -13919 -32419 -40901 -22431 5940 2291 433 19340 39346 36036 25290 -22258 -32015 -6243
16848 -6243 -10739 -18136 -21697 -25120 -33713 -35677 -41612 -52701 -31660 -16815 -14164 7621 16230 6792
16834 6792 -5709 -18104 -30785 -26711 -15683 -8915 501 5604 10417 17521 11334 -1927 -13975
16821 -13975 -12634 -14975 -41061 -45373 -13987 1167 -7479 -7568 564 16740 12830 14315 34119 50643
16807 50643 48700 22572 -1476 -8427 757 1257 4911 14817 19164 9123 -12139 -19802 -15223 -21774
16793 -21774 -25172 -19348 3470 6349 -12900 -2043 7579 -2488 -14171 -23756 -27473 -8536 -5349
16780 -5349 -26547 -30062 -13001 -8487 4078 -2362 -16177 -11822 -8719 -19217 -38329 -37427 -20458
16767 -20458 -8276 -8428 -7410 573 1347 7 15711 28931 12266 -2210 -6634 -16369 -46544
16754 -46544 -65315 -67042 -55876 -25623 -25259 -18235 -12384 -18556 -10638 -12342 -12948 -14799 -30588 -32044
16740 -32044 -26311 -10582 191 -10333 -15954 -16675 -11398 -12542 -21188 -25994 -28057 -7390 -19579
16727 -19579 -20757 -11802 4074 2847 -5148 -16503 -10327 5530 20939 20298 2781 6273 -2477
16714 -2477 6971 11169 1997 -11527 1027 10253 17936 11249 -6398 -16240 -15100 -17519 -20245 -28660
16700 -28660 -29430 -28357 -26699 -26377 -27806 -25753 -44057 -42626 -28262 -15515 -42810 -56332 -63214 -69328
16686 -69328 -51707 -32451 -10757 -5269 -2943 -4138 -10565 -16364 7057 45330 42269 36686 33510
16673 33510 12882 9220 -6556 -11891 -7193 5064 22484 21638 -9564 -43970 -52229 -41754 -40951
16660 -40951 -16228 -6293 -12204 -2838 9612 14274 12769 4742 -4867 -2817 -20972 -20989 -15399 -8660
16646 -8660 13305 20133 3910 -26546 -55915 -35289 -5508 7833 3658 -3521 6909 28374
16634 28374 29446 6488 6958 848 -17491 19378 12654 -8274 -3963 21258 24626 -9208 -24002
16621 -24002 -30157 -16561 14190 21807 20328 19773 21793 2424 -29034 -28229 -8837 -17607 -23760 -23536
16607 -23536 -35496 -39681 -19697 -6527 -15287 -11130 -14599 -25536 -20101 -18874 -19471 -20353 -21095 -26545
16593 -26545 -27415 -13660 -24214 -22868 -22849 -40840 -38578 -33747 -17515 9163 12599 4683 -10565 -15489
16579 -15489 -23481 -23647 -7066 70 -10112 -25234 -21303 -26231 -19323 -8956 -1205 -3137 -4264 -1987
16565 -1987 7133 12589 8658 28110 34824 37165 1335 -6478 -9656 -9545 -5718 -19566 -28127 -14724
16551 -14724 -13254 -17016 -10384 -28372 -31017 -8413 7611 13924 -456 -8133 13926 19665 6005
16538 6005 16386 16121 10564 -11663 -25147 -9528 1933 30353 26006 3039 1676 14166 21339
16525 21339 8181 -8122 -5653 8363 -5258 -17874 -9157 -8623 -15088 -15419 -83 16251 24522
16512 24522 19051 19631 30797 25871 7343 -3804 -13149 -12372 -23336 -23077 -21980 -22696 -8451 -888
16498 -888 -2804 182 13043 16318 5102 1943 -11996 -14207 -13280 -20420 -19141 -17507 -25954 -28848
16484 -28848 -24238 -3363 -491 -703 668 16620 37123 19199 -11592 -18238 -799 2816 -21874
16471 -21874 -31733 -31583 -20163 -16974 -17623 -23447 -20306 2868 17341 10098 8129 -8045 -4088 9267
16457 9267 15357 5166 11931 25414 13501 -6164 -33245 -40844 -56042 -39127 -19102 -12379 6031
16444 6031 4942 -13044 -19995 -27784 -34232 -40688 -46141 -57557 -52998 -58878 -51445 -21470 -11001 -26865
16430 -26865 -21121 -17562 -14618 -1390 -7508 -1677 -9656 -12204 -850 -365 -8148 4652 1494 -3078
16416 -3078 -21108 -11728 3787 11396 26823 29729 14807 -6638 -9276 8829 21004 12249 -1878
16403 -1878 -14726 -14891 -11784 -36827 -45543 -18579 12220 12577 15610 17379 15835 15002 3531 4153
16389 4153 -10631 -6800 18986 26359 19906 7460 -16369 -20946 -38228 -46705 -54998 -34271 -26850
16376 -26850 -14087 -15993 -13093 -19493 -28245 -42799 -36862 -3084 -11848 -17643 1174 4150 -3512
16363 -3512 -5018 3514 10909 -16846 -26691 -35009 -33117 -23684 -26411 -33762 -30659 -37380 -25963 -28636
16349 -28636 -16183 9192 31233 12896 -15760 -14158 -14105 -19128 -8597 7428 12110 9317 19286
16336 19286 20390 1267 -8901 -12067 -962 12519 13543 631 8200 9978 -5160 -32016 -35844
16323 -35844 -22356 -14702 -10505 -20744 -6230 -661 -10907 -13078 -13431 1814 15651 16944 30549
16310 30549 29294 4527 -14566 -21168 -49834 -59927 -43630 -31120 -8641 -6582 -23575 -20413
16298 -20413 -36300 -39245 -33092 -16786 -23467 -34223 -34731 -23655 -13083 1361 -5795 -7618 -5817
16285 -5817 1091 16210 6452 -12308 -32369 -50203 -46847 -2000 18343 -6724 -23610 -30840 -32852
16272 -32852 -29142 6105 9193 9320 6923 9569 9744 13178 9929 -8078 -29262 -22374 -18523 -2593
16258 -2593 9824 5938 -3740 -18837 -22048 -28793 -16516 1129 16003 4550 -29085 -13807 -204
16245 -204 5930 4963 -13102 -10140 -1807 -2730 -31284 -43246 -23570 12142 36750 21067 15386 21032
16231 21032 -4010 -3595 15369 17801 -3 -15727 -12321 1353 15654 21745 17608 5436 -1339
16218 -1339 6731 1317 7661 13885 19743 1249 1523 6882 -7684 -37149 -27683 -9807 14329 4265
16204 4265 -7095 -9718 -2563 -12109 -28469 -40555 -33393 -14219 -10803 9028 8584 -15028 -21553
16191 -21553 -29202 -24266 -19464 -29061 -40641 -30003 -16680 -14649 -19115 -15658 -37938 -68461 -54954
16178 -54954 -26758 -13475 3202 8006 1394 -16884 -24846 -32371 -35180 -27111 -21097 -9091 -15824
16165 -15824 -20575 -7506 8954 14888 19915 16271 1659 15756 34990 36060 12959 16147 14686
16152 14686 5811 5183 13714 8803 21117 6886 -4086 -20701 -27415 -24919 -39176 -42071 -36058
16139 -36058 -30479 -10976 -17457 -38393 -26715 -9613 -3153 -15242 -7780 -11028 -22782 -32275 -31528
16126 -31528 -6895 14989 43871 44783 15675 -8797 -15473 -3907 -5086 3916 4347 13977 15517
16113 15517 1814 -5110 9094 6727 -5976 4232 9009 7914 5320 -24169 -29726 -21049 -14559
16100 -14559 -18215 -28788 -29076 -29316 1423 17276 15322 1945 -17984 -31418 -34095 -33695 -32055 -9564
16086 -9564 -3241 -926 -9877 9529 11156 1353 747 -22102 -25411 -20425 -21346 -30880 -35258 -22406
16072 -22406 -27411 -31662 -37802 -43132 -39689 -30382 -32641 -34725 -31547 -11971 -1184 -191 636 2516
16058 2516 6607 -2167 -12528 1486 17238 29846 26621 15678 11566 22830 42428 29574 15741
16045 15741 2599 15093 11574 -8236 -12637 -15646 2129 23300 33521 12355 -1671 -8292
16033 -8292 -4121 -8147 -21769 -26905 -6802 -4396 232 -10805 -4182 26487 24041 31281 30359 19200
16019 19200 11172 5701 15742 16296 48283 54064 22273 5312 -2776 -17806 -26869 -28166 -21036
16006 -21036 -1475 33075 21919 25646 17197 -6370 -17014 -13777 21883 27013 3098 -9973
15994 -9973 -3504 -2834 7010 6987 13785 1940 -3786 -12369 3820 32860 -315 -26490 -27075 -8840
15980 -8840 -17039 -9328 -11173 -7409 14490 -1961 -17512 -5541 -1036 -3162 -5943 -9583 -686 -8435
15966 -8435 -7575 10836 -1808 -20337 2163 9903 7022 -3619 -7044 9787 16181 2661 -10923
15953 -10923 -23042 -19618 -12389 -9855 -9531 5013 -6457 -29358 -36444 -4574 8590 7537 9482
15940 9482 8605 -6518 -16351 -6453 1713 -3245 4095 15359 13328 15681 8549 -317 2644 -9051
15926 -9051 3692 24630 6367 -1251 7617 1478 -18568 -17603 -11032 -17109 -19117 -19241 -8585 -2643
15912 -2643 4325 8976 735 -15773 -28548 -33623 -16993 7423 5175 -11538 -18231 -614 18734
15899 18734 35103 25743 3162 -371 1615 -5852 15910 46655 35199 27018 38307 58617 37657
15886 37657 14372 7545 -2558 -497 -6937 10947 15262 14142 9869 -6717 2324 8748 -23481
15873 -23481 -41845 -51241 -54989 -57490 -43494 -33323 -21143 -224 8295 12039 30132 29672 9901
15860 9901 -2595 -28899 -24710 -14030 -1717 1151 -7837 -7310 -15989 -14419 -26278 -24637 -37485
15847 -37485 -32606 -25065 -18857 -31148 -27847 -15438 -18937 -7120 -2338 -16112 -8066 -30509 -36585
15834 -36585 -15923 -8020 -13254 -17940 -11719 -8802 -17461 -41070 -46336 -30731 -24762 -23356 -5668
15821 -5668 12739 15194 -168 -13802 -15237 -578 -15051 -20779 -4469 -7905 -38677 -38558 -10075
15808 -10075 -22530 -20890 -33951 -37781 -36298 -40164 -35194 -24133 -27632 -43321 -46197 -63647 -44431
15795 -44431 -14369 -9641 -25855 -26848 -22271 -35976 -31814 -18371 -3830 33 -8674 -5788 -16417
15782 -16417 -15363 -4900 -15853 -25888 -9748 -208 9549 9555 -8171 -32915 -7521 2594 -9674
15769 -9674 -2171 41896 56169 56914 60852 54347 25561 -18822 -16541 -10241 -19635 -4243 -3584 -8047
15755 -8047 -8300 1276 11759 14481 8467 11155 -9316 -22177 -33454 -24631 -18316 -17892 -12998 -18600
15741 -18600 -8386 5693 2457 4010 3448 6016 4311 -6345 -15942 -18927 -22966 -9321 -1037 17565
15727 17565 40696 54997 23038 -1262 5103 6438 -17789 -15786 19274 22918 22057 2396 -7398
15714 -7398 -15817 -35605 -37766 -30201 -25625 -39641 -37631 -17847 808 9707 10841 14040 6600 -11123
15700 -11123 -11693 -2759 -4505 4648 7135 38715 51543 18422 18035 30544 6099 -17635 9289
15687 9289 10317 15254 9715 18444 11298 13600 9260 -13310 -21518 -15229 -4757 10426 746 -16563
15673 -16563 -18170 -19470 -16507 -10357 15306 1281 -20581 -27521 -21663 -23334 -9053 4241 -13525
15660 -13525 -13871 8214 9661 12199 20706 15635 -14218 1120 26704 11675 742 9455 -3922
15647 -3922 615 4316 -14370 -27835 -24927 -8206 -25349 -33570 -37062 -25607 -8603 -4647 12356
15634 12356 12819 6560 -3472 -4176 -19679 -26076 -17851 -7766 -2575 -21271 -34897 -26295 -28755 -24063
15620 -24063 8545 26488 14685 -3338 3792 6724 -5293 -9851 5232 21830 7049 3625
15608 3625 -6963 -20742 -14969 -4782 -5600 3779 8115 -2753 9778 865 -3606 2550 -1997 16213
15594 16213 20560 9612 -845 -15858 -27958 -13790 11717 11475 -15789 -4889 13690 3891
15582 3891 5526 2983 -1335 -2305 -11295 -38439 -33604 -16316 -4462 -887 -823 13684 16268 17602
15568 17602 33554 35348 21824 25020 24890 14927 15461 -196 -14322 -13644 -22153 -10974 13851 9702
15554 9702 7397 15734 10405 21748 32174 -8868 -31816 -33464 -32631 -29670 -30752 -11448 -10970 -12027
15540 -12027 -4576 1798 -2269 4704 1637 -16081 -8392 4445 34688 44616 31354 18035 6957
15527 6957 851 5265 8531 -7660 -13015 -11125 -15002 -2664 -1446 2982 -4416 2937 -4882 12080
15513 12080 19182 35140 44012 32662 27109 34980 33183 23112 19164 24832 45784 41987 28954
15500 28954 24761 43017 46601 46815 25579 15675 27831 27630 33696 30809 44883 43242 16953 7770
15486 7770 9618 21170 26406 23778 31261 42505 47845 35968 50055 49680 42990 43805 45728 30233
15472 30233 3536 -4048 -11546 -6857 -10322 -5387 -7675 -7427 -6578 -15389 10263 -7192 -19944 -8281
15458 -8281 2499 12599 5591 -7002 -20021 -24465 -3178 -3572 -1193 16939 25043 12239 18688
15445 18688 12540 7283 7103 2150 -6140 24783 16302 11531 18026 5799 -4599 -580 -10408 -1598
15431 -1598 1509 -4143 -3588 4508 18196 21094 14681 23676 14164 5076 1543 2522 3864 4999 19590
15416 19590 21642 5114 13810 -1834 -4199 9910 20846 24103 20492 25832 26557 25376 19722 26664
15402 26664 30847 16085 -8741 15991 31423 43416 33213 18251 9215 11850 10079 23726
15390 23726 22421 3149 3988 21514 23384 23974 32414 43065 42025 29499 27235 18425 -1868 3013
15376 3013 21787 15957 12537 9720 4523 5324 -8080 -10681 -10596 9119 15172 13930 23389 10873
15362 10873 14228 19931 35795 51654 32985 9831 12920 9126 -252 -8263 1159 16161 6775
15349 6775 4351 3213 2521 7992 13196 20153 26340 10339 5543 17919 29376 27031 -8381 -30011
15335 -30011 -21314 -9095 17593 14588 11972 20861 22650 34045 53986 50306 23592 29222 -1316
15322 -1316 -1144 15594 21518 19574 11128 21824 14574 8167 8206 3831 -3216 11546 11306 10004 251
15307 251 -26723 -43477 -34556 -19225 -14274 -13662 -5847 10848 -5739 -21603 -34440 -53615 -54434
15294 -54434 -46527 -50918 -39405 -26991 -35739 -51284 -37282 -35630 -22036 13415 9928 5662 -5068
15281 -5068 -12626 -16164 -4059 -10695 -7787 -3402 -13108 -20210 -28784 1087 25161 30222 34346 18796
15267 18796 10515 -11298 -13996 11479 18499 12272 3726 21882 39747 26751 22573 11498 -18805
15254 -18805 -15375 7383 17557 -5105 2997 8778 9890 4784 5817 15788 9256 17453 10365 10718
15240 10718 1190 -6460 712 -4954 2677 -3531 -4161 24889 22943 20054 31288 13980 1335 -9713
15226 -9713 -9622 316 8013 9012 22192 42660 17681 -5777 -1615 7148 4270 9742 5542 -1724
15212 -1724 -22247 -27144 -31238 -22430 -7405 15245 15070 11039 10313 -4525 -6537 -19190 -20026 -34757
15198 -34757 -42438 -28044 -13218 -16420 -25359 -27804 -24118 -36155 -37943 -24366 -12201 -21703 -20592
15185 -20592 -16320 -21257 -8209 -3562 -2408 -11495 -6778 -23275 -31874 -23778 -23787 -22626 -7976 18832
15171 18832 20970 586 -2724 -22267 -10056 1910 19407 19311 22757 25296 482 -6262 -14157
15158 -14157 -14426 -18918 -106 -11952 -44392 -24180 11918 22246 27220 25425 24006 15969 23825
15145 23825 23904 15449 -18008 -32591 -6109 22774 32626 22472 27392 23754 22883 5885 -17741
15132 -17741 -33698 -40083 -17692 8609 17036 -2586 -19413 -9934 10651 21559 13515 -14567
15120 -14567 -33854 -33832 -21874 -18649 -12316 -17937 -23939 -5068 -13064 -20416 -21729 -21153 -17817 6351
15106 6351 24644 20718 -1905 -4115 14066 14323 29938 30404 15312 4164 -13190 3509 19376
15093 19376 37586 21746 14509 18088 18511 23565 22237 5867 3440 108 9956 18752 37983 24553
15079 24553 13518 18655 32468 42071 28887 6814 -9904 -8098 3935 -3860 -13794 -2602 -11963
15066 -11963 -7558 22093 29959 37313 25419 12735 5506 18281 2626 -3551 -1069 20014 19372
15053 19372 10624 14510 12153 11010 22853 18990 8217 -3302 -20413 -18976 -6261 12845 4002
15040 4002 8703 -1565 -26824 -40674 -36523 -8047 -8481 -18772 -35705 -12957 -2673 -13896 -30493
15027 -30493 -50970 -59938 -36479 -16333 14383 15791 3277 3093 2803 7547 12958 3094 -24228
15014 -24228 -15986 -14335 -16540 2337 -6663 -5523 -8441 -8404 21249 35640 30512 -4382 -35736 -24283
15000 -24283 -18807 -15807 -5100 -5234 27197 20202 11023 15093 30671 22154 10399 8451 -6049
14987 -6049 11804 13907 13636 -5806 -15984 -7684 -598 19343 18793 -14695 -24863 -29798 -23716 -3543
14973 -3543 -3367 168 3454 -13549 3610 10709 4721 -15752 -16921 -28584 -39689 -37211 -17147
14960 -17147 -6989 5535 26541 19672 29927 40679 26300 14540 20333 20703 29013 47154 46461
14947 46461 17990 12686 10120 3271 -14713 -24438 -20787 -18500 -33150 -24330 -11417 -27580 -19662
14934 -19662 -11591 -29826 -38701 -35746 -36209 -45143 -37684 -35601 -16457 -15203 1218 3416 -10868 -19756
14920 -19756 5958 12874 -819 -875 -9758 -10417 -14554 -2182 1123 -23959 -28683 -16036 6235 17699
14906 17699 1593 -2924 -16570 -19673 -23305 -27091 -34364 -26114 -33975 -29413 -32926 -25115 -10770 -12639
14892 -12639 -11545 -24973 -37728 -40172 -31283 -24927 -21144 19657 51061 49311 11518 7129 13311
14879 13311 4414 3655 27549 30579 19536 5404 13415 27489 12947 26105 30949 30388 26560
14866 26560 37894 44450 32038 1517 -3484 -12428 -6629 -1974 9162 12742 17176 14149 5050
14853 5050 -13881 -24682 -20078 -16898 -9821 3925 -284 14025 5876 12860 6682 -5526 -7645
14840 -7645 5229 10718 3319 -7445 -6320 -9903 -17579 -27871 -41331 -29526 -17862 -34970 -26917
14827 -26917 -14110 -14529 -3654 3639 11410 -2132 2722 12840 25107 30492 34120 39414 33542
14814 33542 21984 9571 14607 19937 19376 29282 29078 38611 26202 7053 -401 6438 6635 -788
14800 -788 7084 -12291 -18131 -7089 10505 11774 23839 34061 25572 5594 4873 3627 -9464
14787 -9464 509 8726 518 -14685 -14044 -5037 18935 35317 23808 18797 6829 -6262 14004
14774 14004 24562 11393 -8152 -28141 -25889 1753 14565 24067 19942 -1169 -5534 -14043 -3595
14761 -3595 -1022 -9029 -17722 -5002 21628 63437 52897 40107 20693 13624 -8363 -27189 -19369
14748 -19369 -3008 12312 22836 22389 8255 1127 6391 18105 19760 5951 451 -28280 -8554
14735 -8554 24504 22139 19066 2309 5746 22552 14147 17457 15125 1579 12869 19336 7429
14722 7429 1512 -474 821 -2880 -10649 -23803 -24046 -17431 -8426 69 -1678 -14655 -27247 -28517
14708 -28517 -4183 16867 26094 26757 37486 17861 18051 44672 37467 9164 22912 22495 32316
14695 32316 34180 16157 4495 14932 27080 22281 12615 21236 16275 -20167 -45513 -46250 -35976
14682 -35976 -21241 -16849 -3062 -367 -24259 -31089 -23126 -27071 -18905 -24039 -32497 -27296 -8505
14669 -8505 15148 25476 26746 1516 -12569 -1915 3702 1636 -15895 -17485 -18394 8681 8668 -1592
14655 -1592 -8519 -27226 -26617 -26304 -30571 -8299 7233 2095 -2405 -14873 -21748 -14321 -19051 -1458
14641 -1458 -2849 -5678 -20320 -16368 9026 17053 25506 25315 36105 38757 18001 9336 10052 -865
14627 -865 13417 25439 36033 17627 -4202 -10432 14225 20167 4225 492 -683 -348 10327
14614 10327 15612 -3595 -11303 -1514 7626 5583 237 -12654 -11418 -1407 24941 30854 24402
14601 24402 12018 -4823 -10591 -9098 -304 996 -15098 -22579 -28272 -28440 -27065 -31406 -12346 2000
14587 2000 3709 2712 10967 18624 7058 30550 40544 40409 31005 31481 52891 41136 15721 7464
14573 7464 9395 25416 22730 18229 35500 26712 25325 38268 35555 49969 54302 51088 31056
14560 31056 13507 19624 31369 18900 38659 25451 35096 24595 6880 7519 8369 17770 19159
14547 19159 9570 11636 11133 16192 14964 -8775 -7934 7766 26858 28439 29836 27978 34336 28878
14533 28878 13293 18056 10677 9101 30841 39948 28326 22449 32372 22137 23434 12368 5288
14520 5288 15653 14582 3416 34800 31417 19197 12820 -5967 -12178 1076 -7186 -4041 -15262
14507 -15262 -658 6761 -1126 -9495 -21918 -15302 214 7130 -7517 -1285 -1485 -6449 -7812 -7401
14493 -7401 6901 9954 6935 17678 3135 -16566 -28898 -27353 -23029 -30331 -18231 -9053 199
14480 199 10000 4207 20670 23590 21493 21709 3736 -10663 -21505 -38684 -33907 -18876 -20711 5201
14466 5201 17759 48900 71753 43723 6911 -8811 -1513 -16281 -20838 2447 19969 9670
14454 9670 13416 21036 -4910 -30188 -34766 -27279 -7247 14532 25203 48771 33489 28535 29942
14441 29942 8434 25688 39510 31872 22829 12380 3197 12434 14396 24695 14300 4942 -3330
14428 -3330 14217 22735 26011 29525 25859 6201 3621 12792 16801 26944 37919 42658 13676
14415 13676 22440 40581 38785 32395 5965 -11235 -5266 -18871 -31296 -27293 -20590 -31283 -32390
14402 -32390 -3152 4221 751 10976 14649 34169 30463 24401 13763 16310 36474 50808 51525
14389 51525 31357 15112 -2584 3587 9577 12190 -5998 -11957 5592 2854 6321 12051 12052 22535
14375 22535 29959 35179 27327 6970 -9734 -26581 -19951 2470 21398 17347 1802 21499 26369
14362 26369 8888 -5882 3404 6979 16803 4634 3298 -12111 -23289 -22421 -634 -9508 -15816
14349 -15816 -9662 9803 8496 -13632 -45364 -29395 3130 5550 4324 18183 29655 7960
14337 7960 -7376 -10681 -5372 -2216 9901 25253 6911 8853 4764 -510 8215 4263 1012 594
14323 594 1554 14883 28419 15051 28288 21141 -3310 18362 8901 -258 -5958 -19271 -10488
14310 -10488 20271 37247 29973 -117 -11000 -22649 -44005 -38821 -15765 1169 2900 4180
14298 4180 -10652 -9408 19717 32176 12403 -3614 -5015 6254 -4688 -20430 -16760 -8147 -9268
14285 -9268 -4598 3415 1828 479 9419 30782 17713 777 3651 -2327 -2783 11433 3693 28
14271 28 428 2588 -3370 -8544 -10109 -14752 7794 22228 37765 20995 2157 -6707 7809 157
14257 157 -11924 -4219 9115 26448 33640 34458 40625 51163 53920 49920 45720 44456 35862 10425
14243 10425 -4308 -5236 1183 -12362 -853 3205 -3185 -13228 -9957 -14460 -8114 -5476 9158
14230 9158 25499 51009 43477 9824 -6407 24697 30211 32699 38801 14386 22999 24102 4094
14217 4094 1613 10187 37503 29924 3225 -528 -1685 -6625 -24720 4113 14198 9333 8834 4435
14203 4435 4221 9137 -3905 -2148 17421 11324 5796 30126 26388 26934 12230 4092 4865 10527
14189 10527 21822 19297 30687 52970 55432 32791 14731 13449 6462 -23483 -34985 -17182
14177 -17182 -5712 7587 694 -15303 -7937 -39760 -24807 7465 20578 6058 -18912 -24258
14165 -24258 -16503 -7428 -10268 -21692 6185 12126 21651 34062 26129 20067 7609 -4430 13679
14152 13679 13807 8371 14609 13865 20027 8870 -10580 -567 7323 -7424 464 7418 -3178 -2406
14138 -2406 8107 14075 26292 36202 16917 4734 -1090 -7539 5094 11105 10191 21244 21449 19867
14124 19867 20211 39625 24617 7378 9386 7456 2181 -5384 7900 33201 23021 2031 -3377
14111 -3377 -2912 -2230 17151 36296 38237 46463 41413 29743 31602 37435 44028 25782 11854 -7201
14097 -7201 3574 11461 5858 2457 -11438 -3461 25532 36667 17255 3534 8648 18634 14392
14084 14392 2099 -9094 1823 -7388 -27952 -37074 -18873 -9735 -8194 -1453 12477 11820 14557
14071 14557 19097 9764 -12553 -17066 -7657 21388 34019 48631 41818 29179 11418 -11719 -30254
14058 -30254 -39691 -35145 -26538 -18617 -15615 3232 16649 20645 34089 35147 22396 16287 44229
14045 44229 42569 25006 11828 12602 -16579 -41293 -14646 6907 3974 -5702 4214 35651 47387
14032 47387 42350 21870 25124 25990 29829 19495 21492 6047 -9524 -3911 6521 28142 43130
14019 43130 32951 7033 -14756 -24848 -9673 -5218 2661 -168 29186 39902 28248 -11897
14007 -11897 -15593 11453 12410 24067 15613 15834 13984 26385 19442 17432 5752 -7880 11928
13994 11928 39330 28023 22456 8919 17075 -6082 -17748 -13163 -440 6430 6744 3439 -10678
13981 -10678 -5508 9068 14480 29 -374 -8565 3518 30931 40602 26210 39453 53071 47641
13968 47641 23837 27602 35905 28086 30713 14202 10323 10965 27150 25724 17667 11697 8046 10252
13954 10252 5503 13171 32084 26281 16539 12196 27890 25973 27277 43740 37471 12745 -3233
13941 -3233 -11395 4286 20596 7020 7694 -7437 -14073 -32018 -23306 -15945 -448 1720 -8624
13928 -8624 19626 3988 -19360 -26069 4679 5888 4730 9161 32421 46426 35119 19648 4763
13915 4763 -20262 -30287 -23493 5209 38794 21341 46 -6229 -21025 -27613 -25388 -19783 5150
13902 5150 6323 16719 36388 51362 51057 42236 40957 34082 34415 19223 16198 33410 35438 40885
13888 40885 57492 70436 49350 17648 -2343 11768 31169 31396 17262 2330 -12344 -38373
13876 -38373 -38896 -11615 18104 11905 -1658 6553 10622 5283 17329 30485 43174 50317 53076
13863 53076 50835 23360 -1245 1060 14769 25072 25773 8991 1156 -10085 -12807 8781 39575
13850 39575 23269 26769 22681 21896 4202 -19845 2659 21589 13389 32112 54819 30828 2070
13837 2070 -8401 -2170 24425 23756 6370 -1574 3450 12784 29176 17490 -308 -14380 -22023
13824 -22023 -10849 6470 25157 13258 -645 -2558 -1125 -15632 -22348 -15545 -1063 29048
13812 29048 10112 -11996 -9005 15933 21367 9497 7339 14483 2634 1460 18255 3875 -12296
13799 -12296 -10255 5000 -1030 20333 26503 5519 8106 3838 10345 6866 11304 11790 5150 15606
13785 15606 18844 11625 6713 1780 3435 17800 49118 62224 60589 54439 22492 9333 2003
13772 2003 -9275 -30724 -19220 -210 21949 41098 64296 63188 41653 26972 21921 4518
13760 4518 -24683 -23422 -10059 5707 9885 22855 29925 9974 1951 22127 54289 61538 45104
13747 45104 23340 26041 19464 23418 36964 29539 32759 30684 25322 14599 25240 26744 23187
13734 23187 45561 43822 17441 16509 17578 12110 14312 3776 8502 12359 14382 3359 -7545
13721 -7545 4122 15232 37726 31755 23069 31199 44543 36994 15756 12236 33115 34255 34840
13708 34840 37203 41066 44318 54079 47873 11099 -7728 2987 20534 22372 23548 35225 25922
13695 25922 23894 20246 12268 7566 12981 4671 30482 43518 51224 74248 40825 34356 58341
13682 58341 46203 35855 42871 44737 52300 40452 32552 41142 33876 9484 3 17625 38533
13669 38533 35235 3526 8146 9572 2038 9377 23739 48783 48715 32106 27807 28255 11991 15753
13655 15753 27167 25929 38768 15303 18011 42276 77172 79254 45910 40754 54216 58627 25999
13642 25999 21825 -5391 -10500 8163 4065 -16671 -22012 -12924 6198 23342 12196 11458 17800
13629 17800 19807 31241 35540 25177 20612 23182 2469 9628 14609 2576 8471 20922 38132
13616 38132 27290 26518 33357 11526 16696 28060 30685 35833 31326 41893 41185 44989 45236 50477
13602 50477 35521 12926 25610 17950 16968 36673 41497 26706 14712 1100 9677 27293 29450
13589 29450 15589 23149 24659 24594 38923 66843 59838 40793 36802 39842 30822 38589 25449 6436
13575 6436 15014 4134 11607 14352 11952 26252 40327 34153 21108 20655 13089 15139 19233 24933
13561 24933 29978 16767 11192 14669 9020 10977 16833 26423 10485 -13001 -14474 -5077 17546
13548 17546 12687 8768 2650 -4808 -10877 372 15148 41818 53946 41566 21322 39010 34655
13535 34655 31558 35449 38877 31949 24432 34372 58760 63422 58832 38258 40364 35431 36569 31883
13521 31883 30805 40838 39154 9987 -13685 -12618 -616 8705 24015 33825 48030 70746 56621
13508 56621 48601 48960 22798 19295 28244 28544 19928 36522 53505 43726 35682 21255 11127 23338
13494 23338 12562 6759 6358 12896 20384 26626 29678 22700 38605 20501 -5759 -5954 -615 41000
13480 41000 61036 40378 6552 19127 36011 17868 8041 -4867 -10369 4226 34254 37998
13468 37998 39022 29202 15759 -6641 17486 34388 27261 26460 22439 26150 21225 20984 20948 -6358
13454 -6358 -8313 8653 9851 20283 28125 29561 16989 5812 8595 20186 9612 18023 22054
13441 22054 29572 35850 45716 70741 59443 47448 43832 38753 42622 44393 30820 16048 31446
13428 31446 33567 37106 47785 59485 50260 39805 49926 52895 41556 42492 43363 19536 13305
13415 13305 23010 25468 24794 37125 44880 28517 17958 38115 34539 21137 15405 36581 51139
13402 51139 40379 19922 16108 8061 15811 21887 39530 15625 -6044 6489 27608 28047 30072
13389 30072 45090 41585 18120 24356 46426 83681 72575 77820 80097 75815 75545 72152 80116
13376 80116 93396 94073 103012 97312 76581 81926 74002 76561 118007 172521 205253 252062 339165
13363 339165 469417 710407 1121756 1651090 2003664 1988879 1712786 1260186 869540 618860
13353 618860 457991 360003 295793 233883 189796 166880 146228 123503 115645 127075 125698 106793
13341 106793 102494 96360 76852 68578 57661 62792 79442 76259 53864 67832 61798 40468 17022
13328 17022 10268 15446 35256 57037 59612 61349 58922 31905 26316 23442 7495 -250 7692
13315 7692 33460 28881 14247 18110 29510 39593 47509 45870 50838 61627 55056 34097 40942
13302 40942 51415 28157 18547 26769 51416 41379 47601 53613 62048 54907 46558 40150 28166
13289 28166 31014 42006 26436 21048 19374 23118 32769 24340 17117 16837 8400 7263 33072 49106
13275 49106 49557 47318 52299 31492 31485 54476 70558 55791 44322 48437 49860 34577 25752 36488
13261 36488 50289 27310 34793 37907 40106 46948 34982 17342 51153 71637 52978 57565 77007
13248 77007 91060 70903 39859 -8779 2033 22032 27788 32745 27687 15002 31551 61283
13236 61283 67593 73603 96966 91072 80104 67432 64498 57480 65569 74027 76611 42457 24249
13223 24249 30540 37263 56940 49246 54300 49690 37991 23244 14480 17078 20411 19356 19908 8600
13209 8600 7932 5034 12279 30244 44200 33919 28035 23152 5199 1952 -6871 -14487 -7933 12618
13195 12618 27413 47959 69863 73264 78238 59933 44547 41940 37269 23188 19422 15322 15297
13182 15297 37137 47568 39749 26008 33895 43185 41154 48742 55237 41799 46520 45512 57394
13169 57394 70319 66545 104540 126515 108568 93182 91176 91569 86679 106673 90028 73711 63796
13156 63796 80309 75266 87185 135774 173947 202759 246283 272377 293150 327794 302747 240915
13144 240915 187021 162206 135345 134109 122478 124699 119547 124509 121630 126003 112471 81769 58964
13131 58964 52376 31177 39242 83714 95314 111197 115866 109914 105583 108005 108559 108087 99905 114479
13117 114479 109093 84745 55637 50287 71996 72074 84703 86337 71120 54692 75855 93174 86940
13104 86940 87526 78206 55987 29420 30059 33372 79090 98892 108911 131360 114369 88444 79339
13091 79339 103203 117595 123081 162075 213311 228054 212525 188915 173090 158153 135649 94677
13079 94677 84133 83520 73312 79442 89304 80504 94078 108347 97605 61470 63540 89995 97041
13066 97041 83158 85127 92891 114663 130541 130623 120091 120931 110028 102506 90748 71343 50518
13053 50518 37540 39567 78701 105134 133184 158639 184722 177639 175876 180051 162900 154704 174804
13040 174804 186181 206800 206575 203142 220397 239494 234023 217160 212107 219632 246165 232333 197624
13027 197624 208534 253464 276860 305246 362249 419596 466390 461935 368954 257585 215328
13016 215328 189441 189008 217441 239279 249632 257565 265825 270548 237100 213492 226686 256965
13004 256965 276945 281403 302575 309987 309632 308581 296600 284454 272666 252195 250321 253196 246046
12991 246046 238186 249215 271751 273044 270753 251895 245872 263645 272356 282699 283398 325250 339729
12978 339729 354627 362282 372462 372004 370258 391170 413381 416420 422927 425845 412455 401702 386490
12965 386490 399564 414122 412219 404834 416727 429235 427449 436372 463564 459558 440961 461402
12953 461402 480715 496099 502780 504784 534080 582657 613619 630049 649679 663504 691278 755832
12941 755832 829795 894764 960791 991142 1006204 995170 979054 972038 1004388 1043416 1081055 1145513
12929 1145513 1242528 1406246 1587526 1747120 1875388 1923958 1945994 2021083 2160943 2370151
12919 2370151 2594021 2833644 3118336 3438606 3766375 4106677 4510214 4978504 5610125
12910 5610125 6468662 7706711 9440364 11468175 13468055 15523867 17818707 21011057
12902 21011057 26062352 34135568 47340192 69974860 110612912 181177055 283118740
12895 283118740 371291174 387826798 346287438 258310316 168174417 110423115 77154390
12888 77154390 56839607 43601919 34589874 28344988 24069116 21097623 18759319 16606703
12880 16606703 14497965 12410263 10562045 9037890 7785196 6741592 5861084 5152188
12872 5152188 4641536 4216770 3828636 3503978 3209623 2923303 2647779 2351388 2076378
12863 2076378 1886417 1781447 1726147 1679402 1614712 1540256 1461780 1345479 1248906 1152675 1061519
12852 1061519 936757 826221 771351 712758 663603 657834 670161 665538 662043 633219 611031
12841 611031 611487 608018 569259 541251 508975 494646 470014 443001 431428 421743 397652 386140
12829 386140 370810 355785 318956 293691 265738 250258 258479 254576 232669 203199 188775 176839
12817 176839 161230 155317 154158 159962 160838 156806 166137 190951 153963 139785 143374 141456 148468
12804 148468 164349 158728 161645 148167 124206 105462 94050 102527 125107 141135 124280 123911
12792 123911 115779 98974 74028 50889 47351 41520 45192 46382 52373 33502 31502 45946 44956
12779 44956 46250 56302 56346 70006 94422 120435 128678 99178 98360 117849 72595 754 -57325
12766 -57325 -73962 -39725 18854 49285 38102 32340 31198 27914 50141 64307 41785 28548
12754 28548 12029 -3862 -24845 -37832 -29009 -12818 -1665 -27870 -63254 -57385 -32706 4878
12742 4878 -4323 -18769 -15487 4095 39356 65787 73735 75749 43432 13068 1875 -5040 -6967
12729 -6967 -7102 11325 11606 13920 19857 20379 20250 28334 24747 21299 20424 15897 15550 37039 57649
12714 57649 51677 60784 62936 68442 66817 37377 -12988 -39958 -60785 -68347 -92044 -121243 -121769
12701 -121769 -115894 -109062 -59745 -29498 -23487 -9035 -5810 1694 9434 10927 14473 27419 42195
12688 42195 28933 5093 -590 -1333 -5088 -14449 -4958 -11271 -21716 -24296 -41788 -32042 -14973
12675 -14973 -8653 -7171 2144 -11073 -5365 -9765 -22760 -28967 -49526 -46378 -56668 -61435 -51946
12662 -51946 -43423 -5552 -1496 -5427 -4497 -10165 -6358 -3442 12057 19258 12277 -26272 -52752 -58278
12648 -58278 -53778 -45455 -39238 -12545 -77 -5577 20902 43364 32396 18945 7164 -5267
12636 -5267 -22458 -9037 -5116 7745 -4465 -11331 -19020 -26186 -34091 -36875 -53256 -69441 -77198
12623 -77198 -57267 -40152 -21920 -15876 -107 12501 23274 18150 1510 5174 8782 8097 -4911
12610 -4911 -12867 -7649 13795 -6712 -30864 -29723 -6113 2708 -4633 -4100 -5066 15799 11899 -10134
12596 -10134 -26270 -39205 -51005 -35356 1749 41744 53070 18861 18785 34112 23430 27079
12584 27079 39174 37783 59383 45165 20241 4355 1975 4017 -5855 -12400 10840 42889 55265
12571 55265 38489 28810 27474 2789 -18846 1541 15275 13008 2947 12047 10675 -9935 -10677
12558 -10677 970 14424 28260 10817 1665 2709 15785 30166 22102 7080 15107 28855
12546 28855 16899 20816 9370 14839 9377 16138 22151 23091 26756 26029 9842 12085 -5832 -7251
12532 -7251 5477 13402 9114 -5305 6083 19940 20846 6349 -16073 -17286 -9661 -19779 -23774
12519 -23774 -3166 13537 22875 7742 6815 -6301 -15318 -12137 3293 -6353 -12163 -7638 3959
12506 3959 -6922 -11975 -3849 19330 27068 25169 28449 12313 4958 3669 7399 -13602 -13425 -15603
12492 -15603 -20359 -21840 -13218 -4625 -14951 -6600 14768 27513 15346 431 4318 11764 17404
12479 17404 3557 -2722 -14300 -7877 -7410 -20618 -13792 -6591 -10122 -17574 -26872 -37133 -42769 -33936
12465 -33936 -21757 -9107 1115 -781 -14345 64 -11317 -4403 12129 20810 5092 -23477
12453 -23477 -8085 9138 8721 6958 12074 6229 -3530 -670 15004 34090 39468 14179 7382
12440 7382 5421 11998 19515 15280 5947 15381 41086 41566 45742 73372 97693 127906 197736 301882
12426 301882 475898 817936 1315172 1798388 2008108 1907842 1520254 1028630 677118 469839
12416 469839 349340 273452 222807 182391 155355 123486 109417 110310 88258 82230 69771 65673
12404 65673 61706 38262 35345 35143 27012 24419 52950 46767 22310 24976 18249 6544 4104 -9636
12390 -9636 -17627 -22613 -22082 -6149 13871 -6646 -4196 7129 9802 13685 22207 20087 19484 18021
12376 18021 -4564 -867 -9425 -15420 -2587 27022 64774 63454 44723 41885 33055 19527 19943
12363 19943 13286 12570 27253 29644 17075 -8929 -19962 -11317 -8329 -5824 719 7643 183 -15706
12349 -15706 -37035 -24010 23321 8434 -14429 -13029 -2798 11115 8066 23143 24180 5673
12337 5673 -22486 -17392 108 7618 7298 -17769 -1490 22598 40114 23698 -1656 -14084 -10549
12324 -10549 3357 -1354 -5293 -19010 -24705 -22281 -11269 12281 -920 -14079 -21619 -11053 -12137
12311 -12137 -16978 -15314 -18206 -4209 -16817 -26169 -17383 -1748 13340 20730 18307 12156 -1436
12298 -1436 -268 -15628 -37876 -33395 -16870 -15292 -16867 4029 -3210 -16933 -33716 -30694 -24360
12285 -24360 -9053 -6276 -11213 -22382 -22656 -8826 23627 28369 7291 10001 4120 -8190 -1220
12272 -1220 -4140 -9718 1359 -9564 -28276 -18413 -23695 -22464 -7941 15526 20828 20918 18274 -1185
12258 -1185 -12251 -8859 -12393 -7532 10805 20952 12241 217 -8044 -4360 5618 4970 1932 11001
12244 11001 13771 6848 3087 -8340 -15548 -9350 2829 20879 19423 21285 30135 3049 -15842
12231 -15842 -29411 -24230 -20649 5721 5209 16634 9927 -3305 -5713 -15819 -30821 -12196 2349
12218 2349 5193 13312 6919 -546 -9880 -11009 -7977 -2439 -659 -21040 -41493 -42560 -58262 -40956
12204 -40956 -36565 -40218 -25322 -8090 9402 9076 5272 -4199 10721 22484 8338 -5126 -1720
12191 -1720 32937 35488 33445 16723 6783 633 -3608 10427 -1919 -15740 5326 3838 3883 -7643
12177 -7643 -18390 -2599 5721 6509 -8858 -16692 -10380 -707 20377 21580 2043 -739 14460
12164 14460 16310 36610 25263 5210 11585 26017 41976 30319 11672 21770 37208 38972
12152 38972 23268 14455 11131 -1820 -7546 -686 33693 60565 55521 60767 65428 83987 112761
12139 112761 128292 144825 167904 216152 330896 503086 792021 1347972 2357193 3728204
12129 3728204 4525098 4354610 3551669 2310960 1415133 899727 614981 466982 361218
12120 361218 296975 249746 210407 196438 177113 141273 127084 106487 88595 83217 72291 53506
12108 53506 45474 38770 32798 26333 16523 23785 20825 25576 40095 40109 31514 -2962 992 6410
12094 6410 8717 5605 18252 22047 31068 21803 10371 693 1829 10334 13971 19816 23195 22344
12080 22344 20044 24212 38804 36620 22765 16287 8911 8313 -1440 8633 30740 45817 44468
12067 44468 6054 15510 16455 21659 14217 1659 -6679 -29269 -43007 -24632 -13180 -21 -469
12054 -469 3832 12552 -3575 10938 32794 26229 16603 -13922 -2251 19590 17468 28069 -604
12041 -604 -4997 -9909 -7643 6506 13261 3986 -5713 -339 -10146 13687 33652 34350 9690 -24190
12027 -24190 2464 10670 18068 47380 28963 22330 36651 31857 41536 38527 20886 20185 19975 19132
12013 19132 16936 2096 8853 8777 -12329 -18170 -11341 -9742 3616 16608 21946 -4973 -15631
12000 -15631 -7758 -15675 -16975 -11862 -5864 4259 27842 7309 -36029 -64729 -60727 -34104 -21309
11987 -21309 -19148 4829 13041 16785 22142 13251 5730 9926 5164 1256 17706 24653 31547 36742
11973 36742 22830 8233 -11431 -34204 -47073 -46524 -23155 -3319 -17725 -9294 9231 30341
11961 30341 21391 11817 16785 37436 49808 48775 63401 41801 30291 38841 44934 28459 338
11948 338 -25755 -25158 -5377 7599 -14644 -12730 -8315 393 16751 6055 -17613 -21460 -23323
11935 -23323 -1897 27554 20092 13107 14219 19326 -484 -33832 -41218 -43973 -25673 -13236 -7254
11922 -7254 -5304 -8071 -7362 67 17281 23529 32357 37648 37896 57992 66662 58061 31880 11141
11908 11141 -891 -84 1633 3456 -8616 -13013 -8313 4245 21978 19396 30938 44204 40191
11895 40191 28956 7232 9020 18898 5064 -4460 1527 12447 7472 -2266 -3860 4259 12096
11882 12096 34111 46485 51107 50432 27549 21665 35168 34906 18181 24936 18597 -9935 -16379
11869 -16379 -10 4007 -16710 -18310 2120 7663 -4092 -5964 -5644 3874 28786 50437 40756
11856 40756 14057 18639 13373 9518 -1763 -19631 -19752 -19093 -21690 -17953 -16914 9308 44767 53507
11842 53507 52857 35775 45452 43922 40117 43188 30139 33332 43627 36915 21567 34661 39917
11829 39917 34428 24542 10526 20592 47525 59418 56169 45071 68237 52591 33851 21544
11817 21544 -3765 -4836 4081 16863 28405 22206 27462 33571 56052 62459 44880 18994 9764
11804 9764 -5386 -20795 -5638 16222 28928 23598 4112 12651 30101 33806 25973 29461 21703
11791 21703 44499 67843 57780 25326 -2767 -21036 8045 14148 4141 -6550 17504 36918
11779 36918 44142 31871 50371 58625 52406 32212 22068 27966 57638 86892 95957 76636 42302
11766 42302 46903 48532 55517 41547 27456 37819 44817 37366 23620 27654 30168 37534 41597
11753 41597 27042 40019 24635 13386 25378 29825 54861 85137 100778 86568 79349 80752
11741 80752 74462 69327 84809 72616 63000 70586 75884 81585 68196 42839 37865 38732 33126 44444
11727 44444 59391 65870 61158 63888 59127 45525 52490 76467 89029 82943 76466 67578 63983
11714 63983 54670 52084 66457 70846 49028 59142 85091 88064 88960 78346 78772 99657 90952
11701 90952 60042 51435 47587 25930 21356 13259 30382 34810 50416 29726 2660 17931 20805
11688 20805 16424 22690 32802 34277 43666 36030 40840 46173 40933 43251 56111 60958 69978 80657
11674 80657 69036 69504 55168 39939 41382 51420 71995 73932 64443 50770 72917 98348 82852
11661 82852 88373 94892 93256 89109 98778 92782 81919 92445 80337 78071 56881 31125 25565
11648 25565 19701 29410 65107 79085 64346 51404 56058 61470 69131 65938 69664 62761 72392
11635 72392 82975 95117 104518 96982 88723 94057 116996 100675 105074 118340 97038 80414 86821
11622 86821 70513 55725 42948 47550 58620 61887 67507 83373 80945 78593 93436 111128 111861
11609 111861 108495 90440 79361 83049 80148 74774 69964 70868 55095 66697 80480 79295 77259
11596 77259 66598 72119 89962 97437 115670 113731 103721 112875 125438 121444 128921 123871 121702
11583 121702 119950 108264 103189 103356 112019 124734 134501 134029 148890 133459 116991 123755 116835
11570 116835 86029 80104 94242 99701 84802 85556 105585 123189 138839 131406 138658 147916 163511
11557 163511 154539 131917 110047 91426 79684 99569 106996 93746 102630 93195 91719 101848
11545 101848 116078 115213 125899 134266 102133 80391 93667 121635 133274 113592 111301 103279
11533 103279 99700 104479 127184 143256 136641 117986 127121 136076 141756 147747 167982 170815 162205
11520 162205 149941 171991 168947 148601 155810 157548 173235 179723 202579 192923 184514 179877 175089
11507 175089 170312 193369 200794 180543 165438 173479 186667 191620 193671 183919 179541 170411 158335
11494 158335 158507 167752 179420 201577 216154 217718 215094 230170 233259 227593 220311 212153 217428
11481 217428 217234 225525 251845 253007 245175 239980 229658 211951 216806 203580 194471 199460 227592
11468 227592 227309 195392 194857 187855 210069 214130 220352 220455 215425 227549 223984 225889 267894 295144
11454 295144 288350 296532 319066 323044 308434 303417 317517 332041 322069 305709 306382 311838 309685
11441 309685 318817 318269 332633 342831 343952 347481 348634 354891 338647 320810 330046 349737 337764
11428 337764 331662 326170 332502 324487 326131 338311 359771 386463 392385 383938 380997 379764 359634
11415 359634 349178 369486 386675 391348 395034 389192 413770 424692 431305 417939 398577 408851
11403 408851 425711 437122 442055 437945 435170 452807 479927 476123 447187 437191 450340 479691
11391 479691 504962 516438 503667 488564 494099 501601 517407 534815 550398 578563 607740 600105
11379 600105 588826 593725 604894 620819 648012 677891 689383 668261 666567 652088 658476 689450
11367 689450 701135 703073 693288 692809 704596 713267 715672 724721 743068 757020 744956 762037 774941
11354 774941 794653 808603 828060 832242 876779 895274 889318 901484 905901 904689 929608 967042
11342 967042 987621 989843 988309 1013056 1022959 1052123 1078739 1106287 1117158 1107228 1119386 1140915
11330 1140915 1164521 1185421 1206772 1211505 1222994 1227232 1220278 1275982 1323287 1323582 1335302 1363675
11318 1363675 1387207 1404598 1443469 1479927 1490061 1516022 1546292 1564734 1573198 1604179 1642891
11307 1642891 1663005 1679573 1700104 1746800 1779538 1817356 1842518 1860937 1897397 1947555 1990501
11296 1990501 2008315 2024599 2036542 2062694 2107375 2146424 2170988 2187361 2208264 2258917 2290409
11285 2290409 2334257 2356239 2375322 2396795 2432862 2463931 2500868 2525437 2548595 2588336 2621674
11274 2621674 2645933 2668592 2694177 2733509 2762802 2788497 2811468 2841546 2868372 2871257 2887172
11263 2887172 2902351 2896702 2919698 2949120 2962063 2964972 2944769 2933196 2946039 2975951 2992523 3017873
11251 3017873 3008097 2988603 2991126 3011821 3029237 3014889 3003402 2968705 2966938 2956279 2928574 2897028
11239 2897028 2881617 2877484 2868213 2847045 2807987 2761356 2734073 2722760 2718490 2695722 2661404 2626016
11227 2626016 2589489 2557677 2545227 2540944 2520541 2483925 2450611 2411961 2401946 2375491 2332598
11216 2332598 2292679 2255490 2229602 2219082 2213421 2172502 2131661 2096337 2065323 2024780 1983660
11205 1983660 1959482 1929943 1917687 1899189 1847776 1805844 1797261 1757760 1716100 1680954 1663309
11194 1663309 1629384 1590446 1569389 1574673 1566473 1532144 1491458 1463291 1426391 1406455 1398384 1378858
11182 1378858 1349641 1328564 1304455 1285767 1283850 1272705 1239037 1211635 1190735 1198662 1194725 1187230
11170 1187230 1141010 1079354 1054014 1025722 1008647 1010257 998123 972576 959828 969292 971173 959511
11158 959511 949342 946726 944981 923497 918727 889564 848974 837374 814205 802299 798893 774398
11146 774398 771930 790752 799667 777221 732900 726849 721533 711525 677893 647128 667330 683109
11134 683109 666088 653819 652649 660271 650418 629092 620733 606393 573718 566716 579205 569489 559356
11121 559356 560877 555302 529880 532615 551691 525253 518705 524361 536445 527509 509211 486776 455467
11108 455467 444141 453714 456907 439818 417584 423197 410753 399371 398092 418552 443405 439636
11096 439636 409656 408367 404498 412351 407606 407247 406375 382429 362610 370530 371162 353083 363077 367970
11082 367970 357457 350519 344217 348784 348530 376575 359136 323669 317422 330854 331893 329610 320963
11069 320963 322308 335947 337324 298686 282881 275375 274709 296578 297139 298769 308417 292991 263938
11056 263938 261339 257894 250398 234318 233789 247822 240800 264432 268822 247735 248455 259965 260113 268599
11042 268599 280017 271385 232608 226505 218004 213796 212450 214626 226723 234766 229844 225166 228238
11029 228238 244419 259531 252052 238443 238543 239470 227161 214517 182005 175040 175442 166709 153864
11016 153864 160207 172013 172842 162450 169471 182712 197697 201855 182350 172588 183972 187060 175685
11003 175685 161004 166339 170228 155593 166766 165555 161458 172910 182526 169397 151489 140744
10991 140744 154997 168198 152346 152194 153526 130006 136595 157755 152203 157508 174988 170223 153939
10978 153939 141052 133101 118463 121243 135385 126890 108360 103281 120441 139804 137760 97591
10966 97591 82143 93860 78936 69342 79302 94349 84914 67056 86366 105672 118931 125168
10954 125168 118220 101109 108967 92183 100610 132543 118180 110681 134622 132215 126460 121477 121196
10941 121196 117075 108284 103653 100714 97884 97604 88900 83248 76893 82588 87232 100855 111040 90647
10927 90647 90352 107776 98534 94284 102235 120152 137928 130448 100367 89022 79943 90229 101322
10914 101322 101033 83601 91908 89678 96422 83817 76549 88643 88471 92541 115971 111020 119722 116195
10900 116195 99008 68211 72285 74147 77220 92705 113714 103081 85614 80801 84335 76603 73937
10887 73937 86785 109033 93397 61704 40060 21295 35674 58096 55794 53314 73067 93215
10875 93215 95520 94769 97693 97416 93870 111478 116837 98007 81342 75028 80100 78523 84747 82477
10861 82477 71872 61135 63528 55483 53911 63694 62249 56079 55025 53773 36314 36591 34741 50813
10847 50813 67746 65089 61265 44101 25142 40125 65839 68219 54810 66660 76536 57821
10835 57821 55859 54246 39356 42680 51462 57774 46110 41145 62191 79322 81016 80763 57206
10822 57206 33693 30700 23865 14774 23606 42659 55198 60324 32154 37637 25550 27252 48075
10809 48075 80672 107410 84769 56717 59278 61577 45202 26637 23884 31956 44833 62774
10797 62774 61801 31165 21523 10817 3336 283 5375 22007 26458 31924 44915 36696 26530
10784 26530 42613 71465 84348 70964 63229 53389 50005 40623 52257 51831 30259 26354 13190
10771 13190 -6742 7239 33022 49815 68404 57307 54362 58419 55076 42738 38421 44407 31776
10758 31776 29488 28317 21489 17562 20018 32604 20919 10085 20597 20940 14003 27812 40015
10745 40015 45717 33973 38744 33421 30199 30253 42125 38626 24494 3628 -9879 -16159 -17401 -9883
10731 -9883 4391 20289 24306 15498 6678 16803 26458 42166 35426 38690 47849 37987 24283
10718 24283 31391 18077 22750 27320 42226 64902 75698 75596 75669 82100 84641 71051 43194 44677
10704 44677 44803 26934 31521 29708 14447 23979 39275 43031 45589 41901 37896 21491 15270 5082
10690 5082 3238 2369 21637 27492 30386 27053 22969 24465 26436 53198 49102 30446 33564 32820
10676 32820 20806 514 12662 39298 55454 53284 17514 -23445 -11139 12289 26758 18940
10664 18940 20228 27660 30716 15615 11926 20691 14717 945 -18396 -19060 -24103 -16157 -6165 -11511
10650 -11511 -27573 -16043 4938 17293 26306 20556 10645 1151 22553 31348 25730 17024 5756
10637 5756 -6843 -8790 -21329 -18104 10401 26230 11634 20315 25784 25253 24704 51214 70879
10624 70879 53023 23277 16641 6986 29310 34619 17189 40446 46132 27181 21797 15695 8816
10611 8816 -1958 6466 1539 -21542 -15599 -9928 -146 7218 -638 -5346 1901 2181 18422 19111
10597 19111 19538 12436 -14848 -11518 -29782 -42246 -22172 2089 26027 36798 23500 16795 49541
10584 49541 66113 65945 53976 22313 14658 24768 40637 35806 16478 8589 -1131 2511 20220
10571 20220 9140 28105 27791 10447 10200 12524 30880 28167 40226 44775 46795 37666 34314 25071
10557 25071 5531 -684 7345 17290 13015 18534 26152 27983 15253 25667 38465 34877 30401
10544 30401 14381 20211 24651 32646 40965 30061 17083 10769 16558 1233 -15042 -16904 -12304
10531 -12304 20186 37843 34460 16182 -6996 -1842 -6435 13152 36188 27226 7844 -6292
10519 -6292 -13310 5629 15771 16920 7845 -3138 860 9881 17271 21298 11411 -18016 -14698 -22939
10505 -22939 -17906 -576 1980 -2645 17866 17228 2835 -8566 -12175 9970 32041 44734 57377
10492 57377 51061 46378 33153 12451 -6265 -20290 -32278 -16440 5234 15072 -11378 -38826
10480 -38826 -42804 -42560 -30920 3885 31678 46742 11972 16746 25721 27953 32438 32094 23486 1202
10466 1202 -20211 -5895 4170 -16658 -25507 -14967 -5712 -4398 -12488 -12199 8417 9633 -11009
10453 -11009 -15938 9869 29623 43442 27414 -5312 11574 36308 39020 33398 17482 8806
10441 8806 20414 45002 15072 -2455 -16385 -12419 -189 15743 22293 147 -15372 -24734
10429 -24734 -26225 -23564 -5790 7692 31361 26412 -4646 -2806 10644 5457 14126 21447 -12640
10416 -12640 -30263 -16919 -1462 17342 2268 7 9228 13412 15049 -6079 -20524 -5300
10404 -5300 19108 17899 -1514 2854 4030 -5154 -9836 -4115 124 19650 23170 40958 42292 34437
10390 34437 28342 23760 24158 18477 18412 18389 9349 29136 33216 30741 28680 25409 36040 35606 27683
10375 27683 20645 8315 -7895 3178 7078 14223 28464 25912 20933 -8336 7770 21956 23744
10362 23744 34318 2781 -5681 5613 -7501 -3873 1002 -5239 4200 -38 18187 28836 34542
10349 34542 29143 14199 7956 1155 -2916 -527 3927 9751 19632 39585 38502 26263 10323
10336 10323 3077 12458 15152 7827 20538 35148 28531 24411 20853 31663 32675 10262 -4514
10323 -4514 -15149 -16767 -5239 6518 23897 38231 44866 58325 69303 58863 60972 61732 50726
10310 50726 38143 21947 5202 -16599 -23190 -10492 15116 8355 11850 23001 29640 31921 39348
10297 39348 52759 42810 12483 -12513 -15128 -6242 -15768 -10098 13806 18000 5408 -2503 2376
10284 2376 2041 15550 23696 5491 3588 23392 14936 7971 28546 16343 -7546 -30302 -46521
10271 -46521 -16150 -9120 -14570 -20881 -13331 504 10357 7113 5066 6265 4499 6935 2053 19044
10257 19044 24792 23202 7014 16132 18279 1847 -9076 -22391 -17730 -8029 3236 13219 11803
10244 11803 44159 46015 29923 22554 26612 29316 40078 43898 34483 43799 51107 50556 19061 3888
10230 3888 19731 22724 10513 10534 11544 14691 27310 13412 3812 292 -13614 -32860 -21039
10217 -21039 -19069 -10082 7695 2154 9700 10779 -7130 -2976 7445 23857 41591 39319 25193
10204 25193 16292 38305 41640 23060 4858 16453 37195 27413 14363 13437 3706 7988 20654
10191 20654 19213 7149 268 -11838 -20055 -7338 2962 -7109 180 22932 27412 20495 288
10178 288 -4734 15226 15138 153 17133 23623 -4353 -13976 -9678 -3214 671 5716 2617 8191
10164 8191 521 -959 23074 32793 37418 42766 29066 10949 927 -1361 7021 -6557 13739
10151 13739 28380 14382 -11296 -11032 -8006 5244 26180 38917 38896 30719 14510 21183 55083
10138 55083 43280 14185 -1796 4669 13770 1519 4083 1237 378 -2333 24805 21570 -22498
10125 -22498 -6449 21792 25011 28012 14445 6454 13441 1404 -13461 -19098 -16422 -7920 8524
10112 8524 11927 19494 42438 47237 44744 13763 -5420 -20777 -11871 -26289 -35495 -5806 4649
10099 4649 -10870 -7478 -6536 -12090 -606 17910 7313 2911 2602 6052 -2673 -18299 -628 8272
10085 8272 13301 7984 14702 15751 6285 -6604 -4778 9969 24176 24431 21164 25964 9770 -18148
10071 -18148 -15738 -4495 -3745 -5603 -8592 -1736 -6299 -1000 3642 3190 -2081 -28255 -40292 -29678
10057 -29678 6901 9303 -6515 -7100 -19558 -29588 -29829 -13660 -24183 -19193 -20896 -5235 20003
10044 20003 30287 13658 -1890 19089 3435 -14745 1991 7957 423 1430 6457 -4135
10032 -4135 -22681 -1649 27950 31879 15830 -8232 -30036 -27014 -34691 -21315 -32932 -18166
10020 -18166 -9901 6526 21521 26553 15340 10775 8859 -3835 -10593 -14007 -32582 -19334 -16573
10007 -16573 -7737 -13565 -15434 -18156 -4183 -4419 466 3025 -2412 4779 -2792 -5308 -10498 3687
9993 3687 21440 26741 4237 1259 14811 -1915 -14323 -2498 1100 -16648 -15910 -9573 -949
9980 -949 -7419 -8128 -11659 -6598 -17386 -25060 -30376 -23794 17699 39326 36895 26005 25662 51073
9966 51073 44259 14798 19263 22548 17074 16799 27692 37787 36062 26401 16386 8079 9248 18531
9952 18531 1439 2538 1064 -5239 566 11372 30768 54048 50594 30159 20128 6409 14679
9939 14679 34527 30379 19190 14170 27743 17990 -8439 7933 13766 5409 2913 2343 1985 3485
9925 3485 25161 39907 27182 18654 -14526 -14358 911 2182 -2018 -5750 -9715 -9015 -11319 786
9911 786 2819 1454 9859 30519 37398 25913 2789 683 14962 -11195 -22035 -10955 -4809
9898 -4809 5677 -15467 -37459 -40128 -25095 -35274 -54897 -47659 -27465 4645 26877 39900
9886 39900 37533 20459 10338 -11849 -11891 5812 18396 4462 -4484 -20623 -38495 -17894 6446
9873 6446 -5792 -23785 -47215 -60093 -53157 -28816 -16667 5935 27866 19380 8984 17392 14007
9860 14007 8668 -5664 -29835 -30775 -28615 -26096 -8190 12083 20354 26590 16946 30740 32925 14176
9846 14176 -1722 1455 -11179 -2436 8479 21940 27581 24142 -10953 -21303 -7323 6271 -12924
9833 -12924 -29126 -47153 -49660 -33514 -23334 -23424 3520 4817 -15333 1903 -6132 -19750 -34619
9820 -34619 -30124 -16451 10988 4100 -23380 -26670 -16663 -2728 8855 30773 43905 45811 25843
9807 25843 26738 39938 21097 8071 2018 11729 19679 20819 11814 4262 4537 5529 212 -4625 -17353
9792 -17353 -5465 7730 22742 25267 39945 49364 46040 40599 27367 21266 -4634 2903 -14964
9779 -14964 -12529 -473 13679 29469 11826 -11396 -9845 6450 13212 10719 -4337 -16241 -34192
9766 -34192 -33002 -4668 12931 25717 -13694 -25780 -21013 1747 9880 22226 36984 7626
9754 7626 -2265 9271 4807 16417 33828 26500 18783 8337 2784 5253 3017 -1199 -8897 -4830
9740 -4830 -7283 -9330 -18568 -29407 -11098 13340 -2209 1138 1470 -3598 -2063 -1421 -3043 -3440 6195
9725 6195 20095 13451 878 -28076 -37898 -29969 -25590 -18112 -11140 -17015 -17462 -1975 2424 13321
9711 13321 5480 8301 17783 37699 27003 19047 40616 14841 -308 7216 27646 32532 11288
9698 11288 11015 11192 23183 24303 9702 17103 21288 10991 16386 -11551 -34663 -19534 -12107 -17063
9684 -17063 3396 9572 9465 17710 4905 -8841 565 -544 -3075 -10520 -3362 8308 10484 5084
9670 5084 5156 7747 3715 4203 8930 -9388 4835 22924 10088 8872 -2056 -9438 1008 8513
9656 8513 19298 9635 -6486 -6237 1292 10910 11905 20503 -832 -4149 -7456 -13193 -8399 -5431 5389
9641 5389 -9818 -5709 -1151 -10751 1936 2185 -18752 -14662 -5892 14677 14133 -24344 -20583 -21104
9627 -21104 -30475 -31866 -33493 -41667 -31343 -20496 -10120 -6676 10405 16129 16355 2755 435 -5379
9613 -5379 -16115 -28513 -26157 -17698 -9664 2711 17450 20835 651 -7076 5804 19962 21667
9600 21667 -10524 -15322 -4229 -1232 17388 6731 -6339 -11158 -11480 8452 24021 23100 17751
9587 17751 1223 14854 33978 22930 32005 37175 48404 47012 46192 27600 5382 12852 16410
9574 16410 5256 -13263 -17359 17041 6036 -5471 13593 27912 40208 37429 20126 -3150
9562 -3150 -15726 3743 35433 38166 28399 17904 10904 17358 -1745 -7901 -16294 -25752 -3633
9549 -3633 5753 7504 -10856 5228 12034 -1944 4423 31562 25515 17483 -877 -1884 12237
9536 12237 6877 24584 14681 -5117 5195 9096 7327 31391 35821 27948 -127 -14507 -21264
9523 -21264 8668 25268 14371 -15674 3062 6278 -14844 -10922 3505 16015 20546 8574
9511 8574 10942 21245 19787 17934 18668 29546 18760 3798 3720 14081 18594 20802 20389 16443 281
9496 281 -14652 -17024 -2693 -1466 10114 18375 5240 10809 33881 36710 31145 20636 22769 28175
9482 28175 31927 42983 70894 70667 56808 39341 30580 26578 21284 1804 4264 23588 28649
9469 28649 33414 37337 32945 19003 3685 13537 14047 -557 -712 1642 -12042 -6193 -101 1217
9455 1217 9925 8189 7110 -3190 12484 31619 9776 -5983 -3826 -485 23860 21511 17146
9442 17146 9683 -5374 -3930 -6457 7959 11675 19776 24070 4806 -6782 -11948 15626 20270
9429 20270 11324 14330 19035 20091 15396 20215 14894 -469 -3062 417 4573 -1211 -5326 12085
9415 12085 25682 18438 25994 12696 -2935 -11532 -5688 -22074 -41957 -36147 -8250 25408 23423
9402 23423 11231 20883 18218 16366 26396 20329 28762 32598 39171 48687 42942 25126 31825 33891
9388 33891 26588 32159 14826 9640 8764 7157 11558 16335 37293 43022 38809 39932 48965 64722
9374 64722 47688 30817 21579 15942 9120 4920 17038 13819 9853 18928 30624 22895 17992 16913
9360 16913 22178 39034 53790 55811 59472 57814 40305 25631 13762 4073 -4401 -8255 830
9347 830 421 874 24082 34666 44761 54346 64733 60288 39269 31689 37696 32962 22973 31272
9333 31272 43091 56933 26363 34923 34121 25477 26186 37503 39740 40505 35590 29342 27892 41572
9319 41572 52427 33311 20370 22004 28667 36628 45325 32429 28529 54010 64686 51764 37715
9306 37715 3169 -10191 -2660 12077 15868 -4450 -26319 -46763 -27330 -4634 3080 551 -15317
9293 -15317 -684 12865 21567 28683 29596 13976 19855 23460 33948 36245 30233 16786 37325
9280 37325 41521 28524 13467 13254 -17323 -16526 8632 39412 39486 17255 3695 3578 3088 8670
9266 8670 11479 8119 14778 32073 26219 14474 -4883 -14867 -5550 17331 37879 36963 26390 27711
9252 27711 31238 17151 -3238 846 -796 -6876 -9103 -12322 3627 22001 31824 14623 28561
9239 28561 47804 72714 66133 61070 75639 50871 43897 44079 45556 54461 47807 14207 21499 48301
9225 48301 45337 48743 36362 19909 852 -2411 4120 8568 22808 10864 -2667 3921 20874
9212 20874 30010 19941 18484 30489 20000 38841 44028 42536 37829 39532 48389 38868 31153 25676
9198 25676 8508 -5264 10200 22928 9744 15474 6864 -9981 6983 3048 -3800 6843 13661
9185 13661 8694 254 -6966 -1018 18984 9924 -6765 -238 12066 34764 38556 23967 8253
9172 8253 -7012 -11179 -7536 -825 13312 29141 43037 42556 29779 14712 18621 48881 68670
9159 68670 59369 55462 52631 58665 66605 69391 74938 69933 64854 37393 44467 30399 30459 37300 34704
9144 34704 49815 67205 46761 20994 46998 55930 52848 57743 73545 72511 58073 69514 76377
9131 76377 69415 46901 44992 27519 30844 44657 46081 48940 65230 83109 89501 67439 55701
9118 55701 44247 33542 34542 44502 38504 41496 50640 30868 43058 23760 29099 35703 48632
9105 48632 46736 44867 57797 56354 41935 46164 45804 27519 29181 54700 57220 54062 72218 92023
9091 92023 89741 63793 63883 58805 55743 60334 66665 75582 73608 64305 61397 64361 62478 46609 37821
9076 37821 37691 31160 33238 24850 19730 34320 35855 48164 60146 67315 83126 77269 53246 52928
9062 52928 74812 69475 68859 61376 44642 40685 44425 36001 24655 47084 68899 80258 99744
9049 99744 81428 58589 43423 48625 61973 61489 66985 62642 60138 38025 27403 28868 36574
9036 36574 53675 41048 31690 38322 57743 61199 69397 81569 53389 39929 63155 67335 56236
9023 56236 47621 27818 24505 29950 9796 22257 31268 44452 56089 36364 17778 21074 30068
9010 30068 48851 55317 45036 56316 66966 69866 79432 98005 80477 69380 69775 60647 51474
8997 51474 54728 43998 27846 18230 3660 133 -8531 6775 34130 14765 11345 19339 23843
8984 23843 28100 22489 40491 31356 15880 22089 11385 15802 5805 -9198 5143 21215 25785
8971 25785 31813 17718 40391 56734 32995 34269 30809 21966 11388 21687 52521 66230 57962
8958 57962 37903 13484 -8378 -4072 10350 5146 3558 7199 19778 4384 2670 8395 10498
8945 10498 17640 13744 362 12051 10730 11130 18414 44329 36204 27256 22020 16572 22493 16270
8931 16270 20371 20918 46360 56716 55171 48403 23533 5721 5935 -1135 14686 14072 2571 6858
8917 6858 23269 7540 983 -23 -1959 17640 33911 52330 42715 18281 13573 27647 36563
8904 36563 54307 64242 38499 42919 52337 39277 37840 30360 27731 42862 13842 -2216 -4451
8891 -4451 5619 15359 31210 32398 10483 28113 30309 20212 22989 16706 16136 6243 -8442 -6470
8877 -6470 -9531 -14775 -11516 -30911 -55675 -31451 -22223 -27351 -35736 -29169 -8017 5847 5593 10943
8863 10943 20948 7816 4557 7377 17613 27512 37594 18563 5846 13400 -9633 -11300 -1024
8850 -1024 -6945 -9876 12938 13822 4967 12962 3502 -36171 -43613 -35217 -22880 -288 16122 2498
8836 2498 -10121 -2708 -8329 -25925 -12191 1733 1593 -7572 -6066 6260 6533 301 -6629 -13591
8822 -13591 -6811 -12404 -426 2770 6545 14028 19041 24683 1367 -34422 -39995 -17451 5537
8809 5537 3373 -5892 8465 -7465 -7848 170 8941 28876 23754 17059 -12384 -20289 -33163 -14860
8795 -14860 3890 7774 11382 9520 3416 -14995 -7339 13360 7137 24668 39340 23435 8953
8782 8953 -816 -7110 -16272 -9990 9323 17081 8626 5496 11735 -10736 -7254 7730 10524 -199
8768 -199 544 9656 25629 27328 37745 31753 21813 16647 -594 -1134 6013 -6564 -17764 -20548
8754 -20548 -13103 -7144 11819 17905 -1624 1072 3272 2411 -1009 -1691 -19103 -13489 2854 -14597
8740 -14597 -18630 5720 23827 17054 14541 37528 28198 9109 12790 30889 40673 21589 15251
8727 15251 21807 14114 19598 22233 9429 9221 20955 42150 54871 34307 21818 5027 -17382
8714 -17382 -24484 -14612 -13988 8970 31395 34736 13973 -8706 -7619 -33170 -52872 -12718 9250
8701 9250 -11739 -21115 -38685 -22215 -6670 26187 21466 15077 16206 10209 1889 -16318 -26299
8688 -26299 -9747 -16184 -21701 5344 -7533 -13063 -21654 -11493 -1826 4425 14053 27096 27174 23611
8674 23611 19190 14082 21506 34619 25122 -20330 -28142 -10693 -3228 4979 16018 5792 11715
8661 11715 19224 15559 14365 5643 8455 20867 30402 24481 13678 4811 212 -17749 -8773 -3914
8647 -3914 -7332 -2996 -11393 -21474 -6360 2923 -10189 -13143 13605 19284 25231 29555 38794 42255
8633 42255 17901 -3017 -15668 -827 4908 -1857 -3624 -4173 2299 6737 14317 26156 16873 36586
8619 36586 53964 44164 42161 30744 22933 36432 31194 14648 17779 12068 -10189 -7828 2060
8606 2060 17326 11802 264 -21414 -19197 1451 4844 -329 3628 6919 21316 30083 -5382
8593 -5382 -11462 605 16351 43493 45535 50502 42830 23211 21329 31765 28294 24910 37491
8580 37491 29141 25883 32076 34150 34071 48020 68429 57303 62547 38846 9861 -5324 2566 13517
8566 13517 9183 1559 -650 -13462 -22813 -14535 -19481 -15373 7860 8451 -9505 -23324 -19948 -5919
8552 -5919 18727 29885 -5340 -312 -1235 6451 995 10560 29037 26888 25312 41924 49209 25694
8538 25694 12231 3222 123 -15032 -20541 -5777 -14598 -31117 -8017 -16806 1258 31993 20898
8525 20898 14851 2996 -24118 -32709 -12355 -15446 1092 -274 -7398 -8406 6718 10518 278
8512 278 -10734 -11659 -7939 -11201 1461 -1892 -15350 -25825 -25811 -21190 -5998 4804 18747 16169
8498 16169 24405 9391 -5336 -1738 -229 13085 31690 21352 7279 -2610 -8499 -20263 -19028
8485 -19028 20240 27814 8171 4802 11219 14611 12097 -2382 8036 -797 3016 21211 16261
8472 16261 25202 17849 6879 3290 12972 6986 -8034 -14328 -14574 -11289 15503 13746 20386 -1645
8458 -1645 4040 13930 10200 4906 8452 22706 36337 34273 27083 1446 6446 13377 8398 17321
8444 17321 42586 48041 21907 15192 13705 31548 27644 9596 -12143 -6370 -19452 -25364 -9492
8431 -9492 -8948 -2627 9440 19507 22009 30895 42566 15599 4397 10022 27907 15441 27043
8418 27043 27199 10710 3452 1673 -7442 11294 24276 29686 22105 11863 -14608 -29605 -25450
8405 -25450 -14090 -8530 15752 29474 19160 -8584 -19696 -15593 -17880 5160 12803 12916 25542
8392 25542 12182 14498 8092 -960 -1024 2740 16656 40544 41722 25737 8730 -1080 6138 -1589
8378 -1589 -14902 -13115 -6741 -5985 -22410 -36024 -24327 -14781 -14366 -1615 8617 6587 -2360 -9265
8364 -9265 -5306 14804 30859 23768 1173 -8673 -3478 7771 -1443 4452 32172 50861 46140
8351 46140 26682 -4045 -9644 63 -27150 -27725 -13634 -20900 11557 61158 47626 22353 3675
8338 3675 -4291 -3680 -20673 1805 8913 -14291 -5183 17656 16828 8520 26466 23215 1420 -4836
8324 -4836 -845 -6092 -809 17073 26957 30888 26593 33961 41123 23179 31216 43332 51594 32701
8310 32701 21779 10186 2877 -3946 -1592 -1280 -3282 4372 17823 4734 -23160 -5321 2520
8297 2520 -7759 -21293 -27849 -19806 -3659 -6779 -17802 -10192 -4798 10545 -13653 -22589 -25532
8284 -25532 -28245 -26036 -24737 -162 11766 6094 3141 28208 20719 1771 5724 3857 -7776
8271 -7776 -25865 -37687 -48918 -43670 -50327 -37054 -9708 -6944 -1416 -9963 -1669 9621 6046
8258 6046 -2180 -8274 -991 5636 1621 -6262 -9404 -21760 -24305 -26775 -1509 13018 13399 5632
8244 5632 819 4018 9647 -1347 -7295 -9516 630 -5596 -12375 -2229 -6294 -31691 -40177 -35405
8230 -35405 -39345 -20521 9408 21784 6535 8622 2262 -2006 -11958 -14504 -2402 22550 -2988
8217 -2988 -22091 -27545 -23402 -18073 -7720 -9145 -6173 8878 6361 1937 -8354 -6777 -4060 -10000
8203 -10000 -24801 -18365 8618 -18589 -39436 -31615 -11943 15784 12884 10841 15174 9928 8816
8190 8816 -15455 -15842 -7509 -13502 -20390 -1848 7571 16325 29721 19794 17291 23020 20563 -2945
8176 -2945 -9825 -22009 -22706 -28905 -18293 4012 20231 5160 7032 20699 33266 19684 12792
8163 12792 -10308 -10014 -5747 -13223 -10653 -7818 -13253 -4872 5055 9515 1077 -9715 -13077 -10193
8149 -10193 -22905 -28410 -26331 2747 7234 -4797 -18402 -23177 -21780 -19064 -39442 -51537 -46255
8136 -46255 -31831 -17240 -6750 -21789 -29338 -21563 -20600 -25009 -16401 -11178 -756 -2226 4255 1006
8122 1006 -5792 -20782 -23323 -28511 -23665 -16533 1945 22692 21826 -610 -17471 -47156 -58344
8109 -58344 -9860 8371 -3460 -1151 -18056 -23407 -25728 -15579 72 13721 10394 -4097 11928
8096 11928 40987 28608 13959 9032 -17187 -27315 -19532 -10889 -21424 -30091 -47577 -16435 -6109
8083 -6109 608 -1090 -1890 -11574 -13552 -28325 -8464 -8542 9329 7558 2079 260 -3703 -9557 -14283
8068 -14283 6271 2012 17941 17908 1490 -14017 -3488 2695 12649 12252 15319 36215 25745 -15916
8054 -15916 -9802 -4315 -11228 -13960 -418 19165 10895 -1648 8205 14022 -15250 -11012 -10959 -18371
8040 -18371 -7178 -5480 -6364 2932 6895 6241 5427 12083 -9271 -11187 -22122 -18303 -23807 -19182 -17088
8025 -17088 -34300 -21009 -29480 -33437 -15558 8391 11661 -1838 -12408 -1381 15363 5983 -13686
8012 -13686 -23028 -28820 -48749 -32100 -21552 -26955 -20342 6755 12756 -6318 -22322 -31683 -30275
7999 -30275 -700 6326 -6172 -31319 -46976 -43194 -41848 -17437 379 -11561 -26794 -9883
7987 -9883 1808 1746 14032 36790 26455 10905 -425 -2187 -4977 -34996 -32103 -16496 -12162
7974 -12162 -1628 3342 2738 -11424 -11398 -7063 -5139 -17253 -45359 -41932 -20779 -16842 -36706 -25636
7960 -25636 -11493 -5843 -1725 -10707 -15041 3506 11882 24334 12589 8481 12529 21486 17908 8013
7946 8013 14671 5210 -13306 4869 17205 9113 1573 9455 10153 1933 4752 7387 2713 -9789
7932 -9789 -11984 -1298 1659 1122 14269 16811 21107 15629 4609 -8321 6211 15777 -15586 -23823
7918 -23823 -19941 -18289 -5600 18433 16755 -20039 -26670 -8921 -3528 10587 15026 4346 5613
7905 5613 24391 22943 13900 12384 1239 -21241 -31728 -45538 -34228 -38186 -47302 -42399 -39749
7892 -39749 -30676 -21448 -21949 -12622 2924 -11387 -36538 -44017 -33740 -17503 16491 39704 13168
7879 13168 -21084 -43484 -41417 -48596 -30238 -32625 -35908 -50667 -54579 -39818 -18731 -26762 -41357
7866 -41357 -38606 -48236 -60821 -50409 -46045 -28395 -14965 -6611 2516 4855 -7889 -13394 -14886
7853 -14886 -13959 -18258 -10212 -13038 -24566 -20021 12524 36239 44322 26730 3595 -4289 -18555
7840 -18555 -27342 -20329 -32038 -34629 -27370 -3717 18716 35753 36625 41919 26260 14678 -2746
7827 -2746 79 2154 1354 -5993 106 9731 13174 9047 20730 30004 21745 -4875 -19725 -40783
7813 -40783 -31190 -25413 -37856 -31476 -18406 -20326 -22673 2926 13445 25332 26506 14933 -11671
7800 -11671 -15148 -15735 -31262 -32733 -24609 -27282 -10861 -5351 13688 27875 9032 -38079 -52706
7787 -52706 -22768 -6049 -11203 -40430 -41457 -30432 -21584 -9740 -32351 -20895 9905 14028 -1153
7774 -1153 -2229 3839 3273 11131 4908 10437 1164 -24965 -38369 -39093 -35593 -22642 -11410 1314
7760 1314 10788 12753 10717 9843 10517 -530 -28793 -48227 -53115 -59101 -72681 -63199 -57411 -46754
7746 -46754 -42700 -46410 -40116 -27205 -14021 -8967 -25274 -18839 -8275 -16832 -19997 -971 10118
7733 10118 -11528 -27952 -28744 -10630 14579 7685 5969 -1251 -20621 -8279 -12448 -16888 -7278
7720 -7278 -6118 -26461 -28919 -22939 -27057 -10133 11127 23969 7630 -20014 -42537 -42807 -23243
7707 -23243 -11144 -4248 -17920 -19405 -14725 -14954 -4163 12255 31921 29348 31157 12557 328
7694 328 4794 12207 21351 26826 19969 9642 6100 12953 15609 8362 -298 -22943 -23266 -21886 3661
7679 3661 -3376 -9830 35 -6876 -15375 -17615 -10659 -448 5066 14074 12827 13775 -4403 -10935 -8346
7664 -8346 -8990 -4177 -14200 -15858 -429 162 -17608 -28861 -37301 -45414 -28593 -1246 24 -1978
7650 -1978 -6492 -11687 -15114 -25230 -19375 -27245 -26938 -25341 -27893 -16886 -6048 -16521 -33763 -47214
7636 -47214 -18274 -5550 -8894 3466 8195 10401 9166 5426 1774 -9354 -23900 -27597 -25064
7623 -25064 -18611 2524 11920 -1431 1549 19261 20882 11635 -9769 -26363 -28483 -46247 -36804
7610 -36804 -28668 -42677 -56360 -47179 -31106 -33325 -28422 -47479 -62858 -41289 -32750 -35429 -30478
7597 -30478 -22548 -24757 -25257 -34153 -40805 -16682 17609 26692 -5682 -12785 -11450 -20083 -32880 -41164
7583 -41164 -52931 -50536 -66401 -82285 -86503 -61380 -36952 -40147 -45438 -29725 -22350 -8777 603
7570 603 6222 -7011 -17610 -19851 -14664 5525 -6499 -22440 -24606 -31856 -38308 -12321 -4412 -13050
7556 -13050 -10690 -9587 -10547 -11740 -34519 -37696 -26126 -19031 -10795 -7052 794 22556 17487 1548
7542 1548 -13068 -26906 -29356 -31678 -7961 19171 15289 -10497 -17250 -1784 -9769 -31201 -18959
7529 -18959 -21087 -27911 -49808 -35284 -20891 -14421 -10452 5624 -14936 -19649 -11591 -18215 -14168
7516 -14168 -24231 -28293 -16368 -26786 -23761 -37021 -53113 -36412 -41348 -52014 -64564 -71140 -60721
7503 -60721 -42189 -23786 -25440 -22881 -18639 -17819 -21895 -9334 -22654 -33528 -41025 -15348 -11225
7490 -11225 -10568 -4785 6283 21164 22700 20938 14693 8759 23164 18928 23741 31066 15914 -8473
7476 -8473 -31821 -30014 -27479 -24653 -17857 -9052 3423 1686 14538 13372 4060 -7038 7152 6244
7462 6244 11105 11154 -18170 -36624 -22596 -12999 -8131 8440 29681 4115 -20869 -26415 -20852 -13133
7448 -13133 -23767 -20106 -15697 -6934 -9260 1862 -19898 -38269 -37581 -25813 -20530 -18976 -4784
7435 -4784 -8698 6182 9348 -8129 -9046 -15025 -17454 1611 16877 -3493 -20212 -12417 2409
7422 2409 7314 6821 -1169 -12332 -6582 -21697 -27318 -25068 -34320 -12237 -13968 -15820 -10706 -9710 -20712
7407 -20712 -19743 -6732 -11716 -32584 -34815 600 13810 7040 -4196 -13214 -13642 -3805 1378 -2885
7393 -2885 -17377 -23621 -32257 -26330 -6542 -5427 -1171 -7271 -24248 -19568 -11127 -8758 -4454 -26396
7379 -26396 -39743 -45010 -52644 -45926 -34926 -21202 -25076 -10334 6605 -8557 -42074 -38551 -29198
7366 -29198 -14894 -18467 -17153 -21013 -32185 -39196 -52467 -32987 -26506 -9378 -9709 -10894 -30966
7353 -30966 -11652 -5098 -2939 -8003 -35928 -41589 -16356 2321 -29755 -47128 -53251 -46691 -3269
7340 -3269 1366 -22258 -36643 -17516 -19591 -37080 -35082 -24730 -20659 -1002 7702 -389 -14770
7327 -14770 -21581 -5318 7694 18026 27724 22351 4226 -908 -18407 -14479 -1267 -3096 -6675
7314 -6675 4316 1333 -29761 -49907 -56264 -45220 -23351 -23523 -26564 -4509 12192 492 7555
7301 7555 11399 2429 5393 33466 36405 21831 25198 13966 5444 11287 21039 13472 3101 -12163
7287 -12163 -11757 3664 15102 4754 -12396 -25394 -27269 -10382 -751 1187 1781 -3889 3515 19253
7273 19253 16181 10320 1370 -8700 -14487 -23497 -31076 -44028 -21930 -11092 -6981 -28519 -57295
7260 -57295 -45720 -14714 -6316 -8688 6499 -5748 -31262 -47806 -67287 -47780 -16041 -18999
7248 -18999 -21365 -21812 -4852 -3804 -8872 -14808 650 24646 18425 6811 -16745 -24535 -22997 -11930
7234 -11930 -13349 -5300 -10614 -20930 -21195 5 -19140 -21882 -24469 -24230 -12092 -11541 -22168 -10278
7220 -10278 6525 -1870 -32567 -27595 -36685 -53763 -48682 -27228 -22114 -27898 -37982 -18398 -20424
7207 -20424 -7643 4203 -6468 -37106 -57259 -53471 -26903 -975 -1751 -11032 -11391 -19062 -25023
7194 -25023 -6582 -2783 -34837 -39998 -18317 -20309 -33100 -36182 -26881 -10190 -8045 7366 9093
7181 9093 15630 3083 -5119 -10164 -13049 7722 8152 6079 -10754 -17319 -25402 -32342 -32064 -26692 -13466
7166 -13466 8555 9234 -10087 -12842 -17965 -4860 4933 -2393 -1942 -9935 -6736 7210 8603 10167
7152 10167 -2626 -4537 14758 12944 9187 15176 2407 -11493 -24050 -10842 -1053 -20058 -28431
7139 -28431 -20351 -14419 -13127 -12933 -8403 -9122 -21264 -24723 -29793 -38425 -44468 -47082 -46715 -43160 -33253
7124 -33253 -17017 -21694 -31868 -19698 -19653 1227 27979 24674 16899 5826 -25649 -21278 -11475
7111 -11475 -5023 -17323 -32883 -18805 2550 -3313 5252 2349 -5980 -19581 -5621 571 -2791
7098 -2791 -12850 -20411 -23965 -17297 -20944 -32091 -16503 -7704 2584 20303 27984 41812 28319
7085 28319 33652 35350 14853 -2926 -8232 8235 -897 -5770 837 -660 2889 2174 -14003 -7011
7071 -7011 7510 29565 38285 22538 8449 8968 10734 5455 -22278 -11471 5691 -3768 -12147
7058 -12147 -12359 -16566 -11209 5949 3612 -646 -2232 -619 -1110 -7692 -19479 -31422 -26321 -30271
7044 -30271 -30812 -41379 -47584 -52219 -54546 -49545 -29462 -21922 -17701 -7871 -11556 -16763 -15206 -7157
7030 -7157 -698 -13126 -20496 -7337 -34535 -38405 -19480 -16998 -26268 -19869 -25652 -26866 -8695 16431
7016 16431 27939 3084 -2002 -1543 20071 47199 49849 43306 20520 262 -13472 -5068 5463
7003 5463 -14273 -3775 24232 16610 -4280 -21010 -20882 -15516 3298 -4810 -14826 -1936 19812
6990 19812 21373 3173 -20083 -31775 -28505 -2013 -1036 16014 16548 14670 -16252 -39353 -30739
6977 -30739 -32797 -19297 -533 12459 20224 31245 28358 -821 -35455 -36315 -10588 -2539 6890
6964 6890 -4259 -14069 -17808 -22269 -17385 -2929 -10668 -16022 6007 11219 -1273 -9779 1383 -8293
6950 -8293 -28894 -35082 -18034 9976 -4904 -37080 -50097 -40476 -11392 -9117 -6962 -7922 -4578
6937 -4578 15533 12228 -6893 -10805 6637 15574 12069 -8870 4876 4343 1984 19073 7561
6924 7561 5774 5153 5354 7384 -2390 9361 6454 -9142 -23468 -28804 -36999 -41610 -34699 -22714
6910 -22714 -26898 -18450 7039 21898 2782 3027 679 -20474 -25365 -7705 15482 30778 24751
6897 24751 18218 750 -3012 6941 19374 15480 -9546 -18192 -4690 -8720 -13825 -14897 -7809 -19787
6883 -19787 -21999 -11462 -6579 -16057 -28880 -21419 -24539 -2391 490 -7009 -34409 -28503 -26488 -9009
6869 -9009 -6340 -13176 -6500 -21899 -22795 -34469 -33658 -18160 -12853 -20973 -25611 -22488 -24729 -27078 -12148
6854 -12148 -16410 -21046 -24421 -16545 -13010 -2756 -1545 -15136 -17549 79 4616 18068 18075 -18661
6840 -18661 -13047 -11300 -25573 -32925 -31523 -22847 478 905 -3570 -17014 -1841 10663 19166 12047
6826 12047 21712 13650 23431 38227 13653 2617 10434 8667 -9580 -4694 4725 14123 8116 -34
6812 -34 13342 6101 -20685 -31238 -47226 -37957 -22235 -36151 -46013 -44807 -35310 -26192 -18152 -1044
6798 -1044 -729 -20996 -18475 -6070 -21021 -16173 -8347 -8519 -8669 -21904 -36756 -31600 -304 5314
6784 5314 8903 3264 -9226 -18561 2298 8751 30980 35418 39044 48878 58143 45250 29031 15137
6770 15137 6255 -4477 -25234 -22594 -6946 -5429 -12609 -18219 -23689 -32662 -23982 -23294 -19483 -26185
6756 -26185 -46289 -43024 -35748 -25942 -30162 -41368 -44179 -23035 7250 5353 -5566 -6008 -6534 4061
6742 4061 5866 2233 -9459 -20185 -46606 -46001 -17032 2802 5865 20110 28418 24918 15594 -13645
6728 -13645 1186 5019 -12871 -11149 -7386 -3492 -14457 -13508 7644 2485 -6646 -2862 -26272 -18166
6714 -18166 -14890 -6250 18503 39367 44804 41072 32721 14765 -6720 -8515 15740 20216 -2780
6701 -2780 -35018 -42560 -22683 2712 -3731 -16359 -20791 -13215 -32437 -10910 12313 213 -25605
6688 -25605 -41394 -34868 -19422 -26266 -24250 -2887 -6867 -22344 -28686 -38685 -44142 -15140 11753
6675 11753 25673 25764 -9846 -26406 -14172 6480 6364 -3819 -21890 -41529 -44958 -33867 -14331
6662 -14331 3754 21535 30067 27235 12246 -915 1019 -9801 4226 7964 4178 3793 13846
6649 13846 13045 -1987 129 11220 23271 31264 24090 -19057 -39836 -16612 -4038 -16346 -8226
6636 -8226 -4891 8703 14825 -1016 -7907 -187 -3824 -20202 -12157 -990 -5188 -27994 -31428 -8118
6622 -8118 -15328 -36554 -20008 -6468 8994 21523 17514 15113 16143 1191 -4948 -2564 -11803
6609 -11803 -18025 -22285 -27394 -33679 -19753 -12087 -19307 -39059 -19416 5105 14849 -427 -537 4993
6595 4993 1874 4651 4023 7266 20244 980 -21877 -19506 -10216 -18583 -8698 -9771 -20543 -50259
6581 -50259 -72560 -43311 -16391 -19258 -25758 -31507 -22338 -14528 -8994 -14368 -7734 -21416 -29331 -24796
6567 -24796 -21545 -17294 -18070 -1146 -4781 -19584 -22374 -12322 -8193 -19384 -14075 -6942 -2000 -8567
6553 -8567 -18110 -14819 -15173 -7988 9710 -2668 -4080 802 -29456 -22093 -15217 -2036 -7998 -3115
6539 -3115 301 -1825 5498 4466 -17721 -21313 -16276 -17301 -23422 -30795 -16438 -8869 -24116 -17521
6525 -17521 -17534 -33061 -46376 -39073 -33406 -6013 -1122 -38080 -29427 -17232 5515 17206 5737
6512 5737 -2863 11803 -787 -34715 -26525 -24700 -23478 -11895 1710 4940 16763 18958 16358
6499 16358 38505 31969 5043 5394 10202 -9994 -21680 -33140 -32549 -15711 -10850 -5551 88 3428
6485 3428 -1936 -10719 4994 -12468 -34599 -29606 -38916 -36220 -29721 -15621 3328 24225 7753
6472 7753 -16563 -11820 2187 21865 31932 15843 17433 17462 527 -27741 -33277 -21287 -10478
6459 -10478 -14448 -5175 10045 11142 -7681 -14511 -24444 -9984 -11835 -8331 8983 26891 11893
6446 11893 36309 25493 2257 8430 18242 38690 34173 25175 26234 23535 25051 2889 -12477
6433 -12477 -21236 -15360 -19553 -4548 1692 -3124 -4269 -15288 -16962 -2786 1868 -21402 -33271
6420 -33271 -29025 -6573 1572 -9566 -24300 -30992 -38136 -57378 -50514 -29598 -21700 -5695 -7609
6407 -7609 -3969 10855 19253 20669 16179 17598 11071 5468 523 -6122 -16157 -21783 2559 -5177
6393 -5177 -11136 -12733 -21760 -18184 6036 -6910 -25527 -27953 -30994 -20880 -27795 -24707 -27431 -21307
6379 -21307 -24497 -38184 -29783 -17838 -28733 -22204 -25702 -24553 -9684 6442 -2710 -17420 -13443
6366 -13443 516 -5994 -2653 8831 -8907 -25703 -24249 6238 4930 -17385 -25459 -25497 -45183
6353 -45183 -60995 -34582 -32522 -35031 -23371 -28363 -32455 -14157 -8174 -9028 -6233 -28903 -43973
6340 -43973 -25800 -10895 -8465 -18080 -24486 -17505 -30202 -22185 -11043 -21245 -16342 -5112 -25093
6327 -25093 -33561 -22770 -16733 -11151 -20345 -12589 -9828 -3809 11627 -679 -5686 -5822 -14534 -35855
6313 -35855 -32648 -16827 1273 13480 3505 -2743 -19555 -23574 -13779 -15218 -21819 -21448 -24164 -17121
6299 -17121 -16455 -14972 -11954 -3080 13995 -18965 -39495 -30225 -20171 -8831 -206 11107 13013
6286 13013 -9109 -9247 -3185 -880 -4201 -26125 2070 11273 552 -3574 -5943 -11728 -15096 -9782
6272 -9782 -4852 -8228 -1016 20825 13610 10957 -2421 -4485 3748 9986 16809 19120 33179 28791
6258 28791 -3088 -37955 -41072 -42371 -34855 -13341 11617 15066 -627 -13726 -32117 -6448 -7445
6245 -7445 -15033 -18291 -18042 -15896 -22200 3223 18635 23222 6250 515 -17077 -25655 -17653 -21245
6231 -21245 -6340 -5233 -1758 16839 14731 19971 10601 -14706 -28480 -20426 -4631 -233 23 -5408
6217 -5408 -23052 -28243 -9363 -596 -12637 -47940 -42286 -23807 -22084 -9324 4672 33053 24048
6204 24048 15774 32898 68720 66252 30723 30053 47538 23454 -13999 -7382 6953 6921 -5190
6191 -5190 -8058 9217 28731 20431 -663 -19809 -28339 -11511 345 -8190 1674 5537 -16775
6178 -16775 -34753 -30353 -21459 7230 16135 4764 -11257 -24570 -1318 -13265 11397 2270 -10379
6165 -10379 -9724 -19848 -32731 -38640 -27217 -22338 -6516 13370 8182 -607 -4507 -6989 -1147 -2241
6151 -2241 10108 29125 26957 12867 3499 -2456 11865 -2017 -17020 -9347 -5860 -12487 -20007
6138 -20007 -28711 -25940 -24797 -25705 -29447 -17652 -16144 -28791 -18010 -5919 -22853 -28969 -22800 -24639
6124 -24639 -22029 -22747 -9016 -14785 -24758 -22703 -11957 -17832 -13503 3912 -3567 -12520 -10848 -9305
6110 -9305 1714 6970 -1496 -13109 -2533 3670 -2910 -1650 -9733 -9146 -11516 -22231 -38474 -24643
6096 -24643 -8055 -23434 -19811 -11816 1587 7357 4061 -8589 -16150 -27780 -48509 -50538 -34914
6083 -34914 -13042 -693 2985 5976 17895 3343 -12340 -15785 3250 7197 2102 1222 290 -28586
6069 -28586 -39711 -29700 -25122 -35410 -31349 -24343 -24299 -19241 8272 -539 -7129 564 -19810 -8009
6055 -8009 -17492 -20188 -7888 -24877 -28062 -23761 -31975 -35021 -17284 -13599 -21057 -17939 -5660 24349
6041 24349 3303 -32129 -52550 -52286 -20951 -12702 -16204 -25928 -30540 -40567 -23615 -12075 2691
6028 2691 2930 9347 -2463 -25030 -24603 -12480 -6033 -3866 7961 2835 -7292 200 12405 15153
6014 15153 18749 757 -5706 12482 29272 30492 21695 14607 28884 29764 5796 -5798 -9994
6001 -9994 1277 16580 25654 22891 1948 -10489 -11957 -15981 -23544 -22298 -42174 -55616 -49279
5988 -49279 -21126 -25619 -10327 -80 4365 12130 -1315 -13950 -32584 -15829 -12664 -21127 1630
5975 1630 26352 12094 12644 9706 -859 -1230 -25511 -49247 -45596 -24909 -27990 -15130 -5270 -5739
5961 -5739 -8873 -13062 -8060 -7430 -7054 -11979 5040 23232 27046 22046 25352 14837 2395 10645
5947 10645 18940 13635 -4623 -11549 -5554 -8822 -30036 -29348 -22001 -12214 -17173 -11623 -5391 18228
5933 18228 14114 -13917 -32384 -24318 -3861 14215 -16715 -36495 -27349 -28584 -52647 -45854 -51424
5920 -51424 -37196 -32015 -40418 -45279 -53748 -43558 -46576 -43531 -34577 -16312 -25541 -28552 -28044 -10372
5906 -10372 -14551 -30611 -22941 -23071 -7593 -14439 -20147 -36428 -31987 -26706 -9149 2695 -23587
5893 -23587 -18509 1719 21297 8997 -8480 -18828 -33257 -29658 -15574 -16318 -13133 -14352 -25643
5880 -25643 -27016 -41247 -32296 -15803 -13626 8497 5363 12082 24922 30739 4740 -16291 -6490
5867 -6490 -8103 -30958 -33133 -20904 -9953 -13045 -17388 -1323 -873 17549 14350 9253 20337 -256
5853 -256 -18697 -10280 18321 12397 -194 -8207 -12157 -20439 -27254 -20803 -18576 5534 -104 -16136
5839 -16136 -23930 -11554 7132 31049 10341 -17185 4418 15467 6586 25019 28412 29079 11638
5826 11638 11680 15704 12274 7198 1752 -12422 -26812 -27321 -15476 -4573 -4514 -17741 -18475 -14297 -16576
5811 -16576 -9855 -17608 -19555 -7189 6180 -5958 -14561 -13116 1120 5426 5587 12881 20724 21312
5797 21312 -77 -9670 -28189 -16010 -6272 -14290 5761 32187 24917 9709 14328 3122 -21944
5784 -21944 -21118 -5233 -2574 18552 27527 34044 46957 38285 43879 28948 27527 28148 16480 -6999
5770 -6999 -11464 9015 27323 16151 5163 6523 6309 20438 20867 6735 -948 -3990 -8452 -13250
5756 -13250 -11055 -19895 -28632 -22465 735 14177 13512 2132 -22690 -27670 -13164 -6233 -1673 -24321
5742 -24321 -38913 -37182 -30290 -13851 17127 29404 2140 -18605 -7691 4217 -2455 -1427 3604
5729 3604 14583 25882 12065 3807 3288 -11464 -18773 -12283 11701 19537 1587 -2294 -3953 -2724
5715 -2724 -27682 -40802 -45708 -25525 -7571 -7095 -15687 -25936 -30307 -7462 7222 2765 -13643
5702 -13643 -9683 -15035 -26053 -8860 683 -13488 -5540 -9202 -5270 420 -23098 -17801 -7147
5689 -7147 2191 8767 10851 -6028 1683 -6151 -4802 8555 152 -4590 -18617 1373 1185 3194
5675 3194 81 -13370 -24177 -24558 -11084 15241 7747 -9243 -7909 6091 1280 -9413 -16477
5662 -16477 -21943 -13859 -1449 -6170 -7631 -3302 1181 -5297 -1285 15347 14231 -4489 -5092 -11534
5648 -11534 -11366 2784 7783 -1626 -11037 -19184 -18397 -6000 4727 15266 26921 29395 20428 -8310
5634 -8310 -19673 7046 16255 10042 -11486 3498 8409 -1444 7557 33444 30781 8130 -10121
5621 -10121 -22747 -35281 -43048 -49102 -46242 -56445 -42732 -28446 -27512 -13345 365 27501 35741
5608 35741 45886 18288 14302 11998 14722 22625 15080 5907 -9618 -12457 -2347 -32832 -26902
5595 -26902 -28434 -28644 -36057 -27160 -24278 -4978 28011 38446 30230 24566 13025 16581 -15567 -14632
5581 -14632 -21435 -16057 -21058 -32052 -26763 -7827 -4895 93 -28928 -34305 -13803 -22349 -25238 -16369
5567 -16369 -8885 -6983 -10483 -7469 4303 19476 4567 -8647 -5156 16476 40448 42954 27418
5554 27418 -92 -9688 -6837 -7877 -1175 -2393 3765 13150 3573 -8440 -14780 -5203 -3665 7288
5540 7288 -960 -16611 -28928 -21091 -9643 6276 12513 25768 28345 23774 23006 3035 -13957
5527 -13957 -2424 -5503 -8265 381 -17122 -19535 -3712 5427 4344 -5952 -29856 -42325 -50609
5514 -50609 -34961 1927 30299 13975 14108 12094 17370 -1043 9259 19226 22726 -10883 -29990
5501 -29990 -41411 -24127 -4330 4471 4064 10703 10175 7811 18515 3886 18805 30676 12393
5488 12393 -1491 -8669 -955 -18717 -23640 -5630 2034 3126 4960 6644 -5226 -23264 3839
5475 3839 10824 21027 17957 -8476 -30815 -37147 -29143 -18875 -15248 -30670 -13001 -24558 -38492
5462 -38492 -15650 -797 6380 -8196 -10291 25023 18181 24265 42643 13583 -13978 -12132 -17983
5449 -17983 -12816 -8499 -1786 22739 15019 9003 962 30467 40061 10817 6501 3892 1272 14536
5435 14536 2007 -14965 -3736 -3313 -12976 -24401 -7475 -1861 -7316 1758 -8761 -13991 -15346
5422 -15346 -3037 14211 23702 -2718 -6790 18092 28411 33843 22981 14405 1045 -15051 -14599
5409 -14599 -9235 -6936 -9767 -19173 -31199 -29307 2119 15171 15799 -6940 -18369 -17983 -9880 -8322
5395 -8322 -8443 -35270 -25344 -36880 -36403 -32017 -40733 -39500 -40064 -3058 29269 5981 -3941 6086
5381 6086 21855 24310 10832 2864 -1364 1793 -3633 7947 8356 -18823 -18080 -9253 -9796 -28245
5367 -28245 -30597 -21008 -8173 7295 15199 -4803 -14715 -15980 -10780 -10113 4086 6480 21298 15943
5353 15943 -10996 -26593 -28861 -26214 -26861 -28087 -29844 -19277 -10738 -30592 -8715 7771 8313 -1006
5339 -1006 435 -4409 14055 4422 -9452 2994 30836 5407 -21498 -18951 -12510 -14649 -2551
5326 -2551 -28422 -49137 -37248 -14271 -3755 -5283 -22622 -19667 -4501 13599 28318 14478
5314 14478 -1714 -6146 -20059 -10002 -13506 -3214 -3506 -5711 -30738 -35066 -2983 13018 11915
5301 11915 11576 12701 17145 2278 -8717 -217 17167 14588 -3251 1023 21782 17671 -7400
5288 -7400 -14946 -14801 -6545 -2460 -17285 -11247 -3092 6073 2737 -15467 -19351 -25925 -13455 -45041
5274 -45041 -54495 -52542 -52049 -19434 17011 -1438 -18610 -16119 -5636 -9467 -6948 7102 -2186
5261 -2186 -9746 -7985 -12321 -10456 -11059 -23015 -19077 -7890 -17657 -27240 -20729 -24906 -11186 15009
5247 15009 11593 11365 -2515 -13358 -8779 -22534 -21547 -11144 -4665 -21893 -28562 -27943 -23645 -28431
5233 -28431 -23722 -23130 -12915 -17487 -30595 -25335 -2418 5136 10892 23191 11683 591 3439
5220 3439 -6605 -1914 6773 3930 -7159 -9417 -6829 -15424 -18420 -16262 -15572 -33268 -42230 -30285
5206 -30285 -41655 -41664 -33215 -44047 -39215 -25172 -33932 -37065 -16753 11665 32902 32963 12755 -5461
5192 -5461 23963 33719 40711 33873 32644 28250 21696 32089 36654 34002 24681 7568 28786 40724
5178 40724 24577 19511 31913 43603 44726 53812 57229 40483 19931 25288 38626 38735 22035
5165 22035 35 6929 10196 -2371 2698 18861 14048 -12312 -22378 -32250 -26489 -7281 8621
5152 8621 -660 -8940 -13344 14444 30744 9753 -7550 -9213 15633 10308 315 -10495 -9490
5139 -9490 -9002 -11749 -25720 -18494 -29526 -34870 -15178 7878 3370 15675 17973 -10923 -18124 6631
5125 6631 23406 16042 -15160 -30403 -16417 -2350 -1041 12038 22046 18032 9817 -5866 -8813
5112 -8813 -8672 -18999 -22961 -27672 -22730 9367 3249 -8122 -16809 -6042 -12950 -39750 -44003 -20088
5098 -20088 15932 21402 20562 20450 18884 18671 7566 -5059 -11259 -4494 9968 15719 11557 16986
5084 16986 10662 9604 13834 22124 17817 25255 35213 52059 59672 36720 25508 4542 -8505
5071 -8505 -17087 9702 30484 49668 50365 22433 9838 8693 -13734 -2736 18977 10736 8843
5058 8843 -4170 -6740 -14719 -7957 -15487 -29721 -11916 1046 20356 33868 12514 7290 37120
5045 37120 42654 22397 6390 -1624 -13122 -2215 10512 -4598 -16235 5357 8296 -16355
5033 -16355 -14690 -10065 -14824 -3684 27426 16309 6856 9615 1842 -10340 -10020 -23072 -27392 -21326
5019 -21326 -13256 -10457 -18895 -10301 8703 -4735 -19012 -10429 -22751 -14559 -7044 -7799 -5281 3165
5005 3165 -11059 -25248 -28736 -32114 -10092 -10794 -30506 -39342 -26998 -19589 -7187 -16580 -12624 -14180
4991 -14180 -16919 -17596 -18191 -29103 -35192 -34424 -47440 -56316 -32421 -8230 -14986 -48413 -58650 -43764
4977 -43764 -5877 25262 23447 16093 14817 23548 16708 -1323 -591 7532 9022 9265 -1009 5043
4963 5043 7115 -10606 -4644 -4961 -11028 -9792 -17866 -30325 -35335 -30640 -15161 -19545 -32831 -33027
4949 -33027 -12403 -10990 -12735 -26403 -23990 -28887 -30533 -17113 2770 -5363 -4718 -16588 -18997 -6013
4935 -6013 16280 11941 9235 -2950 -34153 -23579 6805 -13078 -40162 -26414 -15456 -945
4923 -945 21756 15763 -272 -27330 -34780 -28614 -17138 -21912 -38232 -18339 3566 29591 6196
4910 6196 -2481 8812 204 -7513 -2387 -14576 -8068 11939 30312 31518 43302 35720 22404
4897 22404 3894 12542 28669 27519 19290 21240 -11804 -29731 -28011 -16477 -4842 7346 5809
4884 5809 -380 7132 28600 29303 26780 28034 27179 22706 35255 35060 19721 8750 3958 -7644
4870 -7644 -3008 8139 23863 26680 17271 7878 12230 17060 20050 9453 1722 -3888 5519 4056
4856 4056 -12778 -6323 7912 12566 -2603 -1909 -5619 -10295 -16031 -8581 -2880 -9416 -10711 -10693 -19774
4841 -19774 -33303 -23166 -9204 214 -10290 -14685 -14764 -26133 -38095 -18697 1909 20063 34810
4828 34810 1838 -23027 -26373 -11478 -1525 3635 18244 31439 13189 10379 18692 15882 13157
4815 13157 11076 -377 -10089 -13337 -14970 -10649 -12784 -10773 -2330 17424 8683 -16576 -29123 -967
4801 -967 26639 12185 -4290 -900 16185 23510 41986 40072 41841 34635 30528 -3328 -36577
4788 -36577 -24228 -4592 -6902 8577 15778 31477 21054 16976 8818 11604 -11714 -14127 3764
4775 3764 25376 11859 -19478 -44394 -33867 -36398 -34856 -6850 24964 20951 4963 -698 -9716
4762 -9716 8627 10528 11891 12410 4735 -9668 -14092 -25371 -33141 -9165 2946 16878 6440
4749 6440 -14507 -40823 -27106 -9340 -1394 -4293 -499 208 -411 -14964 -10361 3606 -2803 422
4735 422 -6859 -15776 -35500 -28368 -8050 -3657 -11128 -12049 4578 7566 10549 -9276 -18650 88
4721 88 20550 31376 34961 5672 -6835 -13386 -11008 -22421 -26049 -6439 -1165 -1823 23018 29513
4707 29513 20424 17261 8077 -674 -14963 -7558 4233 18614 27537 37730 33540 17574 11064
4694 11064 20393 28240 30597 31336 10849 8596 22622 26353 21482 -2190 -22479 -13622 -8952 -5122
4680 -5122 998 -3561 -36564 -67454 -54373 -19777 -10045 -7482 -13112 -33322 -28406 -10486 5059
4667 5059 4918 -11858 -8908 -12101 -3011 8546 7532 19291 27866 17391 17755 20212 5842 7564
4653 7564 14057 -13451 -34501 -33448 -13724 -23048 -38461 -45601 -32038 -9286 22273 36031 18966
4640 18966 1351 -4150 -10216 -18242 -25611 -23585 -14236 10830 13311 -6530 -17362 -25336 -10822
4627 -10822 -14319 -9168 -9945 -3292 13658 6633 4900 21279 4892 -16555 -28172 -22173 7266
4614 7266 23197 15786 6049 -3402 4169 -1743 -4324 744 10133 1511 20346 9703 2171 841
4600 841 5111 4544 10142 7794 -10561 -22600 -37042 -22875 -5060 -15012 -30110 -32061 -26637 -30182
4586 -30182 -25338 -12581 -2655 -28365 -8109 9519 -10155 7753 34275 46263 45346 47555 30042
4573 30042 -7857 -5855 7375 3189 10270 -5013 -17473 7779 9959 -1446 -14987 1368 -10538
4560 -10538 -38321 -48932 -38433 -16952 -15193 8637 -3116 -5482 -4506 856 -3976 12022 31500
4547 31500 20402 10060 -4665 -31820 -26167 -13563 -6100 -1226 -13726 -21222 -25523 -29517 -24258
4534 -24258 -24723 -23092 -23040 -4298 -6752 -3702 -9003 -13755 4522 10175 8685 7497 964 11269 27102
4519 27102 19969 8510 11225 5328 -13603 8139 4248 -13804 -39994 -45248 -38053 -23703 -21400
4506 -21400 -6892 -13462 -21559 -16461 -7283 -9937 10658 11249 16215 7924 -2933 -13246 -26850 -17789
4492 -17789 -26383 -27694 -38548 -46652 -43969 -33228 -2586 -473 8066 16084 23297 14132 2358 3017
4478 3017 13957 7343 3641 10986 -3133 -2891 -18876 -26639 -30890 -17390 -3583 5462 9533 4628
4464 4628 4161 -6387 -15095 -25321 -36932 -31251 -1177 23409 2089 -7502 16502 -3547 -5122
4451 -5122 -2338 -4827 -16371 -22609 -15590 -22164 -44307 -51073 -35549 -22224 -10080 2620 4661
4438 4661 -17240 -22879 -5664 -380 -14841 -411 4239 8261 5520 -9032 -20900 -2420 -7905
4425 -7905 -4128 -2810 -9301 -4148 18132 14290 -3022 -8342 -13896 -15609 -9171 409 906 -987 -1132
4410 -1132 -9584 -10988 -14774 -28297 -17369 -2960 -16542 -32570 -22993 -11439 -16179 -19870 -6015
4397 -6015 -4559 2948 5050 19218 18425 32395 33484 18413 -2404 -248 10860 13206 -15655 -17968
4383 -17968 -10383 -1463 8311 393 21940 16411 17429 15326 13376 -8097 -26431 -14252 -6482 -16711
4369 -16711 -4039 19176 25696 20535 -5918 1634 20855 15133 -3672 -27303 -41710 -38861 167
4356 167 23046 -3406 6283 24574 31980 40167 31983 21788 13278 22521 26430 14172 -13813 -34594
4342 -34594 -28253 -32056 -29030 -21312 -22330 9254 34260 19192 7386 13079 8713 1290 13045
4329 13045 1477 -7664 -22807 -8701 340 -5844 -571 10144 28910 33126 21358 5571 937
4316 937 5521 22145 18967 -6791 -36934 -32057 -9083 -12175 -8581 -7182 2472 9635 -1424 -7573
4302 -7573 -12059 -17808 3370 -2642 4010 3503 9970 4086 -3247 -24641 -13571 11192 16957 21152
4288 21152 11055 8031 20024 9306 2767 3977 46 -2019 -2073 -13803 -24507 -14908 -29553 -13565
4274 -13565 18814 37836 23507 13619 -13484 -16994 -37286 -37722 -35623 -29427 -21154 -14687 -4707 -7606
4260 -7606 -6446 6743 5195 -8036 -16068 -6743 -7942 -867 -12718 -6900 -1717 724 18487 17503
4246 17503 13511 -540 -3724 9796 695 -5793 15555 41980 33050 44687 33642 9965 -35309
4233 -35309 -25635 -10054 319 -842 9034 38013 36616 28603 8801 16577 7054 7965 -15597 -44129
4219 -44129 -36173 -11861 -3621 -6230 -5370 -6202 3435 -4000 22183 30944 28514 22545 16347 27987
4205 27987 29052 31066 19845 15805 20875 16007 18510 39197 39990 35329 10910 11742 5799 -6277
4191 -6277 -4407 -3412 -10125 -9841 -2997 -13789 -21528 -3540 -10457 -12314 -10667 -5353 5119 8871 11483
4176 11483 18613 10011 -4675 -2648 12995 -1515 -15712 -27631 -44393 -42064 -30413 -23279 -3812
4163 -3812 23970 31937 26542 33326 50893 40461 3455 -1310 17535 31359 35901 22509 -2257
4150 -2257 -16214 -10135 4392 30499 13775 4402 -10384 -16091 -10874 32050 49509 22830 16497
4137 16497 4451 11217 10729 -17468 -4795 301 22137 30849 32192 21881 18670 11063 -7793
4124 -7793 1494 5211 19571 30887 21338 10041 5292 -2142 3876 1735 -9782 -1041 13436 -827
4110 -827 -27367 -29625 -35858 -39099 -36258 -22617 -4792 -1157 -2912 -999 -2694 -3667 -7052 -13100 -25408
4095 -25408 -28697 -32175 -7787 -10072 -13387 -14449 -26715 -20952 -27068 -28969 -21656 -9313 -11425 -13903
4081 -13903 -8172 6836 12947 9268 5651 -4538 -9522 1505 10629 12984 26743 19589 -16941
4068 -16941 -48838 -50135 -28064 367 -13671 -24617 -20311 -10045 -10905 -8768 -6083 1743 470
4055 470 10362 11182 12742 14735 11816 11633 -11327 -26246 -21372 -6629 15889 5946 -8710 -5509
4041 -5509 8493 -12326 -12512 -1208 -11385 -5554 6785 8132 589 -12227 -21489 -10912 2795
4028 2795 4057 19608 21217 19884 22967 15797 60 -23925 -1825 -1367 -25966 -29822 -14197 -19472
4014 -19472 -14758 -865 20364 14054 -6468 -16631 -5355 1862 -20726 -43425 -38630 -25712 -12407
4001 -12407 -10802 -1882 13141 25242 10971 -5913 -6269 2560 5440 -5410 4135 8018 14426 -2101
3987 -2101 -6890 4735 914 1407 12836 6260 3226 -12339 -8743 18420 9388 509 4612 16913
3973 16913 6836 5752 -1304 -13661 10554 27948 29342 -3537 -26459 -40429 -42722 -32812 -32752
3960 -32752 -35987 -36226 -14468 5410 22137 11898 4940 -8781 -12550 -9308 -8674 -7887 -6976 -17061
3946 -17061 -15780 -1428 -393 -2195 -1983 -7957 6104 17629 23779 32999 37683 28843 22740 3024
3932 3024 -2678 -9484 -6905 -14161 -1238 -417 -11851 -3287 -15865 -32697 -33354 -25891 -34223 -35794
3918 -35794 -30906 -28103 -700 -2467 7798 8164 6092 -16453 -12287 -2620 -9374 -28758 -32184 -22099
3904 -22099 -28579 -6490 -8980 -11583 -3132 -2939 241 -15327 -20101 7008 31854 29299 24580 31507
3890 31507 27995 8300 -7027 -24125 15012 20341 1657 -4929 -15408 -14625 -8386 14714 19859
3877 19859 15805 27814 28435 24554 19774 12374 9055 7085 -7047 -22397 -11425 6375 3957 -8720
3863 -8720 -19221 -6982 -5621 -26948 -25675 -20475 -1941 8091 -11663 -31662 -15064 -4085 -27881
3850 -27881 -31381 -20029 -9758 -17510 6019 6300 -12021 10451 31578 37931 18893 14714 14645 17759
3836 17759 19609 18339 -3799 -25843 -39413 -27166 -10920 -16908 -21012 -28136 -11987 3397 27812
3823 27812 33435 30539 21257 12607 -7824 -17654 4360 8548 -4546 7975 25516 23656 17983
3810 17983 27157 17012 4149 8626 17691 8862 18614 29608 36970 62948 66358 46149 40109
3797 40109 52122 41731 33463 20992 10511 4348 -5655 -1990 10889 7066 -12324 -20172 -10237
3784 -10237 -313 -12889 23500 21274 10739 -3349 -16737 -9730 -10292 -24250 -12888 2799 788
3771 788 -11497 -15024 -7131 3354 -5804 -19502 -15157 5259 16940 7172 -10732 -11622 -13466 8970
3757 8970 12779 -13494 -11860 13947 2909 -8508 -15371 -704 17086 36316 50801 14015 -13449
3744 -13449 -27346 -32453 -34842 -19149 -2396 -3152 -10422 1604 10281 16607 12677 -12099 -18974 -10107
3730 -10107 -3830 7084 9117 11336 3518 -7884 -400 8854 14948 17763 37421 40693 22431 7333
3716 7333 -20129 -36240 -33315 -15470 754 -27343 -1240 22461 24131 6079 -2013 -10954 541
3703 541 -18058 -14254 -2421 8634 18939 13134 7032 12939 1844 4853 5846 6693 -26816 -18416
3689 -18416 -21225 -23878 -17528 -24213 -24131 -16404 -18563 -25023 -18992 -20613 7532 16925 2661 3327 17058
3674 17058 543 -5507 6585 15144 18824 8720 -7010 -21523 -19561 -24020 -13373 7957 28726
3661 28726 35992 16005 -9801 -11480 -12216 -3282 -7668 -1074 -2196 6472 17441 21508 1214 830
3647 830 -2303 -7737 -11968 -9208 1622 1143 -14122 -24596 -21040 -5700 -21693 -16936 12127 24372
3633 24372 349 -36606 -41178 -35442 -7559 9010 11367 -15013 -26764 -3908 -8725 -16332 -27230
3620 -27230 -35937 -32658 -18524 -7675 -29130 -27533 -6710 1049 -9021 -18721 -32452 -22283 -5403
3607 -5403 -2431 -12178 -10028 -9472 -5034 27485 20641 472 -1418 22482 33269 33351 27387 553
3593 553 4897 2476 15884 14773 12210 9159 32122 24687 21319 23093 19230 8362 -9025 7780
3579 7780 32639 38286 37963 29039 8429 5027 -16685 -27292 -18302 -20931 -25743 -12869 -4140 -6278
3565 -6278 -9135 -15318 -15915 2194 9471 18315 26693 32130 28080 35650 32763 21557 11063 3707
3551 3707 14572 16708 7416 6102 15445 28239 27605 17500 9121 -7726 -8882 -89 -6886 -13368
3537 -13368 -23164 -21628 -18840 6720 4581 -4541 -19532 -32042 -42185 -29944 -4427 10600 -2848
3524 -2848 -12660 -27823 -33700 -23929 -8293 8065 10165 14023 17724 12869 17994 581 -14520 -18069
3510 -18069 -19998 -8330 -28528 -41459 -32394 -34734 -17155 -4583 3345 12998 12460 5724 -10221
3497 -10221 -7457 -6546 -29504 -24028 -22148 -26334 -8549 -1638 -15868 -35839 -22338 5202 14247
3484 14247 13709 10274 -12366 -30463 -39066 -36770 -21827 1616 -19209 -25701 -16536 -23721 -25871 -8664
3470 -8664 -6495 11174 18176 10913 -5970 -2005 752 -14442 -18292 -26474 -32946 -38551 -42832 -38556
3456 -38556 -22128 -11574 -9539 -26196 -21007 -30957 -52265 -41925 -22087 2523 4639 10801 21541
3443 21541 29021 19554 1096 -15885 -4327 768 2889 -10260 -5182 -8323 -20516 -17438 -9178
3430 -9178 -4375 -10234 -5576 -5411 -21605 -20572 -50 -2080 862 -2743 -13840 -31345 -54944 -43077
3416 -43077 -16062 5989 6891 4595 10381 -2414 -19891 -2860 -6092 -11256 -3810 -1373 9704
3403 9704 21926 15016 15285 1994 -9573 9544 5813 1619 -4712 10044 8479 -18606 -45914
3390 -45914 -34144 -5860 8246 20099 6872 -12477 -31519 -46522 -37068 -20314 -25703 -22100
3378 -22100 -21690 3852 15772 8910 2958 -13760 -31586 -24866 -30444 -8111 -1843 8997 22489
3365 22489 26328 -3534 3954 21048 6804 -2796 -7873 -35292 -43356 -22420 -11797 -15048 -13564
3352 -13564 -9280 209 6702 -2721 -3606 3495 -3166 -12640 -26398 -21908 7342 22731 21520 13701
3338 13701 22533 17799 10164 5351 13881 17108 -10121 -22706 -10092 -3523 -195 12119 12115 9270
3324 9270 21748 -2115 -11977 -4514 -1604 -8623 -8416 -14961 4287 30782 8055 -8505 -21354
3311 -21354 -16415 -11708 -20379 -8570 -11306 -15111 -13813 -17947 -26682 -25641 -15742 -14700 -23108 -26652
3297 -26652 -21119 -20711 -15962 -15567 9427 3570 -7263 17016 16496 -4712 -19972 -27661 -14558 -12615
3283 -12615 -26974 -32055 -17368 -17017 -14138 -17556 -17635 -4861 5669 10638 -1672 -3233 14544 15273
3269 15273 27850 40878 31934 18116 17679 24348 8261 -6178 -8544 -4727 -12404 12090 22041
3256 22041 27982 27443 -3256 -28622 -3628 19376 6766 439 10664 11601 5217 -3249 12659
3243 12659 -1376 -16409 -6944 -4589 4409 7313 4122 -16963 -15563 -6422 -10112 -516 10947 1308
3229 1308 -6065 -4464 -4152 28 -1405 -20378 -19109 -11312 16579 6275 5602 -1941 3706 12726 21086
3214 21086 22828 4686 -22942 -10376 2028 -3203 -20382 -14157 956 -5012 -6422 1502 -5894
3201 -5894 -10226 6279 21735 -4084 -21537 -4067 1588 6157 -3987 -17180 -17997 -16110 -9730
3188 -9730 7473 28431 22667 16910 16712 10544 3347 22815 36758 36755 27998 32610 510 -5929 5041
3173 5041 6771 17190 16327 5998 5254 433 5472 2693 -4196 -10773 3029 9723 21864 14925
3159 14925 1170 -19977 -33793 -12963 4559 1101 -10091 -3163 -5591 -25755 -19954 3613 1476
3146 1476 20094 26511 33689 27333 35197 17246 973 -23270 -26644 -9684 7989 20686 21466
3133 21466 14879 6717 5005 13993 12411 4355 13681 12741 17784 13551 4164 -4663 -18101 -14051 11585
3118 11585 11281 9607 -3119 -5402 -28979 -37353 -13692 -6277 -13636 3474 4225 -2306 14905 4069
3104 4069 -5051 -7856 -12444 -11956 -7321 15288 11373 5353 29345 52390 38927 26457 5214 31249
3090 31249 49060 40283 17083 109 1957 16902 21238 17294 17199 11916 10857 12897 -4175 -9700
3076 -9700 -13558 5018 17513 5039 16240 7343 -13202 -27824 -36137 -33394 -39314 -36049 -19626
3063 -19626 4693 6734 9703 15208 4379 2499 7835 6062 13932 21293 6386 12089 14419 26673
3049 26673 22094 10020 12108 16776 21762 27976 18600 28499 38246 31615 6294 -2516 -7583 840
3035 840 4513 10112 671 -8308 -13655 -15296 -24988 -16071 -6961 -12389 -9427 -27715 -40437 -35741 -30325
3020 -30325 -20564 -7360 -6800 -4781 9536 1402 -5931 6776 38312 36682 12778 -13735 -24595
3007 -24595 -13614 -8283 1495 -1203 -20254 -38410 -27092 2577 16726 17328 23427 -4776 -27851
2994 -27851 -40506 -48026 -28377 -24023 -34452 -32534 1258 17241 7266 21579 9229 18609 19452
2981 19452 32211 19838 -6977 -19536 -5369 4033 -875 265 -10604 -18532 -23192 -17078 -2106
2968 -2106 -5944 13093 1837 -7333 13013 21917 13629 8969 13254 10884 3059 -8278 3053 11934
2954 11934 18175 19014 20822 23045 10512 -827 -760 -128 16336 11013 21051 4432 -17701 -26143
2940 -26143 -14905 -2643 -4027 -3316 6750 758 -16959 -7171 23984 17165 7907 13181 7698 -18270
2926 -18270 -22047 5563 13989 -2657 -18414 -9357 -4159 22454 31263 16518 15171 23577 13248
2913 13248 -157 -2919 -2527 879 1985 7993 14224 21667 14913 1515 14061 27876 19051 23588
2899 23588 7598 5970 -924 6153 1667 2540 8289 19277 14727 28628 16784 25536 32986 32150
2885 32150 20730 18722 5679 -16875 -12280 10265 14169 -5645 -43855 -47110 -32321 -36342 -35641
2872 -35641 -4299 19053 36269 26820 24165 16000 15446 18086 42107 55213 68771 60603 40436
2859 40436 7304 -9587 -7994 -14006 -6572 19482 37172 28465 15246 5267 12270 10626 -5151
2846 -5151 -10383 -7553 -1026 15917 27693 11704 -19781 -18761 -9055 -6319 -7178 7972 9326 16356
2832 16356 -53 -12954 -19435 -10129 -12703 -6575 6092 16204 21460 19171 17723 34 -19607
2819 -19607 -21839 -24663 -9507 15132 27933 28292 572 5683 31883 30403 16332 24478 6947
2806 6947 13824 16695 6841 14273 33550 33211 18932 28973 24864 7476 -4810 -22208 -18546 -9317
2792 -9317 -30708 -19806 -12268 -10209 -7299 -10033 -13011 -15730 1888 -9555 -35144 -41643 -31086
2779 -31086 -17499 -628 -8387 -12250 -23444 -13279 8966 25299 19160 8380 -889 -6653 -9498
2766 -9498 -12067 -24817 -12489 20660 40868 48352 28220 7903 10992 8375 -2261 -12983 -17580
2753 -17580 -6226 -10302 -25505 -25152 -17499 -16683 -23055 -22231 -22734 -11251 -9464 -21054 -34734 -31190
2739 -31190 -24665 -14674 -5348 2156 -4561 -19591 -21210 -18662 -7074 24550 42354 30604 17709
2726 17709 4760 7454 8533 -6142 -24458 -33604 -5368 7443 12334 26209 33762 14266 11806
2713 11806 16274 10680 -13386 -17803 -5675 10011 20925 8315 -8381 -9235 -13867 -24196 -2190
2700 -2190 22841 24361 31815 25071 49034 46715 29927 7699 4579 4256 -6889 -5401 -4445 5374
2686 5374 19882 11357 -6014 14180 48662 43679 22472 14665 -5120 -12451 -9459 -9585 12334
2673 12334 24973 21901 28917 18423 15463 20951 18215 25685 19087 15546 2708 18511 10986 21704
2659 21704 3122 -10768 -11138 -10204 1742 16260 7370 13600 13279 8218 6680 11958 19848 4182
2645 4182 -17897 -11159 -14220 10813 40546 40339 26129 26488 33377 38593 42868 28714 13895 -412
2631 -412 -12659 -2666 -20857 -1296 4045 10452 -1647 -394 3021 -7261 -17506 -12804 -16775 -9829
2617 -9829 -4948 4607 14827 22528 25826 12454 -6522 -4879 18184 32143 36509 31451 17878
2604 17878 1181 20465 26955 21961 16938 16174 733 7489 28350 1216 -29323 -24021 5141
2591 5141 -6059 -32321 -25632 -10431 165 21600 15904 8860 1968 2027 9914 -21251 -21326 10922
2577 10922 40086 54599 41477 25148 17147 -6987 -5725 -12284 -20242 -11686 5078 -3222 -17784
2564 -17784 -26721 -34686 -25219 -7331 7659 -3911 -10150 -8711 -10807 15294 36103 6433 -19025
2551 -19025 -35407 -25988 -31724 -2074 11653 37101 28080 30444 10383 9699 33610 27043 17872
2538 17872 30355 14967 4337 -4061 -2092 7232 17198 16013 17908 1012 -7351 -2667 3081 -10739
2524 -10739 -29472 -32672 -30285 -9915 -19154 -39557 -27148 -16185 243 4302 12029 9265 -1283
2511 -1283 -16367 -10990 -8039 2537 -8918 -13828 -17734 -22208 5053 14497 -1571 -11276 -12594 -16904
2497 -16904 10959 7714 16364 -2095 -6879 -31860 -35405 -2696 37224 36816 26851 28857 13339
2484 13339 25521 21233 24725 26219 24707 14014 -952 -1502 6473 19477 10859 4421 4121 7102
2470 7102 -18593 -11259 9926 16167 -2386 -13991 1348 -2638 -27585 -7424 -7866 -10083 -1899
2457 -1899 3535 8004 13284 37012 26509 37176 37352 35824 31627 17697 2507 2082 314 5612
2443 5612 15868 12113 -3638 -12233 7087 -3790 -4451 24615 27019 12325 12617 13701 8528 12648
2429 12648 11212 5994 6340 10315 1308 -2995 12961 1625 979 -17825 -21088 -10447 8138 14848
2415 14848 7860 2960 22007 32816 23141 -428 6025 16218 12009 5004 1177 15002 29224
2402 29224 28063 -2559 -20057 -4177 13168 6446 19917 25451 29612 27427 22616 10027 -3652
2389 -3652 -2244 -7549 -20204 -11545 -4322 7369 3013 2735 -9285 -34212 -46933 -25714 -5345
2376 -5345 1401 9363 9867 9273 -1921 -4307 -9636 -3085 -808 2728 11925 -503 -23463 -27229 -20121
2361 -20121 -19481 2054 21960 24699 4855 -4713 2967 6553 12666 22259 11180 -2286 -22908
2348 -22908 -25528 -16120 -9640 5439 -2151 -18284 -33720 -30636 -11679 -10635 -36406 -48648 -30606
2335 -30606 -12882 -33038 -19122 -12496 -12870 -19770 -18402 -27581 -24259 -18917 6452 19760 10405 5688
2321 5688 16323 27601 18064 1520 -18521 -40283 -43324 -28596 -7835 -11789 -18681 -16852 12723
2308 12723 38089 28694 18407 7694 947 -7722 -14488 -21480 -639 -412 4784 -3533 -7958 -1286
2294 -1286 10665 -744 1815 9100 -4333 -11350 -16676 -2574 342 -9080 -11620 -16002 -4724 4016
2280 4016 -3783 -8867 -15501 -193 20720 11736 8835 -7166 -1003 22857 43301 32264 32497 15363
2266 15363 10574 5422 9266 -921 214 -5180 9674 13712 13095 15609 7959 2055 -22342 -1733
2252 -1733 19383 31857 31075 47142 41864 26337 26776 19518 7910 10562 9637 19523 15740 1312
2238 1312 -52 -13592 -1090 -2619 -5746 -17316 -19171 -19148 -6234 -9 19572 39578 19668 1286
2224 1286 5017 -5438 7135 33956 34886 16357 12507 12468 20154 28695 22702 3630 -6908 7585
2210 7585 4747 -17307 -17551 -10479 20996 18387 -6557 -7365 -12126 -22956 -8613 -2586 -856 5540
2196 5540 6133 -6564 9712 10497 -6119 -1080 -4942 -15460 -6318 -729 -12606 -33485 -25199 -9791
2182 -9791 -7852 3015 23236 9760 -9796 -5590 5517 1864 14622 14577 15944 30309 45666
2169 45666 32616 24050 31738 27708 27855 26832 22866 9983 18234 9117 -12978 -6691 3512 4731
2155 4731 -9747 -8941 6020 18842 16228 148 -12293 -1473 -11685 1313 14100 4513 2981
2142 2981 2594 -8652 -6164 2016 -860 -5639 -2163 -9415 -1028 13776 -2461 -8575 -4901 -2621
2128 -2621 -8351 -20959 -17947 5133 19060 5205 -17521 -13064 -21078 -10409 9487 5988 -8440
2115 -8440 -9035 1889 -1778 -25277 -39690 -44015 -24959 -14983 -1405 -11848 -18601 -7347 -264
2102 -264 6117 -9018 2469 8902 10724 16927 29935 24641 2025 1442 616 2875 -11056 -11077 7258
2087 7258 -4654 -5889 11696 2199 19755 27654 21651 22214 19768 6140 1874 2846 -11405 -6657
2073 -6657 -7682 -2839 3286 10055 15970 17751 20223 32733 27039 7037 959 -7299 -10268 -19899
2059 -19899 -13034 15762 35469 35447 32339 8934 -2000 1421 1648 -4776 -6216 14737 11722 3303
2045 3303 21843 14909 12480 680 14209 36673 15633 16278 -4674 52 5989 18589 20578
2032 20578 16445 14528 7898 4506 12314 9783 21607 18888 8353 864 12293 36129 23824
2019 23824 9924 -3807 609 -7373 -13840 -13219 -30579 -30476 8349 17310 19191 5026 1678 13439
2005 13439 11355 22880 43465 50930 29605 22474 12023 -5757 -2438 4414 -1831 212 13876
1992 13876 29376 27209 35772 34361 34902 30933 19103 9603 -463 -11564 -3727 -8768 -6239 -15885
1978 -15885 -26545 -34927 -23736 -16580 -4916 6878 6349 9751 40770 16992 9392 -621 12740
1965 12740 11862 -4527 -6284 20106 43618 39877 18206 10816 12887 -12899 -18104 -25890 -26058 -22056
$$ [...]
##END NTUPLES=NMR SPECTRUM
##END=
