##TITLE=Analysis number 329642
Compound Code rh 00720
Project Code adrs
Chemist Name aci
##JCAMPDX= 6.0         $$ Bruker NMR JCAMP-DX V2.0
##DATA TYPE= NMR SPECTRUM
##DATA CLASS= NTUPLES
##ORIGIN= Bruker BioSpin GmbH
##OWNER= nmr
$$ XWIN-NMR		Version 3.5
$$ Thu Sep 20 09:29:51 2007 GMT Daylight Time (UT+1h)  MAYBRIDGE\nmr@NMR_250MHZ
##.OBSERVE FREQUENCY= 250.131544655141
##.OBSERVE NUCLEUS= ^1H
##.ACQUISITION MODE= SIMULTANEOUS (DQD)
##.ACQUISITION SCHEME= undefined
##.AVERAGES= 16
##.DIGITISER RES= 18
##SPECTROMETER/DATA SYSTEM= dpx250
##.PULSE SEQUENCE= zg30
##.SOLVENT NAME= DMSO
##.SHIFT REFERENCE= (INTERNAL, DMSO, 0, 16.522)
##AUDIT TRAIL= $$ (NUMBER, WHEN, WHO, WHERE, WHAT)
$$ ##TITLE= Audit trail, XWIN-NMR		Version 3.5
$$ ##JCAMPDX= 5.01
$$ ##ORIGIN= Bruker BioSpin GmbH
$$ ##OWNER= nmr
$$ C:\u/data/dgb/nmr/ADRS/1800/pdata/1/auditp.txt
$$ ##AUDIT TRAIL=  $$ (NUMBER, WHEN, WHO, WHERE, WHAT)
(   1,<2007-09-20 09:29:28.59 +100>,<MAYBRIDGE\nmr>,<NMR_250MHZ>,
      <created by zg, POWCHK disabled, PULCHK disabled
       configuration hash MD5:
       76 6E 9A 78 1E 09 19 81 EC 84 63 8F B0 6A 59 2D
       data hash MD5: 64K
       B1 21 E3 FC 29 34 A6 FC 54 BC FB 8B 40 05 13 DB>)
(   2,<2007-09-20 09:29:41.73 +100>,<MAYBRIDGE\nmr>,<NMR_250MHZ>,
      <Start of raw data processing
       ef LB = 0.3 FT_mod = 6 PKNL = 1 SI = 32K 
       data hash MD5: 32K
       96 43 DB 28 75 0C 60 C4 E0 8D 1F 98 1B 34 12 E4>)
(   3,<2007-09-20 09:29:43.37 +100>,<MAYBRIDGE\nmr>,<NMR_250MHZ>,
      <apk 
       data hash MD5: 32K
       D4 0C E0 55 16 5E 70 4B 6F 46 3E 03 43 3E 1E 60>)
(   4,<2007-09-20 09:29:44.12 +100>,<MAYBRIDGE\nmr>,<NMR_250MHZ>,
      <abs ABSG = 5 
       data hash MD5: 32K
       B4 AC 0C 36 ED 5D 71 A8 9C 9A 8E 45 5E 2D F8 51>)
$$ ##END=
$$ 
$$ hash MD5
$$ 42 FE 6B 42 DE C3 2B 38 2D 99 2D 0E C3 C8 BD 09
##$RELAX= 
##$RELAX= 
##$RELAX= 
##$RELAX= 
##$RELAX= 
##$RELAX= 
##$RELAX= 
$$ Bruker specific parameters
$$ --------------------------
##$DU= <C:\u>
##$EXPNO= 1800
##$NAME= <ADRS>
##$PROCNO= 1
##$TYPE= <nmr>
##$USER= <dgb>
##$AMP= (0..31)
100 100 100 100 100 100 100 100 100 100 100 100 100 100 100 100 100 100 
100 100 100 100 100 100 100 100 100 100 100 100 100 100 
##$AQSEQ= 0
##$AQ_mod= 3
##$AUNM= <au_zg>
##$AUTOPOS= <7 >
##$BF1= 250.13
##$BF2= 250.13
##$BF3= 250.13
##$BF4= 250.13
##$BF5= 500.13
##$BF6= 500.13
##$BF7= 500.13
##$BF8= 500.13
##$BYTORDA= 1
##$CFDGTYP= 0
##$CFRGTYP= 5
##$CHEMSTR= <none>
##$CNST= (0..31)
1 1 145 1 1 1 1 1 1 1 1 1 1 1 1 1 1 1 1 1 1 1 1 1 1 1 1 1 1 1 1 1 
##$CPDPRG= <>
##$CPDPRG1= <>
##$CPDPRG2= <>
##$CPDPRG3= <>
##$CPDPRG4= <mlev>
##$CPDPRG5= <mlev>
##$CPDPRG6= <mlev>
##$CPDPRG7= <mlev>
##$CPDPRG8= <mlev>
##$CPDPRGB= <>
##$CPDPRGT= <>
##$D= (0..31)
0 1 0 0 0 0 0 0 0 0.06 0 0 0 0 0 0 0.0002 0 0 0 0 0 0 0 0 0 0 0 0 0 0 
0 
##$DATE= 1190276967
##$DBL= (0..7)
120 120 120 120 120 120 120 120 
##$DBP= (0..7)
150 150 150 150 150 150 150 150 
##$DBP07= 0
##$DBPNAM0= <>
##$DBPNAM1= <>
##$DBPNAM2= <>
##$DBPNAM3= <>
$$ [...]
##$SUBNAM7= <"">
##$SUBNAM8= <"">
##$SUBNAM9= <"">
##$SW= 20.6930455092707
##$SWIBOX= (0..15)
0 0 3 0 0 0 0 0 0 0 0 0 0 0 0 0 
##$SW_h= 5175.983436853
##$TD= 65536
##$TD0= 1
##$TE= 296.16
##$TE2= 300
##$TE3= 300
##$TEG= 300
##$TL= (0..7)
0 120 120 120 120 120 120 120 
##$TP= (0..7)
150 150 150 150 150 150 150 150 
##$TP07= 0
##$TPNAME0= <>
##$TPNAME1= <>
##$TPNAME2= <>
##$TPNAME3= <>
##$TPNAME4= <>
##$TPNAME5= <>
##$TPNAME6= <>
##$TPNAME7= <>
##$TPOAL= (0..7)
0.5 0.5 0.5 0.5 0.5 0.5 0.5 0.5 
##$TPOFFS= (0..7)
0 0 0 0 0 0 0 0 
##$TUNHIN= 0
##$TUNHOUT= 0
##$TUNXOUT= 0
##$USERA1= <user>
##$USERA2= <user>
##$USERA3= <user>
##$USERA4= <user>
##$USERA5= <user>
##$V9= 5
##$VALIST= <valist>
##$VCLIST= <CCCCCCCCCCCCCCC>
##$VD= 0
##$VDLIST= <DDDDDDDDDDDDDDD>
##$VPLIST= <PPPPPPPPPPPPPPP>
##$VTLIST= <TTTTTTTTTTTTTTT>
##$WBST= 1024
##$WBSW= 4
##$XGAIN= (0..3)
0 0 0 0 
##$XL= 0
##$YL= 0
##$YMAX_a= 215401
##$YMIN_a= -349726
##$ZGOPTNS= <>
##$ZL1= 120
##$ZL2= 120
##$ZL3= 120
##$ZL4= 120
##$ABSF1= 16.522
##$ABSF2= -4.171173
##$ABSG= 5
##$ABSL= 3
##$ALPHA= 0
##$AQORDER= 0
##$ASSFAC= 0
##$ASSFACI= 0
##$ASSFACX= 0
##$ASSWID= 0
##$AUNMP= <proc_1d>
##$AZFE= 0.1
##$AZFW= 0.1
##$BCFW= 0
##$BC_mod= 0
##$BYTORDP= 0
##$COROFFS= 0
##$CY= 12.5
##$DATMOD= 1
##$DC= 0
##$DFILT= <>
##$DTYPP= 0
##$F1P= 14.0000005364418
##$F2P= -0.99999901652339
##$FCOR= 0.5
##$FTSIZE= 32768
##$FT_mod= 6
##$GAMMA= 0
##$GB= 0
##$INTBC= 1
##$INTSCL= 1
##$ISEN= 128
##$LB= 0.3
##$LEV0= 0
##$LPBIN= 0
##$MAXI= 10000
##$MC2= 0
##$MEAN= 0
##$ME_mod= 0
##$MI= 0
##$NCOEF= 0
##$NC_proc= -5
##$NLEV= 6
##$NOISF1= 0
##$NOISF2= 0
##$NSP= 0
##$NTH_PI= 0
##$NZP= 0
##$OFFSET= 16.522
##$PC= 1
##$PHC0= 148.0496
##$PHC1= 6.167857
##$PH_mod= 1
##$PKNL= yes
##$PPARMOD= 0
##$PSCAL= 4
##$PSIGN= 0
##$REVERSE= no
##$SF= 250.13
##$SI= 32768
##$SIGF1= 0
##$SIGF2= 0
##$SINO= 400
##$SIOLD= 32768
##$SREGLST= <1H.DMSO>
##$SSB= 0
##$STSI= 32768
##$STSR= 0
##$SW_p= 5175.98343685301
##$SYMM= 0
##$S_DEV= 0
##$TDeff= 65536
##$TDoff= 0
##$TI= <Analysis number 999999
Compound Code 99
Book Reference 9
Project Code 9>
##$TILT= no
##$TM1= 0
##$TM2= 0
##$TOPLEV= 0
##$USERP1= <user>
##$USERP2= <user>
##$USERP3= <user>
##$USERP4= <user>
##$USERP5= <user>
##$WDW= 1
##$XDIM= 32768
##$YMAX_p= 436576585
##$YMIN_p= -771130
$$ End of Bruker specific parameters
$$ ---------------------------------
##NTUPLES= NMR SPECTRUM
##VAR_NAME=  FREQUENCY,     SPECTRUM/REAL,   SPECTRUM/IMAG
##SYMBOL=    X,             R,               I
##VAR_TYPE=  INDEPENDENT,   DEPENDENT,       DEPENDENT
##VAR_FORM=  AFFN,          ASDF,            ASDF
##VAR_DIM=   32768,         32768,           32768
##UNITS=     HZ,            ARBITRARY UNITS, ARBITRARY UNITS
##FACTOR=    0.157963299565203, 1,           1
##FIRST=     4132.6476996994, 0,             0
##LAST=      -1043.33573715361, 0,           0
##MIN=       -1043.33573715361, -771130,     0
##MAX=       4132.6476996994, 436576585,     0
$$ Real data points
##PAGE= N=1
##DATA TABLE= (X++(R..R)), XYDATA
$$ [...]
15693a34194R1758J68242N9575j08295K3798j05806j54463l1926J12834j15990
15683a94467j6187K7068J55932R005o6343R8925K6409o9588j72271K7329n5968
15672b30156P9201K35k4224J14K1896j10760r0685j5606L7366R1004K28112m6666
15660f0169j8442l8290N099p5256J32777J03365J60222J4934k7847M4409m7528
15649A93274k02514N0219J44177m501j16216j51982k4935j04538q6158j64373
15639d67547j23951J05731O1404K58917M2899m4695o5265r0525r486O5369k27075
15628d94224Q0168K26022N3883p5344P2786J35256j67933k16566N4192Q4092J64805
15617h2863l7950j95552j60351P8330J87813r1129j71159q3077K20036L27888
$$ plain form
15693 -134194 -42436 125806 185381 77086 100884 -4922 -159385 -191311 -78477 -194467
15683 -194467 -210654 -183586 -27654 -18649 -84992 13933 40342 -29246 -201517 -174188 -230156
15672 -230156 -150955 -150720 -174944 -174830 -152934 -263694 -354379 -369985 -332619 -241615 -13503 -60169
15660 -60169 -78611 -116901 -111802 -187058 -54281 49084 209306 224240 196393 240802 193274
15649 193274 -9240 40979 185156 180655 64439 -87543 -112478 -217016 -303174 -467547
15639 -467547 -591498 -485767 -424363 -165446 -122547 -167242 -232507 -323032 -332518 -267149 -494224
15628 -494224 -414056 -188034 -134151 -209495 -136709 -1453 -169386 -385952 -331760 -247668 -82863
15617 -82863 -120813 -316365 -476716 -398386 -210573 -301702 -472861 -555938 -335902 -8014
15607h014l6344j83758j32641J79820Q3921j42782m722m0682m746m0073j06281
15596d36302P7382J94567l1884J71873n8552k3509j9238M9566J54303M3051j37987
15585a6730L1028J55974j4445j4617j05510j42892k2535J5460N015J1773K8704
15574f8775J32145j3926r1204p5513Q5347k29733m4570n0645j74091J08808J57348
15563b64809K22563n5862M6099N4021J2824j79966q416q6383k55404J81984K79219
15552e4130Q3130j44838j33655j3466j3939m551J6003P7177J51917L8180M7460
15541D9288L2113n8883j01675L2512q1545j57907j27584J56322K2121j11917j44669
15530d91824L7476L22477J33924J04152O8632Q9708j90122j13335L0503k3949
$$ plain form
15607 -8014 -44358 -228116 -360757 -180937 -97016 -239798 -244520 -285202 -289948 -330021 -436302
15596 -436302 -358920 -164353 -196237 -24364 -82916 -106425 -125663 -76097 78206 121257 -16730
15585 -16730 14298 170272 155827 141210 35700 -107192 -129727 -114267 -109252 -97479 -68775
15574 -68775 63370 49444 -41760 -117273 -31926 -261659 -306229 -356874 -530965 -422157 -264809
15563 -264809 -42246 -98108 -52009 2012 14836 -165130 -173546 -259929 -515333 -333349 -54130
15552 -54130 29000 -115838 -249493 -262959 -276898 -281449 -265446 -188269 -36352 1828 49288
15541 49288 81401 22518 -79157 -46645 -128190 -286097 -413681 -257359 -235238 -347155 -491824
15530 -491824 -454348 -131871 2053 106205 174837 264545 74423 -38912 -8409 -32358
15520c2358M3591j68303j21219L9469J99563P2779J30821K7581o5516M1237j02796
15509F4849j66906N7643M2279M813k6136j58113r6592j23044J60205P4009M318
15498a62675n0659K8726q6607O0166P4250R9489N2553j85982J1451K01428J44882
15487A87022p1143R8972n3925j97918J8386J74301l2729p4618l0242l5958q2283
15476a00135P736L9529J6488l8503j39373Q4410l1063J04533J41743M3479j01440
15465B7404j38134L7950k0607J32437n1663m769O266R6806l2651k50920p3879
15454b71760o6162p6681N5142K05192J22815J51459J76666j10203j61251j9016
15444F201k42048j35136j7326J19893J51473L6874o3969j00468J49270R1954O4500
$$ plain form
15520 -32358 11233 -157070 -278289 -238820 -39257 33522 164343 191924 126408 167645 64849
15509 64849 -102057 -44414 -2135 2678 -23458 -181571 -278163 -401207 -241002 -166993 -162675
15498 -162675 -213334 -184608 -271215 -211049 -136799 -37310 15243 -170739 -159288 42140 187022
15487 187022 115879 214851 160926 -36992 -18606 155695 122966 48348 18106 -17852 -100135
15476 -100135 -92399 -52870 -36382 -74885 -214258 -129848 -160911 -56378 85365 128844 27404
15465 27404 -110730 -72780 -93387 39050 -12613 -17382 -11116 85690 53039 -197881 -271760
15454 -271760 -337922 -414603 -359461 -154269 -31454 120005 296671 186468 25217 6201
15444 6201 -235847 -370983 -388309 -268416 -116943 -80069 -144038 -244506 -95236 -3282 61218
15433F1218j13085p7909L9631R8089J14322j1626j72515j80581O959O4688p1885
15422b42694j34372K1556J41008R967J27037p5349n5022N3514M7665k6004L3009
15411i9685J9653p9055n4029p8603K93201J13282j50276O2860j74467J21289j0905
15400c6735k2337m0001l1199j77206j3164J53462L421j7990N2848O6360O6778
15389D237k91408o531J95218J3294J6358j4829J4476j99242r4773j3315M1477
15378c35038K85823j19590k60329K4908K26747J46003J00493J12261k17645k79142
15368c15509k5615j7727J1667J49901j1894n7643p2059Q6306J33748o966K89575
15357A63784J07257j9494k9828K00J58771O5265k03199l80157j00883K6076m0763
$$ plain form
15433 61218 -51867 -129776 -90145 7944 122266 110640 -61875 -242456 -235497 -170809 -242694
15422 -242694 -377066 -355510 -214502 -204535 -77498 -152847 -207869 -154355 -106690 -132694 -99685
15411 -99685 -80032 -159087 -213116 -291719 1482 114764 -35512 27348 -147119 -25830 -36735
15400 -36735 -59072 -99073 -130272 -307478 -320642 -167180 -163759 -181749 -128901 -62541 4237
15389 4237 -287171 -293702 -98484 -85190 -68832 -83661 -69185 -268427 -363200 -376515 -335038
15378 -335038 -49215 -168805 -429134 -404226 -177479 -31476 69017 181278 -36367 -315509
15368 -315509 -341124 -358851 -347184 -197283 -209177 -266820 -338879 -252573 -118825 -125791 163784
15357 163784 271041 251547 221719 221919 380690 445955 242756 -137401 -238284 -212208 -252971
15346b52971L3902J60463j34048P5124n1688p2126J37673p3582j25665o0215J02827
15335b60306k07761M4437K0997p7711P3169L7622J12944n6384j59404R7926J58526
15324b15945P0112l6749O4324l5892J21673J88795j60571j32005K61219r4386
15314C0575P7087j65976n6901j41842n3497l5522R5053J98434m0259m4918N2823
15303h4943J07605k977j9554o8131p5433q0083Q6046n0438M4595K45859J73634
15292B76180M7437m0987j13881K2733K4370K0980R8396k03588m62225k63426L1585
15281e62426K94824J53246N4798N9979j77552j34932q5972J30770K14607O3489
15271A0831k9041r3654P3J38860J98031o7162j65914Q8315K4279n831l554p0646
$$ plain form
15346 -252971 -219069 -58606 -192654 -117530 -169218 -241344 -103671 -177253 -302918 -363133 -260306
15335 -260306 -468067 -423630 -402633 -480344 -407175 -369553 -256609 -312993 -472397 -374471 -215945
15324 -215945 -145833 -182582 -118258 -154150 -32477 156318 -4253 -136258 124961 30575
15314 30575 107662 -58314 -115215 -257057 -310554 -346076 -251023 -52589 -92848 -137766 -84943
15303 -84943 22662 19685 131 -68000 -143433 -223516 -137470 -187908 -143313 102546 276180
15292 276180 323617 282630 168749 191482 215852 236832 335228 131640 -330585 -594011 -562426
15281 -562426 -267602 -114356 -59558 421 -177131 -312063 -398035 -267265 -52658 10831
15271 10831 -18210 -111864 -111791 27069 225100 157938 -7976 80339 104618 98787 95233 24587
15259B4587j84805q8764j7081Q3313K32197K2140j74459j76706K8788j62531q8197
15248e01518j26525J34740K08990n6747k9827q823J4499O0022R7461j41022r7126
15237d45876K20283K36355M3113j20336K8133J99107k1066j27477K890j49233
15227a34107j07959J09554N3683P4885r3050J0416K20885J00665N1021j30820
15217A55173m23202o8723J10079n330j37511J45745J90477O8677L4920K18334
15207B88639K0078j96001m41650o7736J10043J06656J12709j03423j33196J2375
15197b91506J10506L16022O5444j53629J0287l875j70900J20191J25894o9215
15187E9219m3466j4702o3809L7827L4919r004j62493J44381q3397l3376j0242
$$ plain form
15259 24587 -160218 -248982 -266063 -182750 49447 71587 -102872 -279578 -250790 -413321 -501518
15248 -501518 -628043 -493303 -284313 -341060 -370887 -379710 -365211 -305189 -207728 -348750 -445876
15237 -445876 -225593 10762 53875 -66461 -38328 160779 139713 12236 15126 -134107
15227 -134107 -242066 -132512 -78829 -3944 -96994 -86578 134307 234972 285993 155173
15217 155173 -268029 -336752 -226673 -232003 -369514 -223769 -33292 35385 70305 288639
15207 288639 308717 112716 -328934 -396670 -286627 -179971 -67262 -170685 -303881 -291506
15197 -291506 -181000 135022 200466 46837 57124 53249 -117651 2540 128434 59219
15187 59219 15753 1051 -62758 -24931 9988 984 -161509 -17128 -100525 -133901 -144143
15176a44143k0285M3703j87207L1792R5470r0094J12811j5326q594k7417n7518
15165b66808j4188K07476J24296n4618K5570o7656p6140p9958j03700o049J382
15154c10393K73410J79015j00302M0603N7660j33198j31536k1858J618K4049j2024
15143a32956r5148n6991o9609K60699K12004L9797o1910p2777k23037l7640N9055
15132a78513M4714q9306J38322O943N7845M5828j19628k07228j67329J01949J91314
15121a75089L7182n5835r8778p8205R3106k3116J4456m5223R1363R9338j5064
15110a55865j3755O4997j13402j23467l2498J63283J94692k0032L8917j06999
15100a04129p2516J56610j77432J85332J96700k06494N9193J90090j29366N4405
$$ plain form
15176 -144143 -164428 -120725 -307932 -276140 -180670 -270764 -157953 -173279 -181873 -209290 -266808
15165 -266808 -280996 -73520 50776 -3842 21728 -45928 -122068 -202026 -305726 -311775 -310393
15154 -310393 -36983 142032 41730 82333 139993 6795 -124741 -146599 -144981 -120932 -132956
15143 -132956 -228104 -285095 -354704 -94005 117999 157796 95886 23109 -199928 -237568 -178513
15132 -178513 -133799 -223105 -84783 -77840 -19995 25833 -93795 -301023 -468352 -366403 -175089
15121 -175089 -137907 -193742 -292520 -370725 -277619 -300735 -286279 -331502 -240139 -140801 -155865
15110 -155865 -169620 -104623 -218025 -341492 -373990 -210707 -16015 -36047 2870 -104129
15100 -104129 -176645 -20035 -197467 -12135 184565 -21929 37264 227354 97988 152393
15090A52393N7499k47316j98640O283Q3888Q158k55221O2128J96975K69989K5918
15079A62054j01422m2318m5759J1697R6390m4947o258O1998M8019j34571l1836
15068b6953m5411J29552q386l3046j01710K00242l3703j35368m7236J57532M7636
15057A03149J58897K27493j85543j78243k37568M4981R393r87L14401k30107l00305
15046b74439q0951l65J3384P1802N7412K4789j76790l662J55j19356n9639J61310
15034c86350J31183J60100K598J99760o3998m4120L8647j06585m4387k28098j08403
15023d49653n8152J74394K13536J38554J59025m0752r4961p822J259j00426m1763
15012a06761K17555o7756k3810j91326j73638J52124R2746l0326O8386l4488j12571
$$ plain form
15090 152393 209892 -37424 -236064 -229781 -145893 -137735 -392956 -330828 -133853 136136 162054
15079 162054 60632 18314 -27445 -15748 80642 35695 29437 91435 139454 4883 -26953
15068 -26953 -72364 57188 48802 15756 -85954 114288 80585 -54783 -102019 55513 103149
15057 103149 262046 489539 303996 125753 -111815 -66834 -57441 -58428 255973 25866 -274439
15046 -274439 -355390 -355755 -342371 -270569 -213157 -188368 -365158 -368820 -368665 -488021 -547660 -386350
15034 -386350 -255167 -95067 -92469 107291 43293 -827 37820 -68765 -113152 -341250 -449653
15023 -449653 -507805 -333411 -119875 18679 177704 136952 41991 34169 35428 -64998 -106761
15012 -106761 110794 43038 19228 -172098 -345736 -193612 -100866 -131192 -62806 -97294 -209865
15001b09865L5352J59301j10351N1614J43811M8249Q6936J5312l88825R000L63808
14990B04342K8816k86897r5524l9917p1005J28637J99610L5730l00o2960p841
14979C2691j17304n0750O7173k6007k503j08823L27261J26886j3229L050j27359
14968A11086r565k40663J25205L62592j89570j28948J44763j17596M4220L1043
14958A32567j93051q7630K3887k76349p2546P4511R5151J10323J71959J1432J55834
14947A46088j4180L3273J529p7655j33309M8225M2953N116J4544j33097j03183
14936a69696j9642J32458o2313j62165R3735J792n0356Q3108O5201j17971l1084
14925b36933M911r2600l9735Q4511P8117o0094q5913J02123J67623J64859J23553
$$ plain form
15001 -209865 -174513 -15212 -125563 -73949 69862 118111 205047 220359 -168466 -159466 204342
14990 204342 233158 -53739 -149263 -189180 -260185 -131548 68062 103792 103492 40532 32691
14979 32691 -84613 -135363 -68190 -94197 -96700 -205523 121738 248624 235395 238445 111086
14968 111086 101521 -139142 -13937 348655 159085 30137 174900 57304 101524 132567
14958 132567 -60484 -148114 -124227 -400576 -473122 -398611 -303460 -193137 -21178 -9746 146088
14947 146088 131908 165181 166710 89055 -44254 3971 46924 52040 66584 -66513 -169696
14936 -169696 -189338 -56880 -119193 -281358 -187623 -185831 -236187 -153079 -87878 -205849 -236933
14925 -236933 -232022 -324622 -364357 -279846 -201729 -261823 -347736 -245613 -77990 86869 210422
14914B10422R1099k8612k8741R5230j20029l83557j20788O9659J75224P3295j36355
14903a03153K955N4679j7200j14950O5323r3136j70880P0986K5535J58298J70819
14892D9276J6182j2363l4844k7818R2840k1192l3542j24616k83L02291K33883
14881D39814j51840l73013j88500O4518n2264J94345J12364K289m8654K208j19803
14870a18536n4920J82361J15251j1379J0858j5823r3394R7143O0146L2966J04318
14859C08991N3000j15446j13526q3556p5840j00224P3470r5582j22416j6614j4421
14848c02164K62332j13772r7743L00471j1317k2066K33737j33952k76096J07912
14838e2658j76424K6819J11781R3437K0311J39642P5980Q026r8558j25842j80692
$$ plain form
14914 210422 301521 272909 244168 339398 219369 -164188 -284976 -215317 -40093 33202 -103153
14903 -103153 -100198 -45519 -62719 -177669 -112346 -205482 -376362 -305376 -279841 -121543 49276
14892 49276 65458 53095 18251 -9567 83273 62081 28539 -96077 -96360 205931 439814
14881 439814 287974 -85039 -273539 -209021 -261285 -66940 45424 47713 -941 1267 -118536
14870 -118536 -173456 8905 124156 112777 123635 107812 14418 111561 171707 204673 308991
14859 308991 361991 246545 133019 49463 -26377 -126601 -53131 -148713 -271129 -287743 -302164
14848 -302164 -39832 -153604 -251347 49124 37807 15741 249478 115526 -160570 -52658
14838 -52658 -229082 -202263 -90482 2955 23266 162908 238888 246914 148356 22514 -158178
14827a58178p7598J48245p3459l16138m040J00763J47908J45942k5137L0960Q869
14816g1863J21395J2779J35385k29454m1666P9132J62550P8844m765p3381M3805
14805B12761o5742q9214L6711q6625q1755L0099O1235N6849J8161J8614P740m2343
14793G6491j93670R1130K24159N8787p6518J1834K9730n3098j25024j19265j06719
14782a82163M2782J81569j56723k28455L2180J59422K44024J37081m5165l20611
14772a36059k1678R3859K16358J45734J1970j63005j69414j03122M7494n0137
14762a28000K1409K02720J12198m4370N424P815n4281j76639O3635K28414J14693
14751C53018m7004l30185k04358j84367J29519J86492K29298K56142j04196N5729
$$ plain form
14827 -158178 -235776 -87531 -160990 -477128 -481168 -380405 -232497 -86555 -111692 -80732 -71863
14816 -71863 49532 62311 197696 -31758 -73424 5708 168258 247102 242337 168956 212761
14805 212761 147019 57805 94516 7891 -73864 -43765 17470 74319 92480 111094 118834 76491
14793 76491 -117179 -26049 198110 256897 180379 192213 221943 168845 43821 -75444 -182163
14782 -182163 -139381 42188 -114535 -342990 -310810 -151388 92636 229717 184552 -136059
14772 -136059 -157737 -63878 152480 298214 310184 147179 -22235 -125357 -77863 -128000
14762 -128000 -106591 96129 208327 163957 169381 177196 122915 -53724 9911 238325 353018
14751 353018 306014 -24171 -228529 -412896 -283377 -96885 132413 388555 284359 340088
14741C40088k5896k67707j26927O0912Q4562N7703j7207k997j7260o2688J19878
14730A42461j50148j66759j25565J49511K01761R5056j57352M4987L7093J31795
14720B02840p6138K6952K2055J14026k30102j91818k7939J01399O4667J1575J86626
14709B04143J12993k28332r6327m8400J74093J95513l3867k16119j03428J01831
14699F2100p5305Q5383P2982k46696n7814j2609J80123J23061j25319j16048p4913
14688a85055l6330j54862M0003J69778J78916N0546q6350q7130l4940J0683J30616
14677d125J50148k9537K3029j1785q4541r0086q7276n8894J34929J04829J25536
14666A72227J1183M7979M8652j16621j65464m4409j04697P204o81m4410J13081
$$ plain form
14741 340088 314192 46485 -80442 -19530 65032 122735 105528 102531 85271 22583 142461
14730 142461 -7687 -174446 -300011 -150500 51261 146317 -11035 33952 71045 202840
14720 202840 126702 153654 175709 289735 59633 -132185 -160124 -58725 5942 17517 204143
14709 204143 317136 88804 -7523 -55923 118170 313683 279816 63697 -39731 62100
14699 62100 -13205 72178 145160 -101536 -159350 -171959 8164 131225 5906 -110142 -185055
14688 -185055 -221385 -376247 -336244 -166466 12450 62996 -23354 -110484 -145424 -134741 -4125
14677 -4125 146023 116486 139515 127730 43189 -46897 -134173 -193067 -58138 46691 172227
14666 172227 183410 231389 280041 163420 -2044 -46453 -151150 -143946 -144627 -189037 -75956
14655g5956J02931j40361j18472J2144K2526k11369J03126N02769J55697k77621
14645G5414j30856o3130r3914J10312J17426J14411j4938M6725k7196l7314l162
14634I3778r7687k7728R2596P3854j8966K1150k1500k2008Q4276m6018j50206
14623a8459J87995j21536k93951J10165J48315M8173K07688K1482J0840j77970
14613A22742j25302P3801J52683j0994o2678o9902j68710p6058J82846L3824L0146
14602H2398n0971N908L5753J17388r6509j05602p8392n0930j52634j04761J52479
14591b45873R0151l9502M2547J1181M1641l0611R5030O7719k3757p1716o1191
14580a24381m1438J67006R2328P0477R1203Q3126l2324k2685m6295m5642J04619
$$ plain form
14655 -75956 26975 -113386 -231858 -219714 -197188 -408557 -305431 197338 353035 75414
14645 75414 -55442 -118572 -212486 -102174 15252 129663 114725 161450 134254 96940 93778
14634 93778 -3909 -31637 60959 134813 115847 136997 115497 93489 177765 131747 -18459
14623 -18459 169536 48000 -245951 -135786 12529 60702 268390 289872 300712 122742
14613 122742 -2560 71241 223924 212930 150252 80350 -88360 -164418 18428 52252 82398
14602 82398 31427 37335 73088 190476 93967 -11635 -90027 -140957 -293591 -398352 -245873
14591 -245873 -155722 -195224 -152677 -141496 -99855 -130466 -35436 32283 8526 -63190 -124381
14580 -124381 -165819 1187 93515 163992 255195 338321 305997 283312 237017 191375 295994
14569B95994J797j30532j19340J09056m2685m1130n2239j50762Q9070K00498k52717
14558i2990k09523j56895J05466J09047J80955J78445l9657o5805k4180j7371
14548c2508j08511j06430K9144J1007J22145J29911J30412j37326Q097j48108
14538a02167r3923n852J72016L4411j09599k7715J66970K21545J75495J28183
14528E59364k27345k73622n5992j19651q6198Q2122K29837R6975J49268k44909
14518A09849r6734P9498q1060l5391r1313j15445J68661N361Q382L8460K54746
14507B45014n71j40833J9528Q2538j10805j67906J061P925J78509K14405j34651
14496A94214k3270m5364R2541j32762j91752K27830J9213j38090m9464L6366m1721
$$ plain form
14569 295994 297791 167259 47919 156975 114290 73160 20921 -129841 -40771 159727 -92990
14558 -92990 -302513 -459408 -353942 -244895 -63940 114505 74848 9043 -15137 -32508
14548 -32508 -141019 -247449 -218305 -207298 -85153 44758 175170 37844 45941 -102167
14538 -102167 -196090 -201942 -29926 4485 -105114 -132829 34141 255686 431181 559364
14528 559364 332019 58397 2405 -117246 -203444 -121322 108515 205490 354758 109849
14518 109849 13115 92613 11553 -23838 -115151 -230596 -61935 -56574 -48192 -9732 245014
14507 245014 244443 103610 123138 205676 94871 -73035 -71974 -64049 114460 328865 194214
14496 194214 170944 125580 218121 85359 -106393 121437 140650 2560 -46904 -10538 -52259
14485e2259J32363n344N399Q2045O9665O0506j40909r9110R5386k7654r1320Q9153
14473A17921p0938J39319j93839j65773q2531J36710O6115n1751o780p1742m111
14462a87400j94125l6204K00428R9292J47793Q1811j25110j15008n7980n0265
14452b36768k8923j33352q0791J29383J81095K48760o871p3270j21311M5830K81475
14441B05257P228j26166q9364J19781J3616J0044j16871L3878l3296j23920j47924
14430b47737L7642K34069J09902J2j29508o318J28418J87722J05973m4790k04260
14419A71125r0068n7265J1301j40491k32116j30503n1216J10831J84218K61797
14409C7613J10332j48456j95938r761J54504r744K84366k39503j9908j26715Q3424
$$ plain form
14485 -52259 80104 74760 80159 162204 231869 292375 151466 52356 147742 120088 28768 117921
14473 117921 46983 186302 -7537 -173310 -255841 -119131 -53016 -104767 -111547 -183289 -187400
14462 -187400 -381525 -417729 -217301 -118009 29784 111595 -13515 -128523 -186503 -236768
14452 -236768 -265691 -399043 -479834 -350451 -169356 79404 72533 -737 -122048 -76218 205257
14441 205257 212485 86319 -3045 116736 130352 140396 23525 57403 24107 -99813 -247737
14430 -247737 -210095 23974 133876 133888 4380 -1938 126480 314202 420175 375385 171125
14419 171125 81057 23792 35093 -105398 -337514 -468017 -519233 -408402 -224184 37613
14409 37613 147945 -511 -196449 -206210 -51706 -61450 222916 -16587 -36495 -163210 -79786
14398g9786J54642J71435O7234J4251k18580j61222j48123J0168R5878P808k16585
14387c02880J91959L3610m25205j17832L15072K65494N9176J4666j77928j15777
14377b59645M8341K74476O2839j25610n3583K8868P1440K5500J04207J3924k68964
14366g8207r6554m122K77452Q8473O9238M0869P4334k37419m3183j25892j54506
14355a89517O8685R4705m1397J44481j38946k12041j06575p6788K2348K86283
14345a48762J81471J23338O2333J11286K273j81929q0504q1375R4810o6983o4325
14334d8367J05961O0513J03742k05349k01153K8410J04944j1632l5105P5986J72813
14323A50763J89431k09598j77650J26892j06888r3629p0325K25537K5421P6819
$$ plain form
14398 -79786 74856 246291 313525 327776 109196 -52026 -200149 -189981 -94103 -86295 -302880
14387 -302880 -110921 -77311 -502516 -620348 -305276 -39782 19394 34060 -143868 -259645
14377 -259645 -211304 63172 126011 401 -53182 -24314 47126 72626 176833 190757 -78207
14366 -78207 -174761 -178883 98569 187042 256280 297149 371483 134064 90881 -35011 -189517
14355 -189517 -120832 -26127 -67524 76957 -61989 -274030 -380605 -457393 -435045 -148762
14345 -148762 32709 156047 218380 329666 331939 150010 69506 -11869 82941 15958 -48367
14334 -48367 57594 118107 221849 16500 -184653 -156243 -51299 -62931 -98036 -22050 150763
14323 150763 340194 130596 -47054 79838 -27050 -120679 -191004 34533 59954 136773
14313A36773R4917J930j89637j35257j3889n6856j61189j4003J02638K03449m1678
14302g2802K1488J32652J38496o1665J0796Q2481k53946j05021R5919M9969n9091
14291b0724m7835J18614l593O7903r8928l66760l1183J52649J43851q1921Q9534
14280g8393Q8947P7035M5396r9736n6139J1585k9940q7678Q084L8113R4316p6626
14268f5036J80226j05598k4589j54439r4129J37656L3630K64492K6631m3882k19992
14257f5030j68261p0548j15060N5511J49928J5302j5906n8268q7695J38761l6871
14246b58137J4833P1999J81671m3343q99p224j40356M5851J20447q4276P7311
14235b2123J17316k5226j11721R1174N5391M9520J1073J40060N0274j30786o260
$$ plain form
14313 136773 231690 233620 43983 -91274 -105163 -162019 -323208 -337211 -234573 -31124 -72802
14302 -72802 -51314 81338 219834 158169 168965 251446 -2500 -107521 -11602 38367 -20724
14291 -20724 -68559 50055 46462 114365 15437 -351323 -382506 -229857 -86006 -167927 -78393
14280 -78393 10554 87589 132985 33249 -22890 -11305 -41245 -128923 -120839 -82726 11590 -65036
14268 -65036 115190 9592 -14997 -169436 -263565 -125909 -92279 172213 198844 154962 -65030
14257 -65030 -233291 -303839 -418899 -363388 -213460 -198158 -214064 -272332 -360027 -221266 -258137
14246 -258137 -243304 -171305 10366 -32977 -33876 -41100 -181456 -135605 -15158 -99434 -22123
14235 -22123 95193 69967 -41754 49420 104811 154331 165404 305464 355738 224952 218692
14224B18692J7173q5871l36587L0066K04281M5550j438J04149J91421r4376j01237
14213A91823j49196Q8505K1628j46401Q2570J1357r3845n7501j39940O4823J65843
14202C9666N9227N1826J21450n4296l25747o3768J18649l0267O4986k4382O4984
14191B2328Q016K81244L2941j00539L15877j46439j24796l8788j57091m6609R4308
14180A40452p1461K2312l1059k06342j30600K42685Q7226K2016j17922Q2100J84605
14169B24012J22657j15000n7539k9160l3149q6783j27524K17168q231L8824l6478
14158A08797J41003J47942k35391l0772R0688j01388j85893l7005J89210O0962
14148A48153J51823j43154k61512L7516j51947L1901J70297Q6535J15175J2517
$$ plain form
14224 218692 235865 149994 -186593 -156527 47754 93304 91866 196015 387436 293060 191823
14213 191823 42627 131132 152760 6359 88929 100286 6441 -51060 -191000 -126177 39666
14202 39666 98893 150719 272169 217873 -107874 -171642 -52993 -83260 -18274 -42656 22328
14191 22328 30344 311588 344529 243990 559867 413428 288632 249844 92753 46144 140452
14180 140452 68991 91303 60244 -146098 -276698 -34013 53213 75229 -42693 39407 224012
14169 224012 346669 231669 174130 144970 111821 25038 -102486 114682 106451 145275 108797
14158 108797 249800 397742 162351 131579 222267 120879 -65014 -102019 87191 148153
14148 148153 299976 156822 -104690 -67174 -219121 -187220 -16923 69612 184787 197304
14138A97304j42995Q9828l0232j10369n9218l5534J71508j4997J61186Q9136j52427
14127A63190J408P1578J5457K2182j77648k35684R6789J30697j4256k3069k44964
14116a94320j36192M519K2713R5993K10397p7361N3864j5169N4917P6891n7985
14105C8267m1321k4242M778o9551q3898J40962M3399j49608l246J99317N0543
14094A05400j54141P3203L25583J29397N5027j21233k10086j80975p317q9140
14084g4282J25600J30682j31193k52962P9094M4869O0811O5712L941j52099q527
14073a08354j3628K545q557R1813L3239k5369m779j14358j06978m0399O1602M7628
14061a85595j29011M3922R1153J5973j78256O2424L03525q0160q6364p7564r2185
$$ plain form
14138 197304 54309 144137 113905 3536 -55682 -91216 80292 65295 226481 315617 163190
14127 163190 164598 236176 251633 273815 96167 -139517 -42728 87969 73713 50644 -194320
14116 -194320 -330512 -325993 -303280 -207287 3110 -74251 -20387 -35556 19361 96252 38267
14105 38267 -3054 -27296 -22518 -92069 -175967 -35005 8394 -141214 -144460 54857 105400
14094 105400 -48741 24462 350045 479442 534469 413236 203150 22175 14858 -74282
14084 -74282 51318 182000 50807 -202155 -123061 -78192 -17381 48331 52272 -99827 -108354
14073 -108354 -121982 -119437 -127994 -36181 -2942 -28311 -33090 -147448 -254426 -294825 -233223 -185595
14061 -185595 -314606 -270684 -179531 -163558 -341814 -279390 24135 -56025 -142389 -219953 -312138
14050c12138J86228P6972j10702M0012l3211j26264l4900O2515R5018J75441q6116
14039f7145j28946N5605j28273J04140J63959O9513n7861o2919M7844N4909M8746
14028I9572j10413j37694J56488M8383m0543j03905m7340J64036R3236Q6528o3577
14017A44771l7726n8416N0360Q6010l1311k03392j12791N1974J58169p4926L153
14006b4125K4937j46016l9517J54993J59966m3413P1016R3456j44736m39516j00449
13995d33404L00878M7460M930Q7408J04199j12597j99789J96293L19194R298m3439
13984B80431K3124p7291r2146q7560J34586q6842k92820j12238M6287J35834p5722
13973b04357K97570K76165r2229m7933N8767p7597o6314J51264j47881j56699
$$ plain form
14050 -312138 -125910 -48938 -159640 -119628 -152839 -279103 -314003 -251488 -156470 18971 -67145
14039 -67145 -196091 -140486 -268759 -164619 -660 68853 10992 -51927 -4083 50826 99572
14028 99572 -10841 -148535 7953 56336 15793 -88112 -135452 28584 121820 208348 144771
14017 144771 107045 48629 98989 184999 153688 -49704 -162495 -110521 47648 -27278 -24125
14006 -24125 812 -145204 -184721 -29728 130238 86825 157841 251297 106561 -332955 -433404
13995 -433404 -132526 -85066 -80136 7272 111471 -1126 -200915 -4622 314572 323870 280431
13984 280431 303555 226264 134118 46558 181144 94302 -198518 -310756 -264469 -128635 -204357
13973 -204357 93213 369378 277149 229216 287983 210386 144072 295336 147455 -9244
13963i244J71753o3879l28239j54630O7975M01007m3973q6098K2963J5962p5176
13952h1579j9002l052J4138j79899j46956J35212M7727J01637j7552m8892L0247
13941a67971K04647k0279j01725j42482n1355j21081K33483J09051l5001n513
13931i8226j1412L18460p4423l2396K08932n7571k23581p6927K00802K46871j57623
13920B42906j99165j65482j02751J19979K47185J19790j84234q3539J51791O9584
13910B16064o2428Q5307j88596K9893k8358Q3446o6860j21364J61458K3797l8462
13899I3897M5702M431l8123r2395J11938J0359m3844j03579O5443J94596k29525
13888A8900j12920q5152k5149n6506K46188J38920J03866p1015l3300j47967k63431
$$ plain form
13963 -9244 162509 98630 -229609 -384239 -316264 84743 40770 -45328 -22365 -6403 -81579
13952 -81579 -100581 -103633 -89495 -269394 -416350 -281138 -233411 -131774 -149326 -198218 -167971
13941 -167971 36676 16397 -85328 -227810 -279165 -400246 -166763 -57712 -92713 -98226
13931 -98226 -109638 208822 134399 102003 310935 253364 29783 -47144 153658 400529 242906
13920 242906 43741 -121741 -224492 -104513 142672 262462 78228 -5311 146480 216064
13910 216064 153636 238943 50347 80240 51882 135328 68468 -52896 108562 132359 93897
13899 93897 139599 144030 105907 13512 125450 135809 91965 -11614 53829 248425 18900
13888 18900 -94020 -179172 -204321 -260827 -14639 124281 228147 157132 123832 -24135 -287566
13877b87566J50605J57471O4435p4542j01937n6927N0453l450n0311k3073Q9152
13866h5690J49791k9824j3030j3675o0579j12114N464K5557L1287O7331p3902
13855a09384o9267J59558L6792J39322P5444J3417k01903j5206J6454j40691O3412
13844c2052J12190L7199k970o5969j3681p0269m4841M2206P4473K07456N8368
13833C02110q2016k16232k3428O0275o5368j53538J85495J12594Q7252k59155
13823e2011l02144q5362Q7674P2923K2732j19486P7658K88890L6413M2375K753
13812G2415j06950K60154J02818k25765k27527l6050O9723K15298l1621k14923
13802a22428l5501q097m9356m5898K03834j1676n5722J47031K09507J91704m1110
$$ plain form
13877 -287566 -136961 20510 84945 10403 -91534 -148461 -98008 -101458 -151769 -174842 -85690
13866 -85690 64101 34277 21247 7572 -53007 -165121 -159657 -134100 -102813 -35482 -109384
13855 -109384 -178651 -19093 17699 157021 232465 245882 43979 28773 45227 -95464 -32052
13844 -32052 80138 117337 114367 48398 34717 -35552 -80393 -38187 36286 243742 302110
13833 302110 220094 3862 -19566 40709 -24659 -178197 7298 119892 207144 -52011
13823 -52011 -354155 -439517 -351843 -278920 -256188 -375674 -298016 -9126 27287 69662 72415
13812 72415 -34535 225619 328437 102672 -124855 -160905 -91182 124116 92495 -122428
13802 -122428 -157929 -166026 -215382 -261280 -57446 -69122 -124844 22187 231694 423398 382288
13791C82288k95315Q272J05941J01773o2362J4128j20586r4583J62241M1506O379
13780B49682O9851k1646L9950L608p8886P8921p0677P6878o8930P9477j43814
13769B14414j23210j49357J8841J35879J66235J27439m6276k66236j04766j22856
13759a49893j14669K01093J23047N301j3781m6312p0005J22842K52203o1017j79074
13748F9735n8044J32682N080R7763m2934o6504P7829p1355m3576p6283j4204L4588
13736D4777J91362L6441k50242j94767j12272K79580J74276j0625L7441J91940
13726C87911j09630O5128O6583K5731j42083j65533Q5369J7623o2158M7519o6542
13715A49918m4576j42399M211L0944Q4641r2102j29346j1099N8091M0178q5335
$$ plain form
13791 382288 86973 95245 201186 302959 240597 254725 134139 39556 201797 243303 249682
13780 249682 319533 297887 337837 341445 262559 341480 270803 347681 278751 358228 214414
13769 214414 91204 -58153 -39312 96567 262802 390241 343965 77729 -27037 -149893
13759 -149893 -264562 -63469 59578 64879 51098 4786 -65219 57623 309826 248809 69735
13748 69735 11691 144373 149453 247216 204282 137778 215607 144252 100676 24393 10189 44777
13736 44777 236139 272580 22338 -172429 -284701 -5121 169155 158530 195971 387911
13726 387911 278281 343409 409992 435723 293640 128107 213476 231099 168941 216460 149918
13715 149918 105342 -37057 -32846 -1902 82739 -9363 -138709 -149808 -91717 -51539 -136874
13704a36874q7016N8633L0762n1148p0264k2818O4876K4967P2737p7154J15901
13693g7398K40374R0976j04202J39991j41519k17106n2540J03290J8773J33017
13683A33656K2742j92109N5013P4903j3464j19311j4749n1302M3633j3921j4864
13672h9773K23128R7908j7616K7049q8650k63577j95015k6018R5297M9120J55764
13661c2383J90742l0023M1673P2038r6417j82275j2000k7182n6975j84176M3578
13650b73400K66638M15586N9585k06693m8242J9676j35572o6592m3480k02039
13640b14533Q9793K23163P9149J08732o1183k22893j42248K3257J39911J53521
13630A76669p0837j21879J27125R8808j33506p2113m0034l1827Q173R7177J50374
$$ plain form
13704 -136874 -223890 -165257 -134495 -185643 -255907 -278725 -213849 -188882 -116145 -193299 -77398
13693 -77398 162976 253952 149750 289741 148222 -68884 -121424 -18134 639 133656
13683 133656 156398 -35711 19302 94205 80741 -38570 -53319 -104621 -60988 -74909 -89773
13672 -89773 133355 231263 213647 240696 152046 -111531 -306546 -332564 -237267 -188147 -32383
13661 -32383 158359 128336 170009 242047 145630 -36645 -48645 -75827 -132802 -316978 -273400
13650 -273400 -6762 408824 468409 261716 213474 233150 97578 30986 -12494 -214533
13640 -214533 -124740 98423 177572 286304 225121 2228 -140020 -116763 23148 176669
13630 176669 105832 -16047 111078 209886 76380 4267 -35767 -67594 -59421 37756 188130
13619A88130Q0787m6244k90815Q0674Q2422J46609L638m2671J686j3261l7961
13608A52994j49321j8474J0491L3136J28399j75390J15226J38895j6288j35653
13598H4015j03264P705P2058M6982r8927j41696R5478J80862Q9246l1259R1104
13587B92304j13010n0723J72233m90j56989k97224K04903J12596k8812J06360
13577B41148p1665J39812Q2963k09182K0583o0921l8739m340M8268j56787M4179
13566C5319K26147j26649o5250N7213K02272n3466j86938m2069j02110R7249J21218
13555A62936K7103N4894O448j06778J4270k1869N7883J63403j63955j34961p0009
13544a0635k3829M1503M5176J35800J8645p1601l34875n5833K89495O7425m6210
$$ plain form
13619 188130 268917 222673 -68142 12532 94954 241563 245201 202530 204216 190955 152994
13608 152994 3673 -14801 -4310 28826 157225 -18165 97061 235956 219668 84015
13598 84015 -19249 -11544 60514 107496 8569 -133127 -37649 143213 232459 201200 292304
13587 292304 179294 128571 300804 300314 143325 -153899 51004 163600 134788 241148
13577 241148 169483 309295 392258 183076 203659 142738 103999 99659 147927 -8860 35319
13566 35319 261466 134817 69567 126780 329052 275586 88648 46579 -55531 41718 162936
13555 162936 190039 244933 251381 144603 158873 137004 194887 358290 194335 59374 -10635
13544 -10635 -34464 7039 52215 188015 206660 135059 -199816 -255649 33846 101271 55061
13533E5061P0384j13551n5166K75673J61893j38740j40222M9969p389J6251J48735
13522C22898J29836j06107m4081q724J67028P881j82250j4043N7879k2195p0386
13511B37736j08523j7818j3221J60467K6411k09412n4339o3803l9309j29550o0180
13500b71541K23845J03050R3059j197j04497j86967L4448J50758J86114j07071
13490A20001j18055J0997J59114J89198P8822j91471q8238q505J58979K55907
13480E66749j3774m2061N9392k08384k29604L3279L3031J00192K4013m6927m2154
13469B33752j53052o7685R4233J65709l5136M3072k40879j96152J20860K81866
13459B46588o278k9566j70526k23490j17686J13161M9962J14987J59586J93117
$$ plain form
13533 55061 125445 11894 -43272 232401 394294 255554 115332 165301 157912 174163 322898
13522 322898 452734 346627 302546 293822 460850 468731 286481 272438 330317 308122 237736
13511 237736 129213 111395 98174 258641 285052 75640 21301 -42502 -81811 -211361 -271541
13500 -271541 -47696 55354 148413 147216 42719 -144248 -109800 40958 227072 120001
13490 120001 1946 12943 172057 361255 440077 248606 160368 151863 310842 566749
13480 566749 552975 510914 570306 361922 132318 165597 198628 298820 322833 275906 233752
13469 233752 80700 13015 107248 272957 237821 280893 40014 -156138 -35278 246588
13459 246588 240310 210744 40218 -183272 -300958 -187797 -137835 -22848 136738 329855
13449C29855J1070j62331j93839j35232R7742R8163J90466j1267m7214j5116K08225
13438C70522J71678o3503k24359n0664J60551j69339p4868J68495J23081o4458
13428C47136l09203q1868k51719O0314K06940P0969r4133J12644J41886q1468
13418A21498L9505J16364l8810J13829P2025n2011j78749o0975M2260R752j25692
13407E8996K2563j04204j07622l9904K29960N1317L0864P685r6176Q9105j15411
13396B7173l6559M4467J65671n9783p3438n3369J00828J61902R231O2961l3524
13385C15560l4746J20835j01244k56097m0434J25370m772p4951J57046K27573
13375D34140J14845O5996j10096k80559o1193J17805j04242o5450j18828j6312
$$ plain form
13449 329855 340925 178594 -15245 -150477 -52735 45428 235894 224627 177413 162297 370522
13438 370522 542200 478697 254338 203674 364225 194886 120018 288513 411594 347136
13428 347136 37933 -43935 -295654 -235340 -28400 42569 -51564 61080 202966 121498
13418 121498 161003 277367 238557 352386 424411 372400 193651 132676 174936 184688 58996
13407 58996 81559 -22645 -130267 -170171 59789 111106 141970 149655 53479 142584 27173
13396 27173 -9386 35081 200752 140969 67531 14162 114990 276892 286123 349084 315560
13385 315560 280814 401649 300405 44308 3874 129244 124472 49521 206567 434140
13375 434140 548985 614981 504885 224326 163133 280938 176696 111246 -7582 -23894
13365b3894Q6746j16088k5642l1674K7597j63125r7755K46670J15340J76092k0442
13354A73825j04456J1718m960P6643j05632r8002j92856J84576K80812k0647k3686
13343A77335P1956j73788j34062j52917L2563J37183Q3320m1949j83193R366J54922
13332a9264j1224k6663J81914J76552O6814O5453L0734j1229j04178j14693P4457
13321C08673N5024n4023J1977P256j15087q9116l5892Q0763j72039j3973J42487
13310A26050L8843p1466r3900J44883M1977k8407l9969m5223j25644J72800p1448
13299D8496j9353J00034j48556K0542L15459K71044K01141k10909l52188k03970
13289B1740J4936K67862K3903j41540M8852n6263K2397J03677N8936P4846M0595
$$ plain form
13365 -23894 62852 -53236 -78878 -110552 -82955 -246080 -343835 -97165 18175 194267 173825
13354 173825 69369 81087 76127 152770 47138 -50864 -243720 -59144 221668 201021 177335
13343 177335 249291 75503 -58559 -211476 -178913 -41730 41590 -359 -183552 -174186 -19264
13332 -19264 -30488 -57151 124763 301315 368129 433582 464316 453087 348909 234216 308673
13321 308673 363697 309674 321651 328907 213820 124704 88812 169575 -2464 -16437 126050
13310 126050 164893 93427 -473 144410 186387 157980 118011 72788 -52856 119944 48496
13299 48496 29143 129177 -19379 1163 316622 587666 788807 577898 225710 21740
13289 21740 36676 304538 328441 186901 235753 179490 201887 305564 364500 439346 479941
13278D79941o0523l15897j72167n0425r4544J40040K31031L69488J36051K669
13268F65664j65930K3825J94130l5237r6087k30521k27996k11544k33088P3121
13258b43663M12500K13504N2208N3512j25214L4056p6451M1741j53807n2636J75388
13247C31138J32157J2367L8954m7648k47342J21792J9268j19670K51562J32096
13237F24674k34566k85574J46272r6660o1317J97435N6520j46270q2864l1076
13227H6574l110p4818j12025R4923J00804J9396k32429j8325l17k2353J06295
13216e5385J67400J49850p6515P792M6952j18661J59371J05011n291r2447j52026
13205A36051p5538K52354J2179q0872L843J55472R8710m7734l37942j91013m1356
$$ plain form
13278 479941 419418 103521 -68646 -119071 -213615 -73575 157456 526944 662995 665664
13268 665664 499734 523559 717689 682452 586365 355844 127848 -83696 -316784 -243663
13258 -243663 168837 382341 434549 488061 362847 396903 320452 362193 208386 155750 331138
13247 331138 463295 475662 514616 466968 219626 341418 360686 241016 492578 624674
13237 624674 390108 104534 250806 154146 92829 290264 346784 200514 117650 86574
13227 86574 83464 8646 -103379 -8456 92348 111744 -120685 -139010 -139327 -161680 -55385
13216 -55385 112015 261865 185350 193142 240094 121433 280804 385815 380524 288077 136051
13205 136051 60513 312867 325046 244174 248017 403489 502199 454465 116523 -74490 -115846
13194a15846j25775q9231K77321J52607J12158J50248j98124l7936O2512j09090
13184G8844K9011N9123J93036O8887J28601j47586Q3648j53741J04319K02654
13174F46796j70267j85800j74676J78005J97626k89433l03990j20641p7069R0455
13164b08994J99440p912J20869L91166k0926j86692j53411J02410p6230O7123
13154B26843J53705J81236P923j63320o7757q5862j2596O6254q0822j532J01996
13143C26068R1882j91223j48835P7845R6002Q1531k09133j73441K540K08628L4732
13132A96596K45496Q0412j6921Q6688l3261j92055j22365j50463j1070J3288k9704
13121F6641j62056K6042N2360o665J51834O3214o317l0970J27680j2492L770n5611
$$ plain form
13194 -115846 -241621 -330852 -53531 99076 211234 361482 163358 125422 187934 78844
13184 78844 107855 166978 360014 428901 557502 409916 493564 339823 444142 646796
13174 646796 476529 290729 116053 294058 491684 202251 -101739 -222380 -299449 -208994
13164 -208994 -9554 -17466 103403 494569 473643 286951 133540 235950 159720 226843
13154 226843 380548 561784 569707 406387 338630 252768 240172 306426 225604 224072 326068
13143 326068 417950 226727 77892 155737 251739 333270 124137 -49304 -46764 161864 196596
13132 196596 442092 522504 505583 592271 559010 366955 244590 94127 83057 96345 66641
13121 66641 -95415 -69373 -17013 -23678 128156 191370 185053 154083 281763 269271 273041 217430
13109B17430P057j21486M002J035J74932j8248M9140M0160L0829J92264K7669
13098F04784m4184O5914p6571j97118p7307J96337j77029r5664n0436K3594J77701
13087C50021O6304p0163n7762O9172J93047J9415l7467p0940J1710r8061j18793
13076B56483l0524k32525p0240J09342o1212K7357K77926J43320K35734p4896
13066E80765J1925L082J28637j3078j06036j65130O2084j6762J48639Q90j29131
13055E05885j00736j05532J24721K11949j33510j77397K9904M9167L4419J8616
13045D57486N4408j45837m0813p9731j23460o7451J52087r000J09751J43168p5901
13034C74707r101j43060k81881K5655K05926K27962j90498o3017J04425m3535
$$ plain form
13109 217430 224487 103001 107003 108038 282970 264722 313862 354022 384851 577115 604784
13098 604784 560600 626514 549943 352825 275518 471855 294826 199162 148726 172320 350021
13087 350021 416325 346162 288400 357572 550619 570034 532567 461627 473337 375276 256483
13076 256483 225959 -6566 -76806 32536 -28676 -1319 276607 419927 655661 580765
13066 580765 592690 595772 724409 711331 605295 440165 502249 485487 634126 635016 505885
13055 505885 405149 299617 424338 636287 502777 325380 355284 404451 438870 457486
13045 457486 511894 366057 325244 245513 122053 54602 206689 197689 307440 450608 374707
13034 374707 365606 222546 -59335 -33680 172246 400208 209710 146693 251118 207583
13024B07583K56448Q7696p2405q5553j29344r3560K35427J30031K8953r9563j47020
13013C18693J21958q2129l3805j35794j16384n7320J58241Q9433J68272Q8085
13003E19250j24611j77480J7568j8656n1398n8632J31536K16092l130o304J53489
12992E97724o5912J47749J79113p6357o3681l9967m3206q6745j03167j29595P9217
12981C95173J5002l9200l2387j07644m6215P1270q6660j71808n5558R3000l0464
12970D509J76055P9295n4409l79816o2476L04190K84741K12446P048N0354P5638
12959F97575o2769n9943j79820j33366m4341p9289O1025J46929J45591R3337r6884
12948D88045K3844q3119L9201q8341j30097j6718j08224q0541J28634K48634K2985
$$ plain form
13024 207583 464031 551727 479322 393769 264425 170865 406292 536323 565276 465713 318693
13013 318693 440651 358522 324717 188923 72539 15219 173460 262893 431165 519250
13003 519250 394639 217159 234727 216071 164673 106041 237577 453669 450539 444235 597724
12992 597724 531812 679561 858674 782317 718636 678669 635463 548718 445551 315956 395173
12981 395173 410175 370975 338588 230944 184729 255999 169339 -2469 -58027 34973 4509
12970 4509 180564 259859 205450 -174366 -236842 67348 352089 564535 571583 621937 697575
12959 697575 634806 574863 395043 261677 217336 138047 199072 346001 491592 584929 488045
12948 488045 511889 428770 467971 379630 249533 232815 124591 44050 172684 421318 444303
12937D44303j0118p6724q2311j27559j71831J20175J20696P39K14917Q7519L5288
12926E55094j5672k12706p8770L1703p7905K200J60635J52835j41527j71968J71553
12915C75472l2776n6089n0427Q6354M9243N8534k44253r1003J31582M235k6857
12904B04015P7482N9511n1100N9634J00564n3381J5453K15667r123k40648p9918
12893B98156N5522j8917j18919j2885K06401J0291J00767N6408j35131k9428O727
12882D18992P9789p1430j49383j07538J31881K57328J34170k31120K3796O6931
12872E53416k17160r3492o2028j49997M2712M6547J10206M8296J0926k8567P8405
12861C39264r5768Q8545J96938J99036O5223L487o3186j68582j20272j66617j61134
$$ plain form
12937 444303 434185 357461 275150 147591 -24240 95935 216631 217370 432287 519806 555094
12926 555094 539422 326716 247946 279649 201744 203944 364579 517414 375887 203919 375472
12915 375472 342696 286607 236180 322534 371777 430311 186058 95055 226637 230872 204015
12904 204015 281497 341008 289908 349542 450106 396725 412178 627845 618722 378074 298156
12893 298156 353678 334761 215842 202957 409358 419649 520416 576824 441693 412265 418992
12882 418992 498781 427351 277968 170430 302311 559639 693809 462689 486485 553416
12872 553416 336256 242764 180736 30739 73451 119998 230204 278500 289426 260859 339264
12861 339264 243496 332041 528979 728015 793238 796725 733539 564957 444685 278068 116934
12850A16934R4481J97085P8993J57488O2206k6997K3875K0155j21890k05871j09282
12839B87177P2914K50993J74395q3654m751j8006N4305j7776o5896j03711J31283
12828F77273j1898k20246k2898K03648J24742K6189J64741r4781j07898p4123
12818F64749O2152R3695j31194j14500q5457J66766O1771P2556j92443J08228
12808G06323m2025M458p127o5335j13754J32813J65184k8652j47335O5005O1046
12797G30601r7149l6519K5367J06334j54961M3944P1215o2572N5494K0019M9359
12786G51132j28094L3004p8946L162j9826k4062l9861J02142J05548p1967j4037
12775F18195j677n0560m806J02986J90526j02034m7692n5183o6234k53206M0993
$$ plain form
12850 116934 211415 408500 487493 644981 707187 680190 704065 724220 602330 396459 287177
12839 287177 360091 611084 785479 701825 697074 679068 733373 715597 649701 545990 677273
12828 677273 665375 445129 422231 625879 750621 776810 941551 846770 738872 664749
12818 664749 726901 820596 689402 574902 489445 656211 717982 790538 598095 706323
12808 706323 664298 668756 661629 596294 482540 615353 780537 751885 604550 669555 730601
12797 730601 633452 596933 622300 728634 573673 617617 688832 626260 681754 701773 751132
12786 751132 623038 656042 577096 580258 560432 536370 496509 598651 704199 632232 618195
12775 618195 616518 565958 561152 664138 854664 752630 704938 649755 583521 330315 371308
12764C71308Q1506J8055J47051K06766J9740j17287L5030r631R1594n2154q405
12753G83573j43296p5143k2486K12751m5479k45834l8676L9236o6970n6623N9841
12742D00894O0746M1559Q2541j53333M832O8564O8915K7025M0014j45885o0226
12731D35646n1505J09578K18349k0724j00060J55570J61205p8732L6419m1255
12721H24491j99139O4311K5543j41232l6820O9057J50612m9756l6598J99207l489
12710H66187m0260j0415m9975j13681k2078j9502n9779j49498j1530Q2987J05761
12699E78217J85346O371j75041J67898P8717R6144J55438j11743j71870L3929
12689H43406k34886k7569K11914M8378j2927k4872j09832l9780N3620K24771J40061
$$ plain form
12764 371308 452814 470869 617920 824686 844426 727139 762169 752538 844132 791978 783573
12753 783573 640277 565134 542648 755399 709920 464086 425410 464646 397676 341053 400894
12742 400894 461640 503199 585740 432407 437239 505803 574718 601743 641757 495872 435646
12731 435646 384141 493719 712068 691344 591284 746854 908059 829327 865746 824491
12721 824491 625352 689663 715206 573974 537154 606211 756823 707067 670469 869676 866187
12710 866187 825927 815512 765537 651856 629778 610276 550497 400999 389469 472456 578217
12699 578217 763563 769934 594893 762791 841508 937652 1093090 981347 809477 843406
12689 843406 608520 580951 792865 841243 828316 803444 693612 653832 707452 932223 1072284
12678A072284j29945p3511j02351Q6007K36354n0042j42664j93061j68359O8006
12668F02718J85018L0151L7914Q7331J34124K35010o1853m07414j42440K19483
12658I20042n3476j14492j11257Q1693m8075Q0762J93091k8136j71831n5178L660
12647F96803q9363R7358K87166J20098Q0151k34708k26010q3316J56825J21125
12637I26129K82063r0382l26551j82637k28483j08405L1860J14245N1099P3270
12627E42208R1911K7243J29429K14188o8901j3638j02952J1709K45579J08835
12617A185611n1110j50765n5711j54909q6847q0788J00538K39043J6686k89767
12607F71981K8561J31214O8185M4995m362J61989m8958J5072j53626J55009P2908
$$ plain form
12678 1072284 942339 868828 766477 852484 1088838 1038796 896132 703071 534712 602718
12668 602718 787736 817887 855801 943132 1077256 1312266 1250413 842999 700559 920042
12658 920042 866566 752074 640817 722510 674435 755197 948288 920152 748321 693143 696803
12647 696803 607440 704798 991964 1112062 1192213 957505 731495 648179 805004 926129
12637 926129 1208192 1117810 791259 608622 380139 271734 303594 417839 468938 542208
12627 542208 634119 661362 790791 1004979 936078 922440 819488 831197 1076776 1185611
12617 1185611 1134501 983736 928025 773116 686269 605481 706019 945062 961748 671981
12607 671981 700542 831756 899941 944936 940574 1102563 1053605 1068677 915051 1070060 1142968
12596A142968R3059j75915M5499l4161p154K2741M867N1890j48424J73527j29629
12585A039268k46282J3328J40472p4949k8452J31673N8686K41519J3041j66248
12575A122056j6430J92329j51850j46862J30593J8664J68549n829r3426j88085
12565A029709K1526J63757K0561r8617P1837K4641j29685j60074m2151J5303m4549
12554H72258n7163J63510N2129J60629J0502o3820J5711j409r1488k2359o4556
12543I73944k3276K15719n7099q0897J81974P0168k00269j10140k02136J6338
12533G84326L2364M9123N1186N9045j15431L1744P3439n1765J30722R4766k7135
12522A112384k5779K9514P4612O0379M0514j66295o8933L02791p1329q539j24127
$$ plain form
12596 1142968 1236027 1060112 1105611 1071450 1064296 1087037 1091904 1143794 995370 1168897 1039268
12585 1039268 792986 806314 946786 871837 843385 975058 1033744 1275263 1288304 1122056
12575 1122056 1105626 1297955 1146105 999243 1129836 1148500 1317049 1311220 1217794 1029709
12565 1029709 1051235 1214992 1235553 1136936 1208773 1233414 1103729 943655 901504 916807 872258
12554 872258 815095 978605 1030734 1191363 1201865 1138045 1153756 1152347 1060859 1038500 973944
12543 973944 950668 1166387 1109288 1028391 1210365 1280533 1080264 970124 767988 784326
12533 784326 816690 865813 916999 976044 860613 892357 965796 914031 1044753 1139519 1112384
12522 1112384 1086605 1116119 1190731 1251110 1291624 1125329 1056396 1359187 1287858 1279319 1155192
12511A155192J83570J41080k7912k3000p67k14062N2298k2519N1375N2211q8809
12500A258657j35542q8547J61644K26453L9727J87476j02801k14580p2793j08239
12490A151455j4574R3257M8984l8956J26742J35095r0713O5106J26353J85729
12480A788478m4924j62657r7322j36936L6988m4091p002j46407N46p0294o4633
12469A051746J27360P8188J90132J1641j41755J64034K59290M793k39933l00801
12459A204695J322O2724K16968J56120K1559R0637J95423k08004n7190J1170J70268
12448A865692L2701q3465O7414O127p0992j29509k51150n3256K57851P260J43566
12437A792239j67170j77417j2125K28406J7853m8302K6080m4124p6064M3895r0390
$$ plain form
12511 1155192 1338762 1479842 1451930 1428930 1428163 1214101 1266399 1243880 1295255 1347466 1258657
12500 1258657 1123115 1034568 1196212 1422665 1462392 1649868 1547067 1332487 1259694 1151455
12490 1151455 1136881 1230138 1279122 1240166 1366908 1502003 1411290 1476396 1602749 1788478
12480 1788478 1743554 1580897 1483575 1346639 1383627 1339536 1332534 1186127 1186673 1116379 1051746
12469 1051746 1179106 1257294 1447426 1459067 1317312 1481346 1740636 1745429 1505496 1204695
12459 1204695 1206017 1268741 1485709 1641829 1663388 1754025 1949448 1741444 1684254 1695424 1865692
12448 1865692 1898393 1814928 1882342 1888469 1817477 1687968 1436818 1383562 1641413 1648673 1792239
12437 1792239 1625069 1447652 1435527 1663933 1681786 1633484 1659564 1615440 1539376 1583271 1492881
12426A492881l9080J31012P8665j69856j9628K0252J38522J84306m2221j83211
12416A591642j40235J30283L3184J10266J44806J31803j86940o3016K2694j65771
12406A608716J9231n4297p0500P9518m1082K7220K68933N127j02724O6329O5828
12395A872299Q3577J37495m2124Q0121n5228K5088o5855m0941N4569O8902j7709
12384B100194o6093j61910n545J90875P8137j7627K3554L8430k34176j47076j2034
12373A786729J17852J27392q9334K9034P1802j75130J55332o0277k70891j68575
12363A523934M0035K19659J25928k25687j09922J0053J13104J15673P6515J36218
12353B025510K1166p420J3399l0100l2259J15604Q6031R0729O2859l9059j30480
$$ plain form
12426 1492881 1453801 1584813 1663478 1493622 1473994 1494246 1632768 1817074 1774853 1591642
12416 1591642 1451407 1581690 1614874 1725140 1869946 2001749 1814809 1751793 1774487 1608716
12406 1608716 1627947 1573650 1503150 1582668 1541586 1568806 1837739 1842866 1740142 1806471 1872299
12395 1872299 1955876 2093371 2051247 2131368 2076140 2101228 2035373 1994432 2049001 2117903 2100194
12384 2100194 2034101 1872191 1866646 2057521 2135658 2118031 2141585 2180015 1945839 1798763 1786729
12373 1786729 1904581 2031973 1942639 1971673 2043475 1868345 2023677 1963400 1692509 1523934
12363 1523934 1563969 1783628 1909556 1683869 1573947 1584000 1697104 1812777 1889292 2025510
12353 2025510 2046676 2039256 2052655 2022555 1990296 2105900 2191931 2282660 2345519 2306460 2175980
12342B175980j2959N0396j6138j44708j28831M2182J00626n1681j13114o0649
12332A841104J61665J84789J53628k64295j30617o5894l9419L1462K77048Q9645
12322B239116j45005n623J52373P8893J00017R6201q9643o9716l8768o5168J14328
12311B367005j08265k03702j29746J36836J9048J21704R2521m6494J49986R0261
12301B489154J4954Q9719k3657k47021n4286N7097N0829J95221j84449k98745
12291B088816O1938Q4411R471J19155M7105n0225m6753J05421L9653l0809n2354
12280B375829J21221J24591l2793K01866k8527l13517j10828K77131J45317m4672
12270B715618P5455L942J18614j10901k50347Q614k5946J43640J82423J22143
$$ plain form
12342 2175980 2163021 2213417 2197279 2052571 1923740 1965922 2066548 2014867 1901753 1841104
12332 1841104 2002769 2187558 2341186 2076891 1946274 1880380 1840961 1872423 2149471 2239116
12322 2239116 2094111 2088488 2240861 2319754 2419771 2515972 2426329 2356613 2317845 2252677 2367005
12311 2367005 2258740 2055038 1925292 2062128 2081176 2202880 2295401 2248907 2398893 2489154
12301 2489154 2504108 2593827 2570170 2323149 2268863 2325960 2376789 2572010 2387561 2088816
12291 2088816 2150754 2235165 2244636 2363791 2410896 2360671 2313918 2419339 2458992 2428183 2375829
12280 2375829 2497050 2621641 2588848 2790714 2762187 2448670 2337842 2614973 2760290 2715618
12270 2715618 2791073 2795015 2913629 2802728 2552381 2560995 2535049 2678689 2861112 2983255
12260B983255P6101j64249j14236J36117m227j07457R3272J23376p5983l4912
12250B911057p8033Q6636L8780j2435r3775J2395J45134Q8126R4904q242l4486
12239C150061J4842L1420r5687j45117j8796K19835Q1970K3562M1175j99477K9860
12228C133648o2501Q8509R2503l9566R0216J10949q3399L1704N3253j6853N5023
12217C453486r092l42436l0818J07304J93477r4178j21817n8218J03218J8305
12207C219231j02767l233K9067J59777J21589p3262o564K7968o3158L9494R8652
12196C446794L2713L7460n6632J7034j28098p2554J81017K8673j44409k20508
12186C121490p8970J46930L76903J42429P9192j3472k90515l2862j36611M5775
$$ plain form
12260 2983255 3059356 2895107 2780871 2916988 2912761 2805304 2898576 3021952 2945969 2911057
12250 2911057 2833024 2919660 2958440 2946005 2852230 2864625 3009759 3097885 3192789 3184547 3150061
12239 3150061 3164903 3196323 3100636 2955519 2936723 3156558 3238528 3262090 3303265 3103788 3133648
12228 3133648 3071147 3159656 3252159 3212593 3302809 3413758 3330359 3362063 3415316 3398463 3453486
12217 3453486 3444394 3101958 3071140 3178444 3371921 3277743 3155926 3097708 3200926 3219231
12207 3219231 3116464 3113231 3142298 3302075 3423664 3350402 3343838 3371806 3308648 3348142 3446794
12196 3446794 3479507 3516967 3460335 3477369 3349271 3276717 3457734 3486407 3341998 3121490
12186 3121490 3042520 3189450 3566353 3708782 3787974 3774502 3483987 3451125 3314514 3360289
12176C360289K11007j24277k13619n0979J28083J78872J42655k14299K14454K22735
12166C854921k7258n0943K502J75648o0391j26444l6141J32232J85264J06312
12156D155702j01327L950M8984j29987m4022j61092Q746J072p8365J56408K29819
12145D089888L83761k6438j31416k9145j80577k7279O7529N8590K00645q9130
12135D316428j97741r2041J7138K9526R2522k3009q3006J9653Q5519j86927K1973
12124D000035m6772l6799K93870J01804J2989j07969L5550J0340M1185J72651
12114D476884J15235j57899l8778J08007K21852k3360l4901r0365P164j3699k11688
12103D358452O8672J51738P5644p6136m6744O1468L949k6619k33222K42803K84423
$$ plain form
12176 3360289 3571296 3447019 3233400 3182421 3310504 3489376 3632031 3417732 3632186 3854921
12166 3854921 3827663 3776720 3779222 3954870 3894479 3768035 3731894 3864126 4049390 4155702
12156 4155702 4054375 4058325 4107309 3977322 3933300 3772208 3780954 3782026 3703661 3860069 4089888
12145 4089888 4473649 4447211 4315795 4286650 4106073 4078794 4146323 4204913 4405558 4316428
12135 4316428 4118687 4026646 4043784 4073310 4165832 4142823 4059817 4079470 4164989 3978062 4000035
12124 4000035 3953263 3916464 4210334 4312138 4325127 4217158 4252708 4263048 4304233 4476884
12114 4476884 4592119 4434220 4395442 4503449 4725301 4701941 4667040 4576675 4583839 4570140 4358452
12103 4358452 4427124 4578862 4654506 4578370 4531626 4593094 4597043 4570424 4337202 4580005 4864428
12092D864428N3772k1728J9087l4362N1911J17219N8204j10501P6288J53958l487
12081E224789l15999n7388K08150j90582m7970J02098j2074n8584k103J88732
12071E039069O5727j0200j67274k5365K11547J15717j65520L3733J38929J44694
12061E381057j36000k55722q7997K30141M3860q3479K87042K7260m4273j90134
12051E171755l4176r6464m7104K64233J82292K20912J445k77524q1959K49321
12041E552731j1793j41518Q5339k6627J20523R6736J25385j49126l4982N7531
12031E674199o0819j72428J3912J02601r9101n9373R2386m2483K9515K7890n7749
12020E448550j37500K02683p8034J24353N8394k6351o9517p1470j34750J7894
$$ plain form
12092 4864428 4918200 4896472 4915559 4881197 4933108 5050327 5108531 4998030 5074318 5228276 5224789
12081 5224789 4908790 4851402 5059552 4868970 4821000 4923098 4911024 4852440 4850337 5039069
12071 5039069 5104796 5094596 4927322 4901957 5113504 5229221 5063701 5097434 5236363 5381057
12061 5381057 5245057 4989335 4901338 5131479 5175339 5091860 5378902 5406162 5361889 5171755
12051 5171755 5137579 5041115 4994011 5258244 5440536 5661448 5662893 5385369 5303410 5552731
12041 5552731 5540938 5399420 5484759 5458132 5578655 5675391 5800776 5651650 5616668 5674199
12031 5674199 5613380 5440952 5454864 5557465 5458364 5398991 5491377 5448894 5478409 5506299 5448550
12020 5448550 5311050 5513733 5435699 5560052 5618446 5592095 5522578 5451108 5316358 5334252
12010E334252P2563p217R861j4854j21980J13642O6624L7361L09375K59252k5382
11999F033497o4144J7285k47836p6197K17085J11880p5632J41551k4592j40434
11989E892463o6711n4689L2078K22627q6464j07430P4413Q6137J51890o0291j03676
11978E980347n6349M4881N2919J29811o0886K7986L5928l091K7481l4300o5294
11967F079433l471k5623J36770k81875O3543K65181j00513j06626n5003o1441
11957E910375p1649o2283L5563Q973j40658K57601K99387J49297r1131m7487j80939
11946F067049L4386l734j79929j54929J68900L91601J03692k36501k28736Q3862
11936F045661p873k9142J9519m8710j17557j23774J24187K81275j26098k348J62659
$$ plain form
12010 5334252 5406815 5399598 5409459 5394605 5272625 5386267 5452891 5490252 5799627 6058879 6033497
11999 6033497 5969353 5986638 5738802 5662605 5879690 5991570 5915938 6057489 6032897 5892463
11989 5892463 5825752 5771063 5803141 6025768 5939304 5831874 5906287 5992424 6144314 6084023 5980347
11978 5980347 5923998 5968879 6021798 6151609 6090723 6118709 6154637 6151546 6179027 6144727 6079433
11967 6079433 6075962 6050339 6187109 5905234 5968777 6233958 6133445 6026819 5971816 5910375
11957 5910375 5838726 5776443 5812006 5820979 5680321 5937922 6237309 6386606 6295475 6247988 6067049
11946 6067049 6101435 6097701 5917772 5762843 5931743 6323344 6427036 6190535 5961799 6045661
11936 6045661 6037788 6008646 6028165 5979455 5861898 5738124 5862311 6143586 6017488 6015140 6177799
11925F177799K12398l4262m5852l3584j60920j24173M2340J78692O6348j87874
11915F090912K4562N3375j17376r8209l7458j11876j87935n0521J06269J18490
11905E790233K46036J81335j26303l36965j55305J26322P8376M731J15053K01595
11895F125108K07726M4057j72153n1385L4563j30846j55263J76351j02889j15660
11885E859609J18268J14372N4736o7490j20892l9186J72443M856l0278r0043J9697
11874E996092J74621Q037k67738j13265K1022j9568J41648J9572j28083p3637
11864E758701L4297m2068o4553k54718J5759R6753J83162K34178j40506j45948
11854E675057O9196j6356P8884q0827l4918j08707P6228o6785L5522K16143K2996
$$ plain form
11925 6177799 6390197 6355935 6310083 6276499 6115579 5991406 6033746 6212438 6278786 6090912
11915 6090912 6115474 6168849 6051473 5953264 5915806 5803930 5615995 5565474 5671743 5790233
11905 5790233 6036269 6217604 6091301 5754336 5599031 5725353 5803729 5808460 5923513 6125108
11895 6125108 6332834 6376891 6204738 6153353 6187916 6057070 5901807 6078158 5975269 5859609
11885 5859609 5977877 6092249 6146985 6079495 5958603 5919417 6091860 6096716 6066438 5976395 5996092
11874 5996092 6170713 6178750 5911012 5797747 5818769 5799201 5940849 5960421 5832338 5758701
11864 5758701 5792998 5750930 5686377 5431659 5447418 5544171 5727333 5961511 5821005 5675057
11854 5675057 5744253 5727897 5806781 5725954 5691036 5582329 5658557 5591772 5627294 5843437 5866433
11843E866433O7427J06742j40388L9382q4179k04572L5996m1344j35699M7662
11833E557460J6431J00384r0890j30786p2694m3764k6835n5101k0802j17470k73755
11822D842178O687K29032M12335P4580o1467j74226k1003K07417k46360j56516
11812E112657N2457J46983Q5400l0544n3976N0353r6809L4777N564k31491J026
11801E076397j3388j21912m9201J98476m0954m6615J0793K39731m7162j79499
11791E026666R5425K0531j96836j31312j31457N7336J69805k9896K3392j36014
11781D767640k12733O5183N3047J65698L7088L6722P659j75607k10462o1011J14332
11770D587556J83861O4191J7249r2051j10437q2238n8241j48611j85567P0907
$$ plain form
11843 5866433 5933860 6040602 5900214 5939596 5855417 5650845 5686841 5645497 5509798 5557460
11833 5557460 5573891 5674275 5583385 5452599 5379905 5336141 5309306 5254205 5233403 5115933 4842178
11822 4842178 4848865 5077897 5490232 5564812 5503345 5329119 5308116 5515533 5269173 5112657
11812 5112657 5165114 5312097 5397497 5366953 5312977 5363330 5266521 5301298 5306862 5075371 5076397
11801 5076397 5063009 4941097 4891896 5090372 5049418 5002803 5013596 5253327 5206165 5026666
11791 5026666 5122091 5142622 4945786 4814474 4683017 4740353 4910158 4880262 4903654 4767640
11781 4767640 4554907 4620090 4673137 4838835 4875923 4912645 4920304 4744697 4534235 4473224 4587556
11770 4587556 4771417 4835608 4852857 4760806 4650369 4568131 4509890 4361279 4175712 4246619
11760D246619O4642r1244j9980K05516Q8369j26001j43775J23116R5198k54033
11750D188427j94331J8808J91668J28073j43081k4892j35974l5192J46397K54815
11740D394718P5271j6141j54432j82921J06764J14812K2199J7376j17274r3260
11730D167112k2835J8036J54546J97492k71532l43538K3161J3672n4486p433M775
11719C878970J01877j40298k3216P431n0009K127n948J47850K7346K9350K42401
11708D217881j28217l11154j43716L4072Q5484P4002L5087Q0725q2118p5175K4219
11697C811090n5527j20216J54691M1223j40227Q0472L3442N8694M9697r3242l21033
11686C499064P799J53506J0238L480k8973j79436j14141J30500N806j3350k435
$$ plain form
11760 4246619 4311261 4220017 4200037 4405553 4493922 4367921 4224146 4347262 4442460 4188427
11750 4188427 3994096 4012904 4204572 4332645 4189564 4164672 4028698 3993506 4139903 4394718
11740 4394718 4469989 4453848 4299416 4116495 4223259 4338071 4360270 4377646 4260372 4167112
11730 4167112 4144277 4162313 4316859 4514351 4242819 3899281 3922442 3936114 3881628 3874195 3878970
11719 3878970 3980847 3840549 3817333 3824764 3774755 3776882 3770934 3918784 3946130 3975480 4217881
11708 4217881 4089664 3778510 3634794 3668866 3754350 3828352 3863439 3944164 3862046 3786871 3811090
11697 3811090 3755563 3635347 3790038 3831261 3691034 3771506 3804948 3863642 3913339 3820097 3499064
11686 3499064 3506863 3660369 3670607 3674087 3645114 3465678 3351537 3482037 3487843 3474493 3472058
11675C472058j30523r9585J1928K3673J19296o0068K0812J17035K54j77978j20065
11664C176837m9854Q145J611n4071l4904q4858M8903K56652O7846j02793j31968
11653C101546k02889J746p4027J23611M5475Q028j30722j43352o6385J11977J06542
11642B881550J05636P4113o1014o1636K26756n2533j33329o2421J4314k9565k00636
11631B701235m3157P3761M9671j96448P0718J33413P8141J62119J27303j16341
11621C040415k70856m4942J24738j33585m37j9206O1952K64923j08393R476k9990
11610B894095j66769L1074p054r1533J39168P2569k43860j28137K0543J81408
11600B701504p0127q9023l9937j07451J7500J04545R7597m08k8306M5798j02826
$$ plain form
11675 3472058 3341535 3241950 3253878 3277551 3396847 3336779 3357591 3474626 3474880 3296902 3176837
11664 3176837 3126983 3135128 3136739 3082668 3047764 2962906 3011809 3268461 3336307 3233514 3101546
11653 3101546 2898657 2900403 2826376 2949987 2995462 3003490 2872768 2729416 2663031 2775008 2881550
11642 2881550 2987186 3061299 3000285 2938649 3165405 3112872 2979543 2917122 2931436 2901871 2701235
11631 2701235 2658078 2731839 2781510 2585062 2655780 2789193 2867334 3029453 3156756 3040415
11621 3040415 2769559 2724617 2849355 2715770 2715333 2696127 2758079 3023002 2914609 2924085 2894095
11610 2894095 2727326 2758400 2751346 2659813 2798981 2871550 2627690 2499553 2520096 2701504
11600 2701504 2631377 2542354 2502417 2394966 2412466 2517011 2614608 2614200 2585894 2631692 2528866
11589B528866j72040P320J30115K4455j7866Q4041L3439l8369j32682j94626j44426
11578B108227L9227K13210J23747J8038j74066j58951j06585q4320Q9348j6657
11568B051218J53273O5302q2071o2086J7329j089j2677O4651j68295m7366j1830
11557A966359l140R911J42350O7483K2939o9047R4863L9538J19706k18980j70946
11546B001036o5796J88807J52536n6365n4740P9719M2747j44885j16540l9742
11536A986777o7508O1502p6479q5142R3465r0894n1229P4402M5711j0503J06342
11525A986444K8076q4980O9739J9296k38286n7165j03926m0454J04863K07849
11515A891456K27091O7459R567j89088l3988j10074j15593K37082O7721m3292
$$ plain form
11589 2528866 2356826 2364146 2494261 2518716 2500850 2584891 2618330 2579961 2447279 2252653 2108227
11578 2108227 2147454 2360664 2484411 2502449 2328383 2169432 2062847 1978527 2067875 2051218
11568 2051218 2204491 2269793 2187722 2125636 2142965 2141876 2129199 2193850 2025555 1978189 1966359
11557 1966359 1963219 1973130 2115480 2182963 2205902 2136855 2231718 2271256 2390962 2171982 2001036
11546 2001036 1935240 2124047 2276583 2220218 2165478 2245197 2287944 2143059 2026519 1986777
11536 1986777 1919269 1980771 1904292 1819150 1912615 1821721 1770492 1844894 1890605 1880102 1986444
11525 1986444 2014520 1929540 1999279 2018575 1780289 1723124 1619198 1578744 1683607 1891456
11515 1891456 2118547 2186006 2195573 2006485 1972497 1862423 1746830 1983912 2051633 2008341
11505B008341l25962j55948l344j28214O2045K5353J06615J31281R3176m9476
11495A763867r0253o2565j6163J70662J62545J53955q5267J37819k2097O4847
11485B177350j04666k80310j43374L7701K5492r3442N5880p0324N1025j5683k4561
11474A615088m8791q4366j81463M0177O5170j26250J8917K17694q3383o0258J21278
11463A493813P7742p414j25030m4798K32578m3818r7390J11079J41762k00697
11453A537827p2688q242o5052L0844R2829q0885j68145j10437K221M7179L4518
11442A239969J13860J56140J84490m863r9741r1732j21273j16861q6223J66302
11432A340068J48468j18638m2550j21554P9637J9635J54603J45399l34371J9234
$$ plain form
11505 2008341 1682379 1526431 1523087 1394873 1456918 1482271 1588886 1720167 1813343 1763867
11495 1763867 1673614 1611049 1594886 1765548 1928093 2082048 1996781 2134600 2112503 2177350
11485 2177350 2072684 1792374 1649000 1686701 1712193 1618751 1674631 1604307 1655332 1639649 1615088
11474 1615088 1566297 1481931 1300468 1340645 1405815 1279565 1298482 1516176 1432793 1372535 1493813
11463 1493813 1571555 1564141 1439111 1394313 1626891 1583073 1485683 1596762 1738524 1537827
11453 1537827 1465139 1456897 1391845 1422689 1515518 1434633 1266488 1156051 1158272 1205451 1239969
11442 1239969 1353829 1509969 1694459 1689596 1589855 1498123 1376850 1259989 1173766 1340068
11432 1340068 1488536 1369898 1327348 1205794 1285431 1305066 1459669 1605068 1270697 1289931
11422A289931J01526j621N5235J34509k5704j5282J20242k775k13817m6646R3822
11411A489420k836o1637o4861P7509J56421M2774N071j59691j99779R9593N7169
11400A439153j04257O3203J05471K778O6685Q8701j97376p2905k07128k56921
11390I27404P7374J82835L4657J05553j16564l6574Q6445J2806k0356j06800j38632
11379A008148j13835Q5013J84481j48363j38262l3596K82789Q0620k1797m0058
11369A145140r4769J79380k7123r6223J61200M9099k57534j73586r9021L0340
11359H16903J89443J03756K4041o612J31979L9656P2244j72155J20309J99075
11349A518639j91394k54544j51582R8950N0822n7473N0775m3147R574j68287j11825
$$ plain form
11422 1289931 1391457 1389836 1445071 1579580 1553876 1538594 1658836 1656061 1442244 1395598 1489420
11411 1489420 1486584 1424947 1360086 1437595 1594016 1636790 1641861 1482170 1282391 1381984 1439153
11400 1439153 1334896 1398099 1503570 1506348 1573033 1661734 1464358 1391453 1184325 927404
11390 927404 1004778 1187613 1222270 1327823 1211259 1174685 1261130 1273936 1253580 1146780 1008148
11379 1008148 894313 979326 1163807 1015444 877182 843586 1126375 1206995 1185198 1145140
11369 1145140 1050371 1229751 1202628 1106405 1267605 1316704 1059170 885584 786563 816903
11359 816903 1006346 1110102 1134143 1127531 1259510 1299166 1371410 1199255 1319564 1518639
11349 1518639 1327245 1072701 921119 1020069 1070891 1013418 1064193 1021046 1030620 862333 750508
11338G50508J46551j2250K6650o2956j15481N4071J83255M4585j7291k64550j0854
11327G22238K00471J76978k9204l9100P2099j86630k04391j44018J51468L19232
11317A039143J91645O4012k47525j20282J61425J34319j59232k28042r2771k69
11307G42423j24854j77235J01590J84302O6651j5912q9634J24588j33037P0430
11297G49312l7422l4527Q5429k05182j19137l8664J10563J74932O6868J43799
11287H95971l2807j39476q2350K13565N290j19386k91665R1930L6384J52852j11615
11276F18693P0144K37535m2678m1899L7830q8007O039l573J7542N2194k15338
11265F48482r2753R5578N2455P4859J10210M1816l0564o9686J7243p8450n9106
$$ plain form
11338 750508 897059 884809 911459 848503 733022 787093 970348 1014933 997642 733092 722238
11327 722238 922709 1099687 1070483 1031383 1103482 916852 712461 568443 719911 1039143
11317 1039143 1230788 1294800 1047275 926993 1088418 1222737 1063505 835463 742692 742423
11307 742423 617569 440334 541924 726226 792877 776965 687331 811919 678882 749312
11297 749312 711890 677363 762792 557610 438473 399809 510372 685304 752172 895971
11287 895971 863164 723688 641338 854903 860193 740807 449142 541072 577456 730308 618693
11276 618693 688837 926372 883694 841795 879625 791618 797657 794084 811626 863820 648482
11265 648482 555729 651307 703762 778621 888831 930647 900083 830397 847640 769190 710084
11254G10084J91770j4563j12884p4106o6085Q8432L22706p0598k40770j31365
11244F02621q1486m3738j11353K24898K25395p0632k06327M0339j4187n684q8935
11233D70911j16703K6205K49646J44897M0831j29915j13818q8334k9583n2883
11223D01254M541R0893j8008k2619O7637K15924J24774k8629k25153k2466J96495
11212G84643K34561j02478k86242o5357J07554M3861n7960l5544p9222n4632R7184
11201E86368J02370j04449r6266J2534N2688k6394j21137J34309O7536r0960j77685
11190C38914Q0983K5896R8489K17905P7981l9726k38551j10831J39299J49876
11180G40235N7827J2902j3789n92k16040j28692n1950J55368r1827J31196K82849
$$ plain form
11254 710084 901854 887291 774407 700301 634216 722648 1045354 974756 733986 602621
11244 602621 521135 477397 366044 590942 816337 745705 539378 579717 565530 559846 470911
11233 470911 354208 380413 630059 774956 815787 685872 572054 483720 454137 401254
11223 401254 405795 496688 478680 456061 523698 739622 864396 835767 610614 588148 784643
11212 784643 1019204 916726 630484 565127 672681 716542 658582 623038 543816 489184 586368
11201 586368 688738 584289 488023 500557 553245 526851 405714 540023 607559 516599 338914
11190 338914 419897 445793 544282 762187 840168 800442 561891 451060 590359 740235
11180 740235 798062 810964 797175 796583 580543 451851 399901 555269 463442 594638 877487
11169H77487P9766j81090j08438m9955j06212j25799P3390J55004J16558j51159
11159E79552k03558j14358k9091K5927k0235M8920K48232n212N3689j8197p790
11148E57879o2318j52657M2642K74872P9092j39479l0027k17169n2279J28476
11138D29032K6649J91098J72831r2531r8481j71623j164l1003l9113j14257J14632
11127C86070J07803P62K582k1691J8860J43973K2602O0856m7989J2618k9951l5404
11115F21091k8976r9887j2518j47741l9296j71265R9403P5226N6719J50273J50055
11104F53084N9990j23695l4300m2379K049K9007J00689J2729J9132J4041j78513
11093E11834R005K35912K46887k08376l16909j05255p5150J18300L2211p0827
$$ plain form
11169 877487 957253 776163 667725 617770 511558 385759 459149 614153 730711 579552
11159 579552 375994 261636 232545 258472 238237 287157 535389 530177 583866 565669 557879
11148 557879 495561 342904 385546 660418 739510 600031 570004 352835 300556 429032
11138 429032 455681 646779 819610 727079 628598 456975 455811 424808 385695 271438 386070
11127 386070 493873 494635 497217 475526 494386 638359 660961 721817 673828 686446 656495 621091
11115 621091 592115 492228 479710 331969 292673 121408 220811 296037 352756 503029 653084
11104 653084 713074 589379 555079 512700 514749 543756 644445 657174 676306 690347 511834
11093 511834 520839 756751 1003638 795262 478353 373098 297948 416248 448459 377632
11083C77632J9199p1282P0036J24276J62311O4261n9410j0979k54031j19955J84852
11072D86910P7812J5174j91713j29469O4183J10150j05949l7743J44917m6542
11062C87730P427l464n7873n4252J0539J10354R3529o6116J65905J04008k59080
11051D38707n1534R0050L18619L19133P2093k0094P771L9903k41988J17512j409
11040A088763l9012K44203J51975J11064P7122J15777J19890K0072k78953k11385
11030A399516l6728K66791m4681J23265K94695K12061J93499J2717j09848k36973
11020B074314k25878k17268j59537p321J31122J48711l8839j82022M20835O6329
11010B010446l02967k11376j89850l9139k96792l40672J64073O5884J30569M9065
$$ plain form
11083 377632 396831 325549 395585 519861 682172 746433 687023 676044 422013 302058 486910
11072 486910 564722 579896 388183 258714 322897 433047 327098 289355 434272 387730
11062 387730 395157 391693 333820 279568 290107 400461 493990 427874 593779 697787 438707
11051 438707 387173 477223 795842 1114975 1187068 1166974 1174745 1214648 972660 1090172 1088763
11040 1088763 1049751 1293954 1445929 1556993 1634115 1749892 1869782 1889854 1610901 1399516
11030 1399516 1362788 1629579 1584898 1708163 2002858 2214919 2408418 2421135 2311287 2074314
11020 2074314 1848436 1631168 1471631 1464310 1595432 1744143 1705304 1523282 1944117 2010446
11010 2010446 1707479 1496103 1306253 1267114 970322 629650 793723 859607 990176 1039241
11000A039241K39347o2021j43857j2018K53k10714j56830k11371J46047M6521
10990F74598j79976j20141K9586m2847K3969j0101r2275J4297L19034J31633k07104
10979E40673p9502k710m0204p5855j95710n0352K0577J50460J25576J13236N0998
10968E57187j30544j64872J12994O8951r2577L81l364j903R7606k11526J86571
10957D18904J13496j70456k05319K8606m797l9753j24409K2792k2725J54435K14715
10946C85489N2178R6419J41662q1820k14743o7435K0264q9107j50701J66805q6572
10935A72439j00819J90644K17651Q3566j33277k90355K6945m0439J85261k4228
10925B87388K9089r4093n9415K180n3662j54388J18074J57874q1971L7341l3924
$$ plain form
11000 1039241 1278588 1216567 1072710 1060692 1060945 850231 693401 482030 628077 674598
10990 674598 494622 374481 404067 361220 385189 375088 282813 297110 616144 747777 540673
10979 540673 461171 458461 418257 342402 146692 96340 116917 267377 392953 506189 557187
10968 557187 426643 261771 374765 443716 351139 351520 348156 346253 443859 232333 418904
10957 418904 532400 361944 156625 185231 180434 140681 16272 39064 16339 170774 385489
10946 385489 437667 534086 675748 593928 379185 311750 332014 242907 92206 259011 172439
10935 172439 71620 262264 479915 563481 430204 139849 166794 126355 311616 287388
10925 287388 316477 222384 162969 165149 111487 -42901 75173 233047 151076 188417 154493
10914A54493m3357j82780P0912J60464J38392P5510J46386J7807j00591k16861
10904B20375p1766J18690l9513k52749p3541o7813n9485J71651J28985P7582Q1052
10893B33468j60202j50392r676J17226q7815R8051k5874J6373R0095J07159Q2470
10882C10883k04949o6156J60667j00108J64809M1825p9658n7289p5296r4903q437
10871h612K19422M6659j33155J54048J80080j25110r4879r2930o2758R6263O9880
10860B48908O043m6594J78494K13870K1497j25335j35308k51970J20198R9228
10850C29031k34271P8979K33122K8882o9652o2344j00464j38893P4814J43402
10840B82606J0542J42138j52069k41526K1305J5026M1174r2973N3284p9903j82135
$$ plain form
10914 154493 111136 -71644 -732 159732 298124 373634 520020 537827 437236 220375
10904 220375 148609 267299 227786 -24963 -98504 -166317 -225802 -54151 74834 152416 233468
10893 233468 73266 -77126 -86802 30424 -57391 40660 14786 31159 121254 228413 310883
10882 310883 105934 39778 200445 100337 265146 306971 227313 170024 94728 -175 -8612
10871 -8612 210810 257469 124314 278362 458442 333332 238453 145523 82765 179028 248908
10860 248908 254951 208357 386851 600721 622218 496883 361575 109605 229803 329031
10850 329031 94760 173739 406861 435743 366091 303747 203283 64390 139204 282606
10840 282606 293148 435286 283217 41691 62996 78022 119196 26223 79507 -396 -182531
10829a82531j21397o1391K04295L9882J75848N1494N5884p8688J48894J00832
10819C33122j53216K40029N3145k85434k36857k44783K4658R6357K24472M8347
10809I9840O7721N9942k40659j02976J34497J40361o9029P3659Q6794J07570P7439
10798D35159M9016P6566j52409k71921j05070k1033o5672r8765J3600K734R3489
10787d4306K3028L0262l1548k12887N9318J75512m4388j55230j0937N5491N2688
10776a02997K20314p9266R7451L9580n897j54253j94039p6456j51903K742K46475
10765a58249J51272J25449j53114p3411j51204j181J78894J20879J30948j246
10755A69037N0614o4422r8847N552J02211N8189l0750o9350k65915J87984Q1755
$$ plain form
10829 -182531 -303928 -365319 -161024 -121142 54706 106200 162084 83396 232290 333122
10819 333122 179906 419935 473080 187646 -49211 -293994 -269336 -172979 51493 99840
10809 99840 167561 227503 -13156 -116132 18365 158726 89697 163356 250150 357720 435159
10798 435159 484175 560741 408332 136411 31341 10308 -55364 -154129 -140529 -137795 -44306
10787 -44306 -21278 8984 -22564 -235451 -176133 -621 -45009 -200239 -211176 -155685 -102997
10776 -102997 117317 38051 135502 175082 169185 14932 -179107 -255563 -407466 -404724 -158249
10765 -158249 -6977 118472 -34642 -108053 -259257 -260438 -81544 39335 170283 169037
10755 169037 219651 155229 56382 61934 164145 222334 191584 122234 -143681 44303 126058
10744A26058l7250p9641r9618m7256L4732J1801M0735J10788L8942q0753M0284
10733E8822j85779k9870p6324k86M9792j3859j00915Q1379K0446M6444O222N5160
10721h8768q6791j26635n021J82100J62951n8099k18726k1392K17764j47863o1846
10710b52326P1840K19739J42610N810j48900o6423j64758k82589k6869J52446
10700c49420J03009N8700j78950O966J97250m380j39531O3308l0471R5016J53232
10689b5271J92716P1720r5788o665k14826l6595j04363m005J29968J22626R1952
10678A21469p6979L5648J9486p4495O5489j87302l3777j11111k8042J81701K54829
10667A66916k4822j07443j23772K49137K18148r6362j3337j44974j0011J40956
$$ plain form
10744 126058 88808 9167 -90451 -137707 -102975 -91174 -50439 60349 99291 18538 58822
10733 58822 -126957 -156827 -233151 -233437 -183645 -197504 -298419 -217040 -196594 -150150 -143928 -88768
10721 -88768 -175559 -302194 -307215 -125115 37836 -20263 -238989 -260381 -42617 -190480 -252326
10710 -252326 -180486 39253 181863 187673 38773 -27650 -192408 -474997 -501866 -349420
10700 -349420 -246411 -187711 -366661 -359695 -162445 -166825 -306356 -243048 -273519 -178503 -25271
10689 -25271 167445 239165 143377 136712 -78114 -114709 -219072 -223077 -93109 29517 121469
10678 121469 44490 80138 99624 25129 90618 -96684 -130461 -241572 -269614 -87913 166916
10667 166916 142094 34651 -89121 160016 378164 281802 268465 123491 113480 254436
10657B54436m8481n1861K6886L2577J17337K98372o4638j11019l9029R6338Q5243
10646E96161K60402L31400K74018N7181K9797N3324K93974K19509L65755N24798
10636C006319O69950Q61106Q36349Q47181P60162P05070R28345R51053J329781
10627A0895316K158723K640919L720842N130742P166256J0332534J3436719J6978305
10619G2460356K0138775K1052051J7245307Q838387J22158o030560o917058l017472
10611A23891944L584011J1854788K1578248L1772203M0047196M1425491L0367553
10604C04521434Q374932j3906887k6147014k6222877j6922088l489214J1376749
10597B37585035K6629120M0889707N1342247N0259673K9870803m673163l5396337
$$ plain form
10657 254436 205955 154094 180980 213557 330894 629266 564628 453609 414580 510918 596161
10646 596161 856563 1187963 1461981 1519162 1548959 1602283 1896257 2115766 2481521 3006319
10636 3006319 3676269 4537375 5373724 6220905 6981067 7686137 8614482 9565535 10895316
10627 10895316 13054039 15694958 19415800 24546542 31712798 42045332 55482051 72460356
10619 72460356 92599131 113651182 130896489 139734876 139857034 133826474 126909416 123891944
10611 123891944 127475955 139330743 160908991 192681194 232728390 274153881 304521434
10604 304521434 312896366 298989479 272842465 246619588 229697500 226208286 237585035
10597 237585035 264214155 305103862 356446109 406705782 436576585 431903422 396507085
10590C96507085n1296912m9924160l7198870k1152415n972644P936383J9716848
10583B58615315K6744043K4480263R061201j4382953l3774840m1810965l8756160
10576A90175904k8996644j8120857q789958j459029M103951O706576M587517k288586
10568A45918874j1437035j8435783k1264619j9916597j6047526j2164585r073846
10561C7578883o567977n043477l800292k784529k224551j755787j674932j433583
10553A2293755j079039q90198q06185p96792p67930m84661l47657l70474l61369
10544F389450r5691l88682m52865l57717l41744k84100j11801r7956J2955M5564
10534D317413k07190k08117j48854j49479K3270r2649j82524j47307J3805j4470
$$ plain form
10590 396507085 345210173 295286013 258087143 236934728 230962084 238898467 258615315
10583 258615315 285359358 309839621 318900822 304517869 270743029 228932064 190175904
10576 190175904 161179260 143058403 134268445 132809416 136913367 143619943 148207460 145918874
10568 145918874 134481839 116046056 94781437 74864840 58817314 46652729 37578883
10561 37578883 31010906 25967429 22167137 19382608 17158057 15402270 13727338 12293755
10553 12293755 11214716 10324518 9518333 8721541 7953611 7468950 7121293 6750819 6389450
10544 6389450 6293759 5905077 5452212 5094495 4752751 4468651 4356850 4258894 4271849 4317413
10534 4317413 4110223 3902106 3753252 3603773 3627043 3534394 3351870 3204563 3218368 3203898
10524C203898j69700k80654j38559n9835n4291L111o0816O2565o4822k41685R7628
10513B296840l3506o3923k33553n2430R8799R0841p3359J59753J22971K9036j08662
10502B232807n2441k44462k63516k7976L747P5691r3404l2071p5757Q4799J64907
10491A772324j04512j58597J0399K0435k0231J05883R6253L9679k46986j41335
10481A373312k950n9201k2873K66894J56139l476k19695k95887J5036J39263p9441
10470A267121j4635j20668O6284Q0304K32431J50140j89701j32641N7834N1534
10460A448003l4928j55838k7410J49195o0487J07099O3605k06869r8371p4634
10450A109365m1596J9809K7809j42986k1680J94792M728N9032p77K137O419k4620
$$ plain form
10524 3203898 3034198 2753544 2614985 2555150 2500859 2503970 2443154 2505719 2440897 2199212 2296840
10513 2296840 2263334 2199411 1965858 1913428 2012227 2103068 2029709 2189462 2312433 2341469 2232807
10502 2232807 2180366 1935904 1672388 1644412 1648159 1723850 1630446 1598375 1522618 1607417 1772324
10491 1772324 1667812 1509215 1519614 1540049 1519818 1625701 1721954 1761633 1514647 1373312
10481 1373312 1370362 1311161 1288288 1555182 1711321 1707845 1488150 1192263 1207299 1346562 1267121
10470 1267121 1252486 1131818 1198102 1278406 1510837 1660977 1471276 1338635 1396469 1448003
10460 1448003 1413075 1257237 1229827 1379022 1318535 1425634 1489239 1282370 1183999 1109365
10450 1109365 1067769 1087578 1115387 972401 950721 1145513 1150241 1209273 1208496 1210633 1217052 1192432
10438A192432j00685M2806n9915M9519J51384M0671l37854n2905J42578m7468
10428A020563J02783p7198n8428M1089N8002R942p5531j16965q1813m9815J06780
10417H79409J01394L5154J32506J2659j80198j39296j50528j1177m1535j19166
10407E19222k4047J03152N2986L8073m9283l01112j31493r399p8704J71407J81905
10396D72707n4739j85015m1353L37221K0690l02383k21173M8370K54691Q6210
10386D15226K01842K07111k28797q9246L06557R0478L9731k20772j48233M5779
10376F19676J05124j37368j60485R839j18696q916M6719O5208j23179J12288O8135
10365D78345k3607j191p0465O2843n178j96173K1259J66463O2010j00143O4313
$$ plain form
10438 1192432 1091747 1134553 1074638 1124157 1275541 1316212 978358 925453 1068031 1020563
10428 1020563 1123346 1046148 987720 1028809 1086811 1096753 1021222 904257 822444 772629 879409
10417 879409 980803 1015957 1148463 1161122 980924 841628 691100 679923 638388 519222
10407 519222 495175 598327 651313 689386 640103 338991 207498 198099 119395 290802 472707
10396 472707 417968 232953 191600 528821 549511 247128 25955 74325 329016 415226
10386 415226 617068 824179 595382 506136 812693 903171 942902 722130 573897 619676
10376 619676 724800 587432 426947 436786 318090 309174 355893 421101 297922 410210 478345
10365 478345 454738 453547 383082 445925 440747 244574 265833 432296 494306 394163 458476
10354D58476P889k2881q2452K94151K08588l0547o7282k99952n1719J52482j12356
10343D54397k22145P0852K69125J34458J6226r284j61721O2228o5170j53800N3349
10332D48515R7981n5518j25311P8428R5593j04030L649j97966j13316L4696l8381
10321A24340q1705P6910K03954k2336k9767J4651M166P9532m4213j99656K06681
10310C32557l1637J9474j378P5360J0704r9752N5395O263M6811O6707J30450k57527
10298C53427k18894q5476k5258J33618m998K6255O9963K28958K12760o0643J16891
10287G46603n3230k07904j91413n5251J26790O4997k14594k09650L0824L91602
10277D28774n2874J7188J53223N085j12858j03998j18291k2533J14194r8688J4276
$$ plain form
10354 458476 466365 443484 361032 655183 863771 833224 765942 465990 414271 566753 454397
10343 454397 232252 303104 572229 706687 722913 713629 551908 614136 548966 395166 448515
10332 448515 546496 490978 365667 444095 539688 435658 439307 241341 128025 162721 124340
10321 124340 42635 119545 323499 301163 271396 286047 290213 369745 325532 125876 332557
10310 332557 300920 320394 319016 394376 405080 305328 360723 366986 413797 480504 610954 353427
10298 353427 134533 49057 23799 157417 152419 178674 248637 477595 690355 629712 746603
10287 746603 693373 485469 294056 238805 365595 430592 215998 6348 37172 428774
10277 428774 375900 393088 546311 551396 438538 334540 216249 193716 307910 209222 223498
10266B23498j15348o6596K22902k9547R2490J62200k2780k68647j52158J37023
10256A83037Q2042Q0937j70323r8965j14611R7569J66556J9668j00312P6139O2927
10245B84664Q4627J5897j72520o9043J23563J00123m4961k28220R5325J41027
10235C30482P6178o6987j21464L3078N0962m1747o673n7268j55509j0794N4844
10224H5102J23064r2727j66214M2997M4854M5665J20319j815J28044l4045k08186
10213H7058J05266K81805J17131J65627N2610J6622j06972j56680j80610K3703
10203D05560o9466l78768R747K17228m8705L0426k2012Q3035N4647j12994Q5125
10192B53823N0200p1881R7476J4770P3813m4161p1616j13128N5380K12901L0656
$$ plain form
10266 223498 108150 41554 264456 234909 327399 489599 466819 198172 46014 183037
10256 183037 265079 346016 175693 76728 -37883 59686 226242 245910 145598 221737 284664
10245 284664 369291 385188 212668 143625 267188 367311 322350 94130 189455 330482
10235 330482 406660 339673 218209 251287 302249 260502 253829 196561 41052 30258 85102
10224 85102 208166 115439 -50775 -7778 37076 82741 203060 201245 329289 295244 87058
10213 87058 192324 474129 591260 756887 809497 826119 719147 562467 381857 405560
10203 405560 336094 -42674 -32927 184301 135596 166022 144010 227045 281692 168698 253823
10192 253823 304023 232142 329618 344388 418201 374040 302424 189296 244676 457577 488233
10181D88233P5392J76082m4369N7129J78125j90481O5052L86403J99888J30395
10171A521849J46990J35154O5936k7434j58326K4769j42278r2410J45976Q539
10161A628765K23094K1953M0230K30823K08051M1408L9399q3595k61256j47263
10151A941609l62788q6264p2198O3836P2445M6677K94095r3677j83444k27490
10141A392801j51959j83680k00902j6464l260j21463K04535K52793l7690j74885
10131I59826k85816r5088k37295j30106q8469k02225L5912K59391J16589l0163
10121C02556q8670L1175j60902j52844k5535j68478p7783K08529K13133p323m6596
10110B7262J56068q6048j2673L2018J6421J260o5298O33k03923j38618J16198
$$ plain form
10181 488233 563625 739707 695338 752467 930592 740111 805163 1191566 1391454 1521849
10171 1521849 1668839 1803993 1869929 1842495 1684169 1708938 1566660 1474250 1620226 1628765
10161 1628765 1851859 1873812 1914042 2144865 2352916 2394324 2433723 2350128 2088872 1941609
10151 1941609 1578821 1492557 1420359 1484195 1556640 1603317 1897412 1803735 1620291 1392801
10141 1392801 1240842 1057162 856260 839796 836536 715073 919608 1172401 1134711 959826
10131 959826 674010 578922 341627 211521 123052 -79173 -43261 216130 332719 302556
10121 302556 213886 245061 84159 -68685 -94220 -262698 -340481 -131952 81181 73858 27262
10110 27262 183330 97282 84609 116627 133048 134308 69010 69643 -134280 -272898 -156700
10099a56700J76083r7034j7018K6981J42473O4096J4037m9098p1287Q7788J57159
10088B77480q4101j10990j0118j13252k84047j9682J0571R3010O1269L8660N5617
10077h5583K37238J11533j15357l4487O6677J44671l8681Q9393J85491P5782q8868
10066E47809n3601j61987r7767P3244J69536k3090K1140M2549k0132j952r4356
10055D01393L5598K80491k35870j90325j3798K8253j31305Q6478J34544J04058
10045D99517j75892k18007j06532K01959Q850J24118K74629p4866k98928p6456
10035A58392J37378j30717r6556j56709j80547J40483J401n3921J28719Q1448
10025B9371J87049K0157O3885j54328j99469J5310J68379M8694J5099J54279O8174
$$ plain form
10099 -156700 19383 -77651 -94669 -67688 74785 138881 152918 103820 32533 120321 277480
10088 277480 193379 82389 72271 -40981 -325028 -344710 -334139 -241129 -179860 -141200 -85583
10077 -85583 151655 263188 147831 113344 180021 324692 286011 375404 560895 636677 547809
10066 547809 494208 332221 234454 307698 477234 454144 475284 517833 497701 495749 401393
10055 401393 436991 717482 481612 291287 277489 305742 174437 260915 395459 499517
10045 499517 323625 105618 -914 201045 209895 334013 608642 533776 234848 158392
10035 158392 295770 165053 68497 -88212 -268759 -128276 -126875 -180796 -52077 29371
10025 29371 216420 236577 300462 146134 -53335 -38025 130354 179048 194147 348426 416600
10014D16600j32615j03510K03996J59213j9667j06499k43469P382J52439L3700
10004C67570q1166n3852M0077n8841K4291J26L775j07317p0737j2366j00354o9960
9992a18754J68244J64281M8632p4082j40859j20380J02292j8211J347O0352J60426
9981B33288J40235l2723k07522M169R5666J62651J15083o817k61476p1240P9515
9970B50829N4608j00215L4558j14236N7381R6333n9645n4166K2954J5569q7926
9959A16044O9259N5346l7168J13310L2237J1911M8243p908m9751k13029j26764
9948A1730M0164N8709P4110L3021j28942m7755J09043L947P3661J05596R5067
9937D28351K03738K11032K79232M38770O73440R19170j58298m69859p21794n93092
$$ plain form
10014 416600 283985 180475 384471 543684 524017 417518 174049 181431 333870 367570
10004 367570 286404 232552 272629 213788 238079 238205 241980 134663 63926 51560 -48794 -118754
9992 -118754 49490 213771 262403 188321 47462 -72918 29374 11163 12510 72862 233288
9981 233288 373523 340800 133278 137447 233113 395764 510847 504030 242554 171314 250829
9970 250829 305437 205222 239780 125544 182925 279258 219613 165447 188401 203970 116044
9959 116044 185303 240649 203481 316791 349028 360939 409182 401274 351523 138494 11730
9948 11730 51894 110603 184713 217734 88792 41037 150080 154027 227688 333284 428351
9937 428351 632089 843121 1122353 1561123 2234563 3153733 2995435 2525576 1803782 1210690
9927A210690l29646k56972k64076q6197l9093j16428j08925J48283J42785L106
9917C03527j72334K12530K56763P3148j50233k28171J12075n0354n5447J37220
9907D38724j55981q0793o3197O4325J89880j06608Q4822J68507J83224n0202j73176
9896D99525j64296K8948N8003p7925k14695O1879J88084l2948r2229j97343o0558
9885c555l6400N9278K09623J02586m8011L2747p3542m0266M508n8369k21459o7192
9873a40052L4380j19103l6039k8752R1577J30560L5157k2248n0171j34068L1496
9862b07263J01169O6006l4229k8799K6815M0114k8989M5884J31476J15360J31462
9851C59006m7390k28388J893J30917K5522m2888j62041j6683N6386o9422L7991
$$ plain form
9927 1210690 881044 624072 359996 273799 234706 118278 9353 157636 300421 303527
9917 303527 131193 343723 600486 673634 523401 295230 407305 356951 301504 438724
9907 438724 282743 201950 138753 203078 392958 286350 371172 539679 722903 672701 499525
9896 499525 335229 364177 422180 344255 129560 191439 379523 346575 254346 57003 -3555
9885 -3555 -39955 19323 228946 331532 283521 316268 242726 202460 206968 148599 -72860 -140052
9873 -140052 -105672 -224775 -260814 -289566 -197989 -67429 -32272 -54520 -104691 -238759 -207263
9862 -207263 -106094 -40088 -74317 -103116 -76301 -36187 -65176 -19292 112184 227544 359006
9851 359006 311616 83228 85121 216038 241560 198672 36631 19948 76334 6912 44903
9840D4903j27835n6196K27933j13308j80967p7248k3297K64144J0105p1221J1510
9829i1477J22841K66889O6040j24877j05663M4894N2460j08447q6401R089J42512
9818A87860J39717n3568l65850Q4747L2726J54367O1355j08995j17345R5247j36247
9807b5986k44090q5958P5299J91757K08059J27786l2621J66822j45395j33814
9797A01859j82877Q5111R1035p3756J8995K313J9333P3269J88055K9114j8310
9786C34141O9727k14328j65235K21683J05045q5681j94789k36053J43338J91489
9776A69337j51419k7008M5317m748j5849o0430r3796K3379k9980R1518q684r3011
9764a55374R8315K210J20516n9303R733K24283l6945j86488N9714m0690q5358
$$ plain form
9840 44903 -82932 -139128 88805 -24503 -205470 -282718 -306015 -41871 -31766 -102987 -91477
9829 -91477 31364 298253 364293 239416 133753 178647 231107 122660 36259 45348 187860
9818 187860 327577 274009 -91841 -7094 25632 179999 241354 132359 15014 110261 -25986
9807 -25986 -270076 -356034 -280735 -88978 119081 246867 214246 381068 235673 101859
9797 101859 -81018 4093 95128 21372 40367 42680 62013 135282 323337 352451 334141
9786 334141 403868 189540 24305 245988 351033 265352 70563 -165490 -22152 169337
9776 169337 17918 -9090 36227 31479 15630 -44800 -138596 -115217 -145197 -53679 -62363 -155374
9764 -155374 -57059 -54849 65667 6364 16097 240380 203435 16947 76661 35971 -49387
9753d9387j22757j32973j3722P9844M4275K7086L858J02189J19219J57576O3373
9742B78581J22176J13387j26162j54104j93375L296K41257n7772j05491j33995
9732a2202J56101J30238J07375l6873k21330l7455N8678j29872o6890J15124J03914
9721A66808j39447j46033N4300q7335P1316J55851J61968J13241o6869k19384
9711F4416o9924J56634Q3426j6814K6582j99805j73950J96737J03433j56600j6410
9700b275Q4617p420K561q0521N6799O7177J38089J10103k5132P2945o0822l5931
9688C20190n9405O1125O8843J09842j3120j93978R591k0634k9255J84665J4339
9677D52203j57755m1658K02495J42009o9142m963m0759K140J41596J30839J46868
$$ plain form
9753 -49387 -172144 -305117 -318839 -238995 -194720 -167634 -163776 -61587 57632 215208 278581
9742 278581 400757 514144 387982 233878 40503 43799 285056 227284 121793 -12202
9732 -12202 143899 274137 381512 344639 123309 85854 144532 14660 -52230 62894 166808
9721 166808 27361 -118672 -64372 -151707 -80391 75460 237428 350669 283800 64416
9711 64416 -5508 151126 234552 217738 244320 44515 -129435 67302 170735 14135 -2275
9700 -2275 82342 74922 77483 -3038 53761 120938 259027 369130 343998 416943 356121 320190
9688 320190 260785 321910 390753 500595 487475 293497 303088 282454 253199 437864 452203
9677 452203 294448 252790 455285 597294 528152 523189 482430 484570 626166 757005 903873
9666I03873J45828L02254L37959O96469P76328J061148J965273L203578M930993
9657A4323703P755637J1375756J3540493L354040p011934j1250477j1935670p439143
9649A2712405l957804k374322j536875r74290p32176l63646k60413m03355l09681
9640A799843j74974l18741j70130R78N4343Q622J5258P024j84198j18285l5650
9629H84090q8540j12806k39093l5077K4587j8125j14716j10404n2504l7085J1055
9618A11382o549J8271m6021M1744J1637L27124J20242j73794O7679k21543j62360
9607H7812J0627M3317o0317j58267l0945j75140k4906K28648K1510Q7229J34213
9596A63781J18335j78638L0435K36978k02478j03798J26459J50018m7628l07697
$$ plain form
9666 903873 1049701 1351955 1689914 2386383 3162711 4223859 6189132 9392710 14323703
9657 14323703 22079340 33455096 46995589 50349629 43337695 32087218 20151548 12712405
9649 12712405 8754601 6380279 4843404 3869114 3136938 2773292 2512879 2109524 1799843
9640 1799843 1624869 1306128 1135998 1136976 1191319 1199941 1215199 1222223 1038025 919740 884090
9629 884090 795550 682744 443651 408574 433161 415036 300320 189916 137412 100327 111382
9618 111382 104833 123104 77083 118827 130464 457588 577830 404036 471715 250172 87812
9607 87812 98439 141756 81439 -76828 -107773 -282913 -307819 -79171 -57661 29568 163781
9596 163781 282116 103478 133913 370891 168413 64615 191074 341092 293464 -14233
9586a4233p8355J39856O0912j89381K2514J60267L9304Q6115j7089l1978J13218
9575B91150r7844k07772P0270O5909J54988J01198l09316j16427J33209P0190
9565A55555o1479o4457J15649l0853j01255j20451m0528N9359K12709J46605M819
9554B75673j21097j23491j13256M6360Q5934J31174L5116Q2386l5050j15053l590
9543A45106Q0708J10528Q3445j64578r3001N008J26139R880k02658p1515j13971
9532h4909p3484P8681K19267m0637m6310m1406R0511R6401J60783j75104q7025
9521I6768j95625k0151J09197m0759n906Q7094J78581j56788j90387N4000P3381
9510a0595j3212p1095q2130m0312j44526O1163k0532k0742J80251M8810q4823
$$ plain form
9586 -14233 -92588 47268 108180 -81201 -58687 101580 140884 226999 209910 177932 291150
9575 291150 193306 -14466 55804 121713 276701 377899 68583 -47844 85365 155555
9565 155555 94076 29619 145268 114415 13160 -107291 -147819 -88460 124249 270854 275673
9554 275673 154576 31085 -82171 -35811 50123 181297 216413 298799 263749 148696 145106
9543 145106 225814 336342 419787 255209 162208 167216 293355 303235 100577 29062 -84909
9532 -84909 -158393 -79712 139555 98918 52608 11202 101713 198114 358897 183793 96768
9521 96768 -98857 -119008 -9811 -50570 -56476 30618 209199 52411 -137976 -83976 -10595
9510 -10595 -23807 -94902 -177032 -217344 -361870 -300707 -321239 -341981 -161730 -112920 -197743
9499a97743J08205K25138J59707R377j43519j36778n0173Q7589K68391J08752
9489D38946j68527j64606K0865p3474q5038P9715M9943K24228K6816J33060J89599
9478F71527k53895k02749j85526j37396J41950j17314r7315J78697n6696M9940
9468h777K04383J74060L2378l74461o6362J70570m7095p4779k07082q3773Q9226
9457a91712k23k49884n77K12762R734M8676J8330K96j3116o4724o843P4388J75994
9444A3101O9572J42240q6497O7436r802j48997j8809j08148l0357K15502K30544
9433C35785j24275k71018j98449l7460p3508K29597K20841J60917k06000N3309
9423H9739j27170r4040P3976K04096K48133j71538o3166N3989K17389m5030k31992
$$ plain form
9499 -197743 -89538 135600 295307 304684 161165 24387 -25786 61803 330194 438946
9489 438946 270419 105813 126678 53204 -31834 47881 97824 322052 348868 481928 671527
9478 671527 417632 214883 29357 -108039 33911 -83403 -180718 -2021 -58717 -8777
9468 -8777 195606 369666 402044 27583 -38779 131791 84696 9917 -197165 -280938 -191712
9457 -191712 -191935 -441819 -442396 -229634 -219900 -171224 -152894 -152598 -165714 -230438 -237281 -162893 13101
9444 13101 82673 224913 138416 205852 196050 47053 28244 -79904 -110261 105241 335785
9433 335785 211510 -59508 -257957 -295417 -368925 -139328 81513 242430 36430 89739
9423 89739 -37431 -131471 -57495 146601 394734 223196 160030 214019 431408 386378 154386
9412A54386l5972n216P0760J266L4250J78445j54294k80149m9949J51616J86183
9401B51326K291J08783p8903k5035K5592J75083J0987j25831j70870r0642q0660
9390B121p150j22850O6086J22372p4440J59358K33179P840j50885k17746R595
9379B7480J52708q6013K3382p6918j60291p9156p6478p5719K53278L7834J52713
9368I2820J8831q958m6099R1143J29871K0948j22951k10628L5534R8962m6397
9357E3076k31946L4024K10358J53172J42675L8550Q8288j50517l4111j18370m9314
9346A35885r1954l1282j08108m7886o2007J11993J66291p7930k27145Q5908K20717
9335G4482P9229J156l5971j31649j13098j50105J18255J34624N3631O0905O9252
$$ plain form
9412 154386 118414 113198 183958 185224 219474 397919 243625 -36524 -86473 65143 251326
9401 251326 253617 362400 283497 258462 284054 459137 470124 344293 173423 82781 2121
9390 2121 -5029 -127879 -61793 60579 -13861 145497 378676 386516 235631 17885 27480
9379 27480 180188 94175 117557 40639 -119652 -198808 -275286 -351005 -97727 -59893 92820
9368 92820 111651 102693 56594 147737 277608 298556 175605 -35023 511 99473 53076
9357 53076 -178870 -144846 65512 218684 361359 399909 488197 337680 303569 185199 135885
9346 135885 43931 12649 -95459 -143345 -205352 -93359 72932 -4998 -232143 -146235 74482
9335 74482 153711 154867 118896 -12753 -125851 -275956 -157701 -23077 30554 91459 160711
9324A60711l1781r1077j38196m9195K6152j24636j09243J91762J7341J45234M8435
9313D5507L0578J7530k48146j69177R2543L04615O3874J37528o693p8968M0593
9302B29784J9970j28437J31165J19689j36846P0515o3149j25666o1138r5006l0477
9291f9596J06664m7567L3365J19300J17088J32590j8226j40199k35549J3511L5511
9280D6892J30201k1601k36618q9769J13747R3891J5095K4328k06581J02245K64995
9269B36825j29331j22417J32780o4182j89833q7021J29653K01145J12626j6786
9259B03459p6205j43102j32824P0948o5286L9593O0986j67140j89606J5657K22687
9248a60833J58045Q9855O2266j19872p3535J26131j5295j7784m1259J42996J49131
$$ plain form
9324 160711 128930 37853 -100343 -149538 -123386 -248022 -357265 -165503 -148162 -2928 45507
9313 45507 76085 93615 -154531 -323708 -231165 73450 137324 274852 268159 189191 229784
9302 229784 249754 121317 252482 372171 235325 305840 242691 117025 55887 -39119 -69596
9291 -69596 37068 -10499 22866 142166 259254 391844 373618 233419 -2130 11381 46892
9280 46892 177093 155492 -81126 -170895 -57148 36743 51838 76166 -130415 -28170 236825
9269 236825 107494 -14923 117857 53675 -136158 -223179 -93526 107619 220245 203459
9259 203459 127254 -15848 -148672 -77724 -143010 -103417 -42431 -209571 -399177 -383520 -160833
9248 -160833 -2788 87067 149333 29461 -44074 82057 66762 48978 7719 150715 299846
9237B99846j07585j77296j39300J09635J70274Q5327k17318n8393n0043J46557
9227F1704N892j84408N3298J32289R1895L7287K9496j23572P4202o013j21767
9216E0303p056j50923J26107L9838R391p3432J97151Q8993r6619j00374j71232
9205h7853K434P0236J6743Q1937M6077J126j43434j41597K4130M0780k4268R0148
9193b3541K40094l3517o3582k25653K5107L3669k1832P815J6119k3371r10O591
9181f3011j1096R6002l2822k56782p5283K03054K29793K17662P4170p2230j16607
9170A92850J09570j26643n8208J29457l8005j07967p4685l8808j39399J00332
9160e1506K01604n4435n5033j08210N4963m2167n9007l5266j87854j04929K22304
$$ plain form
9237 299846 192261 14965 -124335 -14700 155574 240901 23583 -34810 -84853 61704
9227 61704 67596 -116812 -63514 68775 160670 197957 227453 103881 178083 172070 50303
9216 50303 43247 -107676 18431 58269 67660 -5772 191379 280372 183753 83379 -87853
9205 -87853 -85419 -15183 1560 83497 129574 130700 -12734 -154331 -130201 -89421 -113689 -23541
9193 -23541 216553 183036 119454 -106199 -81092 -47423 -69255 -61440 -45321 -68692 -69602 -63011
9181 -63011 -74107 21895 -10927 -267709 -342992 -139938 89855 307517 381687 309457 192850
9170 192850 302420 175777 117569 247026 209021 101054 26369 -12439 -151838 -51506
9160 -51506 150098 95663 40630 -67580 -12617 -54784 -113791 -149057 -336911 -441840 -219536
9149b19536K31698J29058j10903q3370r2013j7918r3546O4588R0323l8744P8314
9138f2049R7552k2954o8907j99099K3604R5420k1454k1159m9599J22539R3867
9127a2239Q8565n4697l6725J09948M1575k27368l7275j50201Q0091J13490J16571
9116C1735l4918J09382K36780k7840j80819k08J87405m0497k55818k37309P1699
9105a40408J5550J05188m0393k77770N1998N9018j22059j4147j2643k2072J26182
9094b71556J99138k8913l9981n1991K12909Q931N7599R368j11508j69605J46269
9083c9340l9578k07408k94098Q130K52654P6399Q8869j47706M3576J50929K0890
9072h6683N4751k6997k39730k7131l3672R536L3483J91960J76127k04492j45186
$$ plain form
9149 -219536 12162 141220 30317 -53053 -145066 -162984 -256530 -191942 -101619 -140363 -62049
9138 -62049 35503 12549 -56358 -255457 -231853 -136433 -157887 -179046 -228645 -106106 -12239
9127 -12239 76326 21629 -15096 94852 136427 -90941 -128216 -278417 -198326 -84836 31735
9116 31735 -3183 106199 342979 315139 134320 134112 321517 281020 25202 -212107 -140408
9105 -140408 -124858 -19670 -60063 -337833 -285835 -226817 -348876 -363023 -375666 -397738 -271556
9094 -271556 -72418 -101331 -141312 -193303 19606 28537 86136 95504 -16004 -185609 -39340
9083 -39340 -78918 -286326 -580424 -572294 -319640 -243241 -154372 -302078 -258502 -107573 -86683
9072 -86683 -31932 -58929 -298659 -325790 -359462 -349926 -316443 -124483 51644 -152848 -298034
9061b98034Q3373K83921J51480k4664j7937q3781l7006j3822j04372J24633j2580
9050E1211P2148J010j04476J06268j00425j69461q869Q4619R0189J18431o9007
9039G1638l6760l4534m7890M3750q4378j51150O0726q117R1741P0086N5710l0440
9027C82J24338J03044q6026m8556p8395l8930r1269l0473n4755o8127N9620P5847
9015a33300J41585J4484j43949j86749J38502J52664n2725j1445N5140P656J2411
9004e726P3440O1821J22027k086j69906j80215j67730L7683J9365j0193J02125
8993a19395o4675q681N2640J03552P7035J9797j44320k14777K34346j28270j73082
8982c65830P0791K46437K33888j34479J7677R0913j47634j55697J4521O862k1418
$$ plain form
9061 -298034 -214661 69260 220740 196076 178139 94358 57352 43530 -60842 63791 51211
9050 51211 123359 124369 19893 126161 25736 -143725 -152594 -67975 22214 140645 71638
9039 71638 34878 344 -47546 -3796 -88174 -239324 -178598 -186715 -94974 -24888 30822 382
9027 382 124720 227764 141738 93182 14787 -24143 -115412 -145885 -200640 -268767 -209147 -133300
9015 -133300 8285 22769 -121180 -307929 -169427 -16763 -69488 -80933 -25793 -18137 -5726
9004 -5726 67714 129535 251562 249476 79570 -100645 -268375 -230692 -211327 -221520 -119395
8993 -119395 -184070 -192751 -140111 -36559 40476 60273 -84047 -298824 -64478 -192748 -365830
8982 -365830 -295039 -48602 185286 50807 68484 159397 11763 -143934 -129413 -122551 -143969
8971a43969M5342M9792K3077K9669L0634J49776N4135J44281k27256r1855l2219
8960C1407j62186q7887N746J50971m5269J389n9425k9155J7496K7579O7831j5123
8948i6626N3839N9134N8014j3545j06190l1360j5832o2075P1947K8754q2787J15930
8936b0797J65554R1603J4989K4301o4268j61277J2129k8174J2238q0386o0831
8925i4919Q1072O9809j40199M0318O2091r610R3692J66612j75668K9197K57228
8914C79623o7805j88462L8512M9357j73981L8145P3625q9166M0923j24465K9095
8903E401j29911j77575R8170Q6842J759j21847J20484J87549j72055k12865R7599
8892b16449J1893n3038P4202O2192M1611J05512K05825L7038j73200K3940q4410
$$ plain form
8971 -143969 -98627 -48835 -25758 3911 34545 184321 238456 382737 155481 63626 31407
8960 31407 -130779 -218666 -212920 -61949 -107218 -105829 -165254 -194409 -176913 -149334 -81503 -96626
8948 -96626 -42787 16347 74361 60816 -45374 -76734 -92566 -154641 -82694 -53940 -136727 -20797
8936 -20797 144757 236360 251349 275650 211382 50105 62234 34060 46298 -34088 -94919
8925 -94919 -13847 55962 -84237 -43919 18172 8562 102254 268866 93198 122395 379623
8914 379623 311818 123356 161868 211225 37244 75389 149014 59848 100771 -23694 5401
8903 5401 -124510 -302085 -203915 -117073 -115314 -237161 -116677 70872 -101183 -314048 -216449
8892 -216449 -204556 -257594 -183392 -121200 -79589 25923 231748 268786 95586 119526 35116
8881C5116q6780J12318m3396q4923l4034n9978j31522N1600m0304J68144J69234
8870E5475j72215P0058k8975j34789m2114O2580M6875P1257j8997J67039J10391
8859A86585l8226k66998q4438O5795J08878N1292j05400q1041j54843m5044Q7789
8848b75651J92910J59332q8348M5753K08038l9397r7764j1172K36401j44853k33535
8837d8286r5160o0627J14074l5487K39693P8419l3797j78778n9296r3918J89896
8826A6733J17618j55136N6743j16559j13164Q8093j2748j2375r9459P079j75343
8815c98518Q539K88808J22393K00944P0504J41863L1508j02887k74757J25921
8805B14318J68462j36635j22109k19399l19301l1974R6325K1155K07553M6228
$$ plain form
8881 35116 -51664 60654 17258 -67665 -101699 -161677 -293199 -241599 -281903 -113759 55475
8870 55475 -116740 -46682 -75657 -210446 -252560 -189980 -143105 -71848 -90845 76194 186585
8859 186585 148359 -118639 -203077 -137282 -28404 22888 -82512 -163553 -318396 -363440 -275651
8848 -275651 -82741 76591 -11757 33996 242034 202637 104873 93701 330102 185249 -48286
8837 -48286 -143446 -204073 -89999 -125486 114207 192626 158829 -19949 -79245 -173163 16733
8826 16733 134351 -20785 35958 -80601 -193765 -105672 -118420 -130795 -230254 -223175 -398518
8815 -398518 -389979 -101171 21222 222166 292670 434533 466041 363154 88397 214318
8805 214318 382780 246145 124036 -95363 -414664 -446638 -350313 -329158 -121605 -75377
8795g5377j39881J98833K21140K528j01124L1738m2579m7977p381J04367j70375
8784b6088j82691N0295J91145N3955j28744N6705O9641r5486j30290n6623N964
8773a92217q2426L04767j11331p1717J66226j45072q644J15995J11246j13280
8763b6453j4571q8211K898m3565q8858J37765J28375J3412K0763r503k5153K70020
8751B76919Q3221j22878q7020k49583j61340J8602p27J12094J41132j48267j12121
8740b49968m5090J82160J44589J11104j84666k37194k7997K80654K18924o1776
8730A30740N6962j24259j52198l8456L3182Q6935k3840l0182M6096Q7461j53812
8719h1371J31798K74136k6946j37813r6606J0687j751O3502M7797j55074j58018
$$ plain form
8795 -75377 -215258 -16425 204715 207243 106119 137857 95278 47301 39920 144287 -26088
8784 -26088 -208779 -158484 32661 86616 -42128 14577 84218 -11268 -141558 -198181 -192217
8773 -192217 -274643 30124 -81207 -152924 13302 -131770 -140414 -24419 86827 -26453
8763 -26453 -41024 -129235 -126337 -169902 -258760 -120995 7380 20792 41555 32052 6899 276919
8751 276919 360140 237262 150242 -99341 -260681 -242079 -242806 -130712 10420 -137847 -249968
8740 -249968 -295058 -112898 31691 142795 -41871 -279065 -307062 -26408 192516 130740
8730 130740 187702 63443 -88755 -127211 -94029 -7094 -30934 -61116 -15020 72441 -81371
8719 -81371 50427 324563 297617 159804 63198 73885 72134 135636 183433 28359 -129659
8708a29659J42702K00120Q3887P6809N7326j61361j76166L2150j06926j07653
8698h8771O9104l5494j31912M0068J69227J94708K03767j12247k97064L553J00196
8687A15135J30729R0014q2384j31269j88511k63112J23285K04532J30233K8172
8677A56824J09637L0627J87585M8146n4215k76873m502n600k7216k05355j87752
8666b28694j44646J9136j6567K94876N0894N9759O2932j57361O9384N9316j36147
8655f7118P5625q6087n3996J45363O4400k65489j13161J50206M5771J01658J44528
8644A41700Q8228M3866j81910q9170k09029Q38K3859J9456l7040K4179j3583K00744
8632A2138O8687q8582N3245P5971p5310J019K64819r6885l3231Q5089P8190r8522
$$ plain form
8708 -129659 13043 213163 297050 373859 431185 269824 93658 125808 18882 -88771
8698 -88771 -19667 -55161 -187073 -147005 22222 216930 420697 308450 11386 14939 115135
8687 115135 245864 335878 253494 122225 -66286 -329398 -206113 -1581 128652 156824
8677 156824 266461 297088 484673 532819 478604 201731 197229 191629 164413 -40942 -228694
8666 -228694 -373340 -354204 -370771 -75895 -25001 34758 97690 -59671 9713 69029 -67118
8655 -67118 8507 -77580 -131576 13787 78187 -187302 -300463 -150257 -104486 -2828 141700
8644 141700 229928 273794 91884 2714 -206315 -205477 -181618 -162162 -199202 -175023 -188606 12138
8632 12138 80825 -7757 45488 121459 46149 47168 311987 215102 181871 266960 345150 246628
8620B46628k54119M163j3084P9109K00255j09907k9536M8842r6377p4247J37338
8609A39065l703j29486K1669J25970k0000O3166m9782j44152J28059K02642q9670
8598B43778Q4993j23302k42389K276J5091M6828O1041N3930P3833r7884K75j36061
8586a7591n1899k3162J0703K5256K73666O5511k89537J88629J81096K93096N6418
8575G12186j69079L5937j16748l409j60972L4943J81095J37578L291K5286N2822
8564G32930J48891m6916m69565l51740J37912J997n3422J16052O5631l5569o3347
8553A82854J12818J55236j62533j42986J32690o9916N6940M3115j6753Q6663j59863
8542B18265r7837J04073j3063j2247K4138j46433J69733k0177q206j73227r198
$$ plain form
8620 246628 -7491 -3328 -16412 62697 262952 153045 123509 172351 75974 1727 139065
8609 139065 135362 5876 27545 153515 133515 196681 146899 2747 130806 333448 243778
8598 243778 328771 205469 -36920 -34644 -19553 27275 88316 142246 216079 118195 118470 -17591
8586 -17591 -69490 -92652 -81949 -56693 216973 282484 -7053 181576 362672 655768 712186
8575 712186 543107 579044 462296 458887 297915 332858 513953 651531 654822 680108 732930
8564 732930 881821 834905 365340 13600 151512 153509 100087 216139 281770 246201 182854
8553 182854 295672 450908 288375 145389 278079 208163 265103 308218 291465 378128 218265
8542 218265 120428 224501 211438 199191 223329 76896 246629 226452 218246 45019 35821
8531C5821J13118j63577j54084K25884J52559j78803o6679K7835o3578k6740j15711
8520b13955K69551J29606L0755Q3508k0117O705K9004Q9117J31918q9947k00243
8509B45902k10542J4279J25622m0875n2742K3740Q56j10714P7663r6703Q8914
8498F5400O1475m8781j52341Q5396J53353k9863p8174L04484M4733o555K4530
8487D23657Q265q7497K8474P2561j28359l49518K6172J40838N2739J4243K5825
8476B27400j10739j20238L42388J81445l2510j13840j27235K6650J019J02497
8466C76837l4040j61913p9681K5501J19333J88973r5121j79237m7342M6307J56703
8455C16320r9590k3104L7088j62689q8772K29476j9543j43960m3617J81788K20426
$$ plain form
8531 35821 148939 -14638 -168722 57162 209721 30918 -35761 -7926 -71504 -98244 -213955
8520 -213955 55596 185202 215957 299465 279348 286053 315057 404174 536092 446145 245902
8509 245902 35360 49639 175261 134386 81644 105384 106240 -4474 73189 -23514 65400
8498 65400 126875 78094 -74247 11149 164502 134639 56465 360949 405682 399127 423657
8487 423657 431922 344425 372899 445460 317101 -32417 -6245 134593 187332 201575 227400
8476 227400 116661 -3577 338811 520256 487746 373906 246671 273321 274340 376837
8466 376837 342797 180884 101203 126704 246037 435010 339889 160652 113310 159617 316320
8455 316320 216730 193626 230714 68025 -20747 208729 189186 45226 1609 183397 403823
8444D03823n0024L938R8775L4317l480N6207l924j10020K02298n9176r1186o0111
8432D21437m5478k0336k26733J03925J06771p0149j86149q4013J29008P2056Q0449
8421B80788K5078l20319r1310K76131K41892P4445J61323k12711q9082N6483k8184
8410C74534l9852j25381K8789O4341q8740j65603R2722P8299k8436K14176J80654
8399E85503M5174m4007j95790L1206j26581j61521n4639p8067J13495O8246J46005
8388C29024J71806O9646m4838j2958J3184k448j19265q5359J16908Q6026L9473
8377E61199r7793o7184j40558P489K63043m8772M4857M2106j90471r5493J0289
8366B88712r6968j22637N2101M9529j2772O2972Q9757J91679J7245J4791M2921
$$ plain form
8444 403823 353799 357737 456512 490829 487349 543556 539632 429612 631910 572734 481548 421437
8432 421437 375959 355623 128890 232815 339586 269437 83288 -725 128283 200339 280788
8421 280788 305866 -14453 -105763 170368 412260 486705 648028 435317 346235 402718 374534
8410 374534 334682 209301 238090 302431 213691 48088 140810 219109 190673 404849 585503
8399 585503 630677 586670 390880 422086 295505 133984 79345 1278 114773 183019 329024
8388 329024 500830 570476 525638 512680 525864 523416 404151 318792 435700 521726 561199
8377 561199 463406 396222 255664 263153 526196 477424 522281 564387 373916 278423 288712
8366 288712 191744 69107 121208 170737 157965 220937 310694 502373 519618 534409 577330
8355E77330j24795l01291j79020M5235J65875J83340N4856J9291k14088J3569
8345B40302J45466K3124J0087j59524j13752Q6003M3978J45371J11391k09259
8335C23187j6967R2305J47070j42784j23688L01434R3849l28881j7244O2084Q6864
8324D77229O159j08891r2575N6572N1450J10797q5827O1642R5899Q1601n1563
8313F02493q3055j26525M8997K60966j28216j54443Q6551m6412j96494M0365L369
8302C07596o3280J29379M1528J7465K17395K5325K1937q7227j35057p3685P5552
8291D76928j04068J74376J85785J81062p4178k18950n6161j5284k2248K4115R1617
8280F42994K5484j52003J557K5122j2875m9344J01370M6484O431Q1595J8034k34948
$$ plain form
8355 577330 452535 151244 -27776 17459 183334 366674 421530 440821 226733 240302
8345 240302 385768 408892 418979 259455 145703 231706 275684 421055 532446 323187
8335 323187 306220 398525 545595 402811 279123 580557 674406 345525 328281 390365 477229
8324 477229 483388 374497 281922 338494 389944 500741 414914 476556 572455 654056 602493
8313 602493 519438 392913 441910 702876 574660 420217 506768 460356 263862 304227 307596
8302 307596 244316 373695 415223 432688 650083 675408 697345 610118 475061 401376 476928
8291 476928 372860 547236 733021 914083 839905 620955 564794 549510 527262 551377 642994
8280 642994 668478 516475 518032 543154 530279 480935 582305 628789 635220 716815 734849 499901
8268D99901k32036L1405L06687j0616L0450K5134m6931P1942j22573R9496j24098
8257E28761n0719J8702N1690J02586j79826j50027L24479K9191N9317J04565o6063
8246G72656j97500O4110j09577J5412R3816m689J35863M941J72314j64123l09359
8235D73864o6227M8008l9615J21256M1943M0803k72147J06706J92365k6975J9719
8224F39700M872j62025j38566M0127O5428J820j89617m6445M9199K51444N256
8213E21193j83719r9492J03506K55046J06374j22913l04991N0387J26238p6221
8203C75408n4302L2415k66146l1426J87077J91997k6264j58282P5515J72212J19248
8192F17452o7658j7247P9758M3593j35680p6709k1433j42022J6823j64344p8472
$$ plain form
8268 499901 267865 299270 605957 595341 625791 650925 603994 675936 553363 652859 528761
8257 528761 478042 496744 548434 651020 471194 321167 645646 674837 734154 838719 772656
8246 772656 575156 639266 529689 545101 638917 634228 770091 775032 947346 783223 473864
8235 473864 407637 455645 416030 537286 579229 620032 347885 454591 646956 619981 639700
8224 639700 644572 482547 343981 384108 449536 451356 261739 215294 264493 515937 521193
8213 521193 337474 237982 341488 596534 702908 579995 275004 325391 451629 375408
8203 375408 321106 353521 87375 55949 243026 435023 408759 250477 325992 498204 617452
8192 617452 549794 532547 612305 655898 520218 443509 422076 280054 296877 132533 54061
8181E4061N0907J64754K91838J81849q7293l5965J8933Q6498p0559j14196k15668
8170C25159r2768N8362L9835J24513K1238k04730j08219j06015K3217M1003k0526
8159A01069q6794o4418M1230Q4514J6525Q8081J13271l5690L3856j8308J38045
8148D11381M7607m618k4526r4808j5179j063o176k3717j04523j4077P9649j42474
8136A07476j37600R6914n4928m3933J8108j3839J72822J90302R3622k11734j55103
8125F2107L5050l4549j37416n2042N4943J37700J68270j66838K1621o7592n3169
8114c1915j52762j11834J84874L13012j5479J465J69251K7255j44311r247P8777
8103C09086Q3075k17225m9986p4111J31852l4438j66794L3115R1993J17376k64442
$$ plain form
8181 54061 104968 269722 561560 743409 656116 620151 639084 725582 655023 540827 325159
8170 325159 232391 290753 330588 455101 476339 271609 163390 57375 80592 121595 101069
8159 101069 14275 -50143 -8913 75601 92126 180207 293478 257788 291644 273336 411381
8148 411381 458988 454370 429844 335036 319857 318794 312618 288901 184378 170301 249950 107476
8136 107476 -30124 66790 11862 -32071 -13963 -27802 145020 335322 428944 217210 62107
8125 62107 97157 62608 -74808 -126850 -71907 65793 234063 67225 88846 21254 -31915
8114 -31915 -184677 -296511 -111637 201375 185896 187361 356612 383867 239556 230309 309086
8103 309086 392161 174936 124950 50839 182691 148253 -18541 14574 106567 223943 -40499
8092d0499j16158M3418J20396J8156J52613o5125J7517K4220j19547Q8455N6024
8081A79470M8962j02967m5406M0907J9321k6561j07378K5856J59117l0500r3582
8070F7239K14729J14015J76412L0249k05823j01236j71399j48327J37767K21710
8060C35336j17061o7494P68p6214k6327k02503J1219n2896J60662K07786Q8429
8049B61705M0999k7363j05434j75999L2873o5887J60634R8080K1331j7314N2235
8038B75860M0968q5147n3155O2007J32785q074o6435k4273P1164k7796j28968
8027A88936q3610k03597m117k0124L2627L2309N8695m2964r8300Q0442j59005
8016b18708k3145J08583N6034O6759j39810o9387R3037Q7567l7479k57493o3725
$$ plain form
8092 -40499 -156657 -113239 7157 25313 177926 112801 130318 154538 34991 123446 179470
8081 179470 228432 125465 80059 120966 140287 113726 6348 32204 191321 160821 67239
8070 67239 281968 395983 572395 602644 396821 295585 124186 -24141 113626 335336
8060 335336 218275 150781 151549 75335 49008 -153495 -142276 -195172 -34510 173276 261705
8049 261705 302704 275341 169907 -6092 26781 -39106 121528 219608 240939 223625 275860
8038 275860 316828 231681 178526 240533 373318 365244 298809 274536 345700 317904 188936
8027 188936 105326 -98271 -102388 -122512 -89885 -57576 1119 -41845 -140145 -59703 -218708
8016 -218708 -241853 -133270 -77236 -10477 -150287 -219674 -126637 -39070 -76549 -334042 -397767
8005c97767l2206J6079J32736K30320Q6622j7195k5043j8671R6270j10321R378
7994b9798L5123J01798K35796Q8596j74710o1290q0985j90083O0063J09705J95440
7983B89655J5436p1817P931l07033k00135j32259J10848J60837J59542J86483
7973B19488J1062m2746M124q257l1627m2895j7834p8611j00249J7390j07669p4708
7961b52532l7111O2611n2873M4132P0183M9672J1974j89406K76997J26483j61100
7950e0970N7647J9692j59827J5735R8953q0576l7033j48242J35551J80637J2102
7939D3669J8686N5664o80j39595L9745J31629m0974J23120K24813n3046k85574
7928A17457Q8567R7014R3654o9918j95380j81536q5422K56170Q2485K27754o9071
$$ plain form
8005 -397767 -429973 -413894 -281158 -50838 35784 18589 -6454 -25125 71145 -39176 -29798
7994 -29798 5325 107123 342919 431515 256805 195515 114530 -75553 -15490 94215 289655
7983 289655 305091 233274 241205 -65828 -265963 -398222 -287374 -126537 33005 219488
7973 219488 230550 187804 191928 183671 152044 109149 91315 12704 -87545 -70155 -177824 -252532
7961 -252532 -289643 -227032 -279905 -235773 -165590 -115918 -103944 -293350 -16353 110130 -50970
7950 -50970 6677 26369 -133458 -117723 -18770 -99346 -136379 -284621 -149070 31567 43669
7939 43669 62355 118019 117339 -22256 17489 149118 108144 231264 456077 403031 117457
7928 117457 206024 303038 396692 326774 131394 -50142 -135564 120606 203091 430845 361774
7917C61774r3777l1362j1971k0410j46192R5686K9236n1956K4358j03249j53906
7906a01769O34P6939j7972l7432J32457n901j08917m7020L4835K0623j6343J02754
7894C2888k7992j0202q1519n6046N8949o6554K58841J95558J56321o8334j50437
7883B41473n6500k30036j702J71804j24321q6036P3573M5492R2457p5748m8249
7872B207j20984p0189K50170J31864r1934r6107j12643j38831J23808J11065r5192
7861a06766l4309J16242J63208L5421m8140J26433o9579j93340j2182j01044m6977
7850a71033P8345N8672l1188P879J51691m311K3090j71080j16362M7042q7857
7839b15112J25555J31544l4868p4588R3088O3243J3227O2977J56457n7142l4633
$$ plain form
7917 361774 267997 236635 224664 204254 58062 153748 182984 131028 155386 52137 -101769
7906 -101769 -101135 -24196 -42168 -79600 52857 46956 -61961 -108981 -74146 -53523 -69866 32888
7894 32888 4896 -5306 -86825 -142871 -83922 -150476 108365 303923 460244 391910 241473
7883 241473 184973 -45063 -46765 125039 718 -85318 -11745 33747 126204 50456 2207
7872 2207 -118777 -188966 61204 193068 101134 5027 -107616 -246447 -122639 -11574 -106766
7861 -106766 -141075 -24833 138375 173796 125656 252089 182510 -10830 -23012 -124056 -171033
7850 -171033 -92688 -34016 -65204 -57325 94366 90055 113145 -57935 -174297 -127255 -215112
7839 -215112 -89557 41987 7119 -67469 25619 88862 102089 165066 321523 264381 229748
7828B29748M535m6008o0249Q7644j1297J27045k8321J32296J4157j20265k35189
7817I4096n4986q6980j37217o7027J05292J95812J66038J4j20720j4888r2593
7806a3159J65779N4582r7665q1417j14447N3660k4282O5080p3201j40355J92154
7795a3271J45405l315k42534m6917n0583K1082r9795j48636J32933P7279O09J22019
7783a05724O615n8158J10705P2678M3314j12374j17917j8946N8276j7485M3532
7772i5484J49879P6266k2181j62444l0641o309j1399J00150p9277P8432J94748
7761A91740o9302n8338q1809m3236N8126r7466k3998j5361r973J39589J64204
7750A54176J46201K411k23161k1403j83097m7219J10997K34967Q6553k81607J29601
$$ plain form
7828 229748 234283 188275 128026 215670 204373 331418 303097 435393 449550 329285 94096
7817 94096 39110 -47870 -185087 -252114 -146822 48990 215028 215042 94322 79434 -13159
7806 -13159 152620 207202 109537 28120 -86327 -32667 -56949 8131 -65070 -205425 -13271
7795 -13271 132134 128819 -113715 -160632 -211215 -190133 -289928 -438564 -305631 -228352 -227743 -105724
7783 -105724 -99109 -157267 -46562 26116 69430 -42944 -160861 -179807 -121531 -139016 -95484
7772 -95484 54395 130661 108480 -53964 -84605 -90914 -102313 -2163 -81440 -3008 191740
7761 191740 122438 64100 -17709 -60945 -2819 -100285 -124283 -139644 -149617 -10028 154176
7750 154176 300377 302788 79627 58224 -124873 -172092 -61095 173872 260425 -21182 108419
7739A08419j78011l22203N8216K19214K31331J39340M0722r1780k7482M2263j52728
7728F7301j69880J6587J59848J90702j39538k5177K3470p432p4324p9061J14370
7717G6866J11588n3584K4439J62797j5794j70876j38449n6909k0488j42560K21525
7706a445L8395n2087o1214l7017J77530K2855K3754j25421j96255k4645n7134
7695b92684J41958J60648j81895j04719M4671J34770J48444k36161k96344R6697
7685c84615J37215J8347K49994J74864R9876k41275l88217q3361J22739K12896
7675h1537L6027J29793J57773j04297j75383J42900L01240j70167k19278J7307
7665C4378r5381k21212m4921J5162J87217J32347m0800q4900J17178Q1049l6190
$$ plain form
7739 108419 -69592 -391795 -333579 -114365 116966 256306 297028 205248 177766 220029 67301
7728 67301 -102579 -85992 73856 264558 125020 99843 123313 115881 41557 -37504 76866
7717 76866 188454 134870 159309 322106 306312 135436 -3013 -59922 -80410 -222970 -1445
7706 -1445 36950 -15137 -76351 -113368 64162 87017 110771 -14650 -210905 -235550 -292684
7695 -292684 -150726 9922 -171973 -276692 -232021 -97251 51193 -184968 -481312 -384615
7685 -384615 -247400 -229053 20941 195805 295681 54406 -333811 -417172 -294433 -81537
7675 -81537 -45510 84283 242056 137759 -37624 105276 406516 236349 17071 34378
7665 34378 -61003 -282215 -327136 -311974 -124757 7590 -33210 -118110 -932 80117 43927
7654D3927j91844j25406p9870K9086J42747J29795J46072j16348j67810K0080
7644a69571j27269m1109N6854l2777J38721K1889J50307O300K8244J65817m3129
7633A54277l5312p9183o7801M4002J01589k83388j95065J7158q4851N0297Q3560
7622b94717P5767J10412J7460o0259k44170J50325K34930J50352q885j16039p9829
7611f4653M1205J01737J25656l0028l6427J7536j10999m9115r0875J2674J05268
7600B1979L3039J52893M9835r3046j4094n4931J21591Q5461R0944j52367j76206
7589F5098j36764M7213m1001j30961J17627J58731J14993O9740l6375J585k8113
7578B01773j44785L9112J24650Q963k82071j53162K2352J59948K8259m1934k5945
$$ plain form
7654 43927 -147917 -273323 -353193 -324107 -181360 -51565 94507 -21841 -189651 -169571
7644 -169571 -296840 -337949 -281095 -313872 -175151 -153262 -2955 3345 31589 197406 154277
7633 154277 118965 39782 -28019 15983 117572 -165816 -360881 -343723 -428574 -378277 -294717
7622 -294717 -218950 -108538 -91078 -151337 -395507 -245182 -10252 140100 131215 15176 -64653
7611 -64653 -23448 78289 203945 173917 137490 155026 44027 -5088 -95963 -83289 21979
7600 21979 55018 207911 257746 164700 150606 95675 217266 302727 393671 241304 65098
7589 65098 -71666 -24453 -65454 -196415 -78788 79943 194936 264676 228301 229886 201773
7578 201773 56988 96100 220750 229713 -52358 -205520 -183168 -23220 5039 -36895 -62840
7567f2840p8163j06624k4575J07266J32957J04037l5326P9804J46922J18458j98302
7556A83614j88336m16584q9083J1087J93825L88095L4080J2758k5064j12775l2714
7545d1097K9878J27331Q3844j18968P1135J61504j95180o1242j31951N6536j23290
7534a41500L4046q8574j8073k0878j2002J38028P1811n097J07837p619q0435O321
7522a6135j46358j57189P4004Q5774N0831J84054j29997N9015j78049j90307J3067
7511c51290J43129J00371j15886r519J87441P1867L034J59957j79559k55375l8286
7500b84116Q0364N6412j82315j4729R1792R3700j8990o3417j29280R6703J62942
7489a10934l4521k01243P2260L18K0317K16476K6140J29434k8661j85191j16180
$$ plain form
7567 -62840 -141003 -247627 -272202 -164936 -31979 72058 36732 116536 263458 381916 183614
7556 183614 -4722 -421306 -510389 -499302 -305477 82618 116698 129456 104392 -8383 -41097
7545 -41097 -11219 116112 199956 80988 152123 313627 118447 57205 -74746 -18210 -141500
7534 -141500 -107454 -196028 -214101 -234979 -246981 -108953 -37142 -42239 65598 57979 -22456 -16135
7522 -16135 -162493 -319682 -245678 -159904 -109073 74981 -55016 3999 -174050 -364357 -351290
7511 -351290 -208161 -107790 -223676 -233195 -45754 26113 29147 189104 9545 -245830 -284116
7500 -284116 -203752 -147340 -329655 -344384 -252592 -158892 -177882 -241299 -370579 -273876 -110934
7489 -110934 -145455 -346698 -274438 -274120 -253803 -37327 -11187 118247 89586 -95605 -211785
7478b11785m4237j1013j00257P3854P4394J68529K7082M2027J47068j15273R863
7467F0252j187J94330K56130j05617n1309k63152j15143J424q4782o9319Q9808
7456h8565q625j09308n0795j08143K05665K15409L956J48894R8074j13031J692
7445A95223j54869o9364r074K39607J06660l49364Q146m5810m2106Q9812O3346
7434C2207P94m8949L1418J72105n6170j07023o2673m1322J78618J58397k61675
7423d273j96719q9524N422K10247J15973q4536l3519L2807K28492M3787m429L6346
7411B60074o0024r7334J01900k9047j74862q0446j70997J49437K13691r7749j37254
7400a22611N0477m412r3907Q7700J40865Q7352k4711j9204L5004P5782j28259
$$ plain form
7478 -211785 -256022 -267035 -367292 -293438 -219044 -50515 -23433 18594 165662 50389 60252
7467 60252 59065 253395 509525 403908 352599 89447 -25696 -24272 -109054 -178373 -88565
7456 -88565 -97190 -206498 -257293 -365436 -159771 55638 59594 208488 306562 193531 195223
7445 195223 40354 -29010 -38084 201523 308183 -41181 -33035 -78845 -120951 -31139 32207
7434 32207 33001 -15948 15470 187575 131405 24382 -38291 -79613 99005 257402 -4273
7423 -4273 -200992 -290516 -285094 -74847 41126 -43410 -76929 -44122 184370 228157 223728 260074
7411 260074 200050 102716 204616 175569 707 -79739 -250736 -101299 112392 14643 -122611
7400 -122611 -72134 -76546 -170453 -82753 58112 145464 120753 101549 136553 212335 84076
7389H4076p8866M9569k2481j12364j34768r128o7175l3641R1163J40533j4655
7378a07737p7537P4350J95057j73468p8041m2758K638P8663J14327m7230n7003
7367a18739j9243P9615J37732k798j0417q3433j60715k21870j60151n5262J20772
7356d94509O472q6651K58525l688j31645p2173J25729J49073J03905k9990o7639
7345b42591J32782j9807L8816l5472r8087k20763l7956K95451J06671L6001J82
7334d4773m3854J01295o9384k4153N2389M2236j33620p4892L6027m3559J79677
7323b2611J61703m6923j65967l6906n4993p3699k44085L1210J09365j12124o1846
7312e16876N7011j432K05137P7133J83105j16946k56044q9841K16351J39285p2338
$$ plain form
7389 84076 5210 54779 32298 -80066 -214834 -223962 -291137 -324778 -233615 -93082 -107737
7378 -107737 -185274 -110924 84133 -89335 -167376 -210134 -207496 -128833 -14506 -61736 -118739
7367 -118739 -137982 -58367 79365 76567 66150 -17283 -177998 -399868 -560019 -615281 -494509
7356 -494509 -488037 -574688 -316163 -319851 -451496 -523669 -397940 -248867 -144962 -174952 -242591
7345 -242591 -109809 -129616 -90800 -126272 -224359 -445122 -483078 -187627 -80956 -44955 -44773
7334 -44773 -88627 12668 -56716 -80869 -28480 13756 -119864 -194756 -158729 -202288 -22611
7323 -22611 139092 92169 -73798 -110704 -165697 -239396 -483481 -452271 -342906 -455030 -516876
7312 -516876 -459865 -461297 -256160 -179027 4078 -112868 -368912 -458753 -242402 -103117 -175455
7301a75455j19623P1603L2945j1258l4591P0879n8901L79238K79612n6413k14945
7290A63091j46070P6478Q5343l6279j8926J5706m9021j20695n7139j13418R4566
7279a06364L1734J14203k02315k81831Q0859K10760J03884q8802P9295J84929
7269A26352Q0687j1641o2479L7809P2060j7603M1270J962j83479j18221K0675
7258a2608K7591o0868l3961p8972J00498r887q5892r931K3240n4565O9504O2082
7246f3769j69226k35636K4211J83471k8417j11120K8968l2951J22358K39518M8656
7235F063Q2296M5754j0276J7500j72700k97705j39892P1075K26362J13223O7476
7224I176O1973n799k1249Q9413N6595o4211K1926m2119k63601j48711P4795J44263
$$ plain form
7301 -175455 -295078 -223475 -190530 -201788 -236379 -165500 -224401 154837 434449 378036 163091
7290 163091 17021 93499 178842 142563 123637 139343 90322 -30373 -87512 -200930 -106364
7279 -106364 -74630 39573 -162742 -444573 -363714 -152954 -49070 -137872 -58577 126352
7269 126352 207039 195398 132919 170728 242788 225185 266455 268417 84938 -33283 -12608
7258 -12608 14983 -45885 -79846 -158818 -58320 -68207 -154099 -164030 -140790 -195355 -125851 -63769
7246 -63769 -232995 -468631 -444420 -260949 -289366 -400486 -371518 -404469 -282111 -42593 6063
7235 6063 88359 134113 123837 141337 -31363 -329068 -468960 -397885 -171523 -58300 9176
7224 9176 71149 65350 44101 133514 190109 125898 147824 105705 -157896 -306607 -231812 -87549
7212h7549j04786K9743K00560l2467j43161N0069M7877p817J36942L9478L9723
7201A68612j25022k04348O2456J13902j4715M2349n3399Q6503K3832j55277j67425
7190b22532J34516m128J67658M2387l1582m9988j9216o651j18963o5935j15686
7179b90120r1838R1047J01236k7293R8472J10928q0198l6679K62366n7423l73907
7168b93409j61824J16984k5176p1007J88741J37037j21755Q481J85114J12368
7158G5554k94m2888k7381p619L0259j8853q8247j22683K1309j00069K68261M05199
7146C92548O1820j8616j0643k64109r4499n1481p8981p0242K2355o7512J24457
7135e4903J35716P7714M1780j15836Q125o4705M0140o5747m202j19099P460j21505
$$ plain form
7212 -87549 -192335 -162592 37968 5501 -137660 -87591 -39714 -47531 89411 128889 168612
7201 168612 43590 -160758 -98302 15600 885 43234 -10165 76338 100170 -55107 -222532
7190 -222532 -88016 -92144 75514 117901 86319 36331 17115 10464 -108499 -174434 -290120
7179 -290120 -381958 -290911 -189675 -216968 -118496 -7568 -87766 -124445 137921 80498 -293409
7168 -293409 -455233 -338249 -363425 -434432 -245691 -108654 -230409 -221928 -36814 75554
7158 75554 75260 32372 4991 -2628 27631 8778 -79469 -202152 -180843 -280912 -12651 392548
7146 392548 454368 435752 425109 161000 66501 15020 -63961 -134203 -111848 -179360 -54903
7135 -54903 80813 158527 200307 84471 92596 27891 68031 2284 -1918 -121017 -113557 -235062
7123b35062j10956Q8080J2126Q7057J93341k05089Q45J18424l4122K6239M5354
7112a3763J00679j8698k14780M7011R4967j34602l2962R5614J00469J62006J0262
7101A96203R879j32021o6918R7519L28j17530j03422O4219j13109O777M9783J66415
7089E8123q1379n2434M8972j66579J50199O2977r868k37316k68379K25223J48998
7078a21463K9868O962N9033Q6211J37613j11256l39466k53265J97577N3953q2985
7067c37218L9454k3985J71756Q6120Q272j02624j57945k819J17165j9640M0441
7056a81023P2866K18917l7003P5162l3426o3816p5381o7264q9439q2138l3993
7045b96538J82198K68429o4934k13305j27563p6679K75242O9914r9909r6157R7930
$$ plain form
7123 -235062 -346018 -257938 -245812 -158755 34586 -170503 -169658 -51234 -85356 -59117 -13763
7112 -13763 86916 68218 -146562 -99551 -4584 -139186 -172148 -76534 23935 185941 196203
7101 196203 206082 74061 7143 104662 104990 -12540 -115962 -51743 -164852 -158075 -108292 58123
7089 58123 -23256 -75690 -26718 -193297 -43098 19879 10011 -227305 -495684 -270461 -121463
7078 -121463 -91595 -84633 -25600 60611 198224 86968 -252498 -505763 -308186 -254233 -337218
7067 -337218 -297764 -321749 -149993 -63873 -55601 -158225 -316170 -318989 -201824 -221464 -181023
7056 -181023 -108157 110760 73757 148919 115493 51677 -23704 -90968 -180407 -262545 -296538
7045 -296538 -114340 154089 89155 -124150 -251713 -328392 -53150 16764 -83145 -179302 -81372
7034h1372J16990O502j14758l9082P5267k2774J4457k48267j17013J1872j1979
7023d10157K4984P494O5844K97507J44511j20503j57703O7557l2927l6570l0876
7012a80839o3927p2372P9976j05812k6913J18959R0211r8238R3794j975J8711
7001a48425k8395r1901K31109K13146O2783j71430j3981j14958k64210m9401J25233
6990b50430N7841K00093K80786O0900k20385j96919R008K1603p0492j21338j00808
6979c30141o6449m9125J28010K0508J63731k203j81903M7620J2995O1098P2832
6968a23027l8373j4705R2847J60373k06822j63207M3012J17073p7986J46686K00378
6957A36249j45760j52237j20039N1151J18594o2640m4996K1789J22254Q7255m4767
$$ plain form
7034 -81372 35618 42120 -72638 -111720 -36453 -59227 -44770 -293037 -410050 -398178 -410157
7023 -410157 -385173 -377679 -311835 -14328 130183 9680 -148023 -80466 -113393 -149963 -180839
7012 -180839 -244766 -317138 -237162 -342974 -369887 -250928 -160717 -258955 -165161 -167136 -148425
7001 -148425 -176820 -268721 -37612 175534 238317 66887 52906 -62052 -326262 -375663 -250430
6990 -250430 -192589 7504 288290 349190 128805 -68114 -59106 -37503 -107995 -229333 -330141
6979 -330141 -396590 -445715 -317705 -297197 -133466 -135669 -317572 -269952 -256957 -195859 -123027
6968 -123027 -161400 -176105 -83258 77115 -129707 -292914 -249902 -132829 -210815 -64129 136249
6957 136249 -9511 -161748 -281787 -230636 -112042 -174682 -219678 -197889 -75635 11620 -33147
6946c3147r1589O3950q9157j00226J7598j6397J39169l554j00811j59883J9564
6935c54483P2300N9621l0327k222j37866p354L09319L8712j6683M7676j57173
6924a78480j19277J18853P7243m9425J0164m6241p5880J9142n4359j23419N2571
6913c69108O6116M0372J1985J11269l0957P9816N5652P0126j73374j27619P3078
6902a92644O199p1808P0432K70463j82962j16419N0566J40563j32954K00166J22478
6891A64080k83726k5127J10912q8834n4860j8318k2301j70000o8844J25988K5165
6880c05865K4279J34330J66313J00340N1514m6792o5792q0122o5225n6486M0995
6869a02511k8571J07548O8627l2022K05212j05634o8410m1934j68908O2980j27329
$$ plain form
6946 -33147 -124736 -60786 -149943 -250169 -232571 -248968 -109799 -113353 -214164 -374047 -354483
6935 -354483 -282183 -222562 -252889 -255111 -392977 -400331 -91012 -52300 -68983 -21307 -178480
6924 -178480 -297757 -178904 -101661 -151086 -140922 -187163 -263043 -243901 -298260 -421679 -369108
6913 -369108 -302992 -262620 -250635 -139366 -170323 -90507 -34855 35271 -138103 -265722 -192644
6902 -192644 -186445 -258253 -187821 82642 -100320 -216739 -166173 -25610 -158564 41602 164080
6891 164080 -119646 -144773 -33861 -122695 -177555 -195873 -218174 -388174 -457018 -331030 -305865
6880 -305865 -281586 -147256 19057 119397 170911 124119 58327 -21795 -87020 -143506 -102511
6869 -102511 -131082 -23534 45093 13071 218283 112649 44239 2305 -166603 -103623 -230952
6858b30952K23294J06477j08957r3089M230j31317o3104N73J00747K97082O1371
6847A66355M4750j27692P0018J38622j64168j36813O1054R2803K10756k59249
6837I6436j66967j88213K848J83441J76677o0892j26805P9593J60457k2405j7142
6826A17028P138l0804j37144N8776J2595j44900L8866m3387J5425O0022o6089
6815a12474n3146J20275m7327J03616J13231N0105q8167J68321q5819k32303p5046
6804a38734J8244j943j22286j11471M6952K79390J05836Q365k0866l600J8926
6793G8813j17393k5757j72838n2870R6601P2894O0302P6810J63339j78080l11019
6782c09198k16169j28918K10301L89551K12993j71497k55540R4046k1480j6874
$$ plain form
6858 -230952 -7658 98819 -10138 -103227 -98997 -230314 -293418 -292845 -192098 104984 166355
6847 166355 211105 83413 153431 292053 127885 -8928 52126 144929 355685 96436
6837 96436 -70531 -258744 -255896 -72455 104222 43330 -83475 -3882 156575 134170 117028
6826 117028 124166 93362 -43782 14994 27589 -117311 -78445 -121832 -106407 -46385 -112474
6815 -112474 -165620 -45345 -92672 10944 124175 174280 86113 254434 168615 -63688 -138734
6804 -138734 -120490 -122433 -244719 -356190 -309238 -29848 75988 84353 63487 59887 78813
6793 78813 -38580 -64337 -237175 -290045 -193444 -120550 -60248 16562 179901 1821 -309198
6782 -309198 -525367 -654285 -443984 -54433 158560 -12937 -268477 -174431 -195911 -212785
6772b12785J99275j4592p9203k5704M2158k01380O566J3875j40874j36226Q8296
6761d60594P9648K6244J082p9754J23160L51j77944J29157j8581n4522K6244m0423
6749d45932m6665m2123J31489J70563Q5976L3747m5684j37012m4656J10474o9706
6738b99529q4252J95143R1590n4876O3136M8121o6899j73022J37847q7864l7531
6727b68136O4351j65490M0659O3611L1705K8118O0561m1188N0536J46369J4677
6716B5773K33249j87404k16930M7062N6434j38940j14336p651O2476J5593q5740
6705c10414J26847J30705j10516n3160p4856J00270Q7192j2760J10842J19208
6695A13358m1629j69749P0244j54475M2872N7616j6902K2464L137n4583k52170
$$ plain form
6772 -212785 -13510 -28102 -107305 -133009 -90851 -292231 -285665 -271790 -412664 -548890 -460594
6761 -460594 -380946 -354702 -353620 -433374 -310214 -309863 -487807 -358650 -377231 -431753 -405509 -445932
6749 -445932 -492597 -534720 -403231 -232668 -146692 -112945 -158629 -295641 -340297 -229823 -299529
6738 -299529 -383781 -188638 -97048 -151924 -88788 -40667 -107566 -280588 -142741 -230605 -268136
6727 -268136 -203785 -369275 -328616 -265005 -233300 -205182 -144621 -185809 -135273 11096 25773
6716 25773 259022 71618 -145312 -98250 -41816 -180756 -295092 -302743 -240267 -224674 -310414
6705 -310414 -183567 -52862 -163378 -216538 -291394 -191124 -103932 -116692 -5850 113358
6695 113358 71729 -98020 -27776 -182251 -139379 -81763 -98665 -76201 -73064 -127647 -379817
6684c79817M8313j55500n112Q1281K84026J83262J43249j05355o5551J35759o6665
6673I7890j98707k212p6245j25867j11332M3083L6045K8657R5828K45138M0724
6662G3002N1191l4447m24K10272j41672n8933k33499j7056J80723j39673o7163
6651a77679L5818l17394P3913K79138J63461l7224j5172j16898j39286p9600K49483
6640h1440J52810P2078k60354j27129j7246o5339J81821J21819k1878K2864M6545
6629B4551p1372P0518K44388J57224J07444m3899l37164j10964O5650o1068j97015
6618a51707j58031K2710J1114J10234m773r0167k160N8541N4207L2221q4010j9977
6606b21798K8970M3069P7710k0796j6936k9494J9231p204m5135J5798J94211r1548
$$ plain form
6684 -379817 -331504 -487004 -492116 -410835 -126809 56453 199702 94347 28796 164555 97890
6673 97890 -100817 -103029 -179274 -305141 -416473 -373390 -337345 -308688 -212860 32278 73002
6662 73002 124193 89746 89322 299594 157922 98989 -134510 -151566 29157 -110516 -177679
6651 -177679 -141861 -459255 -385342 -106204 57257 20033 4861 -112037 -251323 -330923 -81440
6640 -81440 71370 143448 -116906 -244035 -261281 -326620 -144799 -22980 -44858 -21994 24551
6629 24551 -46821 23697 268085 425309 532753 488854 151690 40726 106376 45308 -151707
6618 -151707 -309738 -287028 -275914 -165680 -170453 -260620 -262780 -204239 -150032 -117811 -201821 -221798
6606 -221798 -192828 -149759 -72049 -92845 -109781 -139275 -120044 -127248 -172383 -156585 37626 -53922
6594e3922k9913N9549j06367j338P8811J4054J22588J66922P506L9515q5474l57338
6582a45407j13190J07628R061P3247J69164l7200j35643M289Q6101J38346r9513
6571E6883O708k10939r4371P7069K1452k0072j6725m3992n9245j00425J66706
6560b16951J73614J47125L946q9008L7558j61650p3504j6977K2967J71662r7926
6549i9144j15379p3691j16974K2155k3700r3285j2026J74749L7125J7145q0158
6538c63183J03648J61959l8020j95036l5073N0722q1870n8548M9602K64615J71516
6527C0332N4156j25211n2115o5212K8407N5792R4162j47675k7309j4046q420l7035
6515b14174r230J152L1560j13088k4320J14836r8124j69091J72615M9796Q4065
$$ plain form
6594 -53922 -83835 -24286 -130653 -131991 -53180 -39126 83462 250384 257890 297405 211931 -145407
6582 -145407 -258597 -150969 -141908 -68661 100503 63303 -72340 -68051 18050 156396 56883
6571 56883 63591 -147348 -241719 -164650 -143198 -163270 -179995 -223987 -283232 -383657 -216951
6560 -216951 -43337 103788 107734 18726 56284 -105366 -178870 -195847 -172880 -1218 -99144
6549 -99144 -214523 -288214 -405188 -383033 -406733 -500018 -512044 -337295 -300170 -283025 -363183
6538 -363183 -259535 -97576 -135596 -330632 -365705 -314983 -396853 -455401 -405799 -141184 30332
6527 30332 84488 -40723 -92838 -158050 -129643 -73851 20311 -127364 -154673 -168719 -177139 -214174
6515 -214174 -223404 -222252 -190692 -303780 -328100 -213264 -311388 -480479 -307864 -258068 -174003
6504a74003J54400n5400j79692j59667r932Q513J29820J38794M4316n8215n4696
6493b15762J37182J51733J83063K16092r9164j9342q2635k34742p3311j67564
6483b04450p2607K3638N122K48089J89883L8254L5592N5118l1961k04028l4087
6472D8563q5582l7853P4113o0877K4144N4572l6531j55749j67098q7644O843J92261
6460b30838R2052J07521O462K2104j11715m479p594m1115J02908J41070L84500
6449D60876R7819r6803j06120j74427r8449r4388j96382j19414R5294J71500J69574
6438A09080J53038j13910l68703j9648L3032J40123j24923p7040k1512J74720
6428a15743m7272J11796j8593o8694k06473K92809J31506k24629Q3800o8080l656
$$ plain form
6504 -174003 -19603 -75003 -254695 -414362 -424294 -415781 -285961 -147167 -102851 -161066 -215762
6493 -215762 -78580 73153 256216 472308 373144 353802 271167 36425 -36886 -204450
6483 -204450 -277057 -253419 -248297 -208 189675 227929 263521 318639 286678 82650 48563
6472 48563 -37019 -74872 -759 -61636 -37492 17080 -19451 -175200 -342298 -429942 -423099 -230838
6460 -230838 -138786 -31265 -24803 -2699 -114414 -118893 -126487 -167602 -64694 76376 460876
6449 460876 558695 461892 355772 181345 82896 -11492 -207874 -327288 -231994 -60494 109080
6438 109080 262118 148208 -220495 -240143 -207111 -66988 -191911 -268951 -290463 -115743
6428 -115743 -163015 -51219 -69812 -138506 -344979 -52170 79336 -145293 -61493 -129573 -133229
6417a33229J34314j10541R096J56792j30498j2596j25181j45561j13223P4507
6407c96120j0469r8932J51752J94191K33475j41605j46480l4017J09911R1173
6397d7121j36411n643Q4107k7088J10514J61355O6219P6803k15994k23457j9318
6386a76034J68683J08030j11882m3619K086K11150R2635J15702o7203j58096k01074
6375e9622j18915J0354J42420r2421J22534O464l0219L1050j35403l47193J46052
6364c24899J09603k8362p2163j04976J45186J04548J22293q9146r8360J6427J74028
6353d5821K3116J56850J67493J20194j56406j10973n5171o0822M0282p0004j15770
6342a07032Q7669N409R2810R5063j23895j15289l23816l8533O2814k7635L3863
$$ plain form
6417 -133229 1085 -109456 -100360 56432 -74066 -86662 -211843 -357404 -470627 -396120
6407 -396120 -406589 -505521 -353769 -159578 73897 -67708 -214188 -248205 -138294 -47121
6397 -47121 -183532 -189175 -105068 -132156 -21642 139713 205932 282735 66741 -156716 -176034
6386 -176034 -7351 100679 -11203 -54822 -52736 158414 251049 366751 299548 141452 -59622
6375 -59622 -178537 -168183 -25763 -118184 4350 10814 -19405 11645 -123758 -470951 -324899
6364 -324899 -215296 -243658 -315821 -420797 -275611 -171063 -48770 -137916 -236276 -219849 -45821
6353 -45821 -22705 134145 301638 421832 265426 154453 99282 38460 78742 8738 -107032
6342 -107032 -19363 -13954 78856 173919 50024 -65265 -389081 -427614 -364800 -392435 -358572
6331c58572J52230R9647j50957j5762J13088J01756J5115J28R290q7278j4395
6320a35710q6786L4720P9135O3507j72517j75051J84505k4213j07095L0210p3412
6309c82707P159J14231R8325K0767k3497j52340M4057J6696N2476k1432j20247
6298c46512j24975K88703O6663n0654j96238K33149K0625j27254J61846R6609
6288B1962Q615j47608K7305l4161j72225j50561j5879K8398J50077J14688q7375
6277b56764j85140J5997r8332r9694K78004Q6110m8897K14677K1536J84001M5615
6266A57113k90852J42893K7196k12475q08L14861J36151j87747k15910k07091
6256c36669m0323P1954P4329L0547o0643j37488J3359K20810L507M1595j42881
$$ plain form
6331 -358572 -206342 -106695 -257652 -273414 -160326 -58570 -43455 -43327 -34037 -121315 -135710
6320 -135710 -222496 -187776 -108641 -45134 -217651 -392702 -208197 -232410 -339505 -309295 -382707
6309 -382707 -375548 -261317 -162992 -142225 -165722 -318062 -274005 -257309 -204833 -226265 -346512
6298 -346512 -471487 -182784 -116121 -166775 -363013 -129864 -109239 -236493 -74647 21962
6288 21962 30577 -117031 -89726 -123887 -296112 -446673 -462552 -434154 -284077 -169389 -256764
6277 -256764 -441904 -425907 -524239 -623933 -345929 -259819 -308716 -94039 -72503 111498 157113
6266 157113 -133739 9154 36350 -176125 -176933 137928 274079 86332 -129578 -336669
6256 -336669 -376992 -305038 -230709 -200162 -260805 -398293 -384934 -164124 -160617 -119022 -261903
6245b61903K21466J67974l15571r3445j883R3187K0308L5100m3443j38652m7388
6234c64250J21510r4096Q0935k33524r1039J12838J25493m8292L1829K59537J08052
6223H993J9319J71336P6422O4818j08704j93418o2604j05810r1376j17700Q433
6212c30291p1837l5293J79766Q3089j72903p6722K02950l0391j50975j14374K2329
6201d94652J25879p845Q7546Q2029L9030J48184p5094R1515K21871j8481k04468
6190d486l2578L5911o6845K0424K47590K7022N5741o2428J2941M0819k13622n3801
6178F688O8087m0376L8649o1294K527M4854K9111n3650j66850j33278l4964K00653
6166i9843L7815l7504P4334J90618k7772J58699O6127n2599p7429O0534k1360
$$ plain form
6245 -261903 -40437 127537 -188034 -281479 -283362 -190175 -169867 -134767 -178210 -316862 -364250
6234 -364250 -242740 -336836 -255901 -489425 -580464 -467626 -342133 -390425 -358596 -99059 8993
6223 8993 28312 199648 276070 340888 232184 38766 -23838 -129648 -221024 -338724 -330291
6212 -330291 -402128 -437421 -257655 -174566 -347469 -424191 -221241 -251632 -402607 -516981 -494652
6201 -494652 -368773 -376618 -289072 -207043 -168013 -19829 -94923 -3408 218463 199982 -4486
6190 -4486 -37064 -1153 -67998 -47574 200016 227038 282779 220351 233292 274111 60489 6688
6178 6688 74775 34399 73048 11754 14281 59135 88246 34596 -132254 -265532 -300496 -99843
6166 -99843 -62028 -99532 -25198 165420 137648 296347 362474 309875 232446 292980 271620
6155B71620n7301j69735k55298J21693R3191o0012o4474q264R5141J04465n66
6144G0460J2884j9287Q6397J24245q353k31736j71737j31586n6701J16414J04032
6133a04968k2115m2915l6528M4506j48140L1511P6307N8347l4015P7156N957j04610
6121a99507J06443J09153M134k17498K8110J58964j14092q8515J47299R5685p6541
6110d6365j7615o6762J25578L176j49924J35155p8807n5605k3799J32311k6138
6099f8795j52383l2444q7503j17740J32854j33125r0472M5433Q7221K20994n6139
6088b52099J46196R7528L0109J24537p3751r5880j03478j15173K6707K7685J71103
6077a6516K54751N651k48337r9734n1668J7536Q6882q6775j31750j70471J70731
$$ plain form
6155 271620 214319 44584 -210714 -89021 4170 -55842 -120316 -128580 -33439 71026 70460
6144 70460 83344 64057 150454 274699 266346 34610 -137127 -268713 -325414 -209000 -104968
6133 -104968 -127083 -169998 -206526 -162020 -310160 -278649 -202342 -143995 -178010 -100854 -94897 -199507
6121 -199507 -93064 16089 20223 -197275 -169165 -10201 -124293 -212808 -65509 30176 -46365
6110 -46365 -63980 -130742 -5164 -1988 -151912 -16757 -95564 -151169 -174968 -42657 -68795
6099 -68795 -221178 -253622 -341125 -458865 -326011 -459136 -549608 -504175 -416954 -195960 -252099
6088 -252099 -105903 -8375 21734 146271 72520 -23360 -126838 -242011 -215304 -187619 -16516
6077 -16516 238235 243886 -4451 -104185 -155853 -138317 -51435 -138210 -269960 -440431 -269700
6066b69700N4829m2836P3779J98711J8699r0757O4627p8635m8863o8091K6547
6055a61690P6542J37634j18907J60857K51637j19834l40607j91829J4331J673
6045b90193l5829N1736R7451j87330L3647J26803n2479m646J847R6892O9460R3076
6033D35r3473p0124o584j86325Q5722J37662J17797J01581l60576k09927J55624
6022c28188R1606J98265m4916k35462p816O3465p8666o0938P9431J84712L44999
6011B06492K43849j32599k94444k05882n7624J8194K2015l3999p7806K3749j68293
6000d56348j13339J85083J90018m2245k3744m4421J03762m8323J04529L2091r9454
5989b12391J10131J5518j47339j03893M7707K07525j15846j14276J43224P7021
$$ plain form
6066 -269700 -214871 -257707 -183928 14783 33482 -57275 7352 -71283 -120146 -188237 -161690
6055 -161690 -85148 52486 -66421 94436 346073 226239 -114368 -306197 -291866 -290193
6045 -290193 -326022 -274286 -176835 -364165 -330518 -203715 -256194 -260840 -258993 -162101 -92641 435
6033 435 -93038 -163162 -169746 -356071 -270349 -132687 -14890 86691 -273885 -483812 -328188
6022 -328188 -236582 -38317 -83233 -318695 -326511 -263046 -341712 -402650 -323219 -138507 206492
6011 206492 450341 317742 23298 -182584 -240208 -222014 -199999 -233998 -311804 -288055 -456348
6000 -456348 -569687 -384604 -194586 -236831 -260575 -304996 -201234 -249557 -145028 -112937 -212391
5989 -212391 -102260 -86742 -234081 -337974 -290267 -82742 -198588 -312864 -169640 -92619
5979i2619P1425J52558j69649O7112M7808n1721p9358j86905N3715Q5282L8019
5968f4333N3125J75196l5022j27153r0355o1257J0665O2218O2058m2923M0296
5957a7485P7605N140j11585o9414J60571K8432j63690j48040J4626J53982k8182
5946i8040J62741j20577j47804J94309p640o9035k531N6576M975m0060M7000K3332
5934C246j16605N3137j39187J60551J68641m129m8584p5305M7050Q3873N6456
5923A89144j530j6142O6894j75294q5944r5492r4361J94721J76134k30910r9199
5912a71979N9579L0978O9797j71329j31369K1833M229J9396K00424J2932k0550
5901g6059j80093J13533K00867R2462j51375j46369P8063J27561K7514n2685Q130
$$ plain form
5979 -92619 -21194 131364 -38285 28827 76635 24914 -54444 -241349 -187634 -102352 -64333
5968 -64333 -11208 163988 128966 1813 -88542 -149799 -139134 -76916 -14858 -57781 -17485
5957 -17485 60120 65260 -46325 -115739 44832 73264 -90426 -238466 -223840 -69858 -98040
5946 -98040 64701 -55876 -203680 -9371 -17011 -86046 -88577 -32001 -27026 -67086 -20086 3246
5934 3246 -113359 -60222 -199409 -38858 129783 125654 77070 1765 48815 132688 189144
5923 189144 187614 171472 238366 63072 -22872 -118364 -212725 -18004 158130 -72780 -171979
5912 -171979 -112400 -81422 -11625 -182954 -314323 -292490 -288261 -268865 -68441 -55509 -76059
5901 -76059 -256152 -142619 58248 150710 -665 -147034 -68971 58590 86104 33419 41549
5890D1549r0866j36720J19760J4015m2580J26216q6685m7599M5951j20904k4965
5879b02828p8231r2670q4456o291P1062Q8776O4151m2152m8083L92983O5989k09693
5867h1443J34682J50849k9245j47647j19856M9893o863j03153P4685J44528o7429
5856i99L0610J8598r6855l8668n4053k19069k7888j55949k8487K12724L03609
5845e6427J14897J06431l18827j22621O6238J40578N9545K3687R284m3788j53061
5834a74064k0020J10099L4401n6048J9436J6105L1754j1823l8226q267O5282o6483
5822i7854j5388O9782P8636j77123K9974j02454k9549L1624J0203o4505j82944
5811d49598J03050q605L6492L9500K3942N386Q0465M0764j02412K34673J40745
$$ plain form
5890 41549 -49317 -186037 -66277 -52262 -94842 31374 -55311 -102910 -56959 -177863 -202828
5879 -202828 -281059 -373729 -458185 -464476 -393414 -304638 -240487 -282639 -330722 62261 128250 -81443
5867 -81443 53239 204088 174843 27196 -92660 -42767 -49630 -152783 -78098 66430 -999
5856 -999 29611 48209 -48646 -87314 -141367 -360436 -388324 -544273 -572760 -360036 -56427
5845 -56427 58470 164901 -153926 -276547 -210309 -69731 -10186 13501 22785 -21003 -174064
5834 -174064 -194084 -83985 -49584 -105632 -86196 -70091 -38337 -50160 -88386 -96653 -31371 -97854
5822 -97854 -113242 -43460 35176 -141947 -111973 -214427 -243976 -212352 -202149 -266654 -449598
5811 -449598 -346548 -355153 -318661 -279161 -255219 -249833 -169368 -128604 -231016 3657 144402
5800A44402j71841j21382k918j32723k6177J16419J49687J75515o7285j57741
5790i4044N2760N3945j22706p6292j72087j90609n788K67596J04957j40000N6254
5779b66014N8326J16420M7931P2476k0211o8939j0482o584O0008q7739n4176N2627
5767a06357l902o8142P3695Q7118j82450J01776K58511Q413J1688o2428j57549
5756c9627l13333O7729J44015n636P1132p260L1523P3147J145L4708K9992J78835
5744B66370k45986j2099Q6590n1236j39538n8243K77564q9570j92202N0586P8230
5733b9534P7771k05471j56727J24550k060q8951P1998J75440Q9552m5571k26978
5722b15981J8929R6253n7477r6190j38317j4179p495K68422J56713j41650n0159
$$ plain form
5800 144402 -27439 -148821 -151739 -284462 -310639 -194220 -44533 130982 63697 -94044
5790 -94044 -41284 12661 -110045 -186337 -358424 -549033 -554821 -287225 -182268 -322268 -266014
5779 -266014 -207688 -91268 -43337 29139 8928 -60011 -70493 -77077 -17069 -104808 -158984 -106357
5767 -106357 -110259 -178401 -104706 -17588 -200038 -98262 160249 168662 180350 117922 -39627
5756 -39627 -352960 -285231 -141216 -146852 -75720 -82980 -51457 21690 22835 57543 87535 266370
5744 266370 20384 8285 94875 43639 -95899 -154142 123422 33852 -158350 -107764 -29534
5733 -29534 48237 -157234 -313961 -189411 -191471 -280422 -208424 -32984 56568 10997 -215981
5722 -215981 -197052 -100799 -158276 -254466 -392783 -406962 -414457 -146035 10678 -130972 -181131
5711a81131r1473J28469M7225n2189K3222j43602k34920J63061O1837J11653l0653
5700a98501O6808k3046J09658j5208o2390J27648k36776j60928J10531K28125
5690e4079J19683K2713k62392j23555N0513J00197R6093J84206J17522j94105
5680E6796l5927o5265L4437J0541o0227N1518l8562K6337M850k1098j2047k17826
5668b66473j00591K4726J19917N8736J03857K04580J04263J6497j05832k2601
5658A37079p8719j77410r6552j983j37590j46606Q563Q5068J48602J54922P2302
5647c2324m953p1092K18124N6245j52929p9266L1180M6247j51389K364L9548M6747
5635e1498j6351j7343n8584J66893L6484j4696k02192n9269J96448j5796K728
$$ plain form
5711 -181131 -272604 -144135 -96910 -149099 -125877 -269479 -504399 -341338 -279501 -167848 -198501
5700 -198501 -131693 -154739 -45081 -60289 -122679 4969 -231807 -392735 -282204 -54079
5690 -54079 65604 88317 -174075 -297630 -247117 -146920 -50827 133379 250901 56796
5680 56796 20869 -44396 -9959 582 -59645 -8127 -46689 -20352 -15502 -36600 -48647 -266473
5668 -266473 -367064 -342338 -222421 -163685 -59828 144752 249015 265512 159680 137079
5658 137079 58360 -119050 -215602 -217585 -355175 -501781 -493218 -408150 -259548 -104626 -32324
5647 -32324 -37277 -108369 109755 166000 13071 -66195 -35015 11232 -140157 -137793 -98245 -51498
5635 -51498 -67849 -85192 -143776 23117 59601 44905 -157287 -216556 -20108 -35904 -33176
5624c3176j63406J09493P8883K27184L8671k70722l39234q8569l488O6231l2663
5613d10796K82882K97256o3392j54559R710J81830n4867j17953m122J84620n8370
5602I2239p4612l277m254l5657k8472J51213K45442l21780j93891M9888Q2825
5591d0336m979J7977q578q0947N2169o4061J7809N7931p2952M0049q9638N4099
5579a21457N0458l207J4045N279k7389r6098J31861j84679m3789Q2126P0109K355
5567a20386j00344J0952m5877R4473J55311K0357j95859J1676r5594j2977L2610
5556b45658J52187j09863j13867J16256j01870J63563K47035p1165n0584l1637
5546d5603q1041J43126R5942o3606o8772j5457R8986p4676r1256O5307j9389n4372
$$ plain form
5624 -33176 -196582 -87089 -8206 218978 257649 -13073 -352307 -440876 -444364 -378133 -410796
5613 -410796 -127914 169342 105950 -48609 -38899 142931 88064 -29889 -34011 150609 92239
5602 92239 17627 14350 10096 -25561 -54033 97180 342622 20842 -173049 -123161 -40336
5591 -40336 -45315 -27338 -35916 -116863 -64694 -128755 -110946 -53015 -125967 -85918 -175556 -121457
5579 -121457 -70999 -74206 -60161 -54882 -82271 -178369 -46508 -231187 -274976 -192850 -122741 -120386
5567 -120386 -220730 -209778 -255655 -161182 -5871 14486 -181373 -169697 -265291 -278268 -245658
5556 -245658 -93471 -203334 -317201 -200945 -302815 -139252 107783 36618 -13966 -45603
5546 -45603 -126644 16482 112424 48818 -19954 -35411 63575 -11101 -102357 -37050 -56439 -110811
5534a10811J46619M4913p5574p6924k30499j91185n6591J87999j45387j5015K06831
5523c15624K63478O5p9569K693J5239J31370J41236j89145j02601j97417j37011
5512d67286k3446L6437K12783R2287o0780j44425M0537j1J91384O2072J46007
5501H5559O457j88539n430k404P3580J7894M7044j21570j09394Q7640p1709j02537
5489b83409k48382l4102K84497K18787J60828j56663j34057k46322j45625m6819
5479f31267J05906K58340J14110J43827O483o1701k3960j6247j84812j5619Q2080
5468b22860o3643Q4207j1094j26752j72815J58781J12q3739J43557M8166M2944
5457b03136J24013p5188m7979n0523J6048K228o2938m7597R324j4428J58539N792
$$ plain form
5534 -110811 35808 80721 5147 -71777 -302276 -493461 -550052 -362053 -507440 -522455 -315624
5523 -315624 -52146 -52081 -131650 -128957 -113718 17652 158888 -30257 -132858 -330275 -467286
5512 -467286 -490732 -454295 -241512 -149225 -210005 -354430 -313893 -313904 -122520 -60448 85559
5501 85559 92016 -96523 -101953 -104357 -30777 -12883 34161 -87409 -196803 -109163 -180872 -283409
5489 -283409 -531791 -565893 -281396 -62609 98219 -58444 -192501 -438823 -584448 -631267
5479 -631267 -525361 -267021 -152911 -9084 -2601 -64302 -88262 -104509 -289321 -304940 -222860
5468 -222860 -286503 -202296 -213390 -340142 -512957 -354176 -354064 -437803 -294246 -246080 -203136
5457 -203136 -79123 -154311 -202290 -252813 -236765 -234537 -297475 -345072 -335748 -350176 -191637 -185845
5445a85845O8768P369j41141j62826J18340M1613K08310j771j10351M8214P3124
5434c6196M1197K0327j60370J04464J347r1292j05711J66425l8764k27242j47328
5423d73143Q8327J05648J21640l3472o934P4891J912r8014N2870k11841R8385
5412b79731K32721L7185o6923Jl3601K06373p9083j08844k6244k33813J93966
5401a57993K90673j7042j08770o8176m5443q289j55189j23418j04543K55360K92444
5390D9614m9729l1544m9626n0056P2614n4136j79482N8529L42l2050M0998j5575
5378b40101j71388l5105r6685K26821L52808J84121L2429j36569r0921j12190
5368h6780K03664J5850m1144l8052q4372j28561L2495P6219K3742J25613l0990
$$ plain form
5445 -185845 -117077 -109708 -250849 -413675 -295335 -253722 -45412 -47183 -157534 -109320 -36196
5434 -36196 5001 25328 -135042 -30578 -29231 -120523 -226234 -59809 -98573 -325815 -473143
5423 -473143 -384816 -279168 -157528 -191000 -197934 -123043 -121131 -219145 -166275 -378116 -279731
5412 -279731 -47010 -9825 -76748 -76747 -110348 96025 16942 -91902 -118146 -351959 -157993
5401 -157993 132680 115638 6868 -61308 -106751 -115040 -270229 -393647 -498190 -242830 49614
5390 49614 -115 -31659 -81285 -131341 -58727 -112863 -292345 -233816 -233474 -265524 -224526 -240101
5378 -240101 -411489 -446594 -543279 -316458 36350 220471 252900 116331 25410 -86780
5368 -86780 116884 132734 91590 53538 -30834 -159395 -126900 -50681 -26939 98674 67684
5357F7684m2466K6704j16285j53369j84998L0939q4063J45796K18894j75224j34617
5346d01005K42774J82895J63506K56688P2054j04774j56503N4781j58642N5103
$$ plain form
5357 67684 25218 51922 -64363 -217732 -402730 -371791 -455854 -310058 -91164 -266388 -401005
5346 -401005 -158231 24664 188170 444858 516912 412138 255635 310416 151774 206877
$$ [...]
##END NTUPLES=NMR SPECTRUM
##END=
