##TITLE=Analysis number 328968
Compound Code rh 00785
Book Reference 510/68
Project Code adrs
Chemist Name jimp
##JCAMPDX= 6.0         $$ Bruker NMR JCAMP-DX V2.0
##DATA TYPE= NMR SPECTRUM
##DATA CLASS= NTUPLES
##ORIGIN= Bruker BioSpin GmbH
##OWNER= nmr
$$ XWIN-NMR		Version 3.5
$$ Fri Jul 20 09:25:52 2007 GMT Daylight Time (UT+1h)  MAYBRIDGE\nmr@NMR_250MHZ
##.OBSERVE FREQUENCY= 250.131544655141
##.OBSERVE NUCLEUS= ^1H
##.ACQUISITION MODE= SIMULTANEOUS (DQD)
##.ACQUISITION SCHEME= undefined
##.AVERAGES= 16
##.DIGITISER RES= 18
##SPECTROMETER/DATA SYSTEM= dpx250
##.PULSE SEQUENCE= zg30
##.SOLVENT NAME= DMF
##.SHIFT REFERENCE= (INTERNAL, DMF, 0, 16.522)
##AUDIT TRAIL= $$ (NUMBER, WHEN, WHO, WHERE, WHAT)
$$ ##TITLE= Audit trail, XWIN-NMR		Version 3.5
$$ ##JCAMPDX= 5.01
$$ ##ORIGIN= Bruker BioSpin GmbH
$$ ##OWNER= nmr
$$ C:\u/data/dgb/nmr/ADRS/1260/pdata/1/auditp.txt
$$ ##AUDIT TRAIL=  $$ (NUMBER, WHEN, WHO, WHERE, WHAT)
(   1,<2007-07-20 09:25:30.42 +100>,<MAYBRIDGE\nmr>,<NMR_250MHZ>,
      <created by zg, POWCHK disabled, PULCHK disabled
       configuration hash MD5:
       76 6E 9A 78 1E 09 19 81 EC 84 63 8F B0 6A 59 2D
       data hash MD5: 64K
       07 D7 DF A0 63 8F 3B 92 24 37 77 18 60 BC 31 09>)
(   2,<2007-07-20 09:25:42.92 +100>,<MAYBRIDGE\nmr>,<NMR_250MHZ>,
      <Start of raw data processing
       ef LB = 0.3 FT_mod = 6 PKNL = 1 SI = 32K 
       data hash MD5: 32K
       04 FE F4 06 16 12 F7 6E 84 DD EA F3 C8 C2 F7 2F>)
(   3,<2007-07-20 09:25:44.78 +100>,<MAYBRIDGE\nmr>,<NMR_250MHZ>,
      <apk 
       data hash MD5: 32K
       70 F3 A0 30 A1 AE 4E 7F F1 FE 28 69 99 62 E8 E3>)
(   4,<2007-07-20 09:25:45.58 +100>,<MAYBRIDGE\nmr>,<NMR_250MHZ>,
      <abs ABSG = 5 
       data hash MD5: 32K
       CE 24 9E 2E 68 E7 62 BC 49 C9 7F CA 2E B8 4D EC>)
$$ ##END=
$$ 
$$ hash MD5
$$ 0C 08 6E 2F AD 23 22 F3 B6 9A 13 EC F3 36 CD 85
##$RELAX= 
##$RELAX= 
##$RELAX= 
##$RELAX= 
##$RELAX= 
##$RELAX= 
##$RELAX= 
$$ Bruker specific parameters
$$ --------------------------
##$DU= <C:\u>
##$EXPNO= 1260
##$NAME= <ADRS>
##$PROCNO= 1
##$TYPE= <nmr>
##$USER= <dgb>
##$AMP= (0..31)
100 100 100 100 100 100 100 100 100 100 100 100 100 100 100 100 100 100 
100 100 100 100 100 100 100 100 100 100 100 100 100 100 
##$AQSEQ= 0
##$AQ_mod= 3
##$AUNM= <au_zg>
##$AUTOPOS= <58 >
##$BF1= 250.13
##$BF2= 250.13
##$BF3= 250.13
##$BF4= 250.13
##$BF5= 500.13
##$BF6= 500.13
##$BF7= 500.13
##$BF8= 500.13
##$BYTORDA= 1
##$CFDGTYP= 0
##$CFRGTYP= 5
##$CHEMSTR= <none>
##$CNST= (0..31)
1 1 145 1 1 1 1 1 1 1 1 1 1 1 1 1 1 1 1 1 1 1 1 1 1 1 1 1 1 1 1 1 
##$CPDPRG= <>
##$CPDPRG1= <>
##$CPDPRG2= <>
##$CPDPRG3= <>
##$CPDPRG4= <mlev>
##$CPDPRG5= <mlev>
##$CPDPRG6= <mlev>
##$CPDPRG7= <mlev>
##$CPDPRG8= <mlev>
##$CPDPRGB= <>
##$CPDPRGT= <>
##$D= (0..31)
0 1 0 0 0 0 0 0 0 0.06 0 0 0 0 0 0 0.0002 0 0 0 0 0 0 0 0 0 0 0 0 0 0 
0 
##$DATE= 1184919929
##$DBL= (0..7)
120 120 120 120 120 120 120 120 
##$DBP= (0..7)
150 150 150 150 150 150 150 150 
##$DBP07= 0
##$DBPNAM0= <>
##$DBPNAM1= <>
$$ [...]
##$SUBNAM7= <"">
##$SUBNAM8= <"">
##$SUBNAM9= <"">
##$SW= 20.6930455092707
##$SWIBOX= (0..15)
0 0 3 0 0 0 0 0 0 0 0 0 0 0 0 0 
##$SW_h= 5175.983436853
##$TD= 65536
##$TD0= 1
##$TE= 297.16
##$TE2= 300
##$TE3= 300
##$TEG= 300
##$TL= (0..7)
0 120 120 120 120 120 120 120 
##$TP= (0..7)
150 150 150 150 150 150 150 150 
##$TP07= 0
##$TPNAME0= <>
##$TPNAME1= <>
##$TPNAME2= <>
##$TPNAME3= <>
##$TPNAME4= <>
##$TPNAME5= <>
##$TPNAME6= <>
##$TPNAME7= <>
##$TPOAL= (0..7)
0.5 0.5 0.5 0.5 0.5 0.5 0.5 0.5 
##$TPOFFS= (0..7)
0 0 0 0 0 0 0 0 
##$TUNHIN= 0
##$TUNHOUT= 0
##$TUNXOUT= 0
##$USERA1= <user>
##$USERA2= <user>
##$USERA3= <user>
##$USERA4= <user>
##$USERA5= <user>
##$V9= 5
##$VALIST= <valist>
##$VCLIST= <CCCCCCCCCCCCCCC>
##$VD= 0
##$VDLIST= <DDDDDDDDDDDDDDD>
##$VPLIST= <PPPPPPPPPPPPPPP>
##$VTLIST= <TTTTTTTTTTTTTTT>
##$WBST= 1024
##$WBSW= 4
##$XGAIN= (0..3)
0 0 0 0 
##$XL= 0
##$YL= 0
##$YMAX_a= 248688
##$YMIN_a= -226340
##$ZGOPTNS= <>
##$ZL1= 120
##$ZL2= 120
##$ZL3= 120
##$ZL4= 120
##$ABSF1= 16.522
##$ABSF2= -4.171173
##$ABSG= 5
##$ABSL= 3
##$ALPHA= 0
##$AQORDER= 0
##$ASSFAC= 0
##$ASSFACI= 0
##$ASSFACX= 0
##$ASSWID= 0
##$AUNMP= <proc_1d>
##$AZFE= 0.1
##$AZFW= 0.1
##$BCFW= 0
##$BC_mod= 0
##$BYTORDP= 0
##$COROFFS= 0
##$CY= 12.5
##$DATMOD= 1
##$DC= 0
##$DFILT= <>
##$DTYPP= 0
##$F1P= 14.0000005364418
##$F2P= -0.99999901652339
##$FCOR= 0.5
##$FTSIZE= 32768
##$FT_mod= 6
##$GAMMA= 0
##$GB= 0
##$INTBC= 1
##$INTSCL= 1
##$ISEN= 128
##$LB= 0.3
##$LEV0= 0
##$LPBIN= 0
##$MAXI= 10000
##$MC2= 0
##$MEAN= 0
##$ME_mod= 0
##$MI= 0
##$NCOEF= 0
##$NC_proc= -4
##$NLEV= 6
##$NOISF1= 0
##$NOISF2= 0
##$NSP= 0
##$NTH_PI= 0
##$NZP= 0
##$OFFSET= 16.522
##$PC= 1
##$PHC0= -72.66505
##$PHC1= 40.59749
##$PH_mod= 1
##$PKNL= yes
##$PPARMOD= 0
##$PSCAL= 4
##$PSIGN= 0
##$REVERSE= no
##$SF= 250.13
##$SI= 32768
##$SIGF1= 0
##$SIGF2= 0
##$SINO= 400
##$SIOLD= 32768
##$SREGLST= <1H.DMF>
##$SSB= 0
##$STSI= 32768
##$STSR= 0
##$SW_p= 5175.98343685301
##$SYMM= 0
##$S_DEV= 0
##$TDeff= 65536
##$TDoff= 0
##$TI= <Analysis number 999999
Compound Code 99
Book Reference 9
Project Code 9>
##$TILT= no
##$TM1= 0
##$TM2= 0
##$TOPLEV= 0
##$USERP1= <user>
##$USERP2= <user>
##$USERP3= <user>
##$USERP4= <user>
##$USERP5= <user>
##$WDW= 1
##$XDIM= 32768
##$YMAX_p= 534706477
##$YMIN_p= -5379152
$$ End of Bruker specific parameters
$$ ---------------------------------
##NTUPLES= NMR SPECTRUM
##VAR_NAME=  FREQUENCY,     SPECTRUM/REAL,   SPECTRUM/IMAG
##SYMBOL=    X,             R,               I
##VAR_TYPE=  INDEPENDENT,   DEPENDENT,       DEPENDENT
##VAR_FORM=  AFFN,          ASDF,            ASDF
##VAR_DIM=   32768,         32768,           32768
##UNITS=     HZ,            ARBITRARY UNITS, ARBITRARY UNITS
##FACTOR=    0.157963299565203, 1,           1
##FIRST=     4132.6476996994, 0,             0
##LAST=      -1043.33573715361, 0,           0
##MIN=       -1043.33573715361, -5379152,    0
##MAX=       4132.6476996994, 534706477,     0
$$ Real data points
##PAGE= N=1
##DATA TABLE= (X++(R..R)), XYDATA
$$ [...]
$$ plain form
16100 -92005 -89640 -44588 -37515 -76692 -71800 -56559 -111659 -90132 -41070 17063 -2242 -63623
16088 -63623 -93311 -132174 -76645 -51179 -49870 -60926 -98348 -104002 -118954 -102891 -95031 -24339
16076 -24339 -10745 -49178 -112443 -134531 -94618 -31819 -22942 -67315 -73546 -16917 -16168 -39959
16064 -39959 -22342 -36813 -81486 -70048 -81485 -77414 -84461 -105086 -106459 -118002 -89312 -91129
16052 -91129 -126817 -131730 -102629 -147150 -189948 -114493 -113951 -104844 -102904 -118621 -97662 -35857 -17841
16039 -17841 5112 -53748 -67390 -47427 -54145 -64815 -15466 40557 48893 51442 8569 -64053
16027 -64053 -67669 -85664 -94436 -54478 -75192 -56711 -59378 -76347 -109484 -52807 -1621 10896
16015 10896 -22834 -1832 13864 -22106 -59330 -99261 -70660 -92654 -54129 -18862 -49394 -41592
$$ packed form
16100i2005K365M5052P073l9177M892J5241n5100K1527M9062N8133j9305o1381
16088f3623k9688l8863N5529K5466J309j1056l7422n654j4952J6063P860P0692
16076b4339J3594l8433o3265k2088L9913O2799Q877m4373o231N6629P49k3791
16064c9959J7617j4471m4673J1438j1437M071p047k0625j373j1543K8690j817
16052i1129l5688m913K9101m4521m2798P5455N42R107J940j5717K0959O1805J8016
16039a7841K2953n8860j3642J9963o718j0670M9349N6023Q336K549m2873p2622
16027f4053l616j7995q772L9958k0714J8481k667j6969l3137N6677N1186J2517
16015A0896l3730K1002J5696l5970l7224l9931K8601k1994L8525L5267l0532P802
$$ plain form
16003 -41592 -37652 -29922 -93632 -196168 -188887 -94615 -142969 -137738 -115757 -81601 -69225 2443
15991 2443 -11086 -19163 -53666 -82965 -66100 -70680 -92017 -43616 -1725 8403 -11384 -5564
15979 -5564 52765 52024 44797 34425 -655 -35786 -55351 -89891 -48520 -37817 -16181 -22973 -81842
15966 -81842 -151031 -164620 -48764 -12053 -4567 -4635 11420 -23608 -86889 -75889 -35062 -46189
15954 -46189 -28285 14044 15882 -33498 -90612 -125271 -145637 -133837 -110383 -121556 -39433 -57694
15942 -57694 -85770 -91810 -67510 -21068 15340 34946 17569 5768 6488 5415 41924 39348 -2162
15929 -2162 38133 17113 -22966 -27925 -82809 -141977 -68849 -81185 -173431 -172030 -106979 -72462
15917 -72462 -114689 -110617 -127839 -69144 -121313 -213951 -263210 -201297 -176609 -124783 -98782 -67462
$$ packed form
16003d1592L940P730o3710j02536P281R4272m8354N231K1981L4156J2376P1668
15991B443j3529q077l4503k9299J6865m580k1337M8401M1891J0128j9787N820
15979e564N8329p41p227j0372l5080l5131j9565l4540M1371J0703K1636o792n8869
15966h1842o9189j3589J15856L6711P486o8J6055l5028o3281J1000M0827j1127
15954d6189J7904M2329J838m9380n7114l4659k0366J1800K3454j1173Q2123j8261
15942e7694k8076o040K4300M6442L6408J9606j7377j1801P20j073L6509k576m1510
15929b162M0295k1020m0079m959n4884n9168P3128j2336r2246J401O5051L4517
15917g2462m2227M072j7222N8695n2169r2638m9259O1913K4688N1826K6001L1320
$$ plain form
15905 -67462 -41743 -35560 -3549 -25983 10393 47153 -12578 -42917 492 67582 18055 -48129
15893 -48129 -69297 -121569 -142611 -159347 -98569 -76752 -121891 -127167 -78507 -74023 -115314 -69681
15881 -69681 -72863 -87141 -64733 -63138 -64460 -50840 -21611 50167 32632 -24957 -27277 -4050
15869 -4050 -17261 18777 31493 2499 17808 52830 12967 -30025 -52540 -65364 -77819 -11069
15857 -11069 -20267 -36684 -10445 17882 -14592 -83947 -102064 -59696 16276 39814 3392 -48471
15845 -48471 -87197 -130396 -84573 4624 -18431 5280 60255 2890 -79890 -114909 -110210 -129772
15833 -129772 -112507 -88709 -101949 -40106 3388 -1445 -47225 -66019 -69039 -98284 -114917 -128490
15821 -128490 -141049 -144640 -126240 -58183 8301 86776 74805 34528 -43293 -81943 -84940 -61322
$$ packed form
15905f7462K5719O183L2011k2434L6376L6760n9731l0339M3409O7090m9527o6184
15893d8129k1168n2272k1042j6736O0778K1817m5139n276M8660M484m1291M5633
15881f9681l182j4278K2408J595j322J3620K9229P1778j7535n7589k320K3227
15869d050j3211L6038J2716k8994J5309L5022l9863m2992k2515j2824j2455O6750
15857a1069r198j6417K6239K8327l2474o9355j8117M2368P5972K3538l6422n1863
15845d8471l8726m3199M5823Q9197k3055K3711N4975n7365q2780l5019M699j9562
15833a29772J7265K3798j3240O1843M3494m833m5780j8794l020k9245j6633j3573
15821a28490j2559l591J8400O8057O6484P8475j1971m0277p7821l8650k997K3618
$$ plain form
15809 -61322 -46014 12364 36232 13464 19129 -28013 -52157 -99146 -139075 -136315 -130373 -92218
15797 -92218 -84228 -163720 -117702 -21645 10953 26764 -61046 -148274 -176984 -142625 -146203 -151582
15785 -151582 -99982 -86604 -107463 -101622 -101137 -64554 -9254 4232 34556 25423 30401 65367
15773 65367 -10078 -74844 -32543 -80398 -131621 -190783 -164144 -91837 -123408 -222515 -211731 -180266
15761 -180266 -131916 -51347 542 55232 -16863 -46810 -42367 -62776 -6846 -25026 -90493 -95180
15749 -95180 -85677 -95557 -88384 -73316 -79959 -64386 -80129 -57146 -68513 -67589 -102240 -121421 -103100
15736 -103100 -56341 -47874 -59344 36946 118331 135352 74765 103140 106735 76904 37261 -2333
15724 -2333 -48581 -83809 -88650 -77907 -107985 -186703 -208438 -173501 -148462 -96478 -101152 -105399
$$ packed form
15809f1322J5308N8378K3868k2768N665m7142k4144m6989l9929K760N942L8155
15797i2218P990p9492M6018R6057L2598J5811q7810q7228k8710L4359l578n379
15785a51582N1600J3378k0859N841M85L6583N5300J3486L0324r133M978L4966
15773F5367p5445o4766M2301m7855n1223n9162K6639P2307l1571r9107J0784L1465
15761a80266M8350Q0569N1889N4690p2095k9947M443k0409N5930j8180o5467m687
15749i5180R503r880P173J5068o643J5573j5743K2983j1367R24l4651j9181J8321
15736a03100M6759Q467j1470R6290Q1385J7021o0587K8375L595k9831l9643l9594
15724b333m6248l5228m841J0743l0078p8718k1735L4937K5039N1984m674m247
$$ plain form
15712 -105399 -125744 -161297 -152605 -114555 -104957 -136087 -89532 -87071 -147296 -139337 -128634 -75991
15700 -75991 -32077 8690 -11956 -2898 -11381 11244 35932 -9099 -112288 -85462 -100531 -168445
15688 -168445 -123707 -64822 -82194 -154925 -137134 -108349 -59688 -96269 -137256 -89252 -56692
15677 -56692 -47936 -37242 -32033 -54805 -91244 -133450 -141398 -70237 -29053 -60844 -74946 -25751
15665 -25751 369 -1876 62083 -47760 -92672 12468 38535 58552 71663 81523 137511 156826
15653 156826 86368 -47166 -106330 -97118 -100422 -92571 -91501 -120224 -118675 -90800 -31541 856
15641 856 22118 24205 1045 -69312 -88186 -75976 -27408 23878 47748 77906 14949 -39798
15629 -39798 -49802 -71177 -12080 68021 127910 153335 117259 88848 -609 -25799 -57295 -43177
$$ packed form
15712a05399k0345l5553Q692L8050R598l1130M6555K461o0225P959J0703N2643
15700g5991M3914M0767k0646R058q483K2625K4688m5031j03189K6826j5069o7914
15688a68445M4738N8885j7372p2731J7791K8785M8661l6581m0987M8004L2560
15677e6692Q756J0694N209k2772l6439m2206p948P1161M1184l1791j4102M9195
15665b5751K6120k245O3959j09843m4912J05140K6067K0017J3111R860N5988J9315
15653A56826p0458j33534n9164R212l304P851J070k8723J549K7875N9259L2397
15641H56K1262K087k3160p0357j8874J2210M8568N1286K3870L0158o2957n4747
15629c9798j0004k1375N9097Q0101N9889K5425l6076k8411q9457k5190l1496J4118
$$ plain form
15617 -43177 -54931 -65845 -60973 -18436 -46454 -70142 -49637 8227 88125 51245 18961 -16371
15605 -16371 -35286 -20157 -22530 -38131 -36628 24555 -10326 -28498 -77596 -75565 -83654 -89084 -91335
15592 -91335 -96853 -61174 -54752 -142701 -149258 -80752 -107517 -159596 -139768 -109757 -116728 -112892 -89138
15579 -89138 -88598 -103881 -48061 -53261 -61567 -81987 -66403 -81100 -59654 26770 52274 59077 19737
15566 19737 33633 37002 34338 -1409 -15487 -53168 -81369 -93453 -67495 -85812 -100350 -80832
15554 -80832 -46129 -82435 -86387 -83649 -118427 -161532 -127196 -112723 -81383 -37456 34188 -8497
15542 -8497 -79466 -115315 -184255 -131136 -53700 -32464 -12176 -27984 -50681 -72506 -41290 -15876
15530 -15876 -66911 -50792 -59097 -46219 -6528 -3443 -3162 36937 -40331 -79802 -94877 -75387
$$ packed form
15617d3177j1754j0914M872M2537k8018k3688K0505N7864P9898l6880l2284l5332
15605a6371j8915J5129k373j5601J503O1183l4881j8172m9098K031q089n430k251
15592i1335n518L5679O422q7949o557O8506k6765n2079J9828L0011o971L836K3754
15579h9138N40j5283N5820n200q306k0420J5584j4697K1446Q6424K5504O803l9340
15566A9737J3896L369k664l5747j4078l7681k8201j2084K5958j8317j4538J9518
15554h0832L4703l6306l952K738l4778m3105L4336J4473L1340M3927P1644m2685
15542h497p0969l5849o8940N3119P7436K1236K0288j5808k2697k1825L1216K5414
15530a5876n1035J6119q305J2878L9691L085K81M0099p7268l9471j5075J9490
$$ plain form
15518 -75387 -48805 -38325 -27389 -39355 -62478 -73946 -12462 34748 -6717 5982 -101980
15507 -101980 -173559 -143284 -67869 -34071 -16307 3783 6186 5050 -32535 -77343 -84005 -148643
15495 -148643 -165311 -192529 -173559 -104081 -65550 -6889 -40388 -88133 -144479 -187543 -167976
15484 -167976 -111949 -18252 -63330 -84461 -28050 -13042 35686 45539 -114014 -114375 -94964 -64260
15472 -64260 -75815 -72546 -65211 -30990 -81271 -163272 -131606 -117687 -107618 -66468 9062 22567
15460 22567 -20042 -77939 -62723 -76247 -84070 -85051 -121021 -94740 -14595 42088 -36244 -65041
15448 -65041 -16164 -16752 4988 2598 -22777 -40239 -101198 -173800 -124877 -124088 -193174 -140253 -51652
15435 -51652 -54345 -30360 3640 -51976 -39672 -27338 -65122 -87538 -84067 -69908 -107761 -151162
$$ packed form
15518g5387K6582J0480J0936j1966k3123j1468O1484M7210m1465J2699j07962
15507a01980p1579L0275P5415L3798J7764K0090K403j136l7585m4808o662o4638
15495a48643j6668k7218J8970O9478L8531N8661l3499m7745n6346m3064J9567
15484a67976N6027R3697m5078k1131N6411J5008M8728R853j59553l61J9411L0704
15472f4260j1555L269P335L4221n0281q2001L1666J3919J0069M1150P5530J3505
15460B2567m2609n7897J5216j3524p823r81l5970K6281Q0145N6683p8332k8797
15448f5041M8877n88K1740k390k5375j7462o0959p2602M8923P89o9086N2921Q8601
15435e1652k693K3985L4000n5616J2304J2334l7784k2416L471J4159l7853m3401
$$ plain form
15423 -151162 -96738 -110555 -129581 -115542 -84505 -92573 -130114 -126578 -146176 -137572 -169064 -183725
15411 -183725 -169974 -145473 -107932 -151436 -208964 -221157 -173251 -146351 -90973 -30357 2365
15400 2365 8092 -12293 -37552 -91261 -78862 -33170 -1836 -27301 -81653 -158381 -184758 -116849
15388 -116849 -72211 -59834 -73047 -51739 8552 10053 -34234 -73919 -76058 -86389 -123371 -129814
15376 -129814 -66390 -104898 -163440 -137259 -133319 -106890 -127870 -144416 -98412 -36425 902 32312
15364 32312 33353 32532 -88703 -111731 -153972 -294695 -287153 -209261 -143471 -84054 -102223 -113918
15352 -113918 -91864 -65645 -69905 -9765 -930 -72880 -123913 -120991 -175991 -125506 -80104 -29959
15340 -29959 -54105 -37363 39102 99299 88105 -14853 -75534 -16569 -45341 -88123 -65495
$$ packed form
15423a51162N4424j3817j9026J4039L1037q068l7541L536j9598Q604l1492j4661
15411a83725J3751K4501L7541m3504n7528j2193M7906K6900N5378O0616L2722
15400B365N727k0385k5259n3709J2399M5692L1334k5465n4352p6728k6377O7909
15388a16849M4638J2377j3213K1308O0291J501m4287l9685k139j0331l6982o443
15376a29814O3424l8508n8542K6181L940K6429k0980j6546M6004O1987L7327L1410
15364C2312J041q21j21235k3028m2241j40723P542P7892O5790N9417j8169j1695
15352a13918K2054K6219m260O0140Q835p1950n1033K922n5000N0485M5402N0145
15340b9959k4146J6742P6465O0197j1194j02958o0681N8965k8772m2782K2628
$$ plain form
15329 -65495 -59978 -122312 -118061 -88099 -50198 -76084 -7666 56014 20151 15560 54879 21443
15317 21443 -4544 75335 101568 97893 97107 -9556 -55520 -42421 -42980 -59184 -30561 -42192
15305 -42192 -57151 -48113 -35992 -64653 -139767 -143113 -87002 -69345 -88200 -67218 -78002 -97268
15293 -97268 -112845 -96528 -9836 -2370 -83577 -150894 -173718 -167342 -135573 -91799 -90301 -78297
15281 -78297 -37816 -69524 -86437 -45230 -56206 -79330 -24601 -32632 -2286 -18405 -21640 -51004
15269 -51004 -25598 -86104 -106032 -140302 -144151 -109409 -93436 -71411 -47445 958 -3080 -25564
15257 -25564 -21987 14365 3540 -24043 -13835 -47075 -77341 -26582 -53186 -117525 -100922 -77144
15245 -77144 -37518 -55279 -32086 -1806 -16232 -60448 -74653 -11181 32790 -9459 -76199 -119793
$$ packed form
15329f5495N517o2334M251K9962L7901k5886O8418O3680l5863m591L9319l3436
15317B1443k5987P9879K6233l675p86j06663m5964J3099n59j6204K8623j1631
15305d2192j4959R038J2121k8661p5114l346N6111J7657j8855K0982j0784j9266
15293i7268j5577J6317Q6692P466q1207o7317k2824O376L1769M3774J498J2004
15281g8297M0481l1708j6913M1207j0976k3124N4729q031L0346j6119l235k9364
15269e1004K5406o0506j9928l4270l849L4742J5973K2025K3966M8403m038k2484
15257b5564L577L6352j0825k7583J0208l3240l0266N0759k6604o4339J6603K3778
15245g7144L9626j7761K3193L0280j4426m4216j4205O3472M3971m2249o6740m3594
$$ plain form
15233 -119793 -101328 -91733 -99980 -115478 -131632 -78963 -127503 -161420 -141918 -199572 -277624 -255208
15221 -255208 -186653 -199106 -174664 -73265 -57703 -9389 2267 154 -71703 -170298 -165251 -95107
15209 -95107 -81458 -16574 -25457 -56994 -71667 -100183 -110307 -92094 -71141 -85630 -27824 -67663
15197 -67663 -54680 -73975 -101419 -131338 -83631 -68755 -103821 -66024 -66263 -90283 -84198 -57828
15185 -57828 -24260 -20327 -12620 -36395 -45975 -40169 -27070 -63496 -113406 -109128 -107470 -153820 -154451
15172 -154451 -78012 -14602 -51900 -105967 -169130 -165246 -105311 -59494 -40559 -26013 -61178 -57022
15160 -57022 -61575 -109518 -113644 -91644 -158384 -142200 -117373 -82788 -62602 -23470 -1803 -36334
15148 -36334 -99031 -145328 -143289 -94495 -104901 -96035 -78852 -120497 -148797 -64837 -39123 -54845
$$ packed form
15233a19793J8465R595q247j5498j6154N2669m8540l3917J9502n7654p8052K2416
15221b55208O8555j2453K4442J01399J5562M8314J1656k113p1857r8595N047P0144
15209i5107J3649O4884q883l1537j4673k8516j0124J8213K0953j4489N7806l9839
15197f7663J2983j9295k7444k9919M7707J4876l5066L7797k39k4020O085K6370
15185e7828L3568L933P707k3775r580N806J3099l6426m9910M278J658m6350o31
15172a54451P6439O3410l7298n4067o3163L884N9935M5817J8935J4546l5165M156
15160e7022m553m7943m126K2000o6740J6184K4827L4585K0186L9132K1667l4531
15148c6334o2697m6297K039M8794j0406Q866J7183m1645k8300Q3960K5714j5722
$$ plain form
15136 -54845 -77453 -110997 -117430 -147220 -182527 -134084 -117045 -155537 -165877 -95874 -42812 5567
15124 5567 -49265 -150735 -139990 -109323 -92221 -91995 -128149 -179287 -174175 -80917 -65722 -74862
15112 -74862 -117867 -151880 -136162 -106193 -79733 -139168 -214273 -153423 -114904 -124197 -174989 -156299
15100 -156299 -71318 -145676 -113423 -65366 -69440 -102924 -137769 -181341 -180145 -93581 -24377 -64060
15088 -64060 -49951 -88640 -72963 -63717 -72176 -122976 -175681 -168892 -134469 -134931 -147650 -87907 -92190
15075 -92190 -101851 -41462 -69678 -102769 -139591 -180207 -154271 -153916 -136876 -121108 -95038 -12167
15063 -12167 9100 -9199 10011 -20989 -39123 -56599 -46146 -29218 -65650 -106330 -119479 -130765
15051 -130765 -179957 -168385 -52309 -24266 -53312 -126540 -145080 -111684 -94317 -59784 -34522
$$ packed form
15136e4845k2608l3544o433k9790l5307M8443J7039l8492j0340P0003N3062M8379
15124E567n4832j01470J0745L0667J7102K26l6154n1138N112R3258J5195r140
15112g4862m3005l4013J5718K9969K6460n9435p5105O0850L8519r293n0792J8690
15100a56299Q4981p4358L2253M8057m074l3484l4845m3572J196Q6564O9204l9683
15088f4060J4109l8689J5677R246q459n0800n2705O789L4423m62j2719N9743m283
15075i2190r661O0389k8216l3091l6822m0616K5936L55J7040J5768K6070Q2871
15063a2167K1267j8299J9210l1000j8134j7476J0453J6928l6432m0680j3149j1286
15051a30765m9192J1572J16076K8043k9046p3228j8540L3396J7367L4533K5262
$$ plain form
15040 -34522 -30119 -120089 -189058 -136961 -99185 -129378 -65944 -83066 -79917 -21304 -6097 -64927
15028 -64927 -95410 -20926 15379 647 -78763 -132826 -93800 -33292 -1263 -19014 -85314 -134833
15016 -134833 -216382 -219183 -199141 -151986 -86551 -46712 -27201 -65384 -36795 -67157 -93366 -143409
15004 -143409 -230687 -187049 -94231 -74179 -86989 -46000 -89318 -112292 -131063 -136028 -144317 -113637
14992 -113637 -73989 -92129 -47820 -86118 -121748 -62511 79720 -2369 -120061 -150762 -150610
14981 -150610 -108140 -118325 -66961 -27485 -5027 -10999 -64623 -74883 -94075 -106908 -109564 -138433
14969 -138433 -149790 -134557 -178127 -172636 -117263 -64587 -84580 -113223 -107271 -41966 -33905 -40122
14957 -40122 -77874 -117770 -67673 5421 15491 -934 -13001 -28701 -88060 -131585 -144354 -140401
$$ packed form
15040c4522M403q9970o8969N2097L7776l0193O3434j7122L149N8613J5207n8830
15028f4927l0483P4484L6305j4732p9410n4063L9026O0508L2029j7751o6300m9519
15016a34833q1549k801K0042M7155O5435L9839J9511l8183K8589l0362k6209n0043
15004a43409q7278M3638R2818K0052j2810M0989m3318k2974j8771m965q289L0680
14992a13637L9648j8140M4309l8298l5630N9237J42231q2089j17692l0701J52
14981a50610M2470j0185N1364L9476K2458n972n3624j0260j9192j2833k656k8869
14969a38433j1357J5233m3570N491N5373N2676j9993k8643N952O5305Q061o217
14957d0122l7752l9896N0097P3094J0070j6425j2067j5700n9359m3525j2769L953
$$ plain form
14945 -140401 -113897 -148236 -103140 -15796 5885 -37502 -69491 -101077 -86628 -114136 -162213
14934 -162213 -172756 -73004 -62793 -63740 -77898 -46587 -57993 -68114 -96990 -112702 -95766 -32827
14922 -32827 12088 26949 39889 26248 19511 -19110 -53000 -75411 -96248 -75435 -119441 -164977
14910 -164977 -62568 -1451 40988 11190 -58140 -60843 -27128 -44456 -110432 -112444 -128701 -136409
14898 -136409 -132495 -85780 33566 36773 20407 16494 -37504 -31476 7835 -210 4225 -50448
14886 -50448 -68054 -52164 -26109 -7981 -4973 72644 80742 64586 -5603 -106641 -112178 -79779
14874 -79779 -77313 -95773 -60853 -51963 -79355 -119700 -51951 13253 -57672 -35241 -7996 -41627
14862 -41627 -54350 -119989 -192589 -120070 -98978 -70599 -36041 -64695 -69081 -93272 -32632 -15237
$$ packed form
14945a40401K6504l4339M5096Q7344K1681m3387l1989l1586J4449k7508m8077
14934a62213j0543R9752J0211r47j4158L1311j1406j0121k8876j5712J6936O2939
14922c2827M4915J4861J2940j3641o737l8621l3890k2411k0837K0813m4006m5536
14910a64977J02409O1117M2439k9798o9330k703L3715j7328o5976k012j6257p708
14898a36409L914M6715J19346L207j6366l913n3998O028L9311q045M435n4673
14886e0448j7606J5890K6055J8128L008P7617Q098j6156p0189j01038n537L2399
14874g9779K466j8460L4920Q890k7392m0345O7749O5204p0925K2431K7245l3631
14862d1627j2723o5639p2600P2519K1092K8379L4558k8654m386k4191O0640J7395
$$ plain form
14850 -15237 -6797 -80680 -135262 -129553 -123653 -123218 -58897 14306 -3648 53823 121335 142337 65574
14837 65574 82823 87988 -11296 -7780 2376 1355 11070 -27520 -59930 -9456 51520 82681
14825 82681 40811 2179 597 30409 61696 5948 -15866 -39147 -77865 -85594 -72089 -62912
14813 -62912 -68654 -58531 2264 30103 28354 65098 39089 -2168 -34403 -53393 -113895 -68500
14801 -68500 -82531 -78647 -55983 -12653 -7348 -30552 -20328 -32127 -2410 -9392 -7272 -54450
14789 -54450 -73465 -58553 -87697 -75582 -87647 -85982 -63349 -52872 2577 11334 -1619 -2036
14777 -2036 -3951 -67753 -95001 -102365 -116457 -174638 -225046 -115391 -112185 -124913 -79472 -77674
14765 -77674 -163320 -198079 -195538 -136529 -81550 3190 -21456 -57898 -53993 74834 127147 114283
$$ packed form
14850a5237Q440p3883n4582N709N900M35O4321P3203j7954N7471O7512K1002p6763
14837F5574J7249N165r9284L516J0156j021R715l8590l2410N0474O0976L1161
14825H2681m1870l8632j582K9812L1287n5748k1814k3281l8718p729J3505R177
14813f2912n742J0123O0795K7839j749L6744k6009m1257l2235j8990o0502M5395
14801f8500j4031L884K2664M3330N305k3204J0224j1799K9717o982K120m7178
14789e4450j9015J4912k9144J2115j2065J665K2633J0477N5449Q757j2953m17
14777b036j915o3802k7248p364j4092n8181n0408J09655L206j2728M5441J798
14765g7674q5646l4759K541N9009N4979Q4740k4646l6442L905J28827N2313j2864
$$ plain form
14753 114283 94750 41115 31147 -15868 -20430 -88099 -138119 -189304 -215650 -134507 -55506 -65780
14741 -65780 -50358 -12814 -62953 -35158 76441 87565 -74292 -99717 -90942 -100343 -94759 -101880
14729 -101880 -103694 -107264 -51018 39699 78280 51836 14077 -25304 -95597 -116478 -33301 -10335
14717 -10335 -24663 8092 89533 82985 60508 57357 45988 6824 -37501 -63275 -26296 -22071
14705 -22071 14825 42610 88401 -4250 -27739 -58063 -67713 -24957 -34907 -87016 -128770 -132627
14693 -132627 -80562 -81343 -63091 1087 59517 22656 -1171 37827 18054 -70633 -105971 -50716
14681 -50716 -79340 -54488 -59122 -26902 -8447 -65038 -61459 -8915 3654 -43025 -46325 -11878
14669 -11878 56998 64408 -4373 -43298 -41821 -41706 -41274 -58640 -101073 -82011 -96268 -104088 -112727
$$ packed form
14753A14283j9533n3635r968m7015m562o7669n0020n1185k6346Q1143P9001j0274
14741f5780J5422L7544n0139K7795J11599J1124j61857k5425Q775r401N584p121
14729a01880j814l570N6246R0717L8581k6444l7759l9381p0293k0881Q3177K2966
14717a0335j4328L2755Q1441o548k2477l151j1369l9164m4325k5774L6979M225
14705b2071L6896K7785M5791r2651k3489l0324r650M2756r950n2109m1754l857
14693a32627N2065p81J8252O4178N8430l6861k3827L8998j9773q8687l5338N5255
14681e0716k8624K4852m634L2220J8455n6591L579N2544J2569m6679l300L4447
14669a1878O8876P410o8781l8925J477J15M32j7366m2433J9062j4257p820q639
$$ plain form
14656 -112727 -97835 -105989 -55876 -47128 -107029 -68320 -103837 -137250 -96402 -81915 -101954 -130434
14644 -130434 -85870 -48074 -61475 -146531 -177768 -115772 -15017 -19829 -47723 -19925 -21483 -42679
14632 -42679 -28856 -15202 -47782 -23738 -50341 -73258 -101620 -109432 -77766 -46181 -63493 -17402
14620 -17402 -7357 -20135 -21503 -58617 -144917 -121950 -57056 -6371 -41424 -31710 -52183 -23172
14608 -23172 -51945 -61923 -30476 -53010 -49874 -31348 -65817 -80402 -74250 -63831 -20319 -52962
14596 -52962 -67733 -87463 -123455 -149869 -109670 -106345 -121628 -34427 -41898 -48626 -89660 -18171
14584 -18171 44905 77618 65669 86849 98102 55403 -16442 -51837 -68587 -81880 -84005 -76584
14572 -76584 -57924 -52789 -27395 -22706 1669 49070 88461 83109 72411 33550 -62706 -59648
$$ packed form
14656a12727J4892q154N0113Q748n9901L8709l5517l3413M0848J4487k0039k8480
14644a30434M4564L7796j3401q5056l1237O1996J00755m812k7894K7798j558k1196
14632d2679J3823J3654l2580K4044k6603k2917k8362p812L1666L1585j7312M6091
14620a7402J0045j2778j368l7114q6300K2967O4894N0685l5053R714k0473K9011
14608b3172k8773r978L1447k2534L136J8526l4469j4585O152J0419M3512l2643
14596e2962j4771j9730l5992k6414M0199L325j5283Q7201p471o728m1034P1489
14584a8171O3076L2713j1949K1180J1253m2699p1845l5395j6750j3293k125P421
14572g6584J8660N135K5394M689K4375M7401L9391n352j0698l8861r6256L058
$$ plain form
14560 -59648 -30397 -59394 -54594 -64145 -77486 -37597 21953 71028 45962 -10141 18350 41849
14548 41849 62915 50025 60770 32532 -78670 -101761 -30230 -8235 -20909 12199 -19732
14537 -19732 -27559 -52151 -44543 -58407 -15798 -18214 -15875 20756 694 -44663 -69360 -131848
14525 -131848 -99553 -84810 -105667 -9587 16409 -29961 35514 50 -21794 18211 39705
14514 39705 13937 -47303 -38863 15203 49206 54911 7727 27557 12141 -13778 -480 6352
14502 6352 -14831 -52996 -61489 -2813 23859 51454 74904 51295 75807 64780 -14929 -65918
14490 -65918 -111507 -128420 -13746 13134 17743 37139 55286 89735 88468 100869 86799 37907
14478 37907 -23757 -52869 -45455 -56986 -66199 -22480 -2587 28127 -17350 -58934 -80433 -136070
$$ packed form
14560e9648K9251k8997M800r551j3341L9889N9550M9075k5066n6103K8491K3499
14548D1849K1066j2890J0745k8238j11202k3091P1531K1995j2674L3108l1931
14537a9732p827k4592P608j3864M2609k416K339L6631k0062m5357k4697o2488
14525a31848L2295J4743k0857R6080K5996m6370O5475l5464k1844M0005K1494
14514C9705k5768o1240Q440N4066L4003N705m7184J9830j5416k5919J3298O832
14502F352k1183l8165q493N8676K6672K7595K3450k3609K4512j1027p9709n0989
14490f5918m5589j6913J14674K6880M609J9396J8147L4449j267J2401j4070m8892
14478C7907o1664k9112P414j1531r213M3719J9893L0714m5477m1584k1499n5637
$$ plain form
14466 -136070 -135151 -73266 -75265 -24579 36817 24549 -92781 -85152 -52285 -53887 -66329 -111633
14454 -111633 -72088 -33027 -45294 -123914 -148618 -117985 -85909 -95871 -110921 -113134 -29136 -47518
14442 -47518 -107583 -132737 -183832 -188799 -133647 -173609 -126566 -52393 1706 22322 45529 51037
14430 51037 60046 80196 14281 32929 79634 -1428 -36272 -78281 -120561 -22448 57677 70894
14418 70894 50672 4872 -60666 -13422 -17302 -79 -26071 -33434 33043 97105 58091 15734
14406 15734 17574 26648 -161 -53010 -56938 -38794 -11473 -3341 7610 26483 53374 73719
14394 73719 26486 -24536 -28822 -36605 -17416 -66447 -140684 -166113 -161809 -152796 -117322 -143380
14382 -143380 -155727 -158878 -143726 -131853 -38658 -11133 -29236 -33408 -25190 -39288 -93648 -107799
$$ packed form
14466a36070R19O1885j999N0686O1396j2268j17330P629L2867j602j2442m5304
14454a11633L9545L9061j2267p8620k4704L0633L2076r962j5050k213Q3998j8382
14442d7518o0065k5154n1095m967N5152l9962M7043P4173N4099K0616K3207N508
14430E1037R009K0150o5915J8648M6705q1062l4844m2009m2280R8113Q0125J3217
14418G0894k0222m5800o5538M7244l880J7223k5992p363O6477O4062l9014m2357
14406A5734J840R074k6809n2849l928J8144K7321Q132J0951J8873K6891K0345
14394G3719m7233n1022m286p783J9189m9031p4237k5429M304R013L5474k6058
14382a43380j2347l151J5152J1873R3195K7525j8103m172Q218j4098n4360j4151
$$ plain form
14370 -107799 -79087 -36774 -23092 59790 88204 62886 27163 46796 48135 45541 -23295 -16541
14358 -16541 -23255 -56955 -67016 -79086 -76850 -77970 -12347 53021 5357 -64230 -58921 -4857
14346 -4857 63913 39507 7254 -47259 -68104 -37166 10530 26286 15340 6036 -1511 -39445
14334 -39445 -44227 -62763 -35483 -20325 -66005 -77903 -94150 -116992 -70140 -48260 -58439 18433
14322 18433 -8666 -63296 -21160 92668 84724 26208 59763 28419 38471 68105 98935 135309
14310 135309 160454 120596 723 22870 91728 58493 2835 4707 38394 11741 -44968
14299 -44968 -47027 -24482 8854 11868 -45572 -53621 -46631 1188 -2566 -45046 -48498 -18114 -38273
14286 -38273 -79159 -91461 -41378 13357 7758 19633 -5662 -24665 23937 33628 -30804 -482
$$ packed form
14370a07799K8712M2313J3682Q2882K8414k5318l5723J9633J339k594o8836O754
14358a6541o714l3700j0061j2070K236j120O5623O5368m7664o9587N309N4064
14346d857O8770k4406l2253n4513k0845L0938M7696J5756j0946r304p547l7934
14334c9445m782j8536K7280J5158m5680j1898j6247k2842M6852K1880j0179P6872
14322A8433k7099n4630M2136J13828p944n8516L3555l1344J0052K9634L0830L6374
14310A35309K5145l9858j19873K2147O8858l3235n5658J872L3687k6653n6709
14299d4968k059K2545L3336L014n7440q049O990M7819l754m2480l452L0384k0159
14286c8273m0886j2302N0083N4735n599J1875k5295j9003M8602R691o4432L0322
$$ plain form
14274 -482 20031 -8493 -41831 -36078 -23215 -38070 -84412 -104469 -114395 -98250 -75402 -23254
14262 -23254 7763 -20358 21860 -19634 -36952 -18425 34037 47474 53464 44335 40871 44201
14250 44201 25578 24741 34713 -597 -20981 -4740 12495 -25120 -45182 14469 -35024 -50631
14238 -50631 1466 9026 -17104 -71550 -113054 -121004 -126704 -116669 -97072 -76453 -56278 -29209
14226 -29209 -15950 23623 45286 8939 -21441 -80985 -74219 -44908 -19478 4142 -31767 -14709
14214 -14709 -2594 14788 13898 46396 -10266 -58065 -41475 -14900 55134 97581 163422 228926
14202 228926 180305 146200 148798 137643 118349 104925 50739 -468 65285 119644 184545 212780
14190 212780 97172 46344 26744 -3782 -6187 13692 -58470 -104490 -87240 -66971 -106701
$$ packed form
14274d82K0513k8524l3338N753J2863j4855m6342k0057r926J6145K2848N2148
14262b3254L1017k8121M2218m1494j7318J8527N2462J3437N990r129l464L330
14250D4201j8623q37R972l5310k0384J6241J7235l7615k0062N9651m9493j5607
14238e0631N2097P560k6130n4446m1504p950n700J0035J9597K0619K0175K7069
14226b9209J3259L9573K1663l6347l0380n9544O766K9311K5430K3620l5909J7058
14214a4709J2115J7382q90L2498n6662m7799J6590K6575P0034M2447O5841O5504
14202B28926m8621l4105K598j1155j9294j3424n4186n1207O5753N4359O4901K8235
14190B12780j15608n0828j9600l0526k405J9879p2162m6020J7250K0269l9730
$$ plain form
14179 -106701 -158063 -159985 -140800 -142516 -122571 -52707 54005 49850 38890 72677 88962 -4963
14167 -4963 -32440 -27465 -45142 -35266 22871 -5688 -64739 -68654 -26713 -57195 -62188 -28357 -25279
14154 -25279 -53839 -61899 -34446 -21783 22627 79744 77616 85577 77111 6585 -38329 21717
14142 21717 47982 79260 20019 2335 -19556 -19844 -44244 -44885 -11456 -26056 -52135 -69772
14130 -69772 -19212 4654 45467 -11089 -20762 78653 92658 60132 64956 73407 50762 3604
14118 3604 -53565 -56256 -2740 81911 -6993 -59337 -87527 -89611 21757 75466 10154 26655
14106 26655 37991 19735 127405 128551 138360 31079 11093 93166 168723 132300 45068 -53721
14094 -53721 -58687 -39430 -18701 9665 56694 38887 -58553 -40594 -44540 -52544 -15186 -17258
$$ packed form
14179a06701n1362j922J9185j716J9945O9864J06712m155j0960L3787J6285r3925
14167d963k7477M975j7677R876N8137k8559n9051l915M1941l0482m993L3831L078
14154b5279k8560q060K7453J2663M4410N7117k128P961q466p0526m4914O0046
14142B1717K6265L1278n9241j7684k1891k88k4400o41L3429j4600k6079j7637
14130f9772N0560K3866M0813n6556r673R9415J4005l2526M824Q451k2645m7158
14118C604n7169k691N3516Q4651q8904n2344k8190k084J11368N3709o5312J6501
14106B6655J1336j8256J07670J146R809j07281j9986Q2073P5557l6423q7232r8789
14094e3721m966J9257K0729K8366M7029j7807r7440J7959l946q004L7358k072
$$ plain form
14082 -17258 -5020 18884 57704 49143 57256 2062 -60596 -50531 44200 146702 74749 31522
14070 31522 13463 19117 31000 -34374 -92483 -69172 -60098 -133155 -113179 -1034 26098 29286
14058 29286 -10445 5098 45042 -22554 -51309 -13939 -8332 -39349 -43804 30000 60617 8498
14046 8498 -67792 -35024 6222 16268 9946 -99035 -175920 -167418 -116833 -21067 27171 -32332
14034 -32332 -95143 -74870 -30911 -12929 -33470 -41884 -14667 23997 -28916 1084 64034 111470
14022 111470 98267 67149 33665 5895 -29806 43258 18328 -3020 115404 132914 58681
14011 58681 6091 -21651 -14452 22517 13081 36885 62672 91112 84658 68004 54927 25355
13999 25355 48133 57119 61168 33870 13532 32926 32634 -21289 -12108 -7058 -68589 -167191 -173406
$$ packed form
14082a7258J2238K3904L8820q561Q113n5194o2658J0065R4731J02502p1953m3227
14070C1522j8059N654J1883o5374n8109K3311R074p3057J9976J12145K7132L188
14058B9286l9731J5543L9944o7596k8755L7370N607l1017m455P3804L0617n2119
14046H498p6290L2768M1246J0046o322j08981p6885Q502N0585R5766M8238n9503
14034c2332o2811K0273M3959J7982k0541q414K7217L8664n2913L0000O2950M7436
14022A11470j3203l1118l3484k7770l5701P3064k4930k1348J18424J7510p4233
14011E8681n2590k7742P199L6969r436K3804K5787K8440o454j6654j3077k9572
13999B5355K2778Q986M049k7298k0338J9394k92n3923R181N050o1531r8602o215
$$ plain form
13986 -173406 -101048 -99783 -59681 -22234 5960 -23025 -45312 -49916 -89503 -15289 16776 23643
13974 23643 -531 8143 62608 36539 13673 32809 36389 -2318 -44794 -21693 40602 49710
13962 49710 7645 25385 6242 -21000 5743 -53931 -9631 37229 47786 55215 -24752 -79105
13950 -79105 -48005 -51963 -11688 58660 60249 -24891 -22146 3649 -22224 -6403 -53895 -40651
13938 -40651 -25971 -35361 -83868 -45296 24534 12257 47335 34176 41466 71413 43976 -20999
13926 -20999 -78230 -10530 2127 54202 59772 39959 27403 22812 -61230 -117024 -65083 -37635
13914 -37635 43225 -46959 -113637 -101752 -47993 -51151 -74172 -58397 -44356 -29595 -21028 38497
13902 38497 -10005 -40465 -55162 -50511 -40253 -36033 83531 141189 110421 53551 64010 58431
$$ packed form
13986a73406P2358J265M0102L7447K8194k8985k2287m604l9587P4214L2065O867
13974B3643k4174Q674N4465k6069k2866J9136L580l8707m2476K3101O2295R108
13962D9710m2065J7740j9143k7242K6743n9674M4300M6860J0557P429p9967n4353
13950g9105L1100l958M0275P0348J589q5140K745K5795k5873J5821m7492J3244
13938d0651J4680r390m8507L8572O9830j2277L5078j3159P290K9947k7437o4975
13926b0999n7231O7700J2657N2075N570j9813j2556m591q4042n5794N1941K7448
13914c7635Q0860r0184o6678J1885N3759l158k3021J5775J4041J4761Q567N9525
13902C8497m8502l0460j4697M651J0258M220J19564N7658l0768n6870J0459n579
$$ plain form
13890 58431 -54621 -60579 -29698 12317 43100 13700 -10911 22704 29766 7505 49922 155333
13878 155333 203243 198617 151993 156659 102151 63948 -6079 -5179 9359 30762 -9002 -18743
13866 -18743 9366 -43536 -62590 -10874 18669 29464 64875 81749 82879 12307 -64248 -87292
13854 -87292 -115278 -96734 -10881 8679 -29788 -58775 -44649 -73630 -40772 -69715 -59384 24903
13842 24903 74109 82241 82623 99390 88274 116488 130229 61990 25135 940 -75269 -103871
13830 -103871 -26588 3438 -9462 -1022 -16886 35604 25445 26626 -30057 -9398 -30662 -31640
13818 -31640 1493 -83386 -109076 -47686 -24746 -8489 25606 -665 17558 30316 -20826 -10496
13806 -10496 93064 138191 85578 69125 81194 113788 100689 81843 97568 68638 1324
$$ packed form
13890E8431j13052n958L0881M2015L0783k9400k4611L3615P062k2261M2417J05411
13878A55333M7910m626m6624M666n4508l8203p0027R00J4538K1403l9764r741
13866a8743K8109n2902j9054N1716K9543J0795L5411J6874J130p0572p6555k3044
13854h7292k7986J8544Q5853J9560l8467k8987J4126k8981L2858k8943J0331Q4287
13842B4903M9206Q132L82J6767j1116K8214J3741o8239l6855k4195p6209k8602
13830a03871P7283L0026j2900Q440j5864N2490j0159J181n6683K0659k1264r78
13818c1640L3133q4879k5690O1390K2940J6257L4095k6271J8223J2758n1142J0330
13806a0496J03560M5127n2613j6453J2069L2594j3099j8846J5725k8930o7314
$$ plain form
13795 1324 41912 154584 204146 132839 95345 77206 134716 161526 102503 86861 97877 62382
13783 62382 28859 -23488 12389 -9815 52233 128287 149608 73554 58719 79916 76687 81328
13771 81328 45328 13022 19466 51757 33795 14627 31703 16473 19981 -26996 23091 3549
13759 3549 33179 58774 65409 -5260 -55895 -64703 -20108 50562 30792 11598 33772 45128
13747 45128 136403 156257 66241 41972 -8038 39994 56578 35170 30133 22972 6030 -46994
13735 -46994 -28368 26842 11427 13924 81278 110751 100518 120604 137938 75345 -421 26178
13723 26178 41039 25149 88944 89948 57735 80047 60100 10125 61239 41157 90026 99843
13711 99843 48132 39787 52545 68030 25153 14602 36826 22006 2605 23061 119105 124890
$$ packed form
13795A324M0588J12672M9562p1307l7494j8139N7510K6810n9023j5642J1016l5495
13783F2382l3523n2347L5877k2204O2048P6054K1321p6054j4835K1197l229M641
13771H1328l6000l2306O444L2291j7962j9168J7076j5230L508m6977N0087j9542
13759C549K9630K5595O635p0669n0635q808M4595P0670j9770j9194K2174J1356
13747D5128R1275J9854r0016k4269n0010M8032J6584k1408n037p161j6942n3024
13735d6994J8626N5210j5415K497O7354K9473j0233K0086J7334o2593p5766K6599
13723B6178J4861j5890O3795J004l2213K2312j9947m9975N1114k0082M8869R817
13711I9843n1711q345J2758J5485m2877j0551K2224j4820j9401K0456R6044N785
$$ plain form
13699 124890 152462 82942 84291 74379 29253 -21152 -54932 -8383 31397 27389 -57256 -80910
13687 -80910 -15779 21965 56957 68336 111009 144297 191853 245352 213771 138979 77848 36123
13675 36123 -19893 -17685 -37526 -2357 66966 52196 50261 101001 70821 63684 93526 49821
13663 49821 71546 107349 131619 111071 107049 79748 -537 -36098 29849 51574 34897 -18853
13651 -18853 -10491 7951 -24858 -1366 22850 26529 5105 13608 56441 11409 21196 57361
13639 57361 71085 49041 4749 -10745 -41740 -48408 17977 47044 78112 102879 120169 150020
13627 150020 162992 131373 66082 -33131 -83147 -40982 7577 94116 61933 -10241 21741
13616 21741 6542 15099 82655 108401 110806 101065 27278 26386 28221 -93511 -90809 -33830 -43209
$$ packed form
13699A24890K7572o9520J349r912m5126n0405l3780M6549L9780m008q4645k3654
13687h0910O5131L7744L4992J1379M2673L3288M7556N3499l1581p4792o1131m1725
13675C6123n6016K208j9841L5169O9323j4770j935N0740l0180p137K9842m3705
13663D9821K1725L5803K4270k0548m022k7301q0285l5561O5947K1725j6677n3750
13651a8853Q362J8442l2809K3492K4216L679k1424Q503M2833m5032R787L6165
13639E7361J3724k2044m4292j5494l0995o668O6385K9067L1068K4767J7290K9851
13627A50020J2972l1619o5291r9213n0016M2165M8559Q6539l2183p2174L1982
13616B1741j5199Q557O7556K5746K405r741p3787q92J835j21732K702N6979r379
$$ plain form
13603 -43209 -30354 1227 7333 46155 46383 59101 118765 179252 147362 173882 181447 174107 171431
13590 171431 164392 170701 144954 119134 98656 106464 142949 116522 98657 50309 -7127 -6853
13578 -6853 -8616 -1449 -15650 -13213 53176 53146 20026 65243 63393 74343 109518 104523 17751
13565 17751 45240 107198 93849 131122 149228 166531 127591 95171 130779 113534 131164 158334
13553 158334 175146 137965 117649 70173 26817 -37830 -39169 -19293 33117 65143 113910 140390
13541 140390 156031 109764 85912 101291 91837 111851 135524 141807 105116 133328 162007 179018
13529 179018 154623 83469 77017 43669 -24687 -34371 20298 63279 67280 28821 65023 79193
13517 79193 39653 22556 63733 58981 43897 65319 75553 3685 -47797 -53761 -68697 -23719
$$ packed form
13603d3209J2855L1581O106L8822K28J2718N9664O0487l1890K6520P565p340k676
13590A71431p039O309k5747k5820k0478P808L6485k6427j7865m8348n7436K74
13578f853j763P167j4201K437O6389l0l3120M5217j850J0950L5175m995q6772
13565A7751K7489O1958j3349L7273J8106J7303l8940l2420L5608j7245J7630K7170
13553A58334J6812l7181k0316m7476m3356o4647j339J9876N2410L2026M8767K6480
13541A40390J5641m6267k3852J5379r454K0014K3673O283l6691K8212K8679J7011
13529A79018k4395p1154o452l3348o8356r684N4669M2981M001l8459L6202J4170
13517G9193l9540j7097M1177m752j5084K1422J0234p1868n1482n964j4936M4978
$$ plain form
13505 -23719 24010 97702 96135 62509 132110 150198 170723 137769 143415 145796 151777 97385
13493 97385 71922 72062 117610 149722 127664 133714 169057 181767 182770 163389 62155 56643
13481 56643 68502 77407 131785 136298 139757 115893 102775 131010 127539 133972 97993 53542 47835
13468 47835 73822 10036 -10742 -56026 -44793 24415 34132 -8154 -9567 27562 30532 17587
13456 17587 50941 57028 110989 121190 67851 48254 -1043 28410 117016 103950 60314 83910
13444 83910 123410 113636 138939 127569 99198 66562 42919 91192 132604 93114 73888 95247
13432 95247 85871 -3024 15656 76494 154553 164057 128884 83932 116087 142373 152821 90385
13420 90385 53953 89646 151042 153339 104538 108321 137013 161463 173069 180839 206883 173370
$$ packed form
13505b3719M7729P3692j567l3626O9601J8088K0525l2954N646K381N981n4392
13493I7385k5463J40M5548L2112k2058O050L5343J2710J003j9381j01234n512
13481E6643J1859Q905N4378M513L459k3864j3118K8235l471O433l5979m4451n707
13468D7835K5987o3786k0778m5284J1233O9208R717m2286j413L7129K970j2945
13456A7587L3354O087N3961J0201n3339j9597m9297K9453Q8606j3066m3636K3596
13444H3910L9500r774K5303j1370k8371l2636k3643M8273M1412l9490j9226K1359
13432I5247r376q8895J8680O0838P8059R504l5173m4952L2155K6286J0448o2436
13420I0385l6432L5693O1396K297m8801L783K8692K4450J1606P770K6044l3513
$$ plain form
13408 173370 111918 96012 41634 43108 12440 59205 79002 157381 188231 156445 170581 139990
13396 139990 116493 85948 121194 84442 58400 71538 113553 196077 178826 105399 73408
13385 73408 90937 119800 191947 206564 153801 172174 168038 169127 89921 60818 104066 82821
13373 82821 118964 116756 163795 149188 151190 136613 115076 164105 138335 132841 202264 153989
13361 153989 138086 127772 93391 104193 117320 169844 197407 187097 150533 113030 118946 65369
13349 65369 35527 22620 -5450 -49735 -5109 92913 156211 260357 224324 167233 138035
13338 138035 109603 -10342 -65234 -43003 -5943 44386 14922 17156 61919 79488 57461
13327 57461 141356 120238 117462 163989 238673 243995 192712 164108 132232 96884 29606 54128
$$ packed form
13408A73370o1452j5906n4378J474l0668M6765J9797P8379L0850l1786J4136l0591
13396A39990k3497l0545L5246l6752k6042J3138M2015Q2524j7251p3427l1991
13385G3408J7529K8863P2147J4617n2763J8373m136J089p9206k9103M3248k1245
13373H2821L6143k208M7039j4607K002j4577k1537M9029k5770n494O9423m8275
13361A53989j5903j0314l4381J0802J3127N2524K7563j0310l6564l7503N916n3577
13349F5369k9842j2907k8070m4285M4626R8022O3298J04146l6033n7091k9198
13338A38035k8432j19945n4892K2231L7060N0329k9464K234M4763J7569k2027
13327E7461Q3895k1118k776M6527P4684N322n1283k8604l1876l5348o7278K4522
$$ plain form
13315 54128 114860 204709 157902 145973 163445 138330 108644 104156 126946 72391 83099 80251
13303 80251 68660 48647 70447 104646 105572 72543 127965 108066 47876 71186 80562 113415
13291 113415 169245 110075 77934 42116 61003 90938 -16724 14899 98193 113654 111590
13280 111590 144241 97488 64645 82898 137630 156693 134379 148659 223970 196054 180916
13269 180916 134175 117731 209215 263117 251643 243304 224164 207458 175507 149440 130331 162461
13257 162461 149191 178656 172140 188631 247578 202735 133183 102946 87545 95522 137033 121832
13245 121832 127009 168821 208395 278603 285601 167926 116826 110181 96598 76713 88967 154144
13233 154144 206657 234618 221075 183780 218690 247583 256111 199807 175623 165208 176488 173153
$$ packed form
13315E4128O0732Q9849m6807j1929J7472k5115k9686m488K2790n4555J0708k848
13303H0251j1591k0013K1800L4199R26l3029N5422j9899o0190K3310R376L2853
13291A13415N5830n9170l2141l5818J8887K9935j07662L1623Q3294J5461k064
13280A11590L2651m6753l2843J8253N4732J9063k2314J4280P5311k7916j5138
13269A80916m6741j6444R1484N3902j1474q339j9140j6706l1951k6067j9109L2130
13257A62461j3270K9465o516J6491N8947m4843o9552l0237j5401P977M1511j5201
13245A21832N177M1812L9574P0208O998j17675n1100o645j3583j9885J2254O5177
13233A54144N2513K7961j3543l7295L4910K8893Q528n6304k4184j0415J1280l335
$$ plain form
13221 173153 155338 155956 201740 201940 168406 160152 112454 111459 205586 215653 197642 202837 177364
13208 177364 223468 246346 203173 217285 239933 241940 216576 216356 231357 212791 185774 163467
13196 163467 142972 123630 115019 134882 109372 77920 62434 84972 119145 183171 137784 99991
13184 99991 87334 124606 142874 121896 34232 46266 93112 151811 115323 78789 126398 71162
13172 71162 107361 133906 167419 222867 152091 122738 148520 176280 179319 187866 143853 203899
13160 203899 220457 209943 179843 190059 240302 206723 171371 143568 185233 194236 149550 101800
13148 101800 115674 75179 64365 115484 212577 188815 215003 182659 195733 200211 208975 221200
13136 221200 274273 258721 185702 176425 162785 154911 165038 139599 110795 126589 132933 175317
$$ packed form
13221A73153j7815O18M5784K00l3534q254m7698r95R4127J0067j8011N195k5473
13208A77364M6104K2878m3173J4112K2648K007k5364k20J5001j8566k7017k2307
13196A63467k0495j9342q611J9863k5510l1452j5486K2538L4173O4026m5387l7793
13184I9991j2657L7272J8268k0978q7664J2034M6846N8699l6488l6534M7609n5236
13172G1162L6199K6545L3513N5448p0776k9353K5782K7760L039Q547m4013O0046
13160B03899J6558j0514l0100J0216N0243l3579l5352k7803M1665R003m4686m7750
13148A01800J3874m0495j0814N1119R7093k3762K6188l2344J3074M478Q764J2225
13136B21200N3073j5552p3019r277j3640p874J0127k5439k8804J5794O344M2384
$$ plain form
13124 175317 191041 177002 149195 80897 70833 104458 168938 192047 268644 231310 179832
13113 179832 127424 92434 48882 83151 103726 123478 180535 243566 227356 191127 186840 219522
13101 219522 273694 217459 202078 211840 247019 224387 203462 248183 242004 229930 244499 216273
13089 216273 189198 150743 150666 102956 69138 113344 137047 162184 217169 232258 248560 276430
13077 276430 293954 229925 163225 152926 151518 128304 115389 135374 151965 179968 162200 151017
13065 151017 100928 67922 99377 97612 102631 157951 156932 229160 325445 368331 409608 427988
13053 427988 391622 331805 322692 263694 231089 207278 129321 106662 115355 120204 154328 163156
13041 163156 116325 199352 231484 241708 236949 245758 236409 156776 182561 188250 178896 153853
$$ packed form
13124A75317J5724j4039k7807o8298j0064L3625O4480K3109P6597l7334n1478
13113A79832n2408l4990m3552L4269K0575J9752N7057O3031j6210l6229m287L2682
13101B19522N4172n6235j5381R762L5179k2632k0925M4721o179j2074J4569k8226
13089B16273k7075l8455p7m7710l3818M4206K3703K5137N4985J5089J6302K7870
13077B76430J7524o4029o6700j0299j408k3214j2915J9985J6591K8003j7768j1183
13065A51017n0089l3006L1455j765N019N5320j019P2228R6285M2886M1277J8380
13053D27988l6366n9817r113n8998l2605k3811p7957k2659Q693M849L4124Q828
13041A63156m6831Q3027L2132J0224m759Q809r349p9633K5785N689r354k5043
$$ plain form
13029 153853 142868 182968 223323 259100 245047 154598 136510 129451 135093 221973 219490 221860
13017 221860 200832 234079 287522 288974 392171 433297 400333 374225 379286 429483 394117 392972
13005 392972 290249 175778 176946 236276 256386 201853 184176 235178 250554 219601 200198
12994 200198 229056 270332 302280 264008 243791 270887 183692 131290 143846 236316 233209 181368
12982 181368 160454 157021 146743 172848 203637 252847 218667 186261 205223 239998 280873 342043
12970 342043 402044 431167 463936 432170 408879 433536 449710 492672 446680 331492 323646
12959 323646 348064 404922 401854 267641 173843 256211 362024 316720 272720 219099 202408
12948 202408 246122 222838 239391 246105 242716 235190 248132 295138 303202 242322 220426 248874
$$ packed form
13029A53853j0985M0100M0355L5777j4053r0449j8088p059N642Q6880k483K370
13017B21860k1028L3247N3443J452J03197M1126l2964k6108N061N0197l5366j145
13005C92972j02723j14471J168N9330K0110n4533j7677N1002J5376l0953j9403
12994B00198K8858M1276L1948l8272k0217K7096q7195n2402J2556R2470l107n1841
12982A81368k0914l433j0278K6105L0789M9210l4180l2406J8962L4775M0875O1170
12970C42043O0001K9123L2769l1766k3291K4657J6174M2962m5992j15188p846
12959C23646K4418N6858l068j34213r3798Q2368J05813m5304m4000n3621j6691
12948B02408M3714k3284J6553O714l389p526J2942M7006Q064o0880k1896K8448
$$ plain form
12936 248874 277974 305947 303536 164323 89857 108400 103601 119796 84966 83815 137189 201638
12924 201638 221212 212394 213571 235115 206734 135559 191579 278777 288603 221398 195284 292071
12912 292071 304460 283327 234608 298677 282967 214970 228882 222593 229944 280361 275538 279829
12900 279829 267215 182956 197299 260144 195899 215299 216288 185772 206943 240543 219799 121142
12888 121142 102282 158153 209648 195506 249816 250133 153105 64068 74800 148460 231719 273111
12876 273111 273940 219037 264700 268841 270316 252349 209247 226501 187934 175585 159706 130948
12864 130948 164667 145329 118698 121727 165820 192145 258367 282932 264201 277765 273985 269330
12852 269330 256913 229614 235951 281860 265739 213884 270680 236856 179165 144428 217654 234357
$$ packed form
12936B48874K9100K7973k411j39213p4466J8543m799J6195l4830j151N3374O4449
12924B01638J9574q818J177K1544k8381p1175N6020Q7198R826o7205k6114R6787
12912B92071J2389k1133m8719O4069j5710o7997J3912o289P351N0417m823M291
12900B79829j2614q4259J4343O2845o4245J9400R89l0516K1171L3600k0744r8657
12888A21142j8860N5871N1495j4142N4310L17r7028q9037J0732P3660Q3259M1392
12876B73111Q29n4903M5663M141J475j7967m3102J7254l8567j2349j5879k8758
12864A30948L3719j9338k6631L029M4093K6325O6222K4565j8731J3564l780m655
12852B69330j2417k7299O337M5909j6121n1855N6796l3824n7691l4737P3226J6703
$$ plain form
12840 234357 221888 227735 223565 234715 232213 224820 232573 192539 229593 316793 357850 273950
12828 273950 205153 190568 203521 232757 178869 158066 176936 128740 132599 195865 205436 228445
12816 228445 178061 216736 226627 252155 309731 263075 196535 193940 186321 243873 251803 266274
12804 266274 259604 256057 206310 204512 210535 166378 138596 211293 238399 191449 215614 229271
12792 229271 198634 163065 112813 130412 153894 202388 219277 232859 212911 162927 225674
12781 225674 214820 208812 203434 222883 264604 263757 297434 289723 335171 313560 266438 266378 282588
12768 282588 249245 234033 280520 377455 424328 398358 275823 257144 247027 260795 324456
12757 324456 313861 297097 303506 336344 340325 349802 358018 359903 328042 292811 256732 259346 231659
$$ packed form
12840B34357j2469N847m170J1150k502p393P753m0034L7054Q7200M1057q3900
12828B73950o8797j4585J2953K9236n3888k0803J8870m8196L859O3266R571K3009
12816B28445n0384L8675R891K5528N7576m6656o6540k595p619N7552P930J4471
12804B66274o670l547m9747j798O023m4157k7782P2697K7106m6950K4165J3657
12792B29271l0637l5569n0252J7599K3482M8494J6889J3582j9948m9984O2747
12781B25674j0854o008n378J9449M1721q47L3677p711M5448k1611m7122o0J6210
12768B82588l3343j5212M6487R6935M6873k5970j22535j8679j0117J3768O3661
12757C24456j0595j6764O409L2838L981R477Q216J885l1861l5231l6079K614k7687
$$ plain form
12744 231659 220655 171973 126764 91827 80118 180582 167647 139370 101825 197112 241613
12733 241613 204833 236633 214884 158143 158628 176804 195300 202989 221116 294632 319086 284555
12721 284555 309869 256915 249607 298154 268800 209784 220156 226883 211683 188633 139652 149101
12709 149101 133475 156662 167507 149363 191592 189938 223871 216834 202927 198160 215671 247458
12697 247458 234318 238788 271774 271537 262898 298936 313519 264341 272789 345369 254596 198382
12685 198382 200750 225633 274427 225588 182618 141045 170802 140364 113068 171843 180057 193593
12673 193593 165667 180709 173353 190260 209041 254110 242227 242717 269701 237596 185869 207420
12661 207420 219460 202651 163971 138037 117032 111143 141454 138254 135672 136328 95806 76620
$$ packed form
12744B31659j1004m8682m5209l4937j1709J00464j2935k8277l7545R5287M4501
12733B41613l6780L1800k1749n6741M85J8176J8496P689J8127P3516K4454l4531
12721B84555K5314n2954p308M8547k9354n9016J0372O727j5200k3050m8981R449
12709A49101j5626K3187J0845j8144M2229j654L3933p037j3907m767J7511L1787
12697B47458j3140M470L2986k37q639L6038J4583m9178Q448P2580r0773n6214
12685A98382K368K4883M8794m8839m2970m1573K9757l0438k7296N8775Q214J3536
12673A93593k7926J5042p356J6907J8781M5069j1883M90K6984l2105n1727K1551
12661B07420J2040j6809l8680k5934k1005n889L0311l200k582O56m0522j9186
$$ plain form
12649 76620 142224 195911 231799 225985 196736 207475 232108 236669 261814 258398 255691 255868 202366
12636 202366 219988 204642 156711 225368 235580 218634 274748 285037 205591 251848 306161
12625 306161 258002 165169 135569 157349 161472 178780 177798 215809 203007 232767 216270 209186
12613 209186 255258 271723 275652 247100 216829 219498 195490 204941 234249 242373 228620 225481
12601 225481 261557 332904 354571 320687 258711 257366 241880 218247 171405 179061 208112 184763
12589 184763 182863 240355 253817 238019 268147 240597 185014 177282 191878 215219 224639 180768
12577 180768 215245 299109 303696 337958 352602 315558 290002 235374 208535 217502 240127 294473
12565 294473 345575 371360 337682 288097 293348 295080 280324 253432 292690 266600 246494 209354
$$ packed form
12649G6620O5604N3687L5888n814k9249J0739K4633M561K5145l416k707J77n3502
12636B02366J7622j5346m7931O8657J0212j6946N6114J0289p9446M6257N4313
12625C06161m8159r2833k9600K1780M123J7308r82L8011j2802K9760j6497p084
12613B09186M6072J6465L929k8552l0271K669k4008R451K9308Q124j3753l139
12601B25481L6076P1347K1667l3884o1976j345j5486k3633m6842P656K9051k3349
12589A84763j900N7492J3462j5798L0128k7550n5583p732J4596K3341R420m3871
12577A80768L4477Q3864M587L4262J4644l7044k5556n4628k6839Q967K2625N4346
12565B94473N1102K5785l3678m9585N251J732j4756k6892L9258k6090k0106l7140
$$ plain form
12553 209354 173249 223490 240813 224963 189459 146449 152698 160138 182540 189337 204970 171180
12541 171180 178257 158058 230401 254189 237451 239406 292992 296819 240008 238027 235507 257431
12529 257431 289121 287954 291580 321735 321369 270395 229035 205058 224397 308883 364535 359176
12517 359176 297619 227669 187137 187945 151055 112713 113857 199694 263130 246316 272070 267512
12505 267512 262390 248004 236928 222604 274402 243127 181369 180701 264343 214844 204823 233427
12493 233427 173728 189607 132061 125688 147708 164255 118902 132169 175079 221669 199277 151550
12481 151550 140165 175029 151525 165406 194522 254779 280636 266731 210859 190627 139114
12470 139114 105961 190569 212175 183686 177858 216830 243051 259785 225171 170463 179062 169180
$$ packed form
12553B09354l6105N0241J7323j5850l5504m3010O249P440K2402O797J5633l3790
12541A71180P077k0199P2343K3788j6738J955N3586L827n6811j981k520K1924
12529B57431L1690j167L626L0155l66n0974m1360k3977J9339Q4486N5652n359
12517C59176o1557o9950m0532Q08l6890l8342J144Q5837O3436j6814K5754m558
12505B67512n122j4386j1076j4324N1798l1275o1758o68Q3642m9499j0021K8604
12493B33427n9699J5879n7546o373K2020J6547m5353J3267M2910M6590k2392m7727
12481A51550j1385L4864k3504J3881K9116O0257K5857j3905n5872k0232n1513
12470A39114l3153Q4608K1606k8489n828L8972K6221J6734l4614n4708Q599r882
$$ plain form
12458 169180 190029 246971 249972 208591 212346 212953 243681 225182 147025 181600 218183 147334
12446 147334 183547 241850 289495 275647 284127 235321 210904 205216 149855 95675 155675 182584
12434 182584 192574 215974 190725 164028 188742 239960 219676 218967 229275 242597 237058 221567
12422 221567 171881 151658 208452 216657 221252 227890 219429 173783 107639 142880 126222 162744
12410 162744 177563 183352 218644 223257 220231 260498 336447 351511 358575 278467 243045 227885
12398 227885 198435 264377 319548 242582 137843 35936 19362 11210 19252 48714 38191
12387 38191 104060 115973 131770 141974 132408 207839 179878 149059 114447 94016 172381 256744
12375 256744 214795 166089 129795 130250 177309 204799 221652 218593 182436 234185 267853 208648
$$ packed form
12458A69180K0849N6942L001m1381L755O07L0728j8499p8157L4575L6583p0849
12446A47334L6213N8303M7645j3848Q480m8806k4417n688n5361n4180O0000K6909
12434A82584R990K3400k5249k6697K4714N1218k0284p09J0308J3322n539j5491
12422B21567m9686k0223N6794Q205M595O638q461m5646o6144L5241j6658L6522
12410A62744J4819N789L5292M613l026M0267P5949J5064P064q0108l5422j5160
12398B27885k9450O5942N5171p6966j04739j01907j6574q152Q042K9462j0523
12387C8191O5869J1913J5797J0204r566P5431k7961l0819l4612k0431P8365Q4363
12375B56744m1949m8706l6294M55M7059K7490J6853l059l6157N1749L3668n9205
$$ plain form
12363 208648 166786 182508 210879 231697 235085 222859 173424 97043 112878 201733 206185 216235
12351 216235 231019 190117 193084 184641 176284 118722 116905 69328 33092 69501 94799 35323
12339 35323 17785 94501 128054 147714 176333 192906 188334 184642 178566 167836 168321 140845 172689
12326 172689 112380 127438 133612 151592 166968 169843 166406 177957 176789 206861 180756 166845
12314 166845 122276 149760 203982 212908 169236 171176 171343 169565 179899 216712 166666 152348
12302 152348 109779 61583 75515 81110 62184 27741 113343 136378 140337 137952 83431 74152
12290 74152 95442 182949 266609 257616 294446 353485 287090 216013 183162 152659 126354 115879
12278 115879 182834 223633 183424 184348 138078 95711 33090 58673 87173 106459 79534 46173
$$ packed form
12363B08648m1862J5722K8371K0818L388j2226m9435p6381J5835Q8855M452J0050
12351B16235J4784m0902K967q443q357n7562j817m7577l6236L6409K5298n9476
12339C5323j7538P6716L3553J9660K8619J6573m572l692o076j0730M85k7476L1844
12326A72689o0309J5058O174J7980J5376K875l437J1551j168L0072k6105j3911
12314A66845m4569K7484N4222Q926m3672J940J67j778J0334L6813n0046j4318
12302A52348m2569m8196J3932N595j8926l4443Q5602K3035L959k385n4521r279
12290G4152K1290Q7507Q3660q993L6830N9039o6395p1077l2851l0503k6305j0475
12278A15879O6955M0799m0209R24m6270m2367o2621K5583K8500J9286k6925l3361
$$ plain form
12266 46173 64934 110450 113040 76039 120485 119316 150193 179598 224737 252243 292635 278599
12254 278599 162431 175470 203689 249739 180799 128131 144138 130300 117994 141275 213444
12243 213444 129405 73822 89741 156970 166717 183808 215718 244295 302186 316861 391157 434733
12231 434733 497145 494502 526317 565022 555468 438352 354966 329063 245772 145222 138098 198746
12219 198746 276649 297820 268112 214688 250885 229360 221577 247716 206763 172955 207820 247881
12207 247881 305632 298744 293097 291895 202313 183954 252783 267572 311270 300888 184180 112383
12195 112383 104888 201190 278100 400061 470895 574704 668480 797879 984421 1093757 1137833
12184 1137833 1190167 1150628 989754 756399 568511 470566 329382 261014 274761 319208
$$ packed form
12266D6173J8761M5516K590l7001M4446j169L0877K9405M5139K7506M0392j4036
12254B78599j16168J3039K8219M6050o8940n2668J6007j3838j2306K3281P2169
12243B13444q4039n5583J5919O7229R747J7091L1910K8577N7891J4675P4296M3576
12231D34733O2412k643L1815L8705r554j17116q3386k5903q3291j00550p124O0648
12219A98746P7903K1171k9708n3424L6197k1525p783K6139m0953l3808L4865M0061
12207B47881N7751o888n647j202q9582j8359O8829J4789M3698j0382j16708p1797
12195A12383p495R6302P6910J21961P0834J03809R3776J29399J86542J09336M4076
12184A137833N2334l9539j60874k33355j87888r7945j41184o8368J3747M4447
$$ plain form
12174 319208 340880 299515 280828 274548 284148 257940 225978 276832 324361 326353 278132 250596
12162 250596 297678 223827 213131 220728 251275 247700 168976 150873 182740 260257 291829 306051
12150 306051 333334 285904 276891 294427 356941 519708 732871 986366 1221294 1321197 1325632
12139 1325632 1203148 900129 679126 510476 450088 416641 379452 345551 407109 380079
12129 380079 332472 321667 260941 268746 343808 330485 216759 163732 179515 232982 254940
12118 254940 262638 206960 249534 344736 336198 297612 195539 162513 166384 145374 186333 219599
12106 219599 176492 138331 247420 365699 339394 323473 330438 378023 399290 434784 480449
12095 480449 449602 383466 375625 331890 282390 290390 235036 149242 196314 232865 191180 113598
$$ packed form
12174C19208K1672m1365j8687o280R600k6208l1962N0854M7529J992m8221k7536
12162B50596M7082p3851j0696P597L0547l575p8724j8103L1867P7517L1572J4222
12150C06051K7283m7430r013J7536O2514J62767K13163K53495K34928R9903M435
12139A325632j22484l03019k21003j68650o0388l3447l7189l3901O1558k7030
12129C80079m7607j0805o0726P805P5062j3323j13726n3027J5783N3467K1958
12118B54940P698n5678M2574R5202q538l8586j02073l3026L871k1010M0959L3266
12106B19599m3107l8161J09089J18279k6305j5921O965M7585K1267L5494M5665
12095D80449l0847o6136p841m3735m9500Q000n5354q5794M7072L6551m1685p7582
$$ plain form
12083 113598 112704 140816 139640 156235 159368 104092 109369 92367 99411 149739 210598 215885 225691
12070 225691 197593 199892 185948 163269 114317 38949 85884 117489 74448 139464 214507 185384
12058 185384 92616 62476 98738 77573 -719 59938 102013 174366 243601 200988 108657
12047 108657 102824 87263 70944 40379 22574 65689 131625 176960 171884 132461 76257 119436
12035 119436 167537 147031 97211 134385 123230 18988 -26501 39018 121421 175980 185350
12024 185350 128313 111392 52257 83942 117799 144039 147812 130845 66126 72496 61940 -10355
12012 -10355 -55763 -103344 -72309 -73865 -46493 27603 5047 32294 91544 54001 84551 65621
12000 65621 19405 39060 61520 49890 86525 119065 166155 180919 48348 -62215 -19749
$$ packed form
12083A13598q94K8112j176J6595L133n5276N277j7002P044N0328O0859N287R806
12070B25691k8098K299j3944k2679m8952p5368M6935L1605m3041O5016P5043k9123
12058A85384r2768l0140L6262k1165p8292O0657M2075P2353O9235m2613r2331
12047A08657n833j5561j6319l0565j7805M3115O5936M5335n076l9423n6204M3179
12035A19436M8101k0506m9820L7174j1155j04242m5489O5519Q2403N4559R370
12024A85350n7037j6921n9135L1685L3857K6240L773j6967o4719O370j0556p2295
12012a0355m5408m7581L1035j556K7372P4096k2556K7247N9250l7543L0550j8930
12000F5621m6216J9655K2460j1630L6635L2540M7090J4764j32571j10563M2466
$$ plain form
11989 -19749 5283 -32078 -70435 -9646 -90865 -129632 -94818 -101895 -81820 -35077 -26457 31783
11977 31783 47762 683 -35512 -4007 42758 968 35736 78969 13304 6121 46515 15635
11965 15635 -33980 -77151 -21043 47392 75260 15010 43673 94309 48527 -3754 -41677 43838
11953 43838 31129 43611 63333 48125 -251 -52651 26283 86534 69183 52951 7360 69247
11941 69247 89258 146985 173076 162461 117153 80605 26994 1866 75646 125218 65657 44550
11929 44550 -3139 -36135 -19437 7301 74339 122623 63947 78145 108588 127927 89347 80029
11917 80029 64263 66706 138599 159855 179834 152845 134153 105441 46963 46832 72898 13776
11905 13776 25612 23549 58118 133541 227979 256177 270219 298081 384010 388198 354479 318708
$$ packed form
11989a9749K5032l7361l8357O0789q1219l8767L4814p077K0075M6743Q620N8240
11977C1783J5979m7079l6195L1505M6765m1790L4768M3233o5665p183M0394l0880
11965A5635m9615m3171N6108O8435K7868o0250K8663N0636m5782n2281l7923Q5515
11953D3838j2709J2482J9722j5208m8376n2400P8934O0251j7351j6232m5591O1887
11941F9247K0011N7727K6091j0615m5308l6548n3611k5128P3780M9572n9561k1107
11929D4550m7689l2996J6698K6738O7038M8284n8676J4198L0443J9339l8580r318
11917H0029j5766K443P1893K1256J9979k6989j8692k8712n8478j31K6066n9122
11905A3776J1836k063L4569P5423R4438K8198J4042K7862Q5929M188l3719l5771
$$ plain form
11893 318708 338047 361367 328100 348604 306248 228396 199377 222109 229694 193998 88084
11882 88084 85895 79972 60405 83543 128800 203771 220728 117487 69930 104897 188986 205227
11870 205227 230623 269890 329244 450470 405867 346452 300924 306299 333143 308929 267228
11859 267228 221448 200862 179053 200610 244188 269227 274832 288679 377402 443786 432565 361906
11847 361906 373585 379405 309344 370822 412630 429246 421358 375844 315014 328987 283941 180911
11835 180911 191219 248647 222017 152710 119528 142220 307640 323879 286840 291515 317995
11824 317995 355790 343326 333750 346779 352648 356691 373913 326495 264286 241664 280273 222273
11812 222273 192148 118907 83596 46961 36906 49491 81968 125547 122120 105676 140651 74539
$$ packed form
11893C18708J9339K3320l3267K0504m2356p7852k9019K2732P585l5696j05914
11882H8084k189n923j9567K3138M5257P4971J6957j03241m7557L4967Q4089J6241
11870B05227K5396L9267N9354J21226m4603n9415m5528N375K6844k4214m1701
11859B67228m5780k0586k1809K1557M3578K5039N605J3847Q8723O6384j1221p0659
11847C61906J1679N820p0061O1478M1808J6616p888m5514o0830J3973m5046j03030
11835A80911J0308N7428k6630o9307l3182K2692J65420J6239l7039M675K6480
11824C17995L7795j2464r576J3029N869M043J7222m7418o2209k2622L8609n8000
11812B22273l0125p3241l5311l6635j0055J2585L2477M3579l427j6444L4975o6112
$$ plain form
11800 74539 77526 125531 112374 69910 33835 -2406 11788 34063 33346 -9442 -20054 -15774
11788 -15774 10524 28849 21379 -9094 -27562 -36757 -32596 -47340 26047 74753 107264 113689
11776 113689 115684 94582 57057 50182 68554 19488 -63215 -112219 -46244 -40488 -47818 -24825
11764 -24825 -6550 47767 100228 121261 196314 201219 232373 293810 273982 189657 88834 19658
11752 19658 12862 -24291 -91751 -171573 -216035 -157256 -79980 -85121 -164804 -191212 -139822 -123944
11740 -123944 -90037 -111769 -110029 -149497 -156735 -143672 -144684 -188162 -176438 -197982 -274535 -321980
11728 -321980 -317564 -249351 -171591 -197086 -249175 -303502 -268582 -190316 -108684 -161331 -286677
11717 -286677 -291867 -353706 -380781 -335384 -237600 -218314 -232682 -240434 -198329 -190206 -150939 -193579
$$ packed form
11800G4539K987M8005j3157m2464l6075l6241J4194K2275p17m2788j0612M280
11788a5774K6298J8325p470l0473j8468r195M161j4744P3387M8706L2511O425
11776A13689J995k1102l7525o875J8372m9066q2703m9004O5975N756p330K2993
11764b4825J8275N4317N2461K1033P5053M905L1154O1437j9828q4325j00823o9176
11752A9658o796l7153o7460p9822m4462N8779P7276n141p9683k6408N1390J5878
11740a23944L3907k1732J740l9468p238J3063j012m3478J1724k1544p6553m7445
11728c21980M416O8213P7760k5495n2089n4327L4920P8266Q1632n2647j25346
11717b86677n190o1839k7075M5397R7784J9286j4368p752M2105Q123L9267m2640
$$ plain form
11705 -193579 -212337 -235704 -260868 -240662 -175956 -197006 -284721 -303318 -247694 -267655 -350728
11694 -350728 -373256 -316923 -261775 -246392 -264026 -228533 -247441 -306085 -286677 -171054 -231949
11683 -231949 -215992 -168765 -210107 -222545 -229460 -266970 -260028 -235914 -253854 -272270 -287926 -336057
11671 -336057 -349321 -407531 -458832 -428681 -380950 -326540 -332820 -390219 -445632 -413270 -382395 -397461
11659 -397461 -394010 -340195 -325990 -309771 -336469 -297270 -293196 -288739 -196990 -191527 -279845 -329622
11647 -329622 -384757 -405424 -415237 -459471 -445753 -399482 -361043 -360764 -330467 -332051 -317695 -338454
11635 -338454 -342453 -385093 -391602 -357206 -342114 -375501 -401721 -414837 -389479 -352136 -296089 -221659
11623 -221659 -235536 -254552 -243625 -206647 -210166 -236710 -232270 -183505 -101552 -53174 -63900 -106802
$$ packed form
11705a93579j8758k3367k5164K0206O4706k1050q7715j8597N5624j9961q3073
11694c50728k2528N6333N5148J5383j7634L5493j8908n8644J9408J15623o0895
11683b31949J5957M7227m1342j2438o915l7510O942K4114j7940j8416j5656m8131
11671c36057j3264n8210n1301L0151M7731N4410o280n7399n5413L2362L0875j5066
11659c97461L451N3815J4205J6219k6698L9199M074M457R1749N463q8318m9777
11647c29622n5135k0667r813m4234J3718M6271L8439K79L0297j584J4356k0759
11635c38454l999m2640o509L4396J5092l3387k6220j3116K5358L7343N6047P4430
11623b21659j3877j9016J0927L6978l519k6544M440M8765Q1953M8378j0726m2902
$$ plain form
11611 -106802 -134604 -195966 -225324 -291943 -306991 -233268 -206985 -148895 -93605 -88029 -98044 -38555
11599 -38555 -35551 -69276 -141113 -180460 -192923 -193135 -204915 -145697 -74740 -70574 -71481 -135907 -167832
11586 -167832 -156406 -168612 -175477 -274512 -344022 -382053 -365350 -325997 -402641 -422561 -354747 -308030
11574 -308030 -310146 -290458 -361662 -394027 -502239 -598250 -577087 -522360 -496879 -540720 -504930
11563 -504930 -484053 -499295 -546819 -519361 -446370 -423168 -358402 -355742 -385046 -352617 -289217 -277376
11551 -277376 -335175 -450863 -514193 -404222 -392740 -465998 -427694 -437831 -494149 -523861 -507004
11540 -507004 -513382 -465624 -440972 -495563 -524617 -538285 -541966 -487973 -467544 -499127 -491903 -501441
11528 -501441 -544445 -576050 -554030 -487143 -424719 -456548 -532650 -583218 -653166 -653283 -681170 -628011
$$ packed form
11611a06802k7802o1362k9358o6619j5048P3723K6283N8090N5290N576j0015N9489
11599c8555L004l3725p1837l9347j2463k12j1780N9218P0957M166r07o4426l1925
11586a67832J1426j2206o865r9035o9510l8031J6703L9353p6644j9920O7814M6717
11574c08030k116J9688p1204l2365j08212r6011K1163N4727K5481m3841L5790
11563e04930K0877j5242m7524K7458P2991K3202O4766K660k9304L2429O3400J1841
11551b77376n7799j15688o3330J09971J1482p3258L8304j0137n6318k9712J6857
11540e07004o378M7758K4652n4591k9054j3668l681N3993K0429l1583P224r538
11528e01441m3004l1605K2020O6887O2424l1829p6102n0568o9948j17k7887N3159
$$ plain form
11516 -628011 -594375 -568347 -593203 -583812 -549344 -554448 -627563 -662848 -687822 -706674 -689891 -609021
11504 -609021 -548545 -588960 -591605 -624395 -729780 -777764 -822041 -802988 -766842 -716973 -709246 -764435
11492 -764435 -767711 -742328 -764587 -763259 -765519 -786530 -807395 -795152 -745317 -745075 -739174 -752961 -764105
11479 -764105 -716508 -705018 -699284 -755461 -758745 -776212 -758885 -714458 -669783 -695259 -743764 -719949
11467 -719949 -696433 -704571 -682381 -716550 -759255 -722025 -770597 -846218 -788852 -784402 -789972 -795008
11455 -795008 -766125 -784133 -792260 -736223 -704571 -627757 -663743 -694435 -701331 -741549 -757785 -804557
11443 -804557 -814622 -782172 -799815 -783854 -751677 -735928 -716762 -720191 -741626 -811450 -845575 -837798
11431 -837798 -869950 -881024 -865085 -844186 -831104 -836314 -793958 -787455 -794390 -836154 -854664 -798920
$$ packed form
11516f28011L3636K6028k4856R391L4468n104p3115l5285k4974j8852J6783Q0870
11504f09021O0476m0415k645l2790j05385m7984m4277J9053L6146M9869P727n5189
11492g64435l276K5383k2259J328k260k1011k0865J2243M9835K42N901j3787j1144
11479g64105M7597J1490N734n6177l284j7467J7327M4427M4675k5476m8505K3815
11467g19949K3516q138K2190l4169m2705L7230m8572p5621N7366M450n570n036
11455g95008K8883j8008q127N6037L1652P6814l5986l0692o896m0218j6236m6772
11443h04557j0065L2450j7643J5961L2177J5749J9166l429k1435o9824l4125P777
11431h37798l2152j1074J5939K0899J3082n210M2356O503o935m1764j8510N5744
$$ plain form
11419 -798920 -858859 -910989 -919890 -913843 -857856 -844607 -794480 -782967 -840645 -867118 -785887 -783456
11407 -783456 -834294 -894190 -932103 -905038 -995839 -1058178 -1048060 -994125 -977925 -1016182 -1100620
11396 -1100620 -1107316 -1058357 -989978 -1022505 -1059274 -1058159 -1065839 -1060669 -1045304 -1022993 -1039445 -1022794
11384 -1022794 -1034007 -1055045 -1086044 -1042198 -1002163 -999346 -1022321 -1034468 -1107285 -1176391 -1148054
11373 -1148054 -1210733 -1207629 -1141286 -1132959 -1158401 -1175280 -1175817 -1156554 -1220574 -1216788 -1210956 -1222796
11361 -1222796 -1174767 -1162668 -1180850 -1200419 -1193340 -1168954 -1124019 -1045161 -1088006 -1097212 -1070677 -1134705
11349 -1134705 -1152955 -1141446 -1136788 -1100803 -1107784 -1166729 -1134440 -1054827 -1046773 -1007154 -977761 -1044828
11337 -1044828 -1088539 -1074176 -1008515 -970498 -978139 -962323 -946963 -956749 -940052 -954130 -1018187 -1074634
$$ packed form
11419g98920n9939n2130q901O047N5987J3249N0127J1513n7678k6473Q1231K431
11407g83456n0838n9896l7913K7065r0801o2339J0118N3935J6200l8257q4438
11396a100620o696M8959O8379l2527l6769J115p680N170J5365K2311j6452J6651
11384a022794j1213k1038l0999M3846M0035K817k2975j2147p2817o9106K8337
11373a148054o2679L104O6343Q327k5442j6879n37J9263o4020L786N832j1840
11361a222796M8029J2099j8182j9569P079K4386M4935P8858m2845r206K6535o4028
11349a134705j8250J1509M658L5985o981n8945L2289P9613Q054L9619K9393o7067
11337a044828m3711J4363O5661L8017p641J5816J5360r786J6697j4078o4057n6447
$$ plain form
11325 -1074634 -1141542 -1303684 -1320205 -1288515 -1278545 -1104776 -1014544 -1015621 -968687 -967485 -1001908
11314 -1001908 -1142312 -1282168 -1349779 -1337677 -1328252 -1321553 -1314821 -1365454 -1336104 -1314409 -1310440 -1297524
11302 -1297524 -1294839 -1399835 -1481784 -1484094 -1512791 -1628024 -1710054 -1646314 -1564191 -1566614 -1585755
11291 -1585755 -1595526 -1705016 -1742992 -1755719 -1755649 -1717587 -1737269 -1734210 -1728177 -1756829 -1793545 -1782037
11279 -1782037 -1822337 -1887409 -1938423 -2017880 -2050156 -1953614 -1888915 -1937980 -1961797 -1939828 -1958402
11268 -1958402 -1998285 -2053568 -2105493 -2123425 -2107492 -2134306 -2135586 -2150413 -2186756 -2213899 -2244079
11257 -2244079 -2291260 -2292814 -2319960 -2320138 -2348583 -2354750 -2336864 -2337135 -2368073 -2381061 -2438887 -2470620
11245 -2470620 -2491922 -2490896 -2391204 -2332210 -2369920 -2439642 -2469914 -2488944 -2393043 -2260237 -2180002
$$ packed form
11325a074634o6908j62142j6521L1690R970J73769R0232j077M6934J202l4423
11314a001908j40404j39856o7611J2102R425O699O732n0633K9350K1695L969J2916
11302a297524K685j04996q1949k310k8697j15233q2030O3740Q2123k423j9141
11291a585755r771j09490l7976j2727P0L8062j9682L059O033k8652l6716J1508
11279a782037m0300o5072n1014p9457l2276R6542O4699m9065k3817K1969j8574
11268a958402l9883n5283n1925j7932J5933k6814j280j4827l6343k7143l0180
11257b244079m7181j554k7146j78k8445o167J7886k71l0938j2988n7826l1733
11245b470620k1302J026R9692N8994l7710o9722l0272j9030R5901J32806Q0235
$$ plain form
11234 -2180002 -2049277 -1882030 -1639660 -1424758 -1244770 -1106658 -1137469 -1401971 -1814070 -2129627
11224 -2129627 -2349191 -2515700 -2640622 -2753520 -2744176 -2710417 -2628856 -2468909 -2332727 -2181179
11214 -2181179 -1955781 -1742114 -1631457 -1559715 -1516142 -1552087 -1543543 -1464188 -1239137 -743472
11204 -743472 55627 1146739 2616323 4517147 7067039 10338227 13988432 17350648
11196 17350648 20076459 22014777 22652857 21403442 19385557 18132275 18323447 20131827
11188 20131827 23846627 29537243 36550823 43216183 48247576 51643481 52381692 48821744
11180 48821744 42870085 38215602 36293507 37248501 41361875 48681179 58266919 67561596
11172 67561596 74302293 78229270 78149963 71682862 61164885 51912466 45923730 43273419
$$ packed form
11234b180002J30725J67247K42370K14902J79988J38112l0811k64502m12099l15557
11224b129627k19564j66509j24922j12898R344L3759Q1561J59947J36182J51548
11214b181179K25398K13667J10657P1742M3573l5945Q544P9355K25051M95665
11204g43472P99099J091112J469584J900824K549892L271188L650205L362216
11196A7350648K725811J938318O38080j249415k017885j253282J91172J808380
11188B0131827L714800N690616P013580O665360N031393L395905P38211l559948
11180D8821744n951659m654483j922095R54994M113374P319304R585740R294677
11172F7561596O740697L926977p9307o467101j0517977r252419n988736k650311
$$ plain form
11164 43273419 43560224 46627264 51614582 56722865 60218353 61882955 60972987 55872716
11156 55872716 47815372 40554985 35521744 32677106 31688230 32260173 33800534 35515297
11148 35515297 36555002 36596029 35488693 32573416 28202013 23987272 20726464 18337759
11140 18337759 16635743 15319851 14309998 13518902 12800613 12080925 11512787 10995681 10431371
11131 10431371 9911257 9521452 9167279 8792775 8425946 8158948 7939787 7728456 7376579
11122 7376579 7002741 6751515 6569431 6332799 6054707 5773511 5569566 5437981 5280931
11113 5280931 5152742 4964077 4744867 4512660 4360144 4261626 4055761 3838814 3678173 3585548
11103 3585548 3490356 3356516 3153290 3043778 3003366 3061251 3088177 3157276 3356833 3700069
$$ packed form
11164D3273419K86805L067040M987318N108283L495488J664602r09968n100271
11156E5872716q057344p260387n033241k844638r88876N71943J540361J714763
11148C5515297J039705M1027j107336k915277m371403m214741l260808k388705
11140A8337759j702016j315892j009853p91096p18289p19688n68138n17106n64310
11131A0431371n20114l89805l54173l74504l66829k66998k19161k11331l51877
11122G376579l73838k51226j82084k36632k78092k81196k03945j31585j57050
11113E280931j28189j88665k19210k32207j52516r8518k05865k16947j60641r2625
11103C585548r5192j33840k03226j09512m0412N7885K6926O9099J99557L43236
$$ plain form
11093 3700069 4048877 4328142 4478373 4527613 4367902 3891737 3325482 2956746 2599180 2319771
11083 2319771 2111906 1977334 1805546 1695563 1587868 1529206 1505525 1453254 1357218 1269065
11073 1269065 1239535 1186621 1245470 1167187 1042851 928857 866840 742890 803190 840351 772801
11062 772801 759299 721570 773609 748011 694243 727996 667643 665358 642431 574801 546704 523084
11050 523084 464053 448991 509177 538704 463037 344678 282503 212659 120583 87651 96429
11039 96429 73847 16236 -16019 27073 -18423 -59455 -97083 -133997 -151087 -213329 -304763 -288661
11027 -288661 -280452 -269826 -359435 -401834 -426009 -439414 -517592 -573568 -593996 -606575 -639344 -713623
11015 -713623 -793112 -835935 -855919 -873870 -890368 -867019 -859645 -908412 -927912 -922169 -902954 -933648
$$ packed form
11093C700069L48808K79265J50231M9240j59711m76165n66255l68736l57566k79409
11083B319771k07865j34572j71788j09983j07695n8662k3681n2271r6036q8153
11073A269065k9530n2914N8849p8283j24336j13994o2017j23950O0300L7161o7550
11062G72801j3502l7729N2039k5598n3768L3753o0353k285k2927o7630k8097k3620
11050E23084n9031j5062O0186K9527p5667j18359o2175o9844r2076l2932Q778
11039I6429k2582n7611l2255M3092m5496m1032l7628l6914j7090o2242r1434J6102
11027b88661Q209J0626q9609m2399k4175j3405p8178n5976k0428j2579l2769p4279
11015g13623p9489m2823j9984j7951j6498K3349P374m8767j9500N743J9215l0694
$$ plain form
11003 -933648 -1026314 -1066754 -1135750 -1188337 -1122705 -1100775 -1148599 -1156876 -1179017 -1199588 -1200508 -1194118
10991 -1194118 -1169926 -1174332 -1197235 -1255383 -1281912 -1318421 -1335376 -1304091 -1365452 -1415484 -1415658 -1401581
10979 -1401581 -1467935 -1517888 -1534614 -1563651 -1582563 -1590810 -1573419 -1538179 -1539256 -1492394 -1380878
10968 -1380878 -1266103 -1143549 -890694 -635634 -413045 -272480 -179436 -247313 -521506 -963067
10958 -963067 -1269168 -1505813 -1601137 -1661954 -1781141 -1830416 -1838372 -1942290 -1975001 -1943871 -1847157
10947 -1847157 -1714075 -1553428 -1366082 -1238283 -1102894 -1063258 -1129234 -1418313 -1619317 -1642496
10937 -1642496 -1584462 -1378597 -918126 -172788 721306 1657632 2991847 4856755 7316053
10928 7316053 10650734 14969531 19096275 22044702 24220548 24982156 22829127 19325743
$$ packed form
11003i33648r2666m0440o8996n2587O5632K1930m7824q277k2141k0571r20O390
10991a194118K4192m406k2903n8148k6529l6509j6955L1285o1361n0032j74J4077
10979a401581o6354m9953j6726k9037j8912q247J7391L5240j077M6862J11516
10968a380878J14775J22554K52855K55060K22589J40565R3044o7877k74193m41561
10958i63067l06101k36645r5324o0817j19187m9275p956j03918l2711L1130R6714
10947a847157J33082J60647J87346J27799J35389L9636o5976k89079k01004k3179
10937a642496N8034K05865M60471P45338Q94094R36326J334215J864908K459298
10928G316053L334681M318797M126744K948427K175846P61608k153029l503384
$$ plain form
10920 19325743 17057688 16529077 17808784 21034553 26538245 34470767 42814499 49051070
10912 49051070 53296025 55493447 52047170 43563360 36381088 32851405 32722149 35695119
10904 35695119 42384510 52903241 65197984 75004767 81216344 84844133 81867150 69201167
10896 69201167 55304685 45876271 40849235 39371030 41029465 45814310 52901371 59237461
10888 59237461 63091227 65178100 64178257 56539168 45868956 37832269 33006615 30574332
10880 30574332 30054906 31237428 33788486 36571495 38252716 38972440 38476518 35138274
10872 35138274 29499208 24501822 21007107 18588342 16931716 15753198 14764578 13882841
10864 13882841 13069707 12304556 11574338 10983741 10522236 10138838 9745365 9376370 9061540
$$ packed form
10920A9325743k268055n28611J279707L225769N503692P932522Q343732O236571
10912D9051070M244955K197422l446277q483810p182272l529683j29256K972970
10904C5695119O689391J0518731J2294743R806783O211577L627789k976983j2665983
10896F9201167j3896482r428414n027036j478205J658435M784845P087061O336090
10888E9237461L853766K086873r99843p639089j0670212q036687m825654k432283
10880C0574332n19426J182522K551058K783009J681221P19724m95922l338244
10872C5138274n639066m997386l494715k418765j656626j178518r88620q81737
10864A3882841q13134p65151p30218n90597m61505l83398l93473l68995l14830
$$ plain form
10855 9061540 8739269 8498152 8163871 7802359 7536510 7230874 6988022 6760290 6479407
10846 6479407 6182361 5960026 5866309 5726901 5553816 5407700 5186129 4997880 4826895 4588610
10836 4588610 4394375 4226067 4046199 3862254 3710780 3473617 3380733 3246977 3043624 2968398
10826 2968398 2886328 2845425 2777427 2640142 2465624 2418683 2361569 2248011 2078741 1909495
10816 1909495 1803437 1682416 1603283 1571263 1580832 1526460 1410539 1344303 1204905 1137901 1101421
10805 1101421 1032595 1002614 1010179 947587 889927 858411 790868 740264 680640 683536 680092 643031
10793 643031 564964 559193 593293 701525 700690 653593 681140 677294 638120 577006 531186 529625
10781 529625 504409 564446 597745 615733 575551 570845 387113 69308 -257994 -493453 -652077
$$ packed form
10855I061540l22271k41117l34281l61512k65849l05636k42852k27732k80883
10846F479407k97046k22335r3717j39408j73085j46116k21571j88249j70985k38285
10836D588610j94235j68308j79868j83945j51474k37163r2884j33756k03353p5226
10826B968398q2070m0903o7998j37285j74518m6941n7114j13558j69270j69246
10816A909495j06058j21021p9133l2020R569n4372j15921o6236j39398o7004l6480
10805A101421o8826k9981P565o2592n7660l1516o7543n0604n9624K896l444l7061
10793F43031p8067n771L4100J08232q35m7097K7547l846l9174o1114m5820j561
10781E29625k5216O0037L3299J7988m0182m706j83732l17805l27302k35459j58624
$$ plain form
10770 -652077 -824378 -814808 -680254 -603520 -582416 -597174 -664670 -744071 -790074 -809865 -784403
10759 -784403 -839730 -908116 -974952 -1040611 -1036537 -1059024 -1117714 -1103481 -1060479 -1146125 -1180387 -1154868
10747 -1154868 -1196747 -1190201 -1266611 -1421537 -1494582 -1458458 -1379212 -1337219 -1361577 -1380429 -1361111
10736 -1361111 -1358864 -1404522 -1465097 -1467069 -1537559 -1652618 -1726143 -1780328 -1824167 -1832891 -1784554 -1790174
10724 -1790174 -1835359 -1852300 -1888007 -1999004 -2135029 -2190314 -2255273 -2320807 -2324977 -2379881 -2435848
10713 -2435848 -2416568 -2430568 -2468536 -2496936 -2507932 -2489151 -2418435 -2393854 -2300619 -2156489 -2111998
10702 -2111998 -2128337 -2281740 -2530655 -2805458 -3069461 -3329674 -3507730 -3641440 -3801436 -3900997
10692 -3900997 -3964569 -3973399 -3990657 -4029279 -4100560 -4149523 -4207542 -4345788 -4575467 -4761460 -4924858
$$ packed form
10770f52077j72301R570J34554P6734K1104j4758o7496p9401m6003j9791K5462
10759g84403n5327o8386o6836o5659M074k2487n8690J4233M3002q5646l4262K5519
10747a154868m1879O546p6410j54926p3045L6124P9246M1993k4358j8852J9318
10736a361111K247m5658o0575j972p0490j15059p3525n4185m3839q724M8337n620
10724a790174m5185j6941l5707j10997j36025n5285o4959o5534m170n4904n5967
10713b435848J9280j4000l7968k8400j0996J8781P0716K4581R3235J44130M4491
10702b111998j6339j53403k48915k74803k64003k60213j78056j33710j59996r9561
10692c900997o3572q830j7258l8622p1281m8963n8019j38246k29679j85993j63398
$$ plain form
10681 -4924858 -5032834 -5074233 -5175179 -5211869 -5198478 -5245717 -5324675 -5343627 -5350866 -5379152 -5355472
10670 -5355472 -5279508 -5082050 -4836476 -4533923 -4002403 -3293917 -2230802 -813238 990487
10661 990487 3122361 5614042 8737999 12654605 17389617 23617431 32295916 44196930
10653 44196930 60669219 83637303 116265343 163384392 230931182 319202093 409092778
10646 409092778 474267691 516477125 534706477 492456893 390989143 295337624 227497120
10639 227497120 181525406 149810899 127253348 110796183 98479513 89023641 81402760
10632 81402760 75061203 69706636 65161125 61218613 57571589 54068543 50925359 48200530
10624 48200530 45808728 43712071 41840552 40231317 38797443 37526708 36448829 35686760
$$ packed form
10681d924858j07976m1399j00946l6690J3391m7239p8958j8952p239k8286K3680
10670e355472P5964J97458K45574L02553N31520P08486J063115J417564J803725
10661I90487K131874K491681L123957L916606M735012O227814Q678485J1901014
10653D4196930J6472289K2968084L2628040M7119049O7546790Q8270911Q9890685
10646D09092778O5174913M2209434J8229352m2249584j01467750r5651519o7840504
10639B27497120m5971714l1714507k2557551j6457165j2316670r455872p620881
10632H1402760o341557n354567m545511l942512l647024l503046l143184k724829
10624D8200530k391802k096657j871519j609235j433874j270735j077879p62069
$$ plain form
10616 35686760 35137163 34678450 34462012 34538022 34626810 34443993 33882577 33063538 32057115
10607 32057115 30851617 29559264 28312284 27256319 26279459 25310812 24364853 23506670 22771119
10598 22771119 22104913 21459318 20758209 20017057 19338921 18700510 18085962 17508240 16916006
10589 16916006 16385723 15869909 15482389 15085308 14612038 14200520 13731665 13302286 12968320
10580 12968320 12677307 12355790 12003848 11729262 11470815 11186500 10927990 10752298 10519638
10571 10519638 10195539 9919665 9772724 9554857 9386605 9212410 8995296 8759207 8533697
10562 8533697 8385767 8238891 8121652 8040785 7912693 7739426 7570396 7394600 7262903 7178613
10552 7178613 7066767 6971887 6915952 6786261 6677226 6597210 6479767 6369194 6271052 6173271
$$ packed form
10616C5686760n49597m58713k16438P6010Q8788j82817n61416q19039j006423
10607C2057115j205498j292353j246980j055965r76860r68647r45959q58183p35551
10598B2771119o66206o45595p01109p41152o78136o38411o14548n77722n92234
10589A6916006n30283n15814l87520l97081m73270m11518m68855m29379l33966
10580A2968320k91013l21517l51942k74586k58447k84315k58510j75692k32660
10571A0519638l24099k75874j46941k17867j68252j74195k17114k36089k25510
10562H533697j47930j46876j17239q0867j28092j73267j69030j75796j31697q4290
10552G178613j11846r4880n5935j29691j09035q0016j17443j10573r8142r7781
$$ plain form
10542 6173271 6020617 5974744 5945966 5915992 5957147 5892851 5861832 5797897 5788278 5863483 5859523
10531 5859523 5753481 5680122 5718869 5792870 5822747 5857918 5981728 6132198 6236735 6423995
10521 6423995 6562034 6627004 6626553 6572674 6413725 6151330 5844953 5616845 5583872 5554788 5656734
10510 5656734 5827716 6072708 6179375 6173408 6080868 5805289 5448110 5104066 4876651 4679073
10500 4679073 4512808 4427544 4326851 4205947 4131964 4085523 4061367 4136222 4142516 4147507 4203337
10489 4203337 4264783 4218390 4197674 4142442 4052280 4002350 3923081 3962848 4001269 4040677 4084394
10478 4084394 4109591 4091854 4057256 4047323 4020957 4026821 3985027 3904149 3845958 3833544 3901372 3898002
10466 3898002 3951520 3959014 3985330 3983896 3987188 3957569 3878423 3789467 3756692 3717633 3737091 3724303
$$ packed form
10542F173271j52654m5873k8778k9974M1155o4296l1019o3935r619P5205l960
10531E859523j06042p3359L8747P4001K9877L5171J23810J50470J04537J87260
10521F423995J38039O4970m51n3879j58949k62395l06377k28108l2973k9084J01946
10510E656734J70982K44992J06667n967r2540k75579l57179l44044k27415j97578
10500D679073j66265q5264j00693j20904p3983m6441k4156P4855O294M991N5830
10489D203337O1446m6393k0716n5232r0162m9930p9269L9767L8421L9408M3717
10478D084394K5197j7737l4598r933k6366N864m1794q0878n8191j2414O7828l370
10466C898002N3518P494K6316j434L292k9619p9146q8956l2775l9059J9458j2788
$$ plain form
10454 3724303 3668888 3614630 3602297 3644433 3661089 3618205 3582185 3608196 3578798 3444081 3340121
10443 3340121 3313833 3310494 3346573 3371977 3383756 3405725 3375714 3347091 3269656 3222950 3166084
10432 3166084 3204808 3182292 3117401 3060560 3026005 2977718 3017720 3044528 3011631 2937682 2955325
10421 2955325 2958735 2994406 2989019 2955276 2950176 2882190 2848675 2764206 2729097 2705141 2703813 2716561
10409 2716561 2702622 2703326 2682733 2742972 2710707 2711173 2661994 2655196 2662709 2637057 2636824 2676026 2692686
10396 2692686 2643632 2591150 2570252 2549340 2529273 2488539 2442569 2442181 2459335 2526901 2542186 2494350
10384 2494350 2480961 2472558 2454991 2448035 2445875 2453802 2385682 2335094 2281952 2288161 2295623 2265721
10372 2265721 2190942 2195148 2232839 2181159 2104360 2145034 2129927 2102464 2109997 2142954 2093481 2123600
$$ packed form
10454C724303n5415n4258j2333M2136J6656m2884l6020K6011k9398j34717j03960
10443C340121k6288l339L6079K5404J1779K1969l0011k8623p7435m6706n6866
10432C166084L8724k2516o4891n6841l4555m8287M0002K6808l2897p3949J7643
10421B955325L410L5671n387l3743n100o7986l3515q4469l5109k3956j328J2748
10409B716561j3939P04k0593O0239l2265M66m9179o798P513k5652k33L9202J6660
10396B692686m9054n2482k0898k0912k0067m0734m5970l88J7154O7566J5285m7836
10384B494350j3389q403j7567o956k160P927o8120n0588n3142O209P462k9902
10372B265721p4779M206L7691n1680p6799M0674j5107k7463P533L2957m9473L0119
$$ plain form
10360 2123600 2133286 2072055 2116723 2134699 2055565 2006047 1968027 1971969 2028345 1967544 1969751 2037680
10348 2037680 2105933 2031206 1968897 2011838 2073892 2106577 2011398 1990201 2030091 2019846 2018808
10337 2018808 2031680 1979938 1919660 1935455 1876146 1853615 1907721 1951496 1972823 1959142 1945178
10326 1945178 1946342 2022884 2015615 2019603 2002070 1911076 1901937 1905560 1951102 1971184 1969056 1932954
10314 1932954 1887104 1911267 1959014 1944751 1893624 1885095 1870222 1885447 1863268 1888097 1930102
10303 1930102 1938840 1909309 1880700 1870123 1880009 1829478 1783718 1779028 1826670 1819818 1816756 1804966
10291 1804966 1828299 1902736 1820224 1813739 1811910 1812039 1749262 1759004 1791744 1763389 1759365 1779189
10279 1779189 1734002 1760966 1735691 1713647 1730882 1747240 1791726 1833473 1788178 1773316 1808545
$$ packed form
10360B123600R686o1231M4668J7976p9134m9518l8020L942N6376o0801K207O7929
10348B037680O8253p4727o2309M2941O2054L2685r5179k1197L9890j0245j038
10337B018808J2872n1742o0278J5795n9309k2531N4106M3775K1327j3681j3964
10326A945178J164P6542p269L988j7533r0994r139L623M5542K0082k128l6102
10314A932954m5850K4163M7747j4263n1127q529j4873J5225k2179K4829M2005
10303A930102Q738k9531k8609j0577R886n0531m5760m690M7642o852l062j1790
10291A804966K3333P4437q2512o485j829J29o2777R742L2740k8355m024J9824
10279A779189m5187K6964k5275k2044J7235J6358M4486M1747m5295j4862L5229
$$ plain form
10268 1808545 1845958 1830412 1848464 1824618 1767751 1777801 1802751 1734430 1741836 1721963 1713041 1715726
10256 1715726 1649157 1625830 1678000 1663801 1596722 1602532 1658925 1665082 1653365 1593508 1559015 1490316
10244 1490316 1414862 1450013 1493587 1511888 1473130 1424821 1457448 1478584 1496010 1451832 1359174
10233 1359174 1353093 1454636 1486207 1506216 1516787 1440958 1423024 1454976 1540354 1569864 1513661
10222 1513661 1551705 1566375 1564943 1575292 1532493 1522325 1513971 1502977 1514750 1500150 1503838 1487976
10210 1487976 1444343 1475470 1489818 1495183 1505141 1495932 1529268 1589650 1718014 1820718 1849403
10199 1849403 1981791 2258342 2628378 3055625 3457512 3708857 3951681 4091821 3997239 3637599
10189 3637599 3133670 2736007 2452757 2305391 2161547 2037494 1986604 1927217 1836412 1784674
$$ packed form
10268A808545L7413j5546J8052k3846n6867J0050K4950o8321P406j9873q922K685
10256A715726o6569k3327N2170j4199o7079N810N6393O157j1717n9857l4493o8699
10244A490316p5454L5151M3574J8301l8758m8309L2627K1136J7426m4178r2658
10233A359174o081J01543L1571K0009J0571p5829j7934L1952Q5378K9510n6203
10222A513661L8044J4670j432J0349m2799j0168q354j0994J1773j4600L688j5862
10210A487976m3633L1127J4348N365R958r209L3336O0382J28364J02704K8685
10199A849403J32388K76551L70036M27247M01887K51345K42824J40140r4582l59640
10189C637599n03929l97663k83250j47366j43844j24053n0890n9387r0805n1738
$$ plain form
10179 1784674 1741995 1725313 1678944 1632385 1595964 1636115 1568462 1560349 1567238 1573636 1598094 1624873
10167 1624873 1631964 1638075 1562939 1501615 1512353 1538466 1554710 1524746 1528489 1528166 1552906 1495431
10155 1495431 1505357 1548216 1572231 1551620 1504876 1458802 1448173 1457022 1489032 1532820 1489880 1465021
10143 1465021 1451310 1447240 1431589 1397435 1413492 1413362 1414147 1447515 1442811 1468064 1468343 1460727 1401230
10130 1401230 1333018 1296129 1205655 1210538 1289389 1267808 1237069 1253826 1287138 1286454 1297835 1264874
10118 1264874 1261661 1281932 1176893 1136544 1123968 1109890 1162487 1227458 1183134 1140256 1112183
10107 1112183 1068302 1051228 1082643 1137230 1175082 1201522 1231422 1258527 1226841 1213752 1262913
10096 1262913 1245131 1222740 1221999 1253898 1225787 1221532 1144857 1066356 1098999 1227019 1253044 1234909
$$ packed form
10179A784674m2679j6682m6369m6559l6421M0151o7653q113O889O398K4458K6779
10167A624873P091O111p5136o1324J0738K6113J6244k9964L743l23K4740n7475
10155A495431R926M2859K4015k0611m6744m6074j0629Q849L2010M3788m2940k4859
10143A465021j3711m070j5651l4154J6057j30P85L3368m704K5253K79p616n9497
10130A401230o8212l6889r0474M883P8851k1581l0739J6757L3312o84J1381l2961
10118A264874l213K0271j05039m0349j2576j4078N2597O4971m4324m2878k8073
10107A112183m3881j7074L1415N4587L7852K6440K9900K7105l1686j3089M9161
10096A262913j7782k2391p41L1899k8111m255p6675p8501L2643J28020K6025j8135
$$ plain form
10084 1234909 1216483 1250175 1232049 1250811 1280535 1273860 1281824 1282295 1206809 1134976 1094990 1145489
10072 1145489 1224055 1158476 1129384 1138336 1134453 1089685 1079446 1172447 1261151 1280070 1246133 1187129
10060 1187129 1181504 1178196 1173710 1133802 1109239 1155113 1172295 1135174 1132548 1112263 1091428 1099360
10048 1099360 1084299 1032362 1024564 1076390 1076446 1112603 1113028 1126666 1125282 1085339 1085786 1138072 1108183
10035 1108183 1052790 1018798 1071974 1124766 1114224 1062678 1045194 1045172 1101243 1146267 1193345 1181825
10023 1181825 1158367 1101132 1062616 1080721 1052767 1034166 1060776 1041010 1087668 1105566 1120000
10012 1120000 1142062 1106231 1041457 967342 974353 1007302 987334 1026726 1072658 1064972 1087518 1152688
10000 1152688 1164847 1097286 1057584 1053480 987911 991992 993311 1002829 997239 1022883 995593 989534
$$ packed form
10084A234909j8426L3692j8126J8762K9724o675P964M71p5486p1833l9986N0499
10072A145489P8566o5579k9092Q952l883m4768j0239R3001Q8704J8919l3937n9004
10060A187129n625l308m486l9908k4563M5874J7182l7121k626k0285k0835P932
10048A099360j5061n1937p798N1826N6L6157M25J3638j384l9943M47N2286k9889
10035A108183n5393l3992N3176N2792j0542n1546j7484k2N6071M5024M7078j1520
10023A181825k3458n7235l8516J8105k7954j8601K6610j9766M6658J7898J4434
10012A120000K2062l5831o4774p4115P011L2949j9968L9392M5932p686K2546O5170
10000A152688J2159o7561l9702m104o5569M081J319R518n590K5644k7290o059
$$ plain form
9988 989534 979443 969300 954249 933830 949109 907161 889901 881931 879189 928578 906136 932268
9976 932268 860748 823802 849315 870565 851176 865152 875391 893058 979213 982805 1007513 1002937
9964 1002937 850136 788846 810278 888180 961279 1035135 1064078 1047288 1017837 948068 892323
9953 892323 926321 888149 835965 868712 877122 889034 907583 909140 907523 894228 951138 949958
9941 949958 910110 882009 863386 830874 846145 943850 990297 945414 869514 851268 847559 834748
9929 834748 903053 934870 931837 831232 731490 732183 770405 785462 854521 896289 895055 906005
9917 906005 950690 970552 1004272 1022793 1147899 1271386 1354012 1358568 1307248 1165943 1122740
9906 1122740 1084652 1037984 1011444 982195 957715 991082 1020255 998630 977996 972327 945619 923648
$$ packed form
9988I89534j0091j0143j5051k0419J5279m1948j7260p970k742M9389k2442K6132
9976I32268p1520l6946K5513K1250j9389J3976J0239J7667Q6155L592K4708m576
9964A002937j52801o1290K1432P7902P3099P3856K8943j6790k9451o9769n5745
9953H92323L3998l8172n2184L2747Q410J1912J8549J557j617j3295N6910j180
9941I49958l9848k8101j8623l2512J5271R7705M6447m4883p5900j8246l709j2811
9929H34748O8305L1817l033j00605r9742O93L8222J5057O9059M1768j234J0950
9917I06005M4685J9862L3720J8521J25106J23487Q2626M556n1320j41305m3203
9906A122740l8088m6668k6540k9249k4480L3367K9173k1625k0634n669k6708k1971
$$ plain form
9894 923648 919725 895082 842962 894173 1029113 1030331 957786 920788 857784 867447 859112 837725
9882 837725 856174 887541 829213 861697 884840 894619 863855 845274 865705 928687 875831 811199
9870 811199 735996 727670 700157 746491 810178 807386 724399 717447 767067 795920 838977 838197 815140
9857 815140 720160 648006 640016 715918 773368 773779 754626 763858 755572 704017 710865 698952 714338
9844 714338 735936 775786 742220 721795 713158 709637 764951 831939 810529 770512 792995 861195
9832 861195 841749 851221 803774 752176 798853 836574 860814 848701 843976 856784 848239 829561
9820 829561 794588 709386 707153 724422 710943 708263 709948 662280 662547 660849 523119 569631 663366
9807 663366 701855 693761 676380 702247 711273 716696 734800 745013 710969 720760 769718 849842
$$ packed form
9894I23648l923k4643n2120N1211J34940J218p2545l6998o3004R663q335k1387
9882H37725J8449L1367n8328L2484K3143R779l0764j8581K0431O2982n2856o4632
9870H11199p5203q326k7513M6334O3687k792q2987o952M9620K8853M3057p80k3057
9857H15140r4980p2154p990P5902N7450M11j9153R232q286n1555O848j1913J5386
9844G14338K1598L9850l3566k0425q637l521N5314O6988k1410m0017K2483O8200
9832H61195j9446R472m7447n1598M6677L7721K4240j2113m725J2808q545j8678
9820H29561l4973q5202k233J7269j3479k680J685m7668K67j698j37730M6512R3735
9807F63366L8489q094j7381K5867R026N423J8104J0213l4044R791M8958Q0124
$$ plain form
9795 849842 833134 727067 703240 701641 672151 648457 682362 720338 811358 842246 796138 810236
9783 810236 803520 800833 831909 839011 834728 762485 704047 708722 719355 677658 680086 717412 749968
9770 749968 739578 692283 687760 687044 664276 668961 654520 672106 649716 615120 595163 580766
9758 580766 594579 650834 677832 642688 604235 549943 549332 609766 686865 736648 779179 877420
9746 877420 995289 1185403 1377254 1575735 1722358 1816356 1799425 1715582 1463801 1190832
9736 1190832 1087506 994497 955698 993179 903492 818819 786592 780254 708865 765002 835039
9725 835039 806140 746810 706487 699019 631836 631286 714715 829322 880975 875288 850516 796080
9713 796080 799802 750038 795087 843830 821874 804911 802998 835324 843619 840065 803084 769206
$$ packed form
9795H49842j6708j06067k3827j599k9490k3694L3905L7976R1020L0888m6108J4098
9783H10236o716k687L1076P102m283p2243n8438M675J0633m1697K428L7326L2556
9770G49968j0390m7295m523p16k2768M685j4441J7586k2390l4596j9957j4397
9758E80766J3813N6255K6998l5144l8453n4292o11O0434P7099M9783M2531R8241
9746H77420J17869J90114J91851J98481J46623R3998j6931q3843k51781k72969
9736A190832j03326r3009l8799L7481q9687q4673l2227o338p1389N6137P0037
9725H35039k8899n9330m0323p468o7183n50Q3429J14607N1653n687k4772n4436
9713G96080L722m9764M5049M8743k1956j6963j913L2326Q295l554l6981l3878
$$ plain form
9701 769206 736024 711797 748747 718041 695822 680709 684077 643880 652815 652414 660528 628886 675362
9688 675362 684451 715527 742220 689422 654490 669546 755797 822626 860943 809993 772551 770958
9676 770958 719983 758728 750271 714201 680776 616402 629339 653235 649173 605281 629746 580706
9664 580706 640924 670849 651218 620715 597427 678926 732109 730756 619637 598355 637813 669115
9652 669115 691972 689825 713414 753071 818342 824633 756164 710529 659679 649706 689861 662991
9640 662991 673876 635973 631327 591325 618152 647522 636504 638346 661728 693595 642993 552094
9628 552094 528093 580882 649651 722929 670746 554861 567052 638873 661235 651402 650125 665961
9616 665961 668320 637344 613471 638550 682907 626428 563676 514189 483564 446356 479406 532125
$$ packed form
9701G69206l3182k4227L6950l0706k2219j5113L368m0197Q935m01Q114l1642M6476
9688F75362R089L1076K6693n2798l4932J5056Q6251O6829L8317n0950l7442j593
9676G70958n0975L8745q457l6070l3425o4374J2937K3896m062m3892K4465m9040
9664E80706O0218K9925j9631l0503k3288Q1499N3183j353j11119k1282L9458L1302
9652F69115K2857k147K3589L9657O5271O291o8469m5635n0850r973M0155k6870
9640F62991J0885l7903m646m0002K6827K9370j1018J842K3382L1867n0602r0899
9628E52094k4001N2789O8769P3278n2183j15885J2191P1821K2362r833j277J5836
9616F65961K359l0976k3873K5079M4357n6479o2752m9487l0625l7208L3050N2719
$$ plain form
9604 532125 535440 606129 634712 622893 643696 680898 596868 533993 528879 457256 487324 505452
9592 505452 559790 645244 733535 690756 648079 635025 637275 577069 577362 650219 611027 614870
9580 614870 580540 627410 671552 569136 569479 594811 556337 578830 597841 594211 548102 539925
9568 539925 626425 643753 574763 549461 605227 614238 638481 634653 680078 669608 654266 614583
9556 614583 568131 510531 497819 495541 441166 447127 515853 583876 622797 648189 664503 607829
9544 607829 612167 644621 638951 682152 695848 654074 606883 546552 473671 469166 540839 560940
9532 560940 553465 579186 565827 566640 556986 505645 535418 576103 559824 553024 562860 508375 544692
9519 544692 585104 523149 515723 513112 535789 532130 567495 518766 505456 543773 520565 555695
$$ packed form
9604E32125L315P0689K8583j1819K0803L7202q4030o2875n114p1623L0068J8128
9592E05452N4338Q5454Q8291m2779m2677j3054K250o0206K93P2857l9192L843
9580F14870l4330M6870M4142j02416L43K5332l8474K2493J9011l630m6109q177
9568E39925Q6500J7328o8990k5302N5766R011K4243l828M5425j0470j5342l9683
9556F14583m6452n7600j2712k278n4375N961O8726O8023L8921K5392J6314n6674
9544F07829M338L2454n670M3201J3696m1774m7191o0331p2881m505P1673K0101
9532E60940p475K5721j3359Q13r654n1341K9773M0685j6279o800R836n4485L6317
9519E44692M0412o1955p426k611K2677l659L5365m8729j3310L8317k3208L5130
$$ plain form
9507 555695 576982 532761 446173 378624 310509 399668 479866 540687 624920 633598 569425 528523
9495 528523 525900 626905 704238 659254 589179 498011 454221 420851 455335 491918 500239 516766
9483 516766 488241 523868 517888 518276 539935 565624 522981 524321 531718 548307 596592 595906 570296
9470 570296 489782 490230 542459 492841 527930 575612 565674 491046 510492 570107 616869 631514
9458 631514 589118 560385 538533 532213 509776 523440 547188 511845 528321 490533 484492 472563
9446 472563 461445 475345 536377 493219 470494 496393 472393 442721 407642 470934 506713 506216
9434 506216 476283 457096 449887 483975 523997 590867 576312 555245 514583 431086 385279 446832
9422 446832 513662 527776 483478 438046 448696 493126 502145 398913 347912 350778 342782 320934
$$ packed form
9507E55695K1287m4221q6588o7549o8115Q9159Q0198O0821Q4233Q678o4173m0902
9495E28523k623J01005P7333m4984p0075r1168m3790l3370L4484L6583Q321J6527
9483E16766k8525L5627n980L88K1659K5689m2643J340P397J6589M8285o86k5610
9470E70296q0514M48N2229m9618L5089M7682r938p4628J9446N9615M6762J4645
9458F31514m2396k8733k1852o320k2437J3664K3748l5343J6476l7788o041j1929
9446D72563j1118J3900O1032m3158k2725K5899k4000k9672l5079O3292L5779m97
9434E06216k9933j9187p209L4088M0022O6870j4555k1067m0662q3497m5807O1553
9422D46832O6830J4114m4298m5432J0650M4430R019j03232n1001K866p996k1848
$$ plain form
9410 320934 364031 415728 442676 438579 483025 523057 545110 529118 566098 517547 450089 452222
9398 452222 491496 510496 496643 438152 435992 396871 380705 373938 403567 443768 471163 539193
9386 539193 495539 483737 435396 454055 486143 520791 519327 499887 479510 426170 432100 456972
9374 456972 464980 470387 373807 317473 347898 378073 408855 393726 419048 445507 397384 359809
9362 359809 362492 384395 414637 359251 257711 312145 392629 404597 449228 488383 473613 444902
9350 444902 430194 469149 426746 400091 397428 413364 512804 535028 529841 485560 406809 440554
9338 440554 453316 414777 390136 386175 402976 430951 428628 422149 452488 534496 627878 587030
9326 587030 532665 479808 485044 491813 471639 414420 381232 429228 413152 355610 338137 328681
$$ packed form
9410C20934M3097N1697K6948m097M4446M0032K2053j5992L6980m8551o7458K133
9398D52222L9274J9000j3853n8491k160l9121j6166o767K9629M0201K7395O8030
9386E39193m3654j1802m8341J8659L2088L4648j464j9440k0377n3340N930K4872
9374D56972Q008N407r6580n6334L0425L0175L0782j5129K5322K6459m8123l7575
9362C59809K683K1903L0242n5386j01540N4434Q0484J1968M4631L9155j4770k8711
9350D44902j4708L8955m2403k6655k663J5936R9440K2224n187m4281p8751L3745
9338D40554J2762l8539k4641l961J6801K7975k323o479L0339Q2008R3382m0848
9326E87030n4365n2857N236O769k0174n7219l3188M7996j6076n7542j7473r456
$$ plain form
9314 328681 285201 313178 380789 440874 482638 487005 401245 421820 444796 415330 404286 404199
9302 404199 364340 361997 392874 446993 460468 497040 512298 457430 460565 498822 504857 444395
9290 444395 355096 305596 345500 356645 426933 516547 554311 449487 437341 437156 437707 442869
9278 442869 380859 334510 343811 387320 396831 411632 422369 403520 385233 366924 401605 449201
9266 449201 487669 521108 482142 520317 488270 461268 505707 524650 467808 416960 429096 385382
9254 385382 343678 303684 282836 367317 447582 432944 459109 517128 448764 387496 388513 355390
9242 355390 334389 342694 333711 362891 415528 364705 296639 286591 294140 331109 308607 391508
9230 391508 391613 383314 427035 392376 395351 422527 382760 424951 436586 389667 300864 284365
$$ packed form
9314C28681m3480K7977O7611O0085M1764M367q5760K0575K2976k9466j1044q7
9302D04199l9859k343L0877N4119J3475L6572J5258n4868L135L8257O035o0462
9290D44395q9299m9500L9904J1145P0288Q9614L7764j04824j2146j85N51N162
9278D42869o2010m6349R301M3509R511J4801J0737j8849j8287j8309L4681M7596
9266D49201L8468L3439l8966L8175l2047k7002M4439J8943n6842n0848J2136m3714
9254C85382m1704l9994k0848Q4481Q0265j4638K6165N8019o8364o1268J017l3123
9242C55390k1001Q305q983K9180N2637n0823o8066j0048P549L6969k2502Q2901
9230C91508J05q299M3721l4659K975K7176l9767M2191J1635m6919q8803j6499
$$ plain form
9218 284365 311409 374688 406543 433830 460677 419898 414052 457806 468747 469616 428730 368916
9206 368916 455086 493431 468943 478273 471991 450394 449958 465430 463444 470528 421280 380681 354426
9193 354426 368520 357141 369707 429601 386682 296899 322370 372772 341526 364845 414165 406795
9181 406795 396012 376252 316671 294225 325100 372357 408383 409546 411656 388761 377997 351277
9169 351277 414853 427594 386069 358435 408576 391340 294196 211801 246262 306614 328580 337770
9157 337770 328709 352078 441092 450079 435092 388959 409745 407454 378413 340970 329423 287343
9145 287343 319350 325415 406269 434168 415292 353164 317904 289107 244023 247042 323111 372969
9133 372969 365794 317839 315489 306668 310053 341849 475518 538462 484757 473991 450668 430442
$$ packed form
9218B84365K7044O3279L1855K7287K6847m0779n846M3754J0941Q69m0886n9814
9206C68916Q6170L8345k4488R330o282k1597m36J5472j986P084m9248m0599k6255
9193C54426J4094j1379J2566N9894m2919q9783K5471N0402l1246K3319M9320p370
9181D06795j0783j9760n9581k2446L0875M7257L6026J163K110k2895j0764k6720
9169C51277O3576J2741m1525k7634N0141j7236r7144q2395L4461O0352K1966R190
9157C37770r061K3369Q9014Q987j4987m6133K0786k291k9041l7443j1547m2080
9145B87343L2007O065Q0854K7899j8876o2128l5260k8797m5084L019P6069M9858
9133C72969p175m7955k350q821L385L1796J33669O2944n3705j0766k3323k0226
$$ plain form
9121 430442 378550 368173 371123 398119 408999 366815 327759 242811 249287 308927 371123 430924
9109 430924 439035 415296 422103 422641 417585 412322 415700 408757 396266 357979 374108 413639 399835
9096 399835 409012 319746 319036 298126 242229 268209 335079 367063 425756 419833 335052 314990
9084 314990 350319 346454 308579 322548 374359 372306 407946 439342 416050 407103 363088 358467
9072 358467 328520 345442 316653 348300 349769 276494 288589 326996 289673 268440 324553 368380
9060 368380 328581 315352 278329 317391 302935 273952 244061 258888 319925 380575 386134 433327
9048 433327 449550 439182 381777 375464 395132 350773 371362 331954 342911 349637 346408 370653
9036 370653 351042 346349 401028 450480 488981 431962 440440 458792 394876 326007 354152 325421
$$ packed form
9121D30442n1892j0377K950K6996J0880m2184l9056q4948O476N9640O2196N9801
9109D30924Q111k3739O807N38n056n263L378o943j2491l8287J6129L9531j3804
9096C99835R177q9266p10k0910n5897K5980O6870L1984N8693n923q4781k0062
9084C14990L5329l865l7875J3969N1811k053L5640L1396k3292q947m4015m621
9072C58467k9947J6922k8789L1647J469p3275J2095L8407l7323k1233N6113M3827
9060C68380l9799j3229l7023L9062j4456k8983k9891J4827O1037O0650N559M7193
9048D33327J6223j0368n7405o313J9668m4359K0589l9408J0957O726l229K4245
9036C70653j9611m693N4679M9452L8501n7019Q478J8352o3916o8869K8145k8731
$$ plain form
9024 325421 246134 248695 291676 345570 342147 329633 366195 434548 462481 372243 265506 188221
9012 188221 201868 227589 251154 278533 302092 288988 240036 218553 202220 288048 343441 354378
9000 354378 371398 340333 290787 288882 260779 265864 369763 407209 361121 358827 365920 345684
8988 345684 335686 366127 417535 367178 282499 210787 217058 271395 267408 211924 194120 252433
8976 252433 265515 267153 267323 300803 264006 293338 288459 281048 229706 220150 266978 296999 316701
8963 316701 239888 190294 286932 313931 321841 354025 242895 243814 324817 339010 310439 333993
8951 333993 292636 254684 252534 267692 264324 258708 292821 293052 322267 312021 260917 251543 336730
8938 336730 333729 356714 409245 415929 365990 244793 178862 195097 186880 157850 235536 246066
$$ packed form
9024C25421p9287K561M2981N3894l423j2514L6562O8353K7933r0238j06737p7285
9012A88221J3647K5721K3565K7379K3559j3104m8952k1483j6333Q5828N5393J0937
9000C54378J7020l1065m9546j905k8103N085J03899L7446m6088k294P093k0236
8988C45684r998L0441N1408n0357q4679p1712O271N4337l987n5484j7804N8313
8976B52433J3082J638J70L3480l6797K9332m879p411n1342r556M6828L0021J9702
8963C16701p6813m9594R6638K6999P910L2184j11130R19Q1003J4193k8571K3554
8951C33993m1357l7952k150J5158l368n616L4113K31K9215j0246n1104r374Q5187
8938C36730l001K2985N2531O684m9939j21197o5931J6235q217k9030P7686J0530
$$ plain form
8926 246066 195721 207379 245558 242317 271534 282038 315232 287004 275447 265449 283191 317152
8914 317152 324120 293334 291656 309148 331512 299556 273664 285180 259679 262740 276278 288437
8902 288437 260008 238596 291020 293394 312525 266647 233379 263195 274724 254382 271911 256257
8890 256257 244275 227496 215040 209046 183371 178321 238567 296785 298262 285312 265156 294583
8878 294583 319046 301798 199112 95338 120910 215175 209611 147109 14721 110945 195360
8867 195360 317826 395841 445664 386727 260697 223904 227529 240891 244868 233818 208666 157112
8855 157112 142805 147895 234724 295841 312061 317939 294798 338629 420866 382068 361696 282853
8843 282853 220807 178786 154613 142834 139158 186156 235199 246387 207669 192385 211073 175386
$$ packed form
8926B46066n0345J1658L8179l241K9217J0504L3194k8228j1557r998J7742L3961
8914C17152O968l0786j678J7492K2364l1956k5892J1516k5501L061J3538J2159
8902B88437k8429k1412N2424K374J9131m5878l3268K9816J1529k0342J7529j5654
8890B56257j1982j6779j2456n994k5675n050O0246N8218J477j2950k0156K9427
8878B94583K4463j7248j02686j03774K5572R4265n564o2502j32388R6224Q4415
8867A95360J22466P8015M9823n8937j26030l6793L625J3362L977j1050k5152n1554
8855A57112j4307N090Q6829O1117J6220N878k3141M3831Q2237l8798k0372p8843
8843B82853o2046m2021k4173j1779l676M6998M9043J1188l8718j5284J8688l5687
$$ plain form
8831 175386 119206 145751 128742 120514 255701 269049 260571 290770 287079 307185 369776 334877
8819 334877 290609 315248 309187 284857 232174 224496 240192 226720 240581 236089 209621 204179
8807 204179 214181 132975 152998 153646 158962 172709 162341 233392 325321 348640 330995 262055
8795 262055 217007 288655 344127 316606 244262 250338 224693 225057 223753 140298 186937 292742
8783 292742 322257 264980 287461 337217 343331 367823 325655 302363 296971 281008 293151 271606
8771 271606 250636 265609 271042 258808 200999 141801 131940 157972 207451 198664 251167 205250
8759 205250 168948 144782 112420 135882 157567 169165 173186 150596 218426 266206 239158 203340
8747 203340 252386 272056 200496 172433 197767 253180 243271 251590 266736 248370 220427 230835
$$ packed form
8831A75386n6180K6545j7009q228J35187J3348q478L0199l691K0106O2591l4899
8819C34877m4268K4639o061k4330n2683p678J5696j3472J3861m492k6468n442
8807B04179J0002q1206K0023O48N316J3747j0368P1051R1929K3319j7645o8940
8795B62055m5048P1648N5472k7521p2344O076k5645L64j304q3455M6639J05805
8783B92742K9515n7277K2481M9756O114K4492m2168k3292n392j5963J2143k1545
8771B71606k0970J4973N433j2234n7809n9198r861K6032M9479q787N2503m5917
8759B05250l6302k4166l2362K3462K1685J1598M021k2590O7830M7780k7048l5818
8747B03340M9046J9670p1560k8063K5334N5413r909Q319J5146j8366k7943J0408
$$ plain form
8735 230835 360663 367599 308903 298278 235836 188006 263301 340575 377703 437676 498908 585708
8723 585708 658236 785207 976029 1136283 1279545 1350596 1360352 1346927 1213991 1052021 943293
8712 943293 742836 673512 564081 431459 440903 434395 385898 425787 429490 437733 460914 384929
8700 384929 372573 406471 358632 333028 289722 272338 267121 265898 278988 341004 405706 414906
8688 414906 452087 363465 388061 415074 385992 406430 490550 542142 589743 712900 819581
8677 819581 995161 1338512 1751629 2190338 2574594 2803354 2890149 2671433 2358125 2047844
8667 2047844 1749412 1468393 1237042 1042432 926463 823903 765166 712553 712013 656655 624099
8656 624099 591144 552778 527780 595355 535850 444315 493680 475108 377393 388465 417721 416562
$$ packed form
8735B30835J29828O936n8696j0625o2442m7830P5295P7274L7128N9973O1232Q6800
8723E85708P2528J26971J90822J60254J43262P1051R756j3425j32936j61970j08728
8712I43293k00457o9324j09431j32622R444o508m8497L9889L703Q243K3181p5985
8700C84929j2356L3898m7839k5604m3306j7384n217j223J3090O2016O4702R200
8688D14906L7181q8622K4596K7013k9082K0438Q4120N1592M7601J23157J06681
8677H19581J75580L43351M13117M38709L84256K28760Q6795k18716l13308l10281
8667B047844k98432k81019k31351j94610j15969j02560n8737n2613n40n5358l2556
8656F24099l2955l8366k4998O7575n9505r1535M9365j8572r7715J1072K9256j159
$$ plain form
8644 416562 453732 485173 459354 442585 478582 494946 491842 504666 493079 485012 536203 591252
8632 591252 638942 748330 930640 1100679 1202149 1368299 1489644 1575270 1527295 1407611
8622 1407611 1235802 1037819 855943 722145 696621 697042 706912 662472 629782 555571 527161
8611 527161 546816 562436 521667 498045 482575 477263 421169 323854 295502 318171 359356 394619
8599 394619 366809 377644 401537 403531 386015 384327 373389 341545 359363 365622 414890 409595
8587 409595 372887 365067 355088 396542 415292 359130 285160 209640 188220 209082 247951 335852
8575 335852 430077 430203 411740 444243 424031 389872 423874 457579 469730 395482 328831 251117
8563 251117 236892 255424 317759 404564 438183 382195 299699 298060 254168 231125 226343 227237
$$ packed form
8644D16562L7170L1441k5819j6769L5997J6364l104J2824j1587q067N1191N5049
8632E91252M7690J09388J82310J70039J01470J66150J21345Q5626m7975j19684
8622A407611j71809j97983j81876j33798k5524M21R870m4440l2690p4211k8410
8611E27161J9655J5620m0769k3622j5470n312n6094r7315k8352K2669M1185L5263
8599C94619k7810J0835K3893J994j7516j688j0938l1844J7818O259M9268n295
8587D09595l6708p820r979M1454J8750n6162p3970p5520k1420K0862L8869Q7901
8575C35852R4225J26j8463L2503k0212l4159L4002L3705J2151p4248o6651p7714
8563B51117j4225J8532O2335Q6805L3619n5988q2496j639m3892k3043m782Q94
$$ plain form
8551 227237 219311 222913 230348 255868 219603 226987 246916 232343 226786 218826 252735 306339 265375
8538 265375 222522 246278 215120 223219 280026 316295 304689 326405 287507 241819 305713 320098
8526 320098 312564 300993 231106 249246 324094 285161 284763 322380 340150 320904 234421 242631
8514 242631 272464 318150 339298 323694 293729 260267 222653 195835 263190 250341 238341 234363
8502 234363 234734 273445 359908 416048 443633 493925 505814 488577 484524 444697 422229 482019
8490 482019 487911 455928 365662 337222 301271 232664 210662 198538 166550 191314 182677 163426
8478 163426 129547 140984 193270 192167 148739 175508 235179 310348 257594 201823 172539 187063
8466 187063 218312 243543 227309 235512 277973 235541 231318 209797 277363 325013 365650 411166
$$ packed form
8551B27237p926L602P435K5520l6265P384J9929j4573n557p960L3909N3604m0964
8538B65375m2853K3756l1158Q099N6807L6269j1606K1716l8898m5688O3894J4385
8526C20098p534j1571o9887J8140P4848l8933l98L7617J7770j9246q6483Q210
8514B42631K9833M5686K1148j5604k9965l3462l7614k6818O7355j2849j2000l978
8502B34363L71L8711Q6463N6140K7585N0292J1889j7237m053l9827k2468N9790
8490D82019N892l1983r0266k8440l5951o8607k2002j2124l1988K4764q637j9251
8478A63426l3879J1437N2286j103m3428K6769N9671P5169n2754n5771k9284J4524
8466A87063L1249K5231j6234Q203M2461m2432m223k1521O7566M7650M0637M5516
$$ plain form
8454 411166 459393 621140 744602 770037 787800 792546 686902 539509 399061 348470 335093
8443 335093 309639 344215 350854 305896 303539 301279 330781 351302 282241 222099 259140 294294
8431 294294 327499 293818 235415 121801 67972 136046 193052 229753 255453 249984 272132 210938
8419 210938 148422 216252 286410 299765 256238 212104 183338 180617 235455 258857 353414 366648
8407 366648 390643 439729 435508 429565 422122 383128 330656 377509 352322 255432 246588 211265
8395 211265 165472 231986 263434 167687 150043 162757 151537 167009 171449 145781 166134 215378
8383 215378 214624 200464 213164 167396 101856 165446 236109 153231 133704 162085 148598 179321
8371 179321 204799 134427 188309 206510 192044 197822 176489 166259 163383 123509 209064 255357
$$ packed form
8454D11166M8227J61747J23462K5435J7763M746j05644j47393j40448n0591j3377
8443C35093k5454L4576O639m4958k357k260K9502K0521o9061o0142L7041L5154
8431B94294L3205l3681n8403j13614n3829O8074N7006L6701K5700n469K2148o1194
8419B10938o2516O7830P0158J3355m3527m4134k8766k721N4838K3402R4557J3234
8407C66648K3995M9086m221n943p443l8994n2472M6853k5187r6890q844l5323
8395B11265m5793O6514L1448r5747j7644J2714j1220J5472M440k5668K0353M9244
8383B15378p54j4160J2700m5768o5540O3590P0663q2878j9527K8381j3487L0723
8371A79321K5478p0372N3882J8201j4466N778k1333j0230k876l9874Q5555M6293
$$ plain form
8359 255357 221853 162994 158148 244679 327117 419016 638485 910336 1101417 1253629 1329196
8348 1329196 1370006 1242577 1024068 805262 662154 600013 520697 466933 417532 391293 408941
8337 408941 412639 378777 379059 435867 365710 262619 263032 314386 362101 372974 312858 234322
8325 234322 263596 220025 258586 336554 325014 380505 429404 374858 318149 386981 459859 457246
8313 457246 507112 642942 774349 1064202 1387039 1822856 2254930 2481280 2607754 2604829
8303 2604829 2220723 1757368 1344722 1067217 893147 743152 703039 744776 694299 615866
8293 615866 533422 572361 506235 483159 472990 394975 361704 415671 433536 419332 407010 420081
8281 420081 438791 353854 333043 358455 382304 394803 416392 444775 467161 451647 490733 470219
$$ packed form
8359B55357l3504n8859m846Q6531Q2438R1899K19469K71851J91081J52212P5567
8348A329196M0810j27429k18509k18806j43108o2141p9316n3764m9401k6239J7648
8337D08941L698l3862K82N6808p0157j03091M13N1354M7715J0873o0116p8536
8325B34322K9274m3571L8561P7968j1540N5491M8899n4546n6709O8832P2878k613
8313D57246M9866J35830J31407K89853L22837M35817M32074K26350J26474k925
8303B604829l84106m63355m12646k77505j74070j49995m0113M1737n0477p8433
8293F15866q2444L8939o6126k3076j0169p8015l3271N3967J7865j4204j2322J3071
8281D20081J8710q4937k0811K5412K3849J2499K1589K8383K2386j5514L9086k0514
$$ plain form
8269 470219 498506 502873 550888 641619 771657 1003627 1249436 1371653 1427983 1411696 1326336
8258 1326336 1106002 880154 761650 681041 688521 659579 634798 537895 569023 541116 425824
8247 425824 338106 314737 322708 386913 398923 395210 360649 355190 347398 360732 433076 478701
8235 478701 448768 385795 302122 278529 264540 335291 366703 367112 326513 285869 325846 401115
8223 401115 310690 254278 275647 273705 242566 227445 249707 223474 229420 213497 207766 246426
8211 246426 265800 258602 259447 230775 252805 287476 282416 328334 331373 265656 232403 202591 212035
8198 212035 269727 226475 185914 214271 222134 208467 202622 209726 211696 195592 202615 192985 212030
8185 212030 207294 155278 122866 131993 150460 142606 192013 235824 233105 264747 289086 249932
$$ packed form
8269D70219K8287M367M8015R0731J30038K31970K45809J22217N6330j6287q5360
8258A326336k20334k25848j18504q0609P480k8942k4781r6903L1128k7907j15292
8247D25824q7718k3369P971O4205J2010l713l4561n459p792J3334P2344M5625
8235D78701k9933o2973q3673k3593j3989P0751L1412M09m0599m0644L9977P5269
8223D01115r0425n6412K1369j942l1139j5121K2262k6233N946j5923n731L8660
8211B46426J9374p198Q45k8672K2030L4671n060M5918L039o5717l3253k9812R444
8198B12035N7692m3252m0561K8357P863j3667n845P104J970j6104P023r630J9045
8185B12030m736n2016l2412R127J8467p854M9407M3811k719L1642K4339l9154
$$ plain form
8173 249932 274677 218171 218038 249948 271540 301999 289508 224631 199506 230456 246129 179968
8161 179968 136005 183087 157753 143725 148618 155572 233202 220634 112070 167525 277890 261604
8149 261604 233292 210812 154189 164363 163541 145969 153856 218471 227184 205465 197971 253519 213759
8136 213759 151818 161104 162588 172432 154100 150188 163076 257356 302957 253071 186163 130456
8124 130456 183868 261685 209680 131201 106183 166628 196542 176881 123034 136193 101981 67950
8112 67950 121412 163623 158917 179031 150929 136092 128943 111351 95063 73025 67903 136287
8100 136287 193330 253561 277720 257437 225734 183063 200750 212890 237711 288425 237589 148237
8088 148237 160323 175915 135566 126778 117425 106249 126027 169424 205469 225709 216927 144406
$$ packed form
8173B49932K4745n6506j33L1910K1592L0459j2491o4877k5125L0950J5673o6161
8161A79968m3963M7082k5334j4028M893O954P7630j2568j08564N5455J10365j6286
8149B61604k8312k2480n6623J0174q22j7572P887O4615Q713k1719p494N5548l9760
8136B13759o1941R286J484R844j8332l912J2888R4280M5601m9886o6908n5707
8124A30456N3412P7817n2005p8479k5018O0445K9914j9661n3847J3159l4212l4031
8112F7950N3462M2211m706K0114k8102j4837p149j7592j6288k2038n122O8384
8100A36287N7043O0231K4159k0283l1703m2671J7687J2140K4821N0714n0836q9352
8088A48237J2086J5592m0349q788r353j1176J9778M3397L6045K0240q782p2521
$$ plain form
8076 144406 115255 115625 118587 183026 222426 168414 131778 66103 70701 142387 155170 178698
8064 178698 191520 157231 168936 190794 221436 234326 274014 268837 280467 277192 306030 265882
8052 265882 229604 241046 248774 214674 181598 157616 170383 244226 262778 205857 152542 157988
8040 157988 148375 179356 148720 134508 147013 168559 156745 130014 79652 46626 86611 143841
8028 143841 160956 245484 244211 226644 196922 137368 79238 126521 115650 94015 119360 141632
8016 141632 188365 207270 158418 152684 144921 183464 188288 185137 174857 205635 176697 127777
8004 127777 117367 167111 148802 128233 70207 85386 80861 122715 154245 122706 115067 84352
7992 84352 96298 135835 135326 93456 72954 139033 137275 126784 175468 210523 148111 57906
$$ packed form
8076A44406k9151L70K962O4439L9400n4012l6636o5675M598P1686J2783K3528
8064A78698J2822l4289J1705K1858L0642J2890L9688n177J1630l275K8838m0148
8052B65882l6278J1442P728l4100l3076k3982J2767P3843J8552n6921n3315N446
8040A57988r613L0981l0636j4212J2505K1546j1814k6731n0362l3026L9985N7230
8028A43841J7115Q4528j273j7567k9722n9554n8130M7283j0871k1635K5345K2272
8016A41632M6733J8905m8852n734p763L8543M824l151j0280L0778k8938m8920
8004A27777j0410M9744j8309k0569n8026J5179m525M1854L1530l1539p639l0715
7992H4352J1946L9537n09m1870k0502O6079j758j0491M8684L5055o2412r0205
$$ plain form
7980 57906 25651 52015 40433 5608 84398 119329 142457 86898 79822 150665 203961 209967
7968 209967 143711 134008 100760 138938 194315 236617 236532 199669 217677 187399 183171 227737 193857
7955 193857 197422 156431 177163 211613 241026 196814 106558 43839 7969 39953 123293 149727
7943 149727 164630 225540 195919 161260 181739 195828 182896 147862 138709 185156 153107 106650
7931 106650 130541 168213 205417 249621 201278 214937 219322 214965 260423 255530 251505 235808
7919 235808 254764 221647 188576 224970 254044 273406 239452 169120 154997 153801 126084 107379
7907 107379 108467 64506 64688 28167 51345 109341 109219 150220 113011 63822 111973 169078 183601
7894 183601 155803 205473 206392 150316 167372 96947 80910 98630 52872 5019 60446 107530
$$ packed form
7980E7906l2255K6364j1582l4825P8790L4931K3128n5559p076P0843N3296O006
7968B09967o6256r703l3248L8178N5377M2302q5l6863J8008l0278m228M4566l3880
7955A93857L565m0991K0732L4450K9413m4212r0256o2719l5870L1984Q3340K6434
7943A49727J4903O0910k9621l4659K0479J4089j2932l5034r153M6447l2049m6457
7931A06650K3891L7672L7204M4204m8343J3659M385m357M5458m893m025j5697
7919B35808J8956l3117l3071L6394K9074J9362l3954p0332j4123j196k7717j8705
7907A07379J088m3961J82l6521K3178N7996j22M1001l7209m9189M8151N7105J4523
7894A83601k7798M9670R19n6076J7056p0425j6037J7720m5758m7853N5427M7084
$$ plain form
7882 107530 101958 170523 199814 179632 191979 167300 161663 129473 127420 71447 55675 181002
7870 181002 202316 167782 141431 99947 89387 84807 66186 89096 140536 119101 127995 170673
7858 170673 143302 147421 169251 176375 127567 109280 121156 148139 152674 125955 122957 140046
7846 140046 147976 142916 148134 147971 115866 65842 110364 209161 234694 233976 203163 152359 134897
7833 134897 140952 84433 42781 -13860 67555 115529 140404 154792 168988 130304 74064 17676
7821 17676 76163 110914 172519 146756 70657 84959 107310 109009 158651 199352 227553 240795
7809 240795 215400 251022 237936 248325 215822 191526 191181 209206 203558 170382 122171 145818
7797 145818 128935 99504 110351 179273 197829 199984 169905 170511 189348 170967 145279 150431
$$ packed form
7882A07530n572O8565K9291k0182J2347k4679n637l2190k053n5973j5772J25327
7870A81002K1314l4534k6351m1484j0560m580j8621K2910N1440k1435Q894M2678
7858A70673k7371M119K1830P124m8808j8287J1876K6983M535k6719k998J7089
7846A40046P930n060N218j63l2105n0024M4522R8797K5533p18l0813n0804j7462
7833A34897O055n6519m1652n6641Q1415M7974K4875J4388J4196l8684n6240n6388
7821A7676N8487L4751O1605k5763p6099J4302K2351J699M9642M0701K8201J3242
7809B40795k5395L5622j3086J0389l2503k4296l45J8025n648l3176m8211K3647
7797A45818j6883k9431J0847O8922J8556K155l0079O06J8837j8381k5688N152
$$ plain form
7785 150431 124850 79537 91535 130950 82552 9671 39929 37546 31084 89497 37695 -12177
7773 -12177 54418 114966 140306 151884 202122 219859 180192 208577 143479 62367 72638 137725
7761 137725 229536 224716 142203 73802 89344 114234 92531 104735 16106 9723 17938 47052
7749 47052 125475 171076 94566 58019 14520 51328 64222 75023 39081 585 8337 93120
7737 93120 109739 40889 72677 89856 157036 132782 76621 28391 52655 169907 161925 127166
7725 127166 111032 133362 92276 53618 19546 10786 65136 71074 81901 48724 46355 72850
7713 72850 81981 84269 83312 78067 106415 186434 186778 166031 193947 221113 138623 62891 44164
7700 44164 104545 163759 183513 150498 119886 103495 65500 90688 110751 152956 163892 162805
$$ packed form
7785A50431k5581m5313J1998L9415m8398p2881L0258k383o462N8413n1802m9872
7773a2177O6595O0548K5340J1578N0238J7737l9667K8385o5098q1112J0271O5087
7761A37725R1811m820q2513o8401J5542K4890k1703J2204q8629o383Q215K9114
7749D7052P8423M5601p6510l6547m3499L6808J2894J0801l5942l8496P752Q4783
7737I3120J6619o8850L1788J7179O7180k4254n6161m8230K4264J17252p982l4759
7725A27166j6134K2330m1086l8658l4072q760N4350N938J0827l3177k369K6495
7713G2850R131K288r57n245K8348Q0019L44k0747K7916K7166q2490p5732j8727
7700D4164O0381N9214J9754l3015l0612j6391l7995K5188K0063M2205J0936j087
$$ plain form
7688 162805 218480 288634 281050 229335 199136 196320 207931 202206 185952 181357 190772 136639 94987
7675 94987 56402 3736 93560 127111 159145 157984 134526 109674 105917 59281 37523 -7993
7663 -7993 -46001 42854 87930 104369 54305 -2621 14289 30820 8538 58022 94813 67650
7651 67650 45193 75576 96904 100727 94464 71641 73705 66119 80001 96262 112789 118633 135084
7638 135084 87655 22581 36968 -26001 -64117 44689 70988 189664 302138 250555 241923
7627 241923 240656 257376 226677 197350 154880 146019 124784 71999 82804 118938 129303 147598
7615 147598 194633 188404 154096 146953 164272 117921 38272 78674 71799 79441 90707 138473
7603 138473 146467 135193 123975 66567 19100 60127 108724 78953 78656 75805 117478 161691
$$ packed form
7688A62805N5675P0154p584n1715l0199k816J1611n725j6254m595R415n4133m1652
7675I4987l8585n2666Q9824L3551L2034j161k3458k4852l757m6636k1758m5516
7663g993l8008Q8855M5076J6439n0064n6926J6910J6531k2282M9484L6791k7163
7651F7650k2457L0383K1328L823o263k2823K064p586J3882J6261J6527N844J6451
7638A35084m7429o5074J4387o2969l8116J08806K6299J18676J12474n1583q632
7627B41923j267J6720l0699k9327m2470q861k1235n2785J0805L6134J0365J8295
7615A47598M7035o229l4308p143J7319m6351p9649M0402o875P642J1266M7766
7603A38473P994j1274j1218n7408m7467M1027M8597k9771k97k851M1673M4213
$$ plain form
7591 161691 128508 130973 69074 110213 142766 140285 110854 54835 18993 -55987 -52032 31906
7579 31906 106358 151973 83715 92463 164810 190698 154331 89173 152694 175813 168591 153925
7567 153925 173244 136847 124565 124072 133103 135436 120319 101762 145733 122841 87337 79879 19717
7554 19717 -10056 -20358 21809 60582 74021 86557 54888 75874 66412 63968 53510 20182
7542 20182 -36894 -36583 -7504 53931 77599 53977 35082 76987 167274 139038 122613 143507
7530 143507 127566 159127 136377 80257 27678 -26893 25857 48021 12507 -41784 -7933 101624
7518 101624 45388 62988 84529 52550 59403 89869 35639 57863 90549 84943 45958 20833
7506 20833 46507 38522 20104 38485 105558 83204 45692 23529 108796 154501 64192 18056
$$ packed form
7591A61691l3183K465o1899M1139L2553k481k9431n6019l5842p4980L955Q3938
7579C1906P4452M5615o8258Q748P2347K5888l6367o5158O3521K3119p222j4666
7567A53925J9319l6397j2282m93R031K333j5117j8557M3971k2892l5504p458o0162
7554A9717k9773j0302M2167L8773J3439J2536l1669K0986r462k444j0458l3328
7542B0182n7076L11K9079O1435K3668k3622j8895M1905R0287k8236j6425K0894
7530A43507j5941L1561k2750n6120n2579n4571N2750K2164l5514n4291L3851J09557
7518A01624n6236J7600K1541l1979O853L0466n4230K2224L2686n606l8985k5125
7506B0833K5674p985j8418J8381O7073k2354l7512k2163Q5267M5705r0309m6136
$$ plain form
7494 18056 -26555 27561 77723 101048 89539 120985 133261 139739 133698 158872 199445 202358
7482 202358 135665 128602 182180 192413 143968 139718 108349 115851 109811 92530 95888 125669 142565
7469 142565 149097 106954 85897 30095 47316 42615 -28232 -26457 58491 121040 112995 87591
7457 87591 49978 21593 -21350 -59866 -30803 17832 85564 77827 87879 13661 -9799 46070
7445 46070 73482 105347 88709 -21785 -93085 -35249 78330 108520 92342 16198 -44266
7434 -44266 -24579 98180 101643 115259 149785 159892 108353 17815 25404 2891 26695 48380
7422 48380 58419 31898 68483 79055 67993 52870 59209 14472 7551 13969 -53659 -68623
7410 -68623 -10786 -12538 521 90704 134665 125555 116136 177389 217450 155583 65211 66268 85057
$$ packed form
7494A8056m4611N4116N0162K3325j1509L1446J2276O478o041K5174M0573K913
7482B02358o6693p063N3578J0233m8445m250l1369P502o040j7281L358K9781J6896
7469A42565O532m2143k1057n5802J7221m701p0847J775Q4948O2549q045k5404
7457H7591l7613k8385m2943l8516K9063M8635O7732p737J0052p4218k3460N5869
7445D6070K7412L1865j6638j10494p1300N7836J13579L0190j6178p6144o0464
7434d4266J9687J22759L463J3616L4526J0107n1539r0538P589k2513K3804K1685
7422D8380J0039k6521L6585J0572j1062j5123O339m4737o921O418o7628j4964
7410f8623N7837j752J3059R0183M3961r110r419O1253M0061o1867r0372J057J8789
$$ plain form
7397 85057 130172 116532 104535 126145 123625 195910 168989 87135 23121 49247 53253 58948
7385 58948 22496 -18279 -3157 68361 105182 56856 8929 26650 159512 127407 68538 28007
7373 28007 -8701 -61380 -42527 -32042 -6766 39928 46574 4290 -35251 -91891 -93363 -105993
7361 -105993 -49172 -32223 -8987 50703 79428 107752 35168 2384 13465 11633 17819 -270
7349 -270 -3764 4109 46959 52132 56449 111621 173166 199935 185714 186294 118708 79391 147305
7336 147305 157613 146900 116986 84935 42682 -22308 -72690 -72811 -43883 15596 23600 74104
7324 74104 96297 105480 100591 161513 176105 202019 157340 58504 7895 30075 69112 92298
7312 92298 105372 79992 -12741 -35307 -71313 -78970 -57536 12910 12093 9517 54788 110759 114756
$$ packed form
7397H5057M5115j3640j1997K1610k520P2285k6921q1854o4014K6126M006N695
7385E8948l6452m0775J5122P1518L6821m8326m7927J7721J32862l2105n8869m0531
7373B8007l6708n2679J8853J0485K5276M6694O646m2284l9541n6640j472j2630
7361a05993N6821J6949K3236N9690K8725K8324p2584l2784J1081j832O186j8089
7349b70l494P873M2850N173M317N5172O1545K6769j4221N80o7586l9317O7914
7336A47305J0308j0713k9914l2051m2253o4990n0382j21K8928N9479Q004N0504
7324G4104K2193R183m889O0922J4592K5914m4679r8836n0609K2180L9037K3186
7312I2298J3074k5380r2733k2566l6006p657K1434P0446q17k576M5271N5971L997
$$ plain form
7299 114756 76065 76389 81349 78074 25341 -15459 40385 58212 120624 112963 129447 199637 138878
7286 138878 97099 81591 76272 70410 27232 81353 70558 49708 86155 48119 105505 152388
7274 152388 119623 75279 101336 117441 151063 48328 -40997 24287 27148 33963 134244 111707
7262 111707 29921 10610 23052 82350 149939 169764 141309 47461 31673 29042 35138 72575
7250 72575 76829 105842 118298 54456 -36126 -542 48684 59721 48254 53289 37544 -6254
7238 -6254 -15050 109 40654 97801 97640 110783 84949 54849 42933 98220 122105 56730 56674
7225 56674 58258 23080 103734 93373 44357 30597 63754 70485 83894 97774 78826 62878
7213 62878 31988 -24860 -21348 38535 107873 122347 109760 70707 29804 15802 -20691 -18123
$$ packed form
7299A14756l8691L24M960l275n2733m0800N5844J7827O2412p661J6484P0190o0759
7286A38878m1779j5508n319n862m3178N4121j0795k0850L6447l8036N7386M6883
7274A52388l2765m4344K6057J6105L3622j02735q9325O5284K861O815J00281k2537
7262A11707q1786j9311J2442N9298O7589J9825k8455r3848j5788k631O096L7437
7250G2575M254K9013J2456o3842r0582L5584M9226J1037j1467N035j5745m3798
7238f254q796J5159M0545N7147j61J3143k5834l0100j1916N5287K3885o5375n6
7225E6674J584l5178Q0654j0361m9016j3760L3157O731J3409J3880j8948j5948
7213F2878l0890n6848L512N9883O9338J4474j2587l9053m0903j4002l6493K568
$$ plain form
7201 -18123 44792 69425 65440 111193 137133 107847 64601 54107 -4750 6987 -12905 44245
7189 44245 81067 99721 84794 82220 116248 158271 97786 100890 156078 148705 200333 162538
7177 162538 150411 136774 97333 68292 118820 109459 117585 116293 55477 20472 51705 93309
7165 93309 91911 74074 70665 85079 114411 115794 102716 41993 47057 77216 105276 123087 113185
7152 113185 61540 39819 75324 43225 20540 -8866 -22624 -43392 -15629 51928 66575 55182
7140 55182 96397 155835 103942 129526 193570 222979 188431 114117 69314 53370 104826 99151
7128 99151 71134 51481 65973 84712 68691 30710 38472 -7902 -50619 -11479 96993 211910
7116 211910 167566 141308 121578 69946 58111 -1894 -93964 -130646 -40835 42138 -9760 30866
$$ packed form
7201a8123O2915K4633l985M5753K5940k9286m3246j0494n8857J1737j9892N7150
7189D4245L6822J8654j4927k574L4028M2023o0485L104N5188p373N1628l7795
7177A62538j2127j3637l9441k9041N0528r361Q126j292o0816l5005L1233M1604
7165I3309j398j7837l409J4414K9332J383j3078o0723N064L0159K8060J7811r902
7152A13185n1645k1721L5505l2099k2685k9406j3758k0768K7763O7557J4647j1393
7140E5182M1215N9438n1893K5584O4044K9409l4548p4314m4803j5944N1456n675
7128I9151k8017j9653J4492J8739j6021l7981P762m6374m2717L9140J08472J14917
7116B11910m4344k6258j9730n1632j1835o0005r2070l6682Q9811Q2973n1898M0626
$$ plain form
7104 30866 50400 18124 -18750 -64454 15995 71792 97663 56069 29325 32666 35244 20178
7092 20178 30924 59375 15765 -39082 -58425 2672 9495 15275 44919 99413 120751 174735
7080 174735 177555 188610 169621 145765 47297 -5871 -9293 -17006 6238 34167 34475 25646 43165
7067 43165 40522 23291 -402 31465 81920 109499 110084 91244 63744 50395 29582 -38048
7055 -38048 24306 133850 118377 39524 71737 102407 117086 75318 7005 9936 26869 72309
7043 72309 100183 11909 -4727 43852 46893 53551 33304 17552 56883 49900 15762 -4647
7031 -4647 5432 -6593 5684 -39101 -42723 3417 -7136 -6116 -3042 -35590 -18231 -2463 16432
7018 16432 1022 65269 135077 124286 114604 111780 77400 72370 89105 84925 51809 60294 65847
$$ packed form
7104C0866J9534l2276l6874m5704Q0449N5797K5871m1594k6744L341K578j5066
7092B0178J0746K8451m3610n4847j9343O1097O823N780K9644N4494K1338N3984
7080A74735K820J1055j8989k3856r8468n3168l422p713K3244K7929L08q829J7519
7067D3165k643j7231k3693L1867N0455K7579N85j8840k7500j3349k0813o7630
7055c8048O2354J09544j5473p8853L2213L0670J4679m1768o8313K931J6933M5440
7043G2309K7874q8274j6636M8579L041O658k0247j5752L9331o983l4138k0409
7031d647J0079j2025J2277m4785l622M6140j0553J020L074l2548J7359J5768J8895
7018A6432j5410O4247O9808j0791r682k824l4380n030J6735m180l3116Q485N553
$$ plain form
7005 65847 46929 20286 53564 66511 43383 45340 85201 49126 24140 49130 90299 142225
6993 142225 123536 93256 61451 43007 -2745 -20529 21762 26582 113247 126711 110913 88040
6981 88040 36377 -47390 -110698 -99131 -66447 -51827 -24679 54372 29255 -29220 40324 86268
6969 86268 108523 65178 40323 19968 29682 74630 123687 161308 86717 64786 54355 44664
6957 44664 66841 116970 99130 76821 73650 44498 14355 -3571 7498 31266 1896 -3638
6945 -3638 -61152 -28097 11758 28954 70778 65972 31045 106980 83129 110169 134163 92045
6933 92045 60345 92819 108525 127197 105064 39310 6246 51832 65908 68861 89091 84348
6921 84348 101049 126319 130880 100873 41577 41821 15135 14435 44787 65228 18676 -23495 -27179
$$ packed form
7005F5847j8918k6643L3278J2947k3128J957L9861l6075k4986K4990M1169N1926
6993A42225j8689l0280l1805j8444m5752j7784M2291M820Q6665J3464j5798k2873
6981H8040n1663q3767o3308J1567L2684J4620K7148P9051k5117n8475O9544M5944
6969H6268K2255m3345k4855k0355R714M4948M9057L7621p4591k1931j0431r691
6957D4664K2177N0129j7840k2309l171k9152l0143j7926J1069K3768k9370n534
6945c638n7514L3055L9855J7196M1824m806l4927P5935k3851K7040K3994m2118
6933I2045l1700L2474J5706J8672k2133o5754l3064M5586J4076K953K0230m743
6921H4348J6701K5270M561l0007n9296K44k6686p00L0352K0441m6552m2171l684
$$ plain form
6908 -27179 -13692 11178 96087 183908 146107 19999 20781 40651 90115 99579 71580 -7283
6896 -7283 -77898 -72528 -17366 9014 5351 -12036 84339 141098 174131 184882 100982 102970 98526
6883 98526 144217 103073 20096 43821 90159 98197 55256 83816 110393 84489 64822 52478
6871 52478 25827 27722 31035 61086 94821 20421 -17362 -39660 -42309 -2629 37391 41452 52295
6858 52295 63510 65159 13331 -76445 -55778 -23322 -7025 -34366 -29418 -36684 -32658 -3939 11992
6845 11992 80178 57609 8097 37391 124014 154920 190300 154110 115232 87359 99849 78653
6833 78653 22667 -1364 21841 28187 19113 7844 26364 55052 63318 41596 41611 46565 44620
6820 44620 95751 69744 53522 53972 91040 129364 198489 219081 188659 138690 63609 122944
$$ packed form
6908b7179J3487K4870Q4909Q7821l7801j26108P82J9870M9464R464k7999p8863
6896g283p0615N370N5162K6380l663j7387R6375N6759L3033J0751q3900J988m444
6883I8526M5691m1144q2977K3725M6338Q038m2941K8560K6577k5904j9667j2344
6871E2478k6651J895L313L0051L3735p4400l7783k2298k649L9680M0020M061J0843
6858E2295J1215J649n1828q9776K0667L2456J6297k7341M948p266M026K8719J5931
6845A1992O8186k2569m9512K9294Q6623L0906L5380l6190l8878k7873J2490k1196
6833G8653n5986k4031K3205O346r074j1269J8520K8688Q266k1722J5M954j945
6820D4620N1131k6007j6222M50L7068L8324O9125K0592l0422m9969p5081N9335
$$ plain form
6808 122944 112425 104738 144294 131223 118042 49743 46201 84065 66965 172019 302309 342262
6796 342262 376386 383580 317029 267229 236393 217663 259254 280771 289908 263940 218611 167131
6784 167131 118908 116771 148993 165801 99950 67525 140692 194057 114580 28962 11462 20921
6772 20921 66816 74324 65544 99075 52299 840 43734 34934 7709 7644 74618 72933 74800
6759 74800 124970 100074 59842 56370 35281 43936 97410 170391 67724 5941 51805 63474
6747 63474 71690 51569 91696 81661 91350 73377 58763 93958 191897 191304 123203 130924 179197
6734 179197 134356 103714 107474 127170 132955 68831 44091 51767 82700 32061 75284 119658
6722 119658 156506 97718 65206 88560 63335 24091 8312 -1676 -3214 48277 111661 91752
$$ packed form
6808A22944j0519p687L9556j3071j3181o8299l542L7864j7100J05054J30290L9953
6796C42262L4124P194o6551m9800l0836j8730M1591K1517R137k5968m5329n1480
6784A67131m8223k137L2222J6808o5851l2425P3167N3365p9477q5618j7500R459
6772B0921M5895P508q780L3531m6776n1459M2894q800k7225o5O6974j685J867
6759G4800N0170k4896m0232l472k1089Q655N3474P2981j02667o1783M5864J1669
6747F3474Q216k0121M0127j0035R689j7973j4614L5195R7939n93o8101P721M8273
6734A79197m4841l0642L760J9696N785o4124k4740P676L0933n0639M3223M4374
6722A19658L6848n8788l2512K3354k5225l9244j5779r988j538N1491O3384j9909
$$ plain form
6710 91752 44387 43846 50230 14706 -69394 -44310 -67472 -63605 -69874 -33144 48362 -46992 -13181
6697 -13181 67076 83434 77172 18834 36307 85419 96124 132894 194608 176800 127367 121020
6685 121020 137238 130409 76530 2591 -8864 -44040 -48871 101925 108215 70472 37079 25149
6673 25149 33568 81967 90847 63885 16280 53096 128248 112037 79826 55997 34922 86219
6661 86219 55991 61039 113103 152790 140869 86395 4263 1653 26773 58936 19818 -23461
6649 -23461 -25108 -29290 -16721 72881 73994 57397 20691 -3566 -39966 -77131 -95511 -127533
6637 -127533 -82861 -77914 -17074 33074 53953 59541 46651 25265 23185 72235 73811 -25620
6625 -25620 10311 -18570 -54487 -81744 -75247 -56122 36772 107607 145242 158822 143313 131942
$$ packed form
6710I1752m7365n41O384l5524q4100K5084k3162L867o269L6730Q1506r5354L3811
6697a3181Q0257J6358o262n8338J7473M9112J0705L6770O1714j7808m9433o347
6685A21020J6218o829n3879p3939j1455l5176m831J50796O290l7743l3393j1930
6673B5149Q419M8399Q880k6962m7605L6816P5152j6211l2211k3829k1075N1297
6661H6219l0228N048N2064L9687j1921n4474q2132k610K5120L2163l9118m3279
6649b3461j647m182J2569Q9602J113j6597l6706k4257l6400l7165j8380l2022
6637a27533M4672M947O0840N0148K0879N588j2890k1386k080M9050J576r9431
6625b5620L5931k8881l5917k7257O497J9125R2894P0835L7635J3580j5509j1371
$$ plain form
6613 131942 123083 60648 54128 79952 71067 45572 35470 8873 22972 -4460 21535 27262
6601 27262 25178 -5248 -57539 6714 -34436 -11825 7239 33737 49860 -4007 -18977 8771
6589 8771 28900 29417 -15339 -6731 -40684 -116047 -99147 -69829 -21114 26670 67890 105912 79889
6576 79889 63031 83934 106111 24031 -27770 -31567 -10625 -40042 -50895 -77309 -91212 -111633
6564 -111633 -80201 -12069 67116 118060 106378 52129 67168 25330 -19652 23578 45641 71805
6552 71805 90354 41578 -23711 -75163 -75878 -28404 43640 49862 12565 19725 13429 -33337 -31898
6539 -31898 36709 42499 2413 60034 139713 133055 80609 101580 154128 118023 69190 66473
6527 66473 102364 62659 17218 16445 51979 40947 64117 115803 161528 174995 67512 -19422
$$ packed form
6613A31942q859o2435o520K5824q885k5495j0102k6597J4099k7432K5995N727
6601B7262k084l0426n2291O4253m1150K2611J9064K6498J6123n3867j4970K7748
6589H771K0129N17m4756Q608l3953p5363J6900K9318M8715M7784M1220L8022k6023
6576G9889j6858K0903K2177q2080n1801l797K0942k9417j0853k6414j3903k0421
6564a11633L1432O8132P9185N0944j1682n4249J5039m1838m4982M3230K2063K6164
6552G1805J8549m8776o5289n1452p15M7474P2044O222l7297P160o296m6766J439
6539c1898O8607N790m0086N7621P9679o658n2446K0971N2548l6105m8833k717
6527F6473L5891l9705m5441p73L5534j1032K3170N1686M5725J3467j07483q6934
$$ plain form
6515 -19422 -21080 -14171 -16280 -47393 -14352 26659 -6381 -17396 -4311 27623 52021 32871
6503 32871 19544 -4122 17226 2354 -830 -6664 -82740 -74767 -32243 -26041 -10765 6947 56718
6490 56718 68353 10105 46195 56074 -23888 9635 22054 -27598 -21804 7295 34021 31769
6478 31769 29643 42885 12348 -2054 -60968 -2143 42004 -31379 -23109 -45215 -38349 21951
6466 21951 75022 25855 28416 31700 -1869 29578 29052 -6432 -64 11649 52897 10177 -62334
6453 -62334 -8404 29911 -9300 -67206 -5186 59346 57057 -14416 -55765 -16783 38337 3180
6441 3180 -64045 -16061 -20811 -70170 -132730 -112815 -49168 26210 29185 27563 42621 65072 34057
6428 34057 36923 23699 -2717 -7370 -5013 -66480 -103810 -45110 -16010 -8328 -22016 -31706 22819
$$ packed form
6515a9422j658O909k109l1113L3041M1011l3040j1015J3085L1934K4398j9150
6503C2871j3327k3666K1348j4872l184n834p6076P973M2524O202J5276J7712M9771
6490E6718J1635n8248L6090R879p9962L3523J2419m9652N794K9099K6726k252
6478C1769k126J3242l0537j4402n8914N8825M4147p3383Q270k2106O866O0300
6466B1951N3071m9167K561L284l3569L1447n26l5484O368J1713M1248m2720p2511
6453f2334N3930L8315l9211n7906O2020O4532k289p1473m1349L8982N5120l5157
6441C180o7225M7984m750m9359o2560J9915O3647P5378K975j622J5058K2451l1015
6428C4057K866j3224k6416m653K357o1467l7330N8700K9100P682j3688r690N4525
$$ plain form
6415 22819 21326 12083 62790 115491 159458 139856 166528 188786 206339 190334 213311 219360
6403 219360 123202 27741 6778 7459 4923 18178 29567 -967 70703 143599 131690 83942
6391 83942 88930 76110 56926 30867 -60 -168 51602 62425 55071 76582 71408 70122 82750
6378 82750 59453 95382 142145 149330 141162 39038 -9798 12250 -11408 -48319 20430 49751
6366 49751 -937 -21984 15793 45083 55923 44424 38825 97645 154849 143396 159104 48241
6354 48241 -40649 -14837 -4858 26392 27349 -7360 -65985 8640 67240 -15841 -51320 -37775
6342 -37775 -22714 56940 153899 68186 -42729 -78711 -62404 -38031 -26387 24606 106431 71225
6330 71225 12074 -32084 -7491 -57865 -98567 -78815 -27993 15312 -62425 -89226 13236 89669
$$ packed form
6415B2819j493r243N0707N2701M3967j9602K6672K2258J7553j6005K2977O049
6403B19360r6158r5461k0963O81k536J3255J1389l0534P1670P2896j1909m7748
6391H3942M988j2820j9184k6059l0927j08N1770J0823p354K1511n174j286J2628
6378H2750k3297L5929M6763P185q168j02124m8836K2048k3658l6911O8749K9321
6366D9751n0688k1047L7777K9290J0840j1499n599N8820N7204j1453J5708j10863
6354D8241q8890K5812R979L1250R57l4709n8625P4625N8600q3081l5479J3545
6342c7775J5061P9654R6959q5713j10915l5982J6307K4373J1644N0993Q1825l5206
6330G1225n9151m4158K4593n0374m0702J9752N0822M3305p7737k6801J02462P6433
$$ plain form
6318 89669 56396 19528 -6804 -94206 -70064 -66410 -25851 -40804 -44209 22684 108110 89444
6306 89444 82682 46399 59640 11342 -55799 -74395 -21649 6807 5085 -46254 -12654 29392
6294 29392 -48575 -72438 -24731 -29218 -24911 33026 36435 -7650 -11544 55095 90350 89538 35157
6281 35157 6717 9621 9544 -23173 -6178 56464 88743 14754 -38140 -74881 -54985 -22468 -21798
6268 -21798 22497 32813 -46067 -170 -10480 -88065 -59060 -66940 -77360 -31456 25252 56956
6256 56956 -10301 -54689 -41245 -20260 -13099 -31051 -42182 -42706 -1417 40989 47256 42668 58014
6243 58014 10159 -8479 11733 63758 -3543 -71963 -92582 -54421 -15600 40507 -38232 -44800
6231 -44800 -19477 -19655 109 -14569 -13076 379 6840 66010 92346 -32574 -78713 -42358
$$ packed form
6318H9669l3273l6868k6332q7402K4142L654M0559j4953l405O6893Q5426j8666
6306H9444o762l6283J3241m8298o7141j8596N2746K8456j722n1339L3600M2046
6294B9392p7967k3863M7707m487M307N7937L409m4085l894O6639L5255q12n4381
6281C5157k8440K904p7l2717J6995O2642L2279p3989n2894l6741J9896L2517O70
6268b1798M4295J0316p8880M5897j0310p7585K9005p880j0420M5904N6708L1704
6256E6956o7257m4388J3444K0985P161j7952j1131n24M1289M2406O267m588J5346
6243E8014m7855j8638K0212N2025o7301o8420k0619L8161L8821N6107p8739o568
6231d4800K5323j78J9764j4678J493J3455O461N9170K6336j24920m6139L6355
$$ plain form
6219 -42358 -50399 -107208 -61131 -102825 -80054 -6908 15913 -56741 -128261 -86438 -71035 -78571
6207 -78571 -30524 -93699 -64941 562 -20926 -45220 14070 82721 128557 113218 48369 26142
6195 26142 56653 58405 12634 24297 83415 97824 66703 84829 13853 -1336 27759 60308
6183 60308 61358 66534 36085 3284 -24666 -15048 2979 -18318 -58568 -56737 4425 72129 130193
6170 130193 185106 93692 42752 12708 30738 34205 39738 12639 -48330 -41420 -12413 -51376
6158 -51376 -47839 -32059 -129650 -133554 -68136 1164 47182 52404 -6623 -14367 -67726 -57901 -65016
6145 -65016 -70370 -13810 37178 -18854 -94636 -76429 5795 -35476 -64548 -7065 -37949 -75642
6133 -75642 -61887 -117951 -112727 -59587 -73467 -93856 -86152 -114362 -68428 -3294 -26990 17261
$$ packed form
6219d2358q041n6809M6077m1694K2771P3146K2821p2654p1520M1823J5403p536
6207g8571M8047o3175K8758O5503k1488k4294N9290O8651M5836j5339o4849k2227
6195B6142L0511J752m5771J1663N9118J4409l1121J8126p0976j5189K9095L2549
6183F0308J050N176l0449l2801k7950R618J8027k1297m0250J831O1162O7704N8064
6170A30193N4913r1414n0940l0044J8030L467N533k7099o0969O910K9007l8963
6158e1376L537J5780r7591l904O5418O9300M6018N222n9027p744n3359R825p115
6145f5016n354N6560N0988n6032p5782J8207Q2224m1271k9072N7483l0884l7693
6133g5642J3755n6064N224N3140j3880k0389P704k8210M5934O5134k3696M4251
$$ plain form
6121 17261 63384 72619 -12626 -63432 -50598 23722 55563 -37665 -89119 -98278 -179733 -138427
6109 -138427 -76899 -44188 2066 -24954 -96359 -83625 -76640 -47376 -17595 -37855 -52142 -60528
6097 -60528 -39908 36104 127877 120428 41917 12430 19203 9310 65418 59448 73497 87635 113718
6084 113718 127290 67182 19437 -73516 -88468 -91930 -142698 -121726 -79297 -159503 -175834 -62632
6072 -62632 6051 69291 94859 60284 -3263 -62735 -89113 -114546 -101651 -113966 -53606 12175
6060 12175 53836 25511 71991 68293 41882 9104 -68026 -95395 -90690 -48645 4867 38025
6048 38025 59255 43834 -4609 -51775 -95617 -132134 -166144 -133629 -119108 -83264 -104951 -77764
6036 -77764 -45287 -27711 -36098 -58365 -26365 57837 170113 97232 57438 61563 77465 45654
$$ packed form
6121A7261M6123R235q5245n0806J2834P4320L1841r3228n1454r159q1455M1306
6109a38427O1528L2711M6254k7020p1405J2734O985K9264K9781k0260j4287q386
6097f0528K0620P6012R1773p449p8511k9487O773r893N6108n970J4049J4138K6083
6084A13718J3572o0108m7745r2953j4952l462n0768K0972M2429q0206j6331J13202
6072f2632O8683O3240K5568l4575o3547n9472k6378k5433J2895j2315O0360O5781
6060A2175M1661k8325M6480l698k6411l2778p7130k7369M705M2045N3512L3158
6048C8025K1230j5421m8443m7166m3842l6517l4010L2515J4521L5844k1687K7187
6036g7764L2477J7576q387k2267L2000Q4202J12276p2881l9794M125J5902l1811
$$ plain form
6024 45654 -4347 -48055 -56294 17954 68769 12010 -48792 -82152 -56794 -43873 -74912 -103022
6012 -103022 -95568 -67193 -48791 -49212 -15427 2875 21430 53821 70027 27239 52299 78781
6000 78781 16378 30223 40024 30422 -33245 -86490 -121967 -70427 -23622 -40677 -72432 -84253
5988 -84253 -94003 -73443 -37099 -11541 1889 32695 41685 36549 26425 6113 3510 44897 104644
5975 104644 134203 105520 119392 157173 113115 93320 92713 91643 47979 49275 -14649 -83050
5963 -83050 -50332 -87338 -69918 -9417 -38892 -81795 -114646 -155191 -120462 -100300 -71834 -101051
5951 -101051 -113927 -157620 -110954 -18032 -33372 -96018 -123616 -128329 1572 107839 97481
5940 97481 82112 75048 27839 -11617 14923 29719 39672 15624 -53979 -65831 18150 -63106
$$ packed form
6024D5654n0001m3708q239P4248N0815n6759o0802l3360K5358J2921l1039k8110
6012a03022P454K8375J8402m21L3785J8302J8555L2391J6206m2788K5060K6482
6000G8781o2403J3845R801r602o3667n3245l5477N1540M6805j7055l1755j1821
5988h4253r750K0560L6344K5558J3430L0806Q990n136j0124k0312k603M1387N9747
5975A04644K9559k8683J3872L7781m4058j9795o07j070m3664J296o3924o8401
5963h3050L2718l7006J7420O0501k9475m2903l2851m0545L4729K0162K8466k9217
5951a01051j2876m3693M6666R2922j5340o2646k7598m713J29901J06267j0358
5940I7481j5369p064m7209l9456K6540J4796R953k4048o9603j1852Q3981q1256
$$ plain form
5928 -63106 -106091 -47735 41671 15383 -83060 -127223 -139718 -104579 -76259 -88156 -126035 -51645
5916 -51645 33885 -3214 -75823 -34843 12933 5463 694 9110 -7969 -32507 -25773 -60914 -11781
5903 -11781 91884 35661 -37928 1984 -18478 10012 1901 34134 6765 -22731 -3953 15860
5891 15860 15655 46814 32794 39327 20260 1870 -21335 -38351 -75418 21560 21309 5417 -20857
5878 -20857 -4570 -35671 -106533 -104101 -63557 -86025 -105406 -51592 4103 -21882 -12344 10503
5866 10503 -92342 -71769 -20547 -16465 -55435 -36001 -7712 19890 40624 21279 -12350 6941
5854 6941 26502 16482 -40175 -79815 -35468 17899 24895 20497 -11582 -4559 -13215 -51829 -120277
5841 -120277 -122839 -90173 -77973 -56928 -59594 27209 47262 57026 86657 102797 61089 306
$$ packed form
5928f3106m2985N8356Q9406k6288r8443m4163j2495L5139K8320j1897l7879P4390
5916e1645Q5530l7099p2609M0980M7776p470m769Q416j7079k4538O734l5141M9133
5903a1781J03665n6223p3589L9912k0462K8490q111L2233k7369k9496J8778J9813
5891A5860k05L1159j4020O533j9067j8390k3205j7016l7067R6978k51j5892k6274
5878b0857J6287l1101p0862K432M0544k2468j9381N3814N5695k5985R538K2847
5866A0503j02845K0573N1222M082l8970J9434K8289K7602K0734j9345l3629J9291
5854F941J9561j0020n6657l9640M4347N3367O996m398l2079P023q656l8614o8448
5841a20277k562L2666J2200K1045k666Q6803K0053R764K9631J6140m1708o0783
$$ plain form
5829 306 20784 34922 -51737 -32092 24637 9952 5238 20343 -25547 -48545 -69354 -71098 -31108
5816 -31108 -25137 41948 77142 80324 58264 -2275 27890 52016 21961 -3559 -172 -11892
5804 -11892 -31404 -18349 21827 36449 14455 52147 14319 -29658 -50839 -34794 -6787 -21476
5792 -21476 299 41034 32455 63803 96282 46569 21671 -23326 -99933 -155995 -103674 -52111
5780 -52111 43556 49110 -20756 -10042 4900 -58451 -92830 -60269 -42604 -56495 -43068 8096
5768 8096 17798 -63689 -80705 -17853 -53021 -73489 -61685 12073 53212 40271 4084 -50347
5756 -50347 13580 87742 73843 62371 12865 -36456 -46325 -70175 -83291 -37369 -14915 -19248
5744 -19248 -42624 -74883 -135680 -61973 74860 102184 33835 15287 -65633 -49540 9766 -22503
$$ packed form
5829C06K0478J4138q6659J9645N6729j4685m714J5105m5890k2998k0809j744L9990
5816c1108N971O7085L5194L182k2060o0539L0165K4126l0055k5520L387j1720
5804a1892j9512J3055M0176J4622k1994L7692l7828m3977k1181J6045K8007j4689
5792b1476K1775M0735q579L1348L2479m9713k4898m4997p6607n6062N2321N1563
5780e2111R5667N554o9866J0714J4942o3351l4379L2561J7665j3891J3427N1164
5768H096R702q1487j7016O2852l5168k0468J1804P3758M1139j2941l6187n4431
5756e0347O3927P4162j3899j1472m9506m9321r869k3850j3116M5922K2454m333
5744a9248k3376l2259o0797P3707J36833K7324o8349j8548q0920J6093N9306l2269
$$ plain form
5732 -22503 17587 47060 33358 44495 63097 103548 37108 16153 -18116 -89179 -101908 -80585
5720 -80585 -56818 20972 31651 -68625 -96741 -37256 48594 78899 36812 48094 -16377 -84779
5708 -84779 -66096 -21018 35730 25297 -62301 -123404 -114560 -56673 -68754 -100213 -91202 -24631
5696 -24631 -5674 -18484 -37452 -50743 -31408 -37886 -73085 -91440 -32477 9019 -13208 5047
5684 5047 28686 42654 54812 16141 9212 88814 99218 83014 55778 17462 -13784 6451
5672 6451 74559 57650 7716 10021 -5908 -24014 -22303 21386 5568 26536 28917 -23373 5499
5659 5499 -24684 -94216 -106627 -75743 -39334 -37200 -51512 -11370 -2814 -18430 -2699 -37725
5647 -37725 -42540 -45671 -226 38488 80659 82878 31279 3273 929 -16166 -90990 -73352 -10224
$$ packed form
5732b2503M0090K9473j3702J1137J8602M0451o6440k0955l4269p1063j2729K1323
5720h0585K3767P7790J0679j00276k8116N9485Q5850L0305m2087J1282o4471o8402
5708h4779J8683M5078N6748j0433q7598o1103Q844N7887j2081l1459R011O6571
5696b4631J8957j2810j8968j3291J9335o478l5199j8355N8963M1496k2227J8255
5684E047K3639J3968J2158l8671o929P9602J0404j6204k7236l8316l1246K0235
5672F451O8108j6909m9934K305j5929j8106J711M3689j5818K0968K381n2290K8872
5659E499l0183o9532j2411L0884L6409K134j4312M0142Q556j5616J5731l5026
5647c7725m815l131M5445L8714M2171K219n1599k8006k344j7095p4824J7638O3128
$$ plain form
5634 -10224 -5778 -80753 -32177 -5440 -11171 -73441 -119597 -104945 -83897 -45147 9687 20870
5622 20870 1710 -19863 -62288 -18175 -42186 -37584 21523 76552 7533 -30466 -26762 53649
5610 53649 65792 12103 -2305 -17200 -46124 -63378 28214 61365 -2318 -42322 -27106 -20733
5598 -20733 -36783 -23927 -6591 22591 -948 -40859 -43670 9976 19258 -67 4953 10142 32477
5585 32477 -30518 -94839 -101169 -17373 -32641 -47503 -103964 -78719 -23749 -63054 -53466 40098
5573 40098 -21872 -81404 -85148 -69453 26978 64744 78829 97400 109281 125067 97879 -4439
5561 -4439 -55750 -108202 -86590 -64096 -118043 -106442 -68234 -20751 30244 28003 77298 98364
5549 98364 112596 124583 78885 49438 36372 67771 24428 -96533 -93310 -17915 -57125 -62016
$$ packed form
5634a0224M446p4975M8576K6737n731o2270m6156J4652K1048L8750N4834J1183
5622B0870j9160k1573m2425M4113k4011M602N9107N5029o9019l7999L704Q0411
5610E3649J2143n3689j4408j4895k8924j7254R1592L3151o3683m0004J5216O373
5598b0733j6050J2856J7336K9182k3539l9911k811N3646R282j9325N020N189K2335
5585C2477o2995o4321o330Q3796j5268j4862n6461K5245N4970l9305R588R3564
5573D0098o1970n9532l744J5695R6431L7766J4085J8571J1881J5786k7188j02318
5561d439n1311n2452K1612K2494n3947J1601L8208M7483N0995k241M9295K1066
5549I8364J4232J1987m5698k9447j3066L1399m3343j20961L223P5395l9210m891
$$ plain form
5537 -62016 -59733 -103930 -96024 -151845 -136181 -91820 -89121 -70197 -59843 -26885 -27735 9332 28219
5524 28219 31825 28252 33472 383 -61146 -79526 -4349 -30861 -22753 5259 -31603 -31790 -18912
5511 -18912 -13939 37700 36511 72874 56742 74266 70162 27768 34187 32876 -16662 -46268 -13175
5498 -13175 -13978 -55053 -85579 -93527 -58047 -65037 -55695 -61210 -34995 -49146 -98859 -116069 -103328
5485 -103328 -3120 60490 72477 3356 -14031 78218 95930 69828 83202 90858 47220 23771
5473 23771 10879 -27735 -27130 -46494 -28071 -62751 -114492 -127105 -95252 -73012 5233 41571
5461 41571 30591 44558 31533 48276 26633 -29231 -26218 -22402 18221 49741 59999 9091
5449 9091 -6877 23126 63204 58948 -19441 -25437 38868 116318 80790 27761 3656 -360 90324
$$ packed form
5537f2016K283m4197P906n5821J5664M4361K699J8924J0354L2958q50L7067J8887
5524B8219L606l573N220l3089o1529j8380P5177k6512Q108K8012l6862j87J2878
5511a8912M973N1639j189L6363j6132J7524m104m2394O419j311m9538k9606L3093
5498a3175q03m1075l0526p948L5480o990R342n515K6215j4151m9713j7210J2741
5485a03328J00208O3610J1987o9121j7387R2249J7712k6102J3374P656m3638k3449
5473B3771j2892l8614O05j9364J8423l4680n1741j2613L1853K2240P8245L6338
5461D1571j0980J3967j3025J6743k1643n5864L013L816M0623L1520J0258n0908
5449I091j5968L0003M0078m256p8389n996O4305P7450l5528n3029k4105m016R0684
$$ plain form
5436 90324 139335 100904 39227 -20681 -77532 -86468 -124389 -127675 -116771 -87532 -102022 -59520
5424 -59520 -78713 -86396 -28842 -9614 -23575 -37891 6733 -17099 -16588 17851 -68531 -162428
5412 -162428 -162528 -134442 -117394 -47746 -17839 54363 49431 29365 -38222 -31174 9121 -452 -4918
5399 -4918 4551 -8373 -22028 -47345 -9837 -1185 35833 100534 81760 34985 576 -2970 69149
5386 69149 116527 84008 69210 81140 3663 -64615 -34806 -106485 -112008 -106737 -107022 -117285 -87960
5373 -87960 -62008 -64062 -90687 -94955 8731 40129 -12372 -99431 -128539 -111502 -105566 -76657
5361 -76657 -107764 -89549 -26794 -18908 -28754 -25085 -59876 -115482 -142441 -129387 -10774 48243
5349 48243 6466 -25313 -69320 -92846 -31538 -36180 -65896 -57343 -84209 -158782 -114297 -5099
$$ packed form
5436I0324M9011l8431o1677n9908n6851q936l7921l286J0904K9239j4490M2502
5424e9520j9193p683N7554J9228j3961j4316M4624k3832N11L4439q6382r3897
5412a62428j00K8086J7048O9648K9907P2202m932k0066o7587P048M0295r573m466
5399d918R469j2924j3655k5317L7508Q652L7018O4701j8774m6775l4409l546P2119
5386F9149M7378l2519j4798J1930p7477o8278K9809p1679n523N271k85j0263K9325
5373h7960K5952k054k6625m268J03686L1398n2501q7059k9108J7037N936K8909
5361g6657l1107J8215O2755P886r846L669l4791n5606k6959J3054J18613N9017
5349D8243m1777l1779m4007k3526O1308m642k9716Q553k6866p4573M4485J09198
$$ plain form
5337 -5099 74678 51833 68695 -11047 -33503 -19140 -36556 -20729 -51703 -51654 -60033 -88200 -81620
5324 -81620 -31280 -54054 -36301 34947 65819 47045 -15467 -48707 33979 35763 -13939 15835
5312 15835 8298 -29137 -41005 -53809 -66172 -55991 -48621 -77424 -72346 -35452 3367 13719
5300 13719 10012 -36921 -63186 -96052 -88625 -54358 -60368 -8605 22975 -30002 -17434 -17946 -96509
5287 -96509 -158059 -149357 -171193 -150309 -89019 -48323 -13303 22535 15696 178 -51621 -46804
5275 -46804 1304 34203 -1307 -26942 -57213 -82843 -39435 -56126 -46657 -32890 -14330 -80618
5263 -80618 -46527 -18525 -45964 -66940 -87889 -116538 -122630 -35425 -57457 -135984 -155900 -74044
5251 -74044 -46430 -107807 -160270 -65559 -22749 -9973 -51354 -61671 14768 -36294 -107343 -88643
$$ packed form
5337e099P9777k2845J6862p9742k2456J4363j7416J5827l0974M9q379k8167O580
5324h1620N0340k2774J7753P1248L0872j8774o2512l3240Q2686J784m9702K9774
5312A5835p537l7435j1868j2804j2363J0181P370k8803N078L6894L8819J0352
5300A3719l707m6933k6265l2866P427L4267o010N1763L1580n2977J2568n12p8563
5287i6509o1550Q702k1836K0884O1290M0696L5020L5838o839j5518n1799M817
5275d6804M8108L2899l5510k5635l0271k5630M3408j6691R469J3767J8560o6288
5263h0618L4091K8002k7439k0976k0949k8649o092Q7205k2032p8527j9916Q1856
5251g4044K7614o1377n2463R4711M2810J2776m1381j0317P6439n1062p1049J8700
$$ plain form
5239 -88643 -49185 -88152 -135298 -189706 -128254 -49804 -36198 76333 8550 -15729 55133 114264
5227 114264 47105 -53207 -97862 -137214 -129062 -137954 -69935 -22667 -27293 -49464 -4195 -51472
5215 -51472 -70252 -90782 -86840 -79189 -123320 -178905 -182962 -81256 -35036 23427 127065 126335
5203 126335 72593 -5053 -74296 -125433 -153033 -106868 -1816 79686 39332 -18644 -29104
5192 -29104 -35396 -50727 -106040 -176466 -108406 -44039 6386 16132 -40880 -78493 -5736 -10943
5180 -10943 -33962 -44904 2956 13116 13800 37388 -8714 -55708 -10096 -22486 -7472 96095
5168 96095 101225 48829 2212 -51571 -16993 -13293 -22625 -37703 -65714 -109469 -125756 -89811
5156 -89811 -73782 -74810 -54314 -53424 -66592 -73690 -40225 -8069 -63 -9037 8989 16613 -29241
$$ packed form
5239h8643L9458l8967m7146n4408O1452P8450J3606J12531o7783k4279P0862N9131
5227A14264o7159j00312m4655l9352Q152q892O8019M7268m626k2171M5269m7277
5215e1472j8780k0530L942P651m4131n5585m057J01706M6220N8463J03638p30
5203A26335n3742p7646o9243n1137k7600M6165J05052Q1502m0354n7976j0460
5192b9104o292j5331n5313p0426O8060O4367N0425R746n7012l7613P2757n207
5180a0943k3019j0942M7860J0160O84K3588m6102m6994M5612j2390J5014J03567
5168I6095N130n2396m6617n3783L4578L700r332j5078k8011m3755j6287L5945
5156h9811J6029j028K0496Q90j3168p098L3465L2156Q006q974J8026P624m5854
$$ plain form
5143 -29241 -65387 -8027 1369 -33306 -88323 -95043 -55499 -82154 -105794 -108836 -106345 -83940 -29305
5130 -29305 -41746 -86899 -81601 -93773 -112316 -54856 -28577 -27867 -66650 -91194 20982 68647
5118 68647 43196 95359 36489 -49767 -105931 -77740 -63816 -61189 -85950 -88782 -52086 -50732
5106 -50732 -64212 -64854 -65644 -95593 -85543 -69776 -49300 -44937 -50032 -33362 -49662 -109676 -96774
5093 -96774 -142362 -141945 -150884 -160939 -199816 -155160 -18771 -3523 -65311 -57580 -58711 -73356 -34696
5080 -34696 -39653 -31867 -9574 -26493 12974 3389 -37018 -91272 -42868 2920 -39947 -52286
5068 -52286 -3609 31064 11785 -7567 -39166 -99993 -165264 -167765 -141748 -128077 -96990 -44315
5056 -44315 -9773 27159 -57559 -38599 35922 -23379 -114968 -99965 -86765 -62026 -40491 -47502
$$ packed form
5143b9241l6146N7360R396l4675n5017o720L9544k6655k3640l042K491K2405N4635
5130b9305j2441m5153N298j2172j8543N7460K6279P10l8783k4544J12176M7665
5118F8647k5451N2163n8870q6256n6164K8191J3924K627k4761k832L6696J354
5106e0732j3480o42p90k9949J0050J5767K0476M363n095J6670j6300o0014J2902
5093i6774m5588M17q939j0055l8877M4656J36389J5248o1788P731j131j4645L8660
5080c4696m957P786K2293j6919L9467r585m0407n4254M8404M5788m2867j2339
5068e2286M8677L4673j9279j9352l1599o0827o5271k501K6017J3671L1087N2675
5056d4315L4542L6932q4718J8960P4521n9301r1589J5003J3200K4739K1535p011
$$ plain form
5044 -47502 -79436 -46725 -2986 62833 50826 -14199 34604 55545 5801 -65670 -91403 -121363
$$ packed form
5044d7502l1934L2711M3739O5819j2007o5025M8803K0941m9744p1471k5733k9960
$$ [...]
##END NTUPLES=NMR SPECTRUM
##END=
