##TITLE=Analysis number 329216
Compound Code rh 01075
Project Code adrs
Chemist Name aci
##JCAMPDX= 6.0         $$ Bruker NMR JCAMP-DX V2.0
##DATA TYPE= NMR SPECTRUM
##DATA CLASS= NTUPLES
##ORIGIN= Bruker BioSpin GmbH
##OWNER= nmr
$$ XWIN-NMR		Version 3.5
$$ Mon Aug 13 10:09:19 2007 GMT Daylight Time (UT+1h)  MAYBRIDGE\nmr@NMR_250MHZ
##.OBSERVE FREQUENCY= 250.131544655141
##.OBSERVE NUCLEUS= ^1H
##.ACQUISITION MODE= SIMULTANEOUS (DQD)
##.ACQUISITION SCHEME= undefined
##.AVERAGES= 16
##.DIGITISER RES= 18
##SPECTROMETER/DATA SYSTEM= dpx250
##.PULSE SEQUENCE= zg30
##.SOLVENT NAME= DMSO
##.SHIFT REFERENCE= (INTERNAL, DMSO, 0, 16.522)
##AUDIT TRAIL= $$ (NUMBER, WHEN, WHO, WHERE, WHAT)
$$ ##TITLE= Audit trail, XWIN-NMR		Version 3.5
$$ ##JCAMPDX= 5.01
$$ ##ORIGIN= Bruker BioSpin GmbH
$$ ##OWNER= nmr
$$ C:\u/data/dgb/nmr/ADRS/430/pdata/1/auditp.txt
$$ ##AUDIT TRAIL=  $$ (NUMBER, WHEN, WHO, WHERE, WHAT)
(   1,<2007-08-13 10:08:51.03 +100>,<MAYBRIDGE\nmr>,<NMR_250MHZ>,
      <created by zg, POWCHK disabled, PULCHK disabled
       configuration hash MD5:
       76 6E 9A 78 1E 09 19 81 EC 84 63 8F B0 6A 59 2D
       data hash MD5: 64K
       46 1A F1 44 8C 00 04 64 BC 27 A9 44 1D 02 30 1B>)
(   2,<2007-08-13 10:09:08.68 +100>,<MAYBRIDGE\nmr>,<NMR_250MHZ>,
      <Start of raw data processing
       ef LB = 0.3 FT_mod = 6 PKNL = 1 SI = 32K 
       data hash MD5: 32K
       67 AB F8 A3 4A F5 E8 F0 D8 F6 5A 3C DB C6 0D 4B>)
(   3,<2007-08-13 10:09:10.37 +100>,<MAYBRIDGE\nmr>,<NMR_250MHZ>,
      <apk 
       data hash MD5: 32K
       7D 20 7E B1 6D 4C D2 EA D5 90 92 2F 38 BC CF A9>)
(   4,<2007-08-13 10:09:11.11 +100>,<MAYBRIDGE\nmr>,<NMR_250MHZ>,
      <abs ABSG = 5 
       data hash MD5: 32K
       3D 79 A4 F0 B7 62 49 B6 4E 4C BE 58 0A 15 98 7A>)
$$ ##END=
$$ 
$$ hash MD5
$$ 57 2E 7F 09 D8 59 0D 72 56 EC 64 E2 1A C9 AD 8A
##$RELAX= 
##$RELAX= 
##$RELAX= 
##$RELAX= 
##$RELAX= 
##$RELAX= 
##$RELAX= 
$$ Bruker specific parameters
$$ --------------------------
##$DU= <C:\u>
##$EXPNO= 430
##$NAME= <ADRS>
##$PROCNO= 1
##$TYPE= <nmr>
##$USER= <dgb>
##$AMP= (0..31)
100 100 100 100 100 100 100 100 100 100 100 100 100 100 100 100 100 100 
100 100 100 100 100 100 100 100 100 100 100 100 100 100 
##$AQSEQ= 0
##$AQ_mod= 3
##$AUNM= <au_zg>
##$AUTOPOS= <5 >
##$BF1= 250.13
##$BF2= 250.13
##$BF3= 250.13
##$BF4= 250.13
##$BF5= 500.13
##$BF6= 500.13
##$BF7= 500.13
##$BF8= 500.13
##$BYTORDA= 1
##$CFDGTYP= 0
##$CFRGTYP= 5
##$CHEMSTR= <none>
##$CNST= (0..31)
1 1 145 1 1 1 1 1 1 1 1 1 1 1 1 1 1 1 1 1 1 1 1 1 1 1 1 1 1 1 1 1 
##$CPDPRG= <>
##$CPDPRG1= <>
##$CPDPRG2= <>
##$CPDPRG3= <>
##$CPDPRG4= <mlev>
##$CPDPRG5= <mlev>
##$CPDPRG6= <mlev>
##$CPDPRG7= <mlev>
##$CPDPRG8= <mlev>
##$CPDPRGB= <>
##$CPDPRGT= <>
##$D= (0..31)
0 1 0 0 0 0 0 0 0 0.06 0 0 0 0 0 0 0.0002 0 0 0 0 0 0 0 0 0 0 0 0 0 0 
0 
##$DATE= 1186996129
##$DBL= (0..7)
120 120 120 120 120 120 120 120 
##$DBP= (0..7)
150 150 150 150 150 150 150 150 
##$DBP07= 0
##$DBPNAM0= <>
##$DBPNAM1= <>
##$DBPNAM2= <>
##$DBPNAM3= <>
$$ [...]
##$SUBNAM7= <"">
##$SUBNAM8= <"">
##$SUBNAM9= <"">
##$SW= 20.6930455092707
##$SWIBOX= (0..15)
0 0 3 0 0 0 0 0 0 0 0 0 0 0 0 0 
##$SW_h= 5175.983436853
##$TD= 65536
##$TD0= 1
##$TE= 296.16
##$TE2= 300
##$TE3= 300
##$TEG= 300
##$TL= (0..7)
0 120 120 120 120 120 120 120 
##$TP= (0..7)
150 150 150 150 150 150 150 150 
##$TP07= 0
##$TPNAME0= <>
##$TPNAME1= <>
##$TPNAME2= <>
##$TPNAME3= <>
##$TPNAME4= <>
##$TPNAME5= <>
##$TPNAME6= <>
##$TPNAME7= <>
##$TPOAL= (0..7)
0.5 0.5 0.5 0.5 0.5 0.5 0.5 0.5 
##$TPOFFS= (0..7)
0 0 0 0 0 0 0 0 
##$TUNHIN= 0
##$TUNHOUT= 0
##$TUNXOUT= 0
##$USERA1= <user>
##$USERA2= <user>
##$USERA3= <user>
##$USERA4= <user>
##$USERA5= <user>
##$V9= 5
##$VALIST= <valist>
##$VCLIST= <CCCCCCCCCCCCCCC>
##$VD= 0
##$VDLIST= <DDDDDDDDDDDDDDD>
##$VPLIST= <PPPPPPPPPPPPPPP>
##$VTLIST= <TTTTTTTTTTTTTTT>
##$WBST= 1024
##$WBSW= 4
##$XGAIN= (0..3)
0 0 0 0 
##$XL= 0
##$YL= 0
##$YMAX_a= 413787
##$YMIN_a= -309322
##$ZGOPTNS= <>
##$ZL1= 120
##$ZL2= 120
##$ZL3= 120
##$ZL4= 120
##$ABSF1= 16.522
##$ABSF2= -4.171173
##$ABSG= 5
##$ABSL= 3
##$ALPHA= 0
##$AQORDER= 0
##$ASSFAC= 0
##$ASSFACI= 0
##$ASSFACX= 0
##$ASSWID= 0
##$AUNMP= <proc_1d>
##$AZFE= 0.1
##$AZFW= 0.1
##$BCFW= 0
##$BC_mod= 0
##$BYTORDP= 0
##$COROFFS= 0
##$CY= 12.5
##$DATMOD= 1
##$DC= 0
##$DFILT= <>
##$DTYPP= 0
##$F1P= 14.0000005364418
##$F2P= -0.99999901652339
##$FCOR= 0.5
##$FTSIZE= 32768
##$FT_mod= 6
##$GAMMA= 0
##$GB= 0
##$INTBC= 1
##$INTSCL= 1
##$ISEN= 128
##$LB= 0.3
##$LEV0= 0
##$LPBIN= 0
##$MAXI= 10000
##$MC2= 0
##$MEAN= 0
##$ME_mod= 0
##$MI= 0
##$NCOEF= 0
##$NC_proc= -3
##$NLEV= 6
##$NOISF1= 0
##$NOISF2= 0
##$NSP= 0
##$NTH_PI= 0
##$NZP= 0
##$OFFSET= 16.522
##$PC= 1
##$PHC0= -58.89572
##$PHC1= 9.186207
##$PH_mod= 1
##$PKNL= yes
##$PPARMOD= 0
##$PSCAL= 4
##$PSIGN= 0
##$REVERSE= no
##$SF= 250.13
##$SI= 32768
##$SIGF1= 0
##$SIGF2= 0
##$SINO= 400
##$SIOLD= 32768
##$SREGLST= <1H.DMSO>
##$SSB= 0
##$STSI= 32768
##$STSR= 0
##$SW_p= 5175.98343685301
##$SYMM= 0
##$S_DEV= 0
##$TDeff= 65536
##$TDoff= 0
##$TI= <Analysis number 999999
Compound Code 99
Book Reference 9
Project Code 9>
##$TILT= no
##$TM1= 0
##$TM2= 0
##$TOPLEV= 0
##$USERP1= <user>
##$USERP2= <user>
##$USERP3= <user>
##$USERP4= <user>
##$USERP5= <user>
##$WDW= 1
##$XDIM= 32768
##$YMAX_p= 440728237
##$YMIN_p= -104457
$$ End of Bruker specific parameters
$$ ---------------------------------
##NTUPLES= NMR SPECTRUM
##VAR_NAME=  FREQUENCY,     SPECTRUM/REAL,   SPECTRUM/IMAG
##SYMBOL=    X,             R,               I
##VAR_TYPE=  INDEPENDENT,   DEPENDENT,       DEPENDENT
##VAR_FORM=  AFFN,          ASDF,            ASDF
##VAR_DIM=   32768,         32768,           32768
##UNITS=     HZ,            ARBITRARY UNITS, ARBITRARY UNITS
##FACTOR=    0.157963299565203, 1,           1
##FIRST=     4132.6476996994, 0,             0
##LAST=      -1043.33573715361, 0,           0
##MIN=       -1043.33573715361, -104457,     0
##MAX=       4132.6476996994, 440728237,     0
$$ Real data points
##PAGE= N=1
##DATA TABLE= (X++(R..R)), XYDATA
$$ [...]
18486E5166p023k7164q733N837K6770M6852M486r801k660j0235j1820q146j3937
18473C9592N812J936o744j1287p740j3672j3712l0329J1176J6939r128m432k1617
18460d3206k582K2863j4900k6100j5747K0809K9278J294Q410M818M056o636J5626
18447b017M101j7731j4477K3873J3452r802k3772j4617j104R981O191O923J5678
18434c321l436M101N875m667j5498l0483J61R696j014k2757q108J831J1274L642
18420e2704j1688l784Q229Q983K1959n926m034l5961l969J8372K2652J302r882
18407d6451J624l7444j8537Q941k926r137L8444J9073k026l235l177p576k713
18394f5140R56L2880N851j0575Q913L2317l61J2220k1372P187N560k5911j834
$$ y = [55166, 48143, 20979, 12246, 18083, 44853, 91705, 96191, 86390, 83730, 73495, 61675, 53529, 39592, 45404, 47340, 40596, 29309, 21569, 7897, -5815, -36144, -24968, -8029, -17157, -21589, -43206, -45788, -22925, -37825, -63925, -79672, -58863, -29585, -28291, -19881, -15063, -11007, -17643, -2017, 2084, -15647, -30124, -6251, 7201, -2601, -26373, -40990, -42094, -32113, -25922, -18999, -3321, -6757, -2656, 3219, -1448, -16946, -47429, -47268, -37572, -38586, -61343, -69451, -67620, -56346, -52704, -64392, -68176, -59947, -50964, -29005, -34931, -38965, -74926, -78895, -60523, -37871, -36569, -46451, -44827, -82271, -100808, -91867, -94793, -103930, -65486, -46413, -48439, -51674, -54851, -62427, -65140, -64184, -31304, -25453, -36028, -27115, 5202, 4841, 17061, -4311, 2876, 8436, -17475, -19309]
18381a9309J6191r4j9368k1625j1881J1801L2466M279L314P2J8677K2605l3166
18368C962k7626J8865K6913n839p912j9203j866L450J3748l284j7029j7157p03
18355c3681R859p000O456Q752J7038L0576j8408l6287r776K4801K9808j2323k9440
18342a9625J3904L553j4755k7530K028R996O288J1595K3568J4967J0075Q385j5876
18329B6573k2058L215J3605J634j1120J497q124j5709q698J3904j3429j8960J4297
18316b3373L5007J8913R992R595k1676k8005k4567j642P464l504M838M6327o691
18303B2678k4296l700J1950J860P019k1745j5212N628K6109o118J7125L0052J0564
18290F1914k916k3139k4800j0711J431j0608j0603P547j3127J5501L9220J5628
$$ y = [-19309, -3118, -3212, -22580, -44205, -56086, -44285, -11819, -7540, -4226, -4154, 14523, 37128, 3962, -23664, -4799, 22114, 16275, 8363, -10840, -12706, -9256, 4492, 1208, -15821, -32978, -33681, -23822, -30822, -24366, -15614, 1424, 32000, 13592, -22695, -32471, -7670, 22138, 9815, -19625, -5721, -2168, -16923, -44453, -42425, -32429, -26141, -14546, 9022, 23989, 34064, 42449, 26573, 4515, 7730, 21335, 22969, 11849, 13346, 5222, -10487, -19185, -5281, -18710, -37670, -23373, 11634, 30547, 40539, 50134, 28458, 453, -24114, -25756, -18292, -21796, -16958, 29369, 22678, -1618, -5318, 6632, 8492, 15511, -6234, -21446, -15818, 10291, 4173, 21298, 51350, 61914, 58998, 35859, 11059, 348, 1779, -8829, -19432, -11885, -25012, -9511, 29709, 45337]
18278D5337l1434l002J294j3630m291K8504r99l2751j2125R994J3888J271j0009
18265g953r67M307o13k2916J447J8159p794j082O915K6844L282J7768k379k3252
18251A1766l1176q466L0519L0141j5053k5806J2288J4635N755N667j8323P967
18239A9914J2993m153j3956r762J8148R134n060p787j460K3192n325J6066O842
18226E8786j3582j0757J279J1898j9369r565k6549k7958K5825L5157j152L074
18214B7087k812q220J3458J2195j2965L4557J6214j5840p482l511K7014K9836
18202A09531N349Q498r44K6130q677L7522M3955q267l243P648N735J3894j2768
18189B24363L518O321J2275K2266k7475m1315l726J9107J0416l5242j3286R855
$$ y = [45337, 13903, 10901, 12195, -1435, -5726, 22778, 21779, -10972, -23097, -13103, 785, 2056, -7953, -8920, -4613, -5226, -28142, -26695, -8536, -16330, -17412, -10497, 16347, 19629, 37397, 35018, 11766, -19410, -27876, 2643, 32784, 17731, -8075, 4213, 18848, 24603, 30270, 11947, 19914, 32907, 28754, 14798, 5036, 23184, 32318, 27258, 19471, 18011, 41203, 35878, 51944, 58786, 45204, 34447, 35726, 47624, 28255, 18690, -7859, -35817, -9992, 25165, 24013, 27087, 24275, 16055, 29513, 41708, 28743, 63300, 79514, 63674, 56192, 52681, 79695, 109531, 114880, 123378, 122434, 148564, 139887, 177409, 221364, 213097, 209854, 217502, 223237, 237131, 224363, 227881, 234202, 246477, 268743, 241268, 199953, 196227, 215334, 225750, 190508, 177222, 187077]
18177A87077j4998k2053K019O167j8761j5087l6032j2017r49L744j8352K8318
18165H9076L198J2568j3714k2990j3324k9501N2j2210p79L2443M300K917K2035
18152G4071J3859K1807K9661L6688K9945J6003J3351P428Q662J621K3348M1060
18140C17504L3088J7744K7626J9847l3242k6390J7347j3394j0196M7763K5010
18129D22707Q760J438r721n129k1353k2955n62j4517n4210O984J633K550k198
18116C13427j5087j1440K7306L0569k7389j3367J261j8327j1647j2431j7872j523
18104B43480k2229k2792j9422j7906k5478q198J5085R671k9418k0251k5986j026
18092G5530k634L0800L2811k331j7695J4559J3472P259J0851j376l3261k0069
$$ y = [187077, 172079, 150026, 152045, 158212, 139451, 124364, 88332, 76315, 75366, 79110, 60758, 89076, 92274, 104842, 91128, 68138, 54814, 25313, 25365, 13155, 12376, 44819, 49119, 52036, 74071, 87930, 109737, 139398, 176086, 206031, 222034, 235385, 242813, 251475, 253096, 276444, 317504, 350592, 368336, 395962, 415809, 382567, 356177, 373524, 360130, 349934, 397697, 422707, 431467, 432905, 423184, 418055, 396702, 373747, 373185, 358668, 304458, 311442, 313075, 315625, 313427, 298340, 286900, 314206, 344775, 317386, 304019, 305280, 286953, 275306, 262875, 245003, 243480, 221251, 198459, 179037, 161131, 135653, 127455, 142540, 152211, 122793, 102542, 76556, 75530, 72896, 103696, 136507, 134176, 116481, 131040, 144512, 151771, 162622, 161246, 127985, 107916]
18080A07916p404j2276j7591J9963K7708K8697j0950Q818L4678L9350l707K7912
18068B43114o243k804l2210l7798L619R655q001M1100L4293L187j2391j6209J0980
18055B30292R613r155k6491p986k3154J7738Q346R233O20k800j7751k5274j1573
18042A51658k9036j7348k0048j2028P799R862N653j2690k647P865K4951J9463
18030A33454j8894k5482n285K2782j1859O332j629N700K667n586Q20j8058q920
18017G6042j341p367k885j9672K1220J6837n522m744R62j4588l1063N391L2879
18004F6149J6216K8626K0151j2893k0351k8811r654J9686Q727M674O473J34J4572
17991A13699M1751q16j8355r56J2944j847q554j1868k9108j8646j0208J3831N636
$$ y = [107916, 100512, 88236, 70645, 90608, 118316, 147013, 136063, 144881, 179559, 218909, 215202, 243114, 236871, 234067, 201857, 164059, 167678, 177333, 169332, 210432, 244725, 247912, 235521, 219312, 230292, 239905, 230750, 204259, 196273, 173119, 190857, 199203, 208436, 209056, 206256, 188505, 163231, 151658, 122622, 105274, 85226, 73198, 80997, 90859, 96512, 83822, 81175, 89040, 113991, 133454, 114560, 89078, 83793, 106575, 94716, 101048, 99419, 105119, 107786, 102200, 103020, 84962, 76042, 74701, 67334, 64449, 44777, 65997, 82834, 77312, 72568, 73530, 58942, 27879, 33270, 66149, 82365, 110991, 131142, 118249, 97898, 69087, 59433, 79119, 87846, 92520, 98993, 99127, 113699, 155450, 154634, 136279, 135323, 148267, 146420, 137866, 125998, 96890, 78244, 68036, 81867, 87503]
17978H7503L22R085q522k893r067m1290L661K2266K1812J0664m1150k1817l9102
17965h528j8817K0499J8962K3088j5382l205K1773L0289j0323k1989j6441K21
17953B0147L546M812p239O708R068R632j5506Q532l856k6680M388J2029r350J322
17939A7553J3634Q856J0798J0876N0356k1942j8921J0022n36j7452l8429j1091
17927A3724J5022K8025J2283J7632P337p370R410J8954K6117J3269N6380M0616
17915B51399j2065l5126j9476k1688k4326m0759j8762Q75k0121K014N767N570
17903G3302O399L3564M086r619j0777j4611l398j4372K6384l011j9481P801k1353
17890E4914K3839J0815k7223Q170R993R236N931j014j4759M524K3241j5024j7483
$$ y = [87503, 87825, 96910, 88388, 85495, 76428, 35138, 38799, 61065, 82877, 93541, 52391, 30574, -8528, -27345, -6846, 12116, 35204, 19822, 16617, 38390, 68679, 58356, 36367, 19926, 20147, 23693, 28505, 21266, 27974, 37042, 46674, 31168, 39700, 35844, 9164, 13552, 25581, 16231, 17553, 31187, 40043, 50841, 61717, 112073, 90131, 71210, 81232, 80696, 63244, 24815, 13724, 28746, 56771, 69054, 86686, 94023, 86653, 96063, 115017, 141134, 154403, 210783, 251399, 239334, 204208, 184732, 163044, 138718, 97959, 79197, 80072, 59951, 61965, 67732, 73302, 79701, 113265, 117351, 107732, 96955, 82344, 78946, 64574, 90958, 87947, 68466, 76267, 54914, 78753, 89568, 62345, 70515, 80508, 89744, 95675, 94661, 79902, 84426, 107667, 92643, 75160]
17877G5160K0853j1069J9962M2452L5096J2103k3805j9666K206J5739r797L038
17865A62272l050J2846J1617K1994K5413K9460J7856j3305k3742m6117n7618k8757
17853A08869L128J5468j1472j0629J565P952r739m3621j1190L7426K6660K5493
17841A39910J9209j7885k8998J7010L719j1289K4076M859j3491J4142N001j7124
17829A39139L864P013k6736m1075l0974K0775L2081J9158m884K7289J3773N222
17817A64645L1086K32k440m326j0249J65j5675q229k0210k8321o220n336m327
17804I0795q557P027J1039L1230R843O759M560o776j5034K6595K602r581r372
17791A41130L605o158j502Q602q747r262j0186J8263K5290J0957j4898r930l502
$$ y = [75160, 96013, 84944, 104906, 147358, 182454, 194557, 170752, 151086, 153292, 169031, 159234, 162272, 159222, 172068, 183685, 205679, 231092, 260552, 278408, 265103, 241361, 195244, 137626, 108869, 111997, 127465, 115993, 105364, 106929, 114881, 105142, 61521, 50331, 87757, 114417, 139910, 159119, 141234, 112236, 129246, 132965, 121676, 145752, 150611, 137120, 151262, 156263, 139139, 143003, 150016, 123280, 82205, 51231, 72006, 104087, 123245, 118361, 145650, 159423, 164645, 195731, 195963, 193523, 189197, 178948, 179113, 163438, 155209, 134999, 106678, 100458, 95122, 90795, 82238, 89265, 100304, 131534, 141377, 148136, 152696, 145920, 130886, 157481, 160083, 150502, 141130, 144735, 138577, 137075, 145677, 136930, 127668, 117482, 135745, 161035, 171992, 157094, 147164, 143662]
17778A43662J6306J442k7192K6K0832K2455Q263j740m812n968k424l0549K49L5363
17764A75913M77q184M5R652k0159m282J8319K1015j3552r731j2030p303K0505
17751A70685k638N783K4004j307J1865P560k6062j1966k1974K671J6358J1132
17739A86111K1310m931r429K7723j592p418K888m631J3773J1572k5408k3059M221
17726A91130K5251q824k804k4794J2813K5881j7242K7637M1554j8407M5989L3513
17714C31697l7122P848K8840K458K675j2037J804N219J6546p889O975J6240K417
17701C65671M0482P9457K0680N0490N9349L4820m4290m9701m0456l0821n472K3703
17689E03912L8246n481l8662m2115O253J8524L2993J9283K9514j7365k6025j984
$$ y = [143662, 159968, 161410, 134218, 134244, 155076, 177531, 185794, 184054, 179242, 173274, 170850, 140301, 140550, 175913, 176390, 168206, 168251, 177903, 157744, 153462, 171781, 192796, 179244, 169513, 157483, 150180, 170685, 168047, 173830, 197834, 196527, 208392, 215952, 189890, 177924, 155950, 158621, 174979, 186111, 207421, 202490, 193061, 220784, 219192, 211774, 214662, 210031, 223804, 235376, 209968, 186909, 191130, 216381, 207557, 204753, 179959, 192772, 218653, 201411, 229048, 270602, 252195, 298184, 331697, 294575, 302423, 331263, 333721, 336396, 324359, 326163, 331382, 347928, 340039, 347014, 363254, 365671, 406153, 485610, 506290, 556780, 616129, 650949, 606659, 556958, 516502, 485681, 480209, 503912, 542158, 536677, 498015, 455900, 462153, 480677, 513670, 532953, 562467, 545102, 519077, 517093]
17677E17093L0342K7323L0231M417k4088k6487J2487K0729J5694q749L5625K3336
17665F57953J5502J9186L4459P725K2435M3332M4223L7272K8844M1734M5816P1774
17653A070255O9377Q4786R1114Q7885R9924Q1719J15630J49015K31416L30014
17643B411135M03450N00044N82034O42388P77970R97697J341495J671427J526241
17634A0853881O59708n28491j187888j046846o14304j36919L00866O90832J073398
17625A0064237J508623K063660K843499L986971N903574R003271J3506966J8551515
17617F7432316K0557254J3880348q19843j2761288j5584315j3671427j1675762
17610D7357283r580027o939490m333975k161174m43938J014612K072479K209621
$$ y = [517093, 547435, 574758, 604989, 609406, 585318, 558831, 571318, 592047, 607741, 598992, 634617, 657953, 673455, 692641, 727100, 734825, 757260, 800592, 844815, 882087, 910931, 952665, 998481, 1070255, 1139632, 1224418, 1315532, 1403417, 1503341, 1585060, 1700690, 1849705, 2081121, 2411135, 2814585, 3314629, 3896663, 4539051, 5317021, 6314718, 7656213, 9327640, 10853881, 11513589, 10985098, 9797210, 8750364, 8136060, 7999141, 8300007, 8990839, 10064237, 11572860, 13636520, 16480019, 20466990, 26370564, 35373835, 48880801, 67432316, 87989570, 101869918, 101050075, 88288787, 72704472, 59033045, 47357283, 37777256, 30837766, 26503791, 24342617, 23898679, 24913291, 26985770, 29195391]
17602B9195391P66701j987491m347337m901096m079668k941282k030435j373954
17594H300829r24497o30782m30226m03087l32938k60368j53467l5788O0107J29457
17584E319240K47041L06042L90923N14820P51924J098566J583872K225645L110651
17575A5548724L992515M348029L405367R92399j482067k395964j682434k46031
17567B2480538J379349L188239N253552P574652R729915J1160990J2281025J2208412
17559H5256672P039846m945012j6674888j9577168j5251879r985585o303288m076680
17551A5482018k703160j909302j424603j091270q37336n48163j75960K11732N78768
17542G582724Q69895Q05880J45634q93194j525115j451121j050604p27462n73168
$$ y = [29195391, 29962092, 27974601, 23627264, 18726168, 14646500, 11705218, 9674783, 8300829, 7376332, 6745550, 6315324, 5912237, 5579299, 5318931, 5165464, 5129676, 5189783, 5319240, 5566281, 5872323, 6263246, 6778066, 7529990, 8628556, 10212428, 12438073, 15548724, 19541239, 23889268, 27294635, 28287034, 26804967, 24409003, 22726569, 22480538, 23859887, 27048126, 32301678, 39876330, 49606245, 60767235, 73048260, 85256672, 92296518, 87351506, 70676618, 51099450, 35847571, 25861986, 19558698, 15482018, 12778858, 10869556, 9444953, 8353683, 7516347, 6968184, 6792224, 7003956, 7582724, 8452619, 9258499, 9404133, 8510939, 6985824, 5534703, 4484099, 3756637, 3183469]
17533C183469m73104m24937l37722k49838j62471j60559j49422j01438q6617o2893
17523I74468p4995p2836m4004m4438n5316j1322j4698m5172m1370m0746n7498
17512D72073m4536k9353l2922j8032k8440l0632l529j5084n952K5669j5533j9817
17500B53912j9533j3990M447J662n106l938J7702K8283Q557k1520P486J7625l5684
17487B39903l9404k3149j9123M890Q961J3747J5641k4359n158r187M37l1165j1491
17474A20543j7104N888J2186r01r243J738N372j1744l0629K4530J2869k2353j4583
17461G6569J573j1609N227k9175k5349J5442Q817p932M4012J3996k7754J6955
17449H0772j6944m0293j673K5344N182j5068J7344M631J890J4783J5235K726K597
$$ y = [3183469, 2710365, 2285428, 1947706, 1697868, 1535397, 1374838, 1225416, 1123978, 1037361, 974468, 899473, 826637, 782633, 738195, 682879, 671557, 656859, 611687, 570317, 529571, 472073, 427537, 398184, 365262, 347230, 318790, 288158, 284629, 269545, 263593, 289262, 273729, 253912, 234379, 220389, 224836, 226498, 221392, 217454, 235156, 263439, 271996, 250476, 257962, 275587, 239903, 200499, 177350, 158227, 163117, 172078, 185825, 201466, 177107, 171949, 162762, 163199, 132034, 120543, 103439, 109327, 121513, 120612, 111369, 113107, 118479, 106735, 76106, 100636, 113505, 91152, 76569, 78142, 66533, 71760, 42585, 17236, 32678, 41495, 33563, 77575, 91571, 63817, 80772, 63828, 23535, 21862, 47206, 52388, 37320, 54664, 59295, 61185, 75968, 91203, 93929, 96526]
17436I6526J2450K2241n624j7861j3079k5583l4154j6366J9372m1497l4447J3043
17424b4979J2670J027K732K4739J7965M794j0162k3142J4367P139Q449K2174l2814
17411B4959k6663M588N457J9535N740o825k3911j3900J2690J6915k922j7091P537
17398F109p107l8890R772r40k7014L6299K5395j338l4258p631r417P991k2266
17385f3295k5705J036k915K1184K6792o690K4276K2575j6393n223j7449j0495
17373e2302J5055J1056j6054r801R846K3018J9149l511l688N44l0898l8478R554
17360f6510L5324O694K190k4082N540P834k0008l16L091K6768P978Q387j8121
17347b5231k0040k4483J2124M354k333J57K0030p997N333L7703K6273J206l5604
$$ y = [96526, 108976, 131217, 125593, 107732, 94653, 69070, 34916, 18550, 37922, -3575, -38022, -24979, -12309, -11282, -8550, 16189, 34154, 38948, 28786, 5644, 20011, 27150, 35599, 57773, 24959, -1704, 2884, 8341, 27876, 33616, 26791, 2880, -11020, 1670, 18585, 15663, -1428, 6109, -998, -39888, -30116, -31056, -58070, -21771, 3624, 2286, -31972, -39603, -49020, -41029, -63295, -89000, -87964, -90879, -69695, -42903, -49593, -25317, -2742, -19135, -24358, -41807, -52302, -37247, -26191, -42245, -52046, -42200, -19182, -33, -3544, -7232, -6688, -37586, -76064, -66510, -31186, -24492, -22302, -46384, -40844, -33010, -53018, -53334, -50243, -23475, -15497, -7110, -25231, -45271, -69754, -57630, -53276, -55609, -55452, -35422, -43419, -38086, -383, 25890, 27096, -8508]
17334h508P338J4409j4061m7104l570j218N410J4212M328j8629J1318J4218J4476
17321g381q383j2812K63J543l0619l926K3942P349L08M716j0654R947j568O048
17307b1227K919R318p107l5271j0914p499K3048K9095j6291k1217k5749M050m348
17294h1193J6584K5921J8719J4494j0099j0761l329K9021J6243j5991O277J1981
17282A7867o590l8805k2067j2209j4223J9920K0422N627j1065o991P777N359j0508
17269d5486k7630k6376L6725O619L3704M714j0234J4478k0081j8427r467K6670
17257c4791K4056m623o943K147Q106J740k549J2695J969r389J842R708J2277k4142
17243g897k4738J0912j2664r801M686j2117n810j2490K0000L2505j03o154j6724
$$ y = [-8508, -1170, 13239, -822, -47926, -51496, -52714, -47304, -33092, -28764, -47393, -36075, -21857, -7381, -15764, -28576, -28313, -26770, -57389, -61315, -37373, -30024, -29716, -25000, -35654, -25707, -27275, -21227, -18308, -8990, -16097, -51368, -62282, -69781, -46733, -17638, -33929, -55146, -80895, -76845, -81193, -64609, -38688, -19969, -5475, -15574, -26335, -29664, -643, 15600, -391, 5886, 17867, 11277, -27528, -49595, -61804, -76027, -56107, -35685, -30058, -41123, -48114, -40337, -34978, -45486, -73116, -99492, -62767, -56148, -22444, -17730, -27964, -13486, -33567, -51994, -61461, -34791, -10735, -15358, -22301, -20154, -12048, -10308, -12857, -162, 1807, -7582, -5740, 3968, 16245, -7897, -32635, -21723, -34387, -44188, -39502, -51619, -57429, -69919, -49919, -17414, -17517, -23671, -40395]
17230d0395k4497o937K9001R895L735j91J3834K3014k804j8925P87m521k2230
17217d0234j6898P974K2415J821l0064j3849J4814K1395K446j580j0344j3083
17205e5187K4306M528n791l590J0878o298J2329m177j5294J0607l0163j801J6473
17192d3180o458j1601K9322J2900q147j04L857j5495J4781K616p878o974O281
17179c0080j166r133m497L691K2610L5786l535k2708j2705k6640J2626J0515j4341
17166c9577J143j5767p760p055J2910L340j7103K3959J3921J0747m002p644O592
17153b6296M8114j2291k7359r434R950J4917J4725p780m6996j3102N6685M035
17141E168k8389P600j3793o890L882j3748L260J0373L01L0627K7151j2672L1567
$$ y = [-40395, -64892, -71829, -42828, -32933, -29198, -29389, -15555, 7459, 4655, -14270, -13483, -18004, -40234, -57132, -49158, -26743, -24922, -54986, -68835, -54021, -32626, -30180, -31760, -42104, -55187, -30881, -26353, -32144, -35734, -24856, -31154, -18825, -23002, -38296, -27689, -57852, -59653, -43180, -49638, -61239, -31917, -19017, -27164, -27268, -23411, -38906, -24125, -21509, -29387, -36361, -30080, -31246, -40379, -44876, -41185, -18575, 17211, 13676, -9032, -21737, -48377, -35751, -25236, -39577, -38434, -54201, -61961, -69016, -56106, -52766, -69869, -45910, -31989, -21242, -25244, -32888, -26296, 21818, 9527, -17832, -27266, -17316, -2399, 12326, 4546, -42450, -55552, 1133, 5168, -23221, -15621, -29414, -36304, -32422, -46170, -42910, -32537, -32236, -1609, 25542, 12870, 44437]
17128D4437L943l62o459n241O18o040J1309L970J6738K3486R056K5858L865J4816
17114A39994o888k1728J4661L2596K2016o489j6042J0398j8334k9266M216N1537
17102A76671K3702n414j087L275J3500J6481k3844m9459l3032q672N10n0479l6378
17089B5774l0661j7363K4085J1225M063J0083k99p29L0409P137n227r757q027
17076D0713Q52J778k834j8401p577N62j0975j21J0102N6787M3600K0658K3944
17063A59088N057J3929R340r626l302K6435K8686M28m1289l1367k2204k7556j6072
17050I1547o56J1131K0482j4465K549M206L8905J6656o359J8680M8222P296l2511
17037B05683l0240l5938l7503j1559l1830j393k817n459o470k0819l9457Q475
$$ y = [44437, 48380, 48018, 41559, 36318, 36936, 30896, 42205, 46175, 62913, 86399, 95455, 121313, 125178, 139994, 133106, 111378, 126039, 158635, 180651, 174162, 158120, 168518, 150184, 120918, 125134, 176671, 200373, 194959, 193872, 197147, 210647, 227128, 203284, 153825, 120793, 112121, 112631, 62152, 25774, -4887, -22250, 1835, 13060, 17123, 27206, 26907, 26178, 56587, 63724, 58497, 48740, 40713, 41565, 43343, 40509, 22108, 14531, 15093, 4118, 3997, 14099, 70886, 114486, 135144, 159088, 164145, 178074, 187414, 177788, 174486, 200921, 229607, 230035, 188746, 157379, 135175, 107619, 91547, 90891, 102022, 122504, 108039, 110588, 114794, 153699, 170355, 163996, 182676, 230898, 238194, 205683, 175443, 139505, 102002, 90443, 58613, 57220, 54403, 48944, 42474, 21655, -17802, -9327]
17025i327L263j4062k747K487K2325p723N807r196J659J0001N010k1331j5842
17012b9676K934M731J4807J2870n686M851Q736o068j3195q890k7946j2657M439
16999e0750J6453Q50N984j7148J1064O843j0562J0579P860J7680j4803j6278J0467
16986b1761j9994j2266m675j702L4259N01k5852q63M662M051K5167N596j0527
16973b3404j5592k596J2296k761M642m704j358J4977O973R314j3885k6979n027
16960d8104M65k784J3592k856k9016J2452K6121K6169Q473o878q097n352P644
16947h171K7408N696J0818k7395k3472j7853M336p2q504j3522R974m18n322j43
16933d6640K4887j3705M772N716N043p139k276O230M913j6232K7885j6291j3144
$$ y = [-9327, -6064, -20126, -22873, -20386, 1939, -5784, 23, -9173, -7514, 2487, 7497, -13834, -29676, -26742, -22011, -7204, 5666, -20, 4831, 13567, 7499, -5696, -14586, -42532, -55189, -50750, -34297, -33447, -27463, -44611, -33547, -26704, -37266, -26687, -18827, -1147, -15950, -32228, -21761, -41755, -54021, -58696, -60398, -26139, -25638, -51490, -52353, -47691, -43640, -18473, -12877, -23404, -38996, -41592, -29296, -32057, -27415, -32119, -33477, -18500, -11527, -2213, -16098, -43077, -48104, -47639, -50423, -36831, -39687, -68703, -56251, -30130, -3961, 4512, -2366, -10463, -15815, -8171, 19237, 24933, 35751, 8356, -15116, -32969, -28633, -28705, -37209, -50731, -40757, -41175, -46497, -46640, -21753, -35458, -30686, -24970, -19927, -27066, -29342, -23112, -18199, -34431, -6546, -22837, -35981]
16920c5981K7274N658p146J3515N014J0497J2572r761r224M578j5141l266k0880
16907b2291Q081J5896O959k2406j9468J8017J798K5624J7896j0871L491k3027
16895c01j2771L3058J4950k3021J3402j246k1032J4431Q820r88o878j8006j3628
16882a3210M388p287o737p277N022l121j4074N021J0182N98k400K7536L5j0960
16868a2284p078N705j632n651K1392J725p594k7332j0925j7832K666j1788N826
16855f4802M0085J9878r613j9500p730K5246j428K090J9954J1569j1216n974j1502
16842a2943K9949q560j3694q595Q021J3081j3792J715R059K4333k2836j7251l2905
16829d4418k475P616K0531q192o489r007o372J9243o989J0921q253p969j5930
$$ y = [-35981, -8707, -3049, -10195, 3320, 8334, 18831, 31403, 21642, 12418, 16996, 1855, -1411, -22291, -14210, 1686, 8645, -13761, -33229, -15212, -13414, 12210, 30106, 19235, 22726, -301, -13072, 19986, 34936, 11915, 25317, 24071, 3039, 17470, 26290, 25302, 18424, 418, -13210, -8822, -16109, -22846, -30123, -25101, -28222, -42296, -37275, -27093, -26495, -28895, -1359, -1324, -12284, -19362, -13657, -15289, -20940, 452, 2177, -5417, -32749, -43674, -61506, -58840, -70628, -64802, -24717, -4839, -14452, -33952, -41682, -16436, -17864, -15774, 4180, 15749, 4533, -1441, -12943, 17006, 8446, -5248, -13843, -5822, 7259, -6533, -4818, 4241, 28574, 5738, -11513, -44418, -46893, -39277, -18746, -26938, -33427, -42434, -48806, -29563, -36552, -25631, -33884, -41853, -57783]
16816e7783J2644O805j7055K6130P321j4049J4200J6421k321m04O866r148j4435
16803b4808l248O03K2658l4793j9669K4134K7227J647j2543j376o710l6323l2
16790f3233K4220K3774j523j7254j447J2448j6796n269L1408J7657m699N277j1389
16777f826m381k3798l5960j0413J2779J3909J5047j14j7728K351J1600Q669P494
16764b7371l575K0076K2696J2849j3954r932j9672Q379K8163j2520k3611R300
16752i172J2223J3024J2379J234k4498j320j1807m811Q178N988J4298j4942j7762
16739a6988m5148j6105K5574J9548n028Q414K3388j4281k3484J2016K8773q087
16727a1408k8693j1237Q887J9996P790J0631P439n359K2471J0132j2267K938K6950
$$ y = [-57783, -45139, -38334, -55389, -29259, -21938, -35987, -21787, -5366, -7687, -8091, -1225, -10373, -24808, -28056, -27453, -4795, -39588, -59257, -35123, -7896, -6249, -18792, -20168, -26878, -63201, -63233, -39013, -15239, -16762, -34016, -35463, -23015, -39811, -45080, -13672, 3985, -714, 4563, -6826, -11207, -35005, -70965, -81378, -68599, -54690, -39643, -39757, -57485, -55134, -43534, -34865, -27371, -30946, -10870, 11826, 24675, 10721, 789, -18883, -10504, 17659, 5139, -18472, -9172, 3051, 16075, 28454, 29688, 5190, 3870, -7937, -12748, -4570, 1418, 15716, 774, -16988, -62136, -78241, -52667, -33119, -38147, -29733, -6345, -20626, -44110, -32094, -3321, -11408, -40101, -51338, -42451, -22455, -14665, -4034, 3405, -1954, 20517, 30649, 18382, 21320, 48270]
16714D8270O402l4696k6918o637M076O755r079M257L4057l4824k2974l623K0062
16701a4872O09j3040N204J2305j9515j3365o979J5320Q736K3736K1668j2995j7690
16688a0878J048O349l233j9376J6911J4418J7391J9850r292p119k6794j0681o414
16675a7820J9533K6433R786k1486l4086j2987p873J4243J6150j497N980J6301
16663A2677j126o252n022L833R736q763L910m0261k1627N785J1293j0595m546
16650e0958J3704K949J1691k2487L319J1562K2132p22j9550j0318R201P533Q83
16637b1061j091K0937j9848K457n113j1099p408k253m179K6021J0541j0945j6576
16624c9617O732L8306N538j0622J252j077l2405j3496J4581J6666n183J8380m124
$$ y = [48270, 54672, 19976, -6942, -13579, -9503, -2748, -11827, -7570, 26487, -8337, -31311, -34934, -14872, -14263, -27303, -22099, -9794, -29309, -42674, -49653, -34333, -25597, -1861, 19807, 6812, -10878, -9830, -3481, -6714, -26090, -9179, 5239, 22630, 42480, 33188, 26069, -725, -11406, -17820, 1713, 28146, 37932, 16446, -17640, -30627, -38500, -24257, -8107, -9604, -3624, 12677, 11551, 5299, 277, 4110, 13846, 5083, 8993, -31268, -52895, -47110, -35817, -46412, -50958, -37254, -34305, -22614, -45101, -41782, -30220, -8088, -8810, -28360, -38678, -29477, -21944, -21061, -22152, -1215, -21063, -18606, -23719, -34818, -42226, -44479, -48658, -22637, -12096, -23041, -39617, -32885, 5421, 10959, 337, 1589, 512, -31893, -45389, -30808, -14142, -19325, -945, -5069]
16611e069k787J3004J2192L204q078N963J905j2424l86J0152j9222n011J6680
16598A0123K0696j0625J673j952j4680M492J6889J4892j1810r542L529N436j5021
16585A4100j3800J5042K17j2126p527N277N212K982M368j1048J3073L3594L321
16572E2685n4482k7639J768L4529J9135j9334j2633o374P079j0047P412J276K3123
16559A6498J8514l547j3747M008k6171n249J9805K6609k004j5159k2330j5603
16547a8376m95j832J1026J4939J009p868L788m99O813L2418L1278L531m9169k9294
16533b731j7064J6896J0248J5392n840r225O560K2043k571j294j2595m060j6666
16520i07L317N522J3430K1196k3038j9986l992J884j0681Q864J7427J2465m33
$$ y = [-5069, -7856, 5148, 17340, 20544, 12466, 18429, 20334, 7910, 7524, 17676, -1546, -6557, 10123, 30819, 20194, 21867, 19915, 5235, 9727, 26616, 41508, 29698, 20156, 23685, 29121, 14100, 300, 15342, 15559, 3433, -4094, 1183, 6395, 9377, 13745, 2697, 15770, 49364, 52685, -1797, -29436, -27668, 6861, 25996, 6662, -5971, -12345, -5266, -15313, -7901, -6625, 16498, 35012, 31465, 17718, 21726, -4445, -9694, 10111, 36720, 34716, 19557, -2773, -18376, -18871, -20703, -9677, 5262, 6271, -1597, 2191, 1692, 8505, 40923, 72201, 75732, 26563, -2731, -19795, -2899, 7349, 22741, 16901, 7676, 14236, 36279, 33708, 32414, 19819, 15759, -907, 2410, 7932, 21362, 42558, 19520, -466, -4458, -2574, -13255, -4391, 13036, 25501, 25068]
16507B5068L843r958r610n936J8530k804q753J2196n03J2175j74k0788j4468l1015
16493c2197J2305J8501r739l376P940k499J3915J3788P143j6223j1827M809j1669
16480i129q551j599m500l205l3812r440L5098n343K4409J5532J0853k3258J4104
16467A159J2819J0076N854j0896K375j4067N642j7979q55j6157O337k6663J219
16454d1136P850J2691P331j910mK8964K2922m597P478j638j195l805j1004j6345
16440E602l0608J085K4566J3775o124q773j190l604j3142k3266k2826j950J8494
16427d7961L5404j776j8340K1934J1522J5783L371k6367K5120Q692j9085r778
16415a481n622J9073K685L382Q196J067k5956K863p534j9818O409J7632J8242
$$ y = [25068, 28911, 18953, 9343, 3407, 21937, 19133, 10380, 22576, 22073, 34248, 34074, 13286, -1182, -32197, -19892, -1391, -11130, -14506, -6566, -9065, 4850, 18638, 25781, 9558, -2269, 2540, -9129, -17680, -19279, -23779, -26984, -60796, -70236, -35138, -40481, -16072, -540, 10313, -12945, 1159, 13978, 24054, 29908, 19012, 21387, 7320, 12962, -5017, -5872, -22029, -15692, -42355, -41136, -33286, -20595, -13264, -15174, -15178, 13786, 36708, 32111, 39589, 37951, 36756, 32951, 21947, 5602, -25006, -23921, 645, 14420, 8296, -477, -1667, -5271, -18413, -41679, -64505, -66455, -47961, -12557, -14333, -32673, -10739, 783, 16566, 19937, -6430, 18690, 27382, 8297, -1481, -7103, 11970, 14655, 18037, 26233, 27300, 1344, 4207, -3327, -23145, -16736, 896, 19138]
16402A9138j7129k9064r224K0473J2909K8011K4245j2495j6782J0158j1256L459
16390B2443J1807p954p930m048m249k343J5179m828N920m914k550K5439Q75j3512
16376B9335j0267P019M290l262m986L403N786N056k1275J670l981L4454q217j5367
16362B3658Q315N802J1358k8740j3269K031k5921j5598J3981P852M5695J7254
16350E2418j5967l2017N585R224Q228K9755j4792j3048J675J4441l469J692j3021
16337C0704J1162l254k4042M284J1493l252j5407r124K647J9591j0085J3660j4333
16324A4044j5182M83j9407J2782q681J899J8246K1571L3908k6156k2412J403j3962
16311a464j1634L064k732k014K6137O31j8486J1176L1391R404j0974j2784J8574
$$ y = [19138, 2009, -27055, -36279, -15806, -2897, 25114, 49359, 36864, 20082, 30240, 18984, 22443, 34250, 26296, 18366, 14318, 10069, 7726, 22905, 18077, 23997, 19083, 16533, 41972, 42847, 29335, 19068, 26087, 30377, 27115, 22129, 25532, 31318, 36374, 15099, 16769, 12788, 47242, 39025, 23658, 31973, 37775, 49133, 20393, 7124, 9155, -16766, -32364, -18383, -10531, 35164, 52418, 36451, 4434, 10019, 19243, 27471, 57226, 42434, 29386, 31061, 45502, 42033, 43725, 30704, 41866, 38612, 14570, 18854, 30347, 27095, 11688, 2564, 5211, 24802, 14717, 28377, 14044, -1138, -655, -20062, -7280, -15961, -14062, 4184, 25755, 59663, 33507, 11095, 12498, -1464, -13098, -10034, -12766, -14780, 11357, 11988, -6498, 4678, 36069, 45473, 34499, 21715, 40289]
16298D0289P511k4542j185P956m938o945q038m339p756J5975P927j3859L943j4938
16284b939m087n306K3344L41j2341l464K3323K6605J6703P999J4746k1934j084
16271F1906P696j7884j9296J1729j2809k0402j1284O796J1200K0993P793J7645
16259F4083J8284r916k6191q187N386J2721k541j9544q148K013O845N139Q095
16246D8039j6234J1967j5717l262k1612L596M4007k59k4204M943M699J4919M845
16233E5727J8172l6353j5722n520J1835K8558J3076j8392l0412J8653K427q510
16221C3539L5080j2699k5305j5864l8332J9761O664r25K2351K4562R046K7329
16209H5207J5245k3796j2715Q557J0591q785k1147J4342J2788j6804k4463o5j2826
$$ y = [40289, 47800, 23258, 22073, 30029, 25091, 18146, 10108, 5769, -1987, 13988, 21915, 8056, 11999, -2939, -7026, -12332, 11012, 11353, -988, -4452, 18871, 45476, 62179, 70178, 84924, 62990, 61906, 69602, 51718, 32422, 44151, 31342, 10940, -344, 6452, 17652, 38645, 46438, 64083, 82367, 72451, 46260, 38073, 43459, 56180, 53639, 34095, 25947, 27960, 34805, 39944, 48039, 31805, 43772, 28055, 24793, 3181, 6777, 50784, 50525, 26321, 31264, 35963, 50882, 55727, 73899, 37546, 21824, 16304, 28139, 56697, 69773, 51381, 20969, 39622, 42049, 33539, 68619, 55920, 30615, 14751, -23581, -3820, 2844, 1919, 24270, 48832, 57878, 85207, 100452, 76656, 63941, 72498, 83089, 74304, 53157, 67499, 80287, 63483, 39020, 38955, 26129]
16196B6129N827K2164J1224R515j204j6110j3537o19k611L3967L015m0649N834
16183D2945K6568j8124m3178o945j622N3999Q672k0216l2959O065j9399J1026
16171F832J9838o645O124J1261Q631o047p22L0441j2023n654M194L466j1171K0138
16157F8663K548J222J284j5854J9626L0981k679k3057k8125k4286j6675K8307
16145D1955M5723M3123k4140l0365k411k7144K752J6443r244L2913J0744N036
16133A05385q315j4538m2734l4162p72K56L3669L2087J3337l653j4131P157O331
16120G9917k3804J200K1579J2909k459J948j7162l230j2639J3904L3113J2217
16108A17493l029j6625k3033J1997j14O58n168j018J2843l600N245j1130n931
$$ y = [26129, 31956, 54120, 65344, 74859, 73655, 57545, 44008, 43389, 40778, 74745, 77760, 37111, 42945, 69513, 51389, 8211, 1266, -356, 53643, 62315, 42099, 9140, 15205, -4194, 6832, 26670, 20025, 26149, 37410, 46041, 39994, 39272, 69713, 57690, 52036, 56230, 59696, 48525, 68663, 71211, 72433, 73717, 57863, 77489, 108470, 105791, 82734, 54609, 30323, 13648, 41955, 87678, 130801, 106661, 76296, 73885, 46741, 49493, 65936, 56692, 89605, 100349, 105385, 97070, 82532, 39798, 5636, 4864, 5120, 38789, 70876, 84213, 80560, 66429, 73586, 79917, 56113, 57313, 78892, 91801, 89342, 91290, 74128, 70898, 58259, 72163, 105276, 117493, 114464, 97839, 74806, 86803, 86689, 87347, 82179, 81161, 94004, 90404, 95649, 84519, 78588]
16095G8588K478N623J8816O683K501m216j516J3238O474k3425j3697j451l064
16082H7032K011J2534J0938J7011j753m361j2089R53j4614l2883M641K6297M235
16069I9952K164M162q00M981j5517r8N080L736r343q676j5276m027M380K1417
16055I2135L775J3565K4648K1708K6635o687k6591p66N350r843j2702l0379J0826
16042A11674R520j0815J0674j0853q65q394o584J8836J1679o542r258r595j3203
16029H6274R720M4863p55j2612J7794J8681j5039m741O412R618R663j5094J1600
16016A66384J529p773j6719J657K8999J1776k5980L19K635M005j6354j4516K5330
16003A61292J8436k8023M118L3928Q890J2272p08J0966j0312J3893o679J2425
$$ y = [78588, 81066, 86689, 105505, 112188, 114689, 110473, 108957, 122195, 128669, 105244, 91547, 90096, 87032, 89043, 101577, 112515, 129526, 127773, 123412, 111323, 112276, 97662, 64779, 69420, 95717, 99952, 102116, 106278, 105478, 110459, 94942, 94844, 99924, 103660, 94317, 85641, 70365, 66338, 70718, 92135, 95910, 109475, 134123, 155831, 182466, 175779, 149188, 148422, 153772, 143929, 131227, 100848, 111674, 121194, 110379, 121053, 110200, 109335, 100941, 94357, 113193, 124872, 118330, 109072, 99477, 86274, 95994, 140857, 140102, 127490, 145284, 163965, 148926, 144185, 150597, 160215, 169878, 154784, 166384, 167913, 160140, 143421, 145078, 174077, 185853, 159873, 160192, 162827, 166832, 150478, 135962, 161292, 179728, 151705, 155823, 189751, 198641, 210913, 210205, 221171, 210859, 224752, 218073, 230498]
15991B30498O713j0831j5969J723K4101J0524q656r582m401J7061L1665K0916
15979B93762J6253l486r264K5031P344J964L4410P596M358P56k0056J951J4244
15966C74863p863l312k8891K453j1932l4227N358L6715K6242k6841k1071L313
15954C14807J7961N262k23L6092K3911k6419l3207k9030r89J372j882R4o68k830
15940C04251j1153L457K616l854O291R795j2867k181l498o474n870j1490k0214
15927B48809J2962M2087K0265k9229j2298M0642K5543k1307J2721O700J1229J0375
15915C68499k2087l9135l875M4695J978j6728m231o933J3634j3154k3203o627
15903B92833L931J0744r447J5945J3972J2781Q345Q979j9476j0959J2322R338
$$ y = [230498, 237211, 226380, 210411, 212134, 236235, 246759, 238103, 228521, 224120, 241181, 272846, 293762, 310015, 306529, 297265, 322296, 329640, 331604, 366014, 373610, 377968, 378724, 358668, 360619, 374863, 367000, 363688, 334797, 337250, 325318, 291091, 296449, 333164, 359406, 332565, 311494, 314807, 332768, 338030, 337807, 373899, 397810, 371391, 338184, 309154, 308165, 309537, 307655, 307749, 307081, 304251, 293098, 296555, 299171, 295317, 301608, 311403, 298536, 296355, 292857, 286383, 280513, 269023, 248809, 261771, 303858, 324123, 294894, 282596, 323238, 348781, 327474, 340195, 346895, 358124, 368499, 346412, 307277, 303402, 348097, 350075, 333347, 329116, 322183, 335817, 322663, 299460, 292833, 296764, 307508, 298061, 314006, 327978, 340759, 349104, 358083, 338607, 327648, 339970, 349308]
15891C49308j3242j4647M601J1160L2138m257N11J9489J7960K8779J4489K635
15879D48924j9356j6968L2128L1588Q708j0230k2806k2540J5877K5479J3190m391
15867D79603L4814J0829q112K9738M211j7044r569k26K7342K9124j3275j5540
15855E51895j1900L4309L5396J8683J3180j0281o052K1998J5015l0338O565K3142
15843F61612J4708R808J1383L905J2676K3912k0255P979J9412K1361o02L01K7133
15830G93333J3664j6122R844K6600K1743M0142K7784p974j7690J5812K5263P950
15818I40349o27J2194K131J7420J6753K2686J6040K2088k729K3599O590J2393
15806A088887J4039L559L9173K9166K7562J0033L2175L4643J4497J8412K3835
$$ y = [349308, 336066, 321419, 326020, 337180, 369318, 365061, 365572, 385061, 403021, 431800, 446289, 448924, 429568, 412600, 444728, 476316, 485024, 474794, 451988, 429448, 445325, 470804, 483994, 479603, 514417, 525246, 517134, 546872, 551083, 534039, 524470, 524244, 551586, 580710, 567435, 551895, 539995, 574304, 609700, 628383, 641563, 631282, 625230, 647228, 662243, 631905, 638470, 661612, 676320, 686128, 697511, 701416, 714092, 738004, 717749, 725728, 745140, 766501, 765899, 766200, 793333, 806997, 790875, 800719, 827319, 849062, 889204, 916988, 909014, 891324, 907136, 932399, 940349, 939722, 951916, 954047, 971467, 988220, 1010906, 1026946, 1049034, 1046305, 1069904, 1076494, 1088887, 1102926, 1106485, 1145658, 1174824, 1202386, 1212419, 1244594, 1279237, 1293734, 1312146, 1335981]
15795A335981L6201L823M2695N6624M016L3534K8991J3928M7335J4576K3968K0914
15783A662586K7537Q1504N2067K1469M8349Q2206N0541L8418L8558L2709O1544
15772B197488Q1831N9922P8245N8775M3970L3465N3060Q0394Q1681P4499N9810
15761B903140R6638J22702J16631R7760P9193J18687J24842J16942J39828J32715
15751D049078J16524J65380J63445J48610J44066J90619J89183J81384J98648
15742E546937K18947K39054K63466K86100K62661K91464L51949L54967L53352
15733H168897L55896L81794M39347M65157M94269N33575N85440O28139O78563
15724A2731077P38762Q05821Q18622Q56923R36236J041716J155682J198816J282743
$$ y = [1335981, 1372182, 1376005, 1418700, 1475324, 1479340, 1512874, 1541865, 1555793, 1603128, 1617704, 1641672, 1662586, 1690123, 1771627, 1823694, 1845163, 1893512, 1975718, 2026259, 2064677, 2103235, 2135944, 2197488, 2279319, 2339241, 2417486, 2476261, 2520231, 2553696, 2606756, 2687150, 2768831, 2843330, 2903140, 2999778, 3122480, 3239111, 3336871, 3416064, 3534751, 3659593, 3776535, 3916363, 4049078, 4165602, 4330982, 4494427, 4643037, 4787103, 4977722, 5166905, 5348289, 5546937, 5765884, 6004938, 6268404, 6554504, 6817165, 7108629, 7460578, 7815545, 8168897, 8524793, 8906587, 9345934, 9811091, 10305360, 10838935, 11424375, 12052514, 12731077, 13469839, 14275660, 15094282, 15951205, 16887441, 17929157, 19084839, 20283655, 21566398]
15715B1566398J395049J465440J598887J690396J805001J872441J982603K068073
15707C5444288K137019K180542K151977K089852K016629J859075J665909J408179
15699E0953470J097386P11469K81617j49534n65843q90718j243720j567126j800756
15690D6826245j952784k048252k111551k126452k097371k047051j973070j896549
15682C0573165j779356j692541j590778j484226j397050j255689j199988j143978
15674A9029559j046707r71012r27418q87251q17634p70547p47269o70695o36926
15665A1554100o17749n41552n03173m64505m62235m48390l87450l98677l50410
15656G379959l21639k88950k99908k58233k43026k44802j91393k24634k39497
$$ y = [21566398, 22961447, 24426887, 26025774, 27716170, 29521171, 31393612, 33376215, 35444288, 37581307, 39761849, 41913826, 44003678, 46020307, 47879382, 49545291, 50953470, 52050856, 52762325, 53043942, 52894408, 52328565, 51437847, 50194127, 48627001, 46826245, 44873461, 42825209, 40713658, 38587206, 36489835, 34442784, 32469714, 30573165, 28793809, 27101268, 25510490, 24026264, 22629214, 21373525, 20173537, 19029559, 17982852, 17011840, 16084422, 15197171, 14379537, 13608990, 12861721, 12191026, 11554100, 10936351, 10394799, 9891626, 9427121, 8964886, 8516496, 8129046, 7730369, 7379959, 7058320, 6769370, 6469462, 6211229, 5968203, 5723401, 5532008, 5307374, 5067877]
15647E067877j99580j72529j72458j53325j47646j45056j45804j41068j06174
15638C684237j15664j32895j17124j02301r3519r2931n7417o5987q9576j01686
15628B715137p6583p7216p0770p6896r5748o1721l8159m3170m2239m9712p4511
15617B008412m1086k2615k2458n1179o4032n9779n1760r826l5327j7108l4445
15606A598797n3038k5378k8993k0404m8128k2570n268l1769k2962l5042m7211
15595A258034l8437k7366j2113j5286N079m664j5215m0391l5220j6801k036n431
15583A050153k5396k7314l4195o854k8212k6658k524r971j0483q825j1023l9919
15571H18779q140p553k6969k2707M470J7838J2916k7025l3847l2465J9421J0116
$$ y = [5067877, 4868297, 4695768, 4523310, 4369985, 4222339, 4077283, 3931479, 3790411, 3684237, 3568573, 3435678, 3318554, 3216253, 3122734, 3029803, 2972386, 2906399, 2816823, 2715137, 2638554, 2561338, 2490568, 2413672, 2317924, 2256203, 2218044, 2174874, 2132635, 2082923, 2008412, 1967326, 1944711, 1922253, 1871074, 1807042, 1747263, 1695503, 1685677, 1650350, 1633242, 1598797, 1545759, 1520381, 1491388, 1470984, 1422856, 1400286, 1395018, 1363249, 1340287, 1305245, 1258034, 1219597, 1192231, 1180118, 1164832, 1169911, 1165247, 1150032, 1109641, 1074421, 1057620, 1055584, 1050153, 1024757, 997443, 963248, 956394, 928182, 901524, 899000, 889029, 878546, 869721, 858698, 818779, 810639, 803086, 776117, 753410, 757880, 775718, 788634, 761609, 727762, 695297, 714718, 724834]
15559G24834o57P780j1575q929k7270k3535k8074l3569k8408k1723l1533m397
15547E12944M669K6797m428R886j6086J3383j4169k1160j0293j8526P408N771
15535D96196n221l0395j0893m370K119l7765j7112l710L397R869P33j9412j8481
15522C64955n053m27j1077k9006J9617Q793K3169o499j4929k7258N917m796p211
15509C16195O929l094j2910K1058P024k6436l200J731r085j2917J2680l240k1936
15496B72799k9275K1690J2956K674l946j3303K962O28o51k4675M496J6129m446
15483B58038j5618R09m967k1418j279o373K6616K0275k5392k8632j4588J0683
15471A98254j2156k052M494q024j1445K3911q00o953N16J9020o579k368q944r90
$$ y = [724834, 724177, 731957, 720382, 711453, 684183, 660648, 632574, 599005, 570597, 548874, 517341, 512944, 517613, 544410, 539982, 549868, 533782, 547165, 532996, 511836, 501543, 483017, 490425, 496196, 490975, 460580, 449687, 445317, 447436, 409671, 392559, 388849, 392246, 402115, 402848, 383436, 364955, 359902, 359475, 348398, 319392, 339009, 347802, 370971, 364472, 349543, 322285, 328202, 323406, 316195, 323124, 320030, 307120, 328178, 335202, 308766, 305566, 307297, 298212, 285295, 297975, 294735, 272799, 243524, 265214, 278170, 280844, 276898, 263595, 266557, 267185, 266534, 241859, 246355, 262484, 258038, 242420, 243329, 238362, 216944, 215665, 209292, 235908, 256183, 230791, 202159, 187571, 198254, 186098, 184046, 188540, 180516, 169071, 192982, 192182, 185229, 185745, 204765, 198186, 195818, 186874, 185884]
15457A85884Q057Q738j3753j2028o636m1053k753J5421J4339M337m283k3274L497
15444A36493K7877Q859J1855l3459k5015K428J1620L7105J3125j9049k78L2983
15432B04544k549J2868J4511Q448n183Q762K6316K1696M3582P211K930k1327j4155
15419C07654o235j7957j1086k1341k8539N580j3401J0288j7817k4694j3899j9720
15407A48833j1838j5727O05J2319p514r727J4215J9330j1887L704K616k2771j5982
15394A06176P259K0493k906l3278j1366j3635Q572J3069L5086O439j5443j1419
15382A09047j1892k6124J1613O201j084N948J4536j7656o216J347j7222p838Q680
15369F9340J7080K9621j9246k0355R980n868J6886k7719k5481J7831M685P228
$$ y = [185884, 193941, 202679, 188926, 176898, 170262, 129209, 126456, 141877, 156216, 160553, 156270, 132996, 136493, 164370, 173229, 185084, 151625, 126610, 129038, 140658, 177763, 190888, 171839, 171561, 204544, 201995, 214863, 229374, 237822, 232639, 241401, 267717, 289413, 332995, 340206, 343136, 321809, 307654, 301419, 283462, 272376, 251035, 222496, 228076, 214675, 224963, 207146, 182452, 168553, 148833, 136995, 121268, 121873, 134192, 126678, 116951, 131166, 150496, 138609, 142313, 144929, 122158, 106176, 113435, 133928, 131022, 97744, 86378, 72743, 81315, 94384, 129470, 135909, 120466, 109047, 97155, 71031, 82644, 88845, 87761, 93709, 108245, 90589, 84373, 85720, 68498, 60660, 69340, 86420, 116041, 96795, 76440, 86420, 80552, 97438, 69719, 44238, 62069, 66754, 73982]
15357G3982j0977K348K1473j7268j0026R820j1256k6517j0344J3026K5117N363
15345F4741J2332K0513j7253m0345l672L9582q722L046m844j3719K1611L1034
15333A04304K0430O507j716k1574k8295j2998K0779L1276k1254k6700j3095J7771
15321G5435k0122r460L074M988O464j3706r434K1378j9770r998O830P489J53R920
15307E3241J545j0884J3200K8266k3178l0115J0197J2338j9148j1427J3083J2784
15295D9902j5033m974J9403J8660o071k8821k3091K0284N444J1861Q249j7183
15283C8630o526J1660K2050j5582j47k088j7950J611J9641O513p095k1595l2128
15270c006J6679K0970k6950J5770J4172K3669K587k2324j4249K665P101j7179
$$ y = [73982, 63005, 65353, 86826, 69558, 59532, 69352, 58096, 31579, 21235, 34261, 59378, 64741, 77073, 97586, 80333, 39988, 36316, 75898, 67176, 70222, 65378, 51659, 73270, 104304, 124734, 131241, 129525, 107951, 79656, 66658, 87437, 118713, 97459, 70759, 57664, 75435, 55313, 45853, 48927, 53915, 60379, 46673, 37239, 58617, 38847, 28849, 35679, 43168, 43321, 53241, 54786, 43902, 57102, 85368, 62190, 32075, 42272, 54610, 35462, 24035, 37118, 49902, 34869, 29895, 49298, 67958, 61887, 33066, 9975, 30259, 35703, 47564, 55813, 38630, 32104, 43764, 65814, 50232, 50085, 47997, 30047, 31658, 51299, 57812, 50717, 29122, -3006, 13673, 34643, 7693, 23463, 37635, 61304, 63891, 41567, 27318, 29983, 37084, 19905]
15258A9905j6351K9342M3641K5283J1125k2212k5252K2473j6156m4843j172m281
15246B1502l743N131n241K2560K3490j2994l5149O045K9972j1117l3683J3461
15234B0234J6547J6424L143j5912l2331j139L711Q099K5462k0097r275N774J8159
15221C8799P14r586k0159R410L989k117l2252l4612m575K5165L1417J6322M242
15208B6757k3503o589L8089J1918l4919k1006k4354J839R763k2751J2262L278
15196b9216r148J7344K0402R27o153q457N790J311M761q076o754J1965K4306L6960
15182E5962j924l7535j0712K4077P677j6601K312K1928m906l0555o450J8819O010
15169B8102Q735j6596j9869J3219J2277L0967K6733j9519j8765q281l6412R701
$$ y = [19905, 3554, 32896, 76537, 101820, 112945, 90733, 65481, 87954, 71798, 26955, 25783, 21502, 17759, 22890, 17649, 40209, 63699, 50705, 15556, 21601, 51573, 40456, 6773, 20234, 36781, 53205, 56348, 40436, 8105, 6966, 10677, 18776, 44238, 24141, 14866, 20640, 38799, 39513, 29927, 9768, 19178, 23167, 21050, -11202, -45814, -50389, -25224, 6193, 22515, 26757, 3254, -3335, 34754, 46672, 11753, -9253, -33607, -31768, -22005, -44756, -32494, -29216, -38364, -21020, -618, 309, -5844, -14301, -8511, -7200, -2439, -10515, -17269, -5304, 19002, 55962, 54038, 16503, 5791, 29868, 37545, 20944, 23256, 45184, 40278, 9723, 3273, 22092, 28102, 36837, 20241, 372, 13591, 25868, 56835, 83568, 64049, 45284, 37003, 591, 10292]
15157A0292L171J4985j527k0756L5867j4641j435J5009k9803k4121O311J151O860
15144A363K5457k5238j2650K8777J2462J3745K7241r918m3217n982j794j2394
15132b148R13J698p316j7323K9171L759J5497L547J6912k898m292j2148N687K7198
15118E8257p406j2315k0500J916L826J7129M466k5533R4l869J8632J2155n387
15105D1465l3493j5571J3567j4709K842K980k606K249J1098j0014M10N937k5260
15092b1105k0524j5097N7385L246l8332P303K5683k4050q783j894p221K4704K1596
15079B911J4815K0980M465j6736k9754J3249L256j299O876q826J6734J09p577
15066A9203j4963l4871J688J9073J7042R654j5535j5080O071J0636m489J9713
$$ y = [10292, 13463, 28448, 26921, 6165, 42032, 27391, 25956, 40965, 11162, -12959, -6648, -5497, 1363, 26820, 1582, -11068, 17709, 30171, 43916, 71157, 61239, 18022, 12040, 10246, -2148, -1235, 463, -6853, -24176, 4995, 8754, 24251, 27798, 44710, 41812, 37520, 25372, 31059, 58257, 50851, 38536, 18036, 19952, 23778, 40907, 45373, 19840, 19934, 16065, 34697, 46852, 41465, 7972, -7599, 5968, -8741, -5899, -2919, -5525, -3276, 7822, -2192, -1782, 4155, -21105, -41629, -56726, 659, 3905, -34427, -27124, -1441, -25491, -34274, -36168, -43389, -18685, 2911, 17726, 38706, 43171, 26435, -3319, 9930, 13186, 11887, 18763, 9937, 26671, 26780, 19203, 4240, -30631, -28943, -9870, 7172, 16826, 1291, -13789, -7718, 2918, -1571, 18142]
15054A8142R737l6145L264J2718O509k482J3948J6164q217m4603m463k9064j3430
15041e7922L0937J5933j1663J3809O783N665r738j6005J163j8474j5871J6439
15029c8944K1938K997r338q610n20j1145p961k439K3597J4767N129J2814L235
15016E520J2758m509j7569K4045M883j0383j655K701k0812J1489K2850j5646m0152
15003b6480j5529p457k757J6574K4118L2031j5101k0529R846n439j0534r11L665
14990a8503m878J374J2392J4992K7312j599j8788l835K1070J3469q371j9408j56
14977A5071p645J3426K1154j2787K971J0110j0534m549J708j9655r838L239k0663
14964a7992j8332p725J6123J6854K5539m157j9536k1374K857J7504J2395m037
$$ y = [18142, 27879, -8266, -5002, 7716, 14225, 11743, 25691, 41855, 33638, -10965, -15428, -44492, -57922, -26985, -11052, -22715, -8906, -2123, 3542, -6196, -22201, -21038, -39512, -55383, -38944, -17006, -14009, -23347, -31957, -32477, -43622, -51583, -54022, -30425, -15658, -10529, 2285, 5520, 18278, 13769, -3800, 20245, 25128, 14745, 13090, 15791, -5021, 6468, 29318, 13672, -26480, -42009, -49466, -52223, -35649, -11531, 20500, 5399, -15130, -5284, -10723, -21257, -22168, -18503, -23381, -22007, -9615, 5377, 32689, 31090, 12302, 8467, 29537, 43006, 34635, 15227, 15071, 7426, 20852, 42006, 29219, 32190, 42300, 31766, 27217, 28925, 9270, -568, 2671, -17992, -36324, -44049, -27926, -11072, 14467, 10310, -9226, -30600, -27743, -10239, 2156, -1881]
14952a881L5007J8409L85l1006k0565N90L891J054p682k0257k7835j0186J1272
14939d8804L7865J1773j3854P564J1063J139m2215r964N8056P503k7571j051j2297
14926b0793J3364L4131L070j1751k2992j2316l0242J2886J0628K4243N340J5379
14914B0947J0107K2160j8677j4094j9527j1141q615R789j637k2719J097J7763
14902a4547J3434m196K1661N603j517P504L762J5345k9121l4059j973K1499O33
14889D028o120R000m082J861j3755j5041j9190j4736K90O869K1325J882j6950
14876d4619K1070J7970J4598j4403P000M293p634K233J3697L65K439k1444n517
14863i952q698L038j4920R322J5116j5432K5067L3950j2043k0560l3045N337o476
$$ y = [-1881, 33126, 51535, 51920, 20914, 349, 939, 4830, 5884, -1798, -22055, -49890, -60076, -48804, -10939, 834, -13020, -5456, 5607, 6746, -35469, -45433, 12623, 20126, -7445, -8496, -20793, -7429, 26702, 29772, 18021, -4971, -17287, -47529, -34643, -24015, 228, 5568, 20947, 31054, 53214, 34537, 20443, 916, -10225, -18840, -9051, -10688, -33407, -32310, -14547, -1113, -5309, 16352, 21955, 20438, 27942, 31704, 47049, 17928, -16131, -18104, 3395, 4028, -2092, 6908, 2826, 4687, -9068, -24109, -43299, -58035, -57745, -50876, -29551, -27669, -44619, -23549, -5579, 9019, -5384, 1616, 5909, -1725, 508, 14205, 14570, 17009, -4435, -9952, -18650, -15612, -30532, -21210, -6094, -21526, 3541, 37491, 25448, 4888, -28157, -22820, -29296]
14850b9296K673Q242j2980m110J1272L695K1807J7941K8685j5233o116k1044l2861
14837b7325P740j0709J655J9512L184P10J1385M560J8621m590k0942Q640l63m610
14823G468J1533l775k6121P673Q463R3o149p270q542l755j606r146j2970L740
14809d0364p839P664L7797K4511K5556K70l7947m6803j7732J4913J3410J2413
14797a4151J4848K3184q956j7052J1418P334J9415k3956k0378p311k470J2064
14785f011J8325r5r395k998J5637q537R729l706j5248m029J715J9769Q775p201
14771A6730l757J8506k968K0529j630k3037k2123p510k2790L93K21j574K0789
14758h221k9885K858J7700p274n133k19J330J6084k3561k345J183m328L2547K2146
$$ y = [-29296, -26623, -18381, -31361, -35471, -24199, -20504, 1303, 19244, 47929, 32696, 26580, 5536, -27325, -19585, -30294, -28639, -9127, -5943, -5233, 6152, 10712, 29333, 24743, 3801, 12441, 12078, 7468, 19001, 15226, -10895, -3222, 5241, 5334, -815, -8085, -16627, -20382, -21988, -31134, -44104, -40364, -48203, -40539, -2742, 21769, 47325, 47595, 9648, -37155, -54887, -39974, -26564, -14151, 697, 23881, 14925, -2127, 9291, 16625, 36040, 12084, -8294, -15605, -18075, -6011, 12314, 12219, 2824, -174, 15463, 6926, 16655, 12949, -2299, -6328, -4613, 15156, 23931, 16730, 12973, 31479, 28511, 49040, 47410, 24373, 2250, -5260, -28050, -27657, -27436, -29010, -8221, -38106, -35248, -17548, -24822, -29955, -30174, -28844, -12760, -36321, -38666, -37483, -41811, -9264, 12882]
14744A2882j7579k5080k2352L585M1630L0869j1560l3136J5242J7612J2506N042
14732B9661l8193K711K5465L4177j9392j5230R512p972j8936k4378J5262N1573
14720D4260Q657j2298K887k6763j2137j1008O931L3542j3885k7810j2966R997
14708a0593o5k4786l2623j3571J8085M2398P460j1851k214P434k0537j7669J3848
14695d4684J7050j3775j2097K7264m485k1803R001l798K0196L1774L6713M834
14683D6190l4146l6820j6594L0404O67l5476K108J8340k942J4204j5111L475J4956
14670a0745J9925K2770J4344L252R857l3635l5301k9214o44K4088J150j1310J1841
14657a3622J3321j0408M374k322J0920K7743j3252j5693o256o637m173O127j0433
$$ y = [12882, -4697, -29777, -52129, -48544, -6914, 23955, 12395, -20741, -5499, 12113, 24619, 29661, -8532, -5821, 19644, 53821, 34429, 19199, 28711, 20739, 1803, -22575, -7313, 44260, 52917, 40619, 43506, 16743, 4606, -6402, 529, 34071, 20186, -7624, -20590, -10593, -10658, -35444, -68067, -81638, -63553, -21155, -13695, -25546, -27760, -20326, -40863, -58532, -44684, -27634, -41409, -53506, -26242, -30727, -52530, -43529, -47327, -27131, 4643, 41356, 46190, 12044, -24776, -41370, -10966, -10299, -45775, -43667, -25327, -28269, -14065, -29176, -25701, -10745, 9180, 31950, 46294, 49546, 59403, 25768, -9533, -38747, -39391, -15303, -14153, -25463, -13622, -301, -10709, -6335, -8657, 2263, 30006, 16754, 1061, -5195, -11832, -16005, -9878, -20311]
14644b0311q013r767J7896M442q818q857j2756J4462J9649R978j3432j6274K9043
14631b758K42j8482Q356p518j51j0803l325l119K583K5918K1100m704k483J457
14617F313M773k075J4908j666j5849j3065J1666j017J7920M103M859j7423l4327
14604b0880J0489P453n259j425Q638j1578j3860J4134m887p056K0842K2461k0945
14591a873j8368m229j4776j9684K812p2L2212J3414K312J7907J1235k28l378K885
14577B0169r469j1078O989P403j587J6097N000l282P897P208j3562l419m315j097
14563B2954K299j5818j1098q476j2470r20J5454J6558j7150P52K7172j5485l0071
14550b6299k2448J5161J3066Q838n649J4173L5852J7440j8312j0664m0559j8679
$$ y = [-20311, -28324, -38091, -20195, -15753, -24571, -33428, -46184, -31722, -12073, -2095, -15527, -31801, -2758, -2516, -20998, -12642, -20160, -20311, -31114, -34439, -37558, -34975, -9057, 12043, 7339, 4856, 6313, 11086, 9011, 23919, 22253, 6404, -6661, 5005, 3988, 21908, 26011, 30870, 13447, -20880, -10391, -2938, -8197, -9622, -984, -12562, -26422, -12288, -17175, -24231, -3389, 19072, -1873, -20241, -24470, -39246, -58930, -56118, -56190, -23978, -10564, -8252, 9655, 20890, 20662, 17284, 20169, 10700, -378, 6611, 14014, 12427, 28524, 33524, 30242, 38139, 45347, 31785, 28366, 24051, 22954, 25253, 9435, -1663, -10139, -22609, -23529, -8075, 8483, -8667, -7915, 19257, 3772, -26299, -48747, -33586, -20520, -11682, -17331, -3158, 32694, 50134, 31822, 21158, -19401, -38080]
14538c8080L3383j3521k1037L90p788M722k618Q152K6433J7729n109O04K3372
14525B6632k0069j5208K0529Q905P538p411m729j8113k4541n123J1281p26j4196
14512c5231k1370r01J8216P295M523l310N761p817K7163j2730o582j3579p782
14499d6344J6917Q208n721O341Q53k365k7366j899J0085J5279J9021J4807J6415
14486B4231r104j9712J282J045o841o775j8481N857J5667k6400j5822M6452J7730
14473I129n539o60j2720n291k439j5948J7200K495j5892j0475j2276n502K7927
14460b9991K5197K4907k3256R696P612j0432M596J1553l0325k3074j1444J3472
14448c1489K9240Q939r616j3978J3172n266J0215J5376j1904j4914J1526L939
$$ y = [-38080, -4697, -18218, -39255, -38865, -46653, -41931, -44549, -36397, -9964, 7765, 2656, 3260, 26632, 6563, -8645, 11884, 20789, 28327, 20916, 16187, -1926, -26467, -31590, -20309, -21035, -35231, -56601, -57502, -39286, -31991, -27468, -30778, -25017, -32834, -5671, -18401, -24983, -38562, -46344, -29427, -21219, -26940, -20599, -19746, -22111, -49477, -51376, -41291, -26012, -6991, 7816, 24231, 15127, -4585, -3303, -2258, -9099, -15874, -34355, -28498, -12831, -39231, -55053, -8601, 9129, 3590, 2930, -9790, -15081, -17520, -33468, -16268, -13773, -29665, -40140, -52416, -57918, -29991, -4794, 20113, -3143, 6553, 14165, 3733, 8329, 19882, -10443, -33517, -44961, -31489, -2249, 6690, -2926, -16904, -3732, -8998, 1217, 16593, 4689, -10225, 1301, 5240]
14436E240j6029r46J5539P858P796N472j9407K7223P113k5859k6721K6489J3068
14423B6836k7601k042J393m2136K5281J4023j1769J1244J1803J7837r826k0022
14411d979J115m574j7472J3843P422J5417J8075m885k4259j9071J5377L6365J787
14398C4161j2276k5171J1062p860k6325J976k272q85J5794K6836j3288l9945j1431
14385d9624J4647J4985r306K5793N284K6428r442J1888j7006k6133M300J6779
14373H593K3512o150j679Q557K3010J3395j5951k5069k9612R296K7521n188k534
14360B7701k488K2206n983l0322q448J1684L7379J209l2410k0517J9939r740j0718
14347e08J5905j7117k0451J860p272j9037R452J6858J009p809K1362N536o415
$$ y = [5240, -10789, -11735, 3804, 11662, 19458, 24930, 5523, 32746, 39859, 14000, -12721, 13768, 26836, -765, -2807, -1414, -43550, -18269, -4246, -16015, -4771, 7032, 24869, 15043, -4979, -3864, -8438, -25910, -12067, -4645, 10772, 28847, 23962, -297, -19368, -3991, 32374, 34161, 21885, -3286, 7776, -84, -26409, -24433, -26705, -27590, -11796, 15040, 1752, -38193, -49624, -34977, -19992, -29298, -3505, 1779, 28207, 18765, 30653, 13647, -12486, -8186, 8593, 32105, 25955, 24276, 32833, 55843, 69238, 53287, 28218, -1394, 7902, 35423, 30235, 27701, 25213, 47419, 41436, 11114, 2666, 14350, 51729, 52938, 20528, 11, 19950, 10210, -508, 15397, -1720, -22171, -20311, -27583, -46620, -37168, -20310, -19301, -27110, -5748, -212, -6627]
14334f627j2596J4946K4775K3326j2053m3296L708L9050K4669l1651j3798L665
14322A4118n265J657J4854j4492k0419o840K81n179R954K7430j2635q706K2929
14309A7687p135l654k5271q762J0185K2015k0718j2916j0710K6113K959l888N255
14296h840M73j0068M558o840k8763l212K1598P898j9923K4544K0540j0980J8642
14283I627K5722K0194p887m2320l1094Q27P817q929p104l102p319l119J8848K1163
14269f676J6757K6733j57j8317n837r883J6493N724j5880K3246n19k1635r403
14256F46q68j7240q587N02j9937J4947o606l798j0736K93J9736K7386K052L701
14242A491k4243K46J4207j1233k6800L452K8791K183j9170m744J6696J366j6021
$$ y = [-6627, -19223, -4277, 20498, 43824, 31771, -11525, -7817, 31233, 55902, 24251, 10453, 14118, 8853, 10510, 25364, 10872, -9547, -16387, -16106, -21285, -11331, 16099, 3464, -5242, 17687, 10552, 6898, -18373, -27135, -16950, 5065, -15653, -28569, -39279, -13166, -10207, -14095, -8840, -8367, -18435, -13877, -20717, -49480, -52692, -31094, -23196, -43119, -18575, 1965, -9015, 9627, 35349, 55543, 47656, 5336, -25758, -24931, -17114, -26043, -33147, -36249, -43568, -46687, -27839, -6676, 10081, 36814, 36657, 18340, 12503, 2620, 19113, 24837, 8957, 32203, 31684, 10049, 646, -222, -17462, -26049, -25547, -45484, -30537, -37143, -40941, -51677, -51384, -31648, -4262, -2210, 1491, -22752, -22506, -8299, -19532, -46332, -42880, -14089, -11906, -31076, -35820, -19124, -17758, -33779]
14229c3779K7049n728J9094O28n88J741j4390J3429j0962j5849j1356M889j4054
14216c9876J6337J6557n40q619O145J9042P871L793p370j3587q826n233n030K9508
14202A0172n620j331j2680k2336K604K5130J1993r871o690O387J3324J4672j5209
14189A0545j816k7452O732o611j7010O458j3567r133M439R845J9032J9464J735
14176B661Q347k927k043O687j1627j128m330j0036K281n166j6734K654j452m478
14162c7291J9112K6710k6148p435J0595K6769K265J521k408j718K1237j2256k3002
14149b049k1209q95J8568P52R424r581j0791J1026P123O356o344k0376k2340k843
14135d3179R319m673n332M84K5442m359J5222J7433K6066q437k225K5755J7826
$$ y = [-33779, -6730, -12458, 6636, 7264, 6676, 8417, -5973, 7456, -3506, -19355, -30711, -25822, -39876, -23539, -6982, -7522, -16141, -9996, 9046, 16917, 20710, 13340, -247, -9073, -14306, -19336, 10172, 4552, 3221, -9459, -31795, -29191, -4061, 7932, -1939, -8629, -2242, 11082, 25754, 10545, 8729, -18723, -11991, -18602, -35612, -29154, -42721, -51854, -47415, -37570, -18538, 926, 2661, 11008, 8081, 6038, 12725, 1098, -30, -4360, -14396, -12115, -17281, -34015, -31361, -32813, -37291, -18179, 8531, -17617, -25052, -14457, 12312, 14577, 16098, 13690, 11972, 33209, 20953, -2049, -23258, -24153, -5585, -4833, 4591, -4990, -15781, -4755, 2368, 8724, 2380, -17996, -40336, -43179, -33860, -38533, -43865, -43381, -17939, -22298, -7076, 10357, 36423, 27986, 25761, 51516, 69342]
14122F9342q500p819K8522j6259r99j7688l0704k4850j6430L5409L0158Q284P962
14109E6428j8622k0792q028M748q384N921M306k2928L443N566P349N200P863o051
14095A6019K607J2151j3854p310k0688j6875k0552n337K5968L237j2312J6604
14083b0342N56o587L3183K4373r416p945J2421k9312j2903R113q567k5500j046
14070d1972l392O444m388N361J2175K4749K8489P302O665n946O625r007k3200
14057I905p262j5683j3110O280K7613J1359o17k026j7780K86m168j117K6547j6173
14043D054l0620Q603Q898J1019K8398n043K849K887J4670Q146j4535k5180M767
14030A8913L30j5496m864J0301q08k3905N047k3201M974L9923M9733L552n0575
$$ y = [69342, 60842, 53023, 81545, 65286, 64287, 46599, 15895, -8955, -25385, 10024, 40182, 48466, 56428, 37806, 17014, 8986, 13734, 5350, 11271, 15577, -7351, -3908, 1658, 9007, 14207, 22070, 16019, 18626, 30777, 16923, 9613, -11075, -27950, -48502, -53839, -27871, -24634, -36946, -20342, -19786, -26373, 6810, 31183, 21767, 13822, 26243, -3069, -15972, -6859, -15426, -40926, -41972, -45364, -38920, -43308, -37947, -25772, -1023, 27466, 34768, 41433, 35487, 42112, 33105, 9905, 2643, -13040, -26150, -19870, 7743, 19102, 18485, 16459, -1321, -1035, -5203, -6320, 20227, 4054, -26566, -17963, -9065, 1954, 30352, 25309, 28158, 31045, 45715, 53861, 39326, 14146, 18913, 19243, 3747, -1117, 9184, 8376, -15529, -10482, -33683, -28709, 11214, 60947, 64499, 13924]
14017A3924k3421k757M5717m83O310n061k1664N790K4615J3623j331l3703Q382
14004B9941P397K0068j0362k768l3923k3420J3956j336K849J186P93L1229j3673
13991B1937j0200j4635K6366N160j1828j5781Q752J9132K5902j053r686N51J0362
13978E4979q099R88j2760k8206j5273J1505Q308Q375m9560k5143K3302L2976p468
13965f076n398J5447J6545J1943j9740J2208k5909k9471J0309K014j3130q057
13953c9315j009J6400K7483L0178k115j1373m089l1634j4859J0808L064P988N706
13940b767q272k100M4826K4488k2003l6212j7285j4401J2101K0129R770Q523k5019
13927h222k2780r917o22J2825K0460K6296N943m293l9393k8347j453K4637J1138
$$ y = [13924, -9497, -12254, 33463, 32980, 39290, 34229, 12565, 18355, 42970, 56593, 55262, 21559, 29941, 37338, 57406, 47044, 44276, 10353, -13067, 889, -447, 2402, 3588, 4381, 35610, 21937, 11737, -2898, 23468, 28628, 16800, 1019, 9771, 28903, 54805, 53752, 44066, 44617, 54979, 46880, 47868, 35108, 6902, -8371, 3134, 11442, 19817, -29743, -54886, -31584, 1392, -6076, -11474, 3973, 20518, 32461, 12721, 24929, -980, -30451, -20142, -18128, -31258, -39315, -40324, -23924, 3559, 33737, 31622, 20249, 16160, -15474, -30333, -19525, -16461, -8473, -2767, -11039, -13139, 31687, 56175, 34172, -2040, -19325, -33726, -21625, -1496, 8274, 16797, -8222, -31002, -40919, -41541, -28716, -8256, 18040, 23983, 19690, -19703, -48050, -49503, -24866, -13728]
13914a3728L3032J013l5951m3366j1004K5235K2582K3650J0097j9762K8954K6340
13902D7092J8964k1261j4726j5522k2557j6182j9125J187J2718K005K131K0984
13890d292L8157Q816p581k1243j6349K0880K9905k8850m4870M037M095P676L1515
13877B1896O369j2350k867k1663l228K3538K0787K5417q703k9849q852O939J6261
13864C3695J9098k5603j4195J4355j6724j7211j3213O731K0347L4021q709n868
13852B6724J9949j0347l7505q888J1649J468j1153J7306K4176J739k1067j4340
13840b89r381m076j6372M1820L6863k3644j0053J7170j9711N073o99l900O617
13827A9418J6680J4884j7984j5278Q196m198O722K3462N321m2613k1680J4416
$$ y = [-13728, 19304, 20317, -15634, -59000, -70004, -44769, -22187, 1463, 11560, -8202, 20752, 47092, 66056, 44795, 30069, 14547, -8010, -24192, -43317, -42130, -29412, -27407, -25276, -4292, 33865, 42681, 35100, 13857, -2492, 18388, 48293, 19443, -25427, -21390, -17295, -9619, 21896, 28265, 15915, 13048, -8615, -11843, 11695, 32482, 57899, 49196, 19347, 10495, 17434, 33695, 52793, 27190, 12995, 27350, 10626, -6585, -19798, -13067, 7280, 41301, 32592, 26724, 46673, 36326, -1179, -10067, 1582, 3050, -8103, 9203, 33379, 35118, 14051, -289, -9670, -13746, -30118, 11702, 48565, 24921, 14868, 32038, 12327, 17400, 16701, 12801, 19418, 36098, 50982, 32998, 17720, 25916, 21718, 28440, 51902, 57223, 14610, -7070, 7346]
13815G346J5836l1586k929M97Q560L467O69O74k0329l358J6225L3331O733o316
13801B8820l3756k7967J1735K9911K230R917l7681l2668l311L8831M339j3316
13789b2916pK0839P761R389j34N545J1154J4128k522m851J4057K563m592k8501
13775B1913m514J0937o869l0589j3891j790K0354j162J3098K6028R960N45n22
13762D3498k3338m0809j1147J6035K3859k9455j7116K7063J0760N753n88J142
13750E657J4365j6904j6787K1789K5115j6523j2060m692k74P367n710M128L363
13737H834j9799q145J3734L1242N602l1915j8309P174k893R049K7529K314m510
13724A9907j9947l6120j4385O743J2683L277K3561r861O895P829K4744J0551j1223
$$ y = [7346, 23182, -8404, -11333, -10836, -2276, 1191, 1860, 2534, -17795, -21153, -4928, 28403, 35136, 28820, -4936, -32903, -21168, 8743, 10973, 20890, -16791, -49459, -52770, -13939, -9600, -22916, -22923, -2084, 5677, 15066, 14932, 20477, 31631, 45759, 43237, 38386, 52443, 55006, 50414, 21913, 17399, 28336, 21467, -9122, -23013, -24803, -4449, -5611, 7487, 33515, 43475, 44020, 43498, 20160, -20649, -31796, -15761, 8098, -21357, -38473, -11410, -650, 5103, 4515, 5657, 20022, 3118, -13669, 8120, 33235, 16712, 4652, -40, -314, 7053, 1343, 5471, 8834, -10965, -19110, -5376, 25866, 31468, -447, -18756, -11582, -14475, -5426, 22103, 24417, 19907, -40, -36160, -50545, -43802, -31119, -27842, -4281, -14142, -7247, 582, 25326, 35877, 24654]
13711B4654j3626m1717K2047R716K1755O957j1095q228J7698j056k942Q679Q000
13698D0842r589Q299n147j3663l440R531p572j1547k7885P608J4878q873P608
13685A050L724q59k018Q504J4122K1833o612J3470J1974j5079l2689k3930j8630
13672b5140J9101K6634k4430m15J5858J6258j5050O261J6899o764j5164k8900
13660a4852J8460K409O748P394M320j4250K606R619J2359J516o008j9572l5130
13647b4381R394K2084K0113K5235R773j2854j8470k1671p187j7443o971l34M877
13634a7835K1591Q562Q893j1513k7324M591J5181n90J7525L0793P623l8448k3644
13621d595q45j456j2009J1240L1521O33Q157J8288l335l5837j9227j948k4228
$$ y = [24654, 11028, -30689, -8642, 1074, 22829, 29786, 18691, 10463, 28161, 27105, 24163, 32842, 40842, 31253, 39552, 34405, 20742, 17302, 26833, 19261, 7714, -20171, -12563, 2315, -6558, 1050, 4774, 3915, 1897, 10401, 24523, 46356, 39744, 53214, 65188, 50109, 17420, -6510, -25140, -6039, 20595, -3835, -4250, 11608, 27866, 12816, 19077, 35976, 29212, 14048, -14852, 3608, 6017, 12765, 20159, 24479, 10229, 12835, 22454, 34813, 36329, 30321, 10749, -24381, -14987, 7097, 27210, 52445, 62218, 49364, 30894, 9223, 2036, -15407, -22378, -22712, -17835, 3756, 12318, 21211, 9698, -17626, -13035, 2146, 1556, 19081, 49874, 57497, 19049, -4595, -5440, -6896, -18905, -7665, 23856, 24489, 32646, 50934, 47599, 11762, -7465, -9413, -33641]
13608c3641o153M0245K2434L2241j997k6117k0245j507r312K3503k276o482K4373
13595C5066Q893q917j3669q178l2985j1515K6163N248l662K7158l5179o423K543
13582a5457j019L090p39J2055l411k4925q510O371O201K7643P654Q195j6937r33
13568g22L5905J6749j3678L241l5776k4660J346N710J9807K1462J4091o310j1754
13555B5411K227J1796J9878Q827M711k0464p611p419j3897o270O296P624J5269
13542D6378K371p587j8853j6554M749K4048l626k574n765j2446k173j7793j275
13529a1100L5701K9285n916j1848N703p635J7498l0466j9816k229J8413p973j2
13516I605N917o709N305P121Q362J9400m739j468o971o713r130L544O096p456
$$ y = [-33641, -39794, 451, 22885, 55126, 53129, 27012, 6767, 5260, -4052, 19451, 17175, 10693, 35066, 43959, 35042, 21373, 13195, -19790, -31305, -5142, 106, -3556, 23602, -11577, -18000, -15457, -16476, -13386, -14125, -2070, -5481, -30406, -38916, -32545, -26344, 1299, 8953, 17148, 211, -722, 35183, 51932, 38254, 41495, 5719, -18941, -17595, -11885, 7922, 29384, 43475, 37165, 25411, 27638, 39434, 59312, 68139, 72850, 52386, 44775, 37356, 23459, 17189, 23485, 31109, 46378, 48749, 41162, 22309, 5755, 10504, 34552, 30926, 28352, 22587, 10141, 7968, -9825, -11100, 24601, 53886, 47970, 36122, 41825, 34190, 51688, 21222, 1406, -823, 17590, 9617, 9605, 15522, 8813, 14118, 21239, 29601, 49001, 44262, 42794, 35823, 29110, 19980, 23524, 29620, 22164]
13502B2164r416k3685n340R446K5466n978m1227l093j6469O070p529L4778N4504
13489C9691J8845j0107k182J570l9165j8340J1673M96k0179k62K8377q380N4l274
13475a183J1408l9J7206P271k2285r146M043J6726j2603j6262K1739j0048m410
13462B417K0648J8140r656m431j0738k4802J0872j372K8046J4871m41L093k737
13449D3910N205k6R35j9560j4667K046o547k622j1688P75N770k5083l0814K3628
13435b8738L1923j6384R6o310o21L8684L0135k1507j7150j4564P750p518o057
13422a0261k1868j4005J0472K5097K8197L4165J4618j8682j6648l338K260l0125
13410a18O38J3015k0828J5354L0189J4194M074k2790q485J7486j755r307K7164
$$ y = [22164, 12748, -10937, -16277, -6831, 18635, 12657, -28570, -31663, -48132, -42062, -49591, -14813, 39691, 58536, 48429, 46247, 47817, 8652, -9688, 1985, 2481, -17698, -17960, 10417, 2037, 2091, -1183, 10225, 10186, 27392, 34663, 12378, 3232, 7275, 24001, 11398, -4864, 16875, 6827, 2417, 23065, 41205, 31549, 27118, 16380, -8422, 2450, 1078, 29124, 43995, 43554, 46647, 43910, 49115, 49089, 50024, 30464, 15797, 17843, 11296, 8674, -3014, -2239, 3531, -21552, -52366, -28738, 3185, -13199, -13103, -19413, -20034, 18650, 48785, 27278, 10128, -4436, 3314, -4204, -10261, -32129, -46134, -35662, -10565, 17632, 51797, 66415, 47733, 31085, 27747, 30007, -118, 520, 13535, -7293, 8061, 38250, 52444, 56518, 33728, 25243, 42729, 40974, 31667, 58831]
13397E8831R952j386M95j4991j4753l807M964P526R819j4519R30j0973l4296q934
13383a1142J2208K0041j7496K3565J3681j2826M908j1222o806j207j1287J9979
13371B2396J4222P325M809J4774k0289k2479K463k989n051o521R751j0880k373
13358E158Q983L731j0655q927Q594q449J7662K24k3341k6698K5682J1041p354
13345d349J0622J3762o023N121J3567j7672J574o86J372J6148q453N892m856K5971
13331E1990M607l3600m311k0756j2329P684K0238J1570L639o554n033M716j1348
13318A0513k468J2041j0299j5683L648O138o551J1242J249k4700k3076J025J1209
13305b5712j6051N595K2107J4053j861j0603j1945J5080L4555M965q088k6537
$$ y = [58831, 68783, 67397, 67892, 52901, 38148, 34341, 39305, 46831, 56650, 42131, 43061, 32088, -2208, -11142, 1066, 21107, 3611, 27176, 40857, 28031, 32939, 21717, 14911, 13704, 2417, 22396, 36618, 43943, 48752, 63526, 43237, 20758, 23221, 20232, 15181, 8660, 18411, 7531, 5158, 14141, 17872, 7217, -1710, 6884, -1565, 16097, 16321, -7020, -33718, -8036, 3005, -4349, 6273, 20035, 14012, 19133, 32700, 15028, 16602, 15916, 17288, 33436, 24983, 30875, 26019, 51990, 56597, 22997, 18686, -2070, -14399, -6715, 13523, 25093, 28732, 22178, 17145, 21861, 10513, 8045, 20086, 9787, -5896, -2248, 3890, -2661, 8581, 9830, -14870, -37946, -36921, -25712, -41763, -36168, -14061, -8, -1869, -12472, -24417, -9337, 25218, 30183, 22095, -4442]
13293d442K1872K8281p241O216k8652m5705J016J9062J2110J3657l4016l1014
13281d8856K4070L3590K0179j6414l487J9338P887k4029j5121n201K7987K6232
13269D6175K5238J963o657l626k8470J9145R301k12j8454l4373p698J0673J4470
13256B7475J0611n120Q045j0487j7742m070K5843J3129r407j4500l166P977m141
13243B4447j7083k8696Q724J6375K4977O01P966P736K867j6442O41m583q497j4029
13229E004j6891N620J4006J9219K6162m674k0717k5096J4922k037K0782J8593
13217E4893K931j9174j3308J0024P806p321K865K0644j7100k2115k145r312J8041
13204B6729J1446o38J5641j628l1548q430j1461k202k442J1275j8791J015J9030
$$ y = [-4442, 17430, 45711, 38470, 44686, 16034, -29671, -28655, -9593, 2517, 16174, -17842, -48856, -24786, 8804, 28983, 12569, 9082, 28420, 36307, 12278, -2843, -8044, 19943, 46175, 71413, 73376, 66719, 63093, 34623, 53768, 63069, 62857, 44403, 10030, 2332, 13005, 27475, 38086, 32966, 41011, 30524, 12782, 8712, 34555, 47684, 38277, 23777, 20611, 28588, 24447, 7364, -21332, -12608, 3767, 28744, 29345, 37311, 45047, 47914, 31472, 32113, 27530, 19033, 5004, -11887, -6267, 7739, 26958, 53120, 48446, 27729, 2633, 17555, 15518, 36300, 54893, 57824, 38650, 25342, 35366, 43172, 35851, 38716, 59360, 42260, 20145, 18000, 8688, 26729, 38175, 37537, 53178, 51550, 20002, 11572, 111, -2091, -4533, 6742, -12049, -11034, 7996]
13191G996M285P977K6320O934l006K2936J2466K2805Q405m7135l9780L055p62
13178C2496L153o713p70J9525k4917j9445K9972L3727Q745j8165j6680j7796r609
13165A3523J7512n421O238L9086O161Q257N660p996j2942O726J3557n023J1590
13152I6928J6368K3452J3135N486p914k4925k7333j1583l56j7698j9909J1823
13140E7474L3627J0341j3518k2340J5134k902j6261m867n35j9870J0270J684K306
13127E0543j5926j418R547J8167R600J2072J3404J7209L7337O121M2164M088j2311
13114A90597n625j9222l7827j3915l339J960l411l3449j189q249r558k52p607
13101D8914r293L9513J8695Q603K465j7447Q433Q87n457o579j8752j4238P699
$$ y = [7996, 12281, 20258, 46578, 53512, 50506, 73442, 85908, 108713, 117118, 69983, 30203, 33258, 32496, 35649, 28936, 28166, 47691, 22774, 3329, 33301, 67028, 75773, 57608, 40928, 23132, 13523, 31035, 25614, 31852, 70938, 77099, 85356, 91016, 83020, 70078, 76804, 90361, 85338, 96928, 113296, 136748, 149883, 155369, 147455, 122530, 95197, 83614, 83258, 65560, 45651, 57474, 91101, 101442, 87924, 65584, 80718, 77816, 61555, 56688, 56153, 36283, 46553, 48237, 50543, 34617, 33199, 42746, 60913, 70513, 82585, 95989, 113198, 150535, 156656, 198820, 202908, 190597, 184972, 165750, 127923, 114008, 110669, 112629, 109218, 75769, 74580, 66331, 56773, 56521, 48914, 39621, 79134, 97829, 106432, 108897, 91450, 99883, 100770, 95313, 88734, 69982, 55744, 63443]
13088F3443P895L564j6854j199K3862K9890J1241j3679l0480j8800K2475J8809
13076A00167k8378J503J0320k0749p036n247j2877J6715j169J6943K6152L6608
13064A32952N11k1077j840K634K3376L5574j1263o822K1103J7536L7481L9503
13052B69668N0482P4182J31258J96573K92648L84755M05969K97923J440l09732
13042A795166m45954l49063k44810j92775j27166p0934o4519j3956l5284l6348
13032B14357l2491l3225m143k1120k9053j0868p960J0902L967l721l0653K0714
13020G6706L7157L5j6780l9327j5055J26K3562J0607j249J3522r659l7293j9870
13007B2482j9419R979J0991L2586K22r340n877j104l4403m457k193K1632L6503
$$ y = [63443, 71338, 74902, 58048, 56849, 80711, 110601, 121842, 108163, 77683, 58883, 81358, 100167, 71789, 73292, 83612, 62863, 55827, 50580, 37703, 54418, 53249, 70192, 96344, 132952, 133463, 112386, 110546, 113180, 136556, 172130, 160867, 154045, 175148, 192684, 230165, 269668, 320150, 394332, 525590, 722163, 1014811, 1399566, 1805535, 2103458, 2104898, 1795166, 1349212, 1000149, 755339, 562564, 435398, 364464, 299945, 285989, 250705, 214357, 181866, 148641, 144498, 123378, 94325, 83457, 75497, 86399, 90366, 86645, 55992, 76706, 113863, 113898, 97118, 57791, 42736, 42862, 66424, 77031, 75782, 89304, 79645, 42352, 22482, 3063, 13042, 24033, 56619, 56841, 47501, 41624, 40520, 6117, 1660, -533, 21099, 57602]
12994E7602Q458p460J855L040R176J9498K0545K6524j8510m2122k1734R971k981
12981F3862l896J3945m377q075K6488L012J3530n888k6271k387l566J409J3911
12968H1697j0874j3726n183k3262K060J6555k670N434N186Q860N707J848P955
12955G9587q089j3644K3727J6103l4006p319m166Q551n97J9512J8889l3225l4332
12942C0991R914K5918k265KN406R007j029o118j9486l5928j0039L0010J94J062
12928C7639o755K2858J2465m706k402j573q09M859j2827j0192P00K4449O253L397
12914G3356q926O218J5718N574j0626N593Q743J2428K159M543l5084K7185J3939
12901A20820p519k8483Q457K4426r063K2936j354n496j2550P9l511n351j8242
$$ y = [57602, 66060, 58600, 60455, 63495, 72671, 92169, 112714, 139238, 120728, 78606, 56872, 66843, 63862, 59966, 73911, 69534, 61459, 87947, 90959, 104489, 98601, 72330, 69943, 66377, 67786, 81697, 70823, 57097, 51914, 28652, 30712, 47267, 44597, 50031, 55217, 64077, 69784, 71632, 79587, 71498, 57854, 81581, 97684, 63678, 56359, 52193, 60744, 60147, 79659, 98548, 65323, 30991, 40905, 66823, 64558, 64560, 69966, 78973, 77944, 71826, 52340, 16412, 6373, 36383, 36577, 37639, 30884, 53742, 66207, 61501, 59099, 57526, 56717, 61576, 48749, 38557, 39257, 63706, 69959, 73356, 64430, 70648, 86366, 91940, 81314, 86907, 95650, 108078, 110237, 114780, 79696, 106881, 120820, 113301, 84818, 93275, 117701, 108638, 131574, 130220, 124724, 112174, 112253, 108742, 103391, 85149]
12888H5149J4804p425q255J0796l475k7361k3495K1054l130r73j0469k520j4456
12875C0244K5543K2210L141J5723k051N689r068j7649j0844K67l18L9519R244
12862A11650k991J227J0031J1276J5164M9496K2087j0728M315J3980j9488Q56
12850B06875K4238J9393K9886N6104K9227N5791O421p1268n5291l5658k8526l0183
12838B07009j238o298j1333J4043J659k7410k1458J5609J2186L089P011J8317
12826B11186N795R895o839j5204l2386k1825j2856P866K9747k511k1664r914l8237
12813A03053j9948N2145L8768L1063L1420N8575N5695L7354j5654o1778p4158
12802B36535k5822L659k9224j1635j0283J1745J6543k1310j9619J9519K2929L3748
$$ y = [85149, 99953, 92528, 84273, 95069, 91594, 64233, 40738, 61792, 58662, 57689, 47220, 44700, 30244, 55787, 77997, 81138, 96861, 94810, 100499, 91431, 73782, 62938, 63205, 62887, 102406, 111650, 108659, 109886, 119917, 131193, 146357, 195853, 217940, 207212, 211527, 225507, 206019, 206875, 231113, 250506, 280392, 336496, 365723, 421514, 427935, 356667, 301376, 265718, 237192, 207009, 205771, 199473, 188140, 202183, 203842, 176432, 154974, 170583, 182769, 185858, 192869, 211186, 216981, 226876, 220037, 204833, 172447, 150622, 137766, 145632, 175379, 172868, 151204, 141290, 103053, 83105, 135250, 174018, 205081, 236501, 295076, 350771, 388125, 372471, 310693, 236535, 210713, 214372, 185148, 173513, 163230, 174975, 191518, 170208, 150589, 170108, 193037, 226785]
12790B26785l7584m6358Q500K2956J2876j9676k0325k2605Q252L885n273L7796
12778A69229K1189l963K6219L4736K2989J1298J7535J1523N591J3826K5215J6262
12766C71649J7820L2226R428l9289n4418l3267j3523j7096J9596p796J3940M309
12754C03579J5631j0786l365l2776k5994J3462j5718k1419j4154j6749j3837J0328
12742A88202R729J4868J4274L6134M3899q661k0730k1977K0790M065J8592L7304
12730C36489K3011L8117M6777K0684N486K4546q749L0454Q859K1260K8661m1127
12718E34468o8159m8779k0342K3935M3772O5833Q6157J13995J84922K01307J32233
12707A249342m7826k10311k20332j42810q4193p6141k9690j4362l1834n26K5760
$$ y = [226785, 189201, 142843, 151343, 174299, 187175, 167499, 147174, 124569, 132821, 136706, 131433, 169229, 190418, 186455, 212674, 247410, 270399, 281697, 299232, 310755, 316346, 330172, 355387, 371649, 389469, 421695, 431123, 391834, 337416, 304149, 290626, 273530, 293126, 285330, 299270, 303579, 319210, 308424, 305059, 272283, 246289, 259751, 244033, 222614, 208460, 191711, 177874, 188202, 197931, 212799, 227073, 263207, 307106, 298445, 277715, 255738, 276528, 280593, 299185, 336489, 359500, 397617, 444394, 465078, 470564, 495110, 486361, 516815, 525674, 546934, 575595, 534468, 466309, 417530, 397188, 421123, 464895, 530728, 616885, 730880, 915802, 1117109, 1249342, 1201516, 991205, 770873, 628063, 543870, 467729, 438039, 423677, 391843, 391317, 417077]
12696D17077J2160j796n068k6876j6799K4474J5314j2308J7245J7156j5361j7832
12684D07386J9444L1267K6514J4491K1155j3397l0770j8331j6634j2964J264R754
12672D39179L1651K9996N5851N1364K4985M323K8962K5319M5005O3156J4341Q030
12660H22162J7217Q546M7762K9064L7926O2440O7401O0718P2695J03610J58471
12649A488012J96539L08808L54836L20368J26603j63003k99568k88605k14891
12640A829099j20703m6183P503L8998P4112P0962K6670J2978K5244O1039N9267
12629B038986O9551R2078J46718J65566J69322J67778K16215K31207K37905K97736
12619C833062L35629L62521L71727M49935N08553N64282O88854P88821R23091
$$ y = [417077, 429237, 427441, 422373, 395497, 378698, 403172, 418486, 406178, 423423, 440579, 425218, 407386, 426830, 458097, 484611, 499102, 520257, 506860, 476090, 457759, 441125, 428161, 429425, 439179, 470830, 500826, 556677, 608041, 633026, 637349, 666311, 691630, 736635, 799791, 814132, 822162, 839379, 847925, 895687, 924751, 962677, 1025117, 1092518, 1153236, 1225931, 1329541, 1488012, 1684551, 1993359, 2348195, 2668563, 2795166, 2632163, 2332595, 2043990, 1829099, 1708396, 1662213, 1669716, 1708714, 1782826, 1853788, 1880458, 1893436, 1918680, 1979719, 2038986, 2108537, 2200615, 2347333, 2512899, 2682221, 2849999, 3066214, 3297421, 3535326, 3833062, 4168691, 4531212, 4902939, 5352874, 5861427, 6425709, 7114563, 7903384, 8826475]
12610H826475J053855J223947J550460J968873K430737K783361K920636L222194
12602B5980538M069630N503251P657081J0794491J5473483K2941979L4826225
12595A27246678N3139202P7181496R5343686P8779144R038031p2339509j02399514
12588B65989214q3419228n4848658l4589688k2472843j5238582j0747970p791418
12581C6880827n754335m314907l299546k793706k670513k545288k231509j801145
12573A1469878j446419j155190q99947p19014o18611n30836m86067m23347l30582
12564D859865k95010k85346k87272k69412k54304j88999j65363j35862j31720
12555B846577j32994j43720j38765j12430j46154j24241q8874r0597q6094p9444
$$ y = [8826475, 9880330, 11104277, 12654737, 14623610, 17054347, 19837708, 22758344, 25980538, 30050168, 35553419, 43210500, 54004991, 69478474, 92420453, 127246678, 180385880, 257567376, 352911062, 431690206, 440728237, 368388728, 265989214, 182569986, 127721328, 93131640, 70658797, 55420215, 44672245, 36880827, 31126492, 26811585, 23512039, 20718333, 18047820, 15502532, 13271023, 11469878, 10023459, 8868269, 7968322, 7249308, 6630697, 6099861, 5613794, 5190447, 4859865, 4564855, 4279509, 3992237, 3722825, 3468521, 3279522, 3114159, 2978297, 2846577, 2713583, 2569863, 2431098, 2318668, 2172514, 2048273, 1959399, 1868802, 1782708, 1703264]
12545A703264r4950o1428n5431p4555r0252p9544o5313l4555n8919l5189l0661
12534A022467o7057q0093n4980k0126j0357j2700j2523k9866l5836p654p324J284
12522F85235j153k5302k8927k2809J5457k3413j4515J3288Q411k674R52j6825
12510E87725j0320j3176j9346j719R861O758m0272m7978l0878O168J7046J8498
12498D82367j3894k4416l4038j5667m0189l7298j3448K2753J9375k1489j7966
12487C06090m987J1331p149n461J0750l8135P365p999L728J2528o285n194N360
12474B81942K0260Q922J4161L1857N4373P4059J03116R5487K5635m7997r5269
12463E66546q8517j10389o7940j0275l2107k2111r13r679J5615M067j2282m273
$$ y = [1703264, 1608314, 1546886, 1491455, 1416900, 1326648, 1247104, 1181791, 1147236, 1088317, 1053128, 1022467, 955410, 875317, 820337, 800211, 789854, 777154, 764631, 734765, 698929, 691275, 683951, 685235, 684082, 658780, 629853, 607044, 622501, 599088, 584573, 597861, 606272, 603598, 604550, 587725, 577405, 564229, 544883, 543164, 553025, 559783, 519511, 471533, 440655, 446823, 463869, 482367, 468473, 444057, 410019, 394352, 354163, 316865, 303417, 326170, 345545, 324056, 306090, 301103, 312434, 305285, 299824, 310574, 272439, 279804, 271805, 275533, 288061, 281776, 276582, 281942, 302202, 311124, 325285, 357142, 411515, 485574, 588690, 684177, 709812, 661815, 566546, 478029, 367640, 299700, 289425, 257318, 235207, 234294, 224615, 240230, 244297, 232015, 227742]
12451B27742m503l2621k1187l6581m2593j59K1142J7689K0728K0348n972P31r813
12438A54951J6636P248l0212l4482m8529l2841O157K1603L5237J8113j8625j3825
12426H1431R871L6921J3793j315L430j9480j4564l234k5010j277j6869O555K622
12413G2874j0970j1072p385o014J7076L7965L585K7035J9350j1504J646K1447
12401A54033L6977N963l7197n5538j3349J0283K4167j7366L754J0550j2569k9402
12389H0306O531j8446j1050K3716J9202k972k3071l807k004K192L121l822n936
12376F3960j6943K3321K9107q176n488O310q436j2166j7786j4166o493P18j1324
12363B2438j1422j4111l1841l5821j1507K8049L6092J0067O076J0697R845r481
$$ y = [227742, 223239, 190618, 169431, 132850, 90257, 90098, 111240, 128929, 149657, 170005, 164033, 164764, 154951, 171587, 178835, 148623, 114141, 65612, 32771, 38928, 60531, 95768, 113881, 95256, 81431, 91302, 128223, 142016, 140701, 144131, 124651, 110087, 106853, 81843, 80566, 63697, 70252, 72874, 61904, 50832, 43447, 37433, 54509, 92474, 96059, 123094, 142444, 130940, 132586, 154033, 191010, 196973, 159776, 104238, 90889, 101172, 125339, 107973, 111727, 122277, 109708, 80306, 86837, 68391, 57341, 81057, 100259, 97287, 74216, 70409, 68405, 70597, 73718, 69896, 63960, 47017, 70338, 99445, 91269, 85781, 92091, 83655, 71489, 53703, 39537, 33044, 33762, 22438, 11016, -3095, -34936, -70757, -82264, -54215, -18123, -8056, -1980, 8717, 18562, 9081]
12351I081n452O188L105P673R040K0092l0274j6485k0254M360L2945L8820n319
12338E3520P109o077k6931J122J8985j2060P649K689k487M686k7340K959j5033
12325H791j8033J6886N359o581J0386K9166n934L403L5480j7218l3988Q348k058
12312C4007J1048J656j3169n266j0288L262r195J7480Q778j2371L550o65q098
12299B0729J2341l914p678J2032J3527j820M876j0213k2514l8463n124K2103L1253
12286B7135J5176Q144l382r008J2774o88K277j7187J0274k0807J8330J531o4557
12273a9988p190K5769p063J0159j6270J3653K9674n204K4030J1299o574j409Q700
12260E9586M35j8482j2962l646N933Q772K330j6868M554M346j9561L461R919L310
$$ y = [9081, 3629, 9817, 12922, 20595, 29635, 49727, 19453, 2968, -17286, -12926, 20019, 58839, 53520, 60629, 54552, 27621, 28743, 47728, 35668, 43317, 46006, 43519, 48205, 20865, 23824, 8791, -9242, 7644, 13003, 6422, 16808, 45974, 40040, 43443, 78923, 61705, 27717, 36065, 34007, 45055, 46711, 33542, 28276, 17988, 21250, 12055, 29535, 38313, 25942, 29492, 28827, 20729, 33070, 29156, 21478, 33510, 47037, 45217, 50093, 39880, 17366, -21097, -26221, -4118, 27135, 42311, 50455, 47073, 38065, 50839, 50151, 52428, 35241, 45515, 24708, 43038, 44569, -19988, -27178, -1409, -8472, 1687, -14583, -930, 28744, 23540, 47570, 58869, 52295, 50886, 59586, 60021, 41539, 28577, 24931, 30864, 39636, 41966, 25098, 29652, 33998, 14437, 17898, 27817, 31127]
12246C1127j560k0513n075LJ0047J0424K8794j0837j0274o96L601K3244J4817
12233G3102J8065J6471l2908o412K460j6772j4987L862M581j4668J0645J4299
12221E7738k2041Q310J4735J4667P610o998J3389j5135k1009k2177m204K6122
12209E1007j2498l9771O761L5773Q98m2777j3955O729K6062L2036J0085l2673
12197B7677r156M888l989O205J6586J0265M161R92K2182N146m6558l6611L8745
12184D0533K3335n521k2082J9356J6682L4878J2008J1097K8428J0404K069j7247
12172A53940k1081r265L882j9656j3645k390k74j6599k4558J6292p589J3000Q362
12159H0419k6709J4671J2611j402L001Q575j087J0569J1541J4792p615O572J8492
$$ y = [31127, 29567, 9054, 3979, 3982, 14029, 24453, 53247, 42410, 32136, 31440, 35041, 58285, 73102, 91167, 107638, 74730, 68318, 70778, 54006, 39019, 42881, 47462, 32794, 43439, 57738, 35697, 44007, 58742, 73409, 81019, 74021, 87410, 72275, 51266, 29089, 24885, 51007, 38509, -1262, 5499, 41272, 42170, -607, -14562, -7833, 18229, 50265, 60350, 27677, 18521, 23409, 19420, 25625, 42211, 52476, 56637, 57629, 79811, 84957, 38399, 1788, 40533, 63868, 58347, 36265, 55621, 72303, 107181, 119189, 130286, 158714, 169118, 171187, 153940, 132859, 123594, 127476, 107820, 94175, 91785, 91511, 74912, 50354, 66646, 59057, 72057, 80419, 53710, 68381, 80992, 79590, 82591, 91166, 90079, 100648, 112189, 126981, 119366, 125938, 144430]
12146A44430N2085M4149K069j1998l0370J21K7757N0953P0957P4137J37818K42410
12134H04518K86598L63689M07651K74991n7454l61930m34765l23341k59146j39961
12124E60850r7081p9174o4444m8525k5527j5965j8656j4587k2109j4701j8454
12113A41627l4641r190j6342R182m640k14K5349r902k2847j7889J0016K3419J7873
12100A11801k415l2093l1039R070K5716M3334p176k215R619j0004o471K3583J3881
12087A45591M622j8056l4286j5627J8867J221j3994p780j679O295J9060M940J1454
12074A20628J1255j029M275j3793l993Q191j4935j1236J3199J5250r52j4747j0691
12061A01422K140q411j798R317J8349J3839K262k3119L2952L2863J232j2710j0817
$$ y = [144430, 196515, 240664, 242733, 230735, 200365, 200486, 228243, 279196, 350153, 424290, 562108, 804518, 1091116, 1454805, 1862456, 2137447, 2079993, 1718063, 1283298, 959957, 700811, 560850, 463769, 384595, 320151, 271626, 246099, 230134, 211478, 196891, 174782, 160081, 141627, 106986, 97796, 81454, 90636, 85996, 85782, 111131, 101229, 78382, 60493, 70509, 93928, 111801, 109386, 77293, 46254, 55324, 81040, 124374, 117198, 114983, 124602, 114598, 108127, 131710, 145591, 150213, 132157, 97871, 82244, 101111, 102332, 88338, 80558, 78879, 85174, 104234, 109174, 120628, 131883, 130854, 135129, 121336, 117343, 125534, 110599, 99363, 112562, 127812, 126860, 112113, 101422, 103562, 95151, 93353, 102670, 121019, 134858, 137120, 114001, 146953, 179816, 181048, 168338, 157521]
12048A57521Q768J8888q145j1544L675m122K1941j7678k3967k2756J9427J9387
12036A61395K2755J2423J2101j3216m030K4579K977j1006k1825J1251K9111q63
12024B25652L062r785J2885K340j9279k3173L020k99R234K0791L7677K156j40
12011B64141o351N448o02r4L5582j8212l6217P009K7770l301J5238J2535J5252
11998C18198n906L4143O684j5216K2511M0038P481J6661J8312k0453m362J5515
11986D33606L586K1838M0678M1234K6839K7801J5860L8243L239l2531l65M0063
11974F60091J5754K9157L4403M4041K2853R896L7159L8243N4675J9663J4559L3978
11962A014472P3187M1078M9171Q0478P1019O7625Q1742R0089R7964J12902J25685
$$ y = [157521, 166289, 185177, 177032, 165488, 169163, 165041, 186982, 169304, 145337, 122581, 142008, 161395, 184150, 196573, 208674, 195458, 191428, 216007, 218984, 207978, 186153, 197404, 226515, 225652, 228714, 218929, 231814, 234154, 214875, 191702, 194722, 194423, 203657, 224448, 262125, 264281, 264141, 257790, 263238, 262636, 262542, 298124, 279912, 243695, 250704, 278474, 275173, 290411, 302946, 318198, 312292, 346435, 353119, 337903, 360414, 400452, 407933, 424594, 442906, 422453, 418091, 433606, 437192, 459030, 499708, 540942, 567781, 595582, 611442, 649685, 652924, 620393, 620028, 660091, 675845, 705002, 739405, 783446, 806299, 816195, 853354, 891597, 946272, 965935, 980494, 1014472, 1087659, 1128737, 1177908, 1258386, 1329405, 1397030, 1478772, 1568861, 1666825, 1779727, 1905412]
11951A905412J21099J40139J70905J82323J68020K38885K42646K88390L17558
11942C775377L65817L75603M29444N17664O25199P56163Q30188R62281J170550
11933I808286J430470J771630K159173K692900L370177M323627N557753P148347
11925C8262363R062564J1095162J2732612J2813513R882606L313761n015602j1357455
11917H0789524j3600868j2674929j0524248q311816o424109m984983l905431l094010
11909A7269130k488924j998734j637532j365722j127183r63890q30557o86730
11901F169858n92559n27691m26336l71411l07193k36728k21166k19677j79499
11892C087598j34214r5531j16637p3247r0226o0104n7232r1794j00845r2990q4299
$$ y = [1905412, 2026511, 2166650, 2337555, 2519878, 2687898, 2926783, 3169429, 3457819, 3775377, 4141194, 4516797, 4946241, 5463905, 6089104, 6845267, 7675455, 8637736, 9808286, 11238756, 13010386, 15169559, 17862459, 21232636, 25556263, 31114016, 38262363, 47324927, 58420089, 71152701, 83966214, 93848820, 97162581, 92146979, 80789524, 67188656, 54513727, 43989479, 35677663, 29253554, 24268571, 20363140, 17269130, 14780206, 12781472, 11143940, 9778218, 8651035, 7687145, 6856588, 6169858, 5577299, 5049608, 4623272, 4251861, 3944668, 3707940, 3486774, 3267097, 3087598, 2953384, 2857853, 2741216, 2667969, 2577743, 2517639, 2460407, 2368613, 2267768, 2174778, 2090479]
11881B090479r7224q9047j14106j16450r0883r1262j01699r4488p3012m8206o1080
11870A113022m6689n8355o5415p7155k1494m4745q6519m0603r196l2099m8326
11859E82426n6223m6370O70P757J5178K253p373j8597l7212m653L179l6744k3592
11846C80699k0154Q725k3150l3178q798M145J9734P3L70n966N4j1808q388P110
11832C09468J889j8063j3145k5484K8446L727K799j1092j466J8447k1150k5381
11820B48995l4839k1955l104J9833r030j7394K2669k3590L635r529l185j2306
11808A60200j7887Q012J3497q27k6765R58L6616L0258k439O129J1667K0221M034
11795B43674k980j6752J0658J365j9919k3533j0788q406j6364q245j4335k8599
$$ y = [2090479, 1993255, 1904208, 1790102, 1673652, 1582769, 1491507, 1389808, 1295320, 1222308, 1174102, 1113022, 1066333, 1007978, 942563, 865408, 843914, 799169, 712650, 672047, 662851, 630752, 582426, 526203, 479833, 480503, 488260, 503438, 505691, 498318, 479721, 442509, 437856, 441035, 404291, 380699, 360545, 369270, 346120, 312942, 304144, 308289, 328023, 328096, 328466, 322500, 322554, 310746, 302358, 309468, 311357, 293294, 280149, 254665, 283111, 286838, 289637, 278545, 277079, 295526, 274376, 248995, 214156, 192201, 189097, 208930, 199900, 182506, 205175, 181585, 185220, 175691, 172506, 160200, 142313, 150325, 163822, 162995, 136230, 137188, 173804, 204062, 201623, 207752, 219419, 239640, 243674, 240694, 223942, 234600, 235965, 216046, 192513, 181725, 173319, 156955, 148710, 134375, 105776]
11783A05776N667J6194J4387j0205l0974k6913M613J4537J0591l8855J5521J9325
11771I9664p197R467K6819m670l3254l6346k4902j582J3377K3922Q180q160j0406
11758E4912m002J473R139k642r894k7605J5206J3111r721K3267J8985p06n124
11745G6399l234M580l982m747k2589m525q548J2055K306o573j6079J6234N0985
11732I2282j0388j3002J0478l724j1052m336j5733j4643Q971Q21O838L0729K2836
11719A00077k5255l5734M445J3938J2358j109K108j1472n824O439j0710J5258
11707F4519l4924l40j2883j4331J6862O274J0962K745n821j9435l308o806j2352
11694h838r288J883J3760K1243P454R558J6534k7098J2454j0084k4696l682p918
$$ y = [105776, 111443, 127637, 142024, 131819, 100845, 73932, 78545, 93082, 103673, 64818, 80339, 99664, 92467, 101934, 128753, 124083, 90829, 54483, 29581, 27999, 41376, 65298, 73478, 65318, 54912, 50910, 52383, 61522, 58880, 48986, 21381, 36587, 49698, 39977, 63244, 82229, 81523, 76399, 73165, 77745, 73763, 69016, 46427, 41902, 33354, 45409, 47715, 41142, 25063, 41297, 92282, 81894, 68892, 79370, 75646, 64594, 60258, 44525, 29882, 38853, 39674, 46512, 77241, 100077, 74822, 39088, 43533, 57471, 69829, 68720, 70828, 59356, 53532, 59971, 49261, 64519, 29595, 29255, 16372, 2041, 18903, 25177, 36139, 38884, 33063, 13628, 10320, 3514, -8838, -18126, -16243, -2483, 18760, 26214, 35772, 52306, 25208, 37662, 27578, 2882, -800, -8718]
11681h718l321Q214M1331J8266P191j7819p764M325K0195L0606J0660K9998L2320
11668A65484M2308R0936J23448J44183J54014Q6079o8356j66177j52053r8371
11658C21495o6171p2271o0452Q30N751j2638l9831l5623M54J0495j980r851o519
11645C3689j1959N237J1175L6908O498k5238n728K0671K3700M5391Q0204Q4910
11633C05458J13434J44242J72188O1630r4471j81474j31979j11412o1047n2399
11623A64170n4852l5092k5213l903J5161K7479m592j4461J397N45j0449k9295
11611C0895j6518Q19K473m748K4595j9922J2557K3721K733m283k468j2893k1317
11598A5644N736r764l0771J408K2884K5145J0268r22k3996n551L4247N251N127
$$ y = [-8718, -12039, -3825, 37506, 55772, 62963, 45144, 37380, 41705, 61900, 92506, 103166, 133164, 165484, 207792, 298728, 422176, 566359, 720373, 806452, 738096, 571919, 419866, 321495, 255324, 183053, 122601, 123431, 129182, 116544, 76713, 41090, 41544, 52039, 50059, 40208, 33689, 21730, 26967, 38142, 75050, 81548, 56310, 50582, 71253, 94953, 140344, 220548, 305458, 418892, 563134, 735322, 796952, 702481, 521007, 389028, 277616, 216569, 164170, 109318, 74226, 49013, 45110, 60271, 87750, 83158, 68697, 70094, 70639, 60190, 30895, 14377, 15196, 17669, 12921, 37516, 17594, 30151, 53872, 56605, 52322, 49854, 36961, 15644, 21380, 11616, -19155, -17747, 5137, 30282, 40550, 39628, 15632, 10081, 44328, 49579, 54706]
11585E4706k6837j0290J4656p165j9693m530J521K1127J811j2676J9685j6885
11573A5430n680Q466Q64L083k4445l598J0771M8398K4002j0892k2034j1616k8172
11560D577R30J7017l9307j5016q755j0055J8349J2983O191J352q439J9456K154
11547A437k4372p437O183L1678l236l827M522m7750j6777J0354J394L0457M054
11534a3320J259K5542J2118k0714P816J6862j5774k5152J2097J1365J8943J9923
11522E0965l3554j5027j2654j6623N652N918J9992J8694J0528K6539k9274j8729
11510A2427R241j4439l905K713J6981K3357L257p248l1114n222j3905K3572L1032
11497D6747k0481j810J2533Q02R572k603j7169o637P499J8853q588l9051l1872
$$ y = [54706, 27869, 17579, 32235, 25070, 5377, 847, 2368, 23495, 25306, 12630, 32315, 15430, 9750, 18216, 19080, 22163, -2282, -5880, 4891, 53289, 77291, 66399, 44365, 32749, 4577, 5507, 22524, -16783, -31799, -40554, -50609, -32260, -19277, -13086, -11734, -20173, -717, 1437, -22935, -30372, -24189, 7489, 4253, 426, 4948, -42802, -59579, -49225, -47831, -17374, -13320, -12061, 13481, 25599, 4885, 12701, 29563, 13789, -11363, 734, 12099, 31042, 50965, 17411, 2384, -10270, -26893, -21241, -15323, 4669, 23363, 33891, 60430, 31156, 12427, 21668, 7229, 3324, 6037, 23018, 46375, 49632, 42384, 11270, 6048, -7857, 15715, 46747, 26266, 24456, 36989, 37791, 47363, 44760, 27591, 20954, 28453, 47306, 38718, -333, -32205]
11484c2205J413K5211L3705K0219k9399j8776Q442J1521J1025r043j5276l0792
11472b3955J0352J6853r807O285R031k7131p031O581K3448J0784M644J529o266
11459A5317J2995j2905j9312L141j7802P39K0931J7461P307K1440O677j3284l5199
11446G506l9941k376r907j2585K0694K4444J7231J4392k5636m0266J0619J5704
11434b0121N186J3194m633M374Q382M519m842m39P884P945k628K0441j5976j4204
11420I082J1674P282k280n529j5724M586o891N550K6404j9894l1492J7102J9927
11407A9797j4397k7032l6324J6745J2781l2126J0647K2419P966k209K949J1944
11395f840J8189j429j4084k0032J4268P507q52o204N997O422r346k898K9773o771
$$ y = [-32205, -30792, -5581, 28124, 48343, 18944, 168, 8610, 20131, 31156, 22113, 6837, -23955, -13603, 3250, -6557, -272, 8759, -18372, -25403, -18822, 4626, 15410, 20054, 21583, 15317, 28312, 15407, -3905, -764, -18566, -17827, 3104, 20565, 27872, 49312, 55989, 42705, 7506, -32435, -34811, -44718, -57303, -36609, -12165, 5066, 19458, -6178, -46444, -35825, -20121, -14935, -1741, -6374, -2000, 6382, 10901, 6059, 5620, 13504, 21449, 18821, 39262, 23286, 9082, 20756, 28038, 25758, 20229, 4505, 9091, 2200, 7750, 34154, 14260, -17232, -130, 19797, 5400, -21632, -57956, -41211, -28430, -60556, -49909, -27490, -19524, -21733, -18784, -6840, 11349, 9920, -4164, -24196, -9928, -2421, -3273, -9477, -3480, 2942, -6404, -9302, 20471, 13700]
11381A3700j5328O617J0008J5651J0571j144k8948j3640L615J6831J2422l515
11369B6840k5917j4303j6965j4424L3788n483k655J1448K0777R380j8643j0228
11357f385q964j7225j0167R915L548J654K7979K4184o64o605M679j2983k8292
11344a9326k431N879l24M658K3983J5848m087L592L629k4361p252k3303r538J5916
11330a7117j2k5826j4698j132L3824M4723k3488p599N585J4304J7902r633j9030
11317b197j994l414j7322m368J6963J7517j2144q596j3698j8478O189M0395j6515
11304a7662j7419J7930K3340k0873j4008j263P72M572J8867K0241N177M54p486
11291A2642J3132N314O85k4969k7779J5197J8894K1608m64k2140J5892J4761k1061
$$ y = [13700, -1628, 4989, 14997, 30648, 41219, 40075, 11127, -2513, 1102, 17933, 30355, 26840, 923, -13380, -30345, -44769, -10981, -16464, -19119, -7671, 13106, 22486, 3843, -6385, -15349, -32574, -42741, -32826, -29278, -27624, 355, 24539, 23875, 17270, 21949, 8966, -19326, -21757, -15878, -16202, -11544, 12439, 28287, 24200, 27792, 31421, 7060, -192, -23495, -33033, -17117, -17129, -42955, -57653, -58785, -24961, 19762, -3726, -11325, -5740, 8564, 26466, 16833, -2197, -4191, -7605, -24927, -29295, -12332, 5185, -6959, -15555, -29253, -47731, -41542, -1147, -17662, -35081, -17151, 6189, -14684, -28692, -29955, -29183, -24611, -5744, 14497, 19674, 20128, 12642, 25774, 31088, 31773, 6804, -20975, -5778, 13116, 34724, 34260, 12120, 28012, 42773, 21712]
11278B1712k052K5792J34l363J1537l3722l8519k4155J8685L3523K5190K4750
11266E9512o580j5999j7343j0455j8992J6212N220j2448N444J0688o169M096K8135
11253D1321q09j6159m702R337j8448j8517J0413J5439j185p103m110m612M801
11240E666j0610j5197K5183n143O299n062k0499j3078K174J3039J1340J8597P520
11227B0229j6630j6023K570K4458J2610J0048J4751k4677r902O013j4033k6352
11215a6938J4900L5982J4923q708j3914j2888j4844M588J58m733K418r52O612
11202F604k2578J5361M419j5783K6769J5311n128K5550k2726k1886k3243k3075
11190d0405J918J1067R134J8888j701j210k6963Q8M5231N187n366j0894r045k403
$$ y = [21712, 19660, 45452, 45586, 42223, 53760, 20038, -18481, -42636, -23951, 9572, 34762, 59512, 52932, 36933, 19590, 9135, -9857, 6355, 11575, -873, 4571, 15259, 9090, 13186, 41321, 40512, 24353, 19651, 28988, 10540, -7977, 2436, 17875, 16690, 9587, 5477, 865, 5666, -4944, -20141, 5042, -101, 6198, 1136, -19363, -32441, -30267, -17228, -5888, 12709, 20229, 3599, -12424, -9854, 14604, 27214, 37262, 52013, 27336, 17434, 23447, 9414, -16938, -2038, 33944, 48867, 40159, 26245, 13357, -1487, 3101, 3259, -1474, 944, -8, 6604, -15974, -613, 3806, -11977, 14792, 30103, 24975, 50525, 27799, 5913, -17330, -40405, -38487, -27420, -18286, 602, -1099, -2309, -29272, -29184, 16047, 21234, 15868, 4974, -4071, -6474]
11176f474Q594p191K4289J747l1330j5920J4883M539l8705p242O839M5687J5689
11163A5405j9221J8428k148J0824Q268k653N460o956k0515k7262r092p888L4391
11150b959J5802q608j4257J493J4716q69l8037K4735J8677k1386J2639K6373j0196
11137A8123l2385j6416O51K9878K2757n234k8215q423J8882k0828q308q749R068
11124b9199q847J4427K0472K9102L4005r506j7820l6062j0256N112j5599P526
11112a6645j3953k337J2897K3951M824p878k4972p421J3618k1200J0974M0693
11100A2551Q574n207J6411K01j6695J4811K857j863J3870L129l0092r324K52Q139
11086A7614k7470n81P189o805m893J963m167K9906p540J1201K2389l013j4240
$$ y = [-6474, 2120, -5071, 19218, 20965, -10365, -26285, -11402, -6863, -45568, -52810, -45971, -284, 15405, -3816, 14612, 12464, 23288, 31556, 28903, 34363, 27407, 6892, -20370, -29462, -37350, -2959, 12843, 4235, -10022, -8529, 6187, 5318, -32719, -7984, 10693, -10693, 1946, 28319, 18123, -14262, -30678, -30027, -149, 22608, 17374, -10841, -19264, -382, -21210, -29518, -38267, -29199, -38046, -23619, -3147, 25955, 59960, 50454, 32634, -3428, -13684, -8572, -24171, -16645, -30598, -32935, -20038, 3913, 8737, 859, -24113, -31534, -17916, -39116, -28142, 12551, 21125, 15918, 32329, 32530, 15835, 30646, 33503, 31640, 45510, 48639, 18547, 9223, 9475, 17614, -9856, -10437, -3248, -10053, -14946, -12983, -17150, 12756, 5216, 16417, 38806, 35793, 21553]
11073B1553k2337m448k4167Q568L209J7571K1964r465q162j0348K2096K057l868
11060A4223j7428j7469J8939J1398L622J9390P973J2301K669p353k4836k344J3002
11047C4087K4570K6383J0337P404m883j5379j0211p42p964l083O96J4052p387
11034F7880K2435L4508L0816J4596j9936k159j8508K56m894J4779L7288L6129
11022B13190L9417L8253J3738l6458m1433k9316l2105k9586j2539k0534J7785
11011A20412K5183K0550J143j7458J0784l2000o44j4175j6721k2446j6066J7731
10999G6293J6843j3275L874j7131p22J3173j5837k5910k5217j1981J4013Q422
10987B2545j1842J5615K4747J4936l6175j8834M660J8673j4133J7000K5260N991
$$ y = [21553, -784, -5232, -29399, -20831, -17622, -51, 21913, 12448, 4286, -6062, 16034, 18091, 14223, -3205, -20674, -1735, 9663, 13285, 32675, 40648, 52949, 55618, 48265, 23429, 21085, 34087, 58657, 85040, 95377, 102781, 97898, 82519, 72308, 71566, 63602, 60519, 61215, 75267, 67880, 90315, 124823, 155639, 170235, 150299, 148140, 129632, 129888, 124994, 139773, 177061, 213190, 252607, 290860, 304598, 268140, 226707, 197391, 165286, 135700, 123161, 102627, 120412, 145595, 166145, 167288, 149830, 160614, 128614, 127970, 113795, 97074, 74628, 58562, 76293, 93136, 79861, 83735, 66604, 65882, 79055, 63218, 37308, 12091, 110, 14123, 22545, 10703, 26318, 51065, 66001, 29826, 10992, 15652, 34325, 20192, 37192, 62452, 68443]
10975F8443j7299j0776k520K0247M018m4258N848P52j6811j7953j2185P989r01
10962a5406J3258m394P028L5859p738q799q995p152m997R228m360j6627j0628
10949b3723J8272j2519K3219J2620p370K8967J5120k2890j0085Q704j0936j2624
10937F755R236J1287j271J837k087J2052n119j6787k4302J1359M437q98M19K4959
10923C1877j245j8683L18j0991O629r313J42J770k676Q896Q392K1160o611n3637
10909b3972l1277j638K2584M4934R741j6988k4609q233P217J1462m629n553j2268
10896c3229J556N447K8784K0404J903k8587N451L0915p315n872j5948j0721O479
10883g33M480K4480o341J5955o39L4473M283k0397j7291M150R199l3967j0589
$$ y = [68443, 51144, 40368, 37848, 58095, 62113, 17855, 23703, 24455, 7644, -10309, -22494, -14505, -15406, -2148, -6542, 486, 36345, 28607, 19808, 10813, 3661, -1336, 7892, 3532, -13095, -23723, -5451, -17970, 5249, 17869, 10499, 39466, 54586, 31696, 21611, 30315, 19379, 6755, 15991, 27278, 26007, 27844, 25757, 37809, 32690, 15903, -8399, 2960, 7397, 6499, 6918, 31877, 30632, 11949, 12267, 1276, 7905, -1408, -1266, 504, -2172, 6724, 15116, 36276, 29665, -23972, -55249, -56887, -34303, 10631, 20372, 3384, -21225, -29458, -22241, -10779, -15408, -20961, -33229, -31673, -26226, 2558, 22962, 24865, -3722, 1729, 32644, 25329, 19457, 3509, -7212, -733, 3747, 28227, 21886, 37841, 37202, 71675, 75958, 55561, 38270, 42420, 51619, 17652, 7063]
10870G063O480N363K7813J6520K07N449k7779Q968Q440k9674n114K0277R723k1764
10856C1972k7764K913K0122K1956n523L648K1937k426n44Q043j1482K7464K9498
10843A19814j0013j0016n957l1222J9530k9149j1983L2118K483j3718J5909J4542
10831I2338j1924J285j2897o136J2495J1121k5643j8620j0901k026j3800r283
10819F009j2805k6492J4764J0670L0296J1554L642Q574r61N369J743L125l0432
10806B5056R405p428j3473n973k06m344J3963M803M204J7564k3149j9042K7649
10793B9029j9904n787J1572O448q829k4929j3751J2068L7285K1433k2009j7936
10781D690J1809j0696j3132K3238L941R439M816p952J461K0220L171J2419o507
$$ y = [7063, 13543, 18906, 46719, 63239, 63446, 68895, 41116, 50084, 58524, 28850, 23736, 44013, 53736, 31972, 4208, 7121, 27243, 49199, 43676, 47324, 69261, 66835, 66291, 74334, 62852, 90316, 119814, 109801, 99785, 93828, 62606, 82136, 52987, 41004, 73122, 75605, 61887, 77796, 92338, 80414, 81699, 68802, 62666, 75161, 86282, 60639, 42019, 31118, 29092, 15292, 6009, -6796, -33288, -18524, -7854, 22442, 33996, 37638, 46212, 45251, 50620, 52363, 55488, 25056, 34461, 27033, 13560, 7587, 7381, 3037, 17000, 21803, 26007, 43571, 20422, 1380, 29029, 9125, 3338, 14910, 21358, 12529, -12400, -26151, -14083, 23202, 44635, 22626, 4690, 16499, 5803, -7329, 15909, 19850, 29289, 34105, 26153, 27614, 47834, 51005, 63424, 56917]
10768E6917j8746j7595N188Q361L1203N511j9016m7101J121O661K5079L0612j525
10755F6670l2504j2000j486R352Q315L256J5879m741j1602j1532J5466K089m682
10742D2480J5025m049m946M8o80N946J0537n683L88n402j2182J4509L1555J819
10728H9365l925m06j4019j0076r743j6020K885l471O071O35J0674k587k523l923
10714D2937R807K1045J6604j3692j5795L995p86m382K4240J2437M810j0184j5720
10701G5316j9765P661j8864J2707K5109J9383j4720J1373q404m90r363J74o256
10688G3861R991k4768P313P709l629p048J3935M357n829n058j0055j7743J4634
10675E7670L2469K7360P150j3151K3427k6711k6880j8775L5897K3979j897m545
$$ y = [56917, 38171, 20576, 25764, 34125, 65328, 70839, 51823, 4722, 5843, 12504, 37583, 68195, 66670, 34166, 22166, 20680, 30032, 38347, 41603, 57482, 52741, 41139, 29607, 45073, 47162, 42480, 57505, 53456, 48510, 48558, 47878, 53824, 64361, 58678, 59066, 53664, 41482, 55991, 87546, 89365, 85440, 85034, 71015, 60939, 51196, 35176, 38061, 34590, 40661, 41296, 51970, 49383, 46860, 42937, 52744, 73789, 90393, 76701, 60906, 64901, 64115, 59733, 83973, 96410, 101220, 91036, 75316, 55551, 63212, 44348, 57055, 82164, 101547, 86827, 98200, 89796, 89306, 79943, 80117, 73861, 83852, 59084, 66397, 74106, 70477, 63429, 77364, 81721, 75892, 70834, 60779, 43036, 57670, 90139, 117499, 124649, 111498, 134925, 108214, 81334, 62559, 98456, 122435, 120538, 115993]
10663A15993L7331J5599k5844N665L2270K9466j1675J118J7845J6007o383J9797
10651B47189j3478o831O875M423K8791K0997o461Q534L9540L2083J1485J5528
10639C88675K4468O2019K6664L3430N6246P0933R9956J12467R3492P9083J03167
10628A150600O7128J28120J81184K08436K42937L47652M35587N84988P81697J052724
10618E181053J399872J848894K266894K454038K021755R55041j93392q31066p81269
10609A4321820k74530M03541J271823K281761L464512M544908M916156L687268
10601C4617259P67272k187699l443535k992424j723638k55653J263490K870402
10593B8915474M523644N866030N978363L671658q39581m994744o413184n486940
$$ y = [115993, 153324, 168923, 143079, 148744, 181014, 210480, 198805, 199923, 217768, 233775, 227392, 247189, 233711, 226880, 233755, 238178, 266969, 287966, 281505, 290039, 329579, 361662, 373147, 388675, 413143, 475162, 501826, 535256, 591502, 662435, 762391, 874858, 968350, 1047433, 1150600, 1217728, 1345848, 1527032, 1735468, 1978405, 2326057, 2761644, 3346632, 4128329, 5181053, 6580925, 8429819, 10696713, 13150751, 15172506, 16127547, 15934155, 15103089, 14321820, 14047290, 14450831, 15722654, 18004415, 21468927, 26013835, 30929991, 34617259, 35384531, 33196832, 29753297, 26760873, 25037235, 24781582, 26045072, 28915474, 33439118, 39305148, 45283511, 48955169, 48115588, 43120844, 36707660, 31220720]
10585C1220720l779316k053604m74916R44575K240240L153886L022780J203164
10577C5477529j921805m476547n075139m216955k925076j780188q07453o8501
10569A4205865N33417Q22209O15073k09123j389867k291950k501330k156149j670182
10560E957963j199180q66294o49389n16369l84718l08158k39271j80174j59784
10551A454626j45883j55443j39000r3672q2229n0329m5287l8961q5090p3775l3145
10540E11812k0535q115j3630m1667J0407j792m0421j8250J3042j5734m0010m8511
10528B86596k2171L609r408j4480K5826o544k5329j6692q221J8072J5364k0166
10516B26456k3998j1857p914Q948J9483O548j0363l5613m0797r457J8710L273
$$ y = [31220720, 27441404, 25387800, 24912884, 25857459, 28097699, 31251585, 34274365, 35477529, 33555724, 29079177, 24004038, 19787083, 16862007, 15081819, 14274366, 14205865, 14739282, 15561491, 16176564, 15967441, 14577574, 12285624, 9784294, 7628145, 5957963, 4758783, 3892489, 3243100, 2726731, 2342013, 2033855, 1794584, 1614410, 1454626, 1308743, 1153300, 1014300, 920628, 838399, 788070, 742783, 703822, 618732, 544957, 511812, 491277, 483162, 469532, 427865, 438272, 436480, 396059, 377809, 390851, 375117, 335107, 286596, 264425, 268034, 258626, 244146, 269972, 263428, 238099, 221407, 213186, 231258, 246622, 226456, 202458, 190601, 182687, 191635, 211118, 217666, 207303, 171690, 130893, 121436, 140146, 143419]
10504A43419L760Q131J4793m040l4289K5798J0467j9922k7822l247J3424K539
10492A33011j6039P652J9309j6053j7732l203p660l1396k1289O913J9390k0174
10480E2729k1085L1811K4082j585L725J0472Q508j6530l2819J9096K5543J2742
10468A16689N385O5L599L3524k2261l5717j5639K405o231R992j3370N111o470
10455G7082k0092L334L5651K765l6158q087J4446k8226m5667K117J5264P150L1965
10442E1544n690j2971m993p927K3469J8839k0892j4808K7771O094J661p954n471
10429D8672L743k1688q860J315l372j2055j0289K555k418j5011j2649J2338M3897
10416B6178J6489k6392j0315K5283l538J640Q243J6233J8077k3949j7002M414
$$ y = [143419, 147179, 155310, 170103, 166063, 131774, 157572, 168039, 148117, 120295, 117048, 130472, 133011, 116972, 124624, 143933, 127880, 110148, 106945, 99285, 67889, 46600, 53513, 72903, 52729, 31644, 63455, 87537, 85952, 89677, 100149, 108657, 92127, 59308, 78404, 103947, 116689, 122074, 122139, 125738, 159262, 137001, 101284, 85645, 88050, 81819, 91811, 78441, 83552, 77082, 56990, 60324, 95975, 98740, 62582, 54495, 68941, 40715, -4952, -2835, 12429, 19579, 51544, 45854, 32883, 27890, 19963, 43432, 62271, 41379, 26571, 54342, 60436, 62097, 54143, 48672, 52415, 30727, 21867, 23182, 19810, 7755, -2534, 21, -2397, -17408, -30057, -17719, 26178, 42667, 16275, 5960, 31243, 27705, 29345, 37588, 53821, 71898, 47949, 30947, 35361]
10404C5361k4497J0388R899o095j6186P165n619l5174n037J6819K2269M831j0243
10391C881m061L227k054R330K0734Q932J3613j5465Q329J8463j4589M081l8965
10378A5456k0182q878K3279L8869l806k3345j2997M492P947K8265N537N79j2359
10365D2857q355l1538k0332l327j665j8986J916R262p179J848P219l239o608J7541
10351b0586l927N118r837q909J4144J9438L78R431P224l1268k7531j2347J1228
10338d7444J7852P267p475J9777j4847k4336L230k770K0536O0239K6036q608J4001
10325F3458O80j3177j2073m082k0151j1389J1939K7204R860j203j1914k9271l1401
10312b1520l6882k864J3863J0588K4051k2413q831N114K1103P209q359K901K6442
$$ y = [35361, 10864, 21252, 31151, 25056, 8870, 16035, 10416, -24758, -29795, -12976, 9293, 14124, 3881, -180, 3047, 993, 10323, 31057, 39989, 53602, 38137, 46466, 64929, 50340, 54421, 15456, -4726, -13604, 9675, 48544, 44738, 21393, 8396, 12888, 20835, 49100, 54637, 55216, 42857, 34502, 2964, -17368, -20695, -22360, -41346, -39430, -30168, -37347, -35499, -28280, -31519, -38127, -20586, -24513, -19395, -29232, -38141, -23997, -4559, -4181, 5250, 12474, -18794, -46325, -58672, -47444, -29592, -22325, -29800, -10023, -24870, -49206, -45976, -48746, -28210, 32029, 58065, 49457, 63458, 64138, 50961, 38888, 34806, 14655, 3266, 15205, 42409, 52269, 51066, 39152, 9881, -21520, -58402, -61266, -47403, -36815, -12764, -35177, -44008, -38894, -17791, -10582, -18941, -16040, 10402]
10299A0402p405k6783o100j9821K7271K3206J1327J9627K015k1174k4299O899
10287d835j9969j1493K3475L1468k3408k4730K9653m65P841L864j6115K523r327
10274a1518k1829j853J2060n494k873k170L3673K4567o045j9173J899K3452k596
10261B2100j1785m157o643P41J6401O048o775k629O44K1608P571m747N877J8857
10247F3111k3669j2125J0064J7894J3796j8566j0905p599k028j9051j0209j358
10235f45J4234J6888r267j8070P608k236O415J3159n467L5438L1591O917k9581
10222F6984l9053j4561k746R91M303L822j3732j8113r77R401M5014K7100k8728
10209C9705k7589q805j0499P763J603k2755j4893k684K1659O414p456q323O738
$$ y = [10402, 2997, -23786, -29886, -49707, -22436, 770, 12097, 31724, 33739, 12565, -11734, -4835, -24804, -36297, -12822, 18646, -4762, -29492, 161, -304, 7537, 11401, -4714, -2191, -11518, -33347, -35200, -23140, -28634, -31507, -33677, -4, 24563, 18518, -655, 1244, 24696, 22100, 10315, 6158, -485, 256, 16657, 22705, 15930, 13301, 13945, 35553, 43124, 38377, 44254, 63111, 39442, 27317, 37381, 55275, 69071, 50505, 39600, 32001, 29973, 10922, 713, -645, 13589, 30477, 21210, 3140, 10748, 8512, 14927, 28086, 22619, 58057, 89648, 96565, 66984, 27931, 13370, 10624, 11615, 15918, 19740, 6008, -12105, -13082, -3681, 41333, 68433, 39705, 12116, 3311, -7188, 575, 2178, -20577, -35470, -38154, -16495, -10081, -17537, -25860, -19122]
10196a9122K4019J3212l2137O265K0268j6644P083Q269R118K074o793j6107j120
10183a615Q325O98m545O308N1266N2532P984k9378l0200j5459P381J2722L1882
10170I7901K0494K935M4284M5822J2623j1666j0851j9846m3482j8817k681l923
10158A12793j817M5137P3110L0668J2694R592J4736m4919o2256m8796j3923k4765
10146A02254Q92K8693K0569K1618p843J2629N533m4547k7078k2691j3354j4288
10134F2387l321J408M0206N082k3371Q025k038j4238L00M86k3168M602o518l1879
10120A7963o208L1562k0226k8496k7354j3774p352J5406K659P212J1404J4693
10108b511J4918L185j7389j3295j1431Q056P031M104J115k9149J9984Q677J9709
$$ y = [-19122, 4897, 18109, -14028, -7763, 12505, -4139, 2944, 11213, 20331, 22405, 15612, -495, -1615, 6710, 7408, 2863, 9171, 60437, 112969, 120953, 91575, 61375, 45916, 53297, 66019, 97901, 118395, 121330, 165614, 211436, 224059, 212393, 201542, 181696, 138214, 119397, 116716, 112793, 110976, 156113, 229223, 259891, 272585, 282177, 296913, 251994, 189738, 140942, 127019, 102254, 103146, 131839, 152408, 174026, 166183, 178812, 184345, 139798, 112720, 90029, 76675, 62387, 59066, 60474, 100680, 105762, 82391, 90416, 88378, 74140, 74440, 74926, 51758, 56360, 49842, 17963, 11755, 43317, 23091, -5405, -32759, -46533, -53885, -38479, -35820, -28608, -17204, -2511, 12407, 15592, -1797, -15092, -26523, -18467, -11436, -7332, -6217, -35366, -15382, -6705, 13004]
10095A3004J4391j0775j921L8342Q694j4360j9250k622k212l0339J4724p778j1604
10082a1706j6379O012o18p943J9565K2441k067L659l489N318j6094N729L0007
10069C4435j5430J1942j1137o683J6605o614k4162j7808l76j3109q575K099J226
10056c7587J6889M236k6773o668L2016K7926J0223m720P885J857N26k4221l3860
10043c2271J5J6773j2794j642L1246K7117j5080j3853j9172k4029j5548k255K0141
10030d1352K5774L0744j1483p019n335O82R588J052j9300J3231Q825q631J209
10017b015o939K53m274j0001q459k8781P62o749P4J5992J6165j2631Q624J9398
10003a8581J3810o015M883R445K4600l3045j7545J6571L0102k2981l0423r105
$$ y = [13004, 27395, 16620, 14699, 53041, 61735, 47375, 28125, 25503, 23291, -7048, 7676, -102, -11706, -28085, -22073, -22691, -30634, -11069, 11372, 9305, 12964, 9475, 14793, -1301, 4428, 34435, 19005, 30947, 19810, 13127, 29732, 23118, -1044, -18852, -19228, -32337, -40912, -38813, -37587, -20698, -16462, -43235, -49903, -17887, 10039, 20262, 15542, 23427, 25284, 25810, 1589, -32271, -32256, -15483, -28277, -29919, 1327, 28444, 13364, -489, -19661, -43690, -59238, -61493, -41352, -15578, 15166, 3683, -3336, -8671, -7989, 1599, 2651, -16649, -3418, 5407, -3224, -2015, -8954, -8701, -12975, -22976, -31435, -60216, -59454, -66203, -66129, -50137, -33972, -46603, -37979, -18581, -4771, -10786, -5903, 3542, 28142, -4903, -22448, -5877, 24225, 1244, -29179, -38284]
9991c8284J61J7117K0795L2625O731q031l4427r368J2859J0132o505j6153J0929
9978a419L3501K107l1666l9908m335J36l703j0827K409M4996Q550j801k047L290
9964g17L3293j6852l2217M657J1755k33P558j0088o556j6680k4284J1737J2407
9951b6220m620n316J5663j2189q44J7333k903p390o434O935K146j1750L6764l79
9937G96k173J287l1218k0230O263n789J1553J9059K6931q962j7332J2375k168
9924i608Q449J885k1543J023O138J3700K1033L278j0333l085K4217J2629p381
9911D0402j8488n885L678m332P130R684o916k4977l2219r295K3269o620m3521
9898f8090R927L7118p1J0481K658k754o715J7237J6768j215o120M035j5871j8667
$$ y = [-38284, -38123, -21006, -211, 32414, 39145, 31114, -3313, -12681, 178, 10310, 3805, -12348, -1419, 32082, 34189, 2523, -37385, -41720, -41584, -45287, -56114, -53705, -8709, -159, -1960, -4007, -717, 32576, 15724, -16493, -11836, -81, -314, 7244, -2844, -9400, -26080, -50364, -38627, -26220, -30840, -36156, -20493, -32682, -33526, -16193, -19096, -26486, -32920, -25985, -23839, -35589, 1175, 796, -1377, -90, -31308, -51538, -45275, -51064, -39511, -20452, 6479, -2483, -19815, -7440, -9608, -1159, 726, -20817, -19794, -13656, 44, 21077, 24355, 14022, 10937, 35154, 47783, 40402, 21914, 16029, 19707, 15375, 22505, 32189, 25273, 296, -31923, -41218, -17949, -24569, -68090, -58163, -21045, -21116, -10635, -7977, -10731, -17446, -209, 16559, 15344, 9224, 13259, -2612, -21279]
9884b1279J9552k0689K377r386q392K6348k334r966L3630K1178p606k7133l6450
9871d0150K1641J8256j0940p840l371n434K3048j3227N015n11R231O179M519o451
9857c5q210n807j3626P818K3645j8859o814M11k1950k647L05M754R843K2350J9096
9842A0274J8539k858l6018j6508j5346J6752L2172j7878o205K9914j5924j8044
9830b1130j2234J6468k899L1260J4356j6059m076j5829k737l225J1113J0157o378
9817a213j3703j3865m634k2926M670j2780O9424K8363j1310n010l6664M536K5052
9804I940l4654l048N608j001J2676l2981j5949K1575J8855L475M063L420k330
9791a0351p381J8237K3995k8074l3820j5460J2690J4691J9504L036l1079j6655
$$ y = [-21279, -1727, -22416, -20039, -29425, -37817, -11469, -13803, -23769, 9861, 31039, 23433, -3700, -40150, -18509, -253, -11193, -19033, -22404, -27838, -4790, -18017, -13002, -13513, -4282, 1897, 6416, -35, -8245, -14052, -27678, -19860, 3785, -15074, -21888, -21477, -43427, -46074, -45769, -41015, -31172, -8822, 10274, 28813, 25955, -10063, -26571, -41917, -25165, 7007, -10871, -17076, 12838, -3086, -21130, -33364, -16896, -19795, 11465, 25821, 9762, 5686, -10143, -12880, -16105, -4992, 5165, -1213, -14916, -28781, -33415, -56341, -51671, -64451, 4973, 33336, 22026, 17016, -19648, -15112, 9940, -24714, -27762, -22154, -23155, -10479, -43460, -59409, -37834, -18979, -15504, -11441, -8021, -10351, -17732, 505, 24500, -3574, -37394, -52854, -40164, -25473, -5969, -2933, -34012, -50667]
9779e0667Q589L4015J1609j7717Q627o691k1974L9084M1489J049o828j2461l4087
9766e963P253L691k4724n966J84R727q62k9690n839Q840J0870R074K6956J6850
9752B0401j0670k0645l106j1837j7347L91K4303O209j1558K4037J1541k7527J6100
9739B92J1287j81N622p078J264L114p955j6509l5445j1091j18M609j260K7632
9725b5817J2699P748L1070q233j7888j6506J411j902j5334K2400J4725j3089j2498
9712b1214K675j3434r296l812J1713m435j4307Q167J6818N658M22j0263J0312
9699b0996J0963L4640p075k946M76j7206r979K0158N566r666k0239J5461K7727
9686B6884j8713j8089K122J9590J4256p201j2304l1899j8963J7630K1023l5698
$$ y = [-50667, -42078, -8063, 3546, -14171, -5544, -12235, -34209, 4875, 46364, 47413, 40585, 28124, -5963, 1290, 4981, -19743, -25709, -25525, -15798, -16660, -46350, -52189, -43349, -32479, -23405, 3551, 20401, 9731, -10914, -14020, -25857, -43204, -42813, -18510, -12301, -23859, 178, 11719, -15808, 292, 11579, 11398, 17020, 9942, 11206, 14320, 6365, -10144, -45589, -56680, -56798, -52189, -53449, -25817, -13118, -5370, 25700, 17467, -421, -16927, -15516, -17418, -32752, -10352, 4373, -8716, -21214, -18539, -31973, -41269, -45081, -33368, -37803, -52110, -43943, -27125, -21467, -21045, -31308, -20996, -10033, 24607, 17532, 14586, 15062, -2144, -12123, 8035, 13601, 3935, -16304, -843, 26884, 8171, -9918, -7796, 11794, 26050, 18849, 6545, -25354, -44317, -26687, -5664, -41362]
9674d1362k1019Q410M640J2371J7575J1303P128N226K2359j6m470p112m431l1710
9660b1108j2974J6942Q76J1750n71n24K4396M475j8886j6938r478K1696J4379
9647A4035o336l944Q635J0803j7898q880r368j640j2026r099J3260L9559R667
9634B6768n407m838m986K120m444j4389r935k3134L5877J1882o136O371p725k6857
9620b4833j5657J1727J7350K8046J2351k3086N984j0106k0585q93p360P816L7553
9607A8307K3526n178k5954k7072k1208j3312K4727j977j5441k460J7438L3005
9595D401J568n370R235K2372k4914r770K8900l837K248j6007j165j5438M763j4836
9581a7850N702M707j1079J1258q314J1391j6981o226j8824j0266J6409J9456J5831
$$ y = [-41362, -62381, -53971, -49331, -36960, -19385, -8082, -954, 4272, 26631, 26615, 22145, 15033, 10602, -21108, -34082, -17140, -16264, -4514, -5085, -5609, 18787, 23262, 4376, -12562, -22040, -344, 14035, 7699, 3755, 12390, 23193, 5295, -3585, -12953, -14593, -26619, -35718, -22458, 17101, 26768, 21361, 16523, 11537, 13657, 9213, -5176, -15111, -38245, -2368, 9514, 3378, 9749, 2024, -24833, -40490, -28763, -11413, 16633, 28984, 5898, 11882, 1776, -18809, -19702, -27062, -19246, 18307, 41833, 36655, 10701, -16371, -37579, -50891, -26164, -28141, -43582, -46042, -28604, 4401, 5969, 599, 9834, 32206, 7292, -2478, 26422, 22585, 24833, 8826, 7661, -7777, -3014, -17850, -12148, -7441, -18520, -7262, -15576, -4185, -21166, -27392, -46216, -56482, -40073, -20617, -4786]
9568d786j4390O226J603k5327j7636l839J6085N066p660K542K7163J6002o031
9555d982Q596j522j6847l6921L921J4199K2287q927J5014K103l323J959j4466
9542a8909R065P498L779p551o930j1075r024m159J6770j543J1060J8560j2492
9529d951J9519M17k569J6510k6414R65r938M3134j060l2780j2276n437o721j3029
9515c4630J1044M448n751l627K7973m191J1574O780l527J4149P859O692j3226
9502B5567l6171j3525J3341J8900J8154O939j8778Q376j8548l501j022p029m841
9489a2138L348K612r355j4934O233Q911J1717q566k911J2385J6804R501L0186
9476E3793j6067k5424l2804l7091P598n778k333P416K5769O07l604o4j7095J509
$$ y = [-4786, -19176, -12950, -11347, -36674, -54310, -58149, -42064, -36998, -44658, -42116, -14953, 1049, -4982, 3614, 2092, -14755, -51676, -47755, -33556, -11269, -20196, -5182, -3079, -6402, -4443, -18909, -9844, -2346, 1433, -6118, -13048, -24123, -33147, -37306, -20536, -22079, -11019, 7541, -4951, 14568, 14985, 12416, 28926, 2512, 3477, -6461, 36673, 35613, 2833, -9443, -14880, -21601, -34630, -23586, -19138, -24889, -28516, -543, -4734, 6840, 13620, 10093, 24242, 32101, 38793, 25567, -10604, -24129, -10788, 8112, 26266, 33205, 14427, 22803, 4255, 754, -268, -7297, -12138, -8790, -6178, -15533, -30467, -24234, -15323, -3606, -12172, -15083, -2698, 14106, 23607, 53793, 37726, 12302, -20502, -57593, -49995, -55773, -58106, -50690, -24921, -24314, -27918, -27982, -45077, -43568]
9462d3568J1384j6913j3964K3786j2403K9796M3299n078r143k0229k1931L677
9450c1287O222O857j0135J5297j0424n398J2529Q798K1490J483n65J4120O079
9437C5066L819j7744k9035j0572K2411j3317l4901l035j0027N218K5142L1265
9425D290P49k3860j4922J7349J5539J2403L608j638j6180J3991j686j2926j1745
9412a5028j2890J1742k255K0429J6564Q022N309j877j9430q598j0905j2068O178
9399a4807K1795J2260k0708j8605q936p399P512r901P640L0454K8848J956k090
9386B8019K3593J6266k6330k6965k2887J5194o573k7141j9025L125J3439L9590
9374A0305L8947j2677j0782m467J0158J9495O34l5387k2614r424R142J3322M892
$$ y = [-43568, -32184, -49097, -63061, -39275, -51678, -21882, 21417, 16339, 7196, -13033, -34964, -31287, -25065, -18208, -28343, -13046, -23470, -28868, -16339, -7541, 13949, 15432, 14867, 28987, 35066, 38885, 21141, -7894, -18466, 3945, -9372, -44273, -47308, -57335, -52117, -26975, 4290, 5039, -18821, -33743, -16394, -855, 11548, 15156, 13518, -2662, 11329, 9643, -3283, -15028, -27918, -16176, -18431, 1998, 18562, 26584, 31893, 30016, 10586, 1988, -8917, -20985, -14807, 6988, 19248, -1460, -20065, -29001, -36400, -28888, -38789, -31149, -695, 28153, 30109, 28019, 51612, 67878, 41548, 14583, -8304, 6890, 317, -26824, -45849, -42724, -29285, 10305, 49252, 36575, 25793, 21326, 31484, 50979, 51613, 16226, -6388, -15812, -6670, 6652, 11544]
9361A1544j2687k238J957O523K571q969K627j172q119m216J2507L260k285J9098
9347B0401L19P552o651l20m3402l664R440j5143K043K6638L4645J8720q778o162
9333C5638j7921m6361r598N91J6795J5174M470L5962l284j3207k2471p267J6727
9320E248P956O693j0214O24j2050j123K363J6071J3668J3765j7645k8942j7145
9307b0731k396J7117L566j358p807j4130m362Q563P356J0022O122K2136k3884
9294B14n8759k7004K2687K8772J2908N0944Q719L461J7604J384j7148m1880n796
9281c894o467o302N455J3717L494r182j905J6721k494l9212k43K975Q821L1938
9267A3422j0650r016k808k5836M49K8588L1459Q736j7267k1407N427p527K407
$$ y = [11544, -1143, -3381, -1424, 5099, 7670, -1299, 1328, 156, -7963, -12179, 328, 3588, 1303, 20401, 20720, 28272, 21621, 21301, -22101, -25765, -16325, -31468, -29425, -2787, 31858, 50578, 41800, 35638, 17717, -28644, -38242, -37651, -20856, -5682, -1212, 34750, 31466, 18259, -4212, -11479, 5248, 13204, 19897, 9683, 10307, -1743, -2866, -503, 15568, 29236, 43001, 25356, -3586, -20731, -23127, -6010, -2444, -3802, -11609, -25739, -30101, -21538, -14182, -4160, 1962, 24098, 214, -58545, -85549, -62862, -34090, -21182, 29762, 38481, 41942, 59546, 60930, 43782, 1902, -3894, -10361, -16663, -11208, 2509, 6003, -3179, -5084, 11637, 9143, -30069, -30312, -27337, -18516, 13422, 2772, -6244, -9052, -34888, -34439, -5851, 25608, 34344, 17077, -4330, 1097, -6430, -4023]
9254d023K5432P336j5288p821J0029j7320l768j3829j8523P477L0326L2004K8243
9241F0275j5444p723k722J0990n421Q679j1877m8442j4691J3126j528j568J335
9228a5011j8160m98K8975J5156J0791N277J6628k2159l1034J2929K1979J4811
9216C9684j4351J1202R414l2147P437K856o002k7579M265J5936J558j7906p008
9203a2641L442j1566j082j2207L174L1381R026m1886J1902J0089j573j4501j0030
9190c6472K191J4609p650J0656J1164q840J0024k5256l3345J3901J8741K2852
9178g425J5730J2685m608j0639M029o017N641K0620k3268l1031J38K481K2947
9165A283K7735k7958p267J1400M344l985k5363l376p454o878K4308M0431P029
$$ y = [-4023, 21409, 28745, 13457, 5636, 15665, -1655, -5423, -19252, -37775, -30298, 28, 32032, 60275, 44831, 37108, 34386, 45376, 39955, 48634, 36757, -11685, -26376, -13250, -14778, -16346, -15011, -33171, -33669, -4694, 10462, 21253, 26530, 43158, 20999, -10035, 2894, 24873, 39684, 25333, 36535, 45949, 13802, 21239, 24095, 18093, -9486, -5221, 10715, 12273, -5633, -12641, -9199, -20765, -21847, -34054, -30880, 501, 9527, -32359, -20457, -10368, -11941, -26442, -36472, -34281, -19672, -27322, -16666, -5502, -14342, -4318, -29574, -62919, -49018, -30277, -7425, 8305, 20990, 16382, 5743, 9772, 3755, 9396, 30016, 6748, -24283, -24145, -21664, 1283, 29018, 1060, -6207, 5193, 9537, 5552, -19811, -23187, -30641, -37519, -13211, 27220, 34249]
9152C4249l653n955k4579n012Q912K8744l86j5193j2182L015j2170J860j8811
9139b1161J30J8688K9492j141R739J851k7187n516L067J2210m1556l273O228M1460
9125B3031J5190N711j0957k3108m157m56O919J163K6754J5434k5486k1699r844
9112a505j1237Q669O868j5456K754p452j2276N929J3059J557J2348j7905N708
9099h939r602k3235l1314R637M4445J5294N982r92M950n954n590r38j0897q294
9085b5447J5907k2768r831K0617J5684j4077l2933J1664L9302J8192K602q616
9073A0296k3373j268O983J2640K8767K775j6294J7779l8428n0650L256K9710k5294
9060d3101J8081K9459j6811K0068K2074j3774j657k3699j5396P700J7211p594
$$ y = [34249, 30596, 24641, 62, -4950, 3962, 32706, 32320, 17127, 4945, 7960, -4210, -2350, -21161, -21031, -2343, 27149, 26008, 35747, 37598, 10411, 4895, 7962, 20172, -21384, -24657, -18429, 23031, 38221, 43932, 32975, 9867, 5710, 5254, 12173, 13336, 40090, 55524, 30038, 8339, -1505, -12742, -4073, 2795, -12661, -9907, -17359, -29635, -23706, -10647, -9090, 3258, -14647, -8939, -18541, -41776, -73090, -63453, -19008, -3714, 2268, 1276, 6226, 272, -5318, -6256, -17153, -25447, -9540, -32308, -42139, -21522, -5838, -19915, -52848, -41184, -1882, 16310, 18912, 10296, -13077, -14345, -7362, 5278, 34045, 36820, 20526, 38305, -123, -50773, -47517, -17807, -43101, -25020, 4439, -12372, 7696, 29770, 15996, 14339, -9360, -24756, -17056, 155, -7439]
9048g439j7140p946J5736J9133J3724P880J9008J8881k2714k3192k0360J8822
9036A4393J1517j6520j7009J3494j0455j2306R981J5328k0689J1193R148j4985
9024f910k5495j7370K2084j6980K9361L8761O649k1503j3943J3294j018J1910
9012A8840k1563j1942Q587R555L279k7170l2623O460Q70J6972K1175K0590j0028
8999C002r555j7980q865K3901Q693j1024j1711k4063J5605k2019J6959K9273k9999
8986c7783J9L126j4797J3104l86J5529J9445J5564P218k1455p364M803o812M327
8972e462L080l1136J0275o956J018j6442J3726J7241J7936K1484j9083j8931q042
8959b1292K7980K1291K5985L2713j9544o3952j0036J3852j9606j3203k797J1456
$$ y = [-7439, -24579, -32525, -16789, 2344, 16068, 23948, 42956, 61837, 39123, 15931, -4429, 14393, 25910, 9390, -7619, 5875, -4580, -16886, -6905, 8423, -12266, -1073, 8075, -6910, -32405, -49775, -27691, -44671, -15310, 23451, 30100, 8597, -5346, 7948, 6930, 18840, -2723, -14665, -6078, 3477, 6756, -20414, -53037, -46577, -45707, -28735, -7560, 13030, 3002, -6553, -24533, -33398, -9497, -804, -11828, -23539, -47602, -31997, -54016, -37057, -7784, -37783, -37764, -34638, -49435, -36331, -36717, -21188, -1743, 13821, 21039, -416, -7780, -2977, -9789, -5462, -2382, -33518, -23243, -30199, -29181, -45623, -31897, -14656, 3280, 24764, 5681, -13250, -21292, 6688, 27979, 53964, 86677, 67133, 3181, -6855, 6997, -12609, -25812, -28609, -17153]
8947a7153J743Q497J0303j1002r805j2079r006j5957j6088J4384J965J243m502
8934e7457m572P415K157R352k041j3655n137P237j0653O827L4753J3468j1443
8921b3749k2681J3337K0686K9464o209J0825O476r902j8305j3018j8552O61L8339
8908G372K2749l9230k4841Q406J8811Q221r470j1422r604K1200J7920k1670o621
8895a8179J9016J1428K124o698J4868J1883l0223p264N089l0358K932K2960k2146
8882b4568j5407J6606j0005j2021J2875K429L794J5784K9930r581k3762K8487
8870A4561R992o435l6392L330J7222n913L29O160j3696j5252j0187J404M515K1191
8856i171j3519r559J0532J1234l326p170p005J1367R276j5876J0961J5162n252
$$ y = [-17153, -15410, -6913, 3390, -7612, -17417, -29496, -38502, -54459, -70547, -56163, -54198, -52955, -57457, -62029, -54614, -52457, -43105, -45146, -58801, -63938, -56701, -67354, -60527, -25774, -12306, -23749, -46430, -33093, -12407, 17057, 10848, 21673, 28149, 18247, -58, -13076, -31628, -30967, 7372, 30121, -9109, -33950, -25544, -6733, 1488, -7982, -19404, -29008, -7808, 10112, -11558, -18179, 837, 12265, 14389, 7691, 22559, 34442, 4219, -3045, 2044, -28314, -25382, -2422, -24568, -39975, -23369, -33374, -45395, -32520, -30091, -26297, -10513, 19417, 9836, -13926, 14561, 24553, 18118, -18274, -14944, 2278, -3635, -3306, 2854, -10842, -26094, -36281, -34877, -30362, -9171, -22690, -32249, -21717, -10483, -13809, -20979, -27984, -16617, -7341, -23217, -12256, 2906, -2346]
8843b346j0072M229m996M412J184r652N55L4737K1164j9242j2932q137L60M513
8829C777J6057k641J164J7610M138j7058K6805p386j2150l4082j386J2513J3174
8816B0535J6191J069j6492J0218r066j5840q664O740q8M5519k0838j6150R03j7819
8802c782r120j3601J3583J7389K2676m2018k2864J2297M4744r556R095K4688k079
8789D1452j9008n37J630o725j6647k358O419J814J1549J6963r802r611k3390j9083
8775b7334r668K3807N800J9641J7030P480j8207m0234j6756j2649j402J8506K0000
8762a3986N124j4486k3748L4045K3418q622q817j816k323j4107j6528k5146R050
8749e7942J907K1782L0123j4688j6353J4915J5670j3736r698M200p720k0107J272
$$ y = [-2346, -12418, -8189, -13185, -8773, -7589, -17241, -16686, 18051, 39215, 19973, 7041, -1096, -736, 3777, 19834, 17193, 18357, 35967, 40105, 23047, 49852, 42466, 30316, -3766, -5152, 7361, 20535, 36726, 37795, 21303, 31521, 22455, 6615, -2049, 4691, 4603, 50122, 29284, 13134, 14037, -3782, -12902, -26503, -12920, 4469, 27145, -14873, -37737, -25440, 19304, 9748, 18843, 43531, 41452, 22444, 21907, 23537, 16812, 165, -2193, 4226, 6040, 17589, 34552, 24750, 15139, -8251, -27334, -37002, -13195, -7395, 12246, 29276, 36756, 18549, -21685, -38441, -51090, -52492, -33986, -13986, -8862, -23348, -47096, -13051, 10367, 1745, -7072, -8888, -11211, -25318, -41846, -66992, -57942, -56035, -34253, -4130, -18818, -35171, -20256, -4586, -18322, -28020, -23820, -31540, -51647, -50375]
8736e0375J8051J612l8395k4894J5270q43L2411J1313J0617J5361J8628O526L12
8723A5594j8088q890q417k2144J1358L2284L2369M570l2752j0270j2296L115J9969
8710F402K0323R489j2161j5823j2715J633K2675L0921j4632k8116k5367j4431
8698c1802J7670K2671L6675j0775N706R574j9437j0508o621n747K695l807k534
8685C760P22k3259K775o614j9828K2372O238K2872J481l0812o713K9008J0991
8672A2993N016R38J765o011l5337j7583O254k131k3203o530L9328K2009j7804
8659b0296j1968K9795M7043j4368k1404o175l1170j7432O108K4739J0952K804
8647a372k5716R05J0732J005K839L7153J3648k6301l8258k9415L5442O188K919
$$ y = [-50375, -32324, -30712, -69107, -94001, -78731, -79574, -47163, -35850, -25233, -9872, 8756, 15282, 15594, -2494, -11384, -19801, -41945, -30587, 1697, 34066, 38636, 5884, -4386, -16682, -13567, 6402, 26725, 36214, 24053, 8230, -4485, -2852, 19823, 50744, 36112, 7996, -17371, -31802, -14132, 8539, 45214, 34439, 40145, 49719, 30282, 19774, 13153, 7406, 10101, 6294, 3760, 4482, -18777, -16002, -22616, -42444, -20072, -13834, 9038, 10519, -20293, -27006, 2002, 12993, 18009, 18947, 20712, 14701, -20636, -38219, -31965, -34096, -57299, -63829, -24501, -2492, -20296, -32264, -2469, 44574, 30206, 8802, 2627, -28543, -45975, -39867, -15128, -4176, -1372, -27088, -26183, -15451, -14446, -11607, 25546, 39194, 12893, -25365, -54780, -19338, -13150, -10231]
8634a0231N016J0691J7511j234J532J2158R825k5154J399m3713k9735K472K7852
8621b1611K5428j8977J2083M804O793L430J0752R421j1081r287j0171p803K4837
8608A8618N010M788L5157j2793k1853R700L138n057K607P351O315M062J452j8007
8594D0488l616K2240N365M220J9780q361P881M9434R116J8417J8601j5244l5771
8581A32550J0388j4361k5501p912n016K850Q079l5666m560J2824J5790k2498k0652
8568D6315j0272r616j1563P553p148p660R734j043K780J93K1845R841r757k413
8554C8789N771n322l6756R537L9146P72k1751Q020l378M8j7626K202J650p786
8540A3316j1316k4431l0405o206J2096L1758K0157J1594N037N079L574j0281Q869
$$ y = [-10231, -5215, 5476, 22987, 21753, 23285, 35443, 45268, 20114, 21513, -22200, -51935, -49463, -21611, 3817, -15160, -3077, 1727, 8520, 11950, 22702, 32123, 21042, 11755, 1584, -6219, 18618, 23628, 28416, 63573, 50780, 28927, 38627, 41765, 36708, 39315, 46666, 52981, 57043, 58495, 40488, 36872, 59112, 64477, 68697, 88477, 80116, 87997, 137431, 146547, 164964, 183565, 168321, 132550, 142938, 128577, 103076, 95164, 90148, 92998, 101077, 65411, 60851, 73675, 89465, 66967, 46315, 36043, 26427, 14864, 22417, 15269, 7609, 17343, 16300, 19080, 19273, 41118, 50959, 41202, 38789, 44560, 39238, 2482, 12019, 51165, 51937, 30186, 38206, 34828, 34876, 17250, 19452, 21102, 13316, 2000, -22431, -52836, -59042, -46946, -15188, 4969, 16563, 21600, 26679, 30253, 19972, 28841]
8527B8841j0860J9980M880J7820j2721k1727k3264m547J3567L4184j9975k0742
8515E436J9975M030j4472k7814P726M7455N330l9545m0950L7718M0296R767K0373
8502G5325j0448j9185j0424l0624j2133k0734k6783Q063M0402Q575j9157j1365
8490b8488K170M7919O170j9210p861j8272R570J8330K0508l028Q970p699j2870
8477A6209j3214j6417j4003L212K225k0434J2270L3028o136r895r128r204n565
8464c7052J5487J0077K7867Q043q774m544j580o110O158J3230K0176Q345k4667
8451B6656o554J1506k884j9541j3704L2784J1564R233K676J9991M756l0844k6968
8438A8671J6145N644q348k5009j8862J718K992j2434R878J4742k6225j3121J3083
$$ y = [28841, 17981, 37961, 42841, 60661, 47940, 26213, 2949, -1598, 11969, 46153, 26178, 5436, 25411, 29441, 14969, -12845, -5119, 42336, 47666, 8121, -32829, 4889, 45185, 54952, 75325, 64877, 45692, 35268, 4644, -7489, -28223, -55006, -46943, -6541, 2034, -17123, -28488, -26318, 21601, 27771, 8561, 700, -17572, -8002, 10328, 30836, 27808, 36778, 29079, 16209, 2995, -13422, -27425, -24213, -21988, -42422, -30152, 2876, -3260, -13155, -22283, -31487, -37052, -21565, -11488, 16379, 24422, 15648, 11104, 9524, 3414, 9572, 22802, 42978, 51323, 26656, 20102, 31608, 28724, 9183, -4521, 28263, 39827, 49060, 51736, 71727, 76483, 45639, 18671, 34816, 40460, 32112, 7103, -11759, -10041, -7049, -19483, -9605, 5137, -21088, -34209, -21126]
8425b1126J0639j5324J234n640j6342o130J2432J7127K5665L4274r674k5606K8069
8412B9598J0438j5042q129l5060N592L0646P584J2620O785j2578j8291l419j3663
8399b919j3393J6636R841k135j5496K666n009j3472L11l569j0334n786m337p421
8385e4417O797L0312j771j0057n882N010J8476j1574j3505K468J3725l519O812
8372a7125j5009J4128J3234j9299l0665o357q31J9590L4365L09k540P595P936
8359E331m36P122N628l4001j7922K3176j124k02R542L847K5171j111k9216P512
8345C317K0898L0111Q153k7912j8975L2825M237n791l612l5529l3608o357r827
8332d2070J9033J8400K206p772p765j416K3478J9500j092j041k9427k5594J8228
$$ y = [-21126, -10487, -25811, -24577, -30217, -46559, -52689, -40257, -23130, 2535, 36809, 27135, 1529, 29598, 40036, 24994, 16865, -18195, -12603, 18043, 25627, 38247, 45032, 32454, 14163, 10744, -2919, -16312, 324, 10165, 8030, -7466, -4800, -9809, -23281, -22970, -26539, -36873, -42659, -46996, -54417, -47620, -17308, -19079, -29136, -35018, -30008, -11532, -23106, -36611, -34143, -20418, -23937, -17125, -32134, -18006, -4772, -24071, -54736, -61093, -61924, -42334, -7969, -7660, -10200, -2605, 5331, 4895, 12017, 17645, -16356, -34278, -11102, -12226, -12428, -2886, 961, 26132, 25021, -4195, 3317, 24215, 54326, 62479, 34567, 15592, 48417, 52654, 46863, 43251, 7722, -25886, -32243, -42070, -23037, -4637, -2431, -10203, -17968, -19384, 4094, 23594, 22502, 21461, -7966, -33560, -15332]
8319a5332O4397L367j9092o113j5080l855k1711j189K6654J1063j5189j2949L644
8306a385K5834Q920K622j0552k8367n583R413l369q625K3323J5635j1874j9609
8293c617j9656K0868N4081k5881l1255j5671J1109J8710O978j8459j0337R712
8281c418J0057j0909l4779l371L7685J3875j0805j1297K1437J7290L828o267j7123
8268F203j9530k4597L6987J5979o556j0363O60j0536J4454o245P908J7713l3171
8255a1094l2906J4291K5757j2532r137P052L0977k0553k5296J1982J2336P971
8243a152j5745p241J0337N28j7159p952J2795J1079J8746j7140O793M329k8564
8230c0346o438j3299L4757K3211K1053K2447j8014k6803j957J4769K757j7829
$$ y = [-15332, 49065, 52432, 33340, 27227, 12147, 8292, -13419, -14608, 12046, 23109, 7920, -5029, -1385, 24449, 33369, 35991, 25439, -2928, -8511, 902, -2467, -11092, 12231, 27866, 15992, -3617, -23273, -2405, 51676, 25795, -5460, -21131, -10022, 8688, 15666, -2793, -13130, -3418, 6639, -4270, -39049, -42420, -4735, 9140, -1665, -12962, 8475, 25765, 29593, 23326, 6203, -13327, -37924, -937, 15042, 8486, -1877, -1217, -11753, 2701, -3544, 4364, 22077, -11094, -44000, -29709, -3952, -16484, -25621, -18569, 12408, -8145, -33441, -21459, -9123, -1152, -16897, -24138, -13801, -13273, -30432, -38384, -25589, -14510, 4236, -12904, -6111, -1782, -30346, -36784, -50083, -15326, 7885, 28938, 51385, 33371, 6568, 4611, 19380, 22137, 4308]
8218D308K6447o867k5611n925K2512Q82K105J0475K7372L635m2684J823k4129
8205e657l5535J7733K4824K537K050N494l1381k779k1078K0742J6925K6170J8316
8192C8361n014j6730K6476j407l0833Q742k586j8349k340M271J1516J429j4850
8179a314j5018k7274L506J6342P628K6400L8479q721m3440k1410M527l030J148
8166b2177R877K2393P971k0234L476q680k7058j2384n849m73J8075R886K0203
8153d974K1114J9766q528k537j1969l2679L547q702j1904k362J0831m708N059
8140b8046o970J6952L7710J0162j8997J2981N008l3775j419l7922r033J0299J8218
8127b4832o27J6348k4752q938J3864J3549L4507J6341j2672k5102m484J7098J841
$$ y = [4308, 30755, 23888, -1723, -7648, 14864, 15746, 17851, 28326, 55698, 59333, 16649, 18472, -5657, -41192, -23459, 1365, 3902, 5952, 11446, -19935, -22714, -43792, -23050, -6125, 20045, 38361, 33347, 16617, 43093, 41686, 10853, 19595, 17009, -1340, -3680, 591, 12107, 13536, -1314, -16332, -43606, -40100, -23758, -16130, 10270, 48749, 40028, -3412, -24822, -20295, -23325, -22177, -12300, 10093, 18064, -2170, 1306, -7374, -34432, -46816, -52665, -53138, -35063, -25177, -4974, 16140, 35906, 27378, 24841, 12872, -19807, -16260, -24962, -36866, -39228, -28397, -33105, -28046, -35016, -18064, 19646, 29808, 10811, 23792, 28800, -4975, -6394, -44316, -53349, -43050, -24832, -25459, -9111, -33863, -42801, -28937, -15388, 19119, 35460, 22788, -2314, -6798, 10300, 12141]
8114A2141k841l726r671L109J3252l567J6637J707J626Q5N996J8888k8224l1306
8100e894m027k446k2914O903m90j3940K7204J0566R741l1473L272J2278L7820
8087B6600J0660k453l825J7965o058k9436l4127m751J1629K9342J2448r105j725
8074A7164J0099o697q922j5086j4359J8154K302J580r563l736q977Q88J3458o950
8060a0645j7847M622L519K1906j0168O55J6184J8176k1600k3957P638J2035k081
8047a563k757k5690O056K622K3670J0517r840k1790J9766J5421k1829j1484K1688
8034D787J0881K650K764j3968k588j3445J4912J0591J9204k60j5341J6579k952
8021C3814j1889n884q326q556J7886j156l946p034j3897J0132R536L857k1154
$$ y = [12141, 9300, 5574, -4097, -988, 12264, 8697, 25334, 27041, 28667, 28752, 34748, 53636, 25412, -5894, -9921, -12367, -35281, -28378, -28868, -42808, -15604, -5038, 4703, -26770, -23498, -11220, 26600, 37260, 34807, 30982, 48947, 42889, 13453, -20674, -25425, -13796, 15546, 27994, 18889, 17164, 27263, 20566, 11644, -3442, -17801, 353, 2655, 4235, -5328, -9064, -18041, -17153, -3695, -10645, -28492, -23870, -20351, 1555, -8613, -7958, 8226, 26402, 4802, -19155, -11517, 518, -1563, -4320, -30010, -23954, -21332, 2338, 12855, 3015, -18775, 991, 16412, -5417, -16901, 4787, 15668, 18318, 21082, 7114, 4526, -8919, 5993, 16584, 35788, 35528, 20187, 36766, 33814, 21925, 16041, 7715, -841, 17045, 15889, 11943, 4909, -8988, 1144, 10680, 14537, -6617]
8008f617j8549K1056j243j4633p86K4900J0078J6939k330j1584o140k459K4307
7995C2939J4l740j2656j9064KJ4500Q663L051N01L042o692J505J694m974j3739
7980E046j6866K8910K8625o747p592M782Q422l227k6709j5448J9362K9757J0125
7967E8440k9183l328N862J0728M335L255j3639k0049j5949k3277k921J4331J8461
7954G066K5893P889K170j5824M853k1415k3470j98K8128J1784j711O734J5938
7941D7837J1740k0131j9391j1493k0739J60K1328J5142k9405l439N05m849P148
7928e587k786j3651K9828K0918j562j2822j2171p140Q108J2756j993o071j937
7915E890m782j562k8068j998n543m365K7715K826J1432J9270J0980j8872j3205
$$ y = [-6617, -25166, -4110, -5353, -19986, -20772, 4128, 14206, 31145, 28815, 17231, 11091, 8632, 32939, 32953, 29213, 16557, -2507, -2505, 11995, 20658, 23709, 24210, 27252, 20560, 22065, 23759, 18785, 5046, -11820, 17090, 45715, 38968, 31376, 36158, 44580, 41353, 14644, -804, 18558, 48315, 58440, 29257, 25929, 31791, 42519, 46854, 50109, 36470, 16421, 472, -22805, -25726, -11395, 7066, 32959, 40848, 43018, 27194, 32047, 10632, -12838, -13036, 15092, 26876, 25165, 31899, 47837, 59577, 39446, 20055, 8562, -12177, -12017, 9311, 24453, -4952, -8391, -7886, -12735, -5587, -8373, -22024, 7804, 28722, 27160, 14338, 2167, -4973, 3135, 15891, 13898, 7827, 5890, 1108, -454, -28522, -30520, -36063, -40428, -12713, -9887, 1545, 20815, 31795, 12923, -282]
7902b82l938L3926J013k9261j1965j1496K5313J045k23j1225J551J8405J2501
7889B5364j445O694J181L968M065o071k641P459N011m0993j7506J1881N124J3267
7875A5358k530k4289k0080p933J5708M938n038L490J823J8012J7679o969l4701
7862b4532N569l5789j3949M9J8310K5156J8411K7287k367k5147p209P97J9218
7849E804l123N60K2022r693j6595R998K0982l0909k2246q876R63L8120J8726l55
7835B5378j4892o230J3975l027M842P192j0295p382M554O789k2265j3699j7202
7822c2262J3969L239j3456R221R719P00q569J0400K5276J9977O617p205l1711
7809E915j2593j0216l0466J7074M5497K6617J138j7898k8824N538J2234j9096
$$ y = [-282, -4220, 29706, 30719, 1458, -10507, -22003, 3310, 4355, 4132, -7093, -5542, 12863, 25364, 23919, 30613, 31794, 35762, 39827, 33756, 31115, 38574, 43585, 2592, -14914, -3033, 2091, 15358, 12828, -11461, -31541, -39474, -23766, -18828, -23866, -20376, -18553, -541, 17138, 10169, -24532, -18963, -54752, -68701, -68652, -50342, -25186, -6775, 20512, 18145, -7002, -14211, -13414, 5804, 2681, 3241, 25263, 15570, -1025, 8973, 29955, -954, -23200, -32076, -31113, 7007, 25733, 25378, 10486, 4256, 18231, 15204, 20046, 27238, 16943, 9561, 14115, 20904, -1361, -15060, -32262, -18293, -15054, -28510, -19289, -9570, -8870, -17439, -7039, 18237, 38214, 44831, 37626, 5915, -6678, -16894, -47360, -30286, 15211, 41828, 42966, 25068, -3756, 1782, 14016, -5080]
7797e080n438J2376M574k0169j8792L1467k389k3236L10L008K7381K9984L642
7784C7638P251j3224m4857j3929J2678L1908n243l0579Q351K2580R379p245Q562
7771B3270J791R90k1483j4957P524k070k1820J2958N220K1671q12j4950M146j491
7757a3k1601K3229R686l0776j3021N003J3106k12r228J9318L1864Q991n902q60
7743B9584j1545j5042j163j2180k1519J0512J9637N523j4000q276o043r873K3404
7730a0981K8513k1575k5498J2465J6500J3747k3597j6581J0616K6748J3387M250
7718B7994k3756j0983k7599K533M293n78k693N938K9164r979j1082N066k6830
7705c8512n954J3828J7486o749p635J775K2917k8300r962o852K1936Q538j2312
$$ y = [-5080, -10518, 1858, 6432, -13737, -32529, -1062, -3451, -26687, -26377, -23369, 4012, 33996, 37638, 44889, 31665, -13192, -27121, -14443, 17465, 12222, -18357, -10006, 12574, 21953, 14708, 23270, 25061, 26051, 4568, -10389, -2865, -4935, -26755, -13797, -8577, 13094, 12282, -2668, 1478, -13, -21614, 1615, 11301, -19475, -32496, -27493, -14387, -14599, -23827, -4509, 27355, 36346, 30444, 29584, 18039, 2997, 1834, -10346, -31865, -21353, -1716, 3807, -10193, -18469, -24512, -34385, -10981, 17532, -4043, -29541, -17076, -576, 13171, -10426, -27007, -16391, 10357, 23744, 27994, 4238, -6745, -34344, -31811, -27518, -28096, -30789, -24851, 4313, -5666, -16748, -11682, -38512, -44466, -30638, -13152, -19901, -27536, -25761, -2844, -31144, -41106, -47958, -26022, -17484, -29796]
7692b9796l14q84P617K3701o598k229j582j8225R089J9440J7522M169k0924k3944
7678b2958J4350J6340l729n244o232j9081q283K5803J4851n226j160k44J8373
7665A7560k2466q484L307M8235K7649k6014p938q897j9985J847K139J0973l8232
7652b0306J9881L797j8173k8913p7J708O306o306n381K1914j1204r292m475K0874
7638b9647J4817L055L0951M613k0294j7182j2252k965P768P481P753Q457N964
7625H519N707R929r350P84K662l5076m2489Q177J6992P929p724m905l1644J7868
7611e2621M4334J5294l806J1543J4405q123j5937j4685Q45M1475J9392J7254j0469
7598E8901m1870l7792J8698o173p309K8503K6814J784m575l5671k6782q190j2515
$$ y = [-29796, -30110, -30994, -23377, 324, -6274, -8503, -10085, -28310, -19221, 219, 17741, 21910, 986, -22958, -8608, 7732, 4003, -1241, -7473, -26554, -34837, -9034, 5817, 591, -569, -813, 17560, -4906, -13390, -10083, 38152, 65801, 39787, 31849, 22952, 2967, 4814, 6953, 17926, -20306, -425, 3372, -14801, -43714, -43791, -42083, -35777, -42083, -47464, -25550, -36754, -46046, -50521, -29647, -14830, -11775, 19176, 23789, 3495, -13687, -25939, -28904, -21136, -13655, -5902, 2555, 8519, 14226, 24155, 14805, 15589, 18251, -16825, -59314, -51137, -34145, -26216, -33940, -38845, -70489, -52621, -8287, 7007, 3201, 14744, 29149, 21026, 5089, -9596, -8751, 32724, 52116, 69370, 58901, 17031, -20761, -2063, -8236, -15545, 12958, 39772, 41556, 36981, 1310, -25472, -33662, -46177]
7585d6177j1143N286R162m655P195Q868K9828o452j313K2213m322O478l378o698
7571D892L7540K4843O149j3294k0595m0165j3251j8345j5566R193M2088L6335
7559C9824j0553p22j0465J6213j7067k8874j9697J4052q05n200p359o626J6605
7546b0674M421j273J0611N521L033k2512p810K7924k5258J3543L0196j0542j5483
7533h303m568N008O263Q951j0736p42J1198J998N496J0561M529j5794j2191l320
7519a650K237j6444o533J1477J1873J2444L202J3756J9281j0570j2522N30J9027
7506D6108o222p122j9246O313j0542k4872j5195J9260J3091k5606n356o559P277
7493b8671R846L3255J4444n029N140k7197k1235l523J8131N485l837q941N47R703
$$ y = [-46177, -57320, -52034, -42872, -47527, -40332, -31464, -1636, -8088, -9401, 12812, 8490, 14968, 11590, 4892, 42432, 67275, 73424, 60130, 39535, -630, -13881, -32226, -47792, -38599, 3489, 39824, 29271, 28549, 18084, 34297, 17230, -11644, -31341, -17289, -18094, -23294, -30653, -37279, -20674, -16253, -17526, -6915, -1394, 1639, -20873, -28683, -759, -26017, -12474, 17722, 7180, -8303, -12871, -7863, -1600, 7351, -3385, -4127, 7071, 9069, 14565, 25126, 29655, 13861, 1670, -1650, 587, -15857, -22390, -10913, 960, 13404, 16606, 30362, 49643, 39073, 26551, 27081, 46108, 39886, 32764, 13518, 19831, 9289, -15583, -30778, -11518, 1573, -24033, -29389, -35948, -28671, -18825, 14430, 28874, 23845, 28985, 1788, -19447, -22970, -4839, 646, -3191, -12132, -11585, -1882]
7479a882m592j2473j2731J688r81K8592j3040j3602j8840K3167J8286k451j534
7466a0393k07J9053N760K9313n702k5428m7850o729J9279J6203J0674j2278j6761
7453b5066j9618j9720N772K2246K3939L885l587l844k905l326P544k3482r164
7440d7326K5711L9480j715j5152L0346m375L25j1899j1439J1002m024J1471j9758
7427B647j6664q795k758j0958J9165P401j5845j312J5809J8711m344j6200L8595
7414B5452L7598o702m1944r280P319j4785l0086j6661oL1400J8083J9909j6338
7401C959K1667m563l9707j0550L447J2349q030L453K5565J3565j85k1769L884
7388C085J5160L1794k6422k8785R876L757j3542l585q972L2548J7175r454k2883
$$ y = [-1882, -6474, -18947, -31678, -29990, -30971, -2379, -15419, -29021, -47861, -24694, -6408, -8859, -10393, -10600, 8453, 14213, 43526, 37824, 12396, -35454, -42183, -22904, -6701, 3973, -8305, -25066, -44684, -64404, -58632, -36386, -12447, -8562, -12149, -15993, -18898, -22224, -14680, -38162, -47326, -21615, 17865, 16150, 998, 31344, 26969, 27294, 15395, 3956, 14958, 10934, 22405, 2647, -14017, -22812, -25570, -36528, -17363, -9962, -25807, -27119, -11310, 7401, 3057, -13143, 25452, 63050, 56348, 14404, 5124, 12443, -2342, -32428, -49089, -49095, -17695, 388, 20297, 3959, 25626, 21063, -18644, -29194, -25747, -13398, -21428, -17975, 7590, 21155, 20970, -799, 3085, 18245, 50039, 23617, -5168, 4708, 8465, -5077, -8662, -17634, 14914, 32089, 22635, -248]
7375b48k8411l670J4180J7381k456k1239j5540K8331L9695J5179k4878r539j6336
7362g551k3046k6319j702K5970L9067O41M940r301o541Q583K709J3719j9687j545
7348f3K6750K750j9465j2358r449k358K0279q668J809Q951n113j9059n452o274
7334b7720J0805m241O683N06J3808j6732r953p935r098r894J533J318j1622O262
7320e6280L5280q989J797r723J6409M724N208j15k5393j0333J7817K9172L2131
7307C1705K614k7326J532J9852K8047j1570j6247j0093L998q859j6127J0158K024
7294I708q620p753j9727J2163J2835k680p37j931K5732N253j8403j7715K022K173
7280g680O791K8R469K7168K538k2729m134k6330j765L3048J9788O002N801k1360
$$ y = [-248, -28659, -32329, -18149, -768, -3224, -24463, -40003, -11672, 28023, 43202, 18324, 8785, -7551, -30597, -56916, -58618, -32648, 6419, 7060, 12000, 2699, -3842, 4741, 7450, 21169, 1482, -63, 26687, 29437, 9972, -2386, -11835, -14193, 6086, -2582, -773, 8178, 3065, -15994, -21446, -27720, -16915, -21156, -14473, -13967, -159, -16891, -26844, -34779, -43877, -53771, -52238, -50920, -62542, -56280, -21000, -29989, -28192, -37915, -21506, -16782, -11574, -11689, -37082, -47415, -29598, -426, 31705, 34319, 6993, 8525, 28377, 56424, 44854, 28607, 18514, 22512, 13653, -2474, 7684, 9708, 1088, -6665, -26392, -14229, -1394, -4074, -4811, -6742, 18990, 24243, 5840, -11875, -9853, -7680, -889, -861, 8608, 35776, 38314, 15585, 11451, -14879, -16644, 16404, 36192, 42194, 47995, 26635]
7266B6635j0455j0838O030K5580L3063j8373o6179m609J7678J5543o629R331l740
7253A3037j8417N925K0777k362K6005K4007J0181q822n6981m7818J2633J6945
7241d890J0023m112m5360j1642J8650K0626J8174k2475L308K0298j1563o678J1523
7228d118J192j9850J7579Q917l490j3641K5226r344M198P80r265r980j1857j6691
7214d0344m0660K3831L1210K8691j4798k759L842j2243k0752n260R670K2903o589
7201b3258R040p88K4797J2294k9052j0653J0204n67J3755K0594n629R68J4j2626
7187I093J84m4613J1485L3316K83m337k970J4893k1827j1517j48L719M828j6910
7173b4521J431m738k1980q566J9164K631k3640J3844L2918J5669q608J5556J2292
$$ y = [26635, 16180, 5342, 11372, 36952, 70015, 51642, -14537, -19146, -1468, 14075, 7446, 16777, 13037, -5380, 545, 21322, 18960, 44965, 68972, 79153, 70331, 13350, -34468, -21835, -4890, 5133, 1021, -44339, -55981, -37331, -16705, 1469, -21006, -17698, 2600, -8963, -15641, -4118, -2926, -22776, -5197, 3720, 230, -13411, 11815, 2471, 6669, 7449, -1816, -11796, -23653, -40344, -81004, -57173, -25963, 2728, -12070, -14829, -10987, -23230, -43982, -49242, -39572, -16669, -23258, -14218, -15006, 9791, 22085, -6967, -17620, -7416, -7983, 5772, 26366, 20737, 21705, 21719, 9093, 9277, -35336, -23851, 9465, 9748, 5411, 2441, 17334, -4493, -16010, -16158, -12439, -7611, -24521, -23090, -27828, -49808, -58374, -39210, -36579, -60219, -46375, -13457, 2212, -6396, 9160, 21452]
7160B1452k4324k6318q487K0580L1224P009j0678k6507l1002K5183N641j2754
7148b8981J0589J2883j0339j2077K235R034K5752P693j2410k5735q972J9200j0304
7135b1432j3854J7046K1431K7446R385J3427j0259j5889q276j4717j6387m557
7123a6636j7991M533R886K073J3329O143k4750Q61K209J8580L592l2796j5677
7110d6644K3885J2692J6441j5226j2709j7308m727m491m762R376l644J3837r797
7097d3077m062K1358M1516j6137N344j6189m086O143L9197j3919k2857k3248k9097
7084e9114j4382K0603J8794J0023q424l516M416L6765R291l3609k0743N862K1769
7071a2265J7679m8179l195J4103n494J3654K7798j0670M265O571r076j8649J1622
$$ y = [21452, -2872, -29190, -37677, -17097, 14127, 21136, 10458, -16049, -47051, -21868, -16227, -28981, -18392, -5509, -15848, -27925, -25690, -16656, 9096, 16789, 4379, -21356, -30328, -11128, -21432, -35286, -18240, 3191, 30637, 40022, 53449, 43190, 27301, 19025, 4308, -12079, -16636, -34627, -30094, -20208, -18135, -4806, 1337, -23413, -22552, -20343, -1763, 1829, -30967, -46644, -22759, -10067, 6374, -8852, -21561, -38869, -43596, -48087, -52849, -43473, -47117, -33280, -43077, -47139, -25781, 15735, -402, 4942, -11247, -15333, -9190, 30007, 16088, -6769, -30017, -59114, -73496, -52893, -34099, -24076, -32500, -36016, -31600, 5165, 14456, -19153, -39896, -34034, -12265, 5414, -42765, -45960, -31857, -37351, -23697, 4101, -6569, -2304, 4267, -4809, -23458, -11836]
7058a1836K5473M538m4451q914m92J6510K4703J3415L47j5959J589p202j7467
7045a9746J5549J2520m233k3205k660j2085L334J3545M360N11M80K0643r145j5285
7031a5417J225k4132j146M084J9552q031m380q097J4492L9821K090o706J0637
7018B3992p17N283J8506m670k0633l2147q884P144q795l7476O927J1258j7504
7005e7716R135J3583J4484o819J5025J3704O292Q167l4046j1480K3246K712k088
6992e801L4802K9853k1948k9192o709r488L089l110O760J028q897l69k0467N330
6978b5119J3654Q420O954p778r62j080m925M724L980K097j6323j6940j1307K2125
6964b2480R366L509Q157j033k9702J6426M1681R662m513Q885j4977k4065q840
$$ y = [-11836, 13637, 18175, -26276, -35190, -35682, -19172, 5531, 18946, 19293, 3334, 4923, -2279, -19746, -4197, 8323, 4090, -19115, -21775, -33860, -30526, -16981, -12621, -12110, -11630, 9013, -132, -15417, -14192, -38324, -39470, -35386, -15834, -23865, -28245, -36342, -21850, 17971, 20061, 13355, 23992, 23275, 28558, 47064, 42394, 21761, -10386, -19270, -12126, -20921, -58397, -51470, -40212, -57716, -48581, -34998, -20514, -27333, -12308, 1396, 7688, 15855, -18191, -29671, -6425, -3713, -5801, 29001, 58854, 36906, 7714, 1005, -8483, -5394, -8504, -1744, -716, -9613, -9982, -30449, -25119, -11465, -3045, 3909, -3869, -4831, -5911, -10836, -6112, -2132, -35, -16358, -33298, -44605, -22480, -13114, -9605, -1448, -2481, -32183, -15757, 25924, 35586, 31073, 39958, 24981, 916, -7924]
6951g924J0564n0057j4074K4825K3577q432m934K741o307J1021r950j14j1657
6938d0721O053m087l069j225L5313M9229j1430k9150N335j7623l1069J0085J0704
6925b1655j1824L738M134N884q292k7518J3924K6936N983J1562J063N468K5424
6912C4827j1706k1527L421j0871j6361J4197J0685j9174J6282q167J9668J7637
6900B8911j2686l0698O085O994j85O957K3254n076j7167j4987j4333P8L0335O490
6886A3972j7190K39R067K115P182K6837m07n520o443l0508j7303n811J5271l393
6872a1892q689J3919j360P409M454j2588J6934J0539k6043l097Q057M109k2506
6859b0754q191j168J4687k827k795O411N525L3729R695j1967p660K316j3162k9688
$$ y = [-7924, 2640, -47417, -61491, -36666, -13089, -21521, -26455, -23714, -30021, -19000, -28950, -29064, -40721, -34668, -38755, -41824, -43049, -7736, 41493, 30063, 913, 6248, -11375, -42444, -32359, -21655, -33479, -29741, -25607, -19723, -28015, -55533, -41609, -14673, -8690, 2872, 3935, 9403, 34827, 23121, 1594, 5015, -5856, -22217, -8020, 2665, -16509, -227, -8394, 11274, 28911, 16225, -14473, -8388, -1394, -1579, 5378, 28632, 23556, 6389, -8598, -22931, -22853, 7482, 13972, -3218, -2979, 6088, 8203, 15385, 42222, 41815, 36295, 29852, -656, -17959, -23770, -8499, -11892, -20581, -6662, -8022, -613, 3841, -8747, 8187, 18726, -7317, -10414, -2357, 1752, -20754, -28945, -30113, -15426, -18253, -21048, -14637, -9112, 24617, 34312, 22345, 14685, 17001, 3839, -25849]
6845b5849o805L2201Q996K922m809k1714j8158Q635J8326Q524J431R814J1887
6832B5401k70n190n439K6787n554l8490m2694p370j459j9157P991K7630J8867
6819a8947J4218j8049J4233j243J1633j3327J9096p113k382K094L822j152P373
6806A0256j4179q967J0876j580j0127l339k8809r621K1087k735j852J0370K4100
6793d520J6147K8112n591K290l538J656j3807l8390N325J199Q313J4800r959o588
6779d551J5385j8537k5505j497J2207L0193K3666j6181j7502J478L2453j8634
6767A2975m0386j7208K3984K2954J0858l298J1014N206J0622k5025k3681J3733
6755A748K3177j3342k3463M357P380J1418J365j3156k3196P362K565J343K7122
$$ y = [-25849, -32654, -453, 8543, 11465, 6656, -15058, -33216, -24581, -6255, 2269, 3700, 13514, 25401, 25131, 19941, 14502, 41289, 35735, -2755, -45449, -52819, -54278, -73435, -65444, -37814, -18947, -4729, -22778, -8545, -9788, 1845, -11482, 7614, 501, -1881, 213, 4035, 2883, 10256, -3923, -12890, -2014, -3594, -13721, -17060, -45869, -55490, -34403, -37138, -38990, -28620, -4520, 11627, 39739, 34148, 36438, 32900, 34556, 20749, -17641, -12316, -11117, -2804, 11996, 2037, -4551, 10834, -7703, -33208, -34705, -22498, 7695, 31361, 15180, -2322, -844, 31609, 12975, -27411, -44619, -20635, 2319, 13177, 9879, 20893, 26099, 36721, 11696, -11985, 1748, 24925, 11583, -11880, -7523, -143, 11275, 12640, -516, -23712, -16350, -13785, -12442, 14680]
6742A4680K6169k267k2124p435K1526k5l49l2496L847L4044k794p281j2730l890
6728H875q55j2312j3700J1568K6910M191J3329N203L613n444j6442K284k655m498
6714B0067N315N745j8773j4242j0114k951j6l765M196M0377J8576Q757q330q740
6700C6102k0962k4491n668q716k7703J6393J6821N351k0705J1895L014o889m23
6687b5981K3656k833P301J7158Q939N103J4360j4849l1916k838p880J0392n851
6674e239L461J6011L5675l2505j1376n25r748k6265M842P989M303m621K0702k0768
6660a8064o5o651Q963P611j4197k2607k0856J7344K6798M258J388j9932l511K898
6646c6623K1077J6898J970j3866m006J6418K075q690R36j6433p084O747P46j282
$$ y = [14680, 40849, 38582, 16458, 9023, 30549, 30524, 30175, -2321, 1526, 35570, 32776, 25495, 12765, 8875, 8020, -4292, -17992, -6424, 20486, 24677, 38006, 43209, 46822, 41378, 24936, 27220, 24565, 20067, 25382, 31127, 12354, -1888, -12002, -14953, -14969, -18734, -14538, 25839, 44415, 53172, 44842, 36102, 15140, -9351, -15019, -23735, -51438, -35045, -18224, -12873, -33578, -21683, -18669, -25558, -25981, -2325, -5158, 2143, 19301, 28240, 33343, 47703, 32854, 938, -1900, -9780, 612, -5239, -1778, 14233, 49908, 17403, 6027, 5502, -4246, -30511, -25669, -17680, -13377, -17998, 2704, -18064, -18129, -24780, -15817, -8206, -22403, -45010, -65866, -48522, -21724, -17466, -16078, -36010, -39521, -36623, -15546, 1352, 3322, -10544, -14550, 1868, 3943, -4747, -3811, -20244, -27328, -20581, -19835, -21117]
6632b1117L334r767o724n21J7813J5028o808L558J1650O932J5472q146j2786k442
6618E476J9569J8048j0681j4017q837k2251j3551p331K5885J4316J6592r90j2265
6605I963K394q130L12k892j7577K0383O395o546R64l7862p491J9634O043K6154
6591A1744J0603Q902k8806K996K86j5445j0437j1257K4085L167n591l024j0420
6578b3197J647K1978J7520k525k9714K152n884k5535m5705J8452O8760L0377j7099
6565A1227k8298j9353J1550J663J4477L654k3389o725L0042J9930q381k35J158
6552G320j3310j2155Q546R220q933o511J9210P683l220R373L6803j4063p194j9178
6538A3591k4341j4391j8438m870K9362p668K588n75K3224N135Q224q075k0418
$$ y = [-21117, -17783, -27550, -34274, -34795, -16982, -1954, -8762, -5204, 6446, 13378, 28850, 20704, 7918, 5476, 25045, 43093, 32412, 18395, 9558, -12693, -26244, -33575, -7690, 6626, 23218, 22228, 9963, 12357, 4227, 4539, 1647, -15930, 4453, 10848, 4302, 5266, -32596, -40087, -20453, -14410, 11744, 22347, 31249, 2443, 5439, 5725, -9720, -20157, -31414, -7329, -4162, -9753, -12777, -23197, -21550, 428, 17948, 15423, -14291, -12139, -18023, -43558, -89263, -70811, -2051, 28326, 11227, -17071, -36424, -24874, -23211, -8734, -5080, -28469, -35194, -5152, 14778, 6397, 6162, 7320, -5990, -18145, -9599, -379, -9312, -15823, 3387, 11070, 7850, 17223, 54026, 39963, 32769, 13591, -10750, -25141, -43579, -48449, -19087, -26755, -24167, -24742, -1518, 3617, 11841, 3766, -16652]
$$ [...]
##END NTUPLES=NMR SPECTRUM
##END=
