##TITLE=Analysis number 329092
Compound Code sb 00697
Book Reference a 123293
Project Code adrs
Chemist Name stores
##JCAMPDX= 6.0         $$ Bruker NMR JCAMP-DX V2.0
##DATA TYPE= NMR SPECTRUM
##DATA CLASS= NTUPLES
##ORIGIN= Bruker BioSpin GmbH
##OWNER= nmr
$$ XWIN-NMR		Version 3.5
$$ Wed Aug  1 09:29:32 2007 GMT Daylight Time (UT+1h)  MAYBRIDGE\nmr@NMR_250MHZ
##.OBSERVE FREQUENCY= 250.131544655141
##.OBSERVE NUCLEUS= ^1H
##.ACQUISITION MODE= SIMULTANEOUS (DQD)
##.ACQUISITION SCHEME= undefined
##.AVERAGES= 16
##.DIGITISER RES= 18
##SPECTROMETER/DATA SYSTEM= dpx250
##.PULSE SEQUENCE= zg30
##.SOLVENT NAME= CDCl3
##.SHIFT REFERENCE= (INTERNAL, CDCl3, 0, 16.522)
##AUDIT TRAIL= $$ (NUMBER, WHEN, WHO, WHERE, WHAT)
$$ ##TITLE= Audit trail, XWIN-NMR		Version 3.5
$$ ##JCAMPDX= 5.01
$$ ##ORIGIN= Bruker BioSpin GmbH
$$ ##OWNER= nmr
$$ C:\u/data/dgb/nmr/ADRS/10/pdata/1/auditp.txt
$$ ##AUDIT TRAIL=  $$ (NUMBER, WHEN, WHO, WHERE, WHAT)
(   1,<2007-08-01 09:29:09.08 +100>,<MAYBRIDGE\nmr>,<NMR_250MHZ>,
      <created by zg, POWCHK disabled, PULCHK disabled
       configuration hash MD5:
       76 6E 9A 78 1E 09 19 81 EC 84 63 8F B0 6A 59 2D
       data hash MD5: 64K
       32 57 72 AB 7C 98 FE B1 7D AC 83 F5 65 4E 63 95>)
(   2,<2007-08-01 09:29:22.68 +100>,<MAYBRIDGE\nmr>,<NMR_250MHZ>,
      <Start of raw data processing
       ef LB = 0.3 FT_mod = 6 PKNL = 1 SI = 32K 
       data hash MD5: 32K
       8A 98 D6 19 F5 22 89 D8 B8 D8 6B D4 4A 88 21 EA>)
(   3,<2007-08-01 09:29:24.46 +100>,<MAYBRIDGE\nmr>,<NMR_250MHZ>,
      <apk 
       data hash MD5: 32K
       28 3F E5 84 61 02 3A 3F 6E 85 C1 BE 3B 3F 2A 6E>)
(   4,<2007-08-01 09:29:25.19 +100>,<MAYBRIDGE\nmr>,<NMR_250MHZ>,
      <abs ABSG = 5 
       data hash MD5: 32K
       61 66 FE EC 81 A1 55 BD 01 39 8F DF 20 52 12 00>)
$$ ##END=
$$ 
$$ hash MD5
$$ A1 71 42 BA C9 7C D8 AF B7 45 B3 A1 52 AA CC 2C
##$RELAX= 
##$RELAX= 
##$RELAX= 
##$RELAX= 
##$RELAX= 
##$RELAX= 
##$RELAX= 
$$ Bruker specific parameters
$$ --------------------------
##$DU= <C:\u>
##$EXPNO= 10
##$NAME= <ADRS>
##$PROCNO= 1
##$TYPE= <nmr>
##$USER= <dgb>
##$AMP= (0..31)
100 100 100 100 100 100 100 100 100 100 100 100 100 100 100 100 100 100 
100 100 100 100 100 100 100 100 100 100 100 100 100 100 
##$AQSEQ= 0
##$AQ_mod= 3
##$AUNM= <au_zg>
##$AUTOPOS= <3 >
##$BF1= 250.13
##$BF2= 250.13
##$BF3= 250.13
##$BF4= 250.13
##$BF5= 500.13
##$BF6= 500.13
##$BF7= 500.13
##$BF8= 500.13
##$BYTORDA= 1
##$CFDGTYP= 0
##$CFRGTYP= 5
##$CHEMSTR= <none>
##$CNST= (0..31)
1 1 145 1 1 1 1 1 1 1 1 1 1 1 1 1 1 1 1 1 1 1 1 1 1 1 1 1 1 1 1 1 
##$CPDPRG= <>
##$CPDPRG1= <>
##$CPDPRG2= <>
##$CPDPRG3= <>
##$CPDPRG4= <mlev>
##$CPDPRG5= <mlev>
##$CPDPRG6= <mlev>
##$CPDPRG7= <mlev>
##$CPDPRG8= <mlev>
##$CPDPRGB= <>
##$CPDPRGT= <>
##$D= (0..31)
0 1 0 0 0 0 0 0 0 0.06 0 0 0 0 0 0 0.0002 0 0 0 0 0 0 0 0 0 0 0 0 0 0 
0 
##$DATE= 1185956947
##$DBL= (0..7)
120 120 120 120 120 120 120 120 
##$DBP= (0..7)
150 150 150 150 150 150 150 150 
##$DBP07= 0
##$DBPNAM0= <>
##$DBPNAM1= <>
$$ [...]
##$SUBNAM7= <"">
##$SUBNAM8= <"">
##$SUBNAM9= <"">
##$SW= 20.6930455092707
##$SWIBOX= (0..15)
0 0 3 0 0 0 0 0 0 0 0 0 0 0 0 0 
##$SW_h= 5175.983436853
##$TD= 65536
##$TD0= 1
##$TE= 296.16
##$TE2= 300
##$TE3= 300
##$TEG= 300
##$TL= (0..7)
0 120 120 120 120 120 120 120 
##$TP= (0..7)
150 150 150 150 150 150 150 150 
##$TP07= 0
##$TPNAME0= <>
##$TPNAME1= <>
##$TPNAME2= <>
##$TPNAME3= <>
##$TPNAME4= <>
##$TPNAME5= <>
##$TPNAME6= <>
##$TPNAME7= <>
##$TPOAL= (0..7)
0.5 0.5 0.5 0.5 0.5 0.5 0.5 0.5 
##$TPOFFS= (0..7)
0 0 0 0 0 0 0 0 
##$TUNHIN= 0
##$TUNHOUT= 0
##$TUNXOUT= 0
##$USERA1= <user>
##$USERA2= <user>
##$USERA3= <user>
##$USERA4= <user>
##$USERA5= <user>
##$V9= 5
##$VALIST= <valist>
##$VCLIST= <CCCCCCCCCCCCCCC>
##$VD= 0
##$VDLIST= <DDDDDDDDDDDDDDD>
##$VPLIST= <PPPPPPPPPPPPPPP>
##$VTLIST= <TTTTTTTTTTTTTTT>
##$WBST= 1024
##$WBSW= 4
##$XGAIN= (0..3)
0 0 0 0 
##$XL= 0
##$YL= 0
##$YMAX_a= 376435
##$YMIN_a= -413216
##$ZGOPTNS= <>
##$ZL1= 120
##$ZL2= 120
##$ZL3= 120
##$ZL4= 120
##$ABSF1= 16.522
##$ABSF2= -4.171173
##$ABSG= 5
##$ABSL= 3
##$ALPHA= 0
##$AQORDER= 0
##$ASSFAC= 0
##$ASSFACI= 0
##$ASSFACX= 0
##$ASSWID= 0
##$AUNMP= <proc_1d>
##$AZFE= 0.1
##$AZFW= 0.1
##$BCFW= 0
##$BC_mod= 0
##$BYTORDP= 0
##$COROFFS= 0
##$CY= 12.5
##$DATMOD= 1
##$DC= 0
##$DFILT= <>
##$DTYPP= 0
##$F1P= 14.0000005364418
##$F2P= -0.99999901652339
##$FCOR= 0.5
##$FTSIZE= 32768
##$FT_mod= 6
##$GAMMA= 0
##$GB= 0
##$INTBC= 1
##$INTSCL= 1
##$ISEN= 128
##$LB= 0.3
##$LEV0= 0
##$LPBIN= 0
##$MAXI= 10000
##$MC2= 0
##$MEAN= 0
##$ME_mod= 0
##$MI= 0
##$NCOEF= 0
##$NC_proc= -2
##$NLEV= 6
##$NOISF1= 0
##$NOISF2= 0
##$NSP= 0
##$NTH_PI= 0
##$NZP= 0
##$OFFSET= 16.522
##$PC= 1
##$PHC0= -47.98865
##$PHC1= 7.822323
##$PH_mod= 1
##$PKNL= yes
##$PPARMOD= 0
##$PSCAL= 4
##$PSIGN= 0
##$REVERSE= no
##$SF= 250.13
##$SI= 32768
##$SIGF1= 0
##$SIGF2= 0
##$SINO= 400
##$SIOLD= 32768
##$SREGLST= <1H.CDCl3>
##$SSB= 0
##$STSI= 32768
##$STSR= 0
##$SW_p= 5175.98343685301
##$SYMM= 0
##$S_DEV= 0
##$TDeff= 65536
##$TDoff= 0
##$TI= <Analysis number 999999
Compound Code 99
Book Reference 9
Project Code 9>
##$TILT= no
##$TM1= 0
##$TM2= 0
##$TOPLEV= 0
##$USERP1= <user>
##$USERP2= <user>
##$USERP3= <user>
##$USERP4= <user>
##$USERP5= <user>
##$WDW= 1
##$XDIM= 32768
##$YMAX_p= 358518892
##$YMIN_p= -29589
$$ End of Bruker specific parameters
$$ ---------------------------------
##NTUPLES= NMR SPECTRUM
##VAR_NAME=  FREQUENCY,     SPECTRUM/REAL,   SPECTRUM/IMAG
##SYMBOL=    X,             R,               I
##VAR_TYPE=  INDEPENDENT,   DEPENDENT,       DEPENDENT
##VAR_FORM=  AFFN,          ASDF,            ASDF
##VAR_DIM=   32768,         32768,           32768
##UNITS=     HZ,            ARBITRARY UNITS, ARBITRARY UNITS
##FACTOR=    0.157963299565203, 1,           1
##FIRST=     4132.6476996994, 0,             0
##LAST=      -1043.33573715361, 0,           0
##MIN=       -1043.33573715361, -29589,      0
##MAX=       4132.6476996994, 358518892,     0
$$ Real data points
##PAGE= N=1
##DATA TABLE= (X++(R..R)), XYDATA
$$ [...]
##PAGE= N=2
##DATA TABLE= (X++(I..I)), XYDATA
18844C72908J153l129J12o331O539J503l186k720K746p0m145q840J951M491L373
$$ 372908 374061 370932 371044 364713 371252 372755 369569 366849 369595 369525 365380 356540 358491 362982 366355
18829C66355l689m504O73O199N711J461M56l043N932P617n92m978r19m786j480
$$ 366355 362666 358162 358835 365034 370745 372206 372662 369619 375551 383168 382576 377598 376679 371893 370413
18814C70413J419n34l359K952K737j665l341l036L014L692K998M468N031j239
$$ 370413 371832 371298 367939 370891 373628 371963 368622 365586 368600 372292 375290 379758 384789 383550
18800C83550l302l847N2M859J288j167m204j437q599p121K447N074K233n657J04
$$ 383550 380248 376401 376453 381312 382600 381433 377229 375792 367193 360072 362519 367593 369826 364169 364273
18785C64273P373M337M95j896M112r82j893j779L400J010O373O971M280K788M130
$$ 364273 371646 375983 376478 374582 378694 377712 375819 374040 377440 378450 384823 391794 396074 398862 402992
18770D02992J1032Q297P102l971k3165m3081j8330M486L979N13K740o93K637J135
$$ 402992 414024 422321 429423 425452 402287 359206 340876 345362 349341 349854 352594 351901 354538 355673
18756C55673Q568j486L266N655j571q447j594P605O174k615n946n169P063J953
$$ 355673 364241 362755 366021 371676 370105 361658 360064 367669 373843 371228 365282 360113 367176 369129
18742C69129j014J120L554L132q9K369N677L17m215m447n030L192k119M921O424
$$ 369129 368115 369235 372789 375921 375832 378201 383878 384195 379980 375533 370503 373695 371576 376497 382921
18727C82921j658M28l515j4J171M159l100k393n99J022k163o330L804j356P57
$$ 382921 381263 381691 378176 378162 379333 383492 380392 377999 377400 378422 376259 369929 373733 372377 373134
18712C73134K487Q653j213K368j241k572j11J771M89M815J091r692p346K032N189
$$ 373134 375621 384274 383061 385429 384188 381616 381505 383276 383765 388580 389671 379979 372633 374665 379854
18697C79854k372l978m460l134J1197P494M077k490n060l524k938J713M093j730
$$ 379854 377482 373504 369044 365910 377107 384601 388678 386188 381128 377604 374666 376379 380472 378742
18683C78742k46J162O187Q326J969N88n233l321k844M573k354k578o171M149K645
$$ 378742 378496 379658 385845 394171 396140 396728 391495 388174 385330 389903 387549 384971 378800 382949 385594
18668C85594M202P391m806n067M244K876K838N719m117M317k145l103Q45r021
$$ 385594 389796 397187 392381 387314 391558 394434 397272 402991 398874 403191 401046 397943 398788 389767
18654C89767k990N72j637K000M291n369m951l816N419j227L11j23k132k879k605
$$ 389767 386777 387349 385712 387712 392003 386634 381683 377867 383286 382059 382370 382247 380115 377236 374631
18639C74631K765M619K705M62P79L931J385o61l58L607N83m694j795l548l805
$$ 374631 377396 382015 384720 385182 385961 389892 391277 390616 390258 393865 394448 389754 387959 384411 380606
18624C80606n434l89M416K167NQ39O55k541L216K469K711M114l29p026k292k667
$$ 380606 375172 374783 379199 381366 381371 382210 382865 380324 383540 386009 388720 392834 392505 385479 383187 380520
18608C80520m598L737Q869N476L108J394k816k969J70k934j699Q301O105O7l111
$$ 380520 375922 379659 388528 394004 397112 398506 395690 392721 392891 389957 388258 396559 402664 402731 399620
18593C99620p104n226N66l16n494m067M842J1231P136P773K46k071P08M823n099
$$ 399620 392516 387290 387856 387540 382046 377979 382821 394052 401188 408961 409207 407136 407844 412667 407568
18578D07568l150R268J218J295q669j2349m746O200O20L232K147o269k987P164
$$ 407568 404418 413686 414904 416199 407530 395181 390435 396635 397255 400487 402634 396365 393378 400542
18564D00542N548P648L66j953j672k612m241K98M060Q207j436l649P244j960l956
$$ 400542 406090 413738 414104 412151 410479 407867 403626 403924 407984 416191 414755 411106 418350 416390 412434
18549D12434j0448m305J649K29L500L098P07l882r64l760J506l85O307k969r10
$$ 412434 401986 397681 399330 399559 403059 406157 406864 402982 402018 398258 399764 399379 405686 402717 401807
18534D01807Q029N774l998r41L131m392n402K322Q302O0p234M46J175n193Q636
$$ 401807 409836 415610 411612 410671 413802 409410 404008 406330 414632 414692 407458 407904 409079 403886 412522
18519D12522M058N21r609n311P117L413q895J121P071L850k564p688N114N156
$$ 412522 416580 417101 407492 402181 409298 412711 403816 404937 412008 415858 413294 405606 410720 415876
18505D15876Q96O866Q97p636k518L05J0382l745J203k657q726L452K944M824M847
$$ 415876 416772 423638 424535 416899 414381 414686 425068 421323 422526 419869 411143 414595 417539 422363 427210
18490D27210l132q013P138Q520q44K27n155L297l966o720J61R001K052J655l648
$$ 427210 424078 416065 423203 431723 430879 431106 425951 429248 425282 418562 418723 427724 429776 431431 427783
18475D27783q927l815M145N68j78N28j328R039O173J928k748l770l375m963m041
$$ 427783 418856 415041 419186 419754 419576 420104 418776 427815 433988 435916 433168 429398 426023 421060 417019
18460D17019L928O738P275J316n054n824M544M891J970j479q442o99J468K240
$$ 417019 420947 427685 434960 436276 431222 425398 429942 434833 436803 435324 426882 426183 427651 429891
18446D29891L436K014j0424o846M091M39j818K802M915L797n29L678q68o58L150
$$ 429891 433327 435341 424917 418071 422162 422601 420783 423585 428500 432297 431768 435446 434578 433920 437070
18431D37070L791n996l116r343J245J2791J0114j849m953n859m025L753O408J762
$$ 437070 440861 434865 431749 422406 423651 436442 446556 444707 439754 433895 429870 433623 440031 441793
18417D41793o375k296N189j082j829N034P024l665M430m31o9R86k131o167K445
$$ 441793 435418 433122 438311 437229 435400 440434 447458 443793 448223 447792 447723 448709 446578 440411 442856
18402D42856N413j463o93K106O058J17k111k693k12n370k460J850N916P673J67
$$ 442856 448269 446806 446113 448219 454277 454394 452283 449590 449378 444008 441548 443398 449314 456987 457154
18387D57154r057k098K844O3K65O920R2Q306K106j511o170j0439j918k226N918
$$ 457154 448097 445999 448843 448906 449171 456091 456183 464489 466595 465084 458914 448475 446557 444331 450249
18372D50249j078k713N165Q871M492M859Q402r83k791n909m99m912m113l386l642
$$ 450249 449171 446458 451623 460494 464986 469845 478247 477264 474473 468564 468065 463153 459040 455654 452012
18357D52012k168N610M627M034l70j64P556P035K569L608l278k756m585K342J191
$$ 452012 449844 455454 460081 464115 463745 463581 471137 478172 480741 484349 481071 478315 473730 476072 477263
18342D77263n184L859R408Q187p439j2834o095k623k299O910J3580K807j707m574
$$ 477263 472079 475938 485346 493533 486094 473260 467165 464542 462243 469153 482733 485540 483833 479259
18328D79259L720M991Q466n161n773m722o330M088J1451O231m056j363J028J667
$$ 479259 482979 487970 496436 491275 485502 480780 474450 478538 489989 496220 492164 490801 491829 493496
18314D93496k483j582l23p00n252J880N124L278o83j908K342J140k217l61K785
$$ 493496 491013 489431 489108 488408 483156 485036 490160 493438 492755 490847 493189 494329 492112 491751 494536
18299D94536P985M63j97J102l652k517K225J620k317M864J1109Q163n394Q937
$$ 494536 502521 502984 502787 503889 500237 497720 499945 501565 499248 504112 515221 523384 517990 526927
18285E26927J619o551J503Q199K872p322l068M882m771j786m7M964m809j79R177
$$ 526927 528546 521995 523498 531697 534569 527247 524179 529061 524290 522504 522457 527421 522612 522433 531610
18270E31610L927m468r712K919N439j239N39J635r23O052N340N00l012j808J133
$$ 531610 535537 531069 521357 524276 529715 528476 529015 530650 529727 535779 541119 541619 538607 536799 537932
18255E37932K384P370M383J659j16K761K264L112J999J817K38p19p99L882L960
$$ 537932 540316 547686 552069 553728 553612 556373 558637 561749 563748 565565 565803 565084 564285 568167 572127
18240E72127P551Q944K794k784l15m353r053L256j042k59o504O026Q222O595O107
$$ 572127 579678 588622 591416 588632 588317 583964 574911 578167 577125 576866 570362 576388 584610 591205 597312
18225E97312p231p559R127K750M048M710n680k071M383J1559N605N32J107L267
$$ 597312 590081 582522 591649 594399 598447 603157 597477 595406 599789 611348 616953 617485 618592 621859
18211F21859M602n36j4K401Q264J930N396L040l552K791N117R198l68l425o68
$$ 621859 626461 625925 625911 628312 636576 638506 643902 646942 643390 646181 651298 660496 660128 656703 656035
18196F56035P408J6368J1025j036J847L127N86j87R178O969R367O023K676J0013
$$ 656035 663443 679811 690836 689800 691647 694774 695360 695173 704351 711320 720687 726710 729386 739399
18182G39399M528J290L815J940j170N026Q266J6124J2420k27l860L729N962J6119
$$ 739399 743927 745217 749032 750972 749802 754828 763094 779218 791638 791411 787551 791280 797242 813361
18168H13361J4330J1414Q431J350K622R966J3518J3513J5029J803P305J7305K0500
$$ 813361 827691 839105 847536 848886 851508 861474 874992 888505 903534 905337 912642 929947 950447
18155I50447R100N207J1536J6358J0975R942J7171K0131K1830K0780J7005J8972
$$ 950447 959547 964754 976290 992648 1003623 1013565 1030736 1050867 1072697 1093477 1110482 1129454
18143A129454K2485J6798K0008K8037K9572L1635L0775L1509L9097L6118L8062
$$ 1129454 1151939 1168737 1188745 1216782 1246354 1277989 1308764 1340273 1379370 1415488 1453550
18132A453550L8294N4515N6320N0986N5141O5701P4884Q3574R2197J01233J12689
$$ 1453550 1491844 1546359 1602679 1653665 1708806 1774507 1849391 1932965 2025162 2126395 2239084
18121B239084J28985J53261J75018K06669K40811K81931L61610M60362N88845
$$ 2239084 2368069 2521330 2696348 2903017 3143828 3425759 3787369 4247731 4836576
18112D836576P32564R31525J053161N84484j552864n976848o850389j687643R85857
$$ 4836576 5569140 6500665 7553826 8138310 6585446 608598 -6241791 -7929434 -6943577
18103f943577J200064R69581P46757N62196M27553L42457K93035K41477J98157
$$ -6943577 -5743513 -4773932 -4027175 -3464979 -3037426 -2694969 -2401934 -2160457 -1962300
18094a962300J64564J50004J34222J26423J12529R3886P6098P2024N9518N6760
$$ -1962300 -1797736 -1647732 -1513510 -1387087 -1274558 -1180672 -1104574 -1032550 -973032 -916272
18084i16272M9474N0422M8618M5923M2967L5438L9057L4532L2618K5426K4775
$$ -916272 -866798 -816376 -767758 -721835 -678868 -643430 -604373 -569841 -537223 -511797 -487022
18073d87022K0373K2697K5050J8949J4996K0594J8008O297J3061K1037J7134J5786
$$ -487022 -466649 -443952 -418902 -399953 -384957 -364363 -346355 -340058 -326997 -305960 -288826 -273040
18061b73040J5210K0142J9374J3615l48N513J0994J2760J7469J2688J0985O763
$$ -273040 -257830 -237688 -218314 -204699 -205047 -199534 -188540 -175780 -158311 -145623 -134638 -127875
18049a27875Q534J4002R525L01O101P479k66N074J1659O202K058O684N235O405
$$ -127875 -119341 -105339 -95814 -95513 -89412 -81933 -82199 -77125 -65466 -59264 -57206 -50522 -45287 -38882
18035c8882M807M694O963J5438J3322R284O28j650k485N904R976O09J904L937
$$ -38882 -34075 -29381 -22418 -6980 6342 15626 16254 14604 12119 18023 27999 28608 30512 34449
18021C4449O523O521J881N431k535K53J0541N001L365j145o197K379Q996N759
$$ 34449 40972 47493 49374 54805 52270 52523 63064 68065 71430 70285 64088 66467 75463 81222
18007H1222o0L116n78Q565P380O346L347K952L0j889N480K37o10L20R33P791j936
$$ 81222 81162 84278 83700 92265 99645 105991 109338 112290 112320 110431 115911 116148 115538 115858 116791 124582 122646
17990A22646R44P034K461K257M087J110J279l072p47J018J094J340M572J689O076
$$ 122646 123590 130624 133085 135342 139429 140539 141818 138746 137999 139017 140111 141451 146023 147712 153788
17975A53788R720m88j206Q90N347o56l472j869L196k710p89R251P710j356L111
$$ 153788 163508 163020 161814 162704 168051 167395 163923 162054 165250 162540 161751 171002 178712 177356 180467
17960A80467J445j352j32q328Q99N793K295j032O700l709J122K556K271K779J0045
$$ 180467 181912 180560 180428 172100 172999 178792 181087 180055 186755 183046 184168 186724 188995 191774 201819
17945B01819L179l055J328n15M252N673p304o21P051M544l361l409M68k118l862
$$ 201819 204998 201943 203271 202756 207008 212681 205377 204756 211807 216351 212990 209581 210049 207931 204069
17930B04069Q048L407M061J62J260j681O80M59l249p03J110K445P95k360M358
$$ 204069 212117 215524 219585 219747 221007 219326 220006 220465 217216 216513 217623 220068 220863 218503 222861
17915B22861Q526L077o983m211K854K680P53L127L430l668J43L172p61o74O975
$$ 222861 231387 234464 227481 223270 226124 228804 229557 232684 236114 232446 232589 235761 235000 234326 241301
17900B41301J01j737q823J877O09j008R39J936O181m72M901K966j115J033j574
$$ 241301 241402 239665 230842 232719 233328 232320 233259 235195 241376 240904 245805 248771 247656 248689 247115
17885B47115K60N499J501M299m53M846L423n586n804o918n805N50J3004J3680
$$ 247115 247375 252874 254375 258674 258221 263067 266490 260904 255100 248182 242377 242927 255931 269611
17871B69611k397o513J852M376l126k715k604L408j081J141l290M99n778N39K593
$$ 269611 267214 260701 262553 266929 263803 261088 258484 261892 260811 261952 258662 259161 253383 253922 256515
17856B56515j861N259K970k312m54L630L558K904M756k165q46L624K275L441L505
$$ 256515 254654 259913 262883 260571 260117 263747 267305 270209 274965 272800 271954 275578 277853 281294 284799
17841B84799o972O14O009P20l259N465p586j5117k815L955Q345Q083J348J955
$$ 284799 277827 278441 284450 285170 281911 287376 279790 264673 261858 265813 274158 282241 283589 285544
17827B85544k987p518L354Q53M898K376N534p246q448m70O584j354M815P113J398
$$ 285544 282557 275039 278393 279246 284144 286520 292054 284808 276360 275890 282474 281120 285935 293048 294446
17812B94446l214n62N388J32p68r58o696k236J308K173J481k130O317J111k436
$$ 294446 291232 290670 296058 296190 295422 294464 287768 285532 286840 289013 290494 288364 294681 295792 293356
17797B93356q588k41k717J803j324j04J0928R30m666k452N47Q056N586N81j722
$$ 293356 284768 284527 281810 283613 282289 282185 293113 294043 289377 286925 287472 295528 301114 301695 299973
17782B99973n126j480J324O317J926l577k321J776L907K461j849L362o419J25
$$ 299973 294847 293367 294691 301008 302934 299357 297036 298812 302719 305180 303331 306693 300274 300399
17768C00399K69L182L441n421n228R1m695N872O844j773L586L16L828m128n330
$$ 300399 300668 303850 307291 301870 296642 296733 292038 297910 304754 302981 306567 306883 310711 306583 301253
17753C01253M583K080L183M655r54j891L109m079l287M858l245l872k432l253
$$ 301253 305836 307916 311099 315754 314800 312909 316018 311939 308652 313510 310265 306393 303961 300708
17739C00708j479N754J1968L232o754n599L486K998K769L420l063o358j270o487
$$ 300708 299229 304983 316951 320183 313429 307830 311316 314314 317083 320503 317440 311082 309812 303325
17725C03325k587N567N001Q051O146j0928r742j3J807P21P253L924j358n738m633
$$ 303325 300738 306305 311306 319357 325503 314575 304833 304820 306627 307348 314601 318525 317167 311429 306796
17710C06796j352O749O998l094J013n408K154J2246K506p204j760N609J456K723
$$ 306796 305444 312193 319191 316097 317110 311702 313856 326102 328608 321404 319644 325253 326709 329432
17696C29432K093j018O76l578l415l890O042L888n151J00L545J580J534J250j551
$$ 329432 331525 330507 331183 327605 324190 320300 326342 330230 325079 325179 328724 330304 331838 333088 331537
17681C31537K056J028P61j561j422p187r237j702K930N792L549l878m591K800
$$ 331537 333593 334621 335382 333821 332399 325212 315975 314273 317203 322995 326544 322666 318075 320875
17667C20875L837L967L007m442k975K129N795K554j247P76P111J059n367m661
$$ 320875 324712 328679 331686 327244 324269 326398 332193 334747 333500 334276 341387 342446 337079 332418
17653C32418k826O65L000m4l906l103o15l587M109N942o570m591Q180K729j060
$$ 332418 329592 330257 333257 333213 329307 326204 325589 322002 326111 332053 325483 320892 329072 331801 330741
17638C30741J287q14k2r33n445n392J779O738P112k068k213l010J260m576L51
$$ 330741 332028 331214 331192 330259 324814 319422 321201 327939 335051 332983 330770 327760 329020 324444 324795
17623C24795M202K809L164l030l203N37k146M41r458k218m013N373N224L196L155
$$ 324795 328997 331806 334970 331940 328737 329274 327128 327569 318111 315893 311880 317253 322477 325673 328828
17608C28828L893N349J69j486N733p24l690r62M109J350M70j680q501j0528M206
$$ 328828 332721 338070 338239 336753 342486 341762 338072 337110 341219 342569 343039 341359 332858 322330 326536
17593C26536Q577M321M014p01L290M436J256p566n782L19K346n32Q2N104K033
$$ 326536 335113 339434 343448 342747 346037 350473 351729 344163 338381 338700 341046 340514 340596 345700 347733
17578C47733j181j942j897m142N230k25j3038k420N532K850J512M879K360K068
$$ 347733 346552 344610 342713 338571 343801 343576 330538 328118 333650 336500 338012 342891 345251 347319
17564C47319k525m005J558k591n183J726R044m147l696R16J584k871J376J296
$$ 347319 344794 340789 342347 339756 334573 336299 345343 341196 337500 338416 340000 337129 338505 339801
17550C39801o653o219J0780N801Q97m971j561m790k326J750R210P140L997q207
$$ 339801 333148 326929 337709 343510 344407 339436 337875 333085 330759 332509 341719 348859 352856 344649
17536C44649m389J517P64R45L394q5Q536K671n559O92L867j182m631r56L42M978
$$ 344649 340260 341777 342541 343486 346880 346795 355331 358002 352443 353135 357002 355820 351189 350233 350575 355553
17520C55553m11n851M724P363M59M00P90r066N85j345K722Q53p3L955N951m931
$$ 355553 355142 349291 354015 361378 361837 362237 363027 353961 354546 353201 355923 356776 356703 360658 366609 361678
17504C61678o781k862j606M085J810k995O466o084k388J834R27m63k019o53Q601
$$ 361678 354897 352035 350429 354514 356324 353329 359795 353711 351323 353157 354084 353621 351602 350949 359550
17489C59550j267l664o87M94L0O64K774L684J44L968K167Q29l943q91L822l385
$$ 359550 358283 354619 353932 354426 354456 355120 357894 361578 361722 365690 367857 368686 364743 363852 367674 364289
17473C64289l420o562M344M386N498J892n63k567j870q18m456L031M783q29K401
$$ 364289 360869 354307 358651 363037 368535 370427 369864 367297 365427 364609 360153 363184 367967 367138 369539
17458C69539J947o797Q06K687O703Q08l248L610j14M958M301L4j93M398j065J0502
$$ 369539 371486 364689 365495 368182 374885 375693 372445 376055 375941 380899 385200 385234 385041 389439 388374 398876
17442C98876L295j9962l7656k5410j167N653J829M273J541K217L702J461O718
$$ 398876 402171 382209 344553 319143 317976 323629 325458 329731 331272 333489 337191 338652 345370
17429C45370J2426O396q75k221m577l020j823M83L100J979j876Q718M761o316
$$ 345370 357796 364192 363317 361096 356519 353499 351676 352159 355259 357238 355362 364080 368841 362525
17415C62525m587N391N229p212m508R335l206n535K905K013k016L274n869j980
$$ 362525 357938 363329 368558 361346 356838 366173 362967 357432 360337 362350 360334 363608 357739 355759
17401C55759M135N809o23N53J2041M5j0422J689J0390n083o841J358l734Q37o424
$$ 355759 359894 365703 365080 365633 377674 377719 367297 368986 379376 374293 367452 368810 365076 365913 359489
17386C59489P1N561j805l799P850N651l632L546j67j647m120m863p03o025l570
$$ 359489 359560 365121 363316 359517 367367 373018 369386 372932 372765 371118 366998 362135 361432 355407 351837
17371C51837M499L122M429N073j086k106M07m706N472J1597K738K067O91p551
$$ 351837 356336 359458 363887 368960 367874 365768 366175 361469 366941 378538 381276 383343 384034 376483
17357C76483n059P04k089J354k469n871M372k279j755K686K196Q83P18k014J446
$$ 376483 371424 372128 370039 371393 368924 363053 367425 365146 363391 366077 368273 369156 369874 367860 369306
17342C69306j31K663r3o336N78M889M805O610K737J93o019o938K287J865J569
$$ 369306 369175 371838 371745 365409 365987 370876 375681 382291 385028 385221 379202 372264 374551 376416 377985
17327C77985J232k757k778j422O667J794m458q17k510l700j798J440J679J360
$$ 377985 379217 376460 373682 372260 378927 380721 376263 375446 372936 369236 367438 368878 370557 371917
17313C71917R560M707l742n445l819l510L965m303O55R169J227l121j401j274
$$ 371917 381477 386184 382442 376997 373178 369668 373633 369330 369985 379154 380381 377260 375859 374585
17299C74585j886l274K708j773r27N867M925K40j542M270L843L707M600n781j2650
$$ 374585 372699 369425 372133 370360 369433 375300 380225 380465 378923 383193 387036 390743 395343 389562 376912
17284C76912j1234M287Q589J1071J384o722p531m5P38O749M188j597j799k028
$$ 376912 365678 369965 378554 389625 391009 384287 376756 376711 377449 384198 388386 386789 384990 382962
17270C82962k025L747m257l718N739O039K779m210J428k108L910j40j849q178
$$ 382962 380937 384684 380427 376709 382448 388487 391266 387056 388484 386376 390286 390146 388297 380119
17256C80119j917J825j373n18O228L534L815M83K643q0N511m74J055R81m115k712
$$ 380119 378202 380027 378654 378136 384364 387898 391713 392196 394839 394759 400270 399796 400851 401832 397717 395005
17240C95005o972q40N452J0137j849n548j790J65j716M865l583L415M056n51n252
$$ 395005 388033 387193 392645 402782 400933 395385 393595 393760 392044 396909 393326 396741 400797 400246 394994
17225C94994o064o034j166k55Q58P25N809K677O481Q40n654j29N550j824r502
$$ 394994 388930 382896 381730 381475 382333 383058 388867 391544 398025 398865 393211 393082 398632 396808 387306
17210C87306j144l371M865L442j31p494n718M38N919M487M274L50M165k455p349
$$ 387306 386162 382791 387656 391098 390967 383473 377755 378193 384112 388599 392873 393223 397388 394933 387584
17195C87584m068p93M08J518M588o28l973O174L575l735o259N923N448N170R93
$$ 387584 383516 382723 383131 384649 389237 388609 384636 390810 394385 390650 384391 390314 395762 400932 401925
17180D01925k074n073k14p91k467j297m597K619o28k967L582P159K080Q259o883
$$ 401925 399851 394778 394564 393773 391306 390009 385412 388031 387403 384436 388018 395177 397257 405516 398633
17165C98633m383M276m516n745q38M603R88r25N90k03M316j942J109K429O138
$$ 398633 394250 398526 394010 388265 387427 392030 393018 392093 392683 392480 396796 394854 395963 398392 404530
17150D04530M529P787l963O66n003q451q803Q30n5j270L236Q696R75j937K359
$$ 404530 409059 416846 412883 413549 408546 400095 391292 392122 392067 390797 394033 402729 403704 401767 404126
17135D04126j121K366r94o091M255m55L03M55M38j356l278m934o18j038l078k337
$$ 404126 403005 405371 404377 398286 402541 402086 402389 402844 403282 401926 398648 393714 393096 392058 388980 386643
17119C86643J990N886J424N288M919l939k395j937J43m54l059R69k228k513q0
$$ 386643 388633 394519 395943 401231 406150 402211 399816 397879 398022 397568 394509 395478 393250 390737 390657
17104C90657K478N874J1423M891k887o18j838L80J602o423j420N31L493P752q197
$$ 390657 393135 399009 410432 415323 412436 411818 409980 410360 411962 405539 404119 404650 408143 415895 407698
17089D07698r136j649j915N664O701q11j216r32k654J656N140j931N446J629Q03
$$ 407698 398562 396913 394998 400662 407363 406552 405336 404404 401750 403406 408546 406615 412061 413690 414493
17074D14493K310k999m416L294l351q50m028L932O663k823p107K644N338l170
$$ 414493 416803 413804 409388 412682 409331 408481 404453 408385 415048 412225 405118 407762 413100 409930
17060D09930k236j882M806O978j923k779K684o942o145j722j2j633j719j092M97
$$ 409930 407694 405812 410618 417596 415673 412894 415578 408636 402491 400769 400757 399124 397405 396313 396810
17045C96810L609J3128K942l188p798L143K338l651j647k828j254j370l618n340
$$ 396810 400419 413547 416489 413301 405503 408646 410984 407333 405686 402858 401604 400234 396616 391276
17031C91276N523P24J0411J666n71k08p582Q3j100k473o114N748O638j018l81
$$ 391276 396799 397523 407934 409600 409029 408821 401239 401322 400222 397749 391635 397383 404021 403003 402622
17016D02622P351P356k415l221j663n494m199j422J922n7L029L889J987L748j677
$$ 402622 409973 417329 414914 411693 410030 404536 400337 398915 400837 400780 403809 407698 409685 413433 411756
17001D11756p14J435L906k850k196m114j800j072L339O068K211M61m019n473L145
$$ 411756 411042 412477 416383 413533 411337 407223 405423 404351 407690 413758 415969 416430 412411 406938 410083
16986D10083M515J711M36J12n102k056L71j040N240P99J512m350j903R76L989
$$ 410083 414598 416309 416745 416857 411755 409699 410070 409030 414270 415069 416581 412231 410328 411304 415293
16971D15293r92k732L365M57l83O93M89K667p72k025m61J98k60l290N123r46o569
$$ 415293 414301 411569 414934 415391 415008 415701 416190 418857 418085 416060 415599 415797 415537 412247 417370 416424 409855
16954D09855O28j419K710L199L197k221O531J1089L74n384k444m739K079J160
$$ 409855 410483 409064 411774 414973 418170 415949 422480 433569 433943 428559 426115 421376 423455 424615
16940D24615M373l373M827P91j355m36n841j2513O387M208o714l66M536m0k727
$$ 424615 428988 425615 430442 431233 429878 429442 423601 411088 417475 421683 414969 414603 419139 419099 416372
16925D16372J053J828K817R12m602k103K609K611P390L453m617k068l451P44O932
$$ 416372 417425 419253 422070 422982 418380 416277 418886 421497 428887 432340 427723 425655 422204 422948 429880
16910D29880K856k162r99k323J887L037L163k1l326o984o510l022N712L238K986
$$ 429880 432736 430574 429575 427252 429139 432176 435339 435318 431992 425008 418498 415476 421188 424426 427412
16895D27412j061p434k436n9J26K17K207L347L993j884L269j442m529K529M165
$$ 427412 426351 418917 416481 416422 416548 416765 418972 422319 426312 424428 427697 426255 421726 424255 428420
16880D28420L516n489r92q01r55k013K438l942k345L834P751n680l680p142m267
$$ 428420 431936 426447 425455 424654 423699 421686 424124 420182 417837 421671 429422 423742 420062 412920 408653
16865D08653R756L796M695J530k564m364m499p1Q625M951n572n592l085J0375
$$ 408653 418409 422205 426900 428430 425866 421502 417003 416932 425557 430508 424936 419344 416259 426634
16851D26634m058J028N323q69k789J123n764m413L215j814J999O777o039k300
$$ 426634 422576 423604 428927 428058 425269 426392 420628 416215 419430 417616 419615 426392 420353 418053
16837D18053O734N510M479q49l012r01j11J969Q52N88L665q29J870M972K588q956
$$ 418053 424787 430297 434776 433927 430915 430014 429903 431872 432724 433312 436977 436148 438018 442990 445578 436622
16821D36622j53N111K311n98q20k289l778J985o07k34J814j753m884Nj654L415
$$ 436622 436469 441580 443891 443293 442473 440184 436406 438391 437784 437550 439364 437611 432727 432732 431078 434493
16805D34493j982j790k645L646L652m504o69n286J931J045P035O379l563L15M099
$$ 434493 432511 430721 428076 431722 435374 430870 430201 424915 426846 427891 434926 441305 437742 438057 442156
16790D42156J940q951j394L506K00l434j332P574O866k645M69J52r87l588m07
$$ 442156 444096 435145 433751 437257 437457 434023 432691 440265 447131 444486 444955 445107 444120 440532 440125
16775D40125l24Q092k600j0241k083N548J614l963k98k274M674N378P012O757
$$ 440125 439801 447893 445293 435052 432969 438517 440131 436168 435870 433596 438270 443648 450660 457417
16761D57417M773r53k962q419j1635j476M448n930m683M981j895l138q19j128
$$ 457417 462190 461237 458275 449856 438221 436745 441193 435263 430580 435561 433666 430528 429709 428581
16747D28581P244P273j658l258M898R698k611n178k233k431o729J579Q5k819L836
$$ 428581 435825 443098 441440 438182 443080 452778 450167 444989 442756 440325 433596 435175 435260 432441 436277
16732D36277L326J0408L078j85n006q452P53N617m14L050l098p116K248j413l492
$$ 436277 439603 450011 453089 452904 447898 439446 440199 445816 445402 448452 445354 438238 440486 439073 435581
16717D35581L394M472L256j9n920o938K165k097j75O703p54o341k058k258J451
$$ 435581 438975 443447 446703 446684 440764 433826 435991 433894 433719 440422 439668 433327 431269 429011 430462
16702D30462L138J7401J993l951l379p260P97L087k033n932J933M365L820l116
$$ 430462 433600 451001 452994 449043 445664 438404 439201 442288 440255 434323 436256 440621 444441 441325
16688D41325J170M32M572O098L301j187q41o909N96k624o382o389K852J162K907
$$ 441325 442495 442927 447499 453597 456898 455711 454870 447961 448557 445933 439551 433162 436014 437176 440083
16673D40083L666L395L799j650m818q985P360J2970J0187N356m365M946n452j0320
$$ 440083 443749 447144 450943 449293 444475 435490 442850 455820 466007 471363 466998 471944 466492 456172
16659D56172m253R22K981K794L918j802M039l327N748J51m674l636k852l379K5
$$ 456172 451919 452841 455822 458616 462534 460732 464771 461444 467192 467343 462669 459033 456181 452802 452827
16644D52827j118j718j541O477j483n538j188k879J631J0360j420j033M636m372
$$ 452827 451709 449991 448450 454927 453444 447906 446718 443839 445470 455830 454410 453377 458013 453641
16630D53641o761Q078P694P31m197j0346o175J513P12k180j842J666L904n265
$$ 453641 446880 454958 462652 463383 459186 448840 442665 444178 444890 442710 440868 442534 446438 441173
16616D41173n42l52N644R205M005l855k049l788p384k874O898Q604J915k874R29
$$ 441173 440631 440279 445923 455128 459133 455278 453229 449441 442057 439183 446081 454685 456600 453726 454655
16601D54655N658m028M352M008k953K097N91q81j904l157N0N720j296P3M825m344
$$ 454655 460313 456285 460637 464645 461692 463789 464380 463499 461595 458438 458488 464208 462912 462985 467810 463466
16585D63466j559J36P91m144o360N327O09l228J922k165m033R568J0913O87m559
$$ 463466 461907 462043 462834 458690 452330 457657 458266 455038 456960 454795 450762 460330 471243 471930 467371
16570D67371O01k316J70l641j196J959N129K112p608j795m620n919n97q66l307
$$ 467371 467972 465656 465826 462185 460989 462948 468077 470189 462581 460786 456166 450247 449650 448784 445477
16555D45477n351K521N687J0206K219K039K239k434k743K596K56m076o641r25
$$ 445477 440126 442647 448334 458540 460759 462798 465037 462603 459860 462456 462712 458636 451995 451070
16541D51070P219M985k040m951k661L819K231K278Q33J511J541M742j851n02k983
$$ 451070 458289 463274 461234 456283 453622 457441 459672 461950 462783 464294 465835 470577 468726 468224 465241
16526D65241J210k093L95J344L691L704q071L540O126r182l858R788N188O271
$$ 465241 466451 464358 464753 466097 469788 473492 465421 468961 475087 465905 462047 471835 477023 483294
16512D83294o836j2279o881J496Q603O178K912m378j344m503l993N232R06J60
$$ 483294 476458 464179 457298 458794 467397 473575 476487 472109 470765 466262 462269 467501 468407 468567
16498D68567J923K571k250l641K4K219L017m563n202J528L040J040M97j184r212
$$ 468567 470490 473061 470811 467170 467194 469413 472430 467867 462665 464193 467233 468273 468770 467586 458374
16483D58374l840j527J3809M960j642k242J814j812k375M084k0K598j018K518
$$ 458374 454534 453007 466816 471776 470134 467892 469706 467894 465519 469603 469583 472181 471163 473681
16469D73681K62R42M423M589n113o123J239O930j820m928o294R14M79O816l421
$$ 473681 473943 474885 479308 483897 478784 472661 473900 480830 479010 474082 467788 468702 469181 475997 472576
16454D72576m327j512J820Q491P439j440m679J081J296J537k316J509l354l939
$$ 472576 468249 466737 468557 477048 484487 483047 478368 479449 480745 482282 479966 481475 478121 474182
16440D74182M725L559k558j109j479m273K875r26K310j314p321m044O602P552
$$ 474182 478907 482466 479908 478799 477320 473047 475922 474996 477306 475992 468671 464627 471229 478781
16426D78781k198L90M343k363o045M490M261k018J842L854j703m995n564l877
$$ 478781 476583 476973 481316 478953 472908 477398 481659 479641 481483 485337 483634 478639 473075 469198
16412D69198m300J78M998J546j744O761Q733O2p936p210Q038L320L025L441K400
$$ 469198 464898 465076 470074 471620 469876 476637 485370 485432 477496 470286 478324 481644 484669 488110 490510
16397D90510j885n452k581m486n570J305M971J048L088M747NK832O89j440L361
$$ 490510 488625 483173 480592 476106 470536 471841 476812 477860 480948 485695 485700 488532 489221 487781 491142
16382D91142n865o623L782k422o006N323O53n908M968O913L418L328k760r329
$$ 491142 485277 478654 482436 480014 474008 479331 479984 474076 479044 485957 489375 492703 489943 480614
16368D80614j306J2199R434m060k735m032K201j620k408k987O80o5K977j074J652
$$ 480614 479308 491507 500941 496881 494146 490114 492315 490695 488287 485300 485980 485915 488892 487818 489470
16353D89470K788L427j291o571P730N758m434m047p015j697P45O72J882q667m104
$$ 489470 492258 495685 494394 487823 495553 501311 496877 492830 485815 484118 484863 485535 487417 478750 474646
16338D74646n884P16J0439J916j139J150P208N198k736j1052J106P553K665J27
$$ 474646 468762 469478 479917 481833 480694 481844 489052 494250 491514 480462 481568 489121 491786 491913
16324D91913K54J6j204m866K393l399k362l552p8K959M568j525L93k576M42K619
$$ 491913 492167 492183 490979 486113 488506 485107 482745 479193 479115 482074 486642 485117 485510 482934 483376 485995
16308D85995k084n32K210k05l932J225K749N083k278l539p04j80P162K323L534
$$ 485995 483911 483379 485589 485384 481452 482677 485426 490509 488231 484692 483988 483808 490970 493293 496827
16293D96827r511p41K671K69j375K714Q85L709k813j894L787N99J279l049j787
$$ 496827 487316 486575 489246 489515 488140 490854 491739 495448 492635 490741 494528 495127 496406 493357 491570
16278D91570j666M042j190n162j06J267O135K492j237m860K444Q776L366p974
$$ 491570 489904 493946 492756 487594 487488 488755 494890 497382 496145 491285 493729 502505 505871 497897
16264D97897o688n651k615L920K980j071r16O776N93J600m956N324k195l155j365
$$ 497897 491209 485558 482943 486863 489843 488772 487856 494632 495225 496825 491869 497193 494998 491843 490478
16249D90478P058M915k099j0072j720R57j508k238K040L002o8j109P744j817P286
$$ 490478 497536 502451 500352 490280 488560 489517 488009 485771 487811 490813 490745 489636 497380 495563 502849
16234E02849M146l790R60m880q249L346J0302P871J818j1047o047R207L588o691
$$ 502849 506995 503205 504165 499285 491036 494382 504684 512555 514373 503326 497279 506486 510074 503383
16220E03383k118P00L04n818k040n764L361Q27J053L554L533J591l067k063Q223
$$ 503383 501265 501965 502269 496451 494411 488647 492008 492835 493888 497442 500975 502566 499499 497436 505659
16205E05659Q079R23o010o715j243j994J307N937J868p67j356q667j430Q340N093
$$ 505659 513738 514661 508651 501936 500693 498699 500006 505943 507811 507044 505688 497021 495591 503931 509024
16190E09024K825n649J599o888j829R911P356J259j513m482p77J545q86p927m819
$$ 509024 511849 506200 507799 500911 499082 508993 516349 517608 516095 511613 510836 512381 511495 503568 498749
16175D98749N626j664L036R18q853K214N113K64M449r22l858n079J480Q269J659
$$ 498749 504375 502711 505747 506665 497812 500026 505139 505403 509852 508930 505072 499993 501473 509742 511401
16160E11401P7J083j119J84M220M66k147n256q704R20Q88j259k667L353Q869R32
$$ 511401 511478 512561 511442 511626 515846 516312 514165 508909 500205 501125 502013 500754 498087 501440 510309 511241
16144E11241p812k437J216m544j398N980N770N210L343L056M488j351q582p250
$$ 511241 503429 500992 502208 497664 496266 502246 508016 513226 516569 519625 524113 522762 514180 506930
16130E06930j885o96q86J43K986Q879q78m039l823m703n296p10L050j58R212k792
$$ 506930 505045 504349 503463 503606 506592 515471 514593 510554 506731 502028 496732 496022 499072 498914 508126 505334
16114E05334k746O279K303k003R192R867j447j2349n595K850J834K445R530O690
$$ 505334 502588 508867 511170 509167 518359 528226 526779 514430 508835 511685 513519 515964 525494 532184
16100E32184J429n138m712J024l135p688K249M791n498k314l23l004M523M709
$$ 532184 533613 528475 523763 524787 521652 513964 516213 521004 515506 513192 512869 509865 514388 519097
16086E19097j003P3j528m231M90J982n677m081M377K849K943N113n12j1902k727
$$ 519097 518094 518167 516639 512408 512898 514880 509203 505122 509499 512348 515291 520404 519892 507990 505263
16071E05263Q661P807P336p421n507q601l134j285J567j519J560N544Q334M931
$$ 505263 513924 521731 529067 521646 516139 507538 504404 503119 504686 503167 504727 510271 518605 523536
16057E23536J172j416j633j893m82j863k235M86L755K286M886L615L909J597k350
$$ 523536 524708 523292 521659 519766 519284 517421 515186 515672 519427 521713 526599 530214 534123 535720 533370
16042E33370o323m00l028K090L485k168k239J501K382o58R30J249O08l562j342
$$ 533370 527047 526647 523619 525709 529194 527026 524787 526288 528670 528012 528942 530191 530799 527237 525895
16027E25895J377j432l874L568K234J96p279L770M632o07l32q78M629n291K601
$$ 525895 527272 525840 521966 525534 527768 527964 520685 524455 529087 528480 528148 527270 531899 526608 529209
16012E29209J911Q09q232m060r02L227M414k473j942N731O424m39J484M237L311
$$ 529209 531120 531929 523697 519637 518735 521962 526376 523903 521961 527692 534116 533677 535161 539398 542709
15997E42709k12l478J164j254j888P41m30K574K801l105l146N435L165j587R3
$$ 542709 542497 539019 540183 538929 537041 537782 537352 539926 542727 539622 536476 541911 545076 543489 543582
15982E43582l952l032p98J196M183L785j897k573j859o88O14m835J678R61P94
$$ 543582 539630 536598 535800 536996 541179 544964 543067 540494 538635 537947 538561 533726 535404 536365 537159
15967E37159J391l89m659k743j808M607L533k055j631L53M437k274P805N42j876
$$ 537159 538550 538161 533502 530759 528951 533558 537091 535036 533405 533758 538195 535921 543726 544268 542392
15952E42392k215j0807k122M526l58k255N27J471N152O469Q40l249l071K714M850
$$ 542392 540177 529370 527248 531774 531416 529161 529688 531159 536311 542780 543620 540371 537300 540014 544864
15937E44864o729l74M324j841P28O342m783r76k55J119J483j1756r931N971J0329
$$ 544864 538135 537761 542085 540244 540972 547314 542531 541555 541300 542419 543902 532146 522215 528186 538515
15922E38515J239K832L934l782n745k486k431k823N836O842r70r33Q198N432N57
$$ 538515 539754 542586 546520 542738 536993 534507 532076 529253 535089 541931 540961 540028 548226 553658 554215
15907E54215j1418j0665M64O593N047L762K138l213q421J722O484m831m339M515
$$ 554215 542797 532132 532596 539189 544236 547998 550136 546923 538502 540224 546708 541877 537538 542053
15893E42053J021P047L499m472k66n501K268N392M864M28j44o391o754l252L617
$$ 542053 543074 550121 553620 549148 548882 543381 545649 551041 555905 556333 556189 549798 543044 539792 543409
15878E43409J07K591M176k19r11r84n863L536N543Q84l684o621L86K860M051o146
$$ 543409 543516 546107 550283 550064 549153 548169 542306 545842 551385 552269 548585 541964 542350 545210 549261 543115
15862E43115p659J239R553L365k478j951K046j774k353M426jo42o691k642K816
$$ 543115 535456 536695 546248 549613 547135 545184 547230 545456 543103 547529 547528 546886 540195 537553 540369
15847E40369L973L350J551K453k269Q46Q687O90L885k401p630l159m587P825L152
$$ 540369 544342 547692 549243 551696 549427 550273 558960 559650 563535 561134 553504 550345 545758 553583 556735
15832E56735n359j2042K962M392O724J579l485J238k513K420L636J841j710p4
$$ 556735 551376 539334 542296 546688 553412 554991 551506 552744 550231 552651 556287 558128 556418 556344
15818E56344J277n38k344n19O13o1N814N731j922M900k260q663N310M643k074
$$ 556344 557621 557083 554739 554220 554833 554772 560586 566317 564395 569295 567035 558372 563682 568325 566251
15803E66251n352n349p078J056L547P101M587l35j731J820K013m827l37j113m348
$$ 566251 560899 555550 548472 549528 553075 560176 564763 564428 562697 564517 566530 561703 561366 560253 555905
15788E55905J292N339l98O588L617m298p237K460J334K404Q103n293q686l340
$$ 555905 557197 562536 562138 568726 572343 568045 560808 563268 564602 567006 575109 569816 561130 557790
15774E57790M873L824l121n651J118R062K525J303l283J489j465q810m918O60
$$ 557790 562663 566487 563366 557715 558833 567895 570420 571723 568440 569929 568464 559654 554736 555396
15760E55396k548N112K192m33j691M261P173J796O3l618R12K392j068m306l340
$$ 555396 552848 557960 560152 559719 558028 562289 569462 571258 571321 567703 568615 571007 569939 565633 562293
15745E62293n8l00N027J217J671J067M121K361L176l932q559l876k088N097K155
$$ 562293 562235 561935 566962 568179 569850 570917 575038 577399 580575 576643 568084 564208 562120 567217 569372
15730E69372O02K081m846K195M334m093l298O28L344M590O126j090o286j163O114
$$ 569372 569974 572055 567209 569404 573738 569645 566347 566975 570319 574909 581035 579945 573659 572496 578610
15715E78610L339n453M638n8n481L2N220m185m972l759l925O24k40L773M979R50
$$ 578610 581949 576496 581134 581076 575595 575627 580847 576662 571690 567931 564006 564630 564390 568163 573142 574092
15699E74092j609j74K170m798l591Q763k001m540M678L451M986P194n28j714m436
$$ 574092 572483 572309 574479 569681 566090 574853 572852 568312 572990 576441 581427 588621 588093 586379 581943
15684E81943m599R55n387J950R095M757k582j705n538j129j822l576q157J1021
$$ 581943 577344 578299 572912 574862 583957 588714 586132 584427 578889 577760 575938 572362 564205 575226
15670E75226N751j847p714j903N022P481J541J234j690P70P47J814J044k663j43
$$ 575226 580977 579130 571416 569513 574535 582016 583557 584791 583101 583871 584618 586432 587476 584813 584670
15655E84670o125m358P723k945M95L969n4M314M65o818J179J1298O679j387m934
$$ 584670 578545 574187 581910 578965 579460 583429 583375 587689 588154 581336 582515 593813 600492 599105 594171
15640E94171j2113n517R782M40O37k709L857L262j705q876r3N874L657k463k84
$$ 594171 582058 576541 586323 586763 587400 584691 588548 591810 590105 581229 581136 587010 590667 588204 587920
15625E87920J622M521N757j681O156J319l479j0361L069k418r774j407N330j733
$$ 587920 589542 594063 599820 598139 604295 605614 602135 591774 594843 592425 582651 581244 586574 584841
15611E84841L2m289l741j439J080J1665M169L218J108M755J756p313K955k64r920
$$ 584841 584873 580584 576843 575404 576484 588149 592318 595536 596644 601399 603155 595842 598797 598533 588613
15596E88613j687Q10K32N379M601k39o889m615J719l849r31L328P820J494L854
$$ 588613 586926 587736 587968 593347 597948 597709 590820 586205 587924 584075 583144 586472 594292 595786 599640
15581E99640m798l548J705j91m327o7r08m775P2K523M727O777P533n320m559k395
$$ 599640 594842 591294 592999 592808 588481 588414 587506 582731 582803 585326 590053 596830 604363 599043 594484 592089
15565E92089L088J783J025m375M769j794j121O298k925M803K259o468o04l535
$$ 592089 595177 596960 597985 593610 598379 596585 595464 601762 598837 603640 605899 599431 598827 595292
15551E95292p089K296M474j82L719O626j701p429q72J338P72N271P010k834j987
$$ 595292 588203 590499 594973 594791 598510 605136 603435 596006 595134 596472 597244 602515 609525 606691 604704
15536F04704j05l566M55k018j014P533R84j102M887L121o430l517j726k270L797
$$ 604704 604599 601033 601488 599470 598456 605989 606973 605871 610758 613879 607449 603932 602206 599936 603733
15521F03733k027J024J4399J59n490n398n476o3q218O32L270J7l92M498M288j179
$$ 603733 601706 602730 617129 617288 611798 606400 600924 600861 592643 593275 596545 596562 596170 600668 604956 603777
15505F03777L795J093R36n399J143k81L033M440k337l405L530K80l697n056N998
$$ 603777 607572 608665 609601 604202 605345 605064 608097 612537 610200 606795 610325 610605 606908 601852 607850
15490F07850J681o859m421R857M322k030j466J84n48m992n484J481P014N894K286
$$ 607850 609531 602672 598251 608108 612430 610400 608934 609118 608570 603578 598094 599575 606589 612483 614769
15475F14769J212J153k623j819M47M530O673P35J219J90m747n425l836J903k301
$$ 614769 615981 617134 614511 612692 613139 617669 624342 625077 626296 626486 621739 616314 612478 614381 612080
15460F12080L114M53n71l633m959k879N467N364K458L637L023j191k277m201k754
$$ 612080 615194 615647 615076 611443 606484 603605 609072 614436 616894 620531 623554 622363 620086 615885 613131
15445F13131N80J628j121j692L714O06M356K538o596r74L002J586N119J580m871
$$ 613131 613711 615339 614218 612526 616240 616846 621202 623740 617144 616170 619172 620758 625877 627457 622586
15430F22586r427j752O242M999l024J98O938O355l816r289r775O02P825R268O619
$$ 622586 613159 611407 617649 622648 619624 619822 626760 633115 629299 620010 610235 610837 618662 627930 634549
15415F34549J858l693l562k297K661N604k651m241M600k509k354J342N189J881
$$ 634549 636407 632714 629152 626855 629516 635120 632469 628228 632828 630319 627965 629307 634496 636377
15401F36377O01j133o10J591K17J081J813l753n723N277L320k832K232K82L001
$$ 636377 636978 635845 635235 636826 637043 638124 639937 636184 630461 635738 639058 636226 638458 638740 641741
15386F41741j543q945l748m646m117L355k740L639Q833P401R00n021j942o176
$$ 641741 640198 631253 627505 622859 618742 622097 619357 622996 631829 639230 640130 635109 633167 626991
15372F26991q325J616M375J086l035K477K806Q911M650l909q33J740N63n21p19
$$ 626991 618666 620282 624657 625743 622708 625185 627991 636902 641552 637643 636810 638550 639113 638592 637873
15357F37873k767m15J804k468j133O166K824q029k731J652O751K199m483k196
$$ 637873 635106 634691 636495 634027 632894 639060 641884 633855 631124 632776 639527 641726 637243 635047
15343F35047N272m555P05Q794j666q508j0021M935O984M567L363n56J782p288
$$ 635047 640319 635764 636469 645263 643597 635089 625068 630003 636987 641554 644917 644361 646143 638855
15329F38855m84l430K383l816J714j645l649N869K899k25M31N202Q879k024O62
$$ 638855 638371 634941 637324 633508 635222 633577 629928 635797 638696 638471 638902 644104 652983 650959 651621
15314F51621r42k038m812L868j10o26N812J1800k804o809m766l361k765p81N55
$$ 651621 650679 648641 643829 647697 647587 646961 652773 664573 661769 654960 650194 646833 644068 643287 643842
15299F43842o81N363j019j553K087n629j000K898N087Q949j04K399l387m476O852
$$ 643842 643161 648524 647505 645952 648039 642410 641410 644308 649395 658344 658240 660639 657252 652776 659628
15284F59628K412j467o141k205q63K897L193k363n575n95K615L206L301k764k983
$$ 659628 662040 660573 654432 652227 651364 654261 657454 655091 649516 648921 651536 654742 658043 655279 652296
15269F52296J119n726p279M604R994K053J386j741O07j65l850K365n250l444Q212
$$ 652296 653415 647689 640410 645014 655008 657061 658447 656706 657313 657148 653298 655663 650413 646969 655181
15254F55181O590O52j914o930M113j201o731M571M010N207J22p289L698R452m640
$$ 655181 661771 662423 660509 653579 657692 656491 649760 654331 658341 663548 663670 656381 660079 669531 664891
15239F64891q38P501P834O99n474Q49M001m105l561m127o804L353J130j713J89
$$ 664891 664053 671554 679388 680087 674613 675462 679463 675358 671797 667670 660866 664219 665349 663636 663825
15224F63825M583M80n414P42K494j367P262Q2m18k826M462J847o999j2859m424
$$ 663825 668408 668888 663474 664216 666710 665343 672605 672687 672269 669443 673905 675752 668753 655894 651470
15209F51470K911M181J0842J0316k08n746o679J133L661J194K899K619n56k947
$$ 651470 654381 658562 669404 679720 679512 673766 667087 668220 671881 673075 675974 678593 678037 675090
15195F75090l430O38j72J511L379Q76o04j380k474K15O521J86n367r883L338O360
$$ 675090 671660 672298 672126 673637 677016 677892 677288 675908 673434 673649 680170 680356 674989 665106 668444 674804
15179F74804j39K370k847k047M505J942N439K719q24L7K555J672j289m242J496
$$ 674804 674665 677035 674188 672141 676646 678588 684027 686746 685922 685959 688514 690186 688897 684655 686151
15164F86151l214j444j99j966P706j132L471M338kp265m346k362l827J51k504
$$ 686151 682937 681493 681294 679328 687034 685902 689373 693711 693709 686444 682098 679736 675909 676060 673556
15149F73556J412M839K273n915L375M471l602m500n208N574M203M999K159m818
$$ 673556 674968 679807 682080 676165 679540 684011 680409 675909 670701 676275 680478 685477 687636 682818
15135F82818M00m78K400M343K394k06K41l41J833l511k337M250K358j739O86l505
$$ 682818 683218 682740 685140 689483 691877 691671 691912 691571 693404 689893 687556 691806 694164 692425 693111 689606
15119F89606L970NO01n92k602k172k714M698j294K31J391k151j578R652L652m106
$$ 689606 693576 693581 694182 693590 690988 688816 686102 690800 689506 689737 691128 688977 687399 697051 700703 696597
15103F96597o26j80N757l010p689J631K848k283L279J091n014J072L858L299L224
$$ 696597 695971 695791 701548 698538 690849 692480 695328 693045 696324 697415 692401 693473 697331 700630 703854
15088G03854J567q752k296l418P44N72K34Q614J017q231K226O816M413m118l189
$$ 703854 705421 696669 694373 690955 691699 692271 692505 701119 702136 693905 696131 702947 707360 703242 700053
15073G00053K544M416j000l257n859J285K810N987R788K74N003k170j2211J883
$$ 700053 702597 707013 706013 702756 696897 698182 700992 706979 716767 717041 722044 719874 707663 709546
15059G09546L659L271L094m745j261P64n910l154P012o493r266j647K298M832
$$ 709546 713205 716476 719570 714825 713564 714328 708418 705264 712276 705783 696517 694870 697168 702000
15045G02000K006L973J669K996k916J122m239J651k06o471j646l20O301K975k785
$$ 702000 704006 707979 709648 712644 709728 710850 706611 708262 708056 701585 699939 699619 705920 708895 706110
15030G06110q22m133L498J314k083q950Q290M477n755l752o57Q177K410j715l009
$$ 706110 705288 701155 704653 705967 703884 694934 703224 707701 701946 698194 697537 705714 708124 706409 703400
15015G03400q24K845N788J498J792N807k18j69L324l055k189n258M947M805l114
$$ 703400 702576 705421 711209 712707 714499 720306 720088 719919 723243 720188 717999 712741 717688 722493 719379
15000G19379K93j101j651P54O055K494r533r36K386M585K38p71J230j149O00p52
$$ 719379 719672 718571 716920 717674 723729 726223 716690 715754 718140 722725 722963 722192 723422 722273 722873 722121
14984G22121l111J133N376L092n081n018K47P949J227j260J294j81j488o981k713
$$ 722121 719010 720143 725519 728611 723530 718512 718759 726708 727935 726675 727969 727788 726300 719319 716606
14969G16606K885N287J297L746K01n307k486o460m904O923P815P143j77m255N140
$$ 716606 719491 724778 726075 729821 730022 724715 722229 715769 710865 717788 725603 732746 732569 728314 733454
14954G33454m585J488K275O90o797j772N037N97K198q47J951N32J167Q10J849
$$ 733454 728869 730357 732632 733322 726525 724753 729790 730387 732585 731738 733689 734221 735388 736198 738047
14939G38047O728r20J91o201L1N372M472k282k16r80o881k071L691Q16m958n25
$$ 738047 744775 743855 744046 737845 737876 743248 747720 745438 745222 744242 737361 735290 738981 739797 734839 734314
14923G34314P777L649L69n268n71n53N95k285p799k51l32N219k702l060l952M659
$$ 734314 742091 745740 746109 740841 740270 739717 740312 738027 730228 729977 729645 734864 732162 729102 725150 729809
14907G29809L886M360O734r61l182k971M914l131L515L474L02J653K90j43K594
$$ 729809 733695 738055 744789 743828 740646 737675 742589 739458 742973 746447 746749 748402 748692 748549 751143
14892G51143K017l785J34q9J166K104j525j74j151L164j256J25L229o380j153
$$ 751143 753160 749375 749509 749420 750586 752690 751165 750991 749840 753004 751748 751873 755102 748722 747569
14877G47569L172J685M36k010k19k148P57M565M855l586p7J258j247k087J485
$$ 747569 750741 752426 752862 750852 750633 748485 749242 753807 758662 755076 754999 756257 755010 752923 754408
14862G54408J003j680m212l514K901K224M195J687m49J705L78j723j207J318j371
$$ 754408 755411 753731 749519 746005 748906 751130 755325 757012 756563 758268 758646 756923 755716 757034 755663
14847G55663J974J2310l03n219n572Q427L359l521q620R83J593M8j778o5J219
$$ 755663 757637 769947 769644 764425 758853 767280 770639 767118 758498 759481 761074 761122 759344 759279 760498
14832G60498L110j664M22O551J818n25J477j825l882M782N074n962M657k188l387
$$ 760498 763608 761944 762366 768917 770735 770210 771687 769862 765980 770762 775836 769874 774531 772343 768956
14817G68956j284l792m076p48L771m02j127L537O099M421M224p137m788P643J497
$$ 768956 767672 763880 759804 759056 762827 762425 761298 764835 770934 775355 779579 772442 767654 775297 776794
14802G76794L41K383m796k563N49L167M725L237m014O03K707l588N01m259r655
$$ 776794 777135 779518 774722 772159 772708 775875 780600 783837 779823 780426 783133 779545 780046 775787 766132
14787G66132L353R403j772M610P080O768J338K728k768l09J1210j730q363o213
$$ 766132 769485 778888 777116 781726 788806 795574 796912 799640 796872 796563 807773 806043 797680 791467
14773G91467r097J049L208J13j320P940p96o589k2r24o02j1486l163Q016R542
$$ 791467 782370 783419 786627 786740 785420 793360 792564 785975 785953 785029 784427 772941 769778 777794 787336
14758G87336K596R03n436J24q71L691L649n70K700L927M214m22o835N662L593
$$ 787336 789932 790835 785399 785523 784652 788343 791992 791422 794122 798049 802263 801841 795006 800668 804261
14743H04261n074k138N14L120o95l946j474L934J8o443l967k94L946J102k23M220
$$ 804261 799187 797049 797563 800683 799988 796042 794568 798502 798520 792077 788110 787816 791762 792864 792641 796861
14727G96861J716N695L74n205l339p531r18M891K108k78M044k20L177J097k08
$$ 796861 798577 804272 804646 799441 796102 788571 787653 792544 794652 794374 798418 798198 801375 802472 802264
14712H02264k048j237K985J993k249m223k390k342p799j66Q335P136M132L356
$$ 802264 800216 798979 801964 803957 801708 797485 795095 792753 784954 784788 793123 800259 804391 807747
14698H07747j619j676N224m6j75k387q482j909k117O470J1660k113q059m413o99
$$ 807747 806128 804452 809676 809630 809455 807068 798586 796677 794560 801030 812690 810577 802518 798105 797406
14683G97406P078M186R337L010q369p725M54J0240L643j607k234k783K466j807
$$ 797406 804484 808670 818007 821017 812648 804923 805377 815617 819260 817653 815419 812636 815102 813295
14669H13295j082M821j015L164j516m559Q45P193J0192m110R42K431l622o737
$$ 813295 812213 817034 816019 819183 817667 813108 813953 821146 831338 827228 828170 830601 826979 820242
14655H20242m310K035Q050Q338K81q724n317K041J733L437l019j284J94M825M884
$$ 820242 815932 817967 826017 834355 834636 825912 820595 822636 824369 827806 824787 823503 823697 828522 833406
14640H33406J066j405L214o748j0310M971M126L628L003k783l346j393p80J507
$$ 833406 834472 833067 836281 829533 819223 824194 828320 831948 834951 832168 828822 827429 826649 828156
14626H28156k744Q433N765N22k071p636N320R014o977r445Q44L407o4O73M531
$$ 828156 825412 833845 839610 840132 838061 830425 835745 844759 837782 828337 829181 832588 832524 833197 837728
14611H37728M736K843O192q331p515n764J921J929J51l519J774l288N186q7K931
$$ 837728 842464 845307 851499 843168 835653 829889 831810 833739 833890 830371 832145 828857 834043 833956 836887
14596H36887N740M905p86p905L479M882M494p516k53J954O07J823L151M250j950
$$ 836887 842627 847532 846746 838841 842320 847202 851696 844180 843927 845881 846488 848311 851462 855712 853762
14581H53762L177M423o295n056N795J1214J764j1432l146J1664n694m438O018
$$ 853762 856939 861362 855067 850011 855806 867020 868784 857352 854206 865870 860176 855738 861756
14568H61756l022L280M375R95n571k288m575n825J101K722r67O06N408K912K158
$$ 861756 858734 862014 866389 867384 861813 859525 854950 849125 850226 852948 851981 852587 857995 860907 863065
14553H63065J917j737j260K148J860P21K67J092J29n159L647O584n34n085m108
$$ 863065 864982 863245 861985 864133 865993 866714 866981 868073 868202 863043 866690 873274 872740 867655 863547
14538H63547K476P111N879O99l651P07m65o400J336K247m551K449P478J235k062
$$ 863547 866023 873134 879013 879712 876061 876768 876303 869903 871239 873486 868935 871384 878862 880097 878035
14523H78035K071L350n007k907n895J149J476K250k907j736K114P371m28M205
$$ 878035 880106 883456 878449 875542 869647 870796 872272 874522 871615 869879 871993 879364 878936 883141
14509H83141J283r989L75N352j89k30J803K551O06L928N859R54l00J534k940l278
$$ 883141 884424 874435 874810 880162 879973 879743 881546 884097 884703 888631 894490 895444 895144 896678 893738 890460
14493H90460l894j889N098R605M290R43o603m269o119L111O573M415J381K81l154
$$ 890460 886566 884677 889775 899380 903670 904613 898010 893741 887622 890733 897306 901721 903102 903383 900229
14478I00229J876m994m807K195j763N58M274J98m82K445l731k72N467K132m369
$$ 900229 902105 897111 892304 894499 892736 893294 897568 897766 897284 899729 895998 895726 901193 903325 898956
14463H98956p80K878j451k531M551N144n33R53O57j782j064K817j386m903k762
$$ 898956 898176 901054 899603 897072 901623 906767 906234 907187 907844 906062 904998 907815 906429 901526 898764
14448H98764M228Q612L198l426j414j191j046O404K999l787m588N049N438N381
$$ 898764 902992 911604 914802 911376 909962 908771 907725 914129 917128 913341 908753 913802 919240 924621
14434I24621l889m369N643J116l133M35K273l495l8P998p880l769M091L630m253
$$ 924621 920732 916363 922006 923122 919989 920424 922697 919202 919164 927162 919282 915513 919604 923234 918981
14419I18981m358m260M448K030l535Q437L724k122P333M899j257j0781q254R95
$$ 918981 914623 910363 914811 916841 913306 921743 925467 923345 930678 935577 934320 923539 915285 916280
14405I16280N355o57N298M635k236J710L306m353l240O089M197k77j433K158L127
$$ 916280 921635 920978 926276 930911 928675 930385 933691 929338 926098 932187 936384 936107 934674 936832 939959
14390I39959o347K053k54L858j523j0764O635M970j580j015r43L385K166k076
$$ 939959 933612 935665 935411 939269 937746 926982 933617 938587 937007 935992 935049 938434 940600 938524
14376I38524M100N336P85J767P33L779j2542m016Q216k310L418j449l990k564
$$ 938524 942624 947960 948745 950512 951245 955024 942482 938466 946682 944372 947790 946341 942351 939787
14362I39787L057L690K047P385O37K730n221m24j0p762k104P757K221O997j287
$$ 939787 942844 946534 948581 955966 956603 959333 954112 953688 953678 945916 943812 951569 953790 960787 959500
14347I59500J93m232Q086M769j059K542M7j969j52o724m141J679K679R1O62P954
$$ 959500 959693 955461 963547 968316 967257 969799 969846 967877 967725 961001 956860 958539 961218 961309 961971 969925
14331I69925Q380l869o635l027j56J512l318p303J118J944L914P700K210l642
$$ 969925 978305 974436 967801 964774 964618 966130 962812 955509 956627 958571 962485 970185 972395 968753
14317I68753k703O525o40m44J058r5L959J559l353j142Q79k191M496l798J670
$$ 968753 966050 972575 971935 971491 972549 972454 976413 977972 974619 973477 974356 972165 976661 972863 974533
14302I74533Q42L427k170N932M346L167p51N998L740p123j795k628j0242m803
$$ 974533 975375 978802 976632 982564 986910 990077 989326 995324 999064 991941 990146 987518 977276 972473
14288I72473J1455m280j743O004O331r92j643j054L395J1199n366n823k080K941
$$ 972473 983928 979648 977905 983909 990240 989248 987605 986551 989946 1001145 995779 989956 987876 990817
14274I90817O063K90j248O41O549M279J56m893l576n5l07r73p45N209J8M55j540
$$ 990817 996880 997170 995922 996563 1003112 1007391 1007547 1002654 999078 999023 998716 997743 996998 1002207 1002225 1002680 1001140
14257A001140K772Q28k951o585o75j160L117N126J203l147K32K986L117J423n003
$$ 1001140 1003912 1004740 1001789 995204 994529 993369 996486 1001612 1002815 999668 999900 1002886 1006003 1007426 1002423
14242A002423l430N184O563O012j488k483j722P922K198k812M566k331m895n36
$$ 1002423 998993 1004177 1010740 1016752 1015264 1012781 1011059 1018981 1021179 1018367 1022933 1020602 1015707 1015171
14228A015171q68Q66L079m294l689M702K810K162j213N492N108M24j449l981P397
$$ 1015171 1014303 1015169 1018248 1013954 1010265 1014967 1017777 1019939 1018726 1024218 1029326 1029750 1028301 1024320 1031717
14213A031717j095j410P617P51L38L06l622K227L137j179Q68n77p015P21K607
$$ 1031717 1030622 1029212 1036829 1037580 1037918 1038224 1034602 1036829 1039966 1038787 1039655 1039078 1032063 1032784 1035391
14198A035391j859n7N447M825k684j660J043M044O447K018L382J048r062n97M483
$$ 1035391 1033532 1033475 1038922 1043747 1041063 1039403 1040446 1044490 1050937 1052955 1056337 1057385 1048323 1047726 1052209
14183A052209O38o272k0P335q56n637M135J3203J195K9k117L591p03M979k124
$$ 1052209 1052847 1046575 1046555 1053890 1053034 1047397 1051532 1064735 1065930 1065959 1063842 1067433 1066730 1071709 1069585
14168A069585k48m998q993O286L804J576j313L360M961L349j105q67J503j897
$$ 1069585 1069337 1064339 1055346 1061632 1065436 1067012 1065699 1069059 1074020 1077369 1076264 1075397 1076900 1075003
14154A075003k857m035J102N963l288K889k239O799O199n027p69M115q179k964
$$ 1075003 1072146 1068111 1069213 1075176 1071888 1074777 1072538 1079337 1085536 1080509 1079740 1083855 1075676 1072712
14140A072712J509L744M198L391J902J976l555k459K035J148k38L564N876J676
$$ 1072712 1074221 1077965 1082163 1085554 1087456 1089432 1085877 1083418 1085453 1086601 1086363 1089927 1095803 1097479
14126A097479q8N032K10n524j966o387R48Q327j28n752k491K444k0J941m25M801
$$ 1097479 1097391 1102423 1102633 1097109 1095143 1088756 1089704 1098031 1097903 1092151 1089660 1092104 1092084 1094025 1093600 1098401
14110A098401K518J513N730O67l070j927L100m894l739O41P650p83l665j312r56
$$ 1098401 1100919 1102432 1108162 1108829 1105759 1103832 1106932 1102038 1098299 1098940 1106590 1105807 1102142 1100830 1099874
14095A099874R942K892k602j820l530J769O368O918L668l139k20k754j224L14
$$ 1099874 1109816 1112708 1110106 1108286 1104756 1106525 1112893 1119811 1123479 1120340 1120120 1117366 1116142 1116456
14081A116456M083m92j205J590P398M96J901j288r547o838N231k11K567J2196
$$ 1116456 1120539 1120047 1118842 1120432 1127830 1128326 1130227 1128939 1119392 1112554 1117785 1117574 1120141 1132337
14067A132337m520p810L249L180M939J317k523N852m180l978L183j25M681N455
$$ 1132337 1127817 1120007 1123256 1126436 1131375 1132692 1130169 1136021 1131841 1127863 1131046 1130921 1135602 1141057
14053A141057K060K561N61n47q120J1897M605l984n37r00J236M094L978k393j345
$$ 1141057 1143117 1145678 1146239 1145692 1137572 1149469 1154074 1150090 1149553 1148653 1149889 1153983 1157961 1155568 1154223
14038A154223j715o055K738O43J713P190L208K243k734k06Q576m651m636L161
$$ 1154223 1152508 1146453 1149191 1149834 1151547 1158737 1161945 1164188 1161454 1161248 1169824 1165173 1160537 1163698
14024A163698R95k969j306K514n496k951L627P025J1403p3p432P04P800l2J159
$$ 1163698 1164693 1161724 1160418 1162932 1157436 1154485 1158112 1165137 1176540 1176467 1169035 1169739 1177539 1177507 1178666
14009A178666Q85M70O662Q02K008j327j799r52M78L509Q15q609k690N162N968
$$ 1178666 1179551 1180021 1186683 1187485 1189493 1188166 1186367 1185415 1185893 1189402 1190217 1181608 1178918 1184080 1190048
13994A190048K997m773J773L906l637m915J009k504O068O794M184J147J70n7J675
$$ 1190048 1193045 1188272 1190045 1193951 1190314 1185399 1186408 1183904 1189972 1196766 1200950 1202097 1202267 1202210 1203885
13979A203885j726J672L821Q120N41o667n592L592Q178N444J154L109o422o662
$$ 1203885 1202159 1203831 1207652 1215772 1216313 1209646 1204054 1207646 1215824 1221268 1222422 1225531 1219109 1212447
13965A212447L254L796K988J056j872L207N844P262P90o073j947L955L115j115
$$ 1212447 1215701 1219497 1222485 1223541 1221669 1224876 1230720 1237982 1238772 1232699 1230752 1234707 1237822 1236707
13951A236707l2m725J378k84K096N482O436n412K93J648k512k620M746M588j392
$$ 1236707 1236675 1231950 1233328 1233044 1235140 1240622 1247058 1241646 1241939 1243587 1241075 1238455 1243201 1247789 1246397
13936A246397j083m931K242R251Q51j458J47M645P678L019o967q34m132Q606O425
$$ 1246397 1245314 1240383 1242625 1251876 1252727 1251269 1251416 1256061 1263739 1266758 1259791 1258957 1254825 1263431 1269856
13921A269856j7200m219J2983O055m208J142O862L628l06o912l841J35L699L916
$$ 1269856 1252656 1248437 1261420 1267475 1263267 1264409 1271271 1274899 1274593 1267681 1263840 1263975 1267674 1271590
13907A271590n39j402L631M72R91l62K714n528p36Q389O764j811N449P956m790
$$ 1271590 1271051 1269649 1273280 1273752 1274743 1274381 1277095 1271567 1270831 1279220 1285984 1284173 1289622 1297578 1292788
13892A292788J078k501n899L487K558N7N3J238j701L376m705P79Q512O181J345
$$ 1292788 1293866 1291365 1285466 1288953 1291511 1291568 1291621 1292859 1291158 1294534 1289829 1290608 1299120 1305301 1306646
13877A306646Q00j515J608k59K364K382L329O253M123m308n884l542m895M387
$$ 1306646 1307446 1305931 1307539 1307280 1309644 1312026 1315355 1321608 1325731 1321423 1315539 1311997 1307102 1311489
13863A311489O363J34n92M486P899j527J39M134L838M8j0645l082O878K852K092
$$ 1311489 1317852 1317986 1317394 1321880 1329779 1328252 1328391 1332525 1336363 1336411 1325766 1322684 1329562 1332414 1334506
13848A334506N218N148p88o585p26M14J0258P153j174K59n666K559Q425J564k53
$$ 1334506 1339724 1344872 1344084 1337499 1336773 1337187 1347445 1354598 1353424 1353683 1348017 1350576 1359001 1360565 1360312
13833A360312o67K99K37j834L431L295p42l960l741M389K326j575q244J353L210
$$ 1360312 1359645 1359944 1360181 1358347 1361778 1365073 1364331 1360371 1356630 1361019 1363345 1361770 1353526 1354879 1358089
13818A358089O134R338N308Q141m978k256n544L177N915K296n475j516L304P129
$$ 1358089 1364223 1373561 1378869 1387010 1382032 1379776 1374232 1377409 1383324 1385620 1380145 1378629 1381933 1389062
13804A389062K625K237K119K203k067j213M245P17J762L753O523j636L10K470
$$ 1389062 1391687 1393924 1396043 1398246 1396179 1394966 1399211 1399928 1401690 1405443 1411966 1410330 1410640 1413110
13790A413110L138m238n383M054P417K026J517j828M303p881j697M535j458M172
$$ 1413110 1416248 1412010 1406627 1410681 1418098 1420124 1421641 1419813 1424116 1416235 1414538 1419073 1417615 1421787
13776A421787J2454K727n669J504J256l477J203L960o14j564Q6Q778J5777J252
$$ 1421787 1434241 1436968 1431299 1432803 1434059 1430582 1431785 1435745 1435131 1433567 1433653 1442431 1458208 1459460
13762A459460n919N657J007l602l743j57L413R66N989k651k834k107L291Q798
$$ 1459460 1453541 1459198 1460205 1456603 1452860 1452703 1456116 1457082 1463071 1460420 1457586 1455479 1458770 1467568
13748A467568R067M77n011n123N192J639J374N953J935J744P698K447n700l850
$$ 1467568 1476635 1477112 1472101 1466978 1472170 1473809 1475183 1481136 1483071 1484815 1492513 1494960 1489260 1485410
13734A485410J890O83N412N083M092n106k99Q933j267k141L010J00L915M826m179
$$ 1485410 1487300 1487983 1493395 1498478 1502570 1497464 1497165 1506098 1504831 1502690 1505700 1505800 1509715 1514541 1510362
13719A510362p485o01J1646J1696l316o312k756n87j560J789P747R036M205k175
$$ 1510362 1502877 1502276 1513922 1525618 1522302 1515990 1513234 1512647 1511087 1512876 1520623 1529659 1533864 1531689
13705A531689l275K92M64P110N248J403l429N851P144r37k425p00N214P97K329
$$ 1531689 1528414 1528706 1529170 1536280 1541528 1542931 1539502 1545353 1552497 1551560 1549135 1548435 1553649 1554446 1556775
13690A556775J660K607J5317M193p816l759k375M042K097N464M499k43k851K147
$$ 1556775 1558435 1561042 1576359 1580552 1572736 1568977 1566602 1570644 1572741 1578205 1582704 1582461 1579610 1581757
13676A581757O27o40K615o700j548M420K236J634m72M881P336L977n6M05L054
$$ 1581757 1582384 1581744 1584359 1577659 1576111 1580531 1582767 1584401 1583929 1588810 1596146 1600123 1600067 1600472 1603526
13661A603526J224K038J14m569K059O871O604J852J507O424R454L290k690p00
$$ 1603526 1604750 1606788 1606902 1602333 1604392 1611263 1617867 1619719 1621226 1627650 1637104 1640394 1637704 1637004
13647A637004K050J91J565J182M272K985j364L585N539K025P740K35n591m828
$$ 1637004 1639054 1639245 1640810 1641992 1646264 1649249 1647885 1651470 1657009 1659034 1666774 1667009 1661418 1656590
13633A656590J977P0N544M372L537M665N673M399K02J146M385R26N185O959N245
$$ 1656590 1658567 1658637 1664181 1668553 1672090 1676755 1682428 1686827 1687029 1688175 1692560 1693486 1698671 1705630 1710875
13618A710875n384q084L059O792k964M399N334J587J629J0710n1m19J4178k262
$$ 1710875 1705491 1697407 1700466 1707258 1704294 1708693 1714027 1715614 1717243 1727953 1727902 1727483 1741661 1739399
13604A739399o613q90j499n748O542N363M554j005K288j478R500Q908j438m631
$$ 1739399 1732786 1731896 1730397 1724649 1731191 1736554 1741108 1740103 1742391 1740913 1750413 1759321 1757883 1753252
13590A753252R556K298k747J698o82M523O012r73K954M322L058N55J946O026K540
$$ 1753252 1762808 1765106 1762359 1764057 1763375 1767898 1773910 1772937 1775891 1780213 1783271 1783826 1785772 1791798 1794338
13575A794338J178K617R446O397J669n840R32O005N763k552K902N590R87J764
$$ 1794338 1795516 1798133 1807579 1813976 1815645 1809805 1810737 1816742 1822505 1819953 1822855 1828445 1829432 1831196
13561A831196k084j923n065Q12P368L006J026K002P959J0631R919O058L005Q41
$$ 1831196 1829112 1827189 1822124 1822936 1830304 1833310 1834336 1836338 1844297 1854928 1864847 1870905 1873910 1874751
13547A874751P94L175J903M37k64p67M331L808J456j22J6749O986l723J0247J3387
$$ 1874751 1875545 1878720 1880623 1881060 1880796 1880029 1884360 1888168 1889624 1889502 1906251 1913237 1909514 1919761 1933148
13532A933148K561L308K767L069P77R55l601K872R490P898k722n299K568P020
$$ 1933148 1935709 1939017 1941784 1944853 1945630 1946585 1942984 1945856 1955346 1963244 1960522 1955223 1957791 1964811
13518A964811N741K967O780M439L266K039O985L761K311M667N089K798P486K587
$$ 1964811 1970552 1973519 1980299 1984738 1988004 1990043 1997028 2000789 2003100 2007767 2012856 2015654 2023140 2025727
13504B025727N856R075Q906Q672Q969Q065Q444K626R704J8246R091R177J7005
$$ 2025727 2031583 2040658 2049564 2058236 2067205 2075270 2083714 2086340 2096044 2114290 2123381 2132558 2149563
13491B149563K4540J9491J9947N078r160m5931n9705l6440m3271n9094l9831L781
$$ 2149563 2174103 2193594 2213541 2218619 2209459 2163528 2103823 2067383 2024112 1965018 1925187 1928968
13479A928968K4069K0809K7127K6313J7355J7709P507M998J1667J2444P988O653
$$ 1928968 1953037 1973846 2000973 2027286 2044641 2062350 2069857 2074855 2086522 2098966 2106954 2113607
13467B113607R927J1758J2925K3451J6170M633O624J0572J2880J2511J4026K2217
$$ 2113607 2123534 2135292 2148217 2171668 2187838 2192471 2199095 2209667 2222547 2235058 2249084 2271301
13455B271301K4764K3445K4997L2053M3210M9250L1835k943o9629j39978j61641
$$ 2271301 2296065 2319510 2344507 2376560 2419770 2469020 2500855 2497912 2428283 2288305 2126664
13444B126664j27031n5462m5239o3500j7695L0892M3187M4835M1844K9510K3400
$$ 2126664 1999633 1944171 1898932 1835432 1817737 1848629 1891816 1936651 1978495 2008005 2031405
13433B031405J7651R793J7015J6382J4456K1929K1230J6459J1798J0343O470J3102
$$ 2031405 2049056 2058849 2075864 2092246 2106702 2128631 2149861 2166320 2178118 2188461 2194931 2208033
13421B208033J9820J4312R580R657J1618J0282J5557K2952K2629K5315K6245L2203
$$ 2208033 2227853 2242165 2251745 2261402 2273020 2283302 2298859 2321811 2344440 2369755 2396000 2428203
13409B428203K5842O98n4538j01497r5929p6032p0262k7383J3792L4434L6534
$$ 2428203 2454045 2454743 2400205 2298708 2202779 2126747 2056485 2029102 2042894 2077328 2113862
13398B113862K7048J8533J2067J4891J3670K0507R629N846R626J6024Q890M515
$$ 2113862 2140910 2159443 2171510 2186401 2200071 2220578 2230207 2236053 2245679 2261703 2270593 2275108
13386B275108R702O510L522M395O001J5955R691Q585M230Q43J277J3306J9045
$$ 2275108 2284810 2291320 2294842 2299237 2305238 2321193 2330884 2339469 2343699 2344542 2345819 2359125 2378170
13373B378170J3574M873j588l881N194J1708R480K304M146J2239P625Q70R890
$$ 2378170 2391744 2396617 2395029 2391148 2396342 2408050 2417530 2419834 2423980 2436219 2443844 2444714 2454604
13360B454604J3237P755O415O163K212J776J325P74J0764P963J2003P796L486
$$ 2454604 2467841 2475596 2482011 2488174 2490386 2492162 2493487 2494261 2505025 2512988 2524991 2532787 2536273
13347B536273J242J2282J3865O628J998N253Q494J656r39K278Q358R866R298O188
$$ 2536273 2537515 2549797 2563662 2570290 2572288 2577541 2586035 2587691 2586752 2589030 2597388 2607254 2616552 2622740
13333B622740M214R757J7751J3860k255n320R061J0284M584L112Q325J0206J5646
$$ 2622740 2626954 2636711 2654462 2668322 2666067 2660747 2669808 2680092 2684676 2687788 2696113 2706319 2721965
13320B721965J3827J0219J340L733O364Q497J939j232P439J4233O773J0159J1858
$$ 2721965 2735792 2746011 2747351 2751084 2757448 2765945 2767884 2766652 2774091 2788324 2795097 2805256 2817114
13307B817114R992L979J495O639J0210R208L278O214Q977J3803Q263J0623M247
$$ 2817114 2827106 2831085 2832580 2839219 2849429 2858637 2861915 2868129 2877106 2890909 2899172 2909795 2914042
13294B914042R342P386J6019J4790J0816P970J0196R312M975O306P90L275M052
$$ 2914042 2923384 2930770 2946789 2961579 2972395 2980365 2990561 2999873 3004848 3011154 3011944 3015219 3019271
13281C019271K521j73N936J3399J6892J1156P847P912J9366J0771N597R223M545
$$ 3019271 3021792 3021619 3027555 3040954 3057846 3069002 3076849 3084761 3104127 3114898 3120495 3129718 3134263
13268C134263M461Q814J0787J3417J1807J5566J1728J3927Q209O799P723J3419
$$ 3134263 3138724 3147538 3158325 3171742 3183549 3199115 3210843 3224770 3232979 3239778 3247501 3260920
13256C260920J1887J4911P529J0438J3049J5305J3878J6035J1091J3418J1811
$$ 3260920 3272807 3287718 3295247 3305685 3318734 3334039 3347917 3363952 3375043 3388461 3400272
13245C400272J4434J3170J7668R302L011K0507K5142K4123K4713K0295K5003K3080
$$ 3400272 3414706 3427876 3445544 3454846 3457857 3478364 3503506 3527629 3552342 3572637 3597640 3620720
13233C620720P348P824l8091q9708q6996k7022J7397L6586L7505L0551J9816J9600
$$ 3620720 3628068 3635892 3597801 3508093 3421097 3394075 3411472 3448058 3485563 3516114 3535930 3555530
13221C555530K0189J7458J8623J9782J1000J9515K4483K0373J1726J2595R322
$$ 3555530 3575719 3593177 3611800 3631582 3642582 3662097 3686580 3706953 3718679 3731274 3740596
13210C740596J3202K0363L0111K0913Q139R818J4526K1060K1330K3294K4508K5050
$$ 3740596 3753798 3774161 3804272 3825185 3833324 3843142 3857668 3878728 3900058 3923352 3947860 3972910
13198C972910K1381J1323J3247J4318J1150J1026K2903K4345K3218J7647K801
$$ 3972910 3994291 4005614 4018861 4033179 4044329 4055355 4078258 4102603 4125821 4143468 4146269
13187D146269K748J1104J8080J1894J7854K2709J9704J4233J3153K0589K0779
$$ 4146269 4149017 4160121 4178201 4190095 4207949 4230658 4250362 4264595 4277748 4298337 4319116
13176D319116J5448K2334M5316M1896L3483K0226J5462J8971J5957P851R528J9445
$$ 4319116 4334564 4356898 4402214 4444110 4477593 4497819 4513281 4532252 4548209 4556060 4565588 4585033
13164D585033K1897K3262K1508L7112M0806L0553L0465M2716M6128L6090R203
$$ 4585033 4606930 4630192 4651700 4688812 4729618 4760171 4790636 4833352 4879480 4915570 4924773
13153D924773j432J5976J6567J5301K3349K3819K1600J1658K4052L1359L4068
$$ 4924773 4923341 4939317 4955884 4971185 4994534 5018353 5039953 5051611 5075663 5107022 5141090
13142E141090L3472K9752L4790K1986K5669L5805L9004L1540K5581K8470K0849
$$ 5141090 5174562 5204314 5239104 5261090 5286759 5322564 5361568 5393108 5418689 5447159 5468008
13131E468008L5710N4256M5863K3879J3179K4966M4039L8591L9428M3484M2584
$$ 5468008 5503718 5557974 5603837 5627716 5640895 5665861 5709900 5748491 5787919 5831403 5873987
13120E873987M2830M9447L9413M8379N5840N2068M7677M1960M7373N6035O4431
$$ 5873987 5916817 5966264 6005677 6054056 6109896 6161964 6209641 6251601 6298974 6355009 6419440
13109F419440O9901P6258O0044P231r4364j89234j44543j419J29323J29208J05192
$$ 6419440 6489341 6565599 6625643 6632874 6538510 6349276 6204733 6203314 6332637 6461845 6567037
13098F567037Q9882Q5199P6979P3907P2793P0127O8626N8988N6658O3348O4769
$$ 6567037 6656919 6742118 6819097 6893004 6965797 7035924 7104550 7163538 7220196 7283544 7348313
13087G348313O1881O4923P0713P8676P4649P5404P0499P4305O5827N5601O6022
$$ 7348313 7410194 7475117 7545830 7624506 7699155 7774559 7845058 7919363 7985190 8040791 8106813
13076H106813P7289R1663R4829Q3659Q1476P5466P1384Q4259R5737J01328J07521
$$ 8106813 8184102 8275765 8370594 8454253 8535729 8611195 8682579 8766838 8862575 8963903 9071424
13065I071424J07382J09362J09900J02374R9459J10022J10335J19350J26928J35185
$$ 9071424 9178806 9288168 9398068 9500442 9599901 9709923 9820258 9939608 10066536 10201721
13055A0201721J46826J44488J29977J07977J23962J32604J39487J49951J53296
$$ 10201721 10348547 10493035 10623012 10730989 10854951 10987555 11127042 11276993 11430289
13046A1430289J56464J66890J74302J81071J80322J70639J78503K14586K39820
$$ 11430289 11586753 11753643 11927945 12109016 12289338 12459977 12638480 12853066 13092886
13037A3092886K55036K32138K10421J97772K00926K24531K66618K98891L08029
$$ 13092886 13347922 13580060 13790481 13988253 14189179 14413710 14680328 14979219 15287248
13028A5287248L06112L04295L28818L66386L69154L17620K67652K82820L14600
$$ 15287248 15593360 15897655 16226473 16592859 16962013 17279633 17547285 17830105 18144705
13019A8144705L26406L53829M45612N24825N57132N78405N96693N78845N65760
$$ 18144705 18471111 18824940 19270552 19795377 20352509 20930914 21527607 22106452 22672212
13010B2672212N83551O32885O95479P77132Q46985R02729R77229J095408J187300
$$ 22672212 23255763 23888648 24584127 25361259 26208244 27110973 28088202 29183610 30370910
13001C0370910J283240J385244J470796J557628J696829J922900K184872K422468
$$ 30370910 31654150 33039394 34510190 36067818 37764647 39687547 41872419 44294887
12993D4294887K663829K941552L314206L850692M524169N177870N608442O150645
$$ 44294887 46958716 49900268 53214474 57065166 61589335 66767205 72375647 78526292
12985G8526292P972052J0826568J3679607J6915898K1014315K3620474J5304250
$$ 78526292 86498344 97324912 111004519 127920417 148934732 172555206 187859456
12978A87859456k2689334j05516246j62618984q7238629J570222K5616300K4598574
$$ 187859456 165170122 59653876 -102965108 -190203737 -188633515 -163017215 -138418641
12971a38418641J9887663J5501082J1977435R474763P576482N760690M732213
$$ -138418641 -118530978 -103029896 -91052461 -81577698 -74001216 -68240526 -63508313
12964f3508313M537798M250950L805322L351936K924474K543076K239426K011597
$$ -63508313 -58970515 -54719565 -50914243 -47562307 -44637833 -42094757 -39855331 -37843734
12956c7843734J885243J757170J572127J385744J266810J172287J091657J045580
$$ -37843734 -35958491 -34201321 -32629194 -31243450 -29976640 -28804353 -27712696 -26667116
12948b6667116J012555R48709Q54864P79470P09746O30030N49937N05532M61587
$$ -26667116 -25654561 -24705852 -23850988 -23071518 -22361772 -21731742 -21181805 -20676273 -20214686
12939b0214686M47073M96827N17744N04322M98714M73102M23312L79100L80363
$$ -20214686 -19767613 -19270786 -18753042 -18248720 -17750006 -17276904 -16853592 -16474492 -16094129
12930a6094129L53485K79507K49705K92844L28051L29287K84948K61891K52567
$$ -16094129 -15740644 -15461137 -15211432 -14918588 -14590537 -14261250 -13976302 -13714411 -13461844
12921a3461844K61332K79560K85114K68189K26890J94159J68416J70114J82663
$$ -13461844 -13200512 -12920952 -12635838 -12367649 -12140759 -11946600 -11778184 -11608070 -11425407
12912a1425407K04324K04401J75236J58930J63781J68199J60818J57030J51616
$$ -11425407 -11221083 -11016682 -10841446 -10682516 -10518735 -10350536 -10189718 -10032688 -9881072
12903i881072J48383J43952J48246J52035J19963J12301J11095J17215J20266
$$ -9881072 -9732689 -9588737 -9440491 -9288456 -9168493 -9056192 -8945097 -8827882 -8707616
12894h707616J24254J10463J09731J08376J02311R7943J01726Q5360P2303O4710
$$ -8707616 -8583362 -8472899 -8363168 -8254792 -8152481 -8054538 -7952812 -7867452 -7795149 -7730439
12884g730439O0876P0877R0392Q4924Q0229P3823P3562P9012R0925R5865R0192
$$ -7730439 -7669563 -7598686 -7508294 -7423370 -7343141 -7269318 -7195756 -7116744 -7025819 -6929954 -6839762
12873f839762Q2966P9784P4048O4796O0834O5936O8423O5494O7800N5900O0717
$$ -6839762 -6756796 -6677012 -6602964 -6538168 -6477334 -6411398 -6342975 -6277481 -6209681 -6153781 -6093064
12862f093064O6955O5484O7026N6833N9956O2904N1418N0037M4513K3929J0651
$$ -6093064 -6026109 -5960625 -5893599 -5836766 -5776810 -5713906 -5662488 -5612451 -5567938 -5544009 -5533358
12851e533358l3666l7922L1929R8236J07295Q5241P5844O0642N6686J3057n1436
$$ -5533358 -5567024 -5604946 -5573017 -5474781 -5367486 -5282245 -5206401 -5145759 -5089073 -5076016 -5127452
12840e127452l2823L7702O0440O3211N0268M5276M5235M4884L5410K7377L7262
$$ -5127452 -5160275 -5122573 -5062133 -4998922 -4948654 -4903378 -4858143 -4813259 -4777849 -4750472 -4713210
12829d713210L4297L3714L8327M9060N4037L9602K7209J9669L3332M5582M3741
$$ -4713210 -4678913 -4645199 -4606872 -4557812 -4503775 -4464173 -4436964 -4417295 -4383963 -4338381 -4294640
12818d294640L0193K3888K0919K7666M2642L1627L0771K9490K3910K4628L2490
$$ -4294640 -4264447 -4240559 -4219640 -4191974 -4149332 -4117705 -4086934 -4057444 -4033534 -4008906 -3976416
12807c976416K9222L8073L8355L7331L8869L7645L3739L7204M0348L6955J6748
$$ -3976416 -3947194 -3909121 -3870766 -3833435 -3794566 -3756921 -3723182 -3685978 -3645630 -3608675 -3591927
12796c591927N156J455J2393K1785O637l627J8337K6787K5287K9105L1788L8328
$$ -3591927 -3586771 -3585316 -3572923 -3551138 -3544501 -3548128 -3529791 -3503004 -3477717 -3448612 -3416824 -3378496
12784c378496K8964K4005K5695J3676n741j0014O174J7284K8419L0375K8321K5760
$$ -3378496 -3349532 -3325527 -3299832 -3286156 -3291897 -3301911 -3295737 -3278453 -3250034 -3219659 -3191338 -3165578
12772c165578K4894J4902Q510J9877K2647K3804K4244K8589J5863J9378J8556
$$ -3165578 -3140684 -3125782 -3117272 -3097395 -3074748 -3050944 -3026700 -2998111 -2982248 -2962870 -2944314
12761b944314J0023J4282K0142J8771K3005K3267J2216J3121J4236M848O620N145
$$ -2944314 -2934291 -2920009 -2899867 -2881096 -2858091 -2834824 -2822608 -2809487 -2795251 -2790403 -2783783 -2778638
12749b778638J2784K8386K6471J5948J0629J677M842J6238K4196K6836J7456J1547
$$ -2778638 -2765854 -2737468 -2710997 -2695049 -2684420 -2682743 -2677901 -2661663 -2637467 -2610631 -2593175 -2581628
12737b581628R497P329J2233J4017J5290J5504J9724K2006J2223J4046O913O477
$$ -2581628 -2572131 -2564802 -2552569 -2538552 -2523262 -2507758 -2488034 -2466028 -2453805 -2439759 -2432846 -2426369
12725b426369J3404R409j784P191J9526K7277K2949J6091J2219Q879M522j792
$$ -2426369 -2412965 -2403556 -2405340 -2398149 -2378623 -2351346 -2328397 -2312306 -2300087 -2291208 -2286686 -2288478
12713b288478J0639J5789O791Q604J4343J1074J3718O272J3672P265N084R779
$$ -2288478 -2277839 -2262050 -2255259 -2246655 -2232312 -2221238 -2207520 -2201248 -2187576 -2180311 -2175227 -2165448
12701b165448Q769O831R251P950J9952K1582J1584J1582J4451M092J1688J4401
$$ -2165448 -2156679 -2149848 -2140597 -2132647 -2112695 -2091113 -2079529 -2067947 -2053496 -2049404 -2037716 -2023315
12689b023315O440k3Q456o45J1920J7944J9112K1722J1477j80l43Q909J632K624
$$ -2023315 -2016875 -2016898 -2008442 -2009087 -1997167 -1979223 -1960111 -1938389 -1926912 -1927092 -1927435 -1918526 -1916894 -1914270
12675a914270Q627J5239J8831J5771R215J0721J3686J2847J1125J0355N493j50
$$ -1914270 -1905643 -1890404 -1871573 -1855802 -1846587 -1835866 -1822180 -1809333 -1798208 -1787853 -1782360 -1782510
12663a782510M845J355P738J6111P388N024L456K925R103P684J2798J2236P031
$$ -1782510 -1777665 -1776310 -1768572 -1752461 -1745073 -1740049 -1736593 -1733668 -1724565 -1716881 -1704083 -1691847 -1684816
12650a684816R585M614O979J0002J528N953J5707J0409P898J0419O365M185M928
$$ -1684816 -1675231 -1670617 -1663638 -1653636 -1652108 -1646155 -1630448 -1620039 -1612141 -1601722 -1595357 -1591172 -1586244
12637a586244J2313N107Q605J1768L064k864K5O218J6957J1816P810R886J1464
$$ -1586244 -1573931 -1568824 -1560219 -1548451 -1545387 -1548251 -1548226 -1542008 -1525051 -1513235 -1505425 -1495539 -1484075
12624a484075L023L40N008J0592R551R440K790N044J0360L676P007J0683P047
$$ -1484075 -1481052 -1480712 -1475704 -1465112 -1455561 -1446121 -1443331 -1438287 -1427927 -1424251 -1417244 -1406561 -1399514
12611a399514J7755J0228L828j144L251Q207R068J2484M787k311m98J113Q626
$$ -1399514 -1381759 -1371531 -1367703 -1368847 -1365596 -1357389 -1348321 -1335837 -1331050 -1333361 -1333859 -1332746 -1324120
12598a324120Q756Q585J0242Q600M424J1400M181K101J1817P023L918O549M962
$$ -1324120 -1315364 -1306779 -1296537 -1287937 -1283513 -1272113 -1267932 -1265831 -1254014 -1246991 -1243073 -1236524 -1231562
12585a231562R695J1135l276K910P520Q273M348O530J862M565R419R591Q770M550
$$ -1231562 -1221867 -1210732 -1214008 -1211098 -1203578 -1195305 -1190957 -1184427 -1182565 -1178000 -1168581 -1158990 -1150220 -1145670
12571a145670R322K871O993p87P876J3602J3398L396L316J0199J0476P629j124
$$ -1145670 -1136348 -1133477 -1126484 -1127271 -1119395 -1105793 -1092395 -1088999 -1085683 -1075484 -1065008 -1057379 -1058503
12558a058503M383J1404J6953J5391J4115J5581Q952O832J0166J9424K2618K0853
$$ -1058503 -1054120 -1042716 -1025763 -1010372 -996257 -980676 -971724 -964892 -954726 -935302 -912684 -891831
12546h91831K8370L5643K7924K774m3287q4354r2419r2524q9216l7821J5186M3176
$$ -891831 -863461 -827818 -799894 -797120 -840407 -924761 -1017180 -1109704 -1198920 -1236741 -1221555 -1178379
12534a178379L6288K9924K5313J4025J7548J8665J1415J3962J1180J4175N088
$$ -1178379 -1142091 -1112167 -1086854 -1072829 -1055281 -1036616 -1025201 -1011239 -1000059 -985884 -980796
12523i80796Q831J1467J6883J8061J9732J0282O919Q354J6599K2585J8102J6722
$$ -980796 -971965 -960498 -943615 -925554 -905822 -895540 -888621 -880267 -863668 -841083 -822981 -806259
12511h06259K0844K1238L0602M2791M5417L3273J7739k5897p1576n1464p8190
$$ -806259 -785415 -764177 -733575 -690784 -645367 -612094 -594355 -620252 -691828 -743292 -821482
12500h21482j51894j55200j23076m6384J8855M7404N0388M1687M1371L1291J9704
$$ -821482 -973376 -1128576 -1251652 -1298036 -1279181 -1231777 -1181389 -1139702 -1098331 -1067040 -1047336
12489a047336J8131J5831J8437R847J0755J4620J2600N549M608J4359J5215J2279
$$ -1047336 -1029205 -1013374 -994937 -985090 -974335 -959715 -947115 -941566 -936958 -922599 -907384 -895105
12477h95105J6106R149J5491J7691N516R533J0947J0103J0223K3324K4852J7304
$$ -895105 -878999 -869850 -854359 -836668 -831152 -821619 -810672 -800569 -790346 -767022 -742170 -724866
12465g24866K2197j259l4284p3114m9399k9646m7544m0455j956J6007J9002J6502
$$ -724866 -702669 -703928 -738212 -811326 -860725 -890371 -937915 -978370 -980326 -964319 -945317 -928815
12453i28815J2750K0827J5807M828J2911R568J1789Q661R657N261K708N344M961
$$ -928815 -916065 -895238 -879431 -874603 -861692 -852124 -840335 -831674 -822017 -816756 -814048 -808704 -803743
12440h03743Q901K162M528M814J0597P622K706P323J967O417M128P171Q699N628
$$ -803743 -794842 -792680 -788152 -783338 -772741 -765119 -762413 -755090 -753123 -746706 -742578 -735407 -726708 -721080
12426g21080K285r90l61Q95O672O251J966L212J0798l042M618K755L872M266J255
$$ -721080 -718795 -719785 -720146 -719251 -712579 -706328 -704362 -701150 -690352 -693394 -688776 -686021 -682149 -677883 -676628
12411f76628L171L941R171M394l222o78k06N507O387J230K723m93j091N46L906
$$ -676628 -673457 -669516 -660345 -655951 -659173 -659851 -660057 -654550 -648163 -646933 -644210 -644703 -645794 -645248 -641342
12396f41342J090l372J799P074P882Q360N536l101l402O597M912O59K426N545
$$ -641342 -640252 -643624 -641825 -634751 -626869 -618509 -612973 -616074 -619476 -612879 -607967 -607308 -604882 -599337
12382e99337N724J613L201j503n70J0979r32J59j451J1251N847n553o319K624
$$ -599337 -593613 -592000 -588799 -590302 -590872 -579893 -580825 -580666 -582117 -570866 -565019 -570572 -576891 -574267
12368e74267M611P438r49R510J2857J860l064k399l849M338J0124J880K262N296
$$ -574267 -569656 -562218 -563167 -553657 -540800 -538940 -542004 -544403 -548252 -543914 -533790 -531910 -529648 -524352
12354e24352R43N134K970P857O499n056K281n660l424O749O508K158j6J2496J2776
$$ -524352 -523409 -518275 -515305 -507448 -500949 -506005 -503724 -509384 -512808 -506059 -499551 -497393 -497409 -484913 -472137
12339d72137m93l42N147J106N125K667R520L693l535l556K583m61O339K369L857
$$ -472137 -472630 -472972 -467825 -466719 -461594 -458927 -449407 -445714 -449249 -452805 -450222 -450683 -444344 -441975 -438118
12324d38118j221L345N670J096L644l31J393M359L078J619n09l296j674M126K377
$$ -438118 -439339 -435994 -430324 -429228 -425584 -425915 -424522 -420163 -417085 -415466 -415975 -419271 -420945 -416819 -414442
12309d14442j785J684L559Q285O831K516M398j227K528m224L601J758r53M574
$$ -414442 -416227 -414543 -410984 -402699 -395868 -393352 -388954 -390181 -387653 -391877 -388276 -386518 -387471 -382897
12295c82897L630m700j833M981J1033O781J013k536O605R866J0697m978o59J292
$$ -382897 -379267 -383967 -385800 -380819 -369786 -363005 -361992 -364528 -357923 -348057 -337360 -342338 -342997 -341705
12281c41705l358j090N73R322L811M337k613n640L710k402K711k016k813J1741
$$ -341705 -345063 -346153 -345580 -336258 -332447 -328110 -330723 -336363 -332653 -335055 -332344 -334360 -337173 -325432
12267c25432L564K678N75q52r97O656J5093k785m152O385M312k175l511M264Q162
$$ -325432 -321868 -319190 -318615 -319467 -320464 -313808 -298715 -301500 -305652 -299267 -294955 -297130 -300641 -296377 -288215
12252b88215N718J325J656r94l833m006Q72M442L723n855M517J1803P429J430
$$ -288215 -282497 -281172 -279516 -280510 -284343 -288349 -287477 -283035 -279312 -285167 -280650 -268847 -261418 -259988
12238b59988k312Q60N075o08j072j307O454O031O335M502j1763K604J1032Q40
$$ -259988 -262300 -261440 -256365 -256973 -258045 -259352 -252898 -246867 -240532 -236030 -247793 -245189 -234157 -233317
12224b33317p64M058J125m281j2038P365P781J46O703M766K499l778k13Q112M676
$$ -233317 -234081 -230023 -228898 -233179 -245217 -237852 -230071 -229925 -223222 -218456 -215957 -219735 -219948 -211836 -207160
12209b07160k139m788J591N212J2822J0294j652n384J310N42m721K785P101L665
$$ -207160 -209299 -214087 -212496 -207284 -194462 -184168 -185820 -191204 -189894 -189352 -194073 -191288 -184187 -180522
12195a80522J447O23K251j358j482K756R197M072p267o485P44j301O631Q422Q879
$$ -180522 -179075 -178452 -176201 -177559 -179041 -176285 -167088 -163016 -170283 -176768 -176024 -177325 -170694 -162272 -153393
12180a53393O101k4m729j296l808J436j965R334M733l852k596l115O099J900J8
$$ -153393 -147292 -147316 -152045 -153341 -157149 -155713 -157678 -148344 -143611 -147463 -150059 -153174 -147075 -145175 -145157
12165a45157K731J907P368N127J941j397K796M797j908L517N670k047L837N54
$$ -145157 -142426 -140519 -133151 -128024 -126083 -127480 -124684 -119887 -121795 -118278 -112608 -114655 -110818 -110264
12151a10264M33l3M081J0738L289j628N149K138j3611q999L149M013J704P420
$$ -110264 -109831 -109864 -105783 -95045 -91756 -93384 -88235 -86097 -99708 -108707 -105558 -101545 -99841 -92421
12137i2421M524j922l990P748M719P717l980k302K878N475k48k638l159j606N400
$$ -92421 -87897 -89819 -93809 -86061 -81342 -73625 -77605 -79907 -77029 -71554 -71802 -74440 -77599 -79205 -73805
12122g3805J1707l43n873M830P671N888l96J838K350n749j538J108J073O261M518
$$ -73805 -62098 -62441 -68314 -63484 -55813 -49925 -50321 -48483 -46133 -51882 -53420 -52312 -51239 -44978 -40460
12107d0460M003Q37j963O297K512j759J119p19r917J530R396Q940j14k742M539
$$ -40460 -36457 -35620 -37583 -31286 -28774 -30533 -29414 -30133 -40050 -38520 -29124 -20184 -20298 -23040 -18501
12092a8501J885l686M069p785J854O499K343q580k166R220N149M646k186J098
$$ -18501 -16616 -20302 -16233 -24018 -22164 -15665 -13322 -21902 -24068 -14848 -9699 -5053 -7239 -6141
12078f141O875P854N07m358Q046K359m11J006M542M229o416p922K383j947l976
$$ -6141 734 8588 9095 4737 12783 15142 14731 15737 20279 24508 18092 10170 12553 10606 6630
12063F630N167J2728p70o602M598J0324Q113k428J622j259J58J770L24P936m99
$$ 6630 11797 24525 23755 17153 21751 32075 40188 37760 39382 38123 38281 40051 40375 48311 47812
12048D7812o026m580O805k943o78J0187P550j433n226n096J190n925o62O847L861
$$ 47812 41786 37206 44011 41068 40390 50577 58127 56694 51468 46372 47562 41637 40975 47822 51683
12033E1683M360O488K073j925L266O082Q198R188n228o607m617j846J622O355
$$ 51683 56043 62531 64604 62679 65945 72027 80225 89413 84185 77578 72961 71115 72737 79092
12019G9092J473L826n51O26L948N740N203K171O79J300l991k830L565o070J399
$$ 79092 80565 84391 83840 84466 88414 94154 99357 101528 102207 103507 99516 96686 100251 94181 95580
12004I5580N70P506N873n29L863l579j530K537N888l978q43J498L919r71J152
$$ 95580 96150 103656 109529 109000 112863 109284 107754 110291 116179 112201 111358 112856 116775 115804 116956
11989A16956O924Q128M728k588J667k133k90J0489L629L943n63L999l688l506
$$ 116956 123880 132008 136736 134148 135815 133682 133392 143881 147510 151453 150890 154889 151201 147695
11975A47695J419j60n01l863N44M539k221J436J0844K123K149P10l496m361P43
$$ 147695 149114 148954 148453 144590 145134 149673 147452 148888 159732 161855 164004 164714 161218 156857 157600
11960A57600L636N55J899N555J665j531K326O652l549j688O549Q392l258n448
$$ 157600 161236 161791 163690 169245 170910 169379 171705 178357 174808 173120 179669 188061 184803 179355
11946A79355M626O185k368M25q67k330N598O624L150j522j279r33M48J711O095
$$ 179355 183981 190166 187798 188223 187356 185026 190624 197248 200398 198876 197597 196664 197112 198823 204918
11931B04918M166M671J095J712j881R96N822k81l494p52j037k451J278j269P641
$$ 204918 209084 213755 214850 216562 214681 215677 221499 221218 217724 216972 215935 213484 214762 213493 221134
11916B21134K757M860O682K111M16k44P8J433J895l070m378k083j904L72J808
$$ 221134 223891 228751 235433 237544 237960 237716 237794 239227 241122 238052 233674 231591 229687 230059 231867
11901B31867L386l86M417l667k081J680O534L936k231p322K635J2206K491J0270
$$ 231867 235253 234867 239284 235617 233536 235216 241750 245686 243455 236133 238768 250974 253465 263735
11887B63735L981m893r527n98L199M718O204k376l946O54Q963P560m132J747K426
$$ 263735 267716 262823 253296 252698 255897 260615 266819 264443 260497 261151 270114 277674 273542 275289 277715
11872B77715M643J544l283r88j979Q184L07J582K908M822O047o753K592l095j965
$$ 277715 282358 283902 280619 279631 277652 285836 286143 287725 290633 295455 301502 294749 297341 294246 292281
11857B92281O072j320m274J0306M316J903J485L49l027L972N641R03o813k374
$$ 292281 298353 297033 292759 303065 307381 309284 310769 311118 308091 312063 317704 318607 311794 309420
11843C09420j497K120M802J0865J049j628k090r76o849k020M928R304Q986K303
$$ 309420 307923 310043 314845 325710 326759 325131 323041 322065 315216 313196 318124 327428 336414 338717
11829C38717O88m560j2680M471K688K917J479J1411R028l775j071K442k58K866
$$ 338717 339405 334845 322165 326636 329324 332241 333720 345131 354159 350384 349313 351755 351497 354363
11815C54363J163j566k763M859R737O030n755j2062J477Q238N038k821m251J903
$$ 354363 355526 353960 351197 356056 365793 371823 366068 354006 355483 363721 368759 365938 361687 363590
11801C63590N987l733m308J1597Q966J995o51k599Q51Q83O260J407k351R89J106
$$ 363590 369577 365844 361536 373133 382099 384094 383443 380844 381695 382578 388838 390245 387894 388883 389989
11786C89989j115M82J459J03l44N903l60L256R30K218k409Q159N183m463p349
$$ 389989 388874 389356 390815 390918 390574 396477 396117 399373 400303 402521 400112 408271 413454 408991 401642
11771D01642K896J1258O756k107K330J70n499N69O695K546q687M35L249j969K326
$$ 401642 404538 415796 422552 420445 422775 422945 417446 418015 424710 427256 418569 419004 422253 420284 422610
11756D22610J5L126m988J744O766j317j9P024N342r40K723L042Q977m67O4K35
$$ 422610 422625 425751 420763 422507 429273 427956 427937 434961 440303 439363 442086 445128 454105 453638 453702 453937
11740D53937j116O1j887R70J607Q338k254r980m003J237M078N501J100L032Q30
$$ 453937 452821 452882 450995 451965 453572 461910 459656 449676 445673 446910 450988 456489 457589 460621 461451
11725D61451m952%m00K073J305j051Q116M556k175N273Q356K797n973q277O006
$$ 461451 456499 456499 456099 458172 459477 458426 466542 471098 468923 474196 482552 485349 479376 471099 477105
11710D77105Q808N998O745M302k379j216o344r61K426N127O967m548M365j812
$$ 477105 485913 491911 498656 502958 500579 499363 493019 492058 494484 499611 506578 502030 506395 504583
11696E04583Q925K341N90m173j739L409P939R72j813j84j512j050M107L15K565
$$ 504583 513508 515849 516439 512266 510527 513936 521875 522847 521034 520850 519338 518288 522395 522710 525275
11681E25275J027l003j550l809P377P248N267m03j694K593M110l729K624L860
$$ 525275 526302 523299 521749 517940 525317 532565 537832 537429 535735 538328 542438 538709 541333 545193
11667E45193J422K61J742L530O738L87K395L891K454P55q11J655J017Q91M47L761
$$ 545193 546615 546876 548618 552148 558886 559273 561668 565559 568013 568768 567957 569612 570629 571520 571967 575728
11651E75728l78k978m788k633k310K70Q984M831j315J342k45j803K438L363l09
$$ 575728 575350 572372 567584 564951 562641 562911 571895 576726 575411 576753 576508 574705 577143 580506 580197
11636E80197J73K040P220q85k96l188j569M303j574l539M53N458P936J0759j979
$$ 580197 580370 582410 589630 588745 588449 585261 583692 587995 586421 582882 583335 588793 596729 607488 605509
11621F05509p02j500k535M86M724N518K477K56Q38p50o89k059L095Q346P663q163
$$ 605509 604807 603307 600772 601258 605982 611500 613977 614233 615071 614321 613632 611573 614668 623014 630677 622514
11605F22514k179J2175R746j171r694j0795m54Q616R321L205L172M93j940n406
$$ 622514 620335 632510 642256 641085 631391 620596 620142 628758 638079 641284 644456 644949 643009 637603
11591F37603J028K019P460Q472n573l357o23n401O993O841N112l494Q791L780
$$ 637603 638631 640650 648110 656582 651009 647652 647029 641628 648621 655462 660574 657080 665871 669651
11577F69651J6P030K485m310n213N17r96L71M150N003M14M103R964N039j824j649
$$ 669651 669667 676697 679182 674872 669659 670176 669180 669551 673701 678704 679118 683221 693185 698224 696400 694751
11561F94751K037R2O293l046r252l74R02K185P868J514j86P47K737J997J152J177
$$ 694751 696788 696880 703173 700127 690875 690501 691403 693588 701456 702970 702784 703531 706268 708265 709417 710594
11545G10594M673j038J630K702k460q034j30R851L375o613K711J2784Q175O76
$$ 710594 715267 714229 715859 718561 716101 708067 707937 717788 721163 714550 717261 730045 738220 738896
11531G38896l09J635l573N80l124j65J344O326N169j406l782O831R027l89J778
$$ 738896 738587 740222 736649 737229 734105 733940 735284 741610 746779 745373 741591 748422 757449 757060 758838
11516G58838j796l808J212P050K127M985Q319L325P11m878l763l4l661J867o68
$$ 758838 757042 753234 754446 761496 763623 768608 776927 780252 780963 776085 772322 772288 768627 770494 769826
11501G69826L532L903j202P342N293l242N949M721O375j660M888k183R59K181
$$ 769826 773358 777261 776059 783401 788694 785452 791401 796122 802497 800837 805725 803542 804501 806682
11487H06682L390j927r042N88j608Q852Q674Q213m58r07o845k368M435L522j729
$$ 806682 810072 808145 799103 799691 798083 806935 815609 823822 823364 822457 815612 813244 817679 821201 819472
11472H19472m004K121M798N473P633M391M201m314j929K586J188K143j959R690
$$ 819472 815468 817589 822387 827860 835493 839884 844085 839771 837842 840428 841616 843759 841800 851490
11458H51490N342q439m577k679j694J0981N686J693K919j5l15K253M641L490k911
$$ 851490 856832 848393 843816 841137 839443 850424 856110 857803 860722 860707 860392 862645 867286 870776 867865
11443H67865m563R407Q242L230k048j319M873J231M431P63k412M906P397j991
$$ 867865 863302 872709 880951 884181 882133 880814 885687 886918 891349 892112 889700 894606 902003 900012
11429I00012k23P073l110k881K740K810L904K354j395j452M481Q262R453L119
$$ 900012 899789 906862 903752 900871 903611 906421 910325 912679 911284 909832 914313 922575 932028 935147
11415I35147l199m140k758L395K780J000N25j267o58L813Q708r55Q935M799l412
$$ 935147 931948 927808 925050 928445 931225 932225 932750 931483 930825 934638 943346 942391 951326 956125 952713
11400I52713o958j523K013p7O045K434Q22o25p028L250R918m7m52J884K976M811
$$ 952713 945755 944232 946245 946168 952213 954647 955469 954844 947816 951066 960984 960937 960485 962369 965345 970156
11384I70156M711J817k645l713k874l657L603K749J0576R312n45l436K886M291
$$ 970156 974867 976684 974039 970326 967452 963795 967398 970147 980723 990035 989490 986054 988940 993231
11370I93231Q464N345k017l536R181O462j959j359K299K122k738O284Q265k507
$$ 993231 1001695 1007040 1005023 1001487 1010668 1017130 1015171 1013812 1016111 1018233 1015495 1021779 1030044 1027537
11356A027537k146Q64j578J847K442l362l899O167O50J334M383R894P808n565
$$ 1027537 1025391 1026255 1024677 1026524 1028966 1025604 1021705 1027872 1028522 1029856 1034239 1044133 1051941 1046376
11342A046376r386O89O374O188L758J81k599j52Q702J0785P685M431J717l108
$$ 1046376 1036990 1037679 1044053 1050241 1053999 1054180 1051581 1051429 1060131 1070916 1078601 1083032 1084749 1081641
11328A081641J381P846P801j8K173l245k857K894K335M309L71P61L761J066q303
$$ 1081641 1083022 1090868 1098669 1098651 1100824 1097579 1094722 1097616 1099951 1104260 1104631 1105392 1109153 1110219 1101916
11313A101916p559Q399N204L104O087M883J722L19K608M823R743l718P15M466
$$ 1101916 1094357 1102756 1107960 1111064 1117151 1122034 1123756 1124075 1126683 1131506 1141249 1137531 1138246 1142712
11299A142712L94j192N425L030N761M264J548M833J0037j77l489L747K947k787
$$ 1142712 1143106 1141914 1147339 1150369 1156130 1160394 1161942 1166775 1176812 1176635 1173146 1176893 1179840 1177053
11285A177053L0M851K138m991n38J609N849Q732K465r397m775P361Q962O768P405
$$ 1177053 1177083 1181934 1184072 1179081 1178543 1180152 1186001 1194733 1197198 1187801 1183026 1190387 1199349 1206117 1213522
11270A213522r91n298p153P04J1630Q060r40M520N105k308L354j409L413J2337
$$ 1213522 1212531 1207233 1200080 1200784 1212414 1220474 1219534 1224054 1229159 1226851 1230205 1228796 1232209 1244546
11256A244546J188l67o867l81k367k674O587K115p92L203M241J3374O942l424
$$ 1244546 1245734 1245367 1238500 1238119 1235752 1233078 1239665 1241780 1240988 1244191 1248432 1261806 1268748 1265324
11242A265324m54O483K458k735N956R000J841j603K93N174O090m195K276O799
$$ 1265324 1264870 1271353 1273811 1271076 1277032 1286032 1287873 1286270 1286563 1291737 1297827 1293632 1295908 1302707
11228A302707k322J743O458o225r02N052J428k183O124J6606J1523L572m214J498
$$ 1302707 1300385 1302128 1308586 1302361 1301459 1306511 1307939 1305756 1311880 1328486 1340009 1343581 1339367 1340865
11214A340865O483J846J117j401P239M432q283j424P734j554r219P279J594M289
$$ 1340865 1347348 1349194 1350311 1348910 1356149 1360581 1352298 1350874 1358608 1357054 1347835 1355114 1356708 1360997
11200A360997L759L515O785J687K019O504P191O026j493m670N402J066m602K28
$$ 1360997 1364756 1368271 1375056 1376743 1378762 1385266 1392457 1398483 1396990 1392320 1397722 1398788 1394186 1394414
11186A394414N800J585M837M320M836J0008R470L498J221p51J705k994K391J671
$$ 1394414 1400214 1401799 1406636 1410956 1415792 1425800 1435270 1438768 1439989 1439238 1440943 1437949 1440340 1442011
11172A442011j137O80J3921L907j75J704M318Q351L829j426L072P462M957Q277
$$ 1442011 1440874 1441554 1455475 1459382 1459207 1460911 1465229 1473580 1477409 1475983 1479055 1486517 1491474 1499751
11158A499751j484q158J927N518L673M194J932o295j72M236R359J3393O258M190
$$ 1499751 1498267 1490109 1492036 1497554 1501227 1505421 1507353 1501058 1500886 1505122 1514481 1527874 1534132 1538322
11144A538322P261n860n506L172O915K448K968M600L249K351P346Q170o198m020
$$ 1538322 1545583 1539723 1534217 1537389 1544304 1546752 1549720 1554320 1557569 1559920 1567266 1575436 1569238 1565218
11130A565218M334rN568N480Q080O447K768M733J2543K118p368j4008Q190J0506
$$ 1565218 1569552 1569543 1575111 1580591 1588671 1595118 1597886 1602619 1615162 1617280 1609912 1595904 1604094 1614600
11116A614600N372Q176J767O38O658Q419L839O097m24j615o050M054L606P507
$$ 1614600 1619972 1628148 1629915 1630553 1637211 1645630 1649469 1655566 1655142 1653527 1647477 1651531 1655137 1662644
11102A662644R277J2085M312N969L425j036NN594P36M707K832R76J0013P089Q051
$$ 1662644 1671921 1684006 1688318 1694287 1697712 1696676 1696681 1702275 1703011 1707718 1710550 1711526 1721539 1728628 1736679
11087A736679r84n025L644O136P814N620O966J0734N837j603J58k696p56J2444
$$ 1736679 1735695 1730670 1734314 1740450 1748264 1753884 1760850 1771584 1777421 1775818 1775976 1773280 1772524 1784968
11073A784968J4384R384P841L497k255M482J2647M609K229m538L492J73L435J0735
$$ 1784968 1799352 1808736 1816577 1820074 1817819 1822301 1834948 1839557 1841786 1837248 1840740 1840913 1844348 1855083
11059A855083Q770L735R346O34j063M305P509O740N563Q709Q982Q863J952R376
$$ 1855083 1863853 1867588 1876934 1877568 1876505 1880810 1888319 1895059 1900622 1909331 1918313 1927176 1929128 1938504
11045A938504J2508L970L082Q369M831K354J659Q640J4251Q893O364N593J6693
$$ 1938504 1951012 1954982 1958064 1966433 1971264 1973618 1975277 1983917 1998168 2007061 2013425 2019018 2035711
11032B035711J3558R029J4023P971O001n38j0949k5652k4815k492n78Q141R064
$$ 2035711 2049269 2058298 2072321 2080292 2086293 2085755 2074806 2049154 2024339 2021847 2021269 2029410 2038474
11019B038474q132j7371j0400j0002q248Q648J7645Q292P04K181J4414J0173P248
$$ 2038474 2030342 2012971 2002571 1992569 1984321 1992969 2010614 2018906 2019610 2021791 2036205 2046378 2053626
11006B053626J8822J5487R130N503O580J7090J3373M269J1633P501Q193O756O982
$$ 2053626 2072448 2087935 2097065 2102568 2109148 2126238 2139611 2143880 2155513 2163014 2171207 2177963 2184945
10993B184945R204J1924P184J0534J2304J2325Q404j753j1533l448j433M589m09
$$ 2184945 2194149 2206073 2213257 2223791 2236095 2248420 2256824 2255071 2243538 2240090 2238657 2243246 2242837
10980B242837m638n298o575j2625k4997k8899k2582j4493j364J2187Q491N36M085
$$ 2242837 2238199 2232901 2226326 2213701 2188704 2159805 2137223 2122730 2121366 2133553 2142044 2142580 2146665
10967B146665R289n709o566M493L618N693P684Q844J3335J5133J2154R897J0082
$$ 2146665 2155954 2150245 2143679 2148172 2151790 2157483 2165167 2174011 2187346 2202479 2214633 2224530 2234612
10954B234612J3372J2011J4929R576J1403J4127J5026J8207J6219J6575J1158
$$ 2234612 2247984 2259995 2274924 2284500 2295903 2310030 2325056 2343263 2359482 2376057 2387215
10943B387215P675J0497J1924P146M34k0053k1850j5492j1029m035O337J8130
$$ 2387215 2394890 2405387 2417311 2424457 2424891 2404838 2382988 2367496 2356467 2352432 2358769 2376899
10931B376899J7831J6906M092N50o487j5747j9981o136p454L673P920P116J1563
$$ 2376899 2394730 2411636 2415728 2416278 2409791 2394044 2374063 2367927 2360473 2364146 2372066 2379182 2390745
10918B390745J5575J7323K2537J3399J0069J0048P710J4357J7318J1175Q155J0862
$$ 2390745 2406320 2423643 2446180 2459579 2469648 2479696 2487406 2501763 2519081 2530256 2538411 2549273
10906B549273Q321O564J0207J3888K3456J3494J4426J3523O253k489l485K210
$$ 2549273 2557594 2564158 2574365 2588253 2611709 2625203 2639629 2653152 2659405 2656916 2653431 2655641
10894B655641J1652R381R098O293J4540J6378J6527P278N208O925J5440J2730
$$ 2655641 2667293 2676674 2685772 2692065 2706605 2722983 2739510 2746788 2751996 2758921 2774361 2787091
10882B787091J0399N521R94Q766J7082J1446R289J4084J5389R540P583N625J2221
$$ 2787091 2797490 2803011 2804005 2812771 2829853 2841299 2850588 2864672 2880061 2889601 2897184 2902809 2915030
10869B915030P992Q305j546j970P44J8418J3406L425O885J3559Q086Q416J0876
$$ 2915030 2923022 2931327 2929781 2927811 2928555 2946973 2960379 2963804 2970689 2984248 2992334 3000750 3011626
10856C011626J4562P558M745J6132K1879J5710O865J8385J2007J0051Q848J3657
$$ 3011626 3026188 3033746 3038491 3054623 3076502 3092212 3099077 3117462 3129469 3139520 3148368 3162025
10844C162025J2837J1408J3337J2347J6129J5103J1507K1449K2629J4875L123
$$ 3162025 3174862 3186270 3199607 3211954 3228083 3243186 3254693 3276142 3298771 3313646 3316769
10833C316769R508J3378J0523P259J2309J2783J4556Q913R636J316N281Q382J2214
$$ 3316769 3326277 3339655 3350178 3357437 3369746 3382529 3397085 3405998 3415634 3416950 3422231 3430613 3442827
10820C442827J7027J7488J0760K244Q094J7344J9026J4984J2086J6083J2408J6494
$$ 3442827 3459854 3477342 3488102 3490346 3498440 3515784 3534810 3549794 3561880 3577963 3590371 3606865
10808C606865J6442J9456K0978J4996J4951J8225Q270J5226J6056J0255J9780
$$ 3606865 3623307 3642763 3663741 3678737 3693688 3711913 3720183 3735409 3751465 3761720 3781500
10797C781500K8633J9373J9632K4177J3805J5611K0198K4008K1396J8224J5282
$$ 3781500 3810133 3829506 3849138 3873315 3887120 3902731 3922929 3946937 3968333 3986557 4001839
10786D001839J6039K2658J0476R424J5853J6677J9805J8452J5967J6691J8317
$$ 4001839 4017878 4040536 4051012 4060436 4076289 4092966 4112771 4131223 4147190 4163881 4182198
10775D182198J8600J7702K0806J9136J4283K1989K4356J9726K2451K7086K6291
$$ 4182198 4200798 4218500 4239306 4258442 4272725 4294714 4319070 4338796 4361247 4388333 4414624
10764D414624K2455K9610K3857K2268L4120K1282K3785K9533K6739J8706K6052
$$ 4414624 4437079 4466689 4490546 4512814 4546934 4568216 4592001 4621534 4648273 4666979 4693031
10753D693031K8166K7235K1628K1821K2540K9189L1404K9358K8291K2640K1138
$$ 4693031 4721197 4748432 4770060 4791881 4814421 4843610 4875014 4904372 4932663 4955303 4976441
10742D976441J3014J6567J8454K3695L0717L7217L3659K8634K6463L4010L7012
$$ 4976441 4989455 5006022 5024476 5048171 5078888 5116105 5149764 5178398 5204861 5238871 5275883
10731E275883M1851L3353L0210K8607L3705M3858L9453L1517K8835L4795M4181
$$ 5275883 5317734 5351087 5381297 5409904 5443609 5487467 5526920 5558437 5587272 5622067 5666248
10720E666248M1238M0772M6176M6500M1560L8056M6825M5775M0859M4664M1844
$$ 5666248 5707486 5748258 5794434 5840934 5882494 5920550 5967375 6013150 6054009 6098673 6140517
10709F140517L9541N4018M6608M3590N0866N1781M9916N0355N0806N0092N4771
$$ 6140517 6180058 6234076 6280684 6324274 6375140 6426921 6476837 6527192 6577998 6628090 6682861
10698F682861M9704L6754M1716M7870N7855N8817N7537O1894O2373P0143O8386
$$ 6682861 6732565 6769319 6811035 6858905 6916760 6975577 7033114 7095008 7157381 7227524 7295910
10687G295910O6509O8793O9449O7404P8448P3090Q0454Q8609Q6561Q7714Q5190
$$ 7295910 7362419 7431212 7500661 7568065 7646513 7719603 7800057 7888666 7975227 8062941 8148131
10676H148131Q3501Q6224R5654R4263R9677J06579J10651J16026J04318J05262
$$ 8148131 8231632 8317856 8413510 8507773 8607450 8714029 8824680 8940706 9045024 9150286
10666I150286J15211J20454J20073J21933J28777J32475J37124J33982J40340
$$ 9150286 9265497 9385951 9506024 9627957 9756734 9889209 10026333 10160315 10300655
10657A0300655J43413J55028J64937J75985J87313J85556J88357J99586K18190
$$ 10300655 10444068 10599096 10764033 10940018 11127331 11312887 11501244 11700830 11919020
10648A1919020K27884K41384K49696K65016K83565K98560L24484L44342L56655
$$ 11919020 12146904 12388288 12637984 12903000 13186565 13485125 13809609 14153951 14510606
10639A4510606L73829L71787L91049M31717M74443N18201N55186N66271N28889
$$ 14510606 14884435 15256222 15647271 16078988 16553431 17071632 17626818 18193089 18721978
10630A8721978M55619L78465L73898M72097O35701Q08857R58615J006158R10476
$$ 18721978 19177597 19556062 19929960 20402057 21037758 21846615 22805230 23811388 24721864
10621B4721864P86714P96732Q71373Q48271M03712j064413l567053n745150o185647
$$ 24721864 25508578 26305310 27176683 28024954 28428666 27364253 23797200 18052050 11866403
10612A1866403m877578k505076o64038l39860j035316j565775j004011j3374M13902
$$ 11866403 6988825 4483749 3819711 3479851 2444535 878760 -125251 -138625 275277
10603B75277L70856M70705Q92244J278092J441739J451948J369388J217573J081668
$$ 275277 646133 1116838 2009082 3287174 4728913 6180861 7550249 8767822 9849490
10594I849490J043498J092632J134298J171130J228984J291621J303545J277821
$$ 9849490 10892988 11985620 13119918 14291048 15520032 16811653 18115198 19393019
10586A9393019J242150J215892J268338J385341J206025P66024K81986l45026
$$ 19393019 20635169 21851061 23119399 24504740 25710765 26476789 26758775 26413749
10578B6413749j034584j276938q75148m70906n27906j285590k831518m340257
$$ 26413749 25379165 24102227 23227079 22756173 22228267 20942677 18111159 13770902
10570A3770902n017135n305301n492468m752836l272906k499966k465637k481481
$$ 13770902 8753767 3448466 -2044002 -6796838 -10069744 -12569710 -15035347 -17516828
10562a7516828j875481r86537m65274m05682o18525m67313L68367J021807J138716
$$ -17516828 -19392309 -20378846 -20844120 -21249802 -21868327 -22335640 -21967273 -20945466 -19806750
10553a9806750J143262J281715J411417J352888J135341R74753J021978J166751
$$ -19806750 -18663488 -17381773 -15970356 -14617468 -13482127 -12507374 -11485396 -10318645
10545a0318645J258893J235628J131811J059539J091286J197882J379976J601556
$$ -10318645 -9059752 -7824124 -6692313 -5632774 -4541488 -3343606 -1963630 -362074
10537c62074J820854J997901J981599J522078M90989j049131k340371k301534
$$ -362074 1458780 3456681 5438280 6960358 7451347 6402216 4061845 1760311
10529A760311j469404q21796o01217r80311k473544n004430o680514o034480l645432
$$ 1760311 290907 -530889 -1132106 -2112417 -4585961 -9590391 -16270905 -22305385 -25950817
10520b5950817j439599o66184m47615Q9221P37152J157948J307844J167135Q94411
$$ -25950817 -27390416 -28056600 -28504215 -28414994 -27677842 -26519894 -25212050 -24044915 -23150504
10511b3150504O84923N54213M90686N28098N93299O40845O94429P16166O76663
$$ -23150504 -22465581 -21911368 -21420682 -20892584 -20299285 -19658440 -18964011 -18247845 -17571182
10502a7571182O14895N49944M96047M67732M62792M49992M18719M05826L80106
$$ -17571182 -16956287 -16406343 -15910296 -15442564 -14979772 -14529780 -14111061 -13705235 -13325129
10493a3325129L53259L24975L08284K96695K76728K58196K44863K29392K30684
$$ -13325129 -12971870 -12646895 -12338611 -12041916 -11765188 -11506992 -11262129 -11032737 -10802053
10484a0802053K23815K09408J96934J89119J82806J82904J74354J63520J57353
$$ -10802053 -10578238 -10368830 -10171896 -9982777 -9799971 -9617067 -9442713 -9279193 -9121840
10475i121840J52124J45769J46195J38179J29387J26216J23875J17334J15015
$$ -9121840 -8969716 -8823947 -8677752 -8539573 -8410186 -8283970 -8160095 -8042761 -7927746
10466g927746J17352J22851J09215J05360J01070R3602R6033R9632R2150R4631
$$ -7927746 -7810394 -7687543 -7578328 -7472968 -7371898 -7278296 -7182263 -7082631 -6990481 -6895850
10456f895850R2627R2467P7209P2312P7303P8028P8566P0828O8374O4804O7084
$$ -6895850 -6803223 -6710756 -6633547 -6561235 -6483932 -6405904 -6327338 -6256510 -6188136 -6123332 -6056248
10445f056248P2658P3247O6104O1463N8637O6552O0445N6706N8788O2334N8329
$$ -6056248 -5983590 -5910343 -5844239 -5782776 -5724139 -5657587 -5597142 -5540436 -5481648 -5419314 -5360985
10434e360985N4190M7951N3222O0800N4833N2593N1466M8875N1019N4383N7950
$$ -5360985 -5306795 -5258844 -5205622 -5144822 -5089989 -5037396 -4985930 -4937055 -4886036 -4831653 -4773703
10423d773703M5198L7896M2517N0089N1453M2958L3415M2636M6008L9231M2871
$$ -4773703 -4728505 -4690609 -4648092 -4598003 -4546550 -4503592 -4470177 -4427541 -4381533 -4342302 -4299431
10412d299431M0006L8583L6581L4127M4055M0976L5936L0279L3237L2432L0045
$$ -4299431 -4259425 -4220842 -4184261 -4150134 -4106079 -4065103 -4029167 -3998888 -3965651 -3933219 -3903174
10401c903174K9122L0360L2140L3183L9429L5877L1147K2863K8369L2494L5233
$$ -3903174 -3874052 -3843692 -3811552 -3778369 -3738940 -3703063 -3671916 -3649053 -3620684 -3588190 -3552957
10390c552957L6300L1957K2518J6162K8709K2238K5348K3228K2552K3943K8852
$$ -3552957 -3516657 -3484700 -3462182 -3446020 -3417311 -3395073 -3369725 -3346497 -3323945 -3300002 -3271150
10379c271150L4603K8424K2855K6160K8692K4946K7453K2168K2285K9042K3732
$$ -3271150 -3236547 -3208123 -3185268 -3159108 -3130416 -3105470 -3078017 -3055849 -3033564 -3004522 -2980790
10368b980790K4304L0305K5774K3046K3330J9606J0503K3342K7590K5199K9228
$$ -2980790 -2956486 -2926181 -2900407 -2877361 -2854031 -2834425 -2823922 -2800580 -2772990 -2747791 -2718563
10357b718563K3205K0889K8845K3431K0026K9328K1082K0353J7915J6918J8627
$$ -2718563 -2695358 -2674469 -2645624 -2622193 -2602167 -2572839 -2551757 -2531404 -2513489 -2496571 -2477944
10346b477944J9666K4090K1054J8762J9485J3426J3542J9816J9164J4553J9727
$$ -2477944 -2458278 -2434188 -2413134 -2394372 -2374887 -2361461 -2347919 -2328103 -2308939 -2294386 -2274659
10335b274659K2713J7994J3796J9522K2695J5847K0214J5236J5668J5616J2116
$$ -2274659 -2251946 -2233952 -2220156 -2200634 -2177939 -2162092 -2141878 -2126642 -2110974 -2095358 -2083242
10324b083242J6371K5015J5476J6395J9871K0826J4140J6006K0574J1741Q255
$$ -2083242 -2066871 -2041856 -2026380 -2009985 -1990114 -1969288 -1955148 -1939142 -1918568 -1906827 -1898572
10313a898572J8924K1547J9814K1436K0385J8790R100N500K0532K4127J8821K0320
$$ -1898572 -1879648 -1858101 -1838287 -1816851 -1796466 -1777676 -1768576 -1763076 -1742544 -1718417 -1699596 -1679276
10301a679276J4902J4710J1000Q524J2526J4714J3936J1938J5550J2786J4070
$$ -1679276 -1664374 -1649664 -1638664 -1630140 -1617614 -1602900 -1588964 -1577026 -1561476 -1548690 -1534620
10290a534620J8380J7760J4078J2541J1872J8790J6437J5107J7974J1647M568
$$ -1534620 -1516240 -1498480 -1484402 -1471861 -1459989 -1441199 -1424762 -1409655 -1391681 -1380034 -1375466
10279a375466Q938J5928J2358J4865K0563J8003J5106J0054L427J1450K7042J5003
$$ -1375466 -1366528 -1350600 -1338242 -1323377 -1302814 -1284811 -1269705 -1259651 -1256224 -1244774 -1217732 -1202729
10267a202729J4226R318Q673J4755K0177K1579J7607R549K0026J6693J2010J4713
$$ -1202729 -1188503 -1179185 -1170512 -1155757 -1135580 -1114001 -1096394 -1086845 -1066819 -1050126 -1038116 -1023403
10255a023403J4590J6589J5586J5165J7655J3842R033J8880J6925J2101K2234
$$ -1023403 -1008813 -992224 -976638 -961473 -943818 -929976 -920943 -902063 -885138 -873037 -850803
10244h50803K3057J7450K1676K3113Q946p94J179Q967J0257J1214K383r493n455
$$ -850803 -827746 -810296 -788620 -765507 -756561 -757355 -756176 -747209 -736952 -725738 -723355 -732848 -738303
10231g38303l658J677l684m357O426P593J1940J0747M529J3669J4456P250K308
$$ -738303 -741961 -740284 -743968 -748325 -741899 -734306 -722366 -711619 -707090 -693421 -678965 -671715 -669407
10218f69407J8663K0212K5350J6155J6045K0821K1765K5199K6947J2421K45O152
$$ -669407 -650744 -630532 -605182 -589027 -572982 -552161 -530396 -505197 -478250 -465829 -465584 -459432
10206d59432J8529K2286Q268J1121J3085J946l776J142k143K130J1735P148R489
$$ -459432 -440903 -418617 -410349 -399228 -386143 -384197 -387973 -386831 -388974 -386844 -375109 -367961 -358472
10193c58472L997k433q535n23m864j1517o900O336J4978K1829J8801J5282P725
$$ -358472 -354475 -356908 -365443 -365966 -370830 -382347 -389247 -382911 -367933 -346104 -327303 -312021 -304296
10180c04296Q64k221k440l396j0340oJ5346J5779K0503J9469J1381K1693K0587
$$ -304296 -303432 -305653 -308093 -311489 -321829 -321835 -306489 -290710 -270207 -250738 -239357 -217664 -197077
10167a97077K1603K2776R945J080L246Q280R57P747R061J1358J7549O202j4959
$$ -197077 -175474 -152698 -142753 -141673 -138427 -130147 -129190 -121443 -112382 -101024 -83475 -77273 -92232
10154i2232j9766j4151j3533n869J1850K2530J2408N130k414k44Q086R694O138
$$ -92232 -111998 -126149 -139682 -145551 -133701 -111171 -98763 -93633 -96047 -96291 -88205 -78511 -72373
10141g2373P652m50O551N269N219M922J8567J7379J1636K0682J7736K2322J9213
$$ -72373 -64721 -65171 -58620 -53351 -48132 -43210 -24643 -7264 4372 25054 42790 65112 84325
10128H4325R753J5727J9207K2539J9356K0853K4016J7384N350k250Q367J0714
$$ 84325 94078 109805 129012 151551 170907 191760 215776 233160 238510 236260 244627 255341
10116B55341J0801J3897J2956Q781n225q364p920r081n840J1117R547p369p352
$$ 255341 266142 280039 292995 301776 296551 288187 280267 271186 265346 276463 286010 278641 271289
10103B71289N180J1565K0627K3469K4203K0824J6636K0702J6214J0947J2326J6013
$$ 271289 276469 288034 308661 332130 356333 377157 393793 414495 430709 441656 453982 469995
10091D69995J4971K1955J7368J7624K1975K4768R606J3806K1797J0234J0109J4150
$$ 469995 484966 506921 524289 541913 563888 588656 598262 612068 633865 644099 654208 668358
10079F68358J0934J1475J4634J2124R786J3295J0951J0622J3652J3263N803J6153
$$ 668358 679292 690767 705401 717525 727311 740606 751557 762179 775831 789094 794897 811050
10067H11050J4122J1571P959J9252J2756J5295J9250J6164J3756J1239R779J5879
$$ 811050 825172 836743 844702 863954 876710 892005 911255 927419 941175 952414 962193 978072
10055I78072J9146J2658J5010K0165J6581K1388K3423J9097J5599J6506J7410
$$ 978072 997218 1009876 1024886 1045051 1061632 1083020 1106443 1125540 1141139 1157645 1175055
10044A175055J0608J1428J3515J4679J9471K1999J3322J1666R703J4426J3918
$$ 1175055 1185663 1197091 1210606 1225285 1244756 1266755 1280077 1291743 1301446 1315872 1329790
10033A329790J2482R654J2673J1574J0690M997J5491J8855J6130J6814J3231J6054
$$ 1329790 1342272 1351926 1364599 1376173 1386863 1391860 1407351 1426206 1442336 1459150 1472381 1488435
10021A488435K2479J7287J5882K5911K0328J3280K0172J7825L0734J9363J3061
$$ 1488435 1510914 1528201 1544083 1569994 1590322 1603602 1623774 1641599 1672333 1691696 1704757
10010A704757J8230L037J6353L3382K5536K2872K5489J7141K6021K6686K1890
$$ 1704757 1722987 1726024 1742377 1775759 1801295 1824167 1849656 1866797 1892818 1919504 1941394
9999A941394K0157J9347K1788J7237J5294K0285J7832K0473K3701J9689K2292
$$ 1941394 1961551 1980898 2002686 2019923 2035217 2055502 2073334 2093807 2117508 2137197 2159489
9988B159489K1207J5228J4123K1198K0922J3876J6556K1440K6744K7916K4245
$$ 2159489 2180696 2195924 2210047 2231245 2252167 2266043 2282599 2304039 2330783 2358699 2382944
9977B382944K7420L6345L6089K8397K1015J6924K6256L1908L0030L3630K7795
$$ 2382944 2410364 2446709 2482798 2511195 2532210 2549134 2575390 2607298 2637328 2670958 2698753
9966B698753K8187J9932K0561L5537K7003K4467L2688L2415L2821L2311L0042
$$ 2698753 2726940 2746872 2767433 2802970 2829973 2854440 2887128 2919543 2952364 2984675 3014717
9955C014717K6030K8790K8965K3026J7393M415J0310K1336L2646L8740L1717K8545
$$ 3014717 3040747 3069537 3098502 3121528 3138921 3143336 3153646 3174982 3207628 3246368 3278085 3306630
9943C306630L6453L4450M1360M1370L9324M3365L9237M0754M2726M2477M8878
$$ 3306630 3343083 3377533 3418893 3460263 3499587 3542952 3582189 3622943 3665669 3708146 3757024
9932C757024L8001K9231M0044N1651M7043M9102M7847M6031M2863M3601N1584
$$ 3757024 3795025 3824256 3864300 3915951 3962994 4012096 4059943 4105974 4148837 4192438 4244022
9921D244022M4867M6057M3624M6240M6690N3052N5309N4148N4477N8142O3651
$$ 4244022 4288889 4334946 4378570 4424810 4471500 4524552 4579861 4634009 4688486 4746628 4810279
9910D810279N3476N0879N6597N5653N2636N1614M7569N6294O2565P1306P1889
$$ 4810279 4863755 4914634 4971231 5026884 5079520 5131134 5178703 5234997 5297562 5368868 5440757
9899E440757P7193P6696O6840P3626Q2883P7642P4743Q5173Q8098Q1279Q7974
$$ 5440757 5517950 5594646 5661486 5735112 5817995 5895637 5970380 6055553 6143651 6224930 6312904
9888F312904R5182J01575J02643R8353J02986J05395J01879J09707J17980J20183
$$ 6312904 6408086 6509661 6612304 6710657 6813643 6919038 7020917 7130624 7248604 7368787
9878G368787J13356J18197J17659J22719J32430J40059J49668J50682J49878J56126
$$ 7368787 7482143 7600340 7717999 7840718 7973148 8113207 8262875 8413557 8563435 8719561
9868H719561J59451J62708J66333J69959J87831J96953K02848K10138K18393K31179
$$ 8719561 8879012 9041720 9208053 9378012 9565843 9762796 9965644 10175782 10394175 10625354
9858A0625354K43023K62041K86432K92547L01672L19644L37761L63709L97828
$$ 10625354 10868377 11130418 11416850 11709397 12011069 12330713 12668474 13032183 13430011
9849A3430011M28483M66032M98558N38224N91221O49680P13620P47798P40284
$$ 13430011 13858494 14324526 14823084 15361308 15952529 16602209 17315829 18063627 18803911
9840A8803911O75820N16782L44172L35695N42345Q70988J086427R97058P04117
$$ 18803911 19479731 19996513 20340685 20676380 21218725 22089713 23176140 24173198 24877315
9831B4877315L78824O9966p1088K81672J014726J336487L86704k318288o208872
$$ 24877315 25256139 25326105 25255017 25536689 26551415 27887902 28274606 25956318 19747446
9822A9747446q932833q276762m652240j021869P72681J176045Q18395N9459r02940
$$ 19747446 10814613 2537851 -2114389 -3136258 -2363577 -1187532 -369137 -309678 -1212618
9813a212618j677245j730229q35895M51768J253326J501306J518650J482213J417847
$$ -1212618 -2889863 -4620092 -5455987 -5004219 -3750893 -2249587 -730937 751276 2169123
9804B169123J338373J300292J375311J509998J604314J647933J667394J624355
$$ 2169123 3507496 4807788 6183099 7693097 9297411 10945344 12612738 14237093
9796A4237093J474095J268446R99187P11609L54909j850k8046K47831N76730Q63480
$$ 14237093 15711188 16979634 17978821 18690430 19045339 19043489 19015443 19263274 19840004 20703484
9786B0703484Q75124K88939o48519j598481k208265k137642j913275k426993l944682
$$ 20703484 21578608 21867547 21219028 19620547 17412282 15274640 13361365 10934372 6989690
9777F989690n993436q146053q376898n797151k862556j042297k24450Q6647R7601
$$ 6989690 996254 -7149799 -15526697 -21323848 -24186404 -25228701 -25453151 -25366504 -25268903
9768b5268903j1129k39323n26999n52195m4992O48664J020018J123190J242367
$$ -25268903 -25280032 -25519355 -26046354 -26598549 -26643541 -25994877 -24974859 -23851669 -22609302
9759b2609302J465470J625451J652094J596109J500579J372050J304617J317913
$$ -22609302 -21143832 -19518381 -17866287 -16270178 -14769599 -13397549 -12092932 -10775019
9751a0775019J331208J279904J184026J159477J248448J266879J062501O55488
$$ -10775019 -9443811 -8163907 -6979881 -5820404 -4571956 -3305077 -2242576 -1587088
9743a587088L03494J31808k36602q92560j272947j225503r51943n42399n24370
$$ -1587088 -1283594 -1151786 -1388388 -2280948 -3553895 -4779398 -5731341 -6273740 -6798110
9734f798110j320260k815369m088196m368664l506673k053008j028728o29656
$$ -6798110 -8118370 -10933739 -15021935 -19390599 -22897272 -24950280 -25979008 -26608664
9726b6608664l76734N5835N09295Q49731J067153J124970J065107R62961Q46950
$$ -26608664 -26985398 -26929563 -26420268 -25570537 -24503384 -23378414 -22313307 -21350346 -20503396
9717b0503396P17469N40782L41904K35733L02622M31200M79630M73309M60991
$$ -20503396 -19785927 -19245145 -18903241 -18667508 -18364886 -17933686 -17454056 -16980747 -16519756
9708a6519756M51749M32635M05307L81699L53582L30415L07057K84316K73794
$$ -16519756 -16068007 -15635372 -15230065 -14848366 -14494784 -14164369 -13857312 -13572996 -13299202
9699a3299202K54663K34245K19304K04314J98971K01662J97952J86291J77606
$$ -13299202 -13044539 -12810294 -12590990 -12386676 -12187705 -11986043 -11788091 -11601800 -11424194
9690a1424194J69017J60022J55994J54279J45680J37218J35289J35267J32101
$$ -11424194 -11255177 -11095155 -10939161 -10784882 -10639202 -10501984 -10366695 -10231428 -10099327
9681a0099327J19150J21438J18102J06862J00717J10265J13496J07142R7773R2867
$$ -10099327 -9980177 -9858739 -9740637 -9633775 -9533058 -9422793 -9309297 -9202155 -9104382 -9011515
9671i011515R0310R2209Q2449Q3168Q4501Q0277P9238Q2973P0419P3266P4133
$$ -9011515 -8921205 -8828996 -8746547 -8663379 -8578878 -8498601 -8419363 -8336390 -8265971 -8192705 -8118572
9660h118572P0887O6501O0256O4377O3490N7692O6268O6066N3428N3994N3935
$$ -8118572 -8047685 -7981184 -7920928 -7856551 -7793061 -7735369 -7669101 -7603035 -7549607 -7495613 -7441678
9649g441678N1592N7493O3995O2329M9832N0032N5711N2726M8971M6468M5653
$$ -7441678 -7390086 -7332593 -7268598 -7206269 -7156437 -7106405 -7050694 -6997968 -6948997 -6902529 -6856876
9638f856876M7220M4702M0616M3543M4169L7830N2639M8834M2553M3615M2870
$$ -6856876 -6809656 -6764954 -6724338 -6680795 -6636626 -6598796 -6546157 -6497323 -6454770 -6411155 -6368285
9627f368285L8935M0097K9011L9022M0166M0240L5250M1721L7989K6804K6739
$$ -6368285 -6329350 -6289253 -6260242 -6221220 -6181054 -6140814 -6105564 -6063843 -6025854 -5999050 -5972311
9616e972311K7503L5217L7396L2246L5844L4147L0000L1193L0965L2733K3559
$$ -5972311 -5944808 -5909591 -5872195 -5839949 -5804105 -5769958 -5739958 -5708765 -5677800 -5645067 -5621508
9605e621508K9437L3397L0834K9158K8328K6472K9733K3595K9649K2604K1587
$$ -5621508 -5592071 -5558674 -5527840 -5498682 -5470354 -5443882 -5414149 -5390554 -5360905 -5338301 -5316714
9594e316714K5383K6155K6531K7214K9450K5395K2582J4594J4595K2782K4144
$$ -5316714 -5291331 -5265176 -5238645 -5211431 -5181981 -5156586 -5134004 -5119410 -5104815 -5082033 -5057889
9583e057889K0427K1673K4630K6553K5647K1718J9856J9814K8380K5080J9168
$$ -5057889 -5037462 -5015789 -4991159 -4964606 -4938959 -4917241 -4897385 -4877571 -4849191 -4824111 -4804943
9572d804943J3881K0482J7658J6680K0890K6244K3198J1370J4961J8426K0338
$$ -4804943 -4791062 -4770580 -4752922 -4736242 -4715352 -4689108 -4665910 -4654540 -4639579 -4621153 -4600815
9561d600815K9458K4420J9470J6690K1874K3593J5315J1184J8513J8801J3040
$$ -4600815 -4571357 -4546937 -4527467 -4510777 -4488903 -4465310 -4449995 -4438811 -4420298 -4401497 -4388457
9550d388457R180J3765J3442J9014K0371J7430Q831J3437J1387J4862J3786J7368
$$ -4388457 -4379277 -4365512 -4352070 -4333056 -4312685 -4295255 -4286424 -4272987 -4261600 -4246738 -4232952 -4215584
9538d215584K2683J8915P429J8295J4036Q813J4865J7475J9504K1281J2158Q641
$$ -4215584 -4192901 -4173986 -4166557 -4148262 -4134226 -4125413 -4110548 -4093073 -4073569 -4052288 -4040130 -4031489
9526d031489J1120O611J9151K2108J1640P379Q094K3349K0184J4667J8550J7198
$$ -4031489 -4020369 -4013758 -3994607 -3972499 -3960859 -3953480 -3945386 -3922037 -3901853 -3887186 -3868636 -3851438
9514c851438J5417O866N276J4330J8070J6102K202M159J6808K2066J2687L500
$$ -3851438 -3836021 -3829155 -3823879 -3809549 -3791479 -3775377 -3773175 -3769016 -3752208 -3730142 -3717455 -3713955
9502c713955P019J5860R424j823J2203J0635P610N311O305J6206J7335J7395J2425
$$ -3713955 -3706936 -3691076 -3681652 -3683475 -3671272 -3660637 -3653027 -3647716 -3641411 -3625205 -3607870 -3590475 -3578050
9489c578050O152P042J1675J0913R071R118J4598J6150J7621J2034R344J3058
$$ -3578050 -3571898 -3564856 -3553181 -3542268 -3533197 -3524079 -3509481 -3493331 -3475710 -3463676 -3454332 -3441274
9477c441274J6042J0034O803P926J6843J7878M436R425J2809O005P484O420J0886
$$ -3441274 -3425232 -3415198 -3408395 -3400469 -3383626 -3365748 -3361312 -3351887 -3339078 -3333073 -3325589 -3319169 -3308283
9464c308283J1107J5519Q782J321P620R901M692Q741J0633R122J0728R233P814
$$ -3308283 -3297176 -3281657 -3272875 -3271554 -3263934 -3254033 -3249341 -3240600 -3229967 -3220845 -3210117 -3200884 -3193070
9451c193070R583Q277Q869J3567R591N231Q919R529M099J4107K0255J5442J7406
$$ -3193070 -3183487 -3175210 -3166341 -3152774 -3143183 -3137952 -3129033 -3119504 -3115405 -3101298 -3081043 -3065601 -3048195
9438c048195R700L815J5681Q123N308P454J5438K5657K6408K0841J7406K7864
$$ -3048195 -3038495 -3034680 -3018999 -3010876 -3005568 -2998114 -2982676 -2957019 -2930611 -2909770 -2892364 -2864500
9426b864500K0643J5154j7399n9925n9168j1088J6413K5396J4190J4763Q069m05
$$ -2864500 -2843857 -2828703 -2846102 -2906027 -2965195 -2976283 -2959870 -2934474 -2920284 -2905521 -2897452 -2897857
9414b897857q808p388n415K950J0931O745R042J0078Q246Q793Q285Q035M994j422
$$ -2897857 -2906665 -2914053 -2919468 -2916518 -2905587 -2898842 -2889800 -2879722 -2871476 -2862683 -2854398 -2846363 -2841369 -2842791
9400b842791k275j4345j5938r273p360N035J0845J7994J9115J8412J8298J7749
$$ -2842791 -2845066 -2859411 -2875349 -2884622 -2891982 -2886947 -2876102 -2858108 -2838993 -2820581 -2802283 -2784534
9388b784534J4497J6853P871J2076K1898J5229J2343J0233J4659K046J0904J0911
$$ -2784534 -2770037 -2753184 -2745313 -2733237 -2711339 -2696110 -2683767 -2673534 -2658875 -2656829 -2645925 -2635014
9376b635014J4674J4780N159R55K958J24j784j992j0826q409j2807j1303o228
$$ -2635014 -2620340 -2605560 -2600401 -2599446 -2596488 -2596364 -2598148 -2600140 -2610966 -2619375 -2632182 -2643485 -2649713
9363b649713l894l256j47M925J0137L067q544k2000j9001j0762q077j1533r04
$$ -2649713 -2653607 -2656863 -2657010 -2652085 -2641948 -2638881 -2647425 -2669425 -2688426 -2699188 -2707265 -2718798 -2719702
9350b719702M590Q150J1979K0265K0124J2637J5321Q821N192J0937J5616K1853
$$ -2719702 -2715112 -2706962 -2694983 -2674718 -2654594 -2641957 -2626636 -2617815 -2612623 -2601686 -2586070 -2564217
9338b564217J4000J304O547J3077J5808J6046J0177J4137P607R456J8324K3539
$$ -2564217 -2550217 -2548913 -2542366 -2529289 -2513481 -2497435 -2487258 -2473121 -2465514 -2456058 -2437734 -2414195
9326b414195J3788K150q802j4912j1090n032p28K0R42P481J1402Q671O868r39
$$ -2414195 -2400407 -2398257 -2407059 -2421971 -2433061 -2438093 -2438821 -2438801 -2437859 -2430378 -2418976 -2410305 -2403437 -2404376
9312b404376j0425j3635j3197r762P55J0776J3627J8563J1944J6166J2119J9008
$$ -2404376 -2414801 -2428436 -2441633 -2451395 -2450640 -2439864 -2426237 -2407674 -2395730 -2379564 -2367445 -2348437
9300b348437J5813J1906Q096J0069J3846J2871J2371P240J3945K0997J5247J4478
$$ -2348437 -2332624 -2320718 -2312622 -2302553 -2288707 -2275836 -2263465 -2256225 -2242280 -2221283 -2206036 -2191558
9288b191558J1627M570J4716J3429J7101J5276J8105J5903J7632J2986K5822K2389
$$ -2191558 -2179931 -2175361 -2160645 -2147216 -2130115 -2114839 -2096734 -2080831 -2063199 -2050213 -2024391 -2002002
9276b002002J9329K5145K1846K0898J6329K6763L2259K7365L4684L8615M2869
$$ -2002002 -1982673 -1957528 -1935682 -1914784 -1898455 -1871692 -1839433 -1812068 -1777384 -1738769 -1695900
9265a695900M5096M2884N1152O2077P4277J01346J04994J07554J18867J15461
$$ -1695900 -1650804 -1607920 -1556768 -1494691 -1420414 -1319068 -1214074 -1106520 -987653 -872192
9255h72192Q8848J6667j61675m35031p32428q23023o10881k81535m0144P1118
$$ -872192 -783344 -766677 -928352 -1363383 -2095811 -2918834 -3529715 -3811250 -3851394 -3780276
9245c780276J05645J09563J08494J02322R4099P6249O4983N7947N0451M3249N0375
$$ -3780276 -3674631 -3565068 -3456574 -3354252 -3260153 -3183904 -3118921 -3060974 -3010523 -2967274 -2916899
9234b916899L4119L3564L5659L2939K5132J8070K6222K8975N121J3168K0162K2076
$$ -2916899 -2882780 -2849216 -2813557 -2780618 -2755486 -2737416 -2711194 -2682219 -2677098 -2663930 -2643768 -2621692
9222b621692K2479K0699K1632J5881J3389J2465R778J3033J3735J1266P034Q700
$$ -2621692 -2599213 -2578514 -2556882 -2541001 -2527612 -2515147 -2505369 -2492336 -2478601 -2467335 -2460301 -2451601
9210b451601Q087P831J2472Q752M121J1003J3152J5888J0098K725J686M553O339
$$ -2451601 -2443514 -2435683 -2423211 -2414459 -2410338 -2399335 -2386183 -2370295 -2360197 -2357472 -2355786 -2351233 -2344894
9197b344894j52p414M796J2227N772R440J5377p14p176Q175J1857J1293O715P489
$$ -2344894 -2345046 -2352460 -2347664 -2335437 -2329665 -2320225 -2304848 -2305562 -2312738 -2304563 -2292706 -2281413 -2274698 -2267209
9183b267209K891R273J220J564J1366Q042O657L818J752K197J2250P757J78l090
$$ -2267209 -2264318 -2255045 -2253825 -2252261 -2240895 -2232853 -2226196 -2222378 -2220626 -2218429 -2206179 -2198422 -2198244 -2201334
9169b201334p433P050J5513P579N770L873O553O610l123M288O092N640M506K468
$$ -2201334 -2208767 -2201717 -2186204 -2178625 -2172855 -2168982 -2162429 -2155819 -2158942 -2154654 -2148562 -2142922 -2138416 -2135948
9155b135948Q01j680P690O514M374K364j621J153O340O237O573j103l54M759K568
$$ -2135948 -2135147 -2136827 -2129137 -2122623 -2118249 -2115885 -2117506 -2116353 -2110013 -2103776 -2097203 -2098306 -2098660 -2093901 -2091333
9140b091333M936j277K525N679O135P730O527L832N498N622l023l678L277N611
$$ -2091333 -2086397 -2087674 -2085149 -2079470 -2073335 -2065605 -2059078 -2055246 -2049748 -2044126 -2047149 -2050827 -2047550 -2041939
9126b041939M935N613J0851j125m804K211O959K652O844l075pP749J037K773Q69
$$ -2041939 -2037004 -2031391 -2020540 -2021665 -2026469 -2024258 -2017299 -2014647 -2007803 -2010878 -2010885 -2003136 -2002099 -1999326 -1998457
9111a998457J0842K47K337K795N10J411j072J333J374O063m523J77M303P410L662
$$ -1998457 -1987615 -1987368 -1985031 -1982236 -1981726 -1980315 -1981387 -1980054 -1978680 -1972617 -1977140 -1976963 -1972660 -1965250 -1961588
9096a961588M881Q280J0589M665m99M32j6K290M408r60k926P499N642k971J865
$$ -1961588 -1956707 -1948427 -1937838 -1933173 -1933672 -1933240 -1933256 -1930966 -1926558 -1927518 -1930444 -1922945 -1917303 -1920274 -1918409
9081a918409O064L498K150J38K213K44O225k095p15J839M057j591Q971L898j79
$$ -1918409 -1912345 -1908847 -1906697 -1906559 -1904346 -1904102 -1897877 -1899972 -1900687 -1898848 -1894791 -1896382 -1887411 -1883513 -1883692
9066a883692K607j717m212L780P148o5M893O055O613P359L082l844N17J950R426
$$ -1883692 -1881085 -1882802 -1887014 -1883234 -1876086 -1876151 -1871258 -1865203 -1858590 -1851231 -1848149 -1851993 -1851476 -1849526 -1840100
9051a840100J244Q09O870K559J117m959k010O200K438J887N73l939o53O983m952
$$ -1840100 -1838856 -1838047 -1831177 -1828618 -1827501 -1832460 -1834470 -1828270 -1825832 -1823945 -1823372 -1827311 -1827964 -1820981 -1825933
9036a825933K593P767L960Q39J9K578K256L796Q612J795l877N379M961N770L619
$$ -1825933 -1823340 -1815573 -1811613 -1810774 -1810755 -1808177 -1805921 -1802125 -1793513 -1791718 -1795595 -1790216 -1785255 -1779485 -1775866
9021a775866K988M49J361k203m125j310O310N423O227P365K523K166j564l802
$$ -1775866 -1772878 -1772429 -1771068 -1773271 -1777396 -1778706 -1772396 -1766973 -1760746 -1753381 -1750858 -1748692 -1750256 -1754058
9007a754058m256P469L068q08L106J395K850O370R105l073q192n420l622O167
$$ -1754058 -1758314 -1750845 -1747777 -1748585 -1745479 -1744084 -1741234 -1734864 -1725759 -1728832 -1737024 -1742444 -1746066 -1739899
8993a739899J1304N509J90r06m646j060R444L043K299j57m01N653M784J645K176
$$ -1739899 -1728595 -1723086 -1722896 -1723802 -1728448 -1729508 -1720064 -1717021 -1714722 -1714879 -1715280 -1709627 -1704843 -1703198 -1701022
8978a701022p173l005J876N795j540J323P65K826O273J1J073K75K609k191m281
$$ -1701022 -1708195 -1711200 -1709324 -1703529 -1705069 -1703746 -1702981 -1700155 -1693882 -1693871 -1692798 -1692523 -1689914 -1692105 -1696386
8963a696386O200K205M687Q15L936R263R0J139j104M084J144K681P283m99r2j415
$$ -1696386 -1690186 -1687981 -1683294 -1682479 -1678543 -1669280 -1669190 -1668051 -1669155 -1665071 -1663927 -1661246 -1653963 -1654462 -1654554 -1655969
8947a655969k100N77k084J738L40m388J1556J0447M388k653L577N285K477m169
$$ -1655969 -1658069 -1657492 -1659576 -1657838 -1657498 -1661886 -1650330 -1639883 -1635495 -1638148 -1634571 -1629286 -1626809 -1630978
8933a630978l987M200Q05K488R027j622L929J1358Q96O347L190l802j643j049
$$ -1630978 -1634965 -1630765 -1629960 -1627472 -1618445 -1620067 -1616138 -1604780 -1603884 -1597537 -1594347 -1598149 -1599792 -1600841
8919a600841k1N757k136j902R38N518K501K583l503o6L005M349n66m978m737O888
$$ -1600841 -1600862 -1595105 -1597241 -1599143 -1598205 -1592687 -1590186 -1587603 -1591106 -1591172 -1588167 -1583818 -1584384 -1589362 -1594099 -1587211
8903a587211O795R186J185n790l001N476m066L5L820p54J108q74K707L085j067
$$ -1587211 -1580416 -1571230 -1570045 -1575835 -1578836 -1573360 -1577426 -1577391 -1573571 -1574325 -1573217 -1574091 -1571384 -1568299 -1569366
8888a569366L843Q197J83k252M455P410N734m484m853N888M959j489K02l395k444
$$ -1569366 -1565523 -1557326 -1557143 -1559395 -1554940 -1547530 -1541796 -1546280 -1551133 -1545245 -1540286 -1541775 -1541573 -1544968 -1547412
8873a547412P997M539n544O263K61O43R042K974L183k251n139J687P290L237L413
$$ -1547412 -1539415 -1534876 -1540420 -1534157 -1533896 -1533253 -1524211 -1521237 -1518054 -1520305 -1525444 -1523757 -1516467 -1513230 -1509817
8858a509817l326j435K966n62l816K376K977M295L329N150N549N967P31o447j2453
$$ -1509817 -1513143 -1514578 -1511612 -1512174 -1515990 -1513614 -1510637 -1506342 -1503013 -1497863 -1492314 -1486347 -1485616 -1492063 -1504516
8843a504516n699Q19l64R441N368k708l59n41L599N210M859M660N241j315R43
$$ -1504516 -1510215 -1509396 -1509760 -1500319 -1494951 -1497659 -1498018 -1498559 -1494960 -1489750 -1484891 -1480231 -1474990 -1476305 -1475362
8828a475362O518K494O082p599o778N939O267K419J12L931J35m286N55J143M310
$$ -1475362 -1468844 -1466350 -1460268 -1467867 -1474645 -1468706 -1462439 -1460020 -1459908 -1455977 -1455842 -1460128 -1459573 -1458430 -1454120
8813a454120k596j235R83q2k425N145L441m584n400P427R402j238L296j586K3
$$ -1454120 -1456716 -1457951 -1456968 -1457050 -1459475 -1454330 -1450889 -1455473 -1460873 -1453446 -1444044 -1445282 -1441986 -1443572 -1443549
8798a443549P55O702L830P91o084n9o88k971q25K154Q711N128K757O54k505J923
$$ -1443549 -1442794 -1436092 -1432262 -1431471 -1437555 -1437614 -1438302 -1441273 -1442098 -1439944 -1431233 -1426105 -1423348 -1422694 -1425199 -1423276
8782a423276l986j547P157K238j0285j201L148K183J258M097N290O714l319j21
$$ -1423276 -1427262 -1428809 -1421652 -1419414 -1429699 -1430900 -1427752 -1425569 -1424311 -1420214 -1414924 -1408210 -1411529 -1411650
8768a411650K099N827O724M194j028j334O23j607L947L34n85L226j118j876j101
$$ -1411650 -1409551 -1403724 -1397000 -1392806 -1393834 -1395168 -1394545 -1396152 -1392205 -1391871 -1392456 -1389230 -1390348 -1392224 -1393325
8753a393325m80L831R633K796j236R59k95j0210k666j295p68O594j839n37L373
$$ -1393325 -1393805 -1389974 -1380341 -1377545 -1378781 -1377822 -1378117 -1388327 -1390993 -1392288 -1393056 -1386462 -1388301 -1388838 -1385465
8738a385465N755N876J237L809J421j895O565N549o940j929m901L706m709L771
$$ -1385465 -1379710 -1373834 -1372597 -1368788 -1367367 -1369262 -1362697 -1357148 -1364088 -1366017 -1370918 -1367212 -1371921 -1368150
8724a368150J59N484R829K600j274o186l362M386k321P873P744J182K195M034
$$ -1368150 -1367991 -1362507 -1352678 -1350078 -1351352 -1357538 -1360900 -1356514 -1358835 -1350962 -1343218 -1342036 -1339841 -1335807
8710a335807K060j683m127m857k05L990N889O344p534l666J605N87J0184O073
$$ -1335807 -1333747 -1335430 -1339557 -1344414 -1344619 -1340629 -1334740 -1328396 -1335930 -1339596 -1337991 -1337404 -1327220 -1321147
8696a321147o729l015j575l022J151J850K976R693Q817j98p26M944p83p88J204
$$ -1321147 -1327876 -1330891 -1332466 -1335488 -1334337 -1332487 -1329511 -1319818 -1311001 -1311199 -1311925 -1306981 -1307764 -1308552 -1307348
8681a307348K043N23j3J857l988n753N973M249L094R56K771r98K071K123n475
$$ -1307348 -1305305 -1304782 -1304795 -1302938 -1306926 -1312679 -1306706 -1302457 -1299363 -1298407 -1295636 -1296634 -1294563 -1292440 -1297915
8666a297915j357K926j437M00Q582N966m092k246N196n15K413k38J761L231J850
$$ -1297915 -1299272 -1296346 -1297783 -1297383 -1288801 -1282835 -1286927 -1289173 -1283977 -1284492 -1282079 -1282317 -1280556 -1277325 -1275475
8651a275475n410p674N681J700n796j44J943P8M828J0032r45j843m321M092R849
$$ -1275475 -1280885 -1288559 -1282878 -1281178 -1286974 -1287118 -1285175 -1285097 -1280269 -1270237 -1271182 -1273025 -1277346 -1273254 -1263405
8636a263405K679l909P214K410P84R2p939k077Q517Q373J018K737j635o31M744
$$ -1263405 -1260726 -1264635 -1257421 -1255011 -1254227 -1254135 -1262074 -1264151 -1255634 -1247261 -1246243 -1243506 -1245141 -1245772 -1241028
8621a241028l39n113p093m616k343l35K334Q497J1655L766p358j699j349L183
$$ -1241028 -1241367 -1246480 -1253573 -1258189 -1260532 -1260867 -1258533 -1250036 -1238381 -1234615 -1241973 -1243672 -1245021 -1241838
8607a241838M678M83J898J575n161j708o2k145L364k464J916Q8n674K391K88l955
$$ -1241838 -1237160 -1236677 -1234779 -1233204 -1238365 -1240073 -1240135 -1242280 -1238916 -1241380 -1239464 -1239376 -1245050 -1242659 -1242371 -1246326
8591a246326r123m053k404L418R648M300J638j7N46J068k739q458m155l608M022
$$ -1246326 -1255449 -1259502 -1261906 -1258488 -1248840 -1244540 -1242902 -1242919 -1242373 -1241305 -1244044 -1252502 -1256657 -1260265 -1256243
8576a256243P983O156j260M14K062r921o272J593J0496L485M187L95o21M661j018
$$ -1256243 -1248260 -1242104 -1243364 -1242950 -1240888 -1250809 -1257081 -1255488 -1244992 -1241507 -1237320 -1236925 -1237546 -1232885 -1233903
8561a233903n706k462N009N708P236P249l46o40O60p58R330R739Q698m486n763
$$ -1233903 -1239609 -1242071 -1237062 -1231354 -1224118 -1216869 -1217215 -1217855 -1217195 -1217953 -1208623 -1198884 -1190186 -1194672 -1200435
8546a200435J971n705k424J0329J243l830j091K806M145M230K378K743J548j81
$$ -1200435 -1198464 -1204169 -1206593 -1196264 -1195021 -1198851 -1199942 -1197136 -1192991 -1188761 -1186383 -1183640 -1182092 -1182273
8532a182273L570K218N987J069Q856J2334J8378J1930n412l5070o5808l1787N95
$$ -1182273 -1178703 -1176485 -1170498 -1169429 -1160573 -1148239 -1129861 -1117931 -1123343 -1158413 -1224221 -1256008 -1255413
8519a255413J0256M501L627L183K994P882N910J1982K898r3n446M804O692l836
$$ -1255413 -1245157 -1240656 -1237029 -1233846 -1230852 -1222970 -1217060 -1205078 -1202180 -1202273 -1207719 -1202915 -1196223 -1200059
8505a200059J284P417Q163o860Q53R318M013O33L929r13J12J425R873R222L979
$$ -1200059 -1198775 -1191358 -1183195 -1190055 -1189202 -1179884 -1175871 -1175238 -1171309 -1172222 -1172110 -1170685 -1160812 -1151590 -1147611
8490a147611l655Q192R143Q318R608r661l8858o2136k5101M293Q044N703M133
$$ -1147611 -1151266 -1143074 -1133931 -1125613 -1116005 -1125666 -1164524 -1226660 -1251761 -1247468 -1239424 -1233721 -1229588
8477a229588M463M770P336J6246P667L62m027P70K888N6Q070N549K269j49j690
$$ -1229588 -1225125 -1220355 -1213019 -1196773 -1189106 -1188744 -1192771 -1192001 -1189113 -1189057 -1180987 -1175438 -1173169 -1173318 -1175008
8462a175008K594k600n857P44K00l002K066P742N85p34O098J2244O817j904q5
$$ -1175008 -1172414 -1175014 -1180871 -1180127 -1179927 -1182929 -1180863 -1173121 -1172536 -1173270 -1167172 -1154928 -1148111 -1150015 -1150100
8447a150100J136n30Q459m497k596M397M494l025n262l288J405K83k97l045k148
$$ -1150100 -1148964 -1149494 -1141035 -1145532 -1148128 -1143731 -1139237 -1142262 -1147524 -1150812 -1149407 -1149124 -1149421 -1152466 -1154614
8432a154614p10j343J809Q650M315k86M731L079l197J765J575k58J2807J220o306
$$ -1154614 -1155324 -1156667 -1154858 -1146208 -1141893 -1142179 -1137448 -1134369 -1137566 -1135801 -1134226 -1134484 -1121677 -1120457 -1126763
8417a126763k753j330k655q480p97R692N166L024n003l01M400N612m621k754J412
$$ -1126763 -1129516 -1130846 -1133501 -1141981 -1142778 -1133086 -1127920 -1124896 -1129899 -1130200 -1125800 -1120188 -1124809 -1127563 -1126151
8402a126151P794j449k391J607M018R39k867j201R480j171o975l698k224R634
$$ -1126151 -1118357 -1119806 -1122197 -1120590 -1116572 -1115633 -1118500 -1119701 -1110221 -1111392 -1118367 -1122065 -1124289 -1114655
8388a114655K462l234M748P373l564k443k892n013m104J1297J3024J364m596L200
$$ -1114655 -1112193 -1115427 -1110679 -1103306 -1106870 -1109313 -1112205 -1117218 -1121322 -1110025 -1097001 -1095637 -1100233 -1097033
8374a097033J748k368J973m421j882m5K27n86j003M568J0779K931k772j460j448
$$ -1097033 -1095285 -1097653 -1095680 -1100101 -1101983 -1102028 -1101801 -1102387 -1103390 -1098822 -1088043 -1085112 -1087884 -1089344 -1090792
8359a090792j850j31M537l604l779O80M659m42J901P093L489l640o508J496O965
$$ -1090792 -1092642 -1092773 -1088236 -1091840 -1095619 -1094939 -1090280 -1090722 -1088821 -1081728 -1078239 -1081879 -1088387 -1086891 -1079926
8344a079926o172n111r64j595l118k0o68N750P979P610k96n674Q455R865j314
$$ -1079926 -1086098 -1091209 -1092173 -1093768 -1096886 -1096906 -1097574 -1091824 -1083845 -1076235 -1076531 -1082205 -1073750 -1063885 -1065199
8329a065199o053k393J603k451q2K526J033k615l741K222M763R845P860m008l103
$$ -1065199 -1071252 -1073645 -1072042 -1074493 -1074575 -1072049 -1071016 -1073631 -1077372 -1075150 -1070387 -1060542 -1052682 -1056690 -1059793
8314a059793k45n46k803J412j698m562Q44N80p447J12M480K217J937K394L626
$$ -1059793 -1060038 -1060584 -1063387 -1061975 -1063673 -1068235 -1067391 -1066811 -1074258 -1074146 -1069666 -1067449 -1065512 -1063118 -1059492
8299a059492K804N188K078L015m302J908J742j431l223r70M322K052P8Q135m79
$$ -1059492 -1056688 -1051500 -1049422 -1046407 -1050709 -1048801 -1047059 -1048490 -1051713 -1052683 -1048361 -1046309 -1046231 -1038096 -1038575
8284a038575k536l784l127k517l545J989J19N336P516K436N515K189j270o117
$$ -1038575 -1041111 -1044895 -1048022 -1050539 -1054084 -1052095 -1051976 -1046640 -1039124 -1036688 -1031173 -1028984 -1030254 -1036371
8270a036371K997l069o96j498q38N44j224o05O548N683o872l908l407M946L267
$$ -1036371 -1033374 -1036443 -1037139 -1038637 -1039475 -1038931 -1040155 -1040760 -1034212 -1028529 -1035401 -1039309 -1042716 -1037770 -1034503
8255a034503J0281J86K345L731m104l842m651k948O295L433n035O85J1755M246
$$ -1034503 -1024222 -1024036 -1021691 -1017960 -1022064 -1025906 -1030557 -1033505 -1027210 -1023777 -1028812 -1028127 -1016372 -1012126
8241a012126L47r126o904L435O203K475N173Q66j178q58p295k385O454K20L10
$$ -1012126 -1011779 -1020905 -1027809 -1024374 -1018171 -1015696 -1010523 -1009657 -1010835 -1011693 -1018988 -1021373 -1014919 -1014699 -1014389
8226a014389N610N38L643L734J387l267K234p970l701L004P21l88r25m28k140
$$ -1014389 -1008779 -1008241 -1004598 -1000864 -999477 -1002744 -1000510 -1008480 -1012181 -1009177 -1008456 -1008844 -1009769 -1010197 -1012337
8211a012337M478J994l088L235O075l051o308l184M669L979l623n095O162L273
$$ -1012337 -1007859 -1005865 -1008953 -1005718 -999643 -1002694 -1009002 -1012186 -1007517 -1003538 -1007161 -1012256 -1006094 -1002821
8197a002821l63l510L981Q531M922jM96J742m681m941p9K86P80J184j827Q089
$$ -1002821 -1003184 -1006694 -1002713 -994182 -989260 -989261 -988765 -987023 -991704 -996645 -996724 -996438 -995658 -994474 -996301 -988212
8181i88212n43j223L92J56K912J284N645N63k406M861k140K08O484K584K5J750
$$ -988212 -988755 -989978 -989586 -989430 -986518 -985234 -979589 -979026 -981432 -976571 -978711 -978503 -972019 -969435 -969410 -967660
8165i67660n110k104k655m770O183j013k267j961M037k766J199q78j317l073N352
$$ -967660 -972770 -974874 -977529 -982299 -976116 -977129 -979396 -981357 -977320 -980086 -978887 -979765 -981082 -984155 -978803
8150i78803N624N966O442j904m136k790J880Q829p07o852j92K871M41R49L01O549
$$ -978803 -973179 -967213 -960771 -962675 -966811 -969601 -967721 -958892 -959599 -966451 -966643 -963772 -963331 -962382 -962081 -955532
8134i55532m957l891l194J783N370Q786N34j903O863j338m669N40j704m03l977
$$ -955532 -960489 -964380 -967574 -965791 -960421 -951635 -951101 -953004 -946141 -947479 -952148 -951608 -953312 -953715 -957692
8119i57692l02L94N364k810N113M719r62N206n532l923L097l814k796N821l611
$$ -957692 -957994 -957600 -952236 -955046 -949933 -945214 -946176 -940970 -946502 -950425 -947328 -951142 -953938 -948117 -951728
8104i51728j999K715M993L297j036l74L849L39j818R71m294j187N192j280n283
$$ -951728 -953727 -951012 -946019 -942722 -943758 -944132 -940283 -939944 -941762 -940791 -945085 -946272 -941080 -942360 -947643
8089i47643l046q96O911P187N171k068k102p67L826J957p404J955L632l42l698
$$ -947643 -950689 -951585 -944674 -937487 -932316 -934384 -936486 -937253 -933427 -931470 -938874 -936919 -933287 -933629 -937327
8074i37327j44M367J531L010Q14M954n010o097j688P200M428q31k10M933K681
$$ -937327 -937471 -933104 -931573 -928563 -927749 -922795 -927805 -933902 -935590 -928390 -923962 -924793 -925003 -920070 -917389
8059i17389J626K691j298r080m125M832J337N552l781o694M208O328N653l135
$$ -917389 -915763 -913072 -914370 -923450 -927575 -922743 -921406 -915854 -919635 -926329 -922121 -915793 -910140 -913275
8045i13275l181N203Q115P90j031j160m556J140L93k61N365K667j591J307M240
$$ -913275 -916456 -911253 -903138 -902348 -903379 -904539 -909095 -907955 -907562 -907823 -902458 -899791 -901382 -900075 -895835
8030h95835p83M03L850k522m392m143L209n65j352J306k190k781P09K117j440
$$ -895835 -896618 -896215 -892365 -894887 -899279 -903422 -900213 -900778 -902130 -900824 -903014 -905795 -905086 -902969 -904409
8015i04409O11j180k821K925K207K807L376K436M101K419q616j289J76N166L333
$$ -904409 -903798 -904978 -907799 -904874 -902667 -899860 -896484 -894048 -889947 -887528 -896144 -897433 -897257 -892091 -888758
8000h88758q97K664J844O413N221K786r162P95K807K816R40M453K077L793r358
$$ -888758 -889655 -886991 -885147 -878734 -873513 -870727 -879889 -879094 -876287 -873471 -872531 -868078 -866001 -862208 -871566
7985h71566k1182j2577j810o222l127K801M615J1929Q607M664l351j7082j8048
$$ -871566 -892748 -905325 -907135 -913357 -916484 -913683 -909068 -897139 -888532 -883868 -887219 -904301 -922349
7972i22349j4955m425M950M806K500n27P214J2651O217L770q37l76N59j874M378
$$ -922349 -937304 -941729 -936779 -931973 -929473 -930000 -922786 -910135 -903918 -900148 -900985 -901361 -900802 -902676 -898298
7957h98298L935L139O92k211K29j03K443K839J898L433P43n402M590J601j960
$$ -898298 -894363 -891224 -890532 -892743 -892514 -892617 -890174 -887335 -885437 -882004 -881261 -886663 -882073 -880472 -882432
7942h82432l50n5n338k828o712J35Q177Q006J909l47o962j9596j4921p001L657
$$ -882432 -882782 -882837 -888175 -891003 -897715 -897580 -889403 -881397 -879488 -879835 -886797 -906393 -921314 -928315 -924658
7927i24658K914j696J244L242j948n36Q339M956J906K243L879J934m336l240K870
$$ -924658 -921744 -923440 -922196 -918954 -920902 -921438 -913099 -908143 -906237 -903994 -900115 -898181 -902517 -905757 -902887
7912i02887J175N608M78m975N992M690J462J380j667M504j241m504m509q573n001
$$ -902887 -901712 -896104 -895626 -900601 -894609 -889919 -888457 -887077 -888744 -884240 -885481 -889985 -894494 -903067 -908068
7897i08068k007L784N675k696l552Q05O101J358P92l559j195P939K022N894j082
$$ -908068 -910075 -906291 -900616 -903312 -906864 -906059 -899958 -898600 -897808 -901367 -902562 -894623 -892601 -886707 -887789
7882h87789l001K015J101j932J20k778K032N970n33J237o784l84L151J940K017
$$ -887789 -890790 -888775 -887674 -889606 -889486 -892264 -890232 -884262 -884795 -883558 -890342 -890726 -887575 -885635 -883618
7867h83618l870P326L008N128O23r369m162K36O782O062M246J216K699n426J494
$$ -883618 -887488 -880162 -877154 -872026 -871403 -880772 -884934 -884698 -877916 -871854 -867608 -866392 -863693 -869119 -867625
7852h67625j915M0r44j784R434M404p165q278j790k61j510k17Q196J0586K464
$$ -867625 -869540 -869500 -870444 -872228 -862794 -858390 -865555 -873833 -875623 -875884 -877394 -877611 -869415 -858829 -856365
7837h56365m905M163J855J416o81m671k575M915L82L65K309j547K086k902J314
$$ -856365 -861270 -857107 -855252 -853836 -854517 -859188 -861763 -856848 -856466 -856101 -853792 -855339 -853253 -856155 -854841
7822h54841J209L23m728l490k76q71k767j25p36R460J110O19N910M896K728J373
$$ -854841 -853632 -853309 -858037 -861527 -861803 -862674 -865441 -865566 -866302 -856842 -855732 -855113 -849203 -844307 -841579 -840206
7806h40206P49j90o194n421m449N78M058L987n84p570L760L562l765K026O590
$$ -840206 -839457 -839647 -845841 -851262 -855711 -855133 -851075 -847088 -847672 -855242 -851482 -847920 -851685 -849659 -843069
7791h43069O166j062O484m895k913m59M2k868k027l270j254j124Q012J1727m624
$$ -843069 -836903 -837965 -831481 -836376 -839289 -839748 -839706 -842574 -844601 -847871 -849125 -850249 -842237 -830510 -835134
7776h35134r380K666R530Q879L275p71r305r551O148J0790k586L00j10j354k072
$$ -835134 -844514 -841848 -832318 -823439 -820164 -820935 -830240 -839791 -833643 -822853 -825439 -825139 -825249 -826603 -828675
7761h28675M464J815j261j1895l830J1680m874k6L384p92k962m80K024R7k980
$$ -828675 -824211 -822396 -823657 -835552 -839382 -827702 -832576 -832602 -829218 -830010 -832972 -833452 -831428 -831331 -834311
7746h34311O223L33k489N36J246M305K084L08j320j340J631k55J752P944K13k760
$$ -834311 -828088 -827755 -830244 -829708 -828462 -824157 -822073 -821765 -823085 -824425 -822794 -823049 -821297 -813353 -813140 -815900
7730h15900M69m058L356j6M788j852l167m121L725K196K800n148q09K206M69l207
$$ -815900 -815431 -819489 -816133 -816149 -811361 -813213 -816380 -820501 -816776 -814580 -811780 -816928 -817737 -815531 -815062 -818269
$$ [...]
##END NTUPLES=NMR SPECTRUM
##END=
