##TITLE=Analysis number 329201
Compound Code sb 01738
Project Code adrs
Chemist Name stores
##JCAMPDX= 6.0         $$ Bruker NMR JCAMP-DX V2.0
##DATA TYPE= NMR SPECTRUM
##DATA CLASS= NTUPLES
##ORIGIN= Bruker BioSpin GmbH
##OWNER= nmr
$$ XWIN-NMR		Version 3.5
$$ Thu Aug  9 14:24:14 2007 GMT Daylight Time (UT+1h)  MAYBRIDGE\nmr@NMR_250MHZ
##.OBSERVE FREQUENCY= 250.131544655141
##.OBSERVE NUCLEUS= ^1H
##.ACQUISITION MODE= SIMULTANEOUS (DQD)
##.ACQUISITION SCHEME= undefined
##.AVERAGES= 16
##.DIGITISER RES= 18
##SPECTROMETER/DATA SYSTEM= dpx250
##.PULSE SEQUENCE= zg30
##.SOLVENT NAME= CDCl3
##.SHIFT REFERENCE= (INTERNAL, CDCl3, 0, 16.522)
##AUDIT TRAIL= $$ (NUMBER, WHEN, WHO, WHERE, WHAT)
$$ ##TITLE= Audit trail, XWIN-NMR		Version 3.5
$$ ##JCAMPDX= 5.01
$$ ##ORIGIN= Bruker BioSpin GmbH
$$ ##OWNER= nmr
$$ C:\u/data/dgb/nmr/ADRS/340/pdata/1/auditp.txt
$$ ##AUDIT TRAIL=  $$ (NUMBER, WHEN, WHO, WHERE, WHAT)
(   1,<2007-08-09 14:23:49.11 +100>,<MAYBRIDGE\nmr>,<NMR_250MHZ>,
      <created by zg, POWCHK disabled, PULCHK disabled
       configuration hash MD5:
       76 6E 9A 78 1E 09 19 81 EC 84 63 8F B0 6A 59 2D
       data hash MD5: 64K
       A4 FD 76 C3 7B 8D 5A 05 3A A4 0B 74 8C 40 DC E0>)
(   2,<2007-08-09 14:24:00.50 +100>,<MAYBRIDGE\nmr>,<NMR_250MHZ>,
      <Start of raw data processing
       ef LB = 0.3 FT_mod = 6 PKNL = 1 SI = 32K 
       data hash MD5: 32K
       C1 A6 63 0A DA 4F 63 5C 3F 0D 6E 4B 4E B2 89 F0>)
(   3,<2007-08-09 14:24:02.65 +100>,<MAYBRIDGE\nmr>,<NMR_250MHZ>,
      <apk 
       data hash MD5: 32K
       5E AB 7F D6 DF B5 E0 48 C2 C6 4B BE F0 56 08 D4>)
(   4,<2007-08-09 14:24:03.61 +100>,<MAYBRIDGE\nmr>,<NMR_250MHZ>,
      <abs ABSG = 5 
       data hash MD5: 32K
       0D D0 2D 36 56 84 9E 1C 92 9C 1A B5 99 F5 FD 16>)
$$ ##END=
$$ 
$$ hash MD5
$$ B8 41 7E 6A 78 8C 03 70 3A 59 58 87 84 CE F5 07
##$RELAX= 
##$RELAX= 
##$RELAX= 
##$RELAX= 
##$RELAX= 
##$RELAX= 
##$RELAX= 
$$ Bruker specific parameters
$$ --------------------------
##$DU= <C:\u>
##$EXPNO= 340
##$NAME= <ADRS>
##$PROCNO= 1
##$TYPE= <nmr>
##$USER= <dgb>
##$AMP= (0..31)
100 100 100 100 100 100 100 100 100 100 100 100 100 100 100 100 100 100 
100 100 100 100 100 100 100 100 100 100 100 100 100 100 
##$AQSEQ= 0
##$AQ_mod= 3
##$AUNM= <au_zg>
##$AUTOPOS= <3 >
##$BF1= 250.13
##$BF2= 250.13
##$BF3= 250.13
##$BF4= 250.13
##$BF5= 500.13
##$BF6= 500.13
##$BF7= 500.13
##$BF8= 500.13
##$BYTORDA= 1
##$CFDGTYP= 0
##$CFRGTYP= 5
##$CHEMSTR= <none>
##$CNST= (0..31)
1 1 145 1 1 1 1 1 1 1 1 1 1 1 1 1 1 1 1 1 1 1 1 1 1 1 1 1 1 1 1 1 
##$CPDPRG= <>
##$CPDPRG1= <>
##$CPDPRG2= <>
##$CPDPRG3= <>
##$CPDPRG4= <mlev>
##$CPDPRG5= <mlev>
##$CPDPRG6= <mlev>
##$CPDPRG7= <mlev>
##$CPDPRG8= <mlev>
##$CPDPRGB= <>
##$CPDPRGT= <>
##$D= (0..31)
0 1 0 0 0 0 0 0 0 0.06 0 0 0 0 0 0 0.0002 0 0 0 0 0 0 0 0 0 0 0 0 0 0 
0 
##$DATE= 1186665827
##$DBL= (0..7)
120 120 120 120 120 120 120 120 
##$DBP= (0..7)
150 150 150 150 150 150 150 150 
##$DBP07= 0
##$DBPNAM0= <>
##$DBPNAM1= <>
##$DBPNAM2= <>
##$DBPNAM3= <>
$$ [...]
##$SUBNAM7= <"">
##$SUBNAM8= <"">
##$SUBNAM9= <"">
##$SW= 20.6930455092707
##$SWIBOX= (0..15)
0 0 3 0 0 0 0 0 0 0 0 0 0 0 0 0 
##$SW_h= 5175.983436853
##$TD= 65536
##$TD0= 1
##$TE= 297.16
##$TE2= 300
##$TE3= 300
##$TEG= 300
##$TL= (0..7)
0 120 120 120 120 120 120 120 
##$TP= (0..7)
150 150 150 150 150 150 150 150 
##$TP07= 0
##$TPNAME0= <>
##$TPNAME1= <>
##$TPNAME2= <>
##$TPNAME3= <>
##$TPNAME4= <>
##$TPNAME5= <>
##$TPNAME6= <>
##$TPNAME7= <>
##$TPOAL= (0..7)
0.5 0.5 0.5 0.5 0.5 0.5 0.5 0.5 
##$TPOFFS= (0..7)
0 0 0 0 0 0 0 0 
##$TUNHIN= 0
##$TUNHOUT= 0
##$TUNXOUT= 0
##$USERA1= <user>
##$USERA2= <user>
##$USERA3= <user>
##$USERA4= <user>
##$USERA5= <user>
##$V9= 5
##$VALIST= <valist>
##$VCLIST= <CCCCCCCCCCCCCCC>
##$VD= 0
##$VDLIST= <DDDDDDDDDDDDDDD>
##$VPLIST= <PPPPPPPPPPPPPPP>
##$VTLIST= <TTTTTTTTTTTTTTT>
##$WBST= 1024
##$WBSW= 4
##$XGAIN= (0..3)
0 0 0 0 
##$XL= 0
##$YL= 0
##$YMAX_a= 290375
##$YMIN_a= -225006
##$ZGOPTNS= <>
##$ZL1= 120
##$ZL2= 120
##$ZL3= 120
##$ZL4= 120
##$ABSF1= 16.522
##$ABSF2= -4.171173
##$ABSG= 5
##$ABSL= 3
##$ALPHA= 0
##$AQORDER= 0
##$ASSFAC= 0
##$ASSFACI= 0
##$ASSFACX= 0
##$ASSWID= 0
##$AUNMP= <proc_1d>
##$AZFE= 0.1
##$AZFW= 0.1
##$BCFW= 0
##$BC_mod= 0
##$BYTORDP= 0
##$COROFFS= 0
##$CY= 12.5
##$DATMOD= 1
##$DC= 0
##$DFILT= <>
##$DTYPP= 0
##$F1P= 14.0000005364418
##$F2P= -0.99999901652339
##$FCOR= 0.5
##$FTSIZE= 32768
##$FT_mod= 6
##$GAMMA= 0
##$GB= 0
##$INTBC= 1
##$INTSCL= 1
##$ISEN= 128
##$LB= 0.3
##$LEV0= 0
##$LPBIN= 0
##$MAXI= 10000
##$MC2= 0
##$MEAN= 0
##$ME_mod= 0
##$MI= 0
##$NCOEF= 0
##$NC_proc= -4
##$NLEV= 6
##$NOISF1= 0
##$NOISF2= 0
##$NSP= 0
##$NTH_PI= 0
##$NZP= 0
##$OFFSET= 16.522
##$PC= 1
##$PHC0= -40.44894
##$PHC1= 4.220224
##$PH_mod= 1
##$PKNL= yes
##$PPARMOD= 0
##$PSCAL= 4
##$PSIGN= 0
##$REVERSE= no
##$SF= 250.13
##$SI= 32768
##$SIGF1= 0
##$SIGF2= 0
##$SINO= 400
##$SIOLD= 32768
##$SREGLST= <1H.CDCl3>
##$SSB= 0
##$STSI= 32768
##$STSR= 0
##$SW_p= 5175.98343685301
##$SYMM= 0
##$S_DEV= 0
##$TDeff= 65536
##$TDoff= 0
##$TI= <Analysis number 999999
Compound Code 99
Book Reference 9
Project Code 9>
##$TILT= no
##$TM1= 0
##$TM2= 0
##$TOPLEV= 0
##$USERP1= <user>
##$USERP2= <user>
##$USERP3= <user>
##$USERP4= <user>
##$USERP5= <user>
##$WDW= 1
##$XDIM= 32768
##$YMAX_p= 315270263
##$YMIN_p= -319618
$$ End of Bruker specific parameters
$$ ---------------------------------
##NTUPLES= NMR SPECTRUM
##VAR_NAME=  FREQUENCY,     SPECTRUM/REAL,   SPECTRUM/IMAG
##SYMBOL=    X,             R,               I
##VAR_TYPE=  INDEPENDENT,   DEPENDENT,       DEPENDENT
##VAR_FORM=  AFFN,          ASDF,            ASDF
##VAR_DIM=   32768,         32768,           32768
##UNITS=     HZ,            ARBITRARY UNITS, ARBITRARY UNITS
##FACTOR=    0.157963299565203, 1,           1
##FIRST=     4132.6476996994, 0,             0
##LAST=      -1043.33573715361, 0,           0
##MIN=       -1043.33573715361, -319618,     0
##MAX=       4132.6476996994, 315270263,     0
$$ Real data points
##PAGE= N=1
##DATA TABLE= (X++(R..R)), XYDATA
$$ [...]
$$ plain form
25655 69209 133658 83730 33751 78624 28538 -39790 24107 122429 86936 18422 25966 46414
25643 46414 74208 32539 -3489 -64990 -92127 -21326 12698 60178 84430 -2331 12016 83346
25631 83346 36251 -11529 -46559 -31763 32207 42019 98668 101498 87828 62690 5147 23774
25619 23774 12411 -11679 -9667 -28551 -29639 -57934 -66164 -23686 82660 11335 -10789 -2730
25607 -2730 -47457 -83337 -71354 -64622 -82135 -36542 -17870 -22489 42523 41540 -9633 7098 86258
25594 86258 164628 130507 99308 36601 -1249 -10737 16081 -24900 -41637 -99161 -54654 -40424
25582 -40424 -87988 -75328 30963 14741 34870 103783 119305 51235 -5817 45798 29228
25571 29228 -66491 -65647 -45238 87012 85973 -33710 -71327 -37981 -30218 -14754 -5005 5964
$$ packed form
25655F9209O4449m9928m9979M4873n0086o8328O3897R8322l5493o8514P544K0448
25643D6414K7794m1669l6028o1501k7137P0801L4024M7480K4252q6761J4347P1330
25631H3346m7095m7780l5030J4796O3970R812N6649K830j3670k5138n7543J8627
25619B3774j1363k4090K012j8884j088k8295q230M2478J06346p1325k2124Q059
25607b730m4727l5880J1983O732j7513M5593J8672m619O5012r83n1173J6731P9160
25594H6258P8370l4121l1199o2707l7850r488K6818m0981j6737n7524M4507J4230
25582d0424m7564J2660J06291j6222K0129O8913J5522o8070n7052N1615j6570
25571B9228r5719Q44K0409J32250j039j19683l7617L3346P763J5464R749J0969
$$ plain form
25559 5964 24266 -11718 14448 -18708 -57390 22895 31719 -1154 24825 38572 -23790 -2406
25547 -2406 -39538 -151817 -200140 -246744 -141539 -113166 -117494 -55640 -42358 -97939 -67001 -15651
25535 -15651 43196 74312 -5745 -15491 89286 109977 64137 -12942 -14965 -14164 -10582 -33740
25523 -33740 -39828 622 -20154 -17304 -70384 -91807 -24355 -20779 -4016 73091 121409 80255
25511 80255 67835 -15384 -32603 -41200 -40961 -44715 -16143 33204 24704 -19600 -72658 -29890 -22014
25498 -22014 56071 111883 44711 -66771 -78474 26830 108485 168071 80107 23394 40985
25487 40985 106164 133459 175941 76451 -2506 43650 10130 -15395 -25113 -109211 -17198 62521
25475 62521 7721 -49944 -121873 -177673 -142818 -37792 50180 39684 5573 -21073 26269
$$ packed form
25559E964J8302l5984K6166l3156l8682Q0285Q824l2873K5979J3747o2362K1384
25547b406l7132j12279m8323m6604J05205K8373m328O1854J3282n5581L0938N1350
25535a5651N8847L1116q0057r746J04777K0691m5840p7079k023Q01L582k3158
25523c3740o088M0450k0776K850n3080k1423O7452L576J6763P7107M8318m1154
25511H0255j2420q3219j7219q597K39l754K8572M9347q500m4304n3058M2768P876
25498b2014P8085N5812o7172j11482j1703J05304Q1655N9586q7964n6713J7591
25487D0985O5179K7295M2482r9490p8957M6156l3520k5525r718q4098R2013P9719
25475F2521n4800n7665p1929n5800L4855J05026Q7972j0496l4111k6646M7342
$$ plain form
25464 26269 20637 96607 79055 24415 -59424 -91459 13468 83309 13646 -51707 -25080 -15988
25452 -15988 -4207 -78665 -138616 -112709 -125891 -89008 -114340 -81547 -92230 -39686 -54135 -136846
25440 -136846 -171794 -176465 -130834 2015 29097 2080 21627 52124 65352 77678 58037
25429 58037 -4756 8760 26415 85308 48205 -36466 -70301 -38910 26935 64389 43417 60018
25417 60018 72112 -12624 1177 31188 -56714 -138542 -48710 17829 2504 28674 117742 160865
25405 160865 237561 263734 132287 14077 -53561 -62010 9345 -21351 -34386 -16123 -51208
25394 -51208 -25162 15137 67189 55519 48739 82479 134910 98972 44330 66432 62435 38091
25382 38091 41889 5738 -76262 -104290 -123857 -49545 4736 5965 32914 45146 24653 -19615
$$ packed form
25464B6269n632P5970j7552n4640q3839l2035J04927O9841o9663o5353K6627R092
25452a5988J1781p4458n9951K5907j3182L6883k5332L2793j0683N2544j4449q2711
25440a36846l4948m671M5631J32849K7082k7017J9547L0497J3228J2326j9641
25429E8037o2793J3516J7655N8893l7103q4671l3835L1391O5845L7454k0972J6601
25417F0018J2094q4736J3801L0011q7902q1828Q9832O6539j5325K6170Q9068M3123
25405A60865P6696K6173j31447j18210o7638q449P1355l0696j3035J8263l5085
25394e1208K6046M0299N2052j1670o780L3740N2431l5938n4642K2102l997k4344
25382C8091L798l6151q2000k8028j9567P4312N4281J229K6949J2232k0493m4268
$$ plain form
25370 -19615 16751 -60478 -78916 -14730 22034 18751 -1715 -31391 -104659 -198443 -202542 -143446
25358 -143446 -137210 -124660 -76646 6439 79373 162972 138030 52885 68051 109869 96115 9228
25346 9228 32561 6337 -60798 -99643 -97467 -97257 -94988 -54331 3387 -20378 -96652 -21127 20755
25333 20755 -7325 48334 136108 143912 92096 99895 97994 49362 -23618 43955 102834 126921
25321 126921 118079 -2233 -105878 -118660 -190530 -171381 -68679 -81442 -30392 47057 78518
25310 78518 140571 128915 129770 167428 106409 91620 115075 48079 23839 60287 51341 53217
25298 53217 138084 147559 117611 -20769 -98056 -49881 -7816 64882 68040 57613 -2501 -62806
25286 -62806 14195 65249 79262 41049 13286 -78483 -54636 -48485 -46247 2145 99044 79402
$$ packed form
25370a9615L6366p7229j8438O4186L6764l283k0466k9676p3268r3784m099N9096
25358a43446O236J2550M8014Q3085P2934Q3599k4942q5145J5166M1818j3754q6887
25346I228K3333k6224o7135l8845K176K10K269M0657N7718k3765p6274P5525M1882
25333B0755k8080N5659Q7774P804n1816P799j901m8632p2980O7573N8879K4087
25321A26921q842j20312j03645j2782p1870J9149J02702j2763N1050P7449L1461
25310G8518O2053j1656Q55L7658o1019j4789K3455o6996k4240L6448q946J876
25298E3217Q4867R475k9948j38380p7287M8175M2065P2698L158j0427o0114o0305
25286f2806P7001N1054J4013l8213k7763r1769K3847O151K238M8392R6899j9642
$$ plain form
25274 79402 62818 34391 -25746 -50400 2552 108200 67462 38626 52255 28464 97518
25263 97518 88841 59617 8337 -36191 -56463 -95815 -129845 -72854 -23612 -17960 -6527 60719
25251 60719 64076 23720 -27469 -84987 -97486 -92720 -70209 -103216 -94696 -99128 -98466 -68632 -38870
25238 -38870 4194 98696 155776 91789 110325 100386 81838 77289 17510 -15078 26091 84993
25226 84993 55040 2793 12675 39535 -5493 -37566 -40009 -105298 -60991 8807 47991 72688
25214 72688 119640 163385 183348 187425 163684 84394 43695 25652 -24788 -73722 -97495 -52474
25202 -52474 -25179 -69960 -616 -36089 -36398 4746 20808 16612 -35478 27033 63960 58059
25190 58059 -19255 -18251 -79321 -41233 36771 122834 55762 10957 51271 -14887 -44454 26464
$$ packed form
25274G9402j6584k8427o0137k4654N2952J05648m0738k8836J3629k3791O9054
25263I7518q677k9224n1280m4528k0272l9352l4030N6991M9242N652J1433O7246
25251F0719L357m0356n1189n7518j2499M766K2511l3007Q520m432O62K9834K9762
25238c8870M3064R4502N7080o3987J8536r939j8548m549n9779l2588M1169N8902
25226H4993k9953n2247R882K6860m5028l2073k443o5289M4307O9798L9184K4697
25214G2688M6952M3745J9963M077k3741p9290m0699j8043n0440m8934k3773M5021
25202e2474K7295m4781O9344l5473l09M1144J6062m196n2090O2511L6927n901
25190E8059p7314J004o1070L8088P8004Q6063o7072m4805M0314o6158k9567P0918
$$ plain form
25178 26464 29674 55958 -8283 -82715 -129051 -91956 -25628 33676 19995 -98664 -185963 -218408
25166 -218408 -166931 -160695 -57000 12771 83105 105698 32308 -15799 -8061 -8623 -26666 -56270
25154 -56270 -74055 -154961 -146640 -70063 -33895 -21172 69085 113422 44473 -31154 -18841 3840
25142 3840 65653 39173 7099 -22633 28132 103523 138631 56358 -26049 -30074 -74019 -14573
25130 -14573 -6697 64926 118088 62892 71563 95350 -18751 -92716 -61108 20838 141598 112892
25118 112892 94023 18805 57895 59755 14911 -13942 53302 -18047 -65495 -35342 -29562 -66733
25106 -66733 -43402 -34755 16140 14896 73687 105199 61274 67497 111552 131562 146322 146763 179314
25093 179314 138616 112718 100754 66129 58801 114691 64176 36704 70567 11289 24530 110793
$$ packed form
25178B6464L210K6284o4241p4432m6336L7095O6328N9304j3681j18659q7299l2445
25166b18408N1477O236J03695O9771P0334K2593p3390m8107P738n62j8043k9604
25154e6270j7785q0906Q321P6577L6168J2723R0257M4337o8949p5627J2313K2681
25142C840O1813k6480l2074k9732N0765P5391L5108q2273q2407m025m3945N9446
25130a4573P876P1623N3162n5196Q671K3787j14101p3965L1608Q1946J20760k8706
25118A12892j8869p5218L9090J860m4844k8853O7244p1349m7448L0153N780l7171
25106f6733K3331Q647N0895j244N8791L1512m3925O223M4055K0010J4760M41L2551
25093A79314m0698k5898j1964l4625p328N5890n0515k7472L3863n9278J3241Q6263
$$ plain form
25081 110793 188602 126813 123784 256077 245022 110007 121427 139336 47737 -65471 -73505
25070 -73505 -25800 -90279 -122002 -83582 -60014 -59792 -57996 -19988 -26659 -43003 -77093 -88
25058 -88 80658 103126 119706 48416 -11723 -29300 -5343 50998 90761 128711 155383 101750
25046 101750 329 -68655 -69020 15942 28185 30290 -20550 -45385 -70138 25012 38339 35330
25034 35330 -19954 62193 141207 127497 116501 75275 50855 25446 4586 9945 389 37103
25022 37103 72613 170207 175177 125759 -3416 -96286 -101485 -63531 -41110 31181 43726 34218
25010 34218 7025 24013 89627 95769 29066 -6400 -38535 25903 105495 139518 164440 141496
24998 141496 60039 47062 26735 -87338 -77401 -52813 -11092 -52640 -155066 -174517 -220035
$$ packed form
25081A10793P7809o1789l029J32293j1055j35015J1420J7909r1599j13208q034
25070g3505M7705o4479l1723L8420K3568K22J796L8008o671j6344l4090P7005
25058h8Q0746K2468J6580p1290o0139j7577K3957N6341L9763L7950K6672n3633
25046A01750j01421o8984l65Q4962J2243K105n0840k4835k4753R5150J3327l009
25034C5330n5284Q2147P9014j3710j0996m1226k4420k5409k0860N359r556L6714
25022C7103L5510R7594M970m9418j29175r2870n199L7954K2421P2291J2545r508
25010C4218k7193J6988O5614O142o6703l5466l2135O4438P9592L4023K4922k2944
24998A41496q1457j2977k0327j14073R937K4588M1721m1548j02426j9451m5518
$$ plain form
24987 -220035 -171549 -130845 -48398 -35235 -124269 -137682 -117191 -142443 -103801 -62017 -86302
24976 -86302 -169883 -154411 -135148 -123893 -105291 -144425 -109635 -6932 17832 34432 95414
24965 95414 83828 10801 -113773 -182395 -200684 -201907 -165022 -26598 25158 15143 -6718
24954 -6718 -89262 -90448 -86368 -52468 -4621 274 8760 -24181 -25418 32721 68049 42271 72789
24941 72789 43903 -39491 -46462 -64818 -67463 -57319 -15262 -53582 14310 -3047 -41541 -43276
24929 -43276 21195 83956 59090 -10313 28128 16595 -24158 -31210 -30608 -47060 -104239 -191858
24917 -191858 -123915 -17113 -56656 -95627 -65335 45011 6990 -56919 -42946 -45367 -78618
24906 -78618 -114376 -94388 37893 18038 27689 91442 157319 85926 25970 11479 9559 -2978
$$ packed form
24987b20035M8486M0704Q2447J3163q9034j3413K0491k5252L8642M1784k4285
24976h6302q3581J5472J9263J1255J8602l9134L4790J02703K4764J6600O0982
24965I5414j1586p3027j24574o8622j8289j223L6885J38424N1756j0015k1861
24954f718q2544j186M080L3900M7847M895Q486l2941j237N8139L5328k5778L0518
24941G2789k8886q3394o971j8356k645J0144M2057l8320O7892j7357l8494j735
24929d3276O4471O2761k4866o9403L8441j1533m0753p052O02j6452n7179q7619
24917a91858O7943J06802l9543l8971L0292J10346l8021o3909J3973k421l3251
24906g8618l5758J9988J32281j9855R651O3753O5877p1393n9956j4491j920j2537
$$ plain form
24894 -2978 -2038 9322 14411 29520 29991 7420 37346 30479 -42591 -19634 3996 8143 50557
24881 50557 28808 -81989 -134500 -44142 -10352 15795 48274 26949 -30013 -121321 -209589
24870 -209589 -123570 -48032 -131108 -86181 -50874 -52249 -7716 -67443 -37144 -7841 48940 42793
24858 42793 93695 81478 -25030 -27630 1896 -15640 -22555 11009 -2413 31549 49203 2600
24846 2600 -20573 -24443 -55133 -144783 -72348 4241 69554 121421 41049 38489 85874 167385
24834 167385 171940 102834 65746 64310 61202 -417 8010 43029 44415 -53654 -17461 109952
24822 109952 80293 28154 86060 87690 15929 8991 14285 547 -10521 44393 9607 59762
24810 59762 80329 97535 141092 234517 177263 51295 32230 -32712 -57525 5724 48003
$$ packed form
24894b978R40J1360N089J5109M71k2571K9926o867p3070K2957K3630M147M2414
24881E0557k1749j10797n2511R0358L3790K6147L2479k1325n6962r1308q8268
24870b09589Q6019P5538q3076M4927L5307j375M4533n9727L0299K9303N6781o147
24858D2793N0902j2217j06508k600K9526j7536o915L3564j3422L3962J7654m6603
24846B600k3173l870l0690q9650P2435P6589O5313N1867q0372k560M7385Q1511
24834A67385M555o9106l7088j436l108o1619Q427L5019J386r8069L6193J27413
24822A09952k9659n2139N7906J630p1761o938N294j3738j1068N4914l4786N0155
24810E9762K0567J7206M3557R3425n7254j25968j9065o4942k4813O3249M2279
$$ plain form
24799 48003 -8202 58417 90260 85164 33150 56034 139740 89163 88990 134875 151134 170714
24787 170714 164189 189992 76444 31757 45782 52403 23614 20114 36620 87326 85013 34233
24775 34233 17606 28566 13443 11875 21946 11047 -76697 -144904 -90289 -47367 4811 64063
24763 64063 43804 -85705 -143522 -128443 -94834 -48353 -33950 -15121 31342 50478 2768
24752 2768 -57214 -29300 -71840 -4069 103538 101448 96900 96621 59242 -67380 -119132 -139133
24740 -139133 -113626 -100626 -79260 -58599 -4029 52127 111989 131603 121363 33700 3186
24729 3186 -59056 -52003 -37664 -24469 -10462 -59156 -90188 -211789 -163132 -74064 -9489 -28476
24717 -28476 -85559 -136048 -95777 3000 79537 70347 12703 36197 55499 27102 38590 16312
$$ packed form
24799D8003n6205O6619L1843n096n2014K2884Q3706n0577j73M5885J6259J9580
24787A70714o525K5803j13548m4687J4025O621k8789l500J6506N0706k313n0780
24775C4233j6627J0960j5123j568J0071j0899q7744o8207N4615M2922N2178N9252
24763F4063k0259j29509n7817J5079L3609M6481J4403J8829M6463J9136m7710
24752B768n9982K7914m2540O7771J07607k090m548k79l7379j26622n1752k0001
24740a39133K5507J3000K1366K0661N4570N6156N9862J9614j0240q7663l0514
24729C186o2242P053J4339J3195J4007m8694l1032j21601M8657Q9068O4575j8987
24717b8476n7083n0489M0271R8777P6537r190n7644K3494J9302k8397J1488k2278
$$ plain form
24705 16312 24096 37761 40433 33869 6397 35312 105985 105153 11646 -127840 -149910 -139007
24693 -139007 -104798 -10321 54720 91616 90931 26287 -14901 37100 20657 117369 73427 -50056
24681 -50056 -143291 -29090 60644 22057 -102968 -121433 -93369 -61302 -26221 41104 -34957
24670 -34957 -157165 -122952 -51589 -8660 -18867 57227 117748 88452 49025 99452 79585
24659 79585 45311 44115 948 -54286 -101600 -104083 -117178 -82667 -36138 -18064 60929 43993
24647 43993 9576 -70228 -96005 -123837 -98860 -25714 -3597 -5077 -32279 -65044 -126778 -68026
24635 -68026 -38800 -20330 -66319 -74276 -35379 -70435 -63822 -118097 -126539 -87236 -61950 -129162
24623 -129162 -170768 -125007 -94670 21757 -50068 -12914 69513 106404 61498 102470 57739
$$ packed form
24705A6312P784J3665K672o564k7472K8915P0673q32r3507j39486k2070J0903
24693a39007L4209R4477O5041L6896o85o4644m1188N2001j6443R6712m3942j23483
24681e0056r3235J14201Q9734l8587j25025j8465K8064L2067L5081O7325p6061
24670c4957j22208L4213P1363M2929j0207P6094O0521k9296l9427N0427j9867
24659G9585l4274j196m3167n5234m7314k483j3095L4511M6529J8074P8993j6936
24647D3993l4417p9804k5777k7832K4977P3146K2117j480k7202l2765o1734N8752
24635f8026K9226J8470m5989p957L8897l5056O613n4275q442L9303K5286o7212
24623a29162m1606M5761L0337J16427p1825L7154Q2427L6891m4906M0972m4731
$$ plain form
24612 57739 -24491 6264 65063 32831 10900 -13060 63637 86543 66987 -7080 -62357 -59706
24600 -59706 67476 33405 -84728 -105122 -22101 26128 -28207 -88609 -164104 -158190 -86737
24589 -86737 -19555 -24032 -31840 28315 -6490 -94335 -84341 -36045 -75712 -133853 -108675 -27687
24577 -27687 -16374 45157 116758 141148 119091 48949 43202 -11411 -60076 -90192 -112740 -69217
24565 -69217 -72587 -90596 -26234 -1465 -66776 -102565 -75200 -58193 -57690 2619 -13197 -30650
24553 -30650 -65455 -106164 -9180 48865 93357 -40460 -126861 -92829 -84627 46787 70288
24542 70288 48986 40890 -67230 -126626 -110905 -24155 60546 17679 -68111 -68792 -2140 27338
24530 27338 79988 138458 107838 84483 39737 -37116 -57973 -17337 13839 -2133 -25550 -53929
$$ packed form
24612E7739q2230L0755N8799l2232k1931k3960P6697K2906j9556p4067n5277K651
24600e9706J27182l4071j18133k0394Q3021M8229n4335o0402p5495N914P1453
24589h6737O7182m477p808O0155l4805q7845R994M8296l9667n8141K5178Q0988
24577b7687J1313O1531P1601K4390k2057p0142n747n4613m8665l0116k2548M3523
24565f9217l370j8009O4362K4769o5311l5789K7365J7007N03O0309j5816j7453
24553c0650l4805m0709R6984N8045M4492j33817q6401L4032Q202J31414K3501
24542G0288k1302q096j08120n9396J5721Q6750Q4701m2867q5790o81O6652K9478
24530B7338N2650N8470l0620k3355m4746p6853k0857M0636L1176j5972k3417k8379
$$ plain form
24518 -53929 -91598 -109404 -60258 -50448 5643 80874 62784 9541 -34796 -2551 56774 70349
24506 70349 46415 32913 42469 -13372 -76877 -32852 17198 25082 79250 122537 106004 -26637
24494 -26637 -158649 -68501 13355 20626 2926 -35277 -35777 55942 158584 150140 96325 95553
24482 95553 108234 18070 -55606 -44535 -10817 -25339 -29851 43395 40021 44959 -12083 -59547
24470 -59547 -50192 -91894 -165774 -36674 1883 -6674 -30190 -58471 -52130 -19303 -98310 -98149
24458 -98149 -73137 -90445 -77913 -4392 25871 8438 -45565 -33498 9407 68282 135860 146614
24446 146614 188814 253975 132888 113009 119957 77221 135303 183225 118865 43368 85579
24435 85579 184469 199804 143933 195694 240016 154642 104439 49538 30854 4731 -26063 21585
$$ packed form
24518e3929l7669j7806M9146R810N6091P5231j8090n3243m4337L2245N9325J3575
24506G0349k3934j3502R556n5841o3505M4025N0050P884N4168M3287j6533j32641
24494b6637j32012R0148Q1856P271j7700l8203n00R1719J02642q444n3815p72
24482I5553J2681r0164p3676J1071L3718j4522m512P3246l374M938n7042m7464
24470e9547R355m1702p3880J29100L8557q557k3516k8281O341L2827p9007J61
24458i8149K5012j7308J2532P3521L0263j7433n4003J2067M2905N8875O7578J0754
24446A46614M2200O5161j21087j9879O948m2736N8082M7922o4360p5497M2211
24435H5579R8890J5335n5871N1761M4322q5374n0203n4901j8684k6123l0794M7648
$$ plain form
24423 21585 130398 198415 103481 106095 113664 86073 15297 -46826 -72952 -94737 -94719 -88155 -136352
24410 -136352 -92181 -30367 24655 -2919 -5420 -33967 -59693 -69602 -35369 39393 77289 -8315
24398 -8315 -39881 -11736 31141 33382 66231 49841 -2964 -19595 -20377 -70185 12872 58604
24386 58604 108923 191014 173504 145914 83762 86438 44704 29109 25545 49020 98716 99538
24374 99538 91249 35898 -17609 -17549 -41897 71982 112548 50551 29507 49773 14765 19914
24362 19914 52114 78132 154387 123584 -29457 -56080 -110187 -89113 -21452 -10261 2973
24351 2973 2559 -28227 -71696 -1474 -54503 -156997 -51767 65618 97911 -26869 -71068
24340 -71068 -116283 -179024 -149627 -78304 -9308 22056 30113 -3043 -1090 -65482 -106704 -44661
$$ packed form
24423B1585J08813O8017r4934K614P569k7591p0776o2123k6126k1785J8O564m8197
24410a36352M4171O1814N5022k7574k501k8547k5726r909L4233P4762L7896q5604
24398h315l1566K8145M2877K241L2849j6390n2805j6631p82m9808Q3057M5732
24386E8604N0319Q2091j7510k7590o2152K676m1734j5595l564K3475M9696Q22
24374I9538q289n5351n3507O0k4348J13879M0566o1997k1044K0266l5008N149
24362A9914L2200K6018P6255l0803j53041k6623n4107K1074O7661J1191J3234
24351B973m14l0786m3469P0222n3029j02494J05230J17385L2293j24780m4199
24340g1068m5215o2741K9397P1323O8996L1364Q057l3156J953o4392m1222O2043
$$ plain form
24328 -44661 -39610 -135542 -184178 -221210 -156763 -112217 -114501 -67085 18634 47815 107667 96865
24316 96865 35316 10635 -62146 -47442 -12695 -1840 130869 89813 60871 27180 -23721
24305 -23721 -14311 -25223 -42897 -35824 36523 -5757 -39759 -59789 -92063 -199966 -226884 -189535
24293 -189535 -74609 -9884 -32245 -85966 -77662 -38390 -77254 -105325 -151630 -149408 -119988 -94761
24281 -94761 -130303 -100193 37021 -22563 -124385 -99919 9043 -409 -31307 -45146 48692
24270 48692 69536 -18450 -30024 -37415 5861 3288 28607 79643 65649 77080 13940 18221
24258 18221 67892 66461 62788 67062 4184 -20181 -95701 -89017 -11895 -9062 -22284 11896 20220
24245 20220 -16917 -37676 -62218 7721 40341 28452 46501 -28312 -65676 -50411 33399 49671
$$ packed form
24328d4661N051r5932m8636l7032O4447M4546k284M7416Q5719K9181N9852j0802
24316I6865o1549k4681p2781J4704L4747J0855J32709m1056k8942l3691n0901
24305b3721R410j0912j7674P073P2347m2280l4002k0030l2274j07903k6918L7349
24293a89535J14926O4725k2361n3721Q304L9272l8864k8071m6305K222K9420K5227
24281i4761l5542L0110J37214n9584j01822K4466J08962r452l0898j3839R3838
24270D8692K0844q7986j1574p391M3276k573K5319N1036j3994J1431o3140M281
24258A8221M9671j431l673M274o2878k4365p5520O684P7122K833j3222L4180Q324
24245B0220l7137k0759k4542O9939L2620j1889J8049p4813l7364J5265Q3810J6272
$$ plain form
24233 49671 5031 31947 -16108 -55171 -38104 34812 118451 45022 18196 -4166 6619 -66959
24221 -66959 -140716 -155308 -202043 -225330 -108538 -94297 -105176 -156517 -180215 -84939 -94894 -160157
24209 -160157 -87928 -22611 57952 98955 75007 89699 82467 103757 93828 51914 -20878 -54180
24197 -54180 54691 127109 75385 -21039 -96184 -98647 -24980 -6661 -5776 -86887 -249340 -149227
24185 -149227 -69578 -46282 -6564 20433 -60924 -115222 -69791 21676 49232 -28130 67823
24174 67823 61200 41435 68980 30739 -11157 -47872 -64797 10196 69129 105230 135939 137578
24162 137578 38250 -22362 -17727 39747 139192 138310 37989 12213 -1165 -16156 -42082 -84129
24150 -84129 -118070 -133476 -78986 -92979 -90489 -90427 -99322 -95311 -139265 -97531 -5944 -36553 -97220
$$ packed form
24233D9671m4640K6916m8055l9063J7067P2916Q3639p3429k6826k2362J0785p3578
24221f6959p3757j4592m6735k3287J16792J4241j0879n1341k3698R5276r955o5263
24209a60157P2229O5317Q0563M1003k3948J4692p232K1290r929m1914p2792l3302
24197e4180J08871P2418n1724r6424p5145k463P3667J8319Q85q1111j62453J00113
24185a49227P9649K3296L9718K6997q1357n4298M5431R1467K7556p7362R5953
24174F7823o623j9765K7545l8241m1896l6715j6925P4993N8933L6101L0709J639
24162A37578r9328o0612M635N7474R9445q82j00321k5776j3378j4991k5926m2047
24150h4129l3941j5406N4490j3993K490O2q895M011m3954M1734R1587l0609o0667
$$ plain form
24137 -97220 -133327 -90252 7167 67096 11808 37495 25658 -23912 22857 -16642 -94766 -6690
24125 -6690 18296 -13625 -3616 27235 -13886 -112690 -189206 -142255 -60558 15626 49618 115183
24113 115183 104114 130700 157651 173948 131976 146440 151375 189670 127525 57131 30076 -10011
24101 -10011 -12038 68947 48158 39433 40411 42141 90856 155446 92418 54468 -5950 -4633 17897
24088 17897 10575 -51704 -109737 -49233 -15220 -11302 -20161 8588 -93317 -208456 -234328 -232994
24076 -232994 -179245 -86727 -109676 -156487 -199924 -159762 -116048 -156254 -157035 -141970 -139846 -100342
24064 -100342 -46040 -36274 -65259 -21904 -16243 22295 38169 -98046 -146265 -95140 -3675 -48317
24052 -48317 -90796 -79623 57999 128535 140542 79226 77843 91083 81344 92912 74649 46201
$$ packed form
24137i7220l6107M3075R7419N9929n5288K5687j1837m9570M6769l9499p8124Q8076
24125f690K4986l1921J0009L0851m1121r8804p6516M6951Q1697P6184L3992O5565
24113A15183j1069K6586K6951J6297m1972J4464M935L8295o2145p0394k7055m0087
24101a0011k027Q0985k0789q725R78J730M8715O4590o3028l7950o0418J317K2530
24088A7897p322o2279n8033O0504L4013L918q859K8749j01905j15139k5872J334
24076b32994N3749R2518k2949m6811m3437M0162M3714m0206p81J5065K124L9504
24064a00342N4302R766k8985M3355N661L8538J5874j36215m8219N1125R1465m4642
24052d8317m2479J1173J37622P0536J2007o1316j383J3240r739J1568j8263k8448
$$ plain form
24040 46201 70536 75979 83227 -79017 -140890 -19404 24826 63388 69278 83898 -47631 -103042
24028 -103042 -35078 16132 77850 111936 56970 74015 74529 -28235 -106825 -85849 -45365 -12957
24016 -12957 20980 -47235 -137169 -98300 -59118 -83208 -35283 -68783 -88117 -105024 -87086 -81184
24004 -81184 -115423 -186726 -154766 -65796 -84364 -80513 -20310 -9474 -99956 -58226 7146 3155
23992 3155 64241 4911 -2609 16653 14282 -22175 -101190 -212498 -250234 -202477 -134387 -40942
23980 -40942 -42121 -89710 -154193 15304 42947 64109 12741 -75166 -18767 9316 -40067 -98898
23968 -98898 -117860 -121018 -42003 -17812 -8704 46105 72754 74826 72471 26079 76314 60835
23956 60835 108339 166638 168114 145233 129603 73998 50596 7875 17022 42153 39240 44859
$$ packed form
24040D6201K4335N443P248j62244o1873J21486M4230L8562N890J4620j31529n5411
24028a03042O7964N1210O1718L4086n4966J7045N14j02764p8590K0976M0484L2408
24016a2957L3937o8215q9934L8869L9182k4090M7925l3500j9334j6907J7938N902
24004h1184l4239p1303L1960Q8970j8568L851O0203J0836r0482M1730O5372l991
23992C155O1086n9330p520J9262k371l6457p9015j11308l7736M7757O8090R3445
23980d0942j179m7589o4483J69497K7643K1162n1368q7907N6399K8083m9383n8831
23968i8898j8962l158P9015K4191R108N4809K6649K072k355m6392N0235j5479
23956F0835M7504N8299J476k2881j5630n5605k3402m2721R147K5131k913N619
$$ plain form
23944 44859 145132 210901 178016 111565 136995 158200 107412 17363 20256 46772 -50576 -55075
23932 -55075 -22705 11616 48592 89055 53106 76914 -8908 6328 6997 -5724 -27508 47514
23920 47514 84707 50378 49745 67948 111523 99911 84878 106960 138426 181988 194321 149067
23908 149067 95277 82522 59197 8182 -138 -38697 -128186 -123226 -133846 -102315 -34028 64733
23896 64733 38331 -27409 48974 120041 105110 33498 33170 61680 56774 41334 -47459 -40183
23884 -40183 61925 13484 -7608 60994 62700 56538 82835 900 -108939 -112540 -7504 62842
23872 62842 90565 144584 128512 61673 78975 116615 98370 109808 100848 204955 180723 145106
23860 145106 98798 21173 28251 56438 79664 72220 59247 56898 48766 8842 55395 75069
$$ packed form
23944D4859J00273O5769l2885o6451K5430K1205n0788r0049K893K6516r7348m499
23932e5075L2370L4321L6976M0463l5949K3808q5822J5236O69j2721k1784P5022
23920D7514L7193l4329o33J8203M3575j1612j5033K2082L1466M3562J2333m5254
23908A49067n3790j2755k3325n1015q320l8559q9489M960j0620L1531O8287R8761
23896F4733k6402o5740P6383P1067j4931p1612l28K8510m906j5440q8793P276
23884d0183J02108m8441k1092O8602J706o162K6297q1935j09839l601J05036P0346
23872F2842K7723N4019j6072o6839J7302L7640j8245J1438q960J04107k4232l5617
23860A45106m6308p7625P078K8187K3226p444j2973k349q132l9924M6553J9674
$$ plain form
23848 75069 25918 -11979 1411 22138 7170 42476 67818 35740 29413 -62203 -139884 -223488
23836 -223488 -240340 -270491 -246599 -274092 -246094 -181114 -136151 -33461 -51844 -175543 -198446
23825 -198446 -144648 -176850 -195639 -209912 -166435 -144833 -62941 -61463 -111417 -87717 -59337 76997
23813 76997 88301 79283 24753 19225 -20252 -35900 31040 35064 17272 29315 18159 55453
23801 55453 43348 12265 5111 -30120 -111758 -142645 -63486 -25793 -34093 -58422 -100714 -190909
23789 -190909 -65072 89941 78222 99112 115626 133382 107358 123645 243062 177921 95660
23778 95660 57429 -17580 5931 -4620 52110 100614 85806 32763 -55778 -118748 -113997 -61861
23766 -61861 -53278 -17356 3545 27135 -69136 -87658 -32704 -12173 17468 59872 60345 25206
$$ packed form
23848G5069m9151l7897J3390K0727j4968L5306K5342l2078o327r1616p7681q3604
23836b23488j6852l0151K3892k7493K7998O4980M4963J02690j8383j23699k2903
23825a98446N3798l2202j8789j4273M3477K1602Q1892J478m9954K3700K8380J36334
23813G6997J1304r018n4530n528l9477j5648O6940M024j7792J2043j1156L7294
23801E5453j2105l1083p154l5231q1638l0887P9159L7693q300k4329m2292r0195
23789a90909J25837J55013j1719K0890J6514J7756k6024J6287J19417o5141q2261
23778I5660l8231p5009K3511j0551N6730M8504j4808n3043q8541o2970M751N2136
23766f1861Q583L5922K0901K3590r6271j8522N4954K0531K9641M2404M73l5139
$$ plain form
23754 25206 -86516 -127442 -92602 -31728 -7230 -77089 -101550 -128179 -83390 4128 -24797
23743 -24797 -45920 -53078 -28949 2738 -48462 -143787 -92268 -3327 -48577 -85742 -58370 -14877
23731 -14877 11925 -62275 -68282 -53257 -69932 -88412 -31196 -25795 8841 -18069 -108213 -105074
23719 -105074 -11013 32014 -48548 -106619 -73098 -85735 -77566 -95562 -164755 -222602 -206398 -217124
23707 -217124 -55872 39152 5395 -31666 -26262 649 -39912 62852 102563 54854 13180
23696 13180 -4693 5450 -25711 -95116 -48646 77520 136490 93695 -26222 13157 35319
23685 35319 -73572 -29325 76505 72376 137399 136484 101914 86954 12782 -43907 -17479 -15110
23673 -15110 2292 -102458 -22696 3810 -65190 -58382 -62098 -64478 -151532 -99608 -47904 -52361
$$ packed form
23754B5206j11722m0926L4840O0874K4498o9859k4461k6629M4789Q7518k8925
23743b4797k1123p158K4129L1687n1200r5325N1519Q8941m5250l7165K7372M3493
23731a4877K6802p4200o007J5025j6675j8480N7216N401L4636k6910r0144L139
23719a05074R4061M3027q0562n8071L3521j2637Q169j7996o9193n7847J6204j0726
23707b17124J61252R5024l3757l7061N404K6911m0561J02764L9711m7709m1674
23696A3180j7873J0143l1161o9405M6470J26166N8970m2795j19917L9379K2162
23685C5319j08891M4247J05830m129O5023r15l4570j4960p4172n6689K6428K369
23673a5110J7402j04750P9762K6506o9000O808l716k380q7054N1924N1704m457
$$ plain form
23661 -52361 -83629 -70717 -66806 -71376 -84666 -74580 -64237 -70244 -54088 -142194 -138648 -39803
23649 -39803 27377 -19682 -86190 -106861 -93826 -10377 87025 73209 -40297 -110432 -99433
23638 -99433 -14766 58379 67699 138700 43981 -66004 -26792 66568 47164 47825 -40573 -90178
23626 -90178 -165664 -125267 -88367 -45551 -91330 -122208 -63798 -31218 33509 98306 65202 25459
23614 25459 65911 29590 23763 -21737 -60319 -6641 80393 83161 78300 96239 38168 -13165
23602 -13165 -39753 -88959 -97092 -99000 -90628 39331 73749 3983 -51104 -121080 -149130 -191993
23590 -191993 -185384 -97054 46792 36409 28995 7769 38580 30728 43414 17227 -122807 -153615
23578 -153615 -117879 -109573 -32460 1294 -14633 36978 34765 96 70901 94817 77913 14245
$$ packed form
23661e2361l1268J2912L911m570j3290J0086J0343o007J6156q8106L546R8845
23649c9803O7180m7059o6508k0671J3035Q3449R7402j3816j13506p0135J0999
23638i9433Q4667P3145R320P1001r4719j09985L9212R3360j9404O61q8398m9605
23626i0178p5486M0397L6900M2816m5779l0878N8410L2580O4727O4797l3104l9743
23614B5459M0452l6321n827m5500l8582N3678Q7034K768m861J7939n8071n1333
23602a3165k6588m9206q133j908Q372J29959L4418o9766n5087o9976k8050m2863
23590a91993O609Q8330J43846j0383p414k1226L0811p852J2686k6187j40034l0808
23578a53615L5736Q306P7113L3754j5927N1611k213l4669P0805K3916j6904o3668
$$ plain form
23566 14245 -66257 -32595 45259 48833 -21865 -64247 -148962 -172807 -108457 -94483 -148087 -135799
23554 -135799 -1382 -10154 -45338 -2869 -5053 -37568 -1176 -70911 -73615 4079 82726 87279
23542 87279 104897 97984 105165 67084 283 -59940 -115888 16006 69625 3049 -30116 4871
23530 4871 141763 142482 132032 151057 76533 19217 163 -33262 2966 27734 81675 66405
23518 66405 39135 40564 12138 -32560 -21303 17915 42731 15825 -15646 -26752 14539 25521
23506 25521 -638 109821 135695 60168 19544 28770 26133 74842 98368 76151 14527 -38102
23494 -38102 -24690 -104724 -179754 -153813 -175117 -131257 -31493 63010 38945 52101 33521 10069
23482 10069 8273 -36693 55377 156899 143757 80393 58875 -13033 -101295 -82527 -74809 -57218
$$ packed form
23566A4245q0502L3662P7854L574p0698m2382q4715k3845O4350J3974n3604J2288
23554a35799J34417q772l5184M2469k184l2515L6392o9735k704P7694P8647M553
23542H7279J7618o913P181l8081o6801o0223n5948J31894N3619o6576l3165L4987
23530D871J36892P19j0450J9025p4524n7316j9054l3425L6228K4768N3941j5270
23518F6405k7270J429k8426m4698J1257L9218K4816k6906l1471j1106M1291J0982
23506B5521k6159J10459K5874p5527m0624R226k637M8709K3526k2217o1624n2629
23494c8102J3412q0034p5030K5941k1304M3860R9764R4503k4065J3156j8580k3452
23482A0069j796m4966R2070J01522j3142o3364k1518p1908q8262J8768P718J7591
$$ plain form
23470 -57218 -63531 -29884 -77223 -37140 -52512 -62918 -75802 -76760 -63497 -47084 -41774 21322
23458 21322 19376 -13828 -54124 33935 40209 38130 6625 23236 -38910 -57414 -44150 27048
23446 27048 91996 106479 -24790 -110283 -22192 -96035 -44187 3208 39074 15428 -14004
23435 -14004 -31530 -39197 -47246 -89628 -9987 51175 -15392 -92832 -73479 -106821 -54511 -64994
23423 -64994 -49042 -24962 45208 81879 22454 -56916 11407 12651 -37258 99054 137948 52348
23411 52348 -3567 -57243 -60661 16334 94533 44294 -10360 -30822 -7854 -16544 -32990 -58822
23399 -58822 -7026 60898 108356 142390 90344 80049 63680 145826 100572 -1350 -54014
23388 -54014 -128734 -135995 -102376 -52347 -48240 -43206 -83265 -53384 -29978 -39809 -5581 62817
$$ packed form
23470e7218o313L3647m7339M0083j5372j0406j2884r58J3263J6413N310O3096
23458B1322j946l3204m0296Q8059O274k079l1505J6611o2146j8504J3264P1198
23446B7048O4948J4483j31269q5493Q8091p3843N1848M7395L5866k3646k9432
23435a4004j7526p667q049m2382P9641O1162o6567p7440J9353l3342N2310j0483
23423f4994J5952K4080P0170L6671n9425p9370O8323J244m9909J36312L8894q5600
23411E2348n5915n3676l418P6995P8199n0239n4654k0462K2968q690j6446k5832
23399e8822N1796O7924M7458L4034n2046j0295j6369Q2146m5254j01922n2664
23388e4014p4720p261L3619N0029M107N034m0059K9881K3406r831L4228O8398
$$ plain form
23376 62817 4432 -14057 39844 -24261 -55222 -58766 -113982 -78108 -59109 -104017 -99777 -91194
23364 -91194 -61038 -81858 -85519 28236 37231 36415 53149 -18819 -14380 -14968 49406 -26590 -78429
23351 -78429 -136257 -143299 -89817 -36484 -33146 -99813 -84173 -37766 -1696 -23560 -114489 -187170
23339 -187170 -170292 -96673 -76829 -32205 7044 99708 133368 145854 50636 88190 193950
23328 193950 198252 176068 137989 57128 -59611 -92606 -85514 5920 105129 122790 97077 68906
23316 68906 14075 -4445 -32470 -66880 -81017 -134364 -172050 -134742 -29861 67290 69306 44504
23304 44504 20649 -28787 12994 99903 107866 84692 -7141 -42873 -57703 -23913 -35182 7061
23292 7061 858 53804 110046 61830 -495 -4620 -71691 -115949 -60699 -20695 -96206 -77198
$$ packed form
23376F2817n8385j8489N3901o4105l0961l544n5216L5874J8999m4908M240Q583
23364i1194L0156k0820l661J13755Q995q16J6734p1968M439n88O4374p5996n1839
23351g8429n7828p042N3482N3333L338o6667J5640M6407L6070k1864r0929p2681
23339a87170J6878P3619J9844M4624L9249R2664L3660J2486r5218L7554J05760
23328A93950M302k2184l8079q0861j16739l2995P092R1434R9209J7661k5713k8171
23316F8906n4831j8520k8025l4410j4137n3347l7686L7308J04881R7151K016k4802
23304D4504k3855m9436M1781Q6909P963k3174r1833l5732j4830L3790j1269M2243
23292G061o203N2946N6242m8216o2325m125o7071m4258N5250M0004p5511J9008
$$ plain form
23280 -77198 -11071 -10108 46205 47636 -46282 -62880 -111387 -77409 44455 123080 40414 -23456
23268 -23456 61134 38055 40680 32867 -6451 -29011 -24680 -12394 23508 123519 95469 -37933
23256 -37933 -55265 -38267 -24874 26115 55192 3173 3281 -7390 -58456 -52958 37210 39404
23244 39404 873 -12401 -42007 48938 47743 -19181 -111098 -179692 -144844 -71342 -1594 82255
23232 82255 73131 -5517 -24503 -115674 -134016 -82656 -103885 -97574 -13766 25100 81292 59884
23220 59884 79999 91836 146320 135377 71890 22109 43 8406 -583 58698 111012 38020
23208 38020 50985 110085 111639 59670 59489 70611 52817 48867 56099 35046 1697 -10174 -10201
23195 -10201 14671 74898 15580 -50131 -29004 38601 86029 52973 72965 62575 -7683 35773
$$ packed form
23280g7198O6127R63N6313J431r3918j6598m8507L3978J21864P8625q2666o3870
23268b3456Q4590k3079K625p813l9318k2560M331J2286L5902J00011k8050j33402
23256c7933j7332J6998J3393N0989K9077n2019J08j0671n1066N498R0168K194
23244C9404l8531j3274k9606R0945j195o6924r1917o8594L4848P3502O9748Q3849
23232H2255r124p8648j8986r1171j8342N1360k1229O311Q3808L8866N6192k1408
23220E9884K0115J1837N4484j0943o3487m9781k2066Q363q989N9281N2314p2992
23208C8020J2965N9100J554n1969j81J1122j7794l950P232k1053l3349j1871k7
23195a0201K4872O0227n9318o5711K1127O7605M7428l3056J9992j0390p0258M3456
$$ plain form
23183 35773 8867 -55765 -89486 -76990 -81961 -115445 -110336 -126867 -101283 -150462 -139477 -80275
23171 -80275 -3772 -52575 -121801 -56540 45707 -16624 -19828 85609 71799 23188 17321 -44264
23159 -44264 28322 80820 58440 -2338 -67784 -86484 -32716 41437 102588 129202 104260 94858
23147 94858 154483 103268 85126 43864 -82372 -132915 -128236 -101610 -126439 -109357 -107031 -89639
23135 -89639 -45695 -95007 -188779 -127518 14231 22854 -4133 -5474 21667 33727 47118 25240
23123 25240 -39557 -32488 41770 64575 -8891 -15786 34965 25266 -58051 -59814 -78761 -61036
23111 -61036 -17865 22102 -12898 -21254 29569 24216 11940 -46112 -88218 -51836 -114418 -101480
23099 -101480 -58567 37233 -34544 -1774 86902 156690 216710 187937 139730 173702 142308
$$ packed form
23183C5773k6906o4632l3721J2496m971l3484N109j6531K5584m9179J0985N9202
23171h0275P6503m8803o9226O5261J02247o2331l204J05437j3810m8611n867o1585
23159d4264P2586N2498k2380o0778o5446j8700N3768P4153O1151K6614k4942r402
23147I4858N9625n1215j8142m1262j26236n0543M679K6626k4829J7082K326J7392
23135h9639M3944m9312r3772O1261J41749Q623k6987j341K7141J2060J3391k1878
23123B5240o4797P069P4258K2805p3466o895N0751r699q3317j763j8947J7725
23111f1036M3171L9967l5000q356N0823n353j2276n8052m2106L6382o2582J2938
23099a01480M2913R5800p1777L2770Q8676O9788O0020k8773m8207L3972l1394
$$ plain form
23088 142308 61714 32583 -31520 -72539 -50911 59524 6305 30012 -12080 -37688 33825
23077 33825 15497 -43306 -90679 -43155 -10147 -73308 -50711 -118 -37672 1496 -56480 -56261
23065 -56261 -8193 -45515 -24167 -10552 2595 97437 120545 166261 169280 96797 67621 89643
23053 89643 142222 140422 114228 125481 157687 181600 115540 82701 101506 111562 33980 65196
23041 65196 86179 12415 -6265 69256 91581 -2696 -2499 34311 23537 -57682 -66831 -66504 -52076
23028 -52076 -50505 -41824 -26325 22483 15537 13201 30939 20188 -39575 -62246 -87124 -43486
23016 -43486 34500 8251 28705 58030 91173 111964 35827 -54713 -148824 -145320 -158136 -116001
23004 -116001 -8332 76795 67997 -11011 -14183 -5851 -2305 28430 10496 -15804 -49598 -55522
$$ packed form
23088A42308q0594k9131o4103m1019K1628J10435n3219K3707m2092k5608P1513
23077C3825j8328n8803m7373M7524L3008o3161K2597N0593l7554L9168n7976K19
23065e6261M8068l7322K1348J3615J3147R4842K3108M5716L019p2483k9176K2022
23053H9643N2579j800k6194J1253L2206K3913o6060l2839J8805J0056p7582L1216
23041F5196K0983p3764j8680P5521K2325r4277J97L6810j0774q1219r149L27J4428
23028e2076J571Q681J5499M8808o946k336J7738j0751n9763k2671k4878M3638
23016d3486P7986k6249K0454K9325L3143K0791p6137r0540r4111L504j2816M2135
23004a16001J07669Q5127q798p9008l172Q332L546L0735j7934k6300l3794n924
$$ plain form
22992 -55522 -72327 -23256 34670 26220 12231 43806 85279 158268 75551 -66026 -151450 -88282
22980 -88282 40805 95724 32436 -43874 -111911 -109226 -68579 -58609 -116790 -91777 12794 63421
22968 63421 59157 35862 -30111 -62223 -68619 -221006 -285488 -272090 -217460 -76797 -45532 -96222
22956 -96222 -27324 36199 36512 22838 -57641 -150514 -129039 -30918 13717 -27360 -33421 15653
22944 15653 -78292 -166963 -190356 -111297 -22269 11350 79624 196319 191494 43894 -4402
22933 -4402 49616 77510 15479 -87416 -24582 100203 139275 150091 56044 -61012 -28792
22922 -28792 -66848 -59926 -72913 -94325 -15729 8500 -12900 -19773 32515 -2150 -43265 -75657
22910 -75657 -91078 -105098 -99244 -68424 -31698 -32829 15635 57473 52643 56005 66107 -1893
$$ packed form
22992e5522j6805M9071N7926q450j3989L1575M1473P2989q2717j41577q5424O3168
22980h8282J29087N4919o3288p6310o8037K685M0647R970n8181K5013J04571N0627
22968F3421m264k3295o5973l2112o396j52387o4482J3398N4630J40663L1265n0690
22956i6222O8898O3523L13j3674q0479r2873K1475R8121M4635m1077o061M9074
22944A5653r3945q8671k3393P9059Q9028L3619O8274J16695m825j47600m8296
22933d402N4018K7894o2031j02895O2834J24785L9072J0816r4047j17056L2220
22922b8792l8056O922j2987k1412P8596K4229k1400o873N2288l4665m1115l2392
22910g5657j5421j4020N854L0820L6726j131M8464M1838m830L362J0102o8000
$$ plain form
22898 -1893 -48462 -6031 40694 -49894 -187078 -85364 29339 23105 6182 -47071 -45344 -95364
22886 -95364 -166059 -188906 -241481 -180926 -60179 -66679 -23255 -5279 55797 72636 88926 93190
22874 93190 28651 31452 24362 28146 96253 88169 -31660 -67657 -25277 8744 -40863 -23157
22862 -23157 -42500 -43772 -118626 -95493 -128921 -127937 -180287 -187929 -127197 -106771 -91606 -79825
22850 -79825 -122760 -77776 -56204 -149079 -121036 -43294 -58995 -67634 73629 178929 158443
22839 158443 74446 -6461 -2714 -24329 -111216 -104808 -91511 -50076 15530 29948 18589 15596
22827 15596 -35220 -25565 66009 51712 80478 24148 6448 -73990 -63783 -44571 30889 1952
22815 1952 -2309 57143 80446 -35684 -58810 -79192 -100161 -39810 33737 83972 72568 52100
$$ packed form
22898a893m6569M2431M6725r0588j37184J01714J14703o234j6923n3253J727n0020
22886i5364p0695k2847n2575O0555J20747o500M3424J7976O1076J6839J6290M264
22874I3190o4539K801p090L784O8107q084j19829l5997M2380L4021m9607J7706
22862b3157j9343j272p4854K3133l3428R84n2350p642O0732K0426J5165J1781
22850g9825m2935M4984K1572r2875K8043P7742j5701q639J41263J05300k0486
22839A58443q3997q0907L747k1615q6887O408J3297M1435O5606J4418j1359k993
22827A5596n0816R655R1574j4297K8766n6330j7700q0438J0207J9212P5460k8937
22815A952m261N9452K3303j16130k3126k0382k0969O0351P3547N0235j1404k0468
$$ plain form
22803 52100 110028 74512 92021 18245 -12895 47238 40864 -68375 -71772 -8010 32770 25275
22791 25275 19232 -22855 -28576 -41299 -11806 72158 16030 -85619 -16969 10818 -49308 2721
22779 2721 31847 25497 35648 36503 24570 -19034 23554 -27914 12666 60165 51915 20439 14074
22766 14074 -35186 -65585 -11085 81896 -20397 -70202 -76304 -82640 -30076 -9448 -22933 4336
22754 4336 138371 99234 -11906 -4059 -60069 -61019 -25986 48699 143471 165578 76135 -19059
22742 -19059 -72325 -118141 -129403 -45795 94563 171075 141372 28933 -8476 -16839 -77939
22731 -77939 -85738 -103235 8514 76655 81522 17880 -68730 -7651 64721 29855 -18505 5197
22719 5197 -3079 -56074 -101050 -102587 -58018 4216 49329 -2979 -11361 42029 14425 -63551
$$ packed form
22803E2100N7928l5516J7509p3776l1140O0133o374j09239l397O3762M0780p495
22791B5275o043m2087n721j2723K9493Q3964n6128j01649O8650K7787o0126N2029
22779B721K9126o350J0151Q55j1933m3604M2588n1468M0580M7499q250l1476o365
22766A4074m9260l0399N4500R2981j02293m9805o102o336N2564K0628j3485K7269
22754D336J34035l9137j11140P847n6010r50L5033P4685R4772K2107q9443r5194
22742a9059n3266m5816j1262Q3608J40358P6512k9703j12439l7409q363o1100
22731g7939p799j7497J11749O8141M867o3642q6610O1079P2372l4866m8360K3702
22719E197q276n2995m4976j537M4569O2234M5113n2308q382N3390k7604p7976
$$ plain form
22707 -63551 -55851 16274 32500 26700 -3889 2801 63454 -7487 -58118 13750 -14350 77733
22695 77733 124741 89372 80347 10335 -102520 -135366 -103592 -40066 -77761 -27798 -4559 -58951
22683 -58951 -157069 -108738 -141121 -96557 -77370 -65976 -43113 -52255 -32467 30279 111797 81542
22671 81542 26975 -23842 12408 -16419 -30234 -44980 -62476 -17853 -5520 -40082 -36556 26538
22659 26538 87565 89628 -25972 -49092 -44076 -86069 -68541 -25056 -115334 -104909 33821 68773
22647 68773 16279 -21914 14964 -4120 -2675 56708 62568 85679 93891 -14860 36875 134559
22635 134559 124459 -4471 -65585 -82550 -19345 102390 90323 164249 195199 70359 -17952
22624 -17952 -55832 -523 36629 62835 10858 -5250 -2542 -57795 -61994 37708 23611 10359
$$ packed form
22707f3551P700P2125J6226n800l0589O690O0653p0941n0631P1868k8100R2083
22695G7733M7008l5369r025p0012j12855l2846L1774O3526l7695M9963K3239n4392
22683e8951r8118M8331l2383M4564J9187J1394K2863r142J9788O2746Q1518l0255
22671H1542n4567n0817L6250k8827j3815j4746j7496M4623J2333l4562L526O3094
22659B6538O1027K063j15600k3120N016m1993J7528M3485r0278J0425J38730L4952
22647F8773n2494l8193L6878j9084J445N9383N860K3111Q212j08751N1735R7684
22635A34559j0100j28930o1114j6965O3205J21735j2067P3926L0950j24840q8311
22624a7952l7880N5309L7152K6206n1977j6108K708n5253m199R9702j4097j3252
$$ plain form
22612 10359 49846 34605 40491 7496 93393 89645 118622 115159 66688 9945 36028 14194
22600 14194 5319 -68104 -101335 41350 58079 -50407 -140544 -164032 -39544 -64495 -25453
22589 -25453 30902 -7489 -24633 -55784 -87966 -48986 31870 26258 -10404 -3035 -37624 -6243
22577 -6243 -6595 -89909 -147217 -173591 -135322 -67306 -65106 -48631 14919 12926 26736 53567 -42024
22564 -42024 -56255 -79562 -43994 14373 -34873 -53611 35833 90260 3898 -59414 -52143 -38298
22552 -38298 -92167 -107203 -113131 -32552 -40866 -11580 91565 131749 76354 -25395 -9005 -34794
22540 -34794 -41765 -10695 -64275 -135543 -77011 -120390 -93973 -59957 -20099 24178 12477 -74705
22528 -74705 -75637 -47384 -98207 -117265 -24522 38093 -2385 -29234 36364 46002 30211 78047
$$ packed form
22612A0359L9487j5241N886l2995Q5897l748K8977l463m8471n6743K6083k1834
22600A4194q875p3423l3231J42685J6729j08486r0137k3488J24488k4951L9042
22589b5453N6355l8391j7144l1151l2182L8980Q0856n612l6662P369l4589L1381
22577f243l52q3314n7308k6374L8269O8016K200J6475O3550j993J3810K6831r5591
22564d2024j4231k3307L5568N8367m9246j8738Q9444N4427q6362o3312P271J3845
22552c8298n3869j5036n928Q0579q314K9286J03145M0184n5395j01749J6390k5789
22540c4794o971L1070n3580p1268N8532m3379K6417L4016L9858M4277j1701q7182
22528g4705r32K8253n0823j9058R2743O2615m0478k6849O5598R638j5791M7836
$$ plain form
22516 78047 42727 -5069 -39687 -69087 -83606 -21180 25026 94677 85855 152653 153565 133520
22504 133520 117613 59761 85151 97971 -16612 -54458 7773 18458 46007 48049 49248 67707
22492 67707 90836 117303 51441 15281 84182 71683 44101 7394 -17016 -21558 -67627 -52628
22480 -52628 -23681 62516 138980 69348 -13117 1285 -46232 -45623 -522 29166 74619 37807
22468 37807 -24427 -38788 -76284 -96887 -84161 -52933 -2777 1387 -39472 -49787 10412 48202
22456 48202 43458 -11636 23209 31015 11928 -10719 -27480 -81116 -65369 -75733 -19894 -40664
22444 -40664 -182170 -143733 -151604 -115133 -120627 -40910 -4984 -49249 -158734 -242407 -187761 -88965
22432 -88965 -40141 -24088 44174 37194 -43831 -78996 22664 57006 -5144 5284 -40297 -57083
$$ packed form
22516G8047l5320m7796l4618k9400j4519O2426M6206O9651q822O6798R12k0045
22504A33520j5907n7852K5390J2820j14583l7846O2231J0685K7549K042J199J8459
22492F7707K3129K6467o5862l6160O8901j2499k7582l6707k4410m542m6069J4999
22480e2628K8947Q6197P6464o9632q2465J4402m7517O09M5101K9688M5453l6812
22468C7807o2234j4361l7496k0603J2726L1228N0156M164m0859j0315O0199L7790
22456D8202m744n5094L4845P806j9087k2647j6761n3636J5747j0364N5839k0770
22444d0664j41506L8437p871L6471n494P9717L5926m4265j09485q3673N4646R8796
22432h8965M8824J6053O8262o980q1025l5165J01660L4342o2150J0428m5581j6786
$$ plain form
22420 -57083 -69814 -21195 30522 -64614 -42392 -75204 -79030 -114922 -127183 -32690 24138 14520
22408 14520 -41994 -93834 -35568 40796 37917 2747 -74775 -32622 -8183 -148091 -207915 -129491
22396 -129491 -135501 -152153 -70515 18631 29184 13862 -29272 -65062 -89621 -103792 -92977 -36269
22384 -36269 -15764 49972 37655 18005 -88886 -146761 -79870 -30784 -63633 -78647 -56695
22373 -56695 -101726 -104540 -96372 -66560 -93361 -8066 41326 12861 2115 9927 71229 105434
22361 105434 122910 178425 158768 122562 172753 155679 59959 89932 162110 226667 158935
22350 158935 101283 83799 73394 13243 -64282 -33588 -28206 -59458 -165289 -215854 -141551
22339 -141551 -103795 -64894 -3662 86836 93240 108129 137294 103341 85402 28067 -20875 -5819
$$ packed form
22420e7083j2731M8619N1717r5136K2222l2812l826l5892j2261R4493N6828r618
22408A4520n6514n1840N8266P6364k879l5170p7522M2153K4439j39908n9824P8424
22396a29491o010j6652Q1638Q9146J0553j5322m3134l5790k4559j4171J0815N6708
22384c6269K0505O5736j2317j9650j06891n7875O6891M9086l2849j5014K1952
22373e6695m5031k814Q168K9812k6801Q5295M9392k8465j0746P812O1302L4205
22361A05434J7476N5515j9657l6206N0191j7074r5720K9973P2178O4557o7732
22350A58935n7652j7484j0405o0151p7525L0694N382l1252j05831n0565P4303
22339a41551L7756L8901O1232R0498O404J4889K9165l3953j7939n7335m8942J5056
$$ plain form
22327 -5819 -89980 -149706 -181541 -102959 -70620 -78797 -72949 -159520 -82949 13509 23503 23370 39536
22314 39536 -9887 18879 -43245 -114407 -81023 -69229 -92722 -35123 -9920 -51933 -1603 81039
22302 81039 114152 94139 80222 -33201 -57373 13793 -11373 -6116 -44897 -20732 5394 -27267
22290 -27267 40500 69690 -20668 -74220 -17412 -18940 -67550 -73208 -21623 -20354 -54825 -43803
22278 -43803 -21423 -89888 -133336 -84089 -79431 -106037 -99836 -88791 -98811 -77895 -69104 -2258
22266 -2258 -20132 -75066 -54421 -84098 -84177 -136647 -176515 -138699 -74195 -60074 -80347 -60773
22254 -60773 -106773 -98202 -58567 -8183 -14929 -13954 -62193 -63350 -80596 -166519 -155353 -72201 -100301
22241 -100301 -126790 -132196 -152104 -92239 -70169 -45838 756 -37478 1507 25313 -62341 -85828
$$ packed form
22327e819q4161n9726l1835P8582L2339q177N848q6571P6571R6458R994j33J6166
22314C9536m9423K8766o2124p1162L3384J1794k3493N7599K5203m2013N0330Q2642
22302H1039L3113k0013j3917j13423k4172P1166k5166N257l8781K4165K6126l2661
22290b7267O7767K9190r0358n3552N6808j528m8610n658N1585J269l4471J1022
22278d3803K2380o8465m3448M9247M658k6606O201J1045j0020K0916Q791O6846
22266b258j7874n4934K0645k9677p9n2470l9868L7816O4504J4121k0273J9574
22254f0773m6000Q571L9635N0384o746R75m8239j157j7246q5923J1166Q3152k8100
22241a00301k6489n406j9908N9865K2070K4331M6594l8234L8985K3806q7654k3487
$$ plain form
22229 -85828 -53996 17053 29541 135565 123045 29745 -41568 1121 -20332 -45626 -50761 -11786
22217 -11786 96749 144463 97956 75262 62629 -1319 -38511 -66238 -78809 -104440 -112731 -71439
22205 -71439 -109834 -104220 27524 102189 73484 -47348 -93595 -107153 -72540 -2467 -47574
22194 -47574 -82186 -94095 -106629 -70704 12738 37947 -48634 -48403 -37258 -34731 19309 47211
22182 47211 -21592 -82609 -98236 -65821 -54685 -66854 -64 -35653 -33892 8761 1437 -35187
22170 -35187 -44462 -80091 -59631 -11977 -23959 -134982 -161953 -190946 -135269 -132525 -74291 64311
22158 64311 31400 10413 55909 25674 -15196 -27915 55290 25811 23094 -43950 -10643 20803
22146 20803 42852 51113 50835 50404 56809 86177 67213 19513 57179 59341 62036 53516 33994
$$ packed form
22229h5828L1832P1049J2488J06024j2520r3300p1313M2689k1453k5294n135L8975
22217a1786J08535M7714m6507k2694j2633o3948l7192k7727j2571k5631q291M1292
22205g1439l8395N614J31744P4665k8705j20832m6247j3558L4613P0073m5107
22194d7574l4612j1909j2534L5925Q3442K5209q6581K31J1145K527N4040K7902
22182D7211o8803o1017j5627L2415J1136j2169O6790l5589J761M2653p324l6624
22170c5187r275l5629K0460M7654j1982j11023k6971k8993N5677K744N8234J38602
22158F4311l2911k0987M5496l0235m0870j2719Q3205k9479k717o7044L3307L1446
22146B0803K2049Q261k78m31O405K9368j8964m7700L7666K162K695q520j9522
$$ plain form
22133 33994 66748 59240 52530 -11392 -88618 -35842 -22659 57677 44701 13349 15363 -27555
22121 -27555 -38764 -7205 -83886 -121262 -96856 -64079 -7232 93434 160951 201894 141095
22110 141095 99254 128479 49909 43509 60716 21935 -22199 -25678 64352 70693 59957 12383
22098 12383 -62965 1950 47384 -36672 -98275 -12020 47763 -35031 -47527 -86381 -138921 -182837
22086 -182837 -183399 -177957 -145236 -77243 -14984 -15173 -77471 -67486 -36625 -86192 -150351 -117999 -109907
22073 -109907 -96753 -57821 -23128 60526 83884 81766 122759 82673 45573 69654 129261 89016
22061 89016 -12762 -101932 -163249 -129868 -98373 -88844 -66192 13817 3028 -32885 -77578 -27390
22049 -27390 13013 48822 49716 34614 5683 108836 109570 60307 46944 14537 70811 95975
$$ packed form
22133C3994L2754p508o710o3922p7226N2776J3183Q0336j2976l1352K014m2918
22121b7555j1209L1559p6681l7376K4406L2777N6847J00666O7517M0943o0799
22110A41095m1841K9225p8570o400J7207l8781m4134l479R0030O341j0736m7574
22098A2383p5348O4915M5434q4056o1603Q6255N9783q2794j2496l8854n2540m3916
22086a82837n62N442L2721O7993O2259j89o2298R985L0861m9567o4159L2352Q092
22073a09907J3154L8932L4693Q3654K3358k118M0993m0086l7100K4081N9607m0245
22061H9016j01778q9170o1317L3381L1495R529K2652Q0009j0789l5913m4693N0188
22049b7390M0403L5809Q94j5102k8931J03153P34m9263j3363l2407N6274K5164
$$ plain form
22037 95975 60064 -1849 -1880 66771 62457 -10865 54438 46233 17274 -36226 -130095 -42715 95774
22024 95774 115254 47945 50104 59144 149053 136717 32227 -49349 -115087 -59554 -30756 -9183
22012 -9183 -4201 25035 19991 -54729 -82350 -6632 -24516 -32188 -57038 -36523 -19311 -10324 -31957
21999 -31957 -1419 -28662 -107628 -105522 -63145 -21667 -24491 -51238 -28167 86701 188931 162241
21987 162241 112554 41173 6867 55439 45591 -38714 -44011 -88774 -70568 40019 -25426 9698
21975 9698 65334 30145 66352 129335 100835 -33645 -59305 -52843 -90443 -57084 -21534 -56754
21963 -56754 -40669 -11685 22323 83518 28610 -24771 -54033 -51307 30593 19794 15214 -31456
21951 -31456 -50623 -132941 -136821 -87639 2422 46966 37816 42479 28724 13282 -49029 -11615
$$ packed form
22037I5975l5911o1913l1O8651m314p3322O5303q205k8959n3500r3869Q7380J38489
22024I5774J9480o7309K159R040Q9909j2336j04490q1576o5738N5533K8798K1573
22012i183M982K9236n044p4720k7621P5718j7884p672k4850K0515J7212Q987k1633
21999c1957L0538k7243p8966K106M2377M1478k824k6747K3071J14868J02230k6690
21987A62241m9687p1381l4306M8572r848q4305n297m4763J8206J10587o5445L5124
21975I698N5636l5189L6207O2983k8500j34480k5660O462l7600L3359L5550l5220
21963e6754J6085K8984L4008O1195n4908n3381k9262K726Q1900j0799m580m6670
21951c1456j9167q2318l880M9182R0061M4544r150M663j3755j5442o2311L7414
$$ plain form
21939 -11615 -53308 -15461 59223 21083 48358 101847 12594 -82037 -84611 -3337 -19934 -93222
21927 -93222 -34218 24941 45764 6976 -78528 -154679 -91881 -77066 -34280 25940 -54459 -50285
21915 -50285 25859 6085 81850 118979 -22657 -112254 -88837 -49436 -65245 -73740 -65144 -8267
21903 -8267 55300 45655 22304 30836 10348 52846 84608 76722 17653 -51141 -86702 -30777
21891 -30777 -57041 -140203 -60170 101186 -18511 -34913 20699 68618 83094 32356 -197
21880 -197 -55543 -51266 -4071 -911 17951 48823 89245 175699 219520 112914 55354 48612
21868 48612 30023 -11713 -76457 -50522 -104473 -78535 -62792 -13784 -12961 18691 28871 -78981
21856 -78981 -71062 -90920 -98792 -123481 -53679 71258 96872 48103 -5631 -26778 -23575 -36653
$$ packed form
21939a1615m1693L7847P4684l8140K7275N3489q9253r4631k574Q1274j6597p3288
21927i3222N9004N9159K0823l8788q5504p6151O2798J4815M2786O0220q0399M174
21915e0285P6144j9774P5765L7129j41636q9597K3417L9401j5809q495Q596N6877
21903h267O3567r645k3351Q532k0488M2498L1762p886n9069o8794l5561N5925
21891c0777k6264q3162Q0033J61356j19697j6402N5612M7919J4476n0738l2553
21880a97n5346M277M7195L160J8862L0872M0422Q6454M3821j06606n7560o742
21868D8612j8589m1736o4744K5935n3951K5938J5743M9008Q23L1652J0180j07852
21856g8981P919j9858p872k4689O9802J24937K5614m8769n3734k1147L203j3078
$$ plain form
21844 -36653 -61561 -27214 -19235 11996 4275 16043 -29202 25941 55634 70695 100228 118399
21832 118399 20334 -87085 -39481 -10714 -73251 -58117 -9734 67455 117135 109484 87647
21821 87647 11134 -42002 53563 103828 118893 164014 91858 90339 71596 4495 -26971 -4150
21809 -4150 21707 -2919 409 56050 90048 9794 -8506 -47984 -16510 60436 45293 1608
21797 1608 1751 62729 129336 67056 18979 192 -50172 -56327 -142873 -148477 -96684 -27777 21274
21784 21274 31473 91645 46308 -10329 9367 61114 4943 34721 56317 33017 57225 27952
21772 27952 -68356 -139099 -155648 -79879 -4035 51355 54623 66122 93480 70963 3099 -66723
21760 -66723 -67256 -84898 2755 121260 116799 16453 -64378 -15679 52964 44665 -15312 -71186
$$ packed form
21844c6653k4908L4347P979L1231p721J1768m5245N5143K9693J5061K9533J8171
21832A18399r8065j07419M7604K8767o2537J5134M8383P7189M9680p651k1837
21821H7647p6513n3136R5565N0265J5065M5121p2156j519j8743o7101l1466K2821
21809d150K5857k4626L328N5641L3998q0254j8300l9478L1474P6946j5143m3685
21797A608J43O0978O6607o2280m8077j8787n0364o155q6546n604N1793O8907M9051
21784B1274J0199O0172m5337n6637J9696N1747n6171K9778K1596k3300K4208k9273
21772B7952r6308p0743j6549P5769P5844N5390L268J1499K7358k2517o7864o9822
21760f6723n33j7642Q7653J18505m461j00346q0831M8699O8643q299n9977n5874
$$ plain form
21748 -71186 -128518 -68983 20088 68625 141491 145674 50742 88403 126033 108217 102333 70576
21736 70576 91478 196799 234747 274563 235671 185093 209428 231737 217270 119487 57013
21725 57013 27086 -28817 -1668 20404 -69404 -45250 40678 136790 103759 93043 90087 -18592
21713 -18592 -67916 -23514 17852 92426 54493 30945 61410 139468 185928 118855 -19014
21702 -19014 -96952 -99158 -43025 15435 5356 -116759 -126201 -32557 29842 25043 -66499 -65236
21690 -65236 -54384 -25630 57448 18208 27953 48297 12887 -14216 -5272 -43881 -128334 -72605
21678 -72605 4148 -51406 -47120 13870 -25403 -91742 -10401 -27744 -25752 -63540 17551 65317
21666 65317 76554 74494 88918 33729 -58876 53190 111012 107578 84227 40778 -43419 -57330
$$ packed form
21748g1186n7332N9535Q9071M8537P2866M183r4932L7661L7630j7816n884l1757
21736G0576K0902J05321L7948L9816l8892n0578K4335K2309j4467r7783o2474
21725E7013k9927n5903K7149K2072q9808K4154Q5928R6112l3031j0716k956j08679
21713a8592m9324M4402M1366P4574l7933k3548L0465P8058M6460o7073j37869
21702a9014p7938k206N6133N8460j0079j22115r442R3644O2399m799r1542J263
21690f5236J0852K8754Q3078l9240R745K0344l5410k7103Q944l8609q4453N5729
21678g2605P6753n5554M286O0990l9273o6339Q1341j7343J992l7788Q1091M7766
21666F5317J1237k060J4424n5189r2605J12066N7822l434k3351m3449q4197j3911
$$ plain form
21654 -57330 -29180 -17769 20685 37312 118737 140619 61116 -10242 20781 816 -10063 -18419
21642 -18419 -55878 41280 63846 103562 178810 93669 37821 99635 134287 177856 282064
21631 282064 251907 119266 15947 17410 61275 115733 78334 61450 -12812 -34368 -4818
21620 -4818 -14639 22066 27508 22525 41288 104969 130127 123681 36068 48183 65856 146880 209667
21607 209667 214127 190171 78166 52279 41871 -16752 -58202 -50193 753 -26203 -36094 47500
21595 47500 26873 -82653 -171209 -177151 -73131 -25729 68763 101077 49452 -21863 -43689
21584 -43689 -21513 38334 61044 74846 -6218 -61661 -37266 -59104 -38620 63834 93586
21573 93586 118641 83524 101717 110948 20612 364 51660 101163 87476 27503 -47682 -12182
$$ packed form
21654e7330K8150J1411L8454J6627Q1425K1882p9503p1358L1023j9965j0879q356
21642a8419l7459R7158K2566L9716P5248q5141n5848O1814L4652M3569J04208
21631B82064l0157j32641j03319J463M3865N4458l7399j6884p4262k1556K9550
21620d818r821L6705N442m983J8763O3681K5158o446q7613J2115J7673Q1024O2787
21607B09667M460k3956j12005k5887j0408n8623m1450Q009N0946k6956r891Q3594
21595D7500k0627j09526q8556n942J04020M7402R4492L2314n1625p1315k1826
21584d3689K2176N9847K2710J3802q1064n5443K4395k1838K0484J02454K9752
21573I3586K5055l5117J8193R231r0336k0248N1296M9503j3687n9973p5185L5500
$$ plain form
21561 -12182 27645 -17150 -34599 -110961 -128866 -119256 -60377 -157 17099 -12989 40811 3950
21549 3950 -21739 -15333 17355 -67017 -96517 -39889 18664 29272 23975 19210 -34344 6728
21537 6728 93346 93150 46290 64754 25040 -1366 47726 55839 8084 64043 13635 80585
21525 80585 43318 -685 22798 32097 -60401 -58974 -2423 -572 -26131 -21573 -17956 97179
21513 97179 97320 61938 -3416 44437 40238 -11653 46731 50861 71463 122935 166378 186766
21501 186766 129426 52264 39598 85246 67173 16488 -14594 -12463 15743 61380 142000 126114
21489 126114 35381 -23019 18233 16287 2317 -37599 -19716 17120 28386 12552 -25009 43469
21477 43469 16451 -20084 19431 38184 69569 152535 109927 -24379 -78023 -26473 32233
$$ packed form
21561a2182L9827m4795j7449p6362j7905R610N8879O0220J7256l0088N3800l6861
21549C950k5689O406L2688q4372k9500N6628N8553J0608n297m765n3554M1072
21537F728Q6618j96m6860J8464l9714k6406M9092Q113m7755N5959n0408O6950
21525H0585l7267m4003K3483R299r2498J427N6551J851k5559M558L617J15135
21513I7179J41l5382o5354M7853m199n1891N8384M130K0602N1472M3443K0388
21501A86766n7340p7162j2666M5648j8073n0685l1082K131K8206M5637Q0620j5886
21489A26114r0733n8400M1252j946j3970l9916J7883L6836J1266j5834l7561O8478
21477D3469k7018l6535L9515J8753L1385Q2966m2608j34306n3644N1550N8706
$$ plain form
21466 32233 28054 35102 66360 203751 223153 214155 173051 102671 21592 -80368 -56896 -40522
21454 -40522 -53979 -72319 -35014 -7721 -33650 -142513 -125740 -84115 -37729 9703 65631
21443 65631 -35892 -38122 4844 99369 115481 100189 -10540 -52754 -10710 -5370 -34002 -8720
21431 -8720 63678 48691 -28556 -24553 -5430 8730 14683 -5522 45938 30288 13821 12106
21419 12106 -33139 -42200 -96578 -85350 -71802 -82624 -46405 -67141 -85214 -124091 -141795 -17196
21407 -17196 95824 126078 138173 35245 15005 26264 42048 59826 51141 11853 31552
21396 31552 -31129 -30532 6407 -6007 -87052 -68056 -76032 -25181 73373 41970 57579 35823
21384 35823 43090 37463 88669 48493 -29702 -5952 91951 165479 203178 244854 203008 147664
$$ packed form
21466C2233m179P048L1258J37391J9402q998m1104p0380q1079j01960K3472J6374
21454d0522j3457j8340L7305K7293k5929j08863J6773M1625M6386M7432N5928
21443F5631j01523k230M2966R4525J6112j5292j10729m2214M2044N340k8632K5282
21431h720P2398j4987p7247M003J9123J4160N953k0205N1460j5650j6467j715
21419A2106m5245r061n4378J1228J3548j0822L6219k0736j8073l8877j7704J24599
21407a7196J13020L0254J2095j02928k0240J1259J5784J7778q685l9288J9699
21396C1552o2681N97L6939j2414q1045J8996p976N0851R8554l1403J5609k1756
21384C5823P267n627N1206m0176p8195K3750R7903P3528L7699M1676m1846n5344
$$ plain form
21372 147664 134856 44919 25791 26918 -29924 -75135 -25589 31258 -42867 -30499 -10867 -26193
21360 -26193 -24552 18194 96732 77043 29387 100519 131769 165942 184365 163451 40079 43966
21348 43966 101781 82641 58776 89082 105076 110945 105143 81519 112007 47439 56948 37198
21336 37198 -66644 -4129 -14835 -44046 20698 40413 6798 18078 -7106 -50459 -33375
21325 -33375 -24512 -25378 -25045 -65162 -59321 2221 -8559 -39271 -4743 4057 -7144 31426 102439
21312 102439 56042 15688 59480 -22642 -64207 -42585 -70531 -100428 -5367 63271 10850
21301 10850 -41289 -70287 -67036 -12557 -15883 61654 87787 82431 85930 93633 105422 69963 61517
21288 61517 136008 109467 78710 25917 -5935 81976 139663 125249 110529 138596 103220 51813
$$ packed form
21372A47664j2808q9937j9128J127n6842m5211M9546N6847p4125J2368J9632j5326
21360b6193J641M2746P8538j9689m7656P1132L1250L4173J8423k0914j23372L887
21348D3966N7815j9140k3865L0306J5994N869n802k3624L0488o4568R509j9750
21336C7198j03842O2515j0706k9211O4744J9715l3615J1280k5184m3353J7084
21325c3375Q863q66L33m0117N841O1542j0780l0712L4528Q800j1201L8570P1013
21312A02439m6397m0354M3792q2122m1565K1622k7946k9897R5061O8638n2421
21301A0850n2139k8998L251N4479l326P7537K6133n356L499P703J1789l5459q446
21288F1517P4491k6541l0757n2793l1852Q7911N7687j4414j4720K8067l5376n1407
$$ plain form
21276 51813 12007 40466 870 -81187 -154888 -75879 77382 129893 31623 -24115 -30302 -122563
21264 -122563 -190401 -75600 -79928 -35493 127489 155685 161977 141088 67632 39417 -36330
21253 -36330 -159264 -173280 -150988 -203833 -210339 -185672 -76068 -22930 -1571 20462 -228
21242 -228 43068 157265 117550 138555 10949 -8064 70932 56580 51237 107433 109356 14210
21230 14210 -91426 -81401 4574 109132 118653 14163 -15747 -1045 -68276 -38698 -4845
21219 -4845 29394 -748 -55189 -90803 -45656 -37740 35084 30937 3334 3869 -12067 78004 76289
21206 76289 28515 9749 58303 48607 -91678 -85825 27909 143259 119057 138925 141339 153827
21194 153827 129360 62441 -17434 -8513 49604 72191 75783 21136 -15988 -52407 -13150 16907
$$ packed form
21276E1813l9806K8459l9596q2057p3701P9009J53261N2511r8270n5738o187r2261
21264a22563o7838J14801m328M4435J62982K8196O292k0889p3456k8215p5747
21253c6330j22934j4016K2292n2845o506K4667J09604N3138K1359K2033k0690
21242b28M3296J14197l9715K1005j27606j9013P8996j4352n343N6196J923r5146
21230A4210j05636J0025Q5975J04558R521j04490k9910J4702o7231K9578L3853
21219d845L4239l0142n4441l5614M5147P916P2824m147k7603N35j5936R0071j715
21206G6289m7774j8766M8554r696j40285N853J13734J15350k4202J9868K414J2488
21194A53827k4467o6919p9875Q921N8117K2587L592n4647l7124l6419L9257L0057
$$ plain form
21182 16907 -12721 -41299 -44844 -73389 -24887 13270 54259 -12328 -32786 -55982 -21914 61567
21170 61567 95070 97277 139126 -21359 14336 76378 115257 109773 82261 63461 81820 106514
21158 106514 79683 38640 -51001 -67204 -135808 -120491 -31464 82038 85595 41113 36108 64634
21146 64634 -10254 8432 36907 24090 17139 -44815 -146623 -203246 -205314 -106697 18340 82225
21134 82225 71729 82924 53351 78104 70120 75063 14064 32465 82164 44178 6754 117190
21122 117190 53609 779 25733 30843 45630 62280 76689 13544 13431 72689 106108 124635
21110 124635 77476 735 61921 80251 92402 39649 -51567 -30931 15050 16883 40344 -2107
21098 -2107 -45804 -36993 -21562 -76473 -107527 -69084 -80577 -51715 -8932 17035 22244 15914
$$ packed form
21182A6907k9628k8578l545k8545M8502L8157M0989o6587k0458k3196L4068Q3481
21170F1567L3503K207M1849j60485L5695O2042L8879n484k7512j8800J8359K4694
21158A06514k6831m1043q9641j6203o8604J5317Q9027J13502L557m4482n005K8526
21146F4634p4888J8686K8475j2817o951o1954j01808n6623k068R8617J25037O3885
21134H2225j0496J1195k9573K4753p984M943o0999J8401M9699l7986l7424J10436
21122A17190o3581n2830K4954N110J4787J6650J4409o3145j13N9258L3419J8527
21110A24635m7159p6741O1186J8330J2151n2753r1216K0636M5981J833K3461m2451
21098b107m3697Q811J5431n4911l1054L8443j1493K8862M2783K5967N209o330
$$ plain form
21086 15914 -21758 24209 91802 101222 59695 83891 115100 148701 153584 116443 132941 110843
21074 110843 179020 170056 131524 109626 169155 162220 113014 70681 11410 15039 -14665 -36773
21062 -36773 -10018 -13349 -41397 36653 108665 121323 139368 157244 90843 26893 -86602 -121647
21050 -121647 -98987 -124679 -77127 -108388 -136317 -165530 -232411 -176065 -82884 -58575 -137318
21039 -137318 -169000 -17800 12819 29762 13538 26051 98563 117733 40899 -70469 -64280
21028 -64280 -5921 -98629 -129692 -117222 -63056 16021 80055 97641 187580 234471 199250 -14944
21016 -14944 -111921 -23489 2090 39493 107052 105155 -5419 -9005 21680 72265 63467 43484
21004 43484 37855 67546 85023 96896 12255 -35552 54587 35488 -15536 -48693 -96556 -83393
$$ packed form
21086A5914l7672M5967O7593R420m1527K4196L1209L3601M883l7141J6498k2098
21074A10843O8177q964l8532k1898N9529o935m9206m2333n9271L629k9704k2108
21062c6773K6755l331k8048P8050P2012J2658J8045J7876o6401o3950j13495l5045
21050a21647K2660k5692M7552l1261k7929k9213o6881N6346R3181K4309p8743
21039a37318l1682J51200L0619J6943j6224J2513P2512J9170p6834j11368O189
21028f4280N8359r2708l1063J2470N4166P9077O4034J7586Q9939M6891l5221k14194
21016a4944r6977Q8432K5579L7403O7559j897j10574l586L0685N0585q798j9983
21004D3484n629K9691J7477J1873q4641m7807R0139j9099n1024l3157m7863J3163
$$ plain form
20992 -83393 -47578 50422 70838 73163 35746 58873 58265 -835 -24390 18984 21113 106907
20980 106907 82373 52800 81122 22795 -50316 -44764 -41304 -599 45255 54487 35185 35280 88489
20967 88489 80675 -2426 -32904 -24072 17611 97966 157828 186274 157000 200929 202575 173328
20955 173328 135348 82586 20244 -14426 6396 -24240 -18923 -77832 -29261 -63921 -71076 -44098
20943 -44098 -27722 9928 132061 151062 133220 49858 -61335 -87240 -20577 -16515 -72445
20932 -72445 -116413 -118588 -105194 -29896 29661 -16985 -45505 47280 50719 -14199 -75202 -139135
20920 -139135 -166554 -207876 -164949 -92298 -152307 -158539 -53514 -43799 -14990 27943 48257 -31213
20908 -31213 -76601 -68237 23941 12005 -1564 11815 103807 174217 172087 85744 42911 26877
$$ packed form
20992h3393L5815R8000K0416K325l7417K3127o08n9100k3555M3374K129Q5794
20980A06907k4534k9573K8322n8327p3111N552L460M0705M5854R232j9302R5N3209
20967H8489p814q3101l0478Q832M1683Q0355N9862K8446k9274M3929J646k9247
20955A73328l7980n2762o2342l4670K0822l0636N317n8909M8571l4660p155K6978
20943d4098J6376L7650J22133J9001j7842q3362j11193k5905O6663M062n5930
20932g2445m3968k175J3394P5298N9557m6646k8520R2785L439o4918o1003o3933
20920a39135k7419m1322M2927P2651o0009o232J05025R715K8809M2933K0314p9470
20908c1213m5388Q364R2178j1936j3569J3379R1992P0410k130q6343m2833j6034
$$ plain form
20896 26877 38424 31284 73305 78222 25109 21230 -43252 -27673 84059 8655 19232 70706
20884 70706 69603 180320 98976 30012 42113 59980 55026 56590 52905 -17328 -89367 -116194
20872 -116194 -84933 -55793 -3989 -23453 -25586 18247 38840 14390 44872 68021 34997 33566
20860 33566 -30403 -35468 -50778 -49406 -24956 -46369 -61241 -71038 -47920 53563 25895 -45211
20848 -45211 28155 65005 32243 40345 30566 76611 178640 135492 120978 124467 110741 109124
20836 109124 68050 92540 49909 -31865 -89010 -124519 -87699 -10000 24471 31687 68142 80601
20824 80601 118987 136389 125491 38803 1780 -37457 -49769 -62344 -25773 -55114 -2961 74511
20812 74511 112366 144331 110934 123037 201671 165648 42119 35152 107013 98235 138382 84726
$$ packed form
20896B6877J1547p140M2021M917n3113l879o4482J5579J11732p5404J0577N1474
20884G0706j103J10717q1344o8964J2101J7867m954J564l685p0233p2039k6827
20872a16194L1261K9140N1804j9464k133M3833K0593k4450L0482K3149l3024j431
20860C3566o3969n065j5310J372K4450k1413j4872r797K3118J01483k7668p1106
20848d5211P3366L6850l2762Q102r779M6045J02029m3148j4514L489j3726j617
20836A09124m1074K4490m2631q1774n7145l5509L6820P7699L4471P216L6455J2459
20824H0601L8386J7402j0898q6688l7023l9237j2312j2575L6571k9341N2153P7472
20812G4511L7855L1965l3397J2103P8634l6023j23529o967P1861q778M0147n3656
$$ plain form
20800 84726 37744 95347 54524 -22592 29028 76111 85038 17149 -2753 24323 21278 74474
20788 74474 118105 78353 46801 37834 60776 110266 189323 254698 157850 24997 29280 146883
20776 146883 157581 156931 108923 24407 -12956 40808 77497 31485 11108 60462 141749 165972
20764 165972 66479 -26445 54649 156252 241140 177710 51817 33055 43516 30295 136772
20753 136772 145762 93693 103973 3577 -153302 -142531 -74971 -10451 18599 8183 18620
20742 18620 60834 49658 28400 77764 178491 139816 136217 93496 -5091 -61662 -66506 -76518
20730 -76518 -105101 -129918 -77751 -131692 -93757 32341 41910 -26776 -24330 -22602 31944 163058
20718 163058 178305 167932 157014 88516 81076 132873 37707 77372 158422 196908 174204 66813
$$ packed form
20800H4726m6982N7603m0823p7116N1620M7083Q927o7889j9902K7076l045N3196
20788G4474M3631l9752l1552q967K2942M9490P9057O5375r6848j32853M283J17603
20776A46883J0698o50m8008q4516l7363N3764L6689m6012k0377M9354Q1287K4223
20764A65972r9493r2924Q1094J01603Q4888o3430j25893j8762J0461j3221J06477
20753A36772Q990n2069J0280j00396j56879J0771O7560O4520K9050j0416J0437
20742A8620M2214j1176k1258M9364J00727l8675l599m2721r8587n6571m844j0012
20730g6518k8583k4817N2167n3941L7935J26098R569o8686K446J728N4546J31114
20718A63058J5247j0373j0918o8498p440N1797r5166L9665Q1050L8486k2704j07391
$$ plain form
20706 66813 49908 56340 39657 -24390 -164844 -120241 18697 73367 59865 60639 -22204 -89749
20694 -89749 -18734 85483 122566 67700 48099 45121 39001 82391 105992 117904 82651 91978
20682 91978 128626 182698 68806 -247 16562 57383 5937 24199 74113 145412 242034
20671 242034 204418 118461 58352 40318 133232 180447 132653 11303 1717 115733 123713
20660 123713 116290 42200 -39290 -33104 -25612 29970 55178 14290 -5785 55013 121816 179359
20648 179359 175766 120603 23574 5506 83012 161489 72552 8982 68371 110435 90862 95303
20636 95303 151320 218895 214101 208588 235541 393142 561351 662704 747273 765739 715325
20625 715325 588788 522498 486980 551294 545119 457122 477986 510742 594016 600778 592245 707689
$$ packed form
20706F6813j6905O432j6683o4047j40454M4603J38938N4670j3502P74q2843o7545
20694h9749P1015J04217L7083n4866j9601k978o120M3390K3601J1912l5253R327
20682I1978L6648N4072j13892o9053J6809M0821n1446J8262M9914P1299R6622
20671B42034l7616q5957o0109j8034R2914M7215m7794j21350r586J14016P980
20660A23713p423p4090q1490O186P492N5582K5208m0888k0075O0798O6803N7543
20648A79359l593n5163r7029j8068P7506P8477q8937o3570N9389M2064j9573M441
20636I5303N6017O7575m794n513K6953J57601J68209J01353Q4569J8466n0414
20625G15325j26537o6290l5518O4314o175q7997K0864L2756Q3274O762q533J15444
$$ plain form
20613 707689 773254 795173 794972 740507 641103 572931 499436 446051 441472 410982 344203 193457
20601 193457 170254 133979 73416 96468 158325 178750 219947 210270 130473 -6325 15410
20590 15410 69012 132919 100096 8849 -94664 -40747 51449 118759 188918 276778 412254
20579 412254 378338 204339 144271 219726 276636 289890 322194 446115 615057 629365 757805
20568 757805 903872 921448 825837 799078 779383 695629 676412 728175 857794 906089 769818
20557 769818 612543 574177 689753 761386 883125 703249 553537 500153 375736 299527
20547 299527 157894 171631 149203 134218 128295 150733 150024 147497 90193 56784 -46955 -170978
20535 -170978 -161829 -65130 -31724 -44936 -52799 -10648 -51918 -19423 120090 160861 162254 173965
$$ packed form
20613G07689O5565K1919k01n4465r9404o8172p3495n3385m579l0490o6779j50746
20601A93457k3203l6275o0563K3052O1857K0425M1197r677p9797j36798K1735
20590A5410N3602O3907l2823r1247j03513N3917R2196O7310P0159Q7860J35476
20579D12254l3916j73999o0068P5455N6910J3254L2304J23921J68942J4308J28440
20568G57805J46067J7576r5611k6759j9695q3754j9217N1763J29619M8295j36271
20557G69818j57275l8366J15576P1633J21739j79876j49712n3384j24417p6209
20547B99527j41633J3737k2428j4985n923K2438p09k527n7304l3409j03739j24023
20535a70978R149R6699L3406j3212p863M2151m1270L2495J39513M0771J393J1711
$$ plain form
20523 173965 82790 52265 86507 151808 100714 35906 -35605 -12671 66262 122421 134706
20512 134706 137293 165143 143331 160513 137030 99052 101463 162834 97003 29191 54392 111073
20500 111073 130571 227084 195980 159473 147385 171330 221588 245041 276168 315478 271131
20489 271131 212990 200958 213575 156407 88437 35865 21058 73572 72426 62767 68916 86127
20477 86127 52911 43497 36567 -399 10127 95115 139323 148172 121413 113527 117150 188630 208347
20464 208347 233014 248606 227592 213039 193478 151357 140937 84300 98320 118367 111207 91140
20452 91140 142466 193540 164974 66176 18516 54683 35288 31525 42963 83704 18268 36710
20440 36710 78066 136011 116370 163667 86847 36625 4074 74028 141064 153216 196795 174156
$$ packed form
20523A73965r1175l0525L4242O5301n1094o4808p1511K2934P8933N6159J2285
20512A34706K587K7850k1812J7182k3483l7978K411O1371o5831o7812K5201N6681
20500A11073J9498R6513l1104l6507j2088K3945N0258K3453L1127L9310m4347
20489B71131n8141j2032J2617n7168o7970n2572j4807N2514j146r659O149J7211
20477H6127l3216r414o930l6966J0526Q4988M4208Q849k6759p886L623P1480J9717
20464B08347K4667J5592k1014j4553j9561m2121j0420n6637J4020K0047p160k0067
20452I1140N1326N1074k8566r8798m7660L6167j9395l763J1438M0741o5436J8442
20440C6710M1356N7945j9641M7297p6820n0222l2551O9954O7036J2152M3579k2639
$$ plain form
20428 174156 137593 123214 121214 108872 193845 264803 231220 247482 192606 165194 192239 249342
20416 249342 220198 116137 96435 137150 218529 187811 110077 157938 107713 88316 176390
20405 176390 211286 240603 262097 250501 189181 175098 170383 127227 189760 213483 124742 43357
20393 43357 111006 199405 146144 143186 97002 178132 142139 37361 14942 67590 92856 166551
20381 166551 185001 213036 210504 134195 97814 -28880 -63030 -79923 16136 4117 -11783
20370 -11783 126238 198166 229551 137583 59446 102611 126728 248570 279266 199764 204915
20359 204915 230908 183638 148447 169021 203530 216531 218965 185916 152930 82362 49649 134544
20347 134544 183544 226860 203607 242658 250470 251684 243226 220612 161382 110558 83290 56009
$$ packed form
20428A74156l6563j4379k000j2342Q4973P0958l3583J6262n4876k7412K7045N7103
20416B49342k9144j04061j9702M0715Q1379l0718p7734M7861n0225j9397Q8074
20405A76390L4896K9317K1494j1596o1320j4083m715m3156O2533K3723q8741q1385
20393D3357O7649Q8399n3261k958m6184Q1130l5993j04778k2419N2648K5266P3695
20381A66551J8450K8035k532p6309l6381j26694l4150j6893R6059j2019j5900
20370a1783J38021P1928L1385r1968p8137M3165K4117J21842L0696p9502N151
20359B04915K5993m7270l5191K0574L4509J3001K434l3049l2986p0568l2713Q4895
20347A34544M9000M3316k3253L9051P812J214q458k2614n9230n0824k7268k7281
$$ plain form
20335 56009 44439 67824 77370 69158 170119 291800 321374 330420 392960 422571 365603 307047
20323 307047 309513 323482 251431 125193 126373 176734 222027 229359 229663 250034 279658 209029
20311 209029 177505 138041 152410 187851 228186 269569 272266 309339 255071 235892 260843 221364
20299 221364 292926 409035 419389 379475 381194 459969 425872 406095 378734 353207 430941
20288 430941 527429 515014 484448 481432 517393 591895 676724 794093 756850 712883 737861
20277 737861 825022 864017 905828 1010104 1097107 1076281 1006196 852553 792877 799799 691062
20266 691062 543847 502260 582172 575806 546721 461472 419452 363607 335138 466007 398376
20255 398376 365927 368111 257802 135683 215866 322181 283591 302879 321478 340949 411952
$$ packed form
20335E6009j1570K3385R546q212J00961J21681K9574R046O2540K9611n6968n8556
20323C07047K466J3969p2051j26238J180N0361M5293P332L04K0371K9624p0629
20311B09029l1524l9464J4369L5441M0335M1383K697L7073n4268j9179K4951l9479
20299B21364P1562J16109J0354l9914J719P8775l4097j9777k7361k5527P7734
20288D30941R6488j2415l0566l016L5961P4502Q4829J17369l7243m3967K4978
20277G37861Q7161L8995M1811J04276Q7003k0826p0085j53643n9676O922j08737
20266F91062j47215m1587P9912o366k9085q5249m2020n5845k8469J30869o7631
20255C98376l2449K184j10309j22119Q0183J06315l8590J9288J8599J9471P1003
$$ plain form
20244 411952 454090 547076 523569 422248 374704 363250 409499 465502 536593 707924 792951
20233 792951 860982 891556 878572 867080 898428 926367 949655 1010874 1110460 1176602 1292388
20222 1292388 1321204 1284986 1269193 1125978 997882 1006583 998447 918110 892537 924709 968379
20211 968379 1157232 1323885 1310802 1173679 1014163 837465 844534 861392 703254 542933
20201 542933 505644 495919 459068 535829 574451 588560 572795 543995 447341 483388 517353 563227
20189 563227 546508 541532 491806 444237 547057 692948 641294 553353 530465 580309 764227
20178 764227 782266 649752 557850 548790 640196 667558 645899 662110 643619 564185 611672
20167 611672 708270 810990 816831 791972 759159 658618 711024 786927 725127 714320 758788
$$ packed form
20244D11952M2138R2986k3507j01321m7544j1454M6249N6003P1091J71331Q5027
20233G92951O8031L0574j2984j1492L1348K7939K3288O1219R9586O6142J15786
20222A292388K8816l6218j5793j43215j28096Q701q136q0337k5573L2172M3670
20211I68379J88853J66653j3083j37123j59516j76698P069J6858j58138j60321
20201E42933l7289r725l6851P6761L8622J4109j5765k8800r6654L6047L3965M5874
20189E63227j6719m976m9726m7569J02820J45891n1654q7941k2888M9844J83918
20178G64227J8039j32514r1902r060R1406K7362k1659J6211j8491p9434M7487
20167F11672R6598J02720N841k4859l2813j00541N2406P5903o1800j0807M4468
$$ plain form
20156 758788 779770 821707 872849 863920 824704 834983 947994 1006770 1013840 1072791 1144288 1165445
20144 1165445 1165513 1207659 1125769 1091135 1017624 951164 982741 1014440 1049655 1166600 1201520 1250613
20132 1250613 1316219 1336590 1327639 1335808 1341528 1434756 1450937 1419611 1476084 1490036 1712796 1746088
20120 1746088 1657912 1735062 1844654 1981687 2088729 2150751 2290648 2406514 2521299 2614339
20110 2614339 2697001 2889647 3182566 3413359 3675374 4020460 4352808 4762724 5272320 5654329
20100 5654329 5976275 6397698 6958648 7563648 8483736 9630762 11260681 13487451 16228335
20091 16228335 19106525 22012174 25221066 28975239 30595917 27956435 25508796 25337569
20083 25337569 27246048 30909533 36580577 45131646 57387010 74841074 96914041 120963274
$$ packed form
20156G58788K0982M1937N1142q929l9216J0279J13011N8776P070N8951P1497K1157
20144A165445O8M2146q1890l4634p3511o6460L1577L1699L5215J16945L4920M9093
20132A250613O5606K0371q951Q169N720R3228J6181l1326N6473J3952K22760L3292
20120A746088q8176P7150J09592J37033J07042O2022J39897J15866J14785R3040
20110B614339Q2662J92646K92919K30793K62015L45086L32348M09916N09596L82009
20100E654329L21946M21423N60950O05000R20088J147026J629919K226770K740884
20091A6228335K878190K905649L208892L754173J620678k639482k447639j71227
20083B5337569J908479L663485N671044Q551069J2255364J7454064K2072967K4049233
$$ plain form
20075 120963274 145729381 173974212 207519435 218624203 187469670 157962484 137547157
20068 137547157 109884489 82505461 65735900 58188330 56491630 58092223 61194545
20061 61194545 65035491 70126301 73388106 65091142 48511059 35245210 26925422 21791977
20053 21791977 18483081 16314080 14908531 13919269 13403367 13269517 13433719 13566360 13837430
20044 13837430 14402765 14897698 15012001 15169791 15918931 17242012 19187290 21900925 25469419
20035 25469419 30404243 37308391 46078431 55691792 65227363 75256784 86712590 94073924
20027 94073924 87340797 75863156 71226870 74278772 84637972 102159904 125987941
20020 125987941 155549911 190351283 228870429 262276526 274913976 276413668 269215249
$$ packed form
20075A20963274K4766107K8244831L3545223J1104768l1154533k9507186k0415327
20068A37547157k7662668k7379028j6769561p547570j696700J600593L102322
20061F1194545L840946N090810L261805q296964j6580083j3265849q319788n133445
20053B1791977l308896k169001j405549r89262n15902j33850J64202J32641K71070
20044A3837430N65335M94933J14303J57790P49140J323081J945278K713635L568494
20035B5469419M934824O904148Q770040R613361R535571J0029421J1455806P361334
20027I4073924o733127j1477641m636286L051902J0359200J7521932K3828037
20020A25987941K9561970L4801372L8519146L3406097J2637450J499692p198419
$$ plain form
20013 269215249 214840682 144456796 97996556 71183998 55202683 45375806 39435024
20006 39435024 36255357 35286625 35787916 36733965 37849367 39464578 41537042 38937235
19998 38937235 29650142 21407423 16365777 13232908 11232949 9893011 9059517 8298255
19990 8298255 7660681 7285069 6997369 6583842 6238743 5859680 5097461 4401274 3853709
19981 3853709 3539630 3316623 3135376 2979053 2768440 2660707 2588190 2567718 2518939 2476145
19971 2476145 2330333 2200653 1998219 1887989 1774351 1635697 1509916 1545885 1522028 1457980
19961 1457980 1433091 1450342 1544976 1547936 1441557 1342134 1304764 1321452 1324240 1280156 1141324
19950 1141324 1071890 1081929 1016082 836365 762333 748793 709022 724714 703122 675684 768376
$$ packed form
20013B69215249n4374567p0383886m6460240k6812558j5981315r826877n940782
20006C9435024l179667r68732N01291R46049J115402J615211K072464k599807
19998C8937235r287093q242719n041646l132869j999959j339938q33494p61262
19990H298255o37574l75612k87700m13527l45099l79063p62219o96187n47565
19981C853709l14079k23007j81247j56323k10613j07733p2517k0472m8779m2794
19971B476145j45812j29680k02434j10230j13638j38654j25781L5969k3857o4048
19961A457980k4889J7251R4634K960j06379r9423l7370J6688K788m4084j38832
19950A141324o9434J0039o5847j79717p4032j3540l9771J5692k1592k7438R2692
$$ plain form
19939 768376 865563 985506 1024922 1005477 969968 939786 950249 935799 825752 798191 870482
19928 870482 931833 920928 835795 797486 716155 692146 781417 769209 693739 738007 745228 663760
19916 663760 615643 470869 371843 357096 402546 423441 466153 438422 471730 463926 458307 529118
19904 529118 647062 582056 554592 549598 644264 624984 561144 644894 691169 787850 894718
19893 894718 929609 932942 870757 761989 650168 569024 600451 565596 592565 668263 776790
19882 776790 868294 926565 949843 845939 863766 967061 934022 797865 678581 666415 668504
19871 668504 627115 584042 719264 756727 678072 679005 578276 551568 525040 449293 362843
19860 362843 468379 522837 496738 487193 590632 707988 647730 570076 588375 607057 654192
$$ packed form
19939G68376R7187J19943L9416j9445l5509l0182J0463j4450j10047k7561P2291
19928H70482O1351j0905q5133l8309q1331k4009Q9271j2208p5470M4268P221q1468
19916F63760m8117j44774r9026j4747M5450K0895M2712k7731L3308p804n619P0811
19904E29118J17944o5006k7464m994R4666j9280o3840Q3750M6275R6681J06868
19893H94718L4891L333o2185j08768j11821q1144L1427l4855K6969P5698J08527
19882G76790R1504N8271K3278j03904J7827J03295l3039j36157j19284j2166K089
19871F68504m1389m3073J35222L7463p8655R33j00729k6708k6528p5747q6450
19860C62843J05536N4458k6099r545J03439J17356o0258p7654J8299J8682M7135
$$ plain form
19849 654192 722166 645659 628205 621798 664588 662467 654591 644934 601316 617736 684191 802538
19837 802538 896484 931112 961513 873717 867917 962556 1062630 1151839 1100414 991248 961673
19826 961673 914120 943132 956178 936517 954260 874785 816638 748153 734404 865943 1003383
19815 1003383 1045474 1065595 1040876 1079991 1108925 1073223 1007846 922997 904657 958706 997318
19804 997318 991375 983071 1100542 1208426 1294369 1375926 1423645 1393844 1390822 1288950 1225891
19793 1225891 1179929 1205609 1228542 1226769 1217897 1322463 1434749 1538914 1634695 1730807 1737971
19782 1737971 1726070 1675923 1680491 1728962 1875358 2013370 2039485 2059600 2179435 2241843 2288767
19771 2288767 2386204 2403432 2451732 2488837 2525113 2550129 2750144 2968103 3166752 3299897
$$ packed form
19849F54192O7974p6507j7454o407M2790k121p876r657m3618J6420O6455J18347
19837H02538R3946L4628L0401q7796n800R4639J00074Q9209n1425j09166k9575
19826I61673m7553K9012J3046j9661J7743p9475n8147o8485j3749J31539J37440
19815A003383M2091K0121k4719L9115K8934l5702o5377q4849j8340N4049L8612
19804I97318n943q304J17471J07884Q5943Q1557M7719k9801l022j01872o3059
19793A225891m5962K5680K2933j773q872J04566J12286J04165R5781R6112P164
19782A737971j1901n0147M568M8471J46396J38012K6115K0115J19835O2408M6924
19771B288767R7437J7228M8300L7105L6276K5016K00015K17959J98649J33145
$$ plain form
19761 3299897 3491481 3806107 4249239 4719415 5137129 5647636 6230804 6969449 7626799
19752 7626799 7961345 8326671 8756072 9264927 10124402 11454029 13373139 16125821 20001825
19743 20001825 24661220 29456998 34005066 39162106 45769452 48237035 42075514 36885658
19735 36885658 36184173 39172640 45609429 55736494 70441276 91909775 121502484 156142789
19727 156142789 191767016 228421270 273598283 315270263 296702813 242700158 201876349
19720 201876349 155964975 111325870 84161904 70236607 64389725 64146543 67026871
19713 67026871 70982728 75463287 81769711 86495929 75778143 54505837 38526893 29021440
19705 29021440 23269719 19689144 17429236 15884676 14758939 14203176 14098623 13957231
$$ packed form
19761C299897J91584L14626M43132M70176M17714N10507N83168P38645O57350
19752G626799L34546L65326M29401N08855Q59475J329627J919110K752682L876004
19743B0001825M659395M795778M548068N157040O607346K467583o161521n189856
19735C6885658p01485K988467O436789J0127065J4704782K1468499K9592709L4640305
19727A56142789L5624227L6654254M5177013M1671980j8567450n4002655m0823809
19720B01876349m5911374m4639105k7163966j3925297n846882k43182K880328
19713F7026871L955857M480559O306424M726218j0717786k1272306j5978944r505453
19705B9021440n751721l580575k259908j544560j125737n55763j04553j41392
$$ plain form
19697 13957231 13516104 13427455 13691156 13668305 13490063 13659407 14157691 14912163 16249445
19688 16249445 18263799 21343245 25583671 31506774 39082081 47382321 55604381 64330272
19680 64330272 74980341 82302527 75101954 63834855 59762652 63369576 73703204 89037706
19672 89037706 108340590 132651461 162767313 190790239 197732246 193128606 200134519
19665 200134519 185106252 127696513 81506375 55655636 41042868 32516660 27106403
19658 27106403 23649343 21647354 21056267 21415178 22260104 23158098 24388922 26185007 24811418
19649 24811418 18788563 13630683 10449533 8625796 7527256 6825094 6308610 5909835
19641 5909835 5596755 5277349 4842191 4415449 4197297 3902356 3275611 2828935 2560765
$$ packed form
19697A3957231m41127q8649K63701k2851j78242J69344M98284P54472J337282
19688A6249445K014354L079446M240426N923103P575307Q300240Q222060Q725891
19680F4330272J0650069P322186p200573j1267099m072203L606924J0333628J5334502
19672H9037706J9302884K4310871L0115852K8022926O942007m603640P005913
19665B00134519j5028267n7409739m6190138k5850739j4612768q526208n410257
19658B7106403l457060k001989n91087L58911Q44926Q97994J230824J796085j373589
19649B4811418o022855n157880l181150j823737j098540p02162n16484l98775
19641E909835l13080l19406m35158m26742k18152k94941o26745m46676k68170
$$ plain form
19632 2560765 2380598 2190066 1942513 1848125 1739569 1672057 1709071 1733462 1753179 1727681
19622 1727681 1613615 1489467 1388088 1396353 1380045 1315812 1192949 1272587 1324969 1264065 1308341
19611 1308341 1231127 1253087 1317238 1308353 1409400 1524398 1544808 1588421 1599549 1413393 1248648
19600 1248648 1114290 989553 815665 681342 626046 676045 717051 700502 677139 709975
19590 709975 759898 738453 617024 556937 525080 530246 525629 505196 449472 330398 361793
19579 361793 514587 601399 641525 675028 609028 494453 510619 402089 367028 403217 355676
19568 355676 272221 207576 299836 345975 372766 440357 488732 494324 539299 571342 481716 462015
19556 462015 579469 637901 687381 752175 808308 820402 884719 919953 975042 1106988 1265575
$$ packed form
19632B560765j80167j90532k47553r4388j08556o7512L7014K4391J9717k5498
19622A727681j14066j24148j01379Q265j6308o4233j22863P9638N2382o0904M4276
19611A308341p7214K1960O4151q885J01047J14998K0410M3613J1128j86156j64745
19600A248648j34358j24737j73888j34323n5296M9999M1006j6549k3363L2836
19590G09975M9923k1445j21429o0087l1857N166m617k0433n5724j19074L1395
19579C61793J52794Q6812M0126L3503o6000j14575J6166j08530l5061L6189m7541
19568C55676q3455o4645R2260M6139K6791O7591M8375N592M4975L2043q9626j9701
19556D62015J17454N8432M9480O4794N6133J2094O4317L5234N5089J31946J58587
$$ plain form
19545 1265575 1242566 924001 690979 601765 478342 347542 340864 333010 324889 400950 480404
19534 480404 508841 549932 563698 540452 561125 641831 824349 829292 873462 888155 910720
19523 910720 970264 1079685 1197662 1106454 988132 940891 974165 927038 854989 902646 1036478
19512 1036478 1015317 913807 803326 775233 801793 797444 755562 624932 533569 444904 405933
19501 405933 394252 347519 231316 292973 398390 443128 327568 225581 215821 220914 184497
19490 184497 209616 301144 367315 375311 229141 181651 160009 132953 180141 185071 286706
19479 286706 323573 259133 277290 276237 396352 431645 326458 379478 427892 479913 470661
19468 470661 485923 451569 500529 620356 728047 857477 791110 726716 674498 641412 618357
$$ packed form
19545A265575k3009l18565k33022q9214j23423j30800o678p854q121P6061P9454
19534D80404K8437M1091J3766k3246K0673Q0706J82518M943M4170J4693K2565
19523I10720N9544J09421J17977r1208j18322m7241L3274m7127p2049M7657J33832
19512A036478k1161j01510j10481k8093K6560m349m1882j30630r1363q8665l8971
19501D05933j1681m6733j16203O1657J05417M4738j15560j01987r760N093l6417
19490A84497K5119R1528O6171P996j46170m7490k1642k7056M7188M930J01635
19479B86706L6867o4440J8157j053J20115L5293j05187N3020M8414N2021r252
19468D70661J5262l4354M8960J19827J07691J29430o6367o4394n2218l3086k3055
$$ plain form
19457 618357 592432 505753 463129 386371 397459 478906 517522 562403 648269 648923 637372 580291
19445 580291 530887 446251 448742 442045 398473 376119 330621 308666 307966 379822 287828 184308
19433 184308 224065 188445 140810 112536 161917 111683 13354 -21431 41017 102120 -13593
19422 -13593 -35964 69648 126420 69957 41721 -12514 -22239 -54361 -29237 46049 196952
19411 196952 260967 316671 265620 157170 111272 147543 167765 167062 142233 131335 147164 160112
19399 160112 146448 110360 33913 94272 115433 109624 108321 -5281 32176 181227 163099
19388 163099 179295 37244 13338 -46222 -74196 -131739 -59346 35092 130339 106882 131656
19377 131656 176286 120575 33181 -50673 -10579 39887 77024 30127 2424 5432 76718 166523
$$ packed form
19457F18357k5925q6679m2624p6758J1088Q1447L8616M4881Q5866O54j1551n7081
19445E80291m9404q4636K491o697m3572k2354m5498k1955p00P1856r1994j03520
19433A84308L9757l5620m7635k8274M9381n0234r8329l4785O2448O1103j15713
19422a3593k2371J05612N6772n6463k8236n4235r725l2122K5124P5286J50903
19411A96952O4015N5704n1051j08450m5898L6271K0222p03k4829j0898J5829J2948
19399A60112j3664l6088p6447O0359K1161n809j303j13602L7457J49051j8128
19388A63099J6196j42051k3906n9560k7974n7543P2393R4438R5247k3457K4774
19377A31656M4630n5711q7394q3854M0094N0466L7137m6897k7703L008P1286Q9805
$$ plain form
19365 166523 217487 164433 -16667 -56280 4600 -3918 -6990 90539 168095 150926 134994 -21106
19353 -21106 -77105 -45641 -47977 -1255 3368 -102166 -104974 -70705 27814 95974 126512 74192
19341 74192 -36544 -44807 -70411 -76382 -52419 6967 17968 86140 85838 94905 68078 19903
19329 19903 1638 4544 40279 72997 52657 39926 80674 111108 167294 134348 58790 -13923
19317 -13923 37733 56646 -4185 -104749 -105088 -58941 -97935 -107763 -72427 -108296 -89377 -67794
19305 -67794 -27783 -60940 -150672 -172778 -124398 -155582 -135685 -97033 11079 -18036 -154337
19294 -154337 -131721 -22263 31562 62383 -11419 -126036 -184725 -204101 -150819 -137179 -110259
19283 -110259 -71546 -67844 -53936 -68463 -34754 -4110 -14444 -18698 -35708 -55458 -72669 -135442
$$ packed form
19365A66523N0964n3054j81100l9613O0880q518l072R7529P7556j7169j5932j56100
19353b1106n5999L1464k336M6722M623j05534k808L4269R8519O8160L0538n2320
19341G4192j10736q263k5604n971K3963N9386J1001O8172l02R067k6827m8175
19329A9903j8265K906L5735L2718k0340j2731M0748L0434N6186l2946p5558p2713
19317a3923N1656J8913o0831j00564l39M6147l8994r828L5336l5869J8919K1583
19305f7794M0011l3157q9732k2106M8380l1184J9897L8652J08112k9115j36301
19294a54337K2616J09458N3825L0821p3802j14617n8689j9376N3282J3640K6920
19283a10259L8713L702J3908j4527L3709L0644j0334m254j7010j9750j7211o2773
$$ plain form
19271 -135442 -180088 -168412 -168716 -172204 -169259 -175752 -192811 -105908 27126 122198 113703 63377
19259 63377 72404 19299 -51201 -25871 -45955 -92641 -96325 -54200 -33878 -20790 23750 31449
19247 31449 18398 60356 69332 39621 -93675 -56598 -36135 -21297 12023 87883 96379 102395
19235 102395 70298 27820 -17053 -19203 -29982 -28651 -124171 -95766 -15790 13961 10547 -71635
19223 -71635 -60564 -65131 -149377 -137745 -56406 -3863 -116524 -153480 -36457 91661 54833
19212 54833 -84203 -98528 -128974 -210129 -106828 10252 -21146 -48362 -54998 -93656 -49594
19201 -49594 75160 129600 162559 174926 195692 186247 104709 94242 143604 318212 303025
19190 303025 278211 282048 315159 356183 421372 477186 522237 529343 556502 557615 509760 529153
$$ packed form
19271a35442m4646J1676l04l488K945o493j7059Q6903J33034R5072q495n0326
19259F3377R027n3105p0500K5330k0084m6686l684M2125K0322J3088M4540P699
19247C1449j3051M1958Q976k9711j33296L7077K0463J4838L3320P5860Q496O016
19235A02395l2097m2478m4873k150j0779J331r5520K8405P9976K9751l414q2182
19223g1635J1071m567q4246J1632Q1339N2543j12661l6956J17023J28118l6828
19212E4833j39036j4325l0446q1155J03301J17080l1398k7216o636l8658M4062
19201d9594J24754N4440L2959J2367K0766r445q1538j0467M9362J74608j5187
19190C03025k4814L837L3111M1024O5189N5814M5051P106K7159J113m7855J9393
$$ plain form
19178 529153 616159 708679 851957 891107 840790 743288 835816 936524 864328 786254 628294
19167 628294 464758 369947 240754 172236 123965 169140 234328 239512 204612 163199 155707
19156 155707 224800 387180 384564 280020 223280 172578 179260 137416 64428 49653 45058 72373
19144 72373 86440 75242 92458 115238 81462 7896 42262 121496 107463 124067 276920
19133 276920 451498 569918 635959 586799 495890 412361 424619 465675 530786 588584 669316
19122 669316 528841 295904 259232 241974 131692 147672 252949 386154 529182 538227
19112 538227 569276 665740 757808 743433 589555 484805 430263 413186 339846 161603 42590
19101 42590 24297 16751 -7770 55146 129837 79234 -889 -45171 -164398 -176251 -93607 -81967
$$ packed form
19178E29153Q7006R2520J43278L9150n0317r7502R2528J00708p2196p8074j57960
19167F28294j63536r4811j29193o8518m8271M5175O5188N184l4900m1413p492
19156A55707O9093J62380k616j04544n6740n0702O682m1844p2988j4775m595K7315
19144G2373J4067j1198J7216K2780l3776p3566L4366P9234j4033J6604J52853
19133B76920J74578J18420O6041m9160r0909q3529J2258M1056O5111N7798Q0732
19122F69316j40475k32937l6672j7258j10282J5980J05277J33205J43028R045
19112E38227L1049R6464R2068j4375j53878j04750n4542j7077p3340j78243j19013
19101D2590j8293p546k4521O2916P4691n0603q0123m4282j19227j1853Q2644J1640
$$ plain form
19089 -81967 -51228 -89852 -59163 -5012 20532 20576 68606 111677 115911 101495 180510 257568
19077 257568 155758 1267 36953 7005 -49873 -39956 58142 71961 -1788 -4872 -48827
19066 -48827 -38674 -58993 -91508 -40853 -67172 -55099 -47720 -45011 -3064 4195 -17370 -28936
19054 -28936 -3697 -3474 -51935 -21816 -3773 -40330 -34551 17495 -34175 -72576 -52590 -40208
19042 -40208 22469 109991 152669 88217 64554 41945 -13381 -11749 21634 70581 21784 -32388
19030 -32388 -30870 -70386 3745 8470 -36938 -18217 -14157 -67685 -23591 42368 40229 36289 45719
19017 45719 46332 13104 -62528 -23290 41885 41795 44008 158848 264987 312372 280473 319380
19005 319380 430528 434934 292710 261297 286967 250413 190463 179474 228899 240437 212391
$$ packed form
19089h1967L0739l8624L0689N4151K5544M4M8030M3071M234j4416P9015P7058
19077B57568j01810j54491L5686k9948n6878R917R8098J3819p3749l084m3955
19066d8827J0153k0319l2515N0655k6319J2073P379K709M1947P259k1565j1566
19054b8936K5239K23m8461L0119J8043l6557N779N2046n1670l8401J9986J2382
19042d0208O2677Q7522M2678o4452k3663k2609n5326J632L3383M8947m8797n4172
19030c2388J518l9516P4131M725m5408J8721M060n3528M4094O5959k139l940R430
19017D5719O13l3228p5632L9238O5175r0K213J14840J06139M7385l1899L8907
19005C19380J11148M406j42224l1413K5670l6554n9950j0989M9425J1538k8046
$$ plain form
18994 212391 176223 192657 193139 171590 148388 27842 -99171 -91203 -94863 -84650 -29756 -37845
18982 -37845 -55730 -118895 -73513 46473 59055 86637 71955 68127 79961 79329 86508 78572
18970 78572 31363 28882 7563 8983 81640 108499 128423 151385 132675 180825 298280 308340
18958 308340 236382 158628 116940 112824 35860 -21887 29462 131703 223886 272503 327029
18947 327029 326187 250976 97811 94458 59627 -39169 -93560 -113837 -25931 15052 19444 53920
18935 53920 166882 181881 116333 74056 80694 96688 76031 57634 51376 79611 134837 142339
18923 142339 98869 42203 26012 31373 -19682 -27198 8761 55246 111335 37445 -27214 -24306
18911 -24306 32481 33521 66477 100591 7101 -60248 -81071 -35415 14870 -2642 -16552 27189
$$ packed form
18994B12391l6168J6434M82k1549k3202j20546j27013P968l660J0213N4894q089
18982c7845j7885o3165M5382J19986J2582K7582j4682l828J1834o32P179p936
18970G8572m7209k481k1319J420P2657K6859J9924K2962j8710M8150J17455J0060
18958C08340p1958p7754m1688m116p6964n7747N1349J02241R2183M8617N4526
18947C27029q42p5211j53165l353l4831r8796n4391k0277Q7906M0983M392L4476
18935E3920J12962J4999o5548m2277O638J5994k0657j8397o258K8235N5226P502
18923A42339m3470n6666j6191N361n1055p516L5959M6485N6089p3890o4659K908
18911b4306N6787J040L2956L4114r3490o7349k0823M5656N0285j7512j3910M3741
$$ plain form
18899 27189 86522 76804 92717 199093 159145 -33720 -83195 36491 6550 407 -42776
18888 -42776 -45149 43756 132881 61263 26642 -48668 -91101 -27579 -56583 -12799 -24317 -14447
18876 -14447 -2667 -5613 39584 11045 -36331 9824 53848 15826 -80608 -126621 -135696 -100445
18864 -100445 -33756 20320 34905 16706 76533 40831 -3024 -38583 -4629 -142 -38780 -36116
18852 -36116 -43833 -55646 -14769 -48953 -83401 -43554 -27254 -59872 -67062 -48715 -43701 14526
18840 14526 102196 112704 121113 214383 208670 168874 141319 66739 -44169 -86297 -24670 49374
18828 49374 62473 37321 -14253 10477 -10577 -51499 -71878 -78450 -41896 -45239 -33596 26097
18816 26097 -66147 -138121 -108785 -33620 101427 136924 20565 -79468 -30877 -12255 -37271
$$ packed form
18899B7189N9333r718J5913J06376l9948j92865m9475J19686k9941o143m3183
18888d2776k373Q8905Q9125p1618l4621p5310m2433O3522k9004M3784j1518R870
18876a4447J1780k946M5197k8539m7376M6155M4024l8022r6434m6013r075L5251
18864a00445O6689N4076J4585j8199N9827l5702m3855l5559L3954M487l8638K664
18852c6116p717j1813M0877l4184l4448L9847J6300l2618p190J8347N014N8227
18840A4526Q7670J0508Q409R3270n713l9796k7555p4580j10908m2128O1627P4044
18828D9374J3099k5152n1574K4730k1054m0922k0379o572L6554l343J1643N9693
18816B6097r2244p1974K9336P5165J35047L5497j16359j00033M8591J8622k5016
$$ plain form
18805 -37271 -44719 -99171 -150523 -152009 -168701 -139894 -117735 -50897 -63182 -47270 -57215 -54810
18793 -54810 -111943 -90642 -166231 -187746 -111447 -27368 27690 26204 44089 54422 64356 44232
18781 44232 120873 130370 95553 43934 51379 45885 11660 79531 189451 205097 142778 175674
18769 175674 307735 366256 432967 500192 621771 740865 544561 373069 203335 121520
18759 121520 89152 101956 89391 98169 147158 164047 90954 30884 37598 9309 -11804 -37218
18747 -37218 -4698 -958 9738 77100 96328 116486 78828 41686 -1594 -539 37103 -12560
18735 -12560 39990 105846 162347 202282 306859 347249 363055 240901 249355 324297 294838
18724 294838 202262 155347 101820 31956 22050 92275 65267 70042 148269 227197 249058 187740
$$ packed form
18805c7271p448n4452n1352j486j6692K8807K2159O6838j2285J5912r945K405
18793e4810n7133K1301p5589k1515P6299Q4079N5058j486J7885J0333R934k0124
18781D4232P6641R497l4817n1619P445n494l4225O7871J09920J5646o2319L2896
18769A75674J32061N8521O6711O7225J21579J19094j96304j71492j69734q1815
18759A21520l2368J2804j2565Q778M8989J6889p3093o0070O714k8289k1113k5414
18747c7218L2520L740J0696O7362J9228K0158l7658l7142m3280J055L7642m9663
18735a2560N2550O5856N6501L9935J04577M0390J5806j22154Q454P4942k9459
18724B94838r2576m6915n3527o9864r906P0225k7008M775P8227P8928K1861o1318
$$ plain form
18712 187740 120754 110714 101241 166591 127076 125687 112343 48646 63807 80335 125348 175779
18700 175779 254753 267213 203918 189684 154340 89026 42710 5852 -50187 -107129 -113088 -22026
18688 -22026 -29034 71434 125677 22267 54600 66082 71339 140318 163609 123734 152096 217814
18676 217814 247372 171222 127788 140322 147086 195720 118667 11771 -13018 -32574 9067
18665 9067 71389 109331 24239 -57047 30896 75910 25944 6173 -24351 64444 64923 86681
18653 86681 64413 31761 45732 57792 55030 65189 49376 84758 96130 108095 44756 30301
18641 30301 53088 42386 28542 160 -57043 -31632 -13328 -16598 -43266 -53819 -28329 37687
18629 37687 35867 -3950 39789 29632 13353 41422 30093 52283 51897 65726 98177 69286
$$ packed form
18712A87740o6986j0040r473O5350l9515j389j3344o3697J5161J6528M5013N0431
18700A75779P8974J2460o3295j4234l5344o5314m6316l6858n6039n6942n959R1062
18688b2026p008J00468N4243j03410L2333J1482N257O8979K3291l9875K8362O5718
18676B17814K9558p6150m3434J2534O764M8634p7053j06896k4789j9556M1641
18665I067O2322L7942q5092q1286Q7943M5014m9966j9771l0524Q8795M79K1758
18653H6681k2268l2652J3971J2060k762J0159j5813L5382J1372J1965o3339j4455
18641C0301K2787j0702j3844k8382n7203K5411J8304l270k6668j0553K5490O6016
18629C7687j820l9817M3739j0157j6279K8069j1329K2190l86J3829L2451k8891
$$ plain form
18617 69286 45788 41616 -17643 -19643 -13085 18063 -17733 -42231 -119151 -26412 97330 48555
18605 48555 -21224 -85197 -62573 -61439 -76162 -17105 -36024 -90042 -72747 -57845 13623 -37837
18593 -37837 -25744 32961 40378 -3141 -99907 -89356 -26242 -3625 -21179 20448 -17316 43945
18581 43945 36239 6423 -6336 51737 126168 152176 84005 -27118 -91742 -55550 -15735 45350
18569 45350 113142 72373 82212 48362 54975 159418 141219 156863 191817 168005 147429 238847
18557 238847 281339 410630 644791 793594 921311 990463 1021417 914450 583862 455821
18547 455821 416042 251349 101643 98435 64873 102409 171719 283642 352840 372889 315903
18536 315903 198625 136330 87639 84876 80644 18542 27308 112128 185159 193333 98253 101972
$$ packed form
18617F9286k3498m172n9259k000O558L1148l5796k4498p6920R2739J23742m8775
18605D8555o9779o3973K2624J134j4723N9057j8919n4018J7295J4902P1468n1460
18593c7837J2093N8705P417m3519r6766J0551O3114K2617j7554M1627l7764O1261
18581D3945p706k9816j2759N8073P4431K6008o8171j11123o4624L6192L9815O1085
18569D5350O7792m0769R839l3850O613J04443j8199J5644L4954k3812k0576R1418
18557B38847M2492J29291K34161J48803J27717O9152L0954j06967l30588j28041
18547D55821l9779j64693j49706l208l3562L7536O9310J11923O9198K0049n6986
18536C15903j17278o2295m8691k763m232o2102Q766Q4820P3031Q174r5080L719
$$ plain form
18524 101972 160645 90974 77312 137449 127674 49061 71186 73565 102549 133637 78916 22743
18512 22743 50969 192297 166930 238038 279107 214507 146774 97736 121815 165372 237720
18501 237720 330279 323836 389320 426664 502305 584755 631873 710827 803127 710538 495408
18490 495408 351815 290988 175269 85431 59895 41441 4177 53106 4611 28609 -29510
18479 -29510 -25636 16966 58631 114714 187273 223234 129640 49777 58991 101909 23365 -58759
18467 -58759 45600 161462 142552 61509 69727 -38597 -96866 -45070 42461 132508 171333
18456 171333 291084 284447 247685 179715 149621 98721 69179 113729 3013 -29695 16592
18445 16592 -10366 23346 16755 7219 -4708 -45008 -106266 -90029 23201 749 -28969 -45979
$$ packed form
18524A01972N8673o9671j3662O0137r775p8613K2125K379K8984L1088n4721n6173
18512B2743K8226J41328k5367P1108M1069o4600o7733m9038K4079M3557P2348
18501B37720R2559o443O5484L7344P5641Q2450M7118P8954R2300r2589k15130
18490D95408j43593o0827j15719q9838k5536j8454l7264M8929m8495K3998n8119
18479b9510L874M2602M1665N6083P2559L5961r3594p9863R214M2918p8544q2124
18467e8759J04359J15862j8910q1043Q218j08324n8269N1796Q7531R0047L8825
18456A71333J19751o637l6762o7970l0094n0900k9542M4550j10716l2708M6287
18445A6592k6958L3712o591r536j1927m0300o1258J6237J13230k2452k9718j7010
$$ plain form
18433 -45979 8807 -2993 -76684 -87980 -91850 -117234 -61441 -19751 -5268 114971 138202 69605
18421 69605 59160 40016 -25117 -97836 -54291 29288 44112 25239 5882 36785 92551 41291
18409 41291 -7765 -36186 -6278 78110 103853 14188 -104893 -81863 -46641 34108 54752
18398 54752 -16316 -52885 -92058 -117985 -119991 -92957 -126793 -131755 -107884 31357 77232 -36184
18386 -36184 -111252 -72192 -106379 -43372 154248 158021 116082 53513 70342 69738 126796 54950
18374 54950 -54427 -78919 -44316 20331 17389 54358 68811 69796 25176 -1284 630 108063
18362 108063 101276 61134 69517 59605 88287 108846 168503 128562 67139 -27870 15828 39082
18350 39082 3094 39917 47785 87968 181439 225107 148653 90250 105973 50280 73585 41272
$$ packed form
18433d5979N4786j1800p3691j1296l870k5384N5793M1690J4483J20239K3231o8597
18421F9605j0445j9144o5133p2719M3545Q3579J4824j8873j9357L0903N5766n1260
18409D1291m9056k8421K9908Q4388K5743q9665j19081K3030L5222Q0749K0644
18398E4752p1068l6569l9173k5927k006K7034l3836m962K3871J39241M5875j13416
18386c6184p5068L9060l4187O3007J97620L773m1939o2569J6829o04N7058p1846
18374E4950j09377k4492L4603O4647k942L6969J4453R85m4620k6460J914J07433
18362A08063o787m0142Q383r912K8682K0559N9657l9941o1423r5009M3698K3254
18350C9082l5988L6823P868M0183R3471M3668p6454n8403J5723n5693K3305l2313
$$ plain form
18338 41272 32248 44068 -29657 -16465 32652 95243 146376 171115 66467 -15965 -39794 -16388
18326 -16388 -24934 50456 69108 158485 158923 80312 55405 38931 -73568 -182388 -170192 -96811
18314 -96811 8495 -5769 -72303 -88258 -82772 -43353 -11172 21537 57957 49807 -1169 14738
18302 14738 76871 156662 183139 234254 231976 128273 130848 73529 -31632 -69909 -92378 -30310
18290 -30310 51674 81198 -49765 -134563 -90047 25725 96672 119010 73080 91322 70326
18279 70326 23742 -49999 -70157 -80065 -71291 2709 3725 21192 13530 4322 23576 26112 23612
18266 23612 23775 -820 29638 7212 -46571 -110861 -138423 -107255 1820 20746 30660 70633
18254 70633 123254 194033 165754 85272 60430 -37574 -17532 15021 -32138 -94744 -54945 5899
$$ packed form
18338D1272r024J1820p3725J3192M9117O2591N1133K4739j04648q2432k3829K3406
18326a6388q546P5390J8652Q9377M38p8611k4907j6474j12499j08820J2196P3381
18314i6811J05306j4264o6534j5955N486L9419L2181L2709L6420q150n0976J5907
18302A4738O2133P9791K6477N1115k278j03703K575n7319j05161l8277k2469O2068
18290c0310Q1984K9524j30963q4798M4516J15772P0947K2338m5930J8242k0996
18279G0326m6584p3741k0158r908Q774P4000J016J7467p662r208J9254K536k500
18266B3612J63k4595L0458k2426n3783o4290k7562L1168J09075J8926R914L9973
18254G0633N2621P0779k8279q0482k4842r8004K0042L2553m7159o2606L9799O0844
$$ plain form
18242 5899 59699 99928 136933 168407 143672 159449 145526 15485 25447 25667 46104 39399
18230 39399 29837 35193 121967 231972 163111 102739 26570 24032 84248 16985 2600 1596
18218 1596 -94927 -65552 -28171 42453 78185 123150 152743 103711 51596 100356 67544 57165
18206 57165 116394 80126 100552 118780 113955 29122 26390 61834 67518 10662 64982 86137
18194 86137 79342 59657 134798 146238 222166 211972 144596 131078 209738 199257 172025 167005
18182 167005 195201 212274 204404 249668 209381 90013 169565 302757 301504 286635 302552
18171 302552 268087 225158 281309 368805 417200 362192 382224 383656 415145 383603 270988
18160 270988 244118 311010 286005 240438 228234 253719 300873 466232 545233 541029 538867 482732
$$ packed form
18242E899N3800M0229L7005L1474k4735J5777j3923j30041R962K20K0437o705
18230C9399r562N356Q6774J10005o8861o0372p6169k538O0216o7263j4385j004
18218A596r6523K9375L7381P0624L5732M4965K9593m9032n2115M8760l2812j0379
18206E7165N9229l6268K0426J8228m825q4833k732L5444N684n6856N4320K1155
18194H6137o795j9685P5141J1440P5928j0194o7376j3518P8660j0481k7232n020
18182A67005K8196J7073p870M5264m0287j19368P9552J33192j253j4869J5917
18171C02552l4465m2929N6151Q7496M8395n5008K0032J432L1489l1542j12615
18160B70988k6870O6892k5005m5567j2204K5485M7154J65359P9001m204k162n6135
$$ plain form
18148 482732 437168 404451 538671 622278 608688 687548 787094 848136 832630 878098 946488
18137 946488 1102501 1202105 1239066 1224466 1232051 1315666 1417918 1534181 1720670 2016890 2326192
18126 2326192 2607670 2881857 3168459 3614785 4088198 4734809 5506303 6506665 7811338
18117 7811338 9612272 12238066 15822431 20930981 28170670 39024768 54330591 71010549
18109 71010549 85943810 99525025 120128007 141258175 114436035 67400709 40435959
18102 40435959 26398530 18682362 14020059 10855560 8466533 6742326 5484611 4669475
18094 4669475 4055969 3565373 3171336 2771289 2436632 2224540 2062067 1934503 1710468
18085 1710468 1548261 1434159 1332324 1195431 1101540 952691 817784 723007 767431 683577
$$ packed form
18148D82732m5564l2717J34220Q3607j3590P8860R9546O1042j5506M5468O8390
18137I46488J56013R9604L6961j4600P585Q3615J02252J16263J86489K96220L09302
18126B326192K81478K74187K86602M46326M73413O46611P71494J000362J304673
18117G811338J800934K625794L584365N108550P239689J0854098J5305823J6679958
18109G1010549J4933261J3581215K0602982K1130168k6822140m7035326k6964750
18102D0435959j4037429p716168m662303l164499k389027j724207j257715q15136
18094D669475o13506m90596l94037m00047l34657k12092j62473j27564k24035
18085A710468j62207j14102j01835j36893r3891j48849j34907r4777M4424q3854
$$ plain form
18075 683577 647135 581146 578012 499956 462896 526476 570537 557750 504835 448295 428830 463809
18063 463809 479265 444182 413370 368207 263883 296633 319800 302749 391123 456312 450913
18052 450913 397825 381578 315712 248519 279431 230956 158505 198455 172814 82940 49293
18041 49293 68284 14320 -35054 -13711 17081 -6409 57296 26728 8840 -64336 -34946 -26726
18029 -26726 2583 59445 72274 141116 170272 162770 108370 64158 72086 35328 -3285 38815
18017 38815 108522 84420 -3340 3070 44827 118243 164679 108050 152608 125612 139665 178957
18005 178957 74992 44626 -22046 -41064 -80613 -25477 48346 75413 127454 130984 117297
17994 117297 97646 43148 101277 214802 175351 82864 54935 67348 116523 152817 153426 145006
$$ packed form
18075F83577l6442o5989l134p8056l7060O3580M4061j2787n2915n6540j9465L4979
18063D63809J5456l5083l0812m5163j04324L2750K3167j7051Q8374O5189n399
18052D50913n3088j6247o5866o7193L0912m8475p2451L9950k5641q9874l3647
18041D9293J8991n3964m9374K1343L0792k3490O3705l0568j7888p3176K9390Q220
18029b6726K9309N6862J2829O8842K9156p502n4400m4212P928l6758l8613M2100
18017C8815O9707k4102q7760O410M1757P3416M6436n6629M4558k6996J4053L9292
18005A78957j03965l0366o6672j9018l9549N5136P3823K7067N2041L530j3687
17994A17297j9651n4498N8129J13525l9451r2487k7929J2413M9175L6294O09q420
$$ plain form
17982 145006 149156 81095 10720 -37046 -68805 6576 -16930 -77073 -103815 -53234 -10506 114983
17970 114983 167670 104069 54050 20236 126551 114463 70963 39876 104114 143417 137401
17959 137401 82789 -9468 -7678 -27477 -28120 -24233 -8100 7628 -36675 -132052 -115715 -79084
17947 -79084 -14828 20648 6477 -93086 -71700 -94115 -75115 -32655 -47127 -96184 -73556 -32175
17935 -32175 -8981 34543 25545 37721 102835 177956 130499 -16159 -95448 -47706 -91334 -130107
17923 -130107 -30602 114841 157356 133132 203868 82222 57178 76015 113397 114786 84792
17912 84792 56151 127483 24998 -88940 -116935 -147429 -90807 -66897 -60102 -85144 -95772
17901 -95772 -138457 -85025 -86051 -24706 33956 328 -63056 -108423 -141496 -140452 -193940 -174636
$$ packed form
17982A45006M150o8061p0375m7766l1759P5381k3506o0143k6742N0581M2728J25489
17970A14983N2687o3601n0019l3814J06315j2088m3500l1087O4238L9303o016
17959A37401n4612r2257J790j9799o43L887J6133J5728m4303r5377J6337L6631
17947g9084O4256L5476j4171r9563K1386k2415J9000M2460j4472m9057K2628M1381
17935c2175K3194M3524q998J2176O5114P5121m7457j46658p9289M7742m3628l8773
17923a30107R9505J45443M2515k4224P0736j21646k5044J8837L7382J389k9994
17912H4792k8641P1332j02485j13938k7995l0494N6622K3910O795k5042j0628
17901i5772m2685N3432j026O1345N8662l3628o3384m5367l3073J044n3488J9304
$$ plain form
17889 -174636 -113113 -139121 -149673 -61173 8265 10732 35705 -31516 -104634 -44811 -53001 -111843
17877 -111843 -81078 -60176 -43886 17197 33422 -11569 -7996 -5915 -54696 -52950 32337 30778
17865 30778 -53584 -47007 -67748 55915 70247 113971 76316 13354 42224 -8194 -113024
17854 -113024 -128415 -68471 -105788 -168038 -123136 -74680 -113790 -35302 39035 -2946 -28431
17843 -28431 7871 -19628 -45373 -48193 -136507 -139897 -159958 -210703 -208857 -269408 -222943 -147737
17831 -147737 -123162 -118207 -51747 -36495 -135583 -132251 -111259 -168197 -192978 -158420 -139750 -141086
17819 -141086 -164875 -141875 -97448 -118500 -128932 -141934 -169027 -136787 -121721 -100474 -95124 -65715
17807 -65715 -135042 -88561 -40409 -7652 12436 29546 98228 99609 17201 -72626 -77989 -38981
$$ packed form
17889a74636O1523k6008j0552Q8500O9438K467K4973o7221p3118N9823q190n8842
17877a11843L0765K0902J6290O1083J6225m4991L573K081m8781J746Q5287j559
17865C0778q4362O577k0741J23663J4332M3724l7655o2962K8870n0418j04830
17854a13024j5391N9944l7317o2250M4902M8456l9110P8488P4337m1981k5485
17843b8431L6302k7499k5745k820q8314l390k0061n0745J846o0551M6465P5206
17831a47737K4575M955O6460J5252r9088L332K0992n6938k4781L4558J8670j336
17819a41086k3789K3000M4427k1052j0432j3002k7093L2240J5066K1247N350K9409
17807f5715o9327M6481M8152L2757K0088J7110O8682J381q2408q9827n363L9008
$$ plain form
17795 -38981 20514 16329 -24042 -18965 21742 22306 57335 44963 43771 19387 -18769 -76757 -102040
17782 -102040 -139522 -216874 -177473 -117635 -42663 -3753 -33662 -71681 -51664 30293 52772
17771 52772 -49234 -122093 -50113 102201 186958 98819 -34413 -50919 28543 39487 25228
17760 25228 -25 89077 129594 178262 84295 38021 69176 -57646 -185303 -201210 -110798
17749 -110798 -103058 -33699 -40082 -71896 -59104 -52640 -50728 -70659 -21213 -13500 -34641 5591
17737 5591 4335 -12401 -47486 -36153 -50712 -65546 -166579 -105036 -37573 -7499 2922 48263
17725 48263 -5948 -53332 -59901 -113788 -80568 -1738 -21976 -7933 10166 -51211 -5664 -644
17713 -644 10973 113361 99548 107756 148829 52808 -35299 -27087 -28324 4912 -44102 -31975
$$ packed form
17795c8981N9495m185m0371N077M0707N64L5029j2372j192k4384l8156n7988k5283
17782a02040l7482p7352L9401N9838P4972L8910k9909l8019K0017Q1957K2479
17771E2772j02006p2859P1980J52314Q4757q8139j33232j6506P9462J0944j4259
17760B5228k5253Q9102M0517M8668r3967m6274L1155j26822j27657j5907R0412
17749a10798P740O9359o383l1814J2792O464J912j9931M9446P713k1141M0232
17737E591j256j6736l5085J1333j4559j4834j01033O1543O7463L0074J0421M5341
17725D8263n4211m7384o569n3887L3220P8830k0238J4043J8099o1377M5547N020
17713f44J1617J02388j3813Q208M1073r6021q8107Q212j237L3236m9014J2127
$$ plain form
17701 -31975 4092 24673 49679 88418 68325 50641 61672 136165 108540 -7470 -31981
17690 -31981 30898 -16065 -28164 -41348 -12347 24416 61135 -53251 -132688 -60098 -31769
17679 -31769 -35381 -75408 -7518 -27255 -67128 -36628 55283 -12644 -30661 -129571 -111842 -7562
17667 -7562 17633 81203 73767 -2852 40201 96559 47809 50517 86918 37591 -7898 -44278
17655 -44278 10563 61403 32663 45020 128987 172403 201979 210641 269373 147344 53758 17132
17643 17132 4006 18569 31738 14843 -30551 -18891 -62531 -62811 15519 62341 39383 29421
17631 29421 42433 42978 82099 77001 27636 -9139 -41234 -79505 -89760 -93481 -25269 13808
17619 13808 52114 44747 -51181 -110947 -70090 -26210 -74186 -47485 -23596 9936 39986 -9211
$$ packed form
17701c1975L6067K0581K5006L8739k0093j7684J1031P4493k7625j16010k4511
17690c1981O2879m6963j2099j3184K9001L6763L6719j14386p9437P2590K8329
17679c1769l612m0027O7890j9737l9873L0500R1911o7927j8017r8910J7729J04280
17667g562K5195O3570p436p6619M3053N6358m8750K708L6401m9327m5489l6380
17655d4278N4841N0840k8740J2357Q3967M3416K9576Q662N8732j22029r3586l6626
17643A7132j3126J4563J3169j6895m5394J1660m3640k80P8330M6822k2958r962
17631B9421J3012N45L9121n098m9365l6775l2095l8271j0255l721O8212L9077
17619A3808L8306p367r5928n9766M0857M3880m7976K6701K3889L3532L0050m9197
$$ plain form
17607 -9211 -76498 -90522 10001 100247 106669 113881 139917 110393 37208 -81338 -60297 5100
17595 5100 -13035 -109457 -91452 -28697 4924 8497 44623 82146 63315 38904 -15532 8449
17583 8449 108402 76255 6490 -18724 67441 114421 48416 750 -7280 -38572 20026 9436
17571 9436 -290 19662 45921 -3147 18130 40160 59180 -19397 -99424 -114927 -161127 -217142
17559 -217142 -181448 -104844 -29912 41042 99654 80110 94744 107690 41271 -24001 -43595
17548 -43595 -16154 80103 130027 59100 -39744 -70688 7634 89505 84527 93715 61171 -35406
17536 -35406 -165772 -129429 -114328 -150741 -98283 -51808 23437 47718 90411 148038 119908
17525 119908 60153 120238 182291 199363 202603 188183 142127 101321 50147 5291 2752 37118
$$ packed form
17607i211o7287j4024J00523R0246O422P212K6036k9524p3185j18546K1041O5397
17595E100j8135r6422J8005O2755L3621L573L6126L7523j8831k4411n4436K3981
17583H449R9953l2147o9765k5214Q6165M6980o6005m7666q030l1292N8598j0590
17571I436r726J9952K6259m9068K1277K2030J9020p8577q0027j5503m6200n6015
17559b17142L5694P6604P4932P0954N8612j9544J4634J2946o6419o5272j9594
17548d3595K7441R6257M9924p0927r8844l0944P8322Q1871m978R188l2544r6577
17536c5406j30366L6343J5101l6413N2458M6475P5245K4281M2693N7627k8130
17525A19908n9755O0085O2053J7072L240j4420m6056m0806n1174m4856k539L4366
$$ plain form
17513 37118 8841 5356 6704 -20957 -60815 -100298 -72676 -71687 -76786 58185 39758 -69307
17501 -69307 -50075 -4428 -62490 31246 41527 32950 -20074 -20666 -12882 -17406 -31801 -37815 42516
17488 42516 94933 82393 28431 -38226 -37493 107543 98591 -20987 -47231 33903 -55387 -86988
17476 -86988 -9192 71656 113815 93474 39200 -11334 -53968 -76721 -130691 -98826 -62082 -92684
17464 -92684 -71558 -8166 24413 2820 -81103 -28727 -40080 -87714 -21120 52810 44228 -31398
17452 -31398 -115389 -42476 -3592 -27464 -8653 126257 135064 214182 386288 543697 580147
17441 580147 614033 807126 763499 425953 207191 123176 -24276 -11043 75802 150282 79250
17430 79250 -43275 -97841 -35312 -10021 -30441 -44891 -63455 -35415 72685 16993 -33974
$$ packed form
17513C7118k8277l485J348k7661l9858l9483K7622R89n099J34971j8427j09065
17501f9307J9232M5647n8062R3736J0281q577n3024n92P784m524j4395o014Q0331
17488D2516N2417j2540n3962o6657P33J45036q952j19578k6244Q1134q9290l1601
17476h6988P7796Q0848M2159k0341n4274n0534m2634k2753n3970L1865L6744l0602
17464i2684K1126O3392L2579k1593q3923N2376j1353m7634O6594P3930q582p5626
17452c1398q3991P2913L8884k3872J8811J34910Q807P9118J72106J57409L6450
17441E80147L3886J93093m3627l37546k18762q4015j47452J3233Q6845P4480p1032
17430G9250j22525n4566O2529K5291k0420j4450j8564K8040J08100n5692n0967
$$ plain form
17419 -33974 -100700 -143729 -105907 -37436 -23073 -17806 -23904 -95204 -61844 18378 11611 -10685
17407 -10685 18570 -22107 -38092 2030 37163 75049 191235 224042 103022 99474 89201
17396 89201 47268 42812 74413 101011 99250 72083 16086 -25998 3620 97510 123325 135511
17384 135511 102381 131574 69844 -13202 -12211 10085 -19473 15160 35334 115568 129657 57180
17372 57180 -44706 -142771 -203653 -177451 -95118 -79324 -8968 -55745 -103070 -102784 -40370 -59848
17360 -59848 -46564 8987 31631 -10404 -79521 -159801 -42230 42655 70019 -2493 -79442
17349 -79442 -122921 -110009 -116342 -46224 -65904 4781 116327 192658 89432 212 -49777
17338 -49777 -65994 -79665 -84353 -129672 -113178 -89077 -6432 -79609 -153738 -65583 -52281 -38210
$$ packed form
17419c3974o6726m3029L7822O8471J4363N267o098p1300L3360Q0222o767k2296
17407a0685K9255m0677j5985M0122L5133L7886J16186L2807j21020l548j0273
17396H9201m1933m456L1601K6598j761k7167n5997m2084K9618R3890K5815J2186
17384A35511l3130K9193o1730q3046R91K2296k9558L4633K0174Q0234J4089p2477
17372E7180j01886r8065o0882K6202Q2333J5794P0356m6777m7325K86O2414j9478
17360e9848J3284N5551K2644m2035o9117q0280J17571Q4885K7364p2512p6949
17349g9442m3479J2912o333P0118j9680P0685J11546P6331j03226q9220m9989
17338d9777j6217j3671m688m5319J6494K4101Q2645p3177p4129Q8155J3302J4071
$$ plain form
17326 -38210 -75359 -27668 36433 -48597 -63651 -77099 -25540 -68962 -86244 -64895 -95719 -142985
17314 -142985 -110934 -105231 -83026 -5873 -88457 -83852 -126363 -144394 -30308 16973 84346 96758
17302 96758 15481 18708 124086 75055 13229 32789 -36711 -128959 -111060 -59581 29567 -16762
17290 -16762 -134046 -260122 -219417 -195839 -99197 50754 38311 25787 -13865 -5272 -39661
17279 -39661 -66069 -150345 -172187 -133253 -123630 -158328 -162635 -88761 -65015 -32988 44938 120001
17267 120001 131331 107637 59704 4535 64417 109837 69980 12654 -56631 -9519 83733
17256 83733 22267 -19309 -39843 -60205 -23576 -47468 -63011 -74394 -35853 -33626 -104196 -58518
17244 -58518 -50168 -54984 18668 -20162 -85269 -18332 -5549 -13211 -25176 76673 95446 -29088
$$ packed form
17326c8210l7149M7691O4101q5030j5054j3448N1559m3422j7282K1349l0824m7266
17314a42985L2051N703K2205P7153q2584M605m2511j8031J14086M7281O7373J2412
17302I6758q1277L227J05378m9031o1826J9560o9500r2248J7899N1479Q9148m6329
17290a6762j17284j26076M0705K3578R6642J49951j2443j2524l9652Q593l4389
17279c9661k6408q4276k1842L8934R623l4698m307P3874K3746L2027P7926P5063
17267A20001J1330k3694m7933n5169N9882M5420l9857n7326o9285M7112R3252
17256H3733o1466m1576k0534k0362L6629k3892j5543j1383L8541K227p0570M5678
17244e8518Q350m816P3652l8830o5107O6937J2783p662j1965J01849J8773j24534
$$ plain form
17232 -29088 -127201 -70578 -95479 -200898 -213194 -159723 -112752 -118579 -97531 -22490 11384 -46259
17220 -46259 -118018 -79061 -2848 67371 170700 187805 237512 209814 106853 156631 146183
17209 146183 100963 99087 69787 42843 44888 50184 38511 124076 59341 -12632 6027 1008
17197 1008 -42951 -9040 -68275 -169891 -179183 -91392 34878 53739 35062 -52535 -107305 -125017
17185 -125017 -150709 -60201 -9028 8844 25925 -1117 -22530 36667 55570 -44553 31430
17174 31430 69053 93713 92273 42607 58769 -8130 -63790 -42853 -33422 -38894 -19240 -59084
17162 -59084 -70780 -97976 -50235 23969 31421 60243 75697 -31936 -63733 -27120 -40941 -108196
17150 -108196 -118736 -54705 11160 -10201 -55936 -45554 -19069 -3128 5014 -28548 -53448 -125133
$$ packed form
17232b9088r8113N6623k4901j05419j2296N3471M6971n827K1048P5041L3874n7643
17220d6259p1759L8957P6213P0219J03329J7105M9707k7698j02961M9778j0448
17209A46183m5220j876k9300k6944K045N296j1673Q5565o4735p1973J8659n019
17197A008m3959L3911n9235j01616r292Q7791J26270J8861j8677q7597n4770j7712
17185a25017k5692R0508N1173J7872J7081k7042k1413N9197J8903j00123P5983
17174C1430L7623K4660j440m9666J6162o6899n5660K0937R431n472J9654l9844
17162e9084j1696k7196M7741P4204P452K8822J5454j07633l1797L6613j3821o7255
17150a08196j0540O4031O5865k1361m5735J0382K6485J5941Q142l3562k4900p1685
$$ plain form
17138 -125133 -129310 -21601 35843 22716 -23000 -34401 -10589 -3016 -13838 -26989 9934 24683
17126 24683 98489 78209 93426 97202 69525 -17768 -59552 -7811 21966 -94995 -155868 -186332
17114 -186332 -162529 -153689 -103136 -13283 10612 72929 40032 -30552 -45448 -70984 -63807 -64868
17102 -64868 -36209 -18854 -34976 -12050 90263 42331 21788 20590 -22785 28972 52264 79746
17090 79746 79808 -30026 -102569 -58980 34079 21812 4374 -30099 -31774 32533 60536 8032
17078 8032 -50261 -31598 -12179 8237 -18523 -85484 -126200 -124608 -139702 -175940 -120336 -71895
17066 -71895 -35048 -5402 14990 24795 19930 9395 -69222 -22838 71967 138993 180322 118053
17054 118053 32146 23412 14886 -74833 -72683 -61754 -63296 19862 25452 81836 147151 91349
$$ packed form
17138a25133m177J07709N7444j3127m5716j1401K3812P573j0822j3151L6923J4749
17126B4683P3806k0280J5217L776k7677q7293m1784N1741K9777j16961o0873l0464
17114a86332K3803Q840N0553Q9853K3895O2317l2897p0584j4896k5536P177j061
17102f4868K8659J7355j6122K2926J02313m7932k0543j198m3375N1757K3292K7482
17090G9746O2j09834p2543M3589R3059j2267j7438l4473j675O4307K8003n2504
17078H032n8293J8663J9419K0416k6760o6961m0716J592j5094l6238N5604M8441
17066g1895L6847K9646K0392R805m865j0535p8617M6384R4805O7026M1329o2269
17054A18053q5907q734q526q9719K150J0929j542Q3158N590N6384O5315n5802
$$ plain form
17042 91349 37871 21559 -4731 -21561 1914 -5361 -25266 -124423 -152593 -124802 -20981 -55482
17030 -55482 -61461 -54245 -58884 -128838 -145562 -91982 -86641 -62434 41769 55083 8558 29886
17018 29886 37041 18058 -47309 -92037 -95542 -63768 -95379 -50147 -19822 34787 27550 -65171
17006 -65171 -110337 -175474 -196939 -111327 -111222 -104623 -58457 -105166 -92516 -29621 1903 20772
16994 20772 41837 91265 -4210 -48551 -31210 -23607 45485 24153 36941 -7621 -44923 -115288
16982 -115288 -115994 -93445 -89335 -119883 -157267 -99769 -42990 -77392 -37927 17570 -62658 -25284
16970 -25284 62192 63144 36616 16109 37222 30341 -57040 -63554 -36130 -14135 -96583 -167650
16958 -167650 -162168 -56880 -29996 -53112 -79558 -93082 -56016 -111359 -153446 -176490 -182151 -235954
$$ packed form
17042I1349n3478j6312k6290j6830K3475p275j9905r9157k8170K7791J03821l4501
17030e5482n979P216m639o9954j6724N3580N341K4207J04203J3314m6525K1328
17018B9886P155j8983o5367m4728l505L1774l1611M5232L0325N4609p237r2721
17006f5171m5166o5137k1465Q5612J05O599M6166m6709J2650O2895L1524J8869
16994B0772K1065M9428r5475m4341J7341P603O9092k1332J2788m4562l7302p0365
16982a15288p06K2549M110l0548l7384N7498N6779l4402L9465N5497q0228L7374
16970b5284Q7476R52k6528k0507K1113o881q7381o514K7424K1995q2448p1067
16958a67650N482J05288K6884k3116k6446j3524L7066n5343m2087k3044n661n3803
$$ plain form
16946 -235954 -205994 -84091 -97545 -83229 -77315 -83795 -68163 -58024 -103286 -91313 -86302 -54968
16934 -54968 -14540 -42061 -8452 2802 35811 -6190 -86742 -173604 -50586 29712 -4364
16923 -4364 -35324 11926 45540 108062 -17797 -85112 27754 89365 124901 -3315 -58975
16912 -58975 -138303 -228681 -187628 -72459 -7821 -54913 -9056 33779 55199 66761 46004
16901 46004 32195 14481 104760 142031 50810 31310 -83582 -119214 -78858 3861 85515
16890 85515 68232 -15153 -2367 14476 -15690 -33921 -60103 -22730 -16099 -50249 -13693 56831
16878 56831 87569 125222 88743 -35397 -57931 48365 126788 24045 -117409 -91569 -44845
16867 -44845 6329 -50632 -161706 -201031 -176837 -93286 -149643 -193884 -172351 -163308 -205200 -177360
$$ packed form
16946b35954K9960J21903j3454J4316N914o480J5632J0139m5262J1973N011L1334
16934e4968M0428k7521L3609J1254L3009m2001q0552q6862J23018Q0298l4076
16923d364l0960M7250L3614O2522j25859o7315J12866O1611L5536j28216n5660
16912e8975p9328r0378M1053J15169O4638m7092M5857M2835K1420J1562k0757
16901D6004j3809j7714R0279L7271r1221j9500j14892l5632M0356Q2719Q1654
16890H5515j7283q3385J2786J6843l0166j8231k6182L7373O631l4150L6556P0524
16878E6831L0738L7653l6479j24140k2534J06296P8423j02743j41454K5840M6724
16867d4845N1174n6961j11074l9325K4194Q3551n6357m4241K1533R043m1892K7840
$$ plain form
16855 -177360 -71675 -38335 -96068 -87594 -6170 -21787 -72811 -102372 -72201 15250 37147
16844 37147 92336 149165 69330 10277 -15382 -12348 49378 32532 -50681 -132501 -139236 -128420
16832 -128420 -81752 -46983 -52159 -103255 -92716 -48398 -72006 7983 -26202 -46194 54058
16821 54058 66451 36068 -18904 -72026 -41739 4977 84257 102969 72622 28557 26817 47464
16809 47464 53147 26307 5607 41606 100512 148479 83698 8129 -89498 -93580 -32116 -47491
16797 -47491 -32263 -36360 19968 101799 75514 25089 7402 52703 -18114 -126346 -117406 -9510
16785 -9510 8456 -50866 -55162 -84406 -117854 43069 66723 -6627 -16197 28288 17609 24065
16773 24065 41930 27944 20686 -29229 -53615 -12366 -63144 -103272 -148432 -190113 -144135 -151303
$$ packed form
16855a77360J05685L3340n7733Q474Q1424j5617n1024k9561L0171Q7451K1897
16844C7147N5189N6829p9835n9053k5659L034O1726j6846q3213q1820o735J0816
16832a28420M6668L4769n176n1096J0539M4318k3608P9989l4185j9992J00252
16821E4058J2393l0383n4972n3122L0287M6716P9280J8712l0347m4065j740K0647
16809D7464N683k6840k0700L5999N8906M7967o4781p5569r7627m082O1464j5375
16797d7491J5228m097N6328Q1831k6285n0425j7687M5301p0817j08232Q940J07896
16785i510J7966n9322m296k9244l3448J60923K3654p3350r570M4485j0679O456
16773B4065J7865j3986p258m9915k4386M1249n0778m0128m5160m1681M5978p168
$$ plain form
16761 -151303 -184372 -131044 -70550 -74592 -90182 -49695 16153 -2898 14020 15489 21790 67537
16749 67537 90005 90924 28046 -59310 -41800 21728 70296 69849 25075 -107755 -200810 -136708
16737 -136708 -36682 8788 81897 146839 126696 36958 7717 -44472 -65369 -154980 -105131
16726 -105131 -40621 19741 51227 -71525 -104328 -37174 1861 66700 80581 71615 54471
16715 54471 -5133 -57624 49018 100342 84115 39963 24151 -25207 -21384 -35785 -45398 -127450
16703 -127450 -209793 -207924 -201643 -117303 -36107 76090 163562 69691 -2505 53503 56119 -590
16691 -590 53340 59211 31949 -29762 -73396 -132699 -42074 -44474 -51197 -104233 -128374 -34451 37343
16678 37343 -14713 -88610 -156864 -114530 -38730 -4842 -16304 -27209 -134305 -139341 -80827 -37784
$$ packed form
16761a51303l3069N3328O0494m042j5590M0487O5848j9051J6918J469O301M5747
16749F7537K2468R19o2878q7356J7510O3528M8568m47m4774j32830r3055O4102
16737a36708J00026M5470P3109O4942k0143q9738k9241n2189k0897q9611M9849
16726a05131O4510O0362L1486j22752l2803O7154L9035O4839J3881q966j7144
16715E4471n9604n2491J06642N1324j6227m4152j5812m9358L823j4401r613q2052
16703a27450q2343J869O281Q4340Q1196J12197Q7472r3871p2196N6008K616n6709
16691e90N3930N871k7262o1711m3634n9303R0625k400o723n3036k4141R3923P1794
16678C7343n2056p3897o8254M2334P5800L3888j1462j0905j07096n036N8514M3043
$$ plain form
16666 -37784 -93453 -54983 36302 35687 9177 -7820 -33084 -53244 -3365 68959 53059 -53455
16654 -53455 -69947 42285 198101 234508 121350 22679 47092 71088 69973 146463 113228
16643 113228 80147 105830 119365 86502 77662 24370 -106018 -182777 -200553 -178650 -85033
16632 -85033 -44542 -71500 -84228 -109810 -155876 -149148 -158488 -24567 13569 -16427 -62353 -15295
16620 -15295 86703 173217 74171 39715 -14241 2993 60673 -34333 -92335 -57746 -39307
16609 -39307 -2749 -22746 -25736 -27663 -54450 -51539 -70567 -94348 -120471 -98101 -41728 -3430
16597 -3430 -55684 -96825 -106311 -157000 -158751 -122461 -124756 -155209 -96651 -35810 -55676 -130910
16585 -130910 -173886 -17614 70906 -45030 -73192 -61627 -65573 -17149 -29715 -59504 16553
$$ packed form
16666c7784n5669L8470R1285o15k6510j6997k5264k0160M9879P2324j5900j06514
16654e3455j6492J12232J55816L6407j13158r8671K4413K3996j115P6490l3235
16643A13228l3081K5683J3535l2863q840n3292j30388p6759j7776K1903R3617
16632h5033M0491k6958j2728k5582m6066O728r340J33921L8136k9996m5926M7058
16620a5295J01998Q6514r9046l4456n3956J7234N7680r5006n8002L4589J8439
16609c9307L6558j9997k990j927k6787K911j9028k3781k6123K2370N6373L8298
16597c430n2254m1141r486n0689j751L6290k295l0453N8558O0841j9866p5234
16585a30910m2976J56272Q8520j15936k8162J1565l946M8424j2566k9789P6057
$$ plain form
16574 16553 104145 57201 54972 33875 -70746 -158898 -136439 -43118 -47690 -108331 -142774 -155954
16562 -155954 -161964 -142007 -86709 -36433 -46860 -92104 -29058 -59639 -77707 -92276 -8744 -53850
16550 -53850 -103941 -28622 35811 92590 72740 38744 61815 23006 -42889 -16811 10697 -38233
16538 -38233 -74121 -20449 79340 91619 72429 119850 78064 47052 17388 4872 -27990 -79214
16526 -79214 -55604 -37207 -58060 31809 81928 136808 105272 -12618 -64771 31486 51879
16515 51879 9820 -31332 37462 108894 83255 45525 37502 -14284 51804 41859 13440 41250
16503 41250 29370 5133 65339 65973 89913 61269 -12912 -32929 4536 15188 -44537 -29298
16491 -29298 -60467 -66593 -112483 -85198 -53293 -19285 12109 -36641 -75604 67145 98829 86263
$$ packed form
16574A6553Q7592m6944k229k1097j04621q8152K2459R3321m572o0641l4443j3180
16562a55954o010J9957N5298N0276j0427m5244O3046l0581j8068j4569Q3532m5106
16550e3850n0091P5319O4433N6779j9850l3996K3071l8809o5895K6078K7508m8930
16538c8233l5888N3672R9789J2279j9190M7421m1786l1012k9664j2516l2862n1224
16526g9214K3610J8397k0853Q9869N0119N4880l1536j17890n2153R6257K0393
16515E1879m2059m1152O8794P1432k5639l7730q023n1786O6088r945k8419K7810
16503D1250j1880k4237O0206O34K3940k8644p4181k0017L7465J0652n9725J5239
16491b9298l1169o126m5890K7285L1905L4008L1394m8750l8963J42749L1684j2566
$$ plain form
16479 86263 -4452 -63278 -73076 -66167 -66457 -34089 24012 -70739 -167475 -169490 -172621 -168273 -109321
16466 -109321 -94923 -125937 -195194 -135099 -126339 -154201 -162844 -103494 -46358 -10310 -50232 -51656
16454 -51656 -40847 -5141 -34562 -5607 45023 58413 45263 66761 15754 -102088 -161833
16443 -161833 -134507 -82534 -50579 -63039 -34459 -51073 12508 28096 -89788 -141197 -59548
16432 -59548 -11750 -41987 -17459 28211 54220 39024 -3910 -1528 -14615 7210 -52476 -63225
16420 -63225 -85886 -136691 -198438 -209503 -150206 -143528 -154689 -108750 -9426 20237 -27451 -51183
16408 -51183 -126741 -135549 -164853 -192519 -191106 -112818 -95270 -116359 -95398 -28076 -69157 -112177
16396 -112177 -91128 -96584 -131872 -205133 -166291 -92621 -37557 30549 47578 57859 43119 22045
$$ packed form
16479H6263r0715n8826r798O909k90L2368N8101r4751r6736k015l131M348N8952
16466a09321J4398l1014o9257O0095Q760k7862q643N9350N7136L6048l9922j424
16454e1656J0809L5706k9421K8955N0630J3390j3150K1498n1007j17842n9745
16443a61833K7326N1973L1955j2460K8580j6614O3581J5588j17884n1409Q1649
16432e9548M7798l0237K4528M5670K6009j5196m2934K382j3087K1825n9686j0749
16420f3225k2661n0805o1747j1065N9297O678j1161M5939R9324K9663m7688k3732
16408e1183p5558q808k9304k7666J413P8288J7548k1089K0961O7322m1081m3020
16396a12177K1049n456l5288p3261L8842P3670N5064O8106J7029J0281j4740k1074
$$ plain form
16384 22045 -3325 5971 69026 59797 -32219 -89476 -105822 -83072 -83097 -44265 7238 60628 -11742
16371 -11742 -26934 -49461 -71558 -98530 -91094 8408 34245 -60835 -129531 -113906 -112353 -38348
16359 -38348 35763 47015 39413 67668 53595 82971 122306 97198 64677 -7372 7669 84329
16347 84329 47113 49014 19794 20507 72115 -18225 -61056 -33632 -30059 -78356 -23758 43187
16335 43187 81131 108302 128936 132978 101824 47542 52688 58872 55195 70023 23159 -105075
16323 -105075 -45904 -3702 -48777 -93677 -172457 -207364 -164910 -41460 4739 12180 15531 17582
16311 17582 45763 122204 129797 112725 35914 45874 44721 157057 243979 223316 206729 206944
16299 206944 210966 94302 3694 -79624 -96980 -114180 -84380 -31461 -55604 -12665 56874
$$ packed form
16384B2045k5370R296O3055r229r2016n7257j6346K2750k5L8832N1503N3390p2370
16371a1742j5192k2527k2097k6972P436R9502K5837r5080o8696J5625J553P4005
16359c8348P4111J1252p602K8255j4073K9376L9335k5108l2521p2049J5041P6660
16347H4329l7216J901k9220P13N1608r0340m2831K7424L573m8297N4598O6945
16335D3187L7944K7171K0634M042l1154n4282N146O184l677J4828m6864j28234
16323a05075N9171M2202m5075m4900p8780l4907M2454J23450M6199P441L351K051
16311A7582K8181P6441P593j7072p6811R960j153J12336Q6922k0663j6587K15
16299B06944M022j16664r0608q3318j7356j7200K9800N2919k4143M2939O9539
$$ plain form
16288 56874 56416 14910 -58866 -180696 -154630 -33917 29738 61543 70857 71478 55248 43646
16276 43646 29276 -54854 -7928 -42204 -92115 11580 24197 93142 72883 -8864 -62551
16265 -62551 -122328 -42331 45388 45431 14309 -50212 -16027 -13223 -61107 -49215 40839 49090 36972
16252 36972 94195 128330 90022 14356 -87308 -70516 -80044 -104867 -53504 -115746 -128015 -71083
16240 -71083 -78292 -77443 -6686 27521 30197 91588 109065 131896 156279 27267 19657 -48547
16228 -48547 -90472 -4122 51858 7949 -12816 -40423 -2196 -26815 13895 95122 212132
16217 212132 239140 94422 40034 15761 21919 -13107 -54266 -79322 -39893 635 -65303
16206 -65303 -6947 39569 23024 -41118 -17796 -96556 -98282 -117975 -114189 -90831 -123757 -165325
$$ packed form
16288E6874m58m1506p3776j21830K6066J20713O3655L1805R314O21j6230j1602
16276D3646j4370q4130M6926l4276m9911J03695J2617O8945k0259q1747n3687
16265f2551n9777P9997Q7719M3l1122o4521L4185K804m7884J1892R0054Q251j2118
16252C6972N7223L4135l8308p5666j01664J6792r528k4823N1363o2242j2269N6932
16240g1083p209Q49P0757L4207K676O1391J7477K2831K4383j29012p610o8204
16228d8547m1925Q6350N5980m3909k0765k7607L8227k4619M0710Q1227J17010
16217B12132K7008j44718n4388k4273O158l5026m1159k5056L9429M0528o5938
16206f5303N8356M6516j6545o4142K3322p8760j726j9693L786K3358l2926m1568
$$ plain form
16194 -165325 -200440 -185478 -185241 -184652 -168338 -113342 -112726 -104204 -59623 -49127 -30226 -52985 -23802
16181 -23802 -38867 -45221 -62016 -22638 -19782 -14925 -115439 -94838 -88703 -172317 -90873 8558
16169 8558 73411 24866 -64013 -90074 7499 64335 70010 18305 129801 173463 158209 96950
16157 96950 89895 86518 -9830 -82245 -68740 -137635 -106724 -18938 59476 54782 13401 -186
16145 -186 59481 139423 167752 170301 91373 14374 -12532 -71739 -65218 -42777 10515 3391 -11555
16132 -11555 -22690 -96226 -130511 -20240 48884 -30768 -96672 -80491 25568 105592 120804
16121 120804 32205 -73411 -107559 -76140 -102030 -72235 -98972 -102064 -4060 -44768 -70307
16110 -70307 -40995 -3644 64077 15238 37350 3733 42435 9105 82920 106879 56767 55910
$$ packed form
16194a65325l5115J4962K37N89J6314N4996O16Q522M4581J0496J8901k2759K9183
16181b3802j5065o354j6795L9378K856M857j00514K0601O135q3614Q1444R9431
16169H558O4853m8545q8879k6061R7573N6836N675n1705J11496M3662j5254o1259
16157I6950p055l377r6348p2415J3505o8895L0911Q7786P8414m694m1381j3587
16145a86N9667P9942K8329K549p8928p6999k6906n9207O521K2441N3292p124j4946
16132a1555j1135p3536l4285J10271O9124p9652o5904J6181J06059Q0024J5212
16121A20804q8599j05616l4148L1419k5890K9795k6737l092R8004m0708k5539
16110g0307K9312L7351O7721m8839K2112l3617L8702l3330P3815K3959n0112q57
$$ plain form
16098 55910 85851 121198 54960 -21602 -5662 18353 -24612 -5110 -33436 -28499 -21933 22630
16086 22630 96534 -5934 -98624 -101751 -53862 -7026 13922 83800 125983 80906 3742 -46517
16074 -46517 -25542 -17453 5292 67570 55654 65351 104891 97670 -25066 -121668 -196709 -130797
16062 -130797 -61536 11913 89184 76332 5736 -6982 -1619 -4817 -63078 -35671 -7103 -12634
16050 -12634 -11058 -13117 25142 104334 141903 42527 72237 4350 -37032 -28063 -18614 28847
16038 28847 29834 100875 41844 -12686 -17796 6082 -14970 -630 174042 160007 63449 36066
16026 36066 30597 23201 47323 493 -57958 -13791 34859 47001 40343 58396 128684 131781
16014 131781 107000 159542 128635 16291 -56707 -37439 5248 -23721 -37164 22875 -8440
$$ packed form
16098E5910K9941L5347o6238p6562J5940K4015m2965J9502k8326M937O566M4563
16086B2630P3904j02468r2690l127M7889M6836K0948O9878M2183m5077p7164n0259
16074d6517K0975Q089K2745O2278j1916R697L9540p221j22736r6602p5041O5912
16062a30797O9261P3449P7271j2852p0596j2718N363l198n8261K7407K8568n531
16050a2634J576k059L8259P9192L7569r9376K9710o7887m1382Q969R449M7461
16038B8847R87P1041n9031n4530n110K3878k1052J4340J74672j4035r6558k7383
16026C6066n469p396K4122m6830n8451M4167M8650J2142o658J8053P0288L097
16014A31781k4781N2542l0907j12344p2998J9268M2687k8969j3443O0039l1315
$$ plain form
16003 -8440 -50467 -17227 -56240 -38861 17730 2108 -83950 -51567 6771 25590 41875 61573
15991 61573 55912 15565 4661 -95895 -173624 -140036 -31623 14870 -34401 -64491 -70307 -66263
15979 -66263 -45611 -71053 -111518 -130530 -26707 26344 -48024 -45278 19112 72205 -58496
15968 -58496 -128162 -142790 -98930 -34793 1507 -59299 -62950 -45122 -59884 -58814 -171312 -222975
15956 -222975 -33570 76409 66016 46676 23714 716 -8790 -31650 -45543 -68337 -123768
15945 -123768 -101317 -73706 -128227 -124990 -77371 -93763 -113349 -114904 -86133 -10233 10691 68219
15933 68219 9801 -70357 -57089 -19362 -71041 -155710 -189007 -138732 -98036 -71568 -70574 -41883
15921 -41883 -44862 -72493 -65626 -46414 -63917 -155268 -182685 -109770 18477 61031 -84843 -149193
$$ packed form
16003h440m2027L3240l9013J7379N6591j5622q6058L2383N8338J8819J6285J9698
15991F1573n661m0347j0904j00556p7729L3588J08413M6493m9271l0090n816M044
15979f6263K0652k5442m0465j9012J03823N3051p4368K746O4390N3093j30701
15968e8496o9666j4628M3860O4137L6300o0806l651J7828j4762J070j12498n1663
15956b22975J89405J09979j0393j9340k2962k2998r506k2860j3893k2794n5431
15945a23768K2451K7611n4521L237M7619j6392j9586j555K8771P5900K0924N7528
15933F8219n8418q0158J3268L7727n1679q4669l3297N0275M0696K6468R94K8691
15921d1883k979k7631O867J9212j7503r1351k7417P2915J28247M2554j45874o4350
$$ plain form
15909 -149193 -137109 -39256 23551 -10325 -43963 -74142 -110862 -190878 -121196 -34108 -442
15898 -442 37604 39194 83923 2784 -40869 10373 -43527 -78710 -134604 -107947 -24969 -1424
15886 -1424 29410 18345 -9665 -66061 -177359 -245811 -215699 -199661 -87548 -14317 -55870
15875 -55870 3795 48109 38019 42634 87138 23680 28645 37538 -18051 62118 163206 230252
15863 230252 174127 88242 56401 -10304 -51198 -83386 -22285 48437 52394 53793 31288 -27355
15851 -27355 10788 48591 -73612 -85049 -81950 -89954 -16675 -29009 54787 86078 91447 108817
15839 108817 76402 -6959 -13179 -87425 -123191 -28249 10551 -18437 -60015 -29967 -123283 -117462
15827 -117462 31020 80492 126183 194187 142170 90343 108023 117655 136302 133019 51908 23211
$$ packed form
15909a49193J2084R7853O2807l3876l3638l0179l6720q0016O9682Q7088L3666
15898d42L8046J590M4729q1139m3653N1242n3900l5183n5894K6657Q2978K3545
15886a424L0834j1065k8010n6396j11298o8452L0112J6038J12113P3231m1553
15875e5870N9665M4314j0090M615M4504o3458M965Q893n5589Q0169J01088O7046
15863B30252n6125q5885l1841o6705m0894l2188O1101P0722L957J399k2505n8643
15851b7355L8143L7803j22203j1437L099q004P3279j2334Q3796L1291N369J7370
15839A08817l2415q3361o220p4246l5766R4942L8800k8988m1578L0048r3316N821
15827a17462J48482M9472M5691O8004n2017n1827J7680R632J8647l283q1111k8697
$$ plain form
15815 23211 121903 167829 104685 118196 122912 72616 41323 -32324 -31267 -21976 9957 56916
15803 56916 25628 44912 114725 180441 189668 140402 130601 131257 122759 167436 84711 103657 103902
15790 103902 59002 26831 6551 -25840 1875 -5632 42327 87224 17833 -19243 -67411 -80878
15778 -80878 -44506 9942 44671 53528 4059 -1245 17529 89098 69134 -17851 50928 53127
15766 53127 -10017 12555 99340 153527 192438 161241 112409 166136 159252 -10157 19332 56371
15754 56371 35420 65647 105388 130865 83801 -45983 -62517 -56118 4745 73310 9531 -2231
15742 -2231 -72808 -109656 20341 33511 13824 25452 -28410 -45740 -23717 -22621 -19315 -111834
15730 -111834 -141405 -111293 -76063 -54140 -27068 -85261 -136375 -114776 -23576 -14390 -62183 -144075
$$ packed form
15815B3211R8692M5926o3144J3511M716n0296l1293p3647J057R291L1933M6959
15803E6916l1288J9284O9813O5716R227m9266r801O56q498M4677q2725J8946K45
15790A03902m4900l2171k0280l2391K7715p507M7959M4897o9391l7076m8168j3467
15778h0878L6372N4448L4729Q857m9469n304J8774P1569j9964q6985O8779K199
15766E3127o3144K2572Q6785N4187L8911l1197m8832N3727o884j69409K9489L7039
15754E6371k0951L0227L9741K5477m7064j29784j6534O399O0863O8565o3779j1762
15742b231p0577l6848J29997J3170j9687J1628n3862j7330K2023J096L306r2519
15730a11834k9571L0112L5230K1923K7072n8193n1114K1599R1200R186m7793q1892
$$ plain form
15718 -144075 -93327 -62175 -19736 7389 -17884 -89729 -83637 -41193 -21015 -56571 -88976 -62604
15706 -62604 -47126 4087 35927 82533 71495 18344 -50325 -99015 -4628 -34310 -99998 -81863
15694 -81863 -108311 -32110 1023 25385 56886 -45028 -78288 -57922 -54612 -34229 -47871 -50044
15682 -50044 -75323 -78989 -78852 -55204 23488 22354 -75847 -86637 -81974 -66958 -51936 -28414 -33797
15669 -33797 -36695 -72149 -33558 -110 51435 66098 38106 28632 44868 77019 110757 81709
15657 81709 -35314 -100055 -91857 -46270 -75743 -47284 -18296 21423 -2506 8227 150435
15646 150435 212868 211282 101135 -4605 25787 73873 5758 2166 -54363 -63637 -44493 62748
15634 62748 40787 -28016 -128717 -135652 -67375 -43298 36993 65620 59129 92119 155876 179114
$$ packed form
15718a44075N0748L1152M2439K7125k5273p1845O092M2444K0178l5556l2405K6372
15706f2604J5478N1213L1840M6606j1038n3151o8669m8690R4387k9682o5688J8135
15694h1863k6448P6201L3133K4362L1501j01914l3260K0366L310K0383j3642k173
15682e0044k5279l666J37K3648P8692j134r8201j0790M663J5016J5022K3522n383
15669c3797k898l5454L8591L3448N1545J4663k7992r474J6236L2151L3738k9048
15657H1709j17023o4741Q198M5587k9473K8459K8988L9719k3929J0733J42208
15646A50435O2433j586j10147j05740L0392M8086o8115l592n6529r274J9144J07241
15634F2748k1961o8803j00701o935O8277K4077Q0291K8627o491L2990O3757K3238
$$ plain form
15622 179114 201240 134465 69135 19887 -7703 -57873 31049 152182 180450 79392 131
15611 131 -99255 -45152 -17043 30295 67803 34211 108407 28005 -17310 11005 92921 -15870
15599 -15870 -107969 -92941 -4298 56437 56464 85955 58558 -62857 -134104 -187227 -181963 -196069
15587 -196069 -145097 -118123 -117802 -76367 -60834 -63039 -28872 -42313 -13041 -61607 -86106 -64735
15575 -64735 -83673 -202243 -183254 -115775 -51504 -117343 -109315 -92241 -101911 -68746 -13369 15858
15563 15858 -22220 -110110 -193624 -124414 -49014 -39441 -5378 64246 26904 38440 45932 96625
15551 96625 14669 -147538 -145624 -84804 -63865 -43965 -42913 -61292 -81443 -43960 -14484 -69055
15539 -69055 -30555 -5920 -24078 -46208 -27976 -24016 44935 52488 -3545 46106 35158 23637
$$ packed form
15622A79114K2126o6775o5330m9248k7590n0170Q8922J21133K8268j01058p9261
15611A31r9386N4103K8109M7338L7508l3592P4196q0402m5315K8315Q1916j08791
15599a5870r2099J5028Q8643O0735K7K9491k7397j21415p1247n3123N264j4106
15587a96069N0972K6974L21M1435J5533k205L4167j3441K9272m8566k4499K1371
15575f4735j8938j18570J8989O7479O4271o5839Q028J7074r670L3165N5377K9227
15563A5858l8078q7890q3514O9210P5400R573L4063O9624l7342J1536P492N0693
15551I6625q1956j62207J914O0820K0939J9900J052j8379k0151L7483K9476n4571
15539f9055L8500K4635j8158k2130J8232L960O8951P553n6033M9651j0948j1521
$$ plain form
15527 23637 36173 43571 393 -44102 -59941 -56587 -12619 15306 39599 -9073 21116 13499
15515 13499 -45118 -122106 -139089 -91559 -60403 -36527 -48361 -47860 -51721 -7589 37241 37800 30771
15502 30771 25524 56221 97583 104570 83958 42719 -1099 42735 77146 121907 72441 32267
15490 32267 -5211 3213 47295 18044 -1134 68763 71949 -12659 -72219 -116991 -109677 -160862
15478 -160862 -105750 -88199 -19997 -13164 11602 -6301 20184 10388 -6938 63016 60328 46031
15466 46031 14152 17914 28956 2939 7332 70237 92017 103922 71084 72606 35037 -30799
15454 -30799 25719 40137 3426 -63511 -161506 -93914 -43201 -79496 -67766 -5719 -7102 87443
15442 87443 122458 37468 9546 89121 117128 67109 605 34378 74900 60763 49656 95169
$$ packed form
15527B3637J2536P398m3178m4495j5839L354M3968K7925K4293m8672L0189p617
15515A3499n8617p6988j6983M7530L1156K3876j1834N01l861M4132M4830N59p029
15502C0771n247L0697M1362O987k0612m1239m3818M3834L4411M4761m9466m0174
15490C2267l7478Q424M4082k9251j9178O9897L186q4608n9560m4772P314n1185
15478a60862N5112J7551O8202O833K4766j7903K6485r796j7326O9954k688j4297
15466D6031l1879L762J1042k6017M393O2905K1780J1905l2838J522l7569o5836
15454c0799N6518J4418l6711o6937r7995O7592N0713l6295J1730O2047j383R4545
15442H7443L5015q4990k7922P9575K8007n0019o6504L3773M0522j4137j1107M5513
$$ plain form
15430 95169 71563 912 30705 -14016 -27723 -51658 -67610 -56361 85404 98750 102126 85397
15418 85397 36004 10173 -28522 -14247 -44042 -14573 59573 76528 90757 140402 48095 4570
15406 4570 -470 -109675 -273682 -267243 -198238 -149569 -176998 -188542 -158815 -76956 38390 103563
15394 103563 52124 -24236 -44055 -19788 18593 -17720 -37728 -56760 -127020 -115464 -83329
15383 -83329 -32621 -33534 -83614 -179508 -158221 -48773 -60766 -118185 -87516 -30410 -28945 -36473
15371 -36473 -524 37761 7351 30588 -5331 -33882 -1764 22853 -18915 2897 43205 18524
15359 18524 27638 30294 -32822 3330 2643 -71994 -122065 -114874 -70787 -50476 14009 26659 32075
15346 32075 50398 33889 -68370 -147689 -43275 -33938 -72386 -76810 -90694 10016 54479
$$ packed form
15430I5169k3606p0651K9793m4721j3707k3935j5952J1249J41765J3346L376j6729
15418H5397m9393k5831l8695J4275k9795K9469P4146J6955J4229M9645r2307m3525
15406D570n040j09205j64007O439O9005M8669k7429j1544K9727Q1859J15346O5173
15394A03563n1439p6360j9819K4267L8381l6313k0008j9032p0260J1556L2135
15383h3329N0708r13n0080r5894K1287J09448j1993n7419L0669N7106J465p528
15371c6473L5949L8285l0410K3237l5919k8551L2118K4617m1768K1812M0308k4681
15359A8524R114K656o3116L6152o87p4637n0071P191M4087K0311O4485J2650N416
15346C2075J8323j6509j02259p9319J04414R337l8448m424j3884J00710M4463
$$ plain form
15335 54479 83957 -6202 26146 37570 8117 44339 43123 104779 44156 -22322 2560 -10440
15323 -10440 -17257 -41941 -84294 -105093 -143829 -115645 -81136 -30457 -78371 -105164 -124510 -119236
15311 -119236 -95916 -41416 -59461 -14626 5701 20507 -17694 12063 69482 95007 55846
15300 55846 -46425 -41220 -25850 -42194 -78298 2354 9127 25334 13262 -3643 44055 43742
15288 43742 36678 -19466 -11953 -32351 -40840 3150 29535 129081 71745 8588 33286 -9828
15276 -9828 -48815 -36153 -108186 -979 28268 53023 77342 51039 -44688 -100702 -11727 -11249
15264 -11249 -13000 -2135 5402 56636 71804 120049 87806 -44484 -107756 -139455 -110120 -35890
15252 -35890 16594 -65596 -159769 -66544 35291 71198 86261 57878 30241 -47158 -2368
$$ packed form
15335E4479K9478r0159L2348J1424k9453L6222j216O1656o0623o6478K4882j3000
15323a0440o817k4684m2353k0799l8736K8184L4509N0679m7914k6793j9346N274
15311a19236K3320N4500j8045M4835K0327J4806l8201K9757N7419K5525l9161
15300E5846j02271N205J5370j6344l6104Q0652O773J6207j2072j6905M7698l13
15288D3742p064n6144P513k0398q489M3990K6385R9546n7336o3157K4698m3114
15276i828l8987J2662p2033J07207K9247K4755K4319k6303r5727n6014Q8975M78
15264a1249j751J0865P537N1234J5168M8245l2243j32290o3272l1699K9335P4230
15252c5890N2484q2190r4173R3225J01835L5907J5063k8383k7637p7399M4790
$$ plain form
15241 -2368 59329 37506 -1068 743 -68235 -155500 -121960 -39740 -25619 -24362 -35078 28601
15229 28601 -15487 -50595 -31975 27096 41974 44840 99191 -15942 -6057 67669 136436 166265
15217 166265 100963 68040 71315 181029 245046 167866 60931 -8535 -62002 -127894 -180533
15206 -180533 -211026 -157292 -72814 29570 -11473 -75060 -133160 -66539 -27390 -19219 -10843 -29411
15194 -29411 -13647 -128030 -116363 -86555 21111 98143 97056 70100 11371 -57419 14409
15183 14409 77464 121053 119491 89810 12333 -4067 59903 98796 59810 -84956 -33336 -12852
15171 -12852 -58958 -20812 25785 44460 106456 58906 -52188 9752 41588 71101 32795
15160 32795 51101 142709 113186 43882 17 -33145 -43592 1675 35705 8579 -40225 49497
$$ packed form
15241b368O1697k1823l8574J811o8978q7265L3540Q2220J4121J257j0716O3679
15229B8601m4088l5108J8620N9071J4878K866N4351j15133R885P3726O8767K9829
15217A66265o5302l2923L275J09714O4017p7180j06935o9466n3467o5892n2639
15206a80533l0493N3734Q4478J02384m1043o3587n8100O6621L9149Q171Q376j8568
15194b9411J5764j14383J1667K9808J07666P7032j087k6956n8729o8790P1828
15183A4409O3055M3589j562k9681p7477j6400O3970L8893l8986j44766N1620K0484
15171a2852m6106L8146M6597J8675O1996m7550j11094O1940L1836K9513l8306
15160C2795J8306R1608k9523o9304m3865l3162j0447M5267L4030k7126m8804Q9722
$$ plain form
15148 49497 69592 -50070 -122651 -147292 -8252 50307 15080 -26066 41101 40232 -21941 -18783
15136 -18783 -19149 -55052 -17016 47152 46985 12050 -51842 -26832 -33947 -29078 -97176 -135778 -74287
15123 -74287 -43634 19123 73007 42544 55576 137855 44203 -2951 62097 136607 94385 15175
15111 15175 -31723 -74836 -74260 -36504 4799 -38900 -42122 -12206 39534 77173 118638 49907
15099 49907 -55488 -3236 -4896 -49646 -55737 -56374 -19212 12662 -10603 -81087 -90793 -56319
15087 -56319 25517 78206 89724 127771 74094 66844 65807 110249 137621 170271 141361 82674
15075 82674 32842 74531 138575 74866 59523 120847 62848 6962 -9667 57450 118742 110803
15063 110803 170005 205702 161509 35588 57131 110846 156728 177150 168383 97520 12444
$$ packed form
15148D9497K0095j19662p2581k4641J39040N8559l5227m1146O7167q69o2173L158
15136a8783l66l5903L8036O4168j67l4935o3892K5010p115M869o8098l8602O1491
15123g4287L0653O2757N3884l0463J3032Q2279r3652m7154O5048P4510m2222p9210
15111A5175m6898m3113N76L7756M1303m3699l222K9916N1740L7639M1465o8731
15099D9907j05395N2252j660m4750o091o37L7162L1874k3265p0484r706L4474
15087e6319Q1836N2689J1518L8047n3677p250j037M4442K7372L2650k8910n8687
15075H2674m9832M1689O4044o3709j5343O1324n7999n5886j6629O7117O1292p939
15063A10803N9202L5697m4193j25921K1543N3715M5882K0422q767p0863q5076
$$ plain form
15052 12444 12764 15663 104167 83276 81024 144615 45086 10729 32052 26204 64313 72785 120888
15039 120888 78275 -30500 8845 -89644 -34239 27781 22696 19152 94976 70919 24504 -83273
15027 -83273 -97760 -118714 -110494 -97669 -97722 -76438 50580 41146 -18605 -8887 3250 -21454 -30417
15014 -30417 -21633 21686 76438 119991 61382 42435 99234 44771 29079 -9783 14840 22401
15002 22401 76057 56262 66652 53707 103739 100932 120484 87346 96098 92249 69952 40235
14990 40235 105824 -4361 -29662 -78725 -55116 21457 40217 66868 66346 53780 -17157 -65613
14978 -65613 -34540 -53345 -54329 22343 20072 -18411 93917 132193 73353 -1512 1268 -51170
14966 -51170 33077 -17019 -18306 -21777 -82960 -98695 -25797 63928 173939 105722 84007 57626
$$ packed form
15052A2444L20K899Q8504k0891k252O3591r9529l4357K1323n848L8109Q472M8103
15039A20888m2613j08775L9345r8489N5405O2020n085l544P5824k4057m6415j07777
15027h3273j4487k0954Q220J2825n3K1284J27018r434n9751R718J2137k4704q963
15014c0417Q784M3319N4752M3553n8609j8947N6799n4463j5692l8862K4623P561
15002B2401N3656j9795J0390j2945N0032k807J9552l3138Q752l849k2297k9717
14990D0235O5589j10185k5301m9063K3609P6573J8760K6651n22j2566p0937m8456
14978f5613L1073j8805r84P6672k271l8483J12328L8276n8840p4865K780n2438
14966e1170Q4247n0096j287l471o1183j5735P2898Q9725J10011o8217k1715k6381
$$ plain form
14954 57626 51635 108311 155661 158440 118855 15381 38595 49752 14570 54123 114640 139976
14942 139976 171510 160216 81070 30260 6900 -121900 -102851 18176 40912 40129 89607
14931 89607 78306 24965 -5264 -18878 -6956 -53268 -41405 -97015 -35468 -55650 -106687 -51302
14919 -51302 11128 93719 117512 119688 89077 32091 -8120 -148143 -146329 42362 123577 121742
14907 121742 49328 -31972 -67539 -77096 -36994 -72658 -82716 -24311 -7926 35149 196 -62808
14895 -62808 -56211 -16113 -83414 -49694 -51603 20137 51796 20556 -46149 -62182 -16121 35123
14883 35123 68050 15782 -84745 -120327 -63923 10296 125519 52138 27429 55959 83344
14872 83344 134630 154976 133830 110317 45373 31534 -16602 -51046 -30183 -41254 -93984 -38602
$$ packed form
14954E7626n991N6676M7350K779l9585j03474K3214J1157l5182L9553O0517K5336
14942A39976L1534j1294p9146n0810k3360j28800J9049J21027K2736p83M9478
14931H9607j1301n3341l0229j3614J1922m6312J1863n5610O1547k0182n1037N5385
14919e1302O2430Q2591K3793K176l0611n6986m0211j40023J814J88691Q1215j835
14907A21742p2414q1300l5567r557M0102l5664j0058N8405J6385M3075l4953o3004
14895f2808O597M0098o7301L3720j909P1740L1659l1240o6705j6033M6061N1244
14883C5123L2927n2268j00527l5582N6404P4219J15223p3381k4709K8530K7385
14872H3344N1286K0346k1146k3513o4944j3839m8136l4444K0863j1071n2730N5382
$$ plain form
14860 -38602 1411 4625 -66573 -131238 -126055 -85992 -100824 -57135 -17906 -44071 -70352 -113792
14848 -113792 -132241 -141128 -123848 -171163 -174385 -203703 -260872 -171641 -72805 -63846 -54604 -116132
14836 -116132 -45447 -392 34539 18893 -50753 -109404 -91543 -43146 28633 75894 3814
14825 3814 -74719 -108914 -66359 -45590 -34694 -10732 -32663 -69967 -116929 -39695 18171 18816
14813 18816 -60914 -60502 -99913 -103972 -43247 -32847 75108 145421 154676 96393 18042 46185
14801 46185 73050 59812 -51096 -111524 -87917 -105146 -123764 -96276 -28791 14285 124287
14790 124287 129568 24225 -64937 -149471 -151566 -93660 -30443 13054 478 -83131 -93877 -149241
14778 -149241 -64292 73492 128481 135206 24269 2827 -1975 -6926 114056 127925 117755
$$ packed form
14860c8602M0013L214p1198o4665N183M0063j4832M3689L9229k6165k6281m3440
14848a13792j8449q887J7280m7315l222k9318n7169Q9231R8836Q959R242o1528
14836a16132P0685M5055L4931j5646o9646n8651J7861M8397P1779M7261p2080
14825C814p8533l4195M2555K0769J0896K3962k1931l7304m6962P7234N7866O45
14813A8816p9730M12l9411m059O0725J0400J07955P0313R255n8283p8351K8143
14801D6185K6865j3238j10908o0428K3607j7229j8618K7488O7485M3076J10002
14790A24287N281j05343q9162q4534k095N7906O3217M3497j2576q3609j0746n5364
14778a49241Q4949J37784N4989O725j10937k1442m802m951J20982J3869j0170
$$ plain form
14767 117755 133196 129441 51954 103462 124729 111053 81381 72435 90890 130295 98106 8366
14755 8366 -44156 -44764 -33958 37677 25939 76579 134580 110687 20256 -42361 37376 119355
14743 119355 72467 35555 90661 88818 3742 49213 89087 84611 76148 42181 -12948 2149
14731 2149 22465 -18153 -5743 -9974 -76304 -118890 -82518 -83982 -48840 16348 38716 49031
14719 49031 43796 63321 21467 -6541 8218 -16151 -68048 -128651 -103662 -9178 -7110 19556
14707 19556 11926 -24605 -47149 -2888 50282 -10689 -68994 -77273 -113938 -47303 -49991 -94972
14695 -94972 -45413 -59721 -17481 39160 45300 -114876 -129257 -142818 -158860 -138016 -78550 -137112
14683 -137112 -154959 -34679 110300 104363 115146 46749 -32068 -51938 -30391 5870 -55155
$$ packed form
14767A17755J5441l755p7487N1508K1267j3676k9672q946J8455L9405l2189q9740
14755H366n2522o08J0806P1635j1738N0640N8001k3893r0431o2617P9737Q1979
14743A19355m6888l6912N5106j843q5076M5471L9874m476q463l3967n5129J5097
14731B149K0316m0618J2410m231o6330m2586L6372j464L5142O5188K2368J0315
14719D9031n235J9525m1854k8008J4759k4369n1897o0603K4989R4484K068K6666
14707A9556p630l6531k2544M4261N3170o0971n8305q279l6665O6635k688m4981
14695i4972M9559j4308M2240N6641O140j60176j4381j3561j6042K0844N9466n8562
14683a37112j7847J20280J44979n937J0783o8397p8817j9870K1547L6261o1025
$$ plain form
14672 -55155 -128103 -92188 -5402 16667 9066 -71713 -132165 -99397 -37676 -28049 -51515 -5894
14660 -5894 -47500 -115509 -80303 -82606 -18259 -21848 -35836 53871 9788 -30247 -14427 -36172
14648 -36172 -5679 12923 -31553 -54673 -27114 14111 30758 40500 35812 8368 20857 -36483
14636 -36483 -59466 -29037 -21114 -150751 -132697 -80566 -36370 16175 128912 60408 -30473
14625 -30473 -65195 -72996 -29641 65723 108230 87329 11558 37919 82275 107657 72057 47858
14613 47858 1510 -70133 -65606 -21292 4305 -57732 -52662 -29953 -3760 -15938 -96248 -157933
14601 -157933 -151701 -117419 -112949 -68150 -12777 -68055 -66622 -102437 -142650 -69212 -38071 30154
14589 30154 67341 51076 51100 21481 -50477 -79330 -3194 101460 47689 14441 49442 8401
$$ packed form
14672e5155p2948L5915Q6786K2069p601q0779o0452L2768O1721R627k3466M5621
14660e894m1606o8009L5206k303O4347l589j3988Q9707m4083m0035J5820k1745
14648c6172L0493J8602m4476k3120K7559M1225J6647R742m688k7444J2489n7340
14636c6483k2983L0429P923j29637J8054N2131M4196N2545J12737o8504r0881
14625c0473l4722p801M3355R5364M2507k0901p5771K6361M4356K5382l5600k4199
14613D7858m6348p1643M527M4314K5597o2037N070K2709K6193j2178q0310o1685
14601a57933O232L4282M470M4799N5373n5278J433l5815m0213P3438L1141O8225
14589C0154L7187j6265K4k9619p1958k8853P6136J04654n3771l3248L5001m1041
$$ plain form
14577 8401 6889 11555 23205 79702 192322 172399 145442 113371 119306 83865 55706 20459
14565 20459 -86533 -111020 -147966 -140401 -86402 -118048 -98075 -127086 -40636 65855 43390
14554 43390 -14295 -23360 -5143 -8127 -27014 -65413 -47904 47189 118455 124321 134494 153523
14542 153523 118608 59403 1323 15057 46507 48465 -10924 -79248 -86050 -5998 61378 55623
14530 55623 126403 51386 -33672 -42632 -71329 -34796 13836 59718 54027 11960 -6431 -127135
14518 -127135 -167982 -98877 -65413 1087 74081 47893 -30683 -61548 -79328 -59124 -131003
14507 -131003 -117721 -90552 -52067 -21984 -62427 -68819 -135011 -146577 -91875 -29586 -77221 -61348
14495 -61348 -55805 -91832 -128546 -91931 -97605 3119 87854 127403 55420 -13838 22525 -6864
$$ packed form
14577H401j512M666J1650N6497J12620j9923k6957l2071N935l5441k8159l5247
14565B0459j06992k4487l6946P565N3999l1646J9973k9011Q6450J06491k2465
14554D3390n7685r065J8217k984j8887l8399J7509R5093P1266N866J0173J9029
14542A53523l4915n9205n8080J3734L1450J958n9389o8324o802Q0052O7376n755
14530E5623P0780p5017q5058q960k8697L6533M8632M5882n691m2067j8391j20704
14518a27135m0847O9105L3464O6500P2994k6188p8576l0865j7780K0204p1879
14507a31003J3282K7169L8485L0083m0443o392o6192j1566N4702O2289m7635J5873
14495f1348N543l6027l6714L6615n674J00724Q4735L9549p1983o9258L6363k9389
$$ plain form
14483 -6864 -52089 -74777 -24757 24633 75794 89787 125041 82143 120283 166410 144240 124017
$$ packed form
14483f864m5225k2688N0020M9390N1161J3993L5254m2898L8140M6127k2170k0223
$$ [...]
##END NTUPLES=NMR SPECTRUM
##END=
