##TITLE=Analysis number 329209
Compound Code sb 01869
Book Reference a
Project Code adrs
Chemist Name stores
##JCAMPDX= 6.0         $$ Bruker NMR JCAMP-DX V2.0
##DATA TYPE= NMR SPECTRUM
##DATA CLASS= NTUPLES
##ORIGIN= Bruker BioSpin GmbH
##OWNER= nmr
$$ XWIN-NMR		Version 3.5
$$ Fri Aug 10 11:58:45 2007 GMT Daylight Time (UT+1h)  MAYBRIDGE\nmr@NMR_250MHZ
##.OBSERVE FREQUENCY= 250.131544655141
##.OBSERVE NUCLEUS= ^1H
##.ACQUISITION MODE= SIMULTANEOUS (DQD)
##.ACQUISITION SCHEME= undefined
##.AVERAGES= 16
##.DIGITISER RES= 18
##SPECTROMETER/DATA SYSTEM= dpx250
##.PULSE SEQUENCE= zg30
##.SOLVENT NAME= CDCl3
##.SHIFT REFERENCE= (INTERNAL, CDCl3, 0, 16.522)
##AUDIT TRAIL= $$ (NUMBER, WHEN, WHO, WHERE, WHAT)
$$ ##TITLE= Audit trail, XWIN-NMR		Version 3.5
$$ ##JCAMPDX= 5.01
$$ ##ORIGIN= Bruker BioSpin GmbH
$$ ##OWNER= nmr
$$ C:\u/data/dgb/nmr/ADRS/350/pdata/1/auditp.txt
$$ ##AUDIT TRAIL=  $$ (NUMBER, WHEN, WHO, WHERE, WHAT)
(   1,<2007-08-10 11:58:18.68 +100>,<MAYBRIDGE\nmr>,<NMR_250MHZ>,
      <created by zg, POWCHK disabled, PULCHK disabled
       configuration hash MD5:
       76 6E 9A 78 1E 09 19 81 EC 84 63 8F B0 6A 59 2D
       data hash MD5: 64K
       AE 10 8C E9 3A C0 4C 5F FE B7 0C 58 F1 CB EE 38>)
(   2,<2007-08-10 11:58:33.83 +100>,<MAYBRIDGE\nmr>,<NMR_250MHZ>,
      <Start of raw data processing
       ef LB = 0.3 FT_mod = 6 PKNL = 1 SI = 32K 
       data hash MD5: 32K
       71 84 D4 C6 1E BD CC 55 72 E6 56 EB CF 79 9A C0>)
(   3,<2007-08-10 11:58:35.52 +100>,<MAYBRIDGE\nmr>,<NMR_250MHZ>,
      <apk 
       data hash MD5: 32K
       22 C4 9C C8 47 F1 D0 8D 21 26 2F C5 42 B6 20 8A>)
(   4,<2007-08-10 11:58:36.27 +100>,<MAYBRIDGE\nmr>,<NMR_250MHZ>,
      <abs ABSG = 5 
       data hash MD5: 32K
       F2 D5 53 83 CE EA F2 6B 21 D6 29 72 F7 14 78 0F>)
$$ ##END=
$$ 
$$ hash MD5
$$ 1B 9A 53 7F BB 44 07 46 44 73 3C DA 01 61 A4 EF
##$RELAX= 
##$RELAX= 
##$RELAX= 
##$RELAX= 
##$RELAX= 
##$RELAX= 
##$RELAX= 
$$ Bruker specific parameters
$$ --------------------------
##$DU= <C:\u>
##$EXPNO= 350
##$NAME= <ADRS>
##$PROCNO= 1
##$TYPE= <nmr>
##$USER= <dgb>
##$AMP= (0..31)
100 100 100 100 100 100 100 100 100 100 100 100 100 100 100 100 100 100 
100 100 100 100 100 100 100 100 100 100 100 100 100 100 
##$AQSEQ= 0
##$AQ_mod= 3
##$AUNM= <au_zg>
##$AUTOPOS= <36 >
##$BF1= 250.13
##$BF2= 250.13
##$BF3= 250.13
##$BF4= 250.13
##$BF5= 500.13
##$BF6= 500.13
##$BF7= 500.13
##$BF8= 500.13
##$BYTORDA= 1
##$CFDGTYP= 0
##$CFRGTYP= 5
##$CHEMSTR= <none>
##$CNST= (0..31)
1 1 145 1 1 1 1 1 1 1 1 1 1 1 1 1 1 1 1 1 1 1 1 1 1 1 1 1 1 1 1 1 
##$CPDPRG= <>
##$CPDPRG1= <>
##$CPDPRG2= <>
##$CPDPRG3= <>
##$CPDPRG4= <mlev>
##$CPDPRG5= <mlev>
##$CPDPRG6= <mlev>
##$CPDPRG7= <mlev>
##$CPDPRG8= <mlev>
##$CPDPRGB= <>
##$CPDPRGT= <>
##$D= (0..31)
0 1 0 0 0 0 0 0 0 0.06 0 0 0 0 0 0 0.0002 0 0 0 0 0 0 0 0 0 0 0 0 0 0 
0 
##$DATE= 1186743497
##$DBL= (0..7)
120 120 120 120 120 120 120 120 
##$DBP= (0..7)
150 150 150 150 150 150 150 150 
##$DBP07= 0
##$DBPNAM0= <>
##$DBPNAM1= <>
$$ [...]
##$SUBNAM7= <"">
##$SUBNAM8= <"">
##$SUBNAM9= <"">
##$SW= 20.6930455092707
##$SWIBOX= (0..15)
0 0 3 0 0 0 0 0 0 0 0 0 0 0 0 0 
##$SW_h= 5175.983436853
##$TD= 65536
##$TD0= 1
##$TE= 296.16
##$TE2= 300
##$TE3= 300
##$TEG= 300
##$TL= (0..7)
0 120 120 120 120 120 120 120 
##$TP= (0..7)
150 150 150 150 150 150 150 150 
##$TP07= 0
##$TPNAME0= <>
##$TPNAME1= <>
##$TPNAME2= <>
##$TPNAME3= <>
##$TPNAME4= <>
##$TPNAME5= <>
##$TPNAME6= <>
##$TPNAME7= <>
##$TPOAL= (0..7)
0.5 0.5 0.5 0.5 0.5 0.5 0.5 0.5 
##$TPOFFS= (0..7)
0 0 0 0 0 0 0 0 
##$TUNHIN= 0
##$TUNHOUT= 0
##$TUNXOUT= 0
##$USERA1= <user>
##$USERA2= <user>
##$USERA3= <user>
##$USERA4= <user>
##$USERA5= <user>
##$V9= 5
##$VALIST= <valist>
##$VCLIST= <CCCCCCCCCCCCCCC>
##$VD= 0
##$VDLIST= <DDDDDDDDDDDDDDD>
##$VPLIST= <PPPPPPPPPPPPPPP>
##$VTLIST= <TTTTTTTTTTTTTTT>
##$WBST= 1024
##$WBSW= 4
##$XGAIN= (0..3)
0 0 0 0 
##$XL= 0
##$YL= 0
##$YMAX_a= 455087
##$YMIN_a= -359889
##$ZGOPTNS= <>
##$ZL1= 120
##$ZL2= 120
##$ZL3= 120
##$ZL4= 120
##$ABSF1= 16.522
##$ABSF2= -4.171173
##$ABSG= 5
##$ABSL= 3
##$ALPHA= 0
##$AQORDER= 0
##$ASSFAC= 0
##$ASSFACI= 0
##$ASSFACX= 0
##$ASSWID= 0
##$AUNMP= <proc_1d>
##$AZFE= 0.1
##$AZFW= 0.1
##$BCFW= 0
##$BC_mod= 0
##$BYTORDP= 0
##$COROFFS= 0
##$CY= 12.5
##$DATMOD= 1
##$DC= 0
##$DFILT= <>
##$DTYPP= 0
##$F1P= 14.0000005364418
##$F2P= -0.99999901652339
##$FCOR= 0.5
##$FTSIZE= 32768
##$FT_mod= 6
##$GAMMA= 0
##$GB= 0
##$INTBC= 1
##$INTSCL= 1
##$ISEN= 128
##$LB= 0.3
##$LEV0= 0
##$LPBIN= 0
##$MAXI= 10000
##$MC2= 0
##$MEAN= 0
##$ME_mod= 0
##$MI= 0
##$NCOEF= 0
##$NC_proc= -4
##$NLEV= 6
##$NOISF1= 0
##$NOISF2= 0
##$NSP= 0
##$NTH_PI= 0
##$NZP= 0
##$OFFSET= 16.522
##$PC= 1
##$PHC0= -45.35331
##$PHC1= 4.909238
##$PH_mod= 1
##$PKNL= yes
##$PPARMOD= 0
##$PSCAL= 4
##$PSIGN= 0
##$REVERSE= no
##$SF= 250.13
##$SI= 32768
##$SIGF1= 0
##$SIGF2= 0
##$SINO= 400
##$SIOLD= 32768
##$SREGLST= <1H.CDCl3>
##$SSB= 0
##$STSI= 32768
##$STSR= 0
##$SW_p= 5175.98343685301
##$SYMM= 0
##$S_DEV= 0
##$TDeff= 65536
##$TDoff= 0
##$TI= <Analysis number 999999
Compound Code 99
Book Reference 9
Project Code 9>
##$TILT= no
##$TM1= 0
##$TM2= 0
##$TOPLEV= 0
##$USERP1= <user>
##$USERP2= <user>
##$USERP3= <user>
##$USERP4= <user>
##$USERP5= <user>
##$WDW= 1
##$XDIM= 32768
##$YMAX_p= 442011900
##$YMIN_p= -116244
$$ End of Bruker specific parameters
$$ ---------------------------------
##NTUPLES= NMR SPECTRUM
##VAR_NAME=  FREQUENCY,     SPECTRUM/REAL,   SPECTRUM/IMAG
##SYMBOL=    X,             R,               I
##VAR_TYPE=  INDEPENDENT,   DEPENDENT,       DEPENDENT
##VAR_FORM=  AFFN,          ASDF,            ASDF
##VAR_DIM=   32768,         32768,           32768
##UNITS=     HZ,            ARBITRARY UNITS, ARBITRARY UNITS
##FACTOR=    0.157963299565203, 1,           1
##FIRST=     4132.6476996994, 0,             0
##LAST=      -1043.33573715361, 0,           0
##MIN=       -1043.33573715361, -116244,     0
##MAX=       4132.6476996994, 442011900,     0
$$ Real data points
##PAGE= N=1
##DATA TABLE= (X++(R..R)), XYDATA
$$ [...]
29124B9154k0196k0625P004P558J542R995j3713R977J5882m211p727r132j0856
29111e348J4306m204O573p39j0876r66O771j0841j2904N843j3081P770J7009J8365
29097A7678k0456J3098J0809J9595r018m4416k6595J2641L4785K0668p849K409
29085B3349l1505j7187M732j8365j9011K4364K3139M775J7630p510j7590K7599
29073A4420j6708j5524N780o276k183m390j8511l836K4474J0852j760k626P283
29060i005J0661K777N76l055J088j4435J1208j8049L935J4882O544j9540O965
29047e448j507l8801O55K5626O999k5402O572j0908O244J5745r678m136L8910
29034D871Q176O65L614p946l0501K7601K4366L895O40j1803k5302K340J897K9138
$$ y = [29154, 8958, -11667, -4663, 2895, 4437, 14432, 719, 10696, 26578, 22367, 14640, 5508, -5348, 8958, 4754, 11327, 10588, -288, -1254, 5517, -5324, -18228, -12385, -25466, -17696, -687, 17678, -2778, 10320, 21129, 40724, 31706, -12710, -39305, -26664, 8121, 28789, 20940, 23349, -8156, -25343, -20611, -38976, -57987, -33623, -10484, -5709, 11921, 4411, -13179, 14420, -2288, -17812, -12032, -18308, -20491, -24881, -43392, -47228, -22754, -11902, -13662, -16288, -9005, 1656, 4433, 5009, 1954, 3042, -11393, -185, -18234, -14299, 583, 7127, -12413, -5448, -6955, -45756, -45101, -19475, -12476, -37878, -31306, -42214, -35970, -20225, -29903, -34039, 4871, 13047, 13712, 17326, 9380, -21121, 6480, 30846, 34741, 35381, 23578, -1724, 616, 2513, 31651]
29020C1651o483n449J703r093J3617j4596l699n106Q69p831k1920m295l944l333
29006c7909K8014L1047J4408K5765K3408j8174j5303p247j3932K402j616J8040
28994D8903l2618j15J7045n788j8176k0819j2366l2558K4329J9809M546l5349
28982d3157m2049N062K0066K6007P899K5171L3013p60R786N909j9476j3188N910
28969B0193k1552P044K52R743L0070Q937m0069k1829K2790J697l280j6811r044
28956a1859O537J8575J011L432r292K0432P372j7441k2247n885P280K4304M724
28943B6943j4441o840k3498k063q374K3449L412k3283J5557O984O028j6826J4939
28930A987N318j702j0488k816o509j984K0056r010K369j2529N482j3353J2537
$$ y = [31651, 25168, 19719, 21422, 12329, 25946, 11350, 7651, 2545, 3414, -4417, -26337, -30632, -34576, -37909, -9895, 21152, 35560, 61325, 84733, 66559, 51256, 44009, 30077, 32479, 30863, 48903, 16285, 16170, 33215, 27427, 9251, -11568, -23934, -56492, -32163, -12354, -7808, -43157, -85206, -80144, -60078, -34071, -26172, -1001, 32012, 31252, 41038, 46947, 27471, 14283, 20193, -1359, 5685, 5937, 15680, 45750, 54687, 14618, -7211, 15579, 17276, 13996, -2815, -11859, -5322, 13253, 14264, 17696, 8404, 28836, 36208, 18767, -3480, -9365, -2085, 22219, 26943, 12502, 5662, -17836, -19899, -28273, -4824, -1412, -24695, -9138, -2154, 3874, -12952, 1987, 7305, 5603, -4885, -7701, -14210, -16194, 3862, -5148, -2779, -15308, -9826, -23179, -10642]
28917a0642M9104M17k8422k3721k7896N692k464K7279L6829R02k9416k8956K6801
28904d493K1889j6549Q324r037p188M568Q317K84j7771M613o82n0632k2742N276
28890g5823K9329O4909L2390m92L846k0231q482Q783J1119K301l4044J709J3948
28877B9262L859j3457K543J6451k05P617q866R970J3881r817k1504m105M587J1283
28863D1499j9041j7517j9383K095K0783J9464N157j6738M985J097j2812l883j6975
28850a1269k4920K947o81r319J2711M437L8030L6830J2485j2144j4256k6571j8497
28837a0217M11L5578K2556l4694o275O531J6629K0756O248m2920r223L9765r799
28824C5346k1252P411J8770l0051k7979j4156J5301J6899j5435J8958J4021J0694
$$ y = [-10642, 38462, 38879, 10457, -13264, -41160, -35468, -37932, -10653, 26176, 27078, -2338, -31294, -4493, 17396, 847, 9171, 134, -7054, -2486, 5831, 6115, -11656, -7043, -7725, -58357, -81099, -75823, -46494, 18415, 50805, 50313, 54159, 33928, 25446, 34229, 45348, 47649, 13605, 15314, 29262, 33121, 19664, 22207, 38658, 38453, 46070, 37204, 47174, 61055, 51238, 29734, 25629, 30216, 41499, 22458, 4941, -14442, -12347, 8436, 27900, 33057, 16319, 21304, 22401, 9589, 5706, -11269, -36189, -33242, -33923, -43242, -30531, -26094, 11936, 48766, 61251, 49107, 34851, 8280, -10217, -9806, 25772, 48328, 13634, 7359, 13890, 30519, 51275, 57523, 14603, 5380, 45145, 35346, 14094, 21505, 40275, 10224, -17755, -31911, -16610, 289, -15146, 3812, 17833, 28527]
28812B8527J2912n055m490k810j260l4801j2076o563k8641j353j9872L2333K603
28799d0546k0812l925M1170N166J4661K2232o604J4150J5256j669m0535o207J2992
28786E329k7339p265K1403j1850J7269L6796J7215j4781q027J864R148j7029k7026
28773d293j3898J3466k0304o65P183J5788K6030q626q398k180O210R786O247n232
28759B1114j8422k73l186q518J3959L657R136j0278P385j8j4317o239r760k2961
28745c8721R757L1103K0932L7202j5923k4809j8305j6545k516M578J2716Q073
28733G542L212q332j5274K0354K7409L385j6403Q445P154p494k2626p59J4233
28720B0846J5329J7145k9002o477K0898k5961L038J5652r197j0076k1508k483
$$ y = [28527, 41439, 36384, 31894, 29084, 27824, -6977, -19053, -25616, -54257, -55610, -75482, -43149, -40546, -61358, -65283, -24113, -18947, -4286, 17946, 11342, 25492, 40748, 39079, -1456, -7663, 5329, -22010, -29275, -7872, -19722, -2453, 34343, 51558, 36777, 28750, 30614, 39762, 22733, -4293, -18191, -4725, -25029, -25694, -18511, -2723, 23307, 14681, 6283, 4103, 10313, 20099, 26346, 21114, 2692, 2419, -767, -9285, 4674, 8331, 17467, 7189, 14574, 14556, 239, -6000, -15760, -38721, -28964, 2139, 23071, 60273, 44350, 19541, 1236, -15309, -17825, -13247, -531, 7542, 10754, 2422, -12852, 7502, 34911, 38296, 21893, 30338, 37492, 29998, 7372, 6613, 20846, 36175, 53320, 24318, 17841, 38739, 12778, 15816, 31468, 22271, 12195, -9313, -11796]
28708a1796N787K925J3965J0289j9834l5620j4363K0716n583N669J4863L7286
28696B4304O636j7537j4912p515M73k438q930M45j3407L5903O376k6165p396K3300
28682h63J3780Q079j0213k0706J315J8768J7431M311J6763n871j3187n136l122
28669B1349J197j5112j3207j5859j2013J1771j276J0271J5J0297N127j2476J3037
28656C121M842j6842M369n358n159j1786j117J1496J1017k303l866l2944j9762
28643f4292L0065L4261j1713L6349K350j2322M169L277K7177j4179k4134o554
28631D454p878j1640n313n217J772P453r578J4735J4518J6234r050O05J4825q063
28617A7857n822n645Q509L541O702J0141j9191j1877P022j0723P770o637o194
$$ y = [-11796, -6009, -3084, 10881, 21170, 1336, -34284, -48647, -27931, -33514, -27845, -12982, 24304, 30940, 13403, -1509, -9024, -8551, -10989, -19919, -19474, -32881, 3022, 9398, -16767, -24163, -863, 12917, 20996, 10783, -9923, -8608, 10160, 27591, 31902, 48665, 42794, 29607, 24471, 21349, 22546, 7434, -5773, -21632, -33645, -21874, -23150, -12879, -12864, -2567, 2560, -9916, 3121, 7963, -8879, -4510, -9868, -15027, -26813, -27930, -16434, -5417, -7720, -11586, -44530, -64292, -34227, 34, -11679, 24670, 27020, 14698, 18867, 22144, 49321, 35142, 11008, 4454, -3424, -15064, -20377, -25594, -23822, -16369, -25947, -11212, 3306, 19540, 10490, 11095, 25920, 17857, 12035, 6390, 14899, 18440, 25142, 35283, 16092, 4215, 11237, 514, 8284, 1647, -4547]
28604d547k2901j033K8776J4256o691j081l663m4448q579L0997K3727J1165r704
28591F274l7389j2483L9453J8056k797o503n521j3037j0538M935J2691Q9l104
28578i874J4969J470p967P850N137R453o147j1380N965N724O803R581M216K9614
28564F5414K273k5734j6453k3177R59J703p501k207J9602J1489M421M276j3583
28551B1482k8515R660J0164r508j9385J5740j253j2777J081k484J2746M231l5612
28538c4430j803p216K7049J4208J3302m2479j2463N211J5122L9795K1574o807
28526C1063j8841K046J2014j3721P925n231M096K314j2720L909J1229j9545J0030
28513A4568J6758k3317j3563J9567Q39J7228J4217j7045j3856k6711j133k2580
$$ y = [-4547, -27448, -28481, 295, 14551, 7860, 6779, 3116, -41332, -49911, -18914, 4813, 15978, 6274, -31115, -43598, -4145, 13911, 11114, 4611, -910, -13947, -24485, -19550, -6859, -6770, -9874, 5095, 6565, -1402, 6448, 11585, 21038, 14891, 3511, 9476, 15200, 22003, 31584, 35800, 65414, 67687, 41953, 25500, 2323, 3282, 4985, -2516, -4723, 14879, 26368, 30789, 35065, 21482, -7033, 2627, 12791, 3283, -16102, -362, -1615, -14392, -13311, -15795, -3049, 1182, -34430, -36233, -43449, -16400, -2192, 11110, -31369, -43832, -38621, -23499, 16296, 37870, 31063, 12222, 14268, 26282, 12561, 20486, 15255, 19351, 21665, 8945, 12854, 24083, 4538, 14568, 31326, 8009, -5554, 14013, 14852, 32080, 46297, 29252, 15396, -11315, -12448, -35028]
28501c5028J5475J5068q789Q898K1492P530j0692O276j1460R172k4300R45k7089
28488c2502j3344J7857K7325O112j0050n169P223J8753J2705Q532k9555j1380
28476c493k355j7983L625j7338q554J7368J1329J0111J3803j0123Q942p229j6563
28463a8460J7408R754m910l527j9469R357J7402j288M818p485Q830j3226o664
28450g460j1441q547j0687M592P563J5310K674L541j0698J9362j2565L282J8440
28437A3366k7325k9677K3248M0214J2885k4467j9111m469J5879J4642J5583J6733
28425D7501k4904l5066j4616K2874k119j2367J6492R857j8625K1062M061O221
28413B0371r518n403J3964j5780j54l0710j6252K9010L6464P834n829j5279R245
$$ y = [-35028, -19553, -4485, -13274, -4376, 17116, 24646, 13954, 20230, 8770, 17942, -6358, -5413, -32502, -45846, -27989, -664, 5448, -4602, -9771, -2548, 16205, 28910, 37442, 7887, -3493, -5848, -23831, -20206, -37544, -46098, -28730, -17401, -7290, 6513, -3610, 5332, -1897, -18460, -1052, 8702, 3792, 265, -19204, -9847, 7555, 6267, 11085, 3600, 12430, -796, -7460, -18901, -27448, -38135, -33543, -25980, -10670, -7996, -4455, -15153, 4209, -8356, -5074, 13366, -13959, -43636, -20388, 19826, 32711, 8244, -10867, -15336, 543, 15185, 30768, 47501, 22597, -12469, -27085, -4211, -6330, -18697, -2205, 7652, -10973, 10089, 14150, 20371, 10853, 5450, 19414, 3634, 3480, -27230, -43482, -14472, 21992, 29826, 23997, 8718, 17963]
28400A7963j2134j6859Q862n011M900l0311J4010L05j4696J3209R492J8215J9556
28387B7501n84P001O196j6769l605K3844J6399m3694p4742n7791M2314Q455l216
28374f8691L7737J7847j2879j7492q56m279o442J6162K8595L2208k2571j2144
28362a2805q337j0289Q698p94J2501j0491n686J5824q267K568L0859j0269k3674
28349b0162k4863R11J7031J7670M4208O853M310j0452o227j4949k5881j9621J8311
28336a2861K8299p075J6900N034k08j9275k0523j0386l11k7112J1531K0753P579
28323g655j854O597n249R231J7922K7829K092K903j9727j6877n612r199J5745
28310A6146q223l391r22j1223L045J2263J9488J0623j1029j4038J5566J9012l853
$$ y = [17963, 5829, -11030, -2168, -7179, -2279, -32590, -18580, -18275, -32971, -19762, -10270, 7945, 27501, 26917, 33918, 40114, 23345, 19740, 43584, 59983, 16289, -58453, -116244, -73930, -65475, -68691, -30954, -13107, -25986, -43478, -44334, -48613, -55055, -38893, -10298, 21910, -661, -12805, -21142, -31431, -22733, -23527, -11026, -21517, -27203, -11379, -19646, -17078, 13781, 3512, -20162, -45025, -44114, -27083, -9413, 34795, 41648, 45958, 35506, 29279, 14330, -11551, -31172, -12861, 15438, 8363, 25263, 30297, 30089, 10814, -9709, -20095, -20406, -47518, -35987, -15234, -7655, -9509, -2912, -8161, 1070, 18992, 46821, 48913, 51816, 32089, 15212, 9600, 401, 16146, 7923, 4532, 3610, -7613, -4568, 7695, 27183, 37806, 26777, 12739, 28305, 47317, 43464]
28297D3464l1524j5857M3038k071M153L2330l953m2241J932O67l7153q604L454
28284a2365k786q353m072l4871o838K1651N23P722J6874K1809N675J4116l1824
28271a2739O863K1644n374K911R490k3205l5583l606J5700K9499N786j9749L006
28258e357J3543L388M897L584N241J795p327J6606j770o117J4133r212J801k8563
28244F642j2683j0473Q214K7237O360j0429O765M120P908p814j9091j5304Q132
28231d16M389k0155R658K1423R864p544K6583j1960k0946R156O861O287p514P144
28217C2830l567j203l287K1836p270q755j8771j5314L76K264l189j3834k0371
28204c8255J4123L7857k49J0297l6j1531K4760N678n856m392q869q331j0639j6510
$$ y = [43464, 11940, -3917, 39121, 37050, 41203, 73533, 69580, 27339, 29271, 29938, -7215, -15819, -12365, -15151, -23504, -27576, -62447, -69285, -47634, -47111, -39389, -22515, -706, 4969, 19085, -12739, -5876, 15768, 10394, 13305, 22795, -410, -35993, -39599, -23899, 5600, 11386, -8363, -5357, 8186, 11574, 16471, 20055, 25296, 27091, 19764, 36370, 34600, 28483, 42616, 33404, 35205, 6642, -6041, -16514, -8300, 18937, 25297, 14868, 21633, 25753, 33661, 25847, 6756, -8548, -416, 3973, -16182, -6524, 14899, 24763, 17219, 43802, 31842, 10896, 20052, 26913, 33200, 25686, 32830, 29263, 28060, 24773, 46609, 39339, 30584, 11813, -3501, -3125, -861, -4050, -17884, -38255, -24132, 13725, 13476, 23773, 23737, 12206, 36966, 42644, 36788, 32396, 23527, 15196, 4557, -11953]
28190a1953l180J023L373J0255M153K369p134J4843o588O179N893J5536l134O811
28176C8446l795m6556k3328N943j6895J2400L5933J7485j1943J269O501l9922
28164b4462l205J2418p113O562j2290J2766J7550J1072p244j1420L870L2307J7074
28151D7885j0609k6644j0519n004l344P937M267J8868J0698J1478l921r274l0359
28138A459l3307J775K3749p749r963J1547l736O998R53j5959l038K238m778j0503
28124d0314m865N858J2205o501q326R429L244K7755J4717j3359J1975K1619J047
28111C4484j2910J2184o211j6304k7107l872P024J0670r101J9354J2393n415J5253
28098C0442K880j8402J4855o493L642j2686k1534J2750K5655K819K7826j3968
$$ y = [-11953, -15133, -14110, -10737, -482, 3671, 6040, -1094, 13749, 7161, 13340, 19233, 34769, 31635, 38446, 34651, -11905, -35233, -29290, -46185, -33785, 2148, 19633, 7690, 8959, 15460, -24462, -27667, -15249, -22362, -15800, -28090, -15324, 2226, 13298, 6054, -5366, -1496, 30811, 47885, 37276, 10632, 113, -4891, -8235, -298, 3969, 22837, 33535, 45013, 41092, 31818, 1459, -31848, -30073, -6324, -14073, -24036, -12489, -16225, -9227, -8274, -24233, -27271, -25033, -29811, -40314, -45179, -39321, -27116, -33617, -41943, -32514, -29270, -1515, 13202, -157, 11818, 33437, 34484, 21574, 33758, 27547, 11243, -15864, -19736, -12712, -2042, -11143, 8211, 20604, 15189, 30442, 33322, 14920, 29775, 23282, 26924, 14238, -7296, 5454, 31109, 33928, 61754, 47786]
28086D7786q002J7859J7636j8864m546J5036J9126j5094j0141j9252j409p67j3996
28073B5372j3864k609N428O210K2151k4981l838J292N400m2503J082J1699j0228
28060a9389p165m613k536L1550J1529K1227K838p761j0275M537l4107k0659K8603
28047f221M974K228J1798K8491O150n020J7541N61l335k0295j1994L549k168M768
28033C1027l761l9395j8355R220K6593k983l434J6098j7880n276M341K5427L3173
28020E4795J6718J1730l871K97k8010k9058j9417j9108K3031j6173L318L2614
28008B6866Q766j2291j6604J5571r454j3564q71K7746L821M483j5363l711o403
27995H992K6998p507j7116l744j9514k8379K8678k0560l5408N548K9139K3124
$$ y = [47786, 39784, 57643, 75279, 56415, 51869, 66905, 86031, 70937, 60796, 41544, 40135, 39368, 25372, 11508, 8899, 14327, 20537, 42688, 17707, 13869, 15161, 20561, -21942, -20860, -9161, -19389, -26554, -31167, -33703, -2153, 9376, 30603, 33441, 25680, 15405, 19942, -14165, -34824, -6221, -1247, 981, 12779, 41270, 47420, 42400, 59941, 60502, 57167, 36872, 24878, 28427, 26259, 31027, 27266, -12129, -30484, -21264, 5329, 2346, -1088, 15010, -2870, -8146, -3805, 21622, 54795, 71513, 83243, 79372, 79669, 51659, 22601, 3184, -15924, 7107, -9066, -5748, 26866, 35632, 23341, 6737, 22308, 12854, -710, -1581, 26165, 29986, 34469, 19106, 15395, 8992, 35990, 28483, 11367, 7623, -11891, -40270, -11592, -32152, -67560, -62012, -32873, -9749]
27983i749Q33J2057J9897j90k4880R690P401k0856j2433l079Q966J436J1169K1809
27969B2071j2469O607O968P512p458m0948j0948R613J7971K8106P370k0548J5108
27956B8955J6138l3794j1660o488L416M973J4982N462j2189k7112k228K5834l2927
27943b6638J0945M4170q767j7793J3278r955L0503J3045p270j4684J0578M8086
27931H5498j5162j2992M923k7591j8459J2087j4245p049k662q898j9040o950J9354
27918a1186j1669m4313m608K0010j865J7814K7845j5421j013m315O506J0038n318
27905a7495J0389j5503O909K182l1539P487L859J151j4426k5238J9057J631j295
27892e2831J7019J4077K8347n650J1267K6250j8441j7259J1757r008k1675J8840
$$ y = [-9749, -8916, 3141, 23038, 22848, -2032, 7658, 15059, -5797, -18230, -21309, -12343, -10907, 262, 22071, 9602, 16209, 23177, 30689, 23231, -17717, -28665, -19052, -1081, 27025, 34395, 13847, 28955, 45093, 11299, -361, -6849, -3433, 1540, 16522, 21984, 9795, -17317, -19545, 6289, -26638, -15693, 28477, 19710, 1917, 15195, 5240, 35743, 48788, 41518, 26834, 37412, 85498, 70336, 57344, 62267, 34676, 16217, 28304, 14059, 7010, 4348, -4550, -23590, -30540, -11186, -22855, -67168, -71776, -51766, -53631, -35817, -7972, -23393, -24406, -28721, -22215, -12177, -17495, -7106, -22609, -15700, -13518, -45057, -37570, -33711, -32560, -46986, -72224, -53167, -51536, -52831, -35812, -21735, 6612, 962, 12229, 38479, 20038, 2779, 14536, 5528, -16147, 2693]
27880B693J0631K4926j0196q855J3790k441p175l2143k6023m426K9454K1508j7563
27867e820O072J0841K6517q412m0354p742J5418J8174J8106k1081p406J6102k6267
27854e852j9109J9054J4380J0786p261J411N929j4641k077J6702Q352k0032p2549
27841f4907J7353L6709P470j7051o396j0749k160J0628K3018j1372n194l075J4500
27828a1226J9981J971K1259m705j2844j19K8092J2123k1387k4764r94j6169j5640
27815b4422l790K3134j052j5848q770j1146J7568J6160J1136q468J1525K7897
27803C3924J2692l990k6287L525j5409l0766L689K9728J9388L209K5937l708k4497
27790B7435j8840n344p996N17j888J0236J185R174j9877N189N792N623j2491j1279
$$ y = [2693, 13324, 38250, 28054, 19199, 32989, 30548, 23373, -8770, -34793, -39219, -9765, 11743, -5820, 252, 11093, 37610, 29198, -11156, -18898, -3480, 14694, 32800, 11719, 4313, 20415, -5852, -24961, -5907, 8473, 19259, 11998, 13409, 19338, 4697, 2620, 19322, 27674, 7642, -64907, -47554, -10845, -3375, -20426, -26822, -37571, -39731, -29103, -6085, -17457, -22651, -25726, -11226, 8755, 10726, 31985, 27280, 14436, 14317, 42409, 54532, 33145, 8381, 7387, -8782, -24422, -28212, -5078, -6130, -21978, -30748, -41894, -24326, -8166, 2970, -5498, 6027, 33924, 46616, 42626, 16339, 19864, 4455, -26311, -22622, 7106, 26494, 29703, 55640, 51932, 27435, 8595, 3251, -4745, -4228, -6116, 4120, 5305, 14479, -5398, -209, 5583, 11206, -1285, -12564]
27776a2564l150m340k1311M651L3519R267j2548p58K4988M318o882N99j667j0042
27762D080J5108J3856N374p642n805J3823j4306j7483r103m660k3070k3310K6983
27749b6155K8520O637p914M682J1647k8582l6026j3080J3316J8060K5007J0510
27737F622k7909k3488J017K4009L6559J5650l22O062j8358o495L7741j188j2512
27724C7388k8823j9803l0666k1893R783K4053K3231l281j9381k5754R817Q218
27712c7111K069O191p592J8834N1814j1152m6908r031R459N688N355J4345J5981
27699A7942l2048j0951K2950O04k53j278J7826Q36L375J9255J0269J7732J0180
27686G6439j2568k1658k718J248J1079P162j830q843o523k0636j4286n32l764
$$ y = [-12564, -15714, -20054, -41365, -36714, -3195, 6072, -6476, -7234, 17754, 22072, 15190, 15789, 14122, 4080, 19188, 33044, 38418, 30776, 24971, 38794, 24488, 7005, -2098, -6758, -29828, -53138, -26155, 2365, 9002, 1088, 5770, 17417, -11165, -47191, -60271, -46955, -28895, -3888, 6622, -21287, -44775, -43758, -19749, 16810, 32460, 32138, 38200, 19842, 13347, 51088, 49900, 37388, 8565, -11238, -41904, -63797, -54014, -29961, -6730, -10011, -29392, -55146, -45329, -37111, -35042, -28851, -36443, -17609, 34205, 23053, -23855, -32886, -23427, -17739, -12384, 1961, 17942, -14106, -25057, -2107, -1503, -1756, -3034, 14792, 15628, 19003, 38258, 48527, 66259, 76439, 63871, 42213, 39495, 40743, 51822, 58984, 57154, 48311, 41788, 21152, 6866, 6334, 2570]
27673B570q978P382j0169L09j0882N930n329J4060K1579n147j5528J4652J3593
27660B4042N470O27j0054j5489J254K1001j1524j4507N811P059J4121J247k6894
27647B164n617n59r55k3195L087R250n798q083J4089L892L432n566J1667K6066
27633B3874L099k0159j7244N959n139j3003J8810J3147J7740N608J4541r854k73
27620C7106J2644J7807l2702j9994J1543j1021j8619o694q478l019K0322K0260
27608A9155r807m06M646J499L129l4077r707K1574J5370o366q378N520K075L926
27594H153K8778k10O122j7632k1723J285O970J5478Q694j7139j8031j4242j6152
27581b9649j1429r330K4660K4615J9311J2535o239k3380J62K0063R719k4431l031
$$ y = [2570, -6408, 974, -9195, -8886, -19768, -13838, -19167, -5107, 16472, 11325, -4203, 10449, 24042, 29512, 30139, 20085, 4596, 5850, 26851, 15327, 820, 6631, 13690, 27811, 29058, 2164, -3453, -4012, -4967, -28162, -25075, -15825, -21623, -29706, -15617, -11725, -8293, -13859, -2192, 23874, 26973, 6814, -10430, -4471, -9610, -22613, -3803, 9344, 27084, 32692, 47233, 37379, 37106, 49750, 67557, 34855, 14861, 26404, 15383, -3236, -9930, -18408, -21427, -1105, 19155, 9348, 8942, 13588, 15087, 18216, -15861, -25568, -3994, 11376, 5010, -3368, 2152, 4227, 8153, 36931, 36721, 42843, 25211, 3488, 4773, 11743, 27221, 35915, 18776, 745, -13497, -29649, -41078, -50408, -25748, -1133, 18178, 30713, 24474, 1094, 1256, 21319, 31038, 6607, 3576]
27568C576J0075L370r45J6936j1472k4200k130q71P10K4991j229k5644j6752k0626
27554d4211L7150L3165o860K190j116K3370n338k0410m6239J4604J2749K492J7196
27541A8742M582j0335J0351K070k5205L70K0062K0552k829m9052m5443j9192J4327
27528f1000M3449J6332j2901j5859K8878J2523J1431k3376k0165k162m166o638
27516c3654J7705K4153K4069q260r647j7200n0159j1536L9967O520k3060Q186
27504c2916L1564L7989k0019m0813K2445j1386N630P806M063J877j8559j486r195
27491b3000j3891J2877K5335k0065j7662J6068n241J9130K1656J4873N068r841
27479B5307k6483k5974k2956n40l311j3737J1349K6506l362j5335p689K8749K9351
$$ y = [3576, 13651, 17021, 16076, 33012, 21540, -2660, -4790, -5661, -4951, 20040, 18811, -6833, -23585, -44211, -7061, 26104, 19244, 21434, 20318, 43688, 38350, 17940, -28299, -13695, -946, 1546, 18742, 23324, 12989, 23340, 25410, 205, 575, 20637, 41189, 38360, -10692, -56135, -75327, -61000, -17551, -1219, -14120, -29979, -1101, 11422, 22853, -523, -20688, -22850, -27016, -33654, -15949, 8204, 32273, 24013, 14366, -2834, -52993, -64529, -24562, -18042, -41102, -32916, -1352, 36637, 16618, -24195, -1750, -13136, -7506, 300, 4363, 6240, -12319, -13805, -23000, -36891, -24014, 1321, -18744, -36406, -20338, -25579, -6449, 15207, 30080, 35148, 25307, -1176, -27150, -50106, -50646, -53957, -67694, -56345, -29839, -33201, -48536, -56225, -27476, 1875]
27466A875j5812q921j5136r566J5665M165J0392K1395J6238O079R242j6496k0822
27453a702M672L2236K2381K9363J941q900m1227j5188j233j4217Q037o594j4723
27440e154q951R96J9907J2509j638k3909j3032P557j561o935O933r558J2674n037
27426a5199K3133L5555J951j5996N247j5970J9411K6j2893l0552j4270r598l887
27413c3042j1696q634K5156M459R495K2976J0781N479L787p553J953k095k7912
27400f846P631J996j5201q117n765N294n624N250J948K314K5541K464j0967J4357
27386A4275l823l254J405J8350K1607K6631J7770K203j3284m2271j2994P410K5890
27373E9915m605j9960l087R999j0842m1892n068J7176k0331M041J395k0555L20
$$ y = [1875, -13937, -22858, -37994, -47560, -31895, -27730, -17338, 4057, 20295, 26374, 35616, 19120, -1702, 2970, 35206, 57587, 86950, 88891, 79991, 38764, 23576, 22343, 8126, 16163, 9569, -5154, -14105, -13109, 6798, 19307, 17669, -6240, -19272, -11715, -13276, -20211, -13278, -22836, -10162, -15199, 7934, 43489, 45440, 29444, 34691, 18721, 38132, 38158, 25265, -5287, -19557, -29155, -33042, -44738, -53372, -28216, -23757, -14262, 8714, 19495, 24974, 28761, 21208, 23161, 21066, -6846, 785, 2781, -12420, -20537, -26302, -21008, -26632, -21382, -19434, -17120, 8421, 10885, -82, 14275, 10452, 7198, 8603, 26953, 48560, 75191, 92961, 95164, 81880, 39609, 26615, 34025, 59915, 55310, 35350, 32263, 42262, 31420, -10472, -15540, 1636, -18695, -14654, -13259, -33814, -33494]
27360c3494L0570o772N735N304J9103j6376o609N492K7015J6870q574J9691k1522
27347C6433j9234N081n226m0976k3499J7555J3780J3893l344j1956L613p752j0281
27334c1913N380J3746J5135J8228n590n65p49R722J2944O552k918k0552j7099
27321B321L108k842l699j1811O802m038P735r192M44j1826k6715J9410L5456q110
27307b957L8904M370m583k9784p377P893j0019k4607J5937R004j3263Q955J292
27294f235L4661j2079j4014j034l6373j1552L732J858K048L564M2051P118k1304
27281g559J7945N709j0321m143K1867J0652l5985j7808Q101J4776L4090K7812
27269F5136l2441o76J0982r819k3667m340j0667J9067k1221j4376n48J3730J1840
$$ y = [-33494, -2924, -9696, -3961, 1343, 20446, 4070, -2539, 2953, 29968, 46838, 38264, 57955, 36433, 17199, 22280, 17054, -23922, -47421, -29866, -16086, -2193, -5537, -17493, -13880, -21632, -31913, -26533, -12787, 2348, 20576, 14986, 14421, 13672, 23394, 36338, 42890, 39972, 19420, 2321, 5429, 2587, -1112, -12923, -6121, -10159, -2424, -11616, -11172, -22998, -49713, -30303, 5153, -2957, 35947, 40317, 35734, 5950, -1427, 6466, -3553, -28160, -12223, -3219, -16482, -7527, -6235, 28426, 16347, 2333, 1299, -35074, -46626, -42894, -41036, -38988, -35424, 6627, 13745, -7559, 10386, 16095, 5774, 1631, 23498, 34150, -1835, -19643, -11542, 3234, 37324, 65136, 32695, 32019, 43001, 33182, 9515, 5175, -5492, 13575, -7646, -22022, -22570, -8840, 3000]
27256C000k74M232Q30m187k5559K553J0545J8243j9333r469L0954r936j01J2649
27242A4147m0978l0873L6478L6962N676M828j8903o359j1514m718K8668L3333
27230D6747j7373j4074K8693j6470m0855k5758K3811J1781O987K3537m680k6122
27218c776k2679j8576L1846j3865j9398J4022K1090J1273o715M256q468Q94o982
27205a7078J9648o547k0089j1742r416L065K2523L2201J4283Q802l65l907j4626
27192A6752n1181j5587R0K0133j3114K65l451K0254J1830k5795j2057o597R580
27179d8878Q36L2492K7732j489j3752l9184j1797R465N5015M2293k6205j9709
27167F819n146M777j1674j6886J8397k6831n674L2672L154j8188J6747J1359J4774
$$ y = [3000, 2726, 6958, 7788, 3601, -21958, -19405, -8860, 9383, -9950, -19419, 11535, 1599, 1498, 14147, -26831, -57704, -21226, 15736, 21412, 26240, 7337, 978, -10536, -15254, 13414, 46747, 29374, 15300, 43993, 27523, -13332, -39090, -15279, -3498, 3489, 27026, 22346, -3776, -26455, -45031, -13185, -27050, -46448, -32426, -11336, -63, -6778, -2522, -10990, -10096, -17078, 2570, -3977, -24066, -35808, -45224, -42159, -19636, 12565, 26848, 35650, 35285, 31378, 16752, -34429, -50016, -49926, -29793, -42907, -42642, -46093, -25839, -14009, -39804, -51861, -58458, -48878, -48042, -15550, 12182, 10693, -3059, -42243, -54040, -44575, 10440, 52733, 26528, 6819, 1673, 6450, -5224, -22110, -3713, -30544, -36218, -3546, -392, -18580, -1833, 9526, 24300]
27154B4300J8116J6127l588j2814j5218k1427j0489j9058q462J5669L3851L866
27142B0873j998n622j8571j5459O861K6323Q234k7083k362J4498k4486R307J8935
27129I450M725j8323L773k44j0094J3266Q167o370k1461j9093J945q333J967J2353
27115b8272r39O524M968p650j3468K5478K1132K5878n124k1632N016n988R679
27102A5602P340m834k6788J4183J8542O980l005l6930j5159j7458k4689k0133
27090h6349J4392M9698K8698O131K4131j26k5425l3526j5173Q745N0548M0530
27078F2274j6512l4283k7308m942K8821j3122O049q615l5230K980O669J0802J0886
27065a1531m032J0309N395j1616J2919M0J3249M953Q379P272M055p748k8810k6663
$$ y = [24300, 42416, 58543, 54955, 42141, 26923, 5496, -4993, -24051, -32513, -16844, 17007, 20873, 18875, 13253, -5318, -20777, -13916, 12407, 20641, -6442, -8804, 5694, -18792, -9485, 9450, 14175, -4148, -375, -619, -10713, 2553, 10720, 4350, -17111, -36204, -34259, -42592, -40625, -28272, -29211, -22687, -17719, -25369, -38837, -13359, 7773, 33651, 28527, 6895, 11911, 5923, 15602, 22942, 18108, -8680, 5503, 24045, 31025, 28020, -8910, -24069, -41527, -66216, -86349, -71957, -22259, 6439, 12570, 36701, 36575, 11150, -22376, -37549, -28804, 21744, 62274, 45762, 11479, -15829, -20771, 8050, -5072, 977, -7638, -42868, -39888, -33219, -22417, -11531, -15563, -5254, 141, -11475, 1444, 1484, 14733, 19686, 28065, 35337, 39392, 31644, 2834, -23829]
27051b3829k4238k7222J7285K6056J9638Q708N324j24J0090J130Q343q506j0023
27038B632j0755l83K25p537J0650J4884K1623M20J3386L52q601N411k4137j638
27024A6532k2367j7546R239p647n675J9181L2383k577j1611l998K268L0340J4104
27011E2626m8331l5046K4886n7K713j2600P046L815L8107N823j9161j5743K021
26998F099K1411l128k5335j5889k5211m038J169o616K4021P699K779M487P841
26985d711j150L969L263J3191J0975l0739n161j3584j2593K9228Q424J989m684
26972a583k651k4238o272p174K5188P200J7450N953M511O747l1336R434J8322
26959B1551K1081n60k3920j2665L655K570j2454J0023M483J58j162l2859o529
$$ y = [-23829, -48067, -75289, -58004, -31948, -12310, -3602, 1722, 1598, 11688, 12818, 21161, 12655, 2632, -8123, -8506, -8281, -15818, -5168, 9716, 31339, 31759, 45145, 45497, 36896, 42307, 18170, 16532, -5835, -23381, -14142, -21789, -27464, -8283, 24100, 21523, 9912, 5914, 8182, 38522, 52626, 4295, -30751, -5865, -5922, -3209, -15809, -8763, -4948, 33159, 38982, 19821, 4078, 6099, 27510, 24382, -953, -16842, -42053, -46091, -44922, -51538, -27517, -19818, -17039, -12552, -4711, -5861, -1892, 1371, 14562, 25537, -5202, -10363, -23947, -36540, -7312, 1112, 3101, -1583, -4234, -28472, -34744, -41918, -16730, -9530, 7920, 13873, 18384, 25131, -6205, 3229, 21551, 42632, 42072, 18152, 5487, 9142, 11712, -742, 9281, 13764, 13922, 12760, -20099, -26628]
26946b6628J6886m578J2525M0544O109m2350l756Q697R401j4108j102m622K6688
26933B3706J0366p707j5199o339j9069l0345r57L4175L0968K3074k2146k1971
26921a444J5143k0682l8021J2303M1625J0293P127R617Q228M11j6303j9205M679
26908A3771l4441j1292O114K085k83M2401j3754j2979L8232O750j321r886m404
26895B0993k0460j1573L148j799J157k1156J3013K7395J204J3027j2107j4919
26883b077l020J4157K233q740j5256j707n085J6431O589J9593O236n423k0566
26870C365n909J5928p822j7902j655Q925l141o121L639l719L080J3563O483J0924
26856A9638j5735k8489J5919j93k061K0129k3415J3639K4614j697R448j3521l2387
$$ y = [-26628, -9742, -14320, -1795, 38749, 44858, 2508, -1248, 7449, 16850, 2742, 1640, -2982, 23706, 34072, 26365, 11166, 4827, -14242, -44587, -45544, -11369, 19599, 42673, 20527, -1444, 13699, -6983, -45004, -32701, 8924, 19217, 26344, 35961, 44189, 44600, 28297, 9092, 13771, -20670, -31962, -25848, -23763, -24046, 18355, 4601, -8378, 29854, 36604, 35283, 25397, 20993, 533, -11040, -7892, -9691, -8534, -29690, -16677, 10718, 11922, 24949, 12842, -2077, -5097, 9060, 11293, 2553, -12703, -14410, -19495, -3064, 3525, 23118, 29354, 23931, 3365, -2544, 13384, 5562, -12340, -13995, -5070, -8211, -14332, -10693, -14412, -11332, 2231, 8714, 19638, 3903, -24586, -8667, -8860, -10921, 9208, -14207, -568, 24046, 22349, 31797, 18276, -14111]
26843a4111K0373K7604K551j6008q771o468j2845K5101K659n942j3536j0324K4109
26830A4392J5824j8943k1548j2107j62j5192K2160J8123J3448j829K056n289R206
26817B0139m118o717j8873j2089q415j1901l8648r487M2377L0689J1953M348K2707
26804B1965M323j8400j3664R196m897O627j1140J1668o989K2964j088N874J3261
26791C9700j6259o3776k9330K4907M0735J5478M475l8403l4700L3610M0495K2062
26779C8994j2171k1348j4461K238p101L5164K1681l6019k9641K5870J9645j6401
26767F450j5167j8076q047K9919K9826k27k7128p039K893K279m170L233k7518
26754c2772K5115Q290k1169j5528l5772L53K8345J08N074K7765K106J6343k686
$$ y = [-14111, 6262, 33866, 36417, 20409, 11638, 5170, -7675, 17426, 20085, 14143, 607, -9717, 14392, 30216, 11273, -10275, -22382, -22544, -37736, -15576, 2547, 15995, 14166, 16222, 10933, 20139, 16021, 9304, -9569, -21658, -30073, -41974, -80622, -90109, -47732, -17043, -5090, -742, 21965, 26288, 7888, -5776, 3420, -1477, 5150, -5990, 5678, -1311, 21653, 20565, 26439, 39700, 23441, -40335, -69665, -44758, -4023, 11455, 15930, -22473, -57173, -23563, 16932, 38994, 26823, 5475, -8986, -6748, -13849, 21315, 42996, 6977, -22664, 3206, 22851, 6450, -8717, -26793, -34840, -4921, 24905, 24678, -2450, -9489, -6596, -4317, -8487, -5254, -32772, -7657, 633, -20536, -36064, -71836, -71483, -43138, -43030, -37956, -10191, -8085, 8258, 5572]
26741E572k487r404K865N8780L1935O515k3886l7754r922o004J5538Q937q661
26728C2024j1442J3589l053p028l466J0985j9808l855L249n899O740J6605J6660
26715D5301j6806p464k5400M4R432J4209l217j2903q076R156j4135j5241O094
26702a9006J1545J7959j2433L326O687q469k36l8906l446K5843K082j1759K745
26689b4068k273J6743K168m0041m280L0634j26K3639K8796J5988l547j1874l0026
26676A733k1132J0467Q478P50j9758l850n776K6358Q287l8953q419K5323O662
26663i830j0127p370j810p141K6007K2266J3193M577j0949P5j8793p880j2073
26650a9855Q320J267l475K2564R274j697J6153r477J2276k3819k529j0254r770
$$ y = [5572, 3085, -6319, -3454, 55326, 87261, 93776, 69890, 32136, 22214, 16210, 31748, 40685, 32024, 20582, 34171, 31118, 24090, 20624, 31609, 11801, 7946, 11195, 5296, 12036, 28641, 45301, 28495, 21031, -4369, -4325, 5107, 19316, 16099, 3196, -4880, 4276, -9859, -25100, -19006, -7461, 10498, -1935, 1391, 8078, -391, -627, -39533, -42979, -17136, -15054, -26813, -24068, -26341, -9598, -7430, -47471, -51751, -21117, -21243, 2396, 31192, 47180, 43633, 31759, 1733, -19399, -8932, -454, 296, -19462, -23312, -29088, -2730, 5557, -33396, -41815, -16492, -9830, -19957, -27327, -29137, -36278, -10271, 11995, 25188, 29765, 18816, 18891, 98, -7782, -19855, -11535, -10268, -13743, 8821, 18095, 16398, 32551, 23074, 35350, 11531, 9002, -1252, -11022]
26637a1022q53j1612j828k1460o656L3024j504q348m0829Q736K9044L0230K0424
26624A7346p930l266K6747K844m573J1492k0847j5572Q126j9578q34j5115j6151
26611c7311J7433K4841O105k0128k1837l0020j5717J4695L8734K4039m194J0710
26599G350J3640j8686r585N450J7647K9462j1880k7386l69J3894P294J1953j7581
26586B1203m3100K5429q268l5626P392N0250R453k7272J818L4668O302j4663j0556
26573A7030k5002J9036J0409j4324j5098p400K499J7150M841j1864L55K445k2381
26560b2304o098j2703n679p113Q573J6243K5840R254j1776J0524J4346k0110l2073
26547c3076m126L361J8290J0347o503m071j1898k1144Q988L3122L4920M0484k8867
$$ y = [-11022, -11875, -23487, -25315, -46775, -53431, -20407, -21911, -30259, -71088, -62352, -33308, -3078, 17346, 9416, 6150, 32897, 35741, 31168, 42660, 21813, 6241, 14367, -5211, -6045, -21160, -37311, -19878, 4963, 11068, -9060, -30897, -60917, -76634, -61939, -23205, 834, -3360, 7350, 20990, 2304, -7281, -1831, 15816, 45278, 33398, 6012, 5643, 19537, 26831, 38784, 21203, -21897, 3532, -4736, -40362, -32970, 17280, 26733, -539, 1279, 35947, 42249, 27586, 17030, -7972, 11064, 21473, 7149, -7949, -15349, -12850, 4300, 9141, -2723, -2368, 77, -22304, -28402, -41105, -46784, -53897, -45324, -29081, -3241, 6013, -5763, 4761, 19107, -1003, -33076, -37202, -33841, -15551, -5204, -11707, -15778, -27676, -48820, -39832, -6710, 28210, 68694, 39827]
26534C9827k6608K0938j8216j6030J2974p073j252J605J010j618J4273k0263j5832
26521a6265J886j216J9257R293j5182J3154J7910k028o249j1920K267P55k0450
26508h788j3487k0420M967L3918J6891K5769K447l1304j70k6384j5776J1023K5595
26495D281K0202o082R736J8140L105K494n2527j9807L2101P023m029J8699R56
26482C4292j6206k8845m448L7083J0790K553j0330o924ON381k226r004J3561k5843
26468a60O029R124j4461j5233k2593k0944M4N569J1417K1346N1261N055l4887
26455A567j0234K97J4463O637K3058K8505O033k2664k8161k8285q137J0684J1527
26442E290P659k0828J0051J1915l545j6547r725N598k2336O657Q661n925J7341
$$ y = [39827, 13219, 34157, 15941, -89, 12885, 5812, 4560, 6165, 7175, 5557, 19830, -433, -16265, -14379, -15595, 3662, 12955, -2227, 10927, 28837, 26809, 20560, 8640, 10907, 11662, -8788, -22275, -42695, -37728, -3810, 13081, 38850, 41297, 9993, 9823, -16561, -32337, -21314, 4281, 24483, 18401, 28137, 46277, 49382, 51876, -651, -20458, 11643, 18666, 14637, 33336, 34292, 18086, -10759, -15207, 21876, 32666, 35219, 24889, 17965, 17971, 23352, 21126, 12122, 25683, -160, 5869, 14993, 532, -14701, -37294, -58238, -58194, -52625, -41208, -19862, 31399, 36454, 1567, -8667, -8370, 6093, 12730, 35788, 64293, 70326, 47662, 19501, -8784, -16921, -6237, 5290, 12949, -7879, 2172, 14087, 10542, -6005, -15730, -10132, -32468, -25811, -17150, -23075, -5734]
26429e734q434L769j849j0752M5339K8238k4148j9349o356P445k268K145K000
26416A0046k12j7630r298J4444K4902N777l2073j2755N636M29K786k097l1680
26403d1725l5102P317L3711K6548K3705J3018O879k1493q477k6204p861K6627
26391c057J8259P984q263M474j3355K1565O255r22m055p992r772o501K1589K6091
26377E2300l5084j2266m847M941m311N678M160O027j7910o65j4621M710m995M473
26363a2410p106J14k891J932r978J6778K1919J4770j0838K615L4504j8801l6655
26350f047j6024L2163q7K0025j2333L429R640j6033m0576m971N833K036J435P913
26336a3597K0273K4474M329k3160j332m7124o0065L375J7158L9513L7800O629
$$ y = [-5734, -14168, -10399, -12248, -23000, 22339, 50577, 26429, 7080, 724, 8169, 5901, 8046, 10046, 9834, -7796, -17094, -2650, 22252, 28029, -4044, -16799, -11163, -10734, -7948, -10045, -41725, -76827, -69510, -35799, -9251, 14454, 27472, 34351, 12858, 4381, -21823, -29684, -3057, 15202, 23186, 14923, 19397, 6042, 27607, 33862, 32940, 28885, 20893, 11121, 4620, 26209, 52300, 17216, 4950, 103, 5044, 733, 6411, 10571, 16598, -1312, -1977, -16598, -11888, -16883, -12410, -19516, -19402, -22293, -20361, -30339, -13561, 8358, 23128, 12290, 14905, 49409, 30608, -6047, -22071, 10092, 10005, 30030, 17697, 21126, 30766, 14733, -25843, -30814, -24981, -22945, -21510, -13597, 6676, 31150, 35479, 12319, 10987, -36137, -96202, -92827, -75669, -36156, 1644, 8273]
26324H273L5248L7873p718m2650l0020l705L391Q669k6854k7454M8487J3813k9318
26311a1965P90K1706j118N861R891j6420J7566K577l1576l595M34K1363L74j1188
26297D700m172N79J9563K4059k6487n043J3500J7969p400J405r572q206j928N457
26283B4424l0172k2036j9499K1733K7042J2183n89j2k9606J1697q596j4617j054
26270b9102j7910j268Q741K9507L21j1272j303j92j0870J4620Q232j6820K270
26257b5046Q43j2786J9088L5146J9020j3261k1617K530p220k0447J2623j6683
26245b7810p685P435k8781L1277K0622j1852R199J2358L681l322k6569M345K7835
26232A0733l596j4602k4566m914P060J6326J2593j7004o442M228L715j7806j8566
$$ y = [8273, 43521, 81394, 73676, 31026, 1006, -2699, 692, 9361, -17493, -44947, 3540, 17353, -11965, -11175, 10531, 9413, 15274, 25165, 8745, 26311, 28888, -2688, -6283, -5849, 15514, 15888, 4700, 528, 1107, 20670, 44729, 18242, 13199, 26699, 44668, 37268, 38673, 29101, 20895, 18967, 24424, -5748, -27784, -47283, -25550, 1492, 13675, 13086, 13074, -16532, -4835, -13431, -28048, -29102, -47012, -48280, -39539, -10032, -9711, -20983, -22286, -22478, -33348, -18728, -10496, -27316, -25046, -24203, -36989, -17901, 17245, 36265, 23004, 1387, 3917, -3303, -23750, -11127, -27810, -35495, -28060, -56841, -25564, -4942, -16794, -7595, 4763, 8444, 5122, -21447, -17102, 10733, 7137, -7465, -32031, -36945, -29885, -13559, -966, -17970, -24412, -20184, -16469, -34275, -52841]
26219e2841K0527K3319j0638k1707K4410K3090J705r901k0939N993R797N617K9670
26206B8102l704j5168j7778k6257R686M483p546j4068Q655K3971K7351k808K3719
26193C8638k2626K4840O782m821M213j50j6695k0218M674j1586j3336K156j471
26180i600Q248q49k3267o948J2022M37K5963J0577M547M543n054j2918P855l2463
26166a6907r145O035L1256J9562j9945k2821O911L910K7960j6869j8471p964J1146
26153e342K3658R473k055k435r908j1364r818l2283j0453J0939M0909R225j4057
26140c511p439n945J125K1707K1223j3520K478K843n303J6239J5934j3542o22
26127C1667J1820k6601r096K8223K6680j5562k1575J3243K95m186l6427q467R618
$$ y = [-52841, -32314, -8995, -19633, -41340, -16930, 6160, 7865, -2036, -22975, -16982, -7185, -1568, 28102, 24398, 9230, -8548, -34805, -25119, -20636, -28182, -42250, -33595, -9624, 17727, 14919, 38638, 16012, 40852, 47634, 42813, 47026, 46876, 30181, 9963, 14637, 3051, -10285, -8129, -9600, -1352, -2201, -25468, -32416, -20394, -19957, 6006, 16583, 21130, 25673, 20619, 7701, 15556, -16907, -26052, -20017, 11239, 30801, 10856, -11965, -5054, -1144, 26816, 9947, -8524, -16488, -5342, 18316, 27789, 25734, 23299, 13391, 2027, -7791, -40074, -50527, -39588, 1321, 10546, -3511, -10950, -16895, -15770, 5937, 27160, 13640, 16118, 18961, 13658, 29897, 45831, 32289, 31667, 43487, 16886, 7790, 36013, 62693, 47131, 25556, 38799, 39094, 34908, -1519, -9986, -368]
26114c68J0479n68j6109n072J0248j7067P239K1319J1303m082j1524K1507k4291
26101C014k6469L5228K4635j6781J2501k17K77L472J649r667L5304j3966m4333
26088D647j0629J3341M686J6311r257J547j0672q840L2401O372k9738k4250n423
26075a9504J055n30O975j3719p097J5339P003P232J0418Q751J0292k974k7679
26062d438k2146M064P934J2700N001j0087j330j064l450L9134j9912k4947q937
26049b7478J4580n993m007j068M37k8648j0922K2117K0401M3699L112O699j281
26036C1648N585J5938J086k9307l315o725k7320J8334L1416K0806k7181l1223
26024b58k1437O233L831R867o145k8334j9295J167L4473J5118O81o742J1198k669
$$ y = [-368, 10111, 9543, -6566, -11638, -1390, -18457, -11218, 10101, 21404, 17322, 5798, 27305, 3014, -23455, 11773, 36408, 19627, 32128, 31911, 32188, 35660, 37309, 27642, 62946, 48980, 4647, -5982, 7359, 12045, 28356, 19099, 20646, 9974, 1134, 33535, 39907, 10169, -14081, -19504, -18449, -18979, -12004, -25723, -32820, -17481, -10478, -3246, 7172, 15923, 26215, 23241, -4438, -26584, -22520, -14586, -1886, 3115, -6972, -8302, -9366, -12816, 26318, 6406, -18541, -27478, -12898, -18891, -22898, -23966, -23529, -52177, -63099, -40982, -20581, 23118, 26230, 32929, 31648, 37233, 53171, 54257, 24950, 21635, 14910, -12410, 5924, 37340, 58146, 30965, -258, -21695, -15462, -11631, -1764, -7909, -36243, -55538, -54371, -19898, -4780, -4099, -10841, 357, -2312]
26010b312m755j7761j851J5778j4342N718K9606O744r49J7601p018l0039J5915
25997A2335L1431L730l0614k7991m0614L186L0202Q325k112J0252p922j4515K4646
25984C39l20p812n319j0795K1909K4827J0196j0875m7820l8657K7325L5612j1128
25971a2518k0331l0949Q238L9140P398j877N837k0212l8655k502J7924K2428J7605
25958h474p883J6468J5576K9192Q901J0334k1436m0869k2208J692K923j1334K0960
25945f158O189k192K789j0240j8953M007L098j2144M5230J0824j4029j3391O924
25932A954Q986n926K3895m430j4614k3267R165P372J9542J3637j4077l2957R673
25919a047J171k0150n931N215J9491K834J845J2055P932M921L392j6646k6075
$$ y = [-2312, -7067, -24828, -26679, -10901, -25243, -19525, 10081, 16825, 15876, 33477, 26459, -3580, 12335, 43766, 47496, 16882, -11109, -51723, -48537, -18335, -10010, -12122, -1870, -9792, -24307, 339, 19, -7793, -13112, -23907, -1998, 22829, 33025, 22150, -25670, -64327, -37002, -1390, -12518, -32849, -63798, -55560, -16420, -9022, -10899, -5062, -25274, -63929, -66431, -48507, -26079, -8474, -16357, 111, 15687, 44879, 53780, 64114, 42678, 1809, -20399, -18707, -15784, -27118, -6158, 31, -2161, 628, -9612, -28565, -24558, -21460, -33604, 11626, 22450, 8421, -4970, 1954, 10940, 5014, 28909, 24479, 9865, -13402, -4237, 3135, 22677, 36314, 22237, -10720, -1047, 124, -20026, -25957, -20742, -1251, 1583, 3428, 15483, 23415, 28336, 31728, 15082, -10993]
25906a0993J9193J0767n030k5714l4575J2414L1961J8851J2547p608j7854P792
25894A1751L059p117o132q441n221j5984m949L9902L7118j0659j3147n068K1923
25881C7035j254j0035j90K4393j3791M532j4216m0849q420O242q305j2044Q509
25868b8393K2352K7993M986m211j3487o40J4041n525J289R324r384n553j0489
25855B303K30J6739q890k2278J5073K0757m339K1404Q245P082l523q368k0535
25842B3900j3685l8743l648J6490J8199R359r594O941l8867n828P60o570j3100
25829e4386J1274L040Q930J2413M408Q439k4026m735K8473M150M895l263J5711
25816A5323l8251q567M92m601L3139K1464l710k1244J9823R429k6418L962K445
$$ y = [-10993, 8200, 18967, 13937, -11777, -46352, -33938, -1977, 16874, 29421, 21813, 3959, 11751, 14810, 7693, 1561, -6880, -12101, -28085, -33034, 6868, 43986, 33327, 20180, 15112, 37035, 35781, 25746, 25556, 49949, 36158, 40690, 26474, -14375, -22795, -16553, -24858, -36902, -28393, -6041, 21952, 26938, 22727, 9240, 8600, 22641, 17116, 18405, 27729, 18345, 12792, 2303, 2533, 19272, 10382, -11896, 3177, 23934, 19595, 40999, 49244, 56326, 52803, 44435, 23900, 10215, -28528, -32176, -15686, 2513, 11872, 2278, 9219, -29648, -35476, -34716, -41286, -54386, -43112, -40072, -31142, -18729, -14321, -5882, -29908, -34643, -6170, -2020, 2875, -388, 15323, -22928, -31495, -31003, -35604, -2465, 18999, 15289, -5955, 13868, 23297, -3121, 841, 3286]
25803C286r535p537K158L647J2736M288O626j7919j8078j2990K917j667J1707
25790b0361J553J535K8663J0655K2730O586l00j183q721J1429k957k2953k4492
25777B184k0107J4393K3817j094k4455q259Q061q855J4169P408l1081k1733Q136
25764c7416J7366M136j2587K0189N944M686J3884M738j093k2467j4930j728M390
25751a4888P868j1396o598O087l3423J0227M6925J0465j2331J7909p790k0972
25739g917j848J6817n422m9190l90L7896n856o905J1096J5698P540J1535K8751
25726E1805j2106J1837K2833m0215m5178j8408J9034m957j1910K7728J4788o353
25714H898K6632k849N968J0939M21j2215p572j3409j2797J4134J4877J1588j4744
$$ y = [3286, -6249, -13786, -11628, -7981, 4755, 9043, 15669, -2250, -20328, -33318, -30401, -32068, -20361, -18808, -17273, 11390, 22045, 44775, 51361, 51061, 49878, 41157, 52586, 49629, 26676, 2184, -17923, -3530, 20287, 19193, -5262, -13521, -5460, -14315, -146, 7262, -23819, -45552, -37416, -20050, -15914, -28501, -8312, -2368, 2318, 16202, 20940, 19847, -2620, -17550, -19278, -14888, -7020, -18416, -25014, -18927, -52350, -42123, 4802, 15267, 2936, 20845, 13055, -7917, -9765, 7052, 1630, -47560, -47950, -10054, -15910, -22815, -11719, 3979, 11519, 23054, 51805, 39699, 51536, 74369, 34154, -11024, -29432, -10398, -15355, -27265, 463, 15251, 8898, 35530, 32681, 38649, 49588, 50009, 37794, 30222, 16813, 4016, 18150, 33027, 44615, 29871]
25701B9871l5430l5952K1336K6026l292k9750j9357P584P467r469L6250L3145
25689B8429j1714j6127j0624j589K3890J3550Q258o019L186l8511k3351L0385
25677b37J8248O939k8471p360K0063L4677K284j7676j4796J5616l50p987J0716
25664C1666J3862J1755n432m397j033J3287m1160o898q091o382N770j6863J0194
25651c722k810j9845P805p404j345R254p39L3299j7989j7641M088J4068j3252
25638a6233k115L4275L665J9407L0444r594l9695j564l758M352Q870Q936j0972
25625B6018k3349m606M183p634k7634M745K2561P424K5586P270j6245k3087J88
25612d580R966o311o349N018j7241P341O333K2808J0199r350N811j9302j669K438
$$ y = [29871, -5559, -41511, -20175, 5851, 2559, -27191, -46548, -38964, -31497, -40966, -4716, 28429, 16715, 588, -10036, -11625, 12265, 25815, 34073, 28054, 31240, -7271, -30622, -237, 18011, 24950, -3521, -10881, 9182, 43859, 46143, 28467, 13671, 29287, 28937, 20950, 31666, 45528, 57283, 51851, 47454, 46421, 59708, 18548, 11650, 3559, -2823, 2947, -13916, -3722, -6532, -26377, -18572, -25976, -27321, -18067, -18806, 14493, -3496, -21137, -17049, -2981, -16233, -18348, 15927, 19592, 38999, 69443, 59849, 20154, 18590, 14832, 19184, 28054, 36990, 26018, 2669, -1937, 2246, -5388, -33022, -28277, -5716, 1708, 27294, 34564, 18319, -4768, -4580, 5386, -925, -7274, -2256, -19497, -12156, -5823, 16985, 27184, 17834, 23645, 4343, 2674, 5112]
25598E112j0205j4949q370j6082M817K1343O662J5827K438l1785j0520J9889L027
25585a2796K0026L0675P113l588k7503J602P970K3555J934n149k182j9731j1604
25572A0322P599R891r136j4427j4426J7866j3555l0471j048j9845J093K3890J2565
25559a9682Q84N495J2359K5098J9907P341j5707j5514n4l987p545L303N01o424
25545E975Q740o143j9545J7939j4164R144J0219m462m888Q276M437n54k1233R119
25531B860L850j6545j1862j1929J0218R189J0778l183J8643R698K3334j3667n0765
25518a9381l1155m431J3752m757J2953J885K8874J7259K0582J424p872j6326j3176
25505c69K1104J4975j0291k2069J7625P342M919k994j4416k0993k656L2638l393
$$ y = [5112, -5093, -20042, -28412, -44494, -39677, -18334, -11672, 4155, 6593, -25192, -35712, -15823, -12796, 7230, 37905, 45018, 41430, 13927, 15529, 23499, 47054, 48988, 43839, 41657, 21926, 10322, 17921, 27812, 18676, 4249, -10177, 7689, -5866, -36337, -37385, -57230, -56137, -32247, -19682, -18798, -13303, -944, 24154, 44061, 51402, 35695, 20181, 20127, 16140, 8595, 11898, 12399, 5975, 14715, 8572, -10973, 6966, -7198, 1946, 12165, 7703, 2815, 11091, 15528, 14974, -6259, 2860, 6710, -9835, -21697, -33626, -23408, -14219, -3441, -6624, 12019, 21717, 45051, 31384, -19381, -50536, -54967, -41215, -45972, -33019, -31134, -2260, 14999, 35581, 37005, 29133, 12807, -369, 20735, 35710, 25419, 3350, 20975, 28317, 33236, 30242, 15826, -5167, -7823, 24815, 21422]
25492B1422r255q944L121J4704Q538j9710n021j4396j8541q359J1056K0189K5
25479e171M295j8215K1845L3804J5282k3044j1377N000L15o59P197J9728o885
25466D2115m2264O399l473J172l6006K9837K3079j2378k5432j7460K2859J3192
25454A640K377J894J9175L1154p95q387L660k3346l8015m808P731J1806P076j1517
25440c55j068l512N921j1910p660N989J2276j6267k3942J8126J9744J177J2852
25427A1371p144K0784l805l3729K422J8001q109k0442j5383J6226Q284l0644p696
25414d9864J5433K6442p57J6239J6312j3775l8562J7591M4228L659R315K864l5278
25401A3847j3995j7839r359j139J0528M6175L5113j9406j0147r439k0479p1J3837
$$ y = [21422, 12167, 3223, 6344, 21048, 29586, 9876, 4855, -9541, -28082, -36441, -25385, -5196, -5171, -876, -19091, 2754, 36558, 51840, 28796, 17419, 22419, 22734, 22075, 29272, 49000, 42115, -149, 6250, 2777, 3949, -32057, -2220, 20859, 8481, -16951, -34411, -11552, 1640, 4017, 5911, 25086, 56240, 55445, 47058, 50718, 27372, -10643, -15451, -7720, 4086, 11162, -355, -1423, -4935, 986, -10924, -18584, -12595, -319, -16586, -40528, -22402, -2658, -1481, 11371, 4227, 25011, 21206, -12523, -10101, 7900, -209, -20651, -36034, -19808, -11524, -42168, -49864, -34431, -7989, -8746, 7493, 23805, 10030, -28532, -10941, 33287, 36946, 46261, 49125, 13847, -148, -17987, -27346, -28485, -17957, 28218, 63331, 43925, 33778, 24339, 3860, 3789, 17626]
25388A7626l4631J0004R562j354P010P60j7985q591L4515m483k3567K745r927
25375a8316K0323m79j962l254k9982M521K4146K237L9440K8211J2887j0423K1412
25362H8761M059l3068j3991j6472l5281K0073j1254j609K1622J7186j1948j6506
25350A1572K1156J7600j1855k7927m49J2727K1380K4599k9314l1241K371r354
25338A265n050J2150m413k8111k1432j2964K0020L2451J0761j0242p57J5695m240
25325E133K9934O769j7213k7110o308J9193J1944n063m522j4501j5398N479J0598
25312a065K7479O552J6373K1841j0117l882j2139j4839l7306J7568j0711j2915
25300a3161k9240j7830P880K8786k510O123J0716Q406j2605K590R100L011j2778
$$ y = [17626, -17005, -7001, 2561, 1207, 8217, 8977, -9008, -17599, 16916, 12433, -11134, -8389, -18316, 2007, 1528, -434, -3688, -33670, -29149, -5003, -2766, 36674, 64885, 77772, 67349, 88761, 92820, 59752, 45761, 29289, -5992, 14081, 2827, 1218, 22840, 40026, 28078, 11572, 32728, 50328, 38473, 10546, 10097, 22824, 44204, 68803, 39489, 8248, 10619, 1265, -3785, 8365, 3952, -24159, -45591, -58555, -38535, -6084, 4677, -5565, -6322, 9373, 5133, 35067, 41836, 24623, -2487, -8795, 10398, 22342, 17279, 12757, -1744, -17142, -11663, -1065, 26414, 32966, 49339, 71180, 61063, 57181, 45042, 30203, -7103, 10465, -246, -13161, -42401, -60231, -52351, -23565, -26075, -19952, -9236, -830, -13435, -10845, -1745, 1266, -11512]
25287a1512k256j4693M428K3414J2295K371J867M43j2755j3675l4824m2282J5959
25274g1220L4765J5871q25O604j3182N959j6939j210r52R123L0911M5174L3867
25261G7946l0037m4274L697n817P132m341j9330K3922L093l04j1386L426J0382
25248A4109R628J0562L126k820J3694m14l1184k2175J4988K8048J430k5844N79
25235A3727K1521j3163k7209n161p149O538j4886K2746J3994j2798J068J667j36
25222G59o067J1584J4519q869P564Q479p154r828k778J2037J3666k0443j6554
25209c085J711J8461j067Q881J4465k0911l6974p023M964K8448p246l6803j0896
25196d7075L970N934L7781O574l1031J5637L685J8577J8467j7337j3246L752j4275
$$ y = [-11512, -13768, -28461, -24033, -619, 11676, 14047, 15914, 16357, 3602, -10073, -44897, -87179, -71220, -36455, -20584, -21409, -14805, -27987, -22028, -38967, -40177, -41129, -32006, -1095, 44079, 77946, 47909, 3635, 7332, 1515, 8647, 4306, -15024, 8898, 11991, 11687, 301, 3727, 14109, 23737, 34299, 37425, 34605, 48299, 47885, 16701, -5474, 9514, 37562, 38992, 13148, 13727, 35248, 22085, -5124, -10285, -17434, -10896, -25782, -3036, 10958, -1840, -772, 895, 759, -5308, 6276, 20795, 11926, 19490, 27969, 20815, 10987, 8209, 20246, 33912, 13469, -3085, -1374, 17087, 16020, 24901, 39366, 18455, -18519, -25542, -20578, 7870, 624, -36179, -47075, -43105, -37171, 610, 7184, -23847, -8210, -4525, 14052, 32519, 15182, 1936, 5688, -8587]
25183h587k0132m481j1659K5831J6151K1966K5365L94j8385j6354o789r58q757
25170f395J1917J5293l205J0594j155Q240k9749q426l324k0183o100K3843L7311
25157B8661J3134j0996j4732L056N415n896L4463r743k0592j9342K499J3538l485
25144A5980j5372K0264k0431k1567L548J1112p429K6904J3824k4959l730J6514
25132A4658j6343K1674K4606p234O543N93m1669l3178r581K1318m597q308R793
25119b1725K6349J6593L2850l482j749O975j8125k2952N106L0151j2445j2288
25107B5258K296n906J0695k8767m3428j6921J6808L6001K3681J0950k9902j3143
25095a2378j4877J7152j1553j3602j1463J020O274K0142j2488k936L0K081L9073
$$ y = [-8587, -28719, -33200, -44859, -19028, -2877, 19089, 44454, 44848, 26463, 10109, 3320, 2362, -6395, 5522, 20815, 17610, 28204, 27049, 35289, 5540, -2886, -6210, -26393, -32493, -8650, 28661, 41795, 30799, 16067, 19123, 24538, 18642, 53105, 43362, 22770, 3428, 5927, 19465, 15980, 608, 20872, 441, -21126, -17578, -6466, -13895, 13009, 26833, 1874, -1856, 14658, -1685, 19989, 44595, 37361, 43904, 44497, 2828, -30350, -39931, -18613, -23210, -31518, -21725, 4624, 21217, 54067, 50585, 48836, 55811, 37686, 14734, 19840, 49991, 37546, 25258, 27554, 21648, 32343, 3576, -39852, -56773, -39965, -3964, 19717, 30667, 765, -12378, -27255, -10103, -21656, -35258, -46721, -45701, -39427, -19285, -31773, -34709, -34679, -32598, 6475]
25082F475k117o547J7739j8589q328j9103L665K4485K3094K3809Q040k530j4301
25069C5792j3859j6989m0565n1720k527M0206K7388k6736p169L3878K5957r280
25057e624j4368R594o775o674j250Q841J0936J5617p548K543l149J7316P105j3255
25043A3309j3834P02j4012R224L0832R649j5134M432j4223o938q752n023J0962
25030A194J0366k1825M6988Q661k500j8429m6367k8759k1882l878L7055K2216
25018a7160J1112k3381J9744K0829k5421j2926J5826k033J7529K7651j1962j5687
25006D121O307J5400N67j6997l220N367R882J3924J834j8548m791j2656N609j095
24992E704j7201J448j6441M283p35K6786O187L167j335j7864K85K1816J0797J9819
$$ y = [6475, 4358, -2189, 15550, -3039, -11367, -30470, -26805, -2320, 20774, 44583, 52623, 50093, 35792, 21933, 4944, -35621, -87341, -89868, -49662, -22274, -49010, -56179, -22301, 3656, -5624, -19992, -10398, -17173, -23847, -25097, -16256, -5320, 10297, 2749, 5292, 2143, 19459, 26564, 13309, -525, 177, -13835, -4611, 26221, 35870, 20736, 25168, 10945, 4007, -4745, -9768, 1194, 11560, -10265, 36723, 45384, 42884, 24455, -21912, -50671, -72553, -76431, -39376, -17160, -6048, -29429, -9685, 11144, -14277, -27203, -11377, -13410, 4119, 31770, 19808, 4121, 10428, 25828, 26395, 9398, 6178, 11545, 21427, 35351, 37185, 18637, 13846, 1190, 6799, 5704, -11497, -10049, -26490, -22207, -22942, 3844, 10031, 13198, 11863, -6001, -5716, 16100, 26897, 46716]
24978D6716p344j3048l966j8041n743K317j7328J6171K1501J4313P161j77J669
24965D4201n799N507l784m6608k6430J2264J9406L947M297J8539K1957K763J1307
24952F1567r111m954k7763l737j8788N289J823J1468K9141P401j2543k7739j6893
24939d839j7550p630J5101j0106K767M355L5664O754l2160j8902L0681J4624K1877
24926D0636r965j7940N460O269m46n836j2670P156K5528O950j5233l642r522k536
24912A4209J0349O148j1501k3356k9019M922J1558L0246j2265k1542k9361N157
24900d4455K5846J3608J14J194J0173l130k5969o591J5356Q162R292L586l5764
24887b8578j4624o970R297K6699N0551j8690m8801n370J5348K9182J0545k00L697
$$ y = [46716, 39372, 26324, 22358, 4317, -1426, 891, -16437, -266, 21235, 35548, 42709, 42532, 44201, 38402, 43909, 40125, -6483, -32913, -20649, -1243, 2704, 7001, 25540, 47497, 50260, 61567, 52456, 47502, 19739, 16002, -2786, 2503, 4326, 15794, 44935, 52336, 39793, 12054, -4839, -22389, -30019, -14918, -25024, -22257, -17902, 17762, 24516, -7644, -26546, 4135, 18759, 40636, 30671, 12731, 18191, 24460, 24014, 18178, 5508, 12664, 38192, 45142, 29909, 26267, 16745, 14209, 24558, 30706, 19205, -4151, -33170, -28248, -16690, 13556, 1291, -20251, -49612, -44455, -18609, -5001, -4887, -3693, 6480, 3350, -22619, -29210, -13854, -5692, 3600, 7186, -28578, -43202, -50172, -40875, -14176, 36375, 17685, -31116, -36486, -21138, 8044, 18589, 18389, 22086]
24874B2086j6699k4407O527N449j1829j2655J396J0811q43q147J2464P061K263
24861f523p81m163l880K0919R83P941L626l1502J0535O936j9752j9075K1427Q302
24847e007Q715n691J1051j2725j4853k7030l138L0978J2971N664m670m195j4465
24834b2395J3780K0608j817l1193n16j0009P350K4252K1787j1776M304p25j231
24821A2419j6627k177j6945J0117N010j8608R440L2524k245j6365J3368j2058
24809b147j2158J0161R31J2895K141n789J9929P471Q534r679N183P458l959k3155
24795A7816l7846j1029J3342n32j184k0417j6514K393L1567P464J8118n295l904
24782f021j4186K798J8759l105j2989J8053J7582j6662n437j8072J6577p846q053
$$ y = [22086, 5387, -19020, -12493, -7044, -18873, -31528, -30132, -19321, -20164, -28311, -15847, -8786, -6523, -7304, -11467, -15347, 5572, 6555, 14496, 18122, -13380, -2845, 4091, -15661, -34736, -13309, -5007, 3708, -1983, 9068, -3657, -18510, -45540, -48678, -17700, -4729, 935, -3735, -7930, -22395, -8615, 11993, 10176, -21017, -21533, -31542, -24192, 60, 21847, 10071, 14375, 13650, 12419, -4208, -6385, -23330, -13213, -8203, -26811, -17371, 15153, 12908, -3457, 9911, -2147, -14305, -4144, -3213, 9682, 11823, 6034, 25963, 33434, 41968, 32289, 37472, 44930, 40971, 17816, -20030, -31059, -17717, -18249, -19433, -39850, -56364, -53971, -22404, -14940, 3178, -2117, -6021, -20207, -17409, 1350, -1755, -14744, 3309, 20891, 4229, -1208, -19280, -2703, -10549, -18602]
24769a8602J6341m646J0985j3442j5358J4464Q822K1967P547l2686k5217L655
24757b6170j84n709Q364M041P264K3307P763q824j6723j5246o183j7385J0945
24744c4740M8768J8975l4025k517J6488M696n85k3091j5040j5963M626j0285J0608
24731c2085K4136p902m044m492J4550L0709J2801K1271j6834k0018r214J1704
24719B0582R126K0393k2277k7293j4549m869j1394k515L2385J7345o931j8292
24707h289Q014N11n164K335K3731l7053j286J0875r363n707J8718m949p951o785
24693b2363J8519P686L654K9410o697j7705l342J788n070O256j0061j2463p732
24680a8120J2485k783q174k0938n772L3090r394j8144j789N721j8516R215J4905
$$ y = [-18602, -2261, -6907, 4078, -9364, -24722, -10258, -1436, 20531, 28078, -4608, -29825, -26170, -26354, -32063, -23699, -19658, -12394, 10913, 18676, 9852, -6871, -22117, -28300, -45685, -34740, 14028, 33003, -1022, -3539, 12949, 17645, 17060, -6031, -21071, -37034, -32408, -42693, -32085, -7949, -15851, -19895, -24387, -9837, 20872, 33673, 54944, 38110, 18092, 8878, 20582, 29708, 50101, 27824, 531, -14018, -18887, -30281, -32796, -411, 16934, 10003, -8289, -275, 236, -4928, -2593, 21138, -15915, -17201, -6326, -15689, -21396, -2678, -7627, -15578, -22363, -3844, 3842, 7496, 36906, 30209, 12504, 9162, 10950, 5880, 12136, 2075, -10388, -18120, -5635, -8418, -16592, -37530, -43302, -10212, -19606, -37750, -39539, -33818, -52334, -43119, -28214]
24667b8214K891j4085M594J3637K247R596J5223l8905r215J8480K1436l2864R217
24654b5962P247j0747J8626L9306k8232k3577j0921p927J3450J3596J2070J0801
24642G730K5362j0965k7799m143R478J4042J2239k3171O704K7783j2729l8560
24630a4029J111L8677Q125k0525l6299j4096J128m636L4032l520j2082P936j171
24617a5349j7123o471K1125K9301q944k3846j84J6254K1074J1578j9069k0961
24605a2615p502J6895K1140M036N637M173k5037j0722K183J2950L715j7451j8920
24592b1518q764K0868r895O762K3759k800M178R293k2716N023k3965j0248J6557
24579a3466M8100l692j4098l5699k7042M2329R327j760Q7j6419J1520J9866O626
$$ y = [-28214, -25323, -39408, -34814, -21177, -18930, -9334, 5889, -33016, -42231, -23751, -2315, -35179, -25962, -18715, -29462, -10836, 28470, 238, -23339, -34260, -42187, -28737, -15141, -3071, 7730, 33092, 22127, -5672, -9815, -337, 13705, 25944, 2773, 9477, 37260, 24531, -14029, -12918, 25759, 33884, 13359, -22940, -37036, -35908, -40544, -6512, -10032, -22114, -14178, -15349, -32472, -38943, -17818, 11483, 2539, -21307, -21491, -5237, 15837, 27415, 8346, -12615, -20117, -3222, 17918, 21954, 27591, 31764, 6727, -3995, -1812, 11138, 14853, -2598, -21518, -30282, -9414, -19309, -12547, 11212, 8412, 12590, 21883, -833, 4190, -19775, -30023, -13466, 34634, 30942, 16844, -18855, -45897, -3568, 5759, 3999, 4086, -12333, -813, 19053, 25679]
24566B5679j7936m769j6822r123n397j3500M3086J0548j175n064j9828j2994J292
24553b6003J9438j2203r511K0573r684j7610m965q04j1035o945J8349J9465K8588
24540G653j9470l0992k2939J1712K2544R505l015K882J3346J5762j5254j3671
24528b1937r532P324L9306J0307k8934M008K3143l7k9025J1358j6572k0047J7595
24515a3043K5104P782o229k3205O440Q569j134J4260K4101k8462j1440J0782l2351
24502a8826k6830J9640K639q120K2033L6313R31k5417j487N212Q580j4227j2602
24489a2161K1500N958Q903M894j9408l2847k1435J6676J3198O920O701p415J8218
24476I702L702j1296j9174P959J4940J4190l032j7162J816j3944j5841J405m868
$$ y = [25679, 7743, 2974, -13848, -22971, -28368, -41868, 1218, 11766, 10591, 5527, -14301, -27295, -26003, -6565, -18768, -28279, -7706, -17390, -35000, -39965, -40769, -51804, -58749, -40400, -20935, 7653, -11817, -42809, -65748, -54036, -31492, -21987, -25002, -22120, -8774, 6988, -8266, -21937, -31469, -24145, 15161, 25468, -3466, 542, 23685, 23648, -5377, 5981, -10591, -30638, -13043, 12061, 19843, 13614, -9591, -3151, 5418, 4284, 18544, 42645, 14183, 2743, 13525, -18826, -45656, -26016, -23377, -31497, -9464, 26849, 27780, 2363, 876, 6088, 14668, 441, -12161, 9339, 15297, 24200, 29094, 9686, -23161, -44596, -27920, -14722, -7802, -1101, -8516, 9702, 13404, 2108, -17066, -9107, 5833, 20023, 16991, -171, 1645, -12299, -28140, -26735, -31603]
24463c1603j8435J5791J2010L620J798j5648r735j6143L365K5976K3341J9168
24451A3505k8408K073J4360k9416N436M555N962K729J2192P192k5244j2404J5765
24438a1703K4591r841M29J6576m593K131M438l8568j7504K6247J3127q903j3054
24425a6627J6605J4196j4209Q333P49N572K0036j5808k5757k8453j7353K4852
24413b7864j187Q838Q258R513p598K7870O613J3093l2107n5144L954J5932j2742
24400d2571j0694K0190J7750m150q821L222o287N995J1154j1528k5935l56K12
24387e1819O872J8753J0824K6629j3170M6p834j674k0610N904K9862J5658J2741
24374C2182l504k5965J694K4452j938J5942l622j3261j532j652n403j9189Q227
$$ y = [-31603, -50038, -34247, -22237, -18617, -16819, -32467, -42202, -58345, -54980, -29004, -5663, 13505, -14903, -12830, 1530, -27886, -22450, -17895, -11933, -9204, 2988, 10180, -15064, -27468, -11703, 12888, 3047, 3476, 20052, 15459, 17590, 22028, -16540, -34044, -7797, 5330, -3573, -16627, -22, 14174, -35, 8298, 9047, 14619, 34655, 18847, -6910, -35363, -52716, -27864, -29051, -20213, -11955, -2442, -10040, 17830, 24443, 37536, 5429, -49715, -45761, -29829, -42571, -53265, -33075, -15325, -19475, -28296, -25074, -31361, -25366, -14212, -25740, -51675, -52031, -51819, -44947, -26194, -15370, 11259, -1911, -1865, -9699, -11373, -31983, -26079, 3783, 19441, 32182, 28678, 2713, 4407, 28859, 26921, 42863, 39241, 25980, 24448, 22796, 17393, -1796, 6431]
24361F431K6893r813o108k5524k7499N701J6914K0136O167p942j227J7159k5306
24348d018j3558O934j0558k124O67p477j6830j3905J9229K0499L837l782j2444
24335c3530J2728J6869J8488j3022q022l351J3265L632M604K1853p539j8870N825
24322A2930J2422k5908o524M941j3660j2876q820R932J9230J6820j8930K2852
24310A2409J3478j6409j7129k1888k0591K3888K4579K150m346M796P87q112q391
24297a4779j3273L875l145j3972K1521K4292l504n498R005k3436k7684L2378k572
24284a6792j4725J7425J6740J9531j7944p874o82l6164j3193L1447K3563p960
24272f628k207k2965K1108j126j6572o449O53k892R653O505k9970O409J9534L0013
$$ y = [6431, 33324, 23511, 17403, -8121, -35620, -29919, -13005, 7131, 13298, 5356, 4129, 21288, -4018, -17576, -10642, -21200, -23324, -22657, -30134, -46964, -60869, -41640, -21141, -17304, -21086, -33530, -20802, -3933, 14555, 1533, -6489, -9840, 3425, 7057, 11661, 33514, 25975, 7105, 12930, 25352, -556, -7080, -2139, -15799, -28675, -37495, -27563, -8333, 8487, -10443, 12409, 25887, 9478, -7651, -29539, -50130, -26242, -1663, 487, -3859, 937, 1724, -6388, -14779, -28052, -24177, -27322, -41294, -19773, 4519, 1015, -4483, 4522, -18914, -46598, -14220, -16792, -31517, -14092, 2648, 22179, 4235, -3639, -4321, -40485, -53678, -22231, 1332, -6628, -8835, -31800, -10692, -11818, -28390, -34839, -34186, -37078, -27425, -20920, -50890, -44481, -24947, 5066]
24258E066K3616K2389k1947j6540k9507l604j4657j165j3716k5439L442K1184
24246e0878n169J7594O010p786K039J6145O394M626O108L5147R815o626l969k446
24232B7004j6793p400j7868l0350J0926J0173p40J1841J8990j047r94M745J7317
24219B5804j4794k1555j0360j6419O635K453q302P10O824R332J6069m723j9465
24206b7791L4M380K1780O31O611J3162j5923K433J8279M796k3301k2205K6725
24193I611L2206p226l4758m1705n379K5876n474j3536O806M2352J8241j0768k1185
24180d939k8949q344k3983r550J9927M2159K4139P905j2652m097K465j9317j1855
24167b7091l396o16j1441n308K4276J9391j5217k678k773P960k1057j5348r239
$$ y = [5066, 28682, 51071, 29124, 12584, -16923, -20527, -35184, -36349, -50065, -75504, -72062, -50878, -56047, -38453, -32443, -40229, -38190, -22045, -15651, -11025, -4917, 30230, 40045, 33419, 29450, 27004, 10211, 2811, -15057, -45407, -34481, -24308, -25048, -13207, 5783, 4736, 3742, 8487, 25804, 11010, -10545, -20905, -37324, -30689, -28236, -36538, -35828, -29004, -19672, -3603, -8326, -27791, -27757, -23377, -1597, -966, 5645, 18807, 2884, 5317, 23596, 28392, 5091, -17114, 9611, 41817, 34591, -167, -41872, -47251, -21375, -26849, -40385, -33579, 8773, 27014, 16246, -4939, -33888, -42232, -66215, -75765, -55838, -13679, 10460, 18365, 5713, 1616, 4081, -15236, -27091, -30487, -31103, -42544, -47852, -23576, -4185, -19402, -22080, -24853, -16893, -37950, -53298, -62537]
24154f2537L5359o730K975J293K0438J8587N0396k865j8052j80J886m5473l2250
24141c7153K357J7314r863J962J5915J0141K394n217j5799J9013K3588J93l0849
24128f004J5211J59j0583r703k297K2096j992j1367m78M825k226J8185O133k0334
24114A625m923J0867J2250l275o340k6373k1108j3838l177J9882l83j1132M411
24101d1514R010J4887K1873n344J3574O868J6014K6584k2791K690n797Q935r973
24088C5016j8606j6632o369o626J0184K6082j7684l0240j0037Q597M187J0389
24076a1739n222L2841J36j0481j5374l026l1769l923N782Q55J1774J5582J7708
24063C144j682J13L2108Q588j275k9949l7893k3474J4667Q896J6675K4684j0471
$$ y = [-62537, -27178, -33908, -30933, -29640, -9202, 9385, 59781, 56916, 38864, 38684, 40570, -4903, -37153, -34796, -17482, -27345, -25383, -9468, 673, 3067, -2150, -17949, 1064, 24652, 24845, -6004, 9207, 9366, -1217, -10920, -13217, 8879, 6887, -4480, -4958, -133, -2359, 15826, 21959, 1625, -3298, 7569, 19819, 16544, 10204, -16169, -37277, -51115, -54292, -34410, -34793, -45925, -41514, -32504, -17617, 4256, -1088, 12486, 19354, 35368, 61952, 39161, 41851, 36054, 44989, 35016, 16410, -222, -6591, -13217, -3033, 23049, 5365, -24875, -34912, -26315, -22128, -11739, -16961, 15880, 16016, 5535, -9839, -12865, -44634, -48557, -42775, -41920, -30146, -14564, 3144, 1462, 1575, 33683, 42271, 40996, 11047, -26846, -50320, -35653, -26757, -10082, 14602, 4131]
24050D131L078j572l8400j6884J8257j279Q858J9798l09K759j5673p116J2224
24037a2128j4657J1415K3011M437M907j7360j1484J9567J8059K5290j6310m0691
24025e944j3675P720Q786L145n235M258J1744j9417K3593J8368K054o4487n6135
24012h5225L1505L4503J4130N81K949L398j22j3846j1967n412J7649J9358P651
23999A5152j1870o899k554j2875l6856J7114J8484j3512j0113J2191J9172K7974
23987A5408j5776P602J3718K636K2699k3076l5664j7314K0707J6963k2696l0488
23975d5281k174J1395J3525M7570k415j7587j7753k2649q94J4360J6112K3483
23963A7692l265k4999j745n920K4752K2668j8597k8978r789J7948q302l7243k0800
$$ y = [4131, 7209, 5637, -32763, -49647, -31390, -32669, -23811, -4013, -4322, -1563, -17236, -24352, -12128, -26785, -15370, 7641, 12078, 16985, -375, -11859, 7708, 25767, 51057, 34747, -5944, -19619, -11899, -3113, 32, -5203, -945, 10799, -8618, 14975, 33343, 35397, -29090, -85225, -53720, -19217, -5087, -4506, -1557, 1841, 1719, -12127, -24094, -29506, -11857, 7501, 15152, 3282, -3617, -6171, -19046, -55902, -38788, -20304, -33816, -43929, -31738, -12566, 15408, -368, 7234, 20952, 23588, 46287, 23211, -12453, -29767, -9060, 7903, -14793, -45281, -47455, -36060, -22535, 25035, 22620, 5033, -12720, -35369, -36263, -21903, -5791, 17692, 14427, -10572, -12317, -18237, 6515, 29183, 10586, -18392, -28181, -10233, -18535, -55778, -76578]
23950g6578J7462L8760J4564P510j9152n854K0005k5722M876L1149m673j5770
23938a3423m895q825J8566L0981L5570q249j4316o602J3590P85k5761l2550k7131
23925d2260L316J215J061K371J8543R970j4888r671j1470J611P99J0803p414l410
23911c9424l810K1582K479J030n575j2904k4238J8750J3370j4748j385L0840K1073
23898G040q808k0574j4330j1231q364J037K2956K6910R018P078J8747j2558j0002
23885F919J0156k3756m93r994Q222O888j930J2150q771l191l742n733j538L875
23871a0938O753L2070J0737k122k4272m3746l6545K2197p50L9130J4154K274J8634
23858B7576j3449j3357j3182J425K1316K3719J0336k634o071k6506l2382L827
$$ y = [-76578, -59116, -20356, -5792, 1718, -17434, -23288, -3283, -29005, -24129, 7020, 2347, -13423, -18318, -27143, -8577, 22404, 57974, 49725, 35409, 28807, 42397, 43182, 17421, -15129, -42260, -38944, -37729, -36668, -34297, -15754, -5784, -20672, -30343, -41813, -40202, -39403, -28600, -36014, -39424, -43234, -21652, -19173, -18143, -23718, -36622, -60860, -42110, -28740, -43488, -44873, -14033, 7040, -1768, -22342, -36672, -47903, -56267, -55230, -32274, -5364, 3654, 10732, 29479, 16921, 6919, 17075, -6681, -7174, -17168, -8946, -2058, -3988, 8162, -609, -3800, -7542, -13275, -14813, -10938, -4185, 27885, 38622, 36500, 12228, -31518, -68063, -45866, -46616, -7486, 6668, 8942, 27576, 14127, 770, -12412, -10987, 10329, 34048, 44384, 41750, 35679, 9173, -23209, -19382]
23846a9382J8048N712r782j3164J267K721k260K7135N734m501j9151j3561K7371
23833F187M1987j4868l2443o234l66l323Q913J603j1040k6812P258N660j6338
23820c9816J1045J9300j0727n817j5695O273K2480n886j9076q965J231R404k982
23807c9231o939J6763L1435J2286q872j5828J3169J4692m346Q148R366P616k5331
23794A2928j4681K190J3575J7866L681j3947j8496n51K2724j5273m00J7500O91
23781B7807j0372r506n966J8954K1690k064k5966k2624l645J2735J2502k671r475
23768A399j3716R252R787L6662N57j1462j0960n1633J1181K8212K3399m480k3102
23755E096q948j67K1276n729J2979r87j5485j8478J0381J5683K0299k286k5497
$$ y = [-19382, -1334, 4378, -5404, -18568, -17301, -14580, -16840, 10295, 16029, 11528, -7623, -21184, 6187, 48174, 33306, 863, -5371, -5737, -9060, -147, 1456, -9584, -36396, -29138, -23478, -39816, -28771, -9471, -20198, -26015, -41710, -35437, -12957, -18843, -37919, -46884, -45653, -36249, -39231, -46170, -29407, 2028, 14314, 5442, -10386, 2783, 17475, 13129, 21277, 30643, 38259, 12928, -1753, 437, 14012, 31878, 35559, 21612, 3116, 2565, 25289, 10016, 9616, 27116, 27807, 17435, 7929, 1963, 20917, 42607, 40543, 14577, -8047, -11692, 1043, 13545, 10874, 1399, -12317, -3065, 6722, 43384, 43941, 32479, 21519, -30114, -18933, 9279, 32678, 28198, 5096, -3852, -4019, 17257, 11528, 24507, 23520, 8035, -10443, -62, 15621, 35920, 33634, 8137]
23742H137k2717N362l145J0868Q667J0349P674k6524j1644J3679K694l706l8540
23729c8846j0465R06k1571J7360K6019J1925k5289q565K6692K962K940K1329M686
23716A0083j6687k3621N00J2170K5008J0355O335m4278j8924O525K8690L6852
23704C3008j8629k8318j1134j8371Q845j885J0921L9920K3259L280m2239j7614
23692a8957j553R185J6670m380K1967nr485j4999J7149R632k0621J4715M5178
23679F4496J9621k8176n0477j740j2001J3743J0714j1043M2335O908p806k5519
23667B1055j907j0398j7665M762K1964K2645k3487l1206Q983J6605k2171n710
23655a6530k059p889J6003M539K4413J4298k1055m381J5325J0911J7642j5762
$$ y = [8137, -14580, -9218, -12363, -1495, 7172, 17521, 25195, -1329, -12973, 706, 3400, -306, -38846, -49311, -48405, -69976, -52616, -26597, -14672, -39961, -48526, -21834, -18872, -15932, 5397, 10083, -6604, -30225, -29725, -17555, 7453, 17808, 24143, -20135, -39059, -32534, -3844, 33008, 14379, -13939, -25073, -43444, -34599, -36484, -25563, 14357, 37616, 40896, -1343, -18957, -20510, -11325, 5345, 965, 22932, 22927, 13442, -1557, 15592, 25224, 4603, 19318, 64496, 84117, 55941, 5464, 3724, -8277, 5466, 16180, 5137, 47472, 54380, 46574, 21055, 19148, 8750, -8915, -4153, 17811, 40456, 16969, -14237, -5254, 11351, -10820, -16530, -18589, -26478, -10475, -5936, 18477, 32775, 11720, 7339, 22664, 33575, 51217, 35455]
23643C5455J6939n241j0130N499J125m3017J0060N715J4146k438J807j1363O886
23630B5443p65j1784k980j7526o732K6798J3973J1084r102J629j7364j5994R497
23617F177N680k390R866J6612J3879J341L026m83Q304J949k2296M639J6749K5231
23603H8284M9738N6279O1031R5520J29313J88852L70775N78790N03863K88102
23593B410547J3354j08774N7774J00704q9598l87709n91948m98248l05279j55705
23583D45118r5969p2383m9170p8058m5516j3477o454m898J1155N395q928r576
23571G7239m43j367j9761P518J7051n441K027l1744j4533K3002l4121k2191O029
23558C265J3064j3279j9393j7825L7087K9271J8881K5661j4644n171k162j1413
$$ y = [35455, 52394, 47153, 37023, 42522, 43647, 630, 10690, 16405, 30551, 28113, 29920, 18557, 25443, 24678, 12894, 9914, -7612, -14344, 12454, 26427, 37511, 28409, 30038, 12674, -3320, 6177, 11857, 9467, 19333, 35945, 49824, 51165, 54191, 53708, 62012, 63961, 41665, 46304, 63053, 88284, 138022, 194301, 255332, 350852, 480165, 669017, 1039792, 1618582, 2122445, 2410547, 2423901, 2315127, 2372901, 2473605, 2384007, 1996298, 1404350, 906102, 600823, 445118, 349149, 276766, 227596, 149538, 104022, 90545, 84091, 79193, 90348, 95743, 86815, 77239, 76796, 75429, 55668, 63186, 80237, 74796, 76823, 45079, 30546, 53548, 19427, -2764, 3265, 16329, 3050, -16343, -34168, 2919, 32190, 51071, 76732, 62088, 56917, 54755, 43342]
23546D3342J4757j433k5625r185M5480K6341l932n4098k2555n260j6724J0563
23534A671M5853J2391J0332p85j7175j2190K5243j1484l6699j5630L3320j2759
23522B2088l0784n129L6202K5992n807k865p969j7150k7493K988k919k5801k910
23509d1557J7578N925K3137j659K3981r441q69l1399l2001l4518P559L0746j1786
23496e4304j6675J6201K9974M3115j329m102o604j2313K7605q595l1116j2406
23484c0549K6148J629k0637J0630K2722K837K4515J3615k9959n4296j9772K2723
23472c0394o016J1847J5238j5254M482M7360M8282k7200k3205L945j3591N321
23460B0815o652r032j9966j3619l522n68J6908m84j872K2273K4394k4323k3263
$$ y = [43342, 58099, 56666, 31041, 21856, 67336, 93677, 89745, 35647, 13092, 7832, -8892, 1671, 47524, 59915, 70247, 69462, 52287, 40097, 65340, 53856, 17157, 1527, 34847, 22088, -8696, -13825, 22377, 48369, 42562, 39697, 31728, 14578, -12915, -9927, -12846, -38647, -41557, -23979, -18054, 5083, 3424, 27405, 17964, 17095, -14304, -46305, -80823, -73264, -42518, -54304, -70979, -54778, -24804, 18311, 16982, 12880, 6276, -6037, 21568, 12973, -18143, -30549, -4401, -2772, -23409, -12779, 9943, 12780, 37295, 50910, 20951, -33345, -53117, -30394, -36410, -24563, -9325, -24579, -20097, 27263, 75545, 48345, 25140, 29085, 15494, 20815, 14163, 5131, -14835, -28454, -31976, -32544, -15636, -16120, -17992, 4281, 28675, 4352, -18911]
23447a8911J9992p271k1367J5106L2980j543m370O016M370j1146n063m08k4732
23434a6347o802J6212k494J1517Q667J8671j7660k742p501k058J255j5370m9313
23421f3965K0595L1761K3271j1622L951r238j0127J7537j1572k6268p663k314
23409d5654J7638j0055j8036J3903L0017K6566j048j4976l1278m309J0701j9611
23397d6142J0979P149j1417J3494j1748J1774L61j7376j4143K093K4791N732k3875
23384d8328N897J8203J2415r079J9956J3333l1610J6539K407N943p319O817k132
23371C042j5193j613M4973L995J325j2299r699o015l238l442K4894K962k8893
23358G99j8175K7707n775q091J0980j0168k033k2575j2701P319O185m94J1958
$$ y = [-18911, 1081, -6190, -27557, -12451, 20529, 18986, 14616, 20632, 25002, 13856, 8793, 8385, -16347, -23149, -6937, -9431, 2086, 10753, 29424, 11764, 9022, 1521, -537, 718, -14652, -63965, -43370, -11609, 11662, 40, 3991, -5247, -15374, 2163, -9409, -35677, -43340, -45654, -28016, -38071, -56107, -42204, -12187, 14379, 13331, -1645, -32923, -37232, -26531, -46142, -35163, -28014, -39431, -25937, -37685, -25911, -25550, -42926, -57069, -54976, -30185, -24453, -48328, -42431, -24228, -11813, -20892, -936, 12397, -19213, -2674, -267, 5676, -1643, 5174, 3042, -12151, -13764, 31209, 35204, 36529, 24230, 14531, 8516, 5278, 1836, 26730, 29692, 799, -17376, 10331, 4556, -3535, 7445, -2723, -4756, -27331, -40032, -32713, -26528, -27022, -15064]
23345a5064J0280j5976K1906M193j663J9730K7283J7661j2866k8847l5325r867
23333a8555o248J6732q672K4590R910M471k9152k0540m535j1747L2651K0505j
23320I409K76o549J469L173J3748L644j0585K93L8462j6779j9127j430K1028j6738
23306B0294R309l0882l2105J6316K3334Q998O331k2493q450K4158J0411R726k41
23293C4706L1599R293K4851J3517M896L291L9273K5355R798M463J0194K0433L8846
23280B70515j990l0195j3083r57k1442K083L1287J0454K101O321j2402k7669m8150
23267A66873l7017J122k0341l0562J2883p846o567N768J8912p34k0291N734J337
23254H9271P257j4415N225k3527j4892M934J319J5842r562Q363o335R32k8217
$$ y = [-15064, -4784, -20760, 1146, 5339, 3676, 23406, 50689, 68350, 55484, 26637, -8688, -18555, -24803, -8071, -16743, 7847, 17757, 22228, -6924, -27464, -31999, -43746, -11095, 9410, 9409, 9685, 3136, 4605, 7778, 21526, 25170, 14585, 14878, 53340, 36561, 17434, 16004, 37032, 20294, 29603, -1279, -33384, -17068, 6266, 15264, 21595, -898, -9348, 14810, 25221, 34947, 34706, 66305, 75598, 100449, 113966, 118862, 122153, 161426, 186781, 196579, 201042, 211236, 231669, 270515, 268525, 238330, 225247, 224290, 202848, 204931, 236218, 246672, 248773, 255094, 242692, 215023, 166873, 129856, 130978, 110637, 80075, 92958, 85112, 78545, 84313, 103225, 102491, 82200, 87934, 89271, 96528, 82113, 87338, 63811, 48919, 53853, 55172, 71014, 61452, 69815, 63480, 64412, 36195]
23241C6195j616k5413k7116m710j0304o059J4068J7154n227j5543R541L341K2813
23228G124N266k7130J1939K4204J0468N981k2766k1665K3177N0889L8973J3121
23216A19581k2371m068N550K9238L7220P580k149K7389L3540n603k0884m5687
23204A59336j2547K1629Q187j7243n799k3373j7285j5900q028Q009k2465j4797
23192E9724M616K923q392j5210N908L984O348M1979K8826P751K384K2431O120
23179A69392l7282j2763j6831l5489k7418P059l8866j8073K2610L9382K9135J5670
23167I6526J8644M652J2503J7210r644j4695L0181M294K3274M3240M9739O0128
23155C36052L7536K1364K4046K1086K7339N164L6334j0523k9868p563j7027l5578
$$ y = [36195, 34579, 9166, -17950, -22660, -32964, -39023, -24955, -7801, -13028, -28571, -19030, -15689, 7124, 12390, -14740, -2801, 21403, 31871, 37852, 15086, -6579, 16598, 67487, 106460, 119581, 97210, 93142, 98692, 127930, 165150, 172730, 170581, 197970, 231510, 225907, 205023, 159336, 146789, 168418, 176605, 159362, 153563, 130190, 112905, 97005, 88977, 96986, 74521, 59724, 64340, 67263, 58871, 43661, 49569, 53553, 59901, 101880, 130706, 138457, 140841, 163272, 169392, 132110, 119347, 102516, 67027, 39609, 46668, 7802, -10271, 12339, 51721, 80856, 96526, 115170, 119822, 132325, 149535, 139891, 125196, 155377, 159671, 182945, 226185, 275924, 336052, 373588, 394952, 418998, 440084, 467423, 472587, 508921, 498398, 468530, 460967, 443940, 408362]
23143D08362p0658j7542k1720k6209j7233j3748k7889l4185r743K1472L4647J6424
23131B41978K0548n739J218K8705K0282n720m8N910m633q583N143r058n0141m7653
23117A92209J3490M0370K2687J3341R690k2515p313m750J6676L208J5791M5234
23105C38118L1506L9180J35916K18232L42093N20125O37063M74248J58897q0772
23095B814606r6336R9790K3959j98975m43852n97758m62318k46053j33927o5781
23085F93355o3o467k327j3393j5634k3494O281M4239L9711L2826q752K3999L2953
23072H03234O8111J00136N7449K8605N9358N2085Q3938R2076M7415K5071K2616
23061A440094N2349O5583Q2811J14039J06961J26201J43140J80546K16035K30116
$$ y = [408362, 337704, 320162, 298442, 272233, 255000, 241252, 213363, 179178, 169435, 190907, 225554, 241978, 262526, 256787, 258005, 286710, 306992, 301272, 301224, 307134, 302501, 293918, 299061, 290003, 239862, 192209, 205699, 246069, 268756, 282097, 291787, 269272, 261959, 257209, 273885, 277093, 292884, 338118, 369624, 408804, 544720, 762952, 1105045, 1625170, 2262233, 2736481, 2895378, 2814606, 2718270, 2818060, 2842019, 2643044, 2199192, 1601434, 1139116, 893063, 759136, 693355, 693292, 686825, 684498, 671105, 655471, 631977, 638258, 682497, 722208, 755034, 746282, 770281, 803234, 871345, 971481, 1028930, 1057535, 1116893, 1168978, 1252916, 1344992, 1392407, 1417478, 1440094, 1492443, 1558026, 1640837, 1754876, 1861837, 1988038, 2131178, 2311724, 2527759, 2757875]
23051B757875K32805J82442J65584K04295K43162K92153L37456M10328M77015
23042E303115N45033O20164P32215Q90461J104037J333880J595126J987396K604688
23033A6716115L353121M206282N487895P759499J1822732J9285823L2691889N6587657
23025A57911013R1870769J05784965O7519061J8926092j6896521j0338304K2384776
23018D37161851M841097m0481637q9113730j05956712p3928900m1362877k4226453
23011F6932639j5167312j0219445p548809n927187m864920l806099k834392k190930
23003A4373545j761944j446112j219701r98145q67693p62433o45271n81383n02791
22994E588072m77323m48738l75682l44544k46501j83970j73870j55591j44903
$$ y = [2757875, 2990680, 3173122, 3338706, 3543001, 3786163, 4078316, 4415772, 4826100, 5303115, 5848148, 6468312, 7200527, 8090988, 9195025, 10528905, 12124031, 14111427, 16716115, 20069236, 24275518, 29763413, 37522912, 49345644, 68631467, 101323356, 157911013, 249781782, 355566747, 423085808, 442011900, 425115379, 414777075, 437161851, 442002948, 401521311, 312407581, 206450869, 132521969, 91159092, 66932639, 51765327, 41545882, 33997073, 28069886, 23204966, 19398867, 16564475, 14373545, 12611601, 11165489, 9945788, 8947643, 8079950, 7317517, 6672246, 6090863, 5588072, 5110749, 4662011, 4286329, 3941785, 3695284, 3511314, 3337444, 3181853, 3036950]
22985C036950j46284j16985j40252j42210j61046j54932q4563o2045o0872m7775
22975A919986n6715k1053l7831n6157o1736q3341r8825n9635m4701l0784k8619
22964A340589m2562n5112j5057k5047l5328J943l8693m2947k8022p90L1166M1765
22952A131905M1582J22103L02037M86796N81059L47730J10556j30577q8623J56013
22942C060581L5893k38675m87927n72473l62491k06682j47752r0043q4759n6857
22932H48815n5295m5290n4398k8454k1347m4680l9232q399L520r090k5091m8036
22920D73023n6809n0705m2620Q073R762q353n504q656J3376K9254Q352l9413L638
22907C33418L1894J245R243Q555L1253N5892J2782j0055L4948L0668P00J6933
$$ y = [3036950, 2890666, 2773681, 2633429, 2491219, 2330173, 2175241, 2090678, 2028633, 1967761, 1919986, 1863271, 1842218, 1804387, 1748230, 1686494, 1603153, 1504328, 1444693, 1399992, 1369208, 1340589, 1298027, 1242915, 1227858, 1202811, 1167483, 1169426, 1130733, 1087786, 1059764, 1058974, 1090140, 1131905, 1173487, 1295590, 1597627, 2084423, 2665482, 3013212, 3123768, 2993191, 2904568, 3060581, 3096474, 2857799, 2369872, 1797399, 1434908, 1228226, 1080474, 990431, 905672, 848815, 793520, 748230, 693832, 665378, 644031, 599351, 560119, 551720, 555240, 546150, 521059, 473023, 416214, 365509, 322889, 330962, 340724, 332371, 326867, 318211, 331587, 360841, 369193, 329780, 333418, 365312, 366557, 375800, 384355, 415608, 471500, 484282, 474227, 509175, 539843, 540543, 557476]
22895E57476n337m139j9257k1034J2468k5383l6157r842q45l2542n4822n3080
22883C07506q780K0486j7726j5259K7335L485l1018l8760j0716J9313L1204j973
22871B85097K5j0837j4071k660j2433r019m071n378k0726m82J2m5881p872q05
22857A50899r282j0970o407j58M115p210K6785L3793K7638j3220l4203m1697m584
22844A15499L008k2062l2591p579O549n988j6578j6246n829M553o065q449k0284
22831a2062O684K3951J6179L2489K7886J5367M5451q517k7552o059J4280L1553
22819A59650J0870K530m80L032M1143K6472j4982r185k0656j7351M089O352M102
22806A95586k9095J195j9922k1116J929K2495j4828k4494j2758j6210j0225q39
$$ y = [557476, 552139, 548000, 528743, 507709, 520177, 494794, 458637, 448795, 447950, 415408, 360586, 307506, 298726, 319212, 301486, 286227, 313562, 317047, 286029, 247269, 236553, 255866, 287070, 285097, 285122, 274285, 260214, 257554, 245121, 236102, 232031, 226653, 205927, 205445, 205457, 159576, 151704, 150899, 141617, 130647, 124240, 124082, 128197, 120987, 147772, 181565, 209203, 195983, 161780, 120083, 115499, 118507, 96445, 63854, 56275, 62824, 56836, 40258, 24012, 18183, 22736, 16671, 8222, -12062, -5378, 18573, 34752, 67241, 95127, 110494, 155945, 147428, 119876, 113817, 128097, 159650, 170520, 173050, 172570, 175602, 216745, 243217, 228235, 219050, 198394, 181043, 185132, 191484, 195586, 166491, 167686, 147764, 126648, 128577, 151072, 136244, 111750, 98992, 82782, 72557, 71718]
22794G1718j8460J3138J4023J3021j2029k3798l6041j593K1501O709k7419K5542
22782D6312K7630K3829J743L3982Q263j7018l2665m344J0553Q721k4460l268N393
22769H4671R087j8771k1583o263j2673J4615J458J2365l505j2906o461K68J0410
22756E0712m976L275p455J8144j7634r384N089Q707M8243K3519K9467k2038j6305
22743A09364J2419J1809k2838j9469k0700j8345k3393R301J5051Q03J3081Q698
22731G5781n379K329j4574r684j7595p041J1609j8894k952m65k597J2612m978
22718A8172r435J0940J8962L2763J1432k844p109l4691j4817o08l2172O432J8874
22705A5899n782J959M054K7529N830j2173j1145K595J6391J2258j2604k7473k3641
$$ y = [71718, 53258, 66396, 80419, 93440, 81411, 57613, 21572, 19979, 41480, 48189, 20770, 46312, 73942, 97771, 99514, 133496, 141759, 124741, 92076, 87732, 98285, 107006, 82546, 79278, 84671, 93758, 74987, 53404, 47141, 34468, 49083, 50541, 62906, 59401, 46495, 40034, 40302, 50712, 45736, 49011, 41556, 59700, 42066, 32682, 37771, 46478, 94721, 118240, 147707, 125669, 109364, 121783, 133592, 110754, 91285, 70585, 52240, 28847, 38148, 53199, 54002, 67083, 75781, 70402, 72731, 58157, 48473, 30878, 23837, 35446, 16552, 13600, 13135, 10538, 23150, 18172, 8737, 19677, 38639, 71402, 82834, 79990, 72881, 38190, 23373, 22765, -9407, -2975, 15899, 10117, 12076, 16130, 43659, 49489, 37316, 26171, 28766, 45157, 57415, 44811, 17338, -6303]
22692f303k1265L06K0242M1369J1090R150l8569M329J6525K407J1582L009m199
22679D9673J3992k039k1094J699r416j4359J013M0516l0222k9635m435J4520L4934
22666D5147K716K589K9009k847l4250j6108Q169J3565k2689j0126R93R656k6343
22653e19q984j0309K4598J4291P750k705J1251p92j1511l5089K7655K4617o105
22640C4148P057J6507q378k9813k4370J5225K48M433M285l5037M893K1692P142
22627A8032j5956j630M2345K6559o077O173l5319j3199M1415o010k2771J34j0389
22614B3307j4832k3474j1201N703J2364K5885N754j0196q011o856J972J7966L1431
22601D9812K6016M56o999r852l479J0925J0097N45k9476n0080m2782k268M1024
$$ y = [-6303, -27568, -27262, -7020, 34349, 45439, 54589, 16020, 20349, 36874, 39281, 50863, 53872, 49673, 63665, 61626, 40532, 42231, 32815, 18456, 19469, 59985, 29763, 128, -4307, 10213, 45147, 47863, 50452, 79461, 76614, 42364, 26256, 34425, 47990, 25301, 15175, 16168, 25824, -519, -9503, -19812, 4786, 19077, 26827, 24122, 35373, 34581, 23070, -12019, 15636, 40253, 34148, 41205, 57712, 49334, 19521, -4849, 10376, 10624, 15057, 19342, -15695, -10802, 10890, 18032, 2076, 446, 42791, 69350, 63273, 69446, 34127, 20928, 62343, 56333, 33562, 33696, 23307, 8475, -14999, -26200, -20497, -8133, 17752, 23506, 13310, 5299, -1557, 415, 18381, 49812, 75828, 76284, 69285, 59433, 55954, 66879, 76976, 77521, 48045, -2035, -44817, -47085, -6061]
22588f061K5124R346J8607J0730j7657J1459j838r99j9554j3623J454q655K144
22575A0477j9945J3723O129j8202M0911K8602n753l907r277j4179k0532k6147
22563a8100j80K4237k3356j417P379K568K716J5572O193Q459j936k6877Q230n6
22549C432J7914n017k0353j5886K7620K1181J6108o104O374J6651L2986r225m0556
22536D5125m3546o183M024q415j4106r457R609K3161J3448j2875j4081j3861L0228
22523C071J8946k3993k5928o3K9739K3345K164J298p309q231j595O74j8498o324
22509a2704J4529j6269j5255M2189J9902J4362j3720j1904R355J1567R822j1702
22497D0172K912j705l4649j8238R098J3501K0541L166j9801J5110J680k7311j7144
$$ y = [-6061, 19063, 28409, 47016, 57746, 40089, 51548, 49710, 48711, 29157, 15534, 16988, 8333, 10477, -9468, 4255, 10384, -7818, 33093, 61695, 55942, 52035, 42758, 28579, 8047, -18100, -18280, 5957, -17399, -18816, -11437, -8869, -6153, 9419, 15612, 24071, 22135, -4742, 3488, 3432, 21346, 16329, -4024, -19910, 7710, 28891, 44999, 38895, 45269, 61920, 94906, 85681, 45125, 1579, -4604, -580, -8995, -23101, -32558, -22949, 212, 13660, 785, -13296, -27157, 3071, 22017, -1976, -27904, -27967, 1772, 25117, 27281, 28579, 21270, 13039, 11444, 12118, -6380, -12704, 1825, -14444, -29699, 12490, 32392, 46754, 33034, 21130, 30485, 42052, 51874, 40172, 43084, 41379, 6730, -11508, -2410, 11091, 31632, 34798, 14997, 30107, 31787, 4476, -12668]
22484a2668j5670l715O893n298P37K5884K7527Q065M851j0792K7185o156l1329
22471A5514k0433l470M2129K7287R904j6178J1694r659k9862M478K508R14p184
22458B7642K774K3952K5221M1940M8882K7847k3307k754L3895L4662O3148R5650
22446C99552J68107K72699M86315O11089M19063J53201o8918n6994J24193P6696
22436B585003j66156l69316m34162k23161j12516j22995j58630k38739k30696
22427E28632j43886n7995j7228J0236L3974J28059K40586J50247k7775p6877k00206
22416E67767j81145j01243p5175m5570k2181K940k1390o7446l4195L120Q354J7263
22404E1099K4083j0549k0275l1244J2997J5044J4479K3255K529k1787j2905L2391
$$ y = [-12668, -28338, -32053, -25160, -30458, -29721, -3837, 23690, 31755, 36606, 25814, 52999, 46843, 15514, -4919, -8389, 33740, 61027, 70931, 54753, 66447, 56788, 26926, 31404, 33912, 34826, 27642, 30416, 54368, 79589, 121529, 170411, 198258, 174951, 172197, 206092, 240754, 303902, 399552, 567659, 840358, 1326673, 1937762, 2356825, 2510026, 2441108, 2384114, 2508307, 2585003, 2418847, 2049531, 1615369, 1392208, 1279692, 1156697, 998067, 759328, 528632, 384746, 326751, 309523, 319759, 353733, 481792, 722378, 872625, 844850, 767973, 567767, 386622, 285379, 210204, 164634, 142453, 145393, 124003, 56557, 22362, 25482, 33836, 51099, 75182, 64633, 44358, 13114, 26111, 41155, 55634, 78889, 81418, 59631, 46726, 79117]
22392G9117N4410Q213L0680Q5032P4849J02033K14815K83372L14107L63066L34273
22381A943967J15053M78j01033l12429l55353k65579k86982k37961j62882q5049
22371B52230l2863k8665n2048l7462j0293j9419j9590L4067M191l6879m3984l804
22359E481J0583L6082J9373k5528m2112o315O396M701n622J6876P04j2689k0349
22346a2419J6497M1814J3427k6621q498j1519o177O653Q822J488o087m033j4853
22333a506J8362K5275j8269m1192k2450J1267r897J102L7134q004k4774l4098
22321f7050K0363J9021M6457q578k0653J5847J8476o269L602R995Q430j5067K055
22308B6629q229l5400j3571J8184r707J3580K0040J2390j0120m52q568N467l3913
$$ y = [79117, 133527, 141740, 172420, 257452, 332301, 434334, 649149, 932521, 1246628, 1609694, 1943967, 2059020, 2059498, 1958465, 1646036, 1290683, 1025104, 738122, 500161, 337279, 252230, 219367, 190702, 138654, 101192, 90899, 71480, 51890, 85957, 90148, 53269, 9285, 5481, 16064, 52146, 71519, 45991, 3879, -2436, 3960, 8661, 3039, 19915, 20619, 7930, -12419, 4078, 45892, 59319, 32698, 24200, 12681, 6504, 13157, 21979, 23467, 17380, 13347, -1506, 16856, 42131, 23862, -17330, -39780, -28513, -38410, -37308, -174, -8178, -32952, -67050, -46687, -27666, 18791, 10213, -10440, 5407, 23883, 17614, 21216, 31211, 39641, 24574, 26629, 18400, -17000, -30571, -12387, -22094, -8514, 11526, 23916, 13796, 13344, 4776, 10243, -23670]
22295b3670j3590J2279L106L6458J5650l3192k1816j0388J7388J7700O80k480
22283a875o308L59J7310J9757O017J0964Q85j1313J4036m693M086j0802l3852
22270D571j2081j5726J0455J3499l605K3691J3241j29l3073k6606m199k816J8065
22257a4713j053l21J5373J4864k7125j5304J2428M328n061M144J2129J5076k6052
22244a1287k7441K4139R820N70j4174N28J2839m56K3092J9498k0941k195L440
22231A7432J5228K6948j2857l4253l6317K71j3746j2029K2086K7592m430K945
22219a130J0961J5206O810k3229j950J2519o425j1453j4179J212J5478K5915N601
22206C5336R78j1250o848q171m274l3659p44r43Q594J0784L9449J8355n142j9185
$$ y = [-23670, -37260, -24981, -21875, 14583, 30233, -2959, -24775, -35163, -17775, -75, 605, -1875, -8183, -7824, 9486, 29243, 35260, 46224, 47109, 35796, 49832, 45139, 49225, 38423, 4571, -7510, -23236, -12781, 718, -2887, 20804, 34045, 33916, 843, -25763, -29962, -32778, -14713, -15766, -16087, -714, 14150, -12975, -28279, -15851, -11523, -16584, -12440, -311, 14765, -11287, -38728, -14589, -4769, -4199, -18373, -17845, -5006, -5462, 17630, 37128, 16187, 13992, 17432, 32660, 59608, 46751, 12498, -23819, -23548, -37294, -49323, -27237, 355, -4075, -1130, 9831, 25037, 31847, 8618, 6668, 19187, 12762, 1309, -12870, -11658, 3820, 29735, 35336, 36314, 25064, 18216, 10045, 5771, -27888, -28632, -29575, -20981, -10197, 29252, 47607, 42465, 23280]
22192B3280k2183n799j8332Q498j4551m1224l0698r027L5777J7893K0232K351
22180c3783P797J1739J0139Q210j8932q573P922o40p01Q418K4051l311m512k323
22166E501k447r781l6813n722K3714R418J5722L822J4706j1975j1345l0330O394
22153b9136p9L7172J8828l3338k3939m1550J096K6741J4905J3822J7673L35k8149
22140b5619j4233j921J0925J2707N100O981N7p961K1914j2918j9480N390Q881
22127a0177J6954M172j0566k3542K522M871o957o170J0633L2524J0024J2183M530
22114D1001m036R005O497L044l460m7071j5344j3498j1337J584j784J7535J6329
22101a535j9318m934J7662K3398K1103r446k4974k3825R853Q905J1989p372L0095
$$ y = [23280, 1097, -4702, -23034, -14536, -29087, -70311, -101009, -110036, -74259, -56366, -36134, -33783, -25986, -14247, -4108, 4102, -14830, -23403, -15481, -16121, -16822, -8404, 15647, 12336, 7824, 5501, 3054, -6727, -43540, -49262, -25548, -16130, -408, 3414, 18120, 6145, -5200, -35530, -29136, -29215, 7957, 26785, -6553, -30492, -72042, -70946, -44205, -29300, -15478, 2195, 2530, -25619, -39852, -41773, -30848, -18141, -13041, -6060, -6003, -13964, 7950, -4968, -24448, -19058, -10177, 6777, 10949, 383, -23159, -20637, -15766, -22723, -28893, -18260, 14264, 24288, 36471, 41001, 36965, 45970, 52467, 55511, 52051, 4980, -10364, -23862, -35199, -33615, -35399, -17864, -1535, -20853, -25787, -8125, 15273, 36376, 26930, 1956, -21869, -12016, -3111, 8878, 1506, 31601]
22088C1601q1J2308r496J1489k2066l0337l9737J8540L0456J0768J2858L5276
22076F1579o918k5409j149j2851K0373L8589J9236J8756m129l3545l7198m991
22064C2343k0337j4255m2P781R779J3625J844J1614j1278p641Q412o553m7997
22051b2705j7244O358k1999O229K9916R988J1863j9139J9875J3102j6979k4271
22039b5006j2369P412J7142K248j8820j0466J5407J8372Q734R115k3477l1282
22027d2990m215K4806J029j1632O917J3739J2388R058j5221k9524K26K9993j6573
22014b1999j2611J2122L5141J3174j8590J2703K1059j5775k7748j5009r374N469
22002b1438O926M525L57M232k6004O479L2604j4788L769j2974K2458j0212o647
$$ y = [31601, 31520, 43828, 34332, 45821, 23755, -6582, -46319, -27779, 2677, 13445, 26303, 61579, 54661, 29252, 28103, 15252, 35625, 74214, 93450, 112206, 108077, 74532, 37334, 32343, 12006, -2249, -2291, 5490, 15269, 28894, 30738, 42352, 31074, 23433, 31845, 25292, -22705, -39949, -33591, -55590, -49361, -19445, -9457, 2406, -16733, 3142, 16244, -735, -25006, -37375, -29963, -12821, -10573, -29393, -39859, -24452, -6080, 2654, 11769, -11708, -42990, -47205, -22399, -21370, -33002, -26085, -12346, 42, 9100, -6121, -35645, -35419, -5426, -21999, -34610, -22488, 12653, 25827, 7237, 19940, 40999, 25224, -2524, -17533, -26907, -21438, -14512, -9987, -9630, -5398, -31402, -24923, 7681, -7107, -3338, -16312, 6146, -4066, -10713]
21989a0713Q178j1375l5803k173K6465K3655J1327j2919q139j9368J33L6587K6060
21976C1915K3352j5508k3832l465J5257K5910j5465k6322o955j1645L208P689
21964D139j5523j3740J2408K4705K8102J2938o658l1369k6385m5160j6368N581
21952f7330P962K5322M213K8666J4047l522N122j3418J0236J95m1980K1626J3576
21939D715l851O406k873j576M748r892j8859p445K0464j1492j4540J9886L9628
21926B5319J3146R053j6661j3793j3518r762O46J8337j703o966Q310J2830J3751
21913C8989j4571k7820N260J9918J5809k0878J0315J0222j2792k6158j2456O713
21901g449L316j0291q340M639J7098J2194M146j8825M930m455l0775j567k952
$$ y = [-10713, -2535, -13910, -49713, -51886, -25421, -1766, 9561, -3358, -11497, -30865, -30732, 5855, 31915, 55267, 39759, 15927, 12462, 27719, 53629, 38164, 11842, 4887, -6758, -3550, 4139, -11384, -25124, -12716, 11989, 40091, 53029, 46371, 15002, -11383, -56543, -72911, -67330, -59368, -34046, -29833, -1167, 12880, 9358, 14480, 1062, 11298, 11493, -30487, -8861, 4715, 864, 7270, 4397, 2821, 7569, -2323, -21182, -28627, -8163, -19655, -34195, -14309, 25319, 38465, 47518, 30857, 17064, 3546, -6216, -5570, 12767, 11064, 4098, 12408, 25238, 38989, 24418, -3402, 1858, 21776, 37585, 16707, 27022, 37244, 24452, -1706, -14162, -7449, -4133, -14424, -22764, -18125, -1027, 11167, 15313, -3512, 1418, -3037, -33812, -35379, -38331]
21888c8331q476J5411n126J975p270J9884J6746J8847j3654k0117m408j230J3890
21875a1859o199r460n348j0070k466M394R098J914q909j5262J3538K5806K6821
21862A1998r7j8635j0676J2893L7143K322k1130m5082K8633R783J113J195j1052
21849a592p925j1872p645K0083j1656j801j2133O709J8372J5327m545j855r314
21836i847R710J4478r890p9Q861N329k4960k3196K2135k935m650q07p60R876L7
21821f698p602k1582j0323r782n962R70ml287K0931K0555J1148L984l243k0603
21807c1498J4119K509k0106M310R222K1761L332q837k2453p811K7204K3921n591
21794A0082j8207k1216J19J7022k7745R355L0550j476j446j1330R590L1064L1466
$$ y = [-38331, -46807, -31396, -36522, -34547, -41817, -21933, -5187, 13660, 6, -20111, -24519, -25749, -11859, -18058, -27518, -32866, -42936, -45402, -41008, -31910, -29996, -38905, -54167, -40629, -14823, 11998, 11901, -6734, -17410, -4517, 32626, 34948, 13818, -31264, -2631, 7152, 8265, 9460, -1592, -9517, -21389, -29034, -8951, -20607, -22408, -34541, -27832, -9460, 5867, 1322, -533, -9847, -137, 14341, 4451, 4372, 13233, 18562, -6398, -29594, -7459, -10394, -15044, -15851, -16611, -6735, -6698, -14300, -35882, -46205, -55987, -61949, -60979, -60983, -64270, -43339, -22784, -11636, -7652, -10895, -31498, -17379, -14870, -34976, -30666, -21444, 317, 3649, -5188, -27641, -35452, -8248, 15673, 10082, -8125, -29341, -29222, -12200, -39945, -30590, -40, -1516, -2962, -14292, -4702, 26362, 57828]
21781E7828n752q981O598p266m359J0821j7300K466r563k8358l7074J5093L5175
21768I328l440j554j8041k2529K3890L2379J6713k2706k9752P265K9553j7522
21756C584k4044j6525n735j3946K0749K6285p29k466m445k3019L923P545J4217
21743a4606J4120m09m763J3180M326K978n652k4042N053J3890k9606j0530m018
21730d0079K7218L3705k945l5242J2761l5226k8183J0269J8745K4668K327L846
21718h136L083M3783l127j1283j6852o387k791l2269j6602K3988K8224K0221m1560
21705a9708m6957l220P369N739K1664J5842K4312J7168K500n695Q852L617k1597
21692I886j9360K98k1449K147J2871K3729K7309j1728l8266J01L1182K1588p442
$$ y = [57828, 52076, 43095, 49693, 42427, 38068, 48889, 31589, 34055, 24492, -3866, -40940, -25847, 9328, 5888, 4334, -13707, -36236, -12346, 20033, 36746, 14040, -15712, -8447, 21106, 3584, -20460, -36985, -42720, -56666, -35917, -9632, -10361, -12827, -17272, -40291, -36368, -28823, -14606, -486, -895, -5658, 7522, 11848, 14826, 9174, -14868, -9815, 4075, -25531, -36061, -40079, -12861, 20844, 17899, -17343, -4582, -39808, -67991, -57722, -38977, -14309, -11982, -8136, -5053, 38730, 35603, 24320, 7468, 1081, -1710, -33979, -50581, -26593, 1631, 21852, -19708, -66665, -69885, -62516, -56777, -35113, -19271, 5041, 22209, 24709, 19014, 27866, 31483, 9886, -9474, -9176, -30625, -28478, -15607, 8122, 35431, 23703, -14563, -14462, 16720, 38308, 30866]
21679C0866j9238j2290r916j7603O813J134N23j8952k965N3980l79m2178n953
21666c6158J5090J1427j2141L070P188j8323K980J7057n504J1493J4216J2L7851
21653D8258j576l0122j4268j248j0712j7167P771K173J4384K0749j5819l729r817
21640a1123j5387R822N53J2554j7397O052R197j2829j392R415j5828k6145p470
21627e9978q953K717j2252P60L2461N536Q209p418J3470K4414q849K391N706J5806
21613A4020P360m5429l191J5302J5971k914K2954j9472O540j6151l5942j8878
21601e9830O098J5485K5547q864k3555K6718K161J119K841n885j2154P94M5025
21588A5500K79J2656m030M0359n80K533k8055n4066l1777l817J1884l260j8632
$$ y = [30866, 11628, -662, -10578, -28181, -21368, -20234, -19711, -38663, -41628, 12352, 11973, -30205, -36158, -21068, -9641, -21782, -18712, -11524, -29847, -26867, -9810, -15314, -3821, 10395, 10407, 48258, 46682, 16560, 2292, 1044, -9668, -26835, -19064, -16891, -2507, 18242, 2423, -1306, -11123, -26510, -16688, -16135, -3581, -20978, -14926, -5729, -18558, -19950, -10535, -26363, -52508, -59978, -68931, -66214, -78466, -77706, -45245, -39709, -31500, -38918, -25448, -1034, -9883, -7492, -1786, 14020, 21380, -24049, -27240, -11938, 4033, 1119, 24073, 4601, 11141, -5010, -40952, -59830, -53732, -38247, -12700, -21564, -45119, -18401, -16240, -15121, -12280, -18165, -30319, -29525, 15500, 15779, 28435, 24405, 64764, 64184, 66717, 38662, -15404, -47181, -50998, -39114, -42374, -61006]
21575f1006K7061J1815m905J4448M4309J431p888k2275j716K9111N895j1167J4295
21562C9408l2275k6871r241L339P449r635J4485R202m779k662j5740k189Q208
21549b1301o573N920j601K510j3627K3250M060L834k2712r423K1101j4446k423
21536c1431R725r445O424L656J004K878j4301N845j8183R477L71j9031m706J6705
21522d1012j0928L339K4185O598j7351P453K5300O598O861Q68j5409O650r623
21509f471j844J0461J902K943n288l0509l7974J1241K7355K683k1059j5576Q948
21496e3188l735l301K8052o29m200L094m160J4748K742j1609j8505J121K754o965
21482e3781J0075J1463K3365j92j1948k698p64P367n637J9844l115K6922j1590
$$ y = [-61006, -33945, -22130, -27035, -12587, 31722, 33153, 25265, 2990, 1274, 30385, 36280, 25113, 39408, 7133, -19738, -28979, -25640, -18191, -27826, -13341, -4139, -8918, -11580, -27320, -29509, -21301, -27874, -21954, -23555, -21045, -34672, -11422, -7362, -3528, -26240, -35663, -14562, -29008, -31431, -21706, -31151, -24727, -21071, -20067, -17189, -31490, -25645, -43828, -34351, -33980, -53011, -57717, -41012, -51940, -48601, -24416, -17818, -35169, -27716, -2416, 4182, 11043, 11911, -3498, 3152, -6471, -8315, 2146, 4048, 6991, 1703, -28806, -66780, -55539, -28184, -25501, -46560, -62136, -53188, -56923, -60224, -32172, -32801, -37001, -33907, -38067, -23319, -20577, -32186, -50691, -49570, -46816, -53781, -43706, -32243, -8878, -9070, -21018, -23716, -24480, -17113, -22750, -2906, -6021, 20901, 9311]
21469I311k3283K324N901m132n069J2508r79L680j0825p391j8405j2760J2471
21456c6649K2399k816k188l2579J3900K879O60j8786L1939J0874p218P428m383
21443a4540P981J1666j0529k1560J2998r76j479j9954j8651M62q178K6987J3243
21430b2530q73N833M802K5654j2229l6590k893J8056k3444J4185J6259K6263L411
21417A5904l3882j9417J1978j1421j5116N792L3956j3522l3271M748m997K693
21405e6555R266j5052L038n633j12L6801L3300L8002j7611k9604j0478J4218J0671
21392A0251k818N959N984O760k2540P384n541K031k0981j8009j9112j5363K3897
21379d2098J0543J9934M0115J3166l0364l7531o802K1185j890j7188K2393K6051
$$ y = [9311, -13972, -11648, -5747, -9879, -14948, -2440, -3419, 261, -10564, -17955, -36360, -49120, -36649, -14250, -17066, -19254, -51833, -37933, -35054, -34394, -53180, -21241, -10367, -17585, -10157, -14540, -6559, 5107, -5422, -26982, -13984, -14960, -16439, -36393, -55044, -54582, -62760, -35773, -22530, -23403, -17570, -12768, 12886, 657, -35933, -38826, -20770, -44214, -30029, -13770, 12493, 15904, -17978, -37395, -25417, -36838, -51954, -46162, -12206, -25728, -58999, -54251, -59248, -56555, -47289, -62341, -59303, -64936, -65048, -28247, 5053, 43055, 25444, -4160, -14638, -420, 10251, 7433, 13392, 19376, 26136, 3596, 10980, 5439, 7470, -13511, -31520, -50632, -65995, -42098, -31555, -11621, 28494, 41660, 11296, -26235, -33037, -11852, -13742, -30930, -8537, 17514]
21367A7514O675O20Q982k7052j13q281j3200j3165j67R938p065Q912K6934L1228
21353D1760j9918m1865j4662M732K1237q033o583k5347J0092J8251j0425j4127
21341d4888j370K1152J364k6039J3877L1508m980k0141j409K3458O664m97J4597
21328A3296J6594j7524m026k1105j195K7405J4730j6121k861j690l611P743j6119
21315d484j5958k1676L961K3464K3424K2233j7562J962l0552k4222j0898q9J8307
21302c2090p096N583M591J2472K2465K4697j7828k3387j5681o793k0328L2345
21290b1050J1851p152k5288l65J7558J9310K592j4058j4999L841K930J4935N680
21277d215k3635j0525Q502j181J830j694k3841j8198O394L5720J0629l0914J0821
$$ y = [17514, 24189, 24809, 33791, 6739, 6626, -1655, -14855, -28020, -28187, -18249, -25314, -16402, 10532, 41760, 21842, -20023, -34685, -29953, -8716, -16749, -23332, -48679, -38587, -20336, -30761, -44888, -46258, -25106, -23742, -49781, -35904, -4396, -9376, -29517, -30926, -7468, -804, -1301, 13296, 29890, 12366, 8340, -12765, -13960, 13445, 28175, 12054, 9193, 7503, 3892, 11635, -4484, -20442, -42118, -38157, -14693, 8731, 30964, 13402, 15364, -15188, -39410, -50308, -50397, -32090, -39186, -33603, -29012, -16540, 5925, 30622, 12794, -10593, -26274, -33067, -53395, -21050, -9199, -16351, -41639, -42004, -24446, -5136, -2544, -16602, -31601, -27760, -24830, -9895, -4215, -27850, -38375, -29873, -31054, -29224, -30918, -54759, -72957, -66563, -30843, -20214, -51128, -40307]
21264d0307K1155j416N778K1497L4457p944l0473j6547k4028j3421J9485j96r7
21251c2057k809l3019j4256l02K1390K3672j0674J1538K4222O124j7843J7436
21239f578j051J5675Q119L347K654k6998j2786J4434r877Q273J1463Q665j0817
21226D523k4247O607k3210n492k3778r810L5367L8857Q858j1479k9561r618K363
21213d0620R897Q267R841L2535K6070j4595k8624p576k6913k1071N527J8458J6635
21200a2169j5369N860k002R299K3041j5278j6876K1656o409K698K5470j1565j8040
21187i684l6564N451K0820J4030J7482m998l595r082J2971O210K010j8202lj6225
21173a9379R210l747J6910j3333M648j413O057J5546l0203k6247K1580p652k24
$$ y = [-40307, -19152, -20568, -14790, 6707, 41164, 33220, 2747, -13800, -37828, -51249, -31764, -31960, -32057, -34866, -67885, -82141, -82443, -61053, -37381, -48055, -36517, -12295, -6171, -24014, -6578, -7629, 8046, 16165, 19512, 22166, -4832, -17618, -3184, -13061, -4788, 6675, 15340, 4523, -19724, -13117, -36327, -41819, -65597, -75407, -40040, -1183, 7675, -3804, -33365, -42983, -40620, -30723, -22456, -12615, 19920, 45990, 31395, 2771, -4805, -31718, -52789, -47262, -28804, -12169, -27538, -21678, -23680, -14381, 8660, -6618, -23494, -1838, -8247, -5549, 19921, 8356, -9684, -46248, -40797, -19977, -5947, 11535, 6537, 2942, -6140, 6831, 13041, 15051, -3151, -3154, -19379, -10169, -13916, 2994, -10339, -5691, -7104, -1047, 14499, -15704, -41951, -20371, -28023, -28247]
21160b8247J3011K0016J3464R939l1876N277o441j9333L5210K8093j0541m504
21148B4068k3241j2803K5017j232k9727j1695J0690K796L480J59o316J623n276
21135b2457k4052k5957p188K67R625K6854O528j4838J1351K4358O617J9164K5513
21122C5785K0792M409m101k0267m011M62n570k1062m0789j2642J0342j8345j5118
21109g0115J4312K1953L6342O81j4139j5993Q198P211J274o831k4417K639K6038
21096a2847K4995m516j7787K880R407J3263J4557j9535j8296J6245j4451K630
21084c455j8731J5607q634p380j2922J8300k7995j9079k810k4748K7921J7857
21072d6069J9677q874j4287J5074K7466R557j8646r373j615m826j3889L460m575
$$ y = [-28247, -15236, 4780, 18244, 28183, -3693, 1584, -4857, -24190, 11020, 39113, 28572, 24068, 827, -11976, 13041, 11809, -17918, -29613, -18923, -16127, -12647, -12488, -18804, -17181, -22457, -46509, -72466, -79654, -79387, -69762, -42908, -36380, -51218, -39867, -15509, -8892, 10272, 35785, 56577, 60986, 56885, 36618, 32607, 33069, 27499, 6437, -34352, -46994, -36652, -54997, -70115, -55803, -33850, 2492, 3173, -10966, -26959, -18761, -11550, -10276, -17107, -41524, -38885, -12847, 12148, 7632, -10155, -7275, 2132, 15395, 29952, 10417, -7879, 8366, -6085, -3455, -22186, -6579, -15213, -22593, -35515, -17215, -45210, -64289, -67099, -91847, -63926, -46069, -26392, -35266, -49553, -34479, -7013, 2544, -16102, -25475, -27090, -31916, -45805, -42345, -46920]
21059d6920Q089J8120J2742j2026J3282r191J009J0849Q563J3193j6364N43J4871
21046A6760N140p112p656J2680l849R302M180l4426j3571m0857J816K6231K6694
21033d668J4296M348N929j8378j2329L2987J1399j6306l3294O314K5313n733k9301
21020a9423j5151K9708P66K533K3186J648l8407j9539l032J3055J3917J5442q782
21007d079k3869j4747j024J6617J4030J5367N149k236K5824j9301j2921j3532
20995a4722l6258j1936K4241L0137K800o090o426j3282P608P065j655K6890L1333
20982C9705Q076m9935l3957K2907k93k3693j7684K9388R209K4661L211k7587o819
20969b2811K8903P855O441q100Q712k4634k6768J638J5939J8889q041K30K4433
$$ y = [-46920, -38831, -20711, -7969, -19995, -6713, -15904, -14895, -4046, 4517, 17710, 1346, 1889, 16760, 21900, 14788, 7132, 19812, 15963, 25265, 29445, -4981, -18552, -59409, -57593, -31362, -4668, 9628, 13976, 19905, 1527, -10802, 22185, 33584, 17278, -16016, -9702, 15611, 9878, -19423, -34574, -4866, -4100, -1567, 21619, 23267, -15140, -34679, -37711, -24656, -10739, 4703, -4079, -27948, -42695, -43719, -27102, -13072, 2295, 7444, 5208, 31032, 11731, -1190, -14722, -50980, -62916, -38675, -8538, -5738, -11828, -18254, -31536, -23928, -16863, -18518, 8372, 39705, 47781, -2154, -36111, -13204, -13497, -37190, -54874, -25486, -16277, 8384, 11595, -15992, -22811, 6092, 13947, 20388, 12288, 21000, -3634, -30402, -28764, -12825, 6064, -1977, -1747, 22686]
20956B2686J9381R079j1427l2992j181j1263K2161j4779j5941j1640J3136J9812
20944G032j8870j4568r737j5453q096q627J1242J9474p521K3706O73J1520L2698
20931B3473K0252p144p581L380Q785l4920n683l169j5835o316J8968R515l0056
20918b6331J824P258K0612j6667J4327J8137j3023l531o440q662J9816m842k0102
20905a7624J7230M969K509j2171k1500k3594J140p761J4249K3991P613O197R763
20892E011m0124j2812J4844O616l6158k2154K4714L4991J6107j1532k163l1255
20880e3915k79J2944K6258K9108o846l3831j3067Q321K4305J0938k049J7916K5102
20867D4905r105l4074j9731K6046J4282j2750o057J0270k303j4171J5256M837
$$ y = [22686, 42067, 51146, 39719, 6727, 5546, -5717, 16444, 1665, -14276, -25916, -12780, 7032, -11838, -26406, -36143, -51596, -59692, -68319, -57077, -37603, -45124, -21418, -20745, -9225, 23473, 43725, 36581, 29000, 32380, 41165, 6245, 562, -2607, -18442, -24758, -5790, 3725, -26331, -24507, -17249, 3363, -13304, 1023, 19160, 6137, 2606, -3834, -12496, 7320, 2478, -17624, -394, 4575, 7084, -5087, -26587, -50181, -49041, -56802, -42553, -18562, -10949, -4752, 5011, -35113, -47925, -33081, -26465, -62623, -84777, -60063, -25072, -8965, -20497, -22660, -53915, -54194, -41250, -14992, 14116, 7270, -26561, -39628, -31307, -7002, 3936, 1887, 19803, 44905, 35800, 1726, -18005, 8041, 22323, 9573, 3516, 13786, 11483, -2688, 12568, 17405]
20855A7405j5079j7192P53j3676L574n853M258o427P906K0261J5139m178j3296
20842f405j8541J485R437K2372K1119k9464l1461J4361K1824n622p300J3706j0837
20829e326K764J4051R196o834k0612j2363q209K6170k210Q183p144k1577L823
20816b0088L3768J895k6603j9647k369K2K488q141J8038P732p901r025L627q179
20802c4383j3838R695K5538N860J7018J6215k8576j4359j7237J7270L146N6m256
20789a7851M699J8303r592j1927K2357R320M363l6005k3225O743J99k610q42Q05
20775c5263N298J0002j2485o734J6183j7620j6390J2383K5765K404k1460L0746
20763g171K1979o766n675o550k2653j3909Q357k2798j0139K4596m470O777N616
$$ y = [17405, 2326, -14866, -14113, -27789, -24215, -30068, -25810, -32237, -24331, -4070, 11069, 6891, -6405, -24946, -23461, -14024, 8348, 29467, 3, -31458, -17097, 4727, -895, -8195, 5511, -5326, -2562, 11489, 20685, 13851, -6761, -19124, -27333, -1163, -3373, 4810, -2334, -23911, -20088, 13680, 15575, -11028, -30675, -33044, -33022, -30534, -38675, -20637, -12905, -20806, -29831, -26204, -34383, -48221, -38526, -12988, -7128, 9890, 26105, -2471, -16830, -34067, -16797, -13651, -13595, -17851, -13152, 5151, -4441, -16368, 5989, 15309, 19672, -16333, -39558, -32815, -32616, -35226, -36068, -35263, -29965, -19963, -32448, -39182, -22999, -40619, -57009, -44626, -18861, -16457, -37917, -7171, 14808, 8042, 2367, -4183, -26836, -40745, -32388, -55186, -65325, -40729, -45199, -38422, -32806]
20750c2806P157K0686K6644O067n42Q883l4102k5886k639L720O736J2185R127
20737E230M806l6794j8468J4724J6316K3720k0221k5066j4612K3268O894l1750
20725e1953P195J3844J6981o55j4179j8669p201L000J4432j463J3105J8991k022
20712h594j1560J0039k764j348K1996J2488k6332p235O728l316R177J8629L303
20699B1211K2252k2887k1912l2130J1677k0925P408J6569o76j374L335Q777J7407
20686H732Q109q564m3431k9747N646J6662l829P617K6307J7108J0829j050J2856
20673B7245J937N183j394j7140j7787l4572k3052M245n047j4558L897J3215M313
20660e3515L8246K0652j1278k6879j5996j107K4432N281p482j1085n42k1154j2788
$$ y = [-32806, -25649, -4963, 21681, 27748, 27206, 36089, 1987, -23899, -26538, -22818, -16082, -3897, 5230, 10036, -26758, -45226, -30502, -14186, 9534, -10687, -35753, -50365, -27097, -20203, -51953, -44758, -30914, -13933, -14588, -28767, -47436, -54637, -51637, -37205, -38668, -25563, -6572, -8594, -20154, -10115, -12879, -14227, 7769, 20257, -6075, -13310, -6582, -9898, -721, 17908, 21211, 43463, 20576, -1336, -33466, -21789, -42714, -35306, -18737, -19413, -20787, -17452, -8675, 8732, 16841, 8277, -35154, -64901, -59255, -42593, -46422, -38805, -12498, 4610, 15439, 14389, 27245, 29182, 34365, 32971, 15831, -1956, -36528, -59580, -55335, -60382, -74940, -71043, -57828, -53515, -15269, 5383, -5895, -32774, -48770, -49877, -25445, -20164, -27646, -38731, -39273, -60427, -73215]
20647g3215N673p343n577L3247K3225J3395j3061L799J7046M97k3571%K835o597
20633b9647O031o306L839O523K3181M932M95j2084J0413k723k8374n328K0991
20620h057J1119J0332j7149l7185K2515J0612r577M350K151J5650k674L65j4267
20607a1815j7972l3J1204J4264p285j5151J1208L0379J1657k5135K5729J7944
20595D4994k5218R68p485J4115l2775r767L0040p205m518K7538J5362l713l1730
20582A0606P326j847M813M084j7218J4040j4888J5605N674k6112k1458k1936l342
20569d4653J0579R203l234k2621m822k6771N343J7626j4435J0166J9450K7535
20557a6634L0790K556k2780J66l6482J5581L3958Q336k1496j5475J6685K8483
$$ y = [-73215, -67542, -74885, -80462, -47215, -23990, -10595, -23656, -19857, -2811, -2314, -25885, -25885, -23050, -29647, -23616, -29922, -26083, -19560, 3621, 8553, 9048, -3036, 7377, 4654, -23720, -29048, -8057, 3062, 13394, -3755, -40940, -18425, -7813, -17390, -13040, -10889, 4761, 2087, 2452, -11815, -29787, -29820, -18616, -4352, -11637, -26788, -15580, 14799, 26456, 1321, 27050, 44994, 19776, 20744, 13259, 27374, -5401, -15168, 14872, 7667, 3149, 30687, 46049, 42336, 10606, 17932, 16085, 20898, 24982, 7764, 21804, 6916, 22521, 28195, 2083, -19375, -41311, -44653, -34074, -24871, -28105, -50726, -55548, -82319, -76976, -59350, -73785, -63619, -44169, -16634, 14156, 16712, -6068, -5902, -42384, -26803, 7155, 15491, -6005, -21480, -4795, 23688]
20545B3688l063l8364k5582R952J7315j0173L6941j1652j6796M702J7461J2466
20533A6895M299K051j8987l9813j4560K3200M387J2622j6918j2204n820n96M951
20520d0493j1660J8024m958P168Q296l099K7525K3378M278l5936r12k8747J7279
20507a9857J5234j0991J1877J4055J0901P511k2370J1198M134q671l476j8254
20495h709R183Q784P777r463L097J2969j4318m7923M773k7340O657J3926j9665
20482f0252J1930O560J5657K8659M205k6391j1635L319P96N029J3502k086L204
20469g503j794J7618O289r50k569M587j6479r574k3087l2477j4715J5555R772
20456e5327N597j309L7381J5352p984O422j872j9711j7431o759J9621J0240M874
$$ y = [23688, 20625, -17739, -43321, -33369, -16054, -26227, 10714, -938, -17734, -13032, 4429, 16895, 21194, 23245, 4258, -35555, -50115, -26915, -22528, -9906, -26824, -39028, -44848, -45444, -40493, -52153, -34129, -39087, -31919, -23623, -26722, 803, 24181, 28459, -7477, -8389, -37136, -19857, -4623, -15614, -3737, 10318, 21219, 28730, 6360, 17558, 21692, 13021, 9545, -8709, 474, 9258, 17035, 7572, 10669, 23638, 9320, -38603, -33830, -61170, -54513, -40587, -60252, -48322, -41762, -26105, 2554, 6759, -19632, -31267, -27948, -27152, -22123, -8621, -10707, -7503, -9297, 8321, 14610, 13660, 11091, 15678, -801, -10375, -33462, -65939, -80654, -65099, -55327, -49730, -51039, -13658, 1694, -6290, 132, -1740, -21451, -38882, -45641, -26020, -15780, -10906]
20443a0906J3476J0773M704m7299n110J7469L517M269K1881j5948j2759m821q091
20430b8845J6733J7112j8195J0395K1412N2m515j6780j6302j3067j469j725N110
20417c0084K4399L5884J5271J6346k1418j4575k4217j3762K2596L899j3464m344
20405c469J5361j0609k8264j5109J0543J0807j2894n364r233J3742o638K0476
20393b0651L6998n583j7004j0834N174J1449Q929j3204m33K2592j2207k2182M60
20380a6496k117m855J2334j3247m352J3992J1168j466r267j107J0111j2433J1517
20367f218N686p401M275o061l8980p16K6185M200l29K372k0k4093J718l971J6506
20352b6847J6625K0726J7990J375k6332m0712j6188J3967K1675j496J558n343
$$ y = [-10906, 2570, 13343, 18047, -29252, -34362, -16893, -13376, -9107, 12774, -3174, -15933, -20754, -28845, -12112, 5000, -13195, -2800, 18612, 18664, 14149, -2631, -18933, -32000, -33469, -35194, -30084, -5685, 30199, 45470, 61816, 40398, 25823, 1606, -12156, 10440, 14339, 875, -3469, 11892, 1283, -26981, -42090, -31547, -20740, -33634, -38998, -48231, -34489, -41127, -20651, 16347, 10764, -6240, -17074, -11900, -451, 8478, -4726, -5159, 17433, 5226, -16956, -16496, -18613, -23468, -11134, -24381, -28733, -14741, -3573, -5039, -14306, -15413, -5302, -17735, -6218, -532, -7933, -3658, -9719, -48699, -49415, -23230, -19030, -19359, -16987, -17007, -41100, -39382, -43353, -26847, -10222, 10504, 28494, 29869, 3537, -37175, -53363, -39396, -17721, -19217, -17659, -23002]
20340b3002j4058q81l763K0845j3025L4809J3072k7067l810Q582K8804K532J5153
20327C8191J541l2752k9914L920K3045K6170l4256k8396J4324K7759R449r159
20315I922k8104K6212N533j4087k7376j0839J7492O756k321J0168J4282k4988
20303a7350l7311k6987j8863L6959J5796N582K4753j2699k0239J4801J8681K0469
20291C592Q771K0607j7799l8808l916j0101J3545K2161j7244l945O934p149P93
20278b2559K6850Q026J3185k126n309P56K042m885m152k3540k9524j4352J2437
20265d3151K0994K3856M269J8114P103o961N175k7147R117J2504K386R593O92
20252C6544j6466r148J3979l454l8876r21m611j7621J157L2584M7963k234L995
$$ y = [-23002, -37060, -37941, -41704, -20859, -33884, 925, 13997, -13070, -16880, -8298, 20506, 23038, 38191, 39732, 6980, -22934, -19014, 4031, 30201, -4055, -32451, -18127, 9632, 19081, 9922, -18182, 8030, 13563, -524, -27900, -38739, -21247, -14491, -16812, -6644, 7638, -17350, -54661, -81648, -100511, -63552, -47756, -42174, -17421, -30120, -50359, -35558, -16877, 3592, 12363, 32970, 15171, -23637, -27553, -37654, -24109, -1948, -19192, -23137, -16203, -23352, -22559, 4291, 12317, 25502, 23376, 18067, 18823, 20865, 15980, 11828, -11712, -41236, -55588, -43151, -22157, 1699, 5968, 24082, 31185, 24224, 29399, 2252, 11369, 23873, 26259, 35852, 36544, 20078, 10930, 24909, 21455, -17421, -18342, -22953, -40574, -39417, -6833, 41130, 38896, 42891]
20239D2891J7958k8746M862J7892j7083j3680l9910j8338J4301n241n816N616
20227b5294M9403J4151j5281k7081l2m837P36K0230J4823m661j6699J2313L7650
20214E5421m681k302j6321l1538l0075j4397J5966M022k1810k3494J2717P856
20202d8636K0292M3705n001j7685m295p728J0496k826Q776m306j671K3854L0573
20189D5548r797p181q700k5504n921N461k5720q522J2724J9832J7987K2781j1900
20176B1088k5335J8374k2194n070k783O132K953l208j1689Q17P836j6992k866
20163c2937J1846l958o628l597k805j6807O334J5721P900J7972J0448q586J3913
20150H816L4635j2971j8817l2830J48j3002J6480O837J8318j2836k5519J3028
$$ y = [42891, 60849, 32103, 36965, 54857, 37774, 24094, -15816, -34154, -19853, -25094, -30910, -25294, 24109, 38260, 22979, -4102, -4134, -8971, -8235, 11995, 26818, 22157, 5458, 17771, 55421, 50740, 48438, 32117, 579, -29496, -43893, -27927, -23905, -45715, -69209, -56492, -48636, -28344, 15361, 10360, -7325, -11620, -19348, -8852, -11678, -2902, -7208, -8879, 14975, 45548, 35751, 28570, 19870, -5634, -11555, -6094, -31814, -40336, -27612, -7780, 10207, 32988, 21088, -4247, 14127, -8067, -13137, -15920, -9788, -6835, -10043, -21732, -20915, -13079, -30071, -32937, -21091, -25049, -31677, -35274, -38079, -54886, -48552, -32831, -24931, -6959, 3489, -5097, 8816, 43451, 30480, 11663, -21167, -21019, -34021, -17541, -10704, 7614, -5222, -30741, -17713]
20138a7713J0362k2815k750J0158o541P2P08K4450J6130K508j7798j7636m890
20125b5755k961m184n834K5881J9597K0759q588k1996j2377K1659q26l0542o382
20112c1549J1438J8401n683J2693P460n346J4364n422k1112j7546L334M54k172
20099b0686K212J0804J3280O302J4254K4549m222k7666l341Q306P560j7040k1635
20086g323J0189K203r018k647k6675J7006J9213K6891J2552j2410p394j1731j3048
20073b192J883N233l7830J337K6587K2683N762J4177j461l1212R667j0207J4013
20060A8440K1k2590l4100J9992p012J6978O875j2302J3066j288n382M9j8549K354
20046b3448r947M264Q487K0765M2707K9668k8621k7058K1795N132q508l2962O118
$$ y = [-17713, -7351, -30166, -32916, -22758, -29299, -29227, -28519, -4069, 12061, 14569, -3229, -20865, -25755, -28716, -32900, -38734, -12853, 6744, 27503, 18915, -3081, -15458, 6201, 5375, -25167, -31549, -20111, -1710, -7393, 5300, 12760, 7414, 21778, 16356, -4756, -22302, -18968, -18514, -20686, -18474, -7670, 5610, 11912, 26166, 50715, 46493, 18827, 15486, 23792, 31352, 14312, -7323, 2866, 5069, -3949, -6596, -33271, -16265, 2948, 29839, 42391, 29981, 22587, 10856, -2192, -309, 4924, -32906, -31569, -4982, 17701, 23463, 37640, 36179, 4967, 14634, 4427, 18440, 18461, -4129, -38229, -18237, -25249, -8271, -1396, -13698, -632, -1920, -7302, -7253, -25802, -23448, -33395, -29131, -20644, 121, 42828, 72496, 43875, 16817, 38612, 43744, 35236, 2274, 8392]
20033H392P286l8103j9514Q449J6773M712J6865J5746q617j2319j0987k3947l280
20020c8544K5788L076j7212J5156r940j2318J0361K704J3218n929k9444j4033
20008e7117M9451K4271O596L6017q479k7709l1310R067K7770J5304k2760k9800
19996h699k1948J1030J7136J7709k5872j5477K1337J5156K1968q72j142j9566
19984A0760P94n060l04k2520L875J4735p868j6362R49k86M294N723K0958J1011
19970B0699k269k3603j7874L6262K1699j3756m1845O593J9485j5248k178O005
19958f030n163l580O973K2030j0170n735j0545k6254o025n279j1757K7497N9509
19945B5471J1529k1741l5437p954j3263J1055m524m336J9203r501J5038O506K8614
$$ y = [8392, 15678, -22425, -41939, -33490, -16717, -12005, 4860, 20606, 11989, -330, -11317, -35264, -38544, -12756, -9680, -26892, -11736, -21676, -33994, -23633, -20929, -7711, -13640, -43084, -57117, -7666, 16605, 23201, 59218, 50739, 23030, -8280, 787, 28557, 43861, 21101, -8699, -30647, -19617, -2481, 15228, -10644, -26121, -4784, 10372, 32340, 31468, 30326, 10760, 11554, 6494, 6190, -16330, -12455, 2280, -5588, -21950, -21001, -21287, -16993, -11270, 9688, 20699, 18430, -5173, -23047, 13215, 34914, 21158, -20687, -14094, 5391, -9857, -12035, -6030, -11193, -14773, -7800, 14230, 4060, -1675, -12220, -38474, -44499, -49778, -61535, -34038, 25471, 37000, 15259, -20178, -28132, -41395, -30340, -34864, -39200, -19997, -29498, -14460, -7954, 20660]
19932B0660J7680k4294l2702j3919j593L0814J5529j6722M279J5644R652j9866
19920E162n905p828j6462K2137q214J7945J7278l1087N02L1368J7145J928K93
19907D4262j7434m095J8112l6621l4436K685O183j6981j9786L884O260L1906L6069
19894B0008M340j2005Q05J3876L900K640r857j4943k7892R584R761J2133LJ4259
19880B6612r612J20k8588N275K0711O725n814K3937q005q970p941J4853r647k9948
19866a0292o839K5324N959k0420P734L2087k1629p467j4708l8911K6741J3360
19854i061K8480J2055O5j0335k333j7473n93K8908K0007r722l2173j0437q540
19841a1152R71n430o205N3121M912n274J706l9676R34P560K1985L645k8058j2898
$$ y = [20660, 38340, 14046, -18656, -32575, -34168, -3354, 12175, -4547, -268, 15376, 25028, 5162, -743, -8571, -25033, -2896, -11110, 6835, 24113, -6974, -6472, 24896, 42041, 43969, 44262, 26828, 22733, 40845, 4224, -30212, -27527, -21344, -38325, -58111, -54227, -47967, -16061, 20008, 24348, 12343, 13148, 27024, 30924, 33564, 23707, 8764, -19128, -9544, 217, 12350, 12353, 26612, 17000, 17120, -11468, -6193, 14518, 21243, 15429, 39366, 31361, 22391, 14450, 29303, 19656, -10292, -17131, 8193, 14152, -6268, 1466, 33553, 11924, 4457, -10251, -49162, -22421, -9061, 19419, 31474, 31539, 21204, 18871, 1398, 805, 29713, 49720, 39998, 7825, -2612, -11152, -10181, -15611, -21816, 31305, 36217, 30943, 32649, -7027, -6093, 1467, 23452, 27097, -961, -13859]
19827a3859P786N808J897k1451L210J5171m076P865J0723k1905j2709J1355N283
19814d902O249k5946k399j7310J0185R781Q392J7744M019j5673J6479M3050M048
19801E3717m2442j6975K110j087L628K8194K1632J5852j1084j0919m2627k4667
19789b4668J164K4148l206Q123j1334K4323n34k9231K769j224J1313k3729l743
19776b5829N622P920j2040q171Q992J7255j2155P414J150j0575M884L7695J1797
19763C3959k3371j6052N119J8084l0932j6078J2018M669j5535k5581l778K9633
19751b7845J0417J8369l217K0624J4341q563j4199R202p191j1835J6567r070j3123
19738e523R661P499K48m479L1817l896k143q765k2413k566j2620J0833J5545o793
$$ y = [-13859, -6073, -265, 1632, -19819, -16609, -1438, -5514, 2351, 13074, -8831, -21540, -10185, -4902, 1347, -24599, -26998, -44308, -34123, -24342, -15950, 1794, 5813, -9860, 6619, 49669, 53717, 11275, -5700, -3590, -4677, -1049, 27145, 48777, 64629, 53545, 42626, -1, -24668, -23504, 644, -2562, 5561, -5773, 18550, 18016, -11215, -8446, -9670, 1643, -22086, -25829, -20207, -12287, -24327, -32498, -23506, -6251, -18406, -10992, -9842, -20417, -15533, 22162, 33959, 10588, -5464, -345, 17739, -13193, -29271, -17253, -12584, -28119, -53700, -57478, -27845, -17428, 941, -2276, 18348, 32689, 24126, 9927, 19129, 11938, 103, 16670, 7600, -5523, 4138, 11637, 11885, 7406, 39223, 35327, 33184, 24419, 2006, -560, -13180, -2347, 13198, 6405]
19724F405n140L913L977J9183j7156j6044j0876J3485O811K3884K1047q034k3991
19711A7464q157J254j4381p434M1249L3647j1189j7756k3185m098l1887L3309
19699H836L5818j4881l1087k2534J9068R875N004J5672j6432J5784J0615P712
19687D3450q86M191K0900j6344j0492j3162j8070m410p544K725L1464K5043j5845
19674D1020j5103M3997J4955r427l1997k4956k3360K9786J0347K0220l01k159
19662E3022j9927N437M302J0045K1044K576j8562j7381p373j8222J6248p06k1320
19649I183K496L6932O974j0265m769J8229M389k0420K0753L7540J9227L6013Q0689
19636B36971Q5009O6661J742j4420p9359q5008n8333l3818j9413K9428N9263J02354
$$ y = [6405, 1265, 5178, 9155, 28338, 11182, -4862, -15738, -2253, 4558, 28442, 49489, 41455, 17464, 9307, 10561, -3820, -11254, 29995, 63642, 52453, 34697, 11512, 7414, -24473, 8836, 44654, 29773, -1314, -23848, -4780, 5095, 10099, 25771, 9339, 25123, 35738, 43450, 42564, 46755, 67655, 51311, 40819, 27657, 9587, 5177, -2367, 358, 31822, 56865, 41020, 25917, 69914, 84869, 75442, 43445, 18489, -4871, 24915, 35262, 55482, 55181, 53022, 33095, 38532, 42834, 52879, 73923, 76499, 57937, 40556, 33183, 14961, 31209, 30503, 9183, 11679, 48611, 55585, 45320, 40551, 58780, 63169, 42749, 63502, 101042, 120269, 156282, 236971, 321980, 388641, 390383, 375963, 296604, 211596, 153263, 119445, 100032, 129460, 188723, 291077]
19624B91077J25284O5921R13k2132r7610j24825r6046l8358k6169J5226k062j5492
19612G5727J9298P478l118J655l0147k3836O001K1348M527K744j1150j5932K0817
19599G5412M5223p298k2926k2127L8139R7821Q3279J38406J15134O0355K0876
19588F22294J7247O222K328k9816j7205q168p7641l9236N6382P7101O6418M3028
19576G18954l961k5699K072j5554m8458r2143j10999j24295q8884l1605J700k2718
19564A58410k6002q718j7759k0080l9368k9598J0460L6859J6395P829Q054k860
19552I3622j1973l1331J2175K6537K8688k996K5258N0154P8831J36544J12025
19541E17534J5688j6255l2942j09995j08290l7133j5569j1085K5848Q8403J01579
$$ y = [291077, 416361, 482282, 483195, 461063, 363453, 238628, 142582, 104224, 78055, 93281, 91219, 75727, 95025, 102503, 99385, 101040, 70893, 47057, 53058, 74406, 78933, 81677, 70527, 54595, 75412, 120635, 113337, 90411, 68284, 106423, 204244, 287523, 425929, 541063, 601418, 622294, 639541, 645763, 648091, 618275, 601070, 592902, 515261, 476025, 532407, 609508, 675926, 718954, 714993, 689294, 691366, 675812, 627354, 535211, 424212, 299917, 211033, 179428, 181128, 158410, 132408, 123690, 105931, 85851, 46483, 16885, 27345, 64204, 80599, 88428, 96482, 93622, 81649, 50318, 62493, 89030, 117718, 114722, 139980, 190134, 268965, 405509, 517534, 533222, 516967, 484025, 374030, 265740, 228607, 213038, 201953, 227801, 316204, 417783]
19530D17783P3351L3943k7376r6468j21463p4159n1557l621Q41j2313l7791j5197
19518H5973K2344j2297k885J2029P178j9568k0319k002Q409k2634k0073p866J1227
19505C9516K437P509J2771k1135L819P752r117q179n127j6044K4729M3963l126
19492G9768k7232J6186q153j0116k3800j4829L568O775J1315j3945Q671j407J2708
19479C9509k8150o964J0741J6254q832Q342J0913j212k6528J0848J6849n764k1027
19466A4979J0222J2651j4710k7685J5259K1377R497J269q600l4264l427K0171
19454A6739J0847Q178k1183j2859j6519J1559K5133j3796K4462K2214L2904j5884
19442G1795l3794J1225j9971j3993O042L257l085j190j5910L261K4357J9287j4174
$$ y = [417783, 491134, 525077, 497701, 401233, 279770, 205611, 154054, 150433, 151274, 138961, 101170, 85973, 108317, 96020, 93135, 105164, 112342, 92774, 72455, 70453, 78862, 56228, 36155, 28289, 39516, 41953, 49462, 62233, 41098, 44917, 52669, 43552, 35373, 30246, 14202, 38931, 82894, 79768, 52536, 68722, 60569, 50453, 26653, 11824, 15392, 22167, 33482, 19537, 28208, 26801, 39509, 11359, 4395, 15136, 31390, 22558, 30900, 41813, 40601, 14073, 24921, 41770, 36006, 14979, 25201, 37852, 23142, -4543, 10716, 32093, 41590, 42859, 34259, -5, -3432, 16739, 27586, 35764, 14581, 1722, -14797, -3238, 21895, 8099, 32561, 54775, 87679, 71795, 38001, 49226, 29255, 15262, 21304, 24561, 21476, 20286, 4376, 7637, 31994, 51281, 37107]
19429C7107O433L259n381N070K2455J5917J2075k4072l5419k181M633j9624J541
19416B1813J6299o081m971j2589j9911L189r942P189J2848L8642J5270q279j0050
19403D3427K826J2407j6257j7571k5923k4202n283L3619Q917N021K720K2106L299
19390D5106j1401n272O912M888J7508P428p70O727j6338o70n924J1850J7738J8714
19376I6496K4082m226j6608p799q776M55J0728K4995k3461J7826k0699j1916J0467
19363I1564K5380o230n529K0725k0256L647M2621L2726M2997M8268J5687R950
19351C01550n9761o2436k0285m948q822n080O476K629L1305M5379O0924Q888m3053
19338B52766m8127l2041l0274k2440o922l4495J659M240K6072N2955J3248k6689
$$ y = [37107, 43540, 46799, 41418, 46488, 68943, 84860, 96935, 72863, 37444, 35263, 39896, 20272, 21813, 38112, 32031, 27060, 14471, -5440, -2251, -12193, -5004, 7844, 46486, 61756, 53477, 43427, 46253, 58660, 42403, 24832, -1091, -25293, -30576, 3043, 11960, 16981, 19701, 41807, 45106, 33705, 28433, 35345, 40233, 57741, 65169, 64399, 71126, 54788, 54118, 48194, 60044, 77782, 96496, 120578, 116352, 99744, 91945, 83169, 83624, 94352, 119347, 95886, 113712, 93013, 81097, 91564, 116944, 110714, 105185, 125910, 105654, 109301, 151922, 184648, 227645, 275913, 291600, 301550, 241789, 179353, 159068, 154120, 145298, 140218, 146694, 149323, 180628, 226007, 286931, 295819, 252766, 204639, 172598, 142324, 119884, 112962, 78467, 80126, 84366, 110438, 163393, 176641, 149952]
19326A49952N009l252L8232K6291l1048k7717K8206L8821k9213n0342L989q685
19314A40243J0123K7798J1719M7863J2330M7442O4842M7154O4916N7055M391q1866
19302D54010n8384n2557m0997j7176p957M4795L4945O0796K5186O7647n413n2192
19290D52703j8301o4947n8565n7699n4470l8089J2494j2836K700k123l286J3215
19278A70796q047j4284Q844K4149L613j830l449j9632m6774j2163K1552L8791
19266A61566J0974J2873K1885L5136M07N956J0911J7069K8927L5126J9997R503
19254C70330O14j0949k8618k6365r758K1075L6499L6737K6907M2585K4988o433
19242D77612o6869p3624m0405k5642l6982l094K4739M3742N2143N0509N8164p105
$$ y = [149952, 154961, 151709, 189941, 216232, 185184, 157467, 185673, 224494, 195281, 144939, 148928, 140243, 150366, 178164, 189883, 237746, 250076, 297518, 362360, 409514, 474430, 531485, 535876, 454010, 395626, 343069, 302072, 284896, 276939, 321734, 356679, 417475, 442661, 510308, 504895, 452703, 434402, 369455, 310890, 253191, 198721, 160632, 173126, 160290, 162990, 160867, 157581, 170796, 162749, 148465, 157309, 181458, 185071, 183241, 179792, 160160, 113386, 101223, 122775, 161566, 172540, 185413, 207298, 242434, 242841, 248797, 259708, 276777, 305704, 340830, 360827, 370330, 370944, 359995, 331377, 305012, 295254, 316329, 352828, 389565, 416472, 459057, 484045, 477612, 410743, 337119, 296714, 271072, 234090, 230996, 255735, 299477, 351620, 402129, 460293, 453188]
19230D53188p0414n0731j8995m683n4727k6342r469J9522M9080J08659R1760M9768
19218E36616l9012m1758k0309k7826k7210j0533k2091n0138o816J9398M171m517
19206C09975R04M4809N4117J0841K4703N7501L1611K7537O4612J8863k9554m3938
19194E71981m3938m8347p625J9612L5116N1685J16957J63918J42980L4501j16828
19183I20012j06307q1659m7683J4180K6541J122k7762L0450R7757J74416K00204
19172A201271J44487K07359K13549J1662j23752q1289j51775k42427j65301j19115
19162H94669l2614M9212M6008L4559M9823L1025J8454L2820N0930J21712J78027
19151A474625J66389P2577J01162J45891J01559N4085j4339j04836j30729m4220
$$ y = [453188, 382774, 332043, 313048, 308365, 253638, 227296, 217827, 237349, 286429, 395088, 486848, 536616, 497604, 455846, 435537, 407711, 380501, 369968, 347877, 297739, 290923, 310321, 314492, 309975, 310879, 355688, 409805, 420646, 445349, 502850, 534461, 561998, 626610, 645473, 615919, 571981, 528043, 479696, 472071, 491683, 526799, 578484, 695441, 859359, 1002339, 1036840, 920012, 813705, 732046, 684363, 698543, 725084, 726206, 698444, 728894, 826651, 1001067, 1201271, 1345758, 1553117, 1766666, 1778328, 1654576, 1573287, 1421512, 1179085, 1013784, 894669, 862055, 911267, 957275, 991834, 1041657, 1072682, 1091136, 1123956, 1174886, 1296598, 1474625, 1641014, 1713591, 1814753, 1960644, 2062203, 2116288, 2101949, 1997113, 1866384, 1822164]
19141A822164J38441K47950L00607L36021M26146M87052L05545J56365J22403
19132D342694n7258j47928K7821J74129L61843O36214R07450J383848K197418
19123I826231L460445N537477R129342J4733615J8759689J2553397K579856k635328
19115G3944724j1677613j7096268j2218117n921973j471087K426243P346351J4137665
19107D9469925J8879207J2161010J518133m157467j4110987j9672911j4344339
19100B9742571q122658m748818l095190k183085j502148r24830n75495k63111
19092H327236j11812q5757N8874J94862K86880K78257K01123J68806K86191O19234
19082A0223894R84858J467352K277890L403379N218832Q787628J4707686K0825943
$$ y = [1822164, 1960605, 2208555, 2509162, 2845183, 3271329, 3758381, 4063926, 4220291, 4342694, 4285436, 4137508, 4165329, 4339458, 4701301, 5337515, 6244965, 7628813, 9826231, 13286676, 18824153, 27953495, 42687110, 61446799, 74000196, 76580052, 73944724, 62267111, 45170843, 32952726, 27030753, 25559666, 27985909, 35332260, 49469925, 68349132, 80510142, 82028275, 77870808, 63759821, 44086910, 29742571, 21619913, 16871095, 13775905, 11592820, 10090672, 9165842, 8590347, 8327236, 8215424, 8129667, 8188541, 8383403, 8670283, 8948540, 9149663, 9318469, 9604660, 10223894, 11208752, 12676104, 14953994, 18357373, 23576205, 32363833, 47071519, 67897462]
19074F7897462J8607288R916672P471901N648422L230084M52421l782769m900043
19066A04541438j1090305j2973634j331032J2066746J3393009N818165M557565
19059A14981952L443270J113590j875148p230079r874142j8456716k4148533j8149465
19051C9804729j0748662o545064m275859k924526k073969j411529q53468m96679
19043A0474973m36893m88093m71370m29886l22699k19629o9729m4650J7042K94226
19033H303292O87645J185727J957820L172088N112798Q510862J4177992K0218516
19025F3326740J7254335N266306k048212j0684064j9103268j5631949p881766
19018C0498122k441500J644205O406295J3116365K0010596J7012362M295599l436163
$$ y = [67897462, 86504750, 96421422, 103893323, 109541745, 112771829, 113224250, 109441481, 104541438, 93451133, 80477499, 79146467, 91213213, 104606222, 110424387, 114981952, 118425222, 119538812, 117663664, 110433585, 100559443, 82102727, 57954194, 39804729, 29056067, 22511003, 18235144, 15310618, 13236649, 11825120, 10971652, 10474973, 10038080, 9549987, 9078617, 8648731, 8326032, 8106403, 8036674, 7992024, 8009066, 8303292, 8990937, 10176664, 12134484, 15306572, 20419370, 28930232, 43108224, 63326740, 80581075, 85847381, 83799169, 73115105, 54011837, 38379888, 30498122, 28056622, 29700827, 36107122, 49223487, 69234083, 86246445, 90542044, 87105881]
19010H7105881j2392223k1603262j8509933j0992877o348655l965673k654606
19003A0638652j929333j475643j048561p11736n51550m83714m04505l13293k71197
18994C449120k74293k28924k11245k29322k50201j67263j06657q0838n7651N6152
18984A898878J28353Q4152l2652o4416j47766k52019k30804j18388o0244n1863
18974A153231m5904n2982m6215m8169p9168o7055m3048k0461j1006j0225k4924
18963G04074j6562l5225l1047j4215O318j8843q288J0335k3692j2577m4829j2339
18951E03110N752l418p772J0464K9068j1508k079J0999J0729J260r866K9535j5192
18938E51082m6526k2444k0487k846J2185j2079L181r258m508M129m149l9890l4219
$$ y = [87105881, 74713658, 53110396, 34600463, 23607586, 17258931, 13293258, 10638652, 8709319, 7233676, 6185115, 5473379, 4921829, 4438115, 4033610, 3720317, 3449120, 3174827, 2945903, 2734658, 2505336, 2255135, 2087872, 1981215, 1900377, 1842726, 1898878, 2027231, 2111383, 2078731, 2014315, 1866549, 1614530, 1383726, 1265338, 1205094, 1153231, 1107327, 1054345, 1008130, 959961, 880793, 813738, 770690, 750229, 739223, 728998, 704074, 687512, 652287, 621240, 607025, 613343, 594500, 586212, 596547, 572855, 560278, 515449, 503110, 508862, 505444, 497672, 508136, 537204, 525696, 523617, 534616, 545345, 546605, 536739, 566274, 551082, 504556, 482112, 461625, 458779, 470964, 458885, 462066, 452808, 448300, 452429, 448280, 408390, 374171]
18925C74171K1061L0173j4777k4851N020m392k9333l1895o05n712q491K6913L8512
18912C75794J0155j0689L782k9577j1788K3045N411n835O19k3811k2696R414L987
18899C27811L539j2110q814J3571K1979Q689p342k2112l4121m1567N618J3328
18887B68469r893J0346L0963o04k0656q020k0326l7389J1321J0067K89p631n266
18874B21670J8026N58m183J3504j0890J257k223j8253M755n32j0162Q125L314
18861B24966M015J4189J8015l323M399l114l3406j0387J9266m407j7326J9210
18849B32097m002j3555M8804J5932l9713k9214m234L707R82r449k3559L122l41
18836A80577P275l296J2043J3555J1737k2751J1936L2748J1293j8695l918j2937
$$ y = [374171, 395232, 425405, 410628, 385777, 390797, 386405, 357072, 325177, 324572, 318860, 310369, 337282, 375794, 385949, 375260, 379042, 349465, 337677, 360722, 366133, 360298, 360917, 337106, 314410, 323824, 327811, 331350, 319240, 310426, 323997, 345976, 354665, 347323, 325211, 291090, 249523, 255141, 268469, 258576, 268922, 299885, 299281, 278625, 270605, 250279, 212890, 224211, 234278, 234567, 226936, 221670, 239696, 240254, 236071, 249575, 238685, 239942, 237719, 219466, 224221, 223689, 213527, 221652, 224966, 228981, 243170, 261185, 257862, 262261, 259147, 225741, 215354, 234620, 230213, 212887, 232097, 228095, 214540, 263344, 279276, 239563, 210349, 206115, 209822, 210804, 201355, 177796, 180918, 180577, 187852, 184556, 196599, 210154, 221891, 199140, 211076, 243824, 255117, 236422, 232504, 219567]
18824B19567j378L393K5336N294K3062K2797J942P227j4714l4568m059M8940J7766
18811C20605l0465j1498l405J8022J6404M655r817k5055K8064J5017k0409J994
18799C04112P015L104K6426k470K639J3457L2289L3500O0186J3633n1907n0296
18787C91688N667M0605Q4004N1706M4633N0262j1738o1524o9579k3429k3334j2118
18775D66843N0616L1571k1762n3570n4643L3384Q6877P0418O2653Q6274K6330
18764G84991j15603q1680l3391K0226N079J6617Q1263J23373Q442n5992J5225
18753G68550N6051K8311M0678N2857L5208j6770p572P7353J25911L3116Q239N3143
18741A255075M2626O5170J05627J73192J73380J57546J55006J32253J34027J03411
$$ y = [219567, 218189, 221582, 246918, 252212, 275274, 298071, 300013, 307240, 292526, 257958, 253899, 302839, 320605, 290140, 278642, 275237, 293259, 309663, 314318, 304501, 279446, 307510, 322527, 302118, 304112, 311127, 314231, 340657, 338187, 340826, 354283, 386572, 420072, 480258, 493891, 441984, 391688, 397355, 437960, 521964, 573670, 618303, 668565, 656827, 595303, 525724, 502295, 478961, 466843, 517459, 549030, 527268, 473698, 419055, 452439, 539316, 609734, 672387, 758661, 784991, 669388, 587708, 554317, 574543, 579622, 596239, 677502, 800875, 809317, 753325, 768550, 824601, 852912, 893590, 946447, 981655, 964885, 957313, 1034666, 1160577, 1193693, 1201932, 1255075, 1297701, 1362871, 1468498, 1641690, 1815070, 1972616, 2127622, 2259875, 2393902, 2497313]
18731B497313J71588K99049N68059R33921J423295K040817L023163N275815R296364
18722B5529384J3911857R311300q959195j3893979q204144l880293j739386n32418
18714A1543126M98146J974773M465503Q496223J2916810Q165610r565818j3887029
18706B4607344q158054m064034k291889j604347j212193q81571n36823k43164
18698E615269m7953P1979K45976M97547Q74128J423659K111104L202360N438471
18689A9432540R513027J4172148Q893289r335003j3351663p550543l349184r91319
18681A7433292O84626K415423M836474R126198J6576288K6360433K5524675l602212
18673I9355197k6400797j9332473n856863M580105J2365702Q507701j0280536
$$ y = [2497313, 2668901, 2967950, 3536009, 4469930, 5893225, 7934042, 10957205, 16233020, 25529384, 39441241, 48752541, 39793346, 25899367, 17695223, 13814930, 12075544, 11543126, 12041272, 14016045, 18481548, 26977771, 39894581, 48060191, 38494373, 24607344, 16449290, 12385256, 10093367, 8489020, 7276827, 6395256, 5858433, 5615269, 5567316, 5639295, 5885271, 6382818, 7256946, 8680605, 10791709, 13994069, 19432540, 28945567, 43117715, 52011004, 42676001, 29324338, 21773795, 18424611, 17433292, 18117918, 20533341, 25369815, 34496013, 51072301, 77432734, 102957409, 99355197, 72954400, 53621927, 47765064, 52345169, 64710871, 73218572, 62938036]
18666F2938036j3466039l657209O230005J2705847L738190j3446810j2124831
18659D2917189k872560N485074J2000578O558273j2955536j6723692r824713n045179
18651A9539434k869833j636931p80121o4495N73530J337886K364807M148358P894923
18642C0507558J3833717J8156532M907112j3645365j1090514j628195O855692
18635D7896537J3710946R021092r516304j2075210k200180P833594J3984510L349530
18627G2004515j2472823q642327K587494J4565532K6925803K6144667p294925
18620A13817936l4046463k7350188j4795503p839268m375062k075608O0107K679870
18612B6075821O647160J2604748J6905895L638351j7290729j6883671r383358
$$ y = [62938036, 49471997, 45814788, 52044793, 64750640, 68488830, 55042020, 42917189, 40044629, 45529703, 57530281, 64088554, 51133018, 34409326, 24584613, 19539434, 16669601, 15032670, 14252549, 14188054, 14761584, 16099470, 18464277, 22612635, 30507558, 44341275, 62497807, 67404919, 53759554, 42669040, 41040845, 47896537, 61607483, 70628575, 61112271, 49037061, 46836881, 54670475, 68654985, 72004515, 59531692, 50889365, 53476859, 68042391, 94968194, 121112861, 113817936, 79771473, 52421285, 37625782, 29786514, 25411452, 23335844, 23395951, 26075821, 32722981, 45327729, 62233624, 65871975, 48581246, 31697575, 22314217]
18605B2314217n053539l149607k101983j306090p59668o52935m61704l24342r3339
18596H411010L32636Q16546J277612J922604K892476M879858Q870796J5144347
18588D4547885J9180604L483786j8164594j6898122q867064m236746k038345m24447
18580A6582957J226212L541826P413162J3257461J7109429K768811j7651769j6602797
18572B7645292r226719n064491l211041k226505j476088j004484p58309o04555
18564D073100m59288k88058j89286j23640j89186k53836j83787j14612m6593L5484
18554B260298Q4426J00882Q1264j3675l35M0376l7817o6148o3049n4214N125K1840
18542B358973k0886M2005J14598K3516m0992k3832j15317j58495j03039m4929
$$ y = [22314217, 17260678, 14111071, 12009088, 10702998, 9943330, 9290395, 8828691, 8504349, 8411010, 8743646, 9560192, 10837804, 12760408, 15652884, 20532742, 29403538, 44547885, 63728489, 67212275, 49047681, 32149559, 23282495, 19045749, 17007404, 16582957, 17809169, 21350995, 28764157, 42021618, 59131047, 61899858, 44248089, 27645292, 18418573, 13354082, 10143041, 7916536, 6440448, 5435964, 4677655, 4073100, 3613812, 3325754, 3136468, 3012828, 2823642, 2569806, 2386019, 2271407, 2224814, 2260298, 2344724, 2445606, 2526870, 2513195, 2512860, 2553236, 2515419, 2449271, 2386222, 2332008, 2337133, 2358973, 2338087, 2380092, 2494690, 2518206, 2477214, 2453382, 2338065, 2179570, 2076531, 2031602]
18532B031602N126n7701j78323j98269k21237k37028j44234j27111n3999m8069
18522G70757j8978l1824N620k3294m0394l5191L999L9030N7384M7673k5602l2772
18510G16408j7614J586N5364P0372L7921M0868J14020J26537P3412J3240o9665
18499A162449p3678j26080j63587j29663n7580j2246K6161P4964J22085J09865
18489I32690N6459J0894M5967l3757j20198p9227n3561q7730m4268J8217O4509
18478G09995P6071J9472J4772M3048N4626K9305P5j1600o2435p5474j8874N8270
18466H37251R8327J1488j9398o0856j79969j27299m1924J591n275J0814q826m9345
18454D66579j3674j6102n9755n7855m6882j9762J4841J6819j0767N59J3628j1557
$$ y = [2031602, 2036728, 1979027, 1800704, 1602435, 1381198, 1144170, 999936, 872825, 818826, 770757, 751779, 719955, 725575, 702281, 661887, 626696, 630695, 669725, 727109, 774782, 749180, 716408, 698794, 700380, 755744, 826116, 864037, 904905, 1018925, 1145462, 1218874, 1232114, 1162449, 1088771, 962691, 799104, 669441, 611861, 599615, 625776, 700740, 822825, 932690, 989149, 1000043, 1046010, 1012253, 892055, 812828, 759267, 671537, 627269, 645486, 709995, 786066, 805538, 820310, 863358, 917984, 947289, 947364, 935764, 873329, 797855, 778981, 837251, 935578, 947066, 927668, 866812, 686843, 559544, 517620, 519211, 513936, 524750, 515924, 466579, 452905, 436803, 377048, 319193, 272311, 252549, 267390, 284209, 273442, 274001, 287629, 276072]
18442B76072n8771k1772P055J4770j053j3848m6P403m889k6046j4303N1624J8319
18429B34515j1696J3354M0723N6530L1132K5926K3029K8658N0142Q9739L7719
18418F19771M2659k1420j12800m3854M4787P6868L7499n1351p8176q7551r4250
18407C32182o9258r197q97j2757k2737J3149K2092j4730j1176n037J2030k4117
18395B09547m2103q900R807J9095l9621j1674P367J2572M038L0179L2747k705
18383B20349j3324M972N745N541L7341J585K915N931O575k4324n119K6184J8356
18370B92727r44j0489M76K4834k6615L6n96O380J6359j7869k2090k9042q081l79
18356B24707j1807p866P65k565j3890K9317j4235k3195K574L3755O590m894l02
$$ y = [276072, 217301, 195529, 202584, 217354, 216301, 202453, 202407, 209810, 204921, 178875, 164572, 216196, 234515, 222819, 236173, 276896, 333426, 364558, 390484, 413513, 442171, 492313, 582052, 619771, 662430, 641010, 528210, 484356, 529143, 606011, 643510, 592159, 513983, 426432, 332182, 262924, 253727, 252830, 240073, 217336, 230485, 252577, 237847, 226671, 221634, 233664, 209547, 167444, 158544, 168351, 187446, 147825, 136151, 143518, 156090, 160128, 190307, 223054, 220349, 207025, 211997, 217742, 223283, 260624, 262209, 265124, 271055, 277630, 253306, 248187, 274371, 292727, 291783, 281294, 281770, 306604, 279989, 280025, 279429, 285809, 302168, 284299, 262209, 233167, 225086, 224707, 212900, 205034, 205799, 203234, 189344, 218661, 204426, 181231, 183805, 217560, 224150, 219256, 218954]
18343B18954L3668k184k213n629j1669j7135J7050K5037Q622j5064L202p837n758
18330B39044q853J0353j1195j2980R396k0564n0035k4630J3773P906J6872K6389
18318A95476J6050j74K814j1794k523j9148L942L2979J0978m0972k1569K9577
18306A95636M2647j40p87j8507n674N520K7798L1822K6308J2761K8477O000J2421
18293C64282K465l0397N580J3619j0628J1937M7322L5973j6356j8396j0721k8987
18281C65693j4335j0770J8642k0160j6960L3697L6073M0286J5982k7424l2801
18270C87923j914J5921O476M021M5121K4527m2259o1055m4826L411K251J9138
18258C58735J539K4162L1723k379j9095J3793K0356K6593L4374L5004r844n3245
$$ y = [218954, 252622, 250438, 248225, 242596, 230927, 213792, 230842, 255879, 264501, 249437, 252639, 244802, 239044, 230191, 240544, 229349, 216369, 225765, 205201, 155166, 130536, 144309, 152215, 169087, 195476, 211526, 211352, 214166, 202372, 199849, 180701, 184643, 217622, 228600, 187628, 166059, 195636, 238283, 238143, 237356, 218849, 213175, 218695, 246493, 278315, 304623, 317384, 345861, 351861, 364282, 366747, 336350, 341930, 355549, 344921, 356858, 404180, 440153, 423797, 405401, 394680, 365693, 351358, 340588, 359230, 339070, 322110, 355807, 391880, 432166, 448148, 420724, 387923, 386009, 401930, 408406, 412427, 457548, 482075, 439816, 378761, 333935, 337346, 339597, 358735, 360274, 384436, 416159, 413780, 394685, 408478, 428834, 455427, 489801, 524805, 514961, 461716]
18246D61716l818L5420M6059k465n888J1047K1733L5216j6275j9427m4842l0076
18234D88400Q628K7370k042k3798p146J2533K8762K113K860M486K5458N8047R6941
18221G22612R2489l854m4456k5042K9888K9264O5617J13425N882p0282m0113l2051
18209H43379r004j6871J6573P5054P9603N5340J7613p067J1159L3159P7450J19965
18197A296353P4971L3537J867K9041J09053J51057K26283K09712J24279L7952
18187B294105Q3414K31613K83162K01247Q9250K2262K2982J44176K87958L33223
18177C993392L25025L40091M23239O45362J004110J538403K178491L005234M607806
18168A8061153P610851J2628191J8132136J4449430J043994n092623M119959J7439423
$$ y = [461716, 457898, 493318, 539377, 536912, 531024, 542071, 563804, 599020, 582745, 563318, 518476, 488400, 497028, 524398, 522356, 498558, 491412, 503945, 532707, 534820, 537680, 542166, 567624, 625671, 722612, 815101, 811247, 766791, 741749, 771637, 800901, 866518, 979943, 985825, 915543, 875430, 843379, 834375, 817504, 834077, 909131, 988734, 1044074, 1061687, 1054620, 1065779, 1098938, 1176388, 1296353, 1371324, 1404861, 1406728, 1435769, 1544822, 1695879, 1922162, 2131874, 2256153, 2294105, 2377519, 2609132, 2892294, 3093541, 3182791, 3205053, 3228035, 3372211, 3660169, 3993392, 4318417, 4658508, 5081747, 5727109, 6731219, 8269622, 10448113, 13453347, 18061153, 25672004, 38300195, 56432331, 70881761, 71925755, 66833132, 70953091, 88392514]
18160H8392514K0374488R546202q176893j9595961j5842993j799098O816905j436488
18152G8278676j6789914j9904081j3041702p389486m457135k867503j800122j116735
18144A0911998p52359n77977l04392j31367j85766l05224k53319M994J78649J57778
18134H743015O8673k455M9640K54278N72232Q10225P71175P22349J056948J736694
18124A4782774K665245M027520O368929J0329500J6624503K2615555K0096148
18117I7510174J3632755J0013320Q823232J2808822J9025242J9160406R862102
18110A90836053j750048n696882K399268J0839718j4040714l2939777l0048582
18103A19599036l1281198k7484249j7694526j0534565o669361m659753l350211
$$ y = [88392514, 108767002, 118313204, 110136311, 90540350, 74697357, 72898259, 79715164, 78278676, 61488762, 41584681, 28542979, 21153493, 16696358, 13828855, 12028733, 10911998, 10159639, 9581662, 9277270, 9145903, 8960137, 8654913, 8401594, 8406588, 8585237, 8743015, 8811688, 8809233, 8858873, 9113151, 9685383, 10495608, 11266783, 11989132, 13046080, 14782774, 17448019, 21475539, 27844468, 38173968, 54798471, 77414026, 97510174, 111142929, 121156249, 129979481, 142788303, 161813545, 180973951, 190836053, 189086005, 183389123, 185788391, 196628109, 182587395, 149647618, 119599036, 88317838, 60833589, 43139063, 32604498, 25935137, 21275384, 17925173]
18096A7925173k309514j575811j243212j075546q29657n60378m10871l06326j59492
18087I454366j53406k75113l86677k80537m0064Q7117L8894l2033L0694Q7145
18077H530386L50217R34434J659073K478879L796116O627746J1108842J4360217
18069D9845910Q707494j772963l655644N437955J4854611J4112159L347617r955519
18061H0921620j5706435r848875R09103M543083m279156j4341270j3906154q509156
18053A9782760m802091k973149k014065j354519q90791n91526m26765k97831k08787
18044F223236k56687m04538l36885j15416J52551K34718K53897K59041K89980
18035F299897L07402M42903N70151M93247N61825R92937J629201K391875L529786
$$ y = [17925173, 15615659, 14039848, 12796636, 11721090, 10891433, 10331055, 9920184, 9613858, 9454366, 9300960, 9025847, 8639170, 8358633, 8318569, 8405686, 8444580, 8412547, 8443241, 8530386, 8880603, 9815037, 11474110, 13952989, 17749105, 24376851, 35485693, 49845910, 58553404, 56780441, 53124797, 58562752, 73417363, 87529522, 90877139, 80921620, 65215185, 55366310, 56275413, 60818496, 56539340, 42198070, 28291916, 19782760, 14980669, 12007520, 9993455, 8638936, 7748145, 7156619, 6729854, 6432023, 6223236, 5966549, 5562011, 5225126, 5109710, 5262261, 5496979, 5750876, 6009917, 6299897, 6607299, 7050202, 7620353, 8113600, 8675425, 9668362, 11297563, 13689438, 17219224]
18026A7219224N529952R251774J5748004K4251206K2692225P007279L884344m447800
18018A01136208j4615133l787364R838097N590753n002016o128365j7831353k2470708
18010D6730119j4737258q344419m994991l222898k261060j636199j286137j061107
18002I186050q95469o68343l85117k47385k20280l34156m36576m83536m35947
17993E079241k98129j41501J438K2772P5553Q4157Q3410R7226K33313L65793M03754
17982F007027M42252N38788N31569M86837O97460J011882J465319K081281L091639
17973A6354054M863243Q092057J3744741K1110513J9496499N851277L329936m086412
17965H8755908j1512388p18071J1479029P922371m13265k36172p810101n360709
$$ y = [17219224, 22749176, 32000950, 47748954, 72000160, 94692385, 101699664, 105584008, 101136208, 86521075, 82733711, 92571808, 98162561, 93160545, 87032180, 69200827, 46730119, 31992861, 23648442, 18653451, 15430553, 13169493, 11533294, 10247157, 9186050, 8290581, 7622238, 7237121, 6989736, 6769456, 6435300, 5998724, 5515188, 5079241, 4781112, 4639611, 4641049, 4663821, 4739374, 4823531, 4906941, 5004167, 5237480, 5603273, 6007027, 6449279, 6988067, 7519636, 8006473, 8703933, 9715815, 11181134, 13262415, 16354054, 21217297, 29309354, 43054095, 64164608, 83661107, 89512384, 92842320, 88755908, 77243520, 76525449, 88004478, 95926849, 95513584, 95277412, 87467311, 82106602]
17957H2106602R977148J6342897M044797M93332n274621j5704251n897715R195920
17949I5284109P899630m017379n690965j6972386k3804023j6376743r533254n854416
17941B0934573l874790k744873k016934j453203j058695r13184p56534n84089
17933G532271m75467l99215l33913l30031l97414m10993l16495k24288j31276
17924D513179j03279l9632O1600K7008M2621J43163K01013K01866K11871K48790
17914E508200L07305L77386O29553R73124J389272J907737K754385M279334P122553
17905B5248849J2225154J9402816K0217680O926795K670528k677769j2177176
17898G1836877l838737R214320P925592k795331m436103j4624807k0741964j4199175
$$ y = [82106602, 92083750, 108426647, 112471444, 112964776, 107690155, 91985904, 86088189, 95284109, 103183739, 99166360, 93475395, 76503009, 52698986, 36322243, 26788989, 20934573, 17059783, 14314910, 12297976, 10844773, 9786078, 8872894, 8116360, 7532271, 7056804, 6657589, 6323676, 5993645, 5596231, 5185238, 4868743, 4644455, 4513179, 4409900, 4370268, 4431868, 4458876, 4501497, 4644660, 4845673, 5047539, 5259410, 5508200, 5815505, 6192891, 6822444, 7795568, 9184840, 11092577, 13846962, 18126296, 25248849, 37474003, 56876819, 77094499, 84021294, 86691822, 84014053, 71836877, 67998140, 77212460, 85138052, 82342721, 77906618, 63281811, 42539847, 28340672]
17890B8340672q117074m867874l118250k155170j615296j186098q24360o55591
17882E800959n91865m45204l77492l37094k51960k69047l24784l24778k95305
17873B583430j85035j04473j27653j38629j26819j45454j51664j42258j24162
17864A337283q2781o5068n5170j1914k1398n7787m4693l2513n6227o3580j9465
17853H26687Q100j0928m2579m170K6203n445j2693j0238k7302m4771N947R772
17841G18583j8234k2839j147j5389j4023k3049l4097l4817j6104j5510p962J6992
17829E32404Q046j3900j3533j8129j4237K758k3590k5155j6429P930J618K4481
17817D52264J200k7860j0368k4147K230N099l222j5397j1435j2056J2262K5008
$$ y = [28340672, 20223598, 15355724, 12237474, 10082304, 8467008, 7280910, 6456550, 5800959, 5209094, 4763890, 4386398, 4049304, 3797344, 3528297, 3203513, 2878735, 2583430, 2398395, 2293922, 2166269, 2027640, 1900821, 1755367, 1603703, 1461445, 1337283, 1254502, 1189434, 1134264, 1122350, 1100952, 1043165, 998472, 965959, 909732, 846152, 826687, 834787, 823859, 781280, 777110, 803313, 797868, 785175, 774937, 747635, 702864, 708811, 718583, 700349, 677510, 676363, 660974, 646951, 623902, 589805, 554988, 538884, 523374, 515412, 532404, 540450, 526550, 513017, 494888, 480651, 483409, 459819, 434664, 418235, 426165, 427783, 452264, 453464, 425604, 415236, 391089, 393319, 398418, 395196, 379799, 368364, 356308, 368570, 393578]
17805C93578k4263j6521j3398j9692N567m541j7034J7334Q354l0718j9737l0212
17793B48717j2041N022K7779J0051J0460J2681J8747J4983J0133M315l218j5340
17781C32289j5417n4378l264L5147K1445J0577J801o7281m9850M6712M0123j2504
17769B85400k2714k478l3308j2383j6233l7336j0982J8750L2058J827m610J6908
17757B14899k2741m8517j0091J4251Q601J5354J325k3649m720J1311j1254N7200
17745B01969J4441j9956k197J8463r083j849O020j0236j6160J3527J3037J0891
17733B18867j1477j6953K3277J7711P211K597j3135J1871R975k1307m3457j9974
17721A65206m188l2238j1401J2520L232l505m2923j2655L1806P885k705j1419
$$ y = [393578, 369315, 352794, 339396, 319704, 325271, 320730, 303696, 321030, 329384, 298666, 278929, 248717, 236676, 241698, 269477, 279528, 289988, 302669, 321416, 336399, 346532, 350847, 347629, 332289, 316872, 262494, 259230, 294377, 315822, 326399, 328200, 260919, 211069, 257781, 297904, 285400, 262686, 260208, 226900, 214517, 198284, 160948, 149966, 168716, 200774, 202601, 197991, 214899, 192158, 143641, 133550, 147801, 156402, 171756, 173081, 149432, 144712, 156023, 144769, 201969, 216410, 196454, 194257, 212720, 203637, 201788, 207808, 197572, 181412, 194939, 207976, 218867, 207390, 190437, 213714, 231425, 238636, 241233, 228098, 239969, 249944, 228637, 185180, 165206, 161018, 128780, 117379, 129899, 133131, 129626, 86703, 74048, 105854, 113739, 111034, 99615]
17709I9615N896M874j8199j4073N390j0972k2036j3500J3682L2087J2498j4053
17697H1209P017J1780k9361k6172P08K6765J9111J6657p838l817J6529J4810J8656
17684A46054J3594K7696N745k7850j1883O440p094l068k1062J27L378j8057M348
17671A18368j5084l6605j4227o195L2102L064j769P437O316M392q402k546o082
17658H0769J5784R780l6464l8807K9842K4787J7786J4333N757J2010L7295J0150
17646A83022L2582R7079Q4543O1698K3414j5877M005J10193O6331Q366n4675n2799
17634E47882l5085k5666K7830l8256r1800q0217m3438l1186k6373l0503j0950
17623A62238o419L099j6606p536n367n837m960M395J503J0714j7177r581J7405
$$ y = [99615, 105511, 110385, 92186, 78113, 83503, 72531, 50495, 36995, 50677, 82764, 95262, 81209, 88226, 100006, 70645, 44473, 45181, 71946, 91057, 107714, 99876, 96059, 112588, 127398, 146054, 159648, 187344, 193089, 165239, 153356, 159796, 152702, 149634, 128572, 128699, 132077, 114020, 118368, 103284, 66679, 52452, 46257, 78359, 81423, 79654, 87091, 93407, 97799, 89397, 86851, 80769, 96553, 106333, 69869, 31062, 60904, 85691, 103477, 117810, 123567, 135577, 172872, 183022, 215604, 312683, 397226, 458924, 482338, 466461, 470466, 580659, 646990, 655356, 600681, 547882, 512797, 487131, 514961, 476705, 384905, 304688, 261250, 230064, 203691, 173188, 162238, 155819, 158918, 142312, 134776, 129409, 123572, 118612, 123007, 124510, 135224, 118047, 108466, 125871]
17610A25871J8352o599k9020N147J8561O693J7403R307j8993Q145O3960N4725
17598B73552R5469J12353Q0897R7472P0087L9613O6146P5052R2735L5610l5530
17587A003456r2704j18712n7283m4366m6910l9070j06990j46319p6674m2595m7384
17576A84449l0543o837o381K7453J8755j1630k8906j4080j4517l263l5322j8819
17564F0359m331K5455J5085J9045j997O391j9187j416K1084j093J4095j6837j5129
17551A01524K7461M8446J05352R0383M8285j716q566M6462Q8314L8282p442m4792
17539E31993q9285n0318p877o086l3342o1627q1417m6383k9399k7289r830L4092
17527A23232K213j1063k5408J236K078n84L0006J4053l3558J2884J04p372l339
$$ y = [125871, 144223, 137624, 108604, 113751, 132312, 139005, 156408, 165715, 146722, 154867, 218827, 273552, 369021, 481374, 562271, 659743, 729830, 769443, 835589, 910641, 1003376, 1038986, 1003456, 910752, 792040, 734757, 690391, 643481, 604411, 497421, 351102, 274428, 231833, 184449, 153906, 147069, 140688, 168141, 186896, 175266, 146360, 132280, 117763, 114500, 79178, 60359, 56028, 81483, 96568, 115613, 113616, 120007, 100820, 99404, 120488, 119395, 133490, 116653, 101524, 128985, 177431, 282783, 373166, 421451, 419735, 411169, 457631, 545945, 584227, 576785, 531993, 442708, 392390, 384513, 378427, 345085, 283458, 202041, 155658, 126259, 98970, 89140, 123232, 125445, 114382, 88974, 90210, 92288, 91704, 121710, 135763, 102205, 115089, 115193, 107821, 104482]
17514A04482o740j8545j2310k06j057l779K8382J1339j9392J5621J0021K1582
17502A29398K4212M3420N2100R4322J25520Q3446o322J3457l0043o6221K0467
17491D83756P6913J1492j8173o3226j42078j43953o2173o090m2722J4137K36l16
17479A07803J839j9389k7040n40j1670J2240J4566K1216n484m2062m0445j8749
17467g715M15J1735L2359J247j6451N179O076M207M454J7731J3141L2370J7863
17454A22611j415l307n685j0802J4282K6540L4972P4692J11495J26679Q8424M3369
17442F21855P5147P5887L9777o7873p0635l9676k9806l0567r5923m5703O7848
17431E00331R8833J5020k305o0484o2749J2907M6820J4324j7261k7286j15343
$$ y = [104482, 97742, 79197, 66887, 66681, 65624, 61845, 90227, 101566, 82174, 97795, 107816, 129398, 153610, 197030, 249130, 343452, 468972, 552418, 546096, 559553, 529510, 463289, 483756, 560669, 572161, 553988, 490762, 348684, 204731, 142558, 136468, 93746, 107883, 108119, 107803, 109642, 90253, 63213, 62673, 51003, 63243, 77809, 99025, 93541, 51479, 11034, -7715, -7300, 4435, 36794, 38041, 21590, 26769, 32845, 37052, 41506, 59237, 72378, 104748, 122611, 121196, 117889, 112204, 101402, 115684, 142224, 177196, 251888, 363383, 490062, 578486, 621855, 697002, 772889, 812666, 744793, 674158, 634482, 604676, 574109, 478186, 432483, 500331, 599164, 614184, 611879, 551395, 488646, 501553, 548373, 562697, 545436, 518150, 402807]
17420D02807j02253p9060m2062j911o4805m0829Q806r794j2498M383P007J7693
17408H7484K4692k3109k6674j1887j2341j6358k557R765K2557K475k967M931J2608
$$ y = [402807, 300554, 221494, 179432, 177521, 112716, 71887, 80693, 70899, 58401, 62784, 69791, 87484, 112176, 89067, 62393, 50506, 38165, 21807, 19250, 29015, 51572, 54047, 51080, 56011, 68619]
$$ [...]
##END NTUPLES=NMR SPECTRUM
##END=
