##TITLE=Analysis number 329028
Compound Code sew 04169
Book Reference 505/173
Project Code adrs
Chemist Name robb
##JCAMPDX= 6.0         $$ Bruker NMR JCAMP-DX V2.0
##DATA TYPE= NMR SPECTRUM
##DATA CLASS= NTUPLES
##ORIGIN= Bruker BioSpin GmbH
##OWNER= nmr
$$ XWIN-NMR		Version 3.5
$$ Wed Jul 25 13:47:18 2007 GMT Daylight Time (UT+1h)  MAYBRIDGE\nmr@NMR_250MHZ
##.OBSERVE FREQUENCY= 250.131544655141
##.OBSERVE NUCLEUS= ^1H
##.ACQUISITION MODE= SIMULTANEOUS (DQD)
##.ACQUISITION SCHEME= undefined
##.AVERAGES= 16
##.DIGITISER RES= 18
##SPECTROMETER/DATA SYSTEM= dpx250
##.PULSE SEQUENCE= zg30
##.SOLVENT NAME= CDCl3
##.SHIFT REFERENCE= (INTERNAL, CDCl3, 0, 16.522)
##AUDIT TRAIL= $$ (NUMBER, WHEN, WHO, WHERE, WHAT)
$$ ##TITLE= Audit trail, XWIN-NMR		Version 3.5
$$ ##JCAMPDX= 5.01
$$ ##ORIGIN= Bruker BioSpin GmbH
$$ ##OWNER= nmr
$$ C:\u/data/dgb/nmr/ADRS/1490/pdata/1/auditp.txt
$$ ##AUDIT TRAIL=  $$ (NUMBER, WHEN, WHO, WHERE, WHAT)
(   1,<2007-07-25 13:46:57.12 +100>,<MAYBRIDGE\nmr>,<NMR_250MHZ>,
      <created by zg, POWCHK disabled, PULCHK disabled
       configuration hash MD5:
       76 6E 9A 78 1E 09 19 81 EC 84 63 8F B0 6A 59 2D
       data hash MD5: 64K
       3A 0A 16 2D C7 8C 9C 5F 1A 96 32 8D C5 69 50 E9>)
(   2,<2007-07-25 13:47:08.99 +100>,<MAYBRIDGE\nmr>,<NMR_250MHZ>,
      <Start of raw data processing
       ef LB = 0.3 FT_mod = 6 PKNL = 1 SI = 32K 
       data hash MD5: 32K
       FC 0C F1 84 E0 D6 FB 46 A1 6E EF 2F C9 94 90 96>)
(   3,<2007-07-25 13:47:10.79 +100>,<MAYBRIDGE\nmr>,<NMR_250MHZ>,
      <apk 
       data hash MD5: 32K
       1F 36 BE 73 CA B1 5C 86 55 45 4E E4 5C 41 98 BF>)
(   4,<2007-07-25 13:47:11.49 +100>,<MAYBRIDGE\nmr>,<NMR_250MHZ>,
      <abs ABSG = 5 
       data hash MD5: 32K
       53 5A 15 CC BF DB BB 56 56 DD D8 E7 BF 64 42 DA>)
$$ ##END=
$$ 
$$ hash MD5
$$ FD B7 9F A3 55 28 23 BE 43 2A 84 73 B4 2B 23 D7
##$RELAX= 
##$RELAX= 
##$RELAX= 
##$RELAX= 
##$RELAX= 
##$RELAX= 
##$RELAX= 
$$ Bruker specific parameters
$$ --------------------------
##$DU= <C:\u>
##$EXPNO= 1490
##$NAME= <ADRS>
##$PROCNO= 1
##$TYPE= <nmr>
##$USER= <dgb>
##$AMP= (0..31)
100 100 100 100 100 100 100 100 100 100 100 100 100 100 100 100 100 100 
100 100 100 100 100 100 100 100 100 100 100 100 100 100 
##$AQSEQ= 0
##$AQ_mod= 3
##$AUNM= <au_zg>
##$AUTOPOS= <35 >
##$BF1= 250.13
##$BF2= 250.13
##$BF3= 250.13
##$BF4= 250.13
##$BF5= 500.13
##$BF6= 500.13
##$BF7= 500.13
##$BF8= 500.13
##$BYTORDA= 1
##$CFDGTYP= 0
##$CFRGTYP= 5
##$CHEMSTR= <none>
##$CNST= (0..31)
1 1 145 1 1 1 1 1 1 1 1 1 1 1 1 1 1 1 1 1 1 1 1 1 1 1 1 1 1 1 1 1 
##$CPDPRG= <>
##$CPDPRG1= <>
##$CPDPRG2= <>
##$CPDPRG3= <>
##$CPDPRG4= <mlev>
##$CPDPRG5= <mlev>
##$CPDPRG6= <mlev>
##$CPDPRG7= <mlev>
##$CPDPRG8= <mlev>
##$CPDPRGB= <>
##$CPDPRGT= <>
##$D= (0..31)
0 1 0 0 0 0 0 0 0 0.06 0 0 0 0 0 0 0.0002 0 0 0 0 0 0 0 0 0 0 0 0 0 0 
0 
##$DATE= 1185367615
##$DBL= (0..7)
120 120 120 120 120 120 120 120 
##$DBP= (0..7)
150 150 150 150 150 150 150 150 
##$DBP07= 0
##$DBPNAM0= <>
##$DBPNAM1= <>
$$ [...]
##$SUBNAM7= <"">
##$SUBNAM8= <"">
##$SUBNAM9= <"">
##$SW= 20.6930455092707
##$SWIBOX= (0..15)
0 0 3 0 0 0 0 0 0 0 0 0 0 0 0 0 
##$SW_h= 5175.983436853
##$TD= 65536
##$TD0= 1
##$TE= 296.16
##$TE2= 300
##$TE3= 300
##$TEG= 300
##$TL= (0..7)
0 120 120 120 120 120 120 120 
##$TP= (0..7)
150 150 150 150 150 150 150 150 
##$TP07= 0
##$TPNAME0= <>
##$TPNAME1= <>
##$TPNAME2= <>
##$TPNAME3= <>
##$TPNAME4= <>
##$TPNAME5= <>
##$TPNAME6= <>
##$TPNAME7= <>
##$TPOAL= (0..7)
0.5 0.5 0.5 0.5 0.5 0.5 0.5 0.5 
##$TPOFFS= (0..7)
0 0 0 0 0 0 0 0 
##$TUNHIN= 0
##$TUNHOUT= 0
##$TUNXOUT= 0
##$USERA1= <user>
##$USERA2= <user>
##$USERA3= <user>
##$USERA4= <user>
##$USERA5= <user>
##$V9= 5
##$VALIST= <valist>
##$VCLIST= <CCCCCCCCCCCCCCC>
##$VD= 0
##$VDLIST= <DDDDDDDDDDDDDDD>
##$VPLIST= <PPPPPPPPPPPPPPP>
##$VTLIST= <TTTTTTTTTTTTTTT>
##$WBST= 1024
##$WBSW= 4
##$XGAIN= (0..3)
0 0 0 0 
##$XL= 0
##$YL= 0
##$YMAX_a= 373900
##$YMIN_a= -386135
##$ZGOPTNS= <>
##$ZL1= 120
##$ZL2= 120
##$ZL3= 120
##$ZL4= 120
##$ABSF1= 16.522
##$ABSF2= -4.171173
##$ABSG= 5
##$ABSL= 3
##$ALPHA= 0
##$AQORDER= 0
##$ASSFAC= 0
##$ASSFACI= 0
##$ASSFACX= 0
##$ASSWID= 0
##$AUNMP= <proc_1d>
##$AZFE= 0.1
##$AZFW= 0.1
##$BCFW= 0
##$BC_mod= 0
##$BYTORDP= 0
##$COROFFS= 0
##$CY= 12.5
##$DATMOD= 1
##$DC= 0
##$DFILT= <>
##$DTYPP= 0
##$F1P= 14.0000005364418
##$F2P= -0.99999901652339
##$FCOR= 0.5
##$FTSIZE= 32768
##$FT_mod= 6
##$GAMMA= 0
##$GB= 0
##$INTBC= 1
##$INTSCL= 1
##$ISEN= 128
##$LB= 0.3
##$LEV0= 0
##$LPBIN= 0
##$MAXI= 10000
##$MC2= 0
##$MEAN= 0
##$ME_mod= 0
##$MI= 0
##$NCOEF= 0
##$NC_proc= -3
##$NLEV= 6
##$NOISF1= 0
##$NOISF2= 0
##$NSP= 0
##$NTH_PI= 0
##$NZP= 0
##$OFFSET= 16.522
##$PC= 1
##$PHC0= -52.75518
##$PHC1= 8.443749
##$PH_mod= 1
##$PKNL= yes
##$PPARMOD= 0
##$PSCAL= 4
##$PSIGN= 0
##$REVERSE= no
##$SF= 250.13
##$SI= 32768
##$SIGF1= 0
##$SIGF2= 0
##$SINO= 400
##$SIOLD= 32768
##$SREGLST= <1H.CDCl3>
##$SSB= 0
##$STSI= 32768
##$STSR= 0
##$SW_p= 5175.98343685301
##$SYMM= 0
##$S_DEV= 0
##$TDeff= 65536
##$TDoff= 0
##$TI= <Analysis number 999999
Compound Code 99
Book Reference 9
Project Code 9>
##$TILT= no
##$TM1= 0
##$TM2= 0
##$TOPLEV= 0
##$USERP1= <user>
##$USERP2= <user>
##$USERP3= <user>
##$USERP4= <user>
##$USERP5= <user>
##$WDW= 1
##$XDIM= 32768
##$YMAX_p= 313201834
##$YMIN_p= -82379
$$ End of Bruker specific parameters
$$ ---------------------------------
##NTUPLES= NMR SPECTRUM
##VAR_NAME=  FREQUENCY,     SPECTRUM/REAL,   SPECTRUM/IMAG
##SYMBOL=    X,             R,               I
##VAR_TYPE=  INDEPENDENT,   DEPENDENT,       DEPENDENT
##VAR_FORM=  AFFN,          ASDF,            ASDF
##VAR_DIM=   32768,         32768,           32768
##UNITS=     HZ,            ARBITRARY UNITS, ARBITRARY UNITS
##FACTOR=    0.157963299565203, 1,           1
##FIRST=     4132.6476996994, 0,             0
##LAST=      -1043.33573715361, 0,           0
##MIN=       -1043.33573715361, -82379,      0
##MAX=       4132.6476996994, 313201834,     0
$$ Real data points
##PAGE= N=1
##DATA TABLE= (X++(R..R)), XYDATA
$$ [...]
20523 26457 -11072 -25937 -22892 -28685 -24034 -24773 -30418 -37342 -26290 -1567 7097 1596 -977 -1249
20509 -1249 6928 1131 -15659 -3429 4008 4750 9161 4199 10087 -6443 261 -3589 1922 -12556
20495 -12556 -20583 -23883 -28980 -31997 -22537 -27519 -18978 -733 1774 -7949 -10049 -14171 -10276 -19030
20481 -19030 -26968 -14734 -2344 -8279 -12571 12245 29173 31928 10509 1466 -1535 18826 15471
20468 15471 -1259 -4733 1420 10684 -13887 -24443 -780 4937 207 4518 -3413 -3255 -1395 7074
20454 7074 -3569 9355 -3028 1765 2760 218 -5231 596 -3927 -11802 -15096 -22903 -11976 -9367
20440 -9367 -4147 -1101 -9049 -21719 -43534 -51001 -16570 7779 -5838 -6568 -149 -233 18488 24511
20426 24511 21860 4374 -614 170 -12880 -22039 -16661 -32239 -30081 -10864 359 -4675 -8282
20413 -8282 3597 -17183 -28095 -36427 -37070 -17385 -4964 -3885 9896 1208 -16817 -7006 -18913
20400 -18913 -13922 -4223 -19053 -12283 -2334 -5955 2943 -11923 -8668 -514 -6399 -21779 -38404
20387 -38404 -34493 -32620 -17741 10409 18678 -1147 -10184 -24868 -35953 -21870 -4725 -6972 -20987
20374 -20987 -12658 4782 -3997 191 9189 13418 11879 -12894 -1480 14275 11413 4169 -7225
20361 -7225 4016 5471 5998 -2882 1680 13353 9265 17834 23124 8885 -3170 -4526 -18883 -27237
20347 -27237 540 12744 9767 6428 512 -16482 -15543 -16205 -34245 -33789 -30218 -36369 -51272 -45669
20333 -45669 -45338 -43300 -15607 7154 7668 550 7679 3874 -15109 -28155 -38797 -36986 -13823
20320 -13823 6439 8970 13371 20268 14390 2143 -22405 -16186 -10404 -6772 854 17266 15524
20307 15524 10471 9191 -3556 -15368 -4026 -2694 -8861 -11620 1124 -1666 -9805 -12363 4095
20294 4095 -7800 -20804 -11185 8417 9818 6802 -2837 -12758 -12891 -27381 -26262 -7492 6729
20281 6729 14197 4702 3441 2428 6772 -485 7147 11143 13090 11807 3005 -2179 -5527 -3127 -11130
20266 -11130 -17989 -19505 -33483 -16998 2623 -2173 -5784 -26324 -27730 -9281 -3235 -5548 -4429
20253 -4429 8554 26650 23873 17406 7266 10938 13257 5563 183 -7906 -30935 -24047 -1237
20240 -1237 2749 -3495 -8690 -10763 -2387 -2084 15338 25075 17762 2127 2407 17481 16294 12499
20226 12499 21470 12351 -1593 17757 27691 10898 1679 -1574 -4257 1880 30456 37458 14371
20213 14371 -5113 -31571 -44658 -22234 -6838 -16206 -27866 -20917 -7130 2008 -4897 14478
20201 14478 28604 21312 19129 23359 10534 5114 10045 7555 16380 23737 5897 -14120 -27244
20188 -27244 -17003 -18310 5541 7661 4806 -3036 907 -16915 -38466 -45367 -65763 -71077 -52192
20175 -52192 -20609 -24591 -29574 -6349 -18847 -39576 -34711 -20278 -6913 3636 106 -7923 -13978
20162 -13978 -5614 -11861 -15533 -9040 -9166 -25589 -32838 -13053 -1936 -26383 -20507 -12912 871
20149 871 12888 -4989 -15482 -9033 -1055 4542 8042 7308 -327 10572 23728 14813 9123 5507
20135 5507 -13778 -30341 -30934 -31452 -23430 -10043 -16183 -22049 -17819 -10633 4316 18467 13275 -9265
20121 -9265 -24795 -20450 -11133 5302 14999 7652 -5454 -12718 -7594 -6848 3462 -13510 -16640 3519
20107 3519 18314 20147 8321 5991 -29073 -36602 -39186 -24299 -6262 -18053 -17154 -5929 5872
20094 5872 -1188 -3704 16176 9247 6749 -5876 3909 4419 -5522 -12527 -10018 -2353 -12380 -8776
20080 -8776 20355 24277 9890 3317 1669 -4220 10169 24748 7082 878 7089 -8574 -22445
20067 -22445 -25267 -40568 -34871 -49603 -55575 -40954 -39566 -38613 -43186 -26276 -18628 -15020 -12187 -14660
20053 -14660 -29249 -28580 -18388 1 1209 -11816 -9684 -3454 -2677 7789 -21079 -36630 -39311
20040 -39311 -40857 -26307 -16808 -28096 -26502 -21687 -25587 -22974 -21577 -25345 -4544 -6541 -18991
20027 -18991 -26179 -24158 -8376 -1378 -8526 -9624 6994 -2550 -9254 4539 9304 5736 -2842 -4322
20013 -4322 -9634 -13082 -15975 -18291 -19718 -21832 -23966 -9022 1555 7269 -2384 -10118 -13793 -31251
19999 -31251 -46867 -39444 -18878 -10319 -20030 -18743 -11740 -27088 -21041 -15685 -27521 -26758 -26630 -29402
19985 -29402 -5669 -13652 -11196 -7352 -162 -2650 -5479 -13410 -25290 -36090 -29293 -19977 -23194 -14863
19971 -14863 -11131 -5446 -14631 -16652 -30775 -38164 -28315 -27912 -21350 -13533 -20030 -31452 -28346 -15243
19957 -15243 -17357 -14599 -1187 2797 -4595 8618 20993 9194 -16122 -23595 -16024 16921 -1022
19944 -1022 -44931 -54291 -32206 -15045 1305 17191 25110 32699 16349 -3899 -6665 -3537 -2538
19931 -2538 -13038 -21105 -14561 -5634 -12375 -21100 -20615 -1004 13364 24973 38384 34593 -18946
19918 -18946 -26285 -3993 4062 -3460 -11360 -4483 1107 8598 9770 -601 16571 34212 19270
19905 19270 -317 -7097 -7114 -6279 -2974 -5741 -26787 -32793 -38442 -14971 -1615 2197 -1827 -4544
19891 -4544 -22377 -25598 -500 4594 -20834 -19854 -2596 -4198 11084 -9644 -11841 820 -10963
19878 -10963 -10738 4637 11716 555 14396 30487 18326 -10808 -18830 -5502 -18738 -15648 6937
19865 6937 27684 22853 14111 21259 24888 17028 -296 -8988 -3473 -13216 -21209 -33763 -33610 -18393
19851 -18393 -6509 -19739 -31640 -19825 -17061 -20815 -18898 -21758 -29986 -30653 -31834 -15682 -13815
19838 -13815 -7441 -9592 -10665 -15478 -17470 13672 17543 18378 32272 26037 5425 -11250 -32222
19825 -32222 -22419 199 -3010 -24671 -30166 -32836 -43618 -42931 -35679 -14313 -1202 -13761 -17778
19812 -17778 -10318 6102 -8224 -10392 1674 -4652 -6853 -4175 -9610 2042 7043 7678 -2667
19799 -2667 -16142 -20873 -15437 -6396 -10222 -27270 -38586 -34656 -24806 -20281 -10308 -10916 -23854 -13534
19785 -13534 1522 -14946 -17129 -22809 -29567 -39454 -52093 -36164 -27187 -6914 11876 16503 20538
19772 20538 21389 -154 -4120 3371 -7720 -1252 14191 9511 7039 -9807 -11358 11017 -1742
19759 -1742 7827 9354 18671 2084 218 17113 10899 -3148 -8171 -7061 -20709 -3656 13940
19746 13940 23555 9812 -3307 -4168 -22727 -46991 -48020 -31720 -17468 -10342 -14452 -8220 9246
19733 9246 13865 6688 -11753 -12597 -7361 -5055 6468 10104 -3314 5117 16787 3419 -10873
19720 -10873 -12151 -23259 -40457 -41615 -40015 -33415 -18545 -13038 -13017 -9719 -12167 -22320 -23378 -26278
19706 -26278 -25395 -13134 3105 5884 10161 15838 23755 6478 -10252 -15879 -21470 -24127 -2913
19693 -2913 9685 -5747 -3565 6576 1286 -3543 -2930 11695 42505 47100 39524 51542 31139
19680 31139 13097 21569 28419 24873 2981 -11510 -21077 -33370 -26596 6920 7921 -1133 -9350
19667 -9350 -2766 -8805 -13996 -5937 -11747 -10390 -16805 -15681 -8220 -936 -11448 -17601 -19224 -23564
19653 -23564 -26878 -22899 -28129 -35793 -31118 -1063 14558 24470 12523 -934 -5308 -21710 -26553
19640 -26553 -32792 -30677 -25488 -24418 -30947 -13893 -7417 -8117 -3886 -17852 -25393 -26059 -29906 -24746
19626 -24746 -8391 -5059 -4750 9479 20576 16105 19876 36641 34203 1800 -4581 4596 -1554
19613 -1554 -14041 -16813 9245 31548 7822 -21538 -19391 -6173 2804 -5033 -14562 -13449 -10449
19600 -10449 9532 9467 -1046 2567 4235 18449 13025 9924 5913 7788 13670 -2782 -4114 14389
19586 14389 27486 28865 18286 18854 28959 16003 803 8294 9122 -2165 3280 15981 -488
19573 -488 -22358 -24617 33 21084 14463 2391 -11380 -4346 3845 3530 21677 24263 29771 34524
19559 34524 28274 2741 -13781 -26565 -23418 -2632 -4201 -3214 15160 8988 2628 9930 -1478
19546 -1478 5859 16372 4514 17073 20154 1185 3329 -4954 -6786 -13863 -19112 -22455 -13166 11605
19532 11605 28781 42865 35163 20131 3965 -14084 -21972 -20778 -13200 -6152 -10567 -17563 -25243
19519 -25243 -45992 -55785 -36910 -27123 -20941 -12205 -13035 -11042 8049 -5439 -23734 -20502 -12495
19506 -12495 -21985 -31092 -47375 -49547 -52646 -34776 -32298 -25953 -17736 -13366 -9065 -6578 -1295 -9200
19492 -9200 -28314 -17636 -13711 -13630 -4756 -14549 -8459 -12782 -2330 6427 -7579 -12429 -9108 -18723
19478 -18723 -1557 4517 1216 -2780 784 16440 36123 31726 14851 -13965 -1406 19573 12465
19465 12465 14977 29924 19478 14105 3630 1889 7102 15015 7987 23930 36716 33176 16412
19452 16412 17506 24820 24996 32731 31847 30950 19032 6137 9338 -1100 7179 2093 -3278 -2391 17682
19437 17682 7260 -26408 -21257 -3883 -1000 -9359 6766 26430 31481 32633 6662 -5559 -7854
19424 -7854 -12293 -12731 -35276 -26543 -11213 5321 19018 24567 23617 12258 393 -4505 -2831 2225
19410 2225 -9387 -5329 2829 -8597 2275 9442 -9196 -18321 -21755 -4494 13982 18843 10413
19397 10413 7353 -2595 -1811 -17123 -21883 -202 20875 19314 18123 16096 8006 -5376 -11861 -4742
19383 -4742 -10457 -18091 9006 20543 29513 21176 453 -6366 -35194 -53022 -42793 -40524 -19270
19370 -19270 -17 -607 3391 5974 10021 -1694 -27411 -47968 -36425 -21346 -12400 -18739 -25605
19357 -25605 -14658 10867 12802 18901 30700 38741 52818 68918 95723 119994 127164 129637 146049
19344 146049 134754 108051 74553 60889 51786 31676 30067 51125 53986 49862 38124 34753
19332 34753 36371 28017 17156 13196 7595 -4140 -7404 -952 -16168 -22673 -19992 -1965 10557
19319 10557 185 9319 18321 13600 -1406 3129 10708 -793 5687 15600 29771 39601 28602
19306 28602 16421 19998 34442 42935 44523 41327 53825 63673 72273 63000 60446 80528 99188
19293 99188 126680 137723 126535 133186 135410 103534 60069 47128 46109 52110 45779 16845 4419
19280 4419 7584 -739 8000 8848 -2735 -87 27957 31411 48800 54678 30515 42697 57160
19267 57160 36623 22889 4410 1721 -4008 4119 -4076 10079 27926 13815 14485 27974 24338
19254 24338 -700 -6166 1928 5543 12926 19384 13815 2201 3212 -15018 -11136 -23887 -32969
19241 -32969 -16423 2034 8373 16092 2539 -12571 -4340 -3501 -4055 3695 25980 17669 10217 6167
19227 6167 5953 13625 3680 9876 6381 -7967 -6027 13020 7399 -12688 -356 -2857 5286 2971
19213 2971 19057 -1402 7781 6764 -2993 -9665 -21276 -14219 2665 -7785 -24404 -19069 -26801
19200 -26801 -37575 -12724 9831 -7026 -19403 -13522 -16788 -27489 -20810 -1392 -13034 -9314
19188 -9314 6264 4149 -14582 -26338 -27063 -22752 -24871 -21335 -8675 -3955 10674 9694 11253 2454
19174 2454 3904 13891 24772 23684 5973 -11287 -8800 4680 14481 19641 24383 6798 -19948
19161 -19948 -17471 -12479 -18462 -19471 1550 12869 -2067 -534 22282 16466 8741 -3965 10895
19148 10895 7790 -10168 2882 6939 -11120 -19563 -15664 -8446 -20824 -9824 7050 13842 10595
19135 10595 1617 -9664 -936 4847 -6569 -7761 9373 29817 37805 29302 20833 777 -3872
19122 -3872 16470 27625 42543 33205 5963 399 5434 8547 6534 -5830 -18751 -29984 -19457
19109 -19457 -14904 -17401 -27061 -18769 -9330 -23189 -16637 -1612 7294 3140 2344 -10683 -25211 -43843
19095 -43843 -37223 -15734 -566 6293 7692 2659 -27611 -29856 -31107 -42628 -53053 -45419 -17043
19082 -17043 -8753 -1669 -1421 4768 8077 9602 12341 26872 20518 264 -679 -7232 1862 8724
19068 8724 -11654 -2029 -18701 -40533 -53100 -55210 -49483 -28152 -7965 6739 4766 -2181 3505
19055 3505 -6673 -21701 -19466 -8913 -15906 -26180 -33542 4007 -6315 -12038 -12054 2210 26710
19042 26710 21086 9180 -4699 -14517 -34547 -36635 -20161 10943 21085 27442 28929 13946 -15134
19029 -15134 -21112 -19916 -20550 -22354 -24237 -8457 -22268 -19328 -3134 -8403 -9766 9498 16032 11454
19015 11454 5451 -15097 -27508 -34565 -22774 -23740 -25927 -19533 -8956 4553 18429 28681 10410
19002 10410 -649 -15476 -27010 -18972 -29035 -37934 -25393 -25822 -36368 -38882 -13317 -23593 -4887
18989 -4887 -9538 -2817 16015 7961 -10534 -15244 -8353 -233 -7358 -26127 -36787 -32361 -31112 -21045
18975 -21045 -3372 -14037 -21409 -23603 -12484 181 8552 25768 20946 23471 18125 5286 -16057
18962 -16057 -14510 -9933 -5329 -832 -1170 12022 -17215 -21376 -21106 -20976 -25622 -37836 -30570 -14203
18948 -14203 -3019 -3778 -13668 -14277 2420 15301 8586 10085 11777 20995 14623 3499 -23571 -31017
18934 -31017 -20667 -12585 -5211 -11294 2581 24154 22602 6234 666 12716 10643 -9179 -31425
18921 -31425 -31907 -21667 -5807 13277 13353 14471 10655 1711 -5088 -11500 6220 12479 28141 9883
18907 9883 5353 16399 23212 23770 3471 -28464 -37053 -23567 -22335 -18382 -13430 -17574 -30272 -44693
18893 -44693 -34828 -17589 -4639 -7844 -18895 6686 -1505 -4943 6612 1245 -21900 -34465 -32956
18880 -32956 -8649 -4536 -816 18475 19524 3367 -4248 -34 1880 6591 -5768 -35455 -49964
18867 -49964 -57730 -42067 -24420 -27192 -2625 12434 7291 -15013 -22700 -7726 -1472 -5963 -8454
18854 -8454 -1371 13951 27063 15528 7765 6982 11729 16527 25805 18959 16782 13456 11877 3937
18840 3937 -11120 -12323 3604 10012 8522 14436 22107 26825 19672 12236 23495 17259 8727 13169
18826 13169 1789 -8235 -20307 -14468 -10782 -19832 -19224 3221 23600 24985 19888 19158 2704
18813 2704 -5654 22019 28985 12473 10504 7497 13500 5910 -5840 -2148 -1828 -20405 -26095 -6488
18799 -6488 22547 18611 8299 24581 11849 15773 16482 21717 6262 6399 27974 31220 23711 32733
18785 32733 36305 41787 43649 49605 41400 39257 37992 30782 28856 47993 51568 33292 33413 38243
18771 38243 59168 78896 89994 95994 112941 133883 120800 95728 73278 49915 40171 40181 33863
18758 33863 26785 20004 29162 39233 46462 43018 32562 4824 -15099 -18539 -26469 -8453 -1621
18745 -1621 -2828 -6395 -12143 1692 -13212 -25574 -13143 -5647 3879 4297 7895 25194 37310
18732 37310 40132 42789 24479 4501 -2853 -9901 18241 60154 53769 23959 19815 14071 7340
18719 7340 11400 7248 20921 38790 40992 9245 24566 52989 63817 72546 91974 124908 154135
18706 154135 167201 160034 147543 127499 96153 64836 50768 36788 40506 62887 72823 64171
18694 64171 78113 66535 63776 45045 34297 26133 24909 38637 45670 31268 4337 -10639
18682 -10639 -8012 -1111 -1071 195 2881 16097 25362 23623 29884 51574 56301 47358 26186 32693
18668 32693 49446 31453 22157 22915 36730 17752 26229 32590 27508 62748 88539 99233 108300
18655 108300 101652 87971 79769 106838 119939 128586 129493 119920 107822 73328 50561 70261 87672
18642 87672 76509 64983 43113 36845 37624 51675 51500 56267 65677 54808 38692 24776 27456
18629 27456 26947 -1133 -5983 -8240 7266 -3601 -9348 15095 28460 23976 -723 233 14351
18616 14351 23727 46667 50769 60769 40203 29029 25096 22521 26278 34663 22217 4142 2557
18603 2557 7068 31286 47621 45826 34592 40111 37156 48058 37800 36265 33305 10137 16755
18590 16755 33583 23364 1733 21128 28662 10278 753 6916 3447 -2239 7152 26077 38661
18577 38661 35502 41880 50505 50703 48609 39651 38128 38398 30115 25809 24257 25497 26519 21995 16002
18562 16002 23273 48 -8287 -7609 -16133 -8099 -8443 -6894 -3732 -2592 1737 -6055 -8992 8989
18548 8989 14884 8533 7975 15940 25425 39521 36753 45452 41990 27146 34264 27057 28806 27077
18534 27077 26753 16094 5855 14947 20038 21385 30454 29130 34090 32733 25922 19075 7864 -1850
18520 -1850 16419 25429 36560 58638 50695 34660 21728 2403 -12043 -4859 -13013 2443 12911
18507 12911 8693 -4542 -11941 8029 32818 26915 23845 29770 18100 20129 19425 31432 40700
18494 40700 33008 25970 16511 23561 46337 60971 84987 99585 115846 112471 127215 162778 176260
18481 176260 189222 194632 183874 158922 135154 118956 102501 112776 126772 155058 179746 163840
18469 163840 183196 204000 209658 219628 227773 226211 218066 195433 180341 176503 169869 149142 148629
18456 148629 168656 171862 146394 115081 93973 81859 73004 55511 53140 54643 37346 16179
18444 16179 31517 44238 60367 52135 68316 88827 88381 104085 111550 108269 104799 90459 66285
18431 66285 52118 51594 72736 100691 134562 161661 169485 189820 194038 199524 182091 178223 204023
18418 204023 222451 220329 216705 219380 201712 171173 156473 180062 208419 226544 213225 196593
18406 196593 181704 134233 97479 99415 86380 79009 79303 75219 73284 74218 48222 22159 17847
18393 17847 16011 8461 8417 14012 7752 -3569 1848 10417 14487 28605 33369 -1947 -17401 -26139
18379 -26139 -25004 -12182 10754 33303 33472 25760 17636 25149 23462 6964 8960 13601 23416 27225
18365 27225 18169 30649 40091 32064 19665 4831 18284 28855 31707 28443 19496 3547 18855
18352 18855 30356 29862 25503 11971 16329 26499 21173 31348 28695 21263 12993 21009 23680 34779
18338 34779 32557 30074 24054 14579 21370 24061 28386 14093 3585 -5296 6285 20957 50468
18325 50468 52678 42561 36202 36220 24407 19091 22055 14681 27617 51826 51262 40018 35140 38261
18311 38261 50604 38471 19933 10480 11616 17495 20199 23353 20855 36156 17718 10039 27346
18298 27346 56292 78440 83101 72764 83516 72398 53403 46199 34569 6335 11199 35216
18286 35216 29696 13113 6598 12709 19315 16237 32928 37081 17499 7412 31666 40299 41186
18273 41186 49603 57395 82525 82685 63139 61818 60325 51411 28053 11978 10392 27131 32859
18260 32859 42389 29891 25524 28596 34578 28684 35060 52739 59892 68308 55834 29892 20004
18247 20004 28311 55681 59164 55304 46824 48727 53381 49696 58212 74794 75467 76416 72202 60570
18233 60570 58215 40175 43854 57314 64530 57840 75067 83213 60903 61920 76949 97201 93558
18220 93558 98420 106041 121970 115798 101581 79418 73521 71780 75163 100914 99658 92464 93114 95388
18206 95388 117606 111867 94188 92584 84787 74805 63461 45176 53386 63386 44123 38189 47984
18193 47984 54371 48093 68915 78645 83738 82795 83011 94423 94469 85715 64275 71656 95351 106217
18179 106217 108824 106603 105403 126672 121986 125352 131827 128748 119046 106300 100969 119806 122785
18166 122785 119474 124983 138254 135931 126704 115825 122158 124243 112463 119926 138954 158381 153818
18153 153818 136836 123292 141495 158191 158559 170061 162295 164020 157962 142433 150573 173262 181591
18140 181591 183578 179930 166513 177955 207275 250788 279252 311352 312716 314046 344768 381160
18128 381160 410435 458118 521593 583372 628163 684834 775976 858789 979228 1166972 1394706
18117 1394706 1682162 2115084 2786693 3817099 5469005 8057058 11818124 16634372 21444676
18108 21444676 24564312 25233315 23153130 17334302 11560084 8317795 6448638 5099826
18100 5099826 4095481 3358861 2840131 2454549 2153019 1903910 1688339 1509366 1332136
18091 1332136 1186723 1077939 1011175 991502 985279 979536 1028713 1150483 1329000 1574059 1958884
18080 1958884 2482035 3103699 3769582 4349166 4741112 4851301 4620703 4153010 3623914
18071 3623914 3110638 2681200 2365541 2146171 1999937 1928872 1900185 1897783 1896231 1843721 1718358
18060 1718358 1524134 1308489 1127889 992321 897518 793562 734452 696275 648541 610690
18050 610690 581724 562770 553428 554189 560971 578250 603808 629655 656500 733206 807569 910708
18038 910708 1066703 1254487 1456473 1646493 1802423 1903234 1971990 1970799 1942227 1964321
18028 1964321 2084976 2338529 2714410 3218808 3847610 4580789 5297484 5876254 6149662
18019 6149662 6039766 5565638 4814351 3989701 3320038 2837859 2481362 2226327 2016624
18010 2016624 1839593 1687529 1589766 1543364 1541388 1563198 1593268 1664147 1710657 1760553 1797669
17999 1797669 1812205 1854919 1939966 2081458 2281179 2530391 2834460 3194826 3705324 4448252
17989 4448252 5433229 6483957 7304829 7716573 7604826 6915251 6052515 5525463 5365076
17980 5365076 5468502 5791171 6347793 7193077 8440966 10272483 13046771 17276971 23637284
17971 23637284 32743221 44545874 57179965 67732851 74067500 74282634 66558852 55502374
17963 55502374 45531676 36565308 29209890 24440088 21870022 20936017 21376501 22890027
17955 22890027 24728041 25882969 25660535 23734068 19976269 15615038 12317695 10112016
17947 10112016 8555844 7401475 6573214 6000683 5643142 5450539 5339123 5266147 5207798
17938 5207798 5168188 5180049 5269381 5466667 5864658 6533433 7608821 9256165 11684928
17929 11684928 15008236 18969335 22769695 25441887 26445476 25491093 22809323 20332949
17921 20332949 19525854 20467538 23213435 28166809 35841864 46272365 58702710 71711083
17913 71711083 82498877 87153160 84299686 75334127 60691102 44288496 32704694
17906 32704694 25451839 20430572 16719718 13948347 11849765 10276628 9081304 8227841
17898 8227841 7781241 7782097 8164733 8861461 9580828 9946656 9716488 8802397 7219328 5662167
17888 5662167 4637242 4009415 3548980 3175479 2831058 2483456 2147975 1850804 1606947
17879 1606947 1417758 1254195 1150280 1059129 977014 919433 878089 819880 764674 719684 690060
17868 690060 671385 641690 639736 639410 621970 606625 546104 483438 463634 435803 410940 400562
17856 400562 391598 360977 334709 331925 333370 338315 328345 340883 343753 342438 356600 374784 387089
17843 387089 392825 389261 374224 377697 375328 361019 361596 352939 340642 329690 305837 308114 315082
17830 315082 319187 312131 292491 273736 270995 289605 281805 252206 232262 248320 262462 259994
17818 259994 237712 222167 230978 235647 219082 205181 202237 187982 182776 175613 181527 170394 186841
17805 186841 202301 181489 147246 132700 149800 147272 149386 156887 156034 148078 139414 158398 181585
17792 181585 205319 223508 231667 237264 263903 272421 273215 257785 246708 215334 202745 209820 210048
17779 210048 209401 196516 187269 198604 202923 174343 163287 158840 150526 140793 145154 140174 148355
17766 148355 161353 182880 187102 189577 204707 196960 178176 147332 136890 133586 130677 136262 139138
17753 139138 139208 146824 164041 205047 266698 296136 290964 322902 347132 353748 331228 285446 255514
17740 255514 240649 219917 214299 225583 224289 227570 231678 239577 235224 260984 295240 302824 294831
17727 294831 294593 291139 275359 258807 268687 277640 271048 267863 266739 255545 226867 194890 164248
17714 164248 137382 113353 115871 122879 107106 99239 124094 141212 131608 141360 116103 121540 149446
17701 149446 165157 171369 175269 163729 156269 150476 168388 190908 198038 210945 227592 243199
17689 243199 251566 264732 262225 250483 229558 212125 209176 208657 229805 235858 248175 235379 210939
17676 210939 197125 180936 157254 155182 177975 190767 187305 184326 161324 138832 129534 123508
17664 123508 116266 109855 112232 117037 119533 124370 131009 127311 109447 90168 70995 66103 79824
17651 79824 92582 83950 78881 100038 117002 94814 80000 89527 82717 98576 124062 139274
17639 139274 154649 168774 174061 170590 165893 138093 109124 89248 77816 58984 60455 65576
17627 65576 53710 41758 55326 63612 59270 45149 47453 40548 34020 50673 74964 76949 58842
17614 58842 52753 53332 61865 53267 61827 59610 41204 41603 44659 45808 62923 56621 56386 51890 53326
17599 53326 50421 36530 30694 44547 46349 53842 60913 74837 88381 95690 100850 103487 95611
17586 95611 74748 76167 106049 104532 91078 83597 85069 82906 88421 93957 84423 76466 84251 107966
17572 107966 145521 181355 207067 224879 260645 304927 331741 305584 247217 205223 189125
17561 189125 174933 187328 172114 146332 154529 181678 175403 167311 166057 154616 153383 153477 135910
17548 135910 108095 114736 128354 135549 147159 159504 156807 157426 169582 179390 185876 209016 228444
17535 228444 241074 247570 263914 262834 292129 319188 373901 469245 564675 660590 740161 777932
17523 777932 779673 760527 738697 706649 661083 648442 690274 765555 873407 1026285 1255644
17512 1255644 1546918 1921607 2438417 3105341 3909876 4708405 5352045 5711401 5687914 5257659
17502 5257659 4601836 3887952 3238771 2699428 2313850 2070539 1935630 1884072 1886013 1935321
17492 1935321 1964937 1930881 1817626 1633503 1419888 1200043 1024498 905577 827834 756533
17482 756533 697630 652684 627807 598828 580344 559154 550619 549974 540483 543138 565476 608980
17470 608980 664712 746722 863171 1006125 1200294 1397843 1546167 1647042 1707040 1716060
17460 1716060 1684895 1650493 1656870 1730164 1924768 2244478 2672857 3194103 3780333 4316737
17450 4316737 4720303 4855061 4685220 4224515 3567468 2879051 2283607 1880022 1600050
17441 1600050 1373453 1181664 1020775 900785 815673 779380 742581 712228 691650 698638 716373
17430 716373 706747 689394 663208 608517 540757 506733 486709 478878 460194 454287 473140 498194
17418 498194 507134 486547 441109 402984 386482 421397 461617 486999 513796 505547 493257 449088
17406 449088 422070 383009 363165 375722 429971 498299 606957 755021 915320 1014461 1094912
17395 1094912 1096266 995494 886939 772192 631446 527454 462165 426494 388592 368066
17385 368066 369437 393052 426745 429270 395123 369999 332331 284587 242623 222693 209440 182898
17373 182898 161859 158461 145831 127595 130602 134476 124459 125088 139411 135645 142282 138790 167063
17360 167063 209971 251117 315098 384224 436722 474283 475697 425874 381289 369453 354862 347343
17348 347343 371142 430122 517327 669124 843425 1033888 1212351 1348071 1397394 1342098
17338 1342098 1196944 953651 720018 549989 450612 391502 363841 325488 296152 274323
17328 274323 267841 280689 307000 299360 276617 266545 250513 249005 244591 241029 247949 267736 273237
17315 273237 273559 267967 257121 230259 222820 228995 224020 216191 224640 244859 265963 297963 330654
17302 330654 370403 392375 415250 417701 416222 409393 412640 430866 444579 471253 475645 484459 492061
17289 492061 517616 543002 575551 611117 636359 640887 642582 660436 689707 731218 777778 814480
17277 814480 900683 990749 1065469 1156893 1284781 1424280 1596085 1817072 2056286 2281969
17267 2281969 2509254 2812390 3273373 3981589 5008491 6323907 7781765 8963141 9589441
17258 9589441 9558833 8774261 7542685 6717505 6400092 6412663 6651803 7203486 8116689 9504314
17248 9504314 11588247 14812991 19849409 27484864 38417998 52603008 67866601 80587831
17240 80587831 88163351 88330216 78705829 64898868 52413950 41463627 32900934 27360050
17232 27360050 24175377 22758477 22926200 24416035 26527980 28136326 28313985 26630329
17224 26630329 22861769 17941335 13981551 11329357 9481415 8121653 7104325 6392662
17216 6392662 5903797 5565649 5366669 5242556 5161034 5085967 5015521 5009490 5134260 5427852
17206 5427852 5974532 6857069 8264097 10370708 13348922 17044788 20797358 23621545
17198 23621545 24902626 24359513 21928117 19233730 18089525 18686421 20988290 25317157
17190 25317157 32046926 41114220 51750898 62774379 71917651 75741570 73172921 65648556
17182 65648556 53249303 38808931 28634725 22249359 17773206 14408991 11888400 10004713
17174 10004713 8614096 7605239 6924139 6525615 6430900 6650526 7136315 7695624 8033974
17165 8033974 7952113 7346561 6171336 4860994 3957755 3405356 3024242 2757820 2536932
17156 2536932 2325119 2083668 1848875 1638357 1446810 1294484 1196884 1132675 1070187 1010361
17146 1010361 957050 902291 858891 833493 797022 759133 740782 704637 675078 658884 643032
17135 643032 632978 659753 721473 812088 939600 1120202 1313361 1477936 1589144 1579084
17125 1579084 1416970 1204731 1026766 889666 787049 719031 654629 637620 656777 678910
17115 678910 705516 727619 748344 746882 722209 663420 595827 521309 480121 453383 428150 400409
17103 400409 388550 401080 394176 371665 347735 315957 313136 328555 313172 319504 344964 359824
17091 359824 352565 364297 410686 434321 456271 478520 481962 457055 402245 362647 344606 355841
17079 355841 378699 410111 464606 537575 630871 731005 856862 951214 984054 938671 866448
17068 866448 747753 591275 510374 464063 429609 408166 386809 353025 332527 336911 316090
17057 316090 296659 291332 272546 255403 247869 267962 257889 253581 261505 250492 213323 195008
17045 195008 192265 179322 156069 144588 157087 133300 129180 140330 161669 175712 157510 152786
17033 152786 140997 106551 100554 119181 130033 109025 88136 80377 81121 89865 108586 115890 110652
17020 110652 63680 46498 68167 91668 88526 97051 86639 85811 82946 64986 56179 55846 76797
17007 76797 103239 88995 80688 102156 126732 142045 148469 150489 163299 163097 148040 147806 139088
16994 139088 128331 121112 109903 101120 86932 90303 69125 51774 53188 59064 32611 31503 44257
16981 44257 53003 56902 60060 50900 39906 42913 44094 64385 62159 52577 31445 50161 86206
16968 86206 105380 119842 123379 112524 107638 109023 114339 121326 110225 89964 60412 47614 63174
16955 63174 61647 63280 56888 62380 64928 69900 88907 101283 98905 91760 91663 70938 49260 57085
16941 57085 73458 61514 55232 45038 27003 22349 31553 36795 19768 31764 40942 24890 24260
16928 24260 24037 20855 8841 11204 33118 24164 31539 44174 51801 40893 25962 35919 57856
16915 57856 58628 46101 43901 29866 41629 40447 50839 51180 50927 50071 47844 42624 42496 48641 39646
16900 39646 30611 28041 28008 17816 14509 13786 26251 42798 46262 38731 31134 40393 51402 50611
16886 50611 34972 28287 26233 35189 38658 19682 11100 20796 33170 34203 21569 25334 32098
16873 32098 31798 15341 19737 24541 23042 35595 40528 37307 33558 4853 -12216 -2108 4315
16860 4315 8557 16340 19266 389 -14316 1685 14517 9626 -4908 -13569 -6021 -4492 2262
16847 2262 11847 -644 -10124 -5788 8233 13086 2836 -10168 -12967 -11125 -18842 -10987 6632
16834 6632 14222 24622 21574 8885 17213 33360 42931 55926 43727 14770 -5617 -22412 4966
16821 4966 16587 30615 32856 24950 36521 32571 23768 31533 32480 23063 15185 2053 16566 32451
16807 32451 33240 26101 29082 15112 -3353 -307 9777 9750 1220 15175 35160 31035 11534 957
16793 957 7914 11818 26002 30083 20066 26732 31829 19440 6603 12593 22106 33610 28413 13378
16779 13378 -4338 665 19638 30193 41340 34134 17250 11510 16349 24518 5092 -9828 -18494
16766 -18494 -25913 -10972 3854 -1602 8109 14645 45852 43732 41385 56336 85824 91828 85571
16753 85571 91232 100657 133520 154567 161480 188768 200966 208071 186580 173354 191309 194610 196698
16740 196698 207755 202545 202161 207873 213676 221896 226023 221655 217350 219636 223937 180694 164985 149833
16726 149833 120800 100262 105267 103506 72383 69351 81501 102326 89715 74921 68709 60613
16714 60613 61407 37918 28334 33421 34659 50228 51376 36165 23443 33605 48183 51684 69084
16701 69084 83017 106184 133946 156280 173257 150925 151725 170918 195864 218672 220259 221996
16689 221996 207207 187166 183619 166698 136545 106863 104659 113001 114979 105100 78937 81897 109002
16676 109002 136158 158337 177441 179534 182168 183353 167750 151109 149596 136289 101753 62793
16664 62793 36944 25728 10578 21364 24442 27993 30375 32816 21607 5831 10119 12464 27897
16651 27897 42158 26835 1504 -18936 -31426 -4318 13802 13581 7360 -9131 -16446 -18485 -5801
16638 -5801 -4738 -16900 -30771 -30573 -21759 -13536 -10057 -17995 -37745 -22405 -12663 -14452 944 10603
16624 10603 19778 18168 4798 -10660 3259 5114 -12550 -27063 -12493 -9321 -364 24417 32403
16611 32403 29456 16376 -8991 -13218 -30628 -25630 -17603 -11989 -23616 -23044 -23221 -14472 -1526 3161
16597 3161 -5002 -3513 7770 1965 -2192 -8816 -6001 -87 20445 31171 31790 20660 17367 19502
16583 19502 31019 46824 48452 37995 44131 53343 17340 -8269 -14483 -9478 16270 47246 52287
16570 52287 37571 37726 47669 35016 33132 26449 26109 24613 24110 46172 50242 61761 88453 104801
16556 104801 129437 139326 161299 199591 240115 264637 294011 313119 323595 333777 339169 348716
16544 348716 336442 319995 272918 244198 220628 191292 161745 148159 130299 112122 83460
16533 83460 74124 73061 58560 58855 54861 34707 21542 50099 75005 69072 46880 35021 23414
16520 23414 12510 13314 22544 23448 19704 20600 24607 26589 19801 1646 -6837 -4063 -8285 -7304 3171
16505 3171 4400 -6550 966 14273 -902 -20130 -27359 -17944 -13927 -15830 -30754 -32100 -18719
16492 -18719 -17421 -10727 -4082 4615 16049 20552 10667 -12346 -12217 2474 18068 18417 20893 15404
16478 15404 8252 17459 11400 14812 22267 7024 -7298 -6847 3700 14046 2571 -17244 -34327
16465 -34327 -26578 -20987 -31009 -43534 -25879 -29512 -19031 -10785 -3147 6964 25612 26275 5394
16452 5394 -12062 -13251 -9962 -2494 -1583 -5507 -8953 -6877 -12127 -11454 -25043 -24759 -33172 -21218 -1901
16437 -1901 3422 -2416 10 5438 9553 16024 469 -7445 7461 10810 8312 9065 16523 15743 6961
16422 6961 258 20905 26486 7391 4997 -3912 -9320 -16164 -17721 -7141 -6914 -30791 -27632 -14540
16408 -14540 -9901 -17722 1310 7681 -1046 4756 1297 -10288 -20227 -24968 -11268 3190 -3111
16395 -3111 -6700 -20139 -35281 -31678 -7147 8526 17088 16945 16529 1250 -13589 5673 24194
16382 24194 19958 4212 -6002 5573 7466 6586 12129 15460 19069 13774 14944 -5202 -11785 5515
16368 5515 2409 3831 -12390 -17549 -16858 -19662 -34234 -32787 -15503 6076 14661 7241 13418 -633
16354 -633 -4021 5060 13078 33567 30469 16717 12727 553 -11335 -3974 6062 3164 -2474 -3828
16340 -3828 11944 7272 2204 1581 15156 29425 29344 6426 7706 13792 16812 19541 13238 10038
16326 10038 4990 -4812 -13995 -22034 -18007 5764 13914 29195 36008 28863 9533 24007 12969
16313 12969 10298 29321 32229 33673 24841 24931 35175 18930 -338 10844 31957 47755 10936
16300 10936 1118 -9529 -8502 -4325 -1195 -18598 -30258 -10457 2477 15487 6308 7813 -5428
16287 -5428 -3493 7282 17418 8530 22280 16162 24873 33282 23568 14729 17321 16495 11965 10538
16273 10538 13616 8135 11126 13029 11803 30682 48026 29195 15314 33863 41523 40766 63803
16260 63803 83428 83686 60993 62047 46384 45644 40927 34323 42916 47888 47397 55748 45385 32761
16246 32761 32978 44975 53679 51734 44149 37862 45244 42365 29404 11095 -5534 3333 -11154
16233 -11154 -23894 -15666 -10659 -9261 3290 20248 19896 6492 -6330 13678 28483 42757 23571
16220 23571 4929 1749 -3043 13868 32971 39102 31981 10695 9771 14612 17236 1556 -12878
16207 -12878 -5554 10512 25216 49160 55126 35914 34858 28783 24518 34261 32407 26173 32832
16194 32832 47241 70458 93611 106941 93038 110728 132958 154701 151949 152948 145687 155238 144021
16181 144021 107812 100194 87707 64901 55341 59783 56055 59664 69863 68939 48074 45078 42784
16168 42784 58312 71703 60646 52545 32250 10833 13166 19916 30241 34254 13223 23644
16156 23644 26964 39061 36957 38081 52037 49130 19093 6777 5111 38 -1297 -12288 -1886
16143 -1886 -12376 -12561 8524 11420 3701 -190 -767 -24173 -7407 -21007 -38278 -29056 -5439
16130 -5439 13956 15780 18441 21620 23524 34119 63957 85305 93799 96716 91624 97535 90874 109079
16116 109079 107725 97868 108807 105441 117694 138609 141826 120869 101973 101672 105889 101408 95969
16103 95969 101997 105392 110524 101423 92769 88696 97802 124169 129288 132564 126982 138754 133293 126551
16089 126551 134470 144182 149641 157856 154155 155891 149295 149333 153394 185769 196518 210166 209097 205564
16075 205564 185076 190985 213443 231886 225056 236272 245775 255679 258775 269765 297497 331941
16063 331941 353487 370272 388092 402011 418777 413183 442304 449574 464836 472085 481966 499418
16051 499418 541372 557633 585503 633318 676778 721692 752469 803081 844827 914100 976067
16040 976067 1040886 1139854 1264233 1397320 1543086 1709487 1905216 2119867 2365951 2645111
16030 2645111 2961387 3322771 3747122 4266733 4864778 5550343 6296089 7140316 8057938
16021 8057938 9102383 10267790 11610856 13267827 15335702 17897556 21032332 24816942
16013 24816942 29295593 34440824 40100175 46033889 51912925 57332200 62015900 65489486
16005 65489486 67383802 68025124 67149333 64552677 60606437 55671243 50313258 44348241
15997 44348241 38110003 32340165 27124806 22501658 18464143 15111206 12450738 10325763
15989 10325763 8637861 7313725 6275471 5447190 4763522 4202153 3753148 3370455 3034973
15980 3034973 2763138 2526095 2322734 2133753 1966928 1824220 1688726 1567974 1437053
15971 1437053 1328551 1229490 1142111 1053562 956182 851015 798857 754262 693961 655969 623326
15960 623326 577509 545708 499217 474855 456008 439362 436207 411635 384516 365642 354120 336906
15948 336906 335618 308565 267431 259130 256181 278915 277302 265639 261758 252286 235904 218671 206299
15935 206299 207452 213381 209100 206112 211446 217743 232692 228101 196491 179745 159866 165011 175108
15922 175108 151979 155249 155141 165359 165784 166655 160743 152917 153743 168537 179628 180067 170513 154025
15908 154025 141862 138086 131107 120116 126861 103827 84856 88794 100701 98790 79415 79356 87771
15895 87771 98204 95544 102019 92769 76801 93302 117838 126272 121790 120121 155927 186506 205912
15882 205912 230994 234622 234448 232287 231896 231587 231482 243871 252676 234430 202126 176570 157818 163308
15868 163308 144177 130060 126553 125980 129941 130866 149456 148457 138276 122552 130820 141408 133000
15855 133000 98471 81567 81230 75993 55630 55145 66909 56961 46405 48871 55855 58403 44463
15842 44463 48550 37637 21103 39386 58147 66841 67675 71571 66555 58738 39235 24339 31963
15829 31963 41081 46565 32877 15027 4259 -2347 -1343 -6904 -3476 1755 7988 12033 33858
15816 33858 40729 39185 34271 37762 36862 45672 35727 28660 24378 21226 24876 43922 39694 31798
15802 31798 28990 33716 19692 15901 32323 52532 60550 44007 9767 9228 18982 17734 27528
15789 27528 10072 11081 23692 12429 -1661 -17380 -12416 -17281 -268 16763 1980 1772 -6087
15776 -6087 -8484 -1567 26817 46792 39111 14150 -5204 3506 -7655 18844 18031 15605 20266
15763 20266 25309 30109 15060 18987 18899 17653 13732 18953 9751 8400 31605 26150 14400 17880
15749 17880 14354 27175 24778 18350 9312 19844 27311 34426 24336 20255 39098 46632 38911
15736 38911 41347 37095 32058 24736 13310 22304 17305 -14022 -22428 -1719 28647 40507 42352
15723 42352 45659 35610 40671 41057 32065 25823 28197 12263 -10756 4792 9057 11172 1881 2182
15709 2182 -17348 -30488 -26968 -9750 3842 -2591 -17649 -10088 -1071 15963 14470 9245 122
15696 122 -7742 -20127 -19174 -15764 -15991 -12816 -15846 -11606 -14418 -13159 1656 19552 20933 -2134
15682 -2134 -1614 15384 20110 10349 -1692 1986 -8854 -14830 -14645 7945 12834 -7479 -14506 7053
15668 7053 -3915 -24210 -23184 920 16720 6359 17781 12546 -18854 -21683 -5094 -4365 -11298
15655 -11298 -15536 -17779 -7827 -8294 2104 14486 13888 -2902 4683 -4696 -651 2127 12300 9950
15641 9950 12861 10563 -480 -9141 18409 5623 -7025 -14747 1535 -8224 -14668 5582 10074
15628 10074 -27488 -26477 -18862 -10621 8712 28062 44707 44101 29690 16943 28134 9246 -19392
15615 -19392 -16623 -9262 -3359 12974 10042 4237 -13965 -4611 16691 23943 13688 10543 7813
15602 7813 14805 20712 29908 27144 35182 14775 177 10148 -6052 -9316 -11013 -7129 11397 9799
15588 9799 5593 -1893 3485 27700 29311 18739 7462 10431 24280 35440 45550 23962 9150
15575 9150 1539 3724 -14476 -9780 6919 -7546 -16982 -2373 -418 -7031 -775 22312 37531
15562 37531 24524 2099 -10359 -1349 22527 27561 15420 70 -11762 -8037 -4106 2650 -8447
15549 -8447 -8858 6194 16619 36 3952 -8298 -26951 -20194 -19135 -6557 -5374 1447 -8253
15536 -8253 -5350 5019 10772 8909 20053 23476 21153 190 159 -23205 -17583 9639 4535 13270
15522 13270 7378 -10888 -28783 -18085 -9801 -6071 -7617 8868 9173 10872 -10401 -11405 6545
15509 6545 16021 9983 14718 8674 3300 14316 11819 5597 23063 29921 11796 -3949 -11669 -1533
15495 -1533 2970 4965 -6047 -15002 -7300 556 4099 1647 -4363 -8728 -3343 1799 -2917 4206
15481 4206 21234 22332 29930 23362 25962 32983 45381 44999 35196 29183 43198 54310 68766 79579
15467 79579 89760 103215 109131 151828 209281 230091 258804 275524 314775 337905 354193 357349
15455 357349 341559 316301 303800 285328 279910 251622 211096 180223 150943 143101 136354 117650
15443 117650 87200 79303 85054 78032 48345 43827 37430 23855 16142 -4515 -8410 21422 46330
15430 46330 41415 42276 28000 24347 21556 25146 41921 16808 9074 15545 20537 33333 46117
15417 46117 45579 16637 14555 36712 43706 21064 22932 18544 27549 27219 28387 24624 200 -8069
15403 -8069 2359 9884 31313 28756 18949 18224 31839 33407 28898 9487 11143 5882 7260 -4683
15389 -4683 -7082 -7426 -20833 -7007 -9260 -8608 -20284 -6977 -10849 -36343 -19203 13236 23710
15376 23710 15024 12111 28412 21414 1102 4729 7854 9585 11130 9337 -12489 -35672 -16694
15363 -16694 -12716 -2146 740 314 -8304 -976 -4719 -7156 -3556 -25231 -41358 -65559 -76202
15350 -76202 -52601 -19430 -11467 -18238 -6083 1153 -5819 -7433 -7308 -9322 -9634 -6079 -524 11334
15336 11334 31887 26894 1771 -13494 -3694 16480 32567 27579 15268 8981 12147 24452 11762
15323 11762 6362 -12362 -14938 14391 19788 -1064 2208 14936 26093 8429 -2932 -3959 -8263
15310 -8263 -12568 10915 7921 8093 10177 -8303 -24775 -36493 -33835 -7163 12151 1866 -17733
15297 -17733 -16900 -27402 -29216 -27829 -25125 -19281 -18999 -31383 -25331 -8598 6944 10092 -7606 -1745
15283 -1745 -5483 -11865 -10169 -7805 -6226 2248 9081 4634 7347 9096 7071 -22789 -32147 -15357
15269 -15357 -17929 -32488 -19608 5112 26199 44871 43050 24288 12198 2837 16828 25959
15257 25959 10288 -1308 -9013 -1998 13372 32187 21484 1284 -20077 -20001 -10003 -21888 -30401
15244 -30401 -16869 -32914 -35747 -20331 -25837 -33686 -34755 -15194 7739 10303 -4661 -14410 -14016
15231 -14016 -9592 -2496 6196 -4762 -18014 -15871 -15176 -16658 -16863 -8669 -1896 -15482 -15066 11365
15217 11365 25768 21522 7471 -4347 -3476 -4690 13317 10686 2424 -18926 -26561 -14458 -24748
15204 -24748 -41913 -37122 -24783 -8288 -6237 -4989 1322 11996 23528 17446 2159 -6881 -2640
15191 -2640 -23612 -30816 -6742 10889 6010 4644 -4319 -18302 -13384 -9302 -11959 -28123 -30755
15178 -30755 -18504 -24070 -23910 -10534 -21589 -23789 -21813 -40420 -23920 -16353 -6317 -3384 -8717
15165 -8717 -24042 -39547 -43180 -41684 -8488 -163 -17548 -17000 -14729 -6815 -27696 -35989 -16468
15152 -16468 2711 -4861 -8192 2968 6530 -11129 -25226 -18455 -17455 -26933 -27330 -23235 -28230 -22560
15138 -22560 -18980 -272 19604 14870 682 -9044 -25398 -22804 -8869 -16134 -21872 -34574 -30467
15125 -30467 -37213 -45339 -52735 -43102 -31225 -3059 14063 -4610 -26178 -17129 7608 -11132 -34460
15112 -34460 -32636 -19239 -21183 -48313 -42434 -13813 -19862 -16452 -21127 -17955 -13983 -184 -5094
15099 -5094 -5474 -14764 -13140 -13805 -21585 -28570 -18073 -7646 4099 8998 -13066 -27089 -37615 -33935
15085 -33935 -22010 -19770 -17845 -14515 -27298 -15428 -7813 -19111 -21648 -16402 -2016 2692 4299
15072 4299 -10859 -20719 -17428 -16596 -18434 -7358 -18284 -25260 -18709 -8884 -3734 -4538 -16850 -23944
15058 -23944 -1597 -22915 -31868 -20961 -18863 -25897 -21410 -14278 -20750 -47527 -35427 -4161 -1579
15045 -1579 -20067 -7428 -4742 2024 4532 -5385 -12028 4152 532 -19377 -25890 -31172 -31094 -31082 -31331
15030 -31331 -35521 -48888 -42751 -18172 3998 -4412 -8704 -11465 -10149 -16886 -27377 -16205 -8922
15017 -8922 -26862 -40273 -56593 -39992 -3639 3993 8106 -7711 -21177 -33974 -27114 -7322
15005 -7322 5033 -3786 -5207 -4512 -23013 -15444 -14632 -27486 -25132 -6071 -7636 -16417 -32175 -19055
14991 -19055 -18877 -13996 -3710 1596 -5586 -7177 2257 2809 -15072 -18708 -25218 -22487 -35654 -31137
14977 -31137 -15725 3569 10199 -6063 -15456 -15032 -16325 -28699 -31707 -30484 4645 17191 15098
14964 15098 11677 11027 16962 6657 -13362 -32439 -29075 -26286 -18662 -7427 5847 16129 12092
14951 12092 18273 10563 1281 -13717 -42542 -43513 -26450 -14374 -12970 -13229 -14245 -3324 -27885
14938 -27885 -46586 -57503 -57773 -42753 -32955 -23267 -22256 -16706 -22620 -18848 6271 7147 -14903 -13556
14924 -13556 -11545 -26733 -25853 -15584 -14771 -13839 5152 5997 5097 4923 22319 25864 15778 8396 7867
14909 7867 -6384 -26744 -36915 -27430 -5131 16268 9490 -6242 -3565 7631 -6776 -22173
14897 -22173 -3110 -18509 -22742 -5571 -10427 -12299 -10102 -15615 -21296 -21931 -19005 -16247 -9475 3019
14883 3019 -4306 -9329 -8734 -8811 -18138 -21303 -21524 -8379 -30 19104 22798 3952 -2753 -8851 -26183
14868 -26183 -20716 -13652 -7860 -6845 -17864 -24373 -26350 -28256 -39277 -57076 -71497 -46951 -26295
14855 -26295 -18681 -17166 -13565 -3030 -10350 -31546 -13835 22484 20662 14316 660 8281 9436
14842 9436 2549 -1059 -9812 -5426 7376 12881 16123 25073 35213 18978 -5613 -27667 -32394
14829 -32394 -16252 -16668 -13691 -29006 -16620 2303 10047 11900 -9308 -4622 10471 -3215 -3370
14816 -3370 -12252 -12106 5052 18003 16193 3652 12900 -6462 -13473 -7184 -3764 -17860 -10555 -752
14802 -752 -1374 7949 5716 -21015 -25545 5906 13506 4322 5496 11859 20727 16221 -8573 -14433
14788 -14433 -11408 -30851 -26086 3383 13628 24047 17444 11680 11717 -4134 3558 14007 17509
14775 17509 16895 -7517 -26446 -28514 -15171 -18565 -30549 -24377 -14050 -27214 -30001 -30657 -25304
14762 -25304 -26009 -35274 -38741 -21022 -14130 -24545 -30131 -33140 -25141 -15100 -16925 -18444 -20770 -3786
14748 -3786 -8282 -31753 -29171 -48541 -46640 -57136 -50196 -44091 -21161 -9124 -22136 -35006 -46240
14735 -46240 -31932 -11901 -12970 787 26871 24676 10960 5599 5812 -2578 -3529 12022 7260
14722 7260 -14696 -47858 -41310 -36019 -20826 -18228 -15886 -17182 -19935 -39470 -38831 -7269 -14893 -17213
14708 -17213 -14389 -22620 -18829 -19198 -29204 -46872 -48441 -50098 -38670 -18110 552 -1627 20323
14695 20323 31076 41251 35909 22411 -1052 -18350 -14399 -18990 -18617 -18710 -9092 12388 18587 13941
14681 13941 10133 -5940 -22484 -12012 -9628 -20142 -26026 -23903 -19801 -10158 -8466 365 -19315
14668 -19315 -32988 -39810 -49487 -57864 -49961 -42298 -47623 -42487 -37213 -57175 -40325 -28814 -13761
14655 -13761 13640 7147 -5 2859 -5777 -8994 -5989 -13796 -22114 -5365 1669 4312 2864 -6615
14641 -6615 -16879 -28532 -26838 -31401 -15517 -9218 -6907 -14799 -23267 -39244 -34751 -37123 -34065 -15932
14627 -15932 934 -9552 -21136 -19738 -20204 -23866 -26504 -11412 -6746 -18649 -45314 -41665 -42749
14614 -42749 -30069 -19327 -7917 -2182 -5648 -10593 8230 19967 6493 20385 33070 9185
14602 9185 14772 34040 8484 -4371 1450 32323 48229 44865 29115 15192 -240 -6024 9708
14589 9708 12424 8874 17320 4541 -6776 -4536 -8846 -14241 -10434 -1859 -5333 -20226 -23249 -11341
14575 -11341 -8575 2951 -6408 -35816 -15084 -8877 -2472 -5523 -1837 718 -13682 -12747 -15039 -14923
14561 -14923 -32134 -41378 -30559 -39266 -27322 -20823 -22070 -2737 9393 16287 11002 10505 -1958
14548 -1958 -3565 -8728 -2043 -12868 -8958 -5952 -30229 -30861 -17649 -6886 -7603 -16369 -8516 -1782
14534 -1782 -18820 -39884 -28522 -3096 -23012 -19497 -9482 -12739 -7528 -13388 -5698 -6672 2678
14521 2678 17813 1444 -14270 -27585 -26551 -8318 6076 10377 21199 6180 -28818 -31227
14509 -31227 -13786 9046 21270 44506 62369 66393 51218 27765 8118 -13505 -17560 -4899
14497 -4899 11888 -4317 2192 1583 -9486 -6162 19070 -3915 -8669 4034 10246 19566 17302
14484 17302 -4419 -16380 -16570 2959 4783 6737 -506 -16640 97 18977 -5436 -21943 -25449
14471 -25449 -36407 -28823 -16031 397 7409 2194 -9384 -22029 -24046 -6974 9380 -5669
14459 -5669 -6963 2048 6304 -4286 -9324 -10694 2730 -11599 -3763 14642 16649 7668 -9067
14446 -9067 -9862 -20991 -24287 -35733 -39615 -28215 -49082 -52684 -46973 -52507 -47932 -41990 -52556 -60220
14432 -60220 -51390 -34154 -22663 -44802 -57108 -46487 -23507 -29921 -18273 -3959 -19294 -24180
14420 -24180 -19989 -45894 -40720 -18310 -12129 -17617 -18229 2814 5957 9711 9978 11828 10229 -3334
14406 -3334 -3519 4607 3582 -1408 -2449 -920 16261 13309 -3013 -10273 -34531 -51261 -76665 -77066
14392 -77066 -56443 -53368 -51478 -50346 -42580 -21970 -2263 6571 11059 18693 20643 21807 17834 11239
14378 11239 24407 19345 2763 -24472 -15665 -12335 -17560 -34164 -24616 2229 19790 10637 -3878
14365 -3878 -10384 -8264 -3761 19612 25377 3570 -1113 3202 6591 7458 7304 -15903 -27905 -5546
14351 -5546 12187 -9747 -38392 -47474 -47255 -54275 -49966 -43693 -28390 -6545 -4626 -1600 -13935
14338 -13935 -5826 -4956 -29593 -21997 -15926 -13421 -14290 -11202 6594 9305 13418 8657 -10727 -37520
14324 -37520 -31440 -19054 -13681 -19170 -26445 -21439 -18587 -4621 -5089 -5719 -18899 -38381 -37509 -15071
14310 -15071 -6140 -2678 -11741 -19719 -37329 -28506 -10341 -14034 -23288 -13685 -8175 -37619 -42736 -29249
14296 -29249 -26385 -27739 -16607 -13760 -1681 3488 -5796 2588 2089 -1089 -28144 -32423 -23525 -40776
14282 -40776 -47064 -48519 -41966 -37062 -44634 -29835 -27061 -14980 -8503 18216 40066 49087 30642
14269 30642 26973 32500 28197 16558 11994 -626 357 9277 585 -23691 -26422 -49300 -46763 -46269
14255 -46269 -33453 -22067 -13654 -19373 -29116 -15027 -3578 -22647 -31933 -21253 -13078 -14780 -21368
14242 -21368 -22110 -24934 -28656 -28928 -15852 -11114 -15524 -19427 -18136 -13926 -26664 -21245 -659 -6566
14228 -6566 -19439 -13392 -21956 -22871 -11370 -21460 -17301 -10025 831 5992 19514 30431 11877
14215 11877 4002 -6514 -22365 -26771 -12718 20553 22437 2992 2406 -26294 -30489 -7905 -2895
14202 -2895 -16889 -6764 -1639 -13799 -26419 -17345 -2741 6924 6678 19355 9954 9786 -360
14189 -360 -22798 -19023 -21549 -14011 -30013 -33401 -16501 -2088 -5704 -1649 -1245 -10267 -17977 -11103
14175 -11103 1949 2263 -9927 232 -10706 -5537 -16465 -27704 -13645 3086 -12083 -19153
14163 -19153 -2224 -7458 -13298 -19050 -17828 -17985 -10609 -5415 4264 14766 3084 -21170 -33436
14150 -33436 -32214 -11498 -10399 -570 9766 12821 11652 7168 783 -5939 -7793 -3086 -22827 -24736
14136 -24736 -6794 4281 -3360 806 -4128 -7331 -5224 11198 21463 30950 44552 43239 27327
14123 27327 -864 -27695 -27582 -26892 -26994 -15417 -14146 -20942 -30031 -18448 -5977 -5234 -1399 10818
14109 10818 20594 15514 9144 7690 15270 2818 -4203 -3356 8926 19807 20481 15520 20802 19534
14095 19534 -2199 -3851 -18717 -18989 -21841 -25827 -11629 13232 55 -12674 -16283 3770 11498
14082 11498 6200 4971 7466 3134 -9421 -16842 -17032 -13775 5345 9459 785 214 -5313 -33984
14068 -33984 -41735 -21227 -10644 -6308 4256 -2694 -16207 -14314 -4343 -8140 -22894 -28004 -7704
14055 -7704 -3533 -6279 -3346 -10915 -14236 -14152 3204 1858 15640 26574 2074 -15429 3627 -9204
14041 -9204 -19850 7325 12615 4035 -3498 -28109 -41112 -23781 -11940 -7983 -22762 -22782 -13177
14028 -13177 -27241 -22529 -8465 12406 22039 8259 10908 24772 25532 25207 11015 20641 16028
14015 16028 -1328 -3264 -22659 -32127 -23736 -12379 -29214 -46682 -35561 -30101 -46835 -32050
14003 -32050 -20041 -12721 -13822 -25156 -32965 -19543 -354 7059 -25176 -51640 -52462 -37047 -21322
13990 -21322 -6721 2844 -5503 -11356 -23901 -40967 -16615 5046 -2949 -10586 -20069 -15093 -4706
13977 -4706 12968 30025 38096 32728 59840 61404 27785 -3552 12404 24785 15014 -16728 -21453
13964 -21453 1012 26556 27025 24649 31320 13621 -2942 -1740 3132 12749 12162 -3383 -2442 4130
13950 4130 -71 -19282 -15302 1578 10492 3150 -1603 2502 3194 2922 -825 -19649 -10810 1818
13936 1818 -22225 -17346 -4170 -13690 -16922 -21589 -18735 -17943 -16832 -1957 6190 14070 6257 -7936
13922 -7936 -19738 2157 6795 18039 8577 -12610 -4287 5368 5843 930 -7882 -12933 -11396 -18350
13908 -18350 -25461 -17409 10238 16449 15067 10621 14096 9331 10868 8404 -324 13702 15511 9856
13894 9856 -6858 -3156 21667 49784 46545 24963 9348 -2129 -11508 -9041 1284 1317 4603
13881 4603 18143 1668 -13364 -14840 -23899 -34925 -41309 -27806 -25322 -25290 -24119 -21500 -26565 -11723
13867 -11723 12463 20287 30615 24184 10729 22495 16055 17133 28652 15552 4068 -1666 -17945
13854 -17945 -6316 8939 4986 10798 26972 25705 14633 12422 13154 23798 4498 -989 1019
13841 1019 1145 17478 21501 1435 -5068 1316 19244 24001 11286 2819 -5630 -20305 -9658
13828 -9658 14414 27986 32751 4781 -3034 -7412 8845 19471 1626 -11285 -12394 -18781 -23635
13815 -23635 -23679 -21785 -19946 -13670 -2986 8102 23301 27690 18496 4008 -15117 -24650 -28980 -19948
13801 -19948 -21557 -28704 -33486 -38419 -39497 -20099 -5746 -2677 -1565 -6800 -13006 -12245 -19597 -9045
13787 -9045 -9287 -32391 -32358 -22403 -3133 -14771 -22293 -6007 -6483 -326 8955 -3578 -1568 4836
13773 4836 11988 28985 18957 18573 14511 18503 15777 13111 11352 -5791 -14360 -3957 -1565 -911
13759 -911 -10528 -19250 427 9642 -9960 -9249 -6788 -3063 2355 3703 5201 -2734 -1218 10190
13745 10190 14509 9365 -13858 -24571 -9887 6179 22012 14495 5942 -1876 1683 -4834 -13202
13732 -13202 -9691 -9462 -3539 -12102 -22940 -16207 -3047 2372 14121 20905 10209 2285 11412 31549
13718 31549 20964 8779 7405 879 22452 22930 28354 45643 51375 34639 13732 24662 27062
13705 27062 18607 16223 23149 19949 6485 1506 2574 9793 17997 5334 -12261 -13844 -14575 -14531
13691 -14531 -12304 -26811 -41066 -34560 -19531 7769 17453 30952 25445 -334 -9831 -17751 -28680
13678 -28680 -30967 -20473 -28922 -32918 -38416 -38924 -23790 -28324 -18652 8821 23420 28094 23142 -6426
13664 -6426 -5145 1359 -5286 -4444 -1853 15548 17391 4371 9514 15333 14006 12504 16722 21734
13650 21734 24194 -4476 -10053 1245 7074 18266 26452 19305 -3460 -6456 -12759 -38795 -31808
13637 -31808 -12421 -1954 -2162 -3465 20110 34501 21422 21186 13513 -8422 -21767 -17359 3021
13624 3021 25387 62629 64692 65103 41445 16877 1361 7030 2488 -99 2222 -13659 -30968
13611 -30968 -33003 -21139 -21908 -13203 -10277 -8789 -6681 138 -10035 7943 3174 -29250 -38480 -25009
13597 -25009 7582 17364 -8665 -31442 -12750 25949 35579 27263 38060 53455 40212 20393
13585 20393 1283 -6853 -19771 -14771 637 789 8871 6240 -3804 -15960 -22603 5251 17827
13572 17827 9869 -151 8443 33587 35564 27010 6441 -321 7567 -4925 -2687 22605 31024
13559 31024 39635 29422 1470 13830 12356 -10482 -1379 13561 11499 9097 4218 16139 28732
13546 28732 28900 29030 28529 1852 9575 5356 -2415 -18676 -3612 2241 -934 451 4586 701
13532 701 -11416 -5812 16520 15251 11145 -6844 -503 8190 19302 19238 5670 12676 17150 16790
13518 16790 7098 -10656 -12472 2852 17265 14542 5079 7982 -2288 5563 9687 -3749 -6432
13505 -6432 3631 14249 38047 38368 26650 10183 -4442 -6782 785 6184 -1377 -1142 -5714 -22434
13491 -22434 -5707 22675 38506 37570 35685 25071 13362 18114 29605 37217 41516 34361 22001
13478 22001 12974 9452 -1259 2855 9918 2265 16588 28723 13878 505 22598 36961 41216
13465 41216 31300 29281 29814 36830 33916 40830 7650 6062 19167 11360 6971 27178 26623 20976
13451 20976 7187 10236 22008 8456 5624 15914 29959 38143 13734 14882 21797 14992 23368
13438 23368 24388 21138 7625 -2797 -4659 -2924 685 2053 -5983 13166 18008 25871 29122 15081
13424 15081 4274 -6393 15060 39030 41693 35636 19253 20091 26492 23262 20297 15283 6117
13411 6117 552 17726 32390 26482 47644 60339 65027 50870 50179 53686 24910 10355 8166
13398 8166 16451 9065 -4551 5699 3607 849 18014 25794 20034 33668 31213 25366 38602
13385 38602 36873 5506 4075 1708 5381 19759 14551 -8437 -17840 -23010 1524 15240 16061
13372 16061 -3042 -7689 8888 24035 63672 78598 72683 56830 56777 65965 71194 48556 41792
13359 41792 41200 43856 20262 14426 25342 49866 42818 13989 2165 17599 10284 -8566 1088
13346 1088 20946 31095 30339 28746 32402 45740 68636 85784 75363 68970 49849 42498 42298
13333 42298 40002 27631 19139 9744 -6699 -3539 24162 45890 34320 29164 14419 1948 -8622
13320 -8622 2695 21101 32622 29078 6057 18658 33432 35678 16552 2586 13869 25152
13308 25152 31201 21900 5554 12413 8193 -2834 9302 41563 55145 36481 20955 18807 41209
13295 41209 47572 43336 45908 40980 29993 31150 39708 57070 31698 14955 -2768 414 9688
13282 9688 25519 27803 43548 46527 39713 37027 54959 52791 38429 30168 25961 38570 48500
13269 48500 46662 45882 41080 8880 2570 13979 25513 21751 32750 39181 49417 24360 19879
13256 19879 42075 52091 48585 49341 40507 51791 50102 32035 22946 34191 32186 23061 28759
13243 28759 30297 26258 27985 30817 34253 39723 53766 77533 66466 62009 64393 41532 44821
13230 44821 57944 69345 73842 71433 69128 74838 70757 73916 81066 71046 72428 72753 44764 54751
13216 54751 64192 67383 57579 33351 54155 58717 59460 65472 74537 83546 70640 63552 64003 76326
13202 76326 86477 105543 138757 182088 244132 272388 263813 268087 261803 245357 217046 166180
13190 166180 137363 131444 137585 144426 137475 129099 119037 109703 97164 87233 66292 63943 82645
13177 82645 79219 72533 76633 90223 93287 100253 92793 73830 76650 69536 46999 50241 79279
13164 79279 81699 84580 91401 115732 148773 183239 212797 237664 261628 315472 416825 528681
13152 528681 631140 691805 724058 681738 578416 467748 376502 311905 249921 218137 208862
13141 208862 187719 170286 173071 148399 137841 128926 111576 92720 98073 105229 114128 119090 93446
13128 93446 109020 90676 91662 120596 158891 154437 134345 132479 125822 118669 111104 108321 113421
13115 113421 141753 169239 186767 210796 247867 311830 410085 526255 647997 756588 790264
13104 790264 768966 685941 553342 427823 335198 284178 267244 248715 227605 199321 177590
13093 177590 157730 155418 158533 140612 133035 122433 114799 109517 102490 84112 86387 101881 113996
13080 113996 131030 129680 125236 129194 117614 122334 120430 137154 127526 118177 128839 138468 147096
13067 147096 137242 142232 154793 174328 210479 253930 298578 321717 325413 303133 288025 243512
13055 243512 190798 182864 198877 190766 163706 150501 143654 135108 142657 133517 132254 131940 134243
13042 134243 128437 110757 124268 132327 133172 104056 79075 95460 123984 129190 126460 127064 136611
13029 136611 134737 123818 130176 142423 146169 152352 143141 153321 157479 138579 149086 160245 143371
13016 143371 162237 166040 138332 123476 125582 131335 133606 126201 120581 141344 162731 168741 165631
13003 165631 164407 165671 158769 158956 163205 152984 171664 187686 181648 155971 151127 129909 154324
12990 154324 178275 190295 180975 194298 217209 221205 211403 201573 195968 186547 190924 172820 174375
12977 174375 209836 205049 199097 182627 157265 168104 194286 191932 197355 209058 214318 207880 211913
12964 211913 221988 222256 211481 206784 200509 211870 205808 181704 168565 172773 177578 162304 174361
12951 174361 211011 231606 222746 231048 233217 231339 248043 264061 262799 270071 255254 245591 248109
12938 248109 255026 260913 246481 246027 254665 246479 238534 240533 259262 266215 269653 265519 267958 274486
12924 274486 281278 289685 294441 276492 286749 292177 280741 275465 265336 266340 278684 296804 287796
12911 287796 262225 266834 281907 288423 297956 316123 320694 308936 311815 326777 330521 328485 337926
12898 337926 351286 357302 353150 363905 355896 350181 340007 330685 333961 333778 327212 328098 328210 328675
12884 328675 329362 350840 372889 377622 380445 375329 366230 371394 363798 363753 379737 392026 399817 392884
12870 392884 381676 393663 403859 412698 407684 417766 434846 424301 418369 433504 443639 455326
12858 455326 476048 492851 497696 485987 479462 479303 451297 449665 469379 518759 533013 506081
12846 506081 493666 488285 499427 516792 535278 545868 554446 559836 568682 556585 535056 524996
12834 524996 507143 503076 518442 531169 518343 512663 521056 544948 574179 577570 579342 578651 564118
12821 564118 567926 572254 576741 584142 571578 569729 569347 602529 632353 661504 656779 642759 652535
12808 652535 652583 657146 658868 681458 685401 689492 685872 684906 697514 718524 740831 735157 729114 738576
12794 738576 750397 750399 759371 776754 794142 813121 819917 810604 803328 800012 809352 828426 853125
12781 853125 872138 870478 865886 883596 879057 871893 876419 885543 915700 943597 944125 948776 959339
12768 959339 967345 974408 988041 998080 1003365 1015874 1042879 1050679 1056330 1071049 1080805 1085729 1099034
12755 1099034 1086360 1103578 1096475 1113385 1122552 1127471 1145401 1162006 1176872 1203171 1228801 1243173
12743 1243173 1263880 1308396 1329212 1338552 1357797 1385289 1393171 1392936 1412975 1436408 1448316 1486746
12731 1486746 1519508 1534349 1553546 1587551 1601748 1606063 1620407 1637532 1667538 1689620 1690107 1703172
12719 1703172 1726371 1761902 1797225 1830994 1864028 1878556 1905987 1919480 1949594 1956955 1994874
12708 1994874 2044316 2088073 2137446 2174059 2204212 2219117 2248979 2296319 2327806 2382846 2436555
12697 2436555 2461509 2509564 2549001 2578549 2623954 2670498 2720442 2752648 2803621 2857090 2913372
12686 2913372 2968466 3003810 3054798 3114751 3175499 3207873 3253620 3314905 3402162 3487263 3546575
12675 3546575 3587206 3662557 3729208 3799321 3885481 3962989 4059360 4138662 4215647 4279448 4344476
12664 4344476 4451714 4549905 4631679 4709206 4811714 4938084 5051558 5148834 5247821 5341822
12654 5341822 5443341 5559374 5694021 5818172 5943273 6065521 6197431 6348394 6489541
12645 6489541 6620699 6758121 6920123 7080047 7247371 7436093 7597174 7753427 7922966
12636 7922966 8087178 8266412 8460305 8666771 8868148 9078025 9287627 9499626 9715459
12627 9715459 9933304 10139934 10354751 10588325 10830790 11070373 11318242 11563892 11810868
12618 11810868 12064020 12306921 12563701 12818302 13088247 13354885 13596001 13845331 14085509
12609 14085509 14336672 14589753 14830352 15072627 15304421 15525772 15754628 15965080 16176896
12600 16176896 16358041 16542059 16719881 16874979 17017110 17129079 17244198 17343219 17440781 17513707
12590 17513707 17575823 17605590 17627983 17634957 17628492 17601423 17565418 17501224 17419054 17297962 17179993
12579 17179993 17055895 16902388 16747919 16599428 16421606 16246077 16055481 15845741 15623147
12570 15623147 15383689 15166655 14953346 14727302 14473502 14217678 13968395 13732518 13499203
12561 13499203 13247939 12984233 12723231 12490930 12245609 12008394 11786217 11538640 11277189
12552 11277189 11066653 10859106 10609167 10377008 10159002 9948421 9719822 9513663 9314525
12543 9314525 9116382 8934359 8741417 8546237 8354027 8164556 8014929 7855825 7678556
12534 7678556 7506403 7346526 7190145 7050131 6921782 6778535 6618001 6480161 6366086
12525 6366086 6233504 6094693 5967879 5833007 5714431 5623846 5522850 5426406 5336457 5231866
12515 5231866 5140364 5055213 4962705 4861139 4792348 4712864 4625612 4523206 4432401 4357417 4269367
12504 4269367 4170615 4097614 4038734 3977774 3918759 3850488 3783808 3726707 3677028 3596497 3526913
12493 3526913 3470124 3414323 3356512 3313788 3288347 3228150 3146320 3089404 3051388 3020293 2993040
12482 2993040 2937487 2893454 2841887 2805192 2764220 2735761 2697940 2661299 2635850 2591812 2530246
12471 2530246 2506808 2485437 2459729 2423945 2387490 2358822 2316729 2277914 2229725 2210903 2179177
12460 2179177 2158154 2127331 2107244 2098123 2070503 2053042 2045198 2016004 1965828 1922963 1878740 1840326
12448 1840326 1810365 1814083 1797737 1770765 1741358 1728260 1710244 1704940 1689317 1663693 1645376 1622971
12436 1622971 1611354 1586093 1569738 1581240 1571440 1551138 1538899 1533788 1507336 1482577 1451521 1430211
12424 1430211 1436288 1426542 1387314 1368746 1344435 1314970 1321508 1307299 1282426 1262211 1260143 1243148
12412 1243148 1238814 1228919 1211972 1211230 1214697 1191338 1172702 1172302 1153625 1141768 1134029 1128181 1124492
12399 1124492 1111464 1075204 1043853 1025363 1024031 1026368 1022176 1012135 1001066 1024288 1022733 997010
12387 997010 974782 968616 971668 976427 972230 977228 965656 957083 963100 935638 916106 876946 841547
12374 841547 829771 834657 828277 818258 822812 822594 822389 812488 815126 809447 815013 802124 774083 745618
12360 745618 730168 721492 711289 724599 735430 735096 713773 680203 668800 661233 661163 657581 663908
12347 663908 681770 699809 690940 685013 674918 668563 664768 639634 618335 623002 625854 611399 604880
12334 604880 597949 591051 608100 600040 583207 590326 589112 598214 583713 569716 568261 576487 580638
12321 580638 570090 559629 564578 575816 578916 572411 574170 565644 556409 549525 552619 534527 528034
12308 528034 527499 515977 502584 494523 503996 514810 507659 511514 508924 498994 519219 516174 493647
12295 493647 487703 479446 457123 442382 451945 467880 462145 463952 468750 473483 454651 432439 416767
12282 416767 405098 417282 419876 419172 424530 433287 451060 442890 438736 428460 426139 437244 421281
12269 421281 408298 414403 409512 387964 391915 397466 372853 380574 386680 375345 367591 390618 396445
12256 396445 385006 385805 378441 372965 364373 352154 344941 351794 349322 367981 366160 362657 363182 351036
12242 351036 345935 355913 357260 347850 322643 310128 319352 335334 327498 321407 316889 318383 297231
12229 297231 266878 282102 293972 302596 310342 304080 304791 322536 334751 326010 324239 334275 318591
12216 318591 311037 302984 294796 294408 286016 302752 316498 289589 276410 288458 299340 287681 265983
12203 265983 263447 271493 281212 288321 268600 274234 290462 294991 295354 292157 280937 281246 285714 276974
12189 276974 268866 272090 256408 250871 239606 236531 239085 263927 290062 286079 280071 252566 258907
12176 258907 276069 270072 244865 227715 239592 254224 237385 229088 206793 216334 222949 219644
12164 219644 216179 233065 235836 232254 241889 237476 237915 231935 225159 226590 213493 197931 196817 201917
12150 201917 200392 204994 215142 225166 230250 227862 215795 209219 197370 186377 190459 194194 169906
12137 169906 166075 174891 180958 179702 187674 193607 192791 179006 179384 174968 176105 184694 197923 202529
12123 202529 199871 225676 222668 196931 188016 177053 172304 177990 176326 179652 191238 190932 187527
12110 187527 192723 195369 159907 146179 161825 160910 169865 176510 171080 159307 172176 194224 179147
12097 179147 176408 180347 170023 163370 162026 163960 151424 133409 152213 159686 158624 156717 168256
12084 168256 165155 148065 151126 145765 135822 139952 141251 148185 161501 171015 173321 181734 165919
12071 165919 141566 142039 143335 137452 139241 149934 173738 166103 143755 137864 152877 153449 139727
12058 139727 139944 141703 137441 131113 125366 133586 142362 137849 138737 140844 128502 130183 128625 127619
12044 127619 128093 130155 147905 147329 132451 145347 141398 122890 102389 109987 116027 104360 112915
12031 112915 135124 141718 153522 166867 168278 150671 158834 148013 134466 129694 147454 143313
12019 143313 135526 132793 136650 137290 144885 138551 141850 132321 134121 136081 121520 121303 144793 162141
12005 162141 150978 128254 110309 101881 68325 69066 93602 118194 118634 106463 98426 89791 103368
11992 103368 113654 105992 95673 99950 99155 99976 101919 92584 72594 58161 70673 94689 95398
11979 95398 102399 100159 87616 105722 124814 135708 149163 159558 138637 121022 113663 89528
11967 89528 78359 78126 83298 89040 100757 99988 113300 131048 126393 109324 93850 97948 83759
11954 83759 87917 104977 115295 108871 108188 105332 109108 87714 84273 106476 135114 123896 109262
11941 109262 104080 93822 85291 81703 57647 49589 76545 102489 94053 98988 105672 95147 107712
11928 107712 116373 110324 86321 74794 88667 83855 67535 84176 94376 77078 75114 81163
11916 81163 79892 105987 104634 104662 107092 85563 65701 62115 64938 69239 73188 69171 53130 48968
11902 48968 68700 84459 81756 68385 73824 81111 91264 92259 73819 60163 68380 94121 98887
11889 98887 92437 75292 93937 110635 120913 119008 98903 81640 80320 85613 88176 89941 92898
11876 92898 93245 94171 95809 77101 61169 50011 61530 61796 68109 71459 75368 71925 54131 57144
11862 57144 73199 65465 43986 39731 39925 43270 44590 48951 50554 42719 59778 80741 91464
11849 91464 79138 74398 87672 66117 46551 46012 49534 56658 60535 51033 46551 49285 33200
11836 33200 14517 20365 27527 27875 50794 68171 74683 74031 67660 84357 74852 57882 52831 51084
11822 51084 41951 64132 101580 99745 68447 49438 49092 59698 50471 46938 36874 41392 51359
11809 51359 68920 70431 58357 60542 66164 45952 39417 41878 34304 45955 79054 67530 70401
11796 70401 75505 75332 73912 76419 62515 55013 47712 21919 28829 24073 22982 30732 48452 56671
11782 56671 49822 47320 26744 39498 59720 59773 61177 53022 52573 52874 47527 50398 57454 59714 38223
11767 38223 28664 49214 67142 56702 54726 44676 35168 51167 57973 48153 33330 21284 10581
11754 10581 21814 22030 26141 27211 35592 30180 36419 39753 42491 40492 61179 78362 84612 93180
11740 93180 90234 74900 69749 58486 51772 57038 37805 39979 44373 44968 40363 53335 65588
11727 65588 67889 62738 42531 19545 14475 23440 37196 38210 30521 31393 24525 25315 27751 40141
11713 40141 53562 49061 57585 45943 55920 48537 58657 79029 70607 54077 42772 33019 20819
11700 20819 -2550 -6617 17344 18788 22668 36816 34878 47117 45055 39441 46886 35739 35531
11687 35531 35858 34433 27356 27043 9951 4026 18464 25801 25580 16269 16283 30548 50446 62471
11673 62471 59153 71492 53069 45435 49793 41390 47805 36875 33643 36033 29757 36466 36529 44570
11659 44570 42666 30657 30625 41613 31714 18285 9496 18566 35373 45560 40635 27223 39900
11646 39900 40839 54784 49460 46726 42779 50327 67779 58250 35057 39892 65754 65639 56307 53875
11632 53875 62227 52996 61534 59875 57531 40462 31752 38300 37757 30237 21520 10881 11813 23339
11618 23339 28256 21034 14382 13815 24746 27718 34128 36254 27560 28864 36381 26157 28059 28316
11604 28316 36107 42740 49794 56163 63058 43709 36244 29108 27501 30383 20383 22011 25260 26709
11590 26709 34790 23367 21837 9255 12318 30630 38757 37785 38709 41855 50312 40512 45073 73556
11576 73556 71972 50313 27616 17579 32696 21783 18665 30017 40405 35354 39079 47800 35311
11563 35311 19034 -472 942 20564 27227 38348 41233 34762 50363 51631 51706 34195 6790
11550 6790 9453 11149 20045 53807 60220 44725 20544 20356 34987 30642 28799 37353 33144 27222
11536 27222 33193 45055 61778 55374 36962 15476 23577 40380 48438 39947 34350 27578 43189
11523 43189 64590 45790 31689 44224 35378 19323 16270 25200 25772 19309 15592 11784 30100
11510 30100 46741 58209 49605 29710 11174 5037 17705 42031 38727 33886 30736 2691 -7190
11497 -7190 736 -8704 -4682 20712 29525 38124 37152 32630 34616 35106 26873 11405 14413 25354
11483 25354 21708 10685 17660 29823 41004 55846 34814 27610 22592 23206 29897 25554 21401
11470 21401 11092 4570 10632 23747 21679 9543 6609 8593 4085 14791 35209 36609 32080
11457 32080 24102 37465 49115 44666 29988 30175 48305 38205 16019 1750 640 8353 14984
11444 14984 12512 22879 46205 49009 47016 42873 23915 13819 24485 21308 10807 93 17323
11431 17323 25945 10599 12892 16319 10216 16154 19391 38323 23390 1028 -846 10994 24402
11418 24402 40362 24945 -3345 5127 -1725 -3992 2364 8697 22327 25214 9204 -5454 6713
11405 6713 10231 16830 26129 28892 49228 42893 26586 31419 28421 18021 12046 8059 10569 23789
11391 23789 19642 10362 9161 4137 8997 -950 11239 15013 22510 17651 -13670 -29023 -5215
11378 -5215 -834 62 10873 26372 22859 7483 6064 17680 7355 -1847 6275 21517 15712
11365 15712 16941 8915 25708 35939 37883 28846 14416 13806 16188 -16277 -30917 -9974 32943
11352 32943 34597 31625 18424 7239 20259 33534 36300 40096 37215 32570 37504 53810 54892
11339 54892 29605 31646 43793 27803 20355 24703 26878 11468 1277 -993 -5091 2391 11104
11326 11104 23279 23911 31725 24633 -11555 -15884 -3557 15727 6166 11464 21566 26274 20684
11313 20684 31317 33812 46925 61971 57711 39729 30511 34713 29637 24521 23337 33019 39097
11300 39097 38047 36462 30593 33657 1515 -28689 1443 39943 41914 31572 28585 14690 -5332
11287 -5332 -9978 946 952 1476 1627 6687 8200 3495 -2445 -295 -10532 -6227 18119 39250 32933
11272 32933 31039 24044 12510 -6234 4347 12594 24922 29138 22882 19534 46359 36125 1870
11259 1870 4825 2855 -1367 3918 15646 13192 7367 23600 17457 6907 -3659 -8112 -12335 -870
11245 -870 15347 20424 22543 28974 12298 -12567 -24640 -56482 -55217 -27909 -20388 -12157 7218
11232 7218 20024 31245 15693 16864 5627 10891 21978 13983 13913 9089 1351 -10557 3814
11219 3814 2068 -10451 -13757 -22646 -27707 -14358 23017 22211 8543 6876 25068 39468 23369
11206 23369 22119 34380 26415 9204 13359 9299 14626 -1685 5959 8185 10602 607 -13750
11193 -13750 -17948 -1333 6254 7442 6213 -1278 -18048 -40146 -35939 -13831 -11932 -13677 3
11180 3 -4424 -9071 -10026 -5157 7457 -2384 -3062 -1656 -6574 1026 13731 4456 -20927 -35862 -16898
11165 -16898 -17267 -26251 -18011 -14695 -18222 -22414 -12452 -13968 -19521 -16391 5022 17122 10251 12393
11151 12393 14093 -819 -7557 -1674 -9014 -12320 -13609 -28994 -9612 -2404 -15928 -10250 10896
11138 10896 18124 17110 29230 31493 17976 18090 28374 28718 18841 11745 -5766 -6962 -19365 -19215
11124 -19215 -3019 6069 2834 -12168 -22825 -5537 9355 5700 -5725 -6540 2658 23949 25310
11111 25310 12697 8906 28104 42292 34739 31820 15265 -6987 -11368 1135 12715 9790 -4969
11098 -4969 -5550 1078 10998 16333 15171 11019 11917 10842 3949 431 -2611 10264 8095 -5311 -8837
11083 -8837 -2732 1079 9245 -21303 -23346 -17391 -12230 -7970 -33951 -35202 -18012 -14664 -8115 -12470
11069 -12470 6766 22235 24707 14124 2882 -2696 4377 21515 38648 25028 4007 -7035
11057 -7035 8071 16182 27742 34246 33426 31746 18598 20552 38493 24448 15209 15600 26329 18157
11043 18157 9347 10580 -6186 5077 11231 7923 -5861 -3755 -8691 -8466 5486 20938 17212
11030 17212 9532 9005 9491 13467 -7856 -6900 2746 3341 -11693 -4310 1831 -1313 -19122 -22061 -3630
11015 -3630 13521 21691 10800 -7227 -5135 -7055 16940 20075 12770 -6749 -8110 2491 697
11002 697 2801 12217 15077 18395 36767 35580 6162 -1893 959 29942 23319 22452 30920 26657
10988 26657 27964 11442 -7021 -10920 11556 12805 7021 631 9688 23163 25694 18431 28350
10975 28350 26110 3268 35 -4415 5564 1303 7554 11465 6650 -1408 2057 12997 22471 44195
10961 44195 28315 -6845 -29703 -35823 -29307 -21699 -39134 -29907 -13218 -10421 -11448 13357 5674
10948 5674 -9480 -6478 4967 -2061 -1373 -1598 -10675 -17689 -4271 8132 20560 31707 34806 19441
10934 19441 -3257 -6654 -17309 -24485 -12752 22228 36313 24507 10258 -2579 25591 31621
10922 31621 21731 26621 14626 -6052 -4361 -254 183 2530 622 -13119 -1758 -3352 -10093 -7270
10908 -7270 -19725 -38112 -33992 -36216 -16471 -7015 -3264 -12155 -8780 -24309 -26864 -28451 -24922 -19241
10894 -19241 -10503 -13245 -13346 -29372 -28003 -15720 -37224 -37412 -25009 -14857 -783 13771 13259
10881 13259 14969 17086 33261 38938 30571 19963 22529 12796 -1425 8474 16038 8738 -11854
10868 -11854 -17366 -21140 -34055 -15066 7039 6552 8547 14863 12084 12519 13649 12544 7204 11813
10854 11813 321 -25854 -14406 -14999 3438 -750 -14627 -12160 7564 30416 11546 7191 29997
10841 29997 39207 29615 41121 33983 26193 27097 31597 28068 32715 36619 29403 19003 -1163 -19436
10827 -19436 -30813 -30667 -22499 -4603 4992 -10039 -8736 20077 44072 39919 38882 30497 9512
10814 9512 -10930 -14655 -17146 -2891 -2763 2619 16055 29454 24612 17313 15757 21005 23256 26515
10800 26515 37881 31077 29780 25461 17846 34320 28108 23090 30717 13198 -6599 -31572 -28033
10787 -28033 -28029 -32594 -14615 587 4276 218 14606 6457 236 9832 3661 -4529 -10806 -5850
10773 -5850 10342 -514 -9676 -21266 -13293 217 -3188 -18531 -25779 -14754 -4707 -5675 3316
10760 3316 39814 51361 19273 5967 3768 344 23680 33198 7817 2241 6302 -10878 -8954
10747 -8954 -317 8321 6043 3220 -10994 676 3189 8792 -4692 -10827 -159 15397 29960
10734 29960 8946 2467 6524 12093 3238 446 -3257 -7969 -11596 -2019 -15304 -27939 1634
10721 1634 17254 13317 28367 42411 45184 17176 10160 13357 -6879 -4696 2887 8638 6924
10708 6924 11268 20067 7651 6261 15302 8954 16797 11624 179 -1112 6026 29880 50573 40483
10694 40483 17747 -1588 -20570 -25875 -3898 3760 18242 25452 12553 -671 19155 20341
10682 20341 11848 12434 1413 9096 23138 17750 866 -2877 4869 -4329 -20599 -22150 -15629 1287
10668 1287 8164 13313 -7533 -30257 -12487 9893 17194 26920 29962 31823 35413 46795 42736
10655 42736 34430 39080 41979 28469 18026 2600 -6410 -16354 -5978 19781 26077 20878 28149
10642 28149 16893 -5861 2026 11307 2043 9936 32299 34420 30123 32710 43006 44368 38009
10629 38009 51430 59368 56153 53159 57614 76130 99927 118249 125428 155627 206330 257199 316617
10616 316617 414428 555741 756834 987999 1211226 1435977 1624930 1692088 1618685 1436743
10606 1436743 1203072 948883 718892 550458 448861 360040 290776 233255 197773 171904
10596 171904 149394 135883 125770 126978 118955 110065 97751 75772 76951 84033 60276 37620
10584 37620 40636 64470 80669 57129 45523 41162 53549 41086 26402 18985 19228 32910 31028
10571 31028 20326 17968 9858 24630 22109 6721 20285 18594 16529 33763 45146 49199 30148
10558 30148 28623 43204 63853 46124 54073 57537 49701 40302 17694 29919 32773 41286 44206
10545 44206 38912 38298 56168 70202 85974 82100 77910 92119 118231 123077 126576 142953 134073
10532 134073 140581 136776 116255 114718 123219 139117 154081 179459 209528 252325 331771 431526
10520 431526 574313 765395 945994 1113182 1248418 1344943 1384422 1373099 1339795 1271440
10510 1271440 1130518 941206 721880 570533 438893 335146 291813 242479 206016 185204
10500 185204 148751 98736 87363 80049 71494 53154 45999 42468 44596 46334 59283 82176 92893
10487 92893 90197 104776 90173 80857 65904 86496 88001 87505 92787 86117 84894 80273 69158
10474 69158 60389 57637 43159 58098 58461 94309 125249 123111 121883 121909 134498 150229 152491 166080
10460 166080 177140 171379 170966 177713 143383 119890 114379 103458 68476 76226 83985 72583 78326
10447 78326 88083 79008 82256 114045 96351 74656 81799 97639 90658 85395 76274 81407 76719
10434 76719 58177 70291 74759 85574 112948 93260 67498 73374 97656 99919 81712 68210
10422 68210 89157 87621 74272 72099 71405 48874 36297 49728 55117 85677 97805 85787 109079
10409 109079 135563 173449 204009 250755 298587 351184 422977 467180 472984 468337 465078 467394
10397 467394 459420 431180 392868 349443 299260 260322 220487 201019 197909 179475 146590 133399
10385 133399 111542 84824 90312 105590 122889 143778 157679 175729 169670 155570 165243 183426
10373 183426 187000 203988 220753 235611 227815 228528 231699 224274 212825 208336 204297 200823 222314
10360 222314 210086 213732 209899 186814 154051 138569 121965 118222 120465 112653 80297 55783
10348 55783 38415 13923 3565 -2908 -12618 -13762 4169 8972 10004 -6962 -8868 -33960 -56079
10335 -56079 -70617 -82379 -69482 -17835 22589 63291 125733 196202 256112 292564 324220 342839
10323 342839 334807 323894 301689 287094 269897 278687 291400 304582 297386 296519 299089 310211 328740
10310 328740 353877 348871 320926 298031 264275 223793 218289 227096 222814 252151 263979 277534
10298 277534 295940 325455 353964 398534 430277 448520 478282 525128 577986 641138 720655
10287 720655 806766 854865 888279 879782 848547 819607 787866 735026 692331 680513 681310 688475
10275 688475 707989 726419 742037 772529 819014 871361 898138 927078 959222 972726 1008417
10264 1008417 1043270 1062015 1059925 1059044 1064219 1088076 1130420 1170092 1220562 1284623 1340572 1429304
10252 1429304 1524108 1590623 1671495 1763558 1864265 1960382 2037740 2132485 2243195 2344472 2462739
10241 2462739 2597880 2757856 2993162 3304430 3673529 4112129 4648971 5302448 6057784
10232 6057784 6862371 7679092 8464974 9221653 10054719 11035942 12205482 13715067 15668616
10223 15668616 18203085 21519693 25844506 31643417 39699419 51327211 68448923 93223716
10215 93223716 127219815 169801339 217006051 262103555 296921740 313201834 306716073
10208 306716073 280487604 241262995 195657418 151552357 115999378 90328377 71988958
10201 71988958 58435778 48125680 40091579 33692843 28555696 24373814 20960395 18233490
10193 18233490 16081260 14373341 12995183 11858394 10847498 9907379 9006804 8176114
10185 8176114 7416270 6740330 6171742 5666575 5238195 4866729 4528270 4222642 3961797
10176 3961797 3720102 3534442 3381405 3236912 3132371 3070574 3018658 2979601 2919502 2844823
10166 2844823 2793605 2777694 2736471 2678032 2610269 2567350 2551841 2545809 2568741 2570924 2582923 2627245
10154 2627245 2674679 2738738 2837179 2939540 3069580 3221504 3390390 3602779 3855922 4108908
10144 4108908 4420257 4827817 5328518 5979484 6868038 8077667 9720071 11854163 14442568
10135 14442568 17241331 19915684 22175772 23804421 24721156 25092272 25090208 24681925 23797665
10126 23797665 22679312 21868236 21840882 22802110 24842298 28229485 33474875 41487580 53662608
10117 53662608 71597021 96631191 128553084 164454905 199216011 227830782 246737665
10110 246737665 254114002 251749316 242817860 227449598 202360101 167720864 130779952
10103 130779952 99902454 77687305 61969149 50342321 41460124 34577276 29210532
10096 29210532 24963320 21560369 18791701 16555378 14737864 13255842 12025776 10996916
10088 10996916 10084882 9266615 8545153 7892339 7262963 6634017 6074054 5587081 5160238
10079 5160238 4782925 4426370 4132764 3887194 3633126 3421418 3232622 3059191 2911280
10070 2911280 2779072 2650833 2534791 2419068 2312509 2228620 2140118 2054210 1981391 1915519
10060 1915519 1886908 1834018 1763008 1683133 1605465 1529596 1460968 1413285 1378319 1344595 1307048
10049 1307048 1273144 1260692 1239713 1214921 1214722 1198631 1188051 1190354 1184534 1174395 1150052 1125871
10037 1125871 1104466 1090314 1065896 1044720 1015798 971022 933275 925271 896246 864952 856684 856253
10025 856253 847088 847488 844852 852860 855348 837233 837955 826962 815498 816245 806789 827351 837115 818925
10011 818925 808493 789505 783596 764367 756554 751510 749150 751173 737348 724766 712266 683119
9999 683119 688786 687465 669108 680845 697519 712444 745228 768422 817502 881792 953784 1009218
9987 1009218 1027654 1027580 1046190 1076237 1086253 1062256 1028060 980357 936186 902130 862008 857636
9975 857636 844772 810703 815242 799863 782571 770948 757475 737246 719092 695091 666826 668217
9963 668217 668278 660252 637937 611583 586297 556707 551732 538279 505571 486519 477315 471065 461440
9950 461440 433260 445431 451867 438149 446497 472648 509466 510430 501638 467938 453430 449712 449945
9937 449945 454253 426709 427181 435334 410664 366769 352961 358563 358500 364807 372600 379471 376469 363965
9923 363965 379202 391569 375363 376986 382456 402075 404990 389295 384582 385712 380539 382053 386507
9910 386507 373406 379665 390986 386267 373663 363122 385566 411742 421542 428819 402206 388968
9898 388968 387937 397491 399779 397496 384104 366762 361512 368456 375488 372312 352621 363447 365072
9885 365072 356431 356807 358351 368916 377009 383295 372696 362827 364898 372126 370034 356391 369071 371298
9871 371298 366465 387610 405649 413279 423858 434984 420353 415555 420902 412529 416437 433081 443595
9858 443595 448882 452681 460296 441035 426653 450700 463454 473106 515465 569451 656053 773248
9846 773248 908198 1129007 1479273 1952882 2497497 2998684 3320719 3351340 3023713 2450393
9836 2450393 1865280 1429777 1161257 981863 861313 795663 749135 686232 655556 636963
9826 636963 605261 577803 569886 551370 546448 543549 555287 574847 576300 576773 606771 636576 665452
9813 665452 748514 847416 991704 1173030 1402915 1637541 1850481 2015546 2091367 2028071
9803 2028071 1885708 1681248 1452423 1231715 1035745 894044 801195 735017 681022 627168
9793 627168 578138 565690 544719 525869 518993 530674 503530 487141 478303 466234 456587 459726
9781 459726 463921 472097 474239 472954 475090 463824 461975 459934 452729 463652 475128 476512 465621
9768 465621 454890 466243 472673 479166 469605 464680 470392 481133 479227 491937 504450 504044 500321
9755 500321 503662 518725 535482 507318 493291 509366 531220 553752 552728 543207 519528 502284
9743 502284 514119 522618 541063 548535 560990 581351 591033 596402 602795 634214 654314 693901 746849
9730 746849 816179 902345 987617 1030326 1031742 987639 914063 845142 813166 802734 792971 784402
9718 784402 787664 784761 769888 763568 773665 784349 792458 816772 848620 897527 978550 1109720
9706 1109720 1272023 1457524 1645438 1818238 1954060 2058611 2094075 2064017 2010100 1912142
9696 1912142 1751889 1573241 1390829 1236975 1133275 1066283 1039093 1015326 991417 979783
9686 979783 976406 979539 962922 939530 930350 933547 939285 948799 956583 953225 945549 962316 963456 950882
9672 950882 954407 955704 977602 987161 982727 973546 1004192 1015913 1018896 1023247 1020471 1027351 1055381
9659 1055381 1068199 1077771 1086044 1104323 1099953 1115258 1140067 1159386 1192231 1211169 1233215 1256627
9647 1256627 1255444 1291118 1310728 1335209 1358881 1363228 1367381 1376160 1387274 1400794 1425168 1438187
9635 1438187 1461117 1490532 1517375 1537050 1535375 1576028 1612264 1640001 1659825 1666316 1686599 1714898
9623 1714898 1754604 1777811 1798778 1846370 1876820 1915120 1952696 1978635 1996357 2034072 2075882
9612 2075882 2103254 2135389 2178171 2217530 2246060 2288704 2322795 2371833 2410987 2439257 2451282
9601 2451282 2492405 2557745 2615782 2653292 2701081 2728856 2782255 2839919 2898130 2929626 2981281
9590 2981281 3028486 3066369 3123512 3189526 3249576 3307375 3355608 3396676 3451121 3497270 3550682
9579 3550682 3623381 3682529 3724615 3770308 3831159 3898646 3948183 3979912 4038913 4093644 4148880
9568 4148880 4190929 4248654 4299452 4352684 4396759 4448876 4497456 4556086 4616968 4676972 4718173
9557 4718173 4772331 4837209 4869677 4884873 4913117 4923230 4938656 4966365 4980171 4996592 5019347
9546 5019347 5028943 5030571 5044800 5058387 5068660 5054308 5042933 5041074 5030975 5009553 4980342 4964193
9534 4964193 4919793 4906078 4893192 4875445 4826570 4778232 4736532 4703613 4683114 4639801 4578673
9523 4578673 4528220 4478217 4421114 4365547 4313233 4263495 4199138 4127213 4078055 4042905 3987590
9512 3987590 3925402 3873187 3807576 3743770 3684218 3614072 3555906 3492167 3442115 3384070 3329425
9501 3329425 3274484 3214383 3159433 3103848 3069148 3033399 2986177 2934321 2875948 2808586 2742941
9490 2742941 2702102 2651083 2594580 2551694 2514172 2496448 2486076 2439703 2394026 2356391 2301772
9479 2301772 2232039 2173300 2142956 2110506 2078604 2044226 2011603 1975150 1938596 1879639 1834937
9468 1834937 1800406 1770437 1767367 1737601 1724650 1707113 1672423 1654220 1610256 1583771 1572749 1559454
9456 1559454 1538813 1527271 1486313 1451692 1423268 1406548 1403093 1366269 1324136 1315119 1315176 1291454
9444 1291454 1265720 1246141 1224046 1190144 1145780 1149550 1151916 1145718 1125553 1102078 1089666 1085380
9432 1085380 1091451 1070695 1051368 1035938 1014665 1036350 1036393 993371 971363 960507 944436 934693
9420 934693 923262 910288 873395 869373 870649 858123 868610 855814 836745 813483 791634 773187
9408 773187 774262 784302 786306 767988 731798 716096 716435 724601 735801 715366 697323 682546 673526
9395 673526 662313 640406 632739 626211 617887 627747 627017 609420 596335 604279 608906 599455 602115 577036
9381 577036 579295 576680 562860 561194 541878 527873 535057 540604 529065 527981 522580 510817 489482
9368 489482 479641 504323 493859 491509 491454 483863 487571 474823 480137 473196 451797 437179 435264 440243
9354 440243 434203 422750 422404 421641 405576 415788 419787 430361 415398 404652 394048 391810 400250
9341 400250 398419 387710 386008 379185 365157 350751 358717 361339 383444 394097 382127 357130 333367
9328 333367 325613 322678 331770 332510 325214 321426 316139 320995 326875 328353 322511 317121 319636 297242
9314 297242 300386 311782 312341 316082 316421 310789 306357 297484 307859 295623 285041 282181 262337 230392
9300 230392 220159 230912 222264 219245 236684 252894 239090 246349 261418 275808 284583 286945 277597
9287 277597 282171 271540 267057 256158 239685 235870 235825 237532 247928 234174 221339 231117 257670
9274 257670 259174 244207 219381 217194 227565 205216 184471 201820 202760 203703 187148 175869 196189
9261 196189 198158 173580 176797 186383 185946 178382 177197 181389 179450 183408 184018 193316 191566 187762 180100
9246 180100 169085 165627 169189 162097 153906 164308 162634 178220 187694 187183 178009 180771 176162 173531
9232 173531 169843 177112 169279 165496 172149 175001 173542 171511 167722 168795 190995 206003 203048 173908
9218 173908 165893 181890 181964 169611 180493 178946 165015 148906 147656 125869 126118 129162 142354
9205 142354 143634 151083 149462 150663 150425 142247 122005 122431 150637 146623 170863 183073 170995 153287
9191 153287 151540 152352 133464 141407 179500 182907 159423 155020 144946 147240 146722 137545 123452 122051
9177 122051 117503 120108 137494 150587 153081 129096 121050 125393 118630 138704 157980 159110 158288
9164 158288 142302 135047 148618 158506 146300 158149 163384 151087 133986 133135 126570 117545 104764
9151 104764 108587 112548 110191 108905 109213 106204 117454 113598 121300 133951 140490 123428 95928 83682
9137 83682 90414 98667 115940 127051 121290 106805 109439 138894 131155 118139 121033 118220 110453
9124 110453 97129 98487 112430 117784 96523 97995 115534 109037 101005 107877 96031 97280 93675
9111 93675 89683 102538 114107 124350 119987 112723 117886 108838 101351 107498 101738 105628 109626 121046
9097 121046 94817 79290 74518 73289 81355 75465 85501 95427 81090 75234 74327 81647 89665 99146
9083 99146 84058 79042 91657 86719 75400 63616 48116 65712 76102 67994 79075 71560 72813
9070 72813 85030 80245 86862 100981 107022 94542 89518 100033 82856 67410 66747 93184 121832
9057 121832 125753 108128 98907 71679 81590 80739 86977 109392 101621 76572 62745 53736 66907
9044 66907 72062 88866 100914 100173 83596 63328 61026 68049 73179 64857 69898 62724 78778 75373
9030 75373 67908 54236 59239 53670 50429 68512 62179 66326 51048 48577 43244 68382 86080
9017 86080 93751 102554 89119 69826 71851 71309 64614 92614 108398 109052 94914 82657 97947
9004 97947 116263 99528 92005 101141 97033 93081 97660 120733 112062 91369 90437 99858 109892 110946
8990 110946 99589 111164 102314 86269 67139 59308 61779 61668 45945 33673 39870 41208 45298
8977 45298 41306 34455 40366 49303 54573 68774 56726 52830 53566 47153 49859 55934 27323 16820
8963 16820 44994 52964 66972 50672 41546 35019 30250 60019 60623 47573 31670 31231 53600
8950 53600 59068 59025 44055 36387 25261 10733 11936 10912 17336 26115 32360 42661 43615 42255
8936 42255 71202 83856 83172 96901 83132 64483 66279 71574 77492 71096 66962 61458 57284 75686
8922 75686 67003 32787 31998 34148 38675 34948 50740 58006 60851 82061 89484 86620 85532 61509
8908 61509 59717 54763 59070 72104 64070 48608 44194 51950 48013 34154 43703 40967 33137 31686
8894 31686 32441 21009 34477 62668 60658 39506 29532 38918 55099 68512 56461 39592 37827
8881 37827 23142 25865 32288 24631 26970 37241 34060 37581 47850 48822 43256 58098 56006 52200
8867 52200 56978 38085 39050 65613 73861 76006 79104 83251 91058 77217 64336 66585 63769 60543
8853 60543 69150 62275 53741 50697 53954 46202 26285 29597 37890 40693 40532 59106 60373 49023
8839 49023 52390 47382 63068 66836 71640 60586 58477 57543 35867 27210 22923 21543 46317 57971
8825 57971 44495 35387 47521 43421 32409 18511 24584 33699 38850 39579 50425 66397 56548
8812 56548 43273 31542 27450 15497 14770 18073 18112 21418 30065 37570 41508 49150 62393 32118
8798 32118 7562 19671 32403 32160 40310 55388 47906 49485 38230 37192 38756 16860 8310
8785 8310 -1140 -21796 -18065 1360 37422 48710 54797 80578 68299 59221 43462 27299 26441
8772 26441 32317 37521 38863 28490 39204 38802 39128 29042 22700 21844 32594 40602 45513 45664 40044
8757 40044 48080 57688 61561 39108 23607 32628 54271 49797 42969 51776 65268 58349 37003
8744 37003 40789 41784 47270 52612 52664 37808 36654 47974 74939 73005 70539 58711 47783 51337
8730 51337 64038 70953 52254 35738 39534 52834 69456 89912 79379 58882 68842 67698 66241
8717 66241 61514 67698 67535 67359 48655 29278 29894 34141 33837 30453 46640 55071 45854 49895 55656
8702 55656 51972 63683 57444 64628 87500 109621 98962 85239 69278 71788 61928 56667 68715
8689 68715 84319 76990 59170 68064 82572 87394 79769 72349 71358 74524 87660 107840 105352 96409
8675 96409 107475 110945 124149 133863 121055 103602 93044 115525 113211 108761 116751 117362 112368
8662 112368 104169 103209 130198 132971 119494 117729 117326 119802 121903 133271 157274 162637 158602 153463
8648 153463 152405 175224 219910 279092 360310 466109 605580 761977 865821 891755 869861
8637 869861 744044 568818 428494 356286 335161 313903 289577 266241 252919 237524 238058
8626 238058 226487 240250 251255 263454 274283 279830 300873 304495 302094 308719 301955 310643 326449
8613 326449 341029 355112 364352 386989 393473 396613 382040 354143 363676 397060 422152 432856
8601 432856 467773 556629 695003 907932 1184108 1468839 1677856 1776708 1750317 1533557
8591 1533557 1189922 923540 739763 623079 529219 443412 383015 347224 317565 287769 253693
8580 253693 252518 231905 204308 184415 186863 193080 177411 149619 118782 116912 124406 119687 108065
8567 108065 114854 119350 120552 125685 113761 108096 98258 74541 89163 118234 150545 170670 217981
8554 217981 274750 362984 469676 580937 684621 746260 745711 660889 504059 362474 291066
8543 291066 231623 192193 179204 173741 160748 148185 120594 91030 99530 101566 79409 67242
8531 67242 52690 36839 39651 40727 60568 44271 30669 42943 31133 21500 30715 27563 25146
8518 25146 32416 39610 28380 9467 27936 47607 26824 602 16418 15390 22522 42073 37385
8505 37385 45165 58760 65092 46687 52341 54120 50211 39731 42009 54521 50781 36541 28724
8492 28724 32576 15998 15274 27963 37119 33033 30328 22156 19213 20889 43259 47576 40487 35099
8478 35099 39507 35759 29890 31372 35449 21546 28325 17718 16082 18061 21409 43631 45251 56424
8464 56424 71705 71965 60625 29010 24386 37957 28900 17528 34159 47030 55545 41040 28397
8451 28397 37126 39710 34359 39385 64525 77266 85513 59681 37337 27001 38199 41405 45970
8438 45970 62961 69633 61365 53210 47799 38089 45641 46924 45412 39390 41141 51350 28173 31957
8424 31957 26187 16012 19192 12013 11862 12255 7475 4917 25164 30877 16660 12617 22459 31166
8410 31166 24173 23236 26638 5739 -9733 -2220 5676 12552 3385 3020 -3193 -12519 -7613 -14 14274
8395 14274 39573 50215 27807 10465 5032 15250 26895 26430 36215 23077 19686 32840 32779
8382 32779 26394 32397 40185 38656 45196 25829 9662 26633 35107 24451 11647 4494 16357
8369 16357 21184 14553 3857 -19278 -28750 -4553 24539 59223 51988 28213 10212 16661 17683
8356 17683 31077 34502 30355 34985 45681 39578 31986 40111 46246 15072 16586 34107 31326 33064
8342 33064 35538 41022 35295 43184 48399 34318 23561 27071 41345 47121 48723 48538 31625 9445
8328 9445 -3894 3565 15984 17470 24315 16142 8110 21755 29517 17469 19018 23757 40070 44176
8314 44176 21846 7435 3195 24429 48611 45107 33876 16715 3493 16574 26123 31224 18047
8301 18047 24735 44326 62886 62256 44302 33257 33561 15967 12963 22659 33560 22099 20743
8288 20743 39053 25375 10546 4473 2472 26875 25032 16944 -3552 -16180 6988 25057 44313
8275 44313 22264 8711 27697 28644 7470 2765 -11249 -19466 -22729 1051 28989 34947 41241
8262 41241 40058 37972 25103 18881 23329 12273 -4703 -2944 -10111 17797 25531 8707 -4777
8249 -4777 13821 14142 25133 36864 39495 23011 1838 841 3714 27443 9039 -3765 7800
8236 7800 7926 5491 2086 9298 12451 1516 5652 -10055 -2074 18153 22705 17381 24024 22468
8222 22468 19363 31834 41088 37569 28165 22181 18896 26772 9428 15135 31004 35390 34103 13968
8208 13968 -4928 -8494 12907 6703 1541 -726 13305 36391 33731 11190 7336 33213 35036
8195 35036 36946 9173 -23385 -31022 -18308 18020 25759 22707 10628 7431 2800 3040 -6375 -14416
8181 -14416 -24708 -25136 3662 -6751 -14038 4762 10484 6678 -463 -5725 -9735 -6720 6883 5047
8167 5047 7026 16666 9195 16405 10292 11150 17796 10686 19456 11811 5242 24315 32424 15819 27796
8152 27796 40229 60403 57329 50583 51065 48474 21482 28213 32334 2162 1289 8253 -3014 -2524
8138 -2524 -13184 -26933 -25300 -2199 12970 6556 -12645 -10160 -16364 -25557 -37438 -15799 5994
8125 5994 3010 -12813 -9448 22380 23087 25613 24115 18667 23512 49744 68343 67047 60700 81578
8111 81578 97532 87693 80116 60183 25919 -5012 -4569 18028 18348 6976 -143 1983 11958 30217
8097 30217 23884 8789 4370 10455 2617 16192 26464 30718 24484 -2236 -16213 -7535 -6121
8084 -6121 5803 15375 2562 11088 20444 38266 51556 42554 34011 30135 11286 7125 16528 14399
8070 14399 6440 5426 2819 -5163 -26230 -34092 -5077 -4338 -2625 6098 33440 46680 51402 39383
8056 39383 28296 34940 41119 44976 42404 34306 39101 41179 33180 35020 39845 54619 70435 81584
8042 81584 67462 52117 51696 52605 77901 105377 127801 109276 104349 122385 113526 108962 112388
8029 112388 103228 104319 93961 91136 85561 87283 86924 77766 64049 69068 68944 83111 82856 59705
8015 59705 63064 58216 61937 62695 73337 103372 121011 150013 171763 182603 204599 231374 249484
8002 249484 275231 305699 304972 278940 250315 239403 213230 208093 220350 220704 226664 265740 266291
7989 266291 277708 268756 213690 165358 145028 96702 75430 93332 82499 74357 84540 96152
7977 96152 104573 82690 45911 54615 57811 55185 43039 61978 71449 82936 97307 104591 110621
7964 110621 102648 116380 145744 161627 178957 211752 227853 243369 234818 230953 206563 192484
7952 192484 189210 198653 198295 215438 212623 202247 196258 167584 130656 104629 88612 103325 94661
7939 94661 82080 84041 52561 59349 67203 44706 36001 53382 38776 32138 24492 37225 54184
7926 54184 54338 48439 57166 58946 66828 83990 97611 104193 117921 129774 129066 109175 93443 87749
7912 87749 82081 64308 55151 53728 57511 56412 62599 68808 56794 34288 23952 26139 16362 13263
7898 13263 15429 26367 23852 31277 29441 33643 33900 46594 50965 21971 3564 -15636 -12586 2534
7884 2534 1944 57 2909 20865 25163 11088 13998 32237 34452 22496 19547 6800 -351 -1002
7870 -1002 12383 24885 31287 20144 3847 7581 21228 27312 17214 13489 21534 25571 29717
7857 29717 33901 35023 18734 8561 -737 7159 16599 18620 5536 -14491 -8224 -13831 -15498 8450
7843 8450 15346 16068 14477 9969 14516 10855 7813 -15821 -20567 -29737 -24645 10424 24906 3162
7829 3162 1670 16986 25401 22115 43037 43004 34328 26696 3176 2271 11671 10603 24931 31219 29817
7814 29817 32094 25506 18080 19016 19435 30475 5359 -12041 -13822 -3231 8487 14563 10231 14123
7800 14123 32218 40226 33294 23260 31012 27237 13481 17418 10467 7072 15825 23288 19810 9072
7786 9072 713 -481 -733 5946 5625 2038 -16795 -36850 -9586 7882 23023 29147 20786 16174
7772 16174 18440 14054 -3717 -7603 8476 -5423 5599 10992 -695 -16098 1461 27702 32428
7759 32428 27299 35624 21727 9499 5429 10526 16810 15978 3587 2618 9796 21056 22913 27294
7745 27294 40054 35508 24690 24675 22715 26772 22867 40923 37600 9792 4750 11819 1189 -6720
7731 -6720 -14916 -17846 -23140 -14929 -1520 11942 -7545 -11284 3825 2074 -1261 -3134 -2311 -18616
7717 -18616 -21753 -11095 1478 17020 12360 3172 -3609 1285 -13420 -17227 -13456 -13150 -11707 -4324
7703 -4324 6039 7015 -2497 -5777 664 8145 -3442 14467 19703 7269 10384 11564 -8936 -7754
7689 -7754 -10666 -2634 6684 19749 13043 20782 26594 9214 -5973 15381 27816 28671 36241 20961
7675 20961 6452 356 -9896 -22582 -30230 -11859 4095 -308 15233 14237 2373 -19200 -20765
7662 -20765 -13775 -9208 4783 11999 8113 15459 19234 12378 5611 -6458 -21230 -20485 -23202 -21995
7648 -21995 -8270 -13020 -1153 -2648 -15159 -15719 -43364 -34521 -10512 830 -1947 -13197 -18772
7635 -18772 -30282 -32225 -20961 -14015 -12542 -3327 4260 6932 -6638 815 3913 12655 14923 -3433
7621 -3433 -12029 -3119 16354 17292 22792 24711 12293 13322 14415 3412 -7082 -3791 14394 4769
7607 4769 -11699 5657 19399 8477 1357 7809 8519 5989 -6251 -18971 -30633 -36559 -28392
7594 -28392 -6519 12703 21255 6108 16279 1181 4366 10657 9037 -11385 -16023 -632 32402
7581 32402 30329 -3222 -1968 6234 21573 21480 15159 4007 3883 11232 -14126 -26184 -12060 5506
7567 5506 5954 5159 7641 5394 8617 -2786 18366 8049 -14458 -12575 2650 22646 31517 28210
7553 28210 15802 17920 7386 -4571 -1293 5497 2064 -2370 -12528 -19033 -18366 -15725 -8834 -10775
7539 -10775 4141 375 2632 -13623 -4222 -9526 -15725 -5963 4709 1957 -15668 -31161 -39211
7526 -39211 -25451 -16990 -24515 -27308 -23339 1266 23415 7501 -13668 -1958 14395 14341 28220
7513 28220 37542 45264 30366 27908 41954 31250 26435 8215 -6860 -18779 -33967 -28313 -12388
7500 -12388 -14651 -9803 -7843 -1345 -3282 -15380 -28286 -24964 -17295 -15853 -5449 -9166 -3532 -2011
7486 -2011 -22 -3666 -6388 -3850 -12299 -22376 -33179 -13982 7031 -15778 -19910 -22068 -21192 -16405
7472 -16405 -14933 -12358 447 11250 3309 -2251 -502 153 20816 14894 5400 -3341 -11003 1151
7458 1151 11782 15040 14832 7481 4166 11212 -3600 -6352 2496 -10771 -26361 -21760 -21183 -18852
7444 -18852 -6234 3619 -5020 -20393 -11346 -6562 -6872 -17352 -14477 -14545 -16558 -313 16360 2100
7430 2100 -8815 15945 40555 24152 3496 -3842 1157 4747 7644 -2317 942 7117 1448 -4406
7416 -4406 -1899 -7839 10065 7887 -12832 -18672 -8752 -12627 -24633 -19267 -12343 -7969 -1558 853
7402 853 2628 -8219 -7338 -13111 5193 5945 -8357 -5962 -26075 -23664 9156 24036 23392 3117
7388 3117 -10497 -14248 -11047 -5294 -6067 -6718 8218 1785 -652 7323 3699 6616 3114 4270 13833
7373 13833 15415 11893 -3202 -12787 -3619 380 -7368 -17057 -7329 9041 15036 6588 3161 -5744
7359 -5744 -10598 -11260 11638 28827 18634 14441 17556 7790 -1771 -1269 -8565 -11943 1507 -3580
7345 -3580 -14155 -23571 -15140 -102 -13165 -25228 -15817 13494 8095 -11870 -19277 -9502 2853
7332 2853 -1275 2742 -7980 -20649 -20144 -12415 -10838 86 -11137 -19835 -16195 -24488 -38155 -24691
7318 -24691 -9644 4800 7813 15232 26969 19857 23809 28635 16568 6126 5854 -11931 -14604
7305 -14604 -18288 -25853 -8764 -5721 -18192 3095 5088 2703 12014 11739 13240 23748 23679 13147
7291 13147 8875 6241 5455 13887 17366 2870 -187 667 -23 8467 4588 -6207 -16199 -29512 -21190
7276 -21190 -6721 3198 4556 7134 5381 -1483 -1391 11930 28230 12950 -9396 -23898 -29920 -16528
7262 -16528 -10276 -8898 -1173 -8372 -2886 5183 -5030 -2399 5437 21 5810 -2923 426 10805
7248 10805 17173 12958 2910 12384 6744 21947 24521 18053 13286 17705 13722 19990 25983 25838
7234 25838 23000 28912 11407 2561 2930 10309 24314 14769 -489 -11236 -4494 -5480 -15215 -31855
7220 -31855 -40150 -38895 -52547 -48594 -25875 -7654 5088 -4546 -20451 -22779 -24139 -19117 -13301
7207 -13301 2478 4915 -8206 -17833 -19240 -1505 4777 1945 -1510 -3981 -23663 -30207 -10759
7194 -10759 -26002 -30500 -23368 -40488 -51651 -15860 1909 29221 38415 20209 4053 -3870 -5195
7181 -5195 -9741 -13732 -13963 -5954 -13519 -11663 3492 -10663 -29932 -16432 -7928 -32589 -41536 -31131
7167 -31131 -24455 -1326 17227 8675 3328 5597 11450 2037 -5346 -10321 -12466 -2687 243 -5714
7153 -5714 -20122 -32514 -44313 -33128 -5023 13643 2161 -13446 -10305 3363 5999 3496 3857
7140 3857 8533 -4015 -8129 -9590 -2842 -1985 -7845 11720 24300 14933 3058 -6776 -4208 -3362
7126 -3362 -16139 -9420 16776 44400 40987 17394 24338 25884 -252 -11907 -6981 13195 28930
7113 28930 14889 -14437 -18566 1073 10786 20301 33459 28331 3251 15590 37581 45043 34260
7100 34260 18368 15323 20712 8234 -5639 -3314 -26712 -34786 -29540 -31110 -22235 -25677 -16757 -11401
7086 -11401 -9068 2420 6017 -11730 -6119 5340 8323 5522 -3128 -7898 -11024 -12332 -28865 -19092
7072 -19092 -2596 -5464 -16104 -15791 -1414 19464 16653 23031 -480 9827 14380 22494 36669
7059 36669 35591 36845 30645 8771 15291 8371 -10895 -12322 -12417 3571 16541 1325 -7988 -4533
7045 -4533 -17447 -3090 -9872 -12589 -7007 2909 -17850 -30225 -13857 -1008 -2086 4862 11277
7032 11277 13765 4109 -1274 3052 -2530 -12335 -2528 -9300 -15251 -12865 -17802 1759 16934 20773
7018 20773 24645 15060 3899 3261 19977 32514 33435 22173 2758 -2426 -3514 -2712 -3927 -12623
7004 -12623 -9126 -10674 -4000 1660 9687 -950 -5304 -7727 -12251 -6828 -3111 11976 11574 -5112
6990 -5112 -22406 -29178 -14656 1696 -1704 4886 11302 -5704 -13492 -1631 -1172 -2837 -4576 715
6976 715 7329 18323 16595 25923 26967 27561 28177 21499 24434 19101 10855 5124 -21360 -50480 -40154
6961 -40154 -17850 -7184 8968 29124 27051 14458 7796 -9875 1928 5764 -9535 -8491 -10452
6948 -10452 -1020 324 6063 -14941 -14788 -2268 -1859 15949 32880 15609 -79 9160 10978 12058
6934 12058 15266 -1267 -28090 -49846 -33403 -9497 -21062 -20018 -15162 -533 -7569 -11651 3591
6921 3591 18385 26328 30632 14850 12679 610 -11341 -16592 -22897 -16700 443 9855 4992 -2630
6907 -2630 -15992 -9681 -6633 -11416 -4291 -1774 -13373 -27841 -26324 -10781 -7679 57 4623 9240
6893 9240 7387 -2913 -13272 -21040 -27551 -20213 -19427 -19906 -40044 -22492 5202 20501 16393 19452
6879 19452 21541 8284 -238 -3900 -6648 -3155 -8457 -9373 3073 -15720 -35021 -21597 -5651
6866 -5651 -28465 -13941 1956 14627 -5509 -11377 515 9394 10808 10617 -1228 -9626 -11394
6853 -11394 -7381 -8898 -4185 5213 -6945 -14793 -1657 -5088 -28041 -28806 -11589 -9976 -4354 -15080
6839 -15080 -12851 -10716 -2752 -4732 -22084 -31395 -17934 -4351 555 -761 -2314 14529 2786
6826 2786 2113 8134 10951 -5896 -37051 -29439 -25192 -31620 -36701 -1774 6130 -2747 13307 6652
6812 6652 17702 24761 34990 39277 31252 18930 -4135 -10187 -12542 -25250 -3542 -7357 -26481
6799 -26481 -12423 -3257 7064 36729 47327 17168 -107 -9346 -20842 -29883 -23648 1631 -928
6786 -928 -23033 -12998 -14481 -25271 -40008 -53774 -49311 -42829 -29419 -19547 -18014 -19306 -35917
6773 -35917 -37011 -20715 -1175 -1771 9811 -3811 -9145 -7259 -7461 -10698 -10910 -15908 11523 22507
6759 22507 -510 4011 9228 14408 25070 25229 21554 17239 15288 20744 33467 34070 14161 -10363
6745 -10363 -4369 11032 8543 -11024 -11637 22791 34045 20744 -10641 -14857 -3987 -2879 15104
6732 15104 15927 5153 431 1460 -750 -14543 -20191 -18369 -22719 -16642 -15044 11108 23301 25447
6718 25447 17232 12166 -2210 -9545 -5822 -7514 -16255 -8497 3455 2915 6010 -4057 -23340 -26271
6704 -26271 -6054 -3147 -2737 -3903 -13729 -14305 -12520 3552 -7634 -4001 -1090 -16406 -13032 -9761
6690 -9761 -8544 -18994 -24544 -21447 -4105 -8564 1999 7043 -9239 -34386 -14276 -5307 11454
6677 11454 24280 8805 9545 18329 16292 11769 4342 -21658 -33390 -297 23680 19635 39698
6664 39698 28360 4330 12025 18541 -8970 -35423 -24349 -12515 -1902 1772 -14081 -18304 -4734
6651 -4734 -5145 -7133 -1624 10091 17928 5796 8447 10994 11822 -3484 -16006 4855 16316 7690
6637 7690 1833 -4037 -19224 -26875 -26275 -12343 -8278 -11298 -13298 -4313 3760 -956 -18786 -13580
6623 -13580 10874 32638 28894 26548 22787 26550 19093 2539 -8302 -8048 -3609 -432 -1361 -6743
6609 -6743 -12821 6532 14842 -1819 -5636 -27562 -40558 -45844 -46425 -31440 -16641 2535 -8349
6596 -8349 -42484 -33375 -28557 -19421 -18473 -24356 -27181 -5396 2993 -2821 -3951 -21195 -37798 -34588
6582 -34588 -21219 -20342 -9937 -8500 -22341 -12165 -14231 -5542 -3633 -12218 -17739 -21591 -21339 -19436
6568 -19436 9640 23568 19085 6584 -365 -963 -9987 -7313 -13703 3544 4922 -5791 -15553 -26236
6554 -26236 -13296 -5069 294 17056 18001 1340 -8318 -29356 -40735 -23071 5461 -5847 2271
6541 2271 12156 9913 -12222 -20322 -22603 -34838 -38475 -41899 -24255 -12190 -15286 -25154 -18385 6534
6527 6534 7027 2957 12987 16977 4305 -15546 -14980 -4776 -4137 13762 27406 30029 8991 -20446
6513 -20446 -28666 -26190 -26112 -56572 -66256 -68930 -65506 -63348 -55618 -44007 -29702 -18367 -26083 -13147
6499 -13147 -14197 -23601 -32921 -27765 -12093 -394 9362 5486 7681 19150 27298 24265 10846 -5814
6485 -5814 -14303 -10081 -6507 992 -4641 2096 23636 21527 13358 3661 -5782 -4624 -527 -12960
6471 -12960 -16553 -16231 -6167 2147 -781 -11845 -2016 -23728 -16890 -14074 -5141 6646 13408 -6612
6457 -6612 -9876 -8183 -24843 -21479 -19109 -30203 -29368 -16655 -21523 -17011 -11617 -29965 -43963 -27017
6443 -27017 -14526 -26932 -39914 -25863 -11230 4182 13584 6846 5750 6093 9031 10787 -4443
6430 -4443 -23839 -17718 -11741 -1580 -10194 1835 17582 23984 22674 14679 3250 -7505 -17326
6417 -17326 -616 7071 12702 16629 18082 15033 -3240 -26540 -18992 3292 -7712 -13200 -10782
6404 -10782 -17108 -11089 -10470 -16357 7568 16877 22317 13154 15433 1250 -16695 -29226 -22102 -26829
6390 -26829 -54448 -46745 -32143 -11969 1595 -14212 -15373 -15650 -17172 -16209 -31330 -41175 -56291
6377 -56291 -50819 -41638 -23025 -19431 -27068 -32921 -40468 -44818 -27718 -24675 -20496 -20 7409 4204
6363 4204 17191 20376 19328 -5601 -16926 -16907 -22756 -10235 -5956 -13244 -15620 -25403 -32072 -27497
6349 -27497 -33379 -11379 12495 22060 8320 -25028 -22473 -21962 -25810 -37521 -37571 -37479 -39155 -40028 -25264
6334 -25264 -22061 -7399 -1947 3294 10659 6170 17559 37778 40683 19028 3024 16200 15926
6321 15926 10880 10465 844 -4129 11598 16834 10686 12290 18531 12589 10179 13133 10615 -2235
6307 -2235 -1225 6149 -626 -1767 -5762 -6898 5444 32155 47155 31548 21367 -6856 -7119 5863
6293 5863 -3039 17496 14515 8663 20092 12523 10808 16767 17654 36554 28468 -176 -11947 -11830
6279 -11830 2002 -2432 -34034 -18469 -26186 -44208 -48968 -36015 -52856 -53915 -42931 -43489 -39749
6266 -39749 -35463 -33573 -19702 -6054 -11353 -16644 -23927 -27024 -29860 -40330 -33358 -14440 -15639 -18705
6252 -18705 -25325 -19357 -12528 2556 9813 -6196 -5748 -12549 -6746 19922 29689 5453 3664 4444
6238 4444 8578 -258 -14877 -10911 -4861 -16576 -5430 15134 25206 22802 6873 -19645 -32413
6225 -32413 -28814 -17897 -4558 -529 -7351 -19560 -27088 -44518 -41829 -26069 -697 -3418 958
6212 958 7562 -3662 -3177 9094 9416 501 -3523 -1368 11453 15094 8392 -410 -5512 -21908 -17827
6197 -17827 13389 23893 9165 -2796 -9554 -277 9398 15025 -1373 -31045 -46028 -31789 -28679
6184 -28679 -27036 -25133 -14833 -619 13362 26448 46027 38653 1515 -23961 -14646 -9292 -8086
6171 -8086 -10429 -3115 -6844 -5270 -6734 -87 -15254 -28440 -28104 -25845 -3468 2875 13791 30007
6157 30007 34363 15478 4687 -2311 -14090 2361 6173 17585 13598 -12403 -24955 -15592 -23971
6144 -23971 -29021 -1926 -2606 3814 18724 26154 14490 -4115 -19250 -3812 14399 25062 15653
6131 15653 3229 -3495 -2239 -8520 590 -13067 -37072 -33488 -20026 -3047 4703 3855 -1680 -8548
6117 -8548 3628 394 -2645 10094 16489 10171 7411 -19384 -7054 18509 30721 20517 4014
6104 4014 -7035 -18010 -12688 -9431 3422 1635 -13547 -14268 -20297 -19417 -18291 -25346 -25609 -12227
6090 -12227 4074 6812 28842 31661 12043 -14051 18360 20159 6165 7234 3531 5156 20760
6077 20760 11411 -4414 -2479 -4129 4581 22087 11192 2831 -1642 -7418 555 2395 -16024 -8353
6063 -8353 -12039 -11856 7395 6733 -3667 693 6706 29094 34974 26474 22805 22749 19363 5480 -5669
6048 -5669 -488 -7107 1634 8466 -1060 3756 -2083 -11428 -9525 9914 5706 -10806 -43849 -50048
6034 -50048 -25329 -23676 -26267 -23941 -14422 -27763 -15862 -19001 -11055 -12839 -1856 432 -14053
6021 -14053 -14561 -891 25033 18365 895 -4718 -4045 -19927 -38919 -27592 -30962 -27302 -19860 -29599
6007 -29599 -12689 4652 12430 -11418 -18163 -7496 -9856 -14354 -4695 -756 -11241 -18760 -15027
5994 -15027 -11622 -2193 -9717 -23034 -17708 -23370 -20686 -16228 14998 19953 20048 13646 13222 24457 12215
5979 12215 342 18254 13440 -8420 -34091 -23682 -13342 -9419 6813 17142 7356 -8578
5967 -8578 -23721 -42069 -22146 -13632 1725 -2396 -20540 -11152 -17622 -10003 -12784 -4755 12847
5954 12847 1657 -12562 -4469 4846 8251 -10366 -13473 -21242 -39000 -28045 -8017 -3077 -11989
5941 -11989 -14351 -4878 -20548 -15152 -10095 -24022 -21774 -18007 -33934 -14529 -9100 3107 8312
5928 8312 742 71 -4428 356 -7804 6519 -3879 -21150 -16197 -13799 -7743 -2666 -2583 -541 163
5913 163 -1652 7199 -4987 -4382 -12842 6778 10508 20279 4853 -21811 -42965 -30439 -12127 -6040
5899 -6040 3353 20979 19021 26027 26456 20367 13039 12828 8991 27035 34640 26376 36369 28790 27680
5884 27680 16388 26758 11808 14390 21847 1589 -16210 -23311 -11139 -32124 -18908 -19746 -30957
5871 -30957 -23546 -9715 -5562 -7719 5625 10382 -13787 -14850 -10834 -15532 -7136 -15409 -13461 14032
5857 14032 31407 17960 -10694 -14172 -2772 8512 11447 -215 -11258 -1456 7777 2497 -6190
5844 -6190 -15026 -4329 -4763 -14922 -24571 -41745 -40513 -25836 -8490 5481 25223 22465 25338
5831 25338 22272 8070 -13744 -6341 -7351 -37805 -25420 -19552 -18507 -22762 -23034 -11244 -2209 9561
5817 9561 22588 30021 9302 -1809 4830 5216 -3126 3637 3096 -7446 -8432 -6182 -9273 -14276 -6247
5802 -6247 -1962 -7694 -15523 -33879 -44014 -41804 -29813 -32329 -43744 -29759 -22448 -6886 8372
5789 8372 5446 -14995 -15844 -26342 -33019 -45157 -46921 -39613 -36835 -15550 -6755 -16228 -21990 -20615
5775 -20615 -7015 -10344 4174 1909 -8531 1488 -17187 -13655 7377 17163 33806 27724 26400
5762 26400 27205 27271 21247 28079 13405 12399 9164 7719 23383 32996 30674 27915 26008 18170 22516
5747 22516 -4239 -8686 -5376 2571 -762 13268 -753 -17561 -8063 -7881 -18342 -25290 -17357 -30979
5733 -30979 -29583 -17328 -1276 4986 5992 -3794 7358 14281 11112 12233 17017 2043 4006 3055
5719 3055 694 -320 15872 8960 5293 9960 7223 -1750 463 15165 2975 -7034 13181 25240
5705 25240 18146 5639 -9266 -5135 -7263 -1870 3722 -14482 -13454 -17843 -11221 -6085 -13900 -6247
5691 -6247 -3204 -7835 -21115 -6658 4442 6348 -4709 -5575 227 7551 11604 -3478 -14051 -16682
5677 -16682 3877 28975 36189 17313 12645 25238 20570 -5827 -16648 -9044 -24728 -31791 -22407
5664 -22407 -8859 -14091 -32119 -24832 -30406 -25593 -15934 -11954 -2806 -8105 -14499 -32320 -31070 -26223
5650 -26223 -13952 7981 23403 50806 60710 32174 -61 -28332 -24051 -7414 4352 6573
5638 6573 7188 3082 2998 4293 -18276 -29934 -33727 -26937 -12314 -19890 -12858 5567 18816 18748 16157
5623 16157 12458 16192 14878 22728 18563 8626 -8784 -21247 -12768 -9842 -4011 -6743 -6323 -15474
5609 -15474 -20779 -45442 -44793 -33203 -49773 -57783 -47359 -40730 -15602 -9595 -14364 -5795 1770 -15337
5595 -15337 -24224 -12110 -12169 -30627 -19629 -16903 -9657 -4482 7630 17329 20555 3432 -4708 -5232
5581 -5232 3345 4628 -5462 -18765 10919 7998 14767 10928 6013 -13767 -20035 20 18902
5568 18902 12175 -13191 -28851 -24307 3677 14492 34778 40344 33986 24734 14173 -2421 -27818
5555 -27818 -13695 12542 5415 -12118 -14436 -15573 -29003 -45926 -50152 -48952 -32490 -944 15088
5542 15088 9911 1440 -5656 -2060 -11898 -38 5649 2642 7432 16562 11137 11483 -958 -13571
5528 -13571 -4608 9515 -169 -19686 -19807 -16610 -13368 -6294 8649 8657 2890 318 -29867 -33563 -17588
5513 -17588 1769 7107 16216 14419 -2401 -9959 -7240 1788 23737 48454 27843 24918 35823
5500 35823 33124 18663 -3537 -7674 -11837 -10602 -13033 -3738 1854 -4920 -9778 -25997 -27853 -5971
5486 -5971 27675 10789 -14138 -23101 -23387 -18450 -16257 -3473 -11796 -27353 -31982 -16830 -3277
5473 -3277 -397 151 -16211 -15593 -5363 10462 13919 5642 7056 -13000 -9133 -10968 -16055 -25278
5459 -25278 -29183 -6176 -3626 5511 21140 27193 34330 37289 2903 -11154 -1447 -7056 -12190 7992
5445 7992 11023 1074 -9592 -652 3692 11007 1200 -106 -1000 -24991 -23661 -16357 -16377 919 406
5430 406 3984 -4315 -9864 -8501 -4096 -22128 -8219 -2090 -19715 -31284 -27186 -25415 -16717 -23475
5416 -23475 -14002 3515 -142 -13347 130 4667 12786 20877 -1810 -4939 8967 1774 -734
5403 -734 -9244 -14256 -29034 -27727 -23672 -22169 -34317 -43383 -35544 -40218 -58354 -48553 -17249 -654
5389 -654 11301 6250 -4253 -3223 -14523 -21261 -14665 -35726 -50667 -35431 -9440 -7852 -10005
5376 -10005 -6595 -7471 862 26391 8968 -17804 -12159 -967 4023 -417 -23895 -33254 -38774 -32394
5362 -32394 -27156 -8544 -16824 -14853 -4432 499 18446 13137 15050 13551 9003 2224 1008 -19395
5348 -19395 -22098 -25051 -15503 17353 27544 17265 5202 2483 6244 6515 -7458 -5332 4255 1000
5334 1000 5419 15410 17597 9093 867 -10494 -31579 -27921 -29330 -18457 -7381 3307 15970
5321 15970 10106 7741 21084 9166 -37210 -36563 -31261 -27105 -13484 1558 -4361 -2192 6007 16669
5307 16669 11883 -10207 -26402 -48164 -64356 -56877 -46171 -42207 -33526 -35888 -38247 -27584 -18087
5294 -18087 -21413 -27039 -32458 -39423 -31444 -26291 -15377 -28019 -14385 6889 -2858 -7139 -6533 -7455
5280 -7455 -8129 28 7675 10260 5074 -14000 -15373 -13172 -4914 2634 6149 11441 7045 6384 9300
5265 9300 -7384 -18473 -8358 -10042 -8716 2490 6981 10800 7487 2358 -18802 -19226 -23371 -11441
5251 -11441 -12458 -20711 -14154 -6897 -8014 -16205 -13535 11237 6661 -4563 2100 16196 19262 14469
5237 14469 4369 419 16616 22228 14796 2544 -14111 -18825 -29907 -47772 -18534 -3423 -10193
5224 -10193 -2269 -9358 -16265 -7505 -3438 -20150 -14315 -7427 -7703 -3870 -14686 -17598 -9320 15680
5210 15680 6898 4775 9055 -13435 -19393 -2612 7899 9995 -13842 -32443 -23457 -21089 -16479
5197 -16479 -6271 -4128 -6234 -5471 -6351 -21499 -32290 -27956 -29129 -28981 -32014 -23747 -6738 -750
5183 -750 -18196 -9856 -3521 -11689 -17780 -14855 -9861 -16552 -13741 4179 22914 16404 16250 24773 19852
5168 19852 17497 5288 2285 -1182 19974 31078 25851 23537 17241 27327 26064 16854 8732 5780
5154 5780 3182 -12807 -3225 -3213 -9396 3225 5626 -21678 -15471 -3648 -19381 -27546 -35310 -27541
5140 -27541 2497 -685 -19596 -11893 -2244 247 9840 6498 2602 3014 -829 -5363 400 -11613
5126 -11613 -25130 -31594 -33947 -31187 -16423 -4188 11084 8070 -12485 -19132 -15206 -11330 10313
5113 10313 24466 8315 -12516 -40425 -32065 -23398 -17881 -22031 -25594 -31103 -15321 -15818 -23458 -13948
5099 -13948 -30925 -39247 -33124 -27919 -23039 -31225 -39359 -37572 -30290 -37236 -41080 -35217 -30789 -24726
5085 -24726 -17857 -8564 -8627 -7262 -18707 -26387 -4574 -943 -11701 -25747 -21256 -7135 -22233 -5602
5071 -5602 -14909 -34648 -32403 -27489 -37031 -49005 -33558 -8583 -981 -12549 -39878 -53826 -36543
5058 -36543 -2132 16730 -537 4184 -3496 -17737 -15606 -19136 -31874 -23887 -12795 -4783 -19299
5045 -19299 -19739 -6256 -4090 -13624 -4879 26137 28620 26392 28499 15850 7599 -6742 67 1807
5031 1807 -2066 1636 8076 5742 2646 10391 13324 12579 12303 -625 14795 21300 10399 -1961
5017 -1961 1637 24262 28825 11886 2643 1255 -1858 4951 -3952 2523 7053 5422 1244 6308
5003 6308 -3292 3116 -4698 -26007 -36873 -35619 -29593 -18662 -11739 -14638 -913 4468 -10155 -21293
4989 -21293 -13549 -18834 -3429 5490 8280 -10106 -16868 -24200 -14932 -8191 -13439 -11150 -6367 5131
4975 5131 18791 20051 2413 -17816 -15070 -21723 -21627 -23828 -33864 -42184 -50149 -48686 -38118 -20303
4961 -20303 -11607 -9933 3098 4786 -8579 -5108 4937 -12861 -29504 -41370 -31032 -17708 -9518
4948 -9518 -1235 4333 273 -11051 -3048 954 -7000 14935 28595 19863 4788 -3177 -18916 -21994
4934 -21994 -19560 -14257 -10160 -22443 -12686 -13671 -7972 529 2304 -10416 -16638 -21368 -15586 -22564
4920 -22564 -26649 -38668 -42488 -47612 -35090 -12514 3983 8818 14758 -4020 -7239 -5765 -997
4907 -997 6981 1882 -11872 3915 17621 24737 7953 -5967 -12090 -13667 -9101 -599 -6484 -11125
4893 -11125 -15144 -29044 -5522 6258 3962 -101 -11639 -1959 10064 -9968 5218 25233 25824
4880 25824 18254 15897 21044 13238 3049 11740 -6546 -29653 -21093 -8011 -11345 17785 18638 5624
4866 5624 2390 6085 4084 7397 6359 10755 6262 22037 18125 4925 12065 22887 27694 16878
4852 16878 -7789 -24275 -11435 -8464 5472 28815 28622 11265 6019 21269 26981 15667 1678
4839 1678 9779 1755 11442 21601 12624 -8449 -11316 -728 9761 9348 16526 17616 25339 17822
4825 17822 11279 9615 -7808 981 19283 18986 3316 -6934 1249 14525 21853 20623 -6834
4812 -6834 6933 7765 -9679 -10107 -21877 -24854 -27964 -8772 14162 15084 23612 12511 -1427 10663
4798 10663 15161 17628 6388 -18132 -26489 -32378 -19175 -26596 -13332 2267 -10326 -10186 -18248
4785 -18248 -9209 -3111 -15329 -32279 -20634 -4696 -1703 -19953 -27049 -21617 -35409 -40693 -23334
4772 -23334 -12323 -20237 -23693 -25175 -12367 3751 4111 -7293 12951 28599 34064 29254 16090
4759 16090 11959 21848 32357 -272 -19011 -12479 -25089 -20467 -28805 -16851 -17062 -19578 -7643
4746 -7643 -19176 -26689 -37466 -38027 -36976 -19554 -3846 -9057 -12374 -17137 -32054 -24859 -6876 24201
4732 24201 19456 15612 22889 31171 10839 -6751 3371 5868 3038 -6882 -25198 -26013 -17818 -8648
4718 -8648 -10717 -5771 -3108 -18359 -32448 -17465 2668 3577 -3510 9449 10580 3406 985 978 17479
4703 17479 24099 38047 45583 19300 9836 1663 13551 22548 15568 14021 11083 5537 -312 -10729
4689 -10729 -22713 -23510 -38711 -33513 -16825 -15677 -16078 -20503 -31182 -32276 -37575 -44823 -23646 -10847
4675 -10847 2466 3456 -2912 2373 10094 -514 -19083 -14068 5570 -8095 -6320 -19249 -46562
4662 -46562 -46340 -39985 -29472 -6771 -16649 -38142 -38822 -24731 -6141 -6142 -11403 -206 1483 -9950
4648 -9950 -4291 -747 -3821 -3683 1962 14059 8144 -11931 -4380 3308 7047 2865 -4401 -21100
4634 -21100 -28294 -2081 6037 -21766 -28761 -30445 -23726 -18261 -12425 -8066 -461 -8987 -20834 -19842
4620 -19842 -6567 -9509 -26292 -32609 -43636 -49082 -38127 -35914 -36236 -39530 -48829 -44226 -32041 -33266
4606 -33266 -37883 -35260 -37554 -47404 -42980 -32875 -9765 -2640 -11400 -925 9472 1584 -3055 6914
4592 6914 -5242 -15281 -21586 -9824 -23168 -46347 -45603 -18611 -16283 -16991 -15058 -22269 -36046 -37181
4578 -37181 -23581 -13473 2876 16346 17416 6586 4724 -7172 -13660 -6240 -23060 -37539 -20113
4565 -20113 -2813 7672 21215 30387 25966 3800 1207 24196 21301 28525 10007 10837 14912
4552 14912 15099 21606 4803 -3225 -2846 335 -12105 -15193 -13295 -19764 -20747 -25289 -8255 -17832 -18056
4537 -18056 -9289 -16629 -14499 -14212 -23589 -22028 -19941 -18340 -9576 -16247 -9456 -20710 -11995 -8135 3897
4522 3897 20900 21166 3648 15683 420 -22929 3518 8027 1203 -2678 -9332 454 4675 5173
4508 5173 8041 -2258 -11356 -18722 -11530 -6294 2230 -14333 -21649 -15215 -20773 -15496 -16902 2679
4494 2679 20334 25933 9786 -2051 -816 -6420 -4821 -8316 796 13389 11307 8652 537 -19454
4480 -19454 -41519 -34246 -25671 -21276 -17780 -4221 -5891 -3279 -1122 -12183 -34744 -29822 -20152 -24907
4466 -24907 -41036 -39133 -19162 -9265 -23300 -33921 -27248 1581 10239 -9020 -7103 -14562 -11848
4453 -11848 -8576 -4609 11606 20710 12495 18881 6937 21572 4491 3767 4976 625 7094 6235
4439 6235 4929 6384 21617 11674 67 5225 8942 13989 20611 34926 39015 11499 10725 2921
4425 2921 -12233 1370 26011 46590 25076 -698 -17359 -35596 -28054 -16872 -17151 -8728 -6927
4412 -6927 -4968 13712 40332 41679 25514 23709 20069 9953 -1251 -8524 -2955 2161 -7030 -1959
4398 -1959 4858 -17325 -27117 -18537 -8166 6638 21426 17558 12644 7932 -7868 -10578 -25969
4385 -25969 -38733 -32553 -16541 -13527 -7705 -3912 17289 20466 10814 22509 19012 17488 10248 13461
4371 13461 17180 11290 13060 37816 41363 29345 15397 4563 5196 -2288 -11962 -14612 -18026 -8259
4357 -8259 1487 15343 13788 13845 -225 -6915 -12007 -12447 -16503 -15367 -11612 -5486 -11921 -31073 -20257
4342 -20257 -6638 7018 1061 2540 15735 23206 26413 14875 12943 28657 25325 16066 23633
4329 23633 17285 -2510 -18113 -26686 -4510 14881 35393 13725 -5594 -15399 -23222 -25023 -24929
4316 -24929 -13235 -6280 -8810 -17565 -36735 -22843 -10399 -6618 -13963 -19491 -29691 -22638 -11201
4303 -11201 -4438 12281 13564 45 -18671 -3503 -5638 -13791 -339 -966 -4848 -18665 -24143
4290 -24143 -22623 -10306 -24326 -27307 -21169 -15806 -19439 -31528 -28960 -30823 -25083 -23423 -8489 -5082
4276 -5082 -11834 -16952 -9106 16925 12914 -4429 5157 16595 15710 26588 38064 46170 22599 1277
4262 1277 5473 16878 9737 5166 5511 -643 -4377 -7122 24912 40789 30729 17450 19846 24809
4248 24809 8297 2466 10386 4281 5117 6541 1680 2346 1461 1034 -885 -11300 -19857 -34161 -33449
4233 -33449 -22611 -29864 -16473 41 -1962 3399 -23162 -37250 -22512 -9745 -1290 11947 4308
4220 4308 -8905 -36484 -44266 -32850 -36652 -33456 -12086 -7872 -13903 -30294 -23867 -21143 -7924
4207 -7924 8663 2840 -6591 1635 3417 13379 2247 -1027 2964 -5429 -2470 16395 -2398 -4965
4193 -4965 7007 855 -2065 -13326 -10881 -17730 -17374 -3795 -2849 12121 6158 -12078 -8942 -13360
4179 -13360 1607 7761 -4565 -26121 -33806 -17132 -4352 -212 -6599 -3662 20755 31515 26390
4166 26390 32338 27959 12840 -14444 -26817 -14025 -1676 7695 -3246 -8048 13020 19506 12861
4153 12861 -3631 1278 -18319 -24590 -12855 -5612 -10089 -3334 -799 1433 -2030 -18415 -16937 -23322
4139 -23322 -25725 -1384 31694 18713 -7289 -24573 -11289 12808 -13706 -12172 3867 -1533
4127 -1533 -24770 -37691 -13885 4563 6861 4988 13626 7538 -14658 -14752 -4621 -13685 -21924 -19945
4113 -19945 -30881 -25768 -6579 -6648 -14106 -17620 -19963 -20814 -8283 859 -19645 -12817 17027 11069
4099 11069 6517 6102 21753 20939 -8748 -15686 -9982 5383 -9379 -31372 -44625 -36146 -11847
4086 -11847 12117 21184 22848 39399 31889 34872 23081 37491 10551 -9054 7630 16087 17690
4073 17690 -6207 -25202 -16518 -20790 -25296 -10955 2845 -8397 1025 26817 19994 13537 27185
4060 27185 12477 1717 -4283 -19907 -23868 -9934 -8890 -28021 -29499 -47750 -39675 -37726 -33572
4047 -33572 -18848 -32455 -34512 -13932 -7123 -13183 -14922 7947 -6827 -22100 -13093 12245 18199
4034 18199 3086 -3500 3568 -4485 -16435 -29017 -27761 -16534 -9172 -15160 -5113 -5178 -20767 -11135
4020 -11135 -4020 -10952 -15936 -17481 -880 9838 15670 -2081 -1820 765 -3398 -10556 -26169 -32012
4006 -32012 -31215 -8999 4491 3383 -11306 -25258 -10330 16995 31501 24716 12291 4538 14373
3993 14373 15285 -10422 -33831 -30598 -20568 4828 22556 36421 28275 7351 5048 -986 8666
3980 8666 14855 30458 27696 18605 2836 8340 -4593 -21114 -19512 10829 16578 20387 23453 15416
3966 15416 11573 2860 8509 7250 -1634 11160 16125 18013 23221 23724 20165 13565 4900 24648
3952 24648 20304 5957 3692 8522 22715 19418 3590 -1723 5170 -6188 -9145 -4505 -7479 -16309
3938 -16309 -14369 -2993 10518 6181 3206 8735 16860 15541 13559 10135 21131 24311 4342 -10032
3924 -10032 -11323 -11255 2803 -12201 -32026 -24923 -11156 2674 -15185 -18682 2285 18469 28627
3911 28627 41074 18312 -10320 -15629 -17928 -7978 -9195 -7960 -10066 -6263 -17813 -16321 -803
3898 -803 2558 3762 -6004 -4199 4909 5067 14241 -5221 -4421 -5876 -11984 -1345 20994 20004 -1132
3883 -1132 2905 11266 21614 16517 15169 9796 8133 3921 -3654 -13471 -14980 -24285 -19860 -13775 256
3868 256 -7713 -27953 -43908 -28301 -11167 978 15355 8932 -173 -5370 -624 -7257 -13872 -19560
3854 -19560 -9421 -26836 -24650 -3 -5198 -7806 9984 882 2465 3874 21852 20447 -3160
3841 -3160 -9417 -19876 -31367 -28355 -7389 9662 15176 29519 28502 5665 13762 15359 15892 21365
3827 21365 18454 -4066 -15397 458 13464 5330 -8833 -16433 -9604 -4698 -11632 -12753 -10865
3814 -10865 4284 22486 24547 5945 -15137 -5837 -320 4152 2931 -6309 -5304 7341 -3129
3801 -3129 -4534 16086 36595 31742 28516 24280 25228 24920 30464 6108 -9897 -16948 -29380 -29986
3787 -29986 -30018 -27104 -8327 802 -1131 5315 18196 19612 10057 11339 14425 12846 -448 4306
3773 4306 18992 17933 4579 237 -15893 -23758 781 15865 575 -7110 -10475 -13834 -15281
3760 -15281 -17179 -23256 -36281 -28930 -20122 -21379 -27062 -15188 -11843 4344 7734 7048 -3496 -10557
3746 -10557 -1980 -14763 -23811 3206 9193 -12357 -8009 21528 26495 31329 29354 20791 13712 6165
3732 6165 -1894 -18919 -20851 -22733 -7811 -6936 -13886 -21316 -12331 281 -12531 -15554 841 302
3718 302 -4799 3892 21026 32096 39376 27763 4523 -15303 -9665 2726 17958 9895 5242
3705 5242 -4397 -12812 3600 15768 9254 -9856 -18263 -5856 -7484 -12786 -17605 -4506 -823 -1589
3691 -1589 -7778 -6082 3845 2554 9801 12203 7833 -8470 -12714 2804 14023 12389 14814 15659
3677 15659 5858 -1964 3191 -1844 -18622 -27069 -23475 -21080 -21551 -19749 -17681 -5064 -10765 -8494
3663 -8494 -17509 -17853 -7110 -13200 1717 14908 -7138 -21423 -2659 21533 8044 1290 -2029
3650 -2029 4188 7614 -7390 -18768 -18515 -4959 2022 7162 -13617 -29112 -23420 -6711 12294
3637 12294 41350 30344 24074 11173 4616 7495 5625 1352 8022 -9752 -12858 -1739 -5053
3624 -5053 -17965 -19843 -41194 -35038 -40333 -40571 -8231 -1430 -2284 -5424 -14861 -12059 -16873 -3147
3610 -3147 -10360 -10127 -25475 -28194 -18772 -6529 -10499 -2358 23414 40545 45782 38442 30053 19993
3596 19993 11087 5701 -12869 -19708 -21837 -11116 -5239 -18570 -12804 -13809 -18155 -11268 9706 4737
3582 4737 22087 28041 30323 25808 9915 -15290 -18153 -20474 -7313 -13552 -14768 -16440 -9448 98
3568 98 3018 -14492 -4106 442 -8844 1812 18523 16605 14594 10963 8086 8958 4859 -4397 -607
3553 -607 -10814 -14262 -15986 -9619 -6439 -16686 -28233 -22078 -8701 -10433 -28213 -39207 -44897 -40230
3539 -40230 -39604 -33481 -17232 -27064 -29762 -26661 -18631 -11740 10806 17939 15485 23065 10061 -13419
3525 -13419 -28033 -29533 -11390 -8520 -12868 -6405 16095 26184 33095 7774 -11492 -27302 -35004
3512 -35004 -31983 -34763 -27658 -10832 -14598 -16058 -6779 9808 -13397 -24062 -6441 5398 73
3499 73 -1168 11277 12075 19691 13551 5323 -15581 -6298 -20328 2578 4349 7524 18315 11737
3485 11737 18549 9682 9092 15803 17534 13585 9915 7010 10227 -8534 -8342 14347 15048 -1372 -7369
3470 -7369 -20552 -32882 -37388 -27700 -23685 -30694 -19320 -2620 -2117 -10421 -26315 -25745 -16980 -4059
3456 -4059 3413 9679 -3436 -3943 5413 16078 6588 4806 8097 -7140 -14720 -20358 -4496 2279
3442 2279 -5374 -4711 -8268 -15116 -25637 -27676 -22999 -10263 -16896 -17143 -13310 -13389 -15436 -22183 -22439 4678
3426 4678 3987 -1154 11387 13457 24233 23096 5114 -7586 -18136 -15358 1209 5966 14091 16540
3412 16540 15668 18289 1066 -11280 7345 16621 8810 8711 6093 -8137 -14836 -11841 1711 1510
3398 1510 14678 17239 21424 28356 51203 71246 58341 16495 -718 9331 3967 12034 14418
3385 14418 23118 20162 3649 6031 -4490 1373 2034 -13229 -9558 550 15784 -5661 -11615
3372 -11615 -9537 -16148 -13257 -2022 -23674 -23868 -8518 -16503 -26619 -13051 -6651 -14097 -18550 -26082
3358 -26082 -22307 -3252 8602 20698 21049 6675 -4298 -21090 -23069 -21793 -29799 -22217 -19204
3345 -19204 -3486 -6089 -13786 -10425 -523 -1132 -2713 3385 18022 4279 -4973 12484 4306 -2008
3331 -2008 13193 30347 31152 48893 40345 23431 18915 20382 1421 -21633 -32463 -23041 3781
3318 3781 30990 34676 23984 19096 18522 29185 13708 -6113 -1407 4838 -9970 -12374 -10733 -11231
3304 -11231 -9990 13276 13644 13636 12130 15605 14996 -4417 5719 15092 15342 12748 3418 9067 22609
3289 22609 14414 12286 15153 23515 33668 38327 30043 16481 -1059 -16734 -29450 -29485 -20894 -20644
3275 -20644 10479 22017 -5780 -2809 -9939 -28368 -14611 2739 -2770 -10069 219 13503 14321
3262 14321 15708 10149 -17575 -24905 -20465 -16369 -17570 -8853 -3492 -11449 -13875 -6494 11022 18190
3248 18190 2201 20831 35074 17277 4912 -235 -154 934 10029 24108 19213 3328 7165
3235 7165 32644 28671 19047 -8668 -10095 -5792 3179 2908 14902 17107 6585 -2340 2920 16054
3221 16054 25389 10768 -12349 -22955 -13643 -22271 -32639 -35561 -41813 -31289 -10974 -10213 -15070
3208 -15070 -17571 -27363 -28670 -8604 15454 17139 20328 13540 7231 -5085 -26039 -24689 -12869
3195 -12869 -4762 -5841 5915 27790 38064 17838 9585 -1060 -4751 -117 22214 42329 55396
3182 55396 34918 19543 14330 5853 -3035 1564 -10081 -716 -10041 -20634 -21438 -22287 -17288 -1667
3168 -1667 -1371 -9084 -19552 -36518 -26828 -2388 -6555 28 -4834 -14396 -10170 1059 7552 6145
3154 6145 7728 -7676 -10623 -11843 -11796 -9770 -12860 -16397 -25832 -32609 4837 21064 14224 4682 -12914
3139 -12914 8452 22634 -6906 -22921 -12306 9870 35547 49598 50592 22343 -3764 -16378
3127 -16378 -22221 -14227 6766 18397 24356 5860 7774 10400 13251 13767 3023 -1649 -22912 -32973
3113 -32973 -37682 -25404 -1934 4276 -8429 -30691 -35989 -24813 -7686 -28492 -17794 -12910 4095
3100 4095 14580 -4106 -24331 -19482 -4561 14244 10347 -4755 -4458 8184 9009 -11311 -15977
3087 -15977 -12143 -22693 -24408 4208 34978 49976 46460 37653 33557 20717 9213 4067 -3502
3074 -3502 -26853 -34663 -35064 -12677 1592 -6333 2504 14248 4964 -9988 -18253 7434 9270 -12512
3060 -12512 -18956 -18331 -28543 -8897 22870 13494 713 18354 15882 13982 13655 -3435 -21274
3047 -21274 -17167 -10827 1740 1739 3683 7620 4712 -1999 5671 -1877 -4722 5850 15135 7265 -12727
3032 -12727 -15524 -29399 -28425 -17781 -14805 -450 5311 -6789 -2572 6855 15109 19197 19422 25909
3018 25909 31469 21542 31956 39361 25818 14354 6961 4524 -11498 -12536 -2803 -16042 -30688
3005 -30688 -38895 -22794 -8980 -5464 -15459 -6609 15830 21470 10440 6789 -3498 -19421 -24937
2992 -24937 -8435 10427 12881 -16176 -19681 -26368 -28820 -25644 -19184 -8943 8254 7486 3697 14207
2978 14207 27659 12529 -3712 8066 4063 -10076 -701 430 -4908 -4566 3900 7213 16407 25851
2964 25851 20971 9168 10552 1640 14615 10133 298 -17795 -17546 -17224 493 15294 31153 11927
2950 11927 -511 -2929 -4209 -5979 -10994 -8716 -241 -9735 -26648 -23691 -21737 -15609 -16165 -11406
2936 -11406 -13264 -27053 -25350 -32883 -31289 -27669 -14161 1310 -9892 -12352 507 -26548 -47740
2923 -47740 -41374 -18349 -7873 -4786 -5809 -8309 -15119 -9160 -5719 460 -666 -1959 -13364 -22882
2909 -22882 -28172 -28895 -20462 -1854 718 -3873 8945 13560 4639 -20898 -3990 26161 31590 27875
2895 27875 19625 30858 37396 20507 -2558 -2194 -2268 -2794 7427 4315 4407 7873 12710 9163 -3138
2880 -3138 4785 17694 28835 37254 30352 15315 16889 15106 7653 1379 11440 26750 38498
2867 38498 28598 19518 21680 34477 42244 31606 14952 11939 2605 3538 208 15707 18773 3792
2853 3792 -4071 -8001 -36422 -25533 -9171 1398 -9600 -8197 11536 13784 -8132 -9937 -11343
2840 -11343 -23678 -22965 -17209 -18822 -8401 7127 15549 24920 13391 15184 3232 -10348 -6822
2827 -6822 -4798 17599 32129 29236 25075 14575 -2704 -11539 -10059 -6986 -6983 9608 14775 12591
2813 12591 -5013 -3375 -116 8499 -6704 -7360 7879 -325 -8062 1000 8271 -1018 3566 -2494
2799 -2494 -13363 -11548 -6210 7883 8275 3164 -3030 1328 5721 -4819 -7981 -2783 -836 2777
2785 2777 -12629 -12571 -34283 -32376 -15030 5994 4425 -1774 11393 16756 13801 1978 13767 35899
2771 35899 19857 -7488 -17020 -15632 -3060 1155 10167 6391 2269 -18101 -33153 -31156 -15071
2758 -15071 -12296 -12243 -14954 -6819 -800 8581 1178 -15879 -18409 6680 8333 -3205 128 690 7969
2743 7969 11996 18064 8282 -12448 -11255 1261 5201 12395 -3378 4711 26398 32089 34788 22066
2729 22066 5118 -9234 -36246 -25991 -24348 -10811 -8248 -1023 -2120 7334 10887 7264 -8826
2716 -8826 -10174 -9603 -7965 -628 -9132 -14688 -5484 -3007 12725 19225 19390 26524 33816 32933 7402
2701 7402 -20686 -25653 -24058 -27682 -33286 -33347 -23293 -8581 -4966 -7232 -5375 -17749 -10689 -264
2687 -264 4897 11283 703 -18829 -18397 -478 15834 -1412 -18314 -9747 8351 8891 -4240 1964
2673 1964 -2960 -3227 -1220 1096 -3255 -4156 -1819 -9736 -1268 16975 26633 14750 -1032 5959 -10224
2658 -10224 -3810 -95 -12462 -19652 -14387 -10206 8066 13758 5479 6848 15124 22376 23428 -20023
2644 -20023 -22049 -15761 -30378 -23317 4357 20974 12755 1870 -1023 -10628 -19127 -24675 -3773
2631 -3773 5635 2634 9447 14383 12522 10772 -4802 1101 25216 20464 23096 19952 21677 11568
2617 11568 8111 4313 -296 -18756 -24853 -19048 -8020 6847 27298 36071 25300 14152 10398
2604 10398 10076 -413 -20238 -20976 7087 15118 13414 -2441 5878 11538 -6277 -20799 -25153 -22172
2590 -22172 -24535 -30720 -9546 11800 5454 -16473 -22793 -12480 4574 26889 27492 11926 -4412
2577 -4412 -1476 2892 -7135 -2422 1917 14771 -3865 -14095 -5015 5499 -4148 -14928 -21246
2564 -21246 -17283 -9071 -8809 -7237 -11281 303 12837 835 -11222 162 8594 954 -3376 -16227
2550 -16227 -14322 4354 7554 8695 -4819 -19703 -21478 -15859 12736 26591 37471 47796 43319
2537 43319 33170 35674 34995 20659 21549 1493 -6767 1025 11318 23959 21186 6122 7162 9770
2523 9770 22851 8126 -7140 -2323 -4105 -7673 2475 7156 9603 20798 22372 32447 39080
2510 39080 20115 -3970 -13705 -8477 -8373 2332 978 1629 -787 1972 7778 19005 23909 20974
2496 20974 22500 18166 15603 7259 -11681 -8494 12545 16523 4914 11388 -18618 -42958 -36193
2483 -36193 -27937 -14502 -9007 -5334 -340 -12531 -4887 5763 -286 -15259 -16740 12722 24960
2470 24960 20562 18422 28531 37518 7097 -5157 -103 -13886 -19438 -12184 -3493 -11727 2879
2457 2879 13427 17795 30363 32556 31283 35007 36949 31254 19073 -4265 -4425 5249 5826 -6283
2443 -6283 -2378 -11791 -18149 -6935 7016 14345 47 -11444 7942 32993 30025 21856 22415 27686
2429 27686 6335 5501 2751 -2374 -8299 1924 15036 30139 27221 17493 6793 3073 11859 -1251
2415 -1251 2996 7899 3816 -2680 6021 30907 55062 52145 49220 58272 36765 17693 10369 -4883
2401 -4883 -26208 -36985 -47529 -33389 -17148 -26873 -5065 13949 -3467 -20428 -22428 -24496 -20085
2388 -20085 2906 6823 -8716 -12759 1916 -8259 -10531 -20741 -26182 -16479 1135 14319 -1868
2375 -1868 -6590 -15029 -15424 -27556 -14200 -7950 12562 -9663 -17870 -7821 -18330 -32601 -19673
2362 -19673 2978 21502 17181 -18727 -19736 -5928 938 14993 9269 18995 40971 42903 26664
2349 26664 11710 18482 32472 4380 -14712 -20233 -9952 -6589 -5430 -4038 17930 30199 38222
2336 38222 20445 17130 31219 30622 36802 42209 31052 27114 25864 -3199 -10347 -11629 -1156 -6535
2322 -6535 -30017 -37377 -29818 -15162 -1865 2151 9250 -5298 -9597 157 -6933 -23147 -12820
2309 -12820 6001 3286 67 2395 10794 3234 6914 12358 15941 14167 2894 -8426 8249 30272
2295 30272 25634 28638 36785 25377 9748 25759 18987 3972 -8045 -6547 -5615 -1228 -5863 -29325
2281 -29325 -23669 -19140 -20415 -12764 -13883 -5836 -7636 -6320 2952 -1203 -9155 -9535 -4333 -6197 -3558
2266 -3558 -7873 -13590 -16283 -15146 -12667 -7384 498 -544 -3456 -17020 -5234 -10995 -6465 -7243 -30294
2251 -30294 -46836 -20084 -10131 -11895 889 -9913 -16039 -13424 -9587 10729 17455 15833 29332
2238 29332 36022 23344 12479 -10442 -26658 -21367 -24617 -26970 -18408 -28497 -36302 -32957 -25159
2225 -25159 -14688 -16836 -4763 8174 24564 37437 28125 4381 -9284 -7408 8828 31651
2213 31651 33529 2775 -4966 6105 19366 16581 14668 8714 170 -24604 -32810 -26915 -22141 -17780
2199 -17780 117 19031 15376 12069 5441 18979 26814 19515 13727 -2082 -6931 -3284 -5719 -14018
2185 -14018 -16173 5290 14034 23224 37691 29189 11989 4287 -3418 -30138 -35264 -37390 -32763 -3030
2171 -3030 10188 26249 26148 19734 2985 -10567 -19630 -8829 1928 -6068 -15385 -7055 10550
2158 10550 21653 12324 -15765 -26133 -24218 -27637 -42116 -24322 -11573 -4866 3791 17234 19106
2145 19106 3953 5241 23018 28228 15173 1533 7359 811 -11293 10597 12684 7146 11482
2132 11482 14008 18741 28803 14104 9746 10026 2716 -22758 -22396 -2388 -15451 -17455 -21076 -22646
2118 -22646 -17787 -13885 -5453 -3732 -9135 -14479 -16966 -22972 -9392 3468 1255 -13320 -16992 -3628
2104 -3628 25715 20196 17950 30885 17163 10962 12432 5584 7454 -4659 -8763 -8080 9211 6491
2090 6491 -6060 -9927 -4745 13262 15051 4865 637 24497 26629 3916 -7945 1618 3227
2077 3227 14308 12840 16932 2000 -19981 -4229 11521 19237 17154 24751 9449 19225 21871
2064 21871 -1328 3855 -9742 -12193 -11197 -9069 3522 9510 19797 24037 27020 21800 31988 33887
2050 33887 25529 28898 35987 37416 31065 -2029 -19708 -6367 4427 -20116 -15413 16158 19413
2037 19413 1460 5585 17909 42507 30419 11859 -11128 -19391 -13009 7323 23000 21650 18011
2024 18011 -12238 4160 19255 23791 9113 -11139 -13925 -23029 -25853 -33002 -33770 -6010 29485
2011 29485 14738 -1577 13848 29836 21287 26872 38063 27367 31117 32120 37860 27030 3363
1998 3363 -7000 -17676 -9329 9770 39744 31677 11278 -3458 -4780 2818 9231 1599 4937
1985 4937 4594 -3850 -13915 -15324 -24825 -23530 7496 37918 43255 37459 26462 5419 -669 -14420
1971 -14420 -15778 772 12089 16631 24235 17991 7555 -20626 -37869 -37741 -29006 -13778 -11849
1958 -11849 10155 18477 12124 6306 -25187 -36312 -28597 -23848 1248 11771 8187 -7311 -25804
1945 -25804 -16920 -22510 -20933 1751 22085 30530 14811 -4783 -20845 -13423 -11652 3268 1798
1932 1798 2847 9820 23007 42468 55767 43236 34442 24891 10015 18552 5633 -6201 -4008
1919 -4008 -4907 2005 -6456 -13942 -22851 -27126 -35567 -37911 -39035 -46073 -25167 -662 -6736 -1861 4768
1904 4768 4621 -6231 109 9010 19654 22654 14204 15832 18637 14395 -8452 -14818 -2977 5022
1890 5022 633 9013 20588 26445 29540 18151 28172 38220 28219 26723 14137 2182 -1688
1877 -1688 5633 16029 14040 22755 13959 -7316 -3744 13807 25736 29711 14912 26099 16786
1864 16786 17266 4421 -4696 -9477 7825 23287 25186 24538 24953 27402 23366 21996 7571 -4819
1850 -4819 -21905 -4883 896 28057 37637 37659 38621 18162 509 5717 -9716 -35342 -37848 -12731
1836 -12731 -21381 -11760 -12817 -28464 -36482 -30968 -27760 -28645 -14767 3334 11314 13118 11905 -2418
1822 -2418 -7313 7705 9762 -4648 -17728 -15814 -9895 1431 19155 36241 20949 17264 19428
1809 19428 5234 2049 16041 10095 -16979 -28281 -14070 4583 -8046 -5467 7614 6237 -14517
1796 -14517 -11506 -741 -1453 -8739 -5819 -5991 2476 -6230 -8758 -21297 -9333 4771 10944 2844
1782 2844 -15043 -27258 -5452 -2365 -588 9102 18078 32369 23052 4928 4923 -8288 509 8778
1768 8778 -6390 -19123 -19259 -7887 -8394 -21080 -41597 -31749 -30927 -37697 -34066 -26843 -7889 -5790
1754 -5790 -397 -6960 -29263 -45775 -37689 -15402 -9785 2767 521 -3463 17087 13936 7914 9006
1740 9006 -1956 3646 2150 -5584 7575 17604 8611 787 -11869 6483 33964 20177 14628
1727 14628 8689 25588 35713 24504 1591 2218 482 13449 938 -35673 -44438 -26066 -585
1714 -585 5277 -1488 -16870 -26188 -6681 -6956 -14805 -10269 -10086 -5118 10483 15902 11159 6845 -12670
1699 -12670 -9019 -4394 -9874 -4516 7923 11925 23831 30797 13784 -9778 -13906 -9239 -6795 -7857
1685 -7857 -11660 -4441 6481 17709 12479 -17070 -18348 3325 6132 4337 17964 33167 26453
1672 26453 11342 11425 8279 -14311 -26960 -25561 -33136 -32181 -32391 -26207 7533 7187 -1493 -5342 -8859
1657 -8859 8253 29690 10442 -30515 -39468 -11755 -5225 -31 -8006 -1859 16582 1369 -25306
1644 -25306 -19024 -8789 5223 -10333 -28437 -10714 22988 24051 17259 21793 22167 30335 30560 494
1630 494 -12265 -8763 -20068 -10376 547 -5368 1241 -5671 6087 8511 1621 713 -8085 -9303
1616 -9303 -12724 -7073 -10444 -12034 -15562 4152 18562 -2223 -12176 -6526 7652 17684 15892 7480
1602 7480 4501 -11085 -14772 -2090 6957 -11039 -28213 -26617 -23457 -26146 -26304 -18167 -11662 -3044
1588 -3044 4977 -5377 -3046 -18829 -11155 4809 10703 9005 10542 16857 15415 19308 24697 19196
1574 19196 3969 -22633 -4380 7968 -3443 -9038 1978 -2489 -9539 -27551 -11333 10698
1562 10698 516 -7821 -7269 -25506 -39225 -15877 13321 16524 14779 17521 9081 -4847 9378
1549 9378 8693 4131 5586 -374 2658 -23949 -30249 -31387 -28427 -32461 -32448 -10506 -5599 8294 9372
1534 9372 -5934 -17847 -22832 -19102 -13406 -14619 -20231 -23148 -12493 -20361 -23583 -15525 -13559 -16535
1520 -16535 -12856 3434 8273 8138 1599 8223 37390 40255 19790 -2083 -210 -7993 -11777 -22566
1506 -22566 -11255 6058 10144 -263 -878 -4591 -16528 -23678 -33176 -39081 -10346 -2297 -10367 -20185
1492 -20185 -24479 -37053 -40126 -19458 -15642 -206 2406 12329 4763 7320 18433 13953 -415
1479 -415 -3421 -4764 -17349 -25440 -27086 -21397 -13426 -17389 -187 8574 5102 18722 36358 33804
1465 33804 27462 16337 -3110 -7504 8569 15892 22321 17399 4880 -17343 -19120 -12730 -8457
1452 -8457 6755 12608 10691 9818 22458 12783 16411 25212 39247 28740 29975 40264 21104 15345
1438 15345 521 -8345 -4673 8966 -1615 -8764 -7194 -14567 -27474 -8250 15658 17721 8063
1425 8063 7667 6675 5554 -3836 -3447 13508 29679 15044 17317 7140 -4099 -6146 -5281 12369
1411 12369 28810 31926 29242 31227 22130 14487 24442 5832 5909 4158 1395 12343 10888 6158
1397 6158 19091 16892 7106 -11280 -20991 -12486 7161 14712 18191 38540 38710 34001 14632 1508
1383 1508 -15465 -1662 3740 -999 -8954 -5750 21280 36828 36642 17649 3946 -21335 -24888
1370 -24888 -4602 -7013 -25754 -33581 -23069 -17480 -32245 -37515 -27725 -20247 -13076 2539 9555
1357 9555 -7176 -8475 -10 7948 2987 -19361 -23120 -14130 2632 8433 13673 18455 20660 9447
1343 9447 10297 20410 9076 -2873 9821 15247 16965 19738 13771 14292 21893 7034 8192 6061
1329 6061 14071 25358 14489 12310 10472 383 3653 12580 17695 9727 -5135 -17936 -5492
1316 -5492 -1849 -9498 -23673 -31722 -13887 -16986 -24269 -28054 -27783 -14943 -7882 -23932 -28195 -2255
1302 -2255 -5114 -2838 -15775 -33231 -18097 -8432 3593 -5568 -4416 6150 6133 -5657 -3355 -1930
1288 -1930 5252 20185 39306 35001 30077 25807 16490 3634 3722 8314 -3388 14761 32248 22735
1274 22735 18873 13653 7980 27725 18604 13899 13478 -1234 -8596 4135 692 22795 38027 33245
1260 33245 24989 28436 14206 13212 35521 28092 29193 38963 32623 4272 18021 19964 7010 3698
1246 3698 10768 9854 9744 19680 33868 34568 32946 37787 14472 -14 1393 10312 10012 201 -16209
1231 -16209 -11644 -3106 -8882 -5614 10137 17397 16426 1141 7441 13088 10810 9659 19470 27374
1217 27374 43988 46903 15106 5884 7710 -10677 -6732 1745 -4052 7000 11120 3934 12918 -2105
1203 -2105 -254 -458 -16480 -9620 -8767 -804 -4260 -8485 1696 4752 -3293 -7014 -11317 -12829 -21096
1188 -21096 -17055 -13352 -18235 -30470 -22264 -18609 -19393 -32216 -5741 -5142 -29994 -19906 -6413 7891
1174 7891 11835 -6278 -16932 -15841 -16407 -10336 2364 -6556 -1249 12180 14179 15293 -2861 -1534
1160 -1534 -1298 -4910 -3722 18491 41341 26092 21386 28479 18750 18180 20567 17891 31179 50801
1146 50801 37564 16876 -15622 -24286 -14259 10476 22372 29066 20251 -662 2559 15673 19283
1133 19283 32656 40137 12452 642 -1131 -7216 15555 22471 11031 5890 19454 32306 30305
1120 30305 9468 -2894 18626 20648 23550 38795 40454 38338 19347 10120 17481 12963 -7064
1107 -7064 12457 35391 32239 6862 6581 -1826 -16851 -23093 -15626 -3404 -8479 -2730 -814 -123
1093 -123 3489 -6287 -21686 -16296 -18840 -16443 -10977 -25439 -31866 -14468 8479 14174 -4920 -27169
1079 -27169 -30473 -10036 -1556 -10377 -13613 14127 44202 41993 39118 49139 41091 23556 11084
1066 11084 -17014 -27627 -29889 -27526 -8758 8139 3656 7972 20405 37396 33647 23836 17609
1053 17609 22298 13118 4267 14395 16995 3336 -20802 -14009 9033 19839 12267 -152 -10774
1040 -10774 -14871 -5680 -2730 -5635 31986 47396 46614 41172 45345 28244 15862 5684 -6815
1027 -6815 -1325 -1071 -8181 -26026 -25501 -12458 -1472 2019 2994 4775 31809 47437 51185 39918
1013 39918 32813 46220 37865 9713 14845 26079 38338 28443 23156 15810 4297 17590 30153
1000 30153 25155 27315 39003 53159 52340 41361 28349 24754 12234 21991 37470 24513 4796
987 4796 -17407 -23860 -25489 -5715 -9726 -10484 -15758 -16837 3957 12944 6125 14907 5701 -454 13961
972 13961 5258 5217 16086 6094 -4252 -5712 -4913 25408 33156 11268 7827 15348 21779 19426 18342
957 18342 4355 4283 12244 4260 1031 8677 18154 12541 4771 6968 13750 7386 17891 36932 30300
942 30300 12935 2638 0 -1795 11441 4822 -13433 -8315 4466 10532 15414 16761 28949
929 28949 25531 24244 22692 15549 29834 17017 19439 17610 13422 -374 -19039 -18304 13869 24666
915 24666 33618 17221 23515 32707 17948 17545 28455 5308 4943 16316 14445 10076 11824 12201
901 12201 19198 15853 9398 13774 2568 -11837 -6625 14755 16279 -133 -4546 7387 5788 10880
887 10880 2463 4332 -11074 -1567 12768 33858 33706 22732 7812 11651 2871 -10841 -3118 15637
873 15637 8437 11394 13666 5869 17301 22711 16931 11064 11422 8288 -4261 1377 -8137 -2504 15688
858 15688 39560 54747 40120 37645 26317 12710 11680 2066 -21041 -22815 -17252 -7287 -9184
845 -9184 5460 17799 5379 -20650 -28156 -14832 -19305 -20688 -18926 -10681 -6311 -16423 -23785 -22161
831 -22161 -16550 -7417 -3529 -10 -5811 -4826 8138 23995 15421 11357 -11325 -15545 465 21327
817 21327 44572 29113 13596 24972 27408 26995 33098 23058 14705 13927 21134 24480 20520 5084
803 5084 1477 1841 -6812 -34559 -33894 -19491 -22415 -23038 -5111 12564 26006 26729 12233 -2567
789 -2567 -7508 13399 7966 7802 -12045 -31098 -18426 -16229 -4605 2832 13123 35176 48830
776 48830 46898 24420 769 -5306 11224 15103 -2317 16494 20827 7736 -4548 16660 32709
763 32709 40112 22865 6617 1109 -15190 -6800 2904 22006 25060 27065 40635 41039 33067 28894
749 28894 25020 18473 -16228 -24512 -16389 -24150 -3879 7088 2096 7618 -10543 -6420 -17686 -11996
735 -11996 -4562 -14160 4812 19114 13678 23224 35401 24697 19322 16421 8344 -5007 -17916
722 -17916 -23620 -11037 -4033 9206 9217 5607 9709 1830 -8145 -4649 7033 24892 32982 26205
708 26205 27232 28546 26207 45663 30582 22470 21457 27001 34404 16888 21079 49448 48268 17849
694 17849 1797 -3629 5829 12146 16124 12298 -1931 1463 12375 17205 6388 12472 7071 15680
680 15680 24338 12479 464 5501 -2110 -16475 -5306 5379 10918 23306 13695 18613 27553
667 27553 36040 44809 31232 12441 7413 15595 24650 13500 -14666 -20127 -12034 4753 3919 -3163
653 -3163 15939 26777 46847 48766 28870 21011 30279 21290 13205 -3913 -15478 8955 22720
640 22720 26962 33239 22829 14890 8311 7122 11489 23580 27317 15504 21027 25506 13734 6811
626 6811 23949 19796 16147 18306 20734 12087 19136 17515 12998 17488 23802 10413 24393 35564
612 35564 37102 30190 27316 14635 9095 9689 18677 6900 7718 5393 20640 24144 18931 20566 9460
597 9460 30512 49965 45205 56096 56584 38383 40503 18870 21743 24963 13975 4629 5805 3365
583 3365 -1299 10537 4980 2211 5579 8243 17109 9287 15446 23398 18844 33810 40278 22271
569 22271 5792 -23659 -16918 -7844 -10527 -964 7065 968 -17324 -25463 -22865 -8125 4008 -1728
555 -1728 -15013 -19313 -9252 -11181 -911 5722 2796 6430 24352 20499 5709 3886 10986 1506
541 1506 4072 1964 -14928 -7371 8437 24883 32134 35292 31257 27614 15820 2321 -3702 -17132
527 -17132 -24546 -871 30814 36039 30462 36237 24351 24846 36341 33804 10557 -6644 2537 23586
513 23586 16994 7295 -1753 -4307 -6003 3948 18320 9183 -685 2731 16059 12688 9191 22284
499 22284 10806 10006 25135 26893 9201 7854 1728 29 7528 10755 19793 21326 1820 -22158
485 -22158 -21080 4704 15768 6909 -4364 -5522 -14905 -20468 -20108 -19472 -18684 -23506 -6396 4539
471 4539 5497 16143 28412 20296 17244 11020 19097 14813 1421 -10405 -10793 -11787 -403 -4628 -15605
456 -15605 -16072 -1900 7658 22644 32770 36401 11265 -4439 2820 12955 29983 41212 24140
443 24140 15470 20339 14362 6450 -964 1557 1480 7746 19773 29591 22441 21497 16746 11321 9464
428 9464 13116 37545 58119 40804 14077 -9908 -23963 -17883 -1511 -13551 -16843 12705 25639
415 25639 26157 29713 38054 52279 44586 27481 23766 17017 17937 20485 14138 17678 11582 10121 -5663
400 -5663 10779 30016 36229 31334 32122 28357 21198 18442 17650 16247 18320 20080 28119 30057 16125
385 16125 -357 24596 21136 12052 -7443 -765 -9299 -10959 9362 22829 28119 30899 43345
372 43345 66011 64571 56089 38949 33751 45279 36751 21417 2928 11856 15627 4181 1766
359 1766 1403 9482 8020 17604 6669 4950 29155 22756 5787 -2758 9773 19099 22434 18458
345 18458 6280 17351 31724 21609 8116 16579 26929 27804 17369 18287 30165 27404 24648
332 24648 21079 20303 21976 -1638 -10022 8633 18759 40421 24932 17598 7555 -8380 3312
319 3312 13317 19455 13786 22270 19361 18075 34861 44013 49530 38809 34254 14596 7057 6307
305 6307 10108 20584 27318 26871 12015 17878 30349 43271 30549 14734 12916 10851 1381 -1998
291 -1998 14172 17802 22520 24647 22804 32874 19686 2068 -6201 9983 28688 20022 15304 17207
277 17207 29474 32604 43218 28905 9855 7853 18027 43698 38746 37443 28961 29979 26370
264 26370 14537 5159 13846 26688 17270 14191 -8632 -15619 -13927 -14199 -21129 -22892 -4059 3393
250 3393 -668 -1551 1490 10003 13082 20183 18313 24838 31521 25706 21374 27608 23700 20120 2011
235 2011 -5336 -6534 -5572 -13718 -8971 385 21153 26358 26129 26695 29866 19868 18849 20540 37657
220 37657 35958 17598 2529 2162 -33 -3499 11936 39258 46061 44543 28774 15739 10420 -6695
206 -6695 -8256 12313 21070 23256 8172 -2732 -3429 -13322 -773 11909 16343 19957 15855 8670
192 8670 7099 19275 26621 15079 9876 5216 26860 31324 16435 -1596 13838 17162 -3156
179 -3156 -2705 4717 5613 4635 12301 7959 13670 15614 23502 20958 15862 11960 28313 33109 28379 27386
163 27386 22429 24352 25731 18187 21103 32299 28065 18796 12821 12626 9072 14053 10967 16549 24140
148 24140 34359 32518 31226 31120 3647 10152 35321 42890 35758 36284 29634 18813 10360 13336
134 13336 10866 14678 14817 15787 19085 16459 8053 5023 -2239 -5553 -2826 -5555 8359 10706 10246
119 10246 12900 14305 7504 16694 22192 5302 13956 9075 18970 22016 24897 28831 38885 32698
105 32698 14818 6175 8146 8836 16485 21285 12590 4203 -7414 -10482 -4751 3764 5097 12870 7041
90 7041 17264 20344 19238 12726 5732 5132 4284 1493 10385 8779 5512 13084 12554 12323 9973 25243
74 25243 30782 24517 22812 33171 40067 38056 32588 26996 28406 25104 19257 5955 12238 14722 26183
59 26183 21515 18626 19814 24041 25981 18505 21508 23938 33188 33347 27577 10716 1040 6078 19413
44 19413 19815 19581 8974 -361 14959 23633 6997 9 14664 16837 12795 30884 33192 15596
30 15596 19975 23876 14815 4079 -1283 22719 40094 34244 22635 12791 5680 7327 28567 54002
16 54002 47460 32245 14307 8536 25426 23120 12812 3765 4166 13227 14463 11254 16714 21907
2 21907 17886 25473
0 25473
$$ Imaginary data points
##PAGE= N=2
##DATA TABLE= (X++(I..I)), XYDATA
32767 68492 78139 78139 72436 59262 57729 72526 88662 87353 89013 97558 95444 94619 95624 88845 84233
32752 84233 92923 112324 106841 107952 103699 104527 94993 96252 102530 111475 105484 96007 98344 100123
32738 100123 107893 110656 95673 99940 96506 91904 93215 93958 99358 109577 132971 144185 141230
32725 141230 135779 121508 104226 94198 104356 97861 92858 100881 105944 105240 110162 104626 113135
32712 113135 127124 136512 126281 133172 143288 134810 119218 107673 107123 112237 113429 110624 117516
32699 117516 129900 129716 123826 129349 124886 126095 128814 127341 141216 143157 133150 140085 144832 138557
32685 138557 155909 157800 153118 143895 141322 148863 143285 135834 134854 139462 150953 145330 159468 156768
32671 156768 153849 166727 170844 170922 164328 151896 158503 160623 151187 153862 144310 142811 152127 153254
32657 153254 138529 147874 151345 162251 166307 167422 170386 168875 169954 161202 161489 167497 182734 177996
32643 177996 184611 175880 175029 183633 191025 201201 187626 186476 189557 179713 181377 173164 173688 173621 178695
32628 178695 183477 181711 173918 176060 179760 174227 191627 197374 202652 193185 190831 192563 193362 183102
32614 183102 186487 200602 199591 180671 176391 191914 197898 199960 200391 209437 219851 239222 240008
32601 240008 217930 203143 195108 206925 208189 197773 205080 217180 226461 221740 222329 230176 225547
32588 225547 208994 207954 206700 195111 204029 219980 230231 239691 246651 244248 231057 225314 234737
32575 234737 238314 237841 230495 239298 236755 237474 232469 224983 238075 246928 246136 225448 236934 247434
32561 247434 240913 227968 243106 243382 229348 215573 201998 206239 220380 247517 260996 249640
32549 249640 263923 276967 265601 253928 242238 244089 245223 239298 239501 261431 277316 280275 266308
32536 266308 255276 254444 241602 240352 242288 237843 257471 262252 264686 248064 240066 242495 236421
32523 236421 245324 255832 248134 251555 260167 256068 248619 256745 251753 253218 269034 273439 253161
32510 253161 245486 244910 248239 248678 235391 228851 231076 243485 259684 260901 262909 264064 262200 265005
32496 265005 270572 278702 255800 248593 256810 278544 285635 282112 292365 290129 277863 278495 276435
32483 276435 281593 283253 285477 286043 275137 261253 276226 284117 295544 293449 289450 293076 288611
32470 288611 273871 268324 270926 269868 263993 258572 278265 299820 309817 280092 270030 273553 279980
32457 279980 289466 306391 308889 303335 317442 310929 279767 304036 314697 297501 294390 304536
32445 304536 294332 294791 291462 285363 300432 298895 300703 302858 297587 301099 307408 313665 303946 298196
32431 298196 290047 308037 316084 293070 277820 286751 287870 296220 295014 296204 294544 292642 287373
32418 287373 286788 293328 301280 296423 291595 291954 281462 269390 282830 296059 312955 309217 297807
32405 297807 274573 292949 297998 304000 324215 323445 311501 285437 272683 292122 312865 298551
32393 298551 288815 308156 313012 310350 311737 315280 290516 288696 285034 293721 322863 332267 317783
32380 317783 308665 303129 310800 317835 325132 333084 326336 337288 327530 314813 308396 324466 334569
32367 334569 320886 310349 311905 321451 339246 328645 326406 328491 319752 318356 322577 337622 330920
32354 330920 333425 334080 323339 319454 319836 305029 286690 294620 291972 300391 313173 325803 323658
32341 323658 326221 317009 319133 312881 307106 311470 328775 344005 346990 343262 339310 321321 319088
32328 319088 327217 334294 350235 354225 349883 334497 331820 329889 324607 323044 315945 313555 311286 321070
32314 321070 327116 332842 342366 345716 331346 318335 332586 334453 341730 345984 343080 327173 328495
32301 328495 325151 332341 345424 351315 347299 332957 326098 341042 361323 347067 337622 337214 329418
32288 329418 334110 353502 381889 360685 351091 345482 344525 333525 316531 328112 337466 325573 341606
32275 341606 358396 360491 343029 332689 327917 343703 335173 334502 341945 333051 335429 332559 317890
32262 317890 305177 310803 327285 326970 332652 345211 337656 335330 329720 338060 358423 368697 348477
32249 348477 331034 327941 328353 338148 336695 331798 333123 331568 325079 327108 344988 345646 340033 331855
32235 331855 329197 308335 285224 302738 333501 345373 342214 340292 327739 343709 341519 334438
32223 334438 336647 336768 343704 343174 336049 344947 354419 365792 364676 370082 383718 378809 362509 350228
32209 350228 354073 353548 353073 351127 358188 347269 340946 345610 346711 346710 349564 346216 337548 338554 345625
32194 345625 364389 361002 344903 343652 344535 354758 348961 349892 358812 351501 342180 351955 350104 350269
32180 350269 348730 356240 366602 368460 377535 355730 329957 326851 340477 340243 357442 359331 347035
32167 347035 340404 348690 367254 360420 361738 370416 366277 358263 355230 348004 353147 345138 345040 335024
32153 335024 333052 335598 356455 349288 326541 332559 339721 340908 339287 333589 342923 350050 342883 354078
32139 354078 365085 351037 350842 377200 374320 363929 351365 343366 320078 324843 347275 352630 348468
$$ [...]
##END NTUPLES=NMR SPECTRUM
##END=
