##TITLE=Analysis number 329567
Compound Code spb 02126
Project Code adrs
Chemist Name fudan
##JCAMPDX= 6.0         $$ Bruker NMR JCAMP-DX V2.0
##DATA TYPE= NMR SPECTRUM
##DATA CLASS= NTUPLES
##ORIGIN= Bruker BioSpin GmbH
##OWNER= nmr
$$ XWIN-NMR		Version 3.5
$$ Fri Sep 14 09:12:44 2007 GMT Daylight Time (UT+1h)  MAYBRIDGE\nmr@NMR_250MHZ
##.OBSERVE FREQUENCY= 250.131544655141
##.OBSERVE NUCLEUS= ^1H
##.ACQUISITION MODE= SIMULTANEOUS (DQD)
##.ACQUISITION SCHEME= undefined
##.AVERAGES= 16
##.DIGITISER RES= 18
##SPECTROMETER/DATA SYSTEM= dpx250
##.PULSE SEQUENCE= zg30
##.SOLVENT NAME= DMSO
##.SHIFT REFERENCE= (INTERNAL, DMSO, 0, 16.522)
##AUDIT TRAIL= $$ (NUMBER, WHEN, WHO, WHERE, WHAT)
$$ ##TITLE= Audit trail, XWIN-NMR		Version 3.5
$$ ##JCAMPDX= 5.01
$$ ##ORIGIN= Bruker BioSpin GmbH
$$ ##OWNER= nmr
$$ C:\u/data/dgb/nmr/ADRS/1570/pdata/1/auditp.txt
$$ ##AUDIT TRAIL=  $$ (NUMBER, WHEN, WHO, WHERE, WHAT)
(   1,<2007-09-14 09:12:22.15 +100>,<MAYBRIDGE\nmr>,<NMR_250MHZ>,
      <created by zg, POWCHK disabled, PULCHK disabled
       configuration hash MD5:
       76 6E 9A 78 1E 09 19 81 EC 84 63 8F B0 6A 59 2D
       data hash MD5: 64K
       05 3A 03 5D 80 0A B3 84 E7 69 49 B9 9A 4B 28 A1>)
(   2,<2007-09-14 09:12:35.07 +100>,<MAYBRIDGE\nmr>,<NMR_250MHZ>,
      <Start of raw data processing
       ef LB = 0.3 FT_mod = 6 PKNL = 1 SI = 32K 
       data hash MD5: 32K
       EC 52 72 01 C7 D4 33 93 2D 9A F0 85 7D DA E2 80>)
(   3,<2007-09-14 09:12:37.01 +100>,<MAYBRIDGE\nmr>,<NMR_250MHZ>,
      <apk 
       data hash MD5: 32K
       A3 B5 90 23 0D F6 73 DC 41 9F AA 04 8F 84 1E A2>)
(   4,<2007-09-14 09:12:37.76 +100>,<MAYBRIDGE\nmr>,<NMR_250MHZ>,
      <abs ABSG = 5 
       data hash MD5: 32K
       5A 52 75 BA 4B 45 E9 2F 87 C6 0D 4F 17 E9 41 2B>)
$$ ##END=
$$ 
$$ hash MD5
$$ EE 0F 3B 48 CA 1F BA D3 96 18 BA 7E 84 67 A6 6F
##$RELAX= 
##$RELAX= 
##$RELAX= 
##$RELAX= 
##$RELAX= 
##$RELAX= 
##$RELAX= 
$$ Bruker specific parameters
$$ --------------------------
##$DU= <C:\u>
##$EXPNO= 1570
##$NAME= <ADRS>
##$PROCNO= 1
##$TYPE= <nmr>
##$USER= <dgb>
##$AMP= (0..31)
100 100 100 100 100 100 100 100 100 100 100 100 100 100 100 100 100 100 
100 100 100 100 100 100 100 100 100 100 100 100 100 100 
##$AQSEQ= 0
##$AQ_mod= 3
##$AUNM= <au_zg>
##$AUTOPOS= <5 >
##$BF1= 250.13
##$BF2= 250.13
##$BF3= 250.13
##$BF4= 250.13
##$BF5= 500.13
##$BF6= 500.13
##$BF7= 500.13
##$BF8= 500.13
##$BYTORDA= 1
##$CFDGTYP= 0
##$CFRGTYP= 5
##$CHEMSTR= <none>
##$CNST= (0..31)
1 1 145 1 1 1 1 1 1 1 1 1 1 1 1 1 1 1 1 1 1 1 1 1 1 1 1 1 1 1 1 1 
##$CPDPRG= <>
##$CPDPRG1= <>
##$CPDPRG2= <>
##$CPDPRG3= <>
##$CPDPRG4= <mlev>
##$CPDPRG5= <mlev>
##$CPDPRG6= <mlev>
##$CPDPRG7= <mlev>
##$CPDPRG8= <mlev>
##$CPDPRGB= <>
##$CPDPRGT= <>
##$D= (0..31)
0 1 0 0 0 0 0 0 0 0.06 0 0 0 0 0 0 0.0002 0 0 0 0 0 0 0 0 0 0 0 0 0 0 
0 
##$DATE= 1189757541
##$DBL= (0..7)
120 120 120 120 120 120 120 120 
##$DBP= (0..7)
150 150 150 150 150 150 150 150 
##$DBP07= 0
##$DBPNAM0= <>
##$DBPNAM1= <>
##$DBPNAM2= <>
##$DBPNAM3= <>
$$ [...]
##$SUBNAM7= <"">
##$SUBNAM8= <"">
##$SUBNAM9= <"">
##$SW= 20.6930455092707
##$SWIBOX= (0..15)
0 0 3 0 0 0 0 0 0 0 0 0 0 0 0 0 
##$SW_h= 5175.983436853
##$TD= 65536
##$TD0= 1
##$TE= 296.16
##$TE2= 300
##$TE3= 300
##$TEG= 300
##$TL= (0..7)
0 120 120 120 120 120 120 120 
##$TP= (0..7)
150 150 150 150 150 150 150 150 
##$TP07= 0
##$TPNAME0= <>
##$TPNAME1= <>
##$TPNAME2= <>
##$TPNAME3= <>
##$TPNAME4= <>
##$TPNAME5= <>
##$TPNAME6= <>
##$TPNAME7= <>
##$TPOAL= (0..7)
0.5 0.5 0.5 0.5 0.5 0.5 0.5 0.5 
##$TPOFFS= (0..7)
0 0 0 0 0 0 0 0 
##$TUNHIN= 0
##$TUNHOUT= 0
##$TUNXOUT= 0
##$USERA1= <user>
##$USERA2= <user>
##$USERA3= <user>
##$USERA4= <user>
##$USERA5= <user>
##$V9= 5
##$VALIST= <valist>
##$VCLIST= <CCCCCCCCCCCCCCC>
##$VD= 0
##$VDLIST= <DDDDDDDDDDDDDDD>
##$VPLIST= <PPPPPPPPPPPPPPP>
##$VTLIST= <TTTTTTTTTTTTTTT>
##$WBST= 1024
##$WBSW= 4
##$XGAIN= (0..3)
0 0 0 0 
##$XL= 0
##$YL= 0
##$YMAX_a= 268392
##$YMIN_a= -243953
##$ZGOPTNS= <>
##$ZL1= 120
##$ZL2= 120
##$ZL3= 120
##$ZL4= 120
##$ABSF1= 16.522
##$ABSF2= -4.171173
##$ABSG= 5
##$ABSL= 3
##$ALPHA= 0
##$AQORDER= 0
##$ASSFAC= 0
##$ASSFACI= 0
##$ASSFACX= 0
##$ASSWID= 0
##$AUNMP= <proc_1d>
##$AZFE= 0.1
##$AZFW= 0.1
##$BCFW= 0
##$BC_mod= 0
##$BYTORDP= 0
##$COROFFS= 0
##$CY= 12.5
##$DATMOD= 1
##$DC= 0
##$DFILT= <>
##$DTYPP= 0
##$F1P= 14.0000005364418
##$F2P= -0.99999901652339
##$FCOR= 0.5
##$FTSIZE= 32768
##$FT_mod= 6
##$GAMMA= 0
##$GB= 0
##$INTBC= 1
##$INTSCL= 1
##$ISEN= 128
##$LB= 0.3
##$LEV0= 0
##$LPBIN= 0
##$MAXI= 10000
##$MC2= 0
##$MEAN= 0
##$ME_mod= 0
##$MI= 0
##$NCOEF= 0
##$NC_proc= -4
##$NLEV= 6
##$NOISF1= 0
##$NOISF2= 0
##$NSP= 0
##$NTH_PI= 0
##$NZP= 0
##$OFFSET= 16.522
##$PC= 1
##$PHC0= -70.03902
##$PHC1= 3.642366
##$PH_mod= 1
##$PKNL= yes
##$PPARMOD= 0
##$PSCAL= 4
##$PSIGN= 0
##$REVERSE= no
##$SF= 250.13
##$SI= 32768
##$SIGF1= 0
##$SIGF2= 0
##$SINO= 400
##$SIOLD= 32768
##$SREGLST= <1H.DMSO>
##$SSB= 0
##$STSI= 32768
##$STSR= 0
##$SW_p= 5175.98343685301
##$SYMM= 0
##$S_DEV= 0
##$TDeff= 65536
##$TDoff= 0
##$TI= <Analysis number 999999
Compound Code 99
Book Reference 9
Project Code 9>
##$TILT= no
##$TM1= 0
##$TM2= 0
##$TOPLEV= 0
##$USERP1= <user>
##$USERP2= <user>
##$USERP3= <user>
##$USERP4= <user>
##$USERP5= <user>
##$WDW= 1
##$XDIM= 32768
##$YMAX_p= 425585782
##$YMIN_p= -282985
$$ End of Bruker specific parameters
$$ ---------------------------------
##NTUPLES= NMR SPECTRUM
##VAR_NAME=  FREQUENCY,     SPECTRUM/REAL,   SPECTRUM/IMAG
##SYMBOL=    X,             R,               I
##VAR_TYPE=  INDEPENDENT,   DEPENDENT,       DEPENDENT
##VAR_FORM=  AFFN,          ASDF,            ASDF
##VAR_DIM=   32768,         32768,           32768
##UNITS=     HZ,            ARBITRARY UNITS, ARBITRARY UNITS
##FACTOR=    0.157963299565203, 1,           1
##FIRST=     4132.6476996994, 0,             0
##LAST=      -1043.33573715361, 0,           0
##MIN=       -1043.33573715361, -282985,     0
##MAX=       4132.6476996994, 425585782,     0
$$ Real data points
##PAGE= N=1
##DATA TABLE= (X++(R..R)), XYDATA
$$ [...]
$$ plain form
17692 134483 117159 24610 19246 -30249 -33069 13578 34204 8107 -3295 -3457 62105 109869
17680 109869 104798 114446 79527 104440 81530 52222 40263 81093 113660 155107 163436 68589
17668 68589 49032 82415 99094 49026 47047 45066 91212 111423 64447 52952 42246 13164
17656 13164 25747 48929 66542 38919 46244 49620 54887 22159 -34297 -7331 -25093 -51612
17644 -51612 -53392 -49389 -20613 -12505 40227 34245 54201 10031 35887 82580 105909 69105
17632 69105 54011 66545 67883 7690 -23130 -43176 -60371 -75353 -54672 36705 46396 44954
17620 44954 98684 114119 97776 12861 -19274 -16741 8230 29214 -7621 -46149 -58238 -77170
17608 -77170 9030 71631 24122 27328 17676 17037 57061 29373 67121 41806 24918 38319
$$ packed form
17692A34483j7324r2549n364m9495k820M6647K0626k6097j1402j62O5562M7764
17680A09869n071R648l4919K4913k2910k9308j1959M0830L2567M1447Q329r4847
17668F8589j9557L3383J6679n0068j979j981M6146K0211m6976j1495j0706k9082
17656A3164J2583K3182J7613k7623P325L376N267l2728n6456K6966j7762k6519
17644e1612j780M003K8776Q108N2732n982J9956m4170K5856M6693K3329l6804
17632F9105j5094J2534J338o0193l0820k0046j7195j4982K0681R1377R691j442
17620D4954N3730J5435j6343q4915l2135K533K4971K0984l6835l8528j2089j8932
17608g7170Q6200O2601m7509L206r652o39M0024k7688L7748k5315j6888J3401
$$ plain form
17596 38319 39164 63159 90474 42887 -9455 -56692 4901 24852 -10665 -11171 20770 18572 15124
17583 15124 51122 28504 18893 -49509 -35040 -22236 -24401 -25116 -57876 -108106 -92535 -34402
17571 -34402 61483 89431 58372 64010 32806 -23282 -46120 -91132 -26770 -46179 -80189 -81638
17559 -81638 -58746 -111759 -107019 -64765 2278 39692 -54488 -96596 -86424 -106533 -73357 -84603
17547 -84603 -54397 -1948 -2847 19275 8656 -20304 -31335 22188 32229 28473 -22190 45811
17535 45811 65556 12003 16423 -9146 25444 28841 -17646 -69068 -44678 -82901 -109877 -87171
17523 -87171 -16735 -39321 -30302 -51465 -74672 -65048 18852 21968 -49594 -24104 38993 117431
17511 117431 122188 95646 73544 71383 -18294 -36750 -61629 -50585 -12077 -47564 -26720 18526
$$ packed form
17596C8319Q45K3995K7315m7587n2342m7237O1593J9951l5517n06L1941k198l448
17583A5124L5998k2618r611o8402J4469J2804k165p15l2760n0230J5571N8133
17571c4402R5885K7948l1059N638l1204n6088k2838m5012O4362j9409l4010j449
17559h1638K2892n3013M740M2254O7043L7414r4180m2108J0172k0109L3176j1246
17547h4603L0206N2449q99K2122j0619k8960j1031N3523J0041l756n0663O8001
17535D5811J9745n3553M420k5569L4590L397m6487n1422K4390l8223k6976K2706
17523h7171P0436k2586R019k1163k3207R624Q3900L116p1562K5490O3097P8438
17511A17431M757k6542k2102k161q9677j8456k4879J1044L8508l5487K0844M5246
$$ plain form
17499 18526 68065 93662 112972 83304 4953 -37431 -2255 -49309 -69847 -61766 9797 2756
17487 2756 -45952 -70716 32415 -20601 -34968 9200 4803 41061 67090 72131 33776 -27181
17475 -27181 -23169 14464 -44389 -76332 -40000 -22404 -102711 -129524 -98384 -10888 -3571 14054
17463 14054 56915 72267 66702 11886 24506 83093 79204 42205 22115 -26233 -56863 -41346
17451 -41346 -15286 -34361 -7065 71088 101911 102857 113858 146177 164636 214850 329813 485547
17439 485547 464029 436270 400391 257788 162502 88431 113436 83726 -14548 33761 -12383
17428 -12383 -67317 -19059 6440 52989 108399 130330 72530 66312 93315 202629 317499
17417 317499 359797 425009 540290 624363 554573 467012 416688 416869 482855 457804 437036 364076
$$ packed form
17499A8526M9539K5597J9310k9668p8351m2384L5176m7054k0538Q081P1563p041
17487B756m8708k4764J03131n3016j4367M4168m397L6258K6029N041l8355o0957
17475b7181M012L7633n8853l1943L6332J7596q0307k6813L1140Q7496P317J7625
17463A4054M2861J5352n565n4816J2620N8587l889l6999k0090m8348l0630J5517
17451d1346K6060j9075K7296P8153L0823R46J1001L2319J8459N0214J14963J55734
17439D85547k1518k7759l5879j42603r5286p4071K5005k9710r8274M8309m6144
17428a2383n4934M8258K5499M6549N5410K1931n7800o218K7003J09314J14870
17417C17499M2298O5212J15281Q4073o9790q7561n0324J81O5986k5051k0768p2960
$$ plain form
17405 364076 278971 232679 189589 148491 109994 94577 26819 60659 73817 54403 84187
17394 84187 103517 87597 111999 85166 9795 -2684 52426 153908 198675 308291 415730
17383 415730 404370 402710 380928 257341 158352 101696 84495 46470 22339 80258 123488
17372 123488 92807 489 -92077 -129069 -39483 -67379 -94097 -73749 -16695 33609 53427
17361 53427 2676 -18839 -13316 -17829 -32071 -51450 -32381 3807 -11488 -31804 13959 -14312
17349 -14312 -8436 -8859 -39455 -65891 -40306 15877 25455 -3367 33151 63144 26302 -13967
17337 -13967 -19080 -38172 -4508 -41180 -90217 -117240 -116118 -95877 -60214 -86176 -90636 -27998
17325 -27998 19108 -1771 -65680 -49314 -35875 -13195 -33071 -80436 -115455 -58500 -43531 -36320
$$ packed form
17405C64076q5105m6292m3090m1098l8497j5417o7758L3840J3158j9414K9784
17394H4187J9330j5920K4402k6833p5371j2479N5110J01482M4767J09616J07439
17383D15730j1360j660k1782j23587r8989n6656j7201l8025k4131N7919M3230
17372A23488l0681r2318r2566l6992Q9586k7896k6718K0348N7054N0304J9818
17361E3427n0751k1515N523m513j4242j9379J9069L6188j5295k0316M5763k8271
17349a4312N876m23l0596k6436K5585N6183R578k8822L6518K9993l6842m0269
17337a3967n113j9092L3664l6672m9037k7023J122K0241L5663k5962m460O2638
17325b7998M7106k0879o3909J6366J3439K2680j9876m7365l5019N6955J4969P211
$$ plain form
17313 -36320 -2044 47514 20190 -38839 -45851 -39864 -69266 -90545 -45227 -46429 -38269 7993
17301 7993 79611 150997 137903 27070 -20945 -4426 -11684 -83981 -146495 -121663 -108648 -72697
17289 -72697 -46980 -44640 -59424 -45523 -46521 -39003 -107592 -124846 -73272 -90897 -154338 -155713 -113594
17276 -113594 -114784 -74504 -57351 -44440 -15488 -76160 -98573 -27613 41391 -51218 -76714 -37978
17264 -37978 -55268 13442 15396 -15175 -6404 -45744 -43049 -6395 42699 12009 16752 26650 12298
17251 12298 -80227 -155235 -166150 -110276 -106854 -58058 -52332 -111432 -75693 -52997 -75971 -123264
17239 -123264 -61071 -31231 9864 -10876 -13125 -42870 -57112 -79548 -127611 -80134 -60431 -66294
17227 -66294 -28869 -21858 29807 19604 23170 15881 -6118 9456 -25388 -24926 16911 31260 -11062
$$ packed form
17313c6320L4276M9558k7324n9029p012N987k9402k1279M5318j202Q160M6262
17301G993P1618P1386j3094j10833m8015J6519p258p2297o2514K4832J3015L5951
17289g2697K5717K340j4784J3901r98P518o8589j7254N1574j7625o3441j375M2119
17276a13594j190M0280J7153J2911K8952o0672k2413P0960O9004r2609k5496L8736
17264c7978j7290O8710J954l0571Q771l9340K695L6654M9094l0690M743R898j4352
17251A2298r2525p5008j0915N5874L422M8796N726n9100L5739K2696k2974m7293
17239a23264O2193K9840M1095k0740k249k9745j4242k2436m8063M7477J9703n863
17227f6294L7425P011N1665j0203L566p289k1999J5574l4844M62M1837J4349m2322
$$ plain form
17214 -11062 -20289 -23801 -40967 -28217 -3635 -4067 -54087 -13266 99631 84507 62072 46031
17202 46031 228 4774 -5046 9769 12906 13432 53555 49362 -52494 -51324 25206 6012 -14311
17189 -14311 5422 17361 17129 15209 -249 -41011 -56971 -58259 -71260 -108846 -118060 -105325 -91754
17176 -91754 -51527 23223 5845 -3621 -25356 39968 40462 79859 -19306 -88010 -57881 21150
17164 21150 -19776 -67643 -12366 -8567 16825 62775 132904 85871 -68021 -135208 -112363 -88868
17152 -88868 -90408 -86314 -138745 -165304 -111508 -83069 -88134 -64733 -64721 -1513 78764 105571 80984
17139 80984 -6088 -68632 -29142 -883 9690 -40608 -70522 55843 76568 -525 -101083
17128 -101083 -41269 -3900 7064 -25727 -29611 -40696 33554 70321 68862 118547 124708 80190
$$ packed form
17214a1062r227l512j7166J2750K4582m32n0020M0821J12897j5124k2435j6041
17202D6031m5803M546r820J4815L137N26M0123m193j01856J170P6530j9194k0323
17189a4311J9733J1939k32j920j5458m0762j5960j288j3001l7586r214J2735J3571
17176i1754M0227P4750j7378r466k1735O5324M94L9397r9165o8704L0129P9031
17164B1150m0926m7867N5277L799K5392M5950P0129m7033j53892o7187K2845K3495
17152h8868j540M094n2431k6559N3796K8439n065K3401J2O3208Q0277K6807k4587
17139H0984q7072o2544L9490K8259J0573n0298k9914J26365K0725p7093j00558
17128a01083N9814L7369J0964l2791l884j1085P4250L6767j459M9685O161m4518
$$ plain form
17116 80190 89267 78072 73128 7721 -43709 -63478 -46196 -56904 -87630 -110465 -27298 14173
17104 14173 -42693 -96664 -95419 -70584 -32590 -49024 -19696 6134 19960 -1323 -9585 -3734
17092 -3734 43916 62228 89790 112096 127215 96841 61534 31850 3897 13625 14436 21725 -44970
17079 -44970 -44842 -32171 -35308 -30358 -78368 -106659 -107580 -49549 7648 66901 -16063 -82405 -95235
17066 -95235 -99500 13697 17445 -47040 -62096 42961 39855 42881 12612 -85775 -90764 -91951
17054 -91951 -50578 -8025 -34569 -85877 -28358 2229 -33637 -110113 -82701 -24528 -8899 3464
17042 3464 -10620 -2274 -2834 -43365 -95725 -69841 -71032 13522 -20591 -65644 -60423 -17899 27195
17029 27195 36414 63642 62307 61088 41848 30902 45367 44975 34853 -60535 -74032 -65229 -67094
$$ packed form
17116H0190R077j1195m944o5407n1430j9769J7282j0708l0726k2835Q3167M1471
17104A4173n6866n3971J245K4835L7994j6434K9328K5830J3826k1283q262N851
17092c734M7650J8312K7562K2306J5119l0374l5307k9684k7953R728Q11P289o6695
17079d4970J28J2671l137M950m8010k8291r21N8031N7197N9253q2964o6342j2830
17066i5235m265J13197L748o4485j5056J05057l106L026l0269r8387m989j187
17054i1951M1373M2553k6544n1308N7519L0587l5866p6476K7412N8173J5629J2363
17042C464j4084Q346n60m0531n2360K5884j191Q4554l4113m5053N221M2524M5094
17029B7195R219K7228j335j219j9240j0946J4465l92j0122r5388j3497Q803j865
$$ plain form
17016 -67094 -58883 21683 8506 -68013 -100391 -60815 -68094 -81985 -62051 -67169 -2114 1230
17004 1230 -39425 -13156 -27987 -784 60855 9048 9622 18454 -9054 -11869 -12410 -24140 -41740
16991 -41740 -11560 -2760 19775 64630 90392 74179 44258 39931 50999 28933 91522 45070
16979 45070 52433 39391 36568 79350 54825 36415 -3329 17137 21928 2963 52400 33596
16967 33596 42310 -18344 -40434 -19670 15628 30774 9197 -47907 -28468 -16434 -53332 -28882
16955 -28882 -17479 -47359 -14342 34428 70248 30367 -21795 -70144 -114630 -55433 -19892 -5442
16943 -5442 -30235 -108132 -174371 -139736 -45494 -41172 -45048 -13736 -28372 -33843 -16793 -76134
16931 -76134 -66429 -29556 10556 -13504 -38964 -26523 -126157 -161790 -126917 -70598 -55917 -77836
$$ packed form
17016f7094Q211Q0566j3177p6519l2378L9576p279j3891J9934n118O5055L344
17004A230m0655K6269j4831K7203O1639n1807N74Q832k7508k815n41j1730j7600
16991d1740L0180Q800K2535M4855K5762j6213k9921m327J1068k2066O2589m6452
16979D5070P363j3042k823M2782k4525j8410l9744K0466M791j8965M9437j8804
16967C3596Q714o0654k2090K0764L5298J5146k1577n7104J9439J2034l6898K4450
16955b8882J1403k9880L3017M8770L5820l9881n2162m8349m4486N9197L5541J4450
16943e442k4793p7897o6239L4635R4242M322l876L1312j4636n471J7050n9341
16931g6134R705L6873M0112k4060k5460J2441r9634l5633L4873N6319J4681k1919
$$ plain form
16919 -77836 -96376 -94640 -89228 -36317 -2791 43338 46200 52279 43682 49755 91388 89693 46525
16906 46525 28935 14501 35951 49606 97575 55301 34976 -34225 -124715 -120837 -94859 -30413
16894 -30413 37036 44770 46570 58972 35458 108288 105135 90431 61655 37928 74159 149208
16882 149208 77459 -34538 -27948 6391 18242 23160 45459 -17061 -55014 -20055 -27443 -11799
16870 -11799 26928 17193 -31214 -24106 -39348 -20414 -46285 -110661 -81449 -10362 22064 19393
16858 19393 9885 -36688 -6946 -50316 -97580 -27486 3868 68534 55835 5879 -19304 -61472
16846 -61472 -73007 -62235 -78068 -124006 -116578 7735 24800 -11237 53448 137571 139332 85499
16834 85499 40466 -39396 -36992 -55992 -86335 -50769 -31515 -46843 -76400 -36411 40238 54034
$$ packed form
16919g7836j8540J736N412N2911L3526M6129K862O079q597O073M1633j695m3168
16906D6525j7590j4434K1450J3655M7969m2274k0325o9201r0490L878K5978O4446
16894c0413O7449P734J800J2402k3514P2830l153j4704k8776k3727L6231P5049
16882A49208p1749j11997O590L4339J1851M918K2299o2520l7953L4959p388J5644
16870a1799L8727r735m8407P108j5242J8934k5871o4376K9212P1087L2426k671
16858A9393r508m6573K9742m3370m7264P0094L1354O4666j2699m9956k5183m2168
16846f1472j1535J0772j5833m5938P428J24313J7065l6037O4685Q4123J761n3833
16834H5499m5033p9862K404j9000l0343L5566J9254j5328k9557L9989P6649J3796
$$ plain form
16822 54034 52005 56940 8022 888 -1244 3099 40727 49250 -13798 -21231 -47879 -94929 -81464
16809 -81464 -106927 -45494 -26470 -34394 -9035 -33818 38772 72742 11184 -14510 -81389 -89729
16797 -89729 -30103 -9344 -12631 -13811 -30782 -34104 -104373 -66910 -17028 -7125 -29686 -65373
16785 -65373 -36912 -28892 -14335 -51363 -116973 -44868 -59941 -58097 34791 71827 43685 -4314
16773 -4314 -135857 -135928 -85485 -59477 -42817 16182 88699 69438 57653 8570 -41417 -32911
16761 -32911 -3849 31786 45395 7457 -69453 -61181 -36312 -17046 -79058 -76969 -70792 -11448
16749 -11448 11761 -39864 -119652 -97481 -103795 -31731 -42026 -77313 -119813 -134482 -96634 -19952
16737 -19952 71533 41473 -63637 -84749 -71815 -90100 -120071 -55218 -27028 57557 20410
$$ packed form
16822E4034k029M935m8918p134k132M343L7628Q523o3048p433k6648m7050J3465
16809h1464k5463O1433J9024p924K5359k4783P2590L3970o1558k5694o6879q340
16797h9729N9626K0759l287j180j6971l322p0269L7463M9882R903k2561l5687
16785f5373K8461Q020J4557l7028o5610P2105j5073J844R2888L7036k8142m7999
16773d314j31543p1N0443K6008J6660N8999P2517j9261j1785m9083m9987Q506
16761c2911K9062L5635J3609l7938p6910Q272K4869J9266o2012K089O177N9344
16749a1448K3209n1625p9788K2171o314P2064j0295l5287m2500j4669L7848P6682
16737a9952R1485l0060j05110k1112J2934j8285k9971O4853K8190Q4585l7147
$$ plain form
16726 20410 -17711 54 23414 97107 94324 6559 15260 36265 77470 104931 107148 23306
16714 23306 -5992 8764 -27246 -27145 -2966 11693 48315 60970 42598 979 -76392 -128032
16702 -128032 -83823 -7734 -35243 -53342 -16301 1960 -53518 -43048 26201 100906 81645
16691 81645 17906 -11336 33222 -35913 -55576 -53965 -43299 -26104 -28762 -78718 -83775 -109115
16679 -109115 -125169 -115007 -98185 -36509 -40357 -65480 -58129 -17317 -32008 -64837 -39159 14095
16667 14095 54539 20626 29160 21605 33218 30418 58711 93288 38045 -54915 -70143 -69027
16655 -69027 -100249 -91177 -130222 -91637 -27234 11084 -6586 19256 -42837 -28418 28217 108691
16643 108691 118323 93885 94177 48565 35996 59245 631 -62563 40599 88381 127761 184051
$$ packed form
16726B0410l8121J7765K3360P3693k783q7765Q701K1005M1205K7461K217q3842
16714B3306k9298J4756l6010J01K4179J4659L6622J2655j8372m1619p7371n1640
16702a28032M4209P6089k7509j8099L7041J8261n5478J0470O9249P4705j9261
16691H1645o3739k9242M4558o9135j9663J611J0666J7195k658m9956n057k5340
16679a09115j6054J0162J6822O1676l848k5123P351M0812j4691l2829K5678N3254
16667A4095M0444l3913Q534p555J1613k800K8293L4577n5243r2960j5228J116
16655f9027l1222R072l9045L8585O4403L8318j7670K5842o2093J4419N6635Q0474
16643A08691R632k4438K92m5612j2569K3249n8614o3194J03162M7782L9380N6290
$$ plain form
16631 184051 89658 -53244 -145091 -151972 -86958 -73980 -52717 23953 47738 20052 9636
16620 9636 20330 6269 -31597 -78205 -43311 7504 -16582 -35375 -82454 -94221 -82598 -100135
16608 -100135 -160753 -116703 -107328 -131506 -138092 -123235 -98237 -69691 -97529 -90891 -87513 -84403
16596 -84403 8953 6157 -2131 -42144 -56597 -73954 -112342 -147812 -72862 -30108 -80985 -99538
16584 -99538 -67715 -77514 -28862 -41526 -44178 -37596 24277 27663 -7442 -42584 -40756 -27843 -39102
16571 -39102 -119193 -107684 -20312 -16703 -64843 -56934 -613 -30194 -29023 4778 37104 18336
16559 18336 51541 36704 9560 6652 31263 -14207 -16181 -38109 -13204 32166 59241 15872
16547 15872 17655 47382 118432 106041 48089 41895 9807 -41791 -12689 39699 137948 137340
$$ packed form
16631A84051r4393j42902r1847o881O5014J2978K1263P6670K3785k7686j0416
16620I636J0694j4061l7866m6608L4894N0815k4086j8793m7079j1767J1623j7537
16608a00135o0618M4050R375k4178o586J4857K4998K8546k7838O638L378L110
16596h4403R3356k796q288m0013j4453j7357l8388l5470P4950M2754n0877j8553
16584i9538L1823r799M8652j2664k652O582O1873L386l5105l5142J828J2913j1259
16571c9102q0091J1509Q7372L609m8140P909N6321k9581J171L3801L2326j8768
16559A8336L3205j4837k7144k908K4611m5470j974k1928K4905M5370K7075m3369
16547A5872J783K9727P1050j2391n7952o194l2088n1598K9102N2388R8249o08
$$ plain form
16535 137340 55671 -38851 -94917 -87757 -19172 54919 34698 -36909 -51954 -14657 -25954 17696
16523 17696 38177 -10235 33498 74658 50621 20882 16829 8035 -43988 -156779 -129160 -71300
16511 -71300 -56910 -137955 -169341 -123302 -82550 -36458 -14538 16987 48892 13644 -29626 -52627
16499 -52627 -52872 -105061 -174204 -139739 -99648 -117616 -73782 -65576 -67547 -69345 -3218 47106 -3452
16486 -3452 12704 15608 -22236 10361 41232 42966 15899 -16125 -38126 -2479 -30955 -57883
16474 -57883 -91632 -105943 -32289 -54940 -138089 -95974 -35125 -76802 -94124 -62880 -83442 -182874
16462 -182874 -214096 -149988 -89959 -56375 -35936 -86102 -101369 -53871 11735 34380 31118 -52684
16450 -52684 -68856 -11856 -29655 -44597 3875 -12516 -1669 -37012 -79326 -103956 -110766 -164176
$$ packed form
16535A37340q1669r4522n6066P160O8585P4091k0221p1607j5045L7297j1297M3650
16523A7696K0481m8412M3733M1160k4037k9739m053q794n2023j12791K7619N7860
16511g1300J4390q1045l1386M6039M0752M6092K1920L1525L1905l5248m3270k3001
16499e2627k45n2189o9143L4465M0091j7968M3834Q206j971j798O6127N0324n0558
16486c452J6156K904l7844L2597L0871J734k7067l2024k2001L5647k8476k6928
16474e7883l3749j4311P3654k2651q3149M2115O0849m1677j7322L1244k0562r9432
16462a82874l1222O4108O0029L3584K0439n0166j5267M7498O5606K2645l262q3802
16450e2684j6172N7000j7799j4942M8472j6391J0847l5343m2314k4630o810n3410
$$ plain form
16438 -164176 -107425 -106891 -121783 -120844 -97696 -99478 -35003 -32876 -50020 -25566 -28211 -41280 -62125
16425 -62125 -25313 -33123 -62877 -88778 -68633 -65833 -40399 -47755 -69550 -109973 -67048 -24962
16413 -24962 -26796 -24144 -61990 -107947 -108013 -72389 -103876 -86452 -76551 -54788 -55303 -74224 -85776
16400 -85776 -90551 -100061 -97975 -86079 -77097 -126559 -72920 -41724 -43252 -39212 -59936 -63458 -18370
16387 -18370 35585 31553 34090 2597 3897 17763 1115 -36478 -43438 -102851 -74917 -54671
16375 -54671 -527 46358 -6327 -41373 -35424 -15283 7327 45991 24253 16340 96577 154043
16363 154043 11940 -111292 -149561 -136734 -71959 -21849 15846 83343 75796 33951 43551
16352 43551 -40083 -29578 31319 10080 -51585 -70148 -108418 -146058 -89679 -98286 -116078 -80360
$$ packed form
16438a64176N6751N34j4892R39K3148j782O4475K127j7144K4454k645j3069k0845
16425f2125L6812p810k9754k5901K0145K800K5434p356k1795m0423M2925M2086
16413b4962j834K652l7846m5957o6L5624l1487J7424R901K1763n15j8921j1552
16400h5776m775r510K086J1896Q982m9462N3639L1196j528M040k0724l522M5088
16387a8370N3955m032K537l1493J300J3866j6648l7593o960n9413K7934K0246
16375e4671N4144M6885n2685l5046N949K0141K2610L8664k1738p913Q0237N7466
16363A54043j42103j23232l8269J2827O4775N0110L7695O7497p547m1845R600
16352D3551q3634J0505O0897k1239o1665j8563l8270l7640N6379q607j7792L5718
$$ plain form
16340 -80360 -22776 58132 73209 -480 -41819 -25500 -27716 -31200 12633 -5252 3420 29352
16328 29352 33930 23817 -14253 5805 -48771 -81306 -6803 -4759 -32201 -56348 -6542 18082
16316 18082 -23446 -2685 -49495 -127891 -122924 -54174 -43163 -29455 -3159 -44974 -69247 -94376
16304 -94376 -158437 -98090 -114657 -130537 -189888 -232724 -128584 -111823 -120189 -107275 -58481 -10851
16292 -10851 1669 -36048 4571 -13016 3644 12072 37410 26199 9790 24830 61425 93035
16280 93035 119516 107978 78529 34360 -23538 -23832 -37783 -12958 34285 -6059 564 -44477
16268 -44477 -19179 -15701 -24391 -50010 -72721 -27205 -95938 -89711 7226 85862 75175 1751
16256 1751 -71676 -78831 -69404 -26960 -10403 -32935 18704 -12565 -101430 -140398 -91930 2792
$$ packed form
16340h0360N7584Q0908J5077p3689m1339J6319k216l484M3833j7885Q672K5932
16328B9352M578j0113l8070K0058n4576l2535P4503K044k7442k4147M9806K4624
16316A8082m1528K0761m6810p8396M967O8750J1011J3708K6296m1815k4273k5129
16304i4376o4061O0347j6567j5880n9351m2836J04140J6761q366J2914M8794M7630
16292a0851J2520l7717M0619j7587J6660Q428K5338j1211j6409J5040L6595L1610
16280I3035K6481j1538k9449m4169n7898k94j3951K4825M7243m0344O623m5041
16268d4477K5298L478q690k5619k2711M5516o8733O227R6937P8636j0687p3424
16256A751p3427p155R427M2444J6557k2532N1639l1269q8865l8968M8468R4722
$$ plain form
16244 2792 6752 -73183 -85623 12451 34057 -5563 -28041 5421 -1667 10839 21627 -15344
16232 -15344 -4604 -17806 -58708 -107920 -92026 -37174 -15211 -43812 80 -78169 -117566 -85980
16220 -85980 -80686 -54758 -19586 -38352 -73502 -60452 -58565 -33653 -39567 -38285 -9852 1846
16208 1846 -5843 -14636 -69889 -102587 -118603 -152288 -144074 -169536 -194976 -128431 -64890 -111974
16196 -111974 -125883 -92965 -47338 32989 14342 20767 66240 66047 83644 14218 -58635 -73468
16184 -73468 -57013 42490 73505 73110 35013 43871 39974 5868 -21929 -12196 -42967 -102700 -94088
16171 -94088 -67331 -75213 -27429 24621 -40593 -67447 -112534 -76939 -106655 -140059 -96996 -69155
16159 -69155 -76092 -11787 60663 -28801 -44425 -18542 1936 -32837 -32808 32889 79209 57094
$$ packed form
16244B792L960p9935j2440R8074K1606l9620k2478L3462p088J2506J0788l6971
16232a5344J0740j3202m0902m9212J5894N4852K1963k8601M3892p8249l9397L1586
16220h5980N294K5928L5172j8766l5150J3050J887K4912n914J282K8433J1698
16208A846p689q793n5253l2698j6016l3685Q214k5462k5440O6545O3541m7084
16196a11974j3909L2918M5627Q0327j8647O425M5473j93J7597o9426p2853j4833
16184g3468J6455R9503L1015l95l8097Q858l897l4106k7797R733l0771n9733Q612
16171i4088K6757p882M7784N2050o5214k6854m5087L5595k9716l3404M3063K7841
16159f9155o937O4305P2450q9464j5624K5883K0478l4773K9O5697M6320k2115
$$ plain form
16147 57094 47460 -6920 -4452 -54484 -56368 -67644 -56291 -18955 -24275 -46186 -94908 -149319
16135 -149319 -84364 -59037 -51763 -89278 -133749 -106812 -14319 39044 1930 -20280 7273 52658
16123 52658 14032 21424 96926 105659 -3158 -32445 63349 132370 75415 6342 -34946 -18633
16111 -18633 -47028 -59079 14010 29841 12188 -17537 -57330 -22800 -3463 -24836 -45913 8202
16099 8202 60957 33660 -8309 -28071 -96683 -136237 -154729 -111394 -43655 -36920 -14549 15557
16087 15557 39906 40918 103762 32544 -120384 -151094 -139213 -78150 -69492 -81103 -48194 -20882
16075 -20882 31984 71375 59496 73048 -1765 72252 65393 -26495 -77016 -70919 -49434 -30544
16063 -30544 -36771 -16845 -4890 -20104 -26960 -18072 -60070 -121720 -143453 -88548 -41832 -29538
$$ packed form
16147E7094r634n4380K468n0032j884j1276J1353L7336n320k1911m8722n4411
16135a49319O4955K5327P274l7515m4471K6937R2493N3363l7114k2210K7553M5385
16123E2658l8626P392P5502Q733j08817k9287R5794O9021n6955o9073m1288J6313
16111a8633k8395j2051P3089J5831j7653k9725l9793L4530J9337k1373k1077N4115
16099H202N2755k7297m1969j9762o8612l9554j8492M3335O7739O735K2371L0106
16087A5557K4349J012O2844p1218j52928l0710J1881O1063Q658j1611L2909K7312
16075b0882N2866L9391j1879J3552p4813P4017o859r1888n0521O097K1485J8890
16063c0544o227J9926J1955j5214o856Q888m1998o1650k1733N4905M6716J2294
$$ plain form
16051 -29538 465 36954 37223 59681 70916 61908 34272 18409 13233 14658 -4510 -59997 -135473
16038 -135473 -92064 -76393 -77203 -61865 -73179 -73963 -87573 -105345 -102467 -81612 -92343 -70531
16026 -70531 -7203 6664 20018 14930 -25848 -42460 -6393 -22639 -75368 -24459 -22232 -66055
16014 -66055 -25677 -26906 -50704 -134691 -129242 -137040 -155273 -57642 19160 39672 5798 5893 30542
16001 30542 63135 73169 89890 23972 -64986 -75664 -62733 -61467 -46095 -67021 -81142 -77409
15989 -77409 -49799 -5733 39414 39954 -60132 -89873 -74835 -88388 -74845 -114807 -91571 -28914
15977 -28914 -92909 -105602 -71446 -19008 -45724 -82172 -108713 -113968 -64500 4946 -11344 4967
15965 4967 22753 -43054 -21659 -22649 18864 107248 68974 18943 7037 18401 -877 -91325
$$ packed form
16051b9538L0003L6489K69K2458J1235r008k7636j5863n176J425j9168n5487p5476
16038a35473M3409J5671q10J5338j1314p84j3610j7772K878K0855j0731K1812
16026g0531O3328J3867J3354n088m0778j6612L6067j6246n2729N0909K227m3823
16014f6055M0378j229k3798q3987N449p798j8233R7631P6802K0512l3874R5K4649
16001C0542L2593J0034J6721o5918q8958j0678J2931J266J5372k0926j4121L733
15989g7409K7610M4066M5147N40j00086k9741J5038j3553J3543l9962K3236O2657
15977b8914o3995j2693L4156N2438k6716l6448k6541n255M9468O9446j6290J6311
15965D967J7786o5807K1395r90M1513Q8384l8274n0031j1906J1364j9278r0448
$$ plain form
15953 -91325 -97765 -56043 -18147 16277 73688 138814 170933 84471 -18651 -85803 -50705 -111119
15941 -111119 -146079 -89885 -25805 -33189 -26911 -11975 3688 -15017 -45299 -48140 4709 -11831
15929 -11831 57460 70481 10162 -62166 -11938 46234 77036 38605 25814 31730 23928 85537
15917 85537 57817 50665 55819 27666 3144 -54961 -56608 7271 27144 65823 25871 45834
15905 45834 41358 -13067 -8053 54791 30730 27038 4641 -24929 -833 -34414 -91308 -143625
15893 -143625 -176411 -166834 -127554 -102370 -74242 -76207 -85370 -111749 -144780 -137907 -127671 -86279
15881 -86279 -69502 -41793 -48384 -97831 -122264 -94949 -84181 -101513 -65670 -47165 -33390 -22745
15869 -22745 -44728 -65573 -45130 -39871 -19439 95301 99023 -11955 -92360 -72653 -57154 -48026
$$ packed form
15953i1325o440M1722L7896L4424N7411O5126L2119q6462j03122o7152L5098o0414
15941a11119l4960N6194O4080p384O278J4936J5663j8705l0282k841N2849j6540
15929a1831O9291J3021o0319p2328N0228N8172L0802l8431j2791N916p802O1609
15917H5537k7720p152N154k8153k4522n8105j647O3879J9873L8679l9952J9963
15905D5834m476n4425N014O2844k4061l692k2397k9570K4096l3581n6894n2317
15893a43625l2786R577L9280K5184K8128j965r163k6379l3031O873J0236M1392
15881h6279J6777K7709o591m9447k4433K7315J0768j7332L5843J8505J3775J0645
15869b2745k1983k0845K0443N259K0432J14740L722j10978q0405J9707J5499R128
$$ plain form
15857 -48026 13471 42204 -43785 -107417 -104284 -127445 -120729 -110009 -92017 -54343 -107368 -126749
15845 -126749 -80226 47342 7857 -36749 -41798 -15123 -52467 -10638 -17243 -51661 -75886 -93805
15833 -93805 -98239 -81056 -40888 -13823 26524 63189 12898 2764 -10179 -92342 -55103 -52470
15821 -52470 -65843 -61754 -12240 19292 -12748 -37364 -25432 -59018 -74261 -106541 -112247 -58375
15809 -58375 -11607 2292 -50954 -86531 -69899 -6457 2262 -23321 27964 12001 -39702 -45332
15797 -45332 -45306 -90475 -87871 -25324 -61725 -18703 38792 -11007 -53827 -143188 -116455 -62220
15785 -62220 -36914 -35936 -13361 -6890 37249 38296 35073 11250 -20494 9981 32712 36741 18085
15772 18085 -18216 -1381 23103 24729 17248 11782 64701 68640 17662 -11827 -70935 -105482
$$ packed form
15857d8026O1497K8733q5989o3632L133k3161O716J0720J7992L7674n3025j9381
15845a26749M6523J27568l9485m4606n049K6675l7344M1829o605l4418k4225j7919
15833i3805m434J7183M0168K7065M0347L6665n0291j0134j2943q2163L7239K633
15821e2470j3373M089M9514L1532l2040k4616J1932l3586j5243l2280n706N3872
15809e8375M6768J3899n3246l5577J6632O3442Q719k5583N1285j5963n1703n630
15797d5332K6m5169K604O2547l6401M3022N7495m9799m2820q9361K6733N4235
15785f2220K5306R78K2575O471M4139J047l223k3823l1744L0475K2731M029j8656
15772A8085l6301J6835K4484J626p481n466N2919L939n0978k9489n9108l4547
$$ plain form
15760 -105482 -107137 -83924 -69482 -20313 7710 16468 -7406 60413 79505 20550 -60091 -106318
15748 -106318 -109047 -34009 3914 50821 72933 48450 -9161 54114 50440 502 -8242 -8293 -69717
15735 -69717 -95249 -117866 -70138 -19568 18911 11149 -9564 -26571 -20204 50009 84023 77169
15723 77169 130038 80988 11120 -49148 -51555 -18083 -47847 -55944 -45246 -6480 74935 30929
15711 30929 64852 45153 46556 62609 53969 62932 72798 108148 97621 -29416 -170480 -144039
15699 -144039 -139245 -121588 -77250 -98544 -143036 -125328 -74574 -75089 -28825 -5684 -29982 -49813
15687 -49813 22963 55969 15153 -19167 -16917 -19714 -50191 -28899 30908 5185 -91970 -137658
15675 -137658 -55269 37302 -25335 -50547 -94129 -19182 22373 39234 56489 85875 76950 -45723
$$ packed form
15760a05482j655K3213J4442M9169K8023Q758k3874O7819J9092n8955q0641m6227
15748a06318k729P5038L7923M6907K2112k4483n7611O3275l674m9938q744n1o1424
15735f9717k5532k2617M7728N0570L8479p762k0713j7007O367P0213L4014o854
15723G7169N2869m9050o9868o0268k407L3472k9764q097J0698L8766Q1415m4006
15711C0929L3923j9699J403J6053q640Q963R866L5350j0527j27037j41064K6441
15699a44039M794J7657M4338k1294m4492J7708N0754n15M6264K3141k4298j9831
15687d9813P2776L3006m0816l4320K250k797l0477K1292N9807k5723r7155m5688
15675a37658Q2389R2571o2637k5212m3582P4947M1555J6861J7255K9386q925j22673
$$ plain form
15663 -45723 -79309 -5227 67601 132147 72402 9749 -35890 -98314 -110778 -78660 -58000 -66941
15651 -66941 -76308 -130068 -62531 -43316 -42473 -26007 15734 35258 4118 140 -47745 -39632 -21528
15638 -21528 -32866 -25726 18188 78449 23567 27826 32677 -1213 -21157 -52377 -95167 504
15626 504 -2511 -14167 25023 16495 -31313 -77832 -86508 -85782 -40796 -48069 -104237 -81420 -75127
15613 -75127 -94601 -88959 -75116 -120495 -142025 -142520 -136974 -122485 -67558 -90885 -79147 -72431 -128048
15600 -128048 -97739 -87296 -102704 -36647 41341 -16081 -14594 -31654 -75745 -61834 -72080 -100225
15588 -100225 -65870 -67291 -169536 -152485 -117107 -119475 -65263 -52829 -48190 -64721 -60224 -8062
15576 -8062 -962 -37085 -68584 15144 65791 70424 39758 12173 21852 7548 -61610 -130919
$$ packed form
15663d5723l3586P4082P2828O4546n9745o2653m5639o2424j2464L2118K0660q941
15651f6941r367n3760O7537J9215Q43J6466M1741J9524l1140l978m7885Q113J8104
15638b1528j1338P140M3914O0261n4882M259M851l3890j9944l1220m2790R5671
15626E04l015j1656L9190q528m7808m6519q676P26M4986p273n6168K2817O293
15613g5127j9474N642J3843m5379k1530m95N546J4489N4927k3327J1738O716n5617
15600a28048L0309J0443j5408O6057P7988n7422J487j7060m4091J3911j0246k8145
15588a00225L4355j421j02245J7051L5378k368N4212J2434M639j6531M497N2162
15576h062P100l6123l1499Q3728N0647M633l0666k7585R679j4304o9158o9309
$$ plain form
15564 -130919 -94689 -83897 -78453 -38842 23678 56035 11153 -28107 -56935 -104517 -98896 -36575
15552 -36575 16467 -85 -47942 -36503 29766 54057 67960 104380 31606 8236 7608 -36029
15540 -36029 2172 12618 -45228 -58559 -70961 -74671 -70730 -34494 -74717 -66131 8835 59930
15528 59930 59828 13608 -30630 31722 37335 -1087 -9989 -2712 -21822 4752 34967 17099 -8841
15515 -8841 -36900 -67353 -57119 -9970 -7283 -39156 -52588 -54316 -27863 -73425 -155752 -143448
15503 -143448 -124648 -179274 -120261 -26687 -78136 -90567 -42811 18948 -37100 -83484 -34889
15492 -34889 -4369 -55152 -59335 9332 89505 148590 61228 7389 -49787 -92383 -99059 -55253
15480 -55253 -18108 13503 -8693 12575 -36689 -48210 9853 4285 17736 96034 66626 20220
$$ packed form
15564a30919L6230J0792N444L9611O2520L2357m4882l9260k8828m7582N621O2321
15552c6575N3042j6552m7857J1439O6269K4291J3903L6420p2774k3370o28m3637
15540c6029L8201J0446n7846j3331j2402l710L941L6236m0223Q586P4966N1095
15528E9930j02m6220m4238O2352N613l8422q902P277j9110K6574L0215j7868k5940
15515h841k8059l0453J0234M7149K687l1873j3432j728K6453m5562q2327J2304
15503a43448J8800n4626N9013R3574n1449j2431M7756O1759n6048m6384M8595
15492c4889L0520n0783m183O8667Q0173N9085q7362n3839n7176m2596o676M3806
15480e5253L7145L1611k2196K1268m9264j1521N8063n568J3451P8298k9408m6406
$$ plain form
15468 20220 31431 13880 -56301 -31988 -792 -16071 17007 57014 91909 65132 39031 -5858
15456 -5858 -40972 -88158 -105159 -114073 -58433 -46634 -61197 -38109 -11072 13281 -40029 -35677
15444 -35677 -32981 -34537 -52085 4423 67217 15796 -25935 9127 -45468 -26385 -28736 -86446
15432 -86446 -65171 -26767 9758 15746 -2287 -8756 -85884 -155038 -89798 -12563 -1092 -1651
15420 -1651 -25966 -79714 -95149 -102944 -133210 -116588 -35980 -31305 -86521 -137003 -179362 -184605
15408 -184605 -150947 -71318 6236 -30078 -21978 -79699 -64195 13998 9780 -38781 -65948 -14081
15396 -14081 13593 10815 44798 52073 -4882 -29277 -59419 -43925 -72548 -70553 -62576 -84396
15384 -84396 -41612 -12441 30487 -4448 -15989 -74847 -110452 -117308 -70845 -57495 -81174 -69753
$$ packed form
15468B0220J1211j7551p0181K4313L1196j5279L3078M0007L4895k6777k6101m4889
15456e858l5114m7186j7001q914N5640J1799j4563K3088K7037K4353n3310M352
15444c5677K696j556j7548N6508O2794n1421m1731L5062n4595J9083k351n7710
15432h6446K1275L8404L6525N988j8033o469p7128o9154O5240P7235J1471n59
15420a651k4315n3748j5435p795l0266J6622Q0608M675n5216n0482m2359n243
15408a84605L3658P9629P7554l6314Q100n7721J5504P8193m218m8561k7167N1867
15396a4081K7674k778L3983P275n6955k4395l0142J5494k8623J995P977k1820
15384h4396M2784K9171M2928l4935j1541n8858l5605o856M6463J3350k3679J1421
$$ plain form
15372 -69753 -38390 -66473 -71994 -12701 33597 -18730 -103288 -73442 -47016 -70621 -74484 -76383
15360 -76383 -5853 47032 18374 35737 54984 98322 73669 58506 49019 26547 21145 10090
15348 10090 -48462 -160860 -152074 -91524 -61942 -61534 -34177 23677 56918 9508 -39463 -80601
15336 -80601 -127515 -177168 -108249 -93417 -85117 -61847 -62329 -46943 30397 51598 6917 -28653
15324 -28653 -24101 28140 42746 45370 14742 -70953 -82050 -64439 -43024 -12204 -26573 -62211
15312 -62211 -51144 -55068 -49940 -108034 -67221 -50358 -51522 -88453 -21376 -11865 -15626 4050 34580
15299 34580 6066 -49097 740 56245 28083 -20764 -41030 -42931 -55662 -19873 -24565 -55197
15287 -55197 18193 64623 84741 114551 109429 99015 101883 42507 16681 -27329 -54364 -44314
$$ packed form
15372f9753L1363k8083n521N9293M6298n2327q4558K9846K6426k3605l863j899
15360g6383P0530N2885k8658J7363J9247M3338k4653j5163r487k2472n402j1055
15348A0090n8552j12398Q786O0550K9582M08K7357N7854L3241m7410m8971m1138
15336h0601m6914m9653O8919J4832Q300K3270m82J5386P7340K1201m4681l5570
15324b8653M552N2241J4606K624l0628q5695j1097J7611K1415L0820j4369l5638
15312f2211J1067l924N128n8094M0813J6863j164l6931O7077R511l761J9676L0530
15299C4580k8514n5163M9837N5505k8162m8847k0266j901j2731L5789m692l0632
15287e5197P3390M6430K0118K9810n122j0414K868n9376k5826m4010k7035J0050
$$ plain form
15275 -44314 -63350 -20760 18156 29018 13059 707 73937 25223 -42664 -18083 18447 107793
15263 107793 152719 111203 62747 1581 -69333 -52503 -7429 12602 -9382 -37420 -99410
15252 -99410 -122282 -73999 -31471 -48829 -76817 -66502 -30733 55803 27961 -17000 -22907 -30942
15240 -30942 -34396 -52891 -46056 -23525 -27316 -10560 -26689 -97339 -122030 -133352 -10329 27314
15228 27314 38989 22706 -19343 -48498 -30242 27866 69528 -22647 -33519 -7962 -40193 9604
15216 9604 32655 -46673 -47817 20873 68680 21075 9047 -4395 27837 48481 39155 13964
15204 13964 -19880 -57848 -11168 34981 69766 21326 -8680 18844 -24777 -79064 -60815 -31246
15192 -31246 6017 -16435 -66990 -62604 -56416 -59300 -82618 -64471 -50864 -27554 -88617 -113150
$$ packed form
15275d4314j9036M2590L8916J0862j5959j2352P3230m8714o7887K4581L6530Q9346
15263A07793M4926m1516m8456o1166p0914J6830M5074K0031k1984k8038o1990
15252i9410k2872M8283M2528j7358k7988J0315L5769Q6536k7842m4961n907q035
15240c0942l454j8495O835K2531l791J6756j6129p0650k4691j1322J23023L7643
15228B7314J1675j6283m2049k9155J8256N8108M1662r2175j0872K5557l2231M9797
15216I604K3051p9328j144O8690M7807m7605j2028j3442L2232K0644r326k5191
15204A3964l3844l7968M6680M6149L4785m8440l0006K7524m3621n4287J8249K9569
15192c1246L7263k2452n0555M386O188k884k3318J8147J3607K3310o1063k4533
$$ plain form
15180 -113150 -73106 -46660 -24080 -58462 -79168 -107385 -115186 -153544 -176833 -148913 -63440 -15259
15168 -15259 -33374 -21028 -49983 -22846 -23720 -99300 -103033 -23843 65438 79808 59752 62154
15156 62154 18250 -25859 -70828 -22781 38505 14727 61371 92399 111038 92832 35177 38037
15144 38037 48705 21591 13824 24026 28659 77019 54766 26305 70243 40366 -15417 8538
15132 8538 3238 -39790 -19499 -12794 2224 66327 38016 -14662 -3780 21758 80536 107013
15120 107013 73010 77667 113354 43417 -27237 -58469 -21988 4360 20944 -38731 47881 150597
15108 150597 90353 17937 283 -21904 -1798 2571 -58509 -81502 -81793 -113 -39723 -108146
15096 -108146 -61098 14669 47066 28911 -42386 -77784 -86894 -119205 -108785 -57484 -48987 -15818
$$ packed form
15180a13150M0044K6446K2580l4382k0706k8217p801l8358k3289K7920Q5473M8181
15168a5259j8115J2346k8955K7137q74p5580l733P9190Q9281J4370k0056K402
15156F2154m3904m4109m4969M8047O1286k3778M6644L1028J8639j8206n7655K860
15144C8037J0668k7114p767J0202M633M8360k2253k8461M3938k9877n5783K3955
15132H538n300m3028K0291O705J5018O4103k8311n2678J0882K5538N8778K6477
15120A07013l4003M657L5687o9937p0654l1232L6481K6348J6584n9675Q6612J02716
15108A50597o0244p2416j7654k2187K0106M369o1080k2993k91Q1680l9610o8423
15096a08146M7048P5767L2397j8155p1297l5398r110l2311J0420N1301Q497L3169
$$ plain form
15084 -15818 7806 21485 29881 -19664 -60078 -97999 -60615 -41065 -79943 -96406 -23622 27101
15072 27101 33272 12250 -46241 -73842 -62583 -68842 -9589 36473 5272 -19901 -62619 -119623
15060 -119623 -84238 -32084 -40161 -138409 -98344 -56637 -39573 19862 41404 21744 -74018 -65329
15048 -65329 -33060 -29495 -30787 -3595 -10772 43509 54654 5723 -51618 13763 32658 67415
15036 67415 48509 58263 -12212 -64125 -75754 2115 757 -15318 -34311 -57626 -62655 -66591
15024 -66591 -69329 -34878 -33493 27142 66748 25510 -19889 -84839 -102724 -66789 -75841 -136303
15012 -136303 -117828 -11734 12058 -53072 -163691 -187361 -159964 -111950 -73257 -57508 -38090
15001 -38090 -51612 -86047 -59965 9428 30897 57418 62094 43677 -2574 -99995 -142988 -147454
$$ packed form
15084a5818K3624J3679Q396m9545m0414l7921L7384J9550l8878j6463P2784N0723
15072B7101O171k1022n8491k7601J1259o259N9253M6062l1201k5173m2718n7004
15060a19623L5385N2154q077r8248M0065M1707J7064N9435K1542j9660r5762Q689
15048f5329L2269L565j292K7192p177N4281J1145m8931n7341O5381J8895L4757
15036F7415j8906R754p0475n1913j1629P7869j358j6075j8993k3315n029l936
15024f6591k738L4451J385O0635L9606m1238m5399o4950j7885L5935r052o0462
15012a36303J8475J06094K3792o5130j10619k3670K7397M8014L8693J5749J9418
15001c8090j3522l4435K6082O9393K1469K6521M676j8417m6251r7421m2993m466
$$ plain form
14989 -147454 -99366 -47235 -65916 -67900 474 28890 23149 602 -70431 -133639 -136515 -122297
14977 -122297 -89288 -87123 -43734 16394 63371 58091 99226 57587 29486 -50650 -143191 -127350
14965 -127350 -58386 -34444 20050 8064 -14722 -9304 -31211 -37694 -5574 34007 34957 23986
14953 23986 -10375 25220 56830 15231 12884 3343 -22342 25133 9673 -52288 -73054 -36721
14941 -36721 63354 70509 122505 131940 45630 -749 -10453 63577 74296 23783 -22180 513
14929 513 -27131 -49458 18973 39123 107478 36379 -66110 -124844 -142351 -93877 -71380 -83833
14917 -83833 -144362 -143897 -101040 -89991 -97339 -83092 -26482 24394 18371 22234 71932 51948 14912
14904 14912 -2857 25123 77527 62988 42510 36820 33481 5008 27706 9482 3083 -39883
$$ packed form
14989a47454M8088N2131j8681j984O8374K8416n741k2547p1033o3208k876J4218
14977a22297L3009K165M3389O0128M6977n280M1135m1639k8101q0136r2541J5841
14965a27350O8964K3942N4494j1986k2786N418k1907o483L2120L9581R50j0971
14953B3986l4361L5595L1610m1599k347r541k5685M7475j5460o1961k0766L6333
14941c6721J00075P155N1996R435q6310m6379r704P4030J0719n0513m5963K2693
14929E13k7644k2327O8431K0150O8355p1099j02489n8734j7507M8474K2497j2453
14917h3833o0529M65M2857J1049p348J4247N6610N0876o023L863M9698j9984l7036
14904A4912j7769K7980N2404j4539k0478n690l339k8473K2698j8224o399m2966
$$ plain form
14892 -39883 -37489 -72845 -111388 -48711 5777 33180 33660 4713 11399 30954 49688 64671
14880 64671 17090 -69994 -14847 -49977 -131076 -157624 -63355 1034 17667 49560 57762 79316
14868 79316 78239 2563 -97198 -85659 -31235 15584 45676 42369 34124 -6632 -24531 -37694
14856 -37694 -37224 -35009 -18712 -29905 -2937 -30471 10829 40325 5945 -26117 57869 70360
14844 70360 35534 15232 27690 -62209 -73891 -102311 -81953 -37944 -29490 -63608 -42824 2500
14832 2500 37093 19161 -10804 8983 -28952 -50087 -27038 26886 24888 -30589 -45563 -23170
14820 -23170 18461 38734 -68845 -48525 21242 -4209 -37277 -1010 -37279 -55228 -37921
14809 -37921 -47062 -46163 -108319 -44948 9821 -29289 -32281 15324 30389 20336 28341 17411 11917
$$ packed form
14892c9883K394l5356l8543O2677N4488K7403M80k8947O686J9555J8734J4983
14880F4671m7581q7084N5147l5130q1099k6548R4269O4389J6633L1893Q202K1554
14868G9316j077p5676r9761J1539N4424M6819L0092l307q245m0756j7899j3163
14856c7694M70K215J6297j1193K6968k7534M1300K9496l4380l2062Q3986J2491
14844G0360l4826k0302J2458q9899j1682k8420K0358M4009Q454l4118K0784M5324
14832B500L4593j7932k9965J9787l7935k1135K3049N3924j998n5477j4974K2393
14820b3170M1631K0273j07579K0320O9767k5451l3068L6267l6269j7949J7307
14809c7921r141Q99o2156O3371N4769l9110k992M7605J5065j0053Q005j0930n494
$$ plain form
14796 11917 88635 100865 81054 81261 29448 -29646 -35309 -1964 5794 -30227 -63424 -78447
14784 -78447 -94562 -84635 567 127840 108377 111846 65594 47440 41369 55891 -807 -66476
14772 -66476 -81549 -15973 34641 -2921 -12850 56497 41684 -11986 -64887 -120555 -102627 -51513
14760 -51513 -13734 8432 39543 22744 -73984 -52339 -37179 -47759 -38463 -24946 -13333 -18580
14748 -18580 -17113 -399 -34362 -41970 -23116 -77326 -44486 13871 -52771 -128312 -68207 13971
14736 13971 51000 -21403 1264 83154 148636 105403 52199 -9634 -54908 -56905 14706 32015
14724 32015 219 15652 19784 -2549 -6532 -61020 -109880 -108564 -85595 -35536 -30319 -32882 -38228
14711 -38228 -22393 -40025 -62412 -122907 -135424 -60204 -2993 8820 -25697 -44765 817 26201
$$ packed form
14796A1917P6718J2230j9811K07n1813n9094n663L3345P758l6021l3197j5023
14784g8447j6115R927Q5202J27273j9463L469m6252j8154o071J4522n6698o5669
14772f6476j5073O5576N0614l7562r929O9347j4813n3670n2901n5668J7928N1114
14760e1513L7779K2166L1111j6799r6728K1645J5160j0580R296J3517J1613n247
14748a8580J467J6714l3963p608J8854n4210L2840N8357o6642p5541O0105Q2178
14736A3971L7029p2403K2667Q1890O5482m3233n3204o1833m5274j997P1611J7309
14724C2015l1796J5433M132k2333l983n4488m8860J316K2969N0059N217k563n346
14711c8228J5835j7632k2387o0495j2517P5220N7211J1813l4517j9068M5582K5384
$$ plain form
14699 26201 63956 47502 85006 140370 72991 -24293 -97833 -98646 -102672 -72833 24954 90331
14687 90331 107921 132934 88858 51078 16938 -32067 38846 56713 19809 -25071 22584 -13173
14675 -13173 -56447 -40218 -35738 -71160 -81082 -43537 -59350 -102668 -72910 -65141 -100635 -149019
14663 -149019 -148248 -113623 -55094 7673 11187 13254 -44598 -97191 -27836 -19026 7965 -7214
14651 -7214 -57991 -27625 -64359 -120275 -168041 -109126 -78733 -79906 -117814 -104963 -137876 -186826
14639 -186826 -178125 -202812 -163179 -72817 67141 126980 152963 199311 184441 67571 -31858
14628 -31858 -86622 -36110 -6207 -25051 -24000 -17741 5180 42123 85069 33855 -30522 -20700
14616 -20700 -36178 -19466 -43629 431 41771 27476 42976 -6484 38474 -21951 -86212 -60917
$$ packed form
14699B6201L7755j6454L7504N5364o7379r7284p3540q13m026K9839R7787O5377
14687I0331J7590K5013m4076l7780l4140m9005P0913J7867l6904m4880M7655l5757
14675a3173m3274J6229M480l5422r922L7545j5813m3318K9758P769l5494m8384
14663a49019P71L4625N8529O2767L514K067n7852n2593O9355Q810K6991j5179
14651g214n0777L0366l6734n5916m7766N8915L0393j173l7908J2851l2913m8950
14639a86826Q701k4687L9633R0362J39958N9839K5983M6348j4870j16870r9429
14628c1858n4764N0512K9903j8844J051O259K2921L6943M2946n1214o4377R822
14616b0700j5478J6712k4163M4060M1340j4295J5500m9460M4958o0425o4261K5295
$$ plain form
14604 -60917 -32121 30865 65372 26099 50239 -9506 -7841 24415 65427 48164 62724 58512
14592 58512 -20888 4579 26287 39200 50220 18445 11269 -43720 -63434 -76554 -67190 -1085
14580 -1085 -10455 -6616 -44834 -60846 -67376 -85906 -57975 -40815 14151 -15775 -88530 -58236
14568 -58236 5202 7750 -32833 -19088 -32883 -47715 -66799 -37300 -27346 14649 19592 4178
14556 4178 -28011 9354 33976 31986 -33224 -69406 23364 120317 79478 44190 42215 -25988
14544 -25988 -30325 16020 10974 1452 -14280 -54935 -51658 -18951 33607 18518 -76256 -94472
14532 -94472 -67857 -65259 -61217 -69083 -82366 -109495 -66679 1469 -16349 -34672 -43850 -16883
14520 -16883 53181 86627 71823 20062 -7159 -20983 -67220 -119248 -104003 -28460 -23993 -37512
$$ packed form
14604f0917K8796O2986L4507l9273K4140n9745J665L2256M1012j7263J4560m212
14592E8512p9400K5467K1708J2913J1020l1775p176n4989j9714j3120R364O6105
14580a085r370L839l8218j6012o530j8530K7931J7160N4966k9926p2755L0294
14568e8236O3438K548m0583J3745j3795j4832j9084K9499R954M1995M943j5414
14556D178l2189L7365K4622j990o5210l6182R2770R6953m0839l5288j975o8203
14544b5988m337M6345n046r522j5732m0655L277L2707N2558j5089r4774j8216
14532i4472K6615K598M042p866j3283k7129M2816O8148j7818j8323r178K6967
14520a6883P0064L3446j4804n1761k7221j3824m6237n2028J5245P5543M467j3519
$$ plain form
14508 -37512 -49180 -1724 -30886 -61165 -30394 41445 66364 34286 -33286 -67008 -49402 -46041
14496 -46041 -69747 -93621 -59734 26321 100826 101042 33043 -6527 -27980 -89655 -119651 -93956
14484 -93956 -1744 -34967 -38445 -11082 43526 68321 9182 9144 23295 26611 15696 -4519 28900
14471 28900 8371 55842 95666 30753 -13794 -9821 -4291 28431 -7506 -21547 21127 4122
14459 4122 -54177 -80345 -73242 -51617 -71763 -32453 44716 48203 13981 17440 -16896 -26440 -58572
14446 -58572 -33617 19681 -9935 -31817 -44243 -91842 -92851 -50654 -20967 -23551 7500 94278
14434 94278 109494 117545 98893 48191 47912 76359 103434 78678 49697 77984 25125 -29456
14422 -29456 -66918 -27846 16510 -16196 -67058 -62854 -48831 -87756 -76405 -142369 -136202 -91171
$$ packed form
14508c7512j1668M7456k9162l0279L0771P1839K4919l2078o7572l3722J7606L361
14496d6041k3706k3874L3887Q6055P4505K16o7999l9570k1453o1675k9996K5695
14484i3956R2212l3223l478K7363N4608K4795n9139l8J4151L316j0915k0215L3419
14471B8900k0529M7471L9824o4913m4547L973N530L2722l5937j4041M2674j7005
14459D122n8299k6168P103K1625k0146L9310P7169L487l4222L459l4336r544l2132
14446e8572K4955N3298k9616k1882j2426m7599j009M2197K9687k584L1051Q6778
14434I4278J5216Q051j8652n0702k79K8447K7075k4756k8981K8287n2859n4581
14422b9456l7462L9072M4356l2706n0862M204J4023l8925J1351o5964O167M5031
$$ plain form
14410 -91171 2843 36123 70904 33435 11928 -165 -26726 -23084 -23782 -22135 -27610 29843 65714
14397 65714 43293 -41022 -120668 -120039 -70942 -12666 23341 -7560 13038 16623 456 26128
14385 26128 2242 18445 -39332 -24424 -44911 -54067 -74220 -44370 -69976 -60082 -29352 -43339
14373 -43339 -49484 17249 9638 -44785 -32197 -3280 -30886 -90716 -84319 -69506 -98725 -68501
14361 -68501 -27496 -62962 6243 89926 64706 56938 -12962 -21812 13796 20094 48633 91305
14349 91305 31107 37004 37488 35049 98008 78555 113177 37129 -52129 -995 31728 -37759
14337 -37759 -55178 -103758 -97713 -15839 -33008 -79957 -24649 -9690 36599 65515 14599 4226
14325 4226 -60737 -54044 1835 50576 72382 72258 55568 12987 6014 -2683 -5397 -39297 -32973
$$ packed form
14410i1171R4014L3280L4781l7469k1507j2093k6561L642o98J647n475N7453L5871
14397F5714k2421q4315p9646O29M9097N8276L6007l0901K0598L585j6167K5672
14385B6128k3886J6203n7777J4908k0487r156k0153K9850k5606R894L0730j3987
14373d3339o145O6733p611n4423J2588K8917k7606n9830O397J4813k9219L0224
14361f8501M1005l5466O9205Q3683k5220p768o9900q850L5608O298K8539M2672
14349I1305o0198N897M84k439O2959j9453L4622p6048q9258N1134L2723o9487
14337c7759j7419m8580O045Q1874j7169m6949N5308J4959M6289K8916n0916j0373
14325D226o4963O693N5879M8741K1806j24j6690m2581o973q697k714l3900O324
$$ plain form
14312 -32973 -62272 -24382 -1783 -30382 -76307 -90133 -87105 -75216 -56525 13996 98012 74760
14300 74760 35925 55651 35764 30008 8597 34091 67333 82284 73865 39904 14307 69916
14288 69916 94811 97539 115619 109072 87892 34680 -1786 9217 11026 29239 54522 46374
14276 46374 50969 -12461 -13449 7791 -33901 -65224 -7554 47956 83437 84281 67271 39311 8399
14263 8399 34553 38206 57434 20349 -18932 -48221 -92562 -104613 -134966 -95652 -46340 -81445
14251 -81445 -84513 -115143 -3006 38335 78981 102365 30999 -14763 -44439 25778 52456 65260
14239 65260 83395 46493 -25651 -24111 27434 29995 56144 8302 -35229 -87336 -43719 -55721
14227 -55721 -59880 -23767 -9633 20186 78966 79167 44946 58758 101533 104448 87103 104408
$$ packed form
14312c2973k9299L7890K2599k8599m5925j3826L028J1889J8691P0521Q4016k3252
14300G4760l8835J9726j9887n756k1411K5494L3242J4951q419l3961k5597N5609
14288F9916K4895K728J8080o547k1180n3212l6466J1003J809J8213K5283q148
14276D6374M595o3430r88K1240m1692l1323N7670N5510L5481Q44j7010k7960l0912
14263H399K6154L653J9228l7085l9281k9289m4341j2051l0353L9314M9312l5105
14251h1445l068l0630J12137M1341M0646K3384p1366m5762k9676P0217K6678J2804
14239F5260J8135l6902p2144J540N1545K561K6149m7842m3531n2107M3617j2002
14227e5721m159L6113J4134K9819N8780K01l4221J3812M2775K915j7345J7305
$$ plain form
14215 104408 59196 -8569 -7146 -5964 -12522 -42925 -119466 -66976 -1075 -25388 -79316 -92808
14203 -92808 -169692 -197670 -153970 -129025 -86916 -24326 -6306 11429 27142 37466 15265 -229
14191 -229 22641 43438 84255 98658 106968 38623 -51463 -43313 5204 32249 33141 24202 -4624
14178 -4624 10681 -8268 -27819 -58512 -104681 -81342 -54817 -64772 -53138 -55660 -24685 25283
14166 25283 -19683 -15063 -5618 -23141 23569 59647 42919 61419 72583 71914 69768 11688 5497
14153 5497 -5616 6741 7608 -1903 -47494 -41782 41479 18804 23628 9815 33504 30756 63872
14140 63872 62414 29858 26073 24179 3360 -26666 -39903 3571 18536 49081 41499 35561 49576
14127 49576 45711 41559 94925 59308 28368 64671 87424 114709 43791 6831 11592 6937
$$ packed form
14215A04408m5212o7765J423J182o558l0403p6541N2490O5901k4313n3928j3492
14203i2808p6884k7978M3700K4945M2109O2590J8020J7735J5713J0324k2201j5494
14191b29K2870K0797M0817J4403Q310o8345r0086Q150M8517K7045Q92q939k8826
14178d624J5305j8949j9551l0693m6169K3339K6525r955J1634k522L0975M9968
14166B5283m4966M620R445j7523M6710L6078j6728J8500J1164o69k146n8080o191
14153E497j1113J2357Q67r511m5591N712Q3261k2675M824j3813K3689k748L3116
14140F3872j458l2556l785j894k0819l0026j3237M3474J4965L0545p582n938J4015
14127D9576l865m152N3366l5617l0940L6303K2753K7285p0918l6960M761m655
$$ plain form
14115 6937 32307 2465 23345 19587 9137 -19944 -67269 -104655 -100169 -62256 -42567 -25105
14103 -25105 28915 68467 102657 44936 7156 8750 11413 -8595 -54317 -77632 -33637 78107
14091 78107 101814 59172 -9734 -10589 -21214 28152 9816 -18967 -75756 -21609 -683 -20789
14079 -20789 2944 2071 -22625 -18100 -6250 -4414 -36261 -100751 -118617 -32058 22352 13118 68321
14066 68321 58383 84750 38537 21837 -13519 -33262 -556 28495 -817 24206 28014 -3716
14054 -3716 -51668 -20829 10713 3634 -73005 -83543 -71321 -23749 -3298 11333 26411 36693
14042 36693 72722 28583 29362 -6004 -82957 -112361 -25701 -11965 -13722 -19324 -35868 -53244
14030 -53244 -58095 -54029 -73145 -67547 -18470 -46137 -38619 -24103 32990 42652 34943 13699 19027
$$ packed form
14115F937K5370k9842K0880l758j0450k9081m7325l7386M486L7913J9689J7462
14103b5105N4020L9552L4190n7721l7780J594K663k0008m5722k3315M3995J11744
14091G8107K3707m2642o8906q55j0625M9366j8336k8783n6789N4147K0926k0106
14079b0789K3733q73k4696M525J1850J836l1847o4490j7866Q6559N4410r234N5203
14066F8321r938K6367m6213j6700l5356j9743L2706K9051k9312K5023L808l1730
14054c716m7952L0839L1542p079p6639j0538J2222M7572K0451J4631J5078J0282
14042C6693L6029m4139P79l5366p6953k9404Q6660J3736j757n602j6544j7376
14030e3244m851M066j9116N598M9077k7667P518J4516N7093R662p709k1244N328
$$ plain form
14017 19027 12714 10400 -55463 -100782 -85657 -32772 -12592 10855 38033 27642 6669 -39731
14005 -39731 -53340 -41195 -47493 -33499 -25944 -79148 -72466 -64447 -89775 -90030 -84239 -19340 -13633
13992 -13633 -51289 -58569 -54482 -78324 -32697 -42480 -31107 -553 47731 57118 -57166 -71231
13980 -71231 -134598 -120277 -102247 -60350 -15245 -76430 -53698 21730 43838 66806 96282 79499
13968 79499 -22970 -50912 -47840 -56557 -1572 42515 -24369 -80726 -38678 -16230 -18860 -54453
13956 -54453 -69381 -88738 -126011 -105193 -75267 -21530 25452 -18375 -45724 -60789 -42071 -11244
13944 -11244 -63857 -29638 2525 11604 87125 86041 40543 -6160 -96148 -152911 -112001 -80329
13932 -80329 -44344 -64403 -67926 6538 78595 76774 104684 137796 155746 126744 78860 8041
$$ packed form
14017A9027o313k314o5863m5319J5125N2885K0180K3447K7178j0391k0973m6400
14005c9731j3609J2145o298J3994P555n3204O682Q019k5328k55N791O4899N707
13992a3633l7656p280M087k3842M5627r783J1373L0554M8284R387j14284j4065
13980g1231o3367J4321J8030M1897M5105o1185K2732P5428K2108K2968K9476j6783
13968G9499j02469k7942L072q717N4985M4087o6884n6357M2048K2448k630l5593
13956e4453j4928j9357l7273K0818K9926N3737M6982m3827k7349j5065J8718L0827
13944a1244n2613L4219L2163R079P5521j084m5498m6703q9988n6763M0910L1672
13932h0329L5985k0059l523P4464P2057j821K7910L3112J7950k9002m7884p0819
$$ plain form
13920 8041 34563 7241 -29748 -48906 -31013 -51907 -43417 -50913 -121280 -69206 -51016 14069
13908 14069 35223 26592 80411 97880 54619 -21994 -86116 -107869 -75007 -10002 2502 -26723
13896 -26723 -51698 -93615 -62527 -36500 -29542 -59594 -77352 -105135 -171741 -134514 -55741 -36239
13884 -36239 -4356 -1005 35368 125805 79726 20677 6721 -43269 -35527 280 31053 64959
13872 64959 47810 35473 -45063 -57448 -24149 -16685 5041 3761 -11352 36332 98436 79515
13860 79515 39760 -20480 -20671 -3574 -58251 -79870 -85959 -36210 -30452 -95207 -128175 -70726
13848 -70726 12103 54416 43000 35926 38445 52402 66143 45162 -33055 -45340 -95861 -79862
13836 -79862 -49121 -62954 -27453 8197 23329 70800 50170 75938 105519 102647 76634 31738
$$ packed form
13920H041K6522k7322l6989j9158J7893k0894Q490p496p0367N2074J8190O5085
13908A4069K1154q631N3819J7469m3261p6613o4122k1753L2862O5005J2504k9225
13896b6723k4975m1917L1088K6027O958l0052j7758k7783o6606L7227P8773J9502
13884c6239L1883L351L6373R0437m6079n9049j3956m9990P742L5807L0773L3906
13872F4959j7149j2337q0536j2385L3299P464K1726j280j5113M7684O2104j8921
13860G9515l9755o0240j91J7097n4677k1619o089M9749N758o4755l2968N7449
13848g0726Q2829M2313j1416p074K519J3957J3741k0981p8217j2285n0521J5999
13836g9862L0741j3833L5501L5650J5132M7471k0630K5768K9581k872k6013m4896
$$ plain form
13824 31738 74156 32246 -36301 -17507 26822 61499 68570 -10379 -49536 -28128 -89182 -128484
13812 -128484 -102719 -61212 -80523 -53741 -37924 -92650 -94610 8242 32997 38390 -7967 -40040
13800 -40040 -26070 -38296 -50780 -20715 4289 2597 -67327 -96659 -110183 -91410 -74453 -6310
13788 -6310 5335 -42094 -19487 58665 44900 -32434 -79557 -47045 -25741 -39467 -36447 -21586
13776 -21586 -16614 -31518 -26551 -6831 -21615 -7872 -12120 -26847 -20619 -49194 -133326 -143885
13764 -143885 -81566 -37151 -65353 -118424 -138037 -103811 3249 16331 -5720 16546 50156
13753 50156 55496 36747 41638 17685 28030 52109 8639 -35973 -28148 -19443 -36829 -43420 -14248
13740 -14248 38440 -1104 -47218 -83618 -87341 -19700 -8459 20612 -282 11017 38779 36910
$$ packed form
13824C1738M2418m1910o8547J8794M4329L4677P071p8949l9157K1408o1054l9302
13812a28484K5765M1507j9311K6782J5817n4726j960J02852K4755N393m6357l2073
13800d0040J3970j2226j2484L0065K5004j692o9924k9332j3524J8773J6957O8143
13788f310J1645m7429K2607P8152j3765p7334m7123L2512K1304j3726L020J4861
13776b1586M972j4904M967J9720j4784J3743m248j4727O228k8575q4132j0559
13764a43885O2319M4415k8202n3071j9613L4226J07060J3082k2051K2266L3610
13753E0156N340j8749M891k3953J0345K4079m3470m4612P825Q705j7386o591K9172
13740a4248N2688l9544m6114l6400l723O7641J1241K9071k0894J1299K7762j869
$$ plain form
13728 36910 -16553 -48827 -14833 30563 -4417 -1619 55607 32787 -31708 -50276 -24900 -18802
13716 -18802 -9357 -40724 -21172 -18666 8703 58534 78963 43889 -4614 36002 116840 125843
13704 125843 98280 131769 106370 89818 49538 52443 15382 50719 46169 40206 27968 1901
13692 1901 -56655 -71591 -95176 -102202 -107622 -76534 -42306 -21349 -71808 -82802 -132103 -150831
13680 -150831 -91227 -76922 -55938 -15580 41227 72544 58031 65708 62335 6156 -44489 -35452
13668 -35452 -31281 -7713 -33124 -78481 -92254 -85437 -60519 -9931 -2528 -16181 -56591 19870
13656 19870 66583 90941 77186 16126 -23526 -14910 -50839 -66348 -11481 57871 -33044 -108935
13644 -108935 -89511 -75750 -69218 -57104 -5502 -19925 -892 11947 13261 16372 -25799 -79549
$$ packed form
13728C6910n3463l2274L3994M5396l4980K798N7226k2820o4495j8568K5376O098
13716a8802R445l1367J9552K506K7369M9831K0429l5074m8503M0616Q0838R003
13704A25843k7563L3489k5399j6552m0280K905l7061L5337m550n963j2238k6067
13692A901n8556j4936k3585p026n420L1088L4228K0957n0459j0994m9301j8728
13680a50831N9604J4305K0984M0358N6807L1317j4513P677l373n6179n0645R037
13668c5452M171K3568k5411m5357j3773O817K4918N0588P403j3653m0410P6461
13656A9870M6713K4358j3755o1060l9652Q616l5929j5509N4867O9352r0915p5891
13644a08935J9424J3761O532J2114N1602j4423J9033J2839J314L111m2171n3750
$$ plain form
13632 -79549 -110882 -138625 -108436 -77490 -46730 -21641 26595 63749 25620 19433 4002 -74207
13620 -74207 -73395 -30816 11962 34217 4377 -27901 12809 56056 14911 -15917 -3133 27825
13608 27825 35438 62539 35832 -5144 -92330 -97258 -29361 21652 48899 30575 9633 1344
13596 1344 -64418 -71956 -83341 -120055 -100703 -55831 -107919 -120507 -151676 -168845 -92364 -86896
13584 -86896 -189358 -241715 -207352 -102368 -55324 -44189 37047 59180 15529 -58159 -36492
13573 -36492 37966 70962 -32619 -46087 -16900 30175 7490 -69982 -59330 -6370 48096
13562 48096 100040 24544 -17282 399 28864 25155 3960 47336 59527 125664 89353 7113
13550 7113 34916 -41127 -121729 -129882 -135565 -56003 -99381 -88986 -62367 -101403 -132277 -107781
$$ packed form
13632g9549l1333k7743L0189L0946L0760K5089M8236L7154l8129o187j5431p8209
13620g4207Q12M2579M2778K2255k9840l2278M0710M3247m1145l0828J2784L0958
13608B7825P613K7101k6707m0976q7186m928O7897N1013K7247j8324k0942q289
13596A344o5762p538j1385l6714J9352M4872n2088j2588l1169j7169P6481N468
13584h6896j02462n2357L4363J04984M7044J1135Q1236K2133m3651p3688K1667
13573c6492P4458L2996j03581j3468K9187M7075k2685p7472J0652N2960N4466
13562D8096N1944p5496m1826J7681K8465l709k1195M3376J2191O6137l6311q2240
13550G113K7803p6043q0602q153n683P9562m3378J0395K6619l9036l0874K4496
$$ plain form
13538 -107781 -164506 -191586 -217873 -171844 -106540 -29530 4443 13506 27562 23254 38647 33553
13526 33553 13245 61203 25103 -33104 -40146 -71559 -12325 19576 -31075 -20101 -19568 -67642
13514 -67642 -90952 -130216 -83250 -32181 12407 51820 107485 77050 101587 92308 -354 -31418
13502 -31418 -44801 -10976 54348 16117 -33278 -10254 11519 1098 21630 119877 78542 47192
13490 47192 105055 119149 117147 49954 -7047 -46039 -88159 -43128 -8248 24655 -29958 -32972
13478 -32972 -6428 37401 51468 55019 108540 110187 56898 -5230 -1079 56926 98211 25019
13466 25019 -4982 5268 -46724 35699 57739 26508 -27846 -77843 -39389 18462 68543 15783
13454 15783 64319 -13881 -37485 -32698 -74014 -98082 -81164 -78727 -57715 -61673 -93479 -21897
$$ packed form
13538a07781n6725k7080k6287M6029O5304P7010L3973R063J4056m308J5393n094
13526C3553k0308M7958l6100n8207p042l1413N9234L1901n0651J0974N33m8074
13514f7642k3310l9264M6966N1069M4588L9413N5665l0435K4537r279r2662l1064
13502c1418j3383L3825O5324l8231m9395K3024K1773j0421K0532R8247m1335l1350
13490D7192N7863J4094k002o7193n7001l8992m2120M5031L4880L2903n4613l014
13478c2972K6544M3829J4067L551N3521J647n3289o2128M151N8005M1285p3192
13466B5019l0001J0250n1992Q2423K2040l1231n4354m9997L8454N7851N0081n2760
13454A5783M8536p8200k3604M787m1316k4068J6918K437K1012l958l1806P1582
$$ plain form
13442 -21897 55651 83565 107310 138855 136101 100392 67299 -14407 -64477 -93106 -64014 -57656
13430 -57656 -40829 -33368 -50903 -29145 -18659 20962 49401 98616 57466 37900 53131 -54
13418 -54 -90532 -95034 -28293 -7192 -47479 -68396 -32461 -43072 -24647 14080 -1106 6931 -70845
13405 -70845 -82199 -54832 -63723 -57549 -9786 -43813 -80326 -103101 -67358 -87357 -106908 -65295
13393 -65295 3070 -35711 -16549 -110719 -155304 -112535 -120943 -78349 -76899 -86003 -31653 37591
13381 37591 30872 8104 14372 -31245 -3056 -66474 -41159 -9743 -51784 -64628 -74152 -113913
13369 -113913 -21563 43671 75020 48746 53547 43759 3602 -47326 -2595 31172 -13877 -10798
13357 -10798 17759 13070 13466 11232 -66663 -132938 -109542 -69926 -79558 -38505 -49697 -64289 -91014
$$ packed form
13442b1897P7548K7914K3745L1545k754l5709l3093q1706n0070k8629K9092O358
13430e7656J6827P461j7535K1758J0486L9621K8439M9215m1150j9566J5231n3185
13418e4r0478m502O6741K1101m0287k0917L5935j0611J8425L8727j5186Q037p7776
13405g0845j1354K7367q891O174M7763l4027l6513k2775L5743j9999j9551M1613
13393f5295O8365l8781J9162r4170m4585M2769q408M2594J450r104N4350O9244
13381C7591o719k2768O268m5617K8189o3418K5315L1416m2041j2844r524l9761
13369a13913R2350O5234L1349k6274M801r788m0157n0928M4731L3767m5049L079
13357a0798K8557m689L96k234p7895o6275K3396L9616r632M1053j1192j4592k6725
$$ plain form
13344 -91014 -86813 -63708 12358 33882 272 18167 10045 -22140 -48838 -9785 14008 29085
13332 29085 10415 50051 68005 69025 121627 83208 78761 39105 23849 -24347 6958 41853
13320 41853 37711 25244 909 4942 -37804 -33226 -42372 -46474 -89111 -130964 -128399 -114711 -64593
13307 -64593 -15408 -11068 -4918 -48119 -42214 26586 50202 -13636 -50577 -46097 -66914 -10766
13295 -10766 28404 80552 113222 69863 14502 -22773 -20302 -71679 -94176 -93134 -43224 -27322
13283 -27322 -70097 -93807 -88470 -74841 -50644 -62565 -92696 -44404 -15188 -8182 15603 -3766
13271 -3766 -25450 941 -100264 -77535 -37207 -51415 -35682 -12165 -31298 -53553 -77751 -98336
13259 -98336 -127171 -71755 -44659 -9438 35195 92972 47293 -16459 -21368 -36468 -92056 -88472
$$ packed form
13344i1014M201K3105P6066K1524l3610J7895q122l2185k6698L9053K3793J5077
13332B9085j8670L9636J7954J020N2602l8419m447l9656j5256m8196L1305L4895
13320D1853m142j2467k4335M033m2746M578r146m102m2637m1853K565J3688N0118
13307f4593M9185M340O150m3201N905O8800K3616o3838l6941M480k0817N6148
13295a0766L9170N2148L2670m3359n5361l7275K471n1377k2497J042M9910J5902
13283b7322m2775k3710N337J3629K4197j1921l0131M8292K9216P006K3785j9369
13271c766k1684K6391j01205K2729M0328j4208J5733K3517j9133k2255k4198k0585
13259i8336k8835N5416K7096L5221M4633N7777m5679o3752m909j5100n5588L584
$$ plain form
13247 -88472 -59838 -40619 -16819 2850 11002 48372 90999 108663 66594 27958 -30195 -37406
13235 -37406 -3802 36362 3671 -8733 80588 133181 134033 135015 148902 93067 91904 80212 24425
13222 24425 -37745 -15699 -16794 -71438 -64060 -6275 -17100 -30501 13999 -42617 -82521 -44249
13210 -44249 20996 -8910 -104623 -142879 -65085 35169 62853 17505 3428 -48537 -45071 36141
13198 36141 55394 62713 14389 -63724 -147817 -142756 -136265 -86583 -78842 -49636 -20819 -3839
13186 -3839 -10571 -35843 21068 48630 27483 -4984 -37829 -11388 -24131 -12836 -31633 -88566
13174 -88566 -88553 -42049 59218 63631 50700 -36529 -54439 -42233 -65336 -114256 -59604 -1494
13162 -1494 44614 54459 17569 -34917 -23337 -23857 19123 95108 85756 61694 61349 112352 70602
$$ packed form
13247h8472K8634J9219K3800J9669Q152L7370M2627J7664m2069l8636n8153p211
13235c7406L3604M0164l2691j2404Q9321N2593Q52R82J3887n5835j163j1692n5787
13222B4425o2170K2046j095n4644P378N7785j0825j3401M4500n6616l9904L8272
13210d4249O5245k9906r5713l8256P7794J00254K7684m5348j4077n1965L466Q1212
13198C6141J9253P319m8324p8113q4093N061O491M9682P741K9206K8817J6980
13186c839o732k5272N6911K7562k1147l2467l2845K6441j2743J1295j8797n6933
13174h8566J3M6504J01267M413j2931q7229j7910J2206k3103m8920N4652N8110
13162a494M6108R845l6890n2486J1580n20M2980P5985r352k4062l45N1003m1750
$$ plain form
13149 70602 6511 -20562 -39651 -34012 -47771 -17712 -45582 -26065 -33535 -43986 -20048 -5661
13137 -5661 -30478 -16822 10962 38667 18673 -36745 -57499 -10575 7671 -5689 -3681 -39653
13125 -39653 -46923 -105370 -191625 -179576 -115234 -74281 -81133 -85748 -57405 -70428 -32600 17136
13113 17136 29737 21278 -13324 -68222 -86678 -50801 -67835 -6984 46589 23492 27076 32629
13101 32629 16327 -2273 -41554 -14950 47482 71837 68477 58644 92597 84254 64843 69640
13089 69640 103656 105872 34752 -60471 -60189 -23355 -29844 -47707 -32181 -50597 -86221 -34547
13077 -34547 -22694 -24789 5991 -27443 -50559 -39880 -69938 -71848 -7676 93819 127512 122929
13065 122929 49295 22814 64512 22301 -12250 -43998 -30054 7401 31689 76200 129785
$$ packed form
13149G0602o4091k7073j9089N639j3759L0059k7870J9517p470j0451K3938J4387
13137e661k4817J3656K7784K7705j9994n5418k0754M6924J8246j3360K008l5972
13125c9653p270n8447q6255J2049O4342M0953o852m615K8343j3023L7828M9736
13113A7136J2601q459l4602n4898j8456L5877j7034O0851N3573k3097L584N553
13101C2629j6302j8600l9281K6604O2432K4355l360r833L3953q343j9411M797
13089F9640L4016K216p1120r5223K82L6834o489j7863J5526j8416l5624N1674
13077c4547J1853k095L0780l3434k3116J0679l0058j910O4172J01495L3693m583
13065A22929p3634k6481M1698m2211l4551l1748J3944L7455K4288M4511N3585
$$ plain form
13054 129785 135627 48901 -58392 -42753 -20310 -8842 48121 161955 128554 91215 93274
13043 93274 54892 71447 119783 79365 11070 -54499 -127026 -109090 -3629 83089 73196 34688
13031 34688 12900 -61589 -87041 -33623 -15695 19644 51781 29273 -19228 -29618 37893 40086
13019 40086 56391 52520 40569 65670 63666 79750 119714 90405 23206 35233 78332 66103
13007 66103 61279 90691 48049 -13210 -3933 46169 43293 58105 66273 22654 -77905 -53755
12995 -53755 5431 29126 50210 118311 110482 58195 -1549 -76992 -99582 -88380 -44459 -8955
12983 -8955 15993 -25313 -28154 -64168 -40608 23689 569 -42540 -86530 -71564 -41029 14977
12971 14977 -5762 37390 61932 12059 16219 18582 34261 38832 42637 35955 2004 2745 4248
$$ packed form
13054A29785N842q6726j07293J5639K2443J1468N6963J13834l3401l7339K059
13043I3274l8382J6555M8336m0418o8295o5569p2527J7936J05461Q6718r893l8508
13031C4688k1788p4489k5452N3418J7928L5339L2137k2508m8501j0390O7511K193
13019D0086J6305l871j1951K5101k004J6084L9964k9309o7199J2027M3099j2229
13007F6103m824K9412m2642o1259R277N0102k876J4812Q168m3619j00559K4150
12995e3755N9186K3695K1084O8101p829n2287n9744p5443k2590J1202M3921L5504
12983h955K4948m1306k841l6014K3560O4297k3120m3109m3990J4966L0535N6006
12971A4977k0739M3152K4542m9873M160K363J5679M571L805o682l3951P41J503
$$ plain form
12958 4248 7271 -50723 -52205 -27173 -69283 -24910 16288 76372 81402 3987 -17349 -28258
12946 -28258 -18514 6043 -73781 -56680 16205 37267 66656 44313 49132 52923 52327 82922 40969
12933 40969 -42748 -43189 -665 51561 33491 35741 63138 63957 110304 77216 53535 84147 -10062
12920 -10062 -39157 20415 44484 56751 11401 -7680 -23856 13168 40684 63221 42318 -5479
12908 -5479 18836 -10664 -5854 -8052 -258 74012 56883 -16342 4984 6929 -33173 -22138 -15119
12895 -15119 -17511 -10540 2669 -89557 -125917 -110303 -128145 -86210 -28655 -10750 -553 15164
12883 15164 -14618 14037 39627 48689 9768 -9827 6517 -91322 -142443 -95768 -73027 -56504
12871 -56504 -16238 90174 144422 113199 21104 6504 4419 28093 33550 57569 17379 16287
$$ packed form
12958D248L023n7994j482K5032m2110M4373M1198O0084N030p7415k1336j0909
12946b8258R744K4557p9824J7101P2885K1062K9389k2343M819L791n96L0595m1953
12933D0969q3717m41M2524N2226j8070K250K7397Q19M6347l3088k3681L0612r4209
12920a0062k9095N9572K4069J2267m5350j9081j6176L7024K7516K2537k0903m7797
12908e479K4315k9500M810k198P794P4270j7129p3225K1326J945m0102J1035P019
12895a5119k392O971J3209r2226l6360J5614j7842M1935N7555J7905J0197J5717
12883A5164k9782K8655K5590R062l8921j9595J6344r7839n1121M6675K2741J6523
12871e6504M0266J06412N4248l1223r2095j4600k085K3674N457K4019m0190j092
$$ plain form
12859 16287 -21694 8594 -4311 -890 -74885 -144236 -141937 -75506 5785 18816 41063 82941
12847 82941 77504 -2284 -22018 -18629 -31528 -23029 -43499 2667 68804 68827 64571 -6501 -47016
12834 -47016 -70488 -33505 -26820 -14236 -72760 -72387 -64473 -48382 49549 4483 -48693 -26466
12822 -26466 -2168 36823 65695 91533 109770 91560 48528 35467 7678 -23975 10099 12350
12810 12350 -28294 -22376 -15097 23153 69047 131746 83386 -45790 -86815 -94682 -43194 37315
12798 37315 114098 90555 23294 13564 -516 40258 5701 -34187 -31636 70959 156702 102488
12786 102488 13032 -18793 7198 39649 35349 -16019 -66145 -97123 -70974 -40407 51090 73894
12774 73894 45783 54486 73577 73829 36234 9933 43500 20683 5230 56721 64736 32686
$$ packed form
12859A6287l7981L0288j2905L421p3995o9351K299O6431Q1291J3031K2247M1878
12847H2941n437p9788j9734L389j2899Q499k0470M6166O6137K3m256p1072m0515
12834d7016k3472L6983O685J2584n8524L73P914J6091R7931m5066n3176K2227
12822b6466K4298L8991K8872K5838J8237j8210m3032j3061k7789l1653L4074K251
12810A2350m0644N918P279L8250M5894O2699m8360j29176m1025p867N1488Q0509
12798C7315P6783k3543o7261r730j4080M0774l4557l9888K551J02595Q5743n4214
12786A02488q9456l1825K5991L2451m300n1368n0126l0978K6149L0567R1497K2804
12774G3894k8111Q703J9091K52l7595k6301L3567k2817j5453N1491Q015l2050
$$ plain form
12762 32686 14128 71502 82558 78717 67340 34991 -1409 -45958 31541 68879 -3389 -45095
12750 -45095 -92440 -120892 -138522 -70857 -6634 -81504 -66001 -2827 9804 37995 54220 72264
12738 72264 6915 -30812 -13459 -43788 12463 55099 59930 50160 108303 129631 86386 25792
12726 25792 11838 64560 50189 19291 55183 58353 -12104 1097 -60586 -48337 -10920 -42041
12714 -42041 -36859 -59441 -3163 32810 38605 -15885 -49762 -113731 -60503 4147 10097 14019
12702 14019 110518 86104 30751 -3560 -35535 -47547 -62523 -50388 -19660 46264 106322 59319
12690 59319 48534 42918 23607 -27893 -17512 -64337 -76836 -93288 -5957 42684 -29284 -75663
12678 -75663 -101677 -110983 -62163 -36465 -66386 -60963 -69368 -101073 -56087 -22920 -5775 -8407
$$ packed form
12762C2686j8558N7374J1056l841j1377l2349l6400m4549P7499L7338p2268m1706
12750d5095m7345k8452j7630O7665O4223p4870J5503O3174J2631K8191J6225J8044
12738G2264o5349l7727J7353l0329N6251M2636M831r770N8143K1328m3245o0594
12726B5792j3954N2722j4371l0898L5892L170p0457J3201o1683J2249L7417l1121
12714d2041N182k2582N6278L5973N795n4490l3877o3969N3228O4650N950L922
12702A4019R6499k4414n5353l4311l1975j2012j4976J2135L0728O5924O0058m7003
12690E9319j0785n616j9311n1500J0381m6825j2499j6452Q7331M8641p1968m6379
12678g5663k6014r306M8820K5698k9921N423q405l1705M4986L3167J7145k632
$$ plain form
12666 -8407 -2352 -76614 -89877 23535 3232 -44503 -119995 -119728 -69839 -8381 12422 -46591
12654 -46591 -49726 -47277 -45976 -72563 -112763 -93567 -56599 -29723 -79258 -81722 -78234 -71144 21594
12641 21594 3912 14197 -59243 -130188 -74657 -23738 -52949 -50 47091 68023 21866 -3225
12629 -3225 30562 20251 5152 25879 3251 -5310 -77257 -145425 -124188 -70672 -19356 45557
12617 45557 25023 21122 12301 -4763 13130 38326 60594 32629 70045 135372 196252 135430
12605 135430 14488 7773 80092 106133 38032 11529 -20739 -62060 -6316 35202 20923
12594 20923 47436 88027 95122 5089 -43488 -42096 47163 91353 36046 12939 23337 35729
12582 35729 37397 34366 1415 -16763 13825 55144 3450 -42080 20461 61033 45371 -30500
$$ packed form
12666h407O055p4262j3263J13412k0303m7735p5492K67M9889O1458K0803n9013
12654d6591l135K449J301k6587m0200J9196L6968K6876m9535k464L488P090R2738
12641B1594j7682J0285p3440p0945N5531N0919k9211N2899M7141K0932m6157k5091
12629c225L3787j0311j5099K0727k2628q561p1947o8168K1237N3516N1316O4913
12617D5557k0534l901q821j7064J7893K5196K2268k7965L7416O5327O0880o0822
12605A35430j20942o715P2319K6041o8101k6503l2268m1321N5744M1518j4279
12594B0923K6513M0591P095r0033m8577J392Q9259M4190n5307k3107J0398J2392
12582C5729J668l031l2951j8178L0588M1319n1694m5530O2541M0572j5662p5871
$$ plain form
12570 -30500 -35382 -16432 32523 46377 25597 19974 30002 9338 -55110 -56498 17172 19653
12558 19653 -28838 -83734 -85594 -51842 59912 40381 -53957 -66592 -50037 -25668 -13780 28319
12546 28319 72238 103457 160864 172263 136603 70923 74559 99102 75170 88002 93718 18826
12534 18826 29269 86851 79097 -19474 -2572 -44538 -23981 57705 50225 -2928 51089 51938
12522 51938 41720 5653 -4946 22624 60031 67783 61190 36203 31081 75076 97275 112454
12510 112454 139014 184775 185068 173782 147855 140233 101370 25490 23730 46460 4973 -29049
12498 -29049 -69994 -65109 -25433 -56737 6262 52125 68034 81777 52429 17749 27635 21764
12486 21764 10380 27903 64121 -3113 -52076 -46984 5274 25275 9257 2729 46207 42584
$$ packed form
12570c0500m882J8950M8955J3854k0780n623J0028k0664o4448j388P3670K481
12558A9653m8491n4896j860L3752J11754j9531r4338j2635J6555K4369J1888M2099
12546B8319M3919L1219N7407J1399l5660o5680L636K4543k3932J2832N716p4892
12534A8826J0443N7582p754r8571J6902m1966K0557Q1686p480n3153N4017Q49
12522E1938j0218l6067j0599K7570L7407P752o593k4987n122M3995K2199J5179
12510A12454K6560M5761K93j1286k5927p622l8863p5880j760K2730m1487l4022
12498b9049m0945M885L9676l1304O2999M5863J5909J3743k9348l4680R886n871
12486B1764j1384J7523L6218o7234m8963N092N2258K0001j6018o528M3478l623
$$ plain form
12474 42584 66811 6658 19191 41983 50938 19052 6107 25903 11490 -1877 8485 41241
12462 41241 -31058 -60469 -32751 -30035 -64455 -82903 -105315 -119168 -123287 -72160 -34440 -9722
12450 -9722 -38041 -2489 66473 13509 -46598 16794 54064 58404 92874 83698 64680 32882
12438 32882 47249 56353 59351 16398 -84251 -101295 -113448 -76057 -31496 14764 -21714 -65299
12426 -65299 -16150 55270 128135 102845 -13420 6858 -27901 -56820 -89628 -41940 -1232
12415 -1232 11841 39439 39700 46045 58329 -34969 -59398 -57754 -66955 -29315 2411 -107167 -66295
12402 -66295 -10863 -42551 -46473 -19173 40885 74047 56955 1709 54002 72026 20838 33475
12390 33475 43739 1911 -22642 -4984 10850 -13862 11697 76793 124151 82134 42620 -15533
$$ packed form
12474D2584K4227o0153J2533K2792Q955l1886j2945J9796j4413j3367J0362L2756
12462D1241p2299k9411K7718K716l4420j8448k2412j3853m119N1127L7720K4718
12450i722k8319L5552O8962n2964o0107O3392L7270M340L4470r176j9018l1798
12438C2882J4367R104K998m2953j00649j7044j2153L7391M4561M6260l6478m3585
12426f5299M9149P1420P2865k5290j16265K0278l4759k8919l2808M7688M0708
12415a232J3073K7598K61O345J2284r3298k4429J644r201L7640L1726j09578M0872
12402f6295N5432l1688l922K7300O0058L3162j7092n5246N2293J8024n1188J2637
12390C3475J0264m1828k4553J7658J5834k4712K5559O5096M7358m2017l9514n8153
$$ plain form
12378 -15533 -88523 -103452 -144334 -199970 -151351 -82646 -81722 -99364 -68199 -30986 6235 -44097
12366 -44097 -45348 -11875 10335 -89848 -109127 -79969 1228 89269 143973 115776 41749 85642
12354 85642 68413 20463 -16159 5070 -20645 -4841 1681 33313 22156 -21033 -57744 -58104
12342 -58104 -57009 -9645 20595 45332 63174 57544 93225 108402 110945 109601 52646 -10180
12330 -10180 23959 57986 37699 92121 141722 131650 112526 51229 -9252 -8122 208 42603
12318 42603 7068 20386 11806 25967 2026 -25498 -21715 32602 -12035 -4553 10738 26738
12306 26738 -9420 -66698 -16659 16138 32557 65167 92475 32567 -37248 4652 85647 144429
12294 144429 146929 53050 24756 32859 73511 61947 94315 139152 153210 124897 117147 95176
$$ packed form
12378a5533p2990j4929m0882n5636M8619O8705R24j7642L1165L7213L7221n0332
12366d4097j251L3473K2210j00183j9279K9158Q1197Q8041N4704k8197p4027M3893
12354H5642j7229m7950l6622K1229k5715J5804O522L1632j1157m3189l6711l60
12342e8104J095M7364L0240K4737J7842n630L5681J5177K543j344n6955o2826
12330a0180L4139L4027k0287N4422M9601j0072j9124o1297o0481J130Q330M2395
12318D2603l5535J3318q580J4161k3941k7524L783N4317m4637P482J5291J6000
12306B6738l6158n7278N0039L2797J6419L2610K7308n9908o9815M1900Q0995N8782
12294A44429K500r3879k8294Q103M0652j1564L2368M4837J4058k8313p750k1971
$$ plain form
12282 95176 102061 24560 1493 16677 -48196 -102280 -77656 -66792 -103593 -136097 -94545 -55333
12270 -55333 -55765 -26050 39284 64884 36785 5635 -11076 22864 76871 110543 30636 4818
12258 4818 2863 13416 77128 103799 173501 205174 150020 74941 -25341 18998 55864 65547
12246 65547 6581 5690 56642 41194 -28329 -31282 -12211 18231 35987 38604 13410 -4763
12234 -4763 -24121 -14160 26319 33489 71495 36075 -65504 -44587 -28499 12757 35992 52816
12222 52816 46906 80273 34655 13750 68900 61078 3600 -3509 40494 51866 38579 49759
12210 49759 69688 55990 40589 26841 20972 -7434 -17372 22157 53950 21735 4807 64801
12198 64801 123294 81799 17804 -37341 -32339 34887 15336 -3803 -13000 -42920 -19889 26672
$$ packed form
12282I5176O885p7501k3067J5184o4873n4084K4624J0864l6801l2504M1552L9212
12270e5333m32K9715O5334K5600k8099l1150j6711L3940N4007L3672p9907k5818
12258D818j955J0553O3712K6671O9702L1673n5154p5079j00282M4339L6866R683
12246F5547n8966q91N0952j5448o9523k953J9071L0442J7756K617k5194j8173
12234d763j9358R961M0479P170L8006l5420j01579K0917J6088M1256K3235J6824
12222E2816n910L3367m5618k0905N5150p822n7478p109M4003J1372j3287J1180
12210D9759J9929j3698j5401j3748n869k8406r938L9529L1793l2215j6928N9994
12198F4801N8493m1495o3995n5145N002O7226j9551j9139r197k9920K3031M6561
$$ plain form
12186 26672 102461 133500 78902 45096 40235 103632 146257 118922 41763 73830 140956 120768
12174 120768 120707 165752 199178 316771 419826 339318 263249 276750 238357 206142 166224 120574
12162 120574 158999 155761 63546 43489 54659 111298 182238 141763 123983 147807 118905 60241
12150 60241 7933 -13367 -33327 4996 78922 112167 105429 112409 89544 101094 50550 51809
12138 51809 64813 57109 784 -17534 53058 41243 42505 19493 -32248 -70322 -39320 2822
12126 2822 -1819 17772 116630 132906 58535 -12736 7130 -2415 29232 152242 174691 85982
12114 85982 67165 43980 72131 65022 20654 -4008 14551 31189 68311 92718 69164 83915
12102 83915 79176 9616 -32243 -10482 52194 101308 68911 61803 154968 111064 37011 79637
$$ packed form
12186B6672P5789L1039n4598l3806m861O3397M2625k7335p7159L2067O7126k0188
12174A20768o1M5045L3426J17593J03055q0508p6069J3501l8393l2215l9918m5650
12162A20574L8425l238r2215k0057J1170N6639P0940m0475j7780K3824k8902n8664
12150F0241n2308k1300j9960L8323P3926L3245o738O980k2865J1550n0544J259
12138E1809J3004p704n6325j8318P0592j1815J262k3012n1741l8074L1002M2142
12126B822m641J9591R8858J6276p4371p1271J9866r545L1647J23010K2449q8709
12114H5982j8817k3185K8151p109m4368k4662J8559J6638L7122K4407k3554J4751
12102H3915m739o9560m1859K1761O2676M9114l2397p108R3165m3904p4053M2626
$$ plain form
12090 79637 89858 139873 164297 176752 195164 165920 176206 144900 131270 151737 177809 142595
12078 142595 147907 118904 112955 137690 109188 93161 100096 99024 69826 60920 108537 94123
12066 94123 35181 59164 97137 75853 59585 84387 121846 124664 178768 174821 133048 86507
12054 86507 123159 160645 122044 130771 161742 164212 235863 258172 192310 184104 193532 156867
12042 156867 144726 193617 120466 65467 106019 108120 157484 197481 127283 43851 87476 118273
12030 118273 146770 204425 192550 172876 191671 210344 214654 205702 190806 158953 156545 105749
12018 105749 139968 189125 191006 199880 193171 197175 197622 212231 243152 247667 311927 273044 264619
12005 264619 304609 350469 308984 284519 323527 369866 326751 275637 266550 288498 352742 432622
$$ packed form
12090G9637J0221N0015K4424J2455J8412k9244J0286l1306j3630K0467K6072l5214
12078A42595N312k9003n949K4735k8502j6027O935j072k9198q906M7617j4414
12066I4123n8942K3983L7973k1284j6268K4802L7459K818N4104l947m1773m6541
12054H6507L6652L7486l8601Q727L0971K470P1651K2309o5862q206R428l6665
12042A56867j2141M8891p3151n4999M0552K101M9364L9997p0198q3432M3625L0797
12030A18273K8497N7655j1875j9674J8795J8673M310q952j4896l1853k408n0796
12018A05749L4219M9157J881Q874o709M004M47J4609L0921M515O4260l8883q425
12005B64619L9990M5860m1485k4465L9008M6339m3115n1114r087K1948O4244P9880
$$ plain form
11993 432622 455499 389912 343641 345519 361460 442012 413235 371899 318803 310050 328673 402390
11981 402390 560871 601741 623400 646464 665411 684029 712226 767413 802048 780720 800013
11970 800013 812781 826517 867195 905765 933068 912472 968720 1041194 1133184 1195858 1232714
11959 1232714 1280698 1385618 1495029 1555198 1635973 1702923 1790325 1923444 2026133 2234475
11949 2234475 2454419 2659132 2828990 3058706 3269769 3487807 3763113 4079111 4365497
11940 4365497 4757513 5211408 5772792 6447785 7213736 8015569 8936211 10063736 11431215
11931 11431215 13094471 15150817 17729022 21093540 25462760 31375206 39755289 51908297
11923 51908297 69662565 95740351 135291761 196368499 285864515 384514666 425585782
$$ packed form
11993D32622K2877o5587m6271J878J5941Q0552k8777m1336n3096q753J8623P3717
11981D02390J58481M0870K1659K3064J8947J8618K8197N5187L4635k1328J9293
11970H00013J2768J3736M0678L8570K7303k0596N6248P2474R1990O2674L6856
11959A232714M7984J04920J09411O0169Q0775O6950Q7402J33119J02689K08342
11949B234475K19944K04713J69858K29716K11063K18038K75306L15998K86386
11940D365497L92016M53895N61384O74993P65951Q01833R20642J127525J367479
11931A1431215J663256K056346K578205L364518M369220N912446Q380083J2153008
11923E1908297J7754268K6077786L9551410O1076738Q9496016R8650151M1071116
$$ plain form
11916 425585782 395679011 330831911 243131896 165177309 114038988 82902737 63192645
11909 63192645 49734048 40003180 32759116 27200412 22790065 19241415 16489184 14243753
11901 14243753 12391278 10964556 9802218 8768821 7821780 6996896 6410998 5934002 5440202
11892 5440202 5008536 4622735 4268641 3895772 3579737 3386470 3209240 3011387 2846835
11883 2846835 2725074 2623570 2591691 2385460 2246260 2089439 1965211 1899950 1789515 1705489
11873 1705489 1669230 1643797 1525882 1355979 1258252 1218728 1209164 1191692 1102898 1053656 1000980
11862 1000980 1019364 1025499 1001687 899831 877273 908041 872195 786073 756783 772662 764086
11851 764086 703760 665958 703563 668005 680898 708609 689336 638025 603446 497121 480065
$$ packed form
11916D25585782k9906771o4847100q7700015p7954587n1138321l1136251j9710092
11909F3192645j3458597r730868p244064n558704m410347l548650k752231k245431
11901A4243753j852475j426722j162338j033397r47041q24884n85898m76996m93800
11892E440202m31666l85801l54094l72869l16035j93267j77230j97853j64552
11883B846835j21761j01504l1879k06231j39200j56821j24228o5261j10435q4026
11873A705489l6259k5433j17915j69903r7727l9524r564j7472q8794m9242n2676
11862A000980J8384O135k3812j01856k2558L0768l5846q6122k9290J5879q576
11851G64086o0326l7802L7605l5558J2893K7711j9273n1311l4579j06325j7056
$$ plain form
11840 480065 523129 588977 575522 524863 518941 528406 573691 576537 561574 572223 548158 441817
11828 441817 392632 393900 384761 385466 346583 314337 317803 320030 314325 246304 244140 303976 315870
11815 315870 321516 361361 340719 297296 244830 221116 292340 264238 263061 303123 263197 234486
11803 234486 198118 192011 237830 242367 207141 185360 237868 345620 365528 369797 355315 399513
11791 399513 390261 305128 239813 173740 159283 188413 206800 264561 235513 171167 194834 240209
11779 240209 207110 248801 219307 154433 249007 256421 173450 205169 225159 267526 224751 168816
11767 168816 157271 164781 165761 149494 74850 62202 102374 157814 159348 50004 17660 6656
11755 6656 -1765 41862 104730 88327 69342 48629 64236 85371 89094 94051 96142 117431 162016
$$ packed form
11840D80065M3064O5848j3455n0659n922R465M5285K846j4963J0649k4065j06341
11828D41817m9185J268r139P05l8883l2246L466K227n705o8021k164N9836J1894
11815C15870N646L9845k0642m3423n2466k3714P1224k8102j177M0062l9926k8711
11803B34486l6368o107M5819M537l5226k1781N2508J07752J9908M269j4482M4198
11791C99513r252q5133o5315o6073j4457K9130J8387N7761k9048o4346K3667M5375
11779B40209l3099M1691k9494o4874R4574P414q2971L1719J9990M2367m2775n5935
11767A68816j1545P510R80j6267p4644j2648M0172N5440J534j09344l2344j1004
11755F656q421M3627O2868j6403j8985k0713J5607K1135L723M957K091K1289M4585
$$ plain form
11742 162016 168651 143952 135831 113402 25203 15100 -40695 -74864 -57352 26495 67367 35253
11730 35253 -20190 22793 81129 94118 72510 107827 147255 99977 63996 111698 92040 19610
11718 19610 4992 30416 78169 125306 146944 69267 49525 -10567 -18489 60163 85602 84567
11706 84567 74600 98685 83222 70465 97035 68205 74551 70605 -26766 -59077 -72885 -56099
11694 -56099 -23136 -12050 -42455 15480 64232 82649 -3373 -1771 44060 16636 -17935 -19893
11682 -19893 61864 34143 34851 96111 45027 -1783 44860 46713 63181 82242 52073 37913
11670 37913 19596 28567 95053 61197 19436 10064 43491 92586 120994 118418 132087 121159
11658 121159 66195 -31274 -73269 -85184 -92533 -109639 -84190 -8756 -22666 48255 61535 17870
$$ packed form
11742A62016O635k4699q121k2429q8199j0103n5795l4169J7512Q3847M0872l2114
11730C5253n5443M2983N8336J2989k1608L5317L9428m7278l5981M7702j9658p2430
11718A9610j4618K5424M7753M7137K1638p7677j9742o0092p922P8652K5439j035
11706H4567r967K4085j5463j2757K6570k8830O346l946r7371l2311j3808J6786
11694e6099L2963J1086l0405N7935M8752J8417q6022J602M5831k7424l4571j958
11682a9893Q1757k7721P08O1260n1084m6810M6643J853J6468J9061l0169j4160
11670C7913j8317Q971O6486l3856m1761r372L3427M9095K8408k576J3669j0928
11658A21159n4964r7469m1995j1915p349j7106K5449P5434j3910P0921J3280m3665
$$ plain form
11646 17870 15563 -26562 -33515 6811 -35975 -27386 5658 19748 20064 48791 -3243 -45603 -99155
11633 -99155 -48687 -4495 6109 41213 37930 8071 19903 16702 23974 15672 -28774 32613
11621 32613 95353 103887 72767 54328 68781 49059 42723 -14842 -74516 -22103 69575 101404
11609 101404 146989 136322 78714 54 -20685 -22169 32873 50311 110550 145671 96639 63816
11597 63816 55633 17152 26177 67868 89111 85197 66683 49876 20328 -38635 -6979 3304
11585 3304 -11234 375 24442 -30718 -68776 -44800 1954 32378 61315 58658 59312 44672
11573 44672 43807 61115 34141 -55550 -73921 -67709 -129666 -77108 -61392 -7837 29266 62976
11561 62976 52984 783 -23955 -86120 -65434 -65897 -53707 -22802 -44013 -41726 7858 -19835
$$ packed form
11646A7870k307m2125o953M0326m2786Q589L3044J4090L16K8727n2034m2360n3552
11633i9155N0468M4192J0604L5104l283k9859J1832l201P272q302m4446O1387
11621C2613O2740Q534l1120j8439J4453j9722o336n7565n9674N2413R1678L1829
11609A01404M5585j0667n7608p8660k0739j484N5042J7438O0239L5121m9032l2823
11597F3816q183l8481R025M1691K1243l914j8514j6807k9548n8963L1656J0283
11585C304j4538J1609K4067n5160l8058K3976M6754L0424K8937k657O54j4640
11573D4672q65J7308k6974q9691j8371O212o1957N2558J5716N3555L7103L3710
11561F2976r992n2201k4738o2165K0686m63J2190L0905k1211K287M9584k7693
$$ plain form
11549 -19835 -48433 -75408 -87590 -77014 -32836 -7463 19477 -5195 -58431 -22302 24807 -9383
11537 -9383 14544 -54359 -77132 -8199 14886 -32761 -6346 4405 -60178 -34640 -2397 -36401
11525 -36401 -36532 -62866 -34200 9096 36706 80304 57755 1533 -1589 -9105 5796 16554
11513 16554 39357 -12266 -18623 22022 76116 64612 70125 54240 40579 89447 121148 87544
11501 87544 32684 -29318 20980 96192 79460 22876 14902 34857 90424 105549 -4813 11072
11489 11072 35455 61207 38668 46668 40463 -885 48076 50655 -35994 -13746 46846 34555
11477 34555 -96516 -112461 -51390 49732 100779 62682 49328 43552 19532 -14909 -16617 -35659
11465 -35659 -83371 -105924 -120447 -56538 -22765 -8186 27484 42111 41762 25597 59732 18155
$$ packed form
11549a9835k8598k6975j2182J0576M4178K5373K6940k4672n3236L6129M7109l4190
11537i383K3927o8903k2773O8933K3085m7647K6415J0751o4583K5538L2243l4004
11525c6401j31k6334K8666M3296K7610M3598k2549n6222l122p516J4901J0758
11513A6554K2803n1623o357M0645N4094j1504N513j5885j3661M8868L1701l3604
11501H7544n4860o2002N0298P5212j6732n6584p974J9955N5567J5125j10362J5885
11489A1072K4383K5752k2539Q000o205m1348M8961K579q6649K2248O0592j2291
11477C4555j31071j5945O1071J01122N1047l8097j3354n776k4020l4441j708j9042
11465c5659m7712k2553j4523O3909L3773J4579L5670J4627l49j6165L4135m1577
$$ plain form
11453 18155 -82851 -124153 -100754 -38609 -33877 -78015 -80677 -110091 -109854 -70845 -113548 -93825
11441 -93825 -27654 -1660 -24061 -50051 -14592 14750 63918 71610 16941 -52745 -104736 -63286
11429 -63286 -54561 -40470 -29075 8429 49426 56199 29622 5758 -2449 -49238 -48453 -30390 -29999
11416 -29999 -36259 -30998 -21680 -18916 -28830 -52258 -12868 26710 2690 -7053 65651 53576 66220
11403 66220 9668 3047 -19783 -5689 -50922 -62836 -50321 -40935 10415 61448 39673 46935
11391 46935 40986 80631 90543 81206 13354 41793 73462 114947 106361 94611 66617 18147
11379 18147 10799 12803 42734 76735 32679 22798 -1908 -6099 48488 78235 103000 82385
11367 82385 14524 -19957 50471 36864 20012 8582 5831 55398 155807 110086 60089 94257
$$ packed form
11453A8155j01006m1302K3399O2145M732m4138k662k9414K37L9009m2703J9723
11441i3825O6171K5994k2401k5990L5459K9342M9168P692n4669o9686n1991M1450
11429f3286Q725J4091J1395L7504M0997O773k6577k3864q207m6789P85J8063L91
11416b9999o260N261R318K764r914k3428L9390L9578k4020r743P2704j2075J2644
11403F6220n6552o621k2830J4094m5233j1914J2515R386N1350N1033k1775P262
11391D6935n949L9645R912r337o7852K8439L1669M1485q586j1750k7994m8470
11379A8147p348K004K9931L4001m4056r881k4706m191N4587K9747K4765k0615
11367H2385o7861l4481P0428j3607j6852j1430k751M9567J00409m5721m9997L4168
$$ plain form
11355 94257 57183 76211 132584 68735 -1639 41361 95068 69798 -31268 -34845 71598
11344 71598 132683 111363 35316 -20746 -68196 -56401 -21123 -21948 8873 16840 -4746 50820
11332 50820 119839 64019 71341 69633 51840 78317 134129 109156 44878 86675 38505 -19378
11320 -19378 -15910 25823 43024 55957 90542 34421 -19866 39444 64942 52631 97964 96644
11308 96644 14618 36710 21901 4811 -15012 -7519 9288 39390 42410 43893 81682 104441
11296 104441 68370 42934 5521 -12492 -63591 -90164 -71234 -17457 -4900 -52408 -87081
11285 -87081 -112355 -99589 4878 107067 92650 85032 37541 20341 18726 58130 59058 31486
11273 31486 42715 27682 -16156 2755 37756 32909 -68897 -76143 -45283 -24733 -28021 28335
$$ packed form
11355I4257l7074J9028N6373o3849p0374M3000N3707k5270j01066l577J06443
11344G1598O1085k1320p6047n6062m7450J1795L5278q25L0821P967k1586N5566
11332E0820O9019n5820P322j708j7793K6477N5812k4973o4278M1797m8170n7883
11320a9378L468M1733J7201J2933L4585n6121n4287N9310K5498j2311M5333j320
11308I6644q2026K2092j4809j7090j9823P493J6807L0102L020J483L7789K2759
11296A04441l6071k5436l7413j8013n1099k6573J8930N3777J2557m7508l4673
11285h7081k5274J2766J04467J02189j4417p618m7491j7200j615L9404R28k7572
11273C1486J1229j5033m3838J8911L5001m847j01806p246L0860K0550l288N6356
$$ plain form
11261 28335 32712 65373 7338 -42220 -60961 110 -17865 -109815 -108981 -80150 -50577 -97416
11249 -97416 -87693 -101188 -74204 -48823 -4545 -7308 32656 58770 40675 24954 15246 -42626
11237 -42626 -101495 -46404 -49039 -130159 -63621 -1052 27457 -6720 6278 24427 8207 -8742
11225 -8742 -34875 -91686 -112549 -110316 -74003 -43852 13036 26678 15965 63365 86301 51295
11213 51295 4238 25281 140309 148409 22353 4829 9521 -57973 -24259 73747 107153 66336
11201 66336 -1816 -75668 -77088 -49198 6450 27929 11433 11130 21743 -17054 -5187 3423
11189 3423 -19237 -58887 -72968 -68141 -33655 -59104 -19969 -28481 -39754 7275 70408 89417
11177 89417 103482 101685 104475 75151 24887 -61976 -169258 -94603 9932 6518 -79749 -82752
$$ packed form
11261B8335M377L2661n8035m9558j8741O1071j7975r1950Q34K8831K9573m6839
11249i7416R723j3495K6984K5381M4278k763L9964K6114j8095j5721r708n7872
11237d2626n8869N5091k635q1120O6538O2569K8509l4177J2998J8149j6220j6949
11225h742k6133n6811k0863K233L6313L0151N6888J3642j0713M7400K2936l5006
11213E1295m7057K1043J15028Q100j26056j7524M692o7494L3714R8006L3406m0817
11201F6336o8152p3852j420K7890N5648K1479j6496l03J0613l8797J1867Q610
11189C423k2660l9650j4081M827L4486k5449L9135q512j1273M7029O3133J9009
11177H9417J4065j797K790k9324n0264q6863j07282P4655J04535l414q6267l003
$$ plain form
11165 -82752 -53933 23408 55319 36130 -7398 3229 63026 81550 20413 -20500 -35512 -36264
11153 -36264 -21544 -38448 -53211 -37363 -26703 -13970 -8954 -25472 -38834 -38382 2343 -11477
11141 -11477 26091 50899 75281 86447 120956 140734 143632 100147 70160 -11670 -11922 169
11129 169 41936 9890 -37616 -76212 -33636 -31720 -54841 -152971 -122097 -49730 -16087 -55161
11117 -55161 -27897 51667 43190 9572 56437 100419 87170 37401 -56988 -67888 -44597 37474
11105 37474 44392 31532 -28258 -45481 -38277 -48152 -67736 -74218 -28169 -16339 -13877 -52595 -37826
11092 -37826 23602 -15152 -4715 -1717 -32641 -66717 -106004 -63963 -76308 -97838 -106468 -40808
11080 -40808 -36727 -7703 15843 13236 66452 79254 -2929 34447 54668 73098 82926 59943
$$ packed form
11165h2752K8819P7341L1911j9189m3528J0627N9797J8524o1137m0913j5012p52
11153c6264J4720j6904j4763J5848J0660J2733N016j6518j3362M52M0725j3820
11141a1477L7568K4808K4382J1166L4509J9778K898m3485k9987q1830k52J2091
11129A69M1767l2046m7506l8596M2576J916k3121r8130L0874P2367L3643l9074
11117e5161K7264P9564q477l3618M6865M3982j3249m9769r4389j0900K3291Q2071
11105C7474O918j2860n9790j7223P204r875j9584o482M6049J1830K462l8718J4769
11092c7826O1428l8754J0437K998l0924l4076l9287M2041j2345k1530q630O5660
11080d0808M081K9024K3546k607N3216J2802q2183L7376K0221J8430R828k2983
$$ plain form
11068 59943 -40953 -105450 -53426 -2743 -23062 -24306 -97031 -137115 -92010 -48099 -71359 -29638
11056 -29638 11423 65402 60958 81223 88192 67210 75526 136460 201313 237289 284814 343472
11044 343472 351142 269430 202648 218622 216377 235938 382147 486604 541064 556161 513521
11033 513521 484697 463992 398127 321976 343893 397981 457455 550377 635951 702247 764063
11022 764063 797321 806514 676874 588068 478338 403564 409468 424731 509338 566631 524479
11011 524479 556346 527314 483974 445845 377463 315646 261784 244615 193742 218117 195967
11000 195967 159721 200325 222341 269611 299255 280230 173272 83828 69987 54644 -4245
10989 -4245 -15067 20152 31388 21452 -11120 -40553 11249 61751 36616 15642 7508 66461
$$ packed form
11068E9943j00896o4497N2024N0683k0319j244p2725m0084M5105M3911k3260M1721
11056b9638M1061N3979m444K0265O969k0982Q316O0934O4853L5976M7525N8658
11044C43472P670q1712o6782J5974k245J9561J46209J04457N4460J5097m2640
11033E13521k8824k0705o5865p6151K1917N4088N9474R2922Q5574O6296O1816
11022G64063L3258R193j29640q8806j09730p4774N904J5263Q4607N7293m2152
11011E24479L1867k9032m3340l8129o8382o1817n3862j7169n0873K4375k2150
11000A95967l6246M0604K2016M7270K9644j9025j06958q9444j3841j5343n8889
10989d245j0822L5219J1236r936l2572k9433N1802N0502k5135k0974q134N8953
$$ plain form
10977 66461 117645 29678 -14898 42641 54615 -16946 -12316 6201 -10546 -27268 -15561 30328
10965 30328 36515 50453 29429 7500 -20280 -54251 -21709 -2338 -687 50349 93706 47672
10953 47672 -1476 11365 16315 5128 -9294 -59848 -17423 -33298 -114854 -96058 -69153 -81601
10941 -81601 -34932 8421 17674 -1803 18664 108919 117632 91974 23855 -87041 -98740 -13416
10929 -13416 -1357 22837 -1625 -4394 45826 -8772 -57080 31433 87504 74137 10752 -16329
10917 -16329 26618 69244 65126 -5 -13091 11359 15554 103296 112986 124458 119391 86772
10905 86772 80397 73476 81631 76433 45789 90622 119489 118919 136465 142872 162516 170554 119052
10892 119052 53572 29388 -32773 -79685 -67010 -84504 -32127 1440 -28035 1186 -44221
$$ packed form
10977F6461N1184q7967m4576N7539J1974p1561M630J8517j6747j6722J1707M5889
10965C0328O187J3938k1024k1929k7780l3971L2542J9371J651N1036M3357m6034
10953D7672m9148J2841M950j1187j4422n0554M2425j5875q1556J8796K6905j2448
10941h1601M6669M3353R253j9477K0467R0255Q713k5658o8119j10896j1699Q5324
10929a3416J2059K4194k4462k769N0220n4598m8308Q8513N6071j3367o3385k7081
10917a6329M2947M2626m118o5131j3086K4450M195Q7742R690J1472n067l2619
10905H6772o375o921Q155n198l0644M4833K8867n70J7546O407J9644Q038n1502
10892A19052o5480k4184o2161m6912J2675j7494N2377L3567k9475K9221m5407
$$ plain form
10881 -44221 -79578 -73980 -39660 -840 67848 76824 98496 101139 82820 77997 120150 140622
10869 140622 93167 78736 84537 77289 95516 115995 128310 92999 141112 201733 208659 145144
10857 145144 158974 125475 70641 64709 180496 217917 175575 103218 63901 40063 30723 82530
10845 82530 105707 100535 62729 64281 53584 -4659 -9171 42203 82144 65027 137743 159971
10833 159971 132898 7120 -42607 28319 57238 52334 59612 89938 100140 114172 46999 32157
10821 32157 39820 -11809 35214 72021 58071 27990 -46887 -52199 9497 61454 81421 26551
10809 26551 37590 66258 66030 20811 -14624 73374 75971 16619 -4120 -21589 -3987 3204
10797 3204 21661 -25013 -18806 47733 -2305 -16658 27148 36796 17146 -8128 -7441 16228 68669
$$ packed form
10881d4221l5357N598L4320L8820O8688Q976K1672K643j8319m823M2153K0472
10869A40622m7455j4431N801p248J8227K0479J2315l5311M8113O0621O926o3515
10857A45144J3830l3499n4834n932J15787L7421m2342p2357l9317k3838r340N1807
10845H2530K3177n172l7806J552j0697n8243m512N1374L9941j7117P2716K2228
10833A59971k7073j25778m9727P0926K8919m904P278L0326J0202J4032o7173j4842
10821C2157P663n1629M7023L6807j3950l0081p4877n312O1696N1957J9967n4870
10809B6551J1039K8668k28m5219l5435Q7998K597n9352k0739j7469J7602P191
10797C204J8457m6674O207O6539n0038j4353M3806R648j9650k5274O87K3669N2441
$$ plain form
10784 68669 93927 81358 51989 43117 88254 42059 95086 165353 82449 -17030 -41791 50860
10772 50860 55061 55101 79050 101804 147282 158562 149525 121445 73554 30812 29490 45998 101652
10759 101652 89055 32206 12300 26822 78458 51704 82956 118532 133314 71913 81428 180226
10747 180226 209348 174276 121415 69553 64326 111049 114161 104077 77584 106346 146030 172031
10735 172031 181863 172538 196345 208469 199476 163195 104278 126258 112038 69046 122786 124474
10723 124474 112018 185491 183865 139372 119411 81902 54145 50588 85016 86122 107487 87602
10711 87602 100157 132627 181975 220222 96380 42696 55960 85940 106860 167047 187809
10700 187809 209530 149487 70425 88156 146002 122228 119178 126412 152609 184208 199706 137394
$$ packed form
10784F8669K5258j2569k9369q872M5137m6195N3027P0267q2904r9479k4761R2651
10772E0860M201M0K3949K2754M5478J1280r037k8080m7891m2742j322J6508N5654
10759A01652j2597n6849j9906J4522N1636k6754L1252L5576J4782o1401R515R8798
10747A80226K9122l5072n2861n1862n227M6723L112j0084k6493K8762L9684K6001
10735A72031R832r325K3807J2124q993l6281n8917K1980j4220m2992N3740J688
10723A24474j2456P3473j626m4493j9961l7509k7757l557L4428J106K1365j9885
10711H7602J2555L2470M9348L8247j23842n3684J3264K9980K0920O0187K0762
10700A87809K1721o0043p9062J7731N7846k3774l050P234K6197L1599J5498o2312
$$ plain form
10688 137394 143961 141717 101393 138962 178004 202426 200820 206879 241086 278698 238838 266326
10676 266326 259713 242217 253801 306426 356761 362488 362344 383040 396252 405326 459400 502169
10664 502169 502425 485902 493647 514429 532265 536253 520137 530983 584478 633689 721827 790253
10652 790253 813834 803818 841277 916382 915568 931924 983582 991100 1070170 1097633 1225399 1417911
10640 1417911 1554292 1692631 1829175 2044740 2334715 2608444 2978021 3270799 3601750
10631 3601750 3860965 4189013 4657698 5298163 6071787 7096854 8489633 10324316 12931550
10622 12931550 16427866 20895272 26596350 33210632 39668251 44432515 46672755 46501379
10614 46501379 44839081 43213436 42861200 44637210 49009993 56355749 66942899 79948748
$$ packed form
10688A37394O567k244m0324L7569L9042K4422j606O059L4207L7612l9860K7488
10676B66326o613j7496J1584N2625N0335N727j44K0696J3212R074N4074M2769
10664E02169K56j6523P745K0782J7836L988j6116J0846N3495M9211Q8138O8426
10652G90253K3581j0016L7459P5105q14J6356N1658P518P9070K7463J27766J92512
10640A417911J36381J38339J36544K15565K89975K73729L69577K92778L30951
10631C601750K59215L28048M68685O40465P73624J025067J392779J834683K607234
10622A2931550L496316M467406N701078O614282O457619M764264K240240j71376
10614D6501379j662298j625645l52236J776010M372783P345756J0587150J3005849
$$ plain form
10606 79948748 92423701 100257954 101150714 96280998 88493018 81095376 76705190 76496687
10598 76496687 80915864 90033476 103682538 120117464 134668097 141125120 137258585 125333852
10590 125333852 109557097 94643978 83676947 77749577 76617090 79673764 86212471
10583 86212471 94555999 101122450 101877841 95744142 84675635 71870639 60308322 51640061
10575 51640061 46191535 43714530 43529992 44868261 46669237 47512517 46070320 41908008
10567 41908008 35830757 29124018 22978185 18038483 14376017 11665249 9594881 8003362
10559 8003362 6805130 5876568 5050988 4461017 4046972 3631553 3243573 2911890 2651052
10550 2651052 2457227 2224644 1964794 1776912 1685547 1559045 1518309 1471888 1370386 1253991
$$ packed form
10606G9948748J2474953P834253Q92760m869716p787980p397642m390186k08503
10598G6496687M419177R117612J3649062J6434926J4550633O457023l866535j1924733
10590A25333852j5776755j4913119j0967031n927370j132487L056674O538707
10583H6212471Q343528O566451P55391o133699j1068507j2804996j1562317q668261
10575E1640061n448526k477005j84538J338269J800976Q43280j442197m162312
10567D1908008o077251o706739o145833m939702l662466k710768k070368j591519
10559H003362j198232r28562q25580n89971m14045m15419l87980l31683k60838
10550B651052j93825k32583k59850j87882r1365j26502m0736m6421j01502j16395
$$ plain form
10540 1253991 1172394 1131003 1025524 942104 939007 845565 892729 863248 781950 773211 764907 758233
10528 758233 747487 742052 744659 648262 610024 561242 505233 440643 435139 431961 461011 434214
10516 434214 465394 409494 374130 434959 519493 566546 502386 361981 337819 346161 375354
10505 375354 414761 437305 419956 428392 416595 388505 408803 333156 286735 281377 243262 276199
10493 276199 327649 305968 279417 219611 242652 207828 167877 143757 193388 281768 227948
10482 227948 179321 243508 253390 262382 294852 281089 227943 247020 262903 266622 273169 266399
10470 266399 329804 318353 301301 343050 360559 316590 254637 196143 193525 144313 118555 137979
10458 137979 130768 139204 120332 140021 188107 168023 133170 118653 98893 123309 125761 113287
$$ packed form
10540A253991q1597m1391j05479q3420l097r3442M7164k9481q1298q739q304o674
10528G58233j0746n435K607r6397l8238m8782n6009o4590n504l178K9050k6797
10516D34214L1180n5900l5364O0829Q4534M7053o4160j40405k4162Q342K9193
10505C75354L9407K2544j7349Q436j1797k8090K0298p5647m6421n358l8115L2937
10493B76199N1450k1681k6551n9806K3041l4824l9951k4120M9631Q8380n3820
10482B27948m8627O4187R882Q992L2470j3763n3146J9077J5883L719O547o770
10470B66399O3405j1451j7052M1749J7509m3969o1953n8494k618m9212k5758J9424
10458A37979p211Q436j8872J9689M8086k0084l4853j4517j9760K4416K452j2474
$$ plain form
10446 113287 81420 86227 100422 61600 109966 52852 70664 107257 96155 105036 31863 4022
10434 4022 25362 93709 77011 39199 59203 57593 96893 138635 116481 70978 156050 136629
10422 136629 91934 22809 33675 -2164 -3122 29992 78241 134244 168106 120491 136238 95645
10410 95645 138163 145089 107747 49799 73372 107192 53311 37651 -15781 -43248 -16665 8566
10398 8566 11669 -1512 -12386 -7409 21896 75965 78732 54836 13895 -23750 41687 101095
10386 101095 68068 22353 30324 46453 53191 21489 67808 200415 160032 165487 128645 83068
10374 83068 48190 -25100 -3205 -7809 -39098 -50230 -15796 -2252 -34459 -46435 -23469 -22769
10362 -22769 -29870 11861 37286 18869 24676 50206 18479 -3518 27160 26967 -11070 -77947
$$ packed form
10446A13287l1867M807J4195l8822M8366n7114J7812L6593j1102Q881p3173k7841
10434D022K1340O8347j6698l7812K0004j610L9300M1742k2154m5503Q5072j9421
10422A36629m4695o9125J0866l5839r58L3114M8249N6003L3862m7615J5747m0593
10410I5645M2518O926l7342n7948K3573L3820n3881j5660n3432k7467K6583K5231
10398H566L103j3181j0874M977K9305N4069K767k3896m0941l7645O5437N9408
10386A01095l3027m5715P971J6129O738l1702M6319J32607m0383N455l6842m5577
10374H3068l4878p3290K1895m604l1289j1132L4434J3544l2207j1976K2966P00
10362b2769p101M1731K5425j8417N807K5530l1727k1997L0678j93l8037o6877
$$ plain form
10350 -77947 -104586 -106429 -114757 -39451 80098 160485 145207 105410 43957 -32982 -7940 7507
10338 7507 -5656 -27049 80285 145858 176644 138658 28940 4159 5892 54235 70433 21288
10326 21288 23994 16309 25422 39792 53488 497 -60074 -19260 46040 99951 72725 86299
10314 86299 82704 10833 10260 -78785 -109607 -64707 -55398 -69994 -23696 5424 -21179 -52074
10302 -52074 -58859 -108446 -106272 -36869 -2285 -19360 -31813 -87857 -72145 -52061 -23311 56669
10290 56669 69223 100418 85737 81530 43971 1298 12761 -23764 -63608 -45429 1085 37130
10278 37130 16848 -33781 -13935 20553 -17347 6267 13997 13686 31114 -31063 -44856 58142
10266 58142 84877 77129 101299 37788 26351 11842 23833 49006 34869 -45982 -101772 -16027
$$ packed form
10350g7947k6639j843q328P5306J19549Q0387j5278l9797o1453p6939K5042J5447
10338G507j3163k1393J07334O5573L0786l7986j09718k4781J733M8343J6198m9145
10326B1288K706p685R113J4370J3696n2991o0571M0814O5300N3911k7226J3574
10314H6299l595p1871n73q9045l0822M4900R309j4596M6298K9120k6603l0895
10302e2074o785m9587K174O9403L4584j7075j2453n6044J5712K0084K8750P9980
10290E6669J2554L1195j4681m207l7559m2673J1463l6525l9844J8179M6514L6045
10278C7130k0282n0629J9846L4488l7900K3614P730l11J7428o2177j3793J02998
10266E8142K6735p748K4170o3511j1437j4509J1991K5173j4137q0851n5790Q5745
$$ plain form
10254 -16027 -3588 45382 35831 46756 69374 58138 29448 1841 -73218 -37201 42148 78475
10242 78475 29384 -10396 -479 -530 25755 45318 4771 21704 66849 110714 96735 64238
10230 64238 -41712 -171183 -100232 -35657 -5517 9733 30724 74909 72750 31680 522
10219 522 -3432 -26053 -27914 -12359 -13114 -42985 -7510 23613 -25697 -26241 8955 -38412 -60004
10206 -60004 -41315 -110124 -105655 -38298 56141 13998 5107 63741 90139 19505 -45342 -55734
10194 -55734 -32794 -40858 -44540 -41664 27507 47430 48384 103428 119523 117979 116242 126449 137721
10181 137721 208371 284021 262331 215346 230370 194276 185362 187313 199991 261085 290851 369483
10169 369483 501779 579831 603845 560174 537168 493420 455860 449443 472899 531513 640538
$$ packed form
10254a6027J2439M8970r551J0925K2618j1236k8690k7607p5059L6017P9349L6327
10242G8475m9091l9780R917n1K6285J9563m0547J6933M5145M3865j3979l2497
10230F4238j05950j29471P0951O4575L0140J5250K0991M4185k159m1070l1158
10219E22l954k2621j861J5555p55k9871L5475L1123m9310n44L5196m7367k1592
10206f0004J8689o8809M469O7357R4439m2143q891N8634K6398p0634o4847j0392
10194e5734K2940q064l682K876O9171J9923R54N5044J6095j544j737J0207J1272
10181A37721P0650P5650k1690m6985J5024l6094q914J951J2678O1094K9766P8632
10169C69483J32296P8052K4014m3671k3006m3748l7560o417K3456N8614J09025
$$ plain form
10158 640538 791629 883606 881783 788685 660871 554366 446658 372226 319666 349932 446215
10147 446215 476637 567240 616726 569501 481794 404482 337733 251234 244816 278666 273245 250797
10135 250797 243020 253784 251083 233806 194030 218374 251476 234083 153862 134995 163971 172085
10123 172085 134281 136329 101296 135651 102217 87139 48697 36922 6481 -57361 -122254 -94215
10111 -94215 -28711 -48103 -122180 -101772 -50724 -30156 -43769 -65449 -102889 -99711 -73161 -78843
10099 -78843 -51183 27860 16724 -12372 -28766 -42880 -59584 -37163 -37563 -13676 52315 78884
10087 78884 108532 78982 20265 23410 27000 10138 43376 68637 67559 76749 20989 47291
10075 47291 36860 33435 72236 51924 36026 44518 74842 99496 18190 -4484 -4190 7971
$$ packed form
10158F40538J51091R1977j823r3098j27814j06505j07708p4432n2560L0266R6283
10147D46215L0422R0603M9486m7225q7707p7312o6749q6499o418L3850n421k2448
10135B50797p777J0764k701j7277l9776K4344L3102j7393q0221j8867K8976Q114
10123A72085l7804K048l5033L4355l3434j5078l8442j1775l0441o3842o4893K8039
10111i4215O5504j9392p4077K0408N1048K0568j3613k1680l7440L178K6550n682
10099g8843K7660P9043j1136k9096j6394j4114j6704K2421m00K3887O5991K6569
10087G8884K9648k9550n8717L145L590j6862L3238K5261j078R190n5760K6302
10075D7291j0431l425L8801k0312j5898Q492L0324K4654q1306k2674K94J2161
$$ plain form
10063 7971 14228 -11833 -45940 14085 83166 30775 -68348 -45340 -44725 16714 66575 53376
10051 53376 12867 818 16999 57161 39886 11335 -48070 -47230 -25365 -6491 8213 42641
10039 42641 -5418 31896 64691 69262 66840 88602 19811 -26034 -22174 -30966 -16538 23166
10027 23166 5497 -97090 -141017 -130400 -158821 -101576 -84004 -32924 -5188 -36211 4416
10016 4416 34941 44753 32456 5121 -38392 -74667 -48197 -5236 14154 77012 84123 48820
10004 48820 -11539 13687 -3898 64218 67637 24692 -14496 -28899 -49114 -55978 -47525 -39796
9992 -39796 -9190 -7133 -61001 -9517 61380 71192 93732 52886 31016 61419 79764 49913
9980 49913 11506 22928 96518 75389 3310 -29727 -53937 -52311 -30528 22053 40282 24683
$$ packed form
10063G971O257k6061l4107O0025O9081n2391r9123K3008O15O1439M9861j3199
10051E3376m0509j2049J6181M0162j7275k8551n9405Q40K1865J8874J4704L4428
10039D2641m8059L7314L2795M571k422K1762o8791m5845L860q792J4428L9704
10027B3166j7669j02587m3927J0617k8421N7245J7572N1080K7736l1023M0627
10016D416L0525R812j2297k7335m3513l6275K6470M2961J9390O2858P111l5303
10004D8820o0359K5226j7585O8116L419m2945l9188j4403k0215o864Q453P729
9992c9796L0606K057n3868N1484P0897R812K2540m0846k1870L0403J8345k9851
9980D9913l8407J1422P3590k1129p2079l3037k4210J626K1783N2581J8229j5599
$$ plain form
9968 24683 -8038 -66220 -80187 -58648 -79944 -84249 -102351 -67907 -16674 64825 72008 32649
9956 32649 -42539 -71982 -53761 -67059 -75847 -25013 -27933 4284 16159 -18961 -11677 -27678
9944 -27678 4041 -2184 -14972 -44994 -31625 -23064 -68635 -112675 -57740 -88354 -91791 -97735 -100838
9931 -100838 -133988 -112135 -106331 -77348 15812 29739 45932 34403 34631 92923 117389 146535
9919 146535 128510 95251 84401 47619 15199 -54661 -53460 -14097 49636 143544 111326 64863
9907 64863 30202 1466 -31977 -63343 -92202 -86048 -56220 -70457 -83145 -37605 -39403 -60112
9895 -60112 -51139 -105230 -112103 -59990 -4748 -30347 -75375 -106098 -103693 -76817 -46942 -53146 -81427
9882 -81427 -99706 -114984 -61445 -929 33994 50847 55554 68420 21828 -25792 5838 18488
$$ packed form
9968B4683l2721n8182j3967K1539k1296m305j8102L4444N1233Q1499P183l9359
9956C2649p5188k9443J8221j3298q788N0834k920L2217J1875l5120P284j6001
9944b7678L1719o225j2788l0022J3369Q561m5571m4040N4935l0614l437n944l103
9931a00838l3150K1853N804K8983R3160J3927J6193j1529K28N8292K4466K9146
9919A46535j8025l3259j0850l6782l2420o9860J201L9363O3733R3908l2218m6463
9907F4863l4661k8736l3443l1366k8859O154K9828j4237j2688M5540j798k0709
9895f0112Q973n4091o873N2113N5242k5599m5028l0723K405K6876K9875o204k8281
9882h1427j8279j5278N3539O0516L4923J6853M707J2866m6592m7620L1630J2650
$$ plain form
9870 18488 -11473 -38513 -51907 -35944 -14762 -11133 -103659 -166640 -125626 -78470 -112395 -113387
9858 -113387 5302 42858 6662 -18352 30133 41898 -755 -73639 -134272 -116874 -78975
9847 -78975 -58419 -86180 -102492 -84480 27775 19353 8896 -28561 -89861 -91745 -91910 -86000 -90864
9834 -90864 -19493 45906 68968 52263 -8223 -4856 823 58566 55884 -15037 -10345 -37306 -58067
9821 -58067 -38345 -28180 -29024 18039 -22465 4241 10292 -48488 -32410 -19376 -33508 -36543 -47314
9808 -47314 -27237 35964 24238 -6349 21904 12118 -29771 -64632 -22300 -55630 -51459 -24102
9796 -24102 -30712 35405 98098 82464 99168 57467 10970 -23075 -2023 15638 78378 125717
9784 125717 83171 49214 6514 34588 38093 -64373 -116551 -79940 -83369 -97821 -76764 -66077
$$ packed form
9870A8488k9961k7040j3394J5963K1182L629r2526o2981M1014M7156l3925r92
9858a13387J18689L7556l6196k5014M8485J1765m2653p2884o0633J7398L7899
9847g8975K0556k7761j6312J8012J12255q422j0457l7457o1300j884j65N910m864
9834i0864P1371O5399K3062j6705o0486L367N679N7743k682p0921M692k6961k0761
9821e8067J9722J0165q44M7063m0504K6706O051n8780J6078J3034j4132l035j0771
9808d7314K0077O3201j1726l0587K8253r786m1889l4861M2332l3330M171K7357
9796b4102o610O6117O2693j5634J6704m1701m6497l4045K1052J7661O2740M7339
9784A25717m2546l3957m2700K8074L505j02466n2178L6611l429j4452K1057J0687
$$ plain form
9772 -66077 -10755 512 34624 88467 140068 167765 220749 230249 149018 49209 30848 101046
9760 101046 141132 101796 66506 18245 8487 46475 74845 60889 31140 44592 60516 22298
9748 22298 33706 1698 8336 8819 -8251 -54291 -57146 -52286 -45323 12190 -21177 -76844 -48539
9735 -48539 -3025 46950 35072 -6686 -4896 65324 33979 3298 -30925 32462 30120 7857
9723 7857 43825 -3746 -11401 35331 73566 88940 78438 -7765 -10784 -4565 -57503 -45776 -6827
9710 -6827 230 9209 -27095 -19281 -25974 4215 -19973 -78985 -48703 -17713 14888 51589 33495
9697 33495 55507 67237 89711 110062 91880 41796 2993 63253 90595 46433 5054 44590
9685 44590 75262 69812 556 -79830 -50200 -33562 -40479 -6495 -65 -7465 6306 5754 -64768
$$ packed form
9772f6077N5322J1267L4112N3843N1601K7697N2984R500q1231r9809j8361P0198
9760A01046M0086l9336l5290m8261r758L7988K8370j3956k9749J3452J5924l8218
9748B2298J1408l2008O638M83j7070m6040k855M860O963N7513l3367n5667K8305
9735d8539M5514M9975j1878m1758J790P0220l1345l0681l4223O3387k342k2263
9723G857L5968m7571p655M6732L8235J5374j0502q6203l019O219n2938J1727L8949
9710f827P057Q979l6304P814o693L0189k4188n9012L0282L0990L2601L6701j8094
9697C3495K2012J1730K2474K0351j8182n0084l8803O0260K7342m4162m1379L9536
9685D4590L0672n450o9256q0386K9630J6638o917L3984O430p400J3771n52p0522
$$ plain form
9672 -64768 -50848 12125 23064 4165 36541 55466 10435 -34893 -12692 75444 77469 30273
9660 30273 41108 53162 90461 107234 61344 8542 68509 95093 84979 71550 32082 27288
9648 27288 4444 22615 5634 -25862 -27505 41931 72884 84400 35142 36903 47346 28896
9636 28896 39471 31406 -39434 -18358 -27525 12925 37725 33867 -19611 28872 43512 64411
9624 64411 117485 90859 57692 79618 120916 115614 60202 -30558 -83174 -68127 -58697 -17273
9612 -17273 -4640 -48927 -4485 86431 192988 185575 161899 176866 184545 125652 101930 94718
9600 94718 85566 12847 18400 12103 35910 44498 23547 23714 18332 -5195 194 20277 16834 -21667
9586 -21667 13119 39837 107272 150814 97696 62934 63011 64767 85277 163581 217210 191020 94451
$$ packed form
9672f4768J3920O2973J0939j8899L2376J8925m5031m5328K2201Q8136K025m7196
9660C0273J0835J2054L7299J6773m5890n2802N9967K6584j0114j3429l9468m794
9648B7288k2844J8171j6981l1496j643O9436L0953J1516m9258J761J0443j8450
9636B8896J0575q065p0840K1076r167M0450K4800l858n3478M8483J4640K0899
9624F4411N3074k6626l3167K1926M1298n302n5412r0760n2616J5047R430M1424
9612a7273J2633m4287M4442R0916J06557p413k3676J4967P679n8893k3722p212
9600I4718r152p2719N553o297K3807Q588k0951J67n382k3527N389K0083l443l8501
9586b1667L4786K6718O7435M3542n3118l4762P7J756K0510P8304N3629k6190r6569
$$ plain form
9573 94451 37701 28569 53417 9892 22180 4100 -14203 8282 31559 66803 58528 63780
9561 63780 76347 102582 78751 25173 1208 20039 12264 -21602 20267 27008 40168 25870
9549 25870 -57467 -61068 -23810 -17755 43471 4375 26553 78330 109418 140571 101189 116942
9537 116942 127205 103065 89638 55952 64052 77221 100402 85153 -13784 -24145 32773 58371
9525 58371 65538 100998 83054 -11354 -40227 -36738 -12439 45036 117398 20926 -38216 -26155
9513 -26155 -34875 -64807 -81555 -40696 5577 69902 3832 -8247 23114 645 6826 11483
9501 11483 5454 27319 48748 2051 13797 69364 73798 39871 -11248 -4825 28344 6665
9489 6665 -27198 -50643 -36996 -36530 -102783 -138505 -138970 -151214 -124751 -25293 32650 70972 48004
$$ packed form
9573I4451n6750r132K4848m3525J2288j8080j8303K2485K3277L5244q275N252
9561F3780J2567K6235k3831n3578k3965J8831p775l3866M1869O741J3160j4298
9549B5870q3337l601L7258O055O1226l9096K2178N1777L1088L1153l9382J5753
9537A16942J0263k4140j3427l3686Q100J3169K3181j5249r8937j0361N6918K5598
9525E8371P167L5460j7944r4408k8873L489K4299N7475P2362r6472n9142J2061
9513b6155q720k9932j6748M0859M6273O4325o6070j2079L1361k2469O181M657
9501A1483o029K1865K1429m6697J1746N5567M434l3927n1119O423L3169k1679
9489F665l3863k3445J3647M66o6253l5722m65j2244K6463R9458N7943L8322k2968
$$ plain form
9476 48004 7762 8247 63956 64740 -1302 84376 128869 70155 12198 -11018 7542 50869 58596
9463 58596 83328 110549 84101 43896 -11815 24050 17301 6865 -2967 -46508 -61587 -46266
9451 -46266 -19955 35939 53291 10966 557 -397 -43408 -132216 -141108 -102798 -55980 -45858
9439 -45858 -96148 -32397 51293 48242 -24744 -15128 5045 39440 50532 118100 144476 92548
9427 92548 33254 17514 31417 26783 -12842 -49297 -44344 7405 16160 -2938 -29626 102321
9415 102321 160637 128820 106701 64504 52678 55672 27504 107200 119819 92102 82512 115453
9403 115453 79641 58178 70193 62619 36898 -11662 -31514 -97395 -78067 19796 13573 -5303
9391 -5303 25392 36137 46023 34553 9462 -24736 -15697 30024 36714 100437 51849 44347 81650
$$ packed form
9476D8004m0242M85N5709P84o6042Q5678M4493n8714n7957k3216J8560M3327P727
9463E8596K4732K7221k6448m0205n5711L5865o749j0436r832m3541j5079J5321
9451d6266K6311N5894J7352m2325j0409r54m3011q8808q892L8310M6818J0122
9439d5858n0290O3751Q3690l051p2986R616K0173L4395J1092O7568K6376n1928
9427I2548n9294j5740J3903m634l9625l6455M953N1749Q755j9098k6688J31947
9415A02321N8316l1817k2119m2197j1826K994k8168P9696J2619k7717r590L2941
9403A15453l5812k1463J2015p574k5721m8560j9852o5881J9328R7863o223j8876
9391e303L0695J0745R886j1470k5091l4198R039M5721O690O3723m8588p502L7303
$$ plain form
9378 81650 55391 89110 87388 67509 52957 73840 73617 29020 -812 18018 60043 24294
9366 24294 54366 55171 25038 5572 5103 11226 23466 25381 56878 68647 8652 -18115 -23355
9353 -23355 -8384 8278 54503 227 12254 221 -3897 39219 66067 54278 48908 97478
9341 97478 145776 107358 82911 49336 65923 70624 24177 49642 38609 13214 18497 17178
9329 17178 50155 58821 21731 -7218 -45709 -4220 107 3176 -12462 52406 51780 -6378 -36333
9316 -36333 4693 107051 89653 45696 63706 -15584 -30769 -14684 -42839 -49487 -48341 -40813
9304 -40813 -56559 -37001 9540 15713 -25480 -56782 -43410 -38645 -20875 -33207 -23383 17840
9292 17840 39475 7293 -9476 53077 73901 96485 143431 137806 115866 25464 -25444 -28489
$$ packed form
9378H1650k6259L3719j722j9879j4552K0883k23m4597k9832J8830M2025l5749
9366B4294L0072Q05l0133j9466m69O123J2240J915L1497J1769n9995k6767n240
9353b3355J4971J6662M6225n4276J2027j2033m118M3116K6848j1789n370M8570
9341I7478M8298l8418k4447l3575J6587M701m6447K5465j1033k5395N283j319
9329A7178L2977Q666l7090k8949l8491M1489M327L069j5638O4868o26n8158k9955
9316c6333M1026J02358j7398m3957J8010p9290j5185J6085k8155o648J146P528
9304d0813j5746J9558M6541O173m1193l1302J3372M765J7770j2332R824M1223
9292A7840K1635l2182j6769O2553K0824K2584M6946n625k1940r0402n0908l045
$$ plain form
9280 -28489 8018 24625 -10728 -46576 -64366 -61786 -37223 -38668 -90752 -20145 45228 33669
9268 33669 -11940 -33906 19301 36453 -33233 -64058 -6205 -24251 -49798 -52908 -28382 -51508
9256 -51508 -26364 24272 -41861 -75555 -135656 -58926 60410 63439 -10230 3716 48734 -8756
9244 -8756 -47927 -5223 -21563 -33843 6324 45647 -10332 -32971 -15847 77239 99500 133016
9232 133016 89012 -3401 -82027 -30209 40418 29337 79090 114098 103799 22109 27506 28521
9220 28521 59862 35682 -15380 5666 -11106 4849 37267 67512 82941 85301 95631 70007
9208 70007 7035 -44372 -102049 -115671 -128291 -87780 -95554 -100360 -71497 -65471 -111389 -73706
9196 -73706 -8385 24651 2780 -268 32795 -43161 -46104 -180 16514 -49443 -105841 -68343
$$ packed form
9280b8489L6507J6607l5353l5848j7790K580K4563j445n2084P0607O5373j1559
9268C3669m5609k1966N3207J7152o9686l0825N7853j8046k5547l110K4526k3126
9256e1508K5144N0636o6133l3694o0101P6730J19336L029p3669J3946M5018n7490
9244h756l9171M2704j6340j2280M0167L9323n5979k2639J7124R3086K2261L3516
9232A33016m4004r2413p8626N1818P0627j1081M9753L5008j0299q1690N397J015
9220B8521L1341k4180n1062K1046j6772J5955L2418L0245J5429K360J0330k5624
9208G0007o2972n1407n7677j3622j2620M0511p774m806K8863O026m5918L7683
9196g3706O5321L3036k1871l048L3063p5956k943M5924J6694o5957n6398L7498
$$ plain form
9184 -68343 -64843 -45103 -48319 -46584 -21149 -53516 5483 25371 -47275 -1471 60944 68834 44113
9171 44113 14673 46235 555 -34168 -26444 -47865 -56586 -30716 41740 55212 75392 75965 24667
9158 24667 -29175 -34586 3693 45691 47883 8273 5682 69689 65558 14026 -398 -40698 -119367
9145 -119367 -42426 913 35149 64652 108044 78224 33500 82181 101843 86615 100716 54376
9133 54376 50805 63978 34134 10673 11221 68415 26113 -6129 -8420 -27700 62204 141401 158293
9120 158293 85634 25991 63511 72001 41236 -4925 -6804 -28502 -31002 -48410 -47832 -72186 -79628
9107 -79628 -30296 -8315 -40763 -44188 -32668 -8054 99166 140793 57732 9891 5340 36098
9095 36098 22079 7624 29436 49147 86145 43597 11624 59048 113967 81273 76281 16788
$$ packed form
9184f8343L500J9740l216J735K5435l2367N8999J9888p2646M5804O2415P890k4721
9171D4113k9440L1562m5680l4723P724k1421q721K5870P2456J3472K0180N73n1298
9158B4667n3842n411L8279M1998K192l9610k591O4007m131n1532j4424m0300p8669
9145a19367P6941M3339L4236K9503M3392k9820m4724M8681J9662j5228J4101m6340
9133E4376l571J3173k9844k3461N48N7194m2302l2242k291j9280Q9904P9197J6892
9120A58293p2659n9643L7520Q490l0765m6161j879k1698k500j7408N78k4354p442
9107g9628M9332K1981l2448l425J1520K4614J07220M1627q3061m7841m551L0758
9095C6098j4019j4455K1812J9711L6998m2548l1973M7424N4919l2694m992n9493
$$ plain form
9083 16788 17083 72451 131885 102347 40139 35273 78434 2587 -5063 -20630 -29182 -58393 -96377
9070 -96377 -102978 -94927 -87595 -27045 55923 80321 56148 7418 -8561 -17876 5132 63637 85651
9057 85651 83611 131048 72062 8012 -17268 -52253 -45452 -38538 21972 41814 40464 28921 1973
9044 1973 10107 -31481 -9097 101573 145834 124493 114460 106979 46881 -55420 -21814 27426
9032 27426 50483 69646 71563 77939 95328 88156 87549 48032 76913 127182 121272 105040 127562
9019 127562 68623 -3228 -50285 -62250 -300 -26123 -65934 -63256 -65080 15056 -12598 -16315
9007 -16315 1096 -6895 13916 64689 95967 47106 4691 -11789 -61609 -65722 -103650 -130953
8995 -130953 -132705 -103250 -44390 -5181 35440 43953 40929 28962 -31817 -51119 -50859 -65702 -55203
$$ packed form
9083A6788K95N5368N9434k9538o2208m866M3161p5847p650j5567q552k9211l7984
9070i6377o601Q051P332O0550Q2968K4398k4173m8730j5979r315K3008N8505K2014
9057H5651k040M7437n8986o4050k5280l4985O801O914O0510J9842j350j1543k6948
9044A973Q134m1588K2384J10670M4261k1341j0033p481o0098j02301L3606M9240
9032B7426K3057J9163J917O376J7389p172o07l9517K8881N0269n910j6232K2522
9019A27562n8939p1851m7057j1965O1950k5823l9811K678j824Q0136k7654l717
9007a6315J7411p991K0811N0773L1278m8861m2415j6480m9820m113l7928k7303
8995a30953j752K9455N8860L9209M0621Q513l024j1967o0779j9302K60j4843J0499
$$ plain form
8982 -55203 3562 -42008 -31216 -16040 13276 15558 -10129 32521 39138 14029 1917 -8091
8970 -8091 -4350 51252 66206 47588 6251 48701 14999 28366 92077 105571 108901 31141
8958 31141 -21676 -24080 64315 74702 27591 32996 32629 33171 63967 54875 24731 -13945 -51538
8945 -51538 29419 60479 -4023 -30863 22899 57733 81088 100982 34200 -1577 -20216 -30488
8933 -30488 -75477 -48249 22846 5758 7247 -3414 60321 80221 60487 147724 132886 61192
8921 61192 -48013 -11015 89481 63703 20153 -3784 -26837 -19722 46214 89802 31533 79187
8909 79187 84986 60710 75524 107610 90594 33396 -29612 -23966 6046 -21755 15268 37513
8897 37513 54058 13932 -28447 -125708 -88083 31134 30869 52537 42851 -19069 -23769 8500
$$ packed form
8982e5203N8765m5570J0792J5176K9316K282k5687M2650O617k5109j2112j0008
8970h091L741N5602J4954j8618m1337M2450l3702J3367O3711J3494L330p7760
8958C1141n2817k404Q8395J0387m7111N405l67N42L0796r092l0144l8676l7593
8945e1538Q0957L1060o4502k6840N3762L4834K3355J9894o6782l5777j8639j0272
8933c0488m4989K7228P1095j7088J489j0661O3735J9900j9734Q7237j4838p1694
8921F1192j09205L6998J00496k5778m3550k3937k3053P115O5936M3588n8269M7654
8909G9187N799k4276J4814L2086j7016n7198o3008N646L0012k7801L7023K2245
8897C7513J6545m0126m2379r7261L7625J19217k65K1668r686o1920m700L2269
$$ plain form
8885 8500 -25912 -31695 59403 115714 93809 50903 69396 109775 125890 95185 45455 23170
8873 23170 14911 -26631 -28767 25688 17038 25313 3810 28676 44554 7366 -22281 -33444 4461
8860 4461 25913 -51262 -11613 70313 98671 96507 102275 95300 60853 53679 57268 94992 47629
8847 47629 57566 109134 97875 27484 -25833 -42083 -21613 37052 73286 103843 114213 125151
8835 125151 86451 32374 74672 103118 107693 166834 143958 46278 -65965 -14192 19551 18458
8823 18458 39106 70188 -22814 7931 33094 -9986 -36024 33192 51822 91130 165191 134249
8811 134249 53548 38991 89014 96534 134770 113631 86958 58968 76325 46179 50315 63936
8799 63936 82641 58264 -1658 35647 75852 20231 50419 102997 155336 103459 63881 55080
$$ packed form
8885H500l4412n783R1098N6311k1905m2906J8493M0379J6115l0705m9730k2285
8873B3170q259m1542k136N4455q650Q275k1503K4866J5878l7188k9647j1163L7905
8860D461K1452p7175L9649Q1926K8358k164N768o975l4447p174L589L7724m7363
8847D7629R937N1568j1259p0391n3317j6250K0470N8665L6234L0557J0370J0938
8835A25151l8700n4077M2298K8446M575N9141k2876r7680j12243N1773L3743j093
8823A8458K0648L1082r3002L0745K5163m3080k6038O9216J8630L9308P4061l0942
8811A34249q0701j4557N0023P520L8236k1139k6673k7990J7357l0146M136J3621
8799F3936J8705k4377n9922L7305M0205n5621L0188N2578N2339n1877l9578q801
$$ plain form
8787 55080 138771 129704 48112 38674 -13867 27976 45975 24041 77835 37245 -7039 16447
8775 16447 52947 102530 86645 76275 88445 100951 85851 111975 95307 181775 227664 153563
8763 153563 64814 59246 -18919 -65416 -57453 -18421 -32748 -15696 30655 73449 85035 85751
8751 85751 117192 111202 59706 13832 11995 50702 59059 83883 42475 -2656 38398 35185 -41186
8738 -41186 -23743 11067 11711 13132 23430 32585 44079 74132 62867 55156 98826 167503 101474
8725 101474 22119 26228 8448 51364 152439 60042 -27585 27328 96573 85098 54890 107728
8713 107728 56871 27295 -8797 -49102 -10232 16016 30716 73659 105668 148872 118321 63850
8701 63850 44051 55156 106179 59242 27703 41870 24319 26364 33790 56099 73664 76857
$$ packed form
8787E5080Q3691r067q1592r438n2541M1843J7999k1934N3794m0590m4284K3486
8775A6447L6500M9583j5885j0370J2170J2506j5100K6124j6668Q6468M5889p4101
8763A53563q8749n568p8165m6497P963L9032j4327J7052M6351M2794J1586P16
8751H5751L1441n990n1496m5874j837L8707Q357K4824m1408m5131M1054l213p6371
8738d1186J7443L4810O44J421J0298R155J1494L0053j1265p711M3670O8677o6029
8725A01474p9355M109j7780M2916J01075r2397q7627N4913O9245j1475l0208N2838
8713A07728n0857k9576l6092m0305L8870K6248J4700M2943L2009M3204l0551n4471
8701F3850j9799J1105N1023m6937l1539J4167j7551K045P426K2309J7565L193
$$ plain form
8689 76857 57417 69604 15363 -53059 -19244 11138 1161 7953 52040 112615 156052 119177
8677 119177 26235 -22447 -60455 -76193 -16090 41393 65407 95062 37339 9306 -4158 -29369
8665 -29369 17629 31875 95064 127378 106743 55344 45745 261 2770 57225 88292 52550
8653 52550 40085 61588 76277 98688 97793 105101 64074 32084 9942 24948 23841 21789 97075
8640 97075 136620 152624 112208 16273 -44987 21266 47849 81304 110222 154711 177671 170205
8628 170205 205332 278342 278309 219196 185725 114384 77297 21902 886 -12402 -16975 32290
8616 32290 92966 166836 173076 214381 183895 104071 63819 85722 86770 55578 71268 85596
8604 85596 94117 65354 2529 -8969 59570 100149 101559 126066 108956 89206 94599 119297
$$ packed form
8689G6857j9440J2187n4241o8422L3815L0382r977O792M4087O0575M3437l6875
8677A19177r2942m8682l8008j5738O0103N7483K4014K9655n7723k8033j3464k5211
8665b9369M6998J4246O3189L2314k0635n1399r599m5484K509N4455L1067l5742
8653E2550j2465K1503J4689K2411q95P308m1027l1990k2142J5006j107k052P5286
8640I7075L9545J6004m0416r5935o1260O6253K6583L3455K8918M4489K2960p466
8628A70205L5127P3010l3n9113l3471p1341l7087n5395k1016j3288m573M9265
8616C2290O0676P3870O240M1305l0486p9824m0252K1903J048l1192J5690J4328
8604H5596Q521k8763o2825j1498O8539M0579J410K4507j7110j9750N393K4698
$$ plain form
8592 119297 90314 112164 153874 148951 34070 7995 21674 90657 156057 158521 164355 154660
8580 154660 148695 178391 173913 182944 141012 88813 30228 -3251 10266 109967 77087 19929
8568 19929 79259 104597 105300 52868 31819 48551 98441 90183 105505 124969 119559 102497 119661
8555 119661 146261 100106 93885 64726 54566 68680 54442 15307 11875 8434 -3291 3942
8543 3942 56404 99031 134898 129120 70247 88600 109137 36273 -56775 -63397 -7178 53139
8531 53139 127233 90749 20364 35923 95560 107156 78625 109089 48391 21407 78368 104741
8519 104741 136708 122330 63382 115805 110233 69967 32526 51384 108715 147491 160742 196417
8507 196417 152046 73733 93955 73210 8752 117325 183628 148054 64832 93934 121386
$$ packed form
8592A19297k8983K1850M1710m923j14881k6075J3679O8983O5400K464N834r695
8580A54660n965K9696m478R031m1932n2199n8585l3479J3517R9701l2880n7158
8568A9929N9330K5338P03n2432k1049J6732M9890q258J5322J9464n410j7062J7164
8555A19661K6600m6155o221k9159j0160J4114j4238l9135l432l441j1725P233
8543C942N2462M2627L5867n778n8873J8353K0537p2864r3048o622N6219O0317
8531E3139P4094l6484p0385J5559N9637J1596k8531L0464o0698k6984N6961K6373
8519A04741L1967j4378n8948N2423n572m0266l7441J8858N7331L8776J3251L5675
8507A96417m4371p8313K0222k0745o4458J08573O6303l5574q3222K9102K7452
$$ plain form
8496 121386 106230 152229 161301 167626 209022 135962 42748 58719 113154 116768 112056 162393
8484 162393 94972 78566 104016 110070 149900 151029 146048 159141 136722 127199 142474 175422
8472 175422 199847 158960 153872 145839 87685 31305 -2199 5490 69566 155663 184053 147603
8460 147603 113988 54961 15169 -5865 -5791 -20343 -11520 18552 -7746 -15130 47143 24070 -15382
8447 -15382 -66360 13989 137454 110800 59678 108655 109655 75973 77031 134573 104196 75760
8435 75760 124588 136386 125256 101271 65093 49998 96772 122691 80056 71266 91224 72783
8423 72783 82088 51580 82383 105041 142579 111346 105175 76038 44451 55016 87269 121897
8411 121897 154718 104739 120577 220995 234847 212003 198666 224391 237136 177210 150771
$$ packed form
8496A21386j5156M5999R072O325M1396p3060r3214J5971N4435L614m712N0337
8484A62393o7421j6406K5450O054L9830J129m981J3093k2419r523J5275L2948
8472A75422K4425m0887n088q033n8154n6380l3504P689O4076Q6097K8390l6450
8460A47603l3615n9027l9792k1034P4j4552Q823L0072k6298p384O2273k3073l9452
8447a5382n0978Q0349J23465k6654n1122M8977J000l3682J058N7542l0377k8436
8435G5760M8828J1798j1130k3985l6178j5095M6774K5919m2635q790J9958j8441
8423G2783R305l0508L0803K2658L7538l1233o171k9137l1587J0565L2253L4628
8411A21897L2821m9979J5838J00418J3852k2844j3337K5725J2745n9926k6439
$$ plain form
8400 150771 141935 45917 61255 90269 57674 133234 130391 131722 204211 195576 162653 131679
8388 131679 90121 46667 6269 62833 127222 144891 167045 135846 143238 174972 178759 156260
8376 156260 113016 36989 73753 137181 184004 152387 61280 82240 140944 134116 159716 182824
8364 182824 215702 175268 168776 211648 215824 172220 170283 183145 142859 227352 200955 135680
8352 135680 71534 169185 132545 97277 32418 14064 117440 165096 121753 109445 103388 128711
8340 128711 97088 90298 93451 113469 138472 75236 24356 107307 142445 95945 140408 222149
8328 222149 260204 293137 315696 231656 202501 247853 298630 280367 208660 205970 225033 233747
8316 233747 149400 107239 29042 76415 191416 199502 157292 168026 276896 278724 232331 219854
$$ packed form
8400A50771q836r6018J5338K9014l2595P5560k843J331P2489q635l2923l0974
8388A31679m1558m3454m0398N6564O4389J7669K2154l1199P392L1734L787k2499
8376A56260m3244p6027L6764O3428M6823l1617r1107K0960N8704o828K5600K3108
8364A82824L2878m0434o492M2872M176m3604j937J2862m0286Q4493k6397o5275
8352A35680o4146R7651l6640l5268o4859j8354J03376M7656m3343j2308o057K5323
8340A28711l1623o790L153K0018K5003o3236n0880Q2951L5138m6500M4463Q1741
8328B22149L8055L2933K2559q4040k9155M5352N0777j8263p1707k690J9063Q714
8316B33747q4347m2161p8197M7373J15001Q086m2210J0734J08870J828m6393j2477
$$ plain form
8304 219854 177662 180228 156187 142655 163941 170146 223635 251750 222080 219320 203003 236780
8292 236780 295336 249609 212078 200447 182722 153898 169239 232813 200686 206787 225152 246940
8280 246940 175045 233949 233037 245268 187728 111607 153180 167639 199769 252518 234385 227859
8268 227859 228677 255882 206120 169207 203357 208642 209634 179054 187933 257301 319302 321665 350012
8255 350012 393159 422787 383594 352082 261929 200803 133382 161796 142169 120552 142754 212910
8243 212910 270350 313092 263850 166805 112055 183139 241816 249980 174429 179909 209046 217053
8231 217053 170900 168007 186853 196766 182425 166864 188510 225164 221862 211753 235791 297157
8219 297157 245711 227359 263232 334922 274159 267528 350725 345570 285879 261951 315168 378530
$$ packed form
8304B19854m2192K566k4041j3532K1286O205N3489K8115k9670k760j6317L3777
8292B36780N8556m5727l7531j1631j7725k8824J5341O3574l2127O101J8365K1788
8280B46940p1895N8904r12J2231n7540p6121M1573J4459L2130N2749j8133o526
8268B27859Q18K7205m9762l6913L4150N285R92l0580Q879O9368O2001K363K8347
8255C50012M3147K9628l9193l1512r0153o1126o7421K8414j9627k1617K2202P0156
8243B12910N7440M2742m9242r7045n4750P1084N8677Q164p5551N480K9137Q007
8231B17053m6153k893J8846R913j4341j5561K1646L6654l302j0109K4038O1366
8219B97157n1446j8352L5873P1690o0763o631Q3197n155n9691k3928N3217O3362
$$ plain form
8207 378530 332620 258455 147102 140079 217887 258132 217892 191655 199311 194083 136021 124769
8195 124769 133605 166008 218244 249160 257054 285696 162088 58064 124774 209427 208856 237898
8183 237898 252948 227891 239562 245727 228711 241293 212729 165840 196120 165086 127000 181040
8171 181040 168936 145324 155065 86459 85749 85354 113741 122912 153784 135751 52441 47214 117442
8158 117442 108200 85431 118317 166303 117232 107426 150398 192522 176195 158851 159495 196481
8146 196481 105232 44995 94421 155351 171262 215663 209337 191239 138767 107978 58995 111851
8134 111851 154879 127275 150399 146322 105262 84915 123307 177369 230439 175003 80188 128484
8122 128484 133666 127352 93622 106614 80026 39365 61129 106961 111851 61722 90633 132392
$$ packed form
8207C78530m5910p4165j11353p023P7808M0245m0240k6237P656n228n8062j1252
8195A24769Q836L2403N2236L0916P894K8642j23608j04024O6710Q4653n71K9042
8183B37898J5050k5057J1671O165j7016J2582k8564m6889L0280l1034l8086N4040
8171A81040j2104k3612R741o8606p10l95K8387R171L0872j8033q3310n227P0228
8158A17442r242k2769L2886M7986m9071r806M2972M2124j6327j7344O44L6986
8146A96481r1249o0237M9426O0930J5911M4401o326j8098n2472l0789m8983N2856
8134A11851M3028k7604K3124m077m1060k0347L8392N4062N3070n5436r4815M8296
8122A28484N182o314l3730J2992k6588m0661K1764M5832M890n0129K8911M1759
$$ plain form
8110 132392 156814 131782 71254 38149 11569 66292 88999 71197 36097 12759 22586 47003
8098 47003 17427 -2305 10611 -24775 26015 103279 94536 29878 41305 14983 -2948 26747
8086 26747 -6675 -25833 -40512 -31203 -28530 18475 121557 76055 99261 109631 81613 44145
8074 44145 32055 35047 42142 40252 25395 -69487 -80483 -8144 70701 164587 149662 105215
8062 105215 144313 125668 117351 36375 -6693 37267 28071 35312 47755 28344 977 43269
8050 43269 42607 32476 60619 49638 67693 84314 80081 98484 68484 44654 -5853 18427
8038 18427 92497 103726 91291 53874 34820 42008 68626 14757 -14959 22333 105704 139413
8026 139413 130606 147297 115756 83745 47285 19000 33714 35928 2139 -219 49540 74137
$$ packed form
8110A32392K4422k5032o0528l3105k6580N4723K2707j7802l5100k3338R827K4417
8098D7003k9576j9732J2916l5386N0790P7264q743o4658J1427k6322j7931K9695
8086B6747l3422j9158j4679R309K673M7005J03082m5502K3206J0370k8018l7468
8074D4145j2090K992P095j890j4857r4882j0996P2339P8845R3886j4925m4447
8062A05215L9098j8645q317q0976m3068M3960r196P241J2443j9411k7367M2292
8050D3269o62j0131K8143j0981J8055J6621m233J8403l0000k3830n0507K4280
8038A8427P4070J1229j2435l7417j9054P188K6618n3869k9716L7292Q3371L3709
8026A39413q807J6691l1541l2011l6460k8285J4714K214l3789k358M9759K4597
$$ plain form
8014 74137 92746 54592 430 12724 67205 88713 29097 30052 18861 3309 -1408 -21819
8002 -21819 20160 61858 88781 64850 27830 -22537 -35473 -28481 -46105 -41159 40504 80549
7990 80549 59597 50143 15577 -28946 -67104 -49939 -29019 -31059 -27651 -9925 26236 31064 35893
7977 35893 97983 63395 22106 -17356 -3660 -22698 25903 47750 45960 82055 128552 79668
7965 79668 8683 67705 43076 32540 95641 35641 -6299 22324 29217 45750 24193 29027
7953 29027 -20708 -33455 -44463 -48074 25811 86203 90170 77881 -34271 -78468 -101658 -60716
7941 -60716 -28610 5745 49762 11229 -3597 2957 -20 32075 50959 35944 2722 -12603
7929 -12603 -17428 -55680 -68971 -87340 -51627 -18876 26105 42951 60019 78463 40435 -33428
$$ packed form
8014G4137J8609l8154n4162J2294N4481K1508n9616R55j1191j5552m717k0411
8002b1819M1979M1698K6923k3931l7020n0367j2936O992j7624M946Q1663M0045
7990H0549k0952r454l4566m4523l8158J7165K0920k040L408J7726L6161M828M829
7977C5893O2090l4588m1289l9462J3696j9038M8601K1847j790L6095M6497m8884
7965G9668p0985N9022k4629j0536O3101o0000m1940K8623O893J6533k1557M834
7953B9027m9735j2747j1008l611P3885O0392L967j2289j12152m4197k3190M0942
7941f0716L2106L4355M4017l8533j4826O554k977L2095J8884j5015l3222j5325
7929a2603m825l8252j3291j8369L5713L2751M4981J6846J7068J8444l8028p3863
$$ plain form
7917 -33428 -7496 30589 78114 52839 25477 51696 33434 -5341 -19584 -34216 2813 51718
7905 51718 44157 24188 -12509 27692 65623 80448 69320 28768 79917 112000 109648 -13992
7893 -13992 -12936 -19787 21434 25424 8438 36404 75194 95510 -8753 -91354 -127400 -77805
7881 -77805 2352 926 38212 74459 57325 34006 -16212 3641 15794 72467 100012 60366
7869 60366 53822 11703 14098 8182 -2994 -23963 -28701 -44565 -50479 -18867 56628 56582 47135 -24392
7855 -24392 -33773 3574 -248 -642 -33063 -62870 -70217 -2521 27254 -15639 -82527 -71121 -17971
7842 -17971 -73467 -92598 -62998 -33972 -27110 -65042 -45643 -20564 -12572 38386 81432 129263
7830 129263 85486 35974 6130 24240 45154 31223 -145 66462 53416 10485 -976 -24631
$$ packed form
7917c3428K5932L8085M7525k5275k7362K6219j8262l8775j4243j4632L7029M8905
7905E1718p561j9969l6697M0201L7931J4825j1128m0552N1149L2083k352j23640
7893a3992J056o851M1221L990j6986K7966L8790K0316j04263q2601l6046M9595
7881g7805Q0157j426L7286L6247j7134k3319n0218J9853J2153N6673K7545l9646
7869F0366o544m2119K395n916j1176k0969m738j5864n914L1612P5495m6r447p1527
7855b4392r381L7347l822l94l2421k9807p347O7696K9775m2893o6888J1406N3150
7842a7971n5496j9131K9600K9026O862l7932J9399K5079P992N0958M3046M7831
7830A29263m3777m9512k9844J8110K0914j3931l1368O6607j3046m2931j1461k3655
$$ plain form
7818 -24631 -36165 -17861 9825 -3809 -56770 -25953 -33312 -16812 -7207 58270 129004 73587
7806 73587 27560 79650 26118 -39008 -49998 21845 51366 34669 40607 78103 141953 98463
7794 98463 59151 -1901 -3970 -21298 29506 8724 -48597 -53519 -48854 -25019 5072 16817
7782 16817 89603 35804 10049 -9797 29564 25627 34044 60950 89216 62063 -6304 -36878
7770 -36878 -17136 -52985 -42512 -74382 -68563 -99404 -22976 10554 3420 -18314 -99149 -92518
7758 -92518 -11681 3812 -2843 10180 32665 25901 44197 93318 33310 6685 38982 117398
7746 117398 150837 131007 92013 109301 108881 141148 163358 176336 180341 175314 125390 80206
7734 80206 11079 -1747 23359 4683 36804 72199 60714 29499 22833 -34587 -66132 -73370
$$ packed form
7818b4631j1534J8304K7686j3634n2961L0817p359J6500R605O5477P0734n5417
7806G3587m6027N2090n3532o5126j0990P1843K9521j6697N938L7496O3850m3490
7794I8463l9312o1052k069j7328N0804k0782n7321m922M665K3835L0091J1745
7782A6817P2786n3799k5755j9846L9361l937Q417K6906K8266k7153o8367l0574
7770c6878J9742l5849J0473l1870N819l0841P6428L3530p134k1734q0835O631
7758i2518Q0837J5493o655J3023K2485o764J8296M9121o0008k6625L2297P8416
7746A17398L3439j9830l8994J7288m20L2267K2210J2978M005n027m9924m5184
7734H0206o9127j2826K5106j8676L2121L5395j1485l1215o666n7420l1545p238
$$ plain form
7722 -73370 -56280 -33701 -6227 -16148 15816 20249 72592 152329 102054 62132 58198 -144
7710 -144 -43222 -23174 -23464 -29083 -750 54797 63387 55579 -2344 -19527 -24177 -45633 -73860
7697 -73860 -6626 -45773 -55728 -37570 20271 87055 54456 8515 22894 72028 39403 33370
7685 33370 22365 58311 73462 80573 101832 83358 21720 24206 56785 38002 -24149 -30966
7673 -30966 86873 120572 147562 63800 -4920 -80553 -47134 24414 99977 120990 86216 116990
7661 116990 19074 -81363 -5221 52648 21286 -27219 -14059 8549 9212 3237 95960 130083
7649 130083 107252 14668 36286 111399 103881 83359 54593 28501 -46161 -61479 -25313 -4373
7637 -4373 -21589 -34801 -27486 -49876 -159091 -92219 18235 8124 -2626 -5311 -50535 -24550
$$ packed form
7722g3370J7090K2579K7474r921L1964M433N2343P9737n0275l9922l934n8342
7710a44m3078K0048k90n619K8333N5547Q590p808n7923j7183m650k1456k8227
7697g3860O7234l9147r955J8158N7841O6784l2599m5941J4379M9134l2625o033
7685C3370j1005L5946J5151P111K1259j8474o1638K486L2579j8783o2151o817
7673c0966J17839L3699K6990q3762o8720p5633L3419P1548P5563K1013l4774L0774
7661A16990r7916j00437P6142N7869l1362m8505J3160K2608O63n975R2723L4123
7649A30083k2831r2584K1618P5113p518k0522k8766k6092p4662j5318L6166K0940
7637d373j7216j3212P315k2390j09215O6872J10454j0111j0750k685m5224K5985
$$ plain form
7625 -24550 -10239 48169 68302 59653 49168 44894 77559 61390 16740 -25360 5215 16017
7613 16017 14866 35348 3554 3604 -52198 -51345 -21992 54921 106749 135397 121617 80433 63053
7600 63053 58951 80317 84751 54890 70594 58455 75541 70422 59332 36213 10954 48910
7588 48910 115291 172016 166993 184385 190823 160341 90323 94273 121856 93862 46628 23425
7576 23425 422 -21385 -32659 -21188 -20032 -47622 -61228 -77503 -78707 -3251 91987 122473
7564 122473 103785 82786 34453 38903 104675 138516 110209 92997 144318 163395 109075 71440
7552 71440 -26037 -38653 -41299 1510 -41635 -125904 -100342 -30338 -21152 -48119 -137217 -130895
7540 -130895 -118716 -134736 -83292 -29208 -38435 -67969 -6298 -1611 -14490 -26553 37133 73377
$$ packed form
7625b4550J4311N8408K0133q649j0485m274L2665j6169m4650m2100L0575J0802
7613A6017j151K0482l1794N0n5802Q53K9353P6913N1828K8648j3780m1184j7380
7600F3053m102K1366M434k9861J5704j2139J7086n119j1090k3119k5259L7956
7588D8910O6381N6725n023J7392O438l0482p0018L950K7583k7994m7234k3203
7576B3425k3003k1807j1274J1471J156k7590j3606j6275j204P5456R5238L0486
7564A22473j8688k0999m8333M450O5772L3841k8307j7212N1321J9077n4320l7635
7552G1440r7477j2616k646M2809m3145q4269K5562P0004R186k6967q9098O322
7540a30895J2179j6020N1444N4084r227k9534O1671M687j2879j2063O3686L6244
$$ plain form
7528 73377 53682 43162 65212 86813 101874 67390 61042 38184 33318 -10040 36909 89893
7516 89893 120060 156745 125774 84830 115806 114470 48458 14026 27651 -3039 -2395 58614
7504 58614 146457 123909 37799 -45850 5077 93256 97809 77334 59204 -19999 -49296 -14716
7492 -14716 24293 56779 37379 63665 70793 69220 42786 9438 16585 5889 59443 114415
7480 114415 123117 39462 16820 4999 -13234 -4256 4586 28803 -36108 -119724 -134201 -66262
7468 -66262 -30962 -39043 -17877 -108669 -171674 -147224 -93995 -91528 -61679 -11617 22014 7907
7456 7907 -19322 -24685 -61541 -151741 -162512 -81041 -35277 -44897 -48280 -14796 -13355 -102453 -146571
7443 -146571 -166313 -27497 23151 22692 16983 15054 -24017 -9324 56632 56920 78195 65627 55659
$$ packed form
7528G3377j9695j0520K2050K1601J5061l4484o348k2858m866m3358M6949N2984
7516H9893L0167L6685l0971m0944L0976j336o6012l4432J3625l0690O44O1009
7504E8614Q7843k2548q6110q3649N0927Q8179M553k0475j8130p9203k9297L4580
7492a4716L9009L2486j9400K6286P128j573k6434l3348P147j0696N3554N4972
7480A14415Q702q3655k2642j1821j8233Q978Q842K4217o4911q3616j4477O7939
7468f6262L5300q081K1166r0792o3005K4450N3229K467K9849N0062L3631j4107
7456G907k7229n363l6856r0200j0771Q1471M5764r620l383L3484J441q9098m4118
7443a46571j9742J38816N0648m59n709j929l9071J4693O5956K88K1275j2568r968
$$ plain form
7430 55659 49833 48688 -11948 -73884 -74037 -68946 -106714 -105458 -75659 -48901 1996 4396 31608
7417 31608 5295 -38425 -20564 8050 54130 64277 65487 59193 68687 95031 124358 88752
7405 88752 63100 85823 90688 126606 79775 -176 47523 74472 80226 56223 55325 69976 9415
7392 9415 -55585 -73485 19525 38704 71989 51310 22231 -22311 -37561 -24253 -7055 16505
7380 16505 33160 75255 81807 26906 24941 29607 5434 -27682 -75574 -51901 -39406 11579
7368 11579 -25946 -145709 -150356 -94977 -104923 -92088 -41804 -22004 527 58342 91238 13135
7356 13135 -72534 -81761 -30837 18765 -11533 -5484 6212 33445 97132 101088 66473 52812
7344 52812 64673 -83926 -154289 -92101 -25542 10621 25807 17091 88994 95978 93330 125034
$$ packed form
7430E5659n826j145o0636o1936j53N091l7768J256K9799K6758N0897K400K7212
7417C1608k6313m3720J7861K8614M6080J0147J210o294R494K6344K9327l5606
7405H8752k5652K2723M865L5918m6831p9951M7699K6949N754k4003q98J4651o0561
7392I415o5000j7900R3010J9179L3285k0679k9079m4542j5250J3308J7198K3560
7380A6505J6655M2095O552n4901j965M666k4173l3116m7892K3673J2495N0985
7368A1579l7525j19763m647N5379r946J2835N0284J9800K2531N7815L2896p8103
7356A3135q5669r227N0924M9602l0298O049J1696K7233O3687L956l4615j3661
7344E2812J1861j48599p0363O2188O6559L6163J5186q716P1903O984k648L1704
$$ plain form
7332 125034 62996 37203 86392 95139 32912 -52727 -52779 -57473 -74584 -2518 40245 -20327 -32329
7319 -32329 12264 17766 13021 -1353 5640 -3058 85 -11320 66956 83443 -4362 -66349 -47486
7306 -47486 -8935 14666 -8134 -9855 84036 40262 3728 14567 -28597 -66685 -27592 -15297
7294 -15297 -43964 -70834 -66165 -71175 -55626 -18461 -36066 -35482 -40949 -13938 -33417 -5591 52549
7281 52549 69009 35047 52876 83967 119921 73546 7853 21179 74499 74705 10312 -24751
7269 -24751 -37126 -44464 -35864 24526 36441 27615 -39119 -80882 -87856 -32882 19068 -6186 -55308
7256 -55308 5839 -2001 693 55517 14436 -60195 -102446 -68203 -47742 -37033 -58916 -39340
7244 -39340 -54930 -51079 -30603 -117125 -151027 -128798 -67607 6568 31009 38354 10782 -51799
$$ packed form
7332A25034o2038k5793M9189Q747o2227q5639n2m694j7111P2066M2763o0572j2002
7319c2329M4593N502m745j4374O993q698L143j1405P8276J6487q7805o1987J8863
7306d7486L8551K3601k2800j721R3891m3774l6534J0839m3164l8088L9093J2295
7294a5297k8667k6870M669n010J5549L7165j7605N84n467K7011j9479K7826N8140
7281E2549J6460l3962J7829L1091L5954m6375o5693J3326N3320K06o4393l5063
7269b4751j2375p338Q600O0390J1915q826o6734m1763o974N4974N1950k5254m9122
7256e5308O1147p840K694N4824m1081p4631m2251L4243K0461J0709k1883J9576
7244c9340j5590L851K0476q6522l3902K2229O1191P4175K4441P345k7572o2581
$$ plain form
7232 -51799 -78941 -3585 54509 78770 86609 77083 91160 101492 100227 79331 53627 -16150
7220 -16150 -28726 -40424 -56481 -28590 35509 48104 -4392 7799 14900 33201 -12202 -23895
7208 -23895 3298 55953 58366 51218 56900 73628 128258 60639 15112 13993 62393 68155 61979
7195 61979 68316 102041 77937 32052 35993 75022 66069 -101 -55867 -81492 -81564 -94731 -54622
7182 -54622 -36271 -37229 -16772 -41144 -42092 -35473 -5426 6493 -35227 -62430 -8450 3723 -7423
7169 -7423 16087 28318 -7418 -45118 -54800 -47209 -71574 -75452 -144521 -137656 -14341 66360 23612
7156 23612 -42762 -69262 5547 36894 -29050 -17080 12958 29193 -17312 -15677 51885 61258
7144 61258 -32102 -92957 -38087 -3046 -45363 11944 2952 -57032 -122007 -99553 -94281 -86857
$$ packed form
7232e1799k7142P5356N8094K4261P839r526J4077J0332j265k0896k5704o9777
7220a6150j2576j1698j6057K7891O4099J2595n2496J2191P101J8301m5403j1693
7208b3895K7193N2655K413p148N682J6728N4630o7619m5527j119M8400N762o176
7195F1979O337L3725k4104m5885L941L9029q953o6170n5766k5625p2j3167M0109
7182e4622J8351r58K0457k4372r48O619L0047J1919m1720k7203N3980J2173j1146
7169g423K3510J2231l5736l7700r682P591k4365l878o9069O865J23315Q0701m2748
7156B3612o6374k6500P4809L1347o5944J1970L0038J6235m6505J635O7562R373
7144F1258r3360o0855N4870L5041m2317N7307q992n9984o4975K2454N272P424
$$ plain form
7132 -86857 -134981 -126682 -81682 -55813 -45694 -97385 -125252 -76156 -51842 -71207 -104203 -95359
7120 -95359 -46928 -3192 -76766 -32126 13589 -43508 -70982 -45557 -93247 -99809 -45008 -18092
7108 -18092 27760 50110 37025 17844 -39033 -123734 -141439 -88980 -60058 -85709 -85285 -84653 -90701
7095 -90701 -89565 -95267 -67920 -51610 -79130 -113888 -129179 -102859 -107316 -63257 22869 103802
7083 103802 118179 67847 -12022 -13865 -29008 -73382 -119925 -89815 -81156 -58069 -18339 2692
7071 2692 38205 34489 43292 14056 -13548 -466 -29751 -22254 39495 99313 64675 -37520
7059 -37520 -6929 38561 80829 104796 -7302 -16064 7824 -17063 -90962 -91969 -73425 -58363
7047 -58363 -62994 -39858 5584 -28709 -52085 -33463 -2056 2226 18121 52932 -8839 -77045
$$ packed form
7132h6857m8124Q299M5000K5869J0119n1691k7867M9096K4314j9365l2996Q844
7120i5359M8431M3736p3574M4640M5715n7097k7474K5425m7690o562N4801K6916
7108a8092M5852K2350j3085j9181n6877q4701j7705N2459K8922k5651M24O32o048
7095i0701J136n702K7347J6310k7520l4758j5291K6320m457M4059Q6126Q0933
7083A03802J4377n0332p9869j843j5143m4374m6543L0110Q659K3087L9730K1031
7071B692L5513l716Q803k9236k7604J3082k9285P497O1749N9818l4638j02195
7059c7520L0591M5490M2268K3967j12098q762K3888k4887p3899j007J8544J5062
7047e8363m631K3136M5442l4293k3376J8622L1407M282J5895L4811o1771o8206
$$ plain form
7035 -77045 -80978 -8116 46205 41732 58459 40660 28248 11000 -86670 -77303 -75775 -116608 -107520
7022 -107520 -32584 -31758 -80016 -72685 -49822 -33090 -12141 -72486 -140803 -157616 -129598 -134285
7010 -134285 -142909 -116463 -118530 -124906 -63161 -11224 -30900 -46259 -62598 -41904 -22813 31286
6998 31286 10456 -38039 -33545 -65076 -113513 -129056 -132610 -123453 -112463 -93363 -75232 -88538
6986 -88538 -103211 -29315 79511 72920 -28408 -88304 -122619 -166931 -153063 -114256 -128971 -85407
6974 -85407 -68259 -55031 52353 88966 33341 30193 -1340 -39511 -93840 -90093 -31761 -28101
6962 -28101 6968 29546 -35707 -99415 -46182 -23398 -5941 -65662 -138014 -89214 -62410 -68369
6950 -68369 -49235 -60304 -73362 -102955 -85133 -52833 -12102 -50637 -67596 27417 130162 71356
$$ packed form
7035g7045l933P2862N4321m473J6727j7799j2412j7248r7670R367J528m0833R088
7022a07520P4936Q26m8258P331K2863J6732K0949o0345o8317j6813K8018m687
7010a34285q624K6446k067o376O1745N1937j9676j5359j6339K0694J9091N4099
6998C1286k0830m8495M494l1531m8437j5543l554R157J0990J9100J8131j3306
6986h8538j4673P3896J08826o591j01328n9896l4315m4312J3868L8807j4715M3564
6974h5407J7148J3228J07384L6613n5625l148l1533l8171n4329L747N8332L660
6962b8101L5069K2578o5253o3708N3233K2784J7457n9721p2352M8800K6804n959
6950f8369J9134j1069j3058k9593J7822L2300M0731l8535j6959R5013J02745n8806
$$ plain form
6938 71356 67867 38725 -765 65289 83793 27283 -42078 -91076 -55320 -60142 -17896 7079
6926 7079 13507 31281 12415 33616 16248 13280 24147 14716 57469 58499 17143 -42398 -75015
6913 -75015 -23171 -40243 -46575 14170 34135 -59130 -78084 -76611 -88995 -59401 -15839 21243
6901 21243 46446 29541 -20633 -101711 -126237 -58636 -22751 15894 56829 67938 5272 7744
6889 7744 -26729 -42012 14593 46144 42462 28657 -5002 -57208 -133716 -103306 -11978 20364
6877 20364 -12232 -28864 52650 99403 68844 1498 -34753 -63667 -20572 -17692 -36618 -51605
6865 -51605 -35859 -29520 5992 12533 -43358 -114592 -51180 67436 118705 141748 85182 35668
6853 35668 -2364 -16320 -13240 -68352 -78254 -62760 -19387 -11100 -28467 21717 11475 28364
$$ packed form
6938G1356l489k9142l9490O6054J8504n6510o9361m8998L5756m822M2246K4975
6926G079O428J7774j8866K1201j7368k968J0867r431M2753J030m1356n9541l2617
6913g5015N1844j7072o332O0745J9965r3265j8954J473j2384K9594M3562L7082
6901B1243K5203j6905n0174q1078k4526O7601L5885L8645M0935J1109o2666K472
6889G744l4473j5283N6605L1551l682j3805l3659n2206p6508L0410R1328L2342
6877B0364l2596j6632Q1514M6753l0559o7346l6251k8914M3095K880j8926j4987
6865e1605J5746O339L5512O541n5891p1234O3412J18616N1269K3043n6566m9514
6853C5668l8032j3956L080n5112r902J5494M3373Q287j7367N0184j0242J6889
$$ plain form
6841 28364 5433 2164 -13260 -52444 -66195 -71370 -115058 -134385 -49944 -32504 -32691 89224
6829 89224 127565 95831 47538 -9411 4003 -40269 -38120 -69926 -124909 -113570 -25182 -31462
6817 -31462 -30409 -58209 -77022 -32695 76090 98927 55400 64248 76126 116557 111586 72608
6805 72608 20218 -17252 -9578 -22005 -11275 31048 18636 -3423 58627 128909 84353 96719
6793 96719 76131 -19894 -35425 -24021 43873 108714 135560 40045 -24274 -41422 12589 -11782
6781 -11782 -30146 -79277 -63149 -97583 -87831 -56723 -8224 -45624 -90052 -54553 -41709 27198
6769 27198 72139 9849 -1447 -52744 -131158 -93543 -31785 -29272 -50212 -71612 -62460 -39613
6757 -39613 -522 52796 57004 24546 -30079 -50395 -23982 36192 35399 -38584 -51737 -61519 -24712
$$ packed form
6841B8364k2931l269j5424l9184j3751n175m3688j9327Q4441J7440j87J21915
6829H9224L8341l1734m8293n6949J3414m4272K149l1806n4983J1339Q8388o280
6817c1462J053k7800j8813M4327J08785K2837m3527Q848J1878M0431m971l8978
6805G2608n2390l7470P674j2427J0730M2323j2412k2059O2050P0282m4556J2366
6793I6719k0588r6025j5531J1404O7894O4841K6846r5515o4319j7148N4011k4371
6781a1782j8364m9131J6128l4434R752L1108M8499l7400m4428L5499J2844O8907
6769B7198M4941o2290j1296n1297p8414L7615O1758K513k0940k1400R152K2847
6757c9613L9091N3318M208l2458n4625k0316K6413O0174p93p3983j3153r782L6807
$$ plain form
6744 -24712 -13630 24727 85739 78063 -13774 -9392 9309 550 -45728 10656 -21530 -80152
6732 -80152 -135837 -106450 -71223 -83482 -61043 38135 47357 41820 -45376 -76275 -40924 -33277
6720 -33277 -36745 -3118 -10301 -38416 44950 29129 -84917 -93351 -34401 -44696 -76315 -26457
6708 -26457 13600 69459 110500 50324 10504 -18145 -19397 -56270 -5127 -38394 -86607 -27885
6696 -27885 23245 19191 15087 42619 80962 32072 48981 23548 55822 57451 57431 22387 -92730
6683 -92730 -69831 -8967 19685 51391 92756 60464 -5685 -76981 -85653 -20732 -4114 618
6671 618 -28913 -57896 -38318 -21222 -23597 -39354 3710 -22014 -90345 -103579 -93898 -111150 -87180
6658 -87180 -63678 -64178 -35383 -3067 -25837 -62454 -73315 -19467 -29232 -28772 -11501 46918 50836
$$ packed form
6744b4712J1082L8357O1012p676r1837M382J8701q759m6278N6384l2186n8622
6732h0152n5685K9387L5227j2259K2439R9178R222n537q7196l0899L5351P647
6720c3277l468L3627p183k8115Q3366j5821j14046q434N8950j0295l1619M9858
6708b6457M0057N5859M1041o0176l9820k8649j252l6873N1143l3267m8213N8722
6696b7885N1130m054m104K7532L8343m8890J6909k5433L2274J629k0l5044j15117
6683i2730K2899O0864K8652L1706M1365l2292o6149p1296q672O4921J6618M732
6671F18k9531k8983J9578J7096k375j5757M3064k5724o8331j3234R681j7252K3970
6658h7180K3502n00K8795L2316k2770l6617j0861N3848r765M60J7271N8419L918
$$ plain form
6645 50836 54492 55508 70911 91086 38443 22677 62250 14491 1654 6851 -24434 48672
6633 48672 30342 -17232 -5239 36126 -19641 -38571 -12700 74231 85838 28411 20407 -22325
6621 -22325 -104439 -57612 -38033 -60126 -62931 24446 51437 19141 16260 22097 29517 47796 4613
6608 4613 -2829 14896 56101 -123 -16346 37395 -346 -17928 68143 91350 1203 -59099
6596 -59099 -128052 -137339 -94427 -65819 -79309 -140485 -93098 -16265 14601 32171 11906 25572
6584 25572 -17300 -95121 -69954 -60071 -64680 19082 46946 8674 27320 58615 67196 37069
6572 37069 -6769 -68385 -90611 -35473 25540 -25718 -45709 -57185 -61850 -50399 -58097 -15620
6560 -15620 -29155 -25238 -17570 -34442 -90727 -133018 -94326 -27116 -62252 -109857 -147966 -91897
$$ packed form
6645E0836L656J016J5403K0175n2643j5766L9573m7759j2837N197l1285P3106
6633D8672j8330m7574J1993M1365n5767j8930K5871Q6931J1607n7427q004m2732
6621b2325q2114M6827J9579k2093k805Q7377K6991l2296k881N837P420J8279m3183
6608D613p442J7725M1205n6224j6223N3741l7741j7582Q6071K3207r0147o0302
6596e9099o8953r287M2912K8608j3490o1176M7387P6833L0866J7570k0265J3666
6584B5572m2872p7821K5167R883m609Q3762K7864l8272J8646L1295Q581l0127
6572C7069m3838o1616k2226N5138O1013n1258j9991j1476m665J1451p698M2477
6560a5620j3535L917P668j6872n6285m2291L8692O7210l5136m7605l8109N6069
$$ plain form
6548 -91897 -7060 -10911 49312 58388 -38065 -39926 -72916 -69530 -37188 -38106 -42679 -34312 -23217
6535 -23217 59882 42258 44443 27682 38397 43635 14693 4449 11029 -65912 -98108 -48730
6523 -48730 -51090 -37205 -47549 -112542 -172398 -71612 -29666 -53187 -108520 -109192 -63222 -49331
6511 -49331 -31269 -46391 -47339 27099 60129 -805 -42478 -43215 8980 67224 22610 6634 24374
6498 24374 32192 42564 26300 -10856 -47781 -53062 -61917 -87936 -88377 -67792 926 80361 52404
6485 52404 14099 15740 41990 59275 54965 20445 1658 -4837 27420 4365 -20621 -81642
6473 -81642 -108384 -95722 -11104 -24870 -103596 -184164 -156554 -99335 -73858 -25625 -60490 -101230
6461 -101230 -9814 64768 66077 -54 -64289 -56453 16404 54431 40281 38185 46293 63896
$$ packed form
6548i1897Q4837l851O0223R076r6453j861l2990L386L2342r18m573Q367J1095
6535b3217Q3099j7624K185j6761J0715N238k8942j0244O580p6941l2196M9378
6523d8730k360J3885j0344o4993n9856J00786M1946k3521n5333o72M5970J3891
6511d9331J8062j5122r48P4438L3030o0934m1673p37N2195N8244m4614j5976J7740
6498B4374P818J0372j6264l7156l6925n281q855k6019m41K0585O8718P9435k7957
6485E2404l8305J641K6250J7285m310l4520j8787o495L2257k3055k4986o1021
6473h1642k6742J2662Q4618j3766p8726q0568K7610N7219K5477M8233l4865m0740
6461a01230R1416P4582J309o6131o4235P836P2857L8027j4150k096Q108J7603
$$ plain form
6449 63896 45437 43584 13297 -66415 -91317 -70233 -115344 -82940 -43641 2810 -8514 -50592
6437 -50592 -29624 -15810 -7446 13251 -2267 4946 9156 31003 13635 -29361 -64436 -85863
6425 -85863 -19867 62964 62010 44534 51052 35496 -76485 -135472 -168357 -109601 -129841 -137332
6413 -137332 -34880 45634 67582 43922 1539 -21975 24637 61783 36324 30498 46372 31361
6401 31361 12264 51857 72914 41777 -39248 -72734 -78768 -41410 -87015 -123199 -164954 -119269
6389 -119269 -88429 -61222 -36734 -52157 -45520 -95816 -84384 -113491 -127269 -123637 -66522 -20984
6377 -20984 -23207 -72986 -22140 74242 139869 132660 81049 29372 45103 73334 63402 27169
6365 27169 35645 18599 28304 -3938 -39368 19628 69665 98312 51798 -9266 -51032 -35105
$$ packed form
6449F3896j8459j853l0287p9712k4902K1084m5111L2404L9299M6451j1324m2078
6437e0592K0968J3814Q364K0697j5518P213M210K1847j7368m2996l5075k1427
6425h5863O5996Q2831r54j7476O518j5556j11981n8987l2885N8756k0240p491
6413a37332J02452Q0514K1948k3660m2383k3514M6612L7146k5459n826J5874j5011
6401C1361j9097L9593K1057l1137q1025l3486o034L7358m5605l6184m1755M5685
6389a19269L0840K7207K4488j5423O637n0296J1432k9107j3778L632N7115M5538
6377b0984k223m9779N0846R6382O5627p209n1611n1677J5731K8231r932l6233
6365B7169Q476j7046R705l2242l5430N8996N0037K8647m6514o1064m1766J5927
$$ plain form
6353 -35105 23079 -22829 -30880 -8442 -30219 -71956 -77845 -89627 -53800 -24994 -71987 -153986
6341 -153986 -123792 -70881 167 72117 75755 21965 37530 34455 36920 14318 49740 19322
6329 19322 29951 13151 34183 42206 1121 -12050 69132 71152 69349 -7242 -32545 -56816
6317 -56816 -46303 -39420 -79182 -75867 -52737 -47959 -80347 -19838 5239 -14181 10488 7900 -22297
6304 -22297 -6614 63206 30486 -15272 13836 48241 46468 26231 -4240 -39606 20119 12019
6292 12019 -25548 -36016 -20305 -26037 51309 32312 32705 51301 74316 49285 12116 -75813
6280 -75813 -78419 -153818 -145866 -84091 -77647 -139334 -125646 -84212 -148590 -101089 -53626 -45377 -71477
6267 -71477 -70132 3509 24077 23567 -19711 26472 82301 59368 65060 861 -3411 -23212 -19080
$$ packed form
6353c5105N8184m5908q051K2438k1777m1737n889j1782L5827K8806m6993q1999
6341a53986L0194N2911P1048P1950L638n3790J5565l075K465k2602L5422l0418
6329A9322J0629j6800K1032Q023m1085j3171Q1182K020j803p6591k5303k4271
6317e6816J0513O883l9762L315K3130M778l2388O0509K5077j9420K4669k588l0197
6304b2297J5683O9820l2720m5758K9108L4405j773k0237l0471l5366N9725q100
6292A2019l7567j0468J5711n732P7346j8997L93J8596K3015k5031l7169q7929
6280g5813k606p5399P952O1775O444o1687J3688M1434o4378M7501M7463Q249k6100
6267g1477J345P3641K0568n10m3278M6183N5829k2933N692o4199m272j9801M132
$$ plain form
6254 -19080 -77043 -72610 -16145 -76628 -59580 -51312 -81261 -94309 -119631 -116973 -64917 -77523
6242 -77523 -79489 -77803 -100848 -135886 -165160 -161514 -133028 -155950 -126855 -62982 -36065 -6840
6230 -6840 -16424 -25870 -100748 -115480 -125947 -96979 -103567 -101775 -89753 -86852 -72131 -91938 -101007
6217 -101007 -67272 59961 59908 -344 -5107 -48547 -75503 -50624 -35836 -26545 -9466 21624
6205 21624 34932 62535 -12157 -80423 -157376 -170837 -142451 -148159 -93587 -37523 5802 -26987
6193 -26987 -37326 -77873 -91401 2528 36222 7482 -53858 -98519 -136279 -148144 -139866 -91228
6181 -91228 -47129 -52391 -82195 -44120 -11063 21205 46868 103614 16855 -30517 39532 24904
6169 24904 85519 93267 58194 76459 16903 -17046 -32418 -34571 22095 -4580 -50335 -31107
$$ packed form
6254a9080n7963M433N6465o0483J7048Q268k9949j3048k5322K658N2056j2606
6242g7523j966J686k3045l5038k9274L646K8486k2922K9095O3873K6917K9225
6230f840r584r446p4878j4732j0467K8968o588J792J2022K901J4721j9807r069
6217a01007L3735J27233n3o0252m763m3440k6956K4879J4788R291J7079L1090
6205B1624J3308K7603p4692o8266p6953j3461K8386n708N4572N6064M3325l2789
6193b6987j0339m0547j3528R3929L3694k8740o1340m4661l7760j1865Q278M8638
6181i1228M4099n262k9804L8075L3057L2268K5663N6746q6759m7372P0049j4628
6169B4904O0615P748l5073J8265n9556l3949j5372k153N6666k6675m5755J9228
$$ plain form
6157 -31107 -14504 -15294 9942 23854 15374 16462 5729 -2333 17471 32050 79166 86918 -34935
6144 -34935 -95025 -22758 15667 798 -93960 -91113 -5833 -52996 -75975 -32991 -28996 -24531
$$ packed form
6157c1107J6603p90K5236J3912q480J088j0733q062J9804J4579M7116P752j21853
6144c4935o0090P2267L8425j4869r4758K847Q5280m7163k2979M2984L995M465
$$ [...]
##END NTUPLES=NMR SPECTRUM
##END=
