##TITLE=Analysis number 329121
Compound Code spb 03129
Project Code adrs
Chemist Name aci
##JCAMPDX= 6.0         $$ Bruker NMR JCAMP-DX V2.0
##DATA TYPE= NMR SPECTRUM
##DATA CLASS= NTUPLES
##ORIGIN= Bruker BioSpin GmbH
##OWNER= nmr
$$ XWIN-NMR		Version 3.5
$$ Mon Aug  6 09:55:27 2007 GMT Daylight Time (UT+1h)  MAYBRIDGE\nmr@NMR_250MHZ
##.OBSERVE FREQUENCY= 250.131544655141
##.OBSERVE NUCLEUS= ^1H
##.ACQUISITION MODE= SIMULTANEOUS (DQD)
##.ACQUISITION SCHEME= undefined
##.AVERAGES= 16
##.DIGITISER RES= 18
##SPECTROMETER/DATA SYSTEM= dpx250
##.PULSE SEQUENCE= zg30
##.SOLVENT NAME= CDCl3
##.SHIFT REFERENCE= (INTERNAL, CDCl3, 0, 16.522)
##AUDIT TRAIL= $$ (NUMBER, WHEN, WHO, WHERE, WHAT)
$$ ##TITLE= Audit trail, XWIN-NMR		Version 3.5
$$ ##JCAMPDX= 5.01
$$ ##ORIGIN= Bruker BioSpin GmbH
$$ ##OWNER= nmr
$$ C:\u/data/dgb/nmr/ADRS/180/pdata/1/auditp.txt
$$ ##AUDIT TRAIL=  $$ (NUMBER, WHEN, WHO, WHERE, WHAT)
(   1,<2007-08-06 09:55:07.04 +100>,<MAYBRIDGE\nmr>,<NMR_250MHZ>,
      <created by zg, POWCHK disabled, PULCHK disabled
       configuration hash MD5:
       76 6E 9A 78 1E 09 19 81 EC 84 63 8F B0 6A 59 2D
       data hash MD5: 64K
       DF 8C 0B AF F4 95 CF B2 83 D7 A1 52 87 78 9D D0>)
(   2,<2007-08-06 09:55:18.51 +100>,<MAYBRIDGE\nmr>,<NMR_250MHZ>,
      <Start of raw data processing
       ef LB = 0.3 FT_mod = 6 PKNL = 1 SI = 32K 
       data hash MD5: 32K
       AD 76 9D 7B EF F6 FA BB B1 81 6A E9 0B 64 10 5F>)
(   3,<2007-08-06 09:55:20.07 +100>,<MAYBRIDGE\nmr>,<NMR_250MHZ>,
      <apk 
       data hash MD5: 32K
       9D EF 19 A0 B3 82 C2 60 9A AE C6 23 BB 7F D6 43>)
(   4,<2007-08-06 09:55:20.96 +100>,<MAYBRIDGE\nmr>,<NMR_250MHZ>,
      <abs ABSG = 5 
       data hash MD5: 32K
       9D 55 07 17 1C D8 CA B9 1C B8 BA 98 D3 3D 64 6F>)
$$ ##END=
$$ 
$$ hash MD5
$$ 7E 0A ED 8C 99 48 44 14 E5 6E 88 81 EB D7 A8 2B
##$RELAX= 
##$RELAX= 
##$RELAX= 
##$RELAX= 
##$RELAX= 
##$RELAX= 
##$RELAX= 
$$ Bruker specific parameters
$$ --------------------------
##$DU= <C:\u>
##$EXPNO= 180
##$NAME= <ADRS>
##$PROCNO= 1
##$TYPE= <nmr>
##$USER= <dgb>
##$AMP= (0..31)
100 100 100 100 100 100 100 100 100 100 100 100 100 100 100 100 100 100 
100 100 100 100 100 100 100 100 100 100 100 100 100 100 
##$AQSEQ= 0
##$AQ_mod= 3
##$AUNM= <au_zg>
##$AUTOPOS= <35 >
##$BF1= 250.13
##$BF2= 250.13
##$BF3= 250.13
##$BF4= 250.13
##$BF5= 500.13
##$BF6= 500.13
##$BF7= 500.13
##$BF8= 500.13
##$BYTORDA= 1
##$CFDGTYP= 0
##$CFRGTYP= 5
##$CHEMSTR= <none>
##$CNST= (0..31)
1 1 145 1 1 1 1 1 1 1 1 1 1 1 1 1 1 1 1 1 1 1 1 1 1 1 1 1 1 1 1 1 
##$CPDPRG= <>
##$CPDPRG1= <>
##$CPDPRG2= <>
##$CPDPRG3= <>
##$CPDPRG4= <mlev>
##$CPDPRG5= <mlev>
##$CPDPRG6= <mlev>
##$CPDPRG7= <mlev>
##$CPDPRG8= <mlev>
##$CPDPRGB= <>
##$CPDPRGT= <>
##$D= (0..31)
0 1 0 0 0 0 0 0 0 0.06 0 0 0 0 0 0 0.0002 0 0 0 0 0 0 0 0 0 0 0 0 0 0 
0 
##$DATE= 1186390505
##$DBL= (0..7)
120 120 120 120 120 120 120 120 
##$DBP= (0..7)
150 150 150 150 150 150 150 150 
##$DBP07= 0
##$DBPNAM0= <>
##$DBPNAM1= <>
##$DBPNAM2= <>
##$DBPNAM3= <>
$$ [...]
##$SUBNAM6= <"">
##$SUBNAM7= <"">
##$SUBNAM8= <"">
##$SUBNAM9= <"">
##$SW= 20.6930455092707
##$SWIBOX= (0..15)
0 0 3 0 0 0 0 0 0 0 0 0 0 0 0 0 
##$SW_h= 5175.983436853
##$TD= 65536
##$TD0= 1
##$TE= 296.16
##$TE2= 300
##$TE3= 300
##$TEG= 300
##$TL= (0..7)
0 120 120 120 120 120 120 120 
##$TP= (0..7)
150 150 150 150 150 150 150 150 
##$TP07= 0
##$TPNAME0= <>
##$TPNAME1= <>
##$TPNAME2= <>
##$TPNAME3= <>
##$TPNAME4= <>
##$TPNAME5= <>
##$TPNAME6= <>
##$TPNAME7= <>
##$TPOAL= (0..7)
0.5 0.5 0.5 0.5 0.5 0.5 0.5 0.5 
##$TPOFFS= (0..7)
0 0 0 0 0 0 0 0 
##$TUNHIN= 0
##$TUNHOUT= 0
##$TUNXOUT= 0
##$USERA1= <user>
##$USERA2= <user>
##$USERA3= <user>
##$USERA4= <user>
##$USERA5= <user>
##$V9= 5
##$VALIST= <valist>
##$VCLIST= <CCCCCCCCCCCCCCC>
##$VD= 0
##$VDLIST= <DDDDDDDDDDDDDDD>
##$VPLIST= <PPPPPPPPPPPPPPP>
##$VTLIST= <TTTTTTTTTTTTTTT>
##$WBST= 1024
##$WBSW= 4
##$XGAIN= (0..3)
0 0 0 0 
##$XL= 0
##$YL= 0
##$YMAX_a= 647623
##$YMIN_a= -675948
##$ZGOPTNS= <>
##$ZL1= 120
##$ZL2= 120
##$ZL3= 120
##$ZL4= 120
##$ABSF1= 16.522
##$ABSF2= -4.171173
##$ABSG= 5
##$ABSL= 3
##$ALPHA= 0
##$AQORDER= 0
##$ASSFAC= 0
##$ASSFACI= 0
##$ASSFACX= 0
##$ASSWID= 0
##$AUNMP= <proc_1d>
##$AZFE= 0.1
##$AZFW= 0.1
##$BCFW= 0
##$BC_mod= 0
##$BYTORDP= 0
##$COROFFS= 0
##$CY= 12.5
##$DATMOD= 1
##$DC= 0
##$DFILT= <>
##$DTYPP= 0
##$F1P= 14.0000005364418
##$F2P= -0.99999901652339
##$FCOR= 0.5
##$FTSIZE= 32768
##$FT_mod= 6
##$GAMMA= 0
##$GB= 0
##$INTBC= 1
##$INTSCL= 1
##$ISEN= 128
##$LB= 0.3
##$LEV0= 0
##$LPBIN= 0
##$MAXI= 10000
##$MC2= 0
##$MEAN= 0
##$ME_mod= 0
##$MI= 0
##$NCOEF= 0
##$NC_proc= -1
##$NLEV= 6
##$NOISF1= 0
##$NOISF2= 0
##$NSP= 0
##$NTH_PI= 0
##$NZP= 0
##$OFFSET= 16.522
##$PC= 1
##$PHC0= 159.6152
##$PHC1= 8.319479
##$PH_mod= 1
##$PKNL= yes
##$PPARMOD= 0
##$PSCAL= 4
##$PSIGN= 0
##$REVERSE= no
##$SF= 250.13
##$SI= 32768
##$SIGF1= 0
##$SIGF2= 0
##$SINO= 400
##$SIOLD= 32768
##$SREGLST= <1H.CDCl3>
##$SSB= 0
##$STSI= 32768
##$STSR= 0
##$SW_p= 5175.98343685301
##$SYMM= 0
##$S_DEV= 0
##$TDeff= 65536
##$TDoff= 0
##$TI= <Analysis number 999999
Compound Code 99
Book Reference 9
Project Code 9>
##$TILT= no
##$TM1= 0
##$TM2= 0
##$TOPLEV= 0
##$USERP1= <user>
##$USERP2= <user>
##$USERP3= <user>
##$USERP4= <user>
##$USERP5= <user>
##$WDW= 1
##$XDIM= 32768
##$YMAX_p= 272826465
##$YMIN_p= -8955
$$ End of Bruker specific parameters
$$ ---------------------------------
##NTUPLES= NMR SPECTRUM
##VAR_NAME=  FREQUENCY,     SPECTRUM/REAL,   SPECTRUM/IMAG
##SYMBOL=    X,             R,               I
##VAR_TYPE=  INDEPENDENT,   DEPENDENT,       DEPENDENT
##VAR_FORM=  AFFN,          ASDF,            ASDF
##VAR_DIM=   32768,         32768,           32768
##UNITS=     HZ,            ARBITRARY UNITS, ARBITRARY UNITS
##FACTOR=    0.157963299565203, 1,           1
##FIRST=     4132.6476996994, 0,             0
##LAST=      -1043.33573715361, 0,           0
##MIN=       -1043.33573715361, -8955,       0
##MAX=       4132.6476996994, 272826465,     0
$$ Real data points
##PAGE= N=1
##DATA TABLE= (X++(R..R)), XYDATA
$$ [...]
16554a992J275K072j188J404j831j402J338O80M03J710R93k104k435K69Q36j25
16538i7j587k221ML5J030p54o01L580L634M40j589q37O8L53n81k306k62Q6J073
16519e32o53m49J213m9J214l479M22Q45j338p65P01K329R68L98K97L13k8r48p02
16500b43j799P30j817j85j266j394j75l34K42K829K111K730rj262m667j976K364
16483d121K572L532J126k476p74J561j56j913p44J14j911K46J916j848o36P41
16467b771p20j198j614K076L31J752J147o8l19j95Q85j761j859m11j64K979J071
16450h39n61k46J713Oj531n36j306p78Q24Q10J445j816n06r33j547o87K440J37
16432c911j991J47R10J833J639J381J06j85k844j971J769J833m27J176K537k118
$$ plain form
16554 -1992 -717 1355 167 1571 -260 -1662 -324 356 759 2469 3462 1358 -1077 -808 28 -97
16538 -97 -1684 -3905 -3901 -3866 -2836 -3590 -4191 -611 3023 3463 1874 1037 1105 1458 877 -1429 -1691 -1605 -532
16519 -532 -1185 -1634 -421 -470 744 -2735 -2313 -1468 -2806 -3571 -2870 -541 427 825 1122 1435 1407 459 -243
16500 -243 -2042 -1312 -3129 -3314 -4580 -5974 -6149 -6483 -6241 -3412 -1301 1429 1420 158 -4509 -6485 -4121
16483 -4121 -1549 1983 3109 633 -141 1420 1264 -649 -1393 -1279 -3190 -2944 -1028 -2876 -3512 -2771
16467 -2771 -3491 -4689 -6303 -4227 -3896 -2144 -997 -1065 -1384 -1579 -694 -2455 -4314 -4725 -4889 -1910 -839
16450 -839 -1400 -1646 67 73 -1458 -1994 -3300 -4078 -3254 -2444 -999 -2815 -3321 -4254 -5801 -6488 -4048 -3911
16432 -3911 -5902 -5755 -4845 -3012 -1373 8 114 -71 -2915 -4886 -3117 -1284 -1711 -535 2002 -116
16416a16J476J661l759j30k68p93r03L13m09J90j328J911Q66p13m83Q78K033M99
16398I25k982k362q58J617P62j2j138O22K96J49K724J746m73n13M92q84p04O13
16380B0J079N21N13q50J379K29q76l19j112J375m06j723j525M47K648k533R10
16363b23J49q85R90m41j283O03R11j580pM60p09L53r39J688L86R56j521m32q07
16344b331j268J563J70j115J300R85l308j617n62j535K707L903K719R25L06p14
16328B128k265l031m03R14J322Q13j16J611J462j539l260m97L55m85k797k81O64
16311e405n93J768K823rJ120k207k526K38n14J002J667R59K142J009j123p26J379
16294A004K618M47l588k126J909K535k390l646J951o4k158j227j644K131J202
$$ plain form
16416 -116 1360 3021 -738 -868 -1136 -1929 -2832 -2519 -2928 -2738 -4066 -2155 -1289 -2002 -2485 -1607 426 925
16398 925 -2057 -4419 -5277 -3660 -2898 -2910 -4048 -3426 -3130 -2981 -257 1489 1016 503 995 111 -593 20
16380 20 1099 1620 2133 1283 2662 2891 2015 1696 584 1959 1553 -170 -1695 -1248 1400 -1133 -223
16363 -223 -74 -959 31 -410 -1693 -1090 -179 -1759 -1766 -1306 -2015 -1662 -2601 -913 -527 429 -1092 -1524 -2331
16344 -2331 -3599 -2036 -1866 -2981 -1681 -696 -4004 -5621 -6183 -7718 -5011 -1108 1611 2536 2842 2128
16328 2128 -137 -3168 -3571 -2657 -1335 -522 -638 973 2435 896 -2364 -2861 -2506 -2991 -5788 -6069 -5405
16311 -5405 -5998 -4230 -1407 -1416 -296 -2503 -5029 -4791 -5305 -4303 -2636 -1677 465 1474 351 -375 1004
16294 1004 3622 4069 481 -1645 264 2799 409 -3237 -1286 -1350 -3508 -4735 -6379 -4248 -3046
16279c046m99J394j391J174o79j94j2m09K084k80J325P06m5j470R5r16m26J57
16261b432j038r6J864M5P86J144o06k131k67J265M55k373n32J063o87J193J82
16244b165k046Lk11n40J222J855J78Q11j855j832M25M69o83K001J165k459n42
16227d204O75R71o45r89j573O56L83J187j353M11J277J557L159o19j282N04N32
16210F47n75m26k096J296q91L22j303q28J25P80J847K677n76J124J95r79J16j215
16192B40k79J182K206J283l51j986k468j937j102J152J756p36n12J6n3J883M96
16175G90k753J279J482J56p91k211k090m62l40K586J507k103k416O98J297P54
16159b617K134N05P92R84j982K100j733j417j437p26K086J901r60o68j638j701
$$ plain form
16279 -3046 -3545 -2151 -3542 -2368 -3047 -3241 -3253 -3662 -1578 -1858 -533 173 128 -1342 -1247 -2163 -2589 -2432
16261 -2432 -3470 -3566 -1702 -1657 -871 273 -333 -2464 -2731 -1466 -1011 -3384 -3916 -2853 -3540 -2347 -2165
16244 -2165 -4211 -4208 -4419 -4959 -3737 -1882 -1704 -893 -2748 -4580 -4155 -3686 -4369 -2368 -1203 -3662 -4204
16227 -4204 -3529 -2558 -3203 -4192 -5765 -5109 -4726 -3539 -4892 -4481 -3204 -1647 1512 893 -389 115 647
16210 647 72 -354 -2450 -1154 -2045 -1723 -3026 -3854 -3729 -2949 -1102 1575 999 2123 2318 1339 1455 240
16192 240 -39 1143 3349 4632 4281 2295 -173 -2110 -3212 -2060 -304 -1040 -1552 -1536 -1589 294 790
16175 790 -1963 -684 798 954 163 -2048 -4138 -4600 -4940 -2354 -847 -2950 -5366 -4668 -3371 -2617
16159 -2617 -483 22 814 1798 -184 1916 183 -1234 -2671 -3397 -1311 590 -370 -1038 -2676 -4377
16143d377R61K358J618L61J002J27n96r22j662k18j621o18K66Q26j705n46L09
16126d437Q85R39N43o65J38M28j53R4J408j459N35j312j255Q06K69O46J431M80
16108f79j280K57J238m21j768P77J964J506k018l193r1j539O72p40R57J377K92
16091b689K649Q07j356j547k43J514r8J410J978M49l15N05j732j716J40j192l21
16074a757j33r56m57J11J017J652L50j397o87P13j414J92J419r32J048j437p15
16057c383q68q45K28J043k415J873J100j383q23R98R61K02J159j524J99J439L055
16040A016l32r53M38j707k682K47M410r96k291M61K836j530k808J395M85J060
16024i51J110J353O81j60l71j053j713L35J119m48L38q03o49J33j000j294R10
$$ plain form
16143 -4377 -3416 -1058 560 921 1923 2050 1454 532 -1130 -1348 -2969 -3587 -3321 -2495 -4200 -4746 -4437
16126 -4437 -3552 -2613 -2070 -2735 -2597 -2169 -2322 -2228 -820 -2279 -1744 -3056 -4311 -3505 -3236 -2590 -1159 -679
16108 -679 -1959 -1702 -464 -885 -2653 -1876 88 1594 -424 -3617 -3708 -5247 -4575 -5315 -4358 -2981 -2689
16091 -2689 -40 767 -589 -2136 -2379 -865 -963 447 2425 2874 2559 3064 1332 -384 -244 -1436 -1757
16074 -1757 -1890 -2846 -3303 -3192 -2175 -523 -173 -1570 -2257 -1544 -2958 -2766 -1347 -2279 -1231 -2668 -3383
16057 -3383 -4251 -5096 -4868 -3825 -6240 -4367 -3267 -4650 -5473 -4475 -3514 -3312 -2153 -3677 -3478 -2039 1016
16040 1016 684 -269 169 -1538 -4220 -3973 437 -559 -2850 -2389 447 -1083 -3891 -2496 -2011 -951
16024 -951 159 1512 2193 2033 1662 609 -1104 -769 350 -98 240 -563 -1212 -1079 -2079 -3373 -2463
16007b463J549j494j366n32k1K958m61O30L28K482o56k492k453J163P31J486P80
15990A69j001j36J689l2k375J074J691J623k132k161L03Q22J095j757o06j350
15974c084q42R30J188J152j331j92L64n11p5j48J4L58M25J203m44l89K147J476
15956B241Q20k562k560k45K247O8Q40L32k217l97L397K12p6L67R66k510j893r20
15938a890O22J673l726j57q49O9J764J501J305O87J100j222J753J108j039j073
15922A626j220n70j133k217N62Q27q67l77k449J141K299M50n20O82K171R22K73
15905A600j383k610j170j037P44K222L94J682J550M28J113J229m01j868j549k724
15889a780j17L288j42j249m53l47j043k4J418K980P22L2j879k60o63j435j156
$$ plain form
16007 -2463 -914 -2408 -3774 -4306 -4327 -1369 -1830 -1200 -872 1610 954 -1538 -3991 -2828 -2097 -611 169
15990 169 -832 -968 721 689 -1686 -612 1079 2702 570 -1591 -1288 -466 629 -1128 -1734 -3084
15974 -3084 -3926 -2996 -1808 -656 -1987 -2179 -1815 -2326 -2401 -2549 -2535 -2177 -1752 -549 -993 -1382 765 2241
15956 2241 3061 499 -2061 -2306 -59 9 849 1181 -1036 -1433 1964 2176 2100 2467 3433 923 -970 -1890
15938 -1890 -1268 405 -3321 -3478 -4327 -4258 -2494 -993 312 999 2099 877 2630 3738 2699 1626
15922 1626 406 -164 -1297 -3514 -2952 -2125 -2992 -3369 -5818 -4677 -2378 -1928 -2448 -1766 405 1327 1600
15905 1600 217 -2393 -3563 -4600 -3856 -1634 -1240 442 1992 2420 3533 4762 4361 2493 944 -1780
15889 -1780 -1897 1391 1249 0 -453 -800 -1843 -1867 -449 2531 3253 3285 1406 1146 483 -952 -2108
15872b108p94q91p79p03K667P54j544k275p49O74K474K797k65Mj87j103j71l22
15854b521j626K109J815j401j522J56L287J411j001L17J742q83j979j457j007
15839b560M02p69J281k46N38k28N21K460m5Q59j61k210l023K136l46n36j050r91
15821c968k491n7L576K972P28j360l546j621J407N017k76m75R25mj833j07k289
15804c402j41K213J502j05l292q31L051K58p06n54J250k09L98j56m83Q72J98j669
15786a806m64N46L810j527l542Q10J026r75J27K115k05J756r40Q0N62o4R29j123
15768A115j057L84k64m07q12j415k737O25J319J246K57N85J011j496k149J688
15752b107p92k385k658j013J853J461n11N35p03P74J338l67j459R96O50P42J124
$$ plain form
15872 -2108 -2902 -3793 -4572 -5275 -2608 -1854 -3398 -5673 -6422 -5748 -3274 -477 -742 -738 -925 -2028 -2199 -2521
15854 -2521 -4147 -2038 -223 -1624 -3146 -2990 297 1708 707 1024 2766 1883 -96 -1553 -2560
15839 -2560 -2158 -2927 -1646 -1892 -1354 -1582 -1061 1399 1354 2213 2052 -158 -3181 -1045 -1391 -1927 -2977 -3968
15821 -3968 -6459 -6516 -2940 32 760 -600 -4146 -5767 -4360 657 381 -94 831 827 -1006 -1113 -3402
15804 -3402 -3543 -1330 172 67 -3225 -4056 -1005 -747 -1453 -2007 -757 -966 -568 -724 -1207 -335 -137 -1806
15786 -1806 -2270 -1724 2086 559 -2983 -2173 -1147 -2122 -1995 120 -85 1671 731 811 1373 1309 2238 1115
15768 1115 58 442 178 -229 -1041 -2456 -5193 -4568 -3249 -2003 -1746 -1161 -150 -1646 -3795 -2107
15752 -2107 -2899 -5284 -7942 -8955 -7102 -5641 -6152 -5617 -6320 -5546 -4208 -4575 -6034 -5038 -4388 -3646 -2522
15735b522L338o58k147L62q78r69j49p89Q3L372j409k248Q5J844j669j248M33
15718e169L39j7N00L87L253J630l656l106p37L640O49N9P93K545J090q80p59K45
15700H06N96k70j133j094j84J743m93N52p86k453n24L62K225J364o29m12N62j518
15682a286J563o18R40J705r25L47j413j819o90J053j09J926j471l236K131K439
15666E37K180r47j736j578J038l29j280j576l21J179Q77o91K712j55l122J023
15650b189k15j479r42L31J186P88M42o2j306J314K533Q70k251O14j100J301L20
15633A55N79j815k546j255P88L214J51r05q22n10M09m20P46K567K429k27k456
15616H2o82O2r64K694j365Q48N60j605l75q8P70l12j617n81l199j404N9J853l84
$$ plain form
15735 -2522 816 158 -1989 -1627 -2505 -3474 -3623 -4412 -4329 -957 -2366 -4614 -4529 -2685 -4354 -5602 -5169
15718 -5169 -4830 -4847 -4347 -3960 -707 923 -2733 -5839 -6576 -2936 -2287 -2228 -1435 1110 2200 1320 561 806
15700 806 1402 1132 -1 -1095 -1279 464 -29 523 -263 -2716 -3240 -2878 -653 711 82 -330 232 -1286
15682 -1286 277 -341 599 2304 1379 1726 313 -1506 -2196 -1143 -1252 674 -797 -4033 -1902 537
15666 537 2717 1770 34 -1544 -506 -835 -2115 -3691 -4012 -2833 -1956 -2647 65 -90 -3212 -2189
15650 -2189 -2404 -3883 -4825 -4494 -3308 -2520 -2078 -2140 -3446 -2132 401 1271 -980 -366 -1466 -165 155
15633 155 734 -1081 -3627 -4882 -4094 -880 -729 -1634 -2456 -2966 -2557 -2977 -2231 336 2765 2538 82
15616 82 -600 -538 -1502 1192 -173 675 1235 -370 -745 -833 -63 -375 -1992 -2573 -5772 -7176 -7117 -5264 -5648
15597e648n79j106N91L161J725k30M86J873j255j584O27J534j851J233j550j925
15581d498n99K927M192J955J883m29k082l224j642o8o98K943j473j707j256N97
15565c179O95P38J034J659j397k004J83j12l48J292K36k59J709K396k105k090
15549a552J020j990j483k88k87N85J696O84l874r64K332K751K54j564p85j786
15533e251k695L202K403L113N06j860j609J475j303j048J129l88Q36J541l272
15518c221k66N12J85R72J400R67k28N81p1J792J96j566q56N19J090l680l059N08
15500d225o02n98N15l93J743o97J515J500j985k3p06r17J365j696j7M173J625
15483E77L107j454k712l36J66j199j078J522j752j940J239k299j558M592K033
$$ plain form
15597 -5648 -6227 -7333 -6742 -3581 -1856 -2086 -1600 273 -982 -2566 -1939 -405 -2256 -1023 -2573 -4498
15581 -4498 -5097 -2170 2022 3977 5860 5431 3349 125 -1517 -1585 -2283 660 -813 -2520 -3776 -3179
15565 -3179 -2484 -1746 -712 947 -450 -2454 -2271 -2383 -2731 -1439 -1203 -1462 247 2643 538 -1552
15549 -1552 -532 -2522 -4005 -4293 -4580 -3995 -2299 -1615 -5489 -6453 -4121 -1370 -1116 -2680 -3465 -5251
15533 -5251 -7946 -4744 -2341 772 1278 -582 -2191 -716 -2019 -3067 -1938 -2326 -1490 51 -3221
15518 -3221 -3487 -2975 -2790 -1818 -418 549 321 902 831 2623 2819 1253 397 916 2006 -1674 -4733 -4225
15500 -4225 -4827 -5425 -4910 -5303 -3560 -4257 -2742 -1242 -3227 -3250 -3956 -4873 -3508 -5204 -5221 -1048 577
15483 577 3684 2230 -482 -818 -652 -1851 -2929 -1407 -3159 -5099 -3860 -6159 -7717 -3125 -1092
15468a092o86m05J201J68J803j89J54j552q28J724N87Q05l083o80Q50n88P14J501
15450D04k923o26P74J217k51p60P82j587R86K82k067j04J529K121j131j118J168
15433a304j150j81J970n83j191n23K57N00O81J621p91M31j021N04Q04j005O25
15416c56r84j291J00O33M8l31J422Q3k546J024J283K037k023m89R14N56n73J324
15398H31J163k989JJ114k78o29J58J294M98P9K25M27O9j509l419J408K863o38
15380F68k703k56K494J337n04J61N37P59k108k743j069L100m83j672l29J219R74
15363f18K597j918K09l35M649p37l541j775Q04J410l55k122k26j176l25J545Q47
15346a067j40J014q73k935J076K664j302j184j130J252J243j264P62L247P18r47
$$ plain form
15468 -1092 -1778 -2183 -982 -814 989 800 954 -598 -1426 298 885 1690 -1393 -2073 -1223 -1811 -1097 404
15450 404 -2519 -3145 -2371 -1154 -1405 -2165 -1383 -2970 -1984 -1702 -3769 -3873 -2344 -223 -1354 -2472 -1304
15433 -1304 -2454 -2635 -665 -1248 -2439 -2962 -2705 -2205 -1524 97 -694 -263 -1284 -780 24 -981 -356
15416 -356 -1340 -2631 -2531 -1898 -1850 -2181 -759 -676 -3222 -2198 -915 1122 -901 -1390 -476 80 -493 831
15398 831 1994 -995 -994 120 -158 -787 -629 665 1163 1242 1467 1894 1963 454 -2965 -1557 1306 668
15380 668 -2035 -2291 203 1540 1036 1197 1734 2493 385 -2358 -3427 -327 -810 -2482 -2811 -1592 -618
15363 -618 1979 61 270 -65 4584 3847 306 -1469 -665 745 390 -1732 -1958 -3134 -3459 -1914 -1067
15346 -1067 -1207 -193 -1066 -4001 -2925 -261 -1563 -2747 -3877 -2625 -1382 -2646 -1884 1363 2081 1134
15330A134k69j970j352J372K09j165n71o95J428K583J09k177j568j031J457K424
15314h2J277r85j132j27J165R13K58j087l97K22j406N08M38N62O60j207j047K683
15296A216P61j397q69j998q19j61L17K745P97o15o91j325k776J669R43q64J71
15279b896O10n91j135l79K403P55K382r79r26p08K6K798J871Q60j101k626k08
15262A56K012j393R35L37q49j471k139k30J858J123j014j98q7M37N24J652J280
15245B933o85k589J14J82K76J925J388p69k410L77J10p66N40J82k234j49N20J75
15227h80p86j456m46J678J822P85J797P55l88m2l045k283q67Q12l6l11j29k540
15209e560K01K366J980O16o04R53o91k017J301J026r64n51k467R77K499k298J947
$$ plain form
15330 1134 865 -1105 -2457 -1085 -876 -2041 -2612 -3307 -1879 704 813 -1364 -2932 -3963 -2506 -82
15314 -82 1195 210 -922 -1049 116 1029 1287 200 -197 25 -1381 -873 -435 127 787 -420 -1467 1216
15296 1216 1977 580 -289 -2287 -3106 -3267 -2950 -205 592 -23 -714 -2039 -4815 -3146 -2203 -3067 -2896
15279 -2896 -2286 -2877 -4012 -4391 -1988 -1233 1149 170 -756 -1464 -1438 1360 3231 4091 2990 364 156
15262 156 2168 775 1710 2047 1198 -273 -2412 -2642 -784 339 -675 -873 -960 -523 1 1653 2933
15245 2933 2248 -341 -227 -45 231 2156 3544 2775 365 742 852 86 626 808 -1426 -1575 -1055 -880
15227 -880 -1666 -3122 -3568 -1890 -68 717 2514 3269 2881 2839 -206 -2489 -3356 -2544 -2580 -2891 -3020 -5560
15209 -5560 -5359 -2993 -1013 -397 -1001 -48 -739 -2756 -1455 -429 -1393 -1944 -4411 -3434 -935 -3233 -1286
15192a286R62K393J74j957k271l69J953n64L27K808N66k631n57q42j21L83L8j346
15174b340J131o8J41j900k35j290k69K687L732q76l60j028j227R63l04j12J28
15157a227l938J69L523K713l29l84Q37K135q49k225q1j47L00k601j387N70J315
15140a606k208J837K830n48K81N39J53J192p65j708J017J434j562m75R40o60R74
15123A665k496j02K499m10j480j983j179mm50R10J7J069n0J930L781M40l061k199
15105a103j174M75l20o88j683J26k36n94p14n73K049J795J081j862q64Q51R85
15088b449P93n52k74p54j508J375K121R49j154j22J223N35j177l41q8j663O02
15071b484K053P85J50m79L40J291j668r00j357J03J908J260q44k392q88J089R98
$$ plain form
15192 -1286 -324 2069 2243 286 -1985 -2354 -401 -965 -638 2170 2736 105 -452 -1294 -1415 -1032 -994 -2340
15174 -2340 -1209 -1277 -1136 -3036 -3271 -4561 -4830 -2143 1589 713 353 -675 -1902 -939 -1243 -1355 -1227
15157 -1227 -5165 -4996 -1473 1240 911 527 1364 3499 2650 425 344 197 497 -2104 -3491 -2921 -1606
15140 -1606 -3814 -1977 853 305 586 1125 1278 2470 1705 -3 1014 2448 886 411 1351 691 1665
15123 1665 -831 -933 1566 1156 -324 -2307 -3486 -3490 -3940 -3030 -3013 -1944 -1994 -64 3717 4157 1096 -1103
15105 -1103 -2277 -1802 -2122 -2810 -4493 -4367 -4603 -5197 -5911 -6484 -4435 -2640 -1559 -3421 -4285 -3434 -2449
15088 -2449 -1656 -2208 -2482 -3236 -4744 -3369 -1248 -299 -1453 -1575 -352 183 -994 -1335 -1423 -3086 -2484
15071 -2484 -431 354 504 25 365 1656 -12 -912 -2269 -2166 -258 1002 158 -2234 -3122 -2033 -1035
15054a035J415R93r39j589M76p09j920J977R1j106L0J584q28r62K19K059R72m36
15036B92j629j677J156M299K54j737N53j252k089j000K258k365j291M09K958K142
15020A281J58k719n65k07J048N55M90j452k089j63L428K330n91j67L18l168R37
15003e76j064k82R80r60J250J410j454q15K313J225j952O39M86M68J766o06k023
14986H05j791j790k946J384o50j16J031J83L97k71J03K20J543J113r71O32J418
14969B94j127l50j208J94J089q24m43J87m59K044l61j273K901L103K619j658o12
14952D116O32l001p68j82k776J339J016O20N87O55J337k184k580K25J803Q13k269
14935f17l92K230j026l123o27J985n63K29L28p79n71n11J758L00k966j026L975
$$ plain form
15054 -1035 380 1373 434 -1155 -679 -1388 -3308 -1331 -1240 -2346 -2316 -732 -1560 -2522 -2303 -244 728 292
15036 292 -1337 -3014 -1858 2441 2695 958 1511 259 -1830 -2830 -572 -2937 -4228 -3819 -861 1281
15020 1281 1439 -1280 -1845 -2052 -1004 -449 41 -1411 -3500 -3663 -235 2095 1504 1337 1655 -1513 -576
15003 -576 -1640 -1922 -942 -1902 -652 758 -696 -1511 802 2027 75 714 1200 1668 3434 2828 805
14986 805 -986 -2776 -5722 -4338 -4988 -5104 -4073 -3890 -3493 -3764 -3661 -3441 -1898 -785 -1756 -1124 294
14969 294 -833 -1183 -2391 -2197 -1108 -1932 -2375 -2188 -2647 -603 -964 -2237 664 3767 6386 4728 4116
14952 4116 4748 1747 979 797 -1979 -640 376 996 1583 2238 3575 1391 -1189 -964 839 1652 -617
14935 -617 -1009 1221 195 -2928 -3555 -1570 -2133 -1904 -1576 -2355 -2926 -3437 -1679 -1379 -4345 -5371 -1396
14918a396J487k110p13P52l64o78P20J083J870q6k419R76J33n18P77J270j014
14901b30J26K10j636P31l6l44p33k89K365R00m05r12K5J030J087k998j543k803
14883e455j018Q87P16P58n83K819J017n48m98P53J573q50k148j787O8l7J622j229
14865c940J272J576n92j413N69m04k921L46K337J364J411J149J008M40J128J93
14849C523p77j826j224r49O4K24q55j246R48J295P7k463L60N99O69j218J199N90
14831a010R79k229J908K030j916k85r37k04%J27J941J877M79k024L41L9m291p82
14813c957J626M1J353Q65k774j833Jm29p76R36L445o06P6K53J887O85l03J255
14795A745l51K21P61N33k373q90j279Q25J430j787k718M6M2N241K430j858R52
$$ plain form
14918 -1396 91 -2019 -2732 -1980 -2344 -3022 -2302 -1219 651 565 -1854 -878 -745 -1263 -486 784 -230
14901 -230 -104 106 -1530 -799 -835 -1179 -1912 -2201 164 1064 659 -253 -228 802 1889 -1109 -2652 -5455
14883 -5455 -6473 -5586 -4870 -4112 -4695 -1876 -859 -1407 -1905 -1152 421 -429 -2577 -4364 -4296 -4333 -2711 -3940
14865 -3940 -2668 -1092 -1684 -3097 -2528 -2932 -5853 -5507 -3170 -1806 -395 754 1762 2202 3330 3523
14849 3523 2746 920 -304 -1253 -1189 -965 -1820 -3066 -2118 -823 -746 -3209 -2849 -2250 -1581 -2799 -1600 -1010
14831 -1010 -31 -2260 -352 1678 -238 -523 -1460 -1664 -1664 -1537 404 2281 2760 736 1077 1116 -3175 -3957
14813 -3957 -2331 -2290 -937 -72 -2846 -4679 -4678 -5107 -5883 -4947 -1502 -2108 -2032 -1779 108 793 490 1745
14795 1745 1394 1615 2376 2909 536 -354 -1633 -808 622 -1165 -3883 -3837 -3795 1446 3876 2018 2970
14778B970K615j199m49k222j077R65n16j415p90q4J319k01J420K218k32j271k759
14761g08r14J392m63j751l13R15j479J177p84J614L80Q98N50J146j295r98M38
14744a95J638n02j994K75n87R89J740j82j332m44j784r90J347K156J514p57m29
14727D63k1j587j410J039J291L026o11p41Q93l097j859r4J023l7L3J829j069q12
14709a741K67j053J190O05R4J840j199k617N32K921J864J166j030k491l54o86
14693f92m29J286N48j3l89n70j31K299O78o59p6m205l096j40L261J652k476m09
14675c561J830J109m39K9r87p39J16J575J080p9L45K684J178j918o50m94m1O95
14657A733j341l083n61N10k491J356L309n89j259M27J936J518K5k183n37O9j286
$$ plain form
14778 2970 5585 4386 3937 1715 638 1603 1087 -328 -1118 -1202 117 -84 1336 3554 3322 2051 -708
14761 -708 -1622 -230 -693 -2444 -2757 -1842 -3321 -2144 -2928 -1314 -934 -36 514 1660 365 -633 -195
14744 -195 1443 941 -1053 -778 -1365 -376 1364 1182 -150 -594 -2378 -3368 -2021 135 1649 892 463
14727 463 442 -1145 -2555 -1516 -225 2801 2190 1449 2342 -755 -2614 -2708 -1685 -1722 -1689 140 -929 -1741
14709 -1741 -1474 -2527 -1337 -732 -638 1202 3 -2614 -2082 839 2703 3869 2839 348 -6 -692
14693 -692 -1121 165 713 700 311 -259 -390 1909 2587 1928 1852 -2353 -5449 -5589 -2328 -676 -3152 -3561
14675 -3561 -1731 -622 -1061 -1032 -2019 -2758 -2642 -1067 13 -66 279 2963 4141 2223 1573 1079 1038 1733
14657 1733 392 -2691 -3252 -2742 -5233 -3877 -568 -1157 -2416 -1989 -53 1465 1490 -693 -1230 -1161 -2447
14640b447k51j6k853k30K847R20J98K5j510O65J510j544o68K136j45l91J03K120
14622D69p68r05Q01J112j749l01k55O3J738J553J582j171l288j100J338J626J550
14605B295M45p5j148l019j328N52Q36j36L30l72k474o24Q12L779J451r94j405
14588a075j138J371q8Q40J789J58j873j256k477k210J374M373J274k251j451r40
14572c580J766J737m72Q30j586j904L769L853O20r23k26p21L58J327k43j674k016
14555I15L59m61j378J452n17KJ976K68n54J146k5j369k721m23L39j80m61K70J627
14536B65p4j277k77o43q76o41K538O38n47J284O35M4p17j171j570o1J25j56R81
14517a500l64l061L23K399J873l74q94j725j554K009J308n1K905P56j255o53J001
$$ plain form
14640 -2447 -2698 -2714 -5567 -5797 -2950 -2030 -1832 -1807 -3317 -2652 -1142 -2686 -3354 -1218 -1363 -1754 -1651 469
14622 469 -299 -1204 -403 709 -1040 -1341 -1596 -1533 205 1758 3340 2169 -1119 -2219 -881 745 2295
14605 2295 2740 2665 1517 -1502 -2830 -2278 -1442 -1578 -1248 -1620 -4094 -4718 -3906 -127 1324 330 -1075
14588 -1075 -2213 -842 -930 -90 1699 1857 -16 -1272 -3749 -5959 -4585 -212 1062 -1189 -2640 -3580
14572 -3580 -1814 -77 -549 281 -1305 -3209 560 4413 5033 4110 3884 3163 3521 4848 4605 2931 915
14555 915 1274 813 -565 887 370 372 2348 2616 2062 3208 3183 1814 -907 -1330 -991 -1171 -1632 -1362 265
14536 265 191 -1086 -1363 -2006 -2882 -3523 -985 -347 -894 390 1025 1069 352 -819 -2389 -2450 -2325 -2481 -1500
14517 -1500 -1864 -4925 -4602 -2203 -330 -704 -1598 -3323 -4877 -2868 -1560 -1611 1294 2050 795 142 1143
14500A143P17J146n58J10J643k704l877l059r99P69K492K904L2q06P97n19k179
14483b948O86L121J772n51j35j377j817p24N71J946P66M4j731o35j137p29J713
14466a165j57O73J937j598k504L96J736j53P77p28J317J84J775J880P55j70J101
14449F056K7r80k493l320j683j638r64K394K379j92j739K28P02Q53J344P59P74
14432B507k88l091j675J138p64k100K934J693J179j774l993k217M29J821J136
14417c065J519K212p05k042j087q20K853J844N06o95j093j565j306Q00L559n6
14401H59n92k16j099l055j04Q84J299P49j93K293K88Q16m26J298j287j322k048
14384a856j341N98L10J002J032L6j834K51O25r90o29L13r99j5J29J481J478K930
$$ plain form
14500 1143 1860 3006 2448 2558 4201 1497 -2380 -5439 -6438 -5669 -3177 -273 -241 -1047 -250 -769 -2948
14483 -2948 -2262 859 2631 2080 1945 568 -1249 -1973 -1402 544 1310 1354 -377 -1012 -2149 -2878 -1165
14466 -1165 -1322 -649 1288 -310 -2814 -2418 -682 -835 -58 -786 531 715 2490 4370 5125 4955 6056
14449 6056 6083 5103 2610 -710 -2393 -4031 -4995 -2601 -222 -414 -2153 -1925 -1223 -370 974 1733 2507
14432 2507 2219 -872 -2547 -1409 -2173 -4273 -1339 354 1533 -241 -4234 -6451 -6022 -4201 -3065
14417 -3065 -1546 666 -39 -2081 -3168 -3988 -1135 709 1215 520 -573 -2138 -3444 -2644 915 859
14401 859 267 51 -1048 -4103 -4207 -3323 -2024 -1275 -1468 825 1113 1929 1503 2801 1514 192 -1856
14384 -1856 -3197 -2599 -2289 -1287 -255 -219 -2053 -1802 -1177 -2167 -2796 -2483 -3482 -3497 -3368 -1887 -409 2521
14366B521J459r05l735j093M14R26J584k97p03J26o22M60O80m92L88J021j295
14349D37j351K19j515l3K84j378P20K959J363j062k066j058m35J91L56L88k615
14332d596K364L081m07l602j568K613K068O42J341J82k288n35k626k537N20K937
14316b411n9k95j72K243J805L6R39k333k715J961L90j637N55m39K21j238n3j516
14298d718q16J874J723J606M96R98j08j214l626K74Q04R94R20R77j129j507M87
14281a965N01O36r49j48L78J967J311R12j797l065j405o91p15O52R67K833K85
14264b93j076k948n67M990M67j820Pj024q79J069J13k93m52J28N63Q80p05j402
14246c242j007J402O50K368J330k44j785n25J34L27L96j040j165P66R92K080J265
$$ plain form
14366 2521 3980 3075 -660 -1753 -1339 -413 1171 874 171 297 -325 135 815 323 711 1732 437
14349 437 -914 -695 -2210 -2243 -1959 -3337 -2617 342 1705 643 -1423 -2481 -2916 -2725 -2369 -1981 -4596
14332 -4596 -2232 849 442 -3160 -4728 -2115 -47 595 1936 2118 -170 -705 -3331 -5868 -5348 -2411
14316 -2411 -2470 -2765 -2937 -694 1111 1147 2086 -247 -2962 -1001 -611 -2248 -1693 -2132 -1911 -3149 -3202 -4718
14298 -4718 -5534 -3660 -1937 -331 165 1163 1055 -159 -3785 -3511 -2707 -1713 -793 184 -945 -2452 -1965
14281 -1965 -1464 -828 -1777 -1925 -1547 420 1731 2643 846 -2219 -3624 -4315 -5030 -4378 -3411 -578 -293
14264 -293 -1369 -4317 -4884 106 573 -1247 -1240 -2264 -3143 -2074 -1961 -2254 -2706 -2578 -2015 -1135 -1840 -3242
14246 -3242 -4249 -2847 -2197 171 1501 1257 -528 -1053 -919 -592 -196 -1236 -2401 -1635 -643 1437 2702
14229B702k011o32j73P01q06j246J069K82j911J142K173J79j555j068R89J18j945
14212a992K484p67j703j119R23P82j161q04R84O62p16r48l5R7o94L96N52j550
14194d609J129L231J485k78N02J36k234p52J273q00n2J548J936r52j569j658o03
14177b267k247m51P32n31P41m60k95J111J886J891j270m099m56j39O85K829K999
14160F59J444n46j189m99j536k307m82L789L307r71l053r47k733Q34K610R01L66
14143c53j147J779m51j313j539O66r02j815J728L197j062q73O56J527m17P87J561
14126B029Q77r44N87R5k232j173k121N72K065r59p37l04J166P5J944j65j720j347
14108b292j090M75N11j32K053L537k73l493Q04O13J012J438j382j454m64m36j11
$$ plain form
14229 2702 691 59 -114 587 -219 -1465 -396 -114 -2025 -883 1290 1469 -86 -1154 -165 -47 -1992
14212 -1992 492 -275 -1978 -3097 -2174 -1392 -2553 -3357 -2373 -1711 -2427 -3375 -3410 -3313 -4007 -3611 -3059 -4609
14194 -4609 -3480 -249 1236 958 1460 1596 -638 -1390 -117 -917 -969 579 2515 1563 -6 -1664 -2267
14177 -2267 -4514 -4965 -4233 -4764 -4023 -4483 -4778 -3667 -1781 110 -1160 -5259 -5715 -5854 -5169 -2340 659
14160 659 2103 1557 368 -131 -1667 -3974 -4456 -667 2640 1669 -1384 -2331 -5064 -4230 -1620 -719 -353
14143 -353 -1500 279 -172 -1485 -3024 -2358 -3260 -5075 -3347 -150 -1212 -2085 -1429 98 -319 468 2029
14126 2029 2906 1962 2549 2644 412 -761 -2882 -2310 -245 -1204 -1941 -2245 -1079 -1004 940 775 -945 -2292
14108 -2292 -3382 -2907 -2396 -2528 -475 3062 2789 -704 100 713 1725 3163 1781 327 -137 -573 -684
14091f84j079j348K565P62k183j876K78J59p47%O29J914K45r32L027J849J96k401
14073C74r75k368J125J106j519P13j393k342N55J151J169J115l5q06j228J356
14057b002M72J351j237j173K6K460k008p70R77j219L06M152M058m645l749R1q82
14040c792N37j36j307j375K127K355M34q16j704q7K111M65J407k69k454j143K182
14023a465J471P68p54l12N64j399Rk884P91K426L047n13l396L06K382Q90k073
14006a42j015J512J73J37q98R32K759j513R10J241J214L82j546n62J072L28j66
13989D818J5P07L917L03j253o26n36L29J968J642J020p40m736m215J862K126n26
13972F075R65J356m16k366m08j74R80J546L14R26k171j865J313l24j677j844k511
$$ plain form
14091 -684 -1763 -3111 -546 216 -1967 -3843 -3565 -3406 -4153 -4153 -3524 -1610 -1365 -2297 730 2579 2775 374
14073 374 -601 -2969 -1844 -738 -2257 -1544 -2937 -5279 -4724 -3573 -2404 -1289 -1324 -2130 -3358 -2002
14057 -2002 -1530 -179 -1416 -2589 -2563 -103 -2111 -2881 -1904 -3123 -2817 1335 5393 748 -3001 -2910 -3792
14040 -3792 -3255 -3391 -4698 -6073 -3946 -1591 -1157 -1973 -3677 -3764 -1653 -1188 219 -50 -2504 -3647 -1465
14023 -1465 6 774 20 -292 272 -1127 -1118 -4002 -3211 -785 2262 1749 -1647 -1341 1041 1931 -142
14006 -142 -1157 355 528 665 -233 699 3458 1945 2855 4096 5310 5692 4146 3584 4656 4984 4818
13989 4818 4833 5540 9457 9760 8507 7881 7345 7674 9642 11284 12304 11564 6828 2613 4475 6601 6075
13972 6075 7040 8396 7980 5614 5206 5032 6012 7558 7872 8798 6627 4762 6075 5751 4074 2230 -281
13955b81L49j9L07k76n69o65q45J223K081m51j863k676k736k2K010L879J002j76
13937B72j297J019K756O15m87k084q70j719J208N48J246O7j667J522K550k296
13921A383k310m26K13J267q48m09J2k97Q00P36O7r77Q68l89p70j69J117K436J147
13902C451j831j727J005J127J91J236R38k444n98l56l08r2J555M1j306k415K286
13885G53N91M73R54j366J364K242j905m63n02o20j146L31j527J344K069j327l674
13868b409j697P64n4J599L257k40j257J297R41p20j394K08q68j888k287J704j016
13851d060q90r0n33J656K288m01r54l90n43q48N22J908Q64j102J475j44Q57J049
13833F64R49J085J587k188l174j831j758J248L068J049k23J136Q07J140m65j303
$$ plain form
13955 -281 68 49 356 80 -489 -1154 -1999 -776 1305 854 -1009 -3685 -6421 -6443 -4433 -554 448 272
13937 272 -1025 -6 2750 3365 2878 794 -76 -1795 -587 -39 1207 1274 -393 1129 3679 1383
13921 1383 -927 -1353 -1140 127 -721 -1130 -1118 -1415 -615 121 188 -789 79 -310 -1080 -1249 -132 2304 3451
13902 3451 1620 -107 898 2025 2216 3452 4390 1946 1348 992 684 592 2147 2188 882 -1533 753
13885 753 1344 1817 2771 1405 2769 5011 3106 2643 2141 1521 375 706 -821 523 2592 1265 -2409
13868 -2409 -4106 -3342 -3396 -1797 1460 1220 -37 1260 2201 1481 87 295 -573 -2461 -4748 -3044 -4060
13851 -4060 -4950 -5040 -5573 -3917 -1629 -2030 -2984 -3374 -3917 -4765 -4243 -2335 -1471 -2573 -1098 -1242 -385 664
13833 664 1613 2698 4285 2097 -1077 -2908 -4666 -3418 -350 699 476 1612 2419 3559 3094 1791
13817A791j138k51l92l32j307n14j256n2J602J625k94K25p44m15j715J534J771
13800A38l74J042j045k772Q74q37J185q34J877J434j353k167J68L3M31j84l04
13783b688J331K154j50k461l96J138j789j247N64Q57J075O04J329j499k260k354
13767e792j26J802J696P50O18K461J661J401k397j889m49p04K21P66j696j304
13751b981j459r38n4J193M61K611K099O11K25j392k999Q75P30J04l578j497P57
13734e232J205J32k86l3J846p51K75R33l5P93J181q42J375Q29k515k532j967J882
13716c742K011K243j265j907J387J154k433K873J388j773j608J229K049J477J49
13701C232q67j514l949m22R61j110r49L78P34R55r89q9O1N34J246K11o37j208
$$ plain form
13817 1791 653 402 10 -322 -1629 -2143 -3399 -3451 -1849 -224 -518 -293 -1037 -1452 -3167 -1633 138
13800 138 -236 806 -239 -3011 -2137 -2974 -1789 -2623 -746 688 -665 -2832 -2664 -2631 -2200 -2384 -2688
13783 -2688 -1357 797 647 -1814 -2210 -1072 -2861 -4108 -3544 -2687 -1612 -1008 321 -1178 -3438 -5792
13767 -5792 -5918 -4116 -2420 -1670 -1052 1409 3070 4471 2074 185 -264 -968 -747 19 -1677 -2981
13751 -2981 -4440 -5378 -5432 -4239 -3778 -1167 932 1543 1768 376 -2623 -1748 -1018 -914 -4492 -5989 -5232
13734 -5232 -4027 -3895 -4181 -4214 -2368 -3119 -2844 -1911 -1946 -1153 28 -814 561 1390 -1125 -3657 -5624 -3742
13716 -3742 -1731 512 -753 -2660 -1273 -119 -2552 321 1709 -64 -1672 -443 1606 3083 3232
13701 3232 2365 851 -3098 -3520 -2559 -3669 -4618 -4240 -3506 -2551 -3540 -3629 -3568 -3034 -1788 -1577 -2214 -3422
13683c422J621j70J43j165O57k8j489R04j434j4J237J090j298J668K028O69j950
13666i53O5m70j993q50M28J154j27j940L23J510J963j121K282J370k795p52O12
13649a294j441k94Q55J67R35p54m73j494k334K677K554p65k64j157j358J259K269
13632i12J249n76j25j070K533J314k291l646L09K859k22j643j099j027k58J036
13616c569n51j187m01l96J203P80M92q74R72L290Q17J56J71l502R75Q35J914q63
13598B62j713l58J327J445j111o15M52O85q64q45r9Q29R16o40O30J350L56O46
13580B653L015k905k304K64Q03q84k431r88j41J31r51J198j735O51K440L189J180
13563C185j735k676j561k03Q9L94j456j44l63P23j76J303J129J531K032j132K81
$$ plain form
13683 -3422 -1801 -1971 -1828 -2993 -2336 -2364 -3853 -2949 -4383 -4397 -3160 -2070 -3368 -1700 328 997 -953
13666 -953 -888 -1358 -3351 -4201 -3773 -2619 -2746 -4686 -4363 -2853 -890 -2011 271 1641 -1154 -1906 -1294
13649 -1294 -2735 -3029 -2174 -2007 -1072 -1826 -2299 -3793 -6127 -3450 -896 -1661 -1925 -3082 -4440 -3181 -912
13632 -912 337 -239 -364 -1434 1099 2413 122 -3524 -3215 -356 -578 -2221 -3320 -4347 -4605 -3569
13616 -3569 -4120 -5307 -5708 -6104 -4901 -4121 -3629 -4503 -3531 -241 576 732 903 -2599 -1624 -789 1125 262
13598 262 -1451 -1809 -482 963 -148 -763 -311 374 -490 -1335 -1434 -605 311 -329 301 1651 2007 2653
13580 2653 5668 2763 459 723 1526 642 -1789 -2777 -2918 -2787 -3738 -2540 -4275 -3624 -1184 2005 3185
13563 3185 1450 -1226 -2787 -2990 -2901 -2507 -3963 -4107 -4470 -3747 -3923 -2620 -1491 40 2072 940 1221
13546A221Q79j453N84k0O81k190k054J378O52k002l25O66n77J50K37J900J342
13529A069j721k86P00j264J059K40l844M13J954r18M4p58j31P18K25j629j68K472
13511a825J758j063r88K211q00k045k334N5L140K973J380k766l108j187K528K801
13495G30K36j235J388J62m55k211L11J829l25P46M75M71j141L29N75j360k617
13478b092k355L29J155Q37J657J828J304l94R48q70j66k165l00J15j62M93J296
13461A458K399L41p24K42k788l156p73o22p01K644K836l87j726j03j165J957J865
13444A597O03m39k382K405K059O9k389k904k143K440Q59n14m48J55l500j891L030
13427c393j02J329K283j352j164p76m1K1p90O6k661p46J789N11J81K623j718k369
$$ plain form
13546 1221 2100 647 1231 1211 1892 -298 -2352 -974 -322 -2324 -2649 -1983 -2560 -2410 -2173 -273 1069
13529 1069 -652 -938 -238 -1502 -443 -203 -4047 -3634 -1680 -2598 -2554 -3312 -3443 -2725 -2500 -4129 -4297 -1825
13511 -1825 -67 -1130 -2118 93 -707 -2752 -5086 -5031 -1891 1082 2462 -304 -3412 -4599 -2071 730
13495 730 966 -269 1119 1281 826 -1385 -1074 755 430 1176 1651 2122 981 1310 1885 525 -2092
13478 -2092 -4447 -4118 -2963 -2126 -469 1359 2663 2269 3217 2347 2181 16 -284 -169 -331 162 1458
13461 1458 3857 4198 3474 3716 928 -2228 -3001 -3623 -4324 -1680 1156 769 -957 -1060 -2225 -268 1597
13444 1597 2200 1761 -621 1784 3843 3912 1523 -1381 -3524 -1084 -225 -739 -1187 -1032 -4532 -6423 -3393
13427 -3393 -3495 -2166 117 -1235 -2399 -3175 -3216 -3195 -3985 -3919 -6580 -7326 -5537 -5026 -4845 -2222 -3940 -6309
13409f309N23L944L03o61M21J748j346L577K874l88j387r18m66J144n5l94m239
13392a629j468K107j727J622M74n53k52j172l43N57m81j59j198J171L222J844
13376B015Q08k69j075j095m54j123n75N79j31R2Q58k078j047J98j229K730N29
13359a267j519q08M72O61j288M22K131R9o31k20J162n00k66j960N57J33K048k56
13341a030j092k79o5j305j720P99J757J58p56J380K079J49J577K502j161j363
13325A630k377j299K647o89l73j115k88J767K439j639k817j461J38M21K232Q71
13309H7j037k551p62J709J55K346R29j659n27N57J001K63o72J83j557l9j358r56
13291c888K580L446M88k990j187j122k244J581L60O87J805J965J78j500k912m9
$$ plain form
13409 -6309 -5786 -1842 -1539 -2200 -1779 -31 -1377 2200 5074 4686 3299 2381 1915 3059 3004 2610 -1629
13392 -1629 -3097 -990 -2717 -1095 -621 -1174 -1426 -2598 -2941 -2384 -2865 -3024 -4222 -3051 171 2015
13376 2015 2823 2554 1479 384 -70 -1193 -1768 -1189 -1320 -1228 -370 -2448 -3495 -3297 -4526 -1796 -1267
13359 -1267 -2786 -3594 -3122 -2461 -3749 -3327 -1196 -1097 -1728 -1948 -786 -1286 -1552 -3512 -2955 -2822 -774 -1030
13341 -1030 -2122 -2401 -2466 -3771 -5491 -4692 -2935 -2777 -3533 -2153 -74 75 1652 4154 2993 1630
13325 1630 -747 -2046 601 -88 -461 -1576 -1864 -97 2342 703 -2114 -3575 -3437 -3016 -784 87
13309 87 -950 -3501 -4263 -2554 -2399 -53 876 -783 -1310 -753 248 511 -161 22 -1535 -1574 -2932 -3888
13291 -3888 -1308 2138 2626 -364 -1551 -2673 -4917 -3336 -2976 -2289 -484 1481 1659 159 -2753 -2802
13275b802L058J341k401k812L58p40N22L406Q09J903J143o61k76k427j631J821
13259F11q53o34J064L32J600r52P63K722j640j689j878j489pJ049m6r83j212m42
13241c684J256J749k402m26R39q95l4J67J422N58j788r98K958J871r03p06j70
13224a086l024m68k10j98J492J402J787j62J840K359R05k354k430j51j650l245
13208e193n29M8J54L729K093j682k907J018R11J37J03Q6R44p77k381J91L25P68
13190b962J791j272r06q41N02J172j04J32J723j30k052m19L80Q70K288J161n45
13173G88j337p64j64l52R08jm68j476j872K74p24j89J340L019O13k40j176q0j803
13154c704k734J938J855r87j669J171K354K253j833M75L069J287J610K218L081
$$ plain form
13275 -2802 256 1597 -804 -3616 -3258 -3998 -3476 -70 739 2642 3785 3124 2848 421 -1210 611
13259 611 -242 -876 188 520 2120 1168 1931 4653 3013 1324 -554 -2043 -2050 -1001 -1047 -2030 -3242 -3684
13241 -3684 -2428 -679 -3081 -3507 -2568 -3463 -3497 -3330 -1908 -1350 -3138 -4136 -1178 693 -210 -916 -1086
13224 -1086 -4110 -4578 -4788 -4986 -3494 -2092 -305 -467 1373 3732 4637 2283 -147 -298 -1948 -5193
13208 -5193 -5722 -5674 -5520 -1791 302 -1380 -4287 -3269 -2358 -2221 -2118 -2032 -1088 -1865 -4246 -4055 -3730 -2962
13190 -2962 -1171 -2443 -3349 -4190 -3688 -2516 -2620 -2488 -765 -895 -2947 -3366 -2986 -2116 172 1333 788
13173 788 -549 -1313 -1477 -1829 -921 -922 -1390 -2866 -4738 -4464 -5188 -5377 -4037 -1018 -405 -645 -1821 -1901 -3704
13154 -3704 -6438 -4500 -2645 -3632 -5301 -4130 -1776 477 -1356 -881 2188 3475 5085 7303 10384
13139A0384k627l513l485O7q82k019j312p75N09L126J632j393p87m45O45J320
13123D45p36m71j765J476K961N95k001r09j55p07m09NR97m2j250L16J109K14l5
13104c62r69P0k600q32O57j19J138L64O24m84N93K808q04j197K137p89j335R75
13086a25q83P81M44J262M61k043J477J036k77n87j408J26J149Q77k21j801l847
13069c579o82J65L375K662J352j624k347k688K29K670J042j028l15O21p45J440
13053E48J71K376J655J311j400M47n12j417J452j333j292n43j215N09r02J365
13037A220K24q2q71K453J261j97j291j884l84j476j041k5J553M70n10k008R9J843
13019f46L57r33j316L43N98j64n81M52K38K956j864m116k198J749K736J474J293
$$ plain form
13139 10384 7757 4244 759 826 -56 -2075 -3387 -4162 -3653 -527 1105 -288 -1075 -1520 -875 445
13123 445 -291 -762 -2527 -1051 1910 2505 504 -405 -560 -1267 -1676 -1671 -674 -716 -1966 -1650 -541 -327 -362
13104 -362 -1331 -1261 -3861 -4693 -4036 -4155 -3017 -2653 -2029 -2513 -1920 888 84 -1113 1024 235 -1100 -125
13086 -125 -1008 -227 217 1479 1940 -103 1374 2410 2133 1546 138 264 1413 2290 2069 268 -3579
13069 -3579 -4261 -4096 -721 1941 3293 1669 -678 -3366 -3137 -467 575 -453 -768 -147 -892 548
13053 548 719 3095 4750 6061 4661 5108 4596 3179 4631 3298 2006 1463 248 757 -145 1220
13037 1220 1444 1362 491 2944 4205 4008 2717 833 449 -1027 -2068 -2093 -540 -70 -580 -2588 -2489 -646
13019 -646 -289 -1222 -2538 -2195 -1597 -1761 -2342 -1890 -1652 1304 -560 -4676 -6874 -5125 -2389 -915 378
13002C78j313o31j972p03R92J133r16q88J171L27K74J088n65J882N39m3N24j306
12984b9R33J254l65k68k390j470J20L540J166k527l681k51L082j872M42J838N08
12967C0k30q94n95q77j247J837L241L017j334l114J86P34m05j97n08J476j453
12950c33l25o90M12l36p26M00o47K50L19j119j327J833K19J617J50k003j782Q72
12932c216j393r68P80J198P48n20L30j924p84L11P97J304j030o32J454Q94R0p88
12914c349o97O78J614N52R57J238J707L54o82k817N8L046j202k434J89K747J522
12897C481l83R18O04J439l262k516j478J800R30K015J488j08l083k802J810J565
12881B418n69j482N79j812J090J218j221j708p84L49n29P93j3m9l73j100j728
$$ plain form
13002 378 -935 -1566 -3538 -4241 -3249 -2116 -3032 -3920 -2749 -2422 -2148 -1060 -1625 257 796 753 1277 -29
12984 -29 904 2158 1793 1525 -865 -2335 -2215 1325 2491 -36 -3717 -3968 -886 -2758 -2316 -478 30
12967 30 -200 -1094 -1689 -2566 -3813 -1976 1265 4282 2948 -166 20 754 349 152 -356 1120 -333
12950 -333 -658 -1348 -936 -1272 -1998 -1598 -2245 -1995 -1676 -2795 -4122 -2289 -2070 -453 -303 -2306 -4088 -3216
12932 -3216 -4609 -5577 -4797 -3599 -2851 -3371 -3041 -4965 -5749 -5438 -4641 -3337 -4367 -4999 -3545 -2651 -2561 -3349
12914 -3349 -4046 -3368 -1754 -1202 -245 993 2700 3054 2372 -445 -387 2659 1457 -977 -788 1959 3481
12897 3481 3098 4016 4620 6059 2797 281 -1197 603 1533 3548 5036 4928 1845 -957 853 2418
12881 2418 1849 367 946 -866 224 1442 221 -1487 -2271 -1922 -2451 -1658 -1671 -1720 -2093 -3193 -4921
12864d921Q48J165j441J287J635j389K65P51N12O34L12q51J58q08k16j072m65
12847c596M64K352K326j716k824p03j443L72j541O38j244J423L503j41J97J302
12831f31q68K20O83M03P60j012O75M00K75K69o6K432K213L27L851N277l90R19
12813A5737K64Q18j36j679j693p56k340l419j140q40j235J782j419k61N45l91
12797C837j105q28j527K74J228N0m88j665K108J493o94k014r14j005m36J622o83
12780g47j144j81M70p67J681J169K711N54n2j864j777j026k145J501N30j296J121
12763a262J002O33M22p56M55o80j972l20M23J43L624j678k200j561J562J855r50
12746a260k67j620J160P42j185k606M21K390O02K334j750p95L54K123J708n98
$$ plain form
12864 -4921 -4073 -2908 -4349 -3062 -1427 -2816 -2551 -1800 -1288 -654 -342 -1193 -1035 -1843 -2059 -3131 -3596
12847 -3596 -3132 -780 1546 -170 -2994 -3697 -5140 -4768 -6309 -5671 -6915 -5492 -1989 -2130 -1933 -631
12831 -631 -1499 -1279 -596 -193 567 -445 230 630 905 1174 1108 3540 5753 6080 9931 15208 14818 15737
12813 15737 16001 16819 16683 15004 13311 12555 10215 6796 5656 4816 3581 5363 3944 3683 4228 3837
12797 3837 2732 1904 377 651 1879 1929 1441 -224 1884 3377 2683 669 -245 -1250 -1686 -64 -747
12780 -747 -1891 -2072 -1602 -2369 -688 481 3192 3746 3694 1830 53 -973 -3118 -1617 -1087 -2383 -1262
12763 -1262 -260 373 795 39 494 -186 -2158 -2478 -2055 -1912 1712 34 -2166 -3727 -2165 -310 -1260
12746 -1260 -1527 -3147 -1987 -1245 -2430 -5036 -4615 -2225 -1623 711 -1039 -1834 -1480 643 2351 1753
12730A753j266n1K869J348O04j909j4L293M386K141L291J707k387j822l025j865
12714I053j177q30j560l371j695J92q25j745K548Q20J069P13j673n24K571R55
12698D521J75N31n5l264k136l12J695N83q57J438O13k627l74j918L13j079R28
12681a825J167O40J207J091N8j588k080l791N96J472o44J720K584q61j082m81
12665a817k068J475J455J436P95k054k084j277K637J659k3q04K71o62k720J302
12649b479K35O95K506j0O76J26j766j444O76J571O46j573q42m75K018M033J825
12632F418j417k465R78k59q43m81O33l515j664P99J176M236J395k543k097J177
12616A528l40j791J210J77j398l49j175R09J279M60p47K06j258k393J065l84k63
$$ plain form
12730 1753 487 436 3305 4653 5257 3348 3334 6627 11013 13154 16445 18152 15765 13943 10918 9053
12714 9053 7876 7046 5486 2115 420 612 -213 -1958 590 1410 2479 3192 1519 995 3566 4521
12698 4521 4696 5227 5172 1908 -228 -540 1155 1738 881 2319 2932 305 -69 -1987 -1674 -2753 -1825
12681 -1825 -658 -18 1189 2280 2338 750 -1330 -5121 -4525 -3053 -3697 -1977 607 -254 -1336 -1817
12665 -1817 -3885 -2410 -955 481 1276 -778 -2862 -4139 -1502 157 134 -670 -399 -1061 -3781 -2479
12649 -2479 -2244 -1549 957 947 1623 1749 -17 -1461 -785 786 1432 -141 -983 -1458 560 4593 6418
12632 6418 5001 2536 3514 3255 2412 1931 2564 -951 -2615 -1816 -640 3596 4991 2448 351 1528
12616 1528 1188 -603 607 784 -614 -963 -2138 -1229 50 510 -237 -31 -1289 -3682 -2617 -3001 -3264
12599c264J866k01p78j721k74J885j7N9j391K16l97j609q82K546K381j298J035
12582a844q72O69j04P23J016R60j827m86k516J547m61L00J380j82l688Q81L690
12565h14O89j623m92L81R26k87L908j32k152k191O27P58J22l939j455K75O80J673
12547c046J114J405K37q29j219J378J002l349j202K392Q49J198k105R55j29k635
12531c984J432J144n11K262K276J326n92k136k011O11o99k274Q38J905L411J157
12515D155k828j386J074J35N72k723k290O37n16r39m07K437J084J632q28M78K066
12498B353j655j53k95q44k292n62j11K06M56M69p26J70J55J077L463L091j093
12481C709k326j266j641q68q55j33m96L67j695J238N00M63j257K739J039m07o77
$$ plain form
12599 -3264 -1398 -1599 -2377 -4098 -4372 -2487 -2504 -2445 -3836 -3620 -4017 -5626 -6508 -3962 -1581 -2879 -1844
12582 -1844 -2716 -2047 -2151 -1428 -412 548 -1279 -1765 -4281 -2734 -3195 -2895 -1515 -1697 -5385 -4504 -814
12565 -814 -125 -1748 -2240 -1859 -933 -1220 2688 2556 404 -1787 -1160 -402 -280 -4219 -5674 -5399 -4719 -3046
12547 -3046 -1932 -527 -290 -1119 -2338 -960 42 -3307 -4509 -2117 -1268 -70 -2175 -1220 -1349 -3984
12531 -3984 -2552 -1408 -1919 343 2619 3945 3353 1217 -794 -183 -882 -3156 -2318 -413 2998 4155
12515 4155 1327 -59 1015 1150 1722 -1001 -3291 -2654 -3170 -4109 -4516 -2079 -995 637 -191 287 2353
12498 2353 698 545 250 -594 -2886 -3448 -3559 -3353 -2897 -2428 -3154 -2984 -2829 -1752 1711 4802 3709
12481 3709 1383 117 -1524 -2392 -3247 -3380 -3876 -3509 -5204 -3966 -3466 -3003 -4260 -1521 -482 -889 -1566
12464a566l31N9R23L30q79J991j527k567q23J02M238L319k175k547k294l35K275
12447a807K387p59l57J405J428j171j079Q97K579o83o28l427l038Q21P94O99J187
12430g52p82k218L49J349L217L518m90j112n40R82k73k227R3J68J094j209L06
12413A473K015J86l95j277j263q8n55l23J952r99p97l74p35l5J20q85o56P28N75
12394a333j198j118k1o08J500L031K435K006K24j816n04j073r92L044J086q34
12378C829j649k487j670n72L036K902j89L83j120q39j19j462j129K072K52K295
12362C533R72r39Q84J964l133k531k04p52p53K445K90m99N47l3j947j256j329
12345b741j35m80L29M44O96k356J32K081R17O23Q44r91J462r92k447K036J428
$$ plain form
12464 -1566 -1897 -1838 -915 -585 -1464 527 -1000 -3567 -4390 -4288 -50 3269 1094 -1453 -3747 -4082 -1807
12447 -1807 580 -179 -536 869 2297 1126 47 944 3523 2840 2212 -1215 -4253 -3432 -2638 -1939 -752
12430 -752 -1534 -3752 -3403 -2054 1163 4681 4191 3079 2539 3521 3248 1021 1114 1282 2376 1167 1473
12413 1473 3488 3674 3279 2002 739 651 96 -227 1725 726 -71 -445 -1180 -1215 -1095 -1980 -2636 -1908 -1333
12394 -1333 -2531 -3649 -3670 -4278 -2778 253 2688 4694 4918 3102 2598 1525 533 3577 4663 3829
12378 3829 2180 -307 -1977 -2549 487 3389 3200 3583 2463 1624 1505 43 -1086 986 1238 3533
12362 3533 4505 3566 4450 6414 3281 750 546 -206 -959 1486 1776 1277 1824 1791 -156 -1412 -2741
12345 -2741 -2876 -3356 -3027 -2583 -1887 -4243 -4111 -2030 -1113 -490 354 -637 825 -167 -2614 -578 850
12328H50l66M96l8j011Q24K256m06o20n24k557q9r87k302j402K013K653J327P12
12310H29j864k35M31p87K018l41j615J59K352j84j29j493m06r99k493j437L68
12293e826R39m90K256J089O39J413Q22r87j917k571K158K953o74Q03J55k551j179
12276b968J014J527l11K323k775k350J303J794L21o16J659K582j389k996M78Q74
12260D70R48M6P84r2q32l72J3K167J501n35j873M26r67k530J390L242p65j71p52
12241B098J04k11l231n12l53p1q0K552K750l26r62j268j508j278J988m63j102
12224a873k58K897J90j826j056J272j186j554p4O17K53N11j70o74J823j162J493
12207g77K028j987J06K97J060L1j266q37j881O42Q59j501l92p77J114K616P17
$$ plain form
12328 850 484 980 942 -69 755 3011 2605 1985 1461 -1096 -1185 -2172 -4474 -5876 -3863 -1210 117 829
12310 829 -1035 -1270 -839 -1626 392 51 -1564 -1405 947 763 634 -859 -1265 -2264 -4757 -6194 -5826
12293 -5826 -4887 -5377 -3121 -2032 -1393 20 842 -145 -2062 -4633 -2475 478 -196 607 762 -1789 -2968
12276 -2968 -1954 -427 -738 1585 -1190 -3540 -2237 -443 -122 -738 921 3503 2114 -882 -404 470
12260 470 1418 1464 2248 2156 1324 952 965 3132 4633 4098 2225 2651 1684 -846 544 3786 3021 2850 2098
12241 2098 2202 1991 -1240 -1752 -2105 -2176 -2256 296 3046 2720 1758 490 -1018 -2296 -308 -771 -1873
12224 -1873 -2131 766 956 -870 -1926 -654 -1840 -3394 -3468 -2851 -2598 -2087 -2257 -2931 -1108 -2270 -777
12207 -777 1251 -736 -630 -333 727 758 -508 -1345 -3226 -2584 -1725 -3226 -3618 -4395 -3281 -665 52
12190E2j202m05L50n87R0q26P72k97j047j436n71J360Q84M21J202J55O96j973
12172b362q19M4J927p47j514J8j225N57M82K164K44l65k048j270K322K009J891
12155A308j343j199j080J090o81J623P67K47k870k086K42J01J277J308o12j305
12139c213l16M98J493r65J840J344r15K29l665l006M09Q96J969R05L099J136k492
12122g54K33m7o16N48J79j381j294Q24J749R27P75K024m02k961J911k256l509
12105d050m02J292j39j97J239J196L20L34J607O50j928j236o58k82J276l50L01
12088a027Q41J230j519j301N8q78K737J118M66o54j057N95l7K96j257J040n10
12071A41J695N36q97M5j913p22j19m62K69K612o24k37O52J95j232j558K8K70J81
$$ plain form
12190 52 -1150 -1555 -1205 -1792 -1702 -2528 -1756 -2053 -3100 -4536 -5107 -3747 -2863 -2442 -1240 -1085 -389 -2362
12172 -2362 -3181 -3137 -1210 -1957 -3471 -3453 -4678 -4121 -3639 -1475 -1231 -1596 -3644 -4914 -2592 -583 1308
12155 1308 -35 -1234 -2314 -1224 -1905 -282 485 732 -2138 -4224 -3982 -3881 -2604 -1296 -1908 -3213
12139 -3213 -3529 -3031 -1538 -2503 -663 681 -234 -5 -3670 -6676 -6267 -5371 -3402 -2497 602 1738 -754
12122 -754 -521 -568 -1184 -636 -457 -1838 -3132 -2308 -559 368 1143 3167 2765 -196 1715 -541 -4050
12105 -4050 -4452 -3160 -3299 -3496 -2257 -1061 -741 -407 1200 1850 -78 -1314 -1972 -2254 -978 -1328 -1027
12088 -1027 -186 1044 -475 -1776 -1718 -2596 141 1259 1725 1071 14 609 572 868 -389 651 141
12071 141 1836 2372 1475 1520 -393 -1115 -1234 -1696 -1427 1185 561 324 976 1171 -61 -1619 -1591 -1321 -1140
12052a140Q64L24q34Q05j127k015P26Pj899j406M35L273K268J756N88k060j391
12035h26r27O22K102K10j402k342j299n42J972K994N02q79k69L16q85L504j94
12018B657j801J86o1L3l14O92m00J335k089l186j831M73n3J060J546L507j140
12001F14j931J279K475m49q25k492l048J3J927K269j25j13j582j525q68n35P95
11984d121L022K71j690p05j976l70J887K311m82l94J259J86o54q78M59L00L9J482
11966e4l57k394k178n5l74K14J126K580M289J77o99j528M26J028q0k806J763K017
11948C095O57j953l189k19K78Q79j036K708j304p16R83R81N19j321L19o53k88
11931b60k768j650R76P45j94Q28k604l615L41J405J925K075J536N59K908R02k46
$$ plain form
12052 -1140 -276 48 -786 19 -1108 -3123 -2397 -2390 -4289 -5695 -5260 -1987 281 2037 2625 565 -826
12035 -826 -1753 -1131 971 1181 -221 -2563 -3862 -4404 -2432 562 1064 185 -84 232 -653 2851 2657
12018 2657 856 1042 981 1014 700 1392 992 2327 238 -2948 -4779 -4306 -4359 -3299 -1753 1754 614
12001 614 -1317 -38 2437 1988 1163 -1329 -4377 -4364 -2437 -168 -293 -406 -1988 -3513 -4381 -4916 -4121
11984 -4121 -1099 -828 -2518 -3223 -5199 -5569 -3682 -1371 -1853 -2247 -988 -802 -1456 -2334 -1875 -1575 -1536 -54
11966 -54 -411 -2805 -4983 -5038 -5412 -5198 -4072 -1492 2797 2974 2275 747 1173 2201 2121 -685 1078 3095
11948 3095 3752 1799 -1390 -1609 -1331 -452 -1488 1220 -84 -800 183 1164 1683 362 681 28 -260
11931 -260 -3028 -4678 -3702 -2957 -3151 -2323 -4927 -8542 -8201 -6796 -4871 -2796 -1260 -701 2207 3109 2863
11914B863m360k034J240k09J471J679p90k221P40K161k52q21J039j280j434J266
11898i42p5l84N23j63o85p89M73j34J61n27k116J231LJ207J865N68l50M71J355
11879A692Q9N16l079J209K964J167j54l39j824m47n71J139K816N7k801o45J37
11862A926k093k01J11J120J391j27k037k12j684J083j754L40R07j444j341J287
11846b728J991p41l84j353o76l55j42O83K060J574j584P34K279J321j228j6k145
11829g10J189M37j847M25J831l81L94N26n30j382P27K63k09j026M61R2L60J554
11811B174K267K122k22P57J902j922o34k060r37J861l55R68k788l986q69j66K61
11794a627l22k346J343M043J033j471j292j012K087r32k6j196m97J332J261J53
$$ plain form
11914 2863 -1497 -3531 -2291 -2500 -1029 650 -140 -2361 -1621 540 288 -533 506 -774 -2208 -942
11898 -942 -1017 -1401 -878 -1041 -1726 -2515 -2042 -2176 -2015 -2542 -4658 -3427 -3424 -2217 -352 216 -134 337 1692
11879 1692 1781 2297 -782 427 3391 4558 4404 4065 2241 1794 1223 2362 5178 5235 2434 1789 1926
11862 1926 -167 -368 -257 863 2254 2127 90 -122 -1806 -723 -2477 -2137 -1230 -2674 -4015 -2728
11846 -2728 -737 -1478 -1862 -3215 -3891 -4246 -4388 -3705 -1645 -71 -1655 -921 1358 2679 1451 1435 -710
11829 -710 479 916 -931 -506 1325 944 1338 1864 1334 -48 679 942 733 -293 168 260 620 2174
11811 2174 4441 6563 6341 7098 9000 7078 6444 4384 3447 5308 4953 5921 3133 -853 -1722 -1888 -1627
11794 -1627 -1949 -4295 -2952 1091 2124 653 -639 -1651 436 -496 -522 -1718 -2215 -883 378 531
11778E31k38j84q09L32k131o99P18P29k47P2o17J304J221J832J531k28j184k124
11760a91K95M45j575J051J482K136M8n47K507j87l975q05k112k443O4K305J947
11743D45j38m96j191o58J531K370J549k24J486R58P92r56j557n83j153r38k003
11726g66K43J880J927R76j50k510J86j212k371j894P66M02r75j315m12R33K179
11709b113N695J392j073n98n04j378M11Q38R64l38j164p49k65l431q94K064J926
11692G83J039q53p52M11N17J4J248J416k744k591j752j431J404L789K090j721
11676H67j665J90K392n10l362K757L815P84k746o01r54j73p76K669J652l95j929
11659B015m43J456K31l037q1k273k466J652M303K958k096j362L542j95j036M77
$$ plain form
11778 531 293 109 -700 -368 -2499 -3198 -2480 -1751 -1998 -1926 -2543 -1239 -18 1814 3345 3117 1933 -191
11760 -191 104 549 -1026 25 1507 3643 3691 3144 5651 5464 1489 684 -1428 -3871 -3807 -1502 445
11743 445 307 -189 -1380 -2038 -507 1863 3412 3188 4674 5632 6424 5468 3911 3328 2175 1237 -766
11726 -766 -523 1357 3284 4260 4110 1600 1786 574 -1797 -3691 -2925 -2523 -3498 -4813 -5225 -4292 -2113
11709 -2113 3582 4974 3901 3303 2799 1421 1832 2670 3634 3296 2132 1383 1118 -2313 -3207 -1143 783
11692 783 1822 969 217 628 1145 1159 2407 3823 1079 -1512 -3264 -4695 -3291 498 2588 867
11676 867 -798 -608 1784 1274 -2088 669 4484 5268 2522 1921 967 794 18 2687 4339 3944 2015
11659 2015 1572 3028 3259 222 141 -2132 -4598 -2946 1357 4315 2219 857 4399 4204 3168 3645
11643C645j651p65j917J3J2k469M4K15R17J540K229j447j364L073J147J109P46
11626E077l92J631j403m89O66j149J008o08j325j118j945j913M500o0k909J333
11610I04K176N57l03j137n16J361O41p79k273N92K909J184r39k819k275l17N61
11593d73J201J045j150q79o18L4Q10r88j092N61J546K237r99k985J392R70j265
11576f53j340K372K151j826o4O84j67K07M66L16j642j380k677J178L528K196O60
11559D009p88n52J769r4j509j918j65j099l122J608K108N5K178n44Q88j189j564
11542G1P11J882J442j226k902j412k94K246J123r3L86k79j15l98k621J439L411
11525C371P55k547J199K096o84n50j005r68m54o88m08j410j344L565P25j133J435
$$ plain form
11643 3645 1994 1229 -688 -675 -663 -3132 -3088 -2873 -1956 -416 1813 366 -998 2075 3222 4331 5077
11626 5077 4685 6316 4913 4424 5090 3941 4949 4341 3016 1898 -47 -1960 2540 2480 -429 904
11610 904 3080 3637 3334 2197 1681 3042 3683 2904 631 1223 4132 5316 4377 1558 -717 -1034 -473
11593 -473 728 1773 623 -256 -874 -840 -30 -1018 -2110 -1549 -3 2234 1235 -1750 -358 612 -653
11576 -653 -1993 379 2530 704 640 1324 1157 1364 1830 2146 504 -876 -3553 -2375 1153 3349 4009
11559 4009 3221 2669 4438 4344 2835 917 752 -347 -3469 -1861 247 302 2480 1936 2824 1635 71
11542 71 782 2664 4106 2880 -22 -1434 -1728 518 1641 1548 1934 1655 1540 1142 -1479 -40 3371
11525 3371 4126 1579 2778 4874 4190 3640 2635 1667 1213 525 117 -1293 -2637 928 1653 520 1955
11508A955M94j907l94K96j541j651M42Q6R97J158J516k139J287J368k365o91K146
11491A057M13j423M65J730Q91o72J185J785o24j110o35j294N31N96J247O30j223
11474C549j996J498K200j888K25K48P23m4j27j875j481k161J40K063J463J203
11458C740k75j471j01j807J682j471j98K067m3M86R97J563m04Q80L8J204R34L733
11440A1554L399m15r37l285j585j403k682k30K968J748q06j13K120k718m619r7
11424B899R45j649j800k637p61j1J702L234P56j83J162J735m09j400j86q90k049
11407D58l468j835O3O01K088j4J758J965J316N89j017r7O70q10k085p42J803N86
11389A829n77l19m10Q81k91N38J596j405j113o71N97J078q06j30J342J436q32
$$ plain form
11508 1955 2449 542 148 444 -1097 -2748 -2306 -2220 -1223 -65 1451 -688 599 1967 -398 -1089 1057
11491 1057 1470 47 512 2242 3133 2461 3646 5431 4807 3697 3062 1768 2299 2895 4142 4772 3549
11474 3549 1553 3051 5251 3363 3588 3836 4559 4515 4388 2513 1032 -1129 -989 1074 2537 3740
11458 3740 3465 1994 1893 86 1768 297 99 2166 2123 2609 3606 5169 4765 5645 5683 6887 7821 11554
11440 11554 14953 14538 13601 10316 8731 7328 4646 4416 7384 9132 8326 8213 10333 7615 2996 2899
11424 2899 3844 2195 395 -2242 -3003 -3014 -1312 1922 2678 2495 3657 5392 4983 3583 3397 2507 458
11407 458 -3010 -4845 -4782 -4181 -2093 -2107 -349 1616 2932 3521 2504 2407 3077 2267 182 -560 1243 1829
11389 1829 1252 933 523 1404 1113 1651 3247 1842 729 58 655 1733 927 797 2139 3575 2743
11372B743k508N0J684o04K68R49j920p4n16K063nl401k23L102K37l67j79l40J542
11353B501o97j874J718K862k195O90K74j854k362j156J438L216P87J956r64m95
11337C845J543o1j085k678l54P21K453J451m28q62L92k343k925j583p11K755N06
11320F36M13n32r67K181J025J43J36q8Q91J092P27L6J096O63J111J498K258R64
11302A3283N2K630N449M228M503P042O136O774N836K484j836n511p670q255q918
11287B6227p809m482k169k487j92k47o64K022L274J430k708l629j064j776m6j532
11271D148q72j054J419L333l01p79M73q52j937J058j177m470K397K727j204J31
11255C040J800l1O64M36k101j271m72N69m43R8L70o24J369k255l54j111N85N05
$$ plain form
11372 2743 235 285 1969 1365 1633 2582 662 588 72 2135 2130 -1271 -1494 1608 1845 1478 1299 959 2501
11353 2501 1804 -70 1648 4510 2315 3005 3279 1425 -937 -2093 -655 2561 3348 5304 4340 3845
11337 3845 5388 5327 4242 1564 1210 1931 4384 5835 5407 4545 4937 2594 -331 -1914 -2625 130 636
11320 636 1049 517 -450 1731 2756 2899 3035 2947 3838 4930 5657 5693 6789 7452 8563 10061 12319 13283
11302 13283 13335 15965 21414 25642 30145 37187 43323 50097 55933 58417 56581 51070 43400 35145 26227
11287 26227 18418 13936 11767 9280 9088 8841 8177 10199 13473 14903 12195 8566 7502 5726 5680 4148
11271 4148 3276 2222 3641 6974 6673 5894 6367 5515 3578 4636 3459 -1011 1386 4113 2909 3040
11255 3040 4840 4809 5473 5909 3808 2537 2065 2634 2191 2289 2659 2035 3404 1149 795 -316 269 774
11237G74J684M43J32P64k032r83J307K215n47j662J7n17j148j732L52L793q60
11220B000m250j083K908N69j31J99J89K141n77q48J101J107R97q31O4j539o61
11203A355k599J058j606n90R25K849J147r8J320K142j467j037J172M07L89J546
11187F913N827J306Q43M394P840O091N382O652R418M205k769m205j957n507p164
11172C7269n988o492o616k012j717k86J760J97k709l883l509J146N60K767l30
11157A0157k705j917J317J53K72o21m63k62j209M80k280j091q94j375Q57J174
11141A593K806K522Q06J123k649j780P35k25J409K322P98p7j845m320M59J435
11125E112j936j501J601K259J963J22k591j220o02j897P54K17j414q4o75J347
$$ plain form
11237 774 2458 2901 3033 3797 1765 782 2089 4304 3757 2095 2112 1595 447 -1285 -933 2860 2000
11220 2000 -2250 -3333 -425 144 13 212 401 2542 1965 1117 2218 3325 4322 3491 3555 2016 1355
11203 1355 -1244 -186 -1792 -2382 -1457 1392 2539 2441 3761 5903 4436 3399 4571 4978 5367 6913
11187 6913 12740 14046 14889 19283 27123 33214 38596 45248 54666 58871 56102 51897 49940 44433 37269
11172 37269 31281 24789 18173 16161 14444 14158 15918 16115 13406 9523 6014 7160 7720 10487 10157
11157 10157 7452 5535 6852 7005 7277 6656 6193 5931 4722 5202 2922 1831 937 -438 419 1593
11141 1593 4399 6921 7727 8850 6201 4421 5156 4931 6340 8662 9460 9383 7538 3218 3677 5112
11125 5112 3176 1675 3276 5535 7498 7620 5029 3809 3207 1310 2064 2281 867 783 108 1455
11109A455L529J653k462j133J31m66o15K01J600j094R58j730p50Q13K621J725
11093F436l10j467j417l94J792J808k125k190j112j489o64J40J905K214L511l53
11077F285j469j854k667j578O20K508O35j027j738J143K613m09j11K007n73k540
11061A845K617N61K1j064k047J51J041R90N02J380N64r20k104j383m23J57j430
11044D58p79Q9K04q38J361R64q73J059j182J006J811o61k34K65l07J126m99j432
11026A538m99R77J274J18J119j314j91K2m0k55N55J379r9n50j029J400N11J134
11008F050L74O69L81J036q29j388Q68L45J328L41j620k144k88j111O77m80Q90
10991E099O80r62L49K18J138J14j167o31P82J31q67n38l6N56L456M90k845k944
$$ plain form
11109 1455 4984 6637 4175 3042 3173 2707 2092 2293 3893 2799 3757 2027 1277 2090 4711 6436
11093 6436 6126 4659 3242 2848 4640 6448 4323 2133 1021 -468 -1132 -992 913 3127 6638 6285
11077 6285 4816 2962 295 -1283 -663 1845 2480 1453 -285 858 3471 3062 2951 4958 4385 1845
11061 1845 4462 5023 5044 3980 1933 2084 3125 4115 4617 5997 6561 5641 3537 2154 1731 1888 458
11044 458 -321 -232 -28 -866 495 1459 586 1645 463 1469 3280 2619 2385 2650 2343 3469 2970 1538
11026 1538 1039 2016 3290 3408 4527 3213 3022 3044 3004 2749 3304 4683 4584 4034 3005 4405 4916 6050
11008 6050 6424 7093 7474 8510 7681 6293 7161 7506 8834 9175 7555 5411 5123 4012 4689 4209 5099
10991 5099 5779 4817 5166 5384 6522 6636 5469 4838 5620 5751 4884 4346 4310 4866 8322 8812 5967 3023
10973C023r96O02L019R7j498j801J882K026J430J523J537K013K119O86k505k358
10957A0799R34J035l69n88J79j202Q69R55j687l181R23Q57M17o5P9j723J066L12
10939I610m03j367P57J172K427N466J987L676N724L731K276m92k180k128j459
10924B8797P16L03N3m384n270m122l511k237p36j70q62r2J468q60o0M7J53k23
10906I010r29J30L493j148J554l68Q25L41l27K95k347j435J350J768P05J01L261
10889A6279K182J324M559M390K644J793L601J016r45R44M84J66j524j372j041
10874C4500n065m787k784l441M20j354k43K20L83J45q82j572P40j010K211J635
10858A9116l093p31j105P41J798K223M651J623J146Q24K556K703N470O261R949
$$ plain form
10973 3023 2027 2629 5648 5745 4247 2446 4328 6354 7784 9307 10844 12857 14976 15662 13157 10799
10957 10799 11733 12768 12399 11811 11990 10788 11657 12612 10925 7744 8667 9524 9941 9876 9955 8232 9298 9610
10939 9610 9207 7840 8597 9769 12196 17662 19649 23325 29049 32780 35056 34564 32384 30256 28797
10924 28797 29513 29816 29869 25485 20215 16093 12582 10345 9609 9439 8577 8485 9953 9093 9033 9080 9233 9010
10906 9010 8081 8211 11704 10556 12110 11742 12567 12908 12581 12876 10529 9094 10444 12212 12917 13018 16279
10889 16279 18461 19785 24344 28734 31378 33171 36772 37788 36843 37787 38271 38437 36913 35541 34500
10874 34500 29435 24648 21864 18423 18843 17489 17246 17466 17849 17994 17112 15540 16280 15270 17481 19116
10858 19116 16023 15292 14187 14928 16726 18949 23600 25223 26369 27193 29749 32452 37922 44183 54132
10843E4132J3651J5140J9690J7724J5181J6009J5884J542q996q196l710K970o64
10830A50357j5284k6596k3142j8351j0380m657l220m320l073l266k414p93q66
10817C3995j880r98j122L36l649j749o48n4K381k333l990k400l457N67L028q18
10801A7209m20J971L19k656j656j915k763j909J661M603p26j860n37k56K43K99
10785A1607j58J880J539N95r6n50L80Q44j654r8R73Q4Q87l61q14k839q84K14j225
10766A0324k066N56p78j350p23J458K598J559P99o25N18J278M61k314j169k5N44
10749A1045p66j569j6Q51m36J80N58k531j45j96j173j564J54L858K328J366K746
10732A4690K625J173Q14k3m22M49J331k21M74p38l36j431k842j461J022k235k718
$$ plain form
10843 54132 67783 82923 102613 120337 135518 151527 167411 168953 159957 151761 148051 151021 150357
10830 150357 135073 108477 85335 66984 56604 51947 48727 44407 41334 38068 35654 34861 33995
10817 33995 32115 31117 29995 30331 26682 24933 24285 24231 26612 24279 20289 17889 14432 14999 18027 17209
10801 17209 16789 18760 19079 16423 14767 12852 10089 8180 9841 14444 13718 11858 11321 11065 11308 11607
10785 11607 11449 13329 14868 15463 15367 14817 15197 16041 14387 14289 15262 15346 16233 15872 15058 12219 11335 11549 10324
10766 10324 8258 8814 8036 6686 5963 7421 10019 11578 12377 11752 12270 13548 14009 11695 10526 10501 11045
10749 11045 10279 8710 8694 9545 9109 9289 9847 7316 7171 6975 5802 4238 4392 8250 10578 11944 14690
10732 14690 17315 18488 19302 19279 18857 19306 20637 20416 20890 20152 19816 18385 15543 14082 15104 12869 10151
10715A0151p62Q74K037K991M46J744j973l629J454K25J664j527j714J311L124
10700A6416j296K354J770j764j907j001j285m60j768J13L214Q08j7j686K189j443
10684A4237q62J760M11n12j380K369J191J961k35k953j736j016J364K090k85J205
10668A7609O03K083K671J898j41J339k849j248N79J803k469j426l718k711J372
10653A5395P81J006j348R91Q09M19k85K91O90O92P89k277j755J492M89r75K024
10636A9228P2J167j623l537J052j67j153J299j583m65j064L76J879Q48R51O47
10620A7927J542K419J765P21O11J218J360L641N829M048L873P354J0899J1888
10606G5095J4205J9310K5659L8162M9014N8694N7201O1599P3119N2839j0897m3157
$$ plain form
10715 10151 9389 10263 12300 15291 15737 17481 15508 11879 13333 13558 15222 13695 11981 13292 16416
10700 16416 15120 17474 19244 17480 15573 14572 13287 12827 11059 11172 14386 15194 15177 13491 15680 14237
10684 14237 13375 15135 15546 15034 13654 16023 17214 19175 18940 15987 14251 13235 14599 16689 16404 17609
10668 17609 18212 20295 22966 24864 24723 26062 23213 21965 22544 24347 21878 20452 16734 14023 15395
10653 15395 16176 17182 15834 16825 17634 18053 17768 18059 18749 19441 20230 17953 16198 17690 18179 17204 19228
10636 19228 19300 20467 18844 15307 16359 16192 15039 16338 14755 14290 13226 13602 15481 16329 17280 17927
10620 17927 19469 21888 23653 24374 24985 26203 27563 31204 37033 41081 44954 52308 63207 75095
10606 75095 89300 108610 134269 172431 221445 280139 337340 398939 472058 524897 514000 470843
10594D70843l2009m3779p8496q6144n8780l1636j9004j3243q593n702n667l507
10582H4283j983m165n508n000l508j437m560J14l854l134j420j271l966j650k341
10567D0600m886k899K901q37m75N32M38j594J628K161M980K217K571L563M98N16
10551E1914K07J217j84l093l887k748m738m301l229J29J059J062l80l806K38J215
10535C0675k826j043J627j730j773k316k486j088n25j325p63N19L396M607J829
10520B6778J568J774l21q66j951k314J317j035n47j749J87n36q02o89j271k50
10504A9293J459R59J555m127j722N55j886m97q76J8m23j359J257J911R46j604
10488A5459m063n38J764J406L14L648P40n2q12m7J582N89k836k101R30K761P95
$$ plain form
10594 470843 438834 395055 316559 230415 171635 139999 120995 107752 99159 93457 87790 84283
10582 84283 82300 78135 72627 67627 64119 62682 58122 58236 54382 51248 49828 48557 44591 42941 40600
10567 40600 35714 32815 35716 34879 34404 34936 35374 33780 35408 37569 42549 44766 47337 50900 51398 51914
10551 51914 52121 53338 53154 50061 46174 43426 38688 34387 31158 31287 32346 33408 33028 29222 29460 30675
10535 30675 27849 26806 28433 26703 24930 22614 20128 19040 18515 17190 16427 16946 20342 24949 26778
10520 26778 28346 30120 29799 28933 26982 24668 25985 24950 24403 22654 22841 22305 21503 20814 19543 19293
10504 19293 20752 21711 23266 19139 17417 17972 16086 15589 14713 14731 14308 12949 14206 16117 17063 15459
10488 15459 11396 10858 12622 14028 14342 17990 18730 18678 17866 17819 19401 19990 17154 15053 15983 18744 19539
10471A9539l1k969j11L426N36J382M492K393j499J652J986K988K199K724M550
10456D3257J1405J2804J1386J0419J0296J4228J7381K625o497q003q508j0974
10444I9819j2125j3328j3772q822n008j60n64k532k548j436J79O40J099k39m84
10429D0719j825n60k041j433k271J175M039K810L917K528L992K347P33J152J008
10414E6290N11m69k012k140j265j092k054k203j244n21L002N179K913Q78M550
10399F0323K515J563o4M79J597K390M554N198j531m517r53M231p67m744p856n570
10383E6848m420l261N87r50J631K685K620L186M412L323M720L084R25K262N32
10368G8184j093J415N55K969L026J006O98P46L955N954N693L973M464Q316Q734
$$ plain form
10471 19539 19508 16539 16428 19854 20390 21772 26264 28657 27158 28810 30796 33784 35983 38707 43257
10456 43257 54662 67466 78852 89271 99567 113795 131176 133801 127304 119301 110793 99819
10444 99819 87694 74366 60594 51772 46764 46604 46040 43508 40960 39524 39703 40343 41442 41203 40719
10429 40719 38894 38334 36293 34860 32589 33764 37803 40613 44530 47058 51050 53397 54130 55282 56290
10414 56290 56801 56332 54320 52180 50915 49823 47769 45566 44322 43801 46803 51982 54895 55773 60323
10399 60323 62838 64401 64337 64816 66413 68803 73357 78555 77024 72507 71554 75785 75018 70274 62418 56848
10383 56848 52428 49167 49754 48804 50435 53120 55740 58926 63338 66661 71381 74465 75390 77652 78184
10368 78184 77091 78506 79061 82030 85056 86062 86760 87506 91461 97415 103108 107081 111545 119861 128595
10353A28595N494L982K797M021R216P999R931J2978K1014K5281L0598M1598N7114
10340C60618P8403J08247J42415J75248K08883K44125K49967K33568K13970J75663
10330B191107J12971L2847m3478j00528j49209j99477k27537k23980k13110j96288
10320I83318j57389j22012j04246p9728m2669k5243j9547j6900j6143j5209j4458
10309C69774j6529j8809j9189j7090j6514j1986q404q093p255n753j087l57Q50
10296B39558J079j944j994j513k439J53K410k4j462k202K160K247J53J061L848
10281B41091K321J570L333P204J2585J7139J9618K1717K4705K7064K6832K3968
10269D29147J1620M36o851j2009k2446k7183k0892j5165j3521j3367r902q197
$$ plain form
10353 128595 134089 138071 140868 144889 154105 162104 172035 185013 206027 231308 261906 303504 360618
10340 360618 439021 547268 689683 864931 1073814 1317939 1567906 1801474 2015444 2191107
10330 2191107 2304078 2336925 2293447 2192919 2043710 1844233 1616696 1392716 1179606 983318
10320 983318 825929 703917 599671 519943 477274 452031 432484 415584 399441 384232 369774
10309 369774 353245 334436 315247 298157 281643 269657 261253 253160 245905 240152 239065 238708 239558
10296 239558 240637 238693 236699 235186 232747 232900 235310 235286 233824 231622 233782 236029 236182 237243 241091
10281 241091 243412 244982 248315 255519 268104 285243 304861 326578 351283 378347 405179 429147
10269 429147 440767 441203 434352 422343 399897 372714 351822 336657 323136 309769 299867 291670
10257B91670p076o049m605n083o796q490n160l470j339K14P30M559J1967J5911
10243B76983J3403J5427J5800J4824K0201K3457K1262K7099L7175L9933L8382
10232E43946L6243L8843L9298M2109M8964N7536O2762P0408Q5162R9570J16606
10221A241447J31351J44312J53170J71262K04920K25170K12168K02415K60819
10212B947034L60674M44367N49831P39873J043168J440136J810214K138625K736509
10203A4210431L909643N607584P723157R746416J0399715J0173561J1381589J2308222
10195H5460318O107302m594912p585225m732126q311667j5036675j4486812r294489
10187B7525714n441796l381974k257501j580894j148981q42036o03131n31384
$$ plain form
10257 291670 284594 278545 273940 268857 262061 253571 248411 244941 243602 243816 244546 249105 261072 276983
10243 276983 290386 305813 321613 336437 356638 380095 401357 428456 465631 505564 543946
10232 543946 580189 619032 658330 700439 749403 806939 869701 940109 1025271 1124841 1241447
10221 1241447 1372798 1517110 1670280 1841542 2046462 2271632 2483800 2686215 2947034
10212 2947034 3307708 3752075 4301906 5041779 6084947 7525083 9335297 11473922 14210431
10203 14210431 18120074 23727658 31450815 41197231 51596946 61770507 73152096 85460318
10195 85460318 91567620 86972708 79387483 74655357 66343690 51307015 36820203 27525714
10187 27525714 22083918 18701944 16444443 14863549 13714568 12872532 12269401 11738017
10179A1738017n99973n76098n13219n82476o91027p03621o95590o88223o30384
10170F057406n49024n15924m96625m41501l74619l17630k76537k45403k16317
10161B623826j98691j84671j60559j39805j23978j11554j00129r0520q3603p5228
10151A355088o9019o0640o0308o4158m7172k8659j5993q612j1708j7561j3322
10140I57936j2426n3443j04546j07803p7242n6397m5361l8030l4390l0973k6234
10129C71091k3746k1567j7471j7544j8668j7339j1155q539r443r255m046j571
10117B10747l690o054n997o739l625k267o193o885o194p472m141n247n242p188
10103A33813m633p03l333k158k220J398J863o04R03J17p46L30n73j685J077J275
$$ plain form
10179 11738017 11138044 10561946 10048727 9466251 8775224 8071603 7376013 6687790 6057406
10170 6057406 5508382 4992458 4495833 4054332 3679713 3362083 3085546 2840143 2623826
10161 2623826 2425135 2240464 2079905 1940100 1816122 1704568 1604439 1513919 1430316 1355088
10151 1355088 1286069 1225429 1165121 1100963 1053791 1025132 1009139 1000527 988819 971258 957936
10140 957936 945510 892067 787521 679718 602476 546079 500718 462688 428298 397325 371091
10129 371091 347345 325778 308307 290763 272095 254756 243601 235062 225619 216364 212318 210747
10117 210747 207057 201003 195006 188267 184642 182375 176182 169297 163103 155631 151490 146243 141001 133813
10103 133813 129180 128477 125144 122986 120766 122164 124027 123423 124326 124443 123697 124027 123454 121769 122846 124121
10087A24121m79k719P83j10m14Q21O909Q147N852K208O549J0987J3202O550K078
10072A84485j218m300o731r950j2729j4413j2212n939j706q36j745j512l272l382
10058A04540J349M793L631L032R46J695N84J831J027L780L544L050p0J958L29
10043A36019n136k016m416o677l248k792l006q10O09M70j987k399l287k163m373
10028I4788p99o57j165k652O47J279l544k707m142k920J1o9L51J573J741M110
10012H5845O212R97j828j582j908l93O57k273j440j819j076j602P52J453j245
9997H0750N49J991k975l874o340n204m159l022k774P12J766K163J00n31l802j719
9981E3631q9j899r85j2k691k590M06l74j355j945K74J892R44K031L299j131k171
$$ plain form
10087 124121 123642 120923 121706 121596 121182 122003 128912 137059 142911 145119 151668 162655 175857 182407 184485
10072 184485 183267 178967 172236 162286 149557 135144 122932 116993 115287 114451 112706 111194 107922 104540
10058 104540 105889 110682 114313 117345 118291 119986 120570 122401 123428 127208 130752 133802 133732 135690 136019
10043 136019 130883 128867 124451 117774 114526 111734 108728 107918 108527 108997 107010 104611 101324 99161 94788
10028 94788 93989 93332 92167 89515 90162 91441 87897 85190 81048 78128 78139 78070 78421 79994 81735 85845
10012 85845 92057 93054 91226 89644 87736 87343 88000 85727 84287 82468 81392 79790 80542 81995 80750
9997 80750 81299 83290 80315 76441 70101 64897 60738 57716 54942 55654 57420 59583 59683 59152 55350 53631
9981 53631 53542 51643 50658 50646 47955 45365 45771 45397 44042 42097 42371 44263 45207 47238 50537 49406 47235
9964D7235P34J126J358K511J05L30R82K162l006j266J12r45k883r97j612L2L282
9947D9260J925M43L879K719J405n56J520K598j059m494l385j860j195P12M321
9932E6233K377R98J928N79J149L003K888M57m543k440r7j308k703K40J590J501
9916F1852k055j697o4Q13R04J320J590j424K78j58j102K47j511r02J322N31k71
9899E9673J16K907R08p16m58p48l992n226j882K99j635j245k138K05J22P93j439
9882D5544J42j036j782j2N78k074j857j199J093K47r79k245j226kM020K365J535
9865D3112O21q93R85m5L381j392k388k072k018m726l780r32j74j849k774R70J567
9848B7593k58J932K961m686o81P70q39Q11M34m55J987M848K839Q14j928k237k048
$$ plain form
9964 47235 47969 49095 50453 52964 53069 53399 54381 56543 53537 52271 52383 51438 48555 47558 45946 45978 49260
9947 49260 51185 51628 55507 58226 59631 59075 60595 63193 62134 57640 54255 52395 51200 51912 56233
9932 56233 58610 59608 61536 62115 63264 66267 69155 69612 65069 62629 62532 61224 58521 58761 60351 61852
9916 61852 59797 58100 58036 58849 59753 61073 62663 61239 61517 61359 60257 60504 58993 58091 59413 59944 59673
9899 59673 59789 62696 63604 62888 62430 61682 57690 52464 50582 50881 49246 48001 45863 46068 46190 46983 45544
9882 45544 45686 44650 42868 42856 43434 41360 39503 38304 39397 39644 38665 36420 35194 35192 39212 41577 43112
9865 43112 43733 42840 43825 43780 47161 45769 43381 41309 39291 34565 30785 29853 29679 27830 25056 26026 27593
9848 27593 27335 29267 32228 27542 26861 27631 26792 27603 28037 27582 29569 34417 37256 38070 36142 33905 31857
9831C1857j980N18R96l133l550Q95J123P51O2O72M129J479k513p89J172k511O7
9814B9245P53R18Q51K821J238J460J835j299J063J416M083L578N327O386O037
9799F5712R363R094J3515J8678K8109L7008M8178N7042O1080O3060P2547N3743
9787E37129p862m2671l3318l8644p5385q5029n9720l5294j8929j3067j0170r808
9775A07232q025l690j452k627m033k309j916j159k781m175l323l085j382m492
9761F2783l828k206n235n028k546j474k339m072m64j027l393k596k818n50J711
9746B6918m89j65J07J826J859r3K862N43k371N28k645k031Q14j301o14m16j580
9729B3752J230j02l961j43J871M687L458K934J847K864O33k886m293Q31M268R61
$$ plain form
9831 31857 29877 30395 31391 28258 24708 25603 26726 27477 27539 28211 32340 33819 31306 30517 31689 29178 29245
9814 29245 29998 30916 31767 34588 35826 37286 39121 37822 38885 40301 44384 47962 53289 59675 65712
9799 65712 75075 84169 97684 116362 144471 181479 229657 286699 347779 410839 483386 537129
9787 537129 529267 486596 453278 414634 339249 254220 194500 159206 140277 127210 117040 107232
9775 107232 99207 95517 94065 91438 87405 85096 83180 82021 79240 75065 71742 68657 67275 62783
9761 62783 58955 56749 51514 46486 43940 42466 40127 36055 35591 34564 31171 28575 25757 25207 26918
9746 26918 26429 26264 26371 28197 30056 29963 32825 33368 30997 31525 28880 26849 27663 26362 25748 25332 23752
9729 23752 24982 24880 20919 20776 22647 27334 30792 33726 35573 38437 39070 36184 31891 32722 36990 37951
9713C7951J428L524R63l308j868k224R31N24o77k158j56j321j297k681M67J335
9697C1433j164J87K113O12K125N139J973J9j738j065l721k098m62j335k563L526
9681C2981J520k893n55K519L330N419L036M081L487K399j103m926k676k895m612
9666C9112l19J424k644l35K001J420j621n52K077J642L253J951J530j193k778
9651D4968j319N68j58m43K788J726M97j259m307k716l499N7J28J569j549n15J811
9634C8347K979K417J611N872O255N038O849Q543J1340J3873J6482K0006J8824
9621A58436K3312L2466M1046N1102O3399P2365Q5958R9514J05517J08295J05757
9610I47167R4716O9272L4903N418l4780p1351r0059j03231j09367j05072r5340
$$ plain form
9713 37951 39379 42903 43866 40558 38690 36466 37397 37921 37244 35086 34930 33609 32312 29631 30098 31433
9697 31433 30269 30456 32569 33181 35306 40445 42418 42437 40699 39634 35913 33815 33353 32018 29455 32981
9681 32981 34501 31608 31053 33572 36902 42321 45357 49438 52925 55324 54221 49295 46619 43724 39112
9666 39112 38793 40217 37573 37238 39239 40659 39038 38486 40563 42205 45458 47409 48939 47746 44968
9651 44968 43649 44217 44059 43616 46404 48130 48627 47368 43061 40345 36846 36903 37031 38600 37051 36536 38347
9634 38347 41326 43743 45354 51226 57481 62519 69368 77911 89251 103124 119606 139612 158436
9621 158436 181748 214214 255260 306362 369761 442126 528084 627598 733115 841410 947167
9610 947167 1041883 1111155 1146058 1151476 1116696 1045345 955286 852055 742688 637616 542276
9599E42276q1250o3395m7845l5847k6740k2621j8361j5272j3734j3162j2371j0595
9587A81083j0067r793o576q128p567l067m022n386n788n119p920o236o353q477
9573H6584r137m343r24j445k122k410k477o9J624M433J768m14k288k121k30j34
9557F6295p96k75Q07j893k217k230j776K181j14j450j802m67j227l98m515o316
9541D3807k435j783k962J58J997J872M574K900N62L085M183K511L02M31k622k911
9525E3669j70L263J355j819q43q54j91j493k724j899K017Q19J66j240l464o285
9509D0307n113j996m349o827l235J463J920M575O1M84J820K01k036j896J454L58
9493B7191L58L521K632K476O82j774P64K793k76j602K626K789m67q88N39K557
$$ plain form
9599 542276 461026 397631 349786 313939 287199 264578 246217 230945 217211 204049 191678 181083
9587 181083 171016 161223 154647 146519 138952 135885 131863 126477 120689 115570 107650 101414 95061 86584
9573 86584 77447 73104 72180 70735 68613 66203 63726 63657 65281 69714 71482 71068 68780 66659 66429 66295
9557 66295 65499 65224 66031 64138 61921 59691 57915 60096 59982 58532 56730 56263 55036 54638 50123 43807
9541 43807 41372 39589 36627 36785 38782 40654 45228 48128 48690 51775 55958 58469 58771 59202 56580 53669
9525 53669 53499 56762 58117 56298 55455 54601 54410 52917 50193 48294 50311 51130 51296 50056 46592 40307
9509 40307 35194 33198 28849 22022 18787 20250 22170 26745 26806 27290 29110 29311 27275 25379 26833 27191
9493 27191 27549 31070 33702 36178 36860 35086 35850 38643 38367 36765 39391 42180 41713 40825 41364 43921
9477D3921N333N491N236K166N489Q391J1504J6193J9639K1845K0355K4887L6119
9464B26569N0115M6122L2009K2894K4010K1786j2773m5309o6730o1789m3496k1636
9452A71772j1038p727o460n134n153p818q345n441n009n819l007k759k402l430
9438I2230l599l145L17J399J557L807O626P928R995O349o4m74k642m669k545n541
9422A07529p840o296k400r83k466J61L281L030K700O987R067N105k70j520q19
9407A15266J18q04J90l10j893l139k810l053m248l462q96m690l166K623J392N53
9391I1671J669M324K420N712J4261J6210J2130Q782M731N04J091j336k481N88
9377A60276K410Q21l853l779j341L045K737j082P57M662K028p60J50L01l79P03
$$ plain form
9477 43921 49254 54745 59981 62147 67636 76027 87531 103724 123363 145208 165563 190450 226569
9464 226569 276684 322806 354815 377709 401719 423505 410732 365423 298693 236904 193408 171772
9452 171772 160734 153007 146547 141413 136260 128442 120097 114656 109647 103828 100821 98062 95660 92230
9438 92230 88631 85486 85803 87202 88759 92566 99192 107120 117115 123464 123400 122926 120284 115615 113070 107529
9422 107529 99689 93393 90993 90010 87544 87705 90986 94016 96716 103703 112770 117875 117605 116085 115266
9407 115266 115384 114580 114770 114460 112567 109428 106618 103565 99317 95855 94959 90269 87103 89726 91118 91671
9391 91671 93340 97664 100084 105796 120057 136267 148397 157179 161910 162414 163505 162169 159688 160276
9377 160276 162686 163507 159654 155875 154534 157579 160316 159234 159991 164653 166681 165921 166071 166372 165993 166696
9361A66696K34j352l444J68L990L397j300k828l29K816M947Q357J0122J4845J6305
9346B22624J9095K1137K8374M3148N7083M6213O507j0680k6M2038P5985M5058
9334E96556j4424l6427l0363n2511q8248m4591L659J1535O779J3834K3694L7008
9322D26501M5583M5297M0959L2510K2361Q02j9264k8501k4622j2601L583J3587
9310E46195K1572K3672K0670K1347K5460J8663J2785J2314J7247K1006K1150K1825
9298G83906J7048J0564J3117K3593M1902N9423P2439P3674O4512N3176L6783j2532
9286A237605q2021j11432r0871o3102m0453j5025k389L050O124J5407K5067K7668
9274I09628J5963Q757Q395O442P767o689k7409l0527k9162k0524n982M256K969
$$ plain form
9361 166696 166930 165578 162134 162302 166292 169689 168389 165561 165232 168048 172995 181352 191474 206319 222624
9346 222624 241719 262856 291230 334378 391461 437674 444181 433501 433475 475513 551498 596556
9334 596556 582132 545705 515342 462831 374583 329992 333651 345186 351965 365799 389493 426501
9322 426501 472084 517381 558340 590850 613211 614013 594749 566248 541626 529025 532608 546195
9310 546195 567767 591439 612109 633456 658916 677579 690364 702678 719925 740931 762081 783906
9298 783906 800954 811518 824635 848228 890130 949553 1021992 1095666 1160178 1213354 1250137 1237605
9286 1237605 1155584 1044152 953281 890179 849726 834701 832312 835362 841486 856893 881960 909628
9274 909628 925591 934348 942743 949185 956952 950263 922854 892327 863165 842641 836659 840915 843884
9261H43884m264p036N199K6888M4771N3785N3113N0935M8767N1764N8106O8141
9249A294053Q0600R6992J08254J11902J19861J35817J44707J36948J24857J14656
9239B468647J20901J44366J86549K27791K43271K54754K81670L34481M01808M65377
9229E129615N32228O21792P45406R06791J104882J336826J585532J871837K254242
9220A6089151K722412L257864L979974N108900O520552P786326R183184J1901798
9212F6550161J6959310K4187053L1951860L6010292L2152669K4497955K1593134
9205B53902434J8924031k025735l7944550n6024989m6695787l0605228j9382563
9198H0147613j2729799q673741o069110m418381l329750k462349j719151j209404
$$ plain form
9261 843884 839620 832584 837783 864671 909442 963227 1016340 1067275 1116042 1167806 1225912 1294053
9249 1294053 1374653 1471645 1579899 1691801 1811662 1947479 2092186 2229134 2353991 2468647
9239 2468647 2589548 2733914 2920463 3148254 3391525 3646279 3927949 4262430 4664238 5129615
9229 5129615 5661843 6283635 7029041 7935832 9040714 10377540 11963072 13834909 16089151
9220 16089151 18811563 22069427 26049401 31158301 37678853 45465179 54648363 66550161
9212 66550161 83509471 107696524 139648384 175658676 207811345 232309300 253902434
9205 253902434 272826465 270800730 232856180 176831191 130135404 99530176 80147613
9198 80147613 67417814 58744073 52674963 48256582 44926832 42464483 40745332 39535928
9190C9535928j146326j704654k537780k966969k944168k728617k448175k154352
9182B0904887j878721j631224j412821j217961j042468r11708q17356p44688p46789
9173A0501151q35516q63844p67766o37901n42885m78317m25126l73828l22576
9164E253392k78125k52204k52910k62388k44634k18379k02467j98733j85731j66312
9154B991509j57069j53902j60167j53883j39287j31239j27328j27959j23525j10177
9144A606973r1974q0685p7775q0158q3271q1647p3611n8247m4340m2115m2794
9133H50356m2071k9546j4395j2642j9783j4193j1233j4366k1693k4038j8490j5163
9121F12743j6135j7870k0493k6065k6610k1321j8108j6755j2162q579r096q942
$$ plain form
9190 39535928 38389602 36684948 34147168 31180199 28236031 25507414 23059239 20904887
9182 20904887 19026166 17394942 15982121 14764160 13721692 12809984 11992628 11247940 10501151
9173 10501151 9665635 8801791 8034025 7396124 6853239 6374922 5949796 5575968 5253392
9164 5253392 4975267 4723063 4470153 4207765 3963131 3744752 3542285 3343552 3157821 2991509
9154 2991509 2834440 2680538 2520371 2366488 2227201 2095962 1968634 1840675 1717150 1606973
9144 1606973 1514999 1434314 1356539 1276381 1193110 1111463 1037852 979605 935265 893150 850356
9133 850356 808285 778739 764344 751702 731919 717726 706493 692127 670434 646396 627906 612743
9121 612743 596608 578738 558245 532180 505570 484249 466141 449386 437224 428645 419549 410607
9109D10607j630q38q54j542p6n074q606m366j023K418J784L390L771K944K5M579
9093D05509R329R424J4758K9298L9880K1941p953l255J8652K9844J6204j2933
9081E70698l5648m7603n5622m7138l2512j8792j0883r077r574n587k790N90M317
9068C00379M617K035K635L910L387K908K851N260M846K986m55q4l906p434k285
9053C21650l764r391j2851j0267l322M066p5l700r059r948o318o599l972l618
9039B42832j227j531m218o268q808r237j0101j1141r730q810q314m802J307Q994
9025A68946J3234P585M837K772K50k098m444l736j341l895n831o555l978j028
9011A64718k665L48Q8q38k888k997n524j1621j3581j2763j1868q801o827J99K830
$$ plain form
9109 410607 408977 408139 407285 405743 405667 400593 391987 387621 386598 389016 390800 394190 397961 400905 400930 405509
9093 405509 414838 424262 439020 468318 508198 530139 522186 518931 537583 567427 583631 570698
9081 570698 535050 487447 431825 384687 352175 333383 322500 313423 303849 298262 295472 296062 300379
9068 300379 304996 307031 309666 313576 316963 319871 322722 327982 332828 335814 335359 335275 331369 323935 321650
9053 321650 317886 308495 295644 285377 282055 286121 286046 282346 273287 263339 257021 250422 246450 242832
9039 242832 241605 240074 235856 229588 220780 211543 201442 190301 180571 171761 163447 158645 159952 168946
9025 168946 182180 189765 194602 197374 197624 195526 191082 187346 186005 182110 176279 169724 165746 164718
9011 164718 162053 162401 162489 161651 158763 155766 150242 138621 125040 112277 100409 91608 84781 84980 87810
8996H7810M618N668M610j048k592n782o571o933o194r265q907l244j691Q87K159
8981E3525J974L308N087M210N937K002J350J622K692n460l818N69J205R99K017
8966G7219l84n319k937R6J851l7J822K154K647l333j213N442J0249J0472L484
8951A02213l002q830j1224r589n927j819j338K965O81K053L417K329J570K548
8937G6047Q72K290J122J671L317J631l188m49r94J00l1O17j211J090K707J512
8921H7103M414M013P20K632q60j973N04n99M53N04N63K257O94M96R81N53k648
8904I9807l339l091n735q504m647J315J139m466l146k403k218n28j202l355l196
8889E6431m819l011j371j502k343j459j660o96q20J9k27m25J143L411K879L16
$$ plain form
8996 87810 92428 98096 102706 101658 99066 93284 86713 79780 73586 64321 55414 52170 50479 51366 53525
8981 53525 55499 58807 63894 68104 74041 76043 77393 79015 81707 76247 72429 72998 74203 75202 77219
8966 77219 76835 71516 68579 68675 70526 70489 72311 74465 77112 73779 72566 78008 88257 98729 102213
8951 102213 99211 90381 79157 69568 63641 61822 60484 63449 64130 66183 69600 71929 73499 76047
8937 76047 76919 79209 80331 82002 85319 86950 83762 83313 82319 82419 82388 83005 81794 82884 85591 87103
8921 87103 91517 95530 96250 98882 98022 96049 96553 95954 96407 96911 97474 99731 100425 100921 101902 102455 99807
8904 99807 96468 93377 87642 79138 74491 75806 76945 72479 69333 66930 64712 64184 62982 59627 56431
8889 56431 51612 48601 47230 45728 43385 41926 40266 39570 38750 38769 38542 38117 39260 42671 45550 45866
8873D5866r48j43j528L75J532m630l524k777k383k007j216j870L9O73j918k127
8857B3414j822j091l865j652j799m25J182L269K641K732L921Q99j044L141K453
8842C1954j968j197Q52P15P77k105j089j080k55O56m73m44J731L745L482K314
8826C7615L720M663M833L892L684N240L389L202M031P365P984Q012J1576J6766
8812A25972K0233K6549L4680M0232M8869O1523P6948R0708J05521J11846J12965
8801H56046J05732R2764O6460L0772j274l9260p1933r3789j06153j10299j03555
8790F25511r1492p4166o0751m8296l2756k4535k2430j6174j5273j3176j2291j2334
8778B01837j4974j1851j0688j1470r895p511r450j0858p771p436m825r270p783
$$ plain form
8873 45866 44918 44775 43247 43622 45154 40524 37000 34223 31840 29833 28617 26747 26786 27459 25541 23414
8857 23414 21592 20501 16636 14984 13185 12760 13942 17211 19852 22584 26505 27404 26360 29501 31954
8842 31954 29986 28789 29641 30356 31133 29028 27939 26859 26604 27260 26787 26343 28074 31819 35301 37615
8826 37615 41335 45998 50831 54723 58407 63647 67036 70238 74269 81634 89618 97630 109206 125972
8812 125972 146205 172754 207434 247666 296535 358058 435006 525714 631235 743081 856046
8801 856046 961778 1054542 1121002 1151774 1150500 1111240 1039307 945518 839365 729066 625511
8790 625511 534019 459853 399102 350806 318050 293515 271085 254911 239638 226462 214171 201837
8778 201837 186863 175012 164324 152854 142959 135448 125998 115140 107369 99933 95108 85838 78055
8765G8055n343m099l998n483k191k727l273l916j747j799l413l111j31L12Q18
8750C7954j737m949k20k119k291P67k415k456k991k072j43k377l104o6K172P17
8734A4670L635L711Q57J393K570o69m518l207o19j257k197L1L77l022j102J828
8718A2481K319M55L475N848L35k478j282M98o38l184j428M49k213j983K813J027
8702A6494K020L53j394J125M98J451j780k048m97k236j257L995K316L37k203m38
8686A6736K793J358J718J224m08m84r06n5L81j998q09j422K803K479K21K9K152
8669B5812j479j655j565J661K542J613J351r47j091J83N23k42j931j050o49J890
8653B4966Nj432j157j580j907k386j071o5J523K996K742j454J088n51k324j442
$$ plain form
8765 78055 72712 68613 64615 59132 56941 54214 50941 47025 45278 43479 40066 36955 36824 37136 37954
8750 37954 36217 31268 31048 28929 26638 27405 24990 22534 19543 17471 17328 14951 11847 11781 13953 14670
8734 14670 18305 22016 22873 24266 26836 26167 21649 18442 17823 16566 14369 14400 14777 11755 10653 12481
8718 12481 14800 15255 18730 24578 24913 22435 21153 21651 21013 17829 16401 16850 14637 12654 15467 16494
8702 16494 18514 18867 17473 18598 19096 20547 18767 16719 16222 13986 12729 16724 19040 19377 17174 16736
8686 16736 19529 20887 22605 23829 23421 22937 22031 21976 22357 20359 19550 18128 20931 23410 23631 23660 25812
8669 25812 24333 22678 21113 22774 25316 26929 28280 27333 26242 26425 26948 26706 24775 23725 23076 24966
8653 24966 24971 23539 22382 20802 18895 16509 15438 15373 16896 19892 22634 21180 22268 21717 19393 17951
8637A7951j833k105J65q3N8Q10j005k694j583J317l71J255Q48O3L013k16J677
8620A7267J899k12K06K471j55j458q48R15l68j120j108Q86J388J926k69R51K337
8603B4708K778N97M68j219M20j217Q48j390k614R72O31J61k201l089k538k290
8587A5025P71M257J291n18k457j681l49k291j035j905l426l249R88L072Q48N43
8571I884K839K567L262N165n77J01r02k575l820j969Q39k057P19K888J514p52
8555A7126j792l624p80j076k096j799J001j366M41O36L398J978o0m363m72Q26
8539G978J434l72m80R68q11k648J324L270m47Q39J004l2L92Q74J830k937l143
8522I043J073P00L66m0L89Q50r33k03j383k651k102J813L65r44J65l61J680K760
$$ plain form
8637 17951 16118 14013 14178 14095 14153 14963 13958 11264 9681 10998 10627 11882 12730 12793 15806 15590 17267
8620 17267 19166 18954 19160 21631 21476 20018 19170 20085 19717 18597 17489 18375 19763 21689 21420 22371 24708
8603 24708 27486 28083 28551 27332 27752 26535 27383 25993 23379 24351 24982 25143 22942 19853 17315 15025
8587 15025 15796 20053 21344 20826 18369 16688 16339 14048 13013 11108 7682 4433 5421 8493 9341 9884
8571 9884 12723 15290 18552 23717 23140 23241 22339 19764 15944 13975 14814 12757 13476 16364 17878 17126
8555 17126 15334 11710 10930 9854 7758 5959 6960 5594 6035 6671 10069 12047 11987 7624 7152 7978
8539 7978 9412 9040 8560 9528 8717 6069 7393 10663 10216 11055 12059 12027 12419 13293 15123 12186 9043
8522 9043 10116 10816 11182 11142 11531 12381 11448 11245 9862 7211 5109 6922 7287 6343 6508 6147 7827 10587
8504A0587r08q30K857K18j863k578j572N33j114m4K309J713J720m46L63k46r88
8487I711j106j112J80q88r82j312K41J334k903k926J033j114O19l62K568O84N25
8470D190K70j934J528K269J904J656N2K70o28j164p68n36P27M03j407J810Q84
8453I526j178k249K05r66m81L56N22K223K176p13j941j347m12K17M08P54Q86J199
8435I185J84j932j849j470J63R69R18J934Q67n92O8J639j843l645l146O71K356
8418D477R7k065M54n86M27J296K266J071n62j279J418J466j149l219j087l27J397
8401D095m23J15O40J62J130J197j436k160O37L275p35o78m69O35Q47J931j323
8384G440m91l00N2j67J248K925J658l61j779m33O79M95K762J272j510k852r18
$$ plain form
8504 10587 9679 8849 11706 11924 10061 7483 5911 6444 5330 5286 7595 9308 11028 10582 10945 10699 9711
8487 9711 8605 7493 7673 6785 5803 4491 4732 6066 3163 237 1270 156 775 413 2981 3665 4190
8470 4190 4460 2526 4054 6323 8227 9883 9935 10205 9577 8413 7645 7109 7836 8239 6832 8642 9526
8453 9526 8348 6099 6304 5338 4857 5213 5735 7958 10134 9421 7480 6133 5721 5938 6346 7100 7986 9185
8435 9185 9369 7437 5588 4118 4281 5250 6168 8102 8969 8377 8445 10084 8241 4596 1450 2121 4477
8418 4477 4574 2509 2963 2377 2804 4100 6366 7437 6875 5596 7014 8480 7331 4112 3025 2698 4095
8401 4095 3672 3787 4427 4589 5719 6916 5480 3320 3957 7232 6497 5819 5350 5985 6832 8763 7440
8384 7440 6949 6649 6701 6534 7782 10707 12365 12004 10225 9792 10471 10966 13728 15000 13490 10638 9720
8367I720O3rr50j668K08K320r88k821m58J017o93%J839Rr97O2l952K17J379J030
8347E328J232j287J996J451J111j523k553q98L75L59k692k26J294Q03j371n37
8331B862J030K28K406L24J36J379O07k389l23J44j47P17o27j475QM68J236J690
8313H274o83l155n17J878J722J468j616r61k34p22K45J520L81m94L3k522j762
8296B855p73J742K932m77j692l685r06R82K643j089m92j278O56L755Q92k390J90
8279C865P02R3p0K137K357J25J246k405R42j385j852K350L14j43j75n84q50j179
8261E488J170P57J096j09r28J625p44k366j316k2J833r16k708M67J542j012j392
8244B465K184J450r7k75J226J755j181K95N92o47J10K651P69j767p99p56j70P98
$$ plain form
8367 9720 9783 9774 8824 7156 7364 9684 8696 5875 5417 6434 5741 5741 7580 7589 6592 6654 2702 2919 4298 5328
8347 5328 6560 5273 7269 8720 9831 8308 5755 4857 5232 5591 2899 2673 3967 4770 3399 2862
8331 2862 3892 4120 6526 6850 6986 8365 8972 6583 6260 6404 6257 6974 6347 4872 4880 5348 6584 8274
8313 8274 7591 4436 3919 5797 7519 8987 7371 6410 6176 5454 5699 7219 7600 7106 7139 4617 2855
8296 2855 2082 3824 6756 6279 4587 902 -4 978 3621 2532 2040 762 1418 5173 6065 3675 3865
8279 3865 4567 4660 4590 6727 9084 9209 10455 8050 8992 7607 5755 8105 8419 8276 8101 7517 6667 5488
8261 5488 6658 7415 8511 8402 7474 9099 8355 5989 4673 4651 6484 5568 2860 3327 4869 3857 2465
8244 2465 4649 6099 6002 5727 6953 8708 7527 7822 8414 7767 7877 10528 11297 9530 8731 7975 7805 8603
8226H603p27M72L87m67J620o50l737L076R975K345r825o533R00N818J046q141
8210D162m833j29L95l12K481K924o97m67r29m97R73K571O92K146j203J0k619j349
8192C319O71j256L006L2j079r39N65j756k076M71k23J027L75k275R23o47j188
8175a050Q0J536R44J975l16j91J534n91p14J481J259k35J531p74m15k882j166
8158B006Q38K33L99Q19J264o09O01K390j311j163O5k842n96l19J004J683N20j319
8140C663j6j632n64q76J675J084j64N2J746q67o33p95r67p82J699K33o21M081
8122F316K056J54p39j954j212K27m41j213K50j854J697J048q25j159J994J370
8106E715j866k099J032j09j223Q55J579j81o93K372o9j157M84l53Q66J472K81
$$ plain form
8226 8603 7876 8348 8735 8268 9888 9238 5501 8577 18552 20897 11072 4539 5439 11257 12303 4162
8210 4162 -671 -800 -405 -717 1764 4688 3991 3524 2595 2098 3071 5642 6334 8480 7277 7287 4668 3319
8192 3319 3990 2734 5740 5772 4693 3754 4319 2563 487 958 735 1762 2137 -138 785 138 -1050
8175 -1050 -970 566 1510 3485 3169 2978 4512 3921 3207 4688 5947 5712 7243 6469 6054 3172 2006
8158 2006 2844 3077 3476 4295 5559 4950 5551 7941 6630 5467 5532 2690 2094 1775 2779 4462 4982 3663
8140 3663 3647 2015 1451 575 2250 3334 3170 3222 4968 4101 3468 2673 1706 924 2623 2856 2235 6316
8122 6316 8372 8526 7787 5833 4621 4848 4407 3194 3444 1590 3287 4335 3510 2351 4345 5715
8106 5715 3849 1750 2782 2673 1450 2305 3884 3703 3010 5382 5313 4156 4640 4287 5153 6625 6906
8089F906j723k709R18J037P80Q66L89n12O7L28j441N93L56o50n13n0q33R43K126
8070F878K300j5k148k51k260l277K74J630J263j542J396J905n6n09k490j473J80
8053A805k925J79J065J860J85O61K184l29N15r87j025O57O96m86O44j164J534
8036E069j58l040J653l36L75N26k551O02J533J076m57k566r0Q39J852q88K55K227
8018E921K185k889r67R57J812l483J8L404K777l156j986J570j406q49J191R70
8002F069j194N00J213%k117j182O67O37J661j142p47m71K302K261n55j033O59
7985G528k83J80j209k98P54n99K01L020p33j385j457O84N16N7N48j440k500P66
7967D350K091k50k878p8R71J516J199k688k354M07L266J238M28p94j050L411j780
$$ plain form
8089 6906 5183 2474 3392 4429 5209 6075 6464 5952 6019 6347 4906 5499 5855 5205 4692 4642 3809 4752 6878
8070 6878 9178 9163 7015 6764 4504 1227 1501 3131 4394 2852 4248 6153 6097 5588 3098 1625 1805
8053 1805 -1120 -941 124 1984 2169 2830 5014 4685 5200 4213 3188 3845 4541 4055 4699 3535 5069
8036 5069 4911 1871 3524 3188 3563 4089 1538 2140 3673 4749 4292 1726 1636 2475 4327 3439 3694 5921
8018 5921 8106 5217 4250 5207 7019 3536 3554 6958 9735 6579 4593 6163 4757 3908 5099 6069
8002 6069 4875 5375 6588 6588 4471 3289 3956 4593 6254 5112 4365 3894 6196 8457 7902 6869 7528
7985 7528 7245 7425 6216 5918 6672 6073 6274 9294 8561 7176 5719 6403 6919 6976 7524 6084 3584 4350
7967 4350 6441 6191 3313 3235 4206 5722 6921 4233 1879 2286 5552 6790 7218 6424 5374 8785 7005
7950G005m443J559K111j363j490Q98K219J951j498j911P63K141n32l353N52K352
7934F961K101j01j832j457q32o57m60J9J151N30j619J064Q95j448J098J473l115
7917C771j239J365J475L86j632p03K898Q2N43r06q42k316k723N44k15k334KL245
7899A401o39n34k59J684K440j80r41K052K01j668k444L021J460N81j585r56J511
7882E145k17o56k015K185J320K67l08o53k922n44L36R20J025Q51P57o17j188L52
7864D038j425j188J425o99j249J049K645K23O80l63j154o72q48l38K009R69K07
7847E309J50j640q54j314j205j751P83J312j448k164R92J053J321j946j68J63
7831a407J383K812k31j840L66P26n6M67L88r28J470O18l23q84Jj737p86j89J32
$$ plain form
7950 7005 2562 4121 6232 4869 3379 4277 6496 8447 6949 5038 5801 7942 7410 4057 4609 6961
7934 6961 9062 8961 7129 5672 4840 4183 3723 3742 4893 5423 3804 4868 5763 4315 5413 6886 3771
7917 3771 2532 3897 5372 5758 4126 3423 6321 6403 6946 6040 5198 2882 159 703 488 -1846 -1844 1401
7899 1401 762 228 -31 1653 4093 3913 2972 5024 5225 3557 1113 4134 5594 6175 4590 3634 5145
7882 5145 4928 4272 2257 4442 5762 6029 5721 5068 2146 1602 1938 2858 3883 4734 5491 4874 3686 4038
7864 4038 2613 1425 2850 2151 902 1951 4596 4819 5499 5136 3982 3310 2462 2124 4133 5102 5309
7847 5309 5459 3819 2965 1651 446 -1305 -522 790 -658 -2822 -1830 -777 544 -1402 -1570 -1407
7831 -1407 -24 2788 2557 717 1083 1809 1753 2220 2608 1680 3150 3768 3445 2561 2562 825 39 -150 -18
7812a8j149J546J998J236j144L32k267J026j14OJ29k849p18J156J905L14O8J982
7794C439k9j55n06j312j652o94K042P81J444J21J098k375j031J871J281j176j349
7777A798l27j560J277M27j904J65K563n35N3Q99o56n40P18K191o4j270j157j3
7759B065Q70J107k676r60m76k843j780N06M160J119n63L73K749L85N16r72j280
7742B300q25m80j467P03Q88l33M55k620l59J156O37J90J378J580M77J536P26j825
7724D117p59K72l41l86j183j014k062L111L232m13j317j55k0J299j687j064O37
7707B267L60J332o10r00O50K495q89j958k336j773R02J353K141J941J994q61k932
7690C176j222R21j274K75L83J549j132j479k838J291K035R76L150j407m246O1
$$ plain form
7812 -18 -1167 379 2377 3613 2469 2801 534 1560 1446 1452 1581 -1268 -1986 -830 1075 1389 1457 3439
7794 3439 3410 3255 2749 1437 -215 -909 1133 1914 3358 3479 4577 2202 1171 3042 4323 3147 1798
7777 1798 1471 -89 1188 1615 -289 -124 2439 1904 1957 2856 2200 1660 2378 4569 4505 3235 2078 2065
7759 2065 2935 4042 1366 406 -70 -2913 -4693 -4187 -27 1092 529 902 3651 4036 4552 3580 2300
7742 2300 1475 995 -472 231 1119 786 1241 -1379 -1738 -582 55 245 1623 3203 3680 5216 5942 4117
7724 4117 3358 3630 3289 2903 1720 706 -1356 1755 4987 4574 3257 3102 3082 4381 2694 1630 2267
7707 2267 2627 3959 3349 2449 3099 5594 4705 2747 411 -1362 -460 893 3034 4975 6969 6108 3176
7690 3176 1954 2875 1601 1876 2259 3808 2676 1197 -1641 -350 1685 2661 5811 4404 158 219
7674B19J399P69J442O22r47m37J270o72q92M20N64j406r5k33k581k81J052M46
7656F59L136Q13j865k701q95j483K036J69j567K548M1R5K714j101j137K347K046
7639E855j033j002j24J032q33j994j465J336j207K333J725N56k464j371J13k014
7623e57m79p3L48q23J195J995L96K43l244l40j048K66J777J820l9k541j50O70
7605e84J964K103j86k392k45J730P0l29N07J280j7j495j156j192j324J083K58
7588G5R02k28Q10N36j84k68j495n19M10J090j584j862J956O48l52K572J121k35
7570C393L87j041q83j909N51K130j278j203j428N06L934M93j012j114r45m50j72
7553d1Q46J69Q17k141k905J173K452N05q57L344j744m95J232K66J98J048m17p93
$$ plain form
7674 219 1618 2387 3829 4451 3504 3067 4337 3665 2773 3193 3757 2351 2256 2023 -558 -839 213 659
7656 659 3795 4608 2743 42 -853 -2336 -300 -131 -1698 850 891 986 3700 2599 1462 3809 5855
7639 5855 4822 3820 3696 4728 3895 1901 436 1772 565 2898 4623 5179 2715 1344 1457 -557
7623 -557 -1036 -1109 -761 -1584 -389 1606 2002 2245 -999 -1339 -2387 -2121 -344 1476 1437 -1104 -1254 -584
7605 -584 1380 3483 3297 905 660 2390 2460 2131 2638 3918 3901 2406 1250 58 -1266 -183 75
7588 75 977 749 1559 2095 1911 1643 148 -371 39 1129 -455 -2317 -361 287 -65 2507 3628 3393
7570 3393 3780 2739 1856 -53 498 2628 1350 147 -1281 -775 3159 3652 2640 1526 581 131 -41
7553 -41 805 974 1791 -350 -3255 -2082 370 875 18 3362 1618 1123 2355 2621 2819 3867 3450 2657
7535B657m07m33j450p53P6J678k45L95r05L65j139j129j04k327J576L487P42l71
7517A713r12K44o1p46o42j632r64K414P4k32J136J273k193l474kK249J174J061
7499D80j346p2J823J66l4j115j193K91l13L27L74j089J409K145J778O26J02j505
7481B854J43O85K00K86j648r92J163K484O11j045j519l96k104j707K586J121k92
7464B430j03k296J20Q7K94P31N17J570R10O55m05j88O02l428l441M490r82j225
7446C38R32Q56q46Q52p90J360J286k81k450j11j201M41L14j367q8K04k148K237
7428d62J966l56Q55j067L46J511M55j901M7K234J037k143j974k038N64q17k24
7411a967J536R61j461j18R85L21l45M16L78J814p27j907p99O66R84m59p40K931
$$ plain form
7535 2657 2250 1817 367 -386 -310 1368 1123 1518 613 978 -161 -1290 -1394 -3721 -2145 1342 2084 1713
7517 1713 801 1045 984 238 -404 -2036 -3000 -586 -512 -744 392 1665 -528 -4002 -4004 -1755 -581 480
7499 480 -866 -938 885 1051 1017 -98 -1291 -1000 -1313 -986 -612 -1701 -292 1853 3631 4257 4359 2854
7481 2854 2997 3682 3882 4168 2520 1528 2691 5175 5786 4741 3222 2826 722 -985 1601 2722 2430
7464 2430 2327 31 151 238 532 1263 1780 3350 4260 4915 4510 4322 4924 1496 -1945 2545 1563 338
7446 338 1270 2126 1280 2132 1342 2702 3988 3707 1257 1146 -55 386 700 -667 -755 -551 -2699 -462
7428 -462 1504 1148 2003 936 1282 2793 3248 1347 1394 3628 4665 2522 548 -1490 -926 -1743 -1967
7411 -1967 -431 530 -931 -1049 -64 257 -88 328 706 2520 1793 -114 -913 -247 737 278 -462 2469
7393B469R00k191j622K604J094k83J234m06j690k825Q78N36L72K108n78q95P52
7376B457J92k47J376J096j857j283j294k96J409q71N77Q9j636o53K207J785L227
7359F278k027l106k262j337L82P71L793J989k408k160J941k5n53m63O52J407K15
7342C087j149O6m08j042j017J052m11k159O53q39j75P57K119L202N59j365m60
7325B470r38K12J689K51n91m85N54L2k286r44K479J418j087J192R62p07q03j169
7307B249L7L743L47k166j763k381k969J467L483M34K1j836p92k271J443J756m21
7290C81M41O40o72j620P98j21P2P74q0n86J057R35K66O68Q87k773O70Q2q96j755
7270h32N61J037q46k019p32q87K070k558P85N21J342K448O36J717k002q59M66
$$ plain form
7393 2469 3369 1178 -444 2160 3254 2971 4205 3799 2109 -716 162 698 1070 3178 2600 1705 2457
7376 2457 2649 2402 3778 4874 3017 1734 440 144 1553 682 1259 1348 -288 -941 1266 3051 6278
7359 6278 4251 1145 -1117 -2454 -2072 -1301 2492 4481 2073 -87 1854 1829 1276 813 1465 2872 3087
7342 3087 1938 2004 1596 554 -463 589 178 -1981 -1328 -2167 -2342 -1585 534 3736 4295 2930 2470
7325 2470 1532 1744 3433 3684 3093 2608 3162 3194 908 -36 2443 3861 2774 3966 4928 4221 3418 2249
7307 2249 2286 6029 6376 4210 2447 66 -2903 -1436 2047 2481 2502 666 -126 -2397 -954 802 381
7290 381 822 1462 790 -830 -32 -153 -81 693 613 27 1084 2019 2285 2953 3840 1067 1737 1819 923 -832
7270 -832 -271 766 -80 -2099 -2831 -3718 -1648 -4206 -3421 -2900 -1558 890 1526 3243 1241 382 848
7253H48P64n46j551o8J451o03p91L9J199p99P1J695J694L68J3k631j681J89J883
7234A544K085K299n56l374k904Q21R49m106k710J456O31M048L191L68o57J200
7218D285J217k22k188k334L80L01O19k351j47N48n05m78k670J409L216J033r2
7201B021j07R29k2k307j820P92O17O0N79J856O65j611J762k63l85j441k836j348
7183b859J207P40p36J548J444P6J119p44l182N96J074J545K289j827j142J021
7167B169Q88j382k495n00P1K308J166j328j893k703M39k02l20P3J737K135Q26
7150I89K348J8p53L41j371j696k150o40O59q54O98J948L357p36k063J625J047
7133B767l282J09K546J433j999l985K36K908m58K751J983N95p80k681l336k327
$$ plain form
7253 848 1612 1066 -485 -553 898 295 -496 -457 742 -57 14 1709 3403 3771 3784 1153 -528 -339 1544
7234 1544 3629 5928 5372 1998 -906 -85 864 -3242 -5952 -4496 -3865 183 3374 3742 3085 4285
7218 4285 5502 5280 3092 758 1138 1439 2058 -293 -440 108 -397 -875 -3545 -2136 1080 2113 2021
7201 2021 1914 2843 2821 514 -1306 -514 103 163 742 2598 3263 1652 3414 3151 2766 1325 -1511 -2859
7183 -2859 -1652 -912 -1648 -100 1344 1420 2539 1795 -1387 -791 283 1828 4117 2290 1148 2169
7167 2169 3057 1675 -820 -1320 -1249 1059 2225 897 -996 -3699 -3260 -3462 -3782 -3709 -1972 163 989
7150 989 3337 3355 2602 2943 1572 -124 -2274 -2914 -2255 -3109 -2411 -463 2894 2158 95 1720 2767
7133 2767 -515 -406 2140 3573 1574 -2411 -2175 733 275 3026 5009 5604 4824 2143 -1193 -3520
7117c520j539K231K066J784K579J128N2p21k100j455N05j547j487J975J274j9
7101A206L13Q62m39J18j619j547J073J228K99k02J76J11j394l461j045L087N55
7084f79J229K44J376O31n86o9K71N82j95j937p91j858j152J924L394J391p15N98
7066C658O91m10j473j508k013k435pL764n78j479M97M09J927R98r81r66J515l76
7048A233J544P54m39j356k396J680P15l007j867o67J624J006Q62O29J761K476
7032D552J236J06k399j960L42l432j620J550K51K627Q07n85l202p47J384N41O43
7015I4k94m56j60L183o46j843J001K276K142j449j210l095K20m49M15J818J137
6998B684j810l122L406O67j935j400j32N08O49J12j300r6J759j99k548j157K142
$$ plain form
7117 -3520 -5059 -2828 -762 1022 3601 4729 4781 4060 1960 505 1010 -537 -2024 -49 1225 1206
7101 1206 1519 2381 1942 2060 441 -1106 -33 1195 1494 1292 1468 1579 185 -3276 -4321 -1234 -679
7084 -679 550 794 2170 2801 2215 2146 2417 2999 2804 867 76 -1782 -2934 -1010 2384 3775 3060 3658
7066 3658 4349 3939 2466 958 -1055 -3490 -3497 267 -311 -1790 -1293 -884 1043 2041 1060 94 1609 1233
7048 1233 2777 3531 3092 1736 -660 1020 1735 -1272 -3139 -3806 -2182 -1176 -314 315 2076 4552
7032 4552 5788 5894 3495 1535 1877 -1555 -3175 -1625 -1374 1253 2060 1475 -1727 -2474 -1090 -549 94
7015 94 -200 -656 -816 2367 1721 -122 879 3155 5297 3848 2638 -457 -237 -686 -271 1547 2684
6998 2684 874 -2248 1158 1825 -110 -1510 -1642 -1134 -485 -373 -1673 -1769 -10 -209 -2757 -3914 -1772
6981a772l78j8J280L59Jj638l90J862J413J834r85l344K193J046J26m91J00K308
6963C506K011k615m009J878K381k94j682j138P32n73j632J907M66K75k98L91Q03
6946B109J805j223O61J16p72P59Q80k362j798m95j293k461Q82P11J881K978J273
6929C651j410j083j311N91l95P15j511j355j738O65n04N99R41k96j541O87K997
6912b98R09j316r06L97p29j048j615p07J689J779K182J043j389O13J25j628j8
6895i17J551Q00l19N32l39k25q21K135J697ql013k593j512J98L88J520J120K080
6877B274l613q46L000K299j634q28J040P67L44j503J51j398l11L400L50l763p30
6860a001j136J534J95o72Q65Q12q55p04K133Q25k295j17J355q50l260K849M78
$$ plain form
6981 -1772 -2150 -2168 -888 -529 -528 -2166 -2556 -694 719 2553 1568 -1776 417 1463 1589 1098 1198 3506
6963 3506 5517 2902 -1107 771 3152 2858 1176 38 770 197 -1435 472 938 1213 915 1306 2109
6946 2109 3914 2691 3352 3468 2696 3455 4335 1973 175 -320 -1613 -4074 -3192 -2481 -600 2378 3651
6929 3651 2241 1158 -153 438 43 758 -753 -2108 -3846 -3181 -3685 -3086 -2145 -2441 -3982 -3295 -298
6912 -298 611 -705 -1611 -1214 -1943 -2991 -4606 -5313 -3624 -1845 337 1380 -9 604 729 -899 -917
6895 -917 634 1434 1115 1647 1308 1083 262 2397 4094 4086 1073 -1520 -3032 -2834 -2446 -926 194 2274
6877 2274 -1339 -2185 815 3114 1480 652 1692 2459 2803 1300 1451 53 -258 3142 3492 -271 -1001
6860 -1001 -2137 -603 -408 -1080 -215 597 -258 -962 1171 1996 -299 -416 939 89 -3171 -322 156
6843A56%j28j904P08J811J59R5J013J689K93r87K43l81J246J302j13l296p51J534
6824B689o69l3j903k491K906J115P84L34K31k282j510N67J429K08k934k004K152
6807a411K321J767n29j980j819J072l52J695J807l190j191K168p36O26L205J602
6791E055J686L77n952k899K17O26M34n19K908M0o00K36m6J100o21k519J441M26
6773A390k794L9J517r05M5j786J768J106j539K244K926j577k842O14M087K732
6757G025m05l69j490j372p80J299K931Kj779p16j160O01j699l95k12n41K78l51
6739H67k776r30M367L531M02J835J69Q02j80P83N251k19K22M042L489M002M085
6722B9742L309q73l762m334o344l904k934l704n48Q0P9j15j002j489p13L69N40
$$ plain form
6843 156 156 28 -1876 -1168 643 802 897 1910 3599 3892 2905 3148 2767 4013 5315 5202 1906 1155 2689
6824 2689 2020 1987 84 -2407 499 1614 2398 2732 2963 681 -829 -262 1167 1375 -1559 -3563 -1411
6807 -1411 910 2677 2148 168 -1651 -579 -931 764 2571 -619 -1810 358 -378 248 3453 5055
6791 5055 6741 7118 1166 -1733 -1516 -890 -456 -975 1933 1973 1373 1609 1563 2663 2042 -477 964 1390
6773 1390 -1404 -1365 152 -753 -708 -2494 -726 380 -1159 1085 4011 2434 -408 206 4293 7025
6757 7025 6620 6251 4761 3389 2609 3908 6839 6841 5062 4346 3186 3787 2088 1693 1481 940 1218 867
6739 867 -1909 -2839 1528 5059 5461 7296 7465 8267 8087 8870 14121 13902 14124 18166 21655 25657 29742
6722 29742 33051 32178 28416 24082 17738 13834 10900 7196 6648 6728 6807 6692 5690 4201 3488 3857 4397
6705D397Q53J26P64q66j798r27n1n44Q97J421j78l433O10J364J667l50o64j810
6687A478j252J548r45j052K87K21K80r30k099o92J476O84l72j065o33J611J66
6670a289j167J649J875r67m158p34M085k50j365M658J814J828o62l076m18o99
6654A124J30n08R16O97o47j786O46K319qj640K351l63j232J148J16O1q50n01k104
6635a31j785q94J589J616r11L7J351O08l02j039k440RR80m37L53J881J660j88
6617A957j419j055l38n85J498J465k050j935Q31n55Q66O34n33K091K84j852k296
6600b992L53N65p95j378J790n61K008N76R42j7j251j879N18k76R85q62j169l75
6582c818J275L887L297j770k551j114K260P84J290j941k267k669j117L046L182
$$ plain form
6705 4397 5250 5376 6140 5274 3476 2549 2498 1954 2851 4272 4094 661 1271 2635 4302 3952 3288 1478
6687 1478 226 1774 829 -223 64 285 565 -365 -2464 -3156 -1680 -996 -1368 -2433 -3066 -1455 -1289
6670 -1289 -2456 -807 1068 101 -4057 -4791 -706 -956 -2321 2337 4151 5979 5317 2241 1823 1124
6654 1124 1254 746 1662 2359 1712 -74 572 2891 2883 1243 3594 3231 1999 3147 3263 3324 2474 1973 -131
6635 -131 -1916 -2810 -1221 395 -516 -479 872 1480 1178 139 -2301 -2292 -1312 -1749 -1396 485 2145 1957
6617 1957 538 -517 -855 -1440 58 1523 -527 -2462 -1631 -2186 -1320 -686 -1219 872 1156 -696 -2992
6600 -2992 -2639 -2074 -2869 -4247 -2457 -3018 -1010 -434 508 491 -760 -2639 -2121 -2397 -1412 -2274 -3443 -3818
6582 -3818 -2543 1344 4641 2871 320 -794 1466 2250 3540 1599 -668 -3337 -4454 -1408 1774
6567A774o36k4N06j236j813q91J420N28r79n90j270J747K261m2o33J214Q86n67
6549A655j117k786j077K28J723K82K282N69Q55J967k625o90j440O96J427O01j853
6532F97k138j578P42R14J173J16n78K06Q30p49j34J651J038R36O32j150m37j889
6514B82k956J762K427j022O01q76P97L74m60R36J899j072p42p8j339l04k3q13
6496f07j056o67m47Q10J642M412p10l907l36l12Q1j54M397M63k583L26k095Q46
6478A03Q13J337q78k306k035K827M619N36R22l091k340J431L32L96l10L26J254
6461C936j705j400P52M35K37q29N42j810j620j450K368Q28K75J253K977k486p91
6444A512J758j194P78J09J30J187J585j324k368P26O7k009l356j385R05J284j228
$$ plain form
6567 1774 1138 1114 1620 384 -1429 -2320 -900 -372 -1351 -1941 -3211 -1464 797 755 122 1336 2222 1655
6549 1655 538 -2248 -3325 -3097 -1374 -1092 1190 1759 2614 4581 1956 1266 -174 522 1949 2550 697
6532 697 -1441 -3019 -2277 -1363 -190 -74 -652 -446 384 -365 -499 1152 2190 3126 3758 2608 2171 282
6514 282 -2674 -912 1515 493 1094 218 1015 1389 929 1865 3764 2692 1950 1872 533 229 206 -607
6496 -607 -1663 -2330 -2777 -1967 -325 4087 3377 -530 -866 -1178 -1097 -1251 3146 3609 1026 1352 -743 103
6478 103 916 2253 1375 -931 -2966 -139 4480 5016 5938 2847 507 1938 2270 2666 2356 2682 3936
6461 3936 2231 831 1583 2018 2255 1426 1968 158 -1462 -2912 -544 284 559 1812 4789 2303 1512
6444 1512 3270 2076 2854 2963 3093 4280 5865 4541 2173 2899 2966 957 -2399 -3784 -2879 -1595 -2823
6427b823J766L21J897r11k65J916K34j117K54J92m02n17J908j019j554j438k371
6410c929K039L755R02m67J060J480k480k720J209l06L2K888O58k255M94J279j124
6393B515j748j459j72P06L518k0n947k797K300K417J54j82N80K07l62k330n68
6376c188r0m1J315K235r11j854J352L238p83j399k14P18j031k098M80m23mM13
6358b285n59J034J185p9K84L8N39J943O05j213k368l09J265K120L96J217j905
6341A908l679N10J879m89j650J87J219M31m32Q0J401J1M82j255M10J398j08j532
6323G71K20J184l87O74J511p72l045j668Q63n00O14K91N89r19j125l87O61j008
6305b433q19K189j67k486K066J66k19j239K812L406l432k219K352K66N36M04j535
$$ plain form
6427 -2823 -1057 -736 1161 250 -15 1901 2135 1018 1272 1464 1062 545 2453 1434 -120 -1558 -3929
6410 -3929 -1890 1865 2767 2300 3360 4840 2360 -360 849 543 575 3463 4121 1866 2360 3639 2515
6393 2515 767 -692 -864 -158 3360 3340 -2607 -5404 -3104 -687 -533 -715 -135 72 -290 -2620 -3188
6376 -3188 -3278 -3319 -2004 231 -680 -2534 -1182 2056 1273 -126 -340 378 -653 -2751 -2271 -2694 -2698 -2285
6358 -2285 -2844 -1810 -625 -704 -420 -382 157 2100 2705 1492 -876 -1185 80 2200 2596 3813 1908
6341 1908 -1771 -1261 618 129 -1521 -1334 -115 316 -116 -36 1365 1376 1858 603 1013 2411 2303 771
6323 771 991 2175 1788 2462 3973 3201 156 -1512 -649 -1149 -535 -244 345 -574 -1699 -2086 -1425 -2433
6305 -2433 -3252 -1063 -1230 -3716 -1650 -1484 -1703 -2942 -130 3276 -156 -2375 -23 243 779 1183 -352
6288c52K17J838pj002j186L99J169k77L77J401m77Q43j021M09L007p11j400K96
6270C523J87M18j232j302k279j111K252O74j666p36J056P76q7J604j574k222m79
6253b198R15m48j62q84L21L245q14r56R30R64J710q76Q02L542k027j411J036j53
6235C536k072k078K155k484L02Q48j900r64j352j055p66m63J222J046k26j330
6219e581q61J689R95N07J257j248k308K283K365k009k50M52M036k262j649j03
6203b687J34j114j340J835J432N16r29m39O43K075J760o73j306L88q18K56P58
6186D91j364K160p3k651J191J031j961k668O35J065N41N9r56J765j81r45o45L92
6168b114J812K054j344j626j401j07J139M13j409k37O13K582K255j836j301q45
$$ plain form
6288 -352 -135 1703 1696 694 -492 -93 1076 799 1176 2577 2100 2943 1922 2331 5338 4627 3227 3523
6270 3523 3710 4128 2896 1594 -685 -1796 456 1130 -536 -1272 -216 560 473 2077 503 -1719 -2198
6253 -2198 -1283 -1731 -1893 -2777 -2456 789 -25 -981 -51 913 2623 1747 2549 6091 4064 2653 3689 3536
6235 3536 1464 -614 1541 -943 -641 207 -1693 -2657 -4009 -5064 -5830 -6293 -5071 -4025 -4251 -5581
6219 -5581 -6442 -4753 -3758 -3251 -1994 -3242 -5550 -3267 -902 -2911 -3161 -2709 1327 -935 -2584 -2687
6203 -2687 -2553 -3667 -5007 -3172 -1740 -1224 -2153 -2592 -1949 126 1886 1213 -93 295 -523 -267 491
6186 491 -873 1287 1214 -1437 -246 785 -1176 -3844 -3209 -2144 -1603 -1544 -2500 -735 -916 -1861 -2506 -2114
6168 -2114 -302 1752 408 -1218 -2619 -2726 -1587 -1174 -2583 -2820 -2207 375 2630 794 -507 -1352
6152a352l72k545J5J177J486P84J490O26q83l623j739J145J579j950j74J068N51
6135b717L03J632J273r32r99q61J191j42K253Q47n59J529R26J664k352k402j215
6118e61ll27n36P67J084r04m11N01J74J18k284j706K135L8K286P68o55kK68J257
6098B007k94M0n38j038k49l61L61L54L84k689k000K391K201p85O41p25k06Q11
6080C05k414j064n92R52j24K685O42j927j115K206m84k184q2L84P63K121L646
6063C718J450o05l593j547L41r48o13l396J967J387J136J06k258k368J730O06
6047b887j498J513N54j265J214%J015L768K095k497p25J367L58p4j110j74q12
6030H42M55Q71l464j049K59k68J073K241K423k408j120J110p19j203n76L103j3
$$ plain form
6152 -1352 -1724 -4269 -4254 -3077 -1591 -807 683 1309 426 -3197 -4936 -3791 -2212 -4162 -4336 -3268 -2717
6135 -2717 -2414 -782 491 -441 -1440 -2301 -1110 -1252 1001 1848 1289 2818 3744 5408 3056 654 -561
6118 -561 -564 -891 -1427 -660 424 -480 -891 -390 -216 -98 -2382 -4088 -1953 -1915 371 1139 484 482 750 2007
6098 2007 1713 1753 1215 177 -72 -433 -72 282 666 -2023 -4023 -1632 569 -216 425 -300 -506 305
6080 305 -2109 -3173 -3765 -2813 -2937 -252 390 -1537 -2652 -446 -930 -3114 -3196 -2812 -2049 72 3718
6063 3718 5168 4563 970 -577 -236 -1184 -1797 -5193 -3226 -1839 -703 -597 -2855 -5223 -3493 -2887
6047 -2887 -4385 -2872 -2318 -3583 -2369 -2369 -1354 2414 4509 2012 1287 2654 3012 2938 1828 1654 842
6030 842 1297 2168 -1296 -2345 -2086 -2354 -1281 960 3383 975 -145 965 246 -957 -1533 1570 1557
6013A557k506m51L61j87J448R39j2R05M78q60k993l297Q20M74j088L55r72K088
5995b941O97j416L30O20L560J264M7Q90o70j248j099o01K398N11j514k853J216
5978h09J364R34J734l467k835k340J39K801R55r19K358J039j421J327K62lM18
5961A537K0m30L39k570j275J42J056o07J371m08K48K633k22k726j67J718J297
5944A956j911q33R17k27p95O16R07k382p77Ln99P49L12J038P05J524p36l0j659
5925a222n06j522M72J772L76p59k67J002K643o5j151j041p77n71L91k12M93N80
5907c64n33j491j500l31J143L589L93j008J10J95l32m74m60q7J317k858k074J437
5889c328K025K50j808J355K372r21L92j03l08j660j561j0o91K446K356k461j826
$$ plain form
6013 1557 -949 -1400 -1039 -1226 222 1161 1149 2054 2532 1672 -1321 -4618 -3798 -3324 -4412 -4057 -5029 -2941
5995 -2941 -2244 -3660 -3330 -2710 850 2114 2161 3051 2381 1133 34 -567 1831 2342 828 -2025 -809
5978 -809 555 1489 3223 -244 -3079 -5419 -5280 -2479 -1524 -2443 -85 954 -467 860 1122 1119 1537
5961 1537 1557 1127 1466 -1104 -2379 -2237 -1181 -1788 -417 -825 -577 2056 1834 -892 -1059 659 1956
5944 1956 45 -788 129 -98 -893 -277 630 -1752 -2529 -2526 -3125 -2376 -2064 -1026 -321 1203 467 437 -1222
5925 -1222 -1728 -3250 -2778 -1006 -630 -1389 -1656 -654 1989 1924 773 -268 -1045 -1616 -1225 -1437 -944 -364
5907 -364 -897 -2388 -3888 -4219 -3076 513 906 -102 8 203 -129 -603 -1063 -1150 167 -2691 -4765 -3328
5889 -3328 -1303 -1053 -2861 -1506 866 -55 337 234 -74 -1734 -3295 -3305 -3996 -1550 806 -1655 -3481
5872c481m19J713J017l0o33R74K109k03j895k462j745j384J300O52P36M3L2J336
5854b340K181M90j757r66K08o74J800K227l72j971o68p76J456J974K01J571N51
5837C135j270L79J570j372o59k53K061j843j77J883Nj548k62r88m76Q4N69K878
5819C716j83j885J960j357j669j511j845K494J227l82o6O94j416j687n47p55P67
5802b445K228j553p87J249j303j42J539J322k754K65L576J078o03n39L55j520
5786c4j929L06p7J181J882k64L047L939j669j618l057k013K369p2k842j860J97
5769b514l7J436M77n16J420j547j426M4R64L13J278n44P4N33n54J221P67p33Q70
5750A526N09k544j425j371l52J053J053J038j66m68p90K83J015O10K57J071j001
$$ plain form
5872 -3481 -3900 -2187 -1170 -1200 -1833 -859 1250 1047 -848 -3310 -5055 -6439 -5139 -4487 -3751 -3708 -3676 -2340
5854 -2340 -159 331 -1426 -2392 -2184 -2858 -1058 1169 797 -1174 -1842 -2618 -1162 812 1013 2584 3135
5837 3135 1865 2244 3814 2442 1783 1530 3591 1748 1571 3454 3459 1911 1649 661 185 269 838 3716
5819 3716 3533 1648 3608 2251 582 -929 -2774 -280 947 565 499 1193 -223 -1910 -2457 -3212 -2445
5802 -2445 -217 -1770 -2557 -1308 -2611 -2753 -1214 108 -2646 -2381 1195 2273 1670 1131 1486 -34
5786 -34 -1963 -1657 -1734 -553 1329 1065 4112 8051 6382 4764 1707 -306 2063 1991 -851 -2711 -2514
5769 -2514 -2551 -1115 -638 -1154 266 -1281 -2707 -2663 -1699 -1386 -108 -652 -578 -45 -599 622 1389 656 1526
5750 1526 2035 -509 -1934 -3305 -3657 -2604 -1551 -513 -679 -1147 -1937 -1654 -639 -29 228 1299 298
5733B98P09j621k513J295J828M61j35P88m06p79K90M50J172k115j470K78J66r
5715a313J772j56k421k410J143J577p25j08p92j214J896J650q47N42j578j358
5699d342J218J202P27R8J193J531O1j340P28j004l111j667j035J684J708P9j027
5682c297K385J448K61Q39p05L8j021J567M48r57K290j774j589pK920L069k385
5665C530k498j153j167R96J891j186j447K72j177j179K504J721o72k418j30J107
5649a006Q17Q93j436k115o76K03J881l62J50J996Q85q9k506m41O28M95m05j335
5631b423P95J917q97J445q56j380j39K760J847r3j052j750J163j311j553n50k39
5614b316J233K048j425l500J56J807J39J418O59j482J37J242J251J779J174j954
$$ plain form
5733 298 1007 -614 -3127 -1832 -4 457 322 1110 704 -75 215 665 1837 -278 -1748 -1470 -1304 -1313
5715 -1313 459 303 -2118 -4528 -3385 -1808 -2533 -2641 -3433 -4647 -2751 -1101 -1948 -1406 -2984 -4342
5699 -4342 -3124 -1922 -1195 -1097 96 1627 1688 348 1076 72 -3039 -4706 -5741 -4057 -2349 -2270 -3297
5682 -3297 -912 536 797 1636 931 969 -52 1515 1963 1006 3296 1522 -67 -74 2846 5915 3530
5665 3530 1032 -121 -1288 -292 1599 413 -1034 -762 -1939 -3118 -614 1107 435 -1983 -2113 -1006
5649 -1006 -189 704 -732 -2847 -3523 -3320 -1439 -1801 -1651 345 1230 1141 -1365 -1806 -1178 -683 -1088 -2423
5631 -2423 -1628 289 -608 837 -19 -1399 -1538 1222 3069 2976 1924 174 1337 26 -1527 -2077 -2316
5614 -2316 -1083 965 -460 -3960 -3804 -1997 -1858 -440 219 -1263 -1126 116 1367 3146 4320 2366
5598B366l298k15j5J094K265p09N38j049j863O26K819j50m33k596k34j569K20
5581b203j992k533M46K237L268m30j269J242J469K763L56q86j497j238J806m80
5565A059L27j840j743O51K184R41n14m18o20k49j845K77n5o52j575J322K939l6
5547A53k920J818K164R32k98j688l86p07Q39j021n60J096N44j069q1p02p51j053
5529c690J49m38j59J539K118L75J671j277l740r08O77J511L41J078r26M62P72
5512d45j947J071J643K628Q87k222l706m6j173j476O66J569K189m72p26O99j032
5495a893o00K744j43j52J261L51p52j361n01R38J694j178m09J409p3r86O18k34
5477G33k346o53m5K741n40l16k322n9P90J165R52q95m87k098j8J240j992o33K779
$$ plain form
5598 2366 -932 -1147 -1162 -68 2197 1488 2026 977 -886 -260 2559 2409 1976 -620 -854 -2423 -2203
5581 -2203 -4195 -6728 -6282 -4045 -777 -1207 -2476 -1234 235 2998 3354 2468 971 -267 1539 1059
5565 1059 1386 -454 -2197 -1546 638 1579 1065 647 27 -222 -2067 -1790 -1845 -2497 -4072 -2750 189 153
5547 153 -2767 -949 1215 2147 1849 161 -225 -932 -93 -1114 -1674 -578 -34 -1103 -1184 -1886 -2637 -3690
5529 -3690 -3541 -3979 -4138 -2599 -481 -106 1565 288 -3452 -4360 -3683 -2172 -1831 -753 -1679 -1217 -445
5512 -445 -2392 -1321 322 2950 3837 1615 -2091 -2137 -3310 -4786 -4120 -2551 -362 -834 -1560 -861 -1893
5495 -1893 -2493 251 108 -44 1217 1568 816 -545 -1046 -108 1586 408 -1 1408 1335 349 967 733
5477 733 -1613 -2266 -2311 430 -110 -426 -2748 -2807 -2017 -852 100 -795 -1282 -3380 -3398 -2158 -4150 -4783 -2004
5458b004J403j211j568j432m14M79J71m15J278J005J028L1j225O67Q63K07K161
5441A024L85k154J42l34k272j63J464O95l8p70j752P81J367n45K104o8K42K30
5423C38L72J997N41k042k690K33n59k837j86M597R93j143q29M24Q36l42j717o92
5405b706J990o04j074j13j648j428R5J682J446K10R89j834M23q02l64J658J611
5388d69q70k189n93J17P71m83o45J515J083O6J92J84q96k141j01J829K314Nj211
5369a522J764J725p43J48k415J531p26K75r57j175q65O27P1J551J033j138J571
5352G55j362M71J464R89J999q30j261j983j311j467j099J481J877Q6J250R82J166
5335C207J251j929j523L61k140m81j22J517J335q12j096n00p18J590j508j487
$$ plain form
5458 -2004 -601 -1812 -3380 -4812 -5226 -4747 -4576 -4991 -3713 -2708 -1680 -1649 -2874 -2207 -1344 -1137 1024
5441 1024 1409 -745 -603 -937 -3209 -3372 -1908 -1213 -1251 -2021 -3773 -2992 -1625 -2170 -66 -134 108 338
5423 338 710 2707 3248 1206 -1484 -1251 -1810 -4647 -4833 -236 757 -386 -1215 -791 45 -297 -2014 -2706
5405 -2706 -716 -1320 -2394 -2507 -4155 -5583 -5488 -3806 -2360 -2150 -1161 -2995 -2572 -3374 -3738 -2080 -469
5388 -469 -1339 -3528 -4121 -4004 -3233 -3716 -4361 -2846 -1763 -1697 -1505 -1321 -2217 -4358 -4459 -2630 -316 -311 -1522
5369 -1522 242 1967 1224 1372 -1043 488 -238 37 -920 -2095 -2960 -2333 -2262 -711 322 -816 755
5352 755 -607 -136 1328 2317 4316 3486 2225 242 -1069 -2536 -3635 -2154 -277 -191 1059 2041 3207
5335 3207 4458 2529 1006 1367 -773 -1254 -1376 141 1476 664 -432 -932 -1650 -60 -1568 -3055
5319c055J036l14K80L084j649m420M86J876J256o42k363P73K340K828L93k352
5303d43k631p40J367L83J997L46o82l57j116k271J59L438K362p40j714k429Q55
5286b216R38k551N83K298K354o31j100J783J061J209k92l090M51o68k921L41K111
5269c40J192k54P14J021k000j855M49j368K094J796j215j961k989J006K349J632
5253B71q4O8K57m65j73P82P83j828n74P72j53N69r15n02j498j534J41k94Q64J078
5233b435N42Q77K655J259j003k560L19J794L92J898O26k732k383q95L54O98J448
5216H54n41K51J561l367k53O93K37R8p5Q78j1L94o23n56M82J002J703J608M12
5197D747j375k76n12J183R43Q9p83k260j219O35J334p21k69n25J446K96R71j765
$$ plain form
5319 -3055 -2019 -2333 -2053 1031 -618 -5038 -4552 -2676 -1420 -2062 -4425 -3652 -1312 1516 1909 -443
5303 -443 -3074 -3814 -2447 -2064 -67 279 -403 -760 -1876 -4147 -3988 -550 1812 1072 -642 -3071 -2216
5286 -2216 -1278 -3829 -3246 -948 1406 775 -325 1458 2519 3728 3436 346 797 129 -2792 -2451 -340
5269 -340 852 598 1312 2333 333 -1522 -1073 -2441 -347 1449 234 -1727 -4716 -3710 -1361 271
5253 271 187 255 512 47 -126 656 1439 -389 -963 -191 -344 225 -690 -1192 -2690 -4224 -4083 -4377 -3513 -2435
5233 -2435 -1893 -1016 1639 2898 1895 -665 -346 1448 1840 3738 4364 1632 -751 -1646 -1292 -594 854
5216 854 313 564 2125 -1242 -1495 -802 -565 -467 -542 336 325 719 96 -460 22 1024 2727 4335 4747
5197 4747 3372 3096 2584 3767 4710 4799 4016 1756 537 1172 2506 1785 1516 991 2437 2733 3704 1939
5179A939j131j805j386q58O39R14J811k57j327k265m29K076L22M05n15o26j407
5162c900j450J67K488J409J59k615K58J766J642J237j867l408R83J304J122L26
5146c79r14k087J149O40j523J805K807j061j022n58l023J194N44M19K563R00q94
5129E60M28R16r77l965k945k343L335L843k407m202j36R8J445L379L154j749Q56
5112g10J953o94j659J687j073K157K133K62N25j906j797l18L85J763j270m049
5096b611j806K2r18m29J057J271j91p71J771j481k077N59J732R98j255O70J073
5079b386K788J733k737j600K119n10j329q88O25j389K518N253K75j677J672j523
5063B944l137r55k826R86J896j801j077J955j092j015L137j03l41L05o1O16J38
$$ plain form
5179 1939 808 -997 -2383 -3241 -2602 -1688 123 -134 -1461 -3726 -4155 -2079 -1757 -1352 -1867 -2493 -3900
5162 -3900 -5350 -5183 -2695 -1286 -1127 -3742 -3484 -1718 -76 1161 -706 -4114 -3131 -1827 -705 -379
5146 -379 -1293 -3380 -2231 -1591 -3114 -1309 1498 437 -585 -1143 -4166 -2972 -2428 -2009 554 1454 560
5129 560 988 1904 927 -3038 -5983 -8326 -4991 -1148 -3555 -7757 -7893 -7795 -6350 -2971 183 -1566 -710
5112 -710 1243 549 -1110 577 -496 1661 3794 4056 4581 2675 878 560 945 2708 1438 -2611
5096 -2611 -4417 -4395 -5313 -5742 -4685 -3414 -3605 -4376 -2605 -4086 -6163 -5604 -3872 -2874 -4129 -3459 -2386
5079 -2386 402 2135 -602 -2202 -83 -593 -1922 -2810 -2185 -3574 -1056 4197 4472 2795 4467 2944
5063 2944 -193 -1148 -3974 -2988 -1092 -2893 -3970 -2015 -3107 -4122 -985 -1088 -1429 -1124 -1185 -569 -431
5046d31j231n53j6J574K31j285p87J853p50j151K334J609k028k293p92j224M8
5029d892J610L373K96q39k66j130r92Q38j643n33o08L28N2O19m03L31L204J139
5011D84P58M97J12O85m059j574K348p15K09J17j890k140J61o8J655J059M02P21
4993a238R44N51j179J35J308j353K12J648J898Q0r81k154o86j15P08k395R17M31
4975a269J048q32k099l01M24q91Q82K183J066K159O58j320j530j250J97L3M93
4958c49j118l424J738K856K75j213p75N20J613n59j273L88L15k062l21M25K206
4941g58M76k254j685K009K25j974q49J180K723J294j937r35J396J59j446j48J081
4924a443M45M00J011J287J716n34j683k284N85m89O94J05J692K031l33j497r61
$$ plain form
5046 -431 -1662 -2215 -2231 -657 -426 -1711 -2498 -645 -1395 -2546 -212 1397 -631 -2924 -3716 -4940 -4892
5029 -4892 -3282 91 387 -452 -718 -1848 -2840 -2002 -3645 -4178 -4786 -4458 -4406 -3787 -4190 -3859 -655 484
5011 484 1242 1739 1851 2536 -1523 -3097 -749 -1464 -1255 -1138 -3028 -5168 -5007 -5075 -3420 -2361 -1959 -1238
4993 -1238 -294 257 -922 -787 521 -832 -620 1028 2926 3006 2025 -129 -815 -930 -222 -2617 -1700 -1269
4975 -1269 -221 -1053 -3152 -3453 -3029 -3920 -3038 -855 211 2370 3028 1708 178 -1072 -875 -842 -349
4958 -349 -1467 -4891 -3153 -297 -22 -1235 -2010 -1490 123 -436 -1709 -1321 -1006 -3068 -3389 -2964 -758
4941 -758 -282 -2536 -4221 -2212 -1987 -3961 -4810 -3630 -907 387 -1550 -2485 -1089 -930 -2376 -2524 -1443
4924 -1443 -998 -598 413 1700 3416 2882 1199 -1085 -500 -989 -295 -190 1502 3533 3200 1703 742
4907G42J57k479m18J79J332p19O82l19l497j434J61P65J933O63K603K506J103
4890C960j72j089j58l1j929j622N09m00j830p05q71Q24J189r84j820M38K758N42
4872a391j039L88J928K631p53r85j358K299L9p36k972P64Q82k436Q71J603K647
4855B382k361k420j471R0L06Q66L48l29P49L64K015q50m046l60L393K47n62R99
4837f40j718j750N60J741J376Q70O13n15p94R37P98P62k193J311j676j457O12
4820a163M53J159L08N35j152M74J226j527j787l49N99r2l39P22J750m34j117k924
4802c658j753J474j063J467J086m4J388K445J087J362m91n54k735k588J173J876
4786D72P1l667K96n28r45M7O55L014n73j267J683Q23J342J713P41j431k730l244
$$ plain form
4907 742 899 -1580 -1998 -1819 -487 -1206 -524 -843 -4340 -5774 -5613 -4848 -2915 -2252 351 2857 3960
4890 3960 3788 2699 2541 2510 581 -1041 -532 -932 -2762 -3467 -4338 -3514 -2325 -3309 -5129 -4691 -1933 -1391
4872 -1391 -2430 -2042 -114 2517 1764 779 -579 1720 1759 1023 -1949 -1185 -303 -2739 -1868 -265 2382
4855 2382 21 -2399 -3870 -3780 -3474 -2608 -2260 -2589 -1840 -1476 539 -311 -4357 -4717 -1324 -1077 -1639 -640
4837 -640 -2358 -4108 -3548 -1807 -431 439 1052 537 -257 680 1478 2240 47 1358 -318 -1775 -1163
4820 -1163 -710 449 757 1292 140 614 1840 313 -1474 -1823 -1224 -1316 -1655 -933 817 383 -734 -3658
4802 -3658 -5411 -3937 -5000 -3533 -2447 -2491 -1103 1342 2429 3791 3300 2746 11 -2577 -1404 472
4786 472 543 -3124 -2828 -3356 -4301 -4254 -3599 -585 -1158 -2425 -742 81 1423 3136 3877 2446 -284 -3528
4768c528k242Q15L558L010J234r66%p55j27q98k62Q06k457J70K212K80k329k406
4750c885j030J720J022J422m44J271j185l26m63M2j249J525J646n2j896k74r70
4733c126j241J465L288k431j722J561L023K319k026N77j473j605m397m72J817
4718d443M15l24J263J627l82k322J17J290J614J803n15k847o89K576J442J040
4702A665l10O34j442K63m04K06Q43J830j60k212l516k664J797q5N49K76j191k676
4684f597j149R15O11L318K283m28j976O16M079k91l136N64M606K494q64j444j280
4667B321k935j887N91J889j803p23K47N91j262m15J205l25j602q35k00J519L510
4650a14m32j636J109j227k107k69J550j85J758j392K876K693q18N6l53j322q6
$$ plain form
4768 -3528 -5770 -4955 -1397 1613 2847 1881 1881 1126 999 101 -161 645 -1812 -1642 570 850 -1479 -3885
4750 -3885 -4915 -3195 -2173 -751 -1195 76 -1109 -1435 -1898 -1856 -3105 -1580 66 14 -1882 -2156 -3126
4733 -3126 -4367 -2902 386 -2045 -3767 -2206 817 3136 1110 1687 214 -1391 -5788 -6260 -4443
4718 -4443 -4028 -4352 -3089 -1462 -1844 -4166 -4049 -2759 -1145 658 143 -2704 -3393 -817 625 1665
4702 1665 1355 1989 547 810 406 612 1455 3285 3125 913 -2603 -5267 -3470 -3555 -3006 -2730 -3921 -6597
4684 -6597 -7746 -6831 -6220 -2902 -619 -1047 -3023 -2407 1672 1381 -1755 -1191 3415 5909 5045 3601 2321
4667 2321 -614 -2501 -1910 -21 -1824 -2547 -2300 -1709 -2971 -3386 -2181 -2506 -4108 -4943 -5143 -3624 -114
4650 -114 -546 -2182 -1073 -2300 -4407 -4676 -3126 -3311 -1553 -2945 -69 2624 1806 1862 1509 187 101
4633A01R30J360k999q76J400N51O38j016l47J535M87r86M81J554o3j818o03n37
4615b08Q95K98J70k718m38J741k8j476j07o55J872J564p27m85j103M92J886L72
4597A345r11l14K11J764J551p23k129l277q87K30L42p73Q81J337j082r51K720
4580f66p13k113M18r6l82Q54m90k403N52P04K836K757n61J112j211j394k358J001
4562b153J467n65j221p57J317J808J524o56n36l13j42j420j307n14K65P59J372
4545a072Q21Q32R86p26j409j495j183l80M90J739n73J924o51q98r45R41P65j15
4527i49J290j562j445j71K063p81K45M68J045L304J970k348k588j241l60n79P01
4510i38l68R52kJ761J658j56j53k20j442k192j613N69J283m73j461J136J286j57
$$ plain form
4633 101 1031 2391 -608 -1484 -84 467 1105 89 -258 1277 1764 778 1259 2813 2750 932 329 -208
4615 -208 687 985 1155 -1563 -2001 -260 -288 -1764 -1871 -2526 -654 910 183 -302 -1405 -913 973 1345
4597 1345 434 120 331 2095 3646 2923 794 -2483 -3370 -3140 -2798 -3571 -2690 -1353 -2435 -3386 -666
4580 -666 -1379 -3492 -3074 -3170 -3552 -2698 -3188 -5591 -5039 -4335 -1499 1258 697 1809 598 -796 -3154 -2153
4562 -2153 -686 -1251 -2472 -3229 -1912 -104 1420 764 228 -85 -227 -1647 -2954 -3468 -3203 -2444 -1072
4545 -1072 -251 581 1567 841 -568 -2063 -3246 -3626 -3136 -1397 -1970 -46 -697 -1595 -2540 -1599 -834 -949
4527 -949 341 -1221 -2666 -2837 -774 -1555 -1310 -842 203 3507 5477 3129 541 -700 -1060 -1639 -938
4510 -938 -1306 -354 -356 1405 3063 2907 2754 2534 1092 -1100 -2713 -2144 -861 -1334 -2795 -1659 -373 -530
4492e30j747l58J342K29L06j338L15J84J381O64k604n89L1j170K019J441l79j982
4474b785P17o99P23o4j339q78J772J097K084K199k299j73P89j110j011o8j24k054
4456c223p12M29J56K469J196j670r61J261R37P42O20m48O30j263J184K300j260
4439B387j320M01J935N18r59k759j061R28J129j13L233M16r44j950j901N59L710
4422D209J767k045j371l49j755j157j110Q1p68j018q31J452L377M02k966n22L088
4405D84K0l409j296N70q43r11K975k24J188J875j073P18J822j882k171k726r06
4388e789p01K039K455L17j123M25J89n20m20O49j358p86J458P66q37J30L340J162
4370A396m83q99j544l638J055J577j510k214O16K036R65l181l89J838k926j275
$$ plain form
4492 -530 -2277 -2635 -1293 -1064 -758 -2096 -1781 -1597 -216 448 -2156 -2745 -2714 -3884 -1865 -424 -803 -2785
4474 -2785 -2068 -2767 -2044 -2108 -3447 -4325 -2553 -1456 628 2827 528 355 1144 34 -977 -1045 -1169 -3223
4456 -3223 -3935 -3506 -3350 -881 315 -1355 -2316 -1055 -118 624 1244 796 1426 163 1347 3647 2387
4439 2387 1067 1468 3403 3921 2962 203 -858 70 1199 1086 4319 4735 3791 1841 -60 499 4209
4422 4209 5976 3931 2560 2211 456 -701 -1811 -1730 -2498 -3516 -4347 -2895 482 884 -2082 -2604 484
4405 484 504 -2905 -4201 -3631 -4474 -5385 -2410 -2634 -1446 429 -644 74 1896 14 -2157 -4883 -5789
4388 -5789 -6490 -4451 -1996 -1679 -2802 -2377 -2188 -2708 -3128 -2479 -3837 -4623 -3165 -2399 -3236 -3106 234 1396
4370 1396 913 14 -1530 -5168 -4113 -2536 -4046 -6260 -5644 -3608 -2643 -5824 -6213 -4375 -7301 -8576
4354h576K748J253R95K562k88p17N42P26N55k818j504q6m16l91K78Q25r1P83K398
4335a222K72N0k22R54J285k353m40J210P49j279k386j8L99J009L37L55K22j075
4317b153O01K135k143k50m25k272k03J959J621J024J499j799k633j276J43R77
4301c195J214O97J694j568j290J6K390M33j775K447K639k231K13k01l603k20J513
4284h27k45J305p59M30J478p57m255J692K683j4N55q66M61l129j750j142J296
4267c844J030K157j386J14K478J399Q94j262q59K61k35P88L153k15l235k261p53
4250a776j773r81M838M224k605q48q60p31l85l65P00Q00K631P66l994k232J12
4233b479N59J364j117k586J841O1O77k762r93J418K958N43n83o25J344q22JJ411
$$ plain form
4354 -8576 -5828 -4575 -3580 -1018 -1306 -2023 -1481 -755 -200 -3018 -4522 -4608 -5024 -5415 -5137 -4312 -4403 -3620 -1222
4335 -1222 -950 -900 -1122 -168 1117 -1236 -1676 -466 283 -996 -3382 -3400 -3001 -1992 -1655 -1300 -1078 -2153
4317 -2153 -1552 583 -1560 -1810 -2235 -4507 -4710 -2751 -1130 -106 1393 -406 -3039 -4315 -4172 -3195
4301 -3195 -1981 -1284 410 -1158 -2448 -2432 -42 391 -1384 1063 3702 1471 1684 1483 -2120 -2340 -827
4284 -827 -1072 233 -526 -96 1382 625 -3630 -1938 745 731 1286 420 881 -2248 -3998 -5140 -3844
4267 -3844 -2814 -657 -2043 -1929 549 1948 2842 1580 721 982 747 1535 4688 4473 1238 -1023 -1776
4250 -1776 -3549 -4530 308 4532 1927 1079 219 -512 -897 -1262 -562 238 2869 3635 -359 -2591 -2479
4233 -2479 -1920 -556 -1673 -4259 -2418 -2357 -1680 -4442 -5435 -4017 -1059 -516 -1099 -1724 -380 -1202 -1201 210
4215B10Q93j634k351J278K933j343j36J288J811j687j18J101M53k225j965O31
4199h61J000l67J810Q60p66n79j938J537O95L37o14m85l11L01r15k954R05M21
4181a924k770N52K36l74P33K495Q76K15p63P03M45l658j357m48N17N1j235J449
4163d257J842P09k033o92P95k423J738J826k22P35K605K50o15J887N73k525m36
4146b43l48O35M98j884o30k21j301K085J771k281r64q14K268J61J59M2j198j152
4128c417j4q60j969R17K32L007K169j144R01n07j642J862J031j963J540Q98k007
4111i66j018m1P37j113O80J745R37q51r74p7n41J143K605l48n89Q26l372k118
4093c335P24J027q76k417l94L263M038k59k313o55n19K457r42k451O47J776J015
$$ plain form
4215 210 1103 -531 -2882 -1604 1329 -14 -150 1138 2949 1262 1144 2245 2698 473 -1492 -861
4199 -861 139 -228 1582 2442 1676 1097 -841 696 1391 1728 1114 629 318 619 -296 -3250 -2345 -1924
4181 -1924 -4694 -4142 -3906 -4280 -3547 -1052 -176 39 -724 -21 424 -3234 -4591 -5039 -4522 -4471 -5706 -4257
4163 -4257 -2415 -1706 -3739 -4431 -3636 -6059 -4321 -2495 -2717 -1982 623 873 258 2145 2718 193 -243
4146 -243 -591 44 542 -1342 -1972 -2193 -3494 -1409 362 -1919 -2883 -3697 -1429 -1268 -1109 -1067 -2265 -3417
4128 -3417 -3431 -4291 -6260 -5343 -5111 -2104 65 -1079 -178 -685 -2327 -465 566 -1397 143 1041 -966
4111 -966 -1984 -2025 -1288 -2401 -1721 24 961 110 -864 -941 -1482 -339 2266 1918 1329 2155 -1217 -3335
4093 -3335 -2611 -1584 -2460 -4877 -5271 -2008 2030 1771 -542 -1197 -1716 741 -201 -2652 -2005 -229 786
4076G86Q44j688j045O48q2k519o79J263J778J658k76K74j99m99j952j745J681
4059a752J375M7J231J070j577q36J048k10K25r44k109j258O21K392K748j609q68
4042d06j118K127K100j060k945k34J912N39K85n00M49k27m12r78J308k70q92j776
4024b098K037m75l103K255K058K58n71j624k605n82J165J727J333J277k01j914
4008a063r29R92K6J814J732r29q94r77k15r65j074K087l08j573j5M45P01j851
3990b996N07K841M09J51j436N27P28n90k691j007P36J849J395K79J805j367k568
3973a428K668K399J17k723Q66J665k830l88j925q19J166j109J992J469p57k190
3957a827k889l11Q11J299K081K047J082l23k806J777J899q22l867n44K295l12
$$ plain form
4076 786 1630 -58 -1103 -455 -537 -3056 -3735 -2472 -694 964 688 962 763 264 -1688 -3433 -1752
4059 -1752 -377 -330 901 1971 394 -442 606 396 621 -323 -2432 -3690 -3069 -677 2071 462 -406
4042 -406 -1524 603 2703 1643 -1302 -1536 376 915 1200 700 1149 922 510 -468 840 570 -322 -2098
4024 -2098 -61 -536 -3639 -1384 674 932 361 -1263 -3868 -4450 -3285 -1558 -225 1052 851 -1063
4008 -1063 -1992 -1000 -974 840 2572 1643 749 -228 -443 -1408 -2482 -395 -703 -2276 -2291 -1846 -1145 -2996
3990 -2996 -2489 352 761 912 -524 3 731 141 -2550 -3557 -2821 -972 423 702 2507 1140 -1428
3973 -1428 1240 3639 3756 1033 1899 3564 734 346 -1579 -2398 -1232 -2341 -349 1120 363 -1827
3957 -1827 -4716 -5027 -4216 -2917 -836 1211 2293 1970 -836 941 2840 2018 -1849 -2393 -98 -410
3941d10k81j26J279N23k86q33j192Q00R21o80p04l00J890J9p63o67j090Q28r11
3922a983J949l51R3L395o98j715J560j3k821N53J872j415j747m37K515O54j239
3905A72m11j022J222M30o76l014J799K164o06j466M88j403L1P05J471L94j439
3888a161r40l61QJ402J500J998j291N6n66O39k744K64j054m37P45P98J434j319
3870a029N58J799j301o93K97k118p52J411p46J29J063J356K30j836j237N78R71
3853a320m81j253J91K224Nk55k37J68j61K383J024N5j792n65j06N4J99j668R32
3834f03J386J20J255P18k95k67j320j023j646p14K218R29O2O87N3n59j824j955
3816b778p67o85o46M47p75K924L264J788J264l91l171k583j386K251k20j097M27
$$ plain form
3941 -410 -691 -817 462 985 699 -134 -1326 -526 395 -285 -989 -1289 601 620 -143 -810 -1900 -1072 -1983
3922 -1983 -34 -385 -292 3103 2405 690 2250 2237 -584 -31 1841 426 -1321 -1758 757 1411 172
3905 172 -239 -1261 -39 391 -285 -3299 -1500 664 58 -1408 -920 -2323 -2292 -1587 -116 278 -1161
3888 -1161 -2101 -2462 -2454 -1052 448 2446 1155 1211 645 1284 -1460 -1196 -2250 -2687 -1942 -1144 290 -1029
3870 -1029 -471 1328 27 -666 -369 -2487 -3239 -1828 -2574 -2445 -1382 -26 204 -1632 -2869 -2291 -1320
3853 -1320 -1801 -3054 -2863 -639 -634 -889 -1126 -958 -1119 1264 2288 2343 551 -14 -120 -66 133 -1535 -603
3834 -603 783 903 2158 2876 2581 2314 994 -29 -1675 -2389 -171 758 820 1507 1560 1001 -823 -2778
3816 -2778 -3545 -4230 -4876 -4429 -5204 -2280 984 2772 4036 3645 474 -2109 -3495 -1244 -1464 -2561 -2134
3799b134K1O8j599k164O7k30K010O8k101K173M315J747k152k677j915l32K045
3782b790L56L247K577l066l245M24K912K120l90k381l62r48K77L63j001N06K153
3765G52m11j981j455M73O07R91O43j143j152J747o66k86L578K54m49j974k320
3748b792k014J679K511J94K605J104q86r77o79K21n74p45J631J245O53Q58n26
3731C508k23j311K08k86L17K158j555k399j308M44p72j053j604M36J68j357J886
3714b743M56p41j303K289J794K326o27j786J041j132k123k661M32L215K606R90
3698B033j425q86k109Q85J815j267k628m52L1K046l6L73N06J227j89j335K497
3681A086J218O54R17Q79k533p57p10J9M96o22j225q35j153Q18j27k40M77o92P87
$$ plain form
3799 -2134 -2113 -2045 -3644 -5808 -5741 -5971 -3961 -3893 -5994 -3821 494 2241 89 -2588 -4503 -4835 -2790
3782 -2790 -2434 813 3390 324 -2921 -2497 415 2535 2145 -236 -598 -1546 -1269 -906 -1907 -1401 752
3765 752 341 -1640 -3095 -2622 -2015 -1024 -381 -1524 -2676 -929 -1595 -1881 1697 1951 1502 -472 -2792
3748 -2792 -4806 -3127 -616 -422 2183 3287 2401 1424 745 966 392 -353 1278 2523 3176 4034 3508
3731 3508 3285 1974 2182 1896 2213 4371 2816 417 -891 -447 -1219 -2272 -3876 -3440 -3272 -4629 -2743
3714 -2743 -2287 -3028 -4331 -2042 -248 2078 1451 -335 706 -426 -2549 -5210 -4778 -1563 1043 2033
3698 2033 608 -278 -2387 -1502 313 -954 -3582 -4034 -4003 -1957 -1993 -1620 -1114 113 -76 -1411 1086
3681 1086 2304 2958 3875 4754 2221 1464 754 773 1269 647 -578 -1413 -2566 -1748 -1875 -2115 -1638 -2330 -1543
3662a543J14N35J665j505p55K585K497N44J069pJ341J38j323j197j322k304p8
3645D54p63m15K80j641l56Q52j427L03N81j103P20k25L3K743K113q75o15j727
3627a068j076k49q79N27J701j283m93O20K056L07k88K89p5j264j188M4J343J595
3609F19K182L93J87k105j147L93j761j948L79J492O2J324J45M0J09k360q56M24
3591b428j166L20p99J200L413J890O7j353q43Q54O12k58J62K461k0m994l03j706
3573b891o36J193o71P05J874L188O44j848j645n85k36R81K138p97l99J281R43
3556C239m37j486N21k893J722r03l783j313J8j176o4K329K520j630k716J304K692
3539b056L540o77r73l40Q40j019j923R96J663P24k157M17R83j568j224K396J402
$$ plain form
3662 -1543 -1429 -894 771 -734 -1489 1096 3593 4137 5206 5199 6540 6678 5355 4158 2836 532 454
3645 454 -309 -724 -444 -2085 -2441 -1589 -3016 -2713 -2132 -3235 -2515 -2740 -2707 36 2149 1274 659 -1068
3627 -1068 -2144 -2393 -3272 -2745 -1044 -2327 -2820 -2200 -144 163 -125 164 89 -1175 -2363 -2319 -976 619
3609 619 2801 3194 3381 1276 129 522 -1239 -3187 -2808 -1316 -1254 70 215 255 364 -1996 -2852 -2428
3591 -2428 -3594 -3274 -4073 -2873 540 2430 2497 1144 301 1155 1767 1509 1671 4132 4112 -882 -1185 -2891
3573 -2891 -3527 -2334 -3005 -2300 -426 2762 3406 1558 -87 -672 -908 73 2211 1414 1015 2296 3239
3556 3239 2802 1316 1837 -1056 666 -237 -4020 -5333 -5315 -6491 -6555 -4226 -1706 -3336 -6052 -4748 -2056
3539 -2056 1484 807 -166 -506 334 -685 -2608 -1612 51 775 -1382 -965 18 -1550 -2774 -378 1024
3522A024L7p1J204O30N64j780Q99m39k98r79j956j91j078N18P26J526j135j791
3504b590J962L316j928j975N51J460P77j546j462L4P94l25J035P05j934j076P7
3487b125J763r53p80J30J71l55J827K847l20j957l766j107K795J927n11l44j440
3470b198J095K728J261k771k148p72K051O09j013j427o40J276J770K103J938j027
3454B835k479m12j595N0p37m53P60K279K216J036j380j442L139j035l849q96J89
3437a774J483k342J520j490k538L47J929Q39J729j238P7J824j307N57k374O7J258
3420a433J430L36n67r14L26P19m44j411j164O97N54m60j279n33Q88M13K09L352
3402G19K011L364k411m044N26J655N38P07j659L06N5R5o2j946j661Q51K873L40
$$ plain form
3522 1024 1061 990 2194 2824 3388 1608 2507 2068 1770 791 -1165 -1356 -2434 -1916 -1190 336 -799 -2590
3504 -2590 -628 2688 760 -1215 -664 796 1573 27 -1435 -1401 -607 -932 103 808 -1126 -2202 -2125
3487 -2125 -362 -1315 -2095 -1965 -1794 -2149 -322 2525 2205 248 -3518 -4625 -1830 97 -414 -758 -2198
3470 -2198 -1103 1625 2886 115 -2033 -2805 -754 -145 -1158 -2585 -3225 -1949 -179 1924 3862 2835
3454 2835 356 -56 -1651 -1601 -2338 -2791 -2031 248 2464 3500 2120 678 3817 2782 -1067 -1963 -1774
3437 -1774 -291 -2633 -1113 -2603 -5141 -4794 -2865 -2026 -297 -1535 -1458 366 -941 -384 -2758 -2691 -1433
3420 -1433 -3 333 -234 -1148 -822 -103 -547 -1958 -3122 -2425 -1871 -2331 -3610 -4143 -3255 -2842 -2633 719
3402 719 2730 6094 3683 -361 165 1820 2358 3065 1406 1712 1767 1862 1800 -146 -1807 -956 1917 2257
3384B257j124j844j010L4K023j432N75O99P0j693J25J975O75k11n44M47p35j255
3366i68m83J362P35q86l99R08Q76j032n54j478r24j470j263J316K245O92P1J192
3348f0k964j421J485n55r24k98k14P46L000K213P25k820k544K026n89J525J73
3331d96o82M2k320Q96K137r81o86R21Q06j215R14r37J694K090J512j978r73J161
3313A905J675J855k3m113m1J290j518k493R40k08j698J762L587n78n48K79r25
3296A148j343K372J394P95q73n24K562j956k074K17k99J360k150k659p41J994
3280g77Q4j42j63J063p23N6q71J53J299L92j613M87J046r57l29L37o07J671m90
3261h4k625k82K405L92j129k451M247L35j068j23Q26J944J345l297k582j543q37
$$ plain form
3384 2257 1133 -711 -1721 -1687 336 -1096 -521 178 248 -1445 -1320 655 1330 1119 575 1022 287 -968
3366 -968 -1451 -89 646 -240 -639 269 1145 113 -441 -1919 -2843 -4313 -5576 -4260 -2015 -1323 -1252 -60
3348 -60 -3024 -4445 -2960 -3515 -4439 -4737 -4951 -4205 -1205 1008 1733 -1087 -3631 -1605 -2194 -669 -496
3331 -496 -1178 -1136 -3456 -2560 -423 -1404 -2090 -1169 -363 -1578 -664 -1601 93 2183 3695 1717 744 1905
3313 1905 3580 5435 5412 1299 1258 2548 1030 -1463 -523 -731 -2429 -667 2920 2342 1794 2073 1148
3296 1148 -195 2177 3571 4366 3493 2969 5531 3575 1501 1718 1419 2779 629 -2030 -2771 -777
3280 -777 -693 -835 -998 65 -658 -602 -1473 -1320 -21 371 -1242 -755 291 -666 -995 -658 -1265 406 -84
3261 -84 -2709 -2991 -586 -194 -1323 -3774 473 808 -260 -383 443 2387 3732 435 -2147 -3690 -4527
3244d527Q55j57L89J726J055n61R69j811l13J247K324P60j985j860K248K449j218
3227A590l701l06J349n75m81K322l22k044Q6K618K533j118j220l96l602K98N73
3210b396K146L34j483k010K917j97n66J224M26k464P01L39k09J646j44k88K75
3193B51j324j045l20j81K38Q93n62J531k94j512K324J988j352l252k032J780P69
3176b100J672l18l44L43J324J4r80K258j502j371Q20J373j401j59r91L01p5j56
3158a292j791k580L95L080K252m3M25j25r3J1J517M9k16k195j445l00p2Q62N74
3139i87J600L41K62L544j648p32q49j375r68j0r4O11J631j336k465K874J753J537
3121C689J270k320j523r38Q5q08N97k98n11L553K527j911J202j835j425J278q70
$$ plain form
3244 -4527 -3672 -3829 -3440 -1714 -659 -1220 -251 -2062 -2375 -1128 1196 1956 -29 -1889 359 2808 1590
3227 1590 -2111 -2417 -1068 -1643 -2124 198 -124 -2168 -2082 536 3069 1951 731 335 -3267 -2969 -2396
3210 -2396 -250 84 -1399 -3409 -492 -689 -1255 -31 395 -2069 -1368 -1029 -1238 408 264 -24 251
3193 251 -1073 -2118 -2438 -2619 -2381 -1488 -2050 -519 -813 -2325 -1 1987 635 -2617 -4649 -2869 -2100
3176 -2100 -428 -746 -1090 -747 577 591 -389 1869 367 -1004 -184 1189 -212 -371 -1362 -1061 -1136 -1292
3158 -1292 -3083 -5663 -5268 -2188 64 21 446 321 228 239 1756 1805 1589 -606 -2051 -2351 -2423 -1561 -987
3139 -987 613 954 1216 4760 3112 2380 1531 156 -812 -822 -916 -305 1326 -10 -2475 399 2152 3689
3121 3689 4959 2639 1116 178 263 -545 52 -246 -757 2796 5323 3412 4614 2779 1354 2632 1762
3104A762o32r43k360O16M797K312Nj127k983j05l33j186k42q89J663r20N39K604
3086B578j175k286r35J7j693O19Q65J346m53j955k63q3J140K278l05k78n32m51
3068a566r56o84K12m56k593q85K320J016n07O03j248J187j437j020J767K699l60
3051a908J391J788r44k42J230J204J24j885p58l23N99o00k218J296K581K466l18
3034C483j68j636R8j241l59K356j373j189j114m4J572j910J105L987j231j955
3018C81j790Q41J286J736J290O03j822k974n27K023k277l141j193J900L619R57
3002I12J351k095K170J76k337J03K354j418l462M08K067R12l011p64R65m29j748
2985c846l0O57J717L045M8j317j226j024L61k26o7K03o49K580J040o44j856j345
$$ plain form
3104 1762 1130 187 -2173 -1557 3240 5552 5557 4430 1447 1342 1009 -177 -419 -1308 355 -565 -26 2578
3086 2578 1403 -883 -1818 -1801 -3494 -2875 -2010 -664 -1117 -3072 -3335 -3418 -2278 0 -305 -583 -1115 -1566
3068 -1566 -2522 -3206 -2994 -3450 -6043 -6928 -4608 -3592 -4099 -3496 -4744 -3557 -4994 -6014 -4247 -1548 -1908
3051 -1908 -517 1271 327 85 1315 2519 2643 758 0 -323 276 -324 -2542 -1246 1335 3801 3483
3034 3483 3315 1679 1777 536 177 2533 1160 -29 -1143 -1187 385 -1525 -420 3567 2336 381
3018 381 -1409 -568 718 2454 3744 4347 2525 -449 -976 1047 -1230 -4371 -5564 -3664 -45 912
3002 912 2263 168 2338 2514 177 280 2634 1216 -2246 -1838 229 1141 -1870 -2634 -1669 -2098 -3846
2985 -3846 -3876 -3219 -1502 1543 1591 274 -952 -1976 -1615 -1841 -1908 -1705 -2354 226 1266 622 -1234 -2579
2967b579K355J399j310Q05K04O68l26K47Q3l148j373L906J631k884N49R6j860
2950a537j508J002m7k872J706J95q08j514J834K901P51j148j085K374j60j400
2934a316K861k124m85j052j305o2K106L467k33j332j482J741j450p27j50j661
2918c204l059K782L938j323j470J33n44PJ449K388J297k847j817K428L650K213
2902F021k455k979j169J804l15j545k44K04p00J505M75k213L1O96J056J384m03
2885A153k118j69r64O25M553J23k15l079j863j071Q87j210Q52K247J743L83j607
2868B70j802O1K990J329j47o79K98L28Q97m68j066o47k11j039j968J226L60k27
2850d95KK34J93o95q96l20J464Q49j182k322L3n72r89J554l37L0J503Q06P0J478
$$ plain form
2967 -2579 -224 1175 -135 670 874 1542 1216 1463 1546 -1602 -2975 931 2562 -322 227 323 -1537
2950 -1537 -3045 -2043 -2090 -4962 -3256 -3061 -3869 -5383 -3549 -648 103 -1045 -2130 244 84 -1316
2934 -1316 1545 -579 -1064 -2116 -3421 -3483 -1377 2090 1857 525 -957 784 -666 -1393 -1543 -3204
2918 -3204 -6263 -3481 457 -866 -2336 -2203 -2747 -2740 -1291 1097 2394 -453 -2270 158 3808 6021
2902 6021 3566 587 -582 1222 907 -638 -882 -678 -1378 127 602 -1611 -1580 -884 172 1556 1153
2885 1153 -965 -1134 -2098 -1473 3080 3203 2988 -91 -1954 -3025 -2138 -3348 -2496 -249 1494 1877 270
2868 270 -1532 -1471 1519 2848 2701 2022 2320 2648 3545 3077 2011 1364 1153 114 -1854 -628 -268 -495
2850 -495 -493 -259 -66 -761 -1657 -1977 -513 336 -846 -3168 -3135 -3707 -4696 -3142 -3479 -3449 -1946 -1140 -1070 408
2830D08k83k811j149K030j99J289J104m60r25p21j412o50M45J480P56K702K230
2813C834L11k892n11J437K41M36p1l87k579K017Q63j159j286j400o62n32k095
2796d435j161J304M55K194J825J227r45k966j97N54l31J013R8M18M05K07o28L70
2778e93J499N80j584L07J272J160J408J616M66k109k190J26n60k754N61J321J024
2761A550m16k62p16l45K50K401P69o99r23j054j210l59p08K064K186l45k389j090
2743a296R60J128l71l41J178M39j69j794j936M72J160l89N29K70M40m56j280m23
2725a879P18j041P78L34Q27L85j329j076J919J512k197j206K236J291n17O17q04
2708E68O85n96L98j532k641M48J598J476K493J686l144k657j439j410J427J434
$$ plain form
2830 408 125 -2686 -3835 -1805 -2004 -715 389 -71 -996 -1717 -3129 -3779 -3334 -1854 -1098 1604 3834
2813 3834 4145 1253 742 2179 2420 2856 2785 2398 -181 1836 2699 1540 254 -1146 -1808 -2340 -4435
2796 -4435 -5596 -4292 -3837 -1643 182 1409 464 -2502 -2699 -2145 -2476 -1463 -1365 -947 -542 -335 -963 -593
2778 -593 906 1486 -98 209 1481 2641 4049 5665 6131 4022 1832 1958 1398 -1356 -795 526 1550
2761 1550 1134 872 156 -189 61 2462 3231 2532 1609 555 -655 -1014 -1722 342 2528 2183 -206 -1296
2743 -1296 -336 792 421 80 1258 1697 1528 -266 -2202 -1730 -570 -959 -430 -160 280 -176 -1456 -1879
2725 -1879 -1161 -2202 -1424 -1090 -263 122 -1207 -2283 -364 1148 -1049 -2255 -19 1272 755 1372 568
2708 568 1253 657 1055 -477 -3118 -2670 -1072 404 2897 4583 1439 -1218 -2657 -4067 -2640 -1206
2692a206k20J924L210Q2k321m12o64n24k024r71j420l77M38L269J050K110K57
2675B201j413o76J136k193p84n90j227j870J070K011K773K455M55k950r60N79
2659A7J357q48Q71L17J026k70j877r6O01j810L88n43k383l462j704K395L327Q25
2641a869K107p75p12k1J301l54k00O20k20L9K932J249k271r52j631r01j679P22
2623b615Q15J242j958j993L36J279L318L7k71k493l303K019J869K065j62p38L78
2606a75n00L52J983K973K8o84k663q37r4j396j419Q77P10n87j479J274N06J523
2588C92J726j055k30K937l74l542j179Q72j658j316k58J712J71j09J312R42j017
2571f74n19L04j389k32J872J204j71j045j211N98J165J795J487j251j424j805
$$ plain form
2692 -1206 -1426 498 3708 3790 1469 1057 393 -131 -2155 -3126 -4546 -4923 -4485 -1216 -166 1944 2201
2675 2201 788 112 1248 -945 -1729 -2319 -3546 -5416 -4346 -2335 438 2893 3348 398 -562 17
2659 17 1374 526 1397 1714 2740 2470 593 497 1098 -712 -324 -867 -3250 -6712 -8416 -6021 -2694 -1869
2641 -1869 238 -537 -1249 -1270 31 -323 -523 97 -123 -84 2848 4097 1826 874 -757 -1658 -3337 -2615
2623 -2615 -1800 -558 -2516 -4509 -4173 -2894 424 461 190 -2303 -5606 -3587 -1718 347 185 -553 -175
2606 -175 -675 -323 1660 4633 4661 3977 1314 477 383 -1013 -2432 -1555 -845 -1432 -2911 -1637 -1131 392
2588 392 2118 1063 833 3770 3396 -146 -1325 -453 -2111 -3427 -3685 -1973 -1802 -1911 -599 343 -674
2571 -674 -1193 -889 -2278 -2510 -638 566 395 -650 -1861 -1263 -98 1697 3184 1933 509 -1296
2555a296n5o88K78L327R24J814j842k671J533j348j074Pq38J980M92K58j378J390
2537H13p71J7K254L79p39K0Q36j37J361j258j546R20j074j772j279O30K152n52
2519B54o17j194o04K486o76n65J681J311L5J60p28N75j504j768K44L74p99K89
2501a046K806J588L93m30P2k758j177O61J265K8r24j140J31k95J542p64k19j652
2483a919o37P66q28k66J490J864J461L47k627j725j95Q01k8j2R4K260l87r65k22
2464g28L334p9j839J507J973j188K27J698q86k866o96o13N07P45j249k892j280
2447d325K19n82j66K11J223J532N42P39L42k51r10l19J094r56K484J749j820l07
2429D99Q72K57j613j883J056K086P6Q11l198l59K783l18N41j753j032j107j341
$$ plain form
2555 -1296 -1351 -2039 -1761 1566 2490 4304 2462 -209 1324 -24 -1098 -1091 -1929 51 543 801 -577 813
2537 813 42 59 2313 2692 1953 1973 2809 2672 4033 2775 1229 2149 1075 -697 -1976 -1346 806 254
2519 254 -363 -1557 -2161 325 -351 -916 765 2076 2111 2271 1543 2118 614 -1154 -910 -536 -1335 -1046
2501 -1046 1760 3348 3741 3311 3383 625 -552 109 1374 1402 478 -662 -531 -826 716 -48 -267 -1919
2483 -1919 -2556 -1790 -2618 -2884 -1394 470 1931 2278 -349 -2074 -2269 -1468 -1496 -1508 -1414 846 459 -506 -728
2464 -728 2606 2527 688 2195 4168 2980 3207 4905 4019 1153 457 -156 351 1096 -153 -3045 -4325
2447 -4325 -4106 -4688 -4854 -4643 -3420 -1888 -1346 -607 -265 -516 -1426 -1745 -651 -1607 877 2626 806 499
2429 499 1371 1628 15 -1868 -812 1274 1350 2161 -1037 -1396 1387 1069 1610 -143 -1175 -2282 -3623
2412c623j401K18n27L547K541P77q43j0J576j391n80R82k239J342M31j327L41
2395a86R0j791k716p3J821N15N05L183M57j876m41K17J987K361q8l138j041j266
2377a480j654K072J175N05l79r60k14J30p2p22J131K0p29N15j718J585N53O4O25
2358D47K86Q3j462k83J145J645J328Q59p04l081O7K05M41J714m95n47k426m71
2340a249J274L53N55O16n41j157j853J378K91l575m18J329J733r09K87L940K251
2323D305k73o22Q92L83k69j888L5J321k20k196k802n81r69K084J321O50K467N81
2305D219j120j151M32p62o56j172j362r29K139K12j255j02P50J064k399J43K252
2288C03M70k63q23K33m43l88Q87K382O2l738J354J852q16l76k347j029J185p1
$$ plain form
2412 -3623 -5024 -4806 -5333 -1786 755 1532 689 679 2255 864 284 1266 -973 369 800 -527 -186
2395 -186 -96 -1887 -4603 -4676 -2855 -2340 -1835 1348 1805 -71 -512 -295 1692 4053 3965 827 -214 -1480
2377 -1480 -3134 -1062 113 618 239 -721 -935 -805 -877 -1599 -468 -448 -1177 -662 -2380 -795 -242 -178 447
2358 447 733 816 -646 -929 216 1861 3189 4048 3344 263 330 535 976 2690 2195 1648 -778 -1249
2340 -1249 25 378 933 1549 1008 -149 -2002 -624 -333 -3908 -4326 -2997 -1264 -2173 -1886 2054 4305
2323 4305 4032 3410 4302 4685 4416 2528 2563 3884 3664 1468 -1334 -1915 -2884 -800 521 1171 3638 4219
2305 4219 3099 1948 2380 1618 962 -210 -1572 -2501 -362 -150 -1405 -1507 -757 307 -2092 -1949 303
2288 303 773 510 -313 -80 -523 -911 -24 2358 2420 -1318 36 1888 1072 696 -1651 -2680 -1495 -1566
2270a566M52R46K354P82k64q74L18k377j225m73J33J664P99M45k20Q62l27o83
2252G46j415k112q20K80l37p45J742N82Q2J677J784J49J010j124l82r04J2Q72
2234A097j367n16j900L80m58N57J460J579k015Q43j212j190K270J694p01j656
2218a135J905P55j849K54N37j28L45Q44p86k915N96O57K50k397n93k117O40L14
2200d823J709J217n12j398J885L185J67m305J52K646J114n0j89K15r17K041J760
2183C897o8P1j697O04j496j002j642J038N75q25j93l73n04L091K44Q16n99R67
2165B904l47n40k162k769p08q46K013j49J082R66k85j044Q12o10o42O5J17Q22
2147a321J474k146J3J281J506j616K35Q21O37Ql84N35k318k913m68K562R42O05
$$ plain form
2270 -1566 -1114 -168 2186 2968 2704 1830 2148 -229 -1454 -1927 -1794 -130 669 1114 894 1756 1429 746
2252 746 -669 -2781 -3601 -3321 -3658 -4403 -2661 -2079 -1997 -320 1464 1613 2623 1499 1117 213 225 1097
2234 1097 -270 -786 -2686 -2306 -2764 -2207 -747 832 -1183 -340 -1552 -2742 -472 1222 521 -1135
2218 -1135 770 1525 -324 -70 467 339 684 1528 742 -2173 -1577 -920 -670 -3067 -3660 -5777 -5137 -4823
2200 -4823 -3114 -1897 -2409 -3807 -1922 1263 1430 -2875 -2723 -77 1037 987 798 1013 96 2137 3897
2183 3897 3829 3900 2203 2807 1311 309 -1333 -295 280 -545 -738 -1111 -1615 1476 1720 2536 1937 2904
2165 2904 2557 2017 -145 -2914 -3622 -4468 -2455 -2604 -1522 -556 -841 -1885 -1073 -1683 -2325 -2260 -2143 -1321
2147 -1321 153 -1993 -1980 -699 807 -809 -574 247 884 892 508 1043 -1275 -4188 -4656 -2094 -1152 -547
2129e47j406j033M052K645l139k080r13m59N02k3K07m22j72K687J567l6J082J283
2111C795l229k803rJ720K41N48J781K76Q24K666k675j888j483o04Q41P34J456
2094B191J02j347M36M20N85jo19k769k478j021N32J681K040j96n95Ol31j607j958
2075d929J565j043J157R80J355k12J391J590J065R24k283l02k11k991m546r54
2059g444K029J737k83r09J926o82O35M245N23l108l52m72l373j182Q2N73j5K006
2041d064K849n35l1K445J187P07p97j712k264n78L38k36J634r09P37J058Q20m46
2023B03Q53j061Qj628q0k29j291L51J071k192K2K492J553k15k619L9j04J260P03
2004h64j019l3L1J186L03n72P6P31K444J171j306k827j085l406J98K698P79J494
$$ plain form
2129 -547 -1953 -2986 1066 3711 572 -1508 -2421 -2880 -2378 -2401 -2194 -2616 -2788 -101 1466 1430 2512 3795
2111 3795 566 -2237 -2246 -526 -285 263 2044 2320 3144 5810 3135 1247 -236 -840 1 735 2191
2094 2191 2293 946 1382 1802 2387 2386 1767 -1002 -3480 -4501 -3969 -2288 -248 -444 -1039 -1033 -1364 -2971 -4929
2075 -4929 -3364 -4407 -3250 -2270 -915 -1127 264 1854 2919 3843 1560 1258 1047 -1944 -6490 -7444
2059 -7444 -5415 -3678 -3961 -4870 -2944 -3626 -2991 1254 1777 -1331 -1683 -2155 -5528 -6710 -6628 -6055 -6070 -4064
2041 -4064 -1215 -1750 -1781 664 1851 2558 1761 49 -2215 -2793 -2455 -2691 -1057 -1966 -1229 -171 649 203
2023 203 1056 -5 3 -1625 -1705 -1934 -3225 -2874 -1803 -3995 -3973 -1481 72 -143 -2762 -2723 -2827 -1567 -864
2004 -864 -1883 -1916 -1885 -699 -396 -968 -892 -161 2283 3454 2148 -679 -1764 -5170 -4972 -2274 -1495 -1
1986aJ610j148J095l12l82o98r54k0L502K137k205q82n55j205j79M51j198J313
1968C69j453k755j65K361J866k45P04M27p36j028J597P23Q63J425q00j663n04
1951I86l43N31m12j14M78L34O4R93j60j229j645p97k225k54J625K558P73j8K388
1932C533K240j441j743j686j426l56J23n90P23n12L87Q51K135j046k857J336j244
1915a573k06P41j611J503J360M80j935j287Q60m74J385P61j87k07p13k474J908
1898a669K970m60J687k379j386P86j241K105J305P8j783Q57n66k129q72K315R77
1881E95K909l20k466N17R09J667j576m336j63J355p01n53k03J526J340R00o03
1864G97k196j363J659K225J700J731n95l164R40L463R3L75k694L43n02k836k214
$$ plain form
1986 -1 1609 461 1556 1244 862 164 -790 -810 2692 4829 2624 1742 1187 -18 -197 254 -944 369
1968 369 -1084 -3839 -4004 -1643 223 -22 682 1109 373 -655 942 1665 2528 3953 3153 1490 986
1951 986 643 1174 762 648 1126 1460 1524 2517 2357 1128 -517 -1314 -3539 -3793 -2168 390 1163 1145 3533
1932 3533 5773 4332 2589 903 -523 -879 -756 -1346 -623 -1135 -748 103 2238 1192 -1665 -329 -1573
1915 -1573 -1779 -1038 -2649 -1146 214 694 -1241 -2528 -1668 -2142 -757 4 -183 -390 -1103 -3577 -1669
1898 -1669 1301 841 2528 149 -1237 -451 -1692 413 1718 1796 13 870 304 -1825 -2697 -382 595
1881 595 3504 3184 718 1235 2144 3811 2235 -2101 -2264 -909 -1610 -2163 -2366 -840 500 1400 797
1864 797 -1399 -2762 -1103 1122 2822 4553 3958 794 1734 5197 5290 5665 2971 3314 2812 -24 -2238
1847b238j437J62o46J341R56J397O55K856k304r70O49p80P81j345j155J202m23
1830a299m31J541J356r04j672J307Q95j378M1j108j47j228K50J799K242r47K57
1813E74j736K2K809n47n69j534o36J907o6j525o90J640P56R77K132m8k117p53
1795E96O47J148p54l12r99J070R33j978k174j244j237J448L30L951J662l48k598
1778A41n07K739J168j519j876r21n55J540K674J396k3k490j544J04pJ00J68r93
1760d05m53J617K985j289j327Q30k228n06M91j316R31O66J541L82k528p88r39
1743b336J225J163k990j598J784J749p93j624p97J833K670J632J71k392j201L4
1727a470l89J474R10N49J60j401Q78n58j865J140N51P18J708o02q32J13K330O74
$$ plain form
1847 -2238 -3675 -3513 -4159 -2818 -1862 -465 190 3046 742 -228 421 -359 422 -923 -2078 -876 -1299
1830 -1299 -1730 -189 1167 263 -1409 -102 793 -585 -544 -1652 -1799 -3027 -2777 -978 1264 317 574
1813 574 -1162 -1140 1669 1122 553 -981 -1617 290 224 -1301 -1991 -351 405 1382 3514 3466 1349 596
1795 596 1243 2391 1637 1325 326 1396 2329 351 -1823 -3067 -4304 -2856 -2526 1425 3087 2739 141
1778 141 -366 2373 3541 2022 146 -775 -1330 210 2884 4280 4257 1767 223 327 320 420 588 -405
1760 -405 -858 759 3744 2455 1128 1958 -270 -776 -285 -1601 -670 -4 1537 1919 -609 -1397 -2336
1743 -2336 -1111 52 -2938 -4536 -2752 -1003 -1796 -3420 -4217 -2384 286 1918 2089 -303 -1504 -1470
1727 -1470 -1859 -385 525 1074 1234 -167 711 153 -1712 -572 -21 697 2405 1803 971 1084 3414 4088
1709D088k627j478O05j24J190J837J48o86j959n75j876K33J382j341k75R56L70
1692a32K42O99J94P2R19N38J89l008k001R4L53M74Q91k26O0K415j393r91o43L1
1672a223J604J441n41k142J696q38j857L53J336j066L1J505K106j126l26J253
1656B206j311j271j920Q85J072l02j736j452J305J668J060j591j325J499J785
1641E72L36J559j232k56P76K315N17j734j762j050o09P92l3K97J350J246k12k064
1623H08k525R64K248J145j797j144j572M05o61K86J15P02J108j677O83r92P59
1606a145k03j351l2K018J032r76j836J786K093K55j018k096j4o52k54Q05J242
1589c46j161P49k60J953Kr64m24j554l17L789m88J704J376j143m83q82J679M92
$$ plain form
1709 4088 1461 -17 588 464 1654 3491 3639 2953 994 419 -1457 -1224 158 -1183 -1458 -502 -132
1692 -132 110 809 1003 1075 1994 2532 2721 -287 -2288 -2194 -1841 -1367 -476 -702 -642 1773 380 -611 -1254 -1223
1672 -1223 381 1822 1281 -861 835 -3 -1860 -1507 -171 -1237 -1206 299 2405 1279 953 2206
1656 2206 895 -376 -2296 -1411 -339 -641 -2377 -3829 -2524 -856 204 -1387 -2712 -1213 572
1641 572 908 2467 1235 979 1755 4070 4587 2853 1091 41 -568 224 191 488 1838 3084 2872 808
1623 808 -1717 -753 1495 2640 843 -301 -1873 -1468 -2129 -1843 -1728 -1026 82 -1595 -912 -1904 -1145
1606 -1145 -1348 -2699 -2731 -713 319 -657 -2493 -707 1386 1641 623 -1473 -1487 -2139 -2393 -1588 -346
1589 -346 -1507 -758 -1018 935 937 -27 -451 -2005 -2322 1467 979 2683 4059 2916 2433 1551 3230 3722
1571C722j88p03l376J53J915K459K08k41j689q49n06k16J699l3K45P19j973k655
1553a309J446m37J442K184n09j100j33O1q45j157P01J3o21j374J457K093O0J914
1535C886L40q79o68L11j632N20M4k565j218K421J558k21k100j907l07J797M232
1518C612j28p48k014n19R96j428p93K358j466N91J10J811K18j533o55M93K01J588
1500B694L564j258j223N94k111m36n51M08L264l05m28J143l40k257k060N97K587
1483C882L39k284j531J824j393l574K48O82l90lO10R53J481K504k80j597J093
$$ plain form
1571 3722 3534 2831 -545 -392 1523 3982 4190 3949 2260 1411 905 689 2388 2355 2600 3319 1346 -1309
1553 -1309 137 -300 1142 3326 2817 1717 1584 1645 800 -357 344 357 -264 -1638 -181 1912 1972 3886
1535 3886 4226 3347 2679 2990 1358 1878 1922 -643 -1861 560 2118 1897 -203 -2110 -2417 -620 3612
1518 3612 3484 2736 722 203 1199 -229 -1022 1336 -130 461 571 2382 2600 1067 412 905 1106 2694
1500 2694 6258 5000 3777 4371 2260 1824 1273 1681 4945 4640 4212 5355 5015 2758 698 1295 3882
1483 3882 4221 1937 406 2230 837 -2737 -2489 -1807 -2197 -2200 -1590 -637 844 3348 3068 1471 2564
$$ [...]
##END NTUPLES=NMR SPECTRUM
##END=
