##TITLE=Analysis number 329453
Compound Code spb 06334
Project Code adrs
Chemist Name aci
##JCAMPDX= 6.0         $$ Bruker NMR JCAMP-DX V2.0
##DATA TYPE= NMR SPECTRUM
##DATA CLASS= NTUPLES
##ORIGIN= Bruker BioSpin GmbH
##OWNER= nmr
$$ XWIN-NMR		Version 3.5
$$ Mon Sep  3 15:37:35 2007 GMT Daylight Time (UT+1h)  MAYBRIDGE\nmr@NMR_250MHZ
##.OBSERVE FREQUENCY= 250.131544655141
##.OBSERVE NUCLEUS= ^1H
##.ACQUISITION MODE= SIMULTANEOUS (DQD)
##.ACQUISITION SCHEME= undefined
##.AVERAGES= 16
##.DIGITISER RES= 18
##SPECTROMETER/DATA SYSTEM= dpx250
##.PULSE SEQUENCE= zg30
##.SOLVENT NAME= CDCl3
##.SHIFT REFERENCE= (INTERNAL, CDCl3, 0, 16.522)
##AUDIT TRAIL= $$ (NUMBER, WHEN, WHO, WHERE, WHAT)
$$ ##TITLE= Audit trail, XWIN-NMR		Version 3.5
$$ ##JCAMPDX= 5.01
$$ ##ORIGIN= Bruker BioSpin GmbH
$$ ##OWNER= nmr
$$ C:\u/data/dgb/nmr/ADRS/90/pdata/1/auditp.txt
$$ ##AUDIT TRAIL=  $$ (NUMBER, WHEN, WHO, WHERE, WHAT)
(   1,<2007-09-03 15:36:15.24 +100>,<MAYBRIDGE\nmr>,<NMR_250MHZ>,
      <created by zg, POWCHK disabled, PULCHK disabled
       configuration hash MD5:
       76 6E 9A 78 1E 09 19 81 EC 84 63 8F B0 6A 59 2D
       data hash MD5: 64K
       16 C8 D3 EB A7 FA B1 4C E4 0C 05 EC 30 73 FB 54>)
(   2,<2007-09-03 15:36:52.92 +100>,<MAYBRIDGE\nmr>,<NMR_250MHZ>,
      <Start of raw data processing
       ef LB = 0.3 FT_mod = 6 PKNL = 1 SI = 32K 
       data hash MD5: 32K
       F5 94 76 19 0B 3F 11 E4 F7 75 E4 C0 77 97 69 83>)
(   3,<2007-09-03 15:36:58.76 +100>,<MAYBRIDGE\nmr>,<NMR_250MHZ>,
      <apk 
       data hash MD5: 32K
       8D FB B7 5F 34 71 C9 50 FA 21 7C A9 F1 5F 3E DB>)
(   4,<2007-09-03 15:37:04.29 +100>,<MAYBRIDGE\nmr>,<NMR_250MHZ>,
      <abs ABSG = 5 
       data hash MD5: 32K
       E6 9A 18 95 94 D7 B9 78 0D 39 34 92 E0 5F AD 16>)
$$ ##END=
$$ 
$$ hash MD5
$$ 06 89 6D AB 8F 27 A5 28 EF 72 37 E3 A2 CD 20 F8
##$RELAX= 
##$RELAX= 
##$RELAX= 
##$RELAX= 
##$RELAX= 
##$RELAX= 
##$RELAX= 
$$ Bruker specific parameters
$$ --------------------------
##$DU= <C:\u>
##$EXPNO= 90
##$NAME= <ADRS>
##$PROCNO= 1
##$TYPE= <nmr>
##$USER= <dgb>
##$AMP= (0..31)
100 100 100 100 100 100 100 100 100 100 100 100 100 100 100 100 100 100 
100 100 100 100 100 100 100 100 100 100 100 100 100 100 
##$AQSEQ= 0
##$AQ_mod= 3
##$AUNM= <au_zg>
##$AUTOPOS= <35 >
##$BF1= 250.13
##$BF2= 250.13
##$BF3= 250.13
##$BF4= 250.13
##$BF5= 500.13
##$BF6= 500.13
##$BF7= 500.13
##$BF8= 500.13
##$BYTORDA= 1
##$CFDGTYP= 0
##$CFRGTYP= 5
##$CHEMSTR= <none>
##$CNST= (0..31)
1 1 145 1 1 1 1 1 1 1 1 1 1 1 1 1 1 1 1 1 1 1 1 1 1 1 1 1 1 1 1 1 
##$CPDPRG= <>
##$CPDPRG1= <>
##$CPDPRG2= <>
##$CPDPRG3= <>
##$CPDPRG4= <mlev>
##$CPDPRG5= <mlev>
##$CPDPRG6= <mlev>
##$CPDPRG7= <mlev>
##$CPDPRG8= <mlev>
##$CPDPRGB= <>
##$CPDPRGT= <>
##$D= (0..31)
0 1 0 0 0 0 0 0 0 0.06 0 0 0 0 0 0 0.0002 0 0 0 0 0 0 0 0 0 0 0 0 0 0 
0 
##$DATE= 1188830172
##$DBL= (0..7)
120 120 120 120 120 120 120 120 
##$DBP= (0..7)
150 150 150 150 150 150 150 150 
##$DBP07= 0
##$DBPNAM0= <>
##$DBPNAM1= <>
##$DBPNAM2= <>
##$DBPNAM3= <>
$$ [...]
##$SUBNAM7= <"">
##$SUBNAM8= <"">
##$SUBNAM9= <"">
##$SW= 20.6930455092707
##$SWIBOX= (0..15)
0 0 3 0 0 0 0 0 0 0 0 0 0 0 0 0 
##$SW_h= 5175.983436853
##$TD= 65536
##$TD0= 1
##$TE= 297.16
##$TE2= 300
##$TE3= 300
##$TEG= 300
##$TL= (0..7)
0 120 120 120 120 120 120 120 
##$TP= (0..7)
150 150 150 150 150 150 150 150 
##$TP07= 0
##$TPNAME0= <>
##$TPNAME1= <>
##$TPNAME2= <>
##$TPNAME3= <>
##$TPNAME4= <>
##$TPNAME5= <>
##$TPNAME6= <>
##$TPNAME7= <>
##$TPOAL= (0..7)
0.5 0.5 0.5 0.5 0.5 0.5 0.5 0.5 
##$TPOFFS= (0..7)
0 0 0 0 0 0 0 0 
##$TUNHIN= 0
##$TUNHOUT= 0
##$TUNXOUT= 0
##$USERA1= <user>
##$USERA2= <user>
##$USERA3= <user>
##$USERA4= <user>
##$USERA5= <user>
##$V9= 5
##$VALIST= <valist>
##$VCLIST= <CCCCCCCCCCCCCCC>
##$VD= 0
##$VDLIST= <DDDDDDDDDDDDDDD>
##$VPLIST= <PPPPPPPPPPPPPPP>
##$VTLIST= <TTTTTTTTTTTTTTT>
##$WBST= 1024
##$WBSW= 4
##$XGAIN= (0..3)
0 0 0 0 
##$XL= 0
##$YL= 0
##$YMAX_a= 392513
##$YMIN_a= -395757
##$ZGOPTNS= <>
##$ZL1= 120
##$ZL2= 120
##$ZL3= 120
##$ZL4= 120
##$ABSF1= 16.522
##$ABSF2= -4.171173
##$ABSG= 5
##$ABSL= 3
##$ALPHA= 0
##$AQORDER= 0
##$ASSFAC= 0
##$ASSFACI= 0
##$ASSFACX= 0
##$ASSWID= 0
##$AUNMP= <proc_1d>
##$AZFE= 0.1
##$AZFW= 0.1
##$BCFW= 0
##$BC_mod= 0
##$BYTORDP= 0
##$COROFFS= 0
##$CY= 12.5
##$DATMOD= 1
##$DC= 0
##$DFILT= <>
##$DTYPP= 0
##$F1P= 14.0000005364418
##$F2P= -0.99999901652339
##$FCOR= 0.5
##$FTSIZE= 32768
##$FT_mod= 6
##$GAMMA= 0
##$GB= 0
##$INTBC= 1
##$INTSCL= 1
##$ISEN= 128
##$LB= 0.3
##$LEV0= 0
##$LPBIN= 0
##$MAXI= 10000
##$MC2= 0
##$MEAN= 0
##$ME_mod= 0
##$MI= 0
##$NCOEF= 0
##$NC_proc= -2
##$NLEV= 6
##$NOISF1= 0
##$NOISF2= 0
##$NSP= 0
##$NTH_PI= 0
##$NZP= 0
##$OFFSET= 16.522
##$PC= 1
##$PHC0= -40.9448
##$PHC1= 9.674124
##$PH_mod= 1
##$PKNL= yes
##$PPARMOD= 0
##$PSCAL= 4
##$PSIGN= 0
##$REVERSE= no
##$SF= 250.13
##$SI= 32768
##$SIGF1= 0
##$SIGF2= 0
##$SINO= 400
##$SIOLD= 32768
##$SREGLST= <1H.CDCl3>
##$SSB= 0
##$STSI= 32768
##$STSR= 0
##$SW_p= 5175.98343685301
##$SYMM= 0
##$S_DEV= 0
##$TDeff= 65536
##$TDoff= 0
##$TI= <Analysis number 999999
Compound Code 99
Book Reference 9
Project Code 9>
##$TILT= no
##$TM1= 0
##$TM2= 0
##$TOPLEV= 0
##$USERP1= <user>
##$USERP2= <user>
##$USERP3= <user>
##$USERP4= <user>
##$USERP5= <user>
##$WDW= 1
##$XDIM= 32768
##$YMAX_p= 459325528
##$YMIN_p= -91907
$$ End of Bruker specific parameters
$$ ---------------------------------
##NTUPLES= NMR SPECTRUM
##VAR_NAME=  FREQUENCY,     SPECTRUM/REAL,   SPECTRUM/IMAG
##SYMBOL=    X,             R,               I
##VAR_TYPE=  INDEPENDENT,   DEPENDENT,       DEPENDENT
##VAR_FORM=  AFFN,          ASDF,            ASDF
##VAR_DIM=   32768,         32768,           32768
##UNITS=     HZ,            ARBITRARY UNITS, ARBITRARY UNITS
##FACTOR=    0.157963299565203, 1,           1
##FIRST=     4132.6476996994, 0,             0
##LAST=      -1043.33573715361, 0,           0
##MIN=       -1043.33573715361, -91907,      0
##MAX=       4132.6476996994, 459325528,     0
$$ Real data points
##PAGE= N=1
##DATA TABLE= (X++(R..R)), XYDATA
$$ [...]
23768 -12067 -6278 9721 13091 -513 -7151 2328 20556 11038 -2107 963 3644 -22457 -28517
23755 -28517 -21659 -4925 22764 11089 16082 27388 26256 24739 10153 -8476 -20526 -80
23743 -80 39932 34668 40769 37961 8582 14445 7162 4091 2367 -1070 -17780 -32975 -21044 1329
23729 1329 11692 -7959 -6652 3108 -3634 4015 5509 1413 -16523 -15339 4573 10467 1835 -20893
23715 -20893 -47679 -12966 1592 -13774 4509 14250 -7702 -20190 -12010 -2731 15186 21887
23703 21887 -4763 954 19541 38279 26510 14291 -224 4189 -8713 -25991 -20608 -10730
23691 -10730 24782 14257 9643 5582 -11594 -5394 2286 8599 16566 2055 -25085 -31159 -23977
23678 -23977 -23523 -8117 16776 24679 19072 20360 12081 4479 7374 -694 2558 -8048 1 -6654
23664 -6654 -12573 1189 12423 9160 -2311 -25212 -27148 -28417 -20364 -9394 83 8645 8356 -4797
23650 -4797 -1243 -107 -14830 -28562 -35180 -14113 3607 8078 -1486 -18017 -13012 -2929 -2612
23637 -2612 4906 9205 -60 -11205 -36329 -40648 -10563 -7622 4668 -11447 -27560 -20163 -27055
23624 -27055 -14740 4859 -1130 3323 -2552 -14915 -17904 8317 491 4206 2891 -9819 1667
23611 1667 18643 30424 34946 25237 19656 1915 -19977 -27255 -11589 34373 45223 18426 -3778
23598 -3778 -16590 -18144 -10162 -17224 3464 21542 19511 -13875 -23403 -29393 -20825 -12106 5741
23585 5741 16767 19424 6010 -20618 -28309 -28989 -21363 -14188 -1414 -23706 -10915 -919 15799
23572 15799 34654 17187 -4535 3958 -10306 -16383 -728 10840 -8632 -8449 -23730 -22128 -25832
23559 -25832 -27833 -24937 -15454 10013 21215 11776 4641 14305 13857 8398 -14740 -7040 -10561 -31213
23545 -31213 -8976 -6849 -12990 11777 16896 33007 26434 13768 -3534 3609 7790 -7986 16788
23532 16788 34897 23148 -9913 -40217 -54077 -52116 -43162 -19940 -4094 16061 18993 10648
23520 10648 3730 15355 24655 -2311 -2486 11275 16548 15165 26754 24922 7902 -10068 -13914
23507 -13914 -38279 -47399 -30971 -28644 -3948 16389 20893 19331 29782 32031 14005 -2815 26010
23494 26010 29969 14331 5727 10096 -1653 -2742 -10594 -41808 -45643 -26499 -10851 39849 53044
23481 53044 25340 4669 23199 25777 19029 8199 11934 8203 3561 3149 1204 4690 -5567
23468 -5567 -9089 -5083 -3204 14303 21882 447 -4553 4453 20537 20820 8397 -13768 -4372 -13406
23454 -13406 -35951 -37388 -49132 -52504 -32894 -9237 1609 9215 23845 23290 1801 -3747 1753
23441 1753 1010 -6511 5401 9476 16295 10553 -209 -464 -4728 -13454 -20074 -25631 -25663 -14065 -3974
23426 -3974 10 -11122 -13530 -14732 -21494 -39856 -39437 -11589 803 8057 -10137 -14360 -4510 13149
23412 13149 11567 23669 28468 21159 11914 -13291 -28192 -14238 6614 12351 23852 19661 15901
23399 15901 1598 -4414 16559 25788 17430 2605 -458 14804 21789 21741 18531 10478 -508 -9045
23385 -9045 3455 1726 2344 -4079 -5132 -5533 10022 -4317 -7805 -7048 -22739 -28187 -4146 -2924
23371 -2924 13374 13335 16164 32062 45045 30477 27581 22068 18660 22765 30391 26007 10147 5050
23357 5050 -3270 10424 4447 -8563 -7582 -15108 -9814 -17909 -27079 -16707 -5725 -4707 -21291 -25462
23343 -25462 -37494 -28271 -9615 -16362 -22933 -5876 8363 -4896 -18042 -22524 -15809 -6780 -6817
23330 -6817 -12013 -36438 -38409 -39450 -38658 -48007 -45595 -9709 3274 -28699 -20018 -4357 -8478 -18219
23316 -18219 -19112 -29333 -19574 -15722 6645 8026 -3591 -12720 -1232 -7197 14409 18101 -18499
23303 -18499 -39366 -31719 -22828 -27253 -25149 -14673 -8848 -6075 -5714 -11236 -20013 -21999 -26183 14247
23289 14247 16317 -15880 -9863 -1016 3669 10762 32075 37914 6236 -10408 -24910 -34295 -39790
23276 -39790 -31459 -27600 -17761 3717 7540 -185 -1724 -8080 -9048 -4772 -310 9522 -1469 6279
23262 6279 9068 -2706 -7208 -21512 -24376 -17065 -11726 4378 13202 13526 16560 9753 12341 6451
23248 6451 -1779 -6887 464 -8873 -22193 -3558 15510 21193 -5340 -24629 -24717 -13750 -18783 -17595
23234 -17595 -13390 12532 18445 20395 1383 -10467 -3392 19166 29091 23101 15465 14411 -4559
23221 -4559 -7546 1838 12452 29724 9807 13370 -1783 -21250 -32060 -31380 -27842 -21801 -13561
23208 -13561 -5928 -1746 27679 33323 6939 13544 22677 -1318 14715 11423 19803 31539 29722
23195 29722 26153 11973 3472 7579 -6498 -8998 -3936 -3193 -18828 -16681 -17107 10827 26398 5066
23181 5066 -7463 -7269 -8724 -23314 -24261 -22479 -4708 7110 -1033 2478 5871 26781 32493 13658
23167 13658 4423 651 13687 15667 2724 -13029 -7680 -7475 -7724 5189 10657 6025 -12082 -21839
23153 -21839 -15895 -4597 4614 8124 18024 -6671 -16046 -6983 -12515 -869 16462 23102 20171
23140 20171 513 -14294 -2904 15624 23881 32539 21061 -36 -10040 11390 9585 -5813
23128 -5813 -915 7029 14427 29827 10276 -7039 -16632 -20914 -32777 -42425 -25598 -14987 2108
23115 2108 -13912 -15088 3263 22403 36197 30400 31091 18537 3100 -2900 11044 4187 -12612
23102 -12612 -6692 631 8648 17944 21752 41622 43588 5162 -20906 -13266 -9984 4530 25969
23089 25969 21494 7067 -1125 2604 -6870 -7641 -1502 -21461 -23463 -25269 -17019 -10711 1560 1443
23075 1443 -12434 -5656 4745 -14856 -18731 -13549 1834 20097 24638 29755 18760 54 -13251
23062 -13251 12436 11547 -2970 -14473 -5812 1386 5551 9580 6279 31290 38385 19042 15616
23049 15616 19335 11862 7259 8390 -9822 11154 18236 4727 -6897 -18494 -27256 -21783 -20834
23036 -20834 -19469 -37604 -32364 -33051 -28964 -17125 -14741 -5745 -2063 -13154 -17579 -590 15397
23023 15397 -7824 -21770 -23200 -12281 13805 26076 35287 55561 43826 23423 17335 10563
23011 10563 22263 804 -18639 -24760 -9034 -3608 -25098 -21069 2128 -271 -3094 18892 17783
22998 17783 -988 -586 31886 40684 25367 11679 13350 -2944 2353 6030 19613 34336 18544
22985 18544 14030 15596 8185 2527 3978 9687 27963 31932 14757 -6391 -20449 -26617 -11937
22972 -11937 -6828 -21273 -9201 5046 -4723 -23984 -22578 -18526 -21326 18823 18954 7465 5211
22959 5211 13594 19652 7683 9994 16642 4649 19810 25373 19313 17514 25596 35175 32291 20285
22945 20285 5261 13340 18955 20330 6776 -1939 -17268 -8933 11007 6097 18947 5731 5148
22932 5148 -1169 -5252 -6710 -9214 21930 18669 31130 37442 10715 15690 30299 34193 8311
22919 8311 -7562 -139 15331 18169 20149 10586 12471 -3858 -3007 12727 5748 -21250 -15785 -19145
22905 -19145 -26387 -7390 -3584 5433 13183 13310 -3801 -13310 -18050 -18724 -8656 -7346 -735 4799
22891 4799 4261 -3519 1045 12512 10116 -8788 -6138 2105 13876 2503 2465 4509 14937 30462
22877 30462 24714 2620 -1386 1524 -5141 -5257 -11121 -18050 -3864 3639 -14126 -16545 -22870 -27609
22863 -27609 -19749 -4182 14211 17529 21314 21638 15696 6347 9026 26867 12801 -6973 -23092
22850 -23092 -27656 -19600 -28460 -37689 -29077 -15785 -10257 -17163 -10295 9094 23386 20754 11905 -4282
22836 -4282 -10229 -17318 -31461 -43990 -51327 -37565 -36029 -28531 -23532 -14635 -32114 -30904 -5780
22823 -5780 8376 5271 5950 8094 13908 30045 20225 16618 29019 34518 24989 5367 2479 11453
22809 11453 16774 10142 8901 13033 6166 10756 13234 24904 3261 -16559 -9164 -17563 -33105
22796 -33105 -23268 -12710 -22827 -9953 -7710 -9290 9951 13034 18265 17101 5653 22168 16797
22783 16797 3269 281 -3947 10499 -1229 -11154 -15925 -8560 20584 37531 18359 14627 27717
22770 27717 24130 13972 13854 21228 44373 20932 -14360 -24131 -29629 -47941 -65001 -50978 -35671
22757 -35671 -26753 -27097 -5169 22285 43511 36253 42632 48018 31830 40023 11410 -11977 5643
22744 5643 22352 31600 42172 16197 -1971 6832 11768 25384 40069 43870 17529 -24400 -19807
22731 -19807 -182 -19690 -16555 -1992 1182 4702 -2102 5885 12813 5882 -4124 -14763 -8625
22718 -8625 -653 5433 653 -6008 -10143 18682 38734 34106 13869 4153 8977 14255 28972 37722
22704 37722 30901 42908 34520 19895 15426 17320 25292 17010 2806 -8643 -16077 -11783 -10032
22691 -10032 -17167 -728 15409 -6203 2276 13944 4147 2553 5452 -9441 -25683 -9320 -11663
22678 -11663 -22073 -36236 -47931 -38277 -17089 -26286 -54296 -37281 -2578 642 15923 34652
22666 34652 40467 30345 13336 -2219 -17434 -24554 -40600 -41760 -14788 -8794 -7486 -6522 1181
22653 1181 11691 22728 7043 -816 -24186 -30931 -29496 -35008 -35709 -24764 5451 8404 -10659
22640 -10659 -19705 -26446 -38443 -22227 -1343 -2844 -13705 -21878 -21671 -11930 8620 36276 42416
22627 42416 36134 16883 3064 -1319 -18315 -17758 17038 32605 30900 13924 -2387 -4685 -4932
22614 -4932 12735 32981 7763 -25903 -41910 -48755 -72280 -53886 -11271 13068 -5057 -25724
22602 -25724 -21690 -16877 -26582 -8863 -16152 -39841 -29548 -15781 -3349 17169 22939 14784 7257
22589 7257 -12480 -10383 -352 8332 3550 -27212 -38319 -11888 -14263 -15207 -11471 -6320 -10731 -5164
22575 -5164 7199 -1013 7966 5590 -4095 19347 10532 -3971 -6941 10460 21363 30854 44977
22562 44977 50007 20114 -6027 -17871 -8899 -7768 -7209 1808 10930 -251 5240 -2016 -3038 -11096
22548 -11096 -15368 -13207 -34246 -29822 -27896 -21748 -16199 -18863 -32474 -14007 7405 28361 39374
22535 39374 30642 22160 31096 21449 2174 2696 8832 -372 -12953 -5479 -34061 -34388 -21731 9731
22521 9731 24663 28138 21303 4844 4800 10522 11341 -6027 -15766 -12016 -9578 6713 -1740 -13012
22507 -13012 -4486 19997 41133 25084 7337 30224 24283 24286 23898 31850 34278 26942 43 -30436
22493 -30436 -33478 -35978 -26493 -25583 -39430 -19563 -13618 -19964 -19699 -30987 -30031 -9429 -12015 5008
22479 5008 791 -5463 -29291 -27327 -25615 -15674 -19113 -11330 -17213 -25454 -30023 -43101 -28802 -5504
22465 -5504 2510 -260 -5070 1079 -7406 -9904 3341 -3929 2260 -3349 4264 15373 30180 20003
22451 20003 20544 14892 14556 22435 26040 21272 25183 20431 4781 -5536 -15800 13974 7306 -4023
22437 -4023 -11633 -9239 -12353 -17185 -19914 -23735 -10229 -3133 22715 37304 29509 35493 18504 -4748
22423 -4748 -12509 5237 5134 -18009 -36585 -36052 -25213 -26681 -19563 -14652 -21608 -12345 -3810 -12685
22409 -12685 -23334 -12945 2051 -13857 -21477 -10899 -4810 -14165 -27029 -27321 -10548 9401 6691
22396 6691 7099 20275 5078 -15278 -14873 -10921 15592 17431 -15046 -42772 -44326 -45477 -40470 -30335
22382 -30335 -21892 -28429 -39598 -24207 -2696 14904 -4963 12372 4238 -4063 -12059 -8540 6448
22369 6448 24399 35808 33366 14266 -6901 -13922 -7354 -13861 -21242 -26254 -7508 390 3331
22356 3331 -4719 -6339 -4969 8054 16574 18409 13943 -2207 -10881 -29910 -5825 -10677 -26941
22343 -26941 -20463 -13179 9513 -2113 -16915 -25876 -23613 -23890 -27391 -46319 -34260 -38326 -35583
22330 -35583 -21130 -18504 4920 22153 20430 24975 27627 26416 22058 21604 14937 11924 990 2361
22316 2361 3240 613 -6810 -20443 -19042 -25608 -37875 -45520 -43103 -24733 -7519 -6543 -27734 -39926
22302 -39926 -22815 -7244 -3332 -19944 -11042 -7583 -16318 7728 6081 -14688 -10296 19 3381
22289 3381 5957 -288 -7897 -4292 -8247 -15847 -10554 -4948 10353 6868 -4477 22544 37059 26399
22275 26399 10992 3658 13977 928 -11357 -8815 -4958 -5215 -3561 -4708 -6889 -3999 -94 2638
22261 2638 5146 420 7971 -9679 -11647 -6843 -24286 -26063 -35838 -32531 -56200 -30102 -7433
22248 -7433 9155 25597 27187 5583 -227 -1629 -11841 -27104 -33691 -24833 -11096 -22544 -48529
22235 -48529 -42774 -22951 -18014 -18930 -17859 2657 -1750 6524 14104 -3414 -17252 -22643 -14608 3786
22221 3786 12544 11339 17912 -25 -28699 -34737 -23403 -5200 -408 -7896 7879 -738 -17575
22208 -17575 -22693 -26761 -23728 -46424 -45247 -7882 15865 9839 -5839 -20316 -9045 15582 4278
22195 4278 455 16620 11489 1924 272 5662 9369 12198 20299 670 -8385 8626 17997 12104
22181 12104 -13345 -12615 -8346 7763 18081 22055 -5961 -16797 -20126 -10998 -15758 -4668 -360
22168 -360 1424 16453 13335 12599 -2731 -24021 -40855 -40435 -25447 -17777 -9125 -15819 -4728 18550
22154 18550 23859 10975 2805 -17999 -32276 -48573 -12977 29078 29295 8540 -8941 -19689
22142 -19689 -19161 4677 26218 21321 13411 14294 12735 -376 -11639 -14448 2565 20418 7924
22129 7924 13558 6445 -4975 -40182 -41741 -13864 1515 5133 983 -5891 -9975 -15974 -30353
22116 -30353 -26873 -22412 -19395 -15427 -26101 -7908 2679 10401 8702 4178 4817 22485 14619 1219
22102 1219 -2406 1978 18771 14552 -16089 -19284 -18652 -3565 12726 11777 -11550 -19829 -13153 -2404
22088 -2404 323 6956 15276 25161 20803 24956 53751 48535 54862 39977 28492 1666 -22970
22075 -22970 -39573 -9930 11999 8658 2047 1571 5855 -309 15030 18274 4440 -15243 -15303 -10982
22061 -10982 21748 28393 18315 11259 23637 18140 25927 10617 -2653 -2926 -15687 -19812 2755
22048 2755 32725 27331 30512 42103 30939 6152 -14196 4315 24780 28626 23306 7058 -4275
22035 -4275 -3039 4879 6560 18793 21213 11935 13933 19627 8757 -6132 -10945 -15416 6146 16664
22021 16664 23205 22434 1328 -10844 -8767 8003 17213 15727 18847 36874 49065 53999 39133
22008 39133 25830 15584 -6681 -31685 -16227 396 7863 -19408 -43990 -28337 -9747 -18
21996 -18 -686 5497 18114 6566 2064 -12738 -5814 -5004 -13437 -6393 -17508 -14907 13655 21351
21982 21351 11579 9813 18929 4945 -19582 -19936 -33660 -14970 15082 29216 15585 19698 25631
21969 25631 11693 -951 -20036 -13104 7881 -13271 -8165 21589 32053 40295 36728 24857
21957 24857 20039 23214 9088 4877 -5921 -25293 -30518 -6156 10323 1191 -23308 -27934 -43322
21944 -43322 -16513 3616 -4387 -12927 -11030 -15089 -15674 -2851 -7204 1035 2 2313 -9852 -1389
21930 -1389 20320 13804 -10984 -5532 -13143 -21762 -23967 -10042 -20039 -9514 -63 10576 9156
21917 9156 -1759 -3771 -11249 1355 5691 -1595 7802 -3052 -15230 -11505 2493 17093 -3854
21904 -3854 -20025 -11013 7388 -5312 4279 20970 7356 -5609 -6756 -19904 -21316 -36858 -29557
21891 -29557 -28561 -37072 -30037 -5756 168 -11259 -26214 -21439 -24166 4911 18945 14600 9795
21878 9795 -4572 -2528 11592 19360 3944 -2519 14857 -7720 -25205 -28462 -11679 -8575 -3903
21865 -3903 -6010 -1133 -7847 918 -2429 9395 8520 14096 15043 19492 7177 -3647 -7846 -14525
21851 -14525 -9274 6816 -4888 -21788 -2577 -3987 -4913 2742 11933 -13306 -23878 -19291 -11075
21838 -11075 1321 6531 11519 17646 20228 15150 19615 6434 -9453 -3799 2675 30643 32519
21825 32519 30274 24269 31246 4896 -15576 5041 16312 20994 7919 -5902 1954 -8790 -25381
21812 -25381 -22083 -20365 -16858 -2707 7234 27763 22326 14071 6647 7517 -20150 -20495 -14048 -9083
21798 -9083 -15976 -24649 -26355 -10886 5636 18616 19594 2851 -24088 -34499 -28771 5787 5249
21785 5249 -11698 -1525 20342 25467 22019 10422 7909 7807 -12768 -17542 -23528 -10923 -9502
21772 -9502 -7222 -8016 -11275 -16116 -41999 -37361 -5434 30027 35201 39288 19779 6058 -1115 9270
21758 9270 2094 -16246 -14530 -15685 -9916 14078 10806 2169 2332 -29276 -29328 -32185 -39474 -16013
21744 -16013 393 737 -20707 -44471 -39328 -26932 -17508 -27786 -35182 -22896 -50369 -46894 -44733
21731 -44733 -47924 -49115 -39122 -31584 -11335 -1267 522 4637 -5827 -32389 -40183 -26199 -7966
21718 -7966 2168 -13405 -8357 -7157 2952 15688 -8881 -26005 -8942 -2928 -17287 -36956
21706 -36956 -34991 -21286 -38359 -24334 -11335 -9411 5921 8933 -13358 -26614 -45967 -35288
21694 -35288 -28958 -24935 -1876 6150 -12489 -12276 -11149 -12906 -2937 -16061 -39357 -27125 4414
21681 4414 22985 24307 21271 8288 9286 3243 807 11649 -5177 -12417 18848 43843 17360
21668 17360 13017 18130 6222 12358 5186 32631 37011 31215 16721 23047 -3185 5559 6685
21655 6685 -8778 -11343 -2873 -1420 10150 23434 24345 14888 3263 8939 -11636 -19468 -9863 -6908
21641 -6908 -7 -1416 -145 20080 28641 38628 22130 1503 7546 -15032 -18167 -21464 -1068
21628 -1068 9019 9877 15052 12592 -995 -9717 632 2295 -15315 1322 4073 -25223 -31291
21615 -31291 -34594 -18495 -10187 -29300 -43903 -31121 -34537 -26569 -25717 -23631 -8243 -18744 -9399
21602 -9399 8626 -4945 -18030 -25089 -26397 -3146 -2619 -264 3636 3830 7586 13856 19082 7172
21588 7172 -16924 -28624 -18527 -7257 -22016 -14979 -2162 1317 9801 10882 519 1284 -13790
21575 -13790 -7362 -8738 -3278 -8873 -20513 -28485 -12560 -5494 -2889 11543 30514 20731 19934 12164
21561 12164 -6872 -18945 -3674 6249 25886 48551 54550 33158 38946 23718 2206 -4587
21549 -4587 -11131 -3796 -3218 14683 11711 12286 -9133 -6930 25620 20299 7952 672 3898 -1685
21535 -1685 -12218 -22958 -24524 -8525 -19274 -19719 -8697 -12405 -21552 -11037 -5472 -18753 -29767
21522 -29767 -43922 -50784 -34975 -25996 -3570 9331 8678 3961 12263 233 3389 7148 -4036
21509 -4036 10616 32011 29679 36824 32969 35794 31923 7446 -4196 -21463 -36847 -37177 -33999
21496 -33999 -35318 -23330 3843 -11563 -22580 -1498 6192 1469 -10890 -4223 3246 6120 15451
21483 15451 3463 -6500 7873 15569 -1008 -6202 13694 18779 -4638 -4481 19985 10531 22743
21470 22743 21673 -3267 -14014 -3438 -15961 -51186 -62534 -33374 -15813 -16642 -9335 -7176 -16406
21457 -16406 -15673 3912 10708 13289 -4951 -13085 -1855 -1660 5199 21645 35976 35704 25938 6198
21443 6198 4299 11368 15299 16401 8909 1141 1069 -677 2222 14884 29715 16146 6955 1186
21429 1186 -8023 -9383 -135 747 -136 7067 13752 18109 20158 23256 23484 -398 -18716 -32828 -44161
21414 -44161 -45075 -23772 6604 9009 -3584 -5181 11290 18773 2316 -6537 -19879 -37462 -55725
21401 -55725 -53824 -33978 -21767 -14421 14316 13986 -6793 -14415 -7467 -3975 -18961 -25492 -8277
21388 -8277 1874 -1557 -7034 -19123 -17639 102 6669 13434 18918 22793 38590 36604 31824 21236
21374 21236 12221 2575 -35322 -29407 -17386 -9202 -22719 -30712 -21892 -6848 -5899 -11223 -3372 -21832
21360 -21832 -17112 -14000 4597 -6048 -10347 -156 -19085 -35355 -25249 -21435 -3159 10321
21348 10321 10303 9619 -2803 -14178 -7425 -11287 -34099 -27033 -9949 -1174 6707 5580 -11598 -19335
21334 -19335 -24466 -24788 -23788 -13775 10429 11519 5899 -1272 -26993 -41739 -37769 -7868 -11599
21321 -11599 -27222 -31142 -8904 5091 11435 3430 -3510 -1297 -1702 14790 21607 29130 25822 22318
21307 22318 7629 -12453 -31590 -32391 -15026 -2397 -262 13243 14063 9954 -28108 -28434 -27208
21294 -27208 -32267 -19218 8161 31745 45566 50567 23591 10474 4319 -12054 3097 8830
21282 8830 18102 10143 10828 8739 -2481 -11534 -7522 -4852 8802 5220 -12802 -4872 1766 -14137
21268 -14137 -18867 -38295 -28998 -8286 2746 1769 -4435 -948 2441 5699 -1300 -18687 -19191 -19284
21254 -19284 -37067 -61997 -59065 -28508 -15612 -1905 -88 -162 18394 8639 8819 18010 18752 -2346
21240 -2346 -20185 -37917 -43842 -45610 -47195 -39679 -19244 -32669 -48086 -70688 -53364 -23377 -4204
21227 -4204 15288 14537 4009 4266 12041 -15036 -19330 -1814 -268 7845 127 -13903 -14147 -4602
21213 -4602 -5947 -14912 11902 34070 21804 -8464 -9052 -19938 -33300 -51378 -49391 -33936 -24851
21200 -24851 -14257 -4493 -756 -11032 -23829 -29322 -983 -6008 -4255 -7848 -6052 -10735 -12921
21187 -12921 -8695 -27681 -12193 -7587 -3743 -5630 -9830 -2148 4240 4516 -3164 -16491 -11749 -1404
21173 -1404 14067 25378 40765 11941 -14515 -30173 -30537 -29802 -36196 -38916 -25874 -9663 1636
21160 1636 1828 19046 51532 35686 9517 2852 16759 8625 5904 7889 876 3905 -9635
21147 -9635 4280 26760 30564 23745 32702 39869 39922 20612 -10688 -13262 -17309 -26488 -26923 -2097
21133 -2097 -4762 -17130 -27938 -13874 -163 -9924 -18891 -1767 18740 23410 12647 13745 4787
21120 4787 11668 22564 11190 -2414 -20071 -18236 -7567 15957 24110 38045 55730 43351
21108 43351 98 12119 10176 4856 17344 32852 22511 -9831 -5642 10474 10261 5724 -6392
21095 -6392 -26204 -4859 19364 25446 20156 91 -7893 -4945 -19225 -7375 3279 13743 9458
21082 9458 -14353 -22364 -11412 -14462 -13975 -1302 16434 34292 35265 45177 44395 38359 23729 15084
21068 15084 14084 7290 824 -8443 -3 -9241 -15633 -28554 -29731 -7642 -11256 -9735 -9918 -11046
21054 -11046 1949 18985 13970 -11786 -11573 -6702 1015 33140 23716 9948 -13561 4023 1254
21041 1254 -6039 -11221 21590 37239 27470 30437 24378 5908 13126 14914 18717 7178 13248 12356
21027 12356 5227 -3522 -6080 -3143 -14121 -17570 -14519 -1131 -17916 -26552 -13335 544 7617
21014 7617 158 -13014 -18181 -5964 8481 18572 -218 -9834 14660 17370 -4996 -7739 -3340
21001 -3340 -13110 -15221 10634 26678 26910 -7115 -42321 -42336 -33176 -15370 3876 17692 9671 7903
20987 7903 -6641 -29839 -32909 -33827 -22774 -22459 -28057 -14467 -5418 -8571 -12162 -16821 -4830 -10051
20973 -10051 -14096 -6202 -4812 13634 7000 -3079 -27980 -30056 -27876 -22929 -4394 -17912 -36371
20960 -36371 -32567 -21637 -14882 -17329 -16065 -23755 -44837 -25014 -2047 3617 14097 10945 16376
20947 16376 6124 2482 13530 18191 16048 12644 -4280 -11505 -16028 -4705 3616 -11229 -28414
20934 -28414 -14226 2424 -3974 4028 5282 18447 27395 12831 13627 12018 399 5028 25323
20921 25323 -5424 -9572 10731 15814 2821 4249 -14150 -24573 -30543 -29432 -2094 29357 24409
20908 24409 25468 21329 15030 11040 9235 -412 -3090 13956 31978 17148 1075 -21932 -34467
20895 -34467 -6246 14789 19637 36104 19826 -17910 -9683 2992 9723 13137 5575 13927 8242
20882 8242 15530 -6279 -10120 14298 24180 28406 -1172 -7918 -11711 -2914 19070 32604 30171
20869 30171 10344 14514 18889 -7994 -28018 -34976 -39691 -35754 -20034 -17344 -26108 -42015 -32708
20856 -32708 -10192 -536 -610 12244 6081 -1440 8144 2511 -2083 -26631 -18359 5229 15465 2209
20842 2209 -8449 -21622 -34426 -3825 -12839 -44318 -12335 4633 29471 30911 10876 -14813
20830 -14813 -17707 -26911 -22295 -14661 -5539 19493 17319 5615 -1186 21261 19326 -3128 -27546
20817 -27546 -45436 -20504 5020 15561 21477 10774 24900 28144 19337 -8142 -27965 -14624
20805 -14624 -15037 -16609 -11525 -8261 -27330 -44273 -31806 6772 15022 -5242 -14200 -5616 5341
20792 5341 25209 18609 -14979 -40535 -23136 2911 16828 32347 34517 2010 -19074 1796
20780 1796 -5241 -26030 -48778 -29127 -21163 -5634 14124 1666 9313 4195 -4501 -10384 -598
20767 -598 1229 6163 -12559 -25620 -34859 -25821 -20629 -9408 -7263 15073 17358 -10079 5169
20754 5169 7577 6100 14527 1131 -35063 -32170 -12959 -19118 -17629 -15474 -15013 -6395 17532 7262
20740 7262 -19333 -18211 -14010 -15380 -343 2656 23483 27825 29220 28157 9770 28091 29065 20376
20726 20376 1286 -24614 -24780 125 1840 21793 15861 566 -6128 -4517 -3746 1615 10909 -3295
20712 -3295 11423 20484 10700 1616 11618 12597 17338 8809 15640 30253 43283 43714 19061 -12162
20698 -12162 -13450 -830 -1240 -21892 -6649 -4169 -5304 17907 -2128 -14040 -6469 3552 10848
20685 10848 -1130 -24056 -26505 -40081 -34688 -39194 -39464 -47578 -28030 -5401 -4638 3678 5536 5460
20671 5460 -7360 -244 12751 28164 28852 9432 -17380 -7837 -8599 -600 -3835 -7077 -12118 -9258
20657 -9258 15305 12781 -2092 -21382 -18730 -3268 -13056 -12928 3846 -18088 -10673 -12028 -19216
20644 -19216 -6172 13089 27655 26604 7945 -3708 2727 25520 15661 5573 9930 6467 7534
20631 7534 6288 14724 20246 12735 -1078 3474 776 -11820 11653 16861 4136 6701 1036 -23661
20617 -23661 -28580 -19198 -29477 -54910 -29297 -21006 -39048 -55945 -36474 -25713 -26169 -44681 -53018
20604 -53018 -41859 -39745 -19283 -8429 -5599 17264 8685 -12474 -14256 -4881 1246 4892 -3958
20591 -3958 2963 -5905 -14299 -13863 -9720 2324 9769 4588 15119 35312 20942 9037 17888 3437
20577 3437 -1648 -14021 -15312 3900 35242 17004 9053 -635 -108 3228 1206 21112 32326
20564 32326 23796 19339 19373 30486 42139 36821 36420 25765 15066 13320 15033 25605 27964 17755
20550 17755 24817 44490 42230 38317 26497 29934 18198 -9401 -20122 -3123 20710 34632
20538 34632 34255 21551 -3313 -4973 -1728 15947 22377 18978 23042 29870 35719 45717 37942 10695
20524 10695 -3891 2480 -11290 12676 22059 12766 33997 42039 16675 1802 -15427 -35208
20512 -35208 -13889 8195 14917 22017 8011 1429 10046 32049 8334 -1557 7157 -7688 -28005
20499 -28005 -39147 -30726 -25026 -21112 4929 9076 1551 -9726 14250 16339 -3614 -21519 -28214
20486 -28214 -22988 -9480 -6150 -13079 -13205 -9155 -325 -8436 -10218 -9098 19093 23133 -9198 -32002
20472 -32002 -9366 -3414 -11030 -43815 -35471 -28944 -14740 20827 36618 28126 12394 241 14757
20459 14757 37404 35699 41592 32825 11161 14104 14929 25222 19980 29641 42300 19866 8354
20446 8354 8586 13034 799 -7191 12650 26235 24208 3882 -6222 -12189 515 12488 20833
20433 20833 -2066 -30939 -33415 -17485 -26103 -43589 -44965 -51689 -41589 -17465 10957 4831 9143
20420 9143 15077 -421 -3234 -1718 5646 16764 37263 22197 7071 23487 21751 -2169 -5766
20407 -5766 22794 12168 6189 17643 26501 42023 26852 12021 16118 26193 26820 11913 6534
20394 6534 -3631 15443 27444 15172 -15906 -1058 27871 27807 13238 23733 17565 9356 25848
20381 25848 54525 59459 50605 36638 29904 22541 19950 40647 30166 30078 36732 23078 15027 7428
20367 7428 -4871 1204 4552 19268 30925 19890 2830 6408 -2149 -3632 -20185 -20066 -36664
20354 -36664 -40365 -22473 -7112 -12953 -20775 -12221 -1434 7293 -12827 -13327 -384 7194 13145
20341 13145 -4711 -13608 23084 20920 -12937 -15333 1012 5413 22219 22113 16213 2454 -7032
20328 -7032 -6287 -3420 -18588 -794 3570 -1067 14667 7683 -28017 -33482 -3218 3492 -18858
20315 -18858 -35999 -41402 -26810 -30073 -21659 -334 15624 2801 -7770 14681 27543 6695
20303 6695 -1003 11795 19497 6044 -15375 -22622 -12180 -11724 -8550 -6199 -21871 -16511 19203
20290 19203 1608 -15351 -5852 562 2860 6378 17585 11404 13992 7297 16386 12016 9490 -2896
20276 -2896 1265 2916 7580 26587 28469 58305 33480 17397 9277 -10599 -16692 -15350 3431
20263 3431 4375 -14570 -2486 7664 15678 28782 46567 46665 33777 21240 31259 29537 26600
20250 26600 29915 48800 55045 21584 16601 34098 30960 9326 3784 9371 10937 23861 24354
20237 24354 11704 4416 32548 33903 17832 11751 4701 418 -15928 3790 17928 36182 29254
20224 29254 6140 10782 21665 -581 -7187 -1497 7251 -3771 -2476 10296 9648 1816 -171
20211 -171 17280 22053 20557 18844 9095 -3547 -10148 -8001 6337 39118 36718 14145 3866
20198 3866 -10717 -3594 17081 23963 33226 12703 10543 8049 -15607 -42658 -44245 -28896 -22237
20185 -22237 -5700 1905 -2590 -7787 3806 13640 -6407 -18630 -18934 -2750 24620 36991 17004
20172 17004 -11551 -5620 -5718 -15666 4782 6061 -2896 -7061 16355 24096 7668 17565 2170 -9738
20158 -9738 -3753 -3354 -6122 16524 32215 22498 10930 9148 19594 15806 -23526 -33377 -25904 -15007
20144 -15007 -7598 6607 9887 8177 17422 18666 -15963 -38055 -36190 -12146 2691 12560 9902
20131 9902 -14065 -47754 -31128 -15901 -9311 7366 39056 19039 11914 -16660 -14265 -7779 -13952
20118 -13952 -12702 -2900 -12249 -12262 -25119 -15132 -21773 -14069 -4604 -9179 11236 17568 13249 6406
20104 6406 19657 20846 5540 -9652 -14254 -2273 -9435 -9087 766 30777 30259 23572 29559 29685
20090 29685 28342 15245 -2691 -4356 7749 17734 36614 19840 992 12050 -1047 11455
20078 11455 34472 36565 49852 54006 41428 44955 47209 53973 39943 24025 4558 -533 -10848
20065 -10848 1788 26176 25332 15138 13426 29151 41499 35174 31174 24151 30578 33989 37963
20052 37963 19739 18255 26553 40590 41966 32035 26428 12094 11945 13732 -2938 -18676 -19326 -11149
20038 -11149 1358 -911 -8395 -15724 -9954 -1135 7065 19846 7738 -16090 -13914 -9270 6328
20025 6328 10625 -8636 -13195 9461 4697 11612 29044 15565 -1795 -12985 -18684 -28588 -33352
20012 -33352 -24188 -6242 5367 13058 -4865 -22517 -24326 -6266 -1108 -7108 -2566 -9414 -9427 -2998
19998 -2998 8052 21903 21210 16703 8675 7663 1152 18995 27893 24184 20353 21778 10793 1425
19984 1425 -6812 -3704 5215 -2219 -5379 4676 14533 13142 -18196 -49926 -26807 -5095 2694
19971 2694 -4827 -13541 7888 22639 19709 17263 -2624 -14328 -11010 -23780 -23261 -45442 -58811
19958 -58811 -57249 -48377 -39078 -16195 7282 10392 33575 50869 47488 55493 49593 28010 40333
19945 40333 54986 49967 25673 18609 11844 11098 10169 3928 373 5608 9937 3110 -1050 1158
19931 1158 36435 27765 5703 15101 1418 13121 26487 27646 20344 33624 28839 15244 16453
19918 16453 6197 1424 213 12682 23566 28575 18999 33477 32180 9715 12292 13699 -5559
19905 -5559 -7891 854 -2662 684 30695 35339 25443 15054 19927 15395 14654 15689 27496 26757
19891 26757 2173 -138 18006 7838 -13192 -13894 -4497 6705 35905 43682 22713 4121 19332
19878 19332 12818 8633 30126 29818 10817 1933 8412 35493 38806 36028 46488 17606 -1294
19865 -1294 11394 27715 15233 -1575 850 -6881 -16404 -21045 -9983 27720 46749 32320 3798
19852 3798 6045 5544 13126 -3727 -14794 -17656 2731 21353 5420 4559 5048 -13241 -30394 -15441
19838 -15441 -4122 25333 15873 2104 -2121 -11230 -10236 -4425 1513 -18387 -21667 -15788 -12637 -14945
19824 -14945 -25436 -13290 -7449 24857 35727 50746 26457 17429 47491 44907 14210 16696
19812 16696 -13982 -24073 -12898 -2511 -8910 -16269 -16703 -15114 -6043 9309 -3105 -3297 -19031
19799 -19031 -4699 -13872 -17528 -22631 -20557 -29536 -22484 -9683 -4496 -14894 -11169 -9168 -13275 -32176
19785 -32176 -42998 -34643 -42874 -32907 -13790 -3394 -4829 -19493 -16256 2428 5106 19984 28639
19772 28639 17895 -8327 -13762 -13907 -4643 13149 36778 48643 30428 16681 19935 40133 43646
19759 43646 47666 38051 21361 8831 -11494 5155 14406 14058 9380 7090 27227 21182 -7855
19746 -7855 -761 17057 27855 18009 20038 44365 42273 25872 4246 11267 3457 -7889 -22133
19733 -22133 -4098 3632 17068 29627 24995 5924 5128 7120 24564 26588 37477 19343 7855
19720 7855 14104 19257 10370 -358 -4591 11527 20268 53872 44910 49147 29060 5075 -4215
19707 -4215 -5569 -17247 -15035 -23278 -15873 -14841 -3559 -6132 -23552 -21112 -12362 -589 -8759 880
19693 880 22242 27549 34899 12128 2727 27066 26379 21525 52826 35829 10543 8782 15398 43986
19679 43986 32318 -5147 -22005 -27723 -25882 -16159 -14580 3533 14752 23476 31604 50409 46416
19666 46416 28508 40021 35683 22734 21533 23887 27803 32343 34877 27211 10726 1513 11354
19653 11354 5689 -5373 333 15679 20913 20453 22682 21218 24825 19755 4996 2762 20856 25498
19639 25498 5797 4964 5632 22010 22976 37670 33666 16483 18628 18782 21592 19237 23943 20468
19625 20468 7338 -15081 -41858 -32865 -18481 -3444 390 -8125 -12208 -12460 7267 14399 22037
19612 22037 21321 16586 24584 15676 6632 7619 17701 17682 -1629 -304 -5041 -7638 -18838 -17625 -14949
19597 -14949 -11827 9730 15229 12096 27936 30843 31541 9918 14470 28157 25656 38579 39763
19584 39763 29265 11239 -2422 309 10250 36922 55830 53044 32584 3826 -4030 12378
19572 12378 14418 -12700 -3701 18686 24158 23395 19176 4679 8132 19946 33292 28498 28926 24113
19558 24113 34736 52335 49951 51945 53542 36642 25337 23155 18156 -6109 787 299 5958
19545 5958 33992 33826 45189 48227 53782 63213 48930 37960 32897 40190 50327 94257 128945
19532 128945 170164 207100 292768 382054 451597 467694 481280 469600 380631 290621 232920
19521 232920 163846 108462 81325 80724 65706 41217 22698 13637 9484 16963 22999 26261 25680
19508 25680 11311 3927 8096 -10834 -23773 -31399 -27776 -17443 -14469 -19365 -20924 159 21738
19495 21738 41478 58636 62541 64524 62378 64094 70350 70812 76453 77196 81899 80905 74160 57767
19481 57767 36793 19274 11401 5710 6588 16171 33213 34068 27530 35388 13924 1182 10036 15093
19467 15093 32331 15530 -12038 -4687 16421 34173 31889 17121 6639 5977 -4053 -201 900
19454 900 -13679 -19916 -15631 -11610 -7470 22401 29677 31289 25692 20654 4595 -6697 1482 10444
19440 10444 7939 14063 7102 8298 21148 29613 27644 31076 37321 29425 16441 18997 21714 -8800
19426 -8800 -14188 -5967 -8729 4916 12213 35765 39397 26168 37702 42477 32121 41639 20529
19413 20529 5603 25409 12768 -4609 -18570 3099 33053 53544 44594 36059 43585 45767
19401 45767 27630 17656 -278 -1927 16037 -4822 -15628 -5914 7602 27856 46936 59529
19389 59529 69003 45182 21489 9667 -1751 -8569 28870 55312 37532 4895 5617 25084
19377 25084 29725 35919 49883 50483 46363 43238 25915 31953 17173 4121 25055 13648 -13955
19364 -13955 -24144 -20920 -29469 -27523 -24324 -18405 12703 45054 48542 41311 23668 3918 426
19351 426 -13432 -3575 19801 49607 46826 48085 33430 33416 27294 16245 39070 66396 53128
19338 53128 45173 61561 51799 33931 28976 41930 35017 8311 4535 26491 42425 48129 29367
19325 29367 18743 42826 57538 80240 109300 103263 87018 61102 42191 30724 29483 18638
19313 18638 17085 38608 34812 20945 43916 37275 9400 -15533 -1122 10680 13278 11664 20553
19300 20553 45129 38496 5377 -6898 8185 17723 12907 11788 6895 13847 22162 30793 34541
19287 34541 58126 83383 75927 60055 54651 50768 39838 39368 33587 28112 43873 51397 26850
19274 26850 19886 38188 57602 78519 79733 49940 53069 62564 67152 69688 69935 65183 60893 39422
19260 39422 31875 19166 17877 20181 20498 3801 18298 48655 41336 22546 88 13168 21107
19247 21107 32358 37597 46177 55332 56666 75887 94035 99171 100002 106832 97726 92009 60373 44397
19233 44397 49809 72619 85733 66034 44524 64079 72274 59713 42907 24304 22689 43840
19221 43840 43549 42138 34175 49714 66700 55512 27897 17997 24374 47097 48006 65582 71184
19208 71184 57790 45500 24533 15232 14272 19241 16927 31651 68604 85127 84877 72937 74501
19195 74501 76610 80557 91477 101409 93204 76977 80352 76483 71909 51190 27182 26259 26408 41014
19181 41014 52626 44331 24828 37702 59671 73134 75716 60212 60532 65439 75639 86575 83879
19168 83879 82400 91728 102033 94102 84660 84344 94700 89255 75069 89070 118972 113312 140384
19155 140384 152399 186552 219056 225018 214466 228710 239924 234267 215621 191988 168604 144480
19143 144480 119751 87650 75918 96775 94763 79332 75630 62405 55596 65442 78006 95096
19131 95096 85233 64474 73288 80500 60285 53094 64154 62571 49060 23038 33386 51085 62624
19118 62624 85737 114838 149297 163355 151301 142128 165517 181667 189204 203948 205157 207456
19106 207456 201490 181523 165737 178774 185912 166181 153504 161223 163586 144843 153786 163421 167069
19093 167069 202229 254929 283981 237453 186447 165625 155165 146393 150533 155581 149371 162794
19081 162794 157084 127599 146998 165922 153711 140309 132011 136219 149621 157077 150851 154687 157371
19068 157371 131137 116278 131260 148488 142031 131125 150839 143709 142365 144754 144171 144531 167424
19055 167424 188851 209191 195683 188275 220751 216769 196276 218217 225756 211354 222200 238722
19043 238722 281279 294126 274995 269423 280288 303331 319678 327319 360136 380043 405647 434859
19031 434859 441993 443589 429565 425346 425199 427308 432376 441774 457682 469381 476825 496372 539954
19018 539954 587418 644574 692119 706764 729345 784903 836387 905395 1006662 1099391 1207931
19007 1207931 1319232 1468826 1625330 1804323 1998794 2222222 2504711 2848225 3293905
18998 3293905 3888442 4657346 5661574 7024936 8870743 11337961 15069275 21145895
18990 21145895 30616059 42677580 54461267 70279862 86719637 84914705 82644441
18983 82644441 84895985 69749975 51647401 39631497 28030493 18450364 12501532
18976 12501532 9146241 6963102 5314365 4245813 3475264 2741152 2190012 1802118 1477652
18967 1477652 1216161 1021294 869414 755020 677191 604661 543086 497874 473601 452794
18957 452794 436564 422379 393380 331436 293944 263919 228731 221810 212229 212144 208550 204640 196279
18944 196279 184678 158303 164170 160539 137575 103210 107895 99288 93831 77401 28885 15743
18932 15743 17742 41090 77686 86723 63713 48385 54940 48722 51343 46410 41304 44797 42157
18919 42157 42157 44854 27770 21328 -7274 -24049 -14116 27503 44487 42423 54390 71217 82974
18906 82974 84079 86187 98425 95184 103230 136092 169307 203623 226440 216287 165387 110090
18894 110090 86051 75438 46747 28042 31203 29067 20019 9172 637 -29165 -24536 -21121 -9612
18881 -9612 14837 26160 2295 -3973 20833 20553 11560 -3930 -6534 -8925 -16044 -36688 -50734
18868 -50734 -60653 -74699 -70219 -46534 -17579 1859 16537 52816 88872 100353 87978 105536
18856 105536 123855 104915 100586 112155 151024 157092 179237 205572 196135 152293 117339 76117
18844 76117 41745 22553 15701 22730 16475 4131 -21069 -45428 -47824 -42574 -49763 -37650 -4938
18831 -4938 18405 38421 13299 15444 29148 15057 -1804 -20129 -46385 -45478 -50510 -45611 -30404
18818 -30404 -7586 -30233 -26913 -16488 -2648 -33498 -45974 -43350 -37952 -38193 -25349 -20510 -720
18805 -720 20209 11332 -6527 -9259 -16310 -37230 -56128 -54247 -55415 -48603 -41651 -28780 -28185 -30682
18791 -30682 -38604 -18955 19739 48131 43124 38676 32507 26427 28324 6917 -10747 1494 7285
18778 7285 -20971 -31241 -24685 -37142 -16697 -5736 -23397 -9909 15085 48486 87261 167396
18766 167396 264955 237460 127867 55587 25053 13831 21536 8950 -10661 -13190 -13817 -11365
18754 -11365 -13310 -12310 -34253 -51789 -40911 -28660 -29798 -37271 -32810 -38703 -45415 -44075 -25107
18741 -25107 -22694 -25250 -31554 -37723 -36604 -28423 -24431 -20663 -23512 -15180 22049 20277 -4277 -20097
18727 -20097 -17966 -9353 -3869 -21556 -29542 -21284 -12946 -19234 -43172 -24096 -11109 -10156 3918
18714 3918 4891 -6775 -9757 10896 19197 37584 50161 35142 40860 22695 10145 -3473 3970
18701 3970 -8439 -31040 -26479 -17094 -19893 -19681 -5871 1043 -34839 -18415 11696 5233 682
18688 682 218 -8381 -15994 -34684 -3698 4930 1289 9673 17654 24311 40372 58746 60444 48497
18674 48497 50911 38689 16525 25365 41136 70764 81922 70383 36619 24293 5790 17737
18662 17737 36170 36812 15818 6548 11096 -1510 -15982 -45334 -64245 -56235 -65303 -45324 -9425
18649 -9425 -24614 -25462 -23664 -18529 -8996 -7205 9937 14455 4355 11509 26131 21609 20644 10540
18635 10540 2792 -976 11388 13234 10774 9256 -2489 -40506 -64403 -54571 -40158 -21498 -11162
18622 -11162 -18862 -15025 -18678 -20462 -19800 -32586 -44008 -34321 -15315 -21937 -4859 5942 -6312
18609 -6312 -24137 -21416 -10162 -5432 -648 19279 20111 18768 27694 48111 32288 16596 25612
18596 25612 40623 18248 24508 58092 58028 33850 8355 12686 21663 26845 22240 -7511 -1794
18583 -1794 11744 29170 18391 -5185 -8478 9354 2542 3556 2368 6739 16856 36452 23064
18570 23064 -97 -5290 -6063 23304 34268 26786 15645 18003 -4454 2468 22722 28585 10421
18557 10421 19000 30010 29478 16859 10454 10913 -21455 -37017 -35809 -25027 -13834 -22377 -18725
18544 -18725 -13671 9154 -856 -26392 -27392 -4528 -10993 -971 -11920 -26400 -5469 21585
18532 21585 23874 19582 636 -35746 -34769 2294 28528 151 1027 9338 7066 4681 -1432 -13204
18518 -13204 -14235 20847 19196 10504 -16650 -32427 -31542 -25774 -28573 -10356 4992 25328 31670
18505 31670 22560 3019 -13736 -17994 -10299 -16678 -24248 3016 -4420 -7582 -11692 -17172 -12195 -8640
18491 -8640 -10901 -24533 -24157 -18639 988 3157 4124 1758 1959 -1394 19474 9602 -21392 -17204
18477 -17204 -6255 -16906 -24794 -1877 -17924 -13839 12538 12113 11910 22318 11548 -5497 -31040
18464 -31040 -48039 -26507 -14297 -8487 5060 -8596 -6333 13064 35698 37672 43139 72303
18452 72303 87935 124029 135484 128702 128647 115991 121823 127821 125468 134367 147942 196305 260185
18439 260185 302095 341529 406122 414273 402581 384369 285549 200502 143596 119881 89678 62436
18427 62436 50722 26801 8768 7155 -13024 -25122 -26561 13113 30589 9696 -17186 -48266
18415 -48266 -41723 -13728 1054 -1967 -8838 -4978 -10255 -12400 2060 28429 10912 -12088 -17709
18402 -17709 -13152 -9635 -10346 -7126 -15730 -21796 -21465 -6443 -2078 12606 12481 -11908 -19500 -16373
18388 -16373 -8065 -4556 14272 19493 18619 33642 5833 -27054 -33788 -50621 -41755 -16677 8168
18375 8168 18751 -8735 -25012 -22813 -7138 -3998 84 16030 4424 -12591 -13311 -2028 11083
18362 11083 33229 30761 9338 -16959 -21296 -6184 12620 4896 -5584 -1150 2594 24668 33063
18349 33063 -4379 -7382 -10893 -22248 -14584 -27377 -20704 8413 -5659 -21075 -11954 -522 -8316
18336 -8316 8547 -5509 -17044 1431 19291 8609 -2552 -8932 -9265 -7344 -11051 -28305 -16227
18323 -16227 -13500 -16973 -19717 -25675 -16956 -31012 -43684 -40270 -16126 -2689 23676 40469 21639
18310 21639 -3079 4542 9665 21184 16255 -5883 -22349 -19205 -9636 -21281 -26449 -19271 5353
18297 5353 23839 29035 12870 10252 -5639 -26267 -17005 5187 25182 35725 20475 26778 4010
18284 4010 -8858 8578 35105 30718 20087 7452 -2498 1280 18758 -2081 -11949 -14464 -23442
18271 -23442 -5495 12022 22150 37024 33672 13148 -5322 -17402 -14171 -3023 -11107 -3716
18259 -3716 184 -6659 -16015 -15453 1990 -5313 -489 -11885 -39455 -32470 -9617 -10222 -18370 -14420
18245 -14420 523 -2510 -1998 -5126 -13022 -15821 -9687 483 6885 19684 15272 20401 42115 57327
18231 57327 39923 10506 -2534 -3424 5667 15217 18032 6000 -17959 -36569 -15991 16605 -1329
18218 -1329 -19143 -20841 -7292 -6036 -11339 11998 31322 37335 25789 26450 26149 18013 10734 11499
18204 11499 13515 10974 8044 16802 14074 10013 -6142 9902 18724 21106 37949 39052 28640
18191 28640 24402 47414 42883 18116 -1902 -2241 -7985 -3359 34318 49778 48648 62874 77113
18178 77113 77467 87294 67505 53239 50888 33700 29208 25839 37116 43345 63021 72192 74303
18165 74303 76991 71058 70042 64388 57588 62249 62175 57471 61494 66822 69347 74189 85390 106156
18151 106156 126284 123022 91396 85930 105270 114027 149238 157878 159087 150735 156114 166895 166509
18138 166509 169087 181319 171739 187707 235292 280106 295391 319587 356235 387189 447626 514216
18126 514216 555312 599062 652834 725043 828935 945112 1059748 1186318 1433244 1763135
18116 1763135 2190235 2723228 3443137 4622926 6566329 9888427 16140972 27935339
18108 27935339 46657811 54163624 35518761 18778773 10533499 6503273 4365047 3109217
18100 3109217 2256053 1680570 1326430 1106134 912500 751688 599542 465009 374764 315317
18090 315317 265217 231945 221047 213294 195920 160659 127997 115086 118919 132607 144264 129814
18078 129814 124557 118032 93620 65665 45834 35609 39253 38417 28440 26965 31568 36198 16327
18065 16327 13445 44666 60540 55705 53196 31408 19740 21149 10501 -5605 -11987 -8171 -25833
18052 -25833 -27226 -17041 -13649 -24438 -36222 -49208 -32263 -18124 3741 18177 3608 4682
18040 4682 3190 -3697 -22068 -40581 -33913 -15817 4288 33004 16250 -15142 -18498 -20253 -14525
18027 -14525 -22169 -11421 1062 -7551 -19939 -20761 -27341 -12452 -17357 -21534 -25962 -21541 -12060 10932
18013 10932 14088 9376 16042 -4056 -26420 -21876 -23456 4138 -21487 -45539 -24271 -352 -10122
18000 -10122 -31173 823 10660 11916 12875 -98 -3002 -11406 -18236 -14713 -5162 6471 23154
17987 23154 13785 -5596 890 -3811 5304 14566 24244 35979 17565 815 -11675 -1741 -3749
17974 -3749 -10477 -24986 -37675 -36464 -25405 -28569 -2284 4093 -10620 -11439 -16660 -27574 -31541
17961 -31541 -32862 -32768 -36961 -30872 -24650 -15130 -37844 -20215 11595 -6018 -29974 -47546 -43101
17948 -43101 -30896 -49596 -32089 -16468 -4737 3528 9167 -8724 -15967 -34627 -44499 -50224 -37778
17935 -37778 -47569 -34105 -4816 4879 -13775 -35786 -44067 -45358 -44690 -26245 -24797 -36842 -44697
17922 -44697 -37977 -40872 -46283 -52006 -68928 -54608 -42812 -30398 -33050 -39000 -48490 -44285 -7058
17909 -7058 379 -34606 -50481 -53267 -63505 -84963 -91907 -84380 -68546 -44709 -54126 -59734 -59276
17896 -59276 -35260 -22082 -24351 -20891 -30038 -29991 371 -4737 2366 9360 -7166 -22291 -31962 -21521
17882 -21521 -28458 -43696 -25849 -19727 -20814 -10128 4685 2651 -17210 -4563 5629 -5165
17870 -5165 -15250 -4108 20157 9437 3266 -5539 -1116 -6616 -20468 -35714 -50889 -47798 -44234
17857 -44234 -33259 1722 -3873 -20842 -183 -355 1809 11281 113 -21060 -39064 -67959 -57994
17844 -57994 -47074 -20258 -31122 -50887 -47014 -47207 -29800 13160 11451 -12047 -15893 -15805 -20914
17831 -20914 -22187 -25159 -56498 -61289 -46288 -18269 -6977 -14679 -18719 -22434 -25570 -18012 16793
17818 16793 22364 7069 3934 -20894 -51739 -49780 -26466 -15462 -38092 -31354 277 7157 -1791
17805 -1791 -12292 -18628 1950 8663 -8508 -20119 11313 36408 22898 16966 8531 -13885 -32577
17792 -32577 -18615 -11962 -355 -54 605 -12905 -6122 11125 -8028 -28888 -29748 -50972 -64685
17779 -64685 -61960 -44033 -15551 -14941 -12183 -6738 -21155 -11415 -11107 -23612 -23211 -27986 -35530 -37267
17765 -37267 -41807 -46096 -47378 -34820 -39511 -18694 -2574 -13354 9603 8146 -28916 -27274 -22014
17752 -22014 -33017 -33331 -35848 -25845 -5163 18340 27659 39444 34038 15411 -9788 -14953 -13458
17739 -13458 -3868 -23620 -24690 -23172 -15800 -20574 -14715 4608 16101 16981 -10215 -2557 -11818 -17547
17725 -17547 -16220 -11918 -29135 -15612 10081 6275 3725 -13467 -22589 -29549 -40114 -34585 -13467
17712 -13467 -13085 -21367 -18069 -34498 -47972 -41880 -29837 -28211 -24905 -12760 -15697 -17648 -13960 -14696
17698 -14696 341 -8540 -15828 -35125 -24772 -31228 -28639 -32172 -34145 -23035 -11726 -8352 -3182
17685 -3182 12846 15686 -1831 -17580 -10821 -23867 -21525 -3003 18267 26856 31023 31209 43029
17672 43029 28898 6301 -5002 12651 10870 6646 -770 2679 5488 -9041 -3927 -1695 -18906
17659 -18906 -28323 -27019 -29044 -12754 573 -464 5512 314 -4305 2664 -18288 -27818 -11673
17646 -11673 277 -2119 3603 8920 21322 25706 16954 19839 26353 5451 1588 2290 -3522 -6591
17632 -6591 2803 8476 1731 12038 4444 -21006 -25909 -46795 -49714 -42109 -29684 -40177 -27660
17619 -27660 -29089 -19814 -10139 -15721 -15649 -25789 -32920 -40810 -25828 -30192 -39230 -36325 -43884 -48554
17605 -48554 -44152 -40261 -32765 -30298 -30372 -30909 -43160 -49889 -40819 -24644 -17350 2087 11148 -4869
17591 -4869 -9857 7353 -8170 -39601 -47516 -34116 -27357 1335 10922 10766 2483 -1780 -15438
17578 -15438 -25481 -27662 -11831 -17881 -11137 -21842 -20428 -34192 -45031 -42152 -26656 -1507 -2012
17565 -2012 5837 8201 -2222 -17216 -14636 -14069 -5249 -4465 -8508 5798 6150 21296 12376 -4219
17551 -4219 3000 9337 21648 27975 28884 51207 91578 163329 258379 301377 275486 226730 169912
17538 169912 125267 93222 43774 22407 23771 30978 16477 -5458 -7108 12126 13489 -1750
17526 -1750 -19719 -19429 5035 -764 -13458 -22172 -36420 -35026 -27342 -29139 -48612 -49788 -32934
17513 -32934 -35319 -19904 13931 5874 -15613 -19265 -28497 -37336 -17333 -3178 -14364 2739 6550
17500 6550 11732 15159 9921 -1371 -3528 -1497 -25967 -35207 -26853 -24448 -25547 -30067 -29452 -32515
17486 -32515 -42802 -57106 -52529 -34659 -10413 -6757 -12540 -12828 -15467 -28285 -16600 -13693 -17588
17473 -17588 -16024 -11178 5727 14834 -9354 -11710 -14555 -18931 4389 9409 7087 -4891 3770
17460 3770 -6354 -22991 -58108 -57749 -39233 -30838 -25619 -24387 -16017 -31055 -6385 6598 20564
17447 20564 30943 48798 60698 65364 102006 185052 271967 220628 135888 80373 50828 24342
17435 24342 -12665 -37053 -23262 4711 14617 19658 37754 45532 31803 5940 6326 -1723 4204
17422 4204 -5755 -8816 -10069 -4270 5952 1286 -3231 -1550 -30 7394 16172 15029 15748 14652 -4743
17407 -4743 -9999 4231 6617 -28013 -46710 -42720 -29710 -12104 -6541 -19176 -15778 -7000 -24220
17394 -24220 -36147 -23785 -12207 -26892 -58599 -71594 -46804 -19098 -9059 -22175 -37058 -43400
17382 -43400 -48903 -46401 -52116 -52898 -56624 -39496 -26540 -40347 -57152 -67320 -58993 -30832 -19602
17369 -19602 -13444 -11633 -32803 -55813 -52677 -41724 -43596 -40149 -28782 -30304 -16762 8468 30389
17356 30389 12179 -2214 2634 6072 -294 5862 18406 21023 7111 -12915 -14246 -32782 -34605
17343 -34605 -23576 -6306 9247 13414 26138 31912 31062 3926 3054 2350 -13913 -14042 -7360 -4126
17329 -4126 -11000 2497 -8745 -13928 -18978 -4045 -4467 -15324 -17034 -23928 -38969 -54553 -27123
17316 -27123 9283 5313 -16825 -1833 -409 -12047 -24965 -23405 1359 -1314 -21284 -15482 -15393
17303 -15393 -13148 3336 5535 -2424 -15466 -22958 -690 -11133 -12696 7154 29969 27917 17647
17290 17647 2991 -8531 -14819 -14323 1555 3891 -3273 13238 29288 21681 -3905 -5023 -4475
17277 -4475 -12767 -36472 -20342 -2913 2988 963 -10598 -44550 -49545 -23700 -25381 -22494 -13381
17264 -13381 -6220 -7890 -5982 20534 35301 11211 1664 1454 14304 26136 25024 -2576 -27197
17251 -27197 -23651 -393 19224 10424 -13158 -10928 16951 13165 3298 10194 801 -15760 -38312
17238 -38312 -52264 -43994 -32772 -18179 -28408 -36150 -47904 -32716 -13444 -5539 -9048 -3734 7282
17225 7282 29373 33352 3842 757 -443 1868 16896 27959 10323 -16646 -17729 -6137 17454
17212 17454 6449 -13890 -15059 14286 5250 -2594 -10875 -29915 -22330 -29853 -29592 -24042 -18218 -13105
17198 -13105 -15943 -27527 -14784 -11758 -7467 -8187 -6692 -3757 -6969 -22224 -28571 -11465 -18398 -23196
17184 -23196 -5681 -3463 -5958 -14875 3782 23247 -13487 -16976 -21080 -28533 -19520 -15128 -6542
17171 -6542 2313 -13482 -24429 -22539 -14312 -21785 -7121 -7254 -17076 -2165 -14277 -13749 -7941 -9531
17157 -9531 2339 -7397 -21180 -26463 -29808 -23120 -627 4209 -11495 -16453 -14458 -14881 -3499 -4423
17143 -4423 -6843 -1052 4918 -2417 -9376 -14591 -9255 -10679 -16146 -21965 -14757 -24723 -35990 -37352
17129 -37352 -37880 -26653 -4676 -3342 -15718 -26233 -21777 -20877 -15663 -31598 -36026 -36387 -44342 -43271
17115 -43271 -35212 -31806 -47188 -22819 17669 36547 18651 -13488 -27732 -17312 -18243 -29739
17103 -29739 -26743 -16880 -48687 -58138 -76645 -84265 -81302 -78462 -54415 -26917 -15469 -9575 -7900
17090 -7900 -10461 -37283 -39363 -25330 -8557 -20761 3835 23192 -3799 -49420 -48018 -51171 -37134
17077 -37134 -39817 -24157 -12229 -14565 -5535 1953 -4188 -477 -11453 -29094 -50667 -43484 -28656
17064 -28656 -3056 15268 16223 12832 -1903 7921 10529 -10540 -31597 -19693 -9769 703 5924
17051 5924 22956 16169 -6052 2207 -5475 1178 5743 -3829 5274 4922 10367 3279 7794 26802
17037 26802 27800 31053 25598 9732 1778 5001 -5149 -6920 -38155 -32740 -27719 -34605 -39663 -38104
17023 -38104 -39008 -35608 -38541 -23283 -17519 -7656 -17838 -40246 -47985 -35240 -37383 -55769 -34483
17010 -34483 -12083 -4094 1823 -12866 -13365 -4480 -13956 -15644 -12197 -17983 -2673 5267 -1950 -15965
16996 -15965 -16439 -247 9643 325 -12590 -11745 4973 5467 -9041 -19724 -4976 -1883 -5518 -27365
16982 -27365 -37402 -25001 -26978 -32362 -29640 -10786 -4255 -7173 -6880 1564 -12932 -9444 -9160 907
16968 907 9908 2082 -15002 -9918 11544 34591 22916 8258 -1759 -11652 -18981 -7942 12446
16955 12446 10920 10515 4339 4514 9271 20128 16076 12402 -2558 -4638 -968 -4323 7237 12883
16941 12883 78 12095 10997 5446 -10980 -24870 -38332 -18292 4183 287 -10356 -13305
16929 -13305 -9623 -10139 -36860 -35736 -9641 10472 -6678 -21323 -5652 23168 19977 16969 21566
16916 21566 9154 3778 927 -14863 -31860 -20733 -18598 -9104 -12408 10415 13445 8836 12261
16903 12261 -6875 -8148 -16623 -14610 -14657 -18815 8517 14032 16411 28860 40628 36204 20302 33240
16889 33240 35288 21806 27545 23763 22534 20029 18886 16846 5557 9969 10958 -6432 5067 9387
16875 9387 15251 27628 27025 9720 106 -9739 -3169 -8538 20528 23701 23662 19628 25459 21586 7921
16860 7921 17737 26449 11352 8422 18617 26683 27687 14763 3663 -5841 6254 29605 36398
16847 36398 25581 -3329 -17896 -22716 -36679 -45783 -58491 -65006 -63078 -55114 -63546 -64238 -53674
16834 -53674 -29763 -26040 -24600 -25861 -34712 -21651 -14945 -3336 -7147 -12364 -24997 -18916 -15266
16821 -15266 -15269 -71 11370 17223 32449 43656 37434 2478 -9991 -17848 -16863 -9057 -20818 -15308
16807 -15308 -16056 -3833 -5375 -22176 -32809 -38683 -46388 -29714 -16856 -7124 -13495 -23590 -27017
16794 -27017 -28844 -25636 -20954 -14445 -6200 13235 11964 228 12560 26144 16165 -1497 -37912
16781 -37912 -42502 -28900 -36226 -36563 -22727 -3021 1861 901 -7172 -13291 -12054 -2773 -12335 -9888
16767 -9888 7231 12175 12258 16311 7815 390 1939 -4890 -15996 -16289 -16014 -3858 -11552 -38366 -47862
16752 -47862 -28974 -14236 -27065 -23439 -9654 729 8015 12439 14305 -1008 -8099 -9210 -18647
16739 -18647 -19655 -27995 -30283 -15083 106 -180 432 -25 -6280 -22286 -10200 3818 6153 -1172
16725 -1172 -16231 -22487 -18036 -16668 -15986 -14931 -14919 5892 6199 -23029 -28303 -19154 -6311 24105
16711 24105 28218 16360 798 -3363 -18295 -17054 -9900 -16979 -32935 -21830 -19166 -13985 -16617
16698 -16617 -34714 -23673 -14378 -8320 -2084 -1090 -5238 -7736 3518 -527 -7808 3808 3911 6228
16684 6228 9248 20080 -2167 -14431 -21455 -34941 -38754 -27575 -12807 -3446 5027 -3574 -28017
16671 -28017 -35540 -29655 -10351 -18404 -19854 -9105 3006 8926 -7404 442 -849 -7849 -4296
16658 -4296 -7261 -6179 -1245 15622 12870 -6456 -4859 6133 3119 -24490 -39736 -31828 -13394
16645 -13394 -10876 -15820 -22060 -26383 -29754 -14497 -11835 -2019 13482 14249 -6573 17499 31077
16632 31077 39640 34718 1103 -22404 -29268 -9648 -4750 -35501 -47266 -5200 6348 -15868
16620 -15868 -7580 2608 12157 -10522 -23808 -20350 -7905 51 7791 8306 499 -6316 -13295 -8142
16606 -8142 231 13699 13353 2786 1187 -4363 2351 10914 28738 17663 -8860 -11590 -2764 18386
16592 18386 9190 -8513 -19107 -26605 -4808 17160 23812 -3795 -26955 -26028 -28138 -20026 2567
16579 2567 5761 -10883 -21249 -14679 -3666 -7194 -1895 16637 23454 19495 9331 -1969 -14375
16566 -14375 -11147 2282 -13771 -25656 -28727 -15504 951 -11462 -9341 -27413 -46996 -48783
16554 -48783 -29671 -30014 -39585 -36341 -37315 -22867 -31043 -46464 -34584 5804 11021 389 -8125
16541 -8125 -6034 12269 25387 31655 22263 449 -7780 -21732 -12926 -7978 9255 13077 872
16528 872 -10989 -28829 -22007 -15023 -30619 -35775 -55105 -53125 -32119 -29559 -26470 -20168 -20089 -11096
16514 -11096 18552 16749 15203 -17163 -31538 -12427 -18678 -36563 -34020 -4957 9054 -4519
16502 -4519 -16585 -14590 -6648 15441 21739 15364 10636 -1051 -34695 -53583 -65990 -56336 -26752
16489 -26752 6506 17668 31096 26935 25535 20549 12947 -14875 -29344 -14564 -13923 -5234 3644
16476 3644 3701 6505 646 -11008 -20205 -14015 -821 15962 -3081 -13733 -9165 -909 -22418 -40052
16462 -40052 -40002 -36297 -20008 -9172 -15800 -24140 -34028 -21948 220 -14719 -32926 -48088 -37185
16449 -37185 -12809 139 3921 -15718 -29982 -27430 -32088 -19958 -7230 -38343 -16540 11349
16437 11349 5092 -2582 3318 -3390 -4989 -7959 12552 8464 -3934 -10837 -7495 18657 12147 -8095
16423 -8095 -22713 -15971 6635 -1827 -8288 5253 -3341 -19096 -19357 -10865 -21623 -26309 -5591
16410 -5591 -572 -7506 -8619 -1378 -13786 -11287 4691 2372 13055 13238 17371 9025 11629 9535
16396 9535 -8086 -20136 -16844 -4538 4927 -5546 -21599 -37326 -30871 -15709 -22234 -18816 -16079
16383 -16079 -17210 -11346 24618 22648 14338 621 -18671 -36974 -32750 -30009 -1287 -7322 -14062
16370 -14062 -8198 -22886 -24306 -13238 2354 19109 24028 20676 14113 -23803 -47520 -53554 -35577
16357 -35577 -34758 -35175 -29000 -38629 -33069 -34192 -27359 -22967 -14465 -19090 -12959 -8405 -18683 -21542 -18416
16342 -18416 -29096 -21634 -8710 24891 9615 -12158 -20806 -43292 -37236 -13326 -4371 -9627 -10410
16329 -10410 3658 11053 -5051 -12150 7214 5547 -22753 -24190 -6650 -15259 -21371 -13377 -18916
16316 -18916 -39592 -42923 -20633 -8817 -7176 -10112 7821 12239 2102 -3683 -21866 -15368 -21209
16303 -21209 -12126 -1058 3497 5509 24796 35450 22285 878 -14629 -26832 -20829 -13067 -19261
16290 -19261 -7621 -7047 -3751 60 -6271 -10075 -19592 -12011 -8409 6573 24838 21705 -875 -17119
16276 -17119 -18010 -27844 -36053 -47126 -57030 -45971 -29503 -27446 -27657 -22163 -29535 -38736 -20072 -1507
16262 -1507 -15437 -21249 -13685 -16370 -827 6141 11642 19993 -479 -3080 -1469 6698 12204 26662
16248 26662 36066 40875 29728 -1573 -7422 -7591 -10010 -14076 -17427 -3064 -251 -5177 -16443 -28305
16234 -28305 -26033 -34458 -27985 -4418 -9473 7644 15168 9198 43142 34695 6215 -4439 1410
16221 1410 -12308 -19998 -33114 -39677 -5000 -2018 4395 8265 -5254 -19548 -8717 -2904 -5599
16208 -5599 -4258 1949 -3748 -7244 -18011 -29540 -21661 -20405 -16499 -31270 -37571 -13549 -6345 -5418
16194 -5418 -5988 4750 10361 12952 -4208 -24444 -22843 -16787 1888 2052 5233 13374 12382 1169
16180 1169 -3612 15193 12119 -4115 -2317 -178 7456 25395 13607 12942 4504 17738 -11551
16167 -11551 -51994 -48243 -37126 -36184 -20965 3899 6241 -376 2808 16636 23096 5811 -22985
16154 -22985 -15817 -11628 -22613 -11485 -8504 -17860 -12846 -19170 -8684 30575 40010 37870 7706
16141 7706 2896 13560 24423 19981 -18582 -27648 -21632 -27979 -17499 -31309 -17209 -7147 -4425
16128 -4425 15005 13076 10896 15051 9390 -23821 -9242 -1128 -150 -7325 -9056 5846 14519 -1759
16114 -1759 -10218 -10401 -11171 -20185 -24397 -19256 -23558 -23047 -10865 612 17301 9818 27560 30222
16100 30222 16870 40749 21318 -17775 -19219 -937 17336 3842 -3575 -18438 -20181 -16627
16088 -16627 -9407 -3355 28641 18486 9898 8578 -1850 -7469 -16939 -38330 -23287 4078 6331
16075 6331 6187 -2504 17158 21350 21775 13707 -307 -16092 -17695 -27669 -18510 -1047 12412 30785
16061 30785 36595 24241 27166 35936 6617 -7010 6041 4073 7599 -13494 -18935 326 7385
16048 7385 -1960 -10587 -19719 -5091 2517 -6165 -20405 -17489 -20006 -17011 -3619 3376 -14018 -8570
16034 -8570 -5375 -3408 -8124 -6650 2355 2116 -17956 -27183 -32651 -15336 1440 9385 33985 59052
16020 59052 44405 5970 11846 13724 -10427 -27131 -20413 -6756 -20023 -2193 61 -6886 -11011
16007 -11011 -25743 -22155 -507 7303 2692 1297 5035 14535 1386 -6289 -27246 -12520 10693
15994 10693 15974 -20370 -44433 -54057 -29947 -17510 -20262 -29925 -41526 -19548 -13091 -20200 -26282
15981 -26282 -23423 -13058 -3022 -5443 -8197 10913 -4294 -4988 -15226 -5087 -2690 -5796 2264
15968 2264 26455 37310 32910 29894 6049 -16742 -9440 -6621 -5598 -2339 6867 10511 20550
15955 20550 -8235 -44018 -50336 -17258 -4598 -1843 -12467 -21060 -29464 -26919 -26407 -32148 -31582 -23536
15941 -23536 -12313 -13021 -23311 -28628 -23786 -21162 -42373 -34366 -9793 -6539 -12667 -4996 8183
15928 8183 13805 -4210 19105 23845 -3260 5935 20695 5214 -9093 -13967 -19117 -24435 -28117
15915 -28117 -15940 -6980 2862 602 7649 -4683 -8838 -617 -7726 5550 3340 1845 8449 7468
15901 7468 -10817 -9701 4373 -11647 -30023 -38506 -36239 -28507 -7958 -8381 -19071 2773 -5232
15888 -5232 1558 5996 9890 4232 19865 28858 30989 1435 -8707 -7141 -3008 -2045 -8299 37
15874 37 13134 9022 641 -7197 16416 32786 25276 22438 23829 27947 19496 10198 -3183 -12194
15860 -12194 -5775 3434 -2436 6724 16009 18567 25206 12070 2831 -3844 -19939 -15366 -6354 4353
15846 4353 -19514 -41864 -14908 -3808 -2039 8877 951 -14097 -24825 -16016 -496 -4443 -14003
15833 -14003 -3757 8925 -16890 -30374 2745 -8536 -19452 -15885 -20717 -12792 -247 -5599
15821 -5599 -3471 -2380 -6442 -13827 -6967 -41786 -34225 8106 17278 -6064 -27530 -33729 -16959
15808 -16959 -3040 -14522 -31853 -35048 -13442 -5792 -9783 -21972 -11424 -22771 -21890 -6943 6502
15795 6502 37449 24651 12793 10998 -2263 -15036 -11003 -5732 -20824 -21206 -21254 -24897 -25211 -12503
15781 -12503 37 15268 -1336 11790 6283 -1172 -6600 -5418 -19054 -15498 3233 7558 -7905
15768 -7905 -21988 -10811 -17344 -21637 -3509 17545 26424 28601 18000 3174 21492 25844 703
15755 703 -5952 -14356 -30099 -30579 -18524 -16507 -17520 -18614 -15368 -13888 -24694 2763 -4382 -15832
15741 -15832 -21672 -12938 1007 -19263 -19239 266 2391 11751 9514 9233 17207 -2879 9311 24618
15727 24618 11448 -1313 2481 3836 5227 22975 36321 22563 14205 6843 -1125 -6035 -370
15714 -370 16459 18618 14982 19324 23999 18155 10462 17159 33936 39017 38353 27052 13752 20822
15700 20822 32354 29213 25469 13573 21610 14356 17979 44388 38930 26883 5410 9187 3581
15687 3581 -3932 -11403 -7674 3021 12819 18940 6328 10236 12469 8427 1441 -5254 2673 3900
15673 3900 26650 21753 16960 25599 25096 12378 27500 30832 34244 13118 -9747 -14873 -8875 -1259
15659 -1259 15557 -1665 -21818 -25318 -34484 -37332 -37977 -37260 -22204 -22649 -1322 17299 40954 48639
15645 48639 27292 -21737 12471 6908 -11745 1670 14053 18004 1760 -7937 4826 5791 11419
15632 11419 -23153 -28000 -2255 12692 15637 19471 17381 21563 -6767 -23983 -14357 -19388 -27227
15619 -27227 -15061 -483 14709 22291 24917 15797 12508 25248 19213 10279 12151 18854 18121 8920
15605 8920 -12876 -42053 -43812 -20587 -22086 -27534 -43979 -35222 -31675 -34835 -34747 -23335 -16894 -6146
15591 -6146 -11353 -321 -6625 -8113 2044 7018 5186 -5241 -6136 -10494 -5229 -382 -1031 860
15577 860 3399 7064 9774 3571 20791 17498 5691 -2912 -1977 -15914 -1140 2644 18916 34690
15563 34690 56282 36980 12067 425 4014 -2527 -30950 -45302 -31560 -18623 -5339 -7780
15551 -7780 -16098 -30786 -31734 -39151 -34548 -14187 5628 3888 18407 15673 4483 7779 23655
15538 23655 35602 40412 29094 29280 25909 5508 -11315 -17954 -6793 18887 19162 12885 11832
15525 11832 3700 19442 10044 -10905 -11976 -14796 -17631 -8133 12325 22190 6501 4708 16139
15512 16139 18953 -140 -13116 -31836 -32952 -14724 3795 -5608 -16321 -4490 1074 18889
15500 18889 -11790 -39122 -33120 -25063 -28389 -31853 -32587 -22574 -17900 -16151 -19186 -19151 -7240 -9455
15486 -9455 -28100 -22811 -24104 -23301 -16613 -7297 2845 3824 2600 -2897 -9380 -5359 -7321 -15669 -27943
15471 -27943 -16610 9169 2056 -9999 -8748 -17054 -17700 -6766 16061 22612 18567 18897 32105
15458 32105 36001 13890 -14900 -23994 -6926 -9081 -4741 20672 39811 25823 8913 -5901
15446 -5901 -25217 -23605 -15268 -8719 -12050 -7249 -17464 -21751 -22844 -6651 -8110 -15691 -25167 -37405
15432 -37405 -29889 -8752 6664 8960 11283 26510 43668 20021 -16512 -22624 -22352 -10400 -34733
15419 -34733 -45460 -19706 -19406 -29435 -16726 11917 1167 11224 -714 -5508 -6565 4061
15407 4061 8440 -4908 -16250 -3739 -13538 -12275 -25881 -41404 -41607 -37812 -29359 -22658 20960
15394 20960 38938 42417 29808 5519 -13429 -33284 -30304 -31942 -30428 -23697 -10503 -30233 -16724
15381 -16724 4608 -11281 -30833 -23516 -21702 -32391 -29975 -20913 -16971 -10075 -10169 -23435 -38395
15368 -38395 -25402 -9464 -20906 -12637 -13115 -3976 14976 13814 34876 38754 35172 29859 39625
15355 39625 30141 19115 7426 -10456 -784 -6622 -25690 -16898 5514 11660 6691 3886 8479
15342 8479 18405 5737 12788 33126 12690 -4128 -8279 -14139 -8043 -4497 -7959 -29677 -20391
15329 -20391 -1553 -3666 -1582 14062 -1151 -8455 -19293 -23777 -27516 -22120 -13671 -21619 -21842 -689
15315 -689 -11162 -22348 -34514 -38927 -27584 -9225 -1326 -17094 -3295 -62 -8944 -15927 -3727
15302 -3727 17766 14041 15752 9597 6461 2934 -3050 -18136 -22290 -15499 6652 3541 -24173 -28983
15288 -28983 -24870 -23660 -1863 -21023 -24875 -23340 -21091 -20919 -26174 -14510 6097 -15940 -30701
15275 -30701 -48856 -54103 -42506 -34647 -26588 -36221 -26541 -25305 -19452 -17133 -28334 -17402 11285
15262 11285 15131 -1570 -22067 -28963 -14874 13132 -408 -25201 -29550 -41460 -59364 -59386 -26639
15249 -26639 -127 21083 19951 18356 -5321 -9932 -4222 -28209 -27815 -29090 -36562 -39994 -19152
15236 -19152 -15600 -8698 -7704 7833 368 14850 23833 13526 -4033 10799 4964 -29147 -35548
15223 -35548 -7594 13300 9333 10434 -1384 -7555 -6098 -18458 -30534 -25040 -15619 -16134 -22773
15210 -22773 -14696 -30722 -18018 -17886 -1102 1734 10125 11203 -2732 -2120 -925 14278 9498 9840
15196 9840 8192 16513 15474 12967 2034 -7175 5830 10946 -3013 4792 -530 6341 15281 -2935
15182 -2935 -36448 -37227 -39116 2822 11612 -11522 -5441 -6342 -17797 -30731 -25335 -12679 -18685 -18957
15168 -18957 4978 16273 19130 13574 13991 -8323 -26277 -25007 -14368 8416 8988 -2188 -3135
15155 -3135 -27912 -35564 -7986 -4196 -5229 9351 22581 32880 9871 -4121 -986 -16514 -3664
15142 -3664 -6164 -20460 -23620 12244 54021 55957 54000 49550 12777 -3380 -20569 -15395 -1866
15129 -1866 4251 -12356 -41739 -48031 -9973 -17823 -23488 -12918 -5810 -7882 -4404 -13255 -8216 -6419
15115 -6419 -2768 4945 2427 6513 4364 16942 27041 17084 9489 4863 -108 -3189 -2748 -5852
15101 -5852 -1767 -3839 7780 -8320 -18660 -28930 -17106 -8211 -7836 -6290 -23711 -11110 -4456
15088 -4456 -5101 -4913 -1760 11411 25253 -11989 -18353 -21147 -11411 7503 24765 9584 16079 10211
15074 10211 3660 34595 39156 46361 35514 32123 46298 37890 24706 13993 4852 -10852 -16490
15061 -16490 -21160 -22896 -3091 -5575 -8855 -25283 -30185 -10251 3680 -4537 10018 3962 -29669
15048 -29669 -19999 -8766 -14044 -28207 -20117 -40720 -33451 -20541 -2755 2579 -27125 -42566 -31162
15035 -31162 -18733 -936 11026 131 8392 14251 8315 5514 -16679 -9492 15186 20600 22559
15022 22559 13249 12989 -9261 -20374 6256 25151 19992 11556 13587 34959 28317 4967 -17126
15009 -17126 -10516 212 -2136 3827 -1462 -4579 -3174 -7975 -8726 -13812 -4358 13149 16656 16676 56413
14994 56413 69552 95007 152094 168053 104385 52899 37316 44641 42535 34830 23103 4337
14982 4337 16757 15702 17015 24750 22929 10390 10986 -8104 -4079 11461 10367 10345 -304 4259
14968 4259 -25181 -20044 -10706 4857 -6034 -4953 4386 12280 8585 10234 15648 26124 9179
14955 9179 19090 52067 59395 36036 13363 36066 43357 12488 -7246 7220 18921 34337
14943 34337 21345 9544 -2167 -7071 -13282 -1879 4358 -11074 -8275 -11744 -6357 -11091 -4510
14930 -4510 26619 23124 18427 26522 4884 -1063 -406 10058 6956 -8711 -12120 4997 18855
14917 18855 5844 16593 15557 12832 14481 15060 9106 22930 18709 8701 -11090 -6468 -5194
14904 -5194 -4858 16308 27340 172 -4890 -61 15517 745 -15545 -34640 -34435 -17283 -8839
14891 -8839 -14877 -7881 1239 4800 -3063 9091 10363 4065 -1768 -10334 -12712 -17478 -13720 -13246 1701
14876 1701 -2279 606 3555 16889 4184 -1338 6276 -11521 -22357 -30413 -33141 -21595 -6285
14863 -6285 6972 16723 4114 -30085 -35964 -29621 -18717 1376 10053 -11851 -23033 -9387 2830
14850 2830 -7684 -4065 2470 7121 17365 21635 24147 13617 21254 32821 22920 1082 14548
14837 14548 19767 5779 -10197 -4926 -14366 -16704 -24700 -3309 4566 -18383 -5970 4823 19857
14824 19857 4658 -16113 -17543 -3641 33198 49296 32237 -747 -5110 -10064 -25824 -11873
14812 -11873 6722 300 -30040 -22808 -15802 -30165 -9900 10395 -8520 -14062 -3498 11797
14800 11797 14574 14074 -9406 -8458 -8352 -16725 -16826 -10580 -12939 -18443 -17218 -23739 -14068 -8821 -23499
14785 -23499 -18227 -4839 -3287 -8030 -17411 -15152 4158 -8916 -13177 10017 14242 -1341 -12556
14772 -12556 -4761 -21237 -15460 7944 21929 17777 13837 1409 -6621 -3501 9695 -9240 -8614
14759 -8614 4830 -4786 10145 35523 35372 20974 10341 21372 26116 18061 13213 34454 30253
14746 30253 -3543 -21646 -3669 -5159 -16062 -17553 -28984 -31171 -22683 -9528 -7037 6371 20620
14733 20620 36673 48227 55432 42970 13318 6436 219 12530 8823 11047 10922 12710 24034
14720 24034 9917 1578 17605 42315 38615 16583 -1980 1144 -267 -17240 -19347 1288 25801
14707 25801 12874 3728 6347 12495 5046 -6278 1233 8309 1807 32766 21173 370 4796
14694 4796 2613 4271 -6815 -5960 -8640 -6398 -8095 -2508 13944 19285 17240 2885 -19664 -22330
14680 -22330 -36606 -35675 -17597 -3134 -17959 -14293 -13747 -3384 -16212 -6928 4391 14216 8808
14667 8808 -3906 -11220 -18973 -28185 -21942 -10464 -12912 -11506 -12272 399 9996 15757 20724 15782
14653 15782 -3437 -4173 9738 15064 12199 10085 11531 26870 36818 42903 39346 14184 11609 6070
14639 6070 367 13608 7137 11479 7796 -7136 10492 7653 -12124 -23205 -18354 -17526 -6180
14626 -6180 22412 17275 -11899 -22249 -33717 -31376 -16683 -25422 -9657 -1622 -29493 -57858 -47732
14613 -47732 -15071 2034 5898 -7168 -11876 -15851 -11173 -4452 -675 -7458 -9988 -6560 -11121 -14474
14599 -14474 -15647 -7611 6550 11294 12014 -12871 -11128 -2797 -2392 5294 942 -7091 -7774 -12521 -27614
14584 -27614 -43434 -26409 -11514 -23721 -28727 -9121 -9896 -15311 -5046 4327 10569 38507 33150
14571 33150 17663 10169 370 -4498 2459 9474 18074 21271 17028 3408 -5716 -9709 -4636 11100
14557 11100 30279 19429 -12973 -24305 -39523 -44527 -41207 -11132 8468 32889 49624 62108
14545 62108 29025 2445 -1515 -1112 311 1548 3907 -1126 14247 -1790 -12515 -14534 -5381
14532 -5381 11135 9900 17696 11212 6171 -4631 -3376 26633 16459 20820 28311 16657 3279
14519 3279 24891 37547 29568 23777 43146 56079 43045 24925 2857 -20601 -1945 3028
14507 3028 -2679 -7410 -15168 -24827 -29665 -17325 -11246 -22126 -20590 2335 24178 32283 16006
14494 16006 -11440 -8413 -2029 3738 -3008 -16261 -9556 2529 -747 9114 -7070 -9003 2134
14481 2134 8699 24680 34799 28875 28368 50065 44285 33162 23621 9806 5780 6242 -4 954
14467 954 -3773 4741 -11291 -20373 2584 9598 10582 -862 4879 -18589 -22922 -2284 -7675 -19559
14453 -19559 -10430 -20235 -15262 5076 10888 18397 -2071 -6938 1214 24967 23785 11103 1526
14440 1526 -8512 -8558 -22311 -43699 -58261 -30105 -20473 -16142 -2748 -12072 -20555 -7409 3421
14427 3421 4718 16932 16086 21705 33816 33543 30435 18633 13343 15470 -8878 -22219 -16003 -20735
14413 -20735 801 12874 15538 2414 -26980 -20354 -17618 -7227 -7672 14234 24720 27657 13501
14400 13501 3545 12088 29598 47159 54230 36660 4398 -1706 17422 18250 3294 5238 30153
14387 30153 20092 16561 21090 10003 9210 7884 -9245 -11047 -26940 -43200 -37893 -27111 -20091
14374 -20091 665 8242 -4067 -11304 -18760 -35010 -40629 -29965 -33971 -1151 17552 36519 31860
14361 31860 40927 50345 31901 24182 147 -9317 -8992 -23472 -34285 -27650 -3639 5437 -19646
14348 -19646 -8325 17757 16660 443 -21585 -24154 -26073 -22255 5833 23660 22019 22997 13590
14335 13590 9861 18825 20654 31533 29899 31192 40932 41608 52205 32728 30414 23666 12537 28712
14321 28712 43195 24882 2776 -14391 -23160 -352 22564 -3900 -19899 -30937 -22888 -22074
14309 -22074 -10562 -21290 12065 16099 2441 12366 26543 19498 -4603 5919 15425 40
14297 40 -5173 -18128 -10669 4335 1321 12204 24421 4966 -17447 -33554 -41507 -28150 -10188
14284 -10188 -14037 -10935 4528 17958 22518 11298 12734 12683 16837 15771 21268 16661 5074 -10071
14270 -10071 -10131 16606 49464 35831 26735 29956 33749 12751 -8041 22588 26111 -500 -1394
14257 -1394 -4264 -19512 -15331 12127 25813 7038 -35375 -31512 -11412 -356 1529 50 6229
14244 6229 -6056 -6662 -16411 -20680 -18828 -12404 3489 8925 2838 -9412 -3289 3840 18240 21262
14230 21262 28273 24273 7065 14594 -8654 -5459 2288 15771 21858 10003 13567 16051 14345
14217 14345 14999 -11232 -14672 15969 21482 20330 -9049 -17155 -21229 -14391 -14987 -14157 18634 35066
14203 35066 30153 16532 19587 23885 26663 29949 31886 29245 14888 -8979 -25301 -4890 10832
14190 10832 -3340 -7766 -17649 -27450 -26876 -21047 -9565 4140 25078 24899 11617 5677 -5861
14177 -5861 -20229 -34695 -48562 -46535 -22113 15383 10366 8505 15839 27284 17355 17601 29065
14164 29065 15728 21377 8602 -8013 -10544 -11914 -3726 4096 10286 19532 18897 13955 2779 -7507
14150 -7507 358 -355 -10585 -2891 4842 -6906 -9591 12733 -2072 -1935 2107 12639 19921 14658
14136 14658 17226 20575 22058 35687 19651 -8724 -19715 -6444 2111 -790 6195 26101 16955
14123 16955 14316 -847 -11162 -6141 -11563 -9934 -1940 10012 21240 27584 26489 24413 16286
14110 16286 16480 17029 16863 7248 6617 12552 24876 23953 -6847 -23592 -7134 16869 9986 -4753
14096 -4753 2276 929 3001 16562 43530 59573 48299 60492 63593 87083 89396 56833 73226
14083 73226 89718 82526 77188 65830 49595 29577 29599 50102 52153 23800 24765 21426 19814 15353
14069 15353 5862 11913 10673 13315 12234 17379 4181 11162 8536 12348 19312 12516 3772 -10508
14055 -10508 63 2030 11631 27152 12398 -9380 -13836 -12248 -5995 -5336 -22196 -11727 9282
14042 9282 26683 9733 -11824 -13440 -11503 -17340 -7467 -14322 -23641 -10722 18671 15609 7931
14029 7931 11737 11731 12308 -2267 7768 33418 33375 34470 31904 8834 454 1867 10937 23563 24351
14014 24351 41846 31537 13063 -4027 -6285 16585 32463 26239 19351 29338 44465 37429 17015
14001 17015 11246 12555 19399 13263 14323 2541 -13800 -11475 7256 32116 35376 33103 28261
13988 28261 40147 61695 67186 57926 42905 14738 2110 7910 11996 19108 23757 4779 9710
13975 9710 35389 31345 24752 12958 10001 8246 5739 -1214 14197 27511 32588 19965 5788
13962 5788 -3851 -5914 696 -10767 -3070 -2366 -15137 3849 32366 41680 34898 37167 52870 37929
13948 37929 13507 30299 27280 23285 9527 7945 18820 13610 -14910 -10305 7070 16071 15561
13935 15561 22644 15228 7141 23922 35153 46802 54209 47559 37014 24496 15470 24962 23886
13922 23886 11367 -5504 1201 15946 29162 16096 -8705 6758 22585 16395 12922 3738
13910 3738 -4959 -24492 -29974 -4407 16566 37321 31326 52118 61033 59074 25155 5742 6331
13897 6331 8434 30402 34643 22962 23645 8959 2975 5934 11678 9944 4923 -10274 -6083 22717
13883 22717 7280 -5552 219 9550 2436 -2086 -6476 3920 34692 31213 10291 -6994 5947
13870 5947 20186 14830 18349 35017 30466 38726 50890 32257 33913 36908 40412 44636 28583
13857 28583 13461 -7182 -569 9266 16030 20695 15953 -4450 -2563 21396 31777 39163 31972
13844 31972 5696 -4499 -3694 -263 -7705 -10563 -16893 -11154 -9390 -31344 -34998 -13592 -17111 -19380
13830 -19380 -15327 -3006 6367 22413 41386 54195 53220 32234 28077 22546 15761 13667 35138
13817 35138 49097 33125 6705 -13161 -19782 -19008 -3546 1523 -2184 -14366 -20917 -5253 -695
13804 -695 14149 29382 12961 31122 30869 16919 -2454 -15967 -1072 8130 18702 18442 22447
13791 22447 45565 40662 29831 13816 3347 -866 9637 -7428 -9277 5832 14255 12214 -1112
13778 -1112 5262 28056 15199 -2311 4112 13260 28591 32406 15397 11354 12108 -1257 7312
13765 7312 34011 56476 61869 64468 43926 27276 25129 38759 24420 40461 36749 -516 -13636
13752 -13636 7961 9380 10084 -4282 -12281 -7221 11041 -5003 8410 5695 16071 15633 27164
13739 27164 48458 45786 44897 23155 14757 11336 24480 14578 5640 -1890 -8446 -14160 -8939 5460
13725 5460 12315 19102 29239 51065 48910 22011 6227 -1217 -7371 -1056 11679 18707 33024
13712 33024 19113 7783 10846 -2111 13270 27381 20933 39132 46374 34959 53612 67022
13700 67022 78276 73665 81203 56162 35269 51165 73877 55429 30000 32143 34561 30367 27571
13687 27571 61728 59370 52058 56668 60190 66191 54956 50439 43228 46599 36091 12526 5709
13674 5709 18141 5056 8488 3986 1473 9884 16650 26225 39871 28507 49168 49326 44442 37387
13660 37387 31328 19348 35923 56689 43859 47676 44885 27522 19159 15237 12782 21059 20335
13647 20335 3259 6499 19427 29671 36326 32714 10873 7997 22215 32130 50169 58984 71814
13634 71814 75927 63213 40830 25137 35448 43102 48566 42336 33703 54329 69161 73817 60397
13621 60397 37832 35588 41454 37826 46049 62932 75398 68630 55229 48223 43806 23590 40631
13608 40631 53307 38698 21429 22694 35541 56088 53824 27147 19959 24857 32303 25276 23388
13595 23388 27694 36944 36928 26099 38017 77638 88723 58070 29894 46105 55498 63060 66722
13582 66722 47785 55513 67279 49072 47986 54369 60286 55358 44374 34920 29889 24385 39781
13569 39781 35854 33475 27747 33848 34561 52592 67861 50730 65370 84886 80773 68796 53023
13556 53023 44132 19249 12555 20398 31616 42960 38457 29425 23957 36935 61090 75993 77027
13543 77027 59213 30248 7520 -6800 -3616 10933 36843 63382 67122 55439 49048 39182
13531 39182 14231 20139 20650 16708 31658 44644 24487 8258 23891 19821 24382 31887 51056
13518 51056 63486 51649 38449 35380 57521 65209 67976 58206 47784 58946 51212 34009 35576
13505 35576 35228 51211 40791 33146 29210 36787 46177 62486 65696 61421 61185 65560 69195 49812
13491 49812 48588 39174 35251 24837 30757 37783 28140 14682 10784 25761 41404 52966 31267
13478 31267 41776 53864 66333 61794 62116 78652 75113 72599 68809 69970 65360 69298 81786
13465 81786 74767 46622 54785 85633 80078 81148 88626 94219 83062 103525 112141 99822 95963
13452 95963 123023 136106 119153 97094 101539 114297 117869 121657 114809 145789 175976 206302
13440 206302 258109 338654 456554 629213 953376 1510795 2234684 2411468 1724167 1043493
13430 1043493 658544 445813 319149 221081 165104 148131 148383 129805 111828 103687 94232
13419 94232 74838 81138 66106 47171 46055 52435 61107 88793 84549 76830 78782 63568 58354
13406 58354 62489 56275 55306 61305 69372 62172 77068 73857 57688 59478 83097 103733 88863
13393 88863 60990 51819 35090 52339 58379 35625 17002 6020 -17697 -47057 -43113 -14232
13381 -14232 -9968 -21128 -14492 -6187 -2653 24118 39823 38538 45912 44007 53722 65181 59945
13368 59945 74747 108427 103777 89509 92861 88332 58434 45357 54357 62312 54314 52070 44415
13355 44415 84307 87304 66567 68017 64949 47490 30242 16362 12512 29938 53929 56776 46358
13342 46358 34604 26717 36013 47723 43128 38935 38389 44922 54755 54029 36815 30447 37139 30927
13328 30927 42141 69199 75197 68952 73916 69991 61667 61162 54113 44720 34725 33223 24503 54085
13314 54085 64438 69908 87153 79898 71477 45170 59698 66121 78518 107177 105814 76024 69234
13301 69234 72865 82246 93473 67450 68853 67353 57009 58705 42997 31129 36713 29308 34754
13288 34754 41000 47558 39657 12601 -3602 651 6286 -16119 -41144 -53418 -81318 -86454 -55821
13275 -55821 18771 66162 82040 107785 127715 114777 112634 108837 96071 78814 80219 76896
13263 76896 58141 58404 76983 93855 89232 82136 107898 108309 112196 107715 101553 98344 132595 144914
13249 144914 143899 147696 119623 100971 95141 94841 94777 97371 112296 133303 111910 82333 91815
13236 91815 113044 118386 113678 84083 47737 55533 72758 93908 96936 84819 90849 139656 169152
13223 169152 222939 300066 371297 353909 287447 253187 217575 183306 144980 132337 128154 116704
13211 116704 116936 115852 148211 148608 149287 159623 156032 113812 92599 81853 74101 84362 52509
13198 52509 45926 46810 67280 89481 100225 118566 98279 102124 102572 89360 82202 70137 67673
13185 67673 75167 81689 83103 70984 76968 90338 104076 114231 135946 172436 176818 185766 163363
13172 163363 135318 95305 49152 -867 -30797 -17419 -10862 -9820 16451 42946 53419 69962
13160 69962 75185 105273 153715 198570 235772 239369 228523 198899 170633 139357 106957 95117
13148 95117 123035 143553 143567 147987 134637 104614 90088 102056 110549 112952 105466 130259 158228
13135 158228 174226 186524 181865 185903 187890 177688 191873 213676 227945 198591 134498 63675
13123 63675 26524 50869 85943 117231 168085 199778 198652 206778 207592 183188 177324 186978 199263
13110 199263 209740 207824 213014 200963 192700 180774 165020 133679 131069 157182 181917 210211
13098 210211 255945 318090 396951 452229 437160 510465 553399 511599 444758 409843 406539 407847
13086 407847 379432 343399 342851 353934 340070 314684 288609 280788 255983 254717 267522 268192 273882
13073 273882 276321 291287 317700 344611 367679 355095 309118 248825 210881 207153 232945 257687
13061 257687 272699 272618 303934 314485 331218 352018 365691 374649 392342 381464 353216 339703
13049 339703 349187 355510 361388 351922 341716 365354 403815 437690 476447 509468 533851 533866 537806
13036 537806 554851 563494 572408 627377 746736 920317 1114266 1167192 1084504 1057906 1129960
13025 1129960 1135720 1025374 954898 949130 947407 937927 892785 861509 854136 874957 943445 984681
13013 984681 1020702 1121519 1239093 1295808 1335956 1299253 1291676 1338043 1413270 1538150 1699611
13002 1699611 1875007 2014424 2143029 2175585 2184674 2202357 2278039 2487499 2806458 3129069
12992 3129069 3489772 3855892 4193990 4538548 4973179 5541973 6181735 6862470 7680951
12983 7680951 8709909 10052942 11766455 14023645 16431785 18516262 21583678 26235567
12975 26235567 32404222 40939022 54203810 75620365 112409238 178344446 291474603
12968 291474603 437496020 459325528 310692231 180278205 108573541 70224686 48507615
12961 48507615 35303280 26478983 20562016 16969374 14837669 13531042 12418740 10513999
12953 10513999 8391747 6907578 5972064 5349644 4985078 4889640 4914683 4743125 4328620
12944 4328620 3953926 3593146 3210359 2923952 2750901 2610848 2370849 2062148 1794693
12935 1794693 1606230 1474068 1417895 1409582 1423836 1386633 1293907 1185027 1068953 991721 928999
12924 928999 921530 924643 914570 883586 825427 815520 808411 777047 721541 666736 612215 585958
12912 585958 587935 600706 599690 626946 666188 735319 801025 850130 867374 923807 1032406 1026280
12900 1026280 824317 622350 493632 460442 486069 549587 578558 544834 519624 504663 521690
12889 521690 518906 442218 397470 353431 316813 256047 210878 200652 200220 188570 186201 206981
12877 206981 218313 231941 262062 270820 280883 304766 306720 289281 237789 199072 171769 135670
12865 135670 122352 124753 110676 107158 110923 123122 136641 152211 128568 109949 104462 97300
12853 97300 79967 77506 108963 159591 203620 182954 146300 147245 142354 173524 232193 301143
12841 301143 438847 497934 422176 333925 285890 267906 256906 224886 206103 202068 204758 177441
12829 177441 121208 103154 114229 123511 110708 90098 73898 81845 92322 84506 60298 78796
12817 78796 94497 108235 136691 166720 174676 180907 193231 136949 69228 40151 23722 5337
12805 5337 20616 57563 30856 13454 19944 37685 49462 53101 64652 53356 59815 85800
12793 85800 79237 60757 73131 74218 58449 19476 -3416 5143 5238 -2516 18537 22374 -32597
12780 -32597 -54638 -59841 -44418 17275 89779 108322 95262 92055 90250 109123 154291 156506
12768 156506 150768 179872 196635 213079 206429 159927 115376 102027 125878 223381 360606 376678
12756 376678 311978 228613 181470 142772 106513 87695 75985 99298 86652 42721 32228
12745 32228 38489 23950 7346 6789 10825 10741 10122 44178 49193 51969 54190 64483 65827 36930
12731 36930 42228 25469 8105 -2305 -6727 -33324 -21781 2896 2817 -3460 -15851 -20909 -11077
12718 -11077 -2273 24694 53411 58988 60187 69476 87612 61762 48830 51610 57663 76451 74662
12705 74662 84688 81748 56039 28227 3430 15839 23704 20331 13022 -7466 -24066 -35958
12693 -35958 -24578 -36527 -42744 -41931 -40653 -31787 -21582 -10127 -29394 -15488 -6245 -4151 -1198
12680 -1198 -34417 -43986 -46442 -33714 -18670 -262 5923 13046 -11547 -24649 -15318 12547 16815
12667 16815 1999 9993 20831 8486 2390 22679 30544 75152 153288 192231 180642 165456
12655 165456 152336 125032 85592 76393 104275 111056 107897 90636 61992 45104 32324 31211
12643 31211 49695 38246 29685 20058 11437 19396 23313 -8089 -26193 -23732 -34341 -40879 -50406
12630 -50406 -39176 -33457 -24061 -21840 -11224 1107 -12727 4925 5661 -11787 -16059 -12483 10288
12617 10288 1469 -1133 2698 19047 16356 -2400 -6716 -16136 -23852 -42276 -45923 -22974 -11949
12604 -11949 -8803 -12231 -3204 19012 45664 63830 64473 56056 41681 38477 18306 2751 -3932
12591 -3932 -6403 -23884 -34964 -28636 -8336 9193 1272 8875 12459 4596 1278 -4920 -7206 11827
12577 11827 28193 76191 145294 197689 224206 194536 124590 88993 69271 55659 41324 36207
12565 36207 43016 34408 17256 14395 31884 48677 53927 41943 19101 1695 5006 28455 46372
12552 46372 66993 65225 80368 70538 38672 39235 48642 34065 4171 -2291 -17814 -32034 -28709
12539 -28709 -11841 554 -18184 -37361 -39614 -14302 -5258 -13516 -16796 -2072 12775 18596 25357
12526 25357 46211 44764 27189 21528 8321 16079 22282 26731 26612 38347 28926 36454 24650
12513 24650 44415 31477 26123 33351 39020 31464 39386 50717 65166 54108 67463 108536 148740
12500 148740 208179 297913 431431 631191 971424 1532174 2258475 2383074 1677664 1010983
12490 1010983 608688 404699 290588 218129 151652 117625 87730 65878 58127 59339 55003
12479 55003 30624 18476 17365 -3392 -1175 24327 15131 6830 16024 12486 2423 -7756 -23780
12466 -23780 -20225 -19420 -13792 -8796 -5066 3072 23180 14779 -2647 -7701 -2450 5040 -3990 14346
12452 14346 12212 7090 2023 12378 6953 10792 -5177 -36869 -42225 -21987 14752 26540 11860
12439 11860 1932 -4740 -20908 -32594 -29022 -23031 -28432 -50254 -63232 -63959 -63179 -63016 -42070 -15456
12425 -15456 -1473 9757 32727 25180 2535 -9947 4405 9548 12745 16232 22277 20066 29057
12412 29057 38513 25073 15933 -3664 2415 21608 31756 39921 45021 25102 31722 35552 23806
12399 23806 25071 32191 43525 62050 88853 115835 133966 165209 211745 211601 148627 99420
12387 99420 42468 -1289 4611 -847 -4692 -23472 -36803 -35274 -13241 -7475 -4242 -16678 -23669
12374 -23669 -7917 -8096 -20503 1345 10102 -1106 -14115 -18766 -9510 -5966 -16037 -4818 28493
12361 28493 27225 31076 19491 -8948 -29267 -34160 -17943 -37894 -55426 -42460 -33680 -10573
12349 -10573 -4647 -516 -15605 -25384 -28081 -21188 -16056 -9890 13058 27814 11196 12299 18110
12336 18110 2837 1757 3953 -2094 -16831 -33858 -23721 -8912 16768 11440 -25218 -37780
12324 -37780 -29932 -24750 -10439 -22600 -49385 -58805 -24808 -26665 -54592 -64039 -56324 -38123 -22199
12311 -22199 4685 18943 17437 17548 13892 4711 8823 10353 10537 1924 -3271 14506 4156 25185
12297 25185 47237 49872 34148 19928 20049 -5281 -11858 1133 7951 -1536 -14929 -15706 -40499
12284 -40499 -21847 -1754 -11337 -16464 4520 5070 -7688 -16752 -13424 -16296 -12388 -5122 1446 -1953
12270 -1953 -13730 -11720 6912 34459 31619 17366 7998 1276 7183 10310 -10819 9773 18835
12257 18835 2413 -20268 -10612 -36578 -51886 -45666 -32453 -14937 11555 16189 21 -8456
12245 -8456 -13081 -20551 -18904 -9733 -10395 -5385 -14046 -23517 -29431 -13219 27644 31333 13365 17744
12231 17744 21959 35139 20847 13356 10266 14893 2125 -13313 3647 12108 5415 6209 31941
12218 31941 27720 21565 42203 46599 26751 10540 21037 21227 33027 39969 27287 379 -20809
12205 -20809 -25770 -36950 -25234 -13603 -10126 -19205 -43152 -32326 -30746 -41908 -8280 23693
12193 23693 36464 54182 37382 28272 20377 28321 11110 -12996 8356 6940 -3964 -10753 -3831
12180 -3831 -16708 4969 25001 39641 50317 30687 24311 9343 9865 19705 23620 30264 43749
12167 43749 72938 76243 65105 52478 35644 45753 62372 52466 34652 27476 31794 31691 28935
12154 28935 23075 32192 29444 33213 49585 53955 53077 59352 70128 73287 56836 43797 51506 65575
12140 65575 72189 83280 93194 154007 209568 265306 302909 350726 420911 507776 637769 806776
12128 806776 1091287 1554850 2343194 3586514 5092544 5643278 4408776 2840274 1814536
12119 1814536 1209502 855741 643975 480469 375060 314743 255295 208165 179894 170146
12109 170146 143281 102732 86762 74799 78371 75583 57214 56957 65983 55181 51651 49459 36470
12096 36470 37860 27482 24134 41039 47428 29968 11071 9043 17001 7870 4321 6770 -1744
12083 -1744 749 8960 8121 17355 38190 50843 48084 46538 37550 20190 26148 46978 31960 14598
12069 14598 11655 37965 60798 44609 53002 62262 53841 34837 24150 4600 -4074 1070 -3833
12056 -3833 -9398 -18237 -27062 -28753 -22718 -8848 -543 994 -2871 -7262 -21410 -29882 -27278 -29747
12042 -29747 -12874 17174 23850 13881 9645 10527 33838 47537 42237 31570 16595 18903 19782
12029 19782 38675 29334 20603 25091 20427 32830 39119 36414 9927 -10794 -7936 15059 32006
12016 32006 21955 3983 1914 4610 10505 7806 4053 10146 19893 4702 5025 -21836 -45467
12003 -45467 -49322 -27058 -17905 -29336 -41886 -45087 -33958 -17085 19555 33403 56194 64637
11991 64637 49062 30704 42985 26649 15913 9251 7085 17461 22542 37139 38634 28699 14219
11978 14219 12562 22728 38725 16237 2775 4968 8961 -4188 3046 18185 17299 29058 35377
11965 35377 31459 43798 35856 11494 -4326 -14185 -29084 -29942 -49436 -42819 -10055 1118 18659
11952 18659 167 -6694 -13053 -31481 -32431 -19028 10855 11387 14772 16492 6221 -15793 -28863
11939 -28863 -26373 -32819 -35606 -15637 -19478 -4061 12188 -1017 -13738 -6797 18410 34842 41676
11926 41676 19410 15465 34620 49656 58684 42970 34519 29215 21771 -13429 -16676 -24474 -46485
11913 -46485 -55816 -47952 -34273 -27454 -11526 4627 3928 6582 5591 -3952 7275 2704 19511 22591
11899 22591 7217 1276 -12449 -6427 -4331 -3145 -1140 5547 32309 35765 40275 46776 44384 55107
11885 55107 77437 62869 42731 38315 39389 38179 33502 39612 30951 50526 73749 68459 62982
11872 62982 46526 45042 39281 25850 34721 46079 51273 49212 47369 33592 24761 7052 2202
11859 2202 15011 8356 5206 -2888 -10007 -7257 791 2938 3099 9191 3269 10184 650 2909 2467
11844 2467 2964 10146 13037 19239 48927 55861 21851 30488 34092 29830 49375 56152 78597 82247
11830 82247 66081 59608 77979 79428 53670 40305 27478 24640 34688 11271 -5260 -10392
11818 -10392 -18252 -26256 -35893 -28286 -12788 -6259 30061 24580 10204 10285 -31 -16020 -8899 -360
11804 -360 19021 34800 42394 44289 50806 55832 29640 18582 23468 29316 36849 41937 44108 27677
11790 27677 28068 61361 64800 61084 56996 39101 32051 27464 18854 11830 15299 15895 13407 10647
11776 10647 2176 -995 -13646 -10202 -2832 -21039 -33610 -39359 -29738 -22606 -19657 -9587 931
11763 931 10348 -934 2920 26008 25052 15376 9534 5453 8463 7444 19506 15583 13121 33910
11749 33910 40256 26558 21362 31296 59473 63779 58598 36152 28749 14145 13104 23819 35658
11736 35658 37375 14484 -263 13568 9380 13287 9847 838 4396 -6999 -10112 -17116 -19810
11723 -19810 -21568 -6692 -1291 4174 21008 26225 22940 32393 39139 32088 2767 3021 2647 7914
11709 7914 9070 1038 17238 31310 38711 29474 7014 -10211 -15068 221 7888 19023 8926
11696 8926 17959 13178 -1236 2955 2310 -2963 -4762 -1973 -3281 -33141 -38102 -47711 -27120 -7019
11682 -7019 4194 19496 15073 10128 762 7517 18380 10202 29988 67535 62243 62351 77697
11669 77697 68081 60877 31486 24505 33001 28263 14713 14664 450 -4234 1160 15691 13026 14691
11655 14691 10253 12488 16305 12498 1938 7992 -518 2191 25486 44121 38274 25901 24107
11642 24107 10055 19342 26664 32188 23033 13148 -12760 -20375 8059 19255 8666 3877 8087
11629 8087 19434 25079 7618 6470 8132 15653 44395 40397 11539 23476 31880 9278 19135
11616 19135 46821 63883 66947 47652 42512 60323 79530 78973 65865 37520 28424 8087 -4001
11603 -4001 2368 5594 5700 -1870 2311 -4 13150 24462 17868 6299 10813 17742 -297 1189
11589 1189 -2501 -13065 -6026 10433 22563 37073 20891 22761 24266 20296 15895 15812 4437 6247
11575 6247 5817 29066 22288 10403 -9302 -5950 36822 49549 35063 17522 21320 11612 21321
11562 21321 16935 19957 22383 14843 6217 -7937 -1286 8267 33887 16593 11221 16647 19625 5628
11548 5628 -9457 -15984 -21733 -23433 -14425 1544 -10953 -16120 -21631 -14889 -5081 -1097 7696 -34883
11534 -34883 -34461 -51959 -41869 -12324 -10256 -17971 -22219 -14218 -24958 -35841 -35835 -23408 -2897 -438
11520 -438 13654 24443 27797 13279 25672 32198 -7400 -17420 258 48 9077 15632 21287
11507 21287 10468 11090 9262 18571 24741 27972 27091 16736 24990 42373 29972 31333 47201 25843
11493 25843 4837 5384 -2130 -632 14982 14740 13847 -6516 -13559 -13383 -26870 -30274 -22887 -19241
11479 -19241 -32991 -34648 -24825 -27297 -42412 -19580 -9356 7623 739 -8517 -3133 25068 18734
11466 18734 3258 6921 31363 34211 26284 18101 -2952 -18217 -4044 9123 15109 17834 8270
11453 8270 -6665 -6824 -16507 -9241 -5537 -6524 -6430 -1256 9845 -994 -4659 -8338 -6911 -14122 -29521
11438 -29521 -40899 -37534 -31740 3283 868 -10587 -16558 -37769 -54132 -45735 -13249 -4127 -723
11425 -723 -2773 1027 -2424 -6966 8353 19175 21376 22285 26255 17804 -1484 -11245 -17120 -15681
11411 -15681 11 -702 4665 -4618 2707 -2213 -20603 -39929 -43877 -29942 -34877 -26630 -3645
11398 -3645 -22563 -36268 -15721 4636 364 -9675 -10852 -5911 -1502 11256 11730 -4682 -9968
11385 -9968 -5154 -20149 -23847 -31903 -17196 -11666 -3353 10017 16954 15976 -4963 -4190 11495 8430
11371 8430 1600 -7904 7265 32765 21120 20905 22095 9797 4088 -1817 -15236 -23908 -29973 -9923
11357 -9923 -1455 19441 23693 41106 34361 13341 4966 -3033 -1595 -965 -8400 -7535 -14328 2560
11343 2560 19058 41564 58941 55109 51327 36407 24665 10934 8332 -18146 -9974 7848 8708
11330 8708 8778 27862 33251 33314 15739 -13546 -24698 5263 37576 31889 5144 -3363 -6336 6513
11316 6513 22521 39231 12967 -1840 -4947 -13896 20700 41254 33426 20497 13280 2599 21324
11303 21324 22767 20021 27694 32449 35993 33466 30341 20169 28037 44250 49637 60362 79955
11290 79955 70372 55994 59532 44994 30273 41286 28766 31266 40976 42346 45301 42334 41921
11277 41921 30917 15944 -5989 -9291 -14119 -36521 -54366 -22445 -17780 -7914 2808 19182
11265 19182 29350 17395 -9829 -23840 7667 31393 10355 12333 18058 24871 10094 28323
11253 28323 57965 31403 23646 31766 22904 19183 6785 -19744 -17234 -20922 -17199 -6947 16009
11240 16009 28058 11318 26316 43947 53455 32622 15649 27220 23560 24598 28391 24937 20099
11227 20099 31501 40357 39957 43679 45892 49799 44879 44068 53234 50280 47681 75632 84700 92983
11213 92983 112151 148385 202237 262209 366983 543143 860824 1320864 1691697 1704816 1684171
11202 1684171 1588086 1167092 746296 489875 343235 262768 214333 161127 143203 127962
11192 127962 110059 80567 50790 35793 52839 58722 66598 82606 82095 82245 84137 58397 43942
11179 43942 31091 22520 29031 27414 46454 45282 24226 18889 28558 43550 36022 24214 25036
11166 25036 36821 33487 37260 36311 36328 44865 47152 41637 27366 20486 35808 30212 55400 66677
11152 66677 33113 13641 14835 8210 24812 56424 54905 55161 63686 44248 34848 51178 52455
11139 52455 50103 40866 39469 44427 43505 28136 41901 53981 45446 34701 41954 53448 56408
11126 56408 18612 -17309 -17231 3612 34416 38963 17633 17699 -6008 -15184 -8351 -3005 -9298 -33269
11112 -33269 -55856 -70594 -84390 -83359 -54297 -33264 -41599 -26870 26498 68027 70689 80859
11100 80859 79428 59843 52401 36098 27024 43433 52492 35850 10311 -9740 -1348 18107 41652
11087 41652 62862 57062 31291 751 -7907 20337 49009 72305 84194 76803 70269 83078
11075 83078 99558 88334 79665 96995 96405 85059 71876 77481 61064 66986 62962 58368 70956
11062 70956 77882 67661 54092 63656 73150 80464 116537 161858 191517 236755 260819 252994 240859
11049 240859 189717 150410 159284 140314 111630 98434 81027 89528 84603 77381 77992 59040 35683
11036 35683 24832 32644 39584 41210 49690 26047 19718 27360 47126 49563 69411 84428 86145
11023 86145 67311 61440 63257 75523 78883 62162 48314 39874 52387 35667 17886 45477
11011 45477 39964 42356 75244 115475 141833 143629 136409 122632 80966 47508 30055 12335
10999 12335 7162 -4802 -18033 -17693 -6060 12850 49043 67915 80154 90969 125664 143231
10987 143231 161860 175935 193503 174852 137980 114750 101117 78883 58576 71299 108448
10976 108448 105771 71572 51633 46829 37720 40445 55555 75073 94619 102919 116602 133157
10964 133157 154200 124141 102575 99991 90994 87880 78082 49544 40258 46793 53251 43323 42437
10951 42437 42286 43385 54371 106091 144908 138531 124402 109763 96968 114865 114589 130669 127805
10938 127805 115596 89865 78494 72550 81269 94038 100249 110260 140262 193768 253867 297612
10926 297612 332134 395617 398101 388612 396361 396350 372702 365495 354823 339788 319340 311037 297017
10913 297017 276051 258385 265439 269436 234361 198656 177017 195460 218179 208642 219469 234393
10901 234393 256287 264582 261467 242923 212708 224180 234686 256359 255051 245444 245694 256968 291215
10888 291215 329049 332994 314221 307034 316684 330336 325500 318283 314796 302313 299057 300729 312446
10875 312446 353676 431105 512745 659333 820180 955655 1023668 1040318 1017035 937570 803037
10864 803037 723766 708057 668823 658811 654965 663368 680320 683162 680528 718392 767940 797075
10852 797075 821606 845835 841480 799144 826121 829468 813840 804111 838729 885868 943266 985871
10840 985871 1014872 1035394 1047756 1085827 1160267 1263472 1377684 1502971 1632927 1727636 1817934
10829 1817934 1873850 1948009 2093272 2297967 2557858 2904205 3335973 3858252 4536684 5404130
10819 5404130 6167652 6622024 7230194 7828003 8226677 8829929 9880865 11370804 13075363
10810 13075363 15129278 17835457 21051543 25247458 31515245 41112053 56189238 81719202
10802 81719202 126302733 199489241 285993882 312658751 301157268 306396106 257754309
10795 257754309 165792931 100947582 65066670 44761356 32796279 25460836 20508479
10788 20508479 17137864 14722353 12662376 10938482 9317894 7785981 6612865 5926337
10780 5926337 5665262 5628864 5368401 4934121 4676918 4208658 3531216 3017792 2723958 2521667
10770 2521667 2293455 2105230 1920836 1733814 1573097 1470232 1414775 1382501 1358277 1311306
10760 1311306 1254170 1178524 1080709 1037888 1009481 932697 904265 884088 872930 850534 801865
10749 801865 739812 668781 597212 536226 500348 459674 441715 457683 456689 455284 434049 440407
10737 440407 438677 412175 412418 430366 459373 441873 412774 386095 360575 355862 359337 354702 356694
10724 356694 363982 381455 400590 411152 426994 417515 381932 360808 326843 275969 234810 217403
10712 217403 201339 195749 189125 202476 198937 197327 195656 204431 215178 206081 207014 198987 192631 174544
10698 174544 151108 157370 141400 130910 115930 128661 142230 143922 129753 134437 151534 145295
10686 145295 115593 102154 89689 69864 43056 28297 9265 7287 24429 46828 83460 137184
10674 137184 204987 292816 320930 335253 362725 349010 309410 273199 251191 230075 213936
10663 213936 189797 168285 133336 124445 137882 120522 102181 108693 124894 140121 144663 153092
10651 153092 168000 188611 209656 258189 328410 417084 508335 556050 571535 510789 378969
10640 378969 263712 156476 98531 58652 47119 47379 42027 25267 23787 31098 32202 19140
10628 19140 18080 49132 63702 54522 64213 68753 50048 45913 49468 57048 68813 54915 35929
10615 35929 16476 -14126 -49008 -60737 -80706 -76170 -45649 -14460 11683 34185 58814 69006
10603 69006 87170 135137 143000 136421 138660 115647 101447 97340 82429 47720 1667 -31312
10591 -31312 -29154 -16341 -10837 -5510 13811 25555 48820 47416 19466 -4809 -4779 -1178 -857 8467
10577 8467 2088 -7070 -18125 -26945 -21309 -28404 -31878 -24494 -6261 -4816 36627 44835 27812 38203
10563 38203 27140 13204 9044 1696 -18980 -16088 -5308 1951 -991 8957 18952 14033 4681
10550 4681 -11011 -17825 -24317 -18049 2251 48701 46879 35649 20318 30267 45247 62160 72278
10537 72278 56320 53776 41459 35781 42328 61204 59305 35919 -1856 1591 -10825 -24764 -47170
10524 -47170 -58862 -57288 -58675 -52764 -42724 -46261 -32557 -20083 15523 32711 21282 26883 18923
10511 18923 -9363 -29691 -19318 2339 -10187 -12964 -2339 -4301 876 3419 -667 -9631 -14087
10498 -14087 -13075 -7210 -6009 13458 23552 7455 13640 71172 116776 128367 113030 112713 96582
10485 96582 83768 91283 91391 78938 74655 92580 66742 75835 66486 59113 84176 105616 103599
10472 103599 85426 106818 162620 220640 247930 245398 242837 215646 162582 101224 81709 57607
10460 57607 51513 35439 4812 3844 7401 10791 21745 12895 19603 21335 14766 23445 38315 42961
10446 42961 34133 45671 39702 28768 34443 16321 12577 22435 32244 8086 -18070 -4582 19234
10433 19234 41359 49692 44640 53514 57045 34961 28073 27193 24465 -1751 1177 -1142 -6381 -5137
10419 -5137 -8820 6642 2998 -9094 -23224 -7649 144 11950 -14613 -14560 14070 36693 45230
10406 45230 47892 52358 37772 11116 -6119 9087 37966 57298 60996 110424 174731 244876
10394 244876 315015 403837 559574 823634 1192530 1615203 1720621 1666970 1666996 1365106 883098
10383 883098 551833 368218 256144 197475 163604 118435 96187 94568 80627 71067 42421
10372 42421 37246 51078 28702 8914 8610 4963 4347 -3522 937 17646 14644 22371 7999 -1998
10358 -1998 -3499 -23954 -26770 -8354 -14587 -28120 -40315 -41322 -19583 -542 -19405 -31470 -29626
10345 -29626 -33341 -40269 -21184 3686 -21777 -17065 15243 29412 -4318 -7387 -8973 5517 3267
10332 3267 12750 12239 -11932 -16801 -2381 -3147 13291 28326 16425 15485 17961 22451 12937 7722
10318 7722 -21105 -24683 -28300 -13526 -33557 -38298 -34566 -39455 -61656 -79562 -83374 -43389 -2152
10305 -2152 -30445 -49169 -33069 -24240 -26800 -12246 -1455 6223 5308 -15208 -11698 -7691 -6392
10292 -6392 -16173 -6035 3646 8466 -6611 -7392 -13020 15615 5032 -2668 11562 16682 11958 -741
10278 -741 -39912 -71803 -52658 -29114 -19735 -23804 -17752 -21539 -1478 5830 -13655 -21414 -31991
10265 -31991 -34523 -32327 -31782 -37429 -36188 -7921 -1753 18808 31789 40220 37851 27014 26618 13107
10251 13107 -2478 -24311 -44409 -26352 4671 10355 -9810 -24539 -35635 -29853 -28675 -29864
10239 -29864 1438 23133 -11960 -24218 -13909 -1962 -15 4001 -1939 -26977 -26580 4970 -1967
10226 -1967 -5027 -192 9175 8163 -13412 -20529 -21626 -659 15029 9544 11759 36759 30033 35423
10212 35423 35535 19899 7891 12952 -8645 -230 10952 10400 11850 -12257 -20158 -26453 -20552 -6953
10198 -6953 -150 -2315 -5050 -13789 -18909 -581 -14260 -23928 -20228 -51 3413 10035 20350 11779
10184 11779 -9129 -12344 -22131 -3636 2336 22402 23722 19577 4013 -14166 -34056 -32141 -11895
10171 -11895 -14979 -1444 109 -19557 -33034 -30124 -15479 -4741 -4273 -4615 -10361 2925 -9248
10158 -9248 -28755 -36109 -22831 -16647 7245 21281 831 -15916 -8541 -10926 -12897 6898 -3241
10145 -3241 -10478 -5851 -1034 -7801 -25196 -31276 -7405 -9504 -10178 -3812 -11239 -8057 -8214 1645 9631
10130 9631 6291 14346 42410 40642 29254 14977 2838 -2401 -14011 -11597 -11074 -692 -17949
10117 -17949 -11156 -12096 -26168 -21820 -10527 -19455 -21759 -35686 -26243 -24864 -14165 -15424 -24694 -34068
10103 -34068 -28248 -18154 -6477 12842 4835 -706 3847 -2290 -11944 -1769 3240 -12103 -11198
10090 -11198 -16703 -12767 -24531 -41228 -38683 -43000 -20840 -24589 -32261 -16257 -7037 -22413 -29622
10077 -29622 -14464 1912 9480 503 -21182 -39142 -57084 -57814 -32017 -27716 -25417 -38354 -42005
10064 -42005 -38782 -27410 5144 25506 13517 12890 15891 9987 21677 25790 17615 11175 2509
10051 2509 6295 17674 3092 -24130 -31384 -26060 -16892 -14593 -30099 -27598 -34704 -35414 -21699 -5939
10037 -5939 -928 21915 10313 -1129 -3819 10313 4207 -14518 -8728 758 -3235 2453 5057
10024 5057 -17036 -24761 -28374 -30801 -17725 -1303 400 -12010 -7005 9106 12734 4654 5399 -6095
10010 -6095 -32512 -54766 -48074 -9903 26510 35489 8815 3235 8403 -10853 -31021 -56270 -48080
9997 -48080 -44532 -26853 2669 14828 13301 -3476 -6287 -13833 -18862 -21246 -37477 -40119 -35199
9984 -35199 -21437 -7613 21267 6129 12855 15246 25041 26711 19488 7958 1021 -7836 -12331
9971 -12331 -24635 -2512 3613 -5360 -19439 -11988 -6720 -12124 -23162 -35786 -29494 -31944 -31349 -22020
9957 -22020 -14382 10222 35015 34310 14078 -8459 -14030 9 19423 11210 -15206 -4934 -4012
9944 -4012 -26521 -7909 10730 10272 -13322 -30644 -34666 -15648 -13588 -24577 -33140 -28794 -5348
9931 -5348 11076 642 -2005 21055 67351 137356 237730 379238 512356 446729 248469
9920 248469 121276 56891 31904 31419 18230 -13491 -25411 -37773 -53208 -32450 1000 -691
9908 -691 -3498 18153 30813 21311 24023 19656 11834 21919 10503 3545 1284 20053 4286 5670
9894 5670 32825 48444 27594 6368 19369 -7480 -7795 5639 24144 27251 17515 21473 31233
9881 31233 38410 30358 19981 15236 22776 14797 10868 8051 -1791 6566 13921 19010 545 330
9867 330 5993 2168 7230 16584 11880 -12962 -22791 13711 15287 -3114 -17781 -14957 -2889 -3083
9853 -3083 -11408 -16608 -3457 10422 17574 9625 7036 8171 5229 3616 16321 39410 51610 31094
9839 31094 20646 12547 17971 4128 -11118 -16573 -14808 2189 23196 10115 14225 29143 44903
9826 44903 30069 -334 -10598 -7345 -11291 -21452 -25512 -20476 -12289 -7715 -13887 -14049 -4335 5533
9812 5533 5882 -804 -18872 1658 -1224 -17110 -16520 -16156 -11889 -4118 -22419 -26802 -13957 -15051
9798 -15051 -27709 -12478 -1478 -950 445 -4830 -23075 -23241 -13842 -11362 -14630 -21532 11555 17404
9784 17404 -6741 -16476 -21067 -22158 -15698 -31103 -30130 -33216 -40852 -33524 -20436 -7614 6398 5789
9770 5789 10929 32011 28844 24083 12860 -8229 774 35739 36019 19447 -784 -17816 -17845 -20208
9756 -20208 -8127 8881 14075 6217 -19540 -17317 9450 21952 3018 4300 13215 8483 5460
9743 5460 -15770 -12229 -28120 -30630 2710 25402 47332 17632 13157 31863 41953 30047 27892
9730 27892 15945 544 8447 16255 -1813 -17790 -11128 -13495 -15334 -13343 -9518 14879 25116
9717 25116 27421 19941 8633 13933 -9255 -13814 -20383 -16534 9333 37117 19520 -40 -4520
9704 -4520 -4862 -7854 -27614 -31159 -19320 -16337 -4274 -10222 -14126 8684 5640 -5028 5249 23901
9690 23901 37450 18463 -6722 8323 29797 3766 -682 8112 -6284 -35609 -49195 -35311
9678 -35311 -16751 -18137 -15933 -5961 -7672 -24153 -14148 -2226 -10957 -10175 -15234 -29242 -13190
9665 -13190 8258 -5655 -4086 -7320 -19422 -18356 -20350 -7599 12661 8070 20995 30222 16540
9652 16540 10432 -2204 -16855 -16686 -16074 -9238 -4892 -6842 -361 335 24545 22543 9979 7274
9638 7274 14852 6681 -18371 -32584 -2334 14533 6974 14920 33287 27343 37294 49334 30598
9625 30598 39222 42478 16716 5344 -327 1847 15036 22495 23581 16380 26719 14999 3747
9612 3747 45 -6804 3635 25486 45920 43732 47312 53688 58533 43889 24029 4775 -3543
9599 -3543 -6402 -3712 14248 22726 49348 51488 22971 6983 8397 19668 22352 8176 -11726
9586 -11726 -9552 17580 14631 15683 5249 4398 18316 38042 45685 40729 31752 20578 29952 38597
9572 38597 19128 18538 13691 547 19239 22631 7376 -6680 -7141 6904 28971 35674 40330
9559 40330 44804 29786 11990 32663 34024 28299 32652 33999 12862 -4730 -4756 18438 29983
9546 29983 13932 4195 6038 -1353 5675 24242 5583 -6939 -12284 -20410 -4325 8160 19497
9533 19497 3841 22346 20402 327 -4309 -22965 -28578 -29178 6820 22446 860 10606 23144
9520 23144 24711 12948 19688 25273 35840 26671 7631 -2757 -704 4299 9329 4134 -8471
9507 -8471 8505 20300 31331 41746 36973 23059 23687 23024 10528 4296 14504 29162 39367
9494 39367 43846 31677 35205 28434 28990 29623 28786 21345 9222 9221 10101 17490 19492 17767 19854 45054
9478 45054 37520 22570 38034 47818 41299 26428 29775 35852 22196 18805 13132 15906 29741
9465 29741 33943 16967 11900 24739 25138 26144 39344 42635 42107 32966 51193 74828 64935 44210
9451 44210 47094 40498 52867 59865 59262 62417 52147 45309 50622 48761 42391 32922 39909 35134
9437 35134 30760 52935 70586 58041 36462 30409 34739 21520 31807 44684 41889 48428 62673
9424 62673 56673 55933 56186 69000 69007 73817 61106 40868 39953 59496 74218 79520 96275 82032
9410 82032 72862 66916 71062 64997 44327 37292 44029 46338 55755 66662 59672 63525 42952 51734
9396 51734 59647 57473 60082 67872 81715 80000 67262 85153 89920 81198 73876 57221 56360 73922
9382 73922 83449 96571 90172 93430 109035 129267 111045 98687 91185 95764 92719 100068 110688
9369 110688 93794 93076 105444 121431 134830 134988 121911 119514 125475 120009 110460 119142 127667 112194
9355 112194 103538 117297 148620 157803 138683 113828 111749 128165 108176 109153 113121 138970 162359
9342 162359 150793 150928 143006 139024 135560 133951 139198 159049 154863 148986 128614 119460 131997 141257
9328 141257 149282 150925 149930 140613 158704 172984 162638 147209 143464 149817 160239 160455 157864 160014
9314 160014 177818 205074 209400 214740 199144 191260 196882 196408 201563 193733 181121 189877 196698 195610
9300 195610 188262 209927 229314 234273 236136 253590 227548 210479 227654 230058 231253 234891 244760
9287 244760 261057 265756 289231 282715 289408 306187 294377 286979 282940 275740 279174 292037 293912
9274 293912 298367 300765 317609 318705 304954 301769 309021 327011 362298 374156 392852 408845 429615
9261 429615 416447 406483 404991 409301 406004 423804 446703 446723 438446 458108 478312 501271 506655
9248 506655 508376 481609 480118 487089 501880 498014 498271 515035 524863 531393 547774 559861 580404
9235 580404 593013 592403 597002 613742 618381 641814 645886 661051 672834 674102 678672 705017 725086
9222 725086 726318 723432 725483 735264 747903 767529 802180 807233 819878 853418 865368 869551 885468
9209 885468 891479 905255 942003 965407 987352 983245 965511 977809 971683 961369 970121 985950
9197 985950 999972 996880 1016534 1052780 1064832 1080908 1096627 1104735 1096090 1110149 1103597 1104894 1121355
9184 1121355 1128479 1122059 1136869 1152978 1151471 1128933 1143736 1136555 1140221 1153346 1149391 1137988 1130826
9171 1130826 1153307 1139178 1128778 1129765 1136012 1131455 1129317 1109581 1107640 1116625 1109533 1106839 1075391
9158 1075391 1062760 1060988 1044217 1033416 1020552 1026512 1015433 986905 977673 970741 954830 937159
9146 937159 906295 911313 920030 916447 890924 898188 884938 867934 860755 848393 837028 799587 773100
9133 773100 748259 749910 735235 742117 761197 762378 742672 731669 705393 668054 629399 615776
9121 615776 602898 602321 579835 581959 604513 649894 639449 625768 589094 577701 577709 581195 587955
9108 587955 576837 544257 509346 502114 517785 521359 506539 492181 493355 492141 484504 472084 432919
9095 432919 424587 425415 401559 393411 403456 397858 355837 358892 371020 378028 384134 390028 392611 385403
9081 385403 365384 352349 347797 331535 313005 319084 310907 303893 287306 284637 290915 293176 302859
9068 302859 282048 285798 265713 243716 251862 271317 266401 254140 237963 248176 254783 253995 261841
9055 261841 242792 247305 254179 244433 233832 224766 222818 231333 225293 207591 214461 204357 181282
9042 181282 187397 199571 193910 202583 211916 213788 206585 189692 179326 193588 189697 180355 178956
9029 178956 186104 186335 172141 163083 165670 163711 168553 176489 168293 170671 179011 172266 173271 177723
9015 177723 145517 121138 113683 123990 112894 113127 148142 148568 140049 137287 123537 115902 115646 121255
9001 121255 117502 112230 138631 144313 146871 148774 150097 152525 165825 154899 144162 108692 110120
8988 110120 100799 106258 107861 104611 86828 66185 69777 92604 91061 73564 91686 124235 119664
8975 119664 93057 83234 75464 63519 60556 44958 50713 49416 68240 113360 90298 69836 82787
8962 82787 79675 88328 76350 66772 50522 37245 43637 44349 69489 87804 77935 58823 48466
8949 48466 50755 60760 59503 71929 82678 64656 47251 50651 68255 66487 86811 92997 81223
8936 81223 66463 54288 81326 91267 70359 50225 56169 52516 46170 52654 84472 95553 86809
8923 86809 73175 67619 72845 60535 76405 83507 73076 82302 59509 45060 28794 32466 31725
8910 31725 46943 54220 54744 52035 54897 47623 54858 70700 78206 72075 79017 68046 39261 18500
8896 18500 8530 2931 10386 29621 34091 60130 77793 71546 55129 49022 45729 31999 33475
8883 33475 54219 68662 80342 93198 80443 69902 60060 42966 34907 31405 34287 35427 28041
8870 28041 8543 -5107 35678 45068 39307 51686 70780 64258 59879 51076 42291 29877 16997
8857 16997 21218 13458 5426 19520 16963 18491 36107 42663 41269 40614 53860 59093 64152 24388
8843 24388 19406 21049 20424 25647 30101 39973 50760 61828 70276 61177 52892 46009 43016 37655
8829 37655 25481 10473 31132 30492 36062 50740 42332 53677 49083 32051 34771 27634 11185
8816 11185 24977 12132 -6491 15243 13977 10122 5530 8791 19502 37375 40618 37298 11824
8803 11824 3396 12288 7748 12401 39961 48872 33551 43930 50707 70192 80922 47801 50334
8790 50334 61048 26659 7295 23639 35331 40597 51675 41169 15601 -9226 -16521 -15906 -2441
8777 -2441 17837 25023 35904 33238 14645 14042 7821 -7385 13928 31692 28180 31603 34633 29260
8763 29260 1489 -24870 -35109 -38683 -18136 14578 28859 28659 39278 22888 21702 21254 4705
8750 4705 3560 13814 26642 39142 34710 9112 -4923 -9493 1043 30226 51447 43388 44488
8737 44488 35786 37651 34531 28184 27623 18592 15221 14502 20402 23238 17887 11694 33543 25737 21587
8722 21587 5506 3375 -2478 15208 14481 -2274 -25346 -13270 9283 31508 29091 20190 14944
8709 14944 927 -16561 -11471 7603 12526 13624 21165 7909 6664 24069 28694 30066 28282
8696 28282 30013 40337 20113 15861 21716 -5564 -15456 -5099 11603 -2960 13356 24843 23687
8683 23687 4845 -12992 -16971 -15610 -4612 -12581 -28043 2665 19589 10608 30702 35432 10874
8670 10874 9968 3380 906 8680 30878 45982 47394 46841 43233 30984 20201 6560 -10696 5296
8656 5296 -1748 -5390 10276 -1096 -24848 -21499 -11681 5093 18232 14417 -509 7806 13946
8643 13946 2603 -3347 5899 -387 6532 18927 18278 -898 4273 14136 23090 41888 45094 46438
8629 46438 75970 60558 46774 30922 7546 -13889 -21628 -25932 -23194 -15355 -16021 -17019 -16864 -11146
8615 -11146 -19272 -7566 18957 9005 -14823 -11163 -2650 -12262 -10572 23181 22226 21934 17985 16392
8601 16392 23924 19278 19824 17089 23712 15582 6716 -7230 -24191 -6430 -6928 -35235 -36015 -6002
8587 -6002 19811 26305 39696 30161 25866 27203 10392 10080 34654 44278 45168 37738 22768 29790
8573 29790 23247 12694 27045 55621 60079 62249 53016 39785 29120 28555 27107 24764 6786
8560 6786 6563 6115 4521 -2654 -7889 -3239 12140 14795 13817 2572 -6525 868 -8865 -20913 -27515
8545 -27515 -24578 -19285 5217 35157 38366 37330 41185 31154 10533 7808 5018 -10001 -23022
8532 -23022 -6423 18149 14071 -16873 -6835 -11413 -5658 -14582 -20908 -19964 -2358 9173 7143
8519 7143 17637 23439 20631 12388 6656 16971 448 -5715 7446 8090 -5296 5478 22628
8506 22628 26654 7080 10015 -6242 -27634 -30522 -21572 -28024 -29837 -12510 3258 8407 28591
8493 28591 26246 32654 45891 19023 25967 18031 5928 -21229 -29865 6357 29098 28327 8774
8480 8774 12344 27835 9253 11595 24750 25942 26485 7477 -2832 5140 8021 14585 1431 4673
8466 4673 -4514 7967 14778 7762 -1481 -4419 -7245 -8756 -6483 -2168 13771 11854 33327 28987
8452 28987 13499 20769 27504 37197 40904 39358 26294 10965 -10140 -35217 -17431 -1297 -14482
8439 -14482 -17247 -12588 -2437 -560 6867 15083 4143 -18934 -25929 -13188 -1906 1560 12231
8426 12231 21925 15421 1873 -9829 3672 -8216 8523 925 -7741 2533 -6236 -9022 17449
8413 17449 15944 -12420 -15685 7191 1016 -9915 -626 21475 26120 24907 10553 -14912 1082
8400 1082 9698 -16242 -9971 -14363 -11725 -1508 11827 13039 -5972 -27428 -19056 -20146 -15050 -15709
8386 -15709 -10815 2028 22898 22849 27902 45328 37361 9747 -4251 5555 17167 31784 24389
8373 24389 -8540 -16873 -828 -16352 -27235 -26750 13217 3699 -36 5346 14174 16926 4946
8360 4946 5683 -3564 -18860 -23180 -10238 -17152 -11935 -7958 -42648 -51620 -21981 -18950 -27192 -25089
8346 -25089 -20503 1569 10530 13774 7862 -8302 -5091 -10698 -9689 -25457 -15512 -2487 9661
8333 9661 36005 37693 20671 3655 16883 33320 36617 19179 14028 2953 -21267 -9958 -12574
8320 -12574 -9566 -16332 -28056 -31471 -33055 -41932 -31737 -23626 -8057 14087 16160 10647 -1442
8307 -1442 -14615 -22927 -10691 4022 -21525 -45337 -28181 -14044 -1758 10438 40110 15701
8295 15701 18834 34846 20719 17750 11534 10056 8075 1298 433 19041 31336 49101 37167
8282 37167 34270 19989 13328 21968 19962 20700 32373 13866 2158 13369 21417 -1066 -21036
8269 -21036 -9555 146 -3910 4072 12698 17711 14881 19996 30535 29601 16678 24151 18776 25248
8255 25248 36506 38259 26126 9034 17827 6007 -22813 -43695 -45685 -34661 -16805 11835
8243 11835 25820 24151 4706 2494 9856 -4972 -8964 -17304 -8373 26528 24880 -13091 -24885
8230 -24885 -8146 -7938 -79 25598 36923 34755 25046 15247 8478 6767 225 46 12105 8211
8216 8211 -7069 -12056 2638 -1994 -21451 -11457 -6908 7737 34732 12605 5262 -11838 -4777
8203 -4777 -8469 -12302 -13180 9006 13029 19513 15343 31549 32415 27832 21687 12052 -7054 -4423 -8205
8188 -8205 2949 18222 33550 12687 -4545 -974 25383 21512 21803 9915 -2699 -5907 -13228
8175 -13228 -2681 4793 17550 18289 1863 2010 3087 -111 -22104 -53885 -39656 -18037 -25573
8162 -25573 -21042 -12104 -8241 -19782 -39443 -10360 4844 -13135 -16254 -13910 8659 -6820 -3573
8149 -3573 8265 4367 5793 9632 -5700 -18316 -15709 -2290 9007 1394 7257 -2007 3691 6726
8135 6726 16956 37072 21247 -28166 -24422 8416 17546 2938 -11253 -15677 -19265 -2039 7654
8122 7654 19183 -1173 -8843 -8974 -7690 -3184 -9974 -20765 -8785 -10530 -1027 16134 15091 -4927
8108 -4927 -27938 -30205 -36804 -15301 -8710 -17702 -33580 -37520 -10710 7133 20591 19470 28500
8095 28500 44417 47735 4819 -20391 -42553 -43851 -339 1763 -27177 -29492 -17174 -27158 -23410
8082 -23410 -28898 -34176 -25020 7723 4115 683 -10111 -18464 -10931 -5970 1730 1390 13082 12221
8068 12221 8488 11512 11178 -1247 -19479 -19257 -10197 -18558 -33219 -36896 -33651 10303 30159 7523
8054 7523 -3539 1339 23467 11122 18185 -2612 9471 13147 14125 19350 16169 37161 51008
8041 51008 28976 16020 28028 32194 21568 16898 -797 -14052 2558 7295 -14888 -13438 303
8028 303 12684 14157 13905 16074 11136 24942 32472 8137 10490 17922 25636 14946 -9802 -7556
8014 -7556 14226 42024 49857 31844 24804 20284 11333 18228 31205 32981 21319 16225 29058
8001 29058 40242 34637 21438 34466 61418 49912 55990 39494 24822 20287 18022 19901 28722
7988 28722 22924 12771 19761 27967 19833 28251 41432 34031 28508 39362 15457 -10508 900
7975 900 2541 1081 25064 49428 40848 37352 17014 -2552 7985 10091 9355 26191 30116 33550
7961 33550 22006 15888 26656 28177 39249 21029 10741 -6159 7407 10383 12460 14328 27776
7948 27776 25995 15714 8018 25634 35528 35783 28120 7936 -15007 -8200 107 -4717 -1826 7302
7934 7302 1902 -1529 8455 5435 3447 478 18838 32669 22410 -15240 -30656 -103 10286
7921 10286 -10138 -25730 -22223 -13391 -7227 17828 16413 15033 21747 4675 -13139 -11230 -13061
7908 -13061 -230 -17137 6422 3398 14102 17624 7774 -12070 -25623 -14776 5916 22755
7896 22755 13987 11810 4295 -14152 -19603 -19848 -19448 -13914 -10940 -1745 10299 15332 18782 29233
7882 29233 34538 23777 24752 32047 39440 42064 28232 29552 27022 12359 9395 12030 12265 28204
7868 28204 26209 26311 37537 10207 9990 -502 -5322 -6784 -9619 4524 17291 10339 6413 7382
7854 7382 14232 14884 8741 -15062 -10114 -5659 -24680 -38665 -31269 -18067 -17868 -14341 -10864 6320
7840 6320 5878 -10432 7822 26575 31832 14208 -11206 -17574 -20222 -19106 -13653 -13549 -18170 -15152
7826 -15152 -2964 -15635 -20174 5337 -277 -25760 -14027 12651 992 -6887 -5446 -12122 -35212
7813 -35212 -29666 -25701 -18127 -11666 -8325 6512 7755 16967 17676 -8451 -20968 -105 -6155 -23259
7799 -23259 -15792 -16536 -8408 4327 -1742 -11130 -5433 -9567 -33568 -59445 -46535 -20791 1107
7786 1107 9767 -1273 -7224 -22348 -30586 -24723 -19419 -23319 -23846 -21613 -22415 -14243 6460 8354 14040
7771 14040 7190 8925 -322 -20261 -15284 -17661 -15472 -28176 -20914 1493 4532 9332 -26516 -40644
7757 -40644 -16463 6525 -3394 -17682 -26945 -13642 -8373 -1086 -8899 -17476 -13061 -8220 -5154 -14492
7743 -14492 -4419 6523 -11029 -18453 5230 36043 43032 11827 -15683 -24895 -8644 14197
7731 14197 10554 3331 4193 -8679 -12220 -12741 -13047 -9326 -6670 -13969 -19307 -18492 2912 -4534 -18623
7716 -18623 -20298 -10855 1536 -10449 -6617 -5068 3961 -383 -32128 -16253 26830 29866 -1992
7703 -1992 -2893 20592 29062 29017 25909 10325 6418 -309 -12440 -18055 16272 34318 29284 14430
7689 14430 14503 13025 -12683 -10547 4158 -5035 -20814 -4316 -17303 -46957 -63092 -48275 -37764
7676 -37764 -27453 -15032 -23151 -38314 -44941 -36357 -38893 -54803 -44870 -37399 -15531 -10177 319
7663 319 6738 17573 12785 8555 6398 5160 18236 2524 -20898 -20993 -23861 -8542 1846 7550
7649 7550 5111 7200 -1992 -3478 -26203 -42811 -24307 -11933 -9727 -22448 -19360 -21822 -15557 5136
7635 5136 -2795 -387 11287 28384 1060 -20634 -14177 -20791 -32573 -4100 -2206 -4949 -11378
7622 -11378 -17898 -43748 -39343 -10066 -831 -10892 -3072 2579 -2811 27210 42895 28537 4037
7609 4037 564 15702 18737 7793 1608 -16754 -26434 -17055 3835 32467 35562 21192 4386
7596 4386 -23348 -27226 -13750 -5837 -539 17842 15307 -8926 -16823 -3183 11531 19208 16318
7583 16318 33238 34283 31837 33991 5864 -11007 -18790 -13936 6159 6461 5940 6800 3230 -1488
7569 -1488 -16926 -35576 -27626 -24799 -90 11898 -2140 -11795 -16085 -29668 -20479 7827 6305
7556 6305 -4109 -13296 -16509 -13551 -14931 -37915 -34537 -6353 -6554 -23735 -44968 -41362 -32603 -19372
7542 -19372 -26324 -48674 -41414 -17156 -22598 -27844 -1057 23896 9267 16939 29197 11675 -1216
7529 -1216 2519 813 23937 28286 20562 5096 5632 -18136 -27073 -28223 -9838 -7509 -2117 16016
7515 16016 23601 12218 -150 6344 10990 1877 -23227 -19358 -18234 -20159 17970 37362 31767
7502 31767 15101 6907 12018 22232 25652 20621 -5230 -19347 -16260 13986 20016 2217 1857
7489 1857 18054 29149 13827 -18453 -28238 -29893 -7712 -5411 -24088 -34401 -18077 -11152 3622
7476 3622 -13266 -21186 -23728 -7151 12408 24935 25603 39836 30346 19366 35144 26808 19109
7463 19109 4122 -17838 -18884 -13375 -20852 -15275 -7774 4666 19517 -3372 -25656 -23739 -12363
7450 -12363 10235 16710 13924 2892 -1940 -110 -13396 -26678 -31316 -19062 -2825 -3410 -5856
7437 -5856 -4435 -12003 -1104 9829 9472 11731 6872 6304 -2996 -10038 -7589 -2433 243 289 -19979
7422 -19979 -37610 -11520 6234 -8412 -12574 627 8728 7826 -11888 -5717 9624 14042 -1854
7409 -1854 10492 2482 7372 9603 16915 -5902 -6472 -4988 681 -11384 -2958 17748 28669 -3991
7395 -3991 -19007 -29867 -34145 -18917 -11305 -20563 -30326 -8612 14608 4227 -13887 -10327 -17904
7382 -17904 -14960 -13611 -19034 -44962 -34197 -23169 -26266 -29661 -12875 -6064 3782 -2842 -15029
7369 -15029 -37614 -44907 -40418 -29245 -10175 -21655 -13507 -1807 11923 15633 4400 1415 -18464
7356 -18464 -28661 -32544 -17022 -4921 6495 7424 -14418 -10342 4978 8422 14950 19430 8781
7343 8781 -9412 -14771 -43956 -73879 -63827 -37622 -48373 -50869 -28256 -29449 -56078 -66641 -51151
7330 -51151 -33199 -28932 -30967 -30293 -37928 -38063 -27826 -28966 -26773 -19367 265 10243 1636 -20584
7316 -20584 -26122 -25614 -10426 -629 -1013 478 -10104 -15941 -15492 -5533 2643 -9591 -31480 -28812
7302 -28812 -17833 -11299 928 2284 4468 7177 12187 11361 16125 -1443 -2885 25300 18848 -3698
7288 -3698 -15772 3569 -4468 -12410 -11061 -17238 -19390 -26669 -29361 -30366 -18034 -121 2312 11395
7274 11395 18857 7140 -8813 -5161 14990 28101 17170 -2699 10350 14126 8662 10131 14800
7261 14800 10661 897 -13906 -26825 -29219 -35264 -30845 -21160 -10112 -18319 -14776 -5071 -12593 -7848
7247 -7848 2460 1331 -12330 -12600 -5362 -9450 9492 17877 30715 19912 -17452 -37758 -55197
7234 -55197 -35520 -15474 -4814 4783 23836 19435 -30685 -37624 -10503 1830 30400 19242
7222 19242 -9098 8575 22765 20041 -7765 -15647 3730 -13197 -27535 -7307 -27210 -25320
7210 -25320 -14488 647 -4050 3648 5118 1786 8312 -17204 -25274 -18966 -14543 -17495 -13825 -20967
7196 -20967 -22846 -13260 -14570 -25180 -36163 -32350 -20808 -11503 -1720 8797 -16165 -26268 -5181
7183 -5181 -15796 -40846 -37449 -15790 -40272 -66291 -48446 -43002 -42698 -35897 -33353 -16198 -32772
7170 -32772 -42031 -39782 -36313 -17896 -5233 8174 900 -15639 12090 9966 -3032 -1380 -20451
7157 -20451 -23584 -26779 -10506 -1 7983 -11948 -13656 -421 -5377 -20590 -42587 -53286 -48816
7144 -48816 -30032 -26072 -18474 -4775 21373 24685 19851 5632 -6518 -23753 -9339 295 -21392
7131 -21392 -21857 -12289 -15063 -19246 -10459 8466 10954 6110 1149 4294 -16737 -33093 -43485 -26700
7117 -26700 -23656 -10066 8007 7193 37104 29456 21597 19646 -1411 -24589 -31050 -25460 -596
7104 -596 3456 4298 29178 13247 -12294 -8116 -5970 3806 -6622 -25204 -35864 -50517 -45479 -41475
7090 -41475 -63352 -67857 -56035 -46126 -24581 -32904 -29795 -32937 -36370 -16685 -18619 -14321 -19182 -15476
7076 -15476 -5375 -6319 -3624 -6437 -3374 66 -7650 -25722 -47847 -64398 -53532 -35723 -34073
7063 -34073 -37342 -31595 5690 4704 -9109 -8059 3735 41871 41506 20792 9121 12629 14743 14096
7049 14096 12712 -53 6918 -1771 -12651 -22183 -1623 7920 -53 -28879 -31026 -29073 -43812
7036 -43812 -45943 -39194 -24045 -6184 9011 -4474 -15748 -25358 -21969 -15379 -46052 -40254 -23688
7023 -23688 -6580 5878 -17083 -13081 -5076 717 18481 25646 7467 13836 27106 17749 -11700
7010 -11700 -31232 -49123 -30050 5137 21428 5889 8656 35799 39233 20102 20916 22935 19011
6997 19011 15134 10621 14005 25204 13148 -4413 -23573 -20650 -369 20806 30461 13344 3204
6984 3204 -6495 -16337 9588 26441 35264 43336 24549 -3595 -21966 -9302 -527 -14913 -6641
6971 -6641 16190 26590 8903 -2027 -31496 -30238 -19274 -22438 -9654 -21875 -18322 -11944 -6536
6958 -6536 -2121 -6161 -28021 -29253 -2936 19450 15645 -4238 -13496 -12277 -23689 -38558 -29826
6945 -29826 -29822 -22856 -47181 -38583 -20529 -22543 -28876 -22741 -16165 -21587 -24179 -29683 -12328 -12060 -32889
6930 -32889 -9585 12274 -3033 -19610 -11767 -22784 -15860 -9151 -9984 -655 -3329 -2510 -21251 -26922
6916 -26922 -5351 -7163 -16411 -36403 -56368 -68872 -51021 -49420 -60055 -70021 -51279 -43541 -39718
6903 -39718 -35269 -12739 -56 33010 49838 42194 16903 -9198 3987 17200 31132 23875
6891 23875 17681 21379 22160 20156 5356 -14752 -21303 -28555 -12476 -21878 -9871 2468 9970 -1977
6877 -1977 -14887 -30175 -31202 -28999 -26812 -17564 -3041 7431 8122 -1698 17866 32115 16255
6864 16255 25390 23187 9777 8791 10001 17826 23036 8903 12425 26326 11698 -25287 -33813 -33525
6850 -33525 -21408 -16880 8456 14285 19113 23826 27117 29178 25898 24314 12653 1255 2062 4933
6836 4933 -5315 -10690 -4678 -9209 -13219 -31732 -34484 -27860 -38586 -48583 -24111 -18458 -30661 -25423
6822 -25423 -17320 2587 18000 -6630 -26523 -8420 -21162 -15798 -16094 -11730 -4824 -9624 -31189
6809 -31189 -34844 -13771 767 4755 -12736 -17799 1348 8269 3481 -4683 -26360 -26519 2954
6796 2954 25237 22867 -3500 -6922 -8870 -22199 -30634 -24792 -18576 -24347 -21298 -4335 11285 9346
6782 9346 13187 -3337 -15405 6589 280 7080 -14960 -22852 -19562 -10776 -21568 -39326 -49600
6769 -49600 -50674 -31696 -8176 -4382 -16953 -3483 -17253 -36276 -17193 -2599 -3416 -8994 -3610
6756 -3610 9350 14944 13545 6403 -6234 -21718 -22156 -27381 -13102 -22469 -14182 -9988 3930 -1309
6742 -1309 255 -3613 -59 15448 6604 2818 10990 23082 2941 12832 25854 14876 10409 3234
6728 3234 470 -852 -6708 -2463 -8253 2393 10493 -12100 -11555 11057 13905 -3682 -19665 -11083
6714 -11083 -9973 -2654 3018 3687 11120 31266 31279 6780 7169 16505 24343 28624 21532 22052 2332
6699 2332 -5502 -9057 -7563 -7292 -28936 -25845 -9061 -13606 -527 -2931 -7149 -5179 788 5473
6685 5473 -278 -16219 -30799 -38778 -19916 -11153 -11233 -21858 -19450 -11443 -18351 -14033 -17401 -15550
6671 -15550 -12764 -13914 -23125 -23999 -32389 -34273 -36987 -31678 -7460 -2800 7299 18019 6880 8879
6657 8879 11690 3961 32186 47778 41067 37531 35903 64562 53385 17438 -11396 -2114 16936
6644 16936 15473 3862 12042 5383 -9963 -23840 -24938 -9059 -7893 -17323 -14855 19 -19584
6631 -19584 -22716 2466 22786 27017 38703 24439 -6419 -892 -8612 -3232 -2311 11732 -517
6618 -517 -19117 -19824 -32408 -60923 -47625 -35492 -57692 -45225 -25694 -24775 -21804 -7649 4427
6605 4427 24451 31329 43193 32855 14662 -4671 -3004 -2262 -6829 -2234 18903 30903 11532
6592 11532 -25037 -24940 -20169 -17253 -26337 -18401 -14429 -16418 -22512 -44835 -41826 -11294 -12984 -23273
6578 -23273 -21639 -17823 -25221 -17454 -24996 -52579 -44578 -34938 -23999 -7939 -10625 -25533 -23555 -22369
6564 -22369 -20848 -31357 -14371 3725 14662 3982 -3933 -244 6118 1705 792 -8230 -14921 -3057
6550 -3057 3168 -5072 -14276 -20511 -29096 -22272 -37005 -48000 -33992 1273 6465 1997 13296 17429
6536 17429 268 -16800 -16963 -18578 -364 7343 7427 14837 16451 15046 18909 -14789 -9669 -8502
6522 -8502 -7488 -12224 4067 4991 10466 -2065 -16211 -4183 -4968 -386 20561 1272 -7163 -14482
6508 -14482 -19565 -19472 -25547 -15342 -8530 -3888 9221 5046 20178 14133 -7906 -19054 -2047 652
6494 652 -6937 -6223 18114 21298 20689 13857 -2330 9596 3924 -10897 -870 12851 8444 -3859
6480 -3859 -5468 -3844 659 22369 31997 33097 41009 42178 15147 15532 29331 12966 4317 18701
6466 18701 19154 22953 17603 -1498 1872 702 -25420 -35171 -36160 -12121 9957 2706 -20324 -34296
6452 -34296 -39924 -27481 -24554 -24089 -41878 -54357 -38090 -15668 -25756 -30011 -26604 -26823 -31826 -28323
6438 -28323 -30619 -34380 -4438 -12181 -52232 -43016 -3245 -7154 -18401 -15014 4599 18437 8362
6425 8362 14615 34867 20819 -12729 -20539 -2264 -764 640 23184 33981 31440 14714 21747
6412 21747 25525 3034 -15658 -12427 13118 27057 4952 1241 -20882 -18458 11557 24471 35267
6399 35267 43312 5170 -11207 6971 -5183 -1356 4319 4733 3679 24433 26693 34671 25147 9685
6385 9685 480 10136 8453 13241 4779 -23092 -37453 -6278 13434 -9767 -34785 -35222 -17382
6372 -17382 -10314 -2694 -2205 -5434 -18092 -9211 -4376 -4660 21103 -7765 -29513 -22626 -11253 14919
6358 14919 20354 17489 3804 5865 -18040 -24874 -29344 -29317 -20494 -32563 -31978 -27950 -32319 -58785
6344 -58785 -67023 -64634 -51223 -42520 -36871 -11851 2546 -633 -7385 -11842 -16610 -29535 -42938
6331 -42938 -29367 -26304 -8549 19035 24148 12166 -6139 -16500 -1915 518 5994 2779 2212
6318 2212 15936 30519 10987 10424 -3843 1129 -87 -28808 -29755 -16282 -21329 -7589 6 -1850
6304 -1850 5312 22986 11072 14933 -4403 -34454 -46541 -26256 -899 -2860 -23799 -30132 -21140
6291 -21140 3643 12670 -18059 -34182 -8546 -3831 15195 18515 2860 10065 8720 2504 -11210
6278 -11210 -15585 -17634 -5551 779 -947 11375 34569 27896 26769 -9088 -9040 -4770 -3025 3091
6264 3091 -6497 -31255 -32458 -16376 6750 1484 -11926 -15446 -27958 -29049 -2004 -11849 -34827
6251 -34827 -28116 -9148 8918 -4867 -17075 -3003 -11887 -15421 6989 9051 -665 -10747 -45454
6238 -45454 -22355 -6626 4532 23222 -14 -13686 -8633 563 794 -17965 1387 -7419 -14646
6225 -14646 -24366 -41444 -50034 -32187 -26949 -2098 -9769 -20653 -30676 -34592 -12915 751 -2565
6212 -2565 3688 3929 -6160 -12256 -7031 -12709 -9588 -12030 -8187 -20249 -33798 -34589 -44822 -28912
6198 -28912 -9137 -4416 -33002 -38466 -35699 -18573 -7633 4300 20097 10947 2337 -7395 -24120
6185 -24120 -16819 -15047 -21760 -8279 -11454 -27310 -26073 -10272 11318 3763 6779 -1296 -2141 19217
6171 19217 53683 46869 14580 -8789 -14273 98 14840 -9480 -26482 -30104 -14631 5129
6159 5129 3490 -3795 -16654 -4044 7063 2819 -26706 -22795 -858 19810 14004 12231 12915 5658
6145 5658 -23259 -23127 378 918 -9559 -32958 -28367 -21315 -31878 -37872 -38983 -18251 8463 16201
6131 16201 24331 5433 1305 12866 14582 23437 -2154 -30107 -26807 -15474 -10592 -12268 -8296
6118 -8296 -14193 -11348 -7806 -9265 -7149 5891 -13527 7153 20001 8269 -594 -9333 -9754 -8883
6104 -8883 6817 16832 32541 21964 4890 -10621 -5191 -15111 -21518 -22186 -22277 -8897 2198 -15270
6090 -15270 -24436 372 -8893 -44131 -44383 -15507 1954 17888 11281 14737 5466 -5300 -3749
6077 -3749 -10312 10978 14593 16522 9971 -11574 26872 52610 32674 16564 869 5372 2598
6064 2598 8108 27977 32771 29458 38331 18505 9049 12313 4547 -9285 -11772 -20931 -9260 -3879
6050 -3879 10983 9228 3528 -4380 -4600 -13826 -20491 -13657 -2190 -24031 -61643 -55426 -50645 -32742
6036 -32742 -13295 -158 -7819 -17789 -16880 4145 14947 10275 -7703 -12705 -33363 -12299 385
6023 385 -11006 -12398 -11822 -7073 -8311 -13759 -31014 -23391 -20270 -23070 -3066 5076 8213 15662 7598
6008 7598 -14026 -9440 -11212 -8246 -13001 -20159 -3005 6947 30465 4558 -18272 -2298 8469
5995 8469 -6225 -2761 22646 2723 -11527 -21979 -18507 -19126 -10558 -8058 -10888 -3263 -16567 -11849
5981 -11849 -1862 -13417 -18139 -17132 -15647 -14478 -5949 -2988 -1907 -11373 -31977 4433 26733 20779
5967 20779 9120 4239 1479 -16032 -40106 -27609 -8386 -13420 -5715 -144 -12502 -31772 -37497
5954 -37497 -24192 -7599 -13171 -19521 6586 21902 4660 4555 -9557 -35240 -26992 -29863 -28134
5941 -28134 4220 17874 14047 33111 35431 15163 24732 29201 35817 7900 -25940 -29136 -9805
5928 -9805 -4030 5549 2419 4106 13190 15314 8945 19268 -2882 -9737 -2743 19560 4354 -15069
5914 -15069 -14033 -4297 -11307 -26727 -18144 17335 15648 3476 -2394 -348 1692 -6102 -13962 -28470
5900 -28470 -24322 -23159 -10765 -31117 -52577 -45341 -16002 4538 -5911 -11155 -19487 -15452 -12655
5887 -12655 -21374 -8605 -3240 -32465 -49452 -30276 -18313 -31556 -15632 5441 -4765 -29298
5875 -29298 -32795 -1302 -655 -3529 -5578 -9494 -5962 -6509 -48 -11851 -16538 1330 15547 32012
5861 32012 25628 11189 -12047 -10933 10492 -968 -5358 -7981 -14432 -7196 -14346 -48774 -55339
5848 -55339 -49460 -35755 -26959 -9361 -5851 -24302 -14120 -25631 -28760 -22487 3610 30501 11333
5835 11333 11106 17948 20941 8495 6718 18391 22413 -17138 -44743 -46314 -30593 -17917 -25156
5822 -25156 -27665 -8629 15867 5423 -5577 4657 -14934 -31005 -15730 -3873 -15343 -22839
5810 -22839 -13361 -23794 -39793 -21331 1796 -16049 -15997 -18391 -5656 4242 -477 -18808 -21802
5797 -21802 -23453 -11444 1662 3705 -18216 -22514 -30781 -36391 -20424 -21414 -46955 -30349 -13492
5784 -13492 -9575 -19626 -39434 -24466 -14808 -8344 211 5076 7032 7903 -1539 -24213 -10274 19602
5770 19602 25707 7862 3955 15991 27678 30572 10151 -8839 -19976 -31846 -6235 1107 -5749
5757 -5749 689 18061 14493 2984 -2587 -9141 -15842 -7766 -3722 -6542 -7417 3189 27368 25387
5743 25387 22574 9285 -17790 -16797 -17227 -14854 -21769 -32476 -32446 -26636 -8876 9391 11729 15654
5729 15654 9620 -15804 -25695 -36144 -49868 -47958 -32303 -22775 -2757 -3614 -15532 -8700 18025
5716 18025 31183 39788 43407 26046 10883 19126 2872 -10065 -4942 3066 4030 2948 4272 -5413
5702 -5413 -5054 -13783 -11400 -5260 -8636 -11575 7714 23374 12155 13260 18918 8224 33658 22229
5688 22229 28617 23520 762 -4396 -2783 -15036 -17117 -10711 -7996 -833 5131 27274 14013 -11763
5674 -11763 -25879 -19600 -15340 -14706 1999 -941 -1193 18468 11712 17904 6395 -673 -3722 -10211
5660 -10211 -8368 -42561 -67262 -32274 -6859 1382 730 -23055 -41807 -35011 -28392 -45061 -58494
5647 -58494 -44933 -14161 1350 14115 19260 16917 -19713 -14618 2042 -12154 -29610 -49348
5635 -49348 -55442 -33776 -16750 -625 525 5875 -4125 1563 12387 31358 39985 32825 13853
5622 13853 16237 24921 33036 37572 28405 484 -5412 6113 19342 35242 10448 -25747 -35988
5609 -35988 -31303 -28558 -29771 -23523 -21318 -34025 -22982 -16652 2148 16615 -9894 -29664 -27988
5596 -27988 -33388 -40756 -34043 -43704 -42311 -28424 -15929 -16445 -15720 -22499 -24494 -15171 1431 16735
5582 16735 12068 6177 358 -6074 -10108 -3301 -3724 2666 -540 18892 11294 2227 2146 -15535 -8442
5567 -8442 11028 10278 9081 18387 21439 3905 -16504 -21767 -13804 -3986 9436 8985 -14946 -5804
5553 -5804 4702 19245 36142 25965 4859 13230 17324 6415 1330 10617 -7201 -23468 -18621
5540 -18621 -16693 -7311 18703 26292 7393 -1491 20496 32532 19394 7731 -3644 -8725 3451
5527 3451 16011 6274 -15254 -28464 -23309 -29743 -1750 -12753 -20238 -28657 -10775 3429 -2781
5514 -2781 4395 19251 43764 58050 62907 62637 38078 19397 2789 17219 22813 10162 5294
5501 5294 -4523 10704 8551 9864 17265 4786 -16445 -21987 -17609 7949 39131 43912 46198 50646
5487 50646 38269 27510 17377 10951 33095 44883 52275 25276 2812 5275 1174 8950 8371
5474 8371 21667 24722 32005 25537 -4414 -25812 -20500 -24667 -26456 -13369 106 -7152 -10710 -14694
5460 -14694 -17834 16017 18712 -337 -25775 -25660 -4877 5647 18828 31915 37209 17354 -11062
5447 -11062 -22461 -17321 -13207 -23637 -13189 2516 27241 40209 12362 -19729 -11933 8804
5435 8804 23533 2515 -9960 7229 14616 4139 14802 18902 4344 3320 10763 -6087 -29691
5422 -29691 -42086 -27945 -15325 22318 49830 24794 4289 -3536 4267 13883 -176 -15309
5410 -15309 -29096 -3888 13302 14101 6189 -4294 -6333 -12074 6619 -2878 -4543 -5362 654 6213
5396 6213 9129 -8289 -16763 -102 4181 777 7554 13142 7854 -14083 -42769 -16463 10323
5383 10323 23479 15896 -6526 -11204 -17572 -14426 -3488 -17450 -30432 -2067 4985 -19754 -29363
5370 -29363 -9173 11635 13650 8662 -13700 -19261 -12403 16136 31179 29228 10420 -17980 -22109
5357 -22109 17744 29720 26050 21369 11856 9032 20929 29851 16829 8921 13599 19171 -6119
5344 -6119 -8379 9836 5212 10158 16105 23947 25346 13034 24009 18712 7912 940 7517 18105
5330 18105 14754 -3171 -12953 -13771 -13278 -17107 -6719 -15715 5281 23853 12902 8830 7295 -5209
5316 -5209 7723 7600 -1685 -2591 -3851 17528 34592 35182 21587 36185 6336 -29500 -559 9198
5302 9198 16444 8674 -1603 -1654 -1772 14603 31432 27875 15918 25833 31045 37480 41693 7455
5288 7455 -11308 -9733 -23665 -29962 -17449 -11931 -6397 -12488 11046 12697 -5921 -8877 -3317 -12930
5274 -12930 -30706 -8749 2404 -2994 2457 -603 15142 17633 -14992 -28927 -20289 -16836 -13622
5261 -13622 -5807 -3947 14695 9727 387 -10833 -25484 -24393 -31322 -26356 -34447 -39632 -40662 -27989
5247 -27989 -15497 -8579 -12307 -17953 2700 12104 -5301 1823 -1936 -1579 -13326 -13643 -9699 -15674
5233 -15674 3763 -476 -13995 -7495 -4381 -14094 -21424 -17909 -13667 -14651 -17971 -16249 -13274 -4916
5219 -4916 -14584 -7473 -1972 -11617 -11000 -10162 -6784 2700 13189 -3478 -21239 -9789 -11013 -8567
5205 -8567 -6096 12209 22048 23901 24700 10803 -5166 -18047 -7795 -3868 -1980 14476 7864 -1425
5191 -1425 -7543 12256 10863 -16844 -6611 -3585 -4328 -4604 6678 15131 19888 3460 -5872 4632
5177 4632 15777 12345 -3624 -13014 -3486 -4595 2570 7933 10695 18814 13915 8759 -3323 -12647
5163 -12647 -6158 -1306 9078 9964 3279 -14779 -15664 3536 25982 36796 33241 16001 11486 18834
5149 18834 30773 28181 31247 24346 15134 12380 16522 6446 8333 12894 19563 20000 26036 30066
5135 30066 19076 -2712 8632 5341 12626 9050 11018 28479 27900 26771 29115 26217 20451 3584
5121 3584 -422 -20179 -29395 -18458 -12326 -21614 -25627 -17606 -8475 -2782 6881 7541 -4580 -8130
5107 -8130 1192 -14767 -38219 -24510 -18040 -4833 6397 -64 15526 11427 8632 18859 24124
5094 24124 32187 9483 -20664 -9320 -21685 -39343 -13183 6970 6932 -321 2440 -10238 -13655
5081 -13655 1841 18438 28580 17244 2281 2953 -4913 -21585 -15486 -15399 -13030 -8353 -12044 -15942
5067 -15942 -46709 -31845 3549 988 -19961 -45572 -28130 -20785 -24560 -27717 -36954 -44534 -60566
5054 -60566 -52461 -41270 -27666 -39013 -44769 -22715 -30646 -22397 -1708 6786 1011 -4297 10506
5041 10506 24982 16600 431 -12112 -14259 -6915 9855 37462 34135 18446 11417 21150 19656
5028 19656 17188 6090 16525 11676 -12562 -22064 -10240 -7335 -9775 -15034 -10045 -1706 11482
5015 11482 -1678 -21386 -24300 -17665 5552 16599 6925 -7596 -7551 22324 24359 -4013 -30081
5002 -30081 -36273 -28455 -18565 -15781 -11504 639 -5947 -5386 7997 20564 22197 49565 40326 14859
4988 14859 9190 702 -2218 -19640 -28056 -37499 -17935 -13072 -14459 -29603 -24136 -22721 -11948 3588
4974 3588 -8823 -35099 -22655 -2882 -3319 -16468 -21241 -14225 784 -4591 -5097 -17539 5155
4961 5155 -2616 -13128 -7907 10938 37696 36447 8092 -20896 -10895 -3759 -24013 -24293 -23858 12556
4947 12556 21731 14472 4256 -13226 -37402 -32706 -249 23417 19735 7319 -292 11844 20114
4934 20114 24312 19462 2340 4313 2767 -510 5024 -375 13655 12110 -3027 -1126 -7318 6455
4920 6455 15641 2980 -3727 -14868 -4148 12560 18118 19843 2340 -5540 4387 39122 52219
4907 52219 23220 -899 -20717 -31566 -21764 16562 10782 -3166 600 3107 -9595 -13666 -559
4894 -559 -16062 -32870 -16100 15288 27640 19899 17137 1627 10480 35511 20661 15768 42018
4881 42018 43298 22300 683 -3769 16268 17656 2584 -2322 -18742 -31976 -14180 5832 8529
4868 8529 31268 31980 -5521 -19139 -33180 -15704 -14244 -12621 -15669 7494 2433 -16620 -16096 3470
4854 3470 16092 4735 15225 -8538 -24715 -22798 -19410 -39905 -45930 -59925 -50349 -57007 -63207
4841 -63207 -49269 -25840 -3411 -2418 -10396 -24242 -25098 -30221 -36242 -25478 -16717 -15603 -28945 -30864
4827 -30864 -21313 -6001 -11265 -18748 -19634 -11199 3313 15444 27730 6729 2435 2687 -12646 -18453
4813 -18453 -1868 16788 13063 21827 18869 -1626 -7042 -3872 963 8878 2629 -6443 1148 -827
4799 -827 -6852 -39228 -33808 -25942 -7267 -21851 -49651 -34552 -18057 -4996 -17379 -12122 -14842
4786 -14842 -15770 -8705 8804 2266 3584 -985 -16776 -29157 -8797 -17457 -23032 9078 17133 7618
4772 7618 -2584 -3187 8559 24828 14063 -5861 -5305 -6116 -6929 -2043 1734 9693 -16204 -23623
4758 -23623 -15758 -14583 553 5949 14495 18031 17979 30015 48093 47418 47347 37766 43277 23703 7533
4743 7533 -8684 811 15844 12430 29274 26750 14750 -4113 -3932 -4831 -15925 -16079 -1526 10330
4729 10330 7255 6793 10744 14022 12646 12085 16739 24415 15828 159 18092 36102 48008 51452
4715 51452 25504 13658 15211 20439 12025 -9257 -18447 -1467 -2441 -19227 -38427 -36468 -4730
4702 -4730 7453 -986 -4522 7613 3955 2086 1368 1876 13479 1241 3385 17842 8810 6287
4688 6287 19105 9952 18956 23830 4021 -20764 -26925 -20992 -16585 -38250 -34074 -14814 -15973 -19968
4674 -19968 -26546 -8317 -3386 16805 12971 1080 21398 30780 9066 -15507 -15198 -3711 2224
4661 2224 18690 11861 -179 -18124 -533 15450 26627 7045 -6672 -7824 -124 11007 13125
4648 13125 18638 1686 6792 13578 16895 13750 14632 19766 30135 35715 32949 59258 66184 40432
4634 40432 34114 2350 -14637 -17644 -22648 -41471 -50639 -43131 -42393 -43629 -56662 -42809 -47765 -24835
4620 -24835 -26525 -27861 -18732 16114 22402 15448 -14063 -16557 -26807 -25211 -24342 -16799 -13590 -8794
4606 -8794 99 -710 4047 8986 1013 -30456 -36090 -19744 -10794 -4977 13352 -2285 -13422 -4338
4592 -4338 3700 4827 -11131 973 -898 5475 3822 553 9139 2305 -3871 -9107 11668 -547
4578 -547 3768 4806 -16088 -9361 -22530 -14797 3345 3528 499 15339 16593 17343 3282 5268
4564 5268 5702 -7690 -8126 2129 687 -25181 -13328 1998 -1649 -20693 -26789 -29874 -23633 -21073
4550 -21073 -5196 2244 -13298 -29879 -25221 -29125 -30866 -20046 6014 4463 -9945 -13258 -6500
4537 -6500 2603 -2852 -25845 -34703 -39052 -43051 -22619 -4423 -16789 -18418 -24709 -29159 -30628 -21968
4523 -21968 -26566 -11020 15535 8285 1239 -5276 -210 12040 10454 -5497 -19048 -25442 -15683
4510 -15683 -21780 -6074 -26744 -39859 -34483 -23622 -21115 -8538 -3801 -13256 -5165 720 -4797
4497 -4797 -871 -8150 -19601 -25302 2527 -9302 -9267 -2465 -10627 4471 15042 27989 25937 35758
4483 35758 32177 46881 49222 34639 39558 12642 -14647 3350 17633 -23521 -26342 -11647 4722
4470 4722 13279 32754 19808 3038 -11824 -1646 12562 26147 31389 25214 20107 13408 5987
4457 5987 16558 32030 3707 -12394 -2130 14074 41284 15790 -4606 -3456 16345 -2426
4445 -2426 -22075 -26337 -31791 -21666 -32824 -33148 -20950 -9803 -17904 -14985 7429 5476 -4865
4432 -4865 3978 7628 -467 -16004 -33040 -10485 24503 39892 41912 41246 906 -36339 -30303
4419 -30303 -33685 -29626 -21475 -29203 -17763 -32085 -32557 -17203 5916 8909 -8950 4955 37910
4406 37910 43497 37146 12195 1077 11732 15619 17797 17539 5945 6697 4718 -2101 -38 12050
4392 12050 30371 24383 21152 20829 -1856 -12899 -16276 -9162 -7958 -19172 -16131 1681 -23105
4379 -23105 -22341 -2226 -7381 -27324 -12031 7442 4227 -5666 19259 -1405 -19013 -30662 -28100
4366 -28100 -23426 -18087 -21519 -35928 -12624 -3028 2371 -4356 -7210 -11297 -8283 -22101 -30586 -12946
4352 -12946 -26718 -33361 -38062 -43947 -28437 -28146 -36721 -31197 -18762 -4017 10382 16489 8854 2157
4338 2157 594 14247 20157 26717 22120 16266 10081 1240 9370 8454 -31025 -34165 -10911 11189
4324 11189 13604 20063 12776 3 -27550 -17968 -33482 -33355 -6947 2012 1193 14983 -10710 -17892
4310 -17892 8842 15071 17943 11011 -9139 -12815 -9371 4972 15612 3311 2701 -1253 7329 -10960
4296 -10960 -7329 -14971 -28890 -26524 -36644 -24786 -16372 -23304 -8868 177 1374 32595 45142
4283 45142 31785 4870 -17594 -2169 23197 31550 7049 -2366 -17749 -11494 -16204 -5907 11825
4270 11825 9374 15645 18199 29801 19930 7269 -9743 -16959 -22653 -28658 -21133 -1208 -17599
4257 -17599 -47020 -41988 -45759 -17664 -3121 -15846 -14991 -26221 -20896 -5513 10908 -5421 -17371
4244 -17371 -29535 -55547 -50240 -38402 -29843 13400 935 -5937 10550 12249 4496 7586 9716
4231 9716 21119 24850 20837 11232 -5861 1213 29646 30819 26359 22622 9490 -10277 -28343
4218 -28343 -25846 -14916 -10496 -2241 7120 11076 1278 -11250 -12660 -7020 -19751 -29922 -8795
4205 -8795 11212 18004 -1406 -19084 -15631 -13085 7906 19182 9427 15862 -12637 -12090 -8901 1739
4191 1739 10997 -8504 -1447 9657 -3482 1128 9051 17076 25079 9849 -13318 -17294 -8247 3562
4177 3562 10692 8417 11288 11443 373 26562 14295 -33033 -25150 -2915 6237 -3207 -16588 -44476
4163 -44476 -74017 -77545 -56191 -24632 -24668 -29689 -27740 -24902 -24384 -1007 3415 -9208 -14206 -54
4149 -54 2678 15879 8568 -21372 -26084 -35438 -22496 -18547 -12195 -11762 218 23421 20891 3060
4135 3060 85 11128 3139 6240 3080 27685 25945 6468 9070 27684 25808 23552 6046 -6936
4121 -6936 -8169 -10034 -32403 -23513 -394 925 -9828 9704 8065 -10283 3728 10885 -2359
4108 -2359 -10171 -17463 -15444 -3599 -2886 -7407 14404 25684 33414 12535 6585 780 -9554 1214
4094 1214 2637 6557 -23952 -34017 -21031 -12347 -7116 -711 -4761 -20831 -8004 21572 37432
4081 37432 41163 20357 32017 18308 14335 10339 -1975 7450 18179 24582 37308 23589 17063
4068 17063 23741 21181 4932 -2696 -5905 -12276 -19606 -23282 -19366 -17249 -11228 -7221 3003 126
4054 126 4094 -6235 4253 9316 -4318 3114 8862 6883 18307 20848 34922 12913 -25208
4041 -25208 -23912 926 3635 1182 -6588 720 -5570 -8602 4769 22407 22552 26004 45154 23053
4027 23053 1491 1400 15230 17055 2379 -3129 2197 1951 3217 12510 -1711 -7471 -3559 -5183
4013 -5183 10529 22998 4238 1736 8496 10515 -2858 -8758 -2089 -3440 9526 1797 -17851
4000 -17851 -19101 -16788 -15456 -23623 -36818 -22271 4462 25684 21942 10995 3716 -14845 -19599
3987 -19599 -14702 -6110 -17810 -31230 -32343 -9228 -973 -5085 -14538 -8969 -3410 -27855 -8396
3974 -8396 -11946 -7202 -234 -2669 -3642 -5666 15935 18248 18688 8632 -14066 -4105 2378 4687 14501
3959 14501 16972 27301 19560 20843 5188 -6296 5847 8161 10025 -424 -15058 -26797 -28080
3946 -28080 -82 22849 -5308 -41455 -37346 -30391 -15948 10689 12848 17810 13570 16925 6095
3933 6095 557 3945 -5333 -15114 -13443 -4579 15649 39592 46172 19261 -13978 -7555 -9125 -5121
3919 -5121 12435 14259 3954 -6503 -1073 -806 -2116 5648 13004 -11953 -41024 -48752 -17317 720
3905 720 -3011 -26170 -23921 -24923 -34436 -46064 -29639 -10584 -7780 -21317 -41032 -35208 -31893 -24286
3891 -24286 -1983 -2413 14816 16365 11337 4507 -759 -27511 -19856 12756 18711 12514 7271 28697
3877 28697 33125 6737 -5868 -21649 -1471 16885 4265 -16491 -36588 -34549 -26871 -36360 -33001
3864 -33001 -8136 2463 7632 -9214 -27234 -25337 -6649 3314 7907 2653 23730 29004 28001
3851 28001 18814 24724 13173 -3410 -10282 -17290 533 12418 27462 30807 16853 -1100 2275
3838 2275 32073 44111 26845 -3177 -16119 -7549 -17606 -43660 -48943 -24530 -5938 -12781 -22760
3825 -22760 -29212 -4832 958 -11033 -10194 -15830 -21384 -12705 -17837 -20993 133 1199 7844 -19837
3811 -19837 -23697 -20050 -22687 -22939 -6692 -11713 -3472 15281 20126 8684 -575 -2368 -14330 -33973
3797 -33973 -19751 -33007 -37471 -29507 -27453 -19280 2190 4339 5406 5001 -1565 -6214 1434 2552
3783 2552 6627 1221 -7643 -22400 -14395 -8988 -31420 -19765 8492 -3320 6854 28564 27679
3770 27679 12109 -9967 -12047 -810 -6094 -18610 -21270 -30014 -33599 -14100 -10287 -5003 -29651
3757 -29651 -25411 -16569 -1554 2440 1582 -6323 -11773 15925 22579 23484 14704 17301 21570 29292 31080
3742 31080 5112 -14098 -22215 -13011 -7706 1680 18465 23020 30682 47558 44151 19352 12338
3729 12338 -10864 -5883 11625 39028 32043 29308 26329 28092 -3290 -16093 -9984 -21140 -18157
3716 -18157 -2719 12521 29445 33039 9650 11363 20724 26533 34749 28158 462 7521 19778
3703 19778 24005 30187 8080 -8842 1452 7258 11320 13101 18247 27799 19231 4729 -13699
3690 -13699 -19334 4976 4314 -18262 -13228 1780 -5615 -5618 12949 862 -11947 -18367 -13316 -19388
3676 -19388 4386 18589 18106 20355 3786 4308 3080 -4831 1756 13168 3593 -21436 -45066 -42384
3662 -42384 -30477 -26453 -10715 1640 4222 -9476 -19175 -6142 2855 7601 2026 1578 3875 -7259
3648 -7259 -23465 -16964 -14399 -29258 -29833 -9011 -17218 -17503 -8971 1067 6471 4787 -6430 -14070
3634 -14070 -14506 3668 4706 1427 29173 35962 19959 22532 17186 15446 10339 4506 10670 26326
3620 26326 23860 21116 15182 9083 15068 6945 2482 476 -12604 -20799 205 -2369 10650 21030
3606 21030 14427 23044 28724 16916 -18740 -28230 -11193 872 -2797 19291 12685 -11858 -7581
3593 -7581 -474 2248 1621 -7171 734 7381 18443 -1929 -77 7915 9563 4382 24979 28797
3579 28797 11219 -5666 -17050 -9574 -10471 2746 1934 5383 15996 7123 -13629 -594 6187
3566 6187 11329 6701 14908 20421 4094 -12589 -9302 645 -1769 343 18560 45878 28481 -4474
3552 -4474 -20534 -31129 -7362 7771 3531 6725 14310 6470 895 5562 6705 25895 22596 11799
3538 11799 19745 5633 11662 25171 27047 42234 17044 -11748 -33069 -38303 -41700 -50882 -55953
3525 -55953 -48171 -24016 -17704 -9245 2858 5169 -18110 -27348 -25876 -18204 5848 15898 24378
3512 24378 20511 -3740 -34429 -29636 -11610 10898 36282 35023 16347 17424 14831 8068 2991
3499 2991 -4529 -20740 -41020 -39062 -19989 1160 -6012 -11865 -14616 -6009 19607 15749 12850 13068
3485 13068 6826 15490 31967 33225 23052 20763 30342 40215 9821 5975 2544 -15276 -20599 -9013
3471 -9013 -420 4386 5977 -6018 -22376 -4575 11421 16628 38772 37147 35688 23895 30401
3458 30401 26335 25163 26108 15763 6360 6541 -2637 -14068 -10532 1511 7902 -9991 -12320 -16757
3444 -16757 -15473 -14644 -25709 -7945 4491 36704 28418 9782 9610 16657 7627 9426 28481 9863
3430 9863 -17397 -2607 13563 22157 7842 -1924 -33757 -67586 -77893 -67995 -60104 -25579 -9847
3417 -9847 -9356 3584 8445 -15747 -15290 -3053 -17498 -4091 -1462 2817 26835 30813 15635 8295
3403 8295 -17414 -34820 -24416 11733 11739 -9779 -5599 -11648 -2480 16461 17534 17369 30455 23028
3389 23028 13316 3202 -9968 -8778 -20698 -14477 -5441 6829 8439 -18212 10918 35727 5662
3376 5662 -7913 -19641 -19304 -15288 -18207 80 18488 15462 15376 19653 7759 -29294 -13406 -14280
3362 -14280 -17883 -5219 -304 16145 6136 1959 -9552 4597 11990 4066 26680 45216 42804
3349 42804 33800 -806 -22246 -6160 -32107 -65264 -45171 -17635 -26659 -15660 -20382 -20624 -24874
3336 -24874 -35833 -33887 -16412 -8655 -13725 -2478 -27 269 749 39 5586 6732 5775 2634 -14715
3321 -14715 -7006 14310 21082 9826 -16757 -12662 -3558 -2119 17089 19000 28026 30243 9671
3308 9671 -14074 -18833 -5540 2392 4489 8059 939 -15194 -38932 -44035 -27223 -6857 9678
3295 9678 17410 14060 20752 25568 15785 18919 16857 17977 29457 40160 31130 1603 9745 2568
3281 2568 -13551 -20480 -25295 -8723 12784 25489 17504 152 724 -7852 -1243 1836 -1935 -5322
3267 -5322 -22101 -2782 15577 417 9851 -2440 -3156 8596 8436 -7648 -12990 -15341 -10529 -8994
3253 -8994 8553 9232 9012 -6808 -36053 -39014 -52780 -52560 -35765 -25738 -19493 -13130 -2440 -2792
3239 -2792 -4999 -5854 4093 24444 19569 -14358 -31976 -26291 -4287 717 -13759 -8854 -67 -5933
3225 -5933 -15002 -27310 -30256 -23945 -22829 -11474 -4996 -16882 -29005 -16258 -2030 -11963 -18165
3212 -18165 -25253 -7947 2175 6560 16842 21787 10811 14776 32334 23029 20130 16457 6291
3199 6291 10879 25891 28692 37056 31296 4427 -1331 -7161 9299 24716 17111 19987 29471 18345
3185 18345 -240 -24634 -25497 -18740 -26219 -35959 -27780 -9688 -7532 -12430 -9261 1578 7728 2115
3171 2115 -3390 -3054 -5249 -23814 -21959 -17336 -27501 -43369 -34519 -25309 -18714 -14110 -5703 -16217
3157 -16217 -1521 -6887 -15990 -17471 -10000 -7289 6528 4182 13931 9340 25706 37800 33976 28473
3143 28473 41561 55275 54132 33212 15661 627 17875 20573 22891 19915 34220 40336 20904
3130 20904 13247 8808 14226 -6753 -4018 -1551 -24543 -25556 7763 2594 -4622 -6805 -3635 8521
3116 8521 12274 2443 -21000 -17130 1290 -9303 -16947 -14504 -318 -9629 -35745 -34222 -7661
3103 -7661 6708 -1092 -12357 -36405 -22512 -16197 -17529 -10610 9565 25818 15250 25761 34319
3090 34319 13117 -6463 1985 11360 -4382 8035 10958 647 1128 13964 -2722 -8311 -7485
3077 -7485 11600 -888 2305 15002 12375 20604 19845 5644 -7652 -6518 -3339 16403 6649 -17544
3063 -17544 -6929 -11476 -29305 -31365 -32060 -47136 -39987 -21487 -12641 3297 4975 13490 1028
3050 1028 -3118 3680 10993 11559 23472 33419 23361 24911 3582 -13434 -4000 15007 15741 17731
3036 17731 10806 28668 30921 1101 -22904 -14917 90 8741 -6997 -4080 11723 16808 6767
3023 6767 -7719 -21383 786 28361 26894 26410 13328 12122 13224 -469 20703 42261 36004
3010 36004 30535 25051 12141 21077 12439 16676 22557 24563 4032 6192 6881 14522 25535 -420
2996 -420 -8910 -5389 -4821 -2150 -1111 1473 15555 29659 29884 41113 36434 -2485 -13995 159
2982 159 16988 14623 11584 26011 9384 -6135 -8533 -1736 -279 4594 24984 11975 -7803
2969 -7803 -31022 -41182 -33872 -34928 -15351 -13269 -16684 4988 35568 17036 2813 2765 -13345
2956 -13345 -4992 -5861 1 5367 2311 6197 10063 6625 15297 17197 23829 22967 17826 16665 22936
2941 22936 18365 12205 5197 -8740 7529 16590 22662 8516 -67 -23705 -34576 -5836 13823
2928 13823 15109 13742 -16747 -40599 -60988 -39082 -15593 -8842 -24930 -15708 8285 51116 57728
2915 57728 42459 27165 -5147 -29707 -31257 -15452 -940 -2970 2977 -22449 -37041 -37587 -19044
2902 -19044 5539 -1519 -12686 -9400 2326 3572 -2934 -16375 -10346 -8001 6815 788 -17950
2889 -17950 -22351 -8385 -23763 -23919 -25240 -12560 8059 2979 -13207 -36907 -41404 -32393 -23438
2876 -23438 -11998 -5814 15981 17810 33349 17050 -750 -7446 -7710 -11626 -17295 -4928 -6206
2863 -6206 -8857 14870 26866 6688 -16702 -4812 -9506 -10236 -4817 520 18468 18715 21514 17562
2849 17562 18096 9038 -672 1723 -2521 -10947 -4464 -6213 -20383 -15899 -1977 -3318 1811 -14407
2835 -14407 -9464 -25721 -13828 18911 36639 33370 20554 18738 4478 5108 1650 -7443 -9829
2822 -9829 -9344 -24440 -45912 -49991 -31600 -23948 -9961 -4336 18287 34218 34724 28431 10466 -7803
2808 -7803 2096 30195 38797 29956 28142 10495 8240 -1760 -11433 -30919 -11625 930 -2347
2795 -2347 -7730 -2937 -2671 -10444 -7813 -1475 15682 5208 -2597 7046 -960 -11043 -11622 -7559 14497
2780 14497 34556 18916 14467 -428 1744 15267 21095 12159 24927 35372 23998 -9420 10789
2767 10789 11630 9402 6618 -19210 -26680 -34619 -21542 -8327 -10827 -34912 -37691 -24322 14891
2754 14891 4095 -7643 -8308 -9178 4388 16045 23105 2072 4457 -2252 -3028 -9958 -10681 10483
2740 10483 11180 9005 -2438 -6344 -20038 -36339 -24890 -26 -186 -8756 -8997 -15069 -10575 7884
2726 7884 21286 7848 15624 15815 8659 -10180 -23173 -33301 -22958 -9294 14869 21495 4577
2713 4577 -6021 -6637 -19838 -32905 -28811 -16369 -7581 4775 7823 10545 4303 6071 11618 22303
2699 22303 15723 5272 -2637 -10741 -8570 -14193 -37950 -37110 -29157 -23541 -11794 -10182 -1119 11210
2685 11210 5060 9375 8421 9619 802 -11002 -8095 -11446 -27262 -17237 -13102 -9239 -16669 -28846
2671 -28846 -26456 -12752 -14319 256 15250 35251 41423 25904 18827 24783 25183 -5552 -30994
2658 -30994 -36797 -30181 -14827 10991 19240 9134 22485 24721 -600 8774 20082 -7187 -22858
2645 -22858 -22886 6830 21685 8207 13351 28097 34103 39918 31436 24881 38971 30417 25750 9218
2631 9218 10349 21281 5174 -4710 4462 20372 5188 -21770 -16522 -11239 -2303 -4247 10101
2618 10101 13807 -7781 -8015 5915 -7710 -5978 -10359 -13621 -11940 -1865 -27742 -28918 -9604
2605 -9604 21306 40139 34704 30513 24183 20102 6462 9180 16585 22912 30401 26243 28376 16171
2591 16171 4000 -2690 5127 28514 19449 9813 26119 23856 13889 5137 -9237 -36373 -35946 -9872
2577 -9872 -3502 12613 13418 12618 16755 21699 1438 -20020 -18151 -5629 -26173 -18282 -10596 -1844
2563 -1844 -7855 -6309 10235 5963 -11019 -22981 -14355 -14273 -24854 -3812 280 -12264 -18183 -16957
2549 -16957 -4282 -2610 1626 17597 27361 51039 36833 31563 7656 -25937 -16686 14591 20098
2536 20098 9110 14275 30307 24108 12035 2998 1782 4761 -8601 -4957 -6383 -4962 22589
2523 22589 19738 6196 -6001 10356 13851 14572 14990 15797 4733 -16979 -15714 11665 -5286 -23119
2509 -23119 -24244 -3825 -28634 -52318 -34960 -11828 -1054 1336 738 13881 21076 -540 2492
2496 2492 16150 16073 20497 10370 8328 15093 16303 17020 12075 20359 9107 15791 7816 -9171 -14577
2481 -14577 -7922 -7548 -7429 -365 671 11873 -294 -1256 356 -9321 4911 13754 30420 49795
2467 49795 28847 7030 -9826 -17808 -18706 11725 21365 19631 7498 -890 -26114 -27406 -27751 -17177
2453 -17177 -29052 -20379 1882 16373 21341 23584 26719 23450 30597 29991 21901 24241 29721 19503
2439 19503 2764 -1360 -12228 -6115 -4154 5790 12266 26886 9113 -428 -5497 -31 -3424 -20860
2425 -20860 -16072 11830 14268 893 3742 22254 15796 26284 16678 -286 -12430 -11489 -15352
2412 -15352 -14749 28632 41225 14468 -7229 -18942 -13103 18034 8573 -3708 -13169 -31995 -48557
2399 -48557 -29104 -24236 -22593 -7379 10496 12552 11293 -7335 -26864 -24297 -7455 1218 10699
2386 10699 25264 47639 30988 30406 37501 26731 17750 19550 34987 27942 -8673 -17892 -1988
2373 -1988 7565 1591 -11828 -6440 -9379 -11746 -26814 -12217 12680 15712 8745 359 -25919 -27870
2359 -27870 -20360 -18264 7398 9375 -6507 4652 13839 5565 22719 8965 -20732 -6355 -5083
2346 -5083 -36231 -15724 -5489 6123 15802 6606 6996 4779 17653 27916 32154 31623 11342 -18071
2332 -18071 -6277 6325 -5810 -10401 -5015 3469 -4698 -121 29696 36097 24569 17303 -5075
2319 -5075 -9000 -1659 -7585 -7161 -15146 3723 29196 33666 10919 12546 14176 25621 43002 52950
2305 52950 24946 9751 -1402 1879 6749 6471 7667 9758 11336 22178 7269 -24722 -24459 -25778
2291 -25778 -10957 -4663 4500 7961 36103 46439 32468 41289 43875 18518 23395 10620 994
2278 994 -8807 -24511 -9430 -4794 7712 3811 -11558 -8241 -20664 -6582 -16137 -16333 -11337 2371
2264 2371 19194 8735 -3582 -4850 3250 20096 6788 -12279 -19928 -19570 -16533 5368 23949
2251 23949 25796 30941 10616 -2035 14353 29203 18334 24281 7652 1080 8143 21126 14762
2238 14762 32257 37778 37742 12541 10871 -3778 -2143 -19052 -16539 -12408 9941 -585 3595 -6497
2224 -6497 -16629 -5239 -10233 -5792 14408 29968 28302 11785 6236 1019 8122 33345 23955
2211 23955 2577 6342 -5151 -11729 -1056 -4646 -15977 -17533 1124 9360 4729 193 -3759
2198 -3759 14561 23205 6025 14641 10176 -12514 -21054 -25712 -17094 3699 26156 28719 40416
2185 40416 45434 11697 -2578 -4368 -4127 7189 -1574 -9468 -24774 -32123 -19272 -17447 -6393
2172 -6393 -531 7928 18108 23449 31339 37503 25988 11230 -3591 -7065 -4947 -7812 -8401 4829
2158 4829 516 -18072 -24978 823 -9149 -20967 749 3449 9490 2682 -24347 -35362 -21241
2145 -21241 -19187 -7929 21554 34592 35493 28347 10302 -8392 -9228 -12387 -1054 4481 18971
2132 18971 25515 19470 29133 6427 -5394 -4480 975 -25785 -27829 8155 1694 -4291 -12670 -8183
2118 -8183 -8158 4210 -13105 -36452 -21362 5842 16875 -4696 -8151 1078 -7807 -6972 9920 10792
2104 10792 5034 -11183 7176 29695 13464 -8309 -12464 -27227 -24037 -5749 4473 -5687
2092 -5687 -2814 14499 24756 4248 -22597 -31256 -26070 -12001 2802 837 -16615 -426 11647
2079 11647 -9343 -37612 -40702 -39579 -55684 -55485 -47244 -30541 -21951 -21490 -40187 -39010 -18020 -13143
2065 -13143 -2355 23001 36297 40457 19593 24978 12975 -5832 -13592 -25789 -45912 -44208 -33312
$$ [...]
##END NTUPLES=NMR SPECTRUM
##END=
