##TITLE=Analysis number 329756
Compound Code spb 08364
Project Code adrs
Chemist Name fudan
##JCAMPDX= 6.0         $$ Bruker NMR JCAMP-DX V2.0
##DATA TYPE= NMR SPECTRUM
##DATA CLASS= NTUPLES
##ORIGIN= Bruker BioSpin GmbH
##OWNER= nmr
$$ XWIN-NMR		Version 3.5
$$ Wed Sep 26 12:06:37 2007 GMT Daylight Time (UT+1h)  MAYBRIDGE\nmr@NMR_250MHZ
##.OBSERVE FREQUENCY= 250.131544655141
##.OBSERVE NUCLEUS= ^1H
##.ACQUISITION MODE= SIMULTANEOUS (DQD)
##.ACQUISITION SCHEME= undefined
##.AVERAGES= 16
##.DIGITISER RES= 18
##SPECTROMETER/DATA SYSTEM= dpx250
##.PULSE SEQUENCE= zg30
##.SOLVENT NAME= DMSO
##.SHIFT REFERENCE= (INTERNAL, DMSO, 0, 16.522)
##AUDIT TRAIL= $$ (NUMBER, WHEN, WHO, WHERE, WHAT)
$$ ##TITLE= Audit trail, XWIN-NMR		Version 3.5
$$ ##JCAMPDX= 5.01
$$ ##ORIGIN= Bruker BioSpin GmbH
$$ ##OWNER= nmr
$$ C:\u/data/dgb/nmr/ADRS/2460/pdata/1/auditp.txt
$$ ##AUDIT TRAIL=  $$ (NUMBER, WHEN, WHO, WHERE, WHAT)
(   1,<2007-09-26 12:06:16.12 +100>,<MAYBRIDGE\nmr>,<NMR_250MHZ>,
      <created by zg, POWCHK disabled, PULCHK disabled
       configuration hash MD5:
       76 6E 9A 78 1E 09 19 81 EC 84 63 8F B0 6A 59 2D
       data hash MD5: 64K
       9A 0E 50 B4 C8 D4 6C DD 83 C9 49 48 D2 68 B0 D6>)
(   2,<2007-09-26 12:06:27.78 +100>,<MAYBRIDGE\nmr>,<NMR_250MHZ>,
      <Start of raw data processing
       ef LB = 0.3 FT_mod = 6 PKNL = 1 SI = 32K 
       data hash MD5: 32K
       34 CD 7C D0 6C 85 09 DD A0 E9 12 08 58 11 CE F5>)
(   3,<2007-09-26 12:06:29.45 +100>,<MAYBRIDGE\nmr>,<NMR_250MHZ>,
      <apk 
       data hash MD5: 32K
       67 78 71 AD 0D E4 AD DE 42 B3 E9 2E 5F F0 9D F3>)
(   4,<2007-09-26 12:06:30.17 +100>,<MAYBRIDGE\nmr>,<NMR_250MHZ>,
      <abs ABSG = 5 
       data hash MD5: 32K
       F7 11 96 17 B6 7B 3B 39 DA 7A 4F 7A A8 D4 2D A0>)
$$ ##END=
$$ 
$$ hash MD5
$$ 84 21 13 88 81 A0 D0 88 B4 60 6F 45 74 97 78 A8
##$RELAX= 
##$RELAX= 
##$RELAX= 
##$RELAX= 
##$RELAX= 
##$RELAX= 
##$RELAX= 
$$ Bruker specific parameters
$$ --------------------------
##$DU= <C:\u>
##$EXPNO= 2460
##$NAME= <ADRS>
##$PROCNO= 1
##$TYPE= <nmr>
##$USER= <dgb>
##$AMP= (0..31)
100 100 100 100 100 100 100 100 100 100 100 100 100 100 100 100 100 100 
100 100 100 100 100 100 100 100 100 100 100 100 100 100 
##$AQSEQ= 0
##$AQ_mod= 3
##$AUNM= <au_zg>
##$AUTOPOS= <53 >
##$BF1= 250.13
##$BF2= 250.13
##$BF3= 250.13
##$BF4= 250.13
##$BF5= 500.13
##$BF6= 500.13
##$BF7= 500.13
##$BF8= 500.13
##$BYTORDA= 1
##$CFDGTYP= 0
##$CFRGTYP= 5
##$CHEMSTR= <none>
##$CNST= (0..31)
1 1 145 1 1 1 1 1 1 1 1 1 1 1 1 1 1 1 1 1 1 1 1 1 1 1 1 1 1 1 1 1 
##$CPDPRG= <>
##$CPDPRG1= <>
##$CPDPRG2= <>
##$CPDPRG3= <>
##$CPDPRG4= <mlev>
##$CPDPRG5= <mlev>
##$CPDPRG6= <mlev>
##$CPDPRG7= <mlev>
##$CPDPRG8= <mlev>
##$CPDPRGB= <>
##$CPDPRGT= <>
##$D= (0..31)
0 1 0 0 0 0 0 0 0 0.06 0 0 0 0 0 0 0.0002 0 0 0 0 0 0 0 0 0 0 0 0 0 0 
0 
##$DATE= 1190804775
##$DBL= (0..7)
120 120 120 120 120 120 120 120 
##$DBP= (0..7)
150 150 150 150 150 150 150 150 
##$DBP07= 0
##$DBPNAM0= <>
##$DBPNAM1= <>
##$DBPNAM2= <>
##$DBPNAM3= <>
$$ [...]
##$SUBNAM7= <"">
##$SUBNAM8= <"">
##$SUBNAM9= <"">
##$SW= 20.6930455092707
##$SWIBOX= (0..15)
0 0 3 0 0 0 0 0 0 0 0 0 0 0 0 0 
##$SW_h= 5175.983436853
##$TD= 65536
##$TD0= 1
##$TE= 296.16
##$TE2= 300
##$TE3= 300
##$TEG= 300
##$TL= (0..7)
0 120 120 120 120 120 120 120 
##$TP= (0..7)
150 150 150 150 150 150 150 150 
##$TP07= 0
##$TPNAME0= <>
##$TPNAME1= <>
##$TPNAME2= <>
##$TPNAME3= <>
##$TPNAME4= <>
##$TPNAME5= <>
##$TPNAME6= <>
##$TPNAME7= <>
##$TPOAL= (0..7)
0.5 0.5 0.5 0.5 0.5 0.5 0.5 0.5 
##$TPOFFS= (0..7)
0 0 0 0 0 0 0 0 
##$TUNHIN= 0
##$TUNHOUT= 0
##$TUNXOUT= 0
##$USERA1= <user>
##$USERA2= <user>
##$USERA3= <user>
##$USERA4= <user>
##$USERA5= <user>
##$V9= 5
##$VALIST= <valist>
##$VCLIST= <CCCCCCCCCCCCCCC>
##$VD= 0
##$VDLIST= <DDDDDDDDDDDDDDD>
##$VPLIST= <PPPPPPPPPPPPPPP>
##$VTLIST= <TTTTTTTTTTTTTTT>
##$WBST= 1024
##$WBSW= 4
##$XGAIN= (0..3)
0 0 0 0 
##$XL= 0
##$YL= 0
##$YMAX_a= 253325
##$YMIN_a= -477270
##$ZGOPTNS= <>
##$ZL1= 120
##$ZL2= 120
##$ZL3= 120
##$ZL4= 120
##$ABSF1= 16.522
##$ABSF2= -4.171173
##$ABSG= 5
##$ABSL= 3
##$ALPHA= 0
##$AQORDER= 0
##$ASSFAC= 0
##$ASSFACI= 0
##$ASSFACX= 0
##$ASSWID= 0
##$AUNMP= <proc_1d>
##$AZFE= 0.1
##$AZFW= 0.1
##$BCFW= 0
##$BC_mod= 0
##$BYTORDP= 0
##$COROFFS= 0
##$CY= 12.5
##$DATMOD= 1
##$DC= 0
##$DFILT= <>
##$DTYPP= 0
##$F1P= 14.0000005364418
##$F2P= -0.99999901652339
##$FCOR= 0.5
##$FTSIZE= 32768
##$FT_mod= 6
##$GAMMA= 0
##$GB= 0
##$INTBC= 1
##$INTSCL= 1
##$ISEN= 128
##$LB= 0.3
##$LEV0= 0
##$LPBIN= 0
##$MAXI= 10000
##$MC2= 0
##$MEAN= 0
##$ME_mod= 0
##$MI= 0
##$NCOEF= 0
##$NC_proc= -3
##$NLEV= 6
##$NOISF1= 0
##$NOISF2= 0
##$NSP= 0
##$NTH_PI= 0
##$NZP= 0
##$OFFSET= 16.522
##$PC= 1
##$PHC0= 144.9895
##$PHC1= 5.888078
##$PH_mod= 1
##$PKNL= yes
##$PPARMOD= 0
##$PSCAL= 4
##$PSIGN= 0
##$REVERSE= no
##$SF= 250.13
##$SI= 32768
##$SIGF1= 0
##$SIGF2= 0
##$SINO= 400
##$SIOLD= 32768
##$SREGLST= <1H.DMSO>
##$SSB= 0
##$STSI= 32768
##$STSR= 0
##$SW_p= 5175.98343685301
##$SYMM= 0
##$S_DEV= 0
##$TDeff= 65536
##$TDoff= 0
##$TI= <Analysis number 999999
Compound Code 99
Book Reference 9
Project Code 9>
##$TILT= no
##$TM1= 0
##$TM2= 0
##$TOPLEV= 0
##$USERP1= <user>
##$USERP2= <user>
##$USERP3= <user>
##$USERP4= <user>
##$USERP5= <user>
##$WDW= 1
##$XDIM= 32768
##$YMAX_p= 319652795
##$YMIN_p= -116924
$$ End of Bruker specific parameters
$$ ---------------------------------
##NTUPLES= NMR SPECTRUM
##VAR_NAME=  FREQUENCY,     SPECTRUM/REAL,   SPECTRUM/IMAG
##SYMBOL=    X,             R,               I
##VAR_TYPE=  INDEPENDENT,   DEPENDENT,       DEPENDENT
##VAR_FORM=  AFFN,          ASDF,            ASDF
##VAR_DIM=   32768,         32768,           32768
##UNITS=     HZ,            ARBITRARY UNITS, ARBITRARY UNITS
##FACTOR=    0.157963299565203, 1,           1
##FIRST=     4132.6476996994, 0,             0
##LAST=      -1043.33573715361, 0,           0
##MIN=       -1043.33573715361, -116924,     0
##MAX=       4132.6476996994, 319652795,     0
$$ Real data points
##PAGE= N=1
##DATA TABLE= (X++(R..R)), XYDATA
$$ [...]
18247B45310o8l494j329J4538j120j3457j7549k6438N76j4345j719J6876J4896
18234B12677N789K077j5416n4146l4166J1616M9479j206K5373J7312J6980q262
18222B28107l1027L450p643j4067k648J249k799K2230K545j5771J6372M7843o695
18209B41146j1452j0931k1920q605j6256J315K2201M785O724J0382m586N367J0903
18196B29073j9950j2045M425O782K1647j3190k2257j8901r586J6755K4483K7384
18184B34620j1170j2324j337j3165J0317M513K6730l759n256l569j5219k2125
18172A88256K0020K0810j4443P4j0033M715j0172l5953j0661J3765J5891j7657
18160A64612l0331N982J49J5857K2711J226l543j8769M135J9880l106K821m446
$$ plain form
18247 245310 245242 241748 240419 254957 253837 240380 222831 196393 196969 182624 180905 197781 212677
18234 212677 218466 220543 205127 150981 116815 128431 177910 176704 202077 219389 236369 228107
18222 228107 197080 200530 192887 178820 176172 177421 174622 196852 199397 183626 199998 247841 241146
18209 241146 229694 218763 196843 188238 171982 173297 195498 200283 207007 217389 212803 218170 229073
18196 229073 209123 197078 201503 208285 229932 216742 194485 175584 165998 182753 207236 234620
18184 234620 223450 211126 209789 196624 206941 211454 238184 234425 229169 225600 210381 188256
18172 188256 208276 229086 214643 214717 204684 209399 199227 163274 152613 166378 182269 164612
18160 164612 134281 140263 140412 156269 178980 180206 176663 157894 162029 181909 178803 181624 177178
18147A77178k5583o824N0581P1990J4202m0512m0048K5271o607J3667L4756Q95
18135B68966p964N671J2120J0036J8038j8983n6566l1291k662M6377L5243j7475
18123B61510m7435k3147j5531J1863j675P360j6796k1925k284M39J1491J0286
18111A74156q701l8137k9217j2004J6147L1443K3378l190k8354r499J3493M38
18099A29953L0829O1547K8539k7953j0348Q53L994J3531o032J3335J3476k0318
18087B31406J315L6867L5133j9441j6806j6295j1271J4167J6132n206J8378J0841
18075B95220j9795k8150j6963j0044J1810m402r376q615j3576k0984j2826N393
18063A67692k75m6531j0852L2016m350J5623K4178k0301L571l1313l7975J4679
$$ plain form
18147 177178 151595 144771 195352 267342 281544 241032 200984 226255 219648 233315 268071 268966
18135 268966 261002 266673 278793 288829 306867 287884 231318 200027 197365 243742 278985 261510
18123 261510 214075 190928 175397 187260 185585 192945 176149 154224 151940 152379 163870 174156
18111 174156 165455 127318 98101 86097 102244 133687 157065 153875 125521 116022 129515 129953
18099 129953 160782 222329 250868 222915 212567 213420 217414 230945 224913 238248 251724 231406
18087 231406 232721 269588 304721 285280 268474 252179 240908 255075 271207 266001 284379 295220
18075 295220 275425 247275 230312 220268 232078 227676 218300 209685 196109 175125 162299 167692
18063 167692 167417 120886 110034 142050 137700 153323 177501 157200 160771 129458 91483 106162
18051A06162L1183J954K254K2716J6124r75J9538O769q585J4412l3132k4286L8029
18038A92163K5143L0350J5552r364l1997m802N6700m435k5411l4870j7717M978
18026A96290J3430P927k6392k4266j2062j5475J3782L693J38k4855l18M6378K4416
18013B02686k9487k4857j163k0791q311j8622l8354j2125L4932K8823O050j584
18001A17197K1438L165l3787k2160n579o770K7655J5502J640J072L1822L179k5301
17988A29073j2863k509m2776k4021J675O284K3558L5575J6200o782k0034j045
17976A02335J5371q814j2150k70O209j9870k4702j4489L8371R908q735K3293K4610
17963A31067j9339J2429K5422p74j5561j3090N469k597j423L116j3194o226j6634
$$ plain form
18051 106162 137345 139299 141553 164269 180393 179418 198956 205725 197140 211552 178420 154134 192163
18038 192163 217306 247656 263208 253844 221847 217045 273745 269310 243899 209029 191312 196290
18026 196290 209720 217647 191255 166989 154927 139452 153234 156927 157065 132210 131892 178270 202686
18013 202686 173199 148342 147179 126388 118077 99455 61101 48976 83908 112731 118781 117197
18001 117197 138635 141800 108013 85853 80274 73504 101159 116661 118301 119373 151195 154374 129073
17988 129073 116210 113701 70925 46904 48579 54863 78421 113996 130196 123414 103380 102335
17976 102335 117706 108892 96742 96472 102681 82811 58109 43620 81991 91899 83164 106457 131067
17963 131067 111728 124157 149579 148805 133244 120154 125623 123026 121603 124719 111525 105299 88665
17950H8665k6187Q433K7061P369K2249L0120L4367j4984l3725j7318R86L50j2950
17937A14436q812J3446L639J6950k1085j1226K910j3589m452j6368L5039K824
17925A13712q443J1530j6830m992k7953J7694N394P502O015J1138O434n966j0099
17912A05136l5350o839J2934j1024P914K2231L4099K5551L78j1354p704k1223
17900A14749m724j9821l293j3248J2098n958K7958J4006K3472M455L94R747K2605
17887A82440l380j2379K7648P572j9349J8610j8744j2335q416j913J3567J4539
17875A87860l315o633L57j2642j5212J333r233k5734k3003J031o590K4505J0812
17862A23536p750k3922l927o912K6288L7104L8900O697l6577k7372J2186j8278
$$ plain form
17950 88665 62478 70911 97972 105341 127590 157710 192077 177093 143368 126050 127036 127386 114436
17937 114436 105624 119070 122709 139659 118574 107348 110258 96669 92217 75849 110888 113712
17925 113712 105269 116799 99969 94977 67024 84718 90112 97614 103629 114767 121201 115235 105136
17912 105136 69786 62947 75881 64857 72771 95002 129101 154652 155030 143676 135972 114749
17900 114749 110025 90204 86911 73663 85761 79803 107761 121767 145239 149694 150088 159835 182440
17887 182440 179060 166681 194329 201901 182552 201162 182418 170083 161667 159754 173321 187860
17875 187860 184545 177912 178269 165627 150415 151748 142515 116781 93778 94809 88219 112724 123536
17862 123536 115786 91864 87937 81025 107313 144417 183317 190014 153437 126065 138251 119973
17850A19973K366K7426l697J8127J6175K197K998j0354q249q818k5846N360L9275
17837A76933O534j4469J1318K3950K3222L867j5355l6434k5669K9421J3589J1842
17825B08749k1964q475o951j4910j350Q435l398p146J222n045K9306K1915K364
17812B02752k456J3887k0131k1822k3619j0649Q008J0914J8337P672J1738J9745
17800B14376P355p385K6601k8228m1611K750K1552k23j206j7718k8204R730J5943
17787A73732J768Q371R091j8139Q995j2330o533J4497k5071J1808K3770Q193n739
17774A92413J0547K3854l449J467N35P736K0896j1643k1006J7526J9363K5509
17762B83748K3806N15O420J1323l1584m0575j8185k277J4487j3737m1992o197
$$ plain form
17850 119973 122339 149765 146068 164195 180370 182567 185565 175211 166962 158144 132298 137658 176933
17837 176933 183467 168998 180316 204266 227488 231355 216000 179566 153897 183318 196907 208749
17825 208749 186785 178310 171359 156449 155099 163534 160136 152990 154212 149167 178473 200388 202752
17812 202752 200296 214183 194052 172230 148611 137962 145970 156884 175221 182893 194631 214376
17800 214376 221731 214346 240947 212719 171108 173858 195410 195187 193981 176263 148059 157789 173732
17787 173732 175500 183871 192962 174823 183818 171488 164955 179452 154381 166189 189959 198152 192413
17774 192413 202960 226814 223365 224832 225367 233103 253999 242356 221350 238876 258239 283748
17762 283748 307554 308069 314489 325812 294228 253653 235468 233191 247678 233941 191949 185752
17750A85752N312j5781l8124j4840J2440O603k044k2020L739J0740J2717N662
17738A50156O074j2223K588P222Q274J6839J9843J7203J7439J6580J0656N635
17726B66286k3867m262L959j034M1356M0546N2383M7685K4244J2027J9589k61
17714D78651j7222O873L3685K7124j1495N2219O3479N7451L1119K7926O4009J06396
17702I20215J58321J90372K70264M02341N49371O79525P63492Q49577R77441J008179
17692F769098P72121L40809j9331j56020p3207L1166K12356K94832M21547N70163
17682I163534M90070J2692n35799r24855j072667j038832r58539r20402p87216
17673C427986n75046m44742l49221k19242j57341j33938o7577l1827k0675k5343
$$ plain form
17750 185752 191064 175283 137159 122319 134759 141362 139318 117298 121037 131777 144494 150156
17738 150156 156230 144007 146595 153817 162091 178930 198773 215976 233415 249995 260651 266286
17726 266286 242419 238157 242116 241082 282438 322984 375367 423052 447296 459323 478912 478651
17714 478651 461429 468302 501987 529111 517616 569835 633314 690765 721884 749810 813819 920215
17702 920215 1078536 1268908 1539172 1941513 2490884 3170409 3933901 4783478 5760919 6769098
17692 6769098 7541219 7882028 7862697 7706677 7633470 7664636 7876992 8171824 8593371 9163534
17682 9163534 9653604 9666296 9130497 8205642 7132975 6094143 5135604 4215202 3427986
17673 3427986 2852940 2408198 2058977 1839735 1682394 1548456 1480879 1449052 1428377 1403034
17663A403034J5837K6609L4998M4424Q0079R8997J64072K04980L01526M87394
17653B861950O26689Q63479J037417J251258J441843J673691J736312J484866
17645A2977505J115772R18045R46551J083694R51752N85714L66490M73547O93301
17636B0112371N87955J21429l36270m58500l75900o16522j224782j863135k123656
17627A3822990k016161j812940j587358j404331j164990r01508o48790m61980
17619C824932l31250k37779j40006o5607r562K3427O9449J12864J68033K65507
17609C680008L56810N14066P64915J053220J324172J565544J861386K189562K468044
17600A5777727K734878K873870K825494K574309J942529R06675l4492m73307k57886
$$ plain form
17663 1403034 1418871 1445480 1480478 1524902 1604981 1703978 1868050 2073030 2374556 2861950
17653 2861950 3488639 4352118 5389535 6640793 8082636 9756327 11492639 12977505
17645 12977505 14093277 15011322 15957873 17041567 17993319 18579033 18945523 19419070 20112371
17636 20112371 20700326 20821755 20485485 20026985 19651085 19034563 17809781 15946646 13822990
17627 13822990 11806829 9993889 8406531 7002200 5837210 4935702 4286912 3824932
17619 3824932 3493682 3255903 3115897 3050290 3040728 3064155 3133604 3246468 3414501 3680008
17609 3680008 4036818 4550884 5315799 6369019 7693191 9258735 11120121 13309683 15777727
17600 15777727 18512605 21386475 24211969 26786278 28728807 29635482 29600990 29127683 28869797
17591B8869797J57086N63619P59778P03240N04336p1793j136084k274173l018836
17582B5056970l189018l016794k820101k611561k323652j978946j541201j180788
17574F394909q83509o38975m96165l55378k60031j67812r9933m9060j9298M2183
17564C466931J25342K17682L01765M41876O27361Q90291J154708J337591J502877
17555A0066424J630239J819508K025270K168115K057081J747059J404855Q75810
17547B3794361J46148m66391p87937p13811m34559k60586l66051p67998j144986
17538A8998190j375082j541108j620845j650542j577868j453261j334707j265102
17530G179675j131105j005713q61072o40178m96543l68831l18562k52203k01473
$$ plain form
17591 28869797 29026883 29590502 30350280 31053520 31557856 31486063 30349979 28075806 25056970
17582 25056970 21867952 18851158 16031057 13419496 11095844 9116898 7575697 6394909
17574 6394909 5511400 4872425 4376260 4020882 3760851 3593039 3493106 3444046 3424748 3466931
17564 3466931 3592273 3809955 4111720 4553596 5180957 6071248 7225956 8563547 10066424
17555 10066424 11696663 13516171 15541441 17709556 19766637 21513696 22918551 23794361
17547 23794361 23940509 23474118 22686181 21972370 21537811 21277225 20911174 20143176 18998190
17538 18998190 17623108 16082000 14461155 12810613 11232745 9779484 8444777 7179675
17530 7179675 6048570 5042857 4181785 3541607 3045064 2676233 2357671 2105468 1903995
17521A903995j57730j31289j00332q2065p7721p1327k8796o3558q0744p9165m0825
17510I90443l1781n2496n3737q0729m4232l8335m2645m2841l2669m6648k4401
17499D99929j9970j5633J9570k6268l5946j8401l0508j4579J3904J488j1132o943
17487C55511J9080m7431k0243p6Q503L6517J6387j4658n198j5712n525K1948r479
17474C39624J5219K8100J9692J3804j3565l5330n80J4437J4937k2282j1615J5560
17462C78001n5750j4519j3094m701l6p982k5061o655N553K227k4838o2849l5720
17449A34576J1719j1699R016L2793k794m415j9786m952K6127O594j1939L299k7649
17436A40890j6076J1532K8529j375R109m44n896K5235k440j3169j5672m62j6894
$$ plain form
17521 1903995 1746265 1614976 1514644 1432579 1354858 1283531 1254735 1191177 1110433 1031268 990443
17510 990443 958662 906166 852429 771700 727468 689133 646488 603647 570978 524330 499929
17499 499929 479959 464326 483896 457628 421682 403281 372773 358194 372098 373586 362454 355511
17487 355511 374591 327160 306917 306841 315344 351861 368248 353590 348392 332680 327155 349103 339624
17474 339624 354843 382943 402635 416439 402874 367544 366964 381401 396338 374056 362441 378001
17462 378001 322251 307732 294638 289937 289901 281919 256858 250203 255756 257983 233145 170296 134576
17449 134576 146295 134596 143612 176405 173611 169196 149410 144458 170585 177179 165240 168539 140890
17436 140890 124814 136346 164875 163500 172609 172165 166269 191504 189064 175895 160223 159761 142867
17423A42867P735R140M404J2980M9245K2686p227J6221j1952l0093k6400j4295
17411A75311N873k4357o967L96K5633o588l7329j6370q224K1060j1503k1462k7772
17398F7701K4351L0191P23p248l4039K512K8347L427j9910k7695O462K316K75
17385G7413K1754N727l3029O882K4415m788k2735r874J1051m729q759J1330K5111
17372I9769m231j4353Q293J7995r137j9837k2145K009K6723L5711J0038M995J7255
17359A53085J6027J883p981l4240j7879N666o418k221J0090k433J9938K8749N651
17346A69917o592k9196j2860j2339K4913Q045R544l0021k0974J3374J4396k3415
17334A04792o030K5753K1890n031o993j7222Q028M823Q366J0806k2050p920L298
$$ plain form
17423 142867 150602 159742 164146 177126 226371 249057 241830 258051 246099 216006 189606 175311
17411 175311 181184 156827 149860 150256 175889 169301 131972 115602 107378 128438 116935 95473 67701
17398 67701 92052 122243 122966 115718 81679 84191 112538 115965 96055 68360 74822 77138 77413
17385 77413 99167 104894 71865 78747 103162 98374 75639 65765 76816 72087 63328 74658 99769
17372 99769 95538 81185 89478 107473 98336 78499 56354 58363 85086 120797 130835 135830 153085
17359 153085 169112 170995 163014 128774 110895 116561 110143 107922 118012 115579 135517 164266 169917
17346 169917 163325 134129 121269 108930 133843 141888 151432 121411 100437 113811 128207 104792
17334 104792 98762 124515 146405 141374 134381 117159 125187 130010 138376 149182 127132 119212 122510
17321A22510k452L75M2576L129J8188J0328K8616J2877K5751J5859k1150k5587
17309B31020Q500L6905J7747r310J0900K9614j2270N644K6644l600j288Q262N2256
17296D01024J6144k0860J7864M1708Q245K4446J4152N0251Q9063P2721O8362K8922
17284H12042O1250R9878J02545J09231J24893J35795J49746J66271K69991L84426
17274B416068M19917N20346P55036R92411J283431J757722K344509K895068L226777
17265A6611285L176189K639055J752993Q55922J75257k8750L01178Q23183R53219
17256B7259531N30829l65071j520193k555297l284501l544817l259330k720152
17248A0540999k134138j590397j212309r03629o65156n07032l97390k60675k40559
$$ plain form
17321 122510 120058 120433 163009 166138 184326 194654 223270 236147 261898 277757 256607 231020
17309 231020 239520 276425 294172 284862 295762 325376 313106 318750 345394 341794 340506 348768 401024
17296 401024 417168 396308 414172 455880 464125 488571 502723 552974 642037 714758 783120 812042
17284 812042 873292 973170 1075715 1184946 1309839 1445634 1595380 1761651 2031642 2416068
17274 2416068 2835985 3356331 4111367 5103778 6387209 8144931 10489440 13384508 16611285
17265 16611285 19787474 22426529 24179522 25035444 25210701 25181951 25483129 26306312 27259531
17256 27259531 27790360 27425289 25905096 23349799 20065298 16520481 13261151 10540999
17248 10540999 8406861 6816464 5604155 4700526 4035370 3528338 3130948 2870273 2629714
17239B629714j85423j47438j18728q8513q7608n8865l0888j1511J8444L2966M2880
17228A995030J9250P4060J22393J56020K25205L03316M03048N91469P93792J135589
17218E819172J580637K055918K519727K786312K665902K090132J266566L67652
17210B1152018j44026k90207k5309L15344L25674j32614q21520j632816k263768
17201A6482776k638726k637218k289277j820095j380106j074435q13199n80161
17193C249559m52799l53880k81379k00598j76730j44643j40720j21335q1541q2766
17183A213168r7325m9016l9278l8312m2153n6227m0398p4853o8177k9399j202
17172F76828k1182j3301j1611n884l461l2584J738j8612Q59J9221Q013L0392K2964
$$ plain form
17239 2629714 2444291 2296853 2178125 2089612 2002004 1943139 1912251 1900740 1919184 1952150 1995030
17228 1995030 2014280 2088340 2210733 2366753 2591958 2895274 3298322 3889791 4683583 5819172
17218 5819172 7399809 9455727 11975454 14761766 17427668 19517800 20784366 21152018
17210 21152018 21007992 20717785 20692476 21007820 21333494 21200880 20379360 18746544 16482776
17201 16482776 13844050 11206832 8917555 7097460 5717354 4642919 3829720 3249559
17193 3249559 2796760 2442880 2161501 1960903 1784173 1639530 1498810 1377475 1295934 1213168
17183 1213168 1115843 1066827 1027549 989237 947084 890857 850459 775606 707429 678030 676828
17172 676828 655646 642345 630734 624850 621389 588805 590543 571931 572790 592011 600024 630416 653380
17159F53380J1693J5903L511j6924O17K1503K6365K0762N0477O9700P8769Q3352
17147A019108P0884P7923J19604J70493J66608K26739K67183L22177M51595O29999
17137C522313Q58868J233218J679691K150132K486503K293412J374649N9924q91127
17128A4767583j098455o74105J01313P54421Q65161J82785q98680j849335k256535
17119I894153k085614j629163j197861q70040o09198m37125l33978k40003j70420
17110B320751j17097r8516n8825n2486j9395k7616J8070O4254J02461J26151J10999
17099B368751J00457J25083J78279K77655L20911M52759P03111R67632J378552
17090F873190J891793K562881L272138L708781L478664K485554R08573n46204
$$ plain form
17159 653380 665073 680976 684487 667563 668180 689683 716048 736810 787287 856987 935756 1019108
17147 1019108 1089992 1167915 1287519 1458012 1624620 1851359 2118542 2440719 2892314 3522313
17137 3522313 4381181 5614399 7294090 9444222 11930725 14224137 15598786 15658710 14767583
17128 14767583 13669128 12995023 13096336 13850757 14715918 14898703 14000023 12150688 9894153
17119 9894153 7808539 6179376 4981515 4111475 3502277 3065152 2731174 2491171 2320751
17110 2320751 2203654 2105138 2046313 1993827 1974432 1946816 1964886 2029140 2131601 2257752 2368751
17099 2368751 2469208 2594291 2772570 3050225 3371136 3823895 4527006 5494638 6873190
17090 6873190 8764983 11327864 14600002 18308783 21787447 24273001 25181574 24635370
17082B4635370j252471j088420l02573M68985O68590J81077q22396j999536k892041
17073A7596585l222366k983344k414287j815374j308271r92685p28503n20624
17065C611131l41184k29382j85868j45656j24643j42069j33246j05422j19436
17056B084225o1550n0978n7273m6983m4693m7345k5215M1440J15099J89768K63995
17045B360490M17162O28644Q62881J201581J565732J765080J539252Q11436r3341
17036A1058917o88476p76535l98741J67636N82977N75500M3062p29581j387463
17027H447296j667150j476841j162134q64568o24269m84446l38420k58956k15142
17018A355370j67021r9728r0246q3824n6391o3611o2457o2695l1367m0911l3910
$$ plain form
17082 24635370 23382899 22294479 21991906 22460891 23129481 23310558 22488162 20488626 17596585
17073 17596585 14374219 11390875 8976588 7161214 5852943 4860258 4131755 3611131
17065 3611131 3269947 3040565 2854697 2709041 2584398 2442329 2309083 2203661 2084225
17056 2084225 2022675 1971697 1914424 1867441 1822748 1775403 1750188 1791628 1906727 2096495 2360490
17045 2360490 2777652 3406296 4269177 5470758 7036490 8801570 10340822 11152258 11058917
17036 11058917 10370441 9593906 9195165 9362801 9945778 10521278 10564340 9834759 8447296
17027 8447296 6780146 5303305 4141171 3276603 2652334 2167888 1829468 1570512 1355370
17018 1355370 1188349 1088621 998375 914551 858160 794549 732092 669397 638030 597119 563209
17007E63209m9032j0294J3382j4877o6515m5070j7764J168J588m4274k5477j5186
16995B90858q586J1281r619m5553l551n511k0893j3917L754o200j0692K2173Q800
16982B12344J028O329j951k0306k7197k755K0527Q03o7714j8981K200M5964M357
16969A54648n459m798O67K788j0990j6624R998M485L1230L0800K678j9110l9898
16956A40415r947K5111o329k7431Q372R40n180R533j5623j154j4282r778k088
16943I2559k080l614n046j5258R945N501N872J4085k3696j7679M0882J9714j4234
16930A06951p344K8048j5780j8723q929k8868J348L4536j849q349N474l715J90
16917H2990k4166K2346K0642q819k4523j2195j7460m719j1942P194P500P435j4317
$$ plain form
17007 563209 514177 503883 517265 502388 435873 390803 373039 374207 375795 331521 306044 290858
16995 290858 282272 293553 283934 238381 234830 229319 208426 194509 198263 192063 181371 203544 212344
16982 212344 213372 219701 217750 197444 170247 167492 188019 188822 121108 102127 104327 150291 154648
16969 154648 149189 144391 145058 147846 136856 120232 130230 134715 165945 196745 199423 180313 140415
16956 140415 130468 155579 149250 121819 130191 131131 125951 135484 119861 118707 104425 94647 92559
16943 92559 90479 86865 81819 66561 76506 82007 87879 101964 78268 60589 101471 121185 106951
16930 106951 99607 127655 111875 93152 84223 55355 56703 91239 89390 81041 86515 82800 82990
16917 82990 58824 81170 101812 92993 68470 56275 38815 34096 22154 29348 36848 44283 29966
16904B9966r839r528J4212N1754j7020k4079J2229J002M031J0062o746k0140P234
16891D3138j5498k4457j1297j5143j8K0024L2331l245J2106k282n976J1742K5938
16878F7363j4727l4102j5538K0452J0857K2689j5459j4781L235j0525J5286J5724
16866E0474k6303k5091R069K6653K813l414j2129j2471R145R234p341P605j0412
16853A7832l8754L84P271j3296N339J0824J9277K4697q861J7313J682O485j4200
16840C5993N296j9706l968J8781J8492Q075j4966J1782k405q785l597k4423R016
16827B9585K578N286l666k1219k0154Q896J9496k856j9701M772K7831m08q649
16814B1791K723L172j1748k9613l1519O557K9233M8602k849k8368K16j232K7737
$$ plain form
16904 29966 20127 10599 24811 76565 59545 35466 47695 48697 52728 62790 56044 35904 43138
16891 43138 27640 3183 -8114 -23257 -23275 -3251 29080 25835 37941 35659 29683 41425 67363
16878 67363 52636 18534 2996 23448 34305 56994 41535 26754 29989 19464 34750 50474
16866 50474 24171 -920 8149 34802 37615 34201 22072 9601 18746 27980 20639 28244 17832
16853 17832 -20922 -20538 -13267 -26563 -21224 -10400 8877 33574 24713 42026 43708 50193 35993
16840 35993 41289 21583 17615 36396 54888 62963 47997 59779 57374 48589 44992 20569 29585
16827 29585 32163 37449 33783 12564 -7590 1306 20802 17946 -1755 3017 30848 30440 21791
16814 21791 24514 27686 15938 -13675 -45194 -38637 -9404 39198 36349 7981 8197 6965 34702
16801C4702O850k0808n0132j4782K349K0361K0330J4660M484K6871J312k4920
16789B1277k1497Q622J9770j9254m863j5841L5373L060k2081K000j0754j4364
16777a8552N862M5059r443K0228L4881L247l4062j3693l00k297M4676L7924K857
16764A16387J9959J4975m434J7031j5246K871j304j2603L680j1201k0294J3444
16752A23265N979j4697l6201k3889j1879Q013o168L498o254O927K9683k723k7276
16739D8278k3732l1795r97K7332L4069J6679j1470j2215j3000p025j4707m825
16727F592K2450P693J163J743k798Q863K845J3759j2153J5596N1827J6992q489
16714A26083j116J2516Q555P463J6636j4662l874j006n699k3092l900j9522j7490
$$ plain form
16801 34702 41552 20744 -29388 -44170 -41821 -21460 -1130 13530 18014 44885 46197 21277
16789 21277 -220 8402 28172 8918 4055 -11786 23587 26647 4566 6566 -4188 -18552
16777 -18552 -12690 32369 22926 43154 78035 81282 47220 33527 33227 30930 75606 113530 116387
16764 116387 136346 151321 146887 163918 148672 151543 150239 137636 141316 130115 109821 123265
16752 123265 129244 114547 78346 54457 42578 50591 44423 47921 41667 48594 78277 75554 48278
16739 48278 24546 -7249 -8246 19086 53155 69834 58364 46149 33149 26124 11417 6592
16727 6592 29042 36735 37898 39641 36843 45706 48551 62310 50157 65753 117580 134572 126083
16714 126083 124967 137483 146038 153501 170137 155475 151601 150595 144896 121804 117904 98382 80892
16701H0892J9424q191J44l607k5254m44p862m287o011O800j0313l573r354K4176
16687E2540M4481k9560j0771j3501j5438O751J8325n572k334j8080k8999j6899
16675a9057K4665O828P876j6140j994J4919j129j0024n3218k0184j2324K0352
16663e9430J1974J2564M1187K1491J0666k0399l3139K422K487K471r316j1111
16651b8133J1345J9052K928M913q794j4556R718J7075K1212p114P273J6529O123
16638E7571J4883r567k1212K732p072J25q218K580J9688j0093R883k7043j1126
16625A3131L7408K0109p409p774q106j6890N130P917Q250J9999l823K3325r858
16612H1409l1818J739j3559P706Q157M792j0470l0666L137n916j4690O874K249
$$ plain form
16701 80892 100316 92125 92269 88662 63408 62964 55102 50815 44804 51604 41291 37718 28364 52540
16687 52540 97021 67461 56690 43189 27751 34502 52827 47255 44921 26841 -2158 -19057
16675 -19057 5608 12436 20312 4172 2178 17097 15968 5944 -47274 -67458 -79782 -59430
16663 -59430 -47456 -34892 6295 27786 38452 18053 -15086 -12664 -10177 -7706 -17022 -28133
16651 -28133 -16788 2264 5192 10105 1311 -13245 -3527 13548 34760 27646 34919 51448 57571
16638 57571 72454 62887 41675 44407 37335 37460 29242 31822 51510 41417 51300 24257 13131
16625 13131 50539 70648 63239 55465 47359 30469 35599 43516 51766 71765 67942 91267 81409
16612 81409 49591 51330 37771 45477 53634 58426 47956 17290 20427 14511 -179 6695 8944
16599H944n522J3735J6317J3412j092j7726j0120R299j4453J038K6569j3148k3350
16586C903M394N986K3586p77K018Q122L9236N8882M20l5282R104J7448J1773P049
16572A55862m811J2685k2626m068j7148j3831m467n058m385l111j8095l0132j8457
16559B2358j1703j7229j1285J478l137L8394K3810j1293J1046J1838p100k1205
16547B5972q464M670j8595r462N988J7615P343j7815K2859N577l0172j9796J9517
16534E237r235J9139L0362K1310j9106k9340R975L7279J5750J733P660l009l3494
16521E4261l102J713J7793k0451m6350r695N593K455J7740Q091K600J9477M50
16508E0575j9250k9879K6618L714k4199j1279K7169j3505j1854m383O023L0517
$$ plain form
16599 8944 3422 17157 33474 46886 45794 28068 17948 27247 12794 13832 40401 27253 3903
16586 3903 8297 14283 37869 37092 39110 47232 86468 145350 145770 110488 119592 137040 148813 155862
16572 155862 151051 163736 141110 137042 119894 106063 101596 96538 92153 89042 70947 40815 22358
16559 22358 10655 -6574 -17859 -16381 -19518 18876 42686 31393 42439 54277 47177 25972
16547 25972 17508 22178 3583 -5879 109 17724 25067 7252 30111 35688 5516 -14280 5237
16534 5237 -3998 15141 45503 66813 47707 18367 28342 65621 81371 83104 90764 87755 54261
16521 54261 51159 52872 70665 50214 3864 -5831 -238 2217 19957 28048 30648 50125 50575
16508 50575 31325 1446 28064 31778 7579 -3700 23469 9964 -1890 -6273 -250 30267
16496C0267q678k1657k5107m532P764J3289O208Q584j3595K6330J06j2303K896
16483I572j1059l0292M11K6886o079m884K3242J0940M342k3902j3091L7732j206
16470B2612k2476m3J4603J3140l4075N89N226m729L3227M0344j9647L743J0521
16457F3035j5750l7684J788k5515j3208l374K0929q045J9086N329M067M984k6605
16444a0963m0726J3813N8598K7451j6153j1152j2295q199J0244j815k008j602
16432E193j5958q845l18J1725M037k3559o620J0305l031O153P533j650R427q145
16418a3753m254k647J095O180J7345K4132J7178k6028k2428Q75K8622K2386J1757
16405F0460l0942p560J6571j1890l037k3699k0900M763K5135j4653K0451j3273
$$ plain form
16496 30267 21589 -68 -25175 -29707 -21943 -8654 -2446 6138 -7457 18873 18979 6676 9572
16483 9572 -1487 -31779 -31368 -4482 -10561 -15445 7797 18737 23079 -823 -13914 23818 22612
16470 22612 136 93 14696 27836 -6239 -5650 -424 -5153 28074 68418 48771 52514 63035
16457 63035 47285 9601 11389 -14126 -27334 -30708 -9779 -17824 1262 6591 10658 15642 -10963
16444 -10963 -51689 -37876 20722 48173 32020 20868 8573 374 10618 8803 6795 5193
16432 5193 -10765 -19610 -19928 -8203 -4166 -27725 -34345 -24040 -27071 -20918 -13385 -15035 -5608 -13753
16418 -13753 -18007 -20654 -19559 -13379 3966 28098 45276 19248 -3180 -2305 26317 48703 60460
16405 60460 29518 21958 38529 26639 23602 -97 -20997 -16234 8901 -5752 14699 1426
16393A426m182J8304o623k3274J643j043J8267m349j8029M38J3474K5193p719
16380A3526j8978p67K9144J6202j2007K702l564k8969k9823K668J3308Q605o007
16367a3960M1552J0631k7073k7228K0695J5379j8125m2285k2606K8158K5681K8944
16355A9763m135p784j3960L6717R160J0346j4223k5317j4616J3364L4015K423
16343D5753m015l1263n023k4534o885p834p817J4081j8466j3390J1947J6206N599
16330b5641j8346K3799j4736J7064J4587k666k5411k901J1962K7265J8215j5459
16318G732k0925j2897j096J0895l052r250j5379O935K1757L380j6120O564P507
16305a3949J9894L6770o740l7157J0279J2422j2891j321K0958K3703M034j0164
$$ plain form
16393 1426 -2756 15548 8925 -14349 -12706 -13749 4518 169 -17860 -17422 -3948 21245 13526
16380 13526 -5452 -6219 22925 39127 27120 29822 26258 -2711 -32534 -29866 -16558 -7953 -13960
16367 -13960 27592 38223 11150 -16078 4617 19996 1871 -40414 -63020 -34862 -9181 19763
16355 19763 15628 7844 -6116 30601 39761 50107 35884 10567 -4049 9315 43330 45753
16343 45753 41738 10475 5452 -19082 -25967 -33801 -41618 -27537 -46003 -59393 -47446 -31240 -25641
16330 -25641 -43987 -20188 -34924 -17860 -3273 -5939 -31350 -34251 -22289 4976 23191 7732
16318 7732 -13193 -26090 -27186 -16291 -19343 -28593 -43972 -37037 -15280 -11900 -28020 -21456 -13949
16305 -13949 5945 42715 35975 -1182 9097 21519 8628 7307 28265 51968 56002 45838
16293D5838k7811o288p570k3134j7855k082R392J2041M990J9180j3877J1310J1681
16280A5815l729k630k0354l7465J2J4750k0625l2301L2073K1998j4970K1457J6648
16267i321L314N670J2661k0470l8333K996J8821O319L0917J6751O952M4k975L02
16253C3648k9507J969J1567M94j9504l137J6444J8175J0834j930R051k4194l0405
16240f495l0679l875P764K9357j9155K3134K3483j9286j41K5974M693k1641l862
16227I271q788K3263j1926m253J7135J8784R002j1462N903K5037l1193m4446p224
16214a0897K804j2118j6423L6544J9732k9621j4612J9630J7158J185l3263m490
16202b4371J5354J1647j46K66j5052r484J9736N763j618K5765q300j7660J708
$$ plain form
16293 45838 18027 11739 4169 -18965 -36820 -38902 -29510 -17469 -12479 6701 -7176 4134 15815
16280 15815 12086 9456 -10898 -48363 -48351 -33601 -54226 -86527 -54454 -32456 -47426 -25969 -9321
16267 -9321 -6007 -337 12324 -8146 -46479 -43483 -24662 -18343 12574 29325 36277 36321 33346 33648
16253 33648 4141 6110 17677 18171 -1333 -4470 11974 30149 40983 39053 48104 23910 -6495
16240 -6495 -37174 -41049 -33285 -3928 -23083 51 23534 4248 4107 30081 34774 13133 9271
16227 9271 483 23746 11820 7567 24702 43486 52488 41026 46929 71966 40773 -3673 -10897
16214 -10897 -8093 -20211 -36634 -90 19642 -9979 -24591 -4961 12197 13382 -19881 -24371
16202 -24371 -9017 2630 2484 2750 -12302 -21786 -2050 3713 2095 27860 19560 1900 3608
16189C608J3619J4214j387m726J521P347K2028J2904k1613k4867n4351k1414p687
16176f0804K4932K2400j774J5002K5788J1516l4832Q946J6228q640r604l9220
16164c0062M928K5170q930r463M687r877L4345j7958m4234j2904J0594J4562j8950
16151e8092p90J1331J4040J7677L636J1795J2928k006O884L707k8699M287K0953
16138A7651j9737k4639J8088J9080P859j50j0942j9163J1504q595j3505J6245
16126f304K261J7478o953m0418j3987J4464J6907K3080k9164J411M50L055J2180
16113e540j2317k3824N330K3533K566J3192J5261m651k7215k1650O267K4405k100
16100f743k663O304k8345k7152J119L5658J6639K211j4597k2306J7042J9248o480
$$ plain form
16189 3608 17227 31441 30054 25328 26849 34196 56224 69128 47515 22648 -31703 -53117 -60804
16176 -60804 -35872 -13472 -15246 -244 25544 37060 2228 11174 27402 18762 9158 -30062
16164 -30062 -25134 36 -8894 -18357 -13670 -23547 10798 -7160 -51394 -64298 -53704 -39142 -58092
16151 -58092 -58882 -47551 -33511 -15834 -12198 -403 12525 10519 17403 21110 -7589 -3302 17651
16138 17651 -2086 -26725 -8637 10443 18302 18152 7210 -11953 -449 -9044 -22549 -6304
16126 -6304 -4043 13435 6482 -33936 -47923 -33459 -16552 6528 -22636 -21225 -20775 -17720 -5540
16113 -5540 -17857 -41681 -36351 -12818 -10252 2940 18201 13550 -13665 -35315 -29048 -4643 -6743
16100 -6743 -9406 -3102 -31447 -58599 -57480 -21822 -5183 -2972 -17569 -39875 -22833 -3585 -10065
16087a0065n800q047j4661P431J0092n628j3039j3129M652N246J2284o703O395
16074c0972K0237L3076J1370j7894j1845p232l561M0580M4j9727j2206R889M318
16061A6077j8413J6267M588j6536q178K2715j2586j8673l2159J4851J8082K9406
16049A5441l2046k6687k1972J332L8114R249R822J993j3050j4117K5552J277j0090
16036a5182k5637M295Q639p357l442J216J2047K7099J7950n386k2671l3604J4896
16023b7137J1232q452O890J3383P294j0903J0549j5056l5250L708K4819K9779
16011A0856j622j5036j0662j9394J2601P622M977J0489N826j7569K6488J7566
15999C2142o566l1602k4969K6843L9186k9247j3495K247j1406Q213P453R150J4753
$$ plain form
16087 -10065 -15865 -23912 -38573 -31142 -21050 -26678 -39717 -52846 -48194 -42948 -30664 -37367 -30972
16074 -30972 -10735 22341 33711 15817 3972 -3260 -6821 33759 33803 14076 1870 11759 16077
16061 16077 -2336 13931 18519 1983 -6195 16520 3934 -14739 -46898 -32047 -13965 15441
16049 15441 -16605 -43292 -65264 -63932 -25818 -16569 -6747 -4754 -17804 -31921 -6369 -5092 -15182
16036 -15182 -40819 -36524 -27885 -35242 -38684 -37468 -25421 1678 19628 14242 -8429 -42033 -27137
16023 -27137 -15905 -24357 -17467 -4084 3210 -7693 2856 -12200 -47450 -43742 -18923 10856
16011 10856 9234 -5802 -16464 -35858 -23257 -15635 -10658 -169 5657 -11912 14576 32142
15999 32142 25576 -6026 -30995 -4152 35034 5787 -7708 -5461 -16867 -8654 -1201 7949 22702
15986B2702P780l622j1199J8031O242j4868l087j7842k6995k4599N107M9791J9353
15973B6794n559M309o989k3106O85N643q121j0853O641K5751l14l2879k7391R569
15959c5820M0440L0428j9306j9745Q806l849j0255K1544j9189l3740O3J6937K139
15946b1547r632q963l017J7415J9174P665K744K958m1932j4661K4930J220M151
15933a9495M180n261N047j651j6519j9778k9468j0575j819K8511R534k144L1036
15920b8402M588k5017j7980K574J4496K4052j8637j0951M473Q976J9448J7297
15908e083J3428N92n370M373J9014k263J3453k0882k2979j2047j630L486J9136
15895C228n065j8731j3092n586L2798M1928J6834l1028k5316J4070k216j3934
$$ plain form
15986 22702 30482 26860 15661 33692 39934 25066 21979 4137 -22858 -47457 -42350 7441 26794
15973 26794 21235 25544 18555 -4551 -3866 1777 -6344 -17197 -10556 15195 14881 -17998 -45389 -35820
15959 -35820 4620 35048 15742 -4003 4803 954 -9301 12243 -6946 -40686 -40623 -23686 -21547
15946 -21547 -31179 -40142 -43159 -25744 -6570 1095 3839 6797 -35135 -49796 -24866 -23646 -19495
15933 -19495 -15315 -20576 -15529 -17180 -33699 -53477 -82945 -93520 -95339 -66828 -57294 -59438 -28402
15920 -28402 -23814 -48831 -66811 -64237 -49741 -25689 -44326 -55277 -50804 -41828 -22380 -5083
15908 -5083 8345 8937 3567 7940 26954 24691 38144 17262 -5717 -17764 -19394 -15908 3228
15895 3228 -1837 -20568 -33660 -39246 -6448 35480 52314 21286 -4030 10040 7824 -6110
15883f110K3190j8859m1193n223K2583K0222L2389o9756m2440N608L7701N9575
15871A7687J8730l230J5575l026j7354k720R71j0379k56L1030j7880k0404k4346
15858a5602p792N538q425J7491r389J0839O932P547J3393q261J4509j459j9499
15845E822k8094j0267k2666j194j6216L762K0065K2985J1933q43l131l133M671
15832a6306k8118q754m762K3807J9597o128p53K5416N209j2770J1101M343r49
15819A0933k994o89k1968j3251J665L3632K8805k1488k7545k6579j0465R737M630
15806c5577J9132K0544j8099q388l955j1385l902L6077J5764j1949R7K0541j2779
15793F121k0981j2451k0473J1448Q644j5906o513k6831r865J8874Q531R424O14
$$ plain form
15883 -6110 17080 -1779 -42972 -48195 -25612 -5390 26999 -42757 -85197 -79589 -41888 17687
15871 17687 36417 33187 48762 45736 28382 25662 26633 16254 15998 47028 29148 8744 -15602
15858 -15602 -23394 -17856 -26281 -8790 -18179 -7340 -408 7139 20532 12271 26780 25321 5822
15845 5822 -22272 -32539 -55205 -56399 -72615 -68853 -48788 -25803 -13870 -14713 -17844 -20977 -16306
15832 -16306 -44424 -53178 -57940 -34133 -14536 -20664 -21417 3999 9208 -3562 7539 11882 10933
15819 10933 7939 7250 -14718 -27969 -26304 7328 36133 14645 -12900 -39479 -49944 -40207 -35577
15806 -35577 -16445 4099 -14000 -22388 -26343 -37728 -41630 -5553 10211 -1738 -1641 18900 6121
15793 6121 -14860 -27311 -47784 -36336 -27692 -43598 -50111 -76942 -86807 -67933 -59402 -49978 -49364
15780d9364L776K1295k48l2781k710L4044J9914K290k1143K4343M0435o717j7491
15767A5643J789N788j1465p720j1732k4396K834J5299m44j4892k0916k782J5946
15754c7048K6682J9836J0750j0589J6307j1918j4215j9949j9164O790L0757j9265
15742b1026l2134L0357K3980j894j8977l1222K721J6537J3720L6437M2906k0202
15730D1203k4939k1283j3675j4273J3548m94q858O329K7777k8287j3005J9763
15718a6194J711J4371k610k3858m964J957J9651j7937l2285K0218L1428n664L5294
15705B1118n714j2651k4085J1650n308k689j0457N794J1719J275j929k143J4420
15692A000j0599K0447K8212l2019k6099K7382L946J4501J0319K714k4324R985
$$ plain form
15780 -49364 -45588 -24293 -24541 -57322 -60032 -25988 -6074 -3784 -24927 -584 39851 33134 15643
15767 15643 17432 23220 11755 4035 -7697 -32093 -29259 -13960 -14404 -29296 -50212 -52994 -37048
15754 -37048 -10366 9470 20220 9631 25938 14020 -195 -20144 -39308 -32518 -1761 -21026
15742 -21026 -53160 -22803 1177 -717 -19694 -50916 -48195 -31658 -17938 18499 61405 41203
15730 41203 16264 -5019 -18694 -32967 -19419 -19913 -28771 -22442 5335 -22952 -35957 -16194
15718 -16194 -14483 -112 -2722 -26580 -31544 -29587 -9936 -27873 -60158 -39940 -8512 -14176 21118
15705 21118 15404 2753 -21332 -9682 -14990 -17679 -28136 -22342 -10623 -9348 -11277 -13420 1000
15692 1000 -9599 10848 39060 7041 -19058 8324 12270 26771 37090 39804 15480 25465
15680B5465K087p861k0214K1336L2038P970n0623l0660M903J5063R515J2926j8246
15667C699j6043M767m822J2137K5286L2081k040k4431O517J7771j6068j9746k4647
15654e539j2335J8233K8322j2852j7744L383k3596N05k0962r104J7378J718K1522
15641a1071q31M155J2610k855j9262k3409k7360J3136M6536j7972j1122J0701
15629b6744Q8M3547J1562j4516l316j1179k3967j8153j923M4074K5097j2930p078
15616D562J4885j770J4878J6072R017m722l4894l0198k1778k26J5259K5848l547
15603C386j1397Q210k7973k0659M586O486n542R248K645J5143J5521K199J710
15590C563j3973r810o370k342M0542J9474j7319q337M83p683j59N714q22K161
$$ plain form
15680 25465 27552 19691 -523 20813 52851 60821 10198 -20462 -15559 -496 9019 21945 3699
15667 3699 -12344 -7577 -12399 -262 25024 57105 55065 30634 37151 54922 38854 19108 -5539
15654 -5539 -17874 359 28681 15829 -1915 1468 -22128 -21623 -42585 -51689 -34311 -32593 -11071
15641 -11071 -11902 -7747 4863 2008 -17254 -40663 -68023 -54887 -8351 -26323 -37445 -26744
15629 -26744 -26656 16891 28453 13937 10621 -558 -24525 -42678 -44601 -527 24570 11640 4562
15616 4562 19447 17677 32555 48627 57644 52922 18028 -12170 -33948 -34174 -18915 6933 3386
15603 3386 -8011 199 -27774 -48433 -43847 -37361 -42903 -33655 -31010 -15867 -346 1853 3563
15590 3563 -10410 -20220 -26590 -28932 11610 31084 13765 5428 5911 -1772 -1931 3783 2961 5122
15576E122J679j6985L630K8825J5704L400j0160J8318R943K845k7584j6359j0770
15563G608R168j0638l7189j1806J0056J2572M604k331J0067n761k9105j3135R166
15550d6724L710J1940K3234J223j0719k1367j192L2170K4549n333N234k241l4303
15537a9819m0437j2369q596L236K8133P9879P475p560n043k3653l2582N527J6683
15524i126J7672q528j3699J7822N96k969P337N384o98k0576k3642k108r180j2722
15510e4437J0656L1045J2151Q659r711k0038j2261j2367J3226O49j2622o89k604
15497d8343j4787K623R316O827J5525J3608k766R766O090k556j3314j820L778
15484a6053K613Q393j4461j0282L0498M319r152n78k2704j4724K0767J5490j6635
$$ plain form
15576 5122 6801 -10184 -6554 22271 37975 41375 31215 49533 59476 62321 34737 18378 7608
15563 7608 16776 6138 -31051 -42857 -32801 -20229 -15625 -17956 -7889 -13650 -42755 -55890 -46724
15550 -46724 -43014 -31074 -7840 -6617 -17336 -38703 -39895 -7725 16824 11491 16725 14484 -19819
15537 -19819 -60256 -72625 -81221 -77985 -49852 30027 37502 29942 24899 1246 -31336 -25809 -9126
15524 -9126 8546 18 -13681 4141 4737 1768 9105 14489 13791 -6785 -30427 -32535 -41715 -54437
15510 -54437 -43781 -12736 -585 8074 -1637 -21675 -33936 -46303 -33077 -32428 -45050 -45739 -48343
15497 -48343 -63130 -60507 -51191 -44364 -28839 -15231 -17997 -8231 -2141 -4697 -18011 -19831 -16053
15484 -16053 -13440 -5047 -19508 -29790 708 5027 -4125 -4703 -27407 -42131 -21364 -5874 -22509
15471b2509k3020M549l456K1462j541o818j2010J3667L7545j6131l215J9858j9138
15458a0757j9693j2254j770o843n319J7573M122k089Q275p89k1908L025J2106
15445c6321J2694K6026L637j8851k3998J2309J6993M589J4213L124r383J4938
15433A9970o363J6888j1322j2030l6073P7o064k6246N469K1137j9217j8334J8113
15420e3995L9951K739J6466J4059J6198J2542m948k2029j7478j1551K7248J3068
15408C2270k4963n450k5747J3489K0391R093k5649j880j7467K6204L128j9366
15396a5947N123J3889k722r284J2942Q723n904P664j7401l329N728L93l8002J593
15382c6534N097R540J2193L7500r254l2106N045j8034j6704J3263l914O26k27
$$ plain form
15471 -22509 -45529 -40980 -44436 -22974 -24515 -31333 -43343 -29676 7869 -8262 -11477 8381 -10757
15458 -10757 -30450 -42704 -44474 -51317 -56636 -39063 -34941 -37030 -28755 -29544 -51452 -48427 -36321
15445 -36321 -23627 2399 6036 -12815 -36813 -24504 -7511 -2922 11291 14415 5032 19970
15433 19970 13607 30495 19173 7143 -28930 -28853 -34917 -61163 -55694 -34557 -53774 -72108 -53995
15420 -53995 -14044 -11305 5161 19220 35418 47960 43012 20983 3505 -8046 19202 32270
15408 32270 7307 1857 -23890 -10401 9990 19083 -6566 -8446 -25913 291 3419 -15947
15396 -15947 -10824 3065 343 -8941 4001 12724 6820 14484 -2917 -6246 -518 -125 -38127 -36534
15382 -36534 -31437 -21897 -9704 27796 18542 -13564 -8519 -26553 -43257 -29994 -33908 -33282 -33509
15369c3509o398J9908J7259m449P259J762J0821K576P185n428l0189k3698J3783
15356b3118R417l2938k526K0422k2801r323l7637J6443L1138J3277L2450j1113
15344a6309k8495K058j0309O444J3293o515l219O794O112J6869K9075L9472k7748
15331B7522l5264j4033J0180J1548J2281j6525n7268K106J9099k383R736J4757
15319a8244P92K3348o500r246j4183k0239r249J173J8957j6849j8068n490J7022
15306e6776j7139J9815J4541K1086j4420Q465K1213j1941k7175n56J0828j4524
15294d6583j1472K9487L790J970J3225J6640J3574K3447M5011k0223o1095k5333
15282a7562l984N974J8293Q534J4888J157j0751j2586j9121J3859m855k9651k2016
$$ plain form
15369 -33509 -39907 -19999 -2740 -7189 70 1832 12653 15229 22414 16986 -13203 -36901 -23118
15356 -23118 -13701 -46639 -49165 -28743 -51544 -60867 -98504 -82061 -50923 -37646 -5196 -16309
15344 -16309 -44804 -42746 -53055 -46611 -33318 -39833 -43052 -36258 -30146 -13277 15798 55270 27522
15331 27522 -7742 -21775 -11595 -47 12234 -4291 -61559 -59453 -40354 -42737 -33001 -18244
15319 -18244 -17452 5896 -604 -9850 -24033 -44272 -53521 -52348 -33391 -50240 -68308 -73798 -56776
15306 -56776 -73915 -54100 -39559 -18473 -32893 -24428 -3215 -15156 -42331 -42887 -32059 -46583
15294 -46583 -58055 -28568 -24778 -22808 -9583 7057 20631 44078 89089 68866 7771 -17562
15282 -17562 -21546 -15572 2721 11255 26143 27300 16549 3963 -15158 -1299 -6154 -35805 -57821
15269e7821K6592K4189k661n603k216j0564q082Q898L013K2684k4875r748J2457
15256b3737J5103J642j3634j5401N388L2813J3157j2317j5631L938j4055J0188
15244a2546L1261J004j0569l1274j009P357N086R456J8305J7686j5454k2921O006
15231B388Q794M606M912k7718l295Q14q363J5748J5424j9684n330k9216j5653
15218e6573R198K3370K8105M611k7175k9451j4190R982M6768J4467K09k603l4416
15205b7698n362N861L680J203N0860N33l1081r795P523J0539j9Q258J5032j0967
15191A8567M630J728j9364j1586J53M470j5085J1716J7512J7871J0968N216J080
15178D7876l0698k7638J6929l2950j2829o631K8307J7114k419n31l1189J6222
$$ plain form
15269 -57821 -31229 -7040 -9701 -15304 -17520 -28084 -36166 -27268 -24255 -1571 -26446 -36194 -23737
15256 -23737 -8634 -6992 -20626 -36027 -30639 2174 15331 3014 -12617 -8679 -22734 -12546
15244 -12546 18715 19719 9150 -22124 -23133 -15776 -10690 -1234 17071 34757 19303 -3618 2388
15231 2388 11182 15788 20700 -7018 -10313 -9499 -17862 -2114 13310 -6374 -11704 -40920 -56573
15218 -56573 -47375 -24005 4100 8711 -18464 -47915 -62105 -52123 -5355 9112 9321 6718 -27698
15205 -27698 -33060 -27199 -23519 -22316 28544 29077 -2004 -11799 -4276 6263 6244 14502 29534 18567
15191 18567 23197 24925 5561 -6025 -5872 -1402 -16487 -4771 12741 30612 41580 46796 47876
15178 47876 17178 -10460 6469 -26481 -39310 -45941 -17634 -520 -2939 -3470 -34659 -18437
15166a8437L4088n358Q624l6790k8266O507o82P496P001J8300R422q791k6563
15153c3449j2949K057L3710J3883K264P479j6341r465n756k3427J599J7519M8289
15140B5413j769o719p029k233O499M28l7260K02J5013j3852o461J2162O233K1334
15126A1961J542l332k9245O976J8888l0509l4530p24j1258j7793K7317L4967Q93
15113b4847j9547j5898K2374K1737r15L5434P496k2008l9903j5401J0316R497
15101c1665n162j029K3090J2263l280J7880K4180k2492l4445k9729n839O000J2287
15088c7941q450j6383J2088J0588R101M0320K4111k8118j2289P949j5218r986
15076b4228j3711P64J2533J9677k880l576j9341l2638K2597k950J2876r455O409
$$ plain form
15166 -18437 15651 10293 18917 -17873 -46139 -39632 -40314 -32818 -25817 -7517 1905 -6886 -33449
15153 -33449 -46398 -44341 -10631 3252 5516 12995 -3346 -12811 -18567 -41994 -40395 -22876 25413
15140 25413 23644 16925 9896 7663 14162 14590 -22670 -22468 -7455 -21307 -27768 -15606 -9373 11961
15126 11961 13503 10171 -19074 -12098 6790 -23719 -58249 -58973 -70231 -88024 -60707 -25740 -24847
15113 -24847 -44394 -60292 -37918 -16181 -17096 18338 25834 3826 -36077 -51478 -41162 -31665
15101 -31665 -36827 -37856 -14766 -2503 -5783 12097 36277 13785 -20660 -50389 -56228 -50228 -37941
15088 -37941 -46391 -62774 -50686 -40098 -30997 9323 33434 5316 -6973 976 -14242 -24228
15076 -24228 -37939 -37175 -24642 -4965 -7845 -11421 -30762 -63400 -40803 -43753 -30877 -40332 -33923
15063c3923M7396k22k4368M78l506L2149J1115J6397k0850j8500k8248Q1m5n006
15049b7052n322R600L1331J4244j0276k0286k4633O914M215J0724o24J672J1929
15036B436J0348M268o247k7521o484R195l473K8568L4655k9206k6495k213L0850
15023A8681k6078m13k944K3179J6025J1356j2887j9017Q333q636k8917L541M096
15010a3681J5058O307P532j0156l339K3843J1705j5204J4723J6623r51j6306k0100
14997A6054K6566J2366j7733k3857l5419m911K3967J0739l0184K753M089j0033
14985b5603j6537K119n901l342O495K3798O300j7999K6496J4470P360j2592k8299
14972b3235J9408q441L116R509J5717N250k8554l1274j4062l934j850J5017J5350
$$ plain form
15063 -33923 13473 13251 -11117 -10639 -14145 18004 29119 45516 24666 6166 -22082 -22001 -22046 -27052
15049 -27052 -32374 -22774 8557 22801 12525 -7761 -32394 -25480 -21265 -10541 -11165 -9493 2436
15036 2436 12784 17052 10805 -16716 -23200 -14005 -17478 11090 45745 16539 -9956 -12169 18681
15023 18681 -7397 -7810 -10754 12425 28450 39806 26919 7902 16235 7599 -21318 -17777 -13681
15010 -13681 1377 7684 15216 5060 1721 25564 37269 22065 36788 53411 52460 36154 16054
14997 16054 42620 54986 37253 13396 -22023 -26934 -2967 7772 -22412 -19659 -15570 -25603
14985 -25603 -42140 -40021 -45922 -49264 -42769 -18971 -12671 -30670 -4174 10296 17656 5064 -23235
14972 -23235 -3827 -12268 -9152 357 16074 21324 -7230 -38504 -52566 -56500 -58350 -43333 -27983
14959b7983r830o935n672K0986J7193r977j318o945P665P482K0379J0801l721
14946A2125Q645j8592k9625j0771K6304K5952k3037k8449j1920K022n195j7431
14934f9972J3346K1531n492m784j0264p779N19k80q779L673J053R866P739q071
14920e7694P337J5427J8407N77k2674J1982o554N467K1979K0102j590k3489j2418
14907b3141q92K7543j994m375K7450j4548P471j8846j0253j2439o77P483p432
14894b4650j3359l0950q86J4036L5550L1612L993j7548j1986j1195l685k589J0210
14881b1447L208j8268K1142J2724j5326j7588N002O690k1664J7324k305p137K6884
14868a0761Q025j7901k5579j6543K6539M3078N152M211j1770M44m00p909k2861
$$ plain form
14959 -27983 -37813 -44748 -50420 -29434 -12241 -22218 -23536 -30481 -22816 -15334 5045 15846 12125
14946 12125 20770 2178 -27447 -38218 -11914 14038 -8999 -37448 -49368 -47346 -52541 -69972
14934 -69972 -56626 -35095 -40587 -45371 -55635 -63414 -62895 -63175 -71954 -68281 -67228 -57362 -49623 -57694
14920 -57694 -50357 -34930 -16523 -15946 -38620 -26638 -33192 -27725 -5746 14356 12766 -10723 -23141
14907 -23141 -24033 3510 1516 -2859 24591 10043 17514 -1332 -11585 -24024 -24701 -17218 -24650
14894 -24650 -38009 -68959 -69845 -55809 -20259 11353 15346 -2202 -14188 -25383 -29068 -31657 -21447
14881 -21447 -18239 -36507 -15365 -2641 -17967 -35555 -30553 -23863 -45527 -28203 -30508 -37645 -10761
14868 -10761 -2736 -20637 -46216 -62759 -36220 6858 12010 16221 4451 4895 4495 -3414 -26275
14855b6275J4393L0931j2347j8746k1246k2634l103m606M78k5834J9354K1167
14843d8468K2278J9541O888j5927k4745R125J3635Q418J324k696j4378p095j3053
14830d5153j1713K1799K5715P250j2086R734j0037nJ6614j4577K468j2755P339
14817a5407p754K050Q333J156q307K3512j1500J1287L358l1082p110J6309K3926
14804H771j4311l7800j2504m022K6883q886K2615K3009n092K8945j672k1636l3427
14791b9127j1769J7390O30k2050j4198K4979K8582R963P430K2143l7231m9810
14779e3068K3448L5856J5997l218O031J971k3129k8173J0712R683K6236P627j949
14766B8024k0161j0525M264j5533j4339K5616J5635m1143R074j3811k712M284
$$ plain form
14855 -26275 -11882 19049 6702 -12044 -33290 -55924 -59027 -63633 -63155 -88989 -69635 -48468
14843 -48468 -26190 -6649 239 -15688 -40433 -31308 -17673 -9255 -7931 -10627 -25005 -32100 -45153
14830 -45153 -56866 -35067 -9352 -2102 -14188 -4454 -14491 -14496 2118 -12459 -9991 -22746 -15407
14817 -15407 -23161 -21111 -12778 -11622 -19929 3583 -7917 3370 6728 -24354 -31464 -15155 8771
14804 8771 -5540 -43340 -55844 -59866 -32983 -41869 -19254 3755 -1337 27608 25936 4300 -29127
14791 -29127 -40896 -23506 -22876 -44926 -59124 -34145 -5563 4400 11830 33973 -3258 -53068
14779 -53068 -29620 6236 22233 19015 25046 27017 3888 -24285 -13573 -3890 22346 29973 28024
14766 28024 7863 -2662 1602 -13931 -28270 -2654 12981 -28162 -19088 -32899 -35611 -31327
14754c1327J8293J2987q857l0489k0671K60k237L7174K1945k367p164O759K2j5526
14740b1198l2870O577L5336j2003K2515J6485M079J222J9343j398J0258j217n878
14727D1251o96n396j7104l0833L78j5630j5567J7196J0098O251o447M079m345
14714a6765R240l2834m6423j1170l62K5256K9323J6453o984J317K2551J7366k866
14701D102j3417j2359K747L80L184J6057J0498N088j0263j9700p207K5658q959
14688d191p624O92k0691P23O4284J6826j5249k6375p209K4457j0000l7563k1383
14675d3303J2041L3492J182l0964k164J468L8648K2403j8205k8421j8092j17K1380
14662a0652l594J296K4685j9838m768L559J1426k2013J7493L481j0761J7817Q552
$$ plain form
14754 -31327 -13034 -47 -8904 -39393 -60064 -59804 -62041 -24867 -2922 -5289 -12453 -5694 -5672 -21198
14740 -21198 -54068 -47491 -12155 -24158 -1643 14842 18921 20143 39486 38088 48346 47129 41251
14727 41251 40555 35159 18055 -12778 -12400 -28030 -43597 -26401 -16303 -10052 -16499 -12420 -16765
14714 -16765 -7525 -40359 -86782 -97952 -98314 -73058 -43735 -27282 -34266 -32949 -10398 6968 4102
14701 4102 -9315 -21674 -18927 -18547 -15363 694 11192 16280 6017 -13683 -20890 4768 -4191
14688 -4191 -11815 -11123 -31814 -31091 33193 50019 34770 8395 1186 25643 15643 -21920 -43303
14675 -43303 -31262 2230 3412 -27552 -29716 -28248 10400 32803 14598 -13823 -31915 -32032 -10652
14662 -10652 -14246 -12950 11735 -8103 -12871 -9312 2114 -19899 -2406 1075 -9686 8131 16683
14649A6683Q660j1962l3943p503K9065O476k3473o878l01j5593J8077J3679k692
14636i705q364k583J779k0471k2758J1192Q758J0080J0915j5828l886J7230J9239
14623d402J735K8287J7960k0803k0349l839j371j0989j3369nK2495K6204k3016
14610a462l7917J8855k435R722k3625m644m389K208K0757K8929K2213J6958N3
14597D5223l3339k3789J8111P757n1950k4882P561L6208K804p271J4707n69l0178
14584c9607J5354J1029J5415j9067j9452k12J3275J3410K0095k2181j5705K0651
14572f995K901k422K0893j955k6651O286K8633K3010o306l1945J6477j9214P626
14559A0338j8565k8613R879K4861K682k3335j718J4684j0141j1031k4628j865
$$ plain form
14649 16683 25343 13381 -20562 -28065 1000 7476 -15997 -22875 -23176 -38769 -20692 -7013 -9705
14636 -9705 -18069 -20652 -18873 -39344 -62102 -50910 -42152 -32072 -21157 -36985 -40871 -23641 -4402
14623 -4402 -2667 25620 43580 22777 2428 -1411 -2782 -13771 -27140 -27145 -4650 21554 -1462
14610 -1462 -39379 -20524 -22959 -13237 -36862 -41506 -45895 -43687 -22930 5999 28212 45170 45223
14597 45223 11884 -11905 6206 13963 -37987 -62869 -55308 -19100 -16296 -23567 -8860 -9429 -39607
14584 -39607 -24253 -13224 2191 -16876 -36328 -36540 -23265 -9855 10240 -11941 -27646 -6995
14572 -6995 -4094 -6516 14377 12422 -14229 -7943 20690 43700 37394 5449 21926 2712 10338
14559 10338 -8227 -36840 -26961 -2100 582 -22753 -24471 -9787 -19928 -30959 -55587 -57452
14547e7452K3245j818K1706O836k2796K7883j645J6474k4386l9299q276j053K6971
14534c3610J0552R20k5266k267J4978Q659l238r878o183R47j7536m0065k91K2045
14520h0233L7899J4750j13M466j655q835Q886j634m2735L8317M1202o338k5184
14507b1207K974j6760J2930o777j5751K3050J0536m338K465J3005j3078O141O104
14494g06J2017n710o993j6048l1268j8384m653j0593o45j799L9389M3003K9701
14481B7311k2968l3040k323P336O735K6546o017l1416k3177J7010o013j367l684
14468d5067p52J0995R314J5841k4539k3987P338K5209j4088k558R007M172r569
14455c8684j1068R724K148k5490J849O756K6382N166K7992p526j3728q770j2154
$$ plain form
14547 -57452 -34207 -36025 -14319 -7483 -30279 -2396 -4041 12433 -11953 -51252 -59528 -60581 -33610
14534 -33610 -23058 -22138 -47404 -49671 -34693 -26034 -29272 -39150 -45333 -44386 -61922 -101987 -102278 -80233
14520 -80233 -42334 -27584 -27697 -23231 -24886 -33721 -24835 -26469 -69204 -30887 10315 3977 -21207
14507 -21207 -18233 -34993 -22063 -28840 -44591 -21541 -11005 -15343 -12878 127 -12951 -6810 -706
14494 -706 11311 5601 -1392 -17440 -48708 -67092 -71745 -82338 -82983 -84782 -45393 -2390 27311
14481 27311 4343 -28697 -31020 -23684 -16949 9597 3580 -27836 -51013 -34003 -40016 -41383 -45067
14468 -45067 -45819 -34824 -25510 -9669 -34208 -58195 -50857 -25648 -39736 -42294 -33287 -29115 -38684
14455 -38684 -49752 -40028 -37880 -63370 -61521 -54765 -28383 -23217 4775 -2751 -16479 -25249 -37403
14442c7403p762N868L048M622J8609j3302J1200k237j8346K2185M609n407J8741
14429D425j0780L985l3678O13M3229J0550j0084J0888J8367j0584k2369l0896
14417b6334l0937r283J119P938K2351L4604j091l484J1794j0289k4414l61m784
14404c3171K0688J7373k8026p2N215j7681n544j5044j1271L9592K3268j4896N74
14391a8995M734j8214k185J4086K9954K3738N635o690k3211k0092k0386n399r371
14378d6396K1822j2135j6781N933l09Q244P740k1943K2761K8834M17K241R621
14365A0049n365J8572J9376j1402l0637j2310q782L3163J5326p844l5368j9029
14353c4251J7841K6309J0739j1801l4221j4667K3299J6989j7993K5636j6007r482
$$ plain form
14442 -37403 -45165 -39297 -36249 -31627 -13018 -26320 -15120 -17357 -35703 -13518 -8909 -14316 4425
14429 4425 -6355 -2370 -36048 -35435 7794 18344 8260 19148 37515 26931 4562 -26334
14417 -26334 -57271 -66554 -65435 -57497 -35146 -542 -1633 -5117 6677 -3612 -28026 -28387 -33171
14404 -33171 -12483 4890 -23136 -23208 -17993 -35674 -41218 -56262 -67533 -27941 -4673 -19569 -18995
14391 -18995 -14261 -32475 -34660 -20574 9380 33118 38753 32063 8852 -11240 -31626 -37025 -46396
14378 -46396 -24574 -36709 -53490 -47557 -47866 -39622 -31882 -53825 -31064 -2230 -1813 428 10049
14365 10049 4684 23256 42632 31230 593 -11717 -20499 12664 27990 20146 -15222 -34251
14353 -34251 -16410 9899 20638 8837 -25384 -40051 -16752 237 -17756 7880 -8127 -17609
14341a7609L2876j7158k0475n9J1354Q530J683J6490m948J4603j1658n5679k3732
14328f5782m31n550m326K0436J8471J5547K1066P293K1322L3303k6532L113j9391
14315A8539k2920l219K8059j5758k7499K0752J6363j2303J8717j5488j5474j1635
14303b1866J0868l0732o604J168J137K719J8221M4542K1480j7928k2874j6589
14291a6458k7671p458J2666J5367M0288L4460J0351j3576q393p690q060j2020
14279A1806p906j6388r536j0342K018J1661J0787k1868l142J5063j9716K7438
14267a0125N593j4016j1879j496p243k60Q666J2234k1872K0550L2597n964k6873
14254b0088m1776P727L1722j695K6707j2127j2202j5336o100K659O688K2814j9800
$$ plain form
14341 -17609 15267 -1891 -22366 -22425 -11071 -2541 -858 15632 10684 25287 13629 -42050 -65782
14328 -65782 -66213 -71763 -76089 -55653 -37182 -21635 -569 6724 28046 61349 34817 37930 18539
14315 18539 -4381 -7600 20459 4701 -22798 -2046 14317 2014 20731 5243 -10231 -21866
14303 -21866 -10998 -41730 -48334 -47166 -46029 -43310 -25089 19453 40933 23005 131 -16458
14291 -16458 -44129 -51587 -38921 -23554 16734 51194 61545 47969 39576 31886 23826 11806
14279 11806 3900 -12488 -22024 -32366 -30348 -18687 -7900 -29768 -32910 -17847 -37563 -10125
14267 -10125 -4532 -18548 -30427 -31923 -39166 -39426 -30760 -18526 -40398 -19848 12749 6785 -20088
14254 -20088 -61864 -54137 -22415 -24110 2597 -9530 -21732 -37068 -43168 -40509 -33821 -11007 -30807
14241c0807n7063q470J0959K6716J9127m798O993K2146L4651j396k9468m5041
14229e6451k975L476J8381j144O666j0716P79l732N577O109J172L9505Q130L249
14215A8026j2045K1396Q540l5530m9969l2486J7000K8376j1960M599L5256R885
14203A088j4133k2303j0641O450L8768K3126Q226k3324j8117j035j2900n562L3485
14190C128K4100K9514j229j9803j3276q361L850o150k6569J2015K0774p451J7431
14177B7973J1095k251k007j0693k0767n629j5665j0925p563O152J023R196J8722
14164a339K0374l444J1113j3094l9168j7549J6418J5423L674q139p689J8300K6427
14151B1307J9690J8881k3075k8500j2036M249j4177k5727l565K637M587J4628
$$ plain form
14241 -30807 -87870 -96340 -85381 -58665 -39538 -44336 -37343 -15197 19454 18058 -11410 -56451
14229 -56451 -59426 -55950 -37569 -38713 -32047 -42763 -41984 -45716 -40139 -34030 -32858 6647 14777 18026
14215 18026 5981 27377 35917 387 -49582 -82068 -65068 -36692 -48652 -44053 -8797 1088
14203 1088 -13045 -35348 -45989 -39539 -771 22355 30581 7257 -10860 -11895 -24795 -30357 3128
14190 3128 27228 56742 55513 35710 22434 14073 17923 11773 -14796 -2781 17993 10542 27973
14177 27973 39068 36817 34810 24117 3350 -2279 -17944 -28869 -36432 -30280 -29257 -20061 -1339
14164 -1339 19035 15591 26704 13610 -25558 -43107 -26689 -11266 -7592 -15731 -23420 -5120 21307
14151 21307 40997 59878 36803 8303 -3733 516 -13661 -39388 -42953 -40316 -35729 -21101
14139b1101o098J9506K2316Q17l9970k5648J6326L4491J3373k729O506J8698L703
14126D0190k8833l5241m586k1964J5615L619K576J460R734j2046P836J4025j0499
14113a8114J7847q097K860j9438L021r747O933l5743J1261K1574J4772P541p710
14100a3040J057l946o175j9837J2940N091j9089k7472J4841J9272J5183k1841
14088d3016m352N076J7796p404k7924l1234Q152K0855K4730J7105m340j3718J9209
14075a9065Q060j4198k206N882J6190o122J1681P074k1043l0620l2102J3106K1127
14062d2236L1655k402K72o605l8084n629L335K0977N317K4837k627j1734O118
14049a6806R55L590K5270M568k2202m912O443O597j5981l1613P373R836J2290
$$ plain form
14139 -21101 -27199 -7693 14623 15440 -24530 -50178 -33852 639 14012 11283 17789 36487 40190
14126 40190 11357 -23884 -28470 -50434 -34819 -31200 -28624 -27164 -17430 -29476 -21640 -7615 -18114
14113 -18114 -267 -8364 -5504 -24942 -21921 -31668 -24735 -60478 -49217 -27643 -12871 -5330 -13040
14100 -13040 -11983 -15929 -22104 -41941 -29001 -23910 -42999 -70471 -55630 -36358 -21175 -43016
14088 -43016 -47368 -42292 -24496 -31900 -59824 -91058 -82906 -62051 -37321 -20216 -24556 -38274 -19065
14075 -19065 -11005 -25203 -27409 -21527 -5337 -11459 222 7296 -13747 -44367 -76469 -63363 -42236
14062 -42236 -10581 -12983 -12711 -19316 -57400 -63029 -59694 -38717 -33400 -8563 -11190 -22924 -16806
14049 -16806 -15851 -12261 13009 17577 -4625 -9537 -3094 3503 -12478 -44091 -36718 -26882 -14592
14036a4592J2556j5381J1362J967k8688k5816K2804K6817J0328j7767K151J0586
14024c673K2193k0920j7821J8255l183J1695j102j4237M767N177J2798K5148m367
14011C4730k5309J230J5750j4718l201p537k0038k438J7261l17j7678k351K0739
13998c877K8214L352j8083j5784p14k7734N454O89K031P673k3550k4408J2464
13985e4273J7183K2192J2176k4971j6897K6440L2456j9807k2171J7208l1844r580
13973e1888J361J1099r932j0442K3036K4588N511q122J5533j2286k2957J3022
13961b1477M469l578L701J1434j0980r399J7280j839J7643L78K413K831o826j2905
13947f855N973m5110m2443J1635Q878J3236j268J3375R622k423j4993L956J0312
$$ plain form
14036 -14592 -2036 -17417 -6055 -4088 -32776 -58592 -35788 -8971 1357 -16410 -14259 -3673
14024 -3673 18520 -2400 -20221 -1966 -5149 6546 5444 -8793 -4026 1151 13949 39097 34730
14011 34730 9421 10651 26401 11683 8482 945 -19093 -21531 -4270 -4587 -22265 -24616 -3877
13998 -3877 24337 27689 9606 -6178 -6892 -34626 -29172 -28483 -26452 -18779 -42329 -66737 -54273
13985 -54273 -37090 -14898 -2722 -27693 -44590 -18150 14306 -5501 -27672 -10464 -42308 -51888
13973 -51888 -50527 -39428 -49360 -59802 -36766 -12178 -6667 -14789 744 -11542 -34499 -21477
13961 -21477 -17008 -20586 -16885 -5451 -16431 -25830 -8550 -10389 7254 7632 10045 12876 6050 -6855
13947 -6855 -882 -45992 -88435 -76800 -67922 -54686 -55954 -42579 -32957 -35380 -50373 -46417 -36105
13934c6105L8581J0564j3900J3424k541L215J4909o633l9948L456j204j0513k081
13921b8776M602j164l3030k2202K7563L5091J9171J9306J9307j2154k0801m158
13909B755j4160j8312j8580m027J2469j0207M816J6830N623N245J3349l061k788
13896a0048k1846r788j1083J5872J911k0360L2167j426j5278J3149J7514J278
13884g938j9271m914j9431J7720k114j2695K4343J2797r417k0680J3190J1966
13872a6444K1570j4102m3467J531J5710k239K6215K4322Q338j5938m530k2208
13860b1242k747o736j8646R973N264J1240k82p391J9230J9299J093M564L984l323
13846A4280j8406m3185R291O4298J8107j509K2J2167k3619l6660j5904P13k8254
$$ plain form
13934 -36105 2476 13040 -860 12564 10023 13238 28147 21514 -18434 -14978 -16182 -26695 -28776
13921 -28776 -24174 -25338 -58368 -80570 -53007 -17916 1255 20561 39868 27714 6913 2755
13909 2755 -11405 -29717 -48297 -52324 -39855 -50062 -45246 -28416 -22793 -17548 -4199 -7260 -10048
13896 -10048 -31894 -41682 -52765 -36893 -34982 -55342 -23175 -24601 -39879 -26730 -9216 -7938
13884 -7938 -27209 -32123 -51554 -33834 -35948 -48643 -24300 -11503 -20920 -41600 -28410 -16444
13872 -16444 5126 -8976 -52443 -50912 -35202 -37441 -11226 13096 21434 5496 966 -21242
13860 -21242 -23989 -30725 -49371 -39398 -34134 -22894 -23176 -30567 -11337 7962 9055 13619 17603 14280
13846 14280 -4126 -47311 -38020 26278 44385 42876 42898 55065 31446 -5214 -21118 -20405 -48659
13833d8659J4554J6550j6636j6605R953N352l085M397K4774K0979M520r589j5103
13820h598M718l173J0433O727j5768l5695j8416K0153R116l099J2762J556k842
13807b2126j5442J0762J4383J133J5170j0011j7833j3684k3943K3045J8159J0423
13795i964O972q558k7544J083N760J5225J1259Q219p703j4068J6607M823R83o573
13781c479R239j318k8694k9494j4937L107j2661K8527N479j8622K1343O028j7214
13768e2696K2769L7813k4288j3650k1672o79M0356N268R741J4545k586l468k0220
13755h767Q81r821J3753P536k3036j2960J3663m539j7119l96l963J1639L444J9818
13741i867J6727j027k693j5347M259O725R638K3180q56j7707N869J3696j4573
$$ plain form
13833 -48659 -34105 -17555 -34191 -50796 -40843 -35491 -38576 -34179 -9405 11574 16094 6505 -8598
13820 -8598 -3880 -7053 3380 10107 -5661 -41356 -59772 -39619 -30503 -33602 -20840 -19284 -22126
13807 -22126 -37568 -26806 -12423 -11290 3880 -6131 -23964 -37648 -61591 -38546 -20387 -9964
13795 -9964 -2992 -11550 -39094 -38011 -32251 -17026 -5767 2452 -5251 -19319 -2712 2111 3094 -3479
13781 -3479 5760 4442 -24252 -53746 -68683 -65576 -78237 -49710 -44231 -62853 -41510 -35482 -52696
13768 -52696 -29927 7886 -16402 -30052 -51724 -52403 -12047 -6779 2962 17507 14921 11453 -8767
13755 -8767 -7886 -17707 -3954 3582 -19454 -32414 -18751 -23290 -40409 -40805 -44768 -33129 -29685 -9867
13741 -9867 6860 5833 3140 -12207 -7948 -1223 8415 31595 30739 13032 18901 32597 18024
13728A8024k2153O450P859o827J3003j2418k4651J293K1042m578P278n273j7775
13715a8726O281K8595J4775l6315j6405N417J389N155j4381q862q934J253R425
13702c1333J3319P251O729K114o736j3445j3725q042J7832j3838O161J9644J4238
13689A69J2003m930l020J227J1425J6182J2869J5640j8275K4517j612K032n560
13676F2667k3696j3216l453J2709j6049k1174K0624j153k0979j8099K4431K1984
13664B4596K080k9211Q458n792j8505P115j5685J6226L7645L34L1988J5032P809
13651H2090L0545J1279K49M275k8248J3118K7099k4362l5379J0886K0250k9157
13639H2645m3005J5038J4674Q393k7729j0325R347q600R805j9377k0866j5509
$$ plain form
13728 18024 -4129 2321 10180 3353 16356 3938 -20713 -19420 1622 -2956 4322 -951 -18726
13715 -18726 -12445 16150 30925 -5390 -21795 -16378 -14989 -9834 -24215 -33077 -42011 -40758 -31333
13702 -31333 -18014 -10763 -4034 -1920 -8656 -22101 -35826 -43868 -26036 -39874 -33713 -14069 169
13689 169 12172 7242 4222 5449 16874 33056 45925 61565 43290 67807 66195 68227 62667
13676 62667 38971 25755 22302 35011 18962 -2212 18412 17259 -3720 -21819 2612 24596
13664 24596 26676 -2535 5923 131 -18374 -11259 -26944 -10718 26927 27261 59249 74281 82090
13651 82090 112635 123914 124163 128438 100190 113308 140407 116045 80666 91552 111802 82645
13639 82645 39640 54678 69352 77745 50016 39691 49038 40438 50243 30866 10000 -5509
13627e509K7146K9688j961J249j8468k9326L5586M575J2585r17o971n626j1772
13614C0279J5478K0253k5753j3189j3745m462j820K1433J910J2087N327k0585
13602B7213j1172j045O607N636l7022j4149P682R820L7R089l6681Q763L4787q113
13588A452j1818J1939R448K1068R697J2974M261j3446j9736L3309p565k5982P431
13575C3032J4025q550K632l6603K403J1836M581Q765k157J322l3330j9778L209
13562a8613j0394J2290L169n321P570p28j202J9330L588m751K2162J3083k3985
13549A6198j0674j4968N990J597K955j0067j9881q440R434J3050K9730N22o078
13536I368j236J4783k5069o697J8931J7149j1100n1897l6304j4082K1346J6504
$$ plain form
13627 -5509 21637 51325 49364 50613 32145 2819 38405 42980 55565 54648 47677 42051 30279
13614 30279 45757 66010 40257 27068 13323 8861 7041 28474 30384 42471 47798 27213
13602 27213 16041 14996 21603 27239 -9783 -23932 -16250 -6430 -6393 2696 -33985 -25222 9565 1452
13588 1452 -10366 1573 11021 32089 41786 54760 59021 45575 25839 59148 51583 25601 33032
13575 33032 47057 38507 41139 4536 6939 18775 23356 32121 29964 31286 -2044 -21822 -18613
13562 -18613 -29007 -16717 -13548 -18869 -11299 -12027 -13229 6101 9689 4938 27100 40183 16198
13549 16198 5524 -9444 -3454 -1857 1098 -8969 -28850 -37290 -27856 -14806 14924 15446 9368
13536 9368 8132 22915 -2154 -8851 10080 27229 16129 -35768 -72072 -86154 -64808 -48304
13524d8304j440k7642j0279L4163K2267n11l3258j4978k607K7453J5983J8834
13512b0319K859L3422m52j7428R23k0551j2132L3336K6989k5057j629j0070j5257
13499b5366M24K3673L8432L1775k4521j0147k5332k1768J0041N55m814K0009R307
13486B2268J2321J5663m192j0555l7996j8622J9315O015J0633j2792J1135P786
13474B0979j8473J0613L4315K0743k4716k4414j2676L0494r295l7985O292M808
13462F85j8167r268J250J6792Q595p490j0102J4722L2859j9645J1565J1320J462
13449C4578p233oj0886o801L6320K8233m1175J007R891J4719j6379j4768r612
13436A7888l457j1678j4465J0169K6403J2890o198k4630j73M250l974J4607J5698
$$ plain form
13524 -48304 -49744 -77386 -87665 -53502 -31235 -31746 -65004 -79982 -82589 -55136 -39153 -20319
13512 -20319 -17460 15962 15510 -1918 -995 -21546 -33678 -342 26647 1590 -39 -10109 -25366
13499 -25366 -24942 -1269 37163 68938 44417 34270 8938 -12830 -2789 -2234 -7048 12961 22268
13486 22268 34589 50252 46060 35505 -2491 -21113 -1798 4217 14850 2058 13193 20979
13474 20979 2506 13119 47434 68177 43461 19047 6371 36865 27570 -10415 -4123 685
13462 685 -17482 -26750 -25500 -8708 -113 -7603 -17705 -2983 29876 10231 21796 33116 34578
13449 34578 27345 27339 16453 9652 45972 74205 33030 34037 43928 58647 42268 27500 17888
13436 17888 14431 2753 -11712 -1543 24860 37750 31552 6922 6749 10999 7025 21632 37330
13423C7330J3473j3130j8516R635j2681L4300K6525k9662k0198k3636j1706r197
13411a7463J349l9831j847J0106l81J3197N7581M2202k4969k1247J3241J7945
13399D9883K727l9489j4755J818R923p257K147j458M71l638q50l1423K8771J500
13385a630M14j6673j5229j0710K2371Q35L959O095p561n485K4212L695j9558k0262
13371c5527J7217L6851K1818J7128O879Q446k1532j6368j0752m7024J0764P002
13359e098j1360N406J5354K6713O373j2265l5240M162o619j0024K4482J1149j2672
13346C61K1135K932l387j3619K4845K1536R329K3402N290k9101j2892R00K51k4334
13332B6648j0106L2527K5285P340j6808k9013j8269K6227K8012L981m3772k1215
$$ plain form
13423 37330 50803 37673 19157 28792 16111 50411 76936 47274 27076 3440 -8266 -17463
13411 -17463 -16114 -55945 -57792 -47686 -48067 -34870 22711 64913 39944 18697 31938 49883
13399 49883 52610 13121 -1634 184 10107 2850 4997 3539 4010 372 -478 -31901 -3130 -1630
13385 -1630 -1216 -17889 -33118 -43828 -21457 -20622 -16663 -10568 -18129 -23614 598 4293 -15265 -35527
13371 -35527 -18310 18541 40359 57487 64366 72812 51280 34912 24160 -22864 -12100 -5098
13359 -5098 -16458 -11052 4302 31015 37388 25123 -10117 -5955 -12574 -22598 1884 13033 361
13346 361 21496 24428 21041 7422 32267 53803 63132 86534 91824 62723 49831 50731 50982 26648
13332 26648 16542 49069 74354 81694 64886 35873 17604 43831 71843 75824 32052 10837
13320A0837p334K1375r99k4916L376Q077K8304R272N197K2757J1414L2843M112
13307A24315j7402L64J1452L110K403j1992p464O147J1317J7606j5514j1580j0464
13294A02298L9071J3361j7808m2108O597k280J3213R197l839M469J9644l1044
13282A10771o261K560O972j4389l090L4570j7893j1446L4861J9724P98K226J785
13269A61188K0373J5833O305K5129M4234J7836M778J1675M4069O5613N4710P7611
13257E49354P0760P9309J10205J05394J10813J07543J45651J86584J92303K53741
13247A911657L08041M20198N81586P48833J039153J360796J672064J908561J932155
13238A1883044J718335J240114O17904m3576o55712j202111j583429j673627j577147
$$ plain form
13320 10837 3503 24878 23879 -1037 2339 10416 38720 47992 53189 75946 87360 120203 124315
13307 124315 106913 107277 118729 121839 124242 112250 104786 110933 122250 139856 124342 112762 102298
13294 102298 141369 154730 136922 94814 101411 99131 112344 121541 117702 122171 141815 110771
13282 110771 104510 107070 114042 99653 96563 131133 113240 101794 136655 156379 157177 159403 161188
13269 161188 181561 197394 203699 228828 273062 290898 295676 307351 351420 417033 471743 549354
13257 549354 620114 699423 809628 915022 1025835 1133378 1279029 1465613 1657916 1911657
13247 1911657 2219698 2639896 3221482 3970315 5009468 6370264 8042328 9950889 11883044
13238 11883044 13601379 14841493 15459397 15415821 14760109 13557998 11974569 10300942 8723795
13229H723795j380767j098163q41714o11239m40603k79660j75995r4964j7314
13220C783376M7758J20276J61696K32512L13649M09593N42182P45769J058437
13211G415248J430914J904730K365514K815344L124149L239006L069467K607525
13203B7971897J704538N83172m30422j237259j888130k447002k952220l291941
13195A8012633l240200k878337k301375j691932j179760q46246o41058m26845
13187D806880l02157k42049j57315j28607o1690p026Q8469J93048L00684M06523
13177D896760O23690Q90287J159477J509732J765907J841914J707948J286145
13169A5681860O64258j0895o88013j309737j741769j959525j893449j646653j314419
$$ plain form
13229 8723795 7343028 6244865 5403151 4791912 4351309 4071649 3895654 3800690 3783376
13220 3783376 3831134 3951410 4113106 4345618 4659267 5068860 5611042 6356811 7415248
13211 7415248 8846162 10750892 13116406 15931750 19055899 22294905 25364372 27971897
13203 27971897 29676435 30259607 29829185 28591926 26703796 24256794 21304574 18012633
13195 18012633 14772433 11894096 9592721 7900789 6721029 5874783 5233725 4806880
13187 4806880 4504723 4262674 4105359 3976752 3915062 3908036 3996505 4189553 4490237 4896760
13177 4896760 5520450 6410737 7570214 9079946 10845853 12687767 14395715 15681860
13169 15681860 16346118 16335223 15647210 14337473 12595704 10636179 8742730 7096077 5781658
13160E781658j053149q10347o40497m74807l69655k77713k26926j76473j84399
13151A567692j74239j13891r7654r5428r8086p5001p3945r0612p9209q2935n7279
13140E29413k0854J4139k409k4434m3491l6151k7336k8418r634J7509M781l4575
13128C38540p826q424l3551r781j1266j9176m6088J091M7708J8254O607J7310
13116B93398j951k2636l5593J3842o623P830j2807l0762m3398K1990k722K792
13104A83360J3728k7418j9071L2093P317k0097n749L963k511j1443j7502l1868
13092A04802j9795K5880N721J9949K0705R464q096j0396j9700J6749m100j1825
13080A29358j6123j3132K4175J3077n30j8039j0284j9487O333j6277o194n436
$$ plain form
13160 5781658 4728509 3918162 3277665 2802858 2433203 2155490 1928564 1752091 1567692
13151 1567692 1393453 1279562 1181908 1086480 988394 913393 839448 748836 669627 586692 529413
13140 529413 508559 522698 520289 495855 452364 416213 388877 360459 350825 368334 373115 338540
13128 338540 330714 322290 288739 278958 267692 248516 202428 203519 251227 269481 276088 293398
13116 293398 291447 268811 233218 247060 240437 248267 235460 204698 161300 183290 180568 183360
13104 183360 197088 169670 150599 182692 190009 169912 164163 168126 165615 154172 136670 104802
13092 104802 85007 110887 116608 136557 157262 166726 158630 148234 128534 145283 141183 129358
13080 129358 113235 100103 124278 137355 136825 118786 108502 89015 95348 79071 72877 67441
13068F7441K984J2540J8899L4964K0318l1954m6698r749J6994m194j1807p404
13056F2334j0799k784p481J5423j0302N841j007J8895m369l616J9239n162o140
13043G0072q415j2532k7438j5567J6838J3187M862R788j3945k1028j0821J2674
13031A7675J3031K443j0793o561J6110K5946k360k5134j112L275r4r174K212P684
13017C3148J4329j1153k1459O471J2253K4902Q446l4019j6839Q364N568J5859
13005D5870j6739j0060M337J2369l27k2842j2338l696L1397J094j1444K5513P45
12992D3879j3895j5433L049r246P042J4853J156O223L2130R014k7220L266l1191
12979B3627m0121N534j0793J3497L8978P279J0179J1682j8443l7136Q17l530k6109
$$ plain form
13068 67441 70425 82965 101864 136828 157146 125192 78494 68745 85739 81545 69738 62334
13056 62334 51535 48751 41270 56693 46391 52232 51225 70120 65751 62135 81374 76212 70072
13043 70072 61657 49125 21687 6120 22958 36145 41007 50795 36850 15822 5001 17675
13031 17675 30706 33149 22356 15795 31905 57851 55491 30357 29245 32520 32426 23252 25464 33148
13017 33148 47477 36324 14865 21336 33589 58491 66937 32918 16079 24443 30011 45870
13005 45870 29131 19071 23408 35777 35450 12608 270 -3426 27971 29065 17621 43134 43879
12992 43879 29984 14551 17600 8354 15396 30249 31405 37628 69758 78772 51552 54818 23627
12979 23627 -16494 -10960 -21753 -8256 30722 38001 48180 59862 41419 4283 5100 1570 -24539
12966b4539R817J8869J9062l659J088q065r948j1426N5479j6471j9061r411p123
12953e388j8927n009J308l879J5253J2691J0566o678J0174K0050P171l126r851
12940B4355N73N422o175j082K3251k3315j0890k9667K1014R379J7052L9400P145
12927G6462J0883j5470L878K6413L2187M5426N0701L8551O3240J25670J84959
12916F42900K59202L11968K76816J01496j24061k60008k72781k17735j23308l5911
12906E58578k1871n1416n7292r8210o7028l8806n6215k4603J0158k3027l3867
12895I6401m354j3314k2729k4589J1158J7541J3685M154R49l4293m583J459n817
12882C5668K9617J7650k9472k6196n07k267l121J8530J2916K005j7038j6137l676
$$ plain form
12966 -24539 -14722 4147 23209 19550 20638 12573 2625 -8801 46678 30207 11146 1735 -5388
12953 -5388 -24315 -29324 -28016 -31895 -16642 -3951 6615 -63 10111 30161 37332 34206 24355
12940 24355 24928 30350 24175 23093 46344 23029 12139 -17528 3486 12865 29917 69317 76462
12927 76462 87345 71875 75753 102166 134353 179779 230480 269031 332271 457941 642900
12916 642900 902102 1214070 1490886 1592382 1468321 1208313 935532 717797 594489 558578
12906 558578 536707 485291 427999 329789 262761 223955 167740 143137 153295 130268 96401
12895 96401 92047 78733 56004 31415 42573 60114 73799 77953 78902 44609 40026 41485 35668
12882 35668 65285 82935 53463 27267 26760 24493 21372 39902 52818 54823 37785 21648 17972
12869A7972K0744j709J0468J8472j398N375q786j4226o965k9234j9747l780K2591
12856I777q412K2884J984j788j7282k2815k3233j0203M974K94O116L4133K9321
12843B5750j7479j2559L646J254j2054M984j8403Q484L5010N718j5963N757J6277
12830C0422M327k4341j7195R143J0760j2287p630K7717K890j3484k3521J923L3160
12817B1884K9319j7480K2158r386K227k0301n97o635j4318K256k2465k1486j3008
12804d7832R164J0661J0073L4969J8110K7467J4278j9502l7483P500R241J6214
12792E2860L315R373O536q35O177m2L4180M8346l2233l4563l6513M84K0453k7501
12778E0037j9371m961j5853j3300N789L2273J47J3331k92k4678q65J2997N172
$$ plain form
12869 17972 38716 37007 47475 65947 64549 69924 61138 46912 39947 10713 -9034 -12814 9777
12856 9777 1365 24249 26233 24445 7163 -15652 -38885 -49088 -44114 -43820 -37704 -3571 25750
12843 25750 8271 -4288 -642 612 -11442 -6458 -24861 -16377 18633 24351 8388 14145 30422
12830 30422 34749 10408 -6787 2356 13116 829 -6801 20916 23806 10322 -13199 -11276 21884
12817 21884 51203 33723 55881 46495 48722 28421 27824 21189 6871 9127 -13338 -34824 -47832
12804 -47832 -38668 -28007 -17934 17035 35145 62612 76890 57388 19905 27405 36646 52860
12792 52860 56175 65548 72084 71249 77426 77384 111564 159910 127677 93114 56601 57085 77538 50037
12778 50037 30666 25705 9852 -3448 2341 34614 34761 48092 47800 23122 22257 35254 40426
12765D0426R350J3285l3223k5546O3J1683j2666K8531M0978L8638L9229K1919
12753A72667K2066J5192o738L1918N100k3857j3117m0451k4944j1712K2976j7522
12741A31578m9562j5027N223n854m6245J8485k4947k1971j2003K0197Q809K9678
12729C8361P063J0318l9417l75J9901j7239L6479M7636Q164K0172M0790P193j6438
12716A62608j5633m6689k2442K2467n166r162L8570M3159K1621k2075K3162L5334
12704B25754L1252J0447j9897m2608l2114l0188j3985K791J1287q346l0752j8964
12692H4677o478n859o834l1523K4784J71j5630k4469J4280K1910J4545j0403J7855
12679G7026j2482l306j8639q628L559m588k5599L0386P2331K945j378J445k5794
$$ plain form
12765 40426 49776 63061 29838 4292 4355 16038 3372 31903 72881 111519 150748 172667
12753 172667 194733 209925 203187 235105 240205 216348 203231 162780 137836 126124 149100 131578
12741 131578 82016 66989 72212 66358 20113 38598 13651 -8320 -20323 -126 8683 38361
12729 38361 45424 55742 16325 15950 35851 18612 55091 102727 110891 131063 171853 179046 162608
12716 162608 146975 100286 77844 100311 95145 85983 124553 167712 189333 167258 190420 225754
12704 225754 257006 267453 247556 204948 172834 142646 128661 131452 142739 134393 103641 84677
12692 84677 78199 72340 65506 33983 58767 58938 43308 18839 33119 55029 69574 59171 77026
12679 77026 64544 61238 42599 33971 37530 32942 7343 37729 110060 113005 111627 113072 87278
12666H7278k7571J808J3022R19j9014J0783J7346j1434l9113K5872J4732L273
12654G7901j2222K6764l508k401P735l612q403k0264Q462K7813p254K3782M3475
12641A58268M393j9952k0667J1392P96m0681l6412k5635j9115j1970P256k2342
12629a4669O912M8304N755m3403n2452l38J834o196J9066J4993Q610K2925K40
12616A1581o220j1720P779L517K2351L1168j7151J1676J9018P168K7728N180K4049
12603A36124J4994R637j9268l1319j7654J9700J4053K0683R5738P2212J6885j4332
12591C17453n401L6701p421p788J8126j3152k1473J0691O5412O0832J4969j173
12579D67776m1589p8824j26196j26624r6707n1498n7874N0016M8261r436k246
$$ plain form
12666 87278 59707 61515 74537 75456 56442 67225 84571 73137 34024 59896 74628 77901
12654 77901 65679 92443 88935 86534 94269 90657 82254 61990 70452 98265 91011 114793 158268
12641 158268 162661 142709 122042 133434 134230 93549 57137 31502 12387 417 7673 -14669
12629 -14669 -7757 40547 46302 2899 -49553 -49891 -48057 -54253 -35187 -20194 -11584 11341 11581
12616 11581 5361 -6359 1420 4937 27288 58456 41305 52981 71999 79167 106895 112075 136124
12603 136124 151118 160755 141487 110168 92514 112214 126267 146950 242688 314900 331785 317453
12591 317453 312052 348753 341332 333544 351670 338518 317045 327736 393148 453980 468949 467776
12579 467776 426187 347363 221167 94543 -2164 -53662 -111536 -61520 -13259 -22695 -24941
12568b4941J4844J494O554k2371o677K3605K8912p54j9036J2892K6511K1379J7135
12555G9547J2336k1199m4351N908J2627J5545n23M336k982J3765K3186j1766K667
12542H9096J2481K0643p611N287J8811M3703J4616M241M762j9603K3776P362k3390
12529A94174l4886k1538j1522M3163L0062j3491j579K087J4146K2497M205k144
12517B25174K7762M3454K2065J105j0590K0954K5210J2760k63K4150L7631L0926
12505D60338K9626K2838M2631L0839K6449J3264N687K2319N3896M9783L2118N0777
12493H40565N0049M7430M7992O9641R1780M8427N4058N5943N4610R7660J18307
12482A576462J15724J30596J22377J24268J71575J97907K23602K72793K75519
$$ plain form
12568 -24941 -10097 -8603 -2049 -24420 -31097 -7492 21420 20666 1630 14522 41033 62412 79547
12555 79547 91883 70684 26333 32241 44868 60413 59890 64226 61244 75009 98195 86429 89096
12542 89096 101577 122220 114609 119896 138707 182410 197026 201267 206029 186426 210202 217564 194174
12529 194174 159288 137750 126228 169391 199453 185962 184383 186470 200616 223113 227318 225174
12517 225174 252936 296390 318455 319560 308970 329924 355134 367894 367631 391781 429412 460338
12505 460338 489964 512802 555433 586272 612721 625985 631672 653991 707887 757670 789788 840565
12493 840565 890614 938044 986036 1055677 1147457 1195884 1249942 1305885 1360495 1458155 1576462
12482 1576462 1692186 1822782 1945159 2069427 2241002 2438909 2662511 2935304 3210823
12473C210823K90006L13341M42798N53818O18355P45882Q77631J108749J397398
12464I558801J699786K030782K326619K697135L335308M530295O575385R726494
12456D2480605J4691040K2779569L5569546N3236967O8508652O1118995K1267421
12449C19652795k9649004o1120558o4021786m8628824l1920996k0652848j3879441
12442D9779338r764839p148334n312301m060748l307766k854352k473079k091578
12434A2766341j665061j313292j044381q64205p09441o60053n68502n28413m56343
12425D956650l92255l31398k98425k45017k38775k41734j97752j63690j23051
12416B724553j22139j20728j56311j70685j22053j02937j10035j27333q5072p0656
$$ plain form
12473 3210823 3500829 3814170 4256968 4810786 5429141 6175023 7052654 8161403 9558801
12464 9558801 11258587 13289369 15615988 18313123 21648431 26178726 32754111 42480605
12456 42480605 57171645 79951214 115520760 168757727 237266379 298385374 319652795
12449 319652795 290003791 228883233 164861447 116232623 84311627 63658779 49779338
12442 49779338 40014499 32866165 27553864 23493116 20185350 17330998 14857919 12766341
12434 12766341 11101280 9787988 8743607 7879402 7169961 6509908 5941406 5412993 4956650
12425 4956650 4564395 4232997 3934572 3689555 3450780 3209046 3011294 2847604 2724553
12416 2724553 2602414 2481686 2325375 2154690 2032637 1929700 1819665 1692332 1607260 1536604
12406A536604p4374n8380m6988q211l6288n2229m9337n5824n5790o0834l2760
12395A005589j7735m0043j8918k2772L185r212j5274j0474Q89k3501n6326l7903
12383G57505l652j6983J5778k8530m8493o3433j0986R311j0321l2855l2140m8321
12371D86880l1753k5697K73M5994K0288N478m5286k2339j49M4603J7148M241j9942
12358D79739p769q196k1345o769O727j0297m613O082J4843p722L2909k8028p2065
12345C73496j0680R421r291J5418L973k1313j7524R953L3037j6078P807J5550
12333C93769O02K5270J3014K1796K3234N4577M3297J5810j0004l5122r0226j29291
12321C26726j08384o1975l0381j6305N572o929J589Q663k3823J8017R557p25k5215
$$ plain form
12406 1536604 1462230 1403850 1356862 1348651 1312363 1260134 1210797 1154973 1099183 1038349 1005589
12395 1005589 987854 947811 928893 906121 909306 900094 884820 874346 875235 851734 795408 757505
12383 757505 753853 736870 752648 724118 675625 612192 601206 610517 600196 567341 535201 486880
12371 486880 455127 429430 429703 475697 495985 501463 456177 433838 433689 478292 495440 499681 479739
12358 479739 471970 463774 442429 435660 442387 432090 427477 433559 448402 440680 473589 445561 373496
12345 373496 362816 372237 362946 378364 382337 361024 343500 353453 386490 370412 378219 393769
12333 393769 394371 419641 432655 454451 477685 532262 575559 591369 581365 546243 456017 326726
12321 326726 218342 156367 125986 109681 115253 108324 109913 118576 94753 112770 122327 121602 96387
12308I6387k8525p769J3493K4826o272R649J1526j1657k254j1989K1846K4425
12296A33686J3013K1325J6762p419l4261k7057L0773M4749L4851M1982L9810o656
12284C01558N883J7993L1334O1339J01934J48449K84218N35774Q70959P35145
12274C094586j49359o23717q09629n01731k95045j68530j13343j06503p2137l9342
12264B15250m7285n4547l5965R34k4458j3425K1774p109j5801J0870J1723o080
12252E5881j5110j8290k2512J8215k5825k303p190K421L4797Q850k0127j0992
12240b185K3224O261j7021J8983P576j3993l9638k7138m612L5259J7429k3895
12228a9750k8305J8634M467J9099j2963j151j1411M117R226J5332J9446J4284
$$ plain form
12308 96387 67862 60093 73586 98412 92140 101789 113315 101658 99404 87415 109261 133686
12296 133686 146699 168024 184786 177367 143106 116049 146822 191571 226422 268404 308214 301558
12284 301558 307441 325434 356768 418107 520041 668490 952708 1488482 2359441 3094586
12274 3094586 2945227 2321510 1511881 1010150 715105 546575 433232 326729 254592 215250
12264 215250 167965 113418 77453 78387 53929 40504 62278 55169 39368 50238 61961 55881
12252 55881 40771 22481 -31 18184 -7641 -9944 -17134 -14713 20084 28934 8807 -2185
12240 -2185 21039 27300 10279 29262 36838 22845 -16793 -43931 -48543 -13284 4145 -19750
12228 -19750 -48055 -29421 -24954 -5855 -18818 -19969 -31380 -27263 -18037 -2705 16741 31025
12216C1025K5575J6450L259J0754j5174m430k9169j5035K4974K5938O853k4431
12204E6589k5157J1902L859J7142j8139k9014j4846J6253J3011J2825P42j3452
12192C1715j0025M113L003J2747j4838J2547M014J5498j8237o826M116o45J7779
12179E4961j4924M517k0674N835j8097k1035p656l764k194l599r86J574J6422
12166i620J0709J2482K5545P223j583k3131N650j0150J9351r452k8517o144k404
12153a0041m954r737Q748k4958L899K1305k9123J3178k5804M502N8137L5326M87
12140D0965K007K6047K3081O46r836m4502j5895K287K2942M465m8225n941J0187
12127H228m052J6638K6940Q930p328j8386k9308m6k7114K956K3786k199l01L858
$$ plain form
12216 31025 56600 73050 76309 87063 71889 67459 38290 23255 48229 74167 81020 56589
12204 56589 31432 43334 47193 64335 46196 17182 2336 18589 31600 44425 45167 31715
12192 31715 21690 25803 28806 41553 26715 39262 43276 58774 40537 33711 37827 37182 54961
12179 54961 40037 44554 23880 29715 11618 -9417 -17073 -20837 -23031 -26630 -27616 -26042 -9620
12166 -9620 1089 13571 39116 46339 44756 21625 27275 17125 36476 27024 -1493 -7637 -10041
12153 -10041 -14995 -24732 -15984 -40942 -37043 -15738 -44861 -31683 -57487 -52985 5152 40478 40965
12140 40965 42972 69019 92100 92746 82910 38408 22513 24800 47742 52207 3982 -1959 8228
12127 8228 4176 20814 47754 56684 49356 30970 1662 1616 -25498 -22542 1244 -955 -1256 2602
12113B602m51j290m635k7032j4264O0013J7666O968k5229j1476J3802J396p143
12100A0927J357k0276k167q483J5385L9206j5277k9370J6710J9813J5024L845
12088D6694k6502k1523j4347J1464L3015O890k0226J198J7370k3343l533Q557
12076A5714o986o994O425R469j2704j3754K1335j3010j1005J4399m773J4943m86
12063A2573J6448K1981j7509J269l3761j4050L356n628Q298K4669K9818R553J866
12050E8883L061n973j1319J1807L544l9321k5703L5807P550j8776j4330k0809
12038a5579j2044p824K792J2344n461M0602J3357o308K0056L2538J5206j6573
12026G3106q651k2549l445k1975K546K886L0741K6338K7786J635J0406k4693k9394
$$ plain form
12113 2602 2151 861 -3774 -30806 -45070 14943 32609 39577 14348 2872 16674 18070 10927
12100 10927 12284 -7992 -10159 -18642 -3257 35949 20672 -8698 8012 27825 42849 46694
12088 46694 20192 -1331 -15678 -4214 28801 35691 15465 16663 34033 10690 7157 15714
12076 15714 8728 1734 8159 17628 4924 -8830 12505 -505 -11510 2889 -1884 13059 12573
12063 12573 29021 51002 33493 34762 1001 -13049 -9693 -15321 -7023 17646 47464 57017 58883
12050 58883 61944 55971 44652 56459 60003 20682 -5021 30786 38336 19560 5230 -15579
12038 -15579 -27623 -35447 -32655 -20311 -25772 14830 28187 21879 41935 74473 89679 73106
12026 73106 64455 41906 38461 16486 19032 21918 52659 78997 106783 108418 118824 94131 64737
12013F4737l0525J4120K2288l818k2987J9992J8304k4623L2718K5438m087k4609
12001H6948j9038k1084K0024J4820K5197L8316O2677R1518Q9471N7341k3323o4873
11989C57994o1362j2743J9833J3060M1149J29346J45398K12675L20427L03470
11979A469247J20912j15274k55659k93659k21733j72572j05855p8472n3663p3224
11969B20048o0666r715L2465j8486m5304j8537J5579J1741M4675P707j8068m3778
11957A17661l7696O315K7853P695q623o1061n634j9309k7017K1451M1518N815
11945F8968p952j0501j9065J1487O672j7735n319q529j4583M329J0514o088l0360
11932a8162J2574K3318M989k4131J0882K7949J9128o635k9237j7138j7486P511
$$ plain form
12013 64737 34212 48332 70620 66802 43815 63807 82111 57488 90206 115644 111557 86948
12001 86948 67910 46826 66850 81670 106867 145183 207860 299378 388849 446190 422867 357994
11989 357994 296632 283889 303722 316782 357931 487277 632675 845350 1165777 1469247
11979 1469247 1590159 1474885 1219226 925567 703834 531262 425407 346935 293272 220048
11969 220048 159382 149667 182132 163646 118342 99805 115384 127125 171800 179507 161439 117661
11957 117661 79965 86280 114133 121828 113205 52144 46510 27201 184 21635 63153 68968
11945 68968 61016 50515 31450 42937 49609 31874 26555 18026 3443 7772 18286 12198 -18162
11932 -18162 -5588 17730 22719 -1412 9470 37419 56547 49912 20675 3537 -13949 -6438
11920f438K1588R531k205K196J9493J5014j7468k2269j8004n255K74P50k832R298
11906C673l207R410j3696K7992J4108l2908l07r861j4683K0992L4087k1928m836
11893H836J1153j1491P265j4491R747J9013J3575o646k1158j6189Q481J2669M0104
11880F0868L169N730l0040m2797J3146P537K1688J2477N091j1821k992k4891R67
11867A8132L4142j4623J8654k0561m909Q207k5929j2051K2363j4677k1683j1564
11855b4499p173K833L158j3140j6968P266J2471J0558Q719R121K613N503K094
11842B556j2019P76l652K5140K8799m145j9103l148J891j4440J770q61o641j0691
11828a3768L398K5657p078j3921M262K2621l052j1239N366k5938n943L3001O229
$$ plain form
11920 -6438 15150 24681 22476 24672 44165 59179 41711 19442 1438 -3817 -3543 -2793 -5625 3673
11906 3673 466 9876 -3820 24172 38280 5372 5065 -4796 -19479 1513 35600 13672 8836
11893 8836 19989 8498 15763 1272 11019 30032 43607 36961 15803 -386 8095 20764 60868
11880 60868 64037 69767 39727 -3070 10076 17613 39301 51778 56869 45048 42056 17165 18132
11867 18132 52274 37651 56305 35744 30835 39042 13113 1062 23425 8748 -12935 -24499
11855 -24499 -31672 -28839 -25681 -38821 -55789 -48523 -36052 -25494 -16775 -7654 -5041 462 2556
11842 2556 -9463 -8687 -12339 12801 41600 37455 18352 15204 17095 2655 4425 3564 -3077 -13768
11828 -13768 -10370 15287 8209 -5712 -1450 21171 18119 6880 12246 -13692 -19635 13366 19595
11815A9595k530K003n094j0314n515J497m575K4294J4742J3551j0126n065K016
11802C4479k518j8078j5465q569l700J2491k8591l933k1901l062L4355j0518j8582
11789e3592J1268j187N869m216j6741J9702N284j1957n868j521M416K9579j5892
11776c4856o896L748m663L598P924L3806L916j0229L1662j453q202k3614j398
11763f657J8706J3137k1551q307j3021O780L8367K3266j3938j9648q15k2739K1725
11750A5305K5935j0150l4497O139J8683K6278k337j3442j7944l6326j2905J8221
11738a7040J0217k68j3319k8799j5708P94M7599K9978J3362N560j9985j9184P782
11725I89J749J6820r517j0466l093L177P624j806j1565K567k1720k2961j349L2864
$$ plain form
11815 19595 17065 19068 13974 3660 -1855 -358 -4933 19361 34103 47654 37528 32463 34479
11802 34479 31961 13883 -1582 -10151 -13851 -1360 -29951 -33884 -55785 -58847 -24492 -35010 -53592
11789 -53592 -42324 -43511 -37642 -41858 -58599 -38897 -33613 -45570 -51438 -52959 -48543 -18964 -34856
11776 -34856 -41752 -38004 -42667 -39069 -31145 2661 6577 -3652 28010 26557 18355 -5259 -6657
11763 -6657 12049 25186 3635 -4672 -17693 -10913 27454 50720 36782 17134 16319 -6420 15305
11750 15305 41240 31090 -3407 2732 21415 47693 45356 31914 13970 -22356 -35261 -17040
11738 -17040 -6823 -7091 -20410 -49209 -64917 -64123 -16524 13454 26816 32376 12391 -6793 989
11725 989 2738 19558 10041 -425 -3518 -341 7283 5477 -6088 -3521 -25241 -48202 -49551 -16687
11711a6687J4008j9466k0146L616Q778L7558r259M346m972n528l3958m725J3798
11698c2637K3024L1831J359l2903o408j362k3103J2448L1367j9926r610k6456
11686e2376K4731N5357K6286k5627j2890j166j7419O431k6373k1694J8462K9583
11674C305K9403k413l5241n271p328J6523O049j1156M062j1505k1039K8363o951
11661a3199o821J4558K112P522n869l1985n226J2183J6180k612j5095K6122K3272
11648B1142K3308L942J7230q311J4252M8527P3767J46463J62239j0718j08968
11637C82873j36210q7006q1817n7587j1709K2663M840m1599k4663J4612O7672
11626E2069j1141k3953J775O228L2049J0054j4746l3916k1313J210j8001l1012
$$ plain form
11711 -16687 -2679 -22145 -42291 -38675 -29897 7661 -1598 2748 -2224 -7752 -41710 -46435 -32637
11698 -32637 -9613 22218 23577 -9326 -15734 -17096 -40199 -27751 3616 -16310 -25920 -52376
11686 -52376 -27645 27712 53998 28371 15481 14315 -3104 3327 -23046 -44740 -26278 3305
11674 3305 32708 30295 -4946 -10217 -17545 -1022 5027 -6129 -2067 -13572 -34611 -6248 -13199
11661 -13199 -20020 -5462 -3350 4172 -1697 -33682 -38908 -26725 -10545 -13157 -28252 -2130 21142
11648 21142 44450 48392 65622 57311 71563 120090 193857 340320 502559 491841 382873
11637 382873 246663 159657 77840 20253 8544 31207 36047 -5552 -30215 -15603 52069
11626 52069 40928 16975 18750 24978 57027 67081 52335 18419 -2894 -1684 -19685 -50697
11614e0697l695L3093K8492k1244k1096L563K960k028J6553k072m11J7241M237
11601D896K867J9052r3M307m592r063j505L03j9032m6890K7928M7335k116n347
11587A8050m1257j0083K7128o066N546M6j2724J5067n042J1394K4940p923N072
11574B4148j0670L713q604k3717J0853j437J2506K294J1226R967k0008j1575k3429
11561b4733l3371q482K8072N708m709J4287J3014L8838L1389k6511j8650l7450
11549b2598l9071L888P853M0072j6718J4122K1630J2236k432j9456k3627J3486
11537a0615K1731j1270k1942L5322J6410r651k350R794j5102l1660m824J0662
11525a3495l351K5038M5756J0849k3893j2291K389j6311j1534j5853p972R074
$$ plain form
11614 -50697 -54392 -21299 7193 -14051 -35147 -31584 -28624 -30652 -14099 -16171 -16582 659 4896
11601 4896 7763 26815 26722 31029 26437 17374 15869 16172 -2860 -49750 -21822 25513 23397 18050
11587 18050 -23207 -33290 -6162 -12228 -6682 -6636 -19360 -4293 -9335 2059 26999 19076 24148
11574 24148 13478 17191 8587 -15130 -4277 -5714 6792 9086 20312 30279 10271 -1304 -24733
11561 -24733 -58104 -66586 -38514 -32806 -37515 -23228 -10214 28624 60013 33502 14852 -22598
11549 -22598 -61669 -57781 -49928 -9856 -26574 -12452 9178 21414 18982 -474 -24101 -10615
11537 -10615 11116 -154 -22096 13226 29636 19985 17635 27429 12327 -19333 -24157 -13495
11525 -13495 -16846 8192 53948 64797 40904 28613 31002 14691 3157 -12696 -20668 -11594
11513a1594k8499k2558l831K7326K2100K2173J6031l1884l2205L0656K4198J6183
11501B8096L676n266p363j1069j1788l1717n87K0041M5668J3604J1179j7475k3992
11488A3007P666j1344j0786k6999o513J086l544o988J8003K3617n313m709J1346
11475a471n674J3245Q098n484j7116k8014j6237J6899K8291K5086r084l6273j6681
11462d4415J9567N083K1705l6404j7878N357j0790k994N684K1851K078j9504K121
11449d8539K3205J5975K0171j8218P333K4212l238k4258Q467P387q699O402l471
11436F729k3730J153K5017o762J0745k49L859N20J4471J1497n231j0470k2548
11423E001k4130n719K7357K9917j5527k7414j6263J8289K4045J1009k8087K0395
$$ plain form
11513 -11594 -40093 -62651 -66482 -39156 -17056 5117 21148 -10736 -42941 -12285 11913 28096
11501 28096 31772 26506 19143 8074 -3714 -35431 -36018 -15977 29691 43295 54474 36999 13007
11488 13007 20673 9329 -1457 -28456 -34969 -33883 -37427 -44415 -26412 -2795 -8108 -12817 -1471
11475 -1471 -7145 6100 14198 8714 -8402 -36416 -52653 -35754 -7463 17623 8539 -27734 -44415
11462 -44415 -24848 -19765 1940 -34464 -52342 -46985 -57775 -60769 -55085 -33234 -31156 -50660 -48539
11449 -48539 -25334 -9359 10812 -7406 -73 24139 20901 -3357 5110 12497 3798 10200 6729
11436 6729 -17001 -15848 9169 2407 13152 12903 16762 17282 31753 43250 38019 27549 5001
11423 5001 -19129 -24848 2509 32426 16899 -10515 -26778 -8489 15556 26565 -1522 18873
11411A8873K3737k1239J368q505P815J2626j6627L643M946L0226k935k7153j0620
11398A6155J4027P209L6854O403L4k3066J3472p340o844P431k2121J302m128N641
11384D5029J9827K952k3695o4305k5847J1498M1690L359j683N333J7976J6345
11372D8479p173l8930K845J9145j800m0370k7642P460L5187K9243j4644p466L0933
11359C5267J1636j692P184R921J8525K403j8579l6845j5104L0564j285L513K109
11346D7617j1653J136O95j3899J9379Q313J1653n437j8537k2761L2429J3118j3090
11333D8963r515k481j0671K8444P12k6890K842K3941K5639L210k6101j2805j2044
11320C3244p913k2561j0415K365K0678K6035J5902J6037j0829r121N002o156O356
$$ plain form
11411 18873 42610 21371 22739 14234 22049 34675 18048 21691 26637 56863 53928 26775 16155
11398 16155 30182 37391 74245 80648 80682 57616 71088 63748 56904 64335 42214 43516 39388 45029
11384 45029 64856 67808 44113 -20192 -46039 -34541 7149 10508 8825 14158 32134 48479
11372 48479 41306 2376 5221 24366 22566 -17804 -45446 -37986 -2799 26444 11800 4334 35267
11359 35267 46903 45211 52395 62316 80841 83244 64665 27820 12716 43280 41995 45508 47617
11346 47617 35964 37100 37795 23896 43275 51588 63241 57804 39267 16506 48935 62053 48963
11333 48963 39448 36967 26296 54740 55452 28562 31404 55345 80984 84194 58093 45288 33244
11320 33244 25331 2770 -7645 -5280 15398 41433 57335 73372 62543 53422 58424 52268 58624
11307E8624J5154j9664k518J2691N1j942N155P350l3112J3535K4569J3362J7028
11294A10283j7062l862j2550J6932O402J3947n392J017k3403m4418j3471K2285
11282E0708j1057k3227J7344n768o982o042k651J9425O060k1344k5328j0012J9948
11269A074K9782J339J066j1259j0203k4242k407K8734O018M0734J3459J612J0917
11256H6624J6671k0181k5286R05j143M546r020l4822k894K3543j777k6888j4053
11243c775j7707J5369K5620j3254l0374r133K3397K3105K8547J9006J7972k3030
11231E5743n1622k5958L2476N1814p759j3954k0928l1558j1736P092j0401k1688
11219d8479M3634K6263k7832j6008L825J7871J3471L944K241J0127N140L371P657
$$ plain form
11307 58624 73778 54114 51596 64287 64338 62396 67551 74901 41789 55324 79893 93255 110283
11294 110283 93221 89359 76809 93741 100143 114090 108698 109715 86312 41894 28423 50708
11282 50708 39651 16424 33768 28000 21018 14976 12325 31750 37810 16466 -8862 -18874 1074
11269 1074 30856 32195 33261 22002 11799 -12443 -14850 13884 19902 60636 74095 75707 86624
11256 86624 103295 83114 57828 58733 57590 62136 53116 18294 15400 38943 37166 10278 -3775
11243 -3775 -21482 -6113 19507 6253 -24121 -33254 -9857 13248 41795 60801 78773 55743
11231 55743 4121 -21837 10639 62453 54694 40740 19812 -11746 -23482 -16390 -26791 -48479
11219 -48479 -4845 21418 -6414 -22422 -18597 -726 12745 16689 18930 29057 34197 37568 45225
11206D5225j0980K3039R556p234k146J6012P237k8579j9668m898l5777l5793J7615
11193b6391q450Q513J3321K4777L5788k063K3755O316l8001k2898k459r677O534
11180I065J4923K5937q450j1424p525N837J3517K6330k697j1639J8013L0101k787
11167I9201j2168K7108J1685j1186r973J054K4816L238r918j8407o059K9353J4071
11154A42815p57m3524l1003K3108L1973J254R277L283q552m4708j7230m235j267
11141F0434j5467M043j258K6956q683k6008j1630J3889J2957L1339K2963q116
11129A01419j3587k2126k7348R996J7169K4192l0527j5450n369P216N241K788
11117E3614L1200J3824m020L0846L0656p431l963J73k0479k0814j8297Q629k1650
$$ plain form
11206 45225 34245 57284 66840 59606 57460 73472 80709 52130 32462 27564 -8213 -44006 -26391
11193 -26391 -34841 -26328 -13007 11770 47558 45495 69250 75566 37565 14667 12208 2531 9065
11180 9065 23988 49925 41475 30051 22526 28363 41880 68210 65513 53874 71887 101988 99201
11167 99201 87033 114141 125826 114640 104667 105721 130537 133775 123857 105450 99391 128744 142815
11154 142815 142058 98534 67531 90639 122612 123866 133143 136426 127874 83166 65936 61701 60434
11141 60434 44967 49010 47752 74708 66025 40017 28387 42276 55233 86572 109535 101419
11129 101419 87832 65706 38358 48354 65523 89715 59188 43738 38369 45585 50826 53614
11117 53614 84814 98638 94618 125464 156120 148689 144726 144899 124420 103606 85309 93938 72288
11104G2288k0800J0815O555J33j7878J7837K3012j8515j0087J5549k740L3411
11092A09580J9748l3516J9j6379Q676k606j0514O9K3689L509J3449j291L122K490
11078A20045n700R291K1984k267l8508k0093J530R599K0489L378p567M960J6556
11065A33697J1707K4484k2124r618J5632N1831N8774k1592q438k8736L353N8716
11053B67686M7894R930K4911K9529J9242K9927L5126K4411K294O1451P6300O0976
11041F89677O5883R6290J30768J62269J97073K58767K29461J95763J91904J98256
11031B416111J96849J92093J70648J37920O3000q727r210m5597j41637j59376
11021B812074j96321k56984k51635j87263j44863j22874j23109j01280n9213l8099
$$ plain form
11104 72288 51488 62303 68858 68991 51113 68950 91962 73447 63360 78909 76169 109580
11092 109580 129328 95812 95831 79452 88128 85522 75008 75077 98766 102275 115724 114433 117555 120045
11078 120045 114345 123636 145620 143353 104845 84752 86282 95881 116370 119748 112181 117141 133697
11065 133697 145404 169888 147764 138146 153778 205609 264383 242791 234353 205617 208970 267686
11053 267686 315580 325510 350421 379950 399192 429119 464245 488656 490950 552401 628701 689677
11041 689677 755560 851850 982618 1144887 1341960 1600727 1830188 2025951 2217855 2416111
11031 2416111 2612960 2805053 2975701 3113621 3176621 3167894 3158684 3113087 2971450 2812074
11021 2812074 2615753 2358769 2107134 1919871 1775008 1652134 1529025 1427745 1368532 1330433
11011A330433j8751k7928l6523k107J1921L4434L8709P9240J68129K22827K41854
11000B042238L21294L58179M18356M71584N13013N18693N58505N08955M21853
10991F132670L23849K44949J02856p7362k02102l03204m14257m84255n15022n28137
10981D279985n22429n08423m38161l53783l10060k57219k02816j67708j37058
10972A382328o3404o3608m0763k8375N828J3097J7940O2642P3021J33019J73210
10961A664935J64732K15730K61719K74708K64059K87620K85371K58272J76669
10952C853815R6016M2042o259p0753j57101j72482k20257k10818k14670k19044
10942B720489j96461j23645p3685l1951l805P6930J66184K03558K82109L66459
$$ plain form
11011 1330433 1311682 1283754 1247231 1245124 1257045 1291479 1330188 1409428 1577557 1800384 2042238
11000 2042238 2363532 2721711 3140067 3611651 4124664 4643357 5201862 5710817 6132670
10991 6132670 6456519 6701468 6804324 6726962 6524860 6221656 5807399 5323144 4808122 4279985
10981 4279985 3757556 3249133 2810972 2457189 2147129 1889910 1687094 1519386 1382328
10972 1382328 1318924 1255316 1214553 1186178 1192006 1205103 1223043 1285685 1358706 1491725 1664935
10961 1664935 1829667 2045397 2307116 2581824 2845883 3133503 3418874 3677146 3853815
10952 3853815 3949831 3991873 3985614 3914861 3757760 3585278 3365021 3154203 2939533 2720489
10942 2720489 2524028 2400383 2326698 2294747 2290942 2367872 2534056 2737614 3019723 3386182
10932C386182M11376M81278N59384N87706N95867N75437N37422M09082K81140
10923G824874J85623J9026j37817k28569l64694m62694n19120n44356n30125n30764
10913D711384m77764m05664l00500k56764k15060j43970o8136j1198L3347O1939
10903B927614J06600J59084K27120K91665L86018M80231O18673P34905Q69217
10894F801127R97733J112822J211681J220400J229684J173895J029947Q43497
10886A5620786O16374L30473M5921k65962n38871q07497j005774j170927j238142
10877A1586381j257148j242165j116383r85614q85717p45543o08241m79851l64792
10868C900927k81729j68556j32846j02210m8718K679P7950J37489K07009K36221
$$ plain form
10932 3386182 3797558 4278836 4838220 5425926 6021793 6597230 7134652 7543734 7824874
10923 7824874 8010497 8029523 7891706 7663137 7298443 6835749 6316629 5772273 5242148 4711384
10913 4711384 4233620 3827956 3527456 3270692 3055632 2911662 2843526 2832328 2865675 2927614
10903 2927614 3034214 3193298 3420418 3712083 4098101 4578332 5197005 5931910 6801127
10894 6801127 7798860 8911682 10123363 11343763 12573447 13747342 14777289 15620786
10886 15620786 16237160 16567633 16613554 16347592 15808721 15001224 13995450 12824523 11586381
10877 11586381 10329233 9087068 7970685 6985071 6099354 5353811 4745570 4265719 3900927
10868 3900927 3619198 3450642 3317796 3215586 3166868 3169547 3247497 3384986 3591995 3828216
10858C828216L16861L97524M48960N05798N61287N89514N81175N35046M44030
10849H208411L66154K17595P7185o7673k07404l80703n07616n30126o25801o65960
10839E884062o18486o04912n58817m82392m35224l66277k98863k65802j72038
10830B081251j70260j38640j05307m4450l6566k9247r533j4473L6440N1533L4108
10819A654856Q2850J46209J43162J80856K36275L30087M26020M77334N12650N89873
10809D780172N82685N59197N18686M22390L59712K68084J05351m9837j43384k47287
10799G155769l43115m17878m66600n00399n49936n23455m49352m00153l34862
10790C170019k80581k49775j60055j07275j19669j17978o5727q687o56K1572O2685
$$ plain form
10858 3828216 4145077 4542601 4991561 5497359 6058646 6648160 7229335 7764381 8208411
10849 8208411 8574565 8792160 8869345 8801672 8594268 8213565 7705949 7175823 6550022 5884062
10839 5884062 5265576 4660664 4101847 3619455 3184231 2817954 2519091 2253289 2081251
10830 2081251 1910991 1772351 1667044 1622594 1586028 1556781 1547248 1532775 1569215 1620748 1654856
10819 1654856 1737706 1883915 2027077 2207933 2444208 2774295 3200315 3677649 4190299 4780172
10809 4780172 5362857 5922054 6440740 6863130 7222842 7490926 7596277 7546440 7403056 7155769
10799 7155769 6812654 6394776 5928176 5427777 4877841 4354386 3905034 3504881 3170019
10790 3170019 2889438 2639663 2479608 2372333 2252664 2134686 2068959 2060272 2059616 2081188 2143873
10779B143873J02943J03046J33503K01269K41531L22741M41941N97468P46141
10770E034456Q90002R81020J077416J129447J154760J119528J073587J009755
10762A3469971Q65232O60458L26731J06310p3249k85303m81934o94864q89772
10753A3003580j010336j055043j048278j012232r73159q86968q14205p55711o21373
10744D826275n32766m64616l76021k96967k70248j97965j45566j13307q4229o6439
10734B278151k7166j7159K3993N5402O4768J18569J99692K52988L52968M29729
10724C731935N12816O16443O69795P34076O78534O24964N65462N21553M09080
10715I064658K64766Q6426m9260k12824l31187l77019m68495n53816n36790n04388
$$ plain form
10779 2143873 2246816 2349862 2483365 2684634 2926165 3248906 3690847 4288315 5034456
10770 5034456 5924458 6905478 7982894 9112341 10267101 11386629 12460216 13469971
10762 13469971 14335203 14995661 15322392 15428702 15355453 15070150 14588216 13893352 13003580
10753 13003580 11993244 10938201 9889923 8877691 7904532 7017564 6203359 5447648 4826275
10744 4826275 4293509 3828893 3452872 3155905 2885657 2687692 2542126 2428819 2344590 2278151
10734 2278151 2250985 2233826 2257819 2313221 2377989 2496558 2696250 2949238 3302206 3731935
10724 3731935 4244751 4861194 5530989 6265065 6943599 7568563 8134025 8655578 9064658
10715 9064658 9329424 9415850 9366590 9153766 8822579 8445560 7977065 7423249 6886459 6382071
10705F382071m52251l99106l20758k24368j72499j68846j37444j47786k35852
10696D123161k80210k87825k93089k32901k57886l02355k71661k78032k46750
10687A672452j51522r4234p6100r3613j06681q7934l2738Q571k2652o975M0483
10676A049057K7367K4420Q080r493M0124J06581J50665J48167K21811K46305K96975
10665B310059L48873M18206M26341M48027M68767N01809M69999M14665L43100
10656F149846K52123J42440N409j06071k04951k55877l24119m18062m72676m54249
10646D313813m66481l87948l64815l13616k67196k44395j88202j21134o1097k0204
10636A878725L643M6272J00133Q9290P2587J09779J21994J68087K28550L22073
$$ plain form
10705 6382071 5929820 5530714 5209956 4985588 4813089 4644243 4506799 4359013 4123161
10696 4123161 3842951 3555126 3262037 3029136 2771250 2468895 2197234 1919202 1672452
10687 1672452 1520930 1426696 1350596 1256983 1150302 1062368 1029630 1038201 1015549 1008574 1049057
10676 1049057 1076424 1100844 1108924 1099431 1139555 1246136 1396801 1544968 1766779 2013084 2310059
10665 2310059 2658932 3077138 3503479 3951506 4420273 4922082 5392081 5806746 6149846
10656 6149846 6401969 6544409 6549818 6443747 6238796 5982919 5658800 5240738 4768062 4313813
10646 4313813 3847332 3459384 3094569 2780953 2513757 2269362 2081160 1960026 1898929 1878725
10636 1878725 1882368 1928640 2028773 2118063 2190650 2300429 2422423 2590510 2819060 3141133
10626C141133M32549O23503Q63262J196708J609511K134861K805631L379658L514768
10617A9701584K745895J378767j3077p98566p87744k17476O89790J836106L271685
10608B7806964M842346O194360O254667M073475L24380l054741m588393m167341
10600C7685717k559365n14627J679205M055976O445863Q151308P685174L918454
10592F6547705j750040o355950q115543p249073n117361k756282n91944J409618
10584C6021130L212316M322636L751553R27646k859447n697092o488980n560046
10576B7629716l963707k414368j093829k6391P65251J067455O59522n14546j978852
10567B0130251k988311l267482k885400k257727j703821j286105r36260o92532
$$ plain form
10626 3141133 3573682 4197185 5060447 6257155 7866666 10001527 12807158 16186816 19701584
10617 19701584 22447479 23826246 23813169 23014603 22226859 22009383 22699173 24535279 27806964
10608 27806964 32649310 38843670 45098337 49171812 49496192 46441451 41853058 37685717
10600 37685717 35126352 34611725 36290930 40346906 46792769 54944077 62629251 66547705
10592 66547705 64797665 58441715 50326172 43077099 37959738 35203456 34611512 36021130
10584 36021130 39233446 43556082 47307635 48235281 45375834 39678742 33189762 27629716
10576 27629716 23666009 21251641 20157812 20131421 20896672 21964127 22623649 22109103 20130251
10567 20130251 17141940 13874458 10989058 8731331 7027510 5741405 4805145 4112613
10559D112613n66980m47450l87963l04818k42158k15695j92051j67991j30164
10550A457343r7812o6657p1332q4134o9575o0263m8130k7593l8063n3749m7897
10539G92138l3541j2398l5679m3925m2070m1675o81k1068l2499k1372N959j6210
10527D96979j6756Q340k0398j2372l179Q759j1965j813l3900j4718m520l1685
10515C62772q077J2783J4966j4020j0154k4047J8900K2880j0722K919k3386k2539
10503C22275q31m282k3018L616J084j748j8859J514K9143r577L095L7618j2540
10490C27490k3945j8097l7980J2118M060J241K6287j2176K623K0225K1581J3179
10478C36606J6237j9212o095k357m160j2823P735l967k052J4432O69m04l7501
$$ plain form
10559 4112613 3545633 3098183 2710220 2405402 2163244 1947549 1755498 1587507 1457343
10550 1457343 1359531 1292874 1221542 1137408 1067833 1007570 959440 931847 893784 840035 792138
10539 792138 758597 746199 710520 666595 624525 582850 582169 561101 528602 507230 513189 496979
10527 496979 480223 488563 468165 455793 452614 461373 449408 447595 413695 398977 394457 362772
10515 362772 354695 367478 382444 368424 358270 334223 353123 376003 365281 368200 344814 322275
10503 322275 321444 317162 294144 297760 298844 297096 278237 279751 308894 299317 302412 340030 327490
10490 327490 303545 285448 247468 259586 263646 264887 291174 278998 281621 301846 323427 336606
10478 336606 352843 333631 327536 325179 321019 308196 315931 311964 309912 324344 325013 324609 287108
10465B87108n3265k9381m1000j1028P008r250J1617J4255J6569n051l7421k6430
10453A23731k2554n653J374L470o70J3029j2316j3017O224O301J4575L328n424
10440A12398M923J7193J2262o611J2162r773k0149j6506O428l284J8255j727J7831
10427A43402K0656P661o93j073k7633j2637j0127j0546N872q566p020j3325l2504
10414E3467j6796K3889J0377k3211k858K8651K1653l276m0255j6105L3940K3166
10402I2642k616o924p866j0761J0119O233r333M849J503k1756m8265k3124K8167
10389A2868K1563K2274N147K263j026p468p020J1443J7836J7583k7451j6979O525
10376E7558J262J6573o441j2918n422j316j3816k2282j6041J4769J1308R154m616
$$ plain form
10465 287108 233843 204462 163462 152434 159442 150192 161809 176064 192633 187582 150161 123731
10453 123731 101177 95524 96898 100368 99698 112727 100411 87394 93618 99919 114494 117822 112398
10440 112398 117321 134514 146776 140165 152327 142554 122405 105899 112327 109043 127298 125571 143402
10427 143402 164058 171719 171026 169953 142320 129683 119556 109010 114882 106316 99296 85971 53467
10414 53467 36671 60560 70937 47726 44868 73519 95172 91896 51641 35536 69476 92642
10402 92642 90026 83102 75236 64475 74594 80827 71494 76343 77846 56090 7825 -15299 12868
10389 12868 34431 56705 61852 64115 63089 55621 48601 60044 77880 95463 68012 51033 57558
10376 57558 58820 75393 68952 56034 50612 49296 35480 13198 -2843 11926 23234 32388 27772
10363B7772R117j8026j5805J1216K2876M8216O701k8049J5666J9188l92N33J2454
10350A11467M640J716J3818P110j5348j6188N422R463j5918j5213M876j3043p360
10337G5442o163M006P159J1946o177k3624J5646J6115k700o198l180k248L6932
10324A16956J4487j5147j4349J6787K0833k2145k1195k9043R191j7808J0553L6620
10312A05740L378p192K3884q869p694M739j7911K1533J4632M329K441J353k4871
10299A15492L614J5640M702k260o163L284q465l4697j1561L3267K6037j3451Q95
10286A26334J4943O791m979j8071j7592K1098M8584K8738j1616j680j0524k2601
10274A59425q741P427j8570r471p921n311Q074Q697k9688K2995j2587m1311M83
$$ plain form
10363 27772 36889 18863 3058 14274 37150 85366 92067 64018 79684 98872 98480 99013 111467
10350 111467 116107 117823 131641 138751 123403 107215 112637 122100 106182 90969 95845 82802 75442
10337 75442 69279 73285 80444 92390 86213 62589 78235 94350 91650 85452 82272 80024 116956
10324 116956 131443 116296 101947 118734 139567 117422 96227 67184 76375 58567 69120 105740
10312 105740 109118 101926 125810 116941 109247 113986 96075 117608 132240 136569 139010 140363 115492
10299 115492 119106 134746 139448 137188 131025 134309 125844 91147 79586 112853 138890 125439 126334
10286 126334 141277 148068 143089 125018 107426 128524 177108 205846 194230 192550 182026 159425
10274 159425 150684 158111 139541 130070 122149 116838 124912 133609 103921 126916 114329 73018 73501
10261G3501Q04L0337L3044k697K5036J3999M528m145N63J516k0726j653M514J4672
10247A73293j658J0457j4262J3594L6870K3763K1775j3455l8778j5684p730O614
10235A94799k3348j9376r408r827j8214j6884p880J4820n298l240k612J4969j2116
10222I6385Q54N981L037j1636k448k0177J363k5136q307K2424O346Q286p027K3593
10208I3538j7818r570O423j6871j888O394j817J6970J0069j3897k0383J3618J9625
10195H4393n0525k9446J4375K3992N903m667J8588J0687K5187p182k3389J081
10183F8997M4536K6776j545K0622M931j6546l981j8444j1838J3918L9025M2324
10171B08775J3633n051M2187M1942J897j6487j6304l0290j8048R695M6498L6880
$$ plain form
10261 73501 74305 104642 137686 134989 160025 174024 178552 174407 174970 176486 155760 154107 158621 173293
10247 173293 171635 182092 167830 181424 218294 242057 263832 250377 211599 195915 188185 194799
10235 194799 171451 152075 142667 132840 114626 97742 89862 104682 99384 96144 93532 108501 96385
10222 96385 97239 103220 106257 94621 92173 71996 73359 48223 39916 62340 68686 76972 69945 93538
10208 93538 75720 66150 72573 55702 53814 60208 58391 75361 85430 71533 51150 64768 84393
10195 84393 33868 4422 18797 42789 48692 44025 62613 73300 98487 91305 67916 68997
10183 68997 113533 140309 138764 159386 164317 147771 143790 125346 113508 127426 166451 208775
10171 208775 222408 217357 259544 301486 303383 286896 270592 240302 222254 231949 278447 315327
10159C15327J4676L3860M9909L8933q850q6940m9574k6561K2977M272J4746q94
10147C21881j192M4775j525l0763n9272m5054l5822k8040Q754n047O500M687O69
10134A80551L771q707K3638n158k5949n895K063j3473j8325j8963N213k920j1803
10121A04043j6968M1j4935J245L5179P594k8418l2607M173O086O097p804l5044
10108B8682J1634N899l627K5372k983K541K1207M456k779p50qj2254L4396K4353
10094A36139k1375j6282r018J2086j3249J030P228k828K3075K734R096J6089K191
10081A46916M961j673k2446k7293K972K2692Q113r971j8870j4388K264J6303p563
10068A02017P350K1317J4237l0434m4616J0133J5212J5430J0195j5561R671N13
$$ plain form
10159 315327 330003 363863 413772 452705 443855 356915 307341 280780 303757 308029 322775 321881
10147 321881 320689 365464 363939 333176 273904 228850 193028 164988 173742 168695 175195 179882 180551
10134 180551 184322 175615 199253 194095 168146 162251 164314 150841 132516 113553 118766 115846 104043
10121 104043 87075 87116 72181 73426 108605 116199 87781 55174 59347 65433 71530 63726 28682
10108 28682 40316 46215 42588 67960 64977 67518 88725 93181 90402 89652 89644 77390 111786 136139
10094 136139 114764 98482 89464 101550 88301 89331 96559 93731 116806 119540 128636 144725 146916
10081 146916 151877 150204 127758 100465 103437 126129 134242 124271 105401 91013 93277 109580 102017
10068 102017 109367 130684 144921 114487 69871 80004 95216 110646 120841 105280 114951 115464
10056A15464J365J3413j8073j2158L4298k454J8869J1879J1600J7777j5216j2983
10044A63781k424j1489R780k249j9875j02j2203j0695k3295K7172j756J828K4917
10031A43390j5422m136M176j1315j6888n522N311r260j1455P946M0395K3163j2830
10018A37553p286J7976J4492J4238L3234J2124l104j4515K499Q700o454j6220
10006A93237r913j0925J7869K3008K0455P093j182N496O173K5044L0847L8789
9994C45991N4600N3754K8365L6038l6353l3777o4237l1370m2749m4839k7905j3371
9982B24147J0098Q111L2780J3212j9476p941J4038J1052Q185J5196j035K6889
9970C35256L2106K4389L3371N0171Q7244Q3086P0583O6926R0490Q4755M9769K5958
$$ plain form
10056 115464 116829 130242 112169 100011 134309 131855 150724 162603 174203 191980 176764 163781
10044 163781 161357 149868 159648 157399 137524 137422 125219 114524 91229 118401 116645 118473 143390
10031 143390 127968 123832 128008 116693 99805 94283 99594 90334 78879 86825 127220 150383 137553
10018 137553 130267 148243 162735 176973 210207 222331 219227 204712 207211 215911 209457 193237
10006 193237 183324 172399 190268 213276 233731 240824 239642 245138 251311 276355 307202 345991
9994 345991 400591 454345 482710 518748 482395 448618 384381 353011 310262 265423 237518 224147
9982 224147 234245 242356 275136 288348 268872 260931 274969 286021 294206 309402 308367 335256
9970 335256 367362 391751 425122 475293 562537 645623 716206 783132 873622 958377 1008146 1034104
9958A034104K2297M4360k5082n8508q0781j12083q5473q5131o9686m9746k213
9947E32058O574j6859o151K4099n489k0262k4713L4927L8716L2234K5718M4859
9935F65711L6198M9815N1597P6858Q2493J59996J90806J89811J83109J91068J58061
9924B035523J01367R5201O6258R2086J47254K42374K88849L57618M55870O38613
9914D521013Q05060R72726J190517J454902J594815J553444J243840P81417L04562
9905A4422296q5514m19657p84963j077353j227515j229740j122949r27590p48008
9896F799007n79245m40196l23335k31896j68015r0056J4098Q0352J67176K33504
9886E461394L36040M66357O21802Q20898J052279J273142J513836J653720J593531
$$ plain form
9958 1034104 1056401 1100761 1075679 1017171 936390 824307 738834 653703 584017 534271 532058
9947 532058 538632 521773 515622 539721 534232 513970 489257 524184 562900 595134 620852 665711
9935 665711 701909 751724 803321 880179 962672 1122668 1313474 1503285 1686394 1877462 2035523
9924 2035523 2136890 2232091 2298349 2390435 2537689 2780063 3068912 3426530 3882400 4521013
9914 4521013 5326073 6298799 7489316 8944218 10539033 12092477 13336317 14117734 14422296
9905 14422296 14336782 13917125 13132162 12054809 10827294 9597554 8474605 7547015 6799007
9896 6799007 6219762 5779566 5456231 5224335 5056320 4966264 4980362 5060714 5227890 5461394
9886 5461394 5797434 6263791 6885593 7706491 8758770 10031912 11545748 13199468 14792999
9877A4792999J395230J138848R67305R83679R53159Q60365P62000P18586Q53473
9868B3425644J114127J393659J678247J814188J643476J036705m9469j498959
9860C0557618k747567l399568l447525l056295k473957j922414j459939j093560
9852A0956793p68175n20279l18774j13590O0803K63911N00070O97427Q53788Q70114
9842A2482088P04178L92659K9747k60538k62666l1994K81372P32745J278476J888745
9832A7234812K471555K925501L132616K985501K515466J729956M85611q62619
9824C2618399j920480k602546k846791k880923k826644k625138k338374j997688
9816A2579815j647833j329527j062126q54116o54323n29349m49051l83109k98176
$$ plain form
9877 14792999 16188229 17327077 18294382 19278061 20231220 21091585 21853585 22572171 23425644
9868 23425644 24539771 25933430 27611677 29425865 31069341 32106046 32056577 30557618
9860 30557618 27810051 24410483 20962958 17906663 15432706 13510292 12050353 10956793
9852 10956793 10188618 9668339 9349565 9235975 9296778 9560689 10060759 10758186 11611974 12482088
9842 12482088 13186266 13578925 13608672 13348134 13085468 13053474 13334846 14067591 15346067 17234812
9832 17234812 19706367 22631868 25764484 28749985 31265451 32995407 33481018 32618399
9824 32618399 30697919 28095373 25248582 22367659 19541015 16915877 14577503 12579815
9816 12579815 10931982 9602455 8540329 7686213 7031890 6502541 6053490 5670381 5372205
9807E372205k76982j78245j06488m5319N7383J54125K21581L32818M48564N84691
9797F564333O85511P49640Q03514P07953M84094K65041J02925J10506J82319K20939
9787A0876775J17536j79442o18754r19049j052543j050100r63709q08171p25167
9778D677376o25599n00544m20251l52540k94315k51808j92869j71394j68757j70894
9768A528405q7262q9921r7412q4419l0233j6899m3520o3693o3978m7879j0368
9757H92821m0044m8074k0593k0699J4394L7970j498J8761N4426L5565N7876J14541
9745A095446J19335J15446O4051j9215j18205j42180j54609j15685n2221q4487
9735G07676r1520m7258k4735j4192l3614n6417j8409L277k192P140j7768k8858
$$ plain form
9807 5372205 5095223 4916978 4810490 4765171 4822554 4976679 5198260 5531078 5979642 6564333
9797 6564333 7249844 7999484 8802998 9510951 9995045 10260086 10363011 10473517 10655836 10876775
9787 10876775 10994311 10814869 10196115 9277066 8224523 7174423 6210714 5402543 4677376
9778 4677376 4051777 3551233 3130982 2778442 2484127 2232319 2039450 1868056 1699299 1528405
9768 1528405 1441143 1351222 1253810 1169391 1139158 1122259 1078739 1015046 951068 903189 892821
9757 892821 852777 804703 784110 763411 777805 815775 814277 833038 887464 923029 980905 1095446
9745 1095446 1214781 1330227 1394278 1375063 1256858 1114678 960069 844384 792163 707676
9735 707676 616156 568898 544163 529971 496357 439940 421531 424808 422616 429756 411988 383130
9723C83130P88J5385m8088k9616N948j3631q277l3465J7267L5115k2031j9079
9711B83446M2253J6765J9376K8611K7829J0509L160L2831J7594k4886l0474l6586
9699C90428o0435o0121j9192k6435j0016L095j6938j4229J4770J7060l2615j9646
9687A65726k114o965l894J2329j4189j864J1842k281o541Q091j423J0024N725
9674A74466j2240j0372K9409J669k4538j5712J2218K0348l1347k0946J4634M745
9662A42334K4313P239k6120j6663k0868J3396K3081L8371N5508P2157J7062o0157
9650B69653o5575n2404j2190j4098l1639k2587k0081j1640j0402J4623q391J4394
9638D9663J0770j9744l7879J5003L1093M0230J9510J125j972k5088j4338K148
$$ plain form
9723 383130 383918 399303 351215 321599 327547 313916 305639 272174 289441 324556 302525 283446
9711 283446 325699 342464 361840 390451 418280 428789 431949 464780 482374 457488 427014 390428
9699 390428 329993 269872 250680 224245 214229 217324 200386 186157 200927 217987 185372 165726
9687 165726 163612 156647 152753 165082 150893 149029 160871 158590 152049 160140 158717 168741 174466
9674 174466 162226 151854 181263 182932 158394 142682 154900 175248 143901 122955 137589 142334
9662 142334 166647 173886 147766 131103 110235 123631 146712 185083 240591 312748 329810 269653
9650 269653 204078 151674 139484 125386 93747 71160 51079 39439 29037 43660 35269 49663
9638 49663 60433 40689 2810 17813 48906 89136 108646 109771 107799 82711 68373 70521
9626G0521Q402J0706o219l890J3761J2936j6823k0785J4269J3244r419n0641j6335
9613A9727J8070K144j0267P019J0292K2925n948k6799N687l0281j4548J5530K4410
9600C7961N043L631p067L2292J1155o671P946k761N065J3704j5017r265k6156
9587D9860j152K0539o997k0123q360J9857n76r70j952j4070l5202J6750K592J5656
9573C5852J8859J4402l1696l1295J0000k077P673l0829j1602M0445J8999J7156
9561E5887n4813j0279M061J0992L849K9578J5885L560l9600K976J693q379O085
9548B1495K8802o654J3348J6171R134j9510m3993Q51Q435J9328R834K929K021
9535F2191Q933j5946q119M549J4759k5825j9039j1751L5294J8186j4618p914Q469
$$ plain form
9626 70521 78923 89629 83410 79520 93281 106217 89394 68609 82878 96122 86703 36062 19727
9613 19727 37797 39941 29674 36693 46985 69910 63962 37163 42850 12569 -1979 13551 37961
9600 37961 43004 46635 39568 71860 83015 76344 84290 81529 86594 100298 85281 76016 49860
9587 49860 48708 69247 62250 42127 33767 53624 53048 52078 50126 36056 854 17604 20196 35852
9573 35852 54711 69113 37417 6122 16122 14045 21718 -9111 -20713 19732 38731 55887
9561 55887 1074 -9205 -5144 5848 9697 39275 55160 58720 19120 22096 23789 15410 21495
9548 21495 50297 43643 56991 73162 82296 62786 18793 19644 28079 47407 57241 60170 62191
9535 62191 71124 55178 47059 51608 66367 40542 21503 9752 45046 63232 48614 40700 49169
9522D9169P523P7K6267j935p238k0404J2276Q304j3794k4970L1659m21q587M755
9508F2681o924q006O146K193q30k2209l1225L2022J0012m549Q003K4998L7009
9495A09321k625k4696j8700J7485J9712Q033j6390J4807J3260J6159k1047l393
9483A11926j8215p503m134J0691J1741k0433P288L002J0901L1327K1947l421k7465
9470A27652o152K4686Q613n527m481k546j5413K017j0111p2J879j2605J386J7467
9456A26793N283P211J0037R879K216l6668L66L4194K1517p314J9382K2964N678
9443B21538r286j4801j7347j3269L649J7722l2843l4154N831K474K758q270j7184
9430A06818n812l024M015J7577J8039l1720J888l746m724l844q579J1074q179
$$ plain form
9522 49169 56692 56769 83036 81101 73863 53459 65735 74039 60245 35275 66934 66513 57926 62681
9508 62681 55757 47751 53897 56090 55260 33051 1826 33848 43860 39311 47314 72312 109321
9495 109321 106696 82000 63300 80785 100497 108530 92140 106947 120207 136366 115319 111926
9483 111926 93711 86208 82074 92765 104506 84073 91361 94363 105264 136591 158538 155117 127652
9470 127652 121500 146186 154799 149272 144791 142245 126832 128849 118738 118666 120545 107940 109326 126793
9456 126793 132076 139287 149324 159203 161419 124751 125117 159311 180828 173514 192896 215860 221538
9443 221538 212252 197451 180104 166835 170484 188206 155363 121209 127040 129514 132272 124002 106818
9430 106818 101006 97982 101997 119574 137613 105893 107781 104035 99311 95467 86888 97962 89783
9417H9783j3045J6760k667k7835l3962P494N0797L9873K5114R698j405J0605K1460
9404A92670M658O301L5456p342o1101m7130j9107k6199l86R729j1246j6994R460
9391F8769L869j3097l832J8565J9803N853k9628j2245o423K8469M091l291L277
9378H4180J0833L0315j0274k8777J1043K173k2949J4740K1374j8193j1991R662
9366I2136r497J0084N987j6769j552j1263k2934r474n109P007J1652l361l6854
9353A0053j7644P235K8626q376j1546J2194o276l957L9535N310j6847j406J5707
9340E2608J7807l5266r932J0390P354R295k3701r00k142K3538j9000J5832J3828
9327E9711l2743q235M1080K840k446k081L902N813P223l4762J0601m421K800M397
$$ plain form
9417 89783 76738 93498 90831 62996 29034 36528 87325 127198 152312 162010 160605 171210 192670
9404 192670 197328 203629 239085 231743 170642 123512 104405 78206 77820 87549 76303 59309 68769
9391 68769 72638 59541 55709 74274 94077 99930 70302 58057 51634 80103 84194 80903 84180
9378 84180 95013 125328 115054 86277 97320 99493 76544 91284 112658 94465 82474 92136
9366 92136 82639 92723 98710 81941 80389 69126 46192 36718 31609 38616 50268 46907 10053
9353 10053 -7591 -356 28270 19894 8348 20542 14266 10309 49844 55154 38307 36901 52608
9340 52608 70415 35149 25217 35607 42961 52256 28555 27655 25513 49051 30051 45883 59711
9327 59711 26968 18733 59813 62653 60207 58126 62028 67841 75064 40302 50903 46482 49282 53679
9313E3679k394o989j7821K278N382j1458l0543l3288J6815N247N965J0346m021
9300f802L7971J4819R870l44J0275k8751k36J091J3456J2651r465K343J6829k6861
9286D6846M38P429P374J9173j7172l6140Q105J365k917j612J7704l603k2370p099
9272A7521k2915q442J7550m273K8358O487k8753j6699l365Q326L080P356M478
9259H709q216k6639J7771J9864K800K0159J3128l3195L680o524j6113Q085q740
9246e231n445J4321q324N874m773R762L2143K4211j2443j1063L9957N3155p710
9233A24434k9368j8638j7074r42l3043j5645L7946j416m4461Q753M2709p329j5141
9220C0785m1832j1236K3554K6575J6076J433R85Q050k887J0084j3507k9866k8054
$$ plain form
9313 53679 51285 44296 26475 28753 34135 22677 -7866 -41154 -24339 -19092 -13127 -2781 -6802
9300 -6802 31169 45988 55858 55514 65789 37038 36802 37893 51349 64000 54535 56878 73707 46846
9286 46846 47284 54713 62087 81260 64088 27948 36053 37418 34501 32889 50593 46990 24620 17521
9272 17521 -5394 -13836 3714 -559 27799 34286 5533 -11166 -14531 -6205 -3125 4231 8709
9259 8709 493 -26146 -8375 11489 14289 34448 47576 14381 18061 11537 -4576 3509 -5231
9246 -5231 -10676 3645 -4679 1195 -3578 6184 38327 62538 50095 39032 78989 132144 124434
9233 124434 95066 76428 59354 58412 25369 9724 47670 46254 1793 10546 53255 45926 30785
9220 30785 -11047 -22283 1271 27846 43922 45355 46340 54390 51503 61587 48080 18214 -9840
9207i840K1444M3187J6900j3645j4391k2630N540m412p939M832K157J7862N38
9194C9603k8633P053J1242j112J0283N118m1119l2030J4290J8915q271k3079K7652
9181h8p868p799n033J8053L8702J8265J04l937O342j2793j4618j9282j4662K4147
9167A9533L1159k7751O170L4253r229k1997M894k938j1854j7629m1910O633K7223
9154c443O338J1836L570J0003L2702j293r804j9830m2074K343J6532K0685J0039
9141C7604N683l0184J2188J2576k3912j1656M0832P313L6488l654l4184k244j1996
9128C4854n944L5233j5759l8362p62m284k3894K436N630o741K631j924J1788K4099
9114A9001K3869k061j6230j7251K263k6079r237R469J45J7570M326m240N206l432
$$ plain form
9207 -9840 11604 54791 71691 58046 43655 21025 26565 22153 14214 19046 21203 39065 39603
9194 39603 10970 18023 29265 28153 38436 43554 2435 -29595 -15305 3610 -4661 -27740 -88
9181 -88 -7956 -15755 -20788 -2735 35967 54232 54336 50399 56741 43948 29330 10048 -4614 19533
9167 19533 50692 22941 29111 63364 54135 32138 37032 34094 22240 4611 -37299 -30666 -3443
9154 -3443 2895 14731 18301 28304 61006 59713 49909 30079 -11995 -9652 6880 27565 37604
9141 37604 43287 13103 25291 37867 13955 2299 43131 50444 86932 83278 49094 46850 34854
9128 34854 28910 64143 48384 10022 9260 4976 -18918 -16482 -10852 -17593 -14962 -16886 -5098 19001
9114 19001 42870 40809 24579 7328 9591 -16488 -25725 -16256 -16111 1459 5785 1545 6751 3319
9100C319J4120J7659L0951m680l6321L6780M431J325j0669j3143j0563O372j8917
9087B0664m397l121J8627j25k0837K478J6752K169J0000P863k048L279J2325k7115
9073C6514J2858Q095l439q13l3473m0713j2981R097J7599J2858J2918J8229J6744
9060E3493K851R496m257k8931k0586J1370M665k216k1923k8310J9806J1924J3971
9047B1353q660k9009j0465J3638l7111M865Q634K8026j037m787k130J5134J2928
9034A1379k525k3431J6708J0218j1930J3388j5667r482J6657M09J5125L6053J6689
9021G3591r675l7638j995L891l8688K4430K5356j3622M6j0847P908J9118j6578
9008B5297n8772k4397Q436L0598K1060l315K1617j118k5013k0586k8980K6511
$$ plain form
9100 3319 17439 35098 66049 61369 25048 61828 66259 67584 56915 43772 33209 39581 20664
9087 20664 16267 13146 31773 31648 10811 13289 30041 32210 42210 50073 48025 51304 63629 36514
9073 36514 49372 57467 54028 53215 19742 -20971 -33952 -24855 -7256 5602 18520 36749 53493
9060 53493 56344 65840 61583 32652 12066 23436 28101 25885 3962 -24348 -4542 7382 21353
9047 21353 12693 -16316 -26781 -13143 -50254 -45389 -36755 -8729 -9766 -14553 -16683 -1549 11379
9034 11379 8854 -14577 2131 12349 419 13807 -1860 -11342 5315 5724 20849 56902 73591
9021 73591 63916 26278 24283 28174 -10514 13916 39272 25650 25696 14849 22757 41875 25297
9008 25297 -33475 -57872 -49436 -18838 2222 -1093 20524 19406 -5607 -26193 -55173 -28662
8996b8662k495n927J8214J5806J9164L2458Q825r107q687L099p440N82l940k7753
8982D137r765J8941K4758K3960P5L3570N462l0368m9941j8832J786N595N412J968
8968A6758J4583J6681q970k1346k9776j9229P910K5402M4123r27j8638j4526L1168
8955D3213J8286j2550q917j2223j2837k8167P136J3296L583j2375K4673M1905
8943F5023O235j6856j9651r676L497j338r542q856k8155K3836N827M330J8734
8930C3408j7774J0266Q994j1095j163L9784o789k9045M595J8212j478J550J4262
8917F3727J5163j2930k7292O049K0426j2923k4876N121j2193j1871J2559k0521
8905D39J0235K2529L906k8884Q67K7280O759n811J0452j9534j1170K996J4928
$$ plain form
8996 -28662 -31157 -37084 -18870 -3064 16100 48558 57383 48276 39589 42688 35248 35830 31890 4137
8982 4137 -5628 13313 38071 62031 62106 95676 101138 70770 20829 1997 3783 9378 14790 16758
8968 16758 31341 48022 39052 17706 -12070 -31299 -23389 2013 46136 45209 26571 12045 43213
8955 43213 61499 48949 40032 27809 14972 -13195 -6059 7237 10820 -1555 23118 65023
8943 65023 71258 54402 34751 25075 28572 27234 17692 8836 -19319 4517 10344 14674 33408
8930 33408 15634 25900 34894 23799 22636 62420 55631 26586 31181 49393 47915 49465 63727
8917 63727 78890 65960 38668 44717 65143 52220 27344 32465 20272 8401 20960 439
8905 439 10674 33203 37109 8225 9092 36372 43131 37320 47772 28238 17068 20064 34992
8892C4992J6062k5012k3607O608J7396k494J2522j1651Q493L0684j7455j1847
8880C4691P316J9101j4032l8962j7627K8904j7646j9836n500J7144M2087O284
8868D1924r837l5504q091O607k000k1981k218J7109J9691K955L385l459j2104
8855c523L2584J4455j2230o513K2096J6683k2594m824L3568q845J0649j8735k6692
8842B6079o12m0544J5672J4113o027r032m207J0457k683J2730o38J3640L7546
8829F6494P157k5310k7696j9456J4446K1524J9065K2036k7503j9566K0561m662
8817D7090K439p049j3101j6984N527J6051j3020j3608K0333J9355K3127k6795
8805D3365l3269J4725k6760m576m719r876P089P669K1736K1360k78m250J1864
$$ plain form
8892 34992 51054 26042 2435 9043 26439 23945 36467 24816 33309 63993 46538 34691
8880 34691 42007 61108 47076 8114 -9513 19391 1745 -18091 -23591 -6447 35640 41924
8868 41924 32087 -3417 -11508 -4901 -6901 -28882 -31100 -13991 5700 8655 12040 8581 -3523
8855 -3523 29061 43516 31286 24773 46869 63552 40958 36134 69702 60857 71506 52771 26079
8842 26079 25467 -15077 595 14708 8681 -351 -4558 5899 3216 15946 15308 28948 66494
8829 66494 73651 48341 20645 1189 15635 37159 56224 78260 50757 31191 51752 47090
8817 47090 49529 42480 29379 12395 17922 33973 20953 7345 27678 47033 70160 43365
8805 43365 10096 24821 -1939 -6515 -11234 -21110 -14021 -6352 15384 36744 36466 32216 44080
8792D4080j4614j2266J0566p573k2537k5122o840k890R278K1061J7091J6790P249
8779C4273r582j800M333J6726L289K505j6225j5396L998J0345k6308q591k6060
8766b8493n988K3591J4838K6020J2547l98k1615j3507J2894K655k681j3695j5464
8753i296k456K8809R460J0537Q734J5809n419j8275j5140l1594J677L9632L882
8740C6360k805K7687k800l4058L2324J9284j622l818J339q943l753R912r945Q585
8726F7747P265j1879l6668j9830J1079Q432j573J5790J1708m5785r984k559k02
8713f459j4125N96m057p818K5694M7987J8732k7126N553r394J0279P854l1793
8700A5923p023J7631J4399k7797P840J9173k240J7531k190J0877n172j0937k7972
$$ plain form
8792 44080 29466 17200 27766 20193 -2344 -27466 -34306 -37196 -27918 -6857 10234 27024 34273
8779 34273 24691 22891 27224 43950 47239 49744 33519 18123 22121 32466 6158 -2433 -28493
8766 -28493 -34481 -10890 3948 29968 42515 42117 20502 6995 19889 22544 19863 6168 -9296
8753 -9296 -11752 17057 26517 37054 45788 61597 56178 37903 22763 -8831 -7154 32478 36360
8740 36360 33555 61242 58442 24384 56708 75992 74370 70552 71891 62948 59195 69107 59162 67747
8726 67747 75012 63133 26465 6635 17714 26146 24573 40363 52071 6286 -3698 -6257 -6459
8713 -6459 -20584 -19988 -24045 -31863 -6169 41818 60550 33424 38977 29583 39862 47716 15923
8700 15923 8900 26531 40930 13133 20973 40146 37906 55437 53247 64124 58952 48015 20043
8687B0043k2450j9080q57K4964K6847L1967m938P474l6811l991J2900J7918l9024
8674A4962j4159K5835M835K4419O650o483j9456j7373L1762N884p454P263J9849
8661G6534J5542k9299j6223k0660j4747N509Q62l370m370j0668j3650L7479P33
8648B3672o539J0793J1266M080k297J9386j0007k506k1731j9181r546K4032n898
8635A5524j2830L994K7748N922Q994k1718l4589l689M8168L087K0256J2607K2938
8622I6412p973k0552m6039j996J9356j1220L567K8324J865k881j3609J0511l358
8609E2407J1729l1693j6724j7137L748L4996J2893R677m857j9360n844J6229R431
8596E5495R905L808j705o804k688K5523J9928j0945j2647O9J6175K5527J0631
$$ plain form
8687 20043 -2407 -21487 -22344 2620 29467 61434 56496 63970 27159 23168 36068 53986 14962
8674 14962 803 26638 31473 55892 62542 56059 36603 19230 50992 56876 49422 56685 76534
8661 76534 92076 62777 46554 25894 11147 16656 17518 14148 9778 -890 -14540 22939 23672
8648 23672 17133 27926 39192 43272 40975 60361 50354 47848 26117 6936 -2610 21422 15524
8635 15524 2694 6688 34436 40358 49352 27634 -6955 -10644 37524 40611 60867 73474 96412
8622 96412 88439 67887 21848 19852 39208 27988 31555 59879 61744 58863 45254 55765 52407
8609 52407 64136 32443 15719 -1418 2330 37326 50219 59896 55039 35679 29835 46064 55495
8596 55495 65400 69208 67503 60699 58011 83534 103462 92517 79870 79939 96114 121641 132272
8583A32272l523r425j4241j685p189k4221J1696P304k0536O02o252k1850J4620
8570E7572J1857k228r369R218j6566j1634j1922L4324K5889l0052j8271M382J2217
8557E5417J7565J4910k419k3164l5496j2766J3133j2147J2793M2276k370r393
8545E8339P690j3825K1933J9804k7329q902j5665l0551j3244K1705J4784n637
8533B9102m776K013j0897l0672j927N667R655M284K4255J4345k6148N406k1265
8520i58J7525M4139J6037k0239j4426J2029L840n879Q313J8408m08m1612j2413
8507B4356K523l9230j075J3310j119K2580K7187K1675k0507k4227N329J8676K4592
8494G4070J7894k773j2025J6514k780l4097k0709J655j7850n055K3164M866r926
$$ plain form
8583 132272 128749 119324 105083 103398 96209 71988 83684 90988 70452 71054 64802 42952 57572
8570 57572 69429 67201 57832 67050 50484 38850 26928 61252 87141 57089 38818 43200 55417
8557 55417 72982 87892 85473 62309 26813 14047 27180 15033 27826 70102 67732 58339
8545 58339 66029 52204 74137 93941 66612 57710 42045 11494 -1750 19955 34739 29102
8533 29102 24326 26339 15442 -15230 -17157 -11490 -1835 2449 26704 41049 14901 20307 -958
8520 -958 16567 60706 76743 56504 42078 54107 57947 52068 60381 78789 78381 36769 24356
8507 24356 26879 -12351 -13426 -116 -1235 21345 48532 70207 49700 25473 30802 49478 74070
8494 74070 91964 89191 77166 93680 90900 56803 36094 37749 19899 14844 38008 42874 32948
8481C2948r050N276K0500Q081l2559r452j7246k528K2550Q913J2008J0306O234
8468E5981O319k287J3783k1670k0594n957l1240j8980k630J8628J4760o00J6386
8455B1899L307K8873J3158j7597l4366L178J2146K916K2658K2085J0248p254j7751
8442F3500N209J0295k5438L1909%o391Q107k3859k754j0196j8966O887K710j3699
8428B7314K7230O552O171k0411K6625O916k6726j3091m525j5512p462j557R510
8415B1034r739J3542K6061L0506L0115r596n411l2424r737K6042K3490j7614j7084
8402F9185K1166R275J2907J1178J6845L9042p492j9854o8448n6342J4373J7299
8390E9134j5141N790n095l026J2188J1439J5781P198J6815j146q273o38k6880
$$ plain form
8481 32948 23898 29174 49674 57755 25196 15744 -1502 -4030 18520 27433 39441 49747 55981
8468 55981 62300 60013 73796 52126 31532 25575 -5665 -24645 -27275 -8647 6113 5513 21899
8455 21899 25206 54079 67237 49640 15274 18452 30598 33514 56172 78257 88505 81251 63500
8442 63500 68709 79004 53566 85475 85475 79084 87191 63332 60578 50382 31416 38303 41013 27314
8428 27314 54544 61096 67267 46856 73481 80397 53671 40580 36055 20543 13081 11524 21034
8415 21034 11295 24837 50898 81404 111519 101923 96512 64088 54351 80393 103883 86269 69185
8402 69185 90351 99626 112533 123711 140556 179598 172106 152252 83804 27462 41835 59134
8390 59134 43993 49783 44688 41662 53850 65289 81070 88268 105083 103937 95664 95026 68146
8377F8146l3023k9659J2140K0253O299j0114L990R826O561m051k8298l3465J8521
8364G126M1309L3195j2048R509N772j4851k113L4466N1429N1639L7384L6302j4493
8351B64626k3588n3842n5653k9916k3026r691L0965n985j6239k0245m286M974
8339E8094P058L79M24j3512k1758K1041Q447P153o066K71k5909N612P90j7687
8325B4337N032q021L958M074k0914K3242K5530J7342J3761N442K4062j174k1368
8312I5303j5466K2463L6519J6969J6929K5823q240l4078j3648P948j0043k5610
8300A14869l5880m172J2729L3139j3990j9400l775J6482K6506K2459L463j9964
8288A32466j3157j2307p460K5348J8452n1164k5105K5638J9429j8922k6301j8530
$$ plain form
8377 68146 35123 5464 17604 37857 44156 34042 38032 47858 54419 50368 22070 -11395 7126
8364 7126 48435 81630 69582 79091 84863 70012 67899 102365 153794 205433 242817 279119 264626
8351 264626 241038 187196 131543 101627 78601 68910 99875 93890 77651 57406 53120 58094
8339 58094 65152 65531 65955 52443 30685 51726 60173 67326 61260 61531 35622 41234 42024 24337
8325 24337 29369 21348 25306 29380 8466 31708 57238 74580 88341 93783 117845 116671 95303
8312 95303 79837 102300 138819 155788 172717 198540 190300 156222 142574 150522 140479 114869
8300 114869 78989 74817 87546 120685 106695 87295 83520 100002 126508 148967 152430 132466
8288 132466 119309 107002 99542 124890 143342 92178 67073 92711 112140 93218 66917 48387
8276D8387K9209J3072K725K6302R205j8552m5806J464p835K942J6915O889P455
8263I2372j5918n713M431j8878q114K9864L1347R770j0420k3545q770M1432L308
8250A21166l1880k9029R195L2614j2659P306j3498J3656L9926l227L897j6438
8238A21029j3936n522L068L977k9979p480K3061J151j9923l2119k4842q676k2412
8225a2603J9195L5399O434n028K3616J7219n1P971K1289k8700l455j742R784M4
8211H9372k9898q147j2729j1319J9070K8427O324j9484m3354k910K9599K1523
8199F6474L1278K4508o285K6623j8723m8394m644N026j9239N42J0636J0643J7294
8186I5739j5972j3028j1754J3553L2148R67j3132o105N651N279j7353k9397N773
$$ plain form
8276 48387 77596 90668 93393 119695 128900 110348 64542 66006 58171 61113 78028 84917 92372
8263 92372 76454 70741 75172 56294 48180 78044 109391 119161 108741 85196 76426 117858 121166
8250 121166 89286 60257 69452 102066 89407 96713 83215 96871 136797 133570 137467 121029
8238 121029 107093 101571 104639 108616 78637 71157 94218 95369 75446 43327 18485 9809 -12603
8225 -12603 6592 41991 48425 43397 67013 84232 84181 92152 113441 84741 81286 79544 89328 89372
8211 89372 59474 51327 38598 27279 46349 74776 81100 61616 18262 15352 44951 66474
8199 66474 97752 122260 115975 142598 123875 75481 70837 75863 56624 57166 67802 78445 95739
8186 95739 79767 66739 54985 68538 100686 101653 88521 82416 88067 93346 75993 46596 52369
8173E2369o55L617m754k4242j37K152o648m967L2199J3801j595p540m65J6391
8159F9526J2139j636j4241k3113K3914J8758Q264J226J5976m5746l6539Q291m018
8146C2801Q028j8269N58J7895j460n465K5052K6162L893l3405N64J5052J9242
8133I0648k0008j6063l067j575j6292o269K9634J4525o432j4084q166L29p7J3569
8119E6672k3447P151m221q107r54n514j758P082J2971N432k1244j4938O160L8326
8105E3611j165j1415j2476j5802M116j747k1176P538J4327o653O355j9555m79
8092d521j7681k1215N176L0864K5764J4778n552j8761n72m171M285K0146k7590
8079I50J9692K1850N402j2923J9898q136n2872j7779J5007j3737L6384N0409J8195
$$ plain form
8173 52369 51714 55331 50577 26335 26198 28350 21702 16735 48934 62735 61140 53600 53135 69526
8159 69526 81665 80029 65788 42675 66589 85347 93611 94837 110813 65067 28528 36819 32801
8146 32801 40829 22560 23118 41013 39553 34088 59140 85302 89195 55790 56354 71406 90648
8133 90648 70640 54577 51510 49935 33643 27374 57008 71533 65101 51017 42851 43180 43103 56672
8119 56672 33225 40376 36155 28048 27094 21580 19822 26904 39875 45307 24063 9125 15285 53611
8105 53611 52446 41031 28555 12753 16869 15122 -6054 1484 15811 9158 15513 -4042 -4521
8092 -4521 -22202 -43417 -38241 -7377 18387 33165 27613 8852 8280 4109 8394 28540 950
8079 950 20642 42492 47894 34971 54869 46733 -6139 -23918 -8911 -22648 13736 64145 82340
8066H2340K0246j5842k6070l0607p877j2231j2611J265J2551J7214N538k3492
8054A0424K3511j0049Q240k3447j3423K0420p116l3142m182L3849K2777j9264
8042H598q735o042P364L235K440R079o3P377j7318k2329K0262L0786J6833K076
8028E3563m1032j9466p751M5155n305j3390m071J4800j2313p864j2402p877N375
8015a2578K3817K5250n359k5093m0837o723K5834J3173r634n987L016Q413K0049
8002A3341M805K0999N853j1044M578J7374J9239m0523j7425K009L061k096Q841
7989B9012r276L667M32k605L900r960L7060J2010j3610n154k5848j5615K3589
7976B7602k441j3849l5169P020J3980J6166K986L1184j8353j0919j551J5236L6417
$$ plain form
8066 82340 102586 86744 60674 30067 22190 9959 -2652 -1387 11164 28378 33916 10424
8054 10424 33935 23886 32126 8679 -4744 15676 8560 -24582 -28764 5085 27862 8598
8042 8598 -137 -6179 1185 4420 6860 15939 15876 23253 5935 -16394 3868 34654 51487 53563
8028 53563 12531 -6935 -14686 30469 25164 11774 7703 22503 10190 2326 -10076 -17953 -12578
8015 -12578 11239 36489 31130 6037 -34800 -41523 -15689 -2516 -12150 -18137 -15121 -6708 13341
8002 13341 18146 39145 44998 33954 38532 55906 75145 34622 17197 19206 22267 20171 29012
7989 29012 19736 23403 23835 21230 25130 15170 52230 64240 50630 45476 19628 4013 27602
7976 27602 25161 11312 -23857 -16837 -2857 13309 16295 47479 29126 18207 16656 31892 68309
7963F8309l4971k5093R503R036k3212l4894R249N4029n304j9034j4132J1342J0366
7950A5194K0414q223Q451O886q305p558q050l518j370q715k1695J3171r73K9169
7936B4878M8235l2002J652K2681k1485m0050l4455n456n10K132n2J1421j1457
7923c4468n761J0440j1950J2139K7366j7301O066j2563K579q08J1550R21M6155
7910C4365J420j1849l2314k3232l154J7092J677J7460K2008J301M677j5395P409
7897B1465J3662L59j9670r117J2270m456n004R160q239M305n969j5017j6011K2255
7883gk0508k2304M1672K5847N788P389o683M649k277j5811o570r649q519M751
7869b232K1720K9972j4223m4377j1384j7201o19L5808J9691j0425O766p200R922
$$ plain form
7963 68309 33338 8245 17748 26784 3572 -31322 -22073 31956 26652 7618 -6514 4828 15194
7950 15194 35608 27385 35836 42722 34417 26859 18809 15291 13921 5206 -16489 -3318 -4291 24878
7936 24878 73113 41111 42763 65444 43959 3909 -30546 -36002 -36512 -34380 -34432 -23011 -34468
7923 -34468 -40229 -29789 -41739 -29600 -2234 -19535 -13469 -26032 -23453 -24261 -12711 -11790 34365
7910 34365 35785 23936 -8378 -31610 -34764 -17672 -15995 1465 23473 24774 29451 14056 21465
7897 21465 35127 35486 15816 6699 18969 14513 9509 18669 10430 14735 8766 -6251 -22262 -7
7883 -7 -20515 -42819 -1147 24700 30488 37877 31194 35843 33566 17755 11185 1536 -6983 -2232
7869 -2232 19488 49460 35237 -9140 -20524 -37725 -38344 -2536 17155 6730 13496 6296 16218
7856A6218L8415k5096j0994K563m919n472K5061L751l6561l478L0849O57j5786
7843A5208j8902N601K8j7386L5563O573J1154p403k1672n7868j1380L9068j3949
7830c5365l657n626J311K0892L2647R567j6079J2634q660m205J0238j0267j0363
7817f933Q949L83j1666m671O213K9309k1760j7148K836J0513K6825K4772n240
7804D2382j0709k6913J618Q611k738l301j8826j2252J5012Q503q698J7171R196
7791A9056j6742J457J4954Q773L592R441o503o845J548j9919q570K325J0918J1614
7777B5099K125n963J391l648J4766k852m270N868p825r76J4366J1083n940j8005
7763B5219N2m450k1172k3090M495Q714O735n262K5178J5085r733j2010r54l118
$$ plain form
7856 16218 54633 29537 18543 21106 16187 10715 35776 39527 2966 -512 30337 30994 15208
7843 15208 -3694 1907 1935 -15451 20112 26685 37839 30436 8764 -49104 -60484 -21416 -35365
7830 -35365 -39022 -44648 -43337 -22445 10202 19769 3690 16324 7664 3459 13697 3430 -6933
7817 -6933 2016 2399 -9267 -13938 -7725 21584 -176 -17324 -14488 -3975 22850 47622 42382
7804 42382 31673 4760 6378 14989 12251 8950 -9876 -22128 -7116 1387 -7311 9860 19056
7791 19056 2314 3771 18725 27498 31090 40531 34028 27183 28731 8812 242 2567 13485 25099
7777 25099 27224 21261 22652 19004 33770 30918 26648 32516 24691 23715 38081 49164 43224 25219
7763 25219 25271 20821 -351 -23441 -18946 -10232 -3497 -8759 16419 31504 21771 9761 8807 5689
7749E689n326K3675O39j1760J3116k4763J9944L6156j2661L124k3700l5774J496
7736a0145J4893k5069k0276k232J8133K6209J9937J7645J0212j7466N325k959
7724C4207J1484K34m836K45P17N064k0326j9023R690K1480Q09l8102l2293J1136
7710a9514P990J6901j3089j9401J9369M057l018p60m495K4552K9307J4207k420
7697E3686j1421j0648l0930l3388J33K0899k383j9358R449K0527r07j0017R797
7684d561L8964L5868j7110l1314K47K2488j5830k0351k7230r590J7790J3562k3840
7671b0907j4479J6926J7716J0987o069o314K918k7588M819J6290k1553K4850M6799
7658D4395K386j8204j5296J8962j1956J0692K421N944K6753k055l8361j9919L737
$$ plain form
7749 5689 363 24038 24677 12917 26033 1270 21214 57370 44709 47833 24133 -11641 -10145
7736 -10145 4748 -20321 -40597 -42829 -24696 1513 21450 39095 49307 31841 37166 34207
7724 34207 45691 45925 41089 41334 42051 47115 26789 7766 17456 38936 39745 1643 -30650 -19514
7710 -19514 -11524 5377 -7712 -27113 -7744 -3687 -6705 -7465 -11960 12592 41899 56106 53686
7697 53686 42265 31617 687 -32701 -32568 -11669 -14052 -33410 -23961 -3434 -4341 -14358 -4561
7684 -4561 34403 70271 53161 21847 22094 44582 28752 8401 -18829 -28419 -10629 2933 -20907
7671 -20907 -35386 -18460 -744 10243 4174 -2140 778 -26810 -21991 -5701 -27254 -2404 44395
7658 44395 46781 28577 13281 32243 20287 30979 33400 39344 66097 64042 25681 5762 9499
7645I499q628j1661J5287K1219q413m6981l044J9141r359k143K6625o782K2330
7632A7090J394k380J3592k2819k4763N881o722j319K6727K5639N606o070j2409
7619A9447Q875K6294j4070J3597l2206k5547k3746J0667J2389K134K6532q613
7607A5753q120J7797O524k4901r657j089L2217L190K471k1892k4803P624R158
7594D272o341j530k6223K9708J6565k725R743o903j9248j9320K157L209j1652
7581b8288m3731K8293N079J8984J4524N589k8410J0193J5900P670N85p751J7093
7568A5730R809j8173o880n560K237q985O818P458N828J4124n114j7482n658j2287
7554a8135j952L7060M8075K6539k6312m1704j2244J2808j8446j0069j68j3513
$$ plain form
7645 9499 871 -10790 4497 25716 17303 -29678 -32722 -13581 -22940 -25083 1542 -5240 17090
7632 17090 18484 16104 29696 6877 -17886 -12005 -18727 -20046 6681 32320 37926 31856 19447
7619 19447 28322 54616 40546 54143 21937 -3610 -27356 -16689 -4300 -2166 24366 15753
7607 15753 7633 25430 31954 7053 -2604 -3693 28524 31714 34185 12293 -12510 -4886 4272
7594 4272 -2069 -3599 -29822 -114 16451 13726 23469 16566 -2682 -22002 -19845 -16636 -28288
7581 -28288 -72019 -43726 -38647 -19663 -5139 450 -27960 -17767 -1867 5803 6388 -1363 15730
7568 15730 25539 7366 486 -5074 -2837 -11822 -5004 2454 8282 22406 17292 -190 -5848 -18135
7554 -18135 -20087 16973 65048 91587 65275 23571 11327 24135 5689 -4380 -4548 -18061
7542a8061J3424O063l6208M39K7936Q03k9346l700K2886k746o437K0939J0293
7529F285P430j7563O915J4449k0126j1879J16m571K3651M549m288J3053J68l613
7515A4576K4504M943k3336k5537j9736n832L0318J4683j1444o370L236o160J865
7502d290L6154j6324O807K7797l038o38n308l8758J770n835j5873N746J3913k0883
7488a8760j6066L512L458P065M873K9295j089r94r278m635J2915m34j6302k6590
7474c3030Q059K4771J2740j6304J4323j7146l2140l019O469l27K7316p81k672
7461a1741K1447K1102L594l0259k2313l232K8367J6682J3885l0874r351L2872
7449C0179k341j3286j596Q8k7403m472K3544J2281J0520q033p835j7972j9164
$$ plain form
7542 -18061 -4637 1426 -34782 -34343 -6407 -5604 -34950 -38650 -15764 -18510 -24947 -4008 6285
7529 6285 13715 -3848 3067 17516 -2610 -14489 -14373 -18944 4707 9256 4968 18021 18189 14576
7515 14576 39080 44023 20687 -4850 -24586 -30418 -100 14583 3139 -3231 5 -6155 -4290
7502 -4290 31864 15540 22347 50144 47106 46468 41160 2402 4172 -1663 -17536 -11790 2123 -18760
7488 -18760 -34826 -31314 -27856 -20791 -15918 13377 12288 11294 2016 -2619 10296 9862 -6440 -33030
7474 -33030 -24971 -200 12540 -3764 10559 -6587 -38727 -41746 -35277 -35604 -8288 -9069 -11741
7461 -11741 9706 30808 34402 4143 -18170 -21402 6965 23647 37532 6658 -2693 30179
7449 30179 27838 14552 12956 13044 -14359 -18831 4713 16994 27514 19481 11646 -6326 -25490
7436b5490J4320N288O301l240k0691O010l57l0198K9245M6083L433j6333j4549
7423a78J348l967M968K2911l7060j2126k2908P345K3911q869n413q639R057K0001
7409i619K6030L339l2965k7675Q724l371J1244j086r986L034l481j317J5105q375
7395c0399j8729J1420M66o886j5066m706L789K4367J2843K2598q341P442K2846
7382B1644K6719K611l9548m612L741k4460k824n834l612o507R02K0711j1044K1698
7368d15K8353P53l6468m0184j4190j4602J4227P007p320J9132L5138P756k7158
7355b7971K7547M4020J892k0480l4749n514q088J7544J2306K98k0205M46k0161
7342c3115l0895j089N548J7617K005k3007k87J2274j0210M3500Q451p058k1742
$$ plain form
7436 -25490 -11170 -5882 419 -2821 -23512 -17502 -17859 -48057 -18812 27271 30704 14371 -178
7423 -178 1170 -2797 2171 25082 -11978 -24104 -47012 -39667 -15756 -24625 -30038 -38677 -29620 -9619
7409 -9619 16411 19750 -13215 -40890 -32166 -35537 -24293 -25379 -35365 -32331 -35812 -37129 -22024 -30399
7395 -30399 -49128 -37708 -37242 -44128 -59194 -63900 -60111 -35744 -22901 -303 -8644 -1202 21644
7382 21644 48363 50974 11426 6814 10555 -13905 -16729 -22563 -26175 -32682 -31780 -11069 -22113 -415
7368 -415 27938 28691 -7777 -47961 -62151 -76753 -62526 -55519 -62839 -43707 -8569 -813 -27971
7355 -27971 -424 43596 45488 25008 -9741 -15255 -23343 -5799 6507 6805 -13400 -12954 -33115
7342 -33115 -64010 -65099 -59551 -41934 -39929 -62936 -63223 -50949 -61159 -17659 -9208 -16266 -38008
7329c8008j6208o58J5422R055m054j6890J185q198Q366j892J7732J7076Q859p275
7315a5488j3335Q022l714r722M0288K1854k9063n5862m047K6896l990q229K1335
7302b5055K4072N588k337r109N425l393P88j947o18k3681K3728J5147l3265l0588
7288e5245O630J2624L2864K447k7426Q596L7563p206r756j742j3405l1606J3682
7275c1980L0299J3761K907r80r657l522k2591M048J8281J3848j2738O31l707J152
7261b48q510l5565k5083J5715K0758K2927J3348n152k044m45K7000o979m55O596
7247B1863K317m262m066j5365j6883o612K950J670K218J1030k5012J1708J380
7234a7064j8784j6309N545J1111K8814J5134K747o738L463j0771m376j7654O320
$$ plain form
7329 -38008 -54216 -54874 -39452 -30397 -34451 -51341 -50156 -58354 -49988 -51880 -34148 -17072 -8213 -15488
7315 -15488 -28823 -20801 -24515 -34237 6051 27905 -1158 -57020 -61067 -34171 -38161 -46390 -25055
7302 -25055 -983 4605 2268 -6841 -1416 -4809 -4021 -5968 -6586 -30267 -6539 8608 -24657 -55245
7288 -55245 -48615 -35991 -3127 -680 -28106 -19510 18053 10847 1091 -651 -14056 -45662 -31980
7275 -31980 -1681 12080 14987 14007 4350 828 -21763 -17715 566 14414 1676 2307 -1400 -248
7261 -248 -8758 -44323 -69406 -53691 -32933 -10006 3342 -1810 -3854 -4299 22701 15722 15267 21863
7247 21863 24180 19918 15852 487 -16396 -23008 -20058 -18388 -16170 -5140 -30152 -18444 -17064
7234 -17064 -35848 -52157 -46612 -35501 -6687 8447 11194 4456 7919 -2852 -7228 -24882 -18562
7221a8562j0277K240M296J5383j2778l5723J5196j8337P47L1179K6897J1054J2511
7208B3826l76P31j4747J6447j813k0255j3721J8134K0789l2949j8114Q54m637
7195b5831j1861K7089J4976J2153q629m4745j6758m366K156N792K3645M6036J3281
7182C2938k0833m0880j596j2869K3977L0904P169J1859k0107j6045R868l9478
7170c5093k2374J0292R019J1631K7677J9990l8391l4538J0536Q537L9729K8291
7158C5306P840k5727j5254j0019m296J4621J7522j2413j9988n045k2531j3316
7146e3300j093Q264j0288o112K6100K7831j896J1293K9893k2281k5938J9650Q690
7133A0813r948l282l418q531J0859k063r054r865M0958n423l5506R920R541j509
$$ plain form
7221 -18562 -28839 -26599 -22303 -6920 -19698 -55421 -40225 -58562 -57815 -26636 261 11315 23826
7208 23826 23450 24181 9434 25881 24068 3813 -9908 8226 29015 -3934 -22048 -21194 -25831
7195 -25831 -37692 -10603 4373 16526 7897 -36848 -53606 -57972 -55816 -50024 -26379 19657 32938
7182 32938 12105 -28775 -30371 -43240 -19263 11641 18810 30669 10562 -5483 4385 -35093
7170 -35093 -57467 -47175 -38156 -26525 1152 21142 -17249 -51787 -41251 -32714 7015 35306
7158 35306 43146 17419 2165 -7854 -12150 2471 19993 7580 -12408 -17453 -39984 -53300
7146 -53300 -54393 -46129 -56417 -62529 -36429 -8598 -10494 799 30692 8411 -17527 2123 10813
7133 10813 865 -2417 -5835 -14366 -3507 -5570 -14624 -24489 16469 11046 -24460 -14540 -4999 -6508
7119f508J1160j8163j562J0139J1891n432K261k2500j1294j2242L983o86K1417
7106a7536R875j2484j085K1036k5538n982K8880K0378J2374n542j3247j542k138
7093G449m816J8926M123k7234j0346J8005J0699k2424o595k8815n0484K8232J7639
7080d5641J2778k2982k2341m287L5670L5549k1263k4722J142K3454J7186r600
7068b5057j1918J7748L205O629J8089J9176k4630l3225q221K506J48J4766r131
7055b9915J2682M5951J5132j0754k1913l0368J4549j2472m008J049J0873n254
7043a4448j1222J6067j2480m2937r805N3559j7574j8092r763J5589J5116O447
7031b9543M597k0259k391M4871J9848o692j7379K525k0524L677p48L8005J289
$$ plain form
7119 -6508 4652 -13511 -15073 -4934 6957 1525 3786 -18714 -30008 -42250 -38267 -38953 -17536
7106 -17536 -7661 -20145 -21230 -194 -25732 -31714 -2834 17544 29918 24376 11129 9587 7449
7093 7449 2633 21559 25682 -1552 -11898 6107 16806 -5618 -12213 -41028 -91512 -63280 -45641
7080 -45641 -32863 -55845 -78186 -82473 -46803 -11254 -32517 -57239 -56097 -32643 -15457 -25057
7068 -25057 -36975 -19227 -16022 -9393 8696 27872 3242 -29983 -38204 -35698 -35550 -20784 -29915
7055 -29915 -17233 28718 43850 33096 11183 -19185 -4636 -17108 -21116 -20067 -9194 -14448
7043 -14448 -25670 -9603 -22083 -65020 -74825 -21266 -38840 -56932 -66695 -51106 -35990 -29543
7031 -29543 -24946 -45205 -47596 -2725 17123 10431 -6948 -4423 -24947 -21270 -22018 15987 17276
7018A7276K627k7010K7297P440J1423j428l2962j0852j455j5451n576J3984J9976
7005E289l1665J9070N0791m732m806l751n6305K618J0090N31P729k209K684j7498
6991b2164J10q786o041J4769J2363m2073r764K7629L5474K9855N032k8425k5620
6978a7641J1677J4408o990R418n2Q533J259r213j0242R09K4038L702k7434j9714
6964a7342M866R435j7130k1012J1143J6555m277j8582n157J1684J8756j6358P391
6951b0028L2191J0630o863j1145j7550m084J1667N527j0235j3891l267N654L830
6938a7564J5826K5320j7693n3438K302L5530J6914Q170K3016j385o242m6912k5903
6925d2059k0220j0434r449J1698L3956K4520J6095K2462K1734j8830P476k947
$$ plain form
7018 17276 19903 -7107 20190 27630 39053 37625 4663 -6189 -7644 -23095 -28671 -14687 5289
7005 5289 -26376 -7306 43485 38753 33947 30196 -26109 -23491 -13401 -12870 -5141 -7350 -4666 -22164
6991 -22164 -22054 -30840 -36881 -22112 -9749 -51822 -61586 -33957 1517 31372 36404 7979 -17641
6978 -17641 -5964 8444 1454 10872 10820 19353 20612 11399 1157 2066 26104 29806 2372 -17342
6964 -17342 -12476 -3041 -20171 -41183 -30040 -13485 -17762 -36344 -41501 -29817 -11061 -27419 -20028
6951 -20028 12163 22793 15930 4785 -12765 -16849 -5182 345 -9890 -23781 -27048 -21394 -17564
6938 -17564 -1738 23582 5889 -47549 -45247 -9717 7197 15367 38383 36998 30756 -16156 -42059
6925 -42059 -62279 -72713 -82162 -70464 -36508 -11988 4107 26569 48303 29473 36949 34002
6913C4002r328j7019l3953j8782K87Q969j3227m910M822n535k933N281J8489m531
6899c8368j751K3171k548J969K8626R734L428j3509k8646k2038Q707J7573k9399
6886d3051M821M2155n48j6598m605j1389k7071k0663N066L2772K3373L0142R268
6873B3672k3136l5649j2531o887l33n250j2238N750M0498O983R748K575l144r513
6859a9455p426k0622J4554J8264J2076K8039L063j3167J733K5477K1244r662j4895
6846C9223J0888m5350j3156k027O157J2366J6078j128j3150K0292J938m013m2708
6833a4590m9838J2326m178j5345Q943M9379L2936j9699n067M38R586l395k5077
6820b3581j7062J5904K7066j1686l2903j1499K5030L2261J680K1597j6389l6605
$$ plain form
6913 34002 24674 7655 -26298 -45080 -44793 -35824 -49051 -53961 -49139 -54674 -57607 -52326 -33837 -38368
6899 -38368 -40119 -16948 -19496 -17527 11099 20833 24261 10752 -17894 -39932 -31225 -13652 -43051
6886 -43051 -38230 3925 3377 -13221 -17826 -29215 -56286 -76949 -71883 -39111 -15738 14404 23672
6873 23672 536 -35113 -47644 -54531 -54864 -60114 -72352 -66602 -26104 -19121 -9373 -6798 -9942 -19455
6859 -19455 -26881 -47503 -32949 -14685 -2609 25430 28493 15326 17059 42536 63780 54118 39223
6846 39223 50111 4761 -8395 -10422 -4265 8101 24179 23051 9901 30193 32131 28118 -14590
6833 -14590 -64428 -52102 -56280 -71625 -62682 -13303 19633 -66 -5133 -4695 4891 1496 -23581
6820 -23581 -40643 -24739 2327 -9359 -42262 -53761 -28731 3530 5210 26807 10418 -26187
6808b6187n805K1887P234j7675L290m061k6895n846J4047j2191J5029M933k4683
6795e6923K0042K1053N505j6413J4652l822r88J1452j3424k931p967l51K8517
6782a598K2533J0489O595j1425j9294j2673M902j2400l707n824n461j0514k562
6769d0939O428L2833K5639K0458m058j0200j3827M281K0532J4084j131k184j6835
6756C5081N957J825j9798k2578j4189J3596n889n825Q125L860N320o321K5187
6743B4351L883l5335j9892j8010K6810J0458r559K0484L0013J4109n078q435l2419
6730A380L828N216J359l954r369j0201K2606J9548j3127n47J1076j7821K409J9263
6716C1666J7976l991j5570K0023m128o177j5091l328K2865m362K838J472o556
$$ plain form
6808 -26187 -31992 -10105 -2871 -20546 -17256 -21317 -48212 -54058 -40011 -52202 -37173 -32240 -56923
6795 -56923 -36881 -15828 -10323 -26736 -12084 -15906 -16894 -5442 -18866 -21797 -29764 -30115 -1598
6782 -1598 20935 31424 38019 26594 7300 -5373 -471 -12871 -16578 -22402 -27863 -38377 -40939
6769 -40939 -34511 -1678 23961 44419 40361 30161 16334 20615 41147 55231 54100 51916 35081
6756 35081 41038 42863 23065 487 -13702 -106 -5995 -11820 -3695 165 5485 -836 24351
6743 24351 28234 -7101 -26993 -45003 -18193 -7735 -17294 3190 33203 47312 42234 33799 1380
6730 1380 5208 10424 11783 7829 -1540 -11741 10865 30413 17286 16739 27815 9994 12403 31666
6716 31666 49642 45651 30081 50104 45976 39799 24708 21380 44245 39883 42721 44193 37637
6703C7637j5732j9467j7466J0773q814j0076J8057k344l348J2005j3926k5909
6691c8610r752J259N5189K1677j18P197K2342K8867j1222l0188m2389j9487O171
6678i064p894j8518M317M509R501J7027k789k0102l107q171L378Q156J8516P79
6664c462p671j6075p174q82J3643K8361k3311l5733K623K4555L2202K288l2750
6651b3386J1683j1176K1814q847r452O371j8725j3126j411K2326L4135j2099p306
6638i199J364p998O262J5499J4560J2589j0423p128l2790J3959J9284K134N090
6625B3203k7139j3359J6899j4535N143R392J7202J2449p188p254j063n905j5681
6612g836j1837J094J7310k577R913L333k3390j7328J9508O890q643q088k0007
$$ plain form
6703 37637 21905 2438 -15028 -4255 -13069 -23145 -5088 -7432 -10780 1225 -12701 -38610
6691 -38610 -48362 -47103 8086 29763 29645 36842 59184 88051 76829 46641 4252 -15235 -9064
6678 -9064 -16958 -35476 -31159 -26650 -17149 -122 -2911 -23013 -26120 -34291 -30913 -22757 -4241 -3462
6664 -3462 -11133 -27208 -34382 -35264 -21621 6740 -16571 -52304 -49681 -25126 7076 9364 -23386
6651 -23386 -11703 -22879 -1065 -9912 -19364 -12993 -31718 -44844 -46255 -23929 10206 -1893 -9199
6638 -9199 -7835 -15833 -9571 5928 20488 33077 22654 15526 -17264 -3305 15979 18113 23203
6625 23203 -3936 -17295 -396 -14931 -9788 -396 16806 29255 22067 14813 13750 7845 -7836
6612 -7836 -19673 -18579 -1269 -3846 6067 9400 -13990 -31318 -11810 -4920 -13563 -21651 -41658
$$ [...]
##END NTUPLES=NMR SPECTRUM
##END=
