##TITLE=Analysis number 328871
Compound Code spb 08399
Project Code adrs
Chemist Name fudan
##JCAMPDX= 6.0         $$ Bruker NMR JCAMP-DX V2.0
##DATA TYPE= NMR SPECTRUM
##DATA CLASS= NTUPLES
##ORIGIN= Bruker BioSpin GmbH
##OWNER= nmr
$$ XWIN-NMR		Version 3.5
$$ Wed Jul 11 12:28:16 2007 GMT Daylight Time (UT+1h)  MAYBRIDGE\nmr@NMR_250MHZ
##.OBSERVE FREQUENCY= 250.131544655141
##.OBSERVE NUCLEUS= ^1H
##.ACQUISITION MODE= SIMULTANEOUS (DQD)
##.ACQUISITION SCHEME= undefined
##.AVERAGES= 16
##.DIGITISER RES= 18
##SPECTROMETER/DATA SYSTEM= dpx250
##.PULSE SEQUENCE= zg30
##.SOLVENT NAME= CDCl3
##.SHIFT REFERENCE= (INTERNAL, CDCl3, 0, 16.522)
##AUDIT TRAIL= $$ (NUMBER, WHEN, WHO, WHERE, WHAT)
$$ ##TITLE= Audit trail, XWIN-NMR		Version 3.5
$$ ##JCAMPDX= 5.01
$$ ##ORIGIN= Bruker BioSpin GmbH
$$ ##OWNER= nmr
$$ C:\u/data/dgb/nmr/ADRS/810/pdata/1/auditp.txt
$$ ##AUDIT TRAIL=  $$ (NUMBER, WHEN, WHO, WHERE, WHAT)
(   1,<2007-07-11 12:27:55.33 +100>,<MAYBRIDGE\nmr>,<NMR_250MHZ>,
      <created by zg, POWCHK disabled, PULCHK disabled
       configuration hash MD5:
       76 6E 9A 78 1E 09 19 81 EC 84 63 8F B0 6A 59 2D
       data hash MD5: 64K
       61 AA 2A DA 6C E8 07 0F 25 10 58 43 6D 3A E3 C1>)
(   2,<2007-07-11 12:28:07.22 +100>,<MAYBRIDGE\nmr>,<NMR_250MHZ>,
      <Start of raw data processing
       ef LB = 0.3 FT_mod = 6 PKNL = 1 SI = 32K 
       data hash MD5: 32K
       86 E7 C8 CD 64 8C E1 48 09 7E 6E D5 B9 B8 39 C0>)
(   3,<2007-07-11 12:28:09.25 +100>,<MAYBRIDGE\nmr>,<NMR_250MHZ>,
      <apk 
       data hash MD5: 32K
       15 45 EA CD 50 46 94 46 81 B2 A0 44 FD 84 0D 1C>)
(   4,<2007-07-11 12:28:10.01 +100>,<MAYBRIDGE\nmr>,<NMR_250MHZ>,
      <abs ABSG = 5 
       data hash MD5: 32K
       9D 46 12 8D E4 56 AD 1A 82 D3 4E 61 4D 16 BA BD>)
$$ ##END=
$$ 
$$ hash MD5
$$ DD C3 75 EE 5B 44 45 B1 F1 BE 05 FA AE 4A B4 70
##$RELAX= 
##$RELAX= 
##$RELAX= 
##$RELAX= 
##$RELAX= 
##$RELAX= 
##$RELAX= 
$$ Bruker specific parameters
$$ --------------------------
##$DU= <C:\u>
##$EXPNO= 810
##$NAME= <ADRS>
##$PROCNO= 1
##$TYPE= <nmr>
##$USER= <dgb>
##$AMP= (0..31)
100 100 100 100 100 100 100 100 100 100 100 100 100 100 100 100 100 100 
100 100 100 100 100 100 100 100 100 100 100 100 100 100 
##$AQSEQ= 0
##$AQ_mod= 3
##$AUNM= <au_zg>
##$AUTOPOS= <23 >
##$BF1= 250.13
##$BF2= 250.13
##$BF3= 250.13
##$BF4= 250.13
##$BF5= 500.13
##$BF6= 500.13
##$BF7= 500.13
##$BF8= 500.13
##$BYTORDA= 1
##$CFDGTYP= 0
##$CFRGTYP= 5
##$CHEMSTR= <none>
##$CNST= (0..31)
1 1 145 1 1 1 1 1 1 1 1 1 1 1 1 1 1 1 1 1 1 1 1 1 1 1 1 1 1 1 1 1 
##$CPDPRG= <>
##$CPDPRG1= <>
##$CPDPRG2= <>
##$CPDPRG3= <>
##$CPDPRG4= <mlev>
##$CPDPRG5= <mlev>
##$CPDPRG6= <mlev>
##$CPDPRG7= <mlev>
##$CPDPRG8= <mlev>
##$CPDPRGB= <>
##$CPDPRGT= <>
##$D= (0..31)
0 1 0 0 0 0 0 0 0 0.06 0 0 0 0 0 0 0.0002 0 0 0 0 0 0 0 0 0 0 0 0 0 0 
0 
##$DATE= 1184153274
##$DBL= (0..7)
120 120 120 120 120 120 120 120 
##$DBP= (0..7)
150 150 150 150 150 150 150 150 
##$DBP07= 0
##$DBPNAM0= <>
##$DBPNAM1= <>
##$DBPNAM2= <>
##$DBPNAM3= <>
$$ [...]
##$SUBNAM7= <"">
##$SUBNAM8= <"">
##$SUBNAM9= <"">
##$SW= 20.6930455092707
##$SWIBOX= (0..15)
0 0 3 0 0 0 0 0 0 0 0 0 0 0 0 0 
##$SW_h= 5175.983436853
##$TD= 65536
##$TD0= 1
##$TE= 296.16
##$TE2= 300
##$TE3= 300
##$TEG= 300
##$TL= (0..7)
0 120 120 120 120 120 120 120 
##$TP= (0..7)
150 150 150 150 150 150 150 150 
##$TP07= 0
##$TPNAME0= <>
##$TPNAME1= <>
##$TPNAME2= <>
##$TPNAME3= <>
##$TPNAME4= <>
##$TPNAME5= <>
##$TPNAME6= <>
##$TPNAME7= <>
##$TPOAL= (0..7)
0.5 0.5 0.5 0.5 0.5 0.5 0.5 0.5 
##$TPOFFS= (0..7)
0 0 0 0 0 0 0 0 
##$TUNHIN= 0
##$TUNHOUT= 0
##$TUNXOUT= 0
##$USERA1= <user>
##$USERA2= <user>
##$USERA3= <user>
##$USERA4= <user>
##$USERA5= <user>
##$V9= 5
##$VALIST= <valist>
##$VCLIST= <CCCCCCCCCCCCCCC>
##$VD= 0
##$VDLIST= <DDDDDDDDDDDDDDD>
##$VPLIST= <PPPPPPPPPPPPPPP>
##$VTLIST= <TTTTTTTTTTTTTTT>
##$WBST= 1024
##$WBSW= 4
##$XGAIN= (0..3)
0 0 0 0 
##$XL= 0
##$YL= 0
##$YMAX_a= 427368
##$YMIN_a= -450841
##$ZGOPTNS= <>
##$ZL1= 120
##$ZL2= 120
##$ZL3= 120
##$ZL4= 120
##$ABSF1= 16.522
##$ABSF2= -4.171173
##$ABSG= 5
##$ABSL= 3
##$ALPHA= 0
##$AQORDER= 0
##$ASSFAC= 0
##$ASSFACI= 0
##$ASSFACX= 0
##$ASSWID= 0
##$AUNMP= <proc_1d>
##$AZFE= 0.1
##$AZFW= 0.1
##$BCFW= 0
##$BC_mod= 0
##$BYTORDP= 0
##$COROFFS= 0
##$CY= 12.5
##$DATMOD= 1
##$DC= 0
##$DFILT= <>
##$DTYPP= 0
##$F1P= 14.0000005364418
##$F2P= -0.99999901652339
##$FCOR= 0.5
##$FTSIZE= 32768
##$FT_mod= 6
##$GAMMA= 0
##$GB= 0
##$INTBC= 1
##$INTSCL= 1
##$ISEN= 128
##$LB= 0.3
##$LEV0= 0
##$LPBIN= 0
##$MAXI= 10000
##$MC2= 0
##$MEAN= 0
##$ME_mod= 0
##$MI= 0
##$NCOEF= 0
##$NC_proc= -3
##$NLEV= 6
##$NOISF1= 0
##$NOISF2= 0
##$NSP= 0
##$NTH_PI= 0
##$NZP= 0
##$OFFSET= 16.522
##$PC= 1
##$PHC0= 149.0849
##$PHC1= 14.80573
##$PH_mod= 1
##$PKNL= yes
##$PPARMOD= 0
##$PSCAL= 4
##$PSIGN= 0
##$REVERSE= no
##$SF= 250.13
##$SI= 32768
##$SIGF1= 0
##$SIGF2= 0
##$SINO= 400
##$SIOLD= 32768
##$SREGLST= <1H.CDCl3>
##$SSB= 0
##$STSI= 32768
##$STSR= 0
##$SW_p= 5175.98343685301
##$SYMM= 0
##$S_DEV= 0
##$TDeff= 65536
##$TDoff= 0
##$TI= <Analysis number 999999
Compound Code 99
Book Reference 9
Project Code 9>
##$TILT= no
##$TM1= 0
##$TM2= 0
##$TOPLEV= 0
##$USERP1= <user>
##$USERP2= <user>
##$USERP3= <user>
##$USERP4= <user>
##$USERP5= <user>
##$WDW= 1
##$XDIM= 32768
##$YMAX_p= 463158272
##$YMIN_p= -28457
$$ End of Bruker specific parameters
$$ ---------------------------------
##NTUPLES= NMR SPECTRUM
##VAR_NAME=  FREQUENCY,     SPECTRUM/REAL,   SPECTRUM/IMAG
##SYMBOL=    X,             R,               I
##VAR_TYPE=  INDEPENDENT,   DEPENDENT,       DEPENDENT
##VAR_FORM=  AFFN,          ASDF,            ASDF
##VAR_DIM=   32768,         32768,           32768
##UNITS=     HZ,            ARBITRARY UNITS, ARBITRARY UNITS
##FACTOR=    0.157963299565203, 1,           1
##FIRST=     4132.6476996994, 0,             0
##LAST=      -1043.33573715361, 0,           0
##MIN=       -1043.33573715361, -28457,      0
##MAX=       4132.6476996994, 463158272,     0
$$ Real data points
##PAGE= N=1
##DATA TABLE= (X++(R..R)), XYDATA
$$ [...]
15195G0068J938j273q59Pk767M019K141l52l508O25L259J65j100K573l000l301
15179F8635J012M318J312j122n169j111R01L935J148K24j76N953M380J205m512
15164H0933P09K937l518j916L064m24M085L30l767k684j965J750J654M302k939
15149H2551k318J881r87j950J66N781K842J65L072L885o26l233j176n05Q54r43
15133H9459J596J330j196r0j104J443O46m638j028L745N24p17J736M066o78K373
15117I7467R57L785K621j830k87l200j046o23J716O806J103K85j304r64m456k939
15101I8091K125M351M423p22J443n27J668L43K57L920m297m824J793N757L769
15086A17570L259L936K529J718K567K751P81M47J448J775P00K719j62m294Q19
$$ y = [70068, 72006, 70733, 69874, 69881, 67114, 71133, 73274, 72922, 69414, 70039, 73298, 73463, 72363, 74936, 71936, 68635, 69647, 73965, 75277, 74155, 68986, 67875, 68776, 72711, 73859, 74083, 73907, 79860, 84240, 85445, 80933, 81642, 84579, 81061, 79145, 82209, 81785, 85870, 86200, 82433, 79749, 77784, 79534, 81188, 85490, 82551, 80233, 82114, 81127, 79177, 79343, 85124, 87966, 88131, 91203, 95088, 94462, 91229, 90053, 89548, 90402, 89459, 91055, 92385, 91189, 91099, 89995, 91438, 92084, 87446, 86418, 90163, 90687, 89970, 91706, 95772, 95094, 97467, 98424, 102209, 104830, 103000, 102713, 99513, 98467, 97844, 99560, 106366, 107469, 107754, 106450, 105486, 101030, 98091, 100216, 104567, 108990, 108268, 109711, 109184, 110852, 111195, 111452, 115372, 111075, 106251, 108044, 113801, 117570, 120829, 124765, 127294, 129012, 131579, 134330, 135111, 135558, 137006, 138781, 139481, 142200, 142038, 137744, 138563]
15071A38563m36P50j417k019K998K783N518j70j742J236M77J407n870L46M214
15056A46638k9O403M785l927L18o43N12p92j281M704O273J652M994M538K254L525
15040A79924J135P59L387K259K921j47J283k13j325j162k542j979K139j077K30
15025A85592J563L343L988n46m586J568k405j478P481L210J305J503K889l472
15011A99955p10O69K803L139N640O022M415K919K12P98M94J383j745k72N848M518
14995B36088J822l262J720o90j415k958n818L417N005M586R270O144L932K75L264
14980B61380O39j629N77N011N968L012L992O626M602J232O953J2673J0852J2757
14966C34645J8103K1756K3916L5780N0404Q7125J61302L01524N25291P12255L75309
$$ y = [138563, 138127, 138877, 137460, 135441, 138439, 141222, 146740, 146570, 144828, 146064, 146541, 147948, 142078, 142424, 146638, 146609, 153012, 157797, 153870, 154188, 153545, 154057, 153265, 151984, 156688, 162961, 164613, 169607, 174145, 176399, 179924, 181059, 181818, 185205, 187464, 190385, 190238, 191521, 191308, 189983, 188821, 186279, 184300, 186439, 185362, 185592, 187155, 190498, 194486, 193940, 189354, 190922, 188517, 187039, 194520, 197730, 199035, 200538, 203427, 199955, 199245, 199914, 202717, 205856, 211496, 217518, 221933, 224852, 225064, 225862, 226356, 227739, 225994, 225722, 231570, 236088, 237910, 234648, 236368, 235678, 234263, 231305, 225487, 228904, 233909, 238495, 247765, 253909, 257841, 258116, 261380, 262019, 260390, 260967, 265978, 271946, 274958, 278950, 285576, 290178, 291410, 298363, 311036, 321888, 334645, 352748, 374504, 398420, 434200, 484604, 571729, 733031, 1034555, 1559846, 2272101, 2647410]
14955B647410m97663p34816m66104k52201j33700p5916m5920l2819j9500q303
14945C80468p794m205k300L622p07m766j649k34j018K230M547K206K640Q408J104
14930C82552l020L733M224J273M768J0211L131J387M690P48M784Q239P221Q692
14916D42633K809O995P555L015K667M167N089M754N829N959P934P820L441M535
14902E15202O055P623J4966Q337L690P435P261N305Q603J0206R639P646J0975
14889F22943Q670Q927R443Q893J0293J2060R444Q676J1031J2615J0251J4683J1169
14876G59098J3850J1210J2642J3084J1072J1616J2728J4688J3481J3643J7358
14865I04470J8193J4482J7214J9914J7401J5536K0664K0765K0275J9090J6101
$$ y = [2647410, 2149747, 1414931, 948827, 696626, 562926, 487010, 441090, 408271, 388771, 380468, 372674, 368469, 366169, 369791, 369084, 364318, 362669, 362435, 361417, 363647, 368194, 370400, 373040, 381448, 382552, 379532, 383265, 387489, 388762, 393530, 403741, 406872, 408259, 412949, 413697, 418481, 426720, 433941, 442633, 445442, 452437, 459992, 463007, 465674, 469841, 474930, 479684, 485513, 491472, 499406, 507226, 510667, 515202, 521257, 528880, 543846, 552183, 555873, 563308, 570569, 575874, 584477, 594683, 604322, 611968, 622943, 631613, 640540, 649983, 658876, 669169, 681229, 690673, 699349, 710380, 722995, 733246, 747929, 759098, 772948, 784158, 796800, 809884, 820956, 832572, 845300, 859988, 873469, 887112, 904470, 922663, 937145, 954359, 974273, 991674, 1007210, 1027874, 1048639, 1068914, 1088004, 1104105]
14854A104105K0656K9399K6345K5293K5001K4686K5330K8232K7085K5585K8131
14843A389848L1343K8709L3368L5499K7422L5459L6900M0974L5609L5690M0333
14832A771154M5008M1011M2683M9060N1039N0437M9095N1760N4915N5989N2127
14821B314278N7209O2511O2144O4147O7978P0603O9114O7310O8929P1686P8573
14810C054482P8826Q1224Q0559Q3175Q4812Q4959Q8715Q5662Q7629Q9016R2272
14799C991331R2963Q7641R0528R2733R0227Q8167Q8380Q9928Q4488Q3617Q3270
14788D963273Q4121P7790P6191P7442P8102P8837P2552P2563P1892P1322O7807
14777E791892O8371O9661O7870O7101O7397O7171P1111P4866P4024P4809O8369
$$ y = [1104105, 1124761, 1154160, 1180505, 1205798, 1230799, 1255485, 1280815, 1309047, 1336132, 1361717, 1389848, 1421191, 1449900, 1483268, 1518767, 1546189, 1581648, 1618548, 1659522, 1695131, 1730821, 1771154, 1816162, 1857173, 1899856, 1948916, 1999955, 2050392, 2099487, 2151247, 2206162, 2262151, 2314278, 2371487, 2433998, 2496142, 2560289, 2628267, 2698870, 2767984, 2835294, 2904223, 2975909, 3054482, 3133308, 3214532, 3295091, 3378266, 3463078, 3548037, 3636752, 3722414, 3810043, 3899059, 3991331, 4084294, 4171935, 4262463, 4355196, 4445423, 4533590, 4621970, 4711898, 4796386, 4880003, 4963273, 5047394, 5125184, 5201375, 5278817, 5356919, 5435756, 5508308, 5580871, 5652763, 5724085, 5791892, 5860263, 5929924, 5997794, 6064895, 6132292, 6199463, 6270574, 6345440, 6419464, 6494273, 6562642]
14766F562642O6733P1550P8401O9043P0203O7809O3649O6840O9061O7655O3003
14755G316589O1570N4606N3062N0679M1546L6754K9700K8808K3982J8288Q542
14744G724126K433K309p180j6372j8633k7894l0718l0918l7066m2933m5661m4708
14732G426785n2523n2786n3785n7828n6079n3808n3624n0883n4691n9780n6770
14721F824228n2203n5344n6193n6890m9673n1082n9030o0052n5733n6519o1347
14710F210162o4209o3696o5694o6035o8096o7239p1714p4586p4059p4945p8551
14699E441338q3959q3581q0696q3738q2940q2489q8018r1181q8654q8831q9825
14688D497426r0020q6420p9141q1946q2156q5784p9956p9189p8547q0480p7279
$$ y = [6562642, 6629375, 6700925, 6779326, 6848369, 6918572, 6986381, 7050030, 7116870, 7185931, 7253586, 7316589, 7378159, 7432765, 7485827, 7536506, 7578052, 7614806, 7644506, 7673314, 7697296, 7715584, 7724126, 7726559, 7728868, 7721688, 7705316, 7686683, 7658789, 7628071, 7597153, 7560087, 7517154, 7471493, 7426785, 7374262, 7321476, 7267691, 7209863, 7153784, 7099976, 7046352, 6995469, 6940778, 6880998, 6824228, 6772025, 6716681, 6660488, 6603598, 6553925, 6502843, 6443813, 6383761, 6328028, 6271509, 6210162, 6145953, 6082257, 6016563, 5950528, 5882432, 5815193, 5743479, 5668893, 5594834, 5519889, 5441338, 5357379, 5273798, 5193102, 5109364, 5026424, 4943935, 4855917, 4764736, 4676082, 4587251, 4497426, 4407406, 4320986, 4241845, 4159899, 4077743, 3991959, 3912003, 3832814, 3754267, 3673787, 3596508]
14677C596508p3686p2345p3760p2981o9830o8622o3462o4768o1765n7729n7296
14666B860264n4230n0883m9674n1377n5139m8831m5562m3925m9339m5059m4307
14655B321938m3342l7744l8635l9004m1114m0271l1348l2148l5321l3564l1684
14644A917763l0325k6380k5321k5465l0206l2888k5786k2234l1567k7095k4263
14633A616233k3890k0782j6547k2007k2428k4723k0171j6156k0493j7146j6319
14622A395571k2290k0909j9388j8037j5874j4067j2892j5314j5205j7125j7170
14611A207300j7676j2863j2836j4525j4043j5684j5198j3627j3988j1041j1162
14600A054657j1767q674p671j4287j3762j5064j1911q952j1047j2843o740j0873
$$ y = [3596508, 3522822, 3450477, 3376717, 3303736, 3233906, 3165284, 3101822, 3037054, 2975289, 2917560, 2860264, 2806034, 2755151, 2705477, 2654100, 2598961, 2550130, 2504568, 2460643, 2411304, 2366245, 2321938, 2278596, 2240852, 2202217, 2163213, 2122099, 2081828, 2050480, 2018332, 1983011, 1949447, 1917763, 1887438, 1861058, 1835737, 1810272, 1780066, 1747178, 1721392, 1699158, 1667591, 1640496, 1616233, 1592343, 1571561, 1555014, 1533007, 1510579, 1485856, 1465685, 1449529, 1429036, 1411890, 1395571, 1373281, 1352372, 1332984, 1314947, 1299073, 1285006, 1272114, 1256800, 1241595, 1224470, 1207300, 1189624, 1176761, 1163925, 1149400, 1135357, 1119673, 1104475, 1090848, 1076860, 1065819, 1054657, 1042890, 1034216, 1026545, 1012258, 998496, 983432, 971521, 962569, 951522, 938679, 931939, 921066]
14588I21066j0693j5319j3574n158j0969j3389j1959p109p072p156r553q812j1387
14575G88916o667p500j3109j2248j0474o977p520j0593j1498m004j561r084p438
14562F80243n722j1890j4830p562o845r797j0339o392r889o494m519p506p379
14549E71079l055m800j2996j1005k889k764o239n139o417r797m896n236q983j0504
14535D76359m101k981m329j01j4q263n222o904p052m533r000n828p719n966k302
14520D02044l177k132k151j320m012o326n006k584m401k872l755o329n317j581
14506C51081l719n349k321q518p967P93P77m105n450l078m252j464J0j295k577
14491C02566n811o040l961k008l794l520k520n956m891m880l42m341K82l788l954
$$ y = [921066, 910373, 895054, 881480, 876322, 865353, 851964, 840005, 832896, 825824, 818668, 809115, 800303, 788916, 782249, 774749, 761640, 749392, 738918, 731941, 724421, 713828, 702330, 698326, 696765, 687681, 680243, 674521, 662631, 647801, 640239, 633394, 623597, 613258, 606866, 596977, 590483, 585964, 578458, 571079, 568024, 563224, 550228, 539223, 536334, 533570, 527331, 522192, 515775, 505978, 501082, 495846, 486863, 476359, 472258, 469277, 464948, 464847, 464833, 456570, 451348, 444444, 437392, 432859, 423859, 418031, 410312, 404346, 402044, 398867, 396735, 394584, 393264, 389252, 382926, 377920, 375336, 370935, 368063, 364308, 357979, 352662, 351081, 347362, 342013, 339692, 331174, 323207, 324000, 324777, 320672, 315222, 312144, 307892, 306428, 306438, 305143, 302566, 296755, 290715, 286754, 284746, 280952, 277432, 274912, 268956, 264065, 259185, 258843, 254502, 254784, 250996, 247042]
14476B47042l594k612k648k921n350m369k944m056J904K096Q07k58m552q55O70
14461B18360J247n654P10L783j198m299J842j973m899k170k037j829m812n941
14447A91130n635q15P33r72m305k934n767l166j168k511l268q09o088l861l319
14432A47245J013K455K105m88l257j394j150j744k639j004m593R80L043K040J054
14417A43666j079n90q08l803o027k768M1j488J458k290k517n49l304l336m109
14402A12497k395j705k650L315K064m65k019n359J46J591M81j712K287K343j058
14387A07361l838O9m402l293k254K110j355j721k626p561l203k150K813J363k360
14372G8953J869k090k337k368J025L814m06J019n655k971P2r29k280J843K568
$$ y = [247042, 243448, 240836, 238188, 235267, 229917, 225548, 222604, 218548, 220452, 222548, 223355, 223097, 218545, 217690, 218360, 219607, 213953, 214663, 218446, 217248, 212949, 214791, 212818, 207919, 205749, 203712, 201883, 197071, 191130, 185495, 184680, 185413, 184441, 180136, 177202, 171435, 168269, 167101, 164590, 161322, 160513, 154425, 150564, 147245, 148258, 150713, 152818, 152330, 149073, 147679, 146529, 144785, 142146, 141142, 136549, 137529, 140572, 142612, 143666, 142587, 141997, 141189, 137386, 131359, 128591, 128632, 127144, 128602, 126312, 123795, 123246, 119942, 116606, 112497, 110102, 108397, 105747, 109062, 111126, 110661, 108642, 103283, 103429, 105020, 105501, 103789, 106076, 108419, 107361, 103523, 103592, 99190, 95897, 93643, 95753, 94398, 92677, 90051, 82490, 79287, 77137, 79950, 81313, 78953, 80822, 78732, 76395, 74027, 75052, 78866, 78460, 79479, 73824, 70853, 70925, 69996, 67716, 69559, 72127]
14357G2127m837k481M705J821l300k636j650j401q60J970J432j398p61n907j445
14342E5379J384m99L76j29j165k292J497j264k897K6J575j944k027j264j691Q34
14326D5899J930J009J489K214j011l747l08K527R04K940k313l855o91k062L619
14311D8544R03Q67J296l087J14j248l873m695n104J815L966j379m086k027J52
14296C2158k825L557K704O16J54m67k952j703M482K917r45r32l90j509k217L803
14280C6451J667q22k94q97j645j249M338N01j846L636q63l577o47j187K566J407
14264C7539R89j494j376j461j89l072n083m953K273K184L93j912j211j520k697
14249A8410K313J063K56R83K426J868n982n257k031L625K183l257J431J741M571
$$ y = [72127, 67290, 64809, 69514, 71335, 68035, 65399, 63749, 62348, 61488, 63458, 64890, 63492, 62731, 56824, 55379, 56763, 56264, 56640, 56511, 55346, 53054, 54551, 53287, 50390, 50416, 51991, 50047, 48020, 46756, 45065, 45899, 47829, 48838, 50327, 52541, 51530, 47783, 47475, 50002, 50906, 53846, 51533, 47678, 46987, 44925, 48544, 49447, 50314, 51610, 48523, 48637, 47389, 43516, 38821, 33717, 35532, 39498, 38119, 34033, 32006, 32158, 29333, 32890, 35594, 36210, 36364, 35897, 32945, 31242, 35724, 38641, 37696, 36764, 36374, 34865, 32648, 36451, 38118, 37296, 37002, 36105, 34460, 33211, 37549, 38050, 36204, 39840, 38977, 35400, 34753, 33566, 36132, 37539, 38528, 37034, 35658, 34197, 34008, 30936, 25853, 20900, 23173, 25357, 25750, 23838, 22627, 21107, 18410, 20723, 21786, 22042, 23025, 25451, 27319, 21337, 16080, 14049, 17674, 19857, 16600, 18031, 19772, 24343]
14234B4343Q79n672j09J43J861j143k057L539K779O74j441m410L91L213O65p60
14218B2895j157l095J492o60j08j299J90L443o012l667R24K616M964p99M244K335
14202B6306j553j607j315R79J321L47n584l353l436j194N82J364K613l19o89J125
14186A5587j96m529J687k366R76R1N41l88j146L569P345l85m361j04J819J415
14170A9555r42q32J4n89j669K834k538j417j685j664j332K685K595j181k816K022
14154A3040L41J892j446j461k020J384k16M34j200K319M49O21J987M15j551N78
14138A5566m895k120r8J883j055K662L435k993j822J185j832j961P84k831m52
14123E456K66k151l061m7N198L979Q40n27R71J148J467k593j161Q22r94K467K50
$$ y = [24343, 25222, 19550, 19441, 19584, 21445, 20302, 18245, 21784, 24563, 25237, 23796, 19386, 19777, 22990, 23655, 22895, 21738, 18643, 20135, 19475, 19367, 18068, 18258, 21701, 15689, 12022, 12946, 15562, 20526, 19727, 23971, 26306, 24753, 23146, 21831, 22810, 24131, 24478, 18894, 15541, 12105, 10911, 11493, 12857, 15470, 15151, 14462, 15587, 15391, 10862, 12549, 10183, 11159, 11250, 11791, 11403, 10257, 13826, 21171, 20786, 16425, 16321, 18140, 19555, 18613, 17781, 17795, 17206, 15537, 18371, 15833, 14416, 12731, 11067, 9735, 12420, 15015, 13834, 11018, 13040, 13381, 15273, 13827, 12366, 10346, 11730, 11514, 11948, 10748, 13067, 13516, 14137, 16124, 16539, 14988, 15566, 10671, 8551, 8453, 10336, 9281, 11943, 15378, 12385, 10563, 11748, 9916, 7955, 8739, 5908, 5456, 5722, 3571, 510, 463, 5661, 9640, 10480, 9953, 10924, 12072, 13539, 10946, 9785, 10607, 9613, 12080, 12330]
14106A2330q53L148o80J076j176l321k566R65o30M68j090l006j079n32k135k230
14090a311L616L524k385J098L343O25K667O37k849j367K190K149M823k322p979
14075F459k302K464L492k587n011M53K666K977K213J286j948k3J71M50k986l28
14059G446N336j363r41k325k424k263j009M37M294j47j384K421k035J178l944
14044C277o356j23K805J650L961r30m340R98j952J034K837k761l73P23P71K965
14028D186J646k810k430L784J70L001K964k145o024l83K130K216J532k532j570
14013C735j161O03K666R99r17l40K211k72j464L03k589k770L683N502J342m913
13997F618n883m87l55q48J650M92L052q44j814R40K051M92J485o00L874L037k174
$$ y = [12330, 11477, 14625, 13945, 15021, 13845, 10524, 7958, 8923, 8293, 8761, 7671, 4665, 3586, 3054, 919, -1311, 2305, 5829, 3444, 4542, 7885, 8510, 11177, 11814, 8965, 7598, 9788, 11937, 16760, 14438, 6459, 4157, 6621, 10113, 7526, 2515, 2968, 5634, 8611, 10824, 12110, 10162, 10139, 10310, 10760, 7774, 7446, 12782, 11419, 10478, 8153, 5729, 3466, 2457, 2894, 7188, 7041, 5657, 8078, 6043, 7221, 3277, -3079, -3202, -397, 1253, 5214, 4284, -56, 942, -1010, 24, 2861, 100, -273, 450, 1221, 4186, 5832, 3022, 592, 4376, 4546, 7547, 10511, 8366, 2342, 1959, 4089, 6305, 7837, 5305, 3735, 2574, 3177, 5843, 6842, 5925, 5585, 7796, 7524, 6060, 6363, 3774, 1004, 4687, 10189, 11531, 6618, 735, 248, -107, -955, 695, 1187, 4239, 3395, 1581, 2521, 4572, 5064, 6549, 5949, 9823, 12860, 10686]
13980A0686k320m364k478K869Q51q97n537n176K259L616K690n86L72J205M83j187
13964B486j230K025k137m128J108J088k394q17Q54j553l709J729L389L222O521
13949F454n014j592k063R99N49J295k167O86J350J270J348M28r46j059L541K609
13933G688k146j693k125k020J680P1k264o0k737o9m31q97K300L158J040k251K299
13916A543o65j17J888k279p085k779N343M336J573K641k768l153k255J696L495
13901A414L030k949k892J444K110o2l593l410l806O168K360j520J096k348j785
13886d743l55r68N55j289P3j727j647p1K821n67k095M260O194P70k120n466k297
13869h672K988n88J341L714J369k095k753K757P992O2n660r44k260J123M813n87
$$ y = [10686, 8366, 4002, 1524, 4393, 5244, 4347, -1190, -6366, -4107, -491, 2199, 1613, 1985, 3190, 3673, 2486, 1256, 3281, 1144, -2984, -1876, -788, -3182, -3999, -3145, -4698, -8407, -6678, -3289, -67, 6454, 1440, -152, -2215, -1216, -667, 628, -1539, -853, 497, 1767, 3115, 3543, 2597, 1538, 5079, 7688, 5542, 3849, 1724, -296, 1384, 1455, -809, -869, -3606, -3675, -4106, -5003, -2703, 455, 1495, -756, 1543, 878, 761, 2649, 370, -6715, -9494, -4151, 185, 1758, 4399, 1631, -1522, -3777, -2081, 1414, 4444, 1495, -1397, 47, 2157, 2095, -1498, -4908, -8714, -2546, -186, -1706, -610, -2958, -4743, -5098, -6066, -5511, -6800, -6727, -8454, -10101, -10172, -7351, -7918, -10013, -5753, 441, 1211, -909, -6375, -8672, -5684, -6272, -4931, -1217, 152, -1943, -4696, -1939, 6053, 6115, 455, -489, -2749, -1626, 3187, 2600]
13853B600j987m934k758K082J23J98l16l215J702O059J618j417n05K561K891k526
13837B176j259K075l51n553L51l191k779m12L697M762J619k539j488m155P18M608
13821a721N216p31L8L2j086J718k645m575j242j876J798L098k80r49J310r32j669
13804d496j250J600K863J56j821N11K836N432M97k138j596l182q409J309P78K451
13788d459L07r22M524J113O43l089j257K824J180j724K99K090n040K952L386l610
13772g83m559l236j312j26L729n06j39p73m40q42J149K514l234Q56M081o19j668
13755e908j507L594J923o93m80k86R53M336J923k492m567r91j541l959k261O241
13739e715J996K384J763q17j098K458K334K49m255k378J700kk83J235l301k996
$$ y = [2600, 613, -4321, -7079, -4997, -4874, -4676, -4992, -8207, -6505, -446, 1172, -245, -750, 1811, 4702, 2176, 917, 2992, 2641, -2912, -2561, -5752, -8531, -8943, -5246, -484, 1135, -1404, -2892, -7047, -6329, -1721, 3495, 2764, 2802, 2834, 1748, 3466, 821, -3754, -4996, -6872, -5074, -1976, -2256, -3205, -1895, -2827, -4496, -5746, -4146, -1283, -1127, -2948, -2437, 399, 5831, 6328, 4190, 2594, -588, -8997, -7688, -6910, -4459, -4152, -5074, -550, 563, 1206, -1883, -3140, -316, 864, -860, -561, 1529, -3511, -559, 2827, -783, -5342, -8578, -9890, -10016, -6287, -6793, -6932, -7705, -8145, -8987, -7838, -5324, -8558, -7702, -3621, -4240, -5908, -7415, -3821, -1898, -2591, -3071, -3357, -2404, 1932, 3855, 1363, -3204, -4195, -5736, -9695, -11956, -5715, -3719, -1335, 428, -389, -1487, 971, 3305, 3554, -701, -3079, -1379, -1381, -1664, -429, -3730, -6726]
13723f726o64K016M609P24J75J014J172p31l446m191n158m820P00M041J629N73
13707i083L515M199L781m31m580j796q04j663J85m46O278N832l596m830n548r44
13691i931J925M68k645k471J079K174N64k175M270M058K085l117Q45J507J245
13676a19K118J536k969N20l952m316O19J272L325r04O14L023o69l236k252j149
13660f539J656m91J152J029j447J309k230j162p10K77K699L002k359j423p29r22
13644f888j886k501J632M25M634L459J287p38n003j54R91M6L628Q31K85J199O548
13627G795Q46n319q343K55J880N51J372j859q08k78K108K066K749l782P81J774
13611A788o73k645N80j27N89r1k617j992J285K340m025k800k7K539J625k696r99
$$ y = [-6726, -7390, -5374, -765, -41, 134, 1148, 2320, 1589, -1857, -6048, -11206, -16026, -15326, -11285, -9656, -9083, -5568, -1369, 2412, 1981, -2599, -4395, -5199, -6862, -6677, -7123, -845, 4987, 1391, -3439, -8987, -9931, -8006, -7538, -10183, -12654, -11575, -9401, -8837, -11012, -6742, -2684, -599, -3716, -2871, -1364, -119, 1999, 3535, 566, 1086, -2866, -7182, -6563, -5291, -1966, -2870, -2256, 767, 98, -3138, -5390, -6539, -4883, -5374, -4222, -3193, -4640, -3331, -5561, -6723, -7433, -7156, -4457, -1455, -3814, -5237, -5966, -6888, -8774, -11275, -9643, -9218, -4584, -1125, 162, -576, -5579, -5733, -4742, -4696, -1068, -237, 48, 1247, 7795, 8641, 3322, -5021, -4766, -2886, -2335, -963, -2822, -3630, -3908, -1800, 266, 3015, -767, 14, 1788, 1115, -1530, -950, -1077, -488, -579, -3196, -5188, -3903, -1563, -5588, -8388, -8415, -5876, -4251, -6947, -7946]
13594g946j17j980M379j015j232K77l37L608p42J321M49j668J727k631l357J966
13578g298K697L618L51j845o355p28R50l020l688j257l98L987K507K218R96K305
13562d960j071j638L589K700M153j371l076n428k082K149m789M091J699p37k73
13547g044L326L581L257R77m601l185k357R93N86j297q50L419n60l736j101k011
13531a0603M651N74Q05O35K39J829l036n8R03L842p68k944K146p03Q23n70k145
13514d380k270L507M720Q05j363m878j269P20M630n11k418k057m36m732l654N723
13498g863M617n92J742J160J401j173k668k184q22K292O513K019J0j506k993l936
13482c983l191K578Q91l139J345J113L098L489j513r75J133l723l048r56l46K321
$$ y = [-7946, -8063, -10043, -5664, -6679, -7911, -7634, -7971, -4363, -5105, -3784, -3335, -5003, -3276, -5907, -9264, -7298, -4601, -983, -632, -2477, -8832, -9560, -8610, -11630, -15318, -16575, -16973, -12986, -10479, -8261, -7265, -4960, -6031, -7669, -4080, -1380, 2773, 1402, -1674, -7102, -9184, -7035, -11824, -7733, -6034, -6771, -7044, -3718, -137, 3120, 4097, -504, -3689, -6046, -5053, -4467, -5764, -6614, -3195, -3755, -7491, -8592, -10603, -5952, -5378, -4573, -3938, -3699, -1870, -4906, -4964, -4061, -219, -987, -3931, -1785, -2488, -1665, -2235, -4380, -6650, -3143, 1577, 2382, 1019, -3859, -5128, -4408, 222, -289, -2707, -4764, -5200, -9932, -13586, -7863, -3246, -3838, -2096, -936, 465, -708, -3376, -5560, -6382, -4090, 2423, 4442, 4452, 2946, -47, -3983, -7174, -4596, -3705, -6844, -5499, -4386, -1288, 2201, 688, -287, 846, -2877, -5925, -6881, -7227, -4906]
13466d906Q29K797L300J538j729K65N56m805q64N60j421p36k746M32K993L66L04
13449c267L464O83J752k598k973l480J63N50J987n41Q82K394J191J938P38Q37
13433C720l741P36j33J474L363J810k70p64j370n409N04J797m530n993J873P70
13417f163J370j464K310M691j249k14l153J746J087k234m662j486M251o11r20
13402f701l499J450r72k33M401k1L156J772l40j539n443L02L664R11K259N58R98
13385G23M93r87j54K222J130l171k876L552K561L833j81l638K62J292j031J369
13369E399P52l730j016p42p40K849N830K621O59r73L242J952K686N943k950l11
13353B1471K332N821P237N842O312M807l600l723K855m005n986o877l782q275
$$ y = [-4906, -4077, -1280, 2020, 3558, 1829, 2094, 2650, -2155, -3019, -2459, -3880, -4616, -7362, -6930, -3937, -3571, -3267, 197, 880, 2632, 34, -2939, -6419, -6256, -5706, -3719, -4260, -3378, -984, 207, 2145, 2883, 3720, -21, 715, 582, 2056, 5419, 7229, 6959, 6195, 4825, -584, -80, 1717, -2813, -8806, -6933, -6163, -4793, -6257, -3947, 744, -505, -719, -3872, -2126, -1039, -3273, -7935, -9421, -5170, -5781, -6701, -10200, -8750, -9722, -9955, -5554, -5575, -2419, -647, -987, -2526, -7969, -7667, -4003, -3092, -833, -275, 723, 1216, 229, 75, 2297, 3427, 256, -2620, 932, 3493, 7326, 7145, 3507, 3769, 5061, 4030, 5399, 6151, 2421, 1405, 663, -77, 2772, 8602, 11223, 11882, 10909, 14151, 16103, 18789, 24732, 21782, 21471, 23803, 29624, 36861, 42703, 49015, 53822, 50222, 46499, 49354, 45349, 39363, 32486, 28704, 20429]
13339B0429n134m000J184J977J33l843l230J065j498k443j401M590L43l131J030
13324F071l292n692n313k333n45K073N664K687j226k070J1J667L22M58l58l045
13308d921m28J298k76j479J685M41L72O91m140J201M817K121N52m76k863q832
13292a0237J634L813J720r19K687J873l150j535k527K589K342j243l075J15q10
13277f723m10Q89j778J214j741r58O65q67J230J427Q6J12N26l48o432r35M838
13260i205K992J306L63P9J402q28k809m81N59J534j806j680L600K258J501j005
13244b220K344k69j378q14J307K26P03J638O06l949k840r50r42Q57O18K67k39
13227e035j082J738Q9k422l277m888L512K232N433k048K804p66K98k075l642k84
$$ y = [20429, 15295, 11295, 12479, 14456, 14589, 10746, 7516, 8581, 7083, 4640, 3239, 7829, 8172, 5041, 6071, 2779, -2913, -8226, -10559, -11104, -9031, -3367, -680, -1906, -3976, -3965, -2298, -1976, -1518, -1876, -4921, -5349, -4051, -4327, -5806, -4121, -3680, -3308, -2617, -6757, -5556, -739, 1382, 1934, 1458, -1405, -10237, -8603, -4790, -3070, -3989, -1302, 571, -2579, -4114, -6641, -4052, -1710, -2953, -6028, -5913, -6723, -7133, -6244, -8022, -6808, -8549, -9507, -8842, -9709, -8479, -7052, -6966, -6854, -6328, -6676, -13108, -14043, -9205, -6213, -4907, -4544, -4465, -3063, -3891, -6700, -7181, -6622, -5088, -6894, -8574, -4974, -2716, -1215, -2220, 124, -145, -1523, -2337, -1030, -804, -101, 1537, 2143, -1806, -4646, -5596, -6538, -5681, -5063, -4796, -5035, -6117, -4379, -4290, -6712, -9989, -14877, -11365, -9133, -3700, -5748, -2944, -3710, -3412, -5487, -9129, -9413]
13211i413K530K769J478l402l097r56j34L259K528p98Q84L75K36r91K515k600
13195d817k276J95r18L574N074l838l109j596J983o28R38J521m99J928om708l667
13178a0849J540L134J932j466NJ218l92L234K906j951l069l206K028K145J291
13163a500r21j999P50k210r72p41j784N345J878M86K084m812n041J771O729L82
13147e55J181j008j868J168M310j736n271j024J003r52J874P14k069m18j319P22
13131e248j686J070N482K263K521l832j014n166O11m65k176K448J55l026K054
13116f009K326k922J640L771O15k9l399j960j098J506L153N74l623j517j102R16
13100g158J653L86l578J068Q180L250j487k264O80l324n569J184L258K000K37
$$ y = [-9413, -6883, -4114, -2636, -6038, -9135, -10091, -10225, -6966, -4438, -5236, -4352, -3977, -3741, -4732, -2217, -4817, -7093, -6898, -7816, -4242, 832, -3006, -6115, -7711, -5728, -6356, -5418, -3897, -4396, -2468, -2474, -7182, -10849, -9309, -6175, -4243, -5709, -5704, -4486, -4878, -1644, 1262, -689, -3758, -6964, -4936, -2791, -1500, -2421, -4420, -3670, -5880, -6852, -7593, -9377, -4032, -2154, -1668, 416, -4396, -9437, -7666, -937, -555, 626, -382, -2250, -1082, 3228, 1492, -3779, -4803, -3800, -4752, -2878, -2164, -4233, -4651, -5970, -5248, -6934, -5864, -382, 1881, 4402, 570, -444, -5610, -4999, -5464, -7640, -5192, -5037, -8063, -6009, -3683, -6605, -4965, -1194, -579, -608, -4007, -5967, -7065, -5559, -2406, -1832, -5455, -6972, -8074, -7158, -5505, -5119, -8697, -7629, 551, 3801, 2314, 50, 730, -2594, -8163, -6979, -3721, -1721, -1484]
13085a484k679m802L762j449k163O50J063j036J760O994L658k251l026k145p83
13070c931m312o08N059K361l898J11K889J759J887K231p0m661j689l5J990N236
13054D319l888m490L481J609M316k30n023k120K015J85k435j675j493M08J804
13039c217K191K83l619m311k056M061p07L112P01K031j188j444l441j737O368
13024b973L121R08J167j28N22j737l77j838j562N85r69J77p92Q25P940K710k325
13007E254j003k414O87J33j84K567m820n809Q82J42n19J14J011m372k626o95P162
12990d490N126k021M20k13J438k680j786O7j906N410j382r36J939J080j981n85
12974b500J783j313l407j593n96n31M244K052p99j898J755N10N68L873O57L8j411
$$ y = [-1484, -4163, -8965, -5203, -6652, -8815, -8165, -7102, -8138, -6378, 616, 4274, 2023, -1003, -3148, -3931, -8243, -8851, -3792, -1431, -5329, -5218, -2329, -570, 1317, 3548, 3478, -1183, -2872, -2907, -917, 4319, 431, -4059, -578, 1031, 5347, 5117, 94, -2026, -11, 174, -2261, -3936, -5429, -5021, -3217, -1026, -743, -4362, -8673, -10729, -6668, -7375, -4263, -3562, -1531, -2719, -4163, -7604, -9341, -2973, 148, 1056, 2223, 2095, 2617, 880, 503, -1335, -2897, -2312, -3281, -3104, -3896, -3071, 4869, 7579, 5254, 4251, 1837, 2524, 2657, 2473, 5040, 220, -5589, -4707, -4565, -5084, -4970, -3959, -8331, -10957, -11652, -4490, 636, -1385, -965, -1178, 260, -2420, -4206, -4139, -6045, -635, -2017, -2953, -1014, 66, -1915, -2500, -717, -2030, -5437, -7030, -7626, -8157, -3913, -1861, -2660, -4558, -2803, -2293, -1725, 2148, 2805, 2843, 1432]
12957A432l150l443k73M812L307L185l668j843K520R21N34k95M366l211m559q35
12941b00J90O42j661m095J035l142j431K843K921J366L217n3K995l90k981J405
12925B661l857l077K479O56K292Q03j674K90L374j061j570l549k75K461l51j48
12909e46L150J365l27n365j010J970k96j86j416j348j168r43Q19J215J472Q45
12893a769k465p7K185J867Q45j276j446l012P32j024J586K344J681j163j672J475
12877a189j45j472l226k98J02n796o38P641L88K263K871J78K249l75l953j238
12861b638J927J039L115k857j753M618k284k444l600n11M356J477l410P78O063
12846C876J516k282j232j239k904j063M83N83J884M850K725k532M12j681k540
$$ y = [1432, -1718, -5161, -5434, -622, 2685, 5870, 2202, 359, 2879, 3800, 4334, 4039, 8405, 5194, 635, -200, -10, 632, -1029, -5124, -4089, -7231, -8662, -5819, -2898, -1532, 1685, 1632, 4627, 4237, 1256, 2661, -1196, -4273, -1794, -1138, 1154, 1957, 283, 573, 3947, 2886, 1316, -2233, -2508, -47, -398, -546, 2604, 3969, 3642, -1723, -2733, -763, -1059, -1245, -2661, -4009, -5177, -6120, -5301, -4086, -2614, -1769, -4234, -4311, -2126, -259, 586, -690, -2136, -5148, -4416, -5440, -3854, -1510, 171, -992, -2664, -1189, -1334, -2806, -6032, -6330, -6228, -12024, -12662, -5021, -4633, -2370, 501, 679, 2928, 2553, -1400, -2638, -711, 328, 3443, 586, -1167, 3451, 1167, -1277, -4877, -5388, -1032, 445, -2965, -2187, 3876, 5392, 3110, 1878, 639, -2265, -3328, -2845, -2262, -378, 4472, 7197, 4665, 5077, 3396, 856]
12831H56K99K279j823l062j875l402l771q69L104P007M175l213p02J631J025k232
12815e73J859K623k39m867p64L823L958j006l256k031m836n436K307O82L413q34
12799e177J269j515j372K579J210K516L220J908K180j627m542J343j50j816k451
12784b425L013k857l942L091p34l031J606J874j106J0j173J744J828L4j97j083
12768c348k772Q02j59j408j753l73L448P6K054J398o8L76O373N264j943p385K09
12751G91J158k04J021J852k336q03m47j573m981J637O435K483K399k725m655n420
12735e368L17M891K093J796k556O45J11o28K23j465q61L565N85n350J686j341
12719a657j637m939J373K994O275J790l79k51J002k567L85k32M199L716j791r50
$$ y = [856, 1155, 3434, 1611, -1451, -3326, -6728, -10499, -11368, -8264, -1257, 2918, -295, -997, 634, 1659, -573, 1286, 3909, 3670, -1197, -1961, 1862, 5820, 4814, 1558, -473, -5309, -10745, -8438, -7756, -4343, -5177, -3908, -5423, -6795, -4216, -3006, -490, 2730, 4638, 6818, 5191, 649, 1992, 1842, 26, -2425, 588, -2269, -6211, -3120, -3854, -6885, -5279, -3405, -4511, -4501, -5674, -3930, -2102, -2068, -2265, -3348, -6120, -5318, -5477, -6885, -8638, -9011, -5563, -5487, -3433, -2035, -2103, -1727, 4646, 9910, 7967, 582, 791, 1949, 1745, 2766, 4618, 2282, 1479, 1032, -541, -5522, -3885, 2550, 5033, 7432, 4707, 52, -5368, -5051, -160, 1933, 3729, 1173, 1818, 1929, 1301, 1524, 59, -802, 2763, 3348, -2002, -316, -1657, -3294, -8233, -6860, -3866, 2409, 4199, 3820, 3569, 4571, 2004, 2389, 2157, 6356, 10072, 8281, 7331]
12703G331m693k414K506N745Q12p871k850j383m555L525J670J638J772L757l137
12688A853k319j189J043K162L944K222m184P46K554r31o216J664M265J178J137
12673G929j111k72j226n421K640L974K612L54r59k646L309O28l547m808j641K64
12657G9L212K754p99m597P20K016J790J474K365n647k071K067M33K210j948J470
12641E528O90J324m38q011Q36L156K510J052k390k03o06q97m18n81j304K381J368
12624C997J790J402R26n161k833K624N064K641k696r419k034M47M287j354j05
12609d24M459Jj553n28M215n38o16j256j53J00K793j104l422M86N55j150N91J549
12591D005k263K258q39j639K934j041j665j206l402j225J798p29J423O31n55L508
$$ y = [7331, 2638, 224, 2730, 8475, 9287, 1416, -1434, -2817, -7372, -3847, -2177, -539, 1233, 4990, 1853, -466, -1655, -612, 1550, 5494, 7716, 3532, 4278, 6832, 5901, -315, 1349, 5614, 6792, 7929, 6818, 6546, 5320, -101, 2539, 6513, 9125, 9479, 8520, 5874, 9183, 9811, 6264, 1456, -185, 79, 3291, 6045, 5246, 649, 1369, 3385, 5175, 6649, 9014, 3367, 1296, 3363, 3796, 6006, 4058, 5528, 6218, 7542, 7104, -907, -71, 3085, 5595, 6647, 4257, 4054, 3448, 2551, 2133, 1552, 248, 2629, 3997, 5787, 7189, 8115, 2954, 121, 2745, 7809, 10450, 7754, -1665, -3699, -3252, 1035, -319, -424, 4035, 4036, 2483, 1955, 6170, 5632, 5016, 3760, 3607, 3707, 6500, 5396, 1974, 2460, 3015, 1865, 2456, 4005, 1742, 4000, 3161, 1522, 4456, 3415, 1750, 544, -2858, -4083, -2285, -3014, -1591, -960, -1515, 1993]
12575A993j260K095K662K284j380M725m327m697k280n54L525n2j434k340J005
12560c5K348j467r76J294J123K99J30k250P44N532n90k826J5J6k012J58K057M207
12542G767k005n355j331L749K782l03L570j926j518P17J856L479j445o318m00
12527C319K791k6R28j468J093K742m481k012k612J62J854M814J169k138k91K049
12511G893P15k569K628O970K302n64j525n482j657j76J23K35r98m16Q77J621n57
12494I420q22Q17k446o38J378o62k003R02L816Q69P07o3J231p26J688p55n89j338
12476A0786k688J341L238k490j094j084j287L700m0J79O10J050m615N21o11q90
12460F626N782O778L514m022j074l509l019N048K356l186r95m09M135N419l55
$$ y = [1993, 733, 2828, 5490, 7774, 6394, 11119, 6792, 2095, -185, -739, 2786, 2734, 1300, -1040, -35, 2313, 846, -130, 1164, 2287, 2586, 2716, 466, 1210, 6742, 6152, 3326, 3341, 3357, 1345, 1503, 3560, 7767, 5762, 407, -924, 2825, 5607, 5304, 8874, 6948, 5430, 6147, 8003, 11482, 10037, 3719, 3319, 6110, 6084, 7012, 5544, 6637, 9379, 4898, 2886, 274, 436, 2290, 7104, 8273, 6135, 5844, 7893, 8608, 6039, 8667, 15637, 17939, 17375, 15850, 10368, 8711, 8535, 8658, 8893, 7895, 7479, 8356, 9977, 9420, 8598, 9415, 6969, 6331, 7709, 7047, 5044, 5946, 9762, 10631, 11338, 11275, 12506, 11780, 13468, 12713, 12124, 10786, 8098, 9439, 12677, 10187, 9093, 8009, 6722, 10422, 10382, 10561, 11171, 12221, 7606, 8127, 7516, 6626, 12408, 19186, 22700, 18678, 17604, 14095, 11076, 16124, 18480, 15294, 14299, 13890, 18025, 23444, 23089]
12445B3089L07M808M084j339M72J827M214J677K696L295Q773O799Q445O722Q030
12430H3899Q090O760N146L863k899q721p801o516n747p990j0025m839j35K793
12416E5878k052m130Q41j271n572R32K592J661N146K410j234P26J744M638O437
12401F8746O621J971L950N728O644J1394J3599J4064J4166K3011K8770K9831K2609
12388B51104J8299P288j528j3000k1982k2311k6212k1057j7362j9428j0428m494
12376A18889j0052m534j387p788j0849q177j327l454P67J889M169L162N039j88
12362H6159Q43k693K97K788N731O830J2080J4737J5483J5340K0661K4329K4851
12349B27436K2653K1349J2234L018j2630k0488k6505k7300k3792j8894j7171j9518
$$ y = [23089, 23396, 28204, 32288, 30949, 31421, 33248, 37462, 39139, 41835, 45130, 53903, 60702, 69147, 75869, 83899, 91989, 98749, 103895, 107758, 104859, 96138, 88337, 81821, 76074, 68084, 58059, 53220, 53085, 55878, 53826, 49696, 50537, 49266, 43694, 44626, 47218, 48879, 54025, 56435, 55201, 55927, 57671, 62309, 68746, 75367, 77338, 81288, 87016, 93660, 105054, 118653, 132717, 146883, 169894, 198664, 228495, 251104, 269403, 276691, 275163, 262163, 240181, 217870, 191658, 170601, 153239, 133811, 123383, 118889, 108837, 104303, 102916, 95128, 84279, 76102, 74775, 71321, 72088, 73977, 78146, 81308, 86347, 86159, 87002, 84309, 84606, 87394, 93125, 99955, 112035, 126772, 142255, 157595, 178256, 202585, 227436, 250089, 271438, 283672, 286690, 274060, 253572, 227067, 199767, 175975, 157081, 139910, 120392]
12337A20392j6633q709q677m718j544o307m562J253q37k207j492J235m3j963o89
12322F4499k986j114k112O28K654Q496N139J783J226J993P002O385N587M939O048
12307A10167K372J376r36l958p267q596r290p034j1190p859l562k067j306k903
12293D7947q84r55J028j173k751o820n05K594j232L281M503K25l082m488K186
12278C9874N926L424j419l499k180k853j947j372K08Q22L322l55K655M351k310
12263D4647k762Q78m353k259J717M228k63l753j59j058n58K9J280K652j863m67
12247C7936R62l50P29N07J251J029J731L129L898J289P82k842L143J146R44N18
12231E5802k02N545K064J438l39L90j062k085L741L232l376l354J649L429l334
$$ y = [120392, 103759, 95050, 86373, 81655, 80111, 73804, 69242, 70495, 69658, 67451, 65959, 67194, 67151, 65188, 64499, 61513, 60399, 58287, 58915, 61569, 70065, 75204, 76987, 78213, 80206, 87208, 93593, 99180, 104119, 110167, 112539, 113915, 112979, 109021, 101754, 93158, 83868, 76834, 65644, 57785, 54223, 52156, 50850, 47947, 47063, 46108, 47136, 45963, 43212, 36392, 35887, 38481, 37249, 40530, 45033, 45258, 42176, 37688, 39874, 45800, 49224, 47805, 44306, 42126, 39273, 37326, 35954, 36162, 36984, 40306, 39951, 42606, 46957, 44647, 41885, 42763, 38410, 36151, 37868, 42096, 41833, 38080, 37921, 36863, 36305, 36334, 37614, 40266, 38403, 37936, 38898, 38548, 39277, 39784, 41035, 42064, 43795, 46924, 50822, 52111, 52893, 50051, 53194, 54340, 55284, 55802, 55600, 61145, 63209, 64647, 64308, 64698, 63636, 61551, 65292, 68524, 65148, 61794, 63443, 66872, 63538]
12216F3538J845M79m895K397N313N919J116L368O219P156N682P631L448l45M405
12201A13276J2859J4427J3071J7482J7056J6487J9221J8815J6126J8926J7573
12190B95319J3602N694l25m497j2679j3398j7143j7960j9208j7515j4631j1783
12178A85476j0643j3151j0310r307p964p019l282k765n329p688n844n32k365r36
12164I8341J575K391o1K412L41K792N12N562P415O177K331K76L10L413n28r55
12148A32304j741o290r483n311l142o116o415q347j327l859k734J451K925P46
12134H2661J602j954l090o05K126K487Q12J333Q73N93M041O189L192L266n27K202
12118A05201L697M581M354N66K879K888K204R58L739k919K796K331M70l800q087
$$ y = [63538, 65383, 65862, 60967, 63364, 68677, 74596, 75712, 79080, 85299, 92455, 98137, 105768, 109216, 108871, 113276, 126135, 140562, 153633, 171115, 188171, 204658, 223879, 242694, 258820, 277746, 295319, 308921, 314615, 314290, 309793, 297114, 283716, 266573, 248613, 229405, 211890, 197259, 185476, 174833, 161682, 151372, 142065, 134101, 127082, 123800, 121035, 115706, 108018, 102174, 101642, 99277, 98341, 99916, 102307, 102246, 104658, 104999, 107791, 108303, 113865, 121280, 127457, 129788, 130064, 130374, 133787, 133259, 132304, 130563, 124273, 114790, 109479, 106337, 100221, 93806, 85459, 84132, 80273, 77539, 78990, 81915, 82661, 84263, 82309, 79219, 78614, 80740, 83227, 84039, 85372, 86245, 86838, 90879, 97068, 100260, 103526, 102999, 105201, 108898, 113479, 117833, 118399, 121278, 124166, 126370, 127328, 131067, 128148, 130944, 133275, 133745, 129945, 121858]
12103A21858j523k895l193l08n67N08J495K028N4K96O99M085L003O798K011l891
12087A30458M067L782J276K280Q84L273K971L774N086L990M86J632J185K000K215
12072A69359J302L337R235N338O514J2507O850M582M33K015J23m229m228K372
12058B15510N630L857M42O525N561N064N55J730P981R004M111N189N003P965J1062
12043B95189J2945J0686O700K065J581N445J2599R882O145R212J0256J3804J7287
12030D13796J5116J5772J9625K1701K1798J5291J7200J9633K0252J6974J7097
12019F14255J8262J9835J9521K1347K9138L5736L5248L7454M5716M5470N3018
12008I75000N5843N6472O6713P6371Q3920R7370J02468J11157J27053J45382J51259
$$ y = [121858, 120335, 117440, 114247, 113939, 113372, 113880, 115375, 117403, 117457, 117753, 118452, 122537, 125540, 132338, 134349, 130458, 134525, 138307, 139583, 141863, 142747, 146020, 148991, 152765, 157851, 161841, 162327, 163959, 165144, 167144, 169359, 170661, 173998, 183233, 188571, 195085, 207592, 214442, 219024, 219457, 221472, 221595, 217366, 213138, 215510, 221140, 224997, 225439, 231964, 237525, 242589, 243144, 244874, 252855, 261859, 265970, 271159, 276162, 284127, 295189, 308134, 318820, 325520, 327585, 329166, 334611, 347210, 357092, 363237, 372449, 382705, 396509, 413796, 428912, 444684, 464309, 486010, 507808, 523099, 540299, 559932, 580184, 597158, 614255, 632517, 652352, 671873, 693220, 722358, 758094, 793342, 830796, 876512, 921982, 975000, 1030843, 1087315, 1154028, 1230399, 1314319, 1411689, 1514157, 1625314, 1752367, 1897749, 2049008]
11997B049008J67933J96128K24767K59229L11341L78855M61431N61196O85905
11988E295793Q47263J041184J261353J499058J712541J821559J716089J295618
11980A6490458N81587k61713r96443j456489j611114j543104j361753j142378
11972H699051r23609p28658n62609m26636l15107k17523j26685n4550Q681P1631
11962E423986J38034J98307K49786K95106L41660L87886M47868N26973O47185
11953H656791P88758R73702J204946J498894J865411K308149K843450L463421
11945B3603522M126020M731859N080617M899235L950516K202643l8931k244924
11937D6310557l885790m723319m828232m456880l867716l234264k648601k141163
$$ y = [2049008, 2216941, 2413069, 2637836, 2897065, 3208406, 3587261, 4048692, 4609888, 5295793, 6143056, 7184240, 8445593, 9944651, 11657192, 13478751, 15194840, 16490458, 17072045, 16810332, 15813889, 14357400, 12746286, 11203182, 9841429, 8699051, 7775442, 7046784, 6484175, 6057539, 5742432, 5524909, 5398224, 5343674, 5352355, 5423986, 5562020, 5760327, 6010113, 6305219, 6646879, 7034765, 7482633, 8009606, 8656791, 9445549, 10419251, 11624197, 13123091, 14988502, 17296651, 20140101, 23603522, 27729542, 32461401, 37542018, 42441253, 46391769, 48594412, 48555481, 46310557, 42424767, 37701448, 32873216, 28416336, 24548620, 21314356, 18665755, 16524592]
11929A6524592j717704j368136j075068q39138o48534m81622l53269k43586j45194
11920I652341p0939r607N1089J23662K13005L20614M43063N96396P93693J028349
11910A3141666J323806J680556K112069K625791L223634L870726M491405M919085
11902C7388738M906032M198520K683288N40588j735595l581135m652777m954589
11894C4793070m707330m168816l551693k955628k431384j996164j629754j329424
11886A2022877j086406q91423p31978o07777n13307m39529l91693l51534k95996
11877F713234k38529j83425j14657m5271K5823J07919K07653L13966M32811N84533
11867G804057P58185R60424J179592J401020J579998J623748J454619J005765
$$ y = [16524592, 14806888, 13438752, 12363684, 11524546, 10876012, 10394390, 10041121, 9797535, 9652341, 9581402, 9571795, 9622884, 9746546, 9959551, 10280165, 10723228, 11319624, 12113317, 13141666, 14465472, 16146028, 18258097, 20883888, 24107522, 27978248, 32469653, 37388738, 42294770, 46493290, 49176578, 49717166, 47981571, 44400436, 39747659, 34793070, 30085740, 25916924, 22365231, 19409603, 16978219, 14982055, 13352301, 12022877, 10936471, 10045048, 9313070, 8705293, 8191986, 7752457, 7360764, 7009230, 6713234, 6474705, 6291280, 6176623, 6131352, 6157175, 6265094, 6472747, 6786713, 7219524, 7804057, 8562242, 9522666, 10702258, 12103278, 13683276, 15307024, 16761643, 17767408]
11859A7767408L04024m79621j149514j571511j722692j672851j510881j307718
11851H656644j105225r26772p76636o43490n43070m56944l83776l31694k90030
11842C199007k56173k28811k07809j83535j68412j46960j35285j23117j07424
11833A641481r6864r2760q1662p1662o9779o2682n7639m8650m1790l8494m0232
11822I39267l7462l2418k8480k7734k6810k4848k2952k1244k4996k6825k3417
11811F42081k3262j7850k4326k3653j8223j8627k0560j8983j8270j7975j7554
11800D22798j5621j4773j5599j0219j1329j1082j2027n365o082p989r261m345
11788B99106q183p463o199o743m167j722l419M88j049q71L282K186q019o388K81
$$ y = [17767408, 18071432, 17591811, 16442297, 14870786, 13148094, 11475243, 9964362, 8656644, 7551419, 6624647, 5848011, 5204521, 4661451, 4204507, 3820731, 3489037, 3199007, 2942834, 2714023, 2506214, 2322679, 2154267, 2007307, 1872022, 1748905, 1641481, 1544617, 1451857, 1370195, 1298533, 1228754, 1166072, 1108433, 1059783, 1017993, 979499, 939267, 901805, 869387, 840907, 813173, 786363, 761515, 738563, 717319, 692323, 665498, 642081, 618819, 600969, 576643, 552990, 534767, 516140, 495580, 476597, 458327, 440352, 422798, 407177, 392404, 376805, 366586, 355257, 344175, 332148, 326783, 320701, 312712, 303451, 299106, 290923, 283460, 277261, 270518, 266351, 264629, 261210, 261698, 260649, 259778, 263060, 265246, 257227, 250839, 251120]
11773B51120m259o125n044p841j2753j2827q400o889p194p804l600n192n888p378
11759A49926l122m794k76j14n561p229j902K784j89j720k574l015O62L956K263
11744A29095N26K281k067l635j71p1l718k165j708m317m495l970k868o306n324
11729I1087k885k117k884k979m991k474k979l065j759l483m802J820J920j724
11715E8685l087K380K555K388K12l726J165K343l888n411J61J049Q0P04O50K155
11699E8415J968j974l553o212p051n928L464L599k764O07L259k831l761j053m388
11684C1797j96J386K627r1o422j068L140p86k834L81K06K777K947j59m565q78
11668B8262K85P69j066j709k133j543o8k432L514P639J324k794m663k167l435
$$ y = [251120, 246861, 240736, 235692, 227851, 215098, 202271, 193871, 186982, 179788, 171984, 168384, 163192, 157304, 149926, 146804, 142010, 141734, 141620, 136059, 128830, 126928, 129712, 129523, 127803, 125229, 122214, 122876, 126832, 129095, 129621, 131902, 129835, 126200, 126029, 125958, 122240, 120075, 118367, 114050, 109555, 105585, 102717, 96411, 91087, 88202, 86085, 83201, 80222, 75231, 72757, 69778, 66713, 64954, 61471, 56669, 58489, 60409, 58685, 55598, 57978, 60533, 62921, 63133, 59407, 60572, 62915, 59027, 53616, 53777, 54826, 54906, 55610, 56260, 58415, 60383, 58409, 54856, 48644, 41593, 35665, 39129, 42728, 39964, 40571, 43830, 40999, 37238, 36185, 31797, 31601, 32987, 35614, 35523, 29101, 28033, 31173, 30387, 27553, 27934, 28140, 30917, 33864, 33705, 29140, 28262, 28547, 29316, 28250, 26541, 24408, 22865, 22797, 20365, 23879, 31518, 32842, 30048, 25385, 23218, 19783]
11653A9783J10K745p79j364M17k777l15M137M791o24l172q86j645j272j406J809
11637A9552K663J334l94p48j854R1q78m096j850K171M134r25n211k651j760J086
11621A0664L472N169L191m124m843k529M244K388k323j955n78j331J21j185l986
11606F395P74N45n178l04K126L069J582L750Q29m537q502k444M705j33k436Q87
11590A128K470J660J2K424K240l144j169j998k704l762R73L765M792l093m06K422
11574E610l065j151l338J479n007j277Q69M255k09O58j799J060R8j066j202J983
11558b102K945l534k265J146m87o71L815R46K726J326l061K059K482K653k111
11543E867P36J836N0r58l82M378K577N267M345K831J50N670P287J1558O756J922
$$ y = [19783, 19893, 22638, 21859, 20495, 20912, 18135, 17820, 21957, 26748, 26124, 22952, 22066, 20421, 19149, 17743, 19552, 22215, 23549, 23155, 22407, 20553, 20644, 19766, 15670, 13820, 15991, 20125, 19200, 13989, 11338, 9578, 10664, 14136, 19305, 22496, 18372, 13529, 11000, 15244, 17632, 15309, 13354, 12776, 11445, 11566, 10381, 6395, 7169, 7714, 2536, 2232, 4358, 7427, 9009, 12759, 13588, 9051, 549, -1895, 2810, 2677, 241, 1128, 3598, 5258, 5270, 7694, 9934, 6790, 5621, 3623, 919, -2843, -1870, 1895, 6687, 3594, 3188, 5610, 2545, 1394, -1944, -465, -5472, -6749, -5880, -1625, -1834, -1176, -2975, -1915, -1817, -2883, -4085, -2102, 843, -2691, -4956, -3810, -4297, -4968, -1153, -207, 2519, 3845, 784, 2843, 5325, 7978, 5867, 6603, 8439, 8489, 7531, 7149, 11527, 14104, 19371, 23716, 26547, 26697, 32367, 39654, 51212, 57968, 59890]
11527E9890N590N562J488j335m254j0714p169l357o435m096p003p672m266J26
11513A6355J267J609L33k546j148M329L337J696K709j113K607n49M5L083J1016
11498D3030M159m23M931J2954J2654J6481K1191K2047K1378K0827K1044J8441
11486B18714J2327K635p309j5231j8720j9559k0505k4409j9535j3771j1483q902
11474G4252r596r868k916J204j372N35q43L106J639j463n22J062j697J8j972K988
11458E4555R061N66N753R880Q834J6068J6172J4629J8428K4450K4977K1759J5684
11445B40816K104q019j4243j7872k0759k4733k6870j6938j3277j1749r940o256
11433G2264o708p121n713r413o01j509m940l002J093j566M8j22l353q02k044m019
$$ y = [59890, 65480, 71042, 72530, 71195, 66941, 56227, 49058, 45701, 39266, 35170, 28167, 20495, 16229, 16355, 17622, 19231, 19564, 17018, 15870, 20199, 23536, 25232, 27941, 26828, 29435, 28886, 28931, 32014, 43030, 47189, 46766, 51697, 64651, 77305, 93786, 114977, 137024, 158402, 179229, 200273, 218714, 231041, 233676, 226367, 211136, 192416, 172857, 152352, 127943, 108408, 94637, 83154, 74252, 64656, 54788, 51872, 53076, 51704, 52239, 51396, 54502, 56141, 54678, 54156, 55218, 53521, 53539, 51567, 54555, 63616, 64182, 69935, 79815, 88649, 104717, 120889, 135518, 153946, 178396, 203373, 225132, 240816, 242920, 234901, 220658, 202786, 182027, 157294, 130424, 113486, 100209, 88460, 78520, 72264, 65556, 58435, 52722, 43309, 42708, 41199, 36259, 33257, 34350, 32784, 32832, 32710, 29357, 28555, 26511, 22492]
11417B2492K480K243J813P483M656J923K721N222L512P801R822J0207N243k077
11403H5541j335n631j0682j1889j1932n266l605l769p199m166l787k817N92j634
11389A2421J10K425N159j839n212O90j157j832k402r06J475r24J568L136Q067
11374B0779J0197J0864J3166K5161L4854M4240K7728O616k1957m3074l6500k7384
11362F4690j8004j3462m682n667l753j690m052k980l884k331P87L851l54K164
11348A0633l46k856L309R26J247j08j236k388J504N749qL552Q045P229R231K2538
11332F7021K9599M4242O0286P8118P7535M9414k85n7692q7092p9177n4587l4301
11320I3081k6349j3723j0021n943o947q294j254m138l553l096k022l430k214N98
$$ y = [22492, 24972, 27215, 29028, 36511, 41167, 43090, 45811, 51033, 54545, 62346, 72168, 82375, 87618, 85541, 84206, 78575, 67893, 56004, 44072, 38806, 35201, 31432, 24233, 20067, 16280, 13463, 14055, 12421, 12531, 14956, 20115, 18276, 13064, 13754, 12597, 10765, 8363, 7457, 8932, 8008, 9576, 12712, 20779, 30976, 41840, 55006, 80167, 115021, 159261, 186989, 193605, 171648, 128574, 92074, 64690, 46686, 33224, 28542, 22875, 19122, 17432, 13380, 10400, 6516, 4185, 4972, 8823, 8469, 10633, 10287, 7431, 10740, 11666, 12913, 12805, 11569, 9181, 10685, 16434, 16426, 19978, 28023, 35252, 44483, 67021, 96620, 140862, 201148, 279266, 356801, 406215, 405930, 348238, 261146, 181969, 127382, 93081, 66732, 53009, 42988, 37045, 30098, 21804, 20550, 16412, 12859, 9763, 7741, 4311, 2097, 2695]
11306B695O798P442M40k504K05m074m267K317M354j17l56K187O693J0350J4660
11291D6823J9267K5639L9722M3726L7066J6046k0279m5146n0657l6758k0373j2653
11279D2423j0946q531o315j747l375j801M054P49n843l214l28l114m529k469J020
11264c966P95j177k172P62k562k404K178L206r51n406j007J384O56q75K600K894
11248f045l452Q47K814K8K88p41k349q39J303L505K603K588L769j25l727q76K86
11231a23j210m01J534k13K800K063l411J74K157K181k67K276k909J96r78j020
11215B849l855j077R17P49N790k462l459l518o504N0M275L712K207k646l149K979
11199c142J439L859M088L994r26j463m75o00J016L603O7J516l058J306J590J793
$$ y = [2695, 9493, 16935, 17375, 14871, 15076, 11002, 6735, 9052, 13406, 13289, 12933, 15120, 21813, 32163, 46823, 66090, 91729, 131451, 175177, 212243, 228289, 208010, 162864, 112207, 75449, 55076, 42423, 31477, 22946, 16631, 14884, 11509, 9708, 13762, 14511, 8668, 5454, 5126, 2012, -2517, -4986, -3966, -3171, -4348, -6520, -5758, -8320, -10724, -8546, -5340, -6291, -11697, -12704, -11320, -10664, -11539, -8939, -6045, -9497, -8650, -5836, -5808, -5520, -6261, -8610, -9449, -8146, -4641, -2038, 550, 4319, 4194, 467, -409, -123, -1333, -1734, -200, -413, 2387, 4450, 1039, 1213, 3370, 5551, 5284, 7560, 4651, 4847, 3869, 2849, -1006, -2083, -1166, -417, 5373, 2911, -548, -4066, -10570, -10520, -6245, -2533, -326, -2972, -6121, -3142, -1703, 2156, 6244, 10238, 9312, 7849, 7374, 6774, 7790, 11393, 11460, 12976, 9918, 11224, 12814, 14607]
11183A4607M467J591l811k199N173L678k154k03Q63J224k726n010J262K55k119
11168A4898j544P86O87Q54k783n021M488K503j472L243J464L39j232L63K971L713
11152B4257J398k69K140K728L693r7J531P479M166N833M729O160M544J185J1127
11137H0604Q496O422J2209J0748J1039P515R147M113k318j885l479l046p763j2383
11123A19419j0126q315n930l530n404n984k737o650k192K135l68k78k902J83K685
11108G0006N984P589K229j110j45P622J2799N291O630R850R886J5140J9225J9835
11094A90831J5561K1213J8387K0872K2067J8149J0085J1485O61j5412j4337j6613
11082B82949k5943k4919k7182k6646k3596j6324j4715j1934o701j0450q858l449
$$ y = [14607, 19074, 20665, 16854, 14655, 19828, 23506, 21352, 21149, 22012, 23236, 20510, 15500, 16762, 17017, 14898, 13354, 14140, 14827, 15681, 12898, 7877, 12365, 14868, 13396, 16639, 18103, 18442, 17210, 17573, 20544, 24257, 25655, 25386, 27526, 30254, 33947, 33850, 35381, 42860, 47026, 52859, 57588, 63748, 68292, 69477, 80604, 89100, 95522, 107731, 118479, 129518, 137033, 146180, 150293, 147975, 146090, 142611, 139565, 131802, 119419, 109293, 100978, 95048, 91518, 86114, 80130, 77393, 70743, 68551, 70686, 70318, 70040, 67138, 67321, 70006, 75990, 83579, 85808, 84698, 84553, 92175, 104974, 110265, 116895, 126745, 136631, 151771, 170996, 190831, 206392, 227605, 245992, 266864, 288931, 307080, 317165, 328650, 329311, 313899, 299562, 282949, 257006, 232087, 204905, 178259, 154663, 138339, 123624, 111690, 104989, 94539, 85681, 82232]
11070H2232M15j053n021l962K173K559N589J925j511K904J092K836L900J1281
11056A05359J0149P849J0596J0689J0615J0423J2389J8232K9229K9320K9207L1156
11044C15213K0908J2326J1566m683l5396n8789n7712m0756k7497j8205j2389j4112
11032I0474j0406j0375j1986m970j107J06k286j832k665m668p181j198K776L335
11018C8017o75K071K77j250k650k3K671M374L182N063O022J0132J4456K2313K4070
11003A28050K4733J7783M371p76j4032k3307k4410k3944k1593j4937r305o533
10991C6100n153k317k20l479J992p13j557M93J355j622k834k463J606l470K256
10976A9974o8J29N84k655l490K520J584L55K499K061k887l538j339K139O127O526
$$ y = [82232, 82647, 81594, 76573, 72611, 74784, 77343, 82932, 84857, 83346, 86250, 87342, 90178, 94078, 105359, 115508, 123357, 133953, 144642, 155257, 165680, 178069, 196301, 225530, 254850, 284057, 315213, 336121, 348447, 360013, 355330, 319934, 261145, 203433, 162677, 135180, 116975, 104586, 90474, 80068, 69693, 57707, 52737, 51630, 51736, 49450, 47618, 44953, 40285, 33104, 31906, 34682, 38017, 37342, 39413, 39690, 38440, 35790, 35767, 38438, 42812, 45994, 51057, 57079, 67211, 81667, 103980, 128050, 152783, 170566, 174937, 174161, 160129, 136822, 112412, 88468, 66875, 51938, 42633, 36100, 30947, 28630, 28410, 24931, 26923, 26210, 24653, 25146, 26501, 24879, 22045, 19582, 21188, 17718, 19974, 19906, 20035, 20619, 17964, 14474, 16994, 18578, 18933, 21432, 23493, 20606, 17068, 15729, 17868, 23995, 30521]
10960C0521k130l605L61K881N030p01L04J606L309j898l792K740J650k593l068
10945C0615L086J209n321m185J629rk75L23n49k114K778p48k773m48J816J723
10929B6757M91j290M371Q78K134Q48j894l670L436P488R747O911M471J785J071
10914F3534J410k050j375k82j249k856L33J006k245k479p30J795L841L150m592
10899E7211p524m834k894k457m774K542O710L132j951m71r24p36J221K881N333
10884E2465J476k034J396Q238L425L760K16J908J494m273q69J671R03j696l348
10869F4732j375k311j281j478O30K650M208O647M912R417O942K312p284p970l359
10854G7392p611N50J980M50J531L731j737J021L668M266n30L160M894J229J484
$$ y = [30521, 28391, 24786, 25147, 28028, 33058, 32357, 32661, 34267, 37576, 35678, 31886, 34626, 36276, 33683, 30615, 33701, 34910, 29589, 25404, 27033, 27024, 26749, 27072, 26523, 24409, 27187, 26439, 23666, 23218, 25034, 26757, 27248, 25958, 30329, 31207, 33341, 34189, 32295, 28625, 32061, 39549, 49296, 56207, 60678, 62463, 63534, 64944, 62894, 61519, 61237, 59988, 57132, 57465, 58471, 56226, 53747, 53017, 54812, 58653, 61803, 57211, 49687, 44853, 41959, 39502, 34728, 37270, 43980, 47112, 45161, 44690, 43766, 43030, 44251, 47132, 52465, 53941, 51907, 53303, 61541, 64966, 68726, 68942, 70850, 72344, 68071, 67202, 68873, 69776, 68080, 64732, 63357, 61046, 59765, 58287, 58917, 61567, 65775, 72422, 77334, 86751, 93693, 96005, 88721, 80751, 77392, 69781, 70331, 72311, 72761, 74292, 78023, 76286, 77307, 80975, 85241, 84711, 87871, 92765, 93994, 95478]
10839I5478J744J717K721J027R06J519L986J528J815J441J906J668Q67j725K555
10824A19153N143j290L485M744N646O274P911L546k618k025j061m047J56M120
10810A49137N047M668P167M639Q393N363N049L253R33M319L209P57N869L664L140
10795B14607O077M800N164N247Q175J1552J1247O943J985J1796R990N358P934
10782C10875N029J821N285N825P850Q239N276N830R827R627J3211J1608R711J1957
10768D21971J2002J1694J3861R981J1788J1519J4906J3138J2963J7852J9132K0065
10756E90872J5851J7745K0405K7582L0367L2810L0136L1647L5981L8635L7712
10745I09743L9336M5506M8312N4944N3143N2427N9158O6140O9611P7927Q3847
$$ y = [95478, 97222, 98939, 101660, 102687, 103593, 105112, 109098, 110626, 112441, 113882, 115788, 117456, 118323, 116598, 119153, 124296, 123006, 126491, 131235, 136881, 143155, 151066, 154612, 151994, 149969, 148908, 144861, 145017, 149137, 154184, 158852, 166019, 170658, 179051, 184414, 189463, 192716, 193649, 197968, 201177, 201934, 207803, 211467, 214607, 220684, 225484, 230648, 235895, 244070, 255622, 266869, 273812, 275797, 287593, 297583, 302941, 310875, 315904, 317725, 323010, 328835, 336685, 344924, 350200, 356030, 365857, 375484, 388695, 400303, 410014, 421971, 433973, 445667, 459528, 469509, 481297, 492816, 507722, 520860, 533823, 551675, 570807, 590872, 606723, 624468, 644873, 672455, 702822, 735632, 765768, 797415, 833396, 872031, 909743, 949079, 994585, 1042897, 1097841, 1150984, 1203411, 1262569, 1328709, 1398320, 1476247, 1560094]
10734A560094R0414R8905J05787J13535J17063J24816J33185J44120J56743J75183
10724B819845J97646K22489K50040K85617L21259L55039M08860M65786N28158
10715E854739O05555P00411Q09079R35941J085565J253661J442112J640814J836090
10706A6163967J995161K081880K047836J854003J473942R17686K60331m07376
10698B6387430r82423j400217j636994j716539j666131j532821j365339j188292
10690A4898674j010476q42775o92329n45317m09429k92795j80611p5195K2330
10681A0872077J22428K18979L15144M16485N30034O61556Q06979R79425J183049
10672A6106156J427232J700547K010318K351483K717289L077210L392976L591788
$$ y = [1560094, 1650508, 1749413, 1855200, 1968735, 2085798, 2210614, 2343799, 2487919, 2644662, 2819845, 3017491, 3239980, 3490020, 3775637, 4096896, 4451935, 4860795, 5326581, 5854739, 6460294, 7160705, 7969784, 8905725, 9991290, 11244951, 12687063, 14327877, 16163967, 18159128, 20241008, 22288844, 24142847, 25616789, 26534475, 26794806, 26387430, 25405007, 24004790, 22367796, 20651257, 18985126, 17452305, 16086966, 14898674, 13888198, 13045423, 12353094, 11807777, 11398348, 11105553, 10924942, 10849747, 10872077, 10994505, 11213484, 11528628, 11945113, 12475147, 13136703, 13943682, 14923107, 16106156, 17533388, 19233935, 21244253, 23595736, 26313025, 29390235, 32783211, 36374999]
10664C6374999L592062L309965K696973J750226N86899o35711j747701k590823
10656D3336889l115836l344356l327499l150435k877007k563413k248938j949236
10648B0760169j678627j434257j223775j041115q85431p57594o44008n39233m40710
10639A2115419l46584k47719j50108m6716N8510J69644K89072M16226N55609P02163
10629A3515516Q59326J023703J184991J336558J445340J471249J389625J159885
10621B3386193P88835L00677k45858p59773j184187j474988j623591j650437j587970
10612A5948901j478746j348214j201962j063770r40339q24095p26972o41013n67954
10603G155836n06509m48627m01897l64736l30203k91475k62439k30754k01845
$$ y = [36374999, 39967061, 43277026, 45973999, 47724225, 48311124, 47675413, 45927712, 43336889, 40221053, 36876697, 33549198, 30398763, 27521756, 24958343, 22709405, 20760169, 19081542, 17647285, 16423510, 15382395, 14496964, 13739370, 13095362, 12556129, 12115419, 11768835, 11521116, 11371008, 11324292, 11382802, 11552446, 11841518, 12257744, 12813353, 13515516, 14374842, 15398545, 16583536, 17920094, 19365434, 20836683, 22226308, 23386193, 24175028, 24475705, 24229847, 23470074, 22285887, 20810899, 19187308, 17536871, 15948901, 14470155, 13121941, 11919979, 10856209, 9915870, 9091775, 8364803, 7723790, 7155836, 6649327, 6200700, 5798803, 5434067, 5103864, 4812389, 4549950, 4319196, 4117351]
10594D117351j74388j52954j36709j27246j28937j28600j31983j40707j43353
10585B852474j34006j24144j13995j02578r2495q4950q1295p2912o2597o3188
10575A920314o3966n6599n0772n1762m9638m3505m2400m5241l4682l3273l4853
10564A413623m0990m0710l7292l7821l6601l0281k8588l0308k6553j8123q757
10553A077599L918J8669L9051L7426M543l0708l9384m1796m5847m7794m6275m0922
10541H88480k8699j9119j0029K569K2252L8162L5236J4349j8294n5583p2701o3458
10529G33165m8373l5354k7402k1606j8301j7661j6482j2237j1965j6442j5924
10518D91418j2906j1990r607p191k917R60j868k896R724J3057J1342O301l924
$$ y = [4117351, 3942963, 3790009, 3653300, 3526054, 3397117, 3268517, 3136534, 2995827, 2852474, 2718468, 2594324, 2480329, 2377751, 2285256, 2200306, 2119011, 2046099, 1983502, 1920314, 1856348, 1799749, 1748977, 1697215, 1647577, 1604072, 1561672, 1516431, 1481749, 1448476, 1413623, 1372633, 1331923, 1294631, 1256810, 1220209, 1189928, 1161340, 1131032, 1104479, 1086356, 1077599, 1081517, 1100186, 1139237, 1176663, 1181206, 1150498, 1111114, 1069318, 1023471, 975677, 929402, 888480, 859781, 840662, 830633, 833202, 855454, 893616, 928852, 943201, 924907, 869324, 796623, 733165, 684792, 649438, 622036, 600430, 582129, 564468, 547986, 535749, 523784, 507342, 491418, 478512, 466522, 456915, 449724, 446807, 447767, 445899, 443003, 452727, 465784, 477126, 483427, 479503]
10505D79503l073q758j5018j5050j1950p798N990K5365N4201Q3858R9275O3507
10493G50052j7794p4482q9501q4808o7294m9755l7595k6313k1112k0309j2044
10482B49045j0126j0826j1599p090m510l41n664k463O12m28M53k437J061p637
10468A88050j213L105N117O683J548n344r207o663J110K831Q972J4642K3549L2215
10454B65395L6929K3738q059l4775m8962l9862k8583k1858j3445p039j1259o646
10442A05574k141k173j799K589j085o675q325O59R38k181P06J653j704m896M73
10427H1613J50q36K302n05r32k166j731l344K028L373l769k982j948j542l436
10412F6275k205n999m24J199k570R98K339l34j394m007K125M16n97J494m034p807
$$ y = [479503, 476430, 467672, 452654, 437604, 425654, 417856, 423846, 449211, 503412, 587270, 686545, 750052, 732258, 657776, 568275, 483467, 416173, 366418, 328823, 302510, 281398, 261089, 249045, 238919, 228093, 216494, 209404, 204894, 204553, 198889, 196426, 197038, 196610, 197063, 194626, 195687, 188050, 186837, 189942, 195059, 201742, 203290, 197946, 188739, 182076, 183186, 186017, 194989, 209631, 233180, 265395, 302324, 326062, 318003, 283228, 234266, 194404, 165821, 143963, 130518, 123479, 112220, 105574, 103433, 101260, 99461, 102050, 100965, 94290, 85965, 86624, 87562, 85381, 86087, 87740, 86036, 81140, 81613, 81763, 80927, 83229, 82724, 81792, 79626, 77895, 74551, 76579, 79952, 76183, 73201, 71253, 69711, 66275, 64070, 58071, 57647, 58846, 56276, 57274, 59613, 59279, 57885, 53878, 56003, 56419, 55822, 57316, 53282, 45475]
10396D5475K04M781r63q39J133r31j364j085j774J407j59k443m687j103j662j967
10380C4023k995M41M839J426n82k007k695J561M43l961j194o81M192Q98l210m40
10364C0058J433j487l013j149p29L461K80n110L07j0l677K303k70L75J365L859
10348B7996j08o324m169l47J265L157k056m148o523J29J898J521j116J832N173
10333A8180K527m933m146j738q63K747O320M889j081n916m345k125j06l826J088
10318F672M213P31j333K489R0k001J489j146k397J341j647L76L364L136J085j057
10302A5405J94j245L03J233q28l725k170J302L908N624J912K595J735m677m673
10287A6893m819J767N863L992L916r00J511K214J270O146M986K164O305N362R517
$$ y = [45475, 45679, 50460, 49497, 48658, 49791, 48860, 47496, 46411, 44637, 46044, 45885, 43442, 38755, 37652, 35990, 34023, 31028, 31469, 36308, 37734, 37152, 35145, 32450, 34011, 34454, 30493, 29299, 28618, 32810, 33708, 30498, 30058, 31491, 30004, 26991, 25842, 25113, 28574, 28854, 23744, 24051, 24041, 20364, 22667, 22397, 22772, 24137, 27996, 27888, 21564, 17395, 17048, 18313, 21470, 19414, 15266, 8743, 8872, 10770, 12291, 11175, 13007, 18180, 20707, 15774, 11628, 9890, 9027, 11774, 18094, 22983, 21902, 15986, 11641, 9516, 9410, 5584, 6672, 10885, 11616, 10283, 12772, 12862, 10861, 12350, 11204, 8807, 10148, 8501, 8877, 12241, 15377, 16462, 15405, 15599, 14354, 14657, 15890, 15062, 11337, 9167, 10469, 14377, 20001, 21913, 24508, 26243, 21566, 16893, 12074, 13841, 19704, 23696, 27612, 26712, 28223, 30437, 31707, 37853, 42839, 45003, 51308, 56670, 66187]
10272F6187J1879Q969J6171J1486J0118P347Q825N094m153l949j758o787q364
10259A21065r587q327q583q114l589q012l611j122m046l057m483j762j780K55
10245E5247J855O61J955J207M557M512P333Q026O550J0836R855J3930J5045J5074
10231A56643J8390J9340K1151J2227J1727J2525O577k285r388q128j4130j5634
10219B09015j3344j9550j7731j5363j6333j4040r899j0297o924r251l070N26l925
10206F9814r525K414L929M93j354j282J942j17L6M635L722Q34J323O035L786L412
10190I0097M913Q744N684M537R469P378J456n004m280j0133r236r750r475r039
10176G5361r161r773r067n619j352k018l639m781n155l298l186r29J684j335J261
$$ y = [66187, 78066, 87035, 103206, 114692, 124810, 132157, 140982, 146076, 141923, 137974, 136216, 129429, 121065, 111478, 103151, 94568, 86454, 82865, 74853, 71242, 70120, 66074, 63017, 58534, 56772, 54992, 55247, 57102, 57763, 59718, 60925, 65482, 69994, 77327, 85353, 91903, 102739, 112594, 126524, 141569, 156643, 175033, 194373, 215524, 227751, 239478, 252003, 258580, 256295, 246907, 238779, 224649, 209015, 195671, 176121, 158390, 143027, 126694, 112654, 102755, 92458, 85534, 76283, 73213, 73739, 69814, 60289, 62703, 66632, 67125, 65771, 64489, 66431, 66314, 66350, 70985, 74707, 75541, 76864, 82899, 86685, 90097, 95010, 103754, 109438, 113975, 123444, 130822, 132278, 127274, 122994, 112861, 103625, 93875, 84400, 75361, 66200, 56427, 47360, 41741, 40389, 38371, 34732, 29951, 24796, 21498, 18312, 17383, 19067, 17732, 18993]
10161A8993k144n116k890l81J606m39j239m044l326l071k287J666R54n32J495
10146g55K52R81j432m99j112r88k040P14L28P33N65r25q14L93J815L78m925l21
10128g652J453j26m25k95k568O66L075j860o86L458J041o08n47J776P29l316l608
10111i493m440j874M067M79O374J700l74k90l572j602P95L46L940N94n127k009
10095a0486k587M470O07l532J215J343j618m22J99M18J078j724k015K270N127
10080e657O94k421n81J930n58k035J461M45N79k810O08j609l531K011L981j318
10064h811l442L33K94j078M98j365j08J69o16j830j194J694l257K02J237R72j33
10047a6435p87k061J190P007L572n251l954j222j307L366M05k064J885M797J604
$$ y = [18993, 16849, 11733, 8843, 8462, 10068, 9629, 8390, 4346, 1020, -2051, -4338, -2672, -1718, -2250, -755, -503, 478, -954, -1453, -2565, -3553, -5593, -4879, -4551, -3818, -3253, -4178, -4992, -4599, -2784, -2406, -7331, -7652, -6199, -6325, -6750, -7045, -9613, -8947, -5872, -7732, -8418, -4960, -3919, -4527, -5074, -3298, -2569, -5885, -9493, -13933, -15807, -11740, -11261, -4887, -3187, -3561, -3851, -7423, -9025, -8230, -7884, -3944, -3350, -8477, -10486, -13073, -8603, -7996, -11528, -10313, -8970, -10588, -11010, -10811, -10393, -9315, -11039, -13054, -10784, -5657, -4963, -7384, -7965, -6035, -6593, -8628, -7167, -6722, -6143, -8953, -8345, -9954, -13485, -11474, -7493, -8811, -12253, -11920, -11626, -12704, -12206, -13571, -13679, -13510, -14126, -15956, -17150, -15456, -18713, -18511, -17274, -16302, -16435, -17222, -19283, -18093, -11086, -7514, -12765, -16719, -17941, -19248, -15882, -15477, -17541, -15656, -10859, -9255]
10032i255J857k934p722k847J066L591O892k847j929N64j882n307j071N67K679
10017a8578K587k43N93J902K66j034k778j241N65J566j427k061K01M746N230l78
10001a0084n336j006R51m45p3l995l990M441K14M754J531K740K209J060J383J95
9985e451j774n27n558m362l796l038N12M575K049M11M315k301l54j221J648q68
9969a5740m352Q08K339L8k026j564K34j685K6J812k317l69m35K877J404j717K243
9952a8424K097J138j041m167j728J438N567j530n36m924P54q87O36K103M720o3
9936a4847k440L22j030m235J152L250J005J877L577L283j242J021o3l041n944
9921a7355m892p77j152K391K892L116K532Qp1J102k78m737k706o50p880L65Q082
$$ y = [-9255, -7398, -10332, -18054, -20901, -19835, -16244, -9352, -12199, -14128, -13564, -15446, -20753, -21824, -21257, -18578, -15991, -16234, -15641, -13739, -13473, -14507, -17285, -18526, -17961, -16395, -17822, -19883, -19682, -14936, -9706, -10084, -15420, -16426, -15475, -15920, -15993, -19988, -23978, -19537, -19323, -14569, -13038, -10298, -8089, -7029, -5646, -5451, -7225, -7752, -13310, -17672, -21468, -24506, -23994, -19419, -17370, -16959, -12644, -14945, -15299, -16520, -14872, -15740, -20092, -19284, -16945, -16907, -18933, -20497, -20263, -21948, -21922, -20110, -22427, -22796, -23231, -20354, -18950, -20667, -18424, -16327, -15189, -16230, -20397, -22125, -20687, -15120, -16650, -17186, -22110, -21356, -22243, -21607, -19504, -14784, -14847, -17287, -16965, -17995, -22230, -21078, -17828, -16823, -14946, -11369, -8086, -9328, -8307, -8370, -11411, -17355, -22247, -23024, -24176, -21785, -18893, -15777, -13245, -13237, -13308, -12206, -12484, -17221, -19927, -20577, -28457, -28092, -20010]
9904b0010K559j152L87K228O23K663J630K48K349N50l390l89J474r81Q33n75k17
9887a1170L93L023k093p10j53k003m209j333J462L144L445J466k624K155k279
9872a1486M22K157j355m82j08j976k282j94J872k47R81k861K30N770J902L297
9856d360L771K51l608l310J910r27L80k21L524M602M785Q17j567n558j526l18
9840a355j887k547M842J256k223M255N600Q46L898M031j620n102k603n751q496
9825f856n219l228M228L788l737k204K483K979k374L56K280m87k526m622m97J969
9809a3667K271j994N43N381K800J556J464K96l49l612k287J260K612L69k208l306
9793h871K381k507o71L915L574k706l601J04J813K204j36j847p71J010M16J944
$$ y = [-20010, -17451, -18603, -18216, -15988, -15365, -12702, -11072, -10824, -8475, -7925, -11315, -11704, -10230, -11211, -10378, -10953, -11170, -10777, -7754, -9847, -10557, -10710, -12713, -16922, -18255, -16793, -13649, -10204, -8738, -11362, -9207, -11486, -11064, -8907, -10262, -10744, -10852, -12828, -15110, -15304, -13432, -13679, -12698, -15559, -15329, -9559, -7657, -4360, -589, -338, -3946, -7256, -5346, -6273, -5893, -6114, -2590, 2012, 6797, 7614, 6047, 489, -1037, -1355, -3242, -5789, -947, 309, -1914, 2341, 7941, 8787, 12685, 16716, 15096, 9994, 7391, 1640, -6856, -12075, -15303, -11075, -7287, -11024, -13228, -10745, -7766, -10140, -9784, -7504, -7991, -10517, -15139, -15636, -13667, -11396, -13390, -12847, -7466, -4666, -3110, -1646, -1350, -1699, -5311, -7598, -6338, -3726, -3357, -5565, -8871, -6490, -8997, -9668, -5753, -2179, -4885, -8486, -8382, -6569, -4365, -4501, -6348, -7119, -6109, -5693, -3749]
9777c749N149j365K17K483K051J027M70j538j965o57j679k667K58K026j581q00
9761b320j024L415K169q48k03L708L284k067J81N114J972j922K312K26l372l427
9745G198K239M765m82l80r56m645k636J499N543N616n62P53j341k060N257L450
9729B3258m104k248L217M841J379j738r48J739j200O75N443O332L751J887M627
9714D6911J911J05n49K380K538k102K821P280P034K182J825O635O433L623N661
9699I4688P625N412M207O989R538Q470R812J2563J0394J3552J7062J9768J8223
9686B38303J6855K1410K4540L0133L0239L6978M1419M3860M9962N7424O3260P0659
9674G25042P5569Q7076R4787R6476J02506J02769R2582Q4080O9202N0978K4560
$$ y = [-3749, 1400, 35, 252, 2735, 4786, 5813, 6283, 4745, 2780, 2123, 444, -2223, -1965, 61, -1520, -2320, -3344, 71, 2240, 1392, 1189, 4897, 8181, 6114, 6295, 11409, 13381, 11459, 13771, 13997, 10625, 7198, 9437, 14202, 13720, 13340, 12384, 7739, 5103, 6602, 12145, 17761, 17199, 17952, 16611, 14551, 19808, 23258, 19154, 16906, 20123, 24964, 26343, 24605, 23657, 25396, 24196, 24871, 30314, 36646, 40397, 42284, 46911, 48822, 48927, 48378, 50758, 53296, 51194, 54015, 61295, 68329, 70511, 72336, 78971, 85404, 89027, 94688, 102313, 107725, 111932, 118921, 128459, 136929, 146741, 159304, 169698, 183250, 200312, 220080, 238303, 255158, 276568, 301108, 331241, 361480, 398458, 439877, 483737, 533699, 591123, 654383, 725042, 800611, 887687, 982474, 1078950, 1181456, 1284225, 1376807, 1460887, 1530089, 1581067, 1605627]
9663A605627q271m4319o7488q3626j01004j03423j04786j00047r6177r2829q2647
9652G21010p1367o0686n4529n0352m2298l6385l6497l4274k4957k2217j9539j9616
9640B48293k1220j3632j1349j1881j0721j5005j2035r088p460p783o129o398r886
9627A05706q463o485m293j319l497J511j940o474n468k112lk806n231n652k387
9612E1087n54N6P88K67o15l066m388j944j81m87k121l739l853j56K702J044j936
9595C2904P02P94m132j800k347J236o58J820j711k026m591j559J600l260j517
9580A5455J062l027l560L31L861J189k879k584M322L632J138J744O04R49k899
9565A9338l51m594l284j778k46k233k290J42N80J075K426J130k202k195r17n274
$$ y = [1605627, 1597356, 1553037, 1485549, 1401923, 1300919, 1197496, 1092710, 992663, 896486, 803657, 721010, 649643, 588957, 534428, 484076, 441778, 405393, 368896, 334622, 309665, 287448, 267909, 248293, 227073, 213441, 202092, 190211, 179490, 164485, 152450, 143362, 135902, 128119, 121990, 115592, 105706, 97243, 90758, 86465, 85146, 81649, 83160, 81220, 74746, 69278, 67166, 67163, 64357, 59126, 53474, 51087, 50533, 50589, 51377, 51644, 51029, 47963, 43575, 41631, 41450, 40963, 38842, 35103, 31250, 31094, 33796, 34840, 32904, 33606, 34400, 30268, 28468, 26121, 27357, 26699, 28519, 26808, 24782, 20191, 18632, 20232, 16972, 15455, 16517, 13490, 9930, 10261, 14122, 15311, 12432, 9848, 14170, 17802, 18940, 20684, 21288, 22237, 19338, 18987, 14393, 11109, 9331, 9085, 6852, 4562, 4704, 5284, 6359, 8785, 9915, 7713, 5518, 4601, -673]
9549f73j269p28N67J926K368r28j325j359J10K710n02r91M043M314J427N523j699
9532A3514k465l00J536j24l718q210jn01J314N46m006k871m578K382O806L90J169
9515H83R59j746Q13J615N49k327p48j497j340j777l89L116K551L074o3o42L76
9498C407l931J197n891j764J519R75j081l46Q21j868m710k215L431N306o69j805
9482g624K058M29m244j784j336k979j995J888j283J706O151j067l566k1q70J233
9466a3304J875J342N57j293N32P47l888M15O368J616Q32j716j264q05Q85M232
9450b869j393k766k806l263j278K795M36J464J26K829J505M879M54k887n304R94
9434g084J669j540j165m348k871J326J004j202J865L663o4O14K041O001K527j716
$$ y = [-673, -1942, -2670, -2103, -177, 2191, 1263, -62, -1421, -1311, 1399, 897, -94, 3949, 8263, 9690, 15213, 13514, 11049, 10749, 12285, 12161, 8443, 233, 232, -269, 1045, 1591, -2415, -5286, -9864, -7482, -676, -286, 883, 1842, 96, 909, 2524, 3073, 746, -2, -1499, -2839, -4616, -5005, -1889, 662, 3736, 3673, 3031, 3407, -524, 673, -5218, -6982, -5463, -4488, -5569, -5915, -5094, -6962, -11672, -13887, -10456, -5150, -5819, -7624, -5566, -5137, -9381, -11165, -12501, -15480, -17475, -15587, -16870, -15164, -9013, -10080, -13646, -13667, -14537, -13304, -11429, -10087, -9530, -10823, -10291, -9544, -13432, -13017, -6649, -5033, -4201, -5917, -7181, -7986, -7101, -2869, -4262, -7028, -9834, -13097, -14375, -11580, -11144, -9680, -9554, -6725, -5220, -341, 113, -2774, -8078, -7084, -5415, -6955, -8120, -12468, -15339, -14013, -13009, -14211, -12346, -8683, -8747, -8133, -6092, -91, 2436, 720]
9418G20K229O65l274Q34L295K143N33m891j506K107K291K353j601K425J348j347
9402H324m318M62L074J986K529N73K635j908j864M48J626L16J750k268j157K806
9386A5014K339J916k988l988k701j324P551O599k384m645j502k831k472k302K87
9371F569K237K009k292k71m66l923l067k314J556J706k096J428K366O64J527j212
9355D421L293L142J938K996K610P486K044P029P487L193l376J845k837l543K777
9340D0505N795k139O71j56m639o34L748j47J38J600J720R94j022J213K99L982
9324E1928J973J211k524j395j646K651r05k526o28m183J002O025O30N81P77K322
9308E5293o42o66J482K523j804K890K800k94L312N337m13j462P63L323J888M539
$$ y = [720, 2949, 3614, 340, 1174, 4469, 6612, 7145, 2254, 748, 2855, 5146, 7499, 5898, 8323, 9671, 8324, 4006, 4468, 7542, 9528, 12057, 12630, 15265, 13357, 11493, 11941, 13567, 13883, 15633, 13365, 12208, 15014, 17353, 19269, 16281, 12293, 9592, 8268, 15819, 22418, 20034, 15389, 13887, 11056, 8584, 6282, 6569, 8806, 10815, 8523, 8252, 7786, 3863, 796, -1518, 38, 1744, -352, 1076, 3442, 4106, 5633, 4421, 7714, 10856, 12794, 15790, 18400, 25886, 27930, 34959, 42446, 45639, 42263, 44108, 41271, 37728, 40505, 46300, 44161, 44832, 44676, 40037, 39403, 43151, 43004, 43142, 44742, 46462, 47456, 46434, 47647, 47946, 51928, 53901, 55112, 52588, 51193, 49547, 52198, 51293, 48767, 48139, 43956, 44958, 50983, 51613, 52194, 52971, 55293, 54651, 53985, 55467, 57990, 56186, 59076, 61876, 61582, 64894, 70231, 69818, 68356, 69119, 72442, 74330, 78869]
9292G8869L716K203L948O542O177M431L638K819L86q52j804J089j146m334O198
9277A11880N804L88L81M027J0238J1724J3122P962O345R406Q928J1546J7547J7207
9263B36505K0150K3607K4761K6829K9749L6263M0781M2594N0806N9250O6293P4813
9251G32401R0676R8199J11545J27881J40561J55540J63598J63460J55464J36732
9241B076057J14152Q1917M3518n183m9316q3289j18457j43601j62434j66483j62026
9230A424855j54066j41920j28622j12215r7823q2913p2746o6654n7639m6975m1803
9219D21479l7576l6657k8486k2993j8748j8403k1644j6818j4642j1487j3233j5252
9207A65540j2557j3495n578o422q778l463k960n722o604m425o773R4j331p77J624
$$ y = [78869, 82585, 84788, 88736, 95278, 101455, 105886, 109524, 112343, 112729, 111877, 110073, 111162, 110016, 105682, 111880, 117684, 118072, 118453, 122480, 132718, 144442, 157564, 165526, 171871, 181277, 190205, 201751, 219298, 236505, 256655, 280262, 305023, 331852, 361601, 397864, 438645, 481239, 532045, 591295, 657588, 732401, 823077, 921276, 1032821, 1160702, 1301263, 1456803, 1620401, 1783861, 1939325, 2076057, 2190209, 2272126, 2315644, 2310461, 2261145, 2177856, 2059399, 1915798, 1753364, 1586881, 1424855, 1270789, 1128869, 1000247, 888032, 790209, 707296, 634550, 567896, 510257, 463282, 421479, 383903, 347246, 318760, 295767, 277019, 258616, 236972, 220154, 205512, 194025, 180792, 165540, 152983, 139488, 133910, 127488, 118710, 115247, 112287, 106565, 99961, 95536, 88763, 88857, 87526, 86749, 88373]
9192H8373P50K79L304K614K711K241j35P201L599J530K090j760q094k137j580
9177A00986m998N53k082Q39o37l079n673j871J100O24m118o435k724M52K464j641
9161G3760M0n211l656Q55J821J723n184k92M466J193j569k635o022l748n459n343
9145D4739o999n771j882l794Q32N15K729M754q24O267Q247N146O352Q011N173
9130G3495Q96Q37O394K037M995M842q26L18L396J921J549N615R246R249M688K609
9114A31261P437M916M577N571P697R927J0158J5203J6173J5295J4002J8752K0187
9101B81156K1582K6573L1272L8164L5720L1864L0152K2657J0854K68j3279k4741
9089D92242k9317l3054l4329l3611k7606k2852k2484j7209j4434o260n952L74
$$ y = [88373, 89123, 89402, 92706, 95320, 98031, 100272, 100137, 107338, 110937, 112467, 114557, 112797, 104703, 102566, 100986, 95988, 96541, 94459, 95298, 94661, 91582, 85909, 84038, 85138, 85762, 81644, 75209, 72485, 72937, 75401, 73760, 73800, 68589, 64933, 65788, 67609, 69332, 64148, 63856, 68322, 69515, 67946, 65311, 59289, 55541, 50082, 44739, 37740, 31969, 30087, 26293, 27125, 27640, 30369, 35123, 34299, 40566, 48813, 53959, 60311, 68322, 73495, 74391, 75228, 81622, 83659, 88654, 93496, 92670, 92988, 96384, 98305, 99854, 105469, 114715, 123964, 128652, 131261, 138698, 143614, 148191, 153762, 161459, 171386, 181544, 196747, 212920, 228215, 242217, 260969, 281156, 302738, 329311, 360583, 398747, 434467, 466331, 496483, 519140, 529994, 530262, 516983, 492242, 462925, 429871, 395542, 361931, 334325, 311473, 288989, 271780, 257346, 251086, 245134, 245508]
9077B45508J105n601n928j427l0l632k9L538J036k913j246l37K816N882L215J793
9061B43750P349M703L351M616j767m86O40m092n096l574l409j417j626J66m063
9046B39045j597J415l171j630R95K845N656N378J414J924N553M260Q069Q769J0446
9031B89371J0109J4467J7137J8766J7609J9290J9368J6161J9510K1635K2481J9608
9019E05512J7062J9988J9961Q876M555r15K086Q239N072J869J320O459O373N817
9005F12274O463Q755P301J0486J0331J0800J6524J8719J7729J9988K7270K5769
8993G92409K4525K1792K1028K9407K6640K0467K2815K5537K0760K4460K3641K1143
8981A074624K3526K6254K4916K2308K7623L1851K7741L5032M0647N2282O8371
$$ y = [245508, 246613, 241012, 235084, 233657, 233627, 229995, 229966, 233504, 234540, 231627, 230381, 230044, 232860, 238742, 241957, 243750, 251099, 255802, 259153, 263769, 262002, 261516, 262156, 258064, 252968, 249394, 245985, 244568, 242942, 243108, 239045, 237448, 238863, 235692, 234062, 235057, 237902, 243558, 248936, 250350, 252274, 257827, 262087, 270156, 278925, 289371, 299480, 313947, 331084, 349850, 367459, 386749, 406117, 422278, 441788, 463423, 485904, 505512, 522574, 542562, 562523, 571399, 575954, 575039, 577125, 585364, 590436, 592305, 593625, 600084, 606457, 612274, 618737, 627492, 634793, 645279, 655610, 666410, 682934, 701653, 719382, 739370, 766640, 792409, 816934, 838726, 859754, 889161, 915801, 936268, 959083, 984620, 1005380, 1029840, 1053481, 1074624, 1098150, 1124404, 1149320, 1171628, 1199251, 1231102, 1258843, 1293875, 1334522, 1386804, 1455175]
8970A455175P7993P9518P9443O6133M6579K7211J0027K2O66o05P527J9932K5281
8957A894902K8678L9394M6901N0167N0841N2881O2543O0770N6239N8291N9998
8946B461605O1029N7711N5205N9345N8648O5782P7541P8280P8740Q2001Q3549
8935C219436R1861J00573R5352R6294J01081J05549J04672J08987J13225J16188
8925D253218J16838J23929J29220J34556J41209J44091J52324J58076J65941J67903
8915E687305J61847J68448J75096J88620K03680K27928K53790K91944L34810L44379
8905H037847K76351J71956J14820J31013J68930K01029K32344K65499K98854L24663
8895A0223306L28679L39883L76287M12723M56295M95326N35909N80729O05961
$$ y = [1455175, 1533168, 1612686, 1692129, 1758262, 1804841, 1832052, 1842079, 1842101, 1842767, 1842162, 1849689, 1869621, 1894902, 1923580, 1962974, 2009875, 2060042, 2110883, 2163764, 2226307, 2287077, 2343316, 2401607, 2461605, 2522634, 2580345, 2635550, 2694895, 2753543, 2819325, 2896866, 2975146, 3053886, 3135887, 3219436, 3311297, 3411870, 3507222, 3603516, 3704597, 3810146, 3914818, 4023805, 4137030, 4253218, 4370056, 4493985, 4623205, 4757761, 4898970, 5043061, 5195385, 5353461, 5519402, 5687305, 5849152, 6017600, 6192696, 6381316, 6584996, 6812924, 7066714, 7358658, 7693468, 8037847, 8314198, 8486154, 8600974, 8731987, 8900917, 9101946, 9334290, 9599789, 9898643, 10223306, 10551985, 10891868, 11268155, 11680878, 12137173, 12632499, 13168408, 13749137, 14355098]
8886A4355098O14818O28992O60509P05072P54722Q02988Q51500R11599R74098
8877B1259396J045982J126122J219320J334759J461227J605405J760163J928952
8869C2741326K118026K322351K562792K841541L155196L514633L941871M433667
8861E7631403M983158N611207O328485P135066Q050986R094566J0283738J1649305
8853A20767914J3268162J5215495J7573372K0418665K3773596K7546196L1529072
8846B70092472L5239762L7882935L8350420L5383898K8051552J6381783J775450
8839D63158272j3286454k6107178l4857757l9073508l9457812l7248734l3637819
8832B39489010k9521664k5463858k1759009j8532551j5820001j3602655j1810722
$$ y = [14355098, 14969916, 15598908, 16259417, 16964489, 17719211, 18522199, 19373699, 20285298, 21259396, 22305378, 23431500, 24650820, 25985579, 27446806, 29052211, 30812374, 32741326, 34859352, 37181703, 39744495, 42586036, 45741232, 49255865, 53197736, 57631403, 62614561, 68225768, 74554253, 81689319, 89740305, 98834871, 109118609, 120767914, 134036076, 149251571, 166824943, 187243608, 211017204, 238563400, 270092472, 305332234, 343215169, 381565589, 416949487, 445001039, 461382822, 463158272, 449871818, 423764640, 388906883, 349833375, 310375563, 273126829, 239489010, 209967346, 184503488, 162744479, 144211928, 128391927, 114789272, 102978550]
8825A02978550j0358849r150575q103960p184964o356709n614882m959731m373042
8817D6875838l858942l410589l023609k702782k430467k208590k011621j828073
8809B5401165j667937j512615j383015j274071j163654j069656r84961r03745
8801A5441511q31239p60833o95670o31726n73457n39760n19622m95064m55768
8792I938372m16171l84943l60514l41194l28192l19341l11408l02062k96793k89114
8782F588640k78668k64608k49531k36439k20650j98504j84824j65216j52769j51842
8772D485589j48071j41450j36591j29607j20291j13293j06201j02227r6263r0868
8762C300727q6136q2507p4930o9050p5169o6676o9372o4399o0523n7140n3801
$$ y = [102978550, 92619701, 83469126, 75365166, 68180202, 61823493, 56208611, 51248880, 46875838, 43016896, 39606307, 36582698, 33879916, 31449449, 29240859, 27229238, 25401165, 23733228, 22220613, 20837598, 19563527, 18399873, 17330217, 16345256, 15441511, 14610272, 13849439, 13153769, 12522043, 11948586, 11408826, 10889204, 10394140, 9938372, 9522201, 9137258, 8776744, 8435550, 8107358, 7788017, 7476609, 7174547, 6877754, 6588640, 6309972, 6045364, 5795833, 5559394, 5338744, 5140240, 4955416, 4790200, 4637431, 4485589, 4337518, 4196068, 4059477, 3929870, 3809579, 3696286, 3590085, 3487858, 3391595, 3300727, 3214591, 3132084, 3057154, 2988104, 2912935, 2846259, 2776887, 2712488, 2651965, 2594825, 2541024]
8751B541024n3431m7602m3472m1335m0919m2455m1876l8378l5831k9383l2084
8740B094258l1811l5446l7307m0300l7651l3543l0506k9283k4177j5841p266k849
8728A768278k065r40M466J1297J4476J8445J4901K2273K7963K4431K1462J3616
8716A938603N190n594k4827l8007m8859o0085o2526o4716o7677o2842n8420n1817
8704A398423m8312m6031m6014l5200k6936k7187k5935k6669k1943j7013k1347
8693A055836j9538j5527j9121j3749r375p602j3015n414m963n399k649o733j0666
8680I22085j1715j0677j6700j3323r161j5238j7976j3718r678j1734n012L323
8668G90476J3013K6323N1584P6439O0045o443p5366q0158n6585l4733j7028j1648
$$ y = [2541024, 2487593, 2439991, 2396519, 2355184, 2314265, 2271810, 2229934, 2191556, 2155725, 2126342, 2094258, 2062447, 2027001, 1989694, 1949394, 1911743, 1878200, 1847694, 1818411, 1794234, 1778393, 1771127, 1768278, 1766213, 1765273, 1769739, 1781036, 1795512, 1813957, 1828858, 1851131, 1879094, 1903525, 1924987, 1938603, 1943793, 1938199, 1913372, 1875365, 1826506, 1766421, 1703895, 1639179, 1571502, 1508660, 1450240, 1398423, 1350111, 1304080, 1258066, 1222866, 1195930, 1168743, 1142808, 1116139, 1094196, 1077183, 1055836, 1036298, 1020771, 1001650, 987901, 978526, 970924, 957909, 952495, 947532, 942133, 939484, 932751, 922085, 910370, 899693, 882993, 869670, 860509, 845271, 827295, 813577, 803899, 792165, 787153, 790476, 803489, 829812, 881396, 957835, 1017880, 1011437, 936071, 855913, 799328, 764595, 747567, 735919]
8656G35919q162l097k211J660J649P312o51m271k680p411p501j1914r518q302
8642F80822o614n545p348j3666j2952j1380r065j3212j4908q415o648n926r729
8629E55414j0737r747j1226j1288q371p547q000r262k761l582j67L33m809j764
8615D66486j599n554l526q07j806J463k06l156l514L471j32M374K300j157K367
8600D59004R84k455j691l694l004n364m327j90K307j868J105J198j607m669k307
8585D33422o411p769n316m192o695l616k469o673k54K755R40O03J477j956m439
8570C89407k314l342k853o050p458k237j634j255J645l36m666l939J857L297o53
8555C59469K84L399l141q640n026j735j660J366K661M056J425J163M83l907K187
$$ y = [735919, 727757, 724660, 722449, 724109, 725758, 733070, 732419, 728148, 725468, 718057, 710556, 698642, 689124, 680822, 674208, 668663, 661315, 647649, 634697, 623317, 614252, 601040, 586132, 577717, 571069, 565143, 555414, 544677, 534930, 523704, 512416, 504045, 496498, 488498, 479236, 476475, 472893, 472726, 473059, 468250, 466486, 464887, 459333, 455807, 455000, 453194, 454657, 454451, 451295, 447781, 451252, 451120, 455494, 457794, 456637, 459004, 459988, 457533, 455842, 452148, 449144, 443780, 439453, 439263, 441570, 439702, 440807, 442005, 440398, 435729, 433422, 427011, 419242, 413926, 409734, 403039, 399423, 396954, 390281, 390027, 392782, 393722, 394325, 395802, 393846, 389407, 387093, 383751, 380898, 374848, 367390, 365153, 363519, 362264, 363909, 363573, 358907, 354968, 356825, 360122, 359469, 359753, 363152, 360011, 351371, 346345, 344610, 342950, 344316, 346977, 351033, 352458, 353621, 354104, 350197, 352384]
8540C52384N238k170j403n067m548m338n545m041o821l803r25k636q935m636j465
8525C01289j571l149k508m036m931l345p500k534l387n848n562l506m763o26l258
8510B44765k190l037k448o27j741l980Po56j008Q01l360j784j308N205L202L117
8494B34958M472P783K150J515O832O837N81L455N456K418M183k52j287L726N819
8479B88646M299m12J204j850l787k889L280M542M655J384M385O943Q466M731Q102
8464C31699J2450J3260J5595J7545J8574J9976K4598K7194L4814M1546M5539M8645
8452F51435N6572O3845P3218Q3415R4306J08040J20447J36153J51113J59312J65958
8441A863814J59965J45177J21783R1347N3931P001l5524p2142j08923j38121j58634
$$ y = [352384, 357622, 355452, 354049, 348982, 344434, 340096, 334551, 330510, 323689, 319886, 318961, 316325, 307390, 302754, 301289, 299718, 296569, 294061, 290025, 285094, 281749, 274249, 271715, 268328, 262480, 256918, 253412, 248649, 248023, 244765, 242575, 239538, 237090, 236463, 234722, 230742, 230749, 230093, 229085, 229886, 226526, 224742, 223434, 228639, 231841, 234958, 239430, 247213, 249363, 250878, 257710, 264547, 265128, 268583, 274039, 276457, 280640, 280388, 279101, 282827, 288646, 292945, 292533, 293737, 291887, 288100, 285211, 288491, 293033, 297688, 299072, 303457, 310400, 318866, 323597, 331699, 344149, 357409, 373004, 390549, 409123, 429099, 453697, 480891, 515705, 557251, 602790, 651435, 708007, 771852, 845070, 928485, 1022791, 1130831, 1251278, 1387431, 1538544, 1697856, 1863814, 2023779, 2168956, 2290739, 2382086, 2436017, 2443018, 2407494, 2335352, 2226429, 2088308, 1929674]
8430A929674j65691j68963j58734j44191j33303j17750j03714r0008p6968p0077
8420G00275o0150n2152m2980l5277l3206l2581k9424k4880k5275k2032j3958j2203
8408C16157j5862r092p957r974j0851o653q127j1067j2966j5144j4049m901p009
8395A82505o556r409n893r45j399j973K90j603J403M772Q66p380o033l028K918
8380A48535J291J409O86K724K90k251o895n874j589l92P44p25n302k727m610R9
8364A25413J303J696m342l171j183K773L553K173j742l379o529k405J641r52j307
8349A13542J956J539k660p27K407L021j454p67L076j337j18R76J669K615l77K72
8333A23633L546J329l933K241O110J895j80J036L204j840j644k306j634L133K487
$$ y = [1929674, 1763983, 1595020, 1436286, 1292095, 1158792, 1041042, 937328, 847320, 770352, 700275, 640125, 587973, 544993, 509716, 476510, 443929, 414505, 389625, 364350, 342318, 328360, 316157, 300295, 291203, 283246, 273272, 262421, 255768, 247641, 236574, 223608, 208464, 194415, 189514, 182505, 175949, 166540, 160647, 159702, 158303, 156330, 156620, 155017, 156420, 161192, 162058, 154678, 148645, 145617, 148535, 149826, 151235, 151921, 154645, 154935, 152684, 145789, 139915, 138326, 137934, 138678, 137953, 132651, 129924, 125314, 125413, 126716, 128412, 124070, 120899, 119716, 122489, 126042, 128215, 126473, 123094, 116565, 114160, 115801, 114849, 113542, 115498, 117037, 114377, 113650, 116057, 119078, 117624, 116857, 119933, 118596, 118478, 119454, 121123, 123738, 123361, 123633, 127179, 128508, 124575, 126816, 132926, 134821, 134641, 135677, 138881, 137041, 135397, 133091, 131457, 134590, 137077]
8318A37077K797J211J534K083J5O010N350k026n122j985M884M639P663K467j3899
8303A52698j6877j0073n786p245k036k211m344n051l14Q86M58k559m031j80K238
8288I5573O71K543L083l04k520J380K026M039J034o04N583J399l883j099Q56j343
8272A08434l90R78M80J883L46Q60j710l119n013k849l945j330M505K566j498m30
8256I9768j52n18j879j419j626k825q69J647Q80k603O68J541m38J836n77l46j58
8239I2930J588Q9J417L658M76j980N70n73p6m40j603l552o72P20L10J298o93p8
8221I3389m353k394K37J479j321k035J327K373j957m85l863K075K803p651j08
8206G9516k80j117N44J652L105J348K300j175l49k022l366K364k293n358N22L642
$$ y = [137077, 139874, 141085, 142619, 144702, 144717, 150727, 156077, 154051, 148929, 146944, 151828, 156467, 164130, 166597, 152698, 135821, 125748, 119962, 112717, 110681, 108470, 104126, 99075, 98761, 99647, 100105, 97546, 93515, 93335, 95573, 96244, 98787, 101870, 101566, 99046, 100426, 102452, 106491, 107525, 106921, 112504, 113903, 110020, 108921, 109777, 108434, 108044, 109022, 109502, 111385, 111731, 112591, 110881, 107762, 102749, 99900, 95955, 94625, 99130, 101696, 100198, 99768, 99616, 99098, 97219, 95800, 94174, 91349, 90480, 92127, 93007, 90404, 91072, 92613, 92175, 94011, 93434, 93088, 92930, 94518, 94607, 96024, 99682, 100158, 98178, 98748, 98175, 98099, 97659, 96056, 92504, 91832, 92552, 92862, 94160, 93467, 93389, 89036, 86642, 86879, 88358, 87037, 85002, 86329, 88702, 86745, 86260, 82397, 84472, 87275, 79624, 79516, 79236, 78119, 78663, 80315, 83420, 84768, 87068, 85893, 85544, 83522, 80156, 82520, 80227, 74869, 75391, 79033]
8190G9033n768j512J885J807j099m938j648P77N306k395R84j588J170J014l47
8175G2681J545k694L05K026j906j989J635k36k994l514l091J430M172j524J308
8160F7154j379k856j55P6n8L00J194m073J59J459K617k050o353J096K809j394
8144E8546k140j27L323K295J234M09P74J228K459j51j819LK029k928L52k143k19
8127F3125N46m032K531j436l961O69K446o09p30j151k996j271m131j719n37K56
8111D7000M287k756N3K08M256R084L079J812m107j864k36k6k69k29m748J91j218
8094E4517k481q93l359k064K296K006j579l4r84N457J626M54J254J772j693m054
8078E2241N0m32J786l446l475L24J317K785K723R87k894K618Q54n01J758J737
$$ y = [79033, 73265, 71753, 73638, 75445, 74346, 69408, 67760, 68537, 73843, 71448, 72432, 70844, 72014, 73028, 72681, 74226, 71532, 71837, 73863, 71957, 69968, 71603, 71367, 68373, 64859, 61768, 63198, 67370, 65846, 67154, 65775, 62919, 62764, 62840, 62782, 63082, 64276, 60203, 60362, 61821, 64438, 62388, 56035, 57131, 59940, 58546, 56406, 56279, 59602, 61897, 63131, 63540, 64314, 65542, 68001, 67850, 66031, 66034, 68063, 65135, 65487, 63344, 63125, 63671, 59639, 62170, 60734, 56773, 57442, 59888, 59279, 58549, 57398, 54402, 53131, 49000, 47281, 46744, 47000, 51287, 48531, 48584, 48792, 53048, 62132, 65211, 67023, 62916, 61052, 60816, 60790, 60521, 60292, 55544, 55735, 54517, 52036, 51143, 47784, 45720, 48016, 50022, 48443, 48409, 47425, 52882, 54508, 54962, 56216, 57988, 56295, 52241, 52291, 51859, 53645, 50199, 46724, 47048, 48365, 51150, 53873, 54860, 51966, 54584, 55438, 54937, 56695, 58432]
8062E8432j387J852r86n81M54L532m99k29K701k956l93J382q56J831k301m812
8046E5184R15J137N75L934k993o859j348q53j811R05L167K155M279R6l372L02
8030E5413j042j366M54p60N952K137k352L837k523n46J479k060k718L600M412
8015F3917j974n515j045L023J314R00j861j396j627r43K80r68K610Q277N764K038
7999G2794J033m345l624m498Q61j327j832o71L375K036j882m954m959J102J831
7984E4940j318N2m08j363n63K930L684J810j40kJ922r41j797K015o55k145L15
7967E8336l004k201K144J500n448l221j141j321L185j255L799L340K92j786J819
7952E5038K690j36J031l587j725J952k068q440j458N465L115L571J417L262N54
$$ y = [58432, 57045, 58897, 57911, 57330, 57784, 61316, 60817, 60588, 63289, 60333, 59940, 61322, 60466, 62297, 59996, 55184, 56099, 57236, 57811, 61745, 58752, 51893, 50545, 49692, 47881, 48786, 51953, 54108, 58387, 58483, 55111, 55413, 54371, 53005, 53459, 52699, 58651, 60788, 58436, 62273, 59750, 59204, 60683, 58623, 55905, 59505, 63917, 61943, 56428, 55383, 58406, 59720, 60620, 58759, 57363, 55736, 54793, 55073, 54105, 56715, 64992, 70756, 72794, 73827, 69482, 65858, 61360, 62221, 60894, 59062, 58391, 61766, 63802, 61920, 56966, 52007, 53109, 54940, 53622, 53674, 53266, 51903, 51340, 54270, 57954, 59764, 59624, 59622, 61544, 60603, 58806, 60821, 60166, 58021, 58336, 55332, 53131, 55275, 56775, 51327, 48106, 46965, 45644, 48829, 47574, 51373, 54713, 55005, 53219, 55038, 57728, 57592, 58623, 55036, 53311, 55263, 53195, 44755, 43297, 48762, 51877, 55448, 56865, 60127, 60681]
7937F0681m41j671j144N52O83l812l262J992J303j516K031k403k49l00n121j999
7921D5324K298J347J588j342k202j241r06N89K268K527K076J505k449j943j456
7906D7983l894J590L172O53l805k925j563M588n53k000J033L297O23K469K402
7891E3070K936M370k584k285L747k804l208j831M59q14j382k992m219k66K236
7876D4433j035j806q84K412m260j397J766K24J799K808J027L146l028n253J664
7861D1616J213L248j130l115j509l23j036l994P02M281q15m965m014K759J154
7846C4072L502L637M142O12n04k585q71j776J830L03j711M72M47J18l788k367
7830C5533j997J73K093o55J162M26m63J688k501o312l773R70J070k744l08J635
$$ y = [60681, 60240, 58569, 57425, 57977, 58660, 54848, 51586, 53578, 54881, 53365, 55396, 52993, 52744, 52444, 47323, 45324, 47622, 48969, 50557, 49215, 47013, 45772, 44866, 45455, 47723, 50250, 52326, 53831, 51382, 49439, 47983, 44089, 45679, 48851, 49504, 45699, 42774, 41211, 45799, 45246, 43246, 44279, 47576, 48199, 50668, 53070, 56006, 60376, 57792, 55507, 59254, 56450, 53242, 51411, 51870, 51056, 49674, 46682, 42463, 42197, 44433, 43398, 41592, 40708, 43120, 38860, 37463, 39229, 39453, 41252, 44060, 45087, 48233, 45205, 39952, 41616, 42829, 46077, 44947, 41832, 40323, 40000, 38964, 34970, 35672, 39953, 39138, 34173, 30159, 32918, 34072, 37574, 41211, 45353, 45965, 45461, 42876, 42005, 40229, 42059, 42362, 40651, 41123, 41570, 41688, 37900, 35533, 33536, 33709, 35802, 35147, 36309, 36735, 36272, 37960, 35459, 29147, 25374, 26344, 27414, 24670, 24362, 25997]
7814B5997J011j271M516Q67N59J688K244q26L052J643n077k559k87M323M58k06
7798C6132l409j078r70N99J130r42j905p27J490K441N0J52k369l682K346J884
7782C1142k894j669k51L6J923L885K151j968P7n16j628r15L575K036p2j422k104
7765C1386k214j498M989j095j435j333k592J997O386J909k803j407k08j026P47
7750C1803J473m21k822K997O61p08j262j246j112Q23L027L67l288K048J502J193
7734C5035l49j448K29m59J034K012o70j211k082p44M51j268J855Q12R41J325j323
7717C4140K201j4j611k549l221j145J175k860m776K288N645J813p38j0Q8R94L366
7700C4786L04K020N36j342k150j325k130o01j590K372K742J154n214l862K293
$$ y = [25997, 27008, 25737, 30253, 31120, 31679, 33367, 35611, 34785, 37837, 39480, 34403, 31844, 31557, 35880, 36338, 36132, 32723, 31645, 30675, 31274, 32404, 31462, 29557, 28830, 30320, 32761, 32811, 32963, 30594, 26912, 29258, 31142, 28248, 26579, 26328, 26364, 28287, 32172, 34323, 32355, 32432, 31916, 30288, 29373, 32948, 34984, 34912, 33490, 31386, 29172, 27674, 32663, 31568, 30133, 28800, 26208, 28205, 34591, 36500, 33697, 32290, 32082, 31056, 31803, 33276, 32855, 30033, 33030, 33691, 32983, 31721, 30475, 29363, 30186, 33213, 33580, 30292, 32340, 33842, 35035, 34686, 33238, 33467, 33008, 34042, 36054, 35384, 34173, 32091, 31347, 31798, 30530, 32385, 33197, 34138, 35463, 34140, 36341, 36327, 34716, 32167, 28946, 27801, 28976, 26116, 21340, 23628, 29273, 31086, 30348, 30338, 30426, 31420, 34786, 35090, 37110, 37646, 36304, 34154, 32829, 30699, 30098, 28508, 30880, 33622, 34776, 29562, 25700, 27993]
7685B7993j047k813K912M592L781k204j204l9J95L088k49k969Q54j072l588J704
7669B9934J766K315O1j670o72N19j147m14K61n50K179K306l074k156O31n65k321
7652B7403l823j566L812L942M55k740k05m09k419p04L803K887J728L384j477k11
7636C3860j745r53j5o4r884k052O490M306M021l86k519O25N9j250j957j005l513
7619B4018o17L054L263L373m40k307k548k930q72J077K24l144J14M164L775q08
7603B9396l605k013n030j497M334K27M839m69j725J165nP38L782q42j767m195
7587B3333j618j163K970J293J006j196k788K233J221J011k264J109J710k873n256
7572A8728k083o36K315q83R03O060J881L4K957L274n564l907j228L421j530J276
$$ y = [27993, 26946, 24133, 27045, 31637, 35418, 33214, 32010, 31971, 32166, 35254, 35005, 32036, 32890, 31818, 28230, 29934, 31700, 34015, 34076, 32406, 31734, 32253, 31106, 30692, 30953, 30403, 32582, 34888, 31814, 29658, 30289, 29724, 27403, 23580, 22014, 25826, 29768, 30223, 27483, 27278, 26869, 24450, 23746, 27549, 30436, 32164, 35548, 34071, 33860, 32115, 31162, 31147, 31083, 21199, 19147, 25637, 29943, 33964, 33578, 31059, 31684, 31743, 30493, 28536, 27531, 24018, 23401, 26455, 29718, 33091, 32651, 30344, 27796, 24866, 23994, 25071, 25295, 22151, 22265, 26429, 30204, 29396, 25791, 23778, 18748, 17251, 21585, 21812, 26651, 26182, 24457, 25622, 25617, 26355, 30137, 29295, 27528, 23333, 21715, 20552, 23522, 24815, 25821, 24625, 21837, 24070, 25291, 26302, 24038, 25147, 26857, 23984, 18728, 16645, 16009, 18324, 17441, 18344, 24404, 26285, 26319, 29276, 32550, 26986, 23079, 21851, 25272, 23742, 25018]
7556B5018k894J13j895n60M032K059M79q15J212J38j801m729k340J666Q322j19
7540B7886n047k819N91p88O68J156m82l80J489j276m409J535K233N270K927l697
7524B4857m298L082r71K579J780L85p43j414j647M542o55j489l468k225P11K351
7508B3377m294k69J934K311L827J727k630Q96j251r68P84p09n565k367j89M010
7492B0624m264N27M626J055p9k618j479M169K359k154k236j28j355j130l945M434
7476A8406N453K3n214l205Q61K019q36n11J061M176J255k272Km90J19J654R1L765
7458B6357q60p236l629K831K610p4M211N33J673L130m900l228q87o04j403q08
7442A7716k692M154N72l73K201r38l855k334K407K52L26Pk52M84Q08K614J939
$$ y = [25018, 22124, 22237, 20342, 19782, 23814, 25873, 26352, 25537, 26749, 26887, 25086, 20357, 18017, 19683, 28005, 27886, 22839, 20020, 20611, 19823, 20491, 21647, 21165, 20785, 22274, 20998, 16589, 18124, 20357, 25627, 28554, 24857, 20559, 23641, 22670, 25249, 27029, 27414, 26671, 25257, 23610, 28152, 27497, 26008, 22540, 20315, 21026, 23377, 19083, 18814, 20748, 23059, 26886, 28613, 25983, 26879, 25628, 24660, 25444, 24735, 19170, 16803, 16614, 20624, 16360, 16887, 21513, 22568, 22489, 19871, 18392, 22561, 24920, 22766, 20530, 20402, 19047, 17917, 13972, 18406, 23859, 23882, 18668, 15463, 16324, 18343, 17507, 16996, 18057, 22233, 23488, 21216, 21218, 20728, 20847, 22501, 22592, 26357, 25497, 18261, 14632, 17463, 20073, 19999, 24210, 24743, 26416, 29546, 24646, 21418, 20531, 19927, 18524, 17716, 15024, 19178, 19750, 19377, 21578, 20640, 16785, 14451, 16858, 17110, 17436, 17443, 17191, 17675, 18483, 21097, 23036]
7425B3036k805l763q22L352K977L767p64l144q557j120O588J898j754m916m20
7410A3553L049J521N111M220j815n778l413j918J369K130P44j912L84J716j766
7395A7195j492J187M20M34J327J288J545M84M76n289k461l472J7N675K657K40
7379B0231k67k294j019J108L283K50o46p51k870m333K175J898m375J638O10L817
7363A8455K257r17L519r6o589j934O306L644m359k793J28k664k532K295m35K990
7347A7275k76K418p90j521K039r49O197o22k060n37j843m058k947k611N310L159
7331A8184j353q5m29k108m52K369O46j007J592k196j919o37R02O80L160J386k322
7314A6411l329k198K001J179K313l211q1j627r69M297N274m229n194n199K630
$$ y = [23036, 20231, 16468, 15646, 18998, 21975, 25742, 24978, 21834, 13277, 12157, 18745, 20643, 18889, 13973, 13553, 16602, 18123, 23234, 27454, 25639, 19861, 16448, 14530, 15899, 18029, 18773, 16861, 17245, 18961, 17195, 15703, 16890, 17310, 17744, 19071, 20359, 21904, 22388, 22864, 17575, 15114, 11642, 11659, 17334, 19991, 20231, 19964, 17670, 16651, 17759, 21042, 21292, 20646, 19895, 17025, 12692, 14867, 16765, 12390, 14028, 14638, 18455, 20712, 19795, 23314, 23218, 16629, 14695, 21001, 24645, 20286, 17493, 17621, 14957, 12425, 14720, 14285, 17275, 16999, 19417, 18627, 17106, 19145, 18196, 24393, 23771, 21711, 21174, 19331, 15273, 12326, 9715, 15025, 18184, 16831, 16746, 16317, 14209, 13757, 16126, 16772, 15765, 17357, 15161, 13242, 12605, 13507, 14187, 17347, 18733, 16411, 13082, 10884, 12885, 14064, 16377, 13166, 13085, 11458, 10489, 14786, 20060, 15831, 10637, 5438, 8068]
7299H068K960m0J193J578M710J79k384K510M455j462o68K942l163j865m482N27
7283A5058l393j509L764L087l518o67K825K901P18N3Q03j480j472L10m47l205
7267A3828r97j810J160j65O25J951J706J916O045q60n579k855l115J185O54j51
7251A3538J604j95j297J516k040j716O582N314j742j709J542k141R64J593m765
7236A7048k577j740J629K556K222j356o25K012L2j149L8j417k1n67J729k36J825
7219A9403o14m585j035J506P40j854p84J119o90K530R73K288M45k012j239k9L015
7202A9177J312k295m410J677K18r3J826J243j916j027l117l512K937j55N42j505
7186A0902L089m82l083j881k18M00J561J372K692K757l28m346L266J445k373J179
$$ y = [8068, 11028, 10988, 12181, 13759, 18469, 18648, 16264, 18774, 23229, 21767, 21099, 24041, 20878, 19013, 14531, 15058, 11665, 10156, 13920, 17007, 13489, 12822, 15647, 18548, 19266, 19319, 20122, 18642, 17170, 17480, 17033, 13828, 12831, 11021, 12181, 12016, 12641, 14592, 16298, 18214, 24259, 23399, 17820, 14965, 11850, 13035, 13689, 13538, 15142, 14947, 13650, 15166, 13126, 11410, 17992, 23306, 21564, 19855, 21397, 19256, 20220, 21813, 17048, 14471, 12731, 14360, 16916, 19138, 17782, 17157, 19169, 19201, 18052, 18090, 16673, 16652, 16085, 17814, 17578, 19403, 18789, 14204, 13169, 14675, 15415, 13561, 12777, 13896, 13206, 15736, 16709, 18997, 19442, 17430, 16191, 16162, 19177, 20489, 18194, 13784, 15461, 15679, 15586, 17412, 18655, 16739, 15712, 12595, 9083, 12020, 11865, 12407, 10902, 13991, 13509, 10426, 8545, 8327, 8727, 10288, 11660, 14352, 17109, 16781, 12435, 15701, 17146, 14773, 15952]
7170A5952R94l567l474j446j627K084L336M33K67K376j183l85j864q79J254K230
7154A4501K636R46o05J20J71N96M69R75k153k238k983K974K114j657o96k310J351
7137A4211L882K08j421k475K959L8q63n424J716M705M606k243m749k883J095j752
7121A1610N03L79l029Q01J024K870k398j12J907J445k756p266J811M632L333N56
7105A5310m2j412J749L250k76K955j357l527m582m393m120K717N381M721k13n44
7089A5617k27l211K28m61L262K196J032l345l329k130k216K466L997J225J806
7074A6910O39j817k962k439k980P09M884M311J777p86p19J219J064J30j587j229
7058A7124l02J06K366j992j705l826p60N201J848o507R9l77q87j597r46M17j279
$$ y = [15952, 16946, 13379, 9905, 8459, 6832, 8916, 12252, 12685, 12952, 15328, 14145, 13760, 11896, 11017, 12271, 14501, 17137, 18083, 17478, 17598, 17769, 18365, 18834, 19809, 17656, 15418, 12435, 15409, 17523, 15866, 15170, 12860, 14211, 18093, 18301, 16880, 14405, 17364, 17402, 16539, 11115, 12831, 17536, 22142, 19899, 15150, 12267, 13362, 11610, 12113, 12492, 9463, 10264, 11288, 14158, 11760, 11648, 13555, 15000, 12244, 4978, 6789, 11421, 14754, 15310, 15268, 13856, 15605, 18855, 18579, 21534, 20177, 16650, 12068, 7675, 3555, 6272, 11653, 16374, 16161, 15617, 15390, 12179, 12407, 11946, 15208, 17404, 18436, 15091, 11762, 9632, 7416, 9882, 13879, 15104, 16910, 17549, 15732, 12770, 10331, 7351, 8060, 12944, 17255, 19032, 18246, 17527, 18746, 19810, 19940, 18353, 17124, 16822, 16928, 19294, 17302, 15597, 11771, 11011, 16212, 18060, 11553, 11652, 11275, 10388, 8791, 7845, 8262, 6983]
7041F983J180K308J146J003O02j679J604N02j440l070n178J428J612L196K842
7026A3039J63L546L295O66M729o22k390N12Q33j248j795l341j854k36l074j159
7010A1064r94J798L412j253k179p3K79J299m07M73j113J339o21K496m365m15q40
6993I900L187n51J823l483j251Q77k85p49J538L508J19k652R74k532K36J270P59
6976A2688Q48l243l254J585J216j560M84j523p71P63J519J740m26M679j414m425
6960H906P2J180M022K044p91l333J126L97j59M09k229k88K194j454n83l295J150
6943I368M912Q58j50j735Q5k734O90J159j500k97k211j966J315k383N111L043
6927A3565K28k44K28m951k230j291J735m44M828M080m11j783j558q75j649m36
$$ y = [6983, 8163, 10471, 11617, 12620, 13222, 11543, 13147, 13649, 12209, 9139, 3961, 5389, 7001, 10197, 13039, 13202, 16748, 20043, 20709, 25438, 24816, 22426, 22938, 23771, 22523, 20728, 17387, 15533, 15297, 12223, 11064, 10070, 11868, 15280, 14027, 11848, 11775, 12054, 13353, 12946, 13419, 12306, 13645, 13024, 15520, 11155, 10740, 9900, 13087, 12536, 14359, 10876, 9625, 10502, 10217, 9468, 11006, 14514, 14633, 11981, 12955, 10423, 10659, 11929, 12688, 13536, 10293, 7039, 8624, 9840, 8280, 8764, 7241, 6470, 7233, 8752, 10492, 10066, 14745, 13331, 8906, 8978, 10158, 14180, 16224, 15433, 12100, 13226, 13623, 13464, 13873, 11644, 11356, 13550, 12096, 11513, 8218, 9368, 14280, 15138, 14988, 13253, 13338, 10604, 11294, 12453, 10953, 10656, 8445, 6479, 7794, 5411, 10522, 13565, 13793, 13549, 13777, 8826, 6596, 5305, 7040, 6596, 11424, 15504, 15093, 13310, 11752, 10877, 9228, 8792]
6911H792J730N738N85l366n117M435K444R04J340R4o101l234K678J200Q7n00k068
6894I641L657j423K2K990L369j37l003K172l166k017j527K22J775K564k58m89
6878A4392l033k143l040K266M478k817j95K523K544l894j092J67P72m489N56K749
6862I744J862K54L543r19J415R52j470n811l145L296J860m98r6J236l526m81J448
6845I664M06q5j941J318L524m67m687l323J017O62O76K012k85J039J542M185r21
6828A4336j442p60r52P37M0L98J35j077N69Q60j242k854j73N28L449q7J793L85
6810A4643o12l733q97o533j491K846L440P02K495m776j306Q13k445L880L435J416
6794A1877p10n13m447k303l478m01O431K567K726M020l22p008m225K97J140M271
$$ y = [8792, 10522, 16260, 16845, 13479, 8362, 12797, 15241, 16145, 17485, 17579, 11478, 8244, 10922, 12122, 12209, 11709, 9641, 13298, 11875, 11897, 14887, 18256, 18119, 15116, 17288, 14122, 12105, 10578, 10800, 12575, 15139, 14881, 14392, 11359, 9216, 6176, 8442, 12920, 10103, 9908, 12431, 14975, 11081, 9989, 10156, 10928, 6439, 6995, 9744, 11606, 11860, 15403, 14484, 15899, 16851, 15381, 9570, 6425, 9721, 11581, 11083, 10987, 12223, 8697, 8216, 9664, 10070, 9985, 8044, 9362, 12886, 12419, 7732, 4409, 5426, 6088, 6764, 8776, 8491, 9530, 11072, 15257, 14336, 12894, 12134, 11182, 11919, 11959, 12357, 12492, 11415, 11984, 12844, 11602, 8748, 8575, 9103, 12552, 12465, 14258, 14643, 14031, 10298, 9401, 2868, 1377, 4223, 7663, 8365, 10860, 6084, 4778, 5591, 3146, 7026, 10461, 11877, 11167, 10654, 6207, 3904, 426, 25, 6456, 9023, 11749, 15769, 15447, 8439, 4214, 4511, 5651, 9922]
6778I922O030N290o855j109j692p452k766L496N617j424j653K01q01J644p6K062
6762A0434m53J341L03O62j408n401M921N944k819l881j105Q10K800j169K92O8
6746A1339O74Q24q26k541j11J240J980j760n703k049J074J85k36L226K284K283
6730A1883M2K518N06j854J610P66m474k132p93r98k694N89J267j768Q22J798J305
6713H393K64p60o08o53l26k408Q80J62M634J584k887l246J79J864L372o74L208
6696A2978p26l893j193M799K66M76n75m288j957J224r99K746l694K052j344K586
6680H458O073R46j749K395K692J194m048j029K344j986Q47P9K066K623L16q01
6664B0420m464q92M364J40j719R16N495P708J0223J3582J5708K0128Q721r679
$$ y = [9922, 15952, 21242, 14387, 13278, 11586, 4134, 1368, 4864, 10481, 9057, 7404, 7605, 6804, 8448, 8372, 10434, 9981, 11322, 11625, 12287, 10879, 5478, 10399, 16343, 13524, 9643, 8538, 9348, 12148, 10979, 11271, 11339, 12013, 12837, 12011, 9470, 9359, 10599, 12579, 10819, 5116, 3067, 4141, 4326, 4090, 7316, 9600, 11883, 11925, 14443, 14949, 13095, 14705, 15471, 10997, 8865, 8072, 7074, 4380, 4969, 6236, 4468, 5290, 7088, 8393, 8657, 7897, 7289, 6636, 6310, 3902, 4782, 4944, 9578, 11162, 8275, 5029, 5208, 7072, 10444, 9770, 12978, 12252, 8359, 7166, 11965, 12231, 12707, 12132, 7844, 5887, 7111, 6112, 8858, 5164, 7216, 5872, 8458, 14531, 15477, 13728, 16123, 18815, 20009, 15961, 14932, 17276, 15290, 16137, 16216, 18282, 20905, 21221, 20420, 15956, 15064, 19428, 19568, 17849, 18765, 24260, 31968, 42191, 55773, 71481, 91609, 100330, 90651]
6650I0651k0993k1690j4981q770l641l281j349O32k015k395q4n82K934K500N42
6635A7478l990N65M86j384R04K270Q88R84n27o389m85J209K827j201j768k209
6619I658N2j421P9J360K305Q84j115k289l73J367J24k570j481k276j224K693J730
6602G503o43J789l076M283K538r25r35n70k018N19M608P26k4k424l255R06r30
6585H072L195L631l632k650j887K1N61J593L066j920k49m591j782M72K740L84
6569G024L836L578j728K068K02j752r87K91M55l138k042M442L94J117M00k108
6553A2052k078K479K509q43K375j026k022o215j269J889Q80o91j19l034J593L056
6537I536j262rK749K484j568r12q30m633Q66L563j27p34o29k360j873K826J966
$$ y = [90651, 69658, 47968, 32987, 24217, 20576, 17295, 15946, 16578, 14563, 12168, 12084, 11502, 14436, 16936, 17478, 13488, 14053, 14539, 13155, 14059, 16329, 17217, 18201, 17674, 11285, 10800, 12009, 14836, 13635, 11867, 9658, 9710, 8289, 8368, 9728, 12033, 12917, 11802, 9513, 9140, 10507, 10631, 8061, 6580, 4304, 3080, 5773, 7503, 6860, 8649, 5573, 9856, 12394, 11469, 10534, 9964, 7946, 8465, 13073, 13799, 13775, 11351, 8096, 9002, 8072, 11267, 14898, 11266, 8616, 6729, 6750, 7311, 8904, 11970, 10050, 9801, 5210, 3428, 3900, 6640, 7024, 10860, 14438, 12710, 14778, 14980, 13228, 12241, 12532, 12987, 9849, 7807, 12249, 12643, 13760, 14160, 12052, 9974, 12453, 14962, 14119, 16494, 15468, 13446, 7231, 5962, 7851, 8731, 8040, 7921, 4887, 6480, 9536, 8274, 8265, 11014, 13498, 11930, 11018, 10188, 5555, 6421, 9984, 9857, 9123, 8494, 6134, 4261, 7087, 9053]
6520I053k135J45J642N10j494P62l930L587K538K27K570o58K041k45J644j034
6504A5223m284k287m567j545J622O48N96M826L80m680r49K212J955J460R1l260
6488G441P69J773R81K074J44l947J433J164N398k6n106m128k053J991J743K6J174
6471A0851l76J477J916l993j637r21m14J202R19J713O51J067L4K212K853M38k874
6454A5118l109m463J56L443K219K235l610m451l327J998J369k371m19m352L081
6439C517K582j673l647J39K32L024N588j039K787L59n212l03K897l398k083j371
6423B399L792QM343q94L331L51j525J39L144J51l804m241k14J756l528l570K404
6406D042M748J941j015J218k228j965K741K267n80l791q93k56m10j895k192L097
$$ y = [9053, 6918, 7063, 8705, 9215, 7721, 8483, 4553, 8140, 10678, 10905, 13475, 12817, 14858, 14613, 16257, 15223, 10939, 8652, 4085, 2540, 4162, 4810, 5406, 10232, 10612, 5932, 4983, 7195, 9150, 10610, 10701, 7441, 8210, 9983, 10964, 13038, 13182, 9235, 10668, 11832, 17230, 17204, 12098, 7970, 5917, 7908, 9651, 9677, 10851, 10475, 11952, 13868, 9875, 8238, 7317, 6903, 8105, 9024, 10737, 11388, 12455, 12489, 14701, 17554, 17992, 15118, 12009, 7546, 7702, 11145, 13364, 15599, 11989, 7538, 4211, 6209, 7578, 5207, 4788, 436, 3517, 6099, 4426, 779, 918, 1150, 4174, 9762, 8723, 11510, 11869, 6657, 6354, 9251, 5853, 3770, 2399, 6191, 6199, 10542, 9648, 12979, 13330, 11805, 11944, 15088, 15239, 11435, 7194, 6980, 8736, 5208, 1638, 4042, 8790, 10731, 9716, 10934, 8706, 6741, 9482, 11749, 11169, 7378, 6485, 6229, 5819, 3924, 1732, 4829]
6390D829M801J339j764r08j953n334j755K577J635Q42L970j483p81n46j463k897
6374A109J100O11M5K420O9N45J138o71q63j283J098j942N69K734l86K627k122
6357F798l61L033J999j767K58M43n757m685K89M866k33k061o59k267k26L921K140
6340E731j224L410L530o762l385Q33K484J591J014L12R26r51j317L66r85R67K26
6323F766j185J194n52L922P65j483M97k228k276m8J354K763q91k191k661K587
6307F333M282j483m671l188L076N728l462o789J156l26M817O171k45m430n218
6292A751M84K063L644o94L121J176l042k016k100J210L877k61k92l018l55K849
6276H397m50m62j101J02j72Om54j335k368Q45j325j40j324q21J749J389K085J909
$$ y = [4829, 9630, 10969, 9205, 8297, 6344, 1010, -745, 1832, 3467, 4309, 8279, 6796, 6015, 5469, 4006, 1109, 2209, 2820, 2865, 5285, 5354, 5899, 7037, 6366, 5503, 4220, 5318, 3376, 3945, 6679, 6293, 8920, 6798, 6437, 9470, 11469, 9702, 9960, 10403, 4646, -39, 250, 5116, 4883, 2822, 2163, -104, -330, 3591, 5731, 4507, 7917, 11447, 4685, 1300, 2133, 4617, 6208, 7222, 7534, 8460, 7509, 6192, 6558, 5573, 6540, 6766, 5581, 6775, 6223, 10145, 10910, 9427, 9924, 7696, 5420, 5372, 6726, 9489, 8598, 6407, 3746, 6333, 10615, 9132, 4461, 1273, 4349, 10077, 6615, -174, 982, 656, 5473, 11644, 11399, 6969, 1751, 2235, 4298, 7942, 7248, 10369, 11545, 8503, 6487, 4387, 5597, 9474, 9213, 8921, 5903, 5548, 8397, 7947, 7485, 6384, 6486, 6314, 6320, 5866, 4531, 2163, 3008, 1683, 1543, 219, -602, 1147, 2536, 4621, 6530]
6258F530m220m921J688O652j977l295M642K196J246K788N14k940k290m56N82J896
6242H635p29l16l041n966J813J921J199o2k308K475M162l231o41K536q89Q87P51
6225G196K281K630k77l886j050N207J76j296j562k615R64R1q89l039m017r7K490
6208B307K652q74k267J432M099K087n078j339k414n84K323J116o51j072l70n23
6192H44J32N792K349p326j972M166L17k286j440K461m42M3K770K31M86l687m719
6175b281N310n0J153M430K81n468K785J160j221K94n57n83l454K37J184L105J791
6158H116l84m516o59l122j253L913K477j48k960o89K631j88k066j287P96j172
6142e11p59M163o0l566Q68K436N641k222K750k405k288L683L605O56m47p737J177
$$ y = [6530, 2310, -2611, -923, 5729, 3752, 457, 5099, 7295, 8541, 11329, 11843, 8903, 6613, 6157, 6739, 8635, 7906, 7590, 4549, -1417, 396, 2317, 3516, 3454, 1146, 3621, 7783, 4552, 3911, 6447, 5558, 6445, 7196, 9477, 12107, 11830, 7944, 6894, 12101, 12277, 10981, 9419, 6804, 7768, 7859, 6970, 3931, -86, -183, 2307, 4959, 4085, 1818, 3250, 7349, 9436, 4358, 3019, 605, 21, 2344, 3460, 2809, 1737, 1367, 844, 976, 6768, 9117, 1791, -181, 3985, 4302, 2016, 576, 3037, 2595, 2638, 5408, 5639, 6125, 2438, -2281, 3029, 2979, 4132, 8562, 8843, 3375, 6160, 7320, 6099, 6393, 5836, 5253, 1799, 2036, 3220, 6325, 8116, 7732, 3216, 2557, -565, -1818, 2095, 4572, 4424, 1464, 775, 3406, 3218, 1152, -135, 661, -511, -1270, 2893, 2833, -733, 135, 2571, 8212, 5990, 8740, 6335, 4047, 7730, 11335, 11991, 11544, 3807, 4984]
6125D984L400j325n07k244l44L183J345j150j368l482L741L375k461n811q12R93
6109A517j210R33K151m43K82j023L06P81P0K911k808L28Q3N25J794p41q03O15
6091E268k337o04K830k857j473j661K302K240n96l545M652K611l592m625j55J887
6075C45K348J914L954O5p37j043j225K537J064L217k564m060m034j328P47k208
6059a008J359M378J515M59l117m315r09K350K905k911j806K92o35J181K686M32
6043B856J389L512J490m310j292j003J364L008J259k693j32L353O416l872o906
6028D439k348K855O609l100o228K593J644j686m234L165J891J913k117j217j636
6013B543J063j485K053J33L798K559l070r28m323l845o70L265L582J655l331j771
$$ y = [4984, 8384, 7059, 6552, 4308, 3964, 7147, 8492, 7342, 5974, 2492, 6233, 9608, 7147, 1336, 524, 1517, 307, 1240, 3391, 2948, 3230, 2207, 2513, 3294, 3364, 6275, 3467, 3795, 3878, 4403, 6197, 5456, 4653, 5268, 2931, 2327, 5157, 2300, 827, -834, 1468, 3708, 3112, -433, 4219, 6830, 3238, -1387, -1542, 345, 2693, 4607, 8561, 8626, 7889, 6846, 5621, 8158, 9222, 12439, 9875, 5815, 1781, 453, 1200, -1008, 351, 4729, 6244, 6703, 3586, -729, -1638, 712, 3617, 706, -1100, -808, -1443, -262, 2424, 2856, 4245, 7757, 9247, 4937, 3645, 2642, 4006, 7014, 8273, 5580, 5448, 8801, 15217, 11345, 4439, 2091, 4946, 11555, 8455, 2227, 4820, 6464, 4778, 544, 3709, 5600, 7513, 5396, 4179, 2543, 3606, 2121, 4174, 4307, 8105, 10664, 7594, 6666, 2343, -1502, -2172, 1093, 4675, 6330, 2999, 1228]
5997A228j6j346K247J622m333l875L399M196K76K023J876k118j664K05M80m33
5981C767J796O28J670l31l084r03j544m850K913J153r77J705J779K74L296r50
5965F342K568q4J572j936j252k145M87k480l854K660J28l212k093R28j368Q01
5949b938p16P59N680R33k480r73M830j884p48J42O42j514K234K624l79m351r68
5932H93M849J400k893M55k166l699n29K048j310n12P97R36K256o31q08j002J614
5915A698R05r98l315N15K764J498J133Q60q0N305L706q656j100J840J517k099
5899E493j63K995l79j437O72L125L803l705J302j136o47j839k578j948l049K681
5883C190J158J396J076o75J04L02N45r62R4Q52k388k038N47j587J420n58m23j055
$$ y = [1228, 1212, -134, 2113, 3735, -598, -4473, -1074, 3122, 3398, 5421, 7297, 5179, 3515, 3720, 4200, 3767, 5563, 6191, 7861, 7530, 4446, 3543, 1999, -2851, 62, 1215, 238, 1943, 3722, 3996, 7292, 6342, 8910, 8826, 10398, 8462, 7210, 5065, 5552, 3072, -782, 1878, 2006, -1206, -3299, -2371, -3739, -2938, -3654, -2895, 2785, 3718, 1238, 265, 5095, 3211, 2463, 2605, 3247, 1733, 3967, 6591, 6212, 1861, 893, 5742, 7142, 4249, 4704, 2538, -1161, -1690, 358, -952, -1464, -667, 269, 2525, 1894, 1086, 84, 1698, 2603, 1605, -1710, -1195, 1569, 3067, 4200, 5060, 4980, 10285, 13991, 5335, 4235, 6075, 7592, 5493, 5330, 8325, 7946, 6509, 7181, 10306, 14109, 10404, 11706, 10570, 9923, 8084, 5506, 3558, 509, 3190, 4348, 5744, 6820, 6145, 6249, 6551, 7096, 6134, 6228, 7080, 4692, 2654, 3201, 1614, 3034, 2476, 2053, 998]
5865I98J17Q21o9K763j663k889J681L003r07K136J375j350j725J603K392k278
5849F008k46R62O41J910q22j727p15k746K674R18k102m4j363K145j120k281m20
5832A672j413q98j673L351O121J498L345Q90R3J737j303M72n59Q78J080n013m748
5815E530m494k018j135P96M190O044L417k269l031N1n222m792j882O9L750L122
5799B126N728K040m17r86m511p136m833p326l077M369O719L886P290K341P944
5784A4157K834k020J427M003j160n162m561l453r560q749j412J214O937P366N884
5769G745K616M859J230l883o705r605n936n639L122Q352O710M733M987J047j762
5754A1871q101q444p002l67M93N617L687N044N968K321K807n36L829N706k503
$$ y = [998, 1115, 1936, 1867, 4630, 2967, 78, 1759, 4762, 3855, 5991, 7366, 6016, 4291, 5894, 8286, 6008, 5762, 6724, 7365, 9275, 8453, 6726, 6011, 3265, 5939, 6857, 4755, 4711, 3348, 5493, 4373, 2092, 1672, 259, -639, -2312, 1039, 7160, 8658, 12003, 12893, 12986, 14723, 13420, 13892, 13333, 14211, 15291, 10278, 5530, 1036, -982, -2117, -1321, 2869, 8913, 12330, 10061, 7030, 7081, 1859, -2933, -4815, -4746, -996, 2126, 7854, 9894, 9477, 8491, 3980, -3156, -7989, -15315, -18392, -14023, -7304, -3418, 3872, 6213, 14157, 16991, 14971, 16398, 20401, 19241, 14079, 9518, 6065, -3495, -12244, -13656, -12442, -5505, 1861, 7745, 10361, 15220, 16450, 12567, 5862, -3743, -9679, -15318, -12196, -3844, 2866, 7599, 12586, 13633, 11871, 3770, -4674, -11676, -12043, -11550, -5933, -2246, 2798, 8766, 11087, 13894, 13358, 17187, 22893, 20390]
5739B0390j222j823k848l140m741l752k565j030r31K168L139M877K787P43q82
5724A1170r390p101K700K81J215J722K355n69J871L546n484m646k808J162P52
5709c224pP88K645K871r12o06N87o47J022J975J652l80j677m929l166k295K366
5692c937L829L013K118M48j631O42j652m29K430j35l958j595K714lK269L296K312
5675I731Q69j023l655l121J407M885K269o91N28O69J309l434n397n57l047K69
5659A011n32r21j667L075L198M959j964j763L960O173k025m472m358l216k327
5644h69P12j340K239J946K957n62m446j405N130J971p46J498j143R07p59q59k003
5627C228K795K935l733p43m434J100mK032L072J243l259N97L049J604k282l86
$$ y = [20390, 19168, 17345, 14497, 11357, 6616, 2864, 299, -731, -1662, 506, 3645, 8522, 11309, 12052, 11170, 1780, -5321, -2621, -2340, -1125, 597, 2952, 2383, 4254, 7800, 2316, -2330, -5138, -3976, -3224, -3231, -2443, 202, 3073, 2161, 1555, 2142, 1495, 2517, 4492, 6144, 5764, 4087, -842, -4008, -6303, -3937, -108, 2905, 5023, 5471, 3840, 4482, 2830, 2401, 4831, 4696, 738, -857, 1857, 1854, 4123, 7419, 9731, 10600, 9577, 5922, 2801, 4208, 9093, 11362, 10671, 11199, 11868, 13177, 9743, 4346, 3789, 742, 1011, 479, -442, -2109, 966, 4164, 9123, 7159, 5396, 9356, 15529, 13504, 9032, 4674, 1458, -869, -157, -1497, 742, 2688, 5645, 5083, 637, -768, 4362, 6333, 5587, 7085, 5942, 6849, 6090, 5231, 3228, 6023, 8958, 5225, 4482, 48, 1148, 1144, 3176, 6248, 7491, 4232, 4829, 7878, 9482, 7200, 6814]
5611F814K621L898Q26n516l937l026k003j423k803J629K178j399M06L203K6j608
5595a14J803k553j530L78k087j053n74K068J796N429J392k174k949M49p4L56K801
5578C364j400o566q51j575L2K373P67K038r36L310K756r05k146q85M01K245l137
5561a115J157k075j92M030K093L62j809J222j203R54l503J662M825j344l466J216
5545B814L945M98k623o228k122K637K002R45p04k251l78N05P49K33j088j336K068
5528c34N103K556K67k154n02l73l915R90K556Q8j110m86r23J172P76n018P58N37
5510a2J126J060P45j502k342L205J886R41O028k362j592p63j934l075j508L158
5494C059K298k6n28N06R81o412j150k063j612K510l524o87M188J750k288J121
$$ y = [6814, 9435, 13333, 14159, 8643, 4706, 1680, -323, -1746, -4549, -2920, -742, -2141, -1735, 1468, 1494, -114, 1689, -864, -2394, -2016, -4103, -5156, -5730, -3662, -1866, 3563, 4955, 2781, -168, 281, 207, 563, 3364, 1964, -4602, -5453, -7028, -6996, -4623, -3856, -1818, -2754, 556, 3312, 2407, 261, -624, -223, 2022, -1115, 42, -2033, -2225, 1805, 3898, 4260, 2451, 3673, 2470, 3424, -79, 1583, 6408, 5064, 1598, 2814, 6759, 7257, 4634, -1594, -3716, -1079, 923, 1868, 1164, -1087, -1465, -960, -211, 22, -1066, -2402, -334, 4769, 7325, 7592, 5438, 4936, 4563, 648, 1638, 4194, 4282, 3172, 2686, 1763, 2935, 3711, -1307, -549, -12, 1114, 2174, 2919, 1417, -925, 2280, 4166, 5107, 11135, 8773, 7181, 6418, 4484, 1409, -99, 3059, 5357, 5331, 4803, 5309, 6290, -122, -1272, -3335, -4947, -2437, -5961, -6648, -2460, -710, -2998, -1877]
5478a877J199L700L427J13m978k940J831N94K485M09n273k585N468K547q19k557
5462G44p79J345J604L124j524j03m083o198q0K121j124J5K259p24J876R80j857
5445b404J019L353K614j577l58n07n85L125N80L047J33k750N89j602Q5k078L71
5428C055L094J820J37l777k306L49j940Q96N34l543J332J228m120j07J828J139
5412c81j868k87R85K055J455k056K060o54k139M17J054m31J230K70K461M090Q70
5395I131l713j511j126K051k57l02K50L635k559q01K129j327j702j812k395k24
5379e33k31L365k059p37J272K709J607o5j953K912J828J133k254o00k120j055
5363C219J9L08K616j933l97j609j645m10J07P05J037k083J588J25Q64J594j747
$$ y = [-1877, -678, 3022, 6449, 6562, 1584, -1356, 475, 1069, 3554, 3963, -1310, -3895, 1573, 4120, 3301, 744, -35, 1310, 2914, 6038, 4514, 4411, 328, -5870, -5950, -3829, -4953, -4938, -2679, -3403, -1527, -547, -2404, -1385, 1968, 4582, 3005, 2647, 2140, 1555, 4680, 5260, 8307, 8440, 5690, 6279, 4677, 4762, 2684, 3055, 6149, 7969, 8106, 4329, 2023, 2372, 432, 1328, 1862, -1681, -349, 879, -3241, -3348, -1520, -381, -2249, -2536, -1551, 504, 1959, -97, 1963, 1309, -830, -413, 641, 210, 1440, 1710, 4171, 8261, 9131, 5418, 3907, 2781, 4832, 4575, 4273, 4523, 8158, 5599, 4798, 6927, 5600, 3898, 2086, -309, -533, -764, 2601, 542, -195, 1077, 3786, 5393, 5328, 3375, 6287, 8115, 9248, 6994, 6394, 4274, 3219, 3238, 3546, 6162, 4229, 3832, 2223, 578, 168, 275, 980, 2017, -66, 1522, 1647, 2511, 4105, 2358]
5346B358m001k57L891j801J395j766k867K114J719K496J067k229k013l10j194
5331a398N5L708O00j741j088L053M44n85l874l887o19K82LL669M37r27K99k202
5313c771j298R2q80M217J158k240Oj421k02K292j92j275J604K326k22K182j760
5296F16j395J376j81p70l570O50J128K394K462l677L318m24J970J031k466J706
5280D168K55j624l229J884L58K516j061p09n42j637J157K366N44J924R15k192
5264E093J10J828Q30k188k276n582J232K185j430J097M67J348l200k595J648O37
5248g96k373j357L26k140K565M528q14J448J618K119K105n324l506j305j098K378
5232a626K863L428q88k197j988K933M025J997L6n180k549O84K764J397p40K285
$$ y = [2358, -1643, -1900, 1991, 190, 1585, -181, -3048, -934, 785, 3281, 4348, 2119, 106, -204, -1398, -1343, 2365, 2965, 1224, 136, 3189, 3633, 3048, -826, -4713, -5332, -5050, -5047, -1378, -941, -1868, -1569, -3771, -5069, -4977, -5857, -1640, -482, -2722, -2716, -4137, -4339, -2047, -2239, -3514, -1910, 416, 194, 2376, 616, -779, 597, 416, -354, -3924, -3274, -2146, 248, 2710, -967, 2351, 1927, 3897, 4928, 2462, 4168, 4423, 2799, -430, 1454, 1812, 4328, 3267, 2558, 2016, 379, 1536, 3902, 4446, 6370, 7285, 5093, 5203, 7031, 7861, 5673, 3397, -2185, -953, 1232, -198, 899, 1366, 2714, -486, -3081, -1433, -796, -3169, -4526, -4200, -6340, -3775, 753, -61, 1387, 3005, 5124, 7229, 1905, -1601, -2906, -4004, -1626, 1237, 4665, 3777, 1580, -408, 2525, 6550, 8547, 8583, 3403, 854, 1538, 4302, 5699, 4959, 7244]
5216G244P67l015n570k374l583P5K631J195k648j530J87L694K989J118k485R19
5200c86L561n12k031J304N56M92K610j872p1O00j75j037j487k906j3M221K222
5183E076L64K016L13o114r90k695j087k507k203j009L42N385K981L227l446k861
5167c208J287K225n39K139j761m452J151L795K495l080l513r90J362L017M178
5152D106k357l020J378j445N92r41j304K548J66l586L338J900l222j044J062k23
5136b052P47K798j058m8o414l121L696M473M185J184j077r0j830k337j205N164
5120C015q63Q7l193n33M527J605l025l538r18K257L359j619J002J560K71M57k59
5103D192n406n094L48K426P47p89l43O33j08M75J636n302j065K54M91L860L821
$$ y = [7244, 8011, 4996, -574, -2948, -6531, -6456, -3825, -2630, -5278, -6808, -6621, -2927, 62, 1180, -1305, -386, 3175, 2663, 632, 1936, 2492, 2984, 5594, 3722, 3651, 4251, 4076, 3039, 1552, -1354, -1367, 2854, 5076, 5440, 7456, 7769, 1655, 665, -2030, -3117, -5624, -7827, -8836, -8494, -3109, -128, 3099, -347, -3208, -1921, 304, -235, 1904, 143, -4309, -3158, 637, 3132, 52, -3461, -4451, -3089, -72, 4106, 1749, -1271, 107, -1338, -746, -1687, -2991, -443, -277, -3863, -525, 1375, -1847, -2891, -1829, -2052, -1305, 1493, 435, 387, -6027, -9148, -5452, -979, 3206, 4390, 3313, 3223, 1393, -944, -2149, 3015, 2152, 2239, -954, -1487, 3040, 4645, 1620, -1918, -2836, -579, 2780, 1161, 2163, 3723, 3994, 4451, 4192, -1214, -6308, -5960, -3534, -2787, -3576, -3919, -3286, -3394, -2919, -1283, -6585, -7650, -7396, -6905, -3045, 776]
5086G76j344P79Q39k817m048R11N775N991j118l878r97k327K13L42J407Q91J345
5069B740l238l813J006J718k17l77l65j614K672K344L690J332m32j448k800l177
5053a979p90j27J450J401J313L731j076j660j190K975L046j060j128o78k88L421
5037G361k622M72J066n74n08q52O9J393n83k859K69k573r56K497N056L983J037
5020A1676j804k965l35o54k742r59P48J343N72M007J02P86o759m008r68K2J672
5003b66J88o85O07K024k063o88J632r08L37j166P26L722J68j732J110l849N96
4986b47L374j483k071j16k595K582L889k714k540K582L846J962n306L38J644n121
4970a976k716L483L102j313J067l429j556L801J244l69l472J862N387j366n530
$$ y = [776, -568, 211, 1050, -1767, -5815, -4904, 871, 6862, 5744, 1866, 869, -1458, -1245, -903, 504, 1395, 2740, -498, -4311, -3305, -1587, -1804, -2181, -2546, -4160, -1488, 856, 4546, 5878, 5446, 3998, 1198, -1979, -2769, -2896, -1446, -45, 1268, 4999, 3923, 2263, 1073, 4048, 7094, 6034, 4906, 4228, 3940, 7361, 4739, 5211, 6277, 5703, 5195, 4343, 4412, 5805, 5222, 2363, 2632, 59, -897, 1600, 6656, 10639, 11676, 9872, 6907, 6572, 5918, 3176, 2217, 2965, 4308, 4880, 8887, 8989, 9775, 3016, -992, -1960, -1938, -266, -78, -763, -156, 1868, -195, -883, 749, -159, 178, -988, -262, 3460, 3628, 1896, 3006, -843, -247, 3127, 1644, -427, -543, -3138, -556, 3333, 619, -1921, 661, 4507, 6469, 1163, 1501, 3145, -1976, -4692, -1209, 1893, 580, 1647, -1782, -3338, 463, 1707, 1338, -2134, -272, 5115, 3749, -1781]
4955a781n82k532K929q10J441N417J035j493K650K687j428j032j356k663l446
4940i64k226J325K664K504j927m759m149l330k312N746N803J087l083j92K205
4925a608J782m048j426K441J292N118o52j063J059M41k538k462k70q10j00K810
4909c4j753l498L717L966j577k926l8J427k032K569L907p91K549L362K333j324
4893I857r94o89l379j59l62o344o39K732l047K536L074o57j161r21J749L983j64
4876E415%J368m410m762J325J045m49K367J222j648k941j70j780n35L23J289N118
4859B777l799l773L163J375j058J958J813j670k971Q88N179l08l467k318j09L590
4843A270L209j471k267K988P76j960k449j854k256O53J082J020j362o08J571Q3
$$ y = [-1781, -2363, -4895, -1966, -2776, -1335, 4082, 5117, 3624, 6274, 8961, 7533, 6501, 5145, 2482, -964, -3190, -1865, 799, 3303, 1376, -3383, -7532, -10862, -13174, -7428, -1625, -538, -3621, -3813, -1608, 174, -3874, -5300, -2859, -1567, 3551, 2899, 1836, 2895, 3336, 798, -1664, -1934, -2744, -2844, -34, -1787, -5285, -1568, 2398, 821, -2105, -2143, -716, -2748, -179, 3728, 2937, 5486, 8848, 11181, 9857, 8863, 8174, 4795, 4636, 4274, -2070, -2709, 23, -3024, -488, 2586, 1929, 768, -153, 1596, 5579, 5415, 5415, 6783, 2373, -2389, -1064, -19, -468, 1899, 3121, 1473, -1468, -1638, -3418, -3953, -3630, -2341, 2777, -1022, -4795, -1632, -257, -1315, 643, 2456, 786, -2185, -1297, 3882, 3574, 107, -2211, -2320, 1270, 4479, 3008, 741, 3729, 4505, 2545, 96, -1758, -4014, -3361, -2279, -1259, -2621, -3229, -1658, -1575]
4827a575J275J228n66K045L981j930l479J937L60j244k417L36K152k243J959J304
4811C123k197o447j214J019k89k893M781M537J038k775m950J019O244K220L46
4796C562j137j4l309j987M38q89O44J856J635J945l023l643J598l98J440k18K313
4779H13J847j438L40j159l975P37J307L002K508K29J007K68k239l074l917j890
4763e634J281p58J547K854L404n44P1R20j849j126k887K980L727k497l246M030
4747B273M236J808j273q07R09k02n173k983P54J202L295Q20k053l355j597R62
4731a184n47K028R01N95j592J229k601K033l58l959L995l454k19K739j11K478
4715A973l7L8J03M64l061j098N326M171k225j524k357J887O85j359k359j145J337
$$ y = [-1575, -300, 928, 362, 2407, 6388, 4458, 979, 2916, 3276, 2032, -385, -49, 2103, -140, 1819, 3123, 926, -5521, -6735, -5716, -6005, -8898, -4117, 420, 1458, -1317, -6267, -5248, 996, 3216, 3562, 2425, 2411, -898, -2885, -2447, -3336, -2692, -836, 799, 2744, -279, -3922, -2324, -2722, -1282, -1500, 813, 2660, 1222, 1562, 403, -3572, -2835, -1528, 1474, 3982, 4211, 5218, 5486, 3247, 173, -3744, -5634, -4353, -5111, -3564, -710, 2694, 2150, 2221, 3141, 1292, 166, -2721, 259, 3986, 1489, -1757, 2273, 6509, 8317, 7044, 6237, 7146, 6944, 1771, -1212, -458, 744, 4039, 4859, 2806, -549, -2146, -1184, -1731, 297, 1198, 1793, 201, 1430, -1171, 862, 504, -3455, 540, -2914, -3133, -394, -505, 1973, 1936, 1974, 2077, 2541, -520, -1618, 3708, 7879, 5654, 4130, 1773, 3660, 4345, 2986, 627, -518, 819]
4698H19L917k250L781j062k840j363K30L302M035k117l165l142P81k32k72k309
4682a887k069j303L99L17L578L454M50j885L396p69k796J467K103l93Pj239l395
4665e65j340j861L792M318q78k164j710j289J585k570K60l20J467J441L349L761
4649G276k069p634l675K488N90l766J137O423J711j591j554j755n154J335M060
4634b178L12j834P19J407J753N19N07o72l0k349j67p63q64O38K633O9o82l002
4616c984j423P70K939J919K918j070M42k67o16N54L936O87m695o282k705k84R90
4599f171M362n78J387M19j615Q50J2R19j767j770L71K573K095j281l55L712K34
4582C397j834n141j143N109j821k760j974R70J334K792j573j758r5M348J977j606
$$ y = [819, 4736, 2486, 6267, 5205, 2365, 1002, 1232, 4534, 8569, 6452, 3287, 145, 926, 694, 422, -1887, -3956, -5259, -4860, -4543, -965, 2489, 2939, 1054, 4450, 3681, 885, 2352, 4455, 4062, 4069, 2830, -565, -1905, -3766, 26, 4344, 3466, 1302, -408, -1697, -112, -2682, -2422, -2742, -1275, 166, 3515, 7276, 5207, -2427, -6102, -3614, -3024, -6790, -5653, 770, 2481, 890, -664, -2419, -7573, -6238, -2178, -1866, -3700, -2981, -1574, 179, 698, 1205, 533, 503, -1846, -2013, -2776, -3640, -3002, -369, -300, -982, -3984, -5407, -4637, -1698, 221, 3139, 2069, 2511, 2244, 1628, 2182, 6118, 6805, 2110, -4172, -6877, -7161, -6171, -1809, -2387, -1000, -581, -2196, -1346, -1334, -415, -2182, -3952, -3581, -1008, 1087, -194, -549, 3163, 3397, 1563, -3578, -4721, 388, -1433, -4193, -6167, -5197, -3863, -1071, -2644, -4402, -4497, -149, 1828, 222]
4566B22j16K712l121j731P26J015J239l51k222K614m86k811J129P81L028L65o20
4549B373r37K427L488j115n95J793M93q87k796m584j228J625j031k278P33L226
4533G07P49p01J935N81l055Jk837l025L518L880l909k461K138L589L397l7j085
4516C385q48j543j041n187k23N864M540q17p81Q06L370Q87k671j865l739n77m63
4499i03k44K578K762L46j013K630J687k020l52r10k197k847N11M463k767l384
4483a660M144m54j018n63k575M20K481k453k370n20N40K7j125P58M207J521q61
4466D99r54q99M0o56K363l020k570K111q3J257k07R82L770J921K550j032m36j681
4448C955K166o59r685j404K924J748k64K559o52l533l519k19k750J533N247J682
$$ y = [222, 106, 2818, -303, -2034, -1308, -293, 946, 595, -1627, 987, 501, -2310, -1181, -400, 2628, 2993, 2373, 1436, 3863, 7351, 6236, 5641, 7434, 7927, 7040, 4244, -340, -1568, 57, -974, -3252, -2519, 707, 1456, 755, 2690, 3271, 216, 217, -2620, -5645, -2127, 1753, -2156, -4617, -2479, 1110, 4507, 4470, 3385, 2537, 994, -47, -5234, -5457, 407, 4947, 4130, 3349, 4155, 7525, 8412, 5741, 3876, 137, -440, -903, -1147, 1431, 4193, 4539, 3526, 6156, 7843, 5823, 5471, 4561, 2364, -483, 28, 4491, 1724, -1660, 2484, 2030, 1012, 449, -2126, -1706, 775, -1678, -4048, -4568, -4028, -4001, -5126, -4368, -161, 1360, 499, -455, -1354, -1314, -1970, 393, -2627, -5197, -3086, -3169, -1912, -2119, -1137, 2633, 4554, 7104, 6072, 5636, 3955, 6121, 5462, -4223, -5627, -2703, -955, -1219, 1340, 688, -2845, -6364, -6583, -9333, -7800, -2553, -871]
4432h71k184J727K600j932k053P08j131j312N63K441l73m498j710K040j044K894
4416d135K569O54k76n90L802o23m486k304K05l08J152L462J656q0j935l927M8
4399e116P82J461j05M058k695k806j323q45J108p28M685M809K84m247K83q57L59
4382h93q42m83k613N10j558l936L592L173j694K821K546P34J558l082k260J802
4366f25J575k036j798Q67J216j25p68L731K308R44k952j140J159l989m878j791
4350h302k008K72J308r7K892O015Q60j494j533l079n45N11M30J549O73m94J540
4333a502J390p01K585l910l221o70k112K215L231K467L942J042j476j533M78j721
4317E04k00J147M71J63Q87L23j411q10O35R14j445n920K027L266J702J916J486
$$ y = [-871, -3055, -1328, 1272, -660, -2713, -2005, -3136, -4448, -3885, -1444, -1817, -6315, -8025, -5985, -7029, -4135, -1566, -912, -1188, -1778, 2024, 1401, -3085, -5389, -5184, -5492, -4340, -878, 778, 698, -1237, -5164, -5116, -4334, -2873, -2978, 1080, -1615, -4421, -5744, -6589, -5481, -6209, -1524, 3285, 3569, -678, -395, -1252, -893, -1735, -2218, -4831, -4321, -5879, -9815, -6223, -3050, -4744, -1923, 623, 1357, 2915, -167, -2427, -625, 950, -1086, -2884, -2017, -801, -926, -1694, 2037, 4345, 5289, 2337, 1197, 2356, -1633, -6511, -8302, -10310, -10038, -8730, -8827, -5935, 80, 940, -554, -2087, -5166, -5711, -5200, -4770, -3221, -2548, -3042, -1502, -112, -813, 1772, -2138, -5359, -6029, -8141, -5926, -2695, -228, 3714, 4756, 3280, 1747, 2225, 504, 304, 1451, 1922, 2085, 2972, 3295, 1884, 1074, 1709, 2623, 1178, -4742, -2715, 551, 2253, 4169, 5655]
4300E655j236k062l710l636J160N448j853m782l165J462J801L591K38m528K35
4285e382K310j774j133K973M060J685l140K897J875o899k472p00M168K81l5k928
4269d214J068M561K653K86j827L446j164k015k108J06K720j866k069q64R04O46
4253B63k92j200O33o96J256j242r08l167m82K052o19l668l71N717N698o31j898
4236D45n51j678k11J556L692m043k914j412J39j184L945M229o59K272n250n161
4220f785J821L883J786J65l072N6K041l36j415J918k212k026j193j484M009K131
4204g13j395k242j482O06J697L218J547l31J420j364j076m94J111M22M16l263
4188a923k445J047K67R79L891l95J016O64l988n760p27J380j140j195M368K168
$$ y = [5655, 4419, 2357, -1353, -4989, -3829, 1619, -234, -5016, -8181, -6719, -4918, -1327, -1089, -5617, -5382, -3072, -4846, -5979, -3006, 1054, 2739, -401, 2496, 4371, -2528, -5000, -5700, -1532, -1251, -1286, -4214, -3146, 1415, 4068, 4354, 2527, 5973, 4809, 2794, 686, 792, 3512, 1646, -423, -1287, -383, 263, -29, -1229, -596, -1292, -36, -1278, -2186, -5353, -5835, -3783, -4402, -8070, -8441, -2724, 2974, 2343, 445, -106, -1784, -1995, -439, 3253, -790, -3704, -5116, -4977, -6161, -2216, 2013, 1354, 3626, -1624, -6785, -4964, -1081, 705, 870, -2202, -2146, -105, -441, -1856, 62, -2150, -4176, -5369, -6853, -2844, -713, -2108, -4350, -5832, -5226, -3529, -311, 1236, 905, 2325, 961, -115, -609, 502, 924, 1340, -1923, -4368, -3321, -3054, -2075, 1816, 1421, 2437, 3101, -887, -6647, -7374, -5994, -7134, -8329, -3961, -1793]
4172a793K019Q02k721j720K418K281j351j286m431J680j4j251k59K834m15j95
4156c402k098K849K831K561K389q64m302k12k894J206J327r64J809k382k820J022
4140c944K752R33P31J518n696J575r5J282K062j612J582L154M33m533O92q99K234
4123B169k21n593j310L334L326L646j728j368R18J821m087j291L441j14l778J756
4107I21j638m21Q66J463j197l530m83l532m09n88K410O199l73l547J713k546m07
4090e099K661l41k295l38K783J841J112l182Q52O116R59o13k095J79p07J421M37
4073C691R91o472J076K558q43j821m720M461M205j393O48K72R30l095j931P26
4057g17K264j121j596r77k579Q07m40K062L376K217j109j013j711l673r61M218
$$ y = [-1793, 226, 1028, -1693, -3413, -995, 1286, -65, -1351, -5782, -4102, -4116, -5367, -5626, -2792, -3207, -3402, -5500, -2651, 180, 2741, 5130, 4266, -36, -248, -3142, -1936, -609, -1573, 236, -2146, -4966, -3944, -1192, -259, 472, 1990, -3706, -2131, -2226, -944, 1118, -494, 1088, 4242, 4675, 142, 834, -65, 2169, 1948, -3645, -4955, -1621, 1705, 5351, 3623, 2255, 3173, 4994, 907, -384, 3057, 2943, -835, 921, -717, -1138, -272, 1191, -6, -3536, -4019, -7551, -7960, -8548, -6138, 61, -312, -3859, -2146, -4692, -5099, -2438, -2779, -5074, -5412, -2629, -788, 324, -2858, -2006, 4110, 5069, 4456, 2361, 2540, 1833, 3254, 3691, 4682, -1790, -714, 1844, 1001, -820, -5540, -1079, 3126, 1733, 2381, 2653, 3583, 488, -1443, -717, 1547, 426, -1170, -2147, -4726, -3919, -4359, -2297, 1079, 3296, 2187, 1174, -537, -4210, -5171, -953]
4041i53K158O39j454j683P47P84K351k808k592l272r34N965m08k876K204J35j37
4024b134l31J755k93k445k529R13n84l05K410J57Q87M312N58j312p83j942j0l436
4006e112j536M95O73j123L698M232j273m673l714j276L579K362m210J68J963P85
3990d962M21k60k44k666L518K549K45j035mj479P80L310J661J843l028k055L171
3973A765j443m17j525J260o64o92L33l450l806K399N15l091J588j983K53L001
3957e957M759K409K173j87l509NK06N54L043m12k589k594K542k213j597j381K460
3940b288J388M906L850l20J238K781l761k100k476k537l493n26j05j907J461k35
3924d124n161K935K695L253J987k234J067l019j639M720J598J110j438J27J287
$$ y = [-953, 1205, 1844, 390, -1293, -546, 238, 2589, -219, -2811, -6083, -7017, -1052, -1460, -4336, -2132, -1997, -2134, -2465, -710, -1003, -3448, -5977, -5064, -5648, -5953, -3543, -3386, -2499, 1813, 2371, 1059, 276, -1666, -1676, -5112, -6648, -6153, -5480, -6603, -2905, 1327, 54, -4619, -8333, -9609, -6030, -3668, -7878, -7710, -5747, -4962, -4541, -4801, -5045, -7711, -4193, -1644, -1399, -2434, -2438, -3917, -3137, 173, 1834, 3677, 649, -1406, 1765, 322, -95, -1620, -360, -1024, -1716, -1383, -4833, -8639, -6240, -5725, -8816, -7228, -9211, -8958, -5957, -1198, 1211, 3384, 3197, -312, -307, -101, 453, 3496, 3084, 495, -2099, 443, -1770, -3367, -4748, -2288, -900, 4006, 7856, 7536, 8774, 11555, 7794, 5694, 3218, 681, -2812, -3338, -3443, -5350, -3889, -4124, -9285, -6350, -3655, -402, 1585, -649, 418, -2601, -4240, 480, 2078, 3188, 1750, 1877, 3164]
3909C164M053M508J597k797m834Q0k389j168m00K47j405J367l271k810K377L82
3893a299n38k130L596N138L07k971K443k894O05r85k503J251M321l75J771q64
3877D873J34R98Q17J792K148k11p918m260K68L002O19K733M103j382l942j589
3861B185m772j208m40J944J560k83j738j312J669M979K489r5k487K48j495l415
3845b171k492n04R61K421R4l9k363j649J918J999R41k719j562j841k867N59N255
3828d059N324J152k761k541K70J156K077l03K767O721M366J899j1486q966k433
3813f817l93L659L443L115j755n873k708L465K780J302J03k901R57l080M74L621
3797f08K972j816J620j791J035j230n259K483J502K03N22M19j89Q86k40j626L97
$$ y = [3164, 7217, 11725, 13322, 10525, 5691, 5771, 3382, 2214, 1814, 2061, 656, 2023, -1248, -4058, -1681, -1299, -1837, -3967, -371, 4767, 5074, 2103, 4546, 1652, 2257, 1272, -1231, 20, 4341, 3966, 5737, 4873, 5007, 6005, 6822, 8614, 10762, 10551, 2633, -1627, -1359, 1643, 2262, 4995, 9098, 7716, 3774, 2185, -2587, -3795, -4235, -2291, -731, -1014, -2752, -4064, -2395, 2584, 5073, 4978, 2491, 2739, 1244, -2171, -4663, -5167, -4206, -1785, -1691, -1730, -4093, -5742, -3824, -1825, -884, -3603, -5165, -7006, -9873, -9314, -4059, 1265, 2417, -344, -2885, -2615, -1459, 618, 315, 3082, 9803, 14169, 16068, 4582, -4384, -6817, -7210, -3551, -108, 3007, 1252, -4621, -7329, -3864, -1084, 218, 321, -2580, -1623, -4703, -4229, -608, 2364, 548, 2168, 377, 1412, 182, -5077, -2594, -1092, -889, -367, 52, -137, 749, 509, -1117, -720]
3780g20k086k652J774Q81k193j175K308J742J889J669J242k259j706L023K537
3765D274k243l835j161p72k537N63K06L803M891K616k36o57q75k909p58K347o30
3748B087j996l874m19l55j421P22Q32K173M25K455J020P19k413J705L217j676
3732C201j853o0M99l501j655J067K96q94k706j897J439R96R16L131K099m632k408
3715e962M667L483J689m593j282M732p67k629K313n95l141m994J238L790J309
3700g42j815r65L016R23l052j318o59N2q29j18O949P43k100k052K139p90K36K978
3682B596O25J357k604m635k699K019Q72J719p71J342K191O64n050K903J378K67
3666B174l372n201j648l051K877M430L37j59K764M89j502J968j096k496J641O616
$$ y = [-720, -2806, -5458, -3684, -2803, -4996, -6171, -3863, -2121, -232, 1437, 2679, 420, -1286, 1737, 4274, 2031, -1804, -2965, -3737, -6274, -5711, -5505, -1702, 3189, 5805, 5569, 4912, 4037, 1128, 370, 2717, 2087, 91, -3783, -4202, -4557, -5978, -5256, -4424, -2251, -1826, 629, 1649, 2368, -45, 1660, 4877, 3201, 1348, 1288, 1787, -1714, -3369, -2302, -2006, -2900, -5606, -7503, -6064, -5068, -4152, -1021, 1078, -3554, -5962, -1295, 2188, 3877, -716, -1998, 2734, 1967, -662, 1651, 1056, -2085, -7079, -5841, -2051, -742, -2557, -3522, -506, 417, -2635, -3953, -4612, -4560, -5389, -5507, 1442, 2185, 85, -1967, 172, -618, -382, 2596, 3221, 4578, 1974, -2661, -5360, -3341, -2469, -750, -1521, -179, 2012, 2676, -2374, 529, 1907, 2174, -1198, -6399, -8047, -11098, -8221, -3791, -3454, -3613, -849, -360, -1862, 106, -990, -3486, -1845, 4771]
3650D771J831O00J709n462J577k762k041r95K573j246k890j590L866r18K85M450
3634C758k702l8O10m998l757R14J542L08L740M819m98K387J066j073n952n474
3618e348j426M759J77k111K663K910j716m703k97R46M170J817l672j374K569J061
3602D25k022K388K769n316k968J191K396O7J894k73k649N177K263l63j541k048
3586A390n35j818k233r6j911P54M572K021l34J96j580R76k95k371p55M041M35
3569B457J57j853L37j264l1j59j625m323j150L669J225K890j73l008l062K957
3553b956L2J150J861q41k371J080p82n98l247j753Q182K052o270l341M595L840
3537F33o63k839q91L783n24K631j300l867Q89j1q18n08J097L276K501J633l277
$$ y = [4771, 6602, 7202, 8911, 3449, 5026, 2264, 223, -772, 1801, 555, -2335, -3925, -59, -977, -692, 3758, 1056, 1018, 1628, -3370, -7127, -6213, -4671, -4363, -623, 4196, 3698, 6085, 7151, 6078, 126, -5348, -6774, -2015, -1838, -3949, -1286, 1624, -92, -4795, -5092, -4146, 24, 1841, -1831, -3205, -636, 425, -1597, 791, 3560, -1756, -4724, -3533, -1137, -1070, 824, 551, -2098, 3079, 5342, 4979, 3438, 1390, 855, -963, -3196, -3292, -5203, -4449, 123, 2144, 1810, 2006, 426, 1402, 1107, -1264, -2019, 2022, 2457, 2614, 761, 1098, -166, -197, -356, -1981, -6304, -7454, -3785, -2560, 330, 157, -2851, -5913, -2956, -2924, -1774, 87, -754, -3125, -2045, -2827, -3425, -6672, -8425, -243, 1809, -4461, -7802, -3207, 633, -30, -2869, -3760, 23, -501, 2130, 830, -3037, -2148, -2159, -2977, -3485, -2388, 888, 3389, 5022, 1745]
3520A745j800n71k32j575k534q47j064K704J025J172l493M30N12K121M297R40
3504B830l136j254j702j019P64O51r93m051K615N169K526l71K84j260K81N83P02
3487B619l312j808m9R21K010N176k990n272j745L649J791L85j629L011K49n658
3471b652P52L608m93j973K078L2k412k808j193L281L444K80l905n629P76N64N45
3454e705J101N868J837m437j811L089M881j379k765q96j813P50K229m183k140
3439e374K743J163k237O2K326O37L746N90m132l966J911J436N86j0K750J09k016
3422C24%j897j124k14K695j544l463J233M060l927J060J613j330J693J514J202
3406A895K25k485k499J851j805j543j652k464J202J311n20l195o97j021J83N454
$$ y = [1745, -55, -626, -858, -2433, -4967, -5814, -6878, -4174, -3149, -1977, -5470, -5040, -4528, -2407, 1890, 2830, -306, -1560, -3262, -4281, -3517, -2866, -3859, -7910, -5295, -126, 2400, 2029, 2313, 1053, 1334, 1917, 2619, -693, -2501, -2550, -1629, 381, 5557, 2567, -2705, -4450, -801, 990, 1375, -254, 2757, 3006, -2652, -1900, 1708, 1215, -758, 1320, 1352, -1060, -3868, -5061, -1780, 1664, 1944, -1961, -7590, -6814, -6250, -5705, -4604, 1264, 3101, -1336, -3147, -58, 4823, 3444, 679, -217, -2030, -1280, 949, -3234, -5374, -2631, -1468, -3705, -3643, -1317, -680, 3066, 3656, -476, -4442, -2531, -1095, -509, -519, 2231, 2340, 324, 324, -1573, -2697, -2911, -216, -1760, -5223, -3990, 70, -3857, -2797, -1184, -2514, -821, 693, 1895, 2120, -365, -2864, -1013, -2818, -4361, -6013, -8477, -7275, -5964, -6484, -9679, -10376, -11397, -11214, -5760]
3390e760O303K371j098k508l381K770k49j71K357j321O37k848l040K596l197l848
3374a0387O020M313n285J260O70j253J215O64k833J682N963J290j535j024K291
3359C051j284K44R75j00l530m626k017N85k40K109j535k502L519J363O08m36j658
3342e474j17K449j854N428J884L484q1k818l518m496k35J816J887R06j708r23
3326c370K100k738K706J858L68J279n37n344k578p71K384K065J910K754J012j350
3310A748l60J170p57n145l493R80j259J056M487M365j500j269n784P65N18K623
3294a855o08j172l625M89K389K575L566R55n249k818L688k08k333O040L733n194
3278C73l80n37k899L87R00n563k174K279O197K298l303l569k616J059q32q01J572
$$ y = [-5760, 543, 2914, 1816, -692, -4073, -1303, -1552, -1723, 634, -687, -50, -2898, -5938, -3342, -6539, -10387, -4367, -54, -5339, -4079, -3409, -4662, -3447, -2783, -5616, -3934, 2029, 3319, 1784, 760, 3051, 1767, 2011, 2986, 2886, -644, -5270, -7287, -6702, -6942, -4833, -6368, -8870, -5351, -3988, -3380, -3816, -5474, -5591, -3142, -4996, 432, 2316, 5800, 5719, 2901, -617, -5113, -5348, -3532, -1645, -739, -2447, -3370, -1270, -4008, -1302, 556, 924, 2203, 1666, -3678, -6256, -7027, -4643, -2578, -668, 2086, 3098, 1748, 1388, 2558, 1801, -3344, -6837, -5857, -7116, -6060, -1573, 2792, 1292, 23, -5761, -4996, -4478, -1855, -2463, -3635, -7260, -6771, -4382, -1807, 1759, 2714, -2535, -5353, -1665, -1873, -4206, 1834, 5567, 373, -7, -544, -3443, -3056, -2156, -7719, -9893, -7614, -1417, 881, -2422, -5991, -8607, -7548, -8380, -9181, -7609]
3261g609M293M1n80K405N113m594m93N02l24O70p94j939K936j003M46l619J82
3244d367L254K735O89l931l590j941N05K555L045m1J54r14M162P200j266p541
3228G08M72j882m209j328p22k008J310K390M512N2J269J52J761N14J12k923k427
3211b247j381J82J316M892p36k625l297k537k355j37p76L243K254K915M268L437
3195F416j083l409k419l438n93r32j459j013J557L111L573j232J561r86k63j622
3179b231q8O45L539o51O9K882J429j440l861l726J9O92j034J542k329l898K746
3162e695O30J104K093J265o04p70k671m052K191M201L303J346k487K512k047j485
3146a166k693l320N59Q24K419N61l01l14K50J777j465j0l48j525L211K303o048
$$ y = [-7609, -3316, -3275, -3855, -1450, 3663, -931, -1424, -922, -1246, -576, -1370, -3309, -373, -1376, -930, -4549, -4367, -1113, 1622, 2311, -1620, -5210, -7151, -6646, -4091, -1046, -1087, -933, -1847, 2315, 9515, 8249, 708, 1180, -702, -4911, -6239, -6961, -8969, -7659, -5269, -757, -705, 564, 716, 2477, 2991, 3103, 180, -2247, -3628, -3446, -2130, 2762, 2026, -599, -3896, -6433, -8788, -8925, -9701, -6458, -4204, -1289, 2979, 6416, 5333, 1924, -495, -3933, -4526, -5458, -6917, -7930, -6373, -3262, 311, -921, 640, -346, -609, -2231, -2319, -1674, 1865, 1214, 1283, 4165, 5594, 4154, 293, -3433, -3414, -2722, -3756, -2214, -4543, -8441, -5695, -5065, -3961, -1868, -603, -1207, -1977, -4648, -8700, -6509, -2308, 995, 2341, -146, 2366, 319, -1166, -3859, -7179, -6620, -5796, -3377, -2816, -3117, -3431, -3181, -1404, -2869, -2879, -3227, -4752, -1541, 762, -5286]
3129e286l514j89J206K550N220J054l948j8p75q54P56p61L014L545M4m89k199
3112f44m323l027K598J381L120M999l569l445O083K081l498j881j918L650k332
3097g25p06O9j74O4J360K258J521K979K277k139o190q21J525k470P18P8L030J963
3079D617J736j961m099r01j642K113R84K446R5j393l041l470O71N916M69r91k155
3062f06P5k475R56l786j606L7K1O72L760J25m93P17l164m509O08J198j897l842
3044a4209j721O526L559L005r34R26m82N73n80m907J597L060J822J228N30K387
3028B380o16J281J026j515N96N88m587m050r87J45J961L396L911L45q7r35j879
3011I73j032J125l455m15L190J52k968J027r80P9L996J761k651k794n38j054L42
$$ y = [-5286, -8800, -8989, -7783, -5233, -13, 1041, -2907, -2925, -3700, -4554, -3798, -4559, -1545, 2000, 2044, 1555, -644, -4967, -7994, -5396, -4015, -895, 4104, 535, -2910, 3173, 5254, 1756, -125, -2043, 1607, -725, -1431, -1362, -1536, -1472, -112, 2146, 3667, 6646, 8923, 6784, 594, -227, 1298, -1172, -454, -376, 2654, 4617, 6353, 4392, 293, -608, -2250, -137, 847, 3293, 3388, 1995, -1046, -4516, -3845, 2071, 2540, 1549, -606, -531, -3006, -2050, -5836, -7442, -7405, -7384, -6712, -2952, -2827, -3320, -2603, -5767, -10276, -9668, -8470, -10367, -14209, -15930, -9404, -5845, -2840, -3774, -2848, -3330, -2757, -3337, -8244, -6647, -3587, -1765, -537, -7, 2380, 1764, 3045, 4071, 2556, 3152, 3740, -847, -4897, -5884, -5739, -3778, -382, 3529, 3874, 3787, 2852, 973, -59, 1066, -2389, -2804, 386, 538, -2430, -1403, -2383, -2304, 1692, 3453, 802, -1992, -2530, -3584, -3242]
2994c242J543j36k269J295q6K674L74Q13l69q73k334R82K869J87j434q91L103
2977B206j265q1K516j635l281k327K053O10Q33q16Q17J60k820J237O93n90j718
2960c408j507j156P021L218l114j970l643l114J367L242j63q20K710j804k878
2945f019k902j723K204J952r7q43M02L55M04l82M689M269L307J203k795m943n571
2928f490K284J788j344j62M366K359k811j352o77K315k355n100Rl97K795O615
2912A843O543j91n09l707m61m798k52J949l985j871L045l27m956j471K114K669
2896d365j49l077J023J092J480J698o23K40o0L92M654L301K81l208m158j809J622
2879a666j537J000j427L05O11J169K215j493j896k518Q59K000O85J4n96j725J304
$$ y = [-3242, -1699, -1835, -4104, -2809, -2895, -221, 153, 966, 597, -276, -2610, -1628, 1241, 1428, -6, -897, 2206, 941, 860, 3376, 1741, -1540, -3867, -1814, -1204, -371, -1187, -370, -210, -3030, -1793, -1100, -1690, -3408, -4915, -6071, 950, 4168, 1054, -916, -4559, -7673, -6306, -3064, -3227, -4047, -1337, -3141, -6019, -8921, -10644, -8440, -6488, -6585, -7428, -7026, -6671, -6267, -6649, -1960, 2309, 5616, 6819, 4024, -919, -6490, -4206, -2418, -3762, -3924, 442, 2801, -10, -1362, -2039, 276, -2079, -7179, -7170, -7567, -4772, 1843, 8386, 8195, 7686, 3979, 3518, -1280, -1532, 417, -3568, -5439, -2394, -2721, -7677, -9148, -7034, -4365, -4514, -7591, -6568, -5476, -3996, -2298, -2921, -2681, -2741, -2349, 2305, 5606, 5887, 2679, -1479, -3288, -1666, -3203, -2203, -3630, -3325, -2714, -1545, 670, -823, -2719, -5237, -4378, -2378, -1693, -1679, -2275, -4000, -2696]
2862b696K057L156j618K345K93O61p60k151j408j757J338l410j356J167j17L437
2846h19K074J001J728j733l416j374N37J821N79k849J911n07k790j08L221j599
2830b323n37N74K802J283m61M9j677o304o47J812J400K259j444J499k654k079
2814f448J674K614L00q37j737p16j579R11J362m181n3R85R24J881J806j597k112
2797f803j088k405m66L571O248R98j702O19K555r21m405o77K865L150l548J649
2781c60J177R54J198n949l37M862k057J378K672j422k973j143R90J900j985j976
2765c071m146k949J018L357L146K582M199m125K092O29J795M290J529j6n767k517
2749B046k531J363L43k226J861j205J546J012k466k347k727j949m20K209N818
$$ y = [-2696, -639, 2517, 899, 3244, 3537, 4198, 3438, 1287, -121, -1878, -540, -3950, -5306, -4139, -4256, -819, 1255, 2256, 3984, 2251, -1165, -2539, -2002, -181, 398, -2451, -540, -1047, -3837, -3945, -724, -2323, -2860, -2286, 516, 1799, 1338, 1387, -290, -6594, -7241, -5429, -4029, -1770, -3214, -1715, -4369, -6448, -4774, -2160, -1860, -2697, -4434, -5150, -6729, -5818, -4456, -8637, -8690, -7705, -6781, -4900, -3094, -4691, -6803, -7891, -10296, -10762, -7191, -943, 55, -1647, -1028, 1527, 606, -3799, -4476, -1611, 1539, -2009, -360, 817, 1771, 2969, -2980, -3317, 1545, -512, 866, 3538, 2116, -857, -2000, -1010, 890, -1095, -3071, -7217, -10166, -9148, -5791, -2645, -63, 4136, 11, 2103, 2732, 4527, 8817, 10346, 10330, 4563, 2046, -485, 878, 1221, -1005, 856, -349, 1197, 2209, -257, -2604, -5331, -7280, -7700, -5491, 327]
2734C27M108N481l86m759N29k206m503J287j4j446l371l498l972L615j267J015
2718i060M184L819K846l488k46L431L268O70l329k620l422L532L492j133K561
2703D505K16j37l758j375l8K483O94l881m474n689L954K517J283R12l118l703
2687i609j090J337M137K389R04k760m55L129M396J034J083Q79n024k261N286J507
2671D882l038l118K783P43k596J15L349o96k307J660J812j036k94j016q33k785
2655b375k832J075O076M739l622J000k630n236k920Q9k015R46K00K804K219K35
2639b247L535j588k170m420O21N302M648n7j083j470k445k03n886l231K500N608
2623b586J449K738P89l63o71J850k836k169n69N055J548L585J372j424O81m006
$$ y = [327, 4435, 9916, 9530, 4771, 5300, 3094, -1409, -122, -136, -1582, -4953, -8451, -12423, -8808, -10075, -9060, -4876, -1057, 1789, -1699, -1945, 1486, 4754, 5424, 2095, -525, -3947, -415, 3077, 1944, 4505, 4721, 4584, 826, -549, -587, 1896, 2590, -1291, -5765, -11454, -7500, -4983, -3700, -2788, -5906, -9609, -10699, -9362, -5225, -2836, -1932, -4692, -5147, -2018, 2378, 3412, 4495, 5374, 350, -1911, 3375, 4882, 1844, -1274, 1509, 2252, -344, -229, 3120, 2424, 117, 1777, 3589, 2553, 2259, 1243, 410, -2375, -5207, -4132, 1944, 6683, 3061, 4061, 1431, -3805, -6725, -6636, -8651, -7705, -7505, -4701, -2482, -2247, 1288, -300, -2470, -6890, -6269, -967, 3681, 3624, 2541, 1071, -1374, -1577, -7463, -10694, -8194, -2586, -1137, 1601, 2390, 2027, 1356, 3206, 370, -1799, -2368, 2687, 4235, 7820, 9192, 7768, 8449, 4443]
2607D443l632J074m32K18J777j569m258j344k28K469J957J790M521rp632Q30J858
2590A833j977l139O28K117N56R32O23J16r36l482k847j235K473L226K258l90J021
2573A777L943r4m258j269r55k585o5j957K10K586K268j925K200j893J189R90m424
2556d262j2K036K037j624l594j444p77J775K899J856K947K43l496O23j776M85
2540b084Q69n24j737m28Q3M219J232k171r26J232R49j309k123l478M47l211J928
2523g032K467K412R7O8K34k28j534p80K042O697k93j326N77k471n448J925M005
2506A412R33N24n06j780j03n886J145O76n03o46J862J545J119K060J951k844l421
2489b462j592P98l93K757K400o7l307l081M44R14k266K482K188K469J483M97j59
$$ y = [4443, 811, 1885, 1453, 1671, 3448, 1879, -2379, -3723, -3951, -1482, 475, 2265, 6786, 6777, -855, -25, 1833, -144, -3283, -2655, -538, 18, 950, 1573, 1689, 753, -2729, -5576, -6811, -4338, -1112, 1146, 756, 1777, 5720, 5626, 1368, 99, -856, -3441, -3506, -5463, -5253, -2667, -399, -2324, -124, -2017, -828, 162, -4262, -4274, -2238, -201, -1825, -5419, -6863, -7640, -5865, -2966, -1110, 1837, 2080, -1416, -793, -2569, -2084, -1215, -1739, -3476, -3904, -3821, 398, 1630, -541, -1467, -235, 714, -595, -2718, -6196, -5749, -8960, -7032, -4565, -2153, -2056, -1988, -1754, -1982, -3516, -4296, -2254, 4443, 4150, 2824, 3401, 930, -4518, -2593, 1412, 2345, 2869, 2363, 583, 480, -5406, -4261, -3585, -4088, -4734, -2872, -1327, -208, 1852, 3803, 959, -2462, -4054, -3256, -3649, -892, 1508, 1441, -1866, -4947, -4503, -3589, -5855, -3373, -1185, 1284, 2767, 3264, 3105]
2472C105m776j831p65J28l906J828K778L609K23J94J950K037k849k583q11K53
2456a416J833l748l32l562L324N704J596R75n71l694Q54K650l757O51L602m176
2440f7p14jJ334r7m20n44N60j104K728p58j423l577J18L479M716P66l704k940
2422a648k802k25L099K265j643j571J837K50K008o116n91J182L319K446j382k2
2406D06J394k456l080k268J58K517j764K91K793P298P88j759k709q49J972j603
2390A129K806l15K31J684l023m880l45K500n99M01q79q38l230N19m24k902j91
2373h356N2N18N212n71p71Q98k129n542J093O100J001m06j188m220k642l8L689
2356g300O127M086L329n944k084L768m59l261K087R10k128k025JJ166k13J400
$$ y = [3105, -1671, -3502, -4267, -4139, -8045, -6217, -3439, 170, 393, 587, 2537, 4574, 1725, -858, -1669, -1416, 417, -3331, -3663, -7225, -3901, 1803, 3399, 4374, 3803, 109, 963, 3613, -144, 507, 4109, -67, -781, -782, 552, 455, 35, -509, 51, -1053, 1675, 917, -506, -4083, -3965, -486, 4230, 4996, 1292, -1648, -4450, -4675, -1576, 689, -954, -2525, -688, -438, 1570, -4546, -5137, -3955, -636, 1810, 428, 406, 1800, -656, -3736, -6004, -5846, -3329, -5093, -4802, -2009, 5289, 6077, 4318, 1609, 760, 2732, 1129, 3935, 3620, 3851, 5535, 2512, -2368, -2713, -213, -812, -411, -1290, -2128, -5358, -4839, -5263, -8165, -8356, -8304, -7786, -2574, -3145, -3916, -3018, -5147, -10689, -9596, -3496, -2495, -2901, -4089, -8309, -10951, -10989, -7300, -1173, 2913, 6242, 298, -1786, 1982, 1523, -1738, 349, 1259, -869, -2894, -2893, -1727, -1940, -540]
2340e40K292K039j236k831j658L032L248k984O39J012P51Q56j824k746K112m85
2324A677q41J125o99k957l607o36P118L283j704j356J872j758k263l90J402K663
2308B929k49j386k61O01j94m130k483j300m70R89j635K253L719k428k659M286
2292b418N019J5j149k327k5p57P98l049n137L138K668J824J193p20k412r76L624
2275f91O39j454l172k063K340K264Q29L302q95K2L350l62l761m40K851K298j398
2258C659p44k945l139k49l257J996K619l482K045J753J202O154L382m376m757
2243a39R08J361k332n14j078J464O94n04n064R59K246l768P69M554K391k025k69
2226c47j093n65j364n6Q95n7j550j846L84J579o379M13M378K319K596L15J072
$$ y = [-540, 1752, 3791, 2555, -276, -1934, 1098, 4346, 1362, 2001, 3013, 3764, 4620, 2796, 50, 2162, 1677, 836, 1961, 1262, -1695, -5302, -5938, 1180, 4463, 2759, 1403, 3275, 1517, -746, -1136, 266, 2929, 2680, 1294, 1033, 1634, 1440, -2690, -5173, -6473, -6943, -5954, -7589, -5336, -1617, -4045, -6704, -2418, 2601, 2616, 1467, -860, -885, -1642, -844, -3893, -9030, -5892, -3224, -1400, -207, -927, -3339, -4315, -691, -52, -1506, -4678, -6741, -4401, -2137, -1308, 1994, 1099, 1121, 4471, 4109, 348, -92, 2759, 5057, 3659, 2915, -30, -3169, -3418, -6675, -4679, -2060, -5542, -3497, -1744, -542, 5612, 8994, 4618, -139, 769, 2130, -202, -716, -1794, -330, 364, -140, -5204, -4245, -1999, -5767, -4998, -444, 1947, -78, -347, -1440, -2005, -3369, -3425, -2530, -2587, -4137, -5983, -5599, -4020, -10399, -9986, -5608, -3289, -693, -378, 694]
2209F94J271K777r57l380j977R91j831j396N69k40L63k327O373K598j607K498
2193D419K63J129K484k189j35k833k318N3j659J049k487m303K533K207M274k45
2177B242l941k041k959q66j256J270M000l92j185J372J621l4J509Q51k874n019
2161g702m71K898K759K760K030k64l703P10Q43J247J107K031l959m492M043L901
2145C738k901n015k09L028K476K212J84l914n484K867M801l153n03l55k835P17
2129d346K942K456j92J194J564j303k381j623o90J598q01l623K33K787p89R26
2113b048n83j29m045J072J983L526J994l097o20J528L306j281N9K99l901m067
2097f004q61M144M232l80K79J542k392n71L66o16j782M244J014k856M0l372R55
$$ y = [694, 1965, 4742, 3785, 405, -1572, -581, -2412, -3808, -3239, -3479, -3116, -5443, 930, 3528, 1921, 4419, 4682, 5811, 8295, 6106, 5971, 3138, 820, 873, -786, 263, -2224, -6527, -3994, -1787, 2487, 2242, -1699, -3740, -6699, -7565, -8821, -7551, -3551, -3943, -5128, -3756, -2135, -2169, -660, 191, -2683, -7702, -8173, -5275, -2516, 244, 2274, 2010, -1693, -983, -140, 1107, 2214, 4245, 286, -4206, -163, 3738, 837, -4178, -4387, -1359, 1117, 3329, 3513, -401, -5885, -3018, 1783, -1370, -1873, -2228, -5063, -4346, -1404, 1052, 860, 2054, 3618, 2315, -66, -1689, -2379, -781, -1582, -5205, -4972, -2185, -2974, -2048, -2631, -2760, -6805, -5733, -3750, -224, 1770, -1327, -1947, -419, 2887, 1606, 1665, 1964, -1937, -6004, -6865, -2721, 1511, 1131, 1410, 2952, 560, -11, 355, -261, -2043, 2201, 3215, 359, 399, -2973, -2018]
2080b018j834j767J554mL697j25p466Q06J450J147J79k79j141j394L478M028M012
2063D323L72l400l29k785l68n77J084J406J167l169n185m030q67J770O61L801
2047f126l17q5L490N211j21k961k974k62K003r66l039N521K189Q02n061J056j023
2030b663n612j97L210L043r76l226M49J334J493K953J028j42j83l724k606J06
2014e713O774L922j48j711j37k593j822n10P31l439o87j269L638N099j266p33
1998A36j399l60j745q48k436N90L914K280l398k975o94K497J775n16J619R83J438
1981H61J807j505l140O54O32j299j358J180L08J015K921J681J687j496k720l104
1965a876O86R29K576o42k641j094N30K080J753j61J3r30k349J66J407j846M383
$$ y = [-2018, -3852, -5619, -4065, -4069, -372, -497, -7963, -7157, -5707, -4560, -4381, -4660, -5801, -7195, -3717, 311, 4323, 4695, 1295, 966, -1819, -2187, -2764, -1680, -274, 893, -2276, -7461, -11491, -12358, -10588, -9927, -6126, -6443, -6528, -3038, 2173, 2052, -909, -3883, -4145, -2142, -3108, -6147, -626, 1563, 2365, -2696, -1640, -2663, -8275, -8472, -5262, -2219, -3195, -6421, -5972, -4638, -3145, -192, 836, 694, 511, -3213, -5819, -5713, 1061, 4983, 4835, 3124, 2987, 394, -1428, -1938, -1207, -4646, -5333, -6602, -2964, 2135, 869, 136, -1263, -1623, -3368, -4216, -6652, -6062, -2148, 132, -3266, -6241, -6935, -4438, -2663, -3179, -1560, -577, 861, 2668, 1163, -1977, -1323, -691, -1990, -3348, -2168, -1860, -845, 2076, 3757, 5444, 3948, 1228, -1876, -1190, -261, 2315, 1673, -968, -2062, -1532, 548, 2301, 2140, 2153, 1223, -1126, -960, 447, -1399, 2984]
1948B984j126J49K307j80j134r76j394K246J185r30k44J490l942K078K905L92
1932E810k484m015J818J278M0K383K500N11o00j143J180m325l015j302R87M00
1916B3k2R71j756K743K875J62l974n301j028L399K922M390l718m749P21k465m750
1899i557J717P735N579J471O16o158n951l058M090M440P30k335k708j214l28P11
1883d220K59K36J128K634J355k410j420K4M106O75l32j076L476j348l771K282
1867A598J471o90k494K024J28n99J725N72l999j122R2l38o05k040q53L107p80
1850b803N15J853m83L205o03o014k596j25J715J116o79J719k170k588N239L924
1834A225m378q30L891l305l92O09j663j680O47K078N02J263Q3l287j335L336J871
$$ y = [2984, 1858, 2007, 4314, 4134, 3000, 2024, 630, 2876, 4061, 3131, 2887, 4377, 435, 2513, 5418, 5810, 3326, -689, 1129, 2407, 2447, 4830, 7330, 7841, 7241, 6098, 7278, 2953, -62, -1364, -377, 23, 1, 972, -784, 1959, 4834, 4996, 1022, -4279, -5307, -1908, 1014, 5404, 1686, -3063, -2342, -4807, -9557, -7840, -105, 5474, 6945, 7561, 1403, -4548, -7606, -3516, 924, 1654, -681, -3389, -4603, -4931, -4220, -3961, -3725, -2597, 37, 1392, -1018, -2438, -2414, 1692, 2367, 2035, 959, 4435, 3087, -684, 1598, 3069, 2379, -115, 1909, 2037, 1438, 3163, 3735, -264, -1386, -1294, -1632, -2237, -4277, -5130, -2023, -2803, -2288, -435, -918, 2287, 1684, -4330, -6926, -7051, -5336, -4220, -4899, -3180, -5350, -7938, -2699, 1225, -3153, -3983, -92, -3397, -3789, -3180, -4843, -6523, -5876, -3798, -3296, -2033, -1950, -5237, -6572, -3236, -1365]
1817a365j85k526J417n10J207J560P01l083m961M355J804j275K215N018K57k839
1801A790K019J15m59l08m596k466m00M016J575k95k479K202j051m25j653j512
1785c927r85L883k600J079J926r00J155l510k363J048L264M37K886J738j329m741
1769b939m402n72L445J812j940J857N125R95j730j522l12J728p45J013J791K447
1753F051l09m442p239o72L849J034J187k56P06r77O38Q99j157l2J655l691J816
1736i40N65l94J845J98J426j977R81K514q91j819J364N70j109k158N52P45j049
1719D23j010o64j61k596J277J415k935pK160o99M997K129J905q24j02n51r4J087
1701E750l354m191K129J551n06l655j62k29K053J685J888q57n23l073k799J691
$$ y = [-1365, -1550, -4076, -2659, -3169, -1962, -402, 299, -2784, -7745, -3390, -1586, -2861, -646, 4372, 4629, 1790, 3809, 3924, 3465, 3157, -1439, -3905, -4305, -289, 1286, 991, -1488, 714, -337, -762, -2415, -3927, -4912, -1029, -3629, -2550, -624, -1524, -369, -3879, -6242, -5194, -1930, -1493, 1393, 3131, 1802, -2939, -7341, -7913, -4468, -2656, -4596, -2739, 2386, 3381, 1651, 129, -183, 1545, 800, 1813, 3604, 6051, 5742, 1300, -5939, -6611, -2762, -1728, -541, -797, -91, -1068, -430, 469, -688, -720, 935, -2756, -940, -375, -769, 1076, 1274, 2700, 723, 1704, 4218, 3327, 1508, 2872, 3442, 2333, 175, 727, 1472, 423, -587, -1251, -1412, -4008, -2731, -1316, -4251, -4258, -2098, -2797, 2200, 4329, 6234, 5410, 5308, 4757, 4663, 5750, 2396, -1795, 334, 1885, 1379, -2276, -2438, -2667, -614, 1071, 2959, 2102, 1579, -1494, -4293, -2602]
1685b602j47O39N27K210J565k090K016P57m139l745N001n86l057m472J835L008
1669c280k590k149K764P44J547K878k091o238l443K834L959L912L022j145n71
1654A53m138p6L384O71J378L577J801m29k303k124j182L09k048l888j174p80J216
1637e653o73L64J504N38o32p89K293l59K32J827q51m43J029j816m75K570J913
1620E79K122J177l31l484k413o68O83J999L935j388k759R05K263j16L17O3J94
$$ y = [-2602, -2749, -2110, -1583, 627, 2192, 102, 2118, 2875, -1264, -5009, -8, -594, -3651, -8123, -6288, -3280, -5870, -8019, -5255, -4511, -2964, -86, -2177, -8415, -11858, -9024, -5065, -1153, 1869, 724, 153, -3985, -4061, -677, -6, 1372, 4949, 6750, 6321, 4018, 1894, 712, 1021, -1027, -4915, -6089, -6869, -5653, -6326, -5962, -4458, -3920, -4552, -5341, -3048, -3407, -3175, -1348, -2199, -2642, -1613, -3429, -3904, -1334, 579, 2701, 3878, 3547, 63, -2350, -3018, -2335, -336, 3599, 2211, -548, 357, 2620, 2504, 2821, 2884, 3078]
$$ [...]
##END NTUPLES=NMR SPECTRUM
##END=
