##TITLE=Analysis number 328786
Compound Code tl 00175
Project Code adrs
Chemist Name stores
##JCAMPDX= 6.0         $$ Bruker NMR JCAMP-DX V2.0
##DATA TYPE= NMR SPECTRUM
##DATA CLASS= NTUPLES
##ORIGIN= Bruker BioSpin GmbH
##OWNER= nmr
$$ XWIN-NMR		Version 3.5
$$ Wed Jul  4 09:43:36 2007 GMT Daylight Time (UT+1h)  MAYBRIDGE\nmr@NMR_250MHZ
##.OBSERVE FREQUENCY= 250.131544655141
##.OBSERVE NUCLEUS= ^1H
##.ACQUISITION MODE= SIMULTANEOUS (DQD)
##.ACQUISITION SCHEME= undefined
##.AVERAGES= 16
##.DIGITISER RES= 18
##SPECTROMETER/DATA SYSTEM= dpx250
##.PULSE SEQUENCE= zg30
##.SOLVENT NAME= CDCl3
##.SHIFT REFERENCE= (INTERNAL, CDCl3, 0, 16.522)
##AUDIT TRAIL= $$ (NUMBER, WHEN, WHO, WHERE, WHAT)
$$ ##TITLE= Audit trail, XWIN-NMR		Version 3.5
$$ ##JCAMPDX= 5.01
$$ ##ORIGIN= Bruker BioSpin GmbH
$$ ##OWNER= nmr
$$ C:\u/data/dgb/nmr/ADRS/310/pdata/1/auditp.txt
$$ ##AUDIT TRAIL=  $$ (NUMBER, WHEN, WHO, WHERE, WHAT)
(   1,<2007-07-04 09:43:06.80 +100>,<MAYBRIDGE\nmr>,<NMR_250MHZ>,
      <created by zg, POWCHK disabled, PULCHK disabled
       configuration hash MD5:
       76 6E 9A 78 1E 09 19 81 EC 84 63 8F B0 6A 59 2D
       data hash MD5: 64K
       BD 2B DA 76 97 A3 3F 16 EE 68 E3 9A 15 5E 0F DD>)
(   2,<2007-07-04 09:43:23.96 +100>,<MAYBRIDGE\nmr>,<NMR_250MHZ>,
      <Start of raw data processing
       ef LB = 0.3 FT_mod = 6 PKNL = 1 SI = 32K 
       data hash MD5: 32K
       3C 3C 4B FA 08 CE BD FF 29 5E 9F 4C C6 A8 31 57>)
(   3,<2007-07-04 09:43:25.65 +100>,<MAYBRIDGE\nmr>,<NMR_250MHZ>,
      <apk 
       data hash MD5: 32K
       F3 DB D0 09 24 B5 7A BE 2F 31 56 53 05 CE E8 E7>)
(   4,<2007-07-04 09:43:26.35 +100>,<MAYBRIDGE\nmr>,<NMR_250MHZ>,
      <abs ABSG = 5 
       data hash MD5: 32K
       51 C3 6B 1A 5E 2D DB 31 F7 80 B6 BD 0B 31 D2 E5>)
$$ ##END=
$$ 
$$ hash MD5
$$ AA 14 EE 33 77 C5 21 6D 93 21 4D 3C EF DF AC D1
##$RELAX= 
##$RELAX= 
##$RELAX= 
##$RELAX= 
##$RELAX= 
##$RELAX= 
##$RELAX= 
$$ Bruker specific parameters
$$ --------------------------
##$DU= <C:\u>
##$EXPNO= 310
##$NAME= <ADRS>
##$PROCNO= 1
##$TYPE= <nmr>
##$USER= <dgb>
##$AMP= (0..31)
100 100 100 100 100 100 100 100 100 100 100 100 100 100 100 100 100 100 
100 100 100 100 100 100 100 100 100 100 100 100 100 100 
##$AQSEQ= 0
##$AQ_mod= 3
##$AUNM= <au_zg>
##$AUTOPOS= <3 >
##$BF1= 250.13
##$BF2= 250.13
##$BF3= 250.13
##$BF4= 250.13
##$BF5= 500.13
##$BF6= 500.13
##$BF7= 500.13
##$BF8= 500.13
##$BYTORDA= 1
##$CFDGTYP= 0
##$CFRGTYP= 5
##$CHEMSTR= <none>
##$CNST= (0..31)
1 1 145 1 1 1 1 1 1 1 1 1 1 1 1 1 1 1 1 1 1 1 1 1 1 1 1 1 1 1 1 1 
##$CPDPRG= <>
##$CPDPRG1= <>
##$CPDPRG2= <>
##$CPDPRG3= <>
##$CPDPRG4= <mlev>
##$CPDPRG5= <mlev>
##$CPDPRG6= <mlev>
##$CPDPRG7= <mlev>
##$CPDPRG8= <mlev>
##$CPDPRGB= <>
##$CPDPRGT= <>
##$D= (0..31)
0 1 0 0 0 0 0 0 0 0.06 0 0 0 0 0 0 0.0002 0 0 0 0 0 0 0 0 0 0 0 0 0 0 
0 
##$DATE= 1183538585
##$DBL= (0..7)
120 120 120 120 120 120 120 120 
##$DBP= (0..7)
150 150 150 150 150 150 150 150 
##$DBP07= 0
##$DBPNAM0= <>
##$DBPNAM1= <>
##$DBPNAM2= <>
##$DBPNAM3= <>
$$ [...]
##$SUBNAM7= <"">
##$SUBNAM8= <"">
##$SUBNAM9= <"">
##$SW= 20.6930455092707
##$SWIBOX= (0..15)
0 0 3 0 0 0 0 0 0 0 0 0 0 0 0 0 
##$SW_h= 5175.983436853
##$TD= 65536
##$TD0= 1
##$TE= 296.16
##$TE2= 300
##$TE3= 300
##$TEG= 300
##$TL= (0..7)
0 120 120 120 120 120 120 120 
##$TP= (0..7)
150 150 150 150 150 150 150 150 
##$TP07= 0
##$TPNAME0= <>
##$TPNAME1= <>
##$TPNAME2= <>
##$TPNAME3= <>
##$TPNAME4= <>
##$TPNAME5= <>
##$TPNAME6= <>
##$TPNAME7= <>
##$TPOAL= (0..7)
0.5 0.5 0.5 0.5 0.5 0.5 0.5 0.5 
##$TPOFFS= (0..7)
0 0 0 0 0 0 0 0 
##$TUNHIN= 0
##$TUNHOUT= 0
##$TUNXOUT= 0
##$USERA1= <user>
##$USERA2= <user>
##$USERA3= <user>
##$USERA4= <user>
##$USERA5= <user>
##$V9= 5
##$VALIST= <valist>
##$VCLIST= <CCCCCCCCCCCCCCC>
##$VD= 0
##$VDLIST= <DDDDDDDDDDDDDDD>
##$VPLIST= <PPPPPPPPPPPPPPP>
##$VTLIST= <TTTTTTTTTTTTTTT>
##$WBST= 1024
##$WBSW= 4
##$XGAIN= (0..3)
0 0 0 0 
##$XL= 0
##$YL= 0
##$YMAX_a= 476297
##$YMIN_a= -430544
##$ZGOPTNS= <>
##$ZL1= 120
##$ZL2= 120
##$ZL3= 120
##$ZL4= 120
##$ABSF1= 16.522
##$ABSF2= -4.171173
##$ABSG= 5
##$ABSL= 3
##$ALPHA= 0
##$AQORDER= 0
##$ASSFAC= 0
##$ASSFACI= 0
##$ASSFACX= 0
##$ASSWID= 0
##$AUNMP= <proc_1d>
##$AZFE= 0.1
##$AZFW= 0.1
##$BCFW= 0
##$BC_mod= 0
##$BYTORDP= 0
##$COROFFS= 0
##$CY= 12.5
##$DATMOD= 1
##$DC= 0
##$DFILT= <>
##$DTYPP= 0
##$F1P= 14.0000005364418
##$F2P= -0.99999901652339
##$FCOR= 0.5
##$FTSIZE= 32768
##$FT_mod= 6
##$GAMMA= 0
##$GB= 0
##$INTBC= 1
##$INTSCL= 1
##$ISEN= 128
##$LB= 0.3
##$LEV0= 0
##$LPBIN= 0
##$MAXI= 10000
##$MC2= 0
##$MEAN= 0
##$ME_mod= 0
##$MI= 0
##$NCOEF= 0
##$NC_proc= -4
##$NLEV= 6
##$NOISF1= 0
##$NOISF2= 0
##$NSP= 0
##$NTH_PI= 0
##$NZP= 0
##$OFFSET= 16.522
##$PC= 1
##$PHC0= -49.8191
##$PHC1= 2.191657
##$PH_mod= 1
##$PKNL= yes
##$PPARMOD= 0
##$PSCAL= 4
##$PSIGN= 0
##$REVERSE= no
##$SF= 250.13
##$SI= 32768
##$SIGF1= 0
##$SIGF2= 0
##$SINO= 400
##$SIOLD= 32768
##$SREGLST= <1H.CDCl3>
##$SSB= 0
##$STSI= 32768
##$STSR= 0
##$SW_p= 5175.98343685301
##$SYMM= 0
##$S_DEV= 0
##$TDeff= 65536
##$TDoff= 0
##$TI= <Analysis number 999999
Compound Code 99
Book Reference 9
Project Code 9>
##$TILT= no
##$TM1= 0
##$TM2= 0
##$TOPLEV= 0
##$USERP1= <user>
##$USERP2= <user>
##$USERP3= <user>
##$USERP4= <user>
##$USERP5= <user>
##$WDW= 1
##$XDIM= 32768
##$YMAX_p= 414393869
##$YMIN_p= -102868
$$ End of Bruker specific parameters
$$ ---------------------------------
##NTUPLES= NMR SPECTRUM
##VAR_NAME=  FREQUENCY,     SPECTRUM/REAL,   SPECTRUM/IMAG
##SYMBOL=    X,             R,               I
##VAR_TYPE=  INDEPENDENT,   DEPENDENT,       DEPENDENT
##VAR_FORM=  AFFN,          ASDF,            ASDF
##VAR_DIM=   32768,         32768,           32768
##UNITS=     HZ,            ARBITRARY UNITS, ARBITRARY UNITS
##FACTOR=    0.157963299565203, 1,           1
##FIRST=     4132.6476996994, 0,             0
##LAST=      -1043.33573715361, 0,           0
##MIN=       -1043.33573715361, -102868,     0
##MAX=       4132.6476996994, 414393869,     0
$$ Real data points
##PAGE= N=1
##DATA TABLE= (X++(R..R)), XYDATA
$$ [...]
25104a1953J1330k475m0832j6972p182J5894K7773J1750q76K47p410m648q720
25091c4074K3405O025M17Q180l826J4569N71k1264Q752j0704M2097J1744l3145
25078A2747l3988Q861P7J2553L891R652l589p878q032j845O825J5014o545q499
25064g56m558J7131K200j6771J9253j4138K245K1444j3211j35j3922p320N24J947
25050f067q653L1463j2278j3192N152K8538k985r203J7432k586l438j1617j2722
25037a56J7549N805j0291k049n712L1052K1296L545J5299k3729k0579k0529j0922
25024E79j5300P516j2650m777K0485M440l074J4821N052P976J6638n577m988j8674
25010A2467M884J7171K2596j7550j6126P771L892k8792q380p104p642P992K9123
$$ y = [-11953, -623, -3098, -43930, -60902, -68084, -52190, -24417, -12667, -13543, -13296, -20706, -25354, -34074, -10669, -4644, -4227, 3953, 127, 14696, 15267, -5997, 2755, -7949, 34148, 45892, 12747, -21241, -12380, -12303, 250, 4141, 13793, 10204, 2326, -5706, -7551, -726, 14288, 7743, -756, -5314, 11817, 14017, -2754, 16499, 2361, 4606, 26050, 12839, 12704, -1218, -8538, -8014, -6067, -14720, 16743, 4465, -8727, -3575, 24963, 21978, 12775, 30207, 27621, 24183, 12566, -156, 17393, 23198, 12907, 10858, 5146, 36198, 57494, 61039, 76338, 52609, 32030, 11501, 579, -14721, -7205, -19855, -24632, -4147, 293, -2781, 12040, 17092, 25068, 41706, 36129, 31141, 12467, 17351, 34522, 57118, 39568, 23442, 31213, 35105, 6313, -2067, -9171, -16813, -8821, 20302]
24997B0302J2827j3451k7685P881O175m403J2667n82J3844J8788j4655k68P537
24984C8977j5151m095J159K568k4352j2418N196j54J1831n789k410M543k3971
24971b4066J8229J9603L694l30j6263j3856J5311m283l0613k1112J6212K4290
24959a3184Q956J1726j6151L96J0681J2295k0133q95K0647N057K5221J688p806
24946C8498j0091l7448k9820k1705L5559j0584o377J5146j1567R098J7848j0811
24934b2254L386P411q660j4464J7182J8033L0200r723j729p612J897j823k4606
24921a2762K156O636k3781N265J9723J6408k4826o159Q790N349k305l575J6719
24908G638K259J5046L454R605j0728m340m236K558k3393N93O602n560k1366L5384
$$ y = [20302, 33129, 19678, -8007, -126, 6049, 1646, 14313, 13731, 27575, 46363, 31708, 31440, 38977, 23826, 19731, 20890, 23458, -894, -13312, -8116, -8270, 3561, -2228, -4638, -95, -24066, -5837, 13766, 17460, 17130, 867, -12989, 2322, -1961, -32574, -53686, -37474, -13184, -4228, 7498, -8653, -8257, 2424, 14719, -5414, -6309, 14338, 19395, 44616, 46304, 38498, 28407, -9041, -38861, -60566, -25007, -35591, -41968, -26822, -38389, -29291, -11443, -22254, -18868, -11457, -20117, -34581, -17399, 634, 30834, 21111, 19382, 11770, 13667, 11844, -12762, -10606, -3970, -27751, -22486, -2763, 13645, -11181, -17340, -8550, -3201, -5506, -9081, 7638, 9897, 24943, 28397, 38002, 27274, 22934, 18698, 21256, -2137, -1544, 5058, -502, -21868, 13516]
24894A3516J6077j3555m0165Q847L235k0309j253J4372K80l174J8285K3917j9139
24881I34k4924r895P781L910n402m699k5030R392J1453L6194L2357J4835k7558
24868A9348k5759m711K3197N624j5931m688l9910R604K6064N558J2103P539l731
24855A4307k189k7766P26J848j4774l215K5363J2086J277j2069q333j3757l178
24842b9674k3292K317J1933J8798N54j0M1907j1289j1235J3440m50j6578j0231
24829a3810j6706n199J3539R934L5026J6392Q159j56J7362P796l3395k8801n803
24816D338J7392K1775N273m0964k2891j1516J3906P101M590p746k168J5351Q965
24803A3406r957J9600K3828m748k4464j1490J0492K885J4081j1443K502l377J1094
$$ y = [13516, 29593, 16038, -24127, -15280, -12045, -32354, -33607, -19235, -18955, -22129, -3844, 20073, 934, -23990, -33885, -26104, -22194, -27596, -32295, -57325, -47933, -36480, -286, 32071, 46906, 19348, -6411, -11122, 12075, 17699, 1768, -2920, -42830, -33226, -7162, -1604, 10499, 18038, 14307, 12118, -15648, -14922, -13074, -27848, -31063, -5700, 6386, 7663, -4406, -12739, -26496, -29674, -52966, -50649, -38716, -19918, -19364, -19374, 22533, 11244, 9, 13449, 12999, -3579, -13810, -30516, -35715, -22176, -12242, 22784, 39176, 47335, 47179, 64541, 72337, 38942, 10141, 4338, 21730, 43505, 48778, 7814, -15077, -26593, -12687, -5586, -996, -8742, -10910, 4441, 13406, 3449, 23049, 46877, 42129, 17665, 6175, 16667, 19552, 33633, 22190, 24692, 21315, 32409]
24790C2409q84J9021J282m6900l0877o498J2963K2277k16L2076Q631K897j0353
24777C5828l879l5080q855K0964J4160O10N747j0502k0906j7777K544p472O726
24764a7892J1758j0907o991l59j2419l0573O5J8608L3015j1884J1540J2266J962
24751a811q423k2796J980J1914j2563j5667R233Q916j3011j296o086K378K4271
24738b2961o602J0877J5979J4431J6560P338l981k1635M094j5373j7706j294P855
24725a2418Q365j7031r667j2093J7483J2744O407K8295J8581J5069k0688k5281
24713I766j3337J984J1827K510p814p281j8782K6327J7030J5009p799j5563j4021
24700a44J8606j0628O504m615k4715j5845M160L0814K8979K985l8685o258Q635
$$ y = [32409, 31525, 50546, 51828, 4928, -25949, -32447, -19484, 2793, 2577, 34653, 43284, 46181, 35828, 31949, -3131, -11986, 8978, 23138, 23748, 29495, 18993, -1913, -19690, -17146, -24618, -17892, -6134, -17041, -24032, -24391, -36810, -67383, -67318, -48710, -15695, -27579, -16039, -3773, -1811, -10234, -33030, -31050, -19136, -31699, -47366, -38133, -29217, -42228, -43524, -49610, -47232, -22961, -29563, -18686, -2707, 11724, 28284, 35622, 31641, 10006, 14100, -1273, -18979, -20273, -12418, -4053, -21084, -30751, -42844, -25361, -12617, -6210, 22085, 40666, 55735, 35047, 9766, -3571, -1587, 10240, 12750, 4936, -2345, -21127, 5200, 22230, 37239, 29440, 13877, -144, 18462, 7834, 14338, 9723, -14992, -30837, -26677, 4137, 33116, 36101, -2584, -8842, -207]
24687b07K3375j3673J4743k865K8294j943k9868l7185m960m445L3024L3925J9501
24674E7716j0582m709l272k7112j2614m182M608L0044k6428j0821P509m779K3080
24661A8458K3304r054k0471M810k032r098J4308j7775p728p425J5467J2085R321
24648B4170O799k5383j3739J2388J386Q926J7547j1190j2582m589r232K1677J0573
24635B6751j928l7619J2479J5069j2870r478J6373n982p726R976J5075L711K3648
24622D7479K2772j0332m1961j6660P274O794p380o400m634N8K968j7978J4132
24609c868p954l162j069Q11Q126j0721L071j3012j7407p123j0336K5183K0981
24596a6480M453q677r294r148L544J1333K7500K2042q891n1789j0902K2161P552
$$ y = [-207, 23168, 9495, 24238, 21373, 49667, 47724, 17856, -19329, -24289, -28734, 4290, 38215, 57716, 47134, 42425, 39153, 12041, -573, -4755, -147, 29897, 3469, -7352, 157, -4622, 18458, 41762, 32708, 12237, 17047, 15015, 5917, 20225, 2450, -5278, -12703, 2764, 14849, 24170, 30969, 5586, -8153, 4235, 5621, 14547, 32094, 20904, 8322, 3733, -5499, 16178, 26751, 24823, -12796, -317, 14752, 1882, -7596, 8777, 2795, -4931, 5045, 20120, 23831, 47479, 70251, 59919, 17958, 1298, 8572, 15366, 7986, 1586, -3048, -2990, -22, -18000, -3868, -11822, -14984, -16053, -15242, -7116, -17837, -14766, -27778, -45185, -52308, -62644, -37461, -16480, -12027, -20704, -29998, -39146, -35602, -24269, 3231, 25273, 16382, -35407, -46309, -24148, -16596]
24583a6596q184j5621J1703J3319j1702j8330j2859K1650K5585J4977J8076k649
24571A9369k4437j2374Q384p539J4791j2614J71p963m019J845Q091k0760K103
24558c4952K684K4669K2238K5687R833l1123j5245J740j0891J9939m619o063K0874
24545B4771P435l3423j2233k1300L2761K2042j6593k2636J9726J6712l5118j4401
24533c2257J3884p70j2979J1608K8066n539M125R340l618j1116k7474J6403K5857
24520A5530J2342n779n628J0103K3460J3184j1627k4598k1060j1280J6032K5169
24508C5848N05l0818j6574j5790Q474K2538p637j82p564k927L81l0184Q10J8924
24494b4196L6445P166N543l3802R542K970q416j5997K6139J5641p998J5210P514
$$ y = [-16596, -24780, -40401, -28698, -15379, -27081, -45411, -58270, -36620, -11035, 3942, 22018, 19369, -5068, -17442, -9058, -16597, -1806, -14420, -14249, -22212, -26231, -24386, -16295, -37055, -34952, -32268, -7599, 14639, 40326, 50159, 19036, 3791, 5531, -5360, 14579, 9960, 3897, 24771, 32206, -1217, -13450, -34750, -1989, 20053, 3460, -19176, 550, 17262, -17856, -32257, -18373, -19143, -32122, -20514, 7552, 2013, 6138, 15478, 11860, 744, -26730, -10327, 15530, 27872, 22093, 16465, 26568, 50028, 63212, 51585, 26987, 5927, -5353, 10679, 35848, 36353, 5535, -11039, -26829, -18355, 4183, -3454, -3636, -11200, -14127, -13746, -43930, -43120, -24196, 12249, 19415, 24958, -8844, 698, 3668, -4748, -20745, 5394, 21035, 13037, 28247, 35761]
24481C5761m226p442o379L86j0807m601K3298k1323n543N337j2786j4612J2680
24468a0257K5251K4330M34K610Q146j3504N547R980l566k3101j6732O878p844
24455H172K076q985r051j5224j9585j3940K1695K790l345j5383L3042J0432J1371
24442D065m610j3263J2686j0333J3374K7581J3983j1464O20R265o57r680j5749
24429A5818k6143O488k4372o418K5937K4723k8596o781m26R980n089R269j0124
24416a5734L100j4150N297L8460J1005p560l6009q015K3791P3k0947k6893j9795
24403f7377J5884M822O453o58J8787J0968j4418n668K4414K588l2j9205j9867
24390d3309Q240K4133J805O441J1916J1792j911o749k902j9104n290K258P788
$$ y = [35761, 31535, 24093, 17714, 18100, 7293, 2692, 25990, 4667, -876, 4461, -8325, -22937, -10257, 14994, 39324, 39758, 42368, 50514, 37010, 42557, 52537, 48971, 25870, 9138, 16016, 8172, 10248, 1263, -7788, -23012, -42597, -56537, -34842, -32052, -35397, -50780, -17738, -7306, 4065, -545, -13808, -1122, -11455, 1919, 29500, 43483, 32019, 32639, 41904, 41247, 31567, 15818, -10325, -3837, -28209, -34627, -8690, 16033, -12563, -19344, -19770, -9790, -14879, -5610, -15734, -12634, -26784, -21487, 16973, 27978, 20418, -15591, -23606, 185, 258, -20689, -47582, -67377, -51493, -46671, -40218, -40876, -22089, -11121, -25539, -31207, -6793, -4205, -4237, -23442, -43309, -35069, -10936, -9131, -2690, 9226, 21018, 19107, 12358, 9456, -9648, -14938, -12680, -4892]
24377d892l500j5100q874K002L0982K6741j8157j6860K3398r614k2953l4514J8505
24364c2836K6358J242L91n565k774l320K0204Q435J2069j438l4916M030J4076
24351E956j7756k0146J3703K8770j1229l2787j803K2722Q945K5916J341j3813
24339I819p971Q86j5576n500K1206l710K1445j5225l875K1727R447q409M2n097
24325A9209q360j3188O717J530J3862j7141r649m654J0532O887m422q519l224
24312a0420k4474P834K4902J0037O165j206j9265j4876j9979J3278M2401O953
24300B1350k5954k9348Q13J646j1522J3458J8975J176j3572J1156q701K82L9311
24287A9070K1978j9828n806p820k7544j7141K5790O906n83O415J6669J4793K7971
$$ y = [-4892, -8392, -23492, -32366, -30364, 618, 27359, 9202, -7658, 15740, 6126, -16827, -51341, -32836, -6478, -5236, -4845, -10410, -13184, -16504, 3700, 12135, 24204, 22766, -12150, -8120, 5956, -11800, -31946, -18243, 10527, -702, -33489, -35292, -12570, -3625, 22291, 23632, 9819, 1848, 2734, -12842, -18342, 2864, -846, 20599, 5374, 1499, 23226, 32673, 24264, 24306, 19209, 10849, -2339, 4378, 5908, 19770, 2629, -7020, -11674, -1142, 5745, 1323, -7196, -10420, -34894, -27060, -2158, 7879, 14044, 12838, -6427, -21303, -41282, -28004, 14397, 21350, -4604, -33952, -33139, -31493, -43015, -29557, -10582, -9406, -22978, -11822, -20523, -20241, 19070, 41048, 21220, 15414, 7594, -19950, -37091, -11301, -4395, -4978, 1437, 18106, 32899, 60870]
24274F0870l0059l387K200k0748j1291m470j1214L4915K2735k6875k9598Q54j767
24261a7835N403K3878J4660O523k22k6850m2915j0117L0264J5686L0061j3700
24249A4836m6276J932M6242k727q479j4473j7647K2060K3204k103L31M424J470
24236B2794Q267K945K0912K340l3748J289j5211l8618j7404J0719R6q521J2345
24223c1795j1127P636K0620L5550K826J3260M374l0958k3599J248p961j3873K960
24210c0839m050J6669J1417K5339O900m734j6196o334Q973j4109j2602l709J1347
24197a1928K9323L7993k4264j9822j4570r681k630j5567k0702N26J5532N70J609
24184c3611M377q536K6949j4496j8853K3747K6396K1529j9396K1738J3486p989
$$ y = [60870, 30811, 27424, 29624, 8876, -2415, -6885, -18099, 16816, 39551, 12676, -16922, -16068, -17835, -12432, 11446, 26106, 32629, 32407, 5557, -37358, -47475, -17211, -1525, 28536, 14836, -31440, -29508, 16734, 14007, 5528, -8945, -26592, -4532, 18672, 16569, 16900, 21324, 22794, 31061, 34006, 54918, 57258, 23510, 24799, 9588, -29030, -46434, -35715, -35619, -44140, -31795, -42922, -35286, -14666, 20884, 23710, 36970, 41344, 10386, -13213, -11965, -19926, -33799, -30839, -34889, -18220, -6803, 18536, 25436, 20702, 4506, -1828, 7145, -6964, -19566, -23275, -11928, 17395, 55388, 31124, 11302, -3268, -12949, -15579, -31146, -51848, -51322, -35790, -35220, -33611, -29234, -37770, -10821, -25317, -44170, -20423, 5973, 27502, 8106, 29844, 43330, 35341]
24172C5341k8642j1515K6129K6854J6407j4774m0132k5385J1774J8641l488l2740
24160b1530j597k657k7755j4936Q485M7454R026J0071O943n925k4430j9261K5097
24147a1015K7616O841j8305l920K8098k39l0979J9136K6974j4517j2301p309q675
24134A405K5121P719m1775l6688k2974L0040K8315j951Q014L565j6225J0515J668
24121c251j3868Q31j4879r843L645Q948N941P919J4956p835l560J3659K7903q478
24107B2088j3598r458k3591j7565J0409R729r572J0092J4206m446O002K2100K512
24094A8908k410j3109O040K8837l834j6434j2821j7088j5647J602J6361J7948
24082H353J0417n958k280q200k0568N148k940J8010J5414j0124p473J1995L4321
$$ y = [35341, 6699, -4816, 21313, 48167, 64574, 49800, 9668, -15717, -3943, 14698, 11210, -21530, -23127, -25784, -53539, -68475, -59990, -12536, -3510, 6561, 13504, 7579, -16851, -36112, -11015, 16601, 23442, 5137, 1217, 29315, 29076, -1903, 17233, 44207, 29690, 17389, 10080, 1405, 26526, 34245, -7530, -44218, -67192, -37152, -8837, -10788, -2774, 791, -15434, -4919, -3251, -17119, -16288, -31167, -41010, -37365, -28417, -22476, -14557, 399, -7436, -10996, 2663, 30566, 22088, 8490, -968, -24559, -42124, -31715, -21986, -31558, -21466, -7260, -11706, -5704, 16396, 18908, 16498, 3389, 9429, 38266, 34432, 17998, 5177, -11911, -27558, -25956, -9595, 8353, 18770, 12812, 10532, 2332, -18236, -13088, -16028, 1982, 17396, 7272, -201, 11794, 46115]
24069D6115k5112n711J623n499j5436l858r051o718r93J5926Q081J754K6727J620
24055B9468n1417r33K7112l212Q064o276j5375Q454l479k529k9720n322J7331
24042b7834Q125p955k1043l3001O2988M1108n798n794m960J2196k3723M679K3821
24029B2809k603J0152j779q371k159K947k303j2820j9069j0010J5821K592q721
24016a3514P294j810R885K4086j9848m1781j3600M4297P08l1591J5755O086J9092
24003E059P550j5256r029p565J5353P23O02K3703P046j0879j9097k1253P494P148
23989h401Q620k879j1804j7429N51p414K7962L8477J3661J6977K1997j8724l2278
23976B9316m4211j3064K5718K053j9302J7614J1145m818j343J1671K3472j1228
$$ y = [46115, 21003, 15292, 16915, 11416, -4020, -7878, -16929, -23647, -24640, -8714, -633, 1121, 27848, 29468, -21949, -22882, 4230, 1018, 9082, 2806, -12569, -4115, -7594, -10123, -39843, -45165, -27834, -19709, -27664, -48707, -81708, -18720, 22388, 16590, 10796, 5836, 18032, -5691, -1012, 22809, 20206, 30358, 28579, 20208, 18049, 20996, 18693, 5873, -13196, -23206, -7385, -4793, -13514, -6220, -8030, 1855, 25941, 6093, -35688, -49288, -4991, -4283, -35874, -20119, -14033, 5059, 12609, -2647, -11676, -19241, -3888, -3165, -2563, 21140, 28186, 17307, -1790, -23043, -15549, -8401, 219, -2660, -14464, -31893, -31342, -38756, -10794, 27683, 41344, 58321, 80318, 61594, 29316, -14895, -27959, -2241, -188, -19490, -1876, 9269, 4451, 3108, 14779, 38251, 27023]
23964B7023j7892k3392j4964J1814l746n697M802l5155k5659J4477L8054L2118
23952A783J9913r312J0918k0802j2075L964J0890j899L198l284k9762j1820J1209
23939b7079J3135M352j9052m225R943n343R680k602j5165q321L415M2561J582
23926B881q016k730l328J6056p7j1309j3570k3871J5722n251J556K9864n467J523
23912f017j7433o665J5502R48o73l503L686K9860k4361l0829J381M680J1273K7187
23898E036J1844R995l322l383Q332j4899j165K9511j3349j2840k8482r559Q511
23885a3770J1179j1307O303Q305K3108K7917m068k4318l6604p081J6448K5390
23873B1502R104m2926l2788r468J8130o131j5487R060n324K16L0036M0986k5829
$$ y = [27023, 9131, -14261, -29225, -17411, -21157, -26854, -22052, -57207, -82866, -68389, -30335, 1783, 21696, 12384, 23302, 2500, -9575, -5611, 5279, 3380, 6578, 3294, -26468, -38288, -27079, -13944, -9592, -28644, -32869, -22926, -28269, -18589, -21191, -36356, -44677, -41262, 1299, 2881, -5135, -7865, -11193, 4863, 4786, -6523, -20093, -43964, -28242, -33493, -31937, -2073, -7540, -6017, -23450, -30115, -14613, -13665, -14338, -17841, -14155, 15705, -8656, -39485, -38104, -33424, -22151, 5036, 16880, 26875, 23553, 20170, 28502, 13603, 12438, 41949, 28600, 15760, -12722, -22281, -13770, -2591, -13898, -7595, 710, 23818, 51735, 47667, 23349, -13255, -20336, -3888, 21502, 30606, -12320, -45108, -54576, -36446, -42577, -58064, -49004, -54328, -54112, -24076, 16910, -8919]
23860h919j7918o89J394l343o318L6579L6844L740p203J5369l458j5499L866j9871
23846A4574j8507k071N188K964J6588m629j082J9612j9308p872r618J082M067
23833I88J2045k7645p569J5493o222J9731N028j6503p948K5018j4137l8282M628
23820c5375L1858j71J121Q946J3625J9208j4919l1643m973j688O023n795J3329
23807d54q65n958k0757k5970l354K7762K1240j3114K016R975K9188K7422r912
23794C7219J518Q961l0091k9568N782L544J0776K4280L3339k4542m1794Q302J022
23781H748k1080k2003o679J7931L4349R066k2226m461P22K226Q344J768K629Q566
23767A7900k75j3610L665O021l69k9174J1857J5515k544l3278j3979K4997P738
$$ y = [-8919, -26837, -27526, -26132, -29475, -35793, 786, 37630, 41370, 34167, 49536, 46078, 30579, 34445, 14574, -3933, -6004, -816, 2148, 18736, 14107, 13025, 32637, 13329, 5457, -4161, -3079, 988, 13033, -14612, -22181, -6688, -12910, 6821, 11849, -4654, -12602, 12416, -1721, -40003, -35375, -3517, -3688, -2567, 6379, 20004, 39212, 24293, -7350, -12323, -14011, -7988, -13783, -454, -1319, -7277, -28034, -54004, -57358, -29596, -8356, -21470, -19454, -9479, 19709, 47131, 37219, 38737, 47698, 17607, -11961, -6179, -2635, 8141, 32421, 65760, 41218, -576, 7726, 8748, -12332, -34335, -41014, -23083, 11266, 20332, -1894, -6355, -5633, -3407, 4937, 6705, 9334, 17900, 17625, 4015, 7680, 13701, 13332, -15842, -3985, 11530, 8986, -24292, -38271, -13274, -5536]
23754e536R8n51K6835K5967J3672l5513k6516P575K677k3852J1764L7340m544
23741B9416j3577J5486K31q633j5837k2989O747K159m345l576j5315M427K0677
23728e129m940j0501K4471J6445J0867J879J2480j6845m470q289k855j9114j1729
23715a7730K7805r452J6651n401j6113j7392k7290j4665J4916J6070N104K4509
23703b988M162L0708j0395k9852k562l414J1747K9103L295k2340J6798J9445k6771
23690A6936j6943j4831J1072K9774k283k5701l4156K3127M085Q185m527J6020
23678A0758L7534p452m9581j7205j800J773j1297j0348K0934L2079K1333j4888
23666A1840j3425K696J0990J6698J582l5628j7706J5102O586j8167j4473P462
$$ y = [-5536, -5438, -5989, 20846, 46813, 60485, 24972, -1544, 6031, 8708, -15144, -3380, 33960, 29416, 15839, 31325, 31556, 22923, 7086, -15903, -9156, -6997, -11342, -14918, -30233, -25806, -5129, -10069, -20570, 3901, 20346, 31213, 33092, 45572, 28727, 24257, 15968, 13113, -6001, -17730, 10075, 623, 17274, 11873, -4240, -21632, -48922, -63587, -48671, -32601, -27497, -2988, 1174, 31882, 21487, -8365, -10927, -14341, -2594, 26509, 29804, 7464, 24262, 43707, 16936, -7, -14838, -3766, 26008, 23725, -1976, -36132, -13005, -8920, -735, -5262, 10758, 48292, 40840, -8741, -25946, -27746, -25973, -37270, -47618, -26684, 5395, 26728, 11840, -1585, 1111, 12101, 28799, 30381, -5247, -22953, -7851, -1265, -19432, -33905, -26443]
23654b6443O491J6233M2188J3426j2218j4191L489K939n038j1050j3626j2472
23642a0272K602J9379J5532K627n202k3739j1814L709q42j7792m153J2473p391
23629b4883M619J1093K9931o893j0170J2200j2512k1192r333L870L0061J1686
23617A8477j4341j2465k0323K8395k824j5527J9059L2559M382m039L285J407r981
23604B8064k3596k1099M404R063J1126J8702j4731N487K5986K1388O56j8907k4343
23591B2200r103Q161N137O923J3318p105n668R286j2441o188r971j5736o110l5
23577g332k5624j3178j958J1784K8767q326j7289k738J9976k011j6616j1988n142
23564e1675L727p782J6302k1841k065L3332J2777j3862l459K8770R907P882J1407
$$ y = [-26443, -19952, -3719, 38469, 51895, 39677, 25486, 28975, 31914, 26876, 15826, 2200, -10272, -7670, 11709, 27241, 29868, 24666, 927, -10887, -7178, -8020, -25812, -29965, -17492, -24883, -20264, -9171, 20760, 13867, 3697, 15897, 3385, -17807, -27140, -23270, 6791, 18477, 4136, -8329, -28652, -257, -3081, -18608, 451, 33010, 37392, 33353, 36638, 38045, 28064, 4468, -16631, -12227, -3164, 7962, 26664, 11933, 17420, 43406, 64794, 65450, 46543, 22200, 13097, 21258, 26395, 33318, 46636, 39531, 33863, 43149, 30708, 24520, 14549, -1187, -7297, -7332, -32956, -46134, -48092, -36308, -7541, -15867, -33156, -35894, -15918, -17929, -34545, -46533, -51675, -47948, -55730, -39428, -61269, -63334, -30002, -17225, -31087, -34546, -5776, 4131, 12013, 23420]
23551B3420k391n554o828L901p998M49J3192q220j7668j092N116o563o452J3499
23537c189k535r766j2522J6855M3605k360k0493o881N419J3892O725Q497k6476
23524A0771j0538j7407K0898m05j1526k510J1778K6037J6612j8658L797K0m1011
23511a2142k4246Q917K0983K047P271k9123k4904L1811L9102j2330l7272k7640
23499e7526l373n974J0677R983R28l776J4845M9424k121l731N617k9321j2530
23486b6878P925K9641L3361j0090M34p191j0001l549j5105k7241O538K6941p930
23473c145k5812L0764j3178n1271o68j0469K4124K3030J717J1040o232R773j343
23460a1670J4300J3390L918n72r56J8116J5153p113k8329q604k9177l4293O683
$$ y = [23420, 21029, 15475, 8647, 12548, 4550, 4999, 18191, 9971, -7697, -8789, -3673, -10236, -16688, -3189, -5724, -15490, -28012, -11157, 32448, 30088, 9595, 2714, 8133, 22025, 28750, 37247, 10771, 233, -17174, 3724, 3319, -8207, -10717, 1061, 27098, 43710, 25052, 28849, 28869, -12142, -36388, -27471, -6488, -4441, 2830, -26293, -51197, -19386, 19716, 7386, -29886, -57526, -60899, -66873, -56196, -46213, -45285, -49061, -34216, 15208, 13087, 9356, 14973, -14348, -26878, -18953, 10688, 44049, 33959, 34393, 27202, 17201, 13652, -1453, -28694, -22156, 4785, -3145, -28957, 1807, -11371, -62642, -63310, -73779, -49655, -26625, -24908, -13868, -20100, -10327, -11670, 2630, 16020, 19938, 19366, 18410, 36526, 51679, 44566, 16237, 7633, -21544, -55837, -49154]
23447d9154J6410l3069l80J8546J6036N9592J5918r601j1915o525K606r912K6272
23434C4824J7250J8574l5688k4036j099k940j3621J3694J1894j1520O352Q387
23422B2071j8715l0252j5718K1973k5836j6337M5719L0204j2219k1511M300q433
23410b4754Q381j46j6523M971J7560k141l9104o150K5447l972k5782m620L6921
23397b9912J7861l0845m540L3908K5889j5406k7903o649J0019N411L993o83J8424
23384d33K7700L1843j3389l0748J6991j3770j4287P994r035J9617O979j1468r901
23371H093k154J6393L998l9367l0761Q2K7875K4483m725M112J7064n975M097j2188
23357A1027J2032J8505K0072K2469j6574j7326k1297j0758J661L2232r894l0798
$$ y = [-49154, -32744, -65813, -66193, -47647, -31611, 27981, 43899, 34298, 22383, 15858, 18464, 8552, 34824, 52074, 70648, 34960, 10924, 9825, 6885, -6736, 6958, 18852, 7332, 13684, 22071, 3356, -26896, -42614, -20641, -46477, -62814, -17095, 13109, 890, -20621, -16321, -24754, -16373, -16519, -33042, -28071, -10511, -12652, -51756, -57906, -32459, -36431, -62213, -66833, -29912, -12051, -42896, -47436, -13528, 12361, -3045, -30948, -37597, -27578, -22167, -18174, -18857, -433, 27267, 59110, 45721, 14973, 31964, 18194, 3907, 11901, 2866, 22483, 29462, 17994, 8093, 5939, 22332, 26330, -13037, -43798, -43716, -15841, 8642, 3917, 8029, 25093, 19118, 23215, 11027, 23059, 41564, 61636, 84105, 67531, 50205, 28908, 18150, 19811, 52043, 42149, 11351]
23345A1351j338j140J6737m730k1946N469q059P569l0268k7146Q929M4036K2253
23332B1717K97o857k8136k257J1150q618j5430p46K6366J0126p125m054j90l000
23318f757n548j9827o067K7335J2510L8895k5363k2143J3585L084m548K016l410
23305C762k2406k0948J668j712J4010L7026J250j0869o251j0478j5527o340j8692
23292e5507J0671n195j836K0634J7903o289l555K315q629J0397j6081K2529K6603
23279A3960k1822n639J3939M647l4296J2526K0585J5162k6316N11M830l531p059
23266a2503k807K5118o524l1829k7775N236M2766J9882O460k0557q247k2274O34
23253c2420K1910k727l731R256n25k1756P98Q849P262P399q154j4145n95K1380
$$ y = [11351, 10013, 8873, 25610, 20880, -1066, 4403, -3656, 3913, -26355, -53501, -44572, -536, 21717, 22014, 15157, -12979, -15236, -4086, -12704, -28134, -28880, -2514, 7612, 487, -3567, -3757, -6757, -12305, -32132, -38199, -10864, 1646, 40541, 15178, -6965, 6620, 9704, 5156, 7172, 3762, -18644, -39592, -37924, -39636, -25626, 11400, 12650, 1781, -4470, -14948, -30475, -36815, -55507, -44836, -50031, -51867, -31233, -13330, -19619, -23174, -20859, -29488, -19091, -35172, -12643, 13960, -7862, -13501, 438, 5085, -29211, -16685, 3900, 19062, -7254, -6743, -1913, -5444, -12503, -15310, 9808, 3284, -28545, -56320, -51084, -8318, 11564, 18024, -2533, -10780, -33054, -32420, -10510, -13237, -16968, -7712, -8237, -29993, -29195, -20346, -13084, -5685, -13839, -27984, -28579, -7199]
23239g199J2224k0992M719k033J5569Q834j251L527j7234K956j982j1637j3181
23226b7680P122M50Q127J7516P802j2969j857q875r169k984k0302J5899Q457Q771
23212i692l002J5222k3120m287k8365j2674L602M638j2466K870m852K2246K2822
23199b7058j2120m993L3688J3653M4j9165M353J5029k028j5674k9532o920L1879
23186a8844J0150J8225j342r832K8960q066k5436N134m7447j4975J2077r209m43
23173f1048r007K833L5102J7821k2070m94J3469J855k1757r36o145J2585M965
23160c2827J4803J6450k752o176N087l8493o892J3758K4200J3918j6307r90j6451
23147c2672r788J2711L4532O583k9185k3178j6958J7430J4012o990J4101J4852
$$ y = [-7199, 5025, -15967, -11248, -13281, 2288, 11122, 9871, 13398, -3836, -880, -2862, -14499, -27680, -20558, -20108, -11981, 5535, 13337, 368, -1489, -10364, -19533, -22517, -42819, -26920, -18463, -9692, -12694, 2528, -20592, -24879, -53244, -65918, -62316, -57678, -70144, -67274, -72126, -49880, -27058, -39178, -44171, -10483, 3170, 3214, -15951, -11598, 3431, 1403, -14271, -43803, -50723, -18844, -8694, 9531, 8189, -1643, 27317, 19251, -6185, -1051, -48498, -63473, -51396, -60605, -61048, -70055, -67222, -32120, -14299, -36369, -36863, -23394, -21539, -43296, -44232, -50377, -37792, -32827, -18024, -1574, -4326, -10502, -5415, -43908, -50800, -37042, -12842, 1076, -15231, -16221, -32672, -42460, -29749, 4783, 11366, -17819, -40997, -57955, -40525, -26513, -33503, -19402, -4550]
23135d550K1568k5936j3271m896J7065R164K869J7727q464K247l8979o739k800
23122c4995L5301J9079J473q727l998j2737J440m659K4964o429j8990k8338j5654
23109e2270K5534J5073k4461J0476R893L983Q17J5499J7472m984P78m780j2914
23096A16J2176j2305k6603l3391n884M2998J6951L780K6290k854p868K1573k9129
23083E850l4587J2867J5771k502J0751j1542P085m036q192j5941J5907J7076k5133
23070a6626j6581M059n543j8942M06L426L1539J5131k58R511k8974k4588K3707
23057b3733L5654R012k445k2803k7336J0271N492J1464j4268j2680J811j3506
23045d3067J3524J2559N972J13Q242k3181r288L0870O269l132j3096k518p755
$$ y = [-4550, 17018, -8918, -22189, -27085, -10020, -856, 2013, 19740, 11276, 13523, -25456, -32195, -34995, 306, 19385, 20858, 12131, 8133, -4604, -3164, -7823, 17141, 10712, -8278, -36616, -52270, -26736, -11663, -36124, -25648, -15755, -11772, -10955, 4544, 22016, 17032, 17810, 13030, 116, 12292, -13, -26616, -60007, -65891, -22893, -5942, -2162, 24128, 21274, 13406, 34979, 5850, -28737, -15870, -99, -2601, 8150, -3392, 3693, -343, -8535, -24476, -8569, 8507, -16626, -33207, -29148, -34691, -53633, -53227, -49801, -18262, -3131, -3389, 6122, -22852, -47440, -23733, 11921, 20933, 18488, -4315, -31651, -21380, -15888, -4424, -18692, -31372, -29561, -43067, -29543, -16984, -11012, -10899, -2657, -25838, -35126, -4256, 2013, -1119, -14215, -16733, -24488]
23032b4488L621j0264K1784L7168J2698k0799q755n790J0590q472n367j2347J2002
23019A581J5518P773K723k1380J7643j2145l6028q686k5907R780K0624L0783j3988
23006a1709k5600q009j442J1410K3258J0746Q902L963m430j9138M574J303K3075
22993A6903K732N472j032j1818l1997j1540L599j30N355o66O771J9702m551k3511
22979b4711l239j3451M437L3371M6995o470j3998J2624n436l6776k8627J6940
22967a8341K1137L340k1300j5672J1449q353j6128n120K5257m857k4640k538L8027
22954a7739O938K092J6012k2498k7170L106K5735j1302k809j0962N197m156j3109
22941e0665N619Q487j2779Q537L2541o631k9505K6133J0068L3447Q997l9491j2786
$$ y = [-24488, -20867, -31131, -9347, 27821, 40519, 19720, 10965, 5175, 15765, 7293, 1926, -10421, 1581, 17099, 24872, 27595, 6215, 23858, 11713, -24315, -33001, -58908, -49128, -28504, 2279, -11709, -37309, -45318, -46760, -35350, -12092, -1346, 7556, 11519, 7089, -12049, -7475, -6172, 16903, 19635, 25107, 24075, 12257, -19740, -31280, -27681, -27811, -22456, -23122, -16351, 3351, -1200, -24711, -27950, -41401, -36964, -3593, 43402, 36932, 22934, 35558, 30122, -6654, -35281, -18341, 2796, 6136, -15164, -30836, -19387, -27740, -43868, -48988, -23731, -28588, -53228, -55766, -17739, -10801, -8709, 7303, -15195, -42365, -39259, -13524, -24826, -27635, -38597, -33400, -37556, -50665, -45046, -36559, -49338, -40801, -8260, -14891, -44396, -18263, -8195, 25252, 34249, -5242, -18028]
22928a8028j0602j8590J4723R460r499L621J6719k172Q928K8502j3531j6929k1834
22915b9232N928k670Q872K1485L9407J3850k0688j7985o576k4174l962l639R875
22902i509L9977L1314k1684J4320j1684k8451j8936P45K1890K0946r947j0905
22890A8076j1521J2712K7430l403j1263l5143j8245k5056J0823K1363M641l188
22878a2774k4644N681J5976j329J287R223J5402j1151J7850J4218r530J076r601
22865A1684j8965l76J196k1275l5166J1437J4752J2833J9808K8231j8127m0739
22853c4707O599K2807k5293K494K3510J3269J2772k374l13k4757r584L592m57
22840a2442P495L132m884j0257R035N402m4060j9518m375J4737M1277M6991J2759
$$ y = [-18028, -28630, -47220, -32497, -23037, -32536, -28915, -12196, -14368, -5440, 23062, 9531, -7398, -29232, -23304, -25974, -17102, 4383, 43790, 57640, 36952, 18967, 12391, -11783, -15745, -19384, -9509, 30468, 61782, 40098, 54418, 42734, 14283, -4653, -3908, 17982, 38928, 28981, 18076, 6555, 19267, 46697, 43294, 32031, -3112, -21357, -46413, -35590, -14227, -9586, -12774, -37418, -31737, -15761, -17090, -15803, -6580, 8822, -2329, 15521, 29739, 20209, 21285, 11684, -7281, -7657, -6461, -27736, -62902, -51465, -36713, -23880, -4072, 24159, 6032, -34707, -28108, -5301, -30594, -28100, -4590, 8679, 21451, 19077, 18764, -5993, -15577, -11985, -12442, -4947, -1815, -6699, -16956, -7921, -2519, -46579, -66097, -70472, -55735, -14458, 32533, 45292]
22827D5292j6121k2911J6821k850l5601j3026P41N33J2563K8260j8362r563j3075
22814b7299J936n825Q977K0391J9110p572j8555m7601m552J1406J7162K6989l07
22801e740n948J3647K366p561j3654j6235L178J8090j4380m399P303J6779J876
22788d678r400l865o205k044K8177R220j0764j7572K322J018K7469O445k5331
22775e208k582J0486j5713j0353J3943R184j0092l2841O713J8716K559P702m747
22762a2233k8538j5069J2179M87Q345J5120J0151J6851J3073J9472k4870k5438
22750a0470k4477j2987m872O809K4701K2258L4974j4089m0803L0906J9037k1396
22738I591J2591R645j3840m974Q970m558n912O484k169l7035l625Q072K680J1573
$$ y = [45292, 29171, 6260, 23081, 20231, -15370, -28396, -27655, -27122, -14559, 13701, -4661, -14224, -27299, -25363, -31188, -22211, -1820, 17290, 9718, -8837, -56438, -60990, -49584, -32422, -5433, -5740, -11688, 1959, 4325, -3236, -16890, -33125, -29947, -11857, -26237, -30636, -23333, -6554, -4678, -14078, -17943, -24148, -26192, 1985, 11205, 441, -17131, -14809, -13791, 13678, 20123, -5208, -7790, 2696, -13017, -23370, -9427, -243, -10335, -43176, -36463, -17747, -15188, -7486, -12233, -40771, -55840, -43661, -43174, -34829, -19709, -9558, 7293, 20366, 39838, 14968, -10470, -34947, -47934, -52806, -45997, -21296, 962, 35936, 21847, -18956, 11950, 30987, 9591, 22182, 31827, 17987, 13013, 21983, 17425, 11513, 17997, 15828, -21207, -24832, -16760, -14080, -2507]
22724b507N813p542J011j5434j490J0260O512r469j5157j73Q159K0026q308r888
22710a8187J2544Q800M596N423m819o448j243j7457l679P750K0544R111K851j119
22696A8667j3488j0484j2907j1899J1271r831K1767J7255n59P442j1723P903j7126
22683c712O691o511p120o778M91K0025Q347J3503j504L825j9665j5827k704k997
22669a3936j4722J7880K386k4383K3664K3020j8186j2930j0505N559K770j1324
22657c0707r408J9260J1292k0065j132L1856N643k7609O780K0692J3960J6105
22645C6667q753K01J1070J201l6055k2867m890M425K428r061J2367J6547o67J2908
22631A5521j9653p916k033M750j7746j4009J2423k341K416J572j2718K5143J9139
$$ y = [-2507, 3306, -4236, -3225, -18659, -20149, -9889, -3377, -12846, -28003, -28176, -20017, 9, -8299, -18187, -5643, 3157, 7753, 13176, 8357, 1909, 666, -16791, -20470, -12720, 7824, 16935, 19786, 18667, 5179, -5305, -18212, -30111, -18840, -28671, -6904, 10351, 9792, 17234, 5511, 13414, -3712, 2979, -3532, -10652, -17430, -16939, 3086, 11433, 24936, 23432, 27257, 7592, -8235, -10939, -13936, -28658, -10778, -8392, -32775, -9111, 13909, -4277, -17207, -27712, -22153, -19383, -30707, -40115, -20855, -9563, -29628, -30760, 1096, 6739, -20870, -14090, 6602, 20562, 36667, 27914, 28115, 39185, 40386, 4331, -18536, -23426, -19001, -16573, -25634, -13267, 3280, 2613, 15521, -4132, -12048, -14081, -9331, -27077, -41086, -28663, -31004, -28588, -27016, -39734, -14591, 4548]
22618D548J1442P256l5530K581P106J7817j766m5763l2885J174L0171J3584J5196
22605e069K795r528J4805q851N770r977L36J5922k826K3764N034j1836k8971l43
22591h975K888J2371j2326k2167P165k0549k5622K0659K3134L9218L3505J1411
22579F0712k6459j7727k8206M828J6130j2294P955n966J1981J3517j0179Q0j7552
22566c180k9611k133K0613J1506R373j4755k3246k1718L2525P901j0747J9684
22554c788k4791j5097J9235M1498l652l8859n175m642r043M6413Q646j9843J2781
22541C683J6976j2940l6825l8365K731L2660K1705R438O525j8037N390l998M1261
22528C0204M136o140j455n621o550k5446j5951L1808j826k9066j8799R586L1211
$$ y = [4548, 15990, 23246, -12284, -9703, -2597, 15220, 13454, -32309, -65194, -64020, -33849, -20265, -5069, -2274, -11802, 3003, -5848, -78, -10055, -9719, 6203, 3377, 27141, 32175, 20339, -8632, -8975, -6087, 6284, -6042, -28209, -21044, -41593, -67215, -46556, -23422, 15796, 49301, 60712, 34253, 16526, -11680, -6852, 9278, -3016, 4939, -1027, 10954, 24471, 14292, 14372, -3180, -32791, -34924, -14311, -2805, 6568, -8187, -31433, -53151, -20626, -12725, -23472, -3788, -28579, -43676, -24441, 17057, 13405, -25454, -30629, -35271, -44314, 2099, 10745, -9098, 3683, 20659, 7719, -29106, -67471, -64740, -32080, -10375, -937, 5588, -12449, -7059, -11057, 30204, 34340, 28200, 26745, 21124, 14574, -10872, -26823, 4985, 3159, -25907, -44706, -35120, -3909]
22515c909n655M910J1110l667M953J7605p209p72Q522k3708k0025J0239q209k9293
22501d5108J0770P253L971j523N120K6250k2739k0532J3439K230N283j2316L509
22488b4393n216L6452K2997J0706j2212N609j2697l669Q142j484l2939k0170K9207
22475C33K2911p380m329j1378j9145Q365K6492Q388l092R41j2705R975k9419j0736
22461b0779J2217m465j668j0297j3784K6213J5055n086j5354l8388N827j5977
22449f6486l701L3499J7762L2011K518m8171k1842L9454K2208P661n399m425k7545
22436b2456r930J6646K5612K2629K4024j816k9748k1243j6435K2695j387J4651
22424B3242J9315j4149l4558k1851K1371K0469j716n597j5919j9934j6419J0183
$$ y = [-3909, -9564, -4654, 6456, 2789, 7742, 25347, 18138, 17366, 25888, 2180, -17845, -7606, -15815, -45108, -34338, -27085, -23114, -24637, -19517, 6733, -16006, -36538, -23099, -20869, -15586, -27902, -24393, -29609, 6843, 29840, 40546, 28334, 33943, 21246, 17577, 25719, 24235, -8704, -28874, 333, 23244, 15864, 11535, 157, -18988, -10623, 15869, 24257, 21165, 22106, 9401, 19376, -10043, -20779, -8562, -13027, -14695, -24992, -38776, -12563, 2492, -2594, -17948, -56336, -50509, -66486, -70187, -36688, -18926, 13085, 15603, -32568, -54410, -14956, 7252, 14913, 9514, 5089, -22456, -32386, -15740, 9872, 32501, 56525, 54709, 24961, 3718, -12717, 9978, 8591, 23242, 42557, 28408, -6150, -28001, -6630, 13839, 12123, 6526, -9393, -29327, -45746, -35563]
22412c5563J2518J0796l3401j3121J6896j1095j648L7054M2916k8652l138M633
22400a805J200J0812N528j1853J7694n436j4203n292p944J2399k870j896L805
22387A39K1512j0093j9757o946L031K8518k6587k1308j101p660P813j3276J0579
22374c5136J5535p39l528r473N083j4760N565q63L9742L9692j9404k6047J3024
22361H691J6862Q113l1047l417j4648k0066J9062J7260k8099J4996K931K087k0180
22348b7455k8823J2890J0281K492K4681O0k3535J0730K6700J2804q56j869k8103
22335a0003J9152K0378M588k9446j7104R625J9906O219J0935j753j4586R372j5714
22322A1569j3564J1113j5024l7954j8383R509R248P183J3416J3161K0107N396
$$ y = [-35563, -23045, -12249, -45650, -58771, -41875, -52970, -54618, -17564, 25352, -3300, -6438, -1805, -605, 10207, 15735, 3882, 21576, 16140, 1937, -3355, -11299, 1100, -1770, -3666, 139, 21651, 11558, -8199, -15145, -12114, 16404, -10183, -31491, -32592, -40252, -32439, -45715, -35136, -19601, -20340, -23868, -33341, -28258, -43018, -37453, -38316, 1426, 41118, 21714, -4333, 8691, 25553, 33666, 2619, -798, -15446, -35512, -16450, 810, -27289, -12293, -9362, -7275, -27455, -56278, -43388, -33107, -30615, -5934, -5874, -29409, -18679, 8021, 20825, 19969, 18100, -10003, 9149, 29527, 34115, 4669, -12435, -2810, 17096, 23315, 34250, 32497, 17911, 27283, 11569, -1995, 9118, -5906, -43860, -62243, -52734, -43486, -36303, -22887, -9726, 10381, 15777]
22310A5777l536k32l2184j2635L4896k5326K680J1605k927J456L1037K349l4011
22297a1051k0424N393L12k4025l7396K4967J7277j211q896J8605K8730Q227k10
22284B98j7325m546K3787O884k4815j6589K0661k951p450r398l1533m669L0621
22271c7025K7068j1559J3267P718o478l484j3130k763J9184J3372k3452r781j278
22258b8341M019J2368J7148P72j9429m345k1534j3511L9917J8697m583k0704o207
22245b5733p273K882O615n317K951J4043K5560P629j1488J7793j2101l8736j9061
22232d2236M214K5926K5336p644L933o020m558q736o846l8340l4405M1244m88
22219d8620k3723j0923J8613M5990M2159q101j884J8516K294k6055k5733k7163
$$ y = [15777, 12241, 12009, -20175, -32810, 2086, -23240, -20560, -8955, -11882, -10426, 20611, 22960, -11051, -31475, -26082, -25770, -49795, -87191, -62224, -44947, -46158, -55054, -36449, -7719, 508, 298, -17027, -21573, 2214, 9098, -15717, -32306, -11645, -14596, -22046, -31444, -62977, -67646, -37025, -9957, -21516, -8249, -531, -7009, -10493, -23623, -26386, -7202, 6170, -17282, -27063, -28341, -24322, -11954, 5194, 5966, -13463, -17808, -39342, -52853, -12936, 5761, 1178, -19526, -25733, -33006, -30124, -23509, -28826, -25875, -11832, 13728, 21357, 9869, 27662, 15561, -23175, -42236, -38022, -12096, 13240, 5596, 9529, 3509, -1049, -9785, -16631, -54971, -89376, -48132, -48620, -72343, -83266, -64653, -18663, 23496, 15395, 13511, 32027, 34321, 8266, -17467, -44630]
22207d4630J7488K8628J4722l4993q049L822k8395J4626K2464N342k7883o632
22195d3490o585q364J3378J5638R255M913J0373l8208r748K6488Q210Q411K3720
22182A3991K777n676j794o142o898L0206K4011J3158j8759j8095K8613N194k3172
22169C7414n732J4635j4298m1929k0112J1610j9461n653K3777K7088Q571l7939
22157b2029l2240P561K874M496l974M827K7705P838j9437K041K257j2636O545
22144b4172k449J1022J5328Q75J9157K867k2854k8049L1665j696j3683J2256n810
22131e543J7538j1165J4106k038j6690j8981P219r657k2065M075K5466J8897r869
22118h707l287L0735K604j4691J6423O626j9454P611M923m001k8719j5292L8764
$$ y = [-44630, -27142, 1486, 16208, -18785, -26834, -23012, -51407, -36781, -14317, -8975, -36858, -43490, -50075, -58439, -45061, -29423, -20168, -15255, -4882, -43090, -52838, -26350, -18140, -9729, 13991, 16768, 11092, 9298, 3156, -3742, 26464, 50475, 63633, 44874, 26779, 55392, 60586, 37414, 31682, 46317, 32019, -9910, -30022, -18412, -37873, -43526, -19749, 7339, 15910, -22029, -54269, -46708, -43834, -39338, -43312, -38485, -10780, -2942, -22379, -20338, -18081, -30717, -24172, -26621, -15599, -271, 604, 19761, 22628, -226, -28275, 3390, 1694, -11989, 267, -5543, 11995, 830, 14936, 12898, -3792, -22773, -15554, -25211, -47276, -43201, -17735, 1162, -8707, -11994, 18741, 21345, 6654, 23077, 29703, 10249, 17860, 22783, 18782, -9937, -25229, 13535]
22105A3535J5058j8677k4586p524J5893j0248l5199j1688M8095J6437o050j3681
22093a8635j6754k2460K2202N686j3039L795J5014K4522j7687j4449l389o629
22081d1823j5660R55R899K6393J2714K0806J4161m0544k5986L815K2805J614q976
22068a9827j988j4779k5351L4437J1064J2053J6571K3765P803M673j1396j7023
22056B0002J346J5086l002k594M006q509K428l1240j9460o038j8332n6561J2423
22043i0445M8577K2770M436L3K4068j5370j1356n190k0005p727K2953J5129K300
22030i827N598K979J3036k6975J9943r235k6258K2084M875l46r677M075K3219
22017A3491k024l7857L238J250P873J5775j0905Q944L224j2018p641j7851k0735
$$ y = [13535, 28593, 9916, -14670, -22194, -6301, -16549, -51748, -63436, -15341, 1096, -4954, -18635, -35389, -57849, -35647, -29961, -43000, -39205, -24191, 331, -17356, -31805, -35194, -41823, -57483, -56528, -46629, -20236, -7522, 13284, 27445, -13099, -39085, -35270, -12465, -10851, -19827, -21815, -36594, -61945, -27508, -16444, -4391, 12180, 35945, 43748, 48421, 37025, 20002, 21348, 36434, 33432, 30838, 34844, 26335, 28763, -2477, -21937, -27975, -46307, -102868, -90445, -41868, -19098, -14662, -14629, 9439, -5931, -17287, -22477, -42482, -50209, -27256, -12127, -9827, -4229, -1250, 11786, -15189, 4754, -4481, -30739, -8655, -3780, -4126, -13803, -9728, 13491, 11467, -26390, -23152, -21902, -14029, 1746, -9159, -215, 3009, -9009, -16650, -34501, -55236]
22004e5236j6434J8912L3294K2596L278j7754p571o226Q956k439j1103J2809L1903
21991A4985r769l2800K7018R599j2729L85j3417r162j4824p045J966O378J8512
21978b0903p698j3886j1445J1951J6604J4456n423j2403K3609Q325p705k7004
21966c1522r587L357R244L3216J6199q34j5164P77j0178k6307k6219o979L841
21953f0156J3752N370M0656J5194K567k8111o890N300N858K257j0029J1185J9911
21940A6864J2174k2129N362J9219k5335j1660j9041j7840n56Q538k392K1127Q480
21927g189K4656J0583o801k6790j990J719K240k6761o381k1393K575K6042K6425
21914c065k024n278j1239j3163J2172K1949O911j0510J1678K7360j4104J70J7389
$$ y = [-55236, -71670, -52758, -19464, 3132, 6410, -11344, -18915, -25141, -16185, -18624, -29727, -16918, 14985, 5216, -27584, -566, 9033, -3696, -3311, -16728, -25890, -40714, -47759, -45793, -39415, -20903, -28601, -42487, -53932, -41981, -25377, -10921, -16344, -28747, -5138, 3187, -4518, -31522, -41109, -37752, -28508, 4708, 20907, 20073, 4909, 5686, -4492, -30799, -57018, -63997, -60156, -46404, -41034, -378, 14816, 17383, -10728, -17618, -12318, -6460, -4203, -14232, -3047, 16864, 29038, 6909, 12271, 31490, 6155, -5505, -24546, -42386, -42942, -34404, -36796, -15669, -7189, 17467, 28050, 21249, -5541, -7531, -5812, -3572, -30333, -36714, -58107, -55532, -29490, -3065, -5089, -10367, -21606, -34769, -22597, -648, 6263, -4247, 7431, 34791, 20687, 20857, 38246]
21901C8246j1899j2694O776J2105k0219k6530J5966J3735K0028K540k092m934
21889C1028j0931N789m568k535j854j1516k3254r588j1746J1350J8227o13j4455
21876b4666k299R254P996J9466Q669r78K5305p485k4608K89K6453R437m5759k4713
21862b3639J2584O223o880J6281J2610M77k7452k0170J6075M0343p511j5954o180
21849c193K3869K0261j773j0003k6078k0504o671K888J2644K5733j093k757p963
21836E360J3486O49q255L058l662j2991j2021j7007K0901p67M015J4697L2815
21823D0278m065p296m988k4015J9227K8818j022q639k5320m9827N990K0829k1617
21810c1647j9083J0756L4992K0162P876P030j4031j5102Q997K7051j8486j9963
$$ y = [38246, 26347, 13653, 20429, 32534, 12315, -14215, 1751, 15486, 35514, 38054, 35962, 31028, 20097, 25886, 21318, 18783, 16929, 5413, -17841, -27429, -39175, -27825, -9598, -10211, -24666, -26965, -17711, -9715, 9751, 18420, 17442, 42747, 35262, 10654, 10943, 37396, 46833, 1074, -23639, -11055, -4832, -11712, 4569, 17179, 17656, -9796, -29966, -13891, 26452, 18941, 2987, -3193, 20676, 40937, 39164, 29161, 3083, -17421, -24092, -21204, -8560, 17173, 16080, 13323, 5360, 18846, 19495, 11240, 14298, 10636, -2355, -14376, -31383, -10482, -11249, -7234, 7463, 40278, 36213, 28917, 23929, -86, 19141, 47959, 46937, 38298, 12978, -36849, -30859, -10030, -31647, -50730, -39974, -4982, 15180, 23056, 30086, 16055, 953, 9950, 37001, 18515, -1448]
21798a448K449j5447K218j2508k7538M2580K3335K0538K3116j9182l4971k4516
21786b1374r225j5365K109p607K561L7869L9667R83j9046j3191J762K0480j0528
21773I095j5912J236p246L1196J4765m4197j1348N1655j9448k2094L461J4958
21761F121J9032R596q179J6351n486l2441p882J3471O187l5049O126L5887o09
21748B3125n172J2631L085k649j7785J1313r426J2922p71j8490p187k4691N864
21735a7231K4195k958j2950J9070r922l5957n912J2865J3731J0020J5245M400
21723A4596j5431j3204k0608K304J9657l850J4971j4616k7868j784L0318J9405
21711C890J1008J6340j7519J2267j0459k7926j2725j331J7317M589P49K1802j6589
$$ y = [-1448, 1001, -14446, -12228, -24736, -52274, -9694, 13641, 34179, 57295, 38113, 3142, -21374, -30599, -45964, -43855, -51462, -48901, -11032, 28635, 29618, 10572, -2619, -857, 19623, 9095, -6817, -5581, -12827, 18369, 33134, -11063, -22411, 29244, 9796, -12298, -8837, 6121, 25153, 34749, 26570, 42921, 37435, 4994, -2888, 10583, 16770, -18279, -12153, 23734, 23125, 17953, 30584, 33669, 31020, 13235, 24548, 15122, 28044, 27273, 8783, 1596, -23095, -17231, 6964, 4006, -8944, 10126, 204, -35753, -41665, -28800, -15069, -5049, 10196, 14596, -835, -14039, -34647, -32343, -12686, -16536, -1565, -16181, -44049, -45833, -15515, 3890, 14898, 31238, 13719, 25986, 15527, -12399, -25124, -26455, -9138, -4549, -3800, 18002, 1413]
21698A413l0544K5882M2797j0143m379L230j5391r10j0586k3098j5173k6067j7596
21685h0565Q588L2192j3375J6682L1409N896n869o22j719j3432M823j6106j4863
21672d6961L5013L1571n098j7011K5281K6107j9602l6978k2998j9880O66L1619
21660a8271J9006M50K338J7332K979m3711j8115K6979Q645j505K3488P828k2102
21647E341j6550N902n794P063P97l0597k3686J2847l158m598L8199J2730K13j5396
21633a6687J266J9658J3967K2077k5778l8911J0402K1143J2817j1449n715j5591
21621a2801J2754l05n923J055o315k3956J2374K180J7585J9895m398K4335P935
21608D4415N742M479m6358L34m504j7466k0973r604j036q903J8044R297O586J6839
$$ y = [1413, -29131, -3249, 39548, 29405, 25026, 28256, 12865, 11955, 1369, -21729, -36902, -62969, -80565, -71977, -39785, -53160, -36478, -5069, 827, -5042, -5664, -7383, -20815, -15992, -32098, -46961, -11948, 19623, 14525, -2486, 22795, 48902, 29300, -7678, -30676, -50556, -49890, -18271, 735, 1185, 3523, 20855, 23834, -19877, -37992, -11013, -2368, -3873, 19615, 27443, 5341, -11209, -5307, -11101, -4038, -3241, -33838, -57524, -44677, -47835, -52433, -14234, -1504, -1291, -16687, -15421, 4237, 18204, 40281, 14503, -24408, -14006, 7137, 19954, 8505, 2790, -12801, -47, -352, -6275, -5220, -11535, -35491, -23117, -20937, -3352, 16543, 12145, 36480, 44415, 50157, 54636, 8278, 8612, 4108, -13358, -34331, -43935, -44971, -53874, -35830, -26533, -19947, -3108]
21594c108j1806k2227L936K6167l895p198M539J5137J3881j1982l843J9313k41
21581A8673J0528l662j3872n123J3197K6126O914j2928j0930l853K3460K4133
21569G2663k4688k1411j5267k0256J825k575q999m2K671O577L2774R393j5508
21556A7157o578J0444o432k5032J522M2130Q725m197k824k9154j3860j0868m47
21543a9414j5616j5530K4053L6365j7530j2461j031J3795K5565J4215j59J5325
21531D7577J4965K863k6666k9622P94n864p040k0751J637J6699j7396R224P714
21518e866R733m85q721J0404N659j4033k977m963K0697K153K657J1132j3868j129
21504A0393M164j5428k084K3031J157m0680M281K8572k747l6300l7241J5706J8349
$$ y = [-3108, -14914, -37141, -33205, -7038, -10933, -18131, -13592, 1545, 15426, 3444, -399, 18914, 18673, 29201, 25539, 11667, 6544, 19741, 45867, 52781, 39853, 28923, 25070, 48530, 72663, 47975, 26564, 11297, -8959, -7134, -9709, -18708, -18750, -16079, -9502, 23272, 32665, 17157, 10579, 21023, 14591, -10441, -8919, 33211, 41936, 37739, 34915, 5761, -8099, -18967, -19414, -35030, -50560, -26507, 9858, -7672, -20133, -21164, -7369, 18196, 32411, 32252, 47577, 62542, 65405, 38739, 9117, 9911, 4047, -2993, -23744, -22107, -5408, -22804, -13580, -5866, 3867, 3382, -5339, 5065, 10724, -3309, -6286, -11249, 9448, 11601, 14258, 25390, 11522, 10393, 14557, -871, -2955, 20076, 21233, -19447, -15166, 13406, 10659, -25641, -62882, -47176, -28827]
21491b8827N104J4387r627o609J2904R735q923r73l7489r882J9287J1065J3010
21478a6838K6934k1440N530Q421j47k2885j2014o919J0972k0296j4756J5560K5520
21465b2358o155R808J4803L2932R479j060j4620l1196j1602j01L1735J7732l687
21452B5710l410R47J6304K7079j3942k7076k414k2439L471r47q858R112p878j6077
21438b0418m737K0512K7533k12k0583k4108k0068k9034J5983R360M614L1652J7068
21425G562J631o997j0112N065j6228J1454J3192j041o86J6681K711j7027o722
21412e17M296M1937J7093j3255l7296j1419J6389p020P291j9107m0005n052L2026
21399a4639M1117L1842M753j4875k5484j0737J6583J1535j9929k101K4202j3930
$$ y = [-28827, -23723, -9336, -18963, -25572, -12668, -2933, -11856, -12829, -50318, -60200, -40913, -29848, -16838, 10096, -11344, -5814, 2607, 2460, -20425, -32439, -39358, -28386, -48682, -63438, -47878, -22358, -28513, -18705, -3902, 29030, 38509, 37449, 22829, -8367, -19969, -20070, 11665, 29397, 25710, 22300, 23247, 39551, 66630, 52688, 25612, 23198, 759, 4230, 3283, -5575, 3537, -4341, -20418, -25155, -4643, 22890, 22678, 2095, -22013, -42081, -71115, -55132, -45772, -41158, -9506, 7562, 9193, 2196, -7916, -2851, -19079, -7625, 5567, 4526, 3840, 20521, 23232, 6205, -517, 3779, 45716, 62809, 49554, 12258, 839, 17228, 10208, 17499, -1608, -41613, -46665, -14639, 26478, 58320, 63073, 48198, 22714, 11977, 28560, 40095, 20166, 18065, 42267, 28337]
21387B8337P410j0376k5566j8917J3404L243O812k5257k7357l064K3445J9745
21375h141L570r656k4438k4516J9500N0618k1849J3752K2612K024j5418k2545
21363a4487L7516J4317k3288m2020J3041J1885N081l912j1774J4803L5862o933
21351C0091l0311j9806l765j511l448j506J4093K5195k2890j2958J1798K2038
21339G020R287J91r246R694M296j1570j6464k7206M0043K3935N367r738j7434
21326H175J3416P897J0000k6170k6191L295K0567O176R881O626k3487l8695k500
21313c1010M6536J2258j1125O6j6411p827r101n067J7499j2258j3850k1564J566
21300e0288J402P872j1855n123L7417J4023p360L985J1695P106J7250l754J5522
$$ y = [28337, 35747, 25371, -195, -19112, -5708, -2465, 4347, -20910, -48267, -51331, -27886, -8141, -4571, -14227, -38665, -63181, -43681, 6937, -14912, -1160, 21452, 23476, 8058, -14487, 23029, 37346, 14058, -27962, -14921, -3036, 2045, -1867, -13641, 1162, 37024, 30091, -220, -20026, -23791, -25302, -28750, -30256, -16163, 9032, -13858, -26816, -15018, 7020, 16307, 16498, 7252, 16946, 21242, 9672, -6792, -33998, 6045, 29980, 35347, 25609, 8175, 21591, 29488, 39488, 13318, -12873, -9578, 10989, 17165, 27046, 33672, 10185, -28510, -31010, 15526, 27784, 16659, 16725, 314, -7513, -16614, -21681, -4182, -16440, -30290, -51854, -50288, -48886, -41014, -52869, -57992, -20575, -6552, -13912, -9927, 1768, 8874, 26124, 22370, 37892]
21287C7892j6664j8821j8180j3757J0823O731l144k373P944L095r379p613K79
21274b3167J1433m1218R04L6095o107K199J3023R974L142J5143J605k4344n174
21261f492J0254Q347J9386m426n010L4285k5116j0578K29J6104N528k7381o235
21248H895O725k9795l8636k2565K3526K7133L196K3006K7087K1915O206r693k1249
21235B5751k0288K6964j2855k5455k1132J7181q353K6966O650o350J1998k562
21223A8515P391K5530k451j9191K842K7452p233m5787j5168K835p164j3162O782
21210a8809K4732k3240q778N4649L4207l1219k499K1280o731r205j8019k7291
21198a0923Q318j829j582K6552J0796r088k3112j1838n393k1057j0954K0943L8149
$$ y = [37892, 21228, 2407, -15773, -29530, -18707, -11976, -15120, -17493, -9549, -6454, -15833, -23446, -23167, -11734, -52952, -52048, -15953, -22060, -19861, -6838, 3136, 6278, 21421, 23026, -1318, -6492, 3762, 12109, 31495, 27069, 22059, 56344, 31228, 20650, 20879, 36983, 42511, 15130, 8895, 15620, -14175, -52811, -75376, -51850, -24717, -21521, 1485, 28572, 50487, 56693, 47000, 25751, 5463, 32427, 19572, -5883, -27015, -9834, -18187, 8779, 15429, 9079, 21077, 18515, 25906, 51436, 48985, 29794, 32636, 60088, 52855, 7068, -8100, -5265, -12429, -25591, -18809, 5923, -17317, -26095, 28554, 62761, 31542, 29043, 50323, 43592, 34387, 16368, -10923, -2605, -4434, -6016, 20536, 31332, 22244, -868, -12706, -18099, -39156, -50110, -29167, 8982]
21185H982l466l4858r58K7801J3336j7633J3067k587K1525M774j8495K486k3318
21172i344p910j2648J3670J0553K194N855m465O17J5478l764n278K4459J7616
21159D7033k622o324k6989l831M463j6573j3943Q778Q620k027r948l083K8482
21146A2036M800J731p218q570n2j1813q011J2443P670N447j0464R466M317K7934
21132C9716J8979M128k441J4449j4191l2405j7916n174j3042j7567o780J1078
21120b1166K0119L69j3236k8554J0163J6254K1817L706Q71j398k7053j6877P936
21107b7049j3495k4657m968K9373K2637K3949J9586J0683k6398q93r846J3174
21095A2096J0404K4520J7296k8728o5845j1765k327j7519J846p685L5529M271
$$ y = [8982, 5516, -29342, -30300, -2499, 10837, -6796, 6271, 3684, 25209, 29983, 11488, 13974, -9344, -17254, -29902, -16232, -5679, -3485, 2370, -2095, -1478, 14000, 10236, 4958, 29417, 47033, 44411, 38087, 11098, 7267, 11730, -4843, -18786, -10008, -1388, -3415, -13363, -16446, 12036, 16836, 18567, 11349, 2779, 2727, -9086, -17097, -4654, 3016, 8463, -2001, 7465, 11782, 39716, 58695, 62823, 60382, 74831, 60640, 28235, 10319, 5145, -7897, -25464, -32244, -21166, -1047, -678, -13914, -42468, -32305, -16051, 5766, 9472, 10343, 8945, -18108, -34985, -27049, -40544, -65201, -70169, -40796, -18159, 5790, 25376, 36059, 9661, 8768, -1078, 12096, 22500, 47020, 64316, 35588, -30257, -42022, -44349, -61868, -60022, -67707, -32178, -27907]
21083b7907Q268M7181O842P667j4681m6041k7889J1263r135J7041J3200J5455
21071A264R462J4120j53j31j0930K6167K8535q224j5406j9107j2690M46M718J4210
21057C2281j974J34l73K4740q078j7604J3122j2660j6859l854j2752M006q182
21044h053K256K75K1934J4598k0635o6498l046L6791L831J4814k033j3089L1863
21031A3008L2776n1l0642o632n976o40J93L2647n179p139j2364j1184j3114j3117
21017b7414q635Q100m180J4508K4789q861L797M946m388J1097R069p325K118j1071
21003F550q722R154j4124r812j1957K3360K8398K6927K2381K6647O140j0726k9384
20990F4832k2996n196K5993J730j3150p781j6695J5299j6301P152j747k0029j6995
$$ y = [-27907, -19639, 27542, 34384, 42051, 27370, -18671, -46560, -35297, -44432, -27391, -14191, 1264, 10726, 24846, 24693, 24562, 13632, 39799, 68334, 60110, 44704, 25597, 12907, 13353, 18071, 32281, 30307, 30441, 30068, 54808, 46730, 29126, 42248, 29588, 12729, 8875, -3877, 129, -8053, -5797, -5522, 16412, 31010, 10375, -56123, -59169, -22378, -18547, -3733, -5766, -18855, 13008, 45784, 45733, 15091, 8459, 2483, 1843, 2036, 34683, 29504, 22365, 10001, -1183, -14297, -27414, -36049, -27949, -32129, -17621, 7168, -1693, 2104, 7050, 2662, 13759, 22828, 15503, 17621, 6550, -2172, 6982, -7142, -16954, -28911, -5551, 22847, 49774, 72155, 98802, 104942, 94216, 64832, 41836, 36640, 62633, 64363, 51213, 43432, 26737, 42036, 25735, 32887, 31140, 11111, -5884]
20977e884j178j2008J5050L434n037J6967j8941k7829K624K3293j4179M759L6104
20964A7175r55J0667K629k5744j5833J0386j1942n896J0541J3490K9394j0127
20952B3785m9222N343J6707J2756J9622K1277j0152m160j9620k1600m142K3010
20940A3604K0031j8245Q257K5810Q565j0776k5836P8L8928j791j2484J1507m92
20927E7156l1067r624q464k5874Q217J9094j5109k0468J7752P885J5797j4902
20915C93R101k376j2632M097K6096N4941L5013k5428j5394o217k8147n767P063
20902D0743k0503j2431J858N201j8399J802L056K7595k7514j3403N172Q945m477
20889b355k6149O580K9397L0312J2165j1490q456l4355k6181K294K0819J3779
$$ y = [-5884, -7062, -19070, -4020, -586, -5623, 11344, -7597, -35426, -32802, -9509, -23688, -18929, 17175, 16220, 26887, 29516, 3772, -12061, -1675, -13617, -19513, -8972, 4518, 33912, 23785, -25437, -20094, -3387, 9369, 28991, 50268, 40116, 35956, 16336, -5264, -9406, 13604, 33635, 15390, 23647, 49457, 58022, 47246, 21410, 21488, 60416, 58625, 46141, 57648, 57156, 26089, 16465, 8001, -17873, -9656, 9438, -5671, -26139, -8387, -502, 15295, 393, 9494, 7118, -5514, -1417, 24679, 79620, 114633, 89205, 73811, 67594, 39447, 33680, 40743, 20240, 7809, 9667, 14868, -3531, -1729, 1327, 28922, 1408, -11995, -6823, 2122, -2355, -28504, -21924, 7473, 37785, 49950, 38460, 30004, -4351, -30532, -28238, -7419, 6360]
20877F360K091k0033m945J6493j0231l3228q78N5884J6925K148K1247L875q704
20864D7004j2996J65J103N903L630j8032j0951P233K5785o92J6810j7857l5014
20851A2091Q205J1335p655k5220L746J000J9161n760j1800J0985N723j0485J0492
20838B1818k9413J2038K3294K1710K0169j4008j8957K21K1352J253M482k705p806
20825E3448j4566r823J3277J2320m754J3451J3953j7864j4528k4189M063p868
20813A6920K663o922n280j5741j7264J3497N126O846j2765J8607O687j0845l5148
20800c3619l628K1370M0617J7225k5994k4157J8906j6193K7023O502P868m713
20788C1207K344J9878j4987l5089l2564o043J0246L5162J5185r72j2092k602K209
$$ y = [6360, 8451, -11582, -16527, -34, -10265, -43493, -44371, 11513, 28438, 30586, 51833, 55708, 47004, 34008, 34173, 35276, 41179, 44809, 26777, 15826, 23059, 48844, 48152, 64962, 47105, 12091, 20296, 31631, 23976, -1244, 2502, 3502, 22663, 16903, 5103, 16088, 21811, 11326, 21818, -7595, 4443, 27737, 49447, 69616, 55608, 36651, 36872, 58224, 59477, 63959, 61254, 53448, 38882, 29059, 42336, 54656, 49902, 63353, 77306, 59442, 44914, 20725, 24788, 16920, 19583, 12661, 7381, -8360, -25624, -12127, -7001, -155, -12920, 5687, 12374, 1529, -33619, -37247, -15877, 24740, 41965, 15971, -8186, 10720, -5473, 21550, 28052, 35920, 31207, 33551, 53429, 38442, 3353, -29211, -35254, -25008, 10154, 25339, 24367, 12275, 9673, 11882]
20775A1882j1383m350L474l24k541J9850R139k818q719k849k628O106n743J9474
20761B8570l446j1576j9108L022K0513Q380K518M130j2173j1689J9390L437R014
20748D0982J2283P548q177L28q348Q105N93j5478j3290M0373L962n0720k3487
20735e326n338J7633J2632K027K0654J2505l905N450L3247j3126j3325j7275k1244
20722B4609j3077K7644L0955N380j0662k0793M332K4262k036j4912q969j7886
20710B8847K2415K5107k6292N527Q91p404j1130l1558n717o022K649L1670j3421
20697A5562P654J0991k5638n123m84K1657j550N7k9364l1780K3028K0786J5310
20684B1106L0915K2992m827l8831N023J6798m387K1013N695r952k7001j4643j5138
$$ y = [11882, 499, -3851, -377, -701, -3242, 16608, 25747, 22929, 14210, 11361, 8733, 14839, 9096, 28570, 25124, 13548, -5560, -2538, 17975, 26355, 28873, 33003, 20830, 9141, 28531, 31968, 40982, 53265, 60813, 52636, 52964, 44616, 52721, 53314, 37836, 24546, 64919, 68881, 18161, -5326, -10664, 6969, 19601, 21628, 42282, 54787, 50882, 56332, 89579, 76453, 63128, 45853, 24609, 11532, 39176, 70131, 75511, 64849, 44056, 48388, 72650, 70614, 55702, 46733, 28847, 51262, 76369, 50077, 55604, 56495, 49091, 37961, 6403, 686, -5336, -2687, 28983, 15562, 23216, 34207, 8569, 3446, 2962, 24619, 23069, 23126, -6238, -38018, -14990, 5796, 21106, 52021, 75013, 70186, 31355, 36378, 53176, 48789, 69802, 75497, 65545, 38544, 23901, 8763]
20671H763j8626K703J0532K8514J7225m171J2247k470J903j4355k7351K8255P63
20658D3932j686N798R260k0514p662J4224K904j2190J671Q16j5980N263J4337
20645D0173J4658P06j2900j0284q960J3483K0063J3479j6649k442J0364L1657
20633I3348P790L723m900n793j2133j02j1129m160k0300J0922J0375J3963J6946
20620I8550j2494k1803k3193j2071J2519K1179J1116J6588J5520l4256m964m605
20608F2086m2831L750L7865J4342j6732k8924l066o169p152j2413L9690L1139
20596G1585j4556j1318r665q32j6727N17J874n45J4202j6639k9408k4955j0617
20583d7084K2854l250K3514M5769j4502k7866L877L5869J5117j4814R94j1297
$$ y = [8763, -9863, -7160, 3372, 31886, 49111, 44940, 57187, 54717, 56620, 42265, 14914, 43169, 43932, 42246, 48044, 57304, 36790, 29128, 43352, 46256, 34066, 35737, 36553, 20573, 25836, 40173, 54831, 55537, 42637, 32353, 23393, 36876, 56939, 70418, 53769, 51327, 61691, 93348, 101138, 104861, 99961, 94168, 82035, 81933, 70804, 66644, 46344, 57266, 67641, 81604, 98550, 86056, 64253, 41060, 28989, 41508, 62687, 73803, 90391, 105911, 71655, 66691, 62086, 19255, 23005, 60870, 75212, 58480, 29556, 26490, 20321, 13169, 756, 40446, 71585, 57029, 45711, 36046, 35214, 18487, 19004, 20878, 20333, 34535, 17896, -11512, -36467, -47084, -24230, -27480, -3966, 41803, 27301, -565, 3312, 39181, 54298, 39484, 40478, 29181]
20571B9181p002n794K5547J4192j7208j9815o194J2810j6037N088J6148O155n215
20558C1856k4857P83K5478J0223n711o186j8774J1868K6923m790j7427R543J5343
20545E4272k6894j0856P485j6000J112K6441J3045l8068K857K5782L93p105J1481
20532D3945l439j0932K3538J1701q849j6644k7029r122L8173L572L053K8383N472
20519H1822k0798j3052l4001o999p62M520q465K311J6210J8928r239J0458Q102
20506D9035J5645o765p253J9351j0608k2288K994P788j9726k0035J5557K4455
20494D8150k5356K1060K2451j3858n361P912L3670l471r676j624j0457O174n148
20481F4466j4679Q40J1845k2988m2240j6155K5526M7161J2765k7371J183N408
$$ y = [29181, 22179, 16385, 41932, 56124, 38916, 19101, 12907, 25717, 9680, 14768, 30916, 37071, 31856, 6999, 7782, 33260, 43483, 37772, 31586, 12812, 24680, 51603, 46813, 29386, 38929, 54272, 27378, 16522, 24007, 8007, 9119, 35560, 48605, 10537, 13394, 39176, 39569, 32464, 43945, 40506, 29574, 53112, 64813, 55964, 39320, 12291, 3169, 41342, 44914, 47967, 76350, 81822, 61024, 47972, 13971, 6972, 6210, 10730, 2265, 4576, 20786, 39714, 30475, 40933, 49035, 64680, 57915, 50662, 70013, 59405, 37117, 40111, 47899, 28173, 8138, 23695, 48150, 22794, 43854, 66305, 52447, 47086, 54998, 88668, 85197, 75521, 73897, 63440, 69614, 64466, 49787, 50627, 62472, 39484, -2756, -18911, 6615, 53776, 66541, 39170, 40353, 45761]
20469D5761o550P360m665k011k004O50k9738j9608p103m0411L731M0527J9372
20456E311K8199M0619m1k3129M873P202J1415j2327l863m208k339M968P837J1001
20442G5518l0377l87K207j8984j3215K8903J5190j6973j2306l133O103l913J4356
20429D2989K2479j6396j9324J077O060J4100L6773J930J5413K559q357k5114j9471
20416E4718j6427k2580L1682K9201k4179L920R060n819l1681j117O706k70K4617
20403E7831Q517l736j7640N193K994k1309J6326M2819J2079j6308j2641k0177
20391E3948l9135j7333p838L4342L1740K5469L86j6905J505J8700j1171l4698
20379C9010J2123k758j306K612M0787J3207j3680O048r034q569j7797J3396K4615
$$ y = [45761, 39211, 46571, 41906, 39895, 37891, 38541, 8803, -10805, -17908, -58319, -54588, -14061, 5311, 33510, 74129, 74088, 50959, 55832, 63034, 74449, 62122, 58259, 54051, 51712, 56680, 64517, 75518, 45141, 44754, 46961, 27977, 14762, 43665, 58855, 41882, 29576, 26443, 32546, 28633, 42989, 65468, 49072, 29748, 30825, 36885, 50985, 87758, 89688, 105101, 107660, 99303, 74189, 54718, 38291, 15711, 47393, 76594, 52415, 56335, 65395, 59576, 27895, 26778, 33484, 33214, 57831, 66348, 62612, 44972, 50165, 53159, 31850, 48176, 90995, 103074, 86766, 74125, 53948, 14813, -2520, -10358, 23984, 55724, 81193, 81579, 64674, 66179, 84879, 73708, 39010, 51133, 48375, 47069, 49681, 90468, 103675, 89995, 96043, 87009, 78440, 60643, 74039, 98654]
20366I8654j4126j2386l949J50N086k183o650p808k1102j1651L0K1606J0786k4707
20352C1750o117l387m665K3810J8445o080M04J6501l596J1489p905k5620N726
20339E0755m111j7087j2005L4023j4552l2541K4726L2471J6695j7717P101j4549
20327E3209R583K3019O585k9258k244J5860m092r25K329p915l4554j4761N032
20314B1868L1785Q970j1327K8723K1671J0649k4606l5167j4544R698K683K4635
20302G5038K899j9616k6268J0697L5451R746K116n712N524J611n634p038r761
20289F9053j4555R153L4019N684j77o23j1731l7827j0802J1040J6819J0865P571
20276H8489j7789r320j8539M048m726J395j7816k5058r03J0641J5322j1762K488
$$ y = [98654, 84528, 72142, 68193, 68343, 73429, 71246, 64596, 56788, 35686, 24035, 24065, 45671, 56457, 31750, 25633, 22246, 17581, 41391, 59836, 53756, 54160, 70661, 67065, 78554, 70649, 45029, 50755, 46644, 29557, 17552, 51575, 37023, 4482, 29208, 61679, 78374, 60657, 67758, 53209, 62792, 85811, 92396, 63138, 60894, 76754, 72662, 71737, 74066, 66151, 31597, 16836, 21868, 53653, 62623, 51296, 80019, 101690, 112339, 87733, 52566, 38022, 47720, 50403, 75038, 77937, 58321, 32053, 42750, 78201, 87947, 90063, 84351, 89875, 91486, 85852, 78814, 69053, 54498, 63651, 97670, 103354, 103177, 102554, 90823, 52996, 42194, 53234, 70053, 80918, 88489, 70700, 61380, 42841, 46889, 42163, 43558, 25742, 684, -219, 10422, 25744, 13982, 16470]
20263A6470K8751K7337j3101Q858N03j4846j2178j7814j1139L6250N3863J916
20251A04870j0404j0838J4936Q732r978K267j2580J115K3584M858k7766j1875
20239G6921J1788J3883j6760j1677k0476l922r162K543J8633O762K169j2762K7195
20226H5135L0241p120j4284k266j9485j2779J602k9669J3241M2886j8631P105
20214G5976K2587j7679m683O966q464L4836N593l8943j5068L4566J7619l7967
20202G5339l3949K6410K1332o465M564O453L123O862n976n326j3765L675J4557
20189I6834r825K8158L1221L591o25p351l379m727p895j8710N626J0081L6230
20176A59229J2347K8065J5021O1409O9290Q4262J09899R9980Q9816J41465J37746
$$ y = [16470, 45221, 72558, 59457, 68315, 68818, 53972, 41794, 23980, 12841, 49091, 102954, 104870, 94466, 83628, 98564, 107296, 97318, 99585, 87005, 88120, 111704, 116562, 88796, 76921, 88709, 102592, 85832, 74155, 53679, 49757, 40595, 43138, 61771, 68533, 70702, 57940, 85135, 115376, 108256, 93972, 91706, 72221, 59442, 61044, 31375, 44616, 87502, 68871, 75976, 98563, 80884, 76201, 83167, 74703, 109539, 115132, 76189, 61121, 95687, 113306, 75339, 41390, 67800, 89132, 82667, 87231, 93684, 96807, 103669, 97693, 92367, 78602, 82277, 96834, 87009, 115167, 146388, 149979, 149354, 142003, 138624, 133897, 126002, 107292, 112918, 122999, 159229, 171576, 199641, 214662, 276071, 345361, 429623, 539522, 639502, 729318, 870783, 1008529]
20165A008529M5117N017k01N4195P6125J9534l7196n4971k4301j5753J6889P2412
20153A165396R0746M5001m6958m2821O7474J12673J1036n8091j33453j41574j16913
20142I52516l0397j2182j02746j19958q7804o6937n2057r730m7020n2316l2443
20131C38926m0066k3957m845J6222J8048L687L3060K7637L7159K5342J1657K0270
20119D63140K8317L1317L6108R579K7066P5855R1053Q5475Q5820J36925J79211
20108A249866J11143M1948K8911N5738R1427R2764k0633q6491p7647m7800M3738
20097A482964L7531k0404j09752j49611q6266k8228k1484p2220j34150j38351
20087G60029j07153q7964m4218l8663p4806o9029l0174l4797l519m227l2643n5505
$$ y = [1008529, 1053646, 1058663, 1058462, 1112657, 1188782, 1208316, 1171120, 1116149, 1091848, 1076095, 1092984, 1165396, 1256142, 1301143, 1254185, 1211364, 1278838, 1391511, 1402547, 1344456, 1211003, 1069429, 952516, 922119, 909937, 807191, 687233, 599429, 532492, 480435, 470705, 423685, 371369, 338926, 298860, 274903, 270058, 286280, 304328, 308015, 341075, 368712, 405871, 431213, 442870, 463140, 491457, 522774, 558882, 568461, 595527, 671382, 762435, 847910, 933730, 1070655, 1249866, 1361009, 1402957, 1431868, 1487606, 1579033, 1671797, 1651164, 1564673, 1487026, 1439226, 1482964, 1520495, 1500091, 1390339, 1240728, 1154462, 1126234, 1104750, 1032530, 898380, 760029, 652876, 564912, 520694, 482031, 407225, 338196, 308022, 273225, 269706, 265479, 232836, 177331]
20075A77331l7416o10m290O608j2961K3177K4032K1505j1763j1783k0950r963
20063A42917J9920N009l1775r648J2217j9758n776k820K0117J5688J8474N966
20051A70531J4550k0608j0980k1831q265j2290P317p782j2682J8402j755j4572
20039A00035L2360P327P861j2385j0539r203J9716K0233o044j1523q596m834J0013
20026A34421j0850L866L0001O510n663j1668l812J3860o908Q027L0772J3967J4735
20013B17258O671j7997J6811p349k4987q04O753O31l6078l8192l3939n626J2950
20000I6102P080K962K565N973J1032k426L263J0691L1027J3246j5774k2845n261
19987A37635J0218n342l4938J1210N047k673K6225k913j8201j6144L7355K7965
$$ y = [177331, 139915, 139305, 135015, 141623, 128662, 151839, 175871, 197376, 185613, 173830, 152880, 142917, 162837, 167846, 136071, 126423, 138640, 118882, 113106, 110286, 130403, 146091, 164565, 170531, 185081, 164473, 153493, 131662, 123397, 111107, 118424, 110642, 97960, 116362, 114607, 100035, 132395, 139722, 147583, 135198, 124659, 115456, 135172, 155405, 149361, 137838, 129242, 124408, 134421, 123571, 127437, 157438, 163948, 158285, 146617, 142805, 156665, 149757, 157784, 188556, 202523, 217258, 223929, 205932, 222743, 215394, 190407, 189603, 196356, 196987, 160909, 122717, 88778, 83152, 96102, 103182, 106144, 108709, 114682, 125714, 123288, 126551, 137242, 168269, 181515, 165741, 142896, 137635, 147853, 142511, 107573, 118783, 123830, 121157, 147382, 144469, 126268, 110124, 147479, 175444]
19975A75444J0634l7914k2562P942J0952Q548k313j8115K2903N056o944K593N768
19962A61992k9123k7683J9946R810k3833K280J3767j4562O263m296r958J8436
19950A23039P681o386m642j5539N184R778J5838K1810O371M850J6583p83J662
19937A85446J0973J7814k595j0644L1275J9260K8628K3509j8625K160J3910r716
19925B91395l0162K3249j5870L091J513k444K2495L2464O15l6340k242L534P323
19912B98621K346J0133j5576j5007L2474n096o681M303k8667n1347P03J9546K0153
19899B65905m157n183L3525L6871K6195N124n637l931j017j7443j2839k1739r333
19886B86341J8340J5206k2116N20j8570k3016k0157K6932K5520M011J099j0560
$$ y = [175444, 186078, 148164, 125602, 133544, 144496, 153044, 150731, 132616, 155519, 160575, 153631, 156224, 161992, 132869, 105186, 125132, 134942, 111109, 113389, 127156, 112594, 118857, 114561, 104603, 123039, 130720, 124334, 119692, 104153, 109337, 119115, 134953, 156763, 163134, 167984, 184567, 183784, 185446, 196419, 214233, 211638, 200994, 232269, 251529, 280157, 303666, 285041, 287201, 301111, 291395, 261233, 284482, 268612, 271703, 273216, 270772, 293267, 325731, 326346, 290006, 287764, 291298, 298621, 300967, 311100, 295524, 280517, 312991, 307895, 301214, 305517, 276850, 225503, 226206, 245752, 265905, 261748, 256565, 290090, 326961, 353156, 358280, 352643, 348712, 347695, 330252, 317413, 295674, 286341, 304681, 319887, 297771, 298291, 279721, 256705, 236548, 263480, 289000, 293011, 294110, 283550]
19874B83550R493K1967p109j0958m629l3165k7686m66K3279J652l394k2196q329
19861B22009M1156J2320M037J9526j1794j4897J7035J9946k51O241J8858J0168
19849C44354J7070K6979Q146j4855J0154L795K7843Q484j1193L740J0837k3462
19837D11892l1866J02P747k0182q937R324M8933j0194j0581M0551N013k9178l8797
19824C73827l3205J0549L1533l280m6374k8514J2860O738O055k4755l605K1992
19812C23821j4278j2795R452j0673O887k0332J2870L6031J547J5217r272o614
19800C31861J0254K4522J0923J7928L0514L889j7805K1225M567n444j7035J8743
19788D34142n866m2033J5032K7054N7979J3635J0257Q056L4546J3150p577K3562
$$ y = [283550, 293043, 315010, 307901, 296943, 292314, 259149, 231463, 230997, 254276, 255928, 252534, 230338, 222009, 263165, 275485, 279522, 299048, 287254, 272357, 289392, 309338, 309087, 315328, 334186, 344354, 361424, 388403, 396549, 381694, 391848, 395643, 423486, 431970, 420777, 424517, 435354, 411892, 380026, 380128, 387875, 367693, 358756, 368080, 417013, 406819, 396238, 436789, 441802, 412624, 373827, 340622, 351171, 382704, 379424, 333050, 304536, 317396, 324134, 330189, 305434, 301829, 323821, 309543, 296748, 306200, 295527, 302414, 282082, 294952, 330983, 332530, 347747, 338475, 331861, 342115, 366637, 377560, 395488, 426002, 429891, 412086, 433311, 437878, 432434, 415399, 434142, 428276, 386243, 401275, 428329, 486308, 499943, 510200, 518256, 552802, 565952, 558375, 581937]
19776E81937K3866L5825P1082L9290J9375M3292L4755L2715N0297P9257M2233
19765A053924J7224K4970N1355M074j7663l0557m9304p241n831j3073r058j4850
19753A003970l4953j1787K1207K401m8172j8746n737j3649l8419m6651k6052k4503
19741G58909l6909k3179o515j2283K1514j8854j4829R252J40J1202K5340L2131
19729G45919J2842J8039M8328N2241M7685N8691O9262R0729P8250R709M7584R1401
19717A370680Q3183L6815K1154L4393M1674j165m3044K2740J4610K558r7L8980
19705A622481L117o5932j9916n7301j07703j26526j02010o3721k2506q68K3083
19694A082198M9142L4062L7371K759J1773K3865L8059J2650j6714j5794J4426
$$ y = [581937, 605803, 641628, 712710, 752000, 771375, 814667, 849422, 882137, 932434, 1011691, 1053924, 1071148, 1096118, 1147473, 1151547, 1133884, 1103327, 1054023, 1046782, 1040951, 1027878, 1018820, 1003970, 969017, 957230, 978437, 980838, 932666, 913920, 908183, 894534, 856115, 809464, 783412, 758909, 722000, 698821, 692306, 680023, 701537, 682683, 667854, 677106, 677246, 688448, 713788, 745919, 758761, 776800, 825128, 877369, 925054, 983745, 1053007, 1143736, 1221986, 1231695, 1279279, 1370680, 1453863, 1490678, 1511832, 1546225, 1587899, 1586734, 1543690, 1566430, 1581040, 1583598, 1583501, 1622481, 1625598, 1559666, 1539750, 1482449, 1374746, 1248220, 1146210, 1082489, 1059983, 1059115, 1082198, 1131340, 1165402, 1202773, 1205532, 1217305, 1241170, 1279229, 1291879, 1275165, 1259371, 1273797]
19683A273797J9266M4691O9022P7155N9497Q1326J12841J50801J58761Q9432Q8852
19672B225441J51153J66229J54243J71631K40614K00517J63242K05381K53472
19663C931923K35871J82386K14718K46703J83459J76829J50279J22048O1026R9029
19653E604271K50923L49119L75871M17548N49082O06977O40740P27352O82499
19644A0204382N51845N80926Q63106J321846J811477K434633K776454K487116
19636B3031785K592701L727826N686458N889866L486905K732282M787460R309011
19628F1244294J3356109J5987660J8050474J5872852J6396239K4227211L7276825
19621B02411664M0126790J6026324J480721Q217726K1903759J8902737j0111769
$$ y = [1273797, 1293063, 1337754, 1406776, 1483931, 1543428, 1624754, 1737595, 1888396, 2047157, 2136589, 2225441, 2376594, 2542823, 2697066, 2868697, 3109311, 3309828, 3473070, 3678451, 3931923, 4167794, 4350180, 4564898, 4811601, 4995060, 5171889, 5322168, 5444216, 5505242, 5604271, 5855194, 6204313, 6580184, 6997732, 7546814, 8153791, 8794531, 9521883, 10204382, 10756227, 11337153, 12200259, 13522105, 15333582, 17768215, 20544669, 23031785, 25624486, 29352312, 35038770, 40928636, 44415541, 47147823, 51935283, 61244294, 74600403, 90588063, 108638537, 124511389, 140907628, 165134839, 202411664, 242538454, 258564778, 260045499, 268263225, 290166984, 309069721, 298957952]
19614B98957952k4536039j8443090j1364339j5004532k2314229k0479101j4607296
19607A72209326j6238340j8813550j6131796q786475n151822j0333704j4108918
19600H2644721j2992248q817983o125646o572277p050372o319306m613821k860243
19592B7292825j711753r65113k94651L39521Q64013J395302K327224M004687O143610
19583C9395665P744803P376579O573668Q316809J2928512J6443618J1622965N542483
19575A15945102O822911J5059593K2746188J9493674J5334227K0722524K9168119
19568B45292338L1003686K2707392J9503128L1490450K7039634J690475j6651387
19561C62075716j7950463j280396p327933l3739803m5505479m1512175k6897837
$$ y = [298957952, 274421913, 255978823, 244614484, 229609952, 207295723, 186816622, 172209326, 155970986, 137157436, 121025640, 112239165, 107087343, 96753639, 82644721, 69652473, 60834490, 54708844, 48136567, 41086195, 34766889, 30153068, 27292825, 25581072, 24615959, 24321308, 24660829, 25524842, 26920144, 29247368, 33252055, 39395665, 47140468, 54517047, 61090715, 69407524, 82336036, 98779654, 110402619, 115945102, 122768013, 137827606, 160573794, 180067468, 195401695, 216124219, 245292338, 276296024, 299003416, 318506544, 349996994, 377036628, 378727103, 362075716, 344125253, 342844857, 335516924, 301777121, 256271642, 214759467, 187861630]
19554A87861630k0070976k1121005k3141621k2782018j7415209j0259393m676613
19547F8394795n269505q312782q660856o762989m447083m044749m340577m088663
19539B2467591l458120k678010k018074j449260j118934j069686j037029r58997
19531H679481q04117o88215o39945n65094m92158m31951l73745k84281k81017
19522D118958k51518k36290k41917j71118j71091j23216j33423j42012j38175
19513B510198r3043q9337o8821r1126p7352n1261l4623o3824j01944j04631m6632
19502A687604j3154l8310n9759k7602l9873m0735l7110j3057K5975J809o422k7346
19490A412020k1130k1274P906k0506k4168J374K0351J2466N456K8593K8186J2508
$$ y = [187861630, 167790654, 146669649, 123528028, 100746010, 83330801, 73071408, 68394795, 63125290, 54812508, 46151652, 39388663, 34941580, 30896831, 26556254, 22467591, 19009471, 16331461, 14313387, 12864127, 11745193, 10675507, 9638478, 8679481, 7875364, 7187149, 6547204, 5982110, 5489952, 5058001, 4684256, 4399975, 4118958, 3867440, 3631150, 3389233, 3218115, 3047024, 2923808, 2790385, 2648373, 2510198, 2417155, 2327818, 2258997, 2167871, 2090519, 2039258, 2004635, 1940811, 1838867, 1734236, 1687604, 1674450, 1636140, 1576381, 1548779, 1508906, 1468171, 1431061, 1418004, 1443979, 1445788, 1439366, 1412020, 1390890, 1369616, 1377522, 1357016, 1332848, 1334222, 1354573, 1367039, 1372495, 1401088, 1429274, 1441782]
19478A441782N363l1661o4578k3501j3160k091j1233n3131l3831j5008m8700n9182
19466A091069l0202k6456r683k2110k2115k2260r093k8460n5005Q726N134j1783
19454H67762P718j5872k9246r228m968j0433J0414q175j9646k1283L833J4123
19442G84999J7740J1273J6565p087n304l8020k0562k8106M185m398M7056L5669
19430H14010L0536M8655N4997L7300J4624K8816K1950L1871J9091l0562k1006
19419A050282k3096k9862l8112m5276o7780n4838k2699l206l1226j8825j9415
19408F95947K3449P755k2924j2119K5057K0374k1334m4921L487J3469j1091l1567
19396F45582l4370r580O522j910j8902k4697m9484l2827K3255M493m9461k9592
$$ y = [1441782, 1447145, 1415484, 1350906, 1327405, 1314245, 1312154, 1300921, 1247790, 1213959, 1198951, 1150251, 1091069, 1060867, 1034411, 1024728, 1002618, 980503, 958243, 949150, 920690, 865685, 874411, 879545, 867762, 875480, 859608, 830362, 821134, 816166, 805733, 816147, 807972, 788326, 767043, 770876, 784999, 802739, 814012, 830577, 823490, 818186, 780166, 759604, 731498, 735683, 731285, 778341, 814010, 844546, 893201, 948198, 985498, 1000122, 1028938, 1050888, 1082759, 1101850, 1071288, 1050282, 1027186, 997324, 959212, 913936, 846156, 791318, 768619, 765413, 734187, 715362, 695947, 719396, 727151, 704227, 692108, 717165, 737539, 716205, 671284, 674771, 688240, 677149, 645582, 611212, 601632, 608154, 606244, 587342, 562645, 513161, 480334, 503589, 508082, 458621, 429029]
19384D29029O331L55l166N084K2906J1248L485J1675p360l0932J0811M367M793
19371D68626j3306r9K3350M456k8145m1922j3071l4302l9096K6561J4963j793
19359C66222M039K1665K3629L9815L7181K9264J7122K7462L0930L4305J5272K5254
19347F72160L5039R066J3790K2839K666L7720l858k72J8519L3751n425l8925J911
19334G98981K1723j4076j6925k2686k1129k3997n4725m5417q23j726j8411p544
19322E93245L1063J5417j0261k6330j1646J199l9233m3841m2688m8123n5154j9533
19310C44115j7948j7754r885L0967K9529M6834P1720O6136N3331P0810N5276O7925
19298G91056M6216M6952L4422O1058N6869J617L1016N2122R799j4478K0132J4983
$$ y = [429029, 435360, 435715, 432549, 437633, 460539, 471787, 475272, 486947, 479587, 448655, 459466, 463833, 468626, 455320, 455221, 478571, 483027, 454882, 412960, 399889, 365587, 326491, 353052, 368015, 366222, 370261, 391926, 415555, 455370, 492551, 521815, 538937, 566399, 597329, 631634, 646906, 672160, 707199, 716265, 730055, 752894, 755560, 793280, 789422, 789150, 807669, 841420, 835995, 797070, 798981, 820704, 806628, 789703, 767017, 745888, 721891, 667166, 621749, 620926, 619200, 600789, 593245, 624308, 639725, 629464, 603134, 591488, 592687, 553454, 509613, 466925, 418802, 363648, 344115, 326167, 308413, 298528, 329495, 359024, 405858, 477578, 543714, 597045, 667855, 723131, 791056, 837272, 884224, 918646, 979704, 1036573, 1038190, 1069206, 1121328, 1131127, 1116649, 1136781, 1151764]
19286A151764J2831k462l5710j4446K291l3205k6268j5263l4750n0848o5287l2845
19274H55802k8408m5138j4127k8180J4869P975j3699O452j637k019L1383N897
19262G89170K0281j381l4169m8094m7011p217q582M1088l7l7234k675R822N7339
19249G31300L8030L5335L9385J6467N1857N4023K4129J4576M9723N2078K8838
19238A135741L6964L2799R043K2138j506J9950N4956Q0689P1556P0628R3037P1468
19226A697463R1895O0100O2818O1012J3377M4377O6753P6858J01547J02079J26339
19215B504618J21979J68148J58114J31924J66656K05877K45097K60222K65354
19206D227989L37482M09333M70529N85590O91471P39596O84126P18647Q08828
$$ y = [1151764, 1164595, 1162133, 1126423, 1111977, 1114268, 1081063, 1054795, 1039532, 1004782, 953934, 888647, 855802, 827394, 782256, 768129, 739949, 754818, 762793, 749094, 755546, 753909, 751890, 783273, 789170, 809451, 808070, 773901, 725807, 678796, 671579, 662997, 704085, 704048, 666814, 664139, 673961, 731300, 769330, 804665, 844050, 860517, 912374, 966397, 990526, 1005102, 1054825, 1106903, 1135741, 1172705, 1205504, 1214547, 1236685, 1235179, 1255129, 1310085, 1390774, 1462330, 1532958, 1625995, 1697463, 1789358, 1849458, 1912276, 1973288, 1986665, 2031042, 2097795, 2174653, 2276200, 2378279, 2504618, 2626597, 2794745, 2952859, 3084783, 3251439, 3457316, 3702413, 3962635, 4227989, 4565471, 4974804, 5445333, 6030923, 6722394, 7461990, 8146116, 8864763, 9673591]
19197I673591P87908O89873P06622R18870J163945J528380K207876L324964M613128
19188B5615157N093148M879791N758016Q165042R278378O117596M447290O702551
19180G6056969J1166307J3400885J7452610K5329895K8141872K7452406L6118758
19173B35119702N3026053N1202945K1219033J1362499K1306897K1156740j1705227
19166D02688642l3630957l0390659k4951471l1440560l7949359l3065276k1104963
19159A90155397j2833039j4746279j6750233j2334525o024804p695899j4129442
19152A05641176j5752326j3339099j0770599j0225928r496371p722882n377310
19145C2956661l369413k060640j414515q63833k46687J28337K70644O08806J375338
$$ y = [9673591, 10461499, 11151372, 11857994, 12776864, 13940809, 15469189, 17677065, 21002029, 25615157, 30708305, 35588096, 41346112, 49511154, 58789532, 64907128, 69354418, 76056969, 87223276, 100624161, 118076771, 143406666, 171548538, 199000944, 235119702, 288145755, 339348700, 360567733, 371930232, 393237129, 414393869, 402688642, 369057685, 338667026, 313715555, 282274995, 244325636, 211260360, 190155397, 177322358, 162576079, 145825846, 133491321, 127466517, 119770618, 105641176, 89888850, 76549751, 65779152, 55553224, 46056853, 38333971, 32956661, 29587248, 27526608, 26112093, 25248260, 25001573, 25129910, 25400554, 26009360, 27384698]
19136B7384698K529982M110845O296771Q120780P999237Q202047J1335476J5361492
19128I1341328J2679470O525739O870325J3142254J6261477J1076671J0273357
19121A68170621J9638787L0755829K5261560J3552204J8189712L3711851K1461510
19114C30742074r765385k0191043r142095q696502l1507831m1275270l6133113
19107A74030835k6567272k4156824k2070459j6595001j1481498r239307p134424
19100E6786050m399507k864365m634815n932188n622003m516833l989038l791535
19092B1035766l326302k588533j867106j401876j011538p11109o61199p01042
19084H767061o60276n19041m90512n19573m69538l83923k72596k07649j23102
$$ y = [27384698, 29914680, 34025525, 40322296, 48443076, 56442313, 64644360, 75979836, 91341328, 104020798, 110546537, 117416862, 130559116, 146820593, 157897264, 168170621, 187809408, 218565237, 243826797, 257379001, 275568713, 309280564, 330742074, 320976689, 300785646, 291643551, 282947049, 251439218, 210163948, 174030835, 147463563, 123306739, 101236280, 84641279, 73159781, 63920474, 56786050, 52386543, 49522178, 44887363, 38955175, 33333172, 28816339, 24827301, 21035766, 17709464, 15120931, 13253825, 11851949, 10840411, 10129302, 9468103, 8767061, 8106785, 7587744, 7097232, 6577659, 6108121, 5724198, 5451602, 5243953, 5120851]
19075E120851n7830l6609p9432j40718j35624r0757n7846j15896j59082j13160
19065D133897J7613K0915l4813m8488k097q3121j17292j07955q9174j25679j88195
19054C375611j82067j62138j07966r5156j01283j23514j54476j24700j05343j07617
19044B111351j40153j37574j29033j04539q7492p5248n3491j3725q177k2984j5838
19033A323097K8787N0713N0202M4703Q2275M7540j8584j90n58P241q435k8460
19021A578331L3631M8505j0047j3659M5017N6335M1280K8228n52k5290l8346m6418
19009A697015j4469j9455J411L0614N6588J4893n0616j5166M0724N9285j7299
18998A783525j36539j17686p0264j08149j37008j19754j10026q8728q5125o5709
$$ y = [5120851, 5063021, 5026412, 4946980, 4806262, 4670638, 4579881, 4522035, 4406139, 4247057, 4133897, 4151510, 4172425, 4137612, 4089124, 4087027, 4003906, 3886614, 3778659, 3689485, 3563806, 3375611, 3193544, 3031406, 2923440, 2828284, 2727001, 2603487, 2449011, 2324311, 2218968, 2111351, 1971198, 1833624, 1704591, 1600052, 1512560, 1437312, 1383821, 1370096, 1361919, 1338935, 1323097, 1351884, 1402597, 1452799, 1497502, 1579777, 1627317, 1608733, 1608543, 1607985, 1615226, 1606791, 1578331, 1611962, 1660467, 1650420, 1636761, 1681778, 1738113, 1779393, 1807621, 1807069, 1781779, 1743433, 1697015, 1682546, 1663091, 1664502, 1695116, 1751704, 1766597, 1715981, 1700815, 1741539, 1800824, 1783525, 1646986, 1529300, 1459036, 1350887, 1213879, 1094125, 984099, 895371, 810246, 744537]
18988G44537n1614l5708k8636k0299J3800K3007l363J9312M3307J6773J9713N4718
18976G95547K9223J3665M702j59m376k9249o7236j3816r801m9802l7246k3652
18964F07800l1507l8224j8845O789M866j0415K4975J8792P147M063j290J079k597
18951E72633j2004j856p878O887k7265l6794k3654l9596p4301n7712k2025l5464
18939B40971m2443j5071k3166O233j5703J0209L0981k7980j8502m816J2126J4314
18927A67153K2975J3922L3644q358l5824j9206J5143J4255j5105q942K0444k2408
18915A77693l5151o156j4396K3176O853k5708J1752J3829p893k4194K339j3994
18903A08150K2494M0624M855L668j2538k2459J6603J1661p725r65L2868R462l2351
$$ y = [744537, 692923, 657215, 628579, 608280, 622080, 645087, 641724, 661036, 704343, 721116, 740829, 795547, 824770, 838435, 843137, 842978, 838602, 809353, 742117, 728301, 718500, 668698, 631452, 607800, 576293, 538069, 519224, 526013, 530879, 520464, 545439, 564231, 571378, 575441, 574151, 575230, 572633, 560629, 558773, 550895, 557782, 530517, 493723, 470069, 430473, 356172, 298460, 276435, 240971, 198528, 183457, 160291, 166524, 150821, 161030, 192011, 164031, 145529, 140713, 152839, 167153, 190128, 204050, 237694, 229336, 193512, 174306, 189449, 203704, 188599, 179657, 200101, 177693, 142542, 136386, 121990, 145166, 152019, 126311, 138063, 151892, 143999, 119805, 122144, 108150, 130644, 171268, 176123, 179791, 167253, 144794, 161397, 173058, 165333, 164368, 197236, 206698, 174347]
18890A74347k977L9363O537k5675j7139q69j8804J6388K0584J196j1625R782j0461
18877A80647l7123J1502R882J9914J3142l197J982q754M626J5235L2523j4730
18865B25649l789J4654J9386N0607N5522J14839J46139J27689O4093m6982j06459
18854F61348j42936j03819p9207m6384m7610m5123l6311l3725J9106K526K7022
18843A74887K1367j5435K0712J6630j0984l6489j6326J4672k3967j8119N851m04
18831A32395R002J8280K0850p323k1617j6737K4556L0727j6290l0447j546P911
18819A49761j9796q671J2377K2127Q509J0117k596j5139j0929k3477q305J3592
18807A27570l0602k8478q705J94r12K6129J932k5919j2850J034J0389J5354k1993
$$ y = [174347, 171370, 210733, 217270, 191595, 174456, 173587, 154783, 171171, 191755, 192951, 181326, 191108, 180647, 143524, 155026, 164908, 184822, 197964, 194767, 196749, 187995, 192621, 207856, 240379, 225649, 221860, 236514, 255900, 306507, 362029, 476868, 623007, 750696, 814789, 767807, 661348, 518412, 414593, 335386, 289002, 241392, 196269, 159958, 126233, 145339, 147865, 174887, 196254, 180819, 201531, 218161, 207177, 170688, 154362, 169034, 145067, 126948, 132799, 132395, 141397, 159677, 180527, 173204, 151587, 134850, 159406, 190133, 173843, 143396, 141850, 149761, 129965, 121294, 133671, 155798, 164307, 174424, 171828, 156689, 145760, 122283, 113978, 127570, 96968, 68490, 59785, 59979, 59067, 85196, 87128, 61209, 48359, 49393, 59782, 75136, 53143]
18794E3143p4N7000J8086k4985j3378k329Q301j999j2114r078j4154j603j4973
18781D1843K2978K612J0304O044M605m354Q02K6986K3959J8074j2022k7591K3978
18768A38218R1689P3932P2238n7886r6766p7314n7779r549n889J6111J3075k6712
18756G3368r543K6629K4112j2706N941P827K0178Q966k9411j6859L762j1601k396
18743H8267L3237j759k6036o813j6702l0541K449J0911L2274o322j9564R413k0138
18730D8676j2963J4288N379K1212K0830K3637L9428M4440O124k3186j2596P495
18718A82764j0701k0939l7743n34m04M168o646k3667n327j962l134r436L1902
18705I8341m496L490L6804J1824J396J8618J3131M811J2043j2174m9141J3650
$$ y = [53143, 53069, 110069, 128155, 103170, 89792, 87463, 95764, 93765, 81651, 72573, 58419, 56816, 41843, 64821, 67433, 77737, 83781, 88386, 84032, 84834, 111820, 135779, 153853, 141831, 114240, 138218, 229907, 303839, 376077, 318191, 221425, 144111, 86332, 76783, 70894, 87005, 100080, 73368, 63825, 90454, 114566, 101860, 107801, 115628, 135806, 144772, 115361, 98502, 102264, 90663, 88267, 121504, 119745, 93709, 86896, 70194, 39653, 42102, 53013, 85287, 78965, 59401, 68814, 48676, 35713, 50001, 55380, 76592, 97422, 121059, 160487, 204927, 211051, 187865, 175269, 182764, 172063, 151124, 113381, 112847, 112443, 116611, 109965, 86298, 80971, 79009, 75875, 66439, 98341, 93845, 97335, 134139, 145963, 147359, 165977, 179108, 183919, 195962, 183788, 134647, 148297]
18693A48297J3626J9655j2755j8804k0839l1016J458k9099j1902L31J2124K7715
18681I8791L4238k9171l3581j175M218N249j3771j1291P565L1526L9600L906k7301
18668A08803j2860L4832L013k3576o870J4518r78o463n236j2279J8176J6533O033
18655A33646J6718M8826M9723N4878P0863O8016M1193P0534R2195P5474J09464
18644H31530J45765J27367R5826R0752J26840J48044R9282J01782N7696K2416
18634A847300K84L7562O2663j6589r0666j09540o5429p4262j45937j57364j54334
18623A133688j66086j11183r4763q1206n7351k4854l4833l3359l904L354k0968
18612E08535k2404m5970k6151k3321l3537o510L1767J1121n564k362K9867L2761
$$ y = [148297, 161923, 181578, 168823, 150019, 129180, 98164, 99622, 70523, 58621, 58952, 71076, 98791, 133029, 103858, 70277, 69102, 73320, 78569, 64798, 53507, 61072, 92598, 132198, 136104, 108803, 95943, 130775, 133788, 110212, 103342, 117860, 116882, 110419, 105183, 92904, 111080, 127613, 133646, 150364, 199190, 248913, 303791, 374654, 442670, 483863, 554397, 646592, 722066, 831530, 977295, 1104662, 1200488, 1291240, 1418080, 1566124, 1665406, 1767188, 1824884, 1847300, 1847584, 1885146, 1947809, 1931220, 1840554, 1731014, 1665585, 1591323, 1445386, 1288022, 1133688, 967602, 856419, 761656, 680450, 623099, 598245, 563412, 530053, 526149, 529503, 508535, 486131, 440161, 414010, 390689, 357152, 350642, 382409, 393530, 387966, 385604, 415471, 448232]
18600D48232M3406N8476N2693L3727M2430O8085J38749J36167J09217J27021R6558
18589A354761J24532J54599Q8711L1996J4803K9395j8992m6230q7132r1948n9479
18578A495016l4893n7954J308L6138L3182j7286o6153p2962n6108r8227j24981
18567A037080j27204j38682j35178r6347p9292p9520l7004k5313j6159k8213q115
18556B66053m2720k7518m0649l0762k5567m955r176k9269k995L09k2846J310J0214
18543D1429k432Q224J0470J6877Q160q87k5985K4131K3980N064j6457R419K5176
18530A27169j0534l5662j4290m51j7068k0020M730o608J669J0185P477J3381k0686
18517C9292q330J6918L2962K5530l119J0180j4141k171K1408o424k4782l9074
$$ y = [448232, 491638, 550114, 602807, 636534, 678964, 747049, 885798, 1021965, 1131182, 1258203, 1354761, 1479293, 1633892, 1722603, 1754599, 1769402, 1798797, 1779805, 1733575, 1646443, 1554495, 1495016, 1460123, 1402169, 1403477, 1439615, 1472797, 1455511, 1389358, 1316396, 1260288, 1162061, 1037080, 909876, 771194, 636016, 539669, 460377, 380857, 343853, 318540, 302381, 274168, 266053, 223333, 195815, 155166, 124404, 98837, 93882, 84706, 55437, 52442, 52751, 29905, 31215, 41429, 38997, 47221, 57691, 74568, 82728, 81841, 55856, 79987, 103967, 109031, 92574, 101993, 127169, 116635, 80973, 66683, 66232, 49164, 29144, 33874, 27266, 28935, 39120, 46597, 59978, 39292, 30962, 47880, 80842, 106372, 103253, 113433, 99292, 97121, 118529, 112105, 87323, 48249]
18505D8249j2515N1757K636j3809L610P379j7895k8585m112j0728j2911k1896
18493h820K3894J8697K3985M537k3970l4197j7595q170R661J7475R739J2715L5191
18480F3142k801K260j4708j4773j7566L5871J0298J578l266n87K2103m138O448
18467H3861J9402j0023n467k2361k385K7319L0807r86k1867k480L5936K3571J7332
18454A72659j794o711O180p410m3359k1595L412k7635k3811r941K6198N643j4326
18441E7510O009M7477Nl1557j1286q461K925j3358J5736l01q022O713K6618j3321
18427G6687L2748K5048L3185L3153K9054J4878L9995M1313J1790M163L3377L1474
18415D06865M0811K8957l9913p0741k3786k4008k9153j4717O306j828l7933q986
$$ y = [48249, 35734, 87491, 90127, 76318, 79928, 87307, 69412, 40827, 36715, 25987, 13076, -8820, 15074, 33771, 57756, 62293, 38323, 4126, -13469, -21639, -11978, 5497, 15236, 27951, 63142, 60341, 62601, 47893, 33120, 15554, 51425, 61723, 63301, 60035, 59448, 81551, 77413, 83861, 103263, 93240, 87773, 65412, 63027, 90346, 121153, 120167, 98300, 95820, 131756, 155327, 172659, 170865, 164154, 170334, 162924, 119565, 97970, 101382, 73747, 49936, 39995, 66193, 71836, 57510, 63519, 110996, 111001, 79444, 68158, 59697, 62622, 49264, 65000, 64699, 56677, 63390, 90008, 76687, 109435, 134483, 167668, 200821, 229875, 244753, 284748, 326061, 337851, 342014, 375391, 406865, 447676, 476633, 436720, 365979, 342193, 318185, 289032, 274315, 280621, 278793, 240860, 231874]
18403B31874k5285l2444j6426j5989j0427J8277k6478m2280K724J6646k8686o074
18391F5432J0359j6025r985o507K1873K2021Q314k6887m565K4213L375J6242J9637
18378A27497J6615K6868k453J6157K348K755K2393p381j2263n50K8838N1926J6123
18365B88873J1589n570m2019m1355j9136P826n97k1309k6451l7041k7186j9301
18353F8323q810o861L153N794o8j2113r309j1036j7776k954K1730O078K2161K465
18339F0777l2449p102r029J7598n651j762K5453q597m3317l1225L1500N212K0604
18326B2012Q599k2177j3380J360K7042M1964j8655k5447m887M536K3497j8929
18314B5535K0841J3656K061L551J4904j6097m9499j5793J710J6348l209L987k2773
$$ y = [231874, 206589, 174145, 157719, 141730, 131303, 149580, 123102, 80822, 83546, 100192, 71506, 65432, 75791, 59766, 49781, 43274, 65147, 87168, 95482, 68595, 64030, 88243, 91618, 107860, 127497, 144112, 170980, 168527, 184684, 187032, 189787, 212180, 204799, 192536, 191986, 220824, 272750, 288873, 300462, 294892, 252873, 211518, 192382, 200208, 199611, 178302, 151851, 114810, 87624, 68323, 59513, 52652, 55805, 61599, 61531, 49418, 40109, 29073, 11297, 8343, 30073, 36151, 58312, 60777, 28328, 21226, 12197, 29795, 24144, 22382, 47835, 39238, -4079, -35304, -3804, 1408, 22012, 30611, 8434, -4946, -3586, 23456, 65420, 46765, 21318, 16431, 20967, 44464, 25535, 46376, 60032, 62093, 65644, 80548, 64451, 14952, -841, 869, 17217, 14008, 17995, -4778]
18301d778j0471J0196N244J5357N147k5419J58j2167J2137J4505K902J842q040
18288F613K024K1291M353K241k193m682j6188l2677k6318j1001K080K9515k893
18275b7835j3483j4967j2585K0549n40k6075R800K4462K7142j0124m573K4930
18263c299N061p593J8058j0994M649P411J2429l0196o399J6082K776N714J3471
18250B7170l3180j4837p576m875J6415q971j3016J7322L147J0272O011J2899J0387
18237B1168k118Q644j03j582q510r730O669k788K4073O121K859l3752l700J5353
18223B2604k421j8910k3066j1896k198k3284L984n332L5560M5438J7592j4136
18211B3935n019K5536j5854k5057k915l0680N811K6328R079P926l99l667J2344
$$ y = [-4778, -15249, -5053, 191, 15548, 20695, -4724, -4566, -16733, -4596, 9909, 12811, 14653, 6613, 8637, 29928, 34281, 36522, 34329, 29647, 13459, -19218, -45536, -56537, -54457, -24942, -27835, -41318, -56285, -68870, -48321, -48861, -74936, -65136, -40674, -13532, -23656, -28229, -3299, 1762, -5831, 12227, 1233, 5882, 13293, 25722, -4474, -10873, 5209, 7985, 13699, 27170, -6010, -20847, -28423, -33298, -16883, -25854, -38870, -21548, -18401, -8129, -2118, 10781, 21168, 19050, 27694, 27591, 26009, 17499, 7769, 14438, 11650, 35723, 41844, 44703, 10951, 7251, 22604, 20183, 1273, -21793, -33689, -35887, -59171, -55187, -60519, -24959, 20479, 38071, 23935, 18916, 44452, 28598, 3541, 626, -30054, -24243, 2085, 11164, 19090, 18691, 15024, 27368]
18198B7368k317j7326q387J1742J9971K89p049j631R429M360k0893j8308K0268
18185A7516N588j9787n073M533J7937L123j4109J01J3385Q01r90K3118K5413o379
18171F5177l0407j2266J0529J2053j2031j9062l0597J3938L4493K1137K1807J092
18159G5863P365J985j3797J3774J462m428l7649l0545p514M5217L4286J8150k6098
18146G8071J629N4122L3439k0174n192K9690J0830j2557K4377K0581q033k5050
18134A81733L6227N1732J3696L2392Q63K3427L9378K5638M7504M3625P7391N1567
18122F25173Q2561R3520J75691K27536K96458L44250M24222O24766Q69805J310071
18112E074053K136150L766780O834142J3464839K0875290M444170j2262462j5830329
$$ y = [27368, 25051, 7725, -662, 11080, 31051, 31340, 24291, 22660, 32089, 36449, 15556, -2752, 17516, 23104, 3317, -1756, 2777, 20714, 23837, 9728, 9829, 23214, 24015, 23025, 46143, 71556, 65177, 34770, 22504, 33033, 45086, 33055, 13993, -16604, -2666, 31827, 52964, 74771, 75863, 83228, 85213, 71416, 85190, 86652, 82224, 44575, 14030, 6516, 51733, 86019, 104169, 78071, 79700, 133822, 167261, 147087, 141895, 171585, 182415, 169858, 194235, 214816, 206783, 181733, 217960, 269692, 283388, 315780, 316643, 340070, 379448, 405086, 452590, 496215, 573606, 625173, 707734, 801254, 976945, 1204481, 1500939, 1845189, 2269411, 2894177, 3763982, 5074053, 7210203, 10976983, 17811125, 31275964, 52151254, 56595424, 44332962, 28502633]
18104B8502633j2264309o223272l271173j880140j111639p84910o03314m24605
18096A939271l14116k54470j81838j64775j56710j33755j10000p0117o4190m1762
18086D47538l3751p0592n3413l5316J109j535r359k5079l9519m9512p24K3562
18074A53409K0787K389l0745l1906l8680J6301l908j6435J0490J4443j1966L074
18062H7253Q371k3086m71o64R840J565J0051o997K8937Q535o1728k777J6800J7202
18048I2831N985j5050k2851j3523n288k2599k2714O55L434J1014K8008p522q878
18035B3502O248R434Q924k630j9458n803j868L998o3284j270K9624J1488L0235
18022B9140J9765j299j2525p899q764j3619p90l211P230l213m6101j6741K6167
$$ y = [28502633, 16238324, 10015052, 6743879, 4863739, 3752100, 2967190, 2363876, 1939271, 1625155, 1370685, 1188847, 1024072, 867362, 733607, 623607, 553490, 489300, 447538, 413787, 343195, 289782, 254466, 255575, 254040, 244681, 219602, 180083, 130571, 129847, 153409, 174196, 176585, 145840, 113934, 75254, 91555, 87647, 71212, 81702, 96145, 84179, 87253, 95624, 72538, 72067, 71403, 81243, 82808, 92859, 85862, 114799, 123334, 61606, 58829, 75629, 92831, 98816, 83766, 60915, 47392, 42104, 19505, -3209, -2554, 880, 11894, 39902, 32380, 23502, 29750, 39184, 48108, 45478, 26020, 20217, 18349, 22347, -40937, -42207, -12583, -1095, 29140, 48905, 47606, 35081, 27182, 18418, 4799, 4009, 798, 8028, 4815, -41286, -58027, -31860]
18009c1860J9370J7303m362m714R938j2564j2903K7778L0182k889k3198l7279
17997b5198K5490k745l2350J9037K1852k1837K5960K4084j00j3845J8138o668
17985C1818j6511k1728k0305M990J5564J1756N622l867k6274R575M4566k197p80
17972C2229L5415J3857J1229Q128J6954j985n64J3968j2250l7661m9616L830K7353
17959F0887Q305j0311l925J0186N202j0360j8283j9772j6284K136K2143K9282
17947E9206j6459k0761J537r293o106k7302k7096n304L0753K8811j4899j4893
17935b1806l653j7879J1759L1290J2404K1674P654l3540j2517J4446k237J540
17923I135J0897j0028L949k0555R953L8546K4017Q393q386O372L4037n341j8190
$$ y = [-31860, -12490, 4813, 451, -4263, 5675, -6889, -19792, 7986, 38168, 35279, 12081, -25198, 292, -2453, -34803, -15766, 6086, -15751, 10209, 34293, 34193, 20348, 38486, 31818, 15307, -6421, -26726, -21736, -6172, 5584, 11206, 7339, -18935, -9360, 35206, 33009, 32229, 67644, 81501, 92730, 100858, 117812, 115827, 115263, 129231, 116981, 79320, 29704, 33534, 60887, 69192, 58881, 54956, 65142, 70344, 59984, 41701, 21929, 5645, 7781, 29924, 59206, 42747, 21986, 23523, 14230, 8124, -19178, -46274, -51578, -20825, 7986, -6913, -21806, -25459, -43338, -31579, -289, 12115, 33789, 41443, 7903, -4614, 9832, 7595, 9135, 20032, 10004, 13953, -6602, 3351, 41897, 65914, 74307, 65921, 72293, 106330, 100989, 82799]
17910H2799k7198j5713N093J5161R13j1961q352J2605Q940M966k3344m0150P278
17897A1037L1510O911o395j660R763n913l1002l0228N659O079l758J7760K4036
17884C3799O709p018k7409j9452M384M871K2690l224l233k0942J352M8986j3929
17871B7584m2053J222K0051q893p403j5267m142L210j5438J2759K7765O974m524
17858A845n065K0393L1476j401J2679k7768m0353n836J5785q920N243p784o525
17845a6231J8751N682M572k7449J047J7335M263m492P059j2094j809J1944O839
17832A5417J3957r645J3332o673J3154q52O421M67q098M543N247l201J1209j7776
17818C7502k3997J4455k0558K876k3087p287J7561K7186J1109j9037K154j4459
$$ y = [82799, 55601, 39888, 44981, 60142, 61055, 49094, 40742, 53347, 62287, 67253, 43909, 3759, 11037, 42547, 49458, 43063, 41403, 51166, 45253, 14251, -15977, -10318, -4239, -7997, 9763, 33799, 40508, 33490, 6081, -13371, -8987, -4116, 18574, 15350, 12117, -8825, -7473, 41513, 27584, -14469, -13247, 6804, -2089, -9492, -24759, -28901, -25691, -41129, -28370, -605, 6369, 1845, -3220, 17173, 48649, 47248, 59927, 32159, -8194, -14030, 1755, -7165, -1922, -9706, -16231, 2520, 8202, 12774, -14675, -13628, 3707, 7970, 3478, 10537, -1557, -3366, 8578, 15417, 29374, 19729, 33061, 26388, 39542, 38690, 45111, 45578, 37480, 42023, 47270, 44069, 55278, 37502, 13505, 27960, 7402, 10278, -12809, -20096, -2535, 24651, 35760, 16723, 18877, 4418]
17806D418j7654J8383J1880k143J2178m622J741J0129J838j120M689j3104p017
17793A9596Q689J7021L5047J9246m5056m1101m227k7629l7314J6282K515M0513
17781C582j1538k6093R216L0273L5355r825K943J0062J0130K1523j9989l7178
17769A8461k609l1657j9277J4119L255J8123K0508j2275n530k2835m231p366J2
17756c1302j09K4949j433J7250k4736J283J7277q316K3431K741J43j3223j6452
17743h497j7984K0768P883j2072J036k531j8644M663K092P321j0646Q013j4426
17730c3024j3862Q130K401J3942J2266k0350J2401N40j1000j7005l838J2097r087
17717d6389K4336q642J0314M7231J5568j8251j5373n679j7596J416k841O921N469
$$ y = [4418, -13236, 5147, 17027, 14884, 27062, 22440, 24181, 34310, 36148, 35028, 39717, 26613, 19596, 28285, 45306, 80353, 99599, 54543, 13442, 9215, -18414, -55728, -39446, -36931, 3582, -7956, -34049, -24833, 5440, 40795, 30970, 33913, 43975, 54105, 75628, 55639, 18461, 15852, -15805, -35082, -20963, -17708, 415, 20923, 8648, 3118, -19717, -23948, -31314, -31302, -31411, -6462, -7895, 9355, -15381, -14098, 3179, -5137, 18294, 21035, 21178, 7955, -8497, -26481, -5713, 2170, -9902, -8866, -11397, -30041, -25378, -23286, -15965, -26611, -18598, -33024, -46886, -38756, -36355, -22413, -10147, -30497, -18096, -17556, -28556, -45561, -49399, -37302, -46389, -22053, -30695, -20381, 26850, 42418, 24167, 8794, 3115, -14481, -13065, -15906, -8985, -3516]
17704c516o629J3764R715j0846j9019k3133j882J8218L0804o38l6017j5309K7043
17691a7445j7252J6686J6132R111j5412P776O023p802r284m0142N884P658l117
17678d1184K5177M178J9357J3108j4891L025j282m702l946O520j415j6291J7051
17665D705j9611j8130p586K7025J5901q10N24l218o800O593l4570m0015J9669
17652e6323K1126j3915k663j110R802M4820m817j7161J1096L5953J3608N886k3119
17639B3183l5424k0221K1228K0886n370k9774R90J4788l464K1930L8667j6693
17627C0726j5997l0313k0388q179J7432j4865K5628J767O038M363q981j3803r899
17614c6471l1515K3369L1116k5706K1135K8343K331J5610L934R044l345N074O446
$$ y = [-3516, -10145, 3619, 13334, 2488, -16531, -39664, -41546, -23328, 7476, 6838, -29179, -44488, -17445, -34697, -18011, -1879, 7232, -8180, -404, 5619, -2183, -11467, -51609, -45725, -38067, -41184, -16007, -11829, 7528, 20636, 5745, 8770, 7488, 2786, -1160, 5360, 3945, -12346, 4705, -14906, -33036, -40622, -13597, 2304, 1494, 2018, -1200, -8000, -1407, -35977, -75992, -56323, -35197, -49112, -51775, -52885, -43083, 1737, -3080, -20241, -9145, 26808, 40416, 46302, 23183, -12241, -32462, -11234, 9652, 4282, -25492, -24502, -9714, -13178, 8752, 47419, 30726, 14729, -15584, -35972, -44151, -26719, -41584, -15956, -14189, -8151, -3788, -12769, -26572, -36471, -67986, -44617, -13501, -39207, -18072, 10271, 12602, 28212, 32146, 41190, 37845, 42919, 49365]
17601D9365l6121j7606l3657j9660L4559N4274P049l2775q029l141J3601l465
17589D394j3101k7388R599K4893K0131j7904m139M1229L6329R719r666j8415k7688
17576B7993P356J8053j7407p065K0721L1149m863k598L567q306j5374Q679K1956
17563H3861J082K4138O039N553n13k264j6462l9989l4135J0231L6098J5522q90
17550H8271p423j5590K280j7475j3156j6916M495j2238K291j5207j8661J3202
17538f127K8435M15k0950R952j6440k062K04K462M219Q255M416Q058K3838q069
17524C6606j8910M174J6271l82L0797J3277j2294j4015K1537K2280J1075Q600
17512A19016J6238j561k2631n4798K086R338m910k2119k8856q238J0153N973K877
$$ y = [49365, 13244, -4362, -38019, -57679, -23120, 31154, 38203, 5428, -2601, -5742, 7859, 4394, -8707, -36095, -26496, -1603, 18528, 624, -3515, 37714, 74043, 83762, 74096, 55681, 27993, 35349, 53402, 35995, 28930, 49651, 80800, 75937, 73339, 76906, 68600, 53226, 61905, 83861, 84943, 109081, 115120, 120673, 120160, 117896, 101434, 61445, 27310, 37541, 73639, 89161, 88271, 80848, 65258, 67538, 50063, 36907, 19991, 24486, 12248, 14539, -668, -19329, -6127, 22308, 22723, 1773, 11725, -4715, -6777, -6573, -4111, 108, 8363, 12779, 20837, 44675, 36606, 17696, 21870, 38141, 37759, 68556, 81833, 69539, 55524, 77061, 99341, 110416, 119016, 135254, 133693, 111062, 56264, 58350, 67688, 62778, 40659, 11803, 3565, 13718, 19691, 22568]
17499B2568Q551k4668j8059k2430p355Q937J0041L733M943J7970P447M58K289
17486A4425K1919j1792l3453k0676J7758L2359K0322j0989l4857j9137N161l677
17474b2637J2645O363k880L460j6416m401j286o928Q131P797J396L5274M299j2297
17460A2520q899j253J9343m998m973L908p04m192l6573j0693J8341L215J9038
17447D080L7385J7833J2565K1788M3219Q3719Q9198j3095j07602o6879m5973j2821
17435F3417k3593l6592p468j217j0778K2995j2359k7081r244k047J114L151J0195
17422b9507J9804J5969m48p113L83k4196k0977J4229P147M819j1928Q884J7753
17409e181Q917k8467n933K1292L2182P067l0577k0174j4951r60J2375k0217O280
$$ y = [22568, 31119, 6451, -11608, -34038, -41393, -32456, -22415, -18682, -13739, 4231, 11678, 12136, 14425, 36344, 24552, -8901, -29577, -11819, 20540, 40862, 29873, -4984, -24121, -18960, -22637, -9992, -3629, -6509, -3049, -19465, -23866, -25152, -32080, -23949, -16152, -14756, 20518, 24817, 12520, 3621, 2368, 21711, 16713, 11740, 15648, 14944, 10752, -25821, -36514, -18173, -14958, 4080, 41465, 59298, 71863, 93651, 136870, 220589, 309787, 296692, 189090, 122211, 76238, 63417, 39824, 3232, -4236, -5453, -16231, 6764, -5595, -32676, -41920, -43967, -42853, -39702, -29507, -9703, 6266, 5818, -1295, -912, -25108, -46085, -31856, -24709, -19890, -31818, -22934, -5181, 3736, -24731, -30664, -9372, 22810, 29877, -700, -20874, -35825, -36785, -24410, -44627, -38347]
17396c8347L1194L4213p845k8569j8558K953J3895R022q028j2710j2193j6685
17384e1658Q450J4988j4872l1325j1056J825L3555K4892o420k358j7813J3788
17372c8004K7673J4338j6818k1307k6204K4768N600K223J0158j1356k6015l023
17360e7967J1126Q769J0370O265k0064L3498j0302J9365j7486k4447J8874J0297
17348a1702j0540K853n604M454j3578j193J4439K498J7846J3975j654p103J372
17335F063P888j1197L06L172K10j3353M469j0355k3861j1516N954N069K4368K180
17321a0603l815k7004o548L9903j2209n473K538M557L3395N377k7261l3195O484
17308c3854J8851k0360J4471M675L405q780k0374J1967K2921k8749j1780j43l759
$$ y = [-38347, -7153, 27060, 19215, -9354, -27912, -24959, -11064, -2042, -10070, -22780, -34973, -51658, -43208, -28220, -43092, -74417, -85473, -83648, -50093, -25201, -31621, -33979, -51792, -38004, -10331, 4007, -12811, -34118, -60322, -35554, -29954, -27731, -17573, -28929, -54944, -57967, -46841, -38072, -27702, -21437, -41501, -8003, -18305, 1060, -16426, -40873, -21999, -11702, -22242, -19389, -24993, -20539, -34117, -35310, -20871, -18373, -527, 13448, 11794, 4691, 6063, 13951, 2754, 3060, 6232, 6442, -6911, -2442, -12797, -36658, -48174, -42220, -37151, -12783, -10603, -14418, -41422, -47970, -8067, -20276, -25749, -23211, -18654, 14741, 20118, -7143, -40338, -33854, -15003, -35363, -20892, -16217, -12812, -21592, -41966, -29999, -7078, -35827, -47607, -47750, -51509]
17295e1509J4636J9073K7999J499k509J8381q170k1641k2880q657L2323N93m6753
17282d7615j3169L9724J7342k1182r330N289K2850K1145R051j4458j2775J1592
17270H464K5343j6423j9330j0912k5741L773L8378J0088J2792J178o597k0511
17258E02J5084k1250l8201O351K6936J5150N874k7649k9306J0436J9026J1022
17246f025n492N432j0283J845K6574J9909o988k0266k5423j930M1029N915j2047
17233A2250k6487O431R18j6657j8547j7782K8542R383J529m106K9609J5448k1306
17220g75j8046j5239j3928R508J2664m131k0578J0453M898J775N400J2117J280
17207a4602k6445J6690M2649K3065K0552m1238j2283J9748j5249j4450o662Q076
$$ y = [-51509, -36873, -17800, 10199, 11698, 9189, 27570, 19400, -2241, -25121, -33778, -1455, -862, -47615, -60784, -21060, -3718, -24900, -34230, -28941, -6091, 15054, 24105, 9647, -3128, 8464, 33807, 17384, -1946, -12858, -38599, -34826, 3552, 13640, 26432, 27610, 21013, 502, 15586, -5664, -43865, -37514, -10578, 4572, 10446, -17203, -46509, -36073, -17047, -6025, -11517, -6085, -16368, -14523, 12051, 31960, 24972, 4706, -20717, -22647, 18382, 24297, 12250, -14237, -7806, -6888, -23545, -42092, -59874, -31332, -21949, -20420, -24526, 5083, 20531, -775, -18821, -34060, -47988, -38480, -25816, -29947, -50525, -40072, -35174, -33399, -27999, -15882, -14602, -41047, -24357, 18292, 41357, 61909, 20671, 8388, 28136, 12887, -1563, -8225, -149]
17195a49n756k917K3734j390n592r889l3330r331j1231J0821J2959K9180O393
17182C502R8Q182R170q279j0339O936J8884r437m0038J0928R249n192k0772J6069
17168a1039j7844l0994r840K5050M944J1351m297J2723J4988K2064J5054l2086
17156G4j9772R441P485j207k2662o567J6221l167K9646J346r678J0573j9422L035
17142d654k2771K2955L8689j656L602k1080o964O622n500Q237j803j2948L963
17129F692L71j3994l9805j1201K1268J5516k2287j0844K0430J6371J3510K388
17117a585k0q405j5536J7976J8181k212k9189J840J5566J0871J6526j0385k232
17104A1396m77R8M1346J8974k0326m1085k0328j6316L177m971m295K3200J3437
$$ y = [-149, -5905, -8822, 14912, 13522, 7930, -1959, -35289, -44620, -55851, -45030, -32071, -2891, 3502, 3600, 11782, 20952, 12673, 2334, 9270, 28154, 18717, -21321, -10393, -1144, -6336, -27108, -11039, -28883, -59877, -69717, -44667, -39723, -28372, -32669, -19946, -4958, 17106, 32160, 74, -19698, -10257, -2772, -3979, -26641, -33208, -16987, -20154, 9492, 10838, 1160, 11733, -7689, -4654, -27425, -4470, 34219, 32563, 36165, 15085, 8121, 14743, 9243, 17480, 15677, 2729, 6692, 7063, -6931, -46736, -57937, -36669, -21153, -43440, -54284, -33854, -17483, -3973, -1585, -1605, -10010, -25546, -7570, 10611, 8399, -20790, -18950, -3384, 7487, 24013, 13628, 11396, 10919, 11017, 52363, 71337, 51011, 9926, -10402, -26718, -23541, -28512, -32807, -9607, 3830]
17091C830R596J6692l937N6o51J1995k2037j8973J045L8619k6614j0311K6967
17078B6277P927k5186j1547j3024o439L951J662K609O536l4158k7493J9666J7076
17065c2143K4284K6032K8226k0897m6719j5195L194O559P366N979r65m828J6821
17052b286K9611J4065k2999k1766j6013k830K8089K2391p609j7702l0319J6031
17040a1337K091J2709J73j6119m261j746k484p059P404N949j2779o682J7336J1591
17026e214k6091o887L965J6651R421J6609j6683o823M061j0699k3146j1711J217
17013e5330l197m774L2873J2557L7230P968J2425j0607j6496j1608p525j0093
17001a6577r260j8009j9258Q182M2229J372m221J13M4028L2843m2746m4323j178
$$ y = [3830, 13426, 30118, 26181, 26237, 25586, 37581, 15544, -3429, -2384, 36235, 9621, -690, 26277, 34204, 9018, -2529, -15553, -21992, -18041, -16379, -13770, -7234, -41392, -68885, -49219, -32143, -7859, 18173, 46399, 25502, -21217, -36412, -33218, -26659, -19293, -13314, -14279, -19107, -2286, 27325, 41390, 18391, -3375, -19388, -22218, 5871, 28262, 20653, 2951, -27368, -11337, -9246, 3463, 3636, -12483, -16744, -18490, -20974, -28033, -20629, -14680, -27459, -34141, -16805, -5214, -31305, -38192, -34227, -17576, -8155, 8454, -8229, -15052, -10991, -21690, -44836, -56547, -55330, -58527, -63301, -30428, -17871, 19359, 27327, 39752, 29145, 12649, 1041, -6484, -16577, -25837, -43846, -63104, -54922, -12693, -11321, -15542, -15429, 28599, 61442, 18696, -25627, -26805]
16988b6805n628j9882q829j2731J0348K2580K9551J668J5792N594j6936k1228
16976b6506R675K2185k0693k2010J5393L3683j737k8776j3273k4003P793K3159
16964b5110j2365J192J7361K6034K0533o048l5631K0563l079j7509K5513J0756
16952B2210j5357j7000k0071N162P325j5984o571J6480J6981K0458j2419j8433
16940a7219k4788j3957Q55J1622K5033R578K849j8561n010L1419o273j7230k6410
16927d8092j1615Q338Q789R180K1343L3546J8936n556k34l258j6962j055Q079
16914B1439J940J341K13j1786j759j8735l1344J8068R567m876r30j342j8478M706
16900c1976M118M246o247R776K9193J3926J0903K3435j2789N971k4504j0447K660
$$ y = [-26805, -32433, -52315, -61144, -73875, -63527, -40947, -11396, -9728, 6064, 11658, -5278, -26506, -16831, 5354, -15339, -37349, -21956, 11727, 9990, -18786, -32059, -56062, -48269, -25110, -37475, -36283, -18922, 7112, 27645, 21597, -14034, 6529, 3450, -14059, 11454, 22210, 6853, -10147, -30218, -25056, -17731, -33715, -40286, -23806, -6825, 13633, 1214, -17219, -42007, -55964, -55109, -43487, -18454, -8876, -6027, -24588, -29598, 1821, -4452, -21682, -48092, -59707, -51369, -42580, -33400, -12057, 21489, 40425, 34869, 34635, 31377, 14415, 13360, 21439, 23379, 24720, 24933, 13147, 11388, -7347, -38691, -20623, -11056, -15932, -16862, -18204, -36682, -31976, -27858, -23612, -29859, -20083, 9110, 23036, 33939, 57374, 44585, 50556, 26052, 15605, 18265]
16887A8265j3333j0108l275k4545R978L4024L7697o684m3318l175N832j1115j8362
16874b8119j4352O847L1280J7551o561j0631M52L004p070k066J2867j9227j9151
16861c5176P658J5272L4548J3089k1164k9943j502j6242J792K8582J5908J8560
16849C1382J2147l0333k4429j2413j0194J2646K0932j3744M114K6447m978l939
16837G638J6550K3371l915l7836k5758J6596L545k3826k5189K876L0672J9296
16825D020J4457j359j7659j4508J9983q903J9389J1596j3836k8742j7090K1277
16813a1375k801k114K116J7955p665k0668j0860k449J5728J3656n50J7944Q467
16800A7384j3721j9737J0606L759o968J2600j602j6208J5458P18J2117J0617j3442
$$ y = [18265, 4932, -5176, -8451, -32996, -23018, 11006, 48703, 42019, -1299, -4474, 1358, -9757, -28119, -42471, -35624, -4344, 13207, 6646, -3985, -3533, -529, -7599, -9665, 3202, -16025, -35176, -27518, -12246, 22302, 35391, 14227, -15716, -17218, -33460, -31668, -3086, 12822, 31382, 43529, 13196, -11233, -23646, -33840, -21194, -262, -14006, -9892, 16555, 11577, 7638, 24188, 47559, 43644, 5808, -19950, -3354, 191, -23635, -48824, -45948, -15276, 4020, 18477, 17118, -541, -15049, 4934, -3969, 15420, 27016, 13180, -15562, -32652, -11375, -14176, -16290, -14174, 3781, -3884, -24552, -35412, -37861, -22133, -8477, -9027, 8917, 17384, 3663, -16074, -5468, -1709, -8677, 3923, 2321, -13887, 1571, 2289, 14406, 25023, 11581]
16787A1581k4816p122Q001Q085m073j5928J764J079N958k3408L518J7760J138
16774a6463p01N89J3789K4852p748J3681m654k1556J7381K2257J76q139l130l246
16760B7088P665M4437K507l1273l1092L262l149j2330n3744J2345J6293j4655
16748c2646P449K8584l211J4344j728k2760P615J0667L433J3904j1821J6783K891
16735C3504j5307j7354l230j4539K92P867J3503O076j3881j2417r234K4651j577
16722a646n09q748j7361J3132R275j015J2234l6456l4804O582K6743J6797K5150
16709I374l394j6648j155K645L3194q359k5650j953l537N675J4953M939o927p914
16695d757K5456j1366l676J0973L352j8501j8497K424j2437m167J9975J9033N652
$$ y = [11581, -13235, -20357, -12356, -4271, -8344, -24272, -22508, -21429, -15471, -38879, -35361, -17601, -16463, -17164, -16575, -2786, 22066, 14318, 27999, 23345, 1789, 19170, 41427, 41603, 33464, 30334, 27088, 34753, 79190, 81697, 50424, 19332, 22594, 19445, 7115, -46629, -34284, -17991, -32646, -25197, 3387, 176, 14520, 12792, -9968, -2353, 8314, 11747, 25651, 13830, 30613, 33504, 18197, 843, -2387, -16926, -16634, -8767, 4736, 10812, -3069, -15486, -24720, -69, -1646, -2155, -10903, -28264, -15132, -5857, -6872, 5362, -31094, -65898, -59316, -32573, -15776, 9374, 5980, -10668, -11823, -9178, 24016, 15657, -9993, -11946, -15483, -9808, 5145, 10084, 3157, -4757, 20699, 9333, 5657, 16630, 19982, 1481, -17016, -14592, -27029, -31196, -11221, 7812, 13464]
16682A3464P279K7676p250k2151j3130j1378j2189M379K5660p092q841K0024q975
16669G476O24j6032K467M703p147L469J9814M020j8917k66j9430J604J056o265
16655b2824J9591J1543j2241j3960j567j5551K8265K9297p911j9897J563j6584
16643b0276L273L0045q259l121N907K3790Q847n8977n0219K4315M0868L0227k2739
16630C681j273K5783R469j0909p86o968j1328l903q147J5847o115r292k0689J7215
16616g415J1992J0192J5458p504o799k1932o303J1656j0419k6769p620L498q865
16603e0830J2552K8632M458p004L511P048N42j1618j0229P370K2001J2969l243
16590A6159j0030k40P427Q955k0327Q878J3456P628J0995j0733j1492K1718n197
$$ y = [13464, 20743, 48419, 41169, 19018, 5888, -5490, -17679, -13300, 12360, 5268, -3573, 16451, 7476, 8100, -7932, -5465, -762, -7909, -4440, 15374, 19394, 477, 211, -19219, -17615, -16559, -22824, -3233, 8310, -3931, -17891, -19458, -35009, -6744, 22553, 14642, -5255, -3692, -20276, -17003, 13042, 4783, 1662, 7569, 31359, 40206, -18771, -68990, -44675, -3807, 26420, 3681, 2408, 28191, 37660, 26751, 25965, 18997, 7669, 3766, -4381, 11466, 5351, -3941, -24630, -7415, 4577, 14769, 30227, 22723, 15924, -6008, -12311, -655, -11074, -37843, -45463, -41965, -50830, -38278, -9646, -5188, -12192, -8681, -1633, -1091, -12709, -22938, -15568, 6433, 19402, 16159, 6129, 5889, 13316, 22271, 1944, 10822, 24278, 31906, 42901, 32168, 20676, 42394, 37197]
16577C7197J193k914q031k5639n335M546k1406K5691R730j7607j6556k920m296
16564b6347J6387l658N686J2564m281O860j0337M116n251j4125k1574J310J676
16551c6974M149o190l081J9307J6148Q380K267l0778l5771k5157o986M1098K3996
16538b9592k6843N795L762m279J9371R907L992M592j1567J7283j725l0492N802
16525c3994L69J0716n235P77j406J5721l518j0615K4931K0984J0486k5369M929
16512H776M557k1538J1090K0687k549K0874q731q178J7176J2245j5917r302R104
16499C8294k1110m724Q610Q117j9145Q764J1473r622n665l056k344J1246J6314
16486C7152k3096j8845O816j7214m701k1107k129K0262O47Q494J7966M557j9952
$$ y = [37197, 38390, 35476, 27445, 1806, -3529, 1017, -20389, 5302, 15032, -2575, -19131, -22051, -26347, -9960, -13618, -7932, 4632, 351, 7211, -3126, 990, -4261, -18386, -39960, -38650, -36974, -32825, -39015, -42096, -22789, -6641, 1739, 4006, -26772, -62543, -87700, -94686, -53588, -29592, -56435, -50640, -46878, -51157, -31786, -21879, -17887, -13295, -24862, -7579, -9304, -39796, -33994, -33625, -22909, -28144, -27367, -28773, -13052, -16570, -27185, -2254, 18730, 29216, 3847, 8776, 13333, -8205, 2885, 23572, 21023, 41897, 33166, 24988, 42164, 54409, 38492, 29190, 38294, 17184, 12460, 21070, 29187, 10042, 18806, 30279, 20657, 14992, 11936, 9592, 20838, 37152, 14056, -4789, 2027, -15187, -19888, -40995, -43124, -22862, -22215, -13721, 4245, 8802, -11150]
16473a1150J3305Q034j489q682K553J594r480J7364p751K2371m553o363K213k4505
16459f539J3425N24k326K8461L120k0010M710N395J0800j2132j4625j831N22O931
16445A6425o738n412j6424J7919J2635J0354j444q121J0518J7341j6414j4549
16433A6090p440j8887l3375k3379J6257K5727O097O905O135j1522K8710J4063
16421B5381o970q165J983R856p101k1927k6367j6565j3676K0568K8552J7431P920
16408A0920K2600J7907K871j4015k0813l6817r49M4014M262r423J1564k4949k8954
16395b1782k8142J1253P871j6341o557L3732K3010k304j0521J0479m916R058J597
16382F437M95J6770k5139j4632k141m791J1412J3442M02k3485j9404O353J1887
$$ y = [-11150, 2155, 10189, 8700, 18, 2571, 4165, -5315, 12049, 4298, 26669, 22116, 15753, 17966, -6539, 6886, 7410, 5084, 33545, 36665, 16655, 21365, 26760, 37560, 25428, 10803, 8972, 9494, 16425, 9687, 4275, -12149, 5770, 18405, 28759, 27315, 19194, 29712, 47053, 30639, 16090, 8650, -10237, -43612, -66991, -50734, -25007, -18910, -12005, -5870, -17392, 11318, 25381, 18411, 10246, 12229, 22085, 14984, -6943, -33310, -49875, -63551, -42983, -14431, 3000, 10920, 33520, 51427, 54298, 40283, 19470, -17347, -18296, 25718, 29980, 20557, 32121, 7172, -21782, -49924, -38671, -30800, -47141, -53698, -19966, 3044, 740, -9781, 698, -4218, 4840, 6437, 6932, 23702, -1437, -16069, -18210, -23001, -11589, 1853, 2255, -21230, -40634, -34281, -22394]
16369b2394J027K0352k22l0654J0507J5193K0027l038j3577J7743P134l0550q209
16356a6661J5058J9727J538J9374Q941j6884K878k5970k220r442j7422J3371o97
16343h409o075j2366j9815K5350j2618k1464P913M111J5089J0721L381K993N010
16330f179P682j0410M865J9106o880l1758k2901J4588J7830P477Q803K120o239
16317a896K1387J4624k5512j1726j5555K3412K0345n710k4321j9322P0O972K7272
16304A0040K6718J042j5032J699l0438l9472P58j0541Q127J1128Q591N707J5007
16291f666m058k7147Q470K041n841j0856K8463j792r377K4869L076k356k3417
16278b4591n918m11L80L1640J1506j1652j5274k8912K2260J4916j4510j6870n536
$$ y = [-22394, -21367, -1015, -1237, -31891, -21384, -6191, 13836, 10798, -2779, 14964, 22098, -8452, -16661, -1603, 18124, 19662, 39036, 47977, 31093, 33971, 8001, 5781, -3661, -21083, -7712, -8409, -14484, -26850, -46665, -21315, -33933, -55397, -47484, -43373, -28284, -17563, -14182, -11189, -6179, 1503, -8907, -4042, 15064, 8184, -23574, -46475, -31887, -14057, -6580, 2223, 4343, -1896, 19491, 34115, 8603, -3123, -18678, 4734, 25079, 19369, -4952, -24274, -24204, -17232, 10040, 36758, 37800, 22768, 24467, -5971, -45443, -44685, -55226, -47099, -35971, -27380, -21673, -6666, -10724, -37871, -29401, -27360, -33201, -44057, -15594, -17386, -26763, -1894, 1182, -1174, -24591, -30509, -30920, -30540, 1100, 12606, 954, -14320, -43232, -20972, -6056, -20566, -37436, -42972]
16265d2972J0225J9816J6105o707q800N8P542j403q204O435o139J4735j8296Q131
16251i474j0995j034m021l913K1218K07j6879M286J8874J7665j3943O495J3466
16238B1952k1579l241k107l471j7056M983K3782M42n982l426j220j3664Q65L63
16224a9359J1226J3187o149J3816l942j1623k1542M908p855q508l593L6982l764
16211f216M25R061L406L416K0973K7410l435l3554j9038K105J2093k7589j7994
16198b8937r649M7410K8417k0o949j7592q369N718j8178K3239J7125l605j1505
16185A7105L551n723N437j4531l5247j1195k5735K1265q60q904K2657J6357K2102
16172F279l359J78k1223k9059Q45j2546J6627K9492L2821Q389j0945J3142O621
$$ y = [-42972, -32747, -12931, 3174, -3533, -12333, -12275, -4733, -6136, -14340, -7905, -14044, 691, -17605, -9474, -20469, -21503, -25524, -29437, -8219, -8012, -24891, -20605, -1731, 15934, 1991, 8486, 21952, 373, -2868, -4975, -8446, -25502, -20519, 3263, 3705, -2277, -5703, -6923, -20587, -19722, -19359, -8133, 5054, -1095, 12721, 8779, -2844, -24386, -19478, -27333, -35841, -39434, -2452, -6216, -5791, 3270, 6676, 10092, 31065, 58475, 55040, 21486, 2448, 4553, 16646, -10943, -28937, -38586, 8824, 37241, 37221, 30272, 12680, 4311, 10029, -8149, 15090, 32215, 28610, 17105, 20656, 14933, 20370, 5839, -29408, -40603, -66338, -45073, -45933, -54837, -32180, -15823, 6279, 2920, 3098, -18125, -47184, -46339, -58885, -42258, -12766, 20055, 28444, 17499, 30641, 37262]
16159C7262j1384l9484j4350J9333K9933k4096j8222j0611J8832L2886l0559k4378
16147c4838J4352n652J0770r626K097K2553J1948n21m1248l4315k4949L933L7139
16134d8357M3762J0113k14K4004M823m5008k2332N042Q377k3439K9814J4609l127
16121a933q734l4872r510O826j0438J1117K0251L060O657j0381O050J3302M412
16108d193p770Q987k4664J243P65L6617q014j3501J0931R951j1553l739j6087
16095b1027O967j4677o098J7247J4162K7886m929N414M707j782j380q050j2708
16082E732p735l56K4852M533L335j7387j00J2593k6574k6499J231N1066m431j8700
16068A560k5580j0344K438j1672k574J2245L5882L0375J1116j8985J2629J461
$$ y = [37262, 25878, -13606, -27956, -8623, 21310, -2786, -21008, -31619, -12787, 20099, -10460, -34838, -20486, -26138, -15368, -24994, -22897, -344, 11604, 11083, -30165, -64480, -89429, -85496, -48357, -4595, 5518, 5304, 29308, 34131, -10877, -33209, -28167, -19790, -43229, -13415, 1194, -1933, -10667, -45539, -55049, -48223, -58661, -47544, -27293, -24233, -17576, -27957, -21907, -8605, -4193, -11963, -2976, -27640, -26397, -25632, 10985, 2971, -10530, 401, 10352, -1201, -4940, -21027, -14060, -28737, -34835, -17588, -3426, 24460, 19531, 24945, 29652, 27870, 26490, 18440, 5732, -2003, -2359, 22493, 27026, 30361, 12974, 12874, 25467, -1107, -27606, -26375, 24691, 20260, 1560, -24020, -34364, -31926, -43598, -46172, -33927, 1955, 32330, 43446, 24461, 37090, 38551]
16056C8551J1996M846n2291k5337J5430j1206n192Q990R641j5973K217K246J2788
16043c294J2035m17o143J0576l6599j1186Q689J8437K1428J8615R685K241j8105
16030B5962j1301K0493j727o590n850P467J0545j0719J8852J112L264k3793m705
16017B3010Q688r196P115J379j8084P76M952j2288l1989k480O874K4900K1652
16004B5309R906o910k8086l1929N310J4749K6142r202p979j4710Q296L4588L742
15991B9226j2702k074j6669k8890j832K6710K3728o304j4723r759j6345K2701
15979f933N667j5097j4000P105J857K5136J5129j136j284N580N27q491m597K096
15965A1559k0825j6818J602j2350J4497J6995M507j4304j0979L0245K1067N684
$$ y = [38551, 50547, 55393, 3102, -22235, -6805, -18011, -23203, -14213, -4572, -20545, -18328, -16082, -3294, 8741, 8324, 2181, 12757, -23842, -35028, -26339, -7902, 13526, 32141, 41826, 44067, 25962, 14661, 35154, 33427, 26837, 20987, 28454, 38999, 28280, 47132, 48244, 51508, 27715, 23010, 31698, 22502, 29617, 30996, 12912, 13688, 18640, 6352, -25637, -28117, -21243, 3657, 25309, 35215, 28305, 219, -31710, -26400, -11651, 14491, 5289, -2690, -17400, -9104, 25484, 29226, 16524, 14450, -2219, -31109, -32941, -6231, 17497, 11193, -3530, -13289, -29634, -6933, -1266, -16363, -30363, -23258, -21401, 3735, 18864, 17728, 16444, 22024, 22551, 14060, 9463, 11559, -9266, -26084, -24482, -36832, -22335, -5340, -833, -15137, -26116, 4129, 25196, 30880]
15953C0880m7110j6829J6853M744L891k3176j5924J6242K5776J2756L738J450
15941A3291l369K015Q684K741Q201L41J780l0866k3509L2021n451m7566j3513
15928e5200o475O829K5516j8361l933P988P247J9455q668J709J9066K3649o999
15915A1823l4261L14K679O426Q70J207j1581N044k422l883J5688k71p183j4649
15901c0199J6104J4545n167J0965j6674Q221l902j7429j0669r083k8091K6030
15889d5349K2037J1179M533J6351M174k4041j2960j8105K130R169j1433K955j8720
15876e8080J6936Q708L0038r426P309J6845O223R064j6799j1692J3455J1721m904
15863A9398j4954p426Q542o284M059J405j5215j8186j1513K1856k842p453K5535
$$ y = [30880, -16230, -33059, -16206, -11462, -7571, -30747, -46671, -30429, -4653, 8103, 11841, 13291, 9922, 11937, 20621, 23362, 31563, 31904, 33684, 2818, -20691, 11330, 5879, -41687, -55200, -61675, -54846, -29330, -47691, -51624, -43636, -36389, -16934, -25602, -23893, -4827, 18822, 11823, -22438, -22124, -19445, -13019, -12149, -10942, -22523, -17479, -19901, -23784, -8096, -8367, -15550, -30199, -14095, 450, -4717, 6248, -10426, -2205, -6107, -23536, -34205, -43288, -71379, -45349, -23312, -12133, -7600, 8751, 12925, -11116, -24076, -42181, -40051, -30882, -42315, -39360, -58080, -41144, -32436, -2398, -11824, -4515, 12330, 18553, 27617, 10818, -874, 12581, 24302, 19398, 4444, -2982, 5560, -724, 3335, 4740, -10475, -28661, -40174, -18318, -21160, -28613, -3078]
15850c078J0878l0450J2649K5794m751L222k3657n690k4p496P825j3073J5953
15837a1898K3504P458o934j8181j4739R628K0052j9438o447K3544L8302J1100
15825E5951l4368q572r779k9973j8588q931L3818j053J659L7653k779l5638J8311
15812b289P937l147J9821P215k3462k9325K170j1082L368J6566J4853Q377j4718
15799c716J7338J8218o028k3248k7307j178K1356m589O78q348j9756K0173L9416
15786B3009L4311j0186j9540o535l288M845J0701n163l5327l2985o887k741J5496
15773c4290L5962n301k5543o003J5879L2881O276k8888j2960K1306k73k2759j2751
15760c6464j3083n87K2991J8334Q765n269J1453L679k1087l698q526r159M322
$$ y = [-3078, 7800, -22650, -10001, 15793, 11042, 14264, -9393, -15083, -15107, -22603, -14778, -27851, -11898, 11606, 19064, 12130, -6051, -20790, -11162, 8890, -10548, -16995, 6549, 44851, 55951, 21583, 13011, 3232, -26741, -45329, -54260, -20442, -21495, -19836, 17817, 15038, -20600, -2289, 5648, 2501, 22322, 29537, 6075, -23250, -21080, -32162, -28794, -12228, 2625, 11002, -3716, 13622, 31840, 25812, 2564, -24743, -25921, -4565, -9154, -8476, -16824, -36580, -16407, 23009, 57320, 47134, 27594, 21059, 17771, 22616, 33317, 28154, -7173, -40158, -47045, -49786, -34290, 1672, -3629, -29172, -35175, -19296, 13585, 19861, -9027, -21987, -681, -954, -23713, -36464, -49547, -50134, -27143, -8809, -44, -5313, 6140, 9819, -11268, -14966, -23492, -32651, -28329]
15747b8329J6449J9233K081k6048J3199k1142k2663J3054O033j6859o013q982
15735e9987l63J6824J6993K23M492j1710O977q501l095M994j0307l872K3998J1923
15721a1411q5J86J0160k6141k4513j775n301k858K1071o833J7403J3282j3259
15708c0074j6083J9191J0981k695m135m410p519o025N130q497j1529j0755m261
15695g0681L839N9574L5962K407o365l5595m718j363R764k0543J244r144J0137
15682b5482J8883M572k379J7777J7010k2466k9691k9955L363J9241m500j238J6155
15669a8710K8938L857j0809k1113j5616o948J0491K0245K379K3421n610M783K4882
15656D0190q362j5655Q941r824j4105j2697J8957J3857j8487k8492k3513k918
$$ y = [-28329, -11880, 7353, 9434, -16614, -3415, -24557, -47220, -34166, -28133, -44992, -51005, -59987, -60350, -43526, -26533, -26310, -21818, -33528, -26551, -35052, -38147, -33153, -43460, -47332, -23334, -11411, -11496, -11310, -1150, -27291, -51804, -53579, -58880, -61738, -40667, -47500, -30097, -16815, -30074, -46157, -26966, -15985, -18680, -22815, -27225, -34744, -40769, -35639, -44136, -55665, -66420, -70681, -66842, -7268, 28694, 31101, 24736, -10859, -15577, -16940, -7176, -27719, -26475, -35619, -25482, -6599, -2027, -4406, 13371, 30381, 7915, -21776, -51731, -48368, -29127, -33627, -34865, -18710, 10228, 14085, 3276, -17837, -33453, -40401, -29910, -9665, -7286, 16135, 10525, 15308, 40190, 31828, 16173, 25114, 15290, 1185, -11512, 7445, 21302, 2815, -25677, -49190, -52108]
15644e2108l096L026K0248L7148Q227N479q785Q36Q117j1417j0359l9430j7147
15631e9261L7306J8053O231O499n044j9989J078N743j4784J3211R418p490P403
15618a626K910o728m342J8128k3566R359J0679j6227N233n437m1298R816m488
15605d7587R378J5296J0692j2848k1852K4655M756m931Q70j6366p701L1192J1164
15592c282J0453j4221J8099r103Q327J1633j4023k4909L340O474J9605j4016O87
15579i36P736q19j9616J5539n658O172J3566l8874l635q713P258R085l735P792
15565a4838L997J2776k2291k990O388m147K1377j288j1978P257K5805l580l4571
15552a8083n121M943L0112m144l3615k0651n00l046L5776l616K809r076k654M089
$$ y = [-52108, -55204, -52178, -31930, 5218, 13445, 18924, 10139, 10975, 19092, 7675, -2684, -42114, -59261, -21955, -3902, 2329, 8828, 3784, -16205, -15127, -9384, -24168, -10957, -1539, -9029, -1626, 1284, -5444, -9786, 8342, -15224, -5865, 4814, -11413, -6180, -11617, -52915, -43099, -47587, -38209, -22913, -12221, -25069, -46921, -22266, -17510, -22441, -21571, -37937, -45638, -14446, -3282, 7171, -7050, 11049, 1946, 10273, 21906, 7883, -17026, -13686, -7212, 12393, -1623, -936, 6800, 5981, -13635, 1904, -3754, 2418, 15984, -22890, -26525, -35238, -27980, -18895, -22630, -14838, -10841, 1935, -20356, -23346, -16958, -21105, 272, -1016, -12994, -5737, 20068, 16488, -18083, -23204, -18261, 11851, 7707, -25908, -46559, -47059, -50105, -14329, -17945, -15136, -24212, -26866, -22777]
15538b2777J7877k3325r842k6412J26J0118M3011m804j2315J2581L151J9874j2350
15525e087P448J8311k240M583j5784R547N957k8791J3217O261k1868j26J126J2294
15511D848k6610j9674K5504J2260k71J0572j5553p039J7446J6321P813l1503j9529
15498b5415J5359o177j7745R023J4081J11j5539k124R424N1063L659l9450p464
15485a1194J8742J8893k7834p087p3J2560P022o317o004j3239J3765J0106J4438
15472B3778J1232l0109j3110P019q976j628m120k657j1523j4837o659J5607P104
15459b8879q863J3004K4345K6808J0290m1450j6765J9981K0028O54o629q955P415
15446A0984R603j7951k5188J9668j1267j4859J431j5217J2005M7962l3606j4657
$$ y = [-22777, -4900, -28225, -38067, -64479, -64353, -54235, -11224, -16028, -28343, -15762, -12611, 7263, -5087, 2361, 20672, 18432, 23015, 7231, 16778, 22735, -6056, 7161, 13422, -8446, -8572, -7446, 4848, -21762, -41436, -15932, -3672, -3943, 6629, -8924, -15963, 1483, 17804, 25617, -5886, -25415, -10056, -16233, -33978, -24955, -10874, -10763, -26302, -28426, -19002, 32061, 35720, -3730, -11194, 7548, 26441, -1393, -8480, -8553, 4007, 11029, 4712, -1292, -14531, -766, 9340, 23778, 35010, 4901, -8209, -1190, -10166, -11794, -15914, -18571, -30094, -44931, -51590, -35983, -28879, -37742, -24738, -393, 26415, 36705, -4745, -21510, -1529, 18499, 19153, 12524, 3569, 10984, 20587, 2636, -22552, -2884, -14151, -29010, -27579, -42796, -30791, 17171, -16435, -31092]
15434c1092K4025k0292O902J2121k867J4995O278N770p981j7554j3542J9582K3121
15421A9466M739Q556K4631k5373j7957O59p311j2451n151J2879l1639k8811L001
15408e4762M2375M9599N939k7880K865J4546J4992j3516j3489j9816J4549j2994
15396B408l2372r935J9125R223L1490Q577n620o189r178o164J5450k3710p871
15383a4766N056j0486O474Q516J4608Q96J3651m71R598p966k0421J402J2281O280
15369B4652q675k0229J481j1049j8157K353J3068J4736P715K172k2501l259M613
15356a3080m72M1895L2062Q875L730j5629l0163l2677n784K1783J5610M466j6044
15343A4572r675j56j0825j6796r290Q814N696L7138M2687J7002j6163m4397m5546
$$ y = [-31092, -7067, -27359, -20457, -8336, -11203, 3792, 10070, 15840, 7859, -9695, -23237, -3655, 19466, 24205, 32761, 57392, 32019, 14062, 14721, 7410, -5041, -10192, 2687, -28952, -57763, -54762, -12387, 37212, 43151, 15271, 18136, 32682, 47674, 34158, 20669, 853, 15402, 2408, -29964, -39899, -20774, -11551, 19939, 28516, 22896, 16707, 7529, 1365, 16815, -6895, -14766, -9710, -20196, -13722, -5206, 9402, 10298, 23949, 23478, 33076, 25110, 4689, 6091, 18372, 24652, 15977, -4252, -2771, -13820, -31977, -29624, -16556, -1820, 5895, 8067, -14434, -17693, -13080, -13552, 28343, 60405, 69280, 73010, 57381, 27218, -5459, -11243, 10540, 26150, 30616, 14572, 4897, 4741, -6084, -22880, -32170, -23356, -17660, 19478, 62165, 79167, 63004, 18607, -26939]
15330b6939M839O833K898J5861N767p022j9046P6n147J1876k2421r259J2212J940
15316b7532J6215K4724j3918j9426p710k099p860J2687p302k755k0377Q543k262
15303d9072K2506n802j737N948K4058k1536l1411k3163K0256M5218k74J2356J6591
15290A3938l2332k8952K5608J952m746Q960j3577j6031K3970L6036J8714j39r136
15277B4265l2979j7261J6063n647J904L0870K5103n675n325j7980m541n62K3925
15264C2160P075m4907l1701j4555J3857J0846J4660L1259J0295j9300k3342j9296
15252c2949J6531K0768j9330J4729J0670j5765j9777k0881K0114J3837l175K1177
15240E949o302J5486K5179R589j2205k1023j0683j8930n362N721J652r964J5766
$$ y = [-26939, -22100, -15267, -12369, 3492, 9259, 2237, -16809, -16733, -21880, -10004, -32425, -41684, -29472, -27532, -11317, 13407, -511, -19937, -27647, -29746, -37606, -24919, -32221, -34976, -55353, -46810, -49072, -26566, -32368, -34105, -28157, -4099, -25635, -57046, -80209, -59953, -14735, -15009, -2653, 13938, -18394, -47346, -21738, -19786, -24532, -15572, -29149, -45180, -21210, 14826, 33540, 33401, 24265, -8714, -25975, -9912, -15559, -13655, 17215, 42318, 36643, 31318, 13338, 8797, 8235, 32160, 39235, -5672, -37373, -51928, -38071, -27225, -12565, 18694, 28989, 9689, -13653, -32949, -16418, 4350, -14980, -251, 10419, -5346, -25123, -46004, -25890, -12053, -15228, 5949, -353, 15133, 40312, 49901, 37696, 16673, 5990, -12940, -18302, -12581, -10929, -20893, -5127]
15227e127K5907K5457j2339k6176n928j3187l0515r307J8847J5437Q564p508J8731
15214B856Q107J6552j4295k2484l0823P64r708J0304J876K0363K0780J5535J1927
15201C1754j3458n819m092j2613j119J6815L0850p720j9485n674J241K45K5667
15188C6592n495r162j5162j7032k017p234m416Q021J5456J0930k1447J6144L768
15175H946k5548j7616K190N05n316R437L2923K6053j5993n4Q016j2554j1960j0950
15161a1921k068j9989L815M7655p212J9207J5473J2989k2061P890J0705j5703
15149C8780j677j3018k9477j7644J3146J0165Q11k361Q050j2155k3467K1800J0278
15136C231P517k3719L470L0920k5327j8402j435K863j2989O375K7061J312J951
$$ y = [-5127, 20780, 46237, 33898, 7722, 1794, -11393, -41908, -51215, -32368, -16931, -8367, -15875, 2856, 10963, 27515, 13220, -9264, -40087, -39323, -49031, -38727, -36851, -16488, 4292, 19827, 31754, 18296, 12477, 8385, -4228, -5347, 11468, 42318, 34598, 15113, 9439, 10680, 10925, 36592, 31097, 21935, 6773, -10259, -12276, -19510, -23926, -15905, -449, 10481, -10966, 5178, 8946, -16602, -34218, -32028, -31523, -36839, -27402, 5521, 31574, 15581, 15527, 23543, 10989, -971, -11921, -13989, -33978, -30163, 17492, 10280, 29487, 44960, 57949, 35888, 43778, 54483, 38780, 37103, 24085, -5392, -23036, -9890, 275, 1086, -1275, 6775, -5380, -28847, -7047, 3231, 10748, -12971, -9501, 21419, -3908, -22310, -23745, -20882, -33871, -27496, -435, 877, 2828]
15123B828J4645O028j3854j5240L5884J2602j5920m1663n455p705J659O219R69
15110a9003J5478R354o607q698k8090K8393Q389K096J5550l2671j9005P819L556
15097b3439K6806q650J9697K5999J3748j0171j1944q676k6765J8485K6418L5776
15085G7284k3832p6735l2375J0391K7598J5191l868J0969P064k1471j8722J3324
15073a5182M4682O191k4519j4703J565J6441l210k4588P022K2905j9195J6673
15061A4082j733l1428o00J1377Q519j38l852N615k9186l3035J9884J4384K2810
15048c301P221j4216Q095J6528J4160r208j1086k4871m1952K0065J7202q002J7535
15035a1830L0551j9255k7512k8845k8040j0413K3993L9173P844o529j4069Q587
$$ y = [2828, 17473, 23501, 9647, -5593, 30291, 42893, 26973, -14690, -20145, -27850, -26191, -19972, -19003, -3525, 5829, -778, -9476, -37566, -9173, -784, 1312, 16862, -15809, -34814, -26995, -23439, 3367, -5283, 14414, 40413, 54161, 43990, 32046, 23370, -3395, 15090, 41508, 77284, 53452, -23283, -55658, -45267, -17669, -2478, -6346, 4623, 11687, -9784, -28506, -15182, 29500, 35691, 11172, -3531, -1966, 14475, 11265, -13323, -6301, 16604, -2591, 14082, 12349, -19079, -19679, -8302, 217, 79, -3773, 1842, -27344, -60379, -40495, -26111, -3301, 3920, -10296, -2201, 14327, 28487, 19279, 8193, -16678, -58630, -38565, -21363, -29365, -11830, 18721, -534, -28046, -56891, -84931, -95344, -71351, -32178, -24334, -30863, -44932, -36345]
15023c6345j768J4798J1812L2689J2767j5073k3870J4238M860N661J6476k8725
15011G520q140J2742Q718n808r01k3775j173R637O093J1881J4125J978m923K127
14997C0101K076j7165j6772J4079o072K429j2079j206J5999J2844K944M546N547
14984C7271j0021J768k912k8863k1342K2948q781p564j2673j1389K0123K5519
14972D084k629P958j7203j2640K1790K3831j2046l9801K3706L4578P830j7283
14960B2175k1013r947R864R229j7623K3057N958k5712q28O485J1507K0108K5010
14947E8270J5198r968l9851k780q551k542N759r401j6564O826J2069j7377o240
14934a5152k998J5459K5148j818k9117Q277l1925j9833j1195K9140L7666J025
$$ y = [-36345, -38113, -23315, -11503, 21186, 33953, 18880, -4990, 9248, 14108, 19769, 36245, 7520, -620, 12122, 20840, 15032, 14131, -9644, -10817, -1180, 4913, 16794, 30919, 32897, 27974, 30101, 32177, 15012, -1760, 12319, 6247, 8676, -3403, -4609, 11390, 24234, 27178, 31724, 37271, 27250, 29018, 26106, -2757, -24099, -1151, -9932, -17496, -30169, -41558, -21435, 4084, 1455, 9413, -7790, -20430, 1360, 25191, 13145, -26656, -2950, 31628, 39458, 22175, 1162, -8785, 1079, 10308, -7315, 15742, 21700, -4012, -4840, 1645, 13152, 33260, 58270, 73468, 63500, 23649, 20869, 12318, 9776, 15535, 6134, -10430, -3604, 8465, -8912, -15152, -18150, -2691, 22457, 20639, -8478, -201, -32126, -51959, -63154, -34014, 3652, 4677]
14922D677R573m688o467m220j0752j3435j0728n141M491K8894J1646r7q431J0636
14908E958K995k8555p591J1166L2800K5480k1040k6577p496L031K738J6861K6962
14895C6732Q110k0895l2702k1573J1792j3438j7371K859j3784K8034n34r995P2
14882d2693Q261L0406k050q902K3456j3701q503J1597K1273j0620k3584M640R401
14869a019l905l5736l6641J8406K6161J3400J9288N070l9777j466j6099j505j4015
14856f7838J720K1026K4965K0471K1178j1910l1294j2078p155J0092J0654L050
14844a7119Q97P757L883r412L765j1194j2663L1774k531q714J8075R46L0591l0755
14830E300j2799M09P660M429K81N518m234k855J5794m707r328M199K7713O05K5827
$$ y = [4677, 14250, 9562, 3095, -1125, -11877, -25312, -36040, -41181, -36690, -7796, 3850, 3753, -4678, 5958, 8953, -19602, -27193, -16027, 16773, 42253, 21213, -5364, -12860, -9829, -7091, 9770, 36732, 44842, 23947, -8755, -30328, -18536, -31974, -49345, -46486, -60270, -32236, -32770, -42765, -42693, -34432, -4026, -6076, -14978, 8478, -5223, -13726, -2129, 19144, 8524, -15060, -10420, -1019, -4924, -40660, -77301, -58895, -32734, -19334, -46, 5024, -34753, -36219, -52318, -53823, -67838, -66118, -45092, -20127, 344, 21522, 9612, -21682, -33760, -40915, -30823, -20169, -17119, -16222, -8465, -4582, -13994, -10229, -21423, -34086, -2312, -4843, -13557, 4518, 5464, 36055, 5300, -7499, -7090, 570, 4999, 5280, 10798, 6564, 3709, 19503, 14796, 5468, 9667, 37380, 37985, 63812]
14815F3812j5807m106j7733m8287r941J1131J3861K9133J1345P244N393j8398
14803B7647J6386j1302k0970j575j6538k2604q964j2667J253j46L374J7968J4181
14790a3957M718r693K3720K529K6371j56j3163j8045Q653J9902R671J5337r029
14777D6858Q787m437Q751N614j0315q458K569j2633k5053j1750J7714J8343l588
14764C2402K988J4515M785j1666O698j3853l6911k5305L138J738J7727J153N702
14751C111L708Q408N547J0025j4814l2913k863p459r606M2780n14j8741K9127
14738A5796J2894j2419l6801m18R438l299k8224j2114Q514O637l669K7500J9673
14725C508k1690k114R058R653j6834O21R359J337j380L661K060j5781K9777K2885
$$ y = [63812, 48005, 43899, 26166, -22121, -32062, -20931, -7070, 22063, 33408, 40652, 46045, 27647, 44033, 32731, 11761, 10186, -6352, -28956, -37920, -50587, -49334, -49480, -46106, -28138, -13957, -9239, -18932, 4788, 7317, 33688, 33532, 20369, 2324, 10977, 30879, 40550, 55887, 46858, 55645, 51208, 59959, 65573, 55258, 46800, 49369, 36736, 11683, -67, 17647, 35990, 32402, 35390, 49905, 54690, 43024, 49722, 35869, -1042, -26347, -23209, -21471, -3744, -2591, 3111, 6819, 15227, 20774, 30799, 15985, -16928, -19791, -27250, -36856, 5924, 5410, -13331, 15796, 28690, 16271, -20530, -20948, -11510, -14809, -43033, -55147, -46633, -39996, -43665, -16165, 3508, -18182, -20296, -11238, -1585, -18419, -17798, -8439, -7102, -8482, -4821, -2761, -18542, 11235, 34120]
14711C4120O508k5646j951L397M53J655p960j6232J903k3707L736K1972K3531
14698B1779j068J2443j1067j7813K4254M434L789p894k7188j320L967p536J1563
14685H343J761L33J8217r203l975j0912j0378K983K9498P849l6069j4435J1235
14672d753K667O166K607p51k1909j6624j8224J0653J1929J8251L3303L689J4361
14659D1365m218l1758k6841k1733J2678J2964J8966K182M857P936l519j0560m752
14646b433q145K1340K863j2037p84N120O928r605k5267k7941J4328K1700p391
14633b1324J2360L5446O162j4439j3142k3527J8703j018j1687p329K0181J2162
14621A2548q151q96n099J3106R034p719j1588P697L4129J9640o088j9167j6521
$$ y = [34120, 40628, 14982, 13031, 16428, 16881, 18536, 10576, -5656, -3753, -27460, -23724, -1752, 21779, 20711, 33154, 22087, 4274, 28528, 32962, 36751, 28857, 1669, 349, 4316, -3220, 8343, 10104, 10437, 28654, 19451, 15476, 4564, -5814, -2831, 26667, 34516, -1553, -15988, -4753, -2086, 4080, 6687, 5936, -15973, -32597, -50821, -40168, -28239, -9988, 23315, 27004, 41365, 37147, 5389, -21452, -43185, -30507, -17543, 1423, 3605, 8462, 16398, 12879, 2319, -2433, -10578, 10762, 13625, 1588, 804, 5924, 12852, 3247, -22020, -49961, -35633, -13933, -21324, -8964, 26482, 32644, 18205, 5063, -18464, 239, -779, -12466, -19795, 386, 12548, 4397, 3501, -1598, 11508, 20542, 12823, 1235, 8932, 43061, 62701, 56613, 37446, 20925]
14608B0925K767P971l3529j4652L705k381N092j408Q458J9522J8580l2344j5267
14595a2561R177P807Q770K8553Q504j1023l6500k1574J3648Q776L030O704n816
14582G495m878q06M719k2159k9492K8235K3166j5207j7664Q160l3413j22M3645
14569h321K3586J1280j3541j2135P924r989Q112k816k4046k2186J2409K4841K215
14556b667J3059K8701j0477k219l213k973J7690n76j4788m1054K2958M323n676
14543C088m034n796J4766m886o195n756L5445M310m8178L046O179j2045R250J9801
14529H995j9165k3544M257r866J5453J0217K3096j5970K6135J1352l5741l5874
14517d0655j1128J7736q088J4480M3020L8204j4129l3071n826j0890m0310l1567
$$ y = [20925, 23692, 31663, -1866, -16518, -12813, -15194, -10102, -11510, -3052, 16470, 35050, 2706, -12561, -3384, 4423, 13193, 41746, 50250, 39227, 2727, -18847, -5199, 3577, 6607, 13311, 7495, 2617, 1811, 6530, -15629, -45121, -16886, 6280, -8927, -26591, -18431, -51844, -51966, -8321, 15265, 26545, 13004, 869, 8793, -1196, 6916, 4100, -19946, -42132, -29723, -4882, -2667, 10392, 39093, 28616, 26397, 23184, 20211, 37901, 37325, 22537, -18517, 4441, 8764, 3088, -946, -6742, 8024, 3138, -3057, -8813, 26632, 30942, -17236, -14190, -8011, -20056, -10806, 8995, -10170, -33714, -29457, -39323, -23870, -13653, 9443, -6527, 19608, 30960, -4781, -40655, -51783, -34047, -42135, -27655, 15365, 53569, 39440, 6369, 543, -10347, -50657, -82224]
14505h2224K3112J9960J1153L354M718J3420K6874Q414j8344j7880k905n297r29
14492a6574n276K3138J2180Q858j1704k6972k7689j3654J78J1611K1905K8948
14480D949p354j4426j5881k2173J7649m652J5291M48o0J1650O339p342l1241l857
14466e0660K798K7661J1670K1914m401J573J9319J0639l0560j9741J8012K4698
14454C2922J6973k2770Mj0946j186o238k7945k3819J5320K5476K4193O633j2815
14441A5802k4295j9121L0421M0376j2274j9115q419R289J611k8070M600K8981
14429A9786J7583m00j8015k6975l965L2244J7405k4280k1354r651L2396l785M052
14416A5041k2025k451Q421j0798o945m39J7704P456K4256j7770j6206O757O867
$$ y = [-82224, -59112, -39152, -27999, -24645, -19927, -6507, 20367, 28781, 10437, -7443, -10348, -15645, -16574, -21850, 1288, 13468, 22326, 10622, -16350, -44039, -57693, -57515, -45904, -23999, 4949, -2405, -16831, -32712, -54885, -37236, -41888, -26597, -26149, -26209, -14559, -8220, -15562, -46803, -50660, -47862, -20201, -8531, 13383, 8982, 10555, 29874, 40513, 9953, -9788, 8224, 32922, 49895, 27125, 27129, 16183, 14997, 8759, -19186, -43005, -27685, -2209, 21984, 28617, 15802, -8493, -27614, 2807, 43183, 30909, 11794, 3375, 12664, 14275, -13795, -9195, 19786, 37369, 36969, 18954, -8021, -11986, 20258, 37663, 13383, -7971, -17622, 14774, 10989, 15041, -6984, -9435, -1014, -11812, -18757, -19196, -1492, 5964, 30220, 12450, -3756, 3001, 9868]
14403I868J4290J6080o110k8110j9908K594K7826J7531k0331l291P147K2635k670
14390C7551j9885m0286j35J2362K3368k3230j8888M185J3474K2936M162l4574
14378a8960J45L0388k4785p167k885J432K3949K2431K272l449J1099O077K8040
14365F8587j1510k597j6713o695k1918l3606l2584l8127J6608K4912K1380K1768
14353a0495K6710r32k107R111m15J916j9702k6792k8818j2573J0549K3791K2040
14340g717J4833J1334R239j0773k618M544l4793j3499J5469Q017j0427k1852j0586
14327d8829J0640K6799K9914J6933L478j6707N034j4598M872L7383l6756l4938
14315a6775K0322k990l63K3319j4739j8021q03R611K2630q079p175r432J8622
$$ y = [9868, 24158, 40238, 34128, 6018, -13890, -11296, 16530, 34061, 13730, 10439, 17586, 40221, 37551, 17666, -22620, -22755, -10393, 12975, -10255, -29143, -24958, -11484, 11452, 15614, -18960, -18815, 11573, -13212, -20379, -23264, -21832, 2117, 24548, 26820, 23371, 34470, 40547, 68587, 57077, 54480, 37767, 31072, 9154, -24452, -57036, -95163, -78555, -53643, -32263, -10495, 16215, 15283, 13176, 22287, 21872, 23788, 4086, -22706, -51524, -64097, -53548, -29757, -7717, 7116, 18450, 27689, 16916, 14298, 18842, -15951, -29450, -13981, -5964, -16391, -38243, -48829, -38189, -11390, 18524, 35457, 38935, 22228, 27262, 12664, 17536, 54919, 18163, -16775, 3547, 557, 194, 23513, 8774, -9247, -10050, -439, 22191, 14112, 6937, -2495, 16127]
14302A6127l687k1110J2831J9925L618J6567J1054k3487j8363R152k2168m429
14290c970J0188K672J1391J2986j8254k1782K2069l600R483L9937K4657l4090
14278E1687K0N180k2510l9817j9022n292l54O494p160L937J3685j390K940K791
14264h811J5141L4579L619j4270l724j4076O715k0153l4451j834M181m263K562
14251c4785K4680o072j7857J1206J9841K4J6564K8134N317j5558J885j5503l5216
14238a7340K1666J8830r172J7309K1920J8360k0919j7020P40m91m512m504m473
14225B0394L794m251k4000O251K3045j2720j187k1502j0074L1676L6837L240l0913
14212B0590k0455k5396j3691k2865K007J3925L3114Pm1582K4157J3179O068Q966
$$ y = [16127, 12440, -8670, 4161, 24086, 27704, 44271, 55325, 31838, 13475, 22627, 459, -3970, 6218, 8890, 20281, 33267, 15013, -6769, 15300, 11700, 21183, 61120, 85777, 51687, 51707, 56887, 34377, -5440, -24462, -29754, -30108, -23614, -30774, -26837, -13152, -14542, -11602, -8811, 6330, 40909, 44528, 30258, 26534, 12458, 19173, -980, -35431, -37265, -33084, -37347, -34785, -10105, -16177, -34034, -22828, -2987, -2963, 13601, 41735, 47052, 31494, 33379, 17876, -17340, 4326, 23156, 13984, 31293, 53213, 71573, 50654, 33634, 34374, 33883, 29371, 24867, 20394, 24188, 19937, -4063, 2188, 25233, 12513, 11326, -10176, -20250, 11426, 48263, 51503, 20590, 135, -25261, -38952, -61817, -59810, -45885, -12771, -12764, -54346, -30189, -17010, -10942, -1976]
14199a976J1737m375l982j9104P935K3285J699k0257J389L6658L1288L654l7253
14186C0698k8066l2388n20J4188R418J9167o896l82N280J774l544R395k4072k2363
14172b8311K971K0838j7505J0615O426p320k746M692R692m149l1051p162K6753
14159a6257J5489j5782Q36K010o727J18J1031K3565R414j7824J5106J7722R519
14146D8220m8081m2205n100K6125R141R903L7202K2401n263l611l5231k3339p042
14133a6880M141k5806k6335K6813L3334L4788l2620k8907m714J8492L9588q257
14121A3637j4778m097J171l89L5271l920k4285k4326q008P96N256O803L2623J8592
14107C4346Q308j9443l5767j0934R38p28k0939R058O197K7523M014j0530M156
$$ y = [-1976, 9761, 5386, 1404, -17700, -9765, 13520, 15219, -5038, -3649, 33009, 64297, 67951, 30698, 2632, -29756, -30276, -16088, -6670, 12497, 5601, 5219, 10499, 12273, 8729, 18124, -5948, -28311, -25340, -4502, -22007, -11392, -4966, -12286, -15032, -10340, -648, -4797, -35848, -43010, -16257, -768, -16550, -15714, -13704, -20431, -20313, -9282, 14283, 23697, 5873, 20979, 38701, 48220, 139, -42066, -47166, -21041, -11900, -1997, 35205, 57606, 52343, 48732, 13501, -9838, -16880, -12739, -38545, -64880, -38067, -4733, 30055, -2565, -31472, -36186, -17694, 21894, 13637, -1141, -5238, -4067, -4456, 30815, 26895, 2610, -21716, -29724, -28928, -23672, -16869, 15754, 34346, 42654, 23211, -12556, -23490, -22552, -23280, -44219, -35161, -28964, -1441, 2573, -7957, -3801]
14094c801K3393J8362n408k108k3206j2717J108k5919j4606J2646J2738J0679
14082h839M8363k469l4198N495j4774l3526j7809J3329K1838j9549q077J9877
14070c0339J88K4971Q018J3647O103O122l1786o903K2513J7437J3215j0024j3033
14057B0129j8990k5489J5026r359k0028J0060P661L691J2466R12O911m162l5J4958
14043A3751K912n919o133n429k2116L22J9992L245j2766J5712n813p842J2282
14030B198j825k1114R669K3619K2537j5480r050j4630j9831R954J3839J5005j7689
14017b798l671K969L8546J6248N71k9799j5228j4571p247J2196j9174J2409o425
14004a5974q963K7581N072k8794r908L346j5049M1606L7606j011j0620l278K1685
$$ y = [-3801, 19592, 37954, 32546, 30438, 7232, -5485, -4377, -30296, -44902, -32256, -19518, -8839, 39524, 37055, 2857, 8352, -6422, -39948, -57757, -44428, -22590, -42139, -50216, -30339, -30151, -5180, 2838, 16485, 22588, 28710, -3076, -9979, 12534, 29971, 43186, 33162, 20129, 1139, -24350, -9324, -18683, -38711, -28651, -20990, -17299, -4833, -3921, 2990, -1172, -1207, 13751, 16663, 10744, 4611, -818, -22934, -22612, -2620, 625, -12141, 3571, -2242, -10084, 2198, 373, -20741, -11072, 12547, 35084, 19604, 10554, -4076, -23907, -13953, -114, 14891, -2798, -6469, -3500, 35046, 51294, 51865, 22066, 6838, -7733, -14980, -2784, -21958, -9549, -15974, -24937, 2644, 7716, -21078, -30986, -27640, -42689, -1083, 36523, 35512, 24892, 21614, 43299]
13991D3299l099m714Q098l1659j9149J2368M8329J3991k3649l4957L084j9792
13979g850k5702j4620L0087M7653Q66j4360k3686P370l34n812q355J8255M733
13966H245O215K031j6918j138J8460L358p089M015r555j0459P089O571J4360p111
13952A8074l153O253j2613r890J9406O031J4236j5148n9990j9101L4198K2077
13940C80k2838k3698Q992K1779J2731L193k956K6570P316j8466j0305r615j7418
13927b4335L8672j245l0652J01R936k2199K37K1078J6842J805k3585r473K4354
13914A536n502N420O737j2113j1532K381n784K6054J2054Q84k6086l3622L672
13901c5901K8356K475k392P783k0393J3213r315J9430J7829j8692M476j988l329
$$ y = [43299, 40200, 35486, 43584, 11925, -7224, 5144, 53473, 67464, 43815, 8858, 11942, -7850, -33552, -48172, -18085, 29568, 30434, 16074, -7612, -242, -576, -6388, -14743, 3512, 8245, 14460, 16491, -427, -1565, 16895, 20253, 13164, 17179, 7624, -2835, 4254, 10825, 25185, 18074, 14921, 21174, 8561, -1329, 18077, 24108, 38344, 23196, -36794, -55895, -21697, 380, -22458, -46156, -37164, -15385, -2654, 539, -2417, 24153, 31469, 13003, 2698, -6917, -24335, 14337, 13092, -17560, -17459, -7523, -29722, -29485, -8407, 8435, 10240, -13345, -22818, 1536, -3966, 1454, 8191, -3922, -15454, -13073, -18857, 7197, 19251, 20135, -5951, -39573, -35901, -7545, -5070, -7462, 321, -20072, -6859, -16174, 3256, 21085, 2393, 6869, 4881, 1552]
13888A552k113J5423o501k3563J1568J6981L2220Q999r876k5432j8942n80K8108
13875B7844K5293k9463m7528k5858k085q578J4431J5957p87k9349J279M222J9083
13862c5539J3911J5418q024m1722p576K9988L4147l178k5694m158M8591K7493
13850D3657j8149k4262j677l2788j0365K2134K9840J26m976j1089K3652J302j365
13837A6040m948m510k1000k3548k3292k184N5191O161o101p524N782J7418q377
13824h92k0310k4320j7741L999J7297J559j2333J2930K4333K955k8356k2433m601
13811f7913L1387K5029m765r492j2249j502K378L0156K6113O669L5116k5892m3167
13798h132O451K703J3306K5228l332O787l660l280l0229k924J470k194L5409q633
$$ y = [1552, -561, 14862, 8361, -15202, -3634, 13347, 45567, 54566, 44690, 19258, 316, -264, 27844, 53137, 23674, -23854, -49712, -51797, -60375, -45944, -29987, -30774, -60123, -58844, -54622, -35539, -21628, -6210, -14234, -55956, -63532, -33544, 603, -2575, -28269, -32427, 16164, 43657, 25508, 1246, -431, -33219, -43584, -21450, 8390, 8516, 3540, -7549, 16103, 17405, 16040, 11092, 6582, -14418, -37966, -61258, -63442, -8251, -2090, -8191, -15715, -9933, 7485, -892, -21202, -45522, -63263, -59264, -41967, -40408, -52741, -39811, -15478, -12523, -40879, -63312, -67913, -36526, -11497, -16262, -25754, -38003, -39505, -37127, -6971, 19142, 25811, 60927, 35035, -8132, -1681, 1022, 14328, 39556, 36224, 43011, 39351, 36071, 5842, 2918, 4388, 2194, 37603, 28970]
13784B8970q085O718L478j378J6247j3160l3059N006J7267K607j1561Q792J339
13771B3181J3335J1958j5686m59M466j7289K803j7448K748m031o600O985O074
13758A0037K3874M668l4026n816Q813K8735J53j1876j6103k8092K292J8112P382
13745H153J2845l1179m2412R29N755J1046L4660J8350J7289j5141l0856m745J0080
13732e226K055K9195J7847m320j8289l4737m968J1678j572K0106P62j180k3402
13719a2051j44J2973l1372L103J9536J8515j3706k7056J9057L1916j4172l7752
13707c1153n595J9526J0545L1058r482q001N404p07R445l944l628J463j602j861
13693A1468n562N525k2867O350J4315P536k1449l5609j366J9770N9071j2691j6560
$$ y = [28970, 20885, 27603, 31081, 29703, 45950, 32790, -269, 4737, 22004, 24611, 13050, 21842, 23181, 36516, 48474, 32788, 32329, 36795, 19506, 22309, 4861, 7609, 3578, -3022, 3963, 10037, 33911, 38579, 4553, -1263, 7550, 36285, 36438, 24562, 8459, -19633, -17341, 771, 8153, 20998, -10181, -52593, -51664, -45909, -34863, -203, 18147, 35436, 20295, -10561, -15306, -5226, -3171, 26024, 43871, 39551, 21262, -13475, -18443, -6765, -8337, 11769, 12531, 11351, -12051, -12195, 778, -30594, -27491, -7955, 10560, -3146, -30202, -11145, 20771, 6599, -31153, -36748, -17222, -6677, 24381, 14899, 6898, 12302, 11595, 21040, 17096, 13468, 14931, 13329, 11468, 5906, 11431, -11436, -5086, 9229, 16765, -4684, -40293, -41659, -21889, 37182, 24491, 7931]
13680G931O186l5166J2191L6220l178j0080j0575J9538l4113M762K398J6272p286
13667E100l3602n429L566J5184J0534k1464k824K5764J7054k685L555J7094l808
13654B8039q475k348J6863j1j1338k5548j8469J3573l794j0363J489M059M674
13641a1649q044M794j2627J4745M2348K0649k7770L587j2392k3531J658j4461
13629b2693p953J1997L991j2172J2705J7037j2388K0447K8183r305l4593k0887
13617b5631J561J2304J3104Q586l2884J337J7767P105K4706j7645n378J1319p257
13604H994k6961K0332J3788K2190J833l3012L781K9391K9995j6759l4725k908
13592A5939j3550k527k8434r124R945K8109L1709O134o181k4310k3841P429J5652
$$ y = [7931, 14117, -21049, -8858, 27362, 24184, 14104, 3529, 23067, -11046, -6284, -3886, 12386, 5100, -28502, -33931, -30365, -15181, -4647, -26111, -28935, -3171, 13883, 11198, 14753, 31847, 28039, 19564, 17216, 34079, 34068, 22730, -2818, -21287, -7714, -11508, -21871, -20382, -16323, -11649, -19693, -14899, -27526, -12781, 29567, 50216, 22446, 26033, 13641, -9890, -8232, -22693, -30646, -18649, -14658, -26830, -14125, 2912, -9476, 10971, 39154, 29849, -4744, -25631, -24070, -11766, 1338, 9924, -22960, -21623, -3856, 3249, 27955, 10310, 4932, 16251, 8994, -17967, 2365, 16153, 38343, 40176, 7164, 10945, 40336, 70331, 53572, 18847, 15939, 2389, -138, -28572, -37696, -27751, 358, 32067, 38201, 32020, 7710, -16131, -8702, 6950]
13579F950M0035M419l3311k1435K29M991J0576q001j3045p787J5999L49J625J274
13565B868q007J7094N515J1671k7165J6804K236m044j8454J6136K9694j8885k7212
13552a749J464N893J8829K5495J9172l1979k6617L627J0227P226k2695l3894Q53
13539b4148J1248J4366J3364k1460k0255q119K1215K1703k240j3559k0143l519
13527c1547K7011K7345o983l422N58M171R215k5647j4590K2446O925K3541k9135
13514I888k1906O034N786J7449K6456J6395L254j2333j9764n417J9660j4791k6668
13501D043k0446K8359l432O171J9827j8464l1944R991P289l592l783Q20q247k221
13487a5629R540L2173N232k2107j6204J845J7771K3974o200k1174j7323n727p799
$$ y = [6950, 46985, 51404, 18093, -3342, -3113, 1878, 12454, 4453, -8592, -16379, -380, -31, 1594, 2868, -5139, 11955, 17470, 29141, 1976, 18780, 21016, 16972, -1482, 14654, 44348, 25463, -1749, -285, 5608, 24437, 49932, 69104, 37125, 10508, 14135, 24362, 31588, 8893, -25001, -24148, -12900, 1466, 14830, -6630, -26885, -35004, -13789, 7914, 5674, -7885, -28028, -31547, -4536, 22809, 15826, 12404, 12962, 17133, 26348, 701, -13889, 8557, 15482, 39023, 9888, -12018, -5984, -198, 17251, 43707, 60102, 63356, 51023, 31259, 25842, 45502, 30711, 4043, -16403, 11956, 8524, 14695, 34522, 16058, -15886, -5895, 1394, -2198, -5981, -5161, -13408, -15629, -6089, 26084, 31316, 9209, -6995, -5150, 12621, 36595, 30395, 9221, -8102, -13829, -21628]
13474b1628Q930K6227K9115n177k0757m775J1315k1343j4075J6028M154k2770
13462a4756j3079K5032L3704J5804M903k5804j9917j3400J8708K4895l2337j3892
13450a0139J0622J8948Q851l4085k0920J431J894K7627J1620k0926l2431k1932
13438e9440K2542K1456J6201J6806K730l9679k9785j5509j7350J0264L1791M5213
13426E240K755k3718k469J7633k731j6092q855J2807J2696N383J1886k3310O250
13413b525J7761L099k0311n599J5176K4074k2466j5025Q233J4231K077P758k1890
13400D593M246j373k295K940j9271j1250L5855J5975m2422l5684L5132M4751j2963
13387A8234j7124R599r363j7838l767M531J4869N200n72K13J5065n800j6748m163
$$ y = [-21628, -12698, 13529, 42644, 37467, 16710, 11935, 23250, 1907, -12168, 3860, 8014, -14756, -27835, -2803, 30901, 46705, 51608, 25804, 5887, -7513, 11195, 36090, 3753, -10139, 483, 19431, 28282, -5803, -26723, -25292, -23398, 4229, 15849, -5077, -37508, -59440, -36898, -15442, 759, 17565, 20295, -19384, -49169, -64678, -82028, -71764, -39973, 5240, 7995, -15723, -18192, -559, -3290, -19382, -28237, -15430, -2734, 2649, 14535, -8775, -2525, 15236, 18335, -1976, -7575, 7601, 31675, 9209, -5816, 2417, 16648, 18725, 26483, 4593, 8839, 7466, 5171, 8111, -11160, -22410, 13445, 29420, -13002, -48686, -13554, 31197, 18234, 1110, 10709, 1346, -16492, -20259, -15728, -859, 4341, 3769, 3982, 19047, 13247, -3501, -7664]
13373g664J0174R280j1215K405L217p11J7882m797j736M516k5860l7000L072J8185
13359b0252K1275K2120m125K28j9704m172K972m54N642N112J5272j0925J1246
13346B4235J5702Q540k0293p984j9711K0625L859k4260J1382j237j5004J037M482
13333A373o997K0663K828k486P711J707j2026J7980J5991K431R556k3760p658
13320B7313j9578K2833K9646L059r124k9759j8223k1756J0500Q705P910j127j3378
13307b979o374L775o545j1907J7455J8756J7585K9711O736m1324j5083K770J8328
13294C0904o285J9654j3806m864l6280K8884o18q97J6882j5193j3215K3489R876
13281C8531J59n994J9350l362P662K4396k288l1344k8880o611M598q879j9074
$$ y = [-7664, 2510, 11790, 575, 2980, 6197, 5486, 23368, 18571, 16835, 21351, -4509, -41509, -38437, -20252, 1023, 23143, 19018, 19246, -458, -4630, -1658, -2112, 3530, 8642, 23914, 12989, 24235, 39937, 48477, 28184, 20200, 489, 21114, 24973, 713, 12095, 10858, -4146, -3109, 1373, -5624, 15039, 17867, 15381, 23092, 24799, 12773, 30753, 46744, 49175, 58731, 34971, 27313, 7735, 30568, 60214, 63273, 54149, 24390, 6167, -15589, -5089, 3616, 11526, 10399, -2979, -9353, -5578, -12123, -24030, -6575, 12181, 29766, 59477, 66213, 24889, 9806, 12576, 30904, 24619, 44273, 30467, 25603, -10677, 18207, 17589, 16692, 33574, 18381, 5166, 28655, 38531, 38690, 32696, 52046, 48684, 56346, 80742, 78454, 47110, 18230, 11619, 16217, 7338, -11736]
13268a1736k0898R563N098J7300K5891j7418k3369l1053n430j21R001k0355j3143
13255g6670J7260K1729p044J1428K3594K145n5713l1181J6719K9020J1708J2242
13243b4763R420k6620J3021L0533J8302r467n347L6102j2396l7335R99K6893L2256
13230E1598l3149j3992J6639m869O116j4471j7897K0542J8665J0782q744M161
13218C5381j7057l307j0760l0734k1189R069N131n321K3380K832o916l341J1765
13205a1067O136l860q527j330K8794j0270R068M688j224j0448K896r529P819m90
13191B656j4370n203Q907L8431K8136k0626j5772k4297J686m837O085J1439L256
13178A5491k9224m262K4888r678l996n020r006k832j088J0765n315l8312j830
$$ y = [-11736, -32634, -23071, -17973, -673, 25218, 7800, -15569, -46622, -52052, -52173, -43172, -63527, -76670, -59410, -37681, -44725, -33297, -9703, -7558, -63271, -94452, -77733, -48713, -37005, -24763, -15343, -41963, -28942, 1591, 19893, 10426, 5079, 41181, 28785, -8550, -7551, 19342, 51598, 18449, 4457, 21096, 16227, 22343, 7872, -10025, 10517, 29182, 39964, 31220, 35381, 18324, 15017, 4257, -26477, -47666, -38597, -33466, -38787, -15407, -12575, -19491, -22832, -11067, -4931, -8791, -17318, -18648, 10146, -124, 8944, 13632, 12408, 1960, 4856, -4673, 3146, 2656, -11714, -16917, -8010, 30421, 58557, 37931, 22159, -2138, -452, -5289, 796, 12235, 15491, -13733, -17995, 6893, -2785, -6781, -11801, -20807, -23639, -24727, -13962, -19277, -57589, -59419]
13165e9419J1226K0476J1126j1227R539K2111K187j4951q847M659K4304n122J312
$$ y = [-59419, -48193, -27717, -16591, -27818, -18279, 3832, 6019, -8932, -17779, -13120, 11184, 6062, 7374]
$$ [...]
##END NTUPLES=NMR SPECTRUM
##END=
