##TITLE=Analysis number 328769
Compound Code tl 00596
Project Code adrs
Chemist Name prosynth
##JCAMPDX= 6.0         $$ Bruker NMR JCAMP-DX V2.0
##DATA TYPE= NMR SPECTRUM
##DATA CLASS= NTUPLES
##ORIGIN= Bruker BioSpin GmbH
##OWNER= nmr
$$ XWIN-NMR		Version 3.5
$$ Tue Jul  3 08:49:05 2007 GMT Daylight Time (UT+1h)  MAYBRIDGE\nmr@NMR_250MHZ
##.OBSERVE FREQUENCY= 250.131544655141
##.OBSERVE NUCLEUS= ^1H
##.ACQUISITION MODE= SIMULTANEOUS (DQD)
##.ACQUISITION SCHEME= undefined
##.AVERAGES= 16
##.DIGITISER RES= 18
##SPECTROMETER/DATA SYSTEM= dpx250
##.PULSE SEQUENCE= zg30
##.SOLVENT NAME= CDCl3
##.SHIFT REFERENCE= (INTERNAL, CDCl3, 0, 16.522)
##AUDIT TRAIL= $$ (NUMBER, WHEN, WHO, WHERE, WHAT)
$$ ##TITLE= Audit trail, XWIN-NMR		Version 3.5
$$ ##JCAMPDX= 5.01
$$ ##ORIGIN= Bruker BioSpin GmbH
$$ ##OWNER= nmr
$$ C:\u/data/dgb/nmr/ADRS/180/pdata/1/auditp.txt
$$ ##AUDIT TRAIL=  $$ (NUMBER, WHEN, WHO, WHERE, WHAT)
(   1,<2007-07-03 08:48:42.65 +100>,<MAYBRIDGE\nmr>,<NMR_250MHZ>,
      <created by zg, POWCHK disabled, PULCHK disabled
       configuration hash MD5:
       76 6E 9A 78 1E 09 19 81 EC 84 63 8F B0 6A 59 2D
       data hash MD5: 64K
       E1 CB 8F E3 3B 45 90 F5 5D 06 8A 15 1D E2 04 29>)
(   2,<2007-07-03 08:48:56.54 +100>,<MAYBRIDGE\nmr>,<NMR_250MHZ>,
      <Start of raw data processing
       ef LB = 0.3 FT_mod = 6 PKNL = 1 SI = 32K 
       data hash MD5: 32K
       0C D5 CD D5 DF A5 B9 F4 39 89 3B 64 89 CA 5E 81>)
(   3,<2007-07-03 08:48:58.15 +100>,<MAYBRIDGE\nmr>,<NMR_250MHZ>,
      <apk 
       data hash MD5: 32K
       A4 FF 6C EC 1D 00 4E 45 98 2E E8 64 45 82 27 61>)
(   4,<2007-07-03 08:48:58.85 +100>,<MAYBRIDGE\nmr>,<NMR_250MHZ>,
      <abs ABSG = 5 
       data hash MD5: 32K
       7D 58 E8 8F B5 09 80 A8 EC F6 E3 92 BE 2F B5 08>)
$$ ##END=
$$ 
$$ hash MD5
$$ B1 63 A5 D1 2F FA 7D BF E7 79 95 27 56 E2 5C 00
##$RELAX= 
##$RELAX= 
##$RELAX= 
##$RELAX= 
##$RELAX= 
##$RELAX= 
##$RELAX= 
$$ Bruker specific parameters
$$ --------------------------
##$DU= <C:\u>
##$EXPNO= 180
##$NAME= <ADRS>
##$PROCNO= 1
##$TYPE= <nmr>
##$USER= <dgb>
##$AMP= (0..31)
100 100 100 100 100 100 100 100 100 100 100 100 100 100 100 100 100 100 
100 100 100 100 100 100 100 100 100 100 100 100 100 100 
##$AQSEQ= 0
##$AQ_mod= 3
##$AUNM= <au_zg>
##$AUTOPOS= <2 >
##$BF1= 250.13
##$BF2= 250.13
##$BF3= 250.13
##$BF4= 250.13
##$BF5= 500.13
##$BF6= 500.13
##$BF7= 500.13
##$BF8= 500.13
##$BYTORDA= 1
##$CFDGTYP= 0
##$CFRGTYP= 5
##$CHEMSTR= <none>
##$CNST= (0..31)
1 1 145 1 1 1 1 1 1 1 1 1 1 1 1 1 1 1 1 1 1 1 1 1 1 1 1 1 1 1 1 1 
##$CPDPRG= <>
##$CPDPRG1= <>
##$CPDPRG2= <>
##$CPDPRG3= <>
##$CPDPRG4= <mlev>
##$CPDPRG5= <mlev>
##$CPDPRG6= <mlev>
##$CPDPRG7= <mlev>
##$CPDPRG8= <mlev>
##$CPDPRGB= <>
##$CPDPRGT= <>
##$D= (0..31)
0 1 0 0 0 0 0 0 0 0.06 0 0 0 0 0 0 0.0002 0 0 0 0 0 0 0 0 0 0 0 0 0 0 
0 
##$DATE= 1183448921
##$DBL= (0..7)
120 120 120 120 120 120 120 120 
##$DBP= (0..7)
150 150 150 150 150 150 150 150 
##$DBP07= 0
##$DBPNAM0= <>
##$DBPNAM1= <>
##$DBPNAM2= <>
$$ [...]
##$SUBNAM7= <"">
##$SUBNAM8= <"">
##$SUBNAM9= <"">
##$SW= 20.6930455092707
##$SWIBOX= (0..15)
0 0 3 0 0 0 0 0 0 0 0 0 0 0 0 0 
##$SW_h= 5175.983436853
##$TD= 65536
##$TD0= 1
##$TE= 296.16
##$TE2= 300
##$TE3= 300
##$TEG= 300
##$TL= (0..7)
0 120 120 120 120 120 120 120 
##$TP= (0..7)
150 150 150 150 150 150 150 150 
##$TP07= 0
##$TPNAME0= <>
##$TPNAME1= <>
##$TPNAME2= <>
##$TPNAME3= <>
##$TPNAME4= <>
##$TPNAME5= <>
##$TPNAME6= <>
##$TPNAME7= <>
##$TPOAL= (0..7)
0.5 0.5 0.5 0.5 0.5 0.5 0.5 0.5 
##$TPOFFS= (0..7)
0 0 0 0 0 0 0 0 
##$TUNHIN= 0
##$TUNHOUT= 0
##$TUNXOUT= 0
##$USERA1= <user>
##$USERA2= <user>
##$USERA3= <user>
##$USERA4= <user>
##$USERA5= <user>
##$V9= 5
##$VALIST= <valist>
##$VCLIST= <CCCCCCCCCCCCCCC>
##$VD= 0
##$VDLIST= <DDDDDDDDDDDDDDD>
##$VPLIST= <PPPPPPPPPPPPPPP>
##$VTLIST= <TTTTTTTTTTTTTTT>
##$WBST= 1024
##$WBSW= 4
##$XGAIN= (0..3)
0 0 0 0 
##$XL= 0
##$YL= 0
##$YMAX_a= 352525
##$YMIN_a= -252025
##$ZGOPTNS= <>
##$ZL1= 120
##$ZL2= 120
##$ZL3= 120
##$ZL4= 120
##$ABSF1= 16.522
##$ABSF2= -4.171173
##$ABSG= 5
##$ABSL= 3
##$ALPHA= 0
##$AQORDER= 0
##$ASSFAC= 0
##$ASSFACI= 0
##$ASSFACX= 0
##$ASSWID= 0
##$AUNMP= <proc_1d>
##$AZFE= 0.1
##$AZFW= 0.1
##$BCFW= 0
##$BC_mod= 0
##$BYTORDP= 0
##$COROFFS= 0
##$CY= 12.5
##$DATMOD= 1
##$DC= 0
##$DFILT= <>
##$DTYPP= 0
##$F1P= 14.0000005364418
##$F2P= -0.99999901652339
##$FCOR= 0.5
##$FTSIZE= 32768
##$FT_mod= 6
##$GAMMA= 0
##$GB= 0
##$INTBC= 1
##$INTSCL= 1
##$ISEN= 128
##$LB= 0.3
##$LEV0= 0
##$LPBIN= 0
##$MAXI= 10000
##$MC2= 0
##$MEAN= 0
##$ME_mod= 0
##$MI= 0
##$NCOEF= 0
##$NC_proc= -4
##$NLEV= 6
##$NOISF1= 0
##$NOISF2= 0
##$NSP= 0
##$NTH_PI= 0
##$NZP= 0
##$OFFSET= 16.522
##$PC= 1
##$PHC0= -50.47106
##$PHC1= 7.603105
##$PH_mod= 1
##$PKNL= yes
##$PPARMOD= 0
##$PSCAL= 4
##$PSIGN= 0
##$REVERSE= no
##$SF= 250.13
##$SI= 32768
##$SIGF1= 0
##$SIGF2= 0
##$SINO= 400
##$SIOLD= 32768
##$SREGLST= <1H.CDCl3>
##$SSB= 0
##$STSI= 32768
##$STSR= 0
##$SW_p= 5175.98343685301
##$SYMM= 0
##$S_DEV= 0
##$TDeff= 65536
##$TDoff= 0
##$TI= <Analysis number 999999
Compound Code 99
Book Reference 9
Project Code 9>
##$TILT= no
##$TM1= 0
##$TM2= 0
##$TOPLEV= 0
##$USERP1= <user>
##$USERP2= <user>
##$USERP3= <user>
##$USERP4= <user>
##$USERP5= <user>
##$WDW= 1
##$XDIM= 32768
##$YMAX_p= 347890253
##$YMIN_p= -227061
$$ End of Bruker specific parameters
$$ ---------------------------------
##NTUPLES= NMR SPECTRUM
##VAR_NAME=  FREQUENCY,     SPECTRUM/REAL,   SPECTRUM/IMAG
##SYMBOL=    X,             R,               I
##VAR_TYPE=  INDEPENDENT,   DEPENDENT,       DEPENDENT
##VAR_FORM=  AFFN,          ASDF,            ASDF
##VAR_DIM=   32768,         32768,           32768
##UNITS=     HZ,            ARBITRARY UNITS, ARBITRARY UNITS
##FACTOR=    0.157963299565203, 1,           1
##FIRST=     4132.6476996994, 0,             0
##LAST=      -1043.33573715361, 0,           0
##MIN=       -1043.33573715361, -227061,     0
##MAX=       4132.6476996994, 347890253,     0
$$ Real data points
##PAGE= N=1
##DATA TABLE= (X++(R..R)), XYDATA
$$ [...]
$$ plain form
19870 69710 21753 -4633 25443 16440 -65071 -35822 -46204 13608 19877 -18329 -84492 -59187
19858 -59187 -95021 -155630 -155109 -96630 -16568 3246 23599 -13020 -29580 -3135 18257 17073
19846 17073 36768 10968 -33984 -63148 -96130 -100668 -95947 -99785 -72721 -52114 -21639 17701
19834 17701 30054 34288 -31041 -19385 -15619 1635 2623 -10359 42850 100583 42875 -40235
19822 -40235 -46859 -21959 -119801 -122288 -93353 -125380 -90108 -87375 -125005 -86843 -57217 -9544
19810 -9544 45639 84050 36103 72740 97666 34515 -3668 -7044 5438 -19478 -17955 -15765
19798 -15765 -24992 -58 51255 3594 -59417 -32960 1713 46325 109026 86565 95526 65238
19786 65238 6004 -40177 -47603 -38550 -24868 -13090 -6975 -57248 -39672 -24983 -40318 -32787
$$ packed form
19870F9710m7957k6386L0076r003q1511K9249j0382N9812O269l8206o6163K5305
19858e9187l5834o0609N21N8479Q0062J9814K0353l6619j6560K6445K1392j184
19846A7073J9695k5800m4952k9164l2982m538M721l838K7064K0607L0475L9340
19834A7701J2353M234o5329J1656L766J7254R88j2982N3209N7733n7708q3110
19822d0235o624K4900r7842k487K8935l2027L5272K733l7630L8162K9626M7673
19810i544N5183L8411m7947L6637K4926o3151l8183l376J2482k4916J523K190
19798a5765r227K4934N1313m7661o3011K6457L4673M4612O2701k2461Q961l0288
19786F5238n9234m6181p426R053J3682J1778O115n0273J7576J4689j5335P531
$$ plain form
19774 -32787 -2787 51814 27519 -19570 -18621 -17780 -17848 30016 30609 63676 25524 -11563 25046
19761 25046 45315 68928 63830 50366 24827 8503 73458 70297 -45835 -73038 -23423 16211
19749 16211 34845 65656 67983 89357 90460 94234 91732 101074 55385 13860 44119 78237 33719
19736 33719 -26082 -10015 -2336 -11576 -103820 -98398 -55192 -29750 -35427 -12444 -3803 29450 7899
19723 7899 -24096 38227 68570 70384 44976 -4673 -72533 -108575 -60668 -1168 12503 16973
19711 16973 38588 46095 94679 82169 -3104 -53909 -49383 -15630 -14945 -1162 21415 73880
19699 73880 107040 88362 18698 -1036 -35353 -92022 -114487 -83745 -51177 -35249 -58736 -61944
19687 -61944 7357 81842 110940 90671 63976 49712 53357 1935 34095 -973 -36728 -31204
$$ packed form
19774c2787L0000N4601k4295m7089R49Q41o8M7864N93L3067l8152l7087L6609
19761B5046K0269K3613n098j3464k5539j6324O4955l161j16132k7203M9615L9634
19749A6211J8634L0811K327K1374J103L774k502R342m5689m1525L0259L4118m4518
19736C3719n9801J6067P679r240r2244N422M3206K5442n677K2983Q641L3253k1551
19723G899l1995O2323L0343J814k5408m9649o7860l6042M7907N9500J3671M470
19711A6973K1615P507M8584j2510q5273n0805M526L3753O85J3783K2577N2465
19699G3880L3160j8678o9664j9734l4317n6669k2465L0742L2568J5928k3487l208
19687f1944O9301P4485K9098k0269k6695j4264L645n1422L2160l5068l5755N524
$$ plain form
19675 -31204 3891 43989 28596 16816 27933 105363 159367 147767 88696 6244 -12142 -25789
19663 -25789 -74173 -65906 -31978 18346 -8314 -24674 52769 117347 41046 -10856 15369 -29318
19651 -29318 -875 -13703 -9021 41843 54626 51845 71394 46580 -1939 16985 10932 14261
19639 14261 55374 39924 43906 29608 26347 10669 39735 50093 79933 80277 -2564 -1226 35432
19626 35432 129449 150857 144380 128898 103100 52932 43214 45767 62510 104909 107303 70700
19614 70700 64280 53129 30944 -33108 -40090 -56629 -46427 -36894 -46387 -47027 572 6461 -31945
19601 -31945 -11304 50729 59704 111169 154937 138608 109661 84042 78032 41539 -13919 -8591
19589 -8591 -32157 -42295 -61936 -42348 -58504 -47693 12419 17322 31848 27121 -5088 -26413
$$ packed form
19675c1204L5095M0098j5393j1780J1117P7430N4004j1600n9071q2452j8386j3647
19663b5789m8384Q267L3928N0324k6660j6360P7443O4578p6301n1902K6225m4687
19651b9318K8443j2828M682N0864J2783k781J9549k4814m8519J8924o053L329
19639A4261M1113j5450L982j4298l261j5678K9066J0358K9840L44q2841J338L6658
19626C5432R4017K1408o477j5482k5798n0168r718K553J6743M2399K394l6603
19614G0700o420j1151k2185o4052o982j6539J0202R533r493o40M7599N889l8406
19601c1945K0641O2033Q975N1465M3768j6329k8947k5619o010l6493n5458N328
19589h591k3566j0138j9641J9588j6156J0811O0112M903J4526m727l2209k1325
$$ plain form
19577 -26413 -21560 40072 67526 53738 61946 18097 -26873 -23802 -7576 17315 -11103 -20153
19565 -20153 -52002 -67334 -72056 -14650 22667 72752 85038 90433 79338 60296 66886 41686
19553 41686 -14829 -13332 17341 56151 62012 34868 10162 -22915 5166 49609 75137 84195
19541 84195 51036 -25723 -95472 -101256 -125987 -62197 -440 -46634 -31899 -7228 -4485 30780
19529 30780 77586 14822 24919 43178 29258 21649 -17703 -9800 27185 18084 31806 -5990
19517 -5990 -74999 -60338 -15468 12935 30499 79817 37425 -25397 -8965 29484 21682 5690
19505 5690 -26449 16013 45886 50996 63386 5622 22047 85283 126242 139124 158206 171666
19493 171666 202235 320280 496318 645883 749348 739342 661652 523182 443887 358389
$$ packed form
19577b6413M853O1632K7454j3788Q208m3849m4970L071J6226K4891k8418r050
19565b0153l1849j5332m722N7406L7317N0085J2286N395j1095j9042O590k5200
19553D1686n6515J497L0673L8810N861k7144k4706l3077K8081M4443K5528R058
19541H4195l3159p6759o9749n784k4731O3790O1757m6194J4735K4671K743L5265
19529C0780M6806o2764J0097J8259j3920p609l9352P903L6985r101J3722l7796
19517e990o9009J4661M4870K8403J7564M9318m2392o2822J6432L8449p802j5992
19505E690l2139M2462K9873N110J2390n7764J6425O3236M0959J2882J9082J3460
19493A71666L0569J18045J76038J49565J03465j0006p7690j38470p9295q5498
$$ plain form
19483 358389 268860 242048 238687 264796 277031 299315 442054 606643 685896 766448 742119
19472 742119 558840 474572 479693 496049 512537 482459 442218 333450 267935 266927 217182
19461 217182 154342 127893 132315 125446 84628 122550 128659 107671 149959 65186 66456 108557
19449 108557 84170 143446 231347 300947 325060 286522 206920 129315 122416 139379 114944 134942
19437 134942 173862 179054 278418 453040 689611 889046 937612 952785 846001 736367 629856
19426 629856 656565 729967 736948 714907 655695 649255 639886 753840 888167 845258 654992
19415 654992 424439 271682 222886 186647 189227 197447 214420 214677 161265 166911 204825 178800
19403 178800 142137 143366 131420 113405 114923 145930 83958 57409 -3974 -5447 46390 93757
$$ packed form
19483C58389q9529k6812l361K6109J2235K2284J42739J64589P9253Q0552k4329
19472G42119j83279q4268N121J6356J6488l0078m0241j08768o5515j008m9745
19461B17182o2840k6449M422o869m0818L7922O109k0988M2288q4773J270M2101
19449A08557k4387N9276Q7901O9600K4113l8538p9602p7605o899J6963k4435J9998
19437A34942L8920N192R9364J74622K36571J99435M8566J5173j06784j09634j06511
19426F29856K6709P3402O981k2041n9212o440r369J13954J34327m2909j90266
19415F54992k30553j52757m8796l6239K580Q220J6973K57n3412N646L7914k6025
19403A78800l6663J229j1946j8015J518L1007o1972k6549o1383j473N1837M7367
$$ plain form
19391 93757 97945 192090 250660 204620 121733 53441 63455 64179 74790 120404 91828 117206
19379 117206 144801 93615 33199 -6870 55389 47274 10113 18962 27996 30571 8812 22569
19367 22569 -13003 -423 47583 45818 8621 6229 -32847 -131636 -77368 -1102 10690 45801
19355 45801 90284 121704 137354 115510 64632 52794 60414 88519 91840 27200 53354 72099
19343 72099 69025 45646 76097 128487 184356 150302 102045 36332 24088 -18104 10690 74562
19331 74562 108469 133350 186627 201561 207962 185024 145843 136095 50209 1459 -8940 -8064
19319 -8064 7187 56477 127275 86215 69044 99981 106303 118909 154905 236792 236857 258526 264554
19306 264554 293324 349963 352828 322707 390040 459980 535056 574241 546092 447271 403093 323516
$$ packed form
19391I3757M188R4145N8570m6040q2887o8292J0014P24J0611M5614k8576K5378
19379A17206K7595n1186o0416m0069O2259q115l7161Q849R034K575k1759J3757
19367B2569l5572J2580M8006j765l7197k392l9076r8789N4268P6266J1792L5111
19355D5801M4483L1420J5650k1844n0878j1838P620K8105L321o4640K6154J8745
19343G2099l074k3379L0451N2390N5869l4054m8257o5713j2244m2192K8794O3872
19331G4562L3907K4881N3277J4934O401k2938l9181r748q5886m8750j0399Q76
19319h064J5251M9290P0798m1060j7171L0937O322J2606L5996Q1887O5K1669O028
19306B64554K8770N6639K865l0121O7333O9940P5076L9185k8149r8821m4178p9577
$$ plain form
19294 323516 344675 484312 645002 750615 724665 663940 703211 713913 633843 465850 315053
19283 315053 219429 188808 260237 284882 316289 406353 431760 359336 273721 233739 217707
19272 217707 197200 215271 207370 218802 152159 114092 126726 142549 137171 168822 178902 168914
19260 168914 169187 235202 299848 402291 406561 388909 448288 604205 694211 658146 574097 508919
19248 508919 508799 527398 616768 790732 964429 1020347 995632 895887 792092 687285 588450
19237 588450 479256 406055 442006 566600 657026 783853 883926 817946 719735 731851 740743
19226 740743 720373 656244 552973 444982 430488 455762 418894 333063 267554 219035 214320
19215 214320 278102 254618 197201 197190 224525 240462 230937 206360 232873 229036 198706 199395 217384
$$ packed form
19294C23516K1159J39637J60690J05613k5950o0725L9271J0702q0070j67993j50797
19283C15053r5624l0621P1429K4645L1407R0064K5407p2424q5615l9982j6032
19272B17707k0507J8071p901J1432o6643l8067J2634J5823n378L1651J0080r988
19260A68914K73O6015O4646J02443M270j7652N9379J55917R0006l6065q4049o5178
19248E08919j20J8599Q9370J73964J73697N5918k4715r9745j03795j04807r8835
19237E88450j09194p3201L5951J24594R0426J26827J00073o5980r8211J2116Q892
19226G40743k0370o4129j03271j07991j4494K5274l6868q5831o5509m8519m715
19215B14320O3782k3484n7417j1K7335J5937r525k4577K6513l837l0330O89J7989
$$ plain form
19202 217384 161986 142740 168153 155436 173435 151248 78613 54671 104039 103259 94116 113118
19190 113118 125496 109221 132963 135717 135373 168518 180827 218002 214644 211583 200740 137346
19178 137346 124869 118989 142601 165768 164726 96341 124799 207334 282026 358361 430917 444250
19166 444250 363248 274576 257050 266119 205957 152960 156839 160287 205154 203012 201107 193957 198577
19153 198577 208145 176584 106700 53657 56489 57176 116486 122268 186008 217438 184534 161624
19141 161624 137271 86161 112833 126148 109326 141613 196717 183944 179064 164166 202085 302755
19129 302755 345127 281094 206795 233793 199376 149889 132968 175131 202125 197973 216763 275645
19117 275645 304579 301369 269663 262314 229237 200595 114172 138779 161574 203501 284753 348439
$$ packed form
19202B17384n5398j9246K5413j2717J7999k2187p2635k3942M9368p80r143J9002
19190A13118J2378j6275K3742K754l44L3145J2309L7175l358l061j0843o3394
19178A37346j2477n880K3612K3167j042o8385K8458Q2535P4692P6335P2556J3333
19166D44250q1002q8672j7526R069o0162n2997L879L448M4867k142j905p150M620
19153A98577R568l1561o9884n3043K832O87N9310N782O3740L1430l2904k2910
19141A61624k4353n1110K6672J3315j6822L2287N5104j2773m880j4898L7919J00670
19129C02755M2372o4033p4299K6998l4417m9487j6921M2163K6994m152J8790N8882
19117B75645K8934l210l1706p349l3077k8642q6423K4607K2795M1927Q1252O3686
$$ plain form
19105 348439 391802 387370 393933 407490 398478 360447 330579 316997 289229 193681 103417 68427
19093 68427 63415 69329 139810 201619 197162 214546 257138 318980 215547 157893 186134 198581
19081 198581 162785 148682 147956 171930 197213 186320 206184 239646 259125 296337 320543 306554
19069 306554 261087 223251 162828 211839 205721 221684 250701 289098 359759 417907 356474 323876
19057 323876 335653 343178 389023 359697 327001 336340 346878 444207 489350 475238 502749 580060
19045 580060 627731 655207 584762 455255 321697 165462 162340 149230 190706 264270 324255
19034 324255 389829 383376 301625 329029 365908 381382 448880 489731 568341 666050 682071 724212
19022 724212 701668 670833 714924 754076 807934 822044 833300 926667 976381 997325 1105580
$$ packed form
19105C48439M3363m432O563J3557r012l8031k9868j3582k7768r5548r0264l4990
19093F8427n012N914P0481O1809m457J7384M2592O1842j03433n7654K8241J2447
19081A98581l5796j4103p26K3974K5283j0893J9864L3462J9479L7212K4206j3989
19069C06554m5467l7836o0423M9011o118J5963K9017L8397P0661N8148o1433l2598
19057C23876J1777P525M5845k9326l2696R339J0538R7329M5143j4112K7511P7311
19045E80060M7671K7476p0445j29507j33558j56235l122j3110M1476P3564N9985
19034C24255O5574o453q1751K7404L6879J5474O7498M0851P8610R7709J6021M2141
19022G24212k2544l0835M4091L9152N3858J4110J1256R3367M9714K0944J08255
$$ plain form
19011 1105580 1242269 1418782 1553740 1679691 1856456 2038264 2265659 2490000 2644648
19002 2644648 2694774 2721141 2831642 2817680 2733131 2725621 2815042 3083709 3396270 3752054 4150426
18991 4150426 4546766 5098146 5959066 7378077 9743038 13452897 18506374 23143444 23984697
18982 23984697 21222369 17920315 15980754 15572977 16562646 19028583 23451229 31018359
18974 31018359 44200051 67215272 104900239 155153383 192380101 191557183 170394833
18967 170394833 148218639 123055700 93918938 68356101 51442491 42800538 40688320
18960 40688320 44520559 54178878 66832212 73061130 65330720 49623934 35286253 25518348
18952 25518348 19640068 16245335 14258928 12985470 11959212 10999093 10169720 9608077
$$ packed form
19011A105580J36689J76513J34958J25951J76765J81808K27395K24341J54648
19002B644648N0126K6367J10501j3962q4549p510Q9421K68667L12561L55784L98372
18991D150426L96340N51380Q60920J419011K364961L709859N053477M637070Q41253
18982B3984697k762328l302054j939561m07777R89669K465937M422646P567130
18974C1018359J3181692K3015221L7684967N0253144L7226718q22918k1162350
18967A70394833k2176194k5162939k9136762k5562837j6913610q641953k112218
18960D0688320L832239R658319J2653334O228918p730410j5706786j4337681r767905
18952B5518348n878280l394733j986407j273458j026258r60119q29373n61643
$$ plain form
18944 9608077 9291926 9141431 9069390 9081609 9162772 9437914 10029393 10998217 12206402 13754784
18934 13754784 16071625 19621869 25186369 34349406 49045844 69201300 87672923 91218109
18926 91218109 79064564 63307638 52477354 48453089 50980547 60771934 80081460
18919 80081460 112999908 162461713 223162006 283311677 330773507 340852676 291600233
18912 291600233 210668654 140340027 94106640 66554481 50372918 41058456 36068811
18905 36068811 34284503 35837306 41099111 48812404 53026258 47441749 36038109 25657037
18897 25657037 18657134 14459766 11933751 10247122 8913192 7773370 6870973 6185830
18889 6185830 5721776 5446702 5282667 5200395 5160666 5008942 4897181 4881303 4819172 4473563
$$ packed form
18944I608077l16151j50495p2041J2219Q1163K75142N91479R68824J208185J548382
18934A3754784K316841L550244N564500R163037J4696438K0155456J8471623L545186
18926I1218109j2153545j5756926j0830284m024265K527458R791387J9309526
18919H0081460L2918448M9461805O0700293O0149671M7461830J0079169m9252443
18912B91600233q0931579p0328627m6233387k7552159j6181563r314462m989645
18905C6068811j784308J552803N261805P713293M213854n584509j1403640j0381072
18897B5657037o999903m197368k526015j686629j333930j139822r02397o85143
18889F185830m64054k75074j64035q2272l9729j51724j11761j5878o2131l45609
$$ plain form
18879 4473563 3867798 3257335 2792197 2441532 2203207 2095399 1954760 1872461 1809633 1786472
18869 1786472 1752661 1804598 1754108 1676038 1599219 1540308 1555191 1470031 1342888 1308523 1304996
18858 1304996 1258449 1182663 1127285 1081616 1094396 1080761 1078579 1049650 1022574 1027152 1076104 1092100
18846 1092100 1140401 1243872 1296288 1263305 1184041 1087029 1026920 1003137 989220 964674 991673
18835 991673 998833 959902 1002354 1014421 1042342 940069 910632 829613 712073 668685 689124
18824 689124 708182 775767 829350 784441 789095 780197 782965 814379 883142 955354 881070 878142
18812 878142 1032760 1073748 1037092 1020649 1035335 995421 1050793 1186736 1230253 1397252 1508034
18801 1508034 1525436 1532078 1605550 1651753 1683923 1809374 1918021 2096744 2259023 2462421
$$ packed form
18879D473563o05765o10463m65138l50665k38325j07808j40639q2299o2828k3161
18869A786472l3811N1937n0490p8070p6819n8911J4883q5160j27143l4365l527
18858A304996m6547p5786n5378m5669J2780j3635k182k8929k7076M578M8952J5996
18846A092100M8301J03471N2416l2983p9264r7012o0109k3783j3917k4546K6999
18835I91673P160l8931M2452J2067K7921j02273k9437q1019j17540m3388K0439
18824F89124J9058O7585N3583m4909M654q898K768L1414O8763P2212p4284k928
18812H78142J54618M0988l6656j6443J4686l9914N5372J35943M3517J66999J10782
18801A508034J7402O642P3472M6203L2170J25451J08647J78723J62279K03398
$$ plain form
18791 2462421 2655526 2782187 2896078 3050178 3281858 3549498 3857151 4115495 4531259
18782 4531259 5284969 6294463 7273463 7878410 8252063 8819488 9804295 11481795 14276132
18773 14276132 19032610 27098451 38877125 50145902 50555351 42560310 35432950 32274434
18765 32274434 32473706 35309304 41328968 52159753 71271848 104916622 161395869 244645372
18757 244645372 326347357 347890253 312632738 258265605 196566376 138339253 96634969
18750 96634969 71569280 58097667 52417747 52651834 58672740 71053340 87563720 94646300
18742 94646300 81030504 58921890 40895026 29340404 22481345 18442216 16061424
18735 16061424 14698807 13939682 13092423 11915272 10815562 9926945 9326607 9039700 8936775
$$ packed form
18791B462421J93105J26661J13891J54100K31680K67640L07653K58344M15764
18782D531259P53710J009494R79000O04947L73653N67425R84807J677500K794337
18773A4276132M756478Q065841J1778674J1268777M09449p995041p127360l158516
18765C2274434J99272K835598O019664J0830785J9112095L3644774N6479247Q3249503
18757B44645372Q1701985K1542896l5257515n4367133o1699229n8227123m1704284
18750I6634969k5065689j3471613n679920K34087O020906J2380600J6510380P082580
18742I4646300j3615796k2108614j8026864j1554622o859059m039129k380792
18735A6061424j362617p59125q47259j177151j099710q88617o00338k86907j02925
$$ plain form
18726 8936775 8993168 9281603 9723578 10194146 10658037 11537880 13082412 15329374 19172930
18717 19172930 25954173 37209814 53574282 69559709 71342588 59759635 47269466
18710 47269466 40046096 38740651 43239497 54994425 76212919 106253664 134895776
18703 134895776 156494464 180158349 203025674 183851950 131305459 84656209 55209551
18696 55209551 38501404 29049008 23545214 20222837 18328546 17750830 18374390 20434581
18688 20434581 23888827 25533525 22065632 16473462 12074468 9370488 7745535 6671071
18680 6671071 6019821 5699663 5391083 4862124 4143457 3492522 2993258 2602621 2358536
18671 2358536 2125854 1979922 1940532 1867599 1797489 1741676 1691469 1652262 1593030 1550140 1470598
$$ packed form
18726H936775N6393K88435M41975M70568M63891Q79843J544532K246962L843556
18717A9172930O781243J1255641J6364468J5985427J782879j1582953j2490169
18710D7269466p223370j305445M498846J1754928K1218494L0040745K8642112
18703A34895776K1598688K3663885K2867325j9173724n2546491m6649250k9446658
18696E5209551j6708147r452396n503794l322377j894291n77716O23560K060191
18688B0434581L454246J644698l467893n592170m398994k703980j624953j074464
18680F671071o51250l20158l08580n28959p18667o50935m99264l90637k44085
18671B358536k32682j45932l9390p2933p0110n5813n0207l9207n9232m2890p9542
$$ plain form
18660 1470598 1371280 1306730 1252660 1189726 1111429 1049329 1061371 1071900 1083900 1033420 983707
18649 983707 952017 911526 917905 949270 897849 876632 836963 800241 796160 794653 830772 827291
18637 827291 788445 819533 789601 821889 903226 1033535 1074699 1114964 972083 797879 681260
18626 681260 610720 605384 591432 537837 543015 575402 549436 508135 434968 393480 307893 223019
18614 223019 165283 192143 278813 325656 302423 376531 453013 418890 381520 360094 312446
18603 312446 320817 321166 353124 408185 464020 435722 401850 310440 225824 257553 286435 325200
18591 325200 412916 375354 309365 344889 327106 262840 262433 271484 286672 330325 362977 368096
18579 368096 346842 344959 390559 399960 360961 298229 279386 216504 194602 143884 125248 108790
$$ packed form
18660A470598r9318o4550n4070o2934p8297o2100J2042J0529J2000n0480m9713
18649I83707l1690m0491O379L1365n1421k1217l9669l6722m081j507L6119l481
18637H27291l8846L1088k9932L2288Q1337J30309M1164M0265j42881j74204j16619
18626F81260p0540n336j3952n3595N178L2387k5966m1301p3167m1488q5587q4874
18614B23019n7736K6860Q6670M6843k3233P4108P6482l4123l7370k1426m7648
18603C12446Q371L49L1958N5061N5835k8298l3872r1410q4616L1729K8882L8765
18591C25200Q7716l7562o5989L5524j7783o4266m07R051J5188M3653L2652N119
18579C68096k1254j883M5600R401l8999o2732j8843o2882k1902n0718j8636j6458
$$ plain form
18567 108790 117646 195468 168992 158804 159426 136716 133610 152791 172880 185094 221579 205126
18555 205126 202289 203190 158750 109059 99516 116931 61018 59124 90150 107400 149694 230665
18543 230665 275966 264200 198954 156384 101181 79402 47714 3838 98047 107670 141703 127025
18531 127025 153626 189448 200124 231146 191049 137106 67811 14677 53904 68211 73161 106119
18519 106119 29283 99693 161975 111685 71623 82472 69358 35402 59468 65581 67710 81867
18507 81867 89953 50534 -7674 6626 63984 57852 33054 42488 69667 53068 74198 91556
18495 91556 128719 141347 111483 68687 82899 76988 120440 135489 96855 60039 32024 24401
18483 24401 78724 93309 91998 14536 24647 54122 56835 71696 87423 104853 139248 173121
$$ packed form
18567A08790Q856P7822k6476j0188O22k2710l106J9181K0089J2214L6485j6453
18555B05126k837R01m4440m9691r543J7415n5913j894L1026J7250M2294Q0971
18543B30665M5301j1766o5246m2570n5203k1779l1688m3876R4209R623L4033j4678
18531A27025K6601L5822J0676L1022m0097n3943o9295n3134L9227J4307M950L2958
18519A06119p6836P0410O2282n0290m0062J0849j3114l3956K4066O113K129J4157
18507H1867Q086l9419n8208J4300N7358o132k4798R434K7179j6599K1130J7358
18495I1556L7163J2628k9864m2796J4212n911M3452J5049l8634l6816k8015p623
18483B4401N4323J4585j311p7462J0111K9475K713J4861J5727J7430L4395L3873
$$ plain form
18471 173121 165283 144092 156769 189858 164109 136450 111847 160832 212831 218785 191404 226403
18459 226403 302631 431826 513039 537126 586595 629495 750418 866849 783347 604411 491301
18448 491301 457639 516319 580259 707352 782622 793751 754235 735057 802443 906107 942940
18437 942940 744839 531360 405199 346581 286963 265192 282801 354735 390724 369367 297408
18426 297408 195141 99726 43808 75675 102918 107401 165076 132694 94201 126211 109865
18415 109865 107055 93060 26934 72430 148136 123990 138140 203630 222416 299557 368066 397811
18403 397811 349013 320234 260952 190268 246238 406013 546246 675018 594438 564009 620517
18392 620517 614243 548294 462232 398607 393925 343498 289550 302255 386621 525298 596082 598559
$$ packed form
18471A73121p838k1191J2677L3089k5749k7659k4603M8985N1999N954k7381L4999
18459B26403P6228J29195Q1213K4087M9469M2900J20923J16431q3502j78936j13110
18448D91301l3662N8680O3940J27093P5270J1129l9516j9178O7386J03664L6833
18437I42940j98101k13479j26161n8618n9618k1771J7609P1934L5989k1357p1959
18426B97408j02267r5415n5918L1867K7243M483N7675l2382l8493L2010j6346
18415A09865k810j3995o6126M5496P5706k4146J4150O5490J8786P7141O8509K9745
18403C97811m8798k8779n9282p0684N5970J59775J40233J28772q0580l0429N6508
18392F20517o274o5949q6062o3625m682n0427n3948J2705Q4366J38677P0784K477
$$ plain form
18380 598559 577048 545008 443807 295881 185258 132193 86661 52395 32971 31001 84477
18369 84477 67329 56282 59219 71205 97284 129047 100561 113808 150612 165523 97672 65937
18357 65937 28825 -39248 -38324 -43948 -64497 -84179 -44959 -9246 27802 84829 95271 37424
18345 37424 24173 41566 40191 102827 104552 58254 102568 114122 73391 76949 115837 163312
18333 163312 155484 89871 96991 116092 78845 64374 107896 140547 155913 140043 152870 170802
18321 170802 149738 114514 62722 63380 127714 106176 6246 -12101 -35441 11715 25357 38154
18309 38154 31778 31655 30055 27523 47454 98927 137305 144269 113312 79701 48714 34679 21301
18296 21301 64071 68387 -19021 -20310 -2470 70849 118274 34736 -5793 -1539 27300 -4954
$$ packed form
18380E98559k1511l2040j01201j47926j10623n3065m5532l4266j9424j970N3476
18369H4477j7148j1047K937J1986K6079L1763k8486J3247L6804J4911o7851l1735
18357F5937l7112o8073R24n624k0549j9682L9220L5713L7048N7027J0442n7847
18345C7424j3251J7393j375O2636J725m6298M4314J1554m0731L558L8888M7475
18333A63312p828o5613P120J9101l7247j4471M3522L2651J5366j5870J2827J7932
18321A70802k1064l5224n1792O58O4334k1538r9930j8347k3340M7156J3642J2797
18309C8154o376j23j600k532J9931N1473L8378O964l0957l3611l0987j4035j3378
18296B1301M2770M316q7408j289J7840P3319M7425q3538m0529M254K8839l2254
$$ plain form
18284 -4954 -14437 31705 92079 101199 69094 98613 85835 13945 28689 93260 95466 85249
18272 85249 79590 22518 -25033 -14066 43453 66911 86807 92077 88993 129624 159952 156967
18260 156967 135328 124614 81297 89814 70132 76381 97499 56720 73708 118110 144574 158211
18248 158211 177147 146568 114226 133180 195190 211162 228179 249504 310499 371261 410808
18237 410808 425244 375309 322678 237753 172121 218792 381691 540618 757416 826951 736480
18226 736480 649658 547129 607928 719125 750506 666476 618450 743369 929318 1028060 1056930
18215 1056930 916773 664162 480376 321147 214627 163194 174849 209485 193583 232621
18205 232621 228227 175578 175177 216458 259432 258581 223783 237842 207348 211375 150657 114873 147867
$$ packed form
18284d954r483M6142O0374R120l2105K9519j2778p1890J4744O4571K206j0217
18272H5249n659n7072m7551J0967N7519K3458J9896N270l084M0631L0328k985
18260A56967k1639j0714m3317Q517j9682O249K1118m0779J6988M4402K6464J3637
18248A58211J8936l0579l2342J8954O2010J5972J7017K1325O0995O0762L9547
18237D10808J4436m9935n2631q4925o5632M6671J62899J58927K16798O9535r0471
18226G36480q6822j02529O0799J11197L1381q4030m8026J24919J85949R8742K8870
18215A056930j40157k52611j83786j59229j06520n1433J1655L4636j5902L9038
18205B32621m394n2649m01M1281M2974q51l4798J4059l0494M027o0718l5784L2994
$$ plain form
18192 147867 177782 149488 137803 137081 119202 141577 172579 180237 146952 180714 271531 350262
18180 350262 451530 587112 655848 704546 692992 751846 840212 936613 859940 658307 511093
18169 511093 440746 356542 315885 323950 336996 384833 478213 616735 792253 860748 872160
18158 872160 810859 695585 543678 407329 303873 285826 325818 330540 327881 286094 281799
18147 281799 339272 301228 304889 348787 383019 411215 463746 479617 490362 502864 520998 543315
18135 543315 484847 466752 486763 542417 603099 729045 866592 950391 989222 1114874 1254430
18124 1254430 1385298 1582603 1864694 2204823 2585496 3097074 3696181 4415944 5427382
18115 5427382 6947636 9456643 13287597 19439471 30312542 50334325 84774472 131111275
$$ packed form
18192A47867K9915k8294j1685p22j7879K2375L1002P658l3285L3762R0817P8731
18180C50262J01268J35582O8736M8698j1554N8854Q8366R6401p6673k01633j47214
18169E11093p0347q4204m0657Q065J3046M7837R3380J38522J75518O8495J1412
18158H72160o1301j15274j51907j36349j03456j8047L9992M722k659m1787m295
18147B81799N7473l8044L661M3898L4232K8196N2531J5871J0745J2502J8134K2317
18135E43315n8468j8095K0011N5654O0682J25946J37547Q3799L8831J25652J39556
18124A254430J30868J97305K82091L40129L80673N11578N99107P19763J011438
18115E427382J520254K509007L830954O151874J0873071K0021783L4440147M6336803
$$ plain form
18107 131111275 145818491 109918159 67538463 40113297 25124130 17011386 12348417
18100 12348417 9487155 7509019 6015117 4851485 3958152 3314503 2860633 2464932 2104331
18091 2104331 1822655 1656701 1467555 1305925 1136704 1062881 954057 793753 700845 699679
18081 699679 684122 654903 616366 589804 559448 491576 436800 418580 416254 424721 387085 323849
18069 323849 311456 302668 251377 226484 202566 184183 249334 236197 203650 217089 197512 161520
18057 161520 190101 226521 219377 225983 221158 187704 107738 72863 63660 45559 44681 42544 100793
18044 100793 97886 75625 99299 48267 19869 103624 150104 136929 144843 132886 110032 73870
18032 73870 96561 98237 37036 -1502 408 34579 30693 -8004 -13451 -92531 -101556 -100700 -38897
$$ packed form
18107A31111275J4707216l5900332m2379696k7425166j4989167q112744m662969
18100A2348417k861262j978136j493902j163632q93333o43649m53870l95701l60601
18091B104331k81676j65954j89146j61630j69221p3823j08824j60304r2908j166
18081F99679j5557k9219l8537k6562l0356o7872n4776j8220k326Q467l7636o3236
18069C23849j2393q788n1291k4893k3918j8383O5151j3137l2547J3439j9577l5992
18057A61520K8581L6420p144O606m825l3454p9966l4875r203j8101q78k137N8249
18044A00793k907k2261K3674n1032k8398Q3755M6480j3175P914j1957k2854l6162
18032G3870K2691J676o1201l8538J910L4171l886l8697n447p9080r025Q56O1803
$$ plain form
18019 -38897 58804 85927 130993 163099 165961 162610 111495 76745 133490 128941 89973 59250
18007 59250 91484 99043 112602 86694 94121 88038 73895 15880 14754 60277 57807 78424 78554
17994 78554 61719 51134 41690 25501 5437 68186 125787 153973 125865 147188 182528 239976
17982 239976 207708 129752 41962 43704 40464 33262 -36522 -45089 -229 55894 86058 59261
17970 59261 59200 19120 -51533 -77878 -64704 -61993 -95926 -101282 -60271 -6785 -17425 -36461 27502
17957 27502 56531 7063 -42049 -49637 -22321 1567 21006 58448 74119 30659 23401 70758
17945 70758 62709 48484 6024 -21873 -62203 -27854 11545 13151 43903 43147 -32522 -51336
17933 -51336 -61727 -46693 3348 65927 5528 -28758 -26211 -34293 -225 2243 -27783 -45531
$$ packed form
18019c8897R7701K7123M5066L2106K862l351n1115l4750N6745m549l8968l0723
18007E9250L2234P559J3559k5908P427o083j4143n8015j126M5523k470K0617J30
17994G8554j6835j0585r444j6189k0064O2749N7601K8186k8108K1323L5340N7448
17982B39976l2268p7956q7790J742l240p202o9784q567M4860N6123L0164k6797
17970E9261o1m0080p0653k6345J3174K711l3933n356M1011N3486j0640j9036O3963
17957B7502K9029m9468m9112p588K7316K3888J9439L7442J5671m3460p258M7357
17945G0758q049j4225m2460k7897m0330L4349L9399J606L0752p56p5669j8814
17933e1336j0391J5034N0041O2579o0399l4286K547q082L4068K468l0026j7748
$$ plain form
17921 -45531 -53626 -6529 -17499 -73526 -84265 -105772 -112309 -61553 -56339 -4109 15164 29174
17909 29174 -10603 -16399 -13036 -23234 -33691 -36723 -24617 -20406 -55908 -49637 -53050 -12204 7810
17896 7810 50830 40721 -7113 -32757 -93635 -82117 -110108 -122394 -86339 -32261 10462 -3284
17884 -3284 1969 55103 18579 2384 -74965 -106953 -63298 -52797 -92849 -79351 -75530 -77833
17872 -77833 -71880 -84105 -101644 -86190 -100620 -97001 -136433 -123614 -43716 3894 11679 -2793
17860 -2793 -47361 -61704 -15762 -29442 -40434 -35186 -31680 -43081 -55561 -83390 -97053 -103581
17848 -103581 -106211 -43974 -12332 -41486 -79069 -40810 -49855 -71606 -52734 -44964 -80277 -42065
17836 -42065 11214 55075 24664 25367 6704 -3830 33761 33289 21823 23841 18190 -3267 17035
$$ packed form
17921d5531q095M7097j0970n6027j0739k1507o537N0756N214N2230J9273J4010
17909B9174l9777n796L363j0198j0457l032J2106M211l5502O271l413M0846K0014
17896G810M3020j0109m7834k5644o0878J1518k7991j2286L6055N4078M2723j3746
17884c284N253N3134l6524j6195p7349l1988M3655J0501m0052J3498L821k303
17872g7833N953j2225j7539J5454j4430L619l9432J2819P9898M7610P785j4472
17860b793m4568j4343M5942j3680j0992N248L506j1401j2480k7829j3663o528
17848a03581k630O2237L1642k9154l7583L8259r045k1751J8872P770l5313L8212
17836d2065N3279M3861l0411P03j8663j0534L7591m72j1466K018n651k1457K0302
$$ plain form
17823 17035 105614 142047 105037 79181 14909 -53657 -44757 -28790 -76019 -68585 -57331 -11170
17811 -11170 13958 18056 19979 45181 57903 113150 122120 93313 83601 44583 86848 65658
17799 65658 3433 -111062 -186133 -141329 -113889 -80793 -61087 -27671 -62234 -78463 -90457
17788 -90457 -63657 32677 57658 23480 26212 -3904 -4685 -49558 -100075 -87759 -36739 17734
17776 17734 -880 -4251 -5182 26824 42424 62068 21776 -8838 1443 27721 93162 18693
17764 18693 -5499 -4926 -3007 -2707 8841 7574 -22493 -53186 -48782 -44795 -92155 -109836 -95648
17751 -95648 -65692 2169 -43202 -72731 -54581 -32393 -47640 -68263 -81528 -78673 -11800 28369
17739 28369 -21675 -70011 -82595 -46773 -55527 -62224 -84428 -54492 -24329 16683 655 -10165
$$ packed form
17823A7035Q8579L6433l7010k5856o4272o8566Q900J5967m7229P434J1254M6161
17811a1170K5128M098J923K5202J2722N5247Q970k8807r712l9018M2265k1190
17799F5658o2225j14495p5071M4804K7440L3096J9706L3416l4563j6229j1994
17788i0457K6800R6334K4981l4178K732l0116p81m4873n0517J2316N1020N4473
17776A7734j8614l371r31L2006J5600J9644m0292l0614J0281K6278O5441p4469
17764A8693k4192N73J919L00J1548j267l0067l0693M404L987m7360j7681J4188
17751i5648K9956O7861m5371k9529J8150K2188j5247k0623j3265K855O6873M0169
17739B8369n0044m8336j2584L5822q754o697k2204K9936L0163M1012j6028j0820
$$ plain form
17727 -10165 2855 66815 90114 30947 -41551 -75220 -48430 12058 99231 40935 40295 -1762
17715 -1762 -2879 -26322 -14855 -55743 -80210 -34194 23357 11206 1117 -34760 -44552 -76061
17703 -76061 -18601 -30482 25027 71657 68829 24998 -18714 -74843 -67329 -56785 -42629 -2742
17691 -2742 -3718 -18359 41594 75226 72581 -5802 -41052 -19855 -33932 -30662 -24433 -58014 -43718
17678 -43718 -15385 63853 96538 113573 90792 51234 3045 -34530 14525 52838 73758 113135
17666 113135 159855 77605 58551 -18447 -50974 -92345 -38719 62726 66608 24598 4593
17655 4593 13634 15766 8050 -41982 -54309 -24360 32949 -19689 -63927 -23970 -49276 -131306
17643 -131306 -128316 -118705 -136609 -152664 -105213 -99810 -96745 -83039 -10921 80248 79197 55622
$$ packed form
17727a0165J3020O3960K3299n9167p2498l3669K6790O0488Q7173n8296o40m2057
17715a762j117k3443J1467m0888k4467M6016N7551j2151j0089l5877r792l1509
17703g6061N7460j1881N5509M6630k828m3831m3712n6129P514J0544J4156L9887
17691b742r76j4641N9953L3632k645p8383l5250K1197j4077L270O229l3581J4296
17678d3718K8333P9238L2685J7035k2781l9558m8189l7575M9055L8313K0920L9377
17666A13135M6720q2250j9054p6998l2527m1371N3626J01445L882m2010k0005
17655D593R041K132p716n0032j2327K9949N7309n2638m4238L9957k5306q2030
17643a31306K990R611j7904j6055M7451N403L065J3706P2118R1169j051k3575
$$ plain form
17631 55622 72731 18569 -4846 -18242 -53615 -69056 -52743 -20317 1275 64878 104558 111495
17619 111495 69105 21771 -42485 -53664 -15669 -2731 -14677 -64328 -76812 -64943 -19937
17608 -19937 31993 77936 66541 66427 39418 22072 6796 62239 73454 57592 35330 -29778
17596 -29778 -30051 -18321 -11706 -36025 -37682 -28157 -17659 -1346 -25155 -65301 -85436 -110905 -116870
17583 -116870 -50945 -9486 -4733 21454 49561 41243 38197 -180 -91232 -90801 -68623 3171
17571 3171 43695 11335 -35773 -6032 -3516 -40435 -44458 -6672 8644 3300 32400 38203 -6333
17558 -6333 -4936 39901 -1874 -49045 -28284 -10233 2996 11067 -26000 1599 19176 -12128
17546 -12128 -27247 221 41079 16711 -43563 -67218 -81390 -54460 -26981 -14047 -59111 -10254
$$ packed form
17631E5622J7109n4162k3415j3396l5373j5441J6313L2426K1592O3603L9680O937
17619A11495m2390m7334o4256j1179L7995J2938j1946m9651j2484J1869M5006
17608a9937N1930M5943j1395j14k7009j7346j5276N5443J1215j5862k2262o5108
17596b9778k73J1730O615k4319j657R525J0498J6313k3809m0146k0135k5469n965
17583a16870O5925M1459M753K6187K8107q318l046l8377r1052M31K2178P1794
17571C171M0524l2360m7108K9741K516l6919m023L7786J5316n344K9100N803m4536
17558f333J397M4837m1775m7171K0761J8051J3229Q071l7067K7599J7577l1304
17546a2128j5119K7468M0858k4368o0274k3655j4172K6930K7479J2934m5064M8857
$$ plain form
17534 -10254 33531 14252 34388 43524 54705 97368 108669 56402 -9174 -51409 -80115 -58872
17522 -58872 31750 32329 12787 1099 -5365 -38789 -54890 -56621 20693 31240 -43427 -37662 -60506
17509 -60506 -27316 -27134 -56675 -57707 3591 -35140 -2075 43319 51262 -14115 -76640 -42763
17497 -42763 -26805 -43258 -22547 -37760 -7845 -1804 -5125 5306 -3114 61842 51731 -15655
17485 -15655 -41340 -31479 16895 16305 18789 38709 25510 22878 -1645 -55377 -68192 -48039 -41341
17472 -41341 -64298 -37925 -35028 -46347 -32162 -47252 -45090 -17834 9955 -13500 3468 10506
17460 10506 17267 30805 71778 59541 37630 34123 67092 110554 190885 205288 116298 45050
17448 45050 41933 60692 56894 115173 183860 360109 624066 772506 616923 396998 270477
$$ packed form
17534a0254M3785j9279K0136R136J1181M2663J1301n2267o5576m2235k8706K1243
17522e8872R0622N79j9542j1688o464l3424j6101j731P7314J0547p4667N765k2844
17509f0506L3190J82k9541j032O1298l8731L3065M5394P943o5377o2525L3877
17497d2763J5958j6453K0711j5213K9915O041l321J0431q420O4956j0111o7386
17485a5655k5685R861M8374n90K484J9920j3199k632k4523n3732j2815K0153O698
17472d1341k2957K6373K897j1319J4185j5090K162K7256K7789k3455J6968P038
17460A0506O761J3538M0973j2237k1911l507L2969M3462Q0331J4403q8990p1248
17448D5050l117J8759l798N8279O8687J76249K63957J48440j55583k19925j26521
$$ plain form
17437 270477 97738 40864 11794 -27688 -26010 -20322 -1902 -27479 -9322 36866 41028 68706
17425 68706 82471 58686 -31126 -45826 -12802 36913 59864 52771 -1438 -54200 -65942 -53341
17413 -53341 -43727 -34514 -21556 -9580 41281 84494 26093 31 -47249 -28986 29652 50563
17401 50563 4519 -2131 36103 17215 -20775 -44122 -45436 -22746 17725 60421 35248 -22492
17389 -22492 1674 6277 14552 31505 4942 -95581 -59800 -35359 -45417 -104828 -111635 -80912
17377 -80912 -93785 -59180 -44116 -21039 42663 17782 -29007 -32745 -50056 -52691 -28000 -22226
17365 -22226 -9534 23728 -5384 -12386 17398 40240 43782 82401 68348 86292 106488 86484
17353 86484 33237 15198 27899 27433 -39236 -120320 -131421 -150167 -115886 -87605 -59481 -53184
$$ packed form
17437B70477j72739n6874k9070l9482J678N688J8420k5577J8157M6188M162K7678
17425F8706J3765k3785q9812j4700L3024M9715K2951p093n4209n2762j1742J2601
17413e3341R614R213J2958J1976N0861M3213n8401k6062m7280J8263N8638K0911
17401E0563m6044o650L8234j8888l7990k3347j314K2690M0471M2696k5173n7740
17389b2492K4166M603Q275J6953k6563j00523L5781K4441j0058n9411o807L0723
17377h0912j2873L4605J5064K3077O3702k4881m6789l738j7311k635K4691N774
17365b2226J2692L3262k9112p002K9784K2842L542L8619j4053J7944K0196k0004
17353H6484n3247j8039J2701m66o6669q1084j1101j8746L4281K8281K8124O297
$$ plain form
17341 -53184 -43158 -81102 -43363 -27500 -39734 -40850 -74186 -7234 11133 -40617 -43660 -53121
17329 -53121 -52627 -80173 -95666 -14987 23986 -28746 -50481 -22025 51315 118321 123959 11905
17317 11905 -1622 -9654 -15307 27248 -14296 2234 -5037 -20130 -48546 -25983 -38052 -68913
17305 -68913 -79750 -90397 -77335 -6460 -10174 37012 14729 -8193 -17696 -21771 15146 20195
17293 20195 67489 81245 56138 48753 89031 98030 83374 28576 25885 14772 717 -152 -40706
17280 -40706 -48431 -26996 -25122 -49587 -81191 -60284 -42694 -14275 -17881 -35129 -50417 -68417
17268 -68417 -76504 -44639 -46495 -75087 1370 38825 -15137 -82745 -17432 85860 79395 62167
17256 62167 34055 11714 -15324 -11113 22416 8403 6557 1034 -1829 35759 76747 81911 55461
$$ packed form
17341e3184J0026l7944L7739J5863j2234j116l3336O6952J8367n1750l043r461
17329e3121M94k7546j5493Q0679L8973n2732k1735K8456P3340O7006N638j12054
17317A1905j3527q032n653M2555m1544J6530p271j5093k8416K2563j2069l0861
17305f8913j0837j0647J3062P0875l714M7186k2283k2922r503m075L6917N049
17293B0195M7294J3756k5107p385M0278Q999j4656n4798k691j1113j4055q69m0554
17280d0706p725K1435J874k4465l1604K0907J7590K8419l606j7248j5288j8000
17268f8417q087L1865j856k8592P6457L7455n3962o7608O5313J03292o465j7228
17256F2167k8112k2341k7038M211L3529j4013j846n523k863L7588M0988N164k6450
$$ plain form
17243 55461 -38826 -37975 -22124 76760 81300 92855 38100 31282 19233 25895 37814 16383 25268
17230 25268 49935 77665 73744 18370 -39265 -36181 -15443 -8158 -42306 -55036 -26241 -7165
17218 -7165 -10545 22903 9529 18806 -40534 -31443 -28815 -65455 -53214 9226 57075 52959 27463
17205 27463 -18114 -48955 -25016 -19596 -30536 -24389 -3219 51219 5180 -60089 -141208 -118461
17193 -118461 -43339 -76937 -102553 -45594 -8083 -6672 -3778 18639 -1164 -28836 -12240 31394
17181 31394 19597 40413 60228 33319 62504 81058 73886 8717 -67590 -15702 30419 52217
17169 52217 52306 22902 24141 14709 -30743 -58830 -12285 1766 -18289 16258 22664 -5660 -10771
17156 -10771 -50479 -43238 -62865 -56458 -29785 -26500 -59158 -41533 -66201 -74904 -66817 28712 57591
$$ packed form
17243E5461r4287Q51J5851R8884M540J1555n4755o818j2049O662J1919k1431Q885
17230B5268K4667K7730l921n5374n7635L084K0738P285l4148j2730K8795J9076
17218g165l380L3448j3374R277n9340R091K628l6640J2241O2440M7849m116k5496
17205B7463m5577l0841K3939N420j0940O147K1170N4438m6039o5269q1119K2747
17193a18461P5122l3598k5616N6959L7511J411K894K2417j9803k7672J6596M3634
17181C1394j1797K0816J9815k6909K9185J8554p172o5169p6307N1888M6121K1798
17169E2217Q9k9404J239r432m5452k8087M6545J4051k0055L4547O406k8324n111
17156a0771l9708P241j9627O407K6673L285l2658J7625k4668q703Q087R5529K8879
$$ plain form
17143 57591 -7976 -45396 -28213 -19845 18413 -34394 -61296 -41280 -74886 -84309 -83917 -42942
17131 -42942 -19568 -17167 -56796 -81984 -67445 -86556 -66268 -29288 -38271 -68240 -20487 -38243
17119 -38243 -65665 -55774 -30037 402 7382 9338 25864 6400 10374 15414 10643 -163 22073
17106 22073 37019 53569 47983 20056 36651 10126 13727 -14662 -7693 72538 45016 43921
17094 43921 64441 61209 15811 9336 30359 -3196 28774 72138 40935 40469 -22794 -78149
17082 -78149 -25175 50502 43375 13398 -6328 -33582 -46788 29580 65322 67630 50965 43762
17070 43762 34592 9173 -12407 13901 -5386 -56111 -59294 -59949 -41110 -58083 -91212 -63274
17058 -63274 -46228 -87735 -68607 -94566 -114300 -99624 -42856 -65046 -11602 45425 50843 37758
$$ packed form
17143E7591o5567l7420J7183Q368L8258n2807k6902K0016l3606r423L92M0975
17131d2942K3374K401l9629k5188J4539j9111K0288L6980q983k9969M7753j7756
17119c8243k7422R891K5737L0439O980J956J6526j9464L974N040m771j0806K2236
17106B2073J4946J6550n586k7927J6595k6525L601k8389O969Q0231k7522j095
17094D3921K0520l232m5398o475K1023l3555L1970M3364l1203m66o3263n5355
17082g8149N2974P5677p127k9977j9726k7254j3206P6368L5742K308j6665p203
17070D3762r170k5419k1580K6308j9287n0725l183o55J8839j6973l3129K7938
17058f3274J7046m1507J9128k5959j9734J4676N6768k2190N3444N7027N418j3085
$$ plain form
17046 37758 44261 43925 14156 34351 1352 -9129 50088 77983 146629 107821 91327 46725
17034 46725 -9 -17441 -34129 -38847 -51130 -40188 -72309 -111854 -113721 -130441 -133204 -67253
17022 -67253 4507 -6037 -4747 -9280 -55434 -68059 -57279 -40624 -26804 47305 37488 26061
17010 26061 82017 76546 -17488 -70333 -74637 -70982 -29825 -10489 13686 63959 15322 21974
16998 21974 34088 -34183 -15733 39479 71355 57065 15152 17939 26949 26031 65909 75486 60408
16985 60408 44367 84231 113699 101907 33446 -22826 -36553 -37246 29722 73684 1669 -18115
16973 -18115 -30395 -64003 -66874 -72615 -57665 -36062 21880 66732 74733 27014 33677 51371
16961 51371 80733 49011 30192 20609 17463 -434 29597 63006 94466 80144 51236 27079
$$ packed form
17046C7758O503l36k9769K0195l2999j0481N9217K7895O8646l8808j6494m4602
17034D6725m6734j7432j6688m718j2283J0942l2121l9545j867j6720k763O5951
17022f7253P1760j0544J290m533m6154j2625J0780J6655J3820P4109r817j1427
17010B6061N5956n471r4034n2845m304L655M1157J9336K4175N0273m8637O652
16998B1974J2114o8271J8450N5212L1876j4290m1913K787R010r18L9878R577j5078
16985F0408j6041L9864K9468j1792o8461n6272j3727o93O6968M3962p2015j9784
16973a8115j2280l3608k871n741J4950K1603N7942M4852Q001m7719O663J7694
16961E1371K9362l1722j8819r583l146j7897L0031L3409L1460j4322k8908k4157
$$ plain form
16949 27079 -12462 19872 -11967 -32651 30347 59164 59011 60656 43556 73490 28655 9457
16937 9457 7969 -23521 19641 -15350 -86641 -137720 -117386 -137183 -148910 -88080 -34921 -43880
16925 -43880 -51306 -15249 11165 -2052 19662 40468 36842 42364 56570 66540 22656 15553 11217
16912 11217 16670 5397 -2861 -18747 -70421 -70697 -42674 -82095 -120234 -49817 5023 47307
16900 47307 43274 1621 34237 36199 7378 -1080 -12362 -18381 -21452 32557 -12194 -36675 -7961
16887 -7961 -35606 -6937 34829 24230 90929 133747 75484 61336 64050 20231 9085 8532
16875 8532 64056 115485 134185 140535 75498 67299 -11185 -45966 11165 53127 63126 129430
16863 129430 158455 85316 93856 88487 21655 -8208 -24483 -51944 -35661 -24459 -99314 -89455
$$ packed form
16949B7079l9541L2334l1839k0684O2998K8817j53J645j7100K9934m4835j9198
16937I457j488l1490M3162l4991p1291n1079K0334j9797j1727O0830N3159q959
16925d3880p426L6057K6414j3217K1714K0806l626N522J4206R970m3884p103m336
16912A1217N453j1273q258j5886n1674k76K8023l9421l8139P0417N4840M2284
16900D7307m033m1653L2616J962k8821q458j1282o019l071N4009m4751k4481K8714
16887g961k7645K8669M1766j0599O6699M2818n8263j4148K714m3819j1146n53
16875H532N5524N1429J8700O350o5037q199p8484l4781N7131M1962R999O6304
16863A29430K9025p3139Q540n369o6832k9863j6275k7461J6283J1202p4855R859
$$ plain form
16851 -89455 -67965 -49716 -63824 -51763 -25424 -89010 -75757 -13468 37967 51367 -20818 -4362
16839 -4362 -8702 -54182 -64080 -52506 -65006 -33058 -49836 -12638 21175 26119 71801 46501
16827 46501 -29674 -47134 -58973 -88380 -121570 -201718 -204752 -180613 -199422 -148880 -109708 -81699
16815 -81699 -71559 -63368 1035 39574 49638 8988 -24412 -86328 -50616 -36126 -100155 -74051
16803 -74051 -116805 -155836 -130506 -63871 -59665 -65479 -64930 -55265 -29441 -46080 -21016 -7037 -21396
16790 -21396 -21154 -30635 -37882 14645 102102 58854 -3 -23768 7132 34100 41854 51850 52151
16777 52151 28215 23602 -14578 -30356 23203 9933 29123 -19030 -2500 12646 -26663 -29781
16765 -29781 -25284 -40462 7380 14717 14835 -18996 -75337 -98676 -74870 -29487 23092 98407
$$ packed form
16851h9455K1490J8249j4108J2061K6339o3586J3253O2289N1435J3400p2185J6456
16839d362m340m5480r898J1574j2500L1948j6778L7198L3813M944M5682k5300
16827D6501p6175j7460j1839k9407l3190q0148l034K4139j8809N0542L9172K8009
16815h1699J0140Q191O4403L8539J0064m0650l3400o1916L5712J4490o4029K6104
16803g4051m2754l9031K5330O6635M206n814N49R665K5824j6639K5064J3979j4359
16790b1396K42r481p247N2527Q7457m3248n8857k3765L0900K6968P754R996L01
16777E2151k3936m613l8180j5778N3559j3270J9190m8153J6530J5146l9309l118
16765b9781M497j5178M7842P337J18l3831n6341k3339K3806M5383N2579P5315
$$ plain form
16753 98407 158887 157715 172659 173052 141643 136276 108776 70787 1599 -547 -29223 -45621 -26498
16740 -26498 9158 22032 -9958 -33155 -58413 -33386 -8654 -12383 8984 29326 2832 20133
16728 20133 56471 67814 91305 90313 69818 25196 -12712 17766 32568 31318 -16810 -41185
16716 -41185 -674 20574 -24883 -36460 -18357 -2636 -95885 -77110 -42558 -59112 -74462 -45877
16704 -45877 17846 14803 8961 -8667 -8794 12928 -36125 -30942 26015 54157 82170 68643 50974
16691 50974 27127 6107 -2323 -63001 -97824 -67100 -38571 -9842 -12356 33787 148308 140470
16679 140470 61941 34383 22417 108598 145663 27656 -94116 -86864 -81819 -46279 -11525
16668 -11525 -69177 -92861 -117627 -42095 -27919 -53203 -39174 -54550 -47099 -37465 -79258 -84980
$$ packed form
16753I8407O0480j172J4944L93l1409n367k7500l7989o9188k146k8676j6398J9123
16740b6498L5656J2874l1990k3197k5258K5027K4732l729K1367K0342k6494J7301
16728B0133L6338J1343K3491r92k0495m4622l7908L0478J4802j250m8128k4375
16716d1185M0511K1248m5457j1577J8103J5721r3249J8775L4552j6554j5350K8585
16704d5877O3723l043n842j7628j27K1722m9053N183N6957K8142K8013j3527j7669
16691E0974k3847k1020q430o0678l4823L0724K8529K8729k514M6143J14521p838
16679A40470p8529k7558j1966Q6181L7065j18007j21772P252N045L5540L4754
16668a1525n7652k3684k4766P5532J4176k5284J4029j5376P451R634m1793n722
$$ plain form
16656 -84980 -102362 -149756 -166980 -111793 -123965 -140295 -99609 -36611 -17169 -14055 -22542 -9638
16644 -9638 29969 52507 50889 30346 -18056 -85145 -42607 -3416 -22438 2170 -14639 -21224
16632 -21224 16362 23177 -3211 -19419 -17265 -37597 -85593 -83526 -30703 38902 66845 13699
16620 13699 -69665 -79474 -27342 17564 -9947 -55641 157 -6517 44036 91774 130197 66627
16608 66627 29382 -8102 -17086 2589 45590 33524 32438 45012 35840 32016 3497 4758 43017
16595 43017 73648 69864 57115 16731 596 24270 -2598 -51900 -98258 -138126 -166052 -134371
16583 -134371 -46218 -4556 -45814 -19748 -29078 -28069 -45 1637 -10083 -15464 -35849 -108922
16571 -108922 -122428 -103170 -96861 -11989 -2373 2589 -7854 11016 19042 -12766 -12703 -7785 -4692
$$ packed form
16656h4980j7382m7394j7224N5187j2172j6330M0686O2998J9442L114q487J2904
16644i638L9607K2538j618k0543m8402o7089M2538L9191j9022K4608j6809o585
16632b1224L7586O815k6388j6208K154k0332m7996K067N2823O9605K7943n3146
16620A3699q3364r809N2132M4906k7511m5694N5798o674N0553M7738L8423o3570
16608F6627l7245l7484q984J9675M3001j2066j086J2574r172l824k8519J261L8259
16595D3017L0631l784j2749m0384j6135K3674k6868m9302m6358l9868k7926L1681
16583a34371Q8153M1662m1258K6066r330J009K8024J682j1720n381k0385p3073
16571a08922j3506J9258O309Q4872R616M962j0443J8870Q026l1808O3M918L093
$$ plain form
16558 -4692 -34118 -33027 -372 7029 -20080 -56618 -58150 -55066 -56941 -13973 21604 77057 132962
16545 132962 197682 182442 121481 53781 -66917 -34391 1683 24878 46907 45654 15623
16534 15623 -34925 -57332 -24155 -7250 38123 -9020 -33125 -38863 -47854 -12715 -32607 -90023
16522 -90023 -99312 -97967 -66241 -4430 29633 99712 75921 18402 -49169 -74212 -59914 -3293
16510 -3293 -1506 1281 -37072 -28107 -36526 -29293 -6349 -1552 -279 -34042 -76419 -68662 -9190
16497 -9190 67986 79098 48796 47577 -7363 -19121 -2489 6250 8022 -8167 -51088 -58797 -36968
16484 -36968 -77411 -79146 -64743 -50702 -6473 -23219 -18084 -1504 -12652 16759 30957 66011
16472 66011 90837 52834 2010 125 -23118 -45235 -46909 -75728 -73093 -39611 -34279 -67807
$$ packed form
16558d692k9426J091L2655P401k7109l6538j532L084j875M2968L5577N5453N5905
16545A32962O4720j5240o0961o7700j20698L2526L6074K3195K2029j253l0031
16534A5623n0548k2407L3177J6905M5373m7143k4105n738q991L5139j9892n7416
16522i0023r289J345L1726O1811L4063P0079k3791n7519o7571k5043J4298N6621
16510c293J787K787l8353Q965q419P233K2944M797J273l3763m2377P757N9472
16497i190P7176J1112l0302j219n4940j1758J6632Q739J772j6189m2921p709K1829
16484c6968m0443j735J4403J4041M4229j6746N135J6580j1148K9411J4198L5054
16472F6011K4826l8003n0824j885k3243k2117j674k8819K635L3482N332l3528
$$ plain form
16460 -67807 -35183 5004 8470 -36029 -50244 -38553 7147 11259 -19081 -38043 -58120 -118149
16448 -118149 -118830 -73796 -53914 -107884 -99577 -69202 -16631 9458 -1339 -16082 -66583 -107037
16436 -107037 -31124 -24095 -31298 -69837 -87898 -93945 -120893 -98452 -62225 -56208 -17849 -23331
16424 -23331 -42751 -88671 -122335 -138485 -103347 -36660 -8616 -3452 -18965 -59264 -39647 -2312
16412 -2312 -54482 -42819 -11454 47248 71515 62424 41797 15736 11122 -44554 -87527 1675
16400 1675 42718 -3809 -13739 7579 11935 25800 -33586 -70055 -114456 -98340 -36669 -56831
16388 -56831 -89295 -112271 -151381 -130517 -95886 -49512 -14209 2439 5612 -50073 -66749 -80437
16376 -80437 -36704 -21479 -65066 -109628 -93038 -85718 -116366 -112330 -59325 27869 27016 14235
$$ packed form
16460f7807L2624M0187L466m4499j4215J1691M5700M112l0340j8962k0077o0029
16448a18149o81M5034J9882n3970Q307L0375N2571K6089j0797j4743n0501m0454
16436a07037P5913P029p203l8539j8061o047k6948K2441L6227O017L8359n482
16424b3331j9420m5920l3664j6150L5138O6687K8044N164j5513m0299J9617L7335
16412b312n2170J1663L1365N8702K4267r091k0627k6061m614n5676m2973Q9202
16400A675M1043m6527r930K1318M356J3865n9386l6469m4401J6116O1671k0162
16388e6831l2464k2976l9110K0864L4631M6374L5303J6648L173n5685j6676j3688
16376h0437M3733J5225m3587m4562J6590P320l0648M036N3005Q7194q53j2781
$$ plain form
16364 14235 19947 -1823 -17173 -71861 -76174 -28140 -7033 73329 39990 -20769 -18484 46167
16352 46167 32374 7835 -47182 -51100 -40200 -98692 -107299 -88059 -47186 -30404 -56006 -43943
16340 -43943 24475 3940 -20221 -48816 -38837 -74175 -82808 -45493 -6020 -11186 -53461 -52044
16328 -52044 -20857 -14706 -12353 -6279 -38400 -13252 -606 35697 68549 98566 62507 -30367
16316 -30367 -81243 -119847 -104451 -103113 -83468 574 11180 6328 -43098 -35381 -24804 -47932
16304 -47932 -77924 -71784 -55441 21035 23192 -9313 -12686 -9037 -42743 -56594 27473 62555
16292 62555 37028 71324 45144 -16339 -49984 -77408 -135213 -129134 -132078 -112381 -46401 2355
16280 2355 47040 89460 88588 75669 83072 97797 81508 38729 59229 71162 -32628 -87249
$$ packed form
16364A4235N712k1770j5350n4688m313M8034K1107Q0362l3339o0759K285O4651
16352D6167j3793k4539n5017l918J0900n8492q607J9240M0873J6782k5602J2063
16340d3943O8418k0535k4161k8595R979l5338q633L7315L9473n166m2275J417
16328e2044L1187O151K353O074l2121K5148J2646L6303L2852L0017l6059r2874
16316c0367n0876l8604J5396J338J9645Q4042J0606m852m9426P717J0577k3128
16304d7932k9992O140J6343P6476K157l2505l373L649l3706j3851Q4067L5082
16292F2555k5527L4296k6180o1483l3645k7424n7805O079k944J9697O5980M8756
16280B355M4685M2420q72j2919P403J4725j6289m2779K0500J1933j03790n4621
$$ plain form
16268 -87249 -64523 -3013 19156 -38897 -52866 -24580 -2947 10754 -17538 67617 43213 39509
16256 39509 71479 81393 76652 33400 -9674 -79603 -106869 -31375 56901 64195 11452 -51750
16244 -51750 -52051 -21391 -66381 -98452 -81614 -62940 4080 14562 -42492 -122909 -89621 -49384
16232 -49384 -33812 -25652 35416 28316 38315 77695 53251 34126 56018 87925 48894 53034
16220 53034 48693 40195 33341 36707 -18185 -41659 -25153 29793 413 -122259 -173614 -142991
16208 -142991 -67283 -30144 -12161 -23003 -27672 2186 40483 50754 42540 -2668 -43208 -122912
16196 -122912 -130200 -29835 11784 8614 44134 18257 -44635 -14793 -14339 -9643 84708 129300
16184 129300 55468 1340 27595 27453 3265 -18870 -30095 -9553 -28093 -37106 -14989 -12412
$$ packed form
16268h7249K2726O1510K2169n8053j3969K8286K1633J3701k8292Q5155k4404l704
16256C9509L1970R914m741m3252m3074o9929k7266P5494Q8276P294n2743o3202
16244e1750l01L0660m4990l2071J6838J8674O7020J0482n7054q0417L3288M0237
16232d9384J5572Q160O1068p100R999L9380k4444j9125K1892L1907l9031M140
16220E3034m341q498o854L366n4892k3474J6506N4946k9380j22672n1355L0623
16208a42991P5708L7139J7983j0842m669K9858L8297J0271q214m5208m0540p9704
16196a22912p288J00365M1619l170L5520k5877o2892K9842M54M696R4351M4592
16184A29300p3832n4128K6255j42k4188k2135j1225K0542j8540r013K2117K577
$$ plain form
16172 -12412 -5534 -26025 -34821 853 8765 -50295 -51874 -79541 -47152 -51136 -63626 -89165 -114677
16159 -114677 -56403 22410 37373 -37776 -106820 -45370 -17870 -17719 -23415 -58230 -51225 -85429
16147 -85429 -115943 -104371 -41434 -29548 -18177 -56456 -80399 -64369 -33079 -20813 1914 26288
16135 26288 66877 95588 55371 25209 11732 -6096 -56542 -80618 -22161 -26896 -88744 -47248
16123 -47248 42392 82173 66554 27897 3538 -32849 -48656 -19873 -22505 -35295 -52647 -46723
16111 -46723 -20663 -16815 -62068 -42700 -68877 -77798 -18842 12508 -49534 -67215 -22751 -2509
16099 -2509 -48105 -57127 -28437 -50345 -58434 -78042 -83418 -61421 2159 -14756 -7741 -19868 -38856
16086 -38856 -66626 -21173 -1078 -17428 12432 66721 89655 -23667 -72191 -54031 -49298 -40783
$$ packed form
16172a2412O878k0491q796L5674P912n9060j579k7667L2389l984j2490k5539k5512
16159a14677N8274P8813J4963p5149o9044O1450K7500J51n696l4815P005l4204
16147h5429l0514J1572O2937J1886J1371l8279k3943J6030L1290J2266K2727K4374
16135B6288M0589K8711m0217l0162j3477j7828n0446k4076N8457m735o1848M1496
16123d7248Q9640L9781j5619l8657k4359l6387j5807K8783k632j2790j7352N924
16111d6723K6060L848m5253J9368k6177q921N8956L1350o2042j7681M4464K0242
16099b509m5596r022K8690k1908q089j9608n376K1997O3580j6915P015j2127j8988
16086c8856k7770M5453K0095j6350K9860N4289K2934j13322m8524J8160M733Q515
$$ plain form
16074 -40783 2011 -34080 -60355 -46902 -77427 -74925 -88940 -87576 -70916 -87504 -67068 -6607
16062 -6607 -8199 -25844 -16960 -42150 -41233 4174 -7999 -16039 21580 67325 26117 -12000 35562
16049 35562 93242 97487 -535 -9959 -2742 -21069 25415 104111 157670 125309 83950 77602
16037 77602 48136 19895 -29691 -32589 -11259 10571 -9933 -21068 19722 67498 16219 11117
16025 11117 -7975 -20262 -24889 -10213 -27398 43254 90523 78789 77432 19587 -60242 -58409
16013 -58409 29675 38697 2975 10601 61450 5525 14544 66295 24881 -35292 -38516 12429
16001 12429 35884 9728 46131 72330 49794 46863 64085 125412 103381 64685 45870 -5336
15989 -5336 3797 64429 60276 32490 -8681 -11919 8458 5017 32640 85003 52995 5704 8372
$$ packed form
16074d0783M2794l6091k6275J3453l0525K502j4015J364J6660j6588K0436O0461
16062f607j592j7645Q884k5190R17M5407j2173q040L7619M5745m1208l8117M7562
16049C5562N7680M245r8022r424P217j8327M6484P8696N3559l2361m1359o348
16037G7602k9466k8241m9586k898K1330K1830k0504j1135M0790M7776n1279n102
16025A1117j9092j2287m627J4676j7185P0652M7269j1734j357n7845p9829J833
16013e8409Q8084R022l5722P626N0849n5925R019N1751m1414o0173l224N0945
16001A2429K3455k6156L6403K6199k2536k931J7222O1327k2031l8696j8815n1206
15989e336R133O0632m153k7786m1171l238K0377l441K7623N2363l2008m7291K668
$$ plain form
15976 8372 22668 15915 46026 61751 19076 16682 30990 45409 36109 -10181 -79366 -135506
15964 -135506 -161269 -122543 -125488 -164613 -166993 -193600 -151047 -76233 -22991 -4839 7999 -15520
15952 -15520 -3434 51957 88048 21742 12296 -5997 -54103 -49346 -58456 49603 26937 -61032
15940 -61032 -90670 -96685 -42357 8456 48272 24918 -23972 -29124 -32963 -43620 -55293 -41017
15928 -41017 3005 -60433 -86539 -73615 -54171 -39641 -37159 -94092 -56794 -32449 -53967 -39131
15916 -39131 11241 93901 90726 55167 26040 -47613 -80798 -151849 -157054 -135021 -68824 -80427
15904 -80427 -107120 -66065 -19225 -6453 2540 -21996 -38046 -45080 4806 9369 -17037 -33447
15892 -33447 -85051 -97533 -98711 -70941 -62392 -49422 -92787 -29904 -5494 15554 37 -16316
$$ packed form
15976H372J4296o753L0111J5725m2675k394J4308J4419r300m6290o9185n6140
15964a35506k5763L8726k945l9125k380k6607M2553P4814N3242J8152J2838k3519
15952a5520J2086N5391L6091o6306r446j8293m8106M757r110J08059k2666q7969
15940f1032k9638o015N4328N0813L9816k3354m8890n152l839j0657j1673J4276
15928d1017M4022o3438k6106J2924J9444J4530K482n6933L7298K4345k1518J4836
15916c9131N0372Q2660l175l5559k9127p3653l3185p1051n205K2033O6197j1603
15904h0427k6693M1055M6840J2772Q993k4536j6050p034M9886M563k6406j6410
15892c3447n1604j2482j178K7770Q549J2970m3365O2883K4410K1048j5517j6353
$$ plain form
15880 -16316 23137 43355 29700 23187 29714 -29782 -31440 -12877 19749 60899 83110 75181
15868 75181 44926 -6399 -26495 -3585 -11070 -39630 -76681 -44159 9426 -17383 -5330 15775
15856 15775 50202 29518 -10762 -34556 -69683 -33707 -413 22639 20069 32102 43102 54961
15844 54961 53127 -10155 -77635 -51242 -54530 -96773 -57037 -6339 -82142 -83811 -65849 14791
15832 14791 31215 55669 69901 52416 -22235 -65286 -69493 -86872 -63519 -73379 -100318 -42598
15820 -42598 -23454 -21 4009 47366 84043 114526 59643 41658 22325 43314 25212 71316
15808 71316 56286 21037 35959 39091 51839 4482 6807 31551 18544 -28470 -25710 -2959
15796 -2959 4122 -1044 -28374 -20135 25303 31764 2315 -17806 -10421 31715 65393 62923 43230
$$ packed form
15880a6316L9453K0218j3655o513O527n9496j658J8563L2626M1150K2211p929
15868G5181l0255n1325k0096K2910p485k8560l7051L2522N3585k6809J2053K1105
15856A5775L4427k0684m0280k3794l5127L5976L3294K3052k570J2033J1000J1859
15844E4961j834o3282o7480K6393l288m2243L9736N0698p5803j669J7962Q0640
15832A4791J6424K4454J4232j7485p4651m3051m207j7379K3353r860k6939N7720
15820d2598J9144K3433M030M3357L6677L0483n4883j7985j9333K0989j8102M6104
15808G1316j5030l5249J4922L132J2748m7357K325K4744j3007m7014K760K2751
15796b959P081n166k7330Q239M5438O461k9449k0121P385M2136L3678k470j9693
$$ plain form
15783 43230 37437 5867 -7075 14896 55218 33227 49663 53962 28295 -36797 -117715 -91222
15771 -91222 -37784 -71733 -73764 -30672 -25147 -6822 14719 12770 37245 -47680 -96969 -82640
15759 -82640 -48171 -44445 -86275 -41929 -82401 -128964 -97513 -33903 -3405 509 43594 88761
15747 88761 107004 57110 44015 10578 -354 8870 18882 46613 62349 76660 12242 -66142
15735 -66142 -56737 -14705 46299 80887 52265 16860 58299 95267 104848 107518 98786 39919
15723 39919 33464 49076 64112 117269 131255 92054 11461 12958 56523 61747 25976 24594
15711 24594 49410 53842 78016 77129 68816 99579 76906 33437 -457 -25727 -16445 -61666 -50294
15698 -50294 -73827 10253 81979 95427 7302 -81470 -136754 -152654 -123355 3261 42634
$$ packed form
15783D3230n793l1570j2942K1971M0322k1991J6436M299k5667o5092q0918K6493
15771i1222N3438l3949k031M3092N525J8325K1541j949K4475q4925m9289J4329
15759h2640L4469L726m1830M4346m0472m6563L1451O3610L0498L914M3085M5167
15747H8761J8243m9894j3095l3437j0932R224J0012K7731J5736J4311o4418p8384
15735f6142R405M2032O1004L4588k8622l5405M1439L6968R581K670q732n8867
15723C9919o455J5612J5036N3157J3986l9201q0593J497M3565N224l5771j382
15711B4594K4816M432K4174q87q313L0763k2673m3469l3894k5270R282m5221J1372
15698e0294k3533Q4080P1726J3448q8125q8772n5284j5900K9299J26616L9373
$$ plain form
15687 42634 75869 40855 -3162 13337 61297 73358 58908 -10057 1999 79587 112514 50604
15675 50604 -55631 -61836 -32702 -18127 -51409 -53879 -40748 -18496 -23892 -6118 -19274 -42123
15663 -42123 1067 22364 11563 69956 72711 74940 69634 61933 89662 66226 13264 5011 -25494
15650 -25494 -44959 -45296 -65740 -45781 -8469 52740 49374 41882 36743 26018 55291 110030 105659
15637 105659 61018 49989 29161 30132 22636 -7199 -5327 -32963 -39100 -20682 42009 61379
15625 61379 76430 43062 23750 4013 43125 67600 -962 22988 47609 -16429 -14022 60379
15613 60379 90886 44739 36920 50177 5759 3190 -40515 -63091 -84823 -93137 -64285 -31684
15601 -31684 -36337 2899 -13549 -19953 -61144 -76515 -79285 -91349 -117257 -90224 -11000 17160
$$ packed form
15687D2634L3235l5014m4017J6499M7960J2061j4450o8965J2056P7588L2927o1910
15675E0604j06235o205K9134J4575l3282k470J3131K2252n396J7774j3156k2849
15663d2123M3190K1297j0801N8393K755K229n306p701K7729k3436n2962q253l0505
15650b5494j9465l37k0444J9959L7312O1209l366p492n139j0725K9273N4739m371
15637A05659m4641j1029k0828R71p496k9835J872k7636o137J8418O2691J9370
15625F1379J5051l3368j9312j9737L9112K4475o8562K3950K4621o4038K407P4401
15613F0379L0507m6147p819J3257m4418k569m3705k2576k1732q314K8852L2601
15601c1684m653L9236j6448o404m1191j5371k770j2064k5908K7033P9224K8160
$$ plain form
15589 17160 37772 32392 18088 -13885 -24460 2003 -40190 -88045 -74024 -91903 -32629 61172
15577 61172 -640 -15115 34316 25655 3961 -35737 -16697 -41148 -72092 -106338 -99738 -102327
15565 -102327 -61164 -66006 -3296 30777 16332 -13329 -19156 31076 33705 11431 27121 64143
15553 64143 20140 49700 55139 9271 -16811 -24213 -33144 -50014 -73974 -88618 -103387 -109329
15541 -109329 -23993 26605 -59130 -51027 -15265 -91169 -129128 -91114 -72758 -113659 -157123 -101644
15529 -101644 -72055 -86207 -43277 744 -5151 26280 97427 129561 71438 31307 9093 16718
15517 16718 -21049 -43422 33226 39672 22816 36473 55952 1492 -14629 11757 -11738 10790
15505 10790 19913 3680 -15243 -39775 51686 91754 86622 82359 83116 65759 23992 -31982 -66187
$$ packed form
15589A7160K0612n380j4304l1973j0575K6463m2193m7855J4021j7879N9274R3801
15577F1172o1812j4475M9431q661k1694l9698J9040k4451l0944l4246O600k589
15565a02327M1163m842O2710L4073j4445k9661n827N0232K629k2274J5690L7022
15553F4143m4003K9560N439m5868k6082p402q931j6870k3960j4644j4769n942
15541a09329Q5336N0598q5735Q103L5762p5904l7959L8014J8356m0901m3464N5479
15529a01644K9589j4152M2930M4021n895L1431P1147L2134n8123m0131k2214P625
15517A6718l7767k2373P6648O446j6856J3657J9479n4460j6121K6386k3495K2528
15505A0790R123j6233j8923k4532R1461M0068n132m263P57j7357m1767n5974l4205
$$ plain form
15492 -66187 -55812 16689 -1244 6588 -20285 -27753 -43572 -12043 -20454 -7195 -32796 -80356
15480 -80356 -122273 -104167 -62206 -82986 -49918 -50910 -23508 14744 40788 82010 89503 86882
15468 86882 59070 25963 65167 110246 76775 61495 69110 55501 61884 20819 -33983 -30335
15456 -30335 -25372 34257 39269 -7789 -12237 -5301 6046 29364 -11673 -47301 -9480 9799
15444 9799 48274 118137 118747 143551 104089 6799 -14227 -22095 16002 -1878 36190 65197
15432 65197 71270 53655 89588 126647 45141 -31039 -71831 -44821 12790 -42476 -32417 10001
15420 10001 4906 -11029 -29604 -7890 -24877 -28674 28517 15595 63758 90977 50778 41896
15408 41896 35614 14945 16815 8393 27335 3801 17594 -1763 34309 46678 63560 8666
$$ packed form
15492f6187J0375P2501j7933P832k6873p468j5819L1529q411J3259k5601m7560
15480h0356m1917J8106M1961k0780L3068r92K7402L8252K6044M1222P493k621
15468H6882k7812l3107L9204M5079l3471j5280P615j3609O383m1065n4802L648
15456c0335M963N9629N012m7058m448O936J1347K3318m1037l5628L7821J9279
15444I799L8475O9863O10K4804l9462r7290k1026p868L8097j7880L8068K9007
15432F5197O073j7615L5933L7059q1506p6180m0792K7010N7611n5266J0059M2418
15420A0001n095j5935j8575K1714j6987l797N7191j2922M8163K7219m0199q882
15408D1896o282k0669J870q422J8942k3534J3793j9357L6072J2369J6882n4894
$$ plain form
15396 8666 -46847 -39493 -89265 -75765 -53302 30746 18383 20237 18862 -26687 13227 -4016
15384 -4016 -14834 -69123 -12545 85152 53304 14313 41752 64229 54866 30668 1758 -78966
15372 -78966 -113884 -56945 23313 58251 22429 23038 39482 48536 59431 46188 16659 43670
15360 43670 82782 52192 27240 49295 43823 41142 19207 31509 -23668 -25243 -25097 -76613 -46249
15347 -46249 -7020 -32032 -72092 -110819 -88863 -58900 -91119 -87210 -71872 4226 37609 -7161
15335 -7161 8900 721 -67021 -22422 -6645 -23623 30350 102847 116477 18175 -12338 22483
15323 22483 56247 81729 22779 -56466 -49062 2455 14351 -33013 -37094 -3126 38267 56727
15311 56727 20727 -15246 -37004 -56159 -38036 -35536 -45352 22835 49069 -4263 -46079 17783
$$ packed form
15396H666n5513P354m9772J3500K2463Q4048j2363J854j375m5549L9914j7243
15384d016j0818n4289N6578R7697l1848l8991K7439K2477r363k4198k8910q0724
15372g8966l4918N6939Q0258L4938l5822O09J6444R054J0895j3243k9529K7011
15360D3670L9112l0590k4952K2055n472k681k1935J2302n5177j575J46n1516L0364
15347d6249L9229k5012m0060l8727K1956K9963l2219L909J5338P6098L3383m4770
15335g161J6061q179o7742M4599J5777j6978N3973P2497J3630r8302l0513L4821
15323B2483L3764K5482n8950p9245P404N1517J1896m7364m081L3968M1393J8460
15311E6727l6000l5973k1758j9155J8123K500r816O8187K6234n3332m1816O3862
$$ plain form
15299 17783 62951 62570 66546 24548 -32041 -35863 -71505 -51613 -14528 -40433 -20784 16192
15287 16192 -12912 -22230 -14571 993 -9931 25140 34131 22138 -6041 -16025 -35196 11323
15275 11323 6483 -11424 -50692 29201 75799 117997 120700 85505 93427 107098 92322 107178
15263 107178 68859 -31787 -48276 26204 66752 47986 -8453 25806 43431 53863 37301
15252 37301 -9743 -11021 27467 55319 51650 58507 11853 -3528 -51969 -82716 -22524 -23166 -66511
15239 -66511 -25592 7634 43982 46954 -11951 -84187 -91055 -125930 -49059 13263 26545 15149
15227 15149 -14330 -36876 -59950 -16321 -41569 -54549 11626 38026 -30309 -44833 28079 56575
15215 56575 15521 12103 53047 1162 -53439 -39025 -34937 -17205 -13235 3246 14548 13996 35420
$$ packed form
15299A7783M5168l81L976m1998n6589l822l5642J9892L7085k5905J9649L6976
15287A6192k9104r318P659J5564j0924L5071Q991j1993k8179r984j9171M6519
15275A1323m840j7907l9268P9893M6598M2198K703l5195P922J3671j4776J4856
15263A07178l8319j00646j6489P4480M0548j8766n6439L4259J7625J0432j6562
15252C7301m7044j278L8488K7852l669O857m6654j5381m8441l0747O0192o42m3345
15239f6511M0919L3226L6348K972n8905p2236o868l4875P6871O2322J3282j1396
15227A5149k9479k2546k3074M3629k5248j2980O6175K6400o8335j4524P2912K8496
15215E6575m1054l418M0944n1885n4601J4414M088J7732L970J6481J1302n52K1424
$$ plain form
15202 35420 72370 -8755 -79322 -61256 -19000 15361 35787 46055 3700 -32246 -27676 2658
15190 2658 33359 31644 -18582 -21005 7942 -11613 -15639 13065 -44175 -49992 -17462 -13792 27074
15177 27074 -5918 -62492 -71790 -92282 -119799 -134438 -120087 -130691 -132338 -95746 -36171 -3665
15165 -3665 -23116 -27302 3791 57167 100014 87591 113589 92399 72362 136857 117603 113313
15153 113313 160578 189868 201363 258662 306081 270719 203745 157676 137724 143736 85264 16875
15141 16875 13972 16040 37731 38546 8172 -10528 -24711 -62658 -9648 22281 55914 78865
15129 78865 73616 47789 3194 -11433 -30211 -37922 -30433 -2113 -3830 12076 23530 8450
15117 8450 46571 31024 8534 -10659 -27100 -11411 -2900 -42740 -63730 -10728 -23466 47932
$$ packed form
15202C5420L6950q1125p0567J8066M2256L4361K0426J0268m2355l5946M570L0334
15190B658L0701j715n0226k423K8947j9555m026K8704n7240n817L2530L670M0866
15177B7074l2992n6574r298k0492k7517j4639J4351j0604j647L6592N9575L2506
15165c665j9451m186L1093N3376M2847j2423K5998k1190k0037O4495j9254m290
15153A13313M7265K9290J1495N7299M7419l5362o6974m6069j9952O012n8472o8389
15141A6875k903K068K1691Q15l0374j8700j4183l7947N3010L1929L3633K2951
15129G8865n249k5827m4595j4627j8778p711P489K8320j717J5906J1454j5080
15117H450L8121j5547k2490j9193j6441J5689Q511l9840k0990N3002j2738P1398
$$ plain form
15105 47932 22443 -5457 32131 60659 13588 -2121 -40979 -55290 -22978 -5749 -41065 -48556
15093 -48556 -37655 8333 57240 87986 10297 2305 -12156 -39649 -69467 -111551 -61625 -42169
15081 -42169 -10521 -19837 -8940 14033 8489 17615 91458 100477 49359 8621 11733 24423 36605
15068 36605 33305 21847 1205 11395 5794 29185 38329 -25931 -18206 -21047 -11773 7504 18100
15055 18100 48405 66595 89545 4431 -618 -8982 -21280 9695 -1945 -21788 -1249 27693
15043 27693 53888 -16810 -44932 5202 61548 98653 -4517 -99017 -118346 -74609 -25094
15032 -25094 26239 39218 25913 31078 -28840 -48629 -36926 -82555 -94113 -35886 -7487 53048
15020 53048 72647 60039 32201 16827 30645 11072 11463 22147 44096 37403 -25680 -75490
$$ packed form
15105D7932k5489k7900L7588K8528m7071j5709l8858j4311L2312J7229l5316p491
15093d8556J0901M5988M8907L0746p7689p992j4461k7493k9818m2084M9926J9456
15081d2169L1648r316J0897K2973n544R126P3843R019n1118m0738L112J2690J2182
15068C6605l300j1458k0642J0190n601K3391R144o4260P725k841R274J9277J0596
15055A8100L0305J8190K2950q5114n049q364j2298L0975j1640j9843K0539K8942
15043B7693K6195p0698k8122N0134N6346L7105j03170r4500j9329M3737M9515
15032b5094N1333J2979j3305N165n9918j9789J1703m5629j1558N8227K8399O0535
15020E3048J9599j2608k7838j5374J3818j9573L91J0684K1949o693o3083m9810
$$ plain form
15008 -75490 -59642 -9083 -53195 -84065 -77292 -74565 -44920 54934 137980 100353 101792 122158
14996 122158 93351 57022 39270 53740 36322 58629 96855 96801 42954 26477 2692 -34460
14984 -34460 -73311 -13597 16633 -7860 -38156 7089 47674 44262 -4486 -14762 -37061 2244
14972 2244 -17573 -20852 -54521 -107978 -83331 -57513 -50534 -46715 -11527 -6060 -37945 -35000 -31540
14959 -31540 -67051 -6687 32934 31113 30089 72459 52343 -35138 -58471 -43646 -101019 -86460
14947 -86460 -90432 3420 85273 64746 4744 26279 93283 117848 135907 112173 105411 120643
14935 120643 116837 36031 -5621 10158 30361 12550 -27137 -26481 4255 63717 128178 183596
14923 183596 163625 134682 119562 126767 86844 78669 119300 104892 76764 71527 25947 39919
$$ packed form
15008g5490J5848N0559m4112l0870O773K727K9645R9854Q3046l7627J439K0366
14996A22158k8807l6329j7752J4470j7418K2307L8226n4n3847j6477k3785l7152
14984c4460l8851N9714L0230k4493l0296M5245M0585l412m8748j0276k2299L9305
14972B244j9817l279l3669n3457K4647K5818O979L819L5188N467l1885K945L460
14959c1540l5511O0364L9621j821j024M2370k0116q7481k3333J4825n7373J4559
14947h6460l972R3852Q1853k0527o0002K1535O7004K4565J8059k3734o762J5232
14935A20643l806q0806m1652J5779K0203j7811l9687O56L0736N9462O4461N5418
14923A83596j9971k8943j5120P205l9923q175M0631j4408k8128n237m5580J3972
$$ plain form
14911 39919 101458 52857 5716 -45212 -12629 -4756 -25813 -4889 98229 126727 103888 83956
14899 83956 85165 -14967 -58754 -15647 40312 35890 69347 81828 41624 68185 18245 -16638
14887 -16638 21899 27022 -30250 -45252 -35446 -15136 3337 -18562 8091 20463 57244 65500
14875 65500 -23587 20700 84740 100879 25523 10887 -25846 -33707 -9982 -9063 20943 -4511
14863 -4511 -9411 -25321 -19423 -32173 -74378 -76900 -103800 -69458 -48460 -55985 -19995 -34702 -8211
14850 -8211 8564 4857 254 -44690 -77979 -46130 40595 74634 41463 21853 36877 42033
14838 42033 81814 64667 14209 -19083 10372 -31747 -34639 -16484 -31627 -35419 -29997 50375
14826 50375 101574 79310 77222 94193 88898 98924 84797 51040 56981 57306 75820 57050 57121
$$ packed form
14911C9919O1539m8601m7141n0928L2583P873k1057K0924J03118K8498k2839j9932
14899H3956J209j00132m3787M3107N5959m422L3457J2481m0204K6561m9940l4883
14887a6638L8537N123n7272j5002R806K0310J8473k1899K6653J2372L6781Q256
14875F5500q9087M4287O4040J6139p5356j4636l6733p861K3725R19L0006k5454
14863d511m900j5910N898j2750m2205k522k6900L4342K0998p525L5990j4707K6491
14850h211J6775l707m603m4944l3289L1849Q6725L4039l3171j9610J5024N156
14838D2033L9781j7147n0458l3292K9455m2119k892J8155j5143l792N422Q0372
14826E0375N1199k2264k088J6971n295J0026j4127l3757N941L25J8514j8770P1
$$ plain form
14813 57121 63973 -20704 15384 48119 75817 56891 46451 53564 -26656 -43951 -40713 -16511
14801 -16511 15015 47361 20545 23420 49566 60179 18277 88632 112728 67655 105580 139605
14789 139605 160633 110607 128465 91678 39745 12900 13968 59127 111968 137163 115055 115980
14777 115980 124856 154805 117949 102621 22496 9468 68266 100515 131077 63229 -10678 -24544
14765 -24544 34944 33761 25350 40277 86210 141977 161410 164119 123430 126859 180280 247792
14753 247792 362323 553287 804991 1146909 1513514 1742370 1663693 1413032 1142374 850772
14743 850772 587214 386447 275754 294614 282942 285786 237052 154710 127264 135264 124266
14732 124266 68753 86219 124883 202191 279393 313044 324767 347481 405507 488789 658087
$$ packed form
14813E7121O852q4677L6088L2735K7698j8926j0440P113q0220j7295L238K4202
14801a6511L1526L2346k6816K875K6146J0613m1902P0355K4096m5073L7925L4025
14789A39605K1028n0026J7858l6787n1933k6845J068M5159N2841K5195k2108R25
14777A15980Q876K9949l6856j5328q0125j3028N8798L2249L0562o7848p3907j3866
14765b4544N9488j183q411J4927M5933N5767J9433K709m0689L429N3421O7512
14753B47792J14531J90964K51704L41918L66605K28856p8677k50661k70658k91602
14743H50772k63558k00767j10693J8860j1672K844m8734q2342k7446Q000j0998
14732A24266n5513J7466L8664P7308P7202L3651J1723K2714N8026Q3282J69298
$$ plain form
14721 658087 967886 1314183 1644509 1798281 1660439 1354961 1002924 677949 523229 415512
14711 415512 311271 296435 290224 230248 167936 125415 134588 152231 193620 163836 114122 104284
14699 104284 160312 198490 181429 120726 96101 69245 66040 54605 53567 17438 -40732 -9345
14687 -9345 59846 61961 108351 132114 71380 49251 3536 -5497 14822 74802 77281 58496
14675 58496 40914 -12337 498 38622 63091 30676 50845 41907 54146 78411 128789 191648
14663 191648 173811 148942 123944 139537 115679 11600 -45717 -87567 -68490 -23750 26949
14652 26949 75800 115847 125222 84054 28002 29999 56476 45052 76711 47875 21367 17058
14640 17058 -20257 -54342 -54068 -44689 -28257 19796 17117 41728 43977 39420 60975 47313 58428
$$ packed form
14721F58087L09799L46297L30326J53772j37842l05478l52037l24975j54720j07717
14711D15512j04241j4836o211n9976o2312m2521R173J7643M1389k9784m9714r838
14699A04284N6028L8178j7061o0703k4625k6856l205j1435j038l6129n8170L1387
14687i345O9191K115M6390K3763o0734k2129m5715r033K0319N9980K479j8785
14675E8496j7582n3251J2835L8124K4469l2415K0169q938J2239K4265N0378O2859
14663A91648j7837k4869k4998J5593k3858j04079n7317m1850J9077M4740N0699
14652B6949M8851M0047R375m1168n6052J997K6477j1424L1659k8836k6508m309
14640A7058l7315l4085K74R379J6432M8053k679K4611K249m557K1555j3662J1115
$$ plain form
14627 58428 26413 12308 36264 44846 51948 33486 69290 48769 18910 6245 25212 92306
14615 92306 99707 97184 27293 25542 73826 35801 -7053 -17569 3329 39260 75342 118648
14603 118648 185479 171447 113268 98773 121761 104764 84333 89128 90126 132560 161211 140732
14591 140732 138879 118017 72669 67047 55833 36835 6974 34500 59254 45728 -649 -8994
14579 -8994 2801 -33359 -66569 -55719 7748 50138 43643 36286 93597 107542 116666 124058 100373
14566 100373 25244 22199 47656 47648 34190 52742 69192 57574 74274 113299 143924 106347
14554 106347 89974 195342 332538 339230 357246 363683 321107 269934 174435 135836 136427 146021
14542 146021 150413 112381 123822 155150 144283 159547 101940 88847 142642 182139 177068 161686
$$ packed form
14627E8428l2015j4105K3956Q582P102j8462L5804k0521k9859j2665J8967O7094
14615I2306P401k523o9891j751M8284l8025m2854j0516K0898L5931L6082M3306
14603A18648O6831j4032n8179j4495K2988j6997k0431M795R98M2434K8651k0479
14591A40732j853k0862m5348n622j1214j8998k9861K7526K4754j3526m6377q345
14579h994J1795l6160l3210J0850O3467M2390o495p357N7311J3945R124P392k3685
14566A00373p5129l045K5457qj3458J8552J6450j1618J6700L9025L0625l7577
14554A06347j6373J05368J37196O692J8016O437m2576n1173r5499l8599N91R594
14542A46021M392l8032J1441L1328j0867J5264n7607j3093N3795L9497n071j5382
$$ plain form
14530 161686 159217 199194 217745 127817 96889 142770 209061 220002 212111 249145 272905 339239
14518 339239 318506 261066 283839 300670 195727 95198 111134 196892 162790 138029 162225
14507 162225 192369 193241 204550 257911 271766 243277 182757 217191 174103 158780 170984 167782
14495 167782 111565 70927 50349 15408 21415 33366 83847 53753 62984 24205 21982 20283
14483 20283 68809 109252 87454 113677 141140 142217 153142 156101 119628 74252 42044 78916
14471 78916 44175 -9540 32330 98679 135696 124515 102135 116207 123100 95710 104956 112163
14459 112163 119041 135780 196094 224496 236980 185008 125923 130154 83462 61936 61676 82026
14447 82026 73885 81131 110325 129059 154723 219124 234075 195549 164088 160597 159906 162636 164386
$$ packed form
14530A61686k469L9977J8551q9928l0928M5881O6291J0941p891L7034K3760O6334
14518C39239k0733n7440K2773J6831j04943j00529J5936Q5758l4102k4761K4196
14507A62225L0144Q72J1309N3361J3855k8489o0520L4434m3088j5323J2204l202
14495A67782n6217m0638k0578l4941O007J1951N0481l0094R231l8779k223j699
14483B0283M8526M0443k1798K6223K7463J077J0925K959l6473m5376l2208L6872
14471G8916l4741n3715M1870O6349L7017j1181k2380J4072O893k7390R246P207
14459A12163O878J6739O0314K8402J2484n1972n9085M231m6692k1526k60K0350
14447H2026q141P246K9194J8734K5664O4401J4951l8526l1461l491o91K730J750
$$ plain form
14434 164386 209528 252272 299549 315738 310596 373602 483590 556418 599882 545436 395603
14423 395603 237959 70518 -55872 -77479 -94317 -66695 -17290 -10311 11092 8513 32248
14412 32248 103376 167561 215360 203293 164858 184128 197604 201068 204703 222689 216527 221250
14400 221250 241340 291786 378737 464784 462726 400737 241464 53023 -80341 -171021 -184690
14389 -184690 -95292 -106302 -89307 -37532 -27099 19181 18596 74506 173898 200193 221835 289958
14377 289958 285266 278953 321887 315447 340569 351071 310467 349873 391427 396061 454206 508330
14365 508330 511601 477481 391668 360975 421255 458395 519626 581218 609802 615886 616548 550109
14353 550109 532519 566792 638197 686990 700884 717946 709894 753357 772947 744300 785109 864425
$$ packed form
14434A64386M5142M2744M7277J6189n142O3006J09988P2828M3464n4446j49833
14423C95603j57644j67441j26390k1607j6838K7622M9405O979K1403k579K3735
14412C2248P1128O4185M7799j2067l8435J9270J3476L464L635J7986o162M723
14400B21250K0090N0446Q6951Q6047k058o1989j59273j88441j33364r0680j3669
14389a84690Q9398j1010J6995N1775J0433M6280n85N5910R9392K6295K1642O8123
14377B89958m692o313M2934o440K5122J0502m0604L9406M1554M634N8145N4124
14365E08330L271l4120q5813l0693O0280L7140O1231O1592K8584O084O62o6439
14353E50109j7590L4273P1405M8793J3894J7062q052M3463J9590k8647M0809P9316
$$ plain form
14341 864425 887985 951668 1028646 1179903 1236912 1312097 1348799 1358692 1380835 1463055 1646123
14330 1646123 1766841 1896855 2081733 2266593 2460292 2614391 2783983 2994616 3156949
14321 3156949 3414568 3714019 4052403 4405682 4849750 5290825 5821101 6604443 7506073
14312 7506073 8651063 10172754 12054069 14360974 17068998 20083158 23839589 28991063
14304 28991063 36699422 48274549 65908328 93240656 135276553 195829059 269129569
14297 269129569 328239740 337562693 293380830 226471469 165602714 121026541 91261443
14290 91261443 71653501 58464823 49347387 42846113 38292302 35128026 32691174 30892354
14282 30892354 29885281 29580014 30066053 31418164 33437896 36126327 39816032 45243552
$$ packed form
14341H64425K3560O3683P6978J51257N7009P5185L6702R893K2143Q2220J83068
14330A646123J20718J30014J84878J84860J93699J54099J69592K10633J62333
14321C156949K57619K99451L38384L53279M44068M41075N30276P83342R01630
14312G506073J144990J521691J881315K306905K708024L014160L756431N151474
14304B8991063P708359J1575127J7633779K7332328M2035897O0552506P3300510
14297B69129569N9110171R322953m4181863o6909361o0868755m4576173k9765098
14290I1261443j9607942j3188678r117436o501274m553811l164276k436852j798820
14282C0892354j007073l05267M86039J352111K019732K688431L689705N427520
$$ plain form
14274 45243552 53555419 66209106 85474797 115103651 159831433 222501701 295084352
14267 295084352 347491012 344433017 288107146 213996353 150666997 106034524 76818198
14260 76818198 57779563 45051586 36135650 29816379 25161593 21594489 18568312 15878680
14252 15878680 13691406 11847120 10312660 9138756 8165764 7391129 6779167 6213418 5687718
14243 5687718 5246369 4991255 4723299 4408102 4136238 3866411 3549965 3290484 3098114
14234 3098114 2963832 2860658 2751092 2579593 2454765 2342238 2204272 2081327 2030455 1934719
14224 1934719 1851128 1788255 1763719 1753093 1728281 1697519 1621013 1556675 1497542 1504118 1504724 1391378
14212 1391378 1273466 1231650 1261455 1226706 1153765 1146186 1095746 1053470 1079198 1069789 1007173
$$ packed form
14274D5243552Q311867J2653687J9265691K9628854M4727782O2670268P2582651
14267B95084352N2406660l057995n6325871p4110793o3329356m4632473k9216326
14260G6818198j9038635j2727977q915936o319271m654786l567104l026177k689632
14252A5878680k187274j844286j534460j173904r72992p74635o11962n65749n25700
14243E687718m41349k55114k67956l15197k71864k69827l16446k59481j92370
14234C098114j34282j03174j09566j71499j24828j12527j37966j22945n0872r5736
14224A934719q3591o2873k4536j0626k4812l0762p6506o4338n9133O576O06j13346
14212A391378j17912m1816K9805l4749p2941p579n0440m2276K5728r409o2616
$$ plain form
14201 1007173 995078 992694 958407 944488 945316 895695 837843 860793 906645 870384 795459 782222
14189 782222 738669 717094 721273 704762 727855 765809 729568 758784 782994 848980 831522 772970
14177 772970 756510 790188 841489 891959 907765 967471 983485 949921 828980 677024 597345
14166 597345 562017 528042 516571 500715 537739 544036 554474 543567 495773 424030 417989 435876
14154 435876 435897 448303 459412 459102 435380 445501 449954 446993 464125 501019 555813 617147 660923
14141 660923 722595 698627 601949 490412 398196 368322 347298 325923 333912 249784 229286
14130 229286 205222 180970 177880 176128 149849 119660 138676 173535 165479 178431 228893 234405
14118 234405 276622 279467 287976 258950 186830 232962 227835 218226 289622 365771 394403 377026
$$ packed form
14201A007173j2095k384l4287j3919Q28m9621n7852K2950M5852l6261p4925j3237
14189G82222m3553k1575M179j6511K3093L7954l6241K9216K4210O5986j7458n8552
14177G72970j6460L3678N1301N0470J5806N9706J6014l3564j20941j51956p9679
14166E97345l5328l3975j1471j5856L7024O297J0438j0907m7794p1743o041J7887
14154D35876K1J2406J1109l10k3722J0121M453k961J7132L6894N4794O1334M3776
14141F60923O1672k3968r6678j11537r2216k9874k1024k1375P989q4128k0498
14130B29286k4064k4252l090j752k6279l0189J9016L4859q056J2952N0462N512
14118B34405M2217K845Q509k9026p2120M6132n127r609P1396P6149K8632j7377
$$ plain form
14106 377026 361095 292737 221515 201234 135065 101245 213752 271631 256487 234319 219413
14095 219413 214437 173430 145694 81448 87358 173099 241121 248207 206439 227023 254742 243622
14083 243622 154447 88250 95831 87769 73949 95928 128300 51536 103724 154160 173739 220538
14071 220538 216209 153378 93419 97932 109162 123208 166152 147442 110335 66346 87402 89954
14059 89954 74569 79488 195593 208335 138732 179273 211053 214814 168366 194454 148618 149648
14047 149648 201122 163427 170614 151246 108092 96377 168121 139292 129854 168146 138416 112674
14035 112674 91167 26546 46858 40746 -29968 -27930 28479 40367 -1431 26258 83909 104503
14023 104503 132524 130754 119688 112135 106849 82527 2171 -21943 -29449 -13983 43722 55197
$$ packed form
14106C77026j5931o8358p1222k0281o6169l3820J12507N7879j5144k2168j4906
14095B19413m976m1007k7736o4246N910Q5741O8022P086m1768K0584K7719j1120
14083B43622q9175o6197P581q062j3820K1979L2372p6764N2188N0436J9579M6799
14071B20538m329o2831n9959M513J1230J4046M2944j8710l7107m3989K1056K552
14059H9954j5385M919J16105J2742o9603M0541L1780L761m6448K6088m5836J030
14047A49648N1474l7695P187j9368m3154j1715P1744k8829r438L8292k9730k5742
14035A12674k1507o4621K0312o112p0714K038N6409J1888m1798K7689N7651K0594
14023A04503K8021j770j1066p553n286k4322q0356k4114p506J5466N7705J1475
$$ plain form
14011 55197 7763 -9184 -2284 57817 123048 124814 138839 131891 129405 124087 110577 128850 112416
13998 112416 125753 142496 126893 88736 75550 68314 115220 143521 189559 205815 174715 136161
13986 136161 129499 117765 159962 175355 133800 85790 58800 57872 97106 175557 226960 176356
13974 176356 138056 128350 142989 168281 181745 130849 130028 143584 125573 137470 107756 96679
13962 96679 112027 131640 107959 104400 102168 111362 95731 60388 69013 81031 42894 -607
13950 -607 47973 70031 18986 -51362 -50363 -52802 2842 -8579 -6093 26436 48623 28984 -81961
13937 -81961 -125628 -107278 -110034 -20474 67384 69190 38301 -10003 56047 90780 71499 66277
13925 66277 33220 31644 72073 72065 39020 17235 19141 7438 2575 -16775 -17920 46720 145042
$$ packed form
14011E5197m7434j6947O900O0101O5231J766J4025o948k486n318j3510J8273j6434
13998A12416J3337J6743j5603l8157j3186p236M6906K8301M6038J6256l1100l8554
13986A36161o662j1734M2197J5393m1555m8010k6990r28L9234P8451N1403n0604
13974A76356l8300r706J4639K5292J3464n0896q21J3556j8011J1897k9714j1077
13962I6679J5348J9613k3681l559k232R194j5631l5343Q625J2018l8137m3501
13950f07M8580K2058n1045p0348R99k439N5644j1421K486L2529K2187j9639j10945
13937h1961m3667J8350k756Q9560Q7858J806l0889m8304O6050L4733j9281n222
13925F6277l3057j576M0429ql3045k1785J906j1703m863j9350j145O4640R8322
$$ plain form
13912 145042 224170 201150 189234 134846 129714 183811 145836 118481 123996 59808 92121 100761
13900 100761 67590 32883 49461 65994 17325 -16364 -7234 35610 85022 80890 47683 42191
13888 42191 27264 15647 26459 -8711 -46230 -39407 -6290 12497 5827 28845 37980 -15868
13876 -15868 -11582 54693 169543 101707 69097 60394 62545 46315 166 -2891 38786 17393
13864 17393 15782 59536 72901 79805 83925 93074 102288 33380 13916 2575 -9577 -59951 -3873
13851 -3873 66353 124443 163185 170794 195013 226652 306335 490870 738031 1035352 1345916
13840 1345916 1712784 1870598 1715404 1432119 1095085 811973 605882 488193 389761 322232
13830 322232 308842 251369 207782 197976 230816 284730 241135 220877 201192 176018 211378 225662
$$ packed form
13912A45042P9128k3020j1916n4388n132N4097l7975k7355N515o4188L2313Q640
13900A00761l3171l4707J6578J6533m8669l3689R130M2844M9412m132l3207n492
13888D2191j4927j1617J0812l5170l7519O823L3117J8787o670K3018R135n3848
13876a5868M286O6275J14850o7836l2610q703K151j6230m6149l057M1677k1393
13864A7393j611M3754J3365O904M120R149R214o8908j9464j1341j2152n0374N6078
13851c873P0226N8090L8742P609K4219L1639P9683J84535K47161K97321L10564
13840A345916L66868J57814j55194k83285l37034k83112k06091j17689r8432o7529
13830C22232j3390n7473m3587r806L2840N3914m3595k0258j9685k5174L5360J4284
$$ plain form
13818 225662 247117 359505 486046 550911 604030 816138 1121083 1463998 1744202 1830403
13808 1830403 1656523 1285614 913624 660250 555306 464280 424152 359921 235422 155976
13798 155976 130027 117918 22344 -886 19667 8004 32636 11999 -21271 27852 67172
13787 67172 39256 -4150 -2354 20250 46478 93366 99031 57936 54702 21819 -12632 -4872
13775 -4872 31918 90745 63626 53478 56172 51700 27965 -8890 -4231 24348 54333 91974
13763 91974 63409 34396 46536 49382 47474 -86 -17234 57840 107255 107218 83796 60147 55019
13750 55019 55817 57871 48735 46816 34573 90996 80264 21382 32743 35882 14986 17414 -5912
13737 -5912 18942 -13195 10305 -19199 -5015 17690 112092 111711 101817 47719 9574 32417
$$ packed form
13818B25662K1455J12388J26541O4865N3119K12108L04945L42915K80204Q6201
13808A830403j73880l70909l71990k53374j04944r1026m0128o4231j24499p9446
13798A55976k5949j2109r5574k3230K0553j1663K4632k0637l3270M9123L9320
13787F7172k7916m3406J796K2604K6228M6888N665m1095l234l2883l4451P760
13775d872L6790N8827k7119j0148K694m472k3735l6855M659K8579K9985L7641
13763I1974k8565k9013J2140K846j908m7560j7148P5074M9415l7k3422k3649n128
13750E5019P98K054r136j919j2243N6423j0732n8882J1361L139k0896K428k3326
13737e912K4854l2137K3500k9504J4184K2705R4402l81r894n4098l8145K2843
$$ plain form
13725 32417 24375 15263 9953 -4726 20838 52202 47149 25711 58256 99002 119817 191046
13713 191046 165596 82542 74662 110694 107005 90949 23239 -31008 -98989 5839 62274 86690
13701 86690 103451 167269 183385 169771 115099 95083 114309 79485 66751 94498 108200 105991
13689 105991 101678 21424 -51396 -77916 -65935 23847 66646 72944 65903 67434 13833 -3483
13677 -3483 -492 -2011 41292 117629 140782 64458 19424 -25351 -44189 22770 25027 12113
13665 12113 24214 11634 28591 49109 43094 30025 32598 -18226 -19442 -250 39200 -20880
13653 -20880 -104996 -113921 -30741 83329 124451 146783 95606 32581 10920 -2779 6869 31363
13641 31363 27648 63037 64831 95898 75694 16297 -41458 -43417 21826 39757 50450 34030
$$ packed form
13725C2417q042r112n310j4679K5564L1364n053k1438L2545M0746K0815P1229
13713A91046k5450q3054p880L6032l689j6056o7710n4247o7981J04828N6435K4416
13701H6690J6761O3818J6116j3614n4672k0016J9226l4824j2734K7747J3702k209
13689A05991m313q0254p2820k6520J1981Q9782M2799O298p041J531n3601j7316
13677c483K991j519M3303P6337K3153p6324m5034m4775j8838O6959K257j2914
13665A2113J2101j2580J6957K0518o015j3069K573n0824j216J9192L9450o0080
13653b0880q4116q925Q3180J14070M1122K2332n1177o3025k1661j3699R648K4494
13641C1363l715L5389J794L1067k0204n9397n7755j959O5243J7931J0693j6420
$$ plain form
13629 34030 -14916 -75590 -54909 -45818 -812 63109 59665 63558 -42547 -127702 -140719 -56757
13617 -56757 -35497 17027 -1872 -21252 -19454 9070 46933 89264 64660 49301 43248 25728
13605 25728 97147 155698 104876 72532 -3109 -22991 3644 11739 49043 43016 3163 -6651
13593 -6651 -6254 -43818 -51544 -17930 -7015 43686 21595 12784 46274 772 -18919 -7514 -34857
13580 -34857 -56711 -32290 -8995 7672 31817 -52800 -51646 -33728 2002 -43 31803 39296
13568 39296 -23496 -54891 -23395 7906 31974 -3862 23748 6158 -3826 29828 -5117 3462
13556 3462 -26845 -56960 -30480 -17179 6503 55438 90730 88038 48559 43845 -24393 -71999
13544 -71999 -24540 18149 30172 6139 22411 32985 57523 91667 76163 73073 42606 -28810
$$ packed form
13629C4030m8946o0674K0681R091M5006O3921l444L893j06105q5155j3017Q3962
13617e6757K1260N2524j8899j9380J798K8524L7863M2331k4604j5359o053j7520
13605B5728P1419N8551n0822l2344p5641j9882K6635Q095L7304o027l9853r814
13593f651L97l7564p726L3614J0915N0701k2091q811L3490m5502j9691J1405k7343
13580c4857k1854K4421K3295J6667K4145q4617J154J7918L5730k045L1846P493
13568C9296o2792l1395L1496L1301K4068l5836K7610j7590r984L3654l4945Q579
13556C462l0307l0115K6480J3301K3682M8935L5292k692l9479m714o8238m7606
13544g1999M7459M2689J2023k4033J6272J0574K4538L4144j5504l090l0467p1416
$$ plain form
13532 -28810 6231 -10285 30421 46315 13373 -6155 -14389 -27293 1623 34278 57307 67091
13520 67091 -17562 -41667 -11951 -4461 23646 51882 10604 -2548 54905 83902 15534 -35927
13508 -35927 -12200 -60765 -36880 15955 43473 44628 33376 70476 60980 6096 -20517 5033
13496 5033 62247 41745 40812 6505 -58364 -4683 64743 101529 117762 100026 75514 49946
13484 49946 37916 -12176 -22273 68302 52912 -23612 -30991 -32528 -2831 -25182 -55000 -58658
13472 -58658 -47433 -22734 11074 -4321 -20067 51060 106248 44030 67808 72746 71209 103274
13460 103274 107210 85268 42328 10236 15075 28457 89367 81944 55722 38435 -11902 -59231
13448 -59231 -28121 9513 -4808 -23670 -48949 -32211 -28318 12512 12032 30146 46724 18276
$$ packed form
13532b8810L5041j6516M0706J5894l2942j9528q234j2904K8916L2655K3029R784
13520F7091q4653k4105K9716P490K8107K8236m1278j3152N7453K8997o8368n1461
13508c5927K3727m8565K3885N2835K7518J155j1252L7100r496n4884k6613K5550
13496E033N7214k0502r33l4307o4869N3681O9426L6786J6233j7736k4512k5568
13484D9946j2030n0092j0097R0575j5390p6524p379j537K9697k2351k9818l658
13472e8658J1225K4699L3808j5395j5746P1127N5188o2218K3778M938j537L2065
13460A03274L936k1942m2940l2092M839J3382O0910p423k6222j7287n0337m7329
13448e9231L1110L7634j4321j8862k5279J6738L893M0830m80J8114J6578k8448
$$ plain form
13436 18276 -14024 -2438 -13829 -44084 -50349 -70710 -69479 -26988 -16940 13508 50747 104685
13424 104685 102500 99725 9934 -81015 -167084 -144359 -102873 -69781 -10692 20387 12985 11813
13412 11813 44055 77149 70635 26660 30425 77406 56001 83861 64832 20621 -19512 -40124
13400 -40124 17414 26008 -53164 -31549 14476 -40163 -108109 -66370 -57883 -17151 43923 126223
13388 126223 95473 42859 -9029 -62486 -71573 -46945 -37663 -5887 70233 117466 116278 29938
13376 29938 53938 94492 88238 105352 152456 133579 70391 40834 21069 9871 827 13674
13364 13674 -29563 11197 49982 11971 -37500 -27596 -43550 -53777 -57695 -17591 -19553 -4156
13352 -4156 6397 11276 16985 -39171 -20967 43903 48439 -10394 -49760 -72649 -44048 -4480
$$ packed form
13436A8276l2300J1586j1391l0255o265k0361J231M2491J0048L0448L7239N3938
13424A04685k185k775q9791r0949q6069K2725M1486L3092N9089L1079p402j172
13412A1813L2242L3094o514m3975L765M6981k1405K7860j9029m4211m0133k0612
13400d0124N7538Q594p9172K1615M6025n4639o7946M1739Q487M0732O1074Q2300
13388A26223l0750n2614n1888n3457r087K4628R282L1776P6120M7233j188q6340
13376B9938K4000M0554o254J7114M7104j8877o3188k9557j9765j1198r044J2847
13364A3674m3237M0760L8785l8011m9471R904j5954j0227l918M0104j962J5397
13352d156J0553M879N709n6156J8204O4870M536n8833l9366k2889K8601L9568
$$ plain form
13340 -4480 -846 14478 31478 22015 31602 30965 40525 57653 71840 70917 24807 -31060 9806
13327 9806 44897 -17946 -58246 -39408 35021 38130 116641 104615 59496 -6051 -38408 -24280
13315 -24280 41056 42807 43182 6481 10756 59147 64356 50465 51607 74005 46946 19726 29000
13302 29000 -27097 -69560 -84087 -70558 -69156 -39820 13669 65759 32590 -16898 -29146 -19530
13290 -19530 -30272 -10116 -16516 -75300 -70998 -15652 7214 -18733 -9181 -17873 -14530 -19618 -69408
13277 -69408 -40579 3566 -2075 5176 -19397 -4961 10897 17875 43833 45921 19735 -48428
13265 -48428 -24903 -3431 11040 -8587 -40263 -8201 39336 45411 -52445 -107930 -28542 -24515
13253 -24515 -21393 24489 40504 46152 60550 71116 77465 62388 19302 -35606 14621 118393
$$ packed form
13340d480L634J5324J7000r463R587o37R560J7128J4187r23m6110n5867M0866
13327I806L5091o2843m0300J8838P4429L109P8511j2026m5119o5547l2357J4128
13315b4280O5336J751L75l6701M275M8391N209j3891J142K2398k7059k7220R274
13302B9000n6097m2463j4527J3529J402K9336N3489N2090l3169m9488j2248R616
13290a9530j0742K0156o400n8784M302N5346K2866k5947R552q692L343n088m9790
13277f9408K8829M4145n641P251k4573J4436J5858O978K5958K088k6186o8163
13265d8428K3525K1472J4471j9627l1676L2062M7537O075r7856n5485P9388M027
13253b4515L122M5882J6015N648J4398J0566O349j5077m3086n4908N0227J03772
$$ plain form
13241 118393 108422 81502 68520 101524 109019 36958 -31451 408 3232 -3577 -23297 -19902
13229 -19902 -16973 -11332 -1582 33227 30351 4314 -34511 35677 95982 101696 46421 7129 -28496
13216 -28496 -2602 55377 34662 -23105 -47443 -56174 -50176 -58787 -84723 -45229 -44433 -33935 -34606
13203 -34606 32535 -44576 -90177 13023 9574 -15755 -68380 -61679 -50036 -3975 -42644 -58619
13191 -58619 -84462 -16483 25794 1531 34340 1645 -15314 -23208 -4748 -6821 -11145 49282
13179 49282 76744 75750 4894 -19841 40046 11716 9585 -9666 -8790 -9291 -36148 -49929 -57697
13166 -57697 -48082 -57180 -71357 -94263 -78952 -38989 -25943 -31674 -16312 -52 -27191 -87140
13154 -87140 -94277 -11194 -26003 -50314 -47459 -20608 12585 23855 55195 119373 125374 25672
$$ packed form
13241A18393r971k6920j2982L3004P495p2061o8409L1859K824o809j9720L395
13229a9902K929N641R750L4809k876k6037l8825P0188O0305N714n5275l9292l5625
13216b8496K5894N7979k0715n7767k4338q731N998q611k5936L9494P96J0498o71
13203c4606O7141p7111m5601J03200l449k5329n2625O701J1643M6061l8669j5975
13191e8619k5843O7979M2277k4263L2809l2695j6959p894J8460k073m324O0427
13179D9282K7462r94p0856k4735N9887k8330k131j9251Q76n01k6857j3781p768
13166e7697R615r098j4177k2906J5311L9963J3046n731J5362J6260k7139n9949
13154h7140p137Q3083j4809k4311K855K6851L3193J1270L1340O4178O001r9702
$$ plain form
13142 25672 -13239 20306 19012 4472 -1777 -442 25980 20272 2084 5766 14490 18919 52836
13129 52836 78024 31082 -1005 55664 52673 79619 19262 -7131 14492 -38789 -78200 -56275
13117 -56275 -55401 -112253 -120563 -85363 10284 32443 -1855 -44250 -45130 -78513 -78189 -129306 -143009
13104 -143009 -138586 -84896 -31033 12306 52559 89323 51189 43891 49341 -15999 -72141 -45550
13092 -45550 -61499 -52850 822 46715 -14474 -37271 -62158 -165572 -164840 -88773 -52784 -28910
13080 -28910 31235 65714 21698 -19582 16739 54442 13498 8417 51315 54399 39378 25954
13068 25954 87011 80492 -31095 -124234 -114031 -94559 -62793 -40557 3128 -32748 -5475 -4705
13056 -4705 -47874 -28676 3979 30866 74433 72419 7218 9700 25675 35799 15118 -30958
$$ packed form
13142B5672l8911L3545j294j4540o249J335K6422n708j8188L682Q724M429L3917
13129E2836K5188m6942l2087N6669k991K6946o0357k6393K1623n3281l9411K1925
13117e6275Q74n6852q310L5200R5647K2159l4298m2395q80l3383L24n1117j3703
13104a43009M423N3690N3863M3339M0253L6764l8134p298N450o5340n6142K6591
13092d5550j5949Q649N3672M5893o1189k2797k4887j03414P32P6067L5989K3874
13080b8910O0145L4479m4016m1280L6321L7703m0944n081M2898L084j5021j3424
13068B5954O1057o519j11587r3139J0203J9472L1766K2236M3685l5876K7273P70
13056d705m3169J9198L2655K6887M3567k014o5201K482J5975J0124k0681m6076
$$ plain form
13044 -30958 -12810 -33138 -11797 2263 1816 669 21492 14678 30684 62764 48951 22725
13032 22725 1367 22032 16126 -31710 -69458 -63936 -53484 -48412 11607 52012 32041 53652
13020 53652 19470 43833 5267 -6169 27256 -8886 1071 3612 -21929 20509 17369 31217
13008 31217 26958 -11855 -71248 -122429 -115092 -89914 -86763 -58181 -34202 -54728 -72771 -34285
12996 -34285 740 -19717 -15086 60577 61763 11383 50023 37861 -20557 6315 84868 106456
12984 106456 71154 45259 111776 154923 146567 81969 36405 53865 49697 -9390 -36398 -90651
12972 -90651 -84495 1469 -5521 47085 72254 67645 64449 85382 49306 13533 -5019 7106
12960 7106 68880 123709 69737 12987 -29035 -62684 -20393 35670 78442 36258 -3379 -82264
$$ packed form
13044c0958J8148k0328K1341J4060m47j147K0823o814J6006L2080j3813k6226
13032B2725k1358K0665n906m7836l7748N522J0452N072O0019M0405j9971K1611
13020E3652l4182K4363l8566j1436L3425l6142R957K541k5541M2438l140J3848
13008C1217m259l8813n9393n1181P337K5178L151K8582K3979k0526j8043L8486
12996c4285L5025k0457M631P5663J186n0380L8640j2162n8418K6872P8553K1588
12984A06456l5302k5895O6517M3147q356o4598m5564J7460m168n9087k7008n4253
12972i0651O156Q5964o990N2606K5169m609l196K0933l6076l5773j8552J2125
12960G106O1774N4829n3972n6750m2022l3649M2291N6063M2772m2184l9637p8885
$$ plain form
12948 -82264 -115946 -79537 -40388 -27649 -68508 -64863 -50818 -55133 -72328 -41505 -37347 -36358 -23036
12935 -23036 10287 -33590 -12962 1665 8395 6576 51086 115529 84623 44132 36841 25596
12923 25596 29567 -14513 -20948 15431 68520 105176 142775 111145 47818 16921 18905 14169
12911 14169 42601 53594 40916 2776 3769 -24487 -20673 -46671 -27388 -12945 10941 -3515
12899 -3515 -4554 -13427 -7111 -2664 2397 -16697 -13387 -53145 -60983 -32040 -40408 -33050 -16538 -13806
12885 -13806 -15622 4515 -8898 -38303 -26092 52150 39946 17477 13062 54012 37376 41558
12873 41558 73906 51969 19741 28491 46242 54055 36184 37596 -42686 -62995 -73313 -33803
12861 -33803 -27641 -4367 -9664 -18026 4269 6373 -3550 25585 21742 -28840 -22135 -279 14896
$$ packed form
12948h2264l3682L6409L9149J2739m0859L645J4045m315j7195L0823M158R89J3322
12935b3036L3323m3877K0628J4627O730j819M4510O4443l0906m0491p291j1245
12923B5596L971m4080o435L6379N3089L6656L7599l1630o3327l0897J984m736
12911A4169K8432J0993j2678l8140R93k8256L814k5998J9283J4443K3886j4456
12899c515j039q873O316M447N061j9094L310l9758p838K8943q368P358J6512K732
12885a3806j816K0137j3413k9405J2211P8242j2204k2469m415M0950j6636M182
12873D1558L2348k1937l2228Q750J7751P813j7871J412q0282k0309j0318L9510
12861c3803O162K3274n297q362K2295K104r923K9135l843n0582O705K1856J5175
$$ plain form
12848 14896 10795 41378 102706 38733 -66660 -94178 -54363 -27663 -22039 -48945 -21047 32290
12836 32290 11318 17251 36717 -6972 -795 -14442 -72692 -53477 -13216 34050 73360 52288
12824 52288 16293 -7917 -16107 14088 18227 28193 53299 42954 12576 -17699 -46893 -10169
12812 -10169 8838 34222 100638 43763 -5941 -21050 -26643 -32018 -29731 -68693 -69432 -65616 -60780
12799 -60780 -17862 10994 16507 -6433 -10862 -23590 -56051 -124937 -67218 -55680 3039 28822
12787 28822 -14507 -6103 3427 41482 76594 50881 79783 64241 79429 125526 141028 92083
12775 92083 66043 73185 88451 91350 97178 76319 -10547 -40684 -36894 -15872 -17280 -30564 -26996
12762 -26996 10791 18136 -23515 -28677 -58227 -56763 -7336 8075 16346 -20463 4077 -5315 19493
$$ packed form
12848A4896m101L0583O1328o3973j05393k7518L9815K6700N624k6906K7898N3337
12836C2290k0972N933J9466m3689O177j3647n8250J9215M0261M7266L9310k1072
12824E2288l5995k4210q190L0195M139R966K5106j0345l0378l0275k9194L6724
12812a0169J9007K5384O6416n6875m9704j5109n593n375K287l8962p39L816M836
12799f0780M2918K8856N513k2940m429j2728l2461o8886N7719J1538N8719K5783
12787B8822m3329Q404R530L8055L5112k5713K8902j5542J5188M6097J5502m8945
12775I2083k6040P142J5266K899N828k0859q6866l0137L790K1022j408j3284L568
12762b6996L7787P345m1651n162k9550J464M9427J5411Q271l6809K4540r392K4808
$$ plain form
12749 19493 39917 5441 17557 12939 -28828 -113005 -185845 -134066 -76724 -34700 -19351 25115
12737 25115 53253 15263 40257 42455 47839 118002 96430 27525 -20468 -87804 -87448 -124025
12725 -124025 -77519 -4422 54141 10235 77854 101506 28749 -50553 -74914 -23831 1358
12714 1358 7485 49073 92305 103025 126441 67902 21473 -5234 -47396 -68412 -59641 -21875
12702 -21875 -48835 -105498 -140902 -71617 -24295 -30464 37907 53909 -17484 18162 55455 86929
12690 86929 3111 -7320 19268 41942 16819 13907 17051 83027 91513 55077 15157 -3135
12678 -3135 -12814 -1653 -28223 -57820 -59433 -29938 -22861 -13523 -25219 9243 28232 23305 -7423
12665 -7423 -62495 -39373 -4462 -23065 -13647 9510 50157 50082 46383 1879 -3244 41461 4932
$$ packed form
12749A9493K0424l4476J2116m618m1767q4177p2840N1779N7342M2024J5349M4466
12737B5115K8138l7990K4994K198N384P0163k1572o8905m7993o7336L56l6577
12725a24025M6506P3097N8563m3906O7619K3652p2757p9302k4361N1083K5189
12714A358O127M1588M3232J0720K3416n8539m6429k6707m2162k1016Q771L7766
12702b1875k6960n6663l5404O9285M7322o169O8371J6002p1393L5646L7293L1474
12690H6929q3818j0431K6588K2674k5123k912L144O5976Q486l6436l9920j8292
12678c135r679J1161k6570k9597j613K9495P077R338j1696L4462J8989m927l0728
12665g423n5072K3122L4911j8603R418K3157M0647p5l699m4504n123M4705l6529
$$ plain form
12652 4932 -16244 -26823 65650 87006 88334 47746 61821 84981 22426 58236 107177 165502
12640 165502 177617 146862 106779 -20161 -42041 -24025 -20911 -44057 -26538 -12030 -54974
12629 -54974 -38101 -30090 -25696 -33713 -29888 -37247 20599 73828 104955 101259 110332 22261 -26613
12616 -26613 1895 17820 19572 -30967 -14061 1849 -51820 -43469 -680 1997 -11190 -52975
12604 -52975 -22252 -41377 -72262 -1444 34891 76350 60282 32969 52039 69091 46940 209
12592 209 17477 35958 16641 17591 82223 93661 51686 9011 -61213 -49837 -64869 -117820
12580 -117820 -72133 -40271 9861 -10839 -37579 -15893 -32176 19350 83509 94626 31004
12569 31004 73912 114048 130869 120697 137881 170374 237414 228714 251002 196819 167692 167472
$$ packed form
12652D932k1176j0579R2473K1356J328m0588J4075K3160o2555L5810M8941N8325
12640A65502J2115l0755m0083j26940k1880J8016L114k3146J7519J4508m2944
12629e4974J6873Q011M394q017L825p359N7846N3229L1127l696R073q8071m8874
12616b6613K8508J5925J752n0539J6906J5910n3669Q351M2789K677j3187m1785
12604e2975L0723j9125l0885P0818L6335M1459j6068k7313J9070J7052k2151m6731
12592B09J7268J8481j9317R50O4632J1438m1975m2675p0224J1376j5032n2951
12580a17820M5687L1862N0132k0700k6740K1686j6283N1526O4159J1117o3622
12569C1004M2908M0136J6821j0172J7184L2493O7040q700K2288n4183k9127k20
$$ plain form
12557 167472 241142 208193 181286 173318 101187 67206 93885 93882 54657 48460 47036 36907 13366
12544 13366 -20113 -37061 -19249 -14796 31110 77056 37221 46401 51318 -18338 -118848 -83092
12532 -83092 -41492 1511 23117 -37942 -36733 -44712 -100388 -74536 -17171 2352 -43335 -47496
12520 -47496 -51851 -21900 -81859 -69545 -36191 -49508 -67881 -29837 -33062 36877 97788 96272
12508 96272 94174 70418 31847 28403 71049 107197 130310 119712 52412 64603 53078 37015
12496 37015 -6355 -75882 -69005 -37223 -94347 -92557 -109484 -46201 2105 10110 -48758 -43246
12484 -43246 -1467 -8533 -2087 25942 21986 -30827 -51841 -42557 8750 102048 128365 96520
12472 96520 118006 120110 83854 27310 32820 54364 -8402 -65590 -10567 25332 23387 79194
$$ packed form
12557A67472P3670l2949k6907p968p2131l3981K6679ll9225o197j424j0129k3541
12544A3366l3479j6948J7812M453M5906M5946l9835R180M917o9656j00510L5756
12532h3092M1600M3003K1606o1059J209p979n5676K5852N7365J9523m5687m161
12520d7496m355K9951n9959J2314L3354j3317j8373L8044l225O9939O0911j516
12508I6272k098k3756l8571l444M2646L6148K3113j0598o7300J2191j1525j6063
12496C7015m3370o9527O877L1782n7124J790j6927O3283M8306Q005n8868N512
12484d3246M1779p066O446K8029l956n2813k1014R284N1307R3298K6317l1845
12472I6520K1486K104l6256n6544N510K1544o2766n7188N5023L5899j945N5807
$$ plain form
12460 79194 56858 28258 -56352 -59837 9222 41116 17845 -33440 -28566 -38247 -11471 18415
12448 18415 -18484 -27879 -3080 -797 27583 -33150 -68393 -29167 34216 52200 -32319 -87108
12436 -87108 -86127 -33189 17311 -1588 -46735 -94450 -34958 22429 -32745 -76513 -114162 -112891
12424 -112891 -10235 -5622 7836 55870 49905 -4071 -51748 -44877 -34606 5218 16654 17183
12412 17183 46391 57671 -12281 -82244 -87665 -75281 -83432 -82536 -35596 -52096 -9361 63311
12400 63311 56790 46622 44196 55743 42682 15 -32218 12824 3652 -59850 -47092 59387
12388 59387 98863 34542 -52105 -90734 -80996 -44677 -66798 -117806 -89444 -60806 -17678 17903
12376 17903 26794 -11647 -12142 -59721 -18122 186 -42858 -38782 -40596 -25540 -9916 15616 6455
$$ packed form
12460G9194k2336k8600q4610l485O9059L1894k3271n1285M874r681K6776K9886
12448A8415l6899r395K4799K283K8380o0733l5243L9226O3383J7984q4519n4789
12436h7108R81N2938N0500j8899m5147m7715N9492N7387n5174m3768l7649J271
12424a12891J02656M613J3458M8034n965n3976m7677O871J0271L9824J1436N29
12412A7183K9208J1280o9952o9963n421J2384q151Q96M6940j6500M2735P2672
12400F3311o521j0168k426J1547j3061m2667l2233M5042r172o3502J2758J06479
12388E9387L9476o4321q6647l8629R738L6319k2121n1008K8362K8638M3128L5581
12376A7903Q891l8441m95m7579M1599J8308m3044M076j814J5056J5624K5532r161
$$ plain form
12363 6455 -20956 1302 12023 -31985 -42258 -54212 -68806 -54450 -71362 -68718 -14301 72151
12351 72151 61594 26336 53430 89703 86192 57177 51620 9555 5100 -23994 1328 95316
12339 95316 149439 123377 133021 133039 53072 7087 35443 6717 39819 39348 16124 18591 31660
12326 31660 -23809 -62666 -28912 -6219 -11 12890 25979 52829 57187 11704 10658 14992
12314 14992 59453 105453 66508 72616 122780 176379 159732 159985 129460 104281 54552 31387
12302 31387 33235 -23487 -4634 5777 2037 -3043 -40665 -64972 -70480 -20117 12491 -26505
12290 -26505 -28496 11479 77537 95591 32216 19864 -1069 -19453 -4758 27874 -34205 -17665
12278 -17665 -19575 29052 79711 167788 144104 78338 36181 27627 -15140 -37467 -66448 5480
$$ packed form
12363F455k7411K2258J0721m4008j0273j1954j4594J4356j6912K644N4417Q6452
12351G2151j0557l5258K7094L6273l511k9015n557m2065m455k9094K5322R3988
12339I5316N4123k6062R644J8p9967m5985K8356k8726L3102m71k3224K467J3069
12326C1660n5469l8857L3754K2693O208J2901J3089K6850M358m5483j046M334
12314A4992M4461M6000l8945O108N0164N3599j6647K53l0525k5179m9729k3165
12302C1387J848n6722J8853J0411l740n080l7622k4307n508N0363L2608l8996
12290b6505j991L9975O6058J8054o3375j2352k0933j8384J4695L2632o2079J6540
12278a7665j910M8627N0659Q8077k3684o5766m2157q554m2767k2327k8981P1928
$$ plain form
12266 5480 29998 -15680 -3236 24415 52699 66429 109490 121775 116105 54231 61454 115206
12254 115206 150604 130562 116335 62858 -11441 -67057 -36343 16861 49825 65905 63607 83454
12242 83454 94952 104536 55948 70591 86452 80021 81601 71666 21318 23601 19843 62707 122769
12229 122769 181349 172994 86648 94018 93304 125214 128995 149737 197542 174612 156660 186061
12217 186061 184848 175738 108095 71965 45525 25610 -65184 -54065 -3505 6674 -22676 21483
12205 21483 4901 -8276 11011 -10108 -1071 64823 107627 87412 85041 168058 189652 162104
12193 162104 116785 80793 110033 128549 143234 150168 242958 259021 222383 226122 166978 89697
12181 89697 -2299 -23658 -50852 -51525 -19876 -22947 15066 65999 99359 141738 200703 238365
$$ packed form
12266E480K4518m5678J2444K7651K8284J3730M3061J2285n670o1874P223N3752
12254A15206L5398k0042j4227n3477p4299n5616L0714N3204L2964J6080k298J9847
12242H3454J1498R584m8588J4643J5861o431J580r935n0348K283l758M2864O0062
12229A22769N8580q355q6346P370p14L1910L781K0742M7805k2930j7952K9401
12217A86061j213r110o7643l6130k6440j9915r0794J1119N0560J0179k9350M4159
12205B1483j6582j3177J9287k1119R037O5894M2804k0215k371Q3017K1594k7548
12193A62104m5319l5992K9240J8516J4685O934R2790J6063l6638L739n9144p7281
12181H9697r1996k1359k7194o73L1649l071L8013N0933L3360M2379N8965L7662
$$ plain form
12169 238365 224640 194145 180512 168916 182021 186928 155699 235993 293719 360811 415490 414390
12157 414390 500197 612089 782822 997324 1319588 1762763 2318887 2982305 3446463 3398154
12147 3398154 2970194 2456846 1940785 1485289 1198635 995665 870492 829858 835772 754825
12137 754825 681983 590214 573520 579505 608038 614092 588195 603324 628687 689761 734230 798215
12125 798215 850421 891885 967183 1051406 1204521 1416397 1704596 2098410 2583588 3225013
12115 3225013 3841467 4227029 4071165 3541851 2930504 2440795 2136339 2011078 1952246 1953640
12105 1953640 1968872 2035442 2284798 2557496 2884991 3248680 3602965 4063170 4708772 5513642
12095 5513642 6500648 7769626 9454413 11903646 15553754 20991918 29166510 41098558
$$ packed form
12169B38365j3725l0495j3633j1596J3105M907l1229Q0294N7726O7092N4679j100
12157D14390Q5807J11892J70733K14502L22264M43175N56124O63418M64158m8309
12147C398154m27960n13348n16061m55496k86654k02970j25173m0634N914q0947
12137G54825p2842r1769j6694N985K8533O054k5897J5129K5363O1074M4469O3985
12125G98215N2206M1464P5298Q4223J53115K11876K88199L93814M85178O41425
12115C225013O16454L85562j55864n29314o11347m89709l04456j25261n8832J394
12105A953640J5232O6570K49356K72698L27495L63689L54285M60205O45602Q04870
12095E513642R87006J268978J684787K449233L650108N438164Q174592J1932048
$$ plain form
12087 41098558 56486999 71853001 79775364 75497047 62691005 48365726 36566949
12080 36566949 28054728 22247066 18271079 15522154 13670390 12368770 11504018 11081130
12072 11081130 10935425 10967328 11147339 11529088 12026822 12702124 13751490 15316619 17485837
12063 17485837 20583213 25174544 32196574 43106985 59989280 85569160 120333109
12056 120333109 156305987 172782614 157361847 123277139 89302751 63670416 46442897
12049 46442897 35241008 27909454 22847962 19305329 16881332 15151090 13972842 13127784
12041 13127784 12476417 11852603 11341066 11047450 11028232 11336404 11948244 12969630 14512481
12032 14512481 16783704 20290380 25669144 33611802 44820609 58802649 71758641 76578836
$$ packed form
12087D1098558J5388441J5366002P922363m278317j2806042j4325279j1798777
12080C6566949q512221n807662l975987k748925j851764j301620q64752m22888
12072A1081130j45705L1903J80011L81749M97734O75302J049366J565129K169218
12063A7485837L097376M591331P022030J0910411J6882295K5579880L4763949
12056A20333109L5972878J6476627j5420767l4084708l3974388k5632335j7227519
12049D6442897j1201889p331554n061492l542633k423997j730242j178248q45058
12041A3127784o51367o23814n11537k93616j9218L08172O11840J021386J542851
12032A4512481K271223L506676N378764P942658J1208807J3982040J2955992M820195
$$ plain form
12024 76578836 69703642 55699976 41290668 29874567 21933481 16568285 12889918 10368556
12016 10368556 8642205 7371655 6439446 5754026 5162342 4579640 4054666 3615271 3207534
12007 3207534 2907122 2606287 2365944 2158088 1964923 1793913 1667424 1631968 1508235 1401450
11997 1401450 1278923 1177111 1182941 1144882 1067976 985137 970643 907870 851084 888282 867012
11986 867012 792680 728182 719916 698363 662791 636697 613041 562271 545659 554823 548448 548050
11974 548050 608559 617770 479346 438436 447109 444418 428519 451533 492775 461597 397589 410179
11962 410179 378762 384541 447889 464929 417953 405405 394020 369308 311563 311996 305736 337317
11950 337317 291484 290358 327316 358676 324919 336725 335433 295337 228524 182420 196240 205268
$$ packed form
12024G6578836o875194j4003666j4409308j1416101p941086n365196l678367k521362
12016A0368556j726351j270550r32209o85420n91684n82702n24974m39395m07737
12007C207534l00412l00835k40343k07856j93165j71010j26489l5456j23733j06785
11997A401450j22527j01812N830l8059p6906q2839j4494o2773n6786L7198k1270
11986H67012p4332o4498q266k1553l5572k6094k3656n0770j6612R164o375l98
11974E48050O0509R211j38424m0910Q673k691j5899K3014M1242l1178o4008J2590
11962D10179l1417N779O3348J7040m6976j2548j1385k4712n7745M33o260L1581
11950C37317m5833j126L6958L1360l3757J1806j292m0096o6813m6104J3820R028
$$ plain form
11938 205268 232089 305564 341462 393591 377125 361407 389886 423473 466421 438555 403427
11927 403427 368309 319610 268720 261806 244126 206340 203813 202088 186717 135578 178173 248357
11915 248357 214880 174959 242391 193006 200415 285473 275937 206739 265463 272998 288471 269967
11903 269967 271971 256519 262158 203129 204365 242523 195181 120214 42789 24788 13230 44283
11891 44283 58184 57640 60621 59391 46709 83022 49365 -16834 -2519 8311 77856 93283
11879 93283 122223 156070 163689 201010 192891 172727 176399 120999 80841 82090 111814 107203 81440
11866 81440 36445 48870 93497 95032 25343 -41513 7446 33074 38265 76585 101801 117558
11854 117558 140689 107322 110921 94955 61711 63422 13170 26363 20988 54423 74864 43942
$$ packed form
11938B05268K6821P3475L5898N2129j6466j5718K8479L3587M2948k7866l5128
11927D03427l5118m8699n0890o914j7680l7786k527j725j5371n1139M2595P0184
11915B48357l3477l9921O7432m9385P409Q5058r536o9198N8724P535J5473j8504
11903B69967K004j5452N639n9029J236L8158m7342p4967p7425j8001j1558L1053
11891D4283J3901n44K981j230j2682L6313l3657o6199J4315J0830O9545J5427
11879I3283K8940L3847P619L7321q119k0164L672n5400m0158J249K9724m611k5763
11866H1440m4995J2425M4627J535o9689o6856M8959K5628N191L8320K5216J5757
11854A17558K3131l3367L599j5966l3244J711n0252J3193n375L3435K0441l0922
$$ plain form
11842 43942 17111 27744 117034 146317 188242 182719 149118 123527 137157 125705 61161 38964
11830 38964 58284 71284 55618 105227 82118 71389 40809 10860 -3162 11341 57855 44058
11818 44058 55177 55398 9058 25424 37612 -1766 26354 115459 153663 116758 70647 93495
11806 93495 132690 134381 165203 125839 75363 88377 88631 106920 124653 49758 -10791 -20244
11794 -20244 50025 16431 -82975 -65784 18139 41125 33444 86172 104266 39870 35828 41001
11782 41001 37112 10551 -24149 -38853 -81761 -32053 -2993 -10815 9371 -6510 -23395 -23721
11770 -23721 7241 51828 99864 49937 28915 86817 83734 74056 69436 40552 -5396 -52322
11758 -52322 -33082 -34320 -1203 7946 28618 26488 41113 30075 -2206 -21693 109 61849
$$ packed form
11842D3942k6831J0633Q9290K9283M1925n523l3601k5591J3630j1452o4544k2197
11830C8964J9320J3000j5666M9609k3109j0729l0580k9949j4022J4503M6514j3797
11818D4058J1119K21m6340J6366J2188l9378K8120Q9105L8204l6905m6111K2848
11806I3495L9195J691L0822l9364n0476J3014K54J8289J7733p4895o0549r453
11794b0244P0269l3594r9406J7191Q3923K2986p681N2728J8094o4396m042N173
11782D1001l889k6561l4700j4704m2908M9708K9060p822K0186j5881j6885l26
11770b3721L0962M4587M8036m9927k1022N7902l083r678m620k8884m5948m6926
11758e2322J9240j238L3117R149K0672k130J4625j1038l2281j9487K1802O1740
$$ plain form
11746 61849 36696 5202 66493 142946 182332 118547 79485 65999 60472 55773 12401 -5536
11734 -5536 -55242 -18818 -15813 -15971 -21806 32737 -10593 11175 57073 49041 42011 65712 18910
11721 18910 -70616 -97732 -87036 -68017 -43814 -56385 3875 99779 171677 117353 116524 90487
11709 90487 41147 27110 2724 -56323 -132652 -125049 -47472 -7597 -31036 -20768 -33743 -34549
11697 -34549 -29406 20007 41885 63501 15822 -26974 -37583 -28968 -11593 -32407 -5714 59877
11685 59877 45273 26373 48879 86027 80221 78780 73591 17371 26111 9430 -9697 -25764
11673 -25764 -40754 -18161 13315 14818 16811 -11772 -35111 1681 11389 -2438 29114 40382
11661 40382 33108 26016 4247 -66083 -97346 -32896 24923 12073 -1886 -7615 47823 40211
$$ packed form
11746F1849k5153l1494O1291P6453L9386o3785l9062j3486n527m699m3372j7937
11734e536m9706L6424L005j58n835N4543m3330K1768M5898q032p030K3701m6802
11721A8910q9526k7116J0696J9019K4203j2571O0260R5904P1898n4324q29k6037
11709I0487m9340j4037k4386n9047p6329P603P7577L9875k3439J0268j2975q06
11697c4549N143M9413K1878K1616m7679m2796j0609Q615J7375k0814K6693O5591
11685E9877j4604j8900K2506L7148n806j441n189n6220Q740j6681j9127j6067
11673b5764j4990K2593L1476J503J993k8583k3339L6792R708j3827L1552J1268
11661D0382p274p092k1769p0330l1263O4450N7819j2850j3959n729N5438p612
$$ plain form
11649 40211 21945 -3169 2681 48702 82425 70671 66071 63064 303 -97631 -102745 -82851
11637 -82851 -62825 -54945 -43146 -29371 -30135 -60299 -104639 -76361 -10799 429 -15725 -25676
11625 -25676 11701 11686 44382 102459 113771 41567 40711 28665 46625 24982 11218 28698 9595
11612 9595 -60653 -59612 44072 83466 58070 28337 -5851 -22469 -18710 11121 54195 63937
11600 63937 41498 45099 46323 68258 49190 50637 50767 14384 18127 -1257 -5255 -4714 -35383
11587 -35383 -6452 25208 42354 51125 8078 15369 40497 67386 29948 -27712 -3600 58161
11575 58161 47459 100036 118506 110211 70345 69461 47260 11324 38861 75994 71323 39919
11563 39919 -68204 -116662 -100781 -62191 -5384 17158 55824 76294 60179 36804 29774 41159
$$ packed form
11649D0211j8266k5114N850M6021L3723j1754m600l007o2761r7934n114J9894
11637h2851K0026P880J1799J3775p64l0164m4340K8278O5562J1228j6154r951
11625b5676L7377j5L2696N8077J1312p2204q56j2046J7960k1643j3764J7480j9103
11612I595p0248J041J03684L9394k5396k9733l4188j6618L759K9831M3074R742
11600F3937k2439L601J224K1935j9068J447J30l6383L743j9384l998N41l0669
11587c5383K8931L1660J7146Q771m3047P291K5128K6889l7438n7660K4112O1761
11575E8161j0702N2577J8470q295l9866q84k2201l5936K7537L7133m671l1404
11563C9919j08123m8458J5881L8590N6807K2542L8666K0470j6115k3375p030J1385
$$ plain form
11551 41159 62300 53055 88537 10681 39080 20719 -49992 -38537 -14988 21454 13293 4854
11539 4854 42312 36556 -14951 -54604 -36028 5131 6205 -13709 15182 -12564 2665 22899
11527 22899 24848 25490 52524 28336 -19838 -35890 -42625 -65654 -42266 -12832 -38635 -17799
11515 -17799 -4273 16903 60122 93019 73096 19208 -26587 -63242 -72230 -36791 -24768 10377
11503 10377 7065 -49698 -62224 -37247 -37216 -39172 -12592 -3957 24811 37417 56625 40101 52133
11490 52133 8689 3239 25102 2834 9012 -24795 -30578 -11269 58463 76276 1049 -18616
11478 -18616 -77257 -44282 5820 -58807 -142271 -144602 -71864 -35541 20036 23402 -26549 -60876
11466 -60876 -42679 -67882 -92603 -88508 -43149 10141 31387 -2439 -88113 -102565 -80657 -45558
$$ packed form
11551D1159K1141r245L5482p7856K8399j8361p0711J1455K3549L6442q161q439
11539D854L7458n756n1507l9653J8576M1159J074j9914K8891k7746J5229K0234
11527B2899J949O42K7034k4188m8174j6052o735k3029K3388K9434k5803K0836
11515a7799J3526K1176M3219L2897j9923n3888m5795l6655q988L5439J2023L5145
11503A0377l312n6763j2526K4977L1j956K6580Q635K8768J2606J9208j6524J2032
11490E2133m3444n450K1863k2268O178l3807n783J9309O9732J7813p5227j9665
11478a8616n8641L2975N0102o4627q3464k331P2738L6323N5577L366m9951l4327
11466f0876J8197k5203k4721M095M5359N3290K1246l3826q5674j4452K1908L5099
$$ plain form
11454 -45558 -63374 -52109 -25798 -33082 -59444 -92805 -85360 -55704 -38346 -50063 -57195 -65419
11442 -65419 -14064 7708 -12418 50742 120167 113604 87597 56584 52962 45428 26555 24141
11430 24141 31098 20872 -8607 -11917 -33853 -21316 44012 59873 38153 11744 47143 51267
11418 51267 68994 19465 29984 89314 103851 75132 -14117 -76675 -15823 24997 19434 90849
11406 90849 123364 132088 134397 22832 -11354 -48952 -3373 22515 86484 54605 37923 -27927
11394 -27927 -20021 7911 17821 18401 -18587 -22244 989 460 7997 35796 -4910 -72381 -141729
11381 -141729 -123107 -77255 -47973 -65944 -74822 -90977 -129354 -122485 -84222 -78895 -61861 -44537
11369 -44537 -29586 3243 80960 103041 75664 85986 94912 92325 57090 -28432 -86405 -125985
$$ packed form
11454d5558j7816J1265K6311p284k6362l3361P445K9656J7358j1717p132q224
11442f5419N1355K1772k0126O3160O9425o563k6007l1013l622p534j8873k414
11430B4141O957j0226k9479l310k1936J2537O5328J5861k1720k6409L5399M124
11418E1267J7727m9529J0519N9330J4537k8719q9249o2558O0852M0820n563P1415
11406I0849L2515Q724K309j11565l4186l7598M5579K5888O3969l1879j6682o5850
11394b7927P906K7932R910N80l6988l657K3233n29P537K7799m0706o7471o9348
11381a41729J8622M5852K9282j7971q878j6155l8377O869L8263N327J7034J7324
11369d4537J4951L2829P7717K2081k7377J0322Q926k587l5235q5522n7973l9580
$$ plain form
11357 -125985 -176771 -174812 -83787 29193 62555 63137 14690 6179 3569 35095 34033 6668
11345 6668 -3983 26998 61430 16575 -42234 -24210 6871 11026 -31293 -81530 -64845 -16082
11333 -16082 -26913 -15641 -55670 -57300 3337 24779 4560 10047 1931 -30527 -47559 -47098 -12813
11320 -12813 -16987 -62147 -24224 42168 -25183 -42110 -26398 -15995 -23265 -16002 -8555 16441
11308 16441 21893 11614 88415 81919 21328 50078 63006 31072 12490 26948 -33392 -9945
11296 -9945 25088 48175 36502 -33281 -81623 -67990 -39568 -3386 21486 -7593 -35776 -12893
11284 -12893 -43483 -57811 -47161 -41686 -36864 16117 -47924 -121951 -76059 -28306 -25844 -47418
11272 -47418 -44717 -48556 -17372 64929 83709 100243 58953 -12715 2602 -1901 -7845 46789
$$ packed form
11357a25985n0786J959R1025J12980L3362N82m8447q511k610L1526j062k7365
11345F668j0651L0981L4432m4855n8809J8024L1081M155m2319n0237J6685M8763
11333a6082j0831J1272m0029j630O0637K1442k0219N487q116l2458j7032M61L4285
11320a2813m174m5160L7923O6392o7351j6927J5712J0403p270P263P447K4996
11308A6441N452j0279P6801o496o0591K8750J2928l1934j8582J4458o0340K3447
11296i945L5033K3087j1673o9783m8342J3633K8422L6182K4872k9079k8183K2883
11284a2893l0590j4328J0650N475M822N2981o4041p4027M5892M7753K462k1574
11272d7418K701l839L1184Q2301J8780J6534m1290p1668J5317m503n944N4634
$$ plain form
11260 46789 67631 22010 3258 51588 53176 40945 7256 -44070 -67147 -76910 -63355 -41564
11248 -41564 -34078 -29713 -29007 -18658 -17050 23393 77679 99727 50902 -48647 -124497 -121295 -141388
11235 -141388 -93885 -53676 -12895 -23185 -8180 1170 -23199 -75080 -46864 -65681 -60370 -47541
11223 -47541 -44725 -49410 -63763 -48733 -17334 38026 35525 -18691 -46724 -72970 -54687 -18944
11211 -18944 29023 50011 -56551 -80303 -47352 14312 66631 71699 69025 71017 54149 -12078
11199 -12078 -76398 -72624 -32506 -37404 -59102 -14642 -22528 -11728 -27611 -57281 -48943 -4857
11187 -4857 11518 -75289 -52163 12401 42049 36396 -28085 -35323 -26564 -4145 10160 83267
11175 83267 82748 57554 60501 9792 -3513 1935 -10050 -64435 -18652 -2997 18907 34701
$$ packed form
11260D6789K0842m5621j8752M8330J588j2231l3689n1326k3077r763J3555K1791
11248d1564P486M365P06J0349J608M0443N4286K2048m8825r9549p5850L202k0093
11235a41388M7503M0209M0781j0290J5005R350k4369n1881K8216j8817N311J2829
11223d7541K816m685j4353J5030L1399N5360k501n4216k8033k6246J8283L5743
11211a8944M7967K0988j06562k3752L2951O1664N2319N068k674J992j6868o6227
11199a2078o4320L774M0118m898k1698M4460p886J0800j5883k9670Q338M4086
11187d857J6375q6807K3126O4564K9648n653o4481p238Q759K2419J4305P3107
11175H3267n19k5194K947n0709j3305N448j1985n4385M5783J5655K1904J5794
$$ plain form
11163 34701 46915 86581 18192 -26827 -24136 -14267 -53726 -20040 5374 40503 10841 2297
11151 2297 -33822 -28145 -38681 -16906 2596 23721 14439 5582 52444 90234 36943 -7702
11139 -7702 -24621 -4516 37490 20584 -89831 -116185 -118022 -103006 -97841 -56929 26656 49708
11127 49708 -2567 -45568 -50806 -52749 -84503 -107335 -58303 -63143 -83160 -35706 -6341 -36891
11115 -36891 -2926 -4516 -25030 -7953 73357 28618 -57041 -78283 -41650 -18685 -13641 -1926
11103 -1926 25162 83392 56833 -43741 -50806 -16249 -43382 -59275 -34564 -72673 -70090 -44559
11091 -44559 -11292 -28766 -30650 -48206 -67629 -102272 -41546 19862 -28944 -47550 15025 21250
11079 21250 25509 55023 76104 111707 40499 -44506 -67380 -75218 -54823 -65205 -102540 -84506
$$ packed form
11163C4701J2214L9666o8389m5019K691R869l9459L3686K5414L5129k9662q544
11151B297l6119N677j0536K1775J9502K1125r282q857M6862L7790n3291m4645
11139g702j6919K0105M2006j6906j10415k6354j837J5016N165M0912Q3585K3052
11127D9708n2275m3001n238j943l1754k2832M9032m840k0017M7454K9365l0550
11115c6891L3965j590k0514J7077Q1310m4739q5659k1242L6633K2965N044J1715
11103a926K7088N8230k6559j00574p065L4557k7133j5893K4711l8109K583K5531
11091d4559L3267j7474j884j7556j9423l4643O0726O1408m8806j8606O2575O225
11079B1250M259K9514K1081L5603p1208q5005k2874p838K0395j0382l7335J8034
$$ plain form
11067 -84506 -45168 -51559 -24543 -4830 -27403 24707 40035 77648 96362 62622 25970 -16738
11055 -16738 30927 -26061 -25973 40500 104630 109579 27395 -33351 -83472 -28403 -6910 -14645 -25326
11042 -25326 -59449 -52052 -61936 -41443 8312 51171 43676 34668 25220 11800 26869 27556 -527
11029 -527 -9447 4531 -58746 14176 63917 44435 -2798 -65511 -77635 -39588 -24894 -63607
11017 -63607 -96769 -100885 -66482 6879 58098 70797 48517 9965 26532 30651 18319 25204
11005 25204 8598 33901 13231 -2639 2528 -62503 -54107 -61774 -69446 -42187 -54178 -68384
10993 -68384 -61252 -47369 -11894 -15462 -60885 -145538 -204275 -187284 -135879 -69362 -38632 -51848
10981 -51848 -117264 -126851 -117503 -48994 -7705 54638 62456 38840 8658 15006 2562 -19432
$$ packed form
11067h4506L9338o391K7016J9713k2573N2110J5328L7613J8714l3740l6652m2708
11055a6738M7665n6988Q8O6473O4130M949q2184o0746n0121N5069K1493p735j0681
11042b5326l4123P397r884K0493M9755M2859p495r008r448j3420J5069O87k8083
11029e27q920J3978o3277P2922M9741j9482m7233o2713j2124L8047J4694l8713
11017f3607l3162m116L4403P3361N1219J2699k2280l8552J6567M119j2332O885
11005B5204j6606K5303k0670j5870N167o5031Q396p667p672K7259j1991j4206
10993f8384P132J3883L5475l568m5423q4653n8737J6991N1405O6517L0730j3216
10981e1848o5416r587R348O8509M1289O2343P818k3616l0182O348j2444k1994
$$ plain form
10969 -19432 -37209 -59434 -41856 -10320 -49668 -56704 -43698 -54852 -71642 -14866 43973 32858
10957 32858 -10662 -1068 -13660 -16083 10620 44848 56290 44949 5881 -301 22284 55700
10945 55700 57422 7123 -58382 -36493 -56165 -49609 -52428 -49572 -30544 -95724 -97214 -56323 -22697
10932 -22697 651 2956 34958 38293 23001 66219 85060 67412 85904 63466 38000 5294
10920 5294 -18345 -21794 25240 18598 -3717 20293 12708 -1154 6229 6070 61324 82259 38827
10907 38827 -9188 -36770 -21585 56910 45025 -918 -23195 -15889 23135 39812 10298 26266
10895 26266 -1455 825 -40022 -125028 -149148 -150360 -129848 -67573 14780 32048 -21463 -25270
10883 -25270 -30290 -12113 -69280 -113866 -67534 36326 73577 47309 3891 -14197 -18984 -11743
$$ packed form
10969a9432j7777k2225J7578L1536l9348p036J3006j1154j6790N6776N8839j1115
10957C2858m3520R594j2592k423K6703L4228J1442j1341l9068o182K2585L3416
10945E5700J722n0299o5505K1889j9672O556k819K856J9028o5180j490M0891L3626
10932b2697K3348K305L2002L335j5292M3218J8841j7648J8492k2438k5466l2706
10920E294k3639l449M7034o642k2315K4010p585j3862P383j59N5254K0935m3432
10907C8827m8015k7582J5185P8495j1885m5943k2277P306L9024J6677k9514J5968
10895B6266k7721K280m0847q5006k4120j212K0512O2275Q2353J7268n3511l807
10883b5270n020J8177n7167m4586M6332J03860L7251k6268m3418j8088m787P241
$$ plain form
10871 -11743 33356 32870 41600 28280 -6009 23893 41758 48187 41453 14843 49156 91522 47706
10858 47706 42253 3967 47587 41311 27696 -1117 30900 43885 16888 19950 39773 18964
10846 18964 -5345 32030 52907 13829 -8945 -15580 25521 61620 32248 -49222 -23149 401
10834 401 24389 41261 31363 -6221 -41034 -18325 -30442 -2037 1802 42205 72381 44164
10822 44164 58006 89450 35393 51002 62636 51867 41559 57215 51483 63055 69428 37208
10810 37208 -3073 10049 66125 24739 -41016 -56646 -39842 -4920 -10906 -58571 -64851 -28899
10798 -28899 -43710 -44339 -43060 -3162 25877 43212 5999 -20590 -29179 -48545 -15347 10286
10786 10286 835 7102 7111 42762 56028 93367 90168 85333 8405 -40436 -14022 -2302 -18464
$$ packed form
10871a1743M5099m86Q730j3320l4289K9902J7865O429o734k6610L4313M2366m3816
10858D7706n453l8286M3620o276j3615k8813L2017J2985k6997L062J9823k0809
10846A8964k4309L7375K0877l9078k2774o635M1101L6099k9372q1470K6073K3550
10834D01K3988J6872r898l7584l4813K2709j2117K8405L839M0403L0176k8217
10822D4164J3842L1444n4057J5609J1634j0769j0308J5656n732J1572O373l2220
10810C7208m0281J3122N6076m1386o5755j5630J6804L4922n986m7665o280L5952
10798b8899j4811o29J279L9898K9039J7335l7213k6589q589j9366L3198K5633
10786A0286r451O267RL5651J3266L7339l199m835p6928m8841K6414J1720j6162
$$ plain form
10773 -18464 -60862 -27918 2646 72155 22965 -4827 -7594 -74244 -126842 -127258 -89056 -47616
10761 -47616 -13263 73420 29019 20928 -45628 -64617 -82860 -122657 -121278 -81759 -47539 -46256
10749 -46256 -29121 15344 16251 73240 62867 26625 2549 -22622 -68897 -46063 -11822 11184
10737 11184 19121 13709 -42631 -110911 -94135 -48661 -16333 -4075 26325 101339 107400 77201
10725 77201 112581 123637 124149 131124 50207 7251 54194 -20946 -111171 -20204 8450 -16771
10713 -16771 -5119 19581 15302 -28756 -49576 -37172 -65737 -121435 -43211 46153 38865 53788
10701 53788 79427 100766 50531 39124 31886 39139 58264 14462 10013 -67914 -118945 -87371
10689 -87371 -59233 -23738 -7749 -38000 -10346 -4581 -68887 -33469 -3595 -21561 24195 45141
$$ packed form
10773a8464m2398L2944L0564O9509m9190k7792k767o6650n2598m16L8202M1440
10761d7616L4353Q6683m4401q091o6556j8989j8243l9797J379L9519L4220J283
10749d6256J7135M4465R07N6989j0373l6242k4076k5171m6275K2834L4241K3006
10737A1184P937n412n6340o8280J6776M5474L2328J2258L0400P5014O061l0199
10725G7201L5380J1056N12O975q0917m2956M6943p5140r0225R0967K8654k5221
10713a6771J1652K4700m279m4058k0820J2404k8565n5698P8224Q9364p288J4923
10701E3788K5639K1339n0235j1407p238P253J9125m3802m449p7927n1031L1574
10689h7371K8138L5495J5989l0251K7654N765o4306L5418K9874j7966M5756K0946
$$ plain form
10677 45141 27665 -42671 -56880 -68815 -99531 -124563 -86180 -17857 -72230 -93614 -40042 8691
10665 8691 22803 -20639 8859 113607 69897 -52834 -49581 -43667 -56814 -40798 -41997 -51085
10653 -51085 -97776 -95045 -127445 -84539 -11009 -11496 -8936 -27540 -8967 -37542 -60149 -10697
10641 -10697 24059 39862 34527 -5547 -36669 -72812 -78348 -37629 35838 74037 25577 -30433
10629 -30433 -31527 -60381 -55548 -15664 56241 59313 30241 -37696 -58636 -11600 -3884 36474
10617 36474 25066 -28081 1077 26959 11826 11841 54455 50314 -17353 -47889 -32912 -44004
10605 -44004 -93451 -124131 -76670 -77053 -128119 -94540 -99198 -119185 -126960 -36807 -19994 1831
10593 1831 35997 30195 40816 21823 410 17324 30246 10898 -21470 -28731 -23761 -15688 -18888
$$ packed form
10677D5141j7476p0336j4209j1935l0716k5032L8383O8323n4373k1384N3572M8733
10665H691J4112m3442K9498J04748m3710j22731L253N914j3147J6016j199r088
10653e1085m6691K731l2400M2906P3530m87K560j8604J8573k8575k2607M9452
10641a0697L4756J5803n335m0074l1122l6143n536M0719P3467L8199m8460n6010
10629c0433j094k8854M833L9884P1905L072k9072o7937k0940M7036P716M0358
10617C6474j1408n3147K9158K5882j5133J5M2614m141o7667l0536J4977j1092
10605d4004m9447l0680M7461l83n1066L3579m658j9987p775R0153J6813K1825
10593A831L4166n802J0621j8993k1413J6914J2922j9348l2368p261M970Q073l200
$$ plain form
10580 -18888 -35723 26827 79382 68395 103376 102776 76031 92709 55951 20931 -16507 38379
10568 38379 105757 46339 20965 16933 5782 21745 78118 75424 33829 -2228 -12575 -28616
10556 -28616 -47496 -5360 -32407 -50726 -28565 -43309 -56786 -36641 -41351 -65746 -117345 -96478
10544 -96478 -44973 -58172 -147104 -148673 -119160 -43982 -42780 4712 25252 39373 -20665 -62150
10532 -62150 -76061 -55492 -25380 -49167 -88771 -69365 -78426 -76312 -103485 -57190 2757 32988
10520 32988 39683 35732 31640 58770 16010 25153 -15183 -22764 14170 -22421 -16833 720 29900
10507 29900 34715 -26090 -61435 -59669 -16785 61676 62535 6958 -12082 -51829 -35719 -23618
10495 -23618 -54436 -94454 -42713 4492 -40944 -29399 -27776 -73681 -116313 -106101 -46763 -40050
$$ packed form
10580a8888j6835O2550N2555j0987L4981o00k6745J6678l6758l5020l7438N4886
10568C8379O7378n9418k5374m032j1151J5963N6373k694m1595l6057j0347j6041
10556b8616j8880M2136k7047j8319K2161j4744j3477K0145m710k4395n1599K0867
10544i6478N1505j3199q8932j569K9513P5178J202M7492K0540J4121o0038m1485
10532f2150j3911K0569L0112k3787l9604J9406r061K114k7173M6295N9947L0231
10520C2988O695l951m092K7130m2760R143m0336p581L6934l6591N588J7553K9180
10507B9900M815o0805l5345J766M2884P8461Q59n5577j9040l9747J6110J2101
10495b3618l0818m0018N1741M7205m5436J1545J623m5905m2632J0212N9338O713
$$ plain form
10483 -40050 -3889 -46355 -79223 -122248 -116103 -118813 -74389 -46183 -73593 -105811 -87423 -66810
10471 -66810 -58113 -13230 -19111 -25837 -631 -42975 -58695 -61774 -26814 -7221 -21963 -19968 -48444
10458 -48444 -53474 -20752 -8052 -47422 -7512 -782 -72057 -78003 -60308 -32400 -26390 -65636
10446 -65636 -81287 -49096 -284 1347 11364 -10019 6151 40513 5634 -47158 -108028 -123371
10434 -123371 -107712 -130232 -85089 -37996 -86812 -114730 -89974 -57201 -42016 -84232 -51307
10423 -51307 -93836 -145006 -89322 -29114 64802 86916 68562 72310 81818 31330 -46842 -73442
10411 -73442 -10516 -39398 -62992 -51053 -1432 91645 112271 41710 -3428 2320 -9905 -41757
10399 -41757 -54486 -65213 11365 2574 8418 52492 103060 95763 58244 50138 31134 -628
$$ packed form
10483d0050L6161m2466l2868m3025O145k710M4424K8206k7410l2218J8388K0613
10471f6810Q697M4883n881o726K5206m2344j5720l079L4960J9593j4742J995k8476
10458d8444n030L2722J2700l9370L9910O730p1275n946J7695K7908O010l9246
10446f5636j5651L2191M8812J631J0017k1383J6170L4362l4879n2792o0870j5343
10434a23371J5659k2520M5143M7093m8816k7918K4756L2773J5185m2216L2925
10423e1307m2529n1170N5684O0208R3916K2114j8354L748R508n0488p8172k6600
10411g3442O2926k8882k3594J1939M9621R3077K0626p0561m5138N748j2225l1852
10399d1757j2729j0727P6578q791N844M4074N0568p297l7519q106j9004l1762
$$ plain form
10387 -628 -48871 -67858 -8851 -11292 -7151 -14512 -36921 32748 103114 88789 29760 10484 -9273
10374 -9273 9633 32648 -57183 -72659 -71980 -40638 -25431 -34283 -21107 -51034 -102606 -128405
10362 -128405 -90755 -40760 -34273 -18123 -47435 -77302 -63457 -69739 -44017 -52790 -43913 -363
10350 -363 -22016 -76978 -19816 84206 118827 85897 34711 3961 -5772 8321 37246 -9926
10338 -9926 -54808 -58724 -45237 -28048 -24452 -18392 48383 87535 109115 124987 83930 37490
10326 37490 -22044 -54933 -16860 -17993 64092 113829 112467 21960 37700 -524 -28056 -49284
10314 -49284 -76443 -61368 -57986 -58144 -68799 -50187 -23449 -6520 -36078 -39317 -19224 5396
10302 5396 -19802 15149 -16819 -107931 -120225 -47920 -82720 -85615 -64979 -44744 -40568 -47953
$$ packed form
10387f28m8243j8987N9007k441M141p361k2409O9669P0366j4325n9029j9276j9757
10374i273J8906K3015q9831j5476O79L1342J5207q852J3176k9927n1572k5799
10362a28405L7650M9995O487J6150k9312k9867J3845o282K5722q773Q877M3550
10350c63k1653n4962N7162J04022L4621l2930n1186l0750r733J4093K8925m7172
10338i926m4882l916J3487J7189L596O060O6775L9152K1580J5872m1057m6440
10326C7490n9534l2889L8073j133Q2085M9737j362r0507J5740l8224k7532k1228
10314d9284k7159J5075L382j58j0655J8612K6738J6929k9558l239K0093K4620
10302E396k5198L4951l1968r1112j2294P2305l4800k895K0636K0235M176p385
$$ plain form
10290 -47953 -20804 -9718 -79090 -61545 -70671 -73939 -78773 -99829 -98407 -74809 -36335 -50904
10278 -50904 -88225 -64851 -46454 -87275 -80628 -18076 -20511 -52264 -46949 -33867 -11579 47433
10266 47433 98814 91150 42153 -13226 -48044 -122983 -40391 37013 -5876 15162 67337 70250
10254 70250 51821 -2228 -7190 -16061 -16155 -61343 -93055 -55954 8741 49609 47306 -36657 -77472
10241 -77472 -94196 -96169 -68940 3521 11509 9605 -3758 -3739 56478 73947 75161 50623 46125
10228 46125 52169 30603 54661 50096 -5 5043 7139 85281 139921 86637 75665 60183
10216 60183 -32736 -67660 12697 9022 -74339 -123518 -151394 -155297 -81118 -50817 -57612 -60500
10204 -60500 -58348 -44713 -12613 -11569 -7191 -24860 -18297 -23348 -59275 -91228 -90601 -14785 -38838
$$ packed form
10290d7953K7149J1086o9372J7545r126l268m834k1056J422K3598L8474j4569
10278e0904l7321K3374J8397m0821O647O2552k435l1753N315J3082K2288N9012
10266D7433N1381p664m8997n5379l4818p4939Q2592P7404m2889K1038N2175K913
10254G0250j8429n4049m962q871r4m5188l1712L7101O4695M0868k303q3963m0815
10241g7472j6724j973K7229P2461P988j904j3363J9O0217J7469J214k4538m498
10228D6125O044k1566K4058m565n0101N048K096P8142N4640n3284j0972j5482
10216F0183r2919l4924Q0357l675q3361m9179k7876l903P4179L0301o795k888
10204f0500K152J3635L2100J044M378j7669O563n051l5927l1953O27P5816k4053
$$ plain form
10191 -38838 -29158 -18071 -25540 -156 50570 22768 26805 14194 13163 -54820 -83193 -125625
10179 -125625 -107346 -24948 -30323 -113457 -107407 -56596 -52050 -50678 -93056 -62233 -36296 -58480
10167 -58480 -69833 -67327 -23524 -58268 -47003 -16716 -120 12799 -40559 -25115 62741 13295
10155 13295 39991 -20706 -88615 -48966 -36770 -35094 37388 30514 -17077 -12419 -4129 41409
10143 41409 69654 34915 -13624 8429 59785 47544 -13559 -34901 13611 35834 26922 27178
10131 27178 -664 -7601 47127 101806 92014 49539 30710 -12702 -28839 5163 -25926 -45102
10119 -45102 -23633 -22011 -24050 21982 -1873 9615 2786 -2575 15992 33925 107889 126916
10107 126916 147279 121959 11650 -88199 -81310 -21602 131 -44112 -77702 -106201 -69904
$$ packed form
10191c8838R680J1087p469K5384N0726k7802M037j2611j031o7983k8373m2432
10179a25625J8279Q2398n375q3134O050N0811M546J372m2378L0823K5937k2184
10167e8480j1353K506M3803l4744J1265L0287J6596J2919n3358J5444Q7856m9446
10155A3295K6696o0697o7909L9649J2196J676P2482o874m7591M658Q290M5538
10143D1409K8245l4739m8539K2053N1356j2241o1103k1342M8512K2223q912K56
10131B7178k7842o937N4728N4679r792m2475j8829m3412j6137L4002l1089j9176
10119d5102K1469J622k039M6032k3855J1488o829n361J8567J7933P3964J9027
10107A26916K0363k5320j10309r9849O889N9708K1733m4243l3590k8499L6297
$$ plain form
10096 -69904 -57509 -43475 -81334 -81210 -90674 -77273 -70100 13943 30893 -11546 -24696 -52644
10084 -52644 -86654 -98773 -84172 -30298 11323 38161 34323 1116 -22599 -36699 -36829 -54183
10072 -54183 -25952 -38185 -53968 -114493 -112264 -72679 -99118 -97973 -80173 -86824 -36805 -1929
10060 -1929 -47979 -41447 4017 39605 14904 66764 57404 27286 25200 18715 90952 88433 29583
10047 29583 75314 124103 149883 188933 137092 39010 -6929 38074 66457 47710 97788 98824
10035 98824 111790 110760 70811 32974 36208 -3169 -7713 -23707 5686 18628 10789 10317 10647
10022 10647 -39 -9781 27125 73480 52097 27489 -12360 6495 3406 -58122 -59191 -14362
10010 -14362 61537 83880 4072 -62812 -52790 -12363 -41631 -9406 -9813 -38742 -18718 -27461
$$ packed form
10096f9904J2395J4034l7859J24r464J3401P173Q4043J6950m2439j3150k7948
10084e2644l4010j2119J4601N3874M1621K6838l838l3207k3715j4100j30j7354
10072e4183K8231j2233j5783o0525K229L9585k6439J145J7800o651N0019L4876
10060a929m6050O532M5464L5588k4701N1860r360l0118k086o485P2237k519n8850
10047B9583M5731M8789K5780L9050n1841r8082m5939M5003K8383j8747N0078J036
10035I8824J2966j030l9949l7837L234l9377m544j5994K9393J2942p839m72L30
10022A0647j0686r742L6906M6355k1383k4608l9849J8855l089o1528j069M4829
10010a4362P5899K2343p9808o6884J0022M0427k9268L2225m07k8929K0024q743
$$ plain form
9998 -27461 -12085 -22671 -17078 -22512 -8986 63473 70439 58880 25847 -25797 22321 53613
9986 53613 33596 33055 45645 11681 -32262 -89722 -103893 -25301 -13346 68167 101130 6785
9974 6785 -63521 -45369 -32530 24 -54779 -15230 18869 36041 26074 -22213 1216 42644
9962 42644 43654 33068 21846 2254 -68841 -29477 64901 71901 64014 38874 7536 5843 27470
9949 27470 46977 21911 -39976 -24812 -11944 12036 24417 54479 37264 68037 84809 56335
9937 56335 41725 59419 -11903 -28687 6856 -15805 -31261 -24205 -35636 -19945 -30054 -19831
9925 -19831 21588 23378 17182 -4442 -24623 -25226 -31595 -48063 3335 -1098 62281 135150 90838
9912 90838 64657 67273 -43816 -76188 -93686 -75463 -28078 6339 -23539 -39766 -43033 -32184
$$ packed form
9998b7461J5376j0586N593n434J3526P2459O966j1559l3033n1644M8118L1292
9986E3613k0017n41J2590l3964m3943n7460j4171P8592J1955Q1513L2963r4345
9974F785p0306J8152J2839L2554n4803L9549L4099J7172r967m8287K3429M1428
9962D2644J010j0586j1222j9592p1095L9364R4378P000p887k5140l1338j693K1627
9949B7470J9507k5066o1887J5164J2868K3980J2381L0062j7215L0773J6772k8474
9937E6335j4610J7694p1322j6784L5543k2661j5456P056j1431J5691j0109J0223
9925a9831M1419J790o196k1624k0181o03o369j6468N1398m433O3379P2869m4312
9912I0838k6181K616j11089l2372j7498J8223M7385L4417k9878j6227l267J0849
$$ plain form
9900 -32184 -8764 42441 45322 59124 63224 43381 18017 35463 84662 146975 159521 45874
9888 45874 -7154 13273 -5376 -12103 2591 -36109 21380 24262 9651 -3141 -20140 -6871
9876 -6871 -35394 -25055 -9601 -38117 -776 35512 23042 43989 39419 46309 13170 19780 -14611
9863 -14611 -72594 -41260 7800 -5802 -24458 9448 51167 45984 55209 78842 68275 46400
9851 46400 22855 -6624 31605 19025 34253 -530 10587 35259 35678 48389 31201 16188
9839 16188 27743 -9657 -19982 37783 41549 22128 -31525 -43987 -38943 -21019 14724 -2387
9827 -2387 -21442 -4594 7726 -36323 -45174 -14406 18600 86067 142691 68813 -25943 -48150
9815 -48150 -25305 -43289 -63796 -15372 38326 57766 86290 106657 143052 73432 -3905 20569
$$ packed form
9900c2184K3420N1205K881J3802M100j9843k5364J7446M9199O2313J2546j13647
9888D5874n3028K0427j8649o727J4694l8700N7489K882j4611j2792j6999J3269
9876f871k8523J0339J5454k8516L7341L6288j2470K0947m570O890l3139O610l4391
9863a4611n7983L1334M9060j3602j8656L3906M1719n183R225K3633j0567k1875
9851D6400k3545k9479L8229j2580J5228l4783J1117K4672M19J2711j7188j5013
9839A6188J1555l7400j0325N7765L766j9421n3653j2462N044J7924L5743j7111
9827b387j9055J6848J2320m4049q851L0768L3006O7467N6624p3878r4756k2207
9815d8150K2845j7984k0507M8424N3698J9440K8524K0367L6395o9620p7337K4474
$$ plain form
9803 20569 32970 -11183 -59594 -26957 -20509 -61343 -88882 -98505 -105091 -91480 -37931 5595
9791 5595 70588 38254 78098 166764 201902 117885 120603 82032 45412 36756 -31344 -15986
9779 -15986 -40490 -44878 -59747 -93166 -19155 11977 -22075 -38860 -402 21479 9404 16783
9767 16783 23264 60213 34195 9669 4114 -9740 -43070 20004 61702 91467 67198 22324
9755 22324 -11226 -6655 -41218 -85577 -83804 -92889 -124698 -94906 -50023 -49836 58635 83876 82560
9742 82560 84530 75652 50594 -566 5192 60992 -30478 -49768 -26632 -55340 -110920 -119555 -131169
9729 -131169 -114134 -126638 -86600 -47573 -3188 -9256 -5325 -20109 -6591 -1070 -1022 14022 -9234
9716 -9234 -43017 -61683 -102143 -77439 -36259 -39518 -42183 -73121 -86065 -69757 1561 9558 -37304
$$ packed form
9803B0569J2401m4153m8411L2637O448m0834k7539r623o586J3611N3549M3526
9791E595O4993l2334L9844Q8666L5138q4017K718l8571l6620q656o8100J5358
9779a5986k4504m388j4869l3419P4011L1132l4052j6785L8458K1881j2075P379
9767A6783O481L6949k6018k4526n555j3854l3330O3074M1698K9765k4269m4874
9755B2324l3550M571l4563m4359J773r085l1809K9792M4883J87J08471K5241j316
9742H2560J970q878k5058n1160N758N5800r1470j9290K3136k8708n5580q635j1614
9729a31169J7035j2504M0038L9027M4385o068L931j4784J3518N521M8J5044k3256
9716i234l3783j8666m0460K4704M1180l259k665l0938j2944J6308P1318P997m6862
$$ plain form
9703 -37304 -62108 -28504 4831 -23364 -30684 15029 24351 53109 21018 -69075 -78012 -15918
9691 -15918 2040 -72187 -62344 -3885 5293 -4086 -36233 -15108 17143 -8471 -8609 -56028 -21714
9678 -21714 -37543 -50714 -34115 -49080 -60941 -71705 -63122 -80153 -62801 -33294 -54020 -88516
9666 -88516 -40826 -17145 -20632 -67929 -51452 -88310 -73442 -104410 -127424 -102374 -92043 -74124
9654 -74124 -71536 -56464 24882 67693 15949 -1597 7413 20871 13192 -26985 -43405 4483
9642 4483 40863 40748 78687 103854 82189 -5539 -131866 -111660 -36913 -51887 -68349 -71391
9630 -71391 -89453 -102447 -86486 -41267 -11374 39956 63473 1162 -57673 -27070 48995 24670
9618 24670 22612 -6190 -18969 -69230 -124064 -78417 -30422 8581 58942 27359 -31773 -51307
$$ packed form
9703c7304k4804L3604L3335k8195p320M5713R322K8758l2091r0093q937O2094
9691a5918J7958p4227R843N8459R178r379l2147K1125L2251k5614j38m7419L4314
9678b1714j5829j3171J6599j4965j1861j0764Q583j7031J7352K9507k0726l4496
9666h8516M7690K3681l487m7297J6477l6858J4868l0968k3014K5050J0331J7919
9654g4124K588J5072Q1346M2811n1744j7546R010J3458p679m0177j6420M7888
9642D483L6380j15L7939K5167k1665q7728j26327K0206P4747j4974j6462l042
9630g1391j8062j2994J5961M5219K9893N1330K3517o2311n8835L0603P6065k4325
9618B4670k058k8802j2779n0261n4834M5647M7995L9003N0361l1583n9132j9534
$$ plain form
9606 -51307 -60622 -65308 -45569 -24442 -43146 -21694 16978 27820 24226 -13080 20468 126493
9594 126493 100106 79096 49197 -41450 -85296 -40880 -42217 -25860 7482 47612 75302 110555
9582 110555 119433 8206 -93151 -60138 -60011 -104509 -45379 -14200 9400 -38939 -67708 -78276
9570 -78276 -89266 -75981 -90549 -83928 -84876 -67992 -90014 -67834 -31100 -17390 -70984 -68448 -39047
9557 -39047 -59482 -45480 -31848 -13255 -51195 -89104 -53098 10306 25008 -45217 -68037 -105901
9545 -105901 -97622 -22558 -6410 -785 9020 -25628 -18441 60477 84333 70655 136695 139053 143933
9532 143933 76395 81979 120851 92441 118189 99027 96918 79564 79193 25882 50773 50969 18429
9519 18429 16729 37741 35327 27310 36905 12694 12940 -62678 -101473 -32892 -46351 -43032 17898
$$ packed form
9606e1307r315m686J9739K1127j8704K1452L8672J0842l594l7306L3548J06025
9594A26493k6387k1010k9899r0647m3846M4416j337J6357L3342M0130K7690L5253
9582A10555Q878j11227j01357L3013J27m4498N9130L1179K3600m8339k8769j0568
9570g8276j0990J3285j4568O621r48J6884k2022K2180L6734J3710n3594K536K9401
9557c9047k0435J4002J3632J8593l7940l7909L6006O3404J4702p0225k2820l7864
9545a05901Q279P5064J6148N625R805l4648P187P8918K3856j3678O6040K358M880
9532A43933o7538N584L8872k8410K5748j9162k109j7354l71n3311K4891J96l2540
9519A8429j700K1012k414q017R595k4211K46p5618l8795O8581j3459L319O0930
$$ plain form
9506 17898 12744 -21459 -34989 -57900 -35196 -10522 1648 -28501 -5998 60689 54664 9114
9494 9114 21185 -30183 -11971 -3225 -28619 -39127 -84623 -95878 -33314 -56509 -57395 -23759 -27133
9481 -27133 -12098 -45275 -62416 -43742 -28900 -33612 -42629 -94354 -75748 -79315 -107910 -75897
9469 -75897 -58890 -107315 -138850 -168907 -121945 -77535 -113962 -152828 -130152 -101273 -91611 -109503
9457 -109503 -85080 -126545 -127995 -132766 -138022 -133781 -157549 -132072 -94024 -41444 -75203 -39206
9445 -39206 19107 32625 -5861 -58717 -71894 -53300 -6435 -42444 -120135 -133762 -134639 -108404
9433 -108404 -100198 -40543 -6500 -54144 -57483 -50496 -19623 2741 -34643 -15739 -22055 -17047 -9821
9420 -9821 3884 -11546 -38132 -69553 -49062 -3937 -29069 -46544 -516 15430 31574 59353
$$ packed form
9506A7898n154l4203j3530k2911K2704K4674J2170l0149K2503O6687o025m5550
9494I114J2071n1368J8212Q746k5394j0508m5496j1255O2564k3195q86L3636l374
9481b7133J5035l3177j7141J8674J4842m712r017n1725J8606l567k8595L2013
9469g5897J7007m8425l1535l0057M6962M4410l6427l8866K2676K8879R662j7892
9457a09503K4423m1465j450m771n256M241k3768K5477L8048N2580l3759L5997
9445c9206N8313J3518l8486n2856j3177J8594M6865l6009p7691j3627q77K6235
9433a08404Q206N9655L4043m7644l339O987L0873K2364l7384J8904o316N008P226
9420i821J3705j5430k6586l1421K0491M5125k5132j7475M6028J5946J6144K7779
$$ plain form
9408 59353 76718 36189 -14091 -67081 -98162 -117030 -67524 -24250 2402 21355 -30472 -62796
9396 -62796 -104498 -58242 14850 13395 68324 44749 -31373 -40581 -80685 -88624 -66974 -49948
9384 -49948 -43770 -35373 -23638 11139 33573 29163 39486 71137 54133 17635 1388 -13626
9372 -13626 -48589 -25504 18989 -18381 -19155 28598 42860 3057 -70781 -32449 21113 51185
9360 51185 37793 75044 131216 131223 72220 -17458 -77649 -42200 9371 61036 91899 110116 96341
9347 96341 61444 -17199 -88012 -7721 19140 -53880 -92168 -75093 -62023 -9715 5796 11725
9335 11725 28712 15207 8498 -14896 -37953 -39699 -24555 -19614 12297 71203 91528 122149
9323 122149 96348 -20416 -75263 -73546 -54027 -52293 -22320 1525 35301 -22658 -76999 -99511
$$ packed form
9408E9353J7365m0529n0280n2990l1081j8868M9506M3274K6652J8953n1827l2324
9396f2796m1702M6256P3092j455N4929k3575p6122r208m0104p939K1650J7026
9384d9948O178Q397J1735L4777K2434m410J0323L1651j7004l6498j6247j5014
9372a3626l4963K3085M4493l7370p74M7753J4262l9803p3838L8332N3562L0072
9360E1185j3392L7251N6172Pn9003q9678o0191L5449N1571N1665L0863J8217j3775
9347I6341l4897p8643p0813Q0291K6861p3020l8288J7075J3070N2308J5511N929
9335A1725J6987j3505o709k3394k3057j746J5144M941L1911N8906K0325L0621
9323A22149k5801j16764n4847J717J9519J734K9973K3845L3776n7959n4341k2512
$$ plain form
9311 -99511 -65406 -60490 -51992 -27741 71978 101505 88162 62104 72748 88128 101154 123175
9299 123175 112457 93904 66501 41827 32055 20725 58438 94171 76085 37051 7446 53953
9287 53953 55399 5145 -31881 -17643 10429 63311 71786 72029 112955 137839 130913 93531 138204
9274 138204 170478 125285 4618 -56944 -57231 -72727 -67689 -51903 -25543 65503 35878 -13810
9262 -13810 -39677 46574 79852 89150 46477 12417 50301 26029 -33958 25925 85922 29901
9250 29901 -55497 -29915 11742 20869 -9409 -54674 -65609 -66946 -40606 -8054 18537 40027
9238 40027 52141 12958 -20256 13913 92241 36926 -45787 306 1727 -21939 19032 69968
9226 69968 145187 168745 106277 116015 156862 137086 167753 134378 60299 65667 67164 49467
$$ packed form
9311i9511L4105M916Q498K4251R9719K9527j3343k6058J0644J5380J3026K2021
9299A23175j0718j8553k7403k4674r772j1330L7713L5733j8086l9034k9605M6507
9287E3953J446n0254l7026J4238K8072N2882Q475K43M0926K4884o926l7382M4673
9274A38204L2274m5193j20667o1562k87j5496N038J5786K6360R1046k9625m9688
9262a3810k5867Q6251L3278R298m2673l4060L7884k4272n9987N9883N9997n6021
9250B9901q5398K5582M1657R127l0278m5265j0935j337K6340L2552K6591K1490
9238D0027J2114l9183l3214L4169P8328n5315q2713M6093J421k3666M0971N0936
9226F9968P5219K3558o2468R738M0847j9776L0667l3375p4079N368J497j7697
$$ plain form
9214 49467 78121 134612 139834 82030 84087 105964 108762 87025 124517 93868 49078 109876
9202 109876 127880 154070 193197 212792 169840 91739 83497 89044 136913 161062 186915 220545
9190 220545 192387 144418 106302 80863 91121 116702 158373 188759 255523 247814 224531 227204
9178 227204 278154 309553 342060 407973 469697 524092 515457 514382 624555 766429 821735 828933
9166 828933 860690 925093 982277 1116015 1320002 1539086 1812911 2111361 2383448 2742230
9156 2742230 3285016 3983128 4972189 6381072 8295053 11106890 15443480 22119121 32280435
9147 32280435 46209224 60718080 66628609 58852848 44197816 30771718 21220374 15096900
9139 15096900 11166988 8586035 6785772 5487292 4514922 3732765 3154896 2704003 2337873
$$ packed form
9214D9467K8654N6491N222n7804K057K1877K798k1737L7492l0649m4790O0798
9202A09876J8004K6190L9127J9595m2952p8101q242N547M7869K4149K5853L3630
9190B20545k8158m7969l8116k5439J0258K5581M1671L0386O6764p709k3283K673
9178B27204N0950L1399L2507O5913O1724N4395q635j075J10173J41874N5306P198
9166H28933L1757O4403N7184J33738K03987K19084K73825K98450K72087L58782
9156B742230N42786O98112R89061J408883J913981K811837M336590O675641J0161314
9147C2280435J3928789J4508856N910529p775761j4655032j3426098r551344o123474
9139A5096900l929912k580953j800263j298480r72370p82157n77869m50893l66130
$$ plain form
9130 2337873 2065749 1879121 1692261 1497815 1351601 1208183 1061164 980148 926177 870530
9120 870530 863653 798787 777496 765546 716015 590026 515381 525561 477128 420249 380658 365265
9108 365265 343782 336204 351751 384111 388194 327418 283827 265152 225446 226518 213514 257436
9096 257436 259046 254539 289737 215128 222773 258020 175657 112310 79759 60275 -12931 45002
9084 45002 113092 81959 116855 92810 92805 121834 62589 29776 61383 107962 132869 126356 123198
9071 123198 127566 132154 103664 88988 76339 107533 89525 38244 32141 67799 79248 76285
9059 76285 76506 27519 36205 43703 140990 162661 117617 142086 163580 117163 87694 87222 39290
9046 39290 6165 12942 37156 68606 77936 33772 34080 63703 41106 -37039 -33248 25435 126095
$$ packed form
9130B337873k72124j86628j86860j94446j46214j43418j47019q1016n3971n5647
9120H70530o877o4866k1291j1950m9531j25989p4645J0180m8433n6879l9591j5393
9108C65265k1483p578J5547L2360M083o0776m3591j8675l9706J072j3004M3922
9096B57436J610m507L5198p4609P645L5247q2363o3347l2551j9484p3206N7933
9084D5002O8090l1133L4896k4045nK9029n9245l2813L1607M6579K4907o513l158
9071A23198M368M588k8490j4676j2649L1194j8008n1281o103L5658J1449k963
9059G6285K21m8987Q686P498R7287K1671m5044K4469K1494m6417k9469m72m7932
9046C9290l3125O777K4214L1450R330m4164L08K9623k2597p8145L791N8683J00660
$$ plain form
9033 126095 175089 180551 142977 73071 97422 87004 72100 60691 111969 187368 153610 117322
9021 117322 138205 149398 123506 133318 142229 191305 163926 115077 84907 49684 24250 27107
9009 27107 67679 63349 30133 55928 36199 50738 81790 101788 99738 22736 -38046 -5705
8997 -5705 14569 22285 48813 22132 72846 120715 126635 86516 98596 80544 67808 48418
8985 48418 5269 -13851 -32119 -30392 -24421 -43394 -36210 -2038 25015 12685 27489 48266
8973 48266 74312 25569 15729 -25284 -21329 -6590 -33600 -32390 13063 1318 -7236 18900 -24653
8960 -24653 -39646 15811 40086 5409 -8171 -15091 -25043 -32853 37950 86872 33725 57777
8948 57777 93029 118810 135471 138767 144419 136562 146981 43095 -57854 -23269 22149 60931
$$ packed form
9033A26095M8994N462l7574o9906K4351j0418j4904j1409N1278P5399l3758l6288
9021A17322K0883J1193k5892R812Q911M9076k7379m8849l0170l5223k5434K857
9009B7107M0572m330l3216K5795j9729J4539L1052J9998k050p7002o0782L2341
8997e705K0274P716K6528k6681N0714M7869N920m0119J2080j8052j2736j9390
8985D8418m3149j9120j8268J727N971j8973P184L4172K7053j2330J4804K0777
8973D8266K6046m8743r840m1013L955J4739k7010J210M5453j1745q554K6136m3553
8960b4653j4993N5457K4275l4677j3580o920r952p810P0803M8922n3147K4052
8948E7777L5252K5781J6661L296N652p857J0419j03886j00949L4585M5418L8782
$$ plain form
8936 60931 97067 107844 34716 -6435 1649 23558 -6678 25538 57059 78698 53382 36451
8924 36451 49062 11955 -50009 -905 31942 -246 -15158 8721 70519 26716 -15722 1866
8912 1866 -15610 -20528 15170 29144 -42109 4401 67758 -10889 -40444 -30079 -56240 -60103
8900 -60103 -31181 27077 47535 23863 60065 120764 82984 14472 -23583 -90260 -87025 -41780
8888 -41780 -24072 -9421 21652 48055 89306 103387 79009 43880 24941 -3407 -78729 -112357
8876 -112357 -65309 -18340 -4143 36608 37666 54605 39138 -30278 -31164 -58174 -115433 -75005
8864 -75005 -47488 33247 52460 50913 35803 1260 18525 30409 -798 -20912 -5157 37648
8852 37648 88187 90961 87553 70845 22427 -17934 -29553 -23810 -37177 -31988 28964 44100 3436
$$ packed form
8936F0931L6136J0777p3128m1151Q084K1909l0236L2216L1521K1639k5316j6931
8924C6451J2611l7107o1964M9104L2847l2188j4912K3879O1798m3803m2438J7588
8912A866j7476m918L5698J3974p1253M6510O3357p8647k9555J0365k6161l863
8900f0103K8922N8258K0458k3672L6202O0699l7780o8512l8055o6677L235M5245
8888d1780J7708J4651L1073K6403M1251J4081k4378l5129j8939k8348p5322l3628
8876a12357M7048M6969J4197M0751J058J6939j5467o9416q86k7010n7259M0428
8864g5005K7517Q0735J9213j547j5110l4543J7265J1884l1207k0114J5755M2805
8852C7648N0539K774l408j6708m8418m0361j1619N743j3367N189O0952J5136m0664
$$ plain form
8839 3436 -2573 26514 62445 64077 26812 -48238 -42628 -54206 25297 67291 74886 84695 46672
8826 46672 -85738 -99548 -45108 -18679 -19074 21440 38694 52643 69716 40626 -38199 -93839
8814 -93839 -54664 -8963 -61426 -89601 -85585 -58402 -46228 -12638 -32671 -26591 -48307 -90104
8802 -90104 -33917 -3832 32378 78212 46386 7500 -16858 -54467 -31450 -40582 -55497 -30595
8790 -30595 -44369 -115199 -123948 -114168 -58217 -34318 24938 22238 -42332 -108705 -90440 -120605
8778 -120605 -126088 -99505 3693 63212 47935 21360 62273 41250 3811 -6277 47771 70102
8766 70102 44820 -32913 -45869 -18423 -1176 -48082 -14402 49692 46781 52682 6093 -16414
8754 -16414 -17335 22613 4099 -11504 -21423 49289 7354 7705 17517 -1295 -16174 28242 57385
$$ packed form
8839C436o009K9087L5931J632l7265p5050N610j1578P9503M1994P595R809l8023
8826D6672j32410j3810N4440K6429l95M0514J7254J3949J7073k9090p8825n5640
8814i3839L9175M5701n2463k8175M016K7183J2174L3590k0033O080k1716m1797
8802i0104N6187L0085L6210M5834l1826l8886k4358l7609K3017r132j4915K4902
8790c0595j3774p0830q749R780N5951K3899N9256k700o4570o6373J8265l0165
8778a20605n483K6583J03198N9519j5277k6575M0913k1023l7439j0088N4048K2331
8766G0102k5282p7733j2956K7446J7247m6906L3680O4094k911N901m6589k2507
8754a6414r21L9948j8514j5603r919P0712m1935L51R812j8812j4879M4416K9143
$$ plain form
8741 57385 83600 58717 -11461 -30964 10288 38743 -18277 -62825 -59990 -71422 -16368 19798
8729 19798 50300 18511 -2489 -7264 23133 48139 -15449 -20065 -3586 -21593 -54975 -75080
8717 -75080 -47210 2749 -17481 -6807 31224 30921 95461 66736 33864 -425 -28208 -13900
8705 -13900 -19465 -32449 2888 8849 -23225 -37061 10985 7811 -48698 -36407 -16356 -1142
8693 -1142 18876 -35106 -28494 21825 55237 70617 20599 7342 -1636 14287 -66407 -32718
8681 -32718 20232 64536 68282 113785 135012 109866 84158 8797 -19203 16746 34937 28285
8669 28285 15663 -24200 -41953 24241 17317 13478 19295 -3894 -22302 -65717 -27497 63446
8657 63446 93547 43777 21083 -40093 -54657 -21072 -14889 -67944 2650 59536 3213 -83406
$$ packed form
8741E7385K6215k4883p0178j9503M1252K8455n7020m4548K835j1432N5054L6166
8729A9798L0502l1789k1000m775L0397K5006o3588m616J6479j8007l3382k0105
8717g5080K7870M9959k0230J0674L8031l03O4540k8725l2872l4289k7783J4308
8705a3900n565j2984L5337N961l2074j3836M8046l174n6509J2291K0051J5214
8693a142K0018n3982O612N0319L3412J5380n0018j3257q978J5923q0694L3689
8681c2718N2950M4304L746M5503K1227k5146k5708p5361k8000L5949J8191o652
8669B8285j2622l9863j7753O6194o924l839N817k3189j8408m3415L8220R0943
8657F3446L0101m9770k2694o1176j4564L3585O183n3055P0594N6886n6323q6619
$$ plain form
8645 -83406 -83293 -53188 -7157 -11244 5635 64138 73423 73490 87921 20889 40218 58270 42004
8632 42004 75717 75362 42084 11489 -16812 -23396 12297 33074 -432 -11067 41221 30340
8620 30340 2973 -4831 90345 127579 43066 -30970 -19006 -36327 -40710 2702 51290 70432
8608 70432 49874 12133 1094 27637 25593 22045 30993 22615 54357 52782 57716 65452 53506
8595 53506 60146 64933 76038 68954 110182 89980 70270 59643 48471 68738 60355 96916 116292
8582 116292 84996 77441 65129 115151 128641 121151 174692 247688 313314 255668 169427 103095
8570 103095 4463 -49060 -63483 -22891 15050 28778 28188 671 69029 146156 81837 26548
8558 26548 16952 29264 27533 -24146 -57972 -120202 -57028 -5711 -4825 -33259 -40075 29188 47653
$$ packed form
8645h3406J13L0105M6031m087J6879N8503R285O7J4431o7032J9329J8052j6266
8632D2004L3713l55l3278l0595k8301o584L5693K0777l3506j0635N2288j0881
8620C0340k7367p804R5176L7234q4513p4036J1964j7321m383M3412M8588J9142
8608G0432k0558l7741j1039K6543k044l548Q948q378L1742j575M934P736j1946
8595E3506O640M787J1105p084M1228k0202j9710j0627j1172K0267q383L6561J9376
8582A16292l1296p555j2312N0022J3490p490N3541P2996O5626n7646q6241o6332
8570A03095r8632n3523j4423M0592L7941J3728n90k7517O8358P7127o4319n5289
8558B6548r596J2312j731n1679l3826o2230O3174N1317Q86k8434o816O9263J8465
$$ plain form
8545 47653 43841 -28890 -86962 -47468 24374 39851 35132 70292 104652 108306 78086 57815
8533 57815 59479 118856 154450 205761 216210 182472 93648 -6243 -65432 -67063 -61424 -27559
8521 -27559 11473 48610 83167 19424 3783 -27347 -94 -52658 -51232 -30528 -1352 -29477
8509 -29477 -14023 12252 -38814 -60347 -70961 -70916 -107036 -142305 -139414 -139978 -88495 -71156 -71433
$$ packed form
8545D7653l812p2731n8072L9494P1842J5477m719L5160L4360L654l0220k0271
8533E7815J664N9377L5594N1311J0449l3738q8824r9891n9189j631N639L3865
8521b7559L9032L7137L4557o3743j5641l1130K7253n2564J426K0704K9176k8125
8509b9477J5454K6275n1066k1533j0614M5l6120l5269K891n64N1483J7339k77
$$ [...]
##END NTUPLES=NMR SPECTRUM
##END=
