##TITLE=Analysis number 330402
Compound Code ac 13917
Project Code adrs
Chemist Name stores
##JCAMPDX= 6.0         $$ Bruker NMR JCAMP-DX V2.0
##DATA TYPE= NMR SPECTRUM
##DATA CLASS= NTUPLES
##ORIGIN= Bruker BioSpin GmbH
##OWNER= nmr
$$ XWIN-NMR		Version 3.5
$$ Thu Nov 22 10:12:45 2007 GMT Standard Time (UT+0h)  MAYBRIDGE\nmr@NMR_250MHZ
##.OBSERVE FREQUENCY= 250.131544655141
##.OBSERVE NUCLEUS= ^1H
##.ACQUISITION MODE= SIMULTANEOUS (DQD)
##.ACQUISITION SCHEME= undefined
##.AVERAGES= 16
##.DIGITISER RES= 18
##SPECTROMETER/DATA SYSTEM= dpx250
##.PULSE SEQUENCE= zg30
##.SOLVENT NAME= DMSO
##.SHIFT REFERENCE= (INTERNAL, DMSO, 0, 16.522)
##AUDIT TRAIL= $$ (NUMBER, WHEN, WHO, WHERE, WHAT)
$$ ##TITLE= Audit trail, XWIN-NMR		Version 3.5
$$ ##JCAMPDX= 5.01
$$ ##ORIGIN= Bruker BioSpin GmbH
$$ ##OWNER= nmr
$$ C:\u/data/dgb/nmr/ADRS/2050/pdata/1/auditp.txt
$$ ##AUDIT TRAIL=  $$ (NUMBER, WHEN, WHO, WHERE, WHAT)
(   1,<2007-11-22 10:12:14.16 +000>,<MAYBRIDGE\nmr>,<NMR_250MHZ>,
      <created by zg, POWCHK disabled, PULCHK disabled
       configuration hash MD5:
       76 6E 9A 78 1E 09 19 81 EC 84 63 8F B0 6A 59 2D
       data hash MD5: 64K
       E0 8D 22 8F F3 93 C1 D8 A3 9C BC 23 DA 16 33 67>)
(   2,<2007-11-22 10:12:33.08 +000>,<MAYBRIDGE\nmr>,<NMR_250MHZ>,
      <Start of raw data processing
       ef LB = 0.3 FT_mod = 6 PKNL = 1 SI = 32K 
       data hash MD5: 32K
       E6 AF 00 CE CE B3 DD EA 62 55 AB 20 08 DB 09 8B>)
(   3,<2007-11-22 10:12:34.77 +000>,<MAYBRIDGE\nmr>,<NMR_250MHZ>,
      <apk 
       data hash MD5: 32K
       AA 16 E1 9F 4A D0 F5 24 EA A2 96 0C B2 A6 F3 D9>)
(   4,<2007-11-22 10:12:35.52 +000>,<MAYBRIDGE\nmr>,<NMR_250MHZ>,
      <abs ABSG = 5 
       data hash MD5: 32K
       97 C9 B1 8A 06 E4 D2 B0 8C 97 D5 76 A8 62 EA CF>)
$$ ##END=
$$ 
$$ hash MD5
$$ 88 57 E9 15 F1 51 86 C8 7F A4 9B B5 4E 85 D3 83
##$RELAX= 
##$RELAX= 
##$RELAX= 
##$RELAX= 
##$RELAX= 
##$RELAX= 
##$RELAX= 
$$ Bruker specific parameters
$$ --------------------------
##$DU= <C:\u>
##$EXPNO= 2050
##$NAME= <ADRS>
##$PROCNO= 1
##$TYPE= <nmr>
##$USER= <dgb>
##$AMP= (0..31)
100 100 100 100 100 100 100 100 100 100 100 100 100 100 100 100 100 100 
100 100 100 100 100 100 100 100 100 100 100 100 100 100 
##$AQSEQ= 0
##$AQ_mod= 3
##$AUNM= <au_zg>
##$AUTOPOS= <5 >
##$BF1= 250.13
##$BF2= 250.13
##$BF3= 250.13
##$BF4= 250.13
##$BF5= 500.13
##$BF6= 500.13
##$BF7= 500.13
##$BF8= 500.13
##$BYTORDA= 1
##$CFDGTYP= 0
##$CFRGTYP= 5
##$CHEMSTR= <none>
##$CNST= (0..31)
1 1 145 1 1 1 1 1 1 1 1 1 1 1 1 1 1 1 1 1 1 1 1 1 1 1 1 1 1 1 1 1 
##$CPDPRG= <>
##$CPDPRG1= <>
##$CPDPRG2= <>
##$CPDPRG3= <>
##$CPDPRG4= <mlev>
##$CPDPRG5= <mlev>
##$CPDPRG6= <mlev>
##$CPDPRG7= <mlev>
##$CPDPRG8= <mlev>
##$CPDPRGB= <>
##$CPDPRGT= <>
##$D= (0..31)
0 1 0 0 0 0 0 0 0 0.06 0 0 0 0 0 0 0.0002 0 0 0 0 0 0 0 0 0 0 0 0 0 0 
0 
##$DATE= 1195726332
##$DBL= (0..7)
120 120 120 120 120 120 120 120 
##$DBP= (0..7)
150 150 150 150 150 150 150 150 
##$DBP07= 0
##$DBPNAM0= <>
##$DBPNAM1= <>
##$DBPNAM2= <>
##$DBPNAM3= <>
$$ [...]
##$SUBNAM7= <"">
##$SUBNAM8= <"">
##$SUBNAM9= <"">
##$SW= 20.6930455092707
##$SWIBOX= (0..15)
0 0 3 0 0 0 0 0 0 0 0 0 0 0 0 0 
##$SW_h= 5175.983436853
##$TD= 65536
##$TD0= 1
##$TE= 295.16
##$TE2= 300
##$TE3= 300
##$TEG= 300
##$TL= (0..7)
0 120 120 120 120 120 120 120 
##$TP= (0..7)
150 150 150 150 150 150 150 150 
##$TP07= 0
##$TPNAME0= <>
##$TPNAME1= <>
##$TPNAME2= <>
##$TPNAME3= <>
##$TPNAME4= <>
##$TPNAME5= <>
##$TPNAME6= <>
##$TPNAME7= <>
##$TPOAL= (0..7)
0.5 0.5 0.5 0.5 0.5 0.5 0.5 0.5 
##$TPOFFS= (0..7)
0 0 0 0 0 0 0 0 
##$TUNHIN= 0
##$TUNHOUT= 0
##$TUNXOUT= 0
##$USERA1= <user>
##$USERA2= <user>
##$USERA3= <user>
##$USERA4= <user>
##$USERA5= <user>
##$V9= 5
##$VALIST= <valist>
##$VCLIST= <CCCCCCCCCCCCCCC>
##$VD= 0
##$VDLIST= <DDDDDDDDDDDDDDD>
##$VPLIST= <PPPPPPPPPPPPPPP>
##$VTLIST= <TTTTTTTTTTTTTTT>
##$WBST= 1024
##$WBSW= 4
##$XGAIN= (0..3)
0 0 0 0 
##$XL= 0
##$YL= 0
##$YMAX_a= 357811
##$YMIN_a= -543895
##$ZGOPTNS= <>
##$ZL1= 120
##$ZL2= 120
##$ZL3= 120
##$ZL4= 120
##$ABSF1= 16.522
##$ABSF2= -4.171173
##$ABSG= 5
##$ABSL= 3
##$ALPHA= 0
##$AQORDER= 0
##$ASSFAC= 0
##$ASSFACI= 0
##$ASSFACX= 0
##$ASSWID= 0
##$AUNMP= <proc_1d>
##$AZFE= 0.1
##$AZFW= 0.1
##$BCFW= 0
##$BC_mod= 0
##$BYTORDP= 0
##$COROFFS= 0
##$CY= 12.5
##$DATMOD= 1
##$DC= 0
##$DFILT= <>
##$DTYPP= 0
##$F1P= 14.0000005364418
##$F2P= -0.99999901652339
##$FCOR= 0.5
##$FTSIZE= 32768
##$FT_mod= 6
##$GAMMA= 0
##$GB= 0
##$INTBC= 1
##$INTSCL= 1
##$ISEN= 128
##$LB= 0.3
##$LEV0= 0
##$LPBIN= 0
##$MAXI= 10000
##$MC2= 0
##$MEAN= 0
##$ME_mod= 0
##$MI= 0
##$NCOEF= 0
##$NC_proc= -4
##$NLEV= 6
##$NOISF1= 0
##$NOISF2= 0
##$NSP= 0
##$NTH_PI= 0
##$NZP= 0
##$OFFSET= 16.522
##$PC= 1
##$PHC0= 158.7664
##$PHC1= 5.245453
##$PH_mod= 1
##$PKNL= yes
##$PPARMOD= 0
##$PSCAL= 4
##$PSIGN= 0
##$REVERSE= no
##$SF= 250.13
##$SI= 32768
##$SIGF1= 0
##$SIGF2= 0
##$SINO= 400
##$SIOLD= 32768
##$SREGLST= <1H.DMSO>
##$SSB= 0
##$STSI= 32768
##$STSR= 0
##$SW_p= 5175.98343685301
##$SYMM= 0
##$S_DEV= 0
##$TDeff= 65536
##$TDoff= 0
##$TI= <Analysis number 999999
Compound Code 99
Book Reference 9
Project Code 9>
##$TILT= no
##$TM1= 0
##$TM2= 0
##$TOPLEV= 0
##$USERP1= <user>
##$USERP2= <user>
##$USERP3= <user>
##$USERP4= <user>
##$USERP5= <user>
##$WDW= 1
##$XDIM= 32768
##$YMAX_p= 390993810
##$YMIN_p= -145474
$$ End of Bruker specific parameters
$$ ---------------------------------
##NTUPLES= NMR SPECTRUM
##VAR_NAME=  FREQUENCY,     SPECTRUM/REAL,   SPECTRUM/IMAG
##SYMBOL=    X,             R,               I
##VAR_TYPE=  INDEPENDENT,   DEPENDENT,       DEPENDENT
##VAR_FORM=  AFFN,          ASDF,            ASDF
##VAR_DIM=   32768,         32768,           32768
##UNITS=     HZ,            ARBITRARY UNITS, ARBITRARY UNITS
##FACTOR=    0.157963299565203, 1,           1
##FIRST=     4132.6476996994, 0,             0
##LAST=      -1043.33573715361, 0,           0
##MIN=       -1043.33573715361, -145474,     0
##MAX=       4132.6476996994, 390993810,     0
$$ Real data points
##PAGE= N=1
##DATA TABLE= (X++(R..R)), XYDATA
$$ [...]
15861C3439L779l802j3863l8721m898o354J8847R207N701L5230l1993m770K2586
15848B4388O409m804K8371j2097k2975M3557J2398m5321o2837J208K6723q0j9269
15835b4329j7413j362J26N870j3252k1189p793R508J2052o910k9922M2076M1123
15822a1415K0125j5243l230J4298l2608R326L0281j3562j054k6987l0075L850
15810e6294J4847Q508k3748o915J7442N1294L2046j738j6385l1305N995J0279
15798D026j9026o601k9117m309J1404M583J3676p859M296m0061m7122j393L8440
15785g9063j0879P0537J2041k7735K5560O91j4433L857J1951j3311l0835j2791
15773f4410l455O467K1807J4157J5463K743K2294l2119o962K226J4635p711o1283
$$ y = [33439, 37218, 33416, 19553, -19168, -24066, -30420, -11573, -2366, 3335, 38565, 6572, 1802, 24388, 30797, 25993, 54364, 42267, 19292, 62849, 75247, 29926, -32911, -31703, -4980, -5060, -24329, -41742, -43104, -42978, -37108, -50360, -71549, -79342, -69834, -57782, -64692, -94614, -52538, -11415, 8710, -6533, -9763, 4535, -28073, -18747, 11534, -2028, -3082, -30069, -60144, -56294, -41447, -32939, -56687, -63602, -46160, 5134, 37180, 35442, 19057, -12248, -6253, 4026, -15000, -21601, -50718, -55027, -43623, -39040, -25364, -33223, -28927, -68988, -116110, -117503, -79063, -89942, -19405, -7364, -35099, -9539, -8848, -23281, -19424, -7473, -20784, -51619, -64410, -67865, -61398, -39591, -25434, -9971, -7228, 15066, -17053, -24015, -21789, -7154, -14865, -76148]
15760g6148j8521K9640J7181r081j0696J0579J3558K5038K5868j5492p965J2614
15748c425R035K5499j124m0285m835N983J9102j9995j5816j1726j9790r542l2971
15735i9890J8764L0780J6627N1097N451l361j2417n0107J5372M3843O165M717
15723B7041j329n588l6411k5136k593k3516m354j1773J9064L1625N325j8050j0100
15710e5795l3972M0580L2431k514M0266M5635k1399n6967l1050l8512J4664l1464
15698i8097r451K8128M0689M2786N355K8248r706m4984K3447M1251o536l9969
15686A161j9979L6214o769k857k6018O382j9449l4889j6787J7225n397K6477o122
15673e0808o387J4314q806J0928J9061J1963N70J2956O594j4487r442l2020k9926
$$ y = [-76148, -94669, -65029, -47848, -56929, -67625, -57046, -43488, -18450, 7418, -8074, -16039, -3425, 5610, 31109, 29985, -10300, -15135, -9152, 9950, -10045, -25861, -37587, -57377, -66919, -99890, -81126, -50346, -33719, 17378, 22829, 19468, 7051, -43056, -27684, 16159, 22324, 27041, 25712, 20124, -16287, -41423, -44016, -67532, -71886, -83659, -64595, -32970, -27645, -45695, -55795, -89767, -49187, -16756, -19270, 20996, 66631, 45232, -11735, -42785, -81297, -66633, -98097, -107548, -79420, -38731, 4055, 9410, 37658, 27952, -17032, 6415, 47666, 41130, 1161, -18818, 17396, 10627, 7770, -18248, -11866, -31315, -66204, -82991, -65766, -71163, -44686, -50808, -57195, -42881, -51687, -40759, -21698, -9735, -9165, 3791, 10385, -4102, -13544, -45564, -75490]
15660g5490n918O8896N7775L1856j7885m6910J610m609j3227M8635j1193l1384
15648B156J2180o923l0808K370K0769L5371m2416j4589J2515J6988o438j1301
15636a0126J9782k8391k7303P13J2956N421j1261o353K0698m873k316J9527K41
15623a1285n096j3853p763j5805J9810J011l7045k9732K3210M1802J7823k8868
15611d5791n065m886k5091j5686K1625N5474r008l5409l8031j6001K5861K2927
15599f9081Q637L7833j0683k0944n975K5177J80n75J7126R979K6760r661j9205
15586a0432j1289l2727J1010M393k4375r232K9596O3137M733l7777j0771K6339
15574B605m669n297j1203j686k6224j4580j2185J6624J6455J6688j0554P399j912
$$ y = [-75490, -81408, -12512, 45263, 77119, 59234, 12324, 13934, 9325, -3902, 44733, 33540, 2156, 14336, 7413, -23395, -21025, -256, 35115, -7301, -21890, -9375, 7613, 1175, -10126, 9656, -18735, -46038, -45325, -32369, -26948, -38209, -44562, -23864, -28737, -31053, -11526, -11285, -16381, -30234, -37997, -53802, -33992, -32981, -70026, -99758, -76548, -34746, -16923, -45791, -50856, -55742, -80833, -96519, -74894, -19420, -28428, -63837, -101868, -117869, -92008, -69081, -60444, -22611, -33294, -54238, -60213, -35036, -34856, -35431, -18305, -8326, 18434, 8773, -10432, -21721, -54448, -43438, -39045, -63420, -72652, -43056, 20081, 24814, -12963, -23734, 2605, -2064, -7361, -18564, -20250, -46474, -61054, -73239, -56615, -40160, -23472, -34026, -26627, -28539]
15561b8539O572l242k6361l879K0254o134j7336k0782k0564K8044L1841K6691
15549a3435O854J8463j6657l9393J7354R912j7784j4274N194K5660p171j1324
15537c6601K1235k3179j9276R381j1174j2703L5302o430l5093l3531M9817L8107
15525b4145k6598n8613n610K9238N5174P768o890p680j4323k9311L6706J7174
15513b7110k7313r042M596J8626K3099J5171M810m5517j1288J6145J0203j8187
15501d5807Q689p279r725J3179k5972J1713J5890j3758P59P010o143J7200J8424
15488a5820J7003j5850l912J1979m1075j620J3881J9210k0706l63j9066l7758
15476i4097L711k822L1182j5327l6410k1096M0350N0176N4251K2417k1392n5673
$$ y = [-28539, -21967, -25209, -51570, -55449, -35195, -41329, -58665, -79447, -100011, -71967, -40126, -13435, -6581, 11882, -4775, -44168, -26814, -16902, -34686, -48960, -43766, -18106, -25277, -36601, -15366, -38545, -57821, -48440, -59614, -72317, -37015, -43445, -78538, -112069, -62252, -24145, -50743, -109356, -114966, -85728, -30554, -22786, -29676, -37356, -51679, -80990, -44284, -27110, -54423, -63465, -58869, -40243, -17144, -1973, 2837, -42680, -53968, -37823, -27620, -45807, -37118, -44397, -54122, -40943, -66915, -55202, -39312, -53070, -52311, -45301, -51444, -34244, -15820, 1183, -14667, -18579, -6600, -47675, -49295, -35414, -16204, -36910, -37273, -56339, -94097, -90386, -93208, -62026, -77353, -113763, -134859, -94509, -44333, 9918, 32335, 10943, -44730]
15464d4730K5336K6142J3675j3396k8824j7581q834M7645j1968l7329K496N3674
15452F306J3106m431l0354q178O866O498m992K704q496m0908j3296K3798M744
15439d6633l0292K9557J6210j7717R968k1248l5304K06L8314K4421p974k0677
15427f1169l0457K4633L9980L0986J8405k0772l5588r235M3899j6308j8117K7855
15415e888J2314k9077m0L0502k223k9405k7674K2294l259o348J6447K2116j628
15402a869J0110o882j5041q161q767K0059J8227p54J5525L152J482Q30m8089o566
15388b6744J3204R879q766n51p157k6066j114J5173M1239m3877J5045L0689k05
15375A0749k18k2712K5167l621J1846J0071Q979p7743p7594J2175K9316K2412
$$ y = [-44730, -19394, 6748, 20423, 7027, -21797, -39378, -48212, -567, -12535, -49864, -47368, 6306, 19412, 14981, -15373, -23551, -16685, -10187, -15179, -12475, -20971, -61879, -75175, -51377, -46633, -76925, -47368, -31158, -48875, -38907, -60155, -95459, -95253, -56939, -32518, -40492, -61169, -91626, -66993, -27013, 3973, 22378, 1606, -33982, -43217, 682, -15626, -33743, -5888, 6426, -22651, -22691, 7811, 5588, -23817, -51491, -29197, -32456, -38804, -22357, -241, -1869, 8241, 1359, -13682, -21843, -30610, -10551, 7676, 6922, 22447, 25599, 27081, 27911, -20178, -26744, -13540, -3661, -12427, -12978, -20135, -46201, -47315, -32142, 9097, -34780, -19735, 10954, 10749, 10531, -12181, 12986, 9365, 21211, 31282, 40261, -37482, -115076, -102901, -73585, -51173]
15363e1173j1257l403K4987j6537j3244J6000J6578M6107M9767m3324n9219J4039
15351c0679L7720J6476q226M2653J9597k1050k2428l0677J0769L4427l049p620
15339C7913o483j7427j0620l0921k1208q359p856K0119J4223J2296J3578N10J4800
15326A0565m039P550j7391K7895n298k1164j6634j0663P446J3143P814Q972j5893
15313g697K6666l789m3860k0905l583J3099P157o391N418L431p917K0034L7280
15300A8943J0110j2544K328J3607j3206k0507k9462m417k5679K3588L1527j0604
15288a6316j9462O889L7328j3782o866q516o805l7709J4532J3605j93L0443m2612
15275d9464m5891L0652O168k8105M8438N4532m6310l3482N6097K3087K429J8908
$$ y = [-51173, -62430, -65833, -40846, -57383, -70627, -54627, -38049, 8058, 57825, 14501, -44718, -30679, 7041, 23517, 15291, 57944, 77541, 56491, 34063, 3386, 14155, 48582, 45533, 37913, 31430, 14003, 3383, -27538, -48746, -57105, -64961, -44842, -30619, -18323, -4745, -4235, 10565, 6526, 14076, -3315, 24580, 19282, -1882, -18516, -29179, -21733, -8590, -776, 8196, -7697, 18969, 15180, -28680, -49585, -53168, -40069, -32912, -39303, -33885, -30454, -38371, -18337, 18943, 29053, 16509, 18837, 32444, 19238, -1269, -30731, -35148, -60827, -37239, -5712, -16316, -35778, -28889, 8439, -5343, -12209, -20725, -27530, -65239, -50707, -37102, -37295, -6852, -49464, -95355, -64703, -58535, -86640, -38202, 16330, -29980, -63462, -7365, 15722, 18151, 37059]
15263C7059o08L697r860j1564m628K1662K3422j4452k9414m4088m431M0132K738
15250I665N943k9787j4548L544M4106J1523j7663q95k1709l316M966k2102j1925
15237d2198L9982J5537m028L0428q945k9480q149O679l7213o447k027P750K7076
15224a1035j6930K728J6067L4682r984m0101P000R950r773O224J9211P420k531
15211A2928j4111l2157j193k579k1755J9759K9294J5498l0560j2114L5031j9713
15199b1672J309l265j0744k0928K6538M999J9148K2033o096O446K3415j7941M302
15186B7544O340p852l299o663n530q585j6802R724J2192n765n680o738L9729K8069
15172E6684j6072k7798j6932k9128K4343O177k9712j0765N2351J7260Q792N459
$$ y = [37059, 36451, 40148, 30288, 18724, 14096, 35758, 59180, 44728, 15314, -28774, -33205, 6927, 9665, 15608, -14179, -28727, -25183, 18923, 30446, 12783, 11888, -9821, -13137, -8171, -30273, -42198, -2216, 13321, 9293, 39721, 30776, 1296, -6853, -174, -37387, -43834, -45861, -38111, -11035, -27965, -25237, -9170, 25512, 15528, -24573, -17573, -7623, -17396, -11172, 8039, 15459, 12928, -1183, -33340, -34533, -37112, -58867, -39108, -9814, 5684, -24876, -36990, -1959, -21672, -20363, -23628, -34372, -55300, -28762, -23763, -4615, 17418, 11322, 17768, 41183, 23242, 27544, 33884, 26032, 22733, 16070, 10540, 1955, -14847, -5123, 7069, 1304, -4376, -11114, 28615, 56684, 40612, 12814, -4118, -33246, -8903, -2726, -32438, -43203, 9148, 26408, 35200, 40659]
15160D0659M2192j4977l9177O927M3345q044l0674P456L272m1552K1360K8407
15148E9194n0869m1006Q360K3000k6105o326k4218j7644L4295J6079m0823L7558
15136b8505M4183J7160k1067n5375k1380K1760L4090K803Q094j9988q070k3631
15124d9926r162Q934J9447L7943J9777m5630l9890p948L3026K3321j4785J3346
15112a1547J8701k6994J9709L736L2114K3249j854O803J0113j4623o6173P853
15100A087J0180k7963m056L5478R271k0139n032O500J2995J138k948j7510j3772
15087a4771m254k7872j850n829P365L460k1951N265K0921j219k3507j4701K7031
15074e1912J7612L4473j357m0294j6723J759J7562J5036K697j7563j7362r216
$$ y = [40659, 82851, 67874, 28697, 35624, 78969, 70925, 40251, 47707, 50979, 9427, 30787, 59194, 8325, -32681, -24321, -1321, -27426, -33752, -57970, -75614, -41319, -25240, -66063, -28505, 15678, 32838, 11771, -43604, -64984, -43224, -9134, -6331, 1763, -18225, -26295, -49926, -59088, -50154, -30707, 7236, 27013, -18617, -58507, -66455, -33429, -10108, -24893, -11547, 7154, -19840, -131, 3605, 35719, 58968, 57114, 63917, 74030, 59407, -6766, 1087, 11267, -16696, -20752, 14726, 23997, 3858, -1174, 5326, 18321, 19459, 16511, -999, -14771, -19025, -46897, -48747, -54576, -47211, -43751, -65702, -60437, -39516, -40735, -64242, -78943, -51912, -34300, 173, -1184, -41478, -58201, -56442, -38880, -23844, -21147, -38710, -56072, -65288]
15062f5288M7997J0619l8073l3139J7300K1720J9726K0428p775q790k9106P009
15050c7372J2541o528K363k6463j121L060j7509r941J8885K8790n43k4617L880
15037e4575J8179j1876M7902K3723j2266j3474n6335j6427L9349J0456J2957J6121
15025C734l277k0939j9926J7079p525r122l365o463Q679j9198N165k14L4278Q895
15011a2199r846k2086m54Q453K75n766j103M3891J1756k9926p848K067q489L6931
14997E656K5657k5250k9299k0108n812K7240n55k7887k5968J2705K7176l964k9919
14984g0328j033J8671L096J3342j5490p181M411k497J1481J4357K977L5009m861
14971A954m11j0501l9784K3591L0436J2707K7956m0873j8053j3696j2673J036
$$ y = [-65288, -17291, -6672, -44745, -77884, -60584, -38864, -19138, 1290, -6485, -15275, -44381, -37372, -24831, -31359, -28996, -55459, -56580, -53520, -71029, -80970, -62085, -33295, -33838, -58455, -54575, -36396, -48272, -370, 23353, 11087, -2387, -58722, -75149, -35800, -25344, -12387, 3734, 457, -20482, -40408, -23329, -30854, -39976, -43341, -49804, -41125, -60323, -55158, -55372, -21094, -12199, -22045, -44131, -44585, -36132, -35857, -41623, -42726, 1165, 12921, -17005, -24853, -22786, -31275, 5656, 31313, 6063, -23236, -43344, -49156, -21916, -22471, -50358, -76326, -63621, -36445, -40409, -70328, -71361, -52690, -49594, -36252, -51742, -58923, -54512, -57009, -45528, -31171, -28194, 6815, 1954, 1543, -8958, -48742, -25151, 5285, 17992, 45948, 5075, -12978, -26674, -39347, -38311]
14959c8311o021M846Q598l3976n0593K3511L9474J3558j319P056l9277p454K9327
14946e0581L5394J4509N574J599L814j0612l353K7263l0014k9768o61M6040P253
14933A6457J4354O335j1914j0435Q432Q415l9165r639j3825J8413K2396J2195
14921B2019j2907k2339P572k2651N350K5604J7487k4963k9254J173K3408l6882
14909d6383k425L4119n826K2491R256k07l3548R827k1174J3306J6953j2596j4129
14896c0336j8527K8559J4759L7868j6682j4633j9228m99L5230K0839M1543j311
14884G7582o171m378j4386J184l3622j2582j7022l2696K7127K3801k9799m4446
14872f5408K2841Q592R947M7884M596K136n0497q062j8317N922l2195J3855M3125
$$ y = [-38311, -44332, -39486, -30888, -64864, -115457, -91946, -52472, -38914, -40233, -33177, -72454, -79908, -50581, -15187, -678, 4896, 6495, 10309, -303, -3656, 23607, -6407, -36175, -36836, 9204, 16457, 30811, 37146, 25232, 14797, 23229, 31644, -7521, -17160, -30985, -12572, 9824, 22019, 9112, -13227, -5655, -28306, -22956, 2648, 20135, -4828, -34082, -32909, -9501, -46383, -48808, -14689, -20515, 1976, 11232, 11025, -22523, -12696, -33870, -20564, -3611, -16207, -30336, -48863, -20304, -5545, 32323, 15641, 1008, -18220, -18719, 16511, 37350, 78893, 77582, 71411, 67033, 52647, 53831, 20209, 7627, -9395, -42091, -14964, 8837, -20962, -65408, -42567, -33975, -24028, 23856, 28452, 30588, -19909, -27971, -46288, -40366, -72561, -58706, -15581]
14859a5581K9582J0975m255k740k2429m6405J8320j4213Q018K965l5694m292j7832
14846i3581o199K6773K2734k3434o968L600J2452L4570K7446k0248K0135K0223
14834A7503L9K59L9029j9662M384M2318k9151m5992k9637j6054j4035J2290J8036
14821b0673j3344L210R11K1849J2248J246n5937m9140J2341J5809M8006K9828
14809F354K8852j8206k5100j9817n84L119K658K0096l2269k4776k491K9113N0689
14796A7638N4924J609j0704k2827P129k0775k3427k9107l1825L5359L1685k550
14784G129P312k1840O205L9119J0709l3908j9277j3856j8304L8693P888k5342
14772a5472o032N2905O079l9982R23J8850j3912m6107J3244k919R146J6679R966
$$ y = [-15581, 14001, 24976, 20721, 17981, -4448, -50853, -32533, -46746, -38728, -35763, -71457, -75749, -93581, -99780, -73007, -50273, -73707, -80675, -77075, -64623, -30053, -2607, -22855, -2720, 17503, 17542, 17801, 56830, 37168, 41552, 83870, 54719, 8727, -20910, -36964, -50999, -38709, -20673, -34017, -30807, -29896, -8047, 4201, 5447, -50490, -99630, -87289, -71480, -23474, 6354, 35206, 17000, -8100, -27917, -28501, -25382, -22724, -2628, -34897, -59673, -62164, -33051, 17638, 72562, 74171, 63467, 40640, 47769, 26994, 3567, -25540, -57365, -22006, 9679, 7129, 14441, -7399, -1194, 37925, 48634, 14726, -4551, -18407, -36711, 1982, 9870, -15472, -21504, 31401, 37480, -2502, -1579, 17271, 3359, -42748, -29504, -32423, -23277, -6598, 3368]
14759C368M614J2304Q647J0253l7965k7687j2666J9143P2056j0420l140k5071
14747A3436j8018K2387J479k1992K2220J4365p5073P334J9695R016K4711J9851
14735C9411j2627l768L3252K7118O787j9671j4307m2219k5922K2204J5957j0678
14723A5537m7748m1896K8115L4949K5135J3458o067l2539j6981k0357K9812j5778
14711c4360j5927K5884r655j2774J3579L1508L0008n0185l9518Q380J4640L8273
14699a47l2372K0591N082k098P850J381J1174R667L0301L075n6563o385Q029o459
14685f874j80R457K0226L6747L076k533j7956k0598j7905Q233k1905k0946P528
14672b3630J6492J0987J6669j7235j594r848M8536L67q756J302p318O211K8413
$$ y = [3368, 7982, 20286, 28933, 39186, 1221, -26466, -39132, -19989, 52067, 41647, 38507, 13436, -4582, 17805, 19284, -2708, 19512, 33877, -41196, -33862, -14167, -5151, 19560, 39411, 26784, 23016, 56268, 83386, 90173, 70502, 56195, 13976, -11946, 10258, 26215, 15537, -32211, -74107, -45992, -11043, 14092, 27550, 21483, -11056, -28037, -48394, -18582, -34360, -50287, -24403, -34058, -46832, -33253, -1745, 28263, -21922, -61440, -53060, -38420, -147, -32519, -11928, -6846, -8944, -1094, 287, 11461, 21128, 51429, 54504, -2059, -8444, -415, -6874, -7054, 2403, 22629, 59376, 62452, 59919, 41963, 21365, 3460, 11693, -10212, -31158, -23630, -7138, 3849, 20518, 3283, 1689, -8159, 40377, 40744, 31988, 33290, 25972, 32183, 60596]
14659F0596l4702l391K7370j6579j6928k484L256Q767M09j1602j7374Q857q419
14646b224k2446k9257j2228M8760K9867K9011j5876o9196J8288J2002j0896j9947
14634d4142K471K3505O12k0532k2678N3694K2811K547j2103K4576O319O329k0084
14621B3325K764q599n5288k6614L964M2087K7512l6710J2433J9230l6330j8621
14609e0847Q769j5846L2274L7378k3155N590K7344K5685r106J1819j3945l1506
14597D454l5264j2166L0843k9872p120N4359J5400m5622j7657K3394j163N567
14585a4847J885J4445L2920j2793k2584j2000j3794J3876J3326J1130q481j4178
14573a1095L8442O3511K7178k6184n8222N715O521m8874Q945k4440M298L9404
$$ y = [60596, 25894, 22503, 49873, 33294, 16366, 13882, 17138, 25905, 26314, 14712, -2662, 6195, -2224, -24670, -53927, -66155, -17395, 12472, 41483, 25607, -43589, -25301, -13299, -24195, -44142, -41671, -18166, -17554, -38086, -60764, -7070, 15741, 18288, 6185, 30761, 37080, 43409, 23325, 26089, 17490, -37798, -64412, -60448, -18361, 9151, -27559, -15126, 4104, -32226, -50847, -42078, -57924, -25650, 11728, -11427, -5837, 21507, 47192, 38086, 49905, 35960, 4454, -30810, -42976, -12133, -42005, -49125, 5234, 20634, -24988, -42645, -19251, -20414, -14847, -12962, 1483, 34403, 21610, -974, -12974, -26768, -12892, 434, 11564, 3083, -11095, 27347, 90858, 118036, 91852, 33630, 39345, 45866, -3008, 5937, -18503, -14205, 25199]
14561B5199J4528J9014L4150J3206l2015l9929n1033l4028k180J1172O133J6027
14549a9756L1253L5342l2952o5097J3335o24j0530j9034Q647j6450r175L1328
14537e3713N241J9636L4851J4446j0802L0968L8397n3435k2103O589K7193L127
14525D0395n1405J3477M4735J1548q563j6812j2242j7164k3854N607J5347K4539
14513B5608J9481j1881L1838j8038O535L235J4045J5546J0288k3212n3986n6115
14501c6656m999J3500J1275J7151k2823j881M1502R265j6303m424L1446o509Q395
14488C8939j486m4477k7985k9277o684J4012J8676o60K4466J0570K0973m2838
14476b5771j3090K2921K2708K1141j9614j7738K2679R838r111Q135j033m3247
$$ y = [25199, 39727, 58741, 92891, 106097, 74082, 34153, -16880, -50908, -53088, -41916, -35783, -19756, 11497, 46839, 13887, -51210, -37875, -38499, -49029, -68063, -59416, -75866, -85041, -53713, -48472, -28836, 6015, 20461, 9659, 40627, 79024, 25589, 3486, 10075, 37268, 40395, -11010, 2467, 47202, 58750, 50187, 33375, 21133, 3969, -19885, -14278, 1069, 25608, 45089, 33208, 65046, 47008, 53543, 56778, 70823, 86369, 96657, 73445, 19459, -36656, -41655, -28155, -16880, 271, -22552, -24433, 17069, 26334, 10031, 5607, 37053, 30544, 38939, 37453, -7024, -35009, -64286, -70970, -56958, -38282, -38942, -14476, -3906, 17067, -25771, -38861, -15940, 6768, 27909, 8295, -9443, 13236, 23074, 13963, 22098, 21065, -22182]
14464b2182j9103R246j8057J9741K5833J5233J0384j9923j9770n705j8780J2148
14452c0935o927K3810l396j126K4778K7842q500Q535j3613N096J8584k0269K037
14439B5916R658M2772j3970m1279J654j0660k3580j3124J3179m673j8797q82J3223
14426b0563K8270P142J1769p96n802L465j5450J9818K1918J4949K3523k6335m0132
14413B1776l4433P868M370M6259M873n4983l7938j0130j1496L6512K3387K153
14401a782M638j062J1019j7584k2576j9585L1804J5025J6380j9204j5743K1918
14389C248k4630j2021K8417L698l4181L8663Q974j2994K692n817k6866L013r074
14376c6878k1297K950M90l5532l656L4905J7277J9229m936J2737R617K8564L0896
$$ y = [-22182, -41285, -32039, -50096, -30355, -4522, 10711, 21095, 1172, -18598, -24303, -43083, -30935, -37862, -14052, -17448, -18574, 6204, 34046, 25546, 34081, 20468, 25564, 44148, 23879, 25916, 35574, 78346, 64376, 23097, 24751, 14091, -9489, -22613, -9434, -14107, -32904, -33786, -20563, 7707, 14849, 26618, 25822, 20020, 23485, 8035, 27853, 49771, 64720, 88243, 61908, 21776, -12657, -4789, -419, 45840, 50713, -4270, -42208, -52338, -63834, -27322, -3935, -1782, 2856, 1794, 12813, -4771, -27347, -46932, -15128, -103, 16277, -2927, -18670, 3248, -21382, -33403, -4986, -1288, -35469, 3194, 12168, -826, 1866, -3951, -30817, -27804, -36878, -58175, -55225, -54735, -90267, -93923, -59018, -41741, -22512, -27448, -14711, -5094, 23470, 54366]
14363E4366l967l2912k8789O368J1219j4632m1613o07O224k692P275Q436K5192
14350f132K3840K7317n083j39p354R961M2624k0760J603l0034j8548j141R724
14337B5878j7864K4886j1838N211l459o534J2590q547J987M0231J3635l7001m0102
14324i27k2910j9755l4707j8618k874K0739J3102L567M427N5743J4551j9315L0524
14311B3547o644l3237J5442L2885K1319L8220o217m1216q426j5610l4277r859
14299b4073J7051N7798J0577j2905k9994j1046j4484n206J1665j8400l660k5339
14287d8016J7476p509k3940M230j025J5609L6049J2466J7647Q77K1546L1527K6278
14274A03215j8596k6160l6043j1096k1709m0977j6329M6354K4397m000m9023k5309
$$ y = [54366, 50399, 17487, -11302, -4934, 6285, -8347, -49960, -50567, -44343, -47035, -39760, -31324, -6132, 17708, 45025, 39942, 39803, 32449, 42410, 85034, 64274, 65877, 35843, 17295, 16154, 25878, 8014, 32900, 21062, 26273, 22814, 16280, 28870, 20323, 22310, 62541, 76176, 39175, -927, -23837, -43592, -78299, -96917, -99791, -79052, -65950, -62383, -57956, -2213, 12338, -6977, 23547, 16903, -16334, -892, 31993, 53312, 91532, 85315, 44099, 35673, 20063, -14214, -24073, -7022, 50776, 61353, 48448, 18454, 7408, -7076, -12282, -617, -19017, -22677, -48016, -30540, -38049, -61989, -57759, -58784, -43175, -7126, 5340, 22987, 23864, 45410, 76937, 103215, 84619, 58459, 22416, 11320, -10389, -51366, -67695, -21341, 3056, -944, -49967, -75276]
14262g5276M4130J7434j1667J039K9468j813J3687m307l4254k840L1840j1660
14250d219J4764L2640L630l3790J8832r746J2051q700j9609j7506k1510K7944
14238e219Q147J0314K1744l2135J3578J2929P776R532r642J138k4775l3707J9551
14225g69J7246L208K1111M8889m8104o7298j4740Q780L5552J387n7509r153N4825
14212f575N8503J8050L25p333l54R981l816l926k9899l7625J4465J2860k194q373
14198A4089K5903N6522K7896j3542j6048l3651L116l4384k9860j7918M491M0455
14186B7069J8544J3427J4971p965J263J6972n0945k1108P890k0426R686L8169
14174D7547K9645Q514r992j5509j0430J1621j8752j9211m7900k1141O2519L6474
$$ y = [-75276, -31146, -13712, -25379, -24340, 5128, 3315, 17002, 12695, -21559, -24399, 7441, -4219, 10545, 43185, 46815, 13025, 31857, 22111, 34162, 25462, 5853, -11653, -33163, -5219, 2928, 13242, 34986, 2851, 16429, 29358, 37134, 46666, 37024, 38162, 13387, -20320, -769, 16477, 19685, 40796, 89685, 41581, -25717, -40457, -31677, 3875, 5262, -52247, -61400, -6575, 51928, 69978, 70303, 62970, 62616, 72597, 68781, 64855, 34956, -2669, 11796, 24656, 22462, 14089, 39992, 96514, 124410, 110868, 94820, 61169, 64285, 29901, 41, -17877, -13386, 27069, 45613, 59040, 74011, 66046, 67309, 84281, 33336, 12228, 20118, -308, 9378, 47547, 77192, 85706, 75714, 60205, 49775, 61396, 42644, 23433, -24467, -45608, 16911, 53385]
14162E3385l615j7165j3156j9306j0666J6723K2312q639m1770j9515J6218J6052
14150i142J4293l867M1829J4201M387m7079j4374K354k890J490j0850k7710r8
14137c7456K9387L5748M1054k7251j4836l682k4302k1222M4764K5026N101k3946
14125B8385q780K5094J6282k5576K6429M08j7252l7842j4065L047k8637K9740
14113b767K1024J898J3306J3126o431p539o230m4855J667j1818n906o46j943j1098
14099d8212K5300M2002J8755O57l1384l2773m349M302J07K2882Q942m8007l512
14086d5290M5734K9091j5464j4337l3797K3101K4199n6605J2410Q242K8343p99
14074D828l6100O721Q210l1736M0666J3491p238r740J0318n506K351J359o7436
$$ y = [53385, 49770, 32605, 19449, 143, -10523, 6200, 28512, 19873, -21897, -41412, -25194, -9142, 5151, 1284, 43113, 57314, 61701, 14622, 248, 2602, -288, 1202, -9648, -37358, -37456, -8069, 27679, 68733, 41482, 26646, 22964, -1338, -22560, 22204, 47230, 52331, 28385, 19605, 44699, 60981, 35405, 61834, 62242, 44990, 7148, -6917, -3870, -32507, -2767, 18257, 20155, 33461, 46587, 40156, 32617, 26387, -18468, -16801, -28619, -34525, -35171, -37114, -48212, -22912, 19090, 37845, 38502, 7118, -25655, -30004, -25702, -25595, -2713, 6229, -41778, -45290, 444, 29535, 14071, -266, -34063, -10962, 13237, -43368, -30958, -22716, 5627, 4828, -31272, -24551, -16341, -48077, -7411, 6080, -1158, -10898, -580, -6086, -3735, -2376, -69812]
14061f9812l80O2174L6459L6729l8992m8982l035k178J4155M5020K4451k2594
14049C3015n2406o277J6923K8928J6630m4472k5999P83m01L208K5034K3144q501
14036I609J7647O44l6651K9026J7911j8550l7686j4372K358O970K2646j9507j1940
14023c1895j157m988j8423j073r771N617m927K9748K6261K913l1469J2298L1645
14010D779k932L262J8087p909j8732j4916O293J5296j4447l0820L7836L6680n854
13997B6623O190l1342l7947K3196N2884K9943n08m0897N739R050J0573J0883N9748
13984A24135n585o7865j7505R879O897L2994j76l7171J062j3265l012j2881l0606
13971a3099j8498l98L389K3755K834j3102o338J5609K6604k9021k6431J2169O275
$$ y = [-69812, -70192, -8018, 28441, 65170, 26178, -22804, -25839, -28017, -13862, 31158, 55609, 33015, -19391, -25668, -8745, 20183, 36813, -7659, -33658, -32875, -33276, -30068, -5034, 18110, 9609, 27256, 27900, -8751, 20275, 38186, 19636, -18050, -32422, -30064, -23094, -448, -19955, -31895, -33052, -38040, -56463, -57536, -67307, -61690, -66617, -36869, -10608, -7695, -39164, -26866, 4779, 1847, 5109, 23196, 15287, -3445, -18361, -12068, 3228, -11219, -42039, -4203, 32477, 26623, 32813, 1471, -36476, -13280, 39604, 69547, 69039, 28142, 33881, 42931, 53504, 64387, 124135, 118550, 50685, 33180, 43059, 49956, 82950, 82774, 45603, 46665, 33400, 30388, 17507, -13099, -31597, -31995, -28606, -4851, -2017, -15119, -21457, -5848, 20756, -8265, -34696, -22527, -16252]
13958a6252j6616j008k509J8143M1376L3375j1034m426k1798j0650l8754K0923
13946i230J4032q754l685M994J8088j2474j6786j0072j858K975l5970j3325K7011
13933d5054J8871l3559k5565J841O0352J7264q568l1445k495M0416K0007L645
13921A5710m642l1307K3974K0852J0641J9243o290l5989j5102L3698L1413M9671
13909A11872k5169n8970Q469k8580j5031K2564J6117j0883l0747m2789k2835K9373
13897d6609M954j7287l9514K3025L4139J3156o414K5568r507R881K1604j3930
13885i34k3104J6561K4825K2873l4095k4995N6392J5939j4317r826j33j1734m548
13872A2904L4749J9233j2734M9k6769l155L4837O937n4058l8440K1647K6506l2873
$$ y = [-16252, -32868, -33876, -36385, -18242, 23134, 56509, 45475, 41049, 19251, 8601, -30153, -9230, 4802, -3952, -7637, -2643, 15445, 2971, -13815, -23887, -25745, -22770, -58740, -72065, -45054, -26183, -59742, -85307, -83466, -23114, -5850, -14418, -45863, -48358, -7942, 12065, 15710, 11068, -20239, 3735, 24587, 35228, 54471, 48181, 12192, -2910, 30788, 62201, 111872, 86703, 27733, 36202, 7622, -7409, 15155, 31272, 20389, -10358, -53147, -75982, -46609, -41655, -58942, -98456, -75431, -41292, -28136, -34550, -8982, -18489, -8608, 12996, -934, -24038, -7477, 17348, 40221, 6126, -18869, 37523, 53462, 39145, 29319, 29186, 17452, 12904, 47653, 66886, 54152, 54201, 27432, 24277, 59114, 66051, 11993, -26447, -4800, 21706, -11167]
13859a1167k8349j2414M9326o035k699l3803J4567M1706J7717R917K549N414k9696
13846A7033n454R631j770J2073j5391l5457R750J7070j8934l9358o973M7392J9191
13833H803J4318l6403k6175L503L8577J5069J9141q72m7477j1893J7840L8392
13821C2823q82j9437K224j8900l00J104N406o464p430J7619L5761J2770k9758
13808B4536m1027j0059N9688K8033M086L742P253m106r631p841j9436m2268J1089
13795D059k3389j720k5729k4096k1496k540Q551K8987K3817m477P391K6210j0405
13782a4837k624j8008J4267l814K8868J7869J4594j6372Q433K5410L1018J214
13770H6018r791m9322n935J2876r334m510l7635m7960K0177L0667J6790K6027
$$ y = [-11167, -39516, -51930, -2604, -8639, -11338, -45141, -30574, 11132, 28849, 38766, 41315, 46729, 17033, 11579, 21210, 19440, 31513, 16122, -19335, -9585, 7485, -11449, -50807, -57780, -10388, 8803, 23121, -13282, -39457, -35954, 2623, 17692, 36833, 35961, -11516, -23409, -5569, 32823, 31941, 12504, 14728, -4172, -4472, -3368, 2038, -4426, -11856, 5763, 41524, 54294, 24536, -16491, -26550, 33138, 61171, 65257, 68999, 76252, 72146, 62515, 54674, 35238, -7030, 4059, -19330, -21050, -46779, -70875, -92371, -94911, -86360, -57373, -33556, -38033, -30642, -4432, -14837, -17461, -35469, -21202, -25016, 3852, 21721, 36315, 19943, 28376, 53786, 84804, 86018, 76227, 26905, 20970, 33846, 24512, 20002, -17633, -65593, -45416, -14749, 2041, 28068]
13758B8068J5801J8198M7944j8413m4058K8357K953j4594J7774k7320m4197k1361
13746a0848j1839O5212L6055j9322j0274j3878l723J5519K2983l0709q4283j7157
13734f2264m141L721N0625N374j751L4326M8194m5030k2164L9927j4689k6591
13722E537J7069J1978k4784L5128j7238m031j5308k2306J7907K954N45J3497L975
13709B4923k0603l5031j4752K2918l323l4026J7501L8948J7100j2421q311j607
13697h684j385M1547K0113K3070n663j1396k469k4025P435j5058k0312k3932m6404
13684f7163J9921L8071k3693K882l5157k4654L1354K974P745K5576J0151J9884
13672G891K6076P88j671k1696k2447j9592j8778O2288L2066j5048l0593J5888
$$ y = [28068, 43869, 62067, 110011, 91598, 47540, 75897, 78850, 64256, 82030, 54710, 10513, -10848, -22687, 42525, 78580, 59258, 48984, 35106, 31383, 46902, 69885, 39176, -45107, -62264, -66405, -62684, -12059, -6685, -8436, 25890, 74084, 29054, 6890, 46817, 32128, 5537, 22606, 34584, 9800, 44928, 27690, 23659, 8351, -13955, 3952, 6906, 7451, 20948, 24923, 4320, -30711, -45463, -22545, -25868, -59894, -42393, -3445, 13655, 1234, -7077, -8684, -10069, 31478, 51591, 74661, 68998, 57602, 55133, 31108, 38543, 23485, 3173, -20759, -67163, -47242, -9171, -32864, -29982, -65139, -89793, -58439, -55465, -47720, -22144, -11993, 7891, 33967, 34755, 33084, 11388, -11059, -30651, -49429, 12859, 44925, 29877, -716, 15172]
13660A5172K986k2378k437K0587L4304L912K3275K608J7003k140k0380n5584j0637
13647F291J8129J9998M935n3273R235K0334j3725K0388m1564O869R019L7298N496
13634D9430N129k0917m2065q188j0936j5729J3858M5036K3766L1942J1662m757
13622G8231J6694k8338k4922J3540j2093k4073k31k8298O339J1226j5175j4505
13610b1605L7512J2330K014l7047k5221k616J1233J1018o810J9779J4568M284
13598A9439Q421O724M0250N3395l1347k6573k8107J4587J3708R640o347J7777
13586I1567k087j4826k7004o066J9066K8201k7345j5052j2753J2586l7259l3717
13574b4689K5526L9451K5737l0943k1604N208J7618J0818m5945j5711J0338J388
$$ y = [15172, 18158, -4220, -6657, 13930, 48234, 52146, 75421, 78029, 95032, 92892, 72512, 16928, 6291, 24420, 44418, 49353, -3920, 5315, 25649, 11924, 32312, -9252, -2383, 6636, 43934, 49430, 54559, 33642, -8423, -16611, -27547, -43276, -29418, 15618, 39384, 71326, 82988, 78231, 94925, 66587, 41665, 55205, 43112, 19039, 18808, -9490, -3151, 8075, -7100, -21605, 15907, 28237, 30251, -6796, -32017, -34633, -23400, -12382, -19192, 587, 15155, 19439, 27860, 34584, 74834, 128229, 96882, 70309, 42202, 56789, 70497, 80137, 73790, 91567, 89480, 74654, 47650, 41584, 60650, 88851, 61506, 46454, 33701, 46287, 9028, -24689, 837, 40288, 66025, 35082, 13478, 18686, 36304, 47122, 1177, -14534, -4196, -2808]
13562b808O366j4567K9425N6807Q969j3406k7543J070K4214O86l3607K294K3377
13549F1277j6313M544K7516k5867j269J3927r525K35J3807L284J6433j1170j3811
13536F3068P916j7070l0208k912O274n2335J7058L3771J8002K147K1827J5221
13524H2759k1256m7807j0189J2422R554P160j6408k472J4627K8443N832K609O414
13511G1688l0299m6875l4304M9374L9886J5291l8847l9848k2949n268j5675N476
13499e2350L8594p214m325K0562L7736O804n85j151J1168K555J49k5867R88p451
13485A9613Q506K0884K3098p705L58k3594K668m15j8101L724k6747J6604J3351
13472C2244K1309m002k7106J086K3791K6593r309m8017j3379K197J1453J0181
$$ y = [-2808, 3558, -11009, 18416, 75223, 84192, 70786, 43243, 44313, 68527, 69213, 35606, 37900, 61277, 44964, 49508, 77024, 51157, 49888, 63815, 54290, 54525, 68332, 71616, 88049, 76879, 63068, 70984, 53914, 23706, 20794, 27068, -25267, -8209, 25562, 43564, 45711, 67538, 82759, 61503, 13696, 3507, 15929, 25483, 32643, 16235, 13763, 28390, 56833, 62665, 65274, 71688, 41389, -5486, -39790, 9584, 49470, 64761, 25914, -13934, -36883, -42151, -57826, -52350, -13756, -20970, -25295, -4733, 33003, 39807, 39222, 38071, 49239, 51794, 51943, 26076, 27064, 19613, 28119, 49003, 72101, 64396, 64754, 41160, 43828, 43413, 25312, 29036, 2289, 18893, 32244, 53553, 49551, 22445, 23531, 47322, 73915, 64606, 16589, 3210, 5407, 16860, 27041]
13460B7041K0500o002L5284q223k9129J9691J2683K0655O887n172q471m1517j0391
13447C3836j8158N3143K7051q884k649p827k74R458m394Q663L4296l4973l1408
13434E7880J272j3310j5445M8727M9316k874l8189l5933r919J2275l355o450j8419
13421B5576l2527j1786L2126K6267j1453J2661J8374l3979l0602L4889O0253l3580
13409E6219j9631Q136m517L649p4j5279l4570L3193L6167n3480n3935K094M5429
13396C401J4653J9898J6973J0711k0865j4437R050J0810L789m1452k0589N4597
13384D6539M7698k8511l9974p160n603j1205J5387K4592P7490K4850o8224l9021
13372C6858J3478K1677J8315j6676K086m956j3321n3384l2013m7257j4958N2435
$$ y = [27041, 47541, 41539, 76823, 68600, 39471, 59162, 71845, 92500, 99387, 94215, 85744, 44227, 33836, 15678, 68821, 95872, 86988, 84339, 76512, 76238, 85696, 81302, 89965, 124261, 89288, 57880, 59152, 45842, 30397, 79124, 128440, 125566, 87377, 51444, 41525, 53800, 50445, 43995, 25576, -6951, -18737, 13389, 39656, 28203, 40864, 59238, 25259, -5343, 29546, 89799, 56219, 36588, 44724, 40207, 43856, 43782, 28503, -6067, 27126, 63293, 9813, -44122, -42028, 3401, 18054, 37952, 54925, 65636, 44771, 30334, 39384, 50194, 53983, 12531, -8058, 46539, 94237, 65726, 25752, 18592, 12989, 1784, 17171, 41763, 119253, 144103, 75879, 36858, 50336, 72013, 90328, 73652, 75738, 70782, 57461, 4077, -27936, -75193, -90151, -37716]
13360c7716M3080J8350q485j6527j2343J6207j2272J5031R191l2205j2719J6747
13348a3661J3112J9188Q705J1726k901k4286K9559K3097J2018j5115j2180O141
13336E5403k5712l5346p80K653J0369M611O071k230K6509L4524k2021l117j1750
13323C9184k7370J6115J1997K0975j8770k5L9527j6886o572k4893R081r835L02
13310C2830L6874J2168l6178l9720J7544o463o320K7316J2819J1237P549l4763
13298C4893o286N415q687L0913L4212J6483O253M565l6490n484k0282m1950l8642
13285b5087J8953j6921K8593N4927J2315N542J3871j408k4993M825M712P095k5493
13272E6931k8668j05k7368K3048J3197j2266K3123j5390m2726n254j0175l821
$$ y = [-37716, 5364, 23714, 15229, -1298, -13641, 2566, -9706, 5325, 14516, -17689, -30408, -13661, -549, 18639, 27344, 39070, 36169, 11883, 41442, 64539, 76557, 61442, 49262, 55403, 29691, -5655, -6435, -3782, 6587, 11198, 17269, 15039, 41548, 76072, 54051, 50934, 39184, 11814, 27929, 39926, 60901, 42131, 42106, 81633, 64747, 58175, 33282, 42363, 32528, 32830, 69704, 81872, 45694, 5974, 23518, 17055, 10735, 38051, 50870, 62107, 69656, 34893, 28607, 34022, 25335, 56248, 90460, 106943, 113196, 117761, 81271, 75787, 55505, 13555, -25087, -6134, -23055, 5538, 60465, 72780, 78322, 92193, 90785, 65792, 70617, 75329, 82424, 56931, 28263, 28158, 790, 23838, 37035, 24769, 47892, 32502, -10224, -15478, -25653, -29474]
13260b9474K0230L9041p032J0673R939M968o02j6916j9723q930K0066j7039Q256
13247A3457p16K2433L0768p189J5215j9563k2706K597O069M85o718p980j121j0478
13233A4553n976j8082j8075K7991J5666k8263M1213J462J7646L2349k7818j3552
13221C9114r252P452j1472O234m3307R998J3218j68Q212L520l9291J3966N5883
13208E4107J5867j7617j0911M844K0890p810J5358J1863P000J5162P963m7276
13196F9440j1495K1118J7557N171l785k278k6377j819k4527j9806k5410N337J8145
13183B1271L8780K3640K1415j4480l1273J3801L5369o324l2860J6885j9338n788
13171F1098J1252L5281j5276J7618j1331j9319q202k5690l2442O821J4267l750
$$ y = [-29474, -9244, 29797, 22765, 33438, 43377, 48345, 47743, 30827, 11104, 2174, 22240, 5201, 13457, 12741, 35174, 65942, 58753, 73968, 54405, 31699, 34296, 40365, 40850, 34132, 26152, 25031, 14553, 8577, -9505, -27580, 411, 16077, -12186, 29027, 30489, 48135, 80484, 52666, 39114, 29862, 37314, 25842, 32076, -11231, -1233, 11985, 11817, 20029, 23549, -15742, -1776, 54107, 69974, 52357, 41446, 46290, 67180, 59370, 74728, 86591, 93591, 108753, 116716, 69440, 57945, 79063, 96620, 101791, 98006, 95728, 69351, 67532, 43005, 23199, -2211, 3126, 21271, 60051, 83691, 105106, 90626, 59353, 73154, 108523, 102199, 69339, 86224, 66886, 61098, 72350, 107631, 92355, 109973, 98642, 79323, 71121, 45431, 12989, 19810, 34077, 30327]
13159C0327N884R720j59J1744L967k9392n792J4171L3970J652k7933R03K426j845
13145D9643N152N26k3141q808K6223L8047L9689j8733j4187N282k3375l3J9942
13132I6227J1620r342k0912o918J6888K8318o688k6134m1170n2383M2475K6579
13120E8560J1714k2624K982j4022j0166j8102j350p724q45k7411J0336J6456j8716
13107b0912K6257O384K8186L2684K2252l0170j8755J1196l5963m179K8331L3553
13095G8864k315j7948J7364k7258J3337L1819k8661k9733k248P506l16L755k0613
13082B3553j382R149J6719L6766Q218k0475j5913J7341k1985l4892q489p549K307
13069C368J5012N0125K1818k6318k6755k7977N018J1346J141k720J550o639M871
$$ y = [30327, 36211, 45931, 45772, 57516, 61483, 32091, 26299, 40470, 74440, 76092, 48159, 49062, 51488, 49643, 54795, 55321, 32180, 23372, 49595, 87642, 127331, 108598, 94411, 99693, 76318, 76285, 96227, 107847, 98505, 77593, 70675, 87563, 115881, 109193, 83059, 41889, -10494, 31981, 58560, 70274, 47650, 50632, 36610, 26444, 8342, 6992, -732, -1577, -28988, -18652, -2196, -20912, 5345, 11729, 39915, 72599, 94851, 64681, 45926, 57122, 21159, 16980, 45311, 78864, 76549, 58601, 75965, 48707, 62044, 93863, 65202, 35469, 33221, 40727, 40411, 44166, 23553, 22171, 31320, 48039, 84805, 93023, 72548, 56635, 73976, 51991, 17099, 8610, 1061, 3368, 18380, 68505, 90323, 64005, 37250, 9273, 14291, 25637, 26778, 24058, 25608, 18969, 23840]
13056B3840K0584m542l3894O026L0882M2348J8743j1268J5282k6470k1047r186
13044E1298j6699K63J037r614J5760N4676J7809r9518o9663K5794M3489K943r58
13031A6617K6771J0878J4478n8941J809M6283J7988n4328Q698M360L0194L0982
13019I5789l0409m2850K9574L0584n901k8239R573J0066K7946J0318j6986l0303
13007E9162n773j0141k7623J8409j744J8490J2738r031k3287L6986J2467K3955
12995A04608j5359l3849k7880l360P714k0187L6739N245J3954N2199M83K687p278
12982A15716m8529K1212J2138j4533n780J4181L050j4384K0002j2560m451J8262
12970A04324j0869k6340j2045k5521O643L007k366L3981n28m9287L0228L7315
$$ y = [23840, 44424, 39882, 5988, 12014, 42896, 85244, 103987, 92719, 108001, 81531, 60484, 51298, 34599, 34862, 35899, 26285, 42045, 96721, 114530, 15012, -54651, -28857, 14632, 17575, 16617, 43388, 54266, 68744, 9803, 11612, 57895, 75883, 21555, 30253, 34613, 64807, 95789, 65380, 22530, 52104, 82688, 76787, 48548, 58121, 68187, 96133, 106451, 89465, 59162, 53389, 43248, 15625, 34034, 32290, 50780, 63518, 54487, 31200, 68186, 80653, 104608, 89249, 55400, 27520, 24160, 31874, 11687, 48426, 53671, 67625, 119824, 120307, 122994, 115716, 67187, 88399, 100537, 86004, 80224, 94405, 97455, 83071, 103073, 90513, 86062, 104324, 93455, 67115, 55070, 29549, 36192, 39199, 36833, 70814, 70286, 20999, 51227, 88542]
12958H8542r00j0255O97K6224J0391j2895j8726J4212K0823m452m370l9914R073
12945G8450O2364p705q524o284Q350m1189p2174j2457K7053K1915J4235q872n855
12932D9307O2712K3012J3925k4364j2522j9898j3776P102J1480K3679K6711k0940
12920A26428j7042n4258l0261L007M272J0101K7386J6760K9805J1597J0344o0130
12908G8009k5360J7478N0577j3801l0862l2981m546j9321l7196J5718M6982L1531
12896G6228J2714k968J6275j4537k3149O411J4310J0001J5983q359j0715K8l3489
12883E8733k2138j9666J2335M6474M1703p020m6450j3742K8589M2212J124J5928
12871A38082l5666m3326l7330r356j957O718L4485N1145L1113J6631j1758k7270
$$ y = [88542, 87642, 77387, 78084, 104308, 114699, 101804, 83078, 97290, 118113, 113661, 109291, 69377, 78450, 140814, 133109, 124585, 118301, 126651, 85462, 13288, 831, 27884, 49799, 64034, 55162, 49307, 112019, 135031, 148956, 124592, 112070, 92172, 78396, 85498, 96978, 120657, 147368, 126428, 109386, 55128, 24867, 27874, 32146, 42247, 69633, 86393, 116198, 127795, 138139, 78009, 52649, 70127, 120704, 106903, 76041, 43060, 38514, 19193, -18003, -2285, 44697, 76228, 88942, 85974, 102249, 87712, 64563, 70974, 85284, 95285, 111268, 102909, 92194, 92222, 58733, 36595, 16929, 29264, 75738, 117441, 110421, 63971, 50229, 78818, 121030, 122154, 138082, 102416, 59090, 21760, 12404, 10447, 17165, 51650, 102795, 133908, 150539, 138781, 111511]
12859A11511m8204J9123R580l4618l532J407l0407r991M4080N3112J5811l492
12847A24380k3129n5081k3904Q462j4181K4298R702j0927P144J6729j5607P148
12835E5034J7612m339N169K2015Q067l5910j4071j1112J9084K4234K008l838M114
12822H8067r080K1387N226J6654j8857k3601J115N480j3956J3037J63K0721L306
12809A09662O294k692Q906J645k3827L320m6K879k0137M79m1649p391j4684M4198
12795F6957K0564j3577k1677K7305q74J3088K487J6372q26j2780j1744k3387O278
12782F8186L9576l2858k2173K0530K0362J7363k7723m1037J0592J3017J1242J1518
12770H8595J5025l4892m8509J3612K2027Q225J8335k0114P871K3845Q57m863n183
$$ y = [111511, 63307, 82430, 92010, 57392, 53860, 55267, 24860, 14869, 58949, 112061, 127872, 124380, 101251, 46170, 22266, 30728, 16547, 40845, 50547, 39620, 46764, 63493, 47886, 55034, 72646, 68307, 73476, 95491, 103558, 67648, 53577, 42465, 61549, 85783, 87791, 83953, 88067, 78987, 100374, 105600, 122254, 103397, 79796, 80911, 86391, 72435, 85472, 85635, 106356, 109662, 115956, 113264, 122170, 123815, 99988, 103308, 103262, 106141, 86004, 86483, 44834, 37443, 22759, 66957, 87521, 73944, 52267, 79572, 78698, 91786, 94273, 110645, 109819, 97039, 85295, 61908, 68186, 107762, 74904, 52731, 73261, 93623, 110986, 83263, 42226, 52818, 65835, 77077, 88595, 103620, 68728, 20219, 33831, 55858, 64083, 82418, 62304, 70175, 94020, 94877, 90014, 84831]
12757H4831j1633L465j252l3463q459J9759j5533R581j4387k7361K0637M6939
12745G3124K2758j9075k5088l760K9690J5748J3621r918j1756M509J3063J0850
12733A13766k5986o123K9228j4434j9030O470L7109K9349l1816k4187O336j7231
12721H3451J5798M8461m060l9346j2687l2081J7327k8442j4825M4643p732m3555
12709B6952p839L8028M3365j7323l7972r197M7632J5617l308j5236j4563K1101
12697H7257M848m282l7101P716l51r018k706J8734n1404r659J7351J3417J5884
12684E0686q474j795j2532L4344K5189M989p031j3321P023M2082k5469l4311J6382
12671G7762k4509N748J5121P4781K7728j2291l8585m4741K979K4005K8109o970
$$ y = [84831, 73198, 76663, 75411, 41948, 33489, 53248, 37715, 47296, 32909, 5548, 26185, 73124, 95882, 76807, 51719, 47959, 77649, 93397, 107018, 97100, 85344, 89853, 102916, 113766, 87780, 81657, 110885, 96451, 77421, 83891, 121000, 150349, 118533, 94346, 100682, 83451, 99249, 147710, 143650, 104304, 91617, 59536, 76863, 48421, 33596, 78239, 70507, 26952, 19113, 57141, 100506, 83183, 45211, 36014, 83646, 99263, 95955, 80719, 66156, 87257, 92105, 87823, 50722, 58438, 58087, 49069, 46363, 65097, 13693, 4034, 21385, 34802, 50686, 42212, 40417, 27885, 62229, 87418, 92407, 85376, 72055, 79078, 121160, 95691, 61380, 77762, 53253, 59001, 74122, 148903, 176631, 164340, 125755, 81014, 83993, 107998, 136107, 129137]
12659A29137k3338J1582K8296J0676K012l1579K1050O163l0993k3305J60N449
12647A05310p703J0222k8591l1562J5053O537N5410k2337k9109K9925j1090j2785
12635G9280j047L0117L9381M3481P523K807J4453J1084k6498k9705j2524J513
12623A59865m611q615m6727j6467J7944K3457J4363L903K0145k2997o089j2466
12611A21705J3252J5431j6712o1554j3297L0393R333J3607P856K353J0310k0308
12599A12369J1673j1998n1693m43K3765L8573J9382K0249L6174J9499M4699K5645
12587B87894l6735l4156m9517l1153K0596r133l0434J1348j841l3098J5411j3025
12575I6157k984L0918j4918j6280J718K8574J4614p04k7574k5519j228L992j649
$$ y = [129137, 105799, 117381, 145677, 156353, 158365, 126786, 147836, 153999, 123006, 99701, 99861, 105310, 97607, 107829, 79238, 47676, 62729, 69266, 124676, 102339, 73230, 103155, 92065, 79280, 78233, 108350, 147731, 191212, 198735, 201542, 215995, 227079, 200581, 170876, 158352, 159865, 155254, 146639, 99912, 83445, 101389, 124846, 139209, 143112, 163257, 140260, 134171, 121705, 134957, 150388, 133676, 72122, 58825, 89218, 98551, 112158, 120014, 122367, 132677, 112369, 124042, 112044, 60351, 59908, 83673, 122246, 141628, 161877, 198051, 217550, 262249, 287894, 251159, 217003, 167486, 136333, 156929, 147796, 117362, 128710, 126869, 93771, 109182, 96157, 93173, 124091, 109173, 92893, 94611, 123185, 137799, 137095, 109521, 84002, 82774, 86766, 85117]
12562H5117J7041J0202p254K6253L9488k1234j1387k1352O834N3428K2010J0749
12550B09895L6916n857l8949l2020l2002N124m7920j5208J8868q921N82L6747
12538A27255L3506q953j3003L5920j8244k7572J5661k280k0554l813K5989P677
12526A51589J2910j140J2435k9046l6722k1895j1110m64j3342L3072L8179j7934
12514A16532m2964L1481M7424K3596j7666k4196O896J182K0945k3398j0028O350
12502A36154q62L1081Q965j7697q929M276k0514J1957K2316l451J738m2706M841
12489A27169r860k718l1037o331J6250L3490n182o669N037k0039L5563L737j5785
12476A23625p76j5736J1539J8613l694J8320q469k3128J9006J4974J8490J9908
$$ y = [85117, 102158, 112360, 105106, 131359, 170847, 149613, 138226, 116874, 123708, 177136, 199146, 209895, 246811, 240954, 202005, 169985, 137983, 143107, 95187, 79979, 98847, 89926, 90508, 127255, 160761, 151808, 138805, 174725, 156481, 128909, 144570, 142290, 121736, 117923, 143912, 151589, 164499, 163359, 175794, 146748, 110026, 88131, 77021, 76557, 63215, 96287, 134466, 116532, 73568, 105049, 152473, 176069, 158403, 134207, 141103, 142285, 163230, 139832, 129804, 136154, 135292, 166373, 175338, 157641, 148712, 152988, 132474, 144431, 166747, 163296, 165034, 122328, 127169, 117309, 114591, 83554, 77223, 93473, 126963, 121781, 115112, 120149, 100110, 135673, 139410, 123625, 122849, 107113, 118652, 137265, 133571, 151891, 143422, 120294, 139300, 154274, 172764, 192672]
12464A92672k0401k8085m9684p478R557J4243N2369K816K032K5616m9834L690
12452A47513J4170J2913k1065l0427q812K0911J6331q370L7648N93l7768K5066
12440A68703j1064k0025L3763n570M839m254k1349m2902Q447J2604K3061K3668
12428A69921n671l8096J485J990n8747l598N0230l199J6784K7424k5162k9918
12416A03443N624N184j0744k2602L9387L630k2627M49j5028r241J5530K2012j369
12403A13648Q600k800l5175K8981L6329k784j3069j2019o125K8272K1381J195
12391A66434k3854j5627j2233J9589N4300N591k4300j8100k4256J985O9802J6397
12379B15728l7273n038k3937K6q925k8815Q521M235J7289k2624j1673o161j7798
$$ y = [192672, 172271, 144186, 94502, 87024, 96581, 110824, 163193, 166009, 168041, 193657, 143823, 147513, 161683, 174596, 153531, 123104, 114292, 135203, 151534, 143164, 180812, 181405, 143637, 168703, 157639, 137614, 171377, 165807, 170646, 166392, 145043, 102141, 110588, 123192, 146253, 169921, 164250, 126154, 127639, 129629, 70882, 67284, 117514, 114315, 131099, 158523, 133361, 103443, 109067, 114251, 103507, 80905, 120292, 123922, 101295, 101744, 86716, 77475, 93005, 115017, 113648, 122248, 119448, 84273, 113254, 149583, 146799, 133730, 121711, 115586, 143858, 165239, 166434, 142580, 126953, 114720, 134309, 188609, 194200, 169900, 151800, 127544, 129529, 199331, 215728, 178455, 173417, 149480, 149506, 140581, 111766, 120287, 124522, 141811, 119187, 107514, 101353, 83555]
12366H3555P966J9074n853L2121M652P227j8953r432L6293K7500j2900k4057m360
12353A42833J1650J4917q113k1525j0100N0552q96J4643L9458q846n0461l5210
12341A38902m2433M873o88L2768M3038R380J8464j4808n3293l0348M401K755N3776
12328A66787L850P067J3632j0045m273l230J1212r927j678m296k0456K1508p633
12315A62518j5680M6555P347j7170K737J6058j5451j7248j8662J2314M994J5968
12303A84280K4469k6256j3253l9478o799J0965N1672J7582k0882j0627K3147n205
12291A89615m33J6021q807r704J9494J4166n3259j999J8404j82j6651J4825j9653
12278A61837J605j256N723p129J6789K0945M405l3825j5762N7318K2616J4728
$$ y = [83555, 91521, 110595, 104742, 136863, 141515, 148742, 129789, 120357, 156650, 184150, 171250, 147193, 142833, 154483, 169400, 161287, 139762, 129662, 180214, 179318, 193961, 233419, 224573, 174112, 138902, 96469, 101342, 100654, 133422, 176460, 185840, 204304, 189496, 136203, 105855, 110256, 113011, 166787, 170637, 177704, 191336, 181291, 177018, 173788, 185000, 175073, 173395, 169099, 148643, 170151, 162518, 146838, 193393, 200740, 183570, 186307, 202365, 186914, 169666, 151004, 163318, 168312, 184280, 208749, 182493, 169240, 129762, 122963, 133928, 185600, 203182, 182300, 171673, 194820, 189615, 189182, 205203, 196396, 186692, 206186, 220352, 167093, 165094, 183498, 183316, 166665, 181490, 161837, 163442, 162186, 167909, 160780, 177569, 198514, 202919, 169094, 153332, 210650, 233266, 247994]
12266B47994n4877o7783m55Q620J5391J005K9086O386L4839P642N244l5092l9555
12253A58445N854M3318p068k35J2858K2022K8767k3328n169k0196K4099J8969
12241B58336j7318k0508J8365k4429j4504J3574K2963J1329j6326k899k0150l5375
12229A73058K7072L1026l779m7376m7852K900L4720L0575j6300L635J3331q172
12217A92838L9773J7306K3347K0387J1252Q917k3755p7133j4152K9388L2258R79
12205B61405p213L3198K2068K7664R387J0699L2270K3149r830l591K5034r457
12193D14783k1668J0171J711M933K2200p612k0387q05K1121M158m4316N022p421
12180C81890k1097J267L0953N3577N971L872r89j2463k439M1607L3077K5262o78
$$ y = [247994, 193117, 125334, 124879, 133499, 148890, 149895, 178981, 185367, 220206, 227848, 233092, 198000, 158445, 164299, 207617, 200549, 200314, 213172, 235194, 263961, 240633, 235464, 215268, 239367, 258336, 241018, 220510, 238875, 214446, 199942, 213516, 236479, 247808, 231482, 228583, 208433, 173058, 200130, 231156, 227377, 180001, 132149, 135049, 169769, 200344, 184044, 187679, 201010, 192838, 232611, 249917, 273264, 293651, 304903, 313820, 290065, 212932, 198780, 228168, 260426, 261405, 254192, 287390, 309458, 337122, 346509, 357208, 389478, 412627, 402797, 399206, 424240, 414783, 393115, 403286, 404997, 409930, 432130, 424518, 404131, 403326, 424447, 428605, 384289, 389311, 381890, 360793, 362060, 393013, 446590, 452561, 456433, 455444, 442981, 440542, 482149, 515226, 540488, 539810]
12167E39810j7212k200J6477M056L3792j521j085k9934K8882R360P864r755L9202
12154F17736J4528N935j2263L313q834R909l904L214j402K0712L004L1053M7461
12141G30462K6885p277l6197m1582p410L7213L9749m429n718j6157n550m192k8712
12128F77085O0023K9027j7140k0182j8087K2165m843l703r82Q976N042j9871k9521
12115F87989K3915j1852j843k2580o665R036P882m799K5189j2603m2183J034J2265
12102F64785j7365k0869M599k3968J4384r270r913J8140L4508j8146j6164j0426
12090F10295j6513N18j1573j4998J5571J1310k1572m7919l3638K5032l4702k4303
12078D57508M4609K16k2456K3970j2545j9278k712q28L0253k5804j7841J695j8938
$$ y = [539810, 522598, 520398, 536875, 540931, 574723, 573202, 572117, 542183, 571065, 580425, 588289, 578534, 617736, 632264, 638199, 625936, 629249, 620415, 630324, 626420, 629634, 628232, 648944, 651948, 683001, 730462, 757347, 750070, 713873, 672291, 664881, 702094, 741843, 737414, 731696, 715539, 709989, 705797, 677085, 737108, 766135, 748995, 728813, 710726, 732891, 728048, 724345, 723363, 732339, 737381, 717510, 687989, 711904, 700052, 698209, 675629, 668964, 678000, 685882, 681083, 706272, 693669, 651486, 652520, 664785, 647420, 626551, 631150, 607182, 621566, 612296, 602383, 620523, 655031, 636885, 620721, 610295, 593782, 594300, 582727, 567729, 583300, 594610, 573038, 525119, 491481, 516513, 481811, 457508, 502117, 502333, 479877, 503847, 491302, 472024, 469312, 468484, 498737, 472933, 455092, 456787, 437849]
12065D37849O253p94k3201n0566l3802K5111O3925n527k5132Q679j919p576l4420
12052C58880l2382O936M413M427j4024m955k430M0855O4661Q728o0373l4147m860
12039C35729j1500K3481M5354k6635k9037R979m046J0660J5225P973K4254m050
12027C97387j5846k4996l678l4630L016J9122k5324K9309J9766J0395n109k9903
12015C39509N778L8277j1111l1116K7053K3989Q028j052J707K9949m855j8656
12003D07500j2673k1631L6997K2789l169K7086l587K5514j388j0195p171l2646
11991D27426l313Q048j8941J6840J3701J8333O320q848J9212l2954n463K3463
11979D63824j2258L1582L1425K7286j6477n0686j1047K0381j3245l672J1320N6094
$$ y = [437849, 444102, 443308, 420107, 369541, 335739, 360850, 424775, 419248, 394116, 402795, 400876, 393300, 358880, 326498, 333434, 337847, 342274, 328250, 323295, 320865, 361720, 426381, 435109, 374736, 340589, 335729, 324229, 347710, 393064, 366429, 337392, 347371, 343325, 353985, 369210, 377183, 401437, 397387, 381541, 356545, 352867, 318237, 321253, 340375, 315051, 344360, 364126, 374521, 369412, 339509, 345287, 383564, 372453, 341337, 368390, 392379, 400407, 399355, 401062, 431011, 426156, 407500, 394827, 373196, 410193, 432982, 429813, 456899, 453312, 478826, 477438, 467243, 460072, 427426, 424113, 432161, 413220, 430060, 443761, 462094, 468414, 459566, 478778, 445824, 440361, 463824, 451566, 483148, 514573, 541859, 525382, 474696, 463649, 484030, 470785, 467113, 478433, 534527]
11967E34527N0074L2977K3157k2537K279L1340J6457N6167O3974J7286k4173q449
11955G73079N6024M4455m77q889m499N680m009k6120j7404J7452q012K1487r309
11942H39458P517J0257J7386J7256J7633k71L1791q972q482Q527K3052N8538Q2557
11929A096247J3040j1570N183N3016K0324J7848K906k6984l1284O211k5597J4508
11917A133848Q769J046j298n303l5743r960N0449J5954J6703P950j7810j6666
11905A147939k6564j1880K2057j869L2128l3389J3498j715L3660N2026J4232J4307
11893A254430J3813J916m604j6822l2165l1834L953j7098m4110m4657m0981k4469
11881A017372q439K8517j7033l8410j4048q940p578J8654K8096J2474j9449R842
$$ y = [534527, 584601, 617578, 640735, 618198, 620477, 651817, 668274, 724441, 788415, 805701, 781528, 773079, 829103, 873558, 873081, 864192, 859693, 865373, 861364, 835244, 817840, 835292, 827280, 848767, 839458, 846975, 857232, 874618, 891874, 909507, 909236, 941027, 932055, 923573, 932100, 955152, 1013690, 1096247, 1109287, 1097717, 1102900, 1155916, 1176240, 1194088, 1196994, 1170010, 1138726, 1144937, 1119340, 1133848, 1142617, 1143663, 1142365, 1137062, 1101319, 1091359, 1141808, 1157762, 1174465, 1182415, 1164605, 1147939, 1121375, 1109495, 1131552, 1129683, 1161811, 1128422, 1141920, 1140205, 1173865, 1225891, 1240123, 1254430, 1268243, 1270159, 1265555, 1248733, 1216568, 1184734, 1188687, 1171589, 1127479, 1082822, 1041841, 1017372, 1008933, 1037450, 1020417, 982007, 967959, 959019, 951441, 970095, 998191, 1010665, 991216, 1001058]
11869A001058L67J5827j3299n9047l5665O676L6793J0753J0324M0146J353K7133
11857A042419j1772N503J0095R918j992m2362L810j2295k1489O764M570K8459
11845A021628L6168K0746J9556O915M4231K5580m3936q299M2447N4019M5184J2360
11833A276599p283j5389K6805J2375l8680j6530O760M5907M8855J9322j0185M13
11821A348969L7585O8365J9356j9505o298J2592K5494M6050O3833M1327N96k8925
11809A609439k3945J4054K8397K5280J9449K7609J4494R229K5783L4106O398J1528
11797A801821M7688M0384N8773J7201L2437P2803K1052J7550K9960K2385L1948
11786B194002M8782P5063J03976J07543P6783N8550M0068J9363J13599R9808M0578
$$ y = [1001058, 1001425, 1017252, 1003953, 944906, 909241, 915917, 952710, 963463, 973787, 1013933, 1015286, 1042419, 1030647, 1036150, 1046245, 1056163, 1054171, 1011809, 1015619, 1003324, 981835, 988599, 993169, 1021628, 1057796, 1078542, 1098098, 1105013, 1149244, 1174824, 1130888, 1122589, 1165036, 1219055, 1264239, 1276599, 1269316, 1253927, 1280732, 1293107, 1254427, 1237897, 1244657, 1290564, 1339419, 1358741, 1348556, 1348969, 1386554, 1454919, 1474275, 1454770, 1448472, 1461064, 1486558, 1532608, 1596441, 1637768, 1638364, 1609439, 1585494, 1599548, 1627945, 1653225, 1672674, 1700283, 1714777, 1724006, 1749789, 1783895, 1790293, 1801821, 1849509, 1889893, 1948666, 1965867, 1998304, 2071107, 2092159, 2109709, 2139669, 2162054, 2194002, 2242784, 2317847, 2421823, 2529366, 2606149, 2664699, 2704767, 2724130, 2837729, 2937537, 2978115]
11775B978115J05104J29653R3367J40903J34381J24154J43693J39591J94943K11443
11765D395347K40300K38930K68459K95898L27714L59599M29239M40464N04109
11756G500059O03086O52900P09719Q04275Q77476R24149R71890J037422J004706
11747A5085682J015782R66563Q34167P37937O61320N81275N36946M43769M13417
11738B1276858M51976M95256N22036O22403P79735Q72245J037785J178908J380184
11729B8617386J571549J706577J792787J865268J934999J877590J858997J748513
11721D2973666J589684J444847J299708J156867J070478R77357Q80106P82581
11713E2175294P39275P34153P58215P00328O68646P26934Q44687R23653J026315
$$ y = [2978115, 3083219, 3212872, 3306239, 3447142, 3581523, 3705677, 3849370, 3988961, 4183904, 4395347, 4635647, 4874577, 5143036, 5438934, 5766648, 6126247, 6555486, 6995950, 7500059, 8103145, 8756045, 9465764, 10270039, 11147515, 12071664, 13043554, 14080976, 15085682, 16101464, 17068027, 17902194, 18640131, 19301451, 19882726, 20419672, 20863441, 21276858, 21728834, 22224090, 22746126, 23368529, 24148264, 25020509, 26058294, 27237202, 28617386, 30188935, 31895512, 33688299, 35553567, 37488566, 39366156, 41225153, 42973666, 44563350, 46008197, 47307905, 48464772, 49535250, 50512607, 51392713, 52175294, 52914569, 53648722, 54406937, 55107265, 55775911, 56502845, 57347532, 58271185, 59297500]
11704E9297500J138940J303356J523555J678805J814996J885169J850341J772927
11696G2265589J657832J553717J395608J263268J145482J053760R47555R74477
11688H2257288R57143Q28821O99258N88336L84815J18818j35948m12625o20214
11679H4665692q30780r38943r84146r58176p63547n85397l03543j3283K19553
11670G9507430M26520N50499N15991M10341K47056k6015l46679p08327r50437
11661G9626379j066639j221237j311867j285062j243301j226938j238305j228808
11653F9804222j195938j210251j237314j239304j254552j298411j363627j400249
11645E9604576j413002j377036j435348j483928j473064j438444j464615j470555
$$ y = [59297500, 60436440, 61739796, 63263351, 64942156, 66757152, 68642321, 70492662, 72265589, 73923421, 75477138, 76872746, 78136014, 79281496, 80335256, 81282811, 82257288, 83214431, 84043252, 84742510, 85330846, 85715661, 85834479, 85698531, 85285906, 84665692, 83834912, 82895969, 81911823, 80953647, 80190100, 79604703, 79301160, 79287877, 79507430, 79933950, 80484449, 81000440, 81410781, 81657837, 81631822, 81285143, 80576816, 79626379, 78559740, 77338503, 76026636, 74741574, 73498273, 72271335, 71033030, 69804222, 68608284, 67398033, 66160719, 64921415, 63666863, 62368452, 61004825, 59604576, 58191574, 56814538, 55379190, 53895262, 52422198, 50983754, 49519139, 48048584]
11637D8048584j428182j386571j297345j205526j059776r22530p89439o22116
11629C9337099m93900m92739m41804m92713n29231o66141q79101j009493j062640
11620C3269337j180473j317782j357200j466011j535946j502986j502775j547651
11612B1858513j526785j480909j382463j309486j181991j081838r98220r09161
11604A1987660q28376p64010o61648n78973n03888m59518m16865l67449l56643
11595G050290k82297k54266k54521k27273j88763j52528j61361j82720j23869
11586E222692q0543j8630l0026p9372q9784m5787m7962k6909K76r093K5557P7116
11574D897535K1877K7566N4291O8531R7609Q4723J05157J37980J52618J95880
$$ y = [48048584, 46620402, 45233831, 43936486, 42730960, 41671184, 40748654, 39959215, 39337099, 38843199, 38350460, 37908656, 37415943, 36886712, 36220571, 35341470, 34331977, 33269337, 32088864, 30771082, 29413882, 27947871, 26411925, 24908939, 23406164, 21858513, 20331728, 18850819, 17468356, 16158870, 14976879, 13895041, 12896821, 11987660, 11159284, 10395274, 9733626, 9154653, 8650765, 8191247, 7774382, 7406933, 7050290, 6767993, 6513727, 6259206, 6031933, 5843170, 5690642, 5529281, 5346561, 5222692, 5142149, 5123519, 5093493, 5014121, 4924337, 4878550, 4830588, 4803679, 4803955, 4794862, 4820419, 4897535, 4919412, 4946978, 5001269, 5069800, 5167409, 5252132, 5357289, 5495269, 5647887, 5843767]
11564E843767J95960J56535K26686K31570K84279K77846K95014K73499K84668
11555H069824L41745L58252L17586L21884L80982M12618M53221N20553N52556
11546A1729221O07848O71877P92107Q47829R51514J113493J235436J302040J396460
11537B0647825J434110J575844J757480J863654K050440K172435K377969K567939
11529C6447696K830732L140921L451105L770387M203164M732636N125497N616258
11521F9318396O009719O332842O417251O117457N488214M379473K963059J338925
11513A08365336k09566j537439k387254k800684k840121k522121k055149j434195
11505I2578807q17675k85779P6646K40187K04418r764k76728n24731p05590p03314
$$ y = [5843767, 6039727, 6196262, 6422948, 6654518, 6938797, 7216643, 7511657, 7785156, 8069824, 8411569, 8769821, 9087407, 9409291, 9790273, 10202891, 10656112, 11176665, 11729221, 12337069, 13008946, 13801053, 14648882, 15600396, 16713889, 17949325, 19251365, 20647825, 22081935, 23657779, 25415259, 27278913, 29329353, 31501788, 33879757, 36447696, 39278428, 42419349, 45870454, 49640841, 53844005, 58576641, 63702138, 69318396, 75328115, 81660957, 88078208, 94195665, 99683879, 104063352, 107026411, 108365336, 108155770, 106618331, 104231077, 101430393, 98590272, 96068151, 94013002, 92578807, 91761132, 91475353, 91551999, 91792186, 91996604, 91986840, 91710112, 91185381, 90479791, 89776477]
11495H9776477n04489k04982J81395O52451J168566J648326J998892K248107K370424
11486I9335167K277944K110860J756258J298240Q13159K96259k99857r03919j496077
11477A05188034k102462k772006l426802m020802m514266m803223m966896m864492
11469G3717085m541692l996199l365872k720428k002435j344557o70189j28343
11461E4947370M11081Q46572J166607J295747J235448R80158O49531J89851l75414
11452F1346951j075998j752670k451434l070125l572055l946908m115551m115451
11444C7246759l938017l623920l276138k883418k497107k203513j924828j647794
11436A5252024j402567j244451j104559r60290q07976p33978o82393o16088m89446
$$ y = [89776477, 89271988, 89067006, 89248401, 89900852, 91069418, 92717744, 94716636, 96964743, 99335167, 101613111, 103723971, 105480229, 106778469, 107591628, 107887887, 107588030, 106684111, 105188034, 103085572, 100313566, 96886764, 92865962, 88351696, 83548473, 78581577, 73717085, 69175393, 65179194, 61813322, 59092894, 57090459, 55745902, 55075713, 54947370, 55358451, 56205023, 57371630, 58667377, 59902825, 60882983, 61532514, 61722365, 61346951, 60270953, 58518283, 56066849, 52996724, 49424669, 45477761, 41362210, 37246759, 33308742, 29684822, 26408684, 23525266, 21028159, 18824646, 16899818, 15252024, 13849457, 12605006, 11500447, 10540157, 9732181, 8998203, 8315810, 7699722, 7210276]
11427G210276m42200m52535l87592l19363k59777l07466k86940k49655k26062
11418D278686j70251j64157k02736j72068j64101j31500j07461j17455q7840j14291
11408B846826j00768q6729p3562r5984r6655j10313j24643m8914k4404m0237o7781
11397A976836o0375m8654k9688n5672m4164j04476m9191k9507n9103j9477k612
11386A473917j7481l3602k9618l7449n7134J8215l9326o2660n6332j2457N932
11375A152005m2748l2151j7378M8246K3397r529o0534n3106m0090j6895P613l8586
11363I20244k0072l602k8501j4168j5069M899j4183k0484m360K7554P819K2402
11351H62479j5722m2875m2242m6678k4804R26j1814l259K6176j370n8818n0747
$$ y = [7210276, 6768076, 6315541, 5927949, 5608586, 5348809, 5041343, 4754403, 4504748, 4278686, 4108435, 3944278, 3741542, 3569474, 3405373, 3273873, 3166412, 3048957, 2961117, 2846826, 2746058, 2659329, 2585767, 2489783, 2393128, 2282815, 2158172, 2109258, 2084854, 2044617, 1976836, 1916461, 1867807, 1838119, 1782447, 1738283, 1633807, 1584616, 1555109, 1496006, 1476529, 1473917, 1456436, 1422834, 1393216, 1355767, 1298633, 1316848, 1277522, 1214862, 1158530, 1146073, 1152005, 1109257, 1077106, 1059728, 1107974, 1131371, 1121842, 1061308, 1008202, 968112, 951217, 958830, 920244, 900172, 896570, 868069, 853901, 838832, 843731, 829548, 809064, 804704, 832258, 840077, 862479, 846757, 803882, 761640, 714962, 690158, 691084, 679270, 676011, 702187, 700817, 641999, 591252]
11339E91252q168M1368k6406N22n777O14K2981m0911m101N153j1264m2930m5129
11326D77204J1794L4847k3962m5723M7504P49l2939p165j5797o848p843j0486
11314D21335o301j1562n317J6789K2106p304j7669m813k9639k8488m495J1474
11302C56116M6806R128k3327j1078J2335K2403L427j6385J3626k394K0417L788
11290D34862N278J7070m8135p241K6387L2833J6590k7515K0309M903K174M1818
11278E19333j4576K005m0334j6344P210k7528M554k2687K125J5647K852M8183
11266D80440J5324J5449r109L884n488L6884p934l7676j1198M4974L6392J0851
11254E72793J389J2712j2952J2122r983j8970K8876P5062j4426m5465m702q72
$$ y = [591252, 583084, 624452, 598046, 598568, 592791, 593405, 616386, 575475, 571374, 576527, 565263, 522333, 477204, 488998, 523845, 499883, 454160, 501664, 502413, 469474, 462309, 446512, 439664, 431821, 421335, 415034, 403472, 398155, 414944, 437050, 429746, 412077, 407264, 377625, 349137, 344642, 356116, 402922, 412050, 388723, 377645, 389980, 412383, 415810, 399425, 413051, 410657, 431074, 434862, 440140, 457210, 409075, 401834, 428221, 461054, 477644, 450129, 470438, 475341, 477515, 519333, 504757, 506762, 466428, 450084, 457294, 429766, 434320, 411633, 413758, 429405, 432257, 480440, 495764, 511213, 502104, 505988, 500500, 537384, 529450, 491774, 480576, 525550, 561942, 572793, 574182, 586894, 573942, 586064, 576081, 557111, 585987, 661049, 646623, 601158, 596456, 595584]
11242E95584l6714O755L7710L0741L407k4124k5132m49j749J3369J0793J9408
11230F29599k4911j0128J4635N1656j9477k6738J5420p239l1866n75R246J9976
11218F19598K7280N783k7043k1629j897q661P346j9478m7045j9058n551J8505
11206E28150r321j65N24k9616j262K8579L696l6382j3999J0245L7952J209l6196
11193D83414k2518j6984m1962J5350j576O145K9743l167k8764m516K322j8190
11181C99297l7641l0120k0446Q571L9106m016l5821J9617k838k8841j680K259
11169C07447K8833q402K0800j9965n3449k5621j466R643l4731J707M4144P3935
11157C42875j9899l2798k661p6550n7706J9207J4334K3958M201N285k4021J5913
$$ y = [595584, 558870, 565625, 603335, 634076, 637483, 613359, 588227, 587778, 586029, 599398, 610191, 629599, 604688, 594560, 609195, 660851, 641374, 614636, 630056, 622817, 590951, 590376, 599622, 619598, 646878, 652661, 625618, 603989, 602092, 593431, 600777, 581299, 534254, 515196, 509645, 528150, 518829, 518664, 519188, 489572, 488310, 516889, 520585, 484203, 470204, 480449, 518401, 519610, 483414, 460896, 443912, 401950, 417300, 415724, 421869, 451612, 448445, 419681, 415165, 417487, 399297, 361656, 331536, 311090, 319661, 358767, 354751, 318930, 338547, 335709, 306868, 305188, 307447, 336280, 327878, 348678, 328713, 275264, 249643, 248177, 257820, 223089, 224796, 268940, 342875, 322976, 290178, 287517, 210967, 153261, 172468, 186802, 210760, 214961, 220246, 196225, 212138]
11145B12138K7444J1323l4572j2859n2084l070K465l590j0742j365j0410J3334
11133A38012P84J4953m717l5282j2766L4915K8709r556j7695j7118r942O4380
11121A74677L4278K461l5797r1678l7285J3039N5115J4249K6763J2268J8914J1139
11109A98143j609n0752N062K6084P086k8597K2552J2913J5270L1352L0907R191
11097B77602j8654J0437N261n506k808L4719J7439J1941m332M7235M2771J6182
11085D32287K664m8881M0881R8226M0862L4007l0352l8024L179j6345r336K4817
11073E33985k0666J1097K557J3256J8616j8419j0644l1446M441K8825L2542N0325
11061F14469O822J4670k4983L465L2317M2821k5688K6705M3546M3038J6551J6930
$$ y = [212138, 239582, 250905, 216333, 203474, 151390, 148320, 150785, 147195, 136453, 135088, 124678, 138012, 138796, 153749, 149032, 113750, 100984, 135899, 164608, 155052, 137357, 120239, 110297, 174677, 208955, 211416, 175619, 83941, 46656, 59695, 114810, 129059, 155822, 168090, 187004, 198143, 196534, 145782, 150844, 176928, 184014, 155417, 177969, 190882, 206152, 237504, 268411, 277602, 258948, 269385, 274646, 269140, 266332, 301051, 318490, 330431, 326099, 373334, 416105, 432287, 434951, 386070, 426951, 525177, 566039, 600046, 569694, 531670, 534849, 518504, 509168, 533985, 513319, 524416, 526973, 540229, 558845, 540426, 529782, 498336, 502777, 531602, 564144, 614469, 621291, 635961, 610978, 614443, 646760, 689581, 663893, 690598, 734144, 777182, 793733, 810663]
11049H10663P675J7618J61O812J3316n853k2559Q64L1027j7824J3262Q179L1242
11036H94583P3668M5610k7804p5382n1812l4800r172l0521m702K8367L0289P6097
11024I14421Q5313O2416K4935k5344m9740o8872n3730m7636l7634m6j6431P5366
11012H63018M5688m5449k7889q2409r2654o1232r2566o9905l3713n5076J9190
11001C67003M7296J1944n5391k9771o461k3576j4937k6982l5948k8489n335m700
10989A94653p1289k4383M1654K7505R72M33k2907n5166j5742L4412K8228m470
10977A33900m5948m1411L281K8553J0354n031j13N012R810M45j8065m0956k6516
10964A3315J3628K3596L7106J1369L5932m225k5254K839j305N344L3858J8118
$$ y = [810663, 818338, 835956, 836117, 842929, 856245, 850392, 827833, 828697, 859724, 841900, 855162, 863341, 894583, 968251, 1013861, 986057, 910675, 858863, 824063, 814891, 784370, 779668, 808035, 838324, 914421, 999734, 1062150, 1087085, 1061741, 1012001, 943129, 889399, 841763, 804129, 804083, 787652, 863018, 908706, 863257, 835368, 752959, 660305, 599073, 506507, 436602, 402889, 347813, 367003, 414299, 426243, 370852, 341081, 334620, 311044, 296107, 269125, 233177, 204688, 199353, 194653, 123364, 98981, 140635, 168140, 169112, 169545, 146638, 91472, 75730, 110142, 138370, 133900, 87952, 46541, 49822, 78375, 88729, 83698, 83585, 88597, 98407, 98852, 80787, 39831, 13315, 26943, 50539, 87645, 99014, 134946, 130721, 105467, 108306, 107001, 112345, 146203, 164321]
10952A64321j612k5256j4232l6544k3618n2038m1437P749L6180J4144J7598K6129
10940G1384Q733l578M2362L3876j967O532k143N058n2049j2470J0545l9924J5542
10927H1901q712j237n7889n39L3356J1845N0126o703k0185L9946K4683k5690K6175
10914A47077K6248l3340n9895K2779k0349l4532r667L346p214L0674K0209m781
10902H0555K4474J8566K2051o285l1713m0585k1893J8793L0586L980j253J4986
10890A12262j0141k8974q592k1792j1962j6389j9908K9257N6618m518j1455M5373
10878A09779L5029O361j5012l0221k5995O080Q900l0585L4095L9514J69j0876
10866A27238L431N112j8950M823R394K1956q214n425J0164O461K132L942o221
$$ y = [164321, 162709, 137453, 123221, 86677, 63059, 11021, -30416, -22667, 13513, 27657, 45255, 71384, 80117, 76539, 118901, 152777, 150810, 157342, 155199, 160257, 108208, 95738, 106283, 66359, 81901, 73189, 71952, 14063, 13524, 46880, 58725, 108851, 102148, 81963, 121909, 146592, 120902, 147077, 173325, 139985, 80090, 102869, 82520, 47988, 38321, 41667, 34453, 65127, 85336, 80555, 105029, 123595, 145646, 139361, 107648, 67063, 45170, 63963, 94549, 98529, 97276, 112262, 102121, 73147, 64555, 42763, 30801, 14412, -5496, 23761, 80379, 75861, 64406, 109779, 144808, 151169, 136157, 105936, 79941, 86021, 94921, 64336, 98431, 137945, 138114, 127238, 130669, 135781, 116831, 121654, 131048, 153004, 144790, 139365, 149529, 155990, 158122, 162064, 155843]
10853A55843O387k1839k3975l1044J5722N7155M2978P638k3922k4078P822O463
10841A75150R445J940j2433l4503j6069M5890L6719Q22l0782l8412R031P906N254
10828A59958K2999R271O854J3643j7795j7974k3287r994n729K1195o070o213k2927
10815A23931m755O322k1623j764J8143n251n609n185J0975M0885J3745l1023j0331
10802A28460j7751L7568k1624J9622N1259Q993m6206p520K0801k991k8263j8537
10790A23811L9781n190p405J5236K3324P708j6104J1483j4403l823j4790K8205
10778A87833l758L417K5075o798j2902L3415L090j5274O332l3388r270L103J2391
10765A93266N649L3328L2091Q645n193k6378l2514K323K843l925J8891k4772m3378
$$ y = [155843, 162230, 140391, 116416, 85372, 101094, 158249, 201227, 208865, 184943, 160865, 168687, 175150, 184595, 186535, 174102, 139599, 123530, 169420, 206139, 206961, 176179, 137767, 146798, 154704, 159958, 182957, 192228, 199082, 212725, 194930, 176956, 153669, 143675, 137946, 159141, 153071, 146858, 123931, 119176, 125498, 103875, 102111, 120254, 115003, 109394, 104209, 115184, 156069, 169814, 138791, 128460, 110709, 148277, 126653, 146275, 197534, 206527, 160321, 152801, 173602, 170611, 142348, 123811, 163592, 158402, 150997, 166233, 189557, 197265, 181161, 192644, 178241, 174418, 159628, 187833, 184075, 187492, 212567, 205769, 192867, 226282, 229372, 214098, 220430, 187042, 177772, 180875, 193266, 198915, 232243, 264334, 272979, 267786, 241408, 208894, 211217, 214060, 210135, 229026, 204254, 160876]
10752A60876m0128K3485M4388M9332J1300m628M9775L5430l5478k7361K238p717
10740B61512p561j5642k9682m1112Q06J9167K512J3291N0271M0918j5048l4878
10728B44554j226m231Q914L5982r362k4393L0920P054K4852r505N698k7838m904
10715B76515Q578O1m743J3078j0652J7045n793J0282r438l7723o670Q419K2956
10702B81915k3837K6640L5417K5671K2570L7595k4466l7728l2213m880L848J849
10690C12381k2424O572K3342j6760j9636q350K2100L1759L406j5270O610j8821
10678C04909M6458K5461K8371P916j3657j9140K251N1190K5435K8144K669L0133
10666E20140J2281j882K3327j1195n360N5076n354j9430L1020L1211P9985o264
$$ y = [160876, 120748, 144233, 188621, 237953, 249253, 244625, 294400, 329830, 294352, 266991, 269229, 261512, 253951, 238309, 208627, 167515, 168321, 187488, 190000, 203291, 253562, 294480, 279432, 244554, 243328, 239097, 248011, 283993, 274631, 250238, 281158, 288212, 313064, 303559, 309257, 281419, 276515, 285093, 285154, 280411, 293489, 282837, 299882, 294089, 304371, 294933, 257210, 250540, 258959, 281915, 258078, 284718, 320135, 345806, 368376, 405971, 381505, 343777, 311564, 306684, 310532, 312381, 289957, 296529, 319871, 303111, 283475, 275125, 297225, 328984, 332390, 317120, 323730, 304909, 351367, 376828, 405199, 413115, 399458, 380318, 382569, 433759, 459194, 487338, 490007, 520140, 532421, 530539, 553866, 542671, 537311, 592387, 587033, 567603, 598623, 629834, 709819, 703555]
10654G03555K6033L507k55K3621M9560K1220p223L2101N7460M8686O1285J08906
10642A128456M9283O4523P0078J07583J26705J77485K12035K77462K82628K61344
10632B757582K03148J42788J91947K73927L67183N20241O98216R93409J409432
10623G557873J938172K633053L536835M510796N438228N775192M796724K408312
10615C8595185l67632j961463j925464p95905R74487L166490N779830Q677794
10607E2143322J1226487J1912604Q894695K066519n047422q364968p446917m379006
10599F1005314o71954L225943P448803J1697874J4807087J4641466Q960176j747644
10591A19367065j1882847j5695356j3724768r601540n375193j410137K319948
$$ y = [703555, 729588, 733095, 732840, 756461, 806021, 827241, 820018, 852119, 909579, 958265, 1019550, 1128456, 1177739, 1242262, 1312340, 1419923, 1546628, 1724113, 1936148, 2213610, 2496238, 2757582, 2960730, 3103518, 3295465, 3569392, 3936575, 4456816, 5155032, 6148441, 7557873, 9496045, 12129098, 15665933, 20176729, 25614957, 31390149, 36186873, 38595185, 38227553, 36266090, 34340626, 33544721, 34519208, 37685698, 43465528, 52143322, 63369809, 75282413, 84177108, 86243627, 81196205, 72831237, 65384320, 61005314, 60333360, 63559303, 71008106, 82705980, 97513067, 112154533, 121114709, 119367065, 107484218, 91788862, 78064094, 68462554, 63087361, 61677224, 63997172]
10584F3997172N584379P553584O946402K513407m780773j0875208j2517086j0471410
10576D7950467p258951m384496k026645j07085J355730J945906J359553o78260
10568C8156219l453115n543977o044115n270605m047300l005478k203325j638914
10560F949390j204789q80145o83847n38490m08002l76768l40582k86130k17111
10551B013526j90178j94792j94515j11996j24584j04508p6029n2552o8945p6396
10541H19031n0464l9997m3005k7639k9824n8964L444O875j8348j9171k8928n1787
10529D61223m6182m4227m003M1947J2166L2958j1503n6736m1255q407r446J6766
10517C43301J1854k071k2149l6974K3779j0528k405j7926o2680r937J6894J1373
$$ y = [63997172, 69581551, 77135135, 84081537, 86594944, 81814171, 70938963, 58421877, 47950467, 40691516, 36307020, 34280375, 34173290, 35529020, 37474926, 38834479, 38156219, 34703104, 29159127, 23115012, 17844407, 13797107, 10791629, 8588304, 6949390, 5744601, 4864456, 4180609, 3642119, 3234117, 2857349, 2516767, 2230637, 2013526, 1823348, 1628556, 1434041, 1322045, 1197461, 1092953, 1016924, 964372, 895427, 819031, 768567, 728570, 685565, 657926, 628102, 569138, 572582, 579457, 561109, 541938, 513010, 461223, 415041, 370814, 366811, 408758, 420924, 453882, 442379, 385643, 344388, 335981, 326535, 343301, 355155, 353084, 330935, 293961, 317740, 307212, 304807, 286881, 224201, 214264, 231158, 242531]
10505B42531M1196m896j5637k7839k4316l8226J6035J2768n8687J9239n3188j4170
10493I4810O611K8649M9446K3480j6273K5181J0446l1077j9657l6630k3285O519
10481A18220J9446J7925L4337J2570k8566j7857l3146K5624K0600m696P471J1926
10469A83854L297o750p917n2906N692L7701K693K362K1826n390J1613J3081J2896
10456B22052l4159N687N798M4463J5868R357M8886N3418J5156R337P516k185o26
10443D00568k5975j4518m9615o8298j8037K4095n178m3651m5926m5112L5463j9117
10431A24699o751K3398L3369N558n4781q301q410j9243k6013j4068J0882K2806
10419H3145J0219M3388M0259K4876j8858l389o458j3911j2322k14J2951j2582
$$ y = [242531, 283727, 278831, 263194, 235355, 211039, 172813, 188848, 201616, 142929, 162168, 108980, 94810, 101421, 130070, 179516, 202996, 186723, 211904, 222350, 191273, 171616, 134986, 111701, 118220, 137666, 155591, 189928, 202498, 173932, 156075, 122929, 148553, 169153, 164457, 171928, 183854, 187151, 180401, 172484, 119578, 125270, 162971, 165664, 168026, 189852, 184462, 196075, 209156, 222052, 187893, 193580, 199378, 243841, 259709, 269066, 317952, 371370, 386526, 395863, 403379, 401194, 400568, 374593, 360075, 310460, 242162, 224125, 248220, 243042, 199391, 153465, 108353, 143816, 124699, 117948, 141346, 174715, 180273, 125492, 117191, 108781, 89538, 63525, 49457, 60339, 83145, 93364, 136752, 177011, 201887, 183029, 179640, 173182, 159271, 146949, 146735, 159686, 147104]
10407A47104j4146j9261J7648o821K318j7553K5656N3509L760J8443m86K0222
10395B30393J4161N888l3758m7456j0410M9718n716J7030M2478L7405j4720l4939
10383B50074j6401M584k0610j0770m531M3411K317j2543j3578M7144q644k5113
10371B35340K6936J4266J3331j1675J5004N4402L3140K135o815R190O6234k0743
10359D30745k0424j8293J8948M5785n05K6149M123j1603k646l1058J415P842L4836
10346D85314l2732j2512O418J0637m4442l7300O076K6669l4463k2199m814M135
10334C50787o788J5292K003K7496J8229j9514q367J4804L2121r199L1612Q0915
10322E29391J15546L4537L9996N4688J4482L2576r139k4613n7853n8374k5609
$$ y = [147104, 132958, 113697, 131345, 124524, 126842, 109289, 134945, 188454, 192214, 210657, 210171, 230393, 244554, 250442, 216684, 169228, 158818, 208536, 202820, 219850, 262328, 299733, 285013, 250074, 233673, 238257, 217647, 206877, 202346, 245757, 248074, 235531, 221953, 269097, 260453, 235340, 262276, 276542, 289873, 278198, 293202, 347604, 380744, 382879, 376064, 385254, 451488, 430745, 410321, 392028, 410976, 456761, 456256, 482405, 486528, 474925, 472279, 441221, 442636, 450478, 485314, 452582, 440070, 446488, 457125, 412683, 375383, 381459, 408128, 373665, 351466, 346652, 350787, 343999, 359291, 361294, 388790, 407019, 387505, 379138, 393942, 426063, 416864, 448476, 529391, 644937, 679474, 719470, 774158, 788640, 821216, 812077, 787464, 729611, 671237, 645628]
10311F45628k8565j0532k9626q802K2831P468n241J9645J3457k673k5783q117
10299E89690R418p750J831M850m2734j9917L5280m785j4690J4910N1073N2469
10287F69645J4410R163J3649J2200K2179K2568J2644Q373J2385L6581l352J4756
10275H45201K5685k0583R710K7750K1303N8255M0089L0039M9718J721j8584p936
10263A062368K8298K3667J2734K07M5420O3569L8594N7496M2853N5008O5892P1092
10251A567198M7146N0112R0962O3772P5944Q6788N1930K8670P2339J05079Q3753
10240B323693P5737R6390R4615R3708R4119J45128J77781J73761J69035K03870
10230C647837K60448K32204J74842K56083K87314K73690K89532L46297M13538
$$ y = [645628, 617063, 606531, 576905, 568103, 590934, 598402, 593161, 612806, 626263, 623590, 597807, 589690, 599108, 591358, 593189, 598039, 555305, 535388, 570668, 565883, 551193, 566103, 617176, 669645, 684055, 693218, 706867, 719067, 741246, 763814, 776458, 784831, 797216, 833797, 830445, 845201, 870886, 850303, 860013, 887763, 909066, 967321, 1007410, 1037449, 1087167, 1088888, 1070304, 1062368, 1090666, 1114333, 1127067, 1127274, 1172694, 1236263, 1274857, 1332353, 1375206, 1430214, 1496106, 1567198, 1614344, 1664456, 1755418, 1819190, 1895134, 1981922, 2033852, 2062522, 2134861, 2239940, 2323693, 2399430, 2495820, 2590435, 2684143, 2778262, 2923390, 3101171, 3274932, 3443967, 3647837, 3908285, 4140489, 4315331, 4571414, 4858728, 5132418, 5421950, 5768247, 6181785]
10221F181785M53840N46209O48516P21921Q86561J061525J208208J404775J583368
10212A4696708J760262J901191K110366K350809K671983L151978L880484M955388
10204C7479169O537366Q851910J2399298J7450627K4088567L1760692L8940243
10197A77507872M3760810M5733648M4386916L8485572K7850920J3268072l175271
10190C87818539j8913391l1614024m0334430m5151181m5886836m2497162l5998806
10183A27422709k8060351k0617903j4890984j0858261q053913o156273m844523
10176C3940501l970050l299986k837036k498725k218024j988886j754411j548629
10168A3824754j403233j301167j174305j004101q43912p64631o07344n04774l87775
$$ y = [6181785, 6635625, 7181834, 7830350, 8552271, 9438832, 10500357, 11708565, 13113340, 14696708, 16456970, 18358161, 20468527, 22819336, 25491319, 28643297, 32523781, 37479169, 44016535, 52868445, 65267743, 82718370, 106806937, 138567629, 177507872, 221268682, 267002330, 311389246, 349874818, 377725738, 390993810, 387818539, 368905148, 337291124, 296956694, 251805513, 205918677, 163421515, 127422709, 99362358, 78744455, 63853471, 52995210, 44941297, 38785024, 33940501, 29970451, 26670465, 23833429, 21334704, 19116680, 17127794, 15373383, 13824754, 12421521, 11120354, 9946049, 8941948, 8098036, 7333405, 6726061, 6221287, 5833512]
10159E833512l21277k79382k40836k83617k70289k71221l04111k43093j77518
10150C442168j78330j64220j24159q3689n7536p8684j23222j46316j90967k06066
10140B088979j32274j03265j02410m7873n5646n6636l7139J946r845n7031m4820
10129A443986m8397m0343m1878l9219l9940n6528l5503j684N180N693j9589p2135
10117A059643o9788o2956l9895l1323l7091n8992n5984O172l0316l4338k6185
10106F18947K2852r828k4271l9573k4053J4953j8288m863J6578J7718k4438m7448
10094D98286J8126o594l7820M3938j688o9235n9057K7320K7019K7480j0434k9916
10082D27425j1583m067R302J9255l0097q7583n1621J7553P10j3664q522k6513
$$ y = [5833512, 5512235, 5232853, 4992017, 4708400, 4438111, 4166890, 3862779, 3619686, 3442168, 3263838, 3099618, 2975459, 2891770, 2834234, 2755550, 2632328, 2486012, 2295045, 2088979, 1956705, 1853440, 1751030, 1703157, 1647511, 1590875, 1553736, 1555682, 1545837, 1488806, 1443986, 1395589, 1355246, 1313368, 1274149, 1234209, 1177681, 1142178, 1140494, 1145674, 1151367, 1131778, 1059643, 989855, 926899, 887004, 855681, 818590, 759598, 703614, 709786, 679470, 645132, 618947, 641799, 631971, 607700, 568127, 544074, 559027, 540739, 535876, 552454, 570172, 545734, 498286, 516412, 509818, 471998, 515936, 514248, 445013, 385956, 413276, 440295, 467775, 457341, 427425, 415842, 411775, 421077, 440332, 410235, 322652, 271031, 288584, 289294, 275630, 267108, 240595]
10070B40595j1361j5146l9193n3711j8738m517j1879L1284j6936L7168K6196N9405
10058B23167L4632J5053j0859l6830k2691J1565p928K166K9399n744k4984l5840
10046A71106k4483j2313l435j1144o120l0739k9399j0548j8539k0305m1716j7855
10034e5490J3453K8059K4375m468n175J3506K6407l1519o430j1299L472K089n0807
10021e3827r317j7300K8405N4895J6130m726K6318q704q90k3462l647M117K2439
10008C0431L9298K8826p175o643j6914m5561j3722M6507M2163n193m4687m7287
9996D3r002j6301j7729L085o239Q864R875O9393k175k2883K8512L6530J9029J5872
9982A16874j2669k9215N905j3875p447N1618N1297K3941n2256m5744m706J3120
$$ y = [240595, 229234, 214088, 174895, 121184, 102446, 97929, 86050, 117334, 100398, 137566, 163762, 223167, 257799, 272852, 261993, 225163, 202472, 214037, 206109, 208275, 237674, 231930, 206946, 171106, 146623, 134310, 130875, 119731, 113611, 82872, 53473, 42925, 24386, 4081, -37635, -55490, -42037, -13978, 10397, 5929, 754, 14260, 40667, 9148, 2718, -8581, -5109, -3020, -53827, -63144, -80444, -52039, 2856, 18986, 14260, 40578, 31874, 30984, 7522, 3875, 7992, 30431, 69729, 98555, 91380, 84737, 67823, 22262, 8540, 55047, 97210, 92017, 47330, 43, -8959, -25260, -42989, -39904, -46143, -37279, -27404, 41989, 39814, 16931, 45443, 81973, 101002, 116874, 104205, 74990, 80895, 67020, 59573, 111191, 162488, 186429, 134173, 88429, 83723, 96843]
9970I6843j0898m8898J5877K7072r392o7748k7638l281J6171K5132j8557M8545
9958D3228K5045k4313j252K9947R024o1248k612j086m0954p501K21L9653L6897
9945D5049M5039l7245q403P892l56M8207J7937P933L5408j71j9126K0759m0674
9932A22249m3320l1643k7723K3850J2855L2983M6352N4296O5151J08625K11441
9921E75116L99773O37327Q39034N70329p60884j097227n28370k40140j50101p6852
9911A68005k4701k9040r098J3952j4520m8825k2321k9040o857K0267J9720K5112
9899F2654l790l2276j5030o575l813k4887Q031P593M429K6288K5541J4042K6086
9886H8293J679k1145J2879L0277N568k9146R916k3687l8103k3213P891j7593p810
$$ y = [96843, 85945, 37047, 52924, 79996, 70604, 2856, -24782, -28063, -11892, 13240, -5317, 43228, 68273, 43960, 42708, 72655, 81679, 20431, 17819, 16733, -24221, -31722, -31501, 8152, 45049, 90088, 52843, 44440, 52332, 51976, 100183, 118120, 126053, 161461, 161290, 142164, 162923, 122249, 78929, 47286, 19563, 43413, 56268, 89251, 135603, 189899, 255050, 363675, 575116, 974889, 1612216, 2451250, 3021579, 2260695, 1163468, 635098, 394958, 244857, 168005, 143304, 114264, 105166, 119118, 104598, 55773, 33452, 4412, -2445, 17822, 37542, 62654, 58864, 26588, 11558, 4983, 1170, -23717, -15686, -8093, -3664, 22624, 48165, 62207, 88293, 89972, 68827, 81706, 111983, 117551, 88405, 98321, 74634, 36531, 13318, 21209, 3616, -4194]
9873d194j6798L4563j40o071O295k792J436l1877j5788n415J3981K0464N778J2302
9859A1744n513L34L2114J9028k4592l8510p48J6832j3345J3483M4209K3794k3858
9846E4972j8528m318r939J1212K595L0375n927l3510m8032q870J612N0223P0082
9833I1947K1500j0483k9631j6679k7049O540K413P802J0662k6835p429r954m639
9820H165n159l3300m719L2096L3010M819k6889J2026J8445K3910L7760m460k7386
9807F8318m913J6161R568K8577M3762O9903K4109J4152N522L5394O3114J45755
9795E19422J73705J86775K46834K31058K47289J65978J23239R1217R18p0395j81031
9784A735009k07320k19282k03179j78536j98384j59477j07582o2149n5875o2879
$$ y = [-4194, -20992, 13571, 13431, 7360, 13655, 10863, 12299, -19578, -35366, -40781, -26800, -6336, -558, 11744, 6231, 6565, 38679, 57707, 33115, -5395, -6143, 10689, -2656, 10827, 55036, 78830, 54972, 36444, 32126, 22187, 33399, 35994, 66369, 60442, 26932, -21100, -29970, -28358, 21865, 91947, 113447, 102964, 73333, 56654, 29605, 36145, 38558, 46360, 57022, 30187, 22758, 12804, 8165, 3006, -30294, -35013, -2917, 30093, 34912, 8023, 20049, 38494, 62404, 100164, 95704, 68318, 63405, 79566, 89134, 117711, 161473, 231376, 255485, 269637, 275159, 310553, 373667, 519422, 693127, 879902, 1126736, 1357794, 1605083, 1771061, 1894300, 1985517, 1986435, 1916040, 1735009, 1527689, 1308407, 1105228, 926692, 728308, 568831, 461249, 399100, 343225, 280346]
9774B80346n4622p0106l5324l4008Q20J8840J0136k9743j1904m9711k8830l6628
9762d0734J6980J3203k5063l1004K5339J4036P279J1261q468l6321J094K0671
9750c1727J7803J2697N042q43k3835k5525J367K8786N0523L0403n027k9912l0757
9737a005J830L9712J1337q289q046n477j6042k9995k4080l0015k8930K5324L7835
9724c5841M061L2058J3985l9740k6656M884J8888O494r554j7618K0448m380J0304
9711b2667M141K7659j3033k7588J0454k8405j8847k1456k25L2205J6726M146k5766
9698f2656J1814j7657J130K1772M2065L8248j4898J5273q432k4282j2160k2181
9686c1964k0300L1629J7819J718j1477j7944J466j1939k2293j0739J2002J7364
$$ y = [280346, 225724, 155618, 120294, 86286, 87106, 105946, 116082, 86339, 74435, 24724, -4106, -40734, -23754, -10551, -35614, -66618, -41279, -27243, -19964, -8703, -17171, -53492, -52398, -31727, -13924, -1227, 3815, 2972, -20863, -46388, -45021, -16235, 34288, 64691, 59664, 29752, -1005, 825, 40537, 51874, 43585, 35539, 30062, 14020, -15975, -40055, -70070, -99000, -73676, -35841, -31780, 278, 14263, -25477, -52133, -47249, -28361, -21867, -31421, -49039, -28591, -32971, -22667, -18526, 9133, -3900, -31488, -21034, -49439, -68286, -89742, -89967, -57762, -41036, -36890, -62656, -50842, -68499, -67369, -45597, -3532, 34716, 19818, 35091, 26659, 2377, -9783, -31964, -52264, -20635, -2816, -1098, -12575, -30519, -29053, -40992, -63285, -74024, -62022, -44658]
9674d4658L975j4363j1886K9075N49r060N9753M1628K2908l0908n0216m7997O97
9661e0503J2181J006L8114M965k0910P8763M475n0087l4559L1403M2184k327K0236
9648G4941L8791R0461J71331K63820K78822N2306k89479l13790j64059m9185k4931
9637A29028m4538l2916o800j4030k1864k7674j8130L677k1516M4649K071l1501
9625c9544J7759r43N1263K0616k9061m2644N2130j404k4913P542L843P888j8018
9612D514r227k4032K4980K3190m725q513k8102J0298k7212j5210K4772L4732n751
9599b86J39j2343l3594m998p083K7456p503k0043j0205J143J6823l0687k549L2385
9585e1345K5358J6411j9212j3903k803L105O405O334j155K8858M1178N429O633
$$ y = [-44658, -40683, -55046, -66932, -37857, -37308, -46368, 13385, 55013, 77921, 47013, -3203, -51200, -50503, -38322, -37316, 798, 5763, -15147, 63616, 68091, 18004, -16555, 14848, 57032, 54705, 74941, 113732, 204193, 375524, 639344, 918166, 970472, 680993, 367203, 203144, 153959, 129028, 84490, 51574, 44774, 30744, 8880, -18794, -36924, -33247, -54763, -10114, -8043, -39544, -21785, -22728, 28535, 49151, 20090, -22554, 29576, 28172, 3259, 10801, 14644, 22532, 4514, -4713, -28745, -3765, 19425, 14700, 6187, -21915, -11617, -38829, -54039, -29267, 5465, -286, -147, -12490, -46084, -51082, -58165, -30709, -38212, -58255, -68460, -67317, -50494, -81181, -83730, -51345, -25987, -9576, -28788, -42691, -45494, -42389, -35984, -29650, -30805, -1947, 39231, 44660, 51293]
9572E1293K4001q1001j8692J5172K0638p241l3186J0311K2124o236J059q914J7845
9559G173R940j6829j1782r139p566j2239J0666k9741o855M966j830m131K8274
9546c9093O9156L4862l1570l212k2183o0683l4754k8467N0477O4406K5009J8927
9534D2875r531k2296l538P36n8180j0596o844n577L7772K5132L4390k5134m2574
9521d3365r754L4228J5804m7549J0560M6738r403l1875K172m591J0311L2629j8027
9508a2122L129J1860K7875p463J192m5479k9682m856L1647L5207J831N019p664
9495A0494l888k2051l078R952j9724K6466O716q775j0193p73Q025j718k796R445
9481a898J7868N968K524j3147l5216l3236J7330Q804k9411j3469K3702K9712J1516
$$ y = [51293, 75294, -5707, -24399, -9227, 11411, 4170, -29016, -18705, 3419, -2817, -1758, -10672, 7173, 17113, 284, -11498, -20637, -28203, -40442, -29776, -59517, -66372, -61406, -63236, -67367, -39093, 30063, 64925, 33355, 30143, 7960, -52723, -87477, -115944, -65467, -1061, 23948, 42875, 33344, 11048, 7510, 8246, -49934, -60530, -67374, -72951, -35179, -10047, 24343, -791, -43365, -53119, -18891, -3087, -50636, -40076, 6662, -2741, -34616, -32444, -37035, -26724, 5905, -12122, -8993, 2867, 30742, 23279, 24471, -21008, -50690, -55546, -23899, 11308, 13139, 18158, 10494, 6606, -15445, -18523, -8571, -28295, -1829, 4887, -3888, -14081, -14854, -6829, -8547, -11343, -1898, 15970, 21938, 24462, 11315, -23901, -57137, -39807, -31003, -60414, -73883, -50181, -20469, -8953]
9468h953m5190j016K0338N221L146N332J0572J0230P263j2497j7002k3474j0264
9455e6294k406j9093j5987l77K9322k897j614K4801J6062J4314O352R1k1149M044
9441b4831J8351J8239M8451L192m7439k8520J0657M5999O333k3501j346r329k7875
9428a1619K720j6232m798K4254L5243L3686L141l3277M375J4242k9501m1090K343
9415a6513j6589k9521J3670R000J6372O044K8013j2673l7187k8202K935J846P902
9402e4903N199j1016q776L8072m436n62L3714J9536O229l0510j6025J8383n056
9389a0151L991L599K5443l780l3705k8803j1664K1972K1515j0916l5053k3673
9377h1225q023N2900L4296o837J3633Q293j4908k4814j2909l2781L622J0267l732
$$ y = [-8953, -54143, -55159, -34821, -29600, -26454, -21122, -10550, -320, 6943, -5554, -22556, -46030, -56294, -58700, -77793, -93780, -94157, -64835, -67732, -69346, -44545, -28483, -14169, -7817, -7726, -28875, -24831, -6480, 11759, 60210, 63402, 15963, -12557, -1900, 44099, 50432, 26931, 25585, 16256, -11619, -8899, -25131, -29929, -5675, 29568, 63254, 66395, 33118, 37493, 51735, 22234, -18856, -16513, -33102, -62623, -48953, -39953, -23581, -17537, 10476, -2197, -39384, -67586, -64651, -62805, -54903, -49704, -60720, -69496, -31424, -35860, -36422, -2708, 16828, 23057, -7453, -23478, -5095, -10151, -6160, -2561, 22882, 19102, -14603, -43406, -55070, -33098, -11583, -22499, -57552, -81225, -89248, -36348, -2052, -8889, 4744, 13037, -1871, -26685, -39594, -72375, -68753, -58486, -62218]
9364f2218N36L6413L4049L1139j0384k0317L812m0930J7569L2187J6146J3354
9352E1356l1345k2608k8202k4438K4165M880j226J3341M036L6039O143l819M654
9339C2976m6709m0266k6561J0738K1862K4264j1459J8013m613k1041n5341J1313
9327h6824N3382j1427Q308l003q386o066J0801j108j0108M0072o258l2380l315
9314e6312J4337L2313k62j8245J2191j6778k6390o501N1661L3817m08k9599l641
9301a3817K9341L7672n258l5744m4786R75k5845j7404J5478p633K4473N9832M1395
9288E8679P224l5909j4341j4298K315R031K4840J4967j0314J1315K0372J88k1020
9275E3049l1577q308o695k1054K5046J3922P091J277j1234r037J9496R906j9113
$$ y = [-62218, -61682, -25269, 8780, 39919, 29535, 9218, 13030, -27900, -10331, 21856, 38002, 51356, 20011, -2597, -30799, -55237, -31072, -26192, -27418, -14077, -10041, 25998, 32141, 28322, 32976, -13733, -53999, -80560, -69822, -47960, -23696, -35155, -17142, -21755, -42796, -98137, -86824, -33442, -44869, -36561, -39564, -47950, -54016, -43215, -44323, -54431, -14359, -20617, -52997, -56312, -41975, -9662, -9924, -28169, -15978, -32756, -59146, -65647, -13986, 19831, 19423, -10176, -13817, 15524, 53196, 47938, 12194, -32592, -31617, -57462, -74866, -59388, -67021, -42548, 17284, 58679, 65903, 29994, 15653, 1355, 3670, 12701, 37541, 52508, 42194, 53509, 73881, 74069, 53049, 21472, 13164, 6469, -14585, 10461, 24383, 31474, 32751, 21517, 12480, 31976, 41882, 22769]
9262B2769p231K3932q644m4233j2560K3613O806j7280K4099o129l8907j7164O283
9249d4646M2705J7768j6831j4887j2699R883k308K394L883M4270k149l1726k0606
9236b4949P492J2495K2902k3845J9064K0323k3791K0980j3557k0597L62K0516
9224A7395J9433Q718j4193j4657J0584J5766k2461l9639j9618J2210K4065p106
9212i503k5337l0146K6035Q343J0227J2106K4549m800o777K0149k3458N296n33
9199F151L5684j0350j4802r281j5263j2898J3037K3099L7797o43j6334q912r233
9186A8052J6841K9531k2531k0635k7450j8079L788K2963N634l7457k3128n134
9174e7605J8883M8271k347j9435P6204J3005l4033m8812O753j3720L1418J9898
$$ y = [22769, 15538, 39470, 30826, -13407, -25967, -2354, 4452, -12828, 11271, 5142, -33765, -50929, -44646, -1941, 15827, -1004, -15891, -28590, -18707, -21015, -18621, -14738, 29532, 27383, -4343, -24949, -17457, -4962, 17940, -5905, 13159, 33482, 9691, 30671, 17114, -3483, -3121, 17395, 36828, 45546, 31353, 16696, 27280, 43046, 20585, -19054, -38672, -26462, -2397, -9503, -34840, -64986, -38951, -30608, -20381, -8275, 16274, 11474, 4697, 24846, 1388, 6684, 6151, 41835, 31485, 16683, 7402, -7861, -20759, -7722, 15377, 53174, 52531, 36197, 27285, 18052, 34893, 64424, 41893, 21258, -6192, -24271, -20483, 2480, 8114, -29343, -52471, -57605, -38722, 9549, 7202, -12233, 63971, 76976, 42943, -5869, 884, -12836, 18582, 38480]
9162C8480m841q97L3173J0608l6686n1794J1233J2019R569k0094j3001J4642L3675
9149C6086k1537l1509L646K874J618J6940J9621J2893N696k577j5528n505k4606
9136a888j7429l0743R230L4685L4621O735j660o240j0525j7431J4872J1096j5558
9123I765K295O442K4740q071j2302K6865J6971P567k0771l0921j4197J0195q207
9110A0371m670J0321J8664J9307o010o3903k235K2015J6529M5354n899k485N540
9097F2899j8787J5998k2471m3219K252q11M30K6584n304P432k5777j7638J1092
9084g320J3831K0163k2174j5902J6565k2290j1818K8095L0347k6480j2025m0349
9072d9357k4547J5493L2707K4397j0074o3039j4405N7350L2474r666l2573l4034
$$ y = [38480, 33639, 32742, 65915, 76523, 39837, -11957, -724, 11295, 20864, 770, -12231, 2411, 36086, 14549, -16960, -13314, -10440, -8822, 8118, 27739, 40632, 46328, 43751, 28223, 22718, -1888, -19317, -50060, -40830, -6145, 28476, 35211, 33551, 27311, 16786, -645, 14227, 25323, 9765, 12060, 18502, 43242, 35171, 22869, 49734, 66705, 74272, 53501, 22580, 8383, 18578, 10371, 5701, 16022, 34686, 53993, 47983, -15920, -18155, 3860, 20389, 65743, 59844, 57359, 62899, 44112, 60110, 37639, -5580, -3328, -4139, -3709, 22875, 17571, 25003, -774, -18412, -7320, 6511, 26674, 4500, -11402, 5163, -17127, -28945, -850, 29497, 3017, -9008, -49357, -73904, -58411, -25704, -1307, -11381, -74420, -88825, -31475, 999, -8667, -41240, -75274]
9060g5274J2206M3814J2901m225j3764o685K2640K118n91p137j8761N949R13k4913
9046e0809j6941K5849j0131m170j0454K2550J95J3126K5615N8700J5341k9110
9034C9761m4119j1586K4064j6738J1101n422j431P791o65M3024K5946k326j4513
9021E4887k5826j697j7446J0904K7990N685J4889r306k0886j1261k5042k6547
9009b3656j9149J2064K9139J2184K233M500M1155J0224m1961M816l283k0328R516
8996A7454L1371k1712l6980l0135K5924M1405L3035L6261j610k7150k7825k8137
8984A1901j8837M312J45J5173j02M4721J1511l1693Q938k7230j9146J5358j82
8971A4869j6960l5774L6934N7393J1624J3717k9430l0404j6243o822j6102k0254
$$ y = [-75274, -63068, -19254, -6353, -10578, -24342, -31027, -8387, -6269, -6860, -13997, -32758, -26809, -25896, -50809, -67750, -41901, -52032, -56202, -66656, -44106, -43911, -30785, -5170, 53530, 68871, 39761, -4358, -15944, 8120, -8618, 2483, -2939, -4370, 3421, 2756, 45780, 71726, 69400, 54887, 29061, 27364, 9918, 20822, 48812, 54497, 69386, 60080, 39194, 27933, 2891, -23656, -42805, -30741, -1602, 10582, 12815, 17315, 58470, 68694, 26733, 31549, 28266, 7938, 17454, 48825, 27113, -9867, -40002, -14078, 27327, 60362, 96623, 95013, 67863, 40038, 11901, -6936, -2624, -2479, 12694, 12592, 57313, 68824, 37131, 46069, 18839, -307, 15051, 14869, -2091, -37865, -931, 56462, 68086, 81803, 52373, 21969, 5726, -1096, -17198, -37452]
8959c7452J6688M4080L1234N4746J15237J27079J29438O9890j33624j97376j12180
8948A07760l9869l6329k520J8823J6189j6512n331k5384j7431O98j9432K081k7450
8935d4707r778L8848J592j2202L1031M994l4144j2269k1446q993j6781K4158L4933
8922b4764K0254K92K3754m332O6M3598j304J7556R7477J67514J11837L7317j53949
8909C35316j28994j04129l4754L4551O126m0046l9450j6678L1273L2020k2279
8898E2956l8557K2818l3397k9917K1877K6851J3832J1208L839m038j6978l7682
8886g188k4674o324J2050p72o253J3694J9254J0573j4733K0402L5926L134L829
8873E8918Q833J894o949n655K8794R303l9485j4279q948J0175N2130K9489j1473
$$ y = [-37452, -20764, 23316, 54550, 109296, 224533, 351612, 481050, 550940, 417316, 219940, 107760, 67891, 31562, 29042, 47865, 64054, 47542, 42211, 16827, -604, 94, -19338, -17257, -44707, -54485, -15637, -14045, -26247, 4784, 9778, -24366, -36635, -58081, -67074, -83855, -59697, -24764, -4510, -4218, 19536, 15204, 15270, 58868, 57564, 75120, 172597, 340111, 451948, 489265, 335316, 206322, 102193, 67439, 101990, 108116, 68070, 28620, 11942, 43215, 75235, 52956, 14399, 37217, 3820, -26097, -4220, 22631, 36463, 47671, 51510, 47472, 30494, -7188, -31862, -38186, -26136, -26908, -33161, -19467, -213, 10360, -4373, 16029, 51955, 55089, 58918, 67751, 69645, 62696, 57041, 85835, 95138, 55653, 41374, 32426, 42601, 94731, 124220, 112747]
8860A12747l7042k8764j9130O981j4579K9076K6372l7225l5499j3643j3857o556
8848c1119O459k4140Q222J4635L1452J2047K1073m5K7334O658l9188J5929J8393
8835F7710L666R677P257J2821n0755l4766J186K0978R673k3294j9309n777M419
8822C486P950K4971K5291o120M974r662k3614k8023n278K5399K3248K8537J2008
8809H3167p099k3551j6788M104j250N877k2072L8684K4330R979l3144j4127Q627
8796E6737N222k8884j0209N344K0214J9183L1423m5228j9096K1696j1812n7621
8784a3031O325K3605l082j8404Q930K6632j6134l1964J8049K6157l2729J2980
8772G334K8317J9977k3760Q35N737L395o949L4144j1990P087j7396p790k9555
$$ y = [112747, 75705, 46941, 27811, 34792, 20213, 49289, 75661, 38436, 2937, -10706, -24563, -31119, -24660, -48800, -40578, -25943, 5509, 17556, 38629, 38584, 65918, 72576, 33388, 49317, 67710, 71376, 81053, 88310, 101131, 50376, 15610, 16796, 37774, 47447, 24153, 4844, -933, 3486, 11436, 36407, 61698, 55578, 60552, 50890, 27276, -747, -6025, 19374, 42622, 71159, 83167, 76068, 52517, 35729, 39833, 38583, 44460, 22388, 61072, 85402, 95381, 62237, 48110, 56737, 61959, 33075, 22866, 28210, 48424, 67607, 99030, 53802, 34706, 56402, 44590, -13031, -6706, 16899, 13817, -4587, 4343, 30975, 14841, -17123, 926, 27083, -5646, 7334, 35651, 55628, 31868, 32703, 38440, 41835, 34886, 69030, 57040, 64127, 46731, 38941, 9386]
8759I386n5784j126J9661K5668j6055K4800N662k2479J221P324o201M214L9007
8746C5298N5953l7500j6077L0473j1913N012j842N599r786r569n985j4584l7430
8733a2351J2512l274J4745L2516m3714j1137O3843L7093K3187Q712o2253k2969
8721C6910r567M1721J9001r52n544l6180m693O1663R549n4625j2232K4660K6098
8708I5809L2958J8686K181l0516K2153o212k9315l6410J1678j4019l579J4431
8696G7845P601J1588J3877L217k203r126J7592j2012j3470l5043k9969L7364K3525
8683I0786J668K5955m7285o1380m499M487K4027L1559q553J08K9420k0961k6181
8670C9151K8673J4620j0664M906K3375M113J4213j2168o4671J909M840j2820M3512
$$ y = [9386, -46398, -47524, -27863, -2195, -18250, 6550, 12212, -10267, -9046, -1722, -7923, -3709, 35298, 91251, 53751, 37674, 68147, 56234, 61246, 59404, 65003, 55217, 45648, 39663, 25079, -12351, 161, -3113, 11632, 44148, 434, -10703, 53140, 90233, 113420, 122132, 59879, 36910, 27343, 69064, 88065, 87113, 81569, 45389, 40696, 102359, 111908, 57283, 45051, 69711, 95809, 128767, 147453, 149634, 119118, 141271, 135059, 105744, 69334, 81012, 66993, 63414, 77845, 85446, 97034, 110911, 114128, 111925, 102799, 120391, 108379, 94909, 59866, 29897, 67261, 90786, 92454, 118409, 71124, 9744, 5245, 9732, 33759, 65318, 56765, 56873, 86293, 65332, 39151, 67824, 82444, 71780, 76686, 100061, 104174, 118387, 106219, 41548, 43457, 48297, 35477, 78989]
8657G8989j998j1257J6621J0831K97R653j6584l0174K8815L831M253k3156N750
8644G5871q35J2633j9438L696K351j6268K3940M6028k1992l614J616n564k9276
8631F9148q057Q198l1854J9814J0730J7169M4573J1996K1395j600j7519j6502
8619A27491K6434r874o3466l7229R852P801L9940L0361K0965L3974K4405k4371
8607A86283l1915p278o852K4815j7253k4159R200P903r719K385O079J2829L83
8594A52701n295J7451J5406Q881j4838j5826o432N6576J2163k7203K2106M611
8582B20301k2645q164P741L1810J6064j6864R005K7661N760j9736J971J2960M7066
8569C12930M6307M7034k5462j8241J1996O902L0425J6334J4455j1004k0132l9373
$$ y = [78989, 76991, 65734, 82355, 93186, 93483, 103136, 86552, 56378, 85193, 89024, 93277, 70121, 75871, 75036, 87669, 68231, 71927, 74278, 58010, 81950, 127978, 105986, 102372, 103988, 98424, 69148, 61091, 69289, 37435, 57249, 67979, 85148, 129721, 141717, 163112, 161512, 143993, 127491, 153925, 144051, 80585, 43356, 53208, 61009, 100949, 131310, 152275, 186249, 210654, 186283, 154368, 147090, 140238, 165053, 147800, 123641, 132841, 140744, 131025, 133410, 139489, 152318, 152701, 147406, 164857, 180263, 189144, 174306, 158480, 152048, 208624, 220787, 193584, 215690, 220301, 197656, 189492, 197233, 229043, 245107, 228243, 237248, 264909, 270669, 250933, 252904, 265864, 312930, 359237, 406271, 380809, 362568, 374564, 381466, 411891, 428225, 442680, 431676, 411544, 372171]
8557C72171l1989P836J52k9615m7033k4318J2940j603K3622m0884m2917R693j0186
8544A97869Q051J6108J0253j7832L081m146m894k3875r129o162L118K0207j180
8531A91469K7526r982r782m0031P746L3994K9181m2824m358K6002O860k4716j5543
8518A75542L5840J5415J693J9531R26j4879P870j6793j1210L419m797k2326n0473
8505A39758L204K6888N045M835j4543j0272r172L1347n268l2213J5442O353k4211
8492A37193L426K9597J2521p025R137m415q01l6406M3758J5317k3230N806j1430
8479A73448J7880k1155k722L140n147J6601M060J6341J7752k788k356j4555j092
8466A99407j1375r995J9568j6616j3021L0522Q251J5215r020Q467K4281m6463
$$ y = [372171, 340182, 348018, 348170, 318555, 271522, 247204, 260144, 258541, 282163, 241279, 198362, 208055, 197869, 205920, 222028, 232281, 214449, 217530, 213384, 208490, 184615, 175486, 169324, 172442, 192649, 191469, 218995, 209013, 199231, 159200, 166946, 200940, 230121, 187297, 182939, 208941, 215801, 191085, 175542, 211382, 226797, 228490, 248021, 248947, 234068, 241938, 225145, 213935, 217354, 212557, 190231, 139758, 142962, 169850, 174895, 179730, 165187, 154915, 145743, 177090, 171822, 139609, 155051, 161404, 137193, 140619, 170216, 182737, 175712, 184849, 180434, 179633, 143227, 186985, 202302, 179072, 184878, 173448, 191328, 170173, 167451, 170591, 165444, 182045, 186105, 202446, 220198, 217410, 215054, 200499, 199407, 188032, 178037, 197605, 180989, 167968, 198490, 206741, 221956, 212936, 221403, 245684, 199221]
8454A99221k8407j0867J6868L0277J6240l462l5584k1099R095O7863K1286k4493
8442B36938l4267q069J0602k0134j4959l2658j0550J6354M2965q98j3287Q923
8430A80960j0859L0042M602j0543l8085K5548M4424K9949n388L6492j1159k030
8418B73953k4267p5690k4223K3609k0632j0580p896J3193J5940J9129k2893k3829
8406A35814M691j208n44P924o341n15o87k260k0160l0398j1388j3731o564N4465
8392A09098L3664j1199Q236J7416q347j3260j3957l802K2677Q991o222r894k615
8379A30786K3147J9358k2039P349J7101j4426l6126k771J3187l261j9702K4110
8367A36713L6069J384j9839R180R098J3574j3608j0840R24m858L2410j2657k7927
$$ y = [199221, 170814, 159947, 176815, 207092, 223332, 219870, 184286, 163187, 172282, 240145, 261431, 236938, 202671, 194602, 205204, 185070, 170111, 137453, 126903, 143257, 186222, 185324, 172037, 180960, 170101, 200143, 204745, 194202, 156117, 181665, 226089, 256038, 250650, 287142, 275983, 273953, 249686, 173996, 149773, 173382, 152750, 142170, 134274, 147467, 163407, 182536, 159643, 135814, 140505, 139297, 138753, 146677, 140336, 139821, 139134, 136874, 116714, 86316, 74928, 61197, 54633, 109098, 142762, 131563, 139799, 157215, 148868, 135608, 121651, 117849, 140526, 149517, 143295, 133401, 130786, 153933, 173291, 151252, 158601, 175702, 161276, 125150, 122379, 135566, 132305, 112603, 136713, 172782, 174166, 154327, 163507, 172605, 186179, 172571, 161731, 162655, 157797, 190207, 177550, 149623]
8354A49623k3477r654J0565J7402j5071l1432l4179k583M3550P221K6467m1638
8342I6794K983j1394l4769L9180M6991l6417k1353L6459N979J861k621K3968R876
8329A57537l3474j3246k125K607j6420k6445j5292j0668K3658J4225L4734J1906
8317A26997q206r017k9521J0943K0540o34N902J7911L7560J0273l4240j6465J1401
8304A43444L4998P730j5865o9384l9054J0318o375M50P6858N9917k0771k6090
8292A56176M515k5865j0295J4241K8021R971j8047k3846O197K4896L1477P3125
8280B70566J02304Q6899J79900L52459M68143L63424k38901n95780l81313j73662
8270D34039j09025m8404m906o207n2557k8545K5952J2530J4448k4586j1445k3910
$$ y = [149623, 126146, 116492, 127057, 144459, 129388, 97956, 63777, 61194, 104744, 111965, 138432, 96794, 99777, 88383, 53614, 92794, 139785, 103368, 82015, 118474, 124453, 126314, 123693, 147661, 157537, 124063, 110817, 108692, 111299, 94879, 68434, 53142, 42474, 66132, 80357, 115091, 126997, 118791, 109774, 80253, 91196, 111736, 111102, 117004, 134915, 172475, 182748, 148508, 132043, 143444, 178442, 186172, 170307, 100923, 61869, 72187, 65812, 66262, 143120, 203037, 182266, 156176, 160691, 134826, 124531, 138772, 166793, 176764, 158717, 134871, 141068, 165964, 197441, 270566, 372870, 459769, 639669, 992128, 1460271, 1823695, 1584794, 989014, 607701, 434039, 325014, 276610, 271704, 265497, 212940, 184395, 210347, 222877, 237325, 212739, 201294, 177384]
8258A77384j2471j568k8462j3473q508J8512j8182q361k2135J993M0490L7845
8246A63064K3584l09K3294L4134P4635R6365J55171K35005L78861M52209K10558
8235A846571m16220n58234l00845j57892j08064p3966j7623m8878j5764l6462
8225A12623j7836l1299J2048j8625K4185M4250n333l3324k4126j795l945j2158
8213D4665k023K3251L2154j4406l966Q579J0648K999j2233K8862l2591l3745J4039
8200F6233K0736k4448J2261k7092L1149L2488P880k0369o8078j4298J8220L53
8188C5035K5572L3458K7857j1303R140k4351k8871K4969M616L84R463K094q910
8175I9153k5634J3890M5983J8513K3673R872l2311l1978j1448J3206l3254k7579
$$ y = [177384, 164913, 163345, 134883, 121410, 112902, 131414, 113232, 104871, 82736, 84729, 125219, 163064, 186648, 186339, 209633, 243767, 318402, 414767, 569938, 804943, 1183804, 1636013, 1846571, 1430351, 872117, 571272, 413380, 305316, 231350, 213727, 164849, 149085, 112623, 94787, 63488, 75536, 56911, 81096, 125346, 120013, 86689, 62563, 60768, 56823, 44665, 42642, 65893, 98047, 83641, 79675, 88254, 98902, 101901, 89668, 118530, 85939, 52194, 66233, 86969, 62521, 74782, 47690, 78839, 111327, 119207, 98838, 30760, 16462, 34682, 35035, 60607, 94065, 121922, 110619, 119759, 95408, 66537, 91506, 96122, 96506, 105969, 108063, 99153, 73519, 87409, 133392, 151905, 175578, 185450, 153139, 121161, 109713, 122919, 89665, 62086]
8163F2086P637K3867j1023n760J3471j7626j524K331k353j9193n835O005L6020
8150H8103L0870J6949j8205m2020k4997M423P252L4520p13j4100o547j3070J027
8137F3492N28j1939L4853R930l310k2280J2725o907p4J5946K3207j2152j1129
8124I2890L7008P104Q192j7862j2877J4788N982l4529k8812j0527J5347J0565
8112H7269m3517m7130J4734J9208J3903j0249k2226J7874j4315O937K3343K3809
8100F9640J3356M6782l6401m2774j5925j0331n118j1845N76n903k3912N3204n3
8087C1296J252O3620l2869j9879r513K8526L4669M218l5104k0778j6024k2535
8075F879l3656r844M727J3169j360N1884K7203j2646L377r506O475J9017M99p001
$$ y = [62086, 69723, 93590, 82567, 76807, 90278, 72652, 71128, 73459, 71106, 51913, 46078, 52083, 88103, 118973, 135922, 117717, 75697, 50700, 55123, 62375, 96895, 96182, 82082, 75535, 62465, 63492, 64020, 52081, 86934, 96864, 93554, 71274, 83999, 77092, 77018, 92964, 116171, 104019, 92890, 129898, 137002, 145194, 127332, 114455, 129243, 135225, 100696, 71884, 61357, 76704, 87269, 43752, -3378, 11356, 30564, 44467, 34218, 11992, 29866, 15551, 22488, 45831, 69640, 82996, 129778, 93377, 50603, 34678, 24347, 19229, 7384, 7960, 2057, -21855, 31349, 31296, 32548, 96168, 63299, 43420, 33907, 62433, 97102, 101320, 66216, 45438, 29414, 6879, -26777, -36621, -31894, -18725, -20085, 31799, 59002, 46356, 49733, 40227, 46702, 65719, 66218, 59217]
8061E9217j8842k2703j177k5486k1190k5366J1662O3566N3025Q910j3265J3238
8049H1589o497k4985l4380J5758Q122P472j3439o419j4280k70J3404K5980L3273
8036H5328j0562l77k4958k2421K7795j0257l26m193r889K0651R811K5368J773
8023H7743L325J8818J974j5091j8636j4464q721j3079R839K6972N6156r693K371
8010A27514J9183L030m6372k3463M2086r29k1570j0421K196J5304k940m998l0368
7997F8252J809K4825K4570n715m1614k4917K0949M916j5460J2144L6812q379p199
7984I0993J6679j4473J2435M0436j0782k062j8497l6021k2730j6623j19K4833
7972F4069K7262K0626K5941J5654n466l343k4974o5k1834O062J1290j0054J6071
$$ y = [59217, 40375, 17672, 16495, -8991, -30181, -55547, -43885, 19681, 72706, 81616, 68351, 81589, 75092, 50107, 15727, 31485, 39607, 47079, 33640, 27221, 12941, 12671, 26075, 52055, 85328, 74766, 74389, 49431, 27010, 54805, 44548, 44222, 40029, 30140, 50791, 60602, 85970, 87743, 91068, 109886, 111860, 96769, 78133, 63669, 54948, 41869, 51708, 78680, 134836, 125143, 127514, 146697, 149727, 103355, 79892, 121978, 121049, 99479, 89058, 91254, 106558, 103618, 98620, 68252, 70061, 94886, 119456, 113741, 72127, 47210, 68159, 73075, 57615, 69759, 106571, 98192, 90993, 107672, 93199, 105634, 146070, 135288, 133226, 114729, 78708, 55978, 39355, 39236, 64069, 91331, 111957, 137898, 153552, 148086, 144743, 119769, 119704, 97870, 103932, 115222, 105168, 121239]
7959A21239n560K6590k4462k1199K4084k7532m3027p542L0778J0619O321L4242
7947A24551l5362p5506J4401K1095K5740K5944J8913K3752J5264o86p400n248
7935A45458k960k9550J0974j2801j6825k07K4703L2988K022N832j0744r654K006
7922A41242k5186J0157l9089k2261j2971M392L474K6519m734m229R862q929k9309
7909D8938l7746o521M6616K6864j3088o602M222K0259k1459m751l3190J8418J5310
7896E7270L4891j0822k5186K1706k4077j6005k7040j0066L174K3875L3678K5924
7884H7322k1274j5685J1350J6529k4744m401j1659l850M906L3841J8992k3813
7872F7514j4273K8259J3112m091j5539K2976L8620j5064k6005j638l196k6325
$$ y = [121239, 115679, 142269, 117807, 96608, 120692, 93160, 50133, 42591, 73369, 83988, 90309, 124551, 89189, 13683, 28084, 49179, 74919, 100863, 119776, 143528, 158792, 158106, 150706, 145458, 142498, 112948, 123922, 111121, 94296, 94089, 118792, 151780, 153802, 159634, 148890, 139236, 141242, 116056, 126213, 87124, 64863, 51892, 56284, 59758, 86277, 81543, 77314, 87176, 78247, 48938, 11192, 4671, 51287, 78151, 65063, 58461, 62683, 82942, 61483, 56732, 23542, 41960, 57270, 92161, 81339, 56153, 77859, 53782, 37777, 10737, 671, 3845, 27720, 61398, 87322, 66048, 50363, 61713, 78242, 53498, 49097, 37438, 33588, 38494, 72335, 91327, 67514, 53241, 81500, 94612, 90521, 74982, 97958, 136578, 121514, 95509, 93871, 90675, 64350]
7860F4350J9930j6848M2540K5006M383O459O637k141l529q258j3173K289j7668
7847A09977l4908j2211K9477J3684q712K6125k5529p24n044n734L2593P070m6149
7834G9915K5558O2976p371j2381j3106l6987n8550m174N6285M870j5807k5818
7822E5410J0207O419o079j4882j1177J1760N2451j2257m4971J1549K2572j5267
7810F5735k0025r723K1007J5225j227M0352J484k1524K912Q229j0432P658n721
7797I3950J312j6444k9810k4382j6960L479O1R845L8513L7468p496k7941m1453
7784B0142j9292N6173J5818k6567K1521L0272J1570L377j3524j8849j2094o078
7772F2469j7601j7780O29R812L5522J7470K0244o1168K9155O171m9750l2099o955
$$ y = [64350, 84280, 67432, 109972, 134978, 139361, 145820, 152457, 150316, 146787, 138529, 125356, 127645, 109977, 75069, 62858, 92335, 106019, 97307, 123432, 97903, 97179, 92135, 86401, 118994, 126064, 79915, 105473, 168449, 161078, 148697, 135591, 98604, 40054, 35880, 92165, 97035, 81228, 55410, 65617, 72036, 65957, 51075, 39898, 51658, 104109, 91852, 46881, 58430, 81002, 65735, 45710, 35987, 56994, 72219, 70992, 111344, 112828, 91304, 94216, 102445, 92013, 99671, 93950, 95262, 78818, 49008, 24626, 7666, 11145, 11206, 21051, 59564, 97032, 89536, 61595, 20142, 850, 57023, 72841, 46274, 67795, 98067, 109637, 113014, 99490, 80641, 68547, 62469, 44868, 27088, 27717, 37529, 73051, 90521, 110765, 49597, 78752, 84923, 35173, 3074, -3881]
7759c881K3667L8995k4539P237L537m348j8840Q444r750o555n028J6060J7571
7746D2570k18k7807j5200J4905m0346K224L7317L0718R739L5754r891k9148J7326
7733F7943j2274j0277k8622l7627J9134J1405J4503J1497R029J0148J0943j3031
7721E2771n4066k6141K2283P898K5012N697Q373L0137Q983J4998J1049m5248l1819
7708B9927m4470l2285J8516J2732k1355L6171J4050K647L2657J9132l3816o7846
7696c3940R341L9985M8667L898R875l922l1845j298k3652j6589J6440N3345L6253
7683A06558k6635n5872l1176K8918J087j4586O560J0037O844L8641M257n2437
7671B2196J3403M5608Q558k9160K60k4356m7083k5683m4539J4127N0180L4139
$$ y = [-3881, 19786, 58781, 34242, 41479, 45016, 40668, 21828, 30272, 20522, 13967, 8939, 24999, 42570, 42352, 14545, -655, 14250, -26096, -23872, 13445, 44163, 53902, 89656, 79765, 50617, 67943, 55669, 45392, 16770, -20857, -1723, 9682, 24185, 35682, 44711, 54859, 65802, 52771, -1295, -27436, -5153, 2745, 27757, 33454, 41827, 71964, 80947, 95945, 106994, 61746, 29927, -14543, -46828, -28312, -15580, -36935, -764, 13286, 15933, 48590, 67722, 33906, -33940, -24599, 15386, 64053, 67951, 77826, 73904, 42059, 40761, 17109, 520, 16960, 70305, 106558, 79923, 24051, -7125, 21793, 22880, 8294, 14854, 24891, 31735, 70376, 74633, 22196, 35599, 81207, 89765, 60605, 60865, 36509, -10574, -36257, -80796, -66669, -16489, 17650]
7659A7650L0722j3457m7952N498J5606j0883m874J8875M256j0064K910N63p184
7646A666L092N2K0473K2412m6793m9196K2628P476J0106O709r837j6012Q056N227
7632a3941k836p031J6777j4599K2115k2453j9144K6540L8358j468k7572j3701
7620a8955K5227k114m0689R775J3852q119M267K7153M356K6292j3659l2821j1293
7607a6728N8532k5200k0492K6136O1519n175j7527r2026n0820J3016O063J3705
7595d8997k5584K7950J7017k6943r538M4662L1752J2929J2525m5718m1089L3539
7583a7495L8525J8593k3271p793L3633K1632j2009k4411o7637O400N4073M6437
7571F6677K0281l5205m2093k5117J8588O088j3608J6751q614L948j2018J6619
$$ y = [17650, 48372, 34915, -13037, -7539, 8067, -2816, -7690, 11185, 15441, 5377, 8287, 8850, 1666, 4758, 4810, 25283, 47695, 902, -48294, -25666, -18190, -8084, -1375, -11212, -27224, -19168, -13941, -16777, -23808, -7031, -21630, 485, -21968, -41112, -14572, 23786, 22318, -5254, -18955, 6272, 4158, -36531, -26756, -12904, -21023, -16756, 10397, 14753, 41045, 27386, -5435, -16728, 41804, 16604, -3888, 22248, 83767, 78592, 61065, -30961, -81781, -68765, -62702, -48997, -74581, -46631, -29614, -56557, -66095, -21433, 10319, 23248, 35773, -9945, -51034, -17495, 21030, 39623, 16352, 8559, 42192, 63824, 51815, 27404, -40233, -33833, 20240, 66677, 86958, 51753, 9660, -15457, 3131, 9219, -4389, 12362, 3748, 7696, -4322, 12297]
7559A2297L376j7531J8537j2456n4012Q57K7174k3747J1084K7167k5815k2288
7547e5357M3483K6114k859J2374O446r552m5943l6300P906K6318K6355M2647j3213
7534B8419L714k187K8353m855o907P774k6278m2584p563J0276J1225J8848J0309
7521B8544n2556k6913J1272M0504o215o262j920j2227j8728k4570K817K0421L1256
7508a4577K0150k6560j064J9452j4330J2488L1468l1945j2526l561J0599K6137
7496A5731j6465K706K896l379J2514L4510M137k3892j3470J1952l3198k8300K64
7483c3994m138p485M787J6710J3709K0970J3952L6611j1464o659k5416j2052M97
7470F028j199J2128J6108k1035M2655j1029m3932k0847l3756p816J9580M1062
$$ y = [12297, 15673, -1858, 16679, 4223, -49789, -48932, -21758, -45505, -34421, -7254, -33069, -55357, -11874, 14240, 11381, 23755, 30201, 20649, -25294, -61594, -53688, -27370, -1015, 41632, 28419, 32133, 29946, 58299, 53444, 46537, 54311, 28033, -14551, -22114, -11838, -613, 18235, 28544, -24012, -50925, -39653, 851, -5364, -11626, -13546, -25773, -44501, -69071, -66254, -45833, -14577, 5573, -20987, -22051, -2599, -16929, -4441, 27027, -4918, -17444, -21005, -10406, 15731, -734, 1972, 4868, 1489, 14003, 48513, 52650, 28758, 15288, 27240, -5958, -34258, -33994, -38132, -45617, -40830, -24120, -10411, 10559, 24511, 61122, 49658, 42999, 17583, 5531, 6028, 4829, 16957, 33065, 12030, 54685, 43656, -276, -21123, -54879, -62695, -43115, -2053]
7458b053J573r091J9458J5490M895k3807k5114L524M0814J4403j0211n6903l0261
7445e7283j7603l2777J7472K9178L2572k450J5355J9555j2175k6235O881l5617
7433f3127J4309N2035L0560q406o713J2093N061l3723K3080L0434j6931k1514
7421A7158j5717m671j6998J5233r156k701J8962K4359k8823k2465r62k419K0818
7408g382K1311L9945O815j6218r270n952j7967j9594k0784J783K4964n550n889
7395a3788K8816M293n065K657j033R119J0754M9331L2631l3562q5833l5160Q337
7382b8503l413m834N2385L3431K2564K859k5425m8266l550L5487l801k9923k0668
7369b1657j8537L7817J3421j1534n104P254J6512K6194j6219k0794l2105p39J9254
$$ y = [-2053, -480, -9571, 9887, 25377, 30272, 6465, -18649, -15125, 25689, 40092, 29881, -27022, -57283, -74886, -107663, -90191, -61013, -28441, -30891, -15536, 4019, -8156, -34391, -27510, -63127, -48818, 3217, 33777, 25371, 18658, 30751, 35812, 2089, 25169, 55603, 38672, 17158, 1441, -3230, -20228, -4995, -14151, -16852, 2110, 26469, -2354, -24819, -25781, -28200, -7382, 13929, 53874, 60689, 44471, 35201, 29249, 11282, -8312, -29096, -27313, -2349, -7899, -13788, 15028, 19321, 14256, 16913, 15880, 24999, 35753, 85084, 117715, 84153, -1680, -36840, -28503, -31916, -36750, 15635, 49066, 71630, 74489, 49064, 798, -2752, 32735, 28934, -989, -21657, -40194, -2377, 11044, -490, -5594, 1660, 18172, 44366, 28147, 7353, -24752, -25491, -6237]
7356f237m580O376j388p980k1815m891J7449K5640K5213j6459k2140l7697K0927
7343b7582J9049K7304K6811K4389r498k5398l1344p67J0560p345M0094j485j8175
7330B6613p428n0310J5982n913j1951M6607L5368j5470l3089r026k304R481j1807
7317a3247m4002J4857k1030k0736L0407O198j7601J3069L3259j1005M541M9945
7305B4655J8403l7976N56L2480J0598j1270j9843o719j5029O449J5123M904J0175
7292C2506k2626n2135M4525M4406k1794N745K8519j8498k3440j2106j6603J5722
7280D221K8210P461l1782j9688O155K0088q425J3536L9898J4449k5834m1760O812
7267A3341M42k8696l0095K0163K2130J5700k4058j1759O047P238N333J6004j1435
$$ y = [-6237, -10817, -4441, -5829, -13809, -35624, -40515, -23066, 2574, 27787, 11328, -10812, -48509, -27582, -8533, 18771, 45582, 69971, 60473, 35075, 3731, 2964, 13524, 6179, 46273, 44788, 26613, 19185, -31125, -15143, -21056, -33007, 13600, 48968, 33498, 409, -8617, -10921, -1440, -13247, -57249, -42392, -63422, -84158, -53751, -47553, -65154, -52085, -18826, -29831, -25290, 24655, 43058, 5082, 5638, 38118, 48716, 37446, 17603, 10884, -4145, 2304, 17427, 22331, 32506, 9880, -42255, 2270, 46676, 24882, 30627, 59146, 40648, 17208, 5102, -11501, 4221, 32431, 39892, 8110, -11578, -5423, 14665, 6240, 19776, 59674, 74123, 48289, 6529, 13341, 13783, -14913, -45008, -24845, -2715, 12985, -11073, -22832, -16785, -9547, -4214, 11790, 355]
7254C55N074L6134M9801K8021r5180l3936N8885K3372m8326j6263J7112l0659
7242e610O392N462l5239J553r170L3787R585m3470l0565L400K1568J2377M815
7229b5115L8525L5511J4029J4749j0223l8053k1536N046Q303k3351k4728J4515
7217a2328K6913J8898k2132P253j9790l8514J4230K3121n970o9243o7422L1537
7205a13447M7420N824K8059K2082K8288l1882k7033k5727q772L83K5810L9449
7193i546J3662J4761o5o993R465J2820l6380J4777k932j0621K0674J553m3041
7180b1866J3697j01k2603Q816K2446p556k1414K098o984R651Q628N160K0482j0916
7166d62m9556K1262L6819o455p326k3088k9762N595L2808p041J4068O504j0009
$$ y = [355, 5429, 41563, 91364, 119385, 24205, -9731, 49154, 72526, 24200, 7937, 25049, -5610, 782, 6244, -28995, -27442, -36612, -2825, 6760, -36710, -67275, -63875, -42307, -29930, -25115, 13410, 48921, 62950, 77699, 67476, 29423, 7887, 12933, 21236, -2115, -26843, -12328, 14585, 33483, 11351, 18604, -1186, -39700, -25470, -2349, -8319, -77562, -144984, -113447, -66027, -60203, -32144, -10062, 18226, -13656, -40689, -66416, -75188, -74805, -48995, -9546, 4116, 18877, 18812, 11819, 21284, 34104, -2276, 12501, 9569, -1052, 19622, 21175, -21866, -8169, -8270, -30873, -22057, 389, -7167, -28581, -26483, -33467, -23816, -15188, -10028, 10454, -462, -50018, -28756, 8063, 1608, -5718, -28806, -58568, -52973, -20165, -27206, -13138, -6634, -16643]
7153a6643J6651m55j4427P89k8722j9989J728L1587J2525L3153L3208k731m9800
7140c126j2480k2301R655J0392j9377R097j5279m6712M490J3051K6871J5937K8671
7127a111p044k8524q537p988M0957L6363l9523j8706j6257j3560K5082N246p071
7114d0673j7958K8170J3162j3957L8247L1723M109l4334m2282J1822K8349K7865
7102C4243j1558k7645q3j9383n707l462k8733k12L4739K6691l9844n884L1156
7089a5682K9038J2736J9637j0272j0358k5994J2567K4235j3882m3796J3364K7420
7077A9013n515l7521P345M430k045k2001J3754K1977j8589J2794N8948M2354P075
7064A02019k8545k1466r365k6430l122k0619l264Q014n3517P239N5651k84j5579
$$ y = [-16643, 8, -447, -14874, -14085, -42807, -62796, -61068, -29481, -16956, 16197, 49405, 46674, -3126, -15606, -37907, -28252, -17860, -37237, -28140, -43419, -90131, -85641, -72590, -45719, -29782, -1111, -8155, -36679, -45216, -53204, -12247, 24116, -15407, -34113, -50370, -63930, -38848, -33602, -40673, -58631, -30461, -17299, -31256, 6991, 38714, 42823, 8489, -33793, -21971, 6378, 34243, 22685, -4960, -5043, -24426, -30133, -33595, -62328, -62540, -27801, -1110, -40954, -46838, -15682, 13356, 26092, 45729, 35457, 25099, -895, 11672, 35907, 22025, -21771, -8407, 19013, 13498, -24023, -16678, -12248, -14293, -36294, -22540, -563, -19152, -6358, 52590, 94944, 102019, 73474, 52008, 42643, 16213, 13091, -7528, -10792, -2778, -56295, -49056, 6595, 6311, -9268]
7051i268k179p734m860L8291K5256Q367k5643l5994m4655j8147K7703J1487J7616
7038a9760N112q728q588R524K0158k7247j7806j9270J8396k8900j3593K8739P48
7025f1215m091k0881M23J6385L8571M2677k7856k3162K251L094L3115j3720N323
7012i086R334n293K5742l3473k9668O886L3550K0933k2082J172J3385l0471K625
6999a6446m222k7344n730o639o320J6130j4867J4804K7783L5062l0112j5646L3387
6986a60J3441j8113l7544n0508j1887M4531J8495J1243o239J3461K8483J3069
6974A8272m2708l3058J2724J9716k4652J6567M1481k4604l2699m393K3605O893
6962b2856Q510k3230J4179K1968l0067J9545j4701l0699k714J5107L5396K0496
$$ y = [-9268, -11447, -19181, -24041, 14250, 39506, 47873, 22230, -13764, -58419, -76566, -48863, -37376, -19760, -14648, -23376, -31964, -22440, -2282, -29529, -47335, -66605, -48209, -77109, -90702, -61963, -61215, -65306, -86187, -85764, -69379, -30808, 11869, -15987, -39149, -36898, -33804, -689, -14409, -9086, 248, -5045, 20697, -12776, -42444, -35558, -2008, 18925, -3157, -1985, 11400, -19071, -16446, -20668, -48012, -53742, -60381, -66701, -50571, -65438, -50634, -22851, 12211, -17901, -33547, -160, 13281, -4832, -42376, -92884, -104771, -60240, -41745, -30502, -36741, -23280, 5203, 18272, -24436, -57494, -44770, -25054, -49706, -33139, 8342, -16262, -48961, -53354, -29749, -22856, -14346, -37576, -23397, -1429, -31496, -11951, -26652, -57351, -60065, -44958, -9562, 10934]
6950A0934j8998m715J1492J5126k0628l025j2860J8661r653p921k1041J1320J0525
6937b0783N2388L1859j1292k3561k0998j0031k1073J6084Q719k8100K8698K8967
6925C0877K3038l8798m4049j3229J9074M6035j9264n4349J416N579j6587R527
6913e0730J1648L0895R667l0818j4267K4591L1252j9145L3787m287k6437r042
6901a2886k5838K4620J9472j6857J7519M951j9424k8362r360Q297k1375J0588
6889d8655M201j4080m946m84M4116J7225j8667o818J7419n381p124J1746R058
6876b390j2663k1441j2428o518P013K5580J4624J1548Q345k4922j1710o870m565
6863c6397O619L1053J6881k2264j395p690J1498K0339M679j1873k6258j0259Q740
$$ y = [10934, -8064, -12779, -1287, 13839, -6789, -9814, -22674, -4013, -13666, -21587, -42628, -31308, -20783, 31605, 63464, 52172, 28611, 7613, -2418, -23491, -7407, 1312, -26788, 1910, 30877, 53915, 15117, -28932, -42161, -23087, 22948, 3684, -50665, -49249, -43670, -60257, -50730, -39082, -8187, 1480, -29338, -43605, -19014, 12238, -6907, 26880, 22593, -3844, -12886, -38724, -14104, 5368, -11489, 6030, 10981, -8443, -36805, -46165, -37868, -59243, -48655, -44454, -58534, -63480, -63964, -19848, -2623, -21290, -28108, -10689, -16070, -23194, -11448, -2390, -15053, -36494, -48922, -55440, -48427, -22847, -8223, 3325, 11670, -13252, -24962, -31832, -36397, -29778, 1275, 18156, -4108, -5503, -13193, -1695, 18644, 23323, 11450, -14808, -25067, -16327]
6850a6327m669l2577m515p239q647J4266j1971K6101Q869J835j6923L2904L6244
6837A7351L895J5890k4460k0422o994j0084J5002L048j3556J6955k1759m2473
6825f7607L3488M4867n3663l971N784n910k6666L8529O5933M365k5555j1431K8187
6812B6350M031J578R410l2490l953n2542k1470M6899L4224m083j3788k9059K0121
6799a4772n525l1661P323N6138L2672k5575k2970J4643L226l3899k2752j538M67
6786d4223K0663K7851L2570J5119j6127m9024N113J5590p833o549J8836M1732
6774E3718M434l3037k3514j5807O895j9096j583J2447J4465J278o964Q588n704
6761c880l1186j3061O386j355L215K9707q124q230j426L3483j852k4038j4649
$$ y = [-16327, -20996, -53573, -58088, -65327, -73974, -59708, -71679, -45578, -36709, -34874, -51797, -18893, 17351, 21246, 37136, 12676, -7746, -14740, -24824, -9822, -6774, -20330, -3375, -25134, -67607, -34119, 10748, -42915, -46886, -41102, -47012, -73678, -35149, 30784, 35149, 9594, -1837, 26350, 30381, 31959, 41369, 8879, 4926, -47616, -69086, -22187, 12037, 7954, -5834, -34893, -14772, -20297, -51958, -44635, 11503, 44175, 18600, -4370, 10273, 13499, -20400, -43152, -44690, -44223, -23560, 4291, 36861, 51980, 35853, -13171, -8058, 7532, -301, -6850, 11986, 53718, 58152, 25115, 1601, -14206, -7311, -26407, -27990, -15543, -1078, 200, -6764, 1824, -3880, -35066, -48127, -41741, -43096, -39881, -10174, -18298, -26528, -27954, 5529, 3677, -20361, -35010]
6748c5010j202j7179N015L1715K3516J2831L3854K732k0320l4417J0323K1245
6736C3103j4164m7394k1585L4012K7115L44k2450j965q195Q237J4120k0358k070
6723b1250M1965m29j6615j5772j7024q382L107J3425j1023J7750j0547Q504Q512
6710g779J3642J6349l8303k3810k44K5224j4527j166K2030l381K2249J1647j4558
6697G373K9130R748j1476k2013J4646J669K0338J5181K1286J3692j4894o9015
6685A5665j5086N7334j2628l1339l4664L7532M0107j3513p841k777m316p868K0050
6672D0656O033k8452l2751n204K3135J0964J850p772l5771r181O1181J5563m1276
6659a025J1871l178p801l4437K5713l160j2723J1148k692n60K2266k3556r594
$$ y = [-35010, -36212, -53391, -48376, -16661, 6855, 19686, 53540, 56272, 35952, 1535, 11858, 33103, 18939, -28455, -50040, -16028, 11087, 11431, -11019, -12984, -21179, -12942, 1178, -19180, -21250, 20715, 20286, 3671, -12101, -29125, -37507, -34400, -20975, -31998, -14248, -24795, -16291, -7779, 5863, 22212, -16091, -39901, -40145, -14921, -29448, -30614, -8584, -11965, 10284, 21931, 7373, 36503, 46251, 34775, 12762, 27408, 29077, 49415, 64596, 85882, 99574, 84680, 15665, 579, 57913, 45285, 13946, -20718, 16814, 56921, 43408, 35567, 32790, 28474, 20606, 40656, 46689, 18237, -14514, -19718, 3417, 14381, 16231, 8459, -27312, -36493, 24688, 40251, -1025, 10846, 7668, -133, -34570, -8857, -12017, -24740, -13592, -16284, -16844, 5422, -18134, -27728]
6646b7728n570L17K2822N0083P001j7753q811M265p835P242j8088P806n945p702
6632A04k552J402k1935n289j4072J6360k2834J844K4508j2375j2207k547K2116
6619b7477J798o028O959J3214J3732k2327J8613n6657m126j5226J392M3130L3749
6606G46J073m8180l7490N435P5879K2130k0548J1322J8784J3131k8691J0157J3499
6593C7247J7960k8313m9128R065O1349L667j6365j9239l1629j1970O2081K8335
6581F3060J6303m2675m3556j7691J202Q521m204j0335j5929j9796M186L8506R246
6568a3162j0420j7893L039k633M8958O336j3059P899L6641o763J447r497K0889
6555E1782J6488l7490k3120L4194J8735l0162k8928j0012j7158j6970L988j374
$$ y = [-27728, -33298, -32981, -10159, 39924, 46925, 29172, 20361, 24626, 16791, 24033, 5945, 13751, 7806, 104, -2448, -1046, -22981, -28270, -42342, -25982, -48816, -46972, -22464, -34839, -47046, -49593, -27477, -25679, -31707, -24748, -11534, 2198, -20129, -1516, -58173, -62299, -77525, -76133, -33003, 746, 1819, -46361, -83851, -78416, -2537, 19593, -955, 10367, 29151, 42282, 13591, 23748, 37247, 55207, 26894, -22234, -13169, 48180, 51847, 35482, 16243, -15386, -27356, 34725, 63060, 79363, 36688, -6868, -24559, -23357, -14836, -19040, -29375, -45304, -65100, -60914, -22408, -13162, -23582, -41475, -38436, -41069, 7889, 14225, 1166, 9065, 45706, 38943, 40390, 30893, 51782, 68270, 30780, 7660, 41854, 60589, 30427, 1499, -8513, -25671, -42641, -38653, -40027]
6543d0027j381K9785J5334M6465l049j068k5096l0337j4454k9781J4409M3369
6531D169P854k3611k0596J1623K953j7079q543L2517L064J055J0995Q896l2782
6518a9485m5992R232M8332k467J4466j3188J4668J1320k6922j8183J3986j2011
6506b6244M3256j1981o018M1303J4182P836j8273j6871j2530K130j4473l0672
6494b8355j1241M0623J2814k1001r913l797r855K5038l126J2867M1639j8309O299
6481C3683l0981m1437k976K1841L0392J0540l3896j1657L4087J5774q126j716
6469A5528K7509j7553K2523J411K0596J7387n9075o6083K1438J7996k5744l851
6457b7918n565j240L7044K2336l775j3143k0419k1097o870j3956J9728P092M537
$$ y = [-40027, -41408, -11623, 3711, 50176, 47127, 46059, 20963, -9374, -23828, -53609, -39200, 4169, 12023, -11588, -32184, -20561, -17608, -34687, -43230, -10713, -7649, -6594, 4401, 13297, -19485, -65477, -56245, -7913, -10380, 4086, -9102, 5566, 16886, -10036, -28219, -14233, -26244, 17012, 5031, -987, 40316, 54498, 62334, 44061, 27190, 14660, 16790, 2317, -28355, -39596, 1027, 13841, -7160, -17073, -20870, -30725, -5687, -8813, 4054, 45693, 27384, 33683, 2702, -38735, -41711, -19870, 10522, 21062, -12834, -24491, 9596, 25370, 17244, 15528, 43037, 25484, 48007, 49418, 70014, 87401, 28326, -37757, -16319, 1677, -24067, -27918, -33483, -34723, 2321, 24657, 20882, 7739, -12680, -33777, -40647, -54603, -34875, -27783, -23246]
6444b3246L9322K7695j9544j3586R604k0708j9691j1739J4821J7367M440M74n5053
6431d9844m7644L2810L5338K9006L8109k170M996P462K7233n745o9586r504k4640
6418c4179q008l600k8144L1492O862j0246J0302l706k7860O206N1168M4399m740
6405B9946l5756j4012m28O74N539J3633K6342k2535k0251k74J6529P509j9323
6392a2407m224J2993n074J9265P390J232j0958j9107k1991l029J3187Q837r66
6379a4852K1380M5404j2243l2210R960j3678k4507k1217n0914J9674M7386M5003
6367A9186k1374l782J8516k1454m4922q484K8102r827j3508r863K7709J3158j6626
6354d3169J0930L8628K9790O694m1633o7930k1651K1115J5566L543J140K4123
$$ y = [-23246, 16076, 43771, 24227, 10641, 20245, -463, -20154, -31893, -17072, 295, 4735, 5209, -49844, -97488, -64678, -29340, -334, 37775, 35605, 40601, 48063, 75296, 69551, -35, -9539, -34179, -42187, -45787, -73931, -42439, -35577, -45823, -35521, -39227, -67087, -60881, -9713, 34686, 29946, -5810, -19822, -20250, -19576, -14037, -404, 25938, 3403, -16848, -17122, -593, 6916, -12407, -16631, -3638, -8712, 10553, 17943, 19175, 8217, -10890, -32881, -35910, -22723, -13886, -14852, 6528, 51932, 39689, 7479, 17439, 3761, -20746, -41963, -92877, -73203, -25817, 19186, -2188, -5970, 12546, -8908, -53830, -62314, -34212, -44039, -57547, -67410, -39701, -26543, -43169, -32239, 6389, 36179, 42873, 1240, -66690, -88341, -67226, -51660, -48117, -46977, -22854]
6342b2854j8035l4196K2995J6863n819j4170J7397K0117J0081L447j8740j2418
6330c5332o992J7111l5297j8049L8106j0020L3991K2797K7913M401l8349j6791
6318a6511J1215j3216p803j315p259Q041J0811L0787J9541J9312n70k6097j3061
6305A3875l5393j6164M308K9792L872J5157L0942j4739o3653k3461J1486J7241
6293b6737l5249q576L1280L0248M0698l6276n886R356k680O384l1366Q062j059
6280b1801j3045r751l3996J6058J9444M982m095N302K8389j7850L0095K8838k686
6267B9884j9153N180J6032k2012k1191L225N285J5033M227l0205n199M144J9837
6254E087P762j2035j8668j6507R896J218j052k2354M902Q902K5302j0424o4882
$$ y = [-22854, -40889, -75085, -52090, -35227, -41046, -55216, -37819, -17702, -7621, -4174, -22914, -35332, -42324, -25213, -60510, -78559, -40453, -50473, -16482, 6315, 34228, 38629, 280, -16511, -5296, -18512, -26315, -27630, -34889, -26848, -16037, 14750, 34291, 53603, 53033, 26936, 13875, -21518, -37682, -33374, -3582, 290, 15447, 46389, 31650, -32003, -55464, -43978, -26737, -61986, -70562, -39282, -9034, 31664, -4612, -10498, -1142, -3822, 2562, -28804, -20742, -21801, -34846, -44597, -78593, -62535, -43091, -38109, -42204, -36902, -8513, -26363, 3732, 32570, 29884, 10731, 15911, 31943, 9931, -11260, -8035, -2750, 12283, 16510, -13695, -18894, -14750, 5087, 12849, 814, -17854, -34361, -24465, -23247, -24299, -46653, -41751, -32849, -7547, -17971, -82853]
6241h2853l156J6677J6838j6694L0871K5416j6696l6515L7950N2442L032j91j4394
6228A2727l6661k6942J013J3666L2094K3949l2044k9382J8439r021j6190r147
6216e7499Q474p366j7059J240J6029R104K032Q91j3943N388L2307j3086j2614
6203d6102K091K6715L1360m8631j9795K5606n16N230l821q47L6520k3326j937
6190a7453l959j0810k6431l868L6747M1414k260j3330r124K2443j727l9420k2475
6177e0253j6401J1466m058J6910M9880J5462J6417J6708j0182m2104j6486k0194
6165c2835j9422J2677K7340K3899l2914k9075K0654J2560k483M9856l898m3346
6153a6987k0699n933K9331L0453j3417J3077p761l2006j7468k7004N784N5457
$$ y = [-82853, -86009, -69332, -52494, -69188, -38317, -12901, -29597, -66112, -28162, 24280, 27312, 27121, 12727, -23934, -50876, -49863, -36197, -4103, 19846, -12198, -41580, -23141, -32162, -48352, -57499, -49025, -56391, -73450, -72210, -56181, -47077, -45045, -44154, -58097, -52709, -20402, -33488, -46102, -44011, -17296, 14064, -34567, -54362, -28756, -29272, -24042, -27863, -28710, 7810, -15516, -17453, -21412, -32222, -58653, -62521, -25774, 15640, 13380, 50, -9074, 13369, 11642, -27778, -50253, -66654, -55188, -59246, -42336, 7544, 23006, 39423, 56131, 45949, 3845, -12641, -32835, -52257, -39580, -12240, 11659, -21255, -50330, -29676, -17116, -19599, 30257, 26359, -16987, -37686, -43619, -14288, 16165, 2748, 15825, 8064, -23942, -41410, -68414, -62630, -7173]
6141g173J1432K5033N025r898R303j1407l0618n121P501j0638j060M201J0542
6128b878J5160j3689j1161J2908k1299n1100J4447K3879N957O720K0026J2764
6116A1734j7682q23O068l3957J6673m597j2797P935k2105L3247P2721k702l6802
6103A6913Q726k2726K0512L1374k2878k5242n6020Q431L5218j6165n948O670M401
6090a6734j1339k3553j6315j9285K277P152L0056l497R634N4094k187n5083L5102
6077i678K1168R112l0354k3210j8672K4144J6198l4856m6983K5828M8881J9506
6065A084l7303l9768K6529M5396J7107l057q470j7439o234n430K0572J5701l5686
6052b6998l7882K9063K9556q230n5912n0337M4428O0532K2806k0168k179J2152
$$ y = [-7173, 4259, 29292, 34317, 24419, 33722, 22315, -8303, -13424, -5923, -16561, -17621, -13420, -2878, 12282, -1407, -12568, 340, -20959, -72059, -57612, -33733, -27776, -21056, -1030, 11734, -5948, -6771, -703, -34660, -17987, -22584, -35381, -27446, -49551, -16304, 56417, 53715, 16913, 25639, 2913, 23425, 54799, 31921, 6679, -49341, -40910, -5692, -21857, -27805, -21135, -16734, -28073, -51626, -67941, -87226, -84949, -77797, -47741, -51238, -41604, 12490, 10303, -44780, -9678, 11490, 20602, -9752, -32962, -51634, -27490, -11292, -46148, -93131, -67303, -18422, 1084, -36219, -75987, -49458, -4062, 13045, 9988, 1518, -15921, -22155, -27585, -7013, 8688, -26998, -64880, -35817, -6261, -14491, -70403, -120740, -76312, -15780, 7026, -13142, -15321, -3169]
6040c169L7109J2427n1094l4684K6595K7828k3199J4250K021k6987M6J2148J673
6027e036K1743n424j0660j2770l7155J2929J2011J0964L5355K1896l1629k7459
6015a5235l1411p482K7560J3711L3217j5846m1771l5320k232J9641K2828J3713
6003a8627p051L241R906J611j1461j1144r979p302J4891K4955J0556k07K3631
5990B3020j5701r813r447j1771l3889P549L2010n641r62r505j5252J0201J6274
5977b2927j0742L3279R056j6615M249K8608j2377Q00J4239k0860j9117l050J967
5964a3490J6684m219K609J3143k3320j4404Q87J7557p704L426l225K0518K7485
5951C5947l2475j1997K2700k522j4144M155l8992l9280j3446J5033J2656K1829
$$ y = [-3169, 33940, 46367, -4727, -39411, -12816, 15012, -8187, 6063, 8084, -18903, -18857, -6709, -5036, 16707, 11283, 623, -12147, -49302, -36373, -24362, -13398, 21957, 43853, 12224, -15235, -46646, -54128, -26568, -12857, 20360, 4514, -37257, -72577, -74809, -55168, -32340, -18627, -25678, -22437, -12531, -10920, -22381, -33525, -43504, -50806, -35915, -10960, -404, -611, 23020, 7319, -2494, -11941, -23712, -57601, -50052, -18042, -23683, -24645, -34150, -49402, -39201, -22927, -33669, -390, 8666, -7949, -3700, 24908, 12531, 13331, 27570, 6710, -12407, -15457, -13490, 3194, -1025, 1584, 14727, -8593, -22997, -22110, -4553, -12257, -8831, -12056, 8462, 35947, 3472, -8525, 14175, 11653, -2491, 1664, -37328, -76608, -90054, -75021, -62365, -40536]
5939d0536K7827K4945q016J6574k9280J0860p640Q792K0323K8382l72j5914L204
5926C9149m5765k3454L498m663J114M666O878L123j7878j7055K8429K3845j7809
5913a5922L203l0323j0722O2388R114m996J1286L2911M3365P277l4946l3959j5857
5900B2819m916j8524j1331K6801Q517N151R859k4571K5483J4578k51n7071P905
5887D449Q962r050K1777l4160J2213N8788j5623m5574p859K0909j1245m6458l7855
5874h0726L2826K5362l674J2103R704j2K096q173O143J4859Q268k500n792r233
5860A251l3623O814K7325K079J1885J8209k2447k5191P524r163J8593k685j4869
5847a4298l9590r722k0971J7875J7188L961L8677O670O590j4708P339J841m0950
$$ y = [-40536, -12709, 12236, 4220, 20794, -8486, 2374, -5266, 3526, 23849, 52231, 51859, 35945, 39149, -6616, -30070, -26572, -31235, -30121, -25455, -18577, -15454, -33332, -50387, -21958, 1887, -15922, -12719, -43042, -53764, 8624, 17738, 12742, 24028, 56939, 100304, 107581, 72635, 38676, 22819, 17903, -621, -11952, 14849, 23366, 28517, 38376, 13805, 39288, 53866, 53615, -3456, 4449, 13411, 4361, 26138, -8022, 4191, 62979, 47356, 1782, -6077, 14832, 3587, -42871, -80726, -47900, -22538, -26212, -14109, -4405, -4417, -2321, -10494, -4351, 10508, 18776, 16276, 10484, 1251, -32372, -25558, 1767, 3846, 15731, 33940, 11493, -13698, -6174, -15337, 3256, 571, -14298, -53888, -63610, -84581, -66706, -49518, -45557, -6880, -210, 6380, -8328, -989, 852, -40098]
5834d0098k2815J1034j4197j8001Q877L2647L1033L8163l410K8527q866l2404
5822A0490J7048K5479k1886l4282J688k959M421K2118k1367m5608J0475L3332
5810a051K0529l199l0458k6994l0942N063K6788J5677M9631k2799l5892P204M2150
5797A5707L500m509K980m1637j7244K6600L3679m8849k8817j442M9364J2715o336
5784d289k7707o455O925M15j1265J9331J8569l132J0404q704O111l9108j8323
5771e7228j9674j0183J8032M1827N3156R691j5230j2480l6336O428L8202L3969
5759E0174q239m0510m1281k3481M6030J5599r893J0819q913L5492Q311q992j8309
5746F807k78J4321P380o064k2541r454r165k0858q273J3146K2876P395K9581k7928
$$ y = [-40098, -62913, -51879, -66076, -84077, -75200, -42553, -11520, 26643, 23233, 51760, 42894, 10490, 27538, 53017, 31131, -3151, -1463, -4422, -1, 22117, 750, -44858, -34383, -1051, 19478, 16279, -14179, -41173, -72115, -67052, -40264, -24587, 25044, 2245, -33647, -26443, 15707, 19207, 14698, 17678, -23959, -41203, -14603, 19076, -29773, -58590, -60032, -10668, 2047, -4289, -31996, -38451, -31526, -31111, -42376, -23045, -4476, -7608, 2796, -5908, 203, -38905, -57228, -76902, -87085, -69053, -27226, 25930, 35621, 20391, 7911, -28425, -21997, 16205, 50174, 41935, 1425, -39856, -63337, -17307, -1708, -11601, -782, -9695, 25797, 34108, 25116, 6807, 6529, 20850, 28230, 22166, -375, -9829, -18994, -39852, -48125, -34979, -12103, -4708, 24873, -3055]
5732c055J6194j7420k7961J9270k864j2366r632J6516L903Q029n380l6725k021
5719e3512K3509O0125J8640n258p4380k3064K4336j6516o985K9473J0671j0820
5707b3781K9607n116k2845m827j2388J2424L2576o117j1334K4528p923M55j1692
5694f433p608p525J247j708j6563J6947K2209j6850J9025k9380l6778J6179N3417
5681F179J4434N3673K0629o7015l6796K107P998r752L0771R662k3560k537l523
5668B270L1891p671K2839j3955K2217M046j9799m6410k8130j206k1086K1592K2727
5655a0675J7642R078Q59k6617Q766M0968P243N522l5668j6341R476M24J0856M7626
5641F9159L9140k2396j0298R494K3945k1893l8664j6409j0812L0057k482J6167
$$ y = [-3055, 13139, -4281, -32242, -12972, -15836, -28202, -37834, -21318, -17415, -9386, -14766, -51491, -53512, -30003, 30122, 48762, 43504, -30876, -53940, -29604, -46120, -53105, -23632, -12961, -23781, 5826, 710, -22135, -26962, -39350, -26926, 5650, -467, -11801, 12727, 4804, 5259, -6433, -14041, -21566, -20319, -22027, -38590, -21643, 566, -16284, 2741, -26639, -63417, -47238, 6179, 20613, 74286, 94915, 27900, -8896, -6789, 1209, -8543, 22228, 31890, 8330, 5793, 2270, 34161, 26490, 49329, 35374, 57591, 61637, 41838, -4572, -32702, -33908, -54994, -33402, -10675, 6967, 16045, 16904, -9713, -947, 40021, 47264, 52786, 17118, 777, 10253, 10677, 21533, 69159, 108299, 85903, 75605, 85099, 109044, 87151, 48487, 32078, 21266, 51323, 48841, 65008]
5629F5008n5160j9002r964p364Q343L509J883j1749L2955k489M0812k2673o0017
5616c5908p809L6054O861P425O550k3565k630o710M030j0108k5967j9700J866
5603f9611R189K4207N0929k7804j2376l5717J2151K7207l168l301o867J416L89
5590c3356L1324K3750j6467R29M767k2388P732L5447l885k3306n129l2564k3520
5577e6666Q903m761J0628R341N657j2810m1330j1794K9560L8021M0262L6214k9212
5564B2013K708k8648l6610k8582O101j4202K0504j4512j3697L9719K7317J1083
5552f806K1899j6561L335j1084L228j4424n065M4408o108n101j4673j6528j7387
5539d0867J1948k0377P300J7103j4220k0983M4759M3413o470l1524j9880J0065
$$ y = [65008, 9848, -9154, -19118, -26482, -18139, -14630, -12747, -24496, 8459, 5970, 46782, 24109, -35908, -43717, -7663, -802, 6623, 13173, -10392, -13022, -19732, -15702, -25810, -51777, -71477, -69611, -60422, -36215, 14714, -13090, -25466, -61183, -49032, -21825, -24993, -28294, -35161, -33745, -33356, -2032, 21718, 5251, 6180, 10947, -11441, -3709, 31738, 27853, 4547, -582, -33146, -56666, -47763, -52524, -41896, -32555, -26898, -39708, -81038, -92832, -63272, -25251, 15011, 51225, 22013, 24721, -3927, -40537, -69119, -63018, -77220, -56716, -71228, -84925, -45206, -17889, -6806, 15093, -1468, 1867, -9217, -5989, -20413, -25478, 18930, 12822, 7721, -6952, -23480, -40867, -28919, -49296, -41996, -24893, -39113, -60096, -15337, 28076, 21606, -9918, -29798, -19733]
5527a9733L1988j3892j1695j8658l7778J9110M3750N6448N264j6586j0976j6254
5515A0988J5714M502r959k7528P649o41L386k0805l2833K3253O822M926j563K5560
5501I471J1008K02p677j1841M075k1175k2348l4004N68J5692J8543n741K3537
5488a9690K0384k2459j0758K1220J2144N51r277J2158l1780R168Q1073K9408l2082
5475F0060K087j0206r672n218k8289k6828r967L3757J3394M672O919Q771j0775
5462B8705l3176l3465N708j395j338J9321P375m87r790n281L2826p090n806J1089
5448G196k5786j4487l2470J4866k6422j5262P962O1207O680l20k0573q430M6783
5435I44L1634m974j2894m3288L973L370k0086q08M0600o978k2755j2509O309n220
$$ y = [-19733, 12255, -1637, -13332, -31990, -69768, -50658, -6908, 49540, 54804, 38218, 27242, 10988, 26702, 31204, 21245, -6283, 1366, 725, 4111, -16694, -49527, -26274, -19452, -14526, -16089, 9471, 20479, 20681, 13004, 1163, 5238, -15937, -38285, -72289, -71721, -56029, -37486, -43227, -19690, 694, -21765, -32523, -11303, 841, 1392, -7885, 4273, -27507, -18339, 62734, 92142, 60060, 62147, 51941, 42269, 37051, 8762, -18066, -28033, 5724, 19118, 23790, 30709, 39480, 28705, -4471, -37936, -32228, -33623, -34961, -15640, -8265, -8752, -18542, -23823, 9003, 1913, -3893, 7196, -18590, -33077, -65547, -50681, -77103, -92365, -84403, -23196, -16516, -16836, -37409, -45839, 944, 32578, 27604, 14710, -28578, -24605, -21235, -41321, -42129, -1529, -8507, -31262, -43771, -37462, -42682]
5421d2682L0850J1696m1765j5529N130l2709L588L7852M856N581l1156K0940K8524
5408a4824o056n410o643J0734R999K1041j6632k1388k3872j0601K5967K8818K505
5395f362J2720K6226M032n7104k0015K0493J1849K4980N0990J3251l0826j7762
5383C2472r145k2163j9054j2152J3782J2280n2226k4219J6792N0891o870j9874
5371c9486m076j3722J5939M2075K0343k6088j6892j5444J2445K7672n261k1075
5359b3570j2273k3496k6159p014k7470J1017J4313L2570J186l4242j1447M4823
5347f1762N3541K9833l1291J8102L6715k8154m5360j75K7001l7448p478O5098
5335A8622L9003j0333l0723J2775m591j3600j5616l6504M878M0827K6387P6l2269
$$ y = [-42682, -11832, -136, -41901, -57430, -52300, -85009, -81421, -43569, -38713, -33132, -64288, -43348, -14824, -20880, -26290, -32933, -22199, -12200, 8841, -7791, -29179, -53051, -63652, -37685, -8867, -6362, 6358, 32584, 36616, -20488, -40503, -20010, -8161, 16819, 67809, 81060, 50234, 32472, 23327, 1164, -17890, -30042, -16260, -3980, -56206, -80425, -63633, -12742, -19612, -39486, -43562, -57284, -41345, 730, 21073, -5015, -21907, -37351, -24906, 2766, -2495, -23570, -35843, -59339, -85498, -92512, -119982, -108965, -94652, -62082, -60896, -95138, -106585, -61762, -8221, 21612, -9679, 8423, 45138, 16984, -28376, -28551, -1550, -38998, -46476, 18622, 57625, 47292, 16569, 29344, 24753, 11153, -4463, -40967, -36089, 4738, 31125, 31201, -1068]
5322a068p025j1249L2356k6996p806J8610J3775M4620r796j5116m053k9735j6444
5309a9927J2096J0495K7006k3874k3680R592j3351j3182L1908L0124N825m9389
5297a6357P128L5146k5611L753j4821K246k788M35j9153M249K2172J5127k4387
5284a2861R490L5525j8052q174p400k2620j5732O383L6325n88k326Q517K0901
5271B9388k3606k716j8587J1918P14k9436J9362L7220M6879r649k3704L926k0218
5258B1491j315L0860N900j9301o988j8899l61j3227m2345k7414O077K8398J0880
5245b6244O2897J1537j3001J993k3763j2345j8251N6454N790k8896j7792n331
5233f952J50k0612K5574Q455l5997L167J6474L3150l410o195k7316J822K3612
$$ y = [-1068, -8093, -19342, 13014, -13982, -21788, -3178, 10597, 55217, 45421, 30305, 26252, -3483, -19927, -7831, 2664, 29670, 5796, -17884, -8292, -21643, -34825, -2917, 27207, 33032, -16357, -9229, 25917, 306, 4059, -10762, -8516, -11304, -10869, -30022, -25773, -3601, 11526, -12861, -3371, 32154, 14102, 5928, -1472, -24092, -39824, -33441, 2884, 2296, -30, 8487, 29388, 5782, 3066, -15521, -3603, -2889, -32325, -12963, 24257, 71136, 61487, 37783, 41709, 21491, 20176, 51036, 56936, 37635, 30647, 11748, 11387, -1840, -44185, -71599, -65522, -37124, -26244, 36653, 48190, 35189, 37182, 13419, 1074, -17177, 39277, 45067, 16171, -1621, -6952, -6802, -27414, -1840, 6615, -29382, -26215, -9741, 23409, 19999, 13804, -13512, -11690, 11922]
5220A1922M514J7816K2004m475J3989j8886l8148l9800n685k3155J4797O0138
5208A5031K7633k2475O338J4980k8651n3121O490K0161l8338J2114J9196J7860
5196b782k7686J5525M8198j8086o8149l902K1479K9645q920r755M80Q510o861
5183b2304J9054K5530j2776n427m4480k1330K0827N7323J1914M20M8985l5235
5171D2501k1356j7187m8286O44Q185R875L9489L670L835J9852j6791k703K4508
5158D6236q867q089k8304l6025j116L142M76N6274M460l0675n4106m11J3280K498
5144d1227p830Q409j0701L159J6401J1083j426r785j7083J0589N7653L0469o364
5131D3347n1902l4779J456j9145q261K8822J7417j0449J6946J393k2965r456J2535
$$ y = [11922, 16436, 34252, 56256, 51781, 65770, 46884, 8736, -31064, -36749, -59904, -45107, 15031, 42664, 20189, 26527, 41507, 12856, -40265, -33775, -13614, -51952, -39838, -20642, -2782, -30468, -14943, 33255, 15169, -52980, -56882, -35403, -5758, -14678, -24433, -23953, -15443, -22304, -3250, 22280, 9504, 4077, -40403, -61733, -40906, 16417, 28331, 28751, 77736, 42501, 21145, 3958, -44328, -43684, -35499, -25624, 13865, 17535, 21370, 41222, 24431, 21728, 46236, 37369, 29280, 976, -35049, -36165, -33023, -32547, 23727, 28187, -2488, -56594, -57005, -43725, -41227, -49057, -40648, -51349, -48190, -31789, -20706, -22132, -31917, -49000, -38411, 19242, 49711, 43347, -8555, -43334, -41878, -61023, -69284, -40462, -23045, -33494, -16548, -15155, -38120, -47576, -35041]
5118c5041J7915Q066O376K6287k7010j8372L7952K3692m223k7293m862k3795j4048
5105c4356J0955N8132J6684n503k4743o555j9690J7862j230l025j5097j4923N027
5092a6462J9852K0687l034J3174j9055k3152j667j864L6948K859J4613K7675m9750
5079B0824k8980K1211J707l4415l3763q855K2832L8479J6266j4434k1894j8011
5067c9033K4161K26J4605J7024O776j9718K5589k8604j0892R83j1423m296J155
5054b3447M2326J8780p084j9657J3973J8948j9736j4726J1715k6504N000K8390
5042B7978R142l0348j0856j4265Q619K0715j1710O251O912L40J5218j9374k2836
5029a4214k999l0730l356J4482L0775P438r511K3510l7069k6520k3482K0200M935
$$ y = [-35041, -17126, -9060, -2684, 23603, -3407, -21779, 16173, 39865, 35642, 8349, 3487, -20308, -34356, -23401, 34731, 51415, 45912, 21169, 14614, -5076, 12786, 11556, 8531, -6566, -21489, -16462, 3390, 24077, 21043, 34217, 15162, -7990, -9657, -11521, 25427, 28286, 42899, 70574, 20824, -8156, 13055, 14762, -19653, -53416, -62271, -39439, -960, 15306, 872, -21022, -39033, -14872, -14646, -41, 16983, 23759, 4041, 29630, 1026, -9866, -8883, -20306, -24602, -23447, 18879, 37659, 30575, 10918, 24891, 43839, 24103, 9377, 21092, -5412, -412, 27978, 37120, 6772, -4084, -18349, -9730, 10985, -725, 5526, 12438, 12778, 27996, 8622, -14214, -17213, -47943, -51299, -36817, -6042, 1396, -8115, 15395, -21674, -48194, -71676, -51476, -46541]
5016d6541M0598K4550K1099J02n706q816l4115l1458k9044P148J0539q358k1999
5003h2001j4523L924K4604M5397L9039o744N657k0766p312k9325k7690K671N6091
4990a0978M7373K4959j5578k7620k4868m3088l527m4116R570O9186M1423J6353
4978C9089J592k4840j1443J2228j3383L5804M734Q623j0680j1968O818k798l3887
4965a11o684m139M359J2986L664O27l5763j3040J0346J8803K531L1629o762j8963
4951e17l5047M150J0453q878J1285R482o476k1748J4009P100o570J6913K4449
4938A8605l0681k6863L1965L3936J6164k6531l4542k0503K7602O644j0262j4715
4926b9181J2101P502Q836m7635l3137L3813N1272J6368K2709R702j9528j0806
$$ y = [-46541, -5943, 18607, 39706, 39808, 34102, 25286, -8829, -40287, -69331, -62183, -51644, -60002, -82001, -96524, -92600, -67996, -22599, 16440, 9696, 15353, -5413, -12725, -42050, -69740, -67069, -10978, 36395, 61354, 45776, 18156, -6712, -49800, -53327, -97443, -87873, -18687, 22736, 39089, 40681, 15841, 4398, 16626, 3243, 39047, 43781, 52404, 41724, 29756, 36574, 33776, -111, -6795, -10934, -6575, 6411, 10075, 10702, -25061, -38101, -27755, -8952, -6421, 25208, 18446, -517, -35564, -31414, -20961, -29839, -18554, -9072, -15548, -37296, -23287, -16187, -22757, -5844, 18605, -12076, -38939, -6974, 26962, 43126, 16595, -17947, -38450, -10848, -4204, -14466, -29181, -17080, -9578, -742, -48377, -81514, -47701, 3571, 19939, 42648, 52350, 32822, 22016]
4914B2016j9686N295K0527n9079r345K9567p20o90k5439m3113l3688K0162L127
4901i1066n803K5915M4089j2167K5176J2306k0477k6763J7997L1065l93j478l4728
4888c6327j364R588r253j6111Q810N3058K6041j1969k4307L708j7352L909J2507
4875I38K4121K0435J0539m4593l7886P739j9059L6311J5024m3302L1085J8669
4863B0021n914m4927o921L3347J8905M8766l060l3330L377j0l8252k8229j0978
4850d7205j2193j5845J9655M1747j0667n911J970J1942P461K0657J9344M6716
4838G7671J6878k0142j2488k1562l623k49l0477k3677j2157J4562L7246P215l1631
4825b434j9088K5087K213k9179K3253K2740k6650l7098j3788P190M6735K4759
$$ y = [22016, 2330, 7625, 28152, -30927, -40272, -10705, -11425, -12115, -37554, -80667, -114355, -94193, -91066, -96869, -70954, -26865, -39032, -13856, -1550, -22027, -48790, -30793, 272, -121, -1599, -36327, -37691, -28103, -37356, -53467, -44657, 8401, 34442, 22473, -1834, 1874, -15478, -11569, 938, 25059, 45494, 56033, 11440, -26446, -18707, -37766, -1455, 13569, -29733, 1352, 20021, 14107, -30820, -37741, -4394, 14511, 63277, 60217, 26887, 30264, 30254, -7998, -36227, -47205, -59398, -75243, -55588, -13841, -24508, -30419, -28449, -16507, -9046, 11611, 30955, 77671, 94549, 74407, 61919, 40357, 36734, 36485, 6008, -17669, -29826, -15264, 21982, 29197, -2434, -21522, 3565, 5778, -23401, -148, 22592, -4058, -41156, -54944, -47754, -1019, 23740]
4813B3740J1629k1773n4039R168J6413n67M1333N384m3122k1367M051m1156K3549
4800d6757K1906M0850J349q555j9980j1785J2271m796J092R786O144l9171J4051
4787b3595J8524j293k2036K0089R53J1718j9564K5015p479m4406J3532J0703J2021
4774e818k3841j8387O464M2989L2157Q367l6240q916K8448K6313j9414j3984j6220
4761A918l1288q490J604L7561k2231j1801j2975k9434j0424L5865J0733K1669
4749a7293j9158r439k0935L8372K909l3992L86L7813l7994j4666K6883J6489J5024
4736a5601j4777J1493q764j1005K2269m11K529O610L9314m298p661N197M977J7579
4722D7451l7774o1227j030J6566L8542L0018L0766m168j3392m0863L549r351k843
$$ y = [23740, 35369, 13596, -40443, -31275, -14862, -15429, 25904, 31288, -11834, -33201, -29150, -70306, -46757, -24851, 15999, 17348, 8793, -11187, -22972, -10701, -15497, -14405, -4619, 1525, -37646, -23595, -5071, -6364, -28400, -8311, -7358, 4360, -15204, 9811, 2332, -42074, -28542, -17839, -5818, -29659, -48046, -41582, 1407, 33564, 41931, 5691, -3225, 25223, 51536, 32122, 18138, 1918, -29370, -37860, -36256, 1305, -20926, -32727, -45702, -75136, -85560, -49695, -38962, -17293, -36451, -45890, -66825, -28453, -25544, -59536, -59150, -21337, -59331, -73997, -47114, -30625, -15601, -30378, -18885, -27649, -38654, -16385, -16796, -14267, -7657, 31657, 27359, 19698, 24895, 29872, 47451, 9677, -51550, -52580, -36014, 2528, 32546, 63312, 59144, 45752, 4889, 8438, -913, -3756]
4709c756k9184M1731N4254J5963J2208k0108l0197k3769q33N229L3803j3843l3324
4696H174l507n273L059k1302J9987j8383n6489Q589N6487j746j2463L908M1551
4683B2592j629p625J503k2126k1094j5531j1400l234L2017K2424K1374j9255o748
4670h732j7222j500m398K6635j902n899P993k3626N853K7656K3296r707l0052
4657a1605j5194M3076j499j8608l3896L7640L3937n310k0349k0627K9223J2475
4645B9263k3631J3891J5803m8617r795M0258J8823l055o641J3436r488m4464k6602
4632d0819L8003K6313o167R341K6167k5663j1759N389j3241P958J2751j9922k2096
4619a3745l044M622j951j6244j3206L789K5607J0177P424J5000j8554k7719l3796
$$ y = [-3756, -32940, 8791, 63045, 79008, 91216, 71108, 40911, 17142, 16309, 21538, 55341, 41498, 8174, 4667, -606, 2453, -18849, 1138, -17245, -73734, -65145, -8658, -10404, -22867, -18959, 22592, 20963, 13338, 14841, -7285, -28379, -43910, -55310, -58544, -26527, -4103, 17271, -1984, -8732, -25954, -27454, -31852, -5217, -7119, -13018, -5025, -28651, -22798, 4858, 28154, 18447, -11605, -26799, 16277, 14778, -3830, -37726, -86, 33851, 28541, 8192, -12435, 16788, 29263, 5632, 19523, 35326, -13291, -23086, 17172, 35995, 32940, 26299, 39735, 30247, -14217, -40819, -2816, 23497, 17330, 26671, 52838, 27175, 15416, 20805, 7564, 15522, 28273, 8351, -13745, -16789, -12167, -14118, -30362, -43568, -39779, -14172, -3995, 3429, 18429, -125, -27844, -61640]
4606f1640N4155M6122m0699m2161J3881J669j8308J4147l230j5906R227J898J039
4593c9806M7955J7821n6230q865K232J1991J6921k3708l5077m5137j4324N4678
4581g1549M4649J3855J7520k4007j213N355K3258K2373j5250l8605J496k4526
4569d6644j5669J4295l679K2484L3541r684k3142k6940l0905J4121M8405J4156
4557i661o020m8491k983M1072J3319O432L3704p622q192o960n677o525m271K9861
4543A7986N928n14l925N053N011l4414j4239K118j3136k2011n857L7773j5576
4530c5803p057P892M3482n329o3037k358J1826J177J3287J7159J0443K5321k8061
4517a1058o962J09R149j0285m9121o724M2380N289k5042J3975J4025m887j2531
$$ y = [-61640, -7485, 38637, -2062, -44223, -30342, -28673, -46981, -32834, -36064, -51970, -42743, -40845, -39806, 8149, 25970, -30260, -39125, -36893, -24902, -7981, -31689, -66766, -111903, -126227, -71549, -26900, -13045, 4475, -19532, -20745, -15390, 7868, 30241, 14991, -23614, -22118, -46644, -62313, -48018, -51697, -29213, 4328, -5356, -28498, -55438, -86343, -72222, -23817, -9661, -15681, -64172, -67155, -26083, -12764, -6332, 27372, 19750, 11558, 4598, -1079, -7604, -11875, 17986, 23914, 23400, 19475, 24528, 29539, -4875, -19114, -16996, -30132, -52143, -58000, -20227, -35803, -42860, -34968, 8514, 3185, -59852, -62210, -50384, -49207, -35920, -18761, -8318, 17003, -11058, -18020, -17911, -8762, -19047, -68168, -74892, -32512, -27223, -52265, -38290, -24265, -29152, -41683]
4504d1683m404J4432L953k7551J0479K6728r261J5389J8000k2359k3761L2823
4492g215K1997J3756j4321k3530L4315j1926K7667k6665L488K021l7140m2361
4480e9914k95L178L6358J4324j6726M4024K7585m703m207K7265j3662K2286j8126
4467E7387k6528K507K6060J8791K1444m0636j2812k9749j4037l975N205p304n293
4454h940P135J3738k5092j7553J5164K8891j9434m323l939p412M1102L6573m993
4441E0917m7929m0746K6019L1421K622j603m766K9091j6715k8848p398k4276k049
4428c4260O117L4532J6746k1732r435j7139L829J1516k0091m5026N084L6662N7603
4415B4406J4478j4504O084j6539l9228j7607J9673J1999J8479M4088O936k7899
$$ y = [-41683, -46087, -31655, -27702, -55253, -44774, -18046, -27307, -11918, 6082, -16277, -40038, -7215, 14782, 28538, 14217, -9313, 25002, 13076, 40743, 14078, 17566, 19587, -17553, -59914, -60209, -57031, -20673, -6349, -23075, 20949, 48534, 43831, 39624, 66889, 53227, 75513, 57387, 30859, 33366, 59426, 78217, 99661, 59025, 46213, 16464, 2427, -1548, 3657, -3647, -8940, -1805, 11933, -13159, -30712, -15548, 13343, -6091, -10414, -14353, -21765, 19337, 55910, 50917, 2988, -37758, -11739, 19682, 22304, 20701, 15935, 45026, 28311, -537, -7935, -32211, -34260, -28143, 6389, 23135, 1403, -8032, -25171, -21342, -9826, -29917, -74943, -69859, -33197, 24406, 38884, 24380, 30464, 13925, -25303, -42910, -23237, -11238, 7241, 51329, 58265, 30366]
4403C0366K4129m3556o143M5630q680J5849P364m9729k6710q576j5012M148L7360
4390F440O738j9140l1072l1808N2497k4505j0801K0622r904J0069L3879L3587
4378C6602l1999m3038O487J514r189K1441L4221M101l1294k295k2430L7094M5739
4365D6954j7278k3555l1244k0166P751K8022l1303J2141o854K66r632p577M5454
4352g021J8551J6192j1487p220L6272J5659j1006J3789Q871j6031r883j1185J1877
4339D7378j7381o25j3953J5584J2489n524j0673l0153j2897M8699n077k8558l98
4326a089r333L8724N445k4335K3967N81j0216J4312R393l4436n1737q829R227
4313c8326L9278J3011n385k0740K357j1424L922J7742K848n084O515J5591k8633
$$ y = [30366, 54495, 10939, 4796, 50426, 41746, 57595, 64959, 15230, -11480, -20056, -35068, -30920, 6440, 13178, -5962, -37034, -68842, -16345, -40850, -51651, -31029, -40933, -30864, 3015, 36602, 4603, -38435, -31948, -30434, -39623, -18182, 16039, 20140, -11154, -13449, -35879, 1215, 46954, 29676, 6121, -25123, -45289, -37538, -9516, -40819, -28678, -35532, -35266, -44898, -52475, -7021, 11530, 27722, 16235, 9015, 45287, 60946, 49940, 63729, 72600, 56569, 46686, 35501, 47378, 29997, 29372, 15419, 31003, 43492, 37968, 27295, -2858, -15755, 32944, 27867, -691, -1089, -10422, 28302, 33747, 9412, 33379, 33960, 23744, 38056, 47449, 13013, -38724, -47553, -38326, 952, 13963, 8578, -12162, -9805, -21229, -17307, 435, 3283, -1801, 4714, 20305, -8328]
4300h328p573M7380J634k1627O184j8400j3587o727J7426Q407K575o582j3728
4287a2946j8908J2031N4589l3502k0450K2222K5467j7476J009j5706o694N616
4275d748n810K0261K0532M2931m028k5777j672j0627j4542K5701l8933q856J0214
4262D646J692J0031K7029K1466k5346l5748J2101k579k516l5863k1009K4832l633
4249b4897j7458N798Q714J8519J1589r715J7K8241O7827q826o782j7603j4322
4236D1102k7335l6654Q246K2368J6379j9428m337Q038J3514K657r485j9336j0747
4223a5018K7828J7738l6756m981m741m5887J0K2453K0591R164r50j8010k1999
4210e0558r815J4432M3737J3777r024j6647O670J8360j627j6675K8807L5458O348
$$ y = [-8328, -15901, 31479, 33113, 11486, 17670, -730, -14317, -21044, -3618, 4789, 7364, 782, -12946, -31854, -19823, 34766, 1264, -19186, 3036, 28503, 11027, 12036, -3670, -10364, -4748, -10558, 9703, 30235, 73166, 69138, 43361, 41689, 31062, 16520, 42221, 3288, -5568, 4646, 6338, 16369, 43398, 64864, 39518, 3770, 15871, 13292, 10776, -25087, -46096, -21264, -24897, -42355, -36557, -27843, -9324, 2265, -7450, -7433, 20808, 88635, 79809, 73027, 55424, 41102, 13767, -22887, -14641, 7727, 24106, 4678, 341, 8379, 21893, 24550, 15065, -4271, -15018, 12810, 30548, -6208, -11189, -15930, -61817, -61807, -39354, -18763, -9599, -10549, -28559, -50558, -60373, -45941, -2204, 11573, 2549, -14098, -7428, 10932, 9305, -7370, 21437, 56895, 63243]
4197F3243j0492k8939j7240J0936K366j7980k8705k8613L123J7402p933j9264
$$ y = [63243, 52751, 23812, 6572, 17508, 19874, 1894, -26811, -55424, -52301, -34899, -42832, -62096]
$$ [...]
##END NTUPLES=NMR SPECTRUM
##END=
