##TITLE=Analysis number 330412
Compound Code ac 15844
Project Code adrs
Chemist Name stores
##JCAMPDX= 6.0         $$ Bruker NMR JCAMP-DX V2.0
##DATA TYPE= NMR SPECTRUM
##DATA CLASS= NTUPLES
##ORIGIN= Bruker BioSpin GmbH
##OWNER= nmr
$$ XWIN-NMR		Version 3.5
$$ Thu Nov 22 12:26:59 2007 GMT Standard Time (UT+0h)  MAYBRIDGE\nmr@NMR_250MHZ
##.OBSERVE FREQUENCY= 250.131544655141
##.OBSERVE NUCLEUS= ^1H
##.ACQUISITION MODE= SIMULTANEOUS (DQD)
##.ACQUISITION SCHEME= undefined
##.AVERAGES= 16
##.DIGITISER RES= 18
##SPECTROMETER/DATA SYSTEM= dpx250
##.PULSE SEQUENCE= zg30
##.SOLVENT NAME= CDCl3
##.SHIFT REFERENCE= (INTERNAL, CDCl3, 0, 16.522)
##AUDIT TRAIL= $$ (NUMBER, WHEN, WHO, WHERE, WHAT)
$$ ##TITLE= Audit trail, XWIN-NMR		Version 3.5
$$ ##JCAMPDX= 5.01
$$ ##ORIGIN= Bruker BioSpin GmbH
$$ ##OWNER= nmr
$$ C:\u/data/dgb/nmr/ADRS/2100/pdata/1/auditp.txt
$$ ##AUDIT TRAIL=  $$ (NUMBER, WHEN, WHO, WHERE, WHAT)
(   1,<2007-11-22 12:26:31.60 +000>,<MAYBRIDGE\nmr>,<NMR_250MHZ>,
      <created by zg, POWCHK disabled, PULCHK disabled
       configuration hash MD5:
       76 6E 9A 78 1E 09 19 81 EC 84 63 8F B0 6A 59 2D
       data hash MD5: 64K
       28 C9 AA 4C 0B 6B 3A 73 76 4E 4F 3F E6 50 98 6C>)
(   2,<2007-11-22 12:26:47.46 +000>,<MAYBRIDGE\nmr>,<NMR_250MHZ>,
      <Start of raw data processing
       ef LB = 0.3 FT_mod = 6 PKNL = 1 SI = 32K 
       data hash MD5: 32K
       98 DB 2B 1F BB F0 08 E7 90 94 F2 06 92 CC B6 1A>)
(   3,<2007-11-22 12:26:49.08 +000>,<MAYBRIDGE\nmr>,<NMR_250MHZ>,
      <apk 
       data hash MD5: 32K
       B0 29 84 89 6E 59 9D 1A 53 78 60 10 8D 9B E9 98>)
(   4,<2007-11-22 12:26:49.85 +000>,<MAYBRIDGE\nmr>,<NMR_250MHZ>,
      <abs ABSG = 5 
       data hash MD5: 32K
       B7 DE 7F 6E 0B 7D 17 C6 3A 63 54 98 32 98 83 AB>)
$$ ##END=
$$ 
$$ hash MD5
$$ A7 6D CA 34 22 46 27 4E 0D 7E 49 94 E3 96 09 6F
##$RELAX= 
##$RELAX= 
##$RELAX= 
##$RELAX= 
##$RELAX= 
##$RELAX= 
##$RELAX= 
$$ Bruker specific parameters
$$ --------------------------
##$DU= <C:\u>
##$EXPNO= 2100
##$NAME= <ADRS>
##$PROCNO= 1
##$TYPE= <nmr>
##$USER= <dgb>
##$AMP= (0..31)
100 100 100 100 100 100 100 100 100 100 100 100 100 100 100 100 100 100 
100 100 100 100 100 100 100 100 100 100 100 100 100 100 
##$AQSEQ= 0
##$AQ_mod= 3
##$AUNM= <au_zg>
##$AUTOPOS= <22 >
##$BF1= 250.13
##$BF2= 250.13
##$BF3= 250.13
##$BF4= 250.13
##$BF5= 500.13
##$BF6= 500.13
##$BF7= 500.13
##$BF8= 500.13
##$BYTORDA= 1
##$CFDGTYP= 0
##$CFRGTYP= 5
##$CHEMSTR= <none>
##$CNST= (0..31)
1 1 145 1 1 1 1 1 1 1 1 1 1 1 1 1 1 1 1 1 1 1 1 1 1 1 1 1 1 1 1 1 
##$CPDPRG= <>
##$CPDPRG1= <>
##$CPDPRG2= <>
##$CPDPRG3= <>
##$CPDPRG4= <mlev>
##$CPDPRG5= <mlev>
##$CPDPRG6= <mlev>
##$CPDPRG7= <mlev>
##$CPDPRG8= <mlev>
##$CPDPRGB= <>
##$CPDPRGT= <>
##$D= (0..31)
0 1 0 0 0 0 0 0 0 0.06 0 0 0 0 0 0 0.0002 0 0 0 0 0 0 0 0 0 0 0 0 0 0 
0 
##$DATE= 1195734389
##$DBL= (0..7)
120 120 120 120 120 120 120 120 
##$DBP= (0..7)
150 150 150 150 150 150 150 150 
##$DBP07= 0
##$DBPNAM0= <>
##$DBPNAM1= <>
##$DBPNAM2= <>
$$ [...]
##$SUBNAM7= <"">
##$SUBNAM8= <"">
##$SUBNAM9= <"">
##$SW= 20.6930455092707
##$SWIBOX= (0..15)
0 0 3 0 0 0 0 0 0 0 0 0 0 0 0 0 
##$SW_h= 5175.983436853
##$TD= 65536
##$TD0= 1
##$TE= 295.16
##$TE2= 300
##$TE3= 300
##$TEG= 300
##$TL= (0..7)
0 120 120 120 120 120 120 120 
##$TP= (0..7)
150 150 150 150 150 150 150 150 
##$TP07= 0
##$TPNAME0= <>
##$TPNAME1= <>
##$TPNAME2= <>
##$TPNAME3= <>
##$TPNAME4= <>
##$TPNAME5= <>
##$TPNAME6= <>
##$TPNAME7= <>
##$TPOAL= (0..7)
0.5 0.5 0.5 0.5 0.5 0.5 0.5 0.5 
##$TPOFFS= (0..7)
0 0 0 0 0 0 0 0 
##$TUNHIN= 0
##$TUNHOUT= 0
##$TUNXOUT= 0
##$USERA1= <user>
##$USERA2= <user>
##$USERA3= <user>
##$USERA4= <user>
##$USERA5= <user>
##$V9= 5
##$VALIST= <valist>
##$VCLIST= <CCCCCCCCCCCCCCC>
##$VD= 0
##$VDLIST= <DDDDDDDDDDDDDDD>
##$VPLIST= <PPPPPPPPPPPPPPP>
##$VTLIST= <TTTTTTTTTTTTTTT>
##$WBST= 1024
##$WBSW= 4
##$XGAIN= (0..3)
0 0 0 0 
##$XL= 0
##$YL= 0
##$YMAX_a= 340581
##$YMIN_a= -371559
##$ZGOPTNS= <>
##$ZL1= 120
##$ZL2= 120
##$ZL3= 120
##$ZL4= 120
##$ABSF1= 16.522
##$ABSF2= -4.171173
##$ABSG= 5
##$ABSL= 3
##$ALPHA= 0
##$AQORDER= 0
##$ASSFAC= 0
##$ASSFACI= 0
##$ASSFACX= 0
##$ASSWID= 0
##$AUNMP= <proc_1d>
##$AZFE= 0.1
##$AZFW= 0.1
##$BCFW= 0
##$BC_mod= 0
##$BYTORDP= 0
##$COROFFS= 0
##$CY= 12.5
##$DATMOD= 1
##$DC= 0
##$DFILT= <>
##$DTYPP= 0
##$F1P= 14.0000005364418
##$F2P= -0.99999901652339
##$FCOR= 0.5
##$FTSIZE= 32768
##$FT_mod= 6
##$GAMMA= 0
##$GB= 0
##$INTBC= 1
##$INTSCL= 1
##$ISEN= 128
##$LB= 0.3
##$LEV0= 0
##$LPBIN= 0
##$MAXI= 10000
##$MC2= 0
##$MEAN= 0
##$ME_mod= 0
##$MI= 0
##$NCOEF= 0
##$NC_proc= -5
##$NLEV= 6
##$NOISF1= 0
##$NOISF2= 0
##$NSP= 0
##$NTH_PI= 0
##$NZP= 0
##$OFFSET= 16.522
##$PC= 1
##$PHC0= 173.2038
##$PHC1= -1.379527
##$PH_mod= 1
##$PKNL= yes
##$PPARMOD= 0
##$PSCAL= 4
##$PSIGN= 0
##$REVERSE= no
##$SF= 250.13
##$SI= 32768
##$SIGF1= 0
##$SIGF2= 0
##$SINO= 400
##$SIOLD= 32768
##$SREGLST= <1H.CDCl3>
##$SSB= 0
##$STSI= 32768
##$STSR= 0
##$SW_p= 5175.98343685301
##$SYMM= 0
##$S_DEV= 0
##$TDeff= 65536
##$TDoff= 0
##$TI= <Analysis number 999999
Compound Code 99
Book Reference 9
Project Code 9>
##$TILT= no
##$TM1= 0
##$TM2= 0
##$TOPLEV= 0
##$USERP1= <user>
##$USERP2= <user>
##$USERP3= <user>
##$USERP4= <user>
##$USERP5= <user>
##$WDW= 1
##$XDIM= 32768
##$YMAX_p= 367234506
##$YMIN_p= -529607
$$ End of Bruker specific parameters
$$ ---------------------------------
##NTUPLES= NMR SPECTRUM
##VAR_NAME=  FREQUENCY,     SPECTRUM/REAL,   SPECTRUM/IMAG
##SYMBOL=    X,             R,               I
##VAR_TYPE=  INDEPENDENT,   DEPENDENT,       DEPENDENT
##VAR_FORM=  AFFN,          ASDF,            ASDF
##VAR_DIM=   32768,         32768,           32768
##UNITS=     HZ,            ARBITRARY UNITS, ARBITRARY UNITS
##FACTOR=    0.157963299565203, 1,           1
##FIRST=     4132.6476996994, 0,             0
##LAST=      -1043.33573715361, 0,           0
##MIN=       -1043.33573715361, -529607,     0
##MAX=       4132.6476996994, 367234506,     0
$$ Real data points
##PAGE= N=1
##DATA TABLE= (X++(R..R)), XYDATA
$$ [...]
24672a32180r41P9104M5955k0010j43906l8688O1608R6672J47070N5167J7421
24661A67272o7520j0081K1521K6522q591L5293o5727r0455j48557P7040J01360
24650C8077N864o6000j33506j0998J03692P3300J03840N4314j82926j15986O5373
24639f4956Q450K9514K54J3483m1677j4142j19100j6720J29968K5055m2985j06614
24627a99470P8114Q2312P5130k2221o7409o3465J21977P4514r5775l0321J90914
24616A44300J18889k32568j23837j8560o4378J04879J60409J78279r5821q7594
24606H3998j37161l3785p7798n2792m2422L8079J01583K7682J1201m3597o2400
24595a87412p7355q3966P0734O2336N8638M8403j9710K0420n9867q4485J05843
$$ y = [-132180, -133121, -54017, -8062, -28072, -171978, -210666, -149058, -52386, 94684, 149851, 167272, 99752, 89671, 111192, 137714, 129123, 164416, 98689, 8234, -140323, -63283, 38077, 43941, -22059, -155565, -166563, -62871, 10429, 114269, 168583, -14343, -130329, -64956, -56506, -26992, -26738, -13255, -54932, -69074, -188174, -204894, -74926, -49871, -92856, -199470, -121356, -39044, 36086, 13865, -53544, -117009, 4968, 79482, -16293, -46614, 144300, 263189, 30621, -93216, -111776, -176154, -71275, 89134, 267413, 171592, 83998, -53163, -86948, -164746, -217538, -259960, -221881, -120298, -92616, -81415, -125012, -187412, -264767, -348733, -277999, -215663, -157025, -108622, -128332, -107912, -167779, -252264, -146421]
24584a46421J50136o9555n533n5777k1080O8926k4589J11239J37334R7061j11106
24573A30635j55787j02294R9624O1736r4633k6278j8955R2781K06524k4159p4485
24562I4709j7413k5761q497M7206N2678l7839L1611N2915q9683j34734J02183
24551F7375P2979m7492o5321J0109J2766k7510j4342N0147j5174q6514L8672J08350
24539A04045m1254r4027p900M3386J81174q8206L2046M2217j23327p8965N4132
24528B3321M351k4690q6181p646M7796l0499j23824J9247Q1876J72151Q9140k4868
24516A40174n4543l5189q4470q6442N6539O4442M5567n0898j53642k25973p8444
24505d62879L8605R0613q2373J20863K15028L2505K3221N1761J2360j3104q1604
$$ y = [-146421, 3715, -65840, -71373, -127150, -148230, -79304, -103893, 7346, 144680, 241741, 130635, -25152, -127446, -27822, 33914, -60719, -86997, -105952, -13171, 193353, 169194, 94709, 77296, 51535, 43038, 90244, 142922, 105083, 136694, 189609, 99926, -34808, 67375, 140354, 92862, 27541, 37650, 50416, 22906, 8564, 58711, 43537, -42977, -4305, 104045, 62791, -31236, -39136, 4250, 185424, 97218, 129264, 171481, 48154, -30811, 23321, 27672, 2982, -83199, -90845, -43049, -73548, -197372, -178125, -96249, 75902, 165042, 140174, 85631, 50442, -34028, -120470, -63931, 511, 46078, -4820, -158462, -384435, -462879, -424274, -333661, -416034, -295171, -80143, -47638, -24417, 27344, 39704, 26600, -55004]
24494e5004j20687N8002J36542J10636p4293n1903p9393n9092P2037k7215Q2017
24483h353Q1419o4058k6653N1909j6992L9700J56372J13020j56445j65522l180
24472A217J01975p4742o3055m0771l5354k4698n1821J08866J44852j9095j08323
24461f0949r5081m8008Q7333Q8793J02204M0318j199l0309J33819R3030j5371
24450B94580o4638o0157j35001r4696M3776j4275q5590o7366q9114J3506J92958
24439f6017O4966n9317L2712r9805n2142M2171J31400J42967o3889l7906L9600
24428G4740Q214j856J19108J09331o3731j93902n3851l1599O3244n666j39574
24417a15542q4834M2360L8689Q5120N3543K8164J21710L5529l1658J4409k1241
$$ y = [-55004, -175691, -117689, 18853, 129489, 55196, 3293, -76100, -135192, -63155, -90370, -8353, 73066, 9008, -17645, 34264, 17272, 56972, 213344, 326364, 169919, 4397, 1217, 103192, 28450, -34605, -75376, -110730, -135428, -187249, -78383, 66469, 47374, -60949, -156030, -204038, -116705, -27912, 74292, 114610, 113411, 83102, 216921, 309951, 294580, 229942, 169785, 34784, -59912, -16136, -30411, -116001, -183367, -272481, -258975, -66017, -1051, -60368, -27656, -127461, -179603, -137432, -6032, 136935, 73046, 35140, 74740, 82954, 81098, 200206, 309537, 245806, 51904, -1947, -33546, 29698, 24032, -115542, -200376, -158016, -119327, -34207, 19336, 47500, 169210, 204739, 173081, 187490, 166249]
24406A66249j73434J0819j1134j24700M2844J20009J80554j01899O274o8201j08943
24395f1562o7116m7032l7407O5546J9242O5072N2464J6333q7425K6410K5300p1898
24383a02073k9434N1668M4598k4906l4219n6374N4725J0467L7516L1488O4471
24372D7927J12428O9536R8237j04937j22185r8182J9144M4701j6025l7373P0127
24361H3398m7141K2357q8856o3005r6025k0384P7920M0056q2443n3658O7631J59151
24349i99K7357j7529k2298J01914J505J19260L821q9447o7545k2544o7929j6947
24337e1381L2067R9686N5583K8175M7581J9513J9234J8185p7849p4593Q1463K5589
24325B23253j22118j03288K9863J2252M5176j56088j32556J71207m8493l5429
$$ y = [166249, -7185, 3634, -7500, -132200, -89356, 30653, 211207, 109308, 115582, 47381, -61562, -128678, -175710, -213117, -147571, -128329, -63257, -10793, 5540, -81885, -55475, -30175, -102073, -131507, -79839, -35241, -60147, -94366, -150740, -96015, -85548, -48032, -16544, 47927, 160355, 229891, 328128, 223191, 101006, 2824, 21968, 66669, 50644, 13271, 83398, 36257, 58614, -30242, -93247, -189272, -209656, -131736, -91680, -174123, -227781, -160150, -999, 26358, 8829, -13469, 88445, 89950, 209210, 213031, 123584, 56039, 33495, -34434, -51381, -19314, 80372, 135955, 164130, 211711, 231224, 250458, 268643, 190794, 116201, 197664, 223253, 101135, -2153, 27710, 39962, 85138, -70950, -203506, -32299, -80792, -116221]
24315a16221J20279j43365K3895J04931j48217l3538R7317r094J37852J07954
24305A41793o7021k9556j11176M5550O2087j09507j35076K1162k3209P6230N2424
24294g6299P9198Q9866l8058M782N6914k7604p203k0872P4609q8604p5578j40541
24282a69390n168P3928Q727o5051Q7630M6892j38855K4928J12861J25526R6159
24271A98187n8541l6280j42906l4198P8598K2693j38742j17399N0849L7253Q2692
24260e7794N8721k4110j28117M9806J57275M2221j1200j09593r8821J30850J12376
24249A21614p8196n9770N5508n6523R3879L3744j37950k5315p835l9303O4014
24238c6133n4341L3922J43122j28252N6034Q4205l5510J10957K9386j22570j4617
$$ y = [-116221, 4058, -139307, -115412, -10481, -158698, -192236, -94919, -104013, 33839, 141793, 74772, 45216, -65960, -20410, 41677, -67830, -202906, -181744, -204953, -128723, -76299, 2899, 92765, 54707, 59489, 116403, 88799, 81596, 60724, 135333, 46729, -28849, -169390, -174558, -100630, -91903, -156954, -69324, -22432, -161287, -136359, -23498, 102028, 198187, 139646, 103366, -39540, -73738, 4860, 27553, -111189, -228588, -177739, -140486, -57794, 927, -23183, -151300, -101494, 55781, 98002, 86802, -22791, -121612, 9238, 121614, 43418, -16352, 39156, -17367, 76512, 110256, -27694, -53009, -60844, -100147, -36133, -90474, -56552, 86570, -41682, 14352, 98557, 63047, 174004, 203390, 80820, 66203]
24227F6203o54k5106p6830K111j33Q5373R4601j11374m6867j6501M3112P5647
24215H9582L5248p5373j9517l3771O8142K7200Q6351k7251n9587K4652j10873
24204D803o5474L7879k6721k0870J4509k6775J01626l4947n633j2216R9479R7730
24192A63390p9596p1354j62p096J54921J3191j35955j40734j1450J6671R6748
24181a426J91309K11475O9667n5121k04892k20920l2272Q4286O6628k7476j10914
24170b9656j79757o4685K23701K03539J0171r4725j65542n4177N6693j25624L630
24159b16432k3915K8673o4328J07800J14346j7083O4028R1466o0707j03216j40490
24148b19858N2252J5400K5428R6281J9470n550q1756m8376M2014L1531q3591N0911
$$ y = [66203, 65549, 40443, -36387, -34276, -34409, 50964, 145565, 34191, -12676, -29177, 13935, 89582, 124830, 49457, 29940, -3831, 64311, 91511, 177862, 150611, 91024, 115676, 4803, -60671, -22792, -49513, -70383, -55874, -82649, 18977, -15970, -21603, -33819, 65660, 163390, 83794, 12440, 12278, 5182, 160103, 173294, 37339, -103395, -114845, -98174, -1426, 189883, 401358, 471025, 415904, 211012, -9908, -42180, 42106, 108734, 81258, -29656, -209413, -274098, -50397, 153142, 163313, 68588, -96954, -151131, -94438, -220062, -216432, -240347, -211674, -276002, -168202, -53856, -70939, -6911, 84555, 23848, -79368, -219858, -167606, -152206, -126778, -30497, -11027, -16577, -98333, -146709, -104695, -73164, -156755, -105844]
24136a05844J9249J33885L3643p5009K5301q7505N348P516o7460l8197N8173L1160
24124e9740q0031R5565R3752R2737o4826J7204N7851j49777O5148k5368j62219
24113a19704l6712Q9158R716J7591J10079o7747K4685p4165j62106m8230Q9375
24102a68060N9575N7620k973j0593k6019L5983O0578J53813K0733O8759p9825
24091A69591o120L8542j55238j33308J4574n64k4596j08919R765J60111N6127
24080A9965J7094R0916r9126k3757K190j019k353K7365j0776r2189J54071J15191
24068A97572r9218r87O0332p3420k8115M6605k4615L109O6059k01176q5804J41798
24056B140J07524j219M6464o3563L007M883n6644j93817M2162J28738Q867m6703
$$ y = [-105844, -86595, 47290, 80933, 5924, 31225, -56280, -50932, -43416, -110876, -149073, -90900, -59740, -139771, -44206, 49546, 142283, 77457, 94661, 152512, 2735, 67883, 42515, -119704, -156416, -67258, -57542, -39951, 70128, 2381, 27066, -47099, -209205, -257435, -168060, -108485, -50865, -53838, -64431, -90450, -54467, 6111, 159924, 180657, 249416, 169591, 163471, 202013, 46775, -86533, -71959, -72523, -97119, -206038, -196273, -36162, 19965, 37059, 127975, 28849, 5092, 7282, 6263, 3910, 31275, 20499, -71690, 82381, 197572, 98354, 97367, 157699, 84279, 56164, 102769, 78154, 81263, 147322, -53854, -139658, 2140, 109664, 108445, 154909, 91346, 94353, 99236, 42592, -151225, -109063, 19675, 28542, -18161]
24044a8161j3354J5420K7160l2387J73629M5860m3103j9465o2416m3254j79232
24033a49303R5174L7663J45853L7104k2975R3578L8558j10172l0028j55152r3246
24022a12946K223R4863J62098r2166o8066K1533M3359q3896J33011Q3891n5958
24011A27946m8112p751j4173r6629J759l1608j37618M2230J5791J51329J1416
24000A4580L9587j1926p0007K2910J9976m8558L7780m9996q0299R9134L1029j28896
23988a24686N9750J00096q011p1519o6091M5597K482K5945N2500N8745M0053p7488
23976C7373P4333N0525R9181J17657p0005j73964J2016k3059J4867m439j00805
23965C3680M0436q5389q4338N6762L8564n9433o3094L9979l4769J13856m9124
$$ y = [-18161, -31515, -16095, 11065, -21322, 152307, 198167, 155064, 135599, 73183, 29929, -149303, -54129, -16466, 129387, 166491, 143516, 237094, 275652, 165480, 135452, -19700, -112946, -110723, -15860, 146238, 54072, -13994, 7539, 50898, -32998, 100013, 183904, 127946, 79834, 72083, 57910, -38719, -36960, -68568, -206186, -163956, -148165, 3164, 14580, 54167, 42241, -27766, -4856, 15120, -33438, 4342, -45654, -125953, -26819, 4210, -124686, -64936, 35160, 27149, -44370, -110461, -64864, -62382, -36437, 16063, 74808, 114861, 37373, 111706, 162231, 261412, 379069, 309064, 135100, 147116, 124057, 138924, 134485, 33680, 74116, -11273, -95611, -38849, -285, -59718, -122812, -82833, -117602, -3746, -52870]
23954e2870J11502K5221p9875r860R1209K6214p2873m5037R0036N1050P0028J36632
23942C41377Q3991k3166q5312r8939j16279l2564j4839r6097o6191P7526K4731
23931e762P2897k8290o3395M6263r9016p2096m87J60259L560n3270o6984P4046
23919c2275J58601N3998p3526K7117P2567j03223j00252j13409n7472R6430O5525
23908e919K0593j3936m3801j02133j5561k3155Q1293m6129m1187j6958o3518K9033
23896b41378j6540R894l6385O6579J35882K104r9509N1637j4270P1673R2697J21688
23884A44072k8696m2267p1168R0167P5910k0407k4770j07100k23099P7426K40442
23873A10510m2248n3783J6380J09392O3012n3013Q7963K6826j28762r4513L4060
$$ y = [-52870, 58632, 83853, 3978, -5882, 85327, 111541, 38668, -6369, 83667, 134717, 204745, 341377, 425368, 402202, 316890, 217951, 101672, 69108, 54269, -41828, -108019, -30493, -5762, 67135, 38845, -24550, 21713, -77303, -149399, -149886, 10373, 13933, -39337, -106321, -32275, 126326, 180324, 106798, 133915, 206482, 103259, 3007, -110402, -167874, -71444, -5919, 14674, 738, -43063, -145196, -160757, -183912, -102619, -148748, -189935, -206893, -270411, -241378, -257918, -248024, -284409, -217830, -81948, -79844, -179353, -127716, -141986, -70313, 22384, 144072, 115376, 73109, 1941, 92108, 168018, 147611, 122841, 15741, -207358, -129932, 110510, 68262, 14479, 30859, 140251, 203263, 150250, 238213, 265039, 136277, 41764, 75824]
23862G5824K484r0195o0199M061k3076l0985j9312R3319L3984P7928o9395P5046
23850F9484Q3112J18221J72102L9686k5270k53218q1349r7650m0669M6921l5805
23839d435j2178n9684R0531O7798J7340j17053L0994M1895R4004q3573q7644l6528
23827e8533j03129L4929p7937J8437k9251j9907J64009m211j05775N5818K7471
23816i8079j31172J6901J12592M442j1005N7018r1468K8921J05739jN1068o6617
23804b1661j61680k95974J54839K20788L4236M3461L9983K8866N2827j7711o8124
23793I850R6204J6072o1555J70001N4496j13480j10886r3136j07842l2505p0420
23782b43201n9295k0914N8023R8735K5307J52367N9522m3865j60677o9024O5717
$$ y = [75824, 78308, -11887, -72086, -68025, -91101, -122086, -141398, -48079, -14095, 63833, -5562, 69484, 152596, 270817, 442919, 482605, 457335, 204117, 122768, 25118, -15551, 31370, -4435, -16613, -76297, 14234, 82032, 99372, -17681, 13313, 55208, 149212, 65639, -22005, -58533, -161662, -126733, -204670, -186233, -215484, -235391, -71382, -75593, -181368, -125550, -98079, -229251, -212350, -99758, -95316, -106321, -49303, -140771, -111850, -6111, -6112, 44956, -21661, -183341, -479315, -324476, -103688, -69452, -25991, 13992, 42858, 95685, 77974, 9850, 106054, 122126, 60571, 230572, 285068, 171588, 60702, -32434, -140276, -172781, -243201, -302496, -323410, -265387, -166652, -141345, 11022, 70544, 26679, -133998, -203022, -137305]
23771a37305O1146o2782K7952m9435m8498j39880o9094m3677K37965R7398J46118
23760A9908N8350j08439n1707j08243N0275J33169L7656k0022J6615n7389K3906
23749e921J27832N2745j23226j67074m8611N3015J13177r2762n3999J1222J08245
23738b5357k7983p1541J8437O3630P7229m7689q8720L3821J59678k5028J35885
23727B02362R387p6441l6757r2109K9565J48473k2123j19510r6625J40054K3900
23716A10176R3156j2966q6914N0920p0174n5388Q063J62230o0567j69579j2824
23705d3867N817J3637O0365O1022j8230j29606J09906L493r1134J35307J63811
23694B70521j6496j05101j54984L167J2129J05647J19936r1181j40609o486J34453
$$ y = [-137305, -76159, -138941, -110989, -160424, -208922, -348802, -417896, -461573, -223608, -126210, 19908, 78258, -30181, -81888, -190131, -139856, -6687, 30969, 10947, 27562, -29827, -5921, 121911, 174656, 51430, -115644, -164255, -111240, 1937, -90825, -144824, -133602, -25357, -53340, -124881, -106444, -42814, 34415, -13274, -101994, -68173, 91505, 66477, 202362, 211749, 135308, 98551, 6442, 36007, 184480, 162357, 42847, -53778, 86276, 110176, 203332, 190366, 103452, 154372, 84198, 28810, 36873, 199103, 138536, -31043, -43867, -38050, -24413, 35952, 96974, 78744, -50862, 59044, 62537, -28597, 106710, 270521, 254025, 148924, -6060, -2893, 9236, 114883, 234819, 143638, 3029, -3457, 130996]
23683A30996J5567j36975j53095j82373M3918J25650L874M336K017j54791k8046
23672c28922O2666J1913P5512K20763J09027p6869M0146j6912k2286q8263N044
23661h181J29894J22760M6318j57207p9386j3128r4518N1317R0306o6152j83862
23650a61839K6753l5365p0004l385M1571O1314J17380j2235j69939j43941K69161
23639h0529J98312N3536j08859j34752J7665K7606L8868M2661l4097p1302M9226
23628a665k6152m8850n3584j09523o5221J10062N1270J21843k342J16282Q8959
23617A81079m4498q9648J39322O0399q0196K4558r1900O6520R8203r448j14601
23606A39790k4739L2518Q9136n6790j64726l4884l3122M2230N4454L1184p0453
$$ y = [130996, 146563, 9588, -143507, -325880, -281962, -156312, -152438, -148102, -146085, -300876, -328922, -266256, -254343, -178831, 41932, 150959, 74090, 114236, 97324, 75038, -13225, -8181, 121713, 244473, 290791, 133584, 54198, 41070, -53448, -2131, 88175, 22023, -161839, -135086, -170451, -240455, -243840, -202269, -140955, -23575, -35810, -205749, -349690, -80529, 117783, 171319, 62460, -72292, -54627, -27021, 11847, 54508, 20411, -50891, -1665, -27817, -76667, -130251, -239774, -304995, -194933, -143663, -21820, -24162, 92120, 181079, 136581, 46933, 186255, 246654, 166458, 191016, 99116, 165636, 263839, 254391, 139790, 115051, 147569, 236705, 179915, 15189, -19695, -52817, -10587, 43867, 75051, 4598]
23595D598J17176N6245j68768j97630K4883J25818Q474K1603Q9070j5605j06366
23584d0502j00490j01664L9014J50588K2779R9825R0375j79803k53086j1594O2597
23573b21961j18735N820O0173n4046J26646J46019L1899o4121M1485n9583m3743
23562a50147P8274J53290O4670l7526l2965J26795r3236j02771K4981L3601j4967
23551D9999r9288q0249R9465J33933o6087O4428K9293N5941k3787J39573O7597
23540C70818m3717O1493l6009k50608j33745r9040j09734M6575J28148O6739L4195
23529C5115q6231O6315J05720j7649n9662j82145p3015J08612L1554m600K2617
23518e3369k7708q34k0542M7771M5424R2651k9579J0330n8281o3168m5510r7531
$$ y = [4598, 121774, 178019, 9251, -188379, -163496, -37678, -29204, -7601, 81469, 65864, -40502, -140992, -242656, -203642, -53054, -30275, 69550, 159925, -19878, -272964, -284558, -221961, -340696, -334876, -274703, -328749, -202103, -56084, -24185, -88306, -46821, -106404, -150147, -71873, 81417, 146087, 108561, 75596, 202391, 109155, 6384, 31365, 64966, 49999, -49289, -129538, -30073, 103860, 37773, 102201, 131494, 187435, 163648, 303221, 370818, 327101, 388594, 352585, 101977, -31768, -130808, -240542, -193967, -65819, 920, 35115, -51116, 15199, 120919, 103270, 43608, -138537, -211552, -102940, -71386, -75986, -53369, -81077, -81911, -102453, -54682, -9258, 83393, 53814, 64144, 5863, -57305, -102815, -200346]
23506b00346L9704R6422j1451n9581N7195J90531l5570j18918m1609J9241l4881
23495i9263k5609M9612j32091K6199J72087J60319q7506j53153l6606K2582N6443
23484d6986j19586J28437R0407K1966k11572K305O7708k5484j16167L6795k9055
23473b01232M9343Q5084p9n8794Q1589k6933J20329j4574r1526O0526R8587m1090
23461F1230r6647k3657P5J32838J67141k30344J0579K9244N193l0673M6090k6667
23449D4402l4864l5192j8032j3347j6858m5791j1485N8486l5193r6124K951O6603
23437a34444J38462J15632L1244m7349L7014Q7164o7388j22573M4990l5040n0962
23426c250j74921Q4J8084P1843K4492N8620O02j45136j20298R6865K0149j3642
$$ y = [-200346, -160642, -64220, -75671, -135252, -78057, 112474, 76904, -42014, -83623, -64382, -99263, -124872, -75260, -207351, -181152, -9065, 151254, 63748, -89405, -126011, -103429, -46986, -166572, -38135, 52272, 74238, -137334, -135029, -67321, -92805, -208972, -172177, -201232, -151889, -66805, -66884, -125678, -44089, -71022, 49307, 34733, -56793, 3733, 102320, 61230, -35417, -59074, -58999, 73839, 240980, 10636, 21215, 50459, 55652, 24979, 71069, 44402, 9538, -25654, -43686, -57033, -73891, -119682, -131167, -72681, -107874, -203998, -201047, -134444, 4018, 119650, 150894, 103545, 140559, 227723, 160335, 37762, 82752, 47712, -3250, -178171, -178087, -160003, -88160, -63668, -5048, -4446, -149582, -269880, -173015, -152866, -166508]
23414a66508k3050M7913R7148k4001P826N0657N352n5857o6354j40217Q061J13920
23402a45110J56870q230j05503l6494m6855r7095l3657L6582M2948J13544Q0029
23391d2971k8717k4415j4397m4979j00089Q6871N1988M384N8603J68286R2194
23380B06758j23755p0208k6862p5979O9571P4157J1397q0512q9289m8526J4789
23369a38459K4988J58690k3830m8365l4761p5447l8742M7288J3237K1612J50717
23358E6928R8854o7551k4475k1637j09825o7961q531k2281r2838n5775K8227M5614
23346b41251Q2267j969Q3097J60163J10744m6530m4865l6792J0162m5417o1829
23335c2220J5853k8571l5032J24105P144q422R9840J5746q2075p5359p2469Q0374
$$ y = [-166508, -189558, -141645, -44497, -68498, -60672, -10015, -4663, -60520, -126874, -267091, -259030, -145110, 11760, 3530, -101973, -138467, -185322, -282417, -316074, -279492, -236544, -123000, -42971, -71688, -96103, -110500, -155479, -255568, -168697, -116709, -112325, -53722, 114564, 206758, 83003, 12795, -14067, -90046, -20475, 53682, 65079, -15433, -104722, -153248, -138459, -113471, 45219, 21389, -26976, -61737, -137184, -175926, -128638, -115401, -93789, 56928, 155782, 88231, 63756, 42119, -67706, -135667, -144198, -166479, -259317, -315092, -286865, -241251, -158984, -160953, -77856, 82307, 193051, 146521, 101656, 64864, 75026, 29609, -32220, -16367, -44938, -79970, 44135, 51279, 42857, 142697, 158443, 76368, 1009, -71460, 8914]
23323H914o15N6122R560k3405J518q6654p4745L9335J08458l6866j04276k6781
23311a29435M6439Q6861j5633K4666J43188j17303j81671M5124J03275n758j23611
23300a23858J1443r491J6029J11200K5132m9772j91113m2873K42049L858m2363
23289d9759Q3240n8495n9352J20556L6619m7067j49108m4451J39370l0387l778
23278f2612r1455q7301j3945J79332J94776J8450m9169l2165j62757N0003L4927
23267b1916J90255P7722j37721j29123k0552j47090l0257J50796J18648L7699
23257H8461J0859j7877n5485l2469J3532o7977j00195j7590Q3847K19228l2025
23246I2309r29r215j28962O698j1054M5187k5661j1540j03303J1599J71476j4160
$$ y = [8914, 8299, 64421, 73981, 50576, 52094, -34560, -109305, -69970, 38488, 1622, -102654, -129435, -82996, 3865, -11768, 12898, 156086, 38783, -142888, -97764, 5511, -247, -123858, -112415, -121906, -105877, 5323, 30455, -19317, -210430, -253303, -11254, -7396, -49759, 33481, -25014, -84366, 36190, 72809, 25742, -123366, -167817, -28447, -58834, -62612, -154067, -241368, -255313, -75981, 118795, 137245, 88076, 55911, -106846, -56843, -21916, 168339, 246061, 108340, -20783, -41335, -188425, -218682, -67886, 50762, 88461, 99320, 81443, 25958, -6511, 7021, -60956, -161151, -178741, -94894, 124334, 92309, 91380, 82165, -46797, -40099, -51153, -5966, -31627, -43167, -146470, -134871, 36605, 22445]
23234B2445m8188J4345O2854p1148m4652m6554k40L2681R5547k2709n1087m4876
23222a01582m2124N0771K00648m7014q4330j8683k3705M4550O5833L2250N699
23211H2313p8782r3971k1766L2239j8022l0562j0928J44295J29775N2250O0529
23200B47370p5318j946O55n1936n3693n882m6750j13344P1933K3611j22289r457
23188a37046K6347R6355O3522P546m9258p1497q524K0440o0729K4481N0230o3079
23176a01212N2044P9987L4452j0059j12120P257q2776p6783J97237J21560m936
23165A04651j01534l8223j961r8732M2356R3388Q4391m0743K8525M7024M0984
23154A60126m2229j37383J0012r346J2469O7208k7739n3065K602o9654m8712O1986
$$ y = [22445, -25743, -11398, 51456, -19692, -64344, -110898, -111138, -78457, 17090, -5619, -56706, -101582, -143706, -92935, 107713, 60699, -23631, -42314, -66019, -21469, 44364, 76614, 82313, 3531, -90440, -112206, -79967, -97989, -128551, -139479, 4816, 134591, 186841, 247370, 172052, 170106, 170761, 118825, 65132, 59250, 12500, -100844, -28911, -5300, -127589, -137046, -110699, -14344, 49178, 56724, 7466, -64031, -72555, -52115, -112844, -88363, -38133, -101212, -49168, 30819, 65271, 55212, -56908, -49651, -132427, -209210, -11973, 109587, 104651, 3117, -35106, -37067, -135799, -93443, -55, 84336, 43593, 72118, 119142, 160126, 117897, -19486, -9474, -18820, -6351, 60857, 33118, -19947, -17345, -86999, -135711, -73725]
23142g3725N2962j3488M8346L556K7982l4429j10467M1806J56835M1846j47911
23131f687q9838O1686Q7791R9464l1109j15647j4463q087l6724O0417K9959N2166
23119H8928M9163j34332q4254N7411J53306o0486j18628J9701J6075J15367J2040
23108A14291r5985o8395o5784r360N9194Q4764O2163J09519k5563p0385l4914
23097E9545P9727k18041q3886J35804J49639l587q3764Q3068l7624Q731J00535
23086A90147m8590k25511N2332l1163o5992J5741J6629K3226J36007M9143l4091
23075G7878j15437j02340M436m1388n3514Q3194K9823J09836J43009Q5049m3446
23064A77100j26243J9423p7934j56395R4522J51092Q3607j32584p4940k8927P7456
$$ y = [-73725, -20763, -34251, 14095, 17651, 45633, 11204, -99263, -57457, 99378, 141224, -6687, -96525, -34839, 52952, 152416, 121307, 5660, -8803, -16890, -53614, 6803, 36762, 88928, 138091, 3759, -80495, -23084, 130222, 69736, -48892, -29191, -13116, 102251, 114291, 18306, -50089, -115873, -125233, -66039, 18725, 80888, 190407, 164844, 94459, 59545, 139272, -78769, -162655, -26851, 122788, 119201, 35437, 118505, 80881, 89612, 190147, 141557, -83954, -31622, -62785, -128777, -113036, -96407, -73181, 62826, 111969, 77878, -37559, -139899, -135463, -176851, -230365, -147171, -117348, -7512, 135497, 220546, 177100, 50857, 70280, -7654, -164049, -69527, 81565, 165172, 32588, -42352, -71279, 6177]
23053F177l2402O7746r9752k2441K645J07330J61388L2195k85978j77466J07074
23042a33484J17126R2262k4267J85220P2782j05000j92219l2406J4610o6112L6972
23031c4516R6215m029q7552K5051k0191M8379m9749r3284j09438j7894J26001
23020a21007O6123J8800Q3853P326o0835L9714J3104o8587j38670L1869K2386
23009a05924l5629l262K4487l9957L3905J47955k8675r2444k1995m394p8472L5930
22997a68475J56248M3785j04905k5075m8712j59375j11344J25176N2269l3285
22987b73693J46871J83903R9184j3222j2169o0111q3087m0777M5849p5080o72
22976h3004O5321J2837R2696k8793j9498j0220K8501m830q6092j47918j4403O3673
$$ y = [6177, -26225, 41521, -58231, -80672, -78027, 29303, 190691, 222886, -63092, -240558, -133484, -16358, 75904, 51637, 236857, 309639, 204639, 12420, -19986, -5376, -71488, -34516, 61699, 57670, -29882, -4831, -25022, 23357, -26392, -119676, -229114, -247008, -121007, -54884, -36084, 47769, 55095, -5740, 33974, 47078, -21509, -160179, -128310, -105924, -141553, -144815, -120328, -160285, -126380, 21575, -7100, -99544, -121539, -125933, -204405, -168475, -12227, 31558, -73347, -98422, -147134, -306509, -417853, -292677, -240408, -273693, -126822, 57081, 156265, 143043, 130874, 70763, -12324, -53101, -7252, -82332, -83004, -17683, -4846, 87850, 59057, 39559, 29339, 57840, 53010, -33082, -181000, -195403, -131730]
22964a31730R894Q4435n7497r6578P5689N4840M1527r995o7309k0968O4891R1155
22952C8354n67J8020J20543Q5108n8624k09726N7338J05017Q2839k1895j34947
22941H1460m9786o1803J16669P8590j13665r8268k8538Q2721J58300k0029L1749
22930A77400L2440j30264J244n743j0865l7362J04538m2623o968p2254J0853M1452
22918F1848L9548j84316k24112J5561R2766P7596R3032L8044K2512J3207Q5181
22907A30867j15022j40391P3428J02262p8144j6131P90J4220N6983q9334J347
22896e9125j4953q1045k061O2196q0273q7842J6734J23099M1431J01574J60762
22885A80497m5412q8391l765l3517J83584l4263j33668j36644J05651J20889n8569
$$ y = [-131730, -121836, -37401, -94898, -191476, -115787, -60947, -19420, -29415, -96724, -117692, -52801, 38354, 37787, 55807, 176350, 261458, 202834, -6892, 50446, 155463, 238302, 216407, 81460, 31674, -30129, 86540, 165130, 51465, -46803, -75341, 7380, 165680, 145651, 177400, 209840, 79576, 80820, 75077, 64212, 26850, 131388, 88765, 81797, 9543, 20396, 61848, 101396, -82920, -307032, -291471, -198705, -121109, -28077, 9967, 32479, 45686, 130867, 15845, -124546, -51118, 51144, -27000, -43131, -42341, -28121, 28862, -60472, -59125, -74078, -155123, -157184, -94988, -175261, -263103, -246369, -123270, -81839, 19735, 180497, 135085, 46694, 42929, 9412, 192996, 158733, 25065, -111579, -5928, 114961, 56392]
22874E6392r5740J1423K2618R9193m0951J29845r5236j24423K0124m5759m5093
22863a07607M3377M4436N6880j2872k5632p0431Q3752J6499P924L2675o6642l5706
22851c3347j7972k5727j29288M9675O3890J51754J06101l7055j55177n2696o3919
22840a43761N7966l6419r1406L9273M7596n1570n5561J09464O7454j16073N6575
22829a16462J20231J14302k7172P6368P3293p8007j44049l1582M2451O0593N021
22818I4987n2523n0455J5436K3161p9044P02l2519J12194r6825O2544J37926K6689
22806A62273j16821m8525J343n4085O53J25435o3179N0952R2191q6580P2614p5649
22794F0622j17868N135J03037j09621j53465l9038l5335P7432J02633N9165l8331
$$ y = [56392, -39348, -27925, -5307, 93886, 52935, 182780, 87544, -36879, -16755, -62514, -107607, -64230, -19794, 37086, 24214, -1418, -71849, 11903, 28402, 36326, 69001, 2359, -33347, -51319, -77046, -206334, -156659, -92769, 58985, 165086, 128031, -27146, -79842, -143761, -85795, -122214, -213620, -174347, -126751, -178321, -233882, -124418, -56964, -173037, -116462, 3769, 118071, 90899, 167267, 240560, 162553, 18504, -13078, 29373, 89966, 94987, 42464, -7991, 7445, 30606, -48438, -47736, -80255, 31939, -64886, -2342, 135584, 162273, 45452, -3073, -1730, -55815, -55162, 70273, 7094, 58046, 150237, 63657, 136271, 60622, -57246, -52111, 50926, -58695, -212160, -251198, -286533, -209101, -106468, -47303, -85634]
22783h5634o3733q350q9025M0171M25n139P8697K48747N6299j16718o2193j28971
22771a35424j69144l6820M7949R8044M8892q7390k2602j216J5199j9282J69100
22760i2694J03340l5735K0359R4525m9188k5954k1922j40468o6678j19685R147
22749c24953J04399R010r3878M0315J39422J63564r2267j51912j99715J10701
22739b95314N1468O5036J74945N3602Q9752N9649j2790q6258L5517n4424N7254
22728A38437J0016K6653k19059L0741J61371N3827K1587k3942j43134o8066j57693
22717a69262p6435j1627K3791R5224Q8278K60917J36430j27381j62521k19784
22707a62370k7001K3564J29080J63202Q5487m3977O372J6228n859l6267p9102
$$ y = [-85634, -149367, -157717, -246742, -206571, -206146, -211285, -132588, 116159, 172458, 55740, -6453, -135424, -304568, -341388, -293439, -195395, -146503, -233893, -256495, -257711, -242512, -261794, -92694, 10646, -25089, -4730, 89795, 40607, 14653, -7269, -147737, -214415, -334100, -324953, -220554, -211544, -305422, -265107, -125685, 37879, -54388, -206300, -406015, -295314, -243846, -178810, -3865, 49737, 139489, 199138, 186348, 100090, 135607, 81183, 138437, 148453, 175106, -43953, -13212, 148159, 201986, 223573, 199631, 56497, -11569, -169262, -245697, -257324, -233533, -138309, -50031, 210886, 347316, 219935, 57414, -162370, -189371, -165807, -36727, 126475, 211962, 167985, 174357, 190585, 184726, 148459, 69357]
22696F9357j1329N1247j85909j520J33189j6490m8177N1395N9086L5255j9588
22685A16516l7434n4702k4503J11719L8877n3209k6467K9307k518j56132J69504
22674A10958k640P3323J2390k5367j40267n1941n92r8409k6747Q7618M1387M2817
22662B2530N1730L9838Q9505l1112O0874l3104o8145r591n6151j41892p3476k0457
22650a69451O2917O7674L5461O8428n5897r5904q2591R3937j78439J124K16406
22639c6335R3343j80877M149J12263L0166K9293r9568k8431O8859P8724l3104
22628C8482q6166l3598J01603j5979p0294J23183J39397P8659k1688q193j16307
22617A29099k02160j44774j1602Q3577J97576M7428L5330N8625j62322j18558
$$ y = [69357, 58028, 109275, -76634, -78154, 55035, 38545, -9632, 41763, 100849, 136104, 116516, 79082, 24380, -123, 111596, 150473, 97264, 70797, 100104, 97586, -58546, 110958, 108318, 181641, 194031, 168664, 28397, -23544, -24136, -122545, -149292, -61674, -20287, 22530, 74260, 114098, 203603, 172491, 233365, 200261, 132116, 122525, 66374, -75518, -148994, -169451, -106534, -38860, -3399, 65029, 9132, -86772, -169363, -75426, -253865, -252741, -36335, 57008, -123869, -119720, -7457, 22709, 52002, -47566, -75997, -7138, 71586, 38482, -47684, -81282, 20321, 4342, -65952, 57231, 196628, 275287, 253599, 245406, 129099, -73061, -217835, -229437, -145860, 51716, 99144, 134474, 193099, 30777, -87781]
22607h7781O3567R5794n6818j26876k8551J3544Q1826M952l6733j0699Q2447K2364
22595A7036J57294N2750m4360j2148K5717k8971j8730p1939n4310m5882R36J6499
22583f108L6524m5771Q0175o6667j20340M1890j5919O2664N2242R7952k473j89868
22571g5699p4832O9200J02111N3425j19940r7752Q2661J08157j8273r3689K2358
22560d2273O0036R4017J16413p9164j88858l7134N0350J28746m2910j49130j8592
22549a08499Q8032J30001k1563j18932N1820R188k08887j82028l7959R0264Q4256
22538b24307R9988o5877o0962J41678M4799J0573K1608M6058M258k44920m8740
22527b75844M9019M5076o932L4973J13874j8653O435m5665L5406O3142j67257
$$ y = [-87781, -24214, 71580, 14762, -112114, -140665, -127121, -45295, -40343, -77076, -87775, -5328, 17036, 174330, 227080, 182720, 170572, 196289, 167318, 148588, 76649, 22339, -23543, -22607, -6108, 30416, -15355, 64820, -1847, -122187, -80297, -96216, -33552, 18690, 116642, 114169, -75699, -150531, -81331, 20780, 74205, -45735, -143487, -60826, 47331, 29058, -64631, -42273, 17763, 111780, 228193, 149029, -39829, -76963, -26613, 102133, 59223, -89907, -108499, -20467, 109534, 87971, -30961, 20859, 30047, -178840, -360868, -398827, -308563, -224307, -124319, -190196, -251158, -109480, -64681, -54108, -32500, 13558, 17816, -227104, -275844, -226825, -181749, -188681, -153708, -39834, -58487, -52052, -97717, -62311, 831, -166426]
22516a66426r6762O7238J20309O5345J08528m9496q4899K0802j22979J1287K61051
22505A33998K09606r1657k18124j21962n6091k4252N235m5043R0988J0252l172
22494a10222J48168q240J9404n189Q8992J23341k3558p5889L5303j38738r4437
22483d1065Q4564J2956j10842o0959R7020M8380k633j0908J39426K8207p0690
22472A13456p0352o0157j1775L3624k0115k0045k9735m9451j61796J04158Q3722
22461h8466J15030o4433n522M1170k3406p2488l4384O4804J79664j1269o8260
22450C2440o9325n9592j02512J48392P0127L8051r666L5119p4878j7212L8542
22439B9486L7778m6592m7276p2114j11409K2850J30236j13O3191M1363J10895
$$ y = [-166426, -263188, -195950, -75641, -10296, 98232, 48736, -36163, -15361, -138340, -127053, 133998, 343604, 251947, 33823, -88139, -144230, -168482, -163247, -208290, -117302, -107050, -110222, 37946, 29706, 49110, 43921, 132913, 256254, 232696, 156807, 192110, 53372, -41065, 43499, 56455, -54387, -115346, -18326, 30054, 27421, 16513, 155939, 184146, 113456, 43104, -17053, -28828, 4796, -15319, -35364, -65099, -114550, -276346, -172188, -88466, 26564, -37869, -43391, -2221, -25627, -98115, -132499, -67695, 111969, 100700, 32440, -36885, -96477, -198989, -50597, 19530, 57581, 47915, 83034, 8156, -9056, 29486, 67264, 20672, -26604, -98718, -210127, -187277, -57041, -57154, 6037, 47400, 158295]
22428A58295K7535J1397p8322J84933J4956k04793k52045r3566P8897P4673K47198
22417A69158N0009l1550o6796p2620J0846K0986L5180N9672m7578j73294o554
22406e2541J6699Q1346Q3936K9104n5115p2798M8227J6388j54118J8690J02501
22395F2319q025M4135N6965K297j50173l5647Q1324J69171L1184j47733m6934
22384E8883R9273j1146k0324M0508q0124r9265m4750L8735K7663O0307m6067n7489
22372c3796p9579p4238Mr166P8020n3398J51893o8096j78376m1482L386K06112
22360i8716M0142n821r947j3430J03776J25389o0900r0797j22994J4205L0712
22349h8381Q8691J7816o82O7649K0670j6386Q7420r1729j68998Q354n54j15250
$$ y = [158295, 185830, 197227, 118905, 303838, 318794, 114001, -138044, -231610, -152713, -78040, 169158, 219167, 187617, 120821, 48201, 59047, 80033, 115213, 174885, 127307, -45987, -52541, -35842, 45504, 129440, 158544, 103429, 30631, 78858, 95246, -58872, -40182, 62319, 54294, 98429, 155394, 157691, 7518, -28129, 53195, 222366, 253550, 105817, 58883, 158156, 147010, 126686, 167194, 87070, -12195, -56945, -18210, 9453, 69760, 23693, -33796, -113375, -187613, -187609, -196775, -118755, -172153, -20260, -88356, -266732, -308214, -304828, -98716, -58574, -64395, -74342, -87772, 16004, 141393, 80493, -10304, -133298, -119093, -88381, 310, 18126, 17444, 85093, 105763, 89377, 176797, 85068, -83930, -75576, -76130, -191380]
22337a91380p8590N7050K6140J20816J62461o0850j03979j37145M8896J80602
22327B4021J36486K8876n5655n7481J2594p6129J37016j5291j22631j2683J26233
22316A25356K0672k7790k1561M6434j7432Q6291n7400k12037o6529P9980O8838
22305B4822p4628O2072J0332j09016P9013J51822j2667k8675k23242p6404O4527
22294a32044J15688k3292o2013k4460K07830J50633j230k4249j08623p9118n0983
22283c1861m8581q7936q2908M7296J15042N4404K4654q8664j5973J9483o5399
22272a60443J01303N5588k1587M3692n683r8657k9608R6967Q2213o0910r4052
22261i1177O6544O4318n0887J44600R4182j29935q1438N9660q289m8575l8051
$$ y = [-191380, -269970, -212920, -186780, -65964, 96497, 35647, -68332, -205477, -156581, 24021, 160507, 189383, 133728, 76247, 88841, 12712, 149728, 134437, 11806, -877, 125356, 146028, 118238, 96677, 143111, 125679, 211970, 154570, -57467, -123996, -44016, 24822, -49806, 12266, 22598, -86418, -7405, 144417, 131750, 103075, -120167, -196571, -132044, -16356, -39648, -101661, -126121, 81709, 232342, 231112, 206863, 98240, 19122, -31861, -80442, -168378, -251286, -203990, -88948, -34544, -9890, -98554, -114527, -95044, -160443, -59140, -3552, -25139, 18553, 12870, -85787, -115395, -18428, 63785, 2875, -91177, -24633, 39685, -11202, 133398, 227580, 97645, 16207, 75867, 67578, 19003, -19048]
22250a9048p3698j2303Q9114J53551J54112K1177j36565n1616M0999j35136q7615
22239e7028Q4037K2932j08781l727J8685q887l0093m0912K9857J1281J41214J06119
22227A64697m6489J5964N962P4716J82855j05618k29389j6004k0366L482M2329
22216G2139n8939r3496j6923J9842j9201k2827P5784p458n6193j05641j14214
22205c27127M8984J23577J50233R6168O6351o3218p8580m1890j4726M2992L8230
22194D0994n129N9245J70952m3493n5046L5451j55197j39416J01771R5953q85
22183A05200m166j06972O0664N3685j48155K2996J06163K843M1706O8799j1195
22172A91568r2076j07306o5153L4157k9963j6465J11389K2540P3834L2258o340
$$ y = [-19048, -92746, -105049, -15935, 137616, 291728, 312905, 176340, 124724, 165723, 30587, -57028, 27009, 49941, -58840, -62567, -43882, -52769, -82862, -123774, -93917, -82636, 58578, 164697, 118208, 134172, 140134, 214850, 397705, 292087, 62698, 46694, 26328, 29810, 72139, 13200, -80296, -97219, -77377, -96578, -119405, -43621, -51079, -107272, -212913, -327127, -278143, -154566, -4333, 91835, 158186, 94968, 16388, -25502, -40228, 2764, 40994, 35865, 95110, 266062, 222569, 167523, 202974, 47777, -91639, 10132, 106085, 105200, 101034, -5938, 54726, 108411, -39744, -16748, 89415, 92258, 133964, 202763, 191568, 99492, -7814, -72967, -38810, -68773, -85238, 26151, 48691, 122525, 154783, 148443]
22161A48443l1401j8425l2781k5451L3510k8001M0659J2425O9957K3696j6222
22150A76409k83535q5334j5501O7568o6837o0420m5654K6142L1832j1098L439
22139b62989r0042P3895J3977P9192J06944Q4769p442j19493J07339n5559M728
22128f4681j10760o0512N9093L6514Q0689J07605m2813J130K3819N0055n4312
22117B5827k0078K5886O4129j09813n9386Q9443r091j55219O2530j2681l4759
22106a33212J78986P2789j1361J4502m9805J2270K9853j13354j0282O709o228
22095i133m613k2789N0450k0582l1717J273J8046J79292Q9065j25074p1337L5054
22083H7935M7095j6261J7985l8399k6850J3028P539J1794P9570k5733l0697k11728
$$ y = [148443, 117042, 98617, 65836, 40385, 73895, 45894, 86553, 98978, 168935, 192631, 176409, -107126, -192460, -207961, -140393, -207230, -267650, -313304, -287162, -255330, -266428, -262989, -353031, -279136, -265159, -185967, -79023, 5746, -1696, -121189, -13850, -69409, -64681, -175441, -235953, -176860, -140346, -59657, 47948, 5135, 6265, 30084, 80139, 25827, 5749, 31635, 95764, -14049, -73435, 16008, 6917, -148302, -85772, -98453, -133212, 45774, 118563, 107202, 121704, 71899, 84169, 114022, 668, -9614, -2905, -9133, -13746, -36535, 13915, -6667, -38384, -37111, -19065, 160227, 249292, 124218, 52881, 87935, 135030, 118769, 136754, 98355, 71505, 84533, 92072, 103866, 183436, 157703, 127006, -84722]
22071h4722j47093K3031J2237m6378Q4821J91115L977j8946J09312J41531m5540
22060B23345j62420o5361L2933M2842R2099J324j49639J1775K336r8342j27576
22049a96684K1817J59603K341r6383O8264K8046j0393p1935r0554P8836m0189
22038a47231q7785J51789J03151o9056K4677L89k7515l5047j6830q4661K00O8114
22026a19805J12162J42778j07809m5424M7738l8412j16350l2026N9289j00516
22016a98375m2746L1575O3585J6423R9650L6203j9640J2137p174j09229J01375
22005a6216J77125k7875J28914K9534j28927j18140N4283k5109j9555q3153J16761
21994H7642J5861q8212m4039Q753Q1161n6844j19552m467R8756J57305J5388n5030
$$ y = [-84722, -231815, -208784, -196547, -242925, -158104, 33011, 36988, 18042, 127354, 268885, 223345, 60925, -4436, 28497, 71339, 163438, 164762, 15123, 26898, 29234, -69108, -196684, -174867, -15264, -12923, -109306, -41042, -12996, -23389, -95324, -185878, -107042, -147231, -235016, -83227, 19924, -49132, -24455, -24066, -51581, -86628, -103458, -188119, -187919, -119805, -7643, 135135, 27326, -18098, 29640, -8772, -125122, -157148, -97859, -198375, -241121, -209546, -145961, -129538, -29888, 6315, -13325, -1188, -8362, -117591, -16216, 160909, 133034, 261948, 291482, 162555, 44415, 98698, 73589, 54034, -29119, 87642, 103503, 15291, -28748, -19995, 61166, 4322, -115230, -119697, -20941, 136364, 151752, 96722]
21982I6722Q8220J2126j71361k15614o1693j1692J9083L1589N7823k2435K3478
21971a53754l4981p6688Q618M3396j0277j16332j09423K0353J34118k9162o6882
21960c91014j1812J8894J97650J66782J73094L7179j40459k16937n7977R7246
21950a27354J16246k4516k0730j07469J33613J63669o2881K3327R4321K7022q7066
21939A28182L3798N8382j95022l4095R9036L2947r0497N9406Q7040q8183j60265
21928f9271o8666O6860O0625n5165j5814J04959R9304o8026o7418j20375j3143
21917a46130r541q4006L2274R9707J00938q3745j26658p1408M5596M6N3423J00194
21905h9310m0887j00296Q7408O5019k0688J0633n7663l6519N0729J02925P7816
$$ y = [96722, 184942, 197068, 25707, -189907, -251600, -263292, -244209, -212620, -154797, -177232, -153754, -188735, -265423, -256805, -213409, -223686, -340018, -449441, -429088, -294970, -324132, -391014, -402826, -383932, -186282, -19500, 153594, 190773, 50314, -166623, -224600, -127354, -11108, -35624, -56354, -163823, -30210, 133459, 70578, 93905, 188226, 215248, 128182, 161980, 220362, 25340, -8755, 90281, 123228, 32731, 92137, 179177, 90994, -69271, -137937, -71077, -10452, -65617, -81431, 23528, 122832, 54806, -12612, -132987, -146130, -155671, -239677, -207403, -107696, -6758, -90503, -217161, -288569, -242973, -242927, -189504, -89310, -130197, -230493, -143085, -78066, -98754, -88121, -145784, -182303, -131574, -28649, 49167]
21894D9167J59475P3433p4084J4390l3598o1514J9998p2124L7839k4746N1047
21883A39283j40362l6910P3468K3755j10844O5815n0054j11814M6225k4220j00178
21872b25836q4069O9815J46464K39071O6760J28549r7836k15048o7505j03830
21862a43465K755Q6534O3383J32267O3652j76123r2494N8227R4056L6105l9539
21851H5358Q5687m5829j15637j53572j07976l5457K9246J05333N9666n7194L6797
21840a13578K33204J41692P8728j35027j49286p7480J34223N6942L7570m7935
21830A59053p7275M0478j2579r8972r7101p556n5683P5552Q5080R716j27257k8526
21818a35070J37152n8991l4622K5059o5363M80j6837K8980K8591J439m5711Q7852
$$ y = [49167, 208642, 282075, 207991, 222381, 188783, 127269, 147267, 75143, 112982, 88236, 139283, -1079, -37989, 35479, 59234, -51610, 14205, -35849, -147663, -101438, -125658, -225836, -309905, -240090, -93626, 145445, 212205, 340754, 242918, 27870, -39635, -143465, -140710, -54176, 9207, 141474, 205126, 29003, -63491, -5264, 88792, 124897, 85358, 171045, 125216, 9579, -143993, -251969, -287426, -258180, -152847, -93181, -150375, -113578, 119626, 261318, 340046, 205019, 55733, -21747, 112476, 169418, 206988, 159053, 81778, 122256, 109677, 10705, -86396, -93952, -149635, -74083, 10997, 20713, -106544, -135070, 2082, -56909, -91531, -66472, -131835, -131355, -148192, -119212, -90621, -89182, -134893, -47041]
21806d7041K3011K51080r19j33584l0560L6899j0595K9836j07564j04219J3427
21795h0229N9329P1351n4047o9137p4535M8439J66684J33745j18170k70668P345
21784a79893L1550l7379R1982o1641p7012m7806J25622K88904Q4620O487k4446
21773B00988j10925j68085L0399J45791p325p9020J01841J58640q316j38831o5807
21762E9350M8527k7825r9932r4946P7152N2041k3942o0335j13981j5819L5909
21751a63801K1424k9364o0604Q5527n9722P2168J82188L5902m6715j9892K8513
21740D5624l314j9081k9025R4677J88162r5701r3618K2477J12523M6125R411P4817
21728C53077r3678j09458o4446r2740j12628k1136L2692J13333k2639M2450J859
$$ y = [-47041, -24030, 227050, 226131, 92547, 61987, 98886, 88291, 118127, 10563, -93656, -80229, -20900, 50451, -3596, -72733, -147268, -98829, 67855, 201600, 83430, -187238, -179893, -148343, -185722, -93740, -155381, -232393, -280199, -154577, 134327, 218947, 225434, 200988, 90063, -78022, -47623, 98168, 90843, 11823, 113664, 272304, 263988, 125157, 59350, 107877, 80052, -19880, -114826, -37674, 14367, -9575, -69910, -183891, -199710, -163801, -142377, -171741, -232345, -146818, -206540, -134372, 47816, 83718, 37003, 17111, 45624, 42310, 23229, -5796, 88881, 277043, 181342, 87724, 110201, 222724, 268849, 278260, 353077, 259399, 149941, 85495, -7245, -119873, -141009, -108317, 5016, -17623, 24827, 26686]
21717B6686j3449n7056K3146j27914K4559J0106J11518Q9608P231o2123j79301
21706a46989K8857m3923k9774K8610N5493M5627L0406j6483j9493p591O2696P2645
21694F0081p1206L4905j1504j0950m8408n5447P8364P2979J26399N975m3691L143
21682A40640m8752M572j41063q8688k7573M6823o2759r8253P5459M8335N9417
21671i1842O0467j2951k01075j55015n1578J47163K81089L5358l426r9884o8258
21660a59952L2074J45001j3173r9514R3410J60886n417n5139m7789r5450j7765
21649f2828o928K3222J48989P0017J7175j22750Q761J32826j10220n3437J42412
21638A87239j20827n2479J00047n989m2641k720k896O1821k3257o2858l5657j9320
$$ y = [26686, 13237, -43819, -20673, -148587, -124028, -113922, -2404, 87204, 94435, 32312, -146989, -118132, -162055, -191829, -163219, -107726, -62099, -31693, -48176, -67669, -75260, -12564, 60081, -11125, 23780, 12276, 1326, -47082, -102529, -24165, 48814, 175213, 181188, 137497, 140640, 91888, 96460, -44603, -133291, -160864, -114041, -176800, -275053, -199594, -151259, -91842, -31375, -44326, -245401, -400416, -451994, -304831, -23742, 11616, 8190, -91694, -159952, -127878, 17123, 3950, -95564, -2154, 158732, 153315, 98176, 50387, -45063, -62828, -69756, -46534, 102455, 172472, 189647, 66897, 75658, 208484, 98264, 44827, 187239, 66412, 13933, 113980, 107991, 65350, 62630, 59734, 121555, 98298, 35440, -217, -19537]
21626a9537j12018o8768J86114K1105o0500l2883L805J03852J08872j5843P7881
21615A92080L3331N6429J18834L0536o6033k39941q2310m6463j09131O314L3533
21604g2821O510R3403J0779n7702k2558J5253r180M1647j763p2391p3490j23043
21592b65356J5851J07936J52754J70212j76672M7187m527n8371L3057J21889J4640
21581A58600j95664r0575O1762O4697q9894p9324J94691J28899K1377O852p1476
21570A09945j39541j02776l6682P5552L9106o2123k8670J36213P3746J01483L0656
21559A96909M5229N0250j0359j20242n4566o2839j09647N0746K7426l2790p0240
21548i0123J07923M9283l5134Q8229m9997j12005L7284k2660j17934N0714K0765
$$ y = [-19537, -131555, -200323, -14209, 6896, -53604, -86487, -82682, 21170, 130042, 114199, 192080, 225411, 281840, 400674, 431210, 365177, 125236, 42926, -3537, -112668, -106354, -72821, -66311, 27092, 37871, -19831, -42389, -27136, -36316, 5331, 3568, -68823, -142313, -265356, -249505, -141569, 11185, 181397, 4725, 51912, 47385, -10986, 22071, 143960, 158600, -37064, -127639, -65877, -1180, -91074, -170398, 24293, 153192, 174569, 181421, 109945, -29596, -132372, -169054, -93502, -54396, -116519, -145189, -8976, 64770, 166253, 196909, 242138, 292388, 282029, 161787, 107221, 44382, -65265, -14519, 12907, -19883, -90123, 17800, 67083, 31949, 120178, 70181, -41824, -4540, -27200, -145134, -94420, -73655]
21537g3655o9316r2199k9226K46831J44323M1391p4886k4075J9071n8182m37P8413
21525A08053j4849n7601N4200O8j11366J39629J38264l268k35686q5722n720k0996
21513i4994n7147k001Q7345o3988p9961J39862n3645K0438P4780J11090Q5222
21502A67001O695j18590m8379p4272J7146J38229J26622P8109j07759N2608r0458
21491A46952j22244l0371j10452l880M5808k957q8236o5313j2993q1965m1307
21480c66958J01919J50066J67014m2773r7084n302M1480o0859J16434K19753O9432
21469B93122J6j39898k69882M8159J92073k4758k08619N623k9658m4254q8123
21458b66199p970J8237Q7147K2799J9742k0216J0032m1140o3730j6410N2723L7840
$$ y = [-73655, -142971, -235170, -264396, -17565, 126758, 168149, 93263, 69188, 88259, 30077, 29640, 108053, 93204, 35603, 89803, 89871, -21495, 118134, 256398, 253130, 17444, -68278, -73998, -94994, -152141, -154142, -66797, -130785, -210746, -70884, -124529, -104091, -29311, 81779, 167001, 173696, 55106, 6727, -67545, -50399, 87830, 214452, 292561, 184802, 237410, 146952, 24708, -5663, -116115, -119995, -74187, -77144, -165380, -230693, -243686, -325651, -366958, -265039, -114973, 52041, 9268, -87816, -93118, -51638, -112497, 3937, 223690, 293122, 293138, 153240, -116642, -68483, 123590, 98832, -109787, -104164, -133822, -178076, -266199, -274169, -255932, -168785, -145986, -126244, -146460, -136428, -177568, -241298, -257708, -204985, -167145]
21446a67145P760m9441j1160P8960K15820J34223m6224j03151o3253J30713p9776
21435D7326j38501k712J43624l3980o5613O4033M3857o8886o6651K1300n0656
21424a06859K4886P7607k3781k8817j03858Q1655J0153J0679N3985m8878r7573
21413a50801j3116l8658O2145J90024O8117K7045j60299p6053q7788R1538J05647
21402A7801P9516o746l676j3390k1709k3970q3039j9235M4038j5587O9248r4561
21390g1310J16880J33782p953P71o7884p4212l7441k2049L4022o126R7009k1009
21378G4480R6105j16237q9820J00203Q7064o1450j44873l8298l2711J37118K2397
21367C3978j0952R8361p5976n6766J28917R0866j63496j16751q4473r4371N8636
$$ y = [-167145, -159385, -208826, -219986, -141026, 74794, 209017, 162793, 59642, -3611, 127102, 47326, -91175, -93887, 49737, 15757, -49856, 14177, 58034, -10852, -77503, -56203, -106859, -81973, -4366, -28147, -56964, -160822, -79167, -69014, -58335, -4350, -53228, -150801, -163917, -202575, -140430, 49594, 117711, 144756, -15543, -91596, -179384, -87846, 17801, 97317, 90571, 86895, 73505, 51796, 27826, -55213, -74448, -30410, -45997, 23251, -71310, 45570, 179352, 171399, 172170, 104286, 30074, -7367, -29416, 4606, -1520, 95489, 74480, 170585, 54348, -35472, 64731, 151795, 90345, -54528, -92826, -125537, 11581, 33978, 23026, 121387, 45411, -11355, 117562, 208428, 44932, -71819, -156292, -250663, -192027]
21356a92027P1043K4484m1626K9347J4092k7884L4563M426o7985M4170l3069L6044
21344a04422q6556K7829O1970J6888M5420k1715M4135O0352q9603j42690Q1587
21333a06805J71079l4185j6655J9389J32883j6033j86075j8515O4683j04533r1280
21322a86047R7302N9824L0594J05718r4356n0116O9670n4653j70654O9621Q0326
21311d2771j04123R1818K1949r147J2091m0086m5287n5216Q1494k698l683j8810
21299a14469N6830N1667k07459o1805J11310L7790J20215R156O3929L0751m635
21288I3280k7208M6674M3556m3084M6362m1517o3073j76925m1980P3799k097L5727
21276e6486K6386L4290J03512J36018J482M787l7987o4544k2921k9485q9493n0745
$$ y = [-192027, -120984, -96500, -138126, -108779, -94687, -122571, -88008, -83582, -151567, -107397, -140466, -104422, -190978, -163149, -101179, -84291, -38871, -60586, -16451, 43901, -45702, -188392, -106805, 64274, 30089, 13434, 32823, 165706, 149673, -36402, -54917, 9766, -94767, -186047, -88745, -28921, 1673, 107391, 13035, -37081, 32589, -22064, -192718, -123097, -42771, -146894, -55076, -33127, -42274, -30183, -70269, -115556, -170772, -89278, -91976, -95659, -114469, -57639, -5972, -213431, -275236, -163926, -126136, -5921, 3235, 67164, 97915, 93280, 66072, 112746, 156302, 113218, 159580, 118063, 54990, -121935, -163915, -90116, -92213, -56486, -30100, 4190, 107702, 243720, 245202, 249989, 212002, 147458, 124537, 95052, 5559, -45186]
21264d5186r9293R026O1806j10525l3786J01645L6420J05659K55381N1652K9925
21253C62724n4o6252j75815j28043M2969q8387q7482J28262l6818l2617K51760
21242A70247J50402j35089n2137j6923n6492k8552l5699K3847J3828M812O148
21231D4392J8496M5334k30086r3572J2757o919L2152P1698P7771M3646q7222o2038
21219a33591q2955l8467l9178J12880J11120o741J15464K7813j1427l9596Q1371
21208I6693o0783j7185l8018r7266J2765L9441Q2782R8748p4378o8092p9010L2098
21196g2205k6880k5501j04056N4345J36508l80K27320J0170o7277N9054j33184
21185E7914j21042j8148J08341J40324J29520n4714m9784p1500J11173K3460k4673
$$ y = [-45186, -144479, -135453, -73647, -184172, -217958, -116313, -79893, 25766, 281147, 332799, 362724, 362670, 296418, 120603, -7440, 35529, -52858, -140340, -12078, -48896, -81513, 170247, 320649, 185560, 133423, 116500, 60008, 31456, -4243, 19604, 33432, 38244, 44392, 62888, 108222, -121864, -215436, -202679, -209598, -177446, -105748, -27977, 15669, -71553, -133591, -216546, -255013, -294191, -181311, -70191, -76932, 38532, 66345, 54918, 15322, 96693, 35910, 18725, -19293, -116559, -103794, -64353, 18429, 117177, 42799, -25293, -104303, -72205, -99085, -124586, -228642, -174297, -37789, -38169, 189151, 199321, 132044, 191098, 57914, -63128, -81276, 27065, 167389, 296909, 242195, 192411, 120911, 232084, 255544, 230871]
21174B30871N6041k1561p6269O4086Q8818r971j01976j66298q9746K994j2260
21163c5271j00979k5569N6317J50279M0534j12988n2274n3443l968Q1025J4075
21152d2262J4244K433J68k8299J1314J09726J29993j40086k9600o353l7999J03209
21140H6488n7436P6676j8232q7853p5809J17707N1713P9812O1339q9455j76867
21129c1917N1474k2343m4430l4876J49612N5451j45485j13539J0023J10457M5303
21118B9730J3489m0338r8967J86102Q7054J6773k9385j2663j0901j00881q1053
21107d1040j936M1210k0402J59274M4762n2918l5379P091j8102k5887p868N8963
21095A07768N6957J4481o8246q3750j04008M74N6412N7911o6015k7176K6127J07452
$$ y = [230871, 286912, 265351, 189082, 253168, 341986, 332015, 230039, 63741, -26005, -23011, -35271, -136250, -161819, -105502, 44777, 85311, -27677, -79951, -133394, -137362, -56337, -42262, -28018, -25585, -25417, -53716, -42402, 67324, 197317, 57231, 27631, 21278, -16721, 86488, 29052, 105728, 87496, -357, -76166, 41541, 93254, 173066, 234405, 144950, -31917, 19557, -2786, -47216, -82092, 67520, 122971, -22514, -136053, -126030, -15573, 29730, 43219, 2881, -96086, 90016, 177070, 193843, 164458, 151795, 140894, 40013, -41040, -42976, -1766, -22168, 137106, 181868, 128950, 93571, 100662, 82560, 56673, 48805, 107768, 164725, 179206, 110960, 27210, -76798, -76324, -19912, 37999, -28016, -55192, -29065, 78387]
21083G8387n6756m5612n0432j4349l892J340j34082o8236J60092o0776K9396J25985
21071c8935O7827m3807J30385N5643m6561k2810K8416L6971j5783k1908k8803
21060A00635N1064N4446j18082q4173P2094o334j43108m6469L6013n2734M9700
21049h6948P7904J54535J0202j10200j6971j7413N1490R0089J57974N7279n8652
21038C09289j41557k15296N6642Q0845M1535k9885j12131N0974N5741m6605k4499
21027B5053o1892k8630Q6550o7547k9687R215q295q9792P5697N5392r7568l1079
21015a62583m6976J6909l7636J44901R8765n9580n5143J2723N8262j95149p4971
21004c00478J75293o4659L6331J07552l0328K04223R3572r8244q9130p4013O8217
$$ y = [78387, 21631, -23981, -74413, -88762, -92654, -91314, -225396, -293632, -133540, -194316, -164920, -38935, 28892, -14915, 115470, 171113, 124552, 101742, 130158, 167129, 151346, 129438, 100635, 151699, 206145, 88063, 3890, 75984, 69650, -73458, -119927, -83914, -136648, -86948, -9044, 145491, 155693, 45493, 28522, 11109, 62599, 152688, 310662, 367941, 309289, 167732, -47564, 9078, 89923, 131458, 101573, -10558, 40416, 96157, 49552, 25053, -36839, -65469, 21081, -46466, -76153, -66938, -75233, -165025, -89328, -33936, -131504, -162583, -209559, -192650, -230286, -85385, 13380, -46200, -101343, -88620, -30358, -225507, -300478, -125185, -189844, -153513, -45961, -76289, 127934, 221506, 123262, 34132, -39881, 28336]
20993B8336J60473O2126k4554j7086j02059k2564K5625J06491Q775n36q8211n4970
20981H1846Q8832K21r7710j20376k8957J7584q8250j22805N3716R0550R1715M6322
20969A2688O0655J946n5677N0111M2659M6371R5200P421p1390Q1289J99o9471
20957B02001K9725j01236j4806l0384j22241m4983j6690r007j13105q2471J04054
20946a99143N2130M187J50476O1907m5020l4585P423J05540J00556o3883p6577
20935F3011J3413J9085k0030L9889j17106j9948n4008L9226J03373J34392J19266
20924C20563j27400j62845n7457m3744J20091P8341p840R0044r6848n9524O5906
20913A19287k3513N1701L438o5748r638n2898o6917J16011J7324N9404K2085n5420
$$ y = [28336, 188809, 250935, 226381, 209295, 107236, 84672, 110297, 216788, 225563, 225027, 136816, 81846, 170678, 170899, 73189, -47187, -76144, -58560, -146810, -269615, -215899, -125349, -33634, 12688, 73343, 75289, 19612, 69723, 112382, 158753, 253953, 261374, 189984, 271273, 271472, 202001, 231726, 130490, 115684, 85300, -36941, -81924, -98614, -107621, -220726, -303197, -199143, -147013, -142826, 7650, 69557, 24537, -10048, -2625, 102915, 203471, 139588, 63011, 76424, 95509, 75479, 115368, -1738, -21686, -75694, -36468, 66905, 201297, 320563, 193163, 30318, -27139, -70883, 49208, 127549, 119709, 209753, 112905, 53381, 119287, 95774, 147475, 150913, 85165, 75527, 22629, -44288, 71723, 89047, 148451, 170536, 115116]
20901A15116j01313o0950M4167j8111j77112r9799Q4088J45131J33628J03105
20891A67950N5146j06511l3298N0991p7759N1840J28387q1898n7364M8436q3000
20880F2920P9578R7872J68j53770J8341J59534j18611k35673J0131Q8272M3173
20869E1935J25484N845j13836K5565Q4003p9545J4175M6955j02871r2220O7746
20858C3236K3705m6641J09284P6616m7484O4776l2592J9583K2222j5285L6910
20847B44330j58859j48823o6250J23197J80445l275N4127k2245n8494n2378j58083
20836f6308J06132r4900K1496j87107J7549O1066P6582m2787o1091K6077J56916
20825A3625J13060m6348N098L1780m5630k02723n2592J01595R899L24N2309J04221
$$ y = [115116, 13803, -47147, -2980, -21091, -198203, -298002, -213914, -68783, 64845, 167950, 223096, 116585, 83287, 134278, 56519, 108359, 236746, 154848, 97484, 145920, 62920, 142498, 240370, 240538, 86768, 105109, 264643, 146032, -89641, -79510, 8762, 51935, 177419, 183264, 69428, 94993, 178996, 99451, 113626, 160581, 57710, -34510, 33236, 56941, 10300, 119584, 196200, 148716, 213492, 180900, 200483, 222705, 207420, 244330, 85471, -63352, -129602, -6405, 174040, 170765, 224892, 202647, 144153, 91775, -66308, 39824, -55076, -33580, -220687, -203138, -142072, -65490, -108277, -169368, -143291, 13625, 126685, 80337, 85435, 117215, 71585, -131138, -183730, -82135, -72236, -71912, -19603, 84618]
20813H4618k8636k2365j24561j7077J18710J8100J8576O5696L7746N4131P215
20802B12153l6392Q4877k5121j8977O771j45458J9787M6657J39715J32234Q2966
20791D99212N2092j85148N4128m5955n3468J62621N6407N9756J27122J66463J50481
20780A043711O3903J00671M2863L7289K4400J4354q0467j05639j02264M8342J87522
20769A274685J21932R3841K5304j05533N2690j69147k16997j70936k296P1692
20759I75235j62352k40542m5987l3216j00771r9074K8261n1531n0902j8974J923
20748B02070p907K4557P5785L1364n2053q6348p0322n0007L6916P0330n5415K0031
20736A39001p9111N1013k5140o9028l4296p4723R941K63553J03627p6622q5217
$$ y = [84618, 55982, 33617, -90944, -108021, 10689, 28789, 47365, 113061, 150807, 204938, 212153, 175761, 260638, 235517, 216540, 223311, 77853, 97640, 144297, 284012, 416246, 499212, 551304, 366156, 420284, 374329, 320861, 483482, 539889, 599645, 726767, 893230, 1043711, 1107614, 1208285, 1251148, 1288437, 1312837, 1327191, 1246724, 1141085, 1038821, 1087163, 1274685, 1396617, 1490458, 1515762, 1410229, 1462919, 1293772, 1076775, 905839, 903543, 975235, 812883, 572341, 526354, 493138, 392367, 293293, 321554, 270023, 219121, 200147, 202070, 194163, 218720, 294505, 325869, 273816, 187468, 117146, 67139, 104055, 174385, 118970, 139001, 59890, 110903, 85763, 16735, -17561, -92284, -82343, 181210, 284837, 208215, 122998]
20725A22998j5352r4485J0670j7115Q493O3905m4730P7268P5489N372o8697P6396
20713B00212o6676k8501n1314N6372M1636j8342j01577M071Q1142j28879l3654
20702d5510K9259J88497K2690j66784r2835J26341J1161m3313J79632M9891j01330
20691A57699l8339Q146M5144L8690P3485j16532m7576Q0779q5009j105O2760r122
20679A69020P740M5007J9872M9543m8536r6646k0901j06776l9217P5772N2925
20668A07803q513N0498k6537k4432M1151l8530r5917P2942J93590P5652j60641
20657A87066j78278j03673J16188P138O010n104J6581J35093l4433j55755M773
20646d394J47490r940r7912j12977l0800O5565K5164R6153J7554J14556L013n2326
$$ y = [122998, 107646, 13161, 23831, 6716, 15209, 79114, 34384, 111652, 187141, 192513, 123816, 200212, 133536, 105035, 53721, 110093, 151729, 133387, 31810, 35881, 117023, -11856, -45510, -16251, 172246, 194936, 28152, -64683, 61658, 72819, 29506, 209138, 259029, 157699, 119360, 127506, 172650, 211340, 284825, 168293, 120717, 201496, 116487, 115382, 178142, 169020, 176760, 221767, 241639, 291182, 242646, 146000, 125099, 18323, -20894, 54878, 107803, 99290, 149788, 123251, 98819, 139970, 101440, 5523, 78465, 272055, 347707, 187066, 8788, -94885, 21303, 28441, 34451, 29347, 45928, 181021, 146588, -9167, -4394, 143096, 133156, 35244, -77733, -108533, -42968, -17804, 78349, 95903, 210459, 213472, 161146]
20634A61146o8267j41195P1496Q6431K38147j4043k41908j22651J8727p8802k9357
20623a20276K2322J01522n8875L7235J42409J13447p4513j14148l1391m2721N0528
20612B5539P8074m542j20861j26815M0711Q8320J08384K9400k6193N6508r8072
20601E0453O472K34581J84769j95022j33006r0596n6451O9136R5363m4013m1251
20590H0435r2881j42301k9258K04722L2326L6578o3882P410N6984m599l108N6509
20578A38935J4126k5519l709J27729K3353j27252j21944J7616J6207n4442m0699
20567c5599K9864L2809J27847J3598j61921k3854O11N2034J59884K00411l4929
20556C60755j45561m2317O1944O0150Q8596p8191j373J8420J5412j1968j6940
$$ y = [161146, 92879, -48316, 23180, 109611, 347758, 333715, 91807, -30844, -12117, -90919, -120276, -97954, 3568, -55307, -18072, 124337, 237784, 163271, 49123, 17732, -24989, 25539, 103613, 99071, -21790, -148605, -107894, -19574, 88810, 118210, 92017, 148525, 50453, 56925, 291506, 476275, 281253, 148247, 57651, 1200, 70336, 165699, 121686, 80435, -12446, -154747, -184005, 20717, 53043, 89621, 25739, 33149, 90133, 85534, 82426, 138935, 153061, 127542, 123833, 251562, 274915, 147663, 25719, 43335, 59542, 5100, -35599, -5735, 27074, 154921, 168519, 6598, -17256, -16645, 35389, 195273, 395684, 360755, 215194, 172877, 234821, 294971, 383567, 305376, 304003, 322423, 337835, 325867, 308927]
20545C08927m3816j00391j3785j16388k3371R6245J9557k6616k5044n4093R6073
20534A17298j8154q6347O3718K6733j8177O2063N6376k2630K9799j00660M839
20523A14858p428Q746L4538J7971J2917q1010r5334M0605J39416K0235O9800M5256
20511C20570l2574j24966O3839L8535j1008K3762j695J42883M566j1391J13788
20500E26309m2281j54163k1492k0252K2273j6964N7199J6195M2521O9064N0618
20489E29027o335Q005r8070n2402n566n0984n9937m9265j57653r8003M2336J89233
20477A90386J53695o1401m703O8921q332k3890p697J8887m1364o6712N8950Q535
20465B85275o4481J7782P7392P7278N3978m1544j75184m3136J09103O0947l7070
$$ y = [308927, 265111, 164720, 150935, 34547, 11176, 107421, 126978, 100362, 75318, 21225, 117298, 99144, 12797, 76515, 103248, 85071, 147134, 203510, 180880, 210679, 110019, 114858, 107430, 116176, 150714, 168685, 181602, 100592, 5258, 45863, 185279, 205514, 275314, 320570, 287996, 163030, 226869, 265404, 254396, 278158, 276463, 419346, 423912, 412521, 526309, 484028, 329865, 308373, 288121, 310394, 293430, 350629, 366824, 409345, 478409, 529027, 522692, 530697, 432627, 380225, 374659, 323675, 263738, 214473, 56820, -41183, 1153, 190386, 344081, 282680, 277977, 346898, 338566, 314676, 306979, 325866, 284502, 217790, 276740, 285275, 220794, 238576, 315968, 393246, 447224, 405680, 230496, 187360, 296463, 357410, 320340]
20454C20340K0226K9436q9056p8565j40754M5876J2542r472j578m7448R3768P9911
20442B35226j1661j09193P1085J32600j2761N094K521r7578Q6959J64634K8222
20431D95148r8795J98421O6042m9085k1405j8221J7185P7393J09632r2576j53110
20420E30629P6774K0751N4871j03399k31819j74730R4625Q5433j9687j6689O7191
20409C83950l0171n5927P9715l9291j24046R0794K24408J18967p6636o158p2642
20398D92963j65438n5466Q0504J1079J97745N0482N1600n7163q1774n4813Q079
20387D77798l977R0779m5231k8967K2431q0454q90J33875L8871J08372J68348
20376H80955N4242P5661p2543J4573j07839k625k7486q4917j28436J0654J5560
$$ y = [320340, 340566, 370002, 280946, 202381, 61627, 107503, 120045, 110573, 108995, 61547, 155315, 235226, 223565, 114372, 185457, 318057, 305296, 310390, 312911, 215333, 302292, 466926, 495148, 396353, 594774, 660816, 611731, 590326, 572105, 589290, 666683, 776315, 683739, 530629, 607403, 628154, 683025, 579626, 347807, 173077, 267702, 353135, 333448, 316759, 383950, 353779, 297852, 377567, 338276, 214230, 305024, 529432, 648399, 571763, 565605, 492963, 327525, 272059, 352563, 363642, 561387, 611869, 663469, 606306, 524532, 469719, 477798, 473821, 564600, 519369, 490402, 512833, 432379, 431489, 565364, 604235, 712607, 880955, 935197, 1010858, 938315, 952888, 845049, 842424, 814938, 730021, 601585, 612239, 627799]
20365F27799l9944n9152j8966N3644L9598K9222r5571n9193J977O7259Q1531k5473
20353F02731j51197M0368J39133J18475r0733m6329P3366R0091J03500J52058
20343A031463J02214Q3057M1291J57327K2486J5248j76006k9892Q2683l2941J73379
20332A470309J34466j20001j33612p4522q550k6193r0265l2440L1454M7185l7577
20321A160254n6613k0997M0475l3783p4104J1756o3882O1012J32512J46589M9404
20310A352623k0289Q8633K11930L9122P5567J61015l2023o33K17125J13312J67581
20299B373963J24472P4892M6557J19159J14377K848P5812R6551L1661K41190L16774
20288C618256K48579O9533J21782R8182L66955K56391K24966L44893N18848Q02291
$$ y = [627799, 587855, 528703, 509737, 563381, 602979, 632201, 536630, 477437, 479414, 546673, 628204, 602731, 451534, 491902, 631035, 749510, 658777, 612448, 685814, 775905, 879405, 1031463, 1133677, 1216734, 1258025, 1415352, 1437838, 1453086, 1277080, 1247188, 1329871, 1296930, 1470309, 1604775, 1484774, 1351162, 1276640, 1268090, 1241897, 1151632, 1119192, 1150646, 1197831, 1160254, 1103641, 1082644, 1123119, 1089336, 1015232, 1026988, 963106, 1024118, 1156630, 1303219, 1352623, 1332334, 1420967, 1632897, 1672019, 1747586, 1908601, 1876578, 1875945, 2093070, 2206382, 2373963, 2498435, 2573327, 2619884, 2739043, 2853420, 2856268, 2932080, 3028631, 3060292, 3301482, 3618256, 3866835, 3936368, 4058150, 4156332, 4523287, 4779678, 5004644, 5349537, 5868385, 6670676]
20278F670676P96139Q21093R93963J246060J279862J401765J480232J699633J752842
20269A8142265J950658K206541K330528K630614L234266L770649M849073O586071
20261D5700665R512696J4066742J9064792K1379641K1513220K1348633K2641241
20254A75227630K3061278J9870928J4244442Q162677K814788l605488o941042
20247B32835213l230143J684193Q83458l693551l441005J293017N754186O573227
20239B38658595J746516l665976j0568342j8601992k3695213k5262257k4197694
20232A34413637k3943447k3445745k0140715j5009733j0389216p356212n353096
20225B8775473l975260l100415k491495k027965j824104j649224j413011j144519
$$ y = [6670676, 7466815, 8287908, 9281871, 10527931, 11807793, 13209558, 14689790, 16389423, 18142265, 20092923, 22299464, 24629992, 27260606, 30494872, 34265521, 39114594, 45700665, 55213361, 69280103, 88344895, 109724536, 131237756, 152586389, 175227630, 198288908, 218159836, 232404278, 240566955, 243381743, 239776255, 232835213, 229605070, 231289263, 232172721, 228479170, 225038165, 226331182, 232085368, 238658595, 240405111, 236739135, 226170793, 207568801, 183873588, 158611331, 134413637, 110470190, 87024445, 66883730, 51873997, 41484781, 34128569, 28775473, 24800213, 21699798, 19208303, 17180338, 15356234, 13707010, 12293999, 11149480]
20217A1149480j130878j131082j004486p64288o29350n39875l86435o15504m52015
20208D495567l67288k68678j66646K5454j53720k24958k19859k8430K3056o3594
20198C050904m2437j53652j53424j44748k02663k2316k7841R3730j23776j33473
20188B140304k21484o9583j32077o0475j11188k22645j99109j02734n2755O7554
20178A035808J12169J01034j07301J1973J43175L2966p8745q7989j89024j6783
20168I57283j0691k6587k28729N3632R6474J02142K6090q3416o0486m6071r6429
20157F83212k1429J09349J01344J0675n9508j817K0084P1130K54540L4174k18010
20146I83744k42058j55752L2019J16839N3627j20907l3635j00367j9555j1450
$$ y = [11149480, 10018602, 8887520, 7883034, 7118746, 6489396, 5949521, 5563086, 4947582, 4495567, 4128279, 3859601, 3692955, 3718409, 3564689, 3339731, 3119872, 3091442, 3114498, 3050904, 3008467, 2854815, 2701391, 2556643, 2353980, 2331664, 2303823, 2397553, 2273777, 2140304, 1918820, 1849237, 1717160, 1656685, 1545497, 1322852, 1123743, 1021009, 968254, 1035808, 1147977, 1249011, 1141710, 1153683, 1296858, 1329824, 1251079, 1163090, 974066, 957283, 946592, 920005, 691276, 744908, 841382, 943524, 969614, 886198, 825712, 779641, 683212, 661783, 771132, 872476, 883151, 823643, 821826, 841910, 913040, 1167580, 1201754, 983744, 741686, 585934, 617953, 734792, 788419, 667512, 633877, 533510, 513955, 502505]
20136E02505n4789J75560J12178J21115J57496l4153P427o1248r5573n1202k9152
20125G50164n1302K41k9377j7095K7760J4016J8789r164j68967j38346M7037P1127
20113E14883J87042N5690k5267n0754k6491p8408N140k1830l5995P3740n3548
20102E44202K4396J06828k2865L1967N7051J36633j2535K4327J7771O7119J06244
20091A081138J51483m4495j63553j16442J8822j03914J3822J62862J28991j26919
20081A001795j35742p2705Q220k0522q2851N778n0098j83506o0241R5362J2728
20070E18218p0427j32574J457m6588r9876l9695N6319J99559P4938j7283p4543
20059C69505K6148M1471o4758l8207N7290O2579j4359K4102j32011l6988K9420
$$ y = [502505, 447716, 623276, 735454, 856569, 1014065, 979912, 987339, 926091, 830518, 779316, 750164, 698862, 699103, 669726, 652631, 680391, 694407, 713196, 704032, 535065, 396719, 443756, 514883, 701925, 757615, 732348, 681594, 655103, 576695, 581835, 560005, 524010, 597750, 544202, 568598, 675426, 652561, 684528, 741579, 878212, 865677, 890004, 907775, 974894, 1081138, 1232621, 1188126, 1024573, 908131, 926953, 823039, 836861, 999723, 1128714, 1001795, 866053, 793348, 801568, 781046, 698195, 703973, 653875, 470369, 410128, 505490, 518218, 447791, 315217, 316674, 270086, 170210, 130515, 186834, 386393, 461331, 444048, 369505, 395653, 437124, 372366, 334159, 391449, 454028, 439669, 463771, 331760, 294772, 324192]
20048C24192j63762L5617J65331p2025k3453Q0141K4744l4803K9649j02408q9586
20037A73637N2044p3168p2965K0794M1708J32760J18352K6205j3995j10432l0518
20026B64422k455J0018P3593K8166j0715j23216l3568P4612p3826n4112R8389
20015B51308p7751r7455k2078J92192O3140l2207L3066p8468j29561J7814J60456
20004B80456R350p0927r5888j83542k2876J62777O9842R2808N0286o5136j13584
19993A13566J75900J50508j45447j39257K5755N088l0102Q0211j5262q2542k7546
19982A10872J4197P0512M6553L833J99567r598l966K6004j27501j37960j70964
19971B1549K5665O5059J29231J19144j6960R4386N6543M0326P5337j03139k8067
$$ y = [324192, 160430, 196047, 361378, 289353, 265900, 346041, 370785, 335982, 365631, 263223, 173637, 225681, 152513, 79548, 100342, 142050, 274810, 393162, 419367, 405372, 294940, 264422, 261967, 271985, 345578, 373744, 363029, 239813, 206245, 280857, 207031, 152919, 251308, 173557, 76102, 54024, 246216, 309356, 277149, 310215, 231747, 102186, 120000, 280456, 289806, 218879, 122991, -60551, -83427, 79350, 149192, 242000, 292286, 227150, 113566, 289466, 439974, 294527, 155270, 181025, 186113, 156011, 236222, 220960, 138418, 110872, 125069, 195581, 242134, 245967, 445534, 435936, 431970, 457974, 330473, 192513, 21549, 47214, 112273, 241504, 360648, 343688, 438074, 494617, 534943, 610280, 507141, 479074]
19960D79074M285N2262k11224n9874p6776j7857Q008K3555J10560K1941j46059
19949A87895l0138P9774n6399j46455K1117J01588J40172L4858r8572o2862J24073
19938B95051n387K3764R1688Q3493K03691J06317J48994K35040K9777J2717p6210
19927A148935K8411k3532P2550j00047j77036j34597j06819q3600j64229j2575
19917D47461k3348J002j2218J00374J25395K0759j94608j89577k1276k1934j16600
19906A15430R3973L7706l9625O7881R1870P1363R6672J7999M072k6860M2183N670
19894E78334J32931J49422J56962p4234J1750L2861n771J37076j06842j0343L8486
19883A040632R7887r5149q8656J09616J24443J24963K2379L9791J63877M8910
$$ y = [479074, 483359, 535621, 324397, 264523, 187747, 169890, 177898, 201453, 312013, 333954, 187895, 157757, 237531, 181132, 34677, 55794, 157382, 297554, 332412, 233840, 170978, 295051, 289664, 313428, 405116, 488609, 692300, 798617, 947611, 1182651, 1212428, 1225145, 1148935, 1177346, 1153814, 1226364, 1126317, 949281, 814684, 707865, 624265, 460036, 447461, 424113, 425115, 412897, 513271, 638666, 659425, 464817, 275240, 253964, 232030, 115430, 209403, 247109, 207484, 275365, 367235, 438598, 535270, 553269, 557341, 530481, 572664, 578334, 711265, 860687, 1017649, 943415, 955165, 988026, 982255, 1119331, 1012489, 1002146, 1040632, 1138519, 1043370, 954714, 1064330, 1188773, 1313736, 1336115, 1375906, 1539783, 1588693]
19873A588693p2079k13169k6479J06030n5522k39678j12066J1943j46722j85098
19863F55853j28676P745N9613m1885J40507J14091r7068m0117P2043J34331J18202
19852I94639j5495J06664o7108j04336R5715K05222k9197j02098L0468J60402
19842A274876K89373J69453J34548P6630O0734j626k00677k02274k03803m6280
19832A350954n7395k03283j72954k12132L938L3966q5521m1375j37963q6178J982
19821C94039R8493L6511o7155r0506j46953o4560N0312N6939o6390J98193J71614
19810E70537o7113o5226o9794n7264j0409l5182O0586k4709P8503R8936J67544
19799F46409K19906Q0452K70370L08681m2988r6967j96182k35147j59119j54334
$$ y = [1588693, 1516614, 1303445, 1276966, 1382996, 1327474, 1087796, 975730, 987673, 840951, 655853, 527177, 534922, 594535, 552650, 693157, 807248, 710180, 670063, 742106, 876437, 994639, 979144, 1085808, 1018700, 914364, 1010079, 1215301, 1186104, 1084006, 1114474, 1274876, 1564249, 1733702, 1868250, 1944880, 2005614, 2003988, 1803311, 1601037, 1397234, 1350954, 1293559, 1090276, 917322, 705190, 709128, 743094, 657573, 616198, 478235, 392057, 394039, 492532, 529043, 461888, 371382, 224429, 159869, 210181, 267120, 200730, 398923, 570537, 503424, 438198, 368404, 311140, 300731, 265549, 326135, 301426, 379929, 478865, 646409, 866315, 946767, 1217137, 1525818, 1482830, 1385863, 1189681, 954534, 795415, 641081]
19789F41081q660K93458K17526Q8314J94252K78699P5999o2151k2619j30285j55519
19778A410095k25355j31418k0960n0581N839n6539o6531L9928K7057J06705p4702
19767I63538j99697j49314L0641J6565O6475o2070j03416n2537K9278R4017l5153
19756E98327q9788k8896k7169O3049q5692j10248m9720O5390N2808J47294o1816
19745D73539j7328k2519n8978k5377N0485L0450J45872J70577O8794J43291J08844
19734A067650p1734M41J8516l9510j22234M9561L05320J69655K70391R0571J89221
19723A927848L3624R3049K22649J54872P0394j13938j99105p7559m5458j85841
19713A880535k50724n5574L4125Q9844q2314n594M7798P072K5553l8516r2763
$$ y = [641081, 632421, 925879, 1143405, 1231719, 1425971, 1704670, 1780669, 1718518, 1695899, 1565614, 1410095, 1184740, 1053322, 1032362, 981781, 987620, 931081, 864550, 904478, 931535, 1038240, 963538, 763841, 614527, 645168, 661733, 728208, 666138, 562722, 510185, 539463, 633480, 598327, 508539, 479643, 452474, 515523, 429831, 319583, 269863, 335253, 388061, 535355, 473539, 456211, 433692, 374714, 349337, 399822, 430272, 576144, 746721, 815515, 958806, 1067650, 995916, 996357, 1014873, 975363, 853129, 902690, 1208010, 1377665, 1648056, 1738627, 1927848, 1961472, 2054521, 2277170, 2432042, 2502436, 2388498, 2189393, 2111834, 2066376, 1880535, 1629811, 1574237, 1608362, 1698206, 1615892, 1610298, 1658096, 1665168, 1690721, 1652205, 1559442]
19702A559442j37375k47752j77107j17868o2927j04737l20077m8590K06994P4773
19692F24776m5839j31679l7971k1857o7744K8726k8652Q8406P6685j97398j22760
19681A64693L092R9826P3202l1970L6114P0504J24688M0971K2403p1378M309K7658
19669E64112j45576p8213j19360l2349L1787J74326J71672J4581j45232j72219
19659B63529K2044J9636p5873P7957J57508K6665j5544q3297M7612r068o5484
19648C65685O1984n1523Q686M9079K2482J05366N2011p3477q2904j08407l2696
19637C16286O0200K1473j01326j7153q1582k8850k393J91210K15126p4953j66221
19626C31817r935n7237k243K17661K28415r8111m2952L2598R3541m3084k7591
$$ y = [1559442, 1422067, 1174315, 997208, 879340, 816413, 711676, 391599, 343009, 550003, 624776, 578937, 447258, 409287, 387430, 319686, 348412, 319760, 408166, 484851, 287453, 164693, 167785, 267611, 340813, 308843, 344957, 415461, 540149, 581120, 603523, 532145, 536454, 564112, 418536, 340323, 220963, 188614, 220401, 394727, 566399, 580980, 435748, 263529, 285573, 305209, 229336, 307293, 464801, 491466, 475922, 392625, 440237, 431169, 365685, 427669, 376146, 384832, 433911, 456393, 561759, 613770, 540293, 457389, 348982, 316286, 376486, 397959, 296633, 279480, 197898, 169048, 166655, 357865, 572991, 498038, 331817, 321882, 264645, 262402, 480063, 708478, 610367, 567415, 600013, 693554, 650470, 622879]
19615F22879q7567K0067j18315P7420R4772n2246j7206r8719q5437J26112K9947
19604E11707O3881n3784m0904l3630L230L5314M0394M6926R6805m8189j26143
19593D95607J53676J83885k4345j32686K9196j2978J41951L6202o4621j38833
19583F67054l24M5986k2351n5935J0143J46939j34540j63561k9564k725K8023
19572D89145J4374L8249O2575M5854M9475J5034L1653L0129P9546M9577j05151
19561H00460k9980m7908j0941j642P5387J05405j41207j07413o8006K5221K9397
19550F28773J21370J29668k2272n1383L5102j8205O33Q368o5301p8019k3915j50191
19538E14628J46670J2787J25408J17008M0161j59461n4967J3674L8352O974O9925
$$ y = [622879, 535312, 555379, 437064, 514484, 609256, 557010, 539804, 441085, 355648, 481760, 511707, 575588, 521804, 480900, 447270, 450500, 485814, 526208, 573134, 669939, 621750, 495607, 649283, 833168, 808823, 676137, 705333, 692355, 834306, 870508, 805887, 667054, 666730, 712716, 690365, 634430, 644573, 791512, 656972, 493411, 463847, 461122, 489145, 503519, 541768, 604343, 650197, 699672, 714706, 746359, 776488, 856034, 905611, 800460, 770480, 722572, 711631, 709989, 785376, 890781, 749574, 642161, 574155, 599376, 628773, 750143, 879811, 857539, 806156, 841258, 823053, 823686, 832054, 766753, 688734, 664819, 514628, 661298, 674085, 799493, 916501, 956662, 797201, 742234, 755908, 794260, 801234, 871159]
19527H71159l38N8720r9422O1165O1051k1193O9029k8376J3588O178l9079K554
19515I55036P7922l2725p7150K2921J31895o7783M5555P1904j3042n7870o2189
19504I94474K8716l914m6755k2502o046J03801M7106L0765o6487P0794J03853
19493A233805J59693l9617q797l4588j31917N730J62677j11916q4360Q9270J87210
19482A427190J10644R3038O7511M8285J13595R1350R9649J6627J11521J77299
19472B356709Q9694K13419Q3232p3083n9839m3418m9079L2213K0529J19393K9849
19461B719619M0426j5350M3534J49864J44731J20659K45029J32252K24376J28266
19451C933406K62772K24046Q5615J78644K98025K06291J94947K95415N36748L01212
$$ y = [871159, 870821, 929541, 830119, 891284, 952335, 931142, 1000171, 971795, 985383, 991561, 952482, 955036, 1032958, 1000233, 923083, 946004, 1077899, 1010116, 1055671, 1127575, 1114533, 1056663, 994474, 1023190, 1019276, 972521, 950019, 943973, 1047774, 1094880, 1125645, 1059158, 1129952, 1233805, 1393498, 1353881, 1345084, 1310496, 1178579, 1184309, 1346986, 1235070, 1150710, 1239980, 1427190, 1537834, 1630872, 1698383, 1746668, 1860263, 1951613, 2051262, 2067889, 2179410, 2356709, 2446403, 2659822, 2743054, 2669971, 2610132, 2566714, 2517635, 2549848, 2570377, 2689770, 2719619, 2760045, 2744695, 2788229, 2938093, 3082824, 3203483, 3448512, 3580764, 3805140, 3933406, 4196178, 4420224, 4505839, 4684483, 4982508, 5188799, 5383746, 5679161, 6215909, 6517121]
19441F517121L22375N54267Q82710J045862Q11343R81076J177356J211037J335667
19432A4838814J468191J679057K226272L094192M260344O554859R918142J1717102
19424E5756973J1298161J0698162J1400226J2138092J0174657O212553J064150
19417A18742974m232122p906170r136322r312124j0700275j2737733j3126732
19410E1591496j0769980p440077m734786k950730j619870r55270m63999j56987
19402B2499797R2601L39613O13819P84396R61385J290311J506437K212175L325167
19393C3625701M512591O603288R327048J0499467R688346J0236390J2220610J3702824
19385A10416265J1528381P840281P631272P385879N816619K518429K572L70871
$$ y = [6517121, 6839496, 7393763, 8276473, 9322335, 10133678, 11114754, 12292110, 13503147, 14838814, 16307005, 17986062, 20212334, 23306526, 27566870, 34121729, 44039871, 55756973, 67055134, 77753296, 89153522, 101291614, 111466271, 117678824, 118742974, 114510852, 106604682, 97468360, 88156236, 77455961, 64718228, 51591496, 40821516, 33381439, 28646653, 25695923, 24076053, 23120783, 22656784, 22499797, 22592398, 22932011, 23545830, 24330226, 25291611, 26581922, 28088359, 30300534, 33625701, 38138292, 44741580, 54068628, 64568095, 74256441, 84492831, 96713441, 110416265, 121944646, 129784927, 137416199, 144802078, 150618697, 153137126, 153139698, 153510569]
19377A53510569r7837o50576L33954L408810N807250O260864J2158150K5084288
19369B05815472L5318087L7666849L6339591K7335193J7917698O841616k113534
19362C65120972r808093k0494868l0542912l4588388l2543707l1759347l3821829
19355A71561828l3637041k8270934k0395975j3603293q802529n881255m051959
19348E6918842k569202j751317r33836n5043J321376K946397N119563R007076
19340G0003856J3626023J6360207J7275229J8032754J3497978Q873753M365570
19333A62035370O19585N10855m45409k56684l767001m923130p41323M146093O702776
19324A63881132K658811L73785o18171n922397r120784j0132779o436449k125551
$$ y = [153510569, 153412732, 152762156, 153096110, 156504920, 162312170, 168573034, 180731184, 205815472, 241133559, 278800408, 315139999, 342475192, 360392890, 367234506, 365120972, 355312879, 334818011, 304275099, 269686711, 237143004, 205383657, 171561828, 137924787, 109653853, 89257878, 75654585, 66852056, 60970801, 56918842, 54349640, 52598323, 51664487, 51609444, 52930820, 55877217, 60996780, 70003856, 83629879, 99990086, 117265315, 135298069, 148796047, 157669800, 162035370, 162654955, 163165810, 162720401, 162463717, 158696716, 153773586, 153032263, 157178356, 163881132, 166539943, 166913728, 166295557, 160373160, 151252376, 141119597, 134683148, 132557597]
19316A32557597J408760J0501553K7584652M5658524M8777938L3869240J227564
19309C01585828l5143056n2435495m7058150l1946070j6983225m886720P097209
19302A20230321K2133832L9299308M9293968M0862011J2223845k6781893n2787976
19295B04473416n4754727m1831080k7042807j6607290j0274748o527435m266346
19288D3168983k770446j909303j304067o26796K08033Q93126K014219L993039
19280D3666788O741007R371829J0275525R594455Q783510Q926303J0109887R538783
19272A17008087O390505J511664k514030k396481J389406N775980P463192N450459
19264A40078782J249822j865968k112021j591973l88153P43890J599079M476945
$$ y = [132557597, 133966357, 144467910, 172052562, 217711086, 266489024, 300358264, 301585828, 266442772, 214007277, 166949127, 135003057, 118019832, 113133112, 120230321, 142364153, 181663461, 230957429, 271819440, 284043285, 257261392, 204473416, 149718689, 107887609, 80844802, 64237512, 53962764, 47435329, 43168983, 40398537, 38489234, 37185167, 36558371, 36766404, 37659530, 39673749, 43666788, 50407795, 59779624, 70055149, 79649604, 88433114, 97359417, 107469304, 117008087, 123398592, 124910256, 122396226, 119999745, 121389151, 127165131, 134628323, 140078782, 141328604, 139462636, 137350615, 135758642, 135370489, 136114379, 137713458, 142190403]
19256A42190403O952212K969394q858072k0299531k4435864k0517997j3698814
19249F4301731p597545k896663J185181O212204J3086414J9650088J9483595P753551
19241A21178556r516019k0526286k0599508j4922762q602898m392317j465370
19234D1153396P72620K536883N179800P818229Q837692R470577R902355O929054
19226I2600606M397449N840077R478110J2700203J1063741N524365j112594j220309
19218A39271648M270109Q107892P956748M677951Q28842j889575m184357o475915
19210A52563343j0389418j4145716j4596011j2960697j1556661j2305076j3858112
19203F2751652j3359402j0796992p759060n441444l886219k914877k277534j673277
$$ y = [142190403, 149142615, 152112009, 143253937, 122954406, 98518542, 78000545, 64301731, 56704186, 53807523, 54992704, 61204908, 74291322, 93941410, 113425005, 121178556, 111662537, 91136251, 70536743, 55613981, 47011083, 42618766, 41153396, 41926016, 44462899, 49642699, 57460928, 66298620, 75769197, 85671552, 92600606, 96998055, 102838132, 112316242, 125016445, 136080186, 141604551, 140491957, 139271648, 143541757, 151649649, 159606397, 164284348, 165113190, 163223615, 159039258, 152563343, 142173925, 128028209, 113432198, 100471501, 88914840, 76609764, 62751652, 49392250, 38595258, 30836198, 25394754, 21508535, 18593658, 16316124, 14642847]
19195A4642847j299981j123157r90307j125758j001800o45898m26321m91169l72494
19186G165962l74770m01416m35180m41231l40419k52925j69250j81030j06658
19177D463083L0870Q3763J5871M0721K03281K84540J03771j36221j68262m0289
19167D881128n8700p4101r4521P7925k03560j79361j07526n0935j88203j49526
19157C852620k96114l04014k75577j14929j38127j04408Q9955n717m0880N6228
19147B719037m6071J73739K85235L34669J35840P2709p8077j76240j98953n3406
19137C168482j18548j38770K4005K33762O2532J6446l4044r8138k12272k55343
19127B648112j49198j9521k09995j16308R5070J21157r3730q4130J02811M8984
$$ y = [14642847, 13342866, 12219709, 11229402, 10103644, 9101844, 8455946, 8029625, 7538456, 7165962, 6791192, 6389776, 5954596, 5513365, 5172946, 4920021, 4750771, 4569741, 4463083, 4493953, 4577716, 4593587, 4634308, 4837589, 5122129, 5225900, 5089679, 4921417, 4881128, 4822428, 4748327, 4653806, 4731731, 4528171, 4348810, 4241284, 4190349, 4002146, 3852620, 3556506, 3252492, 2976915, 2861986, 2723859, 2619451, 2709406, 2703689, 2662809, 2719037, 2672966, 2846705, 3131940, 3466609, 3602449, 3675158, 3597081, 3420841, 3221888, 3168482, 3049934, 2911164, 2935169, 3168931, 3231463, 3247909, 3213865, 3115727, 2903455, 2648112, 2498914, 2479393, 2269398, 2153090, 2248160, 2369317, 2275587, 2191457, 2294268, 2343252]
19117B343252O3512l9437j36515j68970k70853q5999m9483j05954J50594R2423
19107A792570j64011p637O5957L356j34467o8060j0523L7975J07211J4657o0063
19096A576965j44886n3093J6383J09139J05414j62441j91074R5403J44854O91
19086A497355O9389J09348M1897p0174K6632j00979r9351l826J30347J49826J0655
19075A761119j49877j2809q1128p5475P6342M5845q4198j12760j21675q7620M8124
19064A205888r6607n5082J0089M6837j3795M2548K6619O85J07606J70628j3717
19053A431699J4642j7816P3859K30243M3287P0790L8106k1681l8928J11529N496
19042A941226K145K0055p4104P481N8696j33940j699j67363j16488J5819J5780
$$ y = [2343252, 2406764, 2367327, 2230812, 2061842, 1790989, 1704990, 1655507, 1549553, 1700147, 1792570, 1628559, 1620922, 1686879, 1690235, 1555768, 1487708, 1477185, 1515160, 1622371, 1637028, 1576965, 1432079, 1378986, 1395369, 1504508, 1609922, 1447481, 1256407, 1351810, 1496664, 1497355, 1566744, 1676092, 1717989, 1647815, 1674447, 1573468, 1474117, 1470291, 1600638, 1750464, 1761119, 1611242, 1598433, 1517305, 1441830, 1518172, 1564017, 1479819, 1367059, 1245384, 1157764, 1205888, 1109281, 1054199, 1064288, 1111125, 1097330, 1139878, 1166497, 1167182, 1274788, 1445416, 1431699, 1446341, 1428525, 1502384, 1732627, 1775914, 1846704, 1884810, 1863129, 1824201, 1935730, 1941226, 1943371, 1963426, 1889322, 1896803, 1955499, 1821559, 1819860, 1652497, 1536009, 1551828, 1567608]
19031A567608p9078p3921J7863n4506r9691m2597J58587J2609l3950k02586q1079
19020A089259j30073J02040P1453J05441k7125O4169J7948j9760P5867r886P9558
19009A418891J0231K189O8837o966m3684J0158Q8178J96160J91726J16958Q7262
18998B139940Q3676m3538j51319k2806q2270p2675K3094L2698K1548O5407J31775
18987B125530K5537P5410j36597j24204k31326p9562K9L4378L8470P6428p4407
18976A729686R511J08737N7267J95826Q9487J38402L14509L76138K42715K02721
18966C464999J05277R9083K42137L42243L97193N64910N75555L44049M37313M79570
18956G052329O01453O77438P90078J093262J256852J750688K689880M023975O383560
$$ y = [1567608, 1488530, 1414609, 1432472, 1377966, 1278275, 1235678, 1394265, 1406874, 1372924, 1170338, 1089259, 959186, 1061226, 1132679, 1238120, 1210995, 1275164, 1293112, 1273352, 1349219, 1339333, 1418891, 1429122, 1431311, 1500148, 1493182, 1449498, 1459656, 1547834, 1743994, 1935720, 2052678, 2139940, 2223616, 2180078, 2028759, 2005953, 1923683, 1851008, 1874102, 1906800, 1928348, 1993755, 2125530, 2151067, 2226477, 2089880, 1965676, 1734350, 1654788, 1654817, 1689195, 1727665, 1804093, 1729686, 1739197, 1847934, 1905201, 2101027, 2190514, 2328916, 2643425, 3019563, 3262278, 3464999, 3570276, 3669359, 3911496, 4253739, 4650932, 5215842, 5791397, 6135446, 6572759, 7052329, 7653782, 8331220, 9121298, 10214560, 11471412, 13222100, 15911980, 19935955, 26319515]
18947B6319515J0631738J4918987J3691409L938951o813648j1289799r233467
18940D2163686m759960L86990O092085J2634903J6563851J0905128l044186j4948326
18932F5994171j7454826j3647664q648786n084319l032312j913522j324828p91654
18924A4096260n60453l86341j80273P0611k0612N4530N41978O19452P10182J129461
18914A6074795J323782J337503J472873J946121K331213K896168L848583N315811
18906C6546849P685297J1385629J8142329K8544172L8277945L2167035O228598
18899A78977854k0109923k8149635k0548317r861750j757356O838370J7458492
18892A22847735K3793858J4445729q339862k5905820k7996142j9356193q120265
$$ y = [26319515, 36951253, 51870240, 65561649, 69500600, 62686952, 51397153, 42163686, 37403726, 37790716, 43882801, 56517704, 73081555, 83986683, 80942497, 65994171, 48539345, 34891681, 26242895, 21158576, 18126264, 16212742, 14887914, 14096260, 13535807, 13149466, 12969193, 13039804, 13019192, 13073722, 13615700, 14235152, 14945334, 16074795, 17398577, 18736080, 20208953, 22155074, 24486287, 27382455, 31231038, 36546849, 44232146, 55617775, 73760104, 102304276, 140582221, 172749256, 178977854, 158867931, 130718296, 110169979, 100308229, 98550873, 105389243, 122847735, 146641593, 161087322, 152747460, 126841640, 98845498, 79489305, 71369040]
18885G1369040n51127k55278m700472r811191j0970183q966277o247619m096047
18877B5770846k519532j462672r04326m48336j98678R1960O0880k1702L30579
18868B0699019N01253P29249J262008J530239J835633K074239K595844L486774
18860C4714258M131340N109863O682672R221391J3974969K2408996L4979498M4738712
18852A75961699L6308204J3240622J70312J136773L5311j2407873k6122870k9062998
18844A59259180k0134991n473825J1056507K4187546K5179590J5546962Q578186
18837B18199155P025751l492961k3920297l9198208m0095413l1278454k1046245
18830F6193328j3485921q715245n606746l804888k874390k389807j986231j575921
$$ y = [71369040, 70817913, 70562635, 65862163, 56050972, 45080789, 36114512, 29866893, 25770846, 23251314, 21788642, 20884316, 20435980, 20237302, 20329262, 20390142, 20368440, 20699019, 21200272, 21929521, 23191529, 24721768, 26557401, 28631640, 31227484, 34714258, 38845598, 43955461, 50638133, 59859524, 73834493, 96243489, 131222987, 175961699, 212269903, 225510525, 225680837, 226817610, 226852921, 214445048, 188322178, 159259180, 139124189, 133650364, 144706871, 168894417, 194074007, 209620969, 218199155, 225224906, 221731945, 197811648, 158613440, 118518027, 87239573, 66193328, 52707407, 43992162, 38385416, 34580528, 31706138, 29316331, 27330100, 25754179]
18822B5754179j611726j495065j141484n14015J76445M34978N93519L97814M75774
18813B3070419O88906Q48277J233205J939898L076498N020025Q229717J2382291
18805E6489236J4094855J0674194L383701j636618k77852P126690J5498200J7959299
18797A23311705J1630086l85794r187549j0908950p394570k820757K159770Q574146
18789A14978087J1708045P289769m611607j6941576k3488471k2438064j7249135
18782D9247048j1573380p503467m898797l440863k600820k146564j665451j364260
18774A4053446j251997o98785l95197j78187Q1281K99091N53042P34546J58007
18765A3355247l60905n11158o6378M70749Q34415J101366J832101K900397N055151
$$ y = [25754179, 24142453, 22647388, 21505904, 20991889, 21168334, 21603312, 22196831, 22594645, 23070419, 23759325, 24607602, 25840807, 27780705, 30857203, 35877228, 44106945, 56489236, 70584091, 81258285, 84641986, 83005368, 82727516, 89854206, 105352406, 123311705, 134941791, 134555997, 125368448, 114459498, 107064928, 104244171, 106403941, 114978087, 126686132, 133975901, 129364294, 112422718, 88934247, 66496183, 49247048, 37673668, 30170201, 25271404, 21830541, 19229721, 17083157, 15417706, 14053446, 12801449, 12102664, 11707467, 11529280, 11610561, 11909652, 12462694, 13197240, 13355247, 12994342, 12483184, 12416806, 12887555, 13721970, 14823336, 16655437, 19555834, 24610985]
18756B4610985Q281873J1053830J0560116N894967j167251o723260q650299o781567
18748C7079394k995532J183933M642367N602992K831227j852329n696676p798825
18740C2996551p853840o383620m522170l110622k052456j290046q03112n79377
18732F401308l16452m32375n50726l23148k19050n5110N7013o640j91827k65717
18722D097276k84678l56395j59081j19013o1278r5771q7943m5761Q9810J33743
18712C110909K68400J99216p0356l63558l50085l33609j40468p8493M7149j45174
18702B143931K1677J93677J09946P1923K8317j7354j48716q6677k03552l18438
18692A794734j01778Q0295j12636L5255J37290Q575q0430L5488j00539j35868
$$ y = [24610985, 32892858, 43946688, 54506804, 60401771, 59234520, 52511260, 43860961, 37079394, 34083862, 35267795, 39910162, 45513154, 48344381, 46492052, 40795376, 32996551, 25142711, 18759091, 14236921, 11126299, 9073843, 7783797, 6980685, 6401308, 6084856, 5652481, 5101755, 4778607, 4559557, 4504447, 4561460, 4554820, 4362993, 4097276, 3812598, 3456203, 3297122, 3178109, 3116831, 3021060, 2933117, 2887356, 2977166, 3110909, 3379309, 3578525, 3508169, 3144611, 2794526, 2460917, 2320449, 2241956, 2289105, 2143931, 2165608, 2359285, 2469231, 2541154, 2569471, 2552117, 2403401, 2316724, 2113172, 1794734, 1692956, 1773251, 1660615, 1695870, 1833160, 1841735, 1761305, 1796793, 1696254, 1560386]
18682A560386n0612o0489P7675J02723J16028J07389J03592J22815K08081J71196
18672B458784j29897k08380k09694k62537k79427j87500Q5825K4923m7914j58208
18662A085975j35078l3533r7614J18197J56934J58851Q8043j5136P2903P6958
18652A476500K33825L42819K47567P0321p4968k13436k80586l63607m08951j39439
18642H90045J36909O4142P8069n0334k01404n4124M2865J6336K9807o4556k13473
18631F74282O7825J06356J18465j4650R1399J04548j21619j62373p4498r5399
18621F94336l6702K5753Q4577J08435p454O1818m0627j79386p3089m578o083j31621
18609D95379l9960m3568P5538P2314k1186q8104n2467m4302j1132O6265J94188
$$ y = [1560386, 1509774, 1449285, 1526960, 1629683, 1745711, 1853100, 1956692, 2079507, 2287588, 2458784, 2328887, 2120507, 1910813, 1648276, 1368849, 1181349, 1267174, 1292097, 1244183, 1085975, 950897, 917364, 819750, 937947, 1094881, 1253732, 1341775, 1326639, 1399542, 1476500, 1710325, 2053144, 2300711, 2371032, 2296064, 2082628, 1802042, 1438435, 1029484, 890045, 1026954, 1091096, 1169165, 1118831, 917427, 863303, 906168, 922504, 952311, 887755, 674282, 742107, 848463, 966928, 952278, 1043677, 1148225, 1026606, 864233, 789735, 694336, 657634, 683387, 767964, 876399, 868945, 930763, 890136, 710750, 637661, 633083, 627000, 495379, 455419, 411851, 487389, 559703, 538517, 450413, 397946, 353644, 342512, 408777, 602965]
18598F02965J48132N2844k2288p1794q8499J3888m0142J5717m0689j94098O4132
18587D40168J55584R1222J90044k24328l24270r3341j7055p646P6855J15441J37491
18576E40165k3838j50045j51383J1928J2102J9692K2170J61385R0857j47913j84531
18565B00589j92593J7470M9956R3441J13052j8375L095J51730J07386j49251m9400
18554C27100J1867J89191J51465J4820J1189O1763M5867J09984m103o3990p3115
18543G82038j85274j19629K776K58452Q5622O2921j38620q23j44387r5654p8187
18532D29235o2197P746o4793q8911O5163O4131j02168j62114L4025n8049m116
18521E7952O7733j9187J7227K8157J23995l6390j01013L1367J24418k3147j5980
$$ y = [602965, 751097, 803941, 781653, 709859, 621360, 635248, 595106, 610823, 570134, 376036, 440168, 595752, 686974, 877018, 652690, 328420, 235079, 218024, 210378, 287233, 402674, 540165, 516327, 366282, 214899, 226827, 238929, 258621, 280791, 442176, 533033, 385120, 200589, 7996, 25466, 75422, 168863, 281915, 263540, 266635, 418365, 525751, 376500, 327100, 338967, 528158, 679623, 694443, 705632, 767395, 813262, 923246, 919143, 855153, 782038, 596764, 477135, 479911, 738363, 823985, 886906, 748286, 747463, 603076, 507422, 429235, 367038, 374784, 309991, 221080, 286243, 350374, 248206, 86092, 120117, 62068, 57952, 125685, 106498, 123725, 151882, 275877, 239487, 138474, 169841, 294259, 271112, 255132]
18510B55132L4818N3823J7736J07845N4472j16210j67681J10815J81948q1128
18500D51570j95275p6693L5300J39327J10654P8891K815o4936m9042J22706O5044
18489F20361j03826p8918j5482j62209j25931n140O0275M8538j16724j52358q4362
18478a15776N9641J35877J9973p0499J18965M211n8799p0250J41087L2293q9625
18467A07098j31407J12961L3269J6789J39141o0256Q0724N481k04759j96855j2254
18456a10068J10299M3818q9444m1015J23717J27336n0088l8318M9498Q2998M6243
18445B54976R73p5403p0987J2249O5294o0128n7442n7592j81805J33517J01623
18434F5275j9705R40l9674J24279J75381K1968O3964Q2652j4768J20894k990j57574
$$ y = [255132, 289950, 343773, 361509, 469354, 523826, 407616, 239935, 350750, 532698, 451570, 256295, 179602, 214902, 354229, 464883, 543774, 546589, 481653, 432611, 555317, 620361, 516535, 437617, 422135, 259926, 133995, 128855, 189130, 237668, 120944, -31414, -115776, -56135, 79742, 99715, 29216, 148181, 152392, 93593, 23343, 164430, 196723, 107098, -24309, 88652, 121921, 138710, 277851, 217595, 298319, 303800, 99041, -97814, -110068, 231, 44049, -45395, -86410, 37307, 164643, 114555, 76237, 125735, 208733, 254976, 255949, 180546, 109559, 121808, 187102, 126974, 69532, 11940, -169865, -36348, 65275, 45570, 46510, 6836, 131115, 306496, 328464, 392428, 475080, 460312, 581206, 578216, 420642]
18422D20642j12072K7247J38538J61568l8036q6372j412J3242j93955J9347M0798
18411C89535L9618n893j43108l0319j15661j10571p3749P4987k9541m0852n3520
18400i9074J04945Q5052n0639l5253j13212r9139J47386J74554m9649l6852R5472
18389A23591L3139q5695j1315J72599K37706K7644N7967N7136J4693j20375p6742
18378D30348K3815K2903K17841O6567J9250J35555P3090o6472k14930p1314q7574
18367E49079k3867J26433J12676O6507P4369j0652k94812o7562j22514k4899o2020
18356C22738j8552n1466J3271P2117J28427n3097n6362j24116j08764L5232L7494
18345A96922m2361j4033N7111L4308o9924J34164K99383R8647r1224J06378M4008
$$ y = [420642, 308570, 335817, 474355, 635923, 597887, 511515, 510103, 523345, 329390, 348737, 389535, 429153, 423260, 280152, 249833, 134172, 23601, -50148, 24839, -4702, -45554, -99074, 5871, 90923, 40284, 5031, -108181, -207320, -59934, 114620, 64971, 28119, 123591, 156730, 71035, 59720, 232319, 470025, 497669, 555636, 612772, 627465, 507090, 430348, 454163, 477066, 694907, 761474, 780724, 916279, 989369, 922897, 707967, 636653, 549079, 525212, 651645, 764321, 830828, 905197, 894545, 599733, 532171, 409657, 384758, 322738, 304186, 252720, 265991, 338108, 466535, 413438, 357076, 232960, 124196, 159428, 196922, 154561, 140528, 197639, 231947, 162023, 296187, 595570, 694217, 602993, 709371, 753379]
18334G53379j00663R0588J53375J65684K8327J72422j05621j33421j73281n2706
18324G98083n0570j34344p2374P0980M1915j12542j47557j68239q566L2290m164
18313B44912j07573l8117J34719J20702j4198l6561k53197p2450J9886n5952J7428
18302d0401L1159J99363J5570J08611J30379J8619r8078o1712k5716L7115J54489
18291D69398J47943l6504J17964J74966J20645J20979J25861m0237r5614o9177
18281A036224j69456j6318J04916L7587n6024j16494j29903j1500j27957k52292
18271B98783q6061N960l3085j69214j8902J20436L4024N3303K1954j68840k8667
18260B9691K0428j3838L5053J31560J28725j45525r3097l0483Q4022L7616q4788
$$ y = [753379, 652716, 743304, 896679, 1062363, 1090690, 1263112, 1157491, 1024070, 850789, 798083, 747513, 613169, 540795, 611775, 653690, 541148, 393591, 225352, 216786, 249076, 244912, 137339, 99222, 233941, 354643, 340445, 303884, 50687, -21763, -1877, -57829, -40401, -9242, 190121, 205691, 314302, 444681, 463300, 365222, 303510, 277794, 314909, 469398, 617341, 580837, 698801, 873767, 994412, 1115391, 1241252, 1201015, 1105401, 1036224, 866768, 850450, 955366, 992953, 936929, 820435, 690532, 679032, 551075, 298783, 212722, 218682, 185597, 16383, -2519, 117917, 151941, 205244, 227198, 58358, 29691, 50119, 36281, 71334, 202894, 331619, 186094, 92997, 62514, 146536, 184152, 99364]
18249I9364n9536M5862J45920J26018J44884J19513n3378j81628n3765j2047j05121
18238B16086N355r4177Q9863O1251J49082O3901j4263m8978j59822j83390K9789
18227A14697l5048p6523r2707l573Q803J08723J11482M5723k1526o2477J67426
18216B65000O1781J23538L7041m4082J6806k21726m9671p065j05493Q0274M6628
18205B03031l0573l5039o4983k3246O2357K2772O9763O1485Q1724o563N5852j6108
18193C80472J4634o6704Q2409J29144r5074n4970M7874M8203k88k2579O0661j4208
18181E09574j05887J7102m8036R2319j2896j36344o5033l3823k4215O1600j02045
18170A52316N7245j8395O3257Q6298J19569J6221l3112j3972J4529p385k5813
$$ y = [99364, 39828, 85690, 231610, 357628, 502512, 622025, 568647, 387019, 333254, 321207, 216086, 221441, 127264, 217127, 278378, 427460, 491361, 477098, 428120, 268298, 84908, 114697, 79649, 3126, -89581, -93154, -84351, 24372, 135854, 181577, 160051, 97574, 265000, 326781, 450319, 487360, 443278, 460084, 238358, 188687, 181622, 76129, 156403, 203031, 172458, 137419, 72436, 49190, 111547, 134319, 204082, 265567, 347291, 340728, 396580, 380472, 395106, 328402, 410811, 539955, 444881, 389911, 437785, 485988, 485700, 463121, 523782, 509574, 403687, 420789, 372753, 465072, 452176, 315832, 250799, 216976, 192761, 254361, 152316, 209561, 191166, 254423, 340721, 460290, 476511, 443399, 429427, 443956, 436571, 410758]
18159D10758J66954O3051j1845J6355K6810p0733N7821J11584P7089m1342p6498
18148G30004Q2156K07701K50113J14759J66515j7352j4952J24232P2723O9229
18138A785128K13875K03402L57775J75041K84458L48889N89660N80285N57988
18129E096501N26500N94027P57215J067595J096683J320208J280036J410729J549184
18120A4698678J636949K014964K602803L119935L841548N127001P642968J2581333
18112E3266179K2616283M4194233Q2649265Q5586551j3136852o9989912p6126837
18105A29058910m8048488k6303740j5005370r430563o496267m540426l303092
18098A5930964k471791k033951j673784j341149j197835j120382q74156q11689
$$ y = [410758, 577712, 640763, 628918, 645273, 672083, 601350, 659171, 770755, 847844, 806502, 730004, 812160, 1019861, 1269974, 1384733, 1551248, 1533896, 1518944, 1643176, 1715899, 1785128, 1999003, 2202405, 2560180, 2735221, 3019679, 3368568, 3958228, 4538513, 5096501, 5623001, 6217028, 6974243, 8041838, 9138521, 10458729, 11738765, 13149494, 14698678, 16335627, 18350591, 20953394, 24073329, 27914877, 33041878, 40684846, 53266179, 75882462, 120076695, 202725960, 288312511, 275175659, 205185747, 129058910, 81010422, 54706682, 39701312, 30270749, 23774482, 19234056, 15930964, 13459173, 11425222, 9751438, 8410289, 7212454, 6092072, 5217916, 4406227]
18090D406227o46041m57429l92918m68251k55910j61468j09926j27442j66138
18081A620704j15150r1136j68794j87765p75q1143p2887L7700j26130n7467l9525
18070G17632j02297J01046o8069j28569o276j65093J5027k4978j30946Q348o1042
18059A54783j01989r4804K2279J07571J60009l9713M8823N2072L1251l8777l9857
18048B61648P9144O4814Q1626k6851j08605k08967j83999m2242L9347J25697J3573
18037I5185q2369j13085j08383Q3838K24292N9065p8261m2418M1850k8735K6975
18026G7954R6679p1761p9469k2294L4295N3190n3053P4315J4299m9334l8085n5926
18014a9190M7007J33656K4757N1078J7040k38804m7040j13562N7831J20248J46176
$$ y = [4406227, 3760186, 3302757, 2909839, 2441588, 2185678, 2024210, 1914284, 1786842, 1620704, 1505554, 1414418, 1245624, 1057859, 1057084, 975941, 903054, 940754, 814624, 757157, 717632, 615335, 716381, 648312, 519743, 513467, 348374, 363401, 338423, 207477, 215825, 154783, 52794, -42010, -19731, 87840, 247849, 208136, 256959, 309031, 340282, 301505, 261648, 340792, 405606, 487232, 460381, 351776, 142809, -41190, -83432, -44085, 81612, 95185, 12816, -100269, -208652, -124814, 99478, 158543, 80282, 37864, 79714, 50979, 77954, 174633, 102872, 23403, 1109, 35404, 88594, 35541, 109856, 124155, 74821, 36736, -19190, 27817, 161473, 186230, 237308, 254348, 15544, -31496, -145058, -87227, 33021, 179197]
18003A79197k1358j16735p0780j04310K7863J21000J08554N5227J60045P9113
17993D17816q0857k30349q6692m401O8462J5474k1904m3464J3272J05417J01951
17982B54725p553j05383j17285p7993N4672J0894L713j8487o021n5540P452J09810
17970E3004j3678O1520K4439r8505o270N3993L5646J6062j697o8788j19305J19709
17958E6130J08440K6347k44495n3966N5070l7240O7700J3814J7076K5278o9063
17947c4909m1653r3971L8280J05293M0112j6497p0949j21175k0253M0224Q7838
17936h7660l4076q6801J35420J01303M7784M8557k7975k2490K7647q3521r5360
17925g7172O1825J88584l6775p4845p4351O0065j2488k7577J3199j560n8771l1122
$$ y = [179197, 157839, 41104, -29676, -133986, -106123, 14877, 123431, 178658, 338703, 417816, 336959, 106610, 19918, 15517, 83979, 99453, 77549, 34085, 47357, 152774, 254725, 247172, 141789, 24504, -53489, 1183, 12077, 15790, -2697, -8718, -64258, -56806, 53004, 39326, 100846, 125285, 26780, 20510, 74503, 110149, 126211, 124514, 55726, -63579, 56130, 164570, 190917, -53578, -107544, -52474, -89714, -22014, -8200, 8876, 34154, -34909, -76562, -170533, -132253, -26960, 13152, -3345, -74294, -195469, -215722, -175498, -87660, -121736, -208537, -73117, 28186, 75970, 124527, 96552, 74062, 101709, 18188, -77172, -15347, 173237, 136462, 61617, -12734, 47331, 34843, 7266, 20465, 18905, -39866, -70988]
17913g0988l3555K8129J6189M3695l9392j83319o2458N1540K01953J97580J13782
17902B63156j12821j81482j53019j34181K3625J78788R0364M731l137J54897P0837
17891B01758q897m3844k54984K4105N4551M5629j1627j92095M2116J14202m2791
17880g1877L7984M8792N0152k8276o8303k9875P0615R2738j64089m7251j0415
17869a19805L7439j14650N681J30848J8688n6513k2897K4779M5363L99R3882Q022
17857E1236k8163l9478m9659r4629J02002K70610J589L9786k7501j29420q1003
17846A5370k9209J35181P3716K6093M063r0940Q9335o0152j49093p2567M9859
17835h344P6044O2609J8517m9567N0428j14544j9893k9428k1441J20423n7573
$$ y = [-70988, -104543, -76414, -60225, -16530, -55922, -239241, -301699, -250159, -48206, 149374, 263156, 150335, -31147, -184166, -318347, -294722, -115934, -25570, -20839, -23976, 130921, 201758, 192861, 149017, -105967, -81862, -27311, 18318, 6691, -185404, -143288, -29086, -71877, -33893, 14899, 65051, 36775, -31528, -61403, 9212, 101950, -62139, -109390, -119805, -82366, -197016, -191335, -60487, -41799, -98312, -121209, -96430, -51067, -50668, 43214, 51236, 23073, -16405, -66064, -160693, -58691, 211919, 213508, 253294, 225793, 96373, 15370, -13839, 121342, 195058, 221151, 225214, 134274, 223609, 163457, 14364, -58203, -8344, 67700, 130309, 148826, 99259, 149687, 35143, 15250, -14178, -35619, 84804, 27231]
17824B7231n251O4609n5056J64018N8893j08213o1880k5719L7692j8185p9803
17813a664j32019l7947K950N0229M8826Q053q2270q0537J0205K29111J01945L1924
17801A48806m8291k20464j02221j4091K1061J89788R3237m1335j93281o4133Q771
17790b22153l34J12616m3318o2954Q8663l6843l1812n588J12585l9828J2510N0011
17778f6445M1430M5577K9258p0994K7996J36946J5851j80482N0009J54660J56770
17767C40576m9298p4834l3573o9538n833J0783j21284j38448L7153K0637n562
17756h9221Q00J6598Q5046J0040L9364n5801q2376j07239J00269M5914J25998
17745H9392N5036j27597j88184J1003k821Q8312L6505M4221n4084r4047J1723
$$ y = [27231, 21980, 86589, 31533, 195551, 254444, 146231, 84351, 58632, 96324, 78139, -1664, -133683, -171630, -168680, -118451, -69625, -61572, -143842, -224379, -214174, 14937, 116882, 148806, 100515, -119949, -222170, -236261, -215200, -25412, 67825, 26490, -166791, -230924, -222153, -222487, -109871, -153189, -216143, -127480, -164323, -196135, -201723, -89138, -128966, -116456, -66445, -25015, 20562, 49820, -21174, 6822, 143768, 159619, -20863, 29146, 183806, 340576, 291278, 216444, 182871, 113333, 107500, 118283, -3001, -141449, -104296, -83659, -89221, -88421, -71823, 13223, 23263, 62627, 6826, -75550, -182789, -82520, -36606, 89392, 144428, 16831, -171353, -160350, -163171, -74859, -38354, 5867, -48217, -142264, -130541]
17734a30541J03132K1961p6298K6240Q6331j05662n5187J23229o3771R7293k5750
17723I77J10504N7705r3508j3484l0373n2319M0301J23472j7539j49638j0821
17712c4723J001r5192m7198Q6870k3190o2580P5494J95313l3335l08L3820R4065
17700A90037J31360n1427k04100j13884j11777P9859M2049l9769O7811P368J18615
17689A16142J73213j17097k49851M4409J07353j59443j71487o565K5909N6302
17679a81115Q4249O5243R834M3301m1110q426J10401k6649n0952J5631n3148o0518
17667i3259J22599J11886p8221j63232J7391L643P6999r8692j31730n8835n2975
17656c44426J51350P5081n2796r856l5335J6059P9133J9739Q2627n156r5644J6094
$$ y = [-130541, -27409, -5448, -81746, -55506, 30825, -74837, -130024, -6795, -70566, 26727, 977, 111481, 169186, 75678, 62194, 31821, -20498, 19803, 143275, 125736, -23902, -34723, -33722, -128914, -176112, -89242, -112432, -175012, -99518, 95795, 62460, 62152, 95972, 190037, 321397, 269970, 65870, -48014, -159791, -79932, -37883, -77652, -9841, -2473, 116142, 289355, 172258, -77593, -33184, 74169, -85274, -256761, -263326, -237417, -181115, -96866, -31623, -21789, 21512, -19598, -28024, 82377, 55728, 4776, 20407, -32741, -93259, 29340, 141226, 63005, -100227, -82836, -79193, -2194, -100886, -232616, -291451, -344426, -193076, -117995, -170791, -180647, -215982, -199923, -120790, -101051, -18424, -23580, -119224, -103130]
17644a03130J68313P6153L9556n1440k33399l9770M3476q4846p9680J5442O1818
17633a87507O7335J02122k8085j59824m672m9763j14663K9592J64906J69671J77990
17622A67102m6879j07393L983J08400o4653l0226k9141j01956R1570N6726k8903
17611A8630J20062O8572p8140p2181k3667o3830n7752o0120j07835R1656P2689
17600i1916L7582o391k8988J1980J25066J34935P3858j19953m2977R8989o331
17589A85854k12440m5633k4167K193J36270J4802J02497Q5977k04430j04669k1017
17578h4763M5235O6885J58023K9336j53057m4288o6766o5146J36436R08N6191
17567G8994N2513J2742j7166l0042o8178O7542J45868j19278j18603p8851Q8482
$$ y = [-103130, 65183, 141336, 180892, 129452, -103947, -143717, -100241, -185087, -264767, -249325, -187507, -120172, -18050, -46135, -205959, -210631, -260394, -375057, -345465, -180559, -10888, 167102, 120223, 12830, 16813, 125213, 60560, 30334, 1193, -100763, -9193, 47533, 18630, 138692, 207264, 129124, 56943, 33276, -30554, -88306, -148426, -256261, -164605, -91916, -54334, -60725, -89713, -77733, 47333, 182268, 256126, 136173, 93196, 192185, 185854, -26586, -72219, -96386, -94193, 42077, 56879, 159376, 245353, 40923, -63746, -84763, -39528, 27357, 185380, 214716, 61659, 17371, -49395, -114541, 21895, 22803, 78994, 131507, 144249, 127083, 97041, 28863, 96405, 242273, 122995, 4392, -74459, 14023]
17556A4023O9953q7227M635L43o5421m5925j05704J4267Q2723J38612o2797J1612
17544c0906J17120J31424j2436p1679q2022k4730m3523l8555o1652M3616J46780
17533G3437P2827K050M9123M5978O3206l7564j27102n2382M9326J4168o8744l6007
17521D8316K4481M2478O4664j06229n1139J552P2764R5195j28234j17854Q585
17510d5421J1289J4640j32389L6754J06500J23662O9683n8890o6312M6025R570
17499A15111q7753Q6974J68055p6573j65610p8780L4082k156r6545j13394j9409
17488b35998L4825o212O4478P1813R7240N5357j57398J6719o9593j36735p877
17477b73381N4064K4354o8923N7978J31138R6658j072N4795J4475r7626j62542
$$ y = [14023, 83976, -3251, 1384, 1727, -63694, -109619, -215323, -201056, -118333, 20279, -42518, -30906, 86214, 217638, 205202, 133523, 51501, 26771, -16752, -55307, -116959, -73343, 73437, 146264, 148314, 197437, 243415, 306621, 269057, 141955, 89573, 138899, 153067, 84323, 48316, 72797, 115275, 179939, 73710, 22571, 24123, 96887, 192082, 63848, -54006, -45421, -34132, -19492, -151881, -115127, -8627, 115035, 184718, 125828, 59516, 105541, 115111, 27358, 114332, 282387, 205814, 40204, -38576, -4494, -6650, -103195, -216589, -235998, -201173, -207385, -142907, -71094, 26146, 81503, -75895, -59176, -128769, -265504, -273381, -219317, -194963, -263886, -205908, -74770, 21888, 20816, 75611, 90086, -7540, -170082]
17466a70082O5331J08526Q2900j6095r6209j11903J27496P6542K6601j4902K3166
17455A01371j30848l8664Q0437Q4804r6505k2155l1247J56834K29713O8650N4705
17444D57095L00604N44782K2956k94547l50834k62484k08651j5646K839L84j16734
17433G9764r0211R3257Q6628q1844K7193j1925P5962j3307r8534n1381m8453M0847
17421G996o3603j2742q5725N5069N9939l3582j2798M7603p667N3705k1135N014
17409g926m0680m4769P3591j02515j9493R1158J36295p2917p4234m49j6782m6016
17397a24737m3266j589K8645L8149J5759J9691j691J19465J09406p9473j28190
17386d7831L8323k5293P5501K994q7085j17309r8217K00609O5154R501N7845K1841
$$ y = [-170082, -104751, 3775, 86675, 70580, -25629, -137532, -10036, 66506, 93107, 78205, 101371, -29477, -68141, 12296, 97100, 595, -21560, -52807, 104027, 333740, 402390, 457095, 757699, 1302481, 1325437, 1030890, 680056, 417572, 208921, 193275, 196114, 196498, 79764, -10447, 82810, 169438, 87594, 114787, 102862, 178824, 165517, 66983, 15602, -32851, 7996, -55607, -68349, -154074, -99005, -39066, -72648, -85446, -37843, -45510, 8195, -12940, -7926, -48606, -93375, -19784, -122299, -141792, -50634, 85661, 12744, -61490, -61939, -78721, -124737, -168003, -169592, -140947, -102798, -87039, -67348, -69039, 50426, 159832, 80359, -47831, -9508, -34801, 40700, 43694, -43391, -160700, -258917, -58308, 6846, 16347, 74192, 96033]
17374I6033L0583j4282J5339q223J5992J37136j84785k63970O2095J43088N2193
17363H1199M350J5437o1777j12317J3038k5680J67625m0608j59931q2487r2536
17352b93687K6069J26398O6844p0881j29056J8573J18662j9025J01064N2351j25373
17341a28061R772j3613N9215J25001k3009k5806L764j45042L015m920P9476j2477
17329g2685J1785K4540k38447j60637Q356J43136J47502o0231N1785R9600J8802
17318b6494R1445M6345l7305P9284Q880K8197o5414J0505p1258r7550M3955R485
17306B0075p8910r044J7728K5059k6315O5936r7745l2793L8304k6393j20161J7274
17294b06985J89339n4838p8369J2138j6348J6608k1751J03462K5150m551o051
$$ y = [96033, 126616, 112334, 127673, 119450, 135442, 272578, 87793, -176177, -114082, 29006, 81199, 85549, 100986, 39209, -73108, -60070, -85750, 81875, 41267, -118664, -201151, -293687, -267618, -141220, -74376, -145257, -274313, -255740, -137078, -156103, -55039, -2688, -128061, -118289, -131902, -72687, 52314, 29305, 3499, 7263, -137779, -134764, -139684, -60208, -72685, -60900, -36360, -274807, -435444, -427088, -283952, -136450, -196681, -144896, -45296, -26494, 64951, 111296, 73991, 153275, 162155, 190352, 124938, 135443, 64185, -33365, 10590, 20075, -58835, -67879, -50151, -25092, -51407, 14529, -83216, -116009, -77705, -104098, -224259, -206985, -17646, -72484, -150853, -138715, -155063, -138455, -160206, -56744, -31594, -36145, -42196]
17283d2196p8186R4708J143k21809j19109J0250L4589K7345l9916J23473J31967
17272g7741r1874J7536J8463r7252N043n12N4427J82553j24140j49882m1322K09478
17260i5223J46787R4441k8544j33074j67027J0564J0052J00258P4775o2849j17857
17249a67697R1300P1708K6175o2152j67169n5330l8143J73216J62700k1743m5074
17238c2209j34448K0294Q6041j3582j03016J26138J92365Q5991p1053j28016J33740
17227A62245q7915m8744l0980K7061K8505K6309Q9882P1927K6411k33065j07488
17216g5852J9598j4282q1370L1004J09362p2306Q4610J01090K6114N1759j27147
17205E2580j04269K1742K3606j32906N5715M1173K5556j15846L4695Q0706j8387
$$ y = [-42196, -120382, -25674, -24531, -246340, -365449, -355199, -320610, -293265, -333181, -209708, -77741, -169615, -152079, -133616, -230868, -225825, -226337, -171910, 10643, -113497, -263379, -304701, -95223, 51564, 146005, 117461, -15613, -182640, -172076, -162024, -61766, 13009, -49840, -167697, -76397, -4689, 21486, -40666, -207835, -263165, -301308, -128092, 34608, 12865, -32209, -166657, -146363, -60322, -73904, -176920, -50782, 141583, 227574, 156521, 28505, 162245, 74330, 25586, -5394, 21667, 50172, 76481, 166363, 238290, 264701, 31636, -75852, -56254, -70536, -151906, -120902, -11540, -83846, 764, 101854, 127968, 179727, 52580, -51689, -29947, -6341, -139247, -83532, -42359, -16803, -132649, -97954, -17248, -35635]
17194c5635m3170O9780O0017r1831n2145L2397J58672J20039l1908p8756o3165
17183D4295J3326j34707n9756J227l352o6673j2514m1088r4960j42777J6569K24868
17171b55542J37292J33896R2149j10507l3139l9432N0440M2046J5603K7343J6193
17160G6342L8937r3441j22508N9029K4225r5293j7355J9400o6338j26628o2666
17149c66296P0514J30489N8063N7960J59486N3499m4635r8875p4418M938P0424
17138B1149O2R5976j51742j30506m5267J22568j00377j90234J45923J58605J54808
17127H0965J37282J25004j00593j16789L0001j7166j39899q1236J8006K5974j34618
17116a73069o9870L4534N3709j63552M9437J24963J65929P7185j40965j11887
$$ y = [-35635, -78805, -9025, 50992, -40839, -92984, -60587, 98085, 218124, 186216, 107460, 44295, 57621, -77086, -136842, -135615, -138967, -205640, -218154, -259242, -354202, -496979, -480410, -255542, -118250, 15646, 107795, -2712, -35851, -75283, -24843, 17203, 32806, 60149, 76342, 115279, 21838, -100670, -41641, -17416, -112709, -130064, -110664, -177002, -303630, -366296, -295782, -165293, -107230, -49270, 110216, 163715, 119080, 20205, -54213, -49275, 21149, 21211, 117187, -34555, -165061, -210328, -87760, -188137, -378371, -232448, -73843, 80965, 218247, 343251, 242658, 125869, 155870, 138704, -1195, -82431, -64425, -38451, -173069, -242939, -208405, -154696, -318248, -268811, -143848, 22081, 99266, -41699, -153586]
17106a53586o891K2116n8913M244J93681m4998p2389n8492l0396J08209J80338
17095H2923J11775q7920j11304L2757J44661P0198j60169k33206K1151K4188J01568
17084c378L1374j7009K974O401J01431r5836j14439l0574j7366Q1966o094j42094
17072b02644o9474N8534J29687Q1423l0409L0952L3073m1708p8255j8486l990
17061a11297m7279r0622M821N8679Q0831J69751O9800j27173n4713Q4296P6167
17050A13261m9511j4625l4585O070L0230J8247m528p7339p2000j3416L9451M8530
17038a0215j57r0713J01055r670l4715R0985L7725n82r2820j14395M1406p7377
17026a59473k2026M8226J62280J13267m5408j03924j62083l4085K17770J57011
$$ y = [-153586, -160477, -138361, -197274, -193030, 651, -44347, -116736, -175228, -205624, -97415, 82923, 194698, 106778, -4526, 28231, 172892, 243090, 82921, -150285, -129134, -104946, -3378, 27996, 10987, 13961, 20362, 121793, 25957, -88482, -119056, -136422, -54456, -60550, -202644, -272118, -213584, -83897, -2474, -32883, -1931, 31142, -10566, -88821, -107307, -111297, -158576, -249198, -244377, -185698, -104867, 64884, 134684, 7511, -47202, 37094, 113261, 63750, 49125, 14540, 20610, 50840, 69087, 64559, -12780, -84780, -98196, -58745, -10215, -10372, -101085, -30, -9700, -44415, 46570, 84295, 83713, -9107, -123502, -82096, -159473, -181499, -133273, 29007, 142274, 96866, -7058, -169141, -203226, 14544, 171555]
17016A71555q2549j46980m9988N3906Q1485R0661j22753m8103j43550N8207M4142
17005i3967k1427j6805L6602K821P5169m1904r8278J17739o430j1524O8691O6970
16993G7657N512j03287K6477J9425L1041M9903k411m7401j03392r188p3521m6670
16981a75855O4557J40914R0516k0575j66481q1856Q5012J33700j6683j90539n0693
16970a87983J87631J5057r7941p12l585m0039r1659Q3885L6568j7493m7553P2562
16958i1262L0793j0786m9712L0632J4536j7196j3393m5706o283j40704k3185R137
16946c13129J36066N4170j21217j26609j17594P0949K00927M95j9017L5967J6096
16935a82896m4739L4408N1979l9056J8325J27992J12505m512l4234M665n6529
$$ y = [171555, 89006, -57974, -107962, -54056, 27429, 118090, -4663, -52766, -196316, -138109, -93967, -115394, -132199, -95597, -92776, -17607, -59511, -157789, -40050, -46480, -58004, 10687, 77657, 83169, -20118, 6359, 25784, 56825, 106728, 104317, 56916, -46476, -55664, -129185, -175855, -111298, 29616, 120132, 99557, -66924, -148780, -63768, 69932, 53249, -137290, -187983, -352, 14705, -83236, -83948, -87533, -127572, -219231, -135346, -98778, -116271, -163824, -91262, -60469, -71255, -120967, -90335, -75799, -92995, -106388, -152094, -158377, -299081, -322266, -313129, -177063, -122893, -244110, -370719, -488313, -417364, -216437, -215942, -234959, -198992, -182896, -227635, -193227, -141248, -180304, -161979, -33987, 78518, 74006, 39772, 44437, -12092]
16924a2092p4163n2868q2920N456K12620Q1664J2031J1373p1806p8608p2500r224
16912a31037K602K5954p8224R2382l9165j49725N73J78301o5616l8162O4080o825
16900a44862k7583r4579L9870J5259o7808j438J91380J16665j1811R609j5589
16889I113q4220J10495r0617q4574O2004J14071o0258p0752p7339J4913P3394
16878h3770O3166J49299j01542k66730K1165J03236R192N1177L7966k4477R4905
16867E3587J31820n9892o8965p2071j6251N8536L0086j73344J888n0254j8276
16856a83136J0600J58567K7331p1171J9698r4277k0941N5357r5558j4787J69776
16845c8541O8086j26912q1336J13122J1058j6093p197M4072k2935k2485Q2709
$$ y = [-12092, -86255, -139123, -222043, -216587, -3967, 77697, 89728, 101101, 29295, -49313, -121813, -131037, -128435, -102481, -180705, -88323, -127488, -277213, -276640, -98339, -163955, -202117, -138037, -144862, -172445, -267024, -227154, -211895, -279703, -281141, -89761, 26904, 15093, 24702, 9113, -75107, 35388, -55229, -139803, -77799, 36272, -23986, -94738, -172077, -157164, -83770, -20604, 128695, 27153, -239577, -218412, -115176, -105984, -54807, -16841, -41318, 53587, 185407, 125515, 56550, -15521, -31772, 26764, 56850, -116494, -114606, -164860, -183136, -172536, -13969, 13362, -57809, -38111, -132388, -153329, -97972, -193530, -208317, -38541, 29545, -97367, -178703, -65581, -54523, -70616, -77813, -33741, -56676, -79161, 3548]
16834C548K3328r0675K1231J21857r91j57054K483R5690j292L7673m1284q4406
16822f9892r105O3339o4161P1228J11759k2280l9749m7092J20017O2406J9148
16811A95618n4048L3158K2962o2905k3649P0841K9029j24688k4807J6795J07631
16800A85937k3759l8357j30028j01050J19680J03875j04683o7009k789o6422l3086
16789a57691K5216Q5304M1986Q6342k58640J5983L2210O5555L7717k6653n3972
16778a06643n9078Q7127R568K0881L0113O8655M45j3161L9579R1929O0154Q023
16766B37592j23897O523l6477p0394K727o9233n5794n6214l1134O8097p5844J839
16754b02209M9459k5320m2734J43230J23475L3230j27469R7080l6691N54n76l0186
$$ y = [3548, 26876, -63799, -42568, 79289, 78298, -78756, -76273, 19417, 18125, 55798, 14514, -69892, -78997, -15658, -79819, -8591, 103168, 80888, 41139, -5953, 114064, 176470, 195618, 141570, 174728, 197690, 134785, 111136, 181977, 211006, 86318, 61511, 78306, 185937, 162178, 123821, -6207, -107257, 12423, 116298, 11615, -55394, -58183, -124605, -157691, -132475, -47171, -5185, 81157, -177483, -161500, -129290, -63735, -26018, -52671, -106643, -165721, -78594, -69026, -48145, -18032, 50623, 51068, 37907, 77486, 169415, 229569, 237592, 113695, 120218, 83741, 13347, 16074, -53159, -108953, -165167, -196301, -128204, -204048, -202209, -152750, -178070, -220804, -77574, 45901, 79131, -48338, 48742, 12051, 12605, 12029, -18157]
16742a8157N6033J4793m9501q0038p1099q3262j7704q8654r1837Q9368J37249
16731b02809J01424k3493k0493n1075p693O4657m46O8944j252r4939J17848J82146
16719A32819L3275k5700O1866O3669N3018j97365j01945m7320j11043M3408L8843
16708e6475K14283Q4614R488j26476m4951l8280K6170o629o4863r8571k4903M5529
16696h1064L4753n8414J26593J35074P316K4528m1510p6794q1280r9973K2611
16685h8160J8510R0442J56306o7508p8022J583k6676m257j7554J2472J96732j09805
16673H4063j61498m3640J8464N4824q2747j26865J23752R0870j03833J3234k8798
16662a62174j26261j2784J75102J01281n2398R046P6560Q2408p168m2022O806
$$ y = [-18157, 37876, 52669, 3168, -76870, -147969, -231231, -248935, -337589, -429426, -340058, -202809, -101385, -124878, -145371, -196446, -204139, -139482, -139928, -70984, -72236, -167175, -49327, 132819, 166094, 140394, 202260, 265929, 318947, 121582, 19637, -27683, -138726, -95318, -56475, 157808, 242422, 251910, 125434, 80483, 42203, 68373, 61744, -3119, -101690, -126593, -81064, -46311, -104725, 21868, 156942, 164258, 188786, 147276, 70482, -10798, -110771, -88160, -69650, 20792, 177098, 109590, 31568, 33151, 6475, 2218, -15336, -2864, 193868, 84063, -77435, -121075, -102611, -47787, -130534, -257399, -133647, -42777, -146610, -133376, -162174, -288435, -301219, -126117, -24836, -77234, -68188, 8372, 90780, 83612, 41590, 48396]
16651D8396o5778j07558K9225J00010M2209j37395p4482J74460J8531j4847J29695
16640A42466M4311l3746j33448r9984m6488r9546P77J4385J69891L1713N289M4810
16628D0430J9391M2472n5524r030p1903j49648q8141R4233J56191N224n7561j7634
16616i1500n4857m2114j04899O6702O9470K2836L1798J11591O4399n5963j02418
16605h4955N3648j687J3922L8538J8389J13729M684p0772k18910J05822J22378
16594I4786p6913j546j5162j15746n0298J18761R0202k3331J1959j6925J5859
16583C1646J14675k7497j15763m0620J35985j9543o3541j8774Q3867J71555q1979
16572A70011j53062p9878N0644j09434k18777J03857J15996l9586o4287O6378
$$ y = [48396, -17382, -124940, -95715, 4295, 46504, -90891, -165373, 9087, 27618, 12771, 142466, 186777, 153031, 19583, -80401, -126889, -226435, -225658, -211273, -41382, -9669, -4380, 40430, 59821, 102293, 46769, 37739, -34164, -183812, -271953, -177720, -21529, -16305, -73866, -91500, -146357, -188471, -293370, -226668, -157198, -134362, -102564, 9027, 73426, 17463, -84955, -31307, -32994, -19072, 19466, 37855, 151584, 156268, 85496, -133414, -27592, 94786, 17873, 16327, 1165, -114581, -164879, -46118, 44084, 20753, 32712, 15787, 31646, 146321, 118824, 3061, -37559, 98426, 78883, 15342, -3432, 80435, 251990, 170011, 16949, -62929, -12285, -121719, -340496, -236639, -120643, -160229, -224516, -158138]
16562a58138K7017J7314o477n6615J07081k7366L9834L0419P0615N9357q7170
16551A5871o3906o9214o1361m5358N0107K5081K1376Q315k42607o7130Q5521Q6058
16539b57247J35338K28981o9901n8262p8020k7379O824n9918O2994O4363Q8054
16528C5827j0395O6546j42518K4878K0284J657j954O5358O0934j6235l2931O3637
16516A35088j60591J326J18131m1681M1569j8736J10658l0900J4157R927q5554
16505I3394r9014O9475J70470j22131n7208p9840J54962m3286j09810j3519J35387
16494I8880J74399m1090m4881J4007j04780K7939N0060r5461o2835m8052r6111
16483a27925k4056j6274R3042L764L9345j1423j10455M4558L2969m7832O3676
$$ y = [-158138, -131121, -113807, -120284, -176899, -69818, -97184, -57350, -26931, 43684, 103041, 15871, -48035, -117249, -178610, -223968, -173861, -148780, -127404, -119089, -361696, -428826, -343305, -257247, -121909, 107072, 37171, -21091, -99111, -126490, -119666, -179584, -116590, -52227, 35827, 25432, 91978, -50540, -25662, -5378, -3721, -5675, 59683, 120617, 104382, 71451, 135088, -25503, -24177, 93954, 52273, 93842, 75106, 185764, 154864, 169021, 178948, 93394, -5620, 63855, 234325, 112194, 54986, -24854, 130108, 86822, -22988, -36507, 98880, 273279, 232189, 187308, 201315, 96535, 124474, 174534, 79073, 16238, -31814, -127925, -151981, -168255, -75213, -71449, -32104, -43527, -153982, -109424, -76455, -124287, -60611]
16472f0611O3938l0315J09508n9686j01606r074Q5302l646l5328m876J0734J7250
16460a8410J6199m0029n9938o2911P2225l6677j4687N7965J02012o2652n8393
16449a05296p875j41181J47669J59034j2076m7988r8799J3068J48410J9542j24880
16438e0372R243J6945j2478O055j48374N0428p294p8666p6816L6858J40319k8909
16426a43061L8186P7562l2995q7148q1887K05629J4811j00630k4193N5536P8380
16415A90K6706N273J7536m4720r9128q6226j3807N1586J34931R8025j24731r7991
16403a32356Q757J0809K6364p2327k3782n5661L773Q8467J57348R0224O3806P530
16391A72952l5992q8545K7028p5903j12667N178j4474o6632j29204N6204R2229
$$ y = [-60611, 3327, -26988, 82520, 22834, -78772, -87846, -2544, -6190, -41518, -46394, -35660, -18410, -2211, -42240, -102178, -165089, -92864, -129541, -144228, -86263, 15749, -46903, -105296, -113171, -254352, -106683, 52351, 40275, -7713, -106512, -93444, 54966, 74508, -50372, -41129, -24184, -36662, -30607, -178981, -128553, -135847, -214513, -291329, -254471, -114152, -143061, -104875, -27313, -60308, -147456, -229343, -23714, -8903, -109533, -133726, -78190, 190, 26896, 32169, 49705, 4985, -94143, -180369, -194176, -142590, -7659, 90366, -34365, -132356, -123599, -112790, -86426, -158753, -182535, -238196, -234423, -145956, 11392, 101616, 165422, 172952, 136960, 48415, 75443, -460, -113127, -107949, -122423, -189055, -318259, -262055, -169826]
16380a69826m7427R8371J35899k1392l983L0506n472Q1485n9094L437j41384J2772
16368h6108M2186q0164O3507R688n4461O2647J39877r0668m2393P3295k3153q1761
16356f7508j14656J22153M9188j6633j46746L4770P4239q563P8142l8807k8883
16345f3304k1859J6386O4077n3447J3575p0179o2140N73N5518P0519N8962L3328
16333D2009n0704o9824j5526R7521L7522L0807o4248K9187J44074q772r0656P4253
16321A55643P9633q1518j29075k568K6148P550L3950r7628P9868J37988M5515
16310B55506M4734J0788j66460j18800o0589j03547m5451M9401J5457k5411J2243
16299a32129j4422R2848m2173J11106k740k08052k514L3459m7158R9102J03405
$$ y = [-169826, -217253, -118882, 17017, -4375, -8358, 22148, 16676, 98161, 39067, 42504, -98880, -86108, -43922, -124086, -60579, -50891, -105352, -42705, 97172, 6504, -35889, 37406, 14253, -67508, -182164, -60011, -10823, -27456, -174202, -139432, -65193, -73756, 4386, -34421, -63304, -85163, -68777, -4700, -58147, -44572, -114751, -176891, -176318, -120800, -50281, 8681, 42009, -8695, -78519, -94045, 3476, 40998, 71805, 7557, 36744, 180818, 172046, 81390, 155643, 235276, 153758, 24683, 22115, 48263, 55813, 89763, -7865, 72003, 209991, 255506, 300240, 311028, 144568, 25768, -34821, -138368, -183819, -134418, -118961, -144372, -132129, -146551, -53703, -95876, 15230, 12490, -195562, -198076, -164617, -211775, -112673, -9268]
16288i268O2067R3788L5242r9706q542p1237M623N7804K5500r7530j49515j63237
16276c20011N1151M5047M2585J59314J14524m0440J9179j3649R265L7888k9502
16265G5351k21863k1269J05355J21613N1780j15731r2742J7812Q4122j9342r0796
16254a05710k8649R466M2280j4187L9194Q5830J30088J41150j16486k26970M7736
16243C742M3829j22648n2269o6355L9408J04911M3880K1418l8222j02792Q5096
16232d0002n4832l7265M7570J42503J30203n0066r326j19966k2318N0267N4305
16221I1073O806j22814j40294k3921M8246K02451p2175P8307J52030l2252l8629
16210A48828l2741q132J06216j06492m3823j8114K9957R5069M9622q1483j09506
$$ y = [-9268, 52799, 146587, 181829, 82123, 73581, 2344, 6967, 64771, 90271, -7259, -156774, -320011, -268860, -223813, -181228, -21914, 92610, 52170, 71349, 57700, 66965, 104853, 75351, -146512, -167781, -62426, 59187, 110967, -4764, -97506, -79694, 4428, -14914, -105710, -134359, -124893, -82613, -96800, -57606, 28224, 158312, 299462, 182976, -43994, 3742, 47571, -75077, -127346, -193701, -154293, -49382, -5502, 15916, -22306, -125098, -40002, -94834, -132099, -84529, 57974, 188177, 138111, 128785, 8819, -13499, 36768, 91073, 97879, -24935, -165229, -189150, -140904, 61547, -10628, 67679, 219709, 187457, 148828, 116087, 107955, 214171, 107679, 63856, 45742, 75699, 170768, 220390, 138907, 29401]
16199B9401o7629o2357L6642J3939Q5861k4442j46502P7559J7433j13139j9072
16188a72306l5297P4969M8674j7432j11552K9607J76666J30669L6381n5536j16824
16177a1981p9074o3160m9622J6291K53007j7891j20211j02825o9427J84874P7920
16166A7901K3186j7554m2045k2177O5587L1487j6071j03225J96620J49541j58425
16155A24825j17868j32358L4142j289J07694M2041k44993n2340J32529J4070L8159
16144e5388q9843l156J19979n1770m464J03877M4844j32333N284N4K0815M6888
16132D787o0424j56809r290L1304J42042J28369j7986l6276j51250j1137J0250
16121a26420J04564l5717j0429Q3486j27190n6141J30618O9368k3619O6534l8968
$$ y = [29401, -38228, -100585, -63943, -50004, 35857, 11415, -135087, -57528, -40095, -153234, -172306, -207603, -132634, -83960, -101392, -212944, -183337, -6671, 123998, 160379, 104843, -11981, -91055, -154215, -203837, -187546, 65461, 47570, -72641, -175466, -244893, -60019, 17901, 41087, 23533, -18512, -40689, 24898, 56385, 40314, -62911, 133709, 283250, 124825, 6957, -125401, -91259, -92548, 15146, 57187, -187806, -240146, -107617, -93547, -55388, -145231, -148387, -28408, -80178, -84642, 19235, 64079, -68254, -62970, -62916, -42101, 4787, -55637, -212446, -221736, -190432, -48390, 79979, 61993, 25717, -125533, -136670, -126420, -21856, -57573, -68002, 15484, -111706, -167847, -37229, 32139, 8520, 75054, 36086]
16110C6086n9701j6729o6457Q8103O8863j39404K5113J5779j33469q4660k4627
16099b91103j29986J12907J55006J6828L8877P1017J66494J4581L6626p5726j39360
16088b3839m0222j14746M622J16406q6761j8999P8933M6000m456J65707J2184
16077A34829m5501j00626l6543Q5147L1256J8349Q1774m8476n9281k0502p064
16066C3362L4538q4793j323O7672k6881K0011q9089j0262J09999O3781p1789J9631
16054F4857r2939m4279N5645o6790j29798n376j7223Q5169M8987M9326l1115P7380
16042f156N4721k9832j4998K2623j35009j13560l5952O5228Q2804p3553L9765
16031a43919L9573P3665j74670o9487J02098Q3633J8675M8684J24695m6827j26936
$$ y = [36086, -23615, -40344, -106801, -18698, 50165, -89239, -64126, -48347, -181816, -266476, -291103, -421089, -308182, -153176, -136348, -97471, -26454, 140040, 154621, 191247, 115521, -23839, -64061, -178807, -174185, -57779, -144540, -163539, -84606, -38606, -43062, 122645, 134829, 89328, -11298, -47841, 37306, 68562, 86911, 168685, 120209, 60928, 40426, 33362, 67900, -16893, -18216, 49456, 22575, 42586, -46503, -56765, 53234, 117015, 45226, 64857, -28082, -72361, -16716, -83506, -213304, -218680, -235903, -150734, -101747, -52421, -83536, -6156, 48565, 18733, 3735, 26358, -108651, -222211, -258163, -192935, -110131, -183684, -143919, -104346, -30681, -205351, -274838, -172740, -89107, -70432, -21748, 102947, 56120, -70816]
16020g0816M1016P7882o357J1817j545m2292r3394l7791l7065J3285O5440J74720
16008I4900j8465M253J71216J11440K9546j65912j34536p3022K00186R4371j69975
15997A44002j9870j65876p7214J62730q8573p0575J70978M5147o9423K7565k9657
15986B9234J54648R3747k22625j50907O2119M6661j01745N3248J09261n6148o3638
15975d6145n0249m3019j30619J50993J75974l0822L0838J1707j6388m8484o4242
15964f0456L3546M650j08361J2010R9652P5638n6673k3180o4219O7943k9840J7740
15952c1550k0040J26843o661o3705m3191J0526J15251l4259n6542O7809J12469
15941A76950O6066m6920p459n0932j5384k7149r025p159j13087j52337k8334J78524
$$ y = [-70816, -29800, 48082, 41725, 53542, 51997, 9705, -83689, -121480, -158545, -145260, -79820, 94900, 76435, 80688, 251904, 363344, 392890, 226978, 92442, 19420, 219606, 313977, 144002, 124132, -41744, -118958, 43772, -44801, -115376, 55602, 100749, 31326, 58891, 29234, 183882, 277629, 55004, -95903, -33784, 12877, -88868, -35620, 73641, 17493, -46145, -96394, -139413, -270032, -119039, 56935, 26113, 56951, 68658, 52270, 3786, -60456, -26910, -22260, -130621, -118611, -18959, 56679, 6, -23174, -87393, -19450, -49290, -31550, -51590, 75253, 68592, 4887, -38304, -27778, 87473, 53214, -3328, 64481, 176950, 243016, 196096, 188637, 137705, 122321, 95172, 86147, 78988, -34099, -186436, -214770, -36246]
15929c6246J64932l236j41998j68513k9996J02349O3317O0312n1994O1722l7125
15918a6476j25451O364Q7447n567p0776m0739J23710M668J9881N8852o5654j11615
15906a35356m8774L1798O0615m2222l2210J39937J11650L2785k0688k0912k0153
15895E6470J6187M7168q7775l7738r494m1258M235P185J48568o885r176j82589
15883i5102l6440N5411j9389l4386M7702J914n1172M1598O2113r6186N6239O0628
15871g070j08156q3789N6539K25571K9135p8818L9608l625j19184R9822o8654
15860a8621j01511O0066j04841l2935R635J35452L4272m5967M3388K9646n5918
15849d7334j6968j1049J18766J13543J65348J9949j53796k0159O9127l0101k6771
$$ y = [-36246, 128686, 125450, -16548, -185061, -215057, -112708, -49391, 10921, -41073, 20649, -16476, -141927, -135563, -48116, -53683, -124459, -165198, -41488, -36820, -16939, 41913, -23741, -135356, -184130, -152332, -91717, -133939, -166149, -26212, 85438, 118223, 97535, 76623, 56470, 72657, 119825, 32050, -5688, -15182, -56440, -52205, -45020, 103548, 96663, 87487, -95102, -131542, -76131, -95520, -129906, -82204, -80290, -131462, -89864, -27751, -123937, -67698, -7070, -115226, -199015, -142476, 83095, 112230, 33412, 73020, 69395, -49789, 50033, -18621, -120132, -60066, -164907, -197842, -188207, -52755, -18483, -64450, -21062, 8584, -47334, -64302, -75351, 43415, 156958, 322306, 342255, 188459, 168300, 237427, 207326, 180555]
15838A80555P0102N1361J314o6605m3775L067J70752m4243j05814k13947p70j3019
15826a1022n9744L5794k5171o393Q2363J82625Q7494j7359j2941q9280p2567j07752
15814a3953k07919J2592J05186J01161l6791M3061Q7638o2498Q6557K3544Q958
15803A47536j5920q9813J12513R484j06451r3602L8073M8883q1585r9621q990
15792a39493J0897L4417P1831N1150J410q0064q4566J31822R409P6239J14756
15781A97808p4863j26210K9293J7480J2142N2864q7924j23231J28074R7541p978
15770A14996P193K6087k7982j62722m0218J45192O0941j72144o9309K6812l4750
15759a25904m44K624O1772M7741L8260r3591J37703Q1605m079m8390q1688M7659
$$ y = [180555, 250657, 302018, 303332, 236727, 192952, 196019, 366771, 322528, 216714, 2767, 1997, -11022, -70766, -34972, -60143, -66536, 15827, 198452, 285946, 268587, 255646, 166366, 93799, -13953, -221872, -209280, -104094, -2933, -39724, 3337, 90975, 28477, 115034, 138578, 147536, 131616, 41803, 154316, 163800, 57349, -36253, 1820, 50703, -30882, -130503, -139493, -128596, -94179, -22348, 28802, 30212, -49852, -134418, -2596, 6813, 83052, 197808, 122945, -3265, 26028, 43508, 55650, 108514, 20590, -102641, 25433, 122974, 114996, 122189, 148276, 120294, -42428, -82646, 62546, 123487, -48657, -117966, -91154, -125904, -126348, -123724, -61952, -14211, 24049, -69542, 68161, 149766, 145687, 97297, 15609, 63268]
15747F3268M7439k9637j58182k1881K0830k588j26753o2895J43476J09411r1074
15736a08586M9154J18827M8748N2237j6066p4211O925L0151l5450n3920L7261
15725E5070L7997j7885l9955p2648o2129M9896j4084q844j8393N6203N7365m6619
15713b4026Q679Q2565Q6276P7523Q3177q7665j18861o7432R9115P9799o4164j19596
15701C5390r486J36010n6447j32263L8035L8806L5195o0535o7367j76539R7424
15690a21777J3809l989J47788p7672k0828j19230m3892J02271J8209k7196J08896
15679b3611q338j4646M832J9883M5060o603l352p928j2451l6280O9081J4632j53692
15666a13413j8544m5868k15466r360K26713M663j9387O168o1414J12420N6291
$$ y = [63268, 110707, 81070, -77112, -98993, -78163, -80751, -207504, -270399, -126923, -17512, -108586, -59432, 59395, 108143, 160380, 144314, 70103, 77028, 107179, 71729, 17809, 55070, 93067, 75182, 35227, -37421, -99550, -49654, -63738, -72582, -90975, -34772, 22593, -24026, -15347, 67218, 153494, 231017, 314194, 226529, 107668, 40236, 139351, 219150, 154986, 35390, 25904, 161914, 105467, -26796, 11239, 50045, 85240, 24705, -42662, -219201, -121777, -107968, -111957, 35831, -41841, -62669, -181899, -225791, -123520, -105311, -132507, -23611, -31949, -46595, -41763, -21880, 23180, 16577, 13225, 5297, -7154, -43434, 25647, 40279, -113413, -131957, -177825, -393291, -402651, -175938, -171275, -190662, -184494, -245908, -133488, -77197]
15655g7197R28K2821j23928P3984J37467J8921j00727j9020K4965l2324j445M3707
15643c1848o2995n5239J29965j8981j07311J44160J3472q9254m4400n8442J1346
15632a69527O5509M3531J7697q041m7170r0256R3692R3588o4765j6769J29394
15621D6883J57913m5124j08488k4751k373J06266l8370p7622k5446k2212L1589
15610a735P4347Q3539R7576J9930k00923r4764N018m1698n3025r6927J81374J80691
15598A53403K9164k144n5926j90401j35289M6882J83351M4749k4254j0354n6334
15587a7153j06713O3604q2655r376J75322l4054J5938n5701q6790r3463Q6995
15576a44046l810j7414J22825J34164L580l3839M6380M488r4593K548j2057P2365
$$ y = [-77197, -76269, -53448, -177376, -103392, 34075, 52996, -47731, -66751, -41786, -74110, -75555, -31848, -94843, -150082, -20117, -39098, -146409, -2249, 11223, -78031, -122431, -180873, -169527, -104018, -60487, -42790, -50831, -98001, -188257, -94565, -977, -65742, -82511, 46883, 204796, 159672, 51184, 26433, 24060, 130326, 91956, 14334, -11112, -33324, -1735, 72612, 156151, 253727, 273657, 72734, -22030, -17012, -58710, -111735, -208662, -27288, 153403, 182567, 180423, 124497, -65904, -201193, -154311, 29040, 73789, 49535, 39181, -17153, -123866, -60262, -142917, -152293, 23029, -11025, 4913, -50788, -137578, -231041, -144046, -147856, -165270, -42445, 91719, 95299, 61460, 107840, 112328, 17735, 20283, 8226, 80591]
15564H0591N918J0960N2089j6319K1837P2317o4031j38900j54347J10624j1007
15553c0268M8616Q4724P3115M0311K7270M2620p6573q9756j67802j24901L6733
15542a35911q4630l0264J30188Q2381Q6047J7805p7038M4483p7823j19907k8940
15531a93609J05109O747q2332N6067M7063R1370Q909j09027m2340J07337J15513
15520A10807r3452o5030j47522o1774J42897Q7757J4525K1125K6549L3010k0902
15509D7990l1989n508r5503K2765M8685k0144M5145j15521L1761n301M4013j00454
15497a34061K6195J17311M9835Q5833j6089q6193j33655K5712K2201r9341L1910
15486a10342N5728n229o6N3794m8551Q9737N2200m214Q592O0433o911L585j18678
$$ y = [80591, 86509, 97469, 149558, 133239, 155076, 227393, 163362, 24462, -129885, -19261, -30268, 18348, 103072, 176187, 216498, 243768, 286388, 209815, 120059, -47743, -172644, -135911, -220541, -250805, -120617, -38236, 47811, 65616, -11422, 33061, -44762, -164669, -193609, -88500, -81753, -164085, -108018, -60955, 30415, 39324, -69703, -112043, -4706, 110807, 17355, -47675, -195197, -256971, -114074, -26317, -11792, 9333, 35882, 68892, 47990, 16001, 10493, -85010, -62245, -13560, -33704, 11441, -104080, -72319, -77620, -33607, -134061, -107866, 9445, 59280, 145113, 129024, 42831, -90824, -65112, -42911, -142252, -110342, -54614, -59843, -59909, -6115, -54666, 35071, 87271, 83057, 91649, 152082, 145171, 148756, 30078]
15473C0078j13811q0538l8759j840K7205j4829p429L2383P9080j7694R7065M1278
15461C2189K3224K4441n762j56908p897J33596m3153K899L8309P5739l7681p2144
15449F852l0739j86092p3549O666Q3589J81170J4848l9899j09589J39389N3795
15438D6441P1081K8240N6707J37689j07568r0961n3174j3197j10497L5370K9108
15427B9239N1671J1084p0353j718j62845M4361j9421p1170O4980P6459K77434
15416B29721J18251j27523j01652J5749k1586j73051r9385J43456O4960N1136
15406A00076j0738q4958q6204n4862M4618L4588Q5032N9584R775l9673K2099k3055
15394E6282k18091K5313N7079j51700J04945J31707k7918k06860Q8290J18687
$$ y = [30078, -83733, -164271, -203030, -204870, -177665, -192494, -199923, -167540, -88460, -106154, -9089, 32189, 55413, 79854, 74092, -82816, -90713, 42883, -270, 2629, 40938, 116677, 78996, 6852, -23887, -209979, -283528, -276862, -193273, -12103, 2745, -37154, -146743, -7354, 46441, 117522, 145762, 202469, 340158, 232590, 141629, 88455, 75258, -35239, 131, 29239, 80910, 91994, 21641, 19923, -142922, -98561, -117982, -189152, -124172, -47713, 229721, 347972, 220449, 118797, 134546, 112960, -60091, -159476, -16020, 48940, 100076, 89338, 4380, -81824, -136686, -92068, -57480, 27552, 87136, 96911, 57238, 79337, 56282, -161809, -136496, -79417, -231117, -126172, 5535, -22383, -229243, -140953, -22266]
15384b2266l2450M9518P9918j7373r8254q7182L9199N9520m6486k7760M8694q9897
15372a44819k0769J29916M5034q9814j42510j6261K04658J02731j41546J57519
15362H4139O0970K583R3404j09912n9945N2324l9162j61525k1154Q3361M7931
15351C3014O6455P6530J0946q8922M345K3192P7628m4712j4157J9956N45j05269
15339E9551r2524o7211k0900J28194K2347q2251q4437j6329P1619L2874P1939
15328B2872Q1341R7752m6631j54295m9152L9745Q6288R4199L7063m2443J14405
15317B81144n6525r5639m3885l5864j50097j4417P9201O4554K7065p7316q8792
15306a10571K9913L774J80708K9520j45588N5519K465O9090J1595n4579r0389
$$ y = [-22266, -54716, -5198, 74720, 57347, -40907, -128089, -88890, -29370, -75856, -103616, -54922, -144819, -165588, -35672, 9362, -80452, -222962, -239223, -34565, 68166, -73380, 84139, 145109, 147692, 241096, 131184, 71239, 123563, 84401, -77124, -98278, -14917, 33014, 99469, 175999, 186945, 98023, 102368, 125560, 203188, 158476, 144319, 164275, 164820, 59551, -32973, -100184, -121084, 7110, 29457, -52794, -137231, -153560, -81941, -49067, 22872, 104213, 201965, 155334, 1039, -48113, -8368, 77920, 172119, 209182, 166739, 281144, 224619, 128980, 85095, 49231, -100866, -115283, -36082, 28472, 55537, -21779, -110571, -80658, -76884, 103824, 133344, -12244, 43275, 45740, 114830, 126425, 71846, -18543]
15295a8543j32281J5079M7616L256R5638J06126n3565j17958N5616M0710J60463
15284B02157q3431n0574p656j0149j12546j18084J25452J31086p1246j09682m43
15273a05116j58928n5009N3876K2640L3395M0904J10616J07320Q0234J5047r3290
15262E1689m8894K4504m7512l8384q2515L8873J3651m7446p1462Q5336J59795
15251C7635l2082j33411l0159O1978N5449l2677J4202K1206P9702k1270L027L4024
15239E7624q7841l3706N1459L6057O6735p6486O5723R217p8808M5576J0712p5286
15227i024j55576L1336P1539J12643J53078R4151j2483l9298j12653K0772M3271
15216A97756r4675k5222j4721k2607o5666q1205j14133j1794r1338J01252K18610
$$ y = [-18543, -150824, -135745, -88129, -84873, 10765, 116891, 63326, -54632, 984, 41694, 202157, 118726, 68152, 60496, 50347, -62199, -180283, -54831, 76255, 5009, -104673, -105116, -264044, -319053, -265177, -242537, -209142, -168238, -57622, 49698, 129932, 144979, 51689, 2795, 27299, -20213, -58597, -141112, -102239, -88588, -136034, -207496, -122160, 37635, 5553, -127858, -158017, -96039, -40590, -73267, -59065, -37859, 41843, 20573, 23600, 57624, -30217, -63923, -12464, 23593, 90328, 13842, 79565, 88782, 9974, 55550, 66262, -9024, -164600, -133264, -61725, 50918, 203996, 298147, 285664, 246366, 133713, 154485, 197756, 103081, 77859, 63138, 40531, -25135, -106340, -220473, -232267, -323605, -222353, -3743]
15205c743J3397j5691R1627j17339P2658J32653p6954j7977q7790m8880K3189
15194c4850n0087j30247N0755p6833K4600L3532K4652J17459J21661j8715m2534
15183A9393K2249J5548j19881M0492O2107k5380O9596q2746o7871N4204N3110
15172D0821N254m7364O3028k6446j8303o1375r7219j48117m3602J1641J05866
15161b15816J19034M0334J37887L5936o811j35629P7411k9613j34116M0929m2709
15150a13163P9273J17829q2184P8284k0760J8374P6634q4218r1031k6417N1856
15139D477j42789m5567J69329K24o7641l7471M6870J25675j4345K9962Q7023o8774
15127H6973o6231m508L0408l9654L6141K4594L6399K3505j5470q1570K3345p3992
$$ y = [-3743, 9654, -6037, 85590, -31749, 40909, 173562, 96608, 78631, -9159, -58039, -34850, -84937, -215184, -164429, -241262, -216662, -183130, -158478, -41019, 80642, 61927, 19393, 41642, 57190, -62691, -22199, 39908, 14528, 84124, 1378, -66493, -12289, 40821, 46075, -1289, 61739, 35293, 16990, -44385, -141604, -289721, -333323, -321682, -215816, -96782, -56448, 81439, 117375, 110564, -25065, 52346, 22733, -111383, -70454, -113163, -33890, 83939, 1755, 80039, 59279, 77653, 154287, 70069, -20962, -47379, 4477, -138312, -183879, -14550, -14326, -81967, -119438, -72568, 53107, 38762, 68724, 155747, 86973, 20742, 16234, 46642, 6988, 43129, 67723, 104122, 127627, 112157, 30587, 53932, -20060]
15115b0060J5728J20371k5716P6796R4088j13877r3964l7348l4332K0791N4323
15104E6800P7653J5037n6116J3292L3876M8183n5326k26624o8904J22890K3615
15093a5624K2724J67317k6190j52364j28686Q5949J45780o4408j0066p2255N90
15082d7233L2569P3701J23923l6940K1931j11285p116R701n7391N1925n4707j00417
15070a01339n4669K0329J66230K8160r339n0813r999J711l9366R0557J33143j86330
15058a1725l4153R1980Q2122n8081r1183j29039k09075j2235K1807M951J22231
15047b22400N646M4062K6122P8408J95010o0121o889j55131J47696J15994O9031
15036B37428j30920j32812k6991k8310P4164J52769j22407n7048L8990j20873
$$ y = [-20060, -4332, 116039, 90323, 167119, 261207, 147330, 53366, 16018, -18314, 2477, 56800, 134453, 149490, 93374, 106666, 140542, 188725, 133399, -93225, -162129, -39239, -15624, 7100, 174417, 148227, -4137, -132823, -46874, 98906, 34498, 24432, -47823, -47233, -14664, 59037, 182960, 146020, 167951, 56666, 49550, 59251, 1860, 53785, -922, -101339, -156008, -135679, 30551, 58711, 49372, -1441, -11440, -9729, -49095, 41462, 174605, -11725, -45878, 46102, 128224, 70143, -21040, -150079, -359154, -371389, -349582, -344631, -222400, -216754, -172692, -146570, -68162, 126848, 66727, 59838, -95293, 52403, 168397, 237428, 106508, -26304, -53295, -81605, -7441, 145328, 22921, -34127, 4863, -116010]
15026a16010k2036K3158Q6970N5695j3387j15154j04474L7710J20617P8014j18213
15015h7110N320P7228j078J1265j6217P0786L7727O6392J5879L811p1644j03824
15003H535l966O7676m307p0062j4414Q2858l0588p3753M437K8951J5417L0402
14991D1186J24130j9466q3630q2802L7048P5690K0938q575J16862Q8910j42891
14980A67400p3273j16965j2095p4155O1283P6884j2131j4321l610K8665J06693
14969A34375m2803R7514j1790j34992M9001n2036n3595o5158J19841L6884P449
14958H4690j6159M91p8344N9247J01636O790j5708j77248M2618m4274j7681J00560
14946D6618l6702J9285N2055J23855N4364o003j75M594j00551m3972P208l4925
$$ y = [-116010, -138046, -114888, -27918, 27777, 14390, -100764, -205238, -167528, -46911, 31103, -87110, -81790, -4562, -5640, 5625, -10592, 60194, 97921, 164313, 180192, 184003, 112359, 8535, 4569, 72245, 67938, -2124, -16538, 66320, 35732, -38021, -33584, -4633, 10784, 41186, 165316, 145850, 62220, -20582, 16466, 92156, 113094, 104519, 221381, 310291, 167400, 94127, -22838, -34933, -109088, -47805, 29079, 16948, 2627, -983, 27682, 134375, 91572, 189086, 177296, 42304, 91305, 39269, -14326, -79484, 40357, 77241, 84690, 68531, 69022, -9322, 49925, 151561, 158351, 142643, -34605, 8013, -36261, -53942, 46618, 9916, 29201, 81256, 205111, 259475, 253472, 253297, 257891, 157340, 113368, 120576, 85651]
14934H5651P323k0043K0489q282j44239n9321J31076l1980o4180L7832Q9384l1393
14922A2317L2399J37123P709k5451q0186l6656J50125J9703j19855j00297M3673
14911D0604o9097K2982J29912R7699K6592L3774j60405j04712j2608m112L1355
14900C1984J05918J2583q4227j2367m2212l477l8067P6548R2574j01513j06760
14889f9016j20120k6966J44977J8640q8067J29496J8925n1537L3353J8444k7031
14878a8902J4378J21147J81362l4087j06789K514J01227k8520k3058k1584k3286
14867A64402q7548p7748m7964q2790R275l5588J11855l9912n0888m0160R5301
14856h1765R2570j25242o4493j09308P4306K03880R3338l6921j80330j0819k795
$$ y = [85651, 92974, 72931, 93420, 85138, -59101, -118422, 12654, -19326, -83506, -45674, 43710, 12317, 44716, 181839, 189548, 164097, 83911, 47255, 197380, 217083, 97228, -3069, 40604, -28493, -5511, 124401, 222100, 248692, 282466, 122061, 17349, 4741, 629, 31984, 137902, 150485, 66258, 53891, 11679, 8202, -29865, 46683, 139257, 37744, -69016, -189136, -216102, -71125, -52485, -140552, -11056, 7869, -43668, -10315, 8129, -18902, -4524, 116623, 297985, 263898, 157109, 159623, 260850, 232330, 209272, 187688, 164402, 76854, -894, -48858, -131648, -122373, -157961, -46106, -86018, -136906, -177066, -81765, 10805, -114437, -178930, -288238, -213932, -10052, 83286, 46365, -133965, -144784, -147579]
14845a47579R9348k1654M7813R8842N7507J813k5018p3283n3085J40314N9264
14834A84282p9263m3601j8293j7486L2455L5439M9829M7297N2346p0735K5623
14823A97893r9269n2396L2994M3710m2584l1736j04941j59209J28689K83934r8284
14812I8801j54721L4644l4763K1211K6147N9119J2456L2307r1751k11098o7259
14801b74907P2940J71290J46568J29452j27498o8949o0187J06307p6273k0141
14791a398K5768n6050j14911M2903J55723J25153Q0317m4135j25751L0099M5593
14780A63311j2996O159m7215j4879K3027M122K7882j07610J75158J0388q1039
14769A46308q2169K084j04615M136J19792r370P3049l7920j88769p4106M6661
$$ y = [-147579, -48231, -69885, -22072, 76770, 134277, 136090, 111072, 37789, -15296, 125018, 184282, 105019, 61418, 43125, 25639, 58094, 93533, 143362, 190659, 243005, 172270, 197893, 98624, 46228, 79222, 122932, 80348, 48612, -56329, -215538, -86849, 197085, 98801, -55920, -21276, -56039, -34828, -8681, 50438, 62894, 95201, 3450, -207648, -274907, -201967, -30677, 115891, 245343, 117845, 48896, -11291, 95016, 18743, -1398, 24370, -31680, -146591, -103688, 52035, 177188, 257505, 213370, 87619, 117718, 163311, 150315, 156474, 109259, 94380, 117407, 121529, 149411, 41801, 216959, 227347, 146308, 64139, 66223, -38392, -34256, 85536, 76166, 149215, 111295, -77474, -151580, -104919]
14758a04919J19476p0741P7746J59106q171j41762j83667q661p443J41205m7069
14747g4900J22323K10088M0729k12069q1295O8274j07941L2545j0615o453P2563
14736E3249j325K1083j0489K2683K97p74p0706o9776K3914K8834M8304l3409l3112
14723b1227Q4834O0878K715l6510o1757M9548p0782j10279p3801K8862J75176
14712B7657O3207p527J29910J32458j50026j5190q1919q0961n6349j55016j08689
14701c02445n7847K05817J0329O1674J09429O354P8988J06433o7599j52291j33606
14690a34764k9182M7923J49916J03336n9409j3503J10378R8679p5055j54238k1906
14679B2175j3561l8094j18538J30333J0666j29436k7784Q2251l125P7403P4721
$$ y = [-104919, 14557, -56184, 21562, 180668, 172497, 30735, -152932, -161593, -169036, -27831, -74900, 47423, 257511, 298240, 86171, 4876, 73150, -34791, -2246, -12861, -19314, 53249, 51924, 73007, 62518, 85201, 85498, 84724, 14018, -55758, -31844, -3010, 45294, 11885, -21227, 63607, 124485, 127200, 90690, 28933, 78481, 7699, -102580, -176381, -147519, 27657, 90864, 83337, 213247, 345705, 195679, 180489, 98570, 17609, -38740, -193756, -302445, -360292, -154475, -144146, -82472, 26957, 33311, 112299, 218732, 151133, -1158, -134764, -163946, -116023, 33893, 137229, 77820, 64317, 174695, 273374, 198319, 44081, 22175, 8614, -29480, -148018, -17685, -7019, -136455, -164239, -81988, -85113, -7710, 67011]
14668F7011j4994J35465p708o8266J19080o4792j09812l5525K7170j66032O7626
14657e0777l6219J52458n4927Q77n3278M1291R8903M6891k5225p6774j42747l6653
14645a36180P1113J18979O4923j9642K1270r2307P6477J7921j63368j15052m5690
14634b01556L7530J28906Q7070n2577R6370N9359Q911o7569j27299j28699P7751
14623h1803J20695J664M7088J21454k200n722l952k3864r5054M5945M895O6388
14611A95534n4423m819J12105m9577j88526j96786j23889M2369P1777R2915k3994
14600a27314l7234k7186J09802J5969L6929k5197q7765k9001J2986J40129L711
14589a4171J6804R1402M32k4313L1038j8284j45457Q821j465r3618M1272L9082
$$ y = [67011, 52017, 187482, 179774, 111508, 230588, 165796, 55984, 20459, 47629, -118403, -50777, -86996, 65462, 10535, 11412, -41866, -575, 98328, 145219, 119994, 43220, -99527, -136180, -65067, 53912, 118835, 99193, 120463, 28156, 104633, 122554, -40814, -155866, -201556, -164026, -35120, 51950, -627, 95743, 155102, 164013, 96444, -30855, -159554, -81803, 38892, 40556, 87644, 209098, 206898, 201176, 197224, 173360, 78306, 124251, 129146, 195534, 141111, 136292, 248397, 198820, 10294, -186492, -310381, -268012, -196235, -103320, -127314, -164548, -191734, -81932, -65963, -29034, -54231, -141996, -170997, -158011, -17882, -14171, 2633, 94035, 94467, 70154, 101192, 82908, -62549, -53728, -55193, -148811, -107539, -68457]
14577f8457J07575j2468m6112m5461N0520k7945n3151J51338J8103j30672n1160
14566a07890j0098K71N5477J72881O8488p0756j33126l2950J48791J01319P0563
14555B62970p7763p2070o1695n3210L6611J12317o6029k8185Q5453L4089j58360
14544A4128j12475n0707K8201K3669m9073J36921K0958j18337K2253O7729K4278
14533G545O6903r6138j2823R4420j23897p5795p213j3250R3013J00904M0307j31604
14521e7628O6356L8973K1031N539p637N3872j0472n7517n0071o0318n3221m3156
14509a54249J66261K30644N6939r4374j55262m8704j05964j36905R4433J36900
14499a0281j489j38022J4132J8999j6119K5465P0109J37896j553K9500Q743r4725
$$ y = [-68457, 39118, 26650, -19462, -64923, -14403, -42348, -95499, 55839, 73942, -56730, -107890, -117988, -117717, -62240, 110641, 179129, 108373, -24753, -57703, 91088, 192407, 262970, 185207, 113137, 51442, -1768, 34843, 147160, 81131, 52946, 138399, 172488, 14128, -98347, -149054, -120853, -97184, -146257, -9336, 11622, -106715, -84462, -16733, 7545, 74448, -21690, -34513, 59907, -63990, -139785, -146998, -160248, -67235, 33669, 73976, -57628, 8728, 47701, 68732, 74271, 66634, 120506, 110034, 52517, 2446, -57872, -111093, -154249, 12012, 242656, 299595, 205221, 49959, 1255, -104709, -241614, -147181, -10281, -11770, -149792, -135660, -116661, -132780, -107315, -37206, 100690, 99137, 128637, 137380, 42655]
14487D2655l0523P883n2405R5815L5483n4929k8629j40018p3740K15988N2782
14476G0362L7444Q6752n8740l0054p4987K9956M6075o7856q5289J27261Q6049
14465A66973q8226p5354J65311J11640o3078J9234j7654o0377q5624L716q4245
14454g684Q3876m914M6300L6742m6058J2117p6619k3111q127N1341n3167l9183
14442b8487L8533r5075o7710K4525J2563M9184O3952M8123R4112j8061n7116l4488
14430C0055j80562p3417Q8722K2826P9609J2026m0547k057J18589J46734P6394
14419B78372j5730J11302K5763j71005j30527m8646j2183m8010N0918Q9978m7895
14408H2337j77879r2046K7284J19096J47044K3298N6378Q6428l9241k9777q3284
$$ y = [42655, 12132, 20015, -32390, 63425, 98908, 43979, 15350, -124668, -198408, 17580, 70362, 107806, 194558, 135818, 105764, 30777, 60733, 106808, 38952, -46337, 80924, 166973, 78747, 3393, 168704, 280344, 217266, 236500, 218846, 158469, 72845, 76561, -7684, 76192, 71278, 117578, 154320, 108262, 120379, 43760, 20649, 12522, 63863, 10696, -28487, 10046, -85029, -152739, -128214, -115651, -66467, -2515, 45608, 139720, 121659, 64543, 30055, -150507, -223924, -135202, -112376, -32767, -20741, -61288, -63345, 55244, 201978, 278372, 262642, 373944, 399707, 228702, 98175, 49529, 37346, -10664, 40254, 130232, 82337, -95542, -187588, -160304, -41208, 105836, 129134, 185512, 271940, 232699, 202922, 119638]
14397A19638l1178j10344l5216N9443M33q3813O2854n971l3038R2671M3753o481
14385G2751q4695o9133J17218R7380J15985n1015p8101l4826J31370j3546N4860
14374B58248q4489r9916L7354L6191k6272M332j84722R277o843j36704J9491Q7049
14362h7004J06355R4846J6006m1633M2907M970L8417n1550j20424p4335j5598
14351h7043J70649N2491k9155m0797J9078L1541L0876R4701j09210J36194J20631
14340C89956p4530n8057q2105p540n7198m7809L6711J25070j36000j82034l11487
14329d05023K6673J83682K35100k1648O3518J435q6490M7740J03798k0898j13128
14318A4759m9394j28050L6682K59251P9877j66767j30013j41476j57499J33581
$$ y = [119638, 88460, -21884, -57100, 2343, 2776, -81037, -18183, -24154, -57192, 35479, 79232, 72751, -11944, -81077, 36141, 133521, 249506, 198491, 120390, 85564, 216934, 203388, 258248, 173759, 73843, 111197, 147388, 121116, 125448, -59274, -49997, -56840, -193544, -174053, -87004, 19351, 114197, 130203, 88570, 131477, 136447, 174864, 123314, 2890, -71445, -87043, 83606, 136097, 106942, 66145, 85223, 116764, 147640, 242341, 133131, 269325, 389956, 315426, 257369, 175264, 167724, 110526, 62717, 99428, 224498, 88498, -93536, -405023, -378350, -194668, 40432, 18784, 82302, 83737, -2753, 44987, 148785, 127887, 14759, -34635, -162685, -126003, 133248, 213125, 46358, -83655, -225131, -382630, -249049]
14308b49049P5294N8748J87964J54307j63874q5935J7888Q4226R9285L459o0495
14297A21818n917j6239j32021Q572M3980Q6960O4287J11721j45844p3290j38124
14286g4097j37222k1056Q819M0703L05677J11232r5664j19620J59720J35873n9827
14275B54538j28414P8236p3582k2013K2080j03332J9153J9064N3942l304k255
14264A14113R902r8425n5850J48968l3581j65615K3761Q7113r7355q0384l6104
14253a83457n2284M2459J27136J11908J5128P3805m390k9220n7657j47142o4556
14242a68270M7188L3897M7633J02132J08580P1456K9445m3786K9695j01443p9617
14231G6910q1799q4904n9322K4368J28466J19375Q6800j52207J08528j88028o8736
$$ y = [-249049, -173755, -115007, 72957, 227264, 63390, -22545, -4657, 79569, 178854, 182313, 121818, 115901, 99662, -32359, -23787, 20193, 107153, 171440, 283161, 137317, 64027, -74097, -211319, -232375, -223556, -182853, 122824, 234056, 138392, 18772, 178492, 314365, 254538, 126124, 204360, 130778, 108765, 130845, 27513, 46666, 65730, 119672, 116368, 114113, 124015, 25590, -30260, 118708, 85127, -80488, -56727, 30386, -66969, -147353, -183457, -235741, -193282, -66146, 45762, 60890, 134695, 130305, 101085, 43428, -103714, -168270, -121082, -87185, -39552, 62580, 171160, 242616, 272061, 228275, 257970, 156527, 76910, -4889, -89793, -149115, -124747, 3719, 123094, 209894, 57687, 166215, -21813, -90549]
14220i0549J35467J45602R243j5362Q8596n4153m038n3174Q3395R5257j4837k5896
14208B99551j45530l3496K537r6200J31572O8006j13128l9422J9623L7079r5379
14197C5213m4938q8360N9779Q3819p453P4820j2767j85774L1896m5140j9809Q6702
14185c2012Q9720j4218r6681J05085Q3477O4802m2260L4435L290K953K5047j43198
14173H0440j82838N7073J06916K1455m7684l8331J11108l3034o3203o2912n000
$$ y = [-90549, 44918, 190520, 199763, 184401, 272997, 218844, 214806, 161632, 245027, 340284, 325447, 299551, 154021, 120525, 123062, 26862, 158434, 226440, 113312, 73890, 93513, 130592, 35213, -9725, -98085, -38306, 45513, 38060, 112880, 100113, -85661, -53765, -98905, -118714, -32012, 57708, 43490, -53191, 51894, 135371, 200173, 157913, 192348, 195638, 198591, 223638, 80440, -102398, -45325, 61591, 83046, 35362, -2969, 108139, 75105, 11902, -51010, -56010]
$$ [...]
##END NTUPLES=NMR SPECTRUM
##END=
