##TITLE=Analysis number 330413
Compound Code ac 21664
Project Code adrs
Chemist Name stores
##JCAMPDX= 6.0         $$ Bruker NMR JCAMP-DX V2.0
##DATA TYPE= NMR SPECTRUM
##DATA CLASS= NTUPLES
##ORIGIN= Bruker BioSpin GmbH
##OWNER= nmr
$$ XWIN-NMR		Version 3.5
$$ Thu Nov 22 12:34:33 2007 GMT Standard Time (UT+0h)  MAYBRIDGE\nmr@NMR_250MHZ
##.OBSERVE FREQUENCY= 250.131544655141
##.OBSERVE NUCLEUS= ^1H
##.ACQUISITION MODE= SIMULTANEOUS (DQD)
##.ACQUISITION SCHEME= undefined
##.AVERAGES= 16
##.DIGITISER RES= 18
##SPECTROMETER/DATA SYSTEM= dpx250
##.PULSE SEQUENCE= zg30
##.SOLVENT NAME= CDCl3
##.SHIFT REFERENCE= (INTERNAL, CDCl3, 0, 16.522)
##AUDIT TRAIL= $$ (NUMBER, WHEN, WHO, WHERE, WHAT)
$$ ##TITLE= Audit trail, XWIN-NMR		Version 3.5
$$ ##JCAMPDX= 5.01
$$ ##ORIGIN= Bruker BioSpin GmbH
$$ ##OWNER= nmr
$$ C:\u/data/dgb/nmr/ADRS/2110/pdata/1/auditp.txt
$$ ##AUDIT TRAIL=  $$ (NUMBER, WHEN, WHO, WHERE, WHAT)
(   1,<2007-11-22 12:34:01.38 +000>,<MAYBRIDGE\nmr>,<NMR_250MHZ>,
      <created by zg, POWCHK disabled, PULCHK disabled
       configuration hash MD5:
       76 6E 9A 78 1E 09 19 81 EC 84 63 8F B0 6A 59 2D
       data hash MD5: 64K
       EB 36 A9 A0 26 B4 7E 0E D8 8E D2 02 2E 36 AE D0>)
(   2,<2007-11-22 12:34:18.77 +000>,<MAYBRIDGE\nmr>,<NMR_250MHZ>,
      <Start of raw data processing
       ef LB = 0.3 FT_mod = 6 PKNL = 1 SI = 32K 
       data hash MD5: 32K
       86 5E 5F 28 C7 82 47 9C A0 9C 3D C5 6A DF 93 7E>)
(   3,<2007-11-22 12:34:20.30 +000>,<MAYBRIDGE\nmr>,<NMR_250MHZ>,
      <apk 
       data hash MD5: 32K
       22 9E 19 5F E1 C0 A8 C0 67 EB FA 6E 0C 63 7E 80>)
(   4,<2007-11-22 12:34:21.04 +000>,<MAYBRIDGE\nmr>,<NMR_250MHZ>,
      <abs ABSG = 5 
       data hash MD5: 32K
       B6 03 4B 54 A9 FA 3E CC 52 36 AF 6C CA FF 3A A8>)
$$ ##END=
$$ 
$$ hash MD5
$$ 8C AD BF D7 F9 9A C6 F0 8B 89 BA 2E FB EE 9F 44
##$RELAX= 
##$RELAX= 
##$RELAX= 
##$RELAX= 
##$RELAX= 
##$RELAX= 
##$RELAX= 
$$ Bruker specific parameters
$$ --------------------------
##$DU= <C:\u>
##$EXPNO= 2110
##$NAME= <ADRS>
##$PROCNO= 1
##$TYPE= <nmr>
##$USER= <dgb>
##$AMP= (0..31)
100 100 100 100 100 100 100 100 100 100 100 100 100 100 100 100 100 100 
100 100 100 100 100 100 100 100 100 100 100 100 100 100 
##$AQSEQ= 0
##$AQ_mod= 3
##$AUNM= <au_zg>
##$AUTOPOS= <23 >
##$BF1= 250.13
##$BF2= 250.13
##$BF3= 250.13
##$BF4= 250.13
##$BF5= 500.13
##$BF6= 500.13
##$BF7= 500.13
##$BF8= 500.13
##$BYTORDA= 1
##$CFDGTYP= 0
##$CFRGTYP= 5
##$CHEMSTR= <none>
##$CNST= (0..31)
1 1 145 1 1 1 1 1 1 1 1 1 1 1 1 1 1 1 1 1 1 1 1 1 1 1 1 1 1 1 1 1 
##$CPDPRG= <>
##$CPDPRG1= <>
##$CPDPRG2= <>
##$CPDPRG3= <>
##$CPDPRG4= <mlev>
##$CPDPRG5= <mlev>
##$CPDPRG6= <mlev>
##$CPDPRG7= <mlev>
##$CPDPRG8= <mlev>
##$CPDPRGB= <>
##$CPDPRGT= <>
##$D= (0..31)
0 1 0 0 0 0 0 0 0 0.06 0 0 0 0 0 0 0.0002 0 0 0 0 0 0 0 0 0 0 0 0 0 0 
0 
##$DATE= 1195734840
##$DBL= (0..7)
120 120 120 120 120 120 120 120 
##$DBP= (0..7)
150 150 150 150 150 150 150 150 
##$DBP07= 0
##$DBPNAM0= <>
##$DBPNAM1= <>
##$DBPNAM2= <>
$$ [...]
##$SUBNAM7= <"">
##$SUBNAM8= <"">
##$SUBNAM9= <"">
##$SW= 20.6930455092707
##$SWIBOX= (0..15)
0 0 3 0 0 0 0 0 0 0 0 0 0 0 0 0 
##$SW_h= 5175.983436853
##$TD= 65536
##$TD0= 1
##$TE= 295.16
##$TE2= 300
##$TE3= 300
##$TEG= 300
##$TL= (0..7)
0 120 120 120 120 120 120 120 
##$TP= (0..7)
150 150 150 150 150 150 150 150 
##$TP07= 0
##$TPNAME0= <>
##$TPNAME1= <>
##$TPNAME2= <>
##$TPNAME3= <>
##$TPNAME4= <>
##$TPNAME5= <>
##$TPNAME6= <>
##$TPNAME7= <>
##$TPOAL= (0..7)
0.5 0.5 0.5 0.5 0.5 0.5 0.5 0.5 
##$TPOFFS= (0..7)
0 0 0 0 0 0 0 0 
##$TUNHIN= 0
##$TUNHOUT= 0
##$TUNXOUT= 0
##$USERA1= <user>
##$USERA2= <user>
##$USERA3= <user>
##$USERA4= <user>
##$USERA5= <user>
##$V9= 5
##$VALIST= <valist>
##$VCLIST= <CCCCCCCCCCCCCCC>
##$VD= 0
##$VDLIST= <DDDDDDDDDDDDDDD>
##$VPLIST= <PPPPPPPPPPPPPPP>
##$VTLIST= <TTTTTTTTTTTTTTT>
##$WBST= 1024
##$WBSW= 4
##$XGAIN= (0..3)
0 0 0 0 
##$XL= 0
##$YL= 0
##$YMAX_a= 350830
##$YMIN_a= -391867
##$ZGOPTNS= <>
##$ZL1= 120
##$ZL2= 120
##$ZL3= 120
##$ZL4= 120
##$ABSF1= 16.522
##$ABSF2= -4.171173
##$ABSG= 5
##$ABSL= 3
##$ALPHA= 0
##$AQORDER= 0
##$ASSFAC= 0
##$ASSFACI= 0
##$ASSFACX= 0
##$ASSWID= 0
##$AUNMP= <proc_1d>
##$AZFE= 0.1
##$AZFW= 0.1
##$BCFW= 0
##$BC_mod= 0
##$BYTORDP= 0
##$COROFFS= 0
##$CY= 12.5
##$DATMOD= 1
##$DC= 0
##$DFILT= <>
##$DTYPP= 0
##$F1P= 14.0000005364418
##$F2P= -0.99999901652339
##$FCOR= 0.5
##$FTSIZE= 32768
##$FT_mod= 6
##$GAMMA= 0
##$GB= 0
##$INTBC= 1
##$INTSCL= 1
##$ISEN= 128
##$LB= 0.3
##$LEV0= 0
##$LPBIN= 0
##$MAXI= 10000
##$MC2= 0
##$MEAN= 0
##$ME_mod= 0
##$MI= 0
##$NCOEF= 0
##$NC_proc= -5
##$NLEV= 6
##$NOISF1= 0
##$NOISF2= 0
##$NSP= 0
##$NTH_PI= 0
##$NZP= 0
##$OFFSET= 16.522
##$PC= 1
##$PHC0= 178.2471
##$PHC1= -1.425042
##$PH_mod= 1
##$PKNL= yes
##$PPARMOD= 0
##$PSCAL= 4
##$PSIGN= 0
##$REVERSE= no
##$SF= 250.13
##$SI= 32768
##$SIGF1= 0
##$SIGF2= 0
##$SINO= 400
##$SIOLD= 32768
##$SREGLST= <1H.CDCl3>
##$SSB= 0
##$STSI= 32768
##$STSR= 0
##$SW_p= 5175.98343685301
##$SYMM= 0
##$S_DEV= 0
##$TDeff= 65536
##$TDoff= 0
##$TI= <Analysis number 999999
Compound Code 99
Book Reference 9
Project Code 9>
##$TILT= no
##$TM1= 0
##$TM2= 0
##$TOPLEV= 0
##$USERP1= <user>
##$USERP2= <user>
##$USERP3= <user>
##$USERP4= <user>
##$USERP5= <user>
##$WDW= 1
##$XDIM= 32768
##$YMAX_p= 378935326
##$YMIN_p= -645307
$$ End of Bruker specific parameters
$$ ---------------------------------
##NTUPLES= NMR SPECTRUM
##VAR_NAME=  FREQUENCY,     SPECTRUM/REAL,   SPECTRUM/IMAG
##SYMBOL=    X,             R,               I
##VAR_TYPE=  INDEPENDENT,   DEPENDENT,       DEPENDENT
##VAR_FORM=  AFFN,          ASDF,            ASDF
##VAR_DIM=   32768,         32768,           32768
##UNITS=     HZ,            ARBITRARY UNITS, ARBITRARY UNITS
##FACTOR=    0.157963299565203, 1,           1
##FIRST=     4132.6476996994, 0,             0
##LAST=      -1043.33573715361, 0,           0
##MIN=       -1043.33573715361, -645307,     0
##MAX=       4132.6476996994, 378935326,     0
$$ Real data points
##PAGE= N=1
##DATA TABLE= (X++(R..R)), XYDATA
$$ [...]
$$ plain form
23618 297846 279563 121047 -18173 -13273 77875 178712 186950 15381 -174535 -99330 -10149
23607 -10149 -40514 3116 86283 94902 251081 376239 236852 87899 -72400 -58367 -64961
23596 -64961 81586 214929 170917 135866 277674 296222 231005 134407 -2039 160319 283781
23585 283781 227692 82272 -34345 -49741 -138187 -244635 -250937 -160711 -44874 -545 138100
23574 138100 191099 184277 254996 200030 203429 143685 -83202 -166694 -262242 -174026 -127363 -4818
23562 -4818 -10742 38648 63861 -14492 70046 86470 24482 -32526 34269 -126007 -121193 30237
23550 30237 37596 27639 20145 86229 16779 6268 -64767 173853 83962 -139849 -285236 -344209
23538 -344209 -252655 -241828 -243668 -145209 -20905 108833 30528 -65459 -81323 -28514 -30641
$$ packed form
23618B97846j8283j58516j39220M900R1148J00837Q238j71569j89916P5205Q9181
23607a0149l0365M3630Q3167Q619J56179J25158j39387j48953j60299J4033o594
23596f4961J46547J33343m4012l5051J41808J8548o5217r6598j36446J62358J23462
23585B83781n6089j45420j16617j5396q8446j06448o302R0226J15837M4329J38645
23574A38100N2999o822P0719n4966L399n9744k26887q3492r5548Q8216M6663J22545
23562d818n924M9390K5213p8353Q4538J6424o1988n7008O6795j60276M814J51430
23550C0237P359r957p494O6084o9450j0511p1035K38620q9891k23811j45387n8973
23538c44209R1554J0827j840R8459J24304J29738p8305r5987j5864N2809k127
$$ plain form
23527 -30641 -43558 114899 120016 65776 -69602 -85939 15024 36052 64086 1450 1125 -59097
23515 -59097 -98826 15636 97485 59218 94894 145947 166809 11526 -110512 -104855 -38479
23504 -38479 -44775 -122714 -885 204269 216338 222787 87552 76305 165149 148884 38763
23493 38763 -171550 -335476 -465376 -516152 -331884 -300048 -361811 -463202 -397370 -275078
23483 -275078 -143763 -110888 -32920 121870 94845 -12656 -211685 -223372 -44533 138338
23473 138338 156645 94903 25293 -157174 -184798 -233497 -214219 -213673 45581 218664 144215
23462 144215 128077 240801 148262 -107361 -267226 -186585 -55901 29979 65109 30332 -47596
23451 -47596 -120228 -70278 -127623 -302936 -210111 -94013 -176999 -196529 -262170 -247538 -84634
$$ packed form
23527c0641j2917J58457N117n4240j35378j6337J00963K1028K8034o2636l25o0222
23515e9097l9729J14462Q1849l8267L5676N1053K0862j55283j22038N657O6376
23504c8479o296p7939J21829K05154J2069O449j35235j1247Q8844j6265j10121
23493C8763k10313j63926j29900n0776J84268L1836o1763j01391O5832J22292
23483b75078J31315L2875P7968J54790k7025j07501j99029j1687J78839J82871
23473A38338J8307o1742o9610j82467k7624m8699J9278N46K59254J73083p4449
23462A44215j6138J12724r2539k55623j59865Q0641J30684Q5880L5130l4777p7928
23451d7596p2632M9950n7345j75313R2825J16098q2986j9530o5641J4632J62904
$$ plain form
23440 -84634 77561 78902 -50050 -88866 -165185 -40827 129462 163523 -184706 -91734 83496
23429 83496 122785 -3782 -51533 2551 -79503 -197902 -203336 -143598 -89171 -33209 -66165
23418 -66165 -92303 -51986 -33662 -115759 -106672 119445 301176 391727 429591 450213 330606
23407 330606 308678 290137 129176 82610 77035 59854 76691 218122 227702 302648 228559
23396 228559 52891 114966 162393 36686 -43423 -37965 -145311 -11611 3546 86605 147957
23385 147957 -34459 -81256 65384 -47124 -1150 -40307 -124816 -54932 69449 296974
23375 296974 241666 -7150 -172200 -28666 105729 20588 -38144 1635 68834 -16288 -121244
23364 -121244 -101482 -200571 -215377 -139384 -86868 -49184 -57305 230366 193336 -40119 -97027
$$ packed form
23440h4634J62195J341j28952l8816p6319J24358J70289L4061l48229R2972J75230
23429H3496L9289j26567m7751N4084q2054j18399n434N9738N4427N5962l2956
23418f6165k6138M0317J8324q2097R087K26117J81731R0551L7864K0622j19607
23407C30606k1928j8541j60961m6566n575j7181J6837J41431R580P4946p4089
23396B28559j75668O2075M7427j25707q0109N458j07346J33700J5157Q3059O1352
23385A47957j82416m6797J46640j12508M5974l9157q4509O9884J24381K27525
23375B96974n5308k48816j65050J43534J34395q5141n8732L9779O7199q5122j04956
23364a21244J9762r9089j4806P5993N2516L7684q121K87671l7030k33455n6908
$$ plain form
23353 -97027 -250081 -293293 -305084 -274688 -142132 -118443 -105767 -63953 -8263 49782 17250
23342 17250 -16982 136085 201601 228678 327017 422384 255561 93425 -37460 -23987 66746
23331 66746 193781 241522 75991 181370 228599 252294 226412 128835 37880 -103962 -96088
23320 -96088 -103093 -130860 419 52359 51174 -56142 -57572 23745 10877 -27467 -74978 -157186
23308 -157186 -119280 -78643 18005 103274 248258 179223 188638 286487 260586 82533 76010
23297 76010 253189 339701 240541 195994 45855 11088 72619 146673 411235 307084 271368
23286 271368 105767 -74008 -104003 -1676 32504 133230 136268 6271 -120277 -77381
23276 -77381 -92958 -221718 -260000 -207864 -100163 -144522 -13227 154972 190436 104964 -11937
$$ packed form
23353i7027j53054m3212j1791L0396J32556K3689J2676M1814N5690N8045l2532
23342A7250l4232J53067O5516K7077R8339R5367j66823j62136j30885J3473R0733
23331F6746J27035M7741j65531J05379M7229K3695k5882r7577r0955j41842P874
23320i6088p005k7767J31279N1940j185j07316j430Q1317j2868l8344m7511q2208
23308a57186L7906M0637R6648Q5269J44984o9035R415R7849k5901j78053o523
23297G6010J77179Q6512r9160m4547j50139l4767O1531P4054K64562j04151l5716
23286B71368j65601j79775k9995J02327L4180J00726L038j29997j26548M2896
23276g7381j5577j28760l8282N2136J07701m4359J31295J68199L5464q5472j16901
$$ plain form
23265 -11937 59446 202900 319872 168210 46955 137328 -20012 83740 107396 40923
23255 40923 172369 114359 8221 -95235 -113281 -21743 -28540 -149652 -131957 131027 275881
23244 275881 160710 4765 -9506 -92214 -194947 -299172 -355356 -444723 -376743 -123698
23234 -123698 157229 155164 151706 186392 45886 -63734 71698 160783 58458 -9476 -158722
23223 -158722 -131609 131346 134575 -86806 -249291 -235293 -93992 -260710 -341907 -197737
23213 -197737 -240880 -280384 -266897 -254135 -321598 -298170 -61104 -98795 -140519 -149120 -92303
23202 -92303 -59267 -46642 33211 197805 116547 203495 115940 -8640 27629 32672 160368
23191 160368 95545 159635 94028 157650 464671 496384 327430 122902 -118760 69037
$$ packed form
23265a1937P1383J43454J16972j51662j21255R0373j57340J03752K3656o6473
23255D0923J31446n8010j06138j03456j8046R1538o797j21112J7695K62984J44854
23244B75881j15171j55945j4271q2708j02733j04225n6184q9367O7980K53045
23234a23698K80927k065l458L4686j40506j09620J35432Q9085j02325o7934j49246
23223a58722K7113K62955L229k21381j62485J3998J41301j66718q1197J44170
23213a97737m3143l9504J3487J2762o7463K3428K37066l7691m1724q601N6817
23202i2303L3036J2625P9853J64594q1258Q6948q7555j24580L6269N043J27696
23191A60368o4823O4090o5607O3622L07021L1713j68954k04528k41662J87797
$$ plain form
23181 69037 1535 -120872 -91822 -53962 -5696 -79267 -168516 -184679 -163728 -88671 -110005
23170 -110005 101977 305281 125317 63168 26304 -27403 -18192 -16729 43326 -24374 123919
23159 123919 220560 156660 222110 162546 64655 -139429 -174243 -84017 -4753 136270 11893
23148 11893 -21295 -106580 -248978 -139950 -63212 -128325 -72434 6123 66992 -29660 6230
23137 6230 118203 212709 184596 47528 -76343 -70029 93945 -150634 -511360 -468524 -381340
23126 -381340 -263755 -96023 102029 194428 91150 -35303 -141195 -120948 -22110 -40240
23116 -40240 -199187 -362137 -244870 -157314 -106774 19292 168162 210718 28824 91624
23106 91624 87689 29170 28648 119837 26118 27665 -119138 -132790 -34797 163240 87831 37107
$$ packed form
23181F9037o7502j22407K9050L7860M8266p3571q9249j6163K0951P5057k1334
23170a10005K11982K03304j79964o2149l6864n3707R211J463O0055o7700J48293
23159A23919R6641o3900O5450n9564r7891k04084l4814R0226P9264J41023j24377
23148A1893l3188q5285j42398J09028P6738o5113N5891P8557O0869r6652L5890
23137F230J11973R4506k8113j37068j23871O314J63974k44579l60726M2836Q7184
23126c81340J17585J67732J98052R2399j03278j26453j05892K0247R8838j8130
23116d0240j58947j62950J17267Q7556N0540J26066J48870M2556j81894O2800
23106I1624l935n8519n22R1189r3719J547j46803j3652R7993J98037p5409n0724
$$ plain form
23094 37107 -50843 -51618 -67314 -95448 -209195 -312905 -296532 -218046 51506 161659 318829
23083 318829 313556 286847 281832 220441 49574 131863 231826 194440 106514 39027 -59817 6972
23071 6972 -20289 -115586 -237505 -72258 29157 120582 155122 127327 88812 -63662 -208508
23060 -208508 -174426 67890 115629 -48595 -191232 -263434 -269281 -278181 -225152 -100896 -43227
23049 -43227 43590 111810 132199 161509 143157 -38764 50869 200187 35676 -90246 -134696
23038 -134696 -18227 2944 33279 41884 -13292 -90529 -150188 -64427 126410 177694 173707
23027 173707 69866 -36194 -256908 -479371 -429888 -143252 -55863 -79770 -228465 -291238
23017 -291238 -341044 -292381 -179994 -140902 -22649 67562 231807 245421 220974 162443 -79875
$$ packed form
23094C7107q7950p75j5696k8134j13747j03710J6373P8486K69552J10153J57170
23083C18829n273k6709n015o1391j70867Q2289R9963l7386q7926o7487r8844O6789
23071F972k7261r5297j21919J65247J01415R1425L4540k7795l8515j52474j44846
23060b08508L4082K42316M7739j64224j42637p2202n847q900N3029J24256N7669
23049d3227Q6817O8220K0389K9310j8352j81921Q9633J49318j64511j25922m4450
23038a34696J16469K1171L0335Q605n5176p7237n9659Q5761J90837N1284l987
23027A73707j03841j06060k20714k22463M9483K86636Q7389k3907j48695o2773
23017b91238m9806M8663J12387L9092J18253R0211J64245J3614k4447n8531k42318
$$ plain form
23006 -79875 3549 -35106 -96331 -162637 -233290 -110531 -69727 -151677 -149130 -212930 -171944 -52927
22994 -52927 -5596 -68342 13538 92383 -151234 -104414 -110047 -33879 -84226 -202774 -124079
22983 -124079 73019 65574 -120766 -238995 -262589 -94206 -49954 -280677 -460889 -242820
22973 -242820 -141321 -71421 -97590 -2805 -74384 -285005 -442267 -453065 -75360 52584
22963 52584 88273 237489 295446 311002 181377 252 -75186 -152680 -53810 237148 327081
22952 327081 66655 -27353 -31065 49522 105257 113044 -92336 -244098 -207273 -193871 -154365
22941 -154365 50017 72552 -28547 -63161 112960 221912 140129 161567 79183 -66811
22931 -66811 -23066 -44709 113002 146597 135103 149000 286539 320048 84169 57199 -85620
$$ packed form
23006g9875Q3424l8655o1225o6306p0653J22759M0804q1950K547o3800M0986J19017
22994e2927M7331o2746Q1880P8845k43617M6820n633P6168n0347j18548P8695
22983a24079J97098p445j86340j18229k3594J68383M4252k30723j80212K18069
22973b42820J01499O9900k6169R4785p1579k10621j57262j0798L77705J27944
22963E2584L5689J49216N7957J5556j29625j81125p5438p7494R8870K90958Q9933
22952C27081k60426r4008l712Q0587N5735P787k05380j51762L6825J3402L9506
22941a54365K04382K2535j01099l4614J76121J08952q1783K1438q2384j45994
22931f6811M3745k1643J57711L3595j1494J3897J37539L3509k35879k6970j42819
$$ plain form
22920 -85620 -20457 -20866 -42922 22092 10768 -132320 -159601 -69961 -20861 -13858 17231 -79456
22908 -79456 -63798 -221903 -498654 -325116 -70036 52712 149574 381679 241933 73088
22898 73088 -76675 -94157 43872 77144 55781 124035 54871 -125092 -52738 18307 143136
22887 143136 28426 -65602 41359 191293 189248 221026 187848 149979 -68080 -196505 -189402
22876 -189402 -63185 -249478 -218548 -135649 -156260 -141637 -145190 -232351 -174015 -65258 -87133
22865 -87133 -68634 49691 8640 -81009 -1806 76085 45045 107693 156887 74175 -11470
22854 -11470 -34236 -78355 226234 433628 396648 176740 102147 161913 157081 201785 136812
22843 136812 106991 248604 301089 199769 54844 137856 90992 58708 238629 218610 336410
$$ packed form
22920h5620O5163m09k2056O5014j1324j43088k7281Q9640M9100P003L1089r6687
22908g9456J5658j58105k76751J73538K55080J22748R6862K32105j39746j68845
22898G3088j49763j7482J38029L3272k1363O8254o9164j79963P2354P1045J24829
22887A43136j14710r4028J06961J49934k045L1778l3178l7869k18059j28425P103
22876a89402J26217j86293L0930Q2899k0611J4623l553q7161N8336J08757k1875
22865h7133J8499J18325m1051q9649P9203P7891l1040O2648M9194q2712q5645
22854a1470k2766m4119L04589K07394l6980k19908p4593N9766m832M4704o4973
22843A36812k9821J41613N2485j01320j44925Q3012m6864l2284J79921k0019J17800
$$ plain form
22832 336410 289253 3166 41445 32008 51616 -18029 -116870 -107885 -126140 -44558 166780
22821 166780 147104 56644 135452 36303 -239325 -277122 -155470 11121 57358 67954 78831
22810 78831 13637 -123263 -66278 -184030 -179260 -240838 -249954 -167970 -75258 -97374 31803
22799 31803 65832 85964 -30314 -283848 -292861 -204735 -117153 -262966 -97657 -62283 -131150
22788 -131150 -81063 -4200 10547 174192 361859 536423 319163 111793 -35348 -139744
22778 -139744 -146094 -7486 237196 194510 -63487 -204323 -32478 125271 -31171 -110368
22768 -110368 6048 77213 165194 26399 68786 32192 35575 128 29878 -121291 -92810
22757 -92810 66938 5823 -14641 -210128 -151923 39538 78954 52186 -78261 -120658 -272876
$$ packed form
22832C36410m7157k86087L8279r437J9608o9645r8841Q985j8255Q1582K11338
22821A66780j9676r0460P8808r9149k75628l7797J21652J66591M6237J0596J0877
22810G8831o5194j36900N6985j17752M770o1578r116Q1984R2712k2116J29177
22799C1803L4029K0132j16278k53534r013Q8126Q7582j45813J65309L5374o8867
22788a31150N0087P6863J4747J63645J87667J74564k17260k07370j47141j04396
22778a39744o350J38608K44682m2686k57997j40836J71845J57749j56442p9197
22768a10368J16416P1165Q7981j38795M2387l6594L383l5447K9750j51169K8481
22757i2810J59748o1115k0464j95487N8205J91461L9416k6768j30447m2397j52218
$$ plain form
22746 -272876 -177013 35483 125311 44984 -130493 -229005 -83004 -26778 36574 67820 173069
22735 173069 257966 261418 246854 183160 96472 -30033 -45946 -33788 -64467 -95403 -131760
22724 -131760 -162328 -92096 -89468 -168292 -184205 -121742 -211642 -284061 -246924 -38486 89979
22713 89979 106187 61473 -59298 -124234 93502 -27707 -57666 -52181 -95242 -70558 -90204
22702 -90204 -87045 -95297 -96136 -11799 -28169 -63723 40062 60448 138391 60945 71760 -43597
22690 -43597 -83239 -255430 -274827 -179390 -158652 -171395 -222737 -231496 -350462 -158499 -116876
22679 -116876 -70773 -93320 1817 58220 -133 -67784 -128084 -229314 -137954 -144023 -260437
22668 -260437 -182866 -218520 -297499 -171843 55410 -20667 -81574 -13641 35012 -33196 57034
$$ packed form
22746b72876R5863K12496Q9828q0327j75477r8512J46001N6226O3352L1246J05249
22735A73069Q4897L452j4564o3694q6688j26505j5913J2158l0679l0936l6357
22724a31760l0568P0232K628p8824j5913O2463q9900p2419L7137K08438J28465
22713H9979J6208m4714j20771o4936K17736j21209k9959N485m3061K4684j9646
22702i0204L159q252q39Q4337j6370l5554J03785K0386P7943p7446J0815j15357
22690d3597l9642j72191j9397R5437K0738j2743n1342q759j18966J91963M1623
22679a16876M6103k2547R5137N6403n8353o7651o0300j01230R1360o069j16414
22668b60437P7571l5654p8979J25656K27253p6077o0907O7933M8653o8208R0230
$$ plain form
22657 57034 -115820 -42183 -56534 -29322 97868 -147779 -150327 29671 40664 82409 -110036
22646 -110036 -120650 -247633 -344025 -335665 -458876 -409637 -335435 -237359 -224126 -218213 -235063
22635 -235063 -104224 -62428 -100596 -151694 -227697 -289958 -302868 -200858 -89593 45412 104458
22624 104458 81032 124556 138928 -35802 -133250 45263 159947 202196 156479 40155 -55901
22613 -55901 -45250 -29680 -72037 -20447 -33778 495 -67791 -34141 4417 -78428 -75587 -215576
22601 -215576 -250097 -225197 -139536 -181903 -181113 -206413 -301077 -198367 -235424 -256120 -145975
22590 -145975 77446 -52319 -94501 -25808 -69468 -179272 -305098 -215067 -136772 -134127 -92196
22579 -92196 44918 59053 -137567 14534 -51794 -92294 105386 122896 13336 -68879 63831
$$ packed form
22657E7034j72854P3637j4351K7212J27190k45647k548J79998J0993M1745j92445
22646a10036j0614j26983r6392Q360j23211M9239P4202R8076J3233N913j6850
22635b35063J30839M1796l8168n1098p6003o2261j2910J02010J11265J35005N9046
22624A04458k3426M3524J4372j74730r7448J78513J14684M2249m5717j16324r6056
22613e5901J0651J5570m2357N1590j3331L4273o8286L3650L8558q2845K841j39989
22601b15576l4521K4900Q5661m2367P90k5300r4664J02710l7057k0696J10145
22590a45975K23421j29765m2182O8693m3660j09804j25826R0031P8295K645M1931
22579i2196J37114J4135j96620J52101o6328m0500J97680J7510j09560q2215J32710
$$ plain form
22568 63831 246421 330613 298791 234695 76120 -110824 -155120 -89974 -64745 -145317 -165654
22557 -165654 -130351 -110492 -128002 -166978 -9435 74627 32486 62339 78367 185070 46817
22546 46817 18859 -46865 -171648 -63686 -73637 -245955 -335002 -190353 -156711 -274956 -237365
22535 -237365 -187920 -178903 -348914 -469183 -284767 -178162 -119114 -137820 -94426 -79580 -42002
22524 -42002 -56933 -18952 134460 131697 96376 -9479 -108632 35179 152167 148248 85494
22513 85494 277005 236057 -24205 -110302 -170602 116931 177730 37289 -110940 -92805 -49719
22502 -49719 58080 72830 15267 -19103 -76963 -31470 -222270 -349737 -327905 -298588 -118191
22491 -118191 65003 20747 103128 89200 -120271 -284692 -357150 -220104 -187418 -176862 -277233
$$ packed form
22568F3831J82590Q4192l1822o4096j58575j86944m4296O5146K5229q0572k0337
22557a65654L5303J9859j7510l8976J57543Q4062m2141K9853J6028J06703j38253
22546D6817k7958o5724j24783J07962r951j72318q9047J44649L3642j18245L7591
22535b37365M9445R017j70011j20269J84416J06605N9048j8706M3394J4846L7578
22524d2002j4931L7981J53412k763l5321j05855r9153J43811J16988l919o2754
22513H5494J91511m0948k60262q6097o0300K87533O0799j40441j48229J8135M3086
22502d9719J07799J4750n7563l4370n7860M5493j90800j27467K1832K9317J80397
22491a18191J83194m4256Q2381j3928k09471j64421p2458J37046L2686J0556j00371
$$ plain form
22480 -277233 -250691 -185962 -163067 -108646 -231266 -202579 -90646 80100 64028 -176598 -257550
22469 -257550 -148651 -328707 -370047 -294319 -100821 -36420 31571 17436 -133845 -263423
22459 -263423 -328886 -276028 -180852 -253245 -267432 -194544 24072 23158 40792 39987 -213414 -265568
22447 -265568 -154079 -152303 -15202 -4428 -57231 -207041 -252135 -189132 -52341 -52439 -3172
22436 -3172 50813 27971 -115104 -107615 -40231 -4874 72892 116308 238090 257066 156703
22425 156703 138525 88980 84549 122970 197582 127139 134911 39212 -57014 -56005 -71461 6952
22413 6952 139480 112429 99152 58354 3148 -44767 -17388 24828 -64723 -91939 -124697 -17857
22401 -17857 36843 43056 115191 201833 152734 158220 168233 58929 157988 59691 19439 44857
$$ packed form
22480b77233K6542O4729K2895N4421j22620K8687J11933J70746j6072k40626q0952
22469b57550J08899j80056m1340P5728J93498O4401O7991j4135j51281j29578
22459b63423o5463N2858R5176p2393j4187P2888K18616r14J7634q05k53401n2154
22447b65568J11489J776J37101J0774n2803j49810m5094O3003J36791r8M9267
22436c172N3985k2842j43075P489O7384L5357P7766M3416J21782J8976j00363
22425A56703j8178m9545m431L8421P4612p0443P772r5699r6226J009j5456P8413
22413F952J32528k7051j3277m0798n5206m7915K7379M2216q9551k7216l2758J06840
22401a7857N4700O213P2135Q6642m9099N486J0013j09304R9059r8297m0252K5418
$$ plain form
22389 44857 54016 146064 183197 42712 51889 -11004 -171156 -213492 -45910 -135947 -124936
22378 -124936 -104489 57229 100156 82793 -115000 -216690 -199574 -156314 -15365 -98762 -150478
22367 -150478 -191587 -216103 -133188 -101530 -212941 -293942 -172893 -154401 -186582 -196872 -221210
22356 -221210 -157495 -65161 -110892 -103863 23540 130202 101955 65538 -5372 -27557 -9997
22345 -9997 -44328 -127415 -131790 -8421 -46849 -145530 -277812 -372261 -230689 47688 186354
22334 186354 250894 202388 145225 -21967 -138913 -194897 -199829 -69532 -37000 -11988 -14852
22323 -14852 -43367 -138418 -130891 -101317 -95746 -136892 -122688 -136505 -7278 37575 -65698 -144177
22311 -144177 -41991 26573 -102659 -47487 -22271 -21942 6530 -88350 -4657 -30948 -127284
$$ packed form
22389D4857R159R2048L7133j40485R177o2893j60152m2336J67582r0037J1011
22378a24936K0447J61718M2927j7363j97793j01690J7116M3260J40949q3397n1716
22367a50478m1109k4516Q2915L1658j11411q1001J21049J8492l2181j0290k4338
22356b21210O3715R2334m5731P029J27403J06662k8247l6417p0910k2185J7560
22345i997l4331q3087m375J23369l8428r8681j32282r4449J41572K78377J38666
22334A86354O4540m8506n7163j67192j16946n5984m932J30297L2532K5012k864
22323a4852k8515r5051P527K9574N571m1146J4204j3817J29227M4853j03273p8479
22311a44177J02186O8564j29232N5172K5216L29K8472r4880Q3693k6291r6336
$$ plain form
22300 -127284 -272357 -192160 -111977 42683 117438 73000 -7817 -76740 -157803 -135248 -217720
22289 -217720 -142413 -63035 -3888 -5638 -75335 -59356 45884 208278 105446 150393 183954
22278 183954 194477 156617 -189081 -512493 -428217 -270451 -275365 -327594 -228046 -47365 -36551
22267 -36551 -110016 -133463 2774 -121457 -175508 49037 175466 158535 -25816 -103633 -214322
22256 -214322 -241226 -80828 -128010 -134351 -110643 -305654 -487471 -219713 -100060 -184178 -247103
22245 -247103 -311912 -195560 -111953 -49187 11783 -36793 97108 143836 199502 271386 222267
22234 222267 206175 31125 35555 194876 204287 230003 148272 163646 119593 37319 139789
22223 139789 121344 196372 125517 -184614 -257717 14768 230611 193611 95323 -109267 -202756
$$ packed form
22300a27284j45073Q0197Q0183J54660P4755m4438q0817o8923q1063K2555q2472
22289b17720P5307P9378N9147j750o9697J5979J05240J62394j02832M4947L3561
22278A83954J0523l7860l45698l23412Q4276J57766m914n2229R9548J80681J0814
22267c6551p3465k3447J36237j24231n4051K24545J26429j6931j84351p7817j10689
22256b14322k6904J60398m7182o341K3708j95011j81817K67758J19653q4118o2925
22245b47103o4809J16352Q3607O2766O0970m8576J33901M6728N5666P1884m9119
22234B22267j6092j75050M430J59321R411K5716q1731J5374m4053q2274J02470
22223A39789j8445P5028p0855l10131p3103K72485K15843l7000r8288k04590r3489
$$ plain form
22212 -202756 -265472 -238762 -166503 -143165 -121670 -17938 63201 43166 135157 242095 180603
22201 180603 4794 -256123 -305286 -375447 -317852 -385741 -312976 -175460 36046 -14819 -52169
22190 -52169 -111980 146750 184413 188144 290949 314049 157923 51997 90783 106917 129748
22179 129748 52121 -70863 -79114 18573 168225 201851 103104 245818 195441 133881 172962
22168 172962 215881 143404 122997 100916 40649 -123821 -225604 -184602 -98913 9549 128158
22157 128158 151492 77590 97418 142746 16691 -143913 -205026 -241003 -62379 -33229 -148860
22146 -148860 -72776 105354 136035 246178 138268 -85791 -45361 128461 176312 183542 799
22135 799 -53957 27034 136754 93208 13731 4592 -72222 -56954 -52195 2742 -74626 302
$$ packed form
22212b02756o2716K6710P2259K3338K1495J03732Q1139k0035R1991J06938o1492
22201A80603j75809k60917m9163p0161N7595o7889P2765J37516K11506n0865l7350
22190e2169n9811K58730L7663L731J02805K3100j56126j05926L8786J6134K2831
22179A29748p7627j22984q251R7687J49652L3626r8747J42714n0377o1560L9081
22168A72962M2919p2477k0407k2081o0267j64470j01783M1002Q5689J08462J18609
22157A28158K3334p3902J9828M5328j26055j60604o1113l5977J78624K9150j15631
22146a48860P6084J78130L0681J10143j07910k24059M0430J73822M7851P230j82743
22135G99n4756Q0991J09720m3546p9477r139p6814J5268M759N4937p7368P4928
$$ plain form
22123 302 164684 69288 81334 74298 145258 221584 173586 153140 106258 81472 201499 192513
22111 192513 67196 32572 79193 184678 41291 83174 -25396 -174375 -52155 -23912
22101 -23912 41667 22231 -40279 -120171 -213071 -139487 -215779 -155729 -206687 -250155 -283811 -196256
22089 -196256 -57001 -6364 -123488 -177120 -117505 -41505 -191862 -326506 -46474 46647
22079 46647 -63587 -202323 -195662 -241199 -103853 -19548 -35395 32721 146507 53996 -70456
22068 -70456 -137576 -92312 -12464 -126042 -215425 -162491 -27347 -79453 -118921 -99811 -122086
22057 -122086 -105953 -138102 -200107 -154420 -102051 -150231 -326488 -268132 -128059 -68921 -91734
22046 -91734 -196676 -249200 -206552 -253944 -181960 -80162 -44883 155314 164105 76076 7147
$$ packed form
22123C02J64382r5396J2046p036P0960P6326m7998k0446m6882k4786J20027q986
22111A92513j25317l4624M6621J05485j43387M1883j08570j48979J22220K8243
22101b3912O5579j9436o2510p9892r2900P3584p6292O0050n0958m3468l3656Q7555
22089a96256J39255N0637j17124n3632N9615P6000j50357j34644K80032R3121
22079D6647j10234j38736O661m5537J37346Q4305j5847O8116J13786r2511j24452
22068g0456o7120M5264P9848j13578q9383N2934J35144n2106l9468J9110k2275
22057a22086J6133l2149o2005M5687N2369m8180j76257N8356J40073N9138k2813
22046i1734j04942n2524M2648m7392P1984J01798L5279K00197Q791q8029o8929
$$ plain form
22035 7147 71121 -63948 13210 99596 -7036 -28907 -77172 -46236 367 46381 -65451
22024 -65451 -206934 -328873 -250236 -182196 -315310 -321284 -237045 -127763 -182865 -192840 -164826
22013 -164826 52421 125552 132402 175287 41380 -33454 -21524 58113 -69318 -197581 -223555
22002 -223555 -173827 -198317 -148233 17077 -26828 -165628 -48330 79297 147495 109921 4502
21991 4502 -41940 33562 -34046 -66158 12736 228430 169831 172479 240151 265209 125085 -42319
21979 -42319 -118610 -154989 -88787 -73837 -78989 -35108 -112897 -255516 -94604 -1187 -127755
21968 -127755 -78968 -113856 -188197 -137372 -124465 -234979 -295002 -377244 -447351 -527262 -503756
21957 -503756 -273258 -340643 -364397 -211428 -8882 43625 110319 150649 182356 206360 300184
$$ packed form
22035G147O3974j35069P7158Q6386j06632k1871m8265L0936M6603M6014j11832
22024f5451j41483j21939P8637O8040j33114n974Q4239J09282n5102r975K8014
22013a64826K17247P3131O850M2885j33907p4834J1930P9637j27431j28263k5974
22002b23555M9728k4490N0084J65310m3905j38800J17298J27627O8198l7574j05419
21991D502m6442P5502o7608l2112P8894K15694n8599K648O7672K5058j40124j67404
21979d2319p6291l6379O6202J4950n152M3881p7789j42619J60912R3417j26568
21968a27755M8787l4888p4341N0825J2907j10514o0023q2242p0107p9911K3506
21957e03756K30498o7385k3754J52969K02546N2507O6694M0330L1707K4004R3824
$$ plain form
21946 300184 199393 67580 -38823 50130 -14655 -11413 -88763 -177139 -287553 -258719 -87660
21935 -87660 -205589 -243578 -219414 -193638 -130894 -80206 33256 -5278 -11222 154382 224202
21924 224202 315027 243832 -27682 -253719 -351557 -221748 -16838 16210 66994 1658 -42708
21913 -42708 25163 -13973 -92486 -163195 -158618 47455 75605 -13324 -43368 57061 -7462
21902 -7462 -9469 -150736 -294091 -157239 -234374 -251918 -117467 -84310 -47888 -80720 -207778
21891 -207778 -257075 -29871 70236 169158 174222 -11278 -52020 -26249 -165294 -338057 -247139
21880 -247139 -120761 14698 98412 169919 183774 115097 126204 162450 203075 223896 130319
21869 130319 -28341 -122527 -201444 -227895 -28706 217658 345538 247890 107574 -124310
$$ packed form
21946C00184j00791j31813j06403Q8953o4785L242p7350q8376j10414K8834J71059
21935h7660j17929l7989K4164K5776O2744N0688J13462l8534n944J65604O9820
21924B24202R0825p1195k71514k26037r7838J29809K04910L3048N0784o5336m4366
21913d2708O7871l9136p8513p0709M577K06073K8150q8929l0044J00429o4523
21902g462k007j41267j43355J36852p7135j7544J34451L3157L6422l2832j27058
21891b07778m9297K27204J00107R8922N064j85500m0742K5771j39045j72763R0918
21880b47139J26378J35459Q3714P1507J3855o8677J1107L6246M0625K0821r3577
21869A30319j58660r4186p8917k6451J99189K46364J27880r7648j40316k31884
$$ plain form
21859 -124310 -162729 57889 107684 81008 52337 118030 152260 52203 -182670 -132913 25703
21848 25703 21329 17981 16033 -19995 -26928 5610 58115 108837 84124 -33701 -68239 24668
21836 24668 -187627 -140571 43739 -120798 -101975 -126963 -58551 -88036 60135 132091 120220
21825 120220 165749 306852 187192 -26874 41748 -3746 -72537 -63352 -112521 -31010 -111101
21814 -111101 -167671 -112748 -135914 60584 13224 -169777 -171480 -126641 -125194 38060 -11163
21803 -11163 -64421 -133472 -69449 1984 37103 226210 275894 241246 173062 85815 260726
21792 260726 219622 90508 107250 146969 -38476 -290074 -347571 -176060 -79086 -132373 -32466
21781 -32466 -9917 -71586 195609 344153 165430 121735 25331 -168579 -27057 4643 -154161
$$ packed form
21859a24310l8419K20618M9795k6676k8671O5693L4230j00057k34873M9757J58616
21848B5703m374l348j948l6028o933L2538N2505N0722k4713j17825l4538R2907
21836B4668k12295M7056J84310j64537J8823k4988O8412k9485J48171P1956j1871
21825A20220M5529J41103j19660k14066O8622m5494o8791R185m9169Q1511q0091
21814a11101n6570N4923k3166J96498m7360j83001j703M4839J447J63254m9223
21803a1163n3258o9051O4023P1433L5119J89107M9684l4648o8184q7247J74911
21792B60726m1104j29114J6742L9719j85445k51598n7497J71511R6974n3287R9907
21781c2466K2549o1669K67195J48544j78723m3695r6404j93910J41522L1700j58804
$$ plain form
21770 -154161 -71171 -12913 131417 82925 17115 27910 102235 114513 127420 11598 -74775
21759 -74775 -80995 -136620 -76320 -198382 -215223 21874 125650 83164 278723 268808 86299
21748 86299 -147124 -313038 -274771 -226655 -301319 -307731 -35341 39965 134593 142621 82394
21737 82394 14140 1815 85975 15073 -213511 -209744 -58234 63229 67771 -1964 -17546
21726 -17546 -64404 -77248 -89198 -297172 -320139 -285521 -237770 -2431 51510 -48802 -64621
21715 -64621 -37718 9126 -73203 -170221 -129652 35506 -23435 -299488 -400123 -180548 -77901
21704 -77901 -189020 -189260 -130489 -212629 -104717 85609 79018 -17362 -236699 -271198 -119709
21693 -119709 -89831 -259247 -324936 -152149 -111151 -186772 -213815 -176640 56246 91353 86045
$$ packed form
21770a54161Q2990N8258J44330m8492o5810J0795P4325J2278J2907j15822q6373
21759g4775o220n5625O0300j22062j6841K37097J03776m2486J95559r915j82509
21748H6299k33423j65914L8267M8116p4664o412K72390P5306R4628Q028o0227
21737H2394o8254j2325Q4160p0902k28584L767J51510J21463M542o9735j5582
21726a7546m6858j2844j1950k07974k2967L4618M7751K35339N3941j00312j5819
21715f4621K6903M6844q2329r7018M0569J65158n8941k76053j00635K19575J02647
21704g7901j11119k40N8771q2140J07912J90326o591r6380k19337l4499J51489
21693a19709K9878j69416o5689J72787M0998p5621k7043L7175K32886L5107n308
$$ plain form
21682 86045 140833 71678 37664 42837 -25730 -177973 -176608 -62554 63715 120725 99798
21671 99798 -25997 5195 -102905 -58924 162506 15324 -198078 -197603 -32929 -31468 113666
21660 113666 76925 131868 69849 -97071 -143550 -131103 -145044 -218990 -259277 -286187 -227327
21649 -227327 -213568 -149971 58530 -51381 -81883 865 86266 28935 -69224 -26886 86354
21638 86354 -68790 -195857 -164713 -237796 -240193 -212143 -55727 -97050 -109353 -82588 -178022
21627 -178022 -122597 -210316 -173540 34351 328254 418908 317030 333020 303381 38643 -124478
21616 -124478 -193915 -289900 -274204 -98506 -84478 32198 131165 149855 2258 26198 9409
21605 9409 33570 72312 103497 86316 -36879 -69546 -153858 -125421 92245 196667 -24329
$$ packed form
21682H6045N4788o9155l4014N173o8567j52243J365J14054J26269N7010k0927
21671I9798j25795L1192j08100M3981K21430j47182k13402M75J64674J461J45134
21660A13666l6741N4943o2019j66920m6479J2447j3941p3946m0287k6910N8860
21649b27327J3759O3597K08501j09911l0502Q2748Q5401n7331r8159M2338J13240
21638H6354j55144j27067L1144p3083k397K8050J56416m1323j2303K6765r5434
21627a78022N5425q7719L6776K07891K93903R0654j01878J5990k9639k64738j63121
21616a24478o9437r5985J5696J75698J4028J16676R8967J8690j47597K3940j6789
21605I409K4161L8742L1185j7181j23195l2667q4312K8437K17666J04422k20996
$$ plain form
21594 -24329 -108677 -13746 -88842 -139073 -102310 -54101 -24002 -75182 -168749 -34342 -68830
21583 -68830 -213287 -49304 -9557 -78885 -169909 -172662 -96759 37132 16343 -94960 -22285
21572 -22285 116042 45335 15645 -2810 -48507 -125237 -150988 -44217 -16190 4906 211066
21561 211066 90382 -177382 -251133 -203475 -98300 -119527 -132050 -2554 18484 -121463
21551 -121463 -152507 -77926 34620 12750 -33884 -184011 -177072 27895 111387 105793 39712
21540 39712 19178 -53755 -56524 87068 177276 233930 74710 50217 176694 314552 292228
21529 292228 247728 159898 114087 114645 160862 90075 -97089 -203345 -92036 -59174 -8669
21518 -8669 -106602 -185747 -91622 -98257 -99119 -41743 -112404 -75378 136010 121220 100339 -16525
$$ packed form
21594b4329q4348R4931p5096n0231L6763M8209L0099n1180r3567J34407l4488
21583f8830j44457J63983L9747o9328r1024k753P5903J33891k0789j11303P2675
21572b2285J38327p0707k9690j8455m5697p6730k5751J06771K8027K1096K06160
21561B11066j20684k67764p3751M7658J05175k1227j2523J29496K1038j39947
21551a21463l1044P4581J12546k1870m6634j50127O939K04967Q3492n594o6081
21540C9712k0534p2933k769J43592R0208N6654j59220k4493J26477J37858k2324
21529B92228m4500q7830m5811N58M6217p0787j87164j06256J11309L2862N0505
21518h669r7933p9145R4125o635q62N7376p0661L7026K11388j4790k0881j16864
$$ plain form
21506 -16525 8686 -130124 -291429 -145093 -224425 -221564 -242242 -225984 -159511 -65843 -153167
21495 -153167 -272476 -133346 118797 106772 -49361 -18246 107630 199048 243948 244821 195850
21484 195850 77099 21379 -67516 -219403 -251958 -346046 -283638 -169352 -186248 -124191 -15652
21473 -15652 46501 -30507 22813 210085 176663 106893 120522 5666 -35684 -212944 -271132
21462 -271132 -220663 -49738 -33284 -137225 -55817 123762 236058 238909 248104 327521 285404
21451 285404 -16427 -185566 -257510 -60422 78416 120684 77333 132766 -37594 80042
21441 80042 79505 230296 35951 -331808 -156138 -15099 -19402 -92235 -5413 -25148 -52004
21430 -52004 -105679 -195204 -192138 -194425 -217290 -173511 -64648 -39097 -10497 -36681 -71171 -74152
$$ packed form
21506a6525K5211j38810j61305J46336p9332K861k0678J6258O6473R3668q7324
21495a53167j19309J39130K52143j2025j56133L1115J25876R1418M4900Q73m8971
21484A95850j18751n5720q8895j51887l2555r4088O2408J14286j6896O2057J08539
21473a5652O2153p7008N3320J87272l3422o9770J3629j14856m1350j77260n8188
21462b71132N0469J70925J6454j03941Q1408J79579J12296K851R195P9417m2117
21451B85404l01831j69139p1944J97088J38838M2268m3351N5433j70360J17636
21441H0042n37J50791j94345l67759J75670J41039m303p2833Q6822j9735k6856
21430e2004n3675q9525L066k287k2865M3779J08863K5551K8600k6184l4490k981
$$ plain form
21418 -74152 -18388 37931 52349 138701 221226 262914 20721 -129745 -226207 -194363 -188017
21407 -188017 -184169 -235404 -166889 -94484 -140591 -162364 20881 65348 -103301 -46844 64316
21396 64316 114276 -16806 -112503 -205814 -152056 -225310 -231408 -41130 -55635 -149917 -229476
21385 -229476 -238693 -257143 -258370 -50841 -151254 -137925 -156508 -152555 -64387 22918 -37648 74236
21373 74236 329514 232326 193312 170446 223265 233322 113351 157354 -43563 -124804 -60098
21362 -60098 -48393 -165648 -204783 -207604 -176647 -60389 53348 77677 -216107 -222260 -62845
21351 -62845 44353 68689 28231 -153203 -306563 -417399 -395172 -143601 -5574 36038
21341 36038 120659 242990 397034 404240 355030 310306 318460 230295 158511 112857 -1872
$$ packed form
21418g4152N5764N6319J4418Q6352Q2525M1688k42193j50466r6462L1844O346
21407a88017L848n1235O8515P2405m6107k1773J83245M4467j68649N6457J11160
21396F4316M9960j31082r5697r3311N3758p3254o098J90278j4505r4282p9559
21385b29476r217j8450j227K07529j00413J3329j8583L953Q8168Q7305o0566J11884
21373G4236K55278r7188l9014k2866N2819J0057j19971M4003k00917q1241O4706
21362f0098J1705j17255l9135k821L0957J16258J13737K4329k93784o153J59415
21351f2845J07198K4336m0458j81434j53360j10836K2227K51571J38027M1612
21341C6038Q4621J22331J54044P206m9210m4724Q154q8165p1784m5654j14729
$$ plain form
21330 -1872 -31694 114971 37329 66417 -147669 -247348 -15308 110102 108332 -9772 -172075
21319 -172075 -224596 -190282 -181576 -29648 -644 -84453 18445 29548 163446 199436 -68789
21308 -68789 -116275 1537 46907 100823 -102310 -109243 -140631 -137169 -176683 -45076 -79986
21297 -79986 -54706 170445 283640 211028 147429 113820 61688 97475 189555 215866 171722
21286 171722 67998 -101803 -151162 -22577 -176317 -278824 -145545 11521 122178 45229
21276 45229 135425 56287 13681 -28830 -32191 76404 59343 62503 -83976 -138485 -114592 91497
21264 91497 217957 267954 346535 240669 -64671 -62518 -46630 -163768 -29089 -41162 -98742
21253 -98742 -50620 -51108 -12116 -32874 -168835 -191546 -240672 -194847 -97688 -149360 -162689 -163631
$$ packed form
21330a872k9822J46665p7642K9088k14086r9679K32040J25410j770j18104j62303
21319a72075n2521L4314Q706J51928K9004q3809J02898J1103J33898L5990k68225
21308f8789m7486J17812M5370N3916k03133o933l1388L462l9514J31607l4910
21297g9986K5280K25151J13195p2612o3599l3609n2132L5787R2080K6311m4144
21286A71722j03724j69801m9359J28585j53740j02507J33279J57066J10657p6949
21276D5229R0196p9138m2606m2511l361J08595j7061L160j46479n4509K3893K06089
21264I1497J26460M9997P8581j05866l05340K153J5888j17138J34679j2073n7580
21253i8742M8122m88L8992k0758j35961k2711m9126M5825R7159n1672j3329r42
$$ plain form
21241 -163631 -100856 -104092 -221555 -186081 -133018 -100893 -85011 -142244 -98026 -98931 -29239 -44746
21229 -44746 -168507 -187921 -157121 -107296 -121864 -146733 10453 24732 -218808 -175898 -226754
21218 -226754 -128048 30258 159036 19950 -160662 -168094 -33114 51407 66576 54807 -41447
21207 -41447 -17232 -100596 -15245 16873 144364 133695 64732 87425 3754 -174291 -126314
21196 -126314 24727 42364 20783 -52832 -118424 -162795 69984 40388 84129 18802 65271
21185 65271 71696 92562 144672 53871 21921 131277 79495 -22635 -399 -69240 -69863 3794
21173 3794 19502 -14550 -35418 -106058 -291576 -222315 -175182 -168697 -74387 -101702 -40410 -51071
21161 -51071 -162517 -309854 -290638 -164953 -66671 -57086 117062 190798 86258 -31673 -161698
$$ packed form
21241a63631O2775l236j17463L5474N3063L2125J5882n7233M4218r05O9692j5507
21229d4746j23761j9414L0800M9825j4568k4869J57186J4279k43540M2910n0856
21218b26754R8706J58306J28778j39086j80612p432J34980Q4521J5169j1769r6254
21207d1447K4215q3364Q5351L2118J27491j0669o8963K2693q3671j78045M7977
21196a26314J51041J7637k1581p3615o5592m4371K32779k9596M3741o5327M6469
21185F5271O425K0866N2110r0801l1950J09356n1782j02130K2236o8841o23P3657
21173C794J5708l4052k0868p0640j85518O9261M7133O485R4310k7315O1292j0661
21161e1071j11446j47337J9216J25685R8282R585J74148P3736j04540j17931j30025
$$ plain form
21150 -161698 -191658 -70634 -61437 -194491 -189293 -62188 -92827 -166982 -266698 -276146 -236549
21139 -236549 -163511 -80910 -72531 17896 160113 163395 -1299 -17152 -78666 -109449 -65267
21128 -65267 31813 52449 166119 -51455 -131546 -178875 -133678 -103133 -127388 -104476 -221624
21117 -221624 -191070 -370546 -346463 -218886 -174263 -22691 6578 -123374 33365 176575
21107 176575 245554 341375 305603 133396 194851 191346 76123 389314 583846 524509 521503
21096 521503 592736 647827 854673 973926 950987 1073783 1154499 1286434 1227537 1069210
21086 1069210 991098 843476 712258 743118 786931 641856 374935 224301 152337 281398
21076 281398 377635 448998 399267 257395 149464 153041 57865 72942 84023 -75800 -173091
$$ packed form
21150a61698k9960J21024R197j33054N198J27105l0639p4155r9716r448L9597
21139b36549P3038Q2601Q379R0427J42217L282j64694j5853o1514l0783M4182
21128f5267R7080K0636J13670k17574q0091m7329M5197L0545k4255K2912j17148
21117b21624L0554j79476K4083J27577M4623J51572K9269j29952J56739J43210
21107A76575O8979R5821l5772j72207O1455l505j15223L13191J94532n9337l006
21096E21503P1233N5091K06846J19253k2939J22796Q0716J31935n8897j58327
21086A069210p8112j47622j31218L0860M3813j45075k66921j50634p1964J29061
21076B81398R6237P1363m9731j41872j07931L577r5176J5077J1081j59823r7291
$$ plain form
21065 -173091 -96833 180 89831 8347 -52514 -129904 -128705 95173 289775 257064 187393
21054 187393 147856 213553 108850 110956 297761 284798 326007 362760 475021 529213 524184
21043 524184 458723 592257 965084 1223089 1141022 1104681 1009609 1044950 1115386 1056055 1146830
21032 1146830 1086222 913359 677532 544827 509086 640433 753452 443261 169539 207154
21022 207154 49068 -7722 67220 112425 79823 83868 77890 50702 -61447 -119874 -142209
21011 -142209 -23117 -99703 -246164 -219966 -47089 72704 67624 68592 71000 62077 -86263
21000 -86263 52149 1122 -208465 -104785 59012 175856 154257 162854 126051 -89254 3188
20989 3188 197472 175925 9410 -10768 5027 -13738 92408 146516 146862 113884 127840 71624
$$ packed form
21065a73091P6258R7013Q9651q1484o0861p7390J199K23878J94602l2711o9671
21054A87393l9537O5697j04703K106J86805j2963M1209L6753J12261N4192n029
21043E24184o5461J33534L72827K58005q2067l6341r5072L5341P0436n9331R0775
21032A146830o0608j72863k35827j32705l5741J31347J13019l10191k73722L7615
21022B07154j58086n6790P4942M5205l2602M045n978k7188j12149n8427k2335
21011a42209J19092p6586j46461K6198J72877J19793n080R68K408q923j48340
21000h6263J38412n1027k09587J03680J63797J16844k1599Q597l6803k15305R2442
20989C188J94284k1547j66515k0178J5795j8765J06146N4108L46l2978J3956n6216
$$ plain form
20977 71624 -25651 88447 189319 67149 -248781 -282136 -305947 -260908 -215886 -3313 -54801
20966 -54801 92269 277529 152214 143889 9314 -58188 -98659 -130065 -7231 13855 -50189
20955 -50189 -19998 -214022 -182637 -49332 14665 -4381 -41005 -73105 -117515 -216220 -82602
20944 -82602 -106708 -164043 22418 288347 143592 152513 92251 66504 -42895 -7137 -122328
20933 -122328 -134481 -130699 -112300 -158092 -184952 -80328 92029 166462 149146 -54713 -187781
20922 -187781 -66889 -12946 -54774 13880 132489 37337 6667 119198 127549 147325 85202
20911 85202 -114216 -275528 -322310 -316684 -406842 -330357 -75156 112486 112167 171116 152997
20900 152997 49335 16786 35498 29413 34613 -41128 -9396 91285 114996 152108 108016
$$ packed form
20977G1624r7275J14098J00872j22170l15930l3355k3811M5039M5022K12573n1488
20966e4801J47070J85260j25315q325j34575o7502m0471l1406J22834K1086o4044
20955e0189L0191j94024L1385J33305O3997j9046l6624l2100m4410r8705J33618
20944h2602k4106n7335J86461K65929j44755Q921o0262k5747j09399L5758j15191
20933a22328j2153L782J8399m5792k6860J04624J72357P4433j7316k03859j33068
20922a87781J20892N3943m1828O8654J18609r5152l0670J12531Q351J9776o2123
20911H5202j99418j61312m6782N626r0158P6485K55201J87642l19N8949j8119
20900A52997j03662l2549J8712o085N200p5741L1732J00681K3711L7112m4092
$$ plain form
20889 108016 77205 69012 135203 -22634 -98370 -51424 121817 89068 38261 123790 231128
20878 231128 102966 33358 23376 -137351 -273011 -152628 -40146 -69538 -193265 -231338
20868 -231338 -253012 -115188 -55729 -72616 -355182 -410887 -239448 -15550 -188445 -164738
20858 -164738 -92579 -185141 1574 39512 102005 91181 -161380 -97292 -16098 -6802 42355
20847 42355 141932 250853 118953 64443 324696 406089 145816 48271 119045 234165 266123
20836 266123 135899 10651 16109 88955 15783 71826 175906 87286 141527 284702 260258
20825 260258 143304 88091 169977 107282 179628 170125 158496 79684 26380 -88251 -38867
20814 -38867 30834 -177379 -64962 -21392 76957 141370 186244 185318 162218 -26052 -184053
$$ packed form
20889A08016l0811q193O6191j57837p5736M6946J73241l2749n0807Q5529J07338
20878B31128j28162o9608r982j60727j35660J20383J12482k9392j23727l8073
20868b31338k1674J37824N9459j6887k82566n5705J71439K23898j72895K3707
20858a64738P2159r2562J86715L7938O2493j0824k52561O4088Q1194R296M9157
20847D2355R9577J08921j31900n4510K60253Q1393k60273r7545P0774J15120L1958
20836B66123j30224j25248N458P2846p3172N6043J04080q8620N4241J43175k4444
20825B60258j16954n5213Q1886o2695P2346r503j1629p8812n3304j14631M9384
20814c8867O9701k08213J12417M3570R8349O4413M4874r26k3100j88270j58001
$$ plain form
20803 -184053 -180281 -254539 -220788 -193923 -150917 4050 15675 -15415 -67513 -28286 -213921
20792 -213921 -243950 -92521 157211 182717 47803 143570 317859 376812 398236 288153
20782 288153 383779 298572 176551 281662 169458 -135936 -228623 -236473 -100451 92656
20772 92656 261211 181485 56995 46555 11352 22982 199455 126467 -26316 216953 406149
20761 406149 373003 201138 129366 -11485 -168216 -186100 -24228 63542 -200938 -289856
20751 -289856 -139289 -150795 -125041 -123562 -253837 -12597 119804 84239 176974 94126 110453
20740 110453 51321 146552 163017 71843 129679 287493 260819 58499 -71968 -85675 -68292
20729 -68292 31521 181630 136182 -6031 -43192 -45425 -60908 -174911 -159907 -26911 -45197
$$ packed form
20803a84053L772p4258L3751K6865M3006J54967J1625l1090n2098L9227j85635
20792b13921l0029J51429K49732K5506j34914R5767J74289N8953K1424j10083
20782B88153R5626q5207j22021J05111j12204l05394r2687p850J36022J93107
20772I2656J68555p9726j24490j0440l5203J1630J76473p2988j52783K43269J89196
20761D06149l3146j71865p1772j40851j56731j7884J61872Q7770k64480q8918
20751b89856J50567j1506K5754J479j30275K41240J32401l5565R2735q2848J6327
20740A10453n9132R5231J6465r1174N7836J57814k6674k02320j30467j3707J7383
20729f8292R9813J50109m5448j42213l7161k233j5483j14003J5004J32996j8286
$$ plain form
20718 -45197 9733 -10263 11755 -101849 -47928 141446 42323 -1435 64915 175547 190011
20707 190011 121452 813 -117252 -125408 -111616 -42698 -83345 -87156 -36288 10596 -148589
20696 -148589 -122306 57316 10914 21930 28826 84656 93781 -19531 -203156 -150531 100167
20685 100167 153985 231828 210058 73688 38578 96718 227005 328132 269026 137716 88913
20674 88913 200944 181527 117121 79226 249 845 56031 167231 306532 275515 285668
20663 285668 372353 435537 418025 305473 102067 -903 253416 449299 418157 250344
20653 250344 178816 110738 86820 785 -36844 -19811 15987 137583 -23737 21804 218282
20642 218282 150699 50021 67862 58932 -2367 -57454 -23387 -14801 131801 227197 277183
$$ packed form
20718d5197N4930j9996K2018j13604N3921J89374r9123m3758O6350J10632J4464
20707A90011o8559j20639j18065q156J3792O8918m0647l811N0868M6884j59185
20696a48589K6283J79622m6402J1016O896N5830R125j13312j83625N2625K50698
20685A00167N3818P7843k1770j36370l5110N8140J30287J01127n9106j31310m8803
20674H8913J12031j9417o4406l7895p8977N96N5186J11200J39301l1017J0153
20663B85668Q6685O3184j7512j12552k03406j02970K54319J95883l1142j67813
20653B50344p1528o8078k3918q6035l7629J7033L5798J21596j61320M5541J96478
20642B18282o7583j00678J7841q930o1299n5087L4067Q586J46602R5396M9986
$$ plain form
20631 277183 379674 378069 283836 430179 571499 417371 194047 162686 227893 384033
20621 384033 328894 386989 573834 631000 604001 527360 595298 827006 900225 1050895 960456
20610 960456 872414 1024377 1228747 1545693 1792782 1901194 1952081 2078723 2570903 3059757
20600 3059757 3349392 3514341 3562443 3952703 4417416 4966308 5415891 5790028 6094587 6548521
20590 6548521 7329376 8543473 10201420 12185877 14849652 19360434 26464020 37475224
20582 37475224 53010988 71118658 86494447 95691383 104279382 121110298 146187435
20575 146187435 169142159 180108494 180529915 178587022 178972184 182437399 185888001 183014456
20567 183014456 169996805 147891735 124139183 107995672 99296348 89348121 72378530
$$ packed form
20631B77183J02491j605r4233J46343J41320j54128k23324l1361O5207J56140
20621C84033n5139N8095J86845N7166k6999p6641O7938K31708P3219J50670r0439
20610I60456q8042J51963K04370L16946K47089J08412N0887J26642M92180M88854
20600C059757K89635J64949M8102L90260M64713N48892M49583L74137L04559M53934
20590F548521P80855J214097J657947J984457K663775M510782P103586J1011204
20582C7475224J5535764J8107670J5375789R196936Q587999J6830916K5077137
20575A46187435K2954724J0966335M21421j942893L85162L465215L450602k873545
20567A83014456j3017651k2105070k3752552j6143511q699324r948227j6969591
$$ plain form
20560 72378530 52789997 37737797 28324782 22578761 18972581 16693127 14738982 13148697
20552 13148697 11977036 11106832 10612048 10435557 10308716 10045405 9850964 9623482 9405703
20543 9405703 9312528 9570354 9871366 9826170 9719699 9751447 10069912 10617485 11407113 12470621
20533 12470621 14109895 16515713 20177426 26056006 35414151 49124676 67166141 85234554
20525 85234554 96980241 103495747 114372720 137388155 167888786 191157278 197082036
20518 197082036 191320776 185618830 186306841 193511076 199868023 196321295 178328812 150103169
20510 150103169 123913747 109057969 101942228 91545000 73202567 52998637 37706036
20503 37706036 28300497 22718387 18946832 16126065 13899772 12226481 10990619 10057546
$$ packed form
20560G2378530j9588533j5052200r413015n746021l606180k279454j954145j590285
20552A3148697j171661q70204m94784j76491j26841k63311j94441k27482k17779
20543I405703r3175K57826L01012m5196j06471L1748L18465N47573P89628J063508
20533A2470621J639274K405818L661713N878580R358145J3710525J8041465J8068413
20525H5234554J1745687O515506J0876973K3015435L0500631K3268492N924758
20518A97082036n761260n701946O88011P204235O356947l546728j7992483k8225643
20510A50103169k6189422j4855778p115741j0397228j8342433k0203930j5292601
20503C7706036r405539n582110l771555k820767k226293j673291j235862r33073
$$ plain form
20495 10057546 9293572 8718871 8228245 7827725 7198625 6495282 5942611 5635926 5542906
20486 5542906 4948091 4375562 4053227 3688135 3444480 3267497 3222644 3084731 2770084 2645967
20476 2645967 2651506 2388279 2142397 2030397 2157941 2015887 1842999 1733939 1676065 1585289
20466 1585289 1507665 1660039 1652209 1533205 1494883 1381141 1183674 1130216 1168977 1036936
20456 1036936 887795 839989 852222 807797 941329 1121350 1291342 1336217 1333315 1451113
20446 1451113 1535058 1732260 1826284 1928855 2171610 2099374 1802064 1534070 1356548 1228557
20436 1228557 1374460 1548236 1815879 1781996 1502458 1151138 820653 700684 569801 551551
20426 551551 672274 699820 453568 200447 168756 258367 243147 193866 198447 141116 304610
$$ packed form
20495A0057546p63974n74701m90626m00520o29100p03343n52671l06685r3020
20486E542906n94815n72529l22335l65092k43655j76983m4853j37913l14647j24117
20476B645967N539k63227k45882j12000J27544j42054j72888j09060n7874r0776
20466A585289p7624J52374p830j19004l8322j13742j97467n3458L8761j32041
20456A036936j49141m7806J2233m4425J33532J80021J69992M4875k902J17798
20446A451113Q3945J97202R4024J02571K42755p2236k97310k67994j77522j27991
20436A228557J45903J73776K67643l3883k79538l51320l30485j19969j30883j8250
20426E51551J20723K7546k46252k53121l1691Q9611j5220m9281M581n7331J63494
$$ plain form
20415 304610 491868 482936 526197 333643 258681 215413 376757 449987 220049 141289 97068
20404 97068 165185 319860 319857 413772 618938 707327 889620 1112793 1396015 1651412 1717394
20393 1717394 1602624 1452581 1343848 1337902 1526283 1741465 1854650 1884960 1792566 1563131
20383 1563131 1395766 1059841 823687 651015 688770 693601 743829 519889 264710 213272
20373 213272 218638 377926 566837 471235 399196 383479 289440 360605 322874 279259 239163
20362 239163 40726 21012 127364 255960 139308 133862 310111 280547 261186 313355 256553
20351 256553 240834 149459 287240 406226 547943 700296 753350 725619 689671 589567
20341 589567 743066 858114 617725 402530 386427 389747 522138 747311 1051689 1262514
$$ packed form
20415C04610J87258q932M3261j92554p4962m3268J61344P3230k29938p8760m4221
20404I7068O8117J54675lR3915K05166Q8389J82293K23173K83222K55397O5982
20393A717394j14770j50043j08733n946J88381K15182J13185L0310r2394k29435
20383A563131j67365l35925k36154j72672L7755M831N0228k23940k55179n1438
20373B13272N366J59288J88911r5602p2039j5717r4039P1165l7731m3615m0096
20362B39163j98437j9714J06352J28596j16652n446J76249k9564j9361N2169n6802
20351B56553j5719r1375J37781J18986J41717J52353N3054k7731l5948j00104
20341E89567J53499J15048k40389k15195j6103L320J32391K25173L04378K10825
$$ plain form
20331 1262514 1341929 1430476 1544986 1612730 1810043 1829628 1943093 2134944 2294825 2344535
20321 2344535 2530546 2632698 2501872 2318386 2206538 1995697 1797502 1815772 1633946 1523005
20311 1523005 1318762 1182584 1172800 1028866 933507 696398 461647 543210 527911 537065 545657
20300 545657 462601 368651 371877 444134 474944 324483 229176 325868 448300 367587 171764
20289 171764 175747 330590 376238 444297 380825 400561 505228 713961 821185 793082 885009
20278 885009 902151 924379 1049898 1227391 1584122 2015039 2207518 2290510 2314747 2225328
20268 2225328 2147690 2075570 2110692 2058727 2109864 2139756 2029362 1999924 1899689 1801378 1648623
20257 1648623 1431486 1251900 1120141 1018251 877064 680091 512757 414623 386637 459652
$$ packed form
20331A262514P9415Q8547J14510O7744J97313J9585J13465J91851J59881M9710
20321B344535J86011J02152j30826j83486j11848k10841j98195J8270j81826j10941
20311A523005k04243j36178r784j43934r5359k37109k34751Q1563j5299R154Q592
20300E45657q3056r3950L226P2257L0810j50461r5307R6692J22432q0713j95823
20289A71764L983J54843M5648O8059o3472J9736J04667K08733J07224k8103R1927
20278H85009J7142K2228J25519J77493L56731M30917J92479Q2992K4237q9419
20268B225328p7638p2120L5122n1965N1137K9892j10394k9438j00235r8311j52755
20257A648623k17137j79586j31759j01890j41187j96973j67334r8134k7986P3015
$$ plain form
20247 459652 529399 400291 394727 471860 547792 368297 325476 364374 312441 76503 184336
20236 184336 373877 461137 579971 435688 186827 182951 216314 203466 283674 157927 1409
20225 1409 5211 172167 215231 286351 289182 355258 369891 414619 542849 577463 429575 475573
20213 475573 429432 424517 540442 363035 92534 11618 82509 232546 244849 181891 153979
20202 153979 259983 368076 303665 426276 475054 344297 254643 288398 472465 562245
20192 562245 412644 413416 523833 541046 728275 799422 965008 1133373 1092556 955167 851303
20181 851303 1053698 1197406 1142415 1173222 1225473 1193490 1067307 836606 747156 787579 623348
20170 623348 505295 539642 436976 254434 125230 -11702 61172 150293 248327 332926
$$ packed form
20247D59652O9747j29108n564P7133P5932j79495m2821L8898n1933k35938J07833
20236A84336J89541Q7260J18834j44283k48861l876L3363j2848Q0208j25747j56518
20225A409L802J66956M3064P1120K831O6076J4633M4728J28230L4614j47888M5998
20213D75573m6141m915J15925j77407k70501q0916P0891J50037J2303o2958k7912
20202A53979J06004J08093o4411J22611M8778j30757q9654L3755J84067Q9780
20192E62245j49601P72J10417J7213J87229P1147J65586J68365m0817j37389j03864
20181H51303K02395J43708n4991L0807N2251l1983j26183k30701q9450M0423j64231
20170F23348j18053L4347j02666j82542j29204j36932P2874Q9121R8034Q4599
$$ plain form
20160 332926 403320 387417 402307 504334 325181 96149 3937 56629 138435 220756 181986
20149 181986 184797 272387 215949 118729 187781 177926 -2842 -100232 -119126 152689 331462
20138 331462 438054 639316 769315 871007 848551 912541 799646 912776 1030471 1268061
20128 1268061 1218111 1352424 1423089 1393456 1323021 1208303 970994 791204 800509 798224 651362
20117 651362 704890 673389 655956 364284 132607 286579 348275 361737 356435 367071 444792
20106 444792 550146 704583 925534 930252 999794 978940 1022843 931990 652782 397254 299135
20095 299135 190178 128420 116855 153051 273731 166096 65434 170051 259044 189867
20085 189867 59094 180141 257768 124506 173406 218274 159658 147766 183714 149578 168695
$$ packed form
20160C32926P0394j5903J4890J02027j79153k29032r2212N2692Q1806Q2321l8770
20149A81986K811Q7590n6438r7220O9052r855j80768r7390j8894K71815J78773
20138C31462J06592K01262J29999J01692k2456O3990j12895J13130J17695K37590
20128A268061m9950J34313P0665k9633p0435j14718k37309j79790R305k285j46862
20117F51362N3528l1501j7433k91672k31677J53972O1696J3462n302J0636P7721
20106D44792J05354J54437K20951M718O9542k0854M3903r0853k79208k55528r8119
20095B99135j08957o1758j1565L6196J20680j07635j00662J04617Q8993o9177
20085A89867j30773J21047P7627j33262M8900M4868n8616j1892L5948l4136J9117
$$ plain form
20074 168695 204506 59567 60670 100527 64926 43010 152063 392539 452875 394056 361590
20063 361590 447518 315778 318909 507321 543878 594315 750194 908323 901688 791998 753979
20052 753979 838631 1130175 1232823 1327190 1238709 1289491 1217875 1198150 962220 997224 1029248
20041 1029248 918695 825342 782488 615104 478625 291014 103886 54975 135681 231248
20031 231248 234358 147250 164724 165524 272778 290184 331130 272166 238012 304042 357768 162461
20019 162461 166310 47278 56052 175046 268379 260319 424507 681918 524147 539263 389365
20008 389365 363300 436526 567491 623623 689208 674390 544893 572192 777966 935328 1085518
19997 1085518 1033825 1010221 1134471 1119032 1046822 1074492 1147806 1287399 1264515 1324283 1258704
$$ packed form
20074A68695L5811j44939J103L9857l5601k1916J09053K40476O0336n8819l2466
20063C61590Q5928j31740L131J88412L6557N0437J55879J58129o635j09690l8019
20052G53979Q4652K91544J02648R4367q8481N0782p1616j9725k35930L5004L2024
20041A029248j10553r3353m2854j67384j36479j87611j87128m8911Q0706R5567
20031B31248L110q7108J7474Q00J07254J7406M0946n8964l4154O6030N3726j95307
20019A62461L849j19032Q774J18994R3333q060J64188K57411j57771J5116j49898
20008C89365k6065P3226J30965N6132O5585j4818j29497K7299K05774J57362J50190
19997A085518n1693k3604J24250j5439p2210K7670P3314J39593k2884N9768o5579
$$ plain form
19986 1258704 1087711 742337 551873 544433 712328 680381 554141 592846 649852 609333
19976 609333 413415 431992 540449 455073 223731 185226 98729 99410 161460 366716 395717
19965 395717 500483 541762 506006 559083 640436 659670 630430 691376 937714 1151467 978517
19954 978517 839056 872299 982029 998717 970798 1002793 961332 1297480 1415948 1417313 1533590
19943 1533590 1303623 1181248 1397449 1636684 1978677 2360231 2841382 3387750 3915194
19934 3915194 4379665 4685512 5031943 5457858 5818679 6122339 6556619 7140765 7881211
19925 7881211 8741404 9760717 11117904 13187533 16263868 20819843 27958836 39751702
19917 39751702 59090787 88984206 131315047 180012732 217848481 226260898 203001403
$$ packed form
19986A258704j70993l45374j90464p440J67895l1947j26240L8705N7006m0519
19976F09333j95918J8577J08457q5376k31342l8505q6497O81O2050K05256K9001
19965C95717J04766M1279l5756N3077Q1353J9234k9240O0946K46338K13753j72950
19954I78517j39461L3243J09730J6688k7919L1995m1461L36148J18468J365J16277
19943A533590k29967j22375K16201K39235L41993L81554M81151N46368N27444
19934C915194M64471L05847L46431M25915L60821L03660M34280N84146P40446
19925G881211Q60193J019313J357187K069629L076335M555975P138993J1792866
19917C9751702J9339085K9893419M2330841M8697685L7835749Q412417k3259495
$$ plain form
19910 203001403 167314585 144243221 146579035 173093403 211725369 240224504 236469090
19903 236469090 197320483 141793279 93678030 62374339 44263547 33543787 26618440
19896 26618440 21970641 18837788 16654599 14880956 13858890 13079761 12720183 12601394
19888 12601394 12306717 12189534 12018497 11760656 11582664 11305825 11436897 11695232 11771619
19879 11771619 11993285 12486034 13022530 14163867 15803582 18079254 21450257 26841929
19871 26841929 35804614 50529397 74422275 110834470 160038341 211614433 244244235
19864 244244235 241276971 208655502 171622051 154614286 166084729 200494829 241218091
19857 241218091 262475462 245476653 194942328 135590724 89133875 60411157 43539622
$$ packed form
19910B03001403l5686818k3071364K335814K6514368L8631966K8499135l755414
19903B36469090l9148607n5527204m8115249l1303691j8110792j0719760o925347
19896B6618440m647799l132853k183189j773643j022066p79129l59578j18789
19888A2601394k94677j17183j71037k57841j77992k76839J31072K58335P6387
19879A1771619K21666M92749N36496J141337J639715K275672L371003N391672
19871B6841929Q962685J4724783K3892878L6412195M9203871N1576092L2629802
19864B44244235k967264l2621469l7033451j7007765J1470443L4410100M0723262
19857B41218091K1257371j6998809n0534325n9351604m6456849k8722718j6871535
$$ plain form
19850 43539622 33480130 27013028 22700883 19508207 17007085 15220775 13838476 12662315
19842 12662315 11820415 10919563 9952310 9191931 8629828 8036568 7498096 7021405 6516293
19833 6516293 6061511 5606350 4948557 4471259 4107822 3569173 2959219 2978857 3077763 2904430
19823 2904430 2732485 2523077 2473131 2329536 2017511 1916305 2009249 2156044 2019723 2014802
19813 2014802 1919141 1732850 1854986 1662667 1456960 1419151 1396025 1402579 1484961 1530389 1687076
19802 1687076 1772426 1628228 1560042 1628325 1994390 2120132 1965846 1828675 1912115 1967569
19792 1967569 1963013 2107439 1989923 1876843 1760158 1567779 1612778 1544838 1293976 1226280
19782 1226280 1054229 1007136 1189490 1311029 1316164 1291819 1240815 1246596 1448609 1490758 1333046
$$ packed form
19850D3539622j0059492o467102m312145l192676k501122j786310j382299j176161
19842A2662315q41900r00852r67253p60379n62103n93260n38472m76691n05112
19833F516293m54782m55161o57793m77298l63437n38649o09954J9638R8906j73333
19823B904430j71945k09408m9946j43595l12025j01206R2944J46795j36321m921
19813B014802r5661j86291J22136j92319k05707l7809k3126O554Q2382M5428J56687
19802A687076Q5350j44198o8186O8283L66065J25742j54286j37171Q3440N5454
19792A967569m556J44426j17516j13080j16685j92379M4999o7940k50862o7696
19782A226280j72051m7093J82354J21539N135k4345n1004N781K02013M2149j57712
$$ plain form
19771 1333046 1109531 1157453 1298514 1374300 1133698 934865 969660 1088886 937582 985313
19761 985313 1071772 904018 622677 663841 736327 715453 444854 393881 304737 391728 492133
19750 492133 592680 736607 613756 506220 432317 578315 644829 703898 698449 755503 839349
19739 839349 891067 960368 1102735 1205528 1125485 1145714 1249826 1175138 1163801 1369152 1367560
19728 1367560 1174229 1089882 1134234 1334512 1665297 1960103 2109441 2523179 2748245 2851646
19718 2851646 3144079 3372989 3267113 3177897 3274086 3322334 3489865 3672317 3935211 3880638
19708 3880638 3540369 3137782 2952839 2847697 2763016 2984121 3296741 3425009 3769476 4178112
19698 4178112 4517048 4927590 5368066 5689249 5887414 6221589 6824842 7536965 8197684
$$ packed form
19771A333046k23515M7922J41061P5786k40602j98833L4795J19226j51304M7731
19761I85313Q6459j67754k81341M1164P2486k0874k70599n0973q9144Q6991J00405
19750D92133J00547J43927j22851j07536p3903J45998O6514N9069n449N7054Q3846
19739H39349N1718O9301J42367J02793q0043K0229J04112p4688j1337K05351j592
19728A367560j93331q4347M4352K00278L30785K94806J49338M13738K25066J03401
19718B851646K92433K28910j05876q9216R6189M8248J67531J82452K62894n4573
19708C880638l40269m02587j84943j05142q4681K21105L12620J28268L44467M08636
19698D178112L38936M10542M40476L21183J98165L34175O03253P12123O60719
$$ plain form
19689 8197684 8953565 10111550 11595716 13597692 16603645 21178620 28223756 39245148
19681 39245148 55366525 76364938 98119956 115703927 128431245 138846760 148962836
19674 148962836 159850398 172853057 187159028 198111991 199803038 190343668 174871798
19667 174871798 160170004 148786562 139200514 129344180 117747106 102791372 83295383
19660 83295383 61903842 44285408 32966103 26187788 21865215 19017729 16779467 15047873
19652 15047873 13976814 13161665 12479387 12259428 11975882 11549412 11479279 11368499 11214910
19643 11214910 11204328 11313756 11473762 11592415 11917616 12443380 13066822 13858760 15027532
19634 15027532 16872382 19741287 24198041 30993574 41773927 58417295 80752685 105410484
$$ packed form
19689H197684P55881J157985J484166K001976L005953M574975P045136J1021392
19681C9245148J6121377K0998413K1755018J7583971J2727318J0415515J0116076
19674A48962836J0887562J3002659J4305971J0952963J691047r459370j5471870
19667A74871798j4701794j1383442r586048r856334j1597074j4955734j9495989
19660H3295383k1391541j7618434j1319305o778315m322573k847486k238262j731594
19652A5047873j071059q15149o82278k19959k83546m26470p0133j10780j53589
19643A1214910j0582J09428J60006J18653L25201N25764O23442P91938J168772
19634A5027532J844850K868905M456754O795533J0780353J6643368K2335390K4657799
$$ plain form
19626 105410484 126483860 141740354 153703899 164578027 175382262 188154750 202965496
19619 202965496 215838990 220420660 212563304 195582708 177624289 163170924 151634969
19612 151634969 140968953 129271228 114581253 94822764 71380584 50638855 36589328
19605 36589328 28195586 22970051 19337688 16785040 14561928 12875179 11716957 10834124
19597 10834124 10079686 9537372 8870335 8025977 7416183 6920403 6494094 6246069 5840833
19588 5840833 5375017 4997086 4756099 4410688 4140512 3708324 3331897 3084422 2937246
19579 2937246 2616248 2353728 2211627 2162391 2038888 1977807 2201328 2193573 2128466 2015227
19569 2015227 1826633 1716725 1586842 1630391 1783811 1898811 1916908 1705530 1626660 1615393
$$ packed form
19626A05410484K1073376J5256494J1963545J0874128J0804235J2772488J4810746
19619B02965496J2873494M581670p857356j6980596j7958419j4453365j1535955
19612A51634969j0666016j1697725j4689975j9758489k3442180k0741729j4049527
19605C6589328q393742n225535l632363k552648k223112j686749j158222q82833
19597A0834124p54438n42314o67037q44358o09794m95780m26309k48025m05236
19588E840833m65816l77931k40987l45411k70176m32188l76427k47475j47176
19579B937246l20998k62520j42101m9236j23503o1081K23521p755o5107j13239
19569B015227j88594j09908j29883M3549J53420J15000J8097k11378p8870j1267
$$ plain form
19559 1615393 1543447 1460787 1606369 1859737 1963889 1956751 1848039 2043705 2041157 1911532
19549 1911532 1627119 1315133 1300031 1450341 1537487 1557955 1568727 1515493 1405531 1391339
19539 1391339 1205428 1074575 1005257 1082741 1119090 958066 935523 920222 942276 1030511 970290
19528 970290 912466 867232 777110 756060 860753 866198 729401 749247 893262 911839 1031361
19517 1031361 949837 790556 850402 788526 880792 895422 815873 984533 1149784 1193365 1066208
19506 1066208 996239 1013137 1141199 1253495 1244206 1392551 1379670 1412349 1666350 1751798 1496442
19495 1496442 1116759 963261 809373 742565 965479 1135434 1280928 1360302 1390060 1346969
19485 1346969 1417224 1361462 1144914 1053793 1010801 1068819 1043649 822408 720503 803085 779205
$$ packed form
19559A615393p1946q2660J45582K53368J04152p138j08712J95666k548j29625
19549A911532k84413l11986j5102J50310Q7146K0468J0772n3234j09962j4192
19539A391339j85911j30853o9318P7484L6349j61024k2543j5301K2054Q8235o0221
19528I70290n7824m5234r0122k1050J04693N445j36797J9846J44015J8577J19522
19517A031361q1524j59281N9846o1876R2266J4630p9549J68660J65251M3581j27157
19506A066208o9969J6898J28062J12296r289J48345j2881L2679K54001Q5448k55356
19495A496442l79683j53498j53888o6808K22914J69955J45494P9374K9758m3091
19485A346969P0255n5762k16548r1121m2992N8018k5170k21241j01905Q2582k3880
$$ plain form
19474 779205 844506 1019143 1022896 1160211 1393067 1550094 1648094 1853425 2136075 2177547
19464 2177547 2319034 2409155 2293384 2438530 2649599 2683034 2628165 2572674 2674182 2673918 2596071
19453 2596071 2498598 2092077 1674182 1461665 1250958 1212852 1260148 1329195 1340697 1258148
19443 1258148 1248482 1104303 741129 604787 796654 917975 703148 470875 424430 661668
19433 661668 795431 916878 915299 819315 661769 540138 402886 322033 399367 588270
19423 588270 689863 640673 769922 1044884 1206098 1160634 1243100 1569305 1848147 2131200
19413 2131200 2420327 2597272 2746105 2889126 2990994 2896643 2925171 2790883 2571783 2392234
19403 2392234 2287316 2352203 2205190 1983900 1760402 1588235 1229070 1061824 962674 1046236
$$ packed form
19474G79205O5301J74637L753J37315K32856J57027R8000K05331K82650M1472
19464B177547J41487R0121j15771J45146K11069L3435n4869n5491J01508k64p7847
19453B596071r7473m06521m17895k12517k10707l8106M7296O9047J1502q2549
19443A258148r666j44179l63174j36342J91867J21321k14827k32273m6445K37238
19433F61668J33763J21447j579r5984j57546j21631j37252q0853P7334J88903
19423E88270J01593m9190J29249K74962J61214m5464Q2466L26205K78842K83053
19413B131200K89127J76945J48833J43021J01868r4351K8528j34288k19100j79549
19403B392234j04918O4887j47013k21290k23498j72167l59165j67246r9150Q3562
$$ plain form
19393 1046236 1110210 1219370 1460528 1463810 1306112 1259151 1292048 1289330 1283708 1159858 1209502
19382 1209502 1514142 1804694 2162062 2466538 2594782 2590997 2504776 2372356 2485325 2553871
19372 2553871 2721742 3204036 3575110 3660576 3713992 3930132 4186884 4286531 4536848 4916061
19362 4916061 5280519 5412466 5682798 6160149 6530330 6999726 7524616 8111869 8945111
19353 8945111 10398988 12522439 14988834 19055971 25802916 35998839 50888362 70419405
19345 70419405 90996965 108327659 121813826 134039060 144098177 148371431 148750420
19338 148750420 151024311 156380803 159713157 157141549 152243942 150349021 150087651 146392267
19330 146392267 137087402 124570696 110455877 93682570 73374783 53457557 39125066
$$ packed form
19393A046236O3974J09160K41158L282j57698m6961L2897k718n622j23850M9644
19382A209502L04640K90552L57368L04476J28244l785q6221j32420J12969O8546
19372B553871J67871M82294L71074Q5466N3416K16140K56752R9647K50317L79213
19362D916061L64458J31947K70332M77351L70181M69396N24890N87253Q33242
19353H945111J453877K123451K466395M067137O746945J0195923J4889523J9531043
19345G0419405K0577560J7330694J3486167J2225234J0059117M273254L78989
19338A48750420K273891N356492L332354k571608m897607j894921k61370l695384
19330A46392267r304865j2516706j4114819j6773307k0307787j9917226j4332491
$$ plain form
19323 39125066 30475169 24995444 21239405 18492602 16401863 14890929 13781490 13071414
19315 13071414 12681932 12395624 12234727 12200443 12430528 12541014 12748766 13041430 14068136
19306 14068136 15031507 15678037 15901744 16219541 17156748 18853986 21325052 24809152 29864229
19297 29864229 37819584 50471299 69325797 93768811 119001597 140356977 158631600
19290 158631600 174967451 185136422 185680304 183039387 184448216 188401713 189529227 186945716
19282 186945716 185497867 187050230 186834312 178313110 161853577 143262339 123244982 99102435
19274 99102435 73067433 51722379 37938195 29489533 23915323 20010420 17164009 15114584
19266 15114584 13589533 12322233 11339603 10472872 9530737 8956063 8340519 7728496 7172203
$$ packed form
19323C9125066q649897n479725l756039k746803k090739j510934j109439p10076
19315A3071414l89482k86308j60897l4284K30085J10486K07752K92664J026706
19306A4068136R63371O46530K23707L17797R37207J697238K471066L484100N055077
19297B9864229P955355J2651715J8854498K4443014K5232786K1355380J8274623
19290A58631600J6335851J0168971N43882k640917J408829L953497J127514k583511
19282A86945716j447849J552363k15918q521202j6459533j8591238k0017357k4142547
19274I9102435k6035002k1345054j3784184q448662n574210l904903k846411k049425
19266A5114584j525051j267300r82630q66731r42135n74674o15544o12023n56293
$$ plain form
19257 7172203 6697183 6259814 5717170 5293388 4804575 4526846 4186410 3898209 3878838 3675183
19247 3675183 3455741 3330769 3147082 3087726 3126561 3166832 3345778 3406318 3414701 3483042 3531587
19236 3531587 3541529 3483009 3431199 3325524 3178155 3278890 3333359 3255757 3167460 3124496 3182717
19225 3182717 3253229 3356476 3209995 3262184 3253831 3091462 2954635 2682142 2664666 2690354
19215 2690354 2597802 2399562 2384700 2252714 2029623 1829752 1471387 1318124 1482055 1522089
19205 1522089 1441773 1397879 1261323 1231357 1298839 1334161 1098379 1153626 1133491 1196045 1433790
19194 1433790 1547977 1749191 1850997 2072278 2340684 2575596 2770629 2963052 2994590 2794322
19184 2794322 2652455 2635926 2881048 2987996 3103216 3375444 3518124 3402961 3148656 2982745
$$ packed form
19257G172203m75020m37369n42644m23782m88813k77729l40436k88201j9371k03655
19247C675183k19442j24972j83687n9356L8835M0271J78946O0540Q383O8341M8545
19236C531587R942n8520n1810j05675j47369J00735N4469p7602q8297m2964N8221
19225C182717P0512J03247j46481N2189q353j62369j36827k72493j7476K5688
19215B690354r2552j98240j4862j31986k23091j99871l58365j53263J63931M0034
19205A522089q0316m3894j36556k9966O7482L5322k35782N5247k0135O2554K37745
19194A433790J14187K01214J01806K21281K68406K34912J95033J92423L1538k00268
19184B794322j41867j6529K45122J06948J15220K72228J42680j15163k54305j65911
$$ plain form
19174 2982745 2898204 2834524 2780291 2869937 3073203 3274023 3198612 3079018 3059416 3020740 2922341
19163 2922341 2712779 2505781 2377176 2073058 1865818 1937188 2111511 2384881 2284717 2088691
19153 2088691 1943717 1867394 1858153 1848448 1712994 1630434 1629441 1562203 1316788 1040017 1017169
19142 1017169 1078540 1067535 1381737 1829720 1887802 1797147 1761717 1536913 1454233 1208539
19132 1208539 997161 831113 829687 653648 431344 428323 577061 675532 669960 522350 671752
19121 671752 645595 574357 433931 440177 520375 685336 1026310 1265820 1415807 1408069 1488514
19110 1488514 1515801 1510905 1570872 1644485 1664047 1864027 2029934 2109541 2012611 1932821 1885158
19099 1885158 1906492 1649251 1416128 1070797 1086421 1211537 1123273 991221 1018710 1117922
$$ packed form
19174B982745q4541o3680n4233Q9646K03266K00820p5411j19594j9602l8676r8399
19163B922341k09562k06998j28605l04118k07240P1370J74323K73370j00164j96026
19153B088691j44974p6323r241r705j35454q2560r93o7238k45415k76771k2848
19142A017169O1371j1005L14202M47983N8082r0655l5430k24804q2680k45694
19132A208539k11378j66048j426j76039k22304l021J48738R8471n572j47610J49402
19121F71752k6157p1238j40426O246Q0198J64961L40974K39510J49987p738Q0445
19110A488514K7287m896N9967P3613J9562J99980J65907P9607r6930p9790m7663
19099A885158K1334k57241k33123l45331J5624J25116q8264j32052K7489R9212
$$ plain form
19089 1117922 1101160 1275028 1129373 1071419 1191201 1242380 1164058 1063105 1041122 1071879
19079 1071879 941021 899877 985971 1112716 1326738 1467984 1508731 1560230 1790928 1964338
19069 1964338 1967794 2202648 2421633 2604068 2610349 2656588 2812580 3082486 3403420 3604545
19059 3604545 3769484 4136411 4454371 4961526 5919654 7198654 8989493 12033931 16881007
19050 16881007 24568353 36444221 53405214 73844562 91141525 96340201 86899431
19043 86899431 69395846 54615062 48625010 52036981 63482183 80661763 96839284
19036 96839284 101812860 90878341 69269886 47378476 32095417 23202509 18287652
19029 18287652 15078149 12735082 10880851 9732472 9160475 8884463 8940253 9023808 8961080
$$ packed form
19089A117922j6762J73868j45655n7954J19782N1179p8322j00953k1983L0757
19079A071879j30858m1144Q6094J26745K14022J41246M0747N1499K30698J73410
19069A964338L456K34854K18985J82435O281M6239J55992K69906L20934K01125
19059C604545J64939L66927L17960N07155R58128J279000J790839L044438M847076
19050A6881007P687346J1875868J6960993K0439348J7296963N198676r440770
19043H6899431j7503585j4780784n990052L411971J1445202J7179580J6177521
19036I6839284M973576j0934519k1608455k1891410j5283059q892908m914857
19029A8287652l209503k343067j854231j148379n71997k76012N5790Q3555o2728
$$ plain form
19020 8961080 8809599 8754212 8754488 8813043 8932831 9416151 9945174 10482774 11369852 12904824
19010 12904824 15087272 18024534 22739608 30460277 42711699 61784605 89369466 123121601
19002 123121601 152281594 162265322 148267338 120528785 96327571 86908044 93787939
18995 93787939 115497535 149622445 187078699 210756738 206544163 175035381 131789456
18988 131789456 94410307 71174623 61172565 61149484 69272202 82830697 94841960
18981 94841960 96520406 84506541 64118453 44653362 31580408 24199719 20065858
18974 20065858 17248929 15194349 13932250 13010432 12092983 11522736 11255272 10948328 10617350
18965 10617350 10284928 10007423 9711088 9605396 9526101 9605952 9841394 10458480 11444227 12888634
$$ packed form
19020H961080j51481n5387K76N8555J19788M83320N29023N37600Q87078J534972
19010A2904824K182448K937262M715074P720669J2251422J9072906K7584861L3752135
19002A23121601K9159993R983728j3997984k7738553k4201214r419527O879895
18995I3787939K1709596L4124910L7456254K3678039m212575l1508782m3245925
18988A31789456l7379149k3235684j0002058k3081Q122718J3558495J2011263
18981I4841960J678446j2013865k0388088j9465091j3072954p380689m133861
18974B0065858k816929k054580j262099r21818r17449n70247k67464l06944l30978
18965A0617350l32422k77505k96335j05692p9295P9851K35442O17086R85747J444407
$$ plain form
18955 12888634 15214974 18891001 24986288 34411155 49213308 71803352 102536592 135258995
18947 135258995 155952120 153065308 128936117 98136621 76311699 69090705 74530166
18940 74530166 90653693 113922847 134601218 139464991 123119695 92918152 62993408
18933 62993408 42047810 29625068 22109051 17353426 14195526 11785188 10087521 8839989
18925 8839989 7653136 6971656 6377849 5933952 5749519 5756460 5567877 5244811 4789235 4608248
18915 4608248 4481780 4400583 4181130 3890301 3778135 3841881 3758586 3557884 3233070 2926653
18905 2926653 2687037 2385119 2264424 2296084 2192123 2130731 2258714 2335533 2339859 2243659
18895 2243659 2211197 2198653 2157622 2256231 2266443 2293813 2393342 2514917 2716885 2899009 3184528
$$ packed form
18955A2888634K326340L676027O095287R424867J4802153K2590044L0733240L2722403
18947A35258995K0693125k886812k4129191l0799496k1824922p220994N439461
18940G4530166J6123527K3269154K0678371M863773j6345296l0201543k9924744
18933F2993408k0945598j2422742p516017m755625l157900k410338j697667j247532
18925H839989j186853o81480n93807m43897j84433O941j88583l23066m55576j80987
18915D608248j26468q1197k19453k90829j12166O3746q3295k00702l24814l06417
18905B926653k39616l01918j20695L1660j03961o1392J27983P6819M326r6200
18895B243659l2462j2544m1031R8609J0212K7370R9529J21575K01968J82124K85519
$$ plain form
18884 3184528 3433087 3768427 3851415 3926398 4100952 4335463 4711482 5149146 5446871 5719200
18874 5719200 6105949 6429406 7140071 7851766 8515522 9526393 11162919 13549730 17156570
18865 17156570 22812209 31609828 45400368 66496803 95915369 130011465 157649131
18858 157649131 166070049 152575437 129112616 112785566 113390729 130584984 155675683
18851 155675683 172824056 167786589 139776303 101619262 68650042 46870916 33919688
18844 33919688 25819094 20495235 16954698 14540366 12934421 12064578 11499160 11173323
18836 11173323 11073095 10901965 10733638 10676256 10551478 10781288 11039259 11136574 11482405 11868082
18826 11868082 12107740 12734611 13793849 15440937 17905340 21634977 27466380 36352346
$$ packed form
18884C184528K48559L35340Q2988P4983J74554K34511L76019M37664K97725K72329
18874E719200L86749L23457P10665P11695O63756J010871J636526K386811L606840
18865A7156570N655639Q797619J3790540K1096435K9418566L4096096K7637666
18858A57649131Q420918j3494612k3462821j6327050O05163J7194255K5090699
18851A55675683J7148373n037467k8010286l8157041l2969220k1779126j2951228
18844C3919688q100594n323859l540537k414332j605945q69843n65418l25837
18836A1173323j00228j71130j68327n7382j24778K29810K57971R7315L45831L85677
18826A1868082K39658O26871J059238J647088K464403L729637N831403Q885966
$$ plain form
18818 36352346 49724734 68646402 91554485 111750270 121217049 117855389 109634195
18811 109634195 108888574 123994831 155630535 194959192 223816429 225013159 197852307
18804 197852307 159909818 132454870 125182063 134131162 146145803 147002990 129953012
18797 129953012 100669696 71209432 49522702 36051103 27968508 23029827 19886508
18790 19886508 17990870 16590659 15396983 14353935 13427575 12742470 12515750 12442580 12135585
18781 12135585 11481394 10616815 9735324 9375899 9309257 9391019 9320786 9253435 9443726 10084479
18771 10084479 11173159 13205976 16547831 22005463 30222079 41670047 57320220 75350881
18763 75350881 89185996 92215502 83683938 70908775 62920321 64578325 73723127 83559937
$$ packed form
18818C6352346J3372388J8921668K2908083K0195785R466779l361660q221194
18811A09634195p45621J5106257L1635704L9328657K8857237J196730k7160852
18804A97852307l7942489k7454948p272807Q949099J2014641Q57187j7049978
18797A29953012k9283316k9460264k1686730j3471599q082595m938681l143319
18790A9886508j895638j400211j193676j043048r26360o85105k26720p3170l06995
18781A2135585o54191q64579q81491l59425o6642Q1762p0233o7351J90291O40753
18771A0084479J088680K032817L341855N457632Q216616J1447968J5650173J8030661
18763G5350881J3835115L029506q531564j2775163p988454J658004R144802R836810
$$ plain form
18755 83559937 86126299 77256398 60237536 42727657 29514871 21382411 16445714 13244746
18747 13244746 10954327 9457057 8581106 8159250 8208945 8359347 8512622 8169356 7577955
18738 7577955 7109467 6733268 6535220 6480816 6407760 6501049 6703271 7133637 7719734 8307011
18728 8307011 8938800 9787591 10859996 12336179 14460747 17542902 22103286 29019025
18720 29019025 40308707 58740756 87525443 129373522 180410394 226139691 244780041
18713 244780041 225075141 176734719 122735476 80900687 54531404 38964328 29387562
18706 29387562 23325486 19335946 16291378 14096604 12345550 10938797 9700778 8614818
18698 8614818 7986580 7775817 7778038 8148249 8674665 9279329 9816100 10434252 10943633 11319350
$$ packed form
18755H3559937K566362q869901j7018862j7509879j3212786q132460m936697l200968
18747A3244746k290419j497270q75951m21856M9695J50402J53275l43266n91401
18738G577955m68488l76199j98048n4404p3056R3289K02222M30366N86097N87277
18728H307011O31789Q48791J072405J476183K124568L082155M560384O915739
18720B9019025J1289682J8432049K8784687M1848079N1036872M5729297J8640350
18713B44780041j9704900m8340422n3999243m1834789k6369283j5567076r576766
18706B9387562o062076l989540l044568k194774j751054j406753j238019j085960
18698H614818o28238k10763K221L70211N26416O04664N36771O18152N09381L75717
$$ plain form
18688 11319350 11705798 11756412 11071925 10360926 9974224 9806104 9932312 10648282 11503489
18679 11503489 12559306 14317530 16653840 19744352 23810835 29641478 38286936 52089613
18671 52089613 74058839 107902188 155688427 212467430 263339039 292664207 298643683
18664 298643683 294656683 290955223 280834840 250535973 199309905 142502068 96699030
18657 96699030 66781725 48655739 37350758 29760845 24293258 20370250 17500003 15270803
18649 15270803 13371305 11955119 11027779 10200571 9801123 9818798 10129384 10614827 11215813
18640 11215813 11347961 10910390 10308486 9835162 9680463 9521744 9011273 8469764 8057984
18631 8057984 7841398 7702527 7661559 7984131 8530799 9567654 11117964 12975711 15422177
$$ packed form
18688A1319350L86448N0614o84487p10999l86702j68120J26208P15970Q55207
18679A1503489J055817J758224K336310L090512M066483N830643Q645458J3802677
18671E2089613K1969226L3843349M7786239N6779003N0871609K9325168N979476
18664B98643683l987000l701460j0120383l0298867n1226068n6807837m5803038
18657I6699030k9917305j8125986j1304981p589913n467587l923008k870247k229200
18649A5270803j899498j416186r27340q27208l99448J7675L10586M85443O00986
18640A1215813J32148m37571o01904m73324j54699j58719n10471n41509m11780
18631H057984k16586j38871m0968L22572N46668J036855J550310J857747K446466
$$ plain form
18622 15422177 18993814 24702360 34365716 49886385 74613196 110191850 153279559
18615 153279559 190238685 203285406 183868154 141812974 96802918 62933868 42168734
18608 42168734 30089716 22541949 17443477 14128002 11825724 10190853 8641310 7554541
18600 7554541 6702699 5955569 5217752 4659584 4299449 4027041 3819090 3712143 3812582
18591 3812582 3995587 4102245 4430656 4625290 4584062 4229381 3618456 2961662 2751359 2474738
18581 2474738 2190211 1901035 1789649 1758925 1489593 1506844 1663534 1565392 1458101 1591409
18571 1591409 1826144 2054258 2347907 2671399 2897951 3117947 3228908 2923900 2465197
18562 2465197 2188636 1914658 1634527 1575795 1347303 1143361 1121368 1059459 879697 743735
$$ packed form
18622A5422177L571637N708546R663356J5520669K4726811L5578654M3087709
18615A53279559L6959126J3046721j9417252m2055180m5010056l3869050k0765134
18608D2168734j2079018p547767n098472l315475k302278j634871j549543j086769
18600G554541q51842p47130p37817n58168l60135k72408k07951j06947J00439
18591C812582J83005J06658L28411J94634m1228l54681o10925o56794k10303k76621
18581B474738k84527k89176j11386l0724k69332J7251J56690r8142j07291J33308
18571A591409K34735K28114K93649L23492K26552K19996J10961l05008m58703
18562B465197k76561k73978k80131n8732k28492k03942k1993o1909j79762j35962
$$ plain form
18552 743735 920705 891337 1052151 993846 947124 901456 1025965 1229453 1274260 1178281 1173412
18541 1173412 1175935 1104661 1298493 1319891 1003789 856108 820060 774729 838412 747881 635636
18530 635636 622007 577422 902845 1219010 1737849 2049012 2098425 2281996 2635209 3054788
18520 3054788 3326697 3465730 3508749 3499947 3404500 3507672 3389182 2957434 2610140 2369759
18510 2369759 1965389 1621903 1230201 1031118 933191 977715 950813 1080260 1080915 865298
18500 865298 567824 439761 387023 443275 388501 511193 595106 606184 573328 542863 561493
18489 561493 698981 664121 608690 575391 619705 671268 1024199 1105487 1007881 974991 960231
18478 960231 1119027 978158 921828 1292018 1577753 1763305 1921290 2152421 2365181 2310110
$$ packed form
18552G43735J76970k9368J60814n8305m6722m5668J24509K03488M4807r5979m869
18541A173412K523p1274J93832K1398l16102j47681l6048m5331O3683r0531j12245
18530F35636j3629m4585L25423L16165N18839L11163M9413J83571L53213M19579
18520C054788K71909J39033M3019q802r5447J03172j18490m31748l47294k40381
18510B369759m04370l43486l91702j99083r7927M4524k6902J29447O55k15617
18500H65298k97474j28063n2738N6252n4774J22692Q3913J1078l2856l0465J8630
18489E61493J37488l4860n5431l3299M4314N1563L52931Q1288r7606l2890j4760
18478I60231J58796j40869n6330L70190K85735J85552J57985K31131K12760n5071
$$ plain form
18468 2310110 2224051 2394860 2337015 2102162 1907400 1836878 1742451 1686925 1399957 1199793
18458 1199793 1100731 881792 600808 378312 358183 369046 282534 257481 301457 291523 328713
18447 328713 306906 293229 234941 234473 339999 344248 350982 353305 315364 263152 172949 195943
18435 195943 46612 3775 178608 360233 438166 423356 473568 671908 708924 719302 678783
18424 678783 584569 662874 655547 565296 711720 953336 1015565 797640 734394 692219 478104
18413 478104 414651 355824 244954 215122 183465 62040 10506 31234 225954 218690 43998
18402 43998 11492 59789 -63939 -67037 -73429 34875 -16865 -102795 -1702 130316 -135
18391 -135 -97869 -219556 -125780 3885 36843 130366 41853 -111399 -154569 -187686 -178985 -232236
$$ packed form
18468B310110q6059J70809n7845k34853j94762p0522r4427n5526k86968k00164
18458A199793r9062k18939k80984k22496k0129J0863q6512k5053M3976r934L7190
18447C28713k1807j3677n8288m68J05526M249O734K323l7941n2212r0203K2994
18435A95943j49331m2837J74833J81625P7933j4810N0212J98340L7016J0378m0519
18424F78783r4214P8305p327r0251J46424K41616O2229k17925o3246m2175k14115
18413D78104o3453n8827j10870k9832l1657j21425n1534K0728J94720p264j74692
18402D3998l2506M8297j23728l098o392J08304n1740q5930J01093J32018j30451
18391a35r7734j21687R3776J29665L2958R3523q8513j53252m3170l3117Q701n3251
$$ plain form
18379 -232236 -197425 -60464 110250 45727 -67961 -126610 -174101 -41188 -27424 112047
18369 112047 178581 99882 136016 103846 114520 173374 285234 402426 413115 100052 38064
18358 38064 10342 118293 157037 61064 56987 70953 282043 515332 559365 526044 574029
18347 574029 644319 614454 462551 441836 490164 728640 926497 993023 970943 868278 554008
18336 554008 357355 189609 116514 87730 55388 108659 31906 56605 203679 249851 297219
18325 297219 303203 321500 342772 251241 103150 49377 88000 160994 213152 64446 21568
18314 21568 6910 -89229 -206081 -178137 217139 447159 493818 398377 375873 264170 271979
18303 271979 571337 864179 848563 856135 913282 944237 785108 813900 919394 1141023 1206309
$$ packed form
18379b32236L4811J36961J70714o4523j13688n8649m7491J32913J3764J39471
18369A12047O6534p8699L6134l2170J0674N8854J11860J17192J0689l13063o1988
18358C8064k7722J07951L8744r5973m077J3966K11090K33289M4033l3321M7985
18347E74029P0290k9865j51903k0715M8328K38476J97857O6526k2080j02665l14270
18336E54008j96653j67746p3095k8784l2342N3271p6753K4699J47074M6172M7368
18325B97219N984J8297K1272r1531j48091n3773L8623P2994N2158j48706m2878
18314B1568j4658r6139j16852K7944L95276K30020M6659r5441k2504j11703P809
18303B71979K99358K92842j5616P572N7147L0955j59129K8792J05494K21629O5286
$$ plain form
18292 1206309 1158641 939814 752023 554638 410072 448979 468318 398079 391818 358073 117997
18281 117997 143272 243358 163038 114808 132887 110970 122268 187363 291564 150753 -6648
18270 -6648 93156 219155 292937 214206 108624 35983 131186 90688 203339 208782 265625
18259 265625 256782 193446 296132 275089 210685 241519 448483 574187 664732 576860 516002
18248 516002 559330 446435 309297 444564 446314 464593 734578 737805 484407 469763 240674
18237 240674 -13470 -275919 -244042 -5207 283698 390927 401118 372357 320371 354142
18227 354142 330884 329150 311996 344184 348965 367537 220401 35469 -112792 2063 -111299
18216 -111299 -63367 115599 187087 97809 138125 88423 72705 105006 240526 308660 265429
$$ packed form
18292A206309m7668k18827j87791j97385j44566L8907J9339p0239o261l3745k40076
18281A17997K5275J00086q0320m8230J8079k1917J1298O5095J04201j40811j57401
18270f648R9804J25999P3782p8731j05582p2641R5203m0498J12651N443N6843
18259B65625q843o3336J02686k1043o4404L0834K06964J25704R0545q7872o0858
18248E16002M3328j12895j37138J35267J750J8279K69985L227k53398j4644k29089
18237B40674k54144k62449L1877K38835K88905J07229J0191k8761n1986L3771
18227C54142k3258j734j7154L2188M781J8572j47136j84932j48261J14855j13362
18216a11299M7932J78966P1488q9278M0316m9702j5718L2301J35520O8134m3231
$$ plain form
18205 265429 235978 301252 362084 463848 277772 121664 84462 170918 303896 344735 342353
18194 342353 419598 335793 285569 441612 597527 507310 515585 768584 996225 1023012 1190047
18183 1190047 1325607 1116654 783892 580129 384117 234238 121084 197161 197415 136770
18173 136770 273521 309298 207878 284221 334723 262099 229569 82544 156474 303722 398324
18162 398324 516428 573324 545507 398745 430639 621140 711130 688000 588254 618798 729930
18151 729930 769396 559399 574261 608731 698245 680897 515832 670147 857920 1095731
18141 1095731 1244024 1468050 1765933 2130419 2317790 2693334 2990056 3025990 3113722 3136288
18131 3136288 3205858 3488517 3549592 3625763 3587663 3587519 3976741 4324059 4765778 5578532 6709456
$$ packed form
18205B65429k9451O5274O0832J01764j86076j56108l7202Q6456J32978M0839k382
18194C42353P7245q3805n0224J56043J55915r0217Q275K52999K27641K6787J67035
18183A190047J35560k08953l32762k03763j96012j49879j13154P6077K54o0645
18173A36770J36751L5777j01420P6343N0502p2624l2530j47025P3930J47248R4602
18162C98324J18104N6896k7817j46762L1894J90501Q9990k3130r9746L0544J11132
18151G29930L9466k09997J4862L4470Q9514j7348j65065J54315J87773K37811
18141A095731J48293K24026K97883L64486J87371L75544K96722L5934Q7732K2566
18131C136288O9570K82659O1075P6171l8100j44L89222L47318M41719Q12754J130924
$$ plain form
18120 6709456 8261430 10173704 12662476 16313865 21707582 30357980 45273736 71749981
18112 71749981 116262153 186835892 286533001 378935326 365103660 241380135 133654661
18105 133654661 80487688 53477336 37634972 27390702 20799122 16402299 13413854
18098 13413854 11474556 10018087 8762243 7574086 6609492 5666267 4729232 4311688 4021820
18089 4021820 3956445 3781893 3624470 3391412 3409959 3431385 3319278 2943320 2444384 2165789
18079 2165789 1997593 1657094 1531868 1560917 1375734 1184654 1156840 1191314 1074453 1043320
18069 1043320 961855 818364 796791 875919 992592 955395 763767 727002 708120 730335 680940
18058 680940 707208 777382 768519 669729 578653 540562 538411 486474 382094 372006 233404
$$ packed form
18120F709456J551974J912274K488772L651389N393717Q650398J4915756K6476245
18112G1749981M4512172P0573739R9697109R2402325j3831666j23723525j07725474
18105A33654661n3166973k7010352j5842364j0244270o591580m396823k988445
18098A3413854j939298j456469j255844j188157r64594r43225r37035m17544k89868
18089D021820o5375j74552j57423k33058J8547K1426j12107l75958m98936k78595
18079B165789j68196l40499j25226K9049j85183j91080k7814L4474j16861l1133
18069A043320q1465j43491k1573P9128J16673l7197j91628l6765j8882K2215m9395
18058F80940K6268P0174q863r8790r1076l8091k151n1937j04380j0088j38602
$$ plain form
18047 233404 346738 513094 430194 120085 51870 87552 142765 246728 51805 149284
18037 149284 286387 262743 135435 108089 5968 -94958 -116451 3703 17147 160383
18027 160383 272776 205981 220700 105875 235588 207183 157442 161193 66705 98133 219373
18016 219373 231682 182024 158693 56434 -65106 14238 80892 58371 102519 310423 404389
18005 404389 234638 295241 355722 369998 102641 166047 290838 313673 375278 328338 -28995
17994 -28995 -49426 105313 -3952 -40544 32778 12993 -25217 -92572 -31633 8468 52389
17983 52389 -16514 29644 346609 379608 253478 228000 214557 159717 -876 51968 382018
17972 382018 573235 482954 397989 381570 432207 197321 62502 83268 31208 -4592 23299
$$ packed form
18047B33404J13334J66356q2900l10109o8215L5682N5213J03963j94923R7479
18037A49284J37103k3644j27308k7346j02121j00926k1493J20154J3444J43236
18027A60383J12393o6795J4719j14825J29713k8405m9741L751r4488L1428J21240
18016B19373J2309m9658k3331j02259j21540P9344O6654k2521M4148K07904R3966
18005D04389j69751O0603O0481J4276k67357O3406J24791K2835O1605m6940l57333
17994b8995k0431J54739j09265l6592P3322j9785l8210o7355O0939M0101M3921
17983E2389o8903M6158L16965L2999j26130k5478j3443n4840j60593N2844L30050
17972C82018J91217r0281q4965j6419N0637k34886j34819K0766n2060l5800K7891
$$ plain form
17961 23299 -61463 9366 -53894 -178157 -114128 -140233 -100382 90946 -62168 37992 83145
17950 83145 68236 -142923 -182883 -210916 -248148 -216718 30312 173279 178105 237699 351931
17939 351931 206275 52649 18478 115304 104164 123789 47098 41099 -16388 -134976 321
17928 321 167149 225810 354034 328167 166522 -45534 -138657 -154830 -87252 62714 152710
17917 152710 237861 135826 67358 14488 -59738 -123328 -150969 -198280 -178764 -80411 -104407
17906 -104407 -1017 -102623 -166780 -92459 220716 142917 231979 171935 157842 99011 375856
17895 375856 407679 117864 122731 98772 -114697 -225129 -172671 -123519 57046 71842 -42999
17884 -42999 -274186 -403879 -347661 -258815 -199340 -33699 15501 -73398 553 -52719 -224915
$$ packed form
17961B3299q4762P0829o3260j24263O4029k6105L9851J91328j53114J00160M5153
17950H3145j4909k11159l9960k8033l7232L1430K47030J42967M826N9594J14232
17939C51931j45656j53626l4171R6826j1140J9625p6691n999n7487j18588J35297
17928C21J66828N8661J28224k5867j61645k12056r3123j6173O7578J49966Q9996
17917A52710Q5151j02035o8468n2870p4226o3590k7641m7311J9516R8353k3996
17906a04407J03390j01606o4157P4321L13175p7799Q9062o0044j4093n8831K76845
17895C75856L1823k89815M867k3959k13469j10432N2458M9152J80565J4796j14841
17884d2999k31187j29693N6218Q8846N9475J65641M9200q8899P3951n3272j72196
$$ plain form
17873 -224915 -303032 -174018 -103897 -191266 -333290 -259553 -178527 -315696 -426087 -257882
17863 -257882 -259526 -125295 45943 -106030 -314377 -296638 -243764 -32406 86329 186261
17853 186261 124342 72895 -9154 -223374 -378800 -292937 -208033 -20888 102320 83865 209811
17842 209811 226141 33192 -16166 -74011 -101519 -133959 -112086 107413 230754 38314 -175938
17831 -175938 -205439 29218 -11002 -35649 -163322 -241615 -25823 -39274 -178248 -140170 -27984
17820 -27984 -6624 -47995 -129075 -324553 -234115 -216289 -262887 -59249 38438 124114 94036
17809 94036 180552 138183 217289 77207 14414 -35607 -201 -84336 -145648 -78148 -81880 -197022
17797 -197022 -107704 -104111 -79587 49708 244150 398981 320801 124487 -14244 -143256
$$ packed form
17873b24915p8117J29014P0121q7369j42024P3737Q1026j37169j10391J68205
17863b57882j644J34231J71238j51973k08347J7739N2874K11358J18735R9932
17853A86261o1919n1447q2049k14220j55426Q5863Q4904J87145J23208j8455J25946
17842B09811J6330j92949m9358n7845k7508l2440K1873K19499J23341j92440k14252
17831a75938k9501K34657m0220k4647j27673p8293K15792j3451j38974L8078J12186
17820b7984K1360m1371q1080j95478R0438J7826m6598K03638R7687Q5676l0078
17809I4036Q6516m2369P9106j40082o2793n0021L5406q4135o1312O7500l732j15142
17797a97022Q9318L593K4524J29295J94442J54831p8180j96314j38731j29012
$$ plain form
17787 -143256 -189648 -45722 160453 161973 185498 179806 115335 139030 62049 -9551 27881
17776 27881 77915 8614 -40116 -175046 -281002 -368674 -240465 -105237 -127254 33643 58087
17765 58087 61259 40839 87073 165398 64344 -187114 -264518 -256438 -149739 48492 193027
17754 193027 218278 220757 -28869 -151200 -120025 -40457 -68142 -40161 -170828 -127531 3380
17743 3380 30205 125125 120394 61548 -45283 417 -105341 -252607 -306894 -60471 43754
17732 43754 66311 95993 -41926 -170851 -127949 -107871 -70727 2284 39039 122778 244813
17721 244813 137310 64632 95900 122452 104029 -76184 -160467 -271665 -240516 -190281 -108062
17710 -108062 -129279 -20440 42736 -40675 -12367 201991 253082 33950 91726 220273 160503
$$ packed form
17787a43256m6392J43926K06175J520K3525n692o4471K3695p6981p1600L7432
17776B7881N0034o9301m8730j34930j05956q7672J28209J35228k2017J60897K4444
17765E8087L172k0420M6234P8325j01054k51458p7404Q080J06699J98231J44535
17754A93027K5251K479k49626j22331L1175P9568k7685K7981j30667M3297J30911
17743C380K6825R4920m731n8846j06831M5700j05758j47266n4287K46423J04225
17732D3754K2557K9682j37919j28925M2902K0078L7144P3011L6755Q3739J22035
17721B44813j07503p2678L1268K6552j8423j80213q4283j11198L1149N0235Q2219
17710a08062k1217J08839O3176q3411K8308K14358N1091k19132N7776J28547n9770
$$ plain form
17699 160503 -21597 -262651 -221515 -193887 -272011 -13934 19358 -10072 -61809 1958 -111592
17688 -111592 -216829 -232332 -130100 81581 229378 238778 217138 282869 357535 340257 280110
17677 280110 182512 152333 -64835 -242411 -206500 -122998 84946 239712 129329 142275
17667 142275 242097 79482 -104422 -282007 -308800 -267017 -122825 8545 83877 74931 117541
17656 117541 88013 45627 65382 260989 115016 91264 -74116 -153172 -103052 -101240 -226092
17645 -226092 -412133 -454708 -223736 -171435 -225081 -200155 -110149 -103829 -305383 -301602 18609
17634 18609 160398 149050 60003 -142973 -84441 24099 159001 149822 -91875 -161822 -14898
17623 -14898 155082 136872 61906 79793 224650 230474 287262 202286 -80436 -282094 -314337
$$ packed form
17699A60503j82100k41054M1136K7628p8124K58077L3292k9430n1737O3767j13550
17688a11592j05237j5503J02232K11681J47797R400k1640O5731P4666j7278o0147
17677B80110r7598l0179k17168j77576L5911Q3502K07944J54766j10383J2946
17667A42275R9822j62615j83904j77585k6793M1783J44192J31370P5332q946M2610
17656A17541k9528m2386J9755J95607j45973k3752j65380p9056N0120J812j24852
17645b26092j86041m2575K30972N2301n3646K4926R0006O320k01554L781L20211
17634A8609J41789j1348q9047k02976N8532J08540J34902r179k41697o9947J46924
17623a4898J69980j8210p4966J7887J44857N824N6788q4976k82722k01658l2243
$$ plain form
17612 -314337 -79206 -27676 -22671 111592 252324 65635 -35110 -31735 6968 -151757 -85731
17601 -85731 -77326 -41562 107470 176681 54766 -149568 -303159 -330924 -174445 -33198 31272
17590 31272 -21240 -49148 -139302 -128710 -91097 -18290 35617 86592 125172 128314 219521 62317
17578 62317 -12537 -68192 -71345 -193665 -207599 -26386 -100172 -125863 37711 -52767 -220516
17567 -220516 -140002 -3786 80802 50820 77523 75151 139771 65305 120716 172970 162237
17556 162237 169266 218049 184838 165398 103245 46339 154242 151707 141366 86317 -125780
17545 -125780 -168288 -189205 48493 45712 -8573 -104650 -63188 143546 255696 169539 157612
17534 157612 356178 338892 192239 -114428 -181497 -155703 54223 249160 132162 -6453
$$ packed form
17612c14337K35131N1530N005J34263J40732j86689j00745L375L8703j58725O6026
17601h5731Q405L5764J49032O9211j21915k04334j53591k7765J56479J41247O4470
17590C1272n2512k7908r0154J0592L7613P2807N3907N0975L8580L142R1207j57204
17578F2317p4854n5655l153j22320j3934J81213p3786k5691J63574r0478j67749
17567b20516Q0514J36216Q4588k9982K6703k372O4620p4466N5411N2254j0733
17556A62237P029M8783l3211j9440o2153n6906J07903k535j0341n5049k12097
17545a25780m2508k0917K37698k781n4285r6077M1462K06734J12150q6157j1927
17534A57612J98566j7286j46653l06667o7069K5794K09926J94937j16998j38615
$$ plain form
17524 -6453 -137436 -300187 -287357 -142532 7220 -40262 -28712 21253 -35449 39801 -15145
17513 -15145 21974 69929 98406 42699 106185 -36166 -152851 -192300 -103417 58024 127100
17502 127100 129012 40238 193480 145151 35225 23976 -189919 -70589 30693 -49579 -290003
17491 -290003 -438789 -193437 73520 139338 76022 3288 -59434 -51662 -35071 -103486 -189385
17480 -189385 -145206 -190314 -86074 70597 30776 -62686 -8656 138988 108388 66830 -59603
17469 -59603 -258883 -116096 69310 37776 -8833 -38580 93255 143694 -116485 -159620 -67490
17458 -67490 83840 187311 231317 80284 97106 239303 189301 191999 110278 163971 270409
17447 270409 284553 580772 918735 1439691 1955271 2038221 1400814 662231 370946 286161
$$ packed form
17524f453j30983j62751J2830J44825J49752m7482J1550M9965n6702P5250n4946
17513a5145L7119M7955K8477n5707O3486j42351j16685l9449Q8883J61441O9076
17502A27100J912q8774J53242m8329j09926j1249k13895J19330J01282q0272k40424
17491b90003j48786K45352K66957O5818o3316p2734o2722P772J6591o8415q5899
17480a89385M4179m5108J04240J56671l9821r3462N4030J47644l0600m1558j26433
17469e9603j99280J42787J85406l1534m6609k9747J31835N0439k60179m3135R2130
17458f7490J51330J03471M4006j51033J6822J42197n0002K698q1721N3693J06438
17447B70409J4144K96219L37963N20956N15580Q2950o37407p38583k91285q4785
$$ plain form
17437 286161 209361 123564 4762 15726 81783 34341 28936 -9570 77051 78359 -29881
17426 -29881 -85639 14215 24166 163546 247893 136166 -80071 -184754 -357206 -393161 -390025
17415 -390025 -205821 -172626 -254086 -160947 -253240 -247288 -313322 -331190 -289978 -109585 189538
17404 189538 400519 329023 111712 -131903 -277549 -259207 45955 86980 92866 150075 94690
17393 94690 -82747 -239698 -198377 -145047 -103192 -62626 -54293 -50295 116504 194681 33160
17382 33160 -45335 48481 -133451 -234144 -55336 4552 21264 85649 547 -153604 -156238
17371 -156238 -228346 -216692 -54704 106838 18489 -10036 37678 -8136 61241 190542 257572
17360 257572 299841 188178 112355 189617 109488 -50419 -43650 -2376 -40228 -20461 -30612
$$ packed form
17437B86161p6800q5797j18802J0964O6057m7442n405l8506Q6621J308j08240
17426b9881n5758R9854R951J39380Q4347j11727k16237j04683j72452l5955L136
17415c90025J84204L3195q1460R3139r2293N952o6034j7868M1212J80393K99123
17404A89538K10981p1496k17311k43615j45646J8342L05162M1025N886N7209n5385
17393I4690j77437j56951M1321N3330M1855M0566Q333L998J66799P8177j61521
17382C3160p8495R3816j81932j00693J78808N9888J6712O4385q5102j54151k634
17371a56238p2108J1654J61988J61542q8349k8525M7714m5814O9377J29301O7030
17360B57572M2269j11663p5823P7262q0129j59907O769M1274l7852J9767j0151
$$ plain form
17349 -30612 -69597 -127202 -8141 169160 -32214 -165573 -191319 -172390 -240595 -175829 -92475
17338 -92475 -126098 -123194 -23762 84470 128733 42612 53857 -141505 -394221 -352753 -322351
17327 -322351 -257680 -141208 -154871 50107 84918 7337 -148137 -119264 -61456 -89238 -206266
17316 -206266 -244959 -112528 31964 78664 30784 -147549 -171155 -124047 -37930 180908 244188
17305 244188 228447 218096 97088 -9781 24630 -13966 52227 -53535 -92017 -133551 9487
17294 9487 139035 247097 177198 -25069 51617 118830 123137 144966 274060 364722 241534
17283 241534 96998 200214 40642 -65128 -89239 -105246 -37242 -39287 -131815 -170059 -89328
17272 -89328 -49332 -113895 -187281 -219845 -262138 -384457 -346152 -262906 -296568 -250501 -261932
$$ packed form
17349c0612l8985n7605J19061J77301k01374j33359k5746J8929o8205O4766Q3354
17338i2475l3623K904R9432J08232M4263q6121J1245j95362k52716M1468L0402
17327c22351O4671J16472j3663K04978L4811p7581j55474K8873N7808k7782j17028
17316b06266l8693J32431J44492M6700m7880j78333k3606M7108Q6117K18838O3280
17305B44188j5741j0351j21008j06869L4411l8596O6193j05762l8482m1534J43038
17294I487J29548J08062o9899k02267P6686O7213M307K1829J29094R0662j23188
17283B41534j44536J03216j59572j05770k4111j6007O8004k045r2528l8244Q0731
17272h9328L9996o4563p3386l2564m2293j22319L8305Q3246l3662M6067j1431
$$ plain form
17261 -261932 -165253 -170159 -202075 -198584 -309614 -411487 -491219 -250428 -80950 -158531 -138909
17250 -138909 -36405 -137651 -66932 -18702 -37577 -21328 -87995 -115901 15822 82684 169071
17239 169071 135696 167047 142540 69478 16206 134688 236694 188741 105649 61403 -27589
17228 -27589 24429 -50970 -154341 -163083 -21384 -50566 824 -49607 -165814 -54060 -62073
17217 -62073 -100740 -118635 -159424 -36945 35379 52491 103862 100454 70011 -117674 -197258
17206 -197258 -147964 -132287 88444 255709 74971 36844 42062 150331 251392 258619 296090
17195 296090 76119 -4932 108317 175646 -11733 -135754 -285483 -455486 -380641 -212571
17185 -212571 -15842 181803 177895 86745 255761 172788 -8791 -32248 -124867 -172286 -195075
$$ packed form
17261b61932R6679m906l1916L491j11030j01873p9732K40791J69478p7581J9622
17250a38909J02504j01246P0719M8230j8875J6249o6667k7906J31723O6862Q6387
17239A69071l3375L1351k4507p3062n3272J18482J02006m7953q3092m4246q8992
17228b7589N2018p5399j03371q742J41699k9182N1390n0431j16207J11754q013
17217f2073l8667j7895m0789J22479P2324J7112N1371l408l0443j87685p9584
17206a97258M9294J5677K20731J67265j80738l8127N218J08269J01061P227L7471
17195B96090k19971q1051J13249O7329j87379j24021j49729j70003P4845J68070
17185b12571J96729J97645l908r1150J69016q2973j81579k3457r2619m7419k2789
$$ plain form
17174 -195075 -130329 -111249 -70172 -10490 63140 55695 56520 61133 41634 28397 -255504 -416314
17162 -416314 -328924 -217420 -44981 24017 -101319 -130192 -116919 96702 13122 -157518
17152 -157518 -162961 -74186 -65850 -45246 -96329 16380 4460 -179253 35255 111276 -98967
17141 -98967 -102678 -43997 -138955 -331064 -285293 -168263 25245 111376 -61590 -218547 -145513
17130 -145513 -4458 -17976 -21946 -115909 -95313 -110682 -25626 12564 -89779 -109100 41841
17119 41841 33817 -38986 -53864 -54695 -147869 -111279 -195083 -383804 -283880 -146777 -146155 -344538
17107 -344538 -311075 -144662 -39916 -8156 31269 101491 -37948 -116557 -194792 -198022 -237684
17096 -237684 -69311 70953 82748 127483 25058 -96474 -171552 -220659 -292211 -136422
$$ packed form
17174a95075O4746J9080M1077N9682P3630p445Q25M613j9499j3237k83901j60810
17162d16314Q7390J11504J72439O8998j25336k8873J3273K13621q3580j70640
17152a57518n443Q8775Q336K0604n1083J12709j1920j83713K14508P6021k10243
17141i8967l711N8681r4958j92109M5771J17030J93508Q6131j72966j56957P3034
17130a45513J41055j3518l970r3963K0596j5369Q5056L8190j02343j9321J50941
17119D1841q024p2803j4878q31r3174L6590q3804j88721R9924J37103O22j98383
17107c44538L3463J66413J04746L1760L9425P0222j39439p8609p8235l230l9662
17096b37684J68373J40264J1795M4735j02425j21532p5078m9107p1552J55789
$$ plain form
17086 -136422 -22356 105468 303566 330916 304163 112628 100102 101208 112643 196960 244873
17075 244873 199988 43434 -26948 36601 155103 165063 59229 115180 28808 -44688 -79993
17064 -79993 -52026 92989 80782 34326 67977 164286 127535 34349 -40133 -108799 -258279
17053 -258279 -225216 -26116 82070 50254 18425 33378 100012 115279 -16360 -137139 -54341
17042 -54341 -50763 -178822 -87214 -110204 -118599 -150276 -75094 -53602 22844 100818 144686 111987
17030 111987 -174804 -21331 -26442 -43864 67858 236525 182424 194954 131757 120698 17591
17019 17591 -3460 -46309 -44219 -60477 40355 -57594 -116574 -101218 -81479 -13705 40250 122715
17007 122715 109499 68171 112970 126165 44916 -72230 -98969 -129495 -167068 -206504 -185852
$$ packed form
17086a36422J14066J27824J98098K7350k6753j91535j2526J106J1435Q4317M7913
17075B44873m4885j56554p0382O3549J18502R960j05834N5951q6372p3496l5305
17064g9993K7967J45015j2207m6456L3651R6309l6751r3186p4482o8666j49480
17053b58279L3063J99100J08186l1816l1829J4953O6634J5267j31639j20779Q2798
17042e4341L578j28059R1608k2990q395l1677P5182K1492P6446P7974M3868l2699
17030A11987k86791J53473n111j7422J11722J68667n4101J2530o3197j1059j03107
17019A7591k1051m2849K090j6258J00832r7949n8980J5356J9739O7774N3955Q2465
17007A22715j3216m1328M4799J3195q1249j17146k6739l0526l7573l9436K0652
$$ plain form
16996 -185852 -256320 -263949 -81348 -186229 -316040 -287817 -169651 -186337 -126074 -120217 -50157
16985 -50157 24035 126396 172752 183773 206746 88064 -82697 -59944 104168 167120 16860
16974 16860 -7038 -68975 32694 126993 113930 94533 -40053 -78492 -121821 -137490 14862
16963 14862 -39387 -70181 -45701 -27506 53828 135331 180839 28935 -73396 -13003 -103583
16952 -103583 -52757 -95881 -178501 -63074 23239 69254 -18251 -56057 -92322 15293 52782
16941 52782 -59280 -20561 76764 -130119 -226198 -198540 -406493 -474075 -64692 131208 15784
16930 15784 60979 -104439 -109524 -176571 -242600 -378983 -420719 -410187 -325798 -325762 -169577 -15333
16918 -15333 -146672 -371350 -232954 -167038 -158616 -227491 -187566 -137073 -46105 -23081 88570
$$ packed form
16996a85852p0468p629J82601j04881j29811K8223J18166j6686O0263N857P0060
16985e0157P4192J02361M6356J1021K2973j18682j70761K2753J64112O2952j50260
16974A6860k3898o1937J01669R4299j3063j9397j34586l8439m3329j5669J52352
16963A4862n4249l0794K4480J8195Q1334Q1503M5508j51904j02331O0393r0580
16952a03583N0826m3124q2620J15427Q6313M6015q7505l7806l6265J07615L7489
16941E2782j12062L8719R7325k06883r6079K7658k07953o7582M09383J95900j15424
16930A5784M5195j65418n085o7047o6029j36383m1736J0532Q4389L6J56185J54244
16918a5333j31339k24678J38396O5916Q422o8875L9925N0493R0968K3024J11651
$$ plain form
16907 88570 127201 147213 144622 124317 63039 8226 -143158 -99367 -71251 -84100 -56681 -142235
16895 -142235 -128241 -20072 -132715 -28915 4034 72158 180445 56940 -34536 -73328
16885 -73328 -105280 -71820 44288 61171 179805 70967 33740 -3347 -72465 48809 54084
16874 54084 80069 94205 12965 -127766 -157498 -54980 -26579 -72671 -183498 -78159 -21991
16863 -21991 -184540 -97710 -32601 -119561 -124942 -203557 -165341 -81692 -64739 -98826 -91401 -44777
16851 -44777 -74980 -68991 -8 196511 263001 -16795 -117822 -93838 -85571 -105708 66475
16840 66475 143430 -45933 -84628 55966 250492 160404 -121157 -32507 29789 7421 -40336
16829 -40336 -75980 -647 25670 -3507 115226 107698 18823 -27858 -26909 -177793 -172078 -160777
$$ packed form
16907H8570L8631K0012k591k0305o1278n4813j51384M3791K8116j2849K7419q5554
16895a42235J3994J08169j12643J03800L2949O8124J08287j23505r1476l8792
16885g3328l1952L3460J16108J6883J18634j08838l7227l7087o9118J21274N275
16874E4084K5985J4136q1240j40731k9732J02518K8401m6092j10827J05339N6168
16863b1991j62549Q6830O5109q6960n381p8615L8216Q3649J6953l4087P425M6624
16851d4777l0203N989O8983J96519O6490k79796j01027K3984Q267k0137J72183
16840F6475P6955j89363l8695J40594J94526r0088k81561Q8650O2296k2368m7757
16829d0336l5644P5333K6317k9177J18733p528q8875m6681R49j50884N715J1301
$$ plain form
16817 -160777 30315 -29580 33043 128408 133092 57835 -35130 54404 45440 10324 -67400 -157660
16805 -157660 -350864 -202424 26534 111962 -107510 -150335 -37466 -102564 -183705 -42180
16795 -42180 -22195 -27543 -164875 -271841 -235632 -106941 -57599 -17305 49374 32062 -35031
16784 -35031 -105533 -152502 -121241 -227584 -253858 -192454 -49004 81711 31810 -51027 -109813
16773 -109813 -72783 -119058 -217369 -119151 16959 -31848 -144076 -188031 -235727 -321855 -263256
16762 -263256 -218472 -64388 -37051 -171966 -282105 -224314 -65871 -191481 -253779 -259328 -166112
16751 -166112 -87576 -157368 -175436 -83268 -161770 -276240 -296281 -175153 -159221 -143775 -161895
16740 -161895 -219066 -163800 56574 135966 -4982 -147260 -53465 19105 21717 83048 166444
$$ packed form
16817a60777J91092n9895O2623R5365M684p5257r2965Q9534q964l5116p7724r0260
16805a57660j93204J48440K28958Q5428k19472m2825J12869o5098q1141J41525
16795d2180J9985n348j37332j06966L6209J28691M9342M0294O6679j7312o7093
16784c5031p0502m6969L1261j06343k6274O1404J43450J30715m9901q2837n8786
16773a09813L7030m6275r8311R8218J36110m8807j12228m3955m7696q6128N8599
16762b63256M4784J54084K7337j34915j10139N7791J58443j25610o2298n549R3216
16751a66112P8536o9792j8068R2168p8502j14470k0041J21128J5932J5446j8120
16740a61895n7171N5266K20374P9392j40948j42278R3795P2570K612O1331Q3396
$$ plain form
16729 166444 276627 136578 -60326 -82500 120154 212839 77031 -164534 -2952 169784
16719 169784 144451 137147 223304 -6505 -125412 -156538 -323132 -415469 -298033 -40184 -37822
16708 -37822 -120276 -269331 -192975 -103091 73533 47424 21117 75882 154955 182711 101978
16697 101978 2199 -82664 -145062 -350295 -249564 25049 -45417 -50462 -41681 -127793 -64371
16686 -64371 -28773 -138821 -71696 -98796 -125006 -62674 23772 64706 -93304 -123483 83734
16675 83734 54666 10393 -26236 199902 247782 318751 144822 -20000 -119784 -18557 23482
16664 23482 3892 55172 130922 72314 -41743 -211975 -125096 10799 70987 16471 -86622
16653 -86622 95843 262643 242764 118953 204458 325340 197862 35486 -31927 67550
$$ packed form
16729A66444J10183j40049j96904k2174K02654R2685j35808k41565J61582J72736
16719A69784k5333p304Q6157k29809j18907l1126j66594r2337J17436K57849K362
16708c7822q2454j49055P6356Q9884J76624k6109k6307N4765P9073K7756q0733
16697A01978r9779q4863o2398k05233J00731K74613p0466n045Q781q6112O3422
16686f4371L5598j10048O7125k7100k6210O2332Q6446M0934j58010l0179K07217
16675H3734k9068m4273l6629K26138M7880P0969j73929j64822r9784J01227M2039
16664B3482j9590N1280P5750n8608j14057j70232Q6879J35895O0188n4516j03093
16653h6622J82465J66800j9879j23811Q5505J20882j27478j62376o7413R9477
$$ plain form
16643 67550 -20169 18328 -79992 -89502 -91078 150103 158929 29397 -136666 -180580 -193445 -87621
16631 -87621 107779 73348 76606 101546 246535 30984 -20969 -54028 -40566 85209 99989
16620 99989 50042 -136478 -160200 -142293 23838 142635 90977 -108350 -178996 -208246 -161085
16609 -161085 -62980 -105352 -36848 2292 -58075 -153700 -19698 174098 66257 101428 111175
16598 111175 212598 146715 -80773 -196002 -34783 37468 -107523 -117396 69906 204918
16588 204918 68385 21583 82486 -43340 -71803 435 101789 110430 64213 45963 31776
16577 31776 44712 -18065 136878 217266 139448 213338 233890 35742 -37151 -77100 -182435
16566 -182435 -152996 33239 10273 -201255 -196251 -116729 -143723 -177758 -209879 -134576 -157984
$$ packed form
16643F7550q7719L8497r8320r510j576K41181Q826j29532j66063m3914j2865J05824
16631h7621J95400l4431L258K4940J44989k15551n1953l3059J3462J25775J4780
16620I9989m9947j86520k3722J7907J66131J18797n1658j99327p0646k9250M7161
16609a61085R8105m2372O8504L9140o0367r5625J34002J93796j07841L5171R747
16598A11175J01423o5883k27488j15229J61219P2251j44991r873J87302J35012
16588B04918j36533m6802O0903j25826k8463P2238J01354Q641m6217j8250j4187
16577C1776J2936o2777J54943Q0388p7818P3890K0552j98148p2893l9949j05335
16566a82435K9439J86235k2966k11528N004P9522k6994l4035l2121P5303k3408
$$ plain form
16555 -157984 -406413 -419354 -280070 -163237 -125590 -69680 -231634 -188499 -36639 11957
16545 11957 152256 216319 167616 146988 122507 148611 221620 96727 25555 28703 170861
16534 170861 -48074 -72682 70640 202777 181978 114623 98760 126876 15006 130461
16524 130461 167503 99464 -90449 -318550 -474038 -362958 -156833 -142632 -130727 88378
16514 88378 -123913 -96195 54303 -144174 -233336 -231631 -247659 -182832 -52636 71219 149453
16503 149453 136414 137436 21509 -37201 -14025 7028 -28032 -26146 75299 107132 22334
16492 22334 17093 -37948 -29565 10771 22687 -142090 -160633 48892 48583 -71297 -110288 -269310
16480 -269310 -232442 -1553 57124 -132684 -178570 -153083 75496 252178 182647 91124 -25429
$$ packed form
16555a57984k48429j2941J39284J16833L7647N5910j61954M3135J51860M8596
16545A1957J40299O4063m8703k0628k4481K6104P3009j24893p1172L148J42158
16534A70861k18935k4608J43322J32137k0799o7355j5863K8116j11870J15455
16524A30461L7042o8039j89913k28101j55488J11080K06125J4201J1905K19105
16514H8378k12291K7718J50498j98477q9162J705j6028O4827J30196J23855P8234
16503A49453j3039J022j15927n8710K3176K1053l5060J886J01445L1833q4798
16492B2334n241n5041Q383M0336J1916j64777j8543K09525l09j19880l8991j59022
16480b69310L6868K30889N8677j89808m5886K5487K28579J76682o9531r1523j16553
$$ plain form
16469 -25429 -130151 68053 191951 237525 242073 39584 57264 104827 165122 217152 334097
16458 334097 320415 381895 347584 221071 249360 252357 248741 -37924 -81175 66690 59535
16447 59535 -129009 -207982 -146165 -139813 -179303 -3043 113524 150229 110438 -55138 -90983
16436 -90983 -219465 -336903 -287444 -2723 11440 -127772 -62122 22674 -36493 -48836 -289825
16425 -289825 -215574 -93294 -12435 -36105 -91261 -228663 -230888 -237412 -133951 -108031 -182404
16414 -182404 -144119 -221745 -320007 -312511 -110967 -258770 -293220 -206992 -159429 -210897 -258965
16403 -258965 -313596 -268432 -185078 -33897 -84431 -175222 -234666 -233909 -115485 -145623 -198178
16392 -198178 -181369 -126143 -41054 -63944 -80093 -203611 -256943 -39385 166968 199532 10464
$$ packed form
16469b5429j04722J98204J23898M5574M548k02489J7680M7563O0295N2030J16945
16458C34097j3682O1480l4311j26513K8289K997l616k86665m3251J47865p155
16447E9535j88544p8973O1817O352l9490J76260J16567L6705l9791j65576l5845
16436i0983j28482j17438M9459K84721J4163j39212O5650Q4796n9167j2343k40989
16425b89825P4251J22280Q0859k3670n5156j37402k225o524J03461K5920p4373
16414a82404L8285p7626r8262P496K01544j47803l4450Q6228M7563n1468m8068
16403b58965n4631M5164Q3354J51181n0534r0791n9444P57J18424l0138n2555
16392a98178J6809N5226Q5089k2890j6149j23518n3332K17558K06353L2564j89068
$$ plain form
16381 10464 -80291 -8876 35956 71700 143821 92341 109689 -87427 -147990 -64936 -64108 44258
16369 44258 56079 61780 -80983 -198706 -222723 210 254963 322197 238729 3698 -166216
16358 -166216 -155075 -15711 33811 38467 6306 21011 75296 226724 373167 374477 147208
16347 147208 43806 -16715 24215 44219 41135 119038 82931 -17829 -86930 -94164 -110401
16336 -110401 -85699 -166196 -200443 -34049 101516 39145 -251489 -342021 -195476 -78065
16326 -78065 -105848 -42598 -87502 -157857 -221783 -166638 34538 171766 132599 -82993 -245121
16315 -245121 -226295 -284580 -339059 -315635 -90737 99447 205090 -31443 -109832 -53723 -191069
16304 -191069 -154318 23379 34333 135584 120904 -44199 78622 115327 236138 154086
$$ packed form
16381A0464r0755P1415M4832L5744P2121n1480J7348j97116o0563Q3054Q28J08366
16369D4258J1821N701j42763j17723k4017K22933K54753O7234q3468k35031j69914
16358a66216J1141J39364M9522M656l2161J4705N4285J51428J46443J310k27269
16347A47208j03402o0521M0930K0004l084P7903l6107j00760o9101p234j6237
16336a10401K4702q0497l4247J66394J35565o2371k90634r0532J46545J17411
16326g8065k7783O3250m4904p0355o3926N5145K01176J37228l9167k15592j62128
16315b45121J8826n8285n4479K3424K24898J90184J05643k36533p8389N6109j37346
16304a91069L6751J77697J0954J01251j4680j65103J22821L6705J20811q2052
$$ plain form
16294 154086 122910 174320 129479 79806 -24820 -45765 -50039 98138 144567 192652 223524
16283 223524 236978 201196 231687 161978 -140772 -230673 -118893 -173084 -167848 1473 190225
16272 190225 209256 72025 -73825 69940 289957 424710 264926 86036 71827 65313
16262 65313 -57970 43334 77208 120359 107736 -8384 -9409 -92439 -89380 136180 171877
16251 171877 84636 37904 31258 -10584 32498 201438 278993 143221 78210 28862 -31367
16240 -31367 -23251 -179893 -203287 -240407 -234916 -198417 -178864 -102522 -123188 -107293 -222070 -2358
16228 -2358 136869 10369 -23355 113150 214388 199854 193130 124767 115890 196570 149394
16217 149394 53830 185767 55963 57097 -42619 -101083 -49735 -194994 -135170 47693 96942
$$ packed form
16294A54086l1176N1410m4841m9673j04626k0945m274J48177M6429M8085L0872
16283B23524J3454l5782L0491o9709l02750q9901J11780n4191N236J69321J88752
16272A90225J9031j37231j45850J43765K20017J34753j59784j78890j4209o514
16262F5313j23283J01304L3874M3151j2623j16120j025q3030L059K25560L5697
16251A71877q7241m6732o646m1842M3082J68940P7555j35772o5011m9348o0229
16240c1367Q116j56642k3394l7120N491L6499J9553P6342k0666J5895j14777K19712
16228b358J39227j26500l3724J36505J01238j4534o724o8363q877Q0680m7176
16217A49394r5564J31937j29804J134r9716n8464N1348j45259N9824J82863M9249
$$ plain form
16206 96942 106210 52907 409 -65544 91888 155305 153943 49058 68941 973 -85520 -51220
16194 -51220 99182 -53965 -213864 -243488 -133353 49613 85569 201153 179342 -10046
16184 -10046 11332 42324 20030 27557 55358 109442 109656 28124 -195479 -43321 -4933 28408
16172 28408 82973 16633 -38203 -39179 -45063 6412 11985 -114070 -94838 17531 155653 -29316
16160 -29316 -34321 119955 271716 193482 84539 74599 62682 -188014 -132889 -135195 -218511
16149 -218511 -54688 -52673 -6417 -2757 144107 102505 111096 241369 244835 54495 -146556
16138 -146556 -16403 -26435 58096 31313 91300 184705 229523 177375 267969 298782 336025
16127 336025 229747 218816 171006 59396 -78633 -88956 -102362 -106930 -79893 120970 -71127
$$ packed form
16206I6942R268n3303n2498o5953J57432O3417j362j04885J9883o7968q6493L4300
16194e1220J50402j53147j59899k9624J10135J82966L5956J15584k1811j89388
16184a0046K1378L0992k2294P527K7801N4084K14q1532k23603J52158L8388L3341
16172B8408N4565o6340n4836r76n884N1475N573j26055J9232J12369J38122j84969
16160b9316n005J54276J51761p8234j08943r940j1917k50696N5125k306q3316
16149b18511J63823K015M6256L660J46864m1602Q591J30273L466j90340k01051
16138a46556J30153j0032Q4531k6783N9987R3405M4818n2148R0594L0813L7243
16127C36025j06278j0931m7810j11610j38029j0323j3406m568K7037K00863j92097
$$ plain form
16116 -71127 -55426 -107991 -172459 -176024 -239039 -146672 -15119 2350 -65117 80491 157639
16105 157639 54188 -63019 -123746 -76049 53697 51787 -16680 102317 326487 252671 68401
16094 68401 -49323 -184160 -138066 76326 228090 189504 100608 -90013 -145181 -98261 -147230
16083 -147230 21412 27858 -65729 -129748 -68076 47122 46869 9021 109900 -30892 79
16072 79 114255 178522 146256 242834 103872 -59112 91623 266915 185869 4094 -49333
16061 -49333 55650 14871 -83472 -67278 41146 104204 33918 -163956 -201756 -186801 -149829
16050 -149829 -66159 -20582 -50262 -71742 22736 63406 -48124 -54783 -106781 -37286 64684
16039 64684 27070 330 -49553 -195277 -237991 -193932 -61278 -162205 -292780 -398089 -285370
$$ packed form
16116g1127J5701n2565o4468l565o3015R2367J31553J7469o7467J45608P7148
16105A57639j03451j17207o0727M7697J29746j910o8467J18997K24170p3816j84270
16094F8401j17724j34837M6094K14392J51764l8586q8896j90621n5168M6920m8969
16083a47230J68642O446r3587o4019O1672J15198k53l7848J00879j40792L0971
16072G9J14176O4267l2266R6578j38962j62984J50735J75292q1046j81775n3427
16061d9333J04983m0779r8343J6194J08424O3058p0286j97874l7800J4955L6972
16050a49829Q3670M5577k9680k1480R4478M0670j11530o659n1998O9495J01970
16039F4684l7614k6740m9883j45724m2714M4059J32654j00927j30575j05309J12719
$$ plain form
16028 -285370 -349829 -136348 110578 133460 218646 221975 117243 -18077 -124728 -76476 -288858
16017 -288858 -406912 -307094 -117565 2793 -143040 -212558 -4186 155475 234258 145167
16007 145167 44425 -82560 56474 153550 120255 127972 39077 -10733 -49832 139809 275282
15996 275282 144701 39572 -94534 18140 143677 118431 209876 184234 34306 -93395
15986 -93395 5555 44864 -9989 -24391 -70143 -129067 48025 153623 131512 13384 -14716
15975 -14716 -297 28498 -31631 -88440 -40106 25292 -54526 -68078 54046 286223 305107
15964 305107 107129 -25219 -391 -109324 -253104 -120836 -185359 -207479 41116 278320
15954 278320 394539 286047 245160 186724 -65143 -230903 -172528 -44280 -46754 -66045 -7392
$$ packed form
16028b85370o4459K13481K46926K2882Q5186L329j04732j35320j06651M8252k12382
16017b88858j18054R9818J89529J20358j45833o9518K08372J59661P8783q9091
16007A45167j00742j26985J39034R7076l3295P717q8895m9810l9099J89641J35473
15996B75282j30581j05129j34106J12674J25537k5246R1445k5642j49928j27701
15986i3395R8950L9309n4853j4402m5752n8924J77092J05598k2111j18128k8100
15975a4716J4419K8795o0129n6809M8334O5398p9818j3552J22124K32177J8884
15964C05107j97978j32348K4828j08933j43780J32268o4523k2120K48595K37204
15954B78320J16219j08492m0887n8436k51867j65760N8375J28248k474j9291N8653
$$ plain form
15943 -7392 -16041 -21918 -125623 -36617 22139 92081 87336 96949 -29436 -86801 -31256 57773
15931 57773 56807 226228 95374 -93757 -18302 -31561 175430 177096 35334 -20215 -43757
15920 -43757 -125807 -259495 -198337 -172290 -164335 -4599 16785 -74333 -171962 -231708 -63545
15909 -63545 -30293 -238210 -333736 -236492 -6860 300817 324334 267162 3921 -68119 -41997
15898 -41997 27661 146696 205361 250646 145264 75978 19756 66789 64766 -44657 -102658
15887 -102658 -169131 -223412 -28896 130290 58054 14597 137236 221557 183430 210023 -4926
15876 -4926 552 146608 163628 73973 69028 -30734 -51962 -146271 -106660 -2199 124337 40708
15864 40708 -11780 18975 -164963 -196121 -144077 -43581 132415 121775 111624 179102 219267
$$ packed form
15943g392q649n877j03705Q9006N8756O9942m745R613j26385n7365N5545Q9029
15931E7773r66J69421j30854j89131P5455j3259K06991J666j41762n5549k3542
15920d3757q2050j33688O1158K6047P955J59736K1384r1118r7629n9746J68163
15909f3545L3252k07917r5526R7244K29632L07677K3517n7172k63241p2040K6122
15898d1997O9658J19035N8665M5285j05382o9286n6222M7033k023j09423n8001
15887a02658o6473n4281J94516J59186p2236m3457J22639Q4321l8127K6593k14949
15876d926N478J46056J7020q9655m945r9762k1228r4309L9611J04461J26536q3629
15864D0708n2488L0755j83938l1158N2044J00496J75996j0640j0151O7478M0165
$$ plain form
15853 219267 126575 -20929 -44234 -121413 -201715 -199921 -182649 -36450 157519 2197 -187102
15842 -187102 -211848 -148567 -50046 -11965 19324 -93810 -123179 -112671 -11649 -94560 -201986
15831 -201986 -271248 -206923 -157443 -17683 23040 110795 133800 51495 -93590 -135287 -250773
15820 -250773 -213591 -29783 17991 22053 -48691 -213444 -127198 -81241 -133449 -171394 -143703
15809 -143703 -123918 -176287 -180298 2800 181745 268959 245061 307926 420386 422578 352760
15798 352760 76856 -96809 -126248 23196 -132926 -136577 73972 70863 38091 83502 114223
15787 114223 28967 -29781 -23500 35201 9753 -193873 -161225 -55360 -40994 -33388 133860
15776 133860 194784 238519 202908 138766 -11773 34055 88922 202765 17747 -114744 -27032
$$ packed form
15853B19267r2692j47504k3305p7179q0302J794J7272J46199J93969j55322j89299
15842a87102k4746O3281R8521L8081L1289j13134k9369J0508J01022q2911j07426
15831b01986o9262O4325M9480J39760M0723Q7755K3005q2305j45085m1697j15486
15820b50773L7182J83808M7774M062p0744j64753Q6246M5957n2208l7945K7691
15809a43703J9785n2369m011J83098J78945Q7214k3898O2865J12460K192o9818
15798C52760k75904j73665k9439J49444j56122l651K10549l109l2772M5411L0721
15787A14223q5256n8748O281N8701k5448k03626L2648J05865J4366P606J67248
15776A33860O0924M3735l5611o4142j50539M5828N4867J13843j85018j32491Q7712
$$ plain form
15765 -27032 128914 200755 171428 137470 40073 48344 228981 365621 410366 285157 284640
15754 284640 458791 325234 122716 234217 158815 128000 -95890 -190951 -266892 -135068
15744 -135068 94455 144582 69447 -106676 -149512 -105432 -76692 -3765 -161825 -255432 -197508
15733 -197508 58475 107478 168219 105668 -166067 -201867 -205176 -106687 -43915 72527 66104
15722 66104 14516 60414 119711 -49746 44835 22417 -14854 -46722 -220445 -408173 -364851
15711 -364851 -148598 -168781 -282432 -137662 -76059 64347 -49679 -79619 33806 65476
15701 65476 -85039 -60163 41899 183226 177844 216945 278276 400691 465542 460265 451208
15690 451208 308543 218703 33124 6728 145551 34283 12399 30188 75424 82140 -14130
$$ packed form
15765b7032J55946P1841k9327l3958r7397Q271J80637J36640M4745j25209n17
15754B84640J74151j33557k02518J11501p5402l0815k23890r5061p5941J31824
15744a35068K29523N0127p5135j76123m2836M4080K8740P2927j58060r3607N7924
15733a97508K55983M9003O0741o2551k71735l5800l309R8489O2772J16442o423
15722F6104n1588M5898N9297j69457R4581k2418l7271l1868j73723j87728M3322
15711c64851K16253k0183j13651J44770O1603J40406j14026k9940J13425L1670
15701F5476j50515K4876J02062J41327n382L9101O1331J22415O4851n277r057
15690D51208j42665q9840j85579k6396J38823j11268k1884J7789M5236O716r6270
$$ plain form
15679 -14130 -62236 -11888 23373 59806 125789 274048 253515 199419 106720 79872 97318
15668 97318 105062 -11564 -144567 -273716 -188260 112969 192477 173106 11458 -114829 -239385
15657 -239385 -268712 -132605 84103 7927 130189 334998 242044 233418 301294 190588 256162
15646 256162 255782 377903 217625 111179 8725 -49921 -14193 -22812 -78811 -28383 -51529
15635 -51529 -256804 -181294 -149271 -129038 -19766 33565 68199 203200 252265 232456 114546
15624 114546 -12926 50518 33784 -179060 -191782 -65919 -37785 117318 180825 160958 179387
15613 179387 171918 174021 116474 69022 186143 187579 170676 143242 -27834 -181806 -177717 -217937
15601 -217937 -38480 138854 327042 411173 301283 177981 66600 -19927 -45215 -33160
$$ packed form
15679a4130m8106N0348L5261L6433O5983J48259k0533n4096r2699k6848J7446
15668I7318P744j16626j33003j29149Q5456L01229P9508j9371j61648j26287j24556
15657b39385k9327J36107K16708p6176J22262K04809r2954q626O7876j10706O5574
15646B56162l80J22121j60278j06446j02454n8646L5728q619n5999N0428k3146
15635e1529k05275P5510L2023K0233J09272N3331L4634J35001M9065j9809j17910
15624A14546j27472O3444j6734k12844j2722J25863K8134J55103O3507j9867J8429
15613A79387p469K103n7547m7452J17121J436j6903k7434j71076j53972M089m0220
15601b17937J79457J77334J88188Q4131j09890j23302j11381q6527k5288J2055
$$ plain form
15591 -33160 150857 -22382 -222982 -3401 8440 211992 410593 429700 348282 130079
15581 130079 73746 -63775 212685 223638 117471 139514 103338 60021 8809 27442 51250
15570 51250 158667 200517 200398 103134 -31905 143612 187352 99807 76435 -24513 -78203
15559 -78203 -7580 96799 221551 260197 306308 377025 408652 158121 182061 284553 236016
15548 236016 159657 148926 269733 304835 422095 460167 342268 346125 114324 -1341 -46786
15537 -46786 -82021 -146786 -182837 -188295 -82037 -88405 -195893 -145084 -112753 -44792 33789 -71684
15525 -71684 -65177 82041 169380 -28087 -54608 -33479 -149326 -147918 -143833 -194575 -179411 -246241
15513 -246241 -426974 -246999 -146093 -179020 -254399 -79725 -173916 -331367 -352320 -244901
$$ packed form
15591c3160J84017j73239k00600K19581J1841K03552J98601J9107q1418k18203
15581A30079n6333j37521K76460J0953j06167K2043l6176m3317n1212J8633K3808
15570E1250J07417M1850j19r7264j35039J75517M3740q7545k3372j00948n3690
15559g8203P0623J04379J24752L8646M6111P0717L1627k50531K3940J02492m8537
15548B36016p6359j0731J20807L5102J17260L8072j17899L857k31801j15665m5445
15537d6786l5235o4765l6051n458J06258o368j07488N0809L2331O7961P8581j05473
15525g1684O507J47218Q7339j97467k6521K1129j15847J408M085n0742J5164o6830
15513b46241j80733J79975J00906l2927p5379J74674r4191j57451k0953J07419
$$ plain form
15503 -244901 -156832 -21386 50941 -82461 -135101 -78837 87782 105053 56842 19045 39542
15492 39542 28925 45263 199370 327859 253213 198067 83679 -25585 -105478 -141059 -74178
15481 -74178 -21780 -51621 -176107 -210702 -64600 73815 104471 98824 39429 50575 55813
15470 55813 -86329 -76322 124598 209689 160811 108443 194666 113740 -5472 -16053 -7835
15459 -7835 -69 19812 44636 79614 126888 179064 207424 128694 -6432 -27348 -94220 -151447
15447 -151447 -13255 45028 47928 31019 66460 -26298 -11309 224092 311166 152793 47402
15436 47402 67272 107670 72212 137674 109618 59830 -135585 -85932 -134281 -33459 65465
15425 65465 77756 90239 143469 220115 164376 153422 221526 192865 -162834 -401432 -446799
$$ packed form
15503b44901Q8069J35446P2327j33402n2640N6264J66619J7271m8211l7797K0497
15492C9542j0617J6338J54107J28489p4646n5146j14388j09264p9893l5581O6881
15481g4178N2398k9841j24486l4595J46102J38415L0656n647n9395J1146N238
15470E5813j42142J0007K00920Q5091m8878n2368Q6223q0926j19212j0581Q218
15459g835P766J9881K4824L4978M7274N2176K8360p8730j35126k0916o6872n7227
15447a51447J38192N8283K900j6909L5441r2758J4989K35401Q7074j58373j05391
15436D7402J9870M0398l5458O5462k8056m9788j95415M9653m8349J00822R8924
15425F5465J2291J2483N3230P6646n5739j0954O8104k8661l55699k38598m5367
$$ plain form
15414 -446799 -304958 -171198 -92847 -219382 -84952 100044 28708 102037 287182 232537
15404 232537 262723 258033 173815 72046 112121 168229 97338 107334 151871 56718 -5405 133357
15392 133357 61150 137427 313920 321184 228184 8248 -80299 -43745 89980 30789 -125633
15381 -125633 -263139 -34844 211977 280312 117816 86729 147376 314930 261940 255898 48813
15370 48813 -22582 -93722 -86057 -86514 -101822 4137 202267 252439 184775 59539 104842 86958
15358 86958 71769 103104 24746 -59080 -181464 -349879 -400716 -191833 -85585 147651 21661
15347 21661 -8304 77134 259566 227558 46618 -2632 -10128 12562 33531 87274 179093
15336 179093 159351 208775 117061 53335 8602 -62020 -49819 -30085 49282 -8543 -50127
$$ packed form
15414d46799J41841J33760P8351j26535J34430J84996p1336P3329J85145n4645
15404B32537L0186m690q4218j01769M0075N6108p0891R996M4537r5153o2123J38762
15392A33357p2207P6277J76493P264r3000k19936q8547L6554J33725n9191j56422
15381a25633j37506K28295K46821O8335j62496l1087O0647J67554n2990o042k07085
15370D8813p1395p1140P665m57j5308J05959J98130N0172o7664j25236M5303j7884
15358H6958j5189L1335p8358q3826j22384j68415n0837K08883J06248K33236j25990
15347B1661k9965Q5438J82432l2008j80940m9250p496K2690K0969N3743R1819
15336A79093j9742M9424r1714o3726m4733p0622J2201J9734P9367n7825m1584
$$ plain form
15325 -50127 -71832 -111231 -126607 -200635 -162526 26891 144525 261782 272772 129695 19792
15314 19792 -59925 -10086 104475 235839 327590 96879 -55497 -6559 97571 -11717
15304 -11717 -156748 -162166 -123024 -83923 73491 118561 -37177 -171021 -223714 26207 88696
15293 88696 111363 28082 34484 91444 -76620 -99975 -63410 -85911 -145693 -95429 -78102 -177802
15281 -177802 -129578 -11249 46775 97299 -16469 33129 113087 -48446 -113291 47642 181742
15270 181742 213923 201134 166867 100077 -151716 -130978 113887 270320 332777 249698 -21542
15259 -21542 11596 90987 130578 385022 349899 171552 90358 -47515 -172567 -186244 -154545
15248 -154545 -74155 -64693 52800 157375 99485 166335 53380 -151118 -43366 144460
$$ packed form
15325e0127k1705l9399j5376p4028L8109J89417J17634J17257J0990j43077j09903
15314A9792p9717M9839J14561J31364R1751k30711j52376M8938J04130j09288
15304a1717j45031n418L9142L9101J57414M5070j55738j33844n2693K49921O2489
15293H8696K2667q3281O402N6960j68064k3355L6565k2501n9782N0264J7327r9700
15281a77802M8224J18329N8024N0524j13768M9598P9958j61533o4845J60933J34100
15270A81742L2181j2789l4267o6790k51793K0738K44865J56433O2457q3079k71240
15259b1542L3138P9391L9591K54444l5123j78347q1194j37873j25052j3677L1699
15248a54545Q0390R462J17493J04575n7890O6850j12955k04498J07752J87826
$$ plain form
15238 144460 25737 -17 60544 130670 77815 63112 23759 118455 206064 153422 102043
15227 102043 186753 244517 196357 125923 106731 263126 106462 50132 82853 65694 -147483
15216 -147483 -30438 169007 296344 259117 98391 -61154 -80211 -92987 -35086 146828
15206 146828 127793 27346 -177491 -318005 -321786 -310409 -173177 -70040 -105349 -178853 -343064
15195 -343064 -262327 -106571 -46304 59336 215177 316051 351510 379213 239934 202329
15185 202329 213434 263207 288185 337776 339652 315474 252928 98470 -43109 -164076 -238036
15174 -238036 -264757 -119798 -1729 155039 104311 25618 94969 152011 42019 62041 208847
15163 208847 153929 -99573 -85758 -60212 -66173 59872 77185 102880 -22926 -73999 -82301
$$ packed form
15238A44460j18723k5754O0561P0126n2855j4703l9353R4696Q7609n2642n1379
15227A02043Q4710N7764m8160p0434j9192J56395j56664n6330L2721j7159k13177
15216a47483J17045J99445J27337l7227j60726j59545j9057j2776N7901J81914
15206A46828j9035j00447k04837j40514l781J1377J37232J03137l5309p3504j64211
15195c43064Q0737J55756O0267J05640J55841J00874L5459K7703j39279l7605
15185B02329J1105M9773K4978M9591J876k4178o2546j54458j41579j20967p3960
15174b38036k6721J44959J18069J56768n0728p8693O9351N7042j09992K0022J46806
15163B08847n4918k53502J3815K5546n961J26045J7313K5695j25806n1073q302
$$ plain form
15152 -82301 -37995 150378 199179 204418 134479 45854 68006 81606 150 -171273 -233768
15141 -233768 -290142 -234997 -68237 -141451 -47948 -78952 -81161 26790 33211 103355 86799
15130 86799 131044 173108 238827 129791 154543 143511 53158 -38876 -44834 -109791 -23327 184448
15118 184448 292996 284979 353938 361163 331808 190969 18752 -47520 -32409 -21953 125643
15107 125643 155378 286019 396944 334060 180394 53944 -85308 -12516 -36598 -90160
15097 -90160 -94871 -4247 31175 -155383 -340703 -281217 -122414 -102460 78098 151540 143574
15086 143574 150138 111874 113792 146233 46392 -120194 -166224 -254549 -196797 -205857 -165941 -94609
15074 -94609 44794 109471 66241 184298 226329 223198 80084 17798 142289 204726 303545
$$ packed form
15152h2301M4306J88373M8801N239o9939q8625K2152J3600q1456j71423o2495
15141b33768n6374N5145J66760p3214R3503l1004k209J07951O421P0144j6556
15130H6799M4245M2064O5719j09036K4752j1032r0353r2034n958o4957Q6464K07775
15118A84448J08548q017O8959P225k9355j40839j72217o6272J5111J0456J47596
15107A25643K9735J30641J10925o2884j53666j26450j39252P2792k4082n3562
15097i0160m711R0624L5422j86558j85320N9486J58803J9954J80558P3442p966
15086A43574O564l8264J918L2441r9841j66586m6030q8325N7752r060L9916P1332
15074i4609J39403O4677m3230J18057M2031l131j43114o2286J24491O2437R8819
$$ plain form
15063 303545 481694 272042 231117 232124 131431 -66233 -103362 34022 -50789 -209015
15053 -209015 -159706 600 -43071 -34932 -97960 -129802 -140657 -250444 -293119 -296335 -178779
15042 -178779 40984 6436 -243941 -408049 -329549 -276201 -252773 -23251 34727 5315 -78415
15031 -78415 -63514 -61814 -180204 -330752 -250879 -219390 -82655 -99330 -69469 -59307 -37155
15020 -37155 120554 140466 109104 60066 108826 41888 -21242 15472 86051 -5431 -36398
15009 -36398 82493 119439 213125 80336 125022 19459 14298 -44200 -48453 -20964 -204034
14998 -204034 -109824 109184 64655 71249 104285 -109789 -163773 -196634 -150830 55190 135101
14987 135101 -134414 -137854 88742 156252 -26933 -31226 -72172 -77926 -217227 46549 66611
$$ packed form
15063C03545J78149k09652m0925J007j00693j97664l7129J37384q4811j58226
15053b09015M9309J60306m3671Q139o3028l1842j0855j09787m2675l216J17556
15042a78779K19763l4548k50377j64108P8500N3348K3428K29522N7978k9412q3730
15031g8415J4901J700j18390j50548P9873L1489J36735j6675K9861J0162K2152
15020c7155J57709J9912l1362m9038M8760o6938o3130L6714P0579r1482l0967
15009c6398J18891L6946R3686j32789M4686j05563n161n8498m253K7489j83070
14998b04034R4210K19008m4529O594L3036k14074n3984l2861M5804K06020P9911
14987A35101k69515l440K26596O7510j83185m293m0946n754j39301K63776K0062
$$ plain form
14976 66611 -85928 -111439 -78806 -62495 35292 22393 -50343 -177575 -199033 -192602 51950
14965 51950 1152 -13410 116139 33791 84355 -22757 -186797 -52362 92162 218248
14955 218248 195665 144640 159479 59911 -29486 -24414 -126974 -279242 -166929 -186699 -218712
14944 -218712 -109626 -12195 201815 120305 22667 45934 -114871 -235240 -83699 87948
14934 87948 41775 38704 45290 30347 -62097 25420 149677 218196 302421 157749 282209
14923 282209 272714 136426 12913 52306 167829 234552 203668 127116 -17927 -56976 31381
14912 31381 218320 116835 -53854 -85721 -135314 7146 -76260 -227854 -291757 -204100 -222641
14901 -222641 -183955 -172132 -157671 -291097 -383428 -314838 -208639 -112659 62638 146437 177610
$$ packed form
14976F6611j52539k5511L2633J6311R7787j2899p2736j27232k1458O431K44552
14965E1950n0798j4562J29549q2348N0564j07112j64040J34435J44524J26086
14955B18248k2583n1025J4839r9568q9397N072j02560j52268J12313j9770l2013
14944b18712J09086R7431K14010q1510r7638K3267j60805j20369J51541J71647
14934H7948m6173l071O586j4943r2444Q7517J24257O8519Q4225j44672J24460
14923B82209r495j36288j23513L9393J15523O6723l0884p6552j45043l9049Q8357
14912C1381J86939j01485j70689l1867m9593J42460q3406j51594o3903Q7657j8541
14901b22641L8686J1823J4461j33426r2331O8590J06199R5980J75297Q3799L1173
$$ plain form
14890 177610 35345 -99131 -56644 -74103 -46783 -41679 -75272 -92773 4140 66487 40482
14879 40482 -61747 -86963 68252 201123 88523 -86288 -63291 -18708 -31735 4591 87288
14868 87288 137353 280283 327345 222792 231585 208798 -24917 -101505 -29196 -119511 -180311
14857 -180311 -82646 -43433 42997 59482 -112208 -121838 -127607 -34210 -74048 -87471 -131903 -121290
14845 -121290 -85260 90529 46433 -84277 -38256 168943 303758 283985 273685 219396 10656
14834 10656 -111792 -123994 -94737 93253 334070 434819 184906 -6236 70365 87063
14824 87063 -18213 42093 136021 266160 267158 422455 538618 385190 337720 288437 209644
14813 209644 232409 161299 190779 89140 212322 155795 83554 86698 136354 216673 256375
$$ packed form
14890A77610j42265j34476M2487j7459K7320N104l3593j7501R6913O2347k6005
14879D0482j02229k5216J55215J32871j12600j74811K2997M4583j3027L6326Q2697
14868H7288N0065J42930M7062j04553Q793k2787k33715p6588P2309r0315o0800
14857a80311R7665L9213Q6430J6485j71690r630n769R3397l9838j3423m4432J0613
14845a21290L6030J75789m4096j30710M6021K07199J34815j9773j0300n4289k08740
14834A0656j22448j2202K9257J87990K40817J00749k49913j91142P6601J6698
14824H7063j05276O0306R3928J30139R98J55297J16163j53428m7470m9283p8793
14813B09644K2765p1110K9480j01639J23182n6527p2241L144M9656Q0319L9702
$$ plain form
14802 256375 74544 113901 276641 305877 188678 131172 107020 106860 216462 382185 418245
14791 418245 434361 294720 88501 -20353 -105344 -53147 -45135 27122 58784 17111 65756
14780 65756 127221 12731 956 919 76635 89118 106204 29522 173044 248297 150999 453
14768 453 -26855 -7552 145815 174632 62060 28555 84820 -36584 -156327 -12001 122483
14757 122483 153383 -14321 44666 -39436 -117998 -168405 17947 -8312 87360 242 -171988
14746 -171988 -273965 -185919 28499 -21241 38949 27932 113018 166418 90461 78967 -49960
14735 -49960 45264 26698 35839 -17075 -10997 -6812 95434 134435 148969 214596 159543 290679
14723 290679 367455 456546 530187 262121 260574 257932 95844 73749 58642 -36638 60053
$$ packed form
14802B56375j81831L9357J62740K9236j17199n7506k4152j60J09602J65723L6060
14791D18245J6116j39641k06219j08854q4991N2197Q012P2257L1662m1673M8645
14780F5756O1465j14490j1775l7P5716J2483J7086p6682J43522P5253r7298j50546
14768D53k7308J9303J53367K8817j12572l3505N6265j21404j19743J44326J34484
14757A22483L0900j67704N8987q4102p8562n0407J86352k6259R5672q7118j72230
14746a71988j01977Q8046K14418m9740O0190j1017Q5086N3400p5957j1494j28927
14735d9960R5224j8566R141n2914O078M185J02246L9001J4534O5627n5053J31136
14723B90679P6776Q9091P3641k68066j547k642j62088k2095j5107r5280R6691
$$ plain form
14712 60053 46101 -56657 -29355 59915 45259 83492 98965 -16418 -16523 -16962 -98723 -218892
14700 -218892 -379684 -374657 -224188 -322538 -316883 -134294 38063 -1199 -80692 33544 93030
14689 93030 145553 334636 198391 207482 212595 194919 86457 -138174 -243350 -386999 -323756
14678 -323756 -211689 -120016 -98661 -14678 -8517 3321 41791 161112 274789 122129 37145
14667 37145 92156 83353 -8582 -61047 58159 56481 219306 235268 113490 -51815 -119613
14656 -119613 74496 111188 59910 183198 167517 9469 48934 146410 -46972 -42489 -5865
14645 -5865 -51597 -138050 -179276 -3671 -80049 -36558 -39878 32734 -2056 -58300 18751 178717
14633 178717 167980 18764 -24666 -104080 -181346 -296160 -257113 -200462 -156623 -58028 57913
$$ packed form
14712F0053j3952j02758K7302Q9270j4656L8233J5473j15383j05m39q1761j20169
14700b18892j60792N027J50469r8350N655J82589J72357l9262p9493J14236N9486
14689I3030N2523J89083j36245R091N113j7676j08462k24631j05176j43649O3243
14678c23756J12067R1673K1355Q3983O161J1838L8470J19321J13677j52660q4984
14667C7145N5011q803r1935n2465J19206j678J62825J5962j21778j65305o7798
14656a19613J94109L6692n1278J23288j5681j58048L9465R7476j93382M483L6624
14645e865m5732q6453m1226J75605p6378M3491l320P2612l4790n6244P7051J59966
14633A78717j0737j49216m3430p9414p7266j14814L9047N6651M3839R8595J15941
$$ plain form
14622 57913 137127 175266 95498 159738 53207 42444 146131 93795 -34919 -110767 -7331
14611 -7331 85884 207818 81116 338 -74802 -259125 -334945 -316356 -128133 59281 47417
14600 47417 -239 179090 280324 137677 -56027 -74805 -84004 59163 37857 24689 -59049
14589 -59049 -118084 -166518 -48491 27592 -110415 -215058 -312482 -250023 -133521 24456 87668
14578 87668 76765 59990 -47679 -116398 -51867 -114980 -120769 62234 67151 117047 139677 210176
14566 210176 234781 210105 201477 -110710 -192039 -229269 -169324 -15334 -20851 -48572 -128758
14555 -128758 -106982 -45763 217026 241522 265397 118381 40814 95322 209235 275216 247811
14544 247811 67141 -15930 -10258 69348 119284 90224 108231 124736 15150 50559 85502
$$ packed form
14622E7913P9214L8139p9768O4240j06531j0763J03687n2336j28714p5848J03436
14611g331R3215J21934j26702q0778p5140j84323p5820J8589J88223J87414j1864
14600D7417m7656J79329J01234j42647j93704j8778r199J43167k1306j3168q3738
14589e9049n9035m8434J18027P6083j38007j04643r7424O2459J16502J57977O3212
14578H7668j0903j6775j07669o8719O4531o3113n789J83003M917M9896K2630P0499
14566B10176K4605k4676q628l12187q1329l7230N9945J53990n517k7721q0186
14555a28758K1776O1219K62789K4496K3875j47016p7567N4508J13913O5981k7405
14544B47811j80670q3071N672P9606M9936k9060J8007J6505j09586L5409L4943
$$ plain form
14533 85502 168885 190935 142353 72912 252236 391275 360426 365286 115308 -105335 -74300
14522 -74300 38450 -94071 10529 270687 203715 -107131 -63280 75579 21748 -94712
14512 -94712 -243951 -353090 -296114 -387057 -284938 22085 -32614 -21069 -26155 45687 155576
14501 155576 108279 -36910 -51168 147709 -28519 -160825 -104107 -59345 -95416 -140953 -152623
14490 -152623 -58915 77943 97510 2437 -80463 -9809 40715 72960 192466 146636 99283
14479 99283 -55660 -169913 -190626 -1090 35069 76480 26911 38233 32924 57091 -464
14468 -464 -101079 -47244 -201215 -274259 -154997 -245550 -153660 79116 227549 229175 108189
14457 108189 -142456 -28801 236720 205275 184809 76424 94273 123547 108517 48872 -86654
$$ packed form
14533H5502Q3383K2050m8582o9441J79324J39039l0849M860k49978k20643L1035
14522g4300J12750j32521J04600K60158o6972l10846M3851J38859n3831j16460
14512i4712j49239j09139N6976r0943J02119L07023n4699J1545n086P1842J09889
14501A55576m7297j45189j4258J98877j76228j32306N6718M4762l6071m5537j1670
14490a52623R3708J36858J9567r5073q2900P0654N0524L2245J19506m5830m7353
14479I9283j54943j14253k0713J89536L6159M1411m9569J1322n309K4167n7555
14468d64j00615N3835j53971p3044J19262r0553R1890K32776J48433J626j20986
14457A08189k50645J13655K65521l1445k0466j08385J7849K9274j5030n9645j35526
$$ plain form
14446 -86654 -200289 -127398 -61686 -248943 -379609 -289013 -123576 -112357 -181001 -164765 -177261
14435 -177261 -81994 -52697 -78762 116526 126141 16342 -27567 -234512 -81858 156698 229485
14424 229485 93143 -70271 -55509 -52817 89790 184506 169509 180703 196440 294154 339151
14413 339151 278215 161197 40110 -36270 -99276 90183 237795 261316 224598 42892
14403 42892 -127067 -108179 104504 24335 -21911 -35961 -171381 -223102 -48148 -30632 8051
14392 8051 -40863 -63111 -62989 -139312 -132533 -35516 42459 54364 -57295 -49353 154753 131927
14380 131927 -11342 -27515 107701 238301 174586 160646 69217 123220 105121 -151213 -59291
14369 -59291 17390 45228 -7255 -79829 -67930 43794 -13216 -13162 211155 52334 -114276
$$ packed form
14446h6654j13635P2891O5712j87257j30666R0596J65437J1219o8644J6236j2496
14435a77261R5267K9297k6065J95288R615j09799m3909k06945J52654K38556P2787
14424B29485j36342j63414J4762K692J42607R4716j4997J1194J5737R7714M4997
14413C39151o0936j17018j21087p6380o3006J89459J47612K3521l6718j81706
14403D2892j69959J8888K12683q0169m6246j4050j35420n1721J74954J7516L8683
14392H051m8914k2248J22p6323O779R7017P7975J1905j11659P942K04106k2826
14380A31927j43269j6173J35216J30600o3715j3940r1429N4003j8099k56334R1922
14369e9291P6681K7838n2483p2574J1899J11724n7010N4K24317j58821j66610
$$ plain form
14358 -114276 -73751 38345 2 -82220 -100714 -170529 -100808 7597 185586 108194 -205363
14347 -205363 503 12786 -91689 70764 30333 -92237 145266 323143 123743 -27114
14337 -27114 -22495 -47463 -227769 -233014 -238609 -89492 -25460 74627 18043 37847 -16749 22100
14325 22100 -115925 -99877 72266 104836 63208 6026 26050 47307 10029 -175278 -200794
14314 -200794 -77094 5208 -143860 -221847 -151188 -94073 31465 -96361 -44744 -86896 -223093
14303 -223093 -186970 -134413 13050 148543 117977 2702 -105125 -142461 -71004 -10765 35619
14292 35619 127572 184316 300429 207932 233501 226741 173320 23956 -209660 -217342 -125328
14281 -125328 -22599 125026 215343 100339 -92974 -284600 -236488 -9227 58270 83009
$$ packed form
14358a14276M0525J12096l8343q2222j8494o9815O9721J08405J77989p7392l13557
14347b05363K05866J2283j04475J62453m0431j22570K37503J77877j99400j50857
14337b7114M619k4968j80306n245n595J49117O4032J00087n6584J9804n4596L8849
14325B2100j38025J6048J72143L2570m1628n7182K0024K1257l7278j85307k5516
14314b00794J23700Q2302j49068p7987P0659N7115J25538j27826N1617m2152j36197
14303b23093L6123N2557J47463J35493l0566j15275j07827l7336P1457O0239M6384
14292C5619R1953N6744J16113r2497K5569o760n3421j49364k33616p682R2014
14281a25328J02729J47625R0317j15004j93313j91626M8112K27261O7497K4739
$$ plain form
14271 83009 -2212 -28985 50328 135217 180318 90967 -141441 -225628 -198105 -166552 -51362
14260 -51362 -73738 98072 282960 284710 177868 -26266 -179418 -121888 8237 69244 200772
14249 200772 157314 140541 192628 169834 136629 175192 206391 135061 165543 -61399 -64738
14238 -64738 -84135 -185955 -143688 -54917 -123245 -149334 -2957 -15615 -101809 -119160 -147004
14227 -147004 -212908 -33028 92173 -8500 -96051 -249354 -268446 -353514 -293865 -186309
14217 -186309 -247065 -321429 -172112 -47341 -162178 -161883 -174766 -321974 -246030 161470 268010
14206 268010 103814 64713 -96491 -202705 -178219 -175789 -92330 35253 -238038 -328172 -201491
14195 -201491 -98800 -1191 70102 -4822 -142606 -213432 -144448 -93521 -122750 -45490 2299
$$ packed form
14271H3009q5221k6773P9313Q4889M5101q9351k32408q4187K7523L1553J15190
14260e1362k2376J71810J84888J750j06842k04134j53152N7530J30125O1007J31528
14249B00772m3458j6773N2087k2794l3205L8563L1199p1330L0482k26942l339
14238f4738j9397j01820M2267Q8771o8328k6089J46377j2658q6194j7351k7844
14227a47004o5904J79880J25201j00673q7551j53303j9092q5068N9649J07556
14217a86309o0756p4364J49317J24771j14837K95j2883j47208P5944M07500J06540
14206B68010j64196l9101j61204j06214K4486K430Q3459J27583k73291r0134J26681
14195b01491J02691R7609P1293p4924j37784p0826O8984N0927k9229P7260M7789
$$ plain form
14184 2299 100042 269773 247249 -4552 -60030 40990 86124 10792 -63317 -104209 29174
14173 29174 115448 95212 -92424 -266101 -249704 -278833 -168014 -122060 -200853 -439782 -423378
14162 -423378 -262162 -301668 -177242 -129725 -70235 74917 107119 -34676 62445 246997
14152 246997 214507 261675 264281 109088 124544 178741 99814 210989 280131 272884 184890
14141 184890 -37158 -9743 -63485 80225 103683 -73690 -64520 5827 7313 -54863 -137027
14130 -137027 -95011 -217583 -241247 -100447 -21129 -75563 -215029 -230904 -180055 46325 93784
14119 93784 -11254 51319 102903 49138 139499 138587 64066 83958 188455 195617 199919 155385
14107 155385 35457 -172778 -252911 -117671 -89857 -182093 -194228 -198965 -153716 -73718 -81285
$$ packed form
14184B299R7743J69731k2524k51801n5478J01020M5134p5332p4109m0892J33383
14173B9174Q6274k0236j87636j73677J6397k9129J10819M5954p8793k38929J6404
14162d23378J61216l9506J24426M7517N9490J45152L2202j41795R7121J84552
14152B46997l2490M7168K606j55193J5456N4197p8927J11175O9142p247q7994
14141A84890k22048K7415n3742J43710K3458j77373R170P0347J486o2176q2164
14130a37027M2016j22572k3664J40800P9318n4434j39466j5875N0849K26380M7459
14119I3784j05038O2573N1584n3765R0361r12p4521J9892J04497P162M302m4534
14107A55385j19928k08235q0133J35240K7814r2236j2135m737M5249P9998p567
$$ plain form
14096 -81285 -90197 -233380 -8451 44142 37291 -26111 76843 189789 181079 251426 281287
14085 281287 102572 -3886 -155550 -438477 -645307 -539782 -357455 -288289 -223266 -172447
14075 -172447 -190090 -104466 35069 27110 21906 29034 54175 193664 324599 120399 -51213
14064 -51213 -186684 -230123 -212406 -44000 124763 182432 203144 112212 23018 140096 42934
14053 42934 -26259 31893 102558 121015 160600 95848 -69571 1499 76719 116418 -27156
14042 -27156 -33354 -27524 -15287 -8298 -2308 8605 -80597 -194546 -270233 -163620 102102 94080
14030 94080 12755 7458 197605 238709 261167 194134 142238 184492 196018 131420 2574
14019 2574 26198 100353 319733 460600 350066 293140 243713 -35288 -151912 -31340 19824
$$ packed form
14096h1285q912j43183K24929N2593o851o3402J02954J12946q710P0347K9861
14085B81287j78715j06458j51664k82927k06830J05525J82327O9166O5023N0819
14075a72447j7643Q5624J39535p959n204P128K5141J39489J30935k04200j71612
14064e1213j35471m3439J7717J68406J68763N7669K0712r0932q9194J17078r7162
14053D2934o9193N8152P0665J8457L9585o4752j65419P1070P5220L9699j43574
14042b7156o198N830J2237O989N990J0913q9202j13949p5687J06613K65722q022
14030I4080q1325n297J90147M1104K2458o7033n1896M2254J1526o4598j28846
14019B574K3624P4155K19380J40867j10534n6926m9427k79001j16624J20572N1164
$$ plain form
14008 19824 -48858 -75881 -53568 74156 191237 174470 79778 1497 -114752 -182530 -314127
13997 -314127 -298265 -155482 -58549 78153 68993 -63452 76205 126234 192700 240455 84791
13986 84791 17433 1998 47678 112065 79437 1615 -95029 -26654 223505 205217 91503
13975 91503 113535 228363 45441 69 26216 110869 -26431 -89899 -105880 -98154 107836
13964 107836 98420 77422 173098 115875 152600 240374 229545 202682 134528 117959 190332 175565
13952 175565 203371 252639 215292 138359 111661 140145 -6652 -189150 -108233 -122546 -2112
13941 -2112 73683 44703 45299 25675 219811 377871 355554 194635 139409 199012 85136
13930 85136 82863 146105 126065 137036 -45709 -59556 -15788 -189966 -99933 39437 75066
$$ packed form
14008A9824o8682k7023K2313J27724J17081j6767r4692p8281j16249o7778j31597
13997c14127J5862J42783R6933J36702r160j32445J39657N0029O6466M7755j55664
13986H4791o7358j5435M5680O4387l2628p7822r6644O8375K50159j8288j13714
13975I1503K2032J14828j82922m5372K6147Q4653j37300o3468j5981P726K05990
13964A07836r416k0998R5676n7223L6725Q7774j0829k6863o8154j6569P2373j4767
13952A75565K7806M9268l7347p6933k6698K8484j46797j82498Q0917j4313J20434
13941b112P5795k8980N96j9624J94136J58060k2317j60919n5226N9603j13876
13930H5136k273O3242k0040J0971j82745j3847M3768j74178R0033J39370L5629
$$ plain form
13919 75066 75041 34694 -114673 -223223 -47378 85737 152662 156332 248349 177971 126923 175508
13907 175508 134238 -6077 5327 90438 130912 237869 138328 175118 126616 100804 283201
13896 283201 233949 60431 -32487 17649 100136 60314 -87469 -235748 -186760 -119910 47638
13885 47638 64500 52704 -20449 -28436 22680 46460 68034 125288 135853 138898 121344 102228
13873 102228 48718 186057 268425 143972 82005 -57205 -702 -69244 -135180 -82133 210214
13862 210214 130993 46281 188219 259154 93651 -88299 23911 103271 202868 329869
13852 329869 299118 126666 7931 132612 -5465 -56967 -92271 -165134 -221652 -195734 -109038
13841 -109038 -230180 -252292 -152937 -68684 -152420 -118194 -159644 -229101 -81805 9972 -37589
$$ packed form
13919G5066k5m0347j49367j08550J75845J33115O6925L670R2017p0378n1048M8585
13907A75508m1270j40315J1404Q5111M0474J06957r9541L6790m8502k5812J82397
13896B83201m9252j73518r2918N0136Q2487l9822j47783j48279M8988O6850J67548
13885D7638J6862j1796p3153p987N1116K3780K1574N7254J0565L045j7554j9116
13873A02228n3510J37339Q2368j24453o1967j39210N6503o8542o5936N3047K92347
13862B10214p9221q4712J41938P0935j65503j81950J12210P9360R9597J27001
13852C29869l0751j72452j18735J24681j38077n1502l5304p2863n6518K5918Q6696
13841a09038j21142k2112R9355Q4253q3736L4226m1450o9457J47296R1777m7561
$$ plain form
13830 -37589 19923 60662 186592 282144 255508 89827 -62870 -135616 56978 126224 -39784
13819 -39784 -224462 -284971 -359965 -198735 -11992 77864 90444 18863 16273 59285 -137644
13808 -137644 -201621 52965 225913 25677 49011 195182 217309 131399 73430 158564 313759
13797 313759 270564 139257 -570 68271 20084 -87657 89516 206477 190487 235030
13787 235030 172117 191332 188104 232545 227786 421689 416461 289505 158033 83838 2490
13776 2490 -99375 -79926 -49828 -66385 -52787 -7887 22563 19558 -45440 -4584 -69115 -218799
13764 -218799 -151928 -71146 67445 -91585 -21365 157653 56305 -22169 20840 -68204 -160189
13753 -160189 -59071 109368 192889 76676 1466 -22072 149232 169390 187913 315114
$$ packed form
13830c7589N7512M0739J25930R5552k6636j65681j52697p2746J92594O9246j66008
13819c9784j84678o0509p4994J61230J86743Q9856J2580p1581k590M3012j96929
13808a37644o3977K54586J72948k00236K3334J46171K2127q5910n7969Q5134J55195
13797C13759m3195j31307j39827O8841m8187j07741J77173J16961j5990M4543
13787B35030o2913J9215l228M4441m759J93903n228j26956j31472p4195q1348
13776B490j01865J9449L0098j6557J3598M4900L0450l005o4998M0856o4531j49684
13764b18799O6871Q0782J38591j59030P0220J79018j01348p8474M3009q9044r1985
13753a60189J01118J68439Q3521j16213p5210k3538J71304K0158J8523J27201
$$ plain form
13743 315114 433179 356434 248513 197251 196261 101446 -23657 -163777 -207707 -244962 -195196
13732 -195196 -354267 -227879 -149361 -114370 -75149 -43951 -141671 -158763 -93837 -134112 -234234
13721 -234234 -277577 -107204 -136459 -231008 -167103 -30390 -24162 -40599 -45601 -17285 87795
13710 87795 -107271 -220719 -109061 6201 69108 88548 174863 212483 203669 117868 -118256
13699 -118256 -300122 -261859 -382560 -267373 -182253 -181962 -148443 -192161 -250222 -163894 -128246
13688 -128246 -184794 32098 91716 65804 12719 -142041 -85011 -180331 -177372 -90457 -27657
13677 -27657 -23042 -106036 -71500 129610 52818 42747 43931 177635 50718 45081 86772 83396
13665 83396 218941 185300 41226 -60457 -8100 -84405 -101715 -136940 -142216 -27154 45977
$$ packed form
13743C15114J18065p6745j07921n1262r90r4815j25103j40120m3930l7255M9766
13732a95196j59071J26388P8518L4991L9221L1198r7720j7092O4926m0275j00122
13721b34234m3343J70373k9255r4549O3905J36713O228j6437n002K8316J05080
13710H7795j95066j13448J11658J15262O2907J9440Q6315L7620q814q5801k36124
13699a18256j81866L8263j20701J15187Q5120K91L3519m3718n8061Q6328L5648
13688a28246n6548K16892N9618k5912n3085j54760N7030r5320K959Q6915O2800
13677b7657M615q2994L4536K01110p6792j0071J184J33704j26917n637M1691l376
13665H3396J35545l3641j44074j01683N2357p6305j7310l5225n276J15062P3131
$$ plain form
13654 45977 149004 80356 -59906 -119065 -110389 -66219 -78440 -80416 -145354 -179322 -110360 162946
13642 162946 295424 300159 184916 -74520 -220472 -199249 -85966 -111921 -73897 72764
13632 72764 -9514 -2241 228472 300944 263894 141649 245952 126269 -24116 -68510 115432
13621 115432 205651 37764 -41433 1725 153191 267824 390661 331287 87397 11884
13611 11884 40220 124561 151175 31341 108315 258060 202489 37273 -13934 70058 239982
13600 239982 266830 236517 140410 148297 62769 -3431 93193 200366 184562 169460 127720
13589 127720 205409 223002 8407 -37838 -102371 -58888 -128163 -142207 -66541 24850 42306
13578 42306 72327 8457 -13214 3155 -100368 -17653 83929 242875 111205 -80942 -179410
$$ packed form
13654D5977J03027o8648j40262n9159Q676M4170j2221j976o4938l3968O8962K73306
13642A62946J32478M735j15243k59436j45952K1223J13283k5955L8024J46661
13632G2764q2278P273K30713P2472l7050j22245J04303j19683j50385m4394J83942
13621A15432R0219j67887p9197M3158J51466J14633J22837n9374k43890p5513
13611A1884K8336Q4341K6614j19834P6974J49745n5571j65216n1207Q3992J69924
13600B39982K6848l0313r6107P887q5528o6200R6624J07173j5804j5102m1740
13589A27720P7689J7593k14595m6245o4533M3483o9275j4044P5666R1391J7456
13578D2306L0021o3870k1671J6369j03523Q2715J01582J58946j31670j92147r8468
$$ plain form
13567 -179410 -189143 -202050 -356161 -262458 19044 177975 242546 359620 451422 275180 175754
13556 175754 99041 37464 -6880 -158445 -223203 -47091 -6048 82282 99873 191692 181453
13545 181453 115900 279180 356834 192774 150900 38672 -5857 -29344 12367 135693 212787
13534 212787 85695 3099 28901 -15752 63692 212389 344540 229675 12295 -135128
13524 -135128 -117282 -200250 -293322 -394848 -498189 -435075 -339805 -133906 -75680 -193881 -230476
13513 -230476 -78200 -40043 -27753 206497 315602 272745 81701 32266 -4182 153777
13503 153777 15531 -211044 -223603 -132168 -100355 -143871 -89085 -48210 -89900 -91434 -92015 -62078
13491 -62078 60838 276157 169900 67667 3099 -58532 -50122 -7106 3621 -109620 128904
$$ packed form
13567a79410r733j2907j54111R3703K81502J58931O4571J17074R1802j76242r9426
13556A75754p6713o1577m4344j51565o4758J76112M1043Q8330J7591R1819j0239
13545A81453o5553J63280P7654j64060m1874j12228m4529k3487M1711J23326P7094
13534B12787j27092q2596K5802m4653P9444J48697J32151j14865k17380j47423
13524a35128J7846q2968r3072j01526j03341O3114R5270K05899N8226j18201l6595
13513b30476J52276L8157J2290K34250J09105m2857j91044m9435l6448J57959
13503A53777j38246k26575j2559R1435L1813m3516N4786M0875m1690j534n81K9937
13491f2078J22916K15319j06257j02233o4568o1631Q410M3016J0727j13241K38524
$$ plain form
13480 128904 354573 289524 88485 -145683 -208988 -147032 -178510 -61760 37166 -64569
13470 -64569 -28784 -14750 -39709 -72599 -58657 99494 134717 163943 109679 31871 54997
13459 54997 119001 77940 12385 -40423 8122 31313 126659 237682 189586 167932 108587
13448 108587 47126 91624 -21380 -92432 -138339 37659 182465 335127 240067 54973
13438 54973 -214775 -171382 -30432 33212 103937 34229 11323 -138 -40534 43781 73153
13427 73153 -8036 78022 163574 -5566 -132766 -179979 -121031 -37362 -18463 -22591 90563
13416 90563 124148 46168 12478 7229 3542 194267 349965 277385 162206 75463 4677
13405 4677 -24648 87490 220783 110887 41393 90291 25948 64290 33658 7542 43802
$$ packed form
13480A28904K25669o5049k01039k34168o3305O1956l1478J16750R8926j01735
13470f4569L5785J4034k4959l2890J3942J58151L5223K9226n4264p7808K3126
13459E4997O4004m1061o5555n2808M8545K3191R5346J11023m8096k1654n9345
13448A08587o1461M4498j13004p1052m5907J75998J44806J52662r5060j85094
13438E4973k69748M3393J40950O3644P0725o9708k2906j1461m0396Q4315K9372
13427G3153q1189Q6058Q5552j69140j27200m7213N8948Q3669J8899m128J13154
13416I0563L3585p7980l3690n249l687J90725J55698p2580j15179q6743p0786
13405D677k9325J12138J33293j09896o9494M8898o4343L8342l0632k6116L6260
$$ [...]
##END NTUPLES=NMR SPECTRUM
##END=
