##TITLE=Analysis number 330129
Compound Code ac 35973
Project Code adrs
Chemist Name frontier sci
##JCAMPDX= 6.0         $$ Bruker NMR JCAMP-DX V2.0
##DATA TYPE= NMR SPECTRUM
##DATA CLASS= NTUPLES
##ORIGIN= Bruker BioSpin GmbH
##OWNER= nmr
$$ XWIN-NMR		Version 3.5
$$ Tue Oct 30 13:17:31 2007 GMT Standard Time (UT+0h)  MAYBRIDGE\nmr@NMR_250MHZ
##.OBSERVE FREQUENCY= 250.131544655141
##.OBSERVE NUCLEUS= ^1H
##.ACQUISITION MODE= SIMULTANEOUS (DQD)
##.ACQUISITION SCHEME= undefined
##.AVERAGES= 16
##.DIGITISER RES= 18
##SPECTROMETER/DATA SYSTEM= dpx250
##.PULSE SEQUENCE= zg30
##.SOLVENT NAME= DMSO
##.SHIFT REFERENCE= (INTERNAL, DMSO, 0, 16.522)
##AUDIT TRAIL= $$ (NUMBER, WHEN, WHO, WHERE, WHAT)
$$ ##TITLE= Audit trail, XWIN-NMR		Version 3.5
$$ ##JCAMPDX= 5.01
$$ ##ORIGIN= Bruker BioSpin GmbH
$$ ##OWNER= nmr
$$ C:\u/data/dgb/nmr/ADRS/1530/pdata/1/auditp.txt
$$ ##AUDIT TRAIL=  $$ (NUMBER, WHEN, WHO, WHERE, WHAT)
(   1,<2007-10-30 13:16:56.98 +000>,<MAYBRIDGE\nmr>,<NMR_250MHZ>,
      <created by zg, POWCHK disabled, PULCHK disabled
       configuration hash MD5:
       76 6E 9A 78 1E 09 19 81 EC 84 63 8F B0 6A 59 2D
       data hash MD5: 64K
       42 E4 57 C4 CB 8C CA DD 63 30 BD D2 DE D7 9D 73>)
(   2,<2007-10-30 13:17:18.62 +000>,<MAYBRIDGE\nmr>,<NMR_250MHZ>,
      <Start of raw data processing
       ef LB = 0.3 FT_mod = 6 PKNL = 1 SI = 32K 
       data hash MD5: 32K
       B4 30 1A 60 E4 F2 A8 A9 38 5F ED 5C 2B 06 CD 35>)
(   3,<2007-10-30 13:17:20.64 +000>,<MAYBRIDGE\nmr>,<NMR_250MHZ>,
      <apk 
       data hash MD5: 32K
       05 AB 1D F0 29 45 86 56 F8 A9 F1 51 7D 56 0C 5E>)
(   4,<2007-10-30 13:17:21.67 +000>,<MAYBRIDGE\nmr>,<NMR_250MHZ>,
      <abs ABSG = 5 
       data hash MD5: 32K
       94 3D 4F F5 65 33 9C AE 20 6E 00 9D 8A 7B C0 F8>)
$$ ##END=
$$ 
$$ hash MD5
$$ 39 0B ED 1B 9D 45 4D EB CE 6D 44 CB C9 09 35 D4
##$RELAX= 
##$RELAX= 
##$RELAX= 
##$RELAX= 
##$RELAX= 
##$RELAX= 
##$RELAX= 
$$ Bruker specific parameters
$$ --------------------------
##$DU= <C:\u>
##$EXPNO= 1530
##$NAME= <ADRS>
##$PROCNO= 1
##$TYPE= <nmr>
##$USER= <dgb>
##$AMP= (0..31)
100 100 100 100 100 100 100 100 100 100 100 100 100 100 100 100 100 100 
100 100 100 100 100 100 100 100 100 100 100 100 100 100 
##$AQSEQ= 0
##$AQ_mod= 3
##$AUNM= <au_zg>
##$AUTOPOS= <25 >
##$BF1= 250.13
##$BF2= 250.13
##$BF3= 250.13
##$BF4= 250.13
##$BF5= 500.13
##$BF6= 500.13
##$BF7= 500.13
##$BF8= 500.13
##$BYTORDA= 1
##$CFDGTYP= 0
##$CFRGTYP= 5
##$CHEMSTR= <none>
##$CNST= (0..31)
1 1 145 1 1 1 1 1 1 1 1 1 1 1 1 1 1 1 1 1 1 1 1 1 1 1 1 1 1 1 1 1 
##$CPDPRG= <>
##$CPDPRG1= <>
##$CPDPRG2= <>
##$CPDPRG3= <>
##$CPDPRG4= <mlev>
##$CPDPRG5= <mlev>
##$CPDPRG6= <mlev>
##$CPDPRG7= <mlev>
##$CPDPRG8= <mlev>
##$CPDPRGB= <>
##$CPDPRGT= <>
##$D= (0..31)
0 1 0 0 0 0 0 0 0 0.06 0 0 0 0 0 0 0.0002 0 0 0 0 0 0 0 0 0 0 0 0 0 0 
0 
##$DATE= 1193750215
##$DBL= (0..7)
120 120 120 120 120 120 120 120 
##$DBP= (0..7)
150 150 150 150 150 150 150 150 
##$DBP07= 0
##$DBPNAM0= <>
##$DBPNAM1= <>
##$DBPNAM2= <>
$$ [...]
##$SUBNAM6= <"">
##$SUBNAM7= <"">
##$SUBNAM8= <"">
##$SUBNAM9= <"">
##$SW= 20.6930455092707
##$SWIBOX= (0..15)
0 0 3 0 0 0 0 0 0 0 0 0 0 0 0 0 
##$SW_h= 5175.983436853
##$TD= 65536
##$TD0= 1
##$TE= 296.16
##$TE2= 300
##$TE3= 300
##$TEG= 300
##$TL= (0..7)
0 120 120 120 120 120 120 120 
##$TP= (0..7)
150 150 150 150 150 150 150 150 
##$TP07= 0
##$TPNAME0= <>
##$TPNAME1= <>
##$TPNAME2= <>
##$TPNAME3= <>
##$TPNAME4= <>
##$TPNAME5= <>
##$TPNAME6= <>
##$TPNAME7= <>
##$TPOAL= (0..7)
0.5 0.5 0.5 0.5 0.5 0.5 0.5 0.5 
##$TPOFFS= (0..7)
0 0 0 0 0 0 0 0 
##$TUNHIN= 0
##$TUNHOUT= 0
##$TUNXOUT= 0
##$USERA1= <user>
##$USERA2= <user>
##$USERA3= <user>
##$USERA4= <user>
##$USERA5= <user>
##$V9= 5
##$VALIST= <valist>
##$VCLIST= <CCCCCCCCCCCCCCC>
##$VD= 0
##$VDLIST= <DDDDDDDDDDDDDDD>
##$VPLIST= <PPPPPPPPPPPPPPP>
##$VTLIST= <TTTTTTTTTTTTTTT>
##$WBST= 1024
##$WBSW= 4
##$XGAIN= (0..3)
0 0 0 0 
##$XL= 0
##$YL= 0
##$YMAX_a= 243905
##$YMIN_a= -366678
##$ZGOPTNS= <>
##$ZL1= 120
##$ZL2= 120
##$ZL3= 120
##$ZL4= 120
##$ABSF1= 16.522
##$ABSF2= -4.171173
##$ABSG= 5
##$ABSL= 3
##$ALPHA= 0
##$AQORDER= 0
##$ASSFAC= 0
##$ASSFACI= 0
##$ASSFACX= 0
##$ASSWID= 0
##$AUNMP= <proc_1d>
##$AZFE= 0.1
##$AZFW= 0.1
##$BCFW= 0
##$BC_mod= 0
##$BYTORDP= 0
##$COROFFS= 0
##$CY= 12.5
##$DATMOD= 1
##$DC= 0
##$DFILT= <>
##$DTYPP= 0
##$F1P= 14.0000005364418
##$F2P= -0.99999901652339
##$FCOR= 0.5
##$FTSIZE= 32768
##$FT_mod= 6
##$GAMMA= 0
##$GB= 0
##$INTBC= 1
##$INTSCL= 1
##$ISEN= 128
##$LB= 0.3
##$LEV0= 0
##$LPBIN= 0
##$MAXI= 10000
##$MC2= 0
##$MEAN= 0
##$ME_mod= 0
##$MI= 0
##$NCOEF= 0
##$NC_proc= -5
##$NLEV= 6
##$NOISF1= 0
##$NOISF2= 0
##$NSP= 0
##$NTH_PI= 0
##$NZP= 0
##$OFFSET= 16.522
##$PC= 1
##$PHC0= 151.534
##$PHC1= 6.565559
##$PH_mod= 1
##$PKNL= yes
##$PPARMOD= 0
##$PSCAL= 4
##$PSIGN= 0
##$REVERSE= no
##$SF= 250.13
##$SI= 32768
##$SIGF1= 0
##$SIGF2= 0
##$SINO= 400
##$SIOLD= 32768
##$SREGLST= <1H.DMSO>
##$SSB= 0
##$STSI= 32768
##$STSR= 0
##$SW_p= 5175.98343685301
##$SYMM= 0
##$S_DEV= 0
##$TDeff= 65536
##$TDoff= 0
##$TI= <Analysis number 999999
Compound Code 99
Book Reference 9
Project Code 9>
##$TILT= no
##$TM1= 0
##$TM2= 0
##$TOPLEV= 0
##$USERP1= <user>
##$USERP2= <user>
##$USERP3= <user>
##$USERP4= <user>
##$USERP5= <user>
##$WDW= 1
##$XDIM= 32768
##$YMAX_p= 353766298
##$YMIN_p= -780945
$$ End of Bruker specific parameters
$$ ---------------------------------
##NTUPLES= NMR SPECTRUM
##VAR_NAME=  FREQUENCY,     SPECTRUM/REAL,   SPECTRUM/IMAG
##SYMBOL=    X,             R,               I
##VAR_TYPE=  INDEPENDENT,   DEPENDENT,       DEPENDENT
##VAR_FORM=  AFFN,          ASDF,            ASDF
##VAR_DIM=   32768,         32768,           32768
##UNITS=     HZ,            ARBITRARY UNITS, ARBITRARY UNITS
##FACTOR=    0.157963299565203, 1,           1
##FIRST=     4132.6476996994, 0,             0
##LAST=      -1043.33573715361, 0,           0
##MIN=       -1043.33573715361, -780945,     0
##MAX=       4132.6476996994, 353766298,     0
$$ Real data points
##PAGE= N=1
##DATA TABLE= (X++(R..R)), XYDATA
$$ [...]
15853a51624J87771L188q7546J2586O1169J09691J42039j61107o2366j4941L541
15842D2401m4256L1044N3612J19420p8281j85158j02774J00845M3412R6178Q0954
15831A57397j27704K1127K6577j26864n9291m7183j3175M9361j32102J41308K42569
15820A32020M1636q2599l8479k4734j83813J33626K3408j9786P1737J9271J4834
15809H7121k14290m165j5631r3924n4210O9914M9711m8080J07448j5265R0447
15798d0924L3753j6336l704r3753j34987r1696l5568J7731k8302L3651J09276
15787b50859K47171n4279j6139J48601N1424J22299j63676k16356q6379R3593
15777a24600J3054J3884L5190O3148J9482q5368l044j29835l7975L5922k7840
$$ y = [-151624, 36147, 39335, -48211, -35625, 25544, 135235, 277274, 116167, 53801, 38860, 42401, -1855, 29189, 82801, 202221, 123940, -61218, -163992, -63147, -19735, 76443, 157397, 29693, 50820, 77397, -49467, -108758, -155941, -169116, -119755, -251857, -110549, 132020, 173656, 91057, 52578, 27844, -155969, -22343, 1065, -18721, 53016, 72287, 87121, -127169, -131334, -146965, -240889, -295099, -225185, -175474, -223554, -116106, -131371, -40924, -7171, -23507, -27211, -120964, -255951, -347647, -383215, -365484, -393786, -360135, -250859, -3688, -57967, -74106, 74495, 125919, 248218, 84542, -131814, -218193, -124600, -111546, -97662, -62472, 676, 20158, -65210, -68254, -198089, -236064, -200142, -227982]
15766b27982l877O6778Q5227P0501O9637j24290Q9100J70936p7314j42965P4796
15755E0547r5338j9271o9290m4767K01412o3l6801L2186j30974K6332L6509l749
15743e3267j6030r6734Q6532J76001P1997k75538o0872P4127j5539n593k6736
15732a41652M6890J34026M6879q4682J7684k2905r4070j74970J50179P8932q03
15721d4492k5744j7417o2968l0391M8443l6357J1715J93961m9828q5838j02206
15710b01122q3038J58178R8597J11897l5290m9164J7591q339j09055j465R2139
15699i071K6903k749L4852k3100J74439M6820k05950J808m7091J6140K5460P7128
15687A15589L4589J00172j26067k38156k0307R1314K0938L2408K5364j68424k1572
$$ y = [-227982, -231859, -165081, -79854, -9353, 60284, -64006, 25094, 196030, 118716, -24249, 50547, -44791, -64062, -133352, -178119, 23293, 23230, -13571, 18615, -112359, -86027, -49518, -53267, -69297, -166031, -79499, 96502, 168499, -107039, -167911, -93784, -109323, -114916, -141652, -94762, 39264, 86143, 1461, 19145, -3760, -97830, -272800, -122621, -43689, -44492, -70236, -87653, -150621, -181012, -132569, -168926, -157211, 36750, -13078, -98916, -201122, -284160, -125982, -27385, 84512, 49222, 58, 17649, 9310, -99745, -101210, -9071, 17832, 15083, 49935, 26835, 201274, 248094, 42144, 43952, -3139, 13001, 38461, 115589, 150178, 250350, 124283, -113873, -134180, -42866, -21928, 10480, 35844, -132580, -154152]
15676a54152P0194R7401J22909Q0188P60l7897j13986m7747m9876j27506j40933
15665c00645j60464K3976P3491M0102K19490J51091k9080j96958p3054J04465
15655a47586Q5520J04041r4523K2542J10187K9139j15163p2173N0655j2913m2932
15644h3206n8097K8889M3400q6414O635L9905l2090L9983J5553q5413P4596Q9790
15632f469O8080p62k06807j44022N5375Q3533J10714J35868M8901j04400j88729
15621a48718O4534J90833j414j93076q8397N6367L4599R4506J19104J28836M671
15610B61845k49540l8421P4604k2009j19931j39763j47842R0464J56610O1170
15600g2813J01011K7922J3541J5793j30466q4962K08429q5997j45877k6075J44658
$$ y = [-154152, -83958, 13443, 136352, 216540, 217300, 179403, 65417, 17670, -32206, -159712, -300645, -461109, -437133, -363642, -323540, -104050, 47041, 17961, -178997, -252051, -147586, -62066, 41975, -52548, -30006, 80181, 109320, -5843, -78016, -27361, -40274, -83206, -141303, -112414, -69014, -155428, -148793, -108888, -140978, -100995, -85442, -170855, -96259, -6469, 61611, 60849, -145958, -289980, -234605, -151072, -40358, 95510, 144411, 40011, -148718, -84184, 106649, 105235, -87841, -176238, -119871, -85272, 9234, 128338, 257174, 261845, 12305, -26116, 48488, 26479, -93452, -233215, -381057, -290593, -133983, -72813, 28198, 56120, 69661, 85454, -45012, -129974, 78455, -7542, -153419, -179494, -34836]
15589c4836J7050k23622L262Q1137O5473j19653j4632K0879l2110l5428O5149
15578b07331J08057n0833q0475K0924J27294O9409r7627n8955N4785Q0689J81170
15567A47107P5732n2496m9528M0674j2809R5924J02541q1835m5800J38500L3549
15556C91559j98992j10109m7150n6337N6801R1697M8692p1301N95O3903K3730
15545A93088j60686j04473K831J69259K1455j3970k9858j13917j25226j20624
15535b82121M8206J34959L3438R5222k1034j30221O2895Q7469q6729o340l0014
15524i4270J60417P0572r8793j14978P622q2685l0844L8587L0561J28362k2928
15513h377k2509j04856p3659M0683Q7108N6464q9018l5355o9059o140N3133P9005
$$ y = [-34836, -17786, -241408, -238146, -157009, -91536, -211189, -225821, -204942, -237052, -272480, -207331, -99274, -150107, -230582, -209658, -82364, -12955, -110582, -169537, -114752, -34063, 147107, 222839, 170343, 120815, 161489, 148680, 244604, 347145, 265310, 219510, 358010, 391559, 192567, 82458, 35308, -21029, 35772, 127469, 176161, 104860, 105455, 169358, 193088, 32402, -72071, -69240, 100019, 121474, 107504, 77646, -36271, -161497, -282121, -233915, -98956, -65518, 29704, 8670, -121551, -58656, 28813, -57916, -64256, -94270, 66147, 136719, 37926, -77052, -69430, -152115, -182959, -144372, -113811, 14551, -8377, -30886, -135742, -209401, -168718, -81610, -25146, -114164, -149519, -218578, -224718, -171585, -92580]
15501i2580m8763J28292J8259o9581q8299p1431m1021J66666o0977M3726J30858
15490A5149q0462q0056K4235L1752j6909m6940j02343N3547J77036L7271j03095
15479i0815q40m3446j18055M3009J74903J91176J32692l8311j50814j10498l906
15468a4905l5763P3822J8172p9484j74774K1123o0428j29619o3003J14893J79501
15457a50465P461k7793N343N1908K4658j28523O7496J04728J10860j7025o5408
15446a6760j20137Q3441K2755L6669j36722L5259J08372O6745J57695M7187N806
15435B90310q0804j40366k58147j11448J2232p6481J64223k9071q8404L6041Q3211
15424a98704M5837o5670q5550R7075J91639p9711l2695J67490P6487j97103m3438
$$ y = [-92580, -141343, -13051, 5208, -64373, -152672, -224103, -265124, -98458, -159435, -115709, 15149, -65313, -145369, -121134, -89382, -106291, -153231, -255574, -202027, -24991, 12280, -90815, -91655, -135101, -253156, -210147, -35244, 155932, 288624, 250313, 99499, -10999, -14905, -50668, 23154, 41326, -38158, -212932, -191809, -252237, -381856, -444859, -329966, -150465, -143004, -170797, -165454, -113546, -88888, -217411, -149915, -45187, 65673, 48648, -16760, -136897, -53456, -30701, 5968, -130754, -95495, 12877, 79622, 237317, 284504, 290310, 209506, 69140, -189007, -300455, -288223, -364704, -200481, -229552, -317956, -281915, -198704, -152867, -218537, -304087, -207012, -15373, -95084, -127779, 39711, 116198, -80905, -124343]
15413a24343O6335k8260J422j30658m7291J25607q833m4608M8498O5443R5999
15402A9311j18610O9342j59144j13437O8249l6197R3343J25825o4700p5815r4070
15391b85903J23339J62505J3308r901O8960J98164j49304m2893p1777M8575r7523
15380d2450j6584Q0771J32498j9774m8374o9051M06O4797j17134j01549j16502
15369b52946n7251O7523M0841O9917J0565L4462J05502j6279o1634J11020M3448
15358I5168r6241N5871O0899n7386k166J12398M9502j62149j64453p3704n612
15347a87873l1107J19887J51040O0488q501K5634j16502j3671J83232L022O2296
15336B47945o2722j50399j04037M862J771J12140R7273J06040m4339q6855j00618
$$ y = [-124343, -58008, -86268, -84846, -215504, -262795, -137188, -146021, -190629, -142131, -76688, 19311, -99299, -29957, -189101, -302538, -234289, -270486, -177143, -51318, -116018, -191833, -285903, -162564, -59, 13249, 3348, 72308, 270472, 121168, 78275, 6498, 55073, -42450, -59034, 21737, 154235, 134461, 86087, 17036, 17442, 82239, -34895, -136444, -252946, -310197, -242674, -201833, -131916, -121351, -86889, 18613, 2334, -59300, 51720, 95168, -1073, 54798, 115697, 58311, 56145, 168543, 218045, 55896, -108557, -182261, -187873, -218980, -99093, 51947, 112435, 103934, 129568, 13066, -605, 182627, 185649, 247945, 185223, 34824, -69213, -64351, -62580, 49560, 146833, 252873, 208534, 121679, 21061]
15325B1061j15760m8828M4319m9600O7823l9778R1517K45672m3870M6776k435
15314B16897j22152r6254j47295J14642l1626k2293R0036J20519q7100P3693O7275
15303A76342j81478j16751J71669J96078q2798j29057k42061R189J37178N1193
15293a0496j38649m820l4748R4665o126j04498J7329j9019R0268K11176R1311
15282A86393o7273j29726J04368N6606j973N573j93108M1469J13459j6244l7063
15271F2481j62529j08361Q4005Q2948L5380j60277O9544m2528J05099L9010r7312
15260i2540n1032r104L3556J06522L3276m6156j9973K7986K2633J953n029J26567
15248A28659n6149Q9162N1961m2022k0230n6975Q334m3396L6694j5084q7708K4488
$$ y = [21061, -94699, -143527, -99208, -148808, -80985, -120763, -29246, 216426, 172556, 219332, 216897, 94745, -1509, -148804, -34162, -65788, -88081, 1955, 122474, 35374, 109067, 176342, -5136, -121887, 49782, 245860, 163062, 34005, -208056, -198867, -61689, -10496, -149145, -153965, -188713, -94048, -100174, -204672, -187343, -206362, -116094, 95082, 186393, 119120, -10606, 93762, 150368, 148395, 153968, -39140, 2329, 115788, 99544, 62481, -100048, -208409, -124404, -41456, -6076, -166353, -96809, -139337, -34238, 4772, -92540, -143572, -152676, -119120, -12598, 20678, -25478, -45451, -17465, 5168, 7121, 2092, 128659, 72510, 161672, 213633, 171611, 151381, 94406, 102740, 59344, 96038, 80954, -6754, 17734]
15236A7734M4116r4437p9249J3214j4047K1891J54096Q3605k3218j6835j9589
15225H7281o6926j33708j48571O0314K2098O530J20539J05204N5682O4535o2973
15214A10005j20876p3895K7500P3265n5445J4467j0374k00061R4994R8734Q8474
15203D6788j40667q8791j3955N3376k3011R5421J37678p5557m4835K3558O086
15192b3909R6951j992J4974j03791N4636J79895n2274j31618j50462m9604Q7317
15181g9877m4352j08544n9654j26533J74845J85679j06775K1580M101J36743p335
15170a0122j83697J05015O6905n8259j1783M3234j00810k09566N9085J45592j1119
15159a65525p063n5807J2625J0803P392n6404J44897Q6726o0574m8412O5664J65644
$$ y = [17734, 61850, -32587, -111836, -98622, -112669, -90778, 63318, 146923, 123705, 106870, 87281, 20355, -113353, -261924, -201610, -179512, -172982, -52443, 52761, 108443, 172978, 110005, -10871, -84766, -57266, 15999, -39446, -24979, -35353, -235414, -140420, -41686, 46788, -93879, -182670, -196625, -143249, -166260, -70839, 66839, -8718, -53553, -29995, -23909, 73042, 71050, 86024, -17767, 36869, 216764, 164490, 32872, -117590, -167194, -79877, -124229, -232773, -292427, -418960, -244115, -58436, -165211, -143631, -139530, -2787, -10122, -193819, -88804, -21899, -80158, -91941, -48707, -149517, -359083, -299998, -154406, -165525, -172588, -228395, -215770, -204967, -197575, -253979, -109082, -22356, -82930, -131342, -65678, 99966]
15147I9966m879j61391P2727l4519O0638j05021p9623J23244K2413L4794N83J2866
15135D1798K6178K24495p813j79074n8699p4142J97623K23181k8272j58607j44761
15124F1907m7359k39768p6474J25405J13856l6512L1973j91258L5934J50192j07464
15113a79568J5898P8952j2579Q5634R9265J3100p3295N416K789n849O3329j17208
15101b4116p0573n188j37901R2188J21797M5711j96382o9474J20539J23313N3269
15090E3183J11276J4109l3034K1127j70926o3872J14721L9454q8712o9563j04415
15079a76652j27261N0501J19044M7293O7956J06691l7334j92919j7216Q4559J5181
15068f0157k819L6050q6579o6340J51292R6497K5676j06408J1125l9942m8435
$$ y = [99966, 95087, -66304, 6423, -28096, 32542, -72479, -152102, -28858, -6445, 28349, 28932, 41798, 67976, 292471, 284658, 105584, 46885, -27257, 170366, 393547, 365275, 206668, 61907, 14548, -225220, -301694, -176289, -62433, -98945, -66972, -258230, -222296, -72104, -179568, -163670, -84718, -97297, -11663, 87602, 100702, 27407, 32823, 35612, 29763, 93092, -24116, -94689, -99877, -237778, -145590, -23793, 21918, -174464, -243938, -123399, -86, 53183, 164459, 178568, 145534, 166661, -4265, -68137, 46584, 86038, -2674, -72237, -176652, -303913, -253412, -134368, -87075, -19119, 87572, 50238, -142681, -159897, -75338, -60157, -62976, -26926, -113505, -179845, -28553, 67944, 93620, -12788, -1663, -41605, -90040]
15057i0040P0965K2167n7059K7048J20864l1762j25878O2769n8568N9416j49287
15046a49365L5380N5785M2811M5464m6136j00929m926J31203J04220Q54j21156
15035f795j34490P8202J19091O4933j24941q5603k4106K18214J60587j27656j11723
15024B5713R5120K9876M8846l1804o3649o0571r2512n9966m1584N5586M8248l1874
15012g8571j468O0165J12052q5412p3183p2572K6257j5768m6624l1912k4935p8077
15000c10048k202l7821P6863N0321M8894Q2303j6133O6658N9767R7689Q4180p7242
14988A23229j76486J19063J04496j59514j10806M3985Q6908j75284j05746P1983
14978a78172P2922n8191j15292m151k7660k3257O2132j2275J78993J00780l7159
$$ y = [-90040, -19075, 3092, -53967, -26919, 93945, 62183, -63695, -926, -59494, -78, -149365, -113985, -58200, -15389, 30075, -16061, -116990, -121916, 9287, 113507, 114361, -6795, -141285, -63083, 56008, 120941, -4000, -89603, -113709, 104505, 265092, 137436, 25713, 120833, 150709, 199555, 167751, 104102, 43531, -48981, -108947, -150531, -94945, -46697, -78571, -80039, -19874, 92178, 6766, -66417, -138989, -112732, -128500, -175124, -207036, -231971, -310048, -312250, -350071, -273208, -222887, -173993, -91690, -107823, -41165, 18602, 116291, 200471, 123229, -53257, 65806, 170302, 10788, -100018, -56033, 30875, -144409, -250155, -178172, -105250, -163441, -278733, -282884, -310544, -333801, -271669, -283944, -104951, -4171, -41330]
14967d1330k4910k7363p6793Q3035L0875L2942m0914n2790R9924J13413N5194
14956A51283l00159n5802J87825Q8789k22098j4168O65k3713O9012M6898M0888
14945c0580l6508Q9629j87033j21188q7010J24149J52290n5417k80755J13705
14935c18718J60700n760n8838l5172N2302N6899J04286n1072J15006q623M4528
14924E5538j24817o124n6899q307q5923L9619J00830k7914P8707K360R370R8548
14912G4988m1610L3771l9887l523j52897l8636l4144J42241K03909q700m0304
14901I5208n4693j61033J9338N541N4670L3533k9745Q1085m3766J1026j09719
14890i8555j08728K15386J77j16719J1712J14828R9462O9771J9227j67138j22708
$$ y = [-41330, -66240, -93603, -170396, -87361, -56486, -23544, -64458, -117248, -17324, 96089, 151283, -148876, -204678, -16853, 71936, -150162, -164330, -163665, -187378, -118366, -71468, -30580, -67088, 22541, -164492, -285680, -372690, -248541, -96251, -151668, -432423, -318718, -158018, -163778, -222616, -257788, -205486, -148587, -44301, -95373, 19633, 11010, 55538, -69279, -75403, -132302, -140609, -226532, -186913, -86083, -113997, -35290, -32930, -23560, 74988, 33378, 67149, 27262, 23739, -129158, -167794, -201938, -59697, 144212, 135512, 95208, 40515, -120518, -101180, -95639, -40969, -7436, -37181, 43904, 138, 11164, -98555, -207283, 8103, 8280, -108439, -96727, 18101, 117563, 187334, 206561, 39423, -83285]
14879h3285p9337J05388P6576L0226k4788j0813J8103j0600O400j9082Q3159O9507
14867A61454l7618m4987o9828L4520k2009N2720M7323r2068Q123j7615j82724
14856a62709j27784l9694K4687R8887J8684J24239K35204j03051k11761P8028
14846f5270q9260p2690J76763R3921N7180N1534k32117l6149J47361J34864j48526
14835A7611j10330j89015J7435J58867o7640O4349J85049j195j34796j16878M8373
14824a28170K6100O6243J14545m3992l5044J36512j34012M9787J28474Q3611k8150
14813B35904p4809O1119J00812j36463l05302J15268N8682j32616M5984J5114
14803a6307k3278P7588M2139Q7814m9475O188j40267r7548O9207J43405R7935
$$ y = [-83285, -162622, -57234, 19342, 49568, 24780, 13967, 32070, 21470, 27870, 8788, 91947, 161454, 123836, 78849, 9021, 43541, 21532, 74252, 121575, 29507, 37630, 20015, -162709, -290493, -330187, -305500, -206613, -187929, -63690, 171514, 68463, -143298, -65270, -154530, -227220, -50457, 43464, 100644, 152178, -79939, -116088, 31273, 166137, 17611, -92719, -281734, -264299, -105432, -173072, -108723, 76326, 75131, -59665, -176543, -128170, -102070, -35827, 78718, 34726, -318, 136194, 2182, 51969, 180443, 264054, 235904, 161095, 222214, 323026, 186563, -118739, -3471, 55211, -77405, -31421, -16307, -39585, 38003, 80142, 167956, 118481, 124669, -15598, -113146, -43939, 99466, 197401]
14792A97401k7170K6229R3255l4745j34908j11739j36984j92154K8541P612J23502
14781a61160J88168O0159j40527Q6500n0665J5630Q9181n9021O0902N5778k30986
14770h6041J5595J41028R7838K612R3574J06136o3004k48277k15369J02714l262
14759e6456l3517M0725P1253j65594l5736L8060j8730J98571Q0130N8195r808
14748A67093m7339k2278n1300j36084k13649j22296Q2990K02575P4289J0798j37415
14737a92616k29061Q6979K26381J18946k14939o2046J21360J78017q4748k48432
14727c00159l0470J51535J81204R1536j65548N5995M4141l2133j2743n9647r400
14716h5689m7030Q5760O7547m7729k27243k7769P4031j0615J62658k9829L4867
$$ y = [197401, 170231, 196460, 289715, 254970, 120062, 8323, -128661, -320815, -292274, -284662, -161160, 27008, 87167, -53360, 33140, -17525, -1895, 87286, 28265, 89167, 144945, -86041, -70446, 70582, 168420, 171032, 264606, 370742, 307738, 59461, -155908, -53194, -56456, -89973, -49248, 22005, -143589, -179325, -141265, -159995, 38576, 118706, 176901, 167093, 119754, 97476, 46176, -89908, -303557, -425853, -342863, -140288, -65999, -55201, -192616, -421677, -334698, -108317, 10629, -204310, -266356, -144996, 33021, -51727, -300159, -330629, -179094, 2110, 93646, -71902, -15907, 28234, -3899, -16642, -76289, -85689, -132719, -46959, 20588, -27141, -254384, -282153, -208122, -218737, -56079, -85908, -51041]
14705e1041L8030J6197r0021r6307j12163O9554L2876Q6378P9672p481M5801L7622
14693D9117j3722p4258n1000j5386l733J59295J79201j15618k88631Q0778J24559
14682C0602r867o9384j12032j78015L5272J89465J92783J35363J2408j39771k22096
14671a35272k5233n2997J01439J07620j13682J7052J10729j45197K6650J53343
14661D4452R7876q5686m7602J7414K6524J9745q3546j38502k4021j2326R3643
14650i2029p1097n6108n7572k2352K40046q816j74512R64K70463L03452j65150
14639A67289j15453N6777P1712j12131j81104j14111j01460M2432P7416l591p2884
14628b85108l709J24536J1130J73578K01325o8446l06095m1714L16883Q884r4222
$$ y = [-51041, -13011, 3186, -86835, -183142, -295305, -225751, -192875, -106497, -26825, -34306, 11495, 49117, 35395, -38863, -89863, -105249, -108982, 50313, 229514, 113896, -174735, -93957, 30602, 20735, -48649, -160681, -338696, -303424, -113959, 78824, 214187, 226595, 86824, -135272, -160505, -213502, -112063, -4443, -118125, -101073, 9656, -135541, -108891, 44452, 142328, 56642, 9040, 26454, 52978, 72723, -10823, -149325, -173346, -185672, -92029, -163126, -219234, -276806, -299158, -59112, -67928, -242440, -241476, 28987, 332439, 167289, 51836, 108613, 180325, 68194, -112910, -227021, -328481, -286049, -208633, -212224, -285108, -288817, -164281, -153151, 20427, 221752, 153306, -152789, -194503, 122380, 131264, 37042]
14617C7042J02518o937L3008n2505m4590K7857P797l2078n7738o1459j99126J4749
14605b31462J47321j06016L8146J12847l7869J1180Q0251R1411L1285j83907j58534
14594b05347j76808L8151N1926J63543L6239j61694j4115Q5450N9859K4543J42733
14583D4480J05964M047M7978k8593J0882j28188j13834Q7689Q2572j24360j7902
14572b9265L7780P2319R3076K446j31643j33274N9935J18725J19734J0333j50319
14561F9847p5980N0739k3423l1344n5578O6542J26139j03087p5783J7491J46262
14550A11825J86190o954K5045k49804j70393O4939j17868j51712j57473L0874
14540d35331R3228K5791J96441l2048l8257K481Q8604k5669j8857O4532n1775
$$ y = [37042, 139560, 132623, 165631, 113126, 68536, 96393, 104190, 72112, 14374, -47085, -246211, -231462, -84141, -190157, -152011, -39164, -77033, -65853, 14398, 105809, 137094, -46813, -205347, -382155, -344004, -292078, -128535, -92296, -253990, -268105, -182655, -122796, -98253, 44480, 150444, 154491, 202469, 173876, 184758, 56570, -57264, 30425, 112997, -11363, -29265, 8515, 80834, 173910, 176356, 44713, -88561, -28626, 90099, 209833, 220166, 69847, -6133, 44606, 21183, -10161, -65739, 803, 126942, 23855, -51928, -34437, 111825, 298015, 291061, 316106, 66302, -104091, -39152, -157020, -308732, -466205, -435331, -342103, -316312, -119871, -151919, -190176, -187695, -99091, -124760, -143617, -79085, -130860]
14529a30860j27747j14189J0932J56402J07965n7196K2597L06356N3489K3366
14519B51115p5032p5156q1601j57539J00405J47362J64929m5884j27134J49182
14509B50647L960j19161J38883N8756o7692p0254m5808j51549j88846J73218K22669
14498B04823k98285j85611J20964M9164j780P0429O9315M4162L1674M25K782q378
14486I9684R9397n5116J34995l6821o5425K2814j22362m0490M4203J00699j9300
14475A62278j39183K2851J51591J06279n5373j17746o0598k05291L9118J09251
14465A3177K9566j4296Q4509m3111k4437J923l2796J14642k1619j13772l8809
14454d5023J38317n6707p1290q9526N255j1027l1233L7200P7020j0294O9071L295
$$ y = [-130860, -258607, -372796, -361864, -205462, -97497, -154693, -132096, 174260, 227749, 251115, 176083, 100927, 19326, -138213, -37808, 109554, 274483, 228599, 101465, 250647, 254607, 135446, 274329, 333085, 265393, 195139, 149331, -2218, -191064, -17846, 204823, -93462, -279073, -158109, -108945, -110725, -40296, 29019, 73181, 104855, 105280, 108062, 99684, 199081, 143965, 278960, 242139, 176714, 199528, 77166, 36676, 80879, 181578, 162278, 23095, 45946, 197537, 303816, 248443, 130697, 70099, -135192, -96074, 13177, 42743, 28447, 112956, 69845, 45408, 47331, 14535, 129177, 107558, -6214, -45023, 93294, 36587, -34703, -124229, -118974, -130001, -161234, -124034, -47014, -57308, 11763, 15058]
14442A5058J8998j25047O1210J8311K9177R9056o988j1515j44803j44366j59732
14431c50641Q690J86056n8091j91735N0063J90690J84002r8808n5945p9062J63764
14420e1017N6431l2105j06552M5859K6082n980J15667o4136l9524J07J26550m6210
14408B5172l8861J0550N7850j0353j51982p523R5116L1958Q2410m1235j31356
14397g8254M021J05810Q5623J25015O0860M327o8222L5061k28932l38302j05220
14386c98213p871J01660J6587J13612R5153N3443J61785p0700Q6630J06148N276
14375B63510J5918o2738R0890N7800q5464l09117j11854J07315N2251j15104r3455
14364a90048n3901O6933J54511K2812j47157J16253J49591k32038j21338j7312
$$ y = [15058, 34056, -90991, -29781, -11470, 17707, 116763, 109775, 98260, -46543, -190909, -350641, -341951, -155895, -213986, -405721, -355658, -164968, 19034, -79774, -135719, -214781, -51017, 5414, -26691, -133243, -87384, -61302, -67282, 48385, -15751, -55275, -55168, 71382, 25172, -13689, -3139, 54711, 44358, -107624, -115147, -20031, 11927, 94337, 53102, -78254, -74233, 31577, 117200, 242215, 303075, 307402, 239180, 274241, 45309, -292993, -398213, -406084, -304424, -287837, -174225, -79072, -25629, 136156, 65456, 152086, 258234, 263510, 279428, 216690, 307580, 365380, 279916, -29201, -141055, -33740, 18511, -96593, -190048, -243949, -177016, -22505, 307, -146850, -30597, 118994, -113044, -234382, -251694]
14354b51694J46631J37444Q227R287l6250j37535M1751R4414N2625N8761O1351
14343A85012k39720j40464J9540J08585J51790n976M2356j1098j35568O688J77271
14332A58416Q1145j74087R2345J39668j9145o0040j7060j08125K4549l629Q9726
14321B03763J53945r6035l16308l114N9772R2846k8192k19555o2244K02564R5677
14310H3119l07328K9411J58497O4140O9220N2090O0629N9074K5634o4463O6973
14299B96996j9796j59852p3032l3541J1341r5466M9621j006o8358p9818J70007
14288b904n0934m0196K2379N0773L0324k8964p9843M6595J9137j06993m630P929
14276a37327J33839K8485o1409j02912J05100J51961P1016r9946L2866p0121l573
$$ y = [-251694, -105063, 32381, 40608, 49895, 13645, -123890, -82139, 12275, 64900, 123661, 185012, -54708, -195172, -175632, -67047, 84743, 78767, 121123, 110025, -25543, -18855, 158416, 239561, 65474, 157819, 297487, 278342, 218302, 201242, 93117, 117666, 114037, 203763, 357708, 261673, -54635, -57749, 2023, 94869, 66677, -152878, -215122, -12558, 83119, -224209, -194798, -36301, 27839, 97059, 149149, 209778, 268852, 294486, 230023, 296996, 277200, 117348, 44316, 10775, 22116, -73350, -23729, -24735, -93093, -172911, -2904, -53838, -94034, -71655, -20882, 9442, -19522, -99365, -52770, -33633, -140626, -145256, -137327, -3488, 24997, -36412, -139324, -34224, 117737, 188753, 88807, 121673, 51552, 47979]
14265D7979o16P421q5971P9633l5325l4241l534K3143j15350o1961J40420M6738
14253H336l5662K8322L2338q1962l3689Q8089J53256J15418J5119j05661q4452
14242I9452j28824k3941p1125J27799O7911j46650j93294j4769O2271K17538P4264
14231G0632K5534p4587n5130q4640J25732j0730K9391j57916q3927J16120J57946
14220E8425L2116j36407o1921p8320J00595L0316O0165L4131k2486r5253R9514
14209B0875O264o5103J7368Q8696P712J5252p9438q366m3344q150j40749m0106
14197b29089J00368K4581j2778l7745K10530j45459j32482N0751R2809P8855j20390
14186a20049n3314Q3415j26237M1645K0392J656j0315J69312j41182j38250N8094
$$ y = [47979, 47363, 54784, -31187, 48446, 13121, -21120, -24654, -1511, -116861, -178822, -38402, 8336, -27326, 996, 33334, -48628, -82317, 5772, 159028, 274446, 289565, 183904, 99452, -29372, -53313, -124438, 3361, 71272, -75378, -268672, -283441, -221170, -3632, 70632, 96166, 21579, -33551, -118191, 7541, -3189, 26202, -131714, -215641, -99521, 58425, 90541, -45866, -107787, -186107, -85512, -55196, 4969, 39100, 16614, -78639, 20875, 27139, -37964, -20596, 68100, 75812, 91064, 11626, 3260, -40084, -48234, -188983, -229089, -128721, -104140, -116918, -154663, 55867, -89592, -222074, -171323, -78514, 341, -120049, -173363, -89948, -216185, -174540, -154148, -152492, -162807, 6505, -134677, -272927, -214833]
14175b14833R8634J15482m2772k4432Q9360j30782m8628J52556J4828k8835j17519
14164a36941n096l2394j46224N7311J64462N185n742L4945J27831L0960K1299
14153A15596p703N6243L0448j74752j27270O6906M538K1071j02919M0727K2624
14142e4491o594k1245J14061j02287o8630O0943m372r9677r4291J0690N7646Q8584
14130a19663N0426m0675r767j5261J1048O224O565p3022P9797J71394P6232N2629
14118A95927M6512j6161J0214j19463j09950R41N8818r4520k1517n2576n0940
14107a52715J3409q598j11905K0565L0725J14967J857r3022m3094k8811J70966
14096h5656O039p2784p6754O6913N3942J13431J41001m8530j18425k8364N122
$$ y = [-214833, -116199, -717, -43489, -67921, 21439, -109343, -157971, -5415, 9413, -19422, -136941, -142037, -174431, -320655, -263344, -98882, -93697, -99439, -64494, 63337, 94297, 115596, 107893, 164136, 194584, 19832, -107438, -40532, -35994, -14923, -117842, -77115, -54491, -61085, -82330, 31731, -70556, -139186, -78243, -82615, -182292, -276583, -265893, -208247, -119663, -69237, -109912, -119679, -134940, -123892, -117668, -111103, -184125, -104328, 67066, 143298, 195927, 242439, 226278, 236492, 117029, 7079, 8020, 66838, -27682, -49199, -101775, -152715, -139306, -147904, -259809, -239244, -208519, -93552, -91695, -184717, -227811, -256622, -85656, -79617, -152401, -229155, -162242, -108300, 5131, 146132, 97602, -20823, -49187, -44065]
14085d4065j91276q3440j6766J82133J54178Q1101K8651j89311k13122j09N6108
14074b35918J1878Q5174O2689r7397k3070N0670k5721J11754M6418M4575q9152
14063e8100q9480N6606K3339Q2550R304J28094o229o4073R1682N576k38989j37761
14051a97481J11262O7775L4666q6297q8990R8399J90634M6470O649j32747l9193
14040A1147j6896r9461q237m159m5351n7109Q8183l170R8318M2820L5541l9978
14028A648J79787J29934j25094j03118j27075k7772q3939j64480q6346J79018
14018b27437J66941N3151k21j5253r794J84877j590p5297J6387J9864j0471k9294
14006G1863o3905K8004M8783j34804O0283J28661R3532P2728j31999o3344m9458
$$ y = [-44065, -235341, -318781, -335547, -153414, 764, 81865, 110516, -78795, -291917, -292026, -235918, -224040, -138866, -76177, -173574, -196644, -145974, -171695, -59941, -13523, 31052, -58100, -147580, -90974, -67635, 14915, 24219, 152313, 146084, 82011, 173693, 179269, -59720, -197481, -86219, -18444, 16222, -70075, -159065, -60666, 129968, 176438, 183087, 50340, 11147, -5749, -105210, -113447, -117606, -162957, -220066, -131883, -135053, -36735, 6085, 41626, 1648, 181435, 311369, 186275, 83157, -43918, -71690, -155629, -320109, -406455, -227437, -60496, -7345, -7566, -22819, -32613, 152264, 150674, 75377, 91764, 111628, 101157, 71863, 7958, 35962, 84745, -50059, 10224, 138885, 232417, 305145, 173146, 109802, 60344]
13995F0344j99203o948J77821J12478j50490j73890K3736L4329J70330L7518k9285
13984E6740J2431O357J58335J5685j19592p7355k93331j09004R1177J91912Q4004
13973A7359q4610N999P6683o9294Jr4659R796K7675M617J37737p5588j78368K50416
13960B7764J19475q9288j11000p1761K7455K2321j72871p0591J93859J07425O970
13949a0242k3872p3709L0910p3782N4257M7064j26486j34600P3660R5817N1552
13938h9431R2140K7735Q2625k16464m8522O9421M3050Q8952J32473J6844J6196
13927B15019k26418r7445M6951J05446R2994j3138j72030J286l9547J7904r7091
13916a66069K6510R8541O6840L7195j1493j73247J79468J47369r9347k59402j06453
$$ y = [60344, -138859, -145807, 32014, 144492, -5998, -179888, -156152, -121823, 48507, 86025, 56740, 69171, 75528, 233863, 249548, 129956, 52601, -240730, -349734, -258557, -66645, 17359, -67251, -61252, 15431, -53863, -53862, -148521, -138725, -111050, -106433, 31304, -44284, -222652, 27764, 147239, 57951, -53049, -124810, -97355, -75034, -247905, -318496, -124637, -17212, -10242, -34114, -107823, -76913, -150695, -96438, -49374, -175860, -310460, -236800, -140983, -89431, 2709, 30444, 113069, -103395, -151917, -82496, -39446, 49506, 181979, 198823, 215019, -11399, -108844, -61893, 43553, 136547, 123409, -48621, -47335, -86882, -68978, -166069, -139559, -41018, 25822, 63017, 51524, -121723, 57745, 205114, 105767, -153635, -260088]
13905b60088K4058R2995Q0176M7036p8246j4454m827M0992n0232m1046J5832k191
13893a49995p52J78038j72380o6759L2565k8512M369J08649M8284Q3775j02805
13882f5523N4282R2448P5485m3583j14425o0652r8621k9982Q9912M6345O6710
13871A2396m2194l941R8225l4039j26301J16659J94445p6923r8224j07786J17467
13860D9784j1943r5160j3825N3116L6456K8558M0798n8783q2170J30614Q4165
13849A61610n2396r6361j58856k0198j56n453L7491L0320Q6491L4368r5640L4054
13837d4726P0096Q0756J1461P7890q290q358n375j68786j83730K3095J79096k3861
13825g32r1971q2768J66191J01655J19303O5736n6285j11367P0507m2920O2935
$$ y = [-260088, -236030, -143035, -62859, -15823, -94069, -108523, -113350, -72358, -122590, -163636, -147804, -149995, -150747, 27291, -145089, -211848, -179283, -207795, -203426, -94777, -46493, 37282, -65523, -11241, 81207, 156692, 113109, -1316, -61968, -160589, -190571, -100659, -54314, 12396, -29798, -33739, 64486, 30447, -95854, 20805, 215250, 138327, 40103, -67683, 49784, 37841, -57319, -71144, -18028, 18428, 46986, 87784, 29001, -53169, 77445, 161610, 109214, 12853, -146003, -166201, -166357, -171810, -134319, -103999, -17508, 16860, -78780, -44726, 25370, 106126, 117587, 195477, 187187, 178829, 173454, 4668, -179062, -155967, 23129, -732, -92703, -175471, -9280, 92375, 211678, 277414, 221129, 109762, 180269, 137349, 200284]
13814B00284n8453j41377N2643n5178l5482J29150R4481j39785j20023J9497K8332
13803b5911K32783j9826p1023N9804q1689L5380j3421j19185J23337J69932j79664
13792A10517j16679K2939m7182j49199J11497Q5283p2876M9082M4600j61159o8299
13781a91476k0400K048m5488N3106K27940O5140K1676j47106p1580m5957N4633
13770i7464K16374p677n9651j7384J58468J8678O5243j9580L0365R9608o5916
13759C21064k13608p1142P4721j94029j36721J68648Q1931O7931L5787n9955j30265
13748e5638o6603j50537m3595J34102J40540p6631j80255L9558K97885K22784
13738B61610j34012k00350q35p2941N3308K4206q1359K4365Q4774J81438n8487
$$ y = [200284, 141831, 454, 53097, -2081, -37563, 91587, 186068, 46283, -73740, -54243, -25911, 206872, 187046, 116023, 175827, 94138, 129518, 116097, -3088, 120249, 290181, 110517, -6162, 16777, -30405, -179604, -68107, 17176, -55700, -6618, 37982, -123177, -191476, -211876, -209828, -255316, -202210, 25730, 90870, 112546, -34560, -106140, -152097, -97464, 118910, 111233, 51582, 34198, 192666, 211344, 276587, 257007, 287372, 386980, 321064, 107456, 36314, 111035, -82994, -219715, -51067, 30864, 98795, 134582, 74627, -55638, -122241, -272778, -316373, -182271, -41731, -118362, -298617, -259059, 38826, 261610, 127598, -72752, -73587, -146528, -93220, -69014, -150373, -126008, -41234, 140204, 81717]
13727H1717j16534l9302J24830k159j18470p1532P9563K56067R8035N6447M1056
13716C89718j54179n8243j24013r9895J67987R3112j63303k06962o1014J21249
13706i5543K1097Q841N5265R5583N9162r736L5692n348p950R500l4038j35175
13694b650p999j09867J5939J90056q4051m7308n535K15368N9832N3417P2501r5586
13682B54117k31089j15887q7284R231o0298K305K63942P538j50367j06717q4349
13671b98858N2950K07854R1944j91499l436O5901l6188l5086l6518N3314N1803
13660g7819J16721J64774K5822o1720o8617r223j28031p1734J31038J83970Q6705
13649B91886j06108k03545L56P6629M0310K27456j30945j06762P6703j72809r8694
$$ y = [81717, -34817, -74119, 50711, 48552, -69918, -141450, -61887, 194180, 292215, 348662, 389718, 235539, 177296, 53283, -46612, 121375, 214487, 51184, -155778, -216792, -95543, -74446, -65605, -10340, 85243, 144405, 134669, 170361, 165013, 157063, 166563, 132525, -2650, -10649, -120516, -104577, 85479, 1428, -45880, -51415, 163953, 223785, 277202, 349703, 254117, 23028, -92859, -180143, -170912, -231210, -228905, 35037, 42575, -107792, -214509, -298858, -245908, -38054, 53890, -137609, -141045, -75144, -111332, -146418, -182936, -129622, -77819, 38902, 203676, 229498, 167778, 99161, 89938, -38093, -109827, 21211, 205181, 291886, 185778, -17767, -17411, 59218, 99528, 326984, 196039, 89277, 165980, -6829, -105523]
13638a05523j2042m4956o7642R5243P0171M0649N9539J00494o720k24731P0702
13627b4816J52797k8679j90945O663K20254J8871L5305P7942p4019j27473l2314
13616C3586R377j29543k20686N1039L9075k9098m7518K8548J4113J06531k998
13605a47574n9115R9998l0758j93814q8365K9540j6662K01457K12721j21981j85985
13594c00538K4912L5701m7750R9687j46651j6400R4406K4307Q5634K0036j34714
13583b61370N2945P9418J07397N5767Q3705n6034K330P0174m7389N2063J02966
13572B41972N3390j45837j65969l40o2503P3640K04433J01350m9792j86120k6476
13561C7748l0717J58221J10496k11553o7728o8748j54601j9708K45315m32L267
$$ y = [-105523, -117565, -162521, -230163, -134920, -64749, -24100, 35439, 135933, 129213, -95518, -24816, 127981, 99302, -91643, -84980, 135274, 154145, 189450, 267392, 193373, 65900, 33586, 42963, -86580, -307266, -256227, -217152, -246250, -293768, -265220, -251107, -144576, -147574, -206689, -106691, -137449, -331263, -419628, -390088, -406750, -205293, 7428, -114553, -300538, -275626, -239925, -287675, -187988, -334639, -351039, -256633, -232326, -146692, -126656, -261370, -208425, -129007, -21610, 34157, 117862, 61828, 64158, 134332, 86943, 139006, 241972, 295362, 149525, -16444, -16784, -79287, -5647, 198786, 300136, 250344, 64224, 37748, 7031, 165252, 275748, 64195, -3533, -72281, -226882, -246590, -1275, -1707, 1560]
13550A560J63303J74268j9166k05734q6838j66439O0933l1594k3155n812K07610
13539F8936K3517K5738K9952M0265r3199n5986r0360j61433n2710J12934q8951
13528b41297J07802K60566K4691k27114K2137j7316r3657k9839K21130l1192J23315
13517A19226P3877m1781j90236p9076R3152J19377J30123j737j93682l6087J10623
13506A03779J19840j03362k17515q6459J1233J00019k8112R316n9644j42055M6094
13495b46866N9269P6357J17890P0461J08748j9055j62396m3862r3582l5048L2673
13484a35411L5742j01119n2580K7759J06902j1032N7272Q814j04180J78115K4536
13473C4818K9713P6200M7608P3930P3666K8923n9288j23730n519O7867o2598j55937
$$ y = [1560, 164863, 339131, 319965, 114231, 27393, -139046, -78113, -109707, -132862, -138674, 68936, 92453, 118191, 148143, 188408, 95209, 39223, -51137, -212570, -265280, -152346, -241297, -133495, 127071, 151762, -75352, -53215, -70531, -164188, -194027, 27103, -4089, 119226, 193103, 151322, -38914, -117990, -24838, 94539, 224662, 222925, 29243, -6844, 103779, 223619, 120257, -97258, -183717, -172484, -72465, -100577, -91261, -150905, -292960, -246866, -187597, -111240, 6650, 77111, 185859, 166804, 4408, -39454, -133036, -168084, -135411, -99669, -200788, -253368, -225609, -118707, -129739, -72467, -63653, -167833, 10282, 34818, 64531, 140731, 188339, 262269, 335935, 364858, 305570, 181840, 176321, 244188, 181590, 25653]
13461B5653j69340J24262J91607L5867o2247K3633J66902p2252j75821j14812
13451b6548R8435j3616j05924o8509J01388m3771k2298N6646j41393k1432Q8782
13440i8240K30513R9507k16722p1375l9767j5800Q005J3840o2718j2539J01587
13429f3709J19481M9735q6840j2184j06624J27435P1980J07720K4801j22842k09029
13418a00076p0142J17561K16402m0832j01689n5261O9115j1336N5883k096J07942
13407A85471k0735o6982m9950q3831j02368n5700J9732P3535J7217m0784J40763
13396A6368j08544j33247J26887M6997k8273o7230J68323J55992J14024j1135
13386B80162m0068n2512J14768k1540p1023p3904N7146J0582m9811m1907p8647
$$ y = [25653, -143687, -19425, 172182, 208049, 145802, 169435, 336337, 264085, 88264, -26548, 71887, 58271, -47653, -116162, -14774, -58545, -80843, -24197, -165590, -187022, -98240, 132273, 231780, 15058, -56317, -96084, -111884, -103879, -90039, -152757, -165296, -63709, 55772, 105507, 18667, 6483, -100141, 27294, 99274, 206994, 231795, 108953, -100076, -170218, -52657, 163745, 122913, 21224, -34037, 35078, 23742, 79625, 77529, 185471, 164736, 97754, 47804, -36027, -138395, -194095, -174363, -100828, -83611, -124395, 16368, -92176, -225423, -98536, -51539, -79812, -147042, 21281, 177273, 291297, 280162, 240094, 187582, 302350, 280810, 209787, 135883, 193029, 203611, 153800, 111893, 33246]
13375C3246J3747q6204k33718k721J26885P3437j39095L0961l7545p5760J02850
13364a93917J41888J80995j22064j00480o7844q0638J31491K0238j0132O172K5133
13353f9158K099R8675k6821j93187j40605J14983K53375j4399J09397K5155j04847
13342E4667r2816j64742o8721O4150R507J14533O4434J92292O0912n8863q0374
13331I4979J43552l3215j24128k3794j07407p8563m2108J31607m0736j21564P0588
13320a30789K21398O4613k41102j46050N4440N0442J54774K03789J7718j25484
13310A23749k27789j79532J32840K05274M5357J2733n9477p8164J92827P3366
13300B41184j25245j55336L7248R9858o129j6089k3461J1948n8411j2821J8161
$$ y = [33246, 46993, -39211, -272929, -275650, -148765, -75328, -214423, -183462, -221007, -296767, -193917, -52029, 128966, 6902, -93578, -161422, -242060, -110569, -90331, -100463, -94291, -69158, -67059, 31616, 4795, -188392, -328997, -214014, 39361, 24962, 134359, 159514, 54667, -38149, -202891, -271612, -207462, -197955, -83422, -18988, 173304, 234216, 175353, 94979, 238531, 205316, 81188, 57394, -50013, -128576, -170684, -39077, -79813, -201377, -130789, 90609, 155222, -85880, -231930, -177490, -127048, 27726, 231515, 249233, 123749, -104040, -283572, -150732, 54542, 99899, 112632, 53155, -25009, 167818, 241184, 115939, -39397, -2149, 97709, 91580, 75491, 52030, 63978, 5567, -7254, 10907]
13289A0907J15579o9860q4569J68770R4331q5347j19056q5609J1377J12515J15144
13278A84182j08021p7179k39023k19587R3728J55517J33208J9453M4152P037J96965
13267A90432J0895P317m2427n7155o5729j90802J1204R194m3044J0854R5177m7113
13255a11197J8035Q3554j6476O6688j80018J2937J58938j357N5666r9453J12484
13244I9801J1995m1418j8459m7436J30871Q3598j10990k60345q7882J82389K4428
13233c3448j3480R1287o2p3003n5896N829J1095l1867k7541k5757O6031k5848
13221a12660J24772J94258n2550q3637J92318J09699j4691j24961N3103j94K4589
13210C10046j11535m7790j70549L5044j1600J94169n6287j35082q9993O7909K07790
$$ y = [10907, 126486, 56626, -27943, 140827, 235158, 149811, 30755, -54854, -43477, 69038, 184182, 76161, -1018, -240041, -459628, -365900, -210383, -77175, -57722, -13570, -6533, 190432, 201327, 208644, 166217, 109062, 43333, -147469, -136265, -127071, -170115, -159261, -64084, -111197, -93162, -9608, -26084, 40604, -139414, -126477, 32461, 31104, 86770, -12683, 99801, 111796, 70378, 51919, 4483, 135354, 218952, 107962, -152383, -240265, -57876, -33448, -46928, 44359, 44297, -28706, -84602, -78773, -67678, -99545, -127086, -152843, -86812, -112660, 12112, 206370, 153820, 70183, 262501, 372200, 357509, 232548, 285651, 285457, 310046, 198511, 150721, -19828, 15216, 3616, 197785, 141498, 6416, -83577, -15668, 192122]
13199A92122J69488Q7879r3310k14170O313L1348O1604N2910j11407K9792Q653
13188B21222r321l0491k2191M0536k19236L3152J31367Q5974j68996j42833j30022
13177b10839N2410J57215J02135l070J32160O2778j37927j39419n6979O0973J48840
13166A68277r1320j00425K652R1189N8832K4874j51309o6868R3636J14338J73613
13155C17489q412j74125r4082o6343N6702l4128j43314M8337N8097P6721L0066
13144F7008Q0306j23909k12630J29032L232j96949M2765K34409P2777K1062o0219
13133E6884j25477J18193R4246o3696j30966j4961J86022R9973j72328j05790
13123e7900K43711J34700Q4195k87955M374O7599k6549n6774j9121J17191l200
$$ y = [192122, 361610, 449489, 356179, 142009, 148322, 179670, 241274, 294184, 182777, 212569, 221222, 211901, 181410, 159219, 199755, -19481, 13671, 145038, 231012, 62016, -80817, -210839, -158429, -1214, 100921, 97851, 230011, 292789, 154862, 15443, -41536, 19437, 168277, 76957, -23468, -20816, 70373, 129205, 154079, 2770, -64098, 29538, 143876, 317489, 309077, 134952, 40870, -25473, 31229, -2899, -146213, -97876, -39779, 36942, 67008, 147314, 23405, -189225, -60193, -56961, -253910, -211145, 23264, 96041, 117103, 56884, -68593, 49600, 143846, 80150, -50816, -65777, 120245, 220218, 47890, -57900, 185811, 320511, 404706, 116751, 121125, 188724, 162175, 105401, 86280, 203471, 200271]
13112B00271j06591l3099q1213l1913J0444j7585J20781K30320j19630j84124
13102a2339l2008L1709J4811j12177j3232R7704J22461J06868k25158M1098J58104
13091A77841N4874m6766j93734k01743N2736j76725J29789J69717N7324j2569
13081A0744k4654M5148J01656l1131o1731n5658p5049r709N5145j10364O5215
13070i0388J1640p7884R6083R473l0075P94J21714J10717J6687L5862J20463R9877
13058D24963p3116j76035k32612J8560R0206j3866P1759J09141j16861J1942R0610
13047B04691k06228q244N4099k3057o7222J44154J7130j16800l8858L3196q2713
13036h9852K0264J18586M8143P4474N4281j57868k06882O4427J96316j66350j92309
$$ y = [200271, 93680, 60581, -20632, -52545, -42101, -59686, 61095, 291415, 171785, -12339, -44347, -12638, 2173, -110004, -123236, -25532, 96929, 203797, -21361, 19737, 177841, 232715, 185949, -7785, -209528, -156792, -333517, -203728, -34011, 23313, 10744, -13910, 31238, 132894, 101763, 40032, -15626, -90675, -100384, -45239, -155603, -90388, -78748, -156632, -60549, -51076, -81151, -80357, 41357, 152074, 168761, 204623, 325086, 424963, 351847, 175812, -56800, -38240, 51966, 38100, 109859, 219000, 102139, 114081, 204691, -1537, -9781, 44318, 21261, -45961, 98193, 115323, -1477, -40335, -7139, -89852, -69588, 48998, 97141, 171615, 225896, 68028, -138854, -74427, 121889, -44461, -236770]
13025b36770j39680N2121Q5840m118J26952J44724R6855M4428j5617k7853k6126
13014A00756j2214N5835j01985n0678M6962R7058J0964M5974p2998N6076K5730
13003B01480q2328j32826p5237J4710R8379K5015j12956j24103j7342k9870R9657
12992a35421M8299Q0678O6104J1068r8742j55187L7098Q3440l8752N1427R1352
12981D1364Q4444j87055k33692o4902J11927J57217p775R5293M1347P2670r4025
12970A6813L2951P6382p1966m5678m8919J51652O3700k6904L5426o7207j08000
12959H250j64316j49901P2248j9269n2724J40682J31807P0597n6904j06383p2020
12948a97933l6148K29742J38050N177N7582J301J07932Q4937l2675m1152k02183
$$ y = [-236770, -376450, -324329, -238489, -242607, -115655, 29069, 125924, 170352, 154735, 126882, 100756, 88542, 144377, 42392, -8286, 38676, 135734, 146698, 192672, 119674, 175750, 201480, 119152, -13674, -88911, -74201, 24178, 49193, -63763, -187866, -205208, -235078, -135421, -87122, -6444, 59660, 70728, -28014, -183201, -146103, -62663, -101415, -49988, 41364, 125808, -61247, -294939, -359841, -247914, -90697, -98472, -3179, 38168, 110838, 16813, 49764, 126146, 54180, 8502, -40417, 111235, 174935, 148031, 183457, 116250, 8250, -156066, -305967, -233719, -252988, -305712, -165030, -33223, 37374, -19530, -125913, -197933, -234081, -4339, 133711, 138888, 196470, 197771, 305703, 390640, 357965, 316813, 114630]
12937A14630j5223p2463J2712N178O843J32087j0886k1342j58119J3761J10887
12926A18065m9288j73528P1770P0589j37768M00J30561j79181n2554K8552J10890
12915f1492Q7078l6186l0121p9073P8146P1979p9120J28175m493j26375q5429
12904a36911R3732J81208o1509j32433O0388j9647m1303J14753r075l1327N7200
12893G5076O3839p8334p8137q9979J15972j50557R8985M4087o070j04715r0606
12882b00439J52171K74026N7376L995O8434j2658r838j15599j5501o4650o3999
12871G3318Q3769J26043j50259j72311p5065j32393J24543L5030K5075J42418
12861H0168K26724j64197m38567k6533K48952K33151p9853j17366J06354Q8464
$$ y = [114630, 99407, 26944, 39656, 44834, 51677, 183764, 172878, 151536, -6583, 7178, 118065, 68777, -104751, -32981, 37608, -100160, -99760, 30801, -148380, -200934, -172382, -61492, 25586, -10600, -40721, -119794, -41648, 30331, -48789, 79386, 74893, -51482, -136911, -43179, 138029, 76520, -55913, 4475, -15172, -56475, 58278, 49203, 17876, 75076, 138915, 60581, -17556, -107535, 8437, -142120, -43135, 952, -5118, -109833, -200439, -48268, 225758, 283134, 287129, 355563, 342905, 333067, 217468, 201967, 137317, 73318, 157087, 283130, 132871, -39440, -114505, -246898, -122355, -87325, -62250, 80168, 306892, 142695, -295872, -322405, -73453, 159698, 79845, -37521, 68833, 157297]
12851A57297l76o9269r2413O8404n6123L1066j08384j41078L56J87904J39817
12840A17201m7798L6804R4397M406P1548K1800P5756O6810j84637j96874k7337
12829C2076M8921K1043j45087j8794M154l7304P6114K020R7969K02489J579p3317
12817B11863m8392M7810j30947q1720J84679L702r8464J06096P7779n6064J26841
12806C43183m9603k0126j093J09804j27004m7476j72245n5752n6908k5072O8077
12795c4215J45510q031J10517J15069o4555M0054J7041q4126j34346J27617n913
12784B24622Q9570L2593j00015j58420q5524l6944J99947J71413Q2206o3586P7285
12773D33147p2382o3290j29024M0157j20936Q6375n2499O1882J42625j12018k61223
$$ y = [157297, 156921, 87652, -4761, 63643, 7520, 38586, -69798, -210876, -210520, -22616, 117201, 69403, 106207, 200604, 205010, 276558, 298358, 374114, 440924, 256287, 59413, 32076, 80997, 102040, -43047, -61841, -57687, -94991, -18877, -16857, 81112, 283601, 285180, 211863, 163471, 211281, 80334, -1386, 183293, 186995, 88531, 194627, 272406, 216342, 343183, 293580, 273454, 272361, 382165, 255161, 207685, 35440, -20312, -77220, -102292, -34215, 111295, 103264, 213781, 328850, 264295, 304349, 321390, 237264, 102918, 230535, 224622, 314192, 346785, 246770, 88350, 2826, -34118, 165829, 337242, 419448, 355862, 433147, 360765, 297475, 168451, 208608, 87672, 174047, 121548, 183430, 326055, 214037, -47186]
12762d7186l0238n8252P2758l9270n0300n8793K5149Q8797M0243m5908q3794l6530
12750b23324K79750N8766J6113J7322J9050J49194j55226r5930L1019k3915J61305
12739B34124J0573k8569j8301k6652r9317k8618J00215j36113L1366K84260m359
12728C18609k62435j61791J1805p639O1649N2228N7456l5750M9460Q2970p6345
12717I0217o8015J71763l4766R375P5530N857m5652K3863j22829o6255o2376O6736
12705D3448M7678j1571j0009r9484j7680J04421N8732p4295O1305J04902J30495
12694C37942N0117r4481o9000J5006m297m8103j26864K0913N6295P8620J44465
12683C60613j91000j07699k167R3652m7578k0418P6084l656P7792l7740P5522
$$ y = [-47186, -77424, -135676, -62918, -102188, -152488, -211281, -186132, -97335, -57092, -103000, -186794, -223324, 56426, 115192, 131305, 148627, 167677, 316871, 161645, 65715, 96734, 72819, 234124, 244697, 216128, 197827, 171175, 71858, 43240, 143455, 7342, 38708, 322968, 318609, 56174, -105617, -93812, -101451, -39802, 12426, 69882, 34132, 83592, 166562, 90217, 22202, 193965, 159199, 168574, 244104, 249961, 204309, 228172, 105343, 39088, -23288, 43448, 91126, 79555, 69546, -29938, -47618, 56803, 115535, 41240, 102545, 207447, 337942, 388059, 293578, 224578, 239584, 235287, 187184, 60320, 81233, 137528, 216148, 360613, 169613, 61914, 59747, 153399, 105821, 85403, 161487, 157831, 235623, 197883, 273405]
12672B73405J54479r5759n3619J12074K9332l3589j99171r4890j7121L3760m8074
12661F0827n1353J11555k1912m8764L8776N2669K6312j66976r8517N151n6027
12650a48259J30556J21504P6624p831N0350r3241P4056l0482J9979o996n3205
12639A33055O0177N9044J52556m2938l8311J5331j6080o710p7639n3840O4361
12628B49006o2387k7782N1574j28145j05758j25222q8092P530L35977J23614L7572
12617B67887j4237M5776J1205k28358M187L7621J24392o897j42664j37641r1273
12606a30002l4966N1602K37220r4787L6943K60086R350l4195k0654m9862J1536
12595B42271r1351j95768r8948P4332Q3613P4799J1433n4469j23697J33024J40696
$$ y = [273405, 427884, 332125, 278506, 390580, 419912, 386323, 187152, 92262, 75141, 108901, 60827, 9474, 121029, 99117, 50353, 89129, 141798, 168110, 1134, -97383, -92232, -148259, -17703, 103801, 180425, 172594, 222944, 129703, 203759, 173277, 193256, 186260, 133055, 193232, 252276, 404832, 361894, 323583, 338914, 322834, 316124, 238485, 184645, 249006, 186619, 158837, 210411, 82266, -23492, -148714, -236806, -229276, 106701, 230315, 267887, 253650, 299426, 310631, 82273, 86460, 124081, 248473, 241576, 98912, -38729, -130002, -164968, -113366, 123854, 29067, 66010, 326096, 335446, 301251, 280597, 230735, 242271, 150920, -44848, -143796, -69464, 14149, 88948, 100381, 45912, -77785, 55239, 195935]
12584A95935p2694N6198K21535L5265k18779L2934K884Q3265m4602j57642j46534
12573a2235p7870J93279K04459J5826Q0011J72753L8794j09413j15085q4470o8234
12562B37815N6464l05825l3649Q5949J0502J99418m7868n3408J2591P0454O8255
12551C00698N5404r022j38743j7603K3075n9912r6944n8664P3026K2874Q0571
12540A74760J0862J12241l912k5551j12326j1332P6955Q3190L7754j9623M3686
12529C66704j9393N729j40504q0107p382k2371n0603L6156l973M6258K3772R3889
12517B48175P2821n1585j20937k9541J11967O7068n3521n0880P7325K7939k9985
12506B68846o970m5675P3875N0431R3544K8583j0384j899j57687J0660L636m3334
$$ y = [195935, 123241, 179439, 400974, 436239, 217460, 250394, 253278, 336543, 291941, 134299, -12235, -90105, 103174, 307633, 323459, 403470, 576223, 615017, 505604, 390519, 306049, 237815, 294279, -11546, -45195, 40754, 51256, 250674, 202806, 149398, 161989, 232443, 300698, 356102, 347080, 208337, 190734, 213809, 153897, 56953, -1711, 71315, 94189, 174760, 185622, 297863, 293951, 268400, 156074, 144742, 221697, 304887, 342641, 323018, 366704, 347311, 353040, 212536, 132429, 125047, 102676, 52073, 88229, 84256, 130514, 154286, 248175, 320996, 269411, 148474, 118933, 230900, 297968, 244447, 193567, 270892, 298831, 268846, 261876, 216201, 290076, 340507, 434051, 462634, 452250, 450351, 292664, 303324, 306960, 263626]
12494B63626q2331J73302N0705M7361R4676M336j01179m5948M646Q2371j69690
12483C21875k89000N5339J10497J08322R273K0024J02370J33813O8865j41467
12473D99911j30834Q00j0391m1077Q852m8630j00983J94304R5327J50556q1547
12462E36288k08425k9889O3878j74597Q800P5000J62769J46511r11j41623l580
12451D34221J07589K2617L7126J47797j16638j88279j07170m290J0686N7954O9926
12440D71539l3999k15744J8535P6863N5310J44292k3836m3024o6327J9977J24816
12429E28402n8663k1416L8007j07605o2757m6500R0867J20833Q019k08938r5438
12418A84811J18052K31030K21810O3521j34050j38915j09534q7241J08962Q9136
$$ y = [263626, 181295, 354597, 405302, 452663, 547339, 551675, 450496, 404548, 409194, 491565, 321875, 32875, 88214, 198711, 307033, 316306, 336330, 438700, 572513, 641378, 499911, 369077, 369877, 359486, 318409, 327261, 278631, 177648, 371952, 467279, 617835, 536288, 327863, 297974, 361852, 187255, 196055, 271055, 433824, 580335, 579424, 437801, 434221, 541810, 564427, 601553, 749350, 632712, 444433, 337263, 332973, 343659, 401613, 471539, 437540, 221796, 240331, 317194, 372504, 516796, 492960, 449936, 383609, 403586, 528402, 469739, 448323, 486330, 378725, 315968, 269468, 360335, 481168, 489187, 280249, 184811, 302863, 533893, 755703, 819224, 685174, 546259, 436725, 349484, 458446, 547582]
12408E47582K35800K06771N1554j95275p1013j26143j6935q1751n1885l3474J16519
12397E81750R6221j6139r9721J04960m8300O8066l6382k17795j92790J30472L35491
12386G05833J42718j20493l30593k1220Q0059J18320J34352j5057k660n9378p7731
12375E54150N042Q1882l2947n2437m1833O0195j5250p6585P6044j06591n815j4340
12363D31515J36224J3352R1523L4335o7627r6454P0753k066J15653L8873m0431
12352G25650k7602P1316j99176o9238J202J41890N4575j48848R2082n481j3293
12341F23077L1268J14630K7484j75138j41918o9435j12452J85695J28202k3548
12331E87865N2907j5066M8062j88974N5847Q1393n6240J86093P2829M232R3705
$$ y = [547582, 783382, 990153, 1041707, 846432, 775419, 649276, 632341, 550590, 498705, 465231, 581750, 677971, 661832, 562111, 667071, 618771, 686837, 650455, 432660, 239870, 370342, 705833, 848551, 728058, 397465, 376245, 456304, 574624, 708976, 693919, 691259, 631881, 554150, 559192, 641074, 608127, 555690, 513857, 574052, 558802, 482217, 558261, 451670, 445855, 431515, 567739, 581091, 672614, 706949, 639322, 542868, 613621, 611555, 727208, 766081, 725650, 698048, 769364, 570188, 500950, 502152, 644042, 698617, 549769, 641851, 636370, 623077, 654345, 768975, 796459, 621321, 479403, 409968, 297516, 483211, 611413, 587865, 640772, 625706, 673768, 484794, 540641, 622034, 565794, 751887, 824716, 828948, 922653]
12320I22653q3294q1276k6o1749r9507r733M5926K3311J01491l4701P5408P4436
12308H72939m9423o4315J33871l6089j43568N3985K45978M7686m9316r3049O6747
12297I85446M9183p0117o774K9098p1541J14806K6750P1981l7878j2888K3763
12286A101829J4698k24895j60619J47162J25893J53732j9191J45489M8872j20602
12276A212368j74649n4606K5177j32937m7417J62599K86733p4269m6878P726J43391
12265A307238J24789k2685j73348m1348J04503j0363j036j23104j01184J54270
12255A217732O7189N4485P9229p3830J96510K4283K1677m1895j28250j32026q8870
12244A196234Q1650K04827J2693o1107R5173p1198j6497p8740r9784P8951J36461
$$ y = [922653, 839359, 758083, 758057, 696308, 596801, 587068, 632994, 656305, 757796, 723095, 798503, 872939, 823516, 759201, 893072, 856983, 713415, 767400, 1013378, 1061064, 1011748, 918699, 985446, 1034629, 964512, 957738, 986836, 915295, 1030101, 1056851, 1128832, 1090954, 1078066, 1101829, 1116527, 891632, 731013, 878175, 1004068, 1157800, 1138609, 1284098, 1332970, 1212368, 1037719, 983113, 1008290, 875353, 827936, 990535, 1277268, 1202999, 1156121, 1163847, 1307238, 1432027, 1409342, 1235994, 1194646, 1299149, 1288786, 1287750, 1164646, 1063462, 1217732, 1284921, 1339406, 1418635, 1344805, 1541315, 1565598, 1587275, 1545380, 1417130, 1285104, 1196234, 1277884, 1482711, 1495404, 1434297, 1529470, 1458272, 1441775, 1363035, 1263251, 1342202, 1478663]
12233A478663J59434Q783q7186k0473o5908o4204J9733M5744O932r2987q2044
12222A306487K25220J15679p2701M981Q9952J42705J31209j3417O9154q9015j34220
12211A776034j30131O7477J16845k9857q3741N5904O8340K17452R0910J40328
12201B289561J62648o8254l3929k1998k56492j13316P3012Q0003q1077k663N1652
12190B079147N4647L2389K5296J5530Q8370N4223J538o3980m5114J89879J15339
12179B547264Q4861N0655r5529j15339j72486r615R1335J69508j5757k13318j8410
12168B303169K69576J75914n7258n4505J5576p0102M7064J27384L622k3893K7610
12157B764157j5844r0714m4379J9791J08431J51614q39J01392J2215L7447m1349
$$ y = [1478663, 1638097, 1646880, 1559694, 1539221, 1473313, 1409109, 1428842, 1474586, 1481518, 1388531, 1306487, 1531707, 1647386, 1574685, 1579666, 1669618, 1812323, 1943532, 1930115, 1999269, 1910254, 1776034, 1645903, 1713380, 1830225, 1800368, 1716627, 1772531, 1840871, 2058323, 2149233, 2289561, 2452209, 2383955, 2350026, 2328028, 2071536, 1958220, 2031232, 2111235, 2030158, 2027495, 2079147, 2133794, 2166183, 2191479, 2207009, 2295379, 2349602, 2351140, 2287160, 2242046, 2431925, 2547264, 2632125, 2682780, 2587251, 2471912, 2299426, 2289811, 2381146, 2550654, 2534897, 2321579, 2303169, 2572745, 2748659, 2691401, 2636896, 2652472, 2582370, 2629434, 2756818, 2760440, 2736547, 2764157, 2748313, 2657599, 2613220, 2633011, 2741442, 2893056, 2892217, 2993609, 3005824, 3043271, 3001922]
12146C001922Q8631J17309l2269j8145J53806p7728j06525O6384P4531J45617
12136C413533j2650j13992R191J50781Q3635R2539p5939l7307q5085M1700K29548
12125C695954J45630J48703K2505q8104j14061n1544l7449j1989J75513L4019
12115C919177j73258O2204J30111R281o3865J39937M7189j12199O7829J67127
12105D193533M5500j22126j00418J5762N2178R2993K78718Q0526K3011k13089
12095D346588m9855J17390J25951K1730k06155j37870j3727l6707r3424J33494
12085D207415J15557K77273m5064k45191M8502J21701j2969q0085L4794N8668
12075D480601j41076J9273J44895R5619R7892j50648m501J43781j1164j66837
$$ y = [3001922, 3090553, 3207862, 3175593, 3157448, 3311254, 3233526, 3127001, 3193385, 3267916, 3413533, 3400883, 3286891, 3296082, 3446863, 3530498, 3623037, 3547098, 3509791, 3424706, 3466406, 3695954, 3841584, 3990287, 4012792, 3924688, 3810627, 3759083, 3721634, 3709645, 3885158, 3919177, 3745919, 3808123, 3938234, 3947515, 3883650, 4023587, 4070776, 3958577, 4026406, 4193533, 4239033, 4116907, 4016489, 4032251, 4084429, 4177422, 4456140, 4536666, 4559677, 4346588, 4296733, 4414123, 4540074, 4561804, 4355649, 4217779, 4204052, 4167345, 4073921, 4207415, 4322972, 4600245, 4555181, 4309990, 4358492, 4480193, 4467224, 4387139, 4421933, 4480601, 4339525, 4358798, 4503693, 4599312, 4697204, 4546556, 4542055, 4685836, 4674672, 4507835]
12065D507835m1306o4934j98204o8479K82994K50832p2704j63267J37974K2665
12055D593406k0241L5548P2053j6675O4041q176k0142J3471K6475q7687m6487
12044D605586K0288j39315m8746l5883j3189R2098J05335M4712j02053j65082
12034D363751o9394R798r0710J0751J09862q998j93746k4884O3186q9412M4611
12023D124815J09128j1485j24797o6879J4911j90879L7059K25858P9429k11649
12013C985511k59015M610J39879J50532j26129j54510K1019J8832Q5391Q1416
12003C947536O2556q6359j35165j21j18956j87351L084m5728N5593O599n0274
11992C451414n7792m5368j00730R2140r8741j0100R0547K8347R0316r4138j93753
$$ y = [4507835, 4466529, 4401595, 4203391, 4134912, 4417906, 4668738, 4596034, 4432767, 4570741, 4593406, 4573165, 4608713, 4680766, 4664091, 4728132, 4719956, 4699814, 4713285, 4739760, 4652073, 4605586, 4625874, 4486559, 4437813, 4401930, 4388741, 4480839, 4586174, 4630886, 4528833, 4363751, 4294357, 4304155, 4213445, 4224196, 4334058, 4325060, 4131314, 4106430, 4169616, 4080204, 4124815, 4233943, 4222458, 4097661, 4030782, 4045693, 3854814, 3891873, 4117731, 4197160, 3985511, 3726496, 3731106, 3870985, 4021517, 3895388, 3740878, 3761897, 3780729, 3866120, 3947536, 4010092, 3923733, 3788568, 3788447, 3669491, 3482140, 3485224, 3439496, 3495089, 3501688, 3451414, 3393622, 3348254, 3247524, 3339664, 3240923, 3230823, 3321370, 3349717, 3440033, 3345895, 3152142]
11981C152142N4692j15058m4608p0941J16840k9375k04996L9583l4528Q0699N6649
11970C001099q9771r7223M1961r4448l2614M8422J56714R8174k94853J9003J12620
11959B869084r9742l9735o6823j03922N2620Q6091k0502j13344l557R4060o0542
11948B593688m8437K5364J969j93805J5000p095j64401k06379P0434J79211r5621
11937B169928m8085O1056l3396j47257o3188J75558M1287J0982q5376j18365P5015
11926B038159L087j77878j78162Q7940l9743k0333m5844n7256N9007O4880J68666
11915A902523p4397k69352j22799J8549M181P9868J12040j9660k2962J15292M8935
11904A772218J55550J7038j00921k56725K3795J43241K2630m727j97033j15401
$$ y = [3152142, 3206834, 3091776, 3047168, 2976227, 3093067, 3063692, 2858696, 2898279, 2863751, 2944450, 3001099, 2911328, 2814105, 2856066, 2761618, 2729004, 2777426, 2934140, 3032314, 2737461, 2756464, 2869084, 2769342, 2729607, 2662784, 2558862, 2611482, 2697573, 2677071, 2563727, 2560170, 2654230, 2593688, 2545251, 2570615, 2572584, 2378779, 2393779, 2386684, 2222283, 2015904, 2086338, 2265549, 2169928, 2121843, 2182899, 2149503, 2002246, 1939058, 2114616, 2155903, 2166885, 2081509, 1963144, 2038159, 2041246, 1863368, 1685206, 1773146, 1733403, 1713070, 1667226, 1609970, 1668977, 1733857, 1902523, 1828126, 1558774, 1435975, 1454524, 1458705, 1538573, 1650613, 1630953, 1607991, 1723283, 1772218, 1927768, 1944806, 1843885, 1587160, 1610955, 1754196, 1776826, 1772099, 1575066, 1459665]
11894A459665K5676N4758Q7744R7369p1528k2896m3378j60763j30025J92599n5811
11883A433410j29301j40440O6441o7588l3449R6985r3150p26L3285q0911j33486
11872I51070P4512N229k7408Q7619J0224M1883j75653P83n2633J62421K50799
11861A328846p1715j99974l935M296j98943J5237K8948J33733J62728L9055N6534
11850A294810r0666n9484k0451k22108k09225J8308J59226l5799o3671L6260r6021
11839G11179J47756L1691K9759l2138m6351J0875K0141j51492J1868J45073R1435
11828I69796R767q1095m8245O8152K7894j20323L4008j09293r9251K5556O8169
11817G45135J02834J25624K0570j05401l9184j66113k22406M7711j0617J3836
$$ y = [1459665, 1485341, 1540099, 1627843, 1725212, 1653684, 1630788, 1587410, 1426647, 1296622, 1489221, 1433410, 1304109, 1163669, 1230110, 1162522, 1129073, 1226058, 1132908, 1132182, 1165467, 1084556, 951070, 1025582, 1030811, 1003403, 1091022, 1101246, 1143129, 967476, 968259, 915626, 1078047, 1328846, 1257131, 1057157, 1053222, 1057518, 858575, 873812, 902760, 1036493, 1199221, 1238276, 1294810, 1204144, 1144660, 1124209, 902101, 692876, 711184, 870410, 834611, 770940, 807200, 711179, 858935, 890626, 920385, 888247, 841896, 852771, 872912, 721420, 733288, 878361, 969796, 979563, 898468, 850223, 918375, 946269, 825946, 859954, 750661, 651410, 676966, 745135, 847969, 973593, 994163, 888762, 849578, 683465, 461059, 508770, 498153, 511989]
11807E11989P4135J37907L7657q1576l6642J40005r5564l5378J45824O9059J33651
11796A001067o3444K6886k92436o8746P8688J31681J13848q2315j98137L334N8239
11785G08665j60822L3152l2578M1869K65255N0712p0397q5676n9615j87883K5004
11774E27686K07053K3128N8940l7792R067r9993l02927j97291l5852K0309K14794
11763C87122P234p3874M2763o2116K2865j5726j84562J58121J89379j39323K4468
11752C56351j911J4426J33770M8472J23744j07596j70212j07044l5201J22397
11742C77196m6786l0459L8210J34388J63704m7760j61409L8820P5612J23323m2444
11731F22395Q7729K7581q3621j57092j77696l5704J23573N1008J3014l43547j26438
$$ y = [511989, 586124, 724031, 761688, 680112, 643470, 783475, 687911, 652533, 798357, 867416, 1001067, 937623, 964509, 672073, 603327, 682015, 813696, 927544, 845229, 647092, 650426, 708665, 547843, 580995, 548417, 590286, 855541, 906253, 835856, 750180, 690565, 502682, 527686, 734739, 757867, 816807, 779015, 788082, 688089, 385162, 187871, 152019, 172328, 387122, 394356, 320482, 363245, 301129, 323994, 308268, 123706, 281827, 471206, 331883, 356351, 354440, 368866, 502636, 551108, 674852, 567256, 397044, 290000, 254799, 377196, 330410, 299951, 338161, 472549, 636253, 588493, 427084, 465904, 541516, 664839, 622395, 710124, 737705, 654084, 496992, 319296, 283592, 407165, 458173, 471187, 127640, 1202]
11720A202J87288K03610J51287j64834q6833M7617q00K8626J3934q4094l5407
11709B61596l9051r1935P0052K20140r159k0285k5149o5029k1031J14457l4703
11698C59903J23874R018k2051O401K2678j39791J02712J08028l3144K1260j9012
11687E39876l3157q3607j29992j24638l9910o3676n6510J89865J57106J5360J37373
11676E08090K19731j53833k39917j59577r1316N5464Q0788q5050j02795K38737
11666B70322l5885L6922j0208o8922r9259R5897K09095o878j49739p4725L9475
11655B06095K3642N5317O7985r4464l7662N1535l3522k6962J7376q6233j177M7025
11643A88955M1993R8897j00854j9281L4654J4424l1118m0684L5000O7817K9760
$$ y = [1202, 188490, 392100, 543387, 378553, 291720, 339337, 338537, 367163, 381097, 297003, 261596, 222545, 130610, 200662, 420802, 411643, 391358, 366209, 301180, 280149, 394606, 359903, 483777, 492795, 470744, 477145, 499823, 360032, 462744, 570772, 537628, 558888, 539876, 506719, 423112, 293120, 168482, 128572, 64896, 8386, 198251, 355357, 370717, 508090, 727821, 573988, 334071, 174494, 83178, 138642, 219430, 134380, 31585, 270322, 234437, 271359, 261151, 192229, 92970, 188867, 397962, 391084, 241345, 166620, 206095, 229737, 285054, 353039, 258575, 220913, 272448, 238926, 211964, 229340, 143107, 141930, 188955, 230948, 329845, 228991, 209710, 244364, 258788, 227670, 186986, 221986, 289803, 319563]
11632C19563n519p5080q5163N3933J05011J32384j08635k06440p4996Q9852O4117
11621B09027J60897j06631J06068K7027j3111j97384l4112j9819q6629n662O4960
11610A04631p0619l4367J72535j727l0318K8472m7359o7108j1915R469o4656p4354
11598h7316J3492M4310J56456N2683n9270n9371J10093J29418O7342J11288j18820
11587C60305j74879j6447q6572j09343P2137J35677J15949p1686j24524k3257
11577G7360j57181p5144o9036N5618J82015j5302j46474j4495J60548J76522P856
11566A82287j8713Q5559m5618m8029M7183m5494j06426j18471m2947J77460O4885
11555A31676J87501K6012r3035j44249k9855q1643m8302P0798K48235K3132N9946
$$ y = [319563, 314044, 238964, 153801, 207734, 312745, 445129, 336494, 130054, 55058, 144910, 209027, 369924, 263293, 369361, 396388, 383277, 185893, 151781, 131962, 45333, 39671, 104631, 34012, -355, 172180, 170453, 140135, 168607, 121248, 54140, 42225, 51694, -12962, -87316, -73824, -29514, 126942, 179625, 120355, 60984, 171077, 300495, 367837, 479125, 360305, 185426, 168979, 82407, -26936, 45201, 180878, 296827, 225141, 100617, 77360, -79821, -154965, -224001, -168383, 13632, -1670, -148144, -162639, -2091, 174431, 182287, 163574, 249133, 203515, 155486, 202669, 157175, 50749, -67722, -110669, 66791, 131676, 319177, 345189, 252154, 107905, 78050, -3593, -51895, 18903, 267138, 290270, 350216]
11544C50216L0063j8679p523M7831r7960P3149q3488r4959j5491J11712j16252
11533A78619p8118Q5835j0558p7524J54465J83067n0276j40455n1833n3424J8192
11522A57990l3178K913n6865M1175q8935n1728J19947L2973j03008J76643Q2651
11511B80578o7265l9171L5243J10981L4241j10561j11461r9489Q5437p6562P0867
11500A12838N4775K484J26721Q4081k03631j05759j46302J19006K63648J2332
11490C20193j66532j46312R6836O3766M7026j6979L0006m1676j9689j8542q3807
11479F4290P3049j20417j60603P3426L0019k0414J04105N9297j31468j77203K6517
11468a79402K30523j600J19589J58246p590j17865M460q2678n3495n5153m5376
$$ y = [350216, 380279, 361600, 354077, 401908, 303948, 377097, 293609, 198650, 183159, 294871, 178619, 100501, 186336, 175778, 98254, 252719, 435786, 385510, 245055, 193222, 139798, 157990, 124812, 127725, 70860, 112035, 23100, -28628, 91319, 124292, 21284, 197927, 280578, 213313, 174142, 209385, 320366, 354607, 244046, 132585, 33096, 118533, 41971, 112838, 167613, 170097, 296818, 380899, 177268, 71509, -74793, 44213, 307861, 320193, 153661, 7349, 104185, 167951, 214977, 197998, 228004, 186328, 166639, 148097, 64290, 137339, 16922, -143681, -70255, -40236, -60650, 43455, 102752, -28716, -205919, -179402, 51121, 49521, 169110, 327356, 319766, 201901, 206361, 123683, 70188, 15035, -30341]
11457c0341l6672K8241J14235O110L8976j8980p4362L7603M3658R7358p8703O8222
11445A95345j2313j83041n7043j2550j11837J08599N8114O2767q5769R9446k6566
11434C5152K6892Q2518q3897j36707P7970P8374J69761l7459j5063o6177j60123
11423b8759m1469r910O8385J14069j88901r3856J47311K66722r2695j39390p524
11412f017Q493L2389N6009j8409k32494r1901J57200O3585P2364L39029j271j32505
11400B46472k6340O137p5795q4084j39595m6747P1504J14691o9826Q9667k7259
11389E8825j565J7356N3406l5822q3293j47657j96615J27163O1439j30237m8600
11378c25600J04104n440p1740J07215M925q2394J82381m2081J04727K09626j2775
$$ y = [-30341, -67013, -38772, 75463, 81573, 120549, 101569, 27207, 64810, 108468, 205826, 127123, 195345, 183032, -9, -57052, -69602, -181439, -72840, -14726, 48041, -37728, 61718, 35152, 62044, 144562, 60665, -76042, 1928, 80302, 250063, 212604, 197541, 131364, -28759, -70228, -80138, -11753, 102316, -86585, -180441, -33130, 233592, 140897, 1507, -6017, 2476, 34865, 90874, 72465, -160029, -251930, -94730, -31145, 41219, 380248, 378977, 246472, 220132, 226269, 150474, 66390, -73205, -119952, -48448, 66243, -3583, 86084, 58825, 57260, 74616, 128022, 92200, 8907, -138750, -335365, -208202, -146763, -277000, -325600, -221496, -226936, -298676, -191461, -186536, -268930, -86549, -128630, -23903, 185723, 172948]
11367A72948j97015j76133J56065K22062N212j2361n5617P574Q966M227J60831
11356B96759m5332k30185L3054K4944p0728j16185Q1207R5674k65438Q4617K68474
11345A56861l6629K1171k77041j54462L0583J21563N6881q8066J26577K2360m2896
11334f3098l4431q830m4679J7842k5063J6185J53034r906j24446j366L3488j8508
11322a09778Q4012Q1466J3642K9503l2425N1391M1028j04434o4442o862N2494
11311C5595K8716n122R975n4441N7092M9113k6098l6499k26666j64266J49311
11300a83290K96387J13081K7253o9921j48730K7248J08876J14147r345j8718r7981
11289A59007j44016J3426P2730J02281J57074j18915o0243M6258o2758q3510N588
$$ y = [172948, -24067, -200200, -44135, 177927, 183139, 170778, 115161, 122735, 131701, 135928, 296759, 251427, 21242, 54296, 79240, 8512, -107673, -26466, 69208, -196230, -111613, 156861, 120232, 141403, -135638, -290100, -259517, -137954, -81073, -169139, -42562, -20202, -63098, -97529, -106359, -151038, -133196, -158259, -142074, 10960, 1054, -123392, -124758, -91270, -109778, -25766, 55700, 69342, 98845, 66420, 117811, 158839, 54405, -10037, -16899, 35595, 64311, 59189, 69164, 14723, 71815, 120928, 94830, 58331, -168335, -332601, -183290, 113097, 226178, 253431, 183510, 34780, 62028, 170904, 285051, 275706, 256988, 159007, 14991, 28417, 101147, 203428, 360502, 241587, 181344, 227602, 164844, 81334, 86922]
11278H6922k44777O2243J71489J10921n1969j32113n8286L5643q270P544j16230
11267a36883L1189J05593k0665q9022P8516K05509J8236n9333r4700j58363p8393
11256a98316j23306j9230J07980k1858o5744r6596J09113J85414J38619K8677
11246D4753J39024J2466j8829K790r4715n4571R6723n7111J1085N1308j52348
11235a9425j34299p4276N0301M2640j5294o9312N9296m4317J1571p3293L2440
11224b33968m707O661J09822o0484q6859K6964Q2314j15009P7839M7619j65981
11213c15789P1255r080K7688M7303N8039j04991j7866K9477J3948K7103p6480
11202b49393L3826J20773Q8115J16139O6482q2931j32845L3250q5368J08821k721
$$ y = [86922, -157855, -95612, 75877, 186798, 134829, 2716, -55570, -19927, -28197, -20653, -136883, -105694, -101, -20766, -109788, -31272, 174237, 192473, 133140, 38440, -119923, -198316, -321622, -340852, -232872, -254730, -320474, -417070, -307957, -122543, 16076, 44753, 183777, 196243, 177414, 180204, 85489, 30918, 127641, 70530, 81615, 132923, -19425, -153724, -228000, -177699, -135059, -150353, -219665, -160369, -204686, -193115, -266408, -233968, -238675, -232014, -122192, -182676, -269535, -242571, -160257, -275266, -197427, -149808, -315789, -244534, -253614, -225926, -178623, -120584, -225575, -243441, -213964, -200016, -172913, -249393, -215567, -94794, -6679, 109460, 175942, 93011, -39834, -6584, -91952, 16869, 14148]
11191A4148q7583q6930j5424J14311O2183m0329n3156M0714K7540k6608j0505
11180f1639L9704m6424m2746N0829O2533J16662l5176Q2948k06289j31085J02047
11169f8636J15977p6586j03650N5902J34593J12087J27614j56801j37650R7595
11159A00445L2177r4631m6372j6878j23329l0646J02202m7272p4575N2309J04335
11148d2235L3420J46295O4338m5638k30363n3550m1519N7100O9787L8807l8207
11137d1765k1093K1600j42974j59243R4488k2283O0333L093J06591n1571Q9675
11126f3149Q911J34134J29559m889J0262j20793m2410L737l8604O0901k262o9180
11114F217R9067P8712l2951k98940L360J36689J5446J67951Q8703j62003j20432
$$ y = [14148, -73435, -160365, -175789, -61478, 705, -39624, -92780, -52066, -24526, -51134, -61639, -21935, -68359, -111105, -60276, 2257, 118919, 83743, 166691, -39598, -170683, -68636, 47341, -29245, -132895, -76993, 57600, 169687, 297301, 140500, 2850, 100445, 132622, 37991, -8381, -25259, -148588, -179234, -77032, -124304, -198879, -146570, -42235, -8815, 137480, 201818, 156180, -74183, -127733, -169252, -112152, -42365, -3558, -41765, -62858, -41258, -184232, -343475, -248987, -271270, -210937, -207844, -101253, -152824, -63149, -54238, 79896, 209455, 204566, 214828, 94035, 51625, 55362, 16758, 77659, 75397, 6217, 105284, 183996, 151045, -147895, -144535, -7846, 7600, 175551, 264254, 102251, -18181]
11103a8181R1467j01720j49363m3126J4947R087p5339n1813K8393J23522K8514
11092a43612L0196J10377R9104j7314N5889N3594j41442l1902j16237j49537m8712
11081b99596m6192o1334M4428N2558N9649Q4618Q0260k98j09241o5676Q253J249
11069b51322J82789m9332P7029R6858N8490k6156k16278N114m806n1245N7843
11058a21016K0698N9154n0228J35314L9115M0834l8048l2340N1527J28201K09578
11047D42789K15185M2154K542k04007k52657L8994K67340K94606J13729K4435
11037I85110J25096J11060J54786N8309j6968k16942k07620l0193R5080O8307
11027A126025J15989J82338K86810K28300J63603j47617j92092k64849j99187
$$ y = [-18181, 73286, -28434, -177797, -220923, -205976, -196889, -272228, -324041, -295648, -172126, -143612, -113416, -3039, 96065, 78751, 134640, 188234, 46792, 14890, -101347, -250884, -299596, -345788, -407122, -362694, -310136, -250487, -165869, -85609, -85907, -195148, -260824, -252571, -251322, -68533, -117865, -40836, 56022, 114512, 88356, -127922, -122808, -127614, -178859, -121016, -100318, -41164, -91392, 43922, 83037, 123871, 85823, 53483, 105010, 233211, 442789, 657974, 700128, 702670, 498663, 246006, 285000, 552340, 846946, 960675, 985110, 1110206, 1221266, 1376052, 1434361, 1417393, 1200451, 992831, 962638, 1057718, 1126025, 1242014, 1424352, 1711162, 1939462, 2103065, 1955448, 1763356, 1498507, 1299320]
11018A299320j01986k36373n7817p4125J82611J18194O9241j6536j3720n3893
11008A114916j53072q3380j15638m1441o938m0960J8977L6457j04256J07530j28789
10997F03406j41290j65351k08190n7211r8777R9592k6312o6976J06067M8935j09402
10986a5509o2729M6155l1842j22246M9728K23727q6744K3483N1704n5083n3673
10975c3029q8884j30377J33756J45987P2238l7927k21434r1832O2454j3144Q8284
10964a13908j8790r3625P5910J42364k7038j84357N6659k6036K0017M8439J0284
10953a10081k0325J21230K340M8748k1969o8332p1617M2015q0206j43737m3141
10942c45075m2666J53265R0369M8809O8819K4954L2684j48257J57865n2787l3173
$$ y = [1299320, 1197334, 960961, 903144, 829019, 1011630, 1129824, 1199065, 1182529, 1168809, 1114916, 961844, 878464, 762826, 721385, 714447, 673487, 692464, 728921, 624665, 732195, 603406, 462116, 296765, 88575, 31364, -67413, 32179, 5867, -61109, 44958, 93893, -15509, -78238, -32083, -63925, -186171, -136443, 87284, 540, 24023, 75727, 20644, -33029, -121913, -252290, -118534, 27453, 99691, 61764, -159670, -251502, -189048, -202192, -113908, -132698, -226323, -150413, -8049, -35087, -219444, -162785, -188821, -168804, -120365, -110081, -130406, -9176, -6836, 41912, 19943, -48389, -120006, -77991, -158197, -301934, -345075, -387741, -234476, -144107, -95298, -26479, -1525, 31159, -117098, 40767, -12020, -45193]
10931d5193J41823P5575M8480j58709r3626L223l940Q4403l9183O3567N495J2491
10919I4406j10493j54064j27083J04969O626j07631Q658p4034J7772J83443j6340
10908a73771k0344L6786K5025K4705p0537k7173J13013J60487j17675j1070o9368
10897a29922O3840J43989j7264K1330P6581r5254j22979o7704Q2663R4320n1046
10886a446R5236J86222J6233j15542j56946p0287K2990J00802n9591q4052l0470
10875i6851K3025n269K0341O3538k8132J49001j16295j37684p2334N5173J24375
10864b1112K7219o3614K73800M4249O98j20405k460q4889J39972q9107j40639
10853c6288k7388J9578M8876J81331K13261n8678n3713J17286j2889j85154j32191
$$ y = [-45193, 96630, 172205, 220685, 61976, -31650, -28427, -32367, 52036, 12853, 76420, 81915, 94406, -16087, -170151, -297234, -192265, -185639, -293270, -284612, -358646, -340874, -157431, -173771, -194115, -157329, -132304, -107599, -178136, -205309, -92296, 68191, -49484, -60554, -129922, -66082, 77907, 60643, 81973, 158554, 63300, -59679, -127383, -44720, 49600, -1446, 93790, 280012, 296245, 180703, 23757, -46530, -23540, 77262, 17671, -66381, -96851, -73826, -79095, -58754, 4784, -23348, 125653, 9358, -128326, -200660, -145487, -21112, 6107, -57507, 216293, 260542, 261240, 140835, 138375, 53486, 193458, 104351, -36288, -63676, -44098, 4778, 186109, 399370, 340692, 286979, 404265, 391376, 206222, 74031]
10842G4031O2118P5387J12953n3259p9508r5980K4721k0702q254j74772j61549
10831b44814J02046P3597J0091k2574j02903J3234J27205m8218j21787N5259J25254
10820c3610K5959j50906j25599J02763K31451N6407k8665J00523j40245k11986
10810a73908p3161O9229J52493O7866p4418O0916J37754N8933j19902j85490L4366
10799d5322l6841q2102N6304K3596k7570N9715L8403m4571j57135l2447P5379
10788a72591L714m6750L3016J55858j60309j19949N2760O3299L0783J38162L2988
10777A0981j31306J2127j9257J32468J18772q9111J8867j3766r8216J01523K2085
10766F5167m0616j25512P9381n7261m1370M4345m2513j7954j62475j82961K3213
$$ y = [74031, 136149, 211536, 324489, 271230, 191722, 95742, 120463, 99761, 91507, -83265, -244814, -142768, -69171, -59080, -81654, -184557, -171323, -44118, -92336, -214123, -158864, -33610, -7651, -158557, -284156, -181393, 50058, 106465, 77800, 178323, 38078, -173908, -247069, -177840, -25347, 42519, -31899, 29017, 166771, 225704, 105802, -79688, -45322, -82163, -164265, -107961, -84365, -111935, -52220, -13817, -58388, -215523, -247970, -172591, -168877, -215627, -182611, -26753, -187062, -307011, -254251, -190952, -160169, -22007, 10981, -120325, -108198, -127455, 5013, 123785, 34674, 53541, 39775, -58441, 43082, 65167, 24551, -100961, -21580, -78841, -120211, -75866, -118379, -136333, -298808, -481769, -458556]
10755d58556Q6660K70776K24107k0954j04115j35937J6426m9182l0202J20623
10745h0354p8650j5429l1845r224N2384l2461J54829O0778j63126m7122M5961
10734a44259J40459L046j2530j9986j07125k4222K04265J57515j20926K6463o231
10723I6469j16925o6074l3464J56130L4964j68614O2618J14520J5198l8601M0714
10712I6935k4776M6420p8156P8384j8383J24977k1488j0313j63601q2535J0040
10701d2496k4149j317J9883j20058J63802j9745J78726M7973j70310j72734O5336
10690g5089p6607l8964L16956L2009m1879j53226l0104j75377P6835J69171l6834
10679c3109P8093O5747K4728p8323j05162L4411R4689K07332O041k12409j73316
$$ y = [-458556, -371896, -101120, 122987, 102033, -2082, -138019, -121593, -170775, -200977, -80354, -159004, -174433, -206278, -215502, -163118, -195579, -40750, 20028, -143098, -190220, -144259, -3800, -754, -13284, -33270, -140395, -164617, 39648, 197163, 76237, 102700, 96469, -20456, -86530, -119994, 36136, 71100, -97514, -34896, 79624, 94822, 56221, 96935, 72159, 118579, 40423, 118807, 100424, 225401, 203913, 193600, 29999, -52536, -42496, -66645, -67962, -48079, -168137, -4335, -24080, 154646, 202619, 32309, -140425, -75089, -151696, -190660, 126296, 158305, 116426, -36800, -66904, -242281, -165446, 3725, -33109, 44984, 110731, 135459, 57136, -48026, -13615, 81074, 288406, 294447, 82038, -91278]
10668i1278P3033K20252K7436p8069L0988R3274N1030p4075j06034M0878L7723
10657B25158J10979J4098J77393J53049J22636j09647j39978N9838J18983Q4154
10647H16663l2348L8100J45418J39522J15187J88126K66007J53682K13646L61390
10637B405393M93127O53221O71616O44436L82807M22326M61309P09556P34367
10628G578158Q80990J363865J912797K801232L880855N263913P261581J0118429
10620D1061820J3644493J7104570J8349908J4781757O826597j229016o110525
10613A04429604o836129l763068J567121Q124258J6380312K5925619L5005838
10606A80833555L7927895K7215475N415143j4559966k4383934k3222206j5200619
$$ y = [-91278, -18245, 202007, 229443, 151374, 182362, 275636, 326666, 252591, 146557, 187435, 225158, 336137, 350235, 527628, 680677, 803313, 693666, 553688, 613526, 732509, 816663, 784315, 822415, 967833, 1107355, 1222542, 1410668, 1676675, 1830357, 2044003, 2405393, 2898520, 3551741, 4223357, 4867793, 5250600, 5672926, 6134235, 6843791, 7578158, 8459148, 9823013, 11735810, 14537042, 18417897, 23681810, 30943391, 41061820, 54706313, 71810883, 90160791, 104942548, 111769145, 110540129, 104429604, 97593475, 93830407, 95397528, 103521786, 119902098, 145827717, 180833555, 218761450, 245976925, 251392068, 236832102, 212448168, 189225962, 174025343]
10599A74025343m033320P819356K0565744L4368048M6131334M7100396K7789397
10592C53766298n546459l3784670m5266639m1537238l0382782j7460361m998193
10585A74789956O703049J7531802K5194411K4163458R543229j3030203l0391954
10578B14503748l6212967l2135855k3206103j4268238o670112l80116M481330
10571A06111687P043297N505274q82017r665409j5970216j7938485j6259111j2796291
10563D5148729r480160o943112n110046l815078l037144k294051j515072j353945
10555A1600121j130855j001439r80583j009501p62107n63448m59876k80213l60921
10546E051178l82617j58738l15758l67575k1179n3483j28727k16925j84721j26885
$$ y = [174025343, 169992023, 177811379, 198377123, 232745171, 278876505, 325976901, 353766298, 348219839, 314435169, 269168530, 227631292, 197248510, 179788149, 174789956, 181493005, 199024807, 224219218, 248382676, 257925905, 244895702, 214503748, 178290781, 146154926, 122948823, 108680585, 102010473, 101630357, 106111687, 113154984, 118660258, 117778241, 108112832, 92142616, 74204131, 57945020, 45148729, 35668569, 28725457, 23615411, 19800333, 16763189, 14469138, 12954066, 11600121, 10469266, 9467827, 8487244, 7477743, 6715636, 6152188, 5692312, 5412099, 5051178, 4668561, 4509823, 4194065, 3826490, 3805311, 3751828, 3623101, 3406176, 3221455, 3094570]
10536C094570j31513k46786k73520j7692j632p2157p6155N5852q3137j31869j17076
10525A998885o7657l8384l575K6776n1631o5891J5106P677j12162j38855N3940
10514A624229m9756p0548P6575O9209j78347j47171j24785q6097J69395N3780
10504A336484j9967j15072M0202j6767n9097j26836j22869k4676K9134j97935
10494G22601j24004q8911J83392J07403m6041R1823P1924q0088k7367L9711K9037
10483H79480k1935k5582P553k5194q2016j25806q5002j57088M9826J3911L6565
10472D64712J9418K3116O1745n1909J09044J06575l4566j03279Q3978j05667j93173
10461C79994K1690K7287N8599J34929o7076m1100K25496k6116m7988O0242l31157
$$ y = [3094570, 2963057, 2716271, 2442751, 2425059, 2423427, 2351270, 2275115, 2330967, 2247830, 2115961, 1998885, 1931228, 1892844, 1889269, 1916045, 1864414, 1798523, 1813629, 1821306, 1709144, 1570289, 1624229, 1574473, 1503925, 1580500, 1649709, 1471362, 1324191, 1199406, 1113309, 1282704, 1336484, 1316517, 1201445, 1241647, 1224880, 1165783, 1038947, 916078, 891402, 920536, 722601, 598597, 509686, 693078, 800481, 754440, 846263, 918187, 838099, 810732, 850443, 879480, 857545, 831963, 839516, 814322, 732306, 606500, 521498, 364410, 414236, 428147, 464712, 484130, 507246, 568991, 517082, 626126, 732701, 698135, 594856, 678834, 573167, 379994, 401684, 428971, 487570, 622499, 555423, 514323, 739819, 713703, 665715, 725957, 394800]
10450C94800k15247Q5434J35804J37212P4830p1230j18454R0209p1052N1610M0006
10439E33922j09195N8080m2055m0994P5660l1956J51050k7310m498o6088j63088
10428C33528J02233K2552j83120J01935K1512N2536j60142j16117L8507P7758
10418B91182N0609j47257r6405Q3334p2557P2392N0722j52963L2629J61542J89251
10407D62479O2066q1848o2843J28111m9716j32774k46451j5096J18328J03514
10397B85770j03827j67599j13420J45646J47376j88592o3157R0473J52191K6973
10387B11834k18817K0753q3466l857n1623J95365J63977L4105o7922k31873k18002
10376b49526k5868L15394J50020p2458K4764q9855K2135J15364j2692J631j33945
$$ y = [394800, 179553, 264987, 400791, 538003, 612833, 541603, 423149, 513358, 442306, 493916, 533922, 424727, 482807, 440752, 399758, 475418, 443462, 594512, 567202, 562704, 496616, 333528, 435761, 458313, 275193, 377128, 398640, 451176, 291034, 174917, 213424, 291182, 341791, 194534, 98129, 181463, 108906, 181298, 232020, 79057, 111686, 273228, 462479, 524545, 442697, 379854, 507965, 458249, 325475, 79024, 63928, 182256, 285770, 181943, 14344, -99076, 46570, 193946, 5354, -57803, 32670, 184861, 211834, -6983, 13770, -69696, -73553, -125176, 70189, 234166, 268271, 200349, -31524, -249526, -275394, 40000, 190020, 117562, 142326, 52471, 74606, 189970, 177278, 178909, 44964]
10365D4964n5047j52183M7979J79880L85927K4119l47149j97774P4118k9O4283
10354F9088k3140m3757k6338J57856J21221P0886l0130j86954n4638J40928Q5496
10343B80518l9649j11338K0914N6135J13060N4605M5699j19588q5609R915J88340
10332D13002n1627P3853k23174q935j4533l8073K04171N5164j77917j38118l5645
10321E8168L9701J35377l05625j66861m5753j31300P2731J3074K82427L5788m4879
10310e7152j10461L4658l151P169R6399q2500q655R4035Q5226r246R7934J68582
10298C12838J09694R2643l5290q0186k5585j35438q2930p7226J36074J80176k7807
10287C66963p8418q7207n6980M3010J28179J8412q7044m2574j19130p0222r8122
$$ y = [44964, -10083, -162266, -114287, 65593, 451520, 475639, 128490, -69284, 4834, 4805, 69088, 45948, 2191, -24147, 133709, 254930, 325816, 295686, 108732, 54094, 195022, 280518, 240869, 129531, 150445, 206580, 319640, 374245, 419944, 300356, 214747, 224662, 413002, 361375, 435228, 212054, 203119, 188586, 150513, 354684, 409848, 231931, 93813, 58168, 97869, 233246, -72379, -239240, -284993, -416293, -343562, -330488, -48061, -12273, -57152, -167613, -132955, -136106, -128937, -32538, -115038, -123693, -29658, 55568, 46322, 144256, 312838, 422532, 515175, 479885, 399699, 374114, 238676, 155746, 78520, 214594, 394770, 366963, 288545, 201338, 144358, 187368, 315547, 333959, 246915, 204341, 85211, 14989, -83133]
10276h3133J40333R2503J82633m7912k7282K35037N7524j77889m6764r7M3714
10265C68667j20461Q6339J77295r5021j6365N7239l6934j00738K2372P187l1369
10254C18211o9726q1410j56488k35184j28953K79491K07343L303q7528m4600J9523
10243B3982J6151K1100J05269R3890N397j44653L7362m3074l2067r2372m6105
10232e5120P1886j12056n9753J07819K25629J70327j2093J20199P7097j70169
10222C63766j75230k21913N7090l7061j23050q6380J14977k9963O0715J25756
10212D8707q3561j518K8537J71412R6442q644k01899j9315O1299J6873J1726k9152
10200I0907L1441R8547l6349J5286p3753j08720o3682J05961J55028m0440o8114
$$ y = [-83133, 57200, 149703, 332336, 284424, 257142, 492179, 549703, 371814, 325050, 324953, 368667, 248206, 334545, 511840, 416819, 400454, 457693, 420759, 320021, 342393, 349580, 318211, 248485, 167075, 10587, -224597, -353550, -74059, 133284, 136587, 49059, 4459, 23982, 40133, 61233, 166502, 260392, 265789, 121136, 158498, 115424, 83357, -9015, -55120, 16766, -95290, -155043, -47224, 178405, 348732, 336639, 456838, 533935, 363766, 188536, -33377, 23713, -13348, -136398, -222778, -107801, -137764, -77049, 48707, -34854, -36372, -7835, 163577, 260019, 251375, 49476, 30161, 91460, 108333, 120059, 90907, 122348, 220895, 184546, 199832, 126079, 17359, -46323, 59638, 214666, 174226, 106112]
10189A06112j67564l694L0483m570J54547K04372J683o1131k1838R7365R3488
10178D29253O2147r3092j0213K332Q1094K10681J92401o031J80487K07772O1287
10167A318118l1855j3138l0666j04044k70977r1203J84611J54820K59598L33175
10157A708439K83268J59871j51827l32786j52922m21093k05739m8993p7856J25608
10147H85970J21481O9381L12818K9323j04752j56740k90595k60499r8713r749
10137D97925K4134K64897J22916q050k9503l8988K822j53685l59482j42012j15442
10126F5532M718O6193J91984Q6829n1209n3720r1852N9286L4466j41802j14051
10115E6374P7991m3614P112P8036q99r8206n7748N813k7074J11106m8752O7769
$$ y = [106112, -61452, -65146, -34663, -39233, 115314, 319686, 321369, 260238, 238400, 335765, 429253, 491400, 398308, 388095, 390427, 471521, 682202, 874603, 868572, 1049059, 1256831, 1318118, 1286263, 1273125, 1242459, 1138415, 867438, 776235, 960846, 1115666, 1375264, 1708439, 1991707, 2151578, 1999751, 1666965, 1514043, 1092950, 887211, 838218, 760362, 885970, 1007451, 1076832, 1389650, 1418973, 1314221, 1157481, 866886, 606387, 507674, 497925, 522059, 786956, 909872, 901822, 872319, 833331, 836153, 682468, 322986, 180974, 65532, 70250, 136443, 328427, 415256, 364047, 310327, 218475, 277761, 312227, 170425, 56374, 134365, 90751, 97863, 175899, 175000, 76794, 19046, 24859, -2215, 108891, 60139, 127908]
10103A27908k2287o0648j903M6752p6395p9271K3188P5430J9487n5967M0985R970
10091D7249O8132m6086J8933J31255O7255p1473j96361N1480m4547M6330K5069
10080I7236o5328J5312L8360l6512L628j5781l8937k4956J7764r4171k6754J42650
10068A2511k8980j4224K18679M3786j27569j09588M0837N2750O339l2886k5625
10057C6030o8014j80259m5090J05102J06973q2257j088O3703n0870J55415K31310
10046B70955r5514j70631o9693N2750P6034Q619q9384j37328L06169J23231k7427
10035B47781l869m1976o1948N4051j20888J11567K1999j47289j30602J83033J51678
10024B63537j93889j31076k5612J63556O5179j04384j22864k7885j8035n0960
$$ y = [127908, 105621, 44973, 43070, 89822, 13427, -65844, -42656, 32774, 52261, -3706, 37279, 47249, 115381, 69295, 88228, 219483, 286738, 215265, 18904, 70384, 25837, 72167, 97236, 31908, 47220, 85580, 49068, 52696, 36915, -2022, -26978, -9214, -103385, -130139, 12511, -16469, -30693, 187986, 231772, 104203, -5385, 35452, 88202, 94541, 61655, 36030, -31984, -212243, -257333, -152231, -45258, -127515, -128603, -64900, -115770, 39645, 270955, 175441, 4810, -64883, -12133, 63901, 72520, -16864, -154192, 151977, 275208, 247781, 243912, 201936, 139988, 194039, 73151, 184718, 206717, 59428, -71174, 111859, 263537, 69648, -61428, -87040, 76516, 141695, 37311, -85553, -113438, -131473, -182433]
10014a82433l1603j6544o7678J03402K08265R5808r3919K7872K40757O114j64166
10003A25875j50580M7892N8373j7215j27466L8322M8294k4889q0028j4724J05250
9992I104O1605Q5499j76555n1300J0192N0791r477K7981P3834J905j724j4919
9980F6936j1455O3610J6249K8728j03261j29779j00897L857M3645J06433J44237
9969A28303m2815N8805L0214k08065P179J11414R6960p9201o8911j4405Q1098
9958A00576M4089J65028j38081m2544j12036k6174N0018K8045J1915m2879l545
9947C4412P897o9212k8553K0792p8142m2110J96258L1668R1868m1984j15621m7872
9935d0599j0814l7163K0059J43482k9921m8937j72715m8347J36052m6036J2140
$$ y = [-182433, -214036, -230580, -298258, -194856, 13409, 109217, 15298, 43170, 283927, 290041, 125875, -24705, 23187, 81560, 64345, -63121, -24799, 23495, -1394, -81422, -96146, 9104, 70709, 156208, -20347, -71647, -61455, -10664, -20141, 7840, 81674, 83579, 81855, 66936, 55481, 119091, 135340, 164068, 60807, -68972, -169869, -166012, -122367, -15934, 128303, 85488, 144293, 174507, -33558, -26379, 85035, 181995, 102794, 33883, 19478, 100576, 144665, 309693, 171612, 129068, 17032, -9142, 40876, 68921, 80836, 37957, 34412, 42309, -26903, -55456, -34664, -112806, -154916, 41342, 73010, 164878, 122894, 7273, -40599, -51413, -88576, -68517, 74965, 45044, -3893, -176608, -224955, -88903, -134939, -122799]
9924a22799N3809J29882K94327R9970j72834k14174m8165N1268J06344M3258j24319
9913I6567j00727n4845J28174m7382k00546R4130J99005j78180q1904j6118J12953
9902d8873J33226J67973o9572j37881j64942N6505J71442M3447k12634p1227O1345
9891g1191J30547L1519j0129j88232j31603M3166l3921J23968J3403j96383j4788
9880c03644L0786J41397r616j21864q9089J73769J33809k1133n4100J50704K23303
9869B54322o1901o3357r0468J04883L0433j14324q9844Q5723J7654j8450J2933
9858F7604p9237j73341o3579k4188J28467L1442j68556K1184P916p1941L8429
9847b85800N3223J3503Q6285r9356m9417O7083P6779m1949J13334J40486K88685
$$ y = [-122799, -68990, 60892, 355219, 455189, 282355, 68181, 20016, 71284, 177628, 220886, 96567, -4160, -59005, 69169, 21787, -178759, -84629, 114376, -63804, -145708, -161826, -48873, 84353, 252326, 182754, 44873, -120069, -63564, 107878, 151325, -61309, -132536, -71191, 59356, 90875, 80746, -107486, -239089, -195923, -229844, -105876, -92473, -288856, -303644, -272858, -131461, -141077, -262941, -352030, -178261, -44452, -65585, -119685, 31019, 254322, 192421, 129064, 38596, 143479, 173912, 59588, -30256, 55467, 73121, 54671, 67604, -11633, -184974, -248553, -272741, -144274, -112832, -281388, -260204, -252288, -324229, -285800, -232577, -219074, -132789, -232145, -281562, -214479, -137700, -179649, -66315, 74171, 362856]
9836C62856l8865j07480M4016m9166m9117K08462k1398k88688r3923k22004K20704
9825c4603J02126J05228Q0835p4578j47500O7020m4932n3194k4616j7440m6436
9814h8090q6080O9483J12063o1193J02383R9949m2893j24239m9177k3297L1815
9803e9276L0149l1234k2164O1451J20553j01974j67888K6271n2844O2311K55231
9792A20586K3534k04796j20870q5264K0646k0333m0357J26946p0667J0514L1288
9781b08773L7936k6721J80422O6667m8662R5571J47572n6792r6195Q704M0638
9770A40367O3687j20286j22434R0287M3052j08870j14123J4121N2152m7036N3998
9759e5085k0853q5435Q2706K4951L8049P012p1459J922J45153O6829l9498k41572
$$ y = [362856, 323991, 216511, 260527, 211361, 162244, 370706, 349308, 60620, -33303, -255307, -34603, 67523, 172751, 253586, 179008, 31508, 98528, 53596, 402, -24214, -41654, -88090, -174170, -104687, 7376, -53817, 48566, 148515, 105622, -18617, -67794, -91091, -59276, -29127, -60361, -82525, -21074, 99479, -2495, -170383, -144112, -196956, -134645, 120586, 144120, -60676, -181546, -266810, -246164, -266497, -306854, -179908, -250575, -240061, -208773, -170837, -197558, -17136, 49531, 869, 96440, 244012, 187220, 91025, 99729, 140367, 204054, 83768, -38666, 51621, 94673, -14197, -128320, -114199, -62047, -109083, -55085, -75938, -161373, -78667, -53716, -15667, -8655, -80114, -78192, 66961, 133790, 94292, -147280]
9747a47280k4915J79230R7112j01416O5149k2144k1685P925j33478k6302Q6262
9736d1542l1244j25134k9031P4203K36667K20118q1312n3577l4515j9766m5924
9725F8943R9126N6235j15678j04433n393J26982K6941l40147j73625J7176J70663
9714a73210R9911R3247R8888j4035m4744M3534J63186m5577j16341J666J88973
9703B95498m3919m8003j9202n2414o9228m8091j9821j62041j38490J29902J20520
9692e5289O7344l4704J09446l4641j98135J15135K01606R3332O0737o0423r2480
9681A71928k37995R5092K06830J2813K9994q4250k22253n6747J72845J78959N5334
9670C22550j51719l64735j95692J69810R4887Q0043J64827J64191N5066l4471
$$ y = [-147280, -172195, 7035, 104147, 2731, 67880, 45736, 24051, 31976, -101502, -127804, -41542, -72786, -197920, -226951, -152748, 83919, 304037, 222725, 169148, 134633, 114867, 68943, 168069, 224304, 108626, 4193, -1200, 125782, 152723, -187424, -361049, -343873, -173210, -73299, 19948, 118836, 104801, 60057, 103591, 266777, 221200, 104859, 106525, 295498, 251579, 203576, 184374, 131960, 62732, 14641, -5180, -167221, -305711, -175809, -55289, 12055, -22649, 86797, 52156, -145979, -30844, 170762, 264094, 324831, 264408, 171928, -66067, 29025, 235855, 248668, 278662, 194412, -27841, -84588, 88257, 267216, 322550, 170831, -193904, -389596, -219786, -124899, -44856, 119971, 284162, 339228, 304757]
9660C04757l1590R3918J79370K56299Q6028N99572N33929n6124m32188m82489
9650A051482l27460k97435k44748p7827J58717L4047Q354j26003q0287k5107j73744
9639a00011o4671J10014J9402l5671o7057N6142L9537j9785o5268m6370N6382
9628a17356l129K17350J27209k07099k18837j81010j1138R2897R5458J07626q5509
9617a83538N7922O7887J5767J27664o555m8371q0407m7805P573N0499P2366J16486
9605A49488N8489j35921k7676q3164N2085q9886l0851p172R1661J45646p9373
9594D3326L3669J18631j5612P1533L1258m1556j69899k38568j29500l9015k4245
9583c59978J8055K53516L9138J77784P3194M0034Q0204j3027R943K7124j23403
$$ y = [304757, 273167, 367085, 546455, 802754, 888782, 1488354, 2022283, 1966159, 1533971, 1051482, 724022, 426587, 181839, 104012, 262729, 296776, 305130, 179127, 98840, 73733, -100011, -164682, -54668, -35266, -70937, -137994, -81852, -42315, -62100, -127368, -173738, -117356, -120485, 96865, 224074, 16975, -201862, -382872, -394010, -301113, -205655, -98029, -183538, -125616, -57729, -41962, 85702, 79147, 30776, -49631, -97436, -89863, -39364, 33002, 149488, 207977, 72056, 44380, -38784, 13301, -76585, -107436, -114608, -22947, 122699, 43326, 76995, 195626, 180014, 251547, 282805, 241249, 71350, -167218, -296718, -335733, -359978, -341923, -88407, -49269, 128515, 201709, 241743, 321947, 308920, 318863, 345987, 222584]
9572B22584L123J2880R5563N4763M2155j09244j24692j97115k1490m8550K3849
9561d6174Q4960n3811L9434l5341K385J81027j68867j03388Q7m8548l4411J60733
9549b1914J22015j89125m1294M1663L9567m3723r4439o2024J19775P2322J50992
9538I3815l5892K4369j29432J78351Q9612J40481M7962j80280q1680j98531n1854
9527a03079K28530P2014k0127j23906M6648L7670J3987k321m9376j0127m4745
9516D5168m8315q376l7505J7669k7709k03840j32427K10500K7867J56963J54142
9505A54137p2699p1612R1486m2050P1168J16705j90546N1536O5292O0796l5811
9494A98402j72722j53800j62662p9228J14092J7560j988L23404J89492J3151k61852
$$ y = [222584, 225707, 238587, 334150, 388913, 431068, 321824, 197132, 17, -21473, -70023, -46174, 38786, -15025, 24409, -10932, -8547, 172480, 3613, -99775, -99688, -148236, -182647, -21914, 100101, -89024, -130318, -88655, -49088, -92811, -187250, -249274, -129499, -57177, 93815, 57923, 82292, -47140, 131211, 220823, 361304, 409266, 228986, 147306, -51225, -103079, 125451, 197465, 177338, 53432, 100080, 137750, 151737, 149416, 100040, 89913, 45168, -3147, -11523, -49028, -31359, -59068, -262908, -395335, -184835, -156968, -5, 154137, 81438, 9826, 101312, 59262, 130430, 247135, 56589, 108125, 173417, 234213, 198402, 25680, -128120, -290782, -370010, -255918, -238358, -240346, 83058, 272550, 285701, 23849]
9483B3849n3365j27628j2154o2270O1008O1806N4722J25249j14696j21189j8092
9472a82760J09595k0632K873j46487K8971J50687J41660j15665j2639k7776Q0071
9461G898L2072J53480J78673o1061j60614j6420k6271k1027J42150m888M6483
9450B70475Q5672P3484j11814j77517n8783K6261p1690O2709K569o4131j24408
9439h7173r922j0580R5905L0925q1473m7546M6665J60120J08056K8483j06519
9428A26941R839p2570n8922M6621P688p4591l6758K275J78235Q6853r6042p6036
9416D3533J43120J12085m4209j06527j2475M4705N0492K2917K6343n7270o9762
9405A52952j48869j86353m7137J92510J32269j5591k6879n723j7099n8386P0516
$$ y = [23849, -29516, -157144, -169298, -231568, -170560, -108754, -54032, 71217, -43479, -164668, -182760, -73165, -93797, -90924, -237411, -208440, -57753, 83907, -31758, -44397, -72173, 7898, 39970, 193450, 372123, 311062, 150448, 134028, 107757, 86730, 228880, 223992, 270475, 356147, 429631, 317817, 140300, 81517, 107778, 36088, 98797, 101366, 37235, -87173, -97095, -107675, -11770, 19155, -62318, -109864, -63199, 96921, 204977, 233460, 126941, 136780, 64210, 5288, 51909, 59597, -14994, -51752, -49477, 128758, 215611, 119569, 43533, 186653, 298738, 254529, 148002, 135527, 180232, 230724, 253641, 279984, 222714, 152952, 4083, -182270, -229407, -36897, 95372, 79781, 52902, 47179, 30080, -28306, 42210]
9394D2210J1167j49811J35956N2296o5323p1298N1067M4790j2802j9296K6933
9383D5889O4608q5576j67946j39332O9405J61704L3744k7085q6472q893j03159
9372b43113j04942j2412K62208K08351M1359j06139l26222j6224O3910J82551
9362e0673P5862q4521Q2542o7844o1928p5272n6443J27474O3067R8367Q8234n9111
9350G9754j64004R355k1630l2230J21056l9236p9238m0064q018O9629R5254P3726
9338F4354k1479M3919r008M3163O1282j94398k5769j82663r1325M4086M0569J08033
9326a19236m2429j72598J48396O1812J22921N0926p6352k9413j26410J1118J52348
9315a8917l972o814N487J77595J58091j17070j13585O6929n6337m0705j03610
$$ y = [42210, 53377, -96434, 39522, 91818, 26495, -44803, 6264, 51054, 38252, 18956, 45889, 110497, 24921, -143025, -282357, -212952, -51248, -17504, -44589, -131061, -139954, -243113, -348055, -360467, -98259, 110092, 151451, 45312, -280910, -297134, -233224, -50673, 25189, -59332, 23210, -44634, -106562, -181834, -238277, -110803, -47736, 50631, 138865, 79754, -84250, -74895, -96525, -128755, -7699, -46935, -126173, -166237, -174255, -104626, -9372, 64354, 42875, 86794, 77786, 120949, 182231, -12167, -37936, -220599, -311924, -267838, -227269, -119236, -161665, -334263, -185867, -124055, -1134, 49792, -26560, -55973, -182383, -171265, -18917, -22889, -29703, -24216, 153379, 311470, 194400, 80815, 147744, 91407, 50702, -52908]
9304e2908j4918j38902R6478Q7374l8889j23552P1732J83274R8845n9147j66186
9293e6799j57603J25828K28553L521p2551k16099J07218J11053m703o522j0430
9282E1466J01298M4597k10304L5057K01196r6384j92963p2269K0272J47841j02225
9271g2418J40440J32871k6170J6049m3416n4014L4939q37j88538J45693N0402
9260A35001j58385K6195l4374K1437k3183P0694P2116P9794r3758q2032K67737
9249B81242K4317o0448p4108j11327p1096O1804M0603l9604j53384o3164O6383
9238i8782Q6893J26587J16083K8203r3220j29937o811N016O0903j04234J6663
9227G364j8292K8583N4654J5416n8977k0375O2801n3830L1251J27657N6754j0644
$$ y = [-52908, -67826, -206728, -110250, -22876, -61765, -185317, -113585, 69689, 168534, 109387, -56799, -214402, -88574, 139979, 143500, 70949, -145150, -37932, 73121, 68418, 61896, 51466, 152764, 197361, -12943, 22114, 223310, 126926, -66037, -138306, -118034, 29807, -72418, 68022, 200893, 174723, 190772, 147356, 93342, 128281, 127444, -61094, 84599, 135001, -23384, 2811, -31563, -10126, -33309, 37385, 109501, 189295, 95537, 13505, 281242, 305559, 245111, 171003, 59676, -11420, 50384, 90987, 51383, -102001, -165165, -98782, -11889, 114698, 230781, 258984, 165764, 35827, 29016, 34032, 94935, -9299, 7364, -10928, 17655, 72309, 87725, 28748, 8373, 71174, 17344, 48595, 176252, 233006, 222362]
9215B22362m7970m2568j06014p7827o1353l3979N2178Q6091q4943P6972J68174
9204A51123r033J0738P0429o328o5504K2244j16138R8667j885p94k60896k74966
9192c82343J9334J12263R3201O7928R1354N5845j2916N3274Q6213R2461j22677
9181A53937p2537J18M9377P027J8925R916J14348J11340j54777j41467j50984
9170e4777o4899m6700P6300o7714m502P366o2496L1867J17187m2412m4451K20822
9158F5591K08155j70658j89682n8973J9503m4951J75366O1831j17535j05405J77710
9147B0952k2602q2658k5845q7285P1732J40757M2458k301O3829K4488p2121j8936
9135E2468L0108q4961K7778q0935j04000J03987L0159K0883j32702M1169J16664
$$ y = [222362, 174392, 131824, 25810, -52017, -113370, -147349, -95171, -9080, -94023, -17051, 151123, 142090, 152828, 223257, 216929, 151425, 173669, 57531, 156198, 154313, 153519, -107377, -382343, -363009, -250746, -157545, -89617, 1737, 57582, 44666, 97940, 184153, 276614, 153937, 81400, 81518, 130895, 137922, 156847, 166763, 281111, 392451, 237674, 96207, -54777, -119676, -166376, -90076, -157790, -162292, -154926, -217422, -185555, -68368, -110780, -155231, 65591, 273746, 103088, -86594, -145567, -126064, -171015, 4351, 66182, -51353, -156758, 20952, -1650, -84308, -110153, -197438, -125706, 15051, 57509, 55208, 119037, 143525, 71404, 52468, 82576, -2385, 25393, -55542, -159542, -55555, -25396, -4513, -137215, -96046, 20618]
9124B0618n3981k5193r8957m909j3413Q9450K2781j16276M0779J53362k3273M6217
9112C7205n691n6265k9081j41770k3543L112M6914K7888J9338m4587j28615M186
9100b90909J95560Q2176J00968K26497J0234j3577q0310j64148k9924j24343j92892
9089b80668o5220L2526K66669R3543m6671l6422k9152L5777Q5121n9804j31013
9078a35314l2050K5833n3120Q6729m528n2173L1606o925M5001l5929m7539M8531
9066a29878K15715J712k3718k5662o6930M8154M1333p8313o9096K2584l2121n7422
9054a53642O373q3983r0431j54664n271P1301K384M2779N227J55619m1837J92062
9042e4083R900p1604J41317j70128P1995J71446R6389k38360j56932P6872K13713
$$ y = [20618, -33363, -58556, -157513, -162422, -175835, -86385, -63604, -179880, -139101, 14261, -9012, 37205, 31514, -24751, -53832, -195602, -219145, -216033, -169119, -141231, -121893, -166480, -295095, -290909, -95349, -13173, 87795, 314292, 324526, 310949, 230639, 66491, 36567, -87776, -280668, -345888, -313362, -46693, 46850, 179, -36243, -65395, -29618, 55503, -4301, -135314, -167364, -141531, -194651, -107922, -112450, -164623, -133017, -139942, -94941, -130870, -178409, -129878, 85837, 87549, 63831, 38169, -28761, 19393, 60726, -17587, -86683, -64099, -96220, -153642, -147269, -231252, -321683, -476347, -481618, -410317, -407933, -365154, -359927, -204308, -246145, -54083, -44183, -115787, 25530, -144598, -72603, 98843, 195232, -43128, -200060, -123188, 90525]
9031I0525R5269J1302j08502J0390O2857P4334m5449j21499m5133j1301J01349
9020A14142Q8931K49534k5024l8567j91662j61798l2687L2865p6814J1761J20573
9009I1254k8807j03855j54450J3093P6297J53504R8239p1724J03589J53882k43613
8998H7409j17941K795j46403q7705J55292J06357O2664o7140J1492R3164j663
8987I8321j0043n311k10100n28J95102L8043p5314m8857J34160R0791j49627k28250
8975a71613P8224Q6194J00661J97736p8391n4000Q5457J1317L3954l4949m556
8964B50034l1650j14186Q8857r9599j11742P5348l3203N5501K2267K5192L9579
8953A66398J18999r0568j71615O868L688j90613j4329K2081K2302p768K00517
$$ y = [90525, 185794, 197096, 88594, 98984, 161841, 236175, 190726, 69227, 24094, 12793, 114142, 203073, 452607, 427583, 389016, 197354, 35556, 2869, 35734, -41080, -29319, 91254, 62447, -41408, -195858, -182765, -106468, 47036, 145275, 73551, 177140, 331022, 87409, -30532, -27737, -174140, -261845, -106553, -196, 62468, -4672, 6820, 99984, 98321, 88278, 82967, -127133, -127661, 67441, 105484, 30170, -18687, 115473, 206264, 56637, -171613, -93389, -7195, 93466, 291202, 212811, 158811, 244268, 255585, 289539, 254590, 250034, 218384, 104198, 193055, 93456, -18286, 57062, 23859, 79360, 101627, 126819, 166398, 285397, 194829, 23214, 30082, 33770, -156843, -171172, -149091, -126789, -134557, 65960]
8942F5960K52555k024j60249j06268M7881J0977J81681K8274j68432j80145K9588
8931b02j3460j3999J22837j03277n6227K1030J03647l6755N5641k2336n3308L0455
8919C4046N5822n2829j57404k428P2708j10121M3998J9140M3738j47843m8118
8908b49291J49898K44544J7038q7577J0070k25432n8692J12124l360k0287P0982
8897c9983M29M378N375k1533R3975P8378L4829o1660o3473j38997r5823M0551
8885a63554J14094J53030R2619j4222M7698j61823k70449p030O7475P9246J6910
8874d6006J42559j48936j5658P3257P8745R1263J33997K0281o5318j96003j85388
8863a17207Q051J40063K0959q9141O3486O0094m2306P8473n5489K930l2225j2697
$$ y = [65960, 318515, 316491, 156242, 49974, 97855, 108832, 290513, 318787, 150355, -29790, -202, -13662, -27661, 95176, -8101, -64328, -43298, 60349, 23594, 79235, 56899, 3591, 34046, 89868, 37039, -120365, -122793, -50085, -160206, -116208, -97068, -53330, -201173, -249291, -99393, 145151, 162189, 74612, 84682, -140750, -199442, -87318, -90678, -110965, -39983, -39554, -35176, -29801, -51334, 42641, 121019, 155848, 94188, 30715, -108282, -204105, -163554, -49460, 103570, 196189, 181967, 229665, 67842, -202607, -209637, -142162, -62916, -46006, 96553, -52383, -68041, 5216, 83961, 175224, 309221, 329502, 264184, 68181, -117207, -109156, 30907, 51866, -37275, 26211, 86305, 43999, 122472, 66983, 69913, 37688, 24991]
8851B4991J15856L9909j0915M3384q9457J74032m9578j05396j58213p8822N1784
8840d2425J5831J34391m9520l9772j760K27231J51520j17763j7668R3838Q434
8829C62337l43148r9592J11722P6150k9454m7716K4796N2443j36368n9974K1816
8818f6988J08000M381q4943J77731K42751k1297j31410j22199M2648J27834k8448
8807B48060r0119j6013O8063n7874k04675J2102n1139l429J3041n9038L2767L5398
8795g2856K0226j7218N2310J5736O4550p4259L2595k170N4118K3924j3588m4950
8783C8418j38734n2140n6261L8323K67516M4846r9555r3486N3676J71350o5600
8772A08353k30999R8589p4836q5502O7968O3575l2781P766J48467N0746q2123
$$ y = [24991, 140847, 180756, 169841, 213225, 123768, 297800, 248222, 142826, -15387, -94209, -42425, -26594, 107797, 58277, 18505, 16745, 243976, 395496, 277733, 260065, 353903, 362337, 19189, -80403, 31319, 107469, 78015, 30299, 55095, 107538, -28830, -88804, -66988, 41012, 45393, -39550, 138181, 380932, 359635, 228225, 106026, 148674, 276508, 248060, 157941, 141928, 209991, 152117, -52558, -40456, -91595, -95024, -81983, -141021, -108254, -72856, -52630, -69848, -17538, -1802, 62748, -11511, 21084, 18914, 73032, 96956, 83368, 38418, -100316, -152456, -208717, -170394, 97122, 141968, 42413, -51073, 2603, 173953, 108353, -122646, -24057, -98893, -184395, -116427, -52852, -85633, -77867, 70600, 121346, 39223]
8761C9223M3112r4820J05073J35194j3925n5391m3054l6680J2871R3888L9207
8750B24698j7559P256q3694j22900r7548J18777P8609J00570O6600q6724l03343
8739a15258k15259J13665K35928J13554L929J10988j08465q3669p2839l3712M9269
8728a869J37822O7298q8551n3335l3127J5797j2577j16494l3104j726Q1317m8456
8716h7005N6248j419M5206O6098J58685l9634l4374O5641M3095j21699j35960
8705A4882K6683Q6321n7756j0634j52302K4496J34919J31341k5003q6473j56006
8694f9532k7609K24306M5445j06326m7502J601l1426J8707n4765J19309J84828
8683B57036L710M4629J6105q9187l2257J8310l23101l585K88449L0846j23276
$$ y = [39223, 82335, -12485, 92588, 227782, 213857, 158466, 115412, 78732, 91603, 185491, 224698, 207139, 214395, 130701, 7801, -89747, 29030, 107639, 208209, 274809, 188085, -115258, -330517, -216852, 19076, 132630, 136559, 247547, 139082, 55413, -17426, -51138, -1869, 135953, 203251, 114700, 61365, 28238, 44035, 31458, -85036, -118140, -119866, -38549, -87005, -30757, -32176, 13030, 79128, 237813, 198179, 163805, 229446, 272541, 150842, 14882, 41565, 127886, 70130, 59496, -92806, -68310, 66609, 197950, 172947, 86474, -69532, -97141, 127165, 172610, 66284, 18782, 20383, -11043, 7664, -47101, 72208, 257036, 260746, 305375, 321480, 232293, 200036, 218346, -104755, -108340, 180109, 210955, 87679]
8672H7679J1650L54229P6001k20390j39208J25579m3339j09150j15580r6799j18998
8661a88326l3237K12369J68959J9583n6070k0730J69794J75825Q225o1586o9220
8650C25586O3784j07330r3536J23208j7819j55196R1029J12109n1075j43367p5867
8639G1526O3262J75296j62238j89819J7753J54675J78442J64296m3708k7029J4626
8628D17082k19426O6409J92765J28092j65048j27836j52905p7111L6193k5380
8618G2835J974J53452l4015m6397q5045q10P8049L0158k5589K585J5548N7282
8606B20027Q8253P4852N8653q7188j27960l1518N7038M2046L5412L3022j17520
8595B45117K7604N3671j06767r0492q7446O088L9555N8502J07005J21795R565
$$ y = [87679, 99329, 453558, 529559, 309169, 169961, 295540, 252201, 143051, 27471, -69328, -188326, -221563, -9194, 159765, 179348, 123278, 102548, 272342, 448167, 456392, 394806, 325586, 389370, 282040, 188504, 311712, 293893, 138697, 229726, 341835, 290760, 147393, 71526, 134788, 310084, 147846, -41973, -24220, 130455, 308897, 473193, 429485, 402456, 417082, 197656, 264065, 456830, 584922, 419874, 292038, 139133, 62022, 98215, 72835, 74809, 228261, 194246, 147849, 62804, 61994, 140043, 170201, 144612, 147197, 162745, 220027, 308280, 383132, 441785, 354597, 226637, 195119, 252157, 294203, 329615, 362637, 245117, 272721, 326392, 219625, 129133, 41687, 47775, 87330, 145832, 252837, 374632, 384197]
8584C84197r1462k4864q7852j63113k7467J30917N7562k954j8869P10k189l9733
8572A14883n5352N0774j4460j1281j2144M4402K7080O2135q4729M6843P7918J08370
8560C54439N7386M7553J2778j88414N523J32440o8516j09637k8182k44895p0463
8549i9988J59292J17688m4159j64273o6890O5359M7461j33227o2296J73811K06832
8538A99610N7499q1604j7211L1377p445J13390k7647O4457k40359q6234N9688
8527F5521j33850j69330K10296J77375J18260o5196o6773j02001Q0284j137Q1275
8516A94724q608Q5306j23580j63675J52656J8478n8113N6434n9909o6588R3398
8505A20523J70552K5928j1094j98849O3523J77442j17338L9614l8959j9061N4925
$$ y = [384197, 292735, 267871, 180019, 16906, -10561, 120356, 177918, 174964, 156095, 156805, 154616, 114883, 59531, 110305, 95845, 84564, 72420, 116822, 143902, 206037, 121308, 168151, 246069, 354439, 411825, 459378, 472156, 283742, 289265, 421705, 353189, 243552, 215370, -29525, -99988, 59304, 176992, 132833, -31440, -98330, -32971, 14490, -118737, -181033, -7222, 199610, 257109, 175505, 158294, 189671, 182226, 295616, 267969, 332426, 92067, 5833, 65521, -68329, -237659, -27363, 150012, 268272, 203076, 136303, 34302, 114586, 113449, 194724, 186116, 271422, 147842, -15833, 136823, 155301, 97188, 153622, 93713, 27125, 120523, 291075, 317003, 305909, 107060, 170583, 348025, 230687, 270301, 231342, 212281, 267206]
8494B67206k9868O2974m9084j17543k0342J9187K9480l2950j33659O4205j4038
8483D5568o9702n409J65020J52718K36960j20038r3332j93974j38103J87307J12188
8472B79203k5963k7739J3025j27212m0001J97994J85026O4779o4420j86897o4753
8461B03042j40512j13703j0483Q2516N3258o1873m1783J31977J96010L982j16045
8450A86386l5870k441l3546m3982j1735p1700K1541J7830J78515R4870k8934o5940
8438B04994r4339n581J69095k9398O9660J7797M1897R0157j4693p1977m0912r9751
8426B36949r6783K64271L17J03522N1406J3927j55390l37210J6738J20682R5695
8415C14124l4407j23112J49687j38445j63708j79837J12585J07910O6658K09287
$$ y = [267206, 237338, 300312, 251228, 133685, 113343, 132530, 162010, 129060, -4599, 59606, 45568, -24134, -29543, 135477, 288195, 525155, 405117, 311785, 117811, -20292, 167015, 279203, 253240, 225501, 238526, 111314, 71313, 269307, 454333, 519112, 454692, 267795, 203042, 62530, -51173, -61656, 20860, 74118, 12245, -29538, 102439, 298449, 302431, 186386, 150516, 148075, 114529, 70547, 58812, -12888, 8653, 26483, 204998, 299868, 270934, 204994, 110655, 105074, 274169, 244771, 314431, 332228, 374125, 464282, 449589, 377612, 336700, 236949, 140166, 404437, 404754, 508276, 559682, 573609, 418219, 81009, 97747, 218429, 314124, 279717, 156605, 306292, 167847, 4139, -175698, -63113, 44797, 111455, 320742]
8405C20742P4741j9546n4856r4814J40126j57845j64066j17355M018J75199K20409
8394C26753J89556m7718k29973l4592J0894R4006N4129n293l6762n4783J26563
8383C92780l5731N4240m0993p6634O3483P9099j17486p0438k842P57m7090r3957
8371A05188m2822l1876J38650j9640K292M2653q9435N979K2564R9638M2884M9953
8359C26028P6955k841j2205j50589O4416K2256j07508m6456Q695o318J0008k098
8347A80343r7668N7262N6764k3667j3186Q5260M8235J4056o0166J23669m1428
8336C29474j06577l6358p818L0007K37071O7727k39179j28203P073J45397j3354
8325B85260j49119j04558J52133J28480p4484O8994l9699k2892J3029j1626L5465
$$ y = [320742, 395483, 375937, 321081, 226267, 366393, 208548, 44482, -72873, -68855, 106344, 326753, 516309, 468591, 238618, 204026, 214920, 308926, 363055, 357762, 321000, 266217, 392780, 357049, 411289, 370296, 293662, 357145, 436244, 318758, 248320, 245478, 246235, 199145, 105188, 62366, 30490, 169140, 149500, 151792, 194445, 105010, 110989, 133553, 233191, 276075, 326028, 402983, 400142, 387937, 237348, 301764, 324020, 216512, 170056, 178751, 172433, 182441, 180343, 82675, 139937, 196701, 173034, 159848, 245108, 293343, 307399, 247233, 370902, 329474, 222897, 186539, 178721, 208728, 445799, 513526, 274347, 146144, 153217, 298614, 285260, 136141, 31583, 183716, 312196, 237712, 306706, 267007, 244115, 257144, 245518, 280983]
8314B80983L0748k00683J9219J05301J53590O0595j74261r9643j701J05009J09308
8303C88465l0402k02513j16459O8714J06421P2887J5728j13735J18754p806j23200
8292A76854r281m2810o3523R9773K9200J34568l5408j24997q8649P2522m6676
8281A01573q3176J32282J86727K6446J3066o2351j71089P0783j17266p6708J76801
8270A97088J1673J84854L75862l574j00378R252j28101p0928k5833l5244M4060
8259D58731Q3140j41630j07971j74408j26351J77753J34296P9906p3527N3437
8249C63376O0114l1743l8850j50802P4060K19884J35049j58973j34675M6870N1256
8238D35566K5617j60804r6539J41475L2975j57033r6828J63718L8889k3338N2550
$$ y = [280983, 311731, 111048, 130267, 235568, 389158, 449753, 275492, 175849, 174148, 279157, 388465, 358063, 155550, 39091, 107805, 214226, 287113, 302841, 189106, 307860, 300054, 176854, 167573, 124763, 61240, 161013, 190213, 324781, 289373, 164376, 75727, 148249, 101573, 18397, 150679, 337406, 363852, 376918, 314567, 143478, 214261, 96995, 20287, 197088, 208761, 393615, 769477, 765903, 665525, 674777, 546676, 475748, 449915, 414671, 458731, 541871, 400241, 292270, 117862, -8489, 169264, 303560, 383466, 309939, 363376, 423490, 391747, 352897, 202095, 276155, 496039, 631088, 472115, 337440, 384310, 435566, 461183, 300379, 203840, 345315, 378290, 221257, 124429, 288147, 327036, 303698, 356248]
8227C56248j20784K9962J06789P2059r4820j09864N5499j09624L6236J37604p9725
8216B79580l8769J17024J30062P4068P0224k49967j18973R9837R0320q2400j24526
8205B46480j17674K2875J22575J82557k5682l1527n7435j09801q0122k4515J18001
8194B45732J22233K4236j28575K76953J62592j25903q3262q371Q9733P3520j45111
8183E03777r1313j57096j09609N4708l5610R6012P8163Q7400j64376p7381M1268
8172B25943M7530L896n1189Q5202Q931p3926N6227O2203J8637Q6614N5669j23406
8160D02331k28495R2991L02592O1782q4659j49491J05661j71630P4851j4696l08131
8149H3106K7440P2584k3703M1790J33998j45658R334M461J24623r9711j35274
$$ y = [356248, 235464, 265426, 372215, 444274, 349454, 239590, 295089, 185465, 221701, 359305, 279580, 240811, 357835, 487897, 561965, 632189, 382222, 263249, 363086, 453406, 371006, 246480, 128806, 151681, 274256, 456813, 431131, 399604, 342169, 232368, 152246, 127731, 245732, 367965, 392201, 263626, 540579, 703171, 577268, 494006, 485635, 575368, 648888, 503777, 412464, 255368, 145759, 200467, 164857, 260869, 339032, 426432, 262056, 184675, 225943, 273473, 277369, 226180, 311382, 320313, 246387, 302614, 364817, 383454, 470068, 525737, 402331, 173836, 266827, 569419, 631201, 546542, 397051, 502712, 331082, 405933, 391237, 83106, 110546, 183130, 159427, 201217, 335215, 189557, 198891, 203352, 327975, 228264, 92990]
8138I2990J62632N606j47782R1120k5415J0606J31537j2333o9229j44224p2076
8127B3432J33993K2406j34794m4168j47060N5391J92222K2906k1219j09935J30088
8116A23262K3406J69501j5892k09365q2693P9322M5237q3037j7254J3559l5252
8105A0794n3812j05000N3468p2087K11772K03142M4464j48865j61605M8676O2944
8094I3891P8855l9288o5552n593J01565J25718K701Q3463p5260j19815k2619K3803
8082A81869P7504J96991j23597k63199o881l0473Q6810J06195K75325J56483l3180
8071F23847j79341k55776o4414o2336J0947L960Q370O3012m7131O3849j38745
8060B6242O7160n5150j44508O6223J34284M1797j06899k2696n2484n9883J15007
$$ y = [92990, 255622, 261228, 113446, 204566, 179151, 189757, 321294, 308961, 239732, 95508, 23432, 157425, 179831, 45037, 869, -146191, -90800, 101422, 124328, 103109, -6826, 123262, 146668, 316169, 300277, 90912, 8219, 87541, 132778, 49741, 32487, 46046, 10794, -43018, -148018, -94550, -166637, 45135, 248277, 292741, 143876, -17729, 30947, 93891, 172746, 133458, 67906, 62313, 163878, 289596, 292297, 375760, 300500, 180685, 158066, 181869, 259373, 456364, 332767, 69568, 62687, 32214, 119024, 225219, 500544, 657027, 623847, 444506, 188730, 124316, 61980, 72927, 76887, 85257, 148269, 101138, 164987, 26242, 93402, 38252, -106256, -40033, 94251, 136048, 29149, 6453, -46031, -105914, 9093]
8049I093p7620Q9N43J46987J28197j05145P6169j3627J29685j60295r5933R5077
8037A33220M5500L1222J49755o7778k9048j1221o3224R3817K4352R6957P0007
8026D73559K9492P9247q6850j39465n6965P7376J84340N7212O6147j26008m4256
8015E13829Q1443j73337j23115j09109K8506j07964j24859P9473P1701l5194l1394
8004F9980j6762J51039J16722j30548M8767p7970j02167J16026K28170O4476j61638
7993C06095j63814l568j71490J5088J13326J30013j9350m4841j11212L3779r201
7982G4825R6066L4603L3569j64391j07038R4155R7171j03329j21923K2207O7987
7971B3902R568m5894J48705L3451k8544N4938o4858o6929p4971N8515J51488K41502
$$ y = [9093, -68527, -68438, -67895, 79092, 207289, 102144, 178313, 164686, 294371, 134076, 38143, 133220, 178720, 209942, 359697, 291919, 262871, 251650, 188426, 282243, 306595, 403552, 473559, 503051, 582298, 495448, 355983, 299018, 376394, 560734, 617946, 684093, 558085, 513829, 595272, 421935, 298820, 189711, 218217, 110253, -14606, 64867, 136568, 101374, 69980, 53218, 204257, 320979, 190431, 239198, 161228, 59061, 175087, 403257, 467733, 306095, 142281, 138713, -32777, -17689, 95637, 225650, 206300, 161459, 50247, 84026, 74825, 170891, 205494, 239063, 74672, -32366, 61789, 158960, 55631, -66292, -44085, 23902, 33470, -12424, 136281, 169732, 141188, 196126, 131268, 64339, -10632, 47883, 199371, 440873]
7959D40873J16686L752o8031j25919q1140k27334j26669J55280O2487L5309O2377
7948B47671r3623O2488J36233j88801j20904k2936l9756K6097J02214J08478Q3740
7937C00901j16891J19311o8688j99022N8435j78623p1440J70197O3635K08020
7927B85835M9680L5667k52065j13988J06150J5635M544m4778r1955o0135J00891
7916C5481J26895J928k20916n9272J35267j24712l893K65403J73064q7230L253
7905B45268o0859j67642J47907J67536L6388j37531R353m0836J6220L1255l127
7894B43932M4307j59292r0494J8012M7028N3905J5190P2217O6943j35979j98432
7883b2663R1012p194o6280j07046N3767K61209O9047o7318j99537k03107j05847
$$ y = [440873, 557559, 561311, 493280, 367361, 286221, 58887, -67782, 87498, 149985, 185294, 247671, 154048, 216536, 352769, 163968, 43064, 20128, -19628, 6469, 108683, 217161, 300901, 184010, 303321, 234633, 35611, 94046, -84577, -156017, 14180, 77815, 285835, 335515, 371182, 119117, 5129, 111279, 126914, 131458, 86680, -5275, -65410, 35481, 162376, 164304, -56612, -115884, 19383, -105329, -109222, 156181, 329245, 242015, 245268, 184409, 16767, 164674, 332210, 368598, 231067, 240420, 199584, 215804, 247059, 243932, 288239, 128947, 38453, 56465, 103493, 157398, 172588, 244805, 311748, 175769, -22663, 68349, 61155, -5125, -112171, -58404, 202805, 271852, 204534, 4997, -198110, -303957]
7872c03957J32020J05347J22716m6397j54693j8123K90587J33671n234J7900J6219
7861B90056r8580K2330r5033r5789R734p0726j5253p1L3699K4756L2219J01964
7849A39306n5260j39543l8199O1996J04361j03423l6287P1431J63341J14757k3152
7838B59328K274j29014j87274j75820M0257J33495K198P9856m5533L7120P7254
7827I4141O0275o4241j40773j6378K12139J62995K8023J1876r3072m3541r6511
7816A14933p1041K2063R6557m7791K9707O2284q9609j0491m8213j77582j030o4909
7804a85122J00703R7335J21569n5983o4083Q01k0667o0574p5195p8373N7914J41655
7792b0020J2038n0268l1615r397p0239o412n002J23811J29244q822j62554j06248
$$ y = [-303957, -171937, -66590, 56126, 9729, -144964, -163087, 127500, 261171, 255937, 273837, 290056, 191476, 213806, 118773, 22984, 32718, -38008, -53261, -53332, -19633, 5123, 37342, 139306, 84046, -55497, -93696, -31700, 72661, -30762, -67049, 4382, 167723, 282480, 259328, 261602, 132588, -54686, -230506, -190249, -56754, -54556, 25300, -20233, 16887, 94141, 154416, 90175, -50598, -66976, 145163, 308158, 336181, 348057, 254985, 211444, 114933, 43892, 65955, 162512, 114721, 144428, 206712, 117103, 106612, 58399, -119183, -120213, -185122, -84419, 12916, 134485, 78502, 14419, 15220, -5447, -66021, -141216, -219589, -161675, -20020, -7982, -58250, -89865, -99262, -169501, -175913, -180915, -57104, 72140, 63318, -99236, -205484]
7780b05484K09564J37851N1571j1263j56426j72208n724N1097O5491J75969p5398
7769F5040o2975J745J1935l1443l6136J42482K2728L3746p4076j79222Q1109R4170
7757F9103O3587m9988k9084j2376K712n572k2764L9517Q3634q3973j53694J3084
7745h5814J3713l0911J68767m1639n0692j12286N3183J42739J02800j82691r2852
7734a15683k6737M5005J57150p476n0547K2400J6969R2767P886M6818p5976J13114
7722B25690m0850m5487k15726q5385K14073n0465j48716J30331K09707q6694k27458
7711a20980l4022J64087q2499l9237M9596Q8839j7629k6276p7474m2719J15146
7700b3168P2779p9267o1855J14795N111o6460M3702P6916J73711K8067j38326
$$ y = [-205484, 4080, 141931, 193502, 182239, 25813, -146395, -152119, -101022, -35531, 140438, 65040, 2065, 3810, 15745, -15698, -51834, 90648, 113376, 147122, 73046, -106176, -25067, 69103, 132690, 82702, 53618, 41242, 43954, 38382, 15618, 55135, 138769, 54796, -98898, -85814, -72101, -103012, 65755, 24116, -26576, -138862, -85679, 57060, 159860, -22831, -115683, -142420, -97415, 59735, 52259, 1712, 24112, 41081, 133848, 141734, 188552, 112576, 225690, 184840, 139353, -76373, -161758, 52315, 1850, -146866, -16535, 193172, 106478, -120980, -155002, 9085, -73414, -112651, -63055, 25784, 8155, -18121, -95595, -138314, -23168, 49611, -29656, -91511, 23284, 28395, -38065, 5637, 82553, 256264, 284331, 146005]
7689A46005k48389l0891r398m3226j10033J85055J83413k08438j5511J23227R5955
7678F7769J6475O9803J54224q1881j97442j13021Q4011j7270O6140K08531j08143
7667A49196o7175J55222j55417l0495R6857Q9477l3004Q1716K01835j26129j07341
7656B54742j52594r321Q1875L5823O2036l9372j0086j82047j64280n6977k967
7645a83168J60068J29219M3614k6570k01573p1131Q7511j0311m0762j013J05840
7634h276q327L590m6239J73027m6847j12896n1115L0241N0378j13937r968L5060
7622a05309j01585l5257J44127n1666L6900k9897r2312J96167P9362Q3053J01138
7611B24721J437o0216n6789Q9500J74768p9199j52265J9992J52818l1522j06444
$$ y = [146005, -102384, -133275, -142673, -185899, -295932, -110877, 72536, -135902, -151413, -28186, 67769, 84244, 154047, 308271, 226390, 28948, -84073, -62, -17332, 48808, 257339, 149196, 82021, 237243, 81826, 51331, 148188, 237665, 204661, 286377, 488212, 362083, 254742, 102148, 92827, 174702, 210525, 272561, 233189, 223103, 41056, -123224, -180201, -183168, -23100, 106119, 149733, 123163, -78410, -149541, -62030, -72341, -113103, -114116, -8276, -16603, -13013, -59252, 113775, 66928, -45968, -97083, -66842, -16464, -130401, -140369, -105309, -206894, -242151, -98024, -149690, -112790, -142687, -234999, -38832, 40530, 123583, 224721, 226158, 165942, 109153, 198653, 373421, 294222, 141957, 161949, 314767, 283245, 176801]
7600A76801q4229j11634p3982N5154J47592k2859k14148n2820l7142l7788Q3370
7589a71685O7779k11653j75135R3151K43273O8453N2516J14310L3159k5574K741
7578I1335k8890j49267n7251J42661O4426M2515K7247j0093O8672K5279n040Q8434
7566C00028k9456r2968J1349J24574N1928k19037j27210j25365Q6429q1711J2839
7555h8600J35202k2661q848K8779k5098J6826q6016J23813j8660K02485J25340
7544C82562j04363j28440o2182l4489n0146j86263M1012N5199J55186N4787n7979
7533F4884N188r3309j30327k4055K2291R7035l9630k7674J99855P5972J04018
7522B54248K9468K2141k6724j00633J16554J39578j03323j08726n9630q0608M1114
$$ y = [176801, 92572, -19062, -93044, -37890, 109702, 86843, -127305, -180125, -217267, -255055, -171685, -103906, -315559, -490694, -397543, -154270, -85817, -33301, 81009, 114168, 88594, 91335, 62445, -86822, -144073, -1412, 63014, 105529, 132776, 122683, 191355, 216634, 211594, 300028, 270572, 177604, 188953, 313527, 365455, 146418, 19208, -106157, -19728, -101439, -88600, 46602, 23941, 15093, 43872, 18774, 35600, -50416, 73397, 54737, 257222, 382562, 278199, 149759, 87577, 53088, 2942, -183321, -142309, -87110, 68076, 122863, 64884, 70072, -23237, -153564, -177619, -155328, -58293, -97923, -125597, 74258, 150230, 254248, 283716, 305857, 279133, 178500, 295054, 434632, 331309, 222583, 162953, 82345, 123459]
7511A23459q9444j03359R4874J06460m9695j32503N10J3124j26064q8502Q9734
7500a61406J81917J10203j30115L5251j06401M3258L1705l8161P4904k7185L0610
7489D4580J4298j61152k05764o0755J53162Q7851j40675j5858M8836l2532j7785
7478b85794J00369K840O7177m5574r9572O3924p9819m2260P6526J15507Q6795
7467c9881J05261M4376O7263j42697R970n3248j21305J782R6074O7435l4612q4460
7455h4042K5960M8043K932J21804M1277m1655j06585j17609r1455J5744q4576
7444b70162P2216Q7458Q9972q9390J53353M7891K7442L8206p0635j60933O3757
7433a0825R2487o3283j54752N8064K5555j80246k1248K11505k3713q5636o9049
$$ y = [123459, 34015, -69344, 25530, 131990, 82295, -50208, -49698, -36574, -162638, -251140, -161406, 20511, 130714, 599, 35850, -70551, -27293, 4412, -33749, 41155, 13970, 44580, 58878, -102274, -308038, -368793, -215631, -127780, -268455, -284313, -235477, -268009, -285794, -185425, -182585, -115408, -160982, -260554, -196630, -276449, -318709, -242183, -126676, -39881, 65380, 109756, 177019, 34322, 44292, -8956, -130261, -128479, -32405, 35030, 418, -84042, -58082, -10039, -7107, 114697, 155974, 114319, 7734, -109875, -201330, -185586, -270162, -197946, -110488, -20516, -109906, 43447, 91338, 118780, 156986, 86351, -74582, -10825, 81662, 18379, -136373, -78309, -52754, -233000, -254248, -42743, -66456, -152092, -221141]
7422b21141M5420R5767Q6980J03055O7260q3994j12213m9710R7538R5025m0743
7411H3244r3016J48354K6116O532j28895K0593M3892M0354J85649p4706p3694
7400A84423q1527o6832j36994n0337N6792O683N9328l6836r7319R7086R36K7131
7388c7466r282m3488r2627m9195J37686Q6934j04499J10666J07007R2935o6545
7377A32126l8640J9504j12627q7965N243o7375J60576J27150l3378j32382m7430
7366g5198p0938j4767p6996j53646L6825J1143j6794K84462J53911p5855m0576
7355c8429j02990J09121j01586j12761R8860m4256q1977m6432P4201p1159k13451
7344e30859K14865K90014J18292P943q7873K3203j02089k2650j11039k118O0265
$$ y = [-221141, -175721, -79954, 7026, 110081, 177341, 93347, -18866, -68576, 28962, 123987, 83244, -9772, 138582, 164698, 171230, 42335, 62928, 106820, 147174, 332823, 258117, 184423, 102896, 36064, -100930, -151267, -94475, -87792, -28464, -65300, -162619, -65533, -64597, -37466, -46748, -90236, -182863, -232058, -94372, -7438, -111937, -1271, 105736, 198671, 132126, 93486, 112990, 363, -87602, -82359, -149734, 10842, 137992, 104614, -27768, -75198, -146136, -160903, -237899, -391545, -354720, -343577, -360371, -75909, 78002, 2147, -38429, -141419, -32298, -133884, -246645, -147785, -192041, -274018, -320450, -246249, -317408, -530859, -315994, -25980, 92312, 100255, 12382, 35585, -66504, -89154, -200193, -202311, -142046]
7333a42046o9542q4782K4921J18071P9005q0114p8310m0829Q8297J84760K81116
7322B80547m1720k14115k44976l8199J04400O4088J2337j42389q7612k5841J22776
7311b10704K46529J75250j40468j93539N0817k5006p3614J0504J19988K27511
7301A87268K31563j48858l14242j27515L2185J1912j49365j19709P5782J01864
7291b19115j08564k70502j28146R3288J13489J18528K25154J06226M6283J0829
7281a2530J73222j8625q0853o1982j15742N6155q5497l9826J6713J11828J03372
7270D6235J9034j1273K1469p7499j64252m8557j40167J29837J61479j44403j66253
7259c74350N3863Q2620P3843k693j53010m2637K4433J19180j27728o6511P0371
$$ y = [-142046, -211588, -296370, -271449, -153378, -74373, -154487, -232797, -273626, -185329, -569, 280547, 238827, 24712, -220264, -258463, -154063, -89975, -77638, -220027, -307639, -333480, -210704, 35825, 211075, 70607, -122932, -72115, -97121, -170735, -160231, -40243, 187268, 418831, 269973, -44269, -171784, -139599, -127687, -277052, -396761, -320979, -219115, -327679, -598181, -726327, -633039, -519550, -401022, -175868, -69642, -23359, -12530, 160692, 142067, 61214, -768, -116510, -60355, -145852, -185678, -168965, -57137, 46235, 65269, 53996, 75465, -2034, -166286, -214843, -355010, -225173, -63694, -208097, -374350, -320487, -237867, -164024, -166717, -319727, -362364, -337931, -218751, -346479, -412990, -342619]
7248c42619R8918P0012L63553J38223k79801k79922k3956K4075K59543M5169k33922
7237a60727n2206M3455m519L2201k0263k1109L279j76292r0097L9357J56385M9265
7225b01271J70002J49162l8676j98454j56811J12812J03120P0123J51860O6378
7215B28245p136j22290l0844J10443q3726j57354R0324L2286n6202k7067k9339
7204e2660j3484j5315j7098K4698N014p9751L6478K1496R504N8148o17j8534j10564
7191a52685j62905k4414j4271m33R626J56010P2830m7317J9550Q0932j94025j39522
7179c96624j14415J6813K50851R7795j29503q268J11526J14269N0448j15110n8677
7168a80895O7355J04243J60075j93208j66189r119l441J14164J36858L9730k6716
$$ y = [-342619, -243701, -173689, 189864, 328087, 48286, -231636, -255592, -231517, 28026, 73195, -160727, -212933, -169478, -173997, -141796, -162059, -183168, -179889, -356181, -446278, -406921, -250536, -201271, -31269, 117893, 79217, -119237, -276048, -163236, -60116, 10007, 161867, 228245, 221109, 98819, 67975, 178418, 94692, -62662, 27662, 59948, 3746, -23321, -52660, -66144, -81459, -98557, -73859, -68845, -148596, -112118, -90622, -81118, -22970, -23587, -42121, -152685, -315590, -340004, -354275, -354708, -345082, -189072, -116242, -163559, -144009, -63077, -257102, -396624, -511039, -494226, -243375, -145580, -275083, -283351, -171825, -57556, -7108, -122218, -180895, -113540, -9297, 150778, -42430, -208619, -217738, -221179, -107015, 29843, 69573, 42857]
7157D2857P8481J19508l7362k01493K2863j0094j12966j22164K1434L2845K18
7146a65873J2204O2755n911r4295j10258J03630P3850J33187o9727l5485o7272
7135a63195r4351J11179K79766R0697j30431j48776l6036R7218j81271o1991m5031
7124b82222m6374K5327K1346j01092O6568Q9824P9584o8737j21762N3157J28705
7113a55676M9739L5885J38839j89715o9068J75772K9876p8433m8485L1664l4312
7102a13914m3919N7785K0780j16520Q5457p2142J64194K06635O0048m9382L2352
7091B31374j56868q4316J2610L0294o6083j13900j15317m3703J24050J15030K12367
7080A45538N5843j04319L3727l6455J461j20423j1771o1900r3885N9239N3051
$$ y = [42857, 121338, 240846, 203484, 1991, 24854, 14760, -98206, -220370, -198936, -166091, -165873, -153669, -90914, -96825, -191120, -301378, -197748, -123898, 9289, -60438, -95923, -163195, -257546, -146367, 133399, 224096, 93665, -55111, -91147, 6071, -175200, -237191, -282222, -328596, -303269, -281923, -383015, -316447, -226623, -147039, -215776, -337538, -284381, -155676, -105937, -70052, 68787, -120928, -189996, -14224, 15652, -62781, -111266, -79602, -113914, -157833, -100048, -79268, -195788, -110331, -182473, -18279, 188356, 248404, 199022, 231374, 74506, -9810, 2800, 33094, -32989, -146889, -262206, -305909, -181859, -66829, 145538, 201381, 97062, 130789, 94334, 95795, -24628, -36399, -98299, -192184, -132945, -79894]
7069g9894j10129o9197n6629J4648j76831J5257N4898j23515J30734K56179L7688
7058a06791K9914J26810l0113r8171k00199r2041N9942J04581q992l0643J09579
7047a36124O6026O0189L9662p0197M9616M4175J024Q0671q2832r7073k6577O7846
7035c594J49191p5045q7061o8901k7479o0845M7671J22617N7693k2529j41829
7024a10111r2060o8711R8790o2480j20225l842l103Q8085P4491K2574K5130J01836
7012d9626M6507r4326p3786R5753J910p5347J37248p73l0630N0189q4915J00430
7000B2634j0588O1642j69990k66355J17185J13071p4538m5961n1391O0802o7348
6989c10837l6419R3202j01011q0376r3483O8866J67948J29131L6457L0812J4144
$$ y = [-79894, -190023, -259220, -315849, -301201, -478032, -462775, -407877, -531392, -400658, -144479, -106791, -76877, 49933, 19820, -78351, -278550, -370591, -310649, -206068, -215060, -245703, -136124, -70098, -9909, 29753, -40444, 9172, 53347, 54371, 135042, 52210, -44863, -71440, -3594, 145597, 70552, -16509, -85410, -112889, -173734, -126063, -3446, 54247, 31718, -110111, -202171, -270882, -172092, -234572, -354797, -358639, -361742, -273657, -199166, -176592, -151462, -49626, -3119, -97445, -171231, -75478, -73568, -148915, -11667, -12440, -43070, 7119, -77796, 22634, 12046, 73688, -96302, -362657, -245472, -132401, -206939, -252900, -304291, -243489, -310837, -347256, -254054, -355065, -435441, -528924, -460058, -292110, -162979, -126522, -95710, -81566]
6978h1566l297k1474J5731k11268j58376P6450P0993M0647Q626K63091K4917q9877
6966f5403j48917L8053J75555O7897q0535l9983N787n2388m5247L2131q3285k4238
6954b20573J18988J5764l0232k5491J7395J30853j2395J02564q373j17207O4425
6943C5718K7837k24678j03379J5675R723m250P3234P0975k8192k433Q7433J97338
6931A55001l5837k2740R8974K0357o0026r7858m935L2479J57549K2864k0990q2171
6919A62667m4182N3247j41156j14783m4782Q6359J13114m1103J4805J41173Q9258
6908B74617n4746Q258L5419j47833L4430o6169k11082P8056M7107J04544o3345
6897C9256o5430n8376L6061J7094m2459l3105J17896K3554O7929o764j25827j00634
$$ y = [-81566, -84863, -106337, -90606, -301874, -460250, -383800, -312807, -272160, -263534, -443, 24474, -65403, -214320, -176267, -712, 67185, -13350, -53333, -47546, -99934, -145181, -113050, -196335, -220573, -101585, -85821, -116053, -141544, -124149, 6704, -5691, 96873, 88500, -28707, 35718, 63555, -161123, -264502, -248827, -239104, -243354, -170120, -99145, -127337, -129770, -42337, 155001, 119164, 96424, 195398, 215755, 155729, 57871, 52936, 85415, 242964, 265828, 244838, 162667, 118485, 171732, 30576, -84207, -128989, -42630, 70484, 29381, 44186, 185359, 274617, 219871, 228129, 263548, 115715, 150145, 83976, -127106, -49050, -1943, 102601, 39256, -26174, -84550, -48489, -31395, -73854, -106959, 10937, 34491, 102420, 95656, -30171, -130805]
6885a30805O0324J58670N3669r200K9081n047j68024p3795P1525o4702p7652Q5245
6873g0711R3862P0060m7354q9637j96119J964O0211R3934Q3990j00765J09571
6862I006p8308j53814n6199Q1702R5716L3203l6793q078K7039K8380N0010K2988
6850A4852Q8375m5563l3394r4493m1488J61171O746j42901j37942p6176J67157
6839a33656P9148j68667o8228O1099J65393M2162q8227j83360R0392l3338J8830
6828b18452K2531K14179l5868j48069j5690J79138n2118O5491K0311N5495k06397
6817a19449k37302p5852L37647M8880o4893N6482J52596p9632j29465j44622J9822
6806b35788j1284m4694Q0298R1055J41587J01529n3937p014o9284j03822J4761
$$ y = [-130805, -70481, 88189, 141858, 132658, 161739, 156692, -11332, -85127, -13602, -78304, -155956, -70711, 23151, 93211, 45857, -43780, -239899, -237935, -177724, -83790, 200, -100565, 9006, -69302, -223116, -279315, -197613, -101897, -68694, -105487, -113565, -86526, -58146, -8136, 14852, 103227, 57664, 24270, -70223, -111711, 49460, 56206, -86695, -224637, -300813, -133656, -54508, -223175, -291403, -230304, -64911, -22749, -110976, -294336, -203944, -237282, -218452, -195921, 18258, -17610, -165679, -181369, -2231, -54349, 11142, 31453, 86948, -119449, -356751, -432603, -94956, -46076, -110969, -54487, 98109, 18477, -110988, -255610, -235788, -247072, -291766, -211468, -120413, 21174, 122703, 68766, 61752, -7532, -111354, -96593]
6795i6593J24836M6375j13864r4356o405m4054J18344J20414L6144N4655L3127
6784A78623j65489j24893j83186m563J0889Q8784J24495J80900m7942o4143k5315
6773c1840j40298k138m150M7515j11513k08025J22342K10873L384j55213M7345
6762b21718J85074J7518Q6132P1871p0632J18607o3935j92128o2316q8768J7628
6751b02667o7031J42125J61186n4167N7610N003Q1709L6964j17975j22750n2996
6740a32989M6971P3567n6414O5382K2681j43865n4783k1964j06742o2151Q8140
6729b82167j0811P2432j16899Q839J71395K3421J32850J01259p703n6331l9391
6718c106R0155r0026j75782P7322M7405j1157q7836o5236P2922J05069R9612P4928
$$ y = [-96593, 28243, 74618, -39246, -133602, -140007, -184061, -65717, 54697, 90841, 145496, 178623, 13134, -111759, -294945, -299508, -288619, -199835, -75340, 105560, 57618, -6525, -31840, -172138, -174276, -178426, -130911, -242424, -450449, -328107, -117234, -113850, -269063, -221718, -36644, -19126, 67006, 138877, 68245, 186852, 122917, -69211, -131527, -220295, -202667, -269698, -127573, 33613, -20554, 37056, 42059, 123768, 160732, 42757, -79993, -132989, -86018, -12451, -68865, -3483, 19198, -124667, -179450, -201414, -308156, -370307, -282167, -292978, -220546, -337445, -328606, -157211, -133790, -940, 100319, 92616, 36285, -3106, 87049, -2977, -178759, -101437, -54032, -65189, -153025, -218261, -145339, -40270, 59342, 134270]
6706A34270m1810j14985q1064n944M3796K1168k27394N813J8549j04660L709J94794
6694a53758J34802p3187p7131m9388L11650J05228k7635L3579L9330j14974r9873
6683B8643O8212J3532j64718q258M3655p2845j39673J8791k5668l3179N7339J51193
6671f2976L15618Q3638L849l84418k51628K5525P1798L0728j13086J5091L7091
6660b28770N7277P8785j40234l7726l0789P1138J70391o2589j7507J46701Q1463
6649H8140k5897j70346q2625L0435o9513O7485M4906Q1854J07512J14177k10981
6638b4853j90873k4414L772P8361P642p6891J014Q59P3859J62190J61339J29653
6626C01658q9833j07122J1216j51014m595J70928o7308l263l8103r7465K5569
$$ y = [134270, 92460, -22525, -103589, -109533, -65737, -44569, -271963, -266150, -247601, -352261, -348552, -153758, -18956, -92143, -169274, -218662, 92988, 198216, 170581, 204160, 243490, 128516, 28643, 96855, 110387, -54331, -62589, -18934, -91779, -231452, -212661, -238329, -271508, -214169, -62976, 252642, 336280, 340129, -44289, -295917, -270392, -198594, -167866, -280952, -265861, -228770, -171493, -92708, -232942, -270668, -301457, -230319, -59928, -122517, -140024, 6677, 88140, 62243, -108103, -190728, -160293, -229806, -162321, -117415, -35561, 71951, 186128, -24853, -215726, -240140, -236368, -158007, -150365, -227256, -226242, -225383, -151524, 10666, 172005, 301658, 211825, 104703, 115919, -35095, -39690, 131238, 63930, 60667, 22564, -74901, -49332]
6615d9332J7797n3262j07156p2215k0441Q7365R5371q8760J85087Q1058j85446
6604a09934j88974O0351q552Q0173R2991o6400n7134j19300O8010M1974J04377
6593a02418J60213L286J15432n606k37079j74799J22509K65881n037j75909R842
6582b3685K03288K0729j33071o4252q8365J15334m3759J3778j21227q9334J66161
6571d4403Q0278j14837O8133M4957p469Q0320Q3774J53098q9189j07371r761J07239
6559B44769n6871k2645J33317m7523j76721p7321L0574K7698j26550r6611m0669
6548b08553j07479J08595J00357p168P6968K41939Q8419j05999j55785m870J18910
6537A45334J0852K6869N1082j57130l9195o9329k2554J90612P5349o9210k6691
$$ y = [-49332, -31535, -84797, -191953, -264168, -284609, -197244, -101873, -190633, -5546, 75512, -109934, -298908, -238557, -247109, -166936, -73945, -140345, -197479, -316779, -248769, -206795, -102418, 57795, 61081, 176513, 170907, -66172, -240971, -118462, 147419, 142382, -33527, -23685, 179603, 200332, 67261, 3009, -85356, 29978, -13781, -3, -121230, -210564, -44403, 35875, -78962, -10829, 34128, 26659, 106979, 190753, 343851, 254662, 147291, 137530, 244769, 187898, 165253, 298570, 251047, 74326, -2995, 27579, 55277, -71273, -167884, -208553, -316032, -207437, -107080, -114248, -37280, 204659, 293078, 187079, 31294, 26424, 145334, 156186, 183055, 234137, 77007, 37812, -31517, -54071, 136541, 211890, 142680, 115989]
6526A15989O5765P4246P156j7891J7583l7922n4835J14358k33626n8890j6979
6515b5046L1502l1134J01051J47283M8783k6898j15304j60194j43911j3506K2170
6504a65204J83801N4741O3367j71536K5067L1801J2863J42919j14897n7443K11632
6493B17111O177r6955r8145q4029n7189j54582n3372M9658J00738k285K6377L2906
6481a13590L1346j5076P4646J49533N412L1622J5494j78442k16150o7272O3661
6470b18816P1522o0207R4779r6981L5890J43122l0953J6040R9109k4612r7109
6459f8216k7631j58187l0191p8405R9378R6111r763J37159r0712n2024J07121
6448g5360j33784q3019L4190L5891o3665P6970M3514N323j67567o8250J00694
$$ y = [115989, 181754, 256000, 263156, 245265, 262848, 224926, 170091, 284449, 50823, -8067, -25046, 6456, -24678, 76373, 223656, 272439, 245541, 130237, -29957, -173868, -187374, -165204, 18597, 73338, 136705, -34831, -9764, 22037, 34900, 177819, 62922, 5479, 217111, 223288, 126333, 28188, -55841, -113030, -267612, -320984, -271326, -170588, -172873, -146496, -113590, -82244, -97320, -22674, 126859, 132271, 163893, 179387, 945, -215205, -282477, -218816, -147294, -207501, -112722, -209703, -173813, -30691, -61644, -45604, 53505, 28893, -68216, -95847, -254034, -284225, -362630, -263252, -167141, -176904, -39745, -130457, -182481, -75360, -209144, -292163, -257973, -222082, -285747, -208777, -165263, -159940, -327507, -395757, -295063]
6437b95063O5509P3660j3534j44052J00287J73523o3142n1406r785j161O0512
6426a04652J48850j14241j38785L653j51632r8494M0521J8393R5017K19575N1370
6415c0425Q8431j35670j8596J39837m614n5783j21442o8823J68609L13508J8739
6404B93771k23740L2593O2601j98237j74850J76222R0677n2941j5440K0254p692
6393C218n7056j51160p7906K8793P8945M784j46003Q9207J12409J94524Q5081
6382A64836J0005o8090j94268j51314K00455J55725N4897l4021k5372o6324k01010
6371a54481m4935J36831P0843N0997Q0045j16829l4825k9870L7435R0155j78745
6360i3379m0854L6437J53971Q9647P2505m4252n8782r6048N707J9951N8119N6097
$$ y = [-295063, -229554, -155894, -169428, -313480, -213193, -39670, -102812, -154218, -164003, -165164, -104652, 44198, -70043, -208828, -205175, -356807, -455301, -414780, -396387, -301370, -81795, -30425, 58006, -77664, -96260, 43577, 38963, -16820, -138262, -207085, -38476, 275032, 293771, 70031, 102624, 165225, -33012, -207862, -31640, 59037, 6096, -9344, 10910, 3218, -53838, -204998, -282904, -254111, -175166, -170382, -316385, -227178, -114769, 79755, 164836, 174841, 106751, -87517, -238831, -38376, 117349, 172246, 138225, 112853, 46529, -154481, -199416, -62585, 8258, 59255, 139300, 22471, -12354, -42224, -4789, 85366, -93379, -134233, -97796, 56175, 145822, 218327, 174075, 115293, 19245, 24952, 44903, 103022, 159119]
6348A59119L209k3220j74393l00752j6414L5510Q3742P2880l3078K07494J46686
6337A60783o2545J4112P2334J77503j93288j80700O0981k22217m5715J4323m9725
6326b54154J90822k01K6641j35256Q62M3874P2748r4429j65903P6571J43680K46568
6314A51823l869j91938r7344K27315N6768R8557j6247j12241j29608k5877l5304
6303g7965P7207J49490N4480k20025p2177k6353K6239Q3836K6087J61852k00404
6292a7733m9012J42214J12329m9893l4671p185m206j02790j9941M7034M1673j1795
6280D6024o2597J85586k7636j67802o3373k7312K9470J06050J8697Q7475o7315
6269E7267k6353m8572r022K4938m1641k46957J05909K39621O7221n1468j82356
$$ y = [159119, 162328, 139108, -35285, -336037, -352451, -316941, -233199, -160319, -193397, 14097, 160783, 98238, 112350, 184684, 362187, 168899, -11801, 49180, -173037, -218752, -204429, -254154, -63332, -63533, -36892, -172148, -171286, -127412, -54664, -149093, -314996, -238425, -94745, 151823, 147954, -43984, -141328, 85987, 142755, 241312, 225065, 112824, -16784, -42661, -77965, -758, 148732, 203212, -16813, -88990, -115343, -89104, -5268, 20819, 182671, -17733, -66745, 75469, 187798, 137905, 103234, 96049, 91843, -10947, -30888, 16146, 57819, 46024, -16573, 169013, 141377, -26425, -89798, -117110, -87640, 18410, 37107, 124582, 57267, 30914, -17658, -26680, -1742, -43383, -290340, -184431, 55190, 122411, 70943, -111413]
6258a11413j21589K29643K32434p5270p9841p7305K6666o3332j1809p002J74770
6247A15952n9304l03148j18018J92481K26023P542Q6549P9053j12777p3567N9628
6236A00414r7429R304M2698o5456j7840j3573q8101l0793O7009J11855j00428
6225h2340J702P7179q8234K2190J89410Q687o2505M2896K479r5386O8678K9314
6213A14070j06525n4025j07481m1566J569j41732J4070K30942j4158p9891J37253
6202d7474k8073k8293j28423L8060J2907K7930m2237J3365j6667J2830M8887J03066
6190c4122J38306k2416j5571j64441n2342J7977m7729p9733J09994j249R907N5860
6178h5559P412J5024J6715l6292K7096j45472q8149O8507K6150P1230R0874J6167
$$ y = [-111413, -233002, -3359, 229075, 153805, 73964, -3341, 23325, -40007, -51816, -58818, 115952, 56648, -246500, -364518, -172037, 53986, 61528, 148077, 227130, 114353, 40786, 100414, 2985, 12289, 54987, -10469, -28309, -41882, -129983, -160776, -93767, 18088, -82340, -80638, -3459, -91693, -69503, 119907, 128594, 66089, 108985, 111464, 16078, 84756, 114070, 7545, -46480, -153961, -195527, -193958, -335690, -321620, -90678, -104836, -184727, -47474, -75547, -103840, -232263, -194203, -181296, -153366, -195603, -182238, -198905, -186075, -137188, -34122, 104184, 81768, 66197, -98244, -150586, -132609, -180338, -260071, -150077, -151326, -141419, -85559, -78147, -63123, -46408, -82700, -55604, -201076, -289225, -220718, -194568, -123338, -32464, -16297]
6166a6297Q8366M0632j03076j32210J36088l1924l8522P7425j84655k5880k4646
6155b14699o2114q7005K0251K09488L4441J48406o0404j63942j25025K1003K06514
6144g3086M9447o9014j5307J15958K1699j09684j06840J212r0840j16474k0955
6133d13884J81265R9864n9634J3557L7685o6501P5168L9641L4011o6412r8009
6122b23249r155j914J42869o8158m1865K1598Q9480j56257k06708J36244M7822
6111b69293k2091k563l6100q7936K39840K46778L2976N3171P5969j76431k14306
6100a59986J00130P595M2920k6213l155k1862k31619l7698R7577O5650J64255
6089b406Q976j06214l2188J12193j03178r5423P2584J2544Q4783k2187J75570
$$ y = [-16297, 72069, 112701, 9625, -122585, 13503, -18421, -56943, 20482, -164173, -190053, -214699, -276813, -363818, -343567, -134079, -99638, 48768, -11636, -175578, -300603, -279600, -73086, -23639, -92653, -107960, 7998, 29697, -79987, -186827, -185615, -276455, -392929, -413884, -232619, -132755, -192389, -178832, -141147, -207648, -132480, -92839, -58828, -125240, -223249, -232404, -234318, -91449, -159607, -201472, -179874, -90394, -246651, -453359, -317115, -269293, -291384, -293947, -330047, -417983, -178143, 68635, 101611, 154782, 230751, 54320, -159986, -59856, -52261, -9341, -35554, -38709, -60571, -292190, -329888, -232311, -166661, -2406, 6570, -99644, -131832, -19639, -122817, -218240, -145656, -133112, -48329, -70516, 105054]
6078A05054J09352j45679m7209M6278j06166k74125p2069O2834J06096K23335
6068G701j012j04749J2284k4418j1973j7408J01395k4j12074n7640K1759p156
6056a93315k4125J70805L1276J03172k1113o1543M8765M8249j33689j2339j75631
6045b19488j46679m2033N1894L2743J68688J18232o3618Q947q888n8883n9777
6034b18862J6152P3438k6840P8057J75016P9536M2515j54744k05121j18340M7610
6023b11583p859J40437R0790j17557j66526L7798J48276K3744j44349k37139J03043
6012c40925K58729n0488j28304k7458Q7591J58993N6967p9290q6290k2986m950
6001a78411K57619J74177j9367j16182l2974Q6625p2146P2119J465j14681k9580
$$ y = [105054, 214406, 68727, 21518, 67796, -38370, -312495, -384564, -321730, -215634, 7701, 6689, -98060, -85776, -110194, -122167, -139575, -38180, -38204, -150278, -207918, -186159, -193315, -217440, -46635, -15359, 87813, 66700, 5157, 53922, 102171, -31518, -43857, -219488, -366167, -408200, -356306, -323563, -154875, -36643, -100261, -91314, -100202, -159085, -218862, -202710, -129272, -156112, -78055, 96961, 176497, 219012, 64268, -140853, -259193, -211583, -219442, -79005, 11785, -105772, -272298, -234500, -86224, -62480, -206829, -443968, -340925, -82196, -132684, -260988, -288446, -200855, -41862, 15105, -64185, -150475, -173461, -178411, 79208, 253385, 234018, 117836, 84862, 171487, 99341, 171460, 172925, 58244, 28664]
5990B8664Q1494j5862m0708q2406r5477k4762J27611J41947n5383q0986K5528
5979I660P962J18865N4365k11250q1438o8122k5533K0172N1032r8181J89748R7284
5967F4564O4108j01195j82069j52725m5101K04239J20597m8202j09324j39479
5957c24587P9368O5433J19565j22998j27231J83509P0780m9624p6696J04006J5535
5946f2940j00516l1460R575N4243J10153N5543m5173j39449k5181J7806N4945
5935a02454L2869j8775N9672J838o4835J14k7805j4115m5788j38995Q4719J31539
5923a02016R6824K7515j54072O2201L5256L0137R6047O0074l5448o8814J43512
5912A91216J95372n4732K9006J5887j33685j75430k20475r4563j05476m9728j9291
$$ y = [28664, 110158, 94296, 53588, -28818, -124295, -149057, -21446, 120501, 65118, -15868, 9660, 17622, 136487, 190852, -20398, -101836, -169958, -195491, -175319, -124287, -222468, -32720, 64564, 128672, 27477, -154592, -307317, -352418, -148179, -27582, -75784, -185108, -324587, -245219, -179786, -60221, -183219, -310450, -126941, -56161, -105785, -182481, -78475, -62940, -163456, -194916, -185341, -131098, -20945, 34598, -10575, -150024, -175205, -157399, -102454, -69585, -88360, -28688, -26850, -91685, -91571, -119376, -133491, -179279, -318274, -233555, -102016, -5192, 22323, -131749, -69548, -34292, -4155, 91892, 151966, 116518, 47704, 191216, 386588, 331856, 360862, 376749, 243064, 67634, -152841, -247404, -352880, -402608, -421899]
5901d21899O9724P5886O7358K5719Q5316p4812q5801l3530m7232M1196j63703
5890d61778n2059K6075L82599R0295P675n004r889K4935J3187K1745p1846N7889
5878B3824m511N8075J62164j35244r0258j13790k01255R615l0761r6261R9161
5867c19241K97409J04655r9810q2059j35435m8987J19583n3155K0938Q5882k8856
5856a39076L0055P6900L2329L455n1812N3657J12351K3298j78275k19273j32873
5845c89264N3004K00073l9831j12926M4448M1215N1626j31575j13476Q0079K37692
5834g8935J72716r066k9479k24068j07339L6466N4779j04727p9190J69245N7700
5823a41898j62540j4523N806J41673O3830q9823l2647J56121R3300K2283m8864
$$ y = [-421899, -352175, -276289, -208931, -183212, -97896, -172708, -258509, -292039, -339271, -298075, -461778, -513837, -487762, -105163, -14868, -7193, -12197, -22086, 2849, 16036, 37781, -34065, 23824, 19313, 77388, 239552, 104308, 14050, -99740, -300995, -291380, -322141, -418402, -319241, -21832, 82823, -16987, -99046, -234481, -283468, -163885, -217040, -196102, -110220, -139076, -109021, -32121, 208, 3663, -48149, 5508, 117859, 141157, -37118, -256391, -389264, -336260, -136187, -176018, -288944, -244496, -203281, -151655, -283230, -396706, -316627, -78935, 93781, 84715, 55236, -168832, -276171, -239705, -184926, -289653, -368843, -199598, -141898, -304438, -318961, -313155, -171482, -107652, -197475, -230122, -74001, 19299, 41582, -7282]
5812g282k1552j71097J30128J37072J53750J37151n5542k93942j48777M1861J51421
5801E3191j32437j82709j2634l3384q292K06720N4188j22140J6835k3157k8070
5790b11889k5996k0284J17776R1390R3211j1090r4944J0470Q2684J744j20439
5779h7367k0858N2123n0721N6104K590r305O5582P6801j8353r7358L4654q205
5767d313J42784j19663j58386k5277Q6051L2753j1008n6875J29971J5488j61310
5756a29785j98775j7353J57297J05269Q7259O0442l9093k2566m1839m8320J09352
5745B1888O6329j68353j6509J38518R1087l9070j62628l8397m0709j14421l1366
5734b93631J25463K01244J02510L3495j8151m7550m2192p1629k2349O5227K44687
$$ y = [-7282, -28834, -199931, -69803, 67269, 221019, 358170, 302628, 8686, -140091, -98230, 53191, -79246, -261955, -274589, -307973, -316265, -109545, -55357, -177497, -160662, -183819, -211889, -237885, -258169, -140393, -49003, 44208, 33118, -61826, -51356, 31328, 33072, -87367, -108225, -56102, -106823, -50719, -48129, -57434, 8148, 84949, 66596, -30762, 3892, -4313, 138471, 18808, -139578, -164855, -78804, -46051, -57059, -113934, 16037, 31525, -129785, -328560, -345913, -188616, -83347, 3912, 64354, 25261, 2695, -39144, -87464, 21888, 88217, -80136, -96645, 41873, 132960, 93890, -68738, -107135, -147844, -262265, -293631, -168168, 33076, 135586, 169081, 150930, 103380, 61188, -10441, -32790, 32437, 277124]
5723B77124m3068m1004R3930j85471p5870R3119N3316j54166j96113j03098m1954
5712c23255L4330L1188N9100j2034J20463k2464m7675J54228L8524j372k8576
5701B457q3601M2685R6052N4043Q3351L4958j58046r0799p7356j0985o728p9841
5689a93810M4496J16810J73692J79694Q0060J3074j26330l34892n0901K09805
5679A11698N1757q9610l681J9907k596p2641o2915O9132j8570P094m6736k8825
5667f5986P2364p9715j38073K9918N9561k3392J3989n4689J11310r0299j32384
5656b97396Q2215L0673k5813N2365q2522j45722j23611L0020P2299J8895n1265
5645d39862J24394J94287J64935R9578N3588k11035j91314J09476J3953P3588
$$ y = [277124, 234056, 193052, 286982, 101511, 25641, 118760, 172076, 17910, -178203, -281301, -323255, -288925, -257737, -198637, -210671, -90208, -112672, -160347, -6119, 32405, 31033, 2457, -81144, -38459, 57593, 111636, 194987, 229945, 71899, -18900, -96256, -107241, -113969, -193810, -149314, -32504, 141188, 320882, 400942, 414016, 287686, -47206, -98107, 111698, 163455, 73845, 70164, 90071, 87475, 14834, -48081, 21051, 2481, 9575, -37161, -65986, 6378, -73337, -211410, -181492, -121931, -145323, -131334, -186023, -74713, -165012, -297396, -215181, -184508, -210321, -157956, -240478, -386200, -509811, -479791, -407492, -388597, -439862, -315468, -121181, 43754, 143332, 196920, -14115, -205429, -95953, -82000, -8412]
5635h412q0243j88123Q0264M4596n154Q4152J24366q0995O4358L0554P8406L563
5623A47332p6459p8375k3381n1876j1171k622q1139Q6874J00161K11936j01198
5612A20082j20382j19555N7920r5981J43376o2882n4807j12383k4344j3287j4043
5601b96286l7434M3836N6261J0457L2060J74054P9783N6404j61649j7419j1622
5590g1555o7313R3234P2081r1546j03805j23721K46568K0555o4828j04810p4731
5579b69871J81568L4934p2232l6082J56780J27720L3978p2899j10550L8235M1760
5568E3341N0391k02196j94982L729J32961o1565J09295J78387J77495j22500k56970
5557a32614P208J33909M1325R2524M2825J49059q6330l9979L4106o0073l2682
$$ y = [-8412, -88655, -276778, -196514, -151918, -157072, -72920, 51446, -29549, 34809, 65363, 143769, 147332, 70873, -7502, -30883, -82759, -93930, -96552, -177691, -90817, 9344, 221280, 120082, -300, -119855, -61935, -157916, -14540, -77422, -132229, -244612, -268956, -282243, -296286, -333720, -289884, -233623, -223166, -191106, -17052, 62731, 119135, -42514, -59933, -71555, -138868, -45634, 26447, -65099, -168904, -292625, -46057, -25502, -90330, -195140, -269871, -88303, -53369, -125601, -161683, -4903, 122817, 156795, 83896, -26654, 11581, 53341, 103732, -98464, -293446, -289717, -156756, -218321, -109026, 69361, 246856, 124356, -132614, -125406, 8503, 49828, 142352, 185177, 334236, 247906, 207927, 242033, 181960, 149278]
5546A49278n5917r1194k4036J638o3589O6191R8172j00527j21727r2295o2261
5535b96267M0571J21195Q0832J0612L2522Q6290L5594j09802O3033k145n9008
5524C427Q9481R0034M3297n4686k23310n5036j6794K07387M208J8869l036R4188
5512A98029J08403q0029k47453p7999N3056n9911k15270K3109Q1756P3680J05610
5501c7019lJ3336J29986P0609j79391j21215J71665p3268j98245j40383L3554
5490c30374R0405m0173j25324O0688K64608J83359q787M6867m3887j28906n1360
5479h2884j21917J01543J46996Q3577k0862m1451n9954L6380p1357Q3792q4313
5468c0450r8500Q9798j16731R7200J05894j21914J9530J10940Q9451j459k6051
$$ y = [149278, 93361, 2167, -21869, -20231, -83820, -17629, 80543, -19984, -141711, -234006, -296267, -255696, -134501, -53669, -43057, -10535, 75755, 111349, 1547, 64580, 62435, 3427, 92908, 182942, 226239, 171553, -51757, -106793, -123587, 83800, 88008, 106877, 103841, 198029, 306432, 226403, -21050, -99049, -45993, -105904, -321174, -298065, -216309, -142629, -37019, -37022, -23686, 106300, 176909, -2482, -123697, 47968, -25300, -223545, -363928, -330374, -239969, -280142, -405466, -344778, -80170, 103189, 94402, 141269, 97382, -31524, -82884, -204801, -103258, 43738, 127315, 106453, 65002, 5048, 41428, -29929, 53863, -30450, -128950, -39152, -155883, -58683, 47211, -74703, -55173, 55767, 145218, 143759, 117708]
5457A17708j48804j65078K7115J39044Q7055p8770j09385j42709Q1761p2372l6054
5446c00489P7379J29866K6010r8878P2048O7776L6818k6217k17028L5919O7446
5435a29350P3128o28l4196j7294j1924L2121R1271L3970J9022o5866J17368j09492
5423a870q1228o2141l4747o0519J54042p8945J3920Q6245p7505J06971j0634k7001
5411g3412j6945Q4070K6431n7636j7983n5088J41239j0616l7181p0788j10391
5400a98300o9172K0833J78140J43j69484n1845J12790J56371j8909M9299J3211
5389B3077O1289j31786j03141J7982Q6830J84777n8557j51082r2720J5725P0873
5378g6733J69919M2759m4051j34241j7829j5920j8573l26052j9849K98475J31535
$$ y = [117708, -31096, -196174, -169059, -30015, 57040, -21730, -131115, -273824, -192063, -264435, -300489, -223110, -93244, -67234, -166112, -94064, -26288, 10530, -15687, -232715, -196796, -129350, -56222, -56850, -91046, -108340, -120264, -88143, 3128, 37098, 56120, -9746, 107622, -1870, -83098, -145239, -179986, -240505, -86463, -165408, -151488, -65243, -142748, -35777, -46411, -73412, -90357, -6287, 20144, -37492, -55475, -110563, 30676, 20060, -17121, -87909, -198300, -267472, -246639, -68499, -68356, -237840, -289685, -176895, -20524, -39433, 9866, 23077, 84366, -47420, -150561, -132579, -45749, 139028, 80471, -70611, -163331, -147606, -76733, 93186, 135945, 91894, -42347, -60176, -76096, -94669, -420721, -440570, -142095, -10560]
5367a0560o7788N635O7919J13776m1570r0867l8728j9550k1482L9645N4852j8339
5355b7057o691n0597m1547k1618J21956L8199j47796p2273M9245Q797n2302k2511
5343b24195j37859P7545K07636J28920j24095j00360r2939N7820K97712Q8924
5333A79109r4079k03132j6908J02359n586J39577M997K2982j70586j50409j2543
5322b04219J4266K63938K13158j09309j21659j3891p6143m9928O1524m982j68011
5311a95256K5036Q7263q7036r9610Q0033J41915K4589P9937m4645j88222j14568
5300b90564j20705J25043L73401N2049m9519O983j63218p1508J024O406M7198
5289h3410j9121n209j8696j29004k8569J10584J57073N7831p1285J37978J24094
$$ y = [-10560, -78348, -72713, -4794, 108982, 67412, -23455, -62183, -81733, -103215, -63570, -8718, -27057, -33748, -84345, -125892, -147510, -25554, 12645, -135151, -207424, -158179, -149382, -201684, -224195, -362054, -284509, -76873, 52047, -72048, -172408, -265347, -207527, 90185, 179109, 85030, -118102, -135010, -32651, -38237, 101340, 106337, 129319, -41267, -191676, -204219, -189953, 73985, 287143, 177834, 56175, 42284, -33859, -83787, -22263, -27245, -195256, -170220, -82957, -169993, -269603, -189570, -47655, -23066, 56871, 12226, -175996, -290564, -411269, -286226, 87175, 139224, 89705, 96688, -66530, -138038, -137014, -130608, -83410, -102531, -107740, -126436, -255440, -284009, -173425, -16352, 41479, -29806, 108172, 232266]
5278B32266m0430j44463j76979j28530m833J54719J2458r7160q9899j42458K7732
5267c97577J76028J34446P6949m0488J34364n140j30838Q3097J11422r350q6725
5256D6188o876P7410j11995j01753k29407J33911J50433J05667L0800N5195k8415
5245A21158q4989J3858K527j80014J60233j1141j14003o4490j04306J22950R5546
$$ y = [232266, 191836, 47373, -129606, -258136, -262969, -108250, -95792, -192952, -282851, -425309, -397577, -221549, -87103, -10154, -50642, 83722, 78582, -52256, 30841, 142263, 132913, 46188, 39312, 116722, 4727, -97026, -326433, -192522, -42089, 63578, 94378, 149573, 121158, 36169, 50027, 52554, -127460, 32773, 21632, -92371, -156861, -261167, -138217, -42671]
$$ [...]
##END NTUPLES=NMR SPECTRUM
##END=
