##TITLE=Analysis number 329825
Compound Code btb 00914
Project Code adrs
Chemist Name fudan
##JCAMPDX= 6.0         $$ Bruker NMR JCAMP-DX V2.0
##DATA TYPE= NMR SPECTRUM
##DATA CLASS= NTUPLES
##ORIGIN= Bruker BioSpin GmbH
##OWNER= nmr
$$ XWIN-NMR		Version 3.5
$$ Wed Oct  3 09:45:28 2007 GMT Daylight Time (UT+1h)  MAYBRIDGE\nmr@NMR_250MHZ
##.OBSERVE FREQUENCY= 250.131544655141
##.OBSERVE NUCLEUS= ^1H
##.ACQUISITION MODE= SIMULTANEOUS (DQD)
##.ACQUISITION SCHEME= undefined
##.AVERAGES= 16
##.DIGITISER RES= 18
##SPECTROMETER/DATA SYSTEM= dpx250
##.PULSE SEQUENCE= zg30
##.SOLVENT NAME= CDCl3
##.SHIFT REFERENCE= (INTERNAL, CDCl3, 0, 16.522)
##AUDIT TRAIL= $$ (NUMBER, WHEN, WHO, WHERE, WHAT)
$$ ##TITLE= Audit trail, XWIN-NMR		Version 3.5
$$ ##JCAMPDX= 5.01
$$ ##ORIGIN= Bruker BioSpin GmbH
$$ ##OWNER= nmr
$$ C:\u/data/dgb/nmr/ADRS/140/pdata/1/auditp.txt
$$ ##AUDIT TRAIL=  $$ (NUMBER, WHEN, WHO, WHERE, WHAT)
(   1,<2007-10-03 09:45:00.03 +100>,<MAYBRIDGE\nmr>,<NMR_250MHZ>,
      <created by zg, POWCHK disabled, PULCHK disabled
       configuration hash MD5:
       76 6E 9A 78 1E 09 19 81 EC 84 63 8F B0 6A 59 2D
       data hash MD5: 64K
       0B F0 0E D5 54 FD ED 7E 7E CC 22 5E C7 25 70 AC>)
(   2,<2007-10-03 09:45:15.90 +100>,<MAYBRIDGE\nmr>,<NMR_250MHZ>,
      <Start of raw data processing
       ef LB = 0.3 FT_mod = 6 PKNL = 1 SI = 32K 
       data hash MD5: 32K
       F7 75 A6 3F B3 98 61 1F 04 BD C0 64 62 3D D9 CF>)
(   3,<2007-10-03 09:45:17.53 +100>,<MAYBRIDGE\nmr>,<NMR_250MHZ>,
      <apk 
       data hash MD5: 32K
       A5 D1 2D 31 80 A8 F1 B4 9F 79 63 6C 39 F6 A2 D1>)
(   4,<2007-10-03 09:45:18.25 +100>,<MAYBRIDGE\nmr>,<NMR_250MHZ>,
      <abs ABSG = 5 
       data hash MD5: 32K
       A6 94 9E 79 61 93 4B 94 A5 81 96 38 A2 D1 3D 33>)
$$ ##END=
$$ 
$$ hash MD5
$$ F4 AC 33 7C 99 2F AC D6 19 95 D9 D3 0B 94 8C 81
##$RELAX= 
##$RELAX= 
##$RELAX= 
##$RELAX= 
##$RELAX= 
##$RELAX= 
##$RELAX= 
$$ Bruker specific parameters
$$ --------------------------
##$DU= <C:\u>
##$EXPNO= 140
##$NAME= <ADRS>
##$PROCNO= 1
##$TYPE= <nmr>
##$USER= <dgb>
##$AMP= (0..31)
100 100 100 100 100 100 100 100 100 100 100 100 100 100 100 100 100 100 
100 100 100 100 100 100 100 100 100 100 100 100 100 100 
##$AQSEQ= 0
##$AQ_mod= 3
##$AUNM= <au_zg>
##$AUTOPOS= <4 >
##$BF1= 250.13
##$BF2= 250.13
##$BF3= 250.13
##$BF4= 250.13
##$BF5= 500.13
##$BF6= 500.13
##$BF7= 500.13
##$BF8= 500.13
##$BYTORDA= 1
##$CFDGTYP= 0
##$CFRGTYP= 5
##$CHEMSTR= <none>
##$CNST= (0..31)
1 1 145 1 1 1 1 1 1 1 1 1 1 1 1 1 1 1 1 1 1 1 1 1 1 1 1 1 1 1 1 1 
##$CPDPRG= <>
##$CPDPRG1= <>
##$CPDPRG2= <>
##$CPDPRG3= <>
##$CPDPRG4= <mlev>
##$CPDPRG5= <mlev>
##$CPDPRG6= <mlev>
##$CPDPRG7= <mlev>
##$CPDPRG8= <mlev>
##$CPDPRGB= <>
##$CPDPRGT= <>
##$D= (0..31)
0 1 0 0 0 0 0 0 0 0.06 0 0 0 0 0 0 0.0002 0 0 0 0 0 0 0 0 0 0 0 0 0 0 
0 
##$DATE= 1191401099
##$DBL= (0..7)
120 120 120 120 120 120 120 120 
##$DBP= (0..7)
150 150 150 150 150 150 150 150 
##$DBP07= 0
##$DBPNAM0= <>
##$DBPNAM1= <>
##$DBPNAM2= <>
##$DBPNAM3= <>
$$ [...]
##$SUBNAM7= <"">
##$SUBNAM8= <"">
##$SUBNAM9= <"">
##$SW= 20.6930455092707
##$SWIBOX= (0..15)
0 0 3 0 0 0 0 0 0 0 0 0 0 0 0 0 
##$SW_h= 5175.983436853
##$TD= 65536
##$TD0= 1
##$TE= 296.16
##$TE2= 300
##$TE3= 300
##$TEG= 300
##$TL= (0..7)
0 120 120 120 120 120 120 120 
##$TP= (0..7)
150 150 150 150 150 150 150 150 
##$TP07= 0
##$TPNAME0= <>
##$TPNAME1= <>
##$TPNAME2= <>
##$TPNAME3= <>
##$TPNAME4= <>
##$TPNAME5= <>
##$TPNAME6= <>
##$TPNAME7= <>
##$TPOAL= (0..7)
0.5 0.5 0.5 0.5 0.5 0.5 0.5 0.5 
##$TPOFFS= (0..7)
0 0 0 0 0 0 0 0 
##$TUNHIN= 0
##$TUNHOUT= 0
##$TUNXOUT= 0
##$USERA1= <user>
##$USERA2= <user>
##$USERA3= <user>
##$USERA4= <user>
##$USERA5= <user>
##$V9= 5
##$VALIST= <valist>
##$VCLIST= <CCCCCCCCCCCCCCC>
##$VD= 0
##$VDLIST= <DDDDDDDDDDDDDDD>
##$VPLIST= <PPPPPPPPPPPPPPP>
##$VTLIST= <TTTTTTTTTTTTTTT>
##$WBST= 1024
##$WBSW= 4
##$XGAIN= (0..3)
0 0 0 0 
##$XL= 0
##$YL= 0
##$YMAX_a= 453198
##$YMIN_a= -505177
##$ZGOPTNS= <>
##$ZL1= 120
##$ZL2= 120
##$ZL3= 120
##$ZL4= 120
##$ABSF1= 16.522
##$ABSF2= -4.171173
##$ABSG= 5
##$ABSL= 3
##$ALPHA= 0
##$AQORDER= 0
##$ASSFAC= 0
##$ASSFACI= 0
##$ASSFACX= 0
##$ASSWID= 0
##$AUNMP= <proc_1d>
##$AZFE= 0.1
##$AZFW= 0.1
##$BCFW= 0
##$BC_mod= 0
##$BYTORDP= 0
##$COROFFS= 0
##$CY= 12.5
##$DATMOD= 1
##$DC= 0
##$DFILT= <>
##$DTYPP= 0
##$F1P= 14.0000005364418
##$F2P= -0.99999901652339
##$FCOR= 0.5
##$FTSIZE= 32768
##$FT_mod= 6
##$GAMMA= 0
##$GB= 0
##$INTBC= 1
##$INTSCL= 1
##$ISEN= 128
##$LB= 0.3
##$LEV0= 0
##$LPBIN= 0
##$MAXI= 10000
##$MC2= 0
##$MEAN= 0
##$ME_mod= 0
##$MI= 0
##$NCOEF= 0
##$NC_proc= -4
##$NLEV= 6
##$NOISF1= 0
##$NOISF2= 0
##$NSP= 0
##$NTH_PI= 0
##$NZP= 0
##$OFFSET= 16.522
##$PC= 1
##$PHC0= 152.8106
##$PHC1= 10.15901
##$PH_mod= 1
##$PKNL= yes
##$PPARMOD= 0
##$PSCAL= 4
##$PSIGN= 0
##$REVERSE= no
##$SF= 250.13
##$SI= 32768
##$SIGF1= 0
##$SIGF2= 0
##$SINO= 400
##$SIOLD= 32768
##$SREGLST= <1H.CDCl3>
##$SSB= 0
##$STSI= 32768
##$STSR= 0
##$SW_p= 5175.98343685301
##$SYMM= 0
##$S_DEV= 0
##$TDeff= 65536
##$TDoff= 0
##$TI= <Analysis number 999999
Compound Code 99
Book Reference 9
Project Code 9>
##$TILT= no
##$TM1= 0
##$TM2= 0
##$TOPLEV= 0
##$USERP1= <user>
##$USERP2= <user>
##$USERP3= <user>
##$USERP4= <user>
##$USERP5= <user>
##$WDW= 1
##$XDIM= 32768
##$YMAX_p= 487172233
##$YMIN_p= -160818
$$ End of Bruker specific parameters
$$ ---------------------------------
##NTUPLES= NMR SPECTRUM
##VAR_NAME=  FREQUENCY,     SPECTRUM/REAL,   SPECTRUM/IMAG
##SYMBOL=    X,             R,               I
##VAR_TYPE=  INDEPENDENT,   DEPENDENT,       DEPENDENT
##VAR_FORM=  AFFN,          ASDF,            ASDF
##VAR_DIM=   32768,         32768,           32768
##UNITS=     HZ,            ARBITRARY UNITS, ARBITRARY UNITS
##FACTOR=    0.157963299565203, 1,           1
##FIRST=     4132.6476996994, 0,             0
##LAST=      -1043.33573715361, 0,           0
##MIN=       -1043.33573715361, -160818,     0
##MAX=       4132.6476996994, 487172233,     0
$$ Real data points
##PAGE= N=1
##DATA TABLE= (X++(R..R)), XYDATA
$$ [...]
18284 303540 292145 251896 217116 196660 173805 111961 93882 102510 101871 83495 57343 81453
18272 81453 129971 157923 138588 140399 150844 176968 210376 253264 297513 346092 310454 287724
18260 287724 295737 308542 309198 300071 353890 406954 453689 476202 483250 502251 502130 533194 567239
18247 567239 565363 569695 528438 518807 504021 443308 377681 387994 417637 416004 364954 344088
18235 344088 336273 295513 261877 213383 189479 160333 157108 176857 192817 184277 156468 111787
18223 111787 146048 175651 134859 130049 89456 83838 67460 46144 51271 75098 111649 144248
18211 144248 115391 112808 86552 48604 33168 41334 17891 16858 8147 -3339 14465 4493
18199 4493 21299 32005 47890 57724 77379 56535 66356 63267 92551 83869 72914 66652 70312
18186 70312 85956 66283 53092 40385 67846 83447 78118 105347 122442 107992 84029 108624
18174 108624 99701 50289 55020 80655 100810 123575 169371 156671 141696 114978 86287 131154
18162 131154 163852 124010 67551 76765 115636 185075 244792 250222 239927 217541 227358 214205
18150 214205 147315 102501 114211 122230 168490 158368 140007 184717 223495 240110 272472 313757
18138 313757 337654 349824 390408 451347 538997 553709 535790 555540 611776 655887 718763
18127 718763 822727 943122 1098366 1295695 1504203 1719196 1995926 2339862 2837303 3522061
18117 3522061 4455031 5777716 7632867 10262551 13883104 19503363 29300731 46088572
18109 46088572 66606014 69290377 54096261 34139718 19888619 12560455 8653630
18102 8653630 6331224 4826619 3741641 2985719 2486539 2088876 1770335 1437819 1256798
18093 1256798 1169934 1071153 930960 816364 764940 712267 627645 590256 528977 419109 385823
18082 385823 360053 366637 379879 329631 300972 299080 316557 362834 366683 350013 321995 336309
18070 336309 326259 303388 294357 309376 332001 330759 347587 357877 398429 379553 359929 350311
18058 350311 333073 317211 279832 256994 235869 224651 226823 205402 176417 193818 188937 178426
18046 178426 151801 149901 192293 182691 178153 168767 164808 181917 178207 174806 175041 136260 94658
18033 94658 128446 132935 114795 145457 143277 149690 171600 155348 129376 116245 122659 114779 103794
18020 103794 111881 148833 139439 102978 121481 128043 133207 165364 182774 193254 196561 195328 197678
18007 197678 206974 201633 186869 160140 157260 178610 180513 145692 160004 166578 169828 191578 182415
17994 182415 194767 193778 222199 203965 135423 135931 151190 161312 142710 148157 193338 161006
17982 161006 126383 113606 112836 101756 83517 65125 99358 120613 109945 108426 121306 116009
17970 116009 93527 121087 160858 206922 220660 224493 216434 210118 214191 201022 182525 158292
17958 158292 156906 166376 188689 180291 164644 162035 164686 135371 124563 151236 173127 146658
17946 146658 134295 150070 159902 175385 214267 208428 177633 186150 219493 231054 232205 240509
17934 240509 242339 266750 245351 228242 213301 196421 178552 161389 154429 188835 230557 272713
17922 272713 296647 291600 265141 261625 243761 218169 211294 229615 264359 266764 278389 266585
17910 266585 221750 193727 256365 284183 312699 327882 330397 332301 290381 290739 298018 278156
17898 278156 295084 308063 323267 345029 334984 336631 349396 322743 315321 378419 435538 443686
17886 443686 468121 477096 469256 503126 547842 574366 586588 592799 598643 620527 617821 565418
17874 565418 542059 548117 606691 647437 696525 728374 751629 785170 772064 752039 799534 858284
17862 858284 886450 892624 880016 880441 922958 982485 1038487 1073791 1097531 1142243 1196852 1255298
17850 1255298 1309521 1360809 1447542 1547594 1671035 1818089 2040697 2303556 2609322 2926758
17840 2926758 3241245 3566371 3891385 4241212 4665963 5271454 6101667 7202396 8633906
17831 8633906 10227499 11658942 13041606 14491345 15367637 15270185 14825673 14374504 14023927
17822 14023927 13826482 14027702 14931140 16773669 19705490 24065721 30579269 40421072
17814 40421072 54445068 71482159 87708754 103306278 120741957 135328389 137245013
17807 137245013 129559543 119202997 108140728 93338730 77037819 63517345 54866240
17800 54866240 50089470 47941887 47226489 47753142 49473994 50437741 48093046 43326735
17792 43326735 37917285 32451687 26912346 21981621 18291995 15966980 14705106 14007125
17784 14007125 13506381 13087507 12794182 12768233 13079474 13714110 14770291 16223647 18061101
17775 18061101 20457250 23846906 28609296 34163379 39538211 44920274 50579165 54645754
17767 54645754 55201987 53948710 53109807 53699994 56238897 61544457 70183666 83511360
17759 83511360 102752003 124371457 140871347 153023564 165225779 171921708 161866658
17752 161866658 140927753 118585125 97530785 75996514 56016101 40464364 30253234
17745 30253234 23974348 20191292 18005753 17034058 16988148 17514993 18079267 18679057 19528675
17736 19528675 20048164 19121040 17182790 15065900 13024190 10869577 8824007 7185134
17728 7185134 6034447 5272186 4765117 4421933 4153151 3844536 3507714 3163980 2850914
17719 2850914 2539822 2244809 2000466 1800112 1671121 1548264 1463686 1405056 1342097 1262017
17709 1262017 1180529 1149221 1098238 1018272 939833 889081 829683 805698 820347 804437 775876
17698 775876 715242 669081 604549 568843 552065 519748 508395 486211 490114 469150 462503 458075
17686 458075 466446 452456 446349 482433 489008 466634 416384 426287 447778 465667 464420 440429
17674 440429 411894 382380 390407 345576 286296 252873 278931 279733 260799 248973 223877 235652
17662 235652 281831 284950 280358 263659 272027 261147 221256 191543 174845 190044 191634 172541
17650 172541 127162 97063 115298 143244 219931 230450 210666 231622 235244 247206 251070 233046
17638 233046 182671 137079 129685 140328 145332 133639 188648 177932 171052 184912 215974 278879
17626 278879 299048 298394 321133 351399 350450 348159 321187 313980 285106 239945 249736 263594 248043
17613 248043 232826 206426 184010 170419 156577 151109 166702 181155 192417 193780 170542 176167
17601 176167 157785 166356 171754 143615 115524 76794 79281 122447 147887 135770 149027 160220
17589 160220 157187 171988 168523 138762 150256 153731 146926 158512 156570 153106 99481 111222 129035
17576 129035 165862 167677 194833 176864 193906 233389 236916 242328 253977 266084 266103 236465 198705
17563 198705 184835 178655 150586 129767 135907 152332 154953 173869 164854 150366 99790 70865
17551 70865 73798 82343 72959 96918 82825 80184 96812 96294 114638 114457 95681 93868 103602 115042
17537 115042 125070 108888 96113 77054 80746 128158 173754 173579 134369 149455 149679 160431
17525 160431 146112 154973 133676 115197 117403 136203 168225 195944 192255 186242 224067 246362
17513 246362 187233 159179 126993 110843 118968 124469 137067 108378 116682 123014 91130 66939
17501 66939 53556 52692 90670 126136 176438 212916 216879 214337 155706 110721 126919 146227
17489 146227 141154 142044 150635 172979 163663 103457 79366 120308 155608 202175 207851 187378 147785
17476 147785 139377 119802 94359 106439 112293 101181 83891 89465 115606 137277 140849 142953
17464 142953 140716 136919 124945 84583 55847 87463 145007 151391 135812 126258 91967 70935
17452 70935 76627 74412 111980 97886 114130 172492 204135 270740 360567 515924 674561 651766
17440 651766 525408 396106 365927 377256 390181 407231 452865 446069 440344 397495 334734
17429 334734 303010 276709 297281 359487 331113 281209 247950 266179 307474 313469 327066 337194
17417 337194 317338 276950 254309 212373 219667 232471 210632 208337 224114 256484 281331 292009
17405 292009 268690 281407 305517 287184 281910 282303 310612 323860 341180 352328 390715 391782
17393 391782 420297 462418 456662 497697 508839 525380 544995 582725 612262 627321 652824 673012
17381 673012 674799 684042 695015 725752 732442 712822 685764 686735 735786 717324 725390 783662 842989
17368 842989 830235 817130 859464 939805 1012854 1085547 1152805 1220627 1255947 1285282 1306866
17357 1306866 1337250 1383230 1426233 1492626 1572265 1668431 1824638 2033614 2247509 2527161
17347 2527161 2872678 3273300 3791241 4431072 5285552 6338735 7556307 9066960 10987375
17338 10987375 13689251 17205797 21014291 23708288 23859578 21887421 18975665 16584532
17330 16584532 15369646 15282075 16217392 18178621 21296298 25753778 31852459 40233956
17322 40233956 52176767 69920150 96532523 133008425 173718938 205512256 212544447
17315 212544447 195144648 163986003 131840605 103746601 81104524 63740604 52026244
17308 52026244 45661649 43945993 46194690 51621165 58315567 62850778 61355534 53740315
17300 53740315 42903969 32562335 24830936 19874683 17028206 15504848 14516507 13575039
17292 13575039 12669766 11818939 11225800 11145513 11434393 11920268 12442906 13048759 13902846
17283 13902846 15252897 17369177 20621987 25445159 32410097 41416936 50959587 58051440
17275 58051440 59513051 55654440 49373595 44327295 42641267 45046635 51789798 62894967
17267 62894967 77832701 95695970 115899529 138690083 159497140 169097187 157778014
17260 157778014 129681389 95354711 65969177 45456753 32695024 24983704 20151020
17253 20151020 17018347 14751582 13055756 11842099 11102787 10967244 11641151 13155621
17245 13155621 15154853 16737164 16806384 15125809 12446995 9749994 7685832 6201910
17237 6201910 5052227 4192113 3519798 3005123 2600764 2327859 2117268 1970859 1829905
17228 1829905 1707018 1613247 1535821 1453990 1386444 1346436 1322236 1235642 1140331 1069866 1035110
17217 1035110 999941 932785 893711 853362 786881 731701 716132 711417 708313 673527 607635 551190
17205 551190 529630 529426 532997 499439 438227 442616 443345 438246 429352 440915 429312 383656 368214
17192 368214 346202 342473 338350 329314 312972 314237 365909 383139 395006 371028 366462 350638
17180 350638 323382 312824 298918 292035 322908 356886 365416 376012 341333 319971 289916 266802
17168 266802 228701 210540 213427 237885 266847 255038 207993 206578 187259 201614 185567 154054
17156 154054 135199 143402 129764 129210 132612 144558 172832 227217 239671 233608 220251 183325
17144 183325 156549 107779 90895 80162 88322 109074 94203 107113 133133 169436 174399 145478
17132 145478 129055 115952 116859 104956 81771 60204 35205 36226 40268 30892 33650 46047 64727
17119 64727 85481 123024 149220 122952 123901 122221 90197 87780 71466 85343 81631 61692 23835
17106 23835 17562 68420 98582 106925 95213 48597 57754 87155 69110 14410 31277 36649
17094 36649 33527 70055 92827 89541 75156 49585 34037 23054 9016 16163 46600 41776
17082 41776 35730 24166 6591 23745 66705 39402 -4038 19816 20684 -2722 -9670 26577
17070 26577 59859 45475 47966 96309 111724 109261 87152 66263 57659 34636 28522 32173 45970
17057 45970 59731 99747 95662 92277 106544 90183 88013 107540 124361 123034 112160 67477
17045 67477 40425 55804 74544 67326 55639 48910 36335 14286 44208 49711 19696 17538
17033 17538 -1228 -49489 -38341 7189 21604 10777 -566 -2981 18330 -11546 -10670 13801
17021 13801 4240 -36112 -50258 -60628 -55898 -35235 -43252 -39053 -77861 -127216 -144411 -125673
17009 -125673 -87946 -62908 -63090 -54141 -38492 -19532 -20922 5553 39900 47037 44398 42941 61308
16996 61308 75810 69519 5095 -14982 3933 5889 -14627 5857 22693 10900 -10751 -27025
16984 -27025 -28260 -38418 -23249 -5763 5048 4800 21021 16021 -19822 -32165 -24696 -32349 -28818
16971 -28818 -54381 -49961 -48608 -65843 -49260 -24682 -21137 -9688 -13970 -10069 -18832 -44146 -55465
16958 -55465 -57412 -60942 -66902 -38873 -3317 -26708 -15659 -2059 -7642 5281 32156 18114
16946 18114 29672 35291 33078 20708 33422 27023 20685 16569 -12801 -18323 7533 10557 27513
16933 27513 38475 18217 12011 38851 36004 -5607 20089 38471 14254 -34078 -37782 -31769
16921 -31769 20879 30153 26220 26589 32894 37923 26247 18543 35848 55299 26497 20743 13690
16908 13690 45683 50323 32322 -6554 14383 37591 32540 22440 39598 48053 27364 30551
16896 30551 28228 36748 21179 5649 9581 42037 49791 30942 7075 4080 849 3440 19519
16883 19519 25099 -6110 -56136 -92194 -105467 -79097 -29261 -27442 13846 -17041 -71544 -65406
16871 -65406 -52415 -16864 7059 21590 56841 58382 27932 23221 32114 58670 65659 42376
16859 42376 -1812 22393 62387 65570 29246 66171 56090 43634 42087 58660 55336 50251
16847 50251 33439 13672 11191 27525 34537 14422 18718 15004 36324 42188 55106 60027 87981
16834 87981 129882 146922 170570 169713 154943 205478 247220 281407 340889 413127 504011 552210
16822 552210 567490 542453 500750 467799 463614 437411 410101 380523 359193 331360 299176 323421
16810 323421 362583 439098 520886 562264 575947 570509 452539 353320 225315 157028 156665 159054
16798 159054 192615 154545 130936 132944 138728 144117 202068 263813 236059 193798 155590 175424
16786 175424 169677 105857 80008 96405 124823 130173 135732 134023 160396 216532 294034 392175
16774 392175 473558 496920 478736 489570 527049 565588 567929 542104 480004 392940 339473 283895
16762 283895 242336 232361 203221 204005 201281 175310 189975 229876 295225 345058 399091 424338
16750 424338 479427 476647 419920 385448 321037 233264 187085 150143 118845 58526 28289 -7553
16738 -7553 8788 59052 81887 84881 84170 73838 76037 60021 18880 -16720 -29201 -27292 -15817
16725 -15817 15498 32424 27740 56240 65620 67155 64269 38774 8053 2244 42270 26150 12982
16712 12982 21716 36638 45163 40653 30543 -14602 -41193 -6119 8414 -3470 -21672 -4860
16700 -4860 44897 61663 66814 70234 21224 -19581 -17287 14603 -3782 -32818 -52350 -55864 -73441
16687 -73441 -72611 -38686 -35052 -62348 -74177 -19895 15568 46924 25329 -21808 -19119 -18833 7708
16674 7708 11920 -20545 -45391 -74148 -80140 -69116 -43191 -35684 -4918 29212 38308 22108 4852
16661 4852 15063 3883 -5420 -56825 -52477 -29732 -47077 -50077 -27031 -7418 -22686 -60283
16649 -60283 -28717 27809 36178 25614 -7013 -52235 -59167 -56507 -84042 -104510 -62234 -49177
16637 -49177 -31421 -33203 -4864 30744 -1707 -56294 -83061 -66832 -28823 14552 -3680 -18483
16625 -18483 -21839 2827 -366 -7223 -7776 -29420 -11037 -576 -46895 -75798 -26691 -29661 -47615
16612 -47615 -26017 -10552 -16149 -5829 20114 -5967 -29299 -18586 -35638 -42541 -36151 -41555
16600 -41555 -19273 4720 -9860 -6220 -27634 -19354 -25108 -32466 -41999 -49789 -969 58567 37204
16587 37204 54457 5246 -74568 -75546 -23628 8718 12433 -25957 -29806 -19247 -6051 6521
16575 6521 -13167 -39545 -22348 -9486 -3343 -11510 3335 10777 32281 50261 59338 56623 3570
16562 3570 -34259 -54416 -53570 -37641 4202 -4111 -26944 -32970 -32556 -6398 -3625 -6041 -40543
16549 -40543 -58289 -60967 -69848 -69899 -54449 -2302 26671 21093 44104 21538 -10694 -18196 -40454
16536 -40454 3859 54794 65282 22561 7118 6404 -1364 1036 31310 60480 37048 42928 28970
16523 28970 19711 4024 -25140 -44091 -33980 8782 -24818 -19988 -21410 -61271 -67337 -55811
16511 -55811 -45931 -50347 -64836 -67367 -79296 -86530 -63997 -80532 -84440 -75808 -83355 -84634 -61690
16498 -61690 -37567 -61345 -54479 9530 42452 58417 13960 -8044 2396 27980 42146 25111
16486 25111 -19003 -33419 -56411 -44513 -9911 -3971 801 6470 3057 -3195 -8128 -5695 11527
16473 11527 22652 14055 -33881 -53351 -25055 -48704 -35094 3715 21296 18916 7657 22947
16461 22947 8723 -22133 -47417 -24260 -37692 -52339 -12524 21835 28440 -8516 -70183 -76553
16449 -76553 -77731 -40043 2786 17169 36764 -3873 -21255 3510 15182 -8095 4200 9253
16437 9253 5510 1629 -20150 -10565 13669 15190 -32043 -27541 -12989 -4831 -12609 -44597 -10669
16424 -10669 12544 22360 78061 112202 65817 48719 45445 31502 -11005 -1636 -10395 -33918
16412 -33918 -49815 -113202 -127774 -78128 -39648 -6709 1760 -26284 -44016 -5497 47934 66992
16400 66992 60372 40617 26060 29342 29774 1350 -12121 -19407 -33920 -56737 -42152 -22150 -12457
16387 -12457 -11228 -16168 1752 -18638 -9983 -3618 -1287 28821 14990 -1498 15915 -7792 5719
16374 5719 -52725 -100984 -91305 -78071 -30289 -46366 -26804 -8752 -6068 -39078 -35547 -13721
16362 -13721 -6898 16776 -2146 -39329 -52813 -48742 -35357 2650 -36126 -45542 -53426 -63498
16350 -63498 -63749 -59776 -21472 -38359 -64423 -57398 -45096 -37337 16818 13520 -26614 -54314 -41232
16337 -41232 -59862 -51488 -61510 -55520 -53773 -82178 -61645 -16369 -1425 12423 19588 1811
16325 1811 15049 35646 -5059 -18148 -53787 -72199 -63998 -47585 -50022 -45858 -17914 -38747
16313 -38747 -44612 -17943 36034 55620 53581 36219 27313 4656 39095 55635 60581 29522
16301 29522 -28450 -35578 26746 80956 28887 -4442 -37523 -544 16032 10276 2822 8063
16289 8063 -948 11281 59637 76734 23228 -4966 -26382 -10300 -2256 6215 35101 63330
16277 63330 81290 105933 93536 68412 61861 49975 57763 39913 11159 -26161 -21733 -3974
16265 -3974 -31490 -25819 -13316 -17684 -47630 -51082 -38162 -31574 -31731 -55506 -72822 -90201 -55624
16252 -55624 -40634 -35177 -27501 -12144 4642 -18794 -66239 -105198 -96771 -75970 -61057 -46242
16240 -46242 83 682 -34609 -5107 -18145 -31120 -32366 -42239 -28384 -69939 -60848 -58359 -21919
16227 -21919 -26964 -15437 -7373 -15803 -57628 -65395 -50366 -57229 -79874 -88462 -22083 12087 -17720
16214 -17720 -56083 -83396 -59947 36444 30184 -21183 -60938 -22929 -3580 -16125 1995 -15930
16202 -15930 -26792 -6439 -23235 -39839 -26057 -41802 -39785 -40864 -41013 -35651 -55120 -36026 10058
16189 10058 10593 -16263 -4315 41649 22944 -4884 11614 43689 27401 -13289 -64105 -40635
16177 -40635 20124 31936 -5715 -21503 -43472 -84948 -80023 -87038 -67648 -23370 -15188 -44085
16165 -44085 -39368 -46308 -39313 -6959 19934 -9131 -37042 -54310 -80548 -91222 -43562 -23297
16153 -23297 -8058 -8835 -37999 -44843 -42052 -48505 -31425 -13985 -16062 -46693 -71160 -60921 -70968
16140 -70968 -77588 -86536 -78057 -63373 -42309 350 4145 -17764 -33918 -16316 -37365 -52380
16128 -52380 -22131 592 2626 -7501 -12923 5606 45391 33197 13731 -13595 729 21887
16116 21887 35451 10274 -11949 -18813 -1360 -4154 385 -4034 -37435 -33268 13629 25558 21740
16103 21740 38993 26058 16767 40111 66290 23125 -14860 -12689 -20626 -55274 -22677 -4190
16091 -4190 -33342 -37116 -25934 7404 42212 53229 23560 12961 30827 41964 62547 59659
16079 59659 9188 -27347 -12553 -10168 2032 9759 17080 -7964 -20241 -30142 -57419 -66905 -47246
16066 -47246 -44938 -43664 -29651 -17077 -6391 -35074 -42900 -57447 -47164 -29886 5398 13977
16054 13977 -2160 -45670 -48281 -31166 3578 6538 -24589 736 48778 43308 35809 55701
16042 55701 51110 24476 557 -28126 -63041 -80942 -67121 -29715 40344 39933 -4846 -8441
16030 -8441 -10014 5510 -22661 -34422 -58529 -70170 -36127 36708 53081 61795 57550 49649 59444
16017 59444 47916 29090 16672 2475 -23180 -34201 -24547 10399 68562 45932 50546 78624
16005 78624 40360 -9520 -29147 3576 10624 -12880 -47576 -41530 -34691 -63055 -66328 -71150 -80821
15992 -80821 -41949 -5390 -1488 -7644 -30305 -30867 -43158 -49249 -46059 -23068 -37305 -9204 43991
15979 43991 72318 45184 69758 28102 13297 49948 36998 12333 14157 -21227 3416 16900
15967 16900 8182 46752 55998 46553 9040 -16831 -10193 -13777 -23977 1247 13448 3789 -18468
15954 -18468 -10175 23879 1289 -50797 -70105 -44501 -59462 -28883 19887 4088 22422 44701
15942 44701 29613 1671 -9580 -4611 14585 16029 8190 35604 8633 -32358 -31367 -638 9831
15929 9831 19565 -28149 -14021 18563 14933 9478 -4103 -3554 13845 760 -26165 -2211 34597
15916 34597 60749 33381 24977 33958 24670 -14275 11290 25506 -6954 -31612 -36361 -37721 -38423
15903 -38423 -3624 17801 -8246 7771 27645 36876 47937 64228 53236 13088 12776 5371
15891 5371 39991 87930 57024 21781 24911 39789 39050 14640 6903 35634 17918 -15300 -29872
15878 -29872 -18899 23954 28555 38657 50514 69100 33624 -143 -16120 -57905 -52914 -51439
15866 -51439 -51962 -24873 7335 11523 18144 8315 17944 1074 -21868 6963 42623 38352 13656
15853 13656 17510 -5132 -27312 22021 43997 45692 38083 -2630 -45561 -40955 -17712 -25428 -12160
15840 -12160 -23902 -27693 -4127 41945 59558 65154 40929 32851 25139 15048 3832 32185
15828 32185 11514 -25939 -20338 -1656 -18154 -3892 2551 10122 23465 15819 -20617 -66526
15816 -66526 -38306 11786 39553 66830 68836 72841 73889 47024 -5930 -42176 -42547 1789 2547
15803 2547 -21195 -37572 -35555 -4749 -7028 805 -3324 -674 31061 32122 46895 35647 8459
15790 8459 27428 33084 20127 14024 30687 83183 76309 41653 7626 10578 -27004 -32666 -10335
15777 -10335 3235 2961 12072 -8589 9015 40238 23053 51508 43786 -2919 -64941 -100518
15765 -100518 -91118 -19834 7588 -26500 -9035 19486 34884 40934 17626 48421 66311 67516
15753 67516 23655 -18494 -53372 -17155 -6962 3855 13606 60125 24288 7521 -5793 -25029
15741 -25029 -19654 -32982 -20078 2768 -9098 -28446 -840 38417 74380 65376 52153 61671
15729 61671 58067 46925 44916 48686 19866 30513 46213 64290 60894 49090 16340 8386 15623
15716 15623 7570 9354 -519 -21315 -9145 -9235 -380 3978 17495 22832 -12332 -18862 -196 -38024
15702 -38024 -11891 5264 14008 37579 37614 -13955 -181 11505 7920 48488 13830 11779 26295
15689 26295 -3671 -9591 16449 16764 27803 41167 52954 61929 47338 29562 43827 63788
15677 63788 32251 43535 13032 889 14868 9900 -5917 -2077 23672 43701 40266 49998
15665 49998 36168 62768 45426 552 14082 2425 -9830 22237 20690 13128 6439 -27111
15653 -27111 -23552 -20273 -4236 6234 34010 18278 -21819 -13825 -4146 -9001 13046 30502 21082
15640 21082 14019 26899 10053 8102 -1050 5873 -22292 -20200 -12586 -22317 -44978 -37131 -40125
15627 -40125 -34444 -17587 -931 17504 21667 24208 53080 70171 84804 76872 15373 -11961
15615 -11961 -2811 -8904 11443 45946 76560 40131 5736 25055 24201 12048 38774 50730
15603 50730 41580 69552 61464 26591 -21213 -12825 7723 20788 28988 50050 55290 56057 29363
15590 29363 3928 -15010 5027 57612 58746 30959 31861 40587 36491 60722 84007 79003 107438
15577 107438 92959 74041 94362 68105 18455 -17830 -39071 -12235 18158 67393 89639
15566 89639 81159 31330 12598 19019 25418 41392 53100 46032 29951 -2812 10312 16540 25358
15553 25358 4690 -22690 8934 -1839 17221 49172 46964 10032 -8289 -12931 -4320 -6958
15541 -6958 9558 38682 21954 -2410 17045 69232 76352 106999 155750 161047 138744 112180
15529 112180 72843 69624 102241 127182 117933 105180 103729 79040 25855 61258 73834 42393
15517 42393 37405 30583 41811 67403 90723 102954 126265 126504 91596 81713 121945 104614 92288
15504 92288 78606 98863 116521 126522 123774 124757 110932 97272 76349 102879 113067 73037
15492 73037 48309 70607 58413 55545 90596 88462 100877 83959 65749 41116 48922 48052 52316
15479 52316 53924 75343 87048 92271 86620 84666 91140 109477 133894 129505 117980 87697 83707
15466 83707 91508 52321 69557 70292 70633 92474 105038 134164 143572 102778 125454 137115 97439
15453 97439 61141 65830 72886 93108 76969 55232 74072 111285 136870 106944 107747 140775
15441 140775 121284 89959 90865 83689 54866 53822 69100 62588 65123 84774 79749 86230 80045
15428 80045 83840 91520 93235 61587 34287 55298 97875 117461 124052 118917 127466 150688 114274
15415 114274 85366 90433 83435 75470 76218 121986 134370 156904 132596 122524 159941 145577
15403 145577 144546 143600 153572 153984 142273 143392 116180 116793 120315 115519 107710 92059 86398 87892
15389 87892 83593 100312 148974 157395 151815 157311 122072 104952 85216 96252 113571 121562 139297
15376 139297 153587 174013 177987 166630 142532 140551 123490 101298 119489 179772 197382 187105
15364 187105 232517 198370 160040 129668 118717 118018 124834 117838 142033 189195 213782 185846
15352 185846 130428 60701 76384 121941 131600 145165 130972 110130 127513 145113 123677 127783
15340 127783 116213 106289 113067 131166 132071 138406 151194 162664 166409 155056 157146 154259 170880
15327 170880 175251 184760 177556 197382 222738 224044 249899 257173 238079 220360 246487 283100
15315 283100 282961 266550 236054 240974 231015 220469 197264 189183 210436 225718 220771 217209 210702
15302 210702 202671 205955 240051 235327 253796 219488 198494 241627 280165 298904 299941 278654
15290 278654 247390 243617 235657 265819 278216 304730 327206 310348 334051 372733 352090 303485
15278 303485 265538 269489 299830 307144 322695 343631 341860 318466 347232 357762 358155 329130
15266 329130 295040 280929 312284 346509 374859 366819 338691 319340 350752 354187 334154 338130
15254 338130 364981 405999 429692 422200 409737 405132 414197 415846 376460 368593 370402 394840 443577
15241 443577 421156 380784 398826 415370 411817 382239 368501 364341 389968 433659 409420 451242
15229 451242 478279 464028 489695 477743 467705 497603 519000 525078 500355 488394 466217 438683
15217 438683 449117 464311 479428 487791 483517 498963 515553 512256 525843 527135 542543 581042
15205 581042 581831 612987 637464 627098 668369 687009 649276 625119 610014 644521 698369 718331
15193 718331 671341 612499 634331 694184 694538 668169 668478 731516 773066 796500 811198 819220
15181 819220 836699 861256 877741 859036 841741 862300 867032 870013 867418 878361 880619 918052
15169 918052 980654 974292 954202 953856 956485 954766 1012469 1058130 1108133 1141802 1154658 1155849 1155617
15156 1155617 1155330 1174364 1205013 1255291 1264776 1301110 1341742 1351676 1338398 1330108 1364668 1392165
15144 1392165 1441949 1485233 1485140 1519289 1565855 1584957 1615881 1661638 1692772 1730263 1767240 1782831
15132 1782831 1774781 1811900 1869193 1927752 1987280 2045391 2118020 2179132 2184229 2200689 2230163 2283907
15120 2283907 2350844 2403185 2477325 2539844 2603545 2651771 2756091 2839024 2886916 2961388 3038883
15109 3038883 3101985 3175284 3254334 3345998 3472611 3586893 3659976 3761235 3863054 3975944
15099 3975944 4120372 4247830 4381541 4514874 4648646 4793136 4955398 5129796 5319000
15090 5319000 5515671 5722850 5907481 6090097 6314171 6552480 6777550 7024211 7268372
15081 7268372 7551550 7842296 8151987 8443175 8755523 9114232 9516124 9929685 10358101
15072 10358101 10843439 11330827 11831310 12332248 12899030 13500688 14140975 14795342 15487697
15063 15487697 16201810 17004026 17840832 18746316 19668512 20634147 21632632 22635112 23710169
15054 23710169 24800853 25921777 27115091 28295112 29476320 30668735 31806245 32891275
15046 32891275 34004490 35039601 35965504 36779451 37498258 38090189 38516581 38781438 38887058
15037 38887058 38818258 38598306 38235570 37691415 37028354 36226709 35303248 34328621 33269250
15028 33269250 32173569 31027243 29869532 28705773 27549769 26371121 25229624 24141287
15020 24141287 23062728 22027842 21036979 20126815 19230086 18327416 17482179 16698716 15955884
15011 15955884 15255394 14605263 13958955 13299303 12721165 12196051 11662399 11216263 10781024
15002 10781024 10325096 9897899 9542448 9221777 8857423 8494850 8152878 7818034 7549029
14993 7549029 7306216 7078974 6874672 6634744 6403105 6210210 6029826 5790141 5578376
14984 5578376 5404724 5226370 5059533 4933445 4806876 4649955 4509718 4396969 4295231
14975 4295231 4177967 4027170 3919915 3849257 3775543 3669455 3574880 3454542 3335727 3247261
14965 3247261 3175768 3094531 3003728 2920817 2860169 2809638 2743216 2652737 2538997 2477869 2480906
14954 2480906 2437882 2378474 2321857 2261066 2212325 2173816 2157524 2119241 2050223 1952257 1910476
14943 1910476 1913717 1865125 1822661 1826392 1811688 1791765 1739137 1723310 1717692 1726830 1677217 1592471
14931 1592471 1528603 1512824 1505442 1464696 1430778 1421947 1416443 1416772 1406559 1351703 1324987 1299387
14919 1299387 1289507 1286180 1250613 1252629 1214894 1161745 1143197 1114511 1136180 1126517 1096406 1093393
14907 1093393 1103218 1057234 1021347 1037137 1029862 988589 961270 957395 931824 904184 889219 874273
14895 874273 874294 889243 879719 870906 824101 819705 806580 794735 775178 790004 806354 797089 775376
14882 775376 783226 737714 693604 676715 681242 680790 695346 715660 725384 711749 676164 653505
14870 653505 633111 622363 609846 593241 583738 604723 608592 606453 581628 572732 571265 551135
14858 551135 554577 538869 532742 511910 528526 528573 504322 494183 489507 497855 530380 543277 520594
14845 520594 497835 467513 467392 472853 453939 428099 407227 446878 476180 454796 453340 473931
14833 473931 478202 498564 482788 476202 441610 368174 349614 349474 368889 375734 394932 423311
14821 423311 461585 423221 403099 415282 419845 401967 366417 385516 383096 401771 389334 344144
14809 344144 321426 353950 373730 388847 413122 426631 439676 403065 350360 321584 305413
14798 305413 311924 305440 294207 285209 308689 318921 323249 322461 296455 319105 346625 361150 334130
14785 334130 323581 291552 302573 322877 292927 283058 271367 276653 274651 247105 283721 282962
14773 282962 254120 218751 174798 167976 187565 185395 211129 211705 226562 254193 265540 258843
14761 258843 254123 231322 213801 197749 215163 218013 227083 246946 244216 215591 232510 243709
14749 243709 226463 202443 174384 185372 177332 150380 129069 132087 173083 179058 145038 132590
14737 132590 158914 179389 216088 204015 175927 178116 151337 148241 164991 170495 148342 135995
14725 135995 123499 118256 112773 113746 117532 135088 161149 164495 184250 221292 212931 174448 162577
14712 162577 175183 175871 214711 234324 194496 202508 213712 176133 165043 176446 175712 183942 137224
14699 137224 107028 123672 132342 113168 114094 158000 156326 178746 190811 195559 176979 159413
14687 159413 128863 97536 81262 54188 83386 96742 133503 123328 115361 154520 173278 166546
14675 166546 164015 178868 176526 175899 152039 123854 130749 144801 171564 167947 136410 124322 134798
14662 134798 138438 104189 90400 131738 170156 161412 128209 99224 78517 77327 54069 86831
14650 86831 91210 94893 68870 74237 114675 140462 138335 140185 158993 98642 96761 119259 115278
14637 115278 117252 93075 115711 143812 139580 133712 100678 60128 72533 45913 56654 75453
14625 75453 60241 75661 86273 134888 152140 118728 110296 120381 106885 118083 104843 86379
14613 86379 107573 107434 74141 75249 72782 78937 86937 94826 68141 85063 50334 58507 85909
14600 85909 81723 81619 94772 127994 135320 119453 130629 107272 105425 99218 110544 78681 28094
14587 28094 -23908 -2351 40484 65856 66780 50145 58268 47335 70360 95861 67854 87398
14575 87398 92450 52287 50976 85828 86316 89185 73455 31629 45309 25454 41981 58596 65342
14562 65342 93012 104501 98757 89431 83486 48855 38542 52791 49389 49131 81928 31708 41682
14549 41682 36270 60158 39507 40777 33494 15116 33341 45000 69489 71043 42031 58509
14537 58509 52003 14252 -18587 -44633 -38899 1736 2475 -32239 -29305 12195 49079 60069 66015
14524 66015 87728 100317 86972 64282 80468 94834 97769 91362 69282 71097 57184 62443
14512 62443 88301 105288 82928 86857 60339 57902 54148 56229 72268 62581 33336 19233 -1526
14499 -1526 -4823 14656 51319 39816 -7461 -26131 -11004 38066 45692 44077 49041 12247 43332
14486 43332 90995 99137 88996 64578 38152 25494 1014 -13785 2850 53447 43745 35670
14474 35670 58657 50564 9624 -15427 26555 32880 69213 63787 43112 63901 70198 60980 95997
14461 95997 116909 113896 49969 20072 3954 6263 36570 31745 41280 35067 14558 -5406 -1127
14448 -1127 17553 46274 65378 39772 24063 -20821 -13744 8400 35643 92952 116577 110667
14436 110667 79939 48989 23498 25351 13533 27788 15787 24077 41858 62712 82326 66599
14424 66599 81778 73065 53807 65709 63506 66881 73590 47826 30712 43112 52607 80322 98348
14411 98348 109424 99992 50844 64722 69910 55218 73008 71567 92560 95118 93551 80281 104278
14398 104278 105387 75059 69759 46418 23278 28075 25754 -15764 -37489 -44263 -26656 -28960 -15539
14385 -15539 -33480 -53910 -11554 16459 10787 -15128 23379 32491 -4286 -16080 -3041 -26702
14373 -26702 -52446 -72887 -42906 -9234 25716 41982 57928 25485 25623 25658 53657 77378 58845
14360 58845 -4807 -5198 9090 32223 60367 52940 42727 58550 83826 81740 80711 48424 28322
14347 28322 63859 65560 51147 5832 29121 42628 16645 2100 -7141 22762 29433 9250
14335 9250 -19147 -8335 2586 24797 11294 -17548 9270 32342 18964 -5216 17745 10891
14323 10891 17626 10949 -8685 -28474 -20549 9095 37814 44666 51404 32445 -5299 -21871 -29599
14310 -29599 -24184 -48160 -19204 26128 51350 49847 49413 20691 -2571 12294 11349 -1780 -8316
14297 -8316 5369 23889 49927 37173 16969 5641 19812 9619 -16015 -22522 16605 -7199
14285 -7199 -11676 22261 64488 67269 31727 18796 42373 41784 31545 24722 4767 9825 13664
14272 13664 21800 16514 -9075 13050 45729 58565 68723 70280 71637 35667 39722 59323 65951
14259 65951 75963 59268 45027 32507 8179 -21819 -24793 -9844 8085 15679 9342 21908
14247 21908 28053 -24763 -31307 -41600 -7987 -9791 4382 709 -1084 4138 -28611 -26117 -24133
14234 -24133 -30982 -33181 -48529 -41961 12521 65614 33210 13725 35624 21848 -19067 -24324
14222 -24324 -14196 -5939 9269 20367 19584 -3503 -16476 17789 18673 14509 32643 44470 37311
14209 37311 39189 1473 8016 32279 25222 10787 -15486 -16054 5847 34185 69310 83586 75485
14196 75485 -8437 -39944 -26704 7612 15303 39871 57641 27552 28313 15168 4689 809
14184 809 -16317 -30246 -48247 -18950 1073 -15367 -17678 -21191 6679 61761 66308 29536 -188
14171 -188 -15072 -6035 2966 -12662 -27678 -57418 -93448 -100873 -34197 -10822 -24856 -17732 8183
14158 8183 51318 47820 50258 48475 51720 51028 31661 8480 -26598 -20072 -10923 -15240 17530 19522
14144 19522 -12753 -49538 -43427 -30614 -43049 -54482 -40908 -46665 -48924 -3473 50975 35853
14132 35853 -2378 -23474 30270 61846 30174 -7167 24416 42174 57800 56448 -2948 -7143
14120 -7143 16438 -358 28764 37627 19380 22809 2552 -10444 -47676 -71174 -60836 -30681
14108 -30681 -45685 -34376 -18027 -390 -2947 -12946 -764 -20681 14708 35487 53927 85715
14096 85715 76942 39703 -22812 -25665 -31145 -51113 -41398 -46398 -68140 -30032 13254 -17465 -59767
14083 -59767 -80883 -39595 -19537 -13967 21625 21063 -11757 -14633 -9690 12418 12237 10092 -7788
14070 -7788 -3058 -4675 -2439 -1279 -25548 -64551 -99186 -87597 -87356 -63854 3988 65115 48483
14057 48483 21694 4991 16805 27641 16957 5233 7238 27855 39467 33479 39321 32505
14045 32505 11073 -20677 -7988 18826 34255 31768 25183 41683 16671 -6851 13565 19563
14033 19563 22770 30619 22948 -2763 -28656 -28555 -7398 27844 52782 30702 299 -18058 -13800
14020 -13800 -29490 -60852 -55100 -27828 8637 3354 11137 26896 12199 -14844 -50040 -35840
14008 -35840 -46407 -57093 -54660 -41591 -37377 -29231 4014 11513 -10708 -9136 -18914 -27835 -27103
13995 -27103 -46089 -60268 -20090 6262 2497 -3600 7479 6233 -16902 -32843 -58218 -57233 -44996
13982 -44996 -20053 -19813 8596 26414 46568 49311 19287 506 34115 35213 35707 16342 -36649
13969 -36649 -50322 -22447 -16926 31943 10983 -16300 -10735 24437 34774 31909 -13055 -25090
13957 -25090 -20396 -33390 7638 30175 20485 3538 30697 -14389 -45643 -12617 -1435 22054
13945 22054 -16312 -27763 5081 47797 38747 36488 19057 -5924 8037 18454 4314 14136
13933 14136 7273 16085 17521 -29427 -39415 -13949 -10713 -7164 -17595 -20888 -39541 -5545 34039
13920 34039 42516 23413 34753 36099 25916 -6471 -26258 -17617 -21427 15750 4426 -14480
13908 -14480 -16154 -5516 22912 8227 -37652 -52536 -56428 -54564 -47688 -18247 -25020 18143 55143
13895 55143 13295 -41390 -61115 -37210 11504 19876 15981 18713 -12928 -36660 -57212 -69367
13883 -69367 -31271 -2421 -21854 -40912 -15502 556 27698 18159 -9439 -41779 -30993 -10538
13871 -10538 23386 20639 21722 51164 47037 42296 9988 -8728 13116 3264 -75520 -98952 -84053
13858 -84053 -27149 -14873 -30252 -27101 1456 5322 7891 15329 -1814 -17836 27533 48481
13846 48481 20859 -11041 -31305 -4584 -12473 3402 -14617 -25644 1378 -14438 -20856 -69922
13834 -69922 -99136 -73704 -61610 -49663 -24136 10934 15835 -9760 -23051 -27059 -7335 5524
13822 5524 2273 11348 20051 17492 -25808 -24445 -16417 5555 41358 53758 47873 17061 6207
13809 6207 6350 -10543 33394 53061 66069 44822 9949 -2626 -30016 -54307 -78579 -52134
13797 -52134 -12975 -5221 -38520 -23349 -6208 7961 15 10321 -24349 -406 -23819 -56252
13785 -56252 -50579 -33145 -15538 -7274 21986 28228 -2161 -14874 -31124 -17613 -19219 -32622
13773 -32622 -16637 11938 -31833 -56137 -62508 -45294 -9056 -364 -20500 -15888 -12536 -65402
13761 -65402 -101241 -29814 5680 14093 21914 6119 -36625 -41871 -28787 -21850 -25794 -36073 -18719
13748 -18719 -45146 -57773 -19101 -9107 -11812 -47225 -64124 -5173 50101 38920 -15883 -44567
13736 -44567 -53257 -19802 -41134 -31078 38547 29834 -4610 16108 17045 -16303 12237 31899
13724 31899 21383 -15399 -10049 -2791 -6608 -33700 -54500 -66531 -38816 -35407 -25319 14120
13712 14120 -3490 -28041 -28773 -1576 -17288 -51378 -24351 4229 31097 44101 13763 25657
13700 25657 46880 35776 27209 11916 11019 11702 968 -2994 -6057 -43550 -48204 35325 85351
13687 85351 45275 38736 9684 -8441 16113 27695 88100 190445 247241 310137 319457 298895
13675 298895 255353 184493 108010 71922 64769 57355 25931 24685 11559 -3592 -17796 -44248
13663 -44248 -11372 24008 28575 17122 1459 25932 -1909 -20381 -39537 -16885 17261 32270
13651 32270 9720 -23208 -10637 4444 34397 8095 868 41090 72024 99449 133682 130425
13639 130425 180604 258747 364119 441845 576389 747416 927873 1052756 1088028 928423
13629 928423 675784 480309 324900 222716 156741 124779 142305 108884 72341 50283 33418
13618 33418 9686 -4569 9598 45334 39149 29667 38875 41184 55239 37859 12194 20962 731
13605 731 -48897 -40872 3349 13834 24944 38998 33615 49641 65459 60181 86835 122198 157459
13592 157459 211069 287191 465863 688041 895528 1068635 1053089 881979 659022 460755
13582 460755 310789 227420 206231 153864 90481 71348 80630 58861 49093 36000 18313 32436
13570 32436 42185 30431 41523 20157 25209 57003 54233 55103 44526 -17124 -24652 -39233 -64723
13557 -64723 -51763 -28404 -27072 22641 37285 39399 38599 21806 -346 35703 89919 122809
13545 122809 167162 232431 293887 370626 367839 278890 187237 137576 84193 60836 58075 32610
13533 32610 -6679 -20461 -2152 -8432 -22565 -20507 -10357 46697 66208 76586 56164 45323
13521 45323 88249 103966 99866 74839 44836 51113 28119 -9496 -11774 -4824 -22703 -21324 -21207
13508 -21207 -45944 -71426 -47190 -34937 -3427 25330 -31886 -68683 -53830 -64747 -35168 -65488
13496 -65488 -130944 -106999 -74394 -82246 -79341 -40504 -24532 1749 4677 -15683 1168 16141
13484 16141 43938 81919 93010 79420 63965 96673 68560 76447 119986 127765 87633 61694
13472 61694 44218 23553 46964 54831 52351 38047 42881 5260 -33034 -17029 -15162 -23169 -8717
13459 -8717 19675 16704 -12903 -27755 -46897 -14941 -13233 2249 3035 18750 6398 -2044 -11506
13446 -11506 -47793 -72468 -37969 26656 -12681 -48678 -72198 -49028 -39406 -23130 6845 19939
13434 19939 36158 69252 99351 112035 170782 222727 181523 100266 122460 166362 136803 95196
13422 95196 63249 62691 42425 31338 52673 54955 44605 49801 43365 15407 -18316 -22869 -21948
13409 -21948 -49380 -62082 -62643 -58744 -68855 -12043 -19076 -44436 -40424 -24955 -2360 -12951 -43051
13396 -43051 -43561 -52951 -61163 -85994 -77689 -6467 28104 73887 40506 17475 35363 54082 113853
13383 113853 131932 128399 152198 183804 186215 158941 134889 131231 112661 65734 29692 -2517
13371 -2517 8109 55461 49847 39845 31941 22169 -17700 -24474 -5708 11066 23493 30396 44325
13358 44325 86836 106023 48278 41308 34540 46115 58895 44104 9066 5768 -3448 -35268
13346 -35268 -36754 -28361 2987 -8518 -1213 28008 61717 43601 30549 28422 62765 79484
13334 79484 71062 63019 71697 61794 22598 35813 68683 32552 60954 65665 53638 44681 61894
13321 61894 79743 29285 10010 6430 26096 51259 84178 84077 74894 55218 54771 44808 23456
13308 23456 42849 53710 87002 116665 60757 28281 12052 25763 44890 78259 100601 67836
13296 67836 35208 75591 108648 138592 143949 151453 140789 163278 171276 173658 206147 211520 163059
13283 163059 157700 126980 107639 131421 129274 122500 134496 163975 185213 196728 190859 163803
13271 163803 160673 182894 164468 147226 150242 131492 134406 160852 165256 179217 231976 244429
13259 244429 231260 234995 210392 181948 195364 229510 232174 301537 359525 424536 464126 519913
13247 519913 578882 584565 611893 660387 678348 742189 842702 908682 976226 1015028 1069059
13236 1069059 1164393 1296481 1414385 1583759 1805799 2049005 2366394 2721908 3154032 3756646
13226 3756646 4528513 5532023 6817943 8447529 10588880 13509843 17650639 23743562
13218 23743562 32827297 45138931 58248492 66403173 64572166 54000395 40323492
13211 40323492 28504621 20220705 14940175 11632880 9479352 8020007 6936577 6022652
13203 6022652 5289189 4723394 4306508 4034997 3890975 3789051 3744889 3751333 3771153 3799919
13193 3799919 3819270 3910999 4041517 4251367 4599840 5042697 5600658 6279813 7090214 8099245
13183 8099245 9349413 10959800 13123296 16008740 19709932 24421138 30509013 38710060
13175 38710060 50340249 67311139 92727508 128860487 171470760 204384779 207204256
13168 207204256 177822127 133136166 92220900 63318361 45207143 34103694 27042742
13161 27042742 22282454 18878221 16190437 13876858 11905931 10310935 9147164 8314563
13153 8314563 7739771 7311861 6962398 6690642 6472917 6271781 6131808 6074931 6121668 6294998
13143 6294998 6601651 7046169 7669171 8477199 9483853 10684007 12188082 14185122 16933538
13134 16933538 20536473 25046919 30893641 38764420 49719092 65607035 89284824 123483223
13126 123483223 166153259 203520175 214047641 189846238 145540843 101529494 69159812
13119 69159812 48663526 36154647 28208835 22941497 19239299 16341512 13817727 11663852
13111 11663852 9901798 8581672 7589176 6859571 6279136 5819063 5432952 5113721 4818865
13102 4818865 4535715 4299137 4114519 3975843 3925567 4004440 4148051 4351993 4615461 4997894
13092 4997894 5486966 6153846 7041259 8148382 9577259 11488503 14012296 17464495 22447203
13083 22447203 29797895 40448613 54016528 66591001 71562323 65578879 52097103
13076 52097103 37524351 26091207 18492252 13671334 10635478 8614321 7175354 6108626
13068 6108626 5206871 4368724 3718242 3194774 2772781 2487173 2272865 2107275 1962044
13059 1962044 1826539 1678186 1508823 1367813 1261683 1184742 1101305 1044839 1026295 1001828
13049 1001828 963654 926429 905527 892174 865041 824180 810868 799810 791910 804700 794352
13038 794352 737680 664974 652421 629795 618464 571979 586470 567861 574882 572828 536504 520021
13026 520021 530482 505357 482524 469454 449517 418670 385371 364100 355904 381073 381000 355675
13014 355675 330972 346033 354829 328149 305452 334206 340044 336149 316317 323839 321435 302368
13002 302368 254516 260093 282017 341051 404933 383577 346413 309248 332154 313503 280918 287264
12990 287264 281410 285984 306624 328412 324431 308519 369395 387359 398940 438602 490725 457546
12978 457546 366800 300097 297133 284582 295396 294620 272027 256845 238448 220901 214337 201022
12966 201022 217753 215428 213753 183832 160675 120365 93836 138710 131307 134688 142548 135148 152417
12953 152417 158980 202615 206763 175345 164039 199134 220366 161138 142433 162990 177358 141666
12941 141666 147306 184293 237184 275443 320691 352587 344997 322832 284290 221989 185555 160175
12929 160175 163601 185860 202784 183939 169461 160135 155392 160352 171457 120262 117638 139527
12917 139527 118846 109180 179658 167322 129467 91302 89435 100497 117399 108783 120154 120251 106454
12904 106454 55983 40521 96259 128028 115002 88147 77705 79112 96039 121377 146750 130082
12892 130082 106473 107021 102888 92836 81352 62026 60137 68172 80185 92470 92421 117189 130417
12879 130417 120237 109372 76750 46587 22199 43361 53290 35115 48943 30967 76008 70031
12867 70031 8175 -26552 -54053 -32230 -2316 -14775 14094 54966 101738 95921 112530 137967
12855 137967 118446 91710 73356 66812 96163 99360 52214 10929 -4397 7869 41031 69133
12843 69133 44050 44426 59011 39894 41088 48226 63411 31428 20723 -6352 -3060 5153 16585
12830 16585 40757 56586 42718 46405 33851 1052 -10979 -63131 -71173 -64439 -55899 -105868
12818 -105868 -119387 -84346 -29578 5888 25320 36408 6536 -13380 12084 23690 35707
12807 35707 36851 30285 43710 23599 36102 37426 13787 26029 4115 -21273 -27861 -32087 -30366
12794 -30366 -28470 -8667 62847 55470 15050 -2709 20744 57070 38621 38952 105726 112464 98719
12781 98719 78717 50146 8935 -13953 -32826 -42319 -54467 -52929 -30604 -22643 13995 31589
12769 31589 6330 20980 49332 67347 55857 38985 51079 57685 41763 54864 77680 107073
12757 107073 112904 122327 134659 163947 150033 124115 141907 132785 142970 184619 232882 305351
12745 305351 361282 385211 364567 334849 266670 199464 165327 104590 66890 81251 105613
12734 105613 111064 82153 44241 25854 17047 29621 33225 77319 112712 121042 72988 47720
12722 47720 28461 25515 26391 47394 57045 82539 91403 92839 115455 142600 171991 187945 123767
12709 123767 129837 170082 220355 268671 309005 336585 424101 569740 758905 963386 1149118
12698 1149118 1133281 962726 739043 514265 343153 252101 219687 188847 152445 113272
12688 113272 63281 29114 -5235 53226 78493 52841 42007 31775 14641 8441 29832 60563
12676 60563 86555 62929 70177 82383 62515 61788 84787 87053 123141 146208 140358 122603 130536
12663 130536 150444 194374 228786 257823 319790 410385 547219 712905 889607 1072415 1117996
12652 1117996 1005202 766306 536537 341377 216569 145528 98453 83912 56547 63908
12642 63908 89441 79504 72523 74967 50067 26481 25290 56220 78890 76914 44829 -1704 -10406
12629 -10406 -7227 39120 33426 42751 35468 72771 85194 94613 124679 112265 118235 138051 144671
12616 144671 151429 169958 177902 194773 242454 318181 352766 379872 369586 318336 268118 202514
12604 202514 166911 170211 100869 85141 91549 57044 9318 -26049 -22116 -16322 -25511 -46904
12592 -46904 -45937 -46326 -10578 9910 4029 -18660 -39791 4498 23277 11549 1447 11043 52694
12579 52694 75023 152880 209270 270188 286723 208830 132708 71883 58393 41705 46664 15252
12567 15252 4798 16233 44709 14214 5669 62329 76254 51973 56037 47315 60681 76806
12555 76806 31120 -18797 -40778 -1036 21208 -5919 -13439 3340 26620 -10443 -36374 -31250
12543 -31250 -19667 -623 37929 40943 28297 793 12520 34337 81115 117703 148197 216358
12531 216358 244948 206719 135090 70722 43778 16853 3234 4743 7440 431 40772 49403
12519 49403 25499 12542 -23667 -3789 -11940 -16604 1904 12468 10075 -37105 -94535 -69186
12507 -69186 -52487 -27490 5320 27202 14590 -536 -3428 -2328 -16936 -24359 -17380 2686
12495 2686 24597 54706 14381 -22702 -6720 22542 51380 72946 65217 77733 56087 27630
12483 27630 37920 64786 82028 82997 50421 34639 11547 20743 14072 -7565 -12978 -20022 -53819
12470 -53819 -49298 -33933 -14608 21194 73829 78270 23457 4800 17501 13611 32530 60528
12458 60528 41119 30597 1901 -2710 18411 20280 -3724 26260 41545 46644 33719 28458
12446 28458 3442 7468 2780 -6272 -19561 -4911 9158 17725 14598 -1766 -9789 9284 17379
12433 17379 23477 32281 45018 59459 23415 27780 97446 160172 153133 121547 105866 78215
12421 78215 47323 64205 57420 57094 40320 24476 14082 880 38317 4140 -61790 -49428
12409 -49428 -78502 -54476 -33595 -60122 -72979 -57479 -41448 -5442 -35810 -18103 -8406 6074
12397 6074 28459 18707 -25434 -21209 1654 -15813 -135 10197 -1741 -13634 -982 -13610
12385 -13610 -33984 -20237 -31486 -25773 -41186 -89798 -60376 -21114 -2417 30754 16698 -39288
12373 -39288 -64347 -55557 -60540 -68209 -38423 -20029 -40376 -61618 -74376 -60515 -72005 -57733
12361 -57733 -58663 -28831 -6140 -11488 -19701 -38250 -44190 -29916 -22637 -14489 -2101 -54596 -51521
12348 -51521 -49173 -69281 -109859 -86157 -53231 -22359 -13703 -5458 -16650 -7257 4354 -17909
12336 -17909 -63751 -45391 -18913 -14779 -41478 -55304 -53316 -46724 -41428 -28486 -19473 -10415 -9317
12323 -9317 -54226 -74932 -75188 -70436 -53617 -41414 -25803 5686 20752 51347 39964 9947
12311 9947 1707 -22499 -42020 -67846 -30049 27287 37350 38410 62308 38236 22676 21990 4090
12298 4090 -11923 -18374 195 -36581 -66827 -34479 -26738 -19300 -5302 -2400 1969 15142 -6594
12285 -6594 -37212 -53123 -63614 -55901 -36479 -24953 -28489 -18004 6219 5345 7265 -28795 -8376
12272 -8376 6032 -3709 -38386 -89488 -83417 -68956 -39306 -41445 -42159 -29604 -27390 -48978 -57755
12259 -57755 -47117 -47034 -75003 -112155 -105830 -62651 -20711 8546 -11101 -10348 -15726 -20435 -9947
12246 -9947 11978 -21889 -72124 -77574 -67511 -57445 -44535 -69385 -68154 -49659 -72192 -72647 -60911
12233 -60911 -52200 -63687 -90563 -75764 -61032 -53643 -49203 -35092 -18143 3176 -197 3439 10054
12220 10054 -5339 -14140 15346 17612 30884 19753 45941 59556 31244 9520 -13131 -31496
12208 -31496 -4911 -1229 22256 -199 -48778 -59575 -61362 -68277 -41660 -22426 -4543 -16402
12196 -16402 -65395 -66675 -44095 -26135 -7497 -16181 -38207 -59503 -50703 -9267 -32788 -8117
12184 -8117 2951 -14650 -10751 1895 29611 18293 -4517 8956 63780 76298 53778 34137
12172 34137 48241 45480 1247 -46330 -67282 -55530 -20252 2244 -5172 -15767 -27313 -11410
12160 -11410 5921 8173 -6725 -12376 11927 16220 11578 4016 37921 55275 42834 23574 7477
12147 7477 -10739 -20166 7039 27651 3996 -47789 -46936 -35755 -49853 -70952 -68277 -34034 -18737
12134 -18737 -30292 -37898 -37680 -25097 7655 14089 7347 5361 -12508 -13194 25426 -2939 -31367
12121 -31367 -53684 -51344 -49548 -43996 6152 23317 -18823 -37986 -59440 -67091 -39048 -49667
12109 -49667 -72494 -73691 -79746 -59936 -12738 622 -38123 -13717 -2449 -29568 -5635 12539
12097 12539 1968 -34892 -55625 -47449 -53048 -11161 1948 -21382 -25745 -38341 9357 23477
12085 23477 -12099 -41249 -52485 -37889 -19776 -12333 -40108 -31867 -29888 -2150 -13403 -65776
12073 -65776 -75548 -55282 -50512 -71886 -84793 -77363 -52306 -67922 -71774 -35371 7926 16580 13919
12060 13919 62027 50071 55328 10751 4468 -24343 -62756 -83178 -69326 -37879 -15367 1938
12048 1938 -13182 -22404 -60179 -58044 -29971 -45600 -34744 -11178 -41804 -67932 -82687 -45175
12036 -45175 -12311 -20176 -20440 13408 14167 -40809 -64369 -110500 -94998 -17334 10540 -16922 -22152
12023 -22152 -22797 -46504 -77867 -85836 -68811 -37470 -8124 5920 -7727 7072 24971 6498
12011 6498 18275 8642 11294 3423 12146 -5868 -52413 -74349 -71862 -61953 -86243 -103278 -99807
11998 -99807 -67145 -93248 -93878 -107874 -84133 -73778 -73440 -48371 -47162 -52597 -39693 -23147 -49869
11985 -49869 -46173 -62706 -45766 -33041 -29036 1519 15648 34317 10117 -33441 -34380 -26295 -26647
11972 -26647 -28482 -38677 -61830 -67970 -54221 -51051 -28565 8055 7687 -31233 -55820 -60420 -86588
11959 -86588 -87368 -85522 -67553 -27041 -25881 -35538 -32076 -26759 -34654 -31049 -49691 -69471 -55188
11946 -55188 -48244 -24172 24686 50691 35997 -7090 -17489 -44328 -67544 -45064 -35924 783
11934 783 -4220 -10315 8699 9501 10072 18059 16078 16288 27909 48117 63496 38103 56127 51456
11920 51456 45586 11230 788 -11624 -34030 -28484 -1800 15743 13481 -25665 -50304 -71307
11908 -71307 -73453 -29394 -22629 -41212 -41479 -19578 11050 9827 -2724 6642 -32693 -25549 -32323
11895 -32323 -22002 -6779 6935 -25089 -9214 -23775 -89171 -94725 -75160 -85704 -51346 -17238
11883 -17238 -33762 -50571 -26331 -8685 167 -32554 -41330 -75157 -101474 -100583 -76649 -67912 -88577
11870 -88577 -106201 -75486 -52875 -37579 -31897 -59265 -106722 -109454 -101012 -89616 -86147 -59418
11858 -59418 -46718 -79940 -127637 -117545 -96166 -80939 -96009 -93189 -105162 -73284 -69168 -90296
11846 -90296 -83157 -62671 -60727 -57830 -59571 -44599 -49399 -67862 -18577 6350 -98 -3785 -25414
11833 -25414 -21761 7646 -22960 -71269 -73476 -78046 -91026 -93192 -50401 -70675 -68758 -78089 -120146
11820 -120146 -118772 -65714 -60711 -58660 -22721 24378 16305 -34199 -36575 -46619 -6412 28932
11808 28932 23560 -44341 -80664 -80584 -76762 -65251 -27276 -25769 -21447 -37923 -52446 -44377 -43860 -54730
11794 -54730 -51078 -21357 -2317 -50782 -60735 -39552 -63418 -65180 -51784 -55836 -42409 -55314
11782 -55314 -63474 -81026 -96538 -93787 -89228 -83410 -39571 -14935 -5742 -2743 -11248 -68832 -74790
11769 -74790 -95347 -90805 -92276 -121094 -108125 -97162 -70113 -63693 -74898 -99338 -118537 -110818
11757 -110818 -100284 -54943 1204 -5587 -31486 -48285 -48414 -33713 10624 61429 100484 77263
11745 77263 9499 -5804 -6244 14289 1534 -38884 -74474 -69503 -72181 -63124 -48555 -55820 -48292
11732 -48292 -57363 -76494 -70396 -63272 -80683 -77224 -56039 -53034 -26498 -41118 -69989 -53343 -70454
11719 -70454 -76235 -60472 -49052 -51632 -85625 -85664 -81328 -70863 -48474 -9068 -16021 -46883 -47278
11706 -47278 -58017 -74127 -69213 -75521 -84555 -66485 -47310 -40212 -51412 -58346 -43960 -58298 -95207
11693 -95207 -127331 -94310 -57651 -33368 -46753 -46548 -48516 -69955 -78190 -62868 -36016 -22314
11681 -22314 -23654 -22020 -33383 -51827 -16167 1248 -32382 -62580 -28850 -11405 -17879 4395
11669 4395 -9083 -55779 -40742 -20437 -15188 -38049 -6336 20360 -4561 -59821 -78142 -38594
11657 -38594 -2039 -8804 -6680 -20904 -35827 -33569 -14241 -8141 2120 -20514 -62181 -76661
11645 -76661 -66257 -55598 -71315 -59450 -40386 -65701 -29378 -18130 -53516 -39337 -7304 -28321
11633 -28321 -33518 9389 64263 85025 122751 201875 276037 314469 363372 377274 343367 335422
11621 335422 311954 272606 238663 148279 109278 120438 104065 67282 35414 16391 26923
11610 26923 -6291 2291 -201 7829 31442 15444 20207 30035 37363 37307 24861 -8913 9230
11597 9230 -2868 -10901 28829 63101 58461 60301 58708 60493 105113 135509 148235 159441 157436
11584 157436 157759 168610 266552 352851 442494 519538 598102 629282 622271 646540 666628 635102
11572 635102 598687 517467 474908 409621 352065 309615 270966 213217 188380 148367 146458 123155
11560 123155 131097 117723 80571 82240 79780 64076 51525 15852 29181 16993 17191 5201
11548 5201 1927 27439 59299 39933 18730 12547 6437 12874 588 28602 36412 24033 9051
11535 9051 32313 46519 67334 134274 198810 251149 291940 376704 475941 518602 505809 455501
11523 455501 427655 364530 339680 293388 235741 136473 51852 8814 41440 36938 33916 -7846
11511 -7846 3363 28183 -22987 -50610 -75504 -83313 -52024 -44429 -19312 11987 46109 55456
11499 55456 30299 503 -28562 -41076 -41684 -20817 -36993 -83828 -84337 -38232 -45726 -67898 -68553
11486 -68553 12557 5667 -19532 -9792 18831 50453 132613 135511 90080 85958 73866 98449
11474 98449 150943 114543 95822 83463 64392 7777 -36161 -42560 372 -2282 -13387 -56918
11462 -56918 -59189 -51068 -43645 -23575 -2965 40898 11466 8501 -2949 -4031 -1027 5248 2271
11449 2271 -37353 -58081 -46915 -51767 -64262 -52042 -47445 -22346 -966 6861 -12739 -23622
11437 -23622 -40701 -51982 -56357 -35253 4276 15830 45614 51656 58775 52684 78260 79682 68151
11424 68151 73164 53787 29365 2654 -31651 -49391 1183 33401 15708 -14805 -24345 -15856
11412 -15856 -10364 4093 36018 72899 53738 38086 -4767 -35018 -31168 -28707 -36530 -27085 -40410
11399 -40410 -50334 -64135 -59020 -73037 -44730 -4362 13338 10742 3208 29780 35524 133 20618
11386 20618 15266 45178 69323 56059 64636 87945 65578 58237 75979 56265 55587 46482 18589
11373 18589 28886 31069 25189 38541 40632 49212 46603 56846 67500 39108 45064 38989 3127
11360 3127 -11504 11471 5047 -51348 -61636 -54155 -36173 -18622 -37751 -62880 -14081 172
11348 172 -37605 -46022 -35936 -24353 -30875 -27597 -43228 -33284 -28524 -28133 5978 58213 64758 52839
11334 52839 67915 52369 53907 46126 38993 14423 -8745 -8986 9219 48811 53247 34665 41929
11321 41929 19329 -26472 -41019 -19750 -9881 11048 47862 72809 51093 27026 -6373 -24134
11309 -24134 -7237 27100 36635 63094 58249 70400 84467 81295 96349 87462 101397 110447 100470
11296 100470 90181 104097 118806 164710 201918 214816 172622 152926 134563 120044 105171
11285 105171 100203 74389 92060 109480 141682 194795 245192 267555 241731 243087 225033 205078
11273 205078 217082 236974 226425 236975 249361 263849 288481 293993 284373 316879 382842 413493
11261 413493 427644 421503 453977 526156 640857 740788 750323 817497 966974 1037237 1093397
11250 1093397 1134870 1180977 1269552 1408031 1524496 1610194 1751689 1935323 2184097 2437996
11240 2437996 2695505 3014745 3436119 3912384 4464354 5032132 5675058 6419000 7316078
11231 7316078 8460104 9979494 12040252 14857028 18620198 23229654 28561623 34385091
11223 34385091 40488415 46591707 52125491 56443458 59249400 60438551 60117256 58193678
11215 58193678 54595017 49610559 43864908 37858604 31926425 26347424 21413055 17351535
11207 17351535 14243528 12051373 10595394 9548644 8812075 8308714 7954908 7661747 7481329
11198 7481329 7358457 7268444 7288438 7385517 7620496 8019412 8518873 9209616 10129798 11266790
11188 11266790 12641598 14326545 16410063 18928198 21948173 25481571 29629434 34676829
11180 34676829 40913539 48511148 57733790 68761271 81335722 94507423 107020051
11173 107020051 117485451 124930949 128674881 128208200 123817510 116421848 107333959 97765724
11165 97765724 88543105 79974740 72188932 64907541 58108321 51853771 46155893 40995657
11157 40995657 36467850 32737298 29890143 27674173 25655895 23599067 21405585 19189420
11149 19189420 17041388 15031423 13296637 11969112 11068042 10536401 10261473 10224217 10451309
11140 10451309 10917694 11604932 12480462 13513078 14639164 15844234 17230870 18845483
11132 18845483 20874862 23685782 27645568 33114088 40240846 48843711 58491203 68777808
11124 68777808 78984948 87982727 94611512 98227019 98627395 95917370 90045675 81445828
11116 81445828 71108565 60281612 49850045 40333971 32010858 25215785 20097901 16374129
11108 16374129 13726888 11833606 10482711 9418593 8514091 7702675 6967030 6330249 5694850
11099 5694850 5108491 4604517 4136148 3718641 3324227 2964428 2719161 2570370 2409844
11090 2409844 2257777 2135685 2067239 2043424 1999612 1918649 1794591 1708721 1646003 1586640 1504534
11079 1504534 1462371 1416993 1319610 1282700 1226845 1164314 1144050 1104665 1068272 1031368 953474
11068 953474 930985 909662 893699 849487 816052 797511 811887 808963 757755 744727 748479 737249
11056 737249 714936 668229 682417 637630 624974 598504 564402 571565 604330 588385 619773 612367
11044 612367 575527 577013 620734 646719 654765 658930 609312 607677 575535 529304 508409 505423
11032 505423 477173 482937 497407 473907 423490 424748 414600 383934 383293 428531 443314 431135
11020 431135 432726 443054 476613 465070 466439 500648 466104 500506 511771 497953 458834 387849
11008 387849 410343 434963 389914 386672 397493 392776 394675 365822 331190 324462 301244 284049
10996 284049 320344 364345 390287 393110 373434 346219 357605 369575 374287 375497 391826 389258
10984 389258 399767 453051 485109 534532 526332 465479 432502 415682 382975 339619 296219 265969
10972 265969 273237 264412 268034 295914 283623 261388 300357 329923 357527 370463 323785 295859
10960 295859 263364 256556 250351 227481 216623 206716 167884 181780 211768 241084 234052 228329
10948 228329 206434 197644 209729 180959 153437 151138 134048 172716 197185 202841 181914 136569
10936 136569 150675 180764 178147 151898 181938 189309 152095 135311 140486 114686 104946 148567
10924 148567 184617 184898 220977 216028 202032 220892 249831 227503 214376 206632 168582 134951
10912 134951 108319 124936 136865 154780 170320 212588 258754 263321 261193 240021 204279 214007
10900 214007 288915 324964 370451 459094 479136 431723 373376 308151 237847 208201 195484
10889 195484 183678 170920 159262 189241 217663 236292 219462 184407 172104 175437 164837 185521
10877 185521 171983 162595 172485 170502 147992 180572 174346 175750 133818 133695 156091 174629 164522
10864 164522 172417 181229 213461 242359 269699 334163 398196 472446 516622 584147 629966 627750
10852 627750 650813 651317 665454 671387 615186 531682 491218 422109 388597 356377 318297 291432
10840 291432 314168 328819 330857 332661 307117 298115 357271 400410 423545 424849 418644 391829
10828 391829 389975 389700 333833 297012 299244 326509 353606 365588 394334 400235 417317 452870
10816 452870 490288 493216 504720 559535 616394 707775 811561 872513 943189 1011913 1087770
10805 1087770 1144910 1192468 1250738 1254270 1265866 1240319 1185180 1159070 1079853 1016895 1003568
10794 1003568 1039409 1138013 1209263 1257162 1293691 1370066 1495608 1633464 1763040 1958364
10784 1958364 2163041 2386952 2675224 2974946 3230960 3499585 3838641 4235996 4674241
10775 4674241 5191086 5799142 6545529 7494213 8695074 10272919 12313277 14972011 18546367
10766 18546367 23357675 30003201 39367312 52528416 69737440 88770370 104681053
10759 104681053 113428756 115809995 115239471 112382195 104236200 89449449 71068179 53744110
10751 53744110 40275518 30888772 24626043 20395729 17524830 15522705 14140921 13198542
10743 13198542 12547273 12080056 11674116 11352441 11033601 10737014 10393708 10020616 9694022
10734 9694022 9552214 9671569 10104376 10856598 12022971 13738785 16197332 19629162 23657692
10725 23657692 27038032 28420968 27911784 27004965 27400420 30158283 35792787 45102472
10717 45102472 58245491 72584761 82949679 85847264 84317751 84962850 93640907 112260831
10709 112260831 136943911 158190779 166144544 158736909 140102233 116258519 92306270
10702 92306270 72009575 57362795 48257775 42780501 38283605 33154322 27593780 22527004
10694 22527004 18568380 15686766 13530203 11849499 10501573 9456525 8749471 8330525
10686 8330525 8076979 7885253 7638472 7357184 7046083 6765385 6637071 6629727 6724544 6923391
10676 6923391 7285098 7730591 8284595 9079246 10209031 11768091 13937014 16889670 20958381
10667 20958381 26695657 34825443 45592718 57313370 66218627 69217001 67404538 64890010
10659 64890010 64694726 65577127 63553397 56146448 45051396 33837185 24877680 18644584
10651 18644584 14512967 11766470 9810919 8402248 7342279 6539419 5867850 5262554
10643 5262554 4716856 4251426 3871736 3516966 3256959 3053892 2872923 2701409 2524823
10634 2524823 2362039 2203297 2033402 1889665 1796109 1696131 1607783 1546780 1504592 1468923
10624 1468923 1467739 1426157 1370366 1300092 1287581 1263599 1241320 1216460 1174041 1150765 1151263 1138228
10612 1138228 1070564 984628 929417 895538 847493 799569 772347 755859 764743 725051 712223
10601 712223 720975 688884 666166 665874 646084 647207 636133 672323 672148 623297 551536 578569 572542
10588 572542 552441 559139 571827 591903 566329 535347 527380 523885 516000 539051 532833 535496 552209
10575 552209 564559 523154 478844 440359 476605 498805 468259 421924 439187 454703 412213
10564 412213 395806 409045 439447 440982 450841 441641 419500 376402 355723 366024 373166 355030
10552 355030 336291 339776 340846 365383 332133 329986 320440 342097 369409 365159 362161 368553 378961
10539 378961 363264 318632 305742 324093 347772 376770 409089 379129 370374 369728 368437 296388
10527 296388 271119 271237 260952 275146 295772 311674 306631 311580 336568 367995 382526 377577
10515 377577 356127 318419 298898 288662 287675 290599 290137 290995 276517 230867 226860 241931 227517
10502 227517 224319 229019 252131 276169 273606 234441 249534 261885 331705 326525 311934 310987 304294
10489 304294 264344 274930 268886 216258 191241 181976 224519 246484 231367 232972 242580 253165
10477 253165 295991 274796 194874 180544 170818 186682 183627 186862 180834 152107 121787 121223 154149
10464 154149 194793 234479 203637 149057 131551 121407 182647 178610 135271 74462 61006 120168
10452 120168 160693 136383 119258 99509 141680 163470 167750 141185 136260 154081 197205 219882
10440 219882 247926 278426 271207 242294 237939 238263 215144 166653 157914 190384 209701 190045
10428 190045 210171 231827 235226 210584 180143 167080 175437 138702 136660 138442 135768 154046
10416 154046 174958 164530 173633 155565 141273 149039 120129 86790 79104 62777 33089 6099
10404 6099 9355 34072 115315 105401 77074 58861 96658 159770 173748 174000 206984 208126 199527
10391 199527 180494 176798 181556 207104 183583 142290 146764 168272 161226 183858 205784 196085
10379 196085 201297 164982 149917 133023 113994 137045 165000 186905 183299 165550 134080 141633
10367 141633 147578 166628 124766 125037 151728 161199 150702 146781 168363 180868 171657 199871 227980
10354 227980 261283 298847 322608 428432 558917 702385 791428 813900 821483 764697 672939
10343 672939 583350 436526 332725 274680 203662 184714 206594 205365 205007 227699 215856 227511
10331 227511 225265 162785 120822 140229 160450 149352 158404 177331 201176 178737 180384 184642
10319 184642 187804 191971 188068 186414 206586 189649 220680 271286 271271 255579 258670 289244 324866
10306 324866 416473 456199 538117 648157 732345 745548 749951 786683 906216 992904 1021721
10295 1021721 975598 828154 669299 540419 442123 344079 294763 281449 237674 220432 205677
10284 205677 184656 206285 215512 177795 174796 159531 114108 98696 126097 143977 143320 161285
10272 161285 197472 178221 139745 132973 121941 136828 186732 189596 193765 144603 140038 163661
10260 163661 159924 157781 166514 167448 227294 321999 389858 427638 487985 597002 702515 721078
10248 721078 684640 610291 510212 421371 310730 245351 232347 235317 233422 224195 235068 206011
10236 206011 177670 138665 116811 92904 65063 50382 53804 89000 90207 52384 55321 49468
10224 49468 60153 62399 58453 37625 30641 58963 90282 116716 123246 118709 132769 161409 185337
10211 185337 190660 169885 161548 150383 151615 105690 87289 106064 94041 83925 84345 51575
10199 51575 53700 72359 79241 96501 69206 60863 91418 99312 71681 62276 85867 117087 119583
10186 119583 107732 86799 67676 64134 46578 -857 35459 44987 70221 68918 56821 57381
10174 57381 53544 28798 68423 89610 85999 78242 81368 73283 82073 102978 99591 68684 69166
10161 69166 104476 87011 90124 113640 122796 119967 157130 180774 154210 131063 119552 85213
10149 85213 51508 55772 111624 118066 95617 104516 57767 49370 69986 99817 67822 46811
10137 46811 35473 68165 78768 104750 123495 146925 158577 166758 133082 112437 83347 53111
10125 53111 73288 95006 103898 87321 57954 43422 77218 79152 71299 85114 82906 92056 94466
10112 94466 61550 37883 24531 -6164 -17172 13420 61636 92280 113326 106157 89750 72768
10100 72768 89300 71257 23181 15749 12419 35436 56958 81993 73026 52529 31317 49814
10088 49814 75908 93772 52117 2603 -23669 -3905 26286 44747 72835 119933 161255 150098
10076 150098 155272 125700 92800 90192 65090 32613 8978 43343 77430 57952 50878 72139
10064 72139 90107 116100 88899 94394 102393 62020 32810 29694 13944 41985 76429 95280
10052 95280 130875 153258 141587 152702 126266 115511 139176 129515 146509 167719 115049 108907
10040 108907 68441 72422 73275 46293 41298 47408 33508 43734 35313 70851 56990 59754 89193
10027 89193 127502 115296 113944 79135 68427 29589 27785 30187 25981 4893 19596 44731
10015 44731 36529 31615 -8561 -19069 -2553 13215 -4722 58 10002 28235 38238 48804
10003 48804 48363 54718 72992 116942 150892 140422 127066 123310 133643 107527 112344 116315 101319
9990 101319 114154 127750 127649 141456 157736 128779 108154 86169 63927 102051 115012 98944
9978 98944 86654 73472 79538 80661 81660 96888 91466 82763 94289 94188 96495 124412 125696 74044
9964 74044 78355 85363 62003 67538 54825 42578 58199 86075 124833 121000 119685 153103 117072
9951 117072 69056 80677 91842 126371 171680 139694 139462 140359 168045 188072 183924 184829 128489
9938 128489 104152 124465 142985 178760 172678 165813 160125 136951 114288 75186 68983 63195 74348
9925 74348 62938 75757 76829 55398 65909 60889 54111 61122 58717 57548 68535 88775 120067
9912 120067 122782 102137 65471 69350 69271 88172 83306 52171 69508 69362 81333 89232 86957 99955
9898 99955 110633 112029 153247 127645 88114 79948 15922 17833 44294 40577 66834 104706 103330
9885 103330 70443 81862 110336 98993 134474 164329 108646 83647 109836 138855 156699 139652
9873 139652 129928 117660 102831 150280 128906 95878 80727 121378 122114 116893 127906 178787
9861 178787 193393 215506 216883 254481 242209 179577 160753 116023 137914 117795 81794 74486
9849 74486 108188 132634 159515 132966 121795 88313 30819 48223 77386 93591 97129 107493
9837 107493 101288 110224 106411 106089 102846 117176 107675 72160 44789 29605 30337 52110 66325
9824 66325 108468 114253 94048 50016 76645 112534 117135 94133 96548 102632 97936 57928 36523
9811 36523 53001 47134 50245 82548 114105 74600 53798 45096 48877 97206 122676 127368 128597
9798 128597 120073 119771 98039 140328 154994 119110 93394 62242 72310 67989 65745 65968 31385
9785 31385 15797 42453 87890 88638 77723 95130 132842 143286 143539 138322 128663 98727 78389
9772 78389 73642 87353 129104 102326 90585 85822 103998 77085 47987 73739 80940 91140
9760 91140 112590 114794 108084 141650 120294 120711 119395 127239 118985 94343 77579 129645 144971
9747 144971 147294 157420 142779 148123 153830 176681 181917 149180 153066 179067 159313 111259 82774
9734 82774 49163 76805 107313 127816 139727 126869 105274 90769 88815 108050 114002 104970
9722 104970 96970 89645 113797 119405 134937 125045 86739 76603 78098 120146 119821 121526 148570
9709 148570 187738 209952 208823 183666 138668 108051 107362 142024 180864 177647 129472 98228
9697 98228 97279 120425 187139 214781 189360 170857 197448 203115 202557 212767 219847 211145 209161
9684 209161 204032 201041 188059 158507 134059 165079 177167 207167 253965 238218 230483 228168
9672 228168 197450 183826 166793 172866 223292 212629 205156 219976 255044 260031 218349 209873
9660 209873 207431 212374 203260 203117 173806 168235 195586 223252 269212 268018 227659 203105 214718
9647 214718 229632 229445 246690 253378 276510 227516 218035 233043 247999 240674 219747 221600 234891
9634 234891 223278 239104 255863 271178 276335 270835 272723 254780 222135 237243 260726 279614
9622 279614 267155 265903 268685 274241 331627 369450 354216 307803 299595 261459 199391 203237 222764
9609 222764 215406 234678 210913 251975 247289 243453 213759 225610 289571 315566 311919 313803 311911
9596 311911 302821 299370 316889 302445 289851 286679 286628 292048 294918 299483 278025 302197 344755
9583 344755 338444 353129 377178 353267 319259 339426 352823 352002 381508 414320 403025 374641
9571 374641 347388 349411 352198 361060 381788 359087 345545 358753 360255 390303 411386 410438 383457
9558 383457 375480 408764 406009 418660 419126 391630 393913 407770 444784 475015 465982 466544 477441
9545 477441 470850 511734 512594 473351 445506 464114 483552 459207 486261 510843 486139 483883
9533 483883 460173 462260 462474 463004 488445 526807 549563 518908 508218 508484 534075 596294 600401
9520 600401 553551 536437 569656 635680 634320 623153 618222 581846 548210 566176 630839 654747
9508 654747 641672 650235 613927 642760 659109 629236 635725 641887 682624 698046 682715 661852
9496 661852 695368 761169 740980 759639 789905 788198 759569 772038 788954 793568 764594 742851
9484 742851 751766 782390 815466 822001 844856 836824 839468 851028 843462 840718 849330 848455 828818
9471 828818 860934 897480 888793 913655 932199 929904 937310 952081 948041 935987 945958 956191 1005394
9458 1005394 1008421 990274 949360 989904 1018792 1033133 1047599 1073442 1098229 1101206 1122030 1126327
9446 1126327 1086731 1046623 1036240 1081649 1125384 1120878 1091337 1107956 1155872 1179843 1179899 1157245
9434 1157245 1132272 1158763 1183835 1187325 1164556 1174313 1171966 1176291 1207123 1238788 1222562 1229163
9422 1229163 1208303 1242528 1259682 1240202 1229984 1214871 1219358 1262639 1260894 1245319 1233315 1272136
9410 1272136 1283804 1262028 1249287 1240684 1242882 1214388 1248474 1242501 1220336 1205014 1185938 1207646
9398 1207646 1221238 1203272 1198939 1245007 1277821 1267900 1260360 1260918 1253658 1216577 1233547 1242992 1187494
9385 1187494 1174166 1162475 1167924 1167450 1159314 1180424 1146483 1130188 1172154 1185829 1177888 1137663
9373 1137663 1102465 1085890 1110422 1095685 1087177 1071996 1077730 1082302 1083413 1045860 1029912 1027280
9361 1027280 1020036 1010821 1000908 982271 944021 963749 967812 936386 941961 949056 906728 904942 883280
9348 883280 851435 829401 853550 872414 851609 862639 869128 843336 842734 848585 852338 844261 842965
9335 842965 815160 761593 793257 841905 829530 821973 760177 718444 700833 702088 708562 663465
9323 663465 660160 662471 648460 661333 672326 723451 701304 695087 648627 646378 652851 633991 623405
9310 623405 636432 630519 640666 637732 609762 606070 585172 558299 555159 596276 579347 564694
9298 564694 574499 558640 520992 536502 536686 524001 504839 522148 528867 509292 502019 496242 498213
9285 498213 496476 500445 469660 407621 393591 397606 432332 464743 401487 403848 431616 445153
9273 445153 449533 441331 417478 417667 484372 478773 456493 435474 456168 460786 476993 456751 443115
9260 443115 471664 445986 457408 459681 411617 381589 374878 382260 404599 408577 415357 398866 378091
9247 378091 411492 408765 388439 348626 324924 334198 322953 297172 272552 285120 298958 324709
9235 324709 338756 347029 339988 373237 356732 273142 269011 294924 282045 243945 293548 302066
9223 302066 303299 303997 292118 316272 353858 337274 301877 309675 305729 318907 332660 308568 301906
9210 301906 276624 279046 250370 211439 247660 277446 240613 221585 256063 272910 270712 276406
9198 276406 303418 306573 297911 318048 291772 273798 290829 294506 261615 245064 247354 235154
9186 235154 220233 211785 201697 213028 206382 251691 265523 247953 258146 270556 278399 279950
9174 279950 281788 251627 241009 222734 210705 214999 204760 187394 189259 214768 241988 234121
9162 234121 240036 220343 224484 229633 182967 174719 167515 196540 229572 243127 212964 219928 235439
9149 235439 225860 198786 182148 180885 171966 161990 187964 196003 178818 158656 162761 188129 178375
9136 178375 184021 218431 218333 180211 180878 215890 277842 284612 280953 295587 268234 232163 228172
9123 228172 189728 168134 188048 179305 177474 180836 192864 146227 122853 169633 151741 134546
9111 134546 149404 150743 145533 136784 150490 168173 155765 171604 194520 153123 156876 173487
9099 173487 180080 187488 160547 157983 143548 147457 149505 160532 140938 151480 175296 213804 242071
9086 242071 220051 215894 230368 242639 211017 204213 180807 184122 143962 154441 174085 144791
9074 144791 159340 166451 161430 152220 150457 167535 138424 134698 143772 151298 188666 200623 160746
9061 160746 103819 156853 196829 200784 189635 189149 196182 171955 139451 123829 101167 122586
9049 122586 168559 167967 160934 153144 121458 117741 119783 102525 56692 82071 116882 125579 137686
9036 137686 148902 136344 101102 121535 138808 118617 106483 116184 98264 83190 121812 132582
9024 132582 128647 141157 164218 179652 189062 173103 193967 190676 208740 294567 440102 578840
9012 578840 792787 1105471 1358998 1376334 1143286 804468 554968 456068 372718 309172
9002 309172 280720 215731 190892 177739 155967 139634 130817 109578 97291 79623 87859 131603
8990 131603 131628 132471 150809 150888 134272 131874 143829 172760 160454 152454 185885 222190 223698 194213
8976 194213 212124 241526 268396 285096 332206 420550 512613 688037 981546 1385502 1976366
8965 1976366 2546267 2555714 2106294 1494491 983294 670938 487862 402790 327686 244070
8955 244070 223938 210375 209532 174851 156623 173584 168779 153420 87819 74794 82386 90055 73394
8942 73394 28164 63935 86026 89618 43828 43112 68145 77752 84932 38758 -716 11513 60674
8929 60674 101587 145155 182216 224409 318982 422139 530577 657988 912773 1188028 1288518
8918 1288518 1142452 900034 680189 509787 390255 279919 194451 160462 134917 140181
8908 140181 153856 124393 84985 81883 72598 59060 25685 -1599 44162 63458 47277 4824
8896 4824 -7392 -28807 -26176 -7856 -20786 -43786 -25363 -20957 -30156 1913 -15513 -7034 -10963
8883 -10963 -2771 -1054 -15315 24718 69320 47825 53975 111085 151503 210220 347737 479720
8871 479720 606648 640019 541805 428947 355874 351325 324949 263620 217882 204183 213690 190126
8859 190126 110952 55435 43868 42567 39691 80806 74218 54523 68361 98148 80699 42162
8847 42162 45411 30143 28663 60734 75512 42096 21477 33266 30421 5686 16745 29300
8835 29300 11162 -23658 -18281 51363 147050 237170 326741 437725 580284 692705 657528
8824 657528 548402 447018 374609 364268 388515 358199 301610 257766 204313 117384 60751
8813 60751 22698 3488 -11722 17718 20396 37285 8430 -5954 7164 15064 2183 4860
8801 4860 32189 24377 23122 37078 53884 30502 -1302 20424 4326 -31939 -18461 3310
8789 3310 -29867 -41941 -4439 25792 35949 97770 158170 224006 265518 221104 175248 139423
8777 139423 141777 146472 135011 80497 70171 52585 28712 37162 34471 9189 -34782 -53388
8765 -53388 -27089 -13851 34553 79531 76953 34347 -10973 5044 24145 59177 101787 80008
8753 80008 38251 -17984 -31964 -23599 -12502 13096 48059 67517 46170 31881 -1515 -58829
8741 -58829 -85412 -63105 -76765 -81253 -81001 -23343 52730 95886 82630 45289 -1277 22286
8729 22286 61326 95477 129671 101874 32571 -13451 -14058 14691 49796 -2700 -7164 27348
8717 27348 61310 74776 77672 82812 61119 27393 -1560 19 5012 -2829 -20438 -64273 -71021
8704 -71021 -45827 -38218 -57702 -41905 -35159 3758 1692 -1663 7580 18445 -28774 -28973 17537
8691 17537 111240 178478 211594 205632 158201 137151 166166 159549 120524 150133 149635 157237 173413
8678 173413 167038 166984 163847 179467 185135 190925 246856 274984 252380 272141 254326 232493 227672
8665 227672 233951 248084 233246 225249 225742 215323 233006 289129 346450 396837 452383 478987
8653 478987 484336 497454 532910 649110 761869 869444 909377 919895 979790 1032433 1078894
8642 1078894 1137279 1256867 1385760 1535636 1686683 1837789 1996624 2129025 2219074 2421207
8632 2421207 2655573 2926727 3302207 3818169 4463961 5270754 6315217 7487392 8783140
8623 8783140 10164437 11707600 13767947 16709474 20885670 26721895 34802611 46022507
8615 46022507 62125760 86777840 125717747 181122481 233077470 238177872 196280826
8608 196280826 138482345 91857051 62881567 45686170 34959720 27665104 22514259
8601 22514259 18809541 16151589 14208410 12797730 11786626 11144150 10652607 10100178 9527311
8592 9527311 9063311 8729726 8501774 8312567 8206215 8280236 8539223 9026429 9729712 10661359
8582 10661359 11954107 13670871 15779354 18260663 20823667 23473545 26978501 32113795
8574 32113795 39536055 49974788 64625380 84978488 113636578 157078701 227449052
8567 227449052 336021985 456406262 487172233 411353954 291816539 190585853 127618078
8560 127618078 90531114 67678166 52486585 41786725 34238566 28849780 24876322
8553 24876322 21903712 19701480 18242512 17114833 15658334 14119384 12781412 11772562
8545 11772562 11008893 10277245 9679830 9255336 8919456 8710127 8781290 9077620 9502706 10163195
8535 10163195 11022141 12035177 13226314 14557225 16218782 18559256 21909153 26669765
8527 26669765 33403502 42759488 55869852 75330149 105730854 152118688 207521868
8520 207521868 235480651 210718363 157335403 105077316 69957770 49065690 36347192
8513 36347192 28089352 22351140 18259885 15339124 13170173 11536684 10282764 9392149
8505 9392149 8750711 8046710 7243766 6479097 5857337 5347270 4914144 4478777 4164247 3849435
8495 3849435 3574824 3314910 3084893 2953803 2882768 2789959 2668625 2558577 2511639 2480728
8485 2480728 2424076 2361772 2300321 2243184 2169792 2079498 2010741 1962697 1915433 1853275 1819160
8474 1819160 1782314 1730491 1654818 1584745 1528087 1476850 1435842 1417285 1341681 1290579 1321462
8463 1321462 1286858 1236310 1161626 1094748 1128802 1190904 1181132 1140213 1097102 1065611 1020032 1038289
8451 1038289 1032517 1016030 953485 938432 934859 936700 946354 933188 884565 831100 830387 855384 935646
8438 935646 1043989 1042206 982490 949529 936404 896851 827806 807434 799949 777567 748930 772046
8426 772046 771628 722862 694635 689988 669615 665572 641731 655601 664834 693890 700718 681198 690214
8413 690214 691260 662521 653774 627006 657927 637370 612826 613701 598026 569194 541327 528672
8401 528672 513379 525413 500172 475006 479511 496995 527632 579494 624960 654733 623008 613381
8389 613381 612081 557532 522253 514691 501038 498497 477656 494090 503153 498767 473951 409812 389131
8376 389131 357207 385021 379741 421075 404921 387725 398462 394598 422850 428214 424390 384249
8364 384249 385774 376613 398138 434079 427413 434512 444087 439439 377082 355772 360349 368847 381092
8351 381092 358233 369229 404486 440072 446247 432206 437074 430105 381053 347040 372197 391731
8339 391731 401678 416871 390457 404810 375971 380623 376392 321107 302217 304470 304111 298235 312212
8326 312212 298078 306157 333225 333698 356202 359793 336215 338738 363661 363659 377818 401298 392419 354205
8312 354205 328632 318299 294120 259518 187084 143396 133574 120698 187414 226051 249583 292534
8300 292534 332142 307046 311897 358090 364905 310014 289983 280789 297620 333657 327923 330109 303192
8287 303192 268170 243381 233687 241808 278579 307534 314803 269215 299072 321711 313343 323618
8275 323618 260225 214940 190639 183426 184673 190311 205891 189089 201438 206463 184653 157785
8263 157785 74361 -9305 -75946 -101971 -52149 25453 125168 152960 178778 212673 225472 220513
8251 220513 252860 294841 246995 202801 156200 145279 157660 209239 218831 240671 271503 286617
8239 286617 306449 259892 247540 254180 277350 254920 254303 258611 276248 267904 288142 327099 336693
8226 336693 324940 271113 222603 176308 177479 203121 201037 194978 185528 168301 129846 133980 167792
8213 167792 232067 314101 403249 509305 680064 917951 1217897 1475708 1462205 1215398
8203 1215398 885262 676155 544279 445150 364102 333966 327471 293900 291801 343486 359577
8192 359577 307014 288024 262733 223633 230710 217664 211873 231109 237101 200029 216791 192543
8180 192543 180293 204936 219471 251961 316809 288617 286738 313549 324209 336292 334584 403123
8168 403123 488019 580054 664928 808238 1100728 1507367 2059224 2602493 2678270 2271793
8158 2271793 1645857 1126818 841563 659789 537175 454311 396899 377605 336735 284620
8148 284620 245206 220974 198980 170962 178931 202998 198142 173182 174728 205740 229873 245456
8136 245456 255135 240694 216542 211145 204357 180809 187175 211220 230978 229231 205938 265795 307393
8123 307393 310803 319377 364033 491927 591201 739568 1041341 1326520 1387714 1232961 939667
8112 939667 667696 492942 414228 382251 396469 354967 297721 298693 318507 305335 299485 248097
8100 248097 180150 158995 152113 157956 187493 199909 188764 180990 207432 193259 172657 165084
8088 165084 215059 234342 213355 178065 163857 198992 182841 147310 146444 172758 191305 190812
8076 190812 193373 181612 171333 187632 196792 178391 161530 119685 101284 122324 146082 155505
8064 155505 197916 190384 148630 136757 159105 168151 175343 173721 182667 181223 173053 203264 226334
8051 226334 201369 189672 168021 146084 161044 177234 180137 172306 178972 168248 163515 197897
8039 197897 192267 184831 159958 149667 107549 123734 163302 144454 114472 133466 148899 137602
8027 137602 128165 124667 117979 115682 131184 133685 133184 155004 160615 137685 131700 135491 142250 160379
8013 160379 197857 196683 164015 189450 216917 224272 191942 182659 188139 198153 182620 135902
8001 135902 120045 126104 112106 76521 72148 94631 97119 145777 181728 208446 205137 175223
7989 175223 174637 183730 185318 148483 115329 119821 132239 123466 110378 110262 142602 166466 163385
7976 163385 128069 137007 145937 158885 174331 195713 200399 160573 175691 163529 170044 192027
7964 192027 191796 176037 153863 160547 152327 135052 128878 131303 134736 129928 113625 114599 143813 174486
7950 174486 171352 149831 159876 148123 151369 142191 105904 110594 90434 84090 146238 109467 80364
7937 80364 109410 129228 114210 133260 171449 169188 117858 142682 173979 180931 166190 132612
7925 132612 115312 81248 116083 133573 96507 100174 132447 170191 148530 147946 155959 125408
7913 125408 136254 133956 148414 133671 83076 80181 85763 109153 110653 108459 91540 90766 104102
7900 104102 68155 32406 58383 112060 126328 110186 86000 100048 145726 119449 75210 86063
7888 86063 97938 127697 146370 122011 107916 117216 102658 114112 109988 94410 96731 86691
7876 86691 85656 40976 26593 38202 54987 69303 45834 40478 75702 97884 80009 74702
7864 74702 113167 150774 145727 137121 120700 114479 91776 107314 130361 137084 169825 175224 133954
7851 133954 111592 115841 84227 82172 99476 115540 145886 139667 118090 139833 169983 112993
7839 112993 97147 81887 99263 108771 70799 69410 40008 33543 34503 30520 62520 51262 18870
7826 18870 28161 89842 120015 98134 92940 94212 61327 56253 71503 81385 91177 112874 121386
7813 121386 79420 84844 48146 1047 14358 64569 126468 124547 104905 59928 36517 59801
7801 59801 56420 49621 36859 39293 69547 80203 71543 76256 81185 78106 57848 71971 60787
7788 60787 14741 -10725 -38473 -7273 35065 50467 85908 128392 115341 53076 -877 1400
7776 1400 27147 61887 96484 117110 91786 49857 32702 12194 37373 55779 55687 44016 49320
7763 49320 65385 108472 130680 107761 82877 38862 76778 111145 133273 142586 128957 98184
7751 98184 74286 44977 21557 -3621 12492 8394 -1893 19014 48955 41425 67252 96220
7739 96220 77878 89992 118584 115944 84073 67128 59993 43438 37365 28617 92806 119719 106800
7726 106800 81725 73204 60611 45446 44625 74387 70910 43489 63218 56950 92938 64873 11811
7713 11811 -49667 -29398 51675 65408 44491 71501 72160 58085 16974 14575 9199 8831 33566
7700 33566 36480 36601 4803 -14822 -39846 -46584 -12177 4435 34804 27670 21154 27425 31425
7687 31425 26927 27305 46842 41785 36818 22509 24167 24107 17621 34772 49274 41316 28720 -4139
7673 -4139 753 26913 38344 30657 68754 85713 75224 70837 36064 45136 35914 32262 16922
7660 16922 11036 47956 52755 57434 75726 85073 114536 104832 84732 71912 70395 52869 58784
7647 58784 40762 24375 15919 19317 25344 38508 43034 34808 11585 3678 35100 34091 43096
7634 43096 62740 63293 29965 21982 31761 32034 34741 42110 41841 32755 29587 29930 10726 17391 30573
7619 30573 44905 36038 13151 15933 43496 62859 88545 122011 105872 87196 76704 72708
7607 72708 51810 22436 6813 -22874 24216 2423 6948 22283 6132 18888 51877 60950
7595 60950 27688 19977 27751 34648 53361 71779 67196 40396 25231 18717 7899 14573 -4037
7582 -4037 36324 96919 97100 65014 43678 14356 -927 3688 35815 36361 -7061 -19272 -7469
7569 -7469 -11888 -1267 -14366 -12692 2776 24919 43051 34806 36535 42090 53389 79217 71973
7556 71973 24994 -26831 -8708 20533 52463 77200 72559 53617 37580 23222 22286 30306 30314
7543 30314 -1819 16273 76230 90205 111388 91583 62417 89639 82471 82381 59483 46103 46301
7530 46301 23490 18255 30470 44838 13575 -7877 12384 8711 21165 32146 54986 53325
7518 53325 50306 61226 34664 25321 33779 30813 10630 25360 33027 38587 -10634 6698 25738
7505 25738 34170 34838 26865 51108 53133 54885 64469 99091 78544 54505 39855 72240 99843
7492 99843 88557 113924 134413 124401 80974 58108 68850 60057 42338 28797 28180 15474
7480 15474 -14278 -12644 -2778 6273 7888 -27656 -31144 45428 68671 35366 -2538 12706 7669
7467 7669 -4938 12201 45294 54819 55123 53969 62073 36270 8403 -1147 1126 8152 -3127 32307
7453 32307 56497 75739 58319 43394 54655 53779 40849 40816 52086 51128 13289 283 449 15141
7439 15141 20376 46539 70422 72218 31064 31944 14614 -18239 -15473 -10233 -25386 -4770 16031
7426 16031 43495 37182 24391 6607 11184 12767 4188 2840 2216 22849 67253 37977 17666
7413 17666 -5972 -20189 8190 25848 11786 -14380 -6242 -25251 -11759 14140 3300 -39950
7401 -39950 -27645 34073 54273 34643 35360 31566 22164 6727 -10062 -39238 -40081 -30665 -7928
7388 -7928 2091 6008 -22094 -928 12127 33038 7018 5054 -15680 -36659 -34782 -39906 -25352
7375 -25352 3895 21722 16308 -26275 -37301 17565 34985 37929 32548 28485 68757 38377 36635
7362 36635 10731 -10574 -32976 -18978 -27323 -11289 11561 -5886 -13649 20056 18570 9362 19059
7349 19059 20940 -31770 -65947 -53835 9630 40360 27238 19346 35636 37248 56240 68444
7337 68444 32856 -4933 -24609 2284 50181 59667 55638 55384 63062 62069 49671 38740 16297
7324 16297 28219 63932 52067 61865 90931 83031 37136 47090 56267 77790 29740 -14713 -13229
7311 -13229 1789 -28440 -15583 33245 25804 35292 79001 79418 35980 37462 85552 44462 47981
7298 47981 94797 95107 66886 32181 5618 321 45994 47166 47741 22686 837 42461 58797
7285 58797 43411 42525 44908 66457 85624 70889 42149 62628 81622 73307 76770 71095 52034
7272 52034 46794 17353 -244 -5027 -16500 -11483 29925 59324 68174 80046 69736 71652 54785
7259 54785 33968 -8503 -37991 -13212 57029 64262 29584 2571 16884 35051 61392 56014
7247 56014 45218 59010 53091 28463 11199 -3716 -19161 -42158 -63163 -33350 5254 34949
7235 34949 33403 -35202 -47843 -20976 17628 81638 115024 92935 38492 19117 40125 52166
7223 52166 19528 -16888 -11907 68777 94278 75988 53528 17176 41034 52237 36986 24372
7211 24372 25284 13349 -13306 -29043 -20238 -4203 16464 54354 83412 95625 95591 66666 50152
7198 50152 39208 14983 -23866 316 20809 16035 1756 42673 79969 66633 14298 -1269
7186 -1269 21308 50037 56471 33756 30038 18958 -14490 -18307 10465 18445 18021 40050 24266
7173 24266 18598 24398 33295 24150 25228 -8853 9284 47751 37932 16581 7208 18518 -5584
7160 -5584 -12590 19738 25318 22017 4633 -1308 -33863 -11656 52882 82308 82316 44500 41178 25764
7146 25764 -9182 -2678 18521 24350 37766 50348 29633 37397 60871 33794 -11246 -10792 39577
7133 39577 47796 26845 25029 11747 34126 76449 99173 64801 24272 -12158 -30655 -21284
7121 -21284 13081 40867 39365 3589 -5294 23113 21764 15254 21010 49036 82455 66693 31715
7108 31715 31453 18155 4144 -5043 -14462 19385 -3319 15575 63105 28114 7540 19711 -34044
7095 -34044 -73855 -59301 -53154 -18655 13040 24254 54577 64561 16416 10207 22912 21318 19418
7082 19418 42790 67316 88644 84556 90567 72116 32630 43776 14339 4840 -1838 17419 -3946
7069 -3946 -43203 -20533 -15658 -16163 -28273 13476 2748 -9663 -10691 -15605 -40300 -10935 15819
7056 15819 44567 70145 93997 67289 21535 26587 74514 50021 32739 47042 31085 -37248
7044 -37248 -49073 -20570 -26574 925 10564 17390 32193 53065 43807 45097 39998 4876 -1625
7031 -1625 -2014 4646 24812 29468 23362 51232 19464 -1020 19497 76847 76573 42886 32615
7018 32615 36120 68873 99165 78396 95725 61403 31837 27747 13116 9943 10819 3330 -8013
7005 -8013 3835 18068 39602 37366 -7552 -15754 459 37160 47137 36196 47587 53757 76529
6992 76529 40492 11688 8296 30400 74923 65146 42881 19370 38546 64225 73677 65180 56654
6979 56654 49492 31466 22388 18653 22506 -14593 -18242 -2369 -7998 -1243 12434 19073 8842
6966 8842 2739 17646 2784 5086 23047 14099 21169 59081 59479 71689 91426 73031 59361
6953 59361 60121 25189 22375 -2135 7897 63649 65660 33989 17138 12692 -22437 -64201 -75690
6940 -75690 -61371 -37362 -15510 -15736 -8508 -3450 34726 69798 74420 26384 20007 -2141 21106
6927 21106 31545 30609 24875 24024 -2966 -20006 -36162 -10700 -1988 55016 64591 59725 23408
6914 23408 19212 15659 175 -23210 -10702 -43376 -38286 -23890 985 9511 55151 71357 49554
6901 49554 49736 52626 19747 -20728 -45459 -51856 -25818 1515 18229 12666 15487 23398 18701
6888 18701 19696 8282 9980 20990 34365 49933 35069 6892 -32436 -45313 -32655 -1741
6876 -1741 37751 65954 73997 77690 41906 -14537 -20672 -16470 -61864 -56409 3384 25203 49339
6863 49339 51675 46511 59857 59476 74397 69651 79217 66907 64630 25157 11437 38852 99351
6850 99351 106507 66300 54254 10990 -14334 -5931 -7655 19487 51607 43714 34561 33348 27442
6837 27442 42127 35436 12426 -4377 2904 20545 -11529 -1456 -3265 -21997 -11954 -44613
6825 -44613 -52832 -34112 6313 48714 11531 -4255 6549 5885 -1846 16708 21673 44737 73835
6812 73835 89247 66382 63816 43409 14281 24047 21642 67699 64498 57056 52175 34186 21794
6799 21794 33896 19951 -5741 -9498 -5488 10171 17687 63813 50918 40002 139 -16643
6787 -16643 -35868 -23439 -737 18051 9319 -2644 -24963 -10676 10449 14541 6625 3636 6245
6774 6245 82912 123751 96914 54284 51311 58820 37263 -137 -14250 -14468 9208 9722 -10688
6761 -10688 -1160 25889 53878 19591 -19777 -19160 -2639 -4691 5621 16170 22814 20645 19917
6748 19917 15189 -6447 978 21178 61507 61976 33829 41411 44874 49811 60636 12701 7354
6735 7354 23534 14480 44229 60271 93858 102792 90678 39747 1129 -4174 34028 61603 44420
6722 44420 44298 51344 18044 17776 28858 20284 28782 36618 16675 4210 -16707 13644 35153
6709 35153 43354 33918 23927 -250 17079 32958 57403 20846 -8749 -6884 32566 40637 28683
6696 28683 38589 55500 69115 57991 46625 38520 73262 76049 18637 -9269 -38989 -24383
6684 -24383 11199 50758 33187 -1359 8398 23221 47637 53388 43912 39043 33866 31534 44209
6671 44209 40900 25733 37282 40590 45709 31452 23047 21311 31549 40427 25882 4634 -2326
6658 -2326 899 -23524 -15982 -8668 24234 60660 55784 17884 35282 46879 41235 54768 51473
6645 51473 53818 50001 45638 31339 34405 19196 16761 39295 41047 60984 74911 98074 109203
6632 109203 107928 84031 59933 25697 17294 16299 -3660 -3151 -1213 12760 13719 20036 44826 26743
6618 26743 4174 448 35185 76756 64854 52877 63905 52564 38906 28117 50698 41952
6606 41952 21371 10647 30715 42854 29512 35321 31242 8732 -13900 -11212 11574 21640
6594 21640 6945 -38713 -55772 -39324 -18890 23573 23846 5799 -12974 -32428 -634 17425
6582 17425 1393 -3162 2264 16525 33086 45348 23838 9001 22712 21116 56537 83954
6570 83954 46252 27570 42297 33675 25084 31415 28827 24146 45335 48957 12857 1529 3625
6557 3625 44535 54650 62309 39376 10535 343 -17990 -8170 6855 4954 -1882 -49707 -74422
6544 -74422 -39480 9843 6653 33079 4009 -23461 -27167 -27305 -749 7714 51422 57535 38416
6531 38416 7858 30290 35273 9629 -15694 -13367 -17513 -10249 -17164 -24163 -13072 -35165 -31678
6518 -31678 10661 11079 26520 13364 -2201 24705 36651 50653 39361 -2957 1469 1604 -856
6505 -856 -28143 -38073 -42338 -29921 2640 4478 -32938 -48124 -15376 -4110 -12886 -5205 -9739
6492 -9739 -6658 -13907 -5467 4683 653 -19296 18671 65548 77180 33119 14302 10341 -16889
6479 -16889 -77265 -83926 -79500 -61790 -36368 -33322 -24664 -24412 -29619 -34834 -46561 -27676 7186
6466 7186 19631 645 -13752 -6644 5239 -8305 17860 -16013 -42651 -20805 -18434 -12360 -13120
6453 -13120 -14680 -5588 -5459 -12442 10832 10020 10746 46841 50926 43536 39481 37367 41094 35700 19149
6438 19149 13985 36190 53055 39499 15879 -5924 -16281 -18989 -8192 2582 -9923 -23606
6426 -23606 -39170 -43725 -10342 -13678 -29160 -5778 -27846 -47349 -40870 15569 44973 39189 46918
6413 46918 25476 -10612 -42465 -58568 -69066 -52423 -31846 5602 -814 -416 -19411 -42502
6401 -42502 -19299 23072 29610 -12151 -32667 -52137 -75083 -38009 -24631 -21691 -30453 -24891 -34338
6388 -34338 -49090 -22149 21771 63946 69487 29937 -4066 1763 12791 -18751 -30664 -15592
6376 -15592 -12469 -38474 -25617 1488 19639 46710 56143 57593 55597 25945 29888 25931 14227
6363 14227 8279 29243 -16043 -49376 -45568 -16085 7071 38358 15939 -18695 -15255 -15856 -25516
6350 -25516 -47293 -59972 -56148 -19689 488 -13225 -3072 -31101 -47577 -65381 -53327 -45394
6338 -45394 -30732 -7038 -28908 -67173 -48920 -15233 -3101 31587 22879 3259 -11047 -28370
6326 -28370 -31352 -13256 -23319 -38408 -17866 -19110 -17495 -18674 18683 43315 30798 4308 30535
6313 30535 25297 13524 4538 23923 -6100 -12100 1568 -8201 21419 40761 15427 -10615 -42768
6300 -42768 -19166 -7191 8088 45155 29325 37170 42419 26809 10250 -1072 22670 -1320
6288 -1320 10344 -5298 -8647 19326 13221 -4254 -4911 40641 46785 16794 19816 41068 40059
6275 40059 61194 58891 53056 22006 -3683 -30255 -52905 -35694 -36774 -57964 -39619 -31009 -44380
6262 -44380 -47862 -33729 -19673 -27436 -52078 -53075 4668 4582 -17353 5231 32332 23160 5047
6249 5047 9473 -3377 11953 5568 -13861 2904 18662 34127 39399 18584 58936 28037 14898
6236 14898 6388 -14975 38140 35660 36836 5179 -30777 -36274 -48418 -26924 6966 11162 -4020
6223 -4020 -1039 -5726 -22037 6682 27736 28655 49528 41433 43433 38454 31938 21434 36578 35764
6209 35764 31981 4122 -4250 -30594 -13067 -16023 -62668 -43847 -5740 42709 42886 12203 -9710
6196 -9710 -10481 -6941 25882 57899 55601 25321 5738 -18227 -6719 -12108 7124 9143 -3528
6183 -3528 -16147 -13842 -9650 15653 33264 37366 51728 54319 13583 -10159 -2173 -13342 -19206
6170 -19206 -15826 4289 2 27865 21258 3547 -9127 19363 59837 52659 34760 28852 32398
6157 32398 31876 58078 96367 118880 127391 74934 33261 -24934 -39675 -32977 -5027 21581 10070
6144 10070 904 12665 732 -21986 -32579 -42721 -48124 -16937 -11209 -13641 -7162 8655 -13736
6131 -13736 -9440 -7248 -23052 -38343 -52663 -46585 -51867 -75355 -84860 -65437 -44332 -43445 -24934
6118 -24934 -36477 -38653 -16984 -19145 -807 8689 3900 -5072 -1267 20740 73713 33336 4045
6105 4045 3452 5986 1097 -4568 -19538 3702 23675 25115 26493 33836 2340 -18409 -37441 -43904
6091 -43904 -35212 2180 4661 -11744 19808 -22114 -37872 -14356 1459 -2881 -4290 -2000 29550
6078 29550 39652 24167 12220 4841 4470 -51216 -105222 -95537 -71054 -72293 -33746 902 24682
6065 24682 19846 -3086 10780 30634 46963 43161 48813 45401 7202 -10856 9247 17788 38819
6052 38819 47960 8607 -29240 -39947 -15179 41791 34725 35867 -11781 -17037 -8604 -42342 -60781
6039 -60781 -52953 -26648 26168 40242 19771 20123 13176 11940 23859 16103 -17132 -3765 8361
6026 8361 583 -13101 -15923 -58479 -46803 -32928 -17136 6858 35648 -26007 -51065 -54964 -54410
6013 -54410 -43085 -35360 -11788 10206 -8205 -40756 -49697 -50581 -43844 -9166 24141 13396 -50960
6000 -50960 -49246 -59267 -63852 -70794 -61035 -38921 -11172 12230 22679 -3735 15068 7886 -16484
5987 -16484 -62438 -46508 -17038 23333 39725 9705 23771 37838 32350 -685 34723 50869
5975 50869 34519 25304 37365 32854 4690 4012 11469 28912 23749 -34090 -34910 -9445 -2261 26367
5961 26367 46757 17879 -5596 -14935 -36595 -47999 12062 8720 19973 31871 46719 40570
5949 40570 -14631 -49711 -17507 29829 35954 17119 25524 14495 -4757 98 16603 24609 1170
5936 1170 -13586 -31279 -10619 -45135 -38122 -26119 -52081 -26927 -9763 -40837 -52440 -39920
5924 -39920 -36440 -37056 -17196 -13698 -15430 -10678 -41428 -38914 -10712 -12520 -49942 -44321 -36602 -58594
5910 -58594 -67556 -27173 -17450 -21053 -25494 -43640 -8252 -24306 -60627 -89083 -127727 -160818 -140427
5897 -140427 -134441 -93817 -45383 -58560 -23290 -2330 -29474 -49586 -41719 -28324 -17478 -63515
5885 -63515 -33611 -32 4406 5752 359 6220 -4455 -30364 -25924 -4533 -16788 2351 9307
5872 9307 -11364 -19367 -34538 -6939 55236 71239 49308 17502 46184 63528 70584 53626
5860 53626 50835 52718 25239 -10906 -29414 -14950 -10081 29665 30461 -1670 -21481 3278 -6668
5847 -6668 1717 14767 3724 -24933 -54517 -52244 -52205 -52137 -34295 -18974 -40839 -36189 -13646 -16943
5833 -16943 -8485 -6067 3972 -257 12491 -6515 -33470 -24240 -10823 9089 -6744 -21514 21852
5820 21852 25286 30309 18711 23568 36820 36145 45305 48156 32139 37738 43880 7137 964 13225
5806 13225 25877 22361 13885 -36934 -54369 -53675 -49776 5101 820 -14824 -10399 20329 15436
5793 15436 -5606 7115 17348 32671 17186 -30742 -48073 -19356 627 -3845 21812 39936
5781 39936 43954 48659 18141 -7400 28529 46501 15315 -11129 6447 31060 44818 51610
5769 51610 1055 -35123 -26030 -16565 14259 10417 -9742 -40160 -24996 -13089 -24041 -27360 -35127
5756 -35127 -28839 -13682 -26587 -19440 -32828 -62885 -68148 -64578 -54995 -52270 -30191 -7300 -26544
5743 -26544 -53089 -46221 -11429 -2165 -8706 -14465 -7022 -3163 14663 26983 34236 14413 -13406
5730 -13406 -5601 -22448 -29247 -18748 -17813 -46033 -53048 -25537 -41586 -15521 29139 57217 50735
5717 50735 34277 18297 -14225 -50073 -82053 -64513 -56490 -26086 -23904 15855 46976 51090
5705 51090 27177 30025 35307 36064 66692 60046 11806 -36080 -5558 8933 30325 20793 4006
5692 4006 -8265 -40083 -34518 -23860 -23839 -20855 -41717 -43290 -16005 -6060 17501 42850 -2010
5679 -2010 -26230 -18555 12711 47607 27830 23979 32728 24292 24546 36391 23989 14567 -3929
5666 -3929 -24708 -831 -4294 -8299 2220 5595 -29455 -61936 -32304 2061 24909 19013 19151
5653 19151 41265 50537 30938 14517 2212 -13514 -47711 -58261 -69519 -31881 -19385 -885
5641 -885 -5176 -14649 -8171 -32900 -64638 -46414 2321 -7864 -47579 -23217 -1527 9244 25948
5628 25948 25877 27418 25293 -2957 -54142 -73653 -37222 8859 -14900 -27339 3464 7748 -29333
5615 -29333 -34506 4436 68304 63028 26909 -26821 -24391 -6737 -11185 -66932 -91086 -53231 -32879
5602 -32879 -32282 -18197 -47722 -48608 -52997 -30475 4159 21188 18077 25721 46945 63679 50873
5589 50873 9360 -31763 -23022 -25442 -33961 -28993 -11528 -6355 -15935 -28349 3172 22900 15880
5576 15880 -7936 3662 -10889 -8835 7243 -3949 -17479 -34230 -4391 8597 3058 16673
5564 16673 -2396 1461 35142 23439 8866 -19395 -5304 -8098 31593 46987 38060 17044
5552 17044 -14740 -28545 -32445 -16694 281 837 5500 7224 -10410 -16593 -8782 -18012 -15729 1836
5538 1836 9207 9036 31119 50471 58923 -14371 -46152 -33934 -39731 -17823 -19861 15915 25042
5525 25042 10013 -4340 25097 -4822 -15460 20584 44710 38345 34581 49388 15580 -34273
5513 -34273 -58502 -20370 -31559 -38966 12022 46175 11328 -28068 -60583 -58153 -22304 -15852
5501 -15852 -7592 12365 8195 -945 -13436 -5567 15345 23218 20889 4936 -6354 -3748 13260
5488 13260 11390 -38530 -50395 -44981 -54663 -50671 -3726 10166 -17604 13582 -5965 -28700 -11514
5475 -11514 16878 -1905 3302 35589 92074 103260 66852 57142 44008 38277 29415 16216 20906
5462 20906 31774 48388 43898 27464 22995 -6855 -17707 -42090 -23702 56392 78109 27906
5450 27906 -22733 -31890 -38714 -33092 6880 -80 11916 6690 -17159 -5153 8095 12757 8453
5437 8453 18275 -545 -14094 -13709 -59228 -89340 -69053 -54703 -61543 -54662 -34041 -45194 -37416
5424 -37416 -20181 12518 -4015 3438 23477 18363 -3757 -31260 -13362 19059 28764 40440
5412 40440 17437 7383 11532 21971 32694 37337 55082 78434 61729 48455 49655 61305
5400 61305 59619 34994 10569 24601 17681 22045 20100 19790 22801 -19513 -20384 5277 4878 -19226
5386 -19226 -39522 -43354 -28678 -3669 -28855 -37041 -7338 9126 42481 55519 27796 -8291
5374 -8291 -21188 -31190 -26391 -31805 -35138 -43559 -35553 7203 42625 38865 60375 51703 18023
5361 18023 8471 21388 12861 -20043 -30856 -33343 -12224 -1495 -41467 -46092 -31993 -10537 3282
5348 3282 23811 14250 35260 46265 39439 48172 17628 19178 31640 12814 11865 22340 9532
5335 9532 21502 16995 -5330 -7150 5786 17527 21900 16301 7666 10644 -1860 10044 4697
5322 4697 -33989 -32629 -31681 -46137 -47009 -24720 -54098 -53676 4902 -31873 -61921 -46952 -18359
5309 -18359 -42078 -65180 -78718 -64933 -28462 -10367 -42740 -58154 -33241 -37720 -61660 -76303
5297 -76303 -76743 -35477 -26469 -40161 -33490 -27254 14131 -3875 -15731 -39835 -59951 -48519 -40041
5284 -40041 -6344 10007 -27322 -71469 -78650 -51200 -40454 -46899 8491 33575 -36956 -65524
5272 -65524 -64368 -40581 -37782 -26945 -22449 -18040 -26802 -17787 16276 16208 18909 21195 -13246 -21552
5258 -21552 -35609 -56700 -53159 -32009 -46122 -36620 -26121 -20719 -4974 -8537 14133 35007 37412
5245 37412 24661 5807 -12142 -5735 16521 7346 15892 21105 -23003 -39075 -2896 47222 31517
5232 31517 11406 -11833 10045 7983 -9114 -24288 -11739 -7057 -10238 13989 14028 26222 -11584
5219 -11584 -21900 -7881 2507 -68015 -80990 -80583 -76232 -59692 -39421 -62248 -71429 -55535 -48867
5206 -48867 -42405 -47918 -56993 -30285 -14203 -21618 -28414 6506 -4591 -13788 1188 621 -19029
5193 -19029 -7301 -11954 24663 79357 51494 7873 4524 -10659 -3072 4045 -25416 -42251 -32131
5180 -32131 -4667 4158 -15234 -23399 -8206 5555 6910 13964 37990 38360 25052 -2859 -49903
5167 -49903 -44495 -44581 -42025 -30554 -44401 -29316 -14083 -5504 21792 32924 24539 -10258 -40536
5154 -40536 -16974 -210 -13811 -18274 -28359 -38008 -33279 -20241 -36782 -34272 -4136 -8229 -25195
5141 -25195 -3015 23608 -7901 -43595 -48053 -16750 14263 36723 11325 -35270 -50678 -30315
5129 -30315 -19532 -3608 -19249 -35016 -44093 -40617 -28874 -6023 -35156 -53375 -40053 -24064
5117 -24064 -23290 -37420 -51409 -31429 -23984 2601 -33138 -33205 -21402 -363 -18967 -29318 -23524
5104 -23524 -4792 15966 18419 -44915 -58296 -14657 -22813 -25796 -64408 -54555 -34946 -29861 -18399
5091 -18399 -31092 -27014 -27898 -44180 -14662 1102 345 4571 19722 43635 43502 4256 -47467
5078 -47467 -65255 -56243 -52894 -36472 -18397 -10894 -30363 -69212 -84143 -47072 -3680 2838 -14126
5065 -14126 19316 -2935 -6965 4272 -4896 -12435 13099 132 -12682 -28613 -32320 -71148 -69434
5052 -69434 -42337 -26211 -5530 2965 -33789 -54864 -59402 -43945 -19872 -3973 11483 -18109
5040 -18109 -46990 -30104 233 5 -20555 -42689 -43197 -15973 9209 21835 5759 19385 -7323
5027 -7323 -31390 -10949 13250 12046 8427 141 -68 -36258 -38195 -3922 -1356 -21960 -38054
5014 -38054 -31208 -11479 -44190 -63600 -65344 -35223 -17813 -25146 -25347 -23262 14092 35605 1367
5001 1367 -2663 8088 12388 26169 45846 68269 48889 57148 35043 6918 12019 20856 23915
4988 23915 5725 14412 -8035 -36303 -17165 -16742 -28716 -35219 -4835 -5073 -23086 -18955 -31868
4975 -31868 -57439 -60835 -65363 -44931 -52976 -49239 -43321 19218 63492 60297 41392 27764 30802
4962 30802 19125 1616 9489 26084 59997 58712 60875 44600 37049 8689 -3208 22725 3412
4949 3412 -26091 -13966 10409 9136 -3201 -13979 -3538 26171 31976 15665 -2446 -48069
4937 -48069 -63816 -50885 -24465 -13449 -44681 -28134 -15259 -27826 -20022 -19440 8110 20530
4925 20530 1443 -9331 -1894 51628 42913 -14630 -533 39610 53192 13979 -7627 31746
4913 31746 41585 13844 13466 -8162 -29746 -14294 8982 -16004 6859 15267 35737 11949 -25852
4900 -25852 -21571 -25310 -7585 28503 47263 23782 -3656 -39114 -41367 -8706 -23198 -39950
4888 -39950 -41605 -31579 -4879 -4863 -36617 -46054 -13906 -17966 -50554 -31215 14057 -2555 -21194
4875 -21194 -2780 27191 37494 46975 11969 -16809 -29044 -22280 -15307 -8549 19204 39375 1972
4862 1972 -47830 -59729 1655 50927 32474 68311 84539 72185 43211 29504 25930 68582
4850 68582 68126 39011 45741 17914 -11540 -33727 -56188 -43691 -35538 -40530 -13508 -22819 -78315
4837 -78315 -72965 -36101 14097 32792 48659 35944 15388 19815 38785 22950 4272 2518
4825 2518 12426 39477 35045 11444 26548 42087 33299 5132 -9405 23494 46802 36570 37125
4812 37125 38750 277 -37257 -54630 -33232 -56788 -67359 -42862 -5126 -5096 -33181 -41730 -54795
4799 -54795 -76333 -73831 -67912 -90314 -112195 -87004 -60495 -52507 -5358 22135 15431 -19174 -65989
4786 -65989 -78148 -71017 -48324 -54632 -49315 -51000 16587 12433 37248 102948 75091 40643 34588
4773 34588 884 -15672 2495 -234 776 13566 8500 -44822 -40316 -10960 18570 9570 -41090
4760 -41090 -38341 -26459 -46816 13837 45903 24958 -17186 -9404 10602 -8467 -38146 -23318
4748 -23318 -23572 -31834 -19494 35490 43983 2843 6863 -27209 -51050 -69937 -68230 -32449 -2822
4735 -2822 -4254 5369 5281 -43513 -54073 -56376 -76773 -69794 -53811 -66676 -65158 -70048 -50375 -29270
4721 -29270 -7875 3966 18423 -12206 -2421 13158 -11588 -11758 -8083 -12843 -14097 -10650 8779
4708 8779 -31488 -54390 -47698 -56448 -91405 -84514 -60359 -11472 46599 25750 -11479 -34151 -48883
4695 -48883 -67151 -28276 28227 21076 2384 -21714 -62087 -36128 -39718 -66820 -69366 -31417
4683 -31417 -6910 18904 -16116 -18071 -35816 -19031 10580 38414 -1467 -2805 9286 22004
4671 22004 8395 -39633 -62032 -46454 -25535 -46071 -63530 -36454 -26648 -53802 -24730 -12407
4659 -12407 -63710 -69169 -34040 -26914 -52276 -39904 6335 2166 -5276 42927 8353 424 33566
4646 33566 11327 -45413 -82147 -97281 -88560 -50928 -32521 -35600 -31758 -31351 -22063 -20682 -12024
4633 -12024 -17285 -21313 -11610 -8724 2966 3885 21311 17246 32033 52901 55405 28630 14971
4620 14971 17995 26419 23994 5896 -22514 -30217 -33139 -17041 -21604 -17127 -8289 -5969 -18155 -28152
4606 -28152 -24735 -29007 25247 51361 -9831 -63088 -64993 -61285 -82569 -42640 -15664 684 -18682
4593 -18682 -8178 3078 -8620 -67989 -87906 -78692 -32331 28965 33544 5114 -24747 -42737
4581 -42737 -47156 -50350 -31903 -22282 -862 -8036 4626 38668 15748 -9758 -35708 -7701 -15438
4568 -15438 -27349 -61231 -46618 -38220 -30756 -36258 -33191 -26318 -5339 -17373 3988 15620 16302
4555 16302 30004 3886 21061 48471 3460 -47328 -78194 -46145 4128 -1584 6393 21713
4543 21713 23297 33964 -6163 -38055 -44896 -34916 -40411 -72099 -76999 -83205 -102419 -107599 -119485
4530 -119485 -90378 -79050 -55225 -36617 576 21492 23567 -30475 -33277 23000 24648 -3765
4518 -3765 -18402 -10290 -10522 -12634 -1203 6718 1491 -63390 -95457 -96240 -75357 -58385 -55480 -69769
4504 -69769 -53811 -49999 -54447 -39570 16723 35842 1598 -18504 -28284 -59777 -93982 -67491
4492 -67491 -68538 -68156 -68170 -54889 -48620 -27655 -49768 -59240 -39922 -38518 -2238 -12145 -23470 -17212
4478 -17212 -8738 -45170 -79611 -73623 -23446 -6581 -23638 -15551 -27976 -50153 -55063 -78252 -82357
4465 -82357 -88732 -84190 -68535 -80268 -73805 -44158 -40321 -57015 -92850 -80803 -72525 -46268 2574
4452 2574 -16384 -36464 -25435 -11157 -13699 -43312 -17219 -2905 -19589 -38141 -17468 9722
4440 9722 -22218 -40252 -43947 -8935 30525 14009 -8765 4065 -18489 -45337 -45116 -21353 -48303
4427 -48303 -48260 -39346 -62023 -55486 -66586 -59767 -17603 -41863 -48784 -77015 -72309 -76436 -57187 -50525
4413 -50525 -58210 -47110 -23997 -23372 -33452 -12492 -33740 -16884 150 11476 26031 55397
4401 55397 57917 57735 -833 -63310 -74747 -46586 -67643 -73656 -73347 -62973 -45764 -19528 7181
4388 7181 -19912 -3245 10944 1045 5081 28343 6086 14404 10010 5800 16270 8454 764
4375 764 -19746 -18450 18113 17312 -2119 -23433 -57122 -38932 -5224 -23960 -42557 -54189 -80932
4362 -80932 -58524 -11901 -13508 -37803 -70588 -91952 -71063 -13816 -12624 -11900 8443 3942 -48172
4349 -48172 -81990 -47419 -7784 -32629 -47273 -85208 -75582 -54334 -34059 -15985 -1853 7362
4337 7362 38118 45762 42092 22787 24037 29874 -2523 -4272 6327 6905 36157 36927 32510 26667
4323 26667 13440 9283 -10657 -64836 -71447 -50346 -7678 15243 20713 3816 2426 8170 28352
4310 28352 41905 53004 -8931 -56082 -32787 17159 24536 -8234 -44775 -82761 -39827 -1245
4298 -1245 -818 -17742 -28525 -35441 -24658 28997 33014 30087 18257 40696 43304 -12499 -11948 972
4284 972 9428 23743 32994 -13958 -59039 -45621 -43785 -17542 -30297 3196 2913 -17147 -8825
4271 -8825 -20806 -35705 -18328 -16695 -72167 -100847 -62699 -31250 -32093 -18025 12951 11397 -23989
4258 -23989 -11145 28190 18953 24781 71991 51966 36970 24309 20110 6794 13561 20709 -23396
4245 -23396 -48200 -32264 -24854 -20360 -11030 -2467 10770 21859 32602 40068 31771 -1987 -34442
4232 -34442 -34220 -29802 -35547 -3497 24175 34969 13198 -7927 -11145 25182 20312 3716 5359
4219 5359 47 -51453 -59322 -7823 12343 10093 1697 -33567 -41169 5851 25979 17803 1510
4206 1510 3852 15786 8557 -8684 5749 -12807 -1579 24556 41974 43114 7136 8771 -60
4193 -60 -34997 -12458 26913 47470 41049 15937 -1157 10610 25435 -1776 -48649 -58327 -27394
4180 -27394 -47658 -40634 -32203 1121 -39643 -56344 -38840 -12074 -6206 -28543 -34225 -42986 -44577
4167 -44577 -47073 -47264 -53007 -73413 -52889 -9951 -18254 -29436 -36096 -21537 -7947 -30865 -21411
4154 -21411 25284 53074 21289 -951 -12048 -31724 -86348 -89842 -42965 -22028 -5876 -8484
4142 -8484 -6335 8629 -8892 -13280 11198 32856 27427 30295 34077 60340 49037 6728 -7394
4129 -7394 5332 24374 -1376 -48003 -53473 -45078 -63799 -39048 -17448 -29282 -66368 -41807
4117 -41807 -42204 -35638 -47173 -51439 -39660 4101 31824 -9993 -31842 -44826 -46508 -41966 -23416
4104 -23416 -33354 -13194 35 1577 22744 27534 32108 32034 41384 62987 53733 21926 17551 31708
4090 31708 8049 -9319 -30702 -37855 -21936 -290 33260 13036 19516 26307 4416 627 -11349
4077 -11349 -32039 -859 21484 -22423 -66583 -80296 -70249 -51491 -53306 -28497 -17914 -4635
4065 -4635 643 -16741 -8419 4415 -27167 -45912 -23299 18744 13664 -11746 -342 30317 43314
4052 43314 71210 104569 67508 9488 -12103 -15906 456 23457 29616 20603 -32168 -26686 6414
4039 6414 -7217 -18886 -9235 -6342 16000 -642 -11467 18 -489 16521 19496 65306 27487
4026 27487 16657 15389 -6405 -13548 -4284 6488 10355 3648 -3580 -5453 29591 44044 45513
4013 45513 33777 25875 -22375 -30999 -17234 44472 103434 98575 21202 -14026 -41783 -46774 -74597
4000 -74597 -75647 -50218 -79590 -88632 -72615 -53685 -15780 -17252 -72472 -46162 -4511 31248
3988 31248 55687 75229 20929 -3350 4451 25202 22517 9930 -24711 -73754 -94516 -91145
3976 -91145 -91576 -59757 -4514 3839 6369 8373 25902 29988 -19996 -32352 -22572 -19060 41085
3963 41085 79320 81083 51602 25360 -12771 -59322 -45936 -49505 -60290 -77129 -55602 -62581
3951 -62581 -72221 -59269 -86363 -101299 -103401 -87481 -60147 -13156 23265 38133 31779 23362 50006
3938 50006 41958 14258 15998 21094 20020 9463 -11585 -13353 23121 41674 12301 21540 43462
3925 43462 34226 -5562 -14325 821 6146 -5913 -1116 18618 38726 58186 39165 -11071 -44274
3912 -44274 -66867 -63041 -43664 -24233 -27917 -52582 -69326 -25830 17304 66075 47083 46135 15708
3899 15708 -25974 -58951 -51770 -31181 -39437 -30373 -45232 -56525 -30145 -4720 33528 31206 13943
3886 13943 10386 25510 19732 -3786 2890 408 -10679 -24313 -47318 -68293 -60854 -42624 11238
3873 11238 26719 40354 50274 48772 40194 32629 27689 49616 27107 2113 11847 12970 -22733
3860 -22733 838 8721 -3390 -12170 4143 11822 5960 3133 22555 30310 21821 34909 -6921
3847 -6921 -29769 -9124 29095 22094 -25630 -21040 11796 57152 62861 22244 17236 13601 -17121
3834 -17121 -27675 -8754 -11913 14326 38589 56292 19097 13927 3877 457 13372 -8273
3822 -8273 -23025 -30455 -16435 -5748 -23892 -34656 -8817 17149 -14926 -29937 -25500 -7073
3810 -7073 -9214 -24209 -63177 -90058 -91362 -64604 3800 4005 -29861 -34051 -22230 -5000 11973
3797 11973 15518 41285 41676 27546 18949 27103 -23953 -46737 -51380 -44210 -30891 -32964 -12738
3784 -12738 -11196 -5333 17103 10238 22599 23520 30432 13750 -11199 -14920 -33183 -35985 -4705
3771 -4705 -41240 -63019 -55489 -58427 -45781 -41500 -44749 -23224 -5323 -12769 -20342 -56013 -30353
3758 -30353 8559 23425 59889 29830 -17033 -77888 -59668 -14022 -55459 -86263 -70585 -66160
3746 -66160 -36263 3159 81 23464 5945 -8760 -12660 17810 30157 50060 24390 25781
3734 25781 -4193 -25130 -24047 -39639 -75665 -94646 -77787 -27899 17751 20972 -26700 -39232
3722 -39232 -38713 -28639 -49796 -69739 -51432 9569 21305 54742 82386 61768 50554 19535
3710 19535 -11680 -29195 -25146 -47968 -47117 -35680 -9528 -14659 -8396 -4720 -4145 -4138 -25814 -20682
3696 -20682 -4367 36712 7084 -13471 -23895 -14649 -45187 -72017 -49521 -19074 -24961 -52172
3684 -52172 -41988 -52548 -56774 -785 26588 8534 14995 19302 -5105 -6143 -24390 -30377 -45009
3671 -45009 -59558 -16037 17041 -11356 -28143 35218 63822 56368 51887 37839 12552 -26876
3659 -26876 -73742 -41610 -3926 8308 -38874 -98960 -114846 -124589 -92108 -52716 -69307 -64577
3647 -64577 -51067 -43929 -40532 -26149 -12445 -6093 -6098 20567 -23628 1598 -7872 -9177 33281 23030
3633 23030 -31606 -33954 -28489 -36485 851 19640 20991 32399 7764 -9378 -32418 -23013 -8240
3620 -8240 -2079 13802 19175 -11506 -35052 -22429 -35003 -24278 16356 4924 -8790 8398
3608 8398 16972 37627 44358 36698 29541 22702 25420 29281 -3192 -68707 -77353 -46030 -38737 -12231
3594 -12231 15012 37796 22182 33650 25953 3639 35088 60035 20665 -6911 -37983 -41475
3582 -41475 -46042 -41323 -11085 -25916 -41826 -58047 -88966 -108283 -84905 -56767 -55931 -27347 -69887
3569 -69887 -95950 -99840 -114427 -106889 -68157 -39814 -44297 -28908 -4339 -36711 -65824 -59902 -64659
3556 -64659 -97294 -84262 -48642 -33214 -54516 -66492 -64449 -36063 2818 -944 21842 48803
3544 48803 13959 8746 -8993 1289 18647 -8225 -19417 -37424 -40968 -26098 -30878 -21009 -14987
3531 -14987 -9242 38028 49536 25332 1405 6733 19475 8931 -28533 -41152 -74763 -32992
3519 -32992 29285 5560 -13264 6614 76 -23929 -8948 15684 29520 29838 -24944 -85593
3507 -85593 -42644 -56427 -78065 -65106 -32936 18669 9600 25152 65444 54280 24563 14307
3495 14307 14701 16597 26015 -30469 -20035 17655 23500 36944 21825 -12987 -9342 -11533 16232
3482 16232 21559 18370 28751 40036 62071 44331 -10326 -42954 -47672 -11998 -5061 -32274 -74679
3469 -74679 -61522 -3510 17151 -8950 8564 36205 9342 3661 -11866 -11099 -3751 -42848 -42754
3456 -42754 -2000 35078 80454 40905 -611 -11290 14320 13041 24884 8028 20520 53975
3444 53975 27121 -15617 -48947 -20876 13646 -15640 -83088 -65492 -1050 34879 31661 2014
3432 2014 -8007 -30420 -60615 -42767 -50123 -40125 -24342 -41650 -53719 572 -2592 -28136 26055
3419 26055 74064 108115 87774 34461 -14794 -35492 -40390 -66874 -21431 3938 14434 7966
3407 7966 7904 -1452 -15988 -19796 5382 31019 13529 -36390 -48707 -33081 -27566 -23728 -31518 -6120
3393 -6120 26682 42365 -8928 -16952 -152 -18486 -1084 -7085 630 -54855 -69196 -60403 -70436
3380 -70436 -51490 9352 -27616 -49958 -50612 -7962 6002 -4894 -6726 -11084 -24900 -9270 5237
3367 5237 15871 21954 32960 -28576 -65871 -49585 -30285 -31304 -11648 -40892 -43109 -11086 40577
3354 40577 35691 -18223 -51921 -26419 -2141 -21821 -35175 -19911 1479 15153 8840 5825
3342 5825 -13453 -28506 -25383 -40331 -67620 -41852 -16179 -14721 -11194 9657 -20323 -31868 -25790
3329 -25790 -37347 -70132 -71420 -28069 264 19174 21427 8170 -19597 -75437 -79674 -37060
3317 -37060 -22630 -23287 2991 -3058 -15122 -63530 -107103 -88044 -40831 -21379 -6659 17588
3305 17588 -29532 -16954 -19055 -65048 -85045 -63030 -17426 39766 28913 12792 16957 12907
3293 12907 -10881 -15202 31676 32684 25743 -9381 -11839 -23201 -2522 17297 3580 -12661 -25733
3280 -25733 -49814 -59914 -65785 -43060 15322 51141 41970 26654 19662 5639 1117 -22268 -45247
3267 -45247 -50666 -368 15181 29878 49980 20107 14211 13014 14251 54052 67442 17650 -17984
3254 -17984 -63502 -61544 -42990 -25409 -17448 -21570 -29317 -66135 -35956 -38463 -15989 -4625 21257
3241 21257 46217 28401 -7961 -28831 -9376 -2712 -2987 111 -4995 14617 12830 45456 62237
3228 62237 25529 19953 35717 4136 -42976 -62977 -10 53079 49568 13554 -18151 16452
3216 16452 24608 54636 61120 25912 -27058 -25071 506 20457 10622 -8136 1016 20801 14210
3203 14210 -3671 -37769 -29547 -9568 -12764 1884 41171 39580 39070 11616 -32062 -17978 3552
3190 3552 10224 -12257 -24377 -13415 -15391 -14072 -9473 23072 37137 45182 57736 42105 32049
3177 32049 -10765 5169 4849 8432 36466 58418 49831 32645 -18510 12335 54475 41948 36326
3164 36326 8234 -11554 -15115 -19097 -43021 -33888 13285 50835 44673 35814 35360 20626 44190
3151 44190 21615 12133 68525 77662 74843 88985 81241 37794 13413 -1347 -123 2718 -25255
3138 -25255 -23040 13042 14054 22830 22675 30800 21026 32417 30549 21268 44042 28730 15616 15892
3124 15892 49329 62683 54423 30243 18888 36911 47854 46630 43608 48008 67136 49102 18041
3111 18041 12931 -15251 -3223 -12467 643 -41250 -53027 -13820 14193 18694 23875 24479 5214
3098 5214 -6081 20663 38486 13741 -24905 -52201 -52307 -29578 -15179 -1278 3125 -1490 8890
3085 8890 22272 -18285 -42050 -65803 -53767 -31857 25650 9679 -24316 -63683 -20371 12420
3073 12420 -1679 4675 12753 8679 -580 4173 2618 31831 26083 -21847 -23118 2755 -15763
3060 -15763 -47709 -66049 -67766 -43320 -32822 -43497 -20739 -9097 1366 271 11621 10500
3048 10500 -26515 -21157 -39554 -12965 16876 28040 -222 -15395 -14961 17544 42574 49747 -2587
3035 -2587 -5430 17918 43606 21439 16368 19628 767 -509 -11085 5148 38023 71842 76684
3022 76684 78978 88490 73597 16796 -19462 -30388 6328 21567 38502 -5476 -32266 -1371
3010 -1371 36914 7327 -15476 -4453 -18323 -2740 -654 -14963 -12173 -22013 -17144 -43642 -42594
2997 -42594 4292 55388 18795 6970 24127 8467 -29982 -29082 -19694 -12388 -3145 19804 6392
2984 6392 -3696 30746 71896 63652 26906 -14800 1257 38020 33683 18982 7572 16036 -10372
2971 -10372 -42963 -56391 -23810 -1362 34631 37973 -15108 -44138 -26958 -6768 19031 30703
2959 30703 16665 -16866 -45880 -15726 -48586 -70089 -55661 -58482 -51641 -37039 6274 26812
2947 26812 4286 -21681 -53388 -34874 -26985 -21020 -11958 -3477 16522 3796 -28207 -75881 -81756
2934 -81756 -47095 -699 10507 -23627 -51158 -45596 -84387 -110379 -59522 -38211 -36749 -36510 -32181
2921 -32181 -25893 -30189 -54212 -59936 -63205 -54323 -47749 -39124 -33374 -33517 -37522 -9899 -5561 2165
2907 2165 -37409 -43604 -36347 9089 69970 79033 63172 42788 21655 5143 -53010 -55950 -4048
2894 -4048 -7341 -2914 8283 17145 23856 27627 47147 17200 5761 22473 21779 6917 6091 8711
2880 8711 15991 48435 69869 72603 61858 53220 26979 31461 4377 -41369 -45145 -65694 -25465
2867 -25465 42050 33267 28824 54680 91564 89414 59521 16663 15167 28614 40270 377 -12670
2854 -12670 -15351 -5955 2893 2331 -31111 -57971 -47656 -3685 53217 37981 37191 -4142 -34794
2841 -34794 -53702 -27497 -29230 -40258 -17909 -24274 -37882 -61783 -67305 -35887 -13667 6975
2829 6975 17852 34700 38070 26390 10205 11114 2663 -29978 -36568 -14338 6370 -6130 9717
2816 9717 15210 18651 61229 59121 22813 -30873 -62637 -32630 -12146 -11790 -30091 -48231 -21168
2803 -21168 -37148 -39962 7838 30655 -2354 -8990 -14267 -24208 -17874 33318 7686 22068 29807
2790 29807 62726 87133 63549 40532 63864 30739 3439 -47706 -41875 -41938 -50856 -45778 5119
2777 5119 30063 12108 16960 20678 -3520 -16154 -32192 -47465 -24365 -22177 -42359 -16794 5773
2764 5773 49311 51130 9959 7070 -649 9874 1373 8388 -19114 -16503 22424 33085 33815 48645
2750 48645 67768 59429 21626 29105 50354 45797 13759 -12978 -15138 -28805 -16912 9405 13420
2737 13420 -1614 7739 17733 -23597 -55388 -57098 -46220 -77960 -42332 -23878 -41735 -37857 -53278
2724 -53278 -55148 -21591 1817 -5325 9666 -12289 -22286 -5411 -46171 -40651 -7962 -1363 642
2711 642 -17550 -29369 -17192 17368 15568 47771 23188 10372 12047 4647 -33074 -27411 -10815
2698 -10815 3898 -16863 -13669 11572 26349 45733 22322 -5307 -8440 28795 38231 36952 48825
2685 48825 56957 35063 27735 41698 25801 6051 21418 32420 -5281 -21686 2835 14847
2673 14847 12807 54501 58262 31923 4641 29707 38230 33589 7859 -13285 -27463 -50372 -35572
2660 -35572 -10963 -5349 7609 9895 11570 10828 -6516 -26901 -3326 -8101 -25992 -51372 -50368
2647 -50368 -41020 -24156 5839 2737 -30460 -44722 -11975 35904 59396 80105 93901 76202
2635 76202 45918 11248 -26670 -2569 21724 31804 33038 55671 51807 -5757 -30003 -20231
2623 -20231 -52983 -71421 -62768 -6034 13604 13295 10006 22358 66216 59304 23273 36667 17376
2610 17376 -16013 -2481 -21373 -9121 -28728 -28864 -41206 -44458 -49656 -29351 -10899 -6650 -26557
2597 -26557 -36088 -18388 25473 16760 -11674 -38613 -21110 -1227 -17155 -29706 -25145 -11339
2585 -11339 -22360 -14661 -23199 -31379 -26284 20669 33770 23435 -22712 -20329 40617 24472 -51299
2572 -51299 -105066 -105137 -34737 -22593 -13229 19895 -2158 -32411 -32796 -26951 -12848 11979 24067
2559 24067 -6601 -25782 -12882 -26165 -37621 -28811 -19852 10266 33148 14201 -12982 -4764
2547 -4764 3052 5469 1212 -11273 -30430 -26835 -26191 -11264 -12216 -29197 -17054 8091 36306 24070
2533 24070 21583 32318 22159 10961 14615 -11450 15370 16502 -39919 -37747 -4907 -13594 5144
2520 5144 51790 53255 8984 -30950 -67734 -63217 -31219 37552 83234 92099 73916 19227 -22749
2507 -22749 -51167 -49363 -4069 9409 -50197 -74649 -82432 -66942 -58397 -47669 -31702 -11564
2495 -11564 16500 -12669 -54528 -55864 -59487 -78615 -38124 -32273 -47019 -77230 -82508 -66028 -19547
2482 -19547 17331 4298 -6503 -21997 -54431 -41017 -27228 -27753 -19768 -15540 16419 28917 36407
2469 36407 -2663 -20588 -12632 11728 6381 299 7436 43083 27857 -19364 -70597 -54163 -54742
2456 -54742 -59299 -30298 -18938 -6549 -9890 -42314 -48038 -53209 -22340 -32845 -34118 -50261 -51737
2443 -51737 -5229 932 32783 28417 28449 -10689 -52213 -35319 -19287 -36385 -13098 5133 5256
2430 5256 -24161 -20914 -14392 -16843 -45277 -25925 -41191 -43708 -37964 -31278 -30465 -12493 -16230 -37494
2416 -37494 10769 46136 28387 32399 33085 11342 -48936 -69969 -31371 -3563 -11801 -28097 -30598
2403 -30598 -7678 -14887 11538 24341 41059 23374 12876 68339 66549 52293 59567 29390
2391 29390 -11546 14555 10530 -5212 -8282 -12091 7772 -4231 -16160 -7466 7013 -12260 -45612
2378 -45612 -58215 -56702 -60158 -59388 -52219 -4289 -7153 -31988 -21803 -24040 -24190 -21856 -46129 -46712
2364 -46712 -14770 23943 36669 20872 17020 31588 29367 53681 51775 -4202 -46978 -45665 -33515
2351 -33515 16368 -19838 -56613 -29802 -23617 -43142 -57548 -39827 -15530 -28807 -11170 26038
2339 26038 9746 -30773 -785 -12670 -18089 -3657 16834 -9396 -20342 -3466 -1763 -1583 -19727
2326 -19727 -48850 -39769 -9958 23753 20179 -13511 -16593 -7523 25816 -12725 -16060 -26761 -2622
2313 -2622 -2977 -3921 18710 16227 -19519 -21640 -44945 -26215 15629 10452 23336 22341 20502 51513
2299 51513 17282 -36542 -71192 -52124 5760 22091 19185 33446 25350 9771 -19875 -68419
2287 -68419 -71520 -44375 -34833 -37914 -18467 12326 21673 26382 -19028 -76828 -57285 -12299 -23301
2274 -23301 -16301 -21600 -55664 -66934 -22107 3744 5735 -5551 -11125 -65196 -83946 -59071 -16278
2261 -16278 17110 13346 8804 -3387 -14252 -15685 -33467 -18980 -10506 -918 15352 30859 95674
2248 95674 57125 21439 7242 6667 -10446 -26630 -19698 -6202 -10178 -28452 -29587 -21466 -16721
2235 -16721 -27265 -27147 -8719 16144 42688 30809 18209 6200 843 14921 32428 15745
2223 15745 6809 8062 41074 54040 62987 61412 24281 26326 -4961 -39821 -1292 -19288 -58094
2210 -58094 -53920 -29478 -7565 9033 34717 39039 33656 35729 7179 -19005 9226 17198 -25573
2197 -25573 -32501 -13091 -66926 -86265 -55141 -49169 -32484 12485 30514 20549 4200 -26080
2185 -26080 -43451 -45475 -43398 -26657 -51164 -70030 -44591 -22193 15879 35664 -4682 -24155
2173 -24155 -8668 -24326 -24129 -27797 -12657 -16308 -44476 -43844 -24144 -13966 -24640 -34730 -35616
2160 -35616 -15804 -21897 -34810 -19827 -15343 -32079 -40612 -32152 -22878 3059 11864 -36937 -16314
2147 -16314 3388 58305 58569 49786 64109 50819 54627 17944 26390 15778 11387 16841 35712
2134 35712 7011 -19176 32742 71953 40785 25022 21373 17451 -730 -335 20833 39043 -455
2121 -455 7723 31541 22824 24788 12755 5390 -1871 -9477 -13856 -11237 3550 -9381 -49983 -62839
2107 -62839 -20798 28034 13966 -2174 6833 -21700 -39601 -15989 -7385 12306 39503 22501
2095 22501 27091 37865 38238 11994 -17171 -13948 6509 32943 33272 635 -4180 33479 1691
2082 1691 -23607 -7112 5081 33174 39050 30011 40922 58811 55582 97711 99786 59668 40608
2069 40608 42724 57192 20538 -10686 -22947 -3675 16193 1197 -34024 -53395 -50694 -54513
2057 -54513 -58885 -88840 -46290 -22486 -33345 -9701 24762 26598 15238 41270 33379 -874
2045 -874 -29639 -37755 -36337 -48458 -7371 -16932 -5866 -7512 -4970 24039 7369 -18962 -17572
2032 -17572 7679 37799 32740 32099 59146 31990 21278 19791 14356 29022 45919 35066 55792
2019 55792 35947 23315 17967 25271 33364 -8948 -38577 -6047 22508 16907 10215 6806 3970
2006 3970 12545 -8940 -23030 -20359 -43829 -4161 9347 -19235 -49067 -69976 -41743 -29782
1994 -29782 -18290 1048 -2948 -20773 -22295 -37034 -24017 -19442 -5587 -13205 -31133 -9671 23321
1981 23321 48886 32342 8288 -9707 -4201 -925 -13579 -3084 12457 18317 18909 7094 3903
1968 3903 38435 42424 56396 38664 24383 -1856 -29360 -20970 3321 28199 67176 73403 46739
1955 46739 22193 42760 30702 20273 19959 26092 -33086 -70296 -101084 -100701 -76223 -39666 -2374
1942 -2374 -10021 -35952 -40104 -24286 -15641 -11579 -11774 -16191 -31504 -50253 -38530 -61486 -60626 -68007
1928 -68007 -53323 -29319 -11902 -9019 -31800 -38275 -29974 -39102 -22712 -382 -3698 7716 27147
1915 27147 -5276 -5279 5755 -1316 -50350 -13601 18131 15968 19365 11217 7640 -8138 -28909 -32628
1901 -32628 -16504 -41294 -51538 -19289 -29053 -17319 41548 47958 13773 2916 -23589 -29223
1889 -29223 32197 64607 28760 6712 -34944 -57116 -50291 -47336 -69311 -60499 -35950 -56947
1877 -56947 -47877 -20893 3039 16725 -1455 -7788 -19009 -29981 -26193 2561 -12882 -2893 2049
1864 2049 18772 35469 33216 5262 26668 46752 46562 -8106 -22479 -39671 -31524 -8654 14284
1851 14284 -15490 -23761 -20396 -14075 -19463 -20509 5877 14179 6387 16834 9383 -5289 -23649
1838 -23649 18249 51729 20851 7723 27311 27448 7907 -56603 -54435 -56640 -43350 -33128 5819
1825 5819 36305 51607 17660 1172 15714 47727 45552 23096 21605 5684 15885 26824
1813 26824 8326 -25613 -10464 -6674 -4243 5786 27079 22561 -7384 11849 -6657 -15670 -34810
1800 -34810 -38342 -23732 -34912 -49413 -68980 -67686 -37779 -57461 -43443 -4050 50467 64960
1788 64960 63125 76006 58502 54440 70279 60216 37753 -8211 -30069 -36382 -52278 -17904
1776 -17904 21952 25499 -19714 -43256 -47223 -59053 -20949 33763 31056 15531 -11641 -9488 -22865
1763 -22865 -4599 -13165 -35118 -64929 -27338 26694 23436 8907 -14389 5443 48308 58827
1751 58827 77657 67163 38888 9864 -16273 -35402 -45933 -47318 -46287 -35488 -10083 -7434
1739 -7434 6127 53739 59371 68192 80784 84649 54877 263 -28279 -38902 -42194 -56968 -48813
1726 -48813 -11164 -19479 15835 11527 42188 67515 43794 13335 -2674 -3220 -3868 33505 28433
1713 28433 -22572 10606 44175 29189 19331 48488 46063 15468 -9824 -15492 -40909 -31811 -31768
1700 -31768 -37201 -43166 -44988 -38091 -47710 -56835 -38359 -35107 -17191 -8031 -37232 -71003 -63857 -38798
1686 -38798 -35148 -58263 -47760 -27173 -27506 3171 3442 -36922 -57597 -6392 3263 15056 62413
1673 62413 65923 88024 63157 -14678 -72629 -57799 -43060 2702 24080 6375 10340 22029
1661 22029 6800 243 -26665 -18089 1221 14852 3453 -15046 -49725 -55245 -16190 2289
1649 2289 14126 14047 7800 27238 46713 37238 36015 25556 10722 6764 -18634 -17293 -58765 -62929
1635 -62929 -55528 -39671 -15917 1981 12987 -18509 -30366 -6456 37904 15567 27691 57133
1623 57133 51502 25251 32808 20355 9894 39232 27560 42456 42662 15898 1901 5043 -14833
1610 -14833 16025 22075 -28630 -21371 15576 35651 34800 14261 -8739 29519 8907 20328 59487
1597 59487 74881 43496 -3359 -40513 -45908 -31414 -20468 6027 13319 521 -31555 -11605
1585 -11605 -15749 -31683 -30095 -33428 -16827 26376 23003 33174 -8328 -9007 29219 27705 17228
1572 17228 -1662 -1925 2940 -7964 -12954 -13554 -31326 -25033 697 -18886 -7094 33170 56324
1559 56324 48690 7767 21286 -4166 -53027 -65278 -20886 -32187 21889 34817 -8637 2660
1547 2660 9024 8493 -32476 -42208 -20334 -25712 8934 32220 43259 32340 3697 7723 -21654
1534 -21654 -48874 -60053 -23468 11816 8478 28571 33117 53611 17202 28594 15246 -16634
1522 -16634 -20026 -12526 27380 33723 8697 20513 45921 23077 -5952 17908 37812 -3722
1510 -3722 14532 -2374 1463 -12775 -10661 1655 9428 8599 26072 -21017 -52883 -8670 18650
1497 18650 18467 -16791 -12800 37698 45195 55408 48192 16438 -3323 -7298 36204 50808 25599
1484 25599 30009 46607 28353 -8305 13535 21630 -1085 -4764 22116 22432 -20138 -53319 -27631
1471 -27631 -8532 5758 -54204 -70298 -48568 -30934 -10738 20994 47052 46399 8652 -5333
1459 -5333 -20907 -17370 391 -29033 -25059 6773 10528 -29188 -32748 -14633 -10560 -6703 -8624
1446 -8624 38935 71348 64227 39172 41443 24131 -33131 -73589 -72001 -38172 -17858 -28962 -23798
1433 -23798 -47360 -77460 -73150 -64076 -65174 -47096 -43344 -53530 -11622 8643 34840 47836 46543
1420 46543 52421 -10850 -21381 1558 -9000 -15676 -4425 35997 38667 1689 4076 11455 19938
1407 19938 25824 -1848 -18958 13639 45678 54806 36166 26272 48649 20859 -32762 -39754 -34712
1394 -34712 -44348 -33838 20216 56182 95337 112505 73964 35402 1194 25000 28449 15361
1382 15361 6393 5574 35721 66883 40596 8828 23478 2704 9727 20729 30946 26186 26117
1369 26117 7198 -11789 -22485 -8589 -29523 -98594 -100378 -76957 -12260 12609 5373 -29455
1357 -29455 -53170 -33922 -2467 6344 41520 50512 89592 73426 38575 43120 39200 46898 57694
1344 57694 72355 86797 66132 9631 3301 16527 18390 14952 -4605 -38529 4824 52297
1332 52297 70562 53455 56464 45959 21023 29239 22054 31149 43675 26987 8612 23803 46131
1319 46131 31005 2863 14037 64888 42239 27280 5469 -12136 -25508 -66434 -16578 16486
1307 16486 -2156 -14278 977 11145 5627 20143 12792 -15453 -912 10263 22870 37861
1295 37861 60938 100401 110708 134113 134310 108655 47915 15061 30663 13890 25392 17702
1283 17702 7261 -8229 1298 44801 49357 19089 21652 46273 63028 40523 29344 62237
1271 62237 49387 39366 18059 22312 28780 15055 -16192 -40337 8057 16404 -12889 -33564
1259 -33564 -58170 -51322 -25019 284 -6919 -10343 -17645 -62058 -96607 -70807 -54088 -33788 -21125
1246 -21125 -10022 45447 28176 33058 29517 6477 -3121 -5243 9912 13612 -22768 -11827 3573
1233 3573 10643 -9493 -19087 23930 48534 71439 11580 18559 32841 11378 9293 14285 44682
1220 44682 42244 17526 8702 10256 18702 22469 -4295 -13927 11056 15780 -20206 -34328 -20981
1207 -20981 4852 38187 21830 41846 57904 52313 26091 24899 13232 12178 4728 -10446 -15183
1194 -15183 25567 52792 20240 49201 92397 109360 83820 39664 23460 21830 -31470 -42217
1182 -42217 -23391 -46397 -34914 -41222 -54765 -56968 -10667 21521 69476 55114 66723 37380
1170 37380 25824 -7337 1234 17000 49313 40486 29344 23105 7803 -16013 -639 25646
1158 25646 -1623 -26112 -29645 26411 62552 46565 34614 32721 30766 47075 66086 57393 26819
1145 26819 35650 33367 4015 9300 413 -23007 -20571 -15087 17787 84181 106883 58579 62584
1132 62584 42867 11849 9211 23309 35435 18055 67 5635 4161 28380 61321 68290 19243
1119 19243 -30260 -26564 -20925 14189 26965 5062 -3965 15295 9754 -3513 -25943 4817 16542
1106 16542 10897 46435 47030 5097 -4504 19742 21067 40447 63041 46995 24533 27333 26450
1093 26450 48050 36604 32459 28792 33200 9619 -8408 -8375 -1735 10807 16712 947 1702 23346
1079 23346 34916 23260 12636 2126 7543 5369 7796 36737 17392 -27587 -19884 -14888 3794
1066 3794 1025 -26251 2022 -21755 -25488 -10143 -11096 16171 60597 66936 49624 11383 23654
1053 23654 19800 16561 25916 7215 -2871 1320 12494 22441 35273 33043 42545 43608 32410
1040 32410 16047 24184 51374 4500 -21319 -32061 -55352 -59014 -24890 -2760 28828 26503
1028 26503 25166 3214 1148 15520 34189 13108 9988 17557 43853 62674 46551 61376 39819
1015 39819 16690 -7217 15096 52185 44874 51639 19605 10044 -13388 -36796 -13162 34102
1003 34102 38304 57093 98011 123814 92196 49624 59623 55613 58010 65410 60788 57312 58740
990 58740 90851 68127 54374 32157 16033 33987 11845 -6307 9462 50101 50994 58564 54914
977 54914 76731 53243 56373 81586 77699 78035 51543 43807 17854 -31597 -27721 -30521 -31985 -40369
963 -40369 -30278 -8127 -701 -21437 -16842 -1245 10027 8560 50253 66309 45704 12106 4998
950 4998 11537 33649 38258 35738 22777 18953 15959 -18045 729 23442 39778 56528 51752
937 51752 67968 36963 727 5375 23170 -2354 -23163 -25098 -10708 26003 32134 50952 41376
924 41376 46576 65939 67612 69454 60476 57730 39280 40375 10442 16742 14528 16917 19243 17287
910 17287 42017 54734 51918 32002 -10143 6861 40127 51436 72884 51193 17552 10483
898 10483 11835 8518 13224 23855 13948 38613 15279 5009 3599 42088 79081 57591 55059
885 55059 37765 27530 32498 -8199 -3948 20248 13334 -2950 -6732 30949 12094 -8229 -535
872 -535 32367 66704 47555 1782 -23640 -18272 7879 -23347 6069 -4842 -27747 4302 27795
859 27795 47251 36549 64894 80295 88232 93863 72323 63667 47480 -17898 -20643 -16485 -31052
846 -31052 -19116 487 29892 58440 48013 39989 50453 41647 -13620 -41284 -16444 2182
834 2182 -6211 12948 26229 24333 34931 37931 27654 22843 -3390 -20239 -8775 -940 16201
821 16201 16818 -1732 14127 19289 9461 15648 -26458 -6691 1254 -19047 -7269 43167 50239
808 50239 44261 55027 34660 -13116 14822 61264 111490 105279 79186 43250 8058 13694 50575
795 50575 69058 61413 38061 43360 29640 23411 43050 16173 32352 29857 44353 59498 17999
782 17999 42455 26696 26718 42257 39747 37705 24070 51447 50277 36551 47108 61388 50053
769 50053 33595 37996 53025 67967 88502 82329 84309 87705 45548 26268 50524 35082 20457
756 20457 58806 95025 89796 54678 44537 25192 58591 49527 35029 802 -30635 -45402
744 -45402 -28580 -5047 3928 21525 49223 50618 33303 9774 14864 27996 26996 20450 7276
731 7276 -13840 5274 -12397 9184 16180 -3628 1933 18220 4735 -4840 -6706 2572 -16606
718 -16606 -34810 -2595 55754 51543 46116 17910 -27 -17730 -20843 7785 46862 55384 -6237
705 -6237 -1998 3702 -31204 -51411 -14138 43792 60262 8730 13822 14901 25572 31088 52561
692 52561 49336 45209 28651 2839 38104 38402 48123 68901 58264 59229 48909 48724 54236 70453
678 70453 66467 69714 63174 33173 40057 43337 4578 -8058 13039 39623 35670 20521 28037
665 28037 10530 -15778 -34080 -41096 -51425 -32098 -40784 -26870 43188 84565 120733 126325 105404
652 105404 88524 101712 87882 71398 46591 38078 24149 -1105 17579 23543 23789 28041 3555
639 3555 -836 644 18106 58701 42142 43996 75448 70989 44563 29221 24660 12764 -20640
626 -20640 12537 48911 47075 60352 47949 57153 49536 31249 26070 23057 -903 14935 52152
613 52152 67312 83447 79621 73021 75964 57717 42356 71879 110977 82200 50922 36145 41288
600 41288 65188 19765 1178 12138 -4066 -18102 -12203 34559 59683 80865 80152 69407 55668
587 55668 102750 87121 64764 73502 56483 57886 77327 97347 78640 41851 17841 298
575 298 -30219 11809 60109 128847 163209 111380 91076 68143 47130 22597 4600 11110 62245
562 62245 63423 22803 41474 36597 31856 49150 71167 63884 37034 42082 33378 36490 16290
549 16290 16832 39210 23811 18463 49285 58287 26329 61753 68774 82898 68544 54303 62787
536 62787 58027 49359 69066 61879 26232 -29105 -35394 -34556 -17725 -10327 -7210 16093 13078 -1004
522 -1004 9025 30212 28657 34011 23821 17097 18769 30605 -9108 -7070 23184 53023 30387
509 30387 10020 -144 15974 29634 -10610 -38765 -36373 -36828 -36158 -9354 28844 11512 -743
496 -743 -3580 23560 50738 57926 41552 -17209 -29454 -10913 20518 60735 110262 109133 87156
483 87156 65873 73880 108051 102702 104694 81954 77901 43992 6698 -13632 -18913 26734 47066
470 47066 54842 39097 61049 71271 41683 16493 18173 7202 -1212 16124 76486 89880 84179
457 84179 58483 46502 64002 49314 50656 47826 30293 55075 42091 45089 29841 50171 36257
444 36257 18697 18142 38719 43682 68052 65182 85931 94470 65901 66253 34809 24007 57200
431 57200 29353 18505 22751 1697 -28812 -24399 -12263 13415 41156 61604 64568 -5586 -33635
418 -33635 -23284 36447 45532 28120 29936 43792 79198 108222 124318 141864 83951 79780 70734
405 70734 64883 60428 70522 81613 71467 35413 57165 65900 97431 105826 57153 20054 19811
392 19811 44244 40220 58232 58141 28355 1572 9847 -10156 28671 60658 73893 22149 7077
379 7077 17666 14509 -47808 -25244 29454 36032 29215 20944 -5871 -14769 5057 7009 26979
366 26979 83977 121480 65898 23433 26552 31398 22396 24669 62493 46431 55247 60866 60012 53820
352 53820 10206 5268 50789 -6909 -26441 19783 64185 84022 58438 55134 52183 16636 5418
339 5418 -2652 -19371 -11294 -21881 -991 1741 -11684 3071 7571 22789 10464 696 966 19872
325 19872 27184 63321 78822 89175 64838 62370 76112 77463 85605 83041 54368 24525 43772
312 43772 39686 48784 22509 35861 71463 94660 90116 88426 70975 14599 8053 30895 41710
299 41710 44278 61787 92213 93021 68051 41877 54387 68320 90671 105416 128208 105137 77531
286 77531 59822 44497 17867 33869 33146 23662 6064 -7720 22809 46251 49739 28952 47548
273 47548 26753 745 -11078 -1541 7871 31546 39343 52182 40984 64405 58377 -11146 -17955
260 -17955 11889 15464 20965 27093 20781 19645 28937 30956 12108 17219 9483 13091 57947 76423
246 76423 81825 85447 68065 69214 83115 77994 70696 71159 76395 50832 17963 -6952 -7299 23772
232 23772 47125 58875 47690 47089 71702 85691 79135 100175 123806 119345 119825 113911 123515 132059
218 132059 107760 81870 54918 34961 31740 32115 47681 79664 80500 81725 91078 110860 90269
205 90269 75640 62039 66399 52800 33402 32512 74002 76529 40772 22157 5972 15438 32191
192 32191 23770 -15133 3607 22534 22171 -4703 -7006 2126 7184 3236 7450 6068 15727 49883
178 49883 56165 44654 35394 -12034 -16150 -3487 17630 27718 49644 39549 18040 6926 26992
165 26992 57850 53225 33625 20286 11886 16671 7039 32151 85947 82609 29381 10196 22397
152 22397 18157 29307 36183 58408 67620 56632 56623 23867 8848 12532 4505 25372 41677 33449
138 33449 54779 72775 66491 63990 76735 96053 90800 95510 71058 46440 14367 18023 12379
125 12379 13318 43580 40047 20819 41931 46199 55791 57045 47521 30405 50636 53133 47698 28995
111 28995 -1029 -8515 18078 55513 62692 44941 42566 76402 77995 69236 58422 71793 54038
98 54038 42432 58391 56856 70446 76576 60904 54494 70357 68352 54177 39289 32854 49099
85 49099 58850 70533 74129 75701 63179 64498 58379 48232 66087 69771 59717 70713 25859
72 25859 30519 46295 57549 56019 51177 66277 84565 71593 68249 90733 91099 44551 39604 31684
58 31684 35409 47393 71323 66071 60105 66077 52162 56431 62459 51101 23099 29084 37449 31633
44 31633 33961 35143 13111 33104 45952 46465 40858 31395 38919 45397 29200 37741 556 12443
30 12443 23924 45630 68412 72999 48547 48739 62674 60792 60779 79448 73948 80369 62913 16495
16 16495 -12471 1849 11712 10906 14285 9950 24455 28987 26191 71698 70892 52642 82649 82560 78988
1 78988 74889
0 74889
$$ Imaginary data points
##PAGE= N=2
##DATA TABLE= (X++(I..I)), XYDATA
32767 122805 144645 155947 165030 167394 162932 181397 217737 222793 202950 169132 155370 147667
32755 147667 161328 182206 186577 176723 149278 154874 154353 172704 207231 181233 161765 178980
32743 178980 174821 178482 191820 225062 231104 220987 236115 232138 213327 205348 206444 205010 178041
32730 178041 167821 168841 168827 189364 198972 205292 196921 210959 240951 238178 244330 252458 261241 279356
32716 279356 274854 249022 254729 263204 254758 255127 283478 272745 272963 273008 271971 265146 240500 237172
32702 237172 248583 242219 240018 234535 237631 273475 297319 292551 296537 260682 262691 268630 255050
32689 255050 253838 249975 246028 250357 254621 272382 291488 312190 341299 339065 331596 307384 310024
32676 310024 308491 325769 333269 320837 322329 334447 342348 324956 318794 343783 350505 369638 362695
32663 362695 383217 385462 355382 332944 335535 309963 289937 308718 338980 337853 327285 334192
32651 334192 347115 369114 384919 371292 359949 352177 342461 332106 317018 327491 351899 362323
32639 362323 348148 332973 343499 347062 379572 391135 406200 402024 389305 382857 373323 360197
32627 360197 339079 331520 325328 346197 375858 360562 382544 398087 364804 371412 405104 421780
32615 421780 413397 392537 409291 399229 397114 408731 411795 429064 428792 413729 393293 385509 390653
32602 390653 388678 378811 390989 417265 444252 433425 441002 444910 444910 435034 421219 404960 388016
32589 388016 369282 385351 402802 394642 405287 420081 432676 422763 450229 486179 493766 496163
32577 496163 494980 478351 481181 494724 490714 500686 490542 501810 507869 519401 484131 468280
32565 468280 484294 491473 486248 457129 470490 509258 520868 533085 507340 490831 519017 534511
32553 534511 506376 490560 477747 480170 500581 504023 522105 552234 556767 534562 492204 477889
32541 477889 506159 529672 535370 528670 500984 470911 473963 494835 497180 483483 512627 558470
32529 558470 568447 533978 553390 560462 572037 542922 526378 512317 517991 518396 523185 519682 509097
32516 509097 526785 488232 483012 481782 480009 471767 493411 513318 510169 496573 522071 533595
32504 533595 510181 515815 523403 490545 483680 470267 476814 506871 530132 549835 532570 548311
32492 548311 566663 567750 574764 583542 573590 551466 542291 542716 569386 555743 553933 552463 546746
32479 546746 561915 560573 566850 602150 619482 641098 616215 570627 540904 527765 520605 538264
32467 538264 582243 568804 555428 547872 543245 585634 578010 590172 569778 545363 554411 565785
32455 565785 563606 550430 550656 558877 558656 548729 565234 573346 554211 553249 563562 567720 561516 553062
32441 553062 550716 559087 571634 584683 619299 625436 640532 643865 620638 599660 614272 598004
32429 598004 624447 657173 645662 600433 587743 594738 622338 609143 582021 607264 643413 624978
32417 624978 625472 628051 612007 588329 591693 601875 610255 614501 614374 599467 588160 578561 582051
32404 582051 603209 630983 634367 609470 604663 629769 641680 661222 658634 667568 648452 650693
32392 650693 649706 641843 635866 618242 581765 591618 621650 632817 662971 666514 672009 679125 640306
32379 640306 636073 678692 693018 698351 669020 652475 650080 658728 642870 626842 652721 686800
32367 686800 680461 699517 682514 666650 631813 610780 624248 634819 657213 655328 633845 631438
32355 631438 639170 640135 645268 633320 627621 621240 622069 617749 616725 632544 635504 633895 670849 695235
32341 695235 700510 681369 686352 657388 664243 676063 657086 656743 703892 722356 727611 715483 719084
32328 719084 674662 664890 690757 688133 668307 646178 665584 641050 626899 649598 696006 678685
32316 678685 673946 690291 681213 680361 680450 667366 672949 660509 665983 669666 675631 664636 660789 645376
32302 645376 626254 616847 612268 650978 686351 693871 705215 721523 733677 732509 714854 720231
32290 720231 745320 757220 733695 703011 713129 745850 769247 749974 720431 757865 719450
32279 719450 665533 661468 690714 722040 718664 708828 680774 667318 684839 696023 724988 740704
32267 740704 733416 695476 669783 677429 666022 690753 730585 731016 720629 707554 723670 718325
32255 718325 714340 718936 716084 724632 728919 761330 758826 682796 626879 655067 703380 709090 717769
32242 717769 689318 684185 699776 693520 699781 705316 661293 677187 669445 669280 681765 665545 721542
32229 721542 719401 684376 677123 721242 717291 699459 668486 659441 671382 651174 692229 711517
32217 711517 717405 720238 713784 716678 702221 714772 724617 689998 690004 709799 705677 725415 740554
32204 740554 732231 737536 741392 721877 720066 707621 733640 753161 731997 735027 721347 700447
32192 700447 691019 682211 689591 715250 708327 700954 702439 700332 696444 704997 741964 737180 704770
32179 704770 651699 680214 688187 687364 705905 701790 701877 672121 678237 674058 720318 749563 707318
32166 707318 676498 698229 687344 723586 748531 756469 796980 770402 701750 697999 673005 682698
32154 682698 678331 664699 644746 613046 611281 622022 640789 637768 671544 716151 743158 798135
32142 798135 787665 763474 726050 714460 748333 735157 685318 702953 702535 675742 691897 735994
32130 735994 705427 695654 674220 665781 682559 674265 669657 739722 786867 814053 802360 775797
32118 775797 738227 750300 777107 777405 770667 777007 768208 715535 729018 742395 732962 747691 737179
32105 737179 721006 697527 686325 697950 692427 713873 717900 713932 726818 736900 714199 728917
32093 728917 710804 716852 762885 752452 708225 702076 711131 680976 679321 699010 699737 704487 730470
32080 730470 724586 699498 699350 694358 720214 716508 705063 651571 633727 689904 709125 695246
32068 695246 715060 722600 717426 712330 692759 677200 683136 720663 707211 705013 706874 692159 664272
32055 664272 694583 714831 714433 707607 694561 691139 696466 698791 711084 682308 691906 729619 758197
32042 758197 746593 736233 753661 707130 703851 688863 677276 675484 683471 682496 695217 729678
32030 729678 714720 686546 687434 702141 712281 673115 666538 691093 692713 682011 684966 715546
32018 715546 703330 705609 697836 672273 657874 684153 683739 704239 739078 743328 749923 744935 721460
32005 721460 694118 690061 712171 720251 726440 744290 711534 681464 656781 677544 707640 684688
31993 684688 675710 663343 650322 655507 635620 624328 655839 700716 763346 772081 725237 712757
31981 712757 700076 678103 687156 705122 723556 719318 690910 696067 715896 736256 734160 695669
31969 695669 703221 713610 705183 708581 693895 719700 712785 680399 665011 676625 692826 693285 681734
31956 681734 701739 714110 732011 726158 735300 729894 701530 693000 717243 746090 729829 727676
31944 727676 739438 725573 735251 777298 817135 746440 703632 718552 767182 793274 755273 718172
31932 718172 731092 723383 696049 706428 746039 780151 784065 791741 764567 732140 720064 731430
31920 731430 727548 695447 684755 697593 680276 686065 700733 691828 696468 729956 717318 703817
31908 703817 720046 733847 737055 724433 747902 762512 729909 712233 726891 711146 713739 733367
31896 733367 754905 751475 757853 752109 748408 760301 746070 747065 749091 747859 714502 719154 793625
31883 793625 772412 743721 746430 739670 774720 769417 742470 718474 717817 758094 772819 775772 775014
31870 775014 741383 722749 718719 723805 700813 704984 716237 699518 683111 707881 681374 655084
31858 655084 669942 665038 676649 705278 693801 682742 702790 722407 721502 755159 753032 735982
31846 735982 703310 687674 704577 702319 675437 692152 688786 662729 672067 694625 720965 732157
31834 732157 746425 750162 754112 774547 755328 732914 721609 703502 716101 714444 696623 703883
31822 703883 721729 728002 736186 749076 739985 718942 708048 711368 686145 735745 743476 748531 756939
31809 756939 799526 791731 784514 768804 747037 723724 695092 715608 724520 716885 717065 696281 657142
31796 657142 646008 667236 644299 621833 631165 656099 681595 700339 696499 695679 707943 703618
31784 703618 677276 683125 673816 686777 696845 697406 734569 763582 731898 665854 700946 719686
31772 719686 710494 722805 702739 688579 668385 683279 702906 754852 798153 810677 791672 761236
31760 761236 716099 698725 730480 744324 732303 729698 742578 733434 688078 691470 729440 694500
31748 694500 666963 692588 756489 809643 788251 765445 735308 733562 715126 673670 651597 667764
31736 667764 713611 712701 704295 732077 712478 691802 734712 772652 740780 712928 689079 673359
31724 673359 706270 708080 726239 747256 757171 736284 686609 699743 710257 721002 721945 743122
31712 743122 735946 713224 691383 670237 699056 708260 707536 740916 727570 713594 669943 664035
31700 664035 657829 662335 669284 695955 706457 706005 696159 681545 642428 669044 701819 727748 717620
31687 717620 676306 689395 739240 754001 757351 758148 728430 720343 713308 697569 698855 694771 652031
31674 652031 645974 703823 730346 727819 697141 668871 645894 679696 725687 732029 695626 709061
31662 709061 706399 708677 699617 720443 744580 746959 743024 732492 738022 745321 783051 803931 784406
31649 784406 768156 780060 763262 795580 806429 795748 769835 725726 704608 692607 733872
31638 733872 747210 759705 777458 756992 717709 692798 681366 666959 694927 720519 736137
31627 736137 715314 720823 715314 728346 735978 739096 744714 754876 780750 794234 796951 757444 757324
31614 757324 772050 755399 749314 752527 763178 751161 755128 747780 712895 680760 689672 726049
31602 726049 760861 714985 691167 694911 759241 776858 799251 783310 728234 699071 707109 719966
31590 719966 743075 749786 759237 756312 742018 727798 738916 759822 777716 762363 744590 760285
31578 760285 778705 791130 784983 763608 737157 723145 753734 794480 771829 770765 773930 743898
31566 743898 689653 652764 698607 757166 716553 710555 725619 749025 733891 750501 757140 739195
31554 739195 710319 743955 764387 770373 757827 735103 734760 744186 756370 762107 781489 799401
31542 799401 747491 712777 708334 716269 760600 765822 772225 755824 746880 720080 724935 728070 697372
31529 697372 695644 725779 786264 769962 780893 788778 775563 758447 719268 719521 720876 695410
31517 695410 666558 688972 739543 747734 722541 720641 724850 714127 736176 785529 767129 759513
31505 759513 783264 761693 749637 756691 746233 744220 745083 784105 777837 794496 816979 831573
31493 831573 800888 790786 788937 765985 731592 720464 745902 743442 710396 726936 728591 730593
31481 730593 728809 743702 807458 795371 778254 754366 713545 689346 671554 702670 761160 753691
31469 753691 708513 687292 670459 683648 702234 724750 692103 726125 750600 751580 735231 747679
31457 747679 743058 755479 771238 749286 738965 763256 765636 746017 732674 714179 684953 690309
31445 690309 684924 673930 690922 707532 729247 744408 730730 687799 709051 708150 692817 711414
31433 711414 716148 712155 718116 727799 715669 693260 675838 671163 689413 734349 752667 807212
31421 807212 814302 780606 719290 736181 782562 813317 816532 796840 772483 739686 754241 790849
31409 790849 810575 806791 765130 783944 778224 758026 754135 737203 724698 773516 789410 760617
31397 760617 758116 771055 772177 754264 751226 768224 774781 766203 754821 747717 747002 749006 750818
31384 750818 718701 708396 702491 699722 702376 699551 678981 724430 767132 737851 707087 664580
31372 664580 673332 720426 688494 657877 672590 663165 642764 652840 678092 719700 741909 751341
31360 751341 715018 674812 689634 654744 663868 721438 746006 758203 777734 769015 764943 752290
31348 752290 750575 765412 741781 739806 757912 779845 794307 778213 792993 786460 755719 720494
31336 720494 720858 718993 740194 750410 755408 722038 711755 703759 728149 732643 748258 773633 787637
31323 787637 776396 732264 741426 767132 792114 779167 774502 754073 707354 728360 760901 762047
31311 762047 792549 784079 756628 775896 781555 758941 766075 740501 739050 754669 743330 774369
31299 774369 781510 804009 788805 743221 736514 744514 777642 796651 778695 762741 746072 720149
31287 720149 714166 714839 744365 747751 735878 739430 719507 738475 782520 796264 782282 728411
31275 728411 704323 727515 749497 731392 707875 687133 706412 698259 723620 739488 706399 679883
31263 679883 680540 710348 694331 695648 708858 732928 745245 745946 763913 772929 741865 753596 738591
31250 738591 717066 655269 648688 688984 709659 750054 745746 737142 735535 748633 753318 751075 783614
31237 783614 767472 733440 746335 756435 753078 764349 740277 742353 754566 779794 787685 766255
31225 766255 761067 763902 748200 787628 759200 728745 754407 795320 775041 768221 734699 719770
31213 719770 737247 772388 811993 797295 789465 775659 737185 706192 709019 736675 790322 786348
31201 786348 768612 780732 792724 762174 753864 740049 719137 732592 744793 764923 779721 765036
31189 765036 781163 757119 692502 699091 702022 683185 699205 726322 776268 765267 738189 730660
31177 730660 746479 788887 759792 704091 730277 728721 737269 759652 738449 758671 795158 829541
31165 829541 835822 788646 757230 753762 742880 742046 769717 753755 722927 692550 694178 680941
31153 680941 680279 704697 709333 690298 680756 724550 748790 743776 755575 782866 762666 718981
31141 718981 706231 731768 733537 721027 752551 773966 750459 756587 768538 782809 788810 761802
31129 761802 770644 784390 769290 791754 830600 786138 769259 768050 743952 733448 758416 774918
31117 774918 760181 740405 736299 769209 772434 742046 731407 738647 748496 750473 797624 785681
31105 785681 790737 761138 731013 749049 760185 769966 795590 799807 768506 764113 757022 732827
31093 732827 749687 770804 745036 731113 748548 748686 740962 774031 809706 833809 815957 821896
31081 821896 801878 809610 794192 794201 789541 775697 789581 809428 834208 814677 808628 752229 736390
31068 736390 741169 752054 787910 833494 829834 795340 768575 774269 761389 761100 802891 789223
31056 789223 757242 761626 736973 722165 744103 750210 773473 748675 729496 738778 736468 770813
31044 770813 778478 767957 755935 748326 753000 786257 777301 781566 773398 752549 744553 746153 721412
31031 721412 724499 725663 710794 712482 706106 731656 726967 744256 768294 761305 753124 776685 776588
31018 776588 785259 774979 770342 770177 719275 714628 726490 724082 742896 740429 771789 769560 805217
31005 805217 795622 776067 782085 776810 763985 754471 731146 761061 797993 835386 849144 805804
30993 805804 782997 778187 767327 773984 777890 788156 790420 777541 802084 840069 815789 784097
30981 784097 776788 783611 780936 797326 781282 793356 773931 739996 737583 774665 800258 801223 772375
30968 772375 740742 753143 754548 727215 751866 738124 725453 748653 779421 775399 764216 748509
30956 748509 722541 701172 702169 757537 755871 755754 747567 756562 795531 817812 826551 785974 758307
30943 758307 740562 720171 757313 799274 821653 795147 804909 841592 824856 810665 767684 734922
30931 734922 719974 707059 757327 811882 833358 822659 784813 771026 790255 766750 765531 774847
30919 774847 779442 763748 776025 802067 779659 779537 785795 746156 749449 779391 784273 766009 760010
30906 760010 766646 810492 808759 764059 729944 734877 758338 740658 712817 702657 697248 702165
$$ [...]
##END NTUPLES=NMR SPECTRUM
##END=
