##TITLE=Analysis number 329810
Compound Code btb 05601
Project Code adrs
Chemist Name stores
##JCAMPDX= 6.0         $$ Bruker NMR JCAMP-DX V2.0
##DATA TYPE= NMR SPECTRUM
##DATA CLASS= NTUPLES
##ORIGIN= Bruker BioSpin GmbH
##OWNER= nmr
$$ XWIN-NMR		Version 3.5
$$ Mon Oct  1 13:08:00 2007 GMT Daylight Time (UT+1h)  MAYBRIDGE\nmr@NMR_250MHZ
##.OBSERVE FREQUENCY= 250.131544655141
##.OBSERVE NUCLEUS= ^1H
##.ACQUISITION MODE= SIMULTANEOUS (DQD)
##.ACQUISITION SCHEME= undefined
##.AVERAGES= 16
##.DIGITISER RES= 18
##SPECTROMETER/DATA SYSTEM= dpx250
##.PULSE SEQUENCE= zg30
##.SOLVENT NAME= CDCl3
##.SHIFT REFERENCE= (INTERNAL, CDCl3, 0, 16.522)
##AUDIT TRAIL= $$ (NUMBER, WHEN, WHO, WHERE, WHAT)
$$ ##TITLE= Audit trail, XWIN-NMR		Version 3.5
$$ ##JCAMPDX= 5.01
$$ ##ORIGIN= Bruker BioSpin GmbH
$$ ##OWNER= nmr
$$ C:\u/data/dgb/nmr/ADRS/60/pdata/1/auditp.txt
$$ ##AUDIT TRAIL=  $$ (NUMBER, WHEN, WHO, WHERE, WHAT)
(   1,<2007-10-01 13:07:34.31 +100>,<MAYBRIDGE\nmr>,<NMR_250MHZ>,
      <created by zg, POWCHK disabled, PULCHK disabled
       configuration hash MD5:
       76 6E 9A 78 1E 09 19 81 EC 84 63 8F B0 6A 59 2D
       data hash MD5: 64K
       FE A1 09 A0 C8 4F 27 1E 7F DA 0F 29 79 B8 DB B2>)
(   2,<2007-10-01 13:07:50.87 +100>,<MAYBRIDGE\nmr>,<NMR_250MHZ>,
      <Start of raw data processing
       ef LB = 0.3 FT_mod = 6 PKNL = 1 SI = 32K 
       data hash MD5: 32K
       2D 68 CD 80 6B 62 ED 9B 2D 20 1E AD BA 91 23 0A>)
(   3,<2007-10-01 13:07:52.48 +100>,<MAYBRIDGE\nmr>,<NMR_250MHZ>,
      <apk 
       data hash MD5: 32K
       23 5E 27 E4 A2 EA 82 88 DE A3 51 15 30 54 E1 30>)
(   4,<2007-10-01 13:07:53.35 +100>,<MAYBRIDGE\nmr>,<NMR_250MHZ>,
      <abs ABSG = 5 
       data hash MD5: 32K
       D4 93 B1 14 EA E6 B7 BE 18 23 D3 EB 75 F9 9D 0D>)
$$ ##END=
$$ 
$$ hash MD5
$$ 96 10 03 E8 0F 7C 16 32 6A EC E5 BA 4B F6 AC F2
##$RELAX= 
##$RELAX= 
##$RELAX= 
##$RELAX= 
##$RELAX= 
##$RELAX= 
##$RELAX= 
$$ Bruker specific parameters
$$ --------------------------
##$DU= <C:\u>
##$EXPNO= 60
##$NAME= <ADRS>
##$PROCNO= 1
##$TYPE= <nmr>
##$USER= <dgb>
##$AMP= (0..31)
100 100 100 100 100 100 100 100 100 100 100 100 100 100 100 100 100 100 
100 100 100 100 100 100 100 100 100 100 100 100 100 100 
##$AQSEQ= 0
##$AQ_mod= 3
##$AUNM= <au_zg>
##$AUTOPOS= <55 >
##$BF1= 250.13
##$BF2= 250.13
##$BF3= 250.13
##$BF4= 250.13
##$BF5= 500.13
##$BF6= 500.13
##$BF7= 500.13
##$BF8= 500.13
##$BYTORDA= 1
##$CFDGTYP= 0
##$CFRGTYP= 5
##$CHEMSTR= <none>
##$CNST= (0..31)
1 1 145 1 1 1 1 1 1 1 1 1 1 1 1 1 1 1 1 1 1 1 1 1 1 1 1 1 1 1 1 1 
##$CPDPRG= <>
##$CPDPRG1= <>
##$CPDPRG2= <>
##$CPDPRG3= <>
##$CPDPRG4= <mlev>
##$CPDPRG5= <mlev>
##$CPDPRG6= <mlev>
##$CPDPRG7= <mlev>
##$CPDPRG8= <mlev>
##$CPDPRGB= <>
##$CPDPRGT= <>
##$D= (0..31)
0 1 0 0 0 0 0 0 0 0.06 0 0 0 0 0 0 0.0002 0 0 0 0 0 0 0 0 0 0 0 0 0 0 
0 
##$DATE= 1191240453
##$DBL= (0..7)
120 120 120 120 120 120 120 120 
##$DBP= (0..7)
150 150 150 150 150 150 150 150 
##$DBP07= 0
##$DBPNAM0= <>
##$DBPNAM1= <>
##$DBPNAM2= <>
##$DBPNAM3= <>
$$ [...]
##$SUBNAM7= <"">
##$SUBNAM8= <"">
##$SUBNAM9= <"">
##$SW= 20.6930455092707
##$SWIBOX= (0..15)
0 0 3 0 0 0 0 0 0 0 0 0 0 0 0 0 
##$SW_h= 5175.983436853
##$TD= 65536
##$TD0= 1
##$TE= 297.16
##$TE2= 300
##$TE3= 300
##$TEG= 300
##$TL= (0..7)
0 120 120 120 120 120 120 120 
##$TP= (0..7)
150 150 150 150 150 150 150 150 
##$TP07= 0
##$TPNAME0= <>
##$TPNAME1= <>
##$TPNAME2= <>
##$TPNAME3= <>
##$TPNAME4= <>
##$TPNAME5= <>
##$TPNAME6= <>
##$TPNAME7= <>
##$TPOAL= (0..7)
0.5 0.5 0.5 0.5 0.5 0.5 0.5 0.5 
##$TPOFFS= (0..7)
0 0 0 0 0 0 0 0 
##$TUNHIN= 0
##$TUNHOUT= 0
##$TUNXOUT= 0
##$USERA1= <user>
##$USERA2= <user>
##$USERA3= <user>
##$USERA4= <user>
##$USERA5= <user>
##$V9= 5
##$VALIST= <valist>
##$VCLIST= <CCCCCCCCCCCCCCC>
##$VD= 0
##$VDLIST= <DDDDDDDDDDDDDDD>
##$VPLIST= <PPPPPPPPPPPPPPP>
##$VTLIST= <TTTTTTTTTTTTTTT>
##$WBST= 1024
##$WBSW= 4
##$XGAIN= (0..3)
0 0 0 0 
##$XL= 0
##$YL= 0
##$YMAX_a= 358542
##$YMIN_a= -487394
##$ZGOPTNS= <>
##$ZL1= 120
##$ZL2= 120
##$ZL3= 120
##$ZL4= 120
##$ABSF1= 16.522
##$ABSF2= -4.171173
##$ABSG= 5
##$ABSL= 3
##$ALPHA= 0
##$AQORDER= 0
##$ASSFAC= 0
##$ASSFACI= 0
##$ASSFACX= 0
##$ASSWID= 0
##$AUNMP= <proc_1d>
##$AZFE= 0.1
##$AZFW= 0.1
##$BCFW= 0
##$BC_mod= 0
##$BYTORDP= 0
##$COROFFS= 0
##$CY= 12.5
##$DATMOD= 1
##$DC= 0
##$DFILT= <>
##$DTYPP= 0
##$F1P= 14.0000005364418
##$F2P= -0.99999901652339
##$FCOR= 0.5
##$FTSIZE= 32768
##$FT_mod= 6
##$GAMMA= 0
##$GB= 0
##$INTBC= 1
##$INTSCL= 1
##$ISEN= 128
##$LB= 0.3
##$LEV0= 0
##$LPBIN= 0
##$MAXI= 10000
##$MC2= 0
##$MEAN= 0
##$ME_mod= 0
##$MI= 0
##$NCOEF= 0
##$NC_proc= -3
##$NLEV= 6
##$NOISF1= 0
##$NOISF2= 0
##$NSP= 0
##$NTH_PI= 0
##$NZP= 0
##$OFFSET= 16.522
##$PC= 1
##$PHC0= 154.4953
##$PHC1= 4.816174
##$PH_mod= 1
##$PKNL= yes
##$PPARMOD= 0
##$PSCAL= 4
##$PSIGN= 0
##$REVERSE= no
##$SF= 250.13
##$SI= 32768
##$SIGF1= 0
##$SIGF2= 0
##$SINO= 400
##$SIOLD= 32768
##$SREGLST= <1H.CDCl3>
##$SSB= 0
##$STSI= 32768
##$STSR= 0
##$SW_p= 5175.98343685301
##$SYMM= 0
##$S_DEV= 0
##$TDeff= 65536
##$TDoff= 0
##$TI= <Analysis number 999999
Compound Code 99
Book Reference 9
Project Code 9>
##$TILT= no
##$TM1= 0
##$TM2= 0
##$TOPLEV= 0
##$USERP1= <user>
##$USERP2= <user>
##$USERP3= <user>
##$USERP4= <user>
##$USERP5= <user>
##$WDW= 1
##$XDIM= 32768
##$YMAX_p= 471034709
##$YMIN_p= -127124
$$ End of Bruker specific parameters
$$ ---------------------------------
##NTUPLES= NMR SPECTRUM
##VAR_NAME=  FREQUENCY,     SPECTRUM/REAL,   SPECTRUM/IMAG
##SYMBOL=    X,             R,               I
##VAR_TYPE=  INDEPENDENT,   DEPENDENT,       DEPENDENT
##VAR_FORM=  AFFN,          ASDF,            ASDF
##VAR_DIM=   32768,         32768,           32768
##UNITS=     HZ,            ARBITRARY UNITS, ARBITRARY UNITS
##FACTOR=    0.157963299565203, 1,           1
##FIRST=     4132.6476996994, 0,             0
##LAST=      -1043.33573715361, 0,           0
##MIN=       -1043.33573715361, -127124,     0
##MAX=       4132.6476996994, 471034709,     0
$$ Real data points
##PAGE= N=1
##DATA TABLE= (X++(R..R)), XYDATA
$$ [...]
20455 -39046 -52465 -39904 -17706 -44 -18287 -15203 -10852 -17612 -14676 -5187 32348 28991 20064
20442 20064 4208 -2741 -16695 -685 -31703 -47542 -14124 -5756 -6667 -30797 -19689 -17831 -26048
20429 -26048 -33589 -27843 -16682 -20154 -38366 -37185 -14723 16656 -6419 -35323 -51450 -73068
20417 -73068 -48592 -11108 -231 -25641 -23172 -23985 -35669 -14254 -12880 6621 7871 -9251 -10637
20404 -10637 -29501 -58917 -27363 -1185 -1227 -8421 -39494 -27132 16890 13190 998 5004 -7564
20391 -7564 -36507 -41657 -53526 -65234 -65715 -63513 -54197 -43008 -34265 -48182 -36297 -19370 -19725
20378 -19725 -1218 11017 11877 -5635 -40397 -20909 -19317 -46175 -35609 -17566 -26161 -39552
20366 -39552 1968 52663 36684 18512 21491 8266 1655 9298 5792 33567 52704 17475
20354 17475 -16045 -26770 -21502 -6779 -14140 -13434 -10409 -39124 -29572 -27242 -62474 -50135 -20038
20341 -20038 -5953 9352 -9427 -35340 -31110 -40985 -63655 -59731 -27698 -19279 15832 20670 -11416
20328 -11416 -19221 -30212 -20932 -14614 -21180 -54094 -47347 -53567 -38176 -16572 -2518 12576 5882
20315 5882 -2166 13525 10015 4424 -4084 -4394 -5852 13782 34775 28004 29309 22518 6316 17436
20301 17436 12462 28075 -2030 4082 12843 22411 8321 3204 -3384 19813 38607 15391 -652
20288 -652 4287 -14294 -15900 -9163 -27064 -35 -19586 -48978 -17175 -20652 -30195 -20866 -6133
20275 -6133 -4512 -10184 -3720 -504 4142 -2651 -19861 -26605 -20974 -18927 -19998 -43949 -46564 -33539
20261 -33539 -26864 590 23663 31011 43639 38517 35521 19548 -6330 10918 41464 58347
20249 58347 55779 19331 19227 27281 47239 40387 5424 -3630 -3153 5961 23398 35993 25066
20236 25066 8806 22981 31810 26686 -15089 13521 34055 11156 10668 10486 7407 -10738 -4688
20223 -4688 -4400 1140 -8244 -38244 -39435 -53066 -19221 28773 33870 4302 7854 26299 31360
20210 31360 7508 -26684 -25164 -25081 -17192 -33930 -11351 -17733 -15992 -17769 447 -13919 -19679
20197 -19679 -13042 -6963 -19792 4433 24004 3410 -1700 -10968 -3589 4512 -4882 -2099 -20516
20184 -20516 -50723 -49899 -16384 -22817 -21198 -5282 -6430 -4618 -19839 -47559 -60397 -58981 -55877
20171 -55877 -27958 -9836 -1981 6803 -10167 -53681 -75217 -38820 -3855 21941 12216 10329
20159 10329 15516 18951 5673 -18890 -42226 -47169 -13188 -10090 -15035 -24239 -27766 -27555 -22614 -24460
20145 -24460 -26528 -23611 -12500 -6939 -8618 -6117 -12729 -10130 -26657 -26377 -16635 15529 19564 37066
20131 37066 8397 -10565 5306 -7207 -30580 -50351 -52329 -29848 -16139 -31467 -30544 -19761
20119 -19761 -17490 -22508 -16958 -31816 -35386 -26013 -7807 4477 -19205 -27139 -23866 -6307 33199
20106 33199 40660 33863 -4726 -28161 -17732 -22946 -13534 -1692 1241 -39182 -34574 -670 15139
20093 15139 -9143 -25715 -18130 -27235 -19261 -10434 -9081 -11540 -18790 -47398 -31086 -12799 -15511
20080 -15511 -40603 -47769 -41719 -48528 -32550 -2507 3090 1905 -15651 -32590 11773 24211 47281
20067 47281 57097 48144 12813 -7421 3298 -4855 -14270 -23582 -18634 -13777 -7574 -13543 -15875 -15853
20053 -15853 -2232 -1108 -296 -21179 -48834 -54416 -61797 -57339 -59813 -62132 -47534 -19591 -18332
20040 -18332 -6151 25039 30698 18577 -8739 -7503 -4872 -22690 2710 25678 20388 -3707
20028 -3707 -33937 -35888 -31950 -26890 -34486 -34104 -263 17151 20363 19867 21781 22015 29368 9423
20014 9423 -2561 14707 -11406 -34668 -28232 -35187 -19270 -18466 -29605 -29535 -23679 -18828 -33934 -29667
20000 -29667 -7291 -15853 1422 -3243 -1025 263 -11853 -17132 -37926 -89838 -111034 -75793 -24074
19987 -24074 5697 -7337 -40634 -33444 -40961 -48351 -34011 -27512 -35719 -37703 -35311 -36359 -6124
19974 -6124 3984 21872 52333 41939 23718 5859 -9713 -6624 -19147 -43284 -44561 -49255
19962 -49255 -31367 -22679 6130 20229 6472 -19661 -36875 -22103 160 -1724 -6975 10564
19950 10564 -8018 -25053 -50305 -70258 -69631 -64248 -55679 -52298 -54330 -59653 -34070 -30953 -17584
19937 -17584 -4196 -29254 -43760 -41690 -23679 -58773 -67561 -28614 -14395 5460 39869 42637
19925 42637 25293 14634 -14230 -22790 -7807 -31789 -27909 -14156 8276 16639 -17924 -24150
19913 -24150 -21408 -27711 -41007 -65192 -68992 -58442 -64370 -76488 -35810 -3642 -15133 -13184 -4544
19900 -4544 -18729 -5121 -7816 -611 -6414 -14271 -32469 -14164 21682 21227 11812 -10177 -35204
19887 -35204 -54120 -50732 -37726 -58056 -43051 -56870 -89486 -69701 -44646 -38343 -6330 -9883
19875 -9883 -22688 584 -21847 -32697 -29845 -18433 -15438 -4894 20924 6811 13412 26068
19863 26068 47640 24255 -14713 -37411 -32531 -12635 -3490 13026 16427 -4589 -10935 -16173 -23846
19850 -23846 -13017 -5497 -29724 -38857 -37707 -13892 7346 30428 31076 -7081 -18873 -8114 -8166
19837 -8166 -11765 -17610 -7237 18690 -5652 -39138 -37904 -25893 -19866 -1262 -8934 -41848 -46542
19824 -46542 -42736 -34248 -17344 -8234 -28397 -37399 -47618 -27793 31680 65738 29907 3230
19812 3230 19019 29633 16181 7221 -4509 -417 -37387 -78655 -69364 -53235 -51123 -13211 9531
19799 9531 15524 10740 -1878 -19675 -17216 -22906 -12954 -1266 37677 41115 26385 18815 2831
19786 2831 -21913 -25529 -35409 -32869 -14643 10204 -6578 -7033 -2528 -19805 -23592 -12933 -1697
19773 -1697 -16482 -43733 -34850 -10800 -16985 -35413 -65448 -51170 -21241 -26987 -24056 -39870 -52951
19760 -52951 -31389 -8439 -11577 -16966 -6419 -34779 -35665 -18683 -36302 -38716 -27444 -22430 -20542
19747 -20542 -2762 -15157 -24718 -28391 -41656 -40046 -14355 -20716 -39083 -38438 -20328 -29081 -46721
19734 -46721 -58696 -36155 1421 7953 4173 -7973 -18204 -19265 -24090 -35563 -45941 -35323
19722 -35323 -19766 468 13928 6742 6673 -6794 -25788 -30284 -7614 -44006 -49849 -15632 -20588
19709 -20588 -24712 -27424 -59034 -62931 -67535 -75153 -80293 -57033 -37374 -11500 1506 -37366 -46723
19696 -46723 -79859 -94704 -103699 -80457 -39683 -37851 -42118 16897 19344 -1657 -697 -2479 -35219
19683 -35219 -34809 -35474 -22283 -15604 4243 28734 7920 -679 9983 -7797 -25862 -17678 -31348
19670 -31348 -33688 -18114 -50151 -68647 -87013 -64674 -14290 4982 2860 -17050 -57593 -69359
19658 -69359 -49700 -1470 15058 5780 -4396 7972 -9071 -22205 -30600 -18395 -37844 -46553
19646 -46553 -40291 -25751 -16079 -19142 6140 14998 -11551 -45688 -36373 -12027 -14145 -33566 -34895
19633 -34895 -48496 -69570 -74808 -61100 -73398 -72732 -41136 -18015 14939 42316 20834 -10032
19621 -10032 2550 22600 19496 9464 16863 11466 3791 5101 -11177 -14210 -14585 -19776 -30857
19608 -30857 -29684 -45496 -65338 -4645 40400 42819 26911 237 -9095 -14567 -7702 -33770 -56108
19595 -56108 -60311 -23182 -7715 -1896 -11491 -46078 -69404 -58223 -32485 -11149 21058 30214
19583 30214 18272 36517 19271 11023 42299 52781 58585 60921 50231 42890 21734 21478 26131
19570 26131 38295 30976 45369 31280 14438 16984 -17499 -24633 -39215 -33778 -25392 -23548 -15415
19557 -15415 -9015 8146 17772 -10035 2332 10169 -767 -22605 -41142 -38224 -27028 9013
19545 9013 -6855 -28388 -34804 -6346 4585 38117 36415 -280 -30999 -19243 -18029 -35194
19533 -35194 -30529 -15647 -7849 -32637 -17232 -7995 3268 29403 24307 12581 -4649 -20797
19521 -20797 -21295 7427 15477 -5757 -18491 -48913 -50065 -35129 -19116 -1474 -31740 -36682 -17529
19508 -17529 -32775 -14223 12107 839 -34168 -58751 -86240 -93132 -68528 -39225 -25752 -43153
19496 -43153 -32385 -13714 -26581 -9748 -18873 -12073 -18547 -2976 23300 5565 -4611 1251
19484 1251 28796 8658 -12689 -34392 -27221 -5124 10662 17164 1824 -16355 -15125 -7678 -5227
19471 -5227 274 8374 1034 1407 135 -4703 -412 25237 60185 43920 32601 9254 -19919
19458 -19919 -18636 -11641 -29245 -28052 -20387 -24466 -4587 -8139 -18528 -9367 -2179 -7457 -2009 7388
19444 7388 2586 2020 -106 -23735 -17217 16536 14869 14746 -4751 -32646 -19799 -222 3482 15637
19430 15637 42559 28003 13839 18269 11264 28315 18012 2369 -8589 -35773 -62112 -76903
19418 -76903 -84805 -51546 -45870 -54117 -49865 -51073 -53269 -34614 -32893 -50533 -48747 -44619 -39054 -14514
19404 -14514 -6252 -9830 -47527 -61210 -19830 -13175 -10664 -12754 -14862 -13412 -2135 -10291 -10710 4026
19390 4026 -8971 -40815 -41291 -7029 41612 58307 28019 19411 -5801 -9482 20630 29367 -11796
19377 -11796 -27838 -32222 -39736 -21105 -43125 -64441 -33545 -51350 -62465 -29905 -12693 -17725
19365 -17725 -37068 -38350 -28141 -21651 -31604 8416 19534 -6396 -30144 -20570 -12201 -26717 -13599
19352 -13599 -7958 -8454 18544 35904 39837 27103 22135 36048 14252 19706 18706 3012 -1520
19339 -1520 2772 39213 62629 48219 34315 33633 12784 38174 38831 33960 -1589 -1449 26543
19326 26543 13578 18583 34795 27234 15165 2383 23480 9638 31809 10818 -10199 -12855
19314 -12855 -17688 -16081 -22964 -27556 6526 -247 -39673 -54123 -37614 -38836 -11733 -3524 -24802
19301 -24802 -25682 -21101 -13402 21226 34113 27677 17811 17229 6248 -34233 -67425 -35451 -4952
19288 -4952 -29469 -4077 3008 -21530 -26859 5537 8108 -17092 -29861 -23442 5096 22468 41355
19275 41355 68618 57365 54289 43716 33266 14990 27360 32057 23026 20341 9310 616 32658
19262 32658 50311 50725 36786 32800 -8514 -26736 -36274 -74618 -76542 -45830 -29576 -14380 -34482
19249 -34482 -66314 -80513 -72947 -40671 390 7180 1172 -13871 -863 2552 5586 -11513 -21173
19236 -21173 -17716 -19199 2934 -3121 -3548 21077 12192 -18602 -19480 6846 3437 -8184 -9177 -40092
19222 -40092 -55518 -67914 -52936 -41921 -17520 11996 38121 27462 -8619 10301 19340 33522
19210 33522 32669 4853 -7312 -5190 10552 -798 -18521 -9188 -18888 -50006 -57172 -45935 -39116
19197 -39116 -55334 -55218 -24904 -20998 -33338 -21003 1169 17925 6762 -13356 -14715 -35852
19185 -35852 -87877 -89164 -78588 -76276 -83980 -97400 -49170 -30368 -8522 24329 26169 6586
19173 6586 7788 -20637 -27981 -4810 6052 3935 -21249 -14059 -16688 -7749 -9013 -12687 -16338 -7013
19159 -7013 -20985 -18536 -3639 -10833 -11031 -2850 12171 33913 49310 67021 64967 39117 28654
19146 28654 19262 30853 25709 1568 -1268 -39680 -58454 -64729 -70592 -59928 -65595 -42125 -11061
19133 -11061 -33086 -50249 -39933 -25115 -35534 -6770 4566 14593 18536 13954 14934 -18006
19121 -18006 -46333 -21254 932 11556 -9488 -16098 -20521 -10117 -27772 -32517 -10151 -14840
19109 -14840 -28085 -26151 -6883 26975 43001 -4381 -31326 -62295 -52519 -30283 -25501 -9390
19097 -9390 6135 -11440 -19166 -28096 -38590 -21539 -12340 19532 20251 11723 -19666 -25857 -24863 -53472
19083 -53472 -62354 -42129 -12711 11504 -5046 -17275 -45759 -31227 -14062 -4686 2034 6177
19071 6177 17492 24389 9623 186 -9171 -12824 1604 -6757 428 -14328 -20764 -15244 -3433
19058 -3433 -39916 -39803 -30002 -61773 -49905 -15160 -6012 -64654 -72578 -84563 -40902 -1786 -2121
19045 -2121 -19679 -24842 -20544 -6568 9625 16201 4269 -4861 -29861 -27164 -19311 -18114 -26022
19032 -26022 -21853 -12799 -10563 -16981 -25310 -30041 -28818 -50292 -50281 -45012 -57317 -27107 11336 741
19018 741 -1406 3256 -5272 -17411 -4888 -18350 -42730 -65196 -73177 -53902 -52348 -70653 -47572
19005 -47572 -17617 -14914 -28047 -41402 -55474 -52387 -44039 -41695 -36807 -35526 -45642 -65097 -65937
18992 -65937 -56326 -65650 -79492 -45282 -18539 -27218 -29050 -16921 -24723 -36216 -28097 -32665 -47345
18979 -47345 -42451 -30861 -16681 -24149 -29810 -30432 -20776 -40757 -42031 -20649 1906 -12499 -30036
18966 -30036 -17571 -17406 -656 10320 20878 7461 -27933 -50580 -42223 2036 23014 4939
18954 4939 -9170 -20405 -7972 -6519 -40926 -52314 -23963 -9531 -25272 -55226 -74718 -76576
18942 -76576 -69115 -56126 -57148 -45297 -37257 -38052 -39114 -22023 1620 -14058 -37078 -23086 -21860
18929 -21860 -11962 2858 -18809 -21254 -8296 -5599 -19218 -11225 -16971 -61763 -65352 -60857 -75962
18916 -75962 -72729 -63811 -64433 -82094 -80514 -58362 -48915 -26758 -13736 -44123 -37701 -18224 9479
18903 9479 3875 -17626 -13495 -22438 -31819 -35045 -25126 -34301 -51162 -63386 -64001 -36618 -30038 -30407
18889 -30407 -40989 -61200 -57696 -35266 -9740 23137 16409 -9644 -29233 581 6100 -29286
18877 -29286 -39873 -29501 5960 15982 9038 23334 22087 -3887 -13238 -38117 -59858 -48192
18865 -48192 -40461 -67360 -89918 -70011 -36685 -33266 -72108 -42845 -447 3338 -23383 -45555
18853 -45555 -37974 -32740 -20121 -17112 -23298 -25051 3167 -5320 -37177 -32333 2702 3653 -1783 -20611
18839 -20611 -41680 -55891 -51142 -20846 -19999 -29936 -30771 -31256 -48592 -79898 -91817 -55070 -11803
18826 -11803 25487 19726 22362 4316 -15658 -20178 -38326 -53146 -48313 -31363 -13201 -28492
18814 -28492 -20202 -12583 8021 -5972 -4171 3619 -33948 -54788 -31737 -7528 2056 -20671 -49616
18801 -49616 -21879 14234 7178 -899 21084 39067 10344 -15490 -9532 -13466 -10130 4778 -10174
18788 -10174 -11910 13250 31290 30881 -8591 -28748 -27080 -37353 -41423 -50083 -49460 -45465 -54002 -62812
18774 -62812 -79569 -51132 3599 35359 78184 150206 224309 223036 171816 95548 55183 9456
18762 9456 -38739 -14559 12286 28811 60483 58868 45425 60188 73818 62020 40008 14587
18750 14587 1167 -18335 -23351 -34150 -39675 -33176 -9927 -14388 4984 5505 16214 20334 51039
18737 51039 54604 36156 45588 51315 32971 757 8134 -19753 -20446 -14351 700 3677 -13146
18724 -13146 -32154 -46623 -23776 -1803 -14734 -37404 -74667 -89280 -81455 -50810 -29814 -5950
18712 -5950 -35284 -45861 -15030 4987 -1682 -31232 -18822 -41341 -46951 -23337 -12175 -14154
18700 -14154 -1627 18309 10348 -34 -18119 3414 22040 21584 29675 20131 28369 32648 13292
18687 13292 18878 14917 25151 25696 21688 5659 -8918 7375 11329 18189 14262 -1869 -9953
18674 -9953 18641 29528 55546 58346 19631 -4361 5577 7372 -19021 -44655 -23857 8944
18662 8944 15195 4978 -10462 1298 8266 54 -1098 -1024 -24035 -18266 -6798 15590 36315
18649 36315 81215 161588 236237 319197 395419 449250 459208 434804 407091 350144 258141 186377
18637 186377 122945 80293 53752 18394 29953 43148 23545 29244 19182 -2599 -13299 5842
18625 5842 -595 -29230 -30635 7196 38450 34951 22281 2491 8609 5895 18518 -4783 17429
18612 17429 22637 20677 24626 2874 -16050 -22204 5199 25718 32024 27328 38426 20343 -8971
18599 -8971 -9363 9917 10683 51028 133005 199302 299070 375281 437426 460252 493092 472614 387881
18586 387881 308924 240736 162977 124942 75581 38546 5161 2078 -171 -594 4691 22460
18574 22460 69456 58919 29723 19211 21393 30254 15814 -4185 5661 34634 53582 26463
18562 26463 27063 20794 15249 8969 12481 -9318 -4172 17749 31252 14603 25698 53658 96444
18549 96444 149406 212798 329555 482904 639988 764019 891440 911796 837060 692201
18539 692201 523028 385176 279309 219064 157557 107849 107900 132326 90628 72612 82360 83647
18527 83647 76186 80882 66111 42175 68105 70738 50776 39730 2368 -2096 21238 20853 28320
18514 28320 36702 40507 9192 -22918 -29525 4068 415 -13806 -49765 -57399 -54848 -48854 -2675
18501 -2675 26284 17870 10810 29837 46378 24084 46988 52553 61330 53129 56865 32706 3845
18488 3845 3468 -3102 2304 29428 48285 44519 5345 15166 9592 -11334 7145 -12221 -8837
18475 -8837 -9027 -22138 -31877 -25266 -3126 -9566 4753 -1563 3379 1910 -8080 -30370 -39693 -26748
18461 -26748 10559 40495 16560 9228 33694 22955 11000 40992 43104 49512 77408 102939
18449 102939 100585 66507 10656 -16813 -30992 -18986 -17951 -28508 -11462 21361 48103 40671
18437 40671 73554 68923 51934 38029 27638 1725 -13143 -11813 -9655 -10082 6341 12391 20582
18424 20582 37930 45575 22885 17660 19136 23470 27963 15587 29859 49770 46608 47623 36229
18411 36229 27983 31588 3123 -59327 -75533 -65266 -48044 -6246 22380 22347 17782 10387 -5136
18398 -5136 -5565 7887 41786 34345 -9704 -44926 -36506 -49911 -26329 -22114 -4259 18103 20241
18385 20241 39685 33586 42324 73969 84312 73603 89299 68092 24599 -1854 -5401 -7953
18373 -7953 -4512 -1990 -12286 2805 6321 6662 11165 14894 48319 58089 25440 3158 24884
18360 24884 35879 -2645 -28884 -24101 -20439 -26114 -42395 -61233 -26742 -24028 -15115 2266 11395
18347 11395 13934 3716 -20075 -36782 -31756 -10346 16318 43919 45820 35405 29253 52578
18335 52578 43962 5913 -3995 13768 48169 78104 74768 86094 118903 99462 63162 38968
18323 38968 43353 53538 51066 73671 70988 78840 107195 80480 44119 13955 9252 21996 35547
18310 35547 42879 42304 19273 7562 10714 22074 -484 -15611 -6484 5178 17884 32614 67865
18297 67865 26422 18735 28315 41505 63945 52898 1239 -36597 -27887 -2224 11006 -2192
18285 -2192 34465 44173 -2949 -2920 25305 43663 28432 -8891 1894 -2806 10160 18891 23417
18272 23417 21494 42725 30443 26569 35355 28703 33838 40328 50893 43624 45860 44285 29058
18259 29058 4116 -24728 -17867 8787 13810 4186 10409 -395 -15777 3139 39957 49235 6390
18246 6390 -5243 -20924 -14399 -11418 -4631 18788 41885 22450 12800 30571 15 -21583 -6054
18233 -6054 29619 48622 47224 37133 6790 9876 14059 6354 2646 21217 38539 5313 -27707
18220 -27707 -28814 -37153 -24072 4692 21556 36120 26424 41150 42397 31971 27397 46509 53060
18207 53060 58408 13267 -1814 4672 2513 -4760 -7661 -2137 -18023 -12756 -10092 -16060 6848
18194 6848 32951 46736 30700 35696 47995 65687 51531 58554 89568 96947 84934 77897 66858
18181 66858 51043 55610 62016 53465 46005 64761 106510 143035 181393 169070 188686 217931
18169 217931 241060 254302 263624 276161 286865 327497 371809 435468 543230 679738 798940
18158 798940 866005 892064 929553 967068 959852 1004073 1098527 1207990 1344304 1528024 1673665
18147 1673665 1781870 1877178 1967498 2139843 2420030 2768515 3251701 3877670 4669264 5826447
18137 5826447 7575918 10387489 15120260 22848983 34208139 49295950 65622244 80536981
18129 80536981 90310272 91582937 85764212 73027860 58526668 44184123 32605031
18122 32605031 24069833 18227404 14359493 11834098 10204565 9226487 8829611 9077747
18114 9077747 10270528 13287599 20201663 33859496 49561032 53413359 47726331 35439787
18106 35439787 23769166 16705807 12501183 9835490 8047726 6778095 5843975 5129961
18098 5129961 4623340 4275720 4026462 3830718 3679889 3532629 3450319 3444181 3563911 3817013
18088 3817013 4172794 4683831 5373526 6329979 7788297 10182416 14211058 20930248 31314665
18079 31314665 45900856 63579601 80588196 94520300 99626228 96913451 85704940
18072 85704940 70339593 54229779 40028211 29238118 21498470 16229442 12666669
18065 12666669 10175812 8363862 6979511 5905133 5105074 4466486 3959415 3561257 3253654
18056 3253654 2964230 2708376 2490896 2242637 2012918 1885934 1797382 1768951 1760353 1726581
18046 1726581 1663151 1536395 1374539 1223463 1082505 945024 837160 759963 669842 635528
18036 635528 615819 622529 603131 566854 544260 516152 503242 479068 434273 435860 448912 446059
18024 446059 402532 344269 346319 369038 389066 362087 337750 323539 299604 300938 307951 301235
18012 301235 306826 328475 330123 328710 307219 283655 262863 296802 320510 321978 315823 301947
18000 301947 289504 250035 197058 210785 219160 211452 214067 224831 185512 149561 157628 157997 138234
17987 138234 163078 153903 149704 138860 127518 142033 157986 186649 182822 181719 170610 150960
17975 150960 130076 138771 144887 158107 163528 143736 124561 118237 111244 107850 97426 93038 102252
17962 102252 123497 151958 177644 185338 172767 146875 131411 124457 110381 118151 148156 157236
17950 157236 147819 129997 123850 136650 146656 114822 117585 100317 83109 72958 55521 46691
17938 46691 32366 29983 57633 51040 61091 66870 68228 67203 81695 88553 73296 52123 40183
17925 40183 39627 35718 42364 49151 39472 37865 45554 60191 47796 56417 37211 24918 47001
17912 47001 45068 38004 49784 28170 33182 64661 77264 52587 59374 92478 96415 77903 37448
17899 37448 43242 53641 54835 81685 100314 68091 31882 48725 66276 54610 37389 47998
17887 47998 42191 27861 39999 33177 74804 92660 71616 70631 52314 54660 50863 55868 52491
17874 52491 80051 94349 37317 24990 5315 12452 11805 9297 24688 42972 67704 74304 81214
17861 81214 74433 67401 76848 96648 90393 64880 57242 65686 48534 29225 35923 40188 33350
17848 33350 8943 29999 39017 53413 59692 51910 45656 56669 55746 60752 53367 2062 -14712
17835 -14712 2925 25925 27891 27568 9708 17080 52476 57450 72562 66789 8929 -40221 -26903
17822 -26903 -5258 6316 -8142 -2705 18938 44811 56024 20365 3121 30342 50805 37178
17810 37178 27182 34221 41903 39651 47108 55621 63548 54619 31347 25713 55714 73643 72144 46358
17796 46358 46996 59429 35852 53780 38080 33184 46380 69429 94595 72620 49642 26224
17784 26224 3885 7789 28007 27748 31726 32971 39129 18951 -7043 -15549 -16779 14484 13324
17771 13324 -17033 -1357 22788 26783 25616 33213 58862 41049 26179 56824 51218 56373 69556
17758 69556 54963 66263 77781 53520 22379 5139 -14705 9239 38223 46238 23358 15016
17746 15016 38900 76710 68519 38736 32587 15185 -7469 -36312 -53339 -46942 -20692 -9106
17734 -9106 24016 22835 6868 -16302 3370 12196 -11624 -13905 -5493 -1060 18606 30842 49204
17721 49204 37510 26713 42079 71109 70298 37038 66872 59853 13746 8072 12066 6405 29869
17708 29869 27508 27831 23841 34591 47135 56550 37277 38689 30623 38312 -5439 -34304 -19734
17695 -19734 6062 8891 313 -17738 -21473 -22293 -26882 -21825 -5399 7452 42272 46777 29807
17682 29807 42220 39825 54077 25414 16496 18593 22330 32349 37732 30163 23377 16199 -12367
17669 -12367 -14313 -5100 4264 17816 22009 14454 -10444 -16404 -15614 -18151 171 8633 18453 32780
17655 32780 47615 18971 -3781 -7848 -14352 -11128 -5254 24023 48946 53089 32762 19399 7588
17642 7588 5704 -2245 -25082 -18034 11418 18172 12099 -277 12312 8088 -6891 -21653 -5144
17629 -5144 23687 25070 22745 18812 42079 22216 17951 18019 21269 51170 60204 66501 59718 73555
17615 73555 119276 134844 193359 275283 335178 412890 465790 499143 479224 410220 349539 301907
17603 301907 237097 180837 142315 139555 128795 78801 45400 34541 13224 17154 5046 -307
17591 -307 19147 24951 50386 43216 25159 28118 36780 9330 -16134 719 28351 18464 32710
17578 32710 62967 75954 92040 97024 91726 40522 15820 30131 41795 44096 36693 6927
17566 6927 22802 28666 33519 50824 67623 88733 138132 198800 275550 357303 447833 505038
17554 505038 511496 477084 405752 343806 271657 214842 160264 118636 108905 101992 61221 47278
17542 47278 29954 21536 38413 44471 64554 76946 98457 127866 145475 171797 180164 223608
17530 223608 255604 287058 331691 352526 362847 386545 366800 314980 290337 256639 207091
17519 207091 167453 142856 151772 188196 192155 228229 281817 315574 324795 335401 359438 392670
17507 392670 364604 336162 316047 256773 236266 205851 177038 155748 128349 101133 74560
17496 74560 79174 58481 37691 63171 65478 53735 60086 79642 79537 39718 43489 41039 43200
17483 43200 44375 8137 18579 36709 12311 -3418 11015 27556 29658 9923 -18458 -14152
17471 -14152 -2830 -1543 11174 17954 22410 39713 46299 11546 -19635 -41644 -38301 -16552 -17533
17458 -17533 -33520 -20831 -20265 2210 10598 -3429 -7630 -19572 -9891 -9108 14313 46592 101108
17445 101108 170808 251839 277566 241559 197473 104990 44748 18290 4317 19142 2586
17434 2586 -5394 6125 -10003 -19643 -7276 -13555 -10084 -3212 -15655 -11647 22341 23613 43040
17421 43040 6029 -35109 -28119 21999 42106 20828 4200 24195 26119 6485 8677 -11529
17409 -11529 -20924 6433 16538 9805 22744 15750 -14821 -14320 -39294 -40771 11388 21955 -7748
17396 -7748 -44496 -32365 -21596 5044 17839 -7402 -2261 28747 62048 31884 -2145 -9719
17384 -9719 1093 -389 18964 15259 14180 4761 8766 2255 8646 33993 21092 12147 3163 24040
17370 24040 27111 4540 -8071 -27489 -15105 10219 20281 -2248 -13843 14700 25641 21631
17358 21631 -203 -23519 -7139 -11872 -42532 -21586 15670 28730 14994 29603 12915 -2000
17346 -2000 19141 58180 52599 23812 16216 13854 -712 3257 18862 11311 4039 -205 -6307
17333 -6307 7178 6588 5192 2165 2184 -6027 -2619 17997 23449 30151 44110 -2675 -13084 19975
17319 19975 38664 14266 15153 6305 11468 13294 7254 295 3263 23073 44294 70861 67111
17306 67111 35497 6870 10954 27369 66980 29963 -2649 -21247 -40773 -55003 -29855 -15696
17294 -15696 -11044 4597 15368 32518 23243 35483 68814 95937 82691 63227 71111 120158
17282 120158 146527 114013 126078 190553 234377 241086 246552 242666 229426 229886 223356 186060 130671
17269 130671 94169 100790 102684 117240 145252 153114 182571 224991 203221 208839 242093 265926
17257 265926 235951 201900 167999 156861 147765 117709 96293 46198 25715 44882 44299 53530
17245 53530 73613 74811 39136 -1659 -5821 -5120 23890 32786 43201 25241 41241 58008 60523
17232 60523 47234 60211 60734 69686 102547 123616 132632 144848 171869 204489 218940 206276
17220 206276 186647 198537 174307 143304 146068 133744 131543 130978 104334 103582 146033 172211 218409
17207 218409 232345 236823 256062 261929 242456 203440 134800 133449 134022 95352 58978 67543 69200
17194 69200 68462 50417 8569 -13758 18405 40527 44373 64161 58551 58034 53832 33051 43626
17181 43626 86849 92208 108328 93521 81262 61155 49535 41472 40131 36321 45099 39350 52402
17168 52402 75005 45360 39307 18855 11969 20314 47993 55100 55664 59968 82530 154168 252352
17155 252352 288337 316566 392760 522912 598595 588897 600282 608765 591213 592099 540280 473608
17143 473608 433178 382320 281858 216943 190791 142131 79952 53569 37750 8539 9083 50538
17131 50538 67077 81239 118594 118277 96370 110432 98074 73398 54996 66980 46396 54997
17119 54997 85271 94444 95539 88425 81942 87682 97323 85092 89193 76963 83367 86222 81979 73304
17105 73304 77392 90308 82028 132298 124762 114690 117190 98702 66032 40308 42584 42649 28150
17092 28150 40468 69362 100923 131624 144625 135909 109613 134050 193760 202527 226472 213293
17080 213293 203526 224932 237619 265287 310134 335571 358307 384141 438568 505208 557804 625764
17068 625764 679042 709355 786584 850201 904869 970705 1036712 1129348 1225270 1306021 1435906
17057 1435906 1601854 1802676 2008626 2263529 2540659 2826853 3178717 3614359 4183652
17048 4183652 4989423 6268269 8393570 11727713 16133280 21130237 26728307 33258595
17040 33258595 41418619 49407487 56199874 60217295 62266503 63819677 63809328 62202685
17032 62202685 57142320 50960132 44690440 39696908 36298441 34554518 34655940 36232559
17024 36232559 39546152 44793424 52485350 60357468 66884941 70457399 71896945 72860594
17016 72860594 71982900 69268931 62641277 54647365 46320572 38816495 31998543 25575347
17008 25575347 19891299 15235508 11872504 9535875 7893938 6682407 5816546 5106986
17000 5106986 4523441 4019301 3581465 3204753 2915126 2670042 2455238 2243273 2077063
16991 2077063 1974815 1880514 1746682 1623580 1546771 1491615 1406609 1277569 1184744 1111819
16981 1111819 1038752 954616 860854 801857 738621 682677 627899 593041 549737 561292 555050
16970 555050 522630 538325 542192 542216 567869 587830 575564 550223 549826 517907 502838 475026 445111
16957 445111 430817 399004 343339 344520 344596 322741 314814 315792 323949 298237 265752 248437 245484
16944 245484 254670 250695 214690 210244 221107 232411 249548 248322 197413 173417 189762 198477
16932 198477 199664 196117 196851 181701 186852 178053 171945 180812 164984 123045 148030 182613 212259
16919 212259 233293 218541 196305 204787 227648 271695 276037 280063 309288 291118 292454 301918
16907 301918 268750 258345 241488 228579 218137 214558 194745 144885 134783 136470 149488 139248
16895 139248 125573 134677 160684 156320 155631 118665 139236 164366 193438 219688 224325 187455
16883 187455 149189 138740 130550 124235 126363 121280 142717 147232 134796 107973 91678 60323
16871 60323 75291 112369 112396 101853 99951 48999 53878 100229 116012 109236 118398 102488 79293
16858 79293 24852 24957 62246 78862 93047 105592 109282 114167 107680 70378 61395 84204 119748
16845 119748 117092 87266 60589 75400 93928 88507 85312 81932 61364 62122 89367 71636 42075
16832 42075 42338 59288 56875 64899 71037 90864 114307 128172 108633 88476 104474 162856 215668
16819 215668 228026 259644 286043 305585 332670 362177 374371 372576 386617 422381 449299 433401
16807 433401 428657 454442 493258 531342 516168 525010 579868 644875 749969 870274 974695
16796 974695 1128744 1225600 1317251 1446576 1596619 1785930 2021614 2380041 2864889 3565200
16786 3565200 4683634 6530528 9525539 13593504 18056472 23387662 30207992 36494645
16778 36494645 40080155 42600717 44083298 43129294 39876870 35227044 29739214 24699289
16770 24699289 20375052 16740537 14296385 13475701 14385737 16713386 19695077 23554650
16762 23554650 28913093 33973375 36756670 38598474 39576600 38445025 35315972 30961739
16754 30961739 25798411 20943088 16677639 12855474 9831817 7705058 6226530 5227030
16746 5227030 4534169 4071097 3769740 3550497 3375338 3250048 3165004 3105668 3089467 3118980
16736 3118980 3211980 3419428 3849227 4599888 5870591 8028221 11345477 15323032 19691508
16727 19691508 25412774 31831782 36175362 38750880 40652578 40852190 38579594 34816182
16719 34816182 29863753 24902796 20610859 16919484 14057501 12629472 12792699 14483108
16711 14483108 17005426 20100430 24561247 29817542 33344588 35280752 36661272 36589458
16703 36589458 34303420 30742009 26050936 21260202 16996450 13223097 9997492 7598354
16695 7598354 5971007 4832844 4021149 3433195 2967335 2609903 2350618 2116616 1920830
16686 1920830 1742794 1587222 1415404 1302822 1207842 1125704 1032765 948523 896409 830690
16676 830690 824765 798709 785152 780974 756921 727103 693190 651136 595309 540029 498793 457351
16664 457351 440400 406302 392504 367024 354416 387806 386160 392218 367472 365975 358148 352751
16652 352751 337481 308470 298394 297589 264671 258688 232320 218156 209394 219827 232792 221935
16640 221935 193066 209413 222929 221215 224189 211075 188729 182225 187953 214487 196845 166672
16628 166672 167194 172832 160491 160740 159701 155397 164021 124553 127608 123402 118186 125078 133510 129546
16614 129546 143575 138279 126726 129273 142483 143943 149557 157247 155251 137596 102743 98730 101834
16601 101834 99719 105519 87404 89723 91097 111724 148250 145283 145784 157688 150763 120799 85448
16588 85448 79568 106646 140536 128159 130243 146735 170148 138128 127919 124191 112301 126467
16576 126467 110985 83384 75432 77400 89501 63739 74432 96142 93501 80129 71036 33620
16564 33620 29422 41558 66672 69542 94699 121082 95806 82904 80559 63042 43551 31816
16552 31816 49840 66538 84299 116582 149209 185307 199108 208932 255710 293356 330947 399334
16540 399334 449410 466665 491504 469766 451865 421130 374980 329039 332738 292297 251572 254448
16528 254448 256479 278962 293092 310153 359734 379851 377801 405446 417437 395329 373354 369627
16516 369627 342806 291380 272939 238069 182202 156735 108160 93170 92144 74576 56325 33277
16504 33277 32911 15804 -2368 28276 42650 32944 33696 51809 69677 69756 64122 63337 56180 55268
16490 55268 51565 41746 36210 12498 14803 45045 55134 61077 87854 70509 30090 38558 59873
16477 59873 47501 29556 25363 24706 12752 18464 43033 31478 20825 18148 10317 30776 19589
16464 19589 -505 -16581 -31335 -11098 8458 21933 9158 12635 15855 -21561 -48377 -11840
16452 -11840 27759 -5675 -2280 38819 35648 19182 164 37978 42151 44044 35364 7701 15594
16439 15594 18975 14135 -1379 14371 19609 12216 -4893 -8289 -8226 -4093 -18776 -10156 28192 55393
16425 55393 48828 22219 -3380 -4240 15924 -4418 -22884 -8091 -7365 -22335 -3502 -8026 -7291
16412 -7291 1382 -8777 -20397 -20614 6061 3155 11189 -14597 -22433 -10155 15916 34595 59429
16399 59429 75389 56677 55933 49365 19952 6168 24201 19679 9405 18902 15907 5944 -6065
16386 -6065 647 23999 28454 -9523 -895 38019 35993 11737 11025 19055 22522 36937 27111 17219
16372 17219 35442 37846 46090 26717 -506 -28743 -37726 -52770 -40689 -12158 12100 26386
16360 26386 8222 25448 25960 31421 19900 10935 23988 17321 -3715 -20096 -13462 -2666 -5004
16347 -5004 -26551 1976 45903 89482 114776 71531 39474 25767 -3143 -39514 -36419 11388
16335 11388 -7258 -21040 5605 -6829 -7228 -13043 -22422 -17980 -9441 28317 57436 48938 39059
16322 39059 26890 33502 28515 16252 32308 51690 40291 57516 62012 69429 63368 75471 48033
16309 48033 38011 14308 -6870 -5987 22584 56897 89383 83564 37066 36621 53851 35719 25559
16296 25559 36252 65601 49154 47881 24899 9274 21144 30891 39269 29591 49504 51731 44879
16283 44879 35326 54424 50769 40220 24701 61694 103107 138546 176143 183359 172425 181290
16271 181290 194252 217864 224470 185261 164288 177589 145939 122304 84132 74337 92167 105378
16259 105378 117509 134927 164343 179926 210444 222305 230296 206841 195134 197009 159657 144187
16247 144187 140894 115324 87632 42638 54828 68666 84480 61128 58584 53856 19950 18263
16235 18263 3733 -13085 -20685 -28661 -25274 -17896 -955 20589 81301 112186 114423 93269 116633
16222 116633 152233 169401 191161 191256 226953 219516 208771 214776 192466 154608 130707 99233
16210 99233 89115 61962 56369 74032 97310 114850 89911 93696 121610 168669 201379 204419
16198 204419 209935 181116 146144 102410 62763 39354 29101 18065 -10988 -22346 -18468 -15417
16186 -15417 7543 19937 -10984 -5963 -14414 -22281 -37700 -1244 24451 21068 6977 -14437
16174 -14437 -17754 -908 -2797 12703 21679 10913 -4741 11874 24002 -937 -24984 -44529
16162 -44529 -55901 -42730 -62061 -83061 -60723 -33213 -12288 30785 44461 21999 1601 18931
16150 18931 28634 56674 32159 10775 9017 15417 -6171 -5184 11333 21456 32750 39213 41409
16137 41409 20290 14421 6656 2268 -24328 -27823 -8651 -16347 -32710 -47930 -34010 -11185 -10540
16124 -10540 8821 21374 -5862 -23023 -19033 -19864 -19536 -22398 -26914 17188 23652 1388 10159
16111 10159 9218 6392 -14531 9445 29961 46782 44083 36271 28548 11419 -38053 -15165 12669
16098 12669 -259 -21119 -30995 -18557 8713 26367 1642 -18962 -8615 -8340 348 -4417 -11974
16085 -11974 1708 -28954 -43333 -43164 -36815 -35710 -38635 -43938 -18653 27106 24416 6861 20484
16072 20484 24318 42033 17629 -2249 21254 2687 -33528 -3780 -14530 -22503 -28310 -34801
16060 -34801 -32036 -31978 -39201 -23373 -14639 -875 13047 18454 13524 -7421 73 -6211 -13109 -3607
16046 -3607 -42943 -30364 -33603 -24971 -13889 -11144 -42984 -51983 -14581 8587 24494 13985 11312
16033 11312 -21758 -23688 5074 10191 -3971 -24587 -37282 -35463 716 -14338 -8534 -10014 -7599
16020 -7599 -40254 -37445 -21030 -3901 19028 12675 -16750 -46760 -42586 -12536 -34051 -29132 -2707
16007 -2707 -543 4458 -1834 -734 4272 19174 10602 -7737 -9365 2067 -6572 -3483 5961 23060
15993 23060 -8573 -8037 17588 3486 -9446 -22070 -9749 7485 19892 19721 13622 9151 12918
15980 12918 28612 64376 51556 46003 25654 -3913 -14298 -25687 -29691 -30092 -15086 22507
15968 22507 41171 17945 -4222 -15589 -5982 1881 17140 23957 33537 11714 -13785 -41023
15956 -41023 -23848 -943 -18078 -7574 9935 2958 6407 -15169 6149 8682 -26190 -28932
15944 -28932 -12703 -11265 4842 73917 98239 71604 17263 -31136 -41211 -11779 -2195 -17601
15932 -17601 -39730 -49255 -26523 -10534 -10291 -167 21234 20364 23636 28609 19883 34307 41526
15919 41526 43104 34064 12885 5954 -5419 -2200 16585 14119 13324 2208 5176 31006 39904
15906 39904 40825 24999 16450 14036 706 -16131 -42199 -43704 -21819 -7824 -9845 -3846 -4146
15893 -4146 -12715 -18211 -31428 -41125 -27146 -27931 -30997 -49179 -31576 1734 7924 4315 6312 -3547
15879 -3547 -33444 -45584 -41954 -36342 -18260 12306 -3366 12716 16402 33567 44232 22324
15867 22324 -966 9373 11730 8507 8305 39444 41679 56847 54758 64307 27208 -26066 -49638
15854 -49638 -44971 -30474 -20919 -23825 -1598 10818 7193 -6163 -12430 -21687 -39160 -30129 -10259
15841 -10259 -19824 -25539 -35471 -37846 -38243 -37984 -22229 1298 4373 8540 26492 40957 27933 35897
15827 35897 23354 -21136 -13261 -7004 -10833 -4826 16005 19195 4113 -861 24358 24080 44387
15814 44387 58860 59246 32160 11577 2166 23347 25593 21464 8504 -3766 -5661 8011 11721
15801 11721 -12809 -12085 -24438 -19296 648 14018 24466 -3040 -37506 -42793 -9945 -22272
15789 -22272 -30262 -51155 -58989 -64782 -59083 -57627 -27944 1466 9779 797 -23447 -27024 -6204
15776 -6204 29803 49641 24735 -8412 -8225 38068 49208 33380 64035 73659 81196 30700 772
15763 772 11068 3511 -21706 -21363 7834 9153 5600 -11668 -6737 -23445 -48781 -33397 -25635
15750 -25635 -12005 -3647 1732 1392 -2112 -16325 -32824 -65564 -84160 -75089 -47383 -21376 -29202
15737 -29202 -47658 -52072 -49157 -67270 -55799 -32470 -8847 10566 4011 -2002 -28614 -39362
15725 -39362 -34597 -27980 -14645 -21495 -13080 -6066 -12917 -8363 18229 16618 8198 -9306 3613
15712 3613 14417 26580 23863 3191 -19414 -22277 -34197 -13745 1990 -12870 -5280 1283 -2215
15699 -2215 6979 3093 -6024 -10267 -28191 -38503 -52643 -30886 -26390 -25879 -4234 -17156 -25259
15686 -25259 -26865 -9640 17737 47664 20201 -7386 -26225 -13698 9329 10652 9931 -11934
15674 -11934 -37454 -30267 -22749 -7523 -17021 -21347 -20935 -37946 -47077 -46167 -23533 -17461 -20206 5856
15660 5856 27914 42762 26944 18191 9870 24602 43305 33487 6897 -20667 -22660 -26643 11208
15647 11208 32939 31700 13860 2330 12646 19284 -13995 -28982 -24296 -3526 4654 26281
15635 26281 5939 -7452 13629 22977 22311 51713 30662 6219 -22805 -34735 -25085 -8858
15623 -8858 -25981 -18594 -26992 -23053 -14547 11373 23392 23464 12527 -6227 -9841 4060 22040
15610 22040 33822 3312 3992 38194 42686 28079 38993 33265 33607 30873 41384 28532 -12997
15597 -12997 -24935 -32143 -23910 -15624 -4689 4865 13941 -15243 -29463 -5127 41547 23161 -19625
15584 -19625 -16284 -7367 9989 -2062 -17347 -6601 3057 13823 6244 -35356 -78209 -74781 -76860
15571 -76860 -89927 -34592 3948 27999 12338 -5786 -23331 -27546 5957 24699 20986 8505
15559 8505 4057 20131 46251 30255 24539 20273 24945 7634 -11740 -11891 14638 4912 -30692
15546 -30692 -2592 23500 15040 11651 18682 31343 7479 -9259 -18769 -19228 -42395 -40841 -12711
15533 -12711 9612 3413 -1460 -15493 -13296 -14175 -14321 -38779 -49378 19319 39776 24155 1522
15520 1522 1666 16318 -19168 -15012 14042 20614 3054 -34336 -43852 -29809 11112 16756 -15228
15507 -15228 -3316 11058 -726 -25441 -49650 -7323 13892 1617 -21372 -577 31982 34150
15495 34150 34948 38225 16563 -319 -12286 -3864 15152 15112 -11786 -51168 -38364 -23490 -23809
15482 -23809 -17994 -24799 -16916 -18551 -20983 -5229 -2656 -14358 2020 -3153 -33375 337 7292
15469 7292 1823 15436 4525 -15967 -24972 -12742 2630 4030 -18714 -20090 -18258 -31909 -18719
15456 -18719 -693 -6196 -19630 -22531 -46071 -46739 -35528 -15712 -26548 -30058 -24904 -32421 -17384
15443 -17384 113 -6214 13197 -6095 -17891 -20051 -10205 18020 2652 3060 21952 41772 50516
15430 50516 33743 -28773 -66482 -62481 1320 40859 55049 23121 -6565 17 -1955 -42160
15418 -42160 -48509 -52014 -39025 -23734 -12788 2477 -14974 -37556 -44501 -40646 -19434 -5106
15406 -5106 1938 -19816 -11099 7408 19438 32751 50722 24249 -4948 -32120 -10065 -25645
15394 -25645 -37266 -10860 -10484 11746 35843 36428 35661 16755 16698 15802 -2429 -2971 37257 33363
15380 33363 21597 5943 -10919 -11535 -30949 -52192 -31480 -4249 1731 -9785 -20681 -6543
15368 -6543 27263 13617 26474 33428 15232 -7900 -6310 8794 -1384 14062 11181 27887
15356 27887 32714 51065 27997 26518 19194 20993 6112 878 15306 34000 74281 58047 59256
15343 59256 89687 94552 45165 30486 39310 31135 23959 28123 35653 27769 19305 13926 11632 13605
15329 13605 8519 4937 4434 -4560 -10826 7260 8982 -5307 -15324 2117 1257 -4203 -1164 18169
15315 18169 -3754 -19964 -856 10659 8387 -11611 -22958 -22618 5176 19916 9954 16216 -1484
15302 -1484 8983 -8884 -24184 -17154 -19314 -20530 -41027 -61509 -34817 1450 35704 51850
15290 51850 22469 -11249 -32342 -30237 -20561 -6835 19773 -19027 -17086 17107 4299 -21175
15278 -21175 -32565 -29459 -19816 -20034 -12315 -9935 -18993 -2856 6028 2151 15247 3113 -10611
15265 -10611 -23873 -26497 29203 16296 -2327 -3564 -34696 -29453 -19605 -9327 -4506 -5903 2711
15252 2711 -21876 -3010 19060 5931 -8003 -27235 -23482 -4031 8386 23950 36888 4989
15240 4989 -12069 -29767 -32668 -23376 -15118 26618 2852 -42300 -26798 -13699 12831 31662
15228 31662 924 -22125 -44056 -36247 -48402 -58285 -48984 -39217 -55764 -89231 -83095 -61551 -45842
15215 -45842 -36672 -42054 -25769 -31770 -69360 -70435 -82259 -73284 -55699 -19606 -9963 -19423 -29777
15202 -29777 -30675 -29874 -41284 -35364 -28792 -25179 -39342 -25395 -25803 -50417 -69185 -34613 -16794
15189 -16794 -34785 -13251 -15349 -21879 -19468 -38779 -17866 -7867 12588 28423 7560 -4958
15177 -4958 23301 57389 30330 13327 34439 77203 78639 64055 36509 1721 -752 3436
15165 3436 -23 5113 1647 -270 -5270 2851 -14542 -26931 -10018 25183 17901 -7452 -32416
15152 -32416 -32023 -50192 -57809 -38493 -34560 -8583 7148 5526 -12761 -32410 -8555 5157 -19491
15139 -19491 -21247 6115 9797 2481 14398 5174 -17735 19016 19242 -9783 -58146 -49330 -12421
15126 -12421 -5605 928 -22006 -51772 -42070 -16651 -8110 92 -14183 -21971 -29729 -47962 -56823
15113 -56823 -54096 -53443 -46560 -26772 -16545 -25407 -49176 -8350 34909 54419 37877 11295 7160
15100 7160 12487 9367 6479 -1320 -31962 -28125 -24983 -33273 -21814 -19487 -38274 -59210 -91085
15087 -91085 -87249 -71487 -36700 -21318 -27214 -48262 -37862 -46256 -50891 -27480 -2175 8590
15075 8590 14441 21496 6787 7755 -12051 -16373 -27354 -25330 -1607 16973 -14265 -35233 -17281
15062 -17281 -9292 265 -15035 -504 19308 9656 -2178 -5739 -28593 -54617 -32020 18874
15050 18874 11539 -14663 -11752 -15196 -8265 -926 1967 13224 -5491 -11114 1211 20504 8323
15037 8323 -19124 -32800 -20244 -28462 -28622 -30434 2538 35801 57708 56059 27949 10225 -27357
15024 -27357 -31079 -18589 -18025 5706 23161 11362 9901 19567 29085 33499 19056 18274 27700 43469
15010 43469 50184 60863 96651 240149 444692 572106 567938 486738 323766 206546 149127
14999 149127 126457 114741 87647 75813 65344 41709 13839 -12413 -24418 -44235 -59718
14988 -59718 -40812 -4116 7802 -4710 -13137 -10722 7531 20417 11246 -11546 -24026 7094
14976 7094 3557 22072 35765 14954 -17390 -3585 17797 6122 42798 58671 58882 39444
14964 39444 2325 -10261 13429 25817 14575 31288 8478 1737 -21476 -2784 17670 16621
14952 16621 -2400 -5800 13131 3257 -16999 -18463 10283 -2545 -5633 -13029 -15501 -9317 -19250
14939 -19250 -24075 -9104 -7756 4812 23734 11859 11450 27522 30760 30669 36864 -7483 -33948
14926 -33948 -23939 -16852 -14736 -26988 -24487 -36194 -32844 -44011 -60033 -53889 -43884 -30606 -28412
14913 -28412 -25994 -14007 -2293 13896 -3796 -25554 -13401 661 10362 13844 9024 14489 31802
14900 31802 22515 20541 13762 18112 -2284 -27180 -45603 -31907 -36009 -11610 -11567 -11782 2972 18304
14886 18304 27895 -7781 -15813 -21884 -12100 -21489 -54130 -43732 -22506 -37983 -31319 -19618 -12233
14873 -12233 -34346 4866 30675 24703 3788 6921 -304 -7279 -6581 5422 7756 6577 5396
14860 5396 -3472 -23491 -16831 19338 28337 25573 17886 29715 33457 8603 29458 37788 12724
14847 12724 931 -15503 -6945 19676 43756 53846 35687 4548 -21301 -30415 -23395 -9742
14835 -9742 -130 1577 -17782 -49204 -47750 -30789 -34620 -47882 -54358 -49658 -43178 -46423 -82438
14822 -82438 -67124 -43829 -42985 -54858 -39007 -46597 -29709 -36356 -37561 -31641 -10110 -21996 -58816
14809 -58816 -86939 -85989 -74368 -61487 -35705 -34941 -26588 2036 16149 42221 49981 27908 3988
14796 3988 1825 1634 -7119 15833 48673 37182 44443 31783 18039 27558 33070 -1460 -46077
14783 -46077 -18406 -13898 -11728 -11788 -8629 -28756 -24041 -45000 -27306 11291 30824 9041 -1030
14770 -1030 11935 22781 -5251 -44867 -39592 -22608 12970 26942 8377 -16262 -8382 303
14758 303 -6016 -16676 -2341 3628 4450 4935 -9503 -9922 -16482 6570 -13624 -24801 -32983 -19204
14744 -19204 15675 15342 20094 8953 7783 -21479 -39935 -39833 -25048 -14028 2782 36720 33933
14731 33933 -1317 -28368 -8672 10644 -18773 -34038 -27989 -32668 -13188 -14705 -31248 -11588
14719 -11588 -36880 -57672 -41418 -5602 4894 -16696 -13534 -15632 -27688 -25500 -31495 -41896
14707 -41896 -45151 -44556 -44097 -41773 -26845 -50867 -32380 -9403 -7688 -21058 -28147 -15683 -34684
14694 -34684 -42782 -34319 -9525 -1702 5110 6150 10379 30269 32298 32293 41064 24626 -12603 -21664
14680 -21664 -3066 -8896 -40127 -63487 -96123 -64273 -33944 -39288 -36927 -35030 -28113 -27245 -17350
14667 -17350 -41391 -48591 -37893 -8065 21575 11219 6479 -2317 19257 13635 -11652 -37859
14655 -37859 -36766 -51577 -31542 -13480 8614 6714 12283 2611 -83 5357 -2540 -12167 -5104
14642 -5104 -28835 -49477 -47160 -29988 -23801 -28820 -42817 -42660 -32401 -42143 -49278 -45069 -19146
14629 -19146 -24371 -20211 -5747 -3584 -20491 -28347 -40394 -37785 -6729 -9861 -1958 19650 706
14616 706 2475 -3810 9521 21628 19705 -325 6476 -18570 -40633 3683 22846 -13418 -21312
14603 -21312 10310 5922 -22657 -21725 17163 40310 22751 12548 5492 -449 2715 6643 -12211
14590 -12211 -18388 -5553 -9987 -18792 -13760 -22043 -2805 -19262 3493 12193 -3996 -33375 -27222
14577 -27222 -24695 -20727 -7989 9434 33685 4826 6382 30342 31207 9144 -13719 -6957 -15451
14564 -15451 -20821 -34711 -43928 -50503 -27756 -186 -9577 -16866 -21739 -13363 -21026 -7164 7324
14551 7324 13960 -15569 -37012 -15846 3132 32014 28033 5587 4229 -1288 4306 -12867 4381
14538 4381 3041 13788 27657 21446 2740 -32754 -32590 -14772 9380 -15158 -25940 -26509 -45259
14525 -45259 -45902 -39122 -54823 -35019 -29829 -4942 8174 21617 38921 22365 -2611 -12698
14513 -12698 -21567 -24325 -18632 -46594 -50103 -27376 -7941 -6407 1135 -9701 -14002 -26241 -35871
14500 -35871 -7301 16606 35229 15274 18705 14244 4885 14652 -3738 -11482 -17387 -13780 -33156
14487 -33156 -31041 10708 17691 13335 -2546 -21018 -11469 -19744 -21567 -35292 -28891 -10884 -13956
14474 -13956 -27211 -28072 -47985 -58059 -46848 -33045 -9475 -23520 -43527 -34235 -21160 -17151
14462 -17151 -2656 2363 1661 -22611 -28427 -13699 -23038 -35016 -48933 -78531 -73295 -61936 -40685
14449 -40685 -27349 -36861 -31496 -24393 -27304 -24331 -10272 16704 41598 66235 42275 4064 8117
14436 8117 21558 26184 4328 -12709 -27518 -34366 -36688 -32511 -28754 -9502 9281 26329 8
14423 8 1381 -13215 -15364 -14169 17487 27581 24512 8017 658 -15511 -5993 -2332 -19429 -30004
14409 -30004 -37850 -12376 25263 23993 7785 -2793 -24608 -15561 -43626 -40317 -35471 -28428 -21992
14396 -21992 -44712 -91494 -74456 -41272 -34515 4924 7977 -11588 -10077 -36067 -24045 -10564
14384 -10564 -26432 -34763 -27142 -21292 -25259 -36112 -13605 4892 6402 -9352 -3659 -15037 -50704
14371 -50704 -42823 -21915 -10558 -33434 -34893 -15862 -11615 5211 17529 -5979 -23333 -12704
14359 -12704 12805 11255 16829 21543 24364 24454 43185 -252 -25292 -2002 14651 18042 6081
14346 6081 -20233 -28652 -21041 -12238 855 4831 -8480 436 -3742 -5705 14665 12811 18253 19105
14332 19105 23161 26546 19191 -1747 -35639 -48285 -51589 -43202 -29635 665 -10274 -16470 -13405
14319 -13405 -12615 74 15091 -4535 -25487 -29693 -34873 -41682 -32320 -16308 -27344 -38357 -14227
14306 -14227 -5039 19677 30003 44087 28661 24301 26706 13048 11098 24695 14261 -6826
14294 -6826 -16975 -6624 -24335 -58706 -37364 -38354 -50807 -32802 -28069 -31341 -45665 -66137 -48700
14281 -48700 -38392 -22307 -15438 -16608 30451 55085 35260 10301 5912 875 14316 13589 -15783
14268 -15783 -19679 -16263 5051 -1712 -29357 -20690 -16872 -21391 -30363 -22967 -9546 -14037 -25231
14255 -25231 -17102 -16247 -4962 -639 3121 8431 25509 19260 -22601 -43293 -45215 -27877 -30823
14242 -30823 -25084 -13351 -10236 -22536 -19374 -3633 -4678 -3002 -34475 -13021 -7521 18296 12299
14229 12299 -11865 -6481 33322 48470 33463 35298 31649 7210 29331 46488 36704 13182
14217 13182 -26523 -27540 6815 3070 21136 29834 30445 48869 45373 29820 13903 8200 29890
14204 29890 18019 5976 15490 12205 -8590 -11765 9942 18574 30384 6399 -12617 -14945 -8587
14191 -8587 5508 28585 -10678 -5655 -17576 -24489 -19511 -5454 14756 -12905 -36386 -45490 -17243
14178 -17243 3107 27334 36199 21786 34096 20937 -28340 -42373 -31177 -49114 -71828 -51059
14166 -51059 -9877 -3678 28127 38402 12834 -21828 -45932 -37040 -30638 -42624 -33413 24651
14154 24651 16831 2469 9941 16793 19171 20658 8338 -5088 -12725 -21537 -40827 -51784 -28365
14141 -28365 -5545 31460 39413 48700 46096 34653 19193 20688 35983 42362 14845 -7268 9528
14128 9528 12300 17140 3227 -14083 999 6532 17103 10973 4356 6608 10609 9363 12451 5004
14114 5004 -11328 -12160 -14139 -8595 -3860 -6039 5822 -1028 -1259 5954 -17559 -8779 -12490 -38232
14100 -38232 -70751 -48359 -42692 -30054 4685 2140 30793 32329 -31151 -34800 -11041 -10969 -27464
14087 -27464 -54516 -76481 -52430 -36338 -31035 -25439 -56272 -62324 -29858 -30203 -51723 -42271 -48706
14074 -48706 -78906 -68062 -31928 -26924 -14700 -28901 -13247 -5087 -12127 -34350 -10006 1912
14062 1912 1309 -4440 -22400 -4872 -2319 -25016 -58728 -78853 -44529 -12561 -1819 19265 28202
14049 28202 14505 -11478 9181 11305 4388 -11351 -10586 511 27567 10708 36474 57211
14037 57211 30287 14718 17318 40690 30469 26026 -6864 -29101 -29749 -34634 -24670 -6254 17122
14024 17122 212 -18122 14651 13302 -2622 7770 1869 -3745 -13710 -16728 -17016 -17292 -24642 -16548
14010 -16548 -15758 -14738 -7974 421 6128 -6169 -43280 -49968 -35685 -2018 9533 17570 27603
13997 27603 15175 23959 4125 -30028 -23437 -25222 -31171 -24785 -28230 -21519 8903 15502 7198
13984 7198 1284 10468 26056 10519 -25414 -12208 13553 32925 13276 16497 28697 -10656
13972 -10656 -36690 -19584 -24806 -10180 1630 18951 14711 31900 51347 39335 -1377 7105
13960 7105 9911 -1002 -15297 -9738 11839 -20795 -47237 -34908 -18215 -28693 -46501 -33759
13948 -33759 -49101 -23815 1369 -6058 -14634 4321 33992 35999 36035 2316 -38362 -34094 -30216
13935 -30216 -2506 23079 2954 6367 10615 -19717 -26071 -15011 -9531 -17145 -17133 -15668 -26664
13922 -26664 -1260 19787 -7297 1738 -9277 -26081 -25693 -40452 -33330 -1654 17022 36248
13910 36248 25192 3448 -25846 -29556 -46241 -54970 -49611 -24593 -14893 7764 -2381 -22290
13898 -22290 -27715 -2072 4308 -6598 -21767 -30419 -45498 -51215 -35071 -12192 12315 15351 -5392
13885 -5392 1763 54355 57111 16654 856 -29243 -38927 -32559 -9333 14322 36869 38168 40586
13872 40586 10846 -12844 -21419 -45082 -34063 -15441 -38155 -58321 -44113 -22442 -49701 -54668
13860 -54668 -60512 -22050 -15466 -33669 -40909 -30004 -27644 -19222 -21951 -24195 -13422 7625 3007
13847 3007 799 -1996 13228 -946 6244 -9249 -23382 -8250 -2030 29961 51467 60135 42142
13834 42142 3097 -6283 -18318 -20235 -18020 -16483 2986 15999 11454 7375 7460 -8486 -6217 -6016
13820 -6016 -20521 -19185 -44872 -47777 -35221 -18269 24155 5138 -24048 -12540 19463 10906
13808 10906 -1976 -1449 -1688 -38415 -55380 -49412 -37853 -6585 7293 12251 -371 -26153 -33558
13795 -33558 -27383 -41079 -25902 -35778 -69278 -59008 -50137 -43365 -3548 -4619 -5307 -7080 -11330
13782 -11330 -5282 27749 32798 18308 2646 -6163 -13446 3397 -23792 -31879 -15141 -34078 -17932
13769 -17932 7161 -30758 -10783 -32117 -31988 868 28568 -4029 -39442 -35436 -35489 -23991 -12031
13756 -12031 -15845 -6552 -3102 -9896 -9325 1984 -7931 22370 19816 -16372 -41188 -25338 4228
13743 4228 -7994 6420 -8845 -12398 -7170 -21795 -12776 -7192 -439 -9543 -277 6551 7158 39593
13729 39593 47539 37504 29410 20279 -17076 -49785 -39801 3699 24253 24552 9896 4669 10470
13716 10470 2671 -1697 -14952 -29158 -13818 -9894 -1178 -9488 9220 -2943 -28925 -13602 16261
13703 16261 38396 58313 62829 22051 5105 1427 2426 -4237 -39957 -47783 -62844 -39040 -4875
13690 -4875 -14526 11048 6197 7471 14645 3364 -22263 -29909 -20475 -35654 -19757 20376 35015
13677 35015 44396 31498 6943 8233 29771 47127 21718 -13022 -34227 -24586 4670 -5071
13665 -5071 -27181 14493 44697 51078 14943 8288 11983 16853 10208 18134 16874 9904 -17349
13652 -17349 -28860 -35055 -34078 -29875 -38785 -27319 -21803 -35261 -29020 -7991 3889 -13699 -19962
13639 -19962 2407 4665 1525 1531 -1442 -14894 -13979 1715 18051 17793 3893 -2491 30666 21584
13625 21584 7345 32384 55699 51172 50591 44375 16175 6436 30332 38832 7841 15205 27110
13612 27110 -25250 -39747 -15393 -17553 -6620 5760 -15549 -30394 -37988 -14245 -8984 -11202
13600 -11202 -2101 -12324 -31158 -13625 -2592 -18443 -16521 -16970 -11168 14307 22075 19321 35077
13587 35077 18231 3432 1941 9751 11470 -16621 -41133 -35058 -33875 -11068 -14681 -17421 -12328
13574 -12328 -31316 -21129 -2054 15950 9282 23404 54086 65838 63805 75591 52313 33268
13562 33268 10453 -1952 -22190 2786 20690 12863 -32715 -58272 -50141 -12544 3027 6054
13550 6054 -7084 8317 46621 56572 56934 45066 12583 21446 -7276 -18865 -12943 -6947 -36523
13537 -36523 -56813 -27402 -8207 -29304 -3170 25961 26621 32898 14744 12039 15071 13970 2487
13524 2487 -6861 6619 5524 -6325 33095 41607 8102 -22515 -18058 14614 44198 55412 52687
13511 52687 16483 -18748 18085 28494 7609 11220 42493 53651 52304 33221 47754 44224
13499 44224 10609 513 3483 12514 21474 35461 26193 6428 5761 -12063 9295 19355 40448
13486 40448 50814 39558 33717 47718 40141 37556 29697 20026 6109 17906 23094 25896 26155
13473 26155 23932 5878 4166 -4953 -38 2201 5666 28258 42529 22127 24104 27669 75304
13460 75304 74286 6291 -44789 -44435 -9059 -9985 -7320 2918 17632 33556 53775 50613 33390
13447 33390 29564 22255 47108 59285 57266 20998 -5855 -32549 -41253 -28656 -11105 11925
13435 11925 31533 39099 42113 54433 63825 54331 33934 57821 70768 45949 20664 -35663
13423 -35663 -34213 -1063 -1146 853 3334 10570 -5697 11404 25661 10476 41419 57346 36009
13410 36009 60464 70391 60500 45351 38453 6613 -13806 -674 7880 27096 28350 1701 21704
13397 21704 29926 11635 9610 19217 24605 33589 41298 20190 15380 36726 37994 18081 11129
13384 11129 33600 48925 36676 24553 11495 18169 20543 48251 75252 59268 35634 14174
13372 14174 26025 43068 42137 48995 45540 32084 22680 7920 7122 971 -4004 7091 15181 10655
13358 10655 14807 6817 9966 18186 27616 7742 -5951 17008 14005 31890 59439 66839 65639
13345 65639 57536 37903 29156 32887 23713 4688 3683 15162 20475 53966 68966 50628 49060
13332 49060 40665 43867 53776 52630 13925 14256 5423 16736 -4569 5645 -9456 2259 6493
13319 6493 12350 54056 77377 87941 95236 116316 103064 46464 15955 40893 17404 14461
13307 14461 24647 21944 26427 42088 43810 37289 39005 9342 14463 30295 29664 32146 55147
13294 55147 62856 77217 86122 74313 57180 46020 78886 81893 74385 67807 67840 58877 45337
13281 45337 48511 50903 46985 49554 40107 48777 68014 74403 64453 83031 62279 54985 67040
13268 67040 33941 4786 12045 2641 -6793 26875 54408 21925 -30301 -58495 -49187 -30993
13256 -30993 -47798 -41852 -27986 -10504 5901 20693 -4772 -9361 25476 29462 31330 31108 39303
13243 39303 34612 30108 27547 44136 30277 9229 29292 46025 76275 58634 29515 28418
13231 28418 53131 80771 51409 25825 41058 31235 3475 -15320 -1447 27814 26362 35112
13219 35112 45593 35910 34882 59939 79466 63625 57708 63156 67142 65260 42703 30371 15514
13206 15514 24348 45114 20785 20207 24269 1703 -6337 13903 36145 59942 62060 36686 31995
13193 31995 45624 68137 49522 31398 37282 48944 73775 80519 68101 48517 22471 23753
13181 23753 24574 20569 11042 6641 -9246 -10514 7571 8259 9190 18480 34775 46608 26753 13327
13167 13327 10036 15354 29417 29820 22851 19396 27777 57716 52051 29293 28597 26353 23508 21936
13153 21936 17421 30071 47654 36581 25964 41578 54693 72267 71202 91551 110459 80338
13141 80338 83912 86443 94300 94444 104558 100392 93644 91639 96421 101583 60882 8714 -42234 -37219
13127 -37219 12619 40925 67638 109356 126380 104960 77332 58513 69210 82751 73810 75711
13115 75711 100305 94716 82846 108676 95910 65420 60334 41673 61342 58487 40857 62880
13103 62880 58920 69889 73638 81320 51443 47171 69099 89787 101476 101547 113688 121141 83429
13090 83429 85912 103339 125099 132507 124911 102841 106941 89722 64147 71678 78494 60109 76961
13077 76961 64018 36620 41911 39018 38588 53371 82259 65585 41391 51649 59256 58916 84166
13064 84166 57083 39428 56959 89984 98593 84423 75042 90297 90536 99974 97844 87852 99747
13051 99747 132900 112778 69778 86773 91312 76544 79883 80130 69931 48947 64906 49626
13039 49626 45385 64094 54579 61743 93547 115556 119007 73169 43223 76242 64060 43379
13027 43379 44309 45295 52940 39067 48916 82300 97821 140552 150945 134419 148560 138441 144312
13014 144312 125378 106299 118693 123136 120516 122300 104586 102673 99576 44913 31577 57497
13002 57497 62143 78887 114079 132258 162024 178990 162382 151065 124602 91869 79902 88530
12990 88530 104185 100298 68584 58469 69195 76749 102266 104996 67485 64908 76201 81946 118824
12977 118824 114431 119224 133329 154676 144301 140609 150742 115782 102858 106167 109578 79994
12965 79994 86045 122864 134251 134384 132488 101516 88175 83816 84868 89313 91199 82693 108441
12952 108441 124212 131878 166109 154813 123727 131109 116914 85523 67369 91734 112833 95853
12940 95853 95508 108400 118521 86381 79916 90326 132018 158270 156535 143608 131669 146909
12928 146909 188709 187201 149587 160099 161638 146953 151921 140786 135122 135492 152086 147467 106405
12915 106405 104850 144361 146464 93731 87018 87571 74815 83557 111872 124690 128089 130585 114882
12902 114882 160967 162126 157258 150472 193337 215535 180914 172953 163263 162704 170413 162016 137623
12889 137623 110685 81046 57172 65792 103344 130036 145491 168072 164288 134306 116664 97751
12877 97751 98493 100004 127403 126747 116995 144626 171639 155630 157854 154883 153680 159890 154908 160111
12863 160111 159878 189320 190254 197753 194644 185005 167265 170221 176696 181516 167330 146974 155778 151019
12849 151019 144312 148033 173959 179890 196072 201314 191078 184960 170117 156041 146967 149940 175660
12836 175660 179068 210052 208503 189149 173242 148506 135813 153710 175875 200125 195172 202134
12824 202134 191024 202325 206225 207624 207653 204091 183042 177760 194164 202613 175059 195531 231535
12811 231535 236038 234941 250920 261832 280632 262655 238939 222320 235591 233354 245266 231748
12799 231748 197317 198304 226212 241667 269898 286678 283082 270097 241610 255981 276410 254900
12787 254900 254150 265485 238776 212109 212470 215878 254745 264679 288283 254655 220758 202045 188806
12774 188806 190708 215201 244355 240242 233080 215193 214168 224915 211327 244429 260935 259026
12762 259026 243000 223816 239131 267345 260589 275109 249192 251132 244622 266842 310206 328552
12750 328552 317684 295649 291270 284225 291372 291606 282284 302577 320990 330072 334663 318162 309760
12737 309760 331874 339428 340449 331512 321065 334249 322422 317053 310453 316586 299959 272962 272365
12724 272365 306276 323500 323732 340968 347192 367432 375034 387138 360427 323943 310383 331684
12712 331684 317939 307889 330674 376926 389927 374923 370246 360705 356955 353063 359689 358772 388689
12699 388689 412117 374902 346684 363949 380782 366669 363452 372035 398203 426396 404732 391468
12687 391468 396246 395425 385755 395323 428056 447874 424342 402170 418417 428921 426766 420286 433591
12674 433591 436635 445082 442883 436395 440497 425361 435203 403789 413798 424264 442310 430562 438124
12661 438124 446890 429933 431494 447459 472297 455664 438556 454586 461907 445549 466370 519095
12649 519095 560289 555065 558279 555845 540693 529731 516916 504350 497355 489915 499062 502734 521259
12636 521259 541618 533494 524505 515615 501488 505199 542515 545156 515399 542714 541886 562574 568276
12623 568276 562819 571208 564411 550797 533075 537887 548029 542483 555223 564344 568407 583563 602955
12610 602955 602050 584181 573241 590118 605517 613566 646611 637802 626693 645229 662502 674248
12598 674248 672110 685716 691830 688700 662865 652728 651345 660051 685350 720341 751734 771318
12586 771318 764495 743800 727155 727917 715098 710255 721473 755736 771922 801278 790203 782300
12574 782300 783661 795758 780499 802863 825893 824645 805995 781859 806834 821798 835012 846125
12562 846125 838045 817358 818380 839288 867643 870955 856922 855925 874443 880459 896371 918797 911436
12549 911436 870669 899781 928115 947463 982219 999921 981288 971807 972182 936456 930720 970625
12537 970625 1002991 1002711 1011202 1040188 1042968 1036299 1046883 1044039 1047912 1055224 1046282 1062997 1078106
12524 1078106 1121450 1152540 1142076 1124281 1116086 1141377 1158273 1158792 1158038 1144788 1159345 1193625
12512 1193625 1214147 1228882 1216586 1249386 1234498 1234848 1263673 1257497 1269553 1305376 1344160 1367788
12500 1367788 1354637 1343376 1340105 1363557 1380889 1406558 1431253 1439574 1426376 1438402 1456957 1484716
12488 1484716 1484993 1511192 1508886 1505249 1510992 1514386 1518877 1561040 1584777 1596307 1601667 1608833 1638437
12475 1638437 1672875 1709004 1722926 1747688 1762677 1775630 1783673 1792686 1775137 1804908 1790055 1797254
12463 1797254 1841761 1846963 1851665 1873509 1913620 1942888 1959379 1994073 2018834 2051796 2065662 2060777
12451 2060777 2078171 2085072 2122492 2163591 2138630 2173583 2223946 2210203 2215114 2243543 2291943 2348737
12439 2348737 2398160 2444837 2474478 2500118 2526749 2528285 2545997 2580343 2623758 2649912 2660694
12428 2660694 2678093 2714946 2770283 2799976 2803004 2815362 2870079 2915470 2940695 3005544 3040926
12417 3040926 3063917 3093137 3129043 3155556 3193327 3249189 3266160 3294928 3356114 3409662 3472204
12406 3472204 3516239 3533380 3568822 3607058 3642570 3712961 3778059 3847195 3924735 3963577 3966720
12395 3966720 4006353 4077840 4155332 4200396 4237200 4296551 4363994 4411520 4475309 4557766 4642790
12384 4642790 4702674 4781262 4840037 4907019 4973960 5000388 5073492 5172694 5252082 5331386 5414908
12373 5414908 5474420 5544180 5665235 5768798 5857007 5922727 6013368 6121545 6195124 6279054 6380890
12362 6380890 6495527 6587993 6672286 6801792 6913240 7023177 7128596 7249201 7361190 7477815
12352 7477815 7607431 7734874 7870313 8023649 8167250 8318891 8446807 8600452 8758930
12343 8758930 8881260 9049116 9195894 9329953 9481199 9668046 9867314 10067403 10263183
12334 10263183 10459161 10611243 10804407 10992112 11178337 11346305 11539618 11744912 11940213
12325 11940213 12146868 12380300 12601204 12813987 13023171 13239946 13520999 13770797 13970789
12316 13970789 14200553 14456494 14726797 14979156 15225973 15503367 15764635 16029517 16318880
12307 16318880 16601801 16845199 17108357 17336547 17572115 17841593 18087283 18331198 18618774
12298 18618774 18923914 19226711 19479567 19748527 19995581 20246215 20487302 20700945 20957884
12289 20957884 21220440 21445485 21636485 21840895 22070242 22272952 22467946 22637497 22770094
12280 22770094 22886332 23017089 23169748 23300819 23396011 23457423 23525588 23568947 23607126 23639938
12270 23639938 23686360 23702238 23687591 23660402 23625570 23558117 23498748 23417026 23343950 23254281 23138871
12259 23138871 22992166 22833161 22666374 22535539 22418744 22256023 22049059 21835061 21596693
12250 21596693 21364567 21178948 20971445 20729798 20498973 20289276 20033022 19759150 19491953
12241 19491953 19221718 18999976 18770394 18529913 18277020 18038744 17763828 17492958 17240105
12232 17240105 16956868 16690245 16454715 16191201 15926448 15660036 15417903 15178311 14918924
12223 14918924 14644608 14418089 14194794 13949254 13709394 13475032 13307011 13137123 12900246
12214 12900246 12659048 12438471 12233972 12075732 11848550 11653515 11450010 11249954 11051681
12205 11051681 10849749 10656663 10513470 10346157 10155964 10015709 9833580 9657510 9515497
12196 9515497 9391513 9229461 9051942 8904527 8747729 8603155 8468425 8340330 8244631 8146708
12186 8146708 8015447 7888002 7741730 7614942 7514983 7407762 7293736 7215477 7100333 6990831
12176 6990831 6865736 6724521 6618617 6526383 6468580 6400980 6292270 6184824 6090114 5991736
12166 5991736 5884799 5803407 5745803 5655618 5567502 5486182 5423406 5360886 5302217 5237318 5151083
12155 5151083 5053910 4984762 4918242 4853833 4797600 4733085 4660579 4598811 4536639 4498653 4447717
12144 4447717 4405262 4357953 4302176 4231614 4188655 4148728 4104067 4038481 3977485 3933407 3877701
12133 3877701 3833254 3800548 3745803 3687663 3614864 3542263 3514569 3492366 3465450 3429668 3402926
12122 3402926 3372867 3321200 3259767 3210511 3195059 3186282 3156061 3126869 3051282 3000982 2988407
12111 2988407 2957050 2906547 2887269 2854049 2820322 2790065 2779460 2739373 2730496 2724323 2706037 2661865
12099 2661865 2626107 2620095 2611952 2592553 2570823 2536756 2500879 2461126 2416341 2412917 2367169 2301857
12087 2301857 2289636 2261173 2215942 2182443 2200627 2204088 2176083 2157360 2141206 2133966 2110804 2081642
12075 2081642 2057607 2039857 2023998 2013912 2003305 1982827 1933648 1897278 1892786 1887801 1863397 1864833
12063 1864833 1832993 1819688 1799896 1766226 1750150 1748579 1734639 1730399 1705545 1701249 1730358 1707827
12051 1707827 1684610 1653854 1598406 1581142 1579905 1554863 1522122 1522390 1524342 1526671 1533476 1539904 1542324
12038 1542324 1540204 1525921 1519464 1481066 1477269 1446601 1399896 1395971 1428295 1435816 1409649 1378398
12026 1378398 1366730 1346363 1322379 1332057 1333716 1347495 1322543 1291794 1277720 1258595 1261962 1274597
12014 1274597 1261367 1204559 1180189 1175484 1174170 1168590 1175725 1168835 1142411 1120182 1123438 1144324
12002 1144324 1153727 1158562 1148795 1180735 1164982 1133949 1093485 1061414 1078612 1097852 1092409 1066496
11990 1066496 1033600 1004591 986065 988683 1012563 1041399 1059558 1019682 1014477 1015038 1028699 1045854
11978 1045854 1023143 989129 979175 976247 977200 969785 961736 940925 940464 911926 903189 899018 904732
11965 904732 912288 902559 861570 834075 825197 842616 832119 815146 825100 830048 830177 824869 818028
11952 818028 817051 798599 805867 800486 788800 770492 768657 775590 795329 805417 824913 815498 788132
11939 788132 757087 757509 772160 769950 771156 734020 732644 724110 719563 703634 693363 689636 696956
11926 696956 704969 718366 720842 715378 710655 682966 643675 629988 643359 631885 640662 651605
11914 651605 664773 662943 654957 668658 669688 675732 665794 669444 697948 689642 661474 648383 631515
11901 631515 619791 582894 598792 612325 611968 625899 624897 582229 578079 597532 632696 637880
11889 637880 601149 595588 592434 602707 572368 552046 574066 571107 559793 559049 593842 596115 572395
11876 572395 564792 568260 513498 491912 514421 525648 520318 503145 532836 569335 568998 565900 567784
11863 567784 547830 510372 513151 511217 513818 511248 532035 520748 511708 511509 506938 506460 516262 523253
11849 523253 548057 537234 529721 503176 467031 463730 456979 450140 461228 486872 520358 531670
11837 531670 493791 481951 456987 407995 419060 412283 436101 464293 449655 465221 479262 486768
11825 486768 458815 469563 444872 411563 402764 398915 407441 422167 430074 419428 426776 444065
11813 444065 442078 428724 419527 393111 392850 419248 396736 418227 430455 411786 406752 402668 360001
11800 360001 340591 354782 368863 391432 418743 392449 357733 389167 396529 366431 344746 347904
11788 347904 352411 325272 314740 317260 292194 277109 305625 345793 371560 361718 333805 302316
11776 302316 294526 317850 315206 295748 305059 314898 299313 292707 311968 354803 387601 385440 382631
11763 382631 356979 305452 284396 278620 280980 334983 358514 351539 359281 380088 376959 370190 358615
11750 358615 343257 336847 303631 287248 320437 338361 325263 308594 271286 251733 270074 289147
11738 289147 298245 302944 319564 321252 317844 319621 303024 298039 304014 306006 290093 239786 231599
11725 231599 254377 269929 289846 296378 267771 273979 300664 303098 297116 310326 316955 295387
11713 295387 288669 290719 300368 306586 298480 299028 277229 281817 265347 272515 264322 254433 255565 258763
11699 258763 271283 304947 293981 287605 298877 283002 265811 227911 219413 212637 222571 242274
11687 242274 244695 255902 272130 261362 257969 236763 218932 217349 207647 215189 222947 197101 202249
11674 202249 225903 203776 159375 153179 176173 236822 262986 257050 222596 198335 243500 241595
11662 241595 224978 229134 215677 216919 229015 230378 226522 209738 215948 212882 191238 198348 220174
11649 220174 209676 215204 211014 233292 219639 201400 172279 179119 208569 207890 193781 188645 250300
11636 250300 290849 254657 231428 228224 216884 194386 201814 209613 187352 164038 154495 171565
11624 171565 187449 197877 174927 157412 174135 183116 176920 171656 170605 160086 172631 183668
11612 183668 192914 182971 194064 221242 209709 178878 178930 200888 204005 203655 212440 195200 159486
11599 159486 175729 175105 192263 233209 221143 183596 146060 160552 171870 194267 197362 160393
11587 160393 156564 179117 182251 191801 209897 211352 222889 237844 233676 237001 206643 210617 185581
11574 185581 189931 189966 206695 196439 187188 178790 188075 208816 206969 204456 184986 156831 166513
11561 166513 151535 153066 141579 132854 148099 143035 145500 171887 202320 193245 180869 179367 192790
11548 192790 213460 201787 175822 177375 185162 175299 161819 142946 127185 142300 149328 170862
11536 170862 196332 189602 154463 155967 163817 141425 138540 157941 150804 148301 162131 191082 164651
11523 164651 147766 130622 130210 163026 176775 178907 178735 151930 151042 136176 123527 146385 175679
11510 175679 181458 167644 162691 174395 184730 172556 161634 160561 169589 186401 159571 121200
11498 121200 119069 124568 137875 144029 160299 163117 140113 95443 70072 80719 81640 138207 155950
11485 155950 133187 92774 91911 82687 89305 100015 121904 129943 121740 117166 146744 172472 166309
11472 166309 165085 165848 136556 110166 118027 106989 138795 140367 113414 107691 120444 107027 109813
11459 109813 102200 93809 98271 83341 134788 134824 113015 125052 135269 145912 141744 117873 102436
11446 102436 94400 142658 134711 102349 84835 72898 77468 88125 98224 118764 139323 152678
11434 152678 172206 154615 133872 137221 101547 84365 100674 129979 130195 117199 112338 107632
11422 107632 103546 88771 77999 99798 111908 92607 89874 118277 119814 115450 88432 80366
11410 80366 89749 84532 78230 80706 83374 96875 92193 86547 105996 84391 71421 87308 67970
11397 67970 86511 101069 86076 58515 71566 115840 98420 65052 77628 97009 79957 74530
11385 74530 92061 115044 130088 126208 106232 109182 99478 103194 110999 109290 98756 51813 46216
11372 46216 56056 71256 59910 59956 103320 125060 107624 97234 111489 132078 112773 90218
11360 90218 94429 117292 143285 125451 97591 98921 104559 80968 72288 91227 85789 88593 76167
11347 76167 66408 59232 82771 105304 105458 100898 103618 133069 131488 110400 108206 112973 105675 92379
11333 92379 109139 115156 111734 101734 105115 116679 117620 102420 94736 102208 118312 132248 142279
11320 142279 136323 116435 114109 106753 90872 84481 92928 100825 100837 104866 125309 115743 119237 117513
11306 117513 94540 45688 11073 29463 40012 30658 49748 77698 89010 71987 96801 71392
11294 71392 60786 48086 62268 92082 96067 64402 49570 70228 80795 76814 75391 80732
11282 80732 81404 109626 97419 95252 103352 118381 99306 120062 109652 105372 102915 77397 77507
11269 77507 72456 59025 38629 47487 62515 81860 116769 98884 101251 98903 79257 72444 79633
11256 79633 67272 34850 13478 20140 9715 33490 82581 64004 31869 12908 37263 69982
11244 69982 73950 51607 54446 102098 100870 110596 99367 101743 96043 78742 83237 72613 68736
11231 68736 65320 89108 104098 111083 92480 82441 69600 73535 67816 40801 34274 43847 48433
11218 48433 53210 68240 49604 37326 14899 19994 46996 62162 63244 36662 49863 64806
11206 64806 82311 96331 104650 73157 60324 93822 109627 100757 83133 100330 129661 148814
11194 148814 134685 131463 132844 112859 89462 101566 84387 62014 56760 57904 69695 80704
11182 80704 50096 56471 55785 60298 70615 62698 43543 32548 41688 60293 59835 66051 58630 78722
11168 78722 89736 53712 52068 78542 99059 96695 85347 80016 89939 91561 70847 70544 91995
11155 91995 110138 96204 116663 118552 59790 20270 49819 48562 21995 39200 17269 15938
11143 15938 24442 51693 43047 48661 52121 42144 32294 50200 57943 29925 15430 49922 72669
11130 72669 60611 33090 41663 56521 54159 44461 61607 56549 27249 43287 46143 36896 39313
11117 39313 50448 58934 69910 66970 67354 49497 49099 49166 44008 31015 67674 71744 77595 79796
11103 79796 67882 56198 63797 54594 71026 56327 20976 32041 44535 21079 24564 21395
11091 21395 22687 19131 24182 58621 47791 32126 5235 31270 31870 26453 73511 66916 27172
11078 27172 -19585 -2597 20691 -25686 -8033 40073 71879 69758 71049 85544 61216 53470
11066 53470 59172 43625 46779 65997 54566 42428 32555 36804 57397 69983 70079 61130 9749
11053 9749 10425 39099 64643 81736 88025 95072 74316 60832 83350 108250 71849 45791 56633
11040 56633 87344 71168 54209 48186 31944 50466 59193 61133 56065 51681 89113 51053 37355
11027 37355 62594 64179 56294 25434 24995 49831 45607 41137 39090 25476 33369 18932 36
11014 36 -4395 2189 11960 59612 71063 71853 67223 49667 62037 58612 40553 59560 78533 48505
11000 48505 16331 -6229 -15771 9161 23702 39678 26466 11058 22791 14104 -6107 49
10988 49 4199 -19283 -17050 -15908 3017 -15948 -20945 -20666 -3409 9703 16084 24481 33670 20490
10974 20490 21317 20018 38953 64644 52511 26542 26463 42321 16796 -2050 13323 11507 -1947
10961 -1947 13191 21704 34088 32222 -3641 -13998 9628 25866 50328 48686 27813 18432 35137
10948 35137 49826 67845 57040 44954 1761 -4296 1994 -1072 -11134 -3961 -4494 -22426 -41873
10935 -41873 -13207 26504 38146 35978 24835 11444 14918 36592 48489 75795 89599 76366
10923 76366 71499 62114 68869 76530 83546 69506 67476 64924 74567 61446 29101 33350 48746
10910 48746 45301 35932 55171 90658 67028 70172 66814 98345 87987 74955 73840 75573 56571
10897 56571 23825 -24053 -33412 -14601 18633 56406 43335 39164 36512 32345 44432 61677
10885 61677 44460 36046 61920 61846 56987 36047 13712 31144 25484 19148 -2759 -1455 -799 -6528
10871 -6528 -8320 -3201 14433 40633 43321 46198 42963 48234 71472 93067 101992 69219 44817
10858 44817 24768 20414 11256 29399 43615 33515 34867 33576 46829 70266 61580 60983 45063
10845 45063 62902 90122 86339 72399 77858 63275 25180 4794 -20597 15965 46157 64480
10833 64480 88770 94483 70491 77491 85166 59610 49090 75744 97095 105997 100906 79893 66397
10820 66397 66580 96611 94118 71124 76957 108597 142076 125069 81422 65202 59096 50484 52916
10807 52916 91011 72530 56737 47622 78363 88744 62250 51753 92710 83854 67311 62398
10795 62398 57546 58902 57668 48708 40024 70496 76413 76898 88215 61344 49198 35861 35702 15395
10781 15395 10810 40320 29571 4172 -11166 2063 27091 45473 40376 25599 37044 50703
10769 50703 61935 48289 35268 35139 43491 64587 97149 106809 98806 46427 23176 28390 12946
10756 12946 26936 56978 53975 66698 61634 76583 72961 59355 40797 7419 -9218 -9437 15434
10743 15434 21713 33983 14346 14369 18864 42279 61753 59714 49636 65224 69927 47361 35920
10730 35920 52858 43038 42990 62189 82640 87031 71814 41124 29101 54196 68200 45457 40230
10717 40230 41198 58862 78833 69132 66504 63799 75356 89543 66959 80122 77002 52076 46204
10704 46204 65651 64329 74386 100875 73143 56358 74679 95486 79625 94287 107362 97556
10692 97556 95619 92529 101477 85291 75758 79893 87447 82408 49541 54827 54741 58818 64158 79579
10678 79579 101012 81396 76626 82569 90342 125536 128636 134623 150756 178749 169915 169013 205293
10665 205293 255089 298475 356251 491287 715572 1014197 1365756 1740839 2069121 2389013
10655 2389013 2597202 2698439 2679597 2568275 2426352 2301140 2133812 1940475 1779015 1612916
10645 1612916 1448741 1245713 1029461 825533 644196 506278 394694 346470 302031 259194
10635 259194 240448 212843 207996 181312 164010 150776 170611 174104 163491 134488 114198 90194
10623 90194 81103 70695 55476 40616 34199 45009 61529 70729 64731 46919 77368 78434 91175
10610 91175 96723 131975 124610 79326 78856 79961 72147 41778 64240 105982 121483 127785 123371
10597 123371 114715 85180 63182 51907 38011 35184 46865 58893 93404 99772 83911 81189
10585 81189 71493 85107 120510 131203 120911 108893 131747 116916 100980 126822 136809 169253
10573 169253 173053 127948 125480 142672 128556 123370 119119 106094 68993 73264 105886 98579 85105
10560 85105 87867 80508 70180 67293 71187 131108 147568 173032 180053 180601 139821 94721 99947
10547 99947 110327 114649 110360 106625 126323 99197 86859 82469 63261 52793 35941 54993
10535 54993 54974 62197 80100 77294 69361 78206 98233 115666 108925 122331 113930 100004 125234
10522 125234 143331 157492 165805 147704 143861 139361 124759 103612 92963 148994 192632 222776
10510 222776 261796 332197 355924 389942 434620 425729 406896 391059 350602 299178 238997 220442
10498 220442 221767 184200 150954 131755 157570 173849 174950 171017 154314 124274 120937 100133
10486 100133 107815 135510 133281 136225 133681 142200 125613 108008 78589 67176 95474 122135
10474 122135 88096 65102 104852 130834 148097 130457 128081 141552 174058 176753 180851 183109
10462 183109 180281 197388 224398 250131 251807 255893 272293 278406 302077 323453 331174 324647 292522
10449 292522 272124 246332 247720 278225 297938 271978 275640 244997 259285 238752 196004 192240
10437 192240 175823 178191 197927 204276 218279 239432 240193 232774 199139 190045 205587 177029 192859
10424 192859 204422 216388 213702 213145 199086 174074 182658 210490 220977 237301 266003 284858
10412 284858 303690 326386 313498 286039 290152 284260 259058 244785 267758 283146 242936 242388
10400 242388 242423 239202 222468 250606 254064 273586 281250 270787 288122 311397 335347 346602 349330
10387 349330 323899 290231 268933 231071 199560 148077 103500 105284 123568 109350 106668 108291
10375 108291 102300 123293 105782 136211 174198 209191 218077 232521 244874 260465 251111 215723
10363 215723 206553 222683 236998 242832 244220 244079 235157 261707 276459 288614 258243 234392 262444
10350 262444 271646 286016 272952 270959 287176 301376 332506 343466 340948 342929 360100 362015
10338 362015 385515 384934 357584 333996 362901 382494 373219 388306 374676 385323 416391 411735
10326 411735 378112 377655 392348 380531 372809 390701 391556 406826 429434 455917 474912 502525
10314 502525 552597 579682 586319 625608 656106 672463 678734 675765 676734 695796 751551 809416
10302 809416 895213 980275 1061998 1156340 1278378 1377289 1479797 1584151 1684268 1740831 1765025
10291 1765025 1814911 1866181 1917636 1970897 2040740 2158971 2273092 2390104 2549000 2752474
10281 2752474 3029561 3387506 3862630 4527505 5442570 6594688 7977888 9533469 11159793
10272 11159793 12795186 14384894 15893296 17277813 18607533 20059403 21889162 24529415
10264 24529415 28515035 34810303 45201568 63176504 94528777 143452033 201493870
10257 201493870 261728481 324068407 382150746 431896430 462815172 471034709 453109940
10250 453109940 415672562 366616045 313024752 251435330 192460976 140754018 103101554
10243 103101554 77943206 60967319 49210068 40905708 34991516 30680161 27465140
10236 27465140 24952184 22813279 20853691 19025599 17266604 15493590 13690327 11966429
10228 11966429 10449593 9156273 8058188 7149910 6452530 5886160 5390019 4956032 4570186
10219 4570186 4238771 3949087 3695197 3452904 3210947 2959413 2754672 2570859 2393587
10210 2393587 2268475 2153704 2103779 2032621 2010028 2036519 2124917 2224401 2417275 2736984
10200 2736984 3105553 3432110 3655706 3721480 3742553 3683660 3541662 3285907 2877957 2437989
10190 2437989 2053291 1748997 1571884 1448052 1357034 1288714 1239761 1217173 1205446 1156988
10180 1156988 1067340 1005199 975148 922905 896926 878951 875090 861715 831677 811474 774704
10169 774704 702326 691782 684163 658551 622016 617154 632888 608502 575137 583343 599219 564297
10157 564297 567450 577581 620102 647277 647915 605858 579914 578664 581349 573091 571683 580253 559264
10144 559264 547879 512424 463932 447680 462415 486501 523563 533397 550776 544823 535168 528303
10132 528303 541994 582804 637165 673913 683487 721237 758740 716307 658826 598173 549926 536635
10120 536635 524321 497694 482445 414526 373577 335864 334819 349891 333374 327023 367774 397940
10108 397940 358352 318938 324030 305795 265496 234009 233019 220070 179002 178355 186567 168134 151344
10095 151344 154617 135228 115898 113272 152204 185947 192667 183149 177831 190228 188895 204873 215235
10082 215235 204344 215252 203052 197194 209024 203736 184613 161873 156824 196317 224458 216497
10070 216497 215590 225333 189162 144529 136172 139805 141818 176400 173117 139875 106164 127857 137842
10057 137842 122092 95194 89266 88312 59887 75111 82790 97159 113857 104674 101412 110938 92292
10044 92292 85489 67111 79767 115250 111827 120515 114552 105004 133072 144904 132701 127323 112213
10031 112213 91855 101283 135662 165183 168648 182134 182015 183678 160952 119882 100555 138768
10019 138768 153970 140650 125747 130810 133109 147756 150982 133883 134311 132354 130139 139710 133027
10006 133027 141728 160389 146048 127222 132952 141747 152175 176756 184870 182141 153019 152514 195870
9993 195870 190071 162359 155254 144764 143033 122697 123697 102660 93150 97943 106319 97683 90554
9980 90554 98067 103999 124160 138571 168671 171500 168234 144335 111756 104115 113360 85924 86943
9967 86943 116154 105489 97207 102820 98952 101931 95786 86625 60132 56907 67314 43064 44549
9954 44549 49139 45761 47220 57578 69849 68514 62922 57117 64257 71998 71977 45027 39107 30803
9940 30803 36325 54942 84557 103923 90815 83666 68114 54444 39030 53005 98496 78032
9928 78032 57544 49538 44941 26204 43429 30700 34807 71960 98243 95769 87380 81193 115261
9915 115261 108362 96892 87223 73713 85578 88684 113792 129249 125161 139161 139953 153338 161701
9902 161701 155637 142104 153207 144477 134952 138640 164704 140527 101609 66734 76615 92726 98441
9889 98441 104254 119924 98769 72777 72808 60108 65994 73188 84951 95710 77083 59699 78897
9876 78897 110298 138121 135228 88070 58413 104304 131019 133098 150867 153545 150607 196414 221458
9863 221458 228714 240667 245997 222458 222974 236344 267704 287874 316520 401949 539014 767800
9851 767800 1071865 1344077 1666826 1998095 2333171 2566047 2668063 2598578 2383716 2143651
9841 2143651 1899548 1569836 1220112 919738 698701 544748 455936 390817 343254 276313
9831 276313 233587 221271 187948 184713 170642 173949 184531 195668 192321 170800 170111 166502 140499
9818 140499 135552 104958 82839 87521 96396 103495 98973 100564 98352 79429 53612 36110 24757
9805 24757 15288 16225 14526 35078 37136 27563 9765 19162 45944 69839 75868 86177 92085 94767
9791 94767 81266 57993 57901 69447 68603 78997 84649 86267 91113 96004 117814 130525 111226 98320
9777 98320 87421 48568 36638 74448 88380 75772 60833 53803 44848 35375 38046 69012 64618
9764 64618 42614 35734 38138 44040 39605 30317 28541 40537 67316 75157 81304 44876 2580
9751 2580 -7077 2132 4618 33563 69551 84884 83900 41831 23742 39979 38483 73308 105942
9738 105942 80993 70274 48190 33428 68519 86613 100028 128323 110887 73591 53874 40729
9726 40729 47036 32151 15377 31180 36410 54109 85993 103238 104553 95578 57644 31477 52852
9713 52852 61276 55909 57076 34209 55827 44952 48941 84213 75705 63833 64184 74254 85579
9700 85579 58518 54807 62563 72986 86119 89465 85343 80824 91961 72862 53689 45412 90779
9687 90779 95320 77096 69026 41564 31017 73178 79489 60262 55391 47523 32117 13426 19231
9674 19231 27863 27730 38150 36111 40353 53196 38830 37161 42928 41213 52378 52556 69902 63413
9660 63413 41795 35834 49030 46977 27825 30656 36170 61824 75993 68936 47895 41805 43272
9647 43272 52510 34781 30866 30807 51742 66241 79268 69803 70924 80969 68614 69384 74662 69274
9633 69274 81156 93221 81514 41442 25661 30392 32680 16441 6069 53105 78515 52761
9621 52761 37210 24627 50796 51256 33887 59902 78477 69435 74181 59159 20004 17576 41425
9608 41425 49366 64927 38529 39817 44472 71039 96643 81818 45671 10706 22548 51337
9596 51337 74711 93775 109489 108168 83503 53490 62773 60565 59248 51325 29952 54196 64942
9583 64942 55311 45637 39062 30978 37399 28804 14366 -2038 -10162 -20009 -25334 1563 22248 22634
9569 22634 23188 20088 25111 45901 73868 75672 29227 8554 48615 56529 69817 68602 30814
9556 30814 36137 61839 75376 60065 46129 56894 69690 35914 25983 6130 7996 -14649
9544 -14649 16587 27726 31151 25533 32208 53562 61308 49273 77531 83922 58163 49195 60079
9531 60079 61287 41368 77771 77350 95893 101275 110480 115107 81949 57962 74441 80509 98791
9518 98791 56881 59171 41562 61400 77186 80273 76829 70070 75793 61174 55284 61008 74933
9505 74933 75862 109280 118103 124015 101422 67067 51838 76286 67020 57405 62797 56533 34680
9492 34680 28516 23212 17314 15384 26594 24459 26837 52630 59979 46609 30156 32870 40305 39010
9478 39010 80140 66412 45893 53435 76380 53438 46492 58971 58739 62746 60401 53216 45904
9465 45904 33086 25196 52288 82294 94929 75398 80251 66770 39642 26172 17648 20041 51757
9452 51757 59665 64656 27164 40178 55481 47600 75414 77004 60413 33717 64236 101566 76147
9439 76147 54555 70313 78898 84237 71346 31528 14467 27543 43707 43933 34750 27596 79848
9426 79848 75296 58764 32657 1097 -26963 -20992 14613 43826 37819 44620 34717 7460 2964
9413 2964 27957 46236 42362 42721 53592 51824 47150 24626 36598 47148 61157 73631 57808
9400 57808 75493 85864 93399 93761 82087 36216 20061 44824 65756 53432 62137 92373 97254
9387 97254 88797 87490 77085 60346 62097 60210 46182 59884 66486 53238 41486 37110 50579
9374 50579 79075 74367 73975 54154 31198 50744 56985 55053 50059 38758 41535 46407 63308
9361 63308 56928 29083 5403 13765 10262 36617 49658 43136 42946 36262 52835 55888 50129 35805
9347 35805 34194 46198 52155 65709 85307 56564 61212 70966 73974 62592 36634 42283 63025
9334 63025 75044 52353 48070 42970 60103 97780 89296 80915 80975 99264 102622 104120 84098 36917
9320 36917 28265 27353 37565 61081 33930 13928 22514 30371 30398 52764 70210 64469 60357 78588
9306 78588 110021 121031 88095 54613 67202 61284 24940 21744 62495 75370 84544 52875
9294 52875 40956 41993 34559 8196 22377 49878 35118 33548 52636 62676 85823 98356
9282 98356 72356 53829 70084 72166 98927 87594 78862 70421 62622 82412 91856 98889 90153
9269 90153 58357 41342 65389 53804 44250 32256 46927 62656 82989 103982 96771 98563
9257 98563 66565 29349 40358 77376 110314 113175 99147 94325 94350 104095 88697 77974 82685
9244 82685 63601 78875 68909 39476 31709 75406 64765 60235 44706 38593 66552 59573 55687
9231 55687 65864 56733 50060 72251 90614 68126 70000 71800 61367 60968 58326 59863 84986
9218 84986 70150 71221 69646 74993 87363 89402 102734 119524 111580 99573 88723 77668 57547
9205 57547 60242 87451 113765 82674 66884 91060 100731 116734 108394 90187 105040 102426 91207
9192 91207 90229 88556 94047 96538 91041 95593 92760 105105 108405 93090 82183 62597 72983 114294
9178 114294 136733 128143 94813 90570 88087 63000 70086 86615 49423 25199 72883 104532
9166 104532 92689 79658 80005 99804 103652 99486 62901 50232 65556 90062 94343 83261 57803
9153 57803 33644 47657 45790 46300 53507 65617 75040 26865 37177 63152 64132 81857 107624
9140 107624 123501 128615 120107 123352 116921 98568 98316 84512 70661 47772 62667 57806 29990
9127 29990 39365 76469 76622 65602 73132 81043 68467 81231 82255 67203 77697 90510 89989
9114 89989 81543 68637 74474 90034 88430 44978 12254 21798 52012 42711 44270 59618 98226
9101 98226 106939 114649 108051 88926 76891 86865 96898 82392 67116 61728 67866 78112 95625
9088 95625 119013 94920 84787 88061 93232 111785 65922 64108 94222 85544 72978 95017 82111
9075 82111 52580 50530 29378 25450 52843 54655 62118 74774 62659 67634 56256 50271 45436
9062 45436 82573 106908 95934 104445 84166 125343 143250 114680 104314 101350 73622 61039
9050 61039 80076 69081 75048 77759 60333 56191 46808 51137 44418 24053 -913 25022 78293
9037 78293 68622 38808 32959 41044 46819 35025 30282 8659 18469 57871 44791 43811 29037
9024 29037 16816 34130 59530 80363 103972 70783 83816 90067 68355 50277 54600 80942
9012 80942 86725 79798 92082 113881 105049 84611 60557 75320 90683 88508 113537 110411 91181
8999 91181 93890 79136 67182 84620 75424 77922 90450 71383 70877 57953 80914 91945 58893
8986 58893 55537 62558 58834 63611 29717 -7212 -9380 13166 -2665 -2128 8992 37632 65367
8973 65367 74200 72081 74722 65508 54548 68699 61812 45753 41711 28206 17302 31874 46121
8960 46121 73042 84229 55142 25890 30795 50241 77225 88586 97824 53119 23349 51246
8948 51246 5767 -2260 31764 23809 21517 15448 37615 53207 64358 72386 81379 81209 74056 57175
8934 57175 36514 37180 32005 11138 22173 14816 -37186 -38757 2785 40119 63097 63456 60305
8921 60305 51774 46897 29434 41981 27381 22061 15668 -5749 13044 45944 32734 15847 9829
8908 9829 16506 6598 7696 46657 52619 34632 23607 24482 33891 21767 24789 24582 4746 24192
8894 24192 24867 -15963 11259 52753 42416 38744 21227 12087 25888 41363 37990 12838 15888
8881 15888 8942 22173 43978 48696 54637 34611 11537 41692 55370 51728 69546 45693 44111
8868 44111 56850 73944 63180 48607 39691 32807 17166 18417 23981 10562 4611 24901 57391
8855 57391 82116 65895 61553 32553 27621 30360 39801 49704 66720 74412 76445 65031 74404
8842 74404 81244 39228 14225 -4586 -13965 -24122 108 15139 20408 58254 70607 36322
8830 36322 20922 41503 27682 36521 54922 61195 76316 66887 64297 65908 42483 40449 34228
8817 34228 32351 27890 17595 5854 11422 26548 24107 -1626 22705 31174 59803 55129 56984
8804 56984 32106 32994 44033 31601 25932 24832 42492 29997 16343 2888 -895 1739 -9088
8791 -9088 -16138 2132 45744 57069 25024 8975 17281 8035 17729 16949 11910 5142 -23969 -2348
8777 -2348 32873 25545 15234 24935 24803 38382 41791 25662 43005 40136 15889 11319 36030
8764 36030 59175 72971 54627 40205 77799 89780 34757 -8417 9916 7266 2945 10636
8752 10636 38241 65435 47189 30893 35839 48250 28303 30422 17175 20626 2871 -783 8410
8739 8410 42221 71593 56434 46955 19282 17863 46201 27880 -16573 5672 41984 47944 37083
8726 37083 13296 -9449 -10773 22324 19366 10964 -6786 8658 32611 31743 19965 27186 26686
8713 26686 30924 28772 2342 5671 -5276 12660 34489 47592 35863 36007 325 -8046 22319
8700 22319 19229 10997 19101 47688 76654 79908 53183 44467 30881 11156 19515 21104 -162
8687 -162 -5228 26678 58381 53316 41303 30353 39271 28943 36659 44980 20972 17273 30399
8674 30399 16284 1733 16452 23370 4962 -47904 -58237 -9945 9527 -4609 -18760 -10808
8662 -10808 -7202 -10540 59 16332 31456 38792 46330 31340 28240 8404 13099 3815 16187
8649 16187 57537 76965 78419 61574 17579 15832 6247 -20245 -8207 -3923 -6214 -7503 41643
8636 41643 38063 -19130 -22240 8992 27594 40497 61988 70471 85697 60664 28574 9968
8624 9968 11180 17944 -6658 -12602 6702 36329 38401 60043 67337 70611 72786 45588 48935 24623
8610 24623 5023 30326 33869 48389 64486 50037 43926 56318 62605 77719 78718 31998 -1060
8597 -1060 -28015 -26244 -9971 -5904 18057 28071 38006 43811 33445 38816 36615 32406 34547 28274
8583 28274 19225 13721 3592 -14824 -14997 -59 14262 -21223 -32872 3781 39031 29877 -14926
8570 -14926 9969 21641 20118 52074 59356 58626 48035 32106 19314 6539 9262 12247 10439
8557 10439 -15098 -34637 -29071 12292 32341 69861 74564 54138 23124 -4190 -7831 1232 12694
8544 12694 17785 -19534 -20105 -6270 26417 34800 32959 40588 45415 69466 68087 50149 23702
8531 23702 6773 -2686 -11581 -5282 -7118 28436 55217 45353 21278 -3567 -9257 627 33603
8518 33603 52092 25989 4497 4607 15411 3616 -13507 -9863 9931 33092 50553 49955 11516
8505 11516 -6148 -25012 -22744 6118 32176 20538 471 -4170 -35493 -26655 1541 17447
8493 17447 22636 17079 -3784 -26530 -21353 -369 -3400 -5208 10156 43832 65002 62542 53276
8480 53276 39799 32797 23696 17746 -5376 -19152 -15730 10940 14910 15872 36869 41885 18308
8467 18308 -637 -1519 20198 41811 31830 -3843 -18809 3171 13367 9286 -3823 50754 52202
8454 52202 28325 -381 -6862 46482 48719 55745 58896 27962 9388 21469 38851 37938 34135
8441 34135 27211 30820 6052 -9535 -719 12894 32060 57937 38096 32197 49877 59491 12763
8428 12763 -7122 13914 17866 20467 23663 -9957 -26386 -33306 -43580 -54349 -60654 -53412 -17893
8415 -17893 -11224 -8526 15991 2476 7150 4173 6697 36362 48668 44515 58211 68334 80134
8402 80134 73554 34480 9281 34024 24288 18561 15911 3428 24584 22594 8889 13981 34638
8389 34638 46970 46183 44147 59305 46862 25263 29349 27720 32296 6712 -9760 -15458 -15140 -13669
8375 -13669 -792 15624 18992 18818 22570 34289 26892 22742 22617 9751 13923 20271 20001 34961
8361 34961 21491 4369 517 3669 665 9822 43436 53289 56128 68490 67046 55768 46334
8348 46334 48285 40204 46206 29919 23449 13295 16375 13190 30635 41785 43214 35613 16755
8335 16755 44365 40429 19980 -9401 -6551 25822 37355 29211 -6922 -9639 12463 16068 16778
8322 16778 8135 -2109 -26151 -26498 -13361 1765 36046 45403 56278 59894 50540 38183 35829
8309 35829 37083 39180 19318 -23694 -10587 45620 81188 72327 34307 10694 -12747 6413
8297 6413 -4523 -17102 12566 26971 50270 53448 3164 3133 1047 11366 66248 73385 34508
8284 34508 8917 7508 -2288 7272 -3043 17006 8725 -17169 5729 38131 55732 28507 -11743
8271 -11743 -27336 -47412 -25004 4977 15971 2391 3676 3895 13589 29100 36516 43001 49077
8258 49077 47701 49217 50027 38199 35818 16323 7916 9294 -5865 801 18995 24090 11959 11680
8244 11680 -12190 -5352 -5912 -13760 -13673 -20986 475 6338 2587 7685 8070 -3939 9938 28089
8230 28089 29729 23194 20496 5042 -1112 -19336 -17105 344 9196 36383 59176 60704 37020
8217 37020 11777 -4606 -29353 -23562 5112 1148 -9613 -11210 6456 4131 16401 22366 11484
8204 11484 2768 -15019 -23187 -25437 -14152 -33444 -40400 -16420 -16000 -5361 3365 25301 58136
8191 58136 55709 27143 7337 13046 11678 -7517 -36632 -31559 -31227 -9889 4099 50192 57995
8178 57995 53342 35735 21582 10213 -17389 -17351 8684 8414 -4335 15842 30596 19783 2461
8165 2461 -13342 -10321 4608 14136 29605 48278 50191 31264 -2832 32885 38308 -9500 -42070
8152 -42070 -34187 -19841 11144 -2116 2257 -6215 -34272 -24131 7447 -29514 -18499 -23428 -19361
8139 -19361 10911 -14096 -48159 -54117 -35732 -40582 -32145 -928 -4403 -10782 -24742 17968 40608
8126 40608 25334 -10592 -24781 -22064 -20061 -8159 -3341 -15323 -25635 -32873 -54765 -48829 -42253
8113 -42253 -49173 -25516 5172 -4276 -36182 -1301 21772 12033 -19368 -9052 12613 10229 13969
8100 13969 440 1965 -21659 -30463 -15376 -23393 -54939 -50454 -31285 -22374 -8011 -2955 -17050
8087 -17050 -16528 -22660 -5649 9492 11941 -1153 -12749 -34489 -41616 -63696 -91022 -71849 -20370
8074 -20370 -32330 -56583 -47544 -23889 -22420 -12408 -368 -11852 -27186 -71153 -63934 -33406
8062 -33406 -16420 17777 24115 20619 11160 11269 4469 -16562 -775 13203 12506 12384 15220 -9282
8048 -9282 -1665 26504 18013 6267 -23063 -14737 20441 25127 -1426 -31806 -40466 -8557 5796
8035 5796 -25045 -61066 -67012 -60613 -50191 -14266 25542 40213 30238 12092 28951 35086 23372
8022 23372 36944 16669 -11484 -18727 7118 19923 3478 -19956 -42854 -31897 -1668 15596
8010 15596 15249 35044 6007 2606 38584 25639 15510 9914 25380 19193 13314 33861 49630
7997 49630 37351 28133 -7445 -23311 -13822 1097 -20669 -47974 -36720 -24982 -13562 -25895
7985 -25895 -41128 -53438 -63724 -26839 13519 6059 8733 -5970 -23093 -13394 6078 899 1313
7972 1313 19857 -1788 -19767 -19643 -24600 -12594 -16371 -10411 14353 7422 -10647 -27332 -25983
7959 -25983 -12262 6201 37729 34505 33401 49206 54907 23661 4003 -7330 -11013 -24017 5408
7946 5408 17244 -4120 -8998 22303 15190 9132 20833 17968 16793 8414 3361 -8299 -31701
7933 -31701 -39396 -16370 -7720 -14832 -23995 -12239 -10258 -1424 -5259 -22970 -32100 -27488 9590 -2081
7919 -2081 -21928 -12082 8956 30048 19022 -8667 -20272 -9535 -3025 9706 8180 -2032 -15943
7906 -15943 -6181 3568 14529 39528 26036 -2125 -16204 -3846 13247 10161 -5594 -27736
7894 -27736 -22754 9033 10064 -3476 -13037 6606 25681 7235 14188 8378 12607 26196 40253
7881 40253 68295 72316 45593 37963 29953 14599 761 -11687 -12352 -10319 -29924 -18644 -3637
7868 -3637 7339 -1942 2344 25198 22112 -2093 -25372 -15279 18469 33081 36307 57140 38137
7855 38137 4713 -15905 -12909 5797 -20847 -22691 -3416 21545 31786 39048 19283 1699
7843 1699 9196 8895 5849 -5083 -3791 -6200 -5861 40162 42037 25509 12784 -16172 -24445 -16969
7829 -16969 5055 14929 16606 23301 32563 -2483 -25188 -29656 -13593 16559 12619 12286 28004
7816 28004 28781 -6645 -42468 -36366 -9531 -6357 -5152 -14980 -19542 -838 288 -10678 -12749 -44508
7802 -44508 -39801 -30694 -41060 -43147 -2985 -3213 -38742 -57227 -31510 -2486 -161 -7676 -24391
7789 -24391 -52391 -25772 -6477 -4062 10423 15203 21470 1023 4669 -7855 -40759 -38941 -19549
7776 -19549 -32349 -22038 -14193 -20102 27653 23926 -3725 -31637 -272 -9024 -28867 -1880 13976
7763 13976 6853 5854 23746 24468 6582 -21586 -13413 531 -1641 -21057 -12345 -30303 -62626
7750 -62626 -39805 7954 28325 20090 -3131 12907 44501 31977 -5477 -26888 -821 -1049
7738 -1049 -36845 -17277 38943 56773 30244 1768 -33447 -48848 -64832 -54626 -44012 -24658
7726 -24658 -18632 -35641 -62353 -52265 -25828 -20919 99 -30345 -35932 -49558 -55756 -42503 -37099
7713 -37099 -27852 -41234 -24618 -11327 7812 -1787 -20906 -21352 -27490 -31151 -40550 -55952 -34921
7700 -34921 -33449 -15877 -17074 11152 32849 39098 32251 16044 10813 17277 -2151 -7068 32112
7687 32112 64703 20512 443 6930 17301 -11624 -36972 -13806 -22937 -26938 -50736 -41703 -11814
7674 -11814 -30568 -26716 2225 4135 -6433 -17578 -27546 -12654 -16559 -21726 -16378 -17245 -44361
7661 -44361 -47127 -40492 -42385 -30979 -8081 14524 38260 46731 6641 -32090 -47139 -33497 -15969
7648 -15969 -10563 -33910 -48701 -35404 -25996 -17927 -16387 -20942 -23401 -17015 -11187 -7152 10056 6115
7634 6115 13615 27607 -12482 -32876 -33468 -39286 -36181 -27146 -37182 -22518 -31159 -13953 -13330 -18243
7620 -18243 -29069 -34446 -24207 -2565 -14598 -50383 -68690 -54337 -38844 -20590 7106 -4933
7608 -4933 -40236 -28266 -19760 -36985 -34935 -33708 -7046 22980 27633 22595 30670 8077 15452
7595 15452 10666 -13977 -40080 -30591 -1587 4629 12438 28198 18638 -10955 -36646 -49925 -60650
7582 -60650 -38672 -31282 -36425 -26291 -13187 11129 28313 39325 34995 46530 26045 -12407
7570 -12407 -23723 -1021 67 17537 18929 3798 31861 74508 66477 24673 24307 19538 -40192
7557 -40192 -52557 -46284 -15746 -6442 -8574 5464 20295 22405 14035 -9652 -13941 14807 29214
7544 29214 14475 25240 26149 -13488 -20780 -8727 -10805 -2994 -18548 -27732 -23134 -6686 -34193
7531 -34193 -57538 -50716 -44858 -91117 -79214 -61775 -71683 -75157 -42501 -30521 -23901 -55645 -20819
7518 -20819 6857 16656 13165 -4566 -701 -11209 -11181 -10662 -8126 -4440 -28313 -51800 -49792 -21540
7504 -21540 -967 -4619 100 -2645 21309 35681 34681 6386 -734 17421 15716 10784 -7217
7491 -7217 -35186 -31747 -18863 -21125 -21717 -23273 -1457 -3901 21259 27224 5125 -19480 -23393 -11610
7477 -11610 -2616 18630 8366 7357 5588 16393 4101 -1709 13041 8679 14133 17055 -26530
7464 -26530 -45232 -53874 -26194 -18424 -21505 -21200 -12372 -5059 -29486 -45115 -18415 -11156 -27718
7451 -27718 -21081 881 5827 19958 24648 30511 19731 4244 -8975 -9000 -12327 -17640 -23162 -19369
7437 -19369 -23269 -40499 -40684 -36892 -4028 -21949 -36148 -20400 -17641 3166 -553 4540 -23298
7424 -23298 -55806 4326 32200 1410 6400 9440 33124 33275 17031 19156 35326 52623 42946
7411 42946 34641 18259 -19034 -31942 -11552 -9681 -23550 -19191 10657 19312 28734 17835 13303
7398 13303 7309 20813 9773 -16157 -36305 -30087 -33929 -50907 -34545 -23673 -3188 -4847 -1014
7385 -1014 -2493 32618 37984 -1370 -21840 -37427 -43186 -10373 -9402 -4258 -18057 -9750 -4871 7078
7371 7078 10415 12679 35615 18919 9764 16672 6050 -2337 -8020 -41880 -37006 -15526 3305
7358 3305 10011 -12602 -4305 -24909 -69490 -48064 -16444 15069 48975 59942 51955 39483 -5245
7345 -5245 -41394 -44544 -51913 -26916 -17930 4486 4197 -7280 -5844 3225 3542 -6220 13369 50
7331 50 -23261 -38761 -43319 -35026 -19063 -17293 -18594 10080 14831 4834 21980 39646 10632 -20043
7317 -20043 -9411 -6741 -7000 20814 24324 20080 -7733 727 -1205 11439 -7589 19354 41407
7304 41407 42014 50657 -2203 -33658 -31493 -38847 -25418 1390 -1413 -12728 -8724 2259 -11688
7291 -11688 -33384 -29784 -48273 -60155 -37345 -13227 17783 1453 -47343 -56229 -69818 -45692
7279 -45692 -21986 -17316 12684 10449 -11406 -6472 4367 -3995 388 2350 -32288 -17168 4019
7266 4019 14416 -3964 -33477 -61523 -79149 -79962 -54946 -17731 -19873 -6796 19831 45583 34307
7253 34307 -2438 -41698 -34992 -19762 -21077 -32451 -4365 10518 -17973 -50595 -22518 -19537
7241 -19537 -39811 -36095 -32270 -34119 -62991 -47201 -24051 -13437 -33035 -43080 -35602 -1177 -26308
7228 -26308 -18660 -8503 -16779 -10288 20877 38223 31534 1073 -11888 -30826 -59667 -41643 -12802
7215 -12802 -23440 -11878 21712 -2515 -17034 -48468 -56165 -70140 -58324 -12971 -13982 -16476
7203 -16476 -50093 -45878 -29351 -8794 3595 -8972 -7615 7400 16523 7161 7133 819 -13498
7190 -13498 -10341 -23575 -41158 -7601 -5766 -22227 -30588 1600 27511 35413 22798 19939 110
7177 110 -33461 -61501 -36360 4024 4405 -18272 -17391 -7625 13786 5688 -12515 -8588 14065 268
7163 268 10145 5226 -15670 -17766 13227 -1562 -1555 26679 47530 58936 53874 61225 59819 23356
7149 23356 20718 4326 6607 2046 10884 6910 -13232 -6307 -2287 11263 25940 24471 18140 43774
7135 43774 48795 28640 22929 -18 -18306 -27062 -20622 -31859 -18474 6300 4279 -1104 -27388
7122 -27388 -35122 -17616 -13837 -2813 -17135 -9627 -12312 -47757 -72021 -93183 -86136 -81286 -68568
7109 -68568 -82363 -79422 -42087 -24615 -12940 18387 13830 901 -44321 -65517 -76037 -63064
7097 -63064 -63462 -68505 -64327 -53019 -21952 -2967 4460 -18705 -11783 -15531 4321 11813 3687 -38050
7083 -38050 -62762 -75476 -47086 -11254 1367 -6857 -7041 2419 -10368 -47401 -59724 -46892 -39233
7070 -39233 -65848 -60639 -42905 -23781 -15380 -25440 -11991 1241 17746 10149 -2934 -3073 -162
7057 -162 12501 -34680 -63055 -13920 -20232 -26780 -7711 -38469 -54931 -65756 -65414 -57379 -38533
7044 -38533 -43418 -43490 -10450 -8933 -26866 15034 13224 17874 -9554 -32865 -22883 -28231 -8814 -7739
7030 -7739 -47120 -43354 -37055 -63981 -56267 -41494 -68182 -59027 -34534 -41004 -60986 -49313 -42408
7017 -42408 -52537 -37840 -19248 -15954 -18783 -19603 -15237 -25420 -40690 -50357 -67829 -61518 -37079
7004 -37079 -2058 33359 27100 2691 -17998 -46957 -49050 -48281 -40274 -22462 -31967 -28537 -30836
6991 -30836 -58996 -52869 -67682 -49664 -48979 -65895 -61697 -35750 -18014 -17373 -45365 -15101 20507
6978 20507 19301 4069 -5378 -19161 -26815 -22137 -27539 -40940 -26297 -21823 -39544 -38993 -45034 -41970
6964 -41970 -13926 -28985 -27481 -19834 -44651 -58113 -22304 -22193 -9915 -1619 -14388 -10575 -34520
6951 -34520 -36610 -46208 -45889 -56578 -37172 -44881 -19106 -9724 -7887 -14828 1831 -125 -28538 -28938
6937 -28938 -19695 -30898 -37499 -27130 7729 30020 17556 -2759 6299 25825 16269 352 -11777
6924 -11777 -35080 -40523 -8514 26014 29380 13140 30589 -1691 -23295 -3002 5059 27049
6912 27049 22468 19171 -429 -14547 4566 -5968 -21692 -16675 -1567 -3940 -34905 -16199 -14562
6899 -14562 -58963 -57078 -66746 -57209 -52529 -19702 -19055 -22402 9626 11878 183 -1652 2541 3045
6885 3045 -15404 6117 525 1481 4155 -6095 -24687 -7957 -2770 -26625 -36956 -25154 -11693
6872 -11693 16770 11264 -32003 -42877 -25458 -15265 -19006 -3596 2668 -6936 -11861 11300 -1835
6859 -1835 -17800 -43408 -36410 -14815 -3510 11022 17065 -5201 6148 -19472 -42582 -37062 -17570
6846 -17570 -8313 -12097 -27273 -38350 -38710 -38399 -20452 1423 -7499 -22378 -41378 -23706 -22441
6833 -22441 -20854 -30694 -64750 -72964 -29191 -6641 -27504 -38805 -35695 -10014 9315 20453 -13388
6820 -13388 -39555 -11661 -8732 -50642 -38097 -4194 -1558 -214 13696 18011 10277 8054 4155
6807 4155 -11238 -11429 -52100 -72268 -46014 -31633 -50625 -39111 -53392 -33763 -21114 -24708 -42937
6794 -42937 -8764 31231 41339 12671 -32039 -48114 -48584 -22361 10547 24092 36160 57814
6782 57814 53417 22225 1304 25906 54438 14937 -9135 -21171 -38695 -51261 -34045 -20404
6770 -20404 -57020 -75674 -42822 -44188 -15440 4632 -1283 -35772 -40583 -45742 -40344 -30322 -34557
6757 -34557 -8772 1692 -15858 -10951 -4215 -24155 -55537 -81601 -68135 -63242 -49312 -42705 -40250
6744 -40250 -32962 -33450 -14154 8084 10742 9841 1714 -12655 -19433 -12188 9880 48999 56314 50914
6730 50914 45797 26230 -2642 -12620 -3465 -10635 -33524 -2835 17454 35251 31529 -4444 -20865
6717 -20865 4371 22517 23406 -424 4586 20588 23373 -2824 1738 19451 -9647 -12597 -14493
6704 -14493 -27626 10504 16497 9779 6464 -22047 -31282 -31016 -15185 -23377 -11174 28005 5815
6691 5815 -21404 -29572 -20450 -26889 -29290 10346 22661 8693 11728 3979 -17 14543 3737
6678 3737 -11048 -11197 -26987 -11039 -6862 15604 11332 -2092 6634 33824 22614 -3923 -2900
6665 -2900 2150 500 9425 -5963 -13887 -35201 -9391 29315 7804 1747 11525 -12098 -13129
6652 -13129 -24824 -43962 -38689 -24610 -13159 -30869 -40551 -40572 -31235 -21997 -17470 -11272 -374 -16155
6638 -16155 -20942 -26472 -30437 -1530 -5226 -45929 -62494 -47225 -55622 -78868 -55087 -59835 -38950
6625 -38950 -52555 -92265 -96651 -87064 -62914 -63462 -58885 -58159 -41874 -11105 -4283 -23657 -56081
6612 -56081 -46811 -39383 -33709 -13482 -3907 -15471 -1636 12851 15007 -6429 -10881 -39681 -65570
6599 -65570 -57557 -27326 -38990 -59739 -62267 -53118 -44396 -41292 -25296 -21944 -18180 -69685 -95354
6586 -95354 -68676 -51700 -43526 -13722 12052 14225 1175 -30608 -45749 -5754 17249 10943
6574 10943 11001 9715 11495 1579 -18979 -25884 -11107 -23429 -55925 -76331 -41709 -39758 -40235 -30454
6560 -30454 13306 53917 64833 39630 26719 15887 -37870 -45664 -52145 -29348 3603 -9545
6548 -9545 -38387 -56711 -42530 -23719 -63853 -34375 8059 -22242 -49842 -29177 -52245 -65359
6536 -65359 -56358 -45546 -47956 -29709 -23251 -35739 -58172 -49180 -40502 -45294 -66030 -65729 -48139
6523 -48139 -56924 -56457 -43459 -45560 -80838 -72429 -25504 -16021 -16252 -26020 -49889 -76113 -94722 -94298
6509 -94298 -67819 -63805 -51982 -56149 -54911 -54234 -29340 -22039 -23745 -23374 -22286 -26964 -18728 -17419
6495 -17419 -12232 -31271 -36457 -3247 32661 11958 -942 -8091 -24282 -28724 -47698 -49228 -54745
6482 -54745 -56492 -32225 3707 3985 -15091 -33456 -27094 -58318 -41622 -7635 10110 30402 17055
6469 17055 -8906 -11053 -9129 1441 6415 3196 -3068 15884 5259 20544 9765 -14404 -37796
6456 -37796 -28847 -20589 7584 14706 -4909 -6162 -12174 -16409 -7530 -17801 -31746 -39007 -45924 -35597
6442 -35597 -6187 2857 -1529 3361 -1089 -18459 -19298 -6830 16883 11319 -7454 5443 -19434
6429 -19434 -28594 -8518 37865 29185 -972 -23004 -14636 -29362 -35567 -40699 -29089 -12763 -42525
6416 -42525 -31109 -51208 -66775 -65273 -25679 -5917 -19609 -41736 -39699 -31280 -48297 -25169
6404 -25169 9025 7733 -5667 -18073 -8230 -32202 -69217 -72754 -46022 -33612 -17286 442
6392 442 3623 6849 17137 19441 15143 -99 13781 3100 -20864 -41688 -62981 -55665 -33650
6379 -33650 -30069 -10768 -812 7159 6809 2720 -3477 -19999 -14510 15627 21442 7221 5560 20723
6365 20723 23944 23569 10321 6304 -896 -25586 -31316 -26482 -33731 -11229 2561 -2712 -29149 -44787
6351 -44787 -63031 -82053 -47249 -29092 -25535 -5004 44257 46751 41565 38761 33199 25359 11106
6338 11106 10473 23157 -596 -1649 -10864 1449 31789 40030 9319 -2422 -15932 -36845 -61767
6325 -61767 -41293 3699 1115 -17476 -3094 -13668 -46555 -61210 -39196 -22416 -39578 -15206
6313 -15206 26060 3474 -23156 -59556 -88596 -81020 -41404 7559 38815 45670 27100 5087
6301 5087 -10764 -21001 -39045 -39390 -33015 -4991 -9178 -12881 9228 32019 21983 -8275 -7953
6288 -7953 39126 61446 49629 27603 7272 3000 12151 11428 6309 24279 40941 26444 9292
6275 9292 -5438 8516 11621 -2722 -14994 -45391 -53544 -21100 12326 25630 39707 35719 33591
6262 33591 17187 -18246 -28539 -28778 -34448 -22779 -25403 -58678 -62656 -46450 -47197 -27714 -41724
6249 -41724 -9944 8138 11595 -4896 -2218 8287 2499 4779 30579 52634 27873 -15608 -35981
6236 -35981 -29005 -11049 -11379 -21803 -46558 -17464 -446 -8402 -8438 -22842 -18323 -18832 -52155 -79964
6222 -79964 -44999 -25693 4128 10975 -1680 24765 46392 31819 15681 -22933 -18297 -9396
6210 -9396 -8055 -30884 -18670 -22880 -32393 -47546 -39650 -40213 -52450 -56483 -42038 -23293 -16906 -10992
6196 -10992 1550 5454 11819 23221 33538 15313 44994 38324 2913 -21122 -22495 -9104 -6195
6183 -6195 -39882 -31310 212 21210 -17802 -55199 -50872 -61662 -54965 -21214 16772 18757 18048
6170 18048 4420 14772 -1496 -17370 -16148 -23824 -14287 -16021 -31702 -21861 -11396 19076 33390
6157 33390 21141 11847 -8176 -16720 -798 31611 17220 4655 6018 2507 42427 68035 30757
6144 30757 1682 -57519 -83616 -79819 -58018 -28403 5282 -21752 -35370 -41866 -70498 -60881
6132 -60881 -61209 -44741 -25782 -7338 -14194 -21090 -14672 -26894 -24495 -22990 -36181 -32235 -22889 -18092
6118 -18092 -35083 -17107 16375 23588 -13256 -1035 19717 -9622 -32999 -40752 -37687 -45164 -33787
6105 -33787 27258 47286 33087 -8276 -43740 -34949 -29537 -17671 -17037 1824 970 -1859 3130
6092 3130 -14464 -12326 35149 60069 42450 22072 29148 2907 -23941 -38480 -42512 -17989 8737
6079 8737 30961 45193 47924 31125 6668 -10604 -17417 -35939 -23123 -32010 -39762 -19785 -18212
6066 -18212 -37145 -35569 -37071 -25477 -17759 -7552 -25875 -37771 -35221 -29887 -32275 364 10249
6053 10249 -3700 -9238 -18343 -36466 -44399 -23221 -13066 -2883 -11951 -6973 3377 -10320 -14145
6040 -14145 -36294 6975 11578 1517 -32149 -49033 -56000 -29856 -22372 -33837 -21983 -11401
6028 -11401 -14469 -26030 -22561 -5492 10095 609 -25480 -34356 -56845 -53792 -18574 -14954 -55943
6015 -55943 -69744 -86919 -83007 -64647 -35256 2610 28791 29996 23447 36139 13465 -20018
6003 -20018 -11898 -10751 5955 10282 -8717 -2589 4731 -4248 1900 -4460 -1670 -13942 -43983 -66612
5989 -66612 -58781 -58881 -36451 -40888 -40143 -31409 -15501 -24155 -44400 -49304 -32523 -7176 18302 16048
5975 16048 -14377 -42690 -54089 -68807 -76134 -45645 -21340 25052 28838 11422 16519 -21048
5963 -21048 -44866 -9321 -9046 -11495 -46043 -61515 -58464 -46289 -48341 -45335 -70397 -64338 -30527
5950 -30527 -7544 27929 9971 -16714 -4236 8771 -15407 -29903 -32165 -14249 1384 22908
5938 22908 3641 2262 -13471 -29102 -19732 5314 -11991 -24688 3954 6587 -4371 -827 -12357
5925 -12357 -19149 -18956 4682 39734 57609 15175 -6047 -13418 -4134 -37341 -55325 -53718 -48272
5912 -48272 -69700 -49851 -25292 -33271 -9419 1401 -23056 -35060 -19622 -31539 -42541 -35330
5900 -35330 -46819 -72277 -89131 -41837 -42941 -18640 -24889 -29931 -12933 -28142 -42808 -55173
5888 -55173 -25031 -20621 -7461 9576 -9530 -33614 -35402 -25621 6321 21561 30451 41242 26702
5875 26702 10986 -14590 -38976 -27954 -39694 -25595 -12347 -25256 -31533 -19770 -28079 -38436
5863 -38436 -40659 -30897 -36980 -42774 -38936 -16245 -3417 -1729 -5670 -12965 -26820 -2786 16897
5850 16897 -2245 -5279 -11551 -5637 8697 6615 -14780 -31738 -32372 -25797 -16892 4747 36093
5837 36093 -3679 -25913 -41242 -32947 -29310 -30526 -29752 -23922 -44498 -44679 -54561 -49357 -41379 -41265
5823 -41265 -24140 -18978 -55333 -48481 -33922 -40853 -55879 -44110 -26736 -30420 -32571 -53092 -63336
5810 -63336 -74384 -55537 -33016 -23978 -30002 -44181 -61355 -66124 -38698 -57774 -37905 -5894
5798 -5894 -1545 -1552 -36894 -40075 -42055 -37039 -22684 -5915 -6021 -23165 -13830 4890 8949 -9674
5784 -9674 -14673 4785 -8073 -7248 -21827 -4483 5956 251 22182 2069 -4305 14845 19081
5771 19081 16251 -34273 -62514 -73681 -49471 1198 20432 28456 34770 24241 -18665 -34355
5759 -34355 -38180 -40057 -42517 -40203 -26264 -8464 -22644 -11933 -7512 1038 25237 7821 9891
5746 9891 40379 52829 42978 42753 33720 -4986 -18138 -13597 -6243 23297 30716 3544 -20170
5733 -20170 -3443 23091 20161 -1906 -6606 -9743 -3578 15431 20192 12773 13381 5459 -6904 675
5719 675 7438 13778 -5901 11995 10811 -3400 6924 2467 -11024 -10873 22924 31194 39713 9655
5705 9655 -17687 -4653 -7595 -18548 -27470 -29906 -13151 12470 62137 54771 -18963 -26847 -26579
5692 -26579 -10225 87 -7403 -17089 9599 5224 -27129 -27064 -25873 -43488 -72656 -61800 -42088
5679 -42088 -6174 37603 43911 19604 13377 24285 26316 18043 14198 1325 32170 69406 55764
5666 55764 39969 31817 18348 -6562 -19785 -9772 -14046 -49789 -82720 -63763 -6389 12511
5654 12511 18127 23675 13041 5003 5832 2166 -13922 -33632 -53171 -13180 -15801 -38782 -43855
5641 -43855 -53607 -37793 -27613 -43943 -57069 -7417 13303 26482 45716 48000 53718 10969
5629 10969 -18514 -30211 -52687 -30698 -22127 -27475 -28962 -19510 -14682 -22773 -31425 -17174 16620
5616 16620 4748 9399 13313 -4909 -11155 -6349 -2956 -20021 -23807 -28036 -25592 -29835 -53753 -37432
5602 -37432 -61576 -67133 -51031 -58526 -40326 -24841 -28941 -31921 -23332 -16905 -12106 -3142 -17305
5589 -17305 -5827 259 20867 24553 -1006 -14005 -14274 -8674 -15635 2047 -10829 892 16750
5576 16750 2537 -36375 -20922 -13503 -7144 -9865 497 16082 19433 -450 987 -18501 -16080
5563 -16080 3304 16071 30837 -469 -40962 -55763 -52418 -39504 -40500 -15927 15107 19462 9064
5550 9064 -1658 -27458 -44573 -34251 -3488 21337 25561 20420 24330 25237 1011 -31364 -1752
5537 -1752 14289 6809 3794 -9671 6756 6552 -20676 -39229 -38287 -16852 -11497 -25764 -16725 -21072
5523 -21072 -9954 -19507 -31818 -18047 -13446 -19523 -4780 -23709 -45028 -16754 11772 18451 -16176
5510 -16176 -33084 -26215 -34916 -25516 -26731 -32797 -67513 -58595 -13102 -15232 -22221 -22790 -12021 -23375
5496 -23375 -35778 -40251 -36058 -41928 -83600 -92487 -81059 -53709 -25084 -45249 -59653 -54054 -64564
5483 -64564 -57667 -35273 -27182 -28418 -15823 7996 3231 3585 2333 12210 15141 27067 15545 -2740
5469 -2740 -12849 -17794 -43045 -42519 -66374 -73420 -81640 -67054 -37799 -17923 11574 13939 36851
5456 36851 22976 5599 11486 1271 -7734 909 29520 20098 -537 -15304 -29593 -28663 -10540
5443 -10540 -38507 -29743 -13174 -6230 13996 26517 37592 24709 24357 33387 19524 16265 4873
5430 4873 -3763 -3660 -12525 -24140 -7321 -149 -4975 12448 -22942 -26839 -7288 -12416 -18966 -48307
5416 -48307 -53149 -31937 528 5985 -24876 -35999 -25782 -15376 -27898 -57571 -67512 -67288 -44309
5403 -44309 -18703 -30233 -28634 -17167 -15632 -10952 -7919 -6645 -24023 3446 9625 17571 -912
5390 -912 -9249 -19145 -34974 -36358 -29839 -26290 -40483 -37535 -44062 -25528 -5906 -25587 -18532 -27193
5376 -27193 -42461 -42497 -39702 -65608 -66250 -69089 -67015 -43085 -25665 -36789 -47509 -19653 -9502
5363 -9502 8692 -3287 19820 13452 20666 -18976 -33598 -2758 -4963 -26744 -29726 -15801 -751
5350 -751 4545 -24539 -27056 -13573 -11911 -13961 -35652 -50041 -52503 -35653 -23151 -19106 -8722
5337 -8722 -8182 1082 -7171 -36399 -41426 -20122 -23581 -49006 -36178 -13123 -17000 -2584 -8027 -4316
5323 -4316 325 -24929 -18626 -22141 -17197 -396 4455 5244 -6491 7637 -1956 -27707 -22146 -2860
5309 -2860 9380 11240 21621 32845 8816 10012 18288 10007 -1347 -8114 -5587 6497 237
5296 237 -11021 -17393 -15344 -16337 -15683 -15395 -27079 -33518 -34705 -30410 -30365 -18660 -15024 -28303 -20623
5281 -20623 -14307 -7234 30392 12054 -27482 -33098 -52563 -68633 -47907 -52876 -47736 -42934 -17691
5268 -17691 -25653 -38649 -20982 -7184 -16394 -13156 -48596 -53320 -60762 -39986 -25180 -13416 -7470
5255 -7470 -19959 -38546 5846 72868 59854 43272 29762 9743 2966 -8306 -25243 -20963
5243 -20963 -64982 -80510 -84714 -84597 -108096 -76395 -50856 -37425 -5435 -37126 -49331 -22346
5231 -22346 13321 -14411 -31413 -3077 -13368 -45149 -27631 -28057 -2741 49275 23069 -22492
5219 -22492 -48930 -16685 -707 -18162 -30688 -25970 9562 17500 -6717 -55992 -52954 -5789
5207 -5789 1505 3995 -24374 -26600 -48038 -43107 -38764 -10747 324 2158 5447 -14930 4431
5194 4431 13020 -4266 6370 17634 -15284 -41141 -26927 17110 17789 10644 5904 21938 30503
5181 30503 31023 44179 39257 9567 -6754 7488 -5693 -32484 -41388 -36924 -13237 -5945 9374
5168 9374 29705 12386 -8673 2533 -4083 -12919 -2305 -15412 -25759 2789 27828 27305 8552
5155 8552 -36028 -20474 19496 48806 40643 42144 59051 35087 29960 25281 -810 -18165 -12001
5142 -12001 -17181 -13897 3624 -13423 -31695 -22004 6370 13764 1668 6027 14221 24306 18546
5129 18546 21181 5253 -17058 -9115 -13247 -14756 -25588 -31912 -17653 -9148 -23970 -14545 -24379
5116 -24379 -688 -886 -18763 -9078 -2426 -14632 -28641 -43385 -36014 -35657 -32185 -2347 14957
5103 14957 129 12013 943 -22344 -26082 -40878 -36723 -6730 4298 -17012 -7207 17941
5091 17941 6467 -20917 -30165 -11183 -15329 -15077 -38144 -38524 -20032 -14350 -23637 -17769 -19477 -46446
5077 -46446 -18998 -307 -1652 27434 43079 30466 11969 23366 12333 -6765 15691 -7556
5065 -7556 -18149 -23388 -21976 -22755 -18174 2457 10706 -1316 1184 -3528 -11494 -4061 13480 17349
5051 17349 19656 37766 44343 43191 56181 72241 31609 14839 -3146 -13169 -32194 -30760 -13480
5038 -13480 -11050 -6861 -35277 -21895 -2959 6350 8662 27473 12213 -16538 -19736 -32480 -19259
5025 -19259 31347 35910 5842 8277 25053 26533 32181 15032 10108 18341 27612 5109 -20339
5012 -20339 -31563 -747 -11787 -19569 5498 15845 3728 12230 28059 2019 5472 5716 -11015
4999 -11015 -6617 20379 20943 4473 -24710 -25898 600 12356 18834 22104 11783 29610 18417
4986 18417 -13628 -54454 -63199 -60876 -37169 -36677 -25496 -28728 -26241 -34465 -14798 11828 27034
4973 27034 24670 45718 37487 -1881 -15412 -1180 21853 -20341 -40095 -20400 -33605 -17973
4961 -17973 11515 -6942 -10132 -693 2101 -15867 -18377 -5886 -10875 -9631 18134 22400 42870
4948 42870 40950 36902 16998 12392 -3809 4739 19678 19985 -5582 -7733 -13017 -4781 -23976 -12065
4934 -12065 -30789 -30622 -8593 1131 29483 29465 18671 5803 19167 32149 34703 12779 -9759
4921 -9759 -3918 15730 -5093 -10726 8947 -1507 -11895 8797 9934 4399 1613 -7701 -26286
4908 -26286 -20065 -12142 -19299 -25795 -13773 -19857 -41743 -62421 -60099 -67787 -11127 7443 -3383
4895 -3383 -22024 -19539 -19285 -17190 -7538 -18540 -23984 -39538 -70018 -82687 -69230 -48082 -15567
4882 -15567 6681 -1325 -17712 -26196 -13110 23183 22668 -10558 5261 -796 -14446 -10177 -10626
4869 -10626 -29896 -68476 -62439 -55487 -48786 -44620 -35805 -26566 -28506 -42200 -44446 -64082 -82929
4856 -82929 -74904 -43621 -30620 -28476 -28632 -34271 -20097 -15678 12945 17855 -5409 -21056 -30575
4843 -30575 -18542 -13548 -25729 -15101 -231 -17116 -10683 10778 31328 22765 6860 -22247
4831 -22247 -35486 -33383 -6575 10370 26692 41783 31185 3476 -8217 -10866 -11970 -25669
4819 -25669 -57565 -49399 -43428 -44122 -27825 -23851 -31228 3850 10496 -39589 -75160 -74287 -72134 -69301
4805 -69301 -52348 -43125 -18254 1257 -21783 -49489 -39970 -31151 -16089 -9555 -3877 9855 4920
4792 4920 4193 25968 2909 8491 16615 20080 -885 11072 -6608 -9846 -19413 -8291 13040
4779 13040 18479 -7524 -1993 -3276 -2934 -5537 -5820 2827 1932 24164 27671 3679 -12742 -27283
4765 -27283 -30846 -49783 -60215 -76504 -64999 -58137 -50332 -52118 -27274 -15203 4245 -13257 -2847
4752 -2847 2489 -18546 -1908 34126 61696 71594 26789 21540 22217 18018 7503 -6332 -1262
4739 -1262 10859 26730 9678 -5218 -12849 -3944 -22689 -20261 -14137 -4158 11404 23675 5401
4726 5401 -32612 -28083 -34505 -10259 -4660 4621 6230 7658 32019 45275 26090 -24541 -48911
4713 -48911 -25446 -6920 -5641 -3892 -8156 -27280 -21610 -3263 -4370 -2561 -753 -17676 -38488
4700 -38488 -21662 -13603 -34463 -42365 -51971 -47350 -31512 -29829 -30862 -14238 7416 -10540 -29926
4687 -29926 -27743 9247 42400 61321 53914 29232 3851 3582 -3284 22126 9981 7816 14131
4674 14131 -11446 -21757 10396 28995 40455 16482 -9879 -32441 -46910 -39307 -25214 -2385
4662 -2385 -8142 -10019 -47400 -33727 4624 19556 5115 1887 -7786 -19176 -27783 -55204 -75513
4649 -75513 -44857 -53212 -41593 -7472 3421 -5038 -29607 -51748 -55434 -52136 -59647 -38412 -18442
4636 -18442 25705 19048 -8653 -14070 -11816 -21830 -36458 -30272 -32422 -32139 1787 1017 -15699 -8569
4622 -8569 -13467 7069 -6241 -13425 -28874 -45880 -430 18737 2855 -1953 10111 -29856 -51321
4609 -51321 -33832 -1918 27782 21558 22910 25248 21259 37751 20223 -20032 -18404 5349 -1533
4596 -1533 -17959 2135 7236 1350 1961 3669 16605 13397 2362 7315 -5245 9866 27094
4583 27094 24078 11171 12677 34075 13369 -19181 -11114 -26894 -20564 -12039 -6326 1640 42325
4570 42325 34574 38834 43593 17296 9024 -1417 -4484 -21085 -19610 5340 7800 20520 11209
4557 11209 -22660 -43013 -6908 13822 -15298 -18105 -6029 -18899 -7228 1306 26551 23742
4545 23742 14492 20538 18759 2471 -23933 -19551 -11871 -28063 -51439 -35737 -27781 -11554 3471
4532 3471 22167 25987 8615 -21010 -30863 815 28174 -3629 -9020 16907 1189 -2449 -10682
4519 -10682 -43599 -24490 7601 11642 1161 -5048 8544 24875 17452 16166 27198 27682 17223
4506 17223 9786 27392 17400 7107 -9713 -19217 -17705 -45483 -14644 5770 13804 4085 31794
4493 31794 10361 -19662 5534 9259 5057 5249 15350 11440 1903 -8369 -1008 11270 5586
4480 5586 15723 -8963 -24103 -19768 -26991 -34911 -33313 -37635 -20889 -34694 -60075 -61534 -38817
4467 -38817 -15810 -33774 -32799 -17032 -12955 -14488 -13266 -1827 -16041 -22744 -28290 -39878 -55053
4454 -55053 -65497 -45290 -30139 -22104 7370 19262 14966 30233 38447 11259 -17424 -30526
4442 -30526 -59205 -79654 -47826 -26053 -19020 -25789 -12706 6112 2033 15552 25352 24903 3167
4429 3167 17507 38175 14997 -27617 -26768 -20444 -13571 -13825 -24805 -33458 -35160 -29914 -12608 11540
4415 11540 4747 11169 14008 -3074 -22554 -44249 -35510 -6896 -11624 -9739 -9165 10049 20261
4402 20261 -25286 -28248 -8456 1982 -21296 -35361 -23462 -33074 -44156 -6667 10522 20132
4390 20132 13708 50236 47867 21102 5353 -13805 -17830 -25932 -11752 5077 23949 21571 8811
4377 8811 10761 25145 28266 8871 -20211 -17576 -12457 28571 50328 39381 36146 9811 10062
4364 10062 -262 -15654 -5272 -15730 -29082 -19529 -23670 -29679 -7607 7191 18213 21776 6339
4351 6339 -19243 -22922 -13482 2130 22421 -17561 -46309 -32503 -28740 -47414 -52180 -25439 -17295
4338 -17295 -15782 -21129 -35398 -21399 -35466 -29375 -7128 5178 21600 26138 39106 9745 -11612
4325 -11612 -19428 -12616 -15374 -5240 620 24915 1172 -13867 -2470 -5622 2244 7605 -18594
4312 -18594 -52838 -78956 -67282 -44004 -32065 -12330 17895 25181 -1161 -6939 3110 -13777
4300 -13777 -20539 -16461 836 18227 24218 10191 -19151 -48090 -45823 -22439 -11959 -7946 -9905
4287 -9905 -6658 -15335 16985 26619 37139 43459 15637 -18977 -54194 -36328 12950 16133 16044 -7837
4273 -7837 23956 61718 57394 -2127 -12832 19317 29496 2722 -1176 -17416 -23270 10363 29613
4260 29613 28350 36615 30280 -3709 -24536 -43315 -31587 -25627 -17758 -8862 8272 19353 7585
4247 7585 3240 -27661 -33652 -43671 -54826 -74833 -62597 -23737 -13170 -9857 -5440 -27248 -19440
4234 -19440 -22782 -11417 -23617 -51986 -48550 -53753 -22806 11831 29022 -2903 -464 26231 30451
4221 30451 14387 3983 5455 -19753 -21313 -8774 -1906 6105 -2505 -6419 3519 165 27827
4208 27827 6132 -42830 -41143 -45877 -52648 -38244 4576 26033 33773 33978 6400 -576 23058
4195 23058 21181 22050 -8929 -33413 -24838 -10587 -8514 -13036 16389 15382 -10057 -8519 -19993
4182 -19993 -11551 6320 10417 -1203 -34603 -30281 -35316 -44905 -43787 -12020 -31408 -22895 19298
4169 19298 25963 3976 -37366 -48416 -41679 -32768 2886 4382 -8227 -1722 10144 21002 17359
4156 17359 29736 21466 24985 -6640 -27545 -28343 -26882 -5128 -3097 -43227 -37501 -30859 -73075
4143 -73075 -73355 -62698 -52045 -47052 -38535 5401 5716 21925 43541 56317 22073 15147 4012
4130 4012 -10853 -1653 32310 36563 26248 6525 -23320 -27667 -27719 -12492 -41786 -52917 -22451
4117 -22451 -52695 -76549 -83740 -71284 -28046 -26938 -31928 -52324 -66390 -58559 -25305 -2343 10777
4104 10777 8721 -10819 -31098 -19494 -35810 -42890 -56611 -79811 -27849 5717 42921 52284
4092 52284 31847 19845 5984 2136 7825 -21111 -11695 -22405 -24035 -9910 12133 4633 2766
4079 2766 13846 10029 3995 11425 8487 22931 34425 18559 -2037 86 30120 75280 71780
4066 71780 54580 31112 14045 23159 16841 15160 20877 33186 18845 25043 48413 24062 26956
4053 26956 4123 13223 25428 22668 17157 -16121 -18204 1364 -17861 -31421 -27583 -19231 -55502
4040 -55502 -77668 -57524 -61004 -39733 -29709 3805 38501 45459 25161 12943 -12140 5650
4028 5650 31856 11196 -10034 -51265 -51501 -13383 -6460 -22874 -12881 16040 -211 -33244 -69963
4015 -69963 -50848 -1667 -15611 -23943 -13554 -41436 -25769 -26634 -28759 -21224 -15255 100 -7931
4002 -7931 -32067 -6194 13306 61027 49743 64160 43951 -5633 -7969 24526 29932 33369 32204
3989 32204 -20712 -28463 -28224 -3321 8445 45700 25465 42937 47208 53546 67018 52486 29427
3976 29427 2522 -43202 -23228 10254 10680 -8980 11477 31200 45997 54367 47991 31548 8880
3963 8880 5240 34563 60936 40359 29034 2456 -5367 -24285 -15254 -6825 -32197 -8723 -10740
3950 -10740 7126 19963 -27273 -36126 -40863 12031 21822 8842 11101 -6679 -437 -14469 -30312
3937 -30312 -28780 -13810 -24159 -33871 -31107 -44738 -52688 -30440 -19509 -18862 -1318 10081 17319
3924 17319 -11455 2822 31599 42929 25024 8564 37572 27973 -8300 1710 -2391 -17956
3912 -17956 -16622 -22503 -8509 6850 18065 3595 -5973 -9811 3818 -16741 -57290 -46245 -22837
3899 -22837 -15099 8818 2617 -3173 -12254 9736 -9925 -29283 -15447 9213 11767 -23682 -35772
3886 -35772 -17376 -11584 7941 1872 2307 -11566 16460 20312 -14270 -32961 -49803 -46287 -58037
3873 -58037 -58071 -49658 -36833 -13525 4250 22897 33042 55009 28911 3770 -11407 -37337 -81716
3860 -81716 -64060 -51480 -18900 2309 15203 16802 26849 33524 15778 12872 36739 41720 30913
3847 30913 56155 48661 32837 28700 43077 47670 8097 21813 50952 58784 61780 36058 24283
3834 24283 11413 -11059 -30211 -2497 -2307 18194 14866 -3643 -10480 4790 17862 2892 -32507
3821 -32507 -36407 -31904 -31034 -18522 -6615 -27789 -57009 -63982 -67820 -58762 -15012 -4428 -7859
3808 -7859 -21296 -17780 -1771 21103 34599 17268 30342 18738 15819 36103 15310 -8253
3796 -8253 11349 1881 20700 2494 5990 8881 696 12215 -9725 -1596 658 2955 -4947 32425
3782 32425 17939 -3424 -4126 4773 -15957 -4986 16650 24062 574 7619 8778 -297 6445
3769 6445 26940 39371 30512 14998 14816 200 -13558 21016 41868 21830 2454 27832 39725
3756 39725 49582 16788 -7116 -10040 7147 4823 -6341 -29004 -27616 -2940 -5034 -16295 -32045
3743 -32045 -40729 -41617 -33841 -35845 -47879 -19474 -148 -7521 -9503 1865 -2764 -8099 -2112 16522
3729 16522 28664 55419 46273 11088 -17021 -13469 -11983 -1860 -5074 -4776 -18475 -15 13634
3716 13634 4461 10570 17112 -26716 -45907 1688 30783 28251 29708 25441 4442 -22528 -36831
3703 -36831 -31335 -1191 11533 3047 -16850 -984 3313 7137 3619 24230 38047 49561 56534
3690 56534 63848 62490 43466 24908 9865 -21245 -25871 -17417 -8262 16032 11878 9448 15811
3677 15811 -2011 12677 18760 -1391 14616 -14298 -13497 9037 207 9974 12388 2000 -8677
3664 -8677 -2973 -14623 -19043 -9105 -16666 -12375 -46590 -21902 7839 -1516 15594 15208 3453 727
3650 727 -15666 -3110 13049 59302 74862 61002 39575 5627 -24455 -8080 9594 24307
3638 24307 -6574 -39749 -49595 -50397 -40103 -32054 -37239 -4832 18620 21889 1175 -4993 3693
3625 3693 20487 15140 13165 16284 -5465 15289 4254 -20510 -39661 -25417 6002 5631 8133
3612 8133 705 13901 2389 9906 5231 -27889 -3995 19335 -1389 10320 -6106 -31887 -16122
3599 -16122 6827 22737 12227 -4952 -28339 -62221 -61091 -38384 -44669 -34830 -32793 -26920 -21957
3586 -21957 -12580 -6448 27553 38978 29399 9032 -3832 -1419 1801 -27011 -45280 -38636 -21316
3573 -21316 -19246 6192 6615 6388 22559 4854 -5182 -22050 -37852 -38960 -30916 672 20135
3560 20135 29227 -1518 -8926 -3685 -50885 -50331 -21495 6574 -15411 -2795 7506 -26024 -24578
3547 -24578 -4674 -37040 -31673 5391 18368 12354 13708 -23803 -39767 -53534 -18812 -34424
3535 -34424 -29205 -6096 -10116 15322 24114 26868 24240 21182 17303 17115 -235 -19583 -30816 -25725
3521 -25725 -19385 -27272 -5647 13378 18643 12977 14163 21216 -14278 -30951 -17045 -21737 -52206
3508 -52206 -51154 -40120 -29842 -30543 -15888 -3930 -4205 -22032 -27567 -24908 -47421 -5292 18817
3495 18817 35483 55192 75325 84968 63007 44870 17920 18802 36572 51617 33548 35581 10098
3482 10098 -36768 -31547 -60458 -44743 -25350 -19112 -39860 -35564 -14384 -14648 -39274 -34651 -20123
3469 -20123 -24525 -7683 10901 -3643 -4999 -18250 -30183 -5634 -3173 17451 30055 23754 26654
3456 26654 9320 -21 268 23708 46008 16942 36317 46205 22580 -37563 -43607 -24354 -18089
3443 -18089 -3940 -22537 -38587 -30415 -19934 -3609 -13961 -20174 -33619 -42322 -22669 4850
3431 4850 21006 -5951 -15781 -31329 -51068 -67141 -44683 -596 4568 -11547 -18572 -34839 -42680
3418 -42680 -53780 -32767 -9167 5192 -27526 -5795 39157 53375 38489 35858 41501 67911
3406 67911 75269 50083 25888 50164 52926 35835 13162 40292 70539 73347 60584 41002
3394 41002 -430 -50222 -35386 -44271 -28060 3037 19448 3301 -29154 -38893 -44720 -45016 -27512
3381 -27512 1858 -3347 -3904 -4880 -2324 -5370 -11877 -44984 -18411 6839 3005 34974 52967 69526
3367 69526 36099 -3005 2225 5 9860 11719 -18777 -10346 463 19453 18131 42217 63014
3354 63014 59252 53010 48557 22332 -16159 -7946 6048 42314 43364 1828 -36051 -35118 -19796
3341 -19796 17264 15786 -10414 -20270 -21126 -16460 3688 8922 5697 -13543 -19314 -9591 16172 5635
3327 5635 -25621 -26842 -459 -4984 1198 4423 -6363 -12627 -43825 -53683 -45044 -30487 -19206
3314 -19206 -22720 -5539 11456 33951 50608 33310 32590 43501 6266 -12012 -13726 -25404 -62140
3301 -62140 -74336 -43853 -26946 -26498 7916 4391 15939 46588 35246 27557 31534 8208 -6773
3288 -6773 -23091 11844 56712 49131 33866 24384 32196 21514 41875 15478 -2710 -6414 -15335
3275 -15335 -14086 7414 -7726 -1505 13215 28451 41180 46510 41214 38566 49950 59653 48877
3262 48877 20801 -13087 -37665 -35639 3956 12591 14732 8366 5743 20554 27055 31312 41606
3249 41606 29753 -4462 -16875 -7084 8174 -8781 2837 -11076 -13228 -9368 -1260 9914 17475
3236 17475 -3264 -9024 1817 4258 -2042 121 12731 19425 -21679 -28492 -10548 -24171 -31331
3223 -31331 -37742 -9128 15147 14788 -14039 -16391 -1883 -11473 -5547 -9154 -23184 -3342 5067
3210 5067 -10706 -38973 -27359 4236 11827 1452 12459 -22967 -31426 -19940 3030 2409 25777
3197 25777 39734 14728 8532 9512 12874 3180 15653 20202 7010 -19029 -70062 -64856 -23336
3184 -23336 21100 39876 39476 42828 43704 2305 6878 11566 14859 3320 13004 3747 -27721 -49543
3170 -49543 -38684 -35665 -55712 -58547 -51884 -30500 -4620 31 -2936 95 40849 68315 38737
3157 38737 17503 52364 40662 33635 41186 36905 10761 -18710 -30198 -1146 24366 19344 25813
3144 25813 13601 -3459 -13489 -17594 -3999 5167 -699 6916 22569 -16244 -26065 -22141 -9637
3131 -9637 -13941 -4010 15440 5677 15889 44793 57488 15142 -1499 16168 17253 -17772 -41217
3118 -41217 -51694 -57182 -33608 -35829 -27451 17128 11782 14536 10137 28953 39260 41431 60004
3105 60004 61229 27464 16395 18203 6116 -7475 -10305 -2897 2987 148 7834 20795 -5160
3092 -5160 -23828 -20540 -22430 -18009 18472 31759 2766 -2409 -7827 -10400 1624 7937 16238 31987
3078 31987 38441 28240 42745 41759 58557 51248 48378 13678 -23272 -14650 15447 27882 4740
3065 4740 -14688 -13676 -12031 -10293 13287 31291 47961 23982 -11834 5561 31181 14970 21362
3052 21362 15044 -9922 -28487 7753 15288 28614 42542 23467 5583 -4669 -22566 -17885
3040 -17885 13330 9413 -2704 -17753 -13904 -5107 -24860 -24186 -56013 -56087 -24914 -4682 2113 19828
3026 19828 30555 8095 21852 43335 38030 27010 33951 23856 16012 5233 -19084 -37235
3014 -37235 -47871 -28140 -27827 -33858 -42560 -21435 23064 44223 27835 5568 -9024 1429 16267
3001 16267 28219 2721 -28135 -28803 -10475 16801 26389 -3455 -49879 -4709 12651 -19639
2989 -19639 -24048 -34926 -13678 20812 9007 -10256 -13101 -3849 15030 11261 -9559 -14542 6586
2976 6586 37340 31942 15847 16426 15870 16824 -13066 -12821 -16031 1939 6527 21062 48301 44153
2962 44153 22289 -202 -23370 -8799 8694 -2496 5767 6581 -10773 -28404 -45261 -41225 -27345
2949 -27345 -9402 -8942 -9504 -16908 -21314 17315 48503 44029 -4194 -23098 -11103 -5248 -10713 -30614
2935 -30614 -32888 -26309 -4275 -1925 -9648 373 9686 22295 27334 51562 31102 20380 6324
2922 6324 10283 14982 -1142 320 11574 19167 20880 -26895 -32625 2822 22876 20817 -13960
2909 -13960 -22656 -42736 -30584 -235 26762 46715 54799 64038 54133 52754 30580 26316 1131
2896 1131 20279 13861 -24588 -48270 -26244 -5741 25508 34536 44765 53688 35256 10252 7992
2883 7992 13040 -6539 -22645 9682 17343 13264 -2226 2828 33010 49308 45699 37459 30930
2870 30930 50088 43502 34648 51817 38954 43874 44894 36403 37967 22426 40132 30433 4196
2857 4196 -13157 -8879 -8638 -36961 -21030 -2448 7884 6933 24781 11515 8476 -3641 -10112
2844 -10112 -25112 -47746 -13208 -10795 -21095 -29514 -11226 -11748 -27915 -38501 -40577 -28323 -10270
2831 -10270 -1195 -6591 -9659 14297 17418 13948 -1970 5239 11056 -931 15200 15066 21869 -6188
2817 -6188 -38251 -7101 25359 25358 31576 28676 13453 17977 28576 -11071 -17978 2352 -15509 -14136
2803 -14136 -5617 16898 35323 44931 26633 18894 12152 3376 -571 -26085 -39723 -55123 -31723
2790 -31723 -23685 -43501 -47427 -20641 -39524 -43170 -26150 -4391 -3130 -12606 -17669 -12320 -20166
2777 -20166 7806 15908 -16553 -32207 -29377 -11241 7136 21765 31632 35700 13339 18439 15879
2764 15879 30959 40787 39207 28045 -4792 -6927 -4013 5911 24084 35271 34293 42788 23418
2751 23418 18494 633 29155 33274 27874 47469 7384 -2618 16325 -4943 -16708 -31179
2739 -31179 -5870 11390 528 2380 27740 39481 31428 2249 -12797 13092 21143 2626
2727 2626 13937 -20433 -38018 -55305 -62375 -57524 -63124 -44120 -32029 -52668 -42143 -50012 -45789
2714 -45789 -40596 -22357 -16660 -10723 -18501 -21151 -23279 -20426 -12953 -23626 -15909 19984 1512 -8605
2700 -8605 -16670 -11699 -2853 -7274 -21714 -34653 -14736 -4979 7090 -5664 -4464 -7419 -4447 10588
2686 10588 26526 22687 12654 -18962 -48165 -27287 828 13201 12353 1639 10666 -4891 -11964
2673 -11964 -10644 -26191 -12563 -494 -12905 -16143 -3546 -2102 -35013 -38551 -40550 -29385 -11519
2660 -11519 -9445 -12890 3386 9608 25925 27890 -760 -25698 -32355 -29427 -33649 -33716 -50095 -20471
2646 -20471 1807 19369 10731 -595 42778 85049 50174 18186 -10773 -10614 17148 56781
2634 56781 56117 51891 22794 -13533 -1480 16005 -6266 16492 26506 1594 988 -23977 -34767
2621 -34767 -16099 -16206 -11455 9983 29402 52063 59035 60047 29689 17510 25743 25910 48987
2608 48987 48979 16049 5790 -5293 -3581 26021 28972 12021 10418 -5343 5954 28170 33823
2595 33823 22542 25641 12468 29910 27912 24724 22816 19049 24124 18146 5857 -35995 -40195
2582 -40195 -25457 6369 16063 38499 29143 3113 6179 18998 12380 8129 -18524 -12857 4806
2569 4806 2920 13558 -2669 -14858 16612 39026 9439 -21958 -2024 31692 30021 39425 36143
2556 36143 26736 19813 25889 30050 29276 40415 28045 18501 7581 -6724 15146 13644 11732 14591
2542 14591 24310 38643 53828 30334 14831 10276 18841 35190 38040 17537 8093 -4588 4319
2529 4319 6834 19285 28970 24418 18655 29023 11785 14960 23871 35981 31219 8735 -17378
2516 -17378 -42343 -52462 -49970 -23167 -16509 1509 -8478 -19277 -37432 -56642 -55505 -50633 -54277
2503 -54277 -52442 -48295 -20490 1274 -1524 23830 33881 35621 1703 -3946 -37773 -70219 -26002
2490 -26002 -5947 29703 60333 52471 156 -13207 -43722 -58703 -11069 -7445 -24261 -33619
2478 -33619 -56538 -24517 4893 11894 18162 56530 54342 21748 -5135 3516 -6355 6269 7573
2465 7573 21146 1438 -27001 -51034 -25789 18750 -303 -8671 33615 61123 43089 -5699
2453 -5699 -9323 1902 2331 18683 33196 16465 1739 16203 30172 18582 9647 38040 47700
2440 47700 43918 36190 44548 21524 -2964 -23607 -23918 1347 28979 8439 -16374 -6120 15647
2427 15647 42864 28729 43175 35992 -17473 -29201 -39376 -31615 -15768 -21165 -9108 -5158 15173
2414 15173 9409 -20658 -24508 -15884 -4878 11627 -6874 -42201 -37408 -30240 -8124 21597 20317
2401 20317 3448 3762 17630 24084 10731 8753 -31346 -38030 -12685 12403 2546 -7245 -28573
2388 -28573 -17465 -13774 -34404 -30327 5312 52703 71810 50664 29246 13843 32614 40418
2376 40418 473 3380 13144 7713 9889 32226 21579 10889 35151 17509 20110 37359 19697
2363 19697 13785 24754 27520 25511 9323 -12079 -6452 6511 -6065 -31217 -28674 -34852 -12904
2350 -12904 -13024 4083 4218 -3200 17931 36755 33660 19198 441 10370 6494 -2275 6533 18374
2336 18374 21968 11054 8572 4772 335 -14902 -9793 3458 26632 25103 15046 -5991 1580
2323 1580 34099 17112 19052 11137 -14802 -17505 -9091 -36776 -48693 -45223 -42796 -38552 -10830
2310 -10830 5647 -15152 -10364 -11357 -13776 15449 38558 16669 -20886 -17313 24562 8511 4089
2297 4089 13627 -1475 -10185 14301 11933 22812 43674 15873 -33722 -37662 -51541 -49020 -39001
2284 -39001 -26079 -38301 -53350 -13892 31265 39187 37242 27646 4147 -1646 6614 2036 20375
2271 20375 29627 5607 9541 4248 -7252 4405 16139 35285 4803 -19798 -27526 3608 17250
2258 17250 2730 17038 7238 15252 35503 6705 -10495 20317 51007 32489 32241 33993 -7702
2245 -7702 -9330 11169 15823 22513 62045 80444 64676 58342 48938 -7 -3227 22724 27159
2232 27159 1562 -34753 -46977 -46901 -51614 -7197 -5132 -14760 -13963 -21563 -22482 -16960 11875 35855
2218 35855 1369 -1857 -17060 -29210 -24027 -35259 -44514 -25686 -15155 -26648 -24940 -14455 10127
2205 10127 42156 48096 37308 21410 -8026 1396 7374 -17705 -28298 -17547 21605 46204
2193 46204 66581 27050 6352 -14874 4859 28685 14526 -10166 -11883 -10171 1513 7798
2181 7798 -9169 -11050 -1270 7451 8163 -15395 -20957 -6466 -14976 3273 29298 26645 22116 24092
2167 24092 33134 51346 42930 14215 3534 8223 -4229 -13849 -38316 -20465 32363 51847 70051
2154 70051 45467 67913 47157 -427 8583 17909 29547 43149 48783 33737 36241 20296 -6148
2141 -6148 -24017 -34882 -1529 30451 75654 69913 72797 36066 11938 -15376 4898 13260 -8999
2128 -8999 -46798 -37190 -26113 -22370 7676 3649 11249 56348 57966 45771 46306 30858 -5713
2115 -5713 -2233 24056 40614 40066 48309 53668 18781 -15958 -20625 -4871 -6792 -31167 -53164
2102 -53164 -50720 -27477 1101 4588 -5635 -15770 -19320 -4081 -2447 -15345 -4944 2536 -16576
2089 -16576 -14198 21568 42406 2259 -28753 -32132 -34506 -29684 -1778 -14066 -45136 -35111 -6901
2076 -6901 -5431 -20515 -35481 -42562 12564 52675 33722 35877 36684 23884 40368 49534 42507
2063 42507 36167 11889 33590 28786 -10085 4766 13987 24431 29566 6535 -16734 -18121 -27601
2050 -27601 -9495 3466 5960 14403 -4567 -26839 -13834 9019 -11141 -12370 11700 9958 -5265
2037 -5265 -14629 -5001 -16662 -28316 -28318 -36164 -26197 -329 -14122 -13454 4311 10580 20227 44165
2023 44165 16635 1325 12320 13559 1042 6154 10973 37629 84814 85080 98205 100718 87868
2010 87868 76968 53119 19080 -9877 -39917 -52787 -31875 -10986 18913 27870 41531 30112
1998 30112 35699 12917 25356 32904 12834 12658 535 9043 23489 15717 26596 37197 6190
1985 6190 -8385 -9251 -2978 -17902 -25854 4052 7801 7101 12265 -5468 -9563 -20245 -32279 -22141
1971 -22141 -31945 -21651 3344 9799 24918 10701 6393 9868 14740 28655 14780 5105 8385
1958 8385 7822 525 -3176 -7164 -14758 -24898 -23294 1618 -1842 -4933 -13845 -24930 -24157 -30104 -26219
1943 -26219 -31661 -18315 -5989 -14847 1845 25997 6826 -43591 -35936 -17592 -14121 -3577 -13007
1930 -13007 -22167 -38221 -12490 28891 18071 -6241 -26976 -14614 8527 -4791 -22268 -19462
1918 -19462 -26616 -47213 -33523 -38756 -27797 -27578 -37114 -37496 -15940 -22837 -19391 -21750 -11511 2877
1904 2877 -230 -25749 -37737 -23797 -14599 -24252 -20390 -17344 -25191 -2043 -7425 -14719 -13473 -3468
1890 -3468 -4281 37325 37960 27231 51230 33847 -4118 -5456 638 -7131 15250 25088 52172 64179
1876 64179 43059 21634 8096 -7611 5 -1085 24787 59064 49531 17565 22513 24836 24969
1863 24969 16671 1803 -12012 -2106 21772 11152 12924 6423 6123 3174 -6603 3221 17732 18989
1849 18989 14882 26469 32795 -1736 25914 30797 35 -36882 -57554 -37624 -21767 -20060 -38327
1836 -38327 -30554 -15264 1004 17135 3361 -21002 -25495 -25755 -38256 -44574 -22165 -4921 11430
1823 11430 12984 18881 42830 68031 66818 52471 49668 51482 30716 -1463 9018 24962 15947
1810 15947 42489 53561 25798 8577 3883 413 6846 -3604 2715 15094 -9714 20755 -620
1797 -620 -27720 -23434 -35882 -25093 -11721 19115 22029 14698 23513 22551 18671 24270 31517 24030
1783 24030 -11531 -6771 -6154 -25121 -33248 -21802 -20027 -10878 -37736 -37924 -35868 -5596 20982 41259
1769 41259 26675 31429 15968 2318 3241 23756 55173 22339 -3766 -7889 -12218 3689 -18157
1756 -18157 -40535 -37627 -8333 -8610 -22458 -5575 16218 17261 6979 9464 17974 35771 28425
1743 28425 41221 35941 45803 37493 6037 3406 19153 23209 16529 39666 34675 24407 -20258
1730 -20258 -34227 -1290 -20923 -17334 21177 47743 33473 12286 2280 -13622 -7558 -14041
1718 -14041 -7097 202 7619 -80 6397 -16380 -34394 -17168 -10317 -18264 -24915 -18483 11614 26305
1704 26305 34678 1003 6521 10791 34498 37629 34136 3395 12996 -5031 18559 46084 46449
1691 46449 23623 17480 15959 10860 23820 36470 34573 17791 -10408 -14103 -18950 12584 26774
1678 26774 21232 41444 30877 38505 10836 -4532 5649 -765 -11226 19142 38348 30172 14010
1665 14010 -7296 -17963 -19246 -15571 2750 -6754 -647 -4419 -4035 -13424 -26905 -32378 -8921 2564
1651 2564 6475 23312 7913 -24304 -25968 -3369 13723 14045 17981 30830 49272 52323 39782
1638 39782 28646 25414 8822 -2801 26873 7844 13116 30208 28107 -18488 -12679 5632 19597
1625 19597 10229 -6748 -37683 -40543 -16091 -6129 8412 31107 9848 18037 23616 7264 -9764
1612 -9764 -22851 -47889 -56049 -71672 -60261 -25240 2279 2015 -2414 -1878 21310 33018 62008
1599 62008 58331 33295 33480 27079 24305 30401 54400 36522 35508 41463 50515 67936 69114 67658
1585 67658 47724 17626 25426 31457 1144 -35978 -33539 -20124 7553 27296 942 -23175
1573 -23175 -20705 -16915 -6273 -8707 -2011 -2343 13027 9184 -13792 1903 -7392 -7793 -22763 14394
1559 14394 29120 19736 986 -10897 1933 16967 4761 10665 17448 -5630 -7449 497 -12388
1546 -12388 459 33092 37178 18154 1664 -12753 -9996 23222 42501 45636 31732 -333
1534 -333 1142 -871 26335 32786 -8913 -40882 -19272 22443 33591 21029 10880 12994 23289
1521 23289 32611 21157 2709 1977 12421 33105 29697 28212 33058 18366 -15720 -5797 4934
1508 4934 -9534 -26789 -33615 -3345 28550 6633 -171 -10485 -18610 -14560 -34626 -67892 -54658
1495 -54658 -11939 398 8276 17940 9451 28526 39444 76060 57993 9614 -1172 14709
1483 14709 -12246 -26999 -43720 -56518 -48065 -44886 -38169 -18294 -6361 7928 -8336 -35434
1471 -35434 -16577 15859 30631 11631 1157 1414 2782 -7933 -18057 -41165 -40257 -14936 846
1458 846 -14940 -6900 10922 21931 44513 45927 20166 18017 22320 -1007 5089 14738 19614 21438
1444 21438 2271 -16714 5174 28 16989 15142 20914 46866 57309 60909 52228 14356 22574
1431 22574 30539 27767 16060 -8591 -26332 5234 23005 10821 -18610 -32475 -26929 -30383 -40325
1418 -40325 -32138 -34545 -24043 -25259 254 40038 64499 54529 23807 14638 9384 -12371 4976
1405 4976 21579 21022 -8046 -6524 22418 42343 33088 18010 -4341 5224 4986 8700 -2472 -26394
1391 -26394 -12828 11663 13919 6546 21362 -19246 -65886 -76034 -87953 -57764 -32038 -13485
1379 -13485 5110 -20040 -2210 41070 32766 31654 32933 45372 40276 15903 28780 11233 -2560
1366 -2560 3205 30025 20799 27398 31476 28942 5276 -6034 -10685 10558 21884 13454 33449
1353 33449 23911 -1738 -2760 -29754 -21170 8289 20789 11542 10950 8450 -3517 6944 30351
1340 30351 26432 -1387 22326 27252 36425 44075 14087 9021 -13771 8835 34368 31334 35394
1327 35394 23788 -457 -6907 17068 10501 -10171 16664 20755 -3832 -12835 11517 1922 6534
1314 6534 7799 9975 8025 1599 11314 36095 72216 60976 33258 12389 18678 33493 43949
1301 43949 38680 22824 -4152 15022 43616 63621 34605 20040 22778 25483 36856 44199 37895
1288 37895 53283 58432 9641 3829 23864 10685 1262 -20280 -36812 -32378 -24722 -15268 -27518
1275 -27518 -29058 -21118 -16101 910 2718 -33679 -49299 -43518 -19661 -16466 -40132 -52273 -52459
1262 -52459 -23205 -6328 11467 22147 15317 13075 36539 68772 64543 27219 17998 12680 -2269
1249 -2269 -2686 16571 25246 32885 31689 16682 -3953 -18624 -27372 -19057 10868 28994 17421
1236 17421 3623 -9145 -35671 -47083 -33191 -40308 -21677 -9707 -3155 15104 25560 33021
1224 33021 27075 49131 23829 14545 28383 23449 -13968 -19748 -19150 -33669 -16692 10621 20541
1211 20541 21401 2320 3725 5586 25934 18309 10086 11301 16657 19024 9004 3259 8411 9278
1197 9278 -4568 -2372 12160 39308 46520 50684 12780 -1269 12134 24901 12902 41960 73335
1184 73335 60006 5720 -17346 -20561 -29315 -33352 -2674 6142 20080 14074 4494 27070 42877
1171 42877 56188 71289 69736 73095 79211 49963 31115 42390 50877 6894 -7014 21103 17340
1158 17340 -19889 -27048 -24123 14312 45109 43734 57027 15680 -12120 -7698 -2344 -27093 -24901
1145 -24901 -12927 23995 15449 -15866 -13160 -13561 -7638 -12682 -1688 14393 28958 20164 38418
1132 38418 20542 -15826 -14612 3418 25186 26864 10491 7047 7208 -25792 -27997 -27403 -52739
1119 -52739 -86715 -78798 -43259 -641 12961 17399 8990 20183 8073 -18222 -9473 8947 19860
1106 19860 20550 23684 22951 4087 -6060 8486 23893 12126 -16925 -47820 -29398 -17274 -6703
1093 -6703 -1224 -25098 -27876 -17846 -5920 -2526 -13258 -35470 -48578 -37151 -23120 -10393 -5699
1080 -5699 1068 26755 3108 -18930 -28668 -5028 29806 16705 -3841 3614 -19483 -4996 12715
1067 12715 39225 -595 -39092 -11957 14318 -1126 -13681 -5988 11121 -2989 -24481 -8369
1055 -8369 11690 14398 -10562 -17839 20719 45507 39318 31715 46013 68604 55632 17517 10551
1042 10551 43105 56844 64611 41155 33059 40426 33212 41283 45715 38118 21870 20799 1918
1029 1918 -14904 8203 27830 51476 65048 46669 14861 -5175 -13633 -29643 -32370 -14988
1017 -14988 4406 7503 25967 7420 6612 19413 7213 -7112 7812 21622 25027 5143 10010
1004 10010 18079 11070 9435 -10593 -16277 -14587 -6180 14270 15528 2594 -8781 3963 12278
991 12278 21108 41855 44044 40475 20509 -7887 -5041 -10394 -31726 -37768 -12808 4532 -64
978 -64 8912 -869 -182 2906 21771 29231 32605 46849 48523 20927 4108 -12271 -25751 -4360
964 -4360 38343 57590 59780 56363 25533 30489 60036 13290 -1089 -14159 -1915 12217 -4800
951 -4800 -22574 4025 5638 -11221 99 -4062 -2354 -24168 -14099 15885 33633 6675 -7514
938 -7514 4056 18039 13548 19239 21578 -2161 7035 2514 4243 -2019 -10860 -27990 -40934 -40764
924 -40764 -12410 23475 -6366 -26600 -954 -3417 -11460 3727 -13967 -42595 -28413 4765
912 4765 9586 -6764 4092 17385 11046 -3472 16538 5874 -3521 19304 33008 10070 8366
899 8366 -9528 -1447 15695 37800 48618 32057 5270 14784 20506 17930 1289 -7807 -8395 13483
885 13483 10844 4101 -22756 -27762 -35644 -28869 -19493 3311 29317 23844 -22647 894 -1478 -926
871 -926 -14340 -25404 -1530 6847 28039 46654 64424 47773 6206 26446 34915 39015 28004
858 28004 27453 14479 -13473 -13184 -13423 -11455 -39266 -38546 -2812 13280 24102 4180 -19487 -29528
844 -29528 -19352 10258 17731 16941 4424 15656 11682 30584 28583 27631 -2751 -7998 -2750 -6434
830 -6434 -16937 -7913 -29732 -67988 -62686 -33088 -11311 -4084 -14772 -4614 6961 -16016 -8607
817 -8607 2800 9180 -3171 -26360 -54818 -19542 30034 21193 -1529 -19639 -21676 -19772 -14253
804 -14253 -7718 -10231 -16250 9333 -17532 -42928 -17288 11470 17192 -7580 -12091 -12351 -15101 -37730
790 -37730 -42699 -52355 -59256 -6698 27143 22852 10627 -1314 -8645 -14557 -17417 1867 -6160 -14663
776 -14663 -18586 -12415 -8169 -5088 -11436 -5083 46203 50587 15153 -11951 -10759 5030 -10677 -28647
762 -28647 -27936 -18864 -36796 -12538 30432 22036 -8761 23914 33528 11864 3556 -10686 -42911
749 -42911 -28850 4274 13993 -15813 -2767 3612 28686 42716 38192 7669 6204 4525 13753
736 13753 414 -11005 -26564 9590 22820 15928 -16480 -57857 -58980 -34511 -40008 -38759 -27986
723 -27986 -14819 -26996 -16821 560 15476 34627 59883 39429 4361 6650 34675 65943
711 65943 68293 28905 -10104 -26472 -22055 -9794 -9110 -18476 -44746 -34312 -20939 -27732 -21724
698 -21724 -19216 -54172 -77311 -96687 -51767 8195 24516 35347 25607 39538 47934 58064 41743
685 41743 17326 21751 20033 25031 23193 15895 7760 -9434 -38150 -33763 -21737 -37023 -40904 -28764
671 -28764 -12466 -12957 -42869 -53807 -51199 -40016 -17189 -11000 -5132 3226 -27564 -19773 -10567 -7575
657 -7575 -12809 -29837 -50205 -61343 -55572 -27504 -909 -7312 -16657 -16288 -37881 -40130 -43585 -23133
643 -23133 3292 7228 39696 31385 -7439 2631 28545 -7027 -28768 -33187 -8544 -2337 4805
630 4805 31315 53974 52775 33496 30398 32766 36168 15646 7568 -20679 -48168 -72317 -54567
617 -54567 -50263 -57722 -63447 -42136 2331 22391 3628 -10509 1700 1620 -17403 -33978 -41209
604 -41209 5665 20310 40794 26705 11974 7367 -31879 -42941 -6428 5012 31997 42043
592 42043 12129 8492 -1006 -2382 4914 22119 14163 -4966 -9831 -26026 -40356 -39442 -38979 -36451
578 -36451 -10274 -15601 -32458 -32801 3235 -5146 -2095 -34650 -25755 -6177 17153 43936 46266
565 46266 28734 -11990 -21807 -10414 -24553 -31482 -38737 -22838 -8373 -2944 12727 13034 -20041
552 -20041 -43278 -51567 -56947 -56273 -44311 -15427 3000 -1614 6607 -19172 -45398 -31563 -5233
539 -5233 2850 14992 -2653 -19389 -6518 -25965 4904 37084 44397 61779 18581 -21038 -28498
526 -28498 -23810 -33404 -49144 -23249 -7133 5775 11423 16470 11335 -3554 -20214 -11538 2722
513 2722 24444 7455 -18580 -17074 9571 21847 -5342 -154 6992 12616 -12512 -43419 -43937
500 -43937 -44328 -47688 -42144 -23281 -18816 -2423 -10287 -45868 -30065 -29069 -18827 4866 13267 4254
486 4254 27575 35821 15115 7728 -14776 -45122 -63867 -56414 -37766 -35882 -16889 -14118 -8814
473 -8814 -26478 -43154 -39567 -46060 -41077 -7260 19395 4495 7647 7449 9536 12627 32603 14987
459 14987 -11517 -12627 -13392 -2051 16657 39976 29698 15540 -1964 -21003 -5925 -2785 -6067
446 -6067 -15697 -3792 36296 59201 55136 49842 58801 53238 51191 51298 48444 35789 45907 47779
432 47779 38546 22403 3081 -8105 -37519 -38709 -28807 -28025 4980 15955 34228 3553 -16719
419 -16719 -8477 -30030 -16793 -12347 -12087 1289 4317 18468 -2911 -2737 8980 -12271 -27591
406 -27591 -19022 -36168 -9745 -19875 -31268 -49312 -48940 -36966 -25833 -50961 -46813 -38714 -17385
393 -17385 -24125 -37811 -11183 -18409 -45342 -39623 -18260 -19834 -24773 -30088 -45326 -53507 -27403
380 -27403 -2422 -20475 -44410 -43693 -31080 -7392 -15090 -21970 -9579 -6583 8373 34222 18691
367 18691 27181 41150 32485 29461 47442 28594 -6 -21307 -21598 -13951 -10874 -6323 -12112 7173
353 7173 -14401 -34791 -23691 10585 43800 35996 4543 -27079 -31038 -19496 -31945 7557 18386
340 18386 -10592 -16910 -26543 -17181 2415 3658 11524 -2914 -13208 -23129 -34932 -8842 -8493 -21619
326 -21619 -20212 -1090 7875 26784 -15766 -25346 9578 28572 -1249 10271 35798 64191 43085
313 43085 22537 14513 13014 203 3308 -3510 -23607 -5409 -8795 -8765 21095 18558 20331 17369
299 17369 2284 -15815 -28132 -27467 -14330 -8044 -22665 -34493 -30791 -25067 -33578 -2017 -9352
286 -9352 -16814 -6360 3738 -10532 -22850 -20733 -15685 -23005 -24482 -25137 -17837 -465 28656 44068
272 44068 52920 25296 -10375 -32966 -32588 -34779 -31833 -26309 -12389 -3880 5842 -2752 4538 16188
258 16188 -1808 -4063 11233 5307 7505 18819 8862 15783 -4786 -18874 -27387 -50153 -38201
245 -38201 -26301 -33533 -21744 -35695 -41037 -63309 -63293 -31827 4252 7193 -20726 -44392 -34804
232 -34804 -19115 -13585 2859 21817 36628 27594 37916 33407 2246 -17689 -32225 -34312 -10249
219 -10249 -3441 -47973 -34910 -2505 -10565 -5215 1982 -6251 -20708 -18765 -10415 -16055 -12768 14479
205 14479 -6444 -13539 -30639 -17825 -21756 -10036 -10902 -7941 -3905 -9394 -10335 -19898 -14618 -12449
191 -12449 -16767 -29632 -34517 -30865 -38454 -23331 -25664 -36436 -40625 -32872 -10663 -20660 -27937 -16405
177 -16405 -34092 -11953 -8284 -22201 7959 14534 5848 -6716 -15144 -42930 -43500 -35498 -17399
164 -17399 -15237 -15981 -25086 -24249 -13580 10356 24816 23136 16410 902 12368 7789 -9258 8634
150 8634 7100 6864 12309 25866 31969 15766 28871 8751 -25263 -12349 3656 -254 20458
137 20458 -2612 -18844 -7753 -9588 -14454 -21192 -6399 -32050 -33403 -1560 282 -15176 -24106
124 -24106 -26481 -13407 9451 -3373 5768 7722 24062 37621 48196 45560 34536 9431 8306
111 8306 41567 26572 13027 -17983 -16314 -15326 -36370 -30889 -9627 -3056 5038 21441 7558
98 7558 -8889 -17710 -18614 -30642 -43948 -20179 -18182 -16841 -35959 -27249 -31267 -33919 -5827 7500
84 7500 10568 2597 -6654 -14897 -25901 -17684 -928 11963 21358 -1015 -25914 -27067 -6639 -22857
70 -22857 -49264 -31965 -2427 -2681 -5100 9413 11953 1615 1166 -7600 11201 5297 -19845 11830
56 11830 34602 28091 9646 521 -21714 -27313 -21353 7765 12876 11565 -7571 -20314 -38998
43 -38998 -43886 -28423 -19492 -27396 -24734 -14279 -10712 -7648 -6017 -29575 -46954 -39389 -26369 -30178
29 -30178 -24551 -7386 5679 -5805 -8415 823 2802 20145 34210 23688 14731 9226 -932
16 -932 -7847 -14277 -21164 -11498 7269 3213 -12004 -24299 -29688 -11458 -11935 -14266 -9561 6183 -10188
1 -10188 -34574
0 -34574
$$ Imaginary data points
##PAGE= N=2
##DATA TABLE= (X++(I..I)), XYDATA
32767 71960 70887 69327 64462 58240 66504 63685 75485 75215 61371 58809 86006 108754 114291 108254
32753 108254 108364 90652 66554 48156 45572 57086 93545 94541 81000 80542 86793 85296 80056
32740 80056 65529 65830 81259 82923 80590 70264 79895 81104 85068 98211 88312 77561 76419
32727 76419 77219 100324 103611 88255 75725 66084 61898 75806 95415 109059 123729 116467 107327
32714 107327 129692 134646 138391 130743 151229 175929 152039 120906 122413 119812 120501 112048 102922
32701 102922 120581 109549 118780 134210 134759 133977 139565 116915 107002 119434 116680 132412 151604
32688 151604 151485 145057 140175 153032 161982 159335 151074 160466 177052 165652 154834 162034 149965
32675 149965 142862 130582 132043 116678 107597 132423 149697 161191 151114 159509 172520 160737
32663 160737 159097 173829 193154 180652 159450 155857 154812 148238 142693 136337 145016 169240 176889
32650 176889 161276 178846 185789 176483 175111 181605 168271 186781 193768 203512 194092 171694 180954
32637 180954 187900 192941 182665 181538 197675 201076 180956 163180 167304 182593 163277 175491
32625 175491 186978 212927 228239 198053 186879 169415 201003 220010 201380 165193 133301
32614 133301 137149 149200 161803 161536 156004 156012 162206 191729 186946 197024 205724 197051 187998 199375
32600 199375 206630 208424 191194 213331 218585 220505 224725 236772 241888 213990 192347 216418 257615
32587 257615 261666 231631 220011 229616 231991 226703 222535 233987 230453 223778 213419 217144 231360
32574 231360 254461 252337 237812 232365 229598 232341 225020 214783 197691 206592 228617 227143 217993
32561 217993 239455 255708 251743 241429 238074 248760 256429 248137 232958 229640 245324 244309 253855
32548 253855 251829 253959 267268 249931 244822 219632 230532 258685 262506 248166 237047 227586
32536 227586 230396 244202 232747 245148 261301 229042 219854 235745 247376 256884 254588 249629
32524 249629 258146 247032 251364 237413 217919 215448 235438 238848 214981 238825 252070 223830
32512 223830 229907 231721 222210 236263 270095 286609 271087 279033 243005 195032 205903 236221
32500 236221 244345 253637 245458 242235 267288 277256 270566 247940 249725 258819 263921 243946 244748 238043
32486 238043 251710 245052 282070 294405 271865 264005 283388 283513 253600 236571 231928 257810
32474 257810 266065 245297 256956 276646 296495 309446 282584 283205 301562 312611 323589 318796
32462 318796 325584 336396 315556 306781 316706 312586 293490 306661 311991 299613 295508 297998 278179
32449 278179 277829 283345 298667 307629 294524 310678 317651 308951 302197 270016 256709 245981 270184
32436 270184 292143 282269 264452 267904 301171 320970 341729 331392 325628 322332 313500 329559
32424 329559 326423 325985 305036 278587 274849 305725 337473 326587 338438 341019 326632 310607
32412 310607 297127 315176 341962 295699 282327 274483 272380 288779 280928 291552 314588 308844
32400 308844 292100 302677 319579 330255 320210 317334 314441 297126 287957 275788 283205 301090
32388 301090 301025 297149 273305 278091 287821 308741 303872 297334 296863 306948 317831 320041 318524 314155
32374 314155 322135 326213 337471 333398 291905 301032 318527 316333 326989 315329 329985 334629 326265
32361 326265 343196 338056 334350 340604 301439 284899 269673 264637 281595 315222 332056 320636
32349 320636 286010 299804 324536 327490 349851 342856 334579 335161 338335 342518 309295 312240 319006
$$ [...]
##END NTUPLES=NMR SPECTRUM
##END=
