##TITLE=Analysis number 326940
Compound Code cc 53605
Book Reference 518/81
Project Code adrs
Chemist Name colinb
##JCAMPDX= 6.0         $$ Bruker NMR JCAMP-DX V2.0
##DATA TYPE= NMR SPECTRUM
##DATA CLASS= NTUPLES
##ORIGIN= Bruker BioSpin GmbH
##OWNER= nmr
$$ XWIN-NMR		Version 3.5
$$ Fri Mar  2 11:43:11 2007 GMT Standard Time (UT+0h)  MAYBRIDGE\nmr@NMR_250MHZ
##.OBSERVE FREQUENCY= 250.131544655141
##.OBSERVE NUCLEUS= ^1H
##.ACQUISITION MODE= SIMULTANEOUS (DQD)
##.ACQUISITION SCHEME= undefined
##.AVERAGES= 16
##.DIGITISER RES= 18
##SPECTROMETER/DATA SYSTEM= dpx250
##.PULSE SEQUENCE= zg30
##.SOLVENT NAME= CDCl3
##.SHIFT REFERENCE= (INTERNAL, CDCl3, 0, 16.522)
##AUDIT TRAIL= $$ (NUMBER, WHEN, WHO, WHERE, WHAT)
$$ ##TITLE= Audit trail, XWIN-NMR		Version 3.5
$$ ##JCAMPDX= 5.01
$$ ##ORIGIN= Bruker BioSpin GmbH
$$ ##OWNER= nmr
$$ C:\u/data/dgb/nmr/ADRS/200/pdata/1/auditp.txt
$$ ##AUDIT TRAIL=  $$ (NUMBER, WHEN, WHO, WHERE, WHAT)
(   1,<2007-03-02 11:42:01.38 +000>,<MAYBRIDGE\nmr>,<NMR_250MHZ>,
      <created by zg, POWCHK disabled, PULCHK disabled
       configuration hash MD5:
       49 4B E0 1D 92 C2 6B 37 9F E6 65 BC 52 41 86 1D
       data hash MD5: 64K
       50 A8 A3 E2 5C BA 04 8B B3 4B D8 32 B9 C1 47 AC>)
(   2,<2007-03-02 11:42:29.82 +000>,<MAYBRIDGE\nmr>,<NMR_250MHZ>,
      <Start of raw data processing
       ef LB = 0.3 FT_mod = 6 PKNL = 1 SI = 32K 
       data hash MD5: 32K
       A7 47 FD B1 45 54 29 6F 5D 72 9F 47 F3 89 B2 75>)
(   3,<2007-03-02 11:42:34.22 +000>,<MAYBRIDGE\nmr>,<NMR_250MHZ>,
      <apk 
       data hash MD5: 32K
       7C 65 A1 2B A9 53 C6 83 9E 36 87 D4 46 1A 8F AC>)
(   4,<2007-03-02 11:42:36.99 +000>,<MAYBRIDGE\nmr>,<NMR_250MHZ>,
      <abs ABSG = 5 
       data hash MD5: 32K
       B8 BF E4 20 63 D5 08 07 7B 18 5F CF 3A 94 90 59>)
$$ ##END=
$$ 
$$ hash MD5
$$ A1 B7 9F EF 13 E9 A8 FF FF 94 53 63 F4 A2 18 F1
##$RELAX= 
##$RELAX= 
##$RELAX= 
##$RELAX= 
##$RELAX= 
##$RELAX= 
##$RELAX= 
$$ Bruker specific parameters
$$ --------------------------
##$DU= <C:\u>
##$EXPNO= 200
##$NAME= <ADRS>
##$PROCNO= 1
##$TYPE= <nmr>
##$USER= <dgb>
##$AMP= (0..31)
100 100 100 100 100 100 100 100 100 100 100 100 100 100 100 100 100 100 
100 100 100 100 100 100 100 100 100 100 100 100 100 100 
##$AQSEQ= 0
##$AQ_mod= 3
##$AUNM= <au_zg>
##$AUTOPOS= <41 >
##$BF1= 250.13
##$BF2= 250.13
##$BF3= 250.13
##$BF4= 250.13
##$BF5= 500.13
##$BF6= 500.13
##$BF7= 500.13
##$BF8= 500.13
##$BYTORDA= 1
##$CFDGTYP= 0
##$CFRGTYP= 5
##$CHEMSTR= <none>
##$CNST= (0..31)
1 1 145 1 1 1 1 1 1 1 1 1 1 1 1 1 1 1 1 1 1 1 1 1 1 1 1 1 1 1 1 1 
##$CPDPRG= <>
##$CPDPRG1= <>
##$CPDPRG2= <>
##$CPDPRG3= <>
##$CPDPRG4= <mlev>
##$CPDPRG5= <mlev>
##$CPDPRG6= <mlev>
##$CPDPRG7= <mlev>
##$CPDPRG8= <mlev>
##$CPDPRGB= <>
##$CPDPRGT= <>
##$D= (0..31)
0 1 0 0 0 0 0 0 0 0.06 0 0 0 0 0 0 0.0002 0 0 0 0 0 0 0 0 0 0 0 0 0 0 
0 
##$DATE= 1172835717
##$DBL= (0..7)
120 120 120 120 120 120 120 120 
##$DBP= (0..7)
150 150 150 150 150 150 150 150 
##$DBP07= 0
##$DBPNAM0= <>
##$DBPNAM1= <>
$$ [...]
##$SUBNAM7= <"">
##$SUBNAM8= <"">
##$SUBNAM9= <"">
##$SW= 20.6930455092707
##$SWIBOX= (0..15)
0 0 3 0 0 0 0 0 0 0 0 0 0 0 0 0 
##$SW_h= 5175.983436853
##$TD= 65536
##$TD0= 1
##$TE= 295.16
##$TE2= 300
##$TE3= 300
##$TEG= 300
##$TL= (0..7)
0 120 120 120 120 120 120 120 
##$TP= (0..7)
150 150 150 150 150 150 150 150 
##$TP07= 0
##$TPNAME0= <>
##$TPNAME1= <>
##$TPNAME2= <>
##$TPNAME3= <>
##$TPNAME4= <>
##$TPNAME5= <>
##$TPNAME6= <>
##$TPNAME7= <>
##$TPOAL= (0..7)
0.5 0.5 0.5 0.5 0.5 0.5 0.5 0.5 
##$TPOFFS= (0..7)
0 0 0 0 0 0 0 0 
##$TUNHIN= 0
##$TUNHOUT= 0
##$TUNXOUT= 0
##$USERA1= <user>
##$USERA2= <user>
##$USERA3= <user>
##$USERA4= <user>
##$USERA5= <user>
##$V9= 5
##$VALIST= <valist>
##$VCLIST= <CCCCCCCCCCCCCCC>
##$VD= 0
##$VDLIST= <DDDDDDDDDDDDDDD>
##$VPLIST= <PPPPPPPPPPPPPPP>
##$VTLIST= <TTTTTTTTTTTTTTT>
##$WBST= 1024
##$WBSW= 4
##$XGAIN= (0..3)
0 0 0 0 
##$XL= 0
##$YL= 0
##$YMAX_a= 205456
##$YMIN_a= -273047
##$ZGOPTNS= <>
##$ZL1= 120
##$ZL2= 120
##$ZL3= 120
##$ZL4= 120
##$ABSF1= 16.522
##$ABSF2= -4.171173
##$ABSG= 5
##$ABSL= 3
##$ALPHA= 0
##$AQORDER= 0
##$ASSFAC= 0
##$ASSFACI= 0
##$ASSFACX= 0
##$ASSWID= 0
##$AUNMP= <proc_1d>
##$AZFE= 0.1
##$AZFW= 0.1
##$BCFW= 0
##$BC_mod= 0
##$BYTORDP= 0
##$COROFFS= 0
##$CY= 12.5
##$DATMOD= 1
##$DC= 0
##$DFILT= <>
##$DTYPP= 0
##$F1P= 14.0000005364418
##$F2P= -0.99999901652339
##$FCOR= 0.5
##$FTSIZE= 32768
##$FT_mod= 6
##$GAMMA= 0
##$GB= 0
##$INTBC= 1
##$INTSCL= 1
##$ISEN= 128
##$LB= 0.3
##$LEV0= 0
##$LPBIN= 0
##$MAXI= 10000
##$MC2= 0
##$MEAN= 0
##$ME_mod= 0
##$MI= 0
##$NCOEF= 0
##$NC_proc= -3
##$NLEV= 6
##$NOISF1= 0
##$NOISF2= 0
##$NSP= 0
##$NTH_PI= 0
##$NZP= 0
##$OFFSET= 16.522
##$PC= 1
##$PHC0= 232.9347
##$PHC1= 7.392114
##$PH_mod= 1
##$PKNL= yes
##$PPARMOD= 0
##$PSCAL= 4
##$PSIGN= 0
##$REVERSE= no
##$SF= 250.13
##$SI= 32768
##$SIGF1= 0
##$SIGF2= 0
##$SINO= 400
##$SIOLD= 32768
##$SREGLST= <1H.CDCl3>
##$SSB= 0
##$STSI= 32768
##$STSR= 0
##$SW_p= 5175.98343685301
##$SYMM= 0
##$S_DEV= 0
##$TDeff= 65536
##$TDoff= 0
##$TI= <Analysis number 999999
Compound Code 99
Book Reference 9
Project Code 9>
##$TILT= no
##$TM1= 0
##$TM2= 0
##$TOPLEV= 0
##$USERP1= <user>
##$USERP2= <user>
##$USERP3= <user>
##$USERP4= <user>
##$USERP5= <user>
##$WDW= 1
##$XDIM= 32768
##$YMAX_p= 483078904
##$YMIN_p= -163104
$$ End of Bruker specific parameters
$$ ---------------------------------
##NTUPLES= NMR SPECTRUM
##VAR_NAME=  FREQUENCY,     SPECTRUM/REAL,   SPECTRUM/IMAG
##SYMBOL=    X,             R,               I
##VAR_TYPE=  INDEPENDENT,   DEPENDENT,       DEPENDENT
##VAR_FORM=  AFFN,          ASDF,            ASDF
##VAR_DIM=   32768,         32768,           32768
##UNITS=     HZ,            ARBITRARY UNITS, ARBITRARY UNITS
##FACTOR=    0.157963299565203, 1,           1
##FIRST=     4132.6476996994, 0,             0
##LAST=      -1043.33573715361, 0,           0
##MIN=       -1043.33573715361, -163104,     0
##MAX=       4132.6476996994, 483078904,     0
$$ Real data points
##PAGE= N=1
##DATA TABLE= (X++(R..R)), XYDATA
$$ [...]
19402a9774M3454L9523J4128k5382K2361l3398m1383J46j8623J1662j9969j436
19390b8691K7806J787l5815m7266J6937L0196K3645M6776K5333l3232m5970j5393
19378c3887n807J368N3060J9422j9585k4405k9951J8803M0774j5998J5260N873
19366B4927k4312j0783J4689j2264P401j2472r956M384k6932J3444J6078J640
19354a4156n838J7176J0662J6220P3132k6375n3257n956n0327M0109M1796R979
19342E3165l8094m799K5978P3478P9715P6981j2653r2363l8263m364l0702N290
19330I3369P0426L9188N8041Q9553k0875j30984q1900l5297k3610m7799o3390
19319e3278L4583J9990J0347K0837j8720k928o786R570N683P786L4238L5337n497
$$ plain form
19402 -19774 23680 63203 77331 51949 74310 40912 -471 -325 -18948 -7286 -27255 -28691
19390 -28691 -885 902 -34913 -82179 -65242 -35046 -11401 35375 60708 27476 -18494 -33887
19378 -33887 -39694 -38326 14734 34156 14571 -9834 -39785 -20982 19792 3794 19054 24927
19366 24927 615 -10168 4521 -7743 -342 -12814 -22770 -18386 -45318 -31874 -15796 -14156
19354 -14156 -19994 -2818 7844 24064 97196 70821 17564 11608 -38719 1390 43186 53165
19342 53165 15071 10272 36250 109728 189443 266424 253771 161408 123145 118781 88079 93369
19330 93369 163795 202983 261024 350577 329702 198718 116818 81521 57911 10112 -53278
19319 -53278 -18695 1295 11642 32479 13759 10831 4045 13615 19298 27084 61322 96659 91162
19306I1162O440Q9304R2188o1227r1195m9970m8662j0703n04K2505J00181J05474
19294B44993q2q4598l6733l1476m6922P924j3649J365N1581l9941p063O819k6551
19281B5667j2846N8396P35l5658m301K047j6873L298J3546j8972J7227J8919m714
19268D6471m49o930j6381m3852J2706L3794O9492R387k1370k296k7064k0582k3035
19255I891m223m269n511P157L6724Q817M881j9276j1323n400k0185J991L1350
19242C0624M3618m4098m5251J7774M9533N0694k3928l9977k2682l5165o740J5540
19230a0058L3876M3425K7205r212l7690P93J0852M0547P938l8840j8586M028K1597
19217G5875k2514k2395j9237J8359N8034K1154K816O2192Q688n1485k2495K4209
$$ plain form
19306 91162 97602 186906 279094 217867 126672 76702 28040 17337 16833 39338 139519 244993
19294 244993 244911 160313 123580 92104 45182 53106 39457 40822 92403 52462 45399 52218 25667
19281 25667 12821 71217 71952 36294 31993 34040 17167 20465 34011 15039 32266 51185 46471
19268 46471 46022 39092 22711 -21141 -8435 25359 94851 104238 82868 80572 53508 32926 9891
19255 9891 5668 1399 -4112 3045 39769 48586 53467 34191 22868 17468 -2717 -726 30624
19242 30624 74242 30144 -15107 2667 52200 102894 78966 38989 16307 -18858 -25598 -10058
19230 -10058 23818 67243 94448 85236 47546 48339 59191 99738 107676 68836 50250 54278 75875
19217 75875 53361 30966 11729 30088 88122 109276 112092 174284 182972 131487 108992 133201
19205A33201O0666J4144m5934k8670K7274P2745m344r6100k5196K4597J3641j6388
19193A29636o9243l8945J0778Q926k264o56r185J5319l0782j9625K167J2078K2082
19180C0286J5635k800J3329n3300q747L0795J8548k1486k7624O245K8934J2061
19168D1876k0119r230L8783K3012m0228k6852O756L521j7122r587L9491O2267
19156I2568M3349j7761k9634J1779Q380m3532J2352L1557j281L1333l7063m606
19144I7441m3522k8867M0362M991l8639o0097j9504J6034K0941K6705P810n2172
19132b8517J7740j717K7298k0119l9380Q999j1880k0676J9535O662O145k0904
19120e6814n0413P866L5653K6064M9397L4587n381M238P745j9046J2188L2462
$$ plain form
19205 133201 193867 208011 162077 133407 160681 233426 229082 132982 107786 132383 146024 129636
19193 129636 60393 21448 32226 41152 38888 38232 29047 44366 13584 -6041 -3874 8204 30286
19180 30286 45921 43121 56450 3150 -5597 25198 43746 22260 -5364 881 29815 41876
19168 41876 21757 12527 51310 74322 34094 7242 13998 17519 397 -9190 30301 92568
19156 92568 135917 118156 88522 100301 108681 65149 77501 109058 107777 139110 102047 97441
19144 97441 53919 25052 65414 70405 31766 -28331 -47835 -31801 -10860 15845 23655 -28517
19132 -28517 -10777 -12494 14804 -5315 -44695 -35696 -47576 -68252 -48717 -42055 -35910 -56814
19120 -56814 -107227 -99361 -63708 -37644 11753 46340 40959 45197 52942 33896 46084 78546
19108G8546l0025K2855k0009k0987k8983l7226L6260K7080M1711K4351N4876K0899
19096A69348m9246o8441j5813l0772l561L7781N1387O521m883P993j2298o0331
19084B7685o897M3607P339l0877k0136k056j9210M623K5312J8728L487J5584K0431
19071H7620M485j6048M014K0965L0670n441L213K4083j6793l4248n3437j3074
19059C6009K3040M5289J9115K8101O0266o339l8807l4936k5075j4965K606n645
19047H8659j2173K1105q515o237j2140k3220M2391N6230l2725k101L6297J3273
19035A60844p029j8358J2562N6229L1916K9296O907k4604q101j3642k9005m409
19023A92606j8446J4113M3187j5783o972K9670j2577K263j8219j8623l3354M2161
$$ plain form
19108 78546 48521 71376 51367 30380 1397 -35829 431 27511 69222 93573 148449 169348
19096 169348 120102 51661 35848 5076 1515 39296 90683 97204 92321 100314 88016 27685
19084 27685 20788 64395 71734 40857 20721 18665 -545 4078 29390 48118 51605 67189 87620
19071 87620 92105 76057 80071 101036 131706 126265 129478 153561 136768 102520 49083 36009
19059 36009 59049 104338 123453 151554 211820 205481 166674 131738 106663 91698 94304 88659
19047 88659 76486 97591 89076 82839 70699 47479 89870 146100 113375 111274 147571 160844
19035 160844 153815 135457 148019 204248 236164 265460 272367 247763 239662 226020 197015 192606
19023 192606 174160 188273 231460 215677 208705 238375 225798 228061 209842 191219 157865 200026
19011B00026K3019m929P172j1860K5888N5128J4126R218O8782M2363K6806L7518
18999D93257M0828K9222J00348N7647O6357R1402J12843J30681J51441J48398
18989A422424K16791K03992K87364L15489K83728K76640M25264P30343R58796
18980E120831J123897J652131K762986M582462Q167664J4779035K0143926O405137
18972F4738069j1486309o314160P219550J6182511L415769j2593652l523734J2260581
18964F9898625J2073026j1097113j5639718j656480J1210844Q266064j5498544
18957E7556704k1658273j2921537p005952l991442k329904j536426j332642j125730
18949E654798p94809m81337m42826m69381m12976k64929j46375j71867p5405N2346
$$ plain form
19011 200026 223045 218116 225288 213428 239316 294444 308570 317788 386570 428933 455739 493257
18999 493257 534085 563307 663655 721302 787659 879061 991904 1122585 1274026 1422424
18989 1422424 1639215 1843207 2130571 2446060 2729788 3006428 3431692 4162035 5120831
18980 5120831 6244728 7896859 10659845 15242307 23409971 38189006 58332932 64738069
18972 64738069 53251760 46937600 54157150 70339661 73755430 61161778 57638044 69898625
18964 69898625 81971651 70874538 55234820 53578340 64789184 73055248 57556704
18957 57556704 35898431 22976894 15970942 11979500 9649596 8113170 6780528 5654798
18949 5654798 4859989 4378652 3935826 3466445 3053469 2788540 2642165 2470298 2394893 2447239
18939B447239j42782l01746k17745K7986J53196m3602j74444j2279J24744m134
18929A856433k32672k01552m2509J06472J9942k72067k35096j72659j32002q5595
18919F08695j4713L9311q514m7864j0371R7205K11291K84884M38639K70945k26448
18908A643060k69275K5759L33763L16364j64866j90501J99699L06727j81571m08990
18898A610169r0997K29045K20993l10116n38903l22925j89515j08075l3871m0515
18888D25290l6162l1859l5494l3844M863o89q9062j0232P9648L15n0231j4781
18876B07762J4047j7892K9516Q690r973j0985j470O085J7072k4717K5668j3173
18864B30630l5342O731K2508M4180J8749P486K8740M5082k7872p9289k5006j8560
$$ plain form
18939 2447239 2304457 2002711 1784966 1812952 1966148 1922546 1748102 1735823 1860567 1856433
18929 1856433 1623761 1422209 1379700 1486172 1506114 1234047 998951 826292 694290 608695
18919 608695 593982 633293 624779 576915 566544 663749 875040 1159924 1598563 1869508 1643060
18908 1643060 1373785 1399544 1733307 2049671 1884805 1694304 1894003 2200730 2019159 1610169
18898 1610169 1519172 1748217 1969210 1659094 1120191 797266 607751 499676 465805 425290
18888 425290 389128 357269 321775 287931 292794 292105 203043 192811 272459 272774 222543 207762
18876 207762 221809 203917 233433 242123 232150 221165 219695 225780 242852 218135 243803 230630
18864 230630 195288 202019 224527 268707 287456 294942 323682 368764 340892 261603 236597 218037
18852B18037k4775J3641K7508Q3004J01837l133k7553l0763o6919o77J2788j7029
18840B85966K2840M7617M7968L1774m769L2585R8481R1510M0381Q6737J09279
18829H90369J61001J45249J7118K8428N8545J25516K10525L38348L15320L28339
18819B618758M56608N87952P61719J035297J527290K424443M190189P831331J4498050
18810C5931637K1055279Q228512j6543776j7775676r125031l563560k70057L141147
18802B1078475Q428714J5715716J4527946p584655j8951492j2553128o512254
18795A4149322l622167k214726j448606q73182l99752k00518j9836q3434j02305
18786E184796J09768L52140O40767J131932J911345L189835N761239J1024037
$$ plain form
18852 218037 193262 206903 234411 317415 419252 416119 388566 357803 290884 290207 302995 285966
18840 285966 308806 356423 404391 436165 431396 463981 562462 653972 694353 781090 890369
18829 890369 1051370 1196619 1213737 1242165 1300710 1426226 1636751 1975099 2290419 2618758
18819 2618758 3075366 3663318 4425037 5460334 6987624 9412067 13602256 21433587 35931637
18810 35931637 56986916 65215428 48671652 30895976 21770945 18207385 17937328 21078475
18802 21078475 29507189 45222905 59750851 52166196 33214704 20661576 14149322
18795 14149322 10527155 8312429 6863823 5990641 5590889 5390371 5370535 5287101 5184796
18786 5184796 5294564 5646704 6287471 7419403 9330748 12520583 18281822 29305859
18778B9305859J8465364J5380922q800541j8718775j1510883n159373j444294
18771A7518279J748138N973847J2644205J6883378J491634j7223468j5129739
18764B3906274q495993m596233k734649j718678j072050o22278l35044q1640J71631
18755D421340j14497q10712p52825m41542j92772q6671j1566M7372K09903J90946
18745B458976k52490l39754m7492m6530l17713k82441j78377p4127m8255K765
18735H74562R1819J94672J25384j14328k35954j30009p5472J2737K3307J07792
18725H74510K49979L87780L49428k37556m72511l23526j57677n8407O4744J60340
18715H37104L37129L77521o0280m31904l27214j55749q5413o5377l7672m4569
$$ plain form
18778 29305859 47771223 63152145 54351604 35632829 24121946 18962573 17518279
18771 17518279 19266417 25240264 37884469 54767847 56259481 39036013 23906274
18764 23906274 15410281 10814048 8079399 6360721 5288671 4666393 4331349 4249709 4421340
18755 4421340 4306843 3496131 2743306 2301764 2108992 2022321 2010755 2058127 2268030 2458976
18745 2458976 2206486 1866732 1819240 1772710 1454997 1172556 994179 920052 871797 874562
18735 874562 966381 1161053 1286437 1172109 936155 806146 730674 743411 766718 874510
18725 874510 1124489 1512269 1861697 1624141 1151630 828104 670427 612020 676764 837104
18715 837104 1174233 1551754 1491474 1059570 732356 576607 491194 425817 388145 343576
18705C43576k4304l0188k3233L6837j4359n2674j1830J2988O479l4899p6005p0543
18693F1845J3777K3266M1645j0676o682j0006j5392l0896K0084O2434L4936k2180
18681A62155Q227j735l5183L0279j6568k7000K6767J1386m3236j1033n932j6866
18669H1261k5004L3270K8048p444k3554k8766L3303M7178N4723q5o9340k0773
18657A02817j2699m9903j3725N9073M7491J1246n287j9926K4938m1229m1512J4802
18645G6086J4455p180K8585N9111J8817k0943k9199l7758k9659j1700m780L702
18633E9537p598J1819K9826K8773J4037l4587j7792J5782k6491j9361M09K8986
18621H3340M7761j6424j3040K055j5137p777j2423n808q028j8820P578J4504m786
$$ plain form
18705 343576 319272 289084 265851 302688 288329 235655 223825 236813 243292 208393 132388 61845
18693 61845 75622 98888 140533 129857 123175 113169 97777 66881 86965 149399 184335 162155
18681 162155 170382 168647 133464 163743 147175 120175 146942 158328 115092 104059 98127 81261
18669 81261 56257 89527 117575 110131 86577 57811 91114 138292 193015 192930 123590 102817
18657 102817 90118 40215 26490 85563 133054 144300 139013 119087 144025 102796 61284 76086
18645 76086 90541 83361 111946 171057 189874 168931 139732 101974 72315 60615 55835 59537
18633 59537 51939 63758 93584 122357 136394 101807 84015 99797 73306 53945 54354 83340
18621 83340 131101 114677 101637 103692 88555 80778 68355 62547 54519 35699 43277 57781 52995
18608E2995r98J5957j5898O400J6577j3036l7430j2843J8316L015K988j06L1282
18595F7219J8175J1015j4493n8268K3640Q482j4670j9510j3331k2635r706K8203
18583D121j5948r35k5924k8652N5317M5235K9453J2630m7328o3825K1610J7569
18571C323q704Q366J7660K857r382j6508o6783J9168K6302j3909q31J9274j3727
18558c2894k9262L6666l883K7057L0171J7604L834j6908j0142l1736j5861K9670
18546D316K5750M5902M0309k462j0436q5671l4650k4447K069J0854M2723O4644
18534G8901M3961j7527k0882R727q099j7024l0070J1068K4561j3702m5098Q078
18522B3894N449p435K3502K4965Q073n4832k767M279J4456K5834P1l1230o296
$$ plain form
18608 52995 51997 67954 52056 58456 75033 61997 24567 11724 30040 33055 36043 35937 67219
18595 67219 85394 96409 81916 23648 47288 55770 41100 21590 8259 -14376 -24082 4121
18583 4121 -11827 -12762 -38686 -67338 -12021 33214 62667 75297 27969 -35856 -14246 3323
18571 3323 -5381 2985 20645 23502 14120 -2388 -69171 -50003 -23701 -37610 -38441 -19167 -32894
18558 -32894 -62156 -25490 -29373 -2316 27855 45459 49293 32385 22243 -9493 -25354 4316
18546 4316 30066 75968 116277 113815 103379 17708 -16942 -41389 -39320 -28466 14257 78901
18534 78901 122862 105335 84453 94180 86081 69057 38987 50055 74616 60914 15816 23894
18522 23894 29343 21908 45410 70375 78448 23616 20849 25128 39584 65418 65489 34259 27963
18509B7963J8132m779j541k0481J4196Q36N2328k23k2322n6268j0489J222K1070
18496A9644O5562N777p932j5993j6966Q309k4769J7186M272n756o180K1421p146
18483E7429j6849l0538l9988Q971k3354M3055P55k3316K5972K2640J09J6173m4603
18470c544M956K1090O169l553O5894J665k7962J1646n0510n6343L0771N4934J3160
18457F8373M242m4409k8385k1397l5867O3507J2266j091M490l937J2765o305m6300
18444b2048R887J5906K8831K4420j4354J7768l5465J7938J8016q706k7423K298
18432B7068J645j9322q84Q6823O3332Q9737P7038O541p2109l7705R3437J07538
18420D23139j0686k3849j7026M4547K1815n6832o5470k2875O9807K6590j09116
$$ plain form
18509 27963 46095 41316 39775 19294 33490 34326 86654 86431 64109 7841 -2648 -1426 19644
18496 19644 85206 90983 83051 67058 50092 58401 33632 50818 55090 49334 43154 64575 57429
18483 57429 40580 10042 -29946 -20975 -44329 -1274 -519 -23835 2137 24777 24886 41059 -3544
18470 -3544 1412 22502 28671 25118 91012 92677 64715 76361 25851 -30492 279 55213 68373
18457 68373 72615 28206 -179 -21576 -57443 6064 18330 17239 21729 17792 30557 24252 -22048
18444 -22048 -12161 3745 32576 56996 42642 60410 24945 42883 60899 52193 24770 27068
18432 27068 28713 9391 8507 95330 158662 248399 325437 331978 259869 222164 315601 423139
18420 423139 412453 388604 371578 416125 437940 381108 315638 292763 362570 389160 280044
18409B80044j18398l3637k2901p723m8110o1490O62O034N5318k384k9816J468
18397A9067k4649k1532M6153J3666l9956K2382o424j0812k3751Q186J4676Q988
18385E994N3992j1543j4354k391J485J0227l510j1143o5006k5211M9151P791k2338
18372b6856n370K4143j811N5272J7028k4392j6164Q43K6268N752P903L082J3663
18359G9361k5413l4776l1935L3607K4456q956K7426J895l3597o825N635j1456
18347A9422R839l276j7355M6591k8877J6380J1282L224k3014k9962J6123L9159
18335E9536L0934L0225P41m3568o4651l1975m2578r734L2648M5459J2328j3332
18323F033j3222K9576N6151l5300k5373J1670L0382l7508M0443M5177K4640k5200
$$ plain form
18409 280044 161646 128009 105108 97385 49275 -12215 -11553 -5519 49799 47415 17599 19067
18397 19067 -5582 -27114 19039 32705 -7251 15131 8707 -2105 -25856 -17670 -2994 5994
18385 5994 59986 48443 34089 31698 33183 43410 39900 28757 -36249 -61460 -12309 -4518 -26856
18372 -26856 -32226 -8083 -9894 45378 62406 38014 21850 22693 48961 54713 62616 65698 79361
18359 79361 53948 19172 -12763 20844 45300 36344 63770 65665 32068 25243 30878 19422
18347 19422 29261 25985 8630 55221 26344 42724 54006 57230 34216 4254 20377 59536
18335 59536 90470 120695 121436 77868 13217 -18758 -61336 -71070 -38422 7037 19365 6033
18323 6033 -7189 22387 78538 43238 17865 29535 59917 22409 62852 108029 132669 107469
18311A07469l0186l628k7373l3459K7207j8653o0299J3238K1611N07N9603L324
18299E9361m666l9113K6682L9321O28n3410k9443p294K1388N668q808k3184j3168
18286b6038K2629J4561L7876N034M376J9407M0434L8362P4184J03079K8993o8673
18274B94224q6859o5976n3352j5377M4846P8264N7523O0534m7367r1917n0728
18263A23815n1770n0628k1702j2405Q745L9716L8737N442j1802L1318r757l5688
18251E4021J512K1095J0459n754K2687L7714R3671R4685Q26j14042n7815k7179
18239A31880Q112L9832L9437M3862P7474K0604p5581j14591o9450j8555L259K7893
18227A14176p333m0365l0752L1360N3038l7378l9686k5317L5087N0254J3305n99
$$ plain form
18311 107469 77283 73655 46282 12823 40030 21377 -38922 -25684 -4073 -3566 56037 59361
18299 59361 54695 15582 42264 81585 82213 28803 -640 -7934 13454 19122 10314 -12870 -26038
18286 -26038 -3409 11152 49028 54062 58438 77845 118279 156641 230825 333904 362897 294224
18274 294224 207365 141389 88037 72660 117506 195770 253293 313827 266460 174543 123815
18263 123815 72045 21417 -285 -12690 -3945 35771 74508 79950 68148 99466 89709 54021
18251 54021 55533 76628 87087 81333 104020 141734 235405 330090 330916 216874 159059 131880
18239 131880 139992 179824 219261 263123 340597 361201 285620 171029 101579 83024 86283 114176
18227 114176 106843 66478 35726 67086 120124 82746 43060 17743 52830 103084 116389 115790
18215A15790l0637r823J5519j8538n185R044K1320j4595R343j8220k3755R603
18203E9866L8614k7015l1475J1611j2754j2835j3427n491K7123K5376m1978j5387
18191B228P0997J7325K830K312k2089j8867j1250P858k3086k5065M2891J8344
18179F4428K7306K058k2766o088j9921k1830J0664L0773K0754l5195l768K571
18167D8986p141j483R942J5046K2350J1904p405n732Q980k1665k7382j3891k7858
18154D651K3964M7976K7813l0827M345K7846q905K6809j9650j3518L5197R146
18142A34847L601J8836K3544L3233J6548J0804j707L0247K9320J1351P8719R1693
18130D81036J9053M493N2659Q6258N1503N5104P8814J57334K16783K42909K99843
$$ plain form
18215 115790 85153 75330 90849 72311 67126 76170 97490 82895 92238 74018 50263 59866
18203 59866 98480 71465 39990 51601 38847 26012 12585 7094 34217 59593 17615 2228
18191 2228 73225 90550 93380 95692 73603 54736 43486 51344 28258 3193 46084 64428
18179 64428 91734 93792 71026 64938 45017 23187 33851 64624 85378 50183 46415 48986
18167 48986 41845 40362 50304 65350 87700 99604 92199 86467 95447 73782 46400 32509 4651
18154 4651 28615 76591 104404 73577 77922 105768 96863 123672 104022 90504 125701 134847
18142 134847 138448 157284 180828 214061 230609 241413 239706 269953 299273 310624 389343 481036
18130 481036 500089 504582 557241 643499 695002 750106 828920 986254 1203037 1445946 1745789
18119A745789L61397M78067O62548P92591J135709J810681K951260N058290R332787
18110B4329119J8445928L3810266L2944973j7969585l9597431k2911775j0865703
18103A8185792n647193l317467k171234j447485r95520p50893o21298m75738m01950
18094B357014l34491k60166k74459k05262j48205j23637j24381j17394j18531
18085F50488j00287j8287K6876j2612n8354q9868l2269k694K8543j4165m9331
18074C28040l2511l4479m6866M690k7193k0514P924L883M6599J658q0782j8047
18062A32402K5925k6155j1458j4328m447r68J6123j1060M675J2510q513j6395
18050I8311m9361j3670N5351N0692m519k5432j9092k4847K4505p464j7318J3645
$$ plain form
18119 1745789 2107186 2585253 3247801 4040392 5176101 6986782 9938042 14996332 24329119
18110 24329119 42775047 76585313 109530286 91560701 51963270 29051495 18185792
18103 18185792 12538599 9221132 7049898 5602413 4606893 3856000 3234702 2758964 2357014
18094 2357014 2022523 1762357 1487898 1282636 1134431 1010794 886413 769019 650488
18085 650488 550201 531914 558790 546178 487824 397956 365687 362993 391536 377371 328040
18074 328040 295529 261050 214184 218874 191681 171167 179091 182974 229573 231231 150449 132402
18062 132402 158327 132172 120714 106386 101939 100971 117094 106034 110709 123219 114706 98311
18050 98311 48950 35280 90631 141323 136804 111372 92280 67433 91938 84474 67156 80801
18038H0801J4770K8264k700k9902j200Q734j8415j84j5218r096J0150M141J6015
18025H6160P3272j1114p2173l1807j2168M822J9413o51j6257m1189L5668K9351
18013F3327j2963j1033o408n555l2858O769L1571m561J8380j4114l5849k181k996
18000h471m723K7947J7608j3296o90J1008M3379j6876j5396J4386M1276m6636
17988D9516l8774K962m4117k9399L6149N7808J6502j4583L0582L7233k8070o6231
17976I578k7836K8556R363K3806N0123K4718k3003K9245N0004j9610n2642k772
17964I9530J242j2844l9262l4490L317n07j7527m4086L4631K8221j4635N115l4867
17951b6162K6622O3445K2731l361j0418k7824Q82l3288j197J8847O5956j5275
$$ plain form
18038 80801 95571 123835 121135 91233 90033 98767 80352 80168 64950 55854 66004 70145 86160
18025 86160 159432 148318 76145 44338 32170 36992 56405 55754 39497 -1692 33976 63327
18013 63327 50364 39331 32923 27368 -5490 1279 32850 28289 46669 32555 -3294 -5475 -8471
18000 -8471 -13194 14753 32361 19065 18375 29383 72762 55886 40490 54876 96152 49516
17988 49516 10742 13704 -30413 -59812 -23663 34145 50647 36064 66646 103879 75809 9578
17976 9578 -18258 10298 19661 43467 93590 118308 95305 124550 174554 154944 102302 99530
17964 99530 100772 87928 48666 14176 17493 16986 -541 -44627 -9996 18225 3590 8705 -26162
17951 -26162 460 63905 86636 83275 72857 45033 45915 12627 11430 30277 96233 80958
17939H0958m3530o0867q022J5364J5278P87j8039K3032K5056n0119K5861j2083
17927f324l7213N517K9587j1525j4206N355j1433L9442M418M2564j853k5482M0048
17914E8895K7357k3788n7911j892J2173j5621j1144P789L5909l757j077j1210
17902A5723j4107K762Q617j1141k5729k5753J0946K3501J1412K54j5665N209J4153
17889A82q083j8430q018K7027K868k492j783j5032K6114K5927j535l1241j3249
17876a7745j9258q156L4392N3069K2933N566K4479l4263n3552l9433k8650M0230
17864b0388j5306j3728K4801j0876k4428r242O0973K9298Q938p889j7894M310
17852H569L3126r353K46k5668l1695r36J6698n566j9585k586K1768K7169J6315
$$ plain form
17939 80958 37428 -23439 -31461 -16097 -819 -32 -18071 4961 30017 -20102 5759 -6324
17927 -6324 -43537 -38020 -8433 -19958 -34164 -28809 -40242 -800 3618 46182 44329 18847 58895
17914 58895 86252 62464 4553 2661 14834 -787 -11931 -4142 31767 28010 26933 15723
17902 15723 1616 4378 12995 1854 -23875 -49628 -38682 -15181 -3769 -3515 -19180 -13971 182
17889 182 -7901 -26331 -34349 -7322 -4454 -6946 -8729 -23761 2353 28280 26745 -4496 -17745
17876 -17745 -37003 -45159 -10767 42302 65235 70801 95280 61017 7465 -31968 -60618 -20388
17864 -20388 -35694 -49422 -24621 -35497 -59925 -69167 -8194 21104 30042 22153 4259 8569
17852 8569 41695 32342 32588 6920 -24775 -25711 -9013 -14579 -34164 -36750 -14982 12187 28502
17839B8502m4035L127J3377j4244J7555J1424o522k01m4231k3187J435P656J0729
17826c8615O561J6461R111J1733L9981k155n2386m6967P488l7254k241K3539R339
17813e5405p160L4522J7466j5938L391M897J9409N1180k5282l8954k8232J108
17801c8998j8646l61L2889J095r69l297J1751M5703K1212J8524P665l1030j3517
17788C2021j6751p144j5894Q178L3401k798l8779m4232M879K9876n68K9383J6659
17775B8231j0440k8737K4857Q328J0971J3334k2882m9395J3070J1076j5172J5449
17763a310m0357J2405N4526j6701j6924K581J0510r523m9117m1015k3208M0351
17751g7782L5644O1346J8620l8261m1700M532r149m7211P171J0555K7773J0114
$$ plain form
17839 28502 -15533 -12406 971 -13273 4282 15706 9184 8983 -35248 -58435 -57000 -49344 -38615
17826 -38615 -32054 -15593 -6482 5251 45232 43077 -9309 -56276 -48788 -86042 -88283 -64744 -55405
17813 -55405 -62565 -28043 -10577 -26515 -23124 -18227 1182 52362 27080 -11874 -40106 -38998
17801 -38998 -57644 -58005 -25116 -24021 -24990 -28287 -16536 29167 50379 68903 76568 45538 32021
17788 32021 15270 8126 -7768 410 33811 31013 -7766 -51998 -47119 -17243 -17811 11572 28231
17775 28231 17791 -10946 13911 22239 33210 46544 23662 -25733 -12663 -1587 -16759 -1310
17763 -1310 -41667 -29262 25264 8563 -8361 -5780 4730 -4793 -53910 -94925 -118133 -77782
17751 -77782 -42138 19208 37828 -433 -42133 -37601 -46750 -93961 -86790 -76235 -48462 -38348
17739c8348J2008R793J3533j343q203j509j3325Q878q849R741J8178l249p556
17726a0251L2054j0850m3158L3941N0169K3816m2069j0967k6226K5602M2901K321
17714F7283l0822j0159J5941M185k3455m1818J2361K5536J1573j7449n1490n3120
17702i1434L824N1288L7511J3645J0666n580L4306K1062q854j7088N096K532j0502
17689D6472k8865k9074j5283J7250K4521j7327l3264Q926L3963m1841j5614J6131
17677c4005j0021L8712J0596k1114m631j3733J6714k534r133n671K536K1395j2187
17664b3076M0538l71L688k883l5383j6017K9663J528k6151N631L550j151M9229
17651B8795m4946k2580k2075J3378P2543N3257j7643o4541l7650l0512l789L2089
$$ plain form
17739 -38348 -26340 -16547 -3014 -4357 -12560 -14069 -27394 -18516 -27365 -17624 554 -2695 -10251
17726 -10251 21803 10953 -32205 1736 51905 75721 33652 22685 -3541 22061 64962 67283
17714 67283 36461 26302 42243 46428 22973 -18845 -6484 19052 30625 13176 -38314 -91434
17702 -91434 -87610 -36322 1189 14834 25500 19920 54226 75288 66434 49346 54442 56974 46472
17689 46472 17607 -11467 -26750 -9500 15021 -2306 -35570 -26644 7319 -34522 -50136 -34005
17677 -34005 -44026 -5314 5282 -15832 -20463 -34196 -17482 -20016 -29149 -34820 -32284 -10889 -23076
17664 -23076 17462 17091 20779 17896 -17487 -33504 -3841 -2313 -28464 -22833 -19283 -20434 28795
17651 28795 -16151 -38731 -60806 -47428 25115 78372 60729 -3812 -41462 -71974 -75763 -43674
17639d3674p841k094N6284K745J9702K184m1295m5639l1287l0731M2292O552m602
17626g7404M4638J3157l0200l0768j5194N5020K3022K2992p361l0975J0065M2229
17614A9221M62Q648k2623k8031m4253N504L3810J5746k2441J8271R933K6075j4609
17601E713l8535n8391R06R470K2979J1694J6102L0611Q614L4797k9812k2454m945
17588a3251k5891Q566J4820J144q462K7568k4301m1708K8722M0411l3512m5960
17576g1854j4275O1109K6519q116O534L0015q322j1328j6906l6147L3930K7839
17564A8998R352m538j4060l9096P258n3804m379J0720q674j2125L0127N6488K6480
17551B2747j5668Q701L9210j670l0547m1670J0629r831j6093k2671o138L7822
$$ plain form
17639 -43674 -51515 -53609 2675 5420 25122 27306 -13989 -59628 -90915 -121646 -79354 -72802 -77404
17626 -77404 -32766 -19609 -49809 -80577 -95771 -40751 -17729 5263 -2098 -33073 -23008 19221
17614 19221 19683 28331 5708 -22323 -66576 -61072 -27262 -11516 -33957 -15686 -5753 20322 5713
17601 5713 -32822 -91213 -90307 -80837 -57858 -46164 -30062 549 9163 43960 14148 -8306 -13251
17588 -13251 -39142 -30576 -15756 -14612 -23074 4494 -19807 -61515 -32793 7618 -25894 -71854
17576 -71854 -86129 -25020 1499 -6617 -83 29932 21610 10282 -6624 -42771 -8841 18998
17564 18998 28350 23812 9752 -29344 -22086 -75890 -80269 -69549 -78223 -90348 -60221 -3733 22747
17551 22747 7079 15780 54990 53320 22773 -18897 -8268 -18099 -34192 -56863 -63001 -25179
17539b5179K01j4796K5449N921J289j6109q549P851j6419J9933L5708l0769k9108
17526d4577l45K4580M737L992N3176K3253n145k0581j2961n201p770j5449k5475
17513b7766Q558j8174J914K3024O073K3014J7934j6540m7157K1136J1344Q007
17501A1367Q213M954J3686K9228l8367m1752n1229J7772M7499k42j7460o585l743
17488b6659j6920L1692j1055o143k2648K4054K4936Q204O200k3002l1251J684
17476d0908M9710k2573j9406j511J9888J4141J2099l3536k5517N9316O104k2670
17464d863K9317K8575k7523k0346L174J7669J0750K696K5339O919J4812n989J6807
17451I7337k7998n3969K3219J6346N883J8625N0456R0500J63164J89444k1636
$$ plain form
17539 -25179 -24978 -39774 -14325 -8404 -7115 -23224 -31773 -23922 -40341 -20408 15300 -15469 -44577
17526 -44577 -44922 -20342 -15605 -11613 41563 64816 59671 39090 26129 20928 13158 -2291 -27766
17513 -27766 -19208 -37382 -35468 -12444 -6371 16643 34577 18037 -29120 -7984 3360 11367
17501 11367 19580 24534 38220 67448 29081 -12671 -63900 -46128 1371 1129 -16331 -22916 -26659
17488 -26659 -43579 -11887 -22942 -29085 -51733 -27679 -2743 5461 11661 -11341 -42592 -40908
17476 -40908 8802 -13771 -33177 -34688 -14800 -659 11440 -22096 -47613 11703 17807 -4863
17464 -4863 24454 53029 25506 5160 8334 26003 36753 39449 64788 71707 86519 80530 97337
17451 97337 69339 15370 38589 54935 60818 79443 129899 220399 383563 573007 551371
17440E51371k28932j51187o0412K785j0860k1614r507K7204P005r104k2502j4108
17428F0139Q05K1434m2517n0404j1316N707l5028j5323K1309N1441J048J011j9311
17415a1005q011l4076J8319j2000r263l701J3425L0792J5610l7821j273M3831
17403D827K7231o601j1071k3560q450J8465K1588J5084k5294j6946L382K9746
17391B8401j3770l2050l576J5052l849k1874j5363k3N2110L7605l1756K8233J4050
17378E3190r287j9783k9914p727Q697K3185j9658K399J2459l2933l5497L2718
17366b2151N8399J116j0992k6402n8163O590j481K5981M3456k4994r980N0507
17354C1886J1332o034k3993J0428n9453L0583j4278J4662P274L4449j885n3900
$$ plain form
17440 551371 322439 171252 110840 113625 102765 81151 71644 98848 105853 96749 74247 60139
17428 60139 60944 82378 39861 -10543 -21859 -16152 -51180 -66503 -45194 6247 7295 8306 -11005
17415 -11005 -19016 -53092 -34773 -46773 -56036 -59737 -46312 -15520 90 -37731 -39004 4827
17403 4827 32058 25457 14386 -9174 -17624 841 22429 37513 12219 -4727 -1345 28401
17391 28401 14631 -17419 -20995 -5943 -9792 -31666 -47029 -47052 5058 42663 10907 39140 53190
17378 53190 43903 24120 -5794 -13521 -4824 18361 -1297 1102 13561 -19372 -54869 -22151
17366 -22151 36248 37364 26372 -30 -58193 -51603 -53084 -27103 16353 -8641 -18621 31886
17354 31886 43218 37184 13191 23619 -35834 -5251 -19529 -4867 2407 36856 34971 -18929
17342a8929j0286K6151K6459k1051k7104K7655K1375K3386J2699m541l3926m5274
17330b3386j7402j2964O3888J9093l2479k8456J9607K2749n99j7415k2964k8292
17318e8620j0355K5035L625l9419o093M6459L4367r958k6537L1157K0036l0503
17306b0806L627J2567p748k4772k480R313l5307K3385P9584M0956l2642l7926
17294G751j9598L1163j8465R440R515k6124l9410K4335O805J1600J709K2495R688
17281C0904k5427m7880Q928M5348M055m3692m207O363J1379L743J8518j2568N70
17268c966j8528l629j3340K839O214L9626K3790p871K1375m8816j9490j2635J1238
17255b3193l7109j6082M9629K3099K3046K3194m6242m1580K601L753k5744k9905
$$ plain form
17342 -18929 -29215 -3064 23395 2344 -24760 2895 24270 47656 60355 55814 21888 -23386
17330 -23386 -40788 -53752 10136 29229 -3250 -31706 -12099 10650 10051 -7364 -30328 -58620
17318 -58620 -68975 -43940 -40315 -79734 -85827 -39368 -5001 -14959 -41496 -10339 9697 -20806
17306 -20806 -17179 -4612 -12360 -37132 -39612 -30299 -65606 -42221 37363 78319 45677 7751
17294 7751 -11847 19316 851 10291 19806 -6318 -45728 -21393 -14588 -2988 -1279 21216 30904
17281 30904 5477 -42403 -33475 11873 15928 -27764 -31971 -25608 -14229 -10486 8032 -4536 -3966
17268 -3966 -22494 -26123 -39463 -36624 -30410 9216 33006 25135 46510 -2306 -21796 -34431 -23193
17255 -23193 -60302 -76384 -26755 -3656 19390 42584 -3658 -45238 -42637 -38884 -64628 -94533
17243i4533K8320N7874j5261Q537N605N11J8104K243P022K4289k9176j9344K8371
17230B2562M0894J5568l9000l0646m615l172O576k5080k5308J9668N0151L2473
17218F0071K916q790K5494J8225m4399o6720L128O841j4954j1761R16k2449J5798
17205c5684J8213N8827K3194j0221m5140j931J1870L4082j7620k8350j0069K5059
17193B2230o131J8622j4160k7826m2812P677j2033K8557Q1107N105m1161j4104
17181E071k9573K8289K4523J2716j294K9484k7955l2707l3119K9459m007n647
17169d760L0062n147J7685q17j1221j0565j6695m758k0957J7259J3220j2279J2319
17156C346M3840k806n2396j2039Q202j04m43l790P624M6418L0253k619n1503k5317
$$ plain form
17243 -94533 -66213 -8339 -23600 -15063 -9458 -8947 9157 11400 18422 42711 13535 -5809 22562
17230 22562 63456 79024 40024 9378 4763 1591 8167 -16913 -42221 -22553 27598 60071
17218 60071 62987 54197 79691 97916 53517 -13203 -10075 -3234 -18188 -29949 -29033 -51482 -35684
17205 -35684 -17471 41356 64550 54329 9189 7258 19128 53210 35590 7240 -2829 22230
17193 22230 16099 34721 20561 -7265 -50077 -42400 -54433 -25876 55231 60336 19175 5071
17181 5071 -24502 3787 28310 41026 39732 69216 41261 8554 -24565 4894 887 -4760
17169 -4760 25302 20155 37840 37023 25802 15237 -1458 -6216 -27173 -9914 3306 -8973 3346
17156 3346 47186 44380 -8016 -20055 -11853 -11957 -12400 -16190 -8566 37852 68105 65486 13983 -11334
17142a1334m5280N356K7448M1941j0456K7909K2420l036j9397l023Q591r024o592
17129B5523k3568k6342m888M222L0096O051n28k382m0980k0630O345j0793j8892
17116g6766K4123O3400O4989O42j9755r544k7284J2162K4214J2734k302m4792
17104B1821j1345j6518k3500J5029M3217N6878l2198k8072k155j8963j6051j0194
17092b2051l034k0557m97J9959j9889l3883k0474L8724L6357K3517P277m545l6664
17079c5760j3617K6837K8360L3747j2659k9363l1452L653M109J2155k9425k7682
17067g1097k14L1157J3008o072j229O1603N6m5467L1240m930n7116l0630K5738
17054e3953J5136k7938M0348M8436L2503M6811J0200l4345l1161k100n686j0373
$$ plain form
17142 -11334 -56614 -51258 -23810 18131 7675 35584 58004 54968 35571 32548 41139 32115 25523
17129 25523 1955 -24387 -29275 -25053 5043 11094 10566 8184 -32796 -53426 -47081 -57874 -76766
17116 -76766 -52643 10757 75746 76388 56633 47089 19805 31967 56181 68915 66613 21821
17104 21821 10476 -6042 -29542 -14513 28704 85582 53384 25312 23157 4194 -11857 -22051
17092 -22051 -25085 -45642 -46139 -26180 -46069 -79952 -100426 -61702 -25345 -1828 5449 904 -35760
17079 -35760 -49377 -22540 5820 39567 26908 -2455 -33907 -30254 -26145 -13990 -43415 -71097
17067 -71097 -71311 -40154 -27146 -33218 -34447 27156 27212 -18255 12985 8055 -49061 -79691 -53953
17054 -53953 -38817 -66755 -26407 22029 54532 101343 111543 77198 46037 43937 38251 27878
17042B7878k4481j6452n006R235j3919k2233L5929K3908M654m766l8925j7238
17030d1416L4663j5644k4863O602K1030m3K3309P390k4925j2536K229J0465K3087
17017I348L6418j1497j2390l5691j5338j5221k7021J3108j4771L2178L9954j0676
17005a1599j5457O0952L9510o360j1347l8643l3103k0486l1564J2148K1163L5236
16993D50J2633R888j7211K3272O74k7217j2445L9432M125k1817R267J231P064
16980B9346M5521j1861m8571q440n391J083j10n1933j0879M1611K2146L4955m7408
16967i931l3827J3137O0829K6481k6100m1548l2630K3208L8494J0784n6023k8968
16955e6094J4818k312j2366L0983j6649O667N856K6689j5061l7812n560l3298
$$ plain form
17042 27878 3397 -13055 -18061 -8826 -22745 -44978 -9049 14859 19513 14747 -24178 -41416
17030 -41416 -6753 -22397 -47260 -40658 -19628 -19671 3638 11028 -13897 -26433 -24204 -13739 9348
17017 9348 45766 34269 21879 -13812 -29150 -44371 -71392 -58284 -73055 -40877 -923 -11599
17005 -11599 -27056 33896 73406 67046 55699 17056 -16047 -36533 -68097 -55949 -34786 450
16993 450 13083 22971 5760 29032 29706 2489 -9956 29476 33601 11784 21051 22282 29346
16980 29346 74867 63006 14435 5995 604 1687 1577 -50356 -61235 -19624 2522 37477 -9931
16967 -9931 -43758 -30621 30208 56689 30589 -10959 -43589 -20381 18113 28897 -27126 -56094
16955 -56094 -41276 -43588 -55954 -24971 -41620 -34953 -29097 -2408 -17469 -55281 -60841 -94139
16943i4139K5415L2284j4745j980O727P7K7643J2344L656M7716K232l5076l7219
16930b5065Q952q933k5984P1122Q28l4093k4206n5313j5519l990j9469N7774M8159
16917b5737J3377m4836k0276j6110J2883J5426m7127j6619M8717J9798K3880J1776
16905b4848k421O712J7553k3533L7871J6019j4754K3768m5960m1862J0984J1338
16893b9133k846K7780L5525m624m9482r084J8250n691m9166J6159K7900k917J1112
16880a6217J1469j4837J9869N3934N6729Q7623N7512L9387o6356p0717m0606m7648
16868G0142J3065K1756J2684k4670o7698k5712j4036M576K832o721l3334o521
16856e3637q200P183K322j0835j4137N7593N5215k8705k6143J4164j0628j5919
$$ plain form
16943 -94139 -68724 -36440 -51185 -53165 -46438 -46361 -18718 -6374 -2718 44998 47230 12154 -25065
16930 -25065 -16113 -25046 -51030 20092 20920 -13173 -37379 -92692 -108211 -112201 -131670 -73896 -25737
16917 -25737 -12360 -57196 -77472 -93582 -80699 -65273 -112400 -129019 -80302 -60504 -36624 -24848
16905 -24848 -27269 -20557 -3004 -26537 11334 27353 12599 36367 -9593 -51455 -40471 -29133
16893 -29133 -31979 -4199 31326 26702 -22780 -31864 -13614 -19305 -68471 -52312 -24412 -27329 -16217
16880 -16217 -4748 -19585 284 54218 110947 198570 256082 295469 229113 158396 117790 70142
16868 70142 83207 104963 117647 92977 25279 -433 -14469 -9893 -7061 -13782 -47116 -53637
16856 -53637 -61837 -54654 -52332 -63167 -77304 -19711 35504 6799 -19344 -5180 -15808 -31727
16844c1727J8681l2200q28K9749K8100J9786r042q16q585l4005j1885l539K897
16831c3414n963m3544O384L8618N3440O4274m2069m5118K002J025J9786N8879
16819G4300l0759p9040l2639L1937j564k3147J2201k455l4624J4058N316K9570
16807c6846K0840K7277n653k0855k0047j7324K3095N4214j175J674o507L7088
16795E5781n1755l2387k42M403M187j1031L4062O1164L751p0217j2291j4081Q046
16782b0610J963K1052j6399p885l071J0584M138l1445k0667J7381j4657M916L3250
16769b1450L0194O037o1074K670L7974K3105o939l5247J6713J7906j1097m1067
16757d2275L7168q857L6698O593k2260K4860M206l3331k3270r685k9711L2665
$$ plain form
16844 -31727 -13046 -45246 -46074 -16325 11775 31561 22519 21703 13118 -20887 -32772 -36311 -33414
16831 -33414 -39377 -82921 -76537 -37919 15521 79795 37726 -7392 -5390 -4365 15421 74300
16819 74300 43541 -35499 -68138 -36201 -37765 -60912 -48711 -51166 -85790 -71732 -66416 -36846
16807 -36846 -16006 11271 5618 -15237 -35284 -52608 -29513 24701 23526 25200 18693 55781
16795 55781 4026 -28361 -28603 -24200 -20013 -31044 3018 64182 67933 -2284 -14575 -28656 -20610
16782 -20610 -18647 2405 -13994 -21879 -24950 -14366 -10228 -41673 -62340 -44959 -59616 -54700 -21450
16769 -21450 8744 14781 -46293 -43623 -5649 17456 10517 -24730 -8017 9889 -1208 -42275
16757 -42275 -5107 -13964 22734 29327 7067 31927 36133 2802 -20468 -30153 -59864 -27199
16745b7199N8705N367K565J784l301l3137l3614K7482Q225K433K0593J44O415
16732C6462l068j8301R267l3820j2807K0628l726m0976K31J5922L2733M2709j8646
16719B6608p540J4572k5685l3601K634L577k9328j7286l8871j8548J3663N8796
16707e1009J5922K2593o254L3749J1286k6136P862k9787j7920p761K3310Q10j3531
16694c6866p757j6874j0135N373j4936M8504N9412n87j6654m0372l4837J2023
16682e3706J5299J5158J7795j2497j9912j2630N6248L8791J5934j9799K0228L57
16670F1266k2159J8085r428j2372r383j8698l2652K5176J3210K9313O152k8156
16658B0354l2195k4030j3264K3433J4504l1543n2116r357J740P0162J7261k6331
$$ plain form
16745 -27199 31506 36873 39438 41222 37921 4784 -28830 -1348 6877 9310 29903 30047 36462
16732 36462 33394 15093 24360 -9460 -22267 -1639 -5365 -46341 -46110 -30188 2545 45254 26608
16719 26608 19068 33640 7955 -25646 -23012 -19435 -48763 -66049 -104920 -123468 -109805 -51009
16707 -51009 -35087 -12494 -18748 15001 26287 151 8013 -21774 -39694 -47455 -24145 -23335 -36866
16694 -36866 -44623 -61497 -71632 -66259 -81195 -32691 26721 26134 9480 -30892 -65729 -53706
16682 -53706 -38407 -23249 -5454 -17951 -37863 -50493 5755 44546 60480 40681 60909 61266
16670 61266 39107 57192 47764 35392 26009 7311 -25341 -165 13045 42358 48510 20354
16658 20354 -11841 -35871 -49135 -25702 -11198 -42741 -94857 -104214 -102474 -32312 -15051 -41382
16646d1382J9205K0147k7610m4129J332K0722n793J7659Q561j411k6300J223M2144
16633a5632N4038J3061O142j9861k0276Q55N965r829k179j997K7728M379m1946
16620D48j5026j9659k3591N851l7177q554P7607J2350j6259J0846J1452J4419
16608A2707K7878M746R701R735r009p582k538k1277l9414L3631L4233m4402o7318
16595e8909m2177J4463L3169K8569L6329r98K345O474j7626l0874k8419L765k6269
16582h0158j6265l381N2054K5864J6296j3527j9815L4930K984K2070P272n8062
16570b9738j2410J8047k6577j1514l3701N559Q7232J0292j9959L708L8245J1158
16558D0342j7637M284O536l436j773J2848j9238j9608m554j2522j4220k3760o00
$$ plain form
16646 -41382 -22177 -2030 -29640 -73769 -72437 -51715 -57508 -39849 -31288 -32699 -58999 -57776 -15632
16633 -15632 38406 51467 57609 37748 17472 18327 24292 14463 12284 10287 38015 42394 448
16620 448 -14578 -34237 -57828 -51977 -89154 -97708 -20101 -7751 -24010 -13164 -1712 12707
16608 12707 40585 45331 55032 64767 55758 48176 45638 24361 -15053 18578 52811 8409 -58909
16595 -58909 -101086 -86623 -53454 -24885 11444 10446 12791 19265 1639 -29235 -57654 -53889 -80158
16582 -80158 -96423 -99804 -47750 -21886 -5590 -19117 -38932 -4002 -1018 21052 28324 -29738
16570 -29738 -42148 -24101 -50678 -62192 -95893 -90334 -3102 7190 -12769 -9061 29184 40342
16558 40342 22705 26989 33525 30089 28316 41164 21926 2318 -2236 -14758 -28978 -52738 -53338
16545e3338J8617j0676K0636k2597j9622K0728L2154m718j8991j5619q352K5569
16533c6209J4223J3393L1702r543O996K7781q886k3849n834o3405l0947N7891
16521b6687N9484J5269o071k1648k8666k6424Q641K316j1454j140J6807P722K3443
16508A1592L976n750J3626k5126j1870k872o344j2084J2761K6518l0726l2917
16496e9216m2660K7773Q391K2084J8060R813J2105J0280K1483J3302j2580n6553
16484b7718l885Q403j0017j5766j7353K8637J3081K6587L0069j0422k6944k3201
16472b8529k1195r89m916R872P487k3697K3832K5889l6146k0502K6663K1797J541
16459a8893P559j7376L319L9147R173j9674P670j6981L757K034L0093J4565k4016
$$ plain form
16545 -53338 -34721 -45397 -24761 -47358 -66980 -46252 -14098 -18816 -37807 -53426 -61778 -36209
16533 -36209 -21986 -8593 23109 13566 20562 48343 39457 15608 9774 -53631 -84578 -26687
16521 -26687 32797 48066 41995 20347 -8319 -34743 -26102 -23786 -35240 -36380 -19573 -11851 11592
16508 11592 15568 9818 23444 -1682 -13552 -16424 -22768 -34852 -22091 4427 -26299 -59216
16496 -59216 -101876 -74103 -65712 -43628 -25568 -15755 -3650 6630 28113 41415 28835 -27718
16484 -27718 -31603 -23200 -33217 -48983 -66336 -37699 -24618 1969 32038 21616 -5328 -28529
16472 -28529 -49724 -50713 -55629 -45757 -38270 -61967 -38135 -12246 -48392 -68894 -42231 -20434 -18893
16459 -18893 -11334 -28710 -25391 13756 22929 3255 10925 -6056 -2299 -265 29828 44393 20377
16446B0377N1055R175l7343L0307j8273j9961k5453m2760m8868J5169J3676J1120
16434d1779j8550r98M5808P3351n538j8611j7263k2197j0857j4041m0017J7515
16422e3177K6738K4002j9778L279K0598J8029l440m4042k2963j0277Q634n776
16410e8173J6608L4238m1559l8353J5104L4379j6969j1898L741J0515l530K9592
16398b6305j0509O493J204m2788R385N1522K0611J6577K176q893j0997o993K615
16385D098N666J5463k144K1035M556n9O949R67l9687m8463O722L0844O126l1532
16371a9459n84K0129P969L0205o736l1059L798Q243k8956K96J9827j7383r517
16358b3227M984L3235M5421k3972k9004k5643L6879r676J2023R973j8059j0966
$$ plain form
16446 20377 71432 80607 43264 73571 55298 35337 9884 -32876 -81744 -66575 -52899 -41779
16434 -41779 -60329 -61327 -15519 57832 52294 33683 16420 -5777 -16634 -30675 -70692 -53177
16422 -53177 -26439 -2437 -22215 -18936 1662 19691 16251 -27791 -50754 -61031 -52397 -58173
16410 -58173 -41565 -7327 -48886 -87239 -72135 -37756 -54725 -66623 -62882 -52367 -55897 -26305
16398 -26305 -36814 -30321 -29117 -71905 -62520 -10998 9613 26190 28366 19473 8476 1483 4098
16385 4098 9764 25227 23083 44118 48674 48615 55564 56531 16844 -31619 -24897 5947 12073 -19459
16371 -19459 -20043 86 8055 38260 31524 465 4263 12506 -16450 -16154 3673 -13710 -23227
16358 -23227 -18243 14992 60413 36441 7437 -18206 18673 8997 21020 30993 12934 1968
16346A968j9085M143q729M839O589J9798L326J8649j2627K391L1973p95o3998
16333a1558l3378R230K8126N15K4026m4749k6007l381J5108K6353Q412L7394L635
16320C3726l3277j4201k9518J1201m548O260J0717M5362j8953l0580j8037j3633
16308e5481K5846J3301L851n124M725R070L2264m0132J9424K1116j2463k7044
16296a0647j0569q587R93L1629K2736N363R702P397j9394n1936Q682m627k0319
16283c9577j2788q570L3123J2002l2144N3985M7151L732J5673L7328k9095n3034
16271B7786m7904P960J9001j8995p2612K990M031N0412K1692K0439n2193l2584
16259f9977K336L8722J5521J4701K9518o6549m8851N393q045O3792J7163k7535
$$ plain form
16346 1968 -17117 -12974 -21703 -16864 -10275 9523 12849 31498 18871 21262 53235 52440 -11558
16333 -11558 -44936 -35706 -7580 -7065 16961 -27788 -53795 -57176 -42068 -15715 -7303 30091 33726
16320 33726 449 -13752 -43270 -32069 -36617 -30357 -19640 25722 6769 -23811 -41848 -55481
16308 -55481 -29635 -16334 -12483 -17607 -12882 -3812 28452 -11680 7744 28860 16397 -10647
16296 -10647 -21216 -29803 -28810 2819 25555 30918 40620 48017 28623 -23313 -14631 -19258 -39577
16283 -39577 -52365 -60935 -27812 -15810 -47954 6031 53182 56914 72587 109915 80820 27786
16271 27786 -20118 -12158 6843 -12152 -84764 -81774 -77743 -27331 -5639 14800 -37393 -69977
16259 -69977 -67641 -28919 -13398 1303 30821 -35728 -84579 -79186 -87231 -23439 -6276 -33811
16247c3811l2436J0609r049j5704m3542K566J1317l685K4827N0093J389j188L6436
16234b178L8561L8584l0886q034m4662o923K3180M857j1578q315m3985K0748j2676
16221d3307J1137O115J3156J0929J4199J1522J5752j1796r359j239j7106J2529
16209A2532m397J4546j5527m323j0766j262j4170J4347J2156J7645J9745L3171
16197G3697m6243o1056K2708j8212r174K8140l141L1907K7230j9499k2303m7053
16185d2999K7170M2519O900k3393J0773j3163k0210o672l7205P993K2238K3311
16173b738O5831L9901n0401k9059J1267j5546J2951n082Q73k202k9620q831L6713
16160B4057M4743L8861k8876l1682n4549K0049l74k7662L3835J7638j6395j4014
$$ plain form
16247 -33811 -66247 -55638 -64687 -80391 -123933 -121367 -110050 -113735 -88908 -38815 -37426 -38614 -2178
16234 -2178 36383 74967 44081 36047 -8615 -15538 7642 12499 921 -7394 -51379 -30631 -43307
16221 -43307 -32170 -26055 -12899 -1970 12229 23751 39503 27707 18348 17109 3 12532
16209 12532 8135 22681 7154 2831 -7935 -9197 -23367 -9020 3136 20781 40526 73697
16197 73697 27454 -33602 -10894 -29106 -38280 -10140 -13281 18626 45856 26357 4054 -42999
16185 -42999 -15829 26690 33590 10197 20970 7807 -12403 -19075 -56280 -48287 -26049 -2738
16173 -2738 63093 102994 52593 23534 34801 19255 32206 27124 27997 25795 -3825 -12656 24057
16160 24057 68800 107661 78785 47103 -7446 12603 12229 -15433 18402 36040 19645 5631
16148E631M998j072k7162K856j0436J0497k3181J582J4028j2699j7665L7068M7159
16135C1604J0843O037N975j8886k4460K085n932Q811j5158q281J1998m0445m3287
16122g9096K8196k139L7123N2627k3514m4876K1819L6818R872J3436N474j4062
16110D1678k9817j754o307j4682j2429J4159j0429n2541L4585M5223N225P704
16098B0615J2100j0584l0074n2620L4K9830k60K6487N203k3781L7274j0215k5866
16085b1857L2148P081l8995l3581k5441j3377J1532J9636P806K6306L0099M2974
16073D4331J4921k9013p101l2818m1803N610j3985J3492J8316J6473J2935j6291
16061a4933J4406o324j4212L1739P4992K1327j8027k8955J0089j8224n5406l6703
$$ plain form
16148 5631 10629 9557 -17605 -14749 -25185 -14688 -37869 -36287 -22259 -34958 -52623 -15555 31604
16135 31604 42447 48484 54459 35573 11113 13198 7266 16077 919 -7362 4636 -35809 -79096
16122 -79096 -50900 -53039 -15916 36711 13197 -31679 -9860 26958 36830 50266 55740 41678
16110 41678 11861 10107 3800 -10882 -23311 -9152 -19581 -72122 -37537 7686 12911 20615
16098 20615 32715 22131 -7943 -60563 -60529 -30699 -30959 -4472 731 -23050 14224 4009 -21857
16085 -21857 10291 17372 -21623 -55204 -80645 -94022 -82490 -62854 -55048 -28742 1357 44331
16073 44331 59252 30239 23138 -9680 -51483 -45873 -59858 -46366 -28050 -11577 1358 -14933
16061 -14933 -527 -6851 -21063 10676 85668 106995 88968 60013 70102 51878 -3528 -40231
16049d0231j6566O791L976l880M8659L5559Q821m9321O921N699k3527m893L4720
16036A2728p634m8332p258M7554K1671j4321j3301j5394m240n550L0611K9372
16024B5906N106M68l4079n581J9331K7873k094j3200j3581j6571j4046N0836K2939
16011E3307k9222K202m210k4394k6617n26k3199k4335L9493N3800K8103J6046
15999F0448j348m8464k8509L4285Q111O050j347K1304K447m4919p340J7183k3339
15986e438k7227J0255j2841J4898K7528O914k2435j4552J4218l6284l1242k5868
15974a02074J5119L4447Q285L2284M2958L7495k747J3845l8806n0198j9781J9716
15962i457L8584J3947j0862j1852L3812Q483J7057k631l2180N844j4157j2536
$$ plain form
16049 -40231 -56797 -50006 -46030 -49910 -1251 34308 43129 -6192 729 6428 -17099 -21992 12728
16036 12728 5094 -43238 -50496 -2942 18729 4408 -8893 -24287 -28527 -34077 -3466 25906
16024 25906 31012 31480 -2599 -8180 11151 39024 36930 23730 10149 -6422 -20468 30368 53307
16011 53307 24085 26287 22077 -2317 -28934 -29460 -52659 -76994 -37501 16299 44402 60448
15999 60448 59100 10636 -17873 16412 24523 30573 29226 50530 52977 8058 718 17901 -5438
15986 -5438 -32665 -22410 -35251 -20353 7175 14089 -8346 -22898 -8680 -44964 -76206 -102074
15974 -102074 -86955 -52508 -44223 -11939 31019 68514 65767 79612 40806 -9392 -29173 -9457
15962 -9457 29127 43074 32212 20360 54172 62655 79712 77081 44901 50745 36588 24052
15950B4052L19j8805M617k577k3230P60j2758R513J2024k0551J6958J0109o296
15937e865q411j8390J5096J6758j386J4194K60j5361j4764k6072m134k2621O202
15924f4494N374o14j2415K2902N5567J6771j6513m366q349l2687L7865K3053K277
15911B4371p5o645J012k0553j1912K226M260r355N6969L612k0812l4375Q5758
15898G4481L9918l3200m112j595l1364k4J4428l2561K320M354p0617l7256K1221
15885e4007M3616o537K364n476p014M5484N8024M722j0179o782m423l936j8469
15872C7387o41l9462l2051l54k0993m182M1766P373l7447R132L6628n215M178
15859c881l5351J4726O0543k6501j4412K3726j3558l4469o981l439N6905p723
$$ plain form
15950 24052 24371 5566 10183 7606 -15624 -14864 -27622 -18109 -6085 -26636 -9678 431 -5865
15937 -5865 -14276 -32666 -17570 -812 -2198 11996 12256 -3105 -17869 -43941 -48075 -70696 -64494
15924 -64494 -59120 -59734 -72149 -49247 6320 23091 6578 2212 -6137 -38824 -959 22094 24371
15911 24371 24296 17651 18663 -1890 -13802 -11576 -7316 -16671 40298 43910 23098 -11277 74481
15898 74481 114399 81199 77087 75492 44128 44104 58532 25971 28291 32645 -37972 -75228 -54007
15885 -54007 -10391 -16928 -14564 -20040 -27054 18430 76454 81176 70997 64215 59792 55856 37387
15872 37387 36746 -2716 -34767 -35121 -56114 -60296 -18530 -11157 -48604 -39472 -2844 -8059 -3881
15859 -3881 -39232 -24506 36037 9536 -4876 18850 5292 -29177 -36158 -39597 17308 9585
15847I585k8044L185j9703l402J2726J65j8285l2461L3478q80M84J7155K9564
15834C567k1318J6350J9793p703k3301k2455R103l4413L825J3303M5756J3524
15822A6031q789O717K020r680j2643j4506P351k5059J665l1381J3994K5785K1966
15809f529k8028k937P805K1349k8489p2877K2904J3855P895K9882J7151q766l7101
15796f3886J5383K1223N373j0272J81N3254n789q9817n656K9045M4944K1201K7672
15783D2856J8732k6812o204l7932l0072k490j5908K544L7904M3030K7393n147
15771D7894m0202j8722M9929J7382j3553k7542r267p303j1130P400L088K8795
15759B6769j3492k7208l800K5137P725j5732K148J5030L7532j1583l640l3914
$$ plain form
15847 9585 -18459 -15274 -34977 -38379 -25653 -25488 -43773 -76234 -42756 -43636 -43152 -25997 3567
15834 3567 -17751 -1401 18392 10689 -12612 -35067 -25964 -60377 -56552 -43249 2507 16031
15822 16031 7242 13959 15979 6299 -6344 -20850 -13499 -38558 -36893 -68274 -54280 -28495 -6529
15809 -6529 -34557 -37494 -29689 -8340 -36829 -109706 -86802 -72947 -65052 -35170 -18019 -26785 -63886
15796 -63886 -48503 -27280 -21907 -32179 -31998 21256 15467 -74350 -80006 -50961 -6017 15184 42856
15783 42856 61588 34776 28572 -9360 -39432 -41922 -57830 -55286 -17382 25648 53041 47894
15771 47894 7692 -11030 38899 56281 42728 15186 5919 -1384 -12514 -5114 -2026 26769
15759 26769 13277 -13931 -17731 7406 15131 -601 1547 16577 54109 42526 38886 4972
15747D972k631k2026p261K6998q05M356N590j7418j836K33r115l0501J2585j0557
15733d7416K3689J0274J7287j304j8895n926J7663K2505N077p623J5604R435K214
15720D2584o4008m3104L915J0944L2664L1398R931J2547Q292L865K3551j2488
15708F0091j7181k6552J954k246k0579k3440j234p843j3622O6284J1933j4611
15696A2954k8055L254n116q108L7187M6742n771m5148M4318J8697k5356p0885
15684b5287j9939j8093j0636l88J3580j686N0865M4552J445m7327J6212R700K576
15671A5574K7564K3981k671j0544k2920j2776m3753M824Q868N47R013o128j7273
15658b5694l5181J7178K2304J0525j4706J6863k3529p328m405L502P070m0777
$$ plain form
15747 4972 2341 -19685 -26946 52 -753 3603 9193 -8225 -10061 -9828 -18943 -49444 -36859 -47416
15733 -47416 -23727 -13453 3834 2530 -16365 -22291 -4628 17877 22954 15331 30935 40370 42584
15720 42584 -21424 -64528 -60613 -49669 -17005 14393 24324 36871 45163 49028 72579 60091
15708 60091 42910 16358 18312 16066 -4513 -27953 -29187 -37030 -50652 15632 27565 12954
15696 12954 -15101 -11847 -16963 -25071 12116 58858 53087 7939 52257 70954 45598 -25287
15684 -25287 -45226 -63319 -73955 -74343 -60763 -62449 -11584 32968 34413 -12914 3298 12998 15574
15671 15574 43138 67119 64448 53904 30984 18208 -25545 -20721 -11853 -11306 -2293 -8421 -25694
15658 -25694 -60875 -43697 -21393 -10868 -25574 -8711 -32240 -39568 -43973 -40471 -33401 -74178
15646g4178j4140J4418j4860J0820M4795J3087m7885j9893J4118N0678K9790M9660
15634E6410L0732m7394p1882j6500p68L5784p470k3543J4799M5722K8906l8024
15622F772J4348M3447o1676l9002l1974L9538L5786r257k4874k1289k4600l0499
15610a03280N9265J6504k0291L6304L5693N511j5412l1568J2093o755j0871K489
15598b0318l6751j2828K9478L9812J6281m1913n873J0524l6260o46M1976O7620
15586E1102K7446j3061j4768p258J1756j441J2643l3469L776Q358k3698l9755
15574a8369l0388O226n932k1515J2852L3384J0398J2613j4034o964J0757K5417
15562A4445k7281q423j1751J8377N4962o350j8794K435k301k0481N217J1015n1099
$$ plain form
15646 -74178 -88318 -73900 -88760 -77940 -33145 -20058 -67943 -87836 -73718 -23040 6750 56410
15634 56410 87142 39748 -32134 -48634 -49402 -13618 -21088 -44631 -29832 15890 44796 6772
15622 6772 21120 64567 2891 -36111 -68085 -28547 7239 -2018 -26892 -48181 -72781 -103280
15610 -103280 -44015 -27511 -47802 -11498 24195 29706 14294 -17274 -5181 -11936 -22807 -20318
15598 -20318 -57069 -69897 -40419 -607 15674 -26239 -32112 -21588 -57848 -58494 -16518 51102
15586 51102 78548 65487 50719 43461 55217 53776 66419 32950 36726 45084 21386 -18369
15574 -18369 -48757 -42531 -48463 -69978 -57126 -23742 -13344 -731 -14765 -21729 -10972 14445
15562 14445 -12836 -21259 -33010 -14633 40329 33979 15185 17620 15319 -5162 55 11070 -40029
15549d0029r718K7733J5518K0193j8005K3607j3737j4807k0081M5479L378J7131
15537C6662k524J0635P738J3384l3224m6607j2690j1791J9922M827q58K9850K8634
15524D3958M913k2663p149j657k915m4747l1122k701L1134M7029j2980J8589j8891
15511G98j8628j8153l173Q771J6544k5596n6839q245L0652M2627L6728k6307k2878
15498d3699r568P4827N171l0098j6106j3990K3736J8267L6428J1034j3906L3698
15486G5794J4125l0655n4866k3264K0177P8909L78j9324K5827k4845j7528l4021
15474A0707K7060K7879P813J781l2030K4415K908j7798J147n024l056K449j7459
15461C0792k9602Q886n973k4498l838q882J1690J6751J3801l589j8809k7405L486
$$ plain form
15549 -40029 -49747 -22014 -6496 13697 -4308 19299 5562 -9245 -29326 16153 19531 36662
15537 36662 34138 44773 52511 65895 32671 -13936 -26626 -38417 -18495 -13668 -14526 15324 43958
15524 43958 48871 26208 19059 17402 14487 -30260 -61382 -64083 -32949 14080 1100 19689 798
15511 798 -17830 -35983 -39156 -30385 -13841 -39437 -96276 -104521 -73869 -31242 5486 -20821 -43699
15498 -43699 -53267 21560 26731 -3367 -19473 -33463 -9727 8540 44968 56002 42096 75794
15486 75794 89919 59264 4398 -18866 1311 80220 80598 61274 87101 62256 44728 10707
15474 10707 37767 65646 73459 75240 43210 67625 70533 52735 53882 48858 45802 48251 30792
15461 30792 1190 10076 4103 -20395 -24233 -33115 -21425 -4674 9127 5538 -13271 -40676 -37190
15448c7190p626L0035L3879J3205k258j0120k1489J3484L3892k4268l5524j7117
15436c1097J5049J0532O077J7823k030j0544J2086M2183k482O395o1174l6264
15424c3446J4176j159l0276k1220K3258O7969j5014j6542k1849j519m314k4135
15412f4071M4670K8594K0660l8051l2552J8757K970j4463l1438J4896J2160J4041
15400b3827K5395j3071m1733L3411L2803j1219m9069k2517k408j7163K6719M8513
15388a4166j4433k2229q73L1655k1271O5341M5671l5930m6068R851Q890J1551
15376A7989R660j4924o406j421J7625M6942K2673m6910l6883k3401k9263K7128
15364a7191K2921l4456r602q81r077k81R207K3479k9938k3865L4605j2034j1998
$$ plain form
15448 -37190 -44816 -14781 19098 32303 30045 19925 -1564 11920 45812 21544 -13980 -31097
15436 -31097 -16048 -5516 561 18384 16354 5810 17896 60079 57597 63992 2818 -33446
15424 -33446 -19270 -20429 -50705 -71925 -48667 19302 4288 -12254 -34103 -35622 -39936 -64071
15412 -64071 -19401 9193 29853 -8198 -40750 -21993 -19023 -33486 -64924 -50028 -37868 -23827
15400 -23827 1568 -11503 -53236 -19825 12978 1759 -47310 -69827 -72235 -89398 -62679 -14166
15388 -14166 -28599 -50828 -51701 -20046 -41317 24024 69695 33765 -12303 -2452 6438 17989
15376 17989 27649 12725 6319 4898 22523 69465 92138 45228 8345 -15056 -44319 -17191
15364 -17191 5730 -28726 -38328 -39209 -48286 -48567 -39360 -15881 -45819 -69684 -35079 -47113 -59111
15351e9111N3241L6971J6269J3575m996n648m6372k7693m9467K5489M6834M026
15339C118l1755J4150M225k488j4187k1141N549J8908L2833J0675l7136q469J4257
15326a1461k1283J2168l302K8150m958q853K0560l0902o087L4118M0418n6627
15314h059j8703J7329L0274j694K422j0861j1916L6234O682l1879L0877J3375
15302E4081k546n0832j6697r73N1280L2768l6753q468M0548O097l354k9137l8555
15289b541J821l9043q337N5608J7487j0113l2036k5485k0796K50p011K587k8159
15276i5768J8945K1320l567R947j2866L3618M7299K1268M006o31l752J792Q104
15263D9715n3000l654J5013p579j3009M26J607K5628p897q891k6361Q405J7125
$$ plain form
15351 -59111 -5870 31101 47370 60945 55949 50301 3929 -23764 -73231 -47742 -908 3118
15339 3118 -28637 -14487 -10262 -12750 -26937 -48078 -42529 -23621 9212 19887 -17249 -25718 -11461
15326 -11461 -32744 -20576 -23878 4272 -686 -9539 11021 -19881 -25968 8150 48568 -8059
15314 -8059 -26762 -9433 20841 19147 21569 10708 -1208 35026 41708 9829 40706 54081
15302 54081 51535 703 -15994 -16967 34313 67081 30328 21860 62408 68505 65151 36014 -2541
15289 -2541 -720 -39763 -48100 7508 24995 14882 -17154 -42639 -63435 -63185 -70196 -67609 -95768
15276 -95768 -76823 -55503 -59070 -49123 -61989 -28371 18928 40196 44202 43571 39819 41611 49715
15263 49715 -3285 -6939 8074 495 -12514 -12088 -10481 15147 7250 -1641 -28002 -19597 -2472
15250b472J3978L44J4695J4278J9641n402l306o940j7778m8842j6340j0703l9149
15237h7996J7471M2821J4319O5300L7614l0093q0029m1301j85l385J0875O940
15225d7649p197O1313L7905m7911m9368N744n303J4625J5715R460M8904R91K632
15212C9861j3623k0902j8260j3728l7172m4207J0251O2821L4305j2668J349m549
15200a6522m398J4666K0025n489K3266K1862j4602k1977l2572M0698J6557n0639
15188i125J5371J7610K639m6601M7913L7379j0210n753k5710l4839Q008m2956
15176d6274n688J730L8668M275K3919J3741M120K1768J8466o015n6096l9712J0473
15163a6625k5266l841j2368M9424M1348p173J1519n339N1928j7643k7789k9373
$$ plain form
15250 -2472 11506 11850 26545 40823 60464 55062 51756 44816 27038 -21804 -38144 -48847 -87996
15237 -87996 -70525 -27704 -13385 51915 89529 59436 -20593 -61894 -62079 -65464 -54589 -47649
15225 -47649 -54846 6467 44372 -3539 -52907 -47163 -52466 -37841 -22126 -12666 36238 37229 39861
15212 39861 26238 5336 -12924 -26652 -63824 -108031 -97780 -34959 -654 -13322 -11973 -16522
15200 -16522 -20920 -6254 13771 8282 31548 53410 38808 16831 -15741 24957 41514 -9125
15188 -9125 6246 23856 26495 -20106 27807 65186 54976 49223 23513 -11326 -3318 -46274
15176 -46274 -51962 -50232 -11564 -7289 16630 30371 34491 56259 74725 68710 12614 -27098 -16625
15163 -16625 -41891 -45732 -58100 -8676 32672 25499 37018 31679 83607 65964 38175 8802
15151H802J392J801r106K499M5439J6208R46j9483j1788m638j824m769j1432j765
15137A2282q014J5399J5074k6966j2900o982j7767k965J5565M2482J4993n312
15125C4889J1118q063j6719J0050m5004k2008K067O0446K3355J0378j9325r958
15113C1226L795K0749p025l4808J4657L9615k1888m0216m0167L7901L771m8503
15101d0893L4064L1647L192j6501k6755J203J2791m4821o039Q198K1116K741j2019
15088c2076j830p2957L7149R6571J2947n3154l935K669n5638k9706J1736O982
15076h1242L6052J5791K0839j1490o556L822j8476M407K5208M4566Q323m4429
15064c185j1372O023J0704L7764q62j1175L458k2581k4548M3063j5666q257l6350
$$ plain form
15151 8802 10194 11995 2889 5388 50827 67035 67981 48498 36710 32072 30248 25479 14047 12282
15137 12282 4268 19667 34741 7775 -5125 -12107 -29874 -32839 -17274 25208 40201 34889
15125 34889 46007 37944 21225 31275 -13729 -35737 -33670 26776 50131 60509 41184 31226
15113 31226 35021 55770 48745 13937 28594 68209 46321 6105 -34062 3839 7610 -40893
15101 -40893 -6829 24818 28010 11509 -15246 -14043 -1252 -46073 -52112 -43914 -22798 -20057 -32076
15088 -32076 -33906 -106863 -69714 26857 39804 -13350 -17285 -14616 -70254 -99960 -88224 -81242
15076 -81242 -45190 -29399 -8560 -20050 -26606 -22784 -41260 -36853 -11645 32921 41244 -3185
15064 -3185 -14557 -8534 2170 39934 39072 27897 31355 8774 -15774 27289 11623 3366 -32984
15051c2984l3834j8099K1095M2601K0760K0577q063j1480k0526l539n230L1879
15039C157P674J5916Q792l7640N5977K5030j6935j8870P035Q464k3442j1099k633
15026B1426j2506j4284j397m8564O95J4042J9574k353r985k1962L0980M3318J3486
15013C2470l9485K9573l799n831K4111M8582q782j2030q498j8280r341m736L8125
15000F2079j7969K1016N817p0942o1410p3862P363M187L6694L0809j5731L77q685
14987h0257J8058J8160P658J4455J5848K4289Q561j2270l822J0367J7329j5868
14975B2508p805M217k7821l3235N6275L7406k5079j1573l681n407K0051J0233
14963C6089k5337j6092M9200P368k6595J875j124j0763m1270L5391L2058l1326
$$ plain form
15051 -32984 -66818 -84917 -63822 -21221 -461 20116 12053 573 -19953 -23492 -28722 3157
15039 3157 10831 26747 35539 -2101 53876 78906 61971 43101 50136 58600 35158 24059 21426
15026 21426 8920 -5364 -6761 -55325 -54630 -40588 -21014 -23367 -33352 -55314 -24334 18984 32470
15013 32470 -7015 22558 18759 12928 37039 85621 76839 64809 56311 38031 28690 23954 62079
15000 62079 44110 65126 70943 1 -61409 -135271 -127908 -123721 -87027 -56218 -71949 -71572 -80257
14987 -80257 -62199 -44039 -36381 -21926 -6078 18211 26772 14502 10680 21047 38376 22508
14975 22508 14703 18920 -8901 -42136 14139 51545 26466 14893 11212 5805 25856 36089
14963 36089 10752 -5340 43860 51228 24633 26508 25384 14621 -26649 8742 40800 9474
14951I474l8991J3636r791J12J3315O903k5998J2950J5104j4001k927P949N249
14938g016L5793j143N339r395l1578k2587j9764N8925M2468q1123j3282K0356
14926b3007L563j2669j3781q96o563J3163L0262n581M432K7965q536J1210M303
14913B3865m5472k2045K1723Q6289Q832o8325n5247L785J7578J9948M7358K6253
14901F4542l0031o8625j5202K0867O874J7994J1727O774m2423k2496N1903M5829
14889D7733K2793j628j1747m0171J997l167K6095J4951o1663k4815j5551j0646
14877e5819J0926P15M2485N596K8502n64k3506j3098K4388P449o513P458k5942
14864B077m5588K4181M7940M8792r325k9044j8423K1833L382n0600l25L005M024
$$ plain form
14951 9474 -29517 -15881 -25672 -25560 -12245 -5342 -31340 -18390 -3286 -17287 -20214 -12265 -7016
14938 -7016 28777 27634 32973 23578 -8000 -30587 -50351 8574 51042 -30081 -43363 -23007
14926 -23007 -19444 -32113 -45894 -46790 -53353 -40190 -9928 -15509 -11077 16888 8352 19562 23865
14913 23865 -21607 -43652 -21929 64360 73192 4867 -50380 -46595 -29017 -9069 38289 64542
14901 64542 34511 -34114 -49316 -28449 -21575 -3581 8146 14920 -27503 -49999 1904 47733
14889 47733 70526 68898 57151 16980 18977 15810 41905 56856 -4807 -29622 -45173 -55819
14877 -55819 -44893 -44178 -1693 3903 32405 31841 8335 -4763 19625 27074 20561 28019 2077
14864 2077 -43511 -19330 28610 77402 68077 39033 20610 42443 45825 -4775 -5100 -2095 1929
14851A929P746j7272K057N3531M280p039n600j2179m3377N640K3971n6782k3951
14838f7046O0070O1794j9552k8073J0131K5071l2958m1078J1723N250J9080L29
14826D741m5750k0520N5440O922m518K2394K7642K0065j7563l6947M5053k5977
14814C0982l2937P955L102J3740o391L495K2384J2675K4701l3967j3355K727J4407
14801D9518J4404j373k0170j6795N244l7595j4157J9988K5208K2019k8543k4020
14789f272j7241m8053K1935K4824J7077J0259l790r678K0255M8718k6560j2432
14777A9042O5j5582P484j3397J7534K2949K590M860k8707m2521L4406L5813Q461
14764E2997k8892j3122n967k9430l667L6983M7264R66m9298n836J134O270L2322
$$ plain form
14851 1929 9675 -7597 -5540 47991 52271 45232 39632 27453 -15924 -10284 13687 -43095 -67046
14838 -67046 -6976 54818 35266 7193 17324 42395 9437 -31641 -19918 -14668 4412 4741
14826 4741 -41009 -61529 -6089 833 -3685 18709 46351 66416 48853 11906 56959 30982
14814 30982 -1955 6000 9102 22842 16451 19946 42330 55005 79706 45739 32384 35111 49518
14801 49518 63922 62549 42379 25584 30828 -6767 -20924 -936 24272 46291 17748 -6272
14789 -6272 -23513 -71566 -49631 -24807 -7730 2529 -1261 -10939 9316 58034 31474 19042
14777 19042 19107 3525 11009 -2388 15146 38095 40685 45545 16838 -25683 8723 44536 52997
14764 52997 24105 10983 5016 -24414 -28081 8902 56166 57132 7834 1998 3132 9402 41724
14751D1724j214l1787k1585Q403j4189J5884J9393K0138K3305K6366J5232M235
14739A05905m364L888l7413o0830j7784M6105k8353k783j389J791k8917j638k415
14726b8197k9228j2086K2362K3867Q461o997q330L4631K287r064j7903j7805n1199
14713h9201M6085L2847R017L4726k4563k3099q569J1208k5297J3436m885k033
14701c0328K598r047M2576J7383k3207M702k9445m2005K2167j6514l0282K8291
14689f3111L2163M3357J4859j3150k1745J2773L0761J3516R583k6975l8473l7206
14677d3648J3486K7674p584K5376L4303J6590Q261k3399o5064j6059O1571O0437
14665I1944O18p73m4847n9621j7026L090n620P304R013N7824J9946j4047j4000
$$ plain form
14751 41724 40510 8723 -12862 -4459 -18648 -2764 16629 36767 60072 86438 101670 105905
14739 105905 101541 105429 68016 7186 -10598 35507 7154 4371 2982 4773 -24144 -25782 -28197
14726 -28197 -57425 -69511 -47149 -23282 -14821 -21818 -30148 4483 6770 -2294 -20197 -38002 -89201
14713 -89201 -43116 -10269 -1252 33474 8911 -14188 -22757 -11549 -36846 -23410 -28295 -30328
14701 -30328 -27730 -36777 5799 23182 -25 4677 -24768 -66773 -44606 -61120 -91402 -63111
14689 -63111 -30948 12409 27268 14118 -7627 5146 35907 49423 59006 32031 -6442 -43648
14677 -43648 -30162 -2488 -10072 15304 49607 66197 74458 51059 -14005 -30064 31507 91944
14665 91944 92562 91789 46942 -12679 -29705 -26615 -32235 -24931 -15918 41906 61852 47805 33805
14652C3805Q847q901k8879J5722J5524J3361j1044j1730m2089J079J0100k5913
14640c0118k72j8475K33J2764K9008K2595m3667J6617N8304J458j9805L823l2104
14627C61k0786o955K151J2848M751K458O124L0463j953J9854l3992n434r380j8431
14613a7921P534N1254M2732O242l5168m0885J6584K6751k3398j641q788k1811
14601A485m9823L301M0391L3484K3411O349r1279j1237L5425K1811o882j2555
14589f119k596p194j8813R381O940k7234o3993j2573j1866L0737N4687l696L7889
14576a4450J5757j0243q174m2949K2223R1568L6269n1168l2156k4972K3134L162
14564H001K6973k7200k5941j8297K9708M521k2078J4630L0907j342j7064P635
$$ plain form
14652 33805 42652 33751 4872 20594 36118 49479 38435 26705 -15384 -14305 -4205 -30118
14640 -30118 -30390 -48865 -48632 -35868 -6860 15735 -27932 -11315 46989 48447 28642 32465 361
14627 361 -20425 -27380 -25229 -12381 -7630 -5172 952 31415 29462 49316 15324 9890 510 -17921
14613 -17921 -10387 40867 83599 89841 54673 13788 30372 57123 33725 32084 23296 1485
14601 1485 -48338 -45037 -4646 28838 52249 58598 -32681 -43918 -8493 13318 6436 -6119
14589 -6119 -8715 -15909 -34722 -25341 -18401 -45635 -109628 -122201 -134067 -103330 -48643 -52339 -14450
14576 -14450 1307 -8936 -17110 -60059 -37836 53732 90001 38833 6677 -18295 4839 8001
14564 8001 34974 7774 -18167 -36464 -6756 -2235 -24313 -9683 21224 19882 2818 10453
14552A0453k2168m7345L1972L8478j4643j8478j5426j4158o387r762L653J637
14540f2174j1153J1955K6445J3079J338k4538J341p117l2165J5764L0122K0305
14528a6798P830k8827J689J1014o291j3930J444J8281L7206M1314n8155m9381
14516e4604k5092K4981J9100M9244K6485j6971j6415P663J6098n894K2142j5249
14504C1488l1648n649L430K3400l5910j0288J3316O606R034k5214J580J2594K1398
14491A4137L2630l1380k1467r321K5266j2631K3479o961J9646L8345n6640l6911
14479b1808M6612N9813J1514J3278k2647j3968k7315l6062R326j0480j5320P0221
14467F3164M0326l9377m8120M833M060M705m332j9174J8663J5350l7573k7855
$$ plain form
14552 10453 -11715 -59060 -27088 11390 -3253 -21731 -37157 -51315 -57702 -67464 -63811 -62174
14540 -62174 -73327 -61372 -34927 -21848 -20510 -45048 -43707 -50824 -82989 -67225 -37103 -16798
14528 -16798 -8968 -37795 -36106 -25092 -31383 -45313 -43869 -25588 11618 52932 -5223 -54604
14516 -54604 -79696 -54715 -35615 13629 40114 23143 6728 14391 30489 24595 46737 31488
14504 31488 -160 -5809 -2379 21021 -14889 -25177 -11861 -5255 3779 -21435 -19855 -7261 14137
14491 14137 46767 15387 -6080 -15401 9865 -2766 20713 13752 33398 71743 15103 -21808
14479 -21808 24804 84617 96131 109409 86762 72794 45479 9417 18743 8263 -7057 63164
14467 63164 103490 64113 15993 20826 24886 29591 25259 6085 24748 40098 2525 -25330
14455b5330m061r167K6878J949k0456m9074M06L2213M597L9358j2822j2405l8485
14442f6399j5038N5102l243m628N0978O044m8982m5472M6105J5605L3562L6014
14430E9648L9628o354l0806o731J7510q205j2451m801l9965J0418r55J3191J0085
14417D0212L600k8236m3563q721L823J4659M6521k7128k3018R759K6136J4403
14405B8447J6885j5200j2127J4618r938j3255P383K7745J3511k5979j6648r8J598
14392A6942k6552r743N6096j924j6667P084J7823l1895o1919J8485j324j7303
14380e0897q207R102M4615L6221m9759m3241j1439l7321J7509L2242N6265N987
14368A077o754m058k230q31K5328K580m7429K1449O8229j7741m8733j9574k1589
$$ plain form
14455 -25330 -29391 -38558 -11680 -9731 -30187 -79261 -78855 -46642 -42045 -2687 -15509 -27914 -66399
14442 -66399 -81437 -26335 -29578 -34206 16772 22816 -26166 -71638 -25533 -9928 23634 59648
14430 59648 99276 92922 62116 55385 72895 64690 52239 47438 7473 17891 16936 30127 40212
14417 40212 43812 15576 -27987 -36708 -32885 -18226 28295 1167 -21851 -12092 14044 28447
14405 28447 45332 30132 18005 32623 22685 9430 16813 44558 58069 32090 15442 15344 16942
14392 16942 -9610 -19353 36743 34819 18152 25236 43059 11164 -50755 -32270 -33594 -50897
14380 -50897 -59104 -50002 -5387 30834 -18925 -62166 -73605 -110926 -93417 -61175 -4910 1077
14368 1077 -5677 -9735 -11965 -12796 12532 15112 -32317 -10868 57361 39620 -9113 -28687 -50276
14355e0276j0113j631K4466J7328O034J0910K9359J5208k4737K6953l249p578
14343C2674J056m8104l153m5474l0464L3434J3767j7923K1833R715q930M604l8542
14330g5507L523K1572j5421K0736J9685N997o029q820l9446J9861L1842K3839
14318A832J4446J6305j0335p763Q292J8720k0066m2869K4034L2926r043l7483
14306a1004l280K5395j3230J1989K5792j2684n231j9549j6231N039K9264k4739
14294h469o066L1210l833k5571l053k0044j9638l3838O0702L4220j3411Q058j0654
14281a0387n5704r303L0492M2803J1377J6238l8770r29M171j5071j8749O595P680
14268b9557J4320M0900k1404l1208J168k6637k7345p991P1059L4964m0147j9212
$$ plain form
14355 -50276 -60389 -62020 -37554 -20226 -14192 -3282 26077 41285 16548 43501 40252 32674
14343 32674 33730 -14374 -17527 -63001 -93465 -60031 -46264 -64187 -42354 -32639 -41569 -36965 -75507
14330 -75507 -71984 -50412 -65833 -45097 -25412 -19415 -25444 -34264 -73710 -53849 -22007 1832
14318 1832 16278 32583 22248 14485 22777 41497 21431 -21438 2596 35522 26479 -11004
14306 -11004 -14284 11111 -2119 9870 35662 22978 17747 -1802 -18033 -12994 16270 -8469
14294 -8469 -14535 16675 12842 -12729 -15782 -35826 -55464 -89302 -28600 5620 -7791 267 -10387
14281 -10387 -66091 -75394 -44902 -2099 9278 25516 -13254 -14183 -10012 -25083 -43832 -37237 -29557
14268 -29557 -15237 25663 4259 -26949 -25781 -52418 -79763 -87754 -16695 18269 -21878 -41090
14256d1090L0551o338K5521J5603l152n9588k6405N9981J4315k1046j688K6548
14244A3212J5083j0370l6581j5297J9859J0288J1571m5411j9347p449L3177K5789
14232e476J1565M571Q756L1718k0714k295K5509j3130q3887K823O1942J9151j3201
14219B7332n7668M473K7058N260k9189J569K5455J5467l526M699j2839j8505J2552
14206B138L7328l1288k7156N1063M6010j0072j2749l3444j3864j2326J424j0684
14194a3620m404K207M686k4599K8486M4599K059M14j2225p77o292J9253k053l402
14180C4332j6460r766j4531O490M1662R081n2008K4495K6370J304k1530l6186
14168f747J526J3397K594J2238J121m95j0876o439O445m105P45P660l448l247
$$ plain form
14256 -41090 -10539 -16877 8644 24247 21095 -38493 -64898 -4917 9398 -11648 -13336 13212
14244 13212 28295 17925 -18656 -33953 -14094 -3806 7765 -37646 -56993 -64442 -31265 -5476
14232 -5476 6089 10660 19416 51134 30420 28125 53634 40504 -43383 -40560 21382 40533 27332
14219 27332 -30336 -25863 1195 6455 -22734 -21165 4290 19757 16231 20930 8091 -10414 2138
14206 2138 39466 8178 -18978 32085 78095 68023 55274 21830 7966 -4360 -2936 -13620
14194 -13620 -18024 -15817 -11131 -35730 -7244 37355 39414 39828 27603 26826 20534 39787 37734 34332
14180 34332 17872 8106 -6425 65 41727 50808 -1200 23295 49665 50969 29439 -6747
14168 -6747 -5221 8176 10770 23008 24129 23634 12758 6319 12764 8659 9404 17064 13616 10369
14154A0369j3669O409L101J2610L3037o506m1519n7914l083K8275l2979l9323
14142a01192L8017R9243K9524P537k6768j271k8890J2704K8555k729n832j1356
14130C7542r485k9130k6184l0147L3779j4953j1666O243K2513M3155L843n245
14118B0265J6996l4521m1066l3999J2346l860q91K1192L5623O262j1982J146j0752
14105b3241J8455J7515j8746K4536K4047m4848k4055m502J5360Q588j5222P508
14093a4605O3034K3231n1566k589O203l4931l7535k3166m0771O227N6132K3998
14081b6338k765K2309J3292J6244J006M086n4947L1K3719L4176J0594l5863j0085
14068d541l3812M6150K5323k976P536K3619k9251j7597N7223L0246k1203m3180
$$ plain form
14154 10369 -3300 3109 6210 18820 51857 45351 3832 -54082 -57165 -28890 -61869 -101192
14142 -101192 -63175 36068 65592 73129 46361 45090 16200 28904 57459 54730 48898 37542
14130 37542 28057 -1073 -27257 -57404 -23625 -38578 -50244 -44001 -21488 21667 25510 20265
14118 20265 37261 2740 -38326 -72325 -59979 -63839 -64730 -43538 -7915 -1653 -13635 -12489 -23241
14105 -23241 -4786 12729 -6017 18519 42566 -2282 -26337 -30839 -15479 -6891 -22113 -14605
14093 -14605 48429 71660 20094 17505 23708 -11223 -48758 -71924 -112695 -106468 -50336 -26338
14081 -26338 -29103 -6794 6498 22742 23748 27834 -27113 -27082 -3363 30813 41407 5544 -4541
14068 -4541 -38353 7797 33120 30144 37680 61299 32048 14451 71674 101920 80717 37537
14056C7537k8622M1648q408o542K5289k5591p871o195R515J6048N6776K3344L8711
14043A65639N2734K0812K9891J31428J76200L04100M86676O58003J83586n01933
14033A707136o33809l93854k42961j45126n1337j8525m3318k9439n6757l4118
14023E7892l1185J0025O961n32m267k7805J4011N041K510M3929J3759l6703n0362
14010C274l290J3774J1085k0712j5235K4675N4843n417L299k01k7360o6003j2449
13997c9717M080K8962L4868q708k5983N6090J4201j4357k3805m3584n9621J1704
13985f5870P594q514J0841L6856K6299r747k553K3749J0534M1601K9028l2469
13973F7349j5946J8568N9288K0249J0563L0017k0065P1911J03357J06679K49013
$$ plain form
14056 37537 8915 50563 42155 35613 60902 35311 27440 21245 30760 46808 103584 126928 165639
14043 165639 218373 239185 269076 400504 576704 880804 1367480 2025483 2209069 1707136
14033 1707136 1073327 679473 436512 291386 240049 221524 178206 148767 92010 57892
14023 57892 26707 36732 43693 43161 38894 11089 25100 30141 32651 76580 90339 53636 3274
14010 3274 -16 13758 24843 4131 -11104 13571 68414 62997 66296 66095 38735 -27268 -39717
13997 -39717 -35637 -6675 28193 19485 -6498 49592 63793 49436 25631 -17953 -77574 -65870
13985 -65870 -58276 -66790 -55949 -19093 7206 -2541 -5094 18655 29189 70790 99818 67349
13973 67349 51403 69971 129259 149508 160071 190088 170023 241934 345291 451970 700983
13962G00983M41777P39522J439751K205425J006885j770561k059445j082259n46257
13953A075821l25775j78315r2238p8728p3961k2092L63l0685n6272m6724m6315
13942A25079m6131K2500K3137k5241j2387k1024l1883l2069l0239J6245K5086
13931A3073M0213m35P575L5101P453o237n0460k4739O31o944L324K4035q398l1160
13917C032N506L5339N3076j6218o7016q362K085K9684m311J1380K3029j6314k8548
13904B2362L1844J3187n684l3301l391M0536J6286J2052k7035j2591l7393j8486
13892a614l2K0821N407k8240m0158o6356Q566N4645L4982K489j3654R949r46O503
13878g638J3479J8304m3022J749J156p935J7010L3100j3631l3660N538J6423L2927
$$ plain form
13962 700983 1142760 1882282 3322033 5527458 6534343 4763782 2704337 1622078 1075821
13953 1075821 750046 571731 479493 400765 326804 304712 305075 274390 218118 171394 125079
13942 125079 78948 101448 124585 99344 86957 65933 34050 1981 -28258 -12013 13073
13931 13073 53286 52851 60426 95527 102980 96743 46283 21544 22175 15231 18555 42590 34192 3032
13917 3032 8538 43877 96953 80735 13719 5357 7442 37126 32815 44195 67224 50910 22362
13904 22362 54206 67393 61709 28408 25017 65553 81839 93891 66856 54265 16872 -1614
13892 -1614 -1646 19175 24582 -3658 -43816 -110172 -101606 -46961 -11979 -9490 -23144 -13195 -14141 -7638
13878 -7638 5841 24145 -18877 -17128 -15972 -23907 -6897 26203 12572 -21088 -15550 873 33800
13865C3800j94l2421m6330R245M8722K0895m9271o935Q415j0065M1912N9676k8241
13852D9208k0743k8348o343L8641J2572n4544j7337K1218K6930r940m997j2944
13840f627R975k5809M5516J5419q956J0433L8173j6599n8303o1509l1062M8690
13828d0659M6530j1653j7161l891L8639L0565J769l3310k1222N76R176N1922K3459
13815G4740J2058J8321O7129R2048K3408j14184j00163m6346N231p517Q458n615
13803B7568l7958k438P415k550R978o824q236L3172J9442N8k027k5711j4974r964
13789a3049O992k9598K9296J773J9862K1018J1813q360M529j5463q331J7647j1344
13776B6785l2636l2591l3550K0300p697J2202M1774Q03L7050p772m1568P256O5630
$$ plain form
13865 33800 33606 1185 -45145 -35900 12822 33717 -15554 -22489 -14074 -24139 17773 77449 49208
13852 49208 28465 117 -6226 32415 44987 -9557 -26894 -5676 21254 11314 6317 -6627
13840 -6627 3348 -22461 23055 38474 29518 39951 78124 61525 3222 -58287 -89349 -40659
13828 -40659 5871 -5782 -22943 -26834 11805 42370 44139 10829 -10393 -9817 -641 51281 74740
13815 74740 86798 105119 172248 264296 287704 173520 73357 27011 32242 24725 33183 27568
13803 27568 -10390 -12828 -5413 -7963 2015 -4809 -13045 20127 39569 39627 37600 11889 -3085 -13049
13789 -13049 -6057 -35655 -6359 -4586 15276 36294 48107 39747 44276 28813 20482 38129 26785
13776 26785 -5851 -38442 -71992 -51692 -59389 -47187 -5413 -4610 32440 24668 -16900 -9644 55986
13763E5986p37N087m099J0799J5094M665k302l7260l8500j4935J326j0463J6203
13750H64M402O2728k6829n7084j6981m908o766M4930o794p1578j0334M8124J5688
13737b4538k2860l3821J7870O1389J4368l253l5530J942K1853q28j4145J8599
13725A046K7539j4522J9893L3865n201P147j879K8336q588k6347l9955l0451k3888
13712c3005m9673K5663M1106M1610N6071K8653l4017m2225M151K7659k1785P62
13700D4970K0305k0428J9822L1755K0043N263k1525o3458L408k681j127K6947
13688F3294O9559L2915m454J2255K1400M488R257k1208l267l675q986k7926r934
13675A33718r660K915J9184M677J6997j80k7662l3742l2226m4227J7760J6454
$$ plain form
13763 55986 55249 60336 56237 67036 82130 86795 84493 47233 8733 -6202 -4876 -15339 864
13750 864 5266 67994 41165 -15919 -32900 -37808 -44574 356 -6438 -78016 -88350 -40226 -24538
13737 -24538 -47398 -81219 -63349 -1960 12408 9155 -26375 -24433 -2580 -3408 -17553 1046
13725 1046 28585 14063 33956 67821 62620 69767 67888 96224 87636 61289 21334 -9117 -33005
13712 -33005 -82678 -57015 -15909 25701 81772 110425 76408 34183 38334 65993 44208 44970
13700 44970 65275 44847 64669 96424 116467 121730 100205 36747 40155 37474 36347 63294
13688 63294 132853 165768 161314 173569 194969 199457 208714 187506 184239 180564 171578 143652 133718
13675 133718 124058 126973 146157 150834 167831 167651 139989 106247 74021 29794 47554 64008
13663F4008j2388p524k2761n602M2605M7582Q006K6512N4428j3723k4153j6172
13651A40818K7996J5766J4704k31l7967j016M317L277K2808j1979j0597l6758
13639A31138J2332k6036j3294m5728m3385k1886k4076K3630Q5432N3649l858K1117
13627A49035M2438M4920N492p899l7309l6438j2303Q158K1516Q5157M3982k0964
13615B85785K560L4116m365L484L9284J3189l2412J6951r717k9741j8555P620
13603C08199P6977P4098L8801J6463j897P978M6707M2317L4656Q2374N0147j8258
13591G58562Q119P8272P4638N4291J04599J43121J71339J30273J19871K56713
13581A899798K95128K60459K03003K30613L02303L52935L94218N04528O95572
$$ plain form
13663 64008 51620 44096 21335 15733 58338 105920 113926 140438 194866 181143 156990 140818
13651 140818 168814 184580 199284 199053 161086 160070 164387 167664 190472 178493 167896 131138
13639 131138 143470 117434 104140 58412 15027 -6859 -30935 -7305 78127 131776 127918 149035
13627 149035 191473 236393 241885 233986 196677 160239 147936 156094 177610 262767 306749 285785
13615 285785 288345 322461 318096 321580 360864 374053 341641 358592 348875 319134 300579 308199
13603 308199 385176 459274 498075 514538 512641 520619 567326 609643 644299 726673 776820 758562
13591 758562 766681 844953 919591 973882 1078481 1221602 1392941 1523214 1643085 1899798
13581 1899798 2194926 2455385 2658388 2889001 3191304 3544239 3938457 4442985 5138557
13572E138557R96251J278925J742030K468324K606285K162441K823251M448651
13564B3664715O832275J0653204J7410592K9874525N3432275R8311685J51804189
13557C91983460R1095444j04411771j52292746r0187949m6684589k6454885j6298167
13550D6748797j0592279o974075m712005l232303k007880j616414k417697k697658
13542A2498486k065832j540144j249197j037557q08802o55217n92002m58549l26416
13533C764770k19769j92249k44536k22632k17974j76016o2946n6133j30695j32917
13523B108903j30794j05856j22778j17008r2168q1015o1595m5011q8217o2623
13513A201838l3573l6660m0778l8161l0840q1752r0264n8816o321j0301M781j8922
$$ plain form
13572 5138557 6134808 7413733 9155763 11624087 14230372 16392813 19216064 23664715
13564 23664715 30496990 41150194 58560786 88435311 141867586 240179271 391983460
13557 391983460 483078904 378667133 226374387 136186438 89501849 63046964 46748797
13550 46748797 36156518 29182443 24470438 21238135 19230255 17613841 15196144 12498486
13542 12498486 10432654 8892510 7643313 6605756 5796954 5141737 4549735 4091186 3764770
13533 3764770 3545001 3352752 3108216 2885584 2667610 2491594 2428648 2372515 2241820 2108903
13523 2108903 1978109 1872253 1749475 1632467 1540299 1459284 1397689 1352678 1264461 1201838
13513 1201838 1168265 1131605 1090827 1052666 1021826 940074 849810 790994 784673 774372 779153 760231
13501G60231o2819m7915l4929K685q156l6120j199j1936j0663J4384K1984j4875
13489E70672o360J7240l9991o0194q852N7507N4473J320l2664j7355m2922n4777
13477D38097m4884Q341M7633m0179p6029l5636N7386N2757m367j7320k5294p0107
13465B90398l9248j1800k9969K465M6009l037K9552K9301R111p0930O768O1637
13453C20257k1459l5808k5492J9841M1925K705j2974o0545q64k58l0583j0343
13441A86402J1359K81j4467K1500N2633L984q218K7811L0889N8477O7135k2867
13429D14919n0008j5249m817k6679j2513m0743k1791R404L9794k9770L461l775
13417B62233j8738J8711j8317j6618J576j7336K2734M1318l738j8043q191j0646
$$ plain form
13501 760231 697412 649497 614568 617253 609097 572977 571778 559842 549179 563563 585547 570672
13489 570672 564312 581552 541561 481367 472515 530022 584495 585815 553151 535796 492874 438097
13477 438097 393213 401554 449187 409008 332979 297343 354729 407486 403119 385799 360505 290398
13465 290398 251150 239350 209381 211846 257855 254818 284370 313671 322782 251852 258620 320257
13453 320257 298798 262990 237498 257339 299264 301969 288995 228450 227586 227328 196745 186402
13441 186402 197761 198042 183575 205075 257708 261692 253474 281285 312174 370651 437786 414919
13429 414919 364911 349662 344845 318166 305653 264910 243119 252523 292317 262547 266008 262233
13417 262233 243495 262206 243889 227271 228847 211511 234245 275563 271825 253782 245591 234945
13405B34945l9804j3809K325l5942o352j8593k8330k4160J9538k764R525o490
13393I0089L8529J3769k1925m4730j3267N7117M1897J3787M7267J210k3097l7555
13381A63091P549M0196j8017k525m4562j9598M440L2526l786o297k1674n810L0622
13368A56155P289n156p9735l2747M4854N4496L5305K0490l8183p9634k4763J2999
13356G1370k857l8274J8353Q532K532M311q052k6805l5578K8895L0148J5344k0320
13343D7599j4789N0432L5310j3864m407q994n560q219Q132O918j179k63k3658
13330F7458j7858J6160J3229K8384K0146J915N382n3935l8383k3458L637n990
13318A6687o527K7072K8736r018M428J3950N452l1998J3724N8249K6969J6960
$$ plain form
13405 234945 195141 181332 183657 147715 141363 122770 94440 70280 89818 87054 96579 90089
13393 90089 128618 142387 120462 75732 62465 119582 161479 175266 222533 223743 200646 163091
13381 163091 170640 210836 192819 190294 145732 126134 130574 163100 159314 153017 131343 125533 156155
13368 156155 163444 158288 78553 45806 90660 145156 180461 200951 162768 83134 58371 71370
13356 71370 68513 30239 48592 57124 59656 63967 55915 29110 -6468 22427 52575 67919 47599
13343 47599 32810 83242 118552 104688 100281 91287 85727 77508 85640 92558 91379 91116 67458
13330 67458 49600 65760 78989 107373 127519 129434 134816 80881 42498 19040 22677 16687
13318 16687 10160 37232 65968 56950 61378 75328 80780 48782 62506 120755 147724 164684
13306A64684R8j3458m9789n1804N806L6114j107l423j5672J6791K4034r804O177
13293A08647l7267K901j2453l3572m2214l6371J3719m466K7981M4553M0380j1772
13281F0066k1584k3177o20L3166J5368J2130j7827o94m700J9748K4640J5813j6629
13268I5700k1061j9371n2242p36Q367L1807K0082J0815o4181k3226K2618J8289
13256B6861K5802J9683k7621n30M9401R979k4945j1262K4547L8293o7362o5295
13244b449J8476M1499l6281l5101n598J0599L1836M3358m965j6948j9862J6610
13232D1174K4366J8585m1199k6984N690L6782J2599P77K430m2971l2304p518J1261
13219B688N96m119k9269R68n612K7493P3075P937M053j8169j1758K400m152J7679
$$ plain form
13306 164684 164782 151324 101535 49731 55537 91651 90544 87121 71449 88240 112274 102470 108647
13293 108647 71380 74281 61828 28256 -13958 -50329 -36610 -41076 -13095 31458 71838 60066
13281 60066 38482 15305 14685 47851 63219 75349 57522 56828 52128 71876 96516 112329 95700
13268 95700 74639 55268 3026 2290 10657 42464 62546 73361 9180 -14046 8572 26861
13256 26861 52663 72346 44725 44195 93596 103575 78630 67368 91915 130208 62846 -2449
13244 -2449 16027 57526 21245 -13856 -19454 -8855 22981 66339 61374 44426 24564 41174
13232 41174 65540 84125 42926 15942 21632 58414 71013 71790 74220 31249 -1055 -8573 2688
13219 2688 3284 -835 -30104 -29136 -34748 -7255 65820 73757 77810 59641 47883 50283 46131 63810
13205F3810j2800N091O78l3557J3831L1392J0160J4036M973k3630l0427o5535
13193b1978J850M5152L0301M398k6952j2262P860j3322j7090K8050J448r385m4608
13180b6538p432L7055K3198K355K4968j7802J892Q878q488L1867j384m8484P486
13167B7571J1586o28J3133N204j3604l4626R119K1888q710J5244J9518J3916k2450
13154E7161O257p430n6897J156J3537L718O1896K549k9233m7364L220L9693J2621
13141F0884O050j6625k8957j7720N312j117M1561J996q1801J6887M5755R396q432
13128C3189P411k8941O698J4816n1593k7632M1048O2733J4221j1257q48N1286
13116A11131K5153j0732m5502l5296l2131j6846J8885N527J0166l1800J6737M3845
$$ plain form
13205 63810 51010 56101 56779 23222 37053 68445 78605 92641 97614 73984 43557 -21978
13193 -21978 -20128 25024 55325 59723 32771 20509 28369 15047 -2043 26007 27455 18070 -26538
13180 -26538 -33970 3085 26283 28638 53606 35804 37696 46574 38086 69953 68569 20085 27571
13167 27571 39157 38529 51662 56866 43262 8636 17755 39643 30933 46177 65695 79611 57161
13154 57161 63418 55988 -909 247 13784 17502 79398 81947 52714 5350 8570 48263 60884
13141 60884 66934 50309 21352 3632 8944 7827 49388 51384 -30417 -13530 32225 41621 33189
13128 33189 40600 11659 18357 33173 -18420 -46052 -5004 57729 71950 60693 59845 111131
13116 111131 136284 125552 80050 44754 12623 -4223 14662 20189 30355 -1445 15292 59137
13104E9137O147j2136J4418K5666R324m0703n2544L2050M1640j8574M459L2877
13092A01761Q786j3198l5391K7475L3014l9863j6804r008M4245M4887j0571Q700
13080A44033N8653L6906M7787J13155J41013K86577N16216P05223K62381n62700
13070A749244o52770l83087k28976j03004p6688o8760n6542n7681N696Q806m07
13059A35831J3190o7259o4650L508k140J2066j2877M2938j9470k4172Q068K590
13047B7623j7196M1266P4619J3094p5631l0601m7332L2765K6609P875j0480l865
13035C8746j8322m6720K0173L0367K0193R854j3594l9595q968N411m59L399J7440
13022A7925J3739L8986p238l9482K1066L1846R350J4944J282n754l521R479K859
$$ plain form
13104 59137 65284 53148 67566 93232 102556 61853 9309 41359 82999 64425 68884 101761
13092 101761 110547 97349 61958 89433 122447 82584 65780 56772 101017 145904 135333 144033
13080 144033 202686 239592 287379 400534 541547 828124 1344340 2049563 2311944 1749244
13070 1749244 1096474 713387 484411 381407 304719 235959 179417 121736 127432 136238 135831
13059 135831 149021 81762 17112 20620 18480 30546 17669 60607 41137 16965 25033 27623
13047 27623 10427 51693 126312 139406 63775 33174 -14158 18607 45216 53091 42611 38746
13035 38746 20424 -26296 -6123 24244 44437 54291 40697 1102 -7866 -2455 -2914 485 17925
13022 17925 31664 70650 63412 23930 44996 76842 86192 101136 102418 96664 93143 102622 105481
13009A05481j5348j8799m7810l3046j2896N299p710J1777J5923M9778N9602q779
12997A03472l8412j6092j7968j0556j6546j2611L6603M9460j3185n0109P297J83
12985B1536j8455O088J4241L7641J1321l5143j982K4255m6038l1833M212p892
12973b2049K4194K8806L6861M1916M419l5052m9561j8327M6070k4641P36r110
12961B4262M109J845j2756k2845l0385K7986M6603N7411J6924o8344q231l057
12949C3522l7861k3361J9833R149j8786R832K8748p480j3440j8595L4739M842
12937B1142O103j2225j7313j9831L349K9588j0899K4076j1381j8142O844j5752
12925a4441L4607J9420j0941j7274K283K6185q851R054M2063j3091m5665j9587
$$ plain form
13009 105481 90133 71334 23524 -9522 -22418 -17119 -24829 -13052 2871 52649 112251 103472
12997 103472 65060 48968 31000 20444 3898 -8713 27890 77350 64165 14056 21353 21536
12985 21536 3081 9169 23410 61051 72372 37229 35247 59502 13464 -18369 -14157 -22049
12973 -22049 2145 30951 67812 109728 114147 79095 29534 11207 57277 32636 33372 24262
12961 24262 28371 30216 17460 -5385 -35770 -7784 38819 96230 113154 44810 36579 33522
12949 33522 -4339 -27700 -7867 1282 -17504 -7672 21076 13596 156 -18439 16300 21142
12937 21142 27245 15020 -2293 -22124 -18775 10813 -86 23990 12609 -5533 1311 -14441
12925 -14441 20166 39586 28645 11371 13654 39839 30988 40042 82105 69014 23349 3762
12913C762K2992P317o199K24J1619L0774l646J060l1689J8890M846N827k0011
12900D5766o3653j3834O555P4361K6761q1270l9631m5864p828k4788L5930K4677
12888f2818O426M9898J292K5757J1190r072J5045L4172K6679j6010M236l0935
12876E5860l4383j3676Q438l786K5093K8161k0902J2862K4028o030k6577M5163
12864I4251q226M1094q485o1477l8498k9133r680l694r311m002k0337L8067L6172
12851A6741J1438k7630o124M0627P462q8801m7955K4884N1064J0502p179n0457
12839f5428j147N5283M8680j8065l2693m3271j4657M4335L9735j4757L0394K2933
12827E1342j3262n8657J1370J1037M0204M580p06l6460L5629N4277n411j6441
$$ plain form
12913 3762 26754 34071 27872 28096 39715 70489 66843 67903 36214 55104 59950 65777 45766
12900 45766 -17887 -31721 -25166 49195 75956 -5314 -44945 -90809 -98637 -123425 -87495 -62818
12888 -62818 -56392 -6494 -5202 20555 31745 22673 37718 71890 98569 82559 86795 55860
12876 55860 21477 7801 16239 12453 37546 65707 44805 57667 81695 75665 49088 94251
12864 94251 86025 127119 118634 57157 18659 -10474 -20154 -23848 -33159 -37161 -57498 -19431 16741
12851 16741 28179 549 -5575 35052 42514 -46287 -94242 -69358 -18294 -7792 -14971 -65428
12839 -65428 -66575 -11292 37388 19323 -13370 -56641 -71298 -26963 12772 -1985 28409 51342
12827 51342 38080 -20577 -9207 1830 42034 46614 45908 9448 45077 99354 93943 77502
12815G7502j2629q747k6958L306r224J9138j3173O053L5235J4296J9485q119J1382
12802A07547K896l8606m4092J1583n243j0979j5393k482k1228J1250K7546j7383
12790E416k0959K0083j8180j9951k384r922J4155n073l3285L6352J5975J7197
12778e76L1470j1051j3401j3046J2169K5682J2825p007J3511J0998k2081o433
12766C3060P961J5868J7037J7835l342m1944m3557K585m7860j2988L8580L2607
12754A5842N539L619J1683K1941J0538n0049m8763l3290N88K1942K0041K8566
12742H197L2343q418J5678k9557q81q210N0157J4193j6962N202m4304j5139k0004
12729a7705J7575K8072J2711j0077k4665J155p246j9008o518R0J6279j2664l8877
$$ plain form
12815 77502 64873 56126 29168 32474 23250 42388 29215 35268 70503 84799 104284 96165 107547
12802 107547 110443 71837 27745 39328 34085 23106 7713 5231 -15997 -4747 22799 5416
12790 5416 -15543 4540 -13640 -33591 -35975 -45897 -31742 -36815 -70100 -33748 -17773 -576
12778 -576 30894 19843 6442 -6604 5565 31247 44072 37065 50576 61574 39493 33060
12766 33060 41021 56889 73926 91761 88419 46475 2918 5503 -42357 -55345 -16765 15842
12754 15842 21381 25000 36683 58624 69162 19113 -29650 -62940 -62352 -40410 -20369 8197
12742 8197 40540 32122 47800 18243 17362 9152 59309 73502 56540 61742 17438 2299 -17705
12729 -17705 -130 27942 40653 30576 5911 7066 -180 -19188 -25706 -25616 -9337 -22001 -60878
12716f0878j4484o482K5828o97N960K914m880N8564O7154m6304k6834l0574m78
12703c1191J9052K3883P466k3928k6621p334l114Q061j6956p0287K8101Q6966
12691e902L8412K2401M582k1593N719j3860k0789k6595m779J0160K5118J4033
12679B6907j2042q403K0674J7196j3991n403N468j8720o20R881J0485o743l825
12666B0864N0332k051m0150m887k348q507J0943r073o380j880l854L897K1642
12653B8548r062J6868J7618k0871p674l0515p581j9169o335J2667L4086M1651
12641E0231M3908j0465l5483M470j4170j4196J7548P340l5523j6146J3478J6540
12629B7532j66J6393k884o8285L878J058j114q64J5190j4601l5947N209K2058
$$ plain form
12716 -60878 -75362 -81844 -56016 -56713 -50753 -47839 -52719 5845 72999 26695 -139 -30713 -31191
12703 -31191 -12139 11744 19210 -4718 -31339 -38673 -41787 -33726 -50682 -120969 -92868 -5902
12691 -5902 32510 54911 59493 37900 43619 29759 8970 -17625 -22404 -12244 12874 26907
12679 26907 14865 6462 27136 44332 30341 24938 30406 11686 11066 20947 31432 24689 20864
12666 20864 71196 69145 28995 24108 21760 13253 24196 15123 8743 6863 3009 6906 28548
12653 28548 19486 36354 53972 33101 25427 -5088 -12669 -31838 -38173 -25506 8580 50231
12641 50231 94139 83674 48191 52661 38491 24295 41843 49183 13660 -2486 10992 27532
12629 27532 27366 43759 40875 -27410 -23532 -22474 -23588 -24452 -9262 -23863 -59810 -54601 -32543
12616c2543M2268k0923o213J0045R290k413k3279n441m584Q264J8131j7975k8693
12603e4066j3784J3152j9947K3355N6711R292n110R974K9070j4540j6156k0993
12591c042k3869M3695L0538K874k6318j8570k8127m252O1470J2406m780k382N1516
12578I1159j892l1539k3386k0977J4669M8200j682M515p131J1199l0897r016k712
12565D0510k8072k4571N681J1422Q528j8658J3433L467J7053J2625j1608J9578
12553D9388m3852J5430j900K4939o477k1866J2481L5047N808l5658r481L8846
12541F2705p762j9245J70l2919k2284l299R375m0924k0932K9123O748K341k4285
12528f1188r655Q354R753j0849r048J1112J0112L4373R737N31l1053k5471J1023
$$ plain form
12616 -32543 9725 -11198 -17411 -7366 1924 -489 -23768 -29209 -33793 -25529 -7398 -25373 -54066
12603 -54066 -67850 -54698 -74645 -51290 5421 14713 9603 19577 48647 34107 17951 -3042
12591 -3042 -26911 16784 47322 50196 23878 5308 -22819 -27071 34399 46805 42025 39643 91159
12578 91159 89267 57728 34342 13365 28034 76234 74552 79067 71936 83135 52238 43222 40510
12565 40510 12438 -12133 -6452 4970 13498 -5160 8273 11740 28793 41418 29810 49388
12553 49388 5536 20966 19066 44005 37528 15662 28143 63190 68998 33340 23859 62705
12541 62705 54943 35698 35868 2949 -19335 -22634 -13259 -54183 -75115 -45992 -39244 -36903 -61188
12528 -61188 -70843 -62489 -52736 -63585 -72633 -61521 -51409 -17036 -7299 -6768 -37821 -63292 -52269
12515e2269N216j6K3146J495J0693n836M9442j4369P518P1199k0118l4742j5m2886
12501a542l9919m04L0782k0616J6326M2846p376n462j1201L9554j1468J427k8942
12488D005j5704O740L951q223L1670j567l0449k300K5730J6858R010k0297n788
12475A3636k2123n297j9155k2666J4311P1077j4045k2393K651k5798j158L6913
12463E953J87J2527j6659k0459R472q714J8676L196j8442o827J9442j0166k2736
12450c4550K110j6680J8517M0488J9520k6136N936L5409K1799k5367K217l690
12438C9573m7957j71j3836j9876L2731L9914J5092k0276l3114k615J1435J9440
12426B0340J6871K5533k8689m981J2119j1287l7729o406r030n2358o900M2453
$$ plain form
12515 -52269 -47053 -47069 -23923 -22428 -11735 -17571 31871 17502 25020 96219 76101 41359 41344 -1542
12501 -1542 -41461 -41865 -11083 -31699 -15373 27473 20097 14635 3434 42988 31520 32947 4005
12488 4005 -11699 -4959 -1008 -9231 22439 20872 -9577 -11877 13853 30711 39721 19424 13636
12475 13636 -8487 -13784 -32939 -55605 -41294 29783 15738 -6655 -4004 -29802 -30960 5953
12463 5953 6140 18667 2008 -18451 -8979 -17693 983 4179 -14263 -21090 -1648 -11814 -34550
12450 -34550 -32440 -49120 -30603 9885 29405 3269 9205 44614 66413 41046 43263 39573
12438 39573 -8384 -8555 -22391 -42267 -9536 30378 45470 25194 -7920 -10535 900 20340
12426 20340 37211 62744 34055 29074 41193 29906 -7823 -14229 -23259 -75617 -82517 -40064
12414d0064M2802J0113J7240N077L3194l0512q722q755O621K8290j0366m445J1213
12401E1686q869m8772l5370L5856J3348J591j331j4290J5567K804m0635O212k0605
12388d2808l0471j3208K0922N9058K937J7522J612J1860l3798j8302K180J6089
12376f407K434j0491k3049m1552R252O8315L7344K8857j0621j7666k5907m6458
12364c5949j3668k9391J0933O4193N2064J1512l5J5251j3775m3116p714j7666
12352g361p111J6274M155Q45J4413j2544j2491k0095Q678j5235p558Q715j8750
12339d8065L2482M9156q147q141K3959L0083J1530l1939l8165K2516k3253R464
12327B1480N8860L1j4432l4595J9213Q250m6318P74l9130K6996K6620l6235k1543
$$ plain form
12414 -40064 2738 12851 30091 35168 68362 37850 29128 20373 26994 55284 44918 40473 51686
12401 51686 42817 -5955 -41325 -5469 7879 9470 8139 -6151 9416 12220 -28415 -22203 -42808
12388 -42808 -73279 -86487 -65565 -6507 -3570 13952 15564 27424 -6374 -24676 -22496 -6407
12376 -6407 -3973 -14464 -37513 -79065 -69813 -1498 35846 64703 54082 36416 10509 -35949
12364 -35949 -49617 -79008 -68075 -3882 48182 59694 59659 74910 61135 18019 10305 -7361
12352 -7361 -14472 1802 5957 6802 21215 8671 -3820 -23915 -15237 -30472 -38030 -29315 -48065
12339 -48065 -15583 33573 25426 17285 41244 71327 82857 50918 12753 35269 12016 21480
12327 21480 80340 80371 65939 31344 50557 58807 12489 13263 -25867 1129 27749 -8486 -30029
12314c0029J9308M091J3854L004j7230n5481N927K9577K2700M7442N954J2040
12302F1157j6269m0334P59P690K2399j3929j5222K5014J4422k0757K994l1993
12290d069n5387j3821K5537R886M561L9214L2695k0985l9345J9236L2422k6284
12278C660r236K6980K8412M523k5468j3723k9513l891J935m503L9150M999l1325
12265h000j7456n969j9988L7016K5991K9492j1500j5525n308K3472J3894l5781
12253A0338o403J254Q592O651k4310k860M9618L0295o4651j5150L2283M9511l2097
12240D3071K1133k1728J2468o9760l6595R18J1298L1069J1823J6841l3484k5702
12228c8648J2375J7279M216M478l8744M6179J5425k959j3998o394P53J450j5294
$$ plain form
12314 -30029 -10721 -6630 7224 10228 -7002 -62483 -56556 -26979 -4279 43163 49117 61157
12302 61157 44888 4554 5313 13003 35402 21473 6251 31265 45687 24930 27924 -4069
12290 -4069 -59456 -73277 -47740 -37854 -33293 5921 38616 17631 -21714 -2478 29944 3660
12278 3660 -5576 21404 49816 54339 28871 15148 -14365 -18256 -16321 -20824 18326 23325 -8000
12265 -8000 -25456 -31425 -51413 -14397 11594 41086 29586 14061 8753 32225 46119 10338
12253 10338 3935 5189 13781 20432 -3878 -6738 42880 73175 8524 -6626 25657 75168 43071
12240 43071 64204 42476 54944 -14816 -51411 -50493 -39195 -8126 3697 20538 -12946 -38648
12228 -38648 -26273 -8994 -4778 -300 -39044 7135 22560 19601 5603 -791 -38 1412 -13882
12215a3882Q982J3187k984J6303L3265L2361j1588m6381J0528k598l261J3444
12203D7376N146j1557k4034j4478N764J358J205L833J4576k1620l5346r759J0640
12190b6896L800j5383J3058j4704m387O462M6612L3502J5107P165L3191p779m9317
12177D0431k8184j2628k5165K0455O6512J5995j8564k7260m3434k0193r792l2978
12165g4805K8901K1852n262O276j1833N594K44j7145J4765k4359k6446M4009K162
12152c6047J7682J5983L3420k1618l7794k1229N289N3979K5660j3087m6883j3537
12140c8182N0304M5686m51M565k712j8914n1052J98M6734N790q861k4761K5568
12127C3912P252K9847K7244m5443l3438k7479K8008J2939J9053k3776k4585l7701
$$ plain form
12215 -13882 -4900 8287 5303 21606 54871 87232 75644 29263 39791 37193 33932 47376
12203 47376 52522 40965 16931 2453 8217 9575 10780 14613 29189 7569 -27777 -37536 -26896
12190 -26896 -23096 -38479 -25421 -40125 -44512 -38050 8562 42064 57171 64336 97527 89748 40431
12177 40431 12247 -381 -25546 -5091 61421 77416 58852 31592 -11842 -32035 -41827 -74805
12165 -74805 -45904 -24052 -29314 -23038 -34871 -29277 -29033 -46178 -31413 -55772 -82218 -38209 -36047
12152 -36047 -18365 -2382 31038 9420 -28374 -49603 -44314 9665 35325 22238 -24645 -38182
12140 -38182 12122 57808 57357 61922 59210 40296 -10756 -10558 36176 41966 33105 8344 33912
12127 33912 41164 71011 98255 52812 19374 -8105 19903 32842 51895 28119 3534 -34167
12115c4167k135K5720k5258k1545k1942K2112P5265K3080m6587m1354j0310K7849
12103b9272M0611p429l3322P970K0614K7868k0395j3565O35O2034P0730l0684
12091I5795k8986N506j2479j4852J9269K9222j902M866p1j0488K6712L141k9589
12078H6144k313j6438k5589k686L126k2467P248j4677o7279q91J6167k0074K9791
12065b9938K8099p4102j9126O9176L9266m6371J1856M0435j3116P826j0414J887
12053E478l086J5297l8674k0774l214K5224j2187n2398L411K3160J0099j0558
12041e8222n399K0592j789j223j4043l841L1252K5603j7382J6965J338K8451o480
12028A5822p760L2133n3445j1321K5536j2611K573j5082P419J8444L6067q009
$$ plain form
12115 -34167 -36302 -10582 -35840 -57385 -79327 -57215 18050 41130 -5457 -46811 -57121 -29272
12103 -29272 11339 3910 -29412 -21442 -828 27040 6645 -6920 -6285 55749 126479 95795
12091 95795 66809 72315 59836 44984 64253 93475 91573 96439 96368 85880 112592 115733 86144
12078 86144 83831 67393 41804 39118 42244 19777 27025 12348 -54931 -55822 -39655 -59729 -29938
12065 -29938 -1839 -75941 -95067 -25891 13375 -32996 -21140 19295 6179 14005 3591 5478
12053 5478 2392 17689 -20985 -41759 -44973 -19749 -31936 -84334 -80923 -57763 -47664 -58222
12041 -58222 -63621 -43029 -44818 -46041 -60084 -63925 -32673 -7070 -24452 -7487 -6149 22302 15822
12028 15822 8062 40195 -13250 -24571 965 -11646 -9073 -24155 -16736 1708 37775 29766
12016B9766J7371O2656K3958j5745l3099K2202K4733o638j7339l4609k4532j5101
12004C3623j5058k070j8704n518J722k7356j6430p888m2581J012M3345N6828m008
11991c083j2834j9674n350K1159L7618r598q359m558k7696L532m4371J1617M2819
11978a8778K9714K0308k7596m7811n4314K2119L0274M2036L468O807j959j0173
11966e905J0221P912o217k6883k6727K1852K3590K4681K7763j87j2329o1163k5167
11953d8559O4097J5000L638P058L8578j7174k3262j8305J2415k9504j5114J6611
11941E479n2721m5061J0695P430N4266K1271k4126J6544L763J2970j8189n4855
11929f2534M1678L4040j0331j3517p586N224O006J3337n899j7968J7629J0970
$$ plain form
12016 29766 47137 109793 133751 118006 84907 107109 131842 125204 107865 73256 48724 33623
12004 33623 18565 16495 -2209 -7727 -6005 -33361 -49791 -57679 -100260 -99248 -55903 925 -3083
11991 -3083 -15917 -35591 -40941 -19782 17836 8238 -121 -4679 -32375 -28843 -73214 -61597 -18778
11978 -18778 10936 31244 3648 -44163 -98477 -76358 -46084 -4048 -580 6227 4268 -5905
11966 -5905 4316 12228 6011 -20872 -47599 -25747 -2157 22524 50287 50100 37771 -23392 -48559
11953 -48559 15538 30538 34176 41234 79812 62638 39376 21071 33486 3982 -11132 5479
11941 5479 -47242 -92303 -81608 -74178 -19912 1359 -22767 -6223 -2460 10510 -7679 -62534
11929 -62534 -20856 13184 2853 -10664 -18250 -13026 -7020 6317 418 -17550 79 11049
11917A1049j2663j3443L1709M1034m2463L69k7346m7906p771l102L3424K5197
11905a1912l086j4458J4671P146M3996j3826j2270j2555K447j8525j548j0353
11893c0273N983j7002K7088L3092J6005L346k0956M0051K3277l6169k0787k825
11881B0830M0522J0119j4735o0058n1546k4149J5319l2775R470J4383K4796J4318
11869c3506k076L0394J731M48l3741n373n421O305L5772L7002Q358l5480o451
11856b038j0048j2302M50J4639k0280j0918M288K8092K4151P578R876M746j908
11843C6326J145l148l7278K2900J728M4632N6295l3251n1762j8265Q545K2777
11831E0644m317k3432p5552n330j1595l7198M0133L6545K3648j3624J9282K2968
$$ plain form
11917 11049 -1614 -15057 16652 57686 15223 15592 -11754 -59660 -67431 -70533 -37109 -11912
11905 -11912 -14998 -29456 -14785 -7639 36357 22531 10261 -2294 153 -18372 -19920 -30273
11893 -30273 -24290 -41292 -14204 18888 34893 38239 17283 57334 80611 44442 23655 20830
11881 20830 61352 71471 56736 -3322 -54868 -79017 -63698 -96473 -87003 -72620 -47824 -33506
11869 -33506 -35582 -5188 -3457 -3009 -36750 -42123 -47544 -41239 -5467 31535 39893 4413 -2038
11856 -2038 -12086 -24388 -23938 -9299 -29579 -40497 -36209 -8117 16034 23612 33488 38234 36326
11843 36326 37471 34323 -2955 19945 21673 66305 122600 89349 37587 19322 27867 50644
11831 50644 46327 22895 -52657 -57987 -69582 -106780 -66647 -30102 -6454 -20078 -796 22172
11819B2172K3143K4522j6411k9370M360J9016j2879M429k6654k0655n1187m2634
11807a02148K6366M5020R222J7744M0856J2349k6600k1500k1896m635j4472l4961
11795g4655l4406k499N1458M3912M197k9384J417K1859j3476K0399l4568k4874
11783g0620J6086j788k0380k763n678N1909j340k3099j1271k156R657J5859L8891
11770f693R871m4393k3948J7259J3052o859K4878O7825K9400l5342l9228R486
11758A5308J685n6400l2448R207l988M2790M2336K049k9425J7361m9592j781O0660
11745A7762J1896j6705o536Q766N428m4523l6428K7370N4505J4297l842P16p002
11732B5704j7253j2235k0022k2576J2283j2605J4562j1859m258J4495M0906n841
$$ plain form
11819 22172 45315 69837 53426 24056 28416 47432 34553 38982 12328 -8327 -59514 -102148
11807 -102148 -75782 -30762 -21540 -3796 37060 49409 22809 1309 -20587 -25222 -39694 -74655
11795 -74655 -109061 -111560 -60102 -16190 -11993 -41377 -39960 -18101 -31577 -11178 -45746 -70620
11783 -70620 -54534 -56322 -76702 -79465 -85143 -33234 -34574 -57673 -68944 -71100 -61443 -45584 -6693
11770 -6693 3178 -41215 -65163 -47904 -34852 -41711 -16833 50992 80392 45050 5822 15308
11758 15308 16993 -39407 -71855 -62648 -66636 -23846 18490 20539 -8886 8475 -41117 -42898 17762
11745 17762 29658 12953 6417 15183 20611 -23912 -60340 -32970 21535 35832 31990 32706 25704
11732 25704 8451 -3784 -23806 -46382 -34099 -46704 -32142 -44001 -48259 -33764 7142 1301
11720A301q33o567l9148j9145o738L0302J4597K5836K0250Q747l8812J9414R831
11707A9035J8408k9151k1677j6060m499k64J2433K8655L4170q09n04l4772j6102
11694a1137l2722K3073K5079K0879J4576j0714k4392J2910M3988J9851k5935l1858
11682B3598K2786l2585j3971K0830P937K3316k1292p6515M4144J3580J1526N4082
11670G7436k1101m2510j2480k0438l1272M289l4007K2634L2867L3471J0576N496
11658B4961k251l245l2903n0802k174k2657K2233P2301K4818K0991j5949q158
11646B7165N649m726j5543j8527j6768l1819j7371L0022K540j2992q814N2283
11634h901J1894j0735L6160K9157k338j1173P149l6305l5585N426J8744l905q727
$$ plain form
11720 1301 468 -6099 -45247 -64392 -71130 -40828 -26231 -395 19855 28602 -10210 9204 19035
11707 19035 37443 8292 -13385 -29445 -33944 -34208 -21775 6880 41050 40241 39737 4965 -11137
11694 -11137 -43859 -20786 4293 25172 39748 29034 4642 17552 61540 81391 55456 23598
11682 23598 46384 13799 -172 20658 28595 51911 30619 -45896 -1752 11828 23354 77436
11670 77436 56335 13825 1345 -19093 -50365 -46076 -80083 -57449 -24582 8889 19465 24961
11658 24961 22710 19465 -13438 -64240 -66414 -89071 -66838 5463 30281 51272 35323 27165
11646 27165 32814 28088 12545 -5982 -22750 -54569 -71940 -41918 -39378 -52370 -61184 -8901
11634 -8901 2993 -7742 28418 57575 55237 44064 51213 14908 -20677 -15251 3493 -412 -9139
11621i139j6701M251o842M02j7047l9032j1234N2481L2522j1884J5823j5992Q921
11608a3471n47J1279J4251L20j2656N388j4898j9133J4403L9211j5324k2641K0498
11595F680K5876o783k8217n6585K7547L1639j2270n7k1749k5610L7253L808j0849
11582b9317J3703J899j8997M275K843L440J9983q898L144K9411L1628l6331n1536
11569c4753o848k610L057O778K0664J1003m4580M2910O0557R537j4706n3631q622
11556a1244O5176q102m2439O92L1045N082k1462l7217K5033K7677N04J0803Q312
11543E3860J6931j5947n4303n5305J4055K1265n055j4247Q853M4771n709j2875
11531c706j3436K7592J7659l826J7789j9032o988j759j8486J6171j3868j2829
$$ plain form
11621 -9139 -25840 -21589 -28431 -28029 -45076 -84108 -95342 -42861 -10339 -22223 -6400 -22392 -13471
11608 -13471 -14018 -2739 11512 11832 -824 4564 -10334 -29467 -15064 24147 8823 -13818 6680
11595 6680 32556 25773 -2444 -59029 -31482 157 -12113 -12170 -33919 -59529 -22276 -18468 -29317
11582 -29317 -15614 -13715 -32712 -28437 -25594 -22154 -2171 -11069 -7925 21486 53114 16783 -34753
11569 -34753 -41601 -44211 -41154 -34376 -13712 -2709 -47289 -4379 56178 65715 51009 -2622 -11244
11556 -11244 53932 45830 3391 4083 35128 40210 18748 -18469 6564 34241 34745 45548 53860
11543 53860 70791 54844 541 -54764 -40709 -19444 -24499 -38746 -29893 14878 9169 -3706
11531 -3706 -17142 10450 28109 24283 42072 23040 16052 14293 -4193 11978 -1890 -14719
11519a4719K332K3742j2766k400O431K582k6872k7061K4994O0558J2115l1371
11507A7565L574l618q85k2398j6015k7994J9166M4430n10K2857m8930k0794k935
11494c6487J2849j5656q530N044L0197j6757r330K802K543K0981K2830K387o623
11481F250K334q685J6080l7407j8791j748M4760K9998J222l5428J1010K5859j5779
11468A9675l9342o243J0538k292o6R572q954j5224O113J0074J9013j9141n1090
11455f7367L8235K7763j6307j6379J794k4246J8717L8115R080m8695m0243N94
11443g8939J4845L2353J3342J6415J6332L6499j9421l2001l0198L5389J836r307
11431b855J2515k2211r189K5008k532J870K1571J9948k1473j2921J0850k5935
$$ plain form
11519 -14719 -12387 11355 -1411 -3811 2620 5202 -21670 -48731 -23737 36821 48936 17565
11507 17565 21139 17521 16636 -5762 -21777 -49771 -30605 13825 13315 36172 -12758 -33552 -36487
11494 -36487 -23638 -39294 -47824 -42780 -12583 -29340 -38670 -35868 -33325 -12344 10486 12873 6250
11481 6250 8584 -101 15979 -21428 -40219 -41967 2793 32791 34013 -1415 9595 35454 19675
11468 19675 -19667 -25910 -15372 -17664 -17730 -8158 -17112 -32336 -26223 -16149 2864 -16277 -67367
11455 -67367 -29132 -1369 -17676 -34055 -32261 -56507 -37790 325 9405 -39290 -79533 -78939
11443 -78939 -64094 -31741 -18399 -1984 14348 50847 31426 -575 -30773 4616 6452 -2855
11431 -2855 9660 -12551 -21740 3268 736 2606 24177 44125 22652 9731 20581 -5354
11419e354J3658R123o804M629k494m133J4729l1237k5346k4240K0946K2057l222
11406a7688j3808L0492k99k6097L062N6661p838p3715n246M6509N1245J2055k8202
11393B7131k1736l0300l6862k7297j0948r692n427K0708P6835L5614k9749l1592
11381d3315j5811K7860K4006J209n012J5602K4884Q23m0987r874N466J4838J2404
11368A2093K236J3264P286J4892p486j9110j8398j9134j603L7652J4628l0816
11356E504k1211P916K3655K9616l1628m2906k7618n913J630K5731K7856J3511
11344F143P247j9534K9923j7003m6126L3049N620k7976m1592K885M6966M2995
11332B2597R32j3016l4115Q101j775K4092K2590j4663M639k765l9986j4732K9510
$$ plain form
11419 -5354 8304 17427 10623 15252 12758 8625 23354 -7883 -33229 -57469 -36523 -14466 -17688
11406 -17688 -31496 -1004 -1303 -27400 -24338 32323 24485 -49230 -54476 -7967 43278 55333 27131
11393 27131 5395 -24905 -61767 -89064 -100012 -109704 -115131 -94423 -17588 18026 -11723 -43315
11381 -43315 -59126 -31266 -7260 -6051 -11063 4539 29423 30246 -10741 -20615 -15149 -311 12093
11368 12093 14329 27593 34879 49771 42285 23175 4777 -14357 -15960 21692 36320 5504
11356 5504 -15707 -7791 15864 45480 13852 -29054 -56672 -62585 -60955 -35224 -7368 6143
11344 6143 13390 -6144 23779 6776 -39350 -6301 -681 -28657 -70249 -67364 -20398 22597
11332 22597 23529 10513 -23602 -15501 -17276 6816 29406 14743 19382 16617 -23369 -38101 -8591
11319h591m534m469J1726K4697P2m52k6926P1K2879n739k7835K407K5126J3213
11305B1645k8042J9414L4633p8n1907m8169M2936L5631J3228o737k6544k5075
11293a9065m727l702p835L2369J3336J0476L8344k7079o1588j8850m027M1333
11281a1015K9709J2231P904k5665k8486N820m382Q210p578L4035K1441j6898k6918
11268a592L0011r2k5041K1147k1559l5693K5585o242J1646l346L275k0775k7141
11255d9817J4627k322M253K3967K5394J9205J644m5307K1085O0489l5314N12k7813
11242A0603N929j5073N7726l1008k5886j8976k6650J6024R133J5867j6316k2276
11230d0903L6980K2464k9446m943N9342j5834l3407k2755o072L9937J0410m2393
$$ plain form
11319 -8591 -13125 -17594 -5868 18829 18901 18449 -8477 -8406 14473 8734 -19101 -16694 8432 21645
11305 21645 -6397 13017 47650 47572 -4335 -52504 -9568 26063 39291 32554 6010 -19065
11293 -19065 -23792 -27494 -35329 -2960 10376 20852 59196 32117 -29471 -48321 -52348 -11015
11281 -11015 18694 30925 38829 13164 -15322 -9502 -13884 -5674 -13252 20783 42224 25326 -1592
11268 -1592 28419 28327 3286 24433 2874 -32819 -7234 -13476 -1830 -5176 -1901 -22676 -49817
11255 -49817 -35190 -37512 -33259 -9292 16102 35307 36951 -8356 12729 73218 37904 38416 10603
11242 10603 16532 1459 59185 28177 2291 -16685 -43335 -27311 -18178 -2311 -18627 -40903
11230 -40903 -3923 18541 -10905 -15848 43494 27660 -5747 -28502 -34574 5363 15773 -26620
11218b6620O898L4831q25n731J744q721p151l656N919j7862k6804K8932J0103
11205h943J1054J3432j0956M307k1070o9949R734L0218l1689J7253K4208j5368
11193d7769k36L3202K8891j4490R51N3056l3930j2491J1342J353J5309k8059J6909
11180B4038N488l1592O659O107K342L8830J867m8073m4699k4039J9123K6429R166
11167h354N1030J6117l8608n8196R669L7861j6095J4483l1789k5580R230M1059
11155H27L6406j941j7098O700j9195M701J5987L3650o084j661K2618q178m6691
11142B0041j2577M470J6754l1361N883j0443N965K2078j4458j4321j1648k8086
11130d7703N111R857j9848M7299j8176k1169p546j9252M3986L5775o473j2956
$$ plain form
11218 -26620 -19722 15109 14284 8553 10297 1576 -5575 -9231 -3312 -21174 -47978 -19046 -8943
11205 -8943 2111 15543 4587 8894 -12176 -82125 -72391 -42173 -73862 -56609 -32401 -47769
11193 -47769 -48005 -14803 14088 -402 549 53605 19675 7184 18526 19879 35188 7129 24038
11180 24038 29526 -2066 4593 10700 13042 51872 53739 5666 -39033 -63072 -43949 -17520 -8354
11167 -8354 42676 58793 20185 -38011 -28342 9519 -6576 7907 -23882 -49462 -40232 827
11155 827 37233 35292 18194 24894 5699 10400 26387 60037 53953 52292 74910 66732 20041
11142 20041 7464 11934 28688 -2673 3210 -7233 -1268 20810 6352 -7969 -19617 -47703
11130 -47703 -42592 -32735 -52583 -5284 -23460 -44629 -52175 -71427 -27441 8334 1861 -11095
11118a1095O35L0448K4903l648j628m148J6770j7045n3966K1552M5971K1135J6169
11105H6053K104m5033L497J17k750l0563j2279k9248P510Q3498L7621m8678m5933
11092E916j6931J7212L0536n818l3826m174J3645K3730r828k1554K2464j7564
11080C808l923L6211j8151m814p985O989k6078l4957m0034j9514q9P4581k0958
11067e4914l9485K7488K5626K9542L139Q464j7961j8054k399L494k9502r657O000
11054f8219L3415J9783L5839L2618Q680p210l6131J1213J3035J1126K546l8050
11042A8645o180q348r587j9671k432j4712j7631M0759K5272K9033J5291o3044
11030a2605p1821r046m45M4727K9031J4127O049J765k2541K6571L88j2026j9181
$$ plain form
11118 -11095 -10460 19988 44891 41243 39615 35467 52237 35192 -18774 2778 48749 69884 86053
11105 86053 88157 43124 46621 46738 43988 13425 1146 -28102 -20592 62906 100527 51849 5916
11092 5916 -11015 6197 36733 30915 -2911 -7085 6560 30290 20462 -1092 21372 3808
11080 3808 -115 36096 17945 13131 5146 12135 -13943 -48900 -88934 -108448 -108537 -33956 -54914
11067 -54914 -94399 -66911 -41285 -11743 -8604 -140 -18101 -36155 -38554 -35060 -64562 -74219 -68219
11054 -68219 -34804 -15021 20818 53436 62116 54906 18775 29988 43023 54149 56695 18645
11042 18645 12465 4117 -5470 -25141 -27573 -42285 -59916 -19157 6115 35148 50439 -12605
11030 -12605 -84426 -93472 -93917 -49190 -20159 -6032 17 1782 -20759 5812 6200 -5826 -25007
11017b5007m6122L525K9238K3590j8026r629L9329M999k4995M9836K0287l7268
11005I757j0154k0440K6499N4497L8522l1363P359k6975m4986k8130m768O650
10993b3532K0567J015q2391J9415M5272k2437K7276M9918J7833j6227j4779o1865
10981c9935m8783p553O9402L1811M046R509l0334n0525j027P278L1315p087k6609
10968e8492m0921l872L2431M9443J7327l0779K4934N4071K0633j1071l9382j9302
10956d980J183J5971k2573m355k2198L9941k3014J2683J9074J8326k3990r179
10944c111j9515l2164O443j7989J2395J4521R181L487l8491K3572J9853j4018
10932c5836K8994K6834J2594N255j7016m7051R636M56k4950J0326M1668J5108
$$ plain form
11017 -25007 -71129 -67604 -38366 -14776 -32802 -42431 -3102 1897 -23098 26738 47025 9757
11005 9757 -397 -20837 5662 60159 98681 67318 74677 47702 2716 -25414 -30182 -23532
10993 -23532 -2965 -1950 -84341 -64926 -19654 -42091 -14815 35103 52936 36709 21930 -39935
10981 -39935 -88718 -96271 -26869 4942 8988 18497 -11837 -62362 -63389 -56111 -24796 -31883 -58492
10968 -58492 -99413 -103285 -70854 -21411 -4084 -34863 -9929 44142 64775 53704 14322 -4980
10956 -4980 -3797 12174 -10399 -14754 -36952 2989 -20025 -7342 11732 30058 6068 -3111
10944 -3111 -22626 -54790 -48347 -66336 -53941 -39420 -30239 -26752 -65243 -41671 -21818 -35836
10932 -35836 -6842 19992 32586 37841 20825 -26226 -16590 -16134 -41084 -30758 10910 26018
10920B6018J3925l0142M2142L9045o426o0907K5524M577m3523L0536j5929j8061
10908F779M2207j7068m2246m9875q625L0092M5332k0055m2120K0477J3138M1608
10896A9644K7469L9738k6159n5620O81L3443j6731l079K279m2205K5099J2926
10884A7485l9792k7869m981K629M5241K5962q323m9192k2619K4172k5462J5061
10872d7688n172J7437J3974J2481l198K6949Q92j7074o726J0744q61L1816K7559
10859F1133k2687p4368l6836M811L9620q251K7637L4844p393m98R308J1741N722
10846D4783P593J6725p278o4555P873L6504N273K6465P79j9375o6153j3546K5769
10833H57j3254k214J0642n974j4540K3516J2213q208L4206J7691R446j2335J7155
$$ plain form
10920 26018 39943 9801 51943 90988 84562 23655 49179 53756 10233 40769 24840 6779
10908 6779 48986 31918 -10328 -60203 -68828 -38736 6596 -13459 -55579 -35102 -21964 19644
10896 19644 47113 86851 60692 5072 5753 39196 22465 19386 21665 -20540 4559 17485
10884 17485 -22307 -50176 -55157 -52528 -7287 18675 10352 -38840 -61459 -37287 -62749 -47688
10872 -47688 -52860 -35423 -21449 -8968 -12166 14783 15675 -1399 -8125 2619 1758 33574 61133
10859 61133 38446 -35922 -72758 -67947 -28327 -36578 -8941 25903 18510 18012 27320 39061 44783
10846 44783 52376 69101 61823 -2732 5141 41645 46918 73383 74162 54787 -11366 -24912 857
10833 857 -12397 -14611 -3969 -9943 -24483 -967 11246 3038 37244 54935 64381 52046 69201
10820F9201K8173m548k5038k1993j8845J550J955L6246J2997k8852M863J8970
10808G4679n946Q778J2419m66j7718N747L4398j249n271l6269o8128j5899K3518
10795H593J228m294M5207P1073M8042L1798K0973k9614J0489p141K1529M0163
10783B58046J0324L3277P8131J04573J68686K75911L48652N44261R54082J743056
10773D518999L278927N475472M018889l583448n675596l261163j629955r31933
10765B210192n39555l63612k66197k06179j03958j01620k6335o4387j37206r1866
10755C09277n6546j6935K498R119P993k3508l3744p8316m7326m6499k1615P722
10743A2120L9700J5917m4335m3824j4092K4844K3219M0517J9225q056n683m3022
$$ plain form
10820 69201 97374 92826 67788 45795 26950 28500 30455 66701 79698 50846 55709 74679
10808 74679 68733 77511 89930 89464 71746 77493 111891 110642 105371 69102 974 -14925 8593
10795 8593 9821 5527 50734 121807 169849 201647 222620 193006 203495 196354 217883 258046
10783 258046 268370 301647 379778 484351 653037 928948 1277600 1821861 2775943 4518999
10773 4518999 7797926 13273398 17292287 13708839 8033243 4772080 3142125 2210192
10765 2210192 1670637 1307025 1040828 834649 730691 629071 602736 538349 401143 309277
10755 309277 252731 235796 238294 247413 255406 231898 198154 119838 72512 26013 4398 12120
10743 12120 51820 67737 23402 -20422 -34514 -9670 13549 54066 73291 65235 59552 16530
10731A6530j6607l9284J744M3529K6967k727R626M023l240k8278n701K2718n4077
10718b4777m1248R082M7947q49L4891K5895J2363j2176j0967J8170K8039j8027
10706F8343m4740K3643J5953P272j9957N306J6312L3721L943m4304n6028j8094
10694h630L6131L2530k1439n3185m177J4828l3533r876l57j7495N6420J8521k6460
10681a6722L3711J2180k3982L174K3947k4394k8999K2076m151K8597J1556L3850
10669G0843P529m3372l3562m1428J7722J9896K666k2549k5785J1711N863R712
10657b0754J9040K359J4190k4564m0760R837L7088K4560J5075k1287j3392j9454
10645a8062K4803N8362J2530q449o061l639k3216m2257R345p368l1287k1741L8380
$$ plain form
10731 16530 -77 -39361 -37617 5912 32879 30152 39778 43801 40561 12283 6582 29300 -24777
10718 -24777 -66025 -56943 -8996 -9845 25046 50941 63304 51128 40161 58331 86370 68343
10706 68343 23603 47246 63199 70471 50514 55820 72132 105853 109796 65492 9464 -8630
10694 -8630 27501 60031 38592 -14593 -18770 -3942 -37475 -47351 -47708 -65203 -8783 9738 -16722
10681 -16722 16989 29169 5187 8361 32308 7914 -21085 991 -3160 25437 36993 70843
10669 70843 78372 35000 1438 -39990 -22268 -2372 294 -22255 -48040 -36329 -30466 -20754
10657 -20754 -1714 645 14835 -9729 -50489 -40652 -3564 20996 36071 14784 1392 -18062
10645 -18062 6741 65103 77633 69184 63123 59484 36268 -5989 3356 -4012 -35299 -57040 -18660
10632a8660l993k6877J7769Q360j968J0954P678n085j9154M07M8279M0474J0495
10619F8679k0902K1093R827m5227n4404n59j815k2917o12J6560j1564J2346j5760
10606d5255K581k1987O481k8542L6597M9889L8920J937n7065l137J5010L6586
10594C2015J3626n5443j0600L852K7476p021j7242j9133J189M7628n7398j9547
10582f0598L9842j9370l5856L1197M0359k7816k449N4000P173r342k476n992k316
10569F356n0276Q848K9378j0080l2338l230M1084l666R88L6795M110m3765l8449
10556e4245J1647M470o589M2168L4956J5137j4116m5432k8226j0172J1430r30
10544c9902J9862M7237L532m3953k9336q567J7731K497l7004l2638r257M9467
$$ plain form
10632 -18660 -22653 -49530 -31761 -23401 -25369 -14415 -6737 -11822 -30976 -30569 17710 58184 68679
10619 68679 47777 68870 78697 33470 -20934 -21493 -23308 -46225 -46837 -30277 -41841 -29495 -45255
10606 -45255 -42674 -64661 -58180 -86722 -50125 -236 38684 40621 -16444 -19581 -4571 32015
10594 32015 45641 -9802 -20402 -16550 10926 3905 -13337 -32470 -31281 16347 -41051 -60598
10582 -60598 -20756 -40126 -75982 -44785 -4426 -32242 -34691 19309 26482 17140 14664 8672 6356
10569 6356 -43920 -35072 -5694 -15774 -48112 -51342 -10258 -13924 -12936 23859 27969 -15796 -54245
10556 -54245 -42598 -38128 -44717 -2549 32407 47544 33428 -12004 -40230 -50402 -38972 -39902
10544 -39902 -20040 27197 30729 -13224 -42560 -51127 -33396 -30899 -67903 -100541 -109798 -60331
10532f0331P1311j2915r885k8884k3437K8190l2316R915L2205J4245l2326p025
10520e1253k2069L9048K7068j1708L792k8729J8642R388o386k4417k0417K5193
10508d1848o4576l2909M8070P1672L5020N553l0512k7413J0539Q021l278M5901
10496B4240L1348j9510l0452o3860J294J6564R035k3598L5946L895J9751j663
10484B990n520J55l742M734J2880N904J0006l8470r192r183o870J3917l0931p959
10470f1281J9536K6472J8475M256j4411n023j5319l0295K3542l183j2778M6231
10458c778M361k416M8j8011K0129j1580l4273L1651J9102k8062m2889K2393L1146
10445a2179l049o274J4655J0510k6017k3467p459P661L4930k6590k0251k5778
$$ plain form
10532 -60331 10980 -1935 -11820 -40704 -64141 -35951 -68267 -58352 -26147 -11902 -44228 -51253
10520 -51253 -73322 -34274 -7206 -18914 -15122 -43851 -25209 -15821 -22207 -46624 -67041 -41848
10508 -41848 -106424 -139333 -91263 -19591 15429 20982 -9530 -36943 -26404 -18383 -21661 24240
10496 24240 55588 36078 5626 -58234 -56940 -40376 -31341 -54939 -18993 -15098 4653 2990
10484 2990 -2530 -2375 -6117 -1383 11497 17401 27407 -11063 -20255 -29438 -36308 -22391 -53322 -61281
10470 -61281 -41745 -15273 3202 7458 -6953 -11976 -27295 -57590 -34048 -37231 -50009 -3778
10458 -3778 583 -1833 -1785 -19796 333 -11247 -45520 -13869 5233 -22829 -65718 -43325 -12179
10445 -12179 -15228 -21502 -6847 3663 -22354 -45821 -53280 -45619 -10689 -37279 -57530 -83308
10433h3308M6162K3250j6520r651K1838J8871j768n575o526J9427M1160M229k6604
10420B4985l4883k2922l528J2586L319j4607m1463K5875l345M2551K1824J8570
10408B8962K046M246l07K5555J4549k8387o5555L816J0531R912j3128k0758m2085
10395g0603m939L8368K0764O868J8547n663r597J8584r07Q175m755J3135n9796
10382c1819Q202N9232J6135j3149r940J9227K8418k7312q807n9852J1001O4420
10370E5756l975m6278j7904j2514K2132J5086j2217R706K1526j9521J0203k653
10358A9347M512k405l1953j0383J4858O617R268M8577J3994m4536j6499K7748
10346C9145K6435P61l5364j7559j0975j2948J2546q95L460k6260j7277J2736j4840
$$ plain form
10433 -83308 -37146 -13896 -30416 -40067 -18229 642 -1126 -6701 -13227 6200 47360 51589 24985
10420 24985 -9898 -32820 -36348 -23762 -20443 -35050 -76513 -50638 -53983 -11432 10392 28962
10408 28962 31008 35254 34947 60502 75051 46664 -18891 -15075 -4544 5368 -7760 -28518 -70603
10395 -70603 -75542 -37174 -16410 -9542 9005 3342 -6255 12329 11422 19597 14842 27977 -31819
10382 -31819 -23617 35615 51750 38601 28661 47888 76306 48994 40187 -19665 -8664 55756
10370 55756 51781 5503 -12401 -24915 -2783 12303 86 9792 31318 11797 22000 19347
10358 19347 23859 21454 -10499 -20882 -6024 593 9861 58438 72432 27896 11397 39145
10346 39145 65580 66341 30977 13418 2443 -10505 2041 1146 4606 -21654 -38931 -26195 -41035
10333d1035n0115P546K1779N6374K8983l7145q370L4521J1255J2149p548k8082
10321C12O944j8444K4173J0848m030o5750k1333K1172K2626L3191m3374m5851
10309g9516K4966M7492P171j2348j0846m4101J2839O0580M0407l4522k1599j6889
10297b6366P127k5762l930R284m8626O642K5244N5898K736j9877k3948l784m765
10284e0127j2261K0780L8254J7869l7948K1317L0685j9747m0684k1351R345J9738
10272b4130p074N1308l913j4920r083r282K4251m0480m7693j317L089K5159O3206
10259I121K3644k2179k1322j5060K2887K2802k7515J0072k1579l4839k1475J0145
10247f5298L543j474J5440p860K9786M7570K5478k4120n7446q50J6027k8756K1247
$$ plain form
10333 -41035 -91150 -83604 -61825 -5451 23532 -13613 -21983 12538 23793 35942 28394 312
10321 312 7256 -11188 12985 23833 19803 -45947 -67280 -46108 -23482 9709 -33665 -79516
10309 -79516 -54550 -7058 113 -12235 -23081 -67182 -54343 6237 46644 12122 -9477 -26366
10297 -26366 -19239 -45001 -48931 -39647 -88273 -81631 -56387 -489 2247 -17630 -41578 -45362 -50127
10284 -50127 -62388 -41608 -3354 14515 -23433 -2116 28569 8822 -31862 -53213 -43868 -24130
10272 -24130 -31204 20104 16191 1271 -7812 -17094 7157 -33323 -81016 -82333 -79244 -54085 9121
10259 9121 32765 10586 -10736 -25796 -2909 19893 -7622 2450 -19129 -53968 -75443 -65298
10247 -65298 -61755 -63229 -47789 -55649 -25863 21707 47185 23065 -34381 -35231 -19204 -47960 -26713
10234b6713m926L164N1204M2496J2477m9093j5444k2497k166K664l8604p872J5869
10221c9441J5119j7661N694m820J186m647J5683K8804M0447r345k4996N470L1347
10208D2840j0019J6479k2016j8464k3559k0568j236O2259M46m653j0739O301L1963
10195D9034K6268K6250k1685j5921p1666r847K5551K506K7280K2551k5235l4471
10183F15k0449N5510J1777k7274k9952O653M1370K231l8655P980K4394l6768P305
10170D737N1025k3466k7515j2566j3386j6495M1883K8430Q358J3893l6552l9013
10158b0667l413j547K0325L202m5481L3741o975j7546N39k0019J713L0861M1346
10145A6079k4180k4393J7514P595o3701j744P5393N3402j8209k8691k3274n903
$$ plain form
10234 -26713 -31639 -28475 22729 65225 77702 28609 13165 -9332 -11498 -8834 -47438 -55310 -39441
10221 -39441 -24322 -41983 -36289 -41109 -39923 -44570 -28887 -83 40364 31019 6023 11493 42840
10208 42840 32821 49300 27284 8820 -14739 -35307 -36543 25716 26162 21509 10770 17071 49034
10195 49034 75302 101552 79867 63946 -7720 -17567 7984 10490 37770 60321 35086 615
10183 615 -19834 35676 47453 20179 -9773 -3120 38250 40481 1826 9806 34200 -2568 4737
10170 4737 55762 32296 4781 -7785 -21171 -37666 4217 32647 41005 54898 18346 -20667
10158 -20667 -24080 -25627 -5302 -2100 -47581 -13840 -20815 -38361 -37822 -57841 -56128 -25267 16079
10145 16079 -8101 -32494 -14980 -7385 -71086 -72830 2563 55965 37756 9065 -14209 -20112
10133b0112P36j1018k4137M3514j835M1691M8346n796j2399j1429j3942k7069
10121F550O171m0941K710j274K8940K0155q510j3625j0141J40r300J70J2061L149
10107c745l4934K5743L1060n5780m9408L1078N1758j0937O798K4728l346k4885
10095a1870k1425J2784k170O792J3529J3110Q471L6527j4677l5203J607m598p257
10082d380Q045j8021J5969l216k902P093R974J0018J881l8175P168n9834k1949
10069h8329N8259K4112K0626j3824l4956j1241j5075J2964L0964k3808q495M2852
10057e951r083k2916j4858k274p264j758Q764N3280J1596k1157j2368K5511Q113
10044I635k186k3925L766K3649N120j9481p400O2141k5481m0420j9882k0120J1731
$$ plain form
10133 -20112 -19376 -30394 -54531 -11017 -12852 28839 77185 71389 58990 47561 33619 6550
10121 6550 12721 -28220 -25510 -26784 2156 22311 13801 176 -9965 -9825 -19125 -18955 -6894 -3745
10107 -3745 -38679 -12936 18124 -37656 -87064 -55986 -4228 -15165 -8367 16361 13015 -11870
10095 -11870 -33295 -20511 -22681 -15889 -2360 10750 19221 55748 41071 5868 7475 2877 -4380
10082 -4380 3665 -14356 1613 -1603 -4505 2588 12562 22580 24461 -13714 -6546 -66380 -88329
10069 -88329 -30070 -5958 14668 844 -34112 -45353 -60428 -47464 -16500 -40308 -48803 -5951
10057 -5951 -15034 -37950 -52808 -55082 -62346 -64104 -55340 -2060 9536 -11621 -23989 1522 9635
10044 9635 7449 -16476 -12710 10939 16059 -3422 -10822 51319 25838 -14582 -34464 -54584 -42853
10031d2853J9930q370J6039n61q456L0201N2260J3257k3385k1742k3013M0822
10019D4129P2265o4369n6615L326K0084j042j7120K1961J1399K4192K5723k3394
10007F0539l2559q42q5387n946K6453j4826K0423K2366n5568m7011J5999O3759
9995c2600o60l1407Q138m360l3139k1776K2903J121M6343P0995L2985j2680L6204
9982H2067j582k8065N144k9915J794J4847j2463p197J2200j189m0126k502m952
9969a1939L0552k79l4365J3436K5278m7636o0128k1443l722K7410L2662J8930
9957c1244j4208J256M4149p429o059O528j0674J0501l034K1430l818n896q303
9944f801J9586L7950n111k9412J0328M3211j028o9707n6690L0570J7749M8089
$$ plain form
10031 -42853 -22923 -31293 -15254 -15815 -24271 5930 58190 71447 48062 26320 3307 44129
10019 44129 116394 52025 -4590 -1264 18820 17778 658 22619 34018 58210 83933 60539
10007 60539 27980 27138 -58249 -64195 -37742 -52568 -32145 -9779 -65347 -112358 -96359 -32600
9995 -32600 -33260 -64667 -56529 -60889 -94028 -115804 -92901 -91780 -45437 25558 58543 45863 82067
9982 82067 80485 52420 57564 27649 29443 44290 31827 24630 36830 35641 -4485 -6987 -11939
9969 -11939 18613 18334 -16031 -2595 22683 -24953 -85081 -106524 -110246 -82836 -50174 -31244
9957 -31244 -45452 -44196 -47 -7476 -13535 -7007 -17681 -7180 -10214 11216 7398 1502 -6801
9944 -6801 12785 50735 45624 16212 26540 69751 68723 -984 -57674 -27104 -9355 38734
9932C8734k2959n8456k3088J2582J6313K0702J9845P727L5419j695m349m5971
9920e196q153K6747K142k2230k4005p784j4271m3665L3416J5324j6681M5671K6666
9907G981j8337J9040j2393l6998K2668M8447k435J8193l5989K0495l0388k6866
9895b6582j5049J8870o976O793J8172M2495k10o907O31K2255L1792l4739j0985
9882C9560k4714l7841Q731m193k8140j6764m579N8746L2919k5752j6351M448J6989
9869C059K6829o170k3715l0594J4738J5216L0270k4608j6845J9172m156K7227
9857C0423p593P770Q200K9187J4461o0589O831N023m3793o1266j5686j950j8027
9844a07009L764J3632J656J1848J7458N223l5495k1526L4732R479k674k4255N6039
$$ plain form
9932 38734 15775 -42681 -65769 -53187 -36874 -16172 3673 11400 46819 45124 40775 -5196
9920 -5196 -13349 13398 15540 -6690 -30695 -38479 -52750 -96415 -62999 -47675 -64356 -18685 7981
9907 7981 -10356 8684 -3709 -40707 -18039 30408 27973 46166 10177 30672 284 -26582
9895 -26582 -41631 -22761 -29737 -22944 -4772 37723 37513 30606 31237 53492 85284 50545 39560
9882 39560 14846 -22995 -14264 -18457 -46597 -63361 -67940 -9194 23725 -2027 -18378 -13930 3059
9869 3059 29888 23718 3 -30591 -15853 -637 29633 5025 -11820 7352 3196 30423
9857 30423 22830 30600 38800 67987 82448 21859 28690 33713 -10080 -71346 -87032 -88982 -107009
9844 -107009 -103245 -89613 -87957 -76109 -58651 -53428 -88923 -110449 -75717 -66238 -68912 -93167 -37128
9831c7128L3444M6964j1284k3862L364K8580O036O688J1341l3184k3259j5958
9819h258l1214J1683M418K1687K1662j4995j4233K2746K8607J7618q0606m8744
9807f9629L4286N0581k3971n605K9076K780n3899l6140k4516j202N3541P92M784
9794c9122K5780j0953j118j3367k1102K0538L4234J4063k5380k3310J7867O9535
9782D7665l0576m9013K3793K3651m951m876k383l7034m1944K5071M8542J2256
9770A0201j4916k1101j6779q880k7027j9592P030N0859J1097K1766l3692q421
9758d9455P459Q519Q70K1109P5452k0276k2354l5145K1428K3440k7899L7762J9374
9745F0284J9283l3720k4869K128j7044P893k0788n2878k0978J4663M3805M5588
$$ plain form
9831 -37128 -3684 43280 31996 8134 11498 40078 46114 52802 64143 30959 7700 -8258
9819 -8258 -39472 -27789 -23371 -1684 19978 4983 -9250 13496 42103 59721 -20885 -69629
9807 -69629 -35343 15238 -8733 -14338 14738 17518 -36381 -72521 -97037 -98239 -44698 -43906 -39122
9794 -39122 -13342 -24295 -25413 -38780 -59882 -39344 -5110 8953 -16427 -39737 -21870 47665
9782 47665 17089 -31924 -8131 15520 10569 5693 3310 -33724 -75668 -50597 -2055 10201
9770 10201 -4715 -25816 -42595 -51475 -78502 -98094 -91064 -40205 -29108 -7342 -41034 -49455
9758 -49455 -41996 -33477 -32607 -11498 63954 43678 21324 -13821 7607 31047 3148 40910 60284
9745 60284 79567 45847 20978 23106 6062 13955 -6833 -59711 -80689 -66026 -22221 23367
9733B3367q866p1743K977J2018j6560j0419P181J4229O1580P782J7381Q337M373
9720E1637N2354j1805k3937m9578k7492k5278k46K8108j2613p089L0400K5716
9708C0177J9769j4789l1533j8705k3286m446k576o016J8735o631J2913K4856K6193
9695B4661K60m2854n56j6300m2709o333L5852k8527l8830L0628J2683L0521J9389
9682b2115M981K530k3705J7013l0245j1441L3860R180O136k523j6582k3205J0748
9669d5368J3623J2582N1918k0938l0317K6434k5468l444L7131J5848R28o358l4885
9656h314k4695j4714m966m976l8744L088Q592J3220J3372K6372l7923m695R610
9643f4773K0018j3134K2812j5486q251L753J6671L6697J8634j4168k9565L58K4796
$$ plain form
9733 23367 14501 -57242 -54265 -42247 -58807 -69226 -62045 -47816 13764 21546 38927 47264 51637
9720 51637 103991 92186 68249 18671 -8821 -34099 -34345 -6237 -18850 -25939 4461 30177
9708 30177 49946 35157 3624 -15081 -38367 -42813 -45389 -51405 -32670 -39301 -26388 -1532 24661
9695 24661 24921 -17933 -18489 -34789 -77498 -83831 -47979 -76506 -115336 -84708 -72025 -41504 -22115
9682 -22115 -17134 -14604 -38309 -21296 -51541 -62982 -29122 -19942 -13806 -16329 -32911 -56116 -45368
9669 -45368 -31745 -19163 32755 11817 -18500 7934 -17534 -20978 16153 32001 32929 26571 -8314
9656 -8314 -33009 -47723 -52689 -57665 -96409 -93321 -84729 -71509 -58137 -31765 -69688 -74383 -64773
9643 -64773 -44755 -57889 -35077 -50563 -58814 -55061 -38390 -1693 16941 2773 -26792 -26434 -1638
9630a638l2235l7853N4580L6897j6856j1345j4566J0720k4229o916J6632l0138
9618e6947J2329K0759r350p773L8829L2411j9724L608l3524o0702P222N3043n362
9605b5181j0433j3732L1906J6758J1979J8467J2574j1687m7746k9168k1478K329
9593f5412P187M8201Q771L1574K4702q947j346O237l8620j2840N0032L8883j3089
9580G5333m0236o4862l2744k688M4626R998p673Q087J3298m056K1504j3146l1181
9567b3740l1633p978K4267J1407M1877J9132k350o562j009l8929m474K2286M840
9554G134m454l9680J663j4822j2763K0920j1586O326J7987p496j2770P338o557
9541d8760Q935q49J3510J5259k0161J0251L4882j8368p603P401q590j4746k2002
$$ plain form
9630 -1638 -33873 -71726 -17146 19751 2895 -8450 -23016 -12296 -36525 -43441 -26809 -56947
9618 -56947 -44618 -23859 -33209 -40982 -2153 30258 10534 14142 -19382 -80084 -72862 -19819 -25181
9605 -25181 -35614 -49346 -17440 -682 11297 29764 42338 30651 -17095 -46263 -67741 -65412
9593 -65412 -58225 -10024 -1253 30321 55023 46076 44730 50967 12347 -493 49539 88422 75333
9580 75333 35097 -29765 -62509 -65197 -20571 -10573 -18246 -10159 3139 -917 20587 7441 -23740
9567 -23740 -55373 -63351 -39084 -27677 14200 33332 30982 24420 23411 -15518 -19992 2294 7134
9554 7134 2680 -37000 -35337 -50159 -62922 -42002 -53588 -47262 -29275 -36771 -49541 -42203 -48760
9541 -48760 -39825 -40674 -27164 -11905 -32066 -21815 13067 -5301 -12904 -5503 -14093 -28839 -50841
9528e0841N457R993m5684j3843J216M119L8126L5512R614K7557J0598m5165m2256
9515e5597r864N532L2413j3080K0143L7051R435q805o880P267r024l0225j7169
9502c8803J3690L3403M4894j5784k0003j5179o636p6804m244Q5540L5574K8932
9490F4580j1933R803l343k0174k082m8714j0717J4903k0484p033J6647k7368r978
9477e5893J1966o990J853J6441J979j73Q072J0738J7753k0616m2945j3795J6264
9464e5346O4138J467j1580L01j4938q311J4888L7221l648N079J4951j8021n5341
9451b9140l3005J6467M4075K4078J8037p476m6039k8997m235M661O403M181K1586
9438i404R236K583j9031k171l1367k1060K9343K1829k0456j391j9792k9337J4623
$$ plain form
9528 -50841 -45384 -35391 -81075 -94918 -93702 -89583 -51457 -15945 -6331 21226 31824 -13341 -55597
9515 -55597 -65461 -59929 -27516 -40596 -20453 16598 26033 17228 10348 17615 8591 -21634 -38803
9502 -38803 -25113 8290 53184 37400 17397 2218 -4418 -81222 -85466 74 35648 64580
9490 64580 52647 62450 59107 38933 36851 -11863 -22580 -7677 -28161 -35194 -18547 -45915 -55893
9477 -55893 -43927 -50917 -49064 -32623 -30644 -30817 -22745 -12007 5746 -14870 -57815 -71610 -55346
9464 -55346 8792 10259 -1321 -1020 -15958 -24269 -9381 27840 24192 29271 44222 26201 -29140
9451 -29140 -62145 -45678 -1603 22475 40512 33036 -13003 -42000 -46235 -41574 -35171 -30990 -9404
9438 -9404 -168 2415 -16616 -18787 -50154 -71214 -41871 -20042 -40498 -41889 -61681 -91018 -76395
9425g6395J43L3678O2948K2725M48m6016p406R453Q3714k0680o0282k3052O6320
9412D5598J8922Q368j0884l0290j8049j6928j5933J4182J1890J0212K4134J9945
9400F1167K361k0792k4416j2097L3910Q588j1653k4076J8458K1760n7852l029
9388g671J4130r913M446L5311j596l6999M059k46q301m9846j3478L6942K8622
9375d540J1967o387m5236k1795J8911P8414K5382n687m0332J1900J5759L7371
9363G5727j4607k1242l5883m1902l1068K0682O949l703K6810N054m250K793O9779
9350E5139j6147k9986l8845n694o483n333J1647L8595j7484l8196j9672K307J9447
9337e0705o201R844K9193Q926O1717k8909l2562j2966L6473P2405K4507j2954
$$ plain form
9425 -76395 -76252 -42574 20374 43099 43547 -2469 -9875 -422 83292 62612 2330 -20722 45598
9412 45598 64520 72888 62004 31714 13665 -3263 -19196 -5014 6876 17088 41222 61167
9400 61167 63528 42736 18320 6223 40133 48721 37068 12992 31450 53210 -4642 -7671
9388 -7671 6459 -3454 992 36303 34707 -2292 1767 1521 -6780 -56626 -70104 -33162 -4540
9375 -4540 7427 1040 -44196 -65991 -47080 31334 56716 51029 10697 22597 38356 75727
9363 75727 61120 39878 3995 -37907 -68975 -48293 -41344 -45047 -18237 -13183 -17433 -14640 55139
9350 55139 38992 9006 -29839 -35533 -42016 -47349 -35702 2893 -14591 -52787 -72459 -70152 -50705
9337 -50705 -56906 -47062 -17869 -8943 52774 23865 -8697 -21663 14810 87215 111722 98768
9325I8768k480r611m2468m0459o388l588j3400k4068j9476J4940M9022l990J6659
9312A3461M1647j8006o8304k9944R040o709N3236L7516J7232k555j8602j6840
9300A1172p639j3453L9583q166k5155k6412L7646j6430l2311J3623J9544N3007
9288D5009L355l3721m1649K7359J2079L2380j884l267k3164m0908K6335N3454
9276E5378k0506k6816o623L5008J1628j4189j8211K297J6245p6532m1909L3535
9264e0695R926j0816L1338L7486K5551l6458j0912J4709J1744J5049N752Q896
9252E1570p293N755k4917J7568M5429j0779p037j9638n1762l3607P232J2327j6340
9239c1492M475K2585K3336J0042J2553l520j9831m7381K3260L0981o170k6163
$$ plain form
9325 98768 96288 86677 44209 3750 -2638 -6226 -19626 -43694 -63170 -48230 792 -3198 13461
9312 13461 55108 37102 -31202 -61146 -52106 -58815 -5579 31937 49169 46614 28012 11172
9300 11172 3533 -9920 29663 21497 -3658 -30070 7576 -8854 -41165 -27542 -7998 45009
9288 45009 48364 14643 -27006 353 12432 44812 42928 39661 16497 -24411 1924 55378
9276 55378 34872 8056 1433 36441 48069 33880 15669 17966 34211 -42321 -84230 -50695
9264 -50695 -40769 -51585 -20247 17239 42790 6332 -4580 10129 21873 36922 42674 51570
9252 51570 44277 50032 25115 42683 88112 77333 70296 50658 -1104 -34711 -27479 -15152 -31492
9239 -31492 -27017 -4432 18904 28946 41499 37979 18148 -29233 -5973 25008 18838 -7325
9227g325J6331N2519j9683n8466k8848L0072J0799J894J9792o5n174J2007K3706
9214D7559N448O524j2085k4060K4961K332m2120k5810j9060j0452K2027M5918
9202B1182M2218j105K372J3304r705j8871n2136j2750P302m6017K0718N2706L3944
9189E3162k5257j6899k6350J937N009k603J740P391J8379O978n1293K9869K2279
9176B4342n080l6183j5448K6570j3325M3231j8130K8398L1764o924l0749Q789
9164C7255M0772k3765j4778J8587p88K5419j68j0863m7032j3185N1580L1926J4415
9151A09375J257J3878p299K8922J4535N0339L0936J1792L0871P7430N6094j3432
9139D04698L8355R0822R3592Q2179M9395J37903J28041J39480K21794K79916L89903
$$ plain form
9227 -7325 9006 61525 41842 -16624 -45472 -15400 -4601 -2707 17085 17020 11846 23853 47559
9214 47559 53007 59531 47446 23386 48347 50679 8559 -17251 -36311 -46763 -24736 21182
9202 21182 63400 62295 64667 77971 68266 49395 -2741 -15491 -8189 -54206 -33488 19218 53162
9189 53162 27905 11006 -15344 -13407 -8398 -11001 -9261 -1870 16509 23487 -27806 2063 24342
9176 24342 19262 -16921 -32369 -5799 -19124 24107 5977 34375 66139 59215 28466 37255
9164 37255 78027 54262 39484 58071 57283 82702 82534 71671 24639 11454 63034 94960 109375
9151 109375 110632 124510 117211 146133 160668 211007 241943 253735 284606 362036 418130 404698
9139 404698 443053 533875 627467 709646 759041 896944 1024985 1164465 1386259 1666175 2056078
9128B056078N35660P65286J053709J546088K452596L799040N569616O460804L629584
9119B7868461k652389o242255n646129l900168k525586j616743j132915p94963
9111C357313n66710m44001l88650k79712k14234j75329j79688j48399p6200q8194
9101G96196p3249o0271r3284p0951J2150j1521m9960m1122k7028k1103n3111m8856
9089B57890L0217J7978m1260j037J3338L149l0430l0356M283j8285j3213N966
9077A98240J4743O386k0974k3360J7674p3467l7203J4677J8604J4097J144j0462
9065A20099j9333k3972k2058m5994j7899K0312M5757J7417k6575j5582j3558k0737
9053b123J4600J3960M391K1729R249k4857m4587J6695K3810L1121K7733J5606
$$ plain form
9128 2056078 2591738 3357024 4410733 5956821 8409417 12208457 17778073 24238877 27868461
9119 27868461 25216072 18973817 13327688 9427520 6901934 5285191 4152276 3357313
9111 3357313 2790603 2346602 1957952 1678240 1464006 1288677 1108989 960590 884390 796196
9101 796196 722947 662676 569392 498441 510591 499070 449110 407988 380960 359857 306746 257890
9089 257890 288107 306085 264825 263788 277126 280275 249845 219489 223772 205487 192274 198240
9077 198240 212983 219369 198395 175035 192709 119242 82039 96716 115320 129417 130561 120099
9065 120099 100766 76794 54736 8742 -9157 11155 56912 74329 47754 32172 18614 -2123
9053 -2123 12477 26437 30828 52557 61806 36949 -7638 9057 32867 63988 91721 107327
9041A07327m2093p72j1982P565K6901l9169k0024J3712J0053j4792J7259m635
9029D9350k0763j5431K1939n115J0896K6622k9534l4353j7169K2997K4694L468
9017C7601J0243j3359k219k4447O305L0437K0761J32j5133L1959L3973L6380m1956
9004A10677p3007j3661K3076k3975J1029j0097j0463K5363K4544m7975K3500K9826
8992F8837J3329o9417k1352L6439r182l289J7295K4564l1498k8719J4733O6621
8980G8361J2336m8938k7584n229M547n5640n322M175m348m0994R256P4826K0331
8967A5777j4245k6197j3919k201J4999P414j5440O219k0261l758N324P550N572
8954c3166K0895N8019M430L099R948n0824q250l4565P43L6110K6288N1180m8053
$$ plain form
9041 107327 65234 64462 52480 60045 86946 47777 27753 41465 51518 36726 53985 49350
9029 49350 28587 13156 35095 29980 40876 67498 37964 3611 -13558 9439 34133 37601
9017 37601 47844 34485 32266 7819 14124 44561 65322 65454 50321 82280 116253 152633 110677
9004 110677 37670 24009 47085 23110 34139 24042 13579 38942 63486 15511 39011 68837
8992 68837 82166 12749 -8603 27836 18654 15365 32660 57224 25726 -2993 11740 78361
8980 78361 90697 41759 14175 8946 13493 -42147 -47469 -43294 -47642 -88636 -79380 -4554 15777
8967 15777 1532 -24665 -38584 -40785 -25786 -18372 -33812 -27593 -47854 -51612 -46288 -38738 -33166
8954 -33166 -12271 45748 50178 53277 63225 12401 4151 -30414 -29671 6439 32727 83907 35854
8941C5854j3467j2498J1563n90p566r085k3092J409J9298J6578J2071O266O499
8928D3240j0743o943j4168k3333m417j5481m83J0278M220j7287N7983N4681k0846
8915E6701J705K5796k5033l507l9328m5892K8031N715j9252k2146O358k4934p069
8902f2855O4899K2213K915n4784k2295J5521K3330j3481J0583L2897J6185j7648
8890A7480m762k5930M669j4704N5985M4552k9927n86k6634P001K1743k126j8019
8877B8742j6104J3639l2117O887J2172K0123L4451k3128k4565j0762j1802j2124
8865a4588L7959K5339J7617M5519L9390L2418l3996K116J3410n2536o4765m7320
8853E63l382l060m3830k9201M1289Q204m483O870L6045M1114k7399k0503L3035
$$ plain form
8941 35854 22387 9889 21452 20862 13296 4211 -18881 -17472 1826 18404 30475 36741 43240
8928 43240 32497 25554 11386 -11947 -16364 -31845 -32328 -22050 -17830 -35117 22866 77547 56701
8915 56701 58406 84202 59169 55662 16334 -29558 -1527 4188 -15064 -37210 -30852 -55786 -62855
8902 -62855 2044 24257 27172 -27612 -49907 -34386 -11056 -24537 -13954 18943 35128 17480
8890 17480 12718 -13212 -8543 -23247 32738 77290 47363 46777 20143 27144 48887 46761 28742
8877 28742 12638 26277 -5840 1047 13219 33342 67793 44665 20100 9338 -2464 -14588
8865 -14588 23371 48710 66327 111846 151236 183654 149658 151774 165184 112648 47883 563
8853 563 -2819 -5879 -49709 -78910 -37621 -29417 -33900 -27030 9015 50129 22730 2227 35262
8840C5262J2231l1808l3343L887J5229L691j1450J9768J8795K3502l3601p887
8828A4276o3390M0921M1919n905j0824J0722K5680n552N368k9279j823l3050J64
8815a0773L7959k9689M919K0882k0951J0682L9619L0041P266m1821p6382o2072
8803i0320j188K3603j3488K6585L5240n781p141J262R587K6283j2957r519n350
8790b3184m3003K709O0017j7764P033K3201k3612q96L541o797O4J515j6253k9052
8776f2481J6460K4443L4504j8661N526Q422j6131k7036j6129J1750L9137O368
8764F172q011j4980k2952J297o916k3945J5312j687K1182O000k5766j3451L8910
8751b8835L1993J1185j4273J9770K0559N52r44k787j6711m7446r106J7503L4278
$$ plain form
8840 35262 47493 15685 -17658 -13771 1458 5149 -6301 13467 32262 55764 22163 14276
8828 14276 -49114 -8193 33726 27821 16997 27719 53399 47847 53215 23936 22113 -10937 -10773
8815 -10773 27186 -2503 2416 23298 2347 13029 52648 82689 89955 48134 -28248 -90320
8803 -90320 -91508 -67905 -81393 -54808 -19568 -25349 -32490 -31228 -21641 4642 -8315 -17834 -23184
8790 -23184 -66187 -63478 -3461 -21225 -14192 9009 -14603 -15499 -11958 -18755 -18691 -17176 -33429 -62481
8776 -62481 -46021 -21578 12926 -5735 -209 8213 -7918 -34954 -51083 -39333 -196 6172
8764 6172 -1839 -16819 -39771 -38474 -45390 -69335 -54023 -55710 -34528 -28528 -54294 -67745 -28835
8751 -28835 3158 14343 70 19840 40399 40951 40007 37220 20509 -26937 -36043 -18540 15738
8738A5738j1018q785j4262j8627k4549M5929L5230l6290m2026K2063J4595J7704
8726d298J2340N217n035J548P834j7987k1160p55O0844M412M4j5840k0030j8999
8712a1865M256L1440M104j4349J1455j3642K0522L9406Q497k2502J2519m049o4007
8699A785l9561K1512N9399m7946J4010L0419m179K1005k2198k500q583p051J5380
8686C1492J9803j608m986L1149l2799q947O027L7534L390L2474k8702n4803j5149
8673A4875L2182j2185R011J5820o771K9120j732l1010j4767J1588K0262J5703
8661H2096N328m501m0695m5901M619L5704L9365M7459J4983L2261j8227p910l5211
8648A09370l0380j7595J1573M8766l1193J249M3583j0156n7336k6333J1503J3832
$$ plain form
8738 15738 4720 -4065 -18327 -36954 -61503 -15574 19656 -16634 -58660 -36597 -22002 -4298
8726 -4298 8042 13259 8224 9772 17606 -381 -21541 -22296 38548 42960 43004 27164 7134 -11865
8712 -11865 -7609 23831 27935 13586 25041 11399 31921 71327 79824 57322 69841 65792 1785
8699 1785 -37776 -16264 43135 -4811 9199 39618 35439 56444 34246 31746 23163 16112 31492
8686 31492 51295 49687 44701 75850 43051 34104 40131 77665 81055 113529 84827 30024 14875
8673 14875 47057 34872 43883 59703 52932 82052 80320 49310 34543 46131 66393 82096
8661 82096 87424 82923 42228 -3673 946 36650 76015 123474 138457 170718 152491 144581 109370
8648 109370 78990 61395 72968 121734 90541 91790 135373 125217 67881 41548 53051 66883
8636F6883M0268L0183K6308M7557j6762j02259K1115n934L4866K1823j616j2887
8624A49545l3874L1716N2283K6097M662k7149j2612L0885k6505K2813J9569N5795
8612B93225O4938j8978j8761M35J8861J5855L2019l5226m6818m8751q086K4246
8600B72959K0597j2221l7225J411J53j1048j7920L6669J9283n9223J1251M428
8588B29114l1688l0407j0180l856k5981m6468j0380K0121k0021m4111L3864J6178
8576G6185J8878J5314M387k0587j9056n635j9783k2294R30j7197L479K6235j4754
8563B6102k5887M28K8924l351K1025K946N636J9034K2833J2781L1056j4536p94
8550A26197M318j9817j8628k5742k3888o0451J3534L6213M956n7003j2663j0275
$$ plain form
8636 66883 107151 137334 163642 211199 194437 92178 113293 107359 142225 164048 162432 149545
8624 149545 115671 147387 199670 225767 230429 203280 190668 221553 195048 217861 237430 293225
8612 293225 358163 339185 320424 320859 339720 355575 387594 352368 305550 256799 248713 272959
8600 272959 293556 281335 244110 245521 245674 234626 216706 253375 272658 213435 224686 229114
8588 229114 197426 167019 156839 152983 127002 80534 70154 90275 70254 26143 60007 76185
8576 76185 95063 110377 114764 94177 75121 69486 49703 27409 28339 11142 14621 40856 26102
8563 26102 215 643 29567 26216 47241 50187 55823 74857 97690 110471 141527 126991 126197
8550 126197 130515 110698 92070 66328 42440 -18011 -4477 31736 36692 -20311 -32974 -43249
8538d3249m2922P864O0748P793k5242J402o109j6236L9182L3681N060l5594k0444
8525c4066j2804J4585L0324K526k3717J5620J0086j245N1191r479k160J2871P602
8512F1334r066l0205K9065q149n223J1069k8759J8186L145l122M718J0757M9409
8499A03159m650l5055l7779k5580M319j6767J1872K9559k5932l998k5804L4796
8487H140J2372o2716o0593k6767Q1721Q2250L4872k3059o0644k1772L0937M5306
8475D0047L6196j8195k1650o581j1906l9316N203K2092L979J085N7332J8121k1531
8462F4876k1815j9844m077P005K3827j9803n5258j771Q716K0007j326P725l889
8449D373q26J2731K5927k9901l5887J3414K6459k0947K1135j780m3769l7317m168
$$ plain form
8538 -43249 -86171 -78307 -17559 -9766 -35008 -33606 -39715 -55951 -16769 16912 21972 -13622 -34066
8525 -34066 -46870 -32285 -1961 565 -23152 -7532 2554 1309 52500 43021 40861 53732 61334
8512 61334 52268 22063 51128 42979 37756 48825 20066 38252 41397 38275 42993 53750 103159
8499 103159 98509 63454 25675 95 4414 -12353 -481 29078 3146 -852 -26656 8140
8487 8140 20512 -42204 -102797 -129564 -47843 34407 69279 46220 -14424 -36196 -5259 40047
8475 40047 76243 58048 36398 29817 17911 -21405 -16202 5890 9869 10954 68286 86407 64876
8462 64876 43061 23217 19140 26145 49972 30169 -25089 -26860 -18144 1863 537 8262 4373
8449 4373 3547 16278 42205 12304 -23583 -10169 16290 -4657 16478 14698 -29071 -66388 -70556
8436g0556K1495M1110K379m6310N1391P4002L2789j1115l6485k7226j6652j4695
8424A27j0352o551J6314l9939j7078P9224L4014j3745j9726J4255j8212m5854
8412b7523J8695L6597k6344K5697L0330J2957k5816j2847J196J6869L2025j8908
8400F2928n9841k4997Q589L9414J2906k9150m6964n500J5942n751M5911N4952
8388F8439m6582j3921J7521j4753M503O903K7925O133J6488P548k5302m5890K2859
8375C1871K920n264l1738k9444m2518m974L3535K2545K074J7049M9215j562k4761
8362A8948N772L4906k9938l8980k3293j2425m0K59J4970J6401q93k2404k0402
8349e7119P5495L3199K7308n9867n6631j5770j4969Q548O723M5725K6964o321
$$ plain form
8436 -70556 -49061 -7951 -5572 -51882 -491 73511 106300 95185 58700 31474 14822 127
8424 127 -10225 -16776 -462 -40401 -57479 21745 55759 42014 22288 36543 18331 -27523
8412 -27523 -8828 27769 1425 27122 57452 70409 44593 31746 32942 49811 81836 62928
8400 62928 3087 -21910 -13321 26093 38999 9849 -37115 -42615 -26673 -32424 13487 68439
8388 68439 21857 7936 25457 10704 15207 22110 50035 56168 72656 80204 54902 9012 31871
8375 31871 34791 29527 -2211 -31655 -74173 -79147 -45612 -23067 -20993 -3944 45271 43709 18948
8362 18948 24720 59626 29688 -9292 -32585 -45010 -45050 -44791 -29821 -13420 -14313 -36717 -57119
8349 -57119 18376 51575 78883 19016 -37615 -53385 -68354 -59806 -53083 -7358 19606 13285
8337A3285r807l0557j5753M3475L5138j280j9573J8122j4960k185k4776l0992
8325c9863k8723k345j4778L0017J6334K3452k169j4778J2822N3j7058L2953K1919
8312A7836k0734l5088p614L2571J9296L6520K343k480k3916m0148L2879Q140l7595
8299a7990J3865K783k8390j2432k4815J8075L4304J2962K7333K1219K6422j5349
8287E7987l1842q544K8065L3255L4835k5919p073N827l8727j3111j5537l765K5690
8274D1141K9622O243j9226n4921l1233L5431J9432J8130l487l717j4403J3250
8262C6262L48m971o515p2878m901L3778J2116K777J0351L174K4176J6624j2960
8249C7381M67n0131j0821K1188J6493K1575K921j4967k1359j6367j2270J9891
$$ plain form
8337 13285 3478 -27079 -42832 643 35781 34501 14928 33050 18090 15905 -8871 -39863
8325 -39863 -68586 -70931 -85709 -55692 -39358 -15906 -18075 -32853 -20031 -19978 -37036 -4083 17836
8312 17836 -2898 -37986 -45600 -13029 6267 42787 45130 42650 18734 -21414 11465 19605 -17990
8299 -17990 -4125 -1342 -29732 -42164 -66979 -48904 -14600 -1638 25695 46914 73336 57987
8287 57987 26145 17601 45666 78921 113756 87837 80764 86591 47864 34753 19216 15451 41141
8274 41141 70763 77006 57780 2859 -28374 7057 26489 44619 41132 37415 23012 36262
8262 36262 36610 31639 25124 -47754 -52655 -18877 -6761 -3984 6367 9541 33717 50341 37381
8249 37381 37848 -12283 -23104 -1916 14577 36152 39073 24106 2747 -13620 -25890 -5999
8237e999J186K8468L9788k5762m6518j8352K1976K2286P322m8394j183M1786J4622
8224C1226o505J7541Q92k4215p708J906j0124k1511n3415R799r51k5106M944N959
8210g7268L2519N8794j7048r327R328J5479j2253L1637L607L813k8137j5632m6521
8197e1009L4971L0781P781K1709n403K2444J5387J1164n6521n3657j3502J5889
8185a9966K8627J6121l97l9150l5601k1237j9264J8973R536k2481J6950R336l0993
8172h9546P3492J7602K814m320j6087k347j822k071l0249J3953p865N530K286
8159c8630N490M3914j4721M1300j9056K4131J6155J5990L7503j4749m7382k0218
8147B9727l6007j7926L42K0890K1951K8207J2105j0262r89J4210p493m5628n1359
$$ plain form
8237 -5999 -4813 23655 63443 37681 -8837 -27189 -5213 17073 24395 -23999 -25182 16604 31226
8224 31226 24721 42262 43154 18939 11231 13137 3013 -18498 -71913 -62114 -63065 -88171 -83227 -77268
8210 -77268 -44749 14045 -3003 -12330 -3002 12477 224 31861 35468 39281 11144 -4488 -51009
8197 -51009 -16038 14743 22524 44233 38830 61274 76661 87825 31304 -22353 -35855 -19966
8185 -19966 8661 24782 24385 -14765 -50366 -71603 -90867 -71894 -62358 -84839 -67889 -58553 -89546
8172 -89546 -16054 1548 4362 42 -16045 -18392 -20214 -22285 -52534 -38581 -46446 -40916 -38630
8159 -38630 -33140 10774 -3947 37353 18297 42428 58583 74573 112076 97327 49945 29727
8147 29727 -6280 -24206 -23864 -2974 18977 47184 59289 49027 48038 62248 54755 9127 -42232
8134d2232j1473m548K3146J9233q533L4431J2858J0076K725k9306J602j542K5562
8121C1999J7033l8113m9731k7771L0335J5943K2951R136K2782J6772L3152m0639
8109D3849K8834K157j2809l8455m845K4338l2705l832j6538m9759p196P949J8660
8096d0352j4806j099J6974j2187O269J7292j5828K3549M506j1807J6411M965J6906
8083A0793K5410k9878J310k9952p286L5116M0589p301k1196k6460P1092L2248
8071I4485m789n7775j1201O799l6070J170M7720K1420k0074j1164J9377k0742
8059B9156J7078N6967j0659o8432l9565k174K2931m0094J6999k608m739N6867
8047C1727J0459k6463M8416J1985k4286M1240J0354l1476k6815K8649M5089J2638
$$ plain form
8134 -42232 -53705 -58253 -35107 -15874 -24407 10024 22882 32958 35683 6377 7979 6437 31999
8121 31999 49032 10919 -38812 -66583 -36248 -20305 2646 11782 34564 51336 84488 43849
8109 43849 72683 74840 62031 23576 18731 43069 10364 6532 -10006 -59765 -66961 -59012 -40352
8096 -40352 -55158 -56257 -39283 -51470 -45201 -27909 -43737 -20188 -15682 -27489 -11078 -6113 10793
8083 10793 36203 6325 7635 -22317 -29603 5513 46102 38801 17605 -8855 62237 94485
8071 94485 89696 31921 20720 27519 -8551 -7381 40339 61759 41685 30521 49898 29156
8059 29156 46234 103201 92542 24110 -15455 -17629 5302 -34792 -17793 -20401 -25140 31727
8047 31727 42186 15723 64139 76124 51838 93078 103432 71956 45141 73790 118879 131517
8035A31517K4421q71j2973j8026j010k2847m613k4772j4927J3843k1082q548K8771
8022F8883K060J0334k4150J1536K805K337N8608J9090k982j4768j7876l9102l222
8009G3553P342K4706M5441K7152j2908N0002N5831O0815R2074O4228j2206l5691
7997D40339q1568j11095o1916o0460J9809O9029K2776L4719O7217J02450O4037
7986E05337o0204j21954q5677o1950n754K2498M317n4843r4857l5907L5402M4499
7974I0907L6147n2948k4177J21k7594P042o836K8562p761J4514J5089j5044K0926
7961G8948J9627M0128J8833O5689N4556L3689O757Q996K2136j8920q099m6935
7949B75405k7462o042N4614Q6675j8300q6516q1142m479k4980p2314l9481k9370
$$ plain form
8035 131517 155938 155067 142094 124068 123058 100211 95598 70826 55899 69742 48660 40112 68883
8022 68883 70943 81277 57127 68663 71468 73805 132413 151503 148521 133753 115877 76775 73553
8009 73553 80895 105601 151042 178194 165286 215288 271119 331934 424008 488236 476030 440339
7997 440339 358771 247676 185760 125300 145109 214138 236914 271633 338850 441300 505337
7986 505337 445133 323179 237502 175552 169798 192296 196613 141770 46913 11006 46408 90907
7974 90907 127054 74106 49929 50050 22456 29498 22662 51224 43463 57977 73066 58022 78948
7961 78948 98575 138703 157536 223225 277781 311470 318227 327223 349359 330439 322340 275405
7949 275405 247943 241901 296515 383190 364890 278374 197232 192753 167773 95459 55978 26608
7937B6608m858K0176L3064o958K138j4351j9899J2544l1744J9348M5803K6905
7925A08776j81j9794m5135k334J7871N303m051q590k6785L6407K8458K9305p647
7912A11603k1795n295l3283j5112K3402J9073K2612j0114J3302N007l3198o999
7900F9203M573j0042k272n1991j0379J0575N709O2755K960k7493J8563l3756n9133
7887b0728J3030J2534J7503K2740r425k5398n4580K3216M3932l3506k5774K0991
7875a5465M4185n390k4389k1475q89J8295o535j0456J6395K2420m5241m453J5324
7862a7674J9326K7267o183k6826k7890j5473L3395J2105K9001k0850m222k811
7850h35l552J7062J3250j5988n700L0129j4962M692J0047M267k9752k7824k0443
$$ plain form
7937 26608 21750 41926 74990 68032 70170 55819 35920 48464 16720 36068 81871 108776
7925 108776 108595 88801 43666 41332 59203 64506 60455 51865 25080 61487 89945 119250 111603
7912 111603 89808 84513 51230 36118 59520 78593 101205 91091 104393 109400 76202 69203
7900 69203 73776 63734 61462 9471 -908 9667 15376 78131 81091 53598 72161 38405 -20728
7887 -20728 -7698 4836 22339 45079 35654 10256 -44324 -21108 22824 -10682 -36456 -15465
7875 -15465 28720 23330 -1059 -22534 -23423 -5128 -11663 -22119 -5724 16696 -28545 -32998 -17674
7862 -17674 1652 28919 22736 -4090 -31980 -47453 -14058 -1953 27048 6198 1976 -835
7850 -835 -4387 12675 25925 9937 4237 34366 19404 24096 34143 38410 8658 -19166 -39609
7837c9609n281N7492N6249j2093l9799J5015j3298m2200M86K0473K6095M7217
7825G0747J918n9097l0685k759K5577K4408K0761O587k9087k9557K6494L236q086
7812B0457j4039o237n0066q117K3467k9308k7749n960L4229O4388j9882k54K4290
7799E219l0988k8421K6832K3153m5754l4181K8567M6984J0855J8626j2273m7740
7787c9121K2959L2366K7203j5054O191K3439k7122L2973J7484O416j6185n3246
7775A8303m9253Q578m88j7507j8622n32L3527m4703L88R054Q831N1154K2866k9232
7761g636l5603J3899j1488j9593M7330O5929J8138p670K2416l0297m3162k5349
7749a3086R173M9179k311M455m09n5286j1576J0785O229m5293o939N8135N7381
$$ plain form
7837 -39609 -44890 12602 68851 56758 16959 31974 18676 -23524 -23038 -2565 23530 70747
7825 70747 72665 13568 -17117 -19876 5701 30109 50870 57457 28370 -1187 25307 28543 20457
7812 20457 6418 181 -49885 -58002 -34535 -63843 -91592 -97552 -63323 1065 -18817 -19071 5219
7799 5219 -25769 -54190 -27358 -4205 -49959 -84140 -55573 -8589 2266 20892 8619 -39121
7787 -39121 -16162 16204 43407 28353 34544 57983 30861 63834 81318 87734 71549 18303
7775 18303 -30950 -22372 -22860 -40367 -58989 -59521 -25994 -70697 -70309 -61255 -52424 -1270 21596 -7636
7761 -7636 -43239 -29340 -40828 -60421 -13091 52838 70976 63306 85722 55425 12263 -13086
7749 -13086 -3913 45266 42955 47410 47001 -8285 -19861 -9076 -2847 -48140 -55079 3056 60437
7736F0437r953l2658k9778k7850m1799M3092K580K3430L7887K9095J6273m6845
7724B3911j4919K9094P73j4805r426k5270l0290N00L2421K469L7812j2332m4348
7711b4410j8976J2196J3862k4813J8574L0645J8223j0648j8982k0253M0598m040
7699A1976Q552J5483J4105j5472l5990J0888O593m9331l6465q586J4524L1484
7687c2239K0576l3132j4200J4653K155m125Q793J580j5482O461k570k0660L9194
7674b8996K0130J8319K8735r692j5670l4280k2392j5184J14j2861q273J9995K2739
7661c7316J2644J7221K502k0341J3182O815l7012P1J6777K3513M2542J9856m7312
7648A3142o4094p871J7283O101K3818L4792K1925j3938j2055M5001k7094j5646
$$ plain form
7736 60437 50484 17826 -11952 -39802 -81601 -38509 -35929 -12499 25388 54483 70756 23911
7724 23911 8992 38086 38859 24054 14628 -10642 -40932 -40432 -8011 -5542 32270 19938 -24410
7711 -24410 -43386 -31190 -17328 -42141 -23567 7078 25301 14653 -4329 -24582 16016 11976
7699 11976 20528 36011 50116 34644 -1346 9542 16135 -33196 -69661 -78247 -63723 -32239
7687 -32239 -11663 -44795 -58995 -44342 -42187 -46312 -37519 -35939 -51421 -44960 -47530 -68190 -28996
7674 -28996 -8866 9453 38188 28496 12826 -21454 -43846 -59030 -58916 -71777 -80050 -60055 -37316
7661 -37316 -24672 -7451 -4949 -25290 -12108 -5293 -42305 -42234 -25457 -1944 40598 60454 13142
7648 13142 -50952 -58823 -41540 -35439 -11621 23171 45096 31158 19103 64104 37010 21364
7636B1364J4451M046l5372k0640J0262o385k3379K6179K7007m5330m3876N3071
7624a8602M5719j9658k6030l3700k57K4291J4242K4191M280n398r28J5506j9438
7611D218m0084K5369K7168J097J9676J7786K566m399j7524j9967j2456R124K0177
7598C2751j2851J3447j8602j4485N9302k2532j8976L6807J2343k7145q449k4564
7586G046r986K3909n258P20k1576r583J8301l45q231q205J3380N430J9786J2053
7572C7441J5501n0896j0373J3742k6624m957J7401j4138J4930p281o285q12m2866
$$ plain form
7636 21364 35815 39861 4489 -16151 -5889 -12274 -35653 -9474 17533 -27797 -71673 -18602
7624 -18602 27117 7459 -18571 -52271 -52528 -28237 -13995 10196 14476 9078 8150 23656 4218
7611 4218 -35866 -10497 16671 17768 37444 55230 57796 53397 35873 15906 3450 12574 32751
7598 32751 19900 33347 14745 260 59562 37030 18054 54861 67204 40059 31610 7046
7586 7046 -2940 20969 15711 16431 -5145 -14728 3573 3228 -5003 -13208 172 5602 25388 37441
7572 37441 52942 2046 -8327 5415 -21209 -26166 -8765 -22903 -7973 -15254 -21539 -22351 -65217
$$ [...]
##END NTUPLES=NMR SPECTRUM
##END=
