##TITLE=Analysis number 327229
Compound Code cc 54004
Book Reference 518/83
Project Code adrs
Chemist Name colinb
##JCAMPDX= 6.0         $$ Bruker NMR JCAMP-DX V2.0
##DATA TYPE= NMR SPECTRUM
##DATA CLASS= NTUPLES
##ORIGIN= Bruker BioSpin GmbH
##OWNER= nmr
$$ XWIN-NMR		Version 3.5
$$ Fri Mar 16 08:43:08 2007 GMT Standard Time (UT+0h)  MAYBRIDGE\nmr@NMR_250MHZ
##.OBSERVE FREQUENCY= 250.131544655141
##.OBSERVE NUCLEUS= ^1H
##.ACQUISITION MODE= SIMULTANEOUS (DQD)
##.ACQUISITION SCHEME= undefined
##.AVERAGES= 16
##.DIGITISER RES= 18
##SPECTROMETER/DATA SYSTEM= dpx250
##.PULSE SEQUENCE= zg30
##.SOLVENT NAME= CDCl3
##.SHIFT REFERENCE= (INTERNAL, CDCl3, 0, 16.522)
##AUDIT TRAIL= $$ (NUMBER, WHEN, WHO, WHERE, WHAT)
$$ ##TITLE= Audit trail, XWIN-NMR		Version 3.5
$$ ##JCAMPDX= 5.01
$$ ##ORIGIN= Bruker BioSpin GmbH
$$ ##OWNER= nmr
$$ C:\u/data/dgb/nmr/ADRS/1020/pdata/1/auditp.txt
$$ ##AUDIT TRAIL=  $$ (NUMBER, WHEN, WHO, WHERE, WHAT)
(   1,<2007-03-16 08:42:29.06 +000>,<MAYBRIDGE\nmr>,<NMR_250MHZ>,
      <created by zg, POWCHK disabled, PULCHK disabled
       configuration hash MD5:
       49 4B E0 1D 92 C2 6B 37 9F E6 65 BC 52 41 86 1D
       data hash MD5: 64K
       2B 54 F3 C0 72 D4 E5 93 85 B4 2E D3 03 AD F2 76>)
(   2,<2007-03-16 08:42:47.56 +000>,<MAYBRIDGE\nmr>,<NMR_250MHZ>,
      <Start of raw data processing
       ef LB = 0.3 FT_mod = 6 PKNL = 1 SI = 32K 
       data hash MD5: 32K
       97 7C 41 1F 7E E3 04 9D E4 4A 6D 4E 3C E6 D8 08>)
(   3,<2007-03-16 08:42:52.39 +000>,<MAYBRIDGE\nmr>,<NMR_250MHZ>,
      <apk 
       data hash MD5: 32K
       82 8C 94 13 13 A1 82 CE E9 B7 47 C5 FC 2D 9C F9>)
(   4,<2007-03-16 08:42:54.17 +000>,<MAYBRIDGE\nmr>,<NMR_250MHZ>,
      <abs ABSG = 5 
       data hash MD5: 32K
       4B A1 90 38 ED 4F 9A 6C 38 B9 23 62 C2 F4 C6 6F>)
$$ ##END=
$$ 
$$ hash MD5
$$ B4 3A C7 70 2A D8 99 9A 17 72 6C 9C 2D E0 E4 8D
##$RELAX= 
##$RELAX= 
##$RELAX= 
##$RELAX= 
##$RELAX= 
##$RELAX= 
##$RELAX= 
$$ Bruker specific parameters
$$ --------------------------
##$DU= <C:\u>
##$EXPNO= 1020
##$NAME= <ADRS>
##$PROCNO= 1
##$TYPE= <nmr>
##$USER= <dgb>
##$AMP= (0..31)
100 100 100 100 100 100 100 100 100 100 100 100 100 100 100 100 100 100 
100 100 100 100 100 100 100 100 100 100 100 100 100 100 
##$AQSEQ= 0
##$AQ_mod= 3
##$AUNM= <au_zg>
##$AUTOPOS= <1 >
##$BF1= 250.13
##$BF2= 250.13
##$BF3= 250.13
##$BF4= 250.13
##$BF5= 500.13
##$BF6= 500.13
##$BF7= 500.13
##$BF8= 500.13
##$BYTORDA= 1
##$CFDGTYP= 0
##$CFRGTYP= 5
##$CHEMSTR= <none>
##$CNST= (0..31)
1 1 145 1 1 1 1 1 1 1 1 1 1 1 1 1 1 1 1 1 1 1 1 1 1 1 1 1 1 1 1 1 
##$CPDPRG= <>
##$CPDPRG1= <>
##$CPDPRG2= <>
##$CPDPRG3= <>
##$CPDPRG4= <mlev>
##$CPDPRG5= <mlev>
##$CPDPRG6= <mlev>
##$CPDPRG7= <mlev>
##$CPDPRG8= <mlev>
##$CPDPRGB= <>
##$CPDPRGT= <>
##$D= (0..31)
0 1 0 0 0 0 0 0 0 0.06 0 0 0 0 0 0 0.0002 0 0 0 0 0 0 0 0 0 0 0 0 0 0 
0 
##$DATE= 1174034547
##$DBL= (0..7)
120 120 120 120 120 120 120 120 
##$DBP= (0..7)
150 150 150 150 150 150 150 150 
##$DBP07= 0
##$DBPNAM0= <>
##$DBPNAM1= <>
$$ [...]
##$SUBNAM7= <"">
##$SUBNAM8= <"">
##$SUBNAM9= <"">
##$SW= 20.6930455092707
##$SWIBOX= (0..15)
0 0 3 0 0 0 0 0 0 0 0 0 0 0 0 0 
##$SW_h= 5175.983436853
##$TD= 65536
##$TD0= 1
##$TE= 683.16
##$TE2= 300
##$TE3= 300
##$TEG= 300
##$TL= (0..7)
0 120 120 120 120 120 120 120 
##$TP= (0..7)
150 150 150 150 150 150 150 150 
##$TP07= 0
##$TPNAME0= <>
##$TPNAME1= <>
##$TPNAME2= <>
##$TPNAME3= <>
##$TPNAME4= <>
##$TPNAME5= <>
##$TPNAME6= <>
##$TPNAME7= <>
##$TPOAL= (0..7)
0.5 0.5 0.5 0.5 0.5 0.5 0.5 0.5 
##$TPOFFS= (0..7)
0 0 0 0 0 0 0 0 
##$TUNHIN= 0
##$TUNHOUT= 0
##$TUNXOUT= 0
##$USERA1= <user>
##$USERA2= <user>
##$USERA3= <user>
##$USERA4= <user>
##$USERA5= <user>
##$V9= 5
##$VALIST= <valist>
##$VCLIST= <CCCCCCCCCCCCCCC>
##$VD= 0
##$VDLIST= <DDDDDDDDDDDDDDD>
##$VPLIST= <PPPPPPPPPPPPPPP>
##$VTLIST= <TTTTTTTTTTTTTTT>
##$WBST= 1024
##$WBSW= 4
##$XGAIN= (0..3)
0 0 0 0 
##$XL= 0
##$YL= 0
##$YMAX_a= 367025
##$YMIN_a= -535977
##$ZGOPTNS= <>
##$ZL1= 120
##$ZL2= 120
##$ZL3= 120
##$ZL4= 120
##$ABSF1= 16.522
##$ABSF2= -4.171173
##$ABSG= 5
##$ABSL= 3
##$ALPHA= 0
##$AQORDER= 0
##$ASSFAC= 0
##$ASSFACI= 0
##$ASSFACX= 0
##$ASSWID= 0
##$AUNMP= <proc_1d>
##$AZFE= 0.1
##$AZFW= 0.1
##$BCFW= 0
##$BC_mod= 0
##$BYTORDP= 0
##$COROFFS= 0
##$CY= 12.5
##$DATMOD= 1
##$DC= 0
##$DFILT= <>
##$DTYPP= 0
##$F1P= 14.0000005364418
##$F2P= -0.99999901652339
##$FCOR= 0.5
##$FTSIZE= 32768
##$FT_mod= 6
##$GAMMA= 0
##$GB= 0
##$INTBC= 1
##$INTSCL= 1
##$ISEN= 128
##$LB= 0.3
##$LEV0= 0
##$LPBIN= 0
##$MAXI= 10000
##$MC2= 0
##$MEAN= 0
##$ME_mod= 0
##$MI= 0
##$NCOEF= 0
##$NC_proc= -4
##$NLEV= 6
##$NOISF1= 0
##$NOISF2= 0
##$NSP= 0
##$NTH_PI= 0
##$NZP= 0
##$OFFSET= 16.522
##$PC= 1
##$PHC0= 229.9471
##$PHC1= 4.897281
##$PH_mod= 1
##$PKNL= yes
##$PPARMOD= 0
##$PSCAL= 4
##$PSIGN= 0
##$REVERSE= no
##$SF= 250.13
##$SI= 32768
##$SIGF1= 0
##$SIGF2= 0
##$SINO= 400
##$SIOLD= 32768
##$SREGLST= <1H.CDCl3>
##$SSB= 0
##$STSI= 32768
##$STSR= 0
##$SW_p= 5175.98343685301
##$SYMM= 0
##$S_DEV= 0
##$TDeff= 65536
##$TDoff= 0
##$TI= <Analysis number 999999
Compound Code 99
Book Reference 9
Project Code 9>
##$TILT= no
##$TM1= 0
##$TM2= 0
##$TOPLEV= 0
##$USERP1= <user>
##$USERP2= <user>
##$USERP3= <user>
##$USERP4= <user>
##$USERP5= <user>
##$WDW= 1
##$XDIM= 32768
##$YMAX_p= 540207484
##$YMIN_p= -428803
$$ End of Bruker specific parameters
$$ ---------------------------------
##NTUPLES= NMR SPECTRUM
##VAR_NAME=  FREQUENCY,     SPECTRUM/REAL,   SPECTRUM/IMAG
##SYMBOL=    X,             R,               I
##VAR_TYPE=  INDEPENDENT,   DEPENDENT,       DEPENDENT
##VAR_FORM=  AFFN,          ASDF,            ASDF
##VAR_DIM=   32768,         32768,           32768
##UNITS=     HZ,            ARBITRARY UNITS, ARBITRARY UNITS
##FACTOR=    0.157963299565203, 1,           1
##FIRST=     4132.6476996994, 0,             0
##LAST=      -1043.33573715361, 0,           0
##MIN=       -1043.33573715361, -428803,     0
##MAX=       4132.6476996994, 540207484,     0
$$ Real data points
##PAGE= N=1
##DATA TABLE= (X++(R..R)), XYDATA
$$ [...]
32077 11091 47806 106144 37124 -42053 -49295 -50559 -49849 -11326 -7208 -71557 -68139 -39188 29064
32064 29064 -35259 -51300 -59210 -60078 17756 70680 30954 16329 50319 67773 58596 16742
32052 16742 -24371 23695 5986 -49248 -69448 -111062 -98606 -79277 -63852 -119300 -145015 -98046
32040 -98046 -69242 32889 94579 64926 50833 43494 43511 9371 -16038 -15915 -21934 -21575 36361
32027 36361 14425 -8369 18821 27872 -33777 -41492 -1800 6851 -42318 -54398 -88283 -55368
32015 -55368 -105094 -125463 -83864 -56555 -6296 1974 -17628 -19852 -19561 -40514 -53535 -52961 -26559
32002 -26559 24798 -7456 -34392 2993 -15501 -21205 41559 25613 23912 -1392 -23558 -23318
31990 -23318 769 -2396 7554 22131 55535 71140 -6866 -67303 -38834 -2730 -32952 -8872
31978 -8872 4381 -20827 -64763 -59904 -42519 -4594 13015 -72211 -127160 -110421 -127808 -96967
31966 -96967 -728 -16932 -88352 -80395 -10934 -754 30596 31024 32749 18740 10055 -7639 -31545
31953 -31545 -53749 -20012 19893 29409 51111 623 -2409 30247 52045 -5886 19728 52917
31941 52917 4802 49742 109954 96393 75653 32789 30262 28275 11643 -17117 -58791 -66756
31929 -66756 31918 44705 -8212 -9264 5929 33671 -15554 -25535 17143 2902 18686 88812
31917 88812 95435 72088 52742 -24549 -17934 -6756 -31572 -63078 -33613 -14451 -26253 -2917
31905 -2917 19452 2395 26593 74045 60783 112899 94834 92162 104351 50167 -33101 -81986
31893 -81986 -88853 -127867 -125776 -84100 -46180 -30811 14791 67667 17474 6829 -53937 -80053
31881 -80053 -89009 -74474 -64017 -52862 -74261 -50375 3788 14120 31252 -36508 -62028 -32663
31869 -32663 18436 7750 26762 602 -87893 -124639 -118724 -63443 -3141 19968 42792 23776
31857 23776 -2472 -12267 8182 -31352 -40389 -11270 -10895 15727 33157 45713 1113 -64845
31845 -64845 -32628 -12518 8454 46784 35483 38928 4854 23739 52723 19991 53815 104719
31833 104719 93038 121036 127920 40119 25522 50707 31342 22890 37655 50029 35517 22681
31821 22681 -19694 -31335 16619 44976 39040 33887 8096 14560 27145 17495 -4423 18338
31809 18338 -25299 -89301 -94307 -18278 4248 -61657 -75631 -38531 -49217 -42216 -2852 -43481
31797 -43481 -20495 25684 69130 90151 89058 43055 45247 55030 43440 8822 440 -37693
31785 -37693 -4478 8355 16626 75352 83574 22301 -61291 -85856 -53164 -45189 -61390 -29575
31773 -29575 20769 -35742 -36545 11100 56725 32060 23725 78905 79112 41767 13298 -55527 -127227
31760 -127227 -105622 -104820 -55722 12367 -12889 -69362 -16832 40551 92984 99613 111788 93290
31748 93290 30673 7874 60325 5084 -55466 -17710 -45259 -70560 -53874 -56962 -93755 -89411
31736 -89411 -89149 -40763 38411 37623 58583 91709 52451 12194 16464 -40000 -29254 -28906 -39884
31723 -39884 -60738 -96502 -48177 -41218 -13163 27043 -496 -44658 -63223 -125518 -84336 -54479
31711 -54479 -62290 -67565 -56122 -42945 -2347 24503 2158 -38459 -29097 17127 47052 46088 2395
31698 2395 -53628 5413 40102 21427 -68331 -55163 -62129 -100461 -146739 -79737 -19765 -113314
31686 -113314 -127919 -99941 -83379 -121497 -52144 -13466 -28606 20132 34492 29679 54140 104545
31674 104545 84475 42822 10184 5247 -50892 -112825 -115711 -88579 -47463 14408 -2205 -48101
31662 -48101 -77466 -6783 50733 12478 17374 73173 84549 50798 21585 3179 -10168 -15612
31650 -15612 25220 84275 65221 30977 -18292 60490 69210 26838 607 -14710 -14306 5917
31638 5917 -19672 -28031 -22682 16884 8881 -35383 -34927 -32125 11024 26181 20495 43415 54499
31625 54499 25102 7016 -12044 -37358 -44964 -32616 1580 29550 56235 31094 -49242 -29102
31613 -29102 20614 -19829 -41394 -101105 -121879 -75025 -49322 -67150 -80646 -114292 -72635 -34827
31601 -34827 22506 -4606 -12219 6308 -3271 -41305 -64722 -12791 43838 -388 59428 100755
31589 100755 67916 -406 -42888 -77562 -43115 39143 26835 -16326 11834 -5926 -19283
31578 -19283 12617 46966 96667 112832 77648 33383 30190 46779 50868 66233 78050 7639
31566 7639 -17407 5700 21290 12460 -19567 -45291 -99886 -109999 -52029 15174 400 -4260
31554 -4260 12119 29868 17516 40105 12016 -71851 -91216 -83406 -110736 -111662 -111982 -145394 -103380
31541 -103380 -79208 -138977 -146773 -118137 -79909 -62268 -69724 -26232 62759 68164 66012 97636
31529 97636 63185 58499 25729 -21988 -30513 -50630 -84919 -62031 -35625 -19052 36831 65348
31517 65348 85606 52391 4336 21155 66996 82998 96664 93673 53712 42940 31522 -10302
31505 -10302 -2605 -7784 -15329 -906 39734 65973 83197 44672 -30311 -74428 18988 24508
31493 24508 -21949 -12713 42263 11234 -9237 23411 26808 -12484 13778 15530 -75582 -123316
31481 -123316 -43902 -56576 -59684 -14649 25371 24997 -21063 -86916 -136038 -97179 -19325 33398
31469 33398 16776 -7590 -25037 -58194 -42940 6939 18023 3871 -30212 -74569 -93137 -64164
31457 -64164 -43682 -35488 4131 -10702 -71220 -88619 -20420 9116 43294 23161 -16409 -19917
31445 -19917 14491 28442 -21406 -38667 16192 -2817 -14935 -69583 -92207 -50653 -29543 -46503
31433 -46503 -62527 -66316 -71634 -37826 -35343 1332 1197 -2212 -56918 -34459 -4349 -68416 -93581
31420 -93581 -52310 -19280 49726 42370 -16283 -15297 30270 41840 -7057 -27446 -34042 -16849
31408 -16849 -349 -17576 -71251 -65038 19832 9753 -67108 -77994 -61504 -17712 -16864 -3983
31396 -3983 -1214 -46779 -64056 2991 17086 14279 60193 83000 57938 49393 15189 -21401
31384 -21401 -17982 -26512 -13418 34391 27244 -28385 -22289 19227 37588 107200 150638 101088
31372 101088 58046 48588 57364 27404 -14176 -8340 5608 11571 11251 33290 52020 17738 36674
31359 36674 34754 -1334 -55262 -85859 -73355 -118869 -141714 -87094 -38341 -71226 -68686 -5070
31347 -5070 23298 2475 5879 -17206 -45726 -49182 -102679 -113069 -98063 -37446 4761 13165
31335 13165 12568 11578 9353 8452 -15534 4629 -26050 -26723 -807 -56672 -102600 -98121 -38320 48487
31321 48487 65517 67218 56571 2427 -86597 -142406 -60452 -7909 -101637 -155801 -63531 61072
31309 61072 112090 109876 31286 -420 -67 28523 22057 20634 17546 -3933 -27823 -37157 -6620
31296 -6620 10257 33733 51957 81470 110436 123610 100030 90180 72049 76265 44724 99
31284 99 38668 -11939 -24607 -54594 -73073 -94842 -75817 -27175 -25887 26644 19223 46666 80253
31271 80253 86777 48303 12432 26192 47940 22294 -13220 -52065 -37946 -41620 -14633 32660
31259 32660 26540 12753 -17472 -35606 -51551 -64896 -79354 -125221 -78110 -77054 -72193 -61371
31247 -61371 -40091 -9643 31077 22233 -3238 18719 4205 8918 48755 9725 -43109 -18768
31235 -18768 -47638 -53654 -3999 -26961 -80462 -30361 -34438 -14643 -39775 -29030 -65909 -77249
31223 -77249 -74274 -99931 -87578 -21129 -8206 -65341 -91693 -107283 -53147 -6560 33961 40488
31211 40488 50155 5120 -2767 -32013 -1319 -1240 -11921 -19664 -57263 -53677 -60555 -83448 -43219
31198 -43219 33485 11111 -49412 -74227 -7752 3939 -20935 -42747 -54957 -102815 -133740 -89495
31186 -89495 -107762 -124200 -51848 -57282 -39063 -9986 -21739 -54008 -78593 -85602 -64206 -18664
31174 -18664 6858 23064 -19734 -72322 -27515 10135 -42635 -99487 -101608 -61760 4843 14765
31162 14765 -5751 -50468 -63470 -37651 -82528 -34265 28703 36735 19284 -9082 -9070 -58269
31150 -58269 -49391 -19167 2259 14990 63815 85951 125315 89915 -21285 -26976 -6788 -9389
31138 -9389 -25683 -70849 -113254 -9970 62543 60798 26112 40709 37626 -4207 -73518 -108893
31126 -108893 -82984 -78397 -89924 -32176 -24043 -22219 12355 3380 -29913 5620 33831 14112
31114 14112 -37537 -35283 -19693 27969 10657 6306 -3158 2224 30265 4879 -98228 -120737
31102 -120737 -103603 -66697 -22137 -5098 -24223 -15037 -21314 -35262 -43971 -10041 -30560 -11516
31090 -11516 25112 1905 -34830 -92161 -95597 -21167 41763 76048 63329 41122 42123 9438
31078 9438 13422 403 -47913 -56379 -76193 -40973 640 36714 103292 117129 98466 20579
31066 20579 25057 40824 59348 41328 31538 51903 12420 19925 59736 42896 -21859 -66432
31054 -66432 -43511 -330 -37442 -72392 -66640 -70411 -73939 -45930 49022 73365 71405 58458
31042 58458 39779 99469 117763 113163 103943 95921 30485 23152 51266 114033 110613 79981 64799
31029 64799 32211 10442 -10137 -42698 -34998 38421 67059 19737 -6646 -22436 -41316 -80014
31017 -80014 -67064 5082 -10818 -33473 -12051 12675 35751 30071 -24406 -84411 -69200 -38028
31005 -38028 -70092 -48882 -30228 -16457 43064 6026 -10289 20352 52496 68805 16004 -33401
30993 -33401 -29522 16343 41009 21530 24957 11731 20470 82981 77628 89098 117442 110051 62153
30980 62153 74392 92553 29443 -3092 56793 29005 -65331 -55511 27932 72268 23185 -21499
30968 -21499 4872 32959 76222 142320 101980 45385 16206 -25872 -39187 -41497 7998 25726
30956 25726 10654 -25648 -85000 -109523 -33269 31541 -16476 -20747 -41041 18467 42460 30525
30944 30525 6541 -33649 -11977 -24452 7747 33279 49075 54896 69473 23928 -30780 -11872
30932 -11872 -65567 -137645 -139183 -131873 -90744 -34125 -33653 -69076 -127192 -89414 -104804 -29437
30920 -29437 87404 69780 49654 66754 -477 -18407 29250 41876 75129 93811 99761 71279
30908 71279 51900 56579 6868 -60068 -72157 -7668 2408 29965 23482 30339 87058 86596 58801
30895 58801 74195 57848 13740 -85079 -133253 -79582 -53800 -41632 -38722 -21185 44286 39414
30883 39414 -770 -9125 78612 123521 186566 152907 69929 5017 -4571 42064 94236 28268
30871 28268 -772 -38383 -42999 -63943 -66612 -37673 -62396 -128700 -148649 -106362 -101751 -50967
30859 -50967 4577 29971 -12972 1076 -10403 -51516 -71496 -125517 -133205 -100276 -24529 29479
30847 29479 77622 70708 53259 55887 58937 42152 42307 18455 -7558 -6474 30875 39700 7006
30834 7006 -83519 -72758 -40991 31274 105455 97593 87889 78785 37288 3728 54385 3759
30822 3759 -34606 -84239 -139258 -80825 -622 8017 -12339 38610 52765 46539 -34703 -47337
30810 -47337 -59362 -29763 -33450 339 -15461 -23673 -29847 -35048 -30705 -71840 -137608 -134880 -76284
30797 -76284 -36461 -3609 -7444 -27949 8047 31834 11757 -42332 -91914 -86872 -79262 -35755
30785 -35755 -76569 -122461 -78567 -37507 5112 27379 22184 36553 70794 80523 53797 27706
30773 27706 39877 30092 47660 393 -132 -26165 -45912 -61956 -37655 -2225 -18420 2712
30761 2712 21090 3954 -28157 15181 39988 -23613 -40279 -65397 -29813 -12956 -16496 -13425
30749 -13425 -8668 -48483 -50014 -10698 -44231 -37664 -48585 -63145 23825 59224 9220 12731
30737 12731 34795 27408 58332 -4459 -20852 -5146 -15940 9160 -80586 -76158 -46160 -94964
30725 -94964 -48265 40547 46532 2334 -36442 19604 47151 -2505 -41657 -110444 -115298 -112869
30713 -112869 -93892 -115103 -140063 -113342 -58280 -3729 41753 6457 8212 -44574 -87692 -78210
30701 -78210 -66423 17873 52927 24177 -21640 3330 21360 -22026 -47883 -56044 -54820 -22155
30689 -22155 56853 42429 3764 11648 33439 -7476 -20757 -109231 -99601 -32014 -11023 -62576
30677 -62576 -64439 -45121 -97410 -30046 -2940 159 28622 24051 -2768 -9637 16685 18141 5897
30664 5897 -132 4164 1091 7731 -43225 -38668 -29393 -35660 -19657 -18920 -40365 -42052 -34258 -61002
30650 -61002 -99502 -122983 -64533 46239 77799 92942 77234 -11017 -3453 54204 35735 74377
30638 74377 62053 95377 102343 101817 102523 73615 52993 63035 59466 26922 14867 52433 46939
30625 46939 69303 105362 92920 52361 34609 36483 17748 64329 86635 70446 49634 70104
30613 70104 89522 42478 16157 34894 37270 24513 55040 105060 49739 8138 29422 51362
30601 51362 9292 -109377 -112753 -64743 -76642 -99785 -67437 3842 14120 -38019 25500 39627
30589 39627 35985 9260 -28197 2929 2360 -81112 -111557 -50538 12225 -19246 -56196 -62313
30577 -62313 21411 29987 -12735 -57608 -40191 -48752 -114 27078 21877 -2750 -67985 -113816
30565 -113816 -83456 -76414 -83873 -87022 -127265 -126864 -50530 -4632 -4165 -46771 -39284 20037 4421
30552 4421 39421 66251 28927 18221 2402 -5515 -35511 -35563 -37721 -88924 -123090 -91144 -29746
30539 -29746 -39809 -30813 -61752 -13911 19288 16310 5296 22733 13851 -49234 -49496 -35640 23967
30526 23967 38471 44752 14610 17128 17458 27717 2422 -49707 -46214 17128 40138 57556 68207
30513 68207 94067 98368 49661 60688 78116 89908 55644 28901 35562 13347 -13597 25071
30501 25071 41762 35458 29677 6160 -49953 -114763 -136307 -84521 -78225 -74003 -100387 -99346 -49462
30488 -49462 70126 86646 96581 87824 31965 58191 36735 7479 -17209 -29421 -27337 -51302
30476 -51302 -75587 -20893 47536 8189 15520 40807 45992 54330 93020 93231 98994 29161 -22858
30463 -22858 -20373 55573 47903 23981 61892 97322 120694 55639 -11353 43469 22523 -51412
30451 -51412 -13520 21528 25196 30811 72449 59038 3915 -1849 3343 27948 58851 117381
30439 117381 114019 83180 78480 483 -37089 -40853 -49349 -6764 10995 -40698 -36802 -10201
30427 -10201 80048 53688 -25402 -17694 61274 114682 111317 95525 55285 65900 91183 33577
30415 33577 -12439 29241 74353 42671 14947 58497 56198 10465 -56205 -67981 -39692 -35566
30403 -35566 -62051 -35544 -25225 -7872 -54865 -73232 -14845 47468 78939 33394 3624 14487
30391 14487 50056 56077 78073 91702 87254 115815 59975 48654 23325 6830 18365 43193
30379 43193 4588 37776 15771 -33149 -14093 -6302 10791 -820 -15880 -20560 27569 27959
30367 27959 8890 5303 29586 2279 -17235 20261 -52901 -17125 51930 70539 -3717 2302
30355 2302 48958 28319 -26435 -16566 14044 590 -19920 -21627 18480 7384 -8351 -23581
30343 -23581 -49213 -18674 30097 46152 -19911 -24587 -10390 -54372 -97939 -93275 -64117 -23940
30331 -23940 -12626 -27883 -47720 -45999 -71354 -80791 -99535 -75193 510 -48769 -90955 -74818
30319 -74818 -58784 -36328 -50705 -34604 22135 53103 -13842 11300 52548 50675 31157 10722
30307 10722 53556 76747 56673 32489 -76552 -57259 -24614 -70652 -73865 -41773 -37539 -86673
30295 -86673 -131234 -127092 -65559 -24676 -50351 -18094 -46608 -96856 -136993 -128336 -44958 44992
30283 44992 23012 -46670 -24156 1345 21896 56529 85643 139174 148496 114611 78282 39189
30271 39189 13215 110632 113923 69114 80572 78323 40544 44853 93557 120226 103065 76701
30259 76701 42282 -9954 -12532 -56751 -84490 -26622 -4442 -68248 -16680 41777 119050 135484
30247 135484 -294 -38185 -68047 -128211 -156956 -111369 -75773 -133590 -132077 -79193 -49949
30236 -49949 -70961 -70753 2395 -20574 -63440 -42500 -15536 21509 59279 34603 -12202 -33717
30224 -33717 19610 47239 6212 -22371 -26718 55381 83608 42075 -19640 -100454 -138449 -113438
30212 -113438 -56090 17380 64609 72723 52784 75749 103646 98362 102416 70483 15350 -55865
30200 -55865 -20299 31136 18744 3555 77575 123599 110144 40945 -38939 -62282 -56099 -39884
30188 -39884 -6238 -21785 15352 25774 -32210 -73185 -30205 -19310 -20507 -6211 8933 -45253
30176 -45253 -69332 -31064 -30874 -60550 7100 52395 24042 54926 49773 -21267 -66136 -48101
30164 -48101 4899 -1576 -18759 14513 6485 854 8313 -8593 -38493 -69941 -50419 -18629
30152 -18629 23802 20564 -1851 69019 121726 66630 6018 -12856 -6935 -54958 -122829 -136126
30140 -136126 -49521 -3114 -12940 -40349 -10714 -42691 -24135 -13722 -5865 17592 49079 46901
30128 46901 61994 37787 -40814 -99304 -80901 -48086 -73979 -91134 -10099 -23312 -67412 -25826
30116 -25826 165 -41847 -72969 -7885 40530 75848 59276 -9917 -71991 -29653 6266 18842
30104 18842 12724 -31153 -64869 -75558 -47256 -40970 -11315 72252 45274 -9688 -20334 25491
30092 25491 34716 -34328 -25137 58779 77741 74886 18630 330 9111 55572 45927 41660 12670
30079 12670 8597 -14171 -5881 -378 -31906 -22296 -19304 -1781 14022 30816 79914 82334 47307
30066 47307 -37132 -24526 -9852 -38613 18793 23092 30290 55816 69814 27632 8210 -41475
30054 -41475 -84866 -39887 -36089 -59323 -44374 -66766 -42566 -6215 30330 63683 33649 -37954
30042 -37954 -85798 -152517 -134207 -74008 -32075 27225 -23863 -23562 -17132 23188 -9032 -49341
30030 -49341 -33281 22900 2276 35474 53616 57210 13005 -27140 -4382 27006 13090 4675
30018 4675 -9349 799 -12051 -54454 -56667 -48830 -45825 -42185 15691 38141 83020 48218 -37581
30005 -37581 -59207 -85019 -102777 -73075 -1623 19197 7465 53628 84747 66678 51130 38283
29993 38283 75814 116280 95420 35398 5511 -9031 -7118 -23612 -53158 -42769 -1289 23993
29981 23993 51964 72825 12948 -7500 -23254 -52192 -27534 -1662 24235 17575 24641 30191
29969 30191 -6874 -22821 38842 48277 44258 -520 1668 -55530 -77029 -45298 -2663 18469
29957 18469 21457 -20518 -125546 -126154 -83578 -75244 -45228 11923 1833 -30430 69708 85786
29945 85786 -8145 -30685 -5558 -60916 -85195 -43283 -40216 -57348 16116 11787 24022 15250
29933 15250 -22550 -31541 4457 21912 33110 111124 70275 60071 81510 33381 4495 32333
29921 32333 58779 112223 131267 82722 66516 13539 -14480 -56005 -29314 -4634 -43729 -124968
29909 -124968 -143807 -66284 -47996 4096 44328 10965 14546 72880 99470 86711 43272 6894
29897 6894 -32740 -27052 -9061 31086 71852 61698 22372 8988 53779 110369 151829 86190
29885 86190 65117 106853 64557 21423 11098 -49179 -46874 -19853 21183 24627 26313 51014
29873 51014 27716 -23984 -28756 -29288 -81621 -71034 -19108 -27757 -49317 -34797 -51964 -23061
29861 -23061 13994 27145 5711 -16849 -24621 -43670 -79517 -96738 -67770 -43577 -66567 -68445
29849 -68445 -87901 -122866 -108587 -43951 -81723 -16560 64301 51715 9309 32631 -28044 -26793
29837 -26793 -17417 -4806 -26100 -64644 -81723 -38731 24917 20899 8461 -33727 -29529 -55888
29825 -55888 -95707 -48817 5004 63097 119169 131699 138083 97167 22539 -63663 -37213 -39459
29813 -39459 -37036 -13895 2704 8567 -11107 -24907 29504 89825 89741 48089 28103 32013 48238
29800 48238 29612 13187 -39815 -61717 -112122 -75432 8456 3757 -48818 -78532 -32843 -25599
29788 -25599 -29136 17691 16784 -29084 -36063 -7006 -1122 14061 -38822 -77598 -89311 -46466 -29829
29775 -29829 39396 43974 -69736 -82425 -74293 -26254 -34142 -36638 -14754 34827 97850 73769
29763 73769 29452 -78341 -88693 -44039 31494 22702 14675 45179 72280 83396 40887 58002
29751 58002 133004 156320 164920 145111 106911 31925 -14543 -7537 -19501 -34497 -30315 -32332
29739 -32332 -19157 -35509 -13874 -31702 -40259 -29299 25476 43250 21984 -25916 -48004 -15474
29727 -15474 24761 23378 61715 55966 4611 -4812 -25168 -57933 -32692 -2052 -14217 -29175
29715 -29175 26250 38315 -20740 -22818 9645 48997 87410 91171 90377 41746 29427 15235
29703 15235 25975 63671 33501 42231 53981 42276 50238 108365 90560 66460 57992 47084
29691 47084 38177 10937 -7603 -9610 -1724 33953 50245 55187 38602 22576 405 45425
29679 45425 76337 83246 104908 67335 42834 31132 35960 -2887 -73440 -57120 -53541 -55091
29667 -55091 -6047 10491 797 -31094 2214 5783 -27900 -56828 -21522 -7183 17375 20041
29655 20041 39210 84696 85333 -513 -38549 -82655 -69616 -18262 -6635 8155 55579 96409
29643 96409 40131 -22407 -35332 -74719 -30273 -708 40867 25848 27299 70333 29063 11096
29631 11096 23887 -20320 -62921 -77061 -107489 -133010 -95160 5083 27680 -261 10359
29620 10359 27690 15270 -6763 53021 124750 84110 25861 5347 -25545 -39955 -65229 -53083
29608 -53083 -64853 -121552 -95556 -44147 -24671 -13352 -36975 -20399 -36755 -13333 -18526 -35244
29596 -35244 -17893 28533 31883 -12398 -80753 -96260 -49932 -59527 -91833 -20343 6881 15352
29584 15352 -6487 -11812 27329 59635 52660 60110 68939 65101 47267 27330 -12703 -85832 -90416
29571 -90416 -88561 -50900 -72481 -84287 -47444 -37943 -71433 -18105 190 -28973 -59559 -75745
29559 -75745 -71201 -37271 -50604 -44147 36602 6231 -33497 7466 -12593 -26342 -2894 -58306
29547 -58306 -76114 -85203 -52928 54734 82275 74141 14342 -1090 25774 15186 46723 8143
29535 8143 -44568 -89495 -55910 -41918 -21298 -61905 -72699 -73971 -33707 28905 34499 27775
29523 27775 -2232 -14374 -13166 -6433 -1821 45578 50277 45551 -21831 -23101 -5348 -92448 -70471
29510 -70471 19187 41822 91718 107676 54708 19357 -11546 -13654 -60652 -72737 -74253 -52175
29498 -52175 -35560 -65768 -48179 33797 136352 180777 135950 43266 -16623 -3497 80949
29487 80949 108179 61065 92543 47137 -16871 35870 118016 116725 87712 9499 8284 30704
29475 30704 33127 -10239 74445 100275 74857 44793 -19439 -62986 -10938 55879 95421 51833
29463 51833 20704 42715 32995 -4329 -30803 3184 42577 66625 81399 78518 44283 -39763
29451 -39763 13019 -673 -76854 -79590 -37454 -18308 -50761 -68296 -125646 -134020 -40822 -49701
29439 -49701 -8912 3511 -80143 -107774 -85908 -60290 -23233 -3419 701 24847 58514 75630
29427 75630 -16284 -23002 -59469 -43289 23119 40829 111230 108813 33992 -22386 -16686 5440
29415 5440 19008 -24107 -3325 -24387 28379 39025 35642 -59440 -3054 -18344 -19418 11450
29403 11450 13510 -39023 -45333 -13645 -63800 -36573 5730 22986 73147 58071 4741 39553
29391 39553 36661 -58661 -37238 -9834 -26061 -7544 -959 14937 -6572 -41991 -16982 -28868
29379 -28868 -36448 -47854 -37547 -42841 -62559 -24723 2606 70991 35372 -35323 -45373 24999
29367 24999 64025 64214 -9709 20648 -10186 -27242 -38752 -18176 9135 68267 86854 37586
29355 37586 -37973 -28403 -13945 -68984 -61383 -27117 32013 85830 97172 59554 -4058 -8356
29343 -8356 -10349 -21040 -49048 -51598 3318 38538 22025 11140 1833 -39543 -60044 -34420
29331 -34420 -16288 -12973 18355 49666 30741 18351 -19590 -79088 -65379 -31214 -38545 8809
29319 8809 95688 95428 40183 -6 33835 43861 17552 34884 19777 -16755 9678 49737
29307 49737 29899 35532 36009 55210 45842 -15086 -64624 -103044 -81150 -42368 -29871 21749
29295 21749 19683 25525 20044 41069 48062 105810 98860 25924 -13556 -81247 -12016 66737 82800
29282 82800 36040 13575 -3740 -14287 -17174 -7921 397 49574 -42298 -55256 -473 2335
29270 2335 10144 -46902 -46693 -8140 4469 14495 45069 16738 -46 -24232 -10128 -31503
29258 -31503 -89569 -140087 -73320 3580 -58900 -60304 -62205 -44384 276 18194 -18552 -4214
29246 -4214 -32827 -27768 -20717 28495 20076 19481 48691 52760 45001 18195 7907 29864 31403
29233 31403 44259 49426 -9233 21305 -726 -17914 -30567 -32077 -32468 19305 46173 62906
29221 62906 73721 57256 49838 60225 37995 13449 -37022 -60908 -29400 -30162 19451 108872
29209 108872 103104 63111 58404 75792 43409 10756 27820 44275 17396 13365 48039 45282
29197 45282 97213 88875 31864 34180 62485 63984 56060 12777 14181 53848 47278 -14870 -74045
29184 -74045 4445 4601 -22439 -12698 -22475 -55733 -87045 -45906 -59109 -46523 16298 28894
29172 28894 24284 34272 -22170 -56455 -20363 -8822 145 27938 55440 64876 50060 6506
29160 6506 -56357 -66502 -815 -10968 -44795 -2424 17110 54796 43228 36430 -10801 -31847
29148 -31847 -28128 -4455 -34166 -60739 -59745 -6052 -53755 -39588 -2030 -75470 -126869 -129861
29136 -129861 -127222 -81191 -31267 24575 26334 -11045 -63953 -56074 -104216 -95520 -15113 91420
29124 91420 131815 100052 79043 40018 -50148 -37446 -3045 -18859 4686 23813 -60449 -101402
29112 -101402 -126127 -82289 -47483 -48847 -1520 -3852 23060 48059 91739 6783 -28041 -56698
29100 -56698 -104069 -78250 -41071 -31969 -15246 9850 17919 45610 3724 -39954 -1024 12959
29088 12959 4102 32436 29743 25997 -45928 -111057 -53299 -45865 -79097 -29035 19552 -35666
29076 -35666 -8661 19480 -28326 -99762 -70227 3796 12539 30365 -24116 -72502 -60263 -25875
29064 -25875 -6211 23944 51793 71559 49512 18321 52588 51609 9129 -35741 -29825 221
29052 221 -12631 80166 119097 94307 59153 53580 52589 4860 97564 154511 163195 132934 92525
29039 92525 80430 130695 164708 139798 119806 81139 75584 18518 2313 100861 118916 49302
29027 49302 -24192 -78277 -45366 -45650 -75938 -51048 -54191 -73285 9247 95764 105540 -2375
29015 -2375 -94290 -34128 59600 111931 125204 122898 57830 5422 12927 55981 46443 48417 -1808
29002 -1808 -6968 -5222 32438 50712 18270 17423 17814 30158 91444 28833 -19458 -48862 -18957
28989 -18957 -26441 -30569 -10411 -36797 -10844 -4851 25302 38160 44501 64501 101475 161841
28977 161841 116910 107294 122729 124009 86953 46264 16314 50145 21823 -31158 -43908 -62507
28965 -62507 -46158 -14968 -57013 -108182 -97209 -63821 -22618 29086 79597 66470 30572 38042
28953 38042 78168 45757 -1554 -13065 2061 34515 40250 127421 132031 63471 22543 6236
28941 6236 -37297 -80979 -87459 -79856 -33714 -75128 -78013 198 6695 27437 91747 85570 99776
28928 99776 50013 39879 68436 83468 62636 -37278 -67071 -37842 -25298 -2804 51927 41653
28916 41653 -31485 -45090 -55299 -37147 -14831 28127 31940 -29184 -12186 -10942 -39642 -22039
28904 -22039 -17218 -99190 -82902 -16614 40698 73999 72577 122737 121424 61414 69350 54487
28892 54487 64159 89076 87777 84007 10367 -42150 -28652 -4346 44391 71440 45107 49529
28880 49529 36237 51421 46680 23771 36493 22299 40780 60054 86737 90906 24396 1191
28868 1191 -27140 -57955 -43330 -44983 -65531 -81192 -96102 -122245 -52850 40272 34084 51042
28856 51042 47437 23340 86039 114931 78394 18061 -7192 -27242 -43142 -21112 -32932 -47549
28844 -47549 -57240 -26594 41514 66158 61932 35713 57071 57106 59564 49064 48450 105061 89330
28831 89330 2080 -2415 -8414 13994 61797 86134 86977 83348 22789 29049 126 31501 36011
28818 36011 45915 31053 48402 102535 167469 113985 -232 -32830 -58083 -13178 48992 38118
28806 38118 -39153 -37373 -213 11335 -25403 10452 10485 31273 14650 -15080 -48835 -33139
28794 -33139 49661 52208 14779 7777 8872 76191 122000 44087 34119 80319 41911 12056
28782 12056 15960 75810 99357 101378 111322 36638 33845 64636 90441 126511 117509 116134 108236
28769 108236 81879 63019 45638 16287 40252 35805 50360 53209 31786 -4163 -1040 7112
28757 7112 33526 56308 64733 77436 102734 112662 67375 77981 73761 68373 49417 56681 56529
28744 56529 42325 68311 55404 66846 51101 32161 -23466 -18539 -22653 -22094 -67763 -79418
28732 -79418 -61778 -37662 -14292 -16618 38995 51005 48418 14531 -68181 -110409 -134605 -63336
28720 -63336 -28484 6633 -46413 -87337 -43726 -93800 -95335 -103858 -95527 -74089 -44597 -24378
28708 -24378 22943 12273 20692 -8332 -56947 -68530 -66814 21168 68119 41068 63993 52324
28696 52324 60246 126806 133653 105969 132515 69676 75095 86502 77043 79528 34744 3233 -28604
28683 -28604 -98702 -117140 -75719 -19034 -31981 -8838 26836 88266 100138 71376 22250 -10391
28671 -10391 -27477 -16786 7479 1679 -1087 51845 46659 -25880 -34812 -55574 -87597 -105729
28659 -105729 -86784 -52541 -58549 -76012 19487 66069 42650 44097 63027 22908 -52569 -100973
28647 -100973 -118951 -114965 -124680 -71198 -24483 -43353 -68836 -73443 -46293 -42782 49483 69291
28635 69291 4441 -8727 -10557 46725 4570 -69412 -45640 -5798 39330 76518 50283 35034
28623 35034 -20251 -77091 -15780 15582 17524 -13342 -54409 -19910 22156 -3314 -18321 -41655
28611 -41655 -14466 67084 142863 86758 63431 28994 16930 14855 9812 33796 7795 -7991
28599 -7991 11953 27897 82901 69915 63709 33388 27807 40871 23218 12496 11296 -11519
28587 -11519 -44690 -17504 48903 -22345 -10217 912 16829 24734 39245 88818 69417 28199
28575 28199 61537 15684 19473 65919 87517 109668 94639 78571 73855 143594 193434 140936
28563 140936 113279 93877 103107 142973 94809 52116 -4615 -24597 -30466 -10803 -21684 -49475
28551 -49475 -68073 -90508 -81313 -32985 -17433 45282 94540 22068 -42170 -88296 -51567 20710
28539 20710 80838 59385 58617 86319 49390 -6273 22046 -39453 -28946 42977 64487 40784
28527 40784 64473 60608 16784 33096 36558 4259 2351 25553 28273 1860 -35501 -39
28515 -39 21966 6116 -7643 -32008 -38267 -89970 -84001 -35387 24024 16184 -19746 -18893 15929
28502 15929 52305 62467 9160 -847 -8501 -16263 -15984 -17955 -41803 -35299 19374 1575 -51167
28489 -51167 24029 28171 -53897 -95813 -98581 -105668 -78835 -101035 -103051 -94431 -75905 -44551 -62710
28476 -62710 -13458 48918 81314 -12696 -74188 -42603 -2864 62851 43069 -11569 27119 69344
28464 69344 62460 59429 9834 -55443 -78539 -111791 -123217 -96580 -40517 36903 15230 -4756
28452 -4756 -17357 22703 52951 54724 19567 40726 7953 -13818 29884 22614 47155 44766
28440 44766 -26665 -5468 -29974 -15176 9862 -12524 -8069 32348 46207 81364 93161 13464
28428 13464 11866 11540 18307 28907 -1012 -16133 -42106 -56166 -63897 -30943 -20250 13429 -1575
28415 -1575 -11770 -8451 -60312 -32745 -4872 28089 842 -72422 -83789 -30165 -53333 -72624
28403 -72624 -104209 -82062 -44502 -38319 -28638 -3330 -16017 39813 36670 30239 90071 89142 57506
28390 57506 55150 61066 92734 82420 50144 48910 21410 -75274 -79923 -60931 -137275 -190373
28378 -190373 -165855 -124721 -113877 -44699 -37145 -56028 -10722 25003 75806 58609 16184 30747
28366 30747 64556 95442 100722 59671 36553 14787 68173 84546 71839 51704 -1043 30884
28354 30884 32668 61882 -403 -41356 -24046 19048 31182 36475 83465 96382 32453 44942
28342 44942 69803 89022 127861 115708 31121 34206 57320 44024 -6812 -15590 -10135 1331
28330 1331 -7036 -3663 -29461 -68977 -88484 -1936 37579 35815 19402 33871 42519 37033 29227
28317 29227 22078 17821 2719 -16735 -19267 -25895 -1122 11875 31105 63324 54313 32619 48997
28304 48997 79387 117123 82725 49950 57063 54434 14448 54781 42010 89185 125609 48188
28292 48188 -7744 -4135 1295 40840 14713 -10384 -3313 -38227 -61589 -42748 -8679 27595
28280 27595 19868 -2632 -4409 31978 40054 44023 38752 54234 20928 8921 746 -41295 -90997
28267 -90997 -23279 36029 38360 111796 139188 150020 132093 152882 85251 29783 28604 -18904
28255 -18904 -20223 -23283 -49097 -41888 -17382 -33943 -41498 46980 24778 -40427 -13902 -5649 -27494
28242 -27494 -90225 -91784 16770 9054 -4662 -21066 31876 63822 42105 96290 104222 -56549
28230 -56549 -149098 -106096 -84331 -39774 -33576 12242 19591 -39151 -123359 -110147 -54054 -28163
28218 -28163 8970 24940 55054 61815 33171 39455 53488 46899 73894 75504 79535 58125 41003
28205 41003 22570 4218 -1339 -13583 -40077 -128957 -113018 -50507 -20591 5244 -15546 -9262
28193 -9262 41238 70968 76611 35108 48235 19916 -35245 -63402 -31677 -30581 -46536 -50927
28181 -50927 -61636 -67939 -64640 -15570 -884 -6750 -24039 -22813 -84006 -90582 -11574 9571 -10610
28168 -10610 608 -2530 1110 -2932 -8863 -18319 -6589 2973 38558 78780 78063 44605 41198
28155 41198 -30471 -28437 -33651 -80345 -122921 -87320 9477 57439 57808 78057 60067 16634
28143 16634 15746 2449 18441 49477 76068 79994 79287 35049 69745 121880 33502 -63173 -47598
28130 -47598 -19365 -2325 19473 39701 56666 67687 4291 34071 51646 35020 73939 77148
28118 77148 35464 24528 51293 104213 95637 12563 15257 44692 13148 24592 22866 37231
28106 37231 94484 121942 141851 133033 120047 87984 14382 -40876 -29513 -19629 53368 107848
28094 107848 67873 257 -16448 -15287 32737 27729 -18842 -8121 33018 -14741 -68253 -53480
28082 -53480 -12890 -22450 24593 69983 91648 59910 18156 -11648 -88492 -45235 21067 59208
28070 59208 88231 39557 -971 61351 70299 66034 94409 133829 170683 165752 147012 118622
28058 118622 65464 5106 -20854 -22153 -18158 37447 81820 26596 22761 37037 3261 -25816
28046 -25816 -27933 46800 71754 83657 82721 96209 67703 31314 -688 9471 -5618 -52469
28034 -52469 -4782 -54028 -42925 8052 -2320 -14747 37019 83033 71791 7924 -4098 5431
28022 5431 -50747 -71625 -21637 34493 84717 81364 18524 -64563 -60823 -29697 -32660 11770
28010 11770 -8922 -48002 24525 30785 17442 8656 -31544 -18247 -45940 -47423 -30119 48201
27998 48201 119830 93035 -8892 31685 35226 30727 -28712 -87599 -78748 -111598 -122572 -138277
27986 -138277 -133107 -105693 -96375 -58261 -49557 -35189 -2637 33160 52883 5940 -50565 -86458
27974 -86458 -113210 -120868 -48585 -29896 -59026 -45900 -26875 1843 -33460 -41101 7019 71699
27962 71699 59870 68656 104783 75661 64914 121906 64646 3626 -4687 81319 66412 34808
27950 34808 87916 107028 59762 24522 12044 116567 142461 136074 41678 -19242 28195 88028
27938 88028 76897 70098 36135 3509 -10282 26224 13608 28569 3648 -38339 -63774 -58796
27926 -58796 -74436 -51891 -2879 -217 11891 -1873 2122 -15224 -1792 1057 -14287 -1723
27914 -1723 52428 62201 70134 91850 75006 34608 58807 91992 59948 39291 42239 67405
27902 67405 58730 956 6753 17826 60372 45188 30895 53756 94097 113729 124480 78418
27890 78418 23110 -15438 11045 20318 -39826 -110223 -96154 8735 102254 45537 -6117 34265
27878 34265 94154 71758 51732 97841 115323 37920 22978 60540 82684 83886 23869 -7936
27866 -7936 24247 66681 54533 40475 -17063 -14879 -26805 -52906 -12124 -43984 -77832 -31812
27854 -31812 11442 253 -59462 -105987 -51212 -20149 16429 83718 112776 48293 41426 -11457
27842 -11457 -11975 30283 -24019 -84980 -99670 -100015 -81280 -68043 -47160 -32190 -6155 26608
27830 26608 74210 57301 6548 -13501 -14603 -5029 -47782 -81491 -52467 2929 46521 43100
27818 43100 44338 74575 1452 -9535 22054 90320 99749 56513 -3460 21362 25038 -37285
27806 -37285 -88400 -61910 -104105 -92244 -61819 -39697 -25211 -60873 -68869 25540 55702 69559
27794 69559 -16993 -85592 -53240 -53529 -50334 -76382 -78606 -30749 49866 43775 6332 -5208 -18485
27781 -18485 -18249 -32610 17052 5367 -76640 -102473 -69413 16060 49868 -4353 -50806 10427
27769 10427 35076 55610 69943 42201 -13655 3834 37581 20527 21369 28519 47335 5402
27757 5402 -119 28190 18156 -33298 -47411 67001 88014 36493 33483 75978 47648 45150
27745 45150 70455 35183 -1408 -460 23669 43519 41734 20251 8982 15265 17023 21744 -37257
27732 -37257 -20883 -33021 37185 29652 24318 28247 39792 65669 94334 92704 64838 17248
27720 17248 2455 -4429 -5099 4348 13664 33827 -5149 -10099 63033 73552 92901 124003 198931
27707 198931 181147 173805 122659 117210 129989 40311 16716 28759 -52267 -20622 -48838 -59614
27695 -59614 -58793 -98439 -67612 -31893 -62554 -81152 -1408 4030 -85522 -120689 -86567 -62555
27683 -62555 -17710 41461 39344 117090 102430 36965 30015 44652 65293 53128 97958 110532
27671 110532 50633 -26271 -12787 12063 -28919 -27316 -76166 -93960 -66818 -10996 34559 54694
27659 54694 14933 -11956 18115 42719 35352 39505 58217 82971 97969 65376 40581 39716
27647 39716 38845 12659 -40557 -74931 -34254 45535 151008 139491 163222 143132 124622 98797
27635 98797 14484 -31191 15641 29871 10893 5089 -28702 -55480 -22006 -27782 17482 56078
27623 56078 53545 82382 115530 105255 8349 -10534 -46777 -37018 20601 59729 59025 75809
27611 75809 32478 -36514 28779 24228 -25551 -47868 -2063 15067 -10221 -13547 -1331 -6018
27599 -6018 -39769 -56823 -71450 -70036 -43668 -9872 -10373 19276 8761 20416 9302 483 61035
27586 61035 152690 155410 67398 63250 19926 -33325 6457 30195 53894 -22953 -7896 -1778
27574 -1778 -7657 86712 155825 130407 86070 77538 30601 7748 -19049 -17781 -24191 -42470 -71761
27561 -71761 -27281 -32757 -53131 -43551 24909 79450 82563 -1753 -43311 -20510 53106 91119
27549 91119 114142 97332 45131 -19032 -25709 -20054 -24601 -45794 -22094 21846 -2582 -84581
27537 -84581 -114605 -47347 -49203 -57602 -7362 4567 -2 -40508 -80332 -42707 -28438 -60154
27525 -60154 1329 50739 8982 -15476 -62814 -87945 -65996 -43785 6348 32158 -11282 -50639
27513 -50639 -42493 -57474 -29282 -15280 -56961 20923 84582 38662 24889 31286 -20362 55618
27501 55618 74529 24737 2205 -60750 -93685 -38984 -5190 -3877 1557 14658 -40352 -83361
27489 -83361 -58488 -40022 -68142 3418 74966 126264 84939 83926 102824 99763 115708 140029
27477 140029 130691 62311 -27167 -54750 -33167 4486 14052 22206 66950 109174 89303 68954
27465 68954 69149 37423 -35262 -58973 -9259 28131 67333 18448 -3398 21683 14170 7607
27453 7607 -3572 -25078 -11342 721 -20511 4160 -12851 -31265 -4291 -2772 55452 56782
27441 56782 75063 44824 16303 37652 42268 4146 4061 32032 31800 -25967 28666 103889 99848
27428 99848 50064 13325 -10692 17008 79190 98051 48933 9720 1256 -2675 19836 36115
27416 36115 62361 48744 12366 -14609 7791 -25109 -86284 -83883 -40263 18324 6076 33853
27404 33853 17700 -31174 -14724 23527 38517 114793 80168 58830 86987 52365 78502 85456
27392 85456 46826 27053 30683 23750 -59771 -51051 -13448 -17387 -4902 -22776 6368 27148
27380 27148 58525 75509 73120 54156 6214 19316 21197 47342 46532 85722 61917 58690 68868
27367 68868 29578 52011 127816 92802 47087 37938 -2321 -50948 -27411 -2276 33017 66221
27355 66221 60218 86030 105985 102830 37194 -73072 -94884 -82936 -41649 1900 -17081 -33936
27343 -33936 34031 45191 7557 -8333 26607 68175 55728 83585 96496 94746 38968 79
27331 79 -31314 -39145 -37762 -38609 -46237 -30469 -2884 70506 74408 -56719 -107784 -23135 -50928
27318 -50928 -60176 -60688 -27589 -28347 -7991 82328 115416 84268 92083 98173 129846 104441 88721
27305 88721 43700 23955 34827 25980 48012 56071 37760 1947 -4561 11052 41766 32994
27293 32994 50015 30032 52749 50459 32272 -13090 -95778 -74113 -73885 -75506 -64326 -12174
27281 -12174 9990 5864 10507 -17896 -42272 -27623 48027 44907 47174 3405 -3036 43645 49580
27268 49580 -12734 -18717 -31854 -22398 41284 61511 24490 883 -44930 -42552 -73147 -82632
27256 -82632 -53482 -69882 -65067 -32926 6829 13232 20031 -11050 18427 40034 89565 116890
27244 116890 96680 -834 16746 32133 7586 79980 101506 79984 92964 79462 4581
27233 4581 -27629 -3940 17782 19599 41505 57671 16718 28375 47857 27347 5632 14851
27221 14851 24386 26810 18497 53475 -4481 -5104 2165 9652 5060 28287 31167 7452 18822
27208 18822 36650 55145 45000 -24084 -45969 -10631 -10139 -35255 -50917 -81171 -76503 -48016
27196 -48016 -48948 -69894 -92381 -35373 -23028 23106 42603 97828 12625 -50250 -116221 -97826
27184 -97826 -20514 41336 54650 52508 42646 36556 11224 -4861 10113 -20717 -50985 -73181
27172 -73181 -80895 -45474 10904 -2682 -20224 35266 71818 64485 -322 31941 3159 12060
27160 12060 1967 9522 49758 30255 19474 -41046 -62654 -57102 -27650 -18630 -56414 -21017
27148 -21017 -9412 -28956 -57795 -55798 -82876 -31937 25261 53634 55594 40970 -4793 -23043
27136 -23043 -35138 -13607 -28691 -48852 -53408 -76589 -35447 -25771 -22261 -9124 -61986 -99603
27124 -99603 -72757 -29655 -10076 -16882 -1013 10741 -31224 -32872 16184 -52146 -96877 -64281
27112 -64281 -34312 -73101 -76756 -82264 -151881 -171893 -145126 -129555 -87105 -80074 -147938 -131446
27100 -131446 -87314 -90833 -83306 -39176 -13067 -14312 -44198 -34648 -20144 7041 5548 -15665
27088 -15665 -30555 25718 -17085 27904 13847 4462 -3563 -95013 -139967 -186827 -149297 -71247
27076 -71247 -36330 -28978 -35497 -4114 33066 -49865 -129645 -105825 -129232 -107554 -49055 17406
27064 17406 -13381 -51598 -44939 -103542 -97681 -43281 -9515 -39157 -56633 -55661 -42336 -42866 19556
27051 19556 76200 80240 80796 87709 88723 56443 63796 24234 36378 25301 61818 36825 -24169
27038 -24169 -33176 -41967 -83394 -46255 -44182 3939 51512 75143 61929 30907 -19129 30952
27026 30952 64051 37802 5492 -13724 7679 2144 -30847 -35585 2383 29420 42006 33584
27014 33584 85164 114818 59573 36751 28111 37745 17857 32981 19319 29761 76710 55284
27002 55284 18892 32737 3362 1422 18207 39225 25721 5870 35610 28766 58179 63408
26990 63408 64049 194 -75430 -93256 -31329 25064 21767 -8339 -20418 -73774 -93581 -26352
26978 -26352 49603 91548 119771 99940 117285 154849 137503 140297 103142 2836 -51232 -83601
26966 -83601 -83556 -12152 82274 139132 128295 60701 48137 20406 -18671 8600 6179 16339
26954 16339 22008 15477 -9119 8203 -18126 -1728 14685 -26990 -68235 -23577 -35149 -35033
26942 -35033 35037 26636 -78703 -79090 -4929 100522 147413 147470 105291 41922 -53491 -82249
26930 -82249 -60072 -62347 -21800 12928 -8071 3055 11734 2548 17166 -28367 10489 13445
26918 13445 8240 -32438 -71663 -35276 -13249 -25921 -21835 11634 28693 53568 84235 87310
26906 87310 42385 -41028 -66311 -57179 -59879 -21893 -37648 -93768 -64912 -58877 -67406 -57275
26894 -57275 -22497 19196 40866 65431 43692 -10340 -78060 -40490 16917 -8632 -10682 28608
26882 28608 41307 53579 65453 24728 -43402 -111043 -106093 -31305 8396 20119 7529 -24208
26870 -24208 -5205 2314 22534 43443 17274 -39673 -20378 20766 -12268 -60457 -41924 -69341
26858 -69341 -48176 -67223 -22496 68557 112631 127671 78683 16398 8458 39606 103097 155440
26846 155440 155849 92171 28636 -4060 6432 -33150 -34594 -14705 -21095 -67114 -88676 -80747
26834 -80747 -116169 -103048 -15714 16241 35233 72526 25834 -26812 -41427 -70570 -36552 -16120
26822 -16120 35213 32157 4020 -31023 -64942 -50958 27080 79162 51452 41199 76989 68966
26810 68966 44731 25220 -21608 1633 1153 2484 -68881 -102103 -14998 -17056 -16284 -39122 -113663
26797 -113663 -113053 -98166 -1953 34680 65461 34676 73750 65302 44249 56038 94270 116531
26785 116531 -4265 12554 83685 114918 57730 76761 54213 2699 5817 7555 67097 137194
26773 137194 105657 86616 90382 77094 82414 91413 135652 102936 43919 34125 34590 13027 815
26760 815 -6438 -39687 -22420 31829 48252 3387 -47348 -42984 -4001 56616 42044 -29408
26748 -29408 -73085 -74149 -7627 -24066 -40426 23626 18417 24340 -12107 -15926 -12312 -23085 -33984
26735 -33984 14237 -8629 -16976 -48651 -36610 -41061 -87495 -79004 -126455 -44072 40162 95091
26723 95091 37898 -13219 29286 32174 10678 -25590 -57455 -53149 -25355 -55536 -80339 -121416
26711 -121416 -103130 -43145 -16339 -51061 -50764 -22432 -14883 36495 115560 177594 106491 11242
26699 11242 -37125 -75721 -59946 14775 20607 14200 -7068 -21617 -48679 -19006 -36651 -38272
26687 -38272 26484 -10787 -25092 31203 47887 5934 6646 61518 105924 45237 4365 -77643
26675 -77643 -121813 -92959 -89117 -70745 -27061 -22935 -36596 -3430 67221 83642 78640 49079
26663 49079 -2017 -36370 -90801 -43789 4735 36605 65172 62639 13824 29397 14313 -44502
26651 -44502 -128794 -92278 -50275 6077 43105 51200 56539 7335 10820 -36383 -86360 -98685
26639 -98685 -6766 47134 29213 13827 22803 -9390 -42823 -19303 23469 33667 33723 -1002
26627 -1002 -50752 2786 39290 -53 -23717 -29519 -25940 43054 48787 54220 73863 43721 55144
26614 55144 60052 15867 -20063 -70533 -81826 -51385 -34438 -60449 -80514 -84390 -37080 -27062
26602 -27062 17557 29988 25827 61951 49876 58742 15935 -62939 -56232 -47331 60148 54268
26590 54268 9183 3006 -9557 -5087 -21992 -19201 26212 101005 79142 49755 45547 1186
26578 1186 -13933 -40032 6859 20299 95564 131624 75511 -9165 -34908 -2531 -56217 -110936
26566 -110936 -100113 -92917 -50970 -5553 42016 67825 12206 -6777 20177 3249 -48904 -89349
26554 -89349 -49313 9828 51703 56366 33477 21338 29134 40383 -2781 -4465 36161 57273
26542 57273 -492 -37897 12488 -6720 24944 42631 984 -59993 -92357 -61468 -36102 -26194
26530 -26194 17032 20810 -91052 -132260 -85913 -25677 30772 -342 -63234 -33434 56866 66719
26518 66719 34388 17052 19702 7365 -34478 -113666 -103241 -43077 18294 -16433 -14103 15484
26506 15484 26024 28216 60588 18235 -11667 -57318 -44649 56096 51015 -3608 37424 76021
26494 76021 5663 44140 45664 45947 36331 10494 -3203 -22516 -47128 -51912 30575 96336 117431
26481 117431 84749 44637 17253 -21239 -37666 2088 -17163 -104848 -69622 23508 53914
26470 53914 123871 139463 93208 77099 99883 82906 81251 50368 18308 35112 51771 74530
26458 74530 31592 -47626 -76032 -28895 25399 51128 53144 -30632 -23039 8714 21682 21464
26446 21464 46766 -8445 628 -12354 -31665 -19022 -6574 -29042 -107988 -22054 -17652 -63712
26434 -63712 -67328 -51393 -42300 18878 31315 20093 -7393 -23968 -43577 -14870 12083 55137
26422 55137 -2674 -43748 -77453 -75254 -53062 -107753 -75413 -7492 45899 20143 22939 -1936
26410 -1936 -63660 -42014 -93 936 -430 -7934 9065 51050 71327 46095 -679 -59916
26398 -59916 -40526 -38669 -66761 -32784 -44644 -109032 -52193 -26762 -68639 -40053 -11749 12755
26386 12755 86676 84735 37153 61879 -2639 -49833 -91434 -52141 -18867 -34536 -6081 12372
26374 12372 20362 -3219 -30102 -26570 55352 74203 69533 71794 42878 33201 71765 23335 -13296
26361 -13296 -9474 -10045 -5696 -36829 13731 -12011 2585 36871 97858 112294 91925 10982
26349 10982 -72211 -53406 -11478 -14744 13225 49859 18179 -21768 -74853 -85816 -59392 -46886
26337 -46886 -71796 -40232 39074 26800 26508 33615 35860 30627 43372 48861 7155 -48953 -51974
26324 -51974 -12977 -25546 -94588 -40725 -1723 38005 76836 17726 22708 29046 33863 9499
26312 9499 6016 26491 -15301 -56302 -59154 -67331 -65254 -45914 -75022 -89057 -13715 5547 555
26299 555 -17600 -51324 -76195 -56399 -72898 -102837 -119919 -98763 -74803 1906 54879 53070
26287 53070 49647 63779 63877 -17797 15290 73675 57937 39109 39440 43856 17162 -15665 -14877
26274 -14877 -9598 40874 -10335 -31284 -74164 -77281 -90432 -111495 -81344 -10569 -6943 -23794
26262 -23794 -13503 -12983 -47082 -8873 49118 18188 31915 120733 72715 9078 50595 120640
26250 120640 110730 115103 46138 -22993 -92341 -130650 -76366 17551 72335 55637 -38192 -54600
26238 -54600 -35456 -31243 4122 70914 72019 71806 76929 61872 30305 -21295 -60903 -82478 -87504
26225 -87504 -52137 -35612 -81612 -86636 -19613 -2551 8192 9488 39620 35434 18826 21836
26213 21836 27817 55366 48673 52994 -2200 -2151 30956 80128 83137 52857 1605 -8820 -39638
26200 -39638 -21240 45704 73108 49862 -3498 -8182 -44520 -40789 -4184 -7417 -45484 38129
26188 38129 54776 16694 29229 102371 71950 80905 55864 13473 1420 5927 -49226 -84635
26176 -84635 -32860 68090 107071 118861 49568 1016 57949 40644 -36536 -18971 -2868
26165 -2868 680 30357 36122 101297 31853 -44585 4596 15361 -51180 -34023 47669 51705
26153 51705 35114 24292 21187 59763 45731 33393 58966 75662 23499 -9953 4947 -24437
26141 -24437 -68066 -39010 -3563 31825 40070 25816 -6131 -57438 -85805 -39896 -9905 -38485
26129 -38485 -73780 -115816 -99723 -118376 -114336 -52082 -66999 -59442 -32987 -40286 19147 67549
26117 67549 10182 -33320 -85849 -120776 -105117 -22528 -58355 -28399 12849 30395 54838 37755
26105 37755 27596 24040 32541 26961 15721 4121 15261 70616 80164 103480 50011 43750 3983
26092 3983 -18162 -9430 72570 101967 79307 105425 90274 56940 16061 24257 19187 40300
26080 40300 16165 33131 71098 16520 -63751 -75322 -46094 -30840 -32441 9718 33824 -50555
26068 -50555 -64892 -33816 -49929 -28229 7791 -22414 -67689 -84286 -83653 -35067 62378 7696
26056 7696 -14691 -3659 1872 22352 15251 -16575 -40008 -78734 -55039 -44717 -28983 -30376
26044 -30376 8306 27215 61415 77209 28917 11356 -20035 -81803 -39173 -27196 -74854 -132883
26032 -132883 -102250 -41006 -93080 -143297 -92041 -26527 -1865 12021 20428 -28525 -33764 -32602
26020 -32602 -45318 7302 -37643 -59907 8043 51732 60319 27338 19318 29254 -14298 28479
26008 28479 43618 -19199 60977 165345 174540 137697 55128 -1264 78675 68383 33044 13031
25996 13031 -19438 -44292 -89450 -96481 -66384 -36957 -22871 -7322 -3995 21013 14838 26401
25984 26401 48387 36590 33646 25066 22608 -31249 -26045 -41834 3844 -14137 -40365 -19105
25972 -19105 -4521 -27702 -59977 -48288 -27787 12684 4428 -36175 -66958 -77346 -68081 -75882
25960 -75882 -21702 24513 -15856 -26289 -30244 27343 -1856 -68840 -63712 -61196 -12827 -12069 -49268
25947 -49268 -60106 -50510 -54726 7751 -698 -27451 -28279 35795 46604 32430 44834 67803 53734
25934 53734 23373 93633 92452 -4666 -32013 6621 9990 -14485 -67188 -39616 -18559 -19256
25922 -19256 -10144 28127 -53342 -57035 -21253 49075 32537 43082 63825 26687 10904 47575
25910 47575 33176 39392 91599 114902 89328 -37057 -77007 -59429 10820 57285 69730 43681
25898 43681 32227 68923 31347 -12066 -7492 5709 25559 46703 106135 56052 7755 29627
25886 29627 61111 51272 45060 79436 116877 97706 45252 20971 30115 35868 17749 18025 60200
25873 60200 39759 18354 44807 94361 84243 20370 14009 3102 -21521 -58417 -43894 -28600
25861 -28600 -8498 18768 17030 -46404 -82568 -37307 3182 -935 -48631 -53305 -109787 -137689
25849 -137689 -73604 -59807 -123612 -160670 -73684 -50851 -56830 -103105 -92325 -17582 26518 43546
25837 43546 54080 -2230 -36458 -29827 29121 20809 1080 22012 26596 18251 56173 28165
25825 28165 9395 18704 4322 2712 -15536 -50358 -50239 -31913 -13852 -9948 3049 43906 62197
25812 62197 54963 13792 18166 -1476 -3908 32572 12832 -14653 16965 65714 74057 44418
25800 44418 10165 -15251 8993 62659 36167 4358 22479 48832 750 -1737 44467 78273
25788 78273 39836 -31043 -49431 4306 58220 62419 47501 44339 26601 1135 -26727 -39424
25776 -39424 10796 54644 25675 29416 54421 54851 5678 -41095 -39762 17134 64889 68009 41450
25763 41450 39201 27937 14109 -27344 -12642 -13396 14240 97800 74135 51348 85948 22189
25751 22189 -46985 -123403 -148994 -131557 -45902 -11105 2051 -5905 -42294 -8386 11585 -11140
25739 -11140 55276 45657 17812 36050 -21809 20845 74581 87312 128472 76775 68353 79147
25727 79147 82946 109869 119977 80260 86221 64671 65041 27697 6757 -14433 25232 66392
25715 66392 62759 14468 -18935 -5500 17689 -13489 -11647 18008 -10937 -21004 -54871 -44497
25703 -44497 -60641 -78268 -35108 -62570 -72134 8095 78289 46125 -20151 -36535 41659 113792
25691 113792 92647 56208 35433 -17526 -75167 -43623 -77248 -57532 -12880 15279 40072
25680 40072 41750 57948 21109 -40073 -6759 38535 33017 -7865 -37170 -56047 -66074 -47790
25668 -47790 -724 31289 70671 65514 56946 21302 -46201 -42502 -21035 181 55909 46195
25656 46195 3201 40786 9922 -26648 -36500 -53643 -6667 53717 5292 -20134 5000 74410
25644 74410 27808 22326 -4365 -56333 -70397 -68420 -46725 11164 -6078 21753 1359 -2814
25632 -2814 809 -26311 -27579 -61741 -128650 -75996 9626 -47458 -55687 -54672 -31457 -41840 -5295
25619 -5295 -2000 -5946 16851 3185 -27940 -39934 -38097 -21470 -25721 15817 14674 46900 23635
25606 23635 -11743 -42712 -30359 -22666 -33404 -1197 38605 13601 14855 -32388 -87006 -42609
25594 -42609 -379 -59501 -84923 -66385 -100126 -90081 -34994 -24784 3461 13113 -13553 -7512
25582 -7512 -5786 3735 -18660 -36915 -75216 -87637 -63168 -59817 -31732 -63731 -29788 21949
25570 21949 21723 -13563 -26082 -52806 -76695 -65757 -18330 7889 4825 -47162 -115416 -143437
25558 -143437 -79220 4674 99917 77726 21878 16792 32767 15135 48751 124092 96654 63414
25546 63414 22667 10841 42950 40058 35454 16021 45336 62939 14886 -49198 -81941 -32160
25534 -32160 -57884 -55361 -35655 32358 38595 5159 -37719 -69805 -79256 -42868 12305 39729
25522 39729 30484 -71663 -60478 -54387 -54803 -18493 -41938 -1513 17419 -36274 -93936 -41839
25510 -41839 -20483 17721 -26879 -96187 -89992 -19884 14150 11315 32629 -12598 -23090 -76875
25498 -76875 -95919 -48916 -72445 -49483 60613 126881 88336 64619 46648 5617 19203
25487 19203 61671 29432 -14134 -86591 -101761 -56219 -42882 -15302 27148 90787 35993 52036
25475 52036 16540 -10607 22458 52668 20578 -44373 -24495 -48191 -77199 -77133 -29484 39417
25463 39417 51990 3787 5859 32688 85806 75539 35336 52624 113953 79843 54290 61312
25451 61312 40045 -38190 4052 64901 -7737 -21046 -12515 16596 20396 -17878 7437 18363
25439 18363 19611 -8168 -4419 24845 39223 117 -2379 -9922 34792 83834 32636 12534
25427 12534 10641 -56 3148 29021 9548 -51898 -31392 39268 77219 100362 -21620 -139000
25415 -139000 -46456 -17536 -6688 30986 18341 -20941 -45756 -16235 -25269 -41118 4908 -30387
25403 -30387 -69744 -14282 11175 -27346 5524 38645 78473 82281 66230 31705 10231 15977
25391 15977 -35001 -65846 -109942 -141376 -184935 -196808 -125464 -70566 -61311 -40227 -43730 11512
25379 11512 72803 49201 -8815 -60498 -20169 51797 60932 50149 33289 18004 17477 29224
25367 29224 -9755 -36075 -44253 -40751 -32166 -25105 -52903 -84200 -84724 -36070 -9580 -18910 -3241
25354 -3241 27086 22746 61630 24169 -6405 -42182 -98349 -111728 -87177 -25697 17618 1818
25342 1818 2961 17139 26289 -19376 -57603 -66649 -14686 11242 70513 86400 51759 52584 41043
25329 41043 19054 -14167 -83617 -69961 -55994 -59390 -76998 -102916 -76366 -91192 -111782 -110776
25317 -110776 -91963 -35179 -68492 -45814 -66711 -99564 -127499 -75913 -30566 -47757 -72799
25306 -72799 -87792 -79212 -87541 -110898 -72505 -9337 69221 138517 95439 61061 51361 -17045
25294 -17045 17775 97510 101962 77299 7840 -35178 -28780 32366 5993 -48813 -4675 109382
25282 109382 120209 55255 -1687 -64178 -69579 -61582 14574 76955 92802 26063 -9567 -20925
25270 -20925 5520 1675 -60670 -82305 36337 59842 35337 63175 52536 -22289 -67418 -61441
25258 -61441 -46872 46408 50150 -181 -20669 -52176 -9631 11266 48586 90096 51460 10618
25246 10618 -19141 21867 24407 32702 53356 -11161 -72585 -107894 -68548 -32310 12082 -24620
25234 -24620 -42967 -43668 -91283 -101097 -96294 -78098 -36126 -38263 -32744 -54077 -14573 51233 30635
25221 30635 -16838 33090 84881 53601 30549 28867 52315 39883 25037 -29041 -37444 9758
25209 9758 47292 53391 59987 23144 -9075 -40194 -66299 -71724 -75040 -67456 -45758 23599 12918
25196 12918 -7315 -8914 39500 25318 16000 -3568 -15265 -20765 -14491 -35679 -30222 -29979 -28439
25183 -28439 -19840 22813 54494 36984 57709 16724 59546 38031 26030 41795 26058 11887
25171 11887 32437 -8530 -92260 -123133 -67262 -31022 -75052 -58810 -18651 9407 24660 76237
25159 76237 56031 16815 79770 25591 -22077 -51309 -68584 -7641 -19465 -37639 -22808 -5512
25147 -5512 17723 23683 642 30086 30998 -2249 4563 1312 -31984 -32152 13268 42250 18395
25134 18395 -34839 -60973 -79853 -69641 -44225 12005 54191 60461 109959 112409 104765 59768
25122 59768 48072 68393 77658 37566 48513 14756 -8727 -24471 -62549 -83676 -145639 -139884
25110 -139884 -58103 -20590 58725 76747 58290 7774 7235 -45707 -46395 -50153 -63064 -41563
25098 -41563 -24545 -55083 -15633 -19543 -5273 40861 -20014 -90399 -138459 -140860 -92060 -63687
25086 -63687 -29613 -45479 -58694 -49531 -77890 -91892 -166419 -164469 -75506 -25690 -11152 43891
25074 43891 91066 97229 78827 69221 84482 100791 89943 51531 13414 86277 80306 31375
25062 31375 61792 80424 75831 28224 12642 -38762 -71555 -15178 536 1361 -25990 -24648
25050 -24648 -4022 -5867 26419 -3875 12295 56405 71667 8696 -105405 -98347 -95307 -22764
25038 -22764 20481 33488 38886 57939 52176 4465 36203 49767 23973 13075 8639 -20920
25026 -20920 -57152 -83047 -75927 -28595 -34263 -33359 -15032 -43452 -38454 -2390 45875 93333 122858
25013 122858 53468 32729 80935 72210 90958 79018 31530 36584 79511 107886 102107 35179
25001 35179 7340 -33603 6182 62543 58652 23025 45689 78557 20321 15402 15097 -31998
24989 -31998 -38796 10335 59715 47096 27214 60191 72778 30244 -28914 -60282 -65730 -47249
24977 -47249 -21359 32481 -24692 -16014 -9788 -18279 -37740 -23658 51408 84847 45966 11988
24965 11988 -45692 -12178 25742 17057 -1728 -15803 -17126 -30825 -8440 -24820 -8161 4980
24953 4980 -78 -2175 35462 60330 4612 15996 37231 16100 -12840 -54150 -77947 -33015
24941 -33015 10662 -10339 -28076 -63285 -18462 2124 38147 -27596 -100137 -72058 -72786 -81617
24929 -81617 -42923 18022 50296 86954 83445 69540 48175 30420 -849 -5684 -12302 9787
24917 9787 24026 -36638 -83518 -84603 -59417 -67688 -39127 8589 38048 53326 49148 43638 -51557
24904 -51557 -36017 29635 23375 -28255 -90127 -45228 27194 19380 -35061 -32477 -60402 -60509 -44171
24891 -44171 -45334 -104842 -163880 -91750 -59603 -98619 -82503 -45503 -73038 -49713 -36184 -23675
24879 -23675 -4185 3439 -5319 -8453 -16564 -60140 -24864 -12986 -19778 -17608 -747 5665 578
24866 578 -32909 -54938 -145466 -57442 12150 -77168 -82090 -33399 -51139 -83600 -89444 -79372
24854 -79372 -73882 -94272 -37085 -35250 -54111 -51459 -79415 -126881 -124875 -84744 -98103 -100975 -113955
24841 -113955 -138775 -92199 -53131 -57934 -5678 46307 114299 152742 86298 28605 89421 90628
24829 90628 4369 -597 -9342 16088 31675 -15411 29469 36686 9636 68601 29050 44471
24817 44471 35607 -13183 -71374 -23680 13893 7532 -42254 -98910 -79147 -686 -10988 -51367
24805 -51367 -11908 67707 102596 82418 39826 -22304 -56963 -58843 -72833 -52676 -52782 -74408
24793 -74408 -102591 -155127 -106217 -52854 -44015 -10055 -6752 -3114 7625 2249 -22034 -20897 35139
24780 35139 47578 41487 50049 85807 99140 75843 61491 43909 74497 151640 131983 28036
24768 28036 -21583 26615 65295 36280 62545 24762 -2837 16646 70013 83139 123770 159961
24756 159961 96794 80241 110481 111169 60549 67028 88925 136730 107993 87772 77648 32894
24744 32894 -27669 6991 -20215 539 -2712 23478 69907 34562 17216 100106 85304 30621
24732 30621 29341 18119 29913 67002 33732 45027 99061 75806 32467 -16913 -48883 -91470
24720 -91470 -89496 -35107 16304 60513 81966 22693 27690 24675 39725 -19592 -19184 21417 -37375
24707 -37375 -32731 28984 14271 -33415 -33604 -8536 11786 -37376 -77873 -6199 79136 71275
24695 71275 63992 66041 19177 -3902 69621 117289 24580 -62274 -50491 -62780 -65563 -28358
24683 -28358 -28008 -46193 -33285 -30305 -26333 -31438 -57897 -71280 -47973 -36856 -56150 -98423 -97485
24670 -97485 -21079 14832 17481 -4580 -20639 -23272 -26811 52951 18995 -55983 -22115 -29175
24658 -29175 -18033 -81103 -27121 -27801 -27262 -48070 -67959 -119189 -126132 -82533 -101867 -107245 -70559
24645 -70559 -922 1444 -5142 -54275 -80976 -27733 37319 23347 -20831 -10522 28512 36863
24633 36863 43613 -34008 -19685 1255 42733 38387 56368 75338 27127 -9910 -85578 -53698
24621 -53698 -5583 -43684 -22835 -7146 13331 -29166 -60600 -76552 -84741 -73129 -69769 12281
24609 12281 23682 54650 82961 76607 53598 3569 -48061 -58511 -39096 -35275 -63171 -48361
24597 -48361 -18155 62756 39291 6905 -21748 7723 49442 13254 10044 -20951 -20633 -32475
24585 -32475 -37971 -48793 -70456 -53449 -47628 -83888 -55432 -27082 8110 -6475 -28251 -23895
24573 -23895 -13283 2096 2298 33922 48637 25994 54071 51637 61309 47347 51134 72492 15934
24560 15934 -1060 12893 -17686 -69883 -87594 -69589 -54705 -52776 -43266 1758 20487 -1273
24548 -1273 32021 -3778 -38725 -36549 -30055 -15072 1914 -55754 -92840 -55169 15185 2669
24536 2669 -21681 -68504 -83275 -66943 -53412 -28600 -51641 -99816 -75994 -52532 -14732 -12042
24524 -12042 -14170 14603 22092 25005 -6933 -46230 -47785 -8282 2719 -74802 -85087 -1437
24512 -1437 56471 57588 64725 -5788 1986 46181 53014 20440 6319 37699 31733 7168 -20994
24499 -20994 -3004 59323 42257 -12741 -50212 -55427 -76702 -60531 -66272 -92225 -95542 -50435
24487 -50435 9434 -35233 -62209 7899 738 -67355 -135637 -170384 -173435 -102540 -92385 -122769
24475 -122769 -156010 -119245 -44928 4610 -80597 -104563 -105060 -99748 -66579 -736 67767 48743
24463 48743 -59548 -92907 -68124 -115469 -133908 -41802 -24470 -42723 -4576 -3065 -32909 21642
24451 21642 36420 53833 8650 18830 -41119 -41141 -59729 -70838 -38035 10001 -29717 -33036
24439 -33036 -32158 -15634 -36816 -84465 -53521 -45127 -114833 -111514 -108239 -93809 -91844 -50458 21888
24426 21888 9803 15971 15821 25306 -8501 -54766 -52765 7506 50849 24586 26705 36350 18069
24413 18069 18166 -60983 -39370 -45493 -62973 -17503 13137 -20404 -28259 -26789 -5020 -50162 -93604
24400 -93604 -30875 5799 -20707 -38312 -32404 -4830 16080 -25514 -34222 -4210 65193 45146
24388 45146 -32188 -63400 -83415 -69858 -6302 -16606 -75465 -125857 -105945 -54549 -12178 1846
24376 1846 -34898 -5989 -38374 -34148 22251 1271 10815 -9221 -3745 -22570 -60368 -21871
24364 -21871 14272 17089 67711 49670 -11919 -75280 -52177 -35636 -51938 -45973 -29070 -9543
24352 -9543 -11478 10736 -16158 16501 45734 -7553 10147 47082 73346 67490 -30543 -71740
24340 -71740 -65093 -33877 39907 80441 80433 69466 22472 21279 13552 -59390 -102299 -94015 -50377
24327 -50377 5750 -31875 -90574 -90786 -44952 -31885 -34344 -61014 -96768 -168568 -162827 -129942
24315 -129942 -158828 -120985 -41572 2877 33477 11844 -63748 -53686 -61107 -27695 -40688 -72004
24303 -72004 -17902 13261 54278 74794 59733 24645 -2077 -17437 39334 53936 42624 45229
24291 45229 62789 -497 -92028 -83081 -32085 -40886 -33325 -4663 14757 -194 -27906 -53294
24279 -53294 -64923 -12477 77965 56430 50621 97223 118172 109453 102345 73859 39402 20809
24267 20809 -22358 -56021 -81322 -77079 -55193 2784 71266 27933 -6887 -33811 15447 16384
24255 16384 -11928 -16039 -66574 -119410 -102986 -81786 -30909 -58454 -115958 -90156 -25803 -9581
24243 -9581 -32525 939 62778 44657 588 -36035 -21949 -16987 3016 24495 11340 -2137
24231 -2137 11014 -10949 -35133 -42578 -42459 -77582 -75102 -116449 -131806 -133749 -55749 -47907 -72596
24218 -72596 -31002 -2583 3986 -23101 -20056 22467 -12349 -53032 -73107 -35498 12042 60955
24206 60955 70195 76302 9606 -8582 -9384 -11156 -5517 -37867 -90151 -27100 -22360 -7985 19120
24193 19120 4429 17579 61742 -13417 -23921 15641 14057 -12847 -29211 -27426 45469 41466
24181 41466 42180 69361 14909 -52716 -137037 -117500 -87312 -23723 8287 35122 42354 12293
24169 12293 76196 117934 145698 85198 -1826 1806 32010 50220 28788 14658 -35016 -55925
24157 -55925 -16620 -23000 -39965 -73572 -16288 19368 -20619 -66252 -109669 -95881 -56195 -39433
24145 -39433 -62147 -61636 -54434 -23494 435 -8710 -8995 21678 -15040 -4822 -20701 -64264 -113329
24132 -113329 -67598 -3449 -40276 -54822 -48730 -8941 7705 -13352 -37437 -60239 -38831 -29888
24120 -29888 -32293 -67964 -83940 -39555 -1284 17704 3642 -13509 -28985 -27834 -18884 -16533
24108 -16533 -18187 -63949 -52070 24956 60330 79612 82821 102000 112675 140086 113995 81078
24096 81078 36732 22519 -9975 60788 86654 26778 -2981 32852 -14455 -82166 -62351 -29131
24084 -29131 -38924 -16269 48162 42911 15000 55124 85026 65298 81185 22513 -64176 -85974
24072 -85974 -18432 55970 76241 109032 66960 29080 85580 140994 113233 101033 59935 -8475
24060 -8475 3983 -23070 -60204 -9801 69626 52942 52290 41284 10786 -26358 -86532 2678
24048 2678 176 -55348 -31355 -34961 -78288 -80154 -40830 3117 -26097 -8197 -12408 -59241 -44126
24035 -44126 -85497 -86494 -66405 -5905 23819 52087 47541 14403 13414 63510 40680 11211 -13597
24022 -13597 -47399 -39895 -55664 -23405 -1718 11585 12683 -68599 -97811 -63834 -9835 -6503
24010 -6503 -34010 -61954 -46963 -13303 20788 47607 49539 25438 31090 19122 2380 -16803
23998 -16803 -43624 -100040 -94859 -29166 -41380 -43633 -42660 -10874 -68580 -98707 -75543 -25581
23986 -25581 9624 2609 -65821 -108641 -124755 -123218 -128658 -117312 -108098 -35523 -9923 -34003
23974 -34003 -30207 -31328 17908 -51431 27225 72969 75665 62250 15840 69456 100000 1142
23962 1142 -54953 -52120 -55515 -46531 -56480 -39576 25736 67134 99835 54992 57587 9642 44490
23949 44490 100550 23694 -15097 -41904 -39196 -63321 -98502 -132988 -100502 -80488 -35489 31285
23937 31285 32519 -18994 -50051 -58776 -29235 -12497 38860 47598 -29006 -86188 -65948 -58204
23925 -58204 -27405 -60147 -89929 5458 66518 40689 7689 -88568 -74207 -21839 -65062 -71986
23913 -71986 -27146 -116939 -168981 -85776 -11618 3818 -54257 -16859 -54664 -92705 -131468 -143187
23901 -143187 -116547 -48731 -24067 -51985 -70750 -93587 -95097 -49195 -38285 -39863 -72268 -55285
23889 -55285 7802 49192 43622 24665 -499 -1774 31031 30716 26769 63184 2711 1581 -979
23876 -979 9157 93818 98677 36973 -33880 -7116 6027 25431 28667 81101 111854 45502
23864 45502 13358 23062 24325 -569 46113 -3893 -44052 -60603 -85353 -79118 -57225 -11650
23852 -11650 15844 101159 87914 78885 23525 -20702 -37836 -76525 -66394 -85200 -110188 -98415
23840 -98415 -46322 -17700 19714 20992 605 -5739 -1569 -14091 -7332 -38935 -49736 -67425
23828 -67425 -139548 -84617 -59244 -71322 -15799 -10149 -41783 -72359 -45458 -44464 -19354 -70303
23816 -70303 -126016 -117976 -54205 -56715 -38644 -14396 -16715 1136 2078 -32371 -66076 -26079 -40354
23803 -40354 -58134 -26120 5162 -23986 -444 2062 5591 -56139 -81966 -61813 -21350 -41181
23791 -41181 3591 -21551 -63024 -96591 -52842 -19148 -14689 -73364 -90372 -57152 37906 69373
23779 69373 102168 79689 28368 13990 13385 40094 51404 5821 5983 -1890 28733 39447 -2309
23766 -2309 1023 -35115 -16562 37946 39248 83008 52879 59162 38822 40172 56616 103781 95606
23753 95606 74164 101387 76392 41208 6473 50402 88572 83337 30635 21655 25138 63421
23741 63421 102479 53809 23711 23937 43454 51722 3417 23658 618 -10586 30061 48997
23729 48997 21398 28521 69791 37899 -20990 -91816 -158415 -133812 -76443 -39846 -24040 63204
23717 63204 63477 -8189 -59799 -78357 -4942 15947 -19443 -8906 30080 51101 22945 -31385
23705 -31385 -110764 -116443 -85847 -77709 -67519 -127273 -100870 -2100 -7671 4296 -3962 -26674
23693 -26674 -39621 -55928 -29433 35749 37813 -70139 -81754 -82156 -90395 -53494 -34827 -61335
23681 -61335 -26874 -61271 -129250 -146548 -157742 -93613 11155 26118 854 -13816 -26598
23670 -26598 21022 1777 -22560 2239 23669 25019 2482 -8505 -41838 -67644 -47874 -58136
23658 -58136 -16639 -37566 -105972 -109271 -127809 -164666 -166660 -118427 -89061 -42462 -58620 -83230
23646 -83230 -108306 -79136 -58207 -81414 -49622 -57733 -87782 -34924 30252 20143 25075 -22004
23634 -22004 -66802 -76221 -63682 -63417 -36510 -29347 -27646 40561 50135 48879 11244 -11645 -42914
23621 -42914 -47047 6388 8798 -1878 31756 -39118 -43437 -27133 -39299 -29091 -7550 -3898
23609 -3898 -48797 -40063 -54740 -13283 -26572 -90815 -97146 -86347 -75330 -53900 -36386 -20712
23597 -20712 -1132 -90279 -122500 -95557 -96849 -95072 -62120 -35938 -92248 -57755 -2716 2446
23585 2446 -32344 -61707 -13619 -39010 -59527 44338 40111 -40196 -77177 -93583 -73032 -110245
23573 -110245 -94194 -35796 -14136 -46189 -64126 -12609 11413 -32864 -22059 -40583 -70915
23562 -70915 -113409 -143033 -172949 -188753 -119949 -63334 -41015 -17403 4333 5603 20712 76305
23550 76305 91066 45281 17492 -13183 1875 -2867 -39788 -46214 -10557 -16858 -32287 -14555
23538 -14555 -23615 -82815 -63502 -10857 -25736 -44724 -57107 -78223 -74241 -81647 -71497 -13781
23526 -13781 50649 68152 -40203 -89475 -61545 -46187 -48483 -32719 16499 -9511 -12942 57866
23514 57866 83870 81952 61105 12419 6256 44286 -25927 -77737 -40294 58222 76477 80255
23502 80255 112826 147717 62139 -56028 -49299 -4044 -32833 -62112 -79925 -41944 -60215 -110019
23490 -110019 -39454 14833 -16537 -54673 -66094 -53062 57924 107305 86602 25069 3144
23479 3144 -19174 36898 493 -83763 -144129 -120133 -26043 82468 60173 -11069 271 -28844
23467 -28844 -22895 -6040 11510 26120 78717 66773 -20862 -108775 -155172 -83585 -24540 961
23455 961 24720 -63016 -49541 -12753 22526 58723 55276 55876 68706 69763 63494 59050 40618
23442 40618 37199 24897 4776 -5518 51734 74062 82699 31265 30120 10274 -63331 -48029
23430 -48029 -27889 -16684 -20854 -11594 -100 5914 -16893 -63851 -136440 -194148 -164861 -104153
23418 -104153 -54282 -17623 47686 3933 -60470 -82183 -78221 4626 11014 20694 6584 -13881
23406 -13881 14152 29986 3604 10886 -31518 3931 76488 102977 102718 91712 76067 -14856
23394 -14856 -31993 12546 11254 26715 3309 17522 34418 -3180 7468 39163 110789 69953
23382 69953 17272 1957 -51879 -86486 -136354 -143328 -46274 47447 50798 -35087 -88705 -31356
23370 -31356 -48356 -48512 -80832 -98042 -70145 -22594 14798 -13247 -15786 57861 86193 66047
23358 66047 46220 52053 58621 -4359 -49121 -42249 -31408 -74519 -68433 -70755 -31013 -26571 -8160
23345 -8160 -45070 -66290 -54008 -67718 -67396 -93765 -112732 -46618 -18070 -12487 33509 11382
23333 11382 9284 30799 28245 29978 36938 39604 -27036 -76109 -102987 -34174 56003 47168 35107
23320 35107 58071 25297 35186 50597 30673 13588 42849 29672 -19175 -79433 -77160 -51143
23308 -51143 -39011 -73449 -70672 -24529 17384 55206 49312 16184 11307 47559 40602 -1419
23296 -1419 -17773 21154 8323 -282 3108 -5798 27651 21991 7186 -10296 23853 -1027 -14357
23283 -14357 -29385 -47957 8359 40540 15026 -25116 -31103 -40379 -88958 -51536 -106562 -98295
23271 -98295 -63410 -106421 -168570 -151048 -100764 -66464 -52567 -46716 -22520 -57519 -58746 -8754
23259 -8754 19532 11469 -34326 -90460 -88634 -129272 -119965 -23851 -16034 -14064 37968 16714 9441
23246 9441 43604 80033 61620 -10903 -4987 70462 40687 38220 15286 -18338 -23867 27689
23234 27689 15692 14662 30646 -10526 -17693 123 70832 55682 13009 -16955 -80372 -39969
23222 -39969 -4485 -44787 -16402 32272 48002 78409 59334 22506 -22332 -7876 -21705 -17309
23210 -17309 -51017 -64225 -13773 -47494 -139084 -186674 -98860 -64841 -82924 -127744 -91227 -10338
23198 -10338 57613 68435 15708 -36849 -31789 -26502 -70691 -99117 -110371 -194807 -211633 -146481
23186 -146481 -118285 -86176 -35469 -9747 -12536 12995 12768 7186 84475 103040 32205 -46094
23174 -46094 -22546 -23404 -62612 -49583 332 18193 25410 -7220 -9696 -381 37514 77708 46659
23161 46659 73871 83971 -8104 -105527 -82092 -43354 18304 44513 83433 68103 52214 1472
23149 1472 56643 30644 24787 32434 -69178 -77158 -3122 54148 43374 36723 80236 109197
23137 109197 97380 137173 91249 75793 40517 11712 -7108 -49231 -46526 -39212 -21237 12393
23125 12393 64304 76092 63697 42749 -6748 -18897 19142 50250 86504 46963 29605 66009
23113 66009 83085 77256 42364 20631 15324 -55781 -49687 -7304 -13861 -53837 -85387 -59431
23101 -59431 -83591 -59277 -51053 -86181 -122135 -75419 -60663 -6311 42966 15798 -52811 -53905
23089 -53905 -72578 -36182 -25193 -26554 9802 69239 38764 -8825 -68536 -40821 -2122 5992
23077 5992 32603 4870 -13623 -6981 -60230 -59928 -107300 -56519 -16750 -3362 -14137 3392
23065 3392 8856 -41374 -20829 -32901 7236 81465 61935 64106 10280 -79926 -70301 -99885
23053 -99885 -60064 -41716 -14987 30313 17750 -26136 -21117 30306 19857 -30296 -10696 53858
23041 53858 11003 -33419 -30463 -46231 3783 86566 56485 43579 12678 -27384 -20513 -34780
23029 -34780 -9866 -43723 -81606 -101665 -74727 -97130 -106852 -106394 -39562 -23307 -95122 -61448
23017 -61448 11595 80116 44682 -6063 -26286 -17729 -87987 -115510 -98435 -33032 9612 -40170
23005 -40170 -51286 -46179 -25559 3735 12543 -34210 -54397 -83156 -48238 -79934 -67122 -44277
22993 -44277 -24682 -56976 -99932 -80155 -33775 -55824 -57742 -79494 -55404 -16260 1831 -14148
22981 -14148 -26185 1194 34200 66961 73666 28869 -7464 14350 36107 4946 -58093 6566
22969 6566 -19638 -47682 20690 17516 5349 42073 36964 46773 8095 -18058 -18936 -17707 -38958
22956 -38958 -73841 -72295 -52154 -47143 -643 39186 55787 51625 2794 -34413 -22737 -12105
22944 -12105 -4404 -9608 -53275 -39860 24823 54475 63265 87235 81534 66132 72648 113292 91971
22931 91971 96592 123565 123938 160400 79039 -47304 -98890 -58499 31000 104989 94134 77360
22919 77360 75996 50988 26032 49525 40316 15624 28613 37209 529 -13290 17924 54064
22907 54064 104622 150834 144198 115360 72163 67394 79360 69301 81789 24577 12431 41324
22895 41324 37806 8805 -52890 -45328 -6132 -3761 -34779 -44369 -1802 -15236 -1888 31089
22883 31089 -2220 -6957 -31487 -54678 -64986 -122751 -109239 -18552 -67359 -114055 -91839 -33953
22871 -33953 -18708 -27437 -76256 -75406 -47887 -25979 50244 48127 24505 -15452 -40900 -19469
22859 -19469 29437 41914 -5172 -105700 -87764 -2807 27030 14339 4218 -200 -17237 -13240
22847 -13240 -15093 -20525 -51109 -58832 -28974 15094 17427 8419 -4720 -48330 -20176 -15964 -31022
22834 -31022 -10179 37718 56068 11994 22154 -33532 -76712 -17089 18449 3640 31657 4325
22822 4325 1658 -458 5045 33822 22817 44514 48093 35070 12979 -1065 -5554 -8122 1379
22809 1379 -25517 40129 52813 72765 71504 -8141 -77024 -114042 -90769 1486 11727 49243
22797 49243 60383 65175 136691 124505 42259 -49109 -69823 -47589 19915 49469 39546 -7952
22785 -7952 -29145 -62246 -81715 -10576 31271 -34882 -52299 -8826 20773 21773 -3253 13169
22773 13169 -25883 -85632 -75954 -68466 29434 41923 -34095 -21311 15405 50207 51039 24415
22761 24415 33266 -6179 -3323 23399 46288 6104 -52711 -64047 -55925 -64397 -57845 47637
22749 47637 2124 -20502 -32977 -7332 -442 -33944 -74655 -70137 -36589 12804 3823 -98844
22737 -98844 -144481 -118057 -60410 -29015 422 32204 6764 31437 110910 123450 72752 37810
22725 37810 -48948 -112835 -83795 -7575 -25722 -22812 -31565 -53273 -40943 -6815 28871 3717
22713 3717 4555 -11882 -14697 9696 47273 25365 -56929 -102484 -134858 -80470 -33650 1208
22701 1208 -49189 -74711 -94722 -113970 -165456 -154365 -86756 -25634 -39122 -56090 -60961 -88508
22689 -88508 -91185 -70043 -91293 -66737 -95457 -53657 -88418 -116280 -93275 -86616 -44523 -7358
22677 -7358 1236 23431 23500 16164 -31262 -12703 -15456 -10970 25468 54368 62480 22961 -16050
22664 -16050 2295 38040 48500 -14775 -72551 -22636 9977 -8424 33641 103687 94023 79675
22652 79675 75002 36277 33822 5066 42151 71850 6475 -8958 17772 30697 29117 -44405
22640 -44405 -80055 -52073 -10391 -29595 7063 25159 67269 104947 104083 92572 36978 13223
22628 13223 -17439 -44751 -22678 -23742 -43787 8896 23259 1820 9998 4652 8495 -16918
22616 -16918 -76088 -94608 -77521 -38829 -21471 -22433 -13619 -22512 -10173 87093 104488 116627
22604 116627 98864 58859 57981 24717 52518 73008 104566 121801 103333 55380 40294 73427
22592 73427 99496 114176 5874 -33607 -7336 22269 47835 16797 11448 27718 97314 108627
22580 108627 38908 19193 43472 70940 51307 338 473 61487 134298 78998 28352 868
22568 868 20847 48031 68909 63112 65127 5118 -29437 -52985 -74126 -77636 -57387 -4753 -21994
22555 -21994 -72810 -51733 -10952 3061 42810 7934 60170 108969 155931 152581 80106 13360
22543 13360 19280 -14567 -51228 -61222 -38369 -34912 -65202 -52257 -82627 -167505 -97951 -55518
22531 -55518 -8302 -41769 -97064 -116371 -111772 -45220 -38915 -12977 -28486 -33452 -19583 55445
22519 55445 17046 -97593 -154343 -103783 -47079 -56575 -94947 -169061 -82319 -21448 174 31957
22507 31957 19654 15000 10740 -23984 -39492 -41287 -43661 -32824 -6397 -99028 -131650 -147434
22495 -147434 -116593 -73082 -30947 -43286 -3264 -5071 -166 24770 123721 80753 70702 45789
22483 45789 93616 95613 97672 45563 -11745 -35881 -36027 -57579 -67968 -99538 -110608 -76303
22471 -76303 -33546 -7376 -67601 -83062 10299 67915 9336 20088 23176 13658 -21480 -38690
22459 -38690 -78379 -92699 -92850 -85343 -35645 -16396 20303 59137 63139 89607 65809 23126
22447 23126 -7928 32781 47806 16512 29986 17942 -5363 -13287 1326 40557 57040 16687
22435 16687 -16466 -4135 7866 10142 9366 2951 1214 -35716 -20396 72245 22240 9198 64442
22422 64442 36748 32745 23501 89566 21895 -57866 -64467 -68908 36670 105683 77837 51736
22410 51736 73684 54591 -46677 -88300 -2001 -9274 8246 39204 82980 144678 198033 262388
22398 262388 257133 197129 205060 281324 318215 348276 472856 659378 936426 1340611 1894728
22387 1894728 2433623 2891854 2981613 2682379 2132544 1543781 1145835 846696 640379 518336
22377 518336 409799 362174 334292 292601 251529 222884 200681 171167 179872 142668 149013 148379
22365 148379 88019 88047 96069 98328 67088 45830 50002 31552 -47458 -35110 13277 23702 47837
22352 47837 44671 41599 39579 53053 3635 -16679 -18334 -8180 -16439 -63152 -68740 -65808 -59311
22339 -59311 16878 77130 105198 100016 61122 18587 -26262 -21369 -18891 9653 -16406 -44676
22327 -44676 -37838 -47640 -47721 -1057 32983 63293 121944 172553 166949 191070 148100 65196 33617
22314 33617 42289 23362 23909 21491 -22220 -111279 -119394 -79592 -19335 -6863 -22402 10560 -22024
22301 -22024 -44021 -31978 928 -25740 -5494 -9887 -7524 -32307 -45533 -25676 2806 5508
22289 5508 46140 52596 7001 -29441 57522 74011 29427 30965 48746 -5699 -65907 -33156
22277 -33156 -20146 -30721 -11848 25673 46295 6239 -14790 18184 -27486 -93695 -80774 -14454
22265 -14454 -3511 11282 16136 18825 41766 74727 110996 77836 102123 109280 92107 92350 98943
22252 98943 89580 8007 -107625 -70015 36051 88153 70148 12562 -1145 68316 100042
22241 100042 108309 54737 13370 385 14974 35129 59953 50069 -7933 38593 70516 100291
22229 100291 68034 3341 -48416 -63529 -51743 -81037 -111956 -33768 44133 102282 110095 96384
22217 96384 59417 47497 98348 51141 10535 22167 67452 74089 104671 127386 129064 88779
22205 88779 62889 32822 27365 16163 1979 -14506 -46226 8764 38532 42136 61502 107326
22193 107326 89994 67401 94522 77050 41921 -2299 -1085 32684 73954 57825 938 -15864
22181 -15864 21201 91531 123618 113180 141345 171476 184069 165606 153922 118469 111919 160217
22169 160217 131878 141029 106710 61575 56991 33311 -16697 48301 63884 -3554 -1748 44150
22157 44150 51439 62114 94450 120598 139452 127726 99529 82221 82317 89056 111008 88396 85280
22144 85280 95026 125023 117989 121874 86114 57053 46218 384 -11667 -24982 4590 44502
22132 44502 66456 82209 117142 119361 86795 42270 816 -28578 -2858 -40889 -55505 -13633
22120 -13633 -26222 -68922 -57850 35075 113123 117184 57924 4100 47916 81232 75072 54533
22108 54533 76933 46508 55904 98021 111755 107856 74985 104810 136514 120634 136455 96385
22096 96385 115830 152196 154391 108432 63487 82771 62597 50837 95191 93734 118049 109428
22084 109428 97067 139070 180997 253909 315834 394847 445625 475328 417099 371068 259425
22073 259425 200264 197241 143554 132284 49600 38889 37649 33429 62526 92154 54511 28815
22061 28815 55258 53951 21204 34805 44502 49319 18565 13931 32577 46127 29997 80361
22049 80361 192711 177099 173976 144153 105799 105788 78421 73611 55636 49763 20539 29953 -20620
22036 -20620 8925 6042 -22547 -41382 -86703 -15238 -11323 -12418 24081 8126 2337 56293
22024 56293 40446 33064 40432 72135 94142 132269 60801 74193 59081 115303 202109 232855
22012 232855 225051 196687 219278 216411 208669 225572 248193 215370 181050 196499 204265 221603
22000 221603 198307 153955 191344 200433 243475 229394 182727 243399 223018 175214 141799 149119
21988 149119 195228 187699 233868 232042 157160 107561 174105 202058 158199 171712 150005 174458
21976 174458 178875 149552 138569 87789 90280 109495 143551 213857 250321 249919 237794 217886
21964 217886 238080 285483 350608 382192 389515 364316 412759 384162 441582 528456 642123
21953 642123 707423 671362 620490 530245 485660 416629 415436 431049 480399 423863 410805 357400
21941 357400 349087 333450 277842 326826 382346 388650 435743 484276 490883 593035 673426 746763
21929 746763 813919 946782 1245770 1684801 2244139 2980616 3514719 3581569 3240167 2731271
21919 2731271 2302009 1998770 1787839 1562682 1455702 1463130 1474143 1372027 1214284 1063324
21909 1063324 902649 785315 752114 700093 645203 652952 612837 621758 600965 551518 622183
21898 622183 676163 705161 706261 734133 750137 726873 710579 784711 844321 883311 834617 837618
21886 837618 922626 969722 953728 932377 942923 968864 1005362 1037706 1097359 1251820 1392366
21875 1392366 1368199 1456254 1527537 1526116 1600241 1633832 1733386 1845951 1946864 2013778 2081753
21864 2081753 2178075 2222130 2356900 2568895 2819152 3085066 3349376 3565033 3834617 4118401
21854 4118401 4391572 4670761 4948014 5265125 5640285 6061076 6512050 7051876 7701213
21845 7701213 8552910 9508887 10581957 11791000 13238093 14927687 16996637 19657174
21837 19657174 23088437 27389098 32889745 40238322 50583564 65474921 87606020 121459774
21829 121459774 173772214 252894559 360406670 472665178 540207484 526210982 440249400
21822 440249400 329595256 234290641 167257344 123498349 94805011 75292541 61222767
21815 61222767 50527182 42216602 35675062 30528992 26336409 22905234 20024802 17637035
21807 17637035 15657638 14020526 12599384 11355233 10307605 9470036 8614421 7724280
21799 7724280 6861540 6131552 5573256 5121456 4738471 4390546 4062435 3797154 3650676
21790 3650676 3514790 3354377 3234062 3042797 2885259 2698949 2454640 2321498 2203270
21781 2203270 2175899 2076439 1994232 1898374 1776221 1685788 1658758 1647000 1594364 1486853 1416068
21770 1416068 1360027 1305938 1298160 1320342 1280173 1192671 1062142 958349 879511 798379 766294
21759 766294 777472 866692 920072 934226 891087 798590 798321 770396 751611 731986 728721 726888
21747 726888 722254 695785 688175 702203 681998 612854 529532 552253 543124 541411 504341 543219
21735 543219 580532 590954 623341 729561 880037 1079732 1487240 2016682 2514950 2980454
21725 2980454 3231508 3086830 2554850 1943024 1474619 1123444 954776 873887 829137 746628
21715 746628 673813 572729 507173 489026 477502 456580 481345 470155 411498 381936 344975
21704 344975 434673 528920 538757 556947 614330 605854 527692 415759 334663 270290 265972 267506
21692 267506 254757 207124 230284 263519 275745 281484 230355 210805 190782 246716 302356 300278
21680 300278 279177 206144 162368 170350 224660 208678 128885 67823 86902 122435 161683 212933
21668 212933 213431 148966 167481 172326 183950 250209 289292 308402 202979 125371 158506 154550
21656 154550 68330 53718 35054 69973 128963 80812 11474 -1271 2047 -50095 -91981 -30704
21644 -30704 7723 54779 44281 6085 58961 59403 60201 105565 130888 128696 86693 67072 115254
21631 115254 127180 73183 79980 96471 94391 51278 45277 19045 19969 66279 79608 30717
21619 30717 58546 71119 100480 105571 129939 173510 151220 107480 77470 35802 -16062 20213
21607 20213 58374 40522 1014 30318 36169 72467 98137 67131 23531 106507 109647 34058
21595 34058 -33558 -25672 34642 82568 111614 115845 75105 90196 96925 51682 21530 81275
21583 81275 117197 141508 107107 95460 151203 154608 92796 16006 24389 103198 81594 66446
21571 66446 62541 62225 48184 67053 86947 113663 137086 112842 90849 68977 46792 33352
21559 33352 55528 39569 88210 67421 40920 21348 -22560 -57983 -61333 11040 61534 11239
21547 11239 -63942 -46124 66601 108557 153065 153491 101395 155174 136202 120204 121210 116817
21535 116817 91770 62678 50732 31115 62823 81985 106736 92625 32495 -5810 -63283
21524 -63283 -95742 -142026 -82186 3831 15705 23676 42008 -10847 -74516 -88628 -119 29311
21512 29311 4254 -7020 -54965 -85059 -101857 -113308 -41426 13485 -19050 -39048 -59679 -26391
21500 -26391 36627 11593 12517 84868 88843 36116 22000 2628 -22394 -27714 -30523 24634 79113
21487 79113 74940 75816 67031 25631 -53426 -64545 -46404 2490 16624 47542 58939 107609
21475 107609 27291 -22196 -2860 -6691 -36046 8690 37979 40000 61948 85502 62480 17116
21463 17116 17227 45218 42310 694 -43275 -22922 80860 90790 104110 116316 76588 76665 -2898
21450 -2898 -22522 29346 107537 113259 129651 125532 99911 62595 34978 36089 19585 -19682
21438 -19682 -16878 -6065 25039 13100 52865 57221 70513 15505 -30731 17518 38994 37782
21426 37782 33133 -18436 -45518 -64136 -30148 22738 7693 -15899 -29775 -59491 -23682 7893
21414 7893 -23578 -45426 -68654 -84620 -49388 43731 55503 -14957 -100944 -97777 -51622 -24090
21402 -24090 -54556 -19255 51140 54292 -42 -22663 -41477 -50475 -423 15030 -15252 -47615
21390 -47615 -52037 -111749 -74004 -65874 -6661 32509 -19576 -62502 -53889 -39455 -35416 -33495 480
21377 480 262 -26732 -43959 -49090 -15892 58392 67616 30002 21544 41566 36350 -34262 -104256
21364 -104256 -84532 -52443 -50143 -62642 -16929 -280 12653 43914 41831 33237 49637 44688
21352 44688 68579 57749 11176 48249 97994 78940 12695 46791 33754 50984 8116 28227
21340 28227 102447 114485 60446 37954 -48693 -76910 -87403 -41918 -39083 407 47 -30622
21328 -30622 -37965 -7824 28931 -20495 -84917 -130229 -117409 -125138 -99978 -41985 -14058 19467
21316 19467 -16286 -22908 -81200 -123535 -145233 -83629 14992 63462 65460 61716 45400 22787
21304 22787 -12384 -27604 -9156 40234 61791 112031 130546 112263 102413 25160 29729 28548
21292 28548 21165 12742 2022 -43095 -79213 -92497 -97237 -79299 -74929 -112114 -116897 -89453 -68926
21279 -68926 -31242 36437 61189 24155 69212 106962 72700 92488 68452 68428 143315 169425
21267 169425 190455 217955 271456 333113 398269 481010 638322 851411 1182632 1623065 2271797
21256 2271797 2816105 2998503 2743417 2178984 1611148 1157324 815890 618295 502987
21247 502987 445434 389833 297057 271536 217353 182852 154765 120556 82378 102654 82885
21236 82885 43946 20181 26256 -5205 209 25535 17244 -49163 -81540 -45573 -10435 -16767
21224 -16767 20700 69119 91297 68035 117900 149553 89788 85079 44451 -18781 43545 47962
21212 47962 21891 20918 -36341 -52397 -76073 -47655 -39650 -103773 -64286 8285 44608 41325
21200 41325 91077 112546 78138 74329 42164 -22988 -33030 -101213 -91119 -29548 8133 -29435
21188 -29435 -38735 17930 8114 7854 34739 80788 61251 1124 -19356 9743 18495 -20884 -38026
21175 -38026 -39358 -26126 -60067 -24676 70496 29950 7694 15449 17575 5480 41059 47023
21163 47023 48889 -20819 8617 -23901 -61102 -8306 24535 48086 -872 -4078 5082 -9036
21151 -9036 -3824 9804 19734 -16326 -23412 1192 57215 56798 61581 71013 -675 -50056 -69055
21138 -69055 -65411 -35056 -43738 -13245 -3207 27550 42636 74586 42083 49588 34914 -23873
21126 -23873 -44809 -32563 -30384 -70932 -149333 -114508 -81978 -88108 -118694 -109140 -86176 -74761
21114 -74761 -78447 -35268 29616 816 -90921 -109060 -90765 -65831 45567 95659 82208 84037
21102 84037 46335 19076 9356 -23577 -25211 -53244 -63674 -63627 -56147 34969 71874 87380 32297
21089 32297 -20150 -55390 -123564 -138955 -155448 -112690 -98751 -56230 -80333 -74249 -1133 13188
21077 13188 -64981 -92597 -90633 -53620 -71483 -138893 -149255 -161098 -113621 -64254 -86463 -65248
21065 -65248 -62364 -94103 -33521 19041 25062 40489 36219 21758 25540 83673 112317 27829
21053 27829 -47209 -35199 -30676 -127212 -141055 -118937 -101640 -56099 -32387 40648 87245 64898
21041 64898 73674 20368 -87224 -133772 -147176 -127534 -47853 -40748 -60256 -54194 -85902 -128707
21029 -128707 -112964 -80961 -75528 -27807 -5167 -59055 -27484 -15266 -13137 -46871 -119871 -82828
21017 -82828 -27645 -1426 -29790 -93595 -119769 -70260 -65520 -82936 -112049 -150651 -151080 -94079
21005 -94079 -81145 -53574 -53120 -46834 -36617 -52662 -84660 -34952 -68119 -68136 -8986 -67695 -97271
20992 -97271 -111099 -80940 17733 61312 46026 4208 -58892 -67489 -39303 -42119 -36533 948
20980 948 32737 62757 78542 29243 82362 59719 18230 19362 5932 -42769 -73679 -112721
20968 -112721 -93860 -111710 -109141 -33395 -12075 6628 -4197 -30120 -53169 -89949 -71786 -70739
20956 -70739 -117834 -59935 15257 31400 -30593 -47408 -17488 7746 -106355 -194270 -186064 -153695
20944 -153695 -121868 -113209 -76474 -69588 -135292 -88066 -64627 -54729 118 22215 51267 18462
20932 18462 -44049 -85602 -68337 -8622 -45356 -19410 -15701 -25648 -18469 14327 11250 9460 -4934
20919 -4934 -38532 -30871 -6109 -10582 24340 76118 20310 21828 -11351 -6938 -8094 4323 5634
20906 5634 11591 -34422 -62644 -34185 -50168 -73001 -81807 -67366 -5312 59897 74476 42220
20894 42220 -16454 -65363 -76474 -50597 -78048 -83846 -24360 9794 -62883 -91038 -78473 -415
20882 -415 71821 31168 -14330 -53436 -38736 4884 14564 -12758 -50815 -68732 -65498 -81326
20870 -81326 -134818 -146358 -88923 -36384 -66846 -77165 -116491 -103904 -42650 26306 -8007 -26315
20858 -26315 27104 60923 113255 83610 56528 -330 -12847 21538 43308 40340 12394 -50401
20846 -50401 -70404 -60689 -78264 -55854 9692 37294 17148 28593 -11038 -430 -22498 -3254
20834 -3254 -66392 -40106 -26777 -16081 -6206 -65551 -117774 -135930 -128121 -57418 1437 48818
20822 48818 43999 -6144 -39394 -36841 -3361 26030 15522 45664 26104 5153 -28081 -33224
20810 -33224 -38691 -35482 -84475 -51646 -78616 -43873 -596 -6707 -48109 -33448 -68511 -58245
20798 -58245 -15462 24904 37960 -13688 -88184 -102947 -88423 -54815 -54545 -56103 -37320 -24507
20786 -24507 39287 106891 124593 41829 -38348 -71626 -59898 -33161 21914 61440 36267 34360
20774 34360 52983 44689 40071 13129 1650 -29924 -27149 -5803 -11252 -9754 11799 3313 -7326
20761 -7326 -28722 15942 78133 93898 44540 35023 -19557 -3926 -813 -7208 -7502 41142 26336
20748 26336 -10170 15683 40806 98804 56682 4391 44445 11163 38435 55890 22128 -11755
20736 -11755 -59854 -57850 -39269 -59766 -77245 -25595 -7242 46351 43408 35566 12636 -8424
20724 -8424 -47049 -21298 -37336 -57437 17763 31121 6176 -45189 -80334 -49786 -42509 -126193
20712 -126193 -143539 -117495 -105865 -34828 1753 -365 -30904 -26625 -34979 -61666 -34192 3438
20700 3438 30732 24625 94382 75884 53438 48977 34053 672 22662 10165 5544 37592
20688 37592 -4183 -30508 -30919 2108 -41817 -102082 -113616 -119701 -45772 -31156 -54836 -55916
20676 -55916 -9634 3127 57442 80452 79494 39055 -19619 -316 5672 12634 -9218 -55154
20664 -55154 -49505 -42034 -48644 -40351 -38245 -64275 -42908 10589 15704 8147 -29031 -57262 -74194
20651 -74194 -73970 -65307 -24839 55281 59431 34744 -1887 14870 5862 -52955 -102874 -87333 -30036
20638 -30036 -24868 -27139 12552 13512 11143 -630 34162 14988 31970 61844 88064 82244 8779
20625 8779 -24910 2057 -2827 17924 20933 28457 20500 22065 16175 9590 -768 -18837 -52793
20612 -52793 -78449 -74527 -56241 -33873 -3850 -6538 12731 -8027 -31159 -43989 -55118 14293
20600 14293 62569 54161 33414 13671 6034 2750 44023 -1779 -28993 -30741 -28278 802 -90
20587 -90 17640 45585 27335 9915 -82375 -65214 -57801 -70569 -40465 -39957 -77834 -11727 9057
20574 9057 -24085 -27311 -2922 -45973 -99422 -114343 -58409 -85311 -108692 -72891 -56464 -47124
20562 -47124 7083 40322 54208 61274 34602 21102 -24975 -22496 -42693 -37155 -92874 -111268
20550 -111268 -123021 -104958 -57030 -55118 -51399 -60485 -35159 -99473 -124182 -90839 -67044 10653
20538 10653 8443 -46298 -131269 -119062 -88892 -74803 -77163 -62627 -65155 -44466 -10701 -8274
20526 -8274 18293 10813 -51534 -56697 -37084 -69642 -17449 -11497 -39248 44732 56613 45791
20514 45791 33979 12974 -17818 -74449 -82304 -57888 -80247 -59616 16343 100793 62375 -61553
20502 -61553 -125368 -81892 -50540 -22066 18477 33495 50474 61383 66316 60315 27941 -44437
20490 -44437 -43493 -13664 -10407 -20319 -1757 3591 -53634 -36254 11422 14490 2287 -104983 -99649
20477 -99649 -99244 -91635 -71016 -83660 -48220 -20048 -6917 -26777 -53356 -66878 -76450 -61626
20465 -61626 -51362 -39803 -39190 -42746 -33370 1038 49871 46538 -2052 -103408 -123037 -138202
20453 -138202 -99291 -129033 -92043 -12392 -14071 -55851 -103494 -46668 11532 12336 -33752 -51278
20441 -51278 -40832 11496 -18478 31566 105590 118767 17765 5120 -21472 -76782 -28613
20430 -28613 12946 62049 9345 -7933 33517 24732 -12344 -69783 -17674 6157 -34266 -49413
20418 -49413 41086 65859 -10822 -54462 -24460 -46746 -80313 -105484 -85242 -87251 -45412 -13435
20406 -13435 50868 18784 -35293 -125565 -135131 -66690 -55298 -66040 -75104 -85516 -33651 15807
20394 15807 -40881 -43382 -51006 -49225 -47209 1 33207 56116 -23546 -70485 -88909 -55980
20382 -55980 -44326 -23265 29699 -22405 8421 40961 42681 41762 105364 126323 82469 28961
20370 28961 34804 19284 19392 16960 -65900 -82850 -49202 40349 66208 37324 -7343 -16554 30497
20357 30497 77126 55948 44587 610 -28697 15664 28278 21712 8037 -37386 -10648 -14578
20345 -14578 -16101 -11817 -13959 -17712 -58110 -66599 -18274 42988 35636 48408 95436 3697 -50754
20332 -50754 -21061 4199 27636 -7871 -32718 -25972 -24520 -63148 -46256 -9386 -35876 8078
20320 8078 25879 -12675 10858 41231 22118 70351 72135 27306 49082 110353 155254 100965
20308 100965 48061 35052 -6791 -4060 11617 -11884 -397 -11899 -47935 -102397 -58047 -60866
20296 -60866 -43679 664 2353 -19080 -56582 -39850 -14418 -35912 -72177 -50979 -60060 -31465
20284 -31465 17664 -41149 -87560 -81787 -42532 -2702 27066 60346 58301 51511 4054 -13997
20272 -13997 -11765 -100934 -144789 -97653 -100052 -110404 -107849 -115264 -115418 -122935 -107408 -74109 -16709
20259 -16709 -5595 -12517 -17881 -22483 -9924 -32541 -24402 -85578 -90271 -14371 10878 8402 -20420
20246 -20420 -35127 3255 15966 -1640 467 -37063 -31451 9594 1741 -87478 -69613 -23965
20234 -23965 -33994 -22463 -9317 315 -14280 -59237 -55570 -36926 13310 7331 -13515 -31338
20222 -31338 30138 35559 -18071 -55309 -27992 -83306 -154315 -113530 -49538 -23332 4616 -71449
20210 -71449 -60331 3444 -63328 -99221 17945 27814 -16886 -74051 -60096 -74311 -109738 -120340
20198 -120340 -132475 -109984 -110061 -116388 -148716 -174636 -169192 -124447 -96601 -113931 -55198 -38938
20186 -38938 -34951 -13830 5421 48888 46640 104187 114813 94766 36631 25352 -4773 -3333
20174 -3333 -11371 -20715 -33345 -33134 -28401 -12348 -26146 68608 61438 503 -402 19861 15456 5324
20160 5324 -2607 -59597 -28802 26615 5061 15332 4044 -17473 -30091 -88979 -133519 -138307
20148 -138307 -101973 -80738 -14340 6599 17417 20168 20311 54179 81471 56378 42317 31113
20136 31113 49337 71449 53431 43091 83284 60915 -12873 -22068 -26507 -72561 -102289 -79197
20124 -79197 -38181 -42402 -24613 -58494 -62466 -98081 -76087 -36106 -54091 -37748 -101840 -161710
20112 -161710 -123446 -92760 -80907 -48149 -8842 32778 63796 37777 -5091 -113099 -121194
20101 -121194 -74586 -53791 -61384 -58026 -8590 65374 54607 66408 39983 -8356 -40141 -61966
20089 -61966 -13093 -6796 -71482 -102185 -80124 -69365 -46946 -28615 7762 1456 -24701 -52857
20077 -52857 -45163 -51469 -10555 50327 90144 91444 130013 87111 56500 33271 58461 65372
20065 65372 55716 30915 -45307 -5478 41479 15213 -32057 -101185 -135504 -155103 -109886 -110518
20053 -110518 -132222 -100106 -61407 -3855 71134 47993 32832 10273 67558 -17221 -12401 22586
20041 22586 82134 79759 80026 43825 -13373 -80123 -85588 -55562 -16354 15651 -47350 -87488
20029 -87488 -114585 -54612 -28103 49538 65411 44642 27892 20424 36347 27083 11692 -31017
20017 -31017 6215 22671 -39390 -87748 -31165 -13246 -44333 26820 1196 4117 35605 -22450
20005 -22450 -41701 -39419 -86512 -127685 -119404 -135615 -143981 -122601 -57896 -30329 -42367 -39181
19993 -39181 -789 47074 61222 -4893 -43582 -2099 68983 37980 -20512 25473 8094 -56388
19981 -56388 -63763 -62278 -88737 -72982 -16064 3131 47293 19421 20393 27697 4461 -5501 -7584
19968 -7584 -13813 -70984 -89660 -78416 -21069 1737 -14711 -64109 -90395 -6906 90135 123428
19956 123428 182955 192277 156266 125142 30111 -3019 -654 26906 50224 8399 -28533 -7251
19944 -7251 35163 93572 121631 18573 -20245 7817 26255 30106 54203 31762 37395 21692
19932 21692 48554 30178 7926 55734 86822 39419 -9575 -88698 -64663 -27645 -44538 23564
19920 23564 105994 108827 101068 58395 67808 46992 25253 4303 -15928 11576 61626 51513
19908 51513 -3189 -45430 -81189 -85622 -26788 1689 -23868 7686 36244 72847 82592 66303
19896 66303 10286 -23820 -10422 -14921 -53811 -65639 -66719 -52197 -44268 -51122 -49161 -16817 -38258
19883 -38258 10304 80828 74335 25838 -16826 -25442 1350 13371 -50891 -63762 -88343 -62672
19871 -62672 -31183 -19293 -44868 -73246 -70998 -18648 19375 -7936 21520 10495 3854 -14223
19859 -14223 23651 82862 67046 -22162 -61906 -27837 10717 -22556 -52923 -79249 -53243 -34330
19847 -34330 -50851 -18515 -976 -41116 -10120 69952 115256 25866 6495 66291 10830 -5976
19835 -5976 -30888 -85913 -83607 -48771 30009 94414 134711 191878 142995 74841 -3904 9813
19823 9813 71058 5917 21338 36752 54003 27817 -46800 -60527 -72604 -46569 -60038 -100597
19811 -100597 -60018 -5009 -4849 -22309 11523 27720 -55893 -110174 -103454 -31310 30881 54884
19799 54884 14126 54340 125488 84855 12054 13499 11029 -25776 -5949 33735 13080 -6429
19787 -6429 -19533 -25175 -13851 -11958 4916 -25017 -54838 -70409 -28468 -2356 -21494 344
19775 344 -29593 -48365 -80791 -115861 -100313 -75141 -99947 -174269 -133768 -45786 -22327 -19076
19763 -19076 -36355 -20429 -15980 -33706 -97857 -103790 -64686 -17100 -40392 8806 53048 17188
19751 17188 -53533 -101070 -82994 -83248 -86184 -86537 7 27170 8221 23247 88232 64824 28136
19738 28136 -36180 -48580 -80257 5501 72636 35935 26874 -56688 -75781 -64881 -59186 -64345
19726 -64345 -11221 -26155 -89905 -61086 -33099 -38300 -61031 -38912 -22836 31809 40114 -38524
19714 -38524 -73796 -74474 -67020 -64492 -84008 -139312 -117073 -58657 26215 68076 55184 31731
19702 31731 35617 -34806 -96478 -53005 -15772 -17419 -7107 20893 1892 -65819 -63983 -4471
19690 -4471 63486 117612 69219 2255 -16679 -52454 -47934 -69197 -28944 43804 25634 -10523
19678 -10523 -13913 -29402 2035 -16094 -43607 -24300 -22230 -389 -9263 10525 -23453 -47824
19666 -47824 -88547 -79864 -63513 -44070 -19217 74055 49508 -37775 -43797 7612 32565 -18692
19654 -18692 -23768 17125 42370 -48004 -44582 56175 69655 45969 33346 -46342 -34438 27145
19642 27145 65387 75144 84605 69449 14189 -19028 7797 74824 50176 31237 -28737 -24123
19630 -24123 -63895 -57220 -33953 -49471 -53126 -35478 35319 54931 64092 78287 88773 52038
19618 52038 10512 2378 -28225 11278 31897 -28264 4501 34296 29950 14646 -46366 -43906
19606 -43906 -37905 -55278 -48163 -51643 -25722 -36849 -17791 -16150 13990 13809 26634 -2994 -322
19593 -322 -628 -31798 -45271 -47603 -62712 -125299 -183058 -167793 -76289 -117196 -168007 -155782 -201731
19580 -201731 -171555 -73458 6683 212 -45375 -76502 -25141 55161 105951 33733 -17200 -134896
19568 -134896 -111192 -36525 28111 -16055 -21303 19379 -390 28522 25666 -594 32920 17345
19556 17345 19148 40499 106245 66426 -6928 47312 106225 52944 49023 86536 63791 29220
19544 29220 86335 130425 93903 65717 52533 38598 8911 7837 -10464 -7370 28367 -20228
19532 -20228 -21578 -53353 -49492 -31276 -43802 -58833 -82987 -48348 -32088 -44124 22755 75759
19520 75759 46203 47088 3523 -42823 -69192 -29246 -11165 -19150 -52564 -11288 24948 43041
19508 43041 13861 -34215 -56829 -32646 690 35550 32519 52153 28808 15878 -25507 4957
19496 4957 -22575 -13385 29111 7033 -102161 -116553 -31575 12661 75395 36067 27316 52970
19484 52970 78442 48449 -2440 -32070 -42028 -3437 34627 -18227 554 40196 1010 19318
19472 19318 5246 -1974 31105 -5524 -27603 3819 2021 -20670 -66105 -62441 -71882 -32930
19460 -32930 47447 61872 31091 17436 -42032 -573 17782 -1480 -1408 1036 105606 147394
19448 147394 83244 33262 75898 114164 85862 141066 106078 61170 5055 -5826 -21204
19437 -21204 1691 -19032 19830 106632 141341 110668 93590 102204 89630 94750 115727 76326
19425 76326 -8906 -48627 -17512 -1230 3567 -21773 -24022 -8035 46199 110451 115504 121516
19413 121516 109402 56984 61974 46429 19417 4717 61366 93955 74606 -11207 -79220 -148247
19401 -148247 -99286 -47750 -30274 -32460 -15173 -419 -5218 5229 48368 71158 37649 57488
19389 57488 71563 103179 150204 134118 118496 88975 89585 20859 5120 48184 50980 75633
19377 75633 132543 128753 93383 65959 15264 51881 47017 1602 -38852 -25714 -13604 42915
19365 42915 33204 8167 -11219 -20486 -12381 4021 -14702 -23594 -23207 5649 24681 49223 87798
19352 87798 35565 -37574 8493 44513 41950 65018 23332 -11856 -27259 40395 100940 88304
19340 88304 45728 32296 -25469 -36153 14463 -5953 -61359 -65693 2886 2976 11939 26654 53788
19327 53788 41943 -179 18353 6542 36487 25812 3433 31694 -3644 36724 32282 42612
19315 42612 102945 123940 91796 82652 71327 68593 143988 151443 86097 70488 36855 10979
19303 10979 28661 28275 39040 96020 47291 21753 57773 -3119 -48808 -53191 -24603 48474
19291 48474 72062 94702 104034 68856 71968 48158 -30607 -15496 -7143 6396 52257 43481
19279 43481 30306 -7021 -4474 22640 39074 81009 93798 62318 2263 -49903 -7024 5265
19267 5265 48050 65583 44068 38204 -3379 -52388 -31724 -19855 -37890 -16044 1347 -3585
19255 -3585 -15842 -62915 -89113 -60740 -44067 -47601 3845 2228 -25955 34266 31750 64345
19243 64345 123429 82656 60909 73533 12213 990 -23624 -4592 33130 116 -90035 -47082
19231 -47082 -1507 28946 85125 149502 198641 196462 203428 176175 111551 79236 61524 40748
19219 40748 42028 3523 -8886 -3221 66240 93458 89575 23931 16906 45530 46087 60484 82871
19206 82871 79988 42374 -2473 62495 106210 92964 7426 -4308 -33031 -74006 -33951 78082
19194 78082 112315 89351 39572 -2124 -32747 44782 119204 165646 212208 158738 110675 91639
19182 91639 77506 28717 59478 132323 106637 29739 55041 110047 95912 49886 107666 143724
19170 143724 124921 78652 70753 90108 128782 180935 233688 166953 106109 64993 37276 -12957
19158 -12957 -27338 -430 12715 -9317 -22197 -11459 14323 65011 52717 12631 -8161 18361
19146 18361 41097 67327 55987 -7464 -46978 -14138 25489 49017 12016 12590 -25075 -37003
19134 -37003 -44962 -75524 -73729 -73441 -57926 23190 82090 81781 25439 16873 37056 21671 24592
19121 24592 28437 62318 88591 83578 47464 31028 56980 126150 134089 101026 6030 46926
19109 46926 78749 54508 57656 77774 29447 55437 85866 31290 40005 69098 58039 28698
19097 28698 38881 31176 31838 53897 63164 43556 90024 118505 113826 89486 72259 52471 38645
19084 38645 106543 121651 148287 137748 109908 133107 97355 84152 95206 159199 242388 225773
19072 225773 219555 172278 151467 227989 325016 452548 594512 793274 936046 895792 722754
19061 722754 549133 474636 667345 966160 1063389 1046195 907213 717932 497178 351152
19051 351152 252132 198376 222653 292182 348334 327664 400031 484379 633541 881223 1056338
19040 1056338 1098912 900894 773715 744594 760167 831644 999470 1025648 936796 711917
19030 711917 479536 339755 269977 191237 187178 197629 222324 227332 147261 25737 -19223
19019 -19223 35872 79054 77375 131294 144389 165008 153464 130674 142331 170824 262358 272602
19007 272602 208774 146277 140596 115403 -8831 11664 107905 178419 147552 123221 120803 93354
18995 93354 53510 107325 71938 64085 77528 51140 -9057 -24252 2447 111 13119 28853
18983 28853 1827 14752 20991 52160 36281 42790 29448 23629 34892 75733 112732 49076
18971 49076 55693 71161 89447 101585 146187 121876 99197 132819 119551 69495 -4386 138
18959 138 99808 118819 104985 133156 154191 102076 103881 194387 219057 225875 174018 190087
18947 190087 179508 206760 210578 364994 591288 773522 953976 1101622 1030949 880380
18937 880380 811467 828560 959830 1129352 1248809 1201052 936797 644303 435868 350096
18927 350096 320857 309892 397658 404387 372097 315142 282903 222869 176418 224679 206384 133450
18915 133450 222225 390859 463528 507630 595911 839200 1097297 1151971 1056173 883975 740994
18904 740994 766319 867647 1054069 1159936 1050106 820237 570788 431227 376555 325535
18894 325535 297595 321829 277603 194803 165998 157064 124915 132784 89749 97632 133761 138341
18882 138341 148134 151409 203217 210813 158306 150177 153399 112207 78540 97089 108063 33068
18870 33068 -11865 -56271 -22073 47839 83530 98496 114328 149962 174553 208631 216698 158442
18858 158442 150977 189319 198794 128433 78345 83921 115505 114383 107122 76440 141087 198869
18846 198869 169969 114259 116436 132367 111964 123018 109405 -2109 2042 6853 -6042 50890
18834 50890 110408 142053 160733 136616 145505 160406 169850 160579 133013 117088 64572 52345
18822 52345 66186 131404 199438 214011 179331 128058 76035 37655 49168 82596 107604 156225
18810 156225 106233 119630 80530 40748 123580 219386 249433 252923 279123 280972 274865 322399
18798 322399 373447 404790 427152 359785 257905 305305 414143 470661 485765 483684 453397
18787 453397 395965 426482 470968 456354 457110 415773 379128 378769 342624 337023 326442 249806
18775 249806 180628 156437 215672 233713 264496 289756 361814 527298 764770 887951 791734
18764 791734 595096 436814 337976 335047 351033 305407 325083 366679 369272 370518 359662 347618
18752 347618 304452 237396 231896 320146 369343 329572 296742 260774 217719 176641 146369 209213
18740 209213 259704 259717 235901 176142 205915 250989 245563 265830 293212 262005 222416 204628
18728 204628 173790 112473 70056 167930 272412 239825 240282 291669 405466 563971 770580
18717 770580 1052282 1417089 1866197 2030414 1733734 1221408 951800 767539 665464 621718
18707 621718 533599 438162 388513 357008 349076 427885 460416 456443 444745 493914 565994 646659
18695 646659 743498 923469 1219277 1716372 2178674 2202263 1803651 1275304 902295 720626
18685 720626 625275 521754 477716 468731 449704 427681 423854 373344 380658 378416 333412 317743
18673 317743 280480 286113 296188 288667 295994 332615 397558 359067 341437 415686 456157 442759
18661 442759 393751 404225 490942 526770 513094 470421 458012 484379 426124 390095 384875 387613
18649 387613 341938 334658 374703 423918 422397 359153 365416 364296 311078 413548 492721 484652
18637 484652 479807 510450 541353 522745 543187 500996 527924 558413 577637 582810 552280 551428
18625 551428 500215 536546 514759 468316 451209 380117 367610 385230 413648 409031 445436 479506
18613 479506 465591 384622 385341 457118 465927 428621 413320 492056 591626 661804 668430 646028
18601 646028 646714 662231 775908 829165 829325 761522 713498 679113 671210 661798 690582 734783
18589 734783 729447 762059 718730 696613 772760 801164 805376 804377 753343 774090 896583 940301
18577 940301 952952 1015931 1088219 1124397 1165780 1266961 1381846 1430255 1606390 1915918 2209275
18566 2209275 2400322 2445718 2340031 2273411 2335735 2521316 2804321 3047941 3113048 2992157
18556 2992157 2881626 2875218 3055888 3416702 3937935 4443736 4933866 5331949 5623328 5996754
18546 5996754 6685354 7769445 9177197 10590864 11918309 13312913 15270166 18348658
18538 18348658 23488114 32279282 47212476 72457814 110455590 149260235 169225571
18531 169225571 159942358 132506640 110030534 107545952 128715448 163718574 187325640
18524 187325640 181863383 146901843 104592546 72244291 53185553 42948504 37534945
18517 37534945 35093755 34737920 36529013 41484387 51873207 71508103 104956493 148321022
18509 148321022 180295079 184387808 159990484 129872660 115060334 124895234 156822366
18502 156822366 189596179 198598367 173125012 128071649 86311194 58107775 41571488
18495 41571488 31910657 26026944 22157078 19366872 17078504 15038198 13308073 11777604
18487 11777604 10405932 9200907 8262695 7507410 6919274 6365818 5917314 5516464 5007741
18478 5007741 4522517 4242674 4098694 3962809 3757139 3426571 3175363 2939617 2798186
18469 2798186 2724952 2739725 2659786 2515067 2265149 1995784 1761707 1599926 1540406 1468612
18459 1468612 1359758 1219132 1191335 1199055 1180887 1153480 1122382 1110213 1104025 1113646 1107552 1141924
18447 1141924 1137546 1036078 959147 952477 932527 957125 1001287 994516 969524 952064 862240 763263
18435 763263 753253 803793 820585 839704 821253 721391 723577 783057 851543 993450 1126613
18424 1126613 1227487 1226565 1118701 993780 856127 826577 862024 861945 850250 856842 869728 895354
18412 895354 948684 1038769 1186325 1244278 1183097 1105507 1093993 1140011 1196522 1265606 1355412
18401 1355412 1429544 1446248 1424936 1427175 1373457 1491006 1739416 2058914 2482993 2796962
18391 2796962 2724134 2384044 2059353 1963286 2052845 2240901 2415520 2550697 2674937 2798068
18381 2798068 2821661 2761264 2795083 2910476 3118965 3464759 3754092 3949246 4134702 4540300
18371 4540300 5171452 5793817 5987764 5717789 5542283 5677129 6243278 7213953 8355017
18362 8355017 9545114 11057424 13189945 16235845 20517284 26901863 37682532 57030447
18354 57030447 91156674 140781655 181248806 181541091 148251239 112809104 96307086
18347 96307086 104086694 134945859 171950737 180386712 149454826 104256619 68562869
18340 68562869 47759354 36690085 30240462 25691086 22100792 19475713 17807878 17050768
18332 17050768 16975100 17217087 17625551 18405351 19998859 22985762 27881800 35602928 48922566
18323 48922566 73070728 115211283 172927817 213329035 205069344 163146675 124133920
18316 124133920 109010914 121710623 158933161 197046066 198480031 158892435 108365568
18309 108365568 70517839 48518788 36369026 29033174 23881067 19879052 16794877
18302 16794877 14635965 13140220 11957327 10825557 9709702 8767395 7977480 7322776
18294 7322776 6858219 6407916 5915265 5580115 5269238 4799910 4337331 4018584 3989628 4166115
18284 4166115 4383164 4316980 4085841 3751776 3450944 3251391 2975928 2728842 2561663 2446582
18274 2446582 2448733 2566613 2481008 2291915 2166900 2205629 2389313 2420162 2228473 1959476
18264 1959476 1708684 1608958 1624300 1632554 1528987 1467689 1419208 1344333 1208798 1101695 1072982
18253 1072982 1049632 1087734 1057191 1019279 912700 818023 810283 868383 859319 811195 815195 856343
18241 856343 815792 817251 816945 769689 778079 819587 867219 877952 925014 973886 934436 925554
18229 925554 863901 867111 882431 868206 892552 904120 914458 906814 907080 832663 823350 820166 814926
18216 814926 810543 799577 844744 902499 916081 910524 936921 971921 981265 1063533 1073255 1043694
18204 1043694 1044123 1067062 1141688 1223060 1352580 1476078 1529348 1615244 1645508 1626889 1688636
18193 1688636 1768800 1822665 1913707 2180001 2559282 3135066 3961945 4863086 5415054 5663000
18183 5663000 5614357 5152241 4466750 3974016 3804284 3807209 4049315 4438343 4925655 5394489
18173 5394489 5926598 6599788 7499076 8728102 10358687 12371330 14362970 16633046 20073056
18164 20073056 25645512 34499089 48489670 71199844 110689290 180762587 287754228
18157 287754228 370364256 345633075 251102890 159145806 101616703 70389912 52896941
18150 52896941 42373757 35722655 31355248 28516765 27118725 26932635 27074205 27044943
18142 27044943 27476248 29659905 34671557 43571886 58879957 85620655 133887608 218648750
18134 218648750 334705493 394019295 340193748 234571185 146428357 94276131 65968157
18127 65968157 50005182 40441381 33833936 28533260 24211123 21072760 18975559 17228511
18119 17228511 15493149 14066591 13179235 12985976 13655041 15280135 18485326 24535193
18111 24535193 36123411 57817737 95057132 132196660 129067628 95048678 59336196
18104 59336196 37219063 26073424 20280787 16476798 13392083 10963612 9060016 7625814
18096 7625814 6518303 5665498 4998791 4443274 3955125 3542924 3298503 3113981 2992032
18087 2992032 2886531 2719283 2532707 2393465 2274449 2145847 1924903 1746462 1683703 1647985
18077 1647985 1534207 1479490 1406049 1336085 1292037 1254695 1111871 988163 994667 919721 863166
18066 863166 883540 951235 1019146 1015016 966969 916981 845535 882542 882410 872224 865528 915578
18054 915578 890582 856833 827338 826756 810909 780572 692063 598524 535940 517680 545303 641413
18042 641413 675507 676630 721609 673218 650172 661210 628425 612065 686179 760151 848244 912005
18030 912005 912409 767433 653579 646003 650817 666800 680058 698505 665813 609664 629436 659865
18018 659865 618484 659599 687780 668903 601320 571617 638115 641661 590994 594638 673334 648344
18006 648344 640538 602904 562876 610619 683841 719068 710733 708804 776277 897108 1123140 1273840
17994 1273840 1347974 1314087 1201858 1122052 1094295 1132039 1214490 1332844 1328862 1265775 1186000
17983 1186000 1060958 895258 718395 617013 590421 637302 721441 788504 863630 995353
17973 995353 1208743 1464440 1642705 1653909 1471563 1281698 1096908 1106690 1244186 1382108
17963 1382108 1443544 1424918 1195242 958943 851693 733178 636214 612164 654932 676833
17953 676833 737225 749639 656051 591721 560581 605163 605874 644876 704983 626105 601854 566394
17941 566394 589344 651818 598167 566772 661592 696361 675233 682689 664189 675686 732007 787618
17929 787618 813740 852421 923838 936053 951704 1044453 1137367 1295751 1553440 1916448 2232954
17918 2232954 2368437 2187778 1901694 1800708 1793847 1915913 2052609 2229024 2516669 2948001
17908 2948001 3254488 3437874 3616824 3954038 4293839 4408768 4443738 4539264 4851371 5442190
17898 5442190 6344437 7567941 9113877 11060462 13566473 17158476 23114383 33490055
17890 33490055 51996119 85235267 140501758 201958174 211200127 166590851 109544632
17883 109544632 69351390 47139026 35184432 28136759 23579004 20483530 18419390
17876 18419390 16961243 15987737 15715248 16021343 16773659 18181292 20726260 25219359 33059816
17867 33059816 46877196 71073455 112557163 171907938 209103321 188442831 138790452
17860 138790452 97822076 79561194 81837709 104402265 149476536 195760188 192985604
17853 192985604 148082475 97638897 63651839 44741342 34234672 27633659 23074277
17846 23074277 19867103 17588802 16187524 15496780 15105573 14844591 14932381 15782027 17795153
17837 17795153 21646072 28666344 41151879 63429754 101782638 154061510 178814818
17830 178814818 151888015 103234755 63809666 40985674 28724126 21748677 17566694
17823 17566694 14759727 12482644 10346410 8660525 7439293 6471057 5709330 5121115
17815 5121115 4598145 4244143 4142542 4263873 4503015 4463034 4082231 3499558 2940936 2472814
17805 2472814 2150454 1948083 1860324 1797130 1844847 1997065 2076158 1874200 1514248 1214333
17795 1214333 1099573 1015726 918911 854059 777642 777633 754040 721100 683917 726556 782303 741907
17783 741907 690704 694508 615550 549249 510048 486631 491335 510778 474471 427262 441307 451886
17771 451886 412539 355794 395532 396156 387404 395339 440017 482505 483691 495115 520039 489431
17759 489431 569035 626552 678673 782009 990136 1347029 1732668 1939881 2028818 2202269
17749 2202269 2471258 2872955 3200012 3244978 3038451 2611787 2100804 1560653 1170122 1008118
17739 1008118 906190 781153 689737 638444 618488 611239 622635 656207 647612 598063 688405
17728 688405 868797 1082817 1397084 1824579 2175415 2311098 2239361 2020193 1687524 1316543
17718 1316543 1074856 1013777 1064675 1142394 1162139 1206449 1166419 955961 751848 607044
17708 607044 478335 425285 441299 439226 419448 341146 326673 353977 381103 330543 282274
17697 282274 257514 237883 256037 301977 278124 203017 186202 170602 172780 145354 64758 77453
17685 77453 104721 129090 154330 191787 201150 183583 155362 134481 92045 137777 156297 150740
17673 150740 144752 121624 46474 -2553 49913 25567 64591 64240 28523 56585 127663 123621
17661 123621 65628 100728 126352 109327 134601 135561 156918 174831 137666 103936 72420 82230
17649 82230 126331 98397 91615 66422 104251 124602 125473 87502 105267 113867 113329 56737 115706
17636 115706 123932 90593 49692 64292 76197 74496 104915 132458 106339 96155 133138 138193
17624 138193 113361 112097 93798 115781 84169 28611 60061 129336 124946 116470 86204 77450
17612 77450 87894 108461 43057 27206 80537 103468 147875 177702 197311 201659 220872 260800
17600 260800 323107 402146 509377 566573 731562 1013347 1420514 1875784 1883600 1447220
17590 1447220 961745 676194 492935 394424 319800 297429 364607 341658 226341 194564
17580 194564 209657 229582 298153 325577 312171 290876 341930 466078 715727 1134909 1744695
17569 1744695 2172870 2054136 1488826 941231 655211 416600 294367 210369 234590 301417
17559 301417 229992 152547 111449 156717 120936 40518 -22726 11997 52937 50987 46270 54405
17547 54405 78398 109741 113649 24065 -7602 5751 66046 100419 118940 134683 79389 50681
17535 50681 58168 18252 -55295 -35799 -32285 -10093 38081 51895 39923 47532 42968 65966
17523 65966 81814 81196 87785 8767 -30545 40066 63143 71411 76306 42831 24471 -6520 30392
17510 30392 44323 15246 55901 55622 49877 65219 55228 75064 65606 22690 -27364 16146 23403
17497 23403 28792 21113 33751 51639 69990 73930 92764 88048 61982 59321 149959 122706 43679
17484 43679 46319 15876 -65556 -37437 49793 48267 29418 55556 30008 47696 59982 86582
17472 86582 51611 60733 102166 158636 129731 97484 66815 70679 105235 91398 79167 65586
17460 65586 69593 116440 128930 125368 121371 140412 136743 112502 42734 23602 107291 138857
17448 138857 108904 68111 157430 237211 321105 465617 780027 955931 907527 732266 509361
17437 509361 346438 205404 91435 69187 111322 108691 51800 43133 49715 64774 52614
17426 52614 24639 8711 50690 48687 53369 62308 108218 178861 211473 244182 324094 311162
17414 311162 227491 184564 142224 117252 123377 134368 148739 148429 150768 97346 43327 34692
17402 34692 58665 89782 128367 99176 -20703 -32294 16234 2581 24819 63838 72517 89788
17390 89788 63554 135869 206054 204308 160847 95320 30108 57825 102602 114794 85549 79910
17378 79910 103057 59193 92851 19145 80753 114513 63191 51197 72456 101081 136341 135054
17366 135054 122516 118343 68845 44302 65379 50753 58055 65936 115778 101653 158251 155044
17354 155044 147199 152955 218662 269583 386851 530835 837941 1091822 1029399 761806 533445
17343 533445 459061 422370 413285 377493 297475 245874 206489 183413 198701 246709 277542 279725
17331 279725 284928 304311 275052 324316 439361 673384 904331 1129821 1218739 1007491 756303
17320 756303 671819 656201 792648 1028760 1280301 1436848 1314986 1029300 798174 597860
17310 597860 458365 429021 360202 316600 327712 284292 277044 269575 319307 384695 374984 347780
17298 347780 329940 388492 432197 477955 669535 990833 1199905 1271172 1097084 841794
17288 841794 607871 487294 469915 446263 448413 465116 414383 401234 429670 452823 370721
17277 370721 332777 287515 301652 317142 270840 265881 237259 231872 293734 269058 198590 221875
17265 221875 198898 247692 353533 364769 336604 301728 322463 353374 407901 430728 468210
17254 468210 537997 610232 630660 613876 559647 484188 531073 559043 564182 509145 462808 432944
17242 432944 447002 546701 649074 694838 721733 736978 683099 680369 757055 803855 862702
17231 862702 938429 1039333 1056006 1090989 1111055 1147470 1201747 1275586 1308164 1527156 1862095
17220 1862095 2303626 2842909 3413796 3744295 3815224 3721725 3590923 3627418 3892718 4338640
17210 4338640 4713582 4916894 5020416 5013745 5132981 5291193 5583793 6092601 6776777 7692925
17200 7692925 9049441 10842211 12968489 15542558 18956480 23816559 31317851 43355163
17192 43355163 63715986 99135144 156362132 230409546 298367828 327979547 303595508
17185 303595508 240056854 167927824 111259241 75411337 54820660 42910013 35668232
17178 35668232 31079035 28330941 26967557 26426643 26383318 26739301 28005417 31169970 37735990
17169 37735990 50098288 72451944 111665475 172121431 243823701 300063829 312194785
17162 312194785 273949193 206773379 140261658 91884627 62526180 45812983 35965565
17155 35965565 29663695 25103181 21496941 18539319 16017587 13766772 11724662 9921939
17147 9921939 8534721 7446822 6735830 6323423 6190694 6192532 5945551 5435320 4745682
17138 4745682 4013133 3373273 2942920 2739650 2753861 2998665 3336426 3548441 3467800 3121285
17128 3121285 2642385 2176193 1909625 1725034 1500852 1278898 1160573 1105622 1102430 1022738
17118 1022738 961121 905673 879615 849060 824088 837547 846720 765795 688292 658916 627277
17107 627277 645910 621465 571938 550872 520261 517866 432737 398404 400123 296913 262222 323373
17095 323373 357038 363629 387923 325740 297271 313864 337448 326938 388358 431966 454403 541121
17083 541121 548750 498831 401284 409783 393123 337225 311961 288444 307392 360777 400609 443798
17071 443798 437379 385638 347228 312468 258420 275984 306479 377990 461675 515221 525554 551078
17059 551078 470275 332773 253454 250767 272415 240173 182012 266121 364890 372453 371162 310308
17047 310308 226485 178956 96505 123505 212864 299271 288392 299133 283213 249250 261070
17036 261070 224280 219336 169887 112098 119780 107019 101446 139405 171620 216186 195520 146853
17024 146853 73676 29699 7634 50838 22780 -67763 -60833 -64501 -24356 25913 14213 -24344
17012 -24344 -68937 -126785 -110209 -28789 28189 58370 61337 26565 28084 -27304 -96003 -87860
17000 -87860 -83186 -109473 -150457 -128949 -46620 -50512 -37687 -23991 12603 59234 16100 20476
16988 20476 73691 61594 21469 6133 14544 37096 69560 47946 89758 58795 13620 10401
16976 10401 57740 120436 75312 52396 24505 13772 -28838 -33523 -42990 -26115 50658 81414
16964 81414 37349 34423 110360 85543 57323 86763 65849 95886 121234 51152 47364 24585
16952 24585 27781 -2177 20276 84495 78874 89194 111380 63979 29644 -10388 -66986 5160
16940 5160 72967 68272 116674 110296 74727 47036 46207 52212 32745 -4033 -97321 -53341 -2421
16927 -2421 -53055 -69686 -20533 2414 22551 45357 61130 65678 95295 129342 116728 71461
16915 71461 57899 50512 50597 34144 3884 -39215 -26072 -19122 -13374 8381 115320 209586 127789
16902 127789 42085 9940 34837 23141 -11521 -81705 -61331 -32019 16046 40654 3804
16891 3804 -51031 -100166 -147700 -134226 -86385 -9871 38932 65389 28731 37552 70227 82365
16879 82365 141895 137539 126899 123569 75797 52532 45253 -3042 -52801 -50625 -40898 -22625 -5943
16866 -5943 27586 -13321 15455 95011 134953 128257 164729 201756 252503 324685 323506 308902
16854 308902 356517 371141 278896 166129 88809 64150 114463 81451 19782 329 11868
16843 11868 25292 36858 31139 33021 49304 73093 104596 87617 40783 116351 186604 158147
16831 158147 126188 89184 160391 242377 252480 202578 224357 205985 225641 269561 273845 338456
16819 338456 427087 451701 472552 406209 300835 258212 254094 315967 351256 325340 312448
16808 312448 280716 271676 245825 293476 277469 249044 189261 136426 74344 72155 173119 198212
16796 198212 178543 137395 92156 98201 136589 62196 -37501 -15491 29038 -614 -46708 -77511
16784 -77511 -57187 -30397 4971 6907 -42409 -81513 -109306 -101486 -26053 -13247 -4995 -47277
16772 -47277 -30019 -28450 -19597 14100 5843 -50943 -74983 -74610 -115434 -103217 -37298 -9712 -21162
16759 -21162 -32354 5901 -18062 14296 47510 22231 -16294 31558 55971 62478 99017 90913
16747 90913 72954 89235 59129 66811 112510 146371 165403 198997 179153 112086 42162 1671
16735 1671 84794 131800 83484 75503 83736 86597 84506 74743 49566 25309 -27527 -24654 -33772
16722 -33772 14703 -16505 -72396 -64983 21037 25042 -43845 -127077 -129792 -157176 -97729 22529
16710 22529 33364 19040 -7456 20704 25386 -28998 -62028 -44646 -53748 -46558 -17029 -13052
16698 -13052 30972 69944 64386 8855 -41399 15897 24290 -4676 18040 1708 51384 127407
16686 127407 160433 178326 167902 175949 111196 28947 -75437 -70607 20861 81546 129859 127273
16674 127273 175887 217454 229767 229437 148673 113959 79492 71242 115715 221973 283762 271676
16662 271676 266672 201430 146066 177214 139948 139338 212585 281220 283586 281729 394640 428701
16650 428701 491669 519177 498594 464001 407534 325234 313339 359956 395978 553408 759584
16639 759584 926019 1063930 1010113 908540 757498 663374 564175 483722 636437 865778
16629 865778 1114498 1397949 1609025 1591713 1475938 1456437 1640969 2020566 2363835 2624928
16619 2624928 2676437 2529554 2243846 1943216 1598287 1214134 896289 793657 738149 757861
16609 757861 888751 1062816 1174943 1157362 1079071 958948 878588 823719 872734 1012092
16599 1012092 1272031 1632901 1884355 1842380 1542455 1145942 814805 611457 457473 395806
16589 395806 391571 365049 336032 293160 262234 203678 157281 95078 88517 135403 73869 119084
16577 119084 175953 161910 67031 -31507 403 63657 100575 114834 147145 190080 148338
16566 148338 126214 113539 60389 46128 77703 120784 143649 83165 60280 34706 25822 91738
16554 91738 93855 114224 161228 147692 95019 65270 36411 39015 -765 1977 61719 43027
16542 43027 7697 28852 16348 -21237 -41423 -18515 2586 1573 20419 -28832 -46172 13363
16530 13363 14987 48617 145659 200863 241108 336908 504920 577502 596870 594937 620927 647485
16518 647485 625551 622611 597929 460017 306729 210571 135712 149563 186229 225063 233518
16507 233518 263142 261872 343815 470663 538544 605046 583865 560725 589430 590793 509094 457368
16495 457368 368822 336244 256598 197097 239433 268423 261429 270091 282232 352618 582447 792372
16483 792372 871974 942918 1004759 1131437 1190494 1187070 1018924 876813 861810 873168 744075
16472 744075 595391 411637 334268 382065 356789 367662 408849 509504 615458 668946 665645
16461 665645 740498 813920 867300 835835 722279 638516 606074 620421 563551 435744 341879
16450 341879 288272 235075 167887 91253 143503 168558 192196 222627 173617 144679 129102
16439 129102 114551 81497 89588 26262 -16836 28279 98889 117106 80556 88452 32896 50291
16427 50291 60486 42407 25699 29025 62619 78970 65226 15390 -282 7291 20249 -166
16415 -166 -7551 -50270 -87702 -71599 -27658 -25987 -55789 -58169 -78050 -68845 1201 -3972 -46561
16402 -46561 -8521 67419 104496 111504 85752 62934 45756 -18334 -69080 -108946 -69117 -67987
16390 -67987 -68361 -40215 14595 5002 27261 10616 -15143 22208 53192 45394 74739 120358
16378 120358 149681 155403 112776 56634 20672 -16473 -5804 74386 113800 112399 76952 -26871
16366 -26871 -95319 -57740 -70408 -83230 -20679 42294 7979 44513 162775 192390 155222
16355 155222 136444 123596 114433 114485 95241 28662 -5582 -3858 35410 -10543 -57175 -62911 -35598
16342 -35598 -47732 -42842 -26359 -8369 -37872 -29175 -32635 -58640 -88190 -50538 32377 29887
16330 29887 -19221 -13767 -8364 1780 16594 1250 36019 114088 84187 39507 41556 61429
16318 61429 85804 44551 -22851 -10508 4845 66828 28385 46814 71487 142196 95009 50751
16306 50751 52907 4217 -19652 -20822 -100344 -72158 -39287 -38082 -118788 -115188 -28885 38218
16294 38218 76316 35169 18093 -32182 -43505 -30064 -38749 -81879 -77866 -58506 -24008 -12283
16282 -12283 -50827 -2235 -9155 -105909 -143568 -156862 -146637 -124273 -29335 -20950 -18011 -29573
16270 -29573 -48683 5217 77958 96154 103565 121966 143900 114516 99755 83391 43747 -50292
16258 -50292 -115218 -111911 -62517 -31562 40767 105451 117685 71328 3604 20269 86058 42869
16246 42869 18187 38247 -10378 10149 76562 43708 55529 36981 68620 56897 10590 2051
16234 2051 9042 5207 50960 85208 79303 -1335 -42738 -9252 -45862 -51400 -60875 -48061 -26092
16221 -26092 -35881 -53523 -55291 -31128 16979 -19425 -65785 -56685 -101413 -119614 -111721 -74388
16209 -74388 -40021 -66165 -74314 -63996 -17175 29296 3481 -45029 -5696 79304 82125 47953
16197 47953 61713 -9381 -23998 15081 56077 42546 -2333 18642 28213 -23637 -23678 -8153
16185 -8153 -45767 -26084 9198 -10830 -41618 -75996 -57570 -31951 -17982 -33209 -78621 -88956
16173 -88956 -83170 -85979 -92875 -51604 18176 10934 -15347 -67598 -103357 -78800 -59634 -39012
16161 -39012 3242 -52900 -84737 -91537 -112413 -51915 -15518 421 2286 -23169 -48528 -38469
16149 -38469 29930 54436 47809 -236 26321 6231 -11029 -62908 -85919 -75578 -86614 -90999
16137 -90999 -38124 30433 92738 85255 24144 -43591 -31771 -18050 36733 72347 111407 83722
16125 83722 3972 -13579 28975 38460 47696 73409 59471 27059 26626 126652 108560 -5347
16113 -5347 -49352 9917 63233 15135 -26563 -26408 6899 21358 31935 29497 21223 -1498 -60637
16100 -60637 -85027 -132096 -147720 -121912 -63364 -55137 -84825 -18803 -31497 -53569 -66207 -93643
16088 -93643 -57958 -26322 -5980 35401 7882 -19364 46414 112557 107640 110000 57007 61339
16076 61339 75122 70360 45320 36572 -25934 -53756 -38227 5513 27571 20423 48163 43513
16064 43513 8605 49258 106221 169408 188915 296284 439521 543799 535537 455189 400687
16053 400687 331226 242147 119312 121956 140861 105412 103022 67672 2233 -1046 -8893 -12731
16041 -12731 24724 -18850 -41945 -14554 5542 -28734 -39068 -49611 -43457 48834 124462 126482
16029 126482 139475 109861 82305 132697 142507 102819 53599 87350 55761 -778 -40937 -76528
16017 -76528 -14919 -3834 -31861 -11919 41329 -20624 -34747 3927 27593 -11515 12950 -18915
16005 -18915 -83326 -80236 -18964 28900 77359 84967 30103 31171 4668 -25489 59238 149358
15993 149358 246555 308409 427363 548691 573612 509102 420420 323989 255043 185359 127481
15982 127481 70577 31614 20673 -18169 -19350 25073 35875 66522 83540 40236 15095 12510
15970 12510 -1022 16240 28222 22377 694 501 1293 -27876 -44909 -29127 12580 69734 50177
15957 50177 10349 -53871 -32708 -65894 -62470 -43167 -46069 -45517 -53884 28411 82433 79798 25134
15944 25134 19728 -16995 -10862 50140 77981 28539 39084 47218 52091 47097 22119 15570 41262
15931 41262 83413 84278 12775 20954 56605 61561 47396 9744 22202 4837 75161 43252
15919 43252 34710 88066 6948 44686 84577 36607 79898 88528 -22186 43346 7408 -18446
15907 -18446 -26187 -72131 -73236 -49913 -12511 20746 18285 -48479 -53611 -16300 -8537 -16583 -43490
15894 -43490 -29887 5528 -23016 -67459 -41364 26330 79655 36671 38248 110857 87991 60565
15882 60565 -7341 -47374 -55739 -60783 -74692 -57861 -22919 6502 31127 76597 41981 9342
15870 9342 -3560 -36521 -2228 -9109 -27997 -26621 -10375 -38 41276 13171 5643 43134
15858 43134 15228 -16988 -39937 -54605 -71709 -121236 -105469 -47417 -8764 22611 -9772 27896
15846 27896 103842 90514 17244 -63373 -53789 -38827 -90425 -112345 -99151 -44089 -101431 -117391
15834 -117391 -60457 -107305 -135239 -83301 31943 64931 66504 110299 99990 60339 16893
15823 16893 -34155 28348 -4394 -39676 -67085 -33735 3504 -21962 -33996 -16197 -53779 -116373
15811 -116373 -101533 -60191 -103240 -96239 -92518 -113838 -127398 -124670 -117307 -81490 -103355 -32279
15799 -32279 -8044 -62203 -57917 -40334 -13569 -17431 -8942 -16834 -10669 36409 39999 -35565 -106003
15786 -106003 -114679 -50349 -40367 -51761 2820 -15084 -4984 17907 31759 -62637 -90628 -69587
15774 -69587 -24942 -70847 -132203 -88736 -38343 12766 7687 -47070 3669 8279 4364 41175
15762 41175 48103 40167 4389 -16211 -30770 -14669 42141 87072 105513 9223 -7225 -26156
15750 -26156 -5433 11750 37936 -18709 -23761 -10997 -70189 -52611 -16364 20351 12378 2960
15738 2960 1781 -28910 -57389 -44318 -4943 -79464 -105345 -42484 -35740 -65712 -65441 -78367 -108155
15725 -108155 -119853 -94669 -100427 -49417 -38333 -88394 -72854 -48883 -61074 -94484 -89831 -97361
15713 -97361 -60366 -53600 -43298 -10393 -23145 -13045 -6138 -14848 29522 54850 5352 -12064
15701 -12064 7556 -7875 -72186 -67616 -40500 -37699 -52229 -50774 5413 14893 -33547 -52710
15689 -52710 10923 86988 95490 108942 62143 55826 82839 19165 -66090 -55568 -64331 -46214
15677 -46214 -44615 -20797 -78998 -76030 -107236 -127775 -101952 -113218 -110380 -112377 -76031 -28267
15665 -28267 -23119 -3236 -21961 -73088 -61638 -51937 -40483 -29657 -55875 -53108 -1445 -5268
15653 -5268 -21988 -44743 -44287 -42401 -45828 -15119 19767 79371 87021 47019 -18839 -53703 4139
15640 4139 15511 -8011 -15506 -43360 -11093 -50758 18021 93116 77568 95361 66203 8059
15628 8059 23413 79139 61574 27915 -8343 -20369 -17116 50970 80388 121828 146969 92194
15616 92194 29260 -15308 38532 10935 -29991 -10700 -41088 -10602 44095 61657 32257 3364
15604 3364 -20547 17663 35065 38758 82558 92993 75784 2419 -10623 -53785 -73933 -31440
15592 -31440 32235 49226 4954 -11977 -22218 -52644 -85566 -47727 42066 39368 12763 -18302
15580 -18302 -23565 -76657 -85941 -97431 -61302 -48623 29411 93076 71133 -15581 -42974 -3714
15568 -3714 -26417 -44631 -44525 -31461 38036 104193 101518 62424 56064 37180 -23473 -46136 -36293
15555 -36293 -42089 -2270 -10958 -71879 -71132 -43001 18724 18805 22841 50856 15923 -3489 8064
15542 8064 69843 48362 -53811 -57027 -31683 -23541 -20405 -16832 -26726 -13612 -17943 13691 -6425
15529 -6425 16770 -7243 -16147 -22996 6012 10440 40012 35187 -51436 -73357 -32578 -22832 -5559
15516 -5559 6403 25309 -1033 -11107 -3694 -8752 -33570 13517 -7704 11366 -6670 49511
15504 49511 92722 96250 81008 14893 -37935 -52000 14243 796 -49143 -66969 -80893 -51530
15492 -51530 15620 -20587 -56388 -48345 -34793 -55935 -83449 -80949 -65982 -45358 -57533 -83281
15480 -83281 15462 60367 58432 40291 -1072 9015 33943 9442 -15451 -33803 -11724 31455
15468 31455 -66309 -57964 -60538 -6620 54128 6686 -10683 22619 15110 15632 6469 35462 22526
15455 22526 -12663 -11872 -41125 -93519 -69522 -17890 -17305 -37164 -62806 -62976 -65733 -26605 37456
15442 37456 98381 69223 26519 64736 101262 59062 34221 105881 115992 37641 70483 92530
15430 92530 50447 -11938 -6273 -41055 1725 -3522 -67619 -96564 -46900 -10557 -7208 414
15418 414 3134 46107 59530 37817 -21661 -84236 -70143 -75360 -76994 -62145 -9524 42106 16304
15405 16304 45549 41447 40048 14937 -12201 59707 67524 -9092 -27980 -19675 -37364 -74723
15393 -74723 -82904 -23825 -24283 -78289 -122672 -55420 5023 24912 52963 -6145 14047 28077
15381 28077 4893 55658 82782 48590 57631 62229 57614 18142 -29807 -66043 -65193 -61392 -94855
15368 -94855 -140727 -121745 -42030 5797 32467 46558 14923 -31331 -7358 22685 38733 45453
15356 45453 56687 -19627 17634 37152 50335 43772 24508 -1599 1314 -13336 -77959 -48930
15344 -48930 -22870 -32207 -40209 -35208 -30169 -23250 -29695 -46973 -76890 -89262 -29893 -8327 -14206
15331 -14206 -32887 56131 71385 26524 -20407 13053 -3299 -54916 -60419 -36607 -22581 -4839
15319 -4839 16447 54325 70632 40051 8859 -60631 -108254 -113461 -106400 -67674 -65667 -64203 -63619
15306 -63619 -39254 -16030 15684 49509 20466 -26472 6628 -29324 -65448 -35379 33028 80328
15294 80328 29973 20788 67546 77467 135727 124317 116850 147592 52638 -36448 -40755 43263
15282 43263 70094 31576 -10657 -30293 -59964 -78981 -31017 60883 108966 17186 7266 57309
15270 57309 104488 62162 -32140 -21884 -7446 29175 15004 55329 59928 25584 30042 76
15258 76 41284 36129 -42503 -89690 -74406 -48071 -45155 -30964 -18664 -24209 21690 32140 81780
15245 81780 70977 -18284 -109490 -84748 -58009 -45885 -36114 -29078 -29387 -15524 42848 54387
15233 54387 14504 -555 48135 21550 31037 10105 -14691 -34417 -36646 -9532 -11774 -23181
15221 -23181 -51641 -39027 -23094 -1397 25708 18768 -41617 -55340 -31067 -5511 -28401 -11215
15209 -11215 26755 33589 21973 23855 -23157 -102491 -53315 -64309 -33820 -61796 -6410 61769
15197 61769 57922 32563 42267 20572 -11491 25316 18255 -36837 -38002 -23720 -39505 -54611
15185 -54611 -36953 29957 107483 73174 24477 2855 -15505 -40278 -14720 8949 44559 43806
15173 43806 37308 2529 -4979 -6147 -43650 -40627 -11556 -15311 -52279 -24631 17915 15641 9783
15160 9783 20360 553 -21718 -53629 -76123 -76808 -49205 -68100 -37334 -30308 -55594 -55856 -91241
15147 -91241 -46474 5866 10276 35882 12748 -8675 7611 19669 21955 33159 28836 -7719
15135 -7719 -43722 -73083 -46936 -44076 -39225 -35477 -22916 -2152 3815 -24520 -34853 -2476 54433
15122 54433 48550 21251 -21056 -76051 -107262 -118002 -60858 -32918 -41224 -25628 -14854 -27990
15110 -27990 -31387 -19381 -48767 -6220 17498 -40331 -48180 -20256 -16110 29357 52107 -30109
15098 -30109 -73074 -35483 1007 35477 113006 75315 40886 41385 73263 67934 87319 34891
15086 34891 -20884 -41775 -51546 -72262 -76026 -98452 -102253 -50375 -76735 -62943 -13948 -33617
15074 -33617 -55882 -45232 -4269 8399 -24253 -12820 -12146 -50806 -96705 -101081 -67914 -46252
15062 -46252 26528 -18972 -6804 17570 6352 -34339 -28288 31832 25130 5536 36188 15724
15050 15724 -8973 -1263 -9702 -20464 -44494 -42434 -14048 -30112 -18163 -30734 -44202 13802
15038 13802 13082 9268 23650 28021 35966 56641 27853 -46506 -64573 -32580 14572 33962 51410
15025 51410 21546 -15853 -19860 -10991 -24571 -34036 -56856 -92811 -68992 -45094 -91241 -107757
15013 -107757 -66723 -52388 3604 -21378 -75607 -73181 -1698 -4000 -23018 -31838 -116097 -101206
15001 -101206 -79757 -48012 -43030 -48857 17949 -7809 -88878 -127112 -118453 -118622 -149428 -135171
14989 -135171 -169921 -204242 -154279 -98837 -54292 -53059 9023 103814 141959 145136 133716 106930
14977 106930 83983 75545 30992 10962 39673 69050 -11526 -43607 -41103 -33857 11197 9369
14965 9369 -19980 -51865 46414 73161 15575 12007 22277 44796 30304 42114 -19762 -6804
14953 -6804 49685 29374 -9895 -12154 -41997 -18280 -37084 -41120 -78243 -74007 -111112 -86917
14941 -86917 9474 50441 -42690 -50877 -54718 -101892 -53513 -46476 -57575 -52738 -49303 -93578 -78426
14928 -78426 -64549 3727 1604 -42575 -54688 -20625 -2849 -8481 12208 44208 75372 85296
14916 85296 64128 -4809 -32376 -30537 14209 79166 94859 93581 80529 56891 37082 21814
14904 21814 35301 91250 93800 38490 -67720 -95866 -48827 -50942 -47333 -113454 -169212 -95416
14892 -95416 -41573 -50359 -21437 -35410 -55878 -7239 -38269 -58678 18252 -9113 -34439 -18554
14880 -18554 -21118 1323 -13410 -15858 71037 66890 47115 49764 65857 67462 24590 70837 86648
14867 86648 21938 -32060 -57281 -37088 -2546 49505 59677 42464 -4874 11552 37974 37308
14855 37308 -693 -9813 -5157 -34829 -84846 -79579 -111083 -111632 -45869 -12109 24839 29342 7356
14842 7356 -35813 -9098 -15000 -33234 18479 12008 -46715 -38741 -6717 531 -46705 -38195 37122
14829 37122 6082 14261 4795 6982 -45786 -86205 -98860 -127556 -135941 -186403 -178546 -102141 -59840
14816 -59840 -116793 -151389 -67629 -40946 -32078 -57243 -65254 3590 1625 -70357 -8519 38859
14804 38859 54372 24952 15386 -64555 -33183 6934 15924 41317 -39057 -1311 -8393 6059
14792 6059 28703 69789 62725 31966 11581 30554 -6843 4326 10833 33833 64612 120666
14780 120666 160524 156179 58768 -40902 10392 -8081 -48510 -15304 -11954 -21483 7752 -9748
14768 -9748 11160 12149 -45005 -123784 -79497 -13926 -14178 -92221 -148242 -83340 -71963 -49117 -44320
14755 -44320 -59823 -28337 27808 42101 -7438 -85692 -94730 -103276 -63715 -20831 -67958 -80661
14743 -80661 -38180 26087 54667 46331 39084 52626 102142 123949 120111 147257 130191 62394
14731 62394 -11426 35757 19705 19861 13937 1202 1356 8411 -4559 -1436 -20429 54568 95674
14718 95674 50094 18047 47926 9769 -34913 -25396 -57844 -59397 16135 3330 -78666 -101055
14706 -101055 -52755 -25613 42745 38623 -15017 -37598 31257 37583 144 34162 -12225 -38372
14694 -38372 5302 58644 1820 -39739 6597 -12370 -22154 -32130 -29457 -9124 -41299 -30169
14682 -30169 -34263 -59271 12596 9710 -6441 5000 1547 -10514 -3604 19090 14712 5186 4091
14669 4091 57357 34293 35046 79780 25114 27474 66730 43601 -30874 -62278 -31016 -76651
14657 -76651 -87730 -38528 -29308 -766 54188 50395 22225 21514 9193 -6010 -17695 -5305
14645 -5305 19809 49630 78163 7276 -26822 23001 -29745 -2537 52865 60127 5791 -16042
14633 -16042 -68161 -95369 -43410 -26858 -14202 -5174 22821 12297 -1539 -1244 63876 111862
14621 111862 92611 29117 9654 -20382 -71743 -36593 -3217 32839 12377 -30626 -70435
14610 -70435 -65588 -41948 -43116 -82097 -75012 -102075 -78529 26137 29997 -3023 -55968 -42230
14598 -42230 -25763 -34777 -59413 -42235 30908 45577 31049 37200 -33903 -71231 -49646 -6514
14586 -6514 -19000 -48899 -64163 -102593 -88267 -88616 -28556 14586 -32205 -11544 36135 9719
14574 9719 14736 57503 84184 85474 99842 83679 50838 47931 25489 4121 -374 57382 69420
14561 69420 11979 -45458 -41965 -4711 -28093 -33493 7057 13020 -52018 -83746 -34369 20717
14549 20717 62146 70284 24719 4099 -36822 -56251 -21791 -29879 -48860 -20513 -35461 -72091
14537 -72091 -60931 -34016 -11507 -25214 -42950 -32238 -34776 -50982 -80808 -40855 13485 27027
14525 27027 28779 66280 5844 -81440 -45033 -9968 -70480 -130742 -143371 -142928 -56832 -16965
14513 -16965 -25183 -33573 -6584 -1937 -11400 -7202 -31665 -35065 5332 -27618 -5447 -21130 -24842
14500 -24842 27292 9631 -12592 -32680 -8845 -37536 -106927 -96255 -56939 -59003 -1606 34138
14488 34138 25612 16001 -2477 -49863 -54582 -39566 -10307 -31852 -32190 -66978 -37372 24124 36268
14475 36268 11107 -41717 -55885 -7812 48682 16475 33612 80338 85471 104000 81800 25583
14463 25583 -34828 -72677 -83212 -67889 -58339 -20686 -37364 -15757 16364 20547 51522 70245
14451 70245 24625 -51293 -146679 -157504 -101588 -45369 -6526 30656 45160 86305 97052 81061
14439 81061 23462 9439 23878 -5426 -13340 -15226 26998 20799 49299 37574 42968 6544
14427 6544 31594 114989 99329 23190 80150 4154 -26933 -1047 28675 66252 80882 34470
14415 34470 45365 -5751 -45927 -16818 -5720 -73005 -48574 2299 -47485 -147219 -122359 -87459
14403 -87459 -78801 -21923 2977 36664 16938 46862 8824 -29596 -13368 -2902 -22582 -20889
14391 -20889 -21257 -6665 32183 82293 42561 18403 -19708 -24622 -20058 -18056 6244 17995 -19942
14378 -19942 -50774 -38483 -3085 -20275 -14544 -19860 22056 48258 40050 -32360 -75957 -50722
14366 -50722 42143 -3568 -36164 17514 -57108 -56582 -11167 -50261 -106209 -95733 -119569 -124855
14354 -124855 -117706 -82125 -78799 -50001 -66738 -78682 -55491 -66685 -5283 -24380 -55528 -67102
14342 -67102 -27488 51453 102352 50529 18829 66905 28694 31340 60764 -4536 11660 -28928
14330 -28928 -108035 -129248 -161565 -157756 -90820 -21466 -59467 -76526 -61018 -74273 -53318 -21305
14318 -21305 -56203 -49146 38124 67891 102700 101929 78380 84970 49270 7919 -26345 8827
14306 8827 -9411 -17215 -5871 -35142 -45067 -43240 -35069 12840 33844 39626 73494 67802 62231
14293 62231 30424 -31060 -21291 -10046 -7303 16592 -9668 2116 15039 2682 28317 25449
14281 25449 41880 96719 100905 28921 -16066 28535 62286 25956 -53817 -38320 -35674 -92599
14269 -92599 -76398 -74518 -36095 -11416 14940 26380 -7371 6109 4292 -64377 -136204 -114503
14257 -114503 -25449 12458 56592 75353 59313 17343 -30486 -19041 6205 -15294 3704
14246 3704 17656 -13766 -34894 5871 -12744 -13138 10001 30008 10755 7897 19401 -7976
14234 -7976 -17430 34064 27095 -7027 -44742 -15853 3049 42031 29112 47383 23032 38650
14222 38650 19121 -65472 -54693 14886 13880 3005 -31209 -42543 15724 18281 23983 30096
14210 30096 19194 -42236 -7744 29935 54120 24367 -15888 -21872 -18725 -37707 37644 81471
14198 81471 41288 81553 82611 54638 -11749 -20212 3705 -36490 -68526 -27416 4791 29028
14186 29028 23832 12723 -15926 -39154 -76014 -51023 -12626 -58475 -31281 -43517 -69524 -33343
14174 -33343 -69404 -92184 -106814 -127620 -143350 -124473 -60978 16636 57711 83361 50769 37244
14162 37244 52659 103701 81969 -9641 36283 90055 38412 -73888 -169892 -172161 -114372 -57037
14150 -57037 -79752 -75466 -36684 -30334 -50757 -26450 -1475 4449 -11953 3069 61925 64893
14138 64893 -10389 -2018 14195 9569 -43797 -56439 -33171 -20569 45540 94569 47571 8748
14126 8748 12709 -56625 -93406 -14661 27821 -25497 -55351 -36475 -51510 -34993 28309 12866
14114 12866 -55287 -79032 -50889 -26942 46879 22660 -82420 -81814 -28095 -8209 -45278 -78773
14102 -78773 -69553 -106032 -86052 -87788 -29757 12896 49151 17780 11377 33197 27939 -3837
14090 -3837 -39094 1521 48463 29541 -43986 -39950 -3173 -15875 -15871 -27345 -70099 -123054 -97621
14077 -97621 -5733 28086 17121 50412 19823 62642 92129 131203 130434 177659 185281 177496
14065 177496 144909 105383 63074 35166 118551 65896 16040 23007 -10849 -56237 -24874 46859
14053 46859 38928 6837 59834 64986 78383 105544 48509 54699 97955 99674 96265 65766 23944
14040 23944 -4320 -9292 28142 91667 148087 116708 136822 236304 251853 288708 295536 323638
14028 323638 348943 389477 477021 454597 394970 370226 366151 350047 271436 254916 235536 144309
14016 144309 113070 140472 177074 130781 108557 59041 48402 25859 16596 50929 18507 -28686
14004 -28686 18832 123471 151381 145207 148721 135105 160343 156490 139851 141209 214571 324185
13992 324185 400788 405050 423903 423610 402590 412457 425139 403953 391915 319386 325536 303287
13980 303287 313323 369431 412037 404284 317595 237526 127301 119485 191546 200382 180623 102659
13968 102659 63234 -10054 -21913 28823 33194 -5707 23149 13751 18221 -2890 -52415 -54214
13956 -54214 -68514 -61478 31031 64176 40190 61710 124397 178441 241563 274983 276772 272764
13944 272764 231084 214781 209803 188083 112779 74322 108433 121425 104065 33236 16847 8252
13932 8252 -20558 -7546 -30377 -78862 -81086 -65075 -27787 31264 48878 70586 62312 51852
13920 51852 44544 25595 -73438 -60763 -4315 -15998 -65363 -78881 -15389 -8906 14589 49536
13908 49536 18486 14095 -23394 -15623 15093 2323 -35618 -57973 30581 23428 -15014 -1073
13896 -1073 -26783 -53221 -58011 -70474 -36832 -7744 5988 -3761 -18527 -30381 -56987 -53634
13884 -53634 -51178 -95942 -103655 -71995 -63085 -6539 31296 32669 39002 17748 -30575 287 53433
13871 53433 42201 37060 20541 -18269 1691 13208 44671 9140 53512 69157 26618 28519
13859 28519 26791 86237 71862 63576 59913 88633 40191 12730 7512 53830 79724 55416
13847 55416 2815 -23377 -62286 -107275 -115323 -93432 -67514 -48774 -16656 -31118 -69748 -49679
13835 -49679 -2145 33792 90673 56444 12045 -25162 -58347 -51537 -30876 14126 18249 -9248
13823 -9248 -39395 -66978 -38546 -39806 -23190 4960 45420 93415 121935 79834 104491 92478
13811 92478 72882 25423 26793 36863 36314 60084 20458 -14455 11578 -31668 -87838 -65838
13799 -65838 -10056 -10460 -13210 -24237 -60406 -60640 -50841 -74461 -128337 -118950 -105670 -45218 -11335
13786 -11335 -42566 -44710 -68588 -89363 -91236 -91069 -73623 -24640 35778 94261 145335 72848
13774 72848 5316 47419 18403 -33720 -73340 -66407 -72360 -93408 -55243 -58226 -13457 47699
13762 47699 9281 40139 99692 44121 -41511 -101568 -134301 -173934 -185945 -110623 -58981 -14177
13750 -14177 -701 -39119 -93 -60881 -87393 -42901 -12874 -52874 -53208 17350 3912 -27428
13738 -27428 28552 35032 -36490 -55777 7264 58534 39520 -13748 -43223 -27085 -20035 -22489
13726 -22489 -11202 -18457 -66389 -105114 -50619 40523 48488 -29425 -47129 -28096 59381 80662
13714 80662 39302 26327 -43472 -36918 -30174 -10160 -41158 -24620 40412 40153 10345 26419
13702 26419 19917 -6005 -53271 -51863 -103746 -60828 4773 2237 -24095 -21560 -4094 -29999
13690 -29999 -37688 -86382 -44084 5082 52323 86131 124521 75791 32176 3449 -32193 -35216
13678 -35216 -5135 11422 48097 76877 79698 66915 41628 -23798 -12951 35326 60907 28163
13666 28163 89510 90941 48242 3881 -31714 -32192 -52671 -42715 -26718 64263 129422 84694
13654 84694 -4451 -28015 15072 -29324 -50320 -23884 -50665 -30340 -25293 -20329 -43747 -7710
13642 -7710 26447 47553 96815 99807 58130 22574 51684 26783 42743 44399 34882 4696
13630 4696 -1876 42434 21047 -7885 1050 -63650 -112819 -54391 -30431 -54789 -18654 -61500
13618 -61500 -85004 -12218 -57032 -95949 -48961 59106 24880 -2337 -9812 -30439 4067 -7473
13606 -7473 30264 43320 91210 51888 -28673 -86792 -68306 34476 81447 14643 9557 -13100
13594 -13100 -88730 -93837 -86263 -53534 17392 -25104 -48981 1240 33903 22494 5957 -41516
13582 -41516 -11266 27043 61891 60489 67170 52473 45443 9384 -4095 11774 5307 -22762
13570 -22762 14348 38520 -7000 -66305 -125350 -116182 -62095 -19201 -28121 -31130 -5327 9320
13558 9320 30067 -18454 -46252 -72840 -68183 -42496 -16201 -36570 -311 33759 20575 40851
13546 40851 42445 16719 4907 16509 66820 84714 11623 -31898 -30231 37184 98471 32087
13534 32087 -39641 -52668 -76040 -91977 -98423 -61209 -33378 -13642 49377 22562 -2838 13513
13522 13513 -12272 -6035 90001 142712 107963 47597 34845 4439 -38087 -62842 -77606 2391
13510 2391 41851 -24928 -2646 45697 -12681 -70903 -85332 -60735 -90906 -57597 1143 85083
13498 85083 53341 70229 74748 86674 82141 77327 81192 78531 -3008 -85892 -70549 -17897 -12691
13485 -12691 28762 41282 37572 69614 102599 41893 67049 70807 65312 10733 -61099 -49346
13473 -49346 52304 121445 159520 104267 21154 24233 38827 25540 106469 206698 315142
13462 315142 348161 333044 353563 305069 277678 182889 81507 65532 55641 72548 106725
13451 106725 91109 41641 -18119 -10999 2205 50223 96154 132395 133883 119235 101088 77310
13439 77310 86592 101721 86492 48730 1351 67507 78565 34413 50148 83535 48561 56749
13427 56749 174013 234053 170401 115455 115938 199133 294042 374528 440536 533429 625866 681437
13415 681437 668936 568734 456925 356575 233767 237910 260373 268838 241411 138595 95414
13404 95414 80904 58446 87536 120518 91077 49363 98019 72598 61789 -9166 -63767 -39990
13392 -39990 -53023 -6930 -47923 -54679 -87354 -54463 8157 124943 140164 113040 59533 62217
13380 62217 82959 132979 116118 88672 153314 242393 275770 290990 420099 569844 523443
13369 523443 436604 326513 216160 129454 64294 63882 126871 157089 141340 115659 115474 114331
13357 114331 94504 101638 121245 125117 95871 59718 31976 -2227 53876 76803 65955 5986
13345 5986 -16626 -33998 -31012 -28412 -43168 -24082 25193 -5454 -69418 -54641 4844 -20353
13333 -20353 -28 88577 109870 79251 35526 -1310 -10836 -21581 12939 41401 -10387 -97134
13321 -97134 -96888 -24329 17829 17440 -26921 -52495 -93909 -152858 -171528 -128925 -74374 -16345
13309 -16345 19963 32923 37085 26139 48025 55822 49227 40994 679 -17055 -31866 -67490
13297 -67490 -21638 -43095 -50133 -5271 32741 58789 106060 101867 58755 99827 131514 130548
13285 130548 58862 -27269 -26018 -9530 31778 26785 46896 78809 37180 -6294 -41127 -78220
13273 -78220 -118348 -170654 -152437 -107570 -23019 -28246 -111066 -105340 -49231 40273 43230 62504
13261 62504 99780 48102 7354 -3796 30788 21285 12790 42211 86898 32045 1240 -1977
13249 -1977 23832 31863 53621 47579 27659 77045 97003 96317 100487 134730 171097 119310 110067
13236 110067 116160 48431 -9538 -25710 -47632 -56212 -64902 -14367 4444 -3921 17966 16924
13224 16924 55304 43577 -35739 5925 65802 87597 88132 101928 43051 34060 111333 91863
13212 91863 114276 158278 160032 176517 207782 244236 253932 280308 374775 376467 380425 366543
13200 366543 259015 225285 285240 339963 399451 485690 526123 535662 448341 353997 314756
13189 314756 304386 299757 267731 309337 296252 280504 228794 121597 90838 119597 61940
13178 61940 58699 90488 55158 94671 155354 199896 256617 385727 358055 278506 299247 328568
13166 328568 368768 367789 372597 306316 207722 138824 145890 180983 248505 350855 368787 400706
13154 400706 351450 360418 345400 417601 520250 626703 675230 631800 513730 369378 241466
13143 241466 184687 138430 134815 108190 101239 84913 117043 141900 148429 150661 157289 170650
13131 170650 140187 91231 114127 46538 42992 49947 -9516 8545 78710 109643 109024 176443
13119 176443 232961 275964 250256 198460 136508 60837 106874 130143 144961 157918 140038
13108 140038 176951 278287 325478 353118 404950 426312 443793 375929 247533 188252 121685
13097 121685 138423 197209 211171 189589 145094 152371 113473 74319 71410 53188 56855 93274
13085 93274 90330 145782 163708 115756 38319 43726 11732 22475 60197 98847 98736 53362
13073 53362 31614 74926 87327 106485 93098 32449 14232 -1503 8867 38388 72415 83943
13061 83943 79726 89988 147362 234415 367669 373559 258536 212440 140673 40414 -28439
13050 -28439 16048 93043 81604 59081 61455 45074 36059 -1267 58370 126105 109109 30016
13038 30016 26799 81947 71606 38857 -24946 -44296 -62238 -64945 -34878 -86751 -35134 77557
13026 77557 155097 174276 156383 150178 151572 161811 154607 98230 83038 64826 58325 51951 22871
13013 22871 32531 25865 14345 67546 103000 116816 90584 115384 124218 132046 132128 147991 154699
13000 154699 104381 131270 220568 340419 419652 390461 339405 278817 177272 158605 188762
12989 188762 153319 200992 255333 230357 212002 258133 269283 243849 329626 393447 376822
12978 376822 331056 255344 209340 103266 85117 119364 143594 117473 156453 142275 161506
12967 161506 255096 326999 258632 211329 196496 175033 149470 109959 117244 198637 233085 197779
12955 197779 203445 217006 171202 108009 163872 288223 322990 202381 135159 163020 201664
12944 201664 212549 179639 182388 132698 108144 101241 139993 154290 145001 90005 23130 39285
12932 39285 68410 44900 54088 17238 28327 49314 22624 8486 -27524 -18665 -50408 -64646
12920 -64646 1195 20249 -522 15619 -16065 -7547 83723 134860 126692 87542 59018 63474
12908 63474 21627 -5237 44777 18976 26075 5008 -5676 -34755 4476 25569 59662 101699
12896 101699 123950 89527 53295 35242 32672 48216 56143 71794 51419 26644 -32630 -125756
12884 -125756 -15858 59868 -28718 -15186 34516 9528 14171 1912 -4244 3846 1764 -45750
12872 -45750 43953 46839 -79625 -83724 -33068 11319 -3103 -16424 -10047 38220 19388 -82787
12860 -82787 -81871 -68631 -78110 -33990 5046 15140 82277 51958 52519 26576 -61248 -55852 -50963
12847 -50963 -7095 18818 44318 61926 30134 2765 -12657 -35581 -34032 -22001 -48096 -84239
12835 -84239 -51407 -34516 -53323 2781 62619 50705 39835 7785 4901 -3683 -39287 -38680
12823 -38680 -16392 -2672 20526 47723 35999 -138 -66432 -62255 -50461 -4669 54296 86
12811 86 27009 74170 6573 -32122 -54554 -68057 -51776 -41276 -21627 -4572 28163 58129
12799 58129 68392 38378 -26393 -41347 -44840 -53056 16322 52381 -8686 -57859 -74919 -18198
12787 -18198 16115 38470 -6897 4498 73756 56494 78919 90672 32559 -16081 33011 26936
12775 26936 -80093 -128777 -78640 -66460 -21688 3455 -10071 18376 6579 -7128 20639
12764 20639 35154 37477 24725 20185 20067 47152 15645 -20530 -43648 -29444 9918 -3717
12752 -3717 23651 -5358 -17042 -11141 -50835 -102728 -96413 -4669 80077 104343 46373 -32436
12740 -32436 -21913 10711 3576 43094 72101 -19409 11744 68018 114509 64601 20581 -5566
12728 -5566 783 -401 2375 -17015 -6786 -17339 -64316 -1104 -23930 -37218 -48517 -44192 -44756
12715 -44756 -28854 -62248 -69548 -65175 -75678 -49161 -73931 -75674 -53374 -6625 -38453 -97383
12703 -97383 -122866 -93134 -70299 -60250 988 18979 51786 93760 76629 46513 34266 -7681
12691 -7681 -70703 -4711 -20557 -30158 8139 60045 76238 61909 19662 -14579 -9058 1414
12679 1414 35319 -21013 -84349 -85914 -63287 -8822 -4971 -15713 -25410 -23417 -40194 -13312 -16716
12666 -16716 -5729 12788 21805 31600 30379 60960 60928 44034 77675 52625 47158 -6084 -46016
12653 -46016 -62039 -23556 -86561 -139788 -134139 -112604 -95303 -50242 8900 -1580 -26319 -26488
12641 -26488 -21193 -13354 -17688 -11922 -36391 -62246 -46203 -4534 6051 528 -7831 52432 78910
12628 78910 10486 -14201 -18844 -34586 -50927 -55005 -66522 24244 81370 81217 104929 121597
12616 121597 57651 23439 23376 -52998 -59838 -32809 -44491 -92947 -63008 15520 17237 2009
12604 2009 42840 -30834 -56875 13076 86898 32253 -20706 9232 10152 25640 1158 28329
12592 28329 19492 21233 11452 8676 -12811 -39189 -45673 1007 9948 15649 690 -26306 -85414
12579 -85414 -74222 -90917 -129063 -118188 -128445 -201641 -174004 -111750 -31573 -39865 -35079 -3387
12567 -3387 34165 22217 19243 -18962 -24215 -29291 -48857 -89845 -21949 14407 32549 32893 52655
12554 52655 70175 17733 -53414 -67352 -46362 -42387 -12339 20210 12021 77127 59700 26241
12542 26241 -21559 -43147 -4955 56118 28985 -43167 -102825 -80806 -49844 -45768 -46215 -38299
12530 -38299 -19809 36677 48589 89429 62357 41093 67273 87570 112249 107180 86128 6851
12518 6851 8538 43290 43294 34676 -6800 45057 57591 53804 66641 70180 38757 22078 41779
12505 41779 51720 84683 57661 -10318 30956 44048 16095 -8958 30019 42104 -22782 -8360
12493 -8360 26626 59959 153092 165767 146222 128659 39055 5617 54147 87422 138001 105176
12481 105176 48335 42639 43214 56238 61955 72931 54856 112605 143270 175970 183777 172055
12469 172055 107121 51985 99445 85063 27394 48674 65480 89689 137512 194232 256277
12458 256277 307048 369486 420105 466284 434216 381180 324068 313544 358868 297549 300566 378240
12446 378240 384720 375937 420376 432697 387033 357693 349703 413840 470576 494010 479098 427322
12434 427322 364219 329904 270584 245084 194324 176392 212056 222400 251557 331656 374951
12423 374951 386938 386087 428825 459397 430769 510166 587255 590220 556237 554852 439103 351166
12411 351166 325203 263924 246106 280254 253906 232176 219377 208627 222286 227090 166438 181482
12399 181482 259649 340187 345399 349187 267351 155256 163579 165224 88141 52710 -3646 6988
12387 6988 58909 132580 216275 262048 251277 253477 278149 358324 360278 330668 291372 245690
12375 245690 148799 98944 103384 86782 49272 36582 123600 103686 62202 82336 43497 69961
12363 69961 89527 42913 -2845 23276 32175 51454 45749 33522 70689 59663 -2714 46637
12351 46637 77469 72712 35654 6499 43511 77633 78823 98352 71785 42673 58178 44723
12339 44723 38804 46434 20753 -22502 -90290 -80116 -81517 18955 57676 73447 88180 73383
12327 73383 47939 12501 43485 64986 55872 26846 -12887 -40522 29876 28755 -49903 -115250
12315 -115250 -129985 -72173 17695 14391 47207 71191 76946 54870 -23941 -91515 -82482 -13888
12303 -13888 17892 66522 87758 101122 111862 61683 46954 16515 -10612 37360 47943 90670
12291 90670 27872 16905 30118 35132 24597 -2123 42960 54590 -31237 -93934 10187 61063
12279 61063 41098 17004 -51386 -68118 -20528 16822 37738 96182 83879 46910 59197 104855
12267 104855 139800 123824 71925 26571 -11365 -56329 -41185 14718 34972 -16629 -11536 13248
12255 13248 3316 -25837 -8491 54532 38426 -1176 61088 72658 27924 -32352 -27546 -30952
12243 -30952 -34829 -26119 -56283 -97268 -78904 11294 -34330 -79856 -95695 -87100 -17413 23981
12231 23981 31129 36900 59039 2238 -10815 30559 9210 -10651 25734 53572 2243 -26936
12219 -26936 11747 20494 7677 28769 82150 104996 56391 7503 54701 83825 31818 -9502
12207 -9502 61591 95170 94497 20768 -61121 -44473 -7096 13443 30354 32336 46555 -22720
12195 -22720 -44690 -5891 -16680 7408 1125 898 52553 102364 97466 52763 65058 106892
12183 106892 120254 105436 61723 34870 52590 24659 -27618 -52991 -86659 -86677 -90527 -84841
12171 -84841 -45813 -74243 -35680 26452 52544 69045 106304 134263 91782 63264 108171 165282
12159 165282 164959 162622 133546 152511 189152 176343 209236 232613 312334 386429 526008 718203
12147 718203 854617 854547 750104 577077 476420 414871 358754 315591 235806 174120 101087
12136 101087 142072 132725 60941 43645 43937 81269 99761 88833 111447 108552 112907 197405
12124 197405 280165 374400 517033 710165 914357 1162312 1258084 1222630 1022997 834312
12114 834312 663126 510416 432962 351435 234755 157413 96127 135764 220553 203193 217690
12103 217690 147253 96110 133971 150455 146319 139301 148332 135683 193427 266338 346942 391131
12091 391131 330065 309756 333279 320701 398633 417948 424510 502206 503081 376720 293319 253373
12079 253373 212997 143921 97398 122019 191660 175506 123472 107802 109719 95408 107620 61253
12067 61253 43446 14662 42600 89948 48665 22997 -6996 12648 30432 -14878 6456 35516
12055 35516 -59140 -70203 -101579 -91925 -44684 10997 -6528 10290 -1045 -49249 -56671 -32960
12043 -32960 -1188 53263 51673 48956 60180 35799 -4281 -26521 -33054 -23107 14467 6362 2126
12030 2126 -9716 -22797 -8124 -5841 -3141 -56715 -103549 -54386 8184 11655 -20049 -8810
12018 -8810 16012 11622 -62634 -35790 -17580 -14405 -13514 11255 -49483 -73619 -47631 -17461 6648
12005 6648 -14315 -60968 -66139 -9957 -1965 -29241 44791 104795 65603 41951 18248 -31421
11993 -31421 12851 39717 43225 -11354 -22313 22347 7217 -34153 -51567 -9743 -24514 8278
11981 8278 51838 15797 -34455 2893 16521 -14151 -32794 -62767 -99641 -91754 -56003 -20416
11969 -20416 -3962 -56026 -29228 16112 -16610 -34253 -37040 -21660 -171 -18595 -41784 -11267
11957 -11267 15517 19838 30633 41327 46983 29502 10400 -9956 52948 130390 113895 73046
$$ [...]
##END NTUPLES=NMR SPECTRUM
##END=
