##TITLE=Analysis number 326380
Compound Code cc 54804
Book Reference 511/68
Project Code adrs
Chemist Name stevem
##JCAMPDX= 6.0         $$ Bruker NMR JCAMP-DX V2.0
##DATA TYPE= NMR SPECTRUM
##DATA CLASS= NTUPLES
##ORIGIN= Bruker BioSpin GmbH
##OWNER= nmr
$$ XWIN-NMR		Version 3.5
$$ Tue Feb  6 10:16:07 2007 GMT Standard Time (UT+0h)  MAYBRIDGE\nmr@NMR_250MHZ
##.OBSERVE FREQUENCY= 250.131544655141
##.OBSERVE NUCLEUS= ^1H
##.ACQUISITION MODE= SIMULTANEOUS (DQD)
##.ACQUISITION SCHEME= undefined
##.AVERAGES= 16
##.DIGITISER RES= 18
##SPECTROMETER/DATA SYSTEM= dpx250
##.PULSE SEQUENCE= zg30
##.SOLVENT NAME= CDCl3
##.SHIFT REFERENCE= (INTERNAL, CDCl3, 0, 16.4508)
##AUDIT TRAIL= $$ (NUMBER, WHEN, WHO, WHERE, WHAT)
$$ ##TITLE= Audit trail, XWIN-NMR		Version 3.5
$$ ##JCAMPDX= 5.01
$$ ##ORIGIN= Bruker BioSpin GmbH
$$ ##OWNER= nmr
$$ C:\u/data/dgb/nmr/ADRS/370/pdata/1/auditp.txt
$$ ##AUDIT TRAIL=  $$ (NUMBER, WHEN, WHO, WHERE, WHAT)
(   1,<2007-02-06 10:15:33.89 +000>,<MAYBRIDGE\nmr>,<NMR_250MHZ>,
      <created by zg, POWCHK disabled, PULCHK disabled
       configuration hash MD5:
       49 4B E0 1D 92 C2 6B 37 9F E6 65 BC 52 41 86 1D
       data hash MD5: 64K
       38 D5 8F AD F9 78 9F 3E B8 4F 3E 5B C9 5A 7C 20>)
(   2,<2007-02-06 10:15:55.50 +000>,<MAYBRIDGE\nmr>,<NMR_250MHZ>,
      <Start of raw data processing
       ef LB = 0.3 FT_mod = 6 PKNL = 1 SI = 32K 
       data hash MD5: 32K
       F2 0B EE B7 13 E8 C2 1F 6A 8F A1 B3 13 B4 FE 0C>)
(   3,<2007-02-06 10:15:57.41 +000>,<MAYBRIDGE\nmr>,<NMR_250MHZ>,
      <apk 
       data hash MD5: 32K
       D7 79 F2 7F 61 3C CB B4 A3 E9 E5 EC E5 7A F5 D1>)
(   4,<2007-02-06 10:15:58.11 +000>,<MAYBRIDGE\nmr>,<NMR_250MHZ>,
      <abs ABSG = 5 
       data hash MD5: 32K
       37 45 C9 A7 E2 77 EC 79 6E 1A F7 BA 41 1C A9 A6>)
$$ ##END=
$$ 
$$ hash MD5
$$ 7B 19 8A 1A 47 3C EA 31 51 B1 B9 1E 02 36 DC 8B
##$RELAX= 
##$RELAX= 
##$RELAX= 
##$RELAX= 
##$RELAX= 
##$RELAX= 
##$RELAX= 
$$ Bruker specific parameters
$$ --------------------------
##$DU= <C:\u>
##$EXPNO= 370
##$NAME= <ADRS>
##$PROCNO= 1
##$TYPE= <nmr>
##$USER= <dgb>
##$AMP= (0..31)
100 100 100 100 100 100 100 100 100 100 100 100 100 100 100 100 100 100 
100 100 100 100 100 100 100 100 100 100 100 100 100 100 
##$AQSEQ= 0
##$AQ_mod= 3
##$AUNM= <au_zg>
##$AUTOPOS= <40 >
##$BF1= 250.13
##$BF2= 250.13
##$BF3= 250.13
##$BF4= 250.13
##$BF5= 500.13
##$BF6= 500.13
##$BF7= 500.13
##$BF8= 500.13
##$BYTORDA= 1
##$CFDGTYP= 0
##$CFRGTYP= 5
##$CHEMSTR= <none>
##$CNST= (0..31)
1 1 145 1 1 1 1 1 1 1 1 1 1 1 1 1 1 1 1 1 1 1 1 1 1 1 1 1 1 1 1 1 
##$CPDPRG= <>
##$CPDPRG1= <>
##$CPDPRG2= <>
##$CPDPRG3= <>
##$CPDPRG4= <mlev>
##$CPDPRG5= <mlev>
##$CPDPRG6= <mlev>
##$CPDPRG7= <mlev>
##$CPDPRG8= <mlev>
##$CPDPRGB= <>
##$CPDPRGT= <>
##$D= (0..31)
0 1 0 0 0 0 0 0 0 0.06 0 0 0 0 0 0 0.0002 0 0 0 0 0 0 0 0 0 0 0 0 0 0 
0 
##$DATE= 1170756932
##$DBL= (0..7)
120 120 120 120 120 120 120 120 
##$DBP= (0..7)
150 150 150 150 150 150 150 150 
##$DBP07= 0
##$DBPNAM0= <>
##$DBPNAM1= <>
$$ [...]
##$SUBNAM7= <"">
##$SUBNAM8= <"">
##$SUBNAM9= <"">
##$SW= 20.6930455092707
##$SWIBOX= (0..15)
0 0 3 0 0 0 0 0 0 0 0 0 0 0 0 0 
##$SW_h= 5175.983436853
##$TD= 65536
##$TD0= 1
##$TE= 294.16
##$TE2= 300
##$TE3= 300
##$TEG= 300
##$TL= (0..7)
0 120 120 120 120 120 120 120 
##$TP= (0..7)
150 150 150 150 150 150 150 150 
##$TP07= 0
##$TPNAME0= <>
##$TPNAME1= <>
##$TPNAME2= <>
##$TPNAME3= <>
##$TPNAME4= <>
##$TPNAME5= <>
##$TPNAME6= <>
##$TPNAME7= <>
##$TPOAL= (0..7)
0.5 0.5 0.5 0.5 0.5 0.5 0.5 0.5 
##$TPOFFS= (0..7)
0 0 0 0 0 0 0 0 
##$TUNHIN= 0
##$TUNHOUT= 0
##$TUNXOUT= 0
##$USERA1= <user>
##$USERA2= <user>
##$USERA3= <user>
##$USERA4= <user>
##$USERA5= <user>
##$V9= 5
##$VALIST= <valist>
##$VCLIST= <CCCCCCCCCCCCCCC>
##$VD= 0
##$VDLIST= <DDDDDDDDDDDDDDD>
##$VPLIST= <PPPPPPPPPPPPPPP>
##$VTLIST= <TTTTTTTTTTTTTTT>
##$WBST= 1024
##$WBSW= 4
##$XGAIN= (0..3)
0 0 0 0 
##$XL= 0
##$YL= 0
##$YMAX_a= 225196
##$YMIN_a= -318177
##$ZGOPTNS= <>
##$ZL1= 120
##$ZL2= 120
##$ZL3= 120
##$ZL4= 120
##$ABSF1= 16.45082
##$ABSF2= -4.242352
##$ABSG= 5
##$ABSL= 3
##$ALPHA= 0
##$AQORDER= 0
##$ASSFAC= 0
##$ASSFACI= 0
##$ASSFACX= 0
##$ASSWID= 0
##$AUNMP= <proc_1d>
##$AZFE= 0.1
##$AZFW= 0.1
##$BCFW= 0
##$BC_mod= 0
##$BYTORDP= 0
##$COROFFS= 0
##$CY= 12.5
##$DATMOD= 1
##$DC= 0
##$DFILT= <>
##$DTYPP= 0
##$F1P= 14.0000005364418
##$F2P= -0.99999901652339
##$FCOR= 0.5
##$FTSIZE= 32768
##$FT_mod= 6
##$GAMMA= 0
##$GB= 0
##$INTBC= 1
##$INTSCL= 1
##$ISEN= 128
##$LB= 0.3
##$LEV0= 0
##$LPBIN= 0
##$MAXI= 10000
##$MC2= 0
##$MEAN= 0
##$ME_mod= 0
##$MI= 0
##$NCOEF= 0
##$NC_proc= -5
##$NLEV= 6
##$NOISF1= 0
##$NOISF2= 0
##$NSP= 0
##$NTH_PI= 0
##$NZP= 0
##$OFFSET= 16.45082
##$PC= 1
##$PHC0= 236.4386
##$PHC1= 6.099934
##$PH_mod= 1
##$PKNL= yes
##$PPARMOD= 0
##$PSCAL= 4
##$PSIGN= 0
##$REVERSE= no
##$SF= 250.130017802763
##$SI= 32768
##$SIGF1= 0
##$SIGF2= 0
##$SINO= 400
##$SIOLD= 32768
##$SREGLST= <1H.CDCl3>
##$SSB= 0
##$STSI= 32768
##$STSR= 0
##$SW_p= 5175.98343685301
##$SYMM= 0
##$S_DEV= 0
##$TDeff= 65536
##$TDoff= 0
##$TI= <Analysis number 999999
Compound Code 99
Book Reference 9
Project Code 9>
##$TILT= no
##$TM1= 0
##$TM2= 0
##$TOPLEV= 0
##$USERP1= <user>
##$USERP2= <user>
##$USERP3= <user>
##$USERP4= <user>
##$USERP5= <user>
##$WDW= 1
##$XDIM= 32768
##$YMAX_p= 516749737
##$YMIN_p= -825397
$$ End of Bruker specific parameters
$$ ---------------------------------
##NTUPLES= NMR SPECTRUM
##VAR_NAME=  FREQUENCY,     SPECTRUM/REAL,   SPECTRUM/IMAG
##SYMBOL=    X,             R,               I
##VAR_TYPE=  INDEPENDENT,   DEPENDENT,       DEPENDENT
##VAR_FORM=  AFFN,          ASDF,            ASDF
##VAR_DIM=   32768,         32768,           32768
##UNITS=     HZ,            ARBITRARY UNITS, ARBITRARY UNITS
##FACTOR=    0.157963299565203, 1,           1
##FIRST=     4114.84413030293, 0,            0
##LAST=      -1061.13930655008, 0,           0
##MIN=       -1061.13930655008, -825397,     0
##MAX=       4114.84413030293, 516749737,    0
$$ Real data points
##PAGE= N=1
##DATA TABLE= (X++(R..R)), XYDATA
$$ [...]
23091A14433m156N3250K7165j26723l15556k1060p3738J19584L75836m3029j3249
23080I2757J8158q614j8686n8700Q1490j21710O0191J12184j36285k79900K7111
23069b32004K6381Q7701K24555Q8089n4710Q887m2902o0967m3559k86862J63297
23058a22094K47445m2335j63155P0614K39664J61027L1085k36723j70790r4134
23048g9396j19248N2531J61385J12513o7820j59355K0690Q1776k540J94250o5647
23037A29139J36314q6726j00843N2014K7491o967q1007k01272j11189J40553L49762
23026B47269J32251l4524j7840j54892p2290k07563J21640j01242k79557O8374
23016b98374K82552J23399J2753k05232j6908n2761o8961n1852l0285J48885R7569
$$ y = [114433, 110277, 163527, 190692, 63969, -251587, -272647, -346385, -226801, 149035, 106006, 92757, 110915, 102301, 83615, 24915, 106405, -15305, 44886, 157070, 20785, -259115, -232004, -205623, -117922, 106633, 194722, 140012, 148899, 105997, 45030, 1471, -285391, -122094, 125351, 83016, -80139, -9525, 230139, 391166, 422251, 185528, 14738, -79396, -198644, -146113, 15272, 127785, 59965, -99390, -78700, 3076, 536, 194786, 129139, 265453, 178727, 77884, 129898, 157389, 150422, 69415, -131857, -243046, -102493, 247269, 379520, 344996, 327156, 172264, 99974, -107589, 14051, -87191, -366748, -298374, -15822, 107577, 120330, -84902, -101810, -154571, -223532, -275384, -305669, -156784, -59215]
23005e9215n6545Q0254M0939q6143j0295p7506j72413J37198J96605J09028k04170
22994a02263k84189j192J69985R9930l6133j9450N7021j17114r0528n770j42515
22983d72218Q6456J92746K0460N0240J06323j6592l5036j21179j8709M5789j08724
22972b70444N9872M539R2485J68165J27662J11845m0611j74355P2152J14352l3226
22961B32436j23378j06131J44655L195j84165j70261P0863J40386J13086J18212
22951B38898j36825k55519n3344K56932J12317M1068j75114n525r1666p8295R0612
22940e6461K25758j1259k62797j66176J4772K15508K93719J79534l5196q3158
22930C14244o7410r6132j50278j75062K74991J92507m68r0158j10024O3746Q6049
$$ y = [-59215, -115760, -35506, 5433, -80710, -91005, -168511, -340924, -203726, -7121, 101907, -102263, -386452, -387644, -217659, -117729, -153862, -173312, -116291, -233405, -323933, -329703, -472218, -385762, -193016, -172556, -122316, -15993, -32585, -67621, -188800, -207509, -161720, -270444, -210572, -206033, -113548, 54617, 182279, 294124, 253513, 79158, 151310, 265662, 232436, 109058, 2927, 147582, 150777, -33388, -203649, -132786, 7600, 120686, 238898, 102073, -153446, -206790, 50142, 162459, 203527, 28413, 22888, -68778, -147073, -56461, 169297, 158038, -104759, -270935, -256163, -40655, 253064, 432598, 397402, 314244, 246834, 150702, 424, -174638, 100353, 292860, 292392, 202234, 92210, 155956, 242005]
22919B42005j35150J16704J10119Q8291k98890k92224j13610k01846K46662K54837
22909A6898O3079J40718K27634m4475q1624j18965j06797k84241j85304J51924
22899b21153J51926J46873J11745o85p0924j17125K161J85498j24378j67322L7632
22888f5752n3693o3190O2223K42029J61131l5753j25325m1142j97046r5864N7138
22877a55244N9325l3852j0189j9683K04393L1859K1366m4316j31246q8711p7333
22866b43631l8927J78935Q7469O1232m9581P9528q7381J12645J60009q7233l69693
22855a96628L4407J30131J31250M4181n9127j40518k04809k2847L03964J61753
22845A81757j56670n2830j30720Q4534M1603r3952j39321J69881L14973l2192
$$ y = [242005, 106855, 223559, 333678, 421969, 123079, -169145, -282755, -484601, -237939, 16898, 79977, 220695, 448329, 403854, 322230, 203265, 96468, -187773, -373077, -221153, -69227, 77646, 189391, 188706, 117782, 657, 2818, 188316, 63938, -103384, -65752, -119445, -182635, -120412, 121617, 282748, 246995, 121670, 80528, -116518, -212382, -155244, -95919, -129771, -139960, -159643, 44750, 76609, 97975, 53659, -77587, -166298, -243631, -282558, -103623, -16154, 45078, -4503, 75025, -12356, 100289, 260298, 173065, -196628, -162221, -32090, 99160, 143341, 84214, -56304, -261113, -283960, 20004, 181757, 25087, -27743, -158463, -73929, -32326, -126278, -265599, -95718, 219255, 187063]
22835A87063l00290J42721J64292l1697k57125p7945l408j7286j18830j37557
22825d50062J30460J32527J04173J50166L6220m2329N3723p1004M5227L7686J03406
22814B30193J05671R1751R7740N5570j20731N2251R5332J17537n5076j42790j48680
22803C78768j07647j18778j94492J10633J279o7960k21383j0985J90729K4688
22793a5148m9327J13694k00657n1649J25968Q4435o723J4162j06566J9688K25837
22782A53714M9078k03084j76170K784m771j56375J8795J82505J02842k7278j3052
22771g1012q076O3097K62935O121J155J46632j11146j24501m7908k45382n0561
22760a78646K49928K11854j7473r0729k39244j45602R1430J07621M1171r7213
$$ y = [187063, -113227, 29494, 193786, 162089, -95036, -172981, -176389, -193675, -312505, -450062, -319602, -187075, -82902, 67264, 103484, 61155, 114878, 43874, 89101, 126787, 230193, 335864, 427615, 525355, 580925, 460194, 512445, 607777, 725314, 670238, 527448, 378768, 271121, 152343, -42149, 68484, 69763, 1803, -219580, -230565, -39836, -15148, -64475, 49219, -151438, -203087, -77119, 7316, 593, 14755, -91811, -72123, 153714, 202792, -292, -176462, -173678, -178449, -334824, -316029, -133524, -30682, -57960, -71012, -79088, -15991, 246944, 253065, 254220, 400852, 289706, 165205, 117297, -128085, -178646, 71282, 283136, 265663, 174934, -64310, -209912, -118482, -10861, 30310, -66903]
22750f6903n8474n8806K9887k81050o5276j45757J84615K43734Q2810K06838m5967
22739B5651R5946p739J6133j36805r6879P3426K15307m2843j03279P0749J19656
22728B29323J79981J50996j92435q5685P7417n6713l34579l7995o781J99667J16408
22717B39604J15025N6864K8426j00378j4902j38690M3113J60552m8118j5925q5881
22706B39690q4109J77077R7546J26762j14009k42062j80592N0078J06282Q2150
22696B58813M3572O0813Q6327q2697j50866J12164m8510j1365r9054N6045l7860
22685A87382J51349n2413J6940k49557l9555J26341K58716K38880Q6424n8421
22675F66086l38019l17171R8523j45439k0154N7044N2654J38778k73398p330J37402
$$ y = [-66903, -125377, -184183, -154296, -435346, -500622, -646379, -461764, -218030, -135220, 71618, 25651, 121597, 113858, 129991, -6814, -103693, -30267, 185040, 142197, 38918, 109667, 229323, 409304, 560300, 367865, 282180, 359597, 302884, -31695, -69690, -76471, 123196, 239604, 354629, 411493, 439919, 339541, 324639, 185949, 229062, 389614, 341496, 325571, 239690, 155581, 332658, 430204, 556966, 442957, 200895, 20303, 70381, 176663, 258813, 302385, 363198, 449525, 366828, 215962, 328126, 279616, 268251, 169197, 225242, 187382, 338731, 286318, 303258, 53701, 14146, 140487, 399203, 638083, 724507, 666086, 328067, 10896, 109419, -36020, -56174, 870, 53524, 192302, -81096, -88426, 48976]
22664D8976J50734J19910J51858j0770l0319J24654j81462m24100j02232K68728
22654A15977J26532o5313p5607l0484k1733O7029L6163q2584N6061J89127J02062
22643D17230j03210k43525m6112P3123L35049K50157L4066M21731L67884M87660
22633A994053N88889L25351m1599j78404k489j5127o52612m36273j76231j81119
22623A224439j15488p0833j15551o6216n1380R0219R374p605k6852J9107O8338
22612I57552L3353k53095k8294J55908J40636j7152o8938j28749K5771J66318
22602I83310P1398J62489K00560L4601M5192L2882J85685K45258M9182n5796j00865
22591A853896Q6083J49914J11600J08608L09289K53767N8808Q4206K94448J13400
$$ y = [48976, 199710, 319620, 471478, 460708, 430389, 555043, 373581, -50519, -152751, 115977, 242509, 177196, 101589, 71105, 49372, 116401, 152564, 69980, 126041, 315168, 417230, 314020, 70495, 24383, 97506, 432555, 682712, 716778, 1138509, 1506393, 1994053, 2582942, 2908293, 2866694, 2688290, 2685801, 2670674, 2018062, 1581789, 1405558, 1224439, 1108951, 1038118, 922567, 856351, 804971, 895190, 904564, 896959, 870107, 889214, 957552, 990905, 737810, 709516, 865424, 1006060, 988908, 919970, 791221, 816992, 983310, 1054708, 1217197, 1417757, 1452358, 1497550, 1530432, 1716117, 1961375, 2010557, 1954761, 1853896, 1939979, 2089893, 2201493, 2310101, 2619390, 2873157, 2931965, 3016171, 3310619, 3424019]
22581C424019K83649L17924K92541L88770L03448K75197Q90262P45149N50004
22572G470963R50352J382210J449680J760692K301769K692001L498500M600222
22564B6106389N749434P562280J1454729J7885916K9399368M9692970P8153488
22557B26004574R7811012Q1770358L5964006L023794n557483k9796685p6030913
22550C33188663r9326602q1657236n0693552k9042367j7858249j2076028q459531
22543C4075098o426702m995302l836772k835762k375200j932838j166151r94160
22535I512211q40586n94851n61418o47731o97709n98780o50536n16747l44723
22526D059130l42691l33012k86174k88037K5724Q0970l9201J1340k59758m34950
$$ y = [3424019, 3707668, 4025592, 4318133, 4706903, 5010351, 5285548, 6175810, 6920959, 7470963, 8421315, 9803525, 11253205, 13013897, 15315666, 18007667, 21506167, 26106389, 31855823, 39418103, 50872832, 68758748, 98158116, 147851086, 226004574, 323815586, 405585944, 441549950, 444573744, 439016261, 409219576, 333188663, 233862061, 152204825, 101511273, 72468906, 54610657, 42534629, 34075098, 27648396, 22653094, 18816322, 15980560, 13605360, 11672522, 10506371, 9512211, 8671625, 8076774, 7515356, 6867625, 6169916, 5571136, 4920600, 4403853, 4059130, 3716439, 3383427, 3097253, 2809216, 2834940, 2915910, 2876709, 2888049, 2628291, 2193341]
22516B193341j9207j98867o9285j96709k84725k517J31692J02949p5864l08520
22506A272288j81407P0345q6684k6997l4912m7788o6314k7850J917R1152N1163
22495A014913n4104p5414j02841Q374n945N203L2967J3133N4767j50429j01014
22484F39610O0713J18268L11925K89187K79090K73918N28734M26354Q0962P3426
22474C082187j904l18870m27260o25942n21563k71404K4669J46275r6620j0962
22464I78606k18577j30382p2369j71512j76273L6176K15308J42669N7698m8636
22454F12708k30334J11551R0421j16603o4665j00980J02367Q5608L8048j56496
22444C71625p7379j0657N0141J02699l7283l4380k01233o3593K10363p9434j92176
$$ y = [2193341, 2174134, 1975267, 1905982, 1709273, 1424548, 1422031, 1553723, 1656672, 1580808, 1272288, 1090881, 1161226, 1074542, 1047545, 1012633, 964845, 898531, 870681, 872598, 963750, 1014913, 960809, 885395, 782554, 790928, 784983, 790186, 823153, 836286, 891053, 740624, 639610, 700323, 818591, 1130516, 1419703, 1698793, 1972711, 2501445, 2927799, 3008761, 3082187, 3080283, 2761413, 2334153, 1708211, 1186648, 915244, 939913, 1086188, 989568, 978606, 760029, 629647, 557278, 385766, 209493, 245669, 460977, 603646, 661344, 612708, 382374, 493925, 584346, 467743, 403078, 302098, 404465, 490073, 528121, 371625, 294246, 283589, 333730, 436429, 399146, 364766, 163533, 99940, 310303, 230869, 38693]
22433C8693L5528J48364N2973m7712O3678j6697L0131J16379Q831j08132J23120
22422D45156J82171M2430j89219L6468j0732J90261j44428k53121K7394M7267
22412C73647J2971j23348m6585n425l5820k52507l6482M7476K2411j48539l6171
22401b28372m4357P9747p541K8875j7918r082J08539K00669R1110j28124j89060
22390a15514J07368K21722N0306J28161j53660j46821J85574L19842j1128m26019
22380A59831o6014q8587j9631J63015L17106k42726j91683l9314J38868j44579
22370a3714j00824j4223J00686k859J70219r5163m5492J33489J22429R0064J37680
22359D82292n8739o5960r0813l4666k14610k51428j77571R4803J73966M2986J1227
$$ y = [38693, 74221, 222585, 275558, 227846, 291524, 274827, 304958, 421337, 430168, 322036, 445156, 627327, 669757, 480538, 517006, 506274, 696535, 552107, 298986, 326380, 373647, 386618, 263270, 216685, 211260, 175440, -77067, -113549, -66073, -43662, -192201, -228372, -272729, -192982, -200523, -171648, -189566, -198648, -90109, 110560, 201670, 73546, -115514, -8146, 213576, 263882, 392043, 238383, 91562, 277136, 596978, 585850, 159831, 93817, 5230, -14401, 148614, 465720, 222994, 31311, -8003, 130865, -13714, -114538, -128761, -28075, -30934, 139285, 44122, -1370, 132119, 254548, 344612, 482292, 423553, 357593, 266780, 232114, 17504, -233924, -411495, -316692, -142726, -99740, -88513]
22348h8513J99976N7785k02450J65368q736n7399o7873P563O0251r0759k34894
22337b59681J39858O1411n2576J13222j46564q470J29456J27915l8393j34424
22327f8246l0304j37407J71216N8560m2648P5529r6308k9412N7986j7488q0960
22316a39482J19151J4406j6107J8253Q5834j24127m2017j2616p78J31983k05770
22305a71270J81864k8296J40511P5952N0363r6820Q738J99662l8011k45140m9633
22294B7920m9600k30220j87025Q3733J62200K4810k40732n2135J64297R7056l8980
22283b38676j3552K4812O2877n8017N371K10012m3754N634l040j61297o3661P9258
22271a94033N9365O0168l0079O892J17318r9429m12542j16298L8279J74808o9904
$$ y = [-88513, 111463, 169248, -33202, 132166, 123430, 66031, -1842, 5721, 65972, -24787, -259681, -119823, -58412, -110988, 2234, -144330, -152800, -23344, 104571, 66178, -68246, -98550, -235957, -64741, -6181, -48829, 26700, -69608, -99020, -41034, -58522, -139482, -20331, -5925, -22032, -3779, 82055, -42072, -84089, -96705, -97483, 34500, -171270, 10594, -17702, 122809, 198761, 249124, 152304, 161042, 360704, 322693, 77553, 27920, -21680, -251900, -438925, -355192, -192992, -168182, -408914, -461049, -296752, -199696, -238676, -252228, -227416, -164539, -222556, -217185, -7173, -50927, -45293, -48333, -209630, -273291, -194033, -134668, -74500, -104579, -97687, 19631, -79798, -492340, -608638, -570359, -395551, -465455]
22260d65455o9672J44428N7943n9311J05797J22315K90925J90069l3645p5393
22250B08001j96291l34074J7366J25600J67671J91070n5457n6239J008k15128
22240a46473K51731L82484M2564p1765k60512k10590p139k3844k2094L6275j7376
22229d6739p8018o9763J32582J54261j38481O6405L5269j48790r3169K44605J69644
22218B27806N2938N1259j7337m3375O0093j23108j58188J57170N8764j71222p4323
22207B0477j8217O1292L4755J16696m5383p8679k5699q8660l7050O6345j04692
22196i8815q3561m9571l5279Q5543Q9370j9503K020J64841j9289k49148q4048
22185b97440J07928K8073o2821J71423J01991l9470o0243O75J10308j0535n7393
$$ y = [-465455, -535127, -390699, -332756, -392067, -286270, -163955, 126970, 317039, 283394, 208001, 11710, -322364, -304998, -179398, -11727, 179343, 123886, 67647, 68655, -146473, 105258, 487742, 530306, 458541, 198029, -12561, -19700, -43544, -65638, -29363, -46739, -124757, -194520, -61938, 92323, -46158, 20247, 55516, -93274, -186443, 58162, 227806, 280744, 332003, 314666, 271291, 331384, 208276, 50088, 207258, 266022, 94800, 20477, 2260, 63552, 98307, 215003, 169620, 90941, 65242, -23418, -60468, 5877, -98815, -182376, -231947, -267226, -181683, -92313, -111816, -109796, 55045, 35756, -213392, -297440, -189512, -161439, -224260, -52837, 49154, 9684, -50559, -49884, 60424, 49889, -7504]
22174g504j94685n2229K44556K01598k19402l02396M0531Q3900l807m1266j17673
22163c68377Q6764K35455K41912p2417j97076k19125r0039J46556Q1054L08048
22153A52755N890L8927Q8023k38735j75895K6654N2953k301j46728Q7444j82151
22142b93164P5088J85900M0978J23855Q1442r6461j2467J43413n5825l9546J61988
22131C15201R9719j83607j96302J5933L5376j75267j03475Q7414J83604j10447
22121c1851j11802j8666J04304j5365l0615L5393o6826l9301K8065K4778m8722
22110a70608j3506Q1084J52076J10887j19020j69631p1689K10961R5294k04585
22100i8737p7145J28531r0961j98385J24143p3480q8931P7338k1903J04065K96372
$$ y = [-7504, -202189, -254418, -9862, 191736, -27666, -330062, -289531, -205631, -209438, -250704, -368377, -281613, -46158, 195754, 123337, -73739, -292864, -382903, -236347, -155293, 152755, 158645, 197572, 285595, 46860, -129035, -102381, -49428, -51729, -198457, -111013, -293164, -218076, -32176, 8802, 132657, 214099, 117638, 105171, 248584, 192759, 153213, 315201, 414920, 231313, 35011, 50944, 86320, -88947, -192422, -105008, 78596, -31851, -143653, -162319, -58015, -73380, -103995, -68602, -135428, -174729, -146664, -121886, -170608, -184114, -103030, 49046, 159933, 40913, -128718, -200407, 10554, 105848, -98737, -175882, -47351, -138312, -336697, -212554, -286034, -374965, -297627, -319530, -215465, 80907]
22089H0907K05248k5855k09701J95355O265j51767j55790K04090J94360k2045
22079C21067j62771m0994j90788j41590j894J35267K63323q4710l93219J06098
22069a90211K74303J89216J02621Q2331J51518r9962j4504P3631k0870r8304k95437
22058A54332j16069j32740m9107l4066J09424L4501J5170J43332J39019j71361
22048I2435l09314r7886k0021J01412J21151l4849k6614N0976R3454j92989q8521
22037c10766K70j38862j67283J56318L09044J98963j561n678r0151q9536q3130
22026b22372P8201J32143j61531p4290J40151l2298L8590J33371J89414K4856
22016B46235j23897l77634J83570L01816q1456M1708P2403O3670r581k4668o1224
$$ y = [80907, 286155, 260300, 50599, 245954, 252219, 100452, -55338, 148752, 343112, 321067, 158296, 117302, -73486, -215076, -216970, -81703, 181620, 96910, -296309, -190211, 84092, 273308, 375929, 458260, 609778, 509816, 495312, 568943, 548073, 449769, 154332, 38263, -94477, -143584, -177650, -68226, -33725, -18555, 124777, 263796, 92435, -216879, -314765, -334786, -233374, -112223, -147072, -173686, -122710, -29256, -222245, -310766, -310496, -449358, -616641, -460323, -151279, 47684, 46123, 40445, -49706, -139242, -222372, -144171, -12028, -173559, -247849, -107698, -139996, -101406, 31965, 221379, 246235, 122338, -255296, -71726, 230090, 148634, 190342, 262745, 326415, 316834, 292166, 230942]
22005B30942j49132O4640j35594j73222J95365L24465K05513l300R8902L24853
21995I83432L14920L72646L23985J66067K11144J92183k05657m97814m40858m13867
21985A006181n13679k26865N745l0607j60994M6413K3890q6663l6304n1073N2184
21974B8228R0665N3967O316j14719J53594Q0676l3196P9384j55864k11439M9071
21963B6683j495o5809K65198K39766O3491j24499l53933j64388k41321q3716O5974
21952c74049N0047K10867K25422j38439r5034K6497K6928m8417O9865q4352K8739
21941a01926j40189j17150j00806j847K53625K21823K6738n9835n0997P1224K4305
21930B4965j37824M4481Q1991k0330m1038q7315K6935J30088r902J5800J9824
$$ y = [230942, 81810, 146450, 10856, -162366, 32999, 357464, 562977, 559677, 658579, 983432, 1298352, 1670998, 1994983, 2161050, 2372194, 2564377, 2358720, 1860906, 1420048, 1006181, 492502, 265637, 271382, 240775, 79781, 126194, 150084, 63421, 27117, -23956, 28228, 118893, 172860, 179176, 64457, 218051, 298727, 265531, 344915, 189051, -22388, 26683, 25188, -40621, 224577, 464343, 527834, 403335, 49402, -114986, -356307, -440023, -374049, -324002, -113135, 112287, -26152, -121186, -94689, -67761, -116178, -46313, -130665, -101926, -242115, -359265, -460071, -461918, -208293, 13530, 40268, -19567, -70564, 660, 24965, -112859, -68378, 13613, -6717, -47755, -135070, -108135, 21953, 12051, 27851, 47675]
21919D7675M1556K2142k5077j23814l9394k05152k3163J18164L6574J66154K9126
21908D4791o2403k20334n3118q864K8887P1404m2062M0277J33869J22682J08325
21897A63454j39896q6852K2114j06017K0455J48912k08662j81864K65115J36509
21887C3268J48214Q5132l9038p6276p0485N343N5530o819p5106j12121k54971
21876c07329J90706K47971k9508l8275r2886m2443J17662J343l4730m803l6819
21865b9111J13217n5649M7127r3222j0285q6432P8938j34254L6979J04558K8049
21854h5K9750m9576J2966K10172J8823k46804q6341K25507J23080Q4201j48319
21843A73374j39729k4384r4779L8798K65235J33273l7864n1472k43791j90536
$$ y = [47675, 89231, 111373, 86296, -37518, -76912, -282064, -305227, -187063, -150489, 15665, 44791, -17612, -237946, -291064, -299928, -271041, -199637, -241699, -201422, -67553, 55129, 163454, 23558, -63294, -41180, -147197, -126742, 22170, -186492, -368356, -103241, 33268, 181482, 266614, 227576, 151300, 80815, 86158, 141688, 134869, 59763, -52358, -307329, -116623, 131348, 101840, 63565, -29321, -71764, 45898, 47241, 12511, 7708, -29111, 84106, 28457, 75584, -17638, -27923, -114355, -35417, -169671, -132692, -28134, -85, 29665, -19911, -6945, 203227, 222050, -24754, -111095, 114412, 237492, 321693, 173374, 33645, 9261, -85518, -46720, 218515, 351788, 313924, 262452, 18661, -171875]
21833a71875O3057J55855n558J54779Q9831K25717J0572j70416j87370r8138J08880
21822A75334k7236J73676r0784k00781n0084l0920o0278n8233o4085j70455J34045
21811b69801J93864R8730R436O3156Q7194p2892k06915k36696j42332n8697N8034
21800d76919K85736J55962K0764P2150p2566m1357K8902J62989l3021J00757J08394
21789C11791j52928k10518j29402Q3097o438J63754N4048J2048k69261Q3396L09561
21778B49148K115j96216J6132J44522N7159J099R4481l2551J0591o7460n1343
21767B27677j77472P2766j05845j87835k2774k3071K0427N3627N7163J95382K65261
21756C75306l03353k79124J57425Q7253Q3502k2763j77173j03207N5422K9047
$$ y = [-171875, -108818, 47037, 41479, 196258, 286089, 511806, 522378, 351962, 164592, 66454, 175334, 148098, 321774, 230990, 30209, -19875, -50795, -111073, -169306, -233391, -403846, -269801, -75937, 22793, 32229, 95385, 182579, 109687, -97228, -333924, -476256, -534953, -476919, -191183, -35221, -14457, 57693, -14873, -56230, -27328, 135661, 102640, 203397, 311791, 158863, -51655, -181057, -97960, -104398, 59356, 113404, 125452, -143809, -60413, 249148, 251263, 55047, 71179, 215701, 272860, 273959, 368440, 335889, 346480, 279020, 227677, 50205, 122971, 17126, -170709, -193483, -216554, -196127, -142500, -85337, 110045, 375306, 71953, -207171, -49746, 37507, 121009, 98246, -78927, -182134, -126712, -97665]
21746i7665M4498j6831j90406J58031J85689J43533r6953k04568K0883R873Q9436
21735D5520Q951R9993l535o6985N2575L385n8346j41447j73370j14646J49302
21724a98603J58871m4444J73698J05774L5877j53029j45296m7671M8113q2897
21714a49607k27744J04628J03527j5756J46436P7104q910o9890n8742j77470J54377
21703a22047J19048j19040r9541l8327r9491O6437L2966P5964J40521R8698k7579
21692B7609o8553j09158R6286J1654L2378K4118N7931N5442J67810j40676J19193
21681B74034p7016j71424q2568m171J11664J86080R9673o6203j68556o8675M2025
21670G4863l9153j07564k60556o7180K05692J15811O7186J21664j0885j90279
$$ y = [-97665, -53167, -69998, -260404, -102373, 83316, 226849, 129896, -74672, -53789, -43916, 45520, 54471, 154464, 150929, 83944, 136519, 139904, 81558, -59889, -233259, -347905, -198603, -39732, -84176, 89522, 195296, 231173, 78144, -67152, -114823, -66710, -149607, -377351, -272723, -169196, -184952, -38516, 38588, 29678, -40212, -98954, -276424, -122047, -2999, -122039, -221580, -259907, -359398, -292961, -259995, -184031, -43510, 55188, 27609, -40944, -150102, -53816, -42162, -9784, 14334, 72265, 127707, 295517, 154841, 274034, 197018, 25594, -56974, -61145, 50519, 236599, 336272, 270069, 101513, 32838, 74863, 35710, -71854, -332410, -399590, -193898, -78087, -10901, 110763, 99878, -90401]
21660i0401q2657P7535n8692L9563J29991J04819m189j38787J0047l7467R5917
21649D5679R6999j43156p856P5137r5311j01564J26762J49307M5313j13004k14614
21638a36308j99480k4765P7700K56984Q6m7465o7682j08768Q8182Q9970N4078
21627a7468n8323K5000L83717l3502j69482O247m6680N633O3014N1743r4132J9747
21615A35514j55322k155j47756o8991o831n9660K12261K61710J00407j54221j2294
21604A02662J2755r5250o2429j07306J92278J4333j19382p7368J22846j02816
21594a19677j20593N3111M0410o9928m7128R7692l9281Q0967L45590o7731k35149
21583h1717L1800j02353j16442J0531O8726J41446o6612n2972J52989J14212n4056
$$ y = [-90401, -173058, -95523, -154215, -114652, 15339, 120158, 115969, -22818, -12771, -50238, 45679, 142678, -478, -8334, 66803, -28508, -130072, -3310, 145997, 191310, 78306, -136308, -335788, -360553, -282853, -25869, -25783, -73248, -140930, -249698, -161516, -71546, -17468, -75791, -50791, 332926, 299424, 129942, 136189, 89509, 95142, 158156, 209899, 115767, 135514, -19808, -21963, -169719, -238710, -245541, -305201, -92940, 168770, 269177, 114956, 102662, 115417, 20167, -42262, -149568, 42710, 57043, -62339, -139707, -16861, -119677, -240270, -187159, -146749, -216677, -263805, -166113, -205394, -124427, 221163, 153432, -81717, -49917, -152270, -268712, -258181, -189455, -48009, -114621, -167593, -14604, 99608, 45552]
21572D5552j18439r6980J52141o495k21348k3N0281R374O6534L7999n1904L9556
21560i3752q5764o8115J25486O8072k03390N4694N3200K17485L0613J32311J53796
21549C84636j8975j25404J08777q4692l35849j90031J40970P20J66370K303n6897
21538h072L1834k2141o8673L5487L0127J25935p5331J80686l8874j06833P0046
21527A54191p8494n3004k265r3145j45420l5660J6303L58600m9923j53205o5124
21516a47146M6303N135n1220J82566K8122p9600K9155R8228j44924L6300L7849
21505D0768j59259k545n496J78089p1464k7865p0375L2444O6331L2605k70995
21494b57762j03840J28727J43712M6524p9570m377m7394M9932Q6058q6117j89740
$$ y = [45552, -72887, -169867, -17726, -24221, -245569, -245592, -195311, -185937, -119403, -81404, -133308, -93752, -179516, -247631, -122145, -54073, -257463, -202769, -149569, 67916, 98529, 230840, 384636, 365661, 240257, 349034, 264342, -71507, -261538, -120568, -119848, 46522, 48825, -8072, 23762, 1621, -67052, -31565, -1438, 124497, 49166, 229852, 190978, 84145, 154191, 75697, 22693, 20428, -72717, -218137, -253797, -237494, 121106, 71183, -82022, -147146, -100843, -95708, -146928, 35638, 63760, -15840, 13315, 111543, -33381, 2919, 40768, -118491, -121036, -126532, 51557, -19907, -47772, -118147, -85703, -19372, 13233, -257762, -361602, -232875, -89163, -42639, -122209, -126586, -173980, -124048, -37990, -124107, -313847]
21483c13847K50570K8444l1496K46794k2525o4928k52370j64033J13537J45863
21473f3991J70727M3532j49480M562J20426M486j29736j47972k30284K60297N4477
21462f2956R9268R4488n0209j06343j19950Q0502K85123q4874k34280N8811p5750
21451a16170j43135J28038J88961J21322P8582J261K321j6702n0833o8368k64022
21440a38745K1991P8034j7150O5030j28401J03951Q7224k2633r7952q5547j25598
21429b59796O9860J54051J24878p0645j50289J70125J22267q8084n2593j25474
21419a05700J1934K50309J32158P5907K33805L97027J94828q9103l38199M5111
21409H08077L0720k59242p1690K901J06766N4842m4565j01847P9209J04033R539
$$ y = [-313847, -63277, -34833, -66329, 180465, 157940, 93012, -159358, -323391, -209854, -63991, 106736, 150268, 788, 5350, 125776, 130262, 526, -147446, -377730, -117433, -62956, 36312, 130800, 80591, -25752, -145702, -65200, 219923, 135049, -99231, -40420, -116170, -259305, -131267, 57694, 179016, 257598, 258859, 261180, 244478, 193645, 125277, -138745, -116754, -38720, -55870, 9160, -119241, -15290, 71934, 49301, -48651, -134198, -259796, -189936, -35885, 88993, 18348, -131941, 38184, 160451, 72367, 19774, -105700, -93766, 156543, 288701, 364608, 598413, 995440, 1190268, 1101165, 762966, 808077, 838797, 579555, 507865, 510766, 617532, 672374, 627809, 525962, 605171, 709204, 718743]
21398G18743P4817o061R925q8803k94421j75606k6754o7441n1644m7104k93814
21387b48163j71179N5952K43191Q5986L4425K31676l1261k16943M4697R7021k12424
21376h7022k07160N4113J41248Q5708m3980O730m0804m9220N6407L7284p6948
21365a23644k09163m6681O6068J03822J29480J35552j85925l20791j23295O1738
21355e12839O3008K16485N4253P4148J20296N0596j64188r9931K26264K63109
21345B91201L4384J94814L8889j36354l34700j73635j359j70739J8600J56519
21335h2380o4084N540n0207K36018L29074k9950o567j76352j68463o6433L8537
21324c5267J30164J96728M0044r1843k09365m3297J9126r1075J26791J78847q0477
$$ y = [718743, 793560, 787499, 797424, 708621, 414200, 238594, 211840, 144399, 92755, 45651, -248163, -419342, -363390, -120199, -34213, 212, 231888, 200627, -16316, 28381, 125402, -87022, -294182, -240069, -98821, -13113, -57093, -50363, -91167, -140387, -83980, -46696, -123644, -332807, -379488, -313420, -209598, -80118, 55434, -130491, -451282, -574577, -512839, -449831, -233346, -179093, -104945, 15351, 65947, -98241, -198172, 28092, 291201, 325585, 520399, 559288, 422934, 88234, -85401, -86760, -257499, -238899, -82380, -146464, -140924, -191131, 44887, 373961, 344011, 337444, 161092, -7371, -73804, -35267, 94897, 291625, 331669, 239826, 30461, -12836, 6290, -84785, 42006, 220853, 140376]
21313A40376j06644n6076j4889l5314K2418k52923j46792J04057k8563P6610J12582
21302a85158Q3451q5938J45221j52638j71772N4031J85922J17800k35459N0156
21292a94384J50929J1428J76185Q0887m6767j83613J00190j59748J65020J05899
21282B06026j05788k62792N904J8012R1577J7751J57255J28318l7842K2783j849
21271B39355p891j46756j40149j51936k50438k7640K00818K19610J44503J10066
21261A89542O2178j27676k83556j59146N4524m2728J27641L07658J9817m7597
21251A00657l3031p7358o1583K4303J72438j41748m6450Q8308P5176l278Q5303
21240A82737P0456j34696p5584o6773J6400n864k4504p9666l9053j55406J01855
$$ y = [140376, 33732, -22344, -37233, -72547, -50129, -303052, -449844, -345787, -374350, -297740, -185158, -101707, -187645, -42424, -195062, -366834, -312803, -126881, -9081, -244540, -194384, -43455, -32027, 144158, 225045, 178278, -5335, 94855, -64893, 100127, 206026, 100238, -162554, -156650, -138638, -47061, -29310, 127945, 256263, 218421, 241204, 239355, 231464, 84708, -55441, -207377, -457815, -485455, -284637, -65027, 79476, 189542, 251720, 124044, -159512, -318658, -264134, -306862, -179221, 128437, 148254, 100657, 67626, -9732, -71315, -47012, 125426, -16322, -62772, 25536, 100712, 97434, 182737, 253193, 118497, 42913, -23860, -7460, -13324, -37828, -117494, -156547, -311953, -210098]
21229b10098K90103j20451j94713k5972j4100K8135N4452k391K6536j13243q8851
21218c70593J8241K04467j724l1793J38928K3588M0496j32606R7199M0343R2549
21207A19095K25975r4039L1156j59594j80809k09372j46857p5565K15479J80245
21197i4286o0484l2950J25984j43861L9812M6368p2999J13764J08522O709n3840
21186a7261j38053K3944l459K9483l7278J18480j8810L7166k45978J4332K30621
21175f813K05512J15680J01788K4896j58229L2110l2703o4932k54364p6747R178
21164a04624j6852m1585j02986K0397J33940K3500m3750j34174p9727q2712J7368
21153d11205J04639J01965J13323m4590J25473O0997K3362N9649r0884Q2236L3475
$$ y = [-210098, 80005, -40446, -235159, -261131, -275231, -247096, -192644, -195035, -168499, -281742, -370593, -352352, -147885, -149609, -181402, -42474, -18886, 21610, -110996, -13797, 26546, 119095, 345070, 251031, 282187, 122593, -58216, -267588, -414445, -490010, -274531, -94286, -154770, -187720, -61736, -205597, -165785, -119417, -192416, -78652, 29870, 36579, -17261, -155314, -131370, -134829, -105346, -142624, -24144, -42954, -5788, -251766, -237434, -6813, 198699, 314379, 416167, 441063, 282834, 314944, 282241, 217309, -37055, -113802, -104624, -121476, -163061, -266047, -245650, -111710, -88210, -131960, -266134, -345861, -428573, -411205, -306566, -204601, -91278, -135868, -10395, 50602, 73964, 133613, 42729, 124965, 158440]
21142A58440j51832j57221n3647K05491O8552q278j24010l6927J64678K13428
21132B78674J0179l02093j22012m6334J69884K52756P004j82482j64813J29537
21122C0300L4098M8683K5438l3415J65234J32852N544o6320j68836j49567J02841
21111A26852J16987O0134M9834R351k6962j07078k1421K5256J13524J05361L0313
21100D82151j60574l72929j1852J13964j27703K6642O1180J48263Q5375k3917
21090B20600K156j11449q6182l18210p0658K35796L05841l8287j38333M2521J90755
21079B34550P8564j73236j10706J79957K83123P379j65622k03806J08827r3372
21069A45658j36991J27657J49454K06144k31361k680j03540j29312j07905J11098
$$ y = [158440, 6608, -150613, -204260, 1231, 69783, 61505, -62505, -99432, 65246, 278674, 288853, -13240, -135252, -181586, -11702, 241054, 248058, 65576, -99237, 30300, 64398, 113081, 138519, 105104, 270338, 403190, 408734, 342414, 173578, 24011, 126852, 243839, 303973, 353807, 363158, 336196, 229118, 207697, 232953, 346477, 451838, 482151, 321577, -51352, -63204, 50760, -76943, -50301, 10879, 159142, 244517, 220600, 222756, 111307, 25125, -293085, -363743, -127947, 177894, 139607, 1274, 43795, 234550, 313114, 139878, 29172, 209129, 492252, 499631, 334009, 130203, 239030, 145658, 8667, 136324, 285778, 491922, 260561, 257881, 154341, 25029, -82876, 28222]
21059B8222L7184p779M7894p9537n6664m6584J08260M1355r9550J70682j2118
21048A31365L5953n2598k17944k74612M6433Q2488K7447Q2689j6182o9908k626
21037b27495O2353K7683K52029l0359l05320j98793k3100J26752j6220O4132j00893
21026c69231j41642j447N2867J10010K52207J22372K47888J06359n5497l6094
21016B87792J33032o8225j13460R2791j533L0753P2124r1036P2031l57609k12170
21005a55510m378J59353J0316j08089L4301n9519M9094J13842P4279j0262P4197
20994A77624o6815N9712K5928l6477j27405M0223K26124J76815l9261j23609j24622
20983A88237l0460R9308K8687j66495n2347J41776J21309l106l2046j32958L596
$$ y = [28222, 65406, 57627, 105521, 25984, -30680, -77264, 30996, 72351, -27199, 143483, 131365, 167318, 114720, -103224, -377836, -331403, -248915, -221468, -138779, -154961, -224869, -227495, -165142, -137459, 114570, 84211, -221109, -419902, -443002, -316250, -332470, -268338, -369231, -510873, -512320, -459453, -349443, -97236, 25136, 273024, 379383, 323886, 287792, 420824, 352599, 239139, 331930, 330397, 361150, 433274, 342238, 414269, 56660, -155510, -159888, -535, 9781, -98308, -64007, -123526, -74432, 39410, 113689, 103427, 177624, 110809, 170521, 196449, 159972, 32567, 72790, 298914, 475729, 436468, 312859, 188237, 157777, 257085, 285772, 119277, 66930, 208706, 330015, 326909, 294863, 161905, 165501]
20972A65501p371j43945j4711j64177r9171M1644L23727J79713j31046j19497
20962C0667J45897K53093k785J01230l953l40452J8618J70941O1633k04245j49760
20951H0884k05681j3011O7123J88220L11301m9301k05790j55445J27510J44202
20941B90012J73706J38855j03810l02544j44216K62485j3281j80240R1684J31565
20931C44216o0481o8292O4689q9282j92642O7818J50952O1831J2826k4087K53835
20920E21383J29228n3035l839j28760j5720P3186j42151r7349O3898K43722L9911
20909F30474M5431J36906k606J36285J35087Q4415l4388o8997J88393J05680k07624
20898A149056q9126j68327J21176K07592J75760K01628P1441J49715K8155K72872
$$ y = [165501, 158130, 14185, -526, -164703, -263874, -222230, 101497, 281210, 150164, 30667, 176564, 429657, 426872, 528102, 524149, 183697, 202315, 373256, 434889, 230644, 80884, -124797, -137808, -70685, 117535, 428836, 379535, 173745, 18300, 145810, 290012, 463718, 602573, 498763, 196219, 52003, 314488, 301207, 120967, 212651, 344216, 283735, 215443, 280132, 190850, -1792, 66026, 216978, 278809, 291635, 267548, 521383, 650611, 597576, 593737, 464977, 449257, 522443, 380292, 282943, 346841, 590563, 630474, 675905, 812811, 810205, 946490, 1081577, 1165992, 1131604, 1062607, 1251000, 1356680, 1149056, 1059930, 891603, 1012779, 1220371, 1396131, 1597759, 1669200, 1818915, 1847070, 2119942]
20888B119942Q0235K75195L24784J3558K56651L73769L42773M922p8585J13545
20878C826789K87996m051R349L05255N19022N18238P48731M34800M19401N03219
20868G568749N89677P48182O95978P62481Q72262R14411J295602J345353J746801
20859A6539496K543173L769773N126680P342104J0790529J6643172K4848924L2088202
20851A19692053L0102066J4428133l978670q526301J944076J2903949R445743
20844A76011049q655926k4161948k3903356j1386829M238785J8456487K6576938
20837A57175200K0302033Q10039j3813724j0374380L084625Q994361k012620k2249305
20829A41916229l3983024l0465813k1136643j3618033r138388o537675m361649
$$ y = [2119942, 2200177, 2475372, 2800156, 2813714, 3070365, 3444134, 3786907, 3791829, 3713244, 3826789, 4114785, 4110734, 4120083, 4425338, 4944360, 5462598, 6211329, 6646129, 7065530, 7568749, 8158426, 8906608, 9602586, 10365067, 11237329, 12151740, 13447342, 14792695, 16539496, 19082669, 22852442, 27979122, 35321226, 46111755, 62754927, 87603851, 119692053, 149794119, 164222252, 160243582, 151717281, 153661357, 166565306, 176011049, 167355123, 143193175, 119289819, 107902990, 112141775, 130598262, 157175200, 177477233, 178287272, 164473548, 154099168, 157183793, 166178154, 164165534, 141916229, 107933205, 77467392, 56330749, 42712716, 33574328, 27036653, 22675004]
20822B2675004l008010k386357j916613j690567j591779j146261q54286m99211
20814I581920l29014n97088r22193o60531k71667j14604l10344p46284p56156
20805D874039n83694l74307R2056J34641q6710k75287k75704j09644P210j78443
20795C224157M2053k23602l33901k19073k01938l28719l57205O2579j70071p2884
20785A421396Q2870K4675j39172K7762l2478j03585q6192Q163L6798p0623l40546
20774H29068l00005N2841r5958K21107J26110k3739o1968k56191j37619O1247
20764D14893K3147k9460r5672L9020L4945m9897K67515J16331J08953N2626J49592
20753A031993K9798k40938k13871l0137j39761Q6835o9689J89242P9383k1964
$$ y = [22675004, 19666994, 17280637, 15364024, 13673457, 12081678, 10935417, 10081131, 9581920, 9252906, 8655818, 7733625, 7073094, 6801427, 6686823, 6376479, 5630195, 4874039, 4290345, 3916038, 4008094, 4142735, 4056025, 3780738, 3505034, 3395390, 3402600, 3224157, 3266210, 3042608, 2708707, 2489634, 2287696, 1958977, 1601772, 1664351, 1494280, 1421396, 1504266, 1528941, 1389769, 1417531, 1385053, 1281468, 1195276, 1203439, 1240237, 1169614, 829068, 529063, 581904, 485946, 707053, 833163, 809424, 747456, 491265, 353646, 414893, 438040, 408580, 312908, 351928, 386873, 336976, 604491, 720822, 829775, 882401, 1031993, 1061791, 820853, 606982, 576845, 437084, 523919, 454230, 643472, 722855, 700891]
20743G00891j19459q4616q5387M9698M0570R2523J46493j46832n8858J74453N8723
20732G68199p3052q5647n7077N0445j41217L6949j58033o0688p2939J41707P8769
20721D27416J85803J49030R35n6176k04690P163K02437j06821j18860R1457j24152
20710D53542l30516J57685N9801j05151K109P7597j09320Q5040K7505Q4104J12936
20699E15332l6221K6987M4582j74645j59026Q4917J0798L1612j07932j5518L4845
20688B55731R2580j80976o1658K04402q486m9959k24360k32259K93510Q4702m9329
20677A23898K5587k2546n6952j66803M2125K80977J39124j83473k81254q9004
20667a88321k9939j9222K62802P4649k06960k3483R3898J61569M7403J08218N391
$$ y = [700891, 581432, 496816, 411429, 461127, 501697, 594220, 740713, 593881, 535023, 709476, 768199, 695147, 609500, 552423, 602868, 461651, 498600, 340567, 279879, 206940, 348647, 427416, 613219, 762249, 763184, 707008, 502318, 509481, 711918, 605097, 486237, 577694, 453542, 123026, 280711, 340512, 235361, 237470, 315067, 205747, 290787, 318292, 402396, 515332, 479111, 506098, 550680, 376035, 217009, 301926, 312724, 344336, 236404, 220886, 255731, 348311, 167335, 105677, 310079, 301593, 251634, 27274, -204985, 88525, 173227, 123898, 149485, 126939, 69987, -96816, -54691, 226286, 365410, 181937, -99317, -188321, -218260, -237482, 25320, 99969, -106991, -130474, -36576, 124993, 172396, 280614, 286005]
20656B86005j59622J12344K67558r1905k07333p0596k9149n4074L9o4504m6082
20645e7319j9361O9005J37487O7961K5380J33129n4180j47481k047K34459J5659
20634D02692k4129m1607k2187k06282p4261k43798J47428R1010m9504J19388J4232
20623A12982j5686J39574O5876m515r9637k00020O0963j24580l1470R4016k88363
20612b90860o6140L52539L9346q2337p5145p0788P6072J30650K8770O8325k5701
20601H4731L2385K4183o8771n3581k27257k03501j32887J56268Q5009M5753j424
20590b59092q169m4278M7573k56640K8654J58474N4058J4588Q4599j3842J07206
20579h6869K84483j8566l6039J1886j5753r2726M747m1089j42499Q5587K9134
$$ y = [286005, 126383, 238727, 506285, 414380, 207047, 136451, 107302, 53228, 53267, -11237, -57319, -76680, -7675, 129812, 197773, 223153, 356282, 302102, 154621, 152574, 387033, 402692, 378563, 336956, 314769, 108487, 34226, -209572, -62144, 28866, -20638, 98750, 112982, 97296, 236870, 302746, 298231, 198594, -1426, 59537, -65043, -96513, -2497, -290860, -357000, -4461, 34885, -47452, -122597, -193385, -117313, 13337, 42107, 110432, 84731, 117116, 141299, 72528, 18947, -208310, -411811, -544698, -388430, -303421, -257668, -259092, -267261, -311539, -263966, -520606, -491952, -333478, -279420, -264832, -180233, -194075, -86869, 197614, 179048, 143009, 154895, 139142, 46416, 51163, 10074, -132425, -46838, -17704]
20568a7704L738Q4672l5010J2117j75784l13430o7216K21445J50713J27667J20220
20557A11428k9174O2399r8383m0017j29276J12139L9620J14468J20517p3092J16469
20546C07098J33037o8505k05537M0157j29920j5927R0951q009l35031l3525O0459
20535a64752j7412o6787K86694J72339j0393j16907j73435P8490K46624q2942
20525A51519j46323J14947l6852p8201l8719J28557P7326P1867n0676m1758K03218
20514C54905l6706o9050p2494m9801j48560o0868L1187L1910n1981K3866J78861
20503A31269R5545N5236k17295M3530R8807Q9897j68898k46762K2298J23795Q7315
20492A14737j85748k3397j4145J35383J60666n3355J0200r1602j66942n1280K52505
$$ y = [-17704, -13966, 70706, 35696, 47813, -127971, -441401, -508617, -287172, -136459, -8792, 111428, 82254, 144653, 46270, 6253, -123023, -10884, 28736, 143204, 263721, 190629, 307098, 440135, 371630, 166093, 206250, 76330, 60403, 151354, 143345, -191686, -225211, -164752, -182164, -248951, 37743, 210082, 199689, 82782, -90653, -12163, 234461, 151519, 5196, 120143, 83291, 5090, -33629, 94928, 172254, 244121, 193445, 151687, 354905, 318199, 249149, 176655, 126854, -21706, -82574, -51387, -19477, -71458, -47592, 131269, 226814, 282050, 64755, 108285, 207092, 296989, 128091, -118671, -96373, 27422, 114737, -71011, -94408, -108553, 26830, 187496, 134141, 144341, 52739, -114203, -165483, 87022]
20481H7022J63386r401R1883l3771j47047j30146j12379K4567o0804J94077J47452
20470B14839R8895j07924O9838J47787P6484j44312k27456j02961k777j46729
20460a24316O1124J60193j6089j98677n6512O5684o7450j77M0249M874o5755K5591
20448a71261L8597N3847K66527l4680k26672n968N4929J9140j21281n622K13513
20437H1069K7472j77645L5912O4404J7016k31537J39697K33398o1694j94912j6140
20426h2960j52939J3788J67821q2820J7642K79921J07951j46737p2660Q0978l0847
20415I9138m6626o989O2646j41375j72104M4108J53535K23544J71511J17968n0228
20404D55128r4544j05323L737n3117k3070j56809j81791q4198J06360J5208l8708
$$ y = [87022, 250408, 241007, 332890, 299119, 152072, 21926, -90453, -65886, -126690, 67387, 214839, 313734, 205810, 275648, 423435, 499919, 355607, 128151, 25190, 22413, -124316, -63192, 97001, 80912, -117765, -174277, -108593, -176043, -176220, -135971, -131097, -196852, -171261, -132664, -78817, 187710, 153030, -73642, -79610, -24681, -5541, -126822, -132444, 81069, 108541, -69104, -33192, 31212, 48228, -183309, -43612, 189786, 128092, -66820, -82960, -235899, -222111, -54290, -137110, -119468, 160453, 268404, 121667, 49007, 129985, 99138, 52512, 45523, 108169, -33206, -205310, -161202, -7667, 215877, 387388, 505356, 455128, 360584, 255261, 258998, 205881, 182811, 26002, -155789, -239987, -133627, -118419, -157127]
20393a57127j07368n7235J10857J89626j2261L8671K12501J70184k05396k19324
20383c6872K12232J62731K0120k01953j54338l0669p5886J08528J98926L25265
20373E28084j16804m07797j30155J19371O3378j34162K37781J32223L8850k50438
20363H0331j27680K11446l0754j88318j57480j35438k7074J23099J73442J46058
20353F7632K2581k579J61871J63596k67055j2931Q7743l7506m5278j52512k6993
20342d1431j10653j62421j56009P9685K47780j7930J40066K17180j67121M418
20332C3564N6540j38800j58320j00413J59296M3966K4894l35408j15599K60397
20322b69883L85731N3282O6240j16069p5465k39181J86748R995j05685q4515O4749
$$ y = [-157127, -264495, -321730, -210873, -21247, -33508, 5163, 217664, 387848, 182452, -36872, 175360, 338091, 358211, 156258, 1920, -28749, -104635, 3893, 202819, 528084, 411280, 3483, -126672, -7301, 56077, -78085, 159696, 291919, 330769, 80331, -47349, 164097, 133343, -54975, -212455, -347893, -374967, -251868, -78426, 67632, 90213, 87634, 249505, 413101, 146046, 133115, 220858, 183352, 138074, -14438, -41431, -152084, -314505, -470514, -390829, -143049, -160979, -20913, 196267, 29146, 33564, 90104, -48696, -207016, -307429, -148133, -104167, -79273, -414681, -530280, -269883, 115848, 169130, 235370, 119301, 43836, -195345, -8597, 1398, -104287, -188802, -124053]
20311a24053K49630J40689j01876k18130n4211M7791K00630J69404o3658J16291
20301C62507m3985j05812j80763k98637r1495K39136J50296r975o1093j44522
20291a84343n2012J88805k00135m2014K13219K97404J75539j02392M4367O0357
20281C98795J95117J17801N225K06615O2172j99324m75610N8057K90764M2053
20271G01665L977L7911K42527m7793j34303J79565J45684j81753n9124J77467
20261A065823k4205j00162k6007j73149k92630j40869n8041J78220p3700o4102
20251B91178j2911j40320J4271k1749k75400N5753K8771m6367M4042N0694N8641
20240D6603J3991l1015M4417j2044N9762J7399J0815R3244j19734j99864N3982
$$ y = [-124053, 125577, 266266, 164390, -53740, -107951, -60160, 140470, 309874, 246216, 362507, 318522, 212710, 31947, -266690, -358185, -119049, 31247, 21272, -39821, -184343, -236355, -47550, -247685, -289699, -76480, 220924, 396463, 294071, 338438, 398795, 593912, 711713, 716938, 923553, 985725, 786401, 310791, 368848, 659612, 701665, 705642, 743553, 986080, 938287, 803984, 983549, 1129233, 947480, 888356, 1065823, 1041618, 941456, 915449, 742300, 449670, 308801, 250760, 428980, 355280, 291178, 278267, 137947, 152218, 130469, -144931, -89178, -60407, -106774, -62732, -12038, 46603, 60594, 29579, 73996, 61952, 121714, 139113, 149928, 243172, 123438, -76426, -22444]
20229b2444m0642j41236J67873K20573m6797J4171J22720r8142j96482K20832
20219B00426r094k68017j54529K46555n8614J26633M8149m27432m3570K77169
20209f2324J96151L7481J7015j8767L4735N5977n2966n7409O3637n8483k52350
20198i7303P6573K79672J16318J45206J23725J15171k41506k92103Q4337J53609
20188D63699o5169k44297l08005n0559L4931J0228L653J19425j124J0658K1673
20177d887N9635O0435m9397J91651p2769O1207K92695J70532r4965n1617J5188
20166E77708q660J81271L6400k54119L5766M0894q0407Q1025n1611j77042r398
20155C71827Q6386K47018L0973p4397J0304q6977j28570J19915n8935N84j28174
$$ y = [-22444, -63086, -204322, -36449, 184124, 137327, 151498, 274218, 176076, -20406, 200426, 191332, -76685, -231214, 15341, -43273, 83360, 131509, -295923, -339493, -62324, 133827, 171308, 188323, 169556, 204291, 260268, 207302, 149893, 213530, 155047, -97303, -20730, 258942, 375260, 520466, 644191, 759362, 517856, 225753, 310090, 463699, 398530, 154233, -153772, -204331, -169400, -159172, -155519, -36094, -37218, -26560, -4887, 54748, 115183, 65786, 257437, 184668, 245875, 538570, 709102, 614137, 562520, 577708, 569048, 750319, 786719, 532600, 568366, 609260, 528853, 609878, 558267, 381225, 371827, 458213, 705231, 736204, 661807, 672111, 585134, 456564, 576479, 517544, 518128, 389954]
20144C89954k22836Q152n0527M566r2642M6459o2807j92264n8340J61753o5201
20133a33733n3955J33830K6514K4583J21825J6306P0064q6466j63925J62326N6857
20122A74226j99802k68756j45659L9522J51303K37443J31788K3827J02371q7254
20112A59009k15998r4869p8053K39728l8497J22751L20426J68475j66555O7614
20102D84031M6012k1239q198k05234k798p1578k2402q8095q6430p0754K51975
20091B05290J11418K63123M39033j39854k83663k25046j16121K4065N9784J57179
20081D95208j37462k47874J55553J60019P3538N1981J14329J23290j25835j47466
20071E15281j15124J1474j34592j81351k03171l4862J5489J17751Q9240l587l1439
$$ y = [389954, 167118, 175270, 124743, 129309, 36667, 83126, 20319, -171945, -230285, -68532, -133733, -187688, -53858, -27344, -2761, 119064, 135370, 205434, 118968, -44957, 117369, 174226, -25576, -294332, -439991, -400469, -249166, -11723, 120065, 143892, 246263, 159009, -56989, -151858, -229911, 9817, -28680, 94071, 414497, 582972, 416417, 484031, 530043, 508804, 500606, 295372, 292574, 220996, 198594, 110499, 24069, -46685, 205290, 316708, 579831, 1018864, 879010, 595347, 370301, 254180, 278245, 338029, 495208, 357746, 109872, 265425, 425444, 498982, 550963, 665292, 788582, 662747, 515281, 400157, 411631, 277039, 95688, -107483, -142345, -126856, -9105, 80135, 76548, 45109]
20060D5109K4848n1225j36843j6054R887O9224J09285j60627k4510n2820l4925
20049b18651N493K1642o5459O9619J61133K45060q8255L2423J59193q9592k7558
20038B05048J73643J90145K33958J62179k51760k28820j92041j87322R3318O0369
20028B58717k00208Q063J3988K57152K24116R7718J12017j93371j36004J18938
20018E61126K63579n7040m29877l01180j39711Q8347O9357l7467j8212J355P8855
20007G9132o2609m7477j52848j85656k017J82418J91364R9030N8084j3388K6174
19996A72207k1151j0866k18453K29854Q5507r9391o2262j0779M4684J25716J30497
19985C65563j36968k36787Q9850r3747J92927J01385L4461r2795K189J07553L1515
$$ y = [45109, 69957, 18732, -118111, -134165, -124278, -55054, 54231, -106396, -130906, -183726, -218651, -213158, -191516, -256975, -187356, -26223, 218837, 130582, 163005, 322198, 232606, 205048, 378691, 568836, 802794, 964973, 713213, 484393, 292352, 105030, 198348, 258717, 58509, 66572, 80560, 337712, 561828, 659546, 771563, 578192, 442188, 561126, 824705, 767665, 337788, 36608, -103103, -14756, 54601, 17134, -1078, 277, 79132, 16523, -30954, -183802, -369458, -371475, -189057, 2307, 101337, 159421, 146033, 172207, 151056, 140190, -78263, 151591, 237098, 137707, 75445, 64666, 109350, 235066, 365563, 228595, -8192, 81658, -12089, 180838, 282223, 316684, 223889, 226078, 333631, 365146]
19974C65146j05128j75288m9742P8175j36497L8911R9179j5212k0732J55643O0403
19963B94858k3600p4922M080Q1076j09117N0182J02405j44874j77339L5733J80572
19952B19054J29561o3665k8899M2774o7385J95841l9412j8594N8103k44966k56932
19941g4520M439J22216J75324J8748N3643J7713r6087K21471Q9863J106r4740
19930D39176M7293J17032j25047J1569J31351m2433p2556j61669m7813n6430L740
19919B44213k6612K13144J41390j4452j1256j5079O9275n5808r1363L1179K99387
19908G84018J22996M4916o9896r6795J7467O2303N2062J33122O331m5341Q0510
19897A091693J42888k54317r9148k0173P7562R9071P7475q4989j15870q930p1588
$$ y = [365146, 260018, 84730, 34988, 113163, -23334, 15577, 114756, 99544, 78812, 234455, 294858, 271258, 196336, 200416, 281492, 172375, 222557, 324962, 180088, 2749, 38482, 219054, 348615, 284950, 256051, 298825, 231440, 427281, 387869, 369275, 427378, 182412, -74520, -70081, 52135, 227459, 246207, 299850, 317563, 221476, 442947, 532810, 533916, 439176, 486469, 603501, 478454, 490023, 621374, 578941, 506385, 344716, 296903, 240473, 244213, 217601, 430745, 572135, 557683, 546427, 531348, 600623, 544815, 453452, 484631, 784018, 907014, 951930, 882034, 785239, 802706, 865009, 917071, 1050193, 1056524, 1011183, 1091693, 1234581, 980264, 881116, 860943, 938505, 1037576, 1115051, 1030062, 914192, 905262, 833674]
19886H33674k20270j23476J98198K77014J25692k14421J382m6528j18458R8501
19876H11308K04681J59708K06761l6992O9567J37887J94959j63920j00007k7027
19866A456925M4646r5321j18193j07245J72626J32447Q9188j41292n3046J82982
19856A563717q6554n7334K1063k9705p8309L6665j18549l24449l32333l13130
19846B81082q247L2810K0112j78968m2070j15283R1807J00423K49315K37366j27865
19835E40482R386O4119o9535J0280Q9134P7913r58L5646J67373J21177j82313
19824H62704k05828O3309K45297O2597j20340l7399j79952l4681M2656k15599
19814D82764j1945J69323K2349J68888p5712k05449r2506n8036j01237r4904K35819
$$ y = [833674, 613404, 489928, 688126, 965140, 1090832, 876411, 877793, 831265, 712807, 811308, 1015989, 1175697, 1382458, 1345466, 1415033, 1552920, 1747879, 1583959, 1483952, 1456925, 1501571, 1406250, 1288057, 1180812, 1353438, 1485885, 1575073, 1433781, 1380735, 1563717, 1477163, 1419829, 1440892, 1411187, 1332878, 1369543, 1250994, 926545, 594212, 281082, 272835, 305645, 325757, 146789, 104719, -10564, 81243, 181666, 430981, 668347, 540482, 549868, 613987, 544452, 554732, 643866, 721779, 720821, 756467, 923840, 1045017, 862704, 656876, 720185, 965482, 1028079, 907739, 870340, 690388, 655707, 698363, 482764, 470819, 640142, 662491, 831379, 755667, 550218, 457712, 399676, 298439, 203535, 439354]
19803D39354L3673j42482k06020J0140k04499M0893J80008r8748J11839j26670
19793C7488j50136J6440J64854Q1212n0131j21235o6814O1093M3357j66585J675
19782a48782J88855K0813R1867N10182J756k73285j29268M09J11724J64440l8974
19771D99737k46198O3648R2412M8184j44298j96329j67878M836K0917J08292M2321
19760A25644r6716q1539l7952J21028M6279K6149O5503K9119N5148N9946p5801
19749B36808J20554K07264j14629j54342m6297m3571n9589r2212J20985R1089
19739B66060l6016m9670m8219J8324J23725J34880N4066j5912j11630r4104J3080
19728B54584R5953j07884j72826m8719l9254L526J96579K31286L299M9807j36423
$$ y = [439354, 473027, 330545, 124525, 134665, -69834, -28941, 151067, 52319, 164158, 37488, -112648, -96208, 68646, 149858, 99727, -21508, -88322, -27229, 16128, -150457, -148782, 40073, 60886, 152753, 662935, 664691, 391406, 262138, 262547, 374271, 538711, 499737, 253539, 317187, 409599, 457783, 313485, 117156, -50722, -45886, -24969, 83323, 125644, 28928, -52611, -90563, 30465, 76744, 102893, 168396, 197515, 252663, 312609, 236808, 357362, 564626, 449997, 295655, 249358, 205787, 146198, 53986, 174971, 266060, 230044, 180374, 132155, 150479, 274204, 409084, 463150, 447238, 335608, 241504, 254584, 350537, 242653, 69827, 21108, -18146, -14620, 181959, 413245, 416544, 466351, 329928]
19717C29928R9492O9914j7293o2414j01632J44924j30338j41776l06026J9816
19707i5405O0212j12072J37521K9896j01489K8646j48352K8677J79923n0609M0209
19696b843Q8525L04415m9118j14921o3665j3420R8674j65631L1020j879J00993
19685B12150j3392k924k23847l1529q651K70706K81196M1833J09780p5212k60771
19674B99339j39793n832j38454j8289K58667P8041O2152L4183j96749l3596K7502
19663B27171o0461j74028O4357L22914L13582k72308j41857N7540o9349q9838
19653A77723J04469R4495j04769K2993j5578j54414J25998J21701p936M7565n8682
19642C53565o0670R3710j15536k49086L16794L15099O5877k1822j03752n4909
$$ y = [329928, 429420, 499334, 482041, 419627, 317995, 462919, 332581, 190805, -115221, -95405, -35193, -147265, -9744, 20152, -81337, -52691, -201043, -172366, 7557, -43052, -2843, 85682, 390097, 340979, 226058, 162393, 148973, 247647, 82016, 113036, 111157, 212150, 198758, 195834, -28013, -59542, -68193, 202513, 483709, 525542, 635322, 560110, 299339, 159546, 153714, 15260, -3029, 255638, 333679, 395831, 430014, 233265, 199669, 227171, 166710, -7318, 57039, 379953, 693535, 421227, 279370, 336910, 267561, 177723, 282192, 376687, 271918, 294911, 279333, 124919, 250917, 372618, 364682, 412247, 353565, 292895, 386605, 271069, 21983, 338777, 653876, 719753, 697931, 594179, 539270]
19632E39270o3204R3963N3549j62132L475K04836J46334k4313j51314j85459k32394
19621B22611K5334P2984K05688j6474N9632P7699M3783J21550J87336R1521k11348
19610H80316o4443k4380k14530o3875R8029K86036K49749K56547N3306L6461l9816
19599A453400O5762K78905R2731J16811J93847K45729M88637K11428K8870M9243
19589C225363L27484L04015K29458L41089M70364O01296N99684O15611R47104
19580G661468J083584J063035J522987K213468L555668N687765R300296J5358845
19572D7447116K5351809L6604150L4626133M512882l0727441l7754053k5294398
19565E4766198j3813264p332232l314855J61409M222310R219833J7252900K8476765
$$ y = [539270, 476066, 570029, 623578, 461446, 464921, 669757, 816091, 791778, 640464, 455005, 222611, 247945, 320929, 526617, 510143, 569775, 647474, 691257, 812807, 1000143, 1091664, 880316, 815873, 791493, 576963, 513088, 611117, 897153, 1146902, 1403449, 1456755, 1493216, 1453400, 1519162, 1798067, 1890798, 2007609, 2201456, 2447185, 2935822, 3147250, 3176120, 3225363, 3552847, 3856862, 4086320, 4427409, 4897773, 5499069, 6098753, 6714364, 7661468, 8745052, 9808087, 11331074, 13544542, 17100210, 22787975, 32088271, 47447116, 72798925, 109403075, 144029208, 148542090, 117814649, 80060596, 54766198, 40952934, 33620702, 30305847, 30467256, 34689566, 43909399, 61162299, 89639064]
19557H9639064L5861233K2619981j3330172l8068918l3838941k0833015j1923521
19550C0125711p210188m775343l260140k290520j703272j050102q14299n52691
19542H469156k06320l05174j74522o2719r1741r0539Q2310J34182L5558J14590
19532G904781M02779P62156N90383O32481R58253J546904J702605J814342K777489
19523A9092173M847340Q150923J3077612K2153237L5997354M5519154L1491038
19516A80328831j1949767m3827997m0648771k4658745j3176455o722754k518180
19509C6826162J839884O677189J3793191K5318919L8602204M0848961J2832034
19502A76738544l0900225m7632891l4963044k0012611j1891854p426128m712932
$$ y = [89639064, 125500297, 148120278, 134790106, 96721188, 62882247, 42049232, 30125711, 22915523, 18140180, 14880040, 12589520, 10886248, 9836146, 9021847, 8469156, 8262836, 7957662, 7783140, 7720421, 7628680, 7538141, 7620451, 7754633, 7790191, 7904781, 8307560, 9069716, 9660099, 10292580, 11250833, 12797737, 14500342, 16314684, 19092173, 23939513, 32090436, 45168048, 67321285, 103318639, 148837793, 180328831, 168379064, 124551067, 83902296, 59243551, 46067096, 39344342, 36826162, 38666046, 45343235, 59136426, 84455345, 123057549, 163906510, 176738544, 145838319, 98205428, 63242384, 43229773, 31337919, 23911791, 19198859]
19495A9198859k973000k149213j773377j444432j147570r24368p71824q99062
19487G116013l79642k65800m15296l47651n01508n57475l59729m52701m04463
19478C431748l92179m90594j58360q9143j06450j06480n4527j74559k28401j96844
19468A434211m9794K31091m3708J6808p7067l2542j19475l11658o3385K5791m5532
19457I64740k1863P1209m0600J9430j56618j73876M0066K32408J30470J326p3919
19446I92773p7914q3837q5666J02015P5664o9611O4728P7764J50318l957k68318
19435H73959k64334j25710J09541J95311J79059M4467j8145o8484k82355j03245
19425E40064L8998j29223j21957P0250M2812j04291m9467M7740r2895J16277K92617
$$ y = [19198859, 16225859, 14076646, 12303269, 10858837, 9711267, 8786899, 8015075, 7116013, 6736371, 6470571, 6055275, 5707624, 5206116, 4648641, 4288912, 3836211, 3431748, 3039569, 2548975, 2390615, 2301472, 2195022, 2088542, 2034015, 1859456, 1631055, 1434211, 1384417, 1615508, 1571800, 1588608, 1511541, 1478999, 1359524, 1047866, 984481, 1010272, 964740, 942877, 1014086, 973486, 992916, 836298, 662422, 702488, 934896, 1065366, 1066692, 992773, 914859, 831022, 745356, 847371, 923035, 853424, 918152, 995916, 1146234, 1142277, 873959, 609625, 483915, 593456, 788767, 967826, 1012293, 994148, 925664, 643309, 540064, 579062, 449839, 327882, 398132, 440944, 336653, 287186, 334926, 242031, 358308, 650925]
19414F50925n8936j83736r9746R0290j6571l8838j98476N252j60843J4149L78327
19403C81797M82778K48881j33021p7281L8045K9167m6545M088J44798L8490o5573
19392A045624k39076l94954j07827N6810m6282m0549q3264k9041J41678n8643
19382B44476J43707J54548K35628K16040Q3422n1200j89176k4511j2087J4092
19372H14939J09696L23028L4913k84264l93540k27834k09941m5838J92692J22697
19362D36548j58045k11321j45447j8213q3478p2612P5574J38788O8235j14752
19352h4723K9886K7166r9406J67371P6167M348j78062n7264P266j7617L5477j46930
19340b36321p6729K14987L9131q2452K08266K44322J4020j58105m9077p8976L5178
$$ y = [650925, 591989, 408253, 308507, 398797, 382226, 343388, 144912, 150164, -10679, 3470, 381797, 864575, 1113456, 980435, 903154, 941199, 970366, 923821, 927909, 1072707, 1111197, 1045624, 806548, 411594, 303767, 360577, 314295, 273746, 190482, 161441, 303119, 244476, 388183, 542731, 778359, 994399, 1077821, 1026621, 837445, 812934, 800847, 814939, 924635, 1247663, 1282576, 998312, 604772, 376938, 166997, 121159, 313851, 436548, 278503, 67182, -78265, -96478, -179956, -252568, -176994, -38206, 30029, -84723, -54837, -27671, -127077, 40294, 116461, 120809, -57253, -114517, -107251, -124868, -89391, -236321, -313050, -98063, -58932, -141384, 66882, 311204, 325224, 167119, 118042, 39066, 74244]
19329G4244j7947k5709Q6201n8971N9565J27689O1769l0831k2049j887N337n1470
19317B05941Q7430J1317L4842M1861o0435k33202J32697L4748k24517o0549K01546
19306A71679P5767k49653l1331K43611J3745M6208K0434P4863k244q4427q029
19295B70623j02192o2083q0928k8610p7202M9299k8265j6394J7827l131K19836
19284A58780N9423j44520o6677p0107M8133P0925p6475j9551j27205R4545N4451
19273a8278J07354r3760N3026P5789K12723j0817l22228j81941P6025P5298p9705
19262a06514k6604K2023k9952J60239j00438m8430L0146J21396L5827r2582k831
19251c7720J3203Q1621m3228r508M5249J32376Q6023P6362K1974j67559j1733
$$ y = [74244, 56297, 30588, 116789, 57818, 117383, 245072, 306841, 276010, 253961, 252074, 257411, 205941, 293371, 304688, 339530, 381391, 320956, 87754, 220451, 255199, 30682, -29867, 171679, 247446, -2207, -33538, 210073, 223818, 270026, 290460, 365323, 363079, 278652, 270623, 168431, 106348, 25420, -3190, -80392, -31093, -59358, -75752, -57925, -61056, 158780, 218203, 73683, 7006, -63101, -14968, 55957, -20518, -40069, -167274, -72729, -18278, 89076, -4684, 48342, 124131, 336854, 326037, 3809, -178132, -102107, -26809, -106514, -133118, -111095, -141047, 19192, -81246, -129676, -99530, 21866, 57693, -34889, -37720, -24517, 57104, 13876, 4368, 49617, 181993, 268016, 344378, 366352, 198793, 187060]
19240A87060J05903J5954k8358j35224J10572Q2454J20962r0604m6524j98827
19230A23368j54363k1613M5402n9754j78321K26716M37j95417K84185J66387l14938
19219g7911J086J06060N7139L9468p6494j17616J8834o670N7173K67369K61607
19208E30045r6499j59576n7330q569q9134m8176q3081J98217m35j34945l858N6358
19196A03017M5044N0133l7703o9975J20730J77434R7691Q5543k43015j26007K7493
19185B30385J64812J63251K6157l04029j71534j68956j12474N2899o3094J59709
19175b2874O9960J23643J49031O6010J47888k06511k12086K00879J06066j55528
19165B66478l7145P3938R0660L15989L94308R3126j30363j99025j36455M1510
$$ y = [187060, 292963, 308917, 280559, 145335, 255907, 338361, 459323, 368719, 322195, 123368, -30995, -52608, -7206, -66960, -245281, -18565, -18128, -213545, 70640, 237027, -77911, -76825, 29235, 86374, 125842, 49348, -68268, -49434, -56104, 1069, 268438, 530045, 433546, 273970, 216640, 208071, 118937, 70761, -12320, 185897, 185462, 50517, 46659, 103017, 148061, 198194, 160491, 90516, 211246, 388680, 486371, 571914, 328899, 202892, 230385, 395197, 558448, 584605, 280576, 109042, -59914, -172388, -119489, -182583, -22874, 47086, 170729, 319760, 385770, 533658, 327147, 115061, 315940, 422006, 266478, 229333, 303271, 393931, 709920, 1104228, 1197354, 1066991, 867966, 731511, 773021]
19155G73021O3383j4424K7518j6590p9016J45400j8063j36716j93471j05146m2139
19144D03757m6128j61235N4729J29029P4408M1586P2512Q8540j13165j78942L9360
19133D04451P7529l7357M5379J88117K51589N8865n3601j79748p9604N668K69674
19122I50962M53008K47287q9058j00413j19144l74175l10712k17833P2826J1924
19112E24672j9248N5007M3385L31429n115k36475j30039p6870j28195m2703R8942
19101D14790l1954j64009R0620p1132R3769J38734M2566p2548J25060j7404p2361
19090D76131M1503J75691j2929j29746J12308q4890p3761n5051J72868M5760O1134
19079G29018k19275M8951M877K2491j4456j82627k08337J60139j31795R1600O2523
$$ y = [773021, 836404, 821980, 849498, 832908, 753892, 899292, 881229, 744513, 551042, 445896, 403757, 357629, 196394, 251123, 380152, 454560, 496146, 568658, 657198, 544033, 365091, 404451, 481980, 444623, 490002, 678119, 929708, 988573, 934972, 755224, 675620, 681288, 950962, 1403970, 1651257, 1562199, 1461786, 1342642, 968467, 657755, 439922, 512748, 524672, 505424, 560431, 603816, 935245, 930130, 693655, 563616, 486746, 358551, 315848, 414790, 382836, 218827, 309447, 238315, 332084, 470818, 513384, 440836, 565896, 548492, 476131, 517634, 693325, 680396, 550650, 662958, 578068, 504307, 449256, 622124, 667884, 729018, 509743, 558694, 563571, 586062, 571606, 388979, 180642, 340781, 208986, 300586, 363109]
19068C63109j02803j15329K323K122N9226J27403O4627J28687q6450K73m092J9873
19056D58969M3020L0124K50056K40175k404j02795j77909M2564L5891j97472l06359
19045C13860j11295K48131L48344J69864J1706m0099k3593N6790J45144m5464
19035A073388j86809R6637J22638O8246K2213q6853j32159r1608J36299Q2489
19025A104481K9805l6233M3776K24700K9900M5048k8786p0564j00006K4110J68789
19014A435020K21180K58863Q8511M6549K90701L11971K21689M82913M90019M28215
19004D275631J76627M16359O33833J047211Q41737P03471J4399N10058Q15561
18995I434887J102106J758618K129971K562236L748288N752856R419204J4902705
$$ y = [363109, 260306, 144977, 147300, 149422, 208648, 336051, 400678, 529365, 442915, 443188, 439096, 458969, 501989, 532113, 782169, 1022344, 1019940, 917145, 739236, 781800, 817691, 620219, 313860, 202565, 450696, 799040, 968904, 980610, 940511, 916918, 973708, 1118852, 1073388, 886579, 983216, 1105854, 1174100, 1196313, 1109460, 977301, 885693, 1021992, 1104481, 1134286, 1098053, 1141829, 1366529, 1396429, 1441477, 1412691, 1342127, 1242121, 1266231, 1435020, 1656200, 1915063, 2003574, 2050123, 2340824, 2652795, 2874484, 3357397, 3847416, 4275631, 4452258, 4868617, 5502450, 6549661, 7391398, 8094869, 8109268, 8619326, 9434887, 10536993, 12295611, 14425582, 16987818, 20736106, 26488962, 35908166, 50810871]
18987E0810871K2370654K8585924K5853467J3892817Q907190J6852874J8471771
18980A85745568N336083j0566557j9488708j5297039q626088j6279976k8431224
18973I2392059k7746052j8854096j1495900p223962n084019l600750k569301j893007
18965A3924972j418564j212541j048264r09214o55424n33075n04933l58003l64129
18956F920825j82395j89745k94148j67028q4816K11693J06304R4051K38793M14318
18946G067852K74740N66600P38124R57812R69368J516326J866311K437908L527873
18937A9922914N749690R073637J4401936K1317422K5034004J8778422Q137021
18930A22415046Q671238J5880937J2625304o15823j3045864j6839866j0395368
$$ y = [50810871, 73181525, 101767449, 127620916, 141513733, 150420923, 167273797, 185745568, 191081651, 180515094, 161026386, 145729347, 137103259, 120823283, 92392059, 64646007, 45791911, 34296011, 27072049, 21988030, 18387280, 15817979, 13924972, 12506408, 11293867, 10245603, 9336389, 8680965, 8147890, 7642957, 7284954, 6920825, 6738430, 6548685, 6254537, 6087509, 6002693, 6214386, 6320690, 6414741, 6653534, 7067852, 7342592, 7909192, 8647316, 9605128, 10574496, 12090822, 13957133, 16395041, 19922914, 25672604, 34746241, 49148177, 70465599, 95499603, 114278025, 122415046, 131086284, 146967221, 159592525, 158976702, 145930838, 129090972, 118695604]
18923A18695604p924998j7858506k5189050k0900860j3415574q044399n207669
18916B0154548l807666k564931j463950r32756r09742r35554n80141m54781o04347
18907G900680l41702l09191k59320k21090n8189l98100k51448k02043o4513M04494
18897F199578L49027J78474J71078N25378P97833Q37503P67548R73506J245427
18888A2045352J362293J813718K233430K876697M167949O437995J1126953J9386923
18880F1451310L2290184M3876603L5773856n692956l6712296k7558392n293975
18873I8134334J7330077L5632559L3463605n790858m6666046m4463677k7255361
18866F0384633j4722943q038174m228631j730383j68091R91942K704070O120065
$$ y = [118695604, 110770606, 92912100, 67723050, 46822190, 33406616, 25362217, 20154548, 16346882, 13781951, 12318001, 11385245, 10475503, 9539949, 8959808, 8505027, 7900680, 7558978, 7249787, 6990467, 6769377, 6711188, 6313088, 6061640, 5859597, 5795084, 6199578, 6548605, 6727079, 6898157, 7423535, 8221368, 9058871, 9826419, 10799925, 12045352, 13407645, 15221363, 17454793, 20331490, 24499439, 30937434, 42064387, 61451310, 93741494, 137618097, 173391953, 167698997, 130986701, 103428309, 98134334, 115464411, 151096970, 184560575, 178769717, 132103671, 87639994, 60384633, 45661690, 37623516, 33394885, 31664502, 31496411, 32488353, 35192423, 41312488]
18858D1312488J1673620K1195606L5498507M6371406L2745307j3762013m0778893
18851A34256028k6889180k612402K0209903L7268304K9993400j4180833n1403595
18844A26641625m5218162k7365795j5554654r008596n550185l889487k848304
18837A7206442k449204j963943j163197o51564m37313n16274q86259r53650n83567
18828G601471l75900l3673j16111m57090p18528n11031m08927l95756k72867m84577
18818C827011m45869l51810o1614O6185J60027j07498j23780m64289q4033o1878
18808B352452j03332l0078k04138j08890j23119j91852p0992p8199J98191L46383
18798A986426P2729K8859j88623j43697J17340L15132K93455m9739j36617N2348
$$ y = [41312488, 52986108, 74181714, 109680221, 156051627, 188796934, 175034921, 134256028, 107366848, 104754446, 124964349, 162232653, 192226053, 178045220, 126641625, 81423463, 54057668, 38503014, 29494418, 23944233, 20054746, 17206442, 14757238, 12793295, 11630098, 10978534, 10541221, 10024947, 9138688, 8185038, 7601471, 7225571, 7191898, 7075787, 6618697, 5900169, 5389138, 4980211, 4584455, 4311588, 3827011, 3381142, 3029332, 2967718, 3033903, 3193930, 3086432, 2962652, 2498363, 2414330, 2352452, 2249120, 2219042, 2014904, 1906014, 1782895, 1591043, 1520051, 1441852, 1640043, 1986426, 2059155, 2088014, 1899391, 1755694, 1873034, 2188166, 2481621, 2431882, 2295265, 2347613]
18788B347613N5169r2355n2402m5095n0474k33192k46257k9431Q7380m4572k5116
18777A671268M5232K79625L16981K00181o7978l28936k58506j0622K38156O23670
18767B709071Q40866N74514o00824o66801o25063n14567k47714j88050j45783
18758A135649J09454R9938k9325Q1010O7799L23194K65773l1029j24615J2767
18748A910615N5821O265J82807j01760l2714r4412j91356k45691j21997J6505
18738A384083j78947k31907k28635j8191O557m4311J3201j44573o3563m2290m6675
18727D04749J37788J75190L08095Q7183k7949j07154n9622Q7221k09410j33921
18717F62170l38103O1769J19465O3812N1090o8169k07497K45217K18612N3599
$$ y = [2347613, 2402782, 2310427, 2258025, 2212930, 2162456, 1929264, 1683007, 1653576, 1740956, 1696384, 1671268, 1716500, 1996125, 2313106, 2513287, 2445309, 2116373, 1857867, 1847245, 2085401, 2709071, 3549937, 4124451, 3523627, 2856826, 2231763, 1717196, 1469482, 1281432, 1135649, 1245103, 1345041, 1315716, 1396726, 1464525, 1787719, 2053492, 2022463, 1897848, 1910615, 1966436, 1972701, 2155508, 2053748, 2021034, 1926622, 1735266, 1489575, 1367578, 1384083, 1205136, 973229, 744594, 726403, 732960, 688649, 701850, 557277, 493714, 451424, 404749, 542537, 717727, 1025822, 1113005, 1085056, 977902, 918280, 1005501, 796091, 662170, 324067, 385836, 505301, 569113, 620203, 552034, 344537, 589754, 808366, 861965]
18707H61965R0438K55742M0358j49763k09805j54239P0159J13702l355j49764
18697G65438k7182K3739Q1181m1965k11913o9453q7768P7033R4091m8420M9019
18686F03800J17104L8600Q2831m0840j54196J512K38723K35695j56367j78155
18676G88707l3728M7981r3211J64049j0564j60717L991K97396P6486l07753k86221
18665D86416O2897J15201J61843O4185l1649R1101K30019K614j23763j3512J0529
18654A055881Q3888K80797K4494k01040r0098j34480P419K79802j7023J09142
18644A398782m2731p5148q4957J39163J98201K86806R3274N6819j19896m54580
18634A395733p0667R2121Q5376o5807j67051k09682J87193J86968R0360Q6608
$$ y = [861965, 952403, 1208145, 1248503, 1098740, 888935, 734696, 804855, 918557, 915202, 765438, 738256, 761995, 843176, 801211, 589298, 519845, 432077, 509110, 603201, 554781, 603800, 720904, 759504, 842335, 801495, 647299, 648811, 887534, 1123229, 966862, 788707, 754979, 802960, 709749, 873798, 863234, 702517, 706508, 1003904, 1080390, 772637, 486416, 549313, 664514, 826357, 890542, 858893, 949994, 1180013, 1182627, 1058864, 1045352, 1055881, 1139769, 1420566, 1445060, 1244020, 1153922, 1019442, 1026861, 1306663, 1289640, 1398782, 1356051, 1280903, 1195946, 1335109, 1533310, 1820116, 1913390, 1970209, 1850313, 1395733, 1325066, 1417187, 1502563, 1436756, 1269705, 1060023, 1247216, 1434184, 1524544, 1611152]
18624A611152J19166J51716K99077M19485L92082J29306J26262K37713K91j76786
18614C309464J81909J13053j1671j3931J83853K69942k97935j91909J92423O8069
18604C803267j72275l45818q6264M03613M33983J83957R404q4664K16851M05372
18594D767426M89376O36281K79017L01344L09686N78191R55394J076356J335134
18585A0728205J630882K193034L085242M571780P099645J1310890J9367019L2143496
18577I2130193M2397488L2747555m537540l3344385k7387762o295301J4871594
18570A10581842K9936831K5788772p675946l9725204l9271788k4795668j3951417
18563D0887422p923429m878886k931388j775247j185790o68515p78559r83319
$$ y = [1611152, 1730318, 1882034, 2181111, 2600596, 2992678, 3121984, 3248246, 3485959, 3486250, 3309464, 3491373, 3604426, 3592755, 3578824, 3762677, 4032619, 3734684, 3542775, 3735198, 3803267, 3630992, 3285174, 3198910, 3602523, 4036506, 4220463, 4229867, 4145203, 4362054, 4767426, 5256802, 5893083, 6172100, 6473444, 6783130, 7361321, 8316715, 9393071, 10728205, 12359087, 14552121, 17637363, 22209143, 29308788, 40619678, 59986697, 92130193, 134527681, 167275236, 162737696, 129393311, 102005549, 95710248, 110581842, 140518673, 166307445, 158631499, 118906295, 79634507, 54838839, 40887422, 32963993, 28085107, 25153719, 23378472, 22192682, 21524167, 20745608, 19762289]
18555A9762289j99648M60959J033016K078409L569045M844274P078795J2129686
18547E0756825K1629962L5595930M7196964L5200486p381642l8781076l0570208
18540A13647241o793877J6373027L2334040K6619087j0729399m4579222m3698015
18533H3172882k7831728j5879710r584991n857142l808327k341126j557334j611830
18525A4700694j910569j635445j095218p75435o13079m80136m66208m93920l74581
18516F856103l10787j53325n6826k63868m17115n20393k23215k70224l75997n7849
18506D206504Q9483p4065j36912k64291k88804m5737j68737L8693J59480q2087
18496C433527k71901j03323j29113l14541l86852j34776J88759K72897P0664k2870
$$ y = [19762289, 19562641, 20023600, 21056616, 23135025, 26704070, 31548344, 38627139, 50756825, 72386787, 107982717, 155179681, 190380167, 182998525, 144217449, 113647241, 106853364, 123226391, 155560431, 182179518, 171450119, 126870897, 83172882, 55341154, 39461444, 29876453, 24019311, 20210984, 17869858, 16312524, 14700694, 12790125, 11154680, 10059462, 9284027, 8670948, 8190812, 7724604, 7230684, 6856103, 6545316, 6391991, 6335165, 6071297, 5654182, 5133789, 4910574, 4640350, 4264353, 4206504, 4295987, 4221922, 4085010, 3820719, 3531915, 3486178, 3317441, 3356134, 3515614, 3433527, 3161626, 3058303, 2929190, 2614649, 2227797, 2093021, 2281780, 2554677, 2625341, 2602471]
18486B602471J69897j31854k63567O9976Q8248m3412k39416j84503k41166J230
18476A827904l3396J94497J44918N5122j62774k85171j36336q5199m4588k4631
18466A450346m6408j48766J8362O1696J04052J48160K23319p6570J7289J29575
18456A881055L47705k1212j88645l31479j11144J7419K3076o0473K128N6540k2578
18445A592392j39117R324O1080P4825l2449l46897j1226n1209l12545n6771L9800
18434H27207N572L0217P1084l314j73717O1609J20603J669l5509j88802q8309
18423F28310J50085J12272P3203m8928P2067j21758K8721l7113j89872J03358
18413G70345J96947J28462J22370K20721J64796P7771o659k9500l2643p91K12786
$$ y = [2602471, 2772368, 2640514, 2376947, 2446923, 2535171, 2491759, 2252343, 2067840, 1826674, 1827904, 1794508, 1989005, 2133923, 2189045, 2026271, 1741100, 1604764, 1519565, 1474977, 1450346, 1403938, 1255172, 1273534, 1335230, 1439282, 1587442, 1810761, 1734191, 1751480, 1881055, 2228760, 2207548, 2018903, 1687424, 1576280, 1593699, 1616775, 1556302, 1558430, 1614970, 1592392, 1453275, 1462599, 1523679, 1598504, 1566055, 1219158, 1207932, 1156723, 844178, 787407, 827207, 832779, 862996, 934080, 930766, 757049, 818658, 939261, 940930, 905421, 716619, 628310, 778395, 890667, 963870, 914942, 987009, 865251, 893972, 856859, 666987, 770345, 967292, 1095754, 1218124, 1438845, 1603641, 1681412, 1674753, 1645253, 1612610, 1611819, 1824605]
18402A824605k29574j61242r9375r2472m0070o188l4381n4176r7844j35645p5780
18391G97858M5736K3953j53344Q0509K3839r2418L52057O23721O9785o208P4864
18380A840352P2655k10864K800j69230l45024k17133k2976k5928J11607K66666
18370A302925J99459J30597Q3827J68810j27355J12271K5992m6399n0756j40219
18360A659152j76694r7043k83146o0015J29821K54238J07430j65855j54517L0880
18350A244251J64550L36794L29403k3216j04662p4257J09284J09220j0267j11821
18340A969279r2521k61155O4369o9430q0988K1205J69412J54577M61456P2743
18330B408947J7784j57472r9769J11961J27329L27877J06403o1275j56555k16599
$$ y = [1824605, 1595031, 1433789, 1334414, 1241942, 1201872, 1195684, 1161303, 1107127, 1009283, 873638, 797858, 843594, 867547, 714203, 794712, 818551, 726133, 1078190, 1701911, 1771696, 1765488, 1840352, 1913007, 1702143, 1704943, 1535713, 1190689, 973556, 950580, 924652, 1036259, 1302925, 1502384, 1632981, 1716808, 1885618, 1758263, 1870534, 1896526, 1850127, 1799371, 1659152, 1482458, 1385415, 1102269, 1042254, 1172075, 1426313, 1533743, 1367888, 1213371, 1244251, 1408801, 1745595, 2074998, 2051782, 1947120, 1872863, 1982147, 2091367, 2081100, 1969279, 1876758, 1615603, 1679972, 1610542, 1529554, 1550759, 1720171, 1874748, 2336204, 2408947, 2426731, 2269259, 2169490, 2281451, 2408780, 2736657, 2843060, 2781785, 2625230, 2408631]
18320B408631q3989K02510L03061L15195p5685l19823o48961q9017q8072N1555
18310A975405L4660j07786k48763k85513j77904l1685o4809L42381L45844R5026
18300A876856Q2916o2139L8800J47990l418M6101K04633R0275l22478l56117k09711
18289A533708L8259j56058J2530m3604P9701O9965L4362K6836j6618K48983J83179
18278B011243n4165k13274j15738k8347K71427K44011J79795K58405L69510Q1822
18268C004689m80708n21022j75381P4700L62277K21482j5132o38810n73669l68733
18258H89693n4338P0181j8855k63884J19369p4653l5516J32025k3462J82429K05036
18247A128025L6716J44791J01754N3835J86818k08266j26604L49133K19778K2666
$$ y = [2408631, 2324642, 2527152, 2830213, 3145408, 3069723, 2749900, 2100939, 2011922, 1923850, 1975405, 2010065, 1902279, 1653516, 1368003, 1190099, 1158414, 1093605, 1435986, 1781830, 1876856, 1959772, 1897633, 1936433, 2084423, 2081005, 2127106, 2331739, 2422014, 2099536, 1743419, 1533708, 1571967, 1415909, 1428439, 1384835, 1464536, 1534501, 1568863, 1595699, 1579081, 1828064, 2011243, 1957078, 1743804, 1628066, 1599719, 1871146, 2115157, 2294952, 2553357, 2922867, 3004689, 2523981, 2002959, 1827578, 1902278, 2264555, 2486037, 2470905, 1832095, 1258426, 889693, 835355, 905536, 886681, 622797, 742166, 667513, 631997, 764022, 740560, 922989, 1128025, 1164741, 1309532, 1411286, 1465121, 1651939, 1443673, 1317069, 1666202, 1885980, 1908646]
18237A908646j14162l34206j98176j07583j53059j15080q6060l8834L13644J48997
18227A224127k32548l07028k11206J6584K28346R6202l9469m1191j34677j45663
18217D53477K18302P2690J05068m7641k24332j18323J56095N7950k84302k07853
18207A81131k9943R2533N081k9406J11913O2884K54418J28564j69134J76104O073
18196G90218l72414r8620M8967J410m8495R8017K78356J35433j0615J88835r1801
18185I19291l22592q0458O4081j56661j73885L2973J13565R6234k6430j812m4452
18174D19854P6452l338K0466L7622l3001q1787r0489O4127P5984J07599n2811
18163E40678K3203K06985N2449l6005J62196L31515P0449k9489j24177O7396Q3837
$$ y = [1908646, 1794484, 1460278, 1262102, 1154519, 1001460, 886380, 800320, 761486, 1075130, 1224127, 991579, 684551, 473345, 489929, 718275, 814477, 775008, 733817, 599140, 453477, 671779, 744469, 849537, 801896, 577564, 459241, 615336, 673286, 388984, 181131, 151188, 243721, 248802, 219396, 331309, 394193, 648611, 777175, 608041, 784145, 790218, 417804, 319184, 368151, 369561, 321066, 419083, 697439, 832872, 822257, 1011092, 919291, 596699, 516241, 580322, 423661, 249776, 282749, 396314, 492548, 466118, 464306, 419854, 496306, 492968, 513434, 551056, 518055, 436268, 345779, 409906, 485890, 593489, 540678, 563881, 770866, 823315, 787310, 949506, 1281021, 1351470, 1321981, 1197804, 1265200, 1349037]
18152A349037r7391j20235q203N6968J29721J34990J37132J05781m2602L5123
18142A680321K41598K02756Q1941K69415J60957O9034J38194J10962R9127K85608
18132C339913M80689N4259K18062K38299L85748N13059O96209P55610J186834
18123G868682J146823Q92113J069055J467936K050725K835275L849081N157014
18115B6336704P334734J1276241J8457089L1619622N7808755J02820414J46751787
18108D02405346J14344391n6183016j66193390j22430725o5300177l4830656j9991312
18101E1820461j2502842q538908o258079m355799l151177k475691k217214j682922
18093A0637829j297856j123029p06543k84254l03228p02590o04327m95522l79080
$$ y = [1349037, 1251646, 1131411, 1123208, 1180176, 1309897, 1444887, 1582019, 1687800, 1645198, 1680321, 1921919, 2124675, 2206616, 2476031, 2636988, 2706022, 2844216, 2955178, 3054305, 3339913, 3820602, 3874861, 4092923, 4331222, 4716970, 5230029, 5926238, 6681848, 7868682, 9015505, 9907618, 10976673, 12444609, 14495334, 17330609, 21179690, 26336704, 33671438, 44947679, 63404768, 95024390, 152833145, 255653559, 402405346, 516749737, 460566721, 294373331, 171942606, 106642429, 71811773, 51820461, 39317619, 30778711, 24520632, 20164833, 17013656, 14537965, 12320751, 10637829, 9339973, 8216944, 7510401, 7226147, 6922919, 6220329, 5616002, 5120480, 4741400]
18084D741400m18874k89675l02968m43688l51792k52128o0995M9652R0143J8986
18074B780061j79846k02538j1053j5721j13722j54619j49662o0960J21933o6519
18064A947354k44054j13223j5347P6543R1360O3471Q6064M9648J8328j57268j85081
18053A617795O6864N4829J35037J84611l37092j49781j82209j1733M5094K64193
18043A687608O8464q841j62732P9889l2709O2754J0316J93620p4022p6530L7599
18032A785416L6974L72652M72574L02997K05957j44769p5721k8635n653O1894
18022B983686L04119K44736K84115L13128K24795L07653O61435L15739J84483
18013E823889L66787N69085N64893Q40561J435994J937810K569498L696078N777922
$$ y = [4741400, 4322526, 4032851, 3729883, 3286195, 2934403, 2682275, 2621280, 2670932, 2761075, 2780061, 2600215, 2397677, 2386624, 2370903, 2257181, 2102562, 1952900, 1891940, 2013873, 1947354, 1703300, 1590077, 1574730, 1651273, 1742633, 1806104, 1892168, 1941816, 1960144, 1802876, 1617795, 1684659, 1739488, 1874525, 2059136, 1722044, 1572263, 1390054, 1378321, 1423415, 1687608, 1756072, 1747231, 1584499, 1664388, 1631679, 1694433, 1704749, 1898369, 1824347, 1747817, 1785416, 1822390, 2195042, 2667616, 2970613, 3176570, 3031801, 2956080, 2927445, 2921792, 2983686, 3287805, 3532541, 3816656, 4129784, 4354579, 4662232, 5323667, 5639406, 5823889, 6190676, 6759761, 7324654, 8165215, 9601209, 11539019, 14108517, 17804595, 23582517]
18004B3582517R300695J5577749K7194411M2988556M8919005J8674786l8077893
17997A48159826n1351161l4134639j9331927j1037610o516374m191745k648058
17990A8948312j930510q47413k7604J66219L42887R52632J617225K224121L661554
17981B5107423N978663R724194J6275365K8210838M3014736M4663206J0937355
17974A83911780l8207781m1815435k1522947k762454J4498044L2139635L9095735
17967A65336577J3107018l6094767m6588753l0919295j8199972j1175704p320498
17960B8144606m763852l215389k339081j442621o80997l41212K09123N93759R34474
17951A7098810J512679K876666N209220Q523540J4573290K5000041L7812338L8993902
$$ y = [23582517, 32883212, 48460961, 75655372, 118643928, 167562933, 186237719, 148159826, 96808665, 62674026, 43342099, 32304489, 25788115, 21596370, 18948312, 17017802, 16170389, 16142785, 16309004, 16651891, 17604523, 19221748, 21445869, 25107423, 31086086, 40810280, 57085645, 85296483, 128311219, 172974425, 183911780, 145703999, 103888564, 82365617, 79603163, 94101207, 126240842, 165336577, 178443595, 142348828, 95760075, 64840780, 46640808, 35465104, 28144606, 23380754, 20165365, 17826284, 16383663, 15702666, 15361454, 15570577, 16164336, 17098810, 18611489, 21488155, 26697375, 35220915, 49794205, 74794246, 112606584, 151600486]
17943A51600486O583064l9710518m3828284k7178438j4951396q561876n557667
17936A8395371l937983k672594j810036j343299j035307q25109p73750n69575
17928E427718m35096k54336k76272j71746j64428j51355l81987k18119k08410
17919C165969m79705o8671K15327J40529K45352O7788l18895j67661O7948k27653
17909B640328o7534K35537j2001k06855j16514j34707k10966j48279p7368j80436
17899A721205r4449P0950j46799k29914l7654J06240j62499M3953J46038R752
17889A426823K18462K03188J13865K43742J13994j05250j17512O6751K82683K75132
17879B721878J69779K8799j1433o0030P9077l9030O2028J06501j74275l58193
$$ y = [151600486, 158183550, 118473032, 74644748, 47466310, 32514914, 23953038, 18395371, 14457388, 11784794, 9974758, 8631459, 7596152, 6771043, 5997293, 5427718, 4992622, 4738286, 4462014, 4290268, 4125840, 3974485, 3592498, 3374379, 3165969, 2686264, 2617593, 2832920, 2973449, 3218801, 3286589, 2967694, 2800033, 2867981, 2640328, 2572794, 2808331, 2796330, 2589475, 2472961, 2338254, 2127288, 1979009, 1901641, 1721205, 1626756, 1697706, 1550907, 1320993, 1283339, 1389579, 1227080, 1271033, 1417071, 1426823, 1645285, 1848473, 1962338, 2206080, 2320074, 2214824, 2097312, 2164063, 2446746, 2721878, 2891657, 2920456, 2909023, 2848993, 2928070, 2889040, 2951068, 3057569, 2883294, 2525101]
17869B525101l25621j12922n7125j94318j12727j18155o6579P1557L5188m0271
17859A604128J64527N25094L78275K23907o4877j77186k05985K7607L75960K56092
17849C107542L07863p1789k15922j15864l89194m57493k37036n794J01807J90639
17839B214759K5975l30098m70351j54876M3270j10700k39705j92209J46717L29921
17829A262703K028J56558M7410J85753K17069K11331j74824k07512j28916k9322
17819A542278P6118P6980R2469j57309k41010k59266j02348K26134M846j84648
17809A074244k05939j46867K9102j66122p2507J02597Q5704O0380M7750m8145
17799G60197j43696J85130J26238j55647l7577n4291P3039K1673l5439j66977
$$ y = [2525101, 2199480, 2086558, 2029433, 1835115, 1722388, 1604233, 1537654, 1609211, 1644399, 1604128, 1768655, 2293749, 2672024, 2895931, 2831054, 2653868, 2447883, 2475490, 2851450, 3107542, 3415405, 3343616, 3127694, 3011830, 2622636, 2165143, 1928107, 1922313, 2024120, 2214759, 2240734, 1910636, 1440285, 1285409, 1328679, 1217979, 978274, 786065, 932782, 1262703, 1264731, 1421289, 1468699, 1654452, 1871521, 2082852, 1908028, 1700516, 1571600, 1542278, 1618396, 1695376, 1787845, 1630536, 1389526, 1130260, 1027912, 1254046, 1258892, 1074244, 868305, 721438, 750540, 584418, 511911, 614508, 700212, 760592, 808342, 760197, 616501, 801631, 927869, 772222, 734645, 680354, 753393, 775066, 739627, 572650]
17789E72650j2041N5359j23K008j22733J1605n539J9006J41523J30713p6701k5271
17777F90456l01804M776m9499K6892J38996N7622o2748n4888J00374j2909J30129
17766F67397k71359k43988J70521K50010J71306j26849k01446k32564J52975K96808
17756F32811n3193j70818j41600n3079J25483L0837j09006K06997M7892j22798
17746C93526k42610Q8788J58603o3127o676n6910j1239P0577n907J46984M8780
17735E20789O6039J0514j42290m2051j16255N7410k5821k96153K3433J92121M9928
17724B97664k69961P0945J66499N1626q8087k2744q059j72337j33345P6889K01558
17713A70648o835K48338l3101j28660Q4808M6992k3064P9786M2670l092j06780
$$ y = [572650, 560609, 615968, 615845, 617853, 495120, 506725, 501186, 520192, 661715, 792428, 715727, 690456, 388652, 393428, 343929, 370821, 509817, 567439, 504691, 449803, 550177, 537268, 667397, 396038, 152050, 322571, 572581, 743887, 617038, 415592, 183028, 336003, 632811, 579618, 408800, 267200, 214121, 339604, 370441, 261435, 468432, 516324, 393526, 150916, 239704, 398307, 335180, 328504, 271594, 260355, 330932, 325025, 472009, 520789, 586828, 597342, 455052, 413001, 296746, 354156, 328335, 32182, 55615, 247736, 297664, 27703, 98648, 265147, 316773, 228686, 205942, 197883, 25546, -107799, -30910, 170648, 163813, 412151, 379050, 250390, 335198, 382190, 359126, 438912, 481582, 478490, 371710]
17702C71710k00899j13412N4463L546M8817j49129L4346P2283j1087J11406J46063
17691C68107o6915o9941m4091K5473m0618j0821J98481J44035q4226p8117n4724
17680B86643p4549Q4323j49618n4368J33716K75062k49L5766j5280j10883j12323
17669B98240J93822m2091Q5322k2781j8131j20012m4824N2713r9157l9494j19562
17658A24045j62904O6764J09415p4926r4077P7077O5406L7407l2793j50179Q2131
17647D7366q3539M0642J25024j48j25615l7518K107J47576K26370N0541k1802
17636C71004j32402m2934k2504l4272n9551L1331J25780P4031j140n7374p9690
17625A72279j19218P5036P0902k02339j11169L1867J30666P8180j90689L1431
$$ y = [371710, 170811, 57399, 111862, 115408, 164225, 15096, 49442, 121725, 110638, 222044, 368107, 301192, 231251, 187160, 212633, 172015, 161194, 359675, 503710, 419484, 341367, 286643, 212094, 296417, 146799, 92431, 226147, 501209, 500960, 536726, 521446, 410563, 298240, 492062, 449971, 535293, 512512, 494381, 374369, 329545, 382258, 283101, 243607, 124045, -38859, 27905, 137320, 62394, -31683, 45394, 110800, 148207, 115414, -34765, 47366, -36173, 4469, 129493, 129345, 3730, -33788, -31681, 115895, 342265, 392806, 371004, 238602, 195668, 173164, 138892, 79341, 110672, 236452, 310483, 309343, 251969, 172279, 53061, 128097, 198999, -3340, -114509, -82642, 48024, 126204, -64485, -33054]
17615c3054J82444O6070o4297j17988L5984R4975J13819J3369l41470L0931N6446
17604C7229J52980J82388N7670n4173n6870j52839l7933j0024P7592O9526J2644
17593B78190q5413K3989o6779o7923J58391j26538j09423J13865Q7114p216k9327
17582A68930j97157j97896J8301j29311R2026J87926J43707Q202J08170Q6883
17572B89781r7104k10980k51860J10652J55239K53936K5839j38307M1204K5696
17562B04096M2470r204p7801k1402L2046J60076J42073k81245l39019J4981m0669
17551a73598K00143J70749r2779m1035l1850j14287k3069q8127J98120R3749J25199
17540B23215K08760M2192k03364k9525j27328J7904P0417P1887n0751k06745L7995
$$ y = [-33054, 149390, 215460, 151163, 33175, 69159, 164134, 277953, 291322, -50148, -19217, 37229, 190209, 372597, 430267, 376094, 319224, 166385, 128452, 118428, 196020, 265546, 278190, 192777, 216766, 149987, 82064, 240455, 113917, 4494, 118359, 205473, 198257, 168930, -28227, -226123, -207822, -337133, -245107, -57181, 86526, 94728, 202898, 289781, 192677, -18303, -270163, -159511, -4272, 249664, 275503, 137196, 178400, 204096, 246566, 237362, 159561, 138159, 170205, 330281, 472354, 191109, -147910, -132929, -173598, 26545, 197294, 104515, 63480, 31630, -82657, -105726, -193853, 4267, 98016, 223215, 431975, 474167, 270803, 241278, 113950, 131854, 202271, 274158, 223407, 16662, 54657]
17529E4657l0701L9071n5774k88234J39747L81085j16048j1389o1172m5648O2834
17518F8428o3845J05218J67830J13436M83j20555m1367J842j4478j31851L1562
17507A16703R3553k8514n9103l1210k41160j09073J84234J20804P0919J45915
17497B63068K9142O087O241R180Q2749j68003j80150j41495N4892J23491L2433
17486A17635O4635l5514J508N5838j62187j75173N9533K33540J52587K152l217
17475C11337p7356M2118r2101K1683n0276K75093J84236j99693j01614O186r0307
17464B29306k4935K15885J59213J54083J18483J1661k38105n3658k5019j51435
17454C95479N541l4240m6271j7621l30737m7676K65481K99302L15542K26463M87411
$$ y = [54657, 23956, 63027, 7253, -280981, -141234, 239851, 123803, 112414, 51242, 5594, 68428, 4583, 109801, 277631, 391067, 391550, 270995, 229628, 231470, 216992, 85141, 116703, 210256, 181742, 122639, 91429, -149731, -258804, -74570, 46234, 117153, 263068, 292210, 298297, 304538, 313718, 396467, 228464, 48314, -93181, -38289, 85202, 117635, 182270, 146756, 148264, 204102, 41915, -133258, -73725, 159815, 312402, 314554, 311337, 233981, 276099, 183998, 205681, 155405, 430498, 614734, 415041, 313427, 319613, 229306, 204371, 420256, 579469, 733552, 852035, 863696, 625591, 571933, 546914, 395479, 401020, 366780, 320509, 302888, -27849, -75525, 189956, 489258, 804800, 1031263, 1518674]
17443A518674Q01917O38670q647p51552o44493l43466n7503j09634j04364j42124
17433G97478j76703J97744J67145M8783m2152k82719j57979j22876k89528j40965
17423a772j15146K7010K34184k1607o0526J42700r3071r2470p6130N4601J01886
17412I9659J44446M1763K80044m1881K6779J16805O8641K36228k5182k50139j86315
17401E10848n7897L5334j91817j81059k03118k57664J28159N8681J78429K57766
17391B77662j8073J6862j30022k648k7770M3086j74462R431k84973n6229J93291
17380a53845K30619l6265n2340j4414n1411M4768N7559J01975r0257k25641l3429
17369b22681K3540p557K5671J00107N6954J26322j86573n347Q1786j11931P7038
$$ y = [1518674, 2320591, 2959261, 2950614, 2199062, 1554569, 1211103, 1153600, 1043966, 939602, 797478, 620775, 818519, 985664, 1034447, 992295, 709576, 551597, 428721, 139193, -1772, -116918, -89908, 144276, 122669, 62143, 204843, 111772, 19302, -56828, -2227, 99659, 244105, 285868, 565912, 524031, 550810, 667615, 736256, 972484, 947302, 697163, 510848, 452951, 488285, 296468, 115409, -87709, -345373, -217214, -158533, 19896, 277662, 259589, 276451, 146429, 143781, 116011, 159097, -15365, -5934, -290907, -347136, -153845, 76774, 40509, -11831, -26245, -77656, -32888, 24671, 126646, 36389, -189252, -222681, -199141, -206698, -181027, -80920, -23966, 102356, -84217, -89564, -7778, -119709, -42671]
17358d2671P2419o8700j15347m1474q2578k33328l2530M2399j18923J82457K92344
17347a45932J49299J37435K48528Q5529p8015j61996j12225k19226j18343r6908
17337c11854l0003K28604j01484j56173m777J10252J24504m8510j38355N08l8579
17326c65867O8082N3069K6165K56717m2282k9998R6970J40048m0004j489K3222
17315A84633J9345r3374j63863m466M303J84994L3148j30817k09740l4727K07909
17304b655J71122o7204m3245q7104j30934Q52J80435J06280q0412j00367l0044
17293h3276q377P9589j33696p2971p1978j9561J57591P0693l415J35755J67111
17282B17465J62896j09682j05997o3051j7387l8219k61306K385L4490L8716j11508
$$ y = [-42671, 29748, -38952, -154299, -195773, -278351, -511679, -544209, -501810, -620733, -438276, -145932, 3367, 140802, 389330, 474859, 396844, 234848, 122623, -96603, -214946, -311854, -341857, -113253, -214737, -370910, -375687, -265435, -140931, -189441, -327796, -327288, -365867, -297785, -244716, -218551, 38166, -4116, -34114, 62856, 202904, 162900, 161411, 184633, 203978, 110604, -53259, -57725, -53422, 131572, 164720, 33903, -175837, -210564, -2655, 168467, 101263, 58018, -29086, -160020, -159168, 21267, 127547, 47135, -53232, -83276, -91653, -12064, -145760, -218731, -290709, -310270, -152679, -81986, -85401, 50354, 217465, 380361, 270679, 164682, 101631, 84244, 46025, -215281, -212896, -178406, -139690, -251198]
17271b51198j26166K50858J21662J33230k9545M0688j32856P3841Q331o5384r4841
17260g1380J12589K2858L5236n8402k40730K41430K26154o2399j51330k21456
17250a67430j01842J31288J33293K12189J73556n0426l42448r9560k13264r2492
17240d17136J04519R7815L0089j9841J51111P4133k03956K3141j6297P6145J23315
17229B3038j8990J7996k264q042r7724j42532l9510O0754P4942L0495J01577l5466
17217c5726j5439k7448o2651m1679l7396k6456J08142J08151o9061K6309L0016
17206d3238j03714j17954K63594J73161j77983N594l2106m268n9079j35078K4809
17195b06262j12813Q0435K73890L8144j3250k0057l14354n6169k8257Q9121p513
$$ y = [-251198, -377364, -126506, -4844, 128386, 98841, 139529, 6673, 80514, 88845, 23461, -71380, 41209, 64067, 99303, 40901, -199829, 41601, 267755, 205356, 54026, -167430, -269272, -137984, -4691, 207498, 381054, 330628, -11820, -111380, -324644, -417136, -312617, -214802, -184713, -204554, -53443, 20690, -183266, -160125, -176422, -100277, 23038, 4048, 22044, 19780, 11738, -85986, -228518, -268028, -207274, -132332, -101837, -260, -35726, -51165, -78613, -141264, -182943, -220339, -246795, -138653, -30502, -99563, -73254, -43238, -146952, -264906, -1312, 171849, -6134, -540, -32646, -36914, -95993, -231071, -206262, -319075, -238640, 35250, 73394, 60144, 40087, -274267, -330436, -358693, -269572, -277085]
17184b77085j5107J67503Q7657r5301j54948J6440L7851j20755j75324J09150
17174d19919O7910q3375K85282K51805k6112q9069M0148M0986j24560j21928l5447
17163b14279J24552K13716L9632j23619N945o3629J8825j87271j0430J15616q002
17152h8944J11037K57317K6256j87116R109j82861j00302O893N6440N8347J54616
17141A20792R4480r4821k7687M4316k754k58640j06578J83948J93776n3255j85714
17130i2137m7646K00681J47684q6881o0713k03497k8955M0351o5260J3834j18322
17119c00861p3813r4699M1798J23269J46348Q2163p4403j34196J38330J83070
17109C7006M3923j25798J29736J71192k11182r7375q2095j73607r7058J01214
$$ y = [-277085, -292192, -124689, -37032, -132333, -287281, -270841, -232990, -353745, -529069, -419919, -352009, -435384, -150102, 101703, 75591, -13478, 26670, 67656, -56904, -178832, -214279, -89727, 123989, 163621, 40002, 45947, -17682, 1143, -186128, -196558, -80942, -88944, 22093, 279410, 305666, 118550, 127659, -55202, -155504, -148611, -92171, -33824, 120792, 215272, 120451, 92764, 137080, 134326, -124314, -230892, -46944, 146832, 93577, -92137, -139783, 60898, 208582, 121701, 60988, -142509, -171464, -131113, -196373, -182539, -300861, -374674, -469373, -427575, -304306, -157958, -75795, -150198, -284394, -146064, 37006, 80929, -44869, 84867, 256059, 44877, -52498, -134593, -308200, -405258, -304044]
17099c04044J27962o7053r3464O9036M6091J65300J41158j17149k33350q8669
17089c54182M7218J20742J16423M755K3492O1445Q2978J23803L7080r9055r7903
17078F6796k18798J22003Q6201k26435k2924J15689K1345j02494r6537M1796J09067
17067a04291J11148J4943j24278M0609R1371J26885q1162j05015j46042j8142
17057a93974O2176o1462L6428R9573O5747M0078Q2657N002j29995k55309J82903
17046f6176J90744l2475N7174m5394j10778j9822r2946K4861J13076R9251j6029
17035A01486j441O863k47586L9399K41782j2255j40419R5249m4131j22711J11560
17024B7796L7522N3915l02513j01835O4471J27125O0682q8427M0979m02n8948
$$ y = [-304044, -176082, -243135, -336599, -267563, -221472, -56172, 84986, -32163, -265513, -354182, -306964, -186222, -69799, -65044, -41552, 19893, 102871, 226674, 263754, 164699, 66796, -152002, -29999, 56202, -170233, -193157, -77468, -56123, -158617, -255154, -213358, -104291, 6857, 21800, -102478, -61869, 29502, 156387, 75225, -29790, -175832, -193974, -131798, -193260, -156832, -57259, 8488, 48566, 131223, 136225, 6230, -249079, -66176, 124568, 92093, 149267, 103873, -6905, -26727, -119673, -94812, 18264, 117515, 101486, 100045, 106908, -140678, -101279, 140503, 128248, -12171, 83078, 38947, -83764, 27796, 65318, 119233, -183280, -285115, -220644, -93519, -32837, -121264, -80285, -80687, -139635]
17013a39635k2927j7329k9746j87347P4426J13811J61172K11622O533m8352n2252
17002F9976j48918j12763o2153O4406J98894M7327m6225l6085l3417k5326r8345
16991a82629j7226J10814Q2201r5280N4289o3816q9682j1787N5943J40958J7779
16980A564q6341j62445j28101R8059m2611N7048K36586O4419k28731k30597M9461
16969c71689J32589J9402m9210P6413O2752j19587o3780J01918Q7495K831P2866
16958d8000J53568o6101n7898K5301J4382J57953P1843q9580k34758k07746N9470
16947b21566K7270K979K37670J53607n1830j44065j94511l7464J52663N6977l3074
16936e1344l8363O6699p0069J07998N3536n3107q3337M342J41204J00276Q6754
$$ y = [-139635, -162562, -179891, -209637, -396984, -322558, -208747, -47575, 164047, 170580, 122228, 69976, -78942, -191705, -253858, -189452, 9442, 56769, 10544, -25541, -58958, -84284, -182629, -199855, -89041, -6840, -102120, -47831, -111647, -201329, -213116, -157173, -16215, 1564, -84777, -247222, -375323, -277264, -319875, -262827, -26241, 38178, -190553, -421150, -371689, -239100, -219698, -268908, -192495, -129743, -249330, -313110, -211192, -123697, -120866, -48000, 105568, 39467, -18431, 6870, 21252, 179205, 251048, 161468, -73290, -281036, -221566, -194296, -191317, 46353, 199960, 148130, 4065, -190446, -227910, -75247, -18270, -51344, -89707, -23008, -93077, 14921, 68457, 15350, -67987, -63645, 77559, 177835, 264589]
16925B64589L8908j34350r5992j42265l06586l742L53148k3278j32619j62487
16915c44674R3112K1033l6167J59580J25783l3837n228j33740n2008M2561L3235
16904a30350j13749m0804J25463r9015j22027J30057J06613L1882q3821l0957
16894b26708J82642J84268R1820o2845l7457P0051N6988R3330n0431j00867p7528
16883A23263j71820P0256J12034j61185j38259l30192M4643K28438L9978N2662
16873a30182J0963o5924J31746O2290o0518j56502o5243j2560J37258j926M8100
16862a02498K42096j4798n5286L1735K6153O6796m1503o2590J6412j69526j4708
16851g7717r9491l7531L1889j6344J58576J62961j41053N2584J0821j91997j57967
$$ y = [264589, 303497, 169147, 73155, -69110, -375696, -379438, -26290, -49568, -182187, -344674, -251562, -230529, -266696, -107116, 18667, -15170, -20398, -154138, -206146, -163585, -130350, -244099, -284903, -159440, -258455, -380482, -250425, -143812, -111930, -195751, -226708, -44066, 140202, 232022, 169177, 131720, 201771, 258759, 352089, 301658, 200791, 123263, -48557, 21699, 133733, -27452, -165711, -495903, -451260, -222822, -182844, -130182, -119219, -185143, -53397, 8893, -51625, -208127, -273370, -285930, -148672, -150598, -102498, 139598, 124800, 69514, 101249, 127402, 194198, 152695, 90105, 106517, -63009, -77717, -177208, -214739, -182850, -199194, -40618, 122343, -18710, 33874, 44695, -147302, -305269]
16840c05269r1214k1622L5833J59419J82657j45118j01323L6651J85454J43369
16830G8837q3127q7358R1457Q993p5951R6457R5696k9994j01750J01023N2722
16819A47005r8885j4396r1313j06274j1859J27445J00624j23459q8605R1897K82821
16808B15001k0115m1185q2700l8872L5774K4625K3772k8209q1399j60280k43107
16797c96695O2949R5200K03117R4023R6443J75812l65727l96532J87993l9217
16787b82634Q0023m8430l0448J36055N3616k77838j7219K74184R1003P6017J4297
16776F8626p2856J64972r6485r165k2195L9312j10901N648R5419R2115j45246
16765I244k23908j71624J50492J76370k0989M0578l9329p2614O0301j50471q2988
$$ y = [-305269, -396483, -418105, -382272, -222853, -40196, -185314, -286637, -249986, -64532, 78837, -4290, -91648, -191, 8802, -67149, 29308, 125004, 95010, -6740, 94283, 147005, 48120, 33724, -57589, -163863, -175722, -48277, 52347, -71112, -159717, -67820, 215001, 194886, 153701, 71001, 32129, 67903, 92528, 116300, 88091, 6692, -153588, -396695, -333746, -238546, -35429, 58594, 155037, 330849, -34878, -431410, -243417, -282634, -202611, -251041, -281489, -145434, -91818, -369656, -386875, -112691, -21688, 54329, 68626, -4230, 160742, 64257, 55092, 32897, 72209, -38692, -33044, 62375, 154490, 9244, -214664, -386288, -235796, -59426, -80415, -39837, -79166, -151780, -91479, -241950, -324938]
16754c24938P9098p370J35523j58241L1804J8215p2860J9375J60595R9888n5275
16743g4186O8200O5332j09369p8653L4070q2632Q4977K5172M3911M1337k03076
16732a84917j78854O8829K63159j27680j55352j37007k6195J17941J5069J33448
16722b11559K95104P9811j15026j70470k70869J07190J17631j75003k5061R3058
16712b75194O1614J11075K4663J687M789J29956L3456j19141K2823m1414j20316
16701a66002l0637K27682K72418q9861j02990k4858O566p0637J27675n8821l8108
16690E2427L159q4429O922j37535k7979K70216K5016j22370j7048N5097J05418
16679A28894R7493j27363o929L7365P1026j14156p1062n4392K18401K8291k71838
$$ y = [-324938, -245840, -253210, -117687, -275928, -244124, -225909, -298769, -279394, -118799, -18911, -74186, -5986, 59346, -50023, -128676, -94606, -177238, -92261, -67089, -23178, 18159, -184917, -363771, -294942, -31783, -159463, -314815, -451822, -478017, -360076, -345007, -211559, 83545, 163356, 48330, -122140, -393009, -285819, -168188, -343191, -368252, -275194, -213580, -102505, -77842, -76155, -71366, 58590, 92046, -27095, -4272, -45686, -166002, -196639, 31043, 303461, 213600, 110610, 85752, 92318, 21681, 149356, 90535, 52427, 55586, -28843, -21921, -159456, -187435, 82781, 107797, -14573, -31621, 23476, 128894, 226387, 99024, 92095, 129460, 200486, 86330, 15268, -39124, 179277, 207568, -64270]
16668f4270j87980j2071m6775J04741Q7560R2095J43133l5895j54829j08416R6313
16657h6394K33101N0501j46197o4182J3513K9542M2753J21860j77962j97776j9887
16646b01128j01083j1859j14143n7889k0474K08512J74173j2057j01404K1313
16636b16039q1396j56432O1293J45149o9461j948o927P9145r9976k0315M9035
16625c17872l986l6051R2727L78119K25333j41961k11617j9370O9280M1291J17800
16614A93693k08883k85147P106l7158m6764K35393R3763N0829l8073m8761n1817
16603a35819J38029R5484O6185o4713j50981J343J07589J07839N3699O6306p8291
16592B06670Q5l6776k05173J9819K49821k739j29428k25530l6345J61461K22Q4618
$$ y = [-64270, -252250, -264321, -311096, -206355, -118795, -26700, 116433, 80538, -74291, -182707, -86394, 146707, 197208, 51011, -13171, 342, 29884, 72637, 194497, 16535, -181241, -201128, -302211, -314070, -428213, -486102, -506576, -298064, -123891, -135948, -237352, -216039, -297435, -453867, -392574, -247425, -316886, -318834, -325761, -246616, -346592, -366907, -317872, -321858, -357909, -265182, 112937, 338270, 196309, -15308, -34678, 34602, 75893, 193693, -15190, -300337, -293231, -330389, -377153, -141760, -47997, 2832, -35241, -84002, -135819, 2210, 97694, 163879, 99166, -51815, -50472, 57117, 164956, 218655, 284961, 206670, 206755, 169979, -35194, -15375, 234446, 231707, 102279, -123251, -159596, 1865, 2087, 86705]
16580H6705j58900n6672K7776j0558K80614J78103j40822k16783O3951J3234n3944
16569A2704J9967J45217j09592q5347q7755j01894L088P7010K39780k02719P3921
16558a5620Q914p2877j33625j3850L3243J31900J34140r974K23934L3544r5746
16547B23983n2187k9537j21101o9465j0795m0458j11534L9091K82851j11025j14096
16536a14273J41524N9899j25533q7244k5273P7865J78059N7128l2427N5710r7898
16525H7537k13141r8825j49332r8028O1812N2607r7319J18073r024m2499K69499
16514a18640L5211K33204j3375q7534j37841J43491O6254j03955j43793J87388
16504F0410J14917o0731j05744r9163M3709j98749o6765P3882J3547J05610R2559
$$ y = [86705, -72195, -128867, -101091, -111649, 168965, 347068, 206246, -10537, 53414, 66648, 12704, 32671, 177888, 68296, -17051, -104806, -206700, -203612, -126602, 113178, -89541, -15620, -6706, -79583, -213208, -227058, -193815, -61915, 72225, 62251, 286185, 319729, 223983, 171796, 142259, 21158, -48307, -59102, -99560, -211094, -172003, 110848, -177, -114273, 27251, 87150, -38383, -125627, -150900, -73035, 105024, 162152, 129725, 185435, 87537, -125604, -224429, -373761, -471789, -409977, -357370, -454689, -336616, -345640, -388139, -118640, -83429, 149775, 136400, 48866, -88975, 54516, 120770, 16815, -126978, 60410, 175327, 114596, 8852, -90311, -46602, -245351, -312116, -238234, -224687, -119077, -26518]
16493b6518j51993k32603L98J56030L12922K33391j09791j09924o3465n479J50359
16482A53327j78503o9790j39420j83899M3860J53722J58637J33198k4567j34467
16472h7902J33610j12989Q3756J60634M8856j29338j32654K8175M1206O4341K6076
16461A23771Q3082L3231M0487J0935o4051j03155j69811j58750j02046R934K26580
16450f9793l7988j09855o313P2641K3887l8529l4936K86073j55430j13297K761
16439a80779K94478J66014k44044m1758J58724j0641o7742j56439K0865J70182
16429A08860O4752L8781J06955j08650m9019P0064J64584r5429l91686j13432
16419b04220J00554J88412K44504r3740j24430k1852p287p9974q8790J08723J47049
$$ y = [-26518, -178511, -411114, -410716, -254686, 58236, 291627, 181836, 71912, 8447, 2968, 153327, -25176, -94966, -234386, -418285, -374425, -220703, -62066, 71132, 46565, -87902, 45708, -67281, 16475, 177109, 225965, 96627, -36027, -7852, 33354, 97695, 123771, 206853, 240084, 280571, 291506, 227455, 124300, -45511, -204261, -306307, -296373, -69793, -107781, -217636, -223949, -151308, -127421, -165950, -200886, 85187, -70243, -183540, -180779, 113699, 279713, 35669, -6089, 152635, 141994, 74252, -82187, -61322, 108860, 173612, 212393, 319348, 210698, 161679, 231743, 396327, 300898, -90788, -204220, -103666, 84746, 329250, 235510, 111080, 89228, 81941, 1967, -86823, 21900, 168949]
16408A68949J779k64749K06264K21517q5478j92383k20855O0797J61178J69833
16398B26852M4477k44460q2894j8192Q349K5563m6741J95899J07807L8193J2707
16387B67560N6153N990j13382j75282l6360J895J13185k43j60691j95305j18002
16376c54482n8014O8665M12359K7290r9919j64832j23615R050O6818k77027j28068
16365f21775K25036L37495l6722j12161M2137J12438j10604N1379K11620J70652
16355B69495P4076j15284j06935P9915j76670j9900n1833j49035J18686J16914
16345C9429j68496q02j5080j04975J74039J32511O0012j85668j14533n7673J04009
16334a37227J20045p8658r5054K10652O6887o7790k92230J24853O943K0872K49346
$$ y = [168949, 170728, -94021, 112243, 333760, 248282, 55899, -164956, -104159, 57019, 226852, 271329, 26869, -56025, -74217, -65868, -40305, -87046, 108853, 216660, 254853, 267560, 323713, 329703, 216321, 41039, 4679, 6574, 119759, 119516, -41175, -236480, -354482, -412496, -343831, 68528, 95818, -4101, -168933, -292548, -283498, -216680, -493707, -621775, -396739, -59244, -95966, -208127, -165990, -53552, -164156, -112777, 98843, 269495, 343571, 228287, 121352, 201267, 24597, 4697, -47136, -196171, -77485, 39429, -129067, -129869, -144949, -249924, -75885, 56626, 116638, -69030, -183563, -241236, -137227, -17182, -95840, -190894, 19758, 86645, 18855, -273375, -148522, -141579, -120707, 128639]
16323A28639r2475J59843Q106M8033M0925j33905j91126j29452p2546L12945K00212
16312B79199m2035k2457j41289j6840j00510k7874J69755N8797N1361P081j0231
16301B04957l7852n3930k04044N734J72551j7374J09179R9982p8358J52674L86
16290C53905j24832n2789m141l5721J39943r9506j71879J9449J86388j71291k04187
16279a64661K68934J0511j61681l3279N0390k1878K9477K66380J40910l3205j87194
16268A64704L6938r9799L4545j32697M4291j65768n6441J92666Q1416J00074j78626
16257B1303N6607R548l2032k18967J20798J41532k069k25577j0560R0011J00075
16246E0669L2307n3138r352J4065j74378l4220J48360k6947K13911J12653q8393
$$ y = [128639, 36164, 196007, 204113, 252146, 293071, 159166, -31960, -161412, -233958, 78987, 279199, 237164, 214707, 73418, 56578, -43932, -71806, 97949, 156746, 208107, 215188, 204957, 167105, 113175, -90869, -85135, 87416, 70042, 179221, 279203, 200845, 353519, 353905, 229073, 176284, 172143, 136422, 276365, 176859, 4980, 24429, 210817, 39526, -164661, 104273, 114784, -46897, -80176, -29786, -51664, -22187, 244193, 385103, 351898, 164704, 201642, 101843, 136388, 3691, 47982, -117786, -174227, 18439, 99855, 199929, 21303, 77910, 87458, 55426, -163541, -42743, 98789, 96720, -128857, -139417, -49406, 50669, 82976, 29838, 20486, 34551, -139827, -174047, -25687, -52634, 161277, 273930, 185537]
16235A85537k28894j70850l0320k5901L7160l9086J47838J07819p2587k1603o625
16224a17512P7367j22849J48803J62928P9070k52191r6019Q0957j06588O7840
16214g8194j29594o1089j13505j20003P1597K83373J1130k25993O1219K8247K08914
16203f3898J31879J65161J11608j39505p8171n5619k29181j33760o5683j3819
16193c70988J12564P337K6638q5267j8271O4631M4542J44483O7229K31825O5548
16182B90271j10596k33578j70213J0443j4962Q8248J81942p5200O8370o0284J3361
16171a2198J37124j38414j4428r4201l1811k0271J55465K176K716m8124p2887
16160a34853P1618R0596j11593p8113Q0988l2627L1673j02983J24434J03833L1697
$$ y = [185537, -43357, -214207, -244527, -270428, -233268, -272354, -124516, -16697, -89284, -110887, -117512, -40145, -162994, -14191, 148737, 227807, -24384, -120403, -39446, -146034, -78194, -207788, -268877, -382382, -502385, -430788, -147415, -136285, -362278, -301059, -272812, -63898, 67981, 233142, 344750, 205245, 127074, 71455, -157726, -291486, -357169, -370988, -258424, -251087, -224449, -309716, -327987, -263356, -218814, -74331, -7102, 224723, 290271, 179675, -53903, -224116, -213673, -228635, -140387, 41555, -33645, 34725, -25559, -12198, 124926, -13488, -27916, -122117, -153928, -174199, -18734, -16558, -13842, -61966, -134853, -63235, 27361, -84232, -162345, -81357, -113984, -82311, -185294, -60860, 42973, 74670]
16149G4670O5116j19737j82182j7964m3374o1666N8723J79389m2751Q4007K84741
16138B78972J18881N1510j10899J9985N9770j37479j79416K3451R0820r9044m9982
16127F6569j1999J32380j57030m1664m4963k6170P8070N6415j4386N9240k66382
16116a69920L4679J40419K7109p0284q2740K4939J59666Q6088j52730o6156K10806
16105A41876j13404k94757k11632J05428M68231K65317J7400o6526j81066k40504
16095a09637j34168O402k9612L5010j41348k2380J67320K40238R0482k8436K4849
16084I8720N7103N9034n8236k1442k14907k008K4098N5456K58757P2417L3999
16073C62991J714n3641j54140o8653n341n6069Q2646J6364m5722j5281k9902J51533
$$ y = [74670, 139786, 20049, -162133, -180097, -223471, -285137, -226414, -47025, -89776, -5769, 278972, 397853, 449363, 338464, 358449, 418219, 280740, 101324, 124775, 215595, 116551, 66569, 54570, 186950, 29920, -11744, -56707, -82877, -4807, 51608, 37222, 96462, -169920, -135241, 5178, 32287, -37997, -120737, -95798, 63868, 149956, -2774, -68930, 141876, 28472, -266285, -477917, -372489, 95742, 361059, 378459, 311933, 130867, -109637, -243805, -237403, -267015, -232005, -373353, -395733, -228413, 11825, 102307, 73871, 98720, 155823, 214857, 156621, 135179, -79728, -81736, -57638, -2182, 256575, 328992, 362991, 364705, 311064, 156924, 88271, 82930, 26861, 109507, 125871, 80149, 64868, 34966, 186499]
16061A86499k6357J29100r3032L4914J10111q1608N4948q9885o954Q3937j05443
16050A96230j07541m2212L2771k62164o6525q6317N6863R5955K75084R8601M2171
16039B32916m6763P6729o5181M8837j63772k7956j68824k31152M3943M31099M364
16028A34240j39223M167j44661q0032K47686O3857J1402N4954j26077J64690J18096
16017C09099j42297j16956J7445j53381k51924K13231J4196q3158J13792k4280
16007a04233J1702j48063o4500J06109L7044J3406J90618K0200l7932k97501M7973
15996b25177K33155k0058l9917j00231K7604J11022j6708N8169o7521r5470j3203
15985a48335O608K1325M1135k7080M0860K870P144J60497J40708o9414k05236
$$ y = [186499, 160142, 289242, 196210, 231124, 341235, 259627, 314575, 224690, 217736, 301673, 196230, 88689, 46477, 79248, -182916, -249441, -335758, -278895, -182940, 92144, 190745, 232916, 186153, 262882, 197701, 246538, 82766, 54810, -114014, -345166, -301223, 129876, 134240, -4983, -816, -145477, -225509, 22177, 86034, 97436, 152390, 26313, 191003, 309099, 166802, 49846, 67291, -86090, -338014, -124783, -110587, -193745, -79953, -104233, -92531, -240594, -305094, -198985, -161941, -148535, 42083, 62283, 24351, -273150, -225177, 7978, -12080, -51997, -152228, -124624, -13602, -30310, 27859, -39662, -135132, -148335, -141727, -120402, -79267, -106347, -65487, -62617, -55473, 105024, 245732, 176318, -28918]
15974b8918l3990J30448N2804l69312j62376J75078p757R7374j07672j64569K15496
15963b03394r3418J94929J58717q1280j7149M9997K80506q6134j02348M9761o5570
15952H4617j3047M4364j24656k32075r0371R5923L4904J79960p5445p5398K2062
15941a49162K7861K51020P0797j82933j26810L6115k1002K0704K5105K1433r6485
15930a23357p7079L9333j00064o9350Q3388L0J12470P5388j35912k32291J69081
15919b58363J10116K16811P2568j58265r7232R2582M7962k3049J04284j41181
15909c3767m4083J01718J7482j50900N0149L6866k1952j09643j57516j39230J53290
15898b97586K72727J1332j40009J23669r5737q7568M6362N9332q6994J6001K42988
$$ y = [-28918, -62908, 67540, 120344, -248968, -411344, -236266, -244023, -146649, -254321, -418890, -203394, -296812, -101883, 56834, -24446, -41595, 8402, 288908, 202774, 100426, 150187, 84617, 71570, 115934, -8722, -240797, -331168, -235245, -200341, -20381, -95826, -171224, -149162, -121301, 129719, 200516, 17583, -109227, -73112, -94114, -73410, -48305, -26872, -123357, -200436, -161103, -261167, -330517, -247129, -247099, -134629, -59241, -195153, -427444, -258363, -148247, 68564, 141132, -17133, -114365, -21783, 26179, 3130, 107414, -33767, -77850, 23868, 41350, -109550, -59401, -22535, -44487, -154130, -311646, -450876, -297586, -24859, -13527, -153536, -29867, -125604, -213172, -166810, -107478, -194472, -178471, 64517]
15887F4517K8911j15459l5805k16994N0766L07816R41r7514j38231n7923L7463
15876a71512K59417P5874j78576n6887J52488K75308J32926n8099j1830j89205
15866B29904j60333O0924P2877Q0540P529p867k4023j32862J16611O7449m9670
15855B61079k01501L9504l2652j54387m5658R420Q2608K04078J17834k42813k06299
15844a68787J8901O7233l9893r7069J43974K33677P359J1772J15008o570l8923
15833B46682k10796j55888j36725p9953K45234j05401l8555K09196k06786r6265
15823c29257K01242r511j69002J98661K04497n8381j3886K2669K3898L8656j2567
15812I7019Q7947R9902Q7126m3199k58219r1357J21704M7300j12179j34382j01536
$$ y = [64517, 93428, -22031, -57836, -274830, -224064, 83752, 84693, -12821, -151052, -208975, -171512, 87905, 163779, -14797, -71684, 80804, 356112, 489038, 430939, 419109, 229904, 69571, 130495, 203372, 283912, 291441, 283574, 259551, 126689, 243300, 310749, 261079, 59578, 99082, 66430, -87957, -133615, -124195, -41587, 162491, 280325, 37512, -168787, -149886, -82653, -122546, -219615, -75641, 158036, 165395, 177167, 292175, 285605, 246682, 35886, -120002, -256727, -336680, -91446, -196847, -235402, -26206, -232992, -329257, -128015, -137526, -306528, -107867, 96630, 38249, 24363, 47032, 70930, 109586, 97019, 184966, 284868, 371994, 328795, 70576, -20781, 100923, 148223, 36044, -98338, -199874]
15801a99874J27599J31400m1812q877m2639L952J82509K0672j69643j01434n9097
15790a57244P6762R7884R1532j43136k4742o8563K17302K18101J22072L8309k26699
15779B41578R0669j51430k62302q7836N9628O1421J98748K4662j89687O8737N9673
15768A13861l36153n9160p5052l9061K94810J89969k29766l38785j50012M2947
15758e86402O5842K82781n7393J59553J51636L5569n5264L0613n2657J15914j3991
15747G6201k04908j37266k58285j19732J12150M06090J56821J27701j15000j58251
15737a14479K52062J46428j03138j08155k26695j13455K25349J10449J00726j1355
15727A57737P2651P4494k9477j39249M9367P4263q6424l0253o0596r1944q1461
$$ y = [-199874, -72275, 59125, 17313, 8436, -34203, -30251, 152258, 172930, 3287, -98147, -157244, -80482, 17402, 108934, -34202, -58944, -127507, 89795, 307896, 429968, 468277, 241578, 332247, 180817, -81485, -169321, -109693, -48272, 150476, 175138, -14549, 54188, 113861, -222292, -281452, -356504, -395565, -100755, 89214, -140552, -479337, -629349, -586402, -520560, -237779, -295172, -135619, 16017, 51586, -3678, 26935, -25722, 90192, 76201, -128707, -265973, -524258, -643990, -531840, -125750, 31071, 158772, 43772, -114479, 137583, 284011, 180873, 72718, -153977, -267432, -42083, 68366, 169092, 157737, 230388, 304882, 275405, 136156, 185523, 259786, 173362, 143109, 82513, -9431, -90892]
15716i0892j40465J6440J44826J69479p0384O3498o2367j36298j09718P692J61199
15705d6990j850j16780m1670P1026l699j03041Q6049K9371l3680O4361K08307
15694A11404J8378p8822j127J34961M4028n1227l7655M8202j09147j17033J5278
15683b2760m2068p8256J4231O3521J10406M4445M4905r8307n8703J65390J0763
15672A53567m1387M8066R4981j16756j42762j01288J45243J00781n4989j45620
15662f0164j33845r2595P7491N8551P7220q7523K3039j2452j2368k65551K7154
15651d01043L10003K02498j64036j73764j52632j15460K06640K84860K0470j26453
15641a08917K28405j4555N2147n5957k06039J09663J05507l1208q1880l8955L2815
$$ y = [-90892, -231357, -214917, -70091, 99388, 29004, 92502, 30135, -106163, -215881, -208189, -46990, -48840, -165620, -207290, -136264, -139963, -243004, -156955, -127584, -161264, -96903, 111404, 129782, 50960, 49833, 184794, 228822, 177595, 139940, 188142, 78995, -38038, -22760, -64828, -143084, -128853, -65332, 45074, 89519, 134424, 36117, -22586, 142804, 153567, 112180, 160246, 255227, 138471, -4291, -105579, 39664, 140445, 85456, -60164, -194009, -286604, -209113, -150562, -73342, -160865, -137826, -150278, -162646, -428197, -401043, -91040, 111458, -52578, -226342, -378974, -494434, -287794, -2934, 17536, -108917, 119488, 104933, 157080, 101123, -104916, 4747, 110254, 79046, -2834, -41789, -8974]
15630h974R0561n5534J35858k2218k13481J15261J19776J10375l02538k39214
15620b70128M1834L3389R8053M3330k5399j54593M1859M8219n0681O5018J51512
15609B2413J16259p0241j32073J19152j7985k19589q9325L9674K15362p045J22513
15598I9115M0564j17087j19366n0990M3935K85069J21576j42741q2779J30697
15588B07993J1730Q3458J61196k10627k01197j20508j59505j95924M0815O8180
15578c14389m9417J69544O4510L01657J61302n1801n3355k0644m7626j13589J04188
15567A50380o9961k27947P8930J10255j29777j83441J26434N7254o2821J63980
15557A3286O8056J21258M8665J51756l1342k33298j00281k1423O1836j12382j68961
$$ y = [-8974, 81587, 26053, 161911, 139693, -73788, 41473, 161249, 271624, -30914, -270128, -228294, -194905, -96852, -53522, -78921, -233514, -191655, -143436, -194117, -129099, 22413, 138672, 68431, -63642, 55510, 37525, -182064, -271389, -231715, -16353, -23398, 99115, 139679, 22592, -96774, -147764, -103829, 181240, 302816, 160075, 77296, 207993, 219723, 303181, 464377, 253750, 52553, -67955, -227460, -423384, -382569, -314389, -363806, -194262, -129752, 171905, 333207, 281406, 228051, 207407, 159781, 46192, 150380, 80419, -147528, -68598, 41657, -88120, -271561, -145127, -87873, -150694, 13286, 81342, 202600, 251265, 403021, 371679, 138381, 38100, 16677, 78513, -33869, -202830]
15546b02830R3197R7999Q3557J73404N2815j45327j05804p7470P8006R2368R771
15535A49686j83681k98503j09657K29836R7761N792J25100O0169O7826j83714
15525c9385M140j70813J55261K03124o0582j24449j7248r1389j0915j1083J58616
15514d723L8704q6658J851j38838J78311L25903m6721j46396j16655j92624J79014
15503h832J09816o1042j22468j91745q3999J07904J1548K882O7692K4576N003
15492a38665n6531J07398j56077K61940R0869o5828n5104n5030l45k1708P4158
15481a4923j9747O9271J57647m2201p7424j60952L3025L1778J16813j9218l2823
15470D1246l203J323K8616J74545K9270p5352j30488q2715j73834J30111K32453
$$ y = [-202830, -109633, -11634, 71923, 245327, 298142, 152815, 47011, -30459, 47547, 139915, 149686, -33995, -332498, -442155, -212319, -114558, -108766, 16334, 76503, 144329, -39385, -35245, -206058, -50797, 152327, 91745, -32704, -49952, -141341, -152256, -163339, -4723, 33981, -52677, -50826, -189664, -11353, 314550, 267829, 121433, 4778, -187846, -8832, 100984, 39942, -82526, -274271, -358270, -250366, -238818, -235936, -168244, -143668, -138665, -195196, -87798, -243875, 18065, 108934, 43106, -11998, -67028, -67373, -89081, -14923, -34670, 34601, 192248, 150047, 72623, -88329, -55304, -23526, 93287, 74069, 41246, 38043, 39366, 67982, 242527, 271797, 196445, 65957, -16758, -190592, -60481, 171972]
15459A71972j0230q3231Q4804K718l5724l1009l24037M72J65985J33399O5700
15448A40819Q1295O3981q8184l1506j40412r8884K7323m7795Q1519K521j68510
15437a77833k04180J0524L9478J77660j21850p0951J43413J3096p5466J7056J35422
15426a13631J69821j33219O4284m0450j0175Q7716k7582p9324J42867j05206k68115
15415c13014n4817L8886L7178K4099k21266n9842K55726L72047l0952j6386J42529
15404A74188N1483j24055l03695j35698J33501J89661n4377l1443J34320j61475
15394a27590j3O0891J02632q0082J38338P9814j50465L4258j58069k3866O7168
15383e6984J42820p7020j91513r4775j5660P5794m0441j62128J64306J36180K99403
$$ y = [171972, 161742, 78511, 163315, 166033, 130309, 99300, -224737, -224265, -58280, 75119, 140819, 222114, 286095, 197911, 166405, 25993, -72891, -45568, -93363, -11844, -9323, -177833, -382013, -371489, -332011, -154351, -276201, -347152, -203739, -190643, -266109, -249053, -113631, 56190, -77029, -12745, -53195, -63370, 24346, -3236, -82560, 60307, -44899, -313014, -367831, -328945, -291767, -267668, -488934, -548776, -293050, 78997, 48045, 31659, 174188, 225671, 101616, -202079, -337777, -204276, -14615, -68992, -100435, 33885, -127590, -127603, -66712, 35920, -44162, 94176, 173990, 23525, 57783, -100286, -124152, -56984, 85836, 8816, -182697, -277472, -293132, -217338, -257779, -419907, -255601, -119421, 179982]
15372A79982q487j39367n9817j2144k4662J29024J54785j66632k62741M7586O3676
15361i8797N5648K10722O526J33114J63424l5023J6094j86520k00578j17170r3671
15350a46231J22169R3742J08812K03253o2676j78621M3806j23261j75517o9990
15340a84514J57439K35706j98177j91570M7944N7920Q9851N7748q2892k53139
15330b63684K2059J53804L30826Q4338m2641l04969o3810q1569J78197J85798
15320A98349j59599r0523l09981J31596L48062K5451n0346J34580Q7751q6961
15310B28379j08967N9861n4115m7764p4782J56722L2593K7046k43644N6598J06446
15299A38373k56455j13797j961l9696L204K5577J10459M3361m6960j29917R3064
$$ y = [179982, 171495, 32128, -27689, -39833, -64495, 64529, 219314, 52682, -210059, -162473, -98797, -43149, 167573, 174099, 307213, 470637, 435614, 451708, 265188, 64610, -52560, -146231, -24062, 69680, 178492, 381745, 319069, 140448, 184254, 60993, -114524, -184514, -27075, 208631, 10454, -181116, -133172, -75252, 14599, 72347, -10545, -263684, -241625, -87821, 243005, 327343, 284702, -20267, -84077, -165646, 12551, 198349, 38750, -51773, -361754, -230158, 117904, 143355, 93009, 227589, 315340, 228379, 119412, 179273, 125158, 77394, 2612, 159334, 191927, 218973, -24671, 31927, 138373, -118082, -231879, -233840, -273536, -270332, -244755, -134296, -90935, -137895, -267812, -174748]
15288a74748K27201j656j66414p0319j51403j03751K44256K09731J80989j2922
15278A80964k43839o3863p3016J9873K09200k45832p9319q6404J73505K32667
15268B3936k9128j49980r5300J9785R7235J53150K6772L942j07074Q7687J09541
15257A40566q3024j64886k41292O5850L03038r7475j12793J4287j24296M6538
15247b53487k4673m3639R5026J05642Q6668m2411P4844J00075r8529k79249R109
15236b70624m5756n0196M17557j89016j00657q190k7792J74086J40004k5402Q5736
15225I9750p4026o4034J117K9532K62156j35937l8844J32338K37275j44683l94982
15214i0338j31324k5500J16050K23879J55913M598k39704m1168J2468j51048N8373
$$ y = [-174748, 52453, 50797, -115617, -185936, -337339, -441090, -196834, 12897, 193886, 180964, -62875, -126738, -199754, -179881, 29319, -216513, -295832, -382236, -208731, 23936, -5192, -155172, -250472, -230687, -133452, 19698, 46470, 50412, -56662, 31025, 140566, 57542, -107344, -348636, -282786, 20252, -77223, -190016, -175729, -300025, -253487, -278160, -321799, -226773, -121131, -34463, -76874, -2030, 98045, -484, -279733, -270624, -316380, -366576, 50981, -138035, -238692, -246882, -274674, -100588, 39416, 14014, 99750, 25724, -38310, -37193, -7661, 254495, 118558, 79714, 212052, 449327, 304644, -90338, -221662, -247162, -131112, 92767, 248680, 253278, 13574, -27594, -15126, -166174, -107801]
15203a07801J51822J02335J33116j61558m29671r6636J30383J16600l6882n8939
15193b57231j3985K3695K7727K1122J68258p1760j81539P268J56434K14376J36850
15182B31215l6399q5190j0550J60542J91405k1591p7123j91179n7234p2334J24502
15171A56064r2602J0235J72301q6301J3712R7539P5950J3901M5726j08780j97436
15160A00309j10466K6280J0468q469K14408Q7085j89566n9542j84307m0619j5748
15149a70167m8124J92344N0519j44602k9261J11713O7896j94253l26844J12688
15139c78091P6756p7427K3081J81168j528p9392m9203K3959J18124K17407j01453
15128d6599p9837M4769r8439L4306R5447o5138l16155j6356m5964o928K05254
$$ y = [-107801, 44021, 146356, 279472, 117914, -311757, -408393, -278010, -161410, -198292, -257231, -271216, -247521, -219794, -198672, -30414, -102174, -283713, -276445, -120011, 94365, 231215, 194816, 109626, 99076, 259618, 451023, 429432, 352309, 161130, 103896, 31562, 156064, 63462, 73697, 245998, 159697, 173409, 270948, 346898, 360799, 406525, 297745, 100309, -10157, 16123, 26591, 18122, 232530, 319615, 130049, 70507, -113800, -154419, -170167, -218291, -25947, 24572, -120030, -149291, -37578, 30318, -163935, -490779, -378091, -301335, -378762, -355681, -174513, -176041, -255433, -304636, -280677, -162553, 54854, -46599, -126436, -81667, -180106, -145800, -50353, -115491, -431646, -448002, -493966, -500894, -295640]
15117b95640K51278P7338o5571k63376K01975J70872J7323L5701J20303k00919
15107D9284O809J28182l1152m3263j24922m8935j70207j4618L5330L1647J09419
15096g2426J39721l6167k61402j61337L003Q24J62279J88005k3870N4892j6427
15085b2905J75177K4307k27145j92893J37442N3270J2276N5237N3029J42587J19917
15074C30299J0990K11472j42572j63096o9790Q2357j7370l06437j11409J14492
15064f1064k32q9945j58792l3315Q0912R6140J07892K03825r3501j24769o0756
15053a33605q5004k3341J90705R6495j02129j42346J6319j5341J146M1691j49133
15042c04543J04995J15687l2807J69108p832j29675J1459n0092k1519p783J07977
$$ y = [-295640, -44362, 32976, -32595, -295971, -93996, 76876, 94199, 129900, 250203, 49284, 56093, 184275, 153123, 109860, -15062, -63997, -234204, -248822, -213492, -181845, -72426, 67295, 31128, -230274, -391611, -388608, -387784, -225505, -37500, -61370, -6478, -22905, 152272, 176579, -50566, -243459, -106017, -52747, -40471, 14766, 67795, 210382, 330299, 341289, 552761, 410189, 247093, 177303, 259660, 242290, -64147, -175556, -61064, -61296, -151241, -310033, -343348, -262436, -166296, -58404, 145421, 51920, -72849, -133605, -218609, -241950, -51245, 45250, -56879, -199225, -182906, -198247, -197101, -155410, -304543, -199548, -83861, -116668, 52440, 44608, -85067, -73608, -123700, -145219, -153002, -45025]
15031d5025P0514K8910K71329j5126j92700p359j31849k19377j79535R2339O1221
15020b66658R9657M4329K1383O6298K095J687l8079J49471k9504K6790J32241
15009B09710k2094J2480k60739j90316J2592O4391Q3992n846J33688l6146j69035
14998a67323R222M8265k5121K07649l0997k0121j7845j7247M6723n8393J60601
14987A35413m1647j03603M231J30525M1168k76433m9796J6951m9688r3400j13905
14976d00184J77980k7968j10074n1628K18281k659R2967O4328Q7924o535m9119
14965f687j39814j8055N0641o801j55840k3551K26511K8595r2375p537M4866J10250
14953A0203q9425j62398j46464J94L7571M2771J76335J23034R7465R8788k29637
$$ y = [-45025, 25489, 54399, 325728, 310602, 117902, 110543, -21306, -240683, -420218, -327879, -266658, -167001, -122672, -101289, -34991, -32896, -31209, -69288, 80183, 50679, 77469, 209710, 187616, 200096, -60643, -250959, -238367, -173976, -89984, -95830, 37858, 1712, -167323, -158101, -109836, -134957, 72692, 41695, 21574, 3729, -13518, 33205, -25188, 135413, 93766, -9837, -5606, 124919, 166087, -110346, -160142, -143191, -192879, -286279, -400184, -222204, -250172, -360246, -411874, -193593, -196252, -103285, -38957, 48967, 42432, -6687, -146501, -164556, -113915, -120716, -276556, -300107, -73596, -45001, -137376, -144913, -100047, 10203, -79222, -241620, -388084, -387890, -350319, -307548, -131213, -8179, 89286, 188074, -41563]
14942d1563o3102n9245O6863N8517o8645P1244K24440j74976k69313N3652P8297
14931a23831k00081J91023L61226m4629M1423j05412j28769o4667K70470O6774
14921B63527j13230J4039j15284n9033n316j15125O6640m0368j05838J51061J93764
14910A34837k27708k60133K30553Q7147J03100O458n9409p9972R7057j60042k64299
14899c92411p0270k7188Q6899l4724J96202K03250j9004J19146J99057o6745l6290
14888A57922R966j13354j8979j3283j28919k168J03097J33830j18311l23607L8194
14877b75612N7674J31860L19613J04757j70523P6043J46874j08737q6256L2498
14867B28191j27122j16804Q0354J43636N2864J66349K5390m2071j57895k28022
$$ y = [-41563, -104665, -163910, -97047, -38530, -107175, -35931, 188509, 13533, -255780, -202128, -123831, -323912, -132889, 228337, 183708, 225131, 119719, -9050, -73717, 196753, 263527, 150297, 164336, 49052, -9981, -15297, -130422, -63782, -104150, -209988, -58927, 134837, -92871, -353004, -122451, -35304, 67796, 74254, 14845, -65127, 31930, -128112, -392411, -462681, -489869, -402970, -437694, -241492, -38242, -57246, 61900, 260957, 194212, 157922, 167888, 54534, 35555, 22272, -106647, -108815, -5718, 128112, 9801, -313806, -275612, -217938, -86078, 233535, 338292, 167769, 243812, 390686, 281949, 195693, 228191, 101069, -15735, 64619, 208255, 261119, 427468, 452858, 410787, 252892, 24870]
14857B4870j60693l5922J5761j28165l1704J00557J41412N1388r945q7978j25289
14846b45708o0750J80196J80338j36912k8938J43193m8157k37122q5724P9900
14836b59684j2916j023K29995L3896J31304J96642j55462j72341J09934n5291
14826D5054j77859p331r834M1322N9850K3209k12978k02020J785q0589J03657
14815d15734P5543Q2351K87268n1733K6528K22963j50197q7116p616M8533J00015
14804A30805Q5419k3966J13993q4507N9021N2588o2977j62907r0794j03306Q3611
14793c020n6640o9305q3016n8931Q4990J35740p3783j32518K47595K07329L2375
14782B30816n4247j47332j5889K9674L3143j70433j45213J74920K70952j08482
$$ y = [24870, -135823, -171745, -155984, -284149, -315853, -215296, -73884, -22496, -32441, -120419, -245708, -306458, -126262, 54076, -82836, -111774, 31419, -16738, -253860, -339584, -259684, -272600, -273623, -43628, -9732, 121572, 318214, 162752, -9589, 100345, 45054, -132805, -140136, -149970, -108648, -48798, -25589, -238567, -440587, -438802, -519391, -415734, -340191, -257840, 29428, -22305, 4223, 227186, 76989, -10127, -17743, 30790, 130805, 216224, 192258, 306251, 221744, 280765, 333353, 270376, 107469, 16675, -86631, -3020, -59660, -128965, -211981, -270912, -185922, -50182, -123965, -256483, -8888, 198441, 230816, 176569, 29237, 13348, 43022, 76165, -94268, -239481, -64561, 206391, 97909]
14772I7909k00282j19357l7904J31697J79511j7481j0428k14946K05799K14635
14762B29153K6947j35492p3251j68429Q719J65871K67792Q8209j7503J07888l7684
14751D62220j47118k78468m9828J04870j7893L6821j8991j31229J08490K0680
14741H9554j10105j20220o7166J68682J53609N8834l4188J84512k808n0489J05515
14730C75730n9755j91677m2456J69745R6841q4251j58697q8673M7891O1020J4318
14719A40036K10752K11119Q7764L22340K02187K00206M10636L48752K61447K41082
14709B636321K27878k1608r5205m39650m94242n16123m41750l47457k57293k34520
14699A6351k3379P8455J49953K0681k8882q92J8421J34812J86921j08993j28662
$$ y = [97909, -102373, -221730, -259634, -127937, 51574, 34093, 23665, -191281, 14518, 229153, 256100, 120608, 47357, -121072, -112353, 53518, 321310, 409519, 392016, 499904, 462220, 315102, 36634, -13194, 91676, 73783, 110604, 91613, -39616, 68874, 89554, -20551, -140771, -207937, -39255, 114354, 173188, 139000, 323512, 320704, 270215, 375730, 315975, 124298, 81842, 251587, 348428, 264177, 105480, 16807, 64698, 125718, 140036, 350788, 561907, 649671, 972011, 1174198, 1374404, 1785040, 2133792, 2395239, 2636321, 2864199, 2842591, 2747386, 2307736, 1813494, 1297371, 855621, 508164, 250871, 16351, -7028, 71427, 221380, 242061, 213179, 212287, 230708, 365520, 552441, 443448, 314786]
14688C14786k73681N6505J28906j611j08464j39436k71375k15560J56156P9700
14678b74074J9628K29555o5833J1240n3259K61369J10647J09316L4990l6472j75319
14667A71788j71737L0345N9792p0318k5807J17435P4875o9137M1042M1528j88113
14656A1693K6483m2258l6346J98766J19431L0512k99714j15546J07670R5669q0807
14645A5553j9633J14575r6364Q1858j02188j18151n5538k53370J38693L0367Q947
14634b55251j21661m6890R8706K78578J50689P4483m6457k2447J73Q2498M3152
14623B35573q9471M0876M3585k19963k76016J98330k8735K7544P5700J09976K1261
14612A38660j37883j86167j3247M2153k8462J59553Q9304J51370J54472J9158
$$ y = [314786, 41105, 97610, 226516, 224905, 116441, -22995, -294370, -509930, -353774, -274074, -254446, -24891, -90724, -79484, -132743, 128626, 239273, 348589, 383579, 347107, 171788, 51, 30396, 90188, 19870, -5937, 111498, 186373, 117236, 158278, 199806, 11693, 38176, -4082, -40428, 158338, 277769, 308281, 8567, -106979, 691, 96360, 15553, -4080, 110495, 14131, 95989, -6199, -124350, -179888, -433258, -294565, -264198, -255251, -376912, -423802, -325096, -46518, 104171, 178654, 132197, 109750, 109923, 192421, 235573, 146102, 186978, 230563, 10600, -265416, -67086, -95821, -68277, 7423, 117399, 138660, 777, -185390, -198637, -156484, -184946, -25393, 63911, 215281, 369753, 388911]
14602C88911r8902l03915r3589J98375K9200K3714q289j11968J44313k5761j0990
14591A31099p7719j11104R6253L15467J4971n9186j14606K972L2531m0786m0221
14580A49671K8808O4481P7063k44475o2300j219K8J14525J46966j29367r1209
14569E2972M8215P9832j67806p907P2559M3298J50503l9176k57055j08310J69500
14558C6625J96568K5704j60100n1434o2811j24049k3301K01675j60906n0066J24832
14547d7263J32337K0392j71346M5240K52393K511j19900k37374l004J01332j45241
14536a69923k7448J49343l5000l2259L7132p9613k3478r7099r626K67451M1581
14525B1061J0896j65787j5025q0833j00761K45611J56190l216O0128M6658P1503
$$ y = [388911, 290009, -13906, -107495, 90880, 120080, 143794, 135505, 23537, 167850, 142089, 131099, 53380, -57724, 38529, 353996, 368967, 309781, 195175, 198147, 230678, 189892, 149671, 178479, 242960, 320023, 75548, 13248, 12029, 12057, 126582, 273548, 144181, 52972, 101187, 181019, 13213, 5306, 77865, 121163, 271666, 232490, -24565, -132875, 36625, 233193, 258897, 98797, 47363, -15448, -139497, -162798, 38877, -122029, -172095, -47263, 85074, 105466, -65880, -20640, 231753, 234264, 114364, -123010, -126014, -24682, -169923, -197371, -48028, -83028, -115287, -78155, -157768, -181246, -278345, -287971, -20520, 21061, 31957, -133830, -148855, -229688, -330449, -84838, 71352, 68136, 128264, 174922, 246425]
14514B46425p9691o5940q2413J8883M3197P2343J03977N0559O8642l9768k17206
14503A19008L5342j32577K83046J67119j75461m0528j59119r3296o145J27386
14493A24775J6004O688K0380K8188j50006j89281O8835L22198J39446j17561j42560
14482A27106j61751k9275K3316N0757k43704p899K30067j0020j01417J37538l4650
14471a9932o0313j9740k3605m0502q9448Q0277K78667J79632k21480j87682o9926
14460a94052l3897o1114l7236l3621r3963j6049J58260L07379J16146j25500r6046
14449a09693N6193r3980j35722O0404M0320P1507N1832n5467r5494K475K73991
14438F6366K62694k2386k15686o4528K8089j5095O1239r9181L7430K6719L8041
$$ y = [246425, 166734, 100794, 18381, 37264, 80461, 152804, 256781, 307340, 375982, 336214, 119008, 154350, 21773, 304819, 471938, 296477, 255949, 96830, 3534, -2611, 124775, 140779, 147467, 167847, 196035, 46029, -143252, -74417, 247781, 387227, 269666, 127106, -34645, -63920, -40604, 10153, -233551, -241450, -11383, -21403, -122820, 14718, -19932, -80245, -99985, -123590, -164092, -253540, -173263, 105404, 285036, 63556, -124126, -194052, -227949, -289063, -326299, -359920, -453883, -469932, -311672, -4293, 111853, -13647, -109693, -53500, -147480, -283202, -222798, -182478, -110971, -59139, -114606, -210100, -207625, 66366, 329060, 306674, 90988, 26460, 54549, 39454, 100693, 1512, 38942, 65661, 103702]
14427A03702M6418k12018M4929J07730k5035r4387k98292L5819n9355K04208K3337
14416a22944k1672J73393K88664K55940k7252k38126r441J32420J2738k9367k07760
14405B06593j08146L6306R9568K10879p3564Q5470k11000j33949J45621J45271
14395D03049Q262j92697k45186j7725j7615m3645p2694j52930k04382J01408K49706
14384a84449J1614k0890j5646J25686K50716M8074l8499l99489L102J83622J31014
14373I4855L33262K4652R120j59480m2825k8949l37914J4268J26349k412O5999
14362I6925J49690k27105k7059N3456o0104K2435Q6237N9063j66056m5662J99082
14351A40902J62946K6322j11614k74113j81283l3686K05998J20178j95573O6296
$$ y = [103702, 150120, -61898, -16969, 90761, 65726, -28661, -326953, -291134, -350489, -146281, -122944, -144616, 28777, 317441, 573381, 546129, 308003, 298562, 430982, 443720, 414353, 206593, 98447, 134753, 234321, 445200, 371636, 457106, 246106, 112157, 257778, 403049, 411311, 218614, -26572, -44297, -61912, -105557, -178251, -331181, -535563, -434155, -184449, -172835, -193725, -209371, -83685, 167031, 215105, 176606, -222883, -219781, -36159, 94855, 428117, 452769, 461889, 302409, 259584, 230635, -107279, -93011, 33338, 30926, 96925, 246615, 19510, -7549, 45907, -14197, 8238, 94475, 153538, -12518, -58180, 140902, 303848, 330170, 218556, -55557, -236840, -270526, -64528, 55650, -139923, -73627]
14341g3627K4o3851J62993K00560Q0405P106j73045k25284J04275K30476Q9939
14330C39971m4923k80181k32700J79773K17126P1900N3367j27676R5298m0326
14320B31629k04201O9019K15523L386j63678k19828Q6761J63233K03573j3677
14310C71740k95741n0655P8043k06322l16865L6909J08247K51436Q5802o3426
14300h32k16591p4928J88902k4738q3281O7570K16146J25598k69225q0134p204
14289a58717K6461M6600R5365J03973j32145J35765l8087K7969L1387o2899j28501
14278e2829k12922j80241J73582J29169j20277l974K32152K23575n5553j68138
14268c5456O883J69550R5863j00525k35274J88886k71915j25409J25364O1599
$$ y = [-73627, -73603, -137454, 25539, 226099, 306504, 313610, 140565, -84719, 19556, 250032, 339971, 295048, 14867, -217833, -38060, 179066, 250966, 304333, 176657, 271955, 231629, 27428, 96447, 311970, 315356, 151678, -68150, 18611, 181844, 385417, 371740, 75999, 25344, 103387, -102935, -419800, -382891, -274644, -23208, 62594, -832, -217423, -292351, -103449, -128187, -211468, -143898, 72248, 197846, -71379, -151513, -158717, -132256, -85656, 9709, 113682, -18463, 117302, 79215, 107184, 138571, 75672, -52829, -265751, -445992, -272410, -143241, -263518, -267492, -35340, 188235, 132682, -35456, -28573, 140977, 236840, 136315, -98959, 89927, -181988, -307397, -182033, -120434]
14258a20434K28787r864j59206j39901J13190L2021j96463O5459K15001M955j05336
14247g1791m8461Q2283J52364j73289k795L3831N8122k2314J30713m0264j54160
14236e5761l3930L6491j88044j66949m5704J36058L40572K9845j39788J4289j1467
14225h4388j27181J7311l7090l4394j58243P2329K49217J76986j3928r6753M7279
14214A1145l5484j32559k79108J5840O1375J4369J45082L40197K9552N59j46647
14203B4321J09066L3544l5765j65187j7732j76228k20193J0125K89612J73942
14193B5505m9391K56770K5311o7017j04797j19544j43451L2124K6511j63485j88665
14182d70129K93499J41979j8543K0532n4787N3573N8807r8652N8695O5718o6691
$$ y = [-120434, 108353, 98489, -60717, -200618, -87428, -55407, -251870, -186411, 28590, 33545, -71791, -120252, -37969, 114395, -58894, -61689, -27858, 30264, 7950, 138663, 98399, -55761, -89691, -53200, -241244, -408193, -453897, -317839, 22733, 52578, -87210, -72921, -84388, -211569, -194258, -231348, -265742, -423985, -351656, -102439, 74547, 60619, -36134, 11145, -24339, -156898, -436006, -420166, -358791, -344422, -199340, 140857, 170409, 170968, 24321, 133387, 166931, 131166, -34021, -51753, -227981, -448174, -438049, -148437, 25505, -23886, 232884, 258195, 191178, 86381, -33163, -176614, -144490, -117979, -281464, -470129, -176630, -34651, -53194, -32662, -87449, -33876, 24931, -73721, -15026, 50692, -15999]
14171a5999J28552P6266j4482J1572j30780j23279L1791k27124n4838P8854J42908
14160i6559J8335j36255Q2525J18539j04310J72707N1112J8303p4589O0722j5774
14149I4756l6839o3208j4731J58969M0314l2955J71473L6485j10643L0772N5392
14138C29785j25709K8987j58441R2113j46407l0324O9272J56843M3150j54270
14128A04999j71622M641k5440N1319N7193Q7168j02536k6012p9784j38993p2568
14117c11635r1163J65212K1533p6481J91506l127K5237O8328j9997q9825r2863
14106b13275l7305M9778Q1210P1134n8510L720J64582m3072K3729K50483P3991
14095C66465P9990j26452k05417p7393J30913K2908J3262P7700j55299R2570M8035
$$ y = [-15999, 112553, 188819, 174337, 185909, 55129, -68150, -36359, -263483, -318321, -239467, -96559, -78224, -214479, -131954, -13415, -117725, 54982, 106094, 124397, 49808, 110530, 94756, 57917, -5291, -20022, 138947, 179261, 146306, 317779, 354264, 243621, 274393, 329785, 204076, 233063, 74622, 166735, 20328, -9996, 59276, 216119, 259269, 104999, -66623, -61982, -87422, -36103, 21090, 108258, 5722, -20290, -100074, -239067, -311635, -402798, -237586, -216053, -292534, -101028, -104155, -78918, -10590, -30587, -120412, -213275, -250580, -200802, -119592, -48458, -106968, -103248, 61334, 18262, 41991, 292474, 366465, 446455, 320003, 114586, 37193, 168106, 191014, 204276, 281976, 126677, 219247, 267282]
14084B67282j27851j41181L7647p6611j75898N2426K63788J24817J75295j57680
14074B42034l03663j65856J27677M1584m0637j48985n5138K1935L6503J69499
14064g5047J73078K5660k09324J3569K52101J94851r4222L6538N7256j08938K5026
14053B90548j12930j83332K8981K63238j2984k60481J1705j20084J98992R7175
14043B00828k19422j20752k1671J15994Q4761L11106k1234k10639k75442p827
14033a64298J49282j25305J45499q0314j60996l7083q1806J00213K5057J5018
14023b14733Q24R4042O9428l1767j21574L3918J72157l810k27258m2794M3629
14012b27938J44530L2022Q7741j25274j5161l7948j41893R340j4630Q5876L1222
$$ y = [267282, 139431, -1750, 35897, -40714, -216612, -164186, 99602, 224419, 399714, 242034, -61629, -227485, -99808, -58224, -98861, -247846, -302984, -281049, -244546, -75047, 98031, 123691, -85633, -72064, 180037, 374888, 280666, 317204, 374460, 265522, 290548, 177618, -5714, 23267, 286505, 273521, 13040, 24745, -95339, 103653, 200828, -18594, -139346, -161017, -45023, 39738, 350844, 329610, 118971, -156471, -164298, -15016, -140321, 5178, -75136, -236132, -273215, -355021, -254808, -229751, -214733, -213909, -119867, -50439, -82206, -203780, -169862, 2295, -1515, -228773, -271567, -227938, -83408, -51386, 36355, -88919, -104080, -142028, -283921, -274581, -289211, -203335, -172113]
14001a72113l6231j65286j19943k5170M7773L0123J99774J79620O1552J85944
13991A86043J3947l92697j9280K30401J18468k9839j899j76666k93298J73190
13981a91630K12172r7386n2887J50133R9849q8178k876P2082j3301j60890J07158
13970C4246j6943K7333M867j24372O4183r5650n4018n4777k7942L2753J58772
13959e1548N6759k3705j863J16757L8690l3567k9734j07257o3378j12965Q7358
13948a24453O261k41242J2075J12871J79040J84546j23608L4535r5704j38556
13938a94235M32010K03483m7126j42988j76101O3305k0174j90195J14370j09779
13928f7430l852q4870J7706j93598J30946K4667p139J50034J1799j00445J31622
$$ y = [-172113, -208344, -373630, -493573, -518743, -470970, -440847, -241073, -61453, 99, 186043, 199990, -192707, -211987, 18414, 136882, 107043, 105144, -71522, -364820, -191630, 20542, -76844, -129731, 20402, 120251, 32073, 29197, 101279, 87978, -72912, 34246, 17303, 44636, 49503, -74869, -10686, -106336, -160354, -215131, -243073, -210320, -51548, 5211, -18494, -20357, 96400, 135090, 101523, 71789, -35468, -98846, -211811, -124453, -118192, -359434, -347359, -234488, -55448, 129098, 5490, 40025, -55679, -194235, 237775, 441258, 394132, 251144, 75043, 138348, 118174, -72021, 42349, -67430, -71282, -156152, -138446, -332044, -201098, -176431, -183570, -33536, -21737, -122182, 9440]
13917I440N2297j36326K27618J72746m7932j0904j02356J684R8267N7934m1360
13906B81108q6318k09167j60J41096o9466m3271M4144k07081q0601J33280J9602
13895g6834J8153R1560j10081j03334l11454J02055L67592J58936J98395J58860
13885D93848j84072l07007J54138K51978L4314j72399p1417j8656j50472m1567
13875a1312J9793M4470k05404k00913K65290K40161j47296j70561Q7067K92L5177
13864d3236P6495R626K3158j03712R9697Q8907j82662j32729J34734J95003j87919
13853b2638j92647N1902J01075n837k8703K5601J25191L6548j5164P1910o3939
13842H3299J7501J11811N5442n6190k68017j11907O3125J12078n8588J36496j01256
$$ y = [9440, 61737, -74589, 153029, 325775, 277843, 266939, 164583, 166267, 264534, 322468, 281108, 194790, -14377, -14537, 126559, 57093, 13822, 57966, -149115, -229716, -96436, -76834, -58681, 32879, -77202, -180536, -491990, -389935, -22343, 136593, 334988, 493848, 309776, 2769, 156907, 408885, 443199, 270800, 199383, 180727, 30255, -11312, 8481, 52951, -152453, -353366, -88076, 152085, 4789, -165772, -78705, -78413, -43236, 33259, 42885, 66043, -37669, 62028, 150935, -31727, -164456, -29722, 165281, -22638, -215285, -163383, -62308, -68145, -96848, -71247, 53944, 90492, 75328, 147238, 83299, 100800, 212611, 268053, 211863, -56154, -168061, -104936, 7142, -51446, 85050, -16206]
13831a6206k38686j65407O3733L6721j0337J46990K86182q8121j19814K2838n1034
13820a33141J17643j5775p1089j77265J26580J57802k29071J23767J04790n7550
13810e3309R4018r4262J16520K5127l9983J13503Q6134j89326k39007J94688R5147
13799A09250l4202o0515M5490l9879m504J38038j56286l2936M1141j10263o374
13788a11040J1759N3023M111n9802O1052M3722J15135K4518j01352n1102J04030
13777I4054J15503K1558R0907n0725j55444j2690j08630l9843K579K67499J64539
13766C89307j04605l58473j74854P3173K35344K28562j74783k85819m8715J06107
13756a14756J63426J86869j3314O2303j47312j19368k45609M5043j7630n356R1628
$$ y = [-16206, -254892, -420299, -356566, -319845, -330182, -183192, 102990, 14869, -104945, -82107, -133141, -15498, -31273, -102362, -279627, -153047, 4755, -224316, -100549, 4241, -53309, 40709, -53553, 62967, 88094, 48111, 161614, 247748, 58422, -180585, 14103, 109250, 75048, 14533, 60023, 20144, 15640, 153678, -2608, -35544, 5597, -104666, -111040, -99281, -46258, -42147, -101949, -40897, 2825, 117960, 142478, 41126, -9976, 94054, 209557, 231115, 322022, 271297, 115853, 103163, -5467, -45310, -42731, 224768, 389307, 284702, -73771, -248625, -175452, 59892, 288454, 113671, -172148, -220863, -114756, 48670, 235539, 222225, 284528, 137216, 17848, -227761, -182718, -200348, -205704, -114076]
13745a14076N4813J47147J67662O3228j04569k97466j38455j58833P9829m7096
13735c47816J59554K272J37015M1893k87320j84669O6768K35018J6766R6151Q2298
13724A7930O1532m4487k7017K04730J21851R5645O0497q4385p5145l2786o0874
13713B37491L7337j89471j35219r8856q034N1113J19573j25975R4494r9610R2923
13702b4234K56405j14429k27948j13592k3775J98850K78190J22290q0294j49036
13692A22427Q1245j9398O6328j08589j1292q7835k02399J79697K19776J9969n9121
13681B00808l627J1669P9912J34147k47493j34836N9482N8050m9192p6551o8893
13670c6524J55510K13105l2869P9356K2825n9386m8482j63652j11864k0504n1988
$$ y = [-114076, -59263, 87884, 255546, 318774, 214205, -83261, -221716, -380549, -300720, -347816, -188262, -185990, -48975, -7082, -294402, -479071, -412303, -177285, -160519, -64368, 17930, 79462, 34975, 7958, 212688, 334539, 430184, 490681, 406296, 331151, 298365, 237491, 274828, 85357, -49862, -148718, -156752, -105639, 13934, -112041, -17547, -117157, -24234, 232171, 117742, -110206, -223798, -247573, -48723, 229467, 351757, 271463, 122427, 203672, 184274, 250602, 142013, 130721, 42886, -159513, 20184, 239960, 259929, 200808, 197181, 208850, 288762, 422909, 175416, 40580, 100062, 158112, 108920, 32369, -36524, 118986, 332091, 299222, 378578, 401403, 342017, 293535, 129883, 18019, -2485, -54473]
13659e4473J364J0142O0392N7872Q7606J09612o9306q8810o342k34891k43987
13648c70821N1987J66767L5132J07403m3106Q4376j07002J01891K22326J65492
13638D14445j45042p9372Q6167M4596K0922m9417q2416K0359O6299j65809j25158
13627E574N6085P639J6185L12699J16378J46666J82586N1578j68174j93922j31366
13616D01928j87076r1993m7731r9733j59948J90731J69606k00553k14908l4118
13606b73795R7823L868k19396O0026J44136O9760m7665p7299N178J88725J33916
13595H5277j21569j33134J85983J26435j7283j42817m3434K15812p7658M3432
13585A21044J62172K35041k47348l62934J6629J66471J62112K47673L92673J72460
$$ y = [-54473, -53109, -42967, 17425, 75297, 162903, 272515, 203209, 114399, 108057, -126834, -370821, -318834, -152067, -116935, -9532, -52638, 31738, -75264, 26627, 248953, 414445, 269403, 190031, 276198, 320794, 341716, 292299, 209883, 230242, 296541, 130732, 5574, 61659, 69298, 85483, 398182, 514560, 661226, 843812, 895390, 727216, 533294, 401928, 214852, 122859, 75128, -24605, -184553, 6178, 175784, -24769, -239677, -273795, -175972, -172104, -391500, -331474, -187338, -117578, -165243, -242542, -237364, -48639, 85277, -36292, -169426, 16557, 142992, 125709, -17108, -60542, 155270, 77612, 121044, 283216, 518257, 270909, -92025, -75396, 91075, 253187, 500860, 893533, 1065993]
13575A065993j67602k11442n5323j26253J48021n544j84109j53077r210n1858
13565B49596k61406o2595K18604K88411j46065l58454R1889M4389p110J1755M8925
13554A17939n0438k42126J05248K34737J41679l9947p4194Q5034r0241K47103
13544D34794J74994r0035l0733M0435K07865m0425j43399L933j47334O432j03034
13533C13493K38224K87786m5685j5484q2194k2406j3239j32545k29017r9150K39643
13522D39426J3774k36280n1550k39180j64833m3384k9087J26294R9811P5896N3190
13511D4077R1785q1995K04354p0569k45918J92981J74734j37606j24278k6239
13501B1326j35679M2631j2677j28439J0617L6971M1122l906M0051j0667k22263
$$ y = [1065993, 898391, 686949, 631626, 505373, 653394, 647850, 463741, 310664, 301454, 249596, -11810, -74405, 144199, 432610, 286545, -71909, 19980, 64369, 57259, 69014, 117939, 67501, -174625, -69377, 165360, 307039, 267092, 192898, 277932, 187691, 434794, 609788, 519753, 489020, 529455, 737320, 696895, 553496, 557429, 410095, 416527, 313493, 551717, 839503, 793818, 778334, 696140, 673734, 660495, 527950, 298933, 199783, 439426, 453200, 216920, 165370, -73810, -238643, -282027, -311114, -184820, -85009, -9113, 44077, 135862, 53867, 258221, 187652, -58266, 134715, 309449, 171843, 47565, 21326, -114353, -71722, -84399, -212838, -202221, -165250, -124128, -128034, -87983, -98650, -320913]
13490c20913q8080J59610l4628l9894n0771J13305K15889J72086k1394l6901k38127
13479a69818k1744K56775J34801J13210J48085j80529q4009L1802K1568M6297
13469B96438N4298r4124k15664l3191K9966J71216J29767j10746J09535n1921
13459B85574k8071k3468r8791M6251J02743Q2494K1096n4595n5639j1087P5596
13448C42103R541K9752j73315K08587j25620k91299l5279J62919N341j10221j42989
13437a20480j31893N3851J39018J81229m117k1012q1180K11415J65548j08723
13427B83656J56938m0559j57176k07656k67582j86616J04236J24312J68239M1971
13417A9763J14885q7877j22496Q4771m4498R9275J02423M1999j14168j45195j06562
$$ y = [-320913, -408993, -249383, -284011, -323905, -374676, -261371, -45482, 126604, 105210, 68309, -169818, -191562, 65213, 200014, 313224, 461309, 280780, 196771, 228573, 250141, 296438, 350736, 256612, 40948, 7757, 37723, 208939, 338706, 227960, 337495, 285574, 257503, 234035, 135244, 181495, 284238, 366732, 387828, 333233, 277594, 266507, 342103, 351644, 381396, 208081, 416668, 291048, -251, -35530, 127389, 132730, 22509, -120480, -252373, -198522, -59504, 121725, 117608, 96596, 15416, 226831, 392379, 283656, 440594, 400035, 242859, 35203, -232379, -418995, -314759, -190447, -22208, 19763, 134648, 46771, -75725, 9046, -35452, 63823, 166246, 208245, 94077, -51118, -157680]
13406a57680J78935J45233j15628J95821j24634k3096j70284k54223R7405J99810
13396b8341J04988O1524m6701j90442k1358K80249K43564o1239j20080J12056
13386C34220P9906k49288j60565J5907J93552j62441M4408L8372k4284K6181n1705
13375H4263j00672J93108J84954j11559j08384j16872j4959N4128J3693p1290
13365F410j64081j24050j44144M0652K62368J99708q4741j81234j45379J36857
13355a97634K14446K37591j15331j68687m1224L5858m153j08025n3936L52454
13345A51359Q2309l3276p7014j41352P257J50542J01788m6662O5305O1452k9733
13334B91975K1751l8446j32625n9238k2810M8596o6463J1263J49510R2271l13298
$$ y = [-157680, 21255, 166488, 50860, 246681, 122047, 98951, -71333, -325556, -228151, -28341, 76647, 138171, 91470, -98972, -120330, 159919, 403483, 342244, 222164, 334220, 414126, 164838, 4273, 20180, 213732, 51291, 95699, 134071, 109787, 135968, 84263, -16409, 176699, 361653, 250094, 141710, 24838, 9879, 64007, 77700, 6410, -157671, -281721, -425865, -385213, -122845, 76863, -7878, -189112, -334491, -197634, 16812, 254403, 139072, -29615, -70839, -34981, -39134, -147159, -201095, 151359, 233668, 200392, 123378, -17974, -10717, 139825, 241613, 194951, 260256, 321708, 291975, 313726, 275280, 142655, 83417, 60607, 109203, 42740, 54003, 203513, 295784, -17514]
13323a7514k13493J85176J66600l6477n7396R5137j10218R4839N1061K5810J71966
13312C55491O4992J11945j89261P4823K60771j95444l04429K935M8136O1240J08294
13301C99493j36319j80194j68909r5776l7618N3900J51638J27541j16227k121
13291d592K13985J32976p3977k25507p2601Q3650k9013k1336j9050m419K70809
13280B50925K25585o0789p3715j89773O3299K57113j59405k48682j00794J18408
13270H2172J37569N5444j11238n4452J24644J58751j24099j41531M8517K97896
13260D73673N5033Q03p623n5464j8533k44756k03497K3723K04336k32884J6378
13249A1189K29449P4845j03572k41084o4871J05224M3761j9664J5365p1917Q7033
$$ y = [-17514, -231007, -45831, 120769, 84292, 26896, 122033, 11815, 106654, 157715, 183525, 355491, 420483, 532428, 343167, 417990, 678761, 483317, 178888, 181823, 229959, 291199, 399493, 263174, 82980, -85929, -181705, -219323, -165423, -13785, 113756, -2471, -4592, 209393, 342369, 268392, 42885, -29716, 53934, 24921, 3585, -15465, -19884, 250925, 476510, 415721, 342006, 152233, 215532, 472645, 313240, 64558, -36236, 82172, 219741, 275185, 163947, 109495, 234139, 392890, 268791, 127260, 175777, 473673, 528706, 529509, 521886, 466422, 447889, 203133, -364, 23359, 227695, -5189, 11189, 240638, 315483, 211911, -29173, -94044, 11180, 54941, 35277, 50642, -21275, 65758]
13238F5758N4909k04417k3590N2720m4286R2345Q7897M3556L653q7738N5200L4316
13226A30323q4916J28630j7057K9870n260n6737q8360K89753P4733j25372j59522
13215A16085N7540l7818j20676O2378O0211Q1399j01875J35157l3897J005J4198
13204B33707J32329q8637n0267L8346q7893J36349O4256p6351k50680p3243J28122
13193A06038M8105n7248k04684r612N4875j08842n654N7617n2609o6225m1542
13182b79781q5973L4289J66491J73134J0562q2646J09739J18008O2993J3481p4989
13171A65308K04572n2385j97966j86784J37700Q4591k68139k20637J03954J97471
13161c2315O4755P6574j82338j73059n4448J32431J00320j05122J27331M4036
$$ y = [65758, 120667, -83750, -107340, -54620, -98906, -6561, 81336, 124892, 128545, 40807, 96007, 130323, 45407, 174037, 156980, 186850, 181590, 124853, 36493, 326246, 400979, 275607, 116085, 173625, 135807, 15131, 77509, 137720, 219119, 117244, 252401, 218504, 219509, 233707, 366036, 277399, 227132, 265478, 177585, 313934, 378190, 301839, 51159, -22084, 106038, 154143, 96895, -107789, -117401, -62526, -171368, -177022, -119405, -172014, -238239, -279781, -365754, -331465, -164974, 8160, 18722, -63924, 45815, 163823, 226816, 240297, 165308, 369880, 317495, 119529, -67255, 70445, 155036, -113103, -333740, -229786, -32315, 32440, 109014, -73324, -246383, -300831, -168400, -68080, -173202, -45871, -1835]
13151a835J0125N1031j15450j85373j56461M0288J32468Q4447N1553O094L5009
13140d8104k0359m2778O8035l4942j48678p1246N8178J56428o1406j54842K14920
13129h4794L00066q1700L8100N9852m7079L9665O6613j07892j59279K03626N5152
13118B82330p9236K6082m6837m0545o242k05396k1126K3647n0252j17196m1381
13107b76152J39665J28849j04400j8538J43908K0316j44464n8419J04687K18162
13097A53614O5817k60871n7152J04528L288k5877Q5920O1038j72161n2197L7619
13086e6434J65930k0799r0539J04973l659o724j9743j20247n8003N1765j01583
13075a55063n4797P7483j13668q3020R1885N3439N4491L1396p1914j35929r2296
$$ y = [-1835, 8290, 59321, -56129, -241502, -397963, -357675, -225207, -140760, -89207, -83113, -48104, -68463, -111241, -43206, -78148, -226826, -298072, -239894, -83466, -144872, -299714, -84794, 215272, 133572, 171672, 231524, 184445, 224110, 290723, 182831, 23552, 227178, 282330, 203094, 229176, 182339, 141794, 135552, -69844, -90970, -67323, -117575, -234771, -276152, -136487, -7638, -112038, -130576, 13332, 33648, -110816, -169235, -64548, 153614, 219431, -41440, -98592, 5936, 9224, -16653, 69267, 130305, -41856, -94053, -56434, 109496, 88697, -1842, 103131, 99472, 92748, 73005, -47242, -105245, -53480, -155063, -209860, -132377, -246045, -329065, -237180, -183741, -129250, -97854, -169768, -305697, -397993]
13064c97993K11318K62533j19515p6392j29556l1260l1522J49120L173P2048K27711
13053A39665p5559j9927k4045J22513J79882m9526k63023J07959K31505K6395
13043C75839k02109j42115j03446r0862J77713J17159L159j31244J89411J60618
13033C54123k6445r6117n4161k17814M560O0066m7628j00555q0412R8548N7072
13022d8763n8877k0495O1534k22604M7056J99692K2586O8293J56901J35892o2973
13011B78242j58073j6047n9106m0923r1640O2671P2716J43714q5509o0593Q717
13000E4169j16923r5473l4517N6065O1737K1091j65057m025P3410J43481q8863
12989i4905J9993N3983N8544J53566r7853n9601P1726O4751Q6639k21891N2542
$$ y = [-397993, -186675, 75858, -43657, -120049, -249605, -280865, -312387, -163267, -160094, -88046, 139665, 64106, 44179, 20134, 142647, 322529, 273003, 9980, 117939, 349444, 375839, 173730, 31615, -71831, -162693, 15020, 132179, 135338, 4094, 193505, 354123, 327678, 231561, 177400, -40414, -35854, 24212, -23416, -123971, -204383, -105835, -48763, -107640, -128135, -66601, -289205, -242149, -42457, -19871, 48422, 205323, 341215, 278242, 120169, 104122, 45016, 4093, -87547, -24876, 47840, 191554, 106045, 45452, 54169, -62754, -158227, -192744, -136679, -74942, -53851, -218908, -222933, -149523, -6042, -94905, -74912, -20929, 37615, 191181, 93328, 33727, 105453, 170204, 256843, 34952, 87494]
12978H7494L4148j36215j21781n0609j80666o5094K41575K30488j74941j2170
12968a47771N4676L120m2347N487j46711j03286J2472q2877k6908J78420o8778
12957c64503k2790J03805Q5002J44001j51509J08938J61128j07681j04445n3955
12947b02009K1868l5114K5527J11941J51937q9764J86013L4156j28663q0685l6290
$$ y = [87494, 121642, -14573, -136354, -186963, -367629, -432723, -191148, 39340, -135601, -147771, -93095, -89975, -132322, -126835, -273546, -376832, -364360, -447237, -474145, -295725, -364503, -387293, -283488, -198486, -54485, -205994, -97056, 64072, -43609, -148054, -202009, -180141, -215255, -189728, -77787, 74150, -15614, 170399, 204555, 75892, -4793, -41083]
$$ [...]
##END NTUPLES=NMR SPECTRUM
##END=
