##TITLE=Analysis number 326609
Compound Code cc 54846
Book Reference 511/72
Project Code adrs
Chemist Name stevem
##JCAMPDX= 6.0         $$ Bruker NMR JCAMP-DX V2.0
##DATA TYPE= NMR SPECTRUM
##DATA CLASS= NTUPLES
##ORIGIN= Bruker BioSpin GmbH
##OWNER= nmr
$$ XWIN-NMR		Version 3.5
$$ Thu Feb 15 11:04:43 2007 GMT Standard Time (UT+0h)  MAYBRIDGE\nmr@NMR_250MHZ
##.OBSERVE FREQUENCY= 250.131544655141
##.OBSERVE NUCLEUS= ^1H
##.ACQUISITION MODE= SIMULTANEOUS (DQD)
##.ACQUISITION SCHEME= undefined
##.AVERAGES= 16
##.DIGITISER RES= 18
##SPECTROMETER/DATA SYSTEM= dpx250
##.PULSE SEQUENCE= zg30
##.SOLVENT NAME= CDCl3
##.SHIFT REFERENCE= (INTERNAL, CDCl3, 0, 16.4505)
##AUDIT TRAIL= $$ (NUMBER, WHEN, WHO, WHERE, WHAT)
$$ ##TITLE= Audit trail, XWIN-NMR		Version 3.5
$$ ##JCAMPDX= 5.01
$$ ##ORIGIN= Bruker BioSpin GmbH
$$ ##OWNER= nmr
$$ C:\u/data/dgb/nmr/ADRS/950/pdata/1/auditp.txt
$$ ##AUDIT TRAIL=  $$ (NUMBER, WHEN, WHO, WHERE, WHAT)
(   1,<2007-02-15 11:04:20.57 +000>,<MAYBRIDGE\nmr>,<NMR_250MHZ>,
      <created by zg, POWCHK disabled, PULCHK disabled
       configuration hash MD5:
       49 4B E0 1D 92 C2 6B 37 9F E6 65 BC 52 41 86 1D
       data hash MD5: 64K
       EF F4 22 AB 50 1D 1E B2 D2 10 C9 45 23 30 1B DC>)
(   2,<2007-02-15 11:04:35.43 +000>,<MAYBRIDGE\nmr>,<NMR_250MHZ>,
      <Start of raw data processing
       ef LB = 0.3 FT_mod = 6 PKNL = 1 SI = 32K 
       data hash MD5: 32K
       26 F7 ED 09 57 A7 3D 92 1A 6C 8D 48 35 6A 2A 43>)
(   3,<2007-02-15 11:04:37.57 +000>,<MAYBRIDGE\nmr>,<NMR_250MHZ>,
      <apk 
       data hash MD5: 32K
       44 CA 5C 3C 59 05 08 86 8C CB 19 58 39 67 4D 11>)
(   4,<2007-02-15 11:04:38.30 +000>,<MAYBRIDGE\nmr>,<NMR_250MHZ>,
      <abs ABSG = 5 
       data hash MD5: 32K
       C1 E2 82 D9 16 9F 47 AE CC 40 45 CD 7F 84 EC 12>)
$$ ##END=
$$ 
$$ hash MD5
$$ 13 9A A6 71 2B 06 A6 2C A8 87 AA 43 CB 58 84 0D
##$RELAX= 
##$RELAX= 
##$RELAX= 
##$RELAX= 
##$RELAX= 
##$RELAX= 
##$RELAX= 
$$ Bruker specific parameters
$$ --------------------------
##$DU= <C:\u>
##$EXPNO= 950
##$NAME= <ADRS>
##$PROCNO= 1
##$TYPE= <nmr>
##$USER= <dgb>
##$AMP= (0..31)
100 100 100 100 100 100 100 100 100 100 100 100 100 100 100 100 100 100 
100 100 100 100 100 100 100 100 100 100 100 100 100 100 
##$AQSEQ= 0
##$AQ_mod= 3
##$AUNM= <au_zg>
##$AUTOPOS= <36 >
##$BF1= 250.13
##$BF2= 250.13
##$BF3= 250.13
##$BF4= 250.13
##$BF5= 500.13
##$BF6= 500.13
##$BF7= 500.13
##$BF8= 500.13
##$BYTORDA= 1
##$CFDGTYP= 0
##$CFRGTYP= 5
##$CHEMSTR= <none>
##$CNST= (0..31)
1 1 145 1 1 1 1 1 1 1 1 1 1 1 1 1 1 1 1 1 1 1 1 1 1 1 1 1 1 1 1 1 
##$CPDPRG= <>
##$CPDPRG1= <>
##$CPDPRG2= <>
##$CPDPRG3= <>
##$CPDPRG4= <mlev>
##$CPDPRG5= <mlev>
##$CPDPRG6= <mlev>
##$CPDPRG7= <mlev>
##$CPDPRG8= <mlev>
##$CPDPRGB= <>
##$CPDPRGT= <>
##$D= (0..31)
0 1 0 0 0 0 0 0 0 0.06 0 0 0 0 0 0 0.0002 0 0 0 0 0 0 0 0 0 0 0 0 0 0 
0 
##$DATE= 1171537459
##$DBL= (0..7)
120 120 120 120 120 120 120 120 
##$DBP= (0..7)
150 150 150 150 150 150 150 150 
##$DBP07= 0
##$DBPNAM0= <>
##$DBPNAM1= <>
$$ [...]
##$SUBNAM7= <"">
##$SUBNAM8= <"">
##$SUBNAM9= <"">
##$SW= 20.6930455092707
##$SWIBOX= (0..15)
0 0 3 0 0 0 0 0 0 0 0 0 0 0 0 0 
##$SW_h= 5175.983436853
##$TD= 65536
##$TD0= 1
##$TE= 295.16
##$TE2= 300
##$TE3= 300
##$TEG= 300
##$TL= (0..7)
0 120 120 120 120 120 120 120 
##$TP= (0..7)
150 150 150 150 150 150 150 150 
##$TP07= 0
##$TPNAME0= <>
##$TPNAME1= <>
##$TPNAME2= <>
##$TPNAME3= <>
##$TPNAME4= <>
##$TPNAME5= <>
##$TPNAME6= <>
##$TPNAME7= <>
##$TPOAL= (0..7)
0.5 0.5 0.5 0.5 0.5 0.5 0.5 0.5 
##$TPOFFS= (0..7)
0 0 0 0 0 0 0 0 
##$TUNHIN= 0
##$TUNHOUT= 0
##$TUNXOUT= 0
##$USERA1= <user>
##$USERA2= <user>
##$USERA3= <user>
##$USERA4= <user>
##$USERA5= <user>
##$V9= 5
##$VALIST= <valist>
##$VCLIST= <CCCCCCCCCCCCCCC>
##$VD= 0
##$VDLIST= <DDDDDDDDDDDDDDD>
##$VPLIST= <PPPPPPPPPPPPPPP>
##$VTLIST= <TTTTTTTTTTTTTTT>
##$WBST= 1024
##$WBSW= 4
##$XGAIN= (0..3)
0 0 0 0 
##$XL= 0
##$YL= 0
##$YMAX_a= 243309
##$YMIN_a= -320929
##$ZGOPTNS= <>
##$ZL1= 120
##$ZL2= 120
##$ZL3= 120
##$ZL4= 120
##$ABSF1= 16.45054
##$ABSF2= -4.242632
##$ABSG= 5
##$ABSL= 3
##$ALPHA= 0
##$AQORDER= 0
##$ASSFAC= 0
##$ASSFACI= 0
##$ASSFACX= 0
##$ASSWID= 0
##$AUNMP= <proc_1d>
##$AZFE= 0.1
##$AZFW= 0.1
##$BCFW= 0
##$BC_mod= 0
##$BYTORDP= 0
##$COROFFS= 0
##$CY= 12.5
##$DATMOD= 1
##$DC= 0
##$DFILT= <>
##$DTYPP= 0
##$F1P= 14.0000005364418
##$F2P= -0.99999901652339
##$FCOR= 0.5
##$FTSIZE= 32768
##$FT_mod= 6
##$GAMMA= 0
##$GB= 0
##$INTBC= 1
##$INTSCL= 1
##$ISEN= 128
##$LB= 0.3
##$LEV0= 0
##$LPBIN= 0
##$MAXI= 10000
##$MC2= 0
##$MEAN= 0
##$ME_mod= 0
##$MI= 0
##$NCOEF= 0
##$NC_proc= -3
##$NLEV= 6
##$NOISF1= 0
##$NOISF2= 0
##$NSP= 0
##$NTH_PI= 0
##$NZP= 0
##$OFFSET= 16.45054
##$PC= 1
##$PHC0= 232.5111
##$PHC1= 6.680249
##$PH_mod= 1
##$PKNL= yes
##$PPARMOD= 0
##$PSCAL= 4
##$PSIGN= 0
##$REVERSE= no
##$SF= 250.13001787187
##$SI= 32768
##$SIGF1= 0
##$SIGF2= 0
##$SINO= 400
##$SIOLD= 32768
##$SREGLST= <1H.CDCl3>
##$SSB= 0
##$STSI= 32768
##$STSR= 0
##$SW_p= 5175.98343685301
##$SYMM= 0
##$S_DEV= 0
##$TDeff= 65536
##$TDoff= 0
##$TI= <Analysis number 999999
Compound Code 99
Book Reference 9
Project Code 9>
##$TILT= no
##$TM1= 0
##$TM2= 0
##$TOPLEV= 0
##$USERP1= <user>
##$USERP2= <user>
##$USERP3= <user>
##$USERP4= <user>
##$USERP5= <user>
##$WDW= 1
##$XDIM= 32768
##$YMAX_p= 307682231
##$YMIN_p= -168152
$$ End of Bruker specific parameters
$$ ---------------------------------
##NTUPLES= NMR SPECTRUM
##VAR_NAME=  FREQUENCY,     SPECTRUM/REAL,   SPECTRUM/IMAG
##SYMBOL=    X,             R,               I
##VAR_TYPE=  INDEPENDENT,   DEPENDENT,       DEPENDENT
##VAR_FORM=  AFFN,          ASDF,            ASDF
##VAR_DIM=   32768,         32768,           32768
##UNITS=     HZ,            ARBITRARY UNITS, ARBITRARY UNITS
##FACTOR=    0.157963299565203, 1,           1
##FIRST=     4114.7739999231, 0,             0
##LAST=      -1061.20943692991, 0,           0
##MIN=       -1061.20943692991, -168152,     0
##MAX=       4114.7739999231, 307682231,     0
$$ Real data points
##PAGE= N=1
##DATA TABLE= (X++(R..R)), XYDATA
$$ [...]
16387C4519J119k3246m3443L650K2247m169k8961l7031K105L1620J0717K7724
16375c149k9639P133M3753K0305N707K6390O588k3550k7450n3399j320P317K0220
16362a094m5989l4713L9398L6645k6160j0966K9650L1964N392k0872k8867J525
16350b4087N9783P370k9758m6969j6334R36L1120K0147j0155J1563K7405j2933
16338A8088r072R366N772l9905k280j0773N5236K4267L897l4130j2874l2755j0287
16325c5450O900L1800K3462n945L2233J4772l6072L7491K748n3767j8286j0890
16313a1004J4360o765l4489r223L9620L0532k0085q4937j3195N7656M8737J8791
16301B9998m1600k5607L3906J7468o205J1156K517j8277k5094m071J8827M3816
$$ y = [34519, 35638, 12392, -31051, -27401, -5154, -9323, -38284, -75315, -73210, -41590, -30873, -3149, -32788, -25655, 18098, 38403, 44110, 70500, 77088, 53538, 26088, -27311, -28631, -21314, -1094, -47083, -81796, -42398, -5753, -31913, -42879, -13229, 18735, 24127, 3255, -25612, -24087, 35696, 43066, 13308, -33661, -49995, -49059, -17939, 2208, -7947, 3616, 31021, 18088, 9016, 18382, 24154, -15751, -18031, -28804, 26432, 50699, 54596, 20466, 7592, -25163, -35450, -28550, 3250, 26712, 20767, 53000, 67772, 31700, 69191, 71939, 18172, -114, -11004, 3356, -3409, -37898, -47121, -7501, 23031, 2946, -81991, -95186, -37530, 11207, 29998, -11602, -37209, -3303, 14165, 7960, 19116, 21633, 3356, -21738, -25809, -6982, 36834]
16289C6834J5053Q893j9523m4217m6388J6871M3093K9536J2292k7686j6480J0347
16277A8625m5667K538N398M3889K6690r768J9018k9372k2726J3423J691k1999
16265A740K261J2717j1415J018M219k3769n406L0154L5436N850k2567J8853l8685
16252A0406k8123L3930N656R82n3351j6983J0781l793j1312n713j5329L0043q986
16239e1792q190L4828J8022l3227m5348r251R5039N8982p908l9590L2275j157
16227D2683k9164k1620M4216j3963j9754j264P039j2607J7946k1199m8617Q580
16215d7724K0824P2l088L3684k5953j3061L7464N2338M332K2288l5809n3392K7319
16202A9294l642k4328q494k5141l9281Q280m9774J0072M9273Q91M1518L4096k3585
$$ y = [36834, 51887, 60780, 41257, -2960, -49348, -32477, 10616, 40152, 52444, 24758, 8278, 18625, -27042, -24504, -19106, 24783, 51473, 41705, 60723, 31351, 8625, 22048, 23739, 1740, 4001, 16718, 5303, 6321, 10540, -13229, -18635, 11519, 46955, 52805, 30238, 49091, 10406, -17717, 16213, 21869, 22851, -30500, -47483, -36702, -40495, -51807, -57520, -72849, -42806, -51792, -59982, -25154, -7132, -40359, -85707, -94958, 81, 59063, 51155, 11565, 43840, 42683, 13519, -8101, 36115, 22152, 2398, 1134, 8173, -4434, 13512, -7687, -56304, -47724, -26900, -26828, -29916, 3768, -22185, -35246, 2218, 54556, 58888, 81176, 45367, -8025, 19294, 15652, -8676, -17170, -42311, -81592, -73312, -123086, -113014, -63741, -62850, -21332, 12764, -10821]
16189a0821j6637k3135l6671J5809L5700p449m951L629l4022k9719M1297Q4794
16177A7824k9499k680K4369K483m760K1148J1354l5747k0824K1529J7438k7405
16165d770l3793k6012L5728O349Q360M051j8212K901L1879J323M2202l9260l8543
16152b7797N4613j8898m4898j0297M482M1068j3923J0181K8644L5799k4025l0867
16140D082K5251j918m0008l9861r358k1934j9428K9055L6445L1843L174k7227
16128b9884l1192n94K7697k1568J382P128K06k2524l3332q031K8073M1003k57
16115d1893j1150J6130j0969K5381L048l825j898j0753j5356l2729k1746N218
16103a00542L9399K3281L4110L926j4017r810O291o641j8491j1740M430k6940
$$ y = [-10821, -27458, -50593, -87264, -71455, -35755, -43204, -48155, -44526, -78548, -108267, -66970, 17824, -11675, -14355, 10014, 12497, 7737, 28885, 40239, 4492, -16332, 5197, 22635, -4770, -38563, -64575, -28847, -22498, -14138, -10087, -28299, -25398, 6481, 7804, 50006, 10746, -27797, 26816, 7918, -36980, -47277, -42795, -1727, -15650, -5469, 23175, 58974, 34949, 4082, 29333, 27415, -12593, -52454, -61812, -83746, -103174, -74119, -37674, -5831, -2657, -29884, -61076, -61670, -33973, -55541, -54159, -47031, -46825, -69349, -102681, -110712, -82639, -41636, -41893, -53043, -36913, -47882, -22501, -19453, -23278, -25176, -35929, -51285, -84014, -105760, -100542, -61143, -37862, -3752, 174, -13843, -23653, -17362, -24003, -42494, -54234, -49804, -76744]
16091g6744J560N2116n51K7845L5244j5638m6314K512R502m0113K1625J8162l0715
16078d1509k8965J2694J3202K4867k25k1861M0114K2969m531j1512l9381j705
16066c5843m772j9990J8821r905j2908L7727J045J6086O0543n501j1972k6190
16054G141k6543N2908M7679r101q252p755r133k9330r144P710L006j8058M2693
16041D3821J6811l1449m4863K344k818j6834J3409L1723J9400j9193m7320j7353
16029e2322j603R032j7915k380R409K1977j0351j7771j0002N1172N1875l2261
16017a140m882L3526j3066n0831k9560j297J7789L1826J6027n819L6787N09l2638
16004b769n032L1307j8981j1333j9802j6987q774L0641K1567j0122k4971P508
$$ y = [-76744, -75184, -23068, -23619, 4226, 39470, 23832, -22482, -19970, -10468, -50581, -28956, -10794, -41509, -70474, -57780, -44578, -19711, -19936, -41797, -1683, 21286, 16755, 5243, -34138, -35843, -40615, -60605, -41784, -51689, -64597, -26870, -25825, -9739, 50804, 45303, 33331, 7141, -19402, 33506, 81185, 72084, 63832, 56077, 46944, 17614, 8470, 16180, 19186, 1128, 43821, 60632, 29183, -15680, -13336, -16154, -32988, -19579, 12144, 31544, 12351, -34969, -52322, -53925, -44893, -62808, -65188, -55779, -33802, -44153, -61924, -71926, -20754, 31121, -1140, -6022, 27504, 14438, -36393, -65953, -67250, -49461, -17635, -1608, -7427, 29360, 29869, -2769, -7801, 23506, 4525, -6808, -26610, -43597, -52371, -21730, -163, -10285, -35256, -27748]
15992b7748L1469K4940J4296l5042n0592M921J3984J211l4365m5091K5379n597
15980h2235k209K4473q292R617J7814J1965j4907J4890r467J2455P346k6594J0949
15967c4195m906r311j0000L958l1199R198P3998O4117o5543j7873O541M2144L0360
15954E7289m9445o8778J5689m598K4197j2953k3134K2568k8167o856N3174J4891
15942f123O019J3989L532K9137M584m3440M542J3902j5741k1306l3210m7227N159
15929h6183L345K0818M0798K4501J8091J994J6929l3813k7337k0346j5596J5583
15917d1216j2164m65k180K2335J6542k347J0043k1596m7654P854L0271Q217j1706
15904d4066l2586j2827J3143O0749K2095j1820K612K0786R32J3554L116K4246
$$ y = [-27748, 3721, 28661, 42957, 7915, -42677, -37756, -23772, -22561, -56926, -102017, -76638, -82235, -84444, -59971, -68263, -58646, -40832, -28867, -43774, -28884, -38351, -25896, -18550, -45144, -34195, -39101, -48412, -58412, -54454, -85653, -76455, -2457, 61660, -3883, -21756, -15215, 26929, 57289, 7844, -60934, -45245, -49843, -25646, -38599, -61733, -39165, -67332, -74188, -21014, -6123, -104, 13885, 17417, 46554, 51138, 7698, 12240, 26142, 10401, -10905, -44115, -91342, -86183, -82838, -62020, -21222, 3279, 21370, 23364, 40293, 6480, -20857, -41203, -56799, -41216, -53380, -53845, -56025, -33690, -17148, -19495, -9452, -31048, -78702, -70848, -40577, -32360, -44066, -76652, -89479, -76336, -15587, 6508, -5312, -2700, 18086, 19018, 32572, 35688, 59934]
15892E9934M0009P490J2691n948j8125p2652j302K401k0367l853p782K9559k9134
15879g079m6753J3049R380j019L2084N5013o898k4785P622m5062k7437k991N6394
15866A1518J7740l5974j6359J1524Q11M990k3641m0097k6370K3122Q149N4554
15854a0033j8081j9577P319K8388L3327j8310l5974j1511K740o30J0746J5143
15842a6453M2613K2665l4780k6974M1831j4881P045q083J5845J0320j3559n0809
15830b5220K1937K264k4654K1733M800j205k3862o4426j6934O310M0173P3226
15818A4142j6254k6768k1266j0894J3452K4787L0051J8432k4057k5365j995J8177
15806g558m09l148l0693P802J0855L0379J300R215q618k9120j7060N8354K8448
$$ y = [59934, 99943, 107433, 120124, 114176, 96051, 23399, 22097, 24498, 4131, 278, -7504, 22055, -7079, -53832, -40783, -31403, -32422, -338, 54675, 47777, 22992, 30614, -14448, -41885, -44876, 11518, 29258, -6716, -23075, -11551, -10740, -5750, -29391, -69488, -95858, -72736, -64587, -10033, -28114, -47691, -40372, -11984, 21343, 3033, -32941, -44452, -41712, -42342, -31596, -16453, 26160, 48825, 14045, -12929, 28902, 14021, 21066, 12983, 28828, 39148, 25589, -25220, -3283, -1019, -25673, -3940, 860, -345, -24207, -88633, -105567, -99257, -59084, 14142, -2112, -28880, -50146, -61040, -47588, -22801, 7250, 25682, 1625, -23740, -25735, -7558, -7967, -11115, -41808, -34006, -23151, 7228, 8528, 17743, 9125, -19995, -37055, 21299, 49747]
15793D9747k4394r413J7545M1168m6076m6742m17R587J9378l1612n3935j402L9798
15780c6768k4263j4397o153K0486K2909p13L681J2998j6162J3691j213j9868j1211
15767e6983J4274M598J7187m6290k1179R920K8595J4009Q807J6331n292J8801
15755B778l1467K1089J1334M655j6980k6644l7102K9675Q281J6678R552K8007
15743A9856j5858k5899N1126M4923K1449k4551K3312j4595o3539k8226j3172L347
15731b1827j9104K4944L5457L1899m8594m5844J5077J5545m2985j748K5143J4804
15719a7233J3145K3335P939J0769k9876l1408L8703l702m8083l4148M793N0412
15707a5354k0234o435L081J7202O892Q681N8511l6918n2871Q324O612P9988J9358
$$ y = [49747, 25353, 15940, 33485, 74653, 28577, -18165, -18582, -8995, 10383, -21229, -75164, -76566, -36768, -61031, -75428, -81581, -61095, -38186, -38899, -35218, -22220, -38382, -24691, -25904, -45772, -56983, -42709, -38111, -20924, -67214, -88393, -78473, -49878, -35869, -27062, -10731, -16023, 2778, -28689, -7600, 3734, 8389, -8591, -35235, -72337, -42662, -34381, -17703, -8151, 19856, 3998, -21901, 29225, 74148, 95597, 71046, 94358, 79763, 16224, -12002, -25174, -21827, -40931, -15987, 19470, 51369, 2775, -43069, -27992, -12447, -55432, -57180, -32037, -17233, -4088, 19247, 27186, 37955, 8079, -23329, 15374, 11672, -36411, -70559, -65766, -15354, -35588, -42023, -38942, -21740, -14848, -6167, 52344, 15426, -37445, -29121, -22509, 57479, 76837]
15694G6837k725m2638k3948R575K4968L090O114l7875k8092O94j7729M5025L1894
15681D5190P958k577l3910k2229J6501l5107m7841K0038L2269m9657k0478L8381
15669e1462M0208j7826M047P61K1055J7205l6781r21q234L5462L1495j2830J2182
15656C4361J558L7356j3969j8134l2093j096J4859l2293k7472J2411N5012L3295
15644F3795j8520l0265n1658l2665K3404J1429K2150J4981L7285J9597j4014j4417
15632C1102o2225N469J6822j4397k0491J9487K9610k6711r868L636j9974O806
15620d0734J5880l1371J5263R090J7002m140m0157M645M9255l7630j6205j290
15608f0392L8329M7075l006l5906n8377J4899J2211o073N045p868L4602J7775
$$ y = [76837, 74112, 31474, 7526, 17101, 42069, 45159, 51273, 13398, -14694, -14000, -31729, 13296, 45190, 53148, 50571, 16661, -5568, 10933, -24174, -72015, -51977, -19708, -69365, -89843, -51462, -11254, -29080, -25033, -24272, -3217, 13988, -22793, -23714, -31948, 3514, 35009, 22179, 34361, 35919, 73275, 59306, 41172, 9079, 7983, 22842, -9451, -36923, -24512, 30500, 63795, 45275, 15010, -36648, -69313, -45909, -34480, -12330, 2651, 39936, 59533, 45519, 31102, -31123, -25654, -8832, -23229, -43720, -24233, 5377, -21334, -31202, -27566, -47540, -40734, -24854, -56225, -40962, -31872, -14870, -19010, -59167, -54522, -5267, -42897, -59102, -60392, -22063, 25012, 22006, -13900, -72277, -57378, -45167, -51240, -46195, -54063, -19461, -1686]
15596a686l601l893J6919L097m650K2036m1053k3097n187j3823K75M6681O9586
15583F1604O157l4578k7540L337L7883j3917j3272k3763l9193k3040o418L0479
15571d2261k5376J4398J4676j955J7466K9905K7441n1836n9484J2254L2659K857
15559b9256j0187j9054J8457k7890O999P612J128M0736k3997R901M4036j5487
15547B998j4629l4825l4841J8050K2064R955O413O841k4394L1670J2884J1299
15535A3485L9237k2317N545P961k1793l1859K4791m639m6584j8577L9144J5401
15523b05J178O6212J6610j7960j1485j2229L0252q561K5692L2011m3678m7975
15511B9862Q058L883M005j2930j2879n7197m4415Q463M5440o287O828J7783j1115
$$ y = [-1686, -5287, -9180, 7739, 10836, 6186, 28222, -12831, -35928, -41115, -54938, -54663, -7982, 61604, 67761, 33183, 5643, 8980, 46863, 32946, 19674, -4089, -43282, -66322, -72740, -42261, -67637, -53239, -38563, -40518, -23052, 6853, 34294, -17542, -77026, -64772, -32113, -29256, -39443, -58497, -40040, -67930, -60931, -53319, -52191, -11455, -35452, -25551, 18485, 2998, -11631, -46456, -81297, -63247, -41183, -31228, -24815, -17974, -42368, -10698, 2186, 13485, 52722, 30405, 35950, 43911, 22118, -9741, 15050, 10411, -36173, -54750, -15606, -205, 973, 67185, 83795, 65835, 54350, 42121, 72373, 63812, 89504, 121515, 77837, 29862, 37920, 41803, 45808, 32878, 19999, -37198, -81613, -73150, -27710, -33997, -27169, -9386, -20501]
15498b0501J1871l5212L3556L825n699J1791o160j026l5568Q171k142J0111J6800
15485a0183l3162k7039O2881j5093l7726k647p39J0000P800J3147K5958Q91J0624
15472D712K2507K570j1998L287M319o3919l5350P140K7516j5756j2626k5009k841
15459i5448N4110L2307J6097m91k664J9903m6693R824L1777j4960o145P795Q003
15446A3415J0767N081j9431k0379m8364k4636n767J0517J8149K154K0136j6043
15434e4401J7995j6172n029M0802M4645j8574n9199L043L578K8683J887k837l805
15421a9384o747o267K2648J9652m8724o451L3316J8767J4456m8896p343N890J0662
15408a8421K5474k5792l8952m5444j9697J0244N0044O2709k7147j8119k0223j7116
$$ y = [-20501, -8630, -43842, -10286, -6461, -12160, -369, -6529, -7555, -43123, -34952, -37094, -26983, -10183, -43345, -70384, -7503, -22596, -60322, -62969, -63708, -53708, -45908, -32761, -6803, -5912, 4712, 27219, 29789, 17791, 21078, 25397, -38522, -73872, -66732, -39216, -54972, -67598, -92607, -95448, -41338, -9031, 7066, 6575, 3911, 23814, -22879, -13055, 18722, 3762, -2383, 5412, 13415, 24182, 29263, 9832, -10547, -58911, -83547, -89314, -78797, -60648, -58494, -38358, -54401, -36406, -52578, -57607, -16805, 27840, 9266, -49933, -46890, -43312, -14629, -12742, -15579, -19384, -26131, -32398, -9750, 9902, -38822, -45273, -11957, 6810, 21266, -27630, -34973, -29083, -18421, 7053, -18739, -57691, -103135, -122832, -112588, -62544, 165, -26982, -45101, -65324, -82440]
15396h2440J2518k2262j5888L7110K1122L7208q65j9007j2523P849L8534P776
15384I132n486P249o899j5413m9210K85p736M8119K4009n0591j9426K6939q449
15371d7477j4309L1473R076m570Q331K0038K3732j728o655J4404j4810r334l0864
15358b2693k8735L5415N1130j5404j4959j1083j450K2443m1825k9058M3868K1373
15346I022K540k1728k8067N2871O619j8626l8198j7592K5922J6103k016k7414
15334d0564P357K4251L0913m8106l0546o912k0268l9230l7387J4680P4050M648
15322f7114J2492K2305M4108l2211k6944j8413p071N902N8977K6126j763j9027
15310b633j8379n2023m1501P968K3705K6015J3871P708K0711k046K6397O461j0007
$$ y = [-82440, -69922, -92184, -108072, -70962, -49840, -12632, -13497, -32504, -45027, -37178, 1356, 9132, 3646, 10895, 3996, -11417, -60627, -60342, -68078, -19959, 4050, -46541, -65967, -39028, -47477, -61786, -30313, -21237, -25807, -17476, 2562, 26294, 24566, 17911, 32315, 17505, 8171, -22693, -51428, -16013, 35117, 19713, 4754, -6329, -7779, 14664, -27161, -56219, -12351, 9022, 11562, -10166, -38233, 14638, 21257, 2631, -35567, -53159, -27237, -11134, -13150, -40564, -33207, -8956, 21957, -26149, -56695, -63607, -83875, -123105, -160492, -145812, -71762, -67114, -54622, -32317, 11791, -20420, -47364, -65777, -72848, -66946, -7969, 18157, 16394, -2633, -21012, -73035, -114536, -106568, -82863, -56848, -42977, -35269, -14558, -16604, 9793, 16254, 6247]
15297F247Q58j6042J3331J8339J2193o810L3817L525Q311r869K5177k5838l305
15284E9934m0736n8730J2708N443Q253K3278K4835n357l096m588j4684q097L6584
15271C5747J3051K060r557Q544M1292R416k4220O909J90k0408j4876j2332m1229
15258e413P95J4298M6437K0491l1343m0586K0080L7829M3265N384p6257p372k1639
15245E969j7492k414L798K9642O729l6345k6250m2823j0887L3844N7074q05n008
15232d968L5072L4265J2800O957j4765k7272P95Q403k4376k9094k9646P849K3563
15219d17o838j2328q636j9467K5065L6628j8733j1023P85k5176j7656j5256k716
15206g5768O8854N0101m2058m4466K1844j5326j6634L933K0558J8099J8780M6425
$$ y = [6247, 7105, -8937, 4394, 22733, 34926, 28116, 61933, 65458, 73769, 63900, 89077, 63239, 59934, 19198, -39532, -26824, -21381, -13128, 10150, 34985, 29628, 26532, 21944, 7260, -837, 35747, 48798, 50858, 41301, 49845, 91137, 100553, 76333, 83242, 83432, 63024, 48148, 35816, -5413, -4618, 9680, 56117, 76608, 45265, 4679, 24759, 62588, 105853, 111237, 34980, 27608, 5969, -11523, -13937, -10139, 19503, 26232, -10113, -36363, -79186, -90073, -56229, 845, 40, -4968, 30104, 64369, 77169, 84126, 69361, 42089, 42884, 51287, 26911, -2183, -31829, -23980, -417, -7255, -19583, -28219, -47686, -22621, 14007, -4726, -15749, -14964, -40140, -57796, -73052, -75768, -6914, 43187, 1129, -43337, -21493, -36819, -53453, -49520, -28962, -10863, 7917, 54342]
15194E4342K0245O626n8871k432K3197n493o084K5825N1135j3429l0616j8972
15182D5473m1244R228J7283m8680K8034L2417l996j6456j5448J393K3728p97l2562
15169a627M95m730l690J5331j022J7592j3544P579O959m938k4534J2354l552L3002
15155C5675J8991j0518j2978j7083k867J2190J0843n8181m0285J9839O7453K4512
15143D7591n6985m4381K823j0188J176M3144M0912N4187k9801m7220K1256j9581
15131B933k571M9804q138j6206K8936j395m2052k5498J1263J9668n438K8197k0706
15118A8797l1360k2000K8124Q207k7602j8156j0147L2334K8441j2703k3564N2344
15106B2715L9418k1254l1920J3946J0644l9962N22j726M177J1770K8101L2956
$$ y = [54342, 74587, 81213, 22342, 19910, 43107, 37614, 31530, 57355, 108490, 95061, 64445, 45473, 4229, 13457, 30740, -17940, 10094, 42511, 38515, 22059, 6611, 8004, 31732, 30935, -1627, -1132, -5862, -9552, 5779, 4757, 22349, 8805, 16384, 23343, 18405, -6129, 6225, 2673, 35675, 54666, 44148, 31170, 14087, 11220, 23410, 34253, -23928, -64213, -44374, 23079, 47591, -9394, -53775, -50952, -61140, -59964, -16820, 24092, 78279, 48478, 1258, 22514, 2933, 362, 50166, 42028, 25822, 54758, 53363, 11311, -14187, -2924, 16744, 11306, 39503, 18797, -12563, -34563, -6439, 1768, -25834, -43990, -54137, -21803, 6638, -6065, -29629, 22715, 62133, 40879, 8959, 22905, 33549, -6413, -5891, -7617, -3440, 8330, 36431, 69387]
15094F9387o527J2488l718k789n4830m1668J4938Q333k8751Q352k2991J2843N052
15081b9881m8591l436O5330K4284K3754l333l1455j4616J7758n5803J4066L9997
15069a926K4919j4986m7014k7496K6102o18L5087K377o329p020M683J167k7527
15056c8581k2507J8897J9183J3388j2912M1691N831q932J849k1233l1894j9103
15044e4323K1063L4449J1712j3577l1038j8689L6967L6429J4179l0390j4979r738
15032a7935M5538L1750o0884k8786M5580L5069K7663k2934l2506L2540K9074q764
15020G5405j1913j4263j5077L61k2661j0669k6799k8781l0705M7554L4081l1569
15008c5036L0974K1457j6556l510q31j0728o098N7332J3616r809j5008k844R389
$$ y = [69387, 62860, 75348, 71630, 68841, 14011, -27657, -12719, -4386, -33137, -24785, -47776, -34933, -29881, -78472, -81908, -16578, 7706, 31460, 28127, -3328, -17944, -186, -55989, -41923, -1926, 22993, 8007, -39007, -66503, -40401, -41019, -5932, -3555, -9884, -16904, -12221, -11054, -38581, -61088, -42191, -23008, -9620, -22532, 19159, 24990, 16058, 17907, -3326, -35220, -54323, -33260, 1189, 12901, -676, -31714, -50403, -13436, 22993, 37172, 6782, -8197, -17935, 27603, 59353, -1531, -30317, 15263, 50332, 77995, 55061, 22555, 55095, 84169, 75405, 63492, 49229, 34152, 34513, 11852, 1183, -25616, -54397, -85102, -37548, -3467, -35036, -4062, 17395, 839, -2671, -3502, -14230, -20328, 37004, 50620, 40811, 25803, 22959, 32348]
14995C2348l2020O728K6383k3577j7105K4218N169n3394M5939J6265j0052j4233
14983F669l5141q201J7633K3931J8806k8352p0954r833M8494J1598k6690j3782
14971f5822J6448M2628J4149l4466k3601l111k9683J0862j2603L0250J6260k3687
14959f2376J0416J9577J2123P829p554j3057k927j5165k4030r421m4873j7544
14947a47002M2389P3704M3701J7356K9377m0765n8851m813J7807L8348J8072j624
14935B7699R663n8710p258J4377j0162m536k1096k9592J3457j8448j1263L9039
14923e6830K4685L0099Q100J8922m4994r687N3873k3885n3291J7053j846j5750
14911e3551J7792j1396K9111L6493K3953l2970k6588m4378K8300R196n8956J2564
$$ y = [32348, 328, 7056, 33439, 9862, -7243, 16975, 22144, -31250, 14689, 30954, 20902, 6669, -28472, -36673, -19040, 4891, 23697, -4655, -75609, -85442, -36948, -25350, -52040, -65822, -49374, -6746, 7403, -27063, -50664, -53775, -83458, -72596, -85199, -54949, -38689, -62376, -51960, -32383, -20260, -12431, -19985, -33042, -35969, -51134, -75164, -84585, -129458, -147002, -104613, -30909, 12792, 30148, 59525, 18760, -40091, -44904, -27097, 11251, 29323, 27699, 37362, -21348, -28606, -14229, -24391, -28927, -50023, -79615, -66158, -84606, -95869, -56830, -32145, -2046, 6054, 24976, -20018, -29705, 24168, 283, -53008, -35955, -37801, -53551, -35759, -47155, -18044, 18449, 42402, 9432, -17156, -61534, -33234, -24038, -82994, -70430]
14899g0430P5330J5810K1789L8698l2543l6605J1754j145j3128m1972k0616N3016
14887d2J1144j4867j7351k3683M0125K6654j549l5830j0653J0239n1710n433L5742
14874c7214p262J495J3870O427k5315M899k95J9286R430p278K6938M915n347Q683
14860A3232q23l4215R301m021O8903j2811J0094m252p567l9419o3928K326R055
14847e4125J3221q615j8106L0238K8502J2707m074k9298k4147K904j2682J4443
14835d9032L7636L5599P542O1954l4549l7960J2903Q417M541m6513l475K9416
14823B6479O924k3543j0040M3445L581l2355n1666J7393N0227o433K7144J1324
14811F2480j8737m035O202J9019M862l7196k4387J1060M931L7649K1470M362k7187
$$ y = [-70430, 4900, 20710, 42499, 81197, 48654, 12049, 23803, 22658, 9530, -32442, -53058, -42, 11102, -3765, -21116, -44799, -4674, 21980, 20431, -15399, -26052, -15813, -67523, -72956, -37214, -44476, -42981, -29111, -22684, -47999, -43100, -43395, -24109, -14679, -21957, 4981, 9896, 4549, 13232, 12409, -21806, -12505, -16526, 52377, 39566, 49660, 45408, 37841, -1578, -65506, -63180, -54125, -40904, -49519, -67625, -37387, -8885, 3822, -252, -29550, -53697, -50793, -63475, -49032, -11396, 24203, 31745, 93699, 59150, 21190, 34093, 42510, 47051, 538, -2937, 26479, 33403, 9860, -180, 43265, 46846, 14491, -37175, -19782, 30445, 24012, 51156, 62480, 43743, 39708, 45910, 64929, 69791, 32595, 8208, 19268, 24199, 61848, 83318, 87680, 60493]
14798F0493l5938R816l740j1948k1450k6228N466Q009J4642R410k2613j8309k8462
14785f0852O783j0230P866L5336K379k346j9196J1849J9439J1789M4928J3133
14773F0878o6171j4959N240L0862N217R265j3950l900K1388J9270k6480m2434
14761a5774l80K137K9077m866k0980L9372L8902q796m8760k2832M8671J3677j2465
14748C6983K7883k0957k2461l7089K4263j8642j0847m0157m2947O8902J16374
14737H1305L7338m9341j2490n8440j6071k1025j84J1806P8481M0319o2851j8587
14725A0260K3441J8761k108k505O780L646p25j2138P787j3921k2486l7002k781
14712b2991K0312n4614l147J2319Q530L0153J2219p364k4156k369j0874k9082
$$ y = [60493, 24555, 34371, 30631, 18683, -2767, -28995, -23529, -15520, -878, 8532, -14081, -32390, -60852, -54069, -64299, -56433, -21097, -18718, -21064, -40260, -28411, -8972, 2817, 47745, 60878, -5293, -20252, -15012, 15850, 21067, 30332, 16382, 12482, 33870, 53140, 26660, -15774, -16154, -14017, 15060, 10194, -10786, 28586, 67488, 58692, 9932, -12900, 35771, 49448, 36983, 64866, 43909, 21448, -15641, 8622, -10020, -20867, -61024, -103971, -35069, 81305, 118643, 69302, 56812, -1628, -17699, -38724, -38908, -27102, 51379, 91698, 28847, 10260, 33701, 52462, 50354, 47849, 54629, 58275, 57550, 45412, 53199, 39278, 16792, -20210, -22991, -2679, -57293, -60440, -48121, -39591, -9438, 2781, -4583, -28739, -31108, -41982, -71064]
14700g1064N0033O9473K1144k7861k2609P15N452k3128L334J5911L4897l6813
14688A9484j4031n043q431m0466l5472Q801L7582r214N109N7101k610L0513n2756
14675i433m0389N0177K3713P326L698P922k3527j4401o205M958J0016p917l8794
14662c2856o7794o445J7258K6546J694K234j8438M1717N6817J5720O533J3866
14650E6852K951m5749o794o874M497l6638k2466J4406n998J5853J564k6282m159
14637e8837L4426J7844j9895j456O983J1875l414q179L72M345K0269N105J4471
14624B3909M0045k6028j2695n219k1415q553l168m604j9693m7407J7993J1018
14612e5817j3073q964Q99L2611K6107j2505J1403j2864J8950L0393k1328L4455
$$ y = [-71064, -21031, 48442, 69586, 41725, 19116, 19831, 25283, 2155, 5489, 21400, 56297, 19484, 5453, 410, -8021, -48487, -83959, -75158, -37576, -46790, -41681, 15420, 12810, 43323, -9433, -49822, 355, 24068, 31394, 35092, 43014, 19487, 5086, -1119, 3839, 13855, 5938, -32856, -100650, -107095, -89837, -63291, -61597, -59363, -77801, -36084, 20733, 36453, 42986, 56852, 59803, 14054, 7260, 386, 4883, -31755, -54221, -39815, -45813, -29960, -28396, -54678, -58837, -24411, -6567, -26462, -27918, -20935, -9060, -12474, -20653, -20281, -15936, 4333, 9438, 23909, 63954, 37926, 25231, 20012, -1403, -9956, -13124, -17728, -37421, -84828, -66835, -55817, -68890, -77854, -76955, -44344, -18237, -30742, -19339, -32203, -13253, 17140, -4188, 30267]
14600C0267J1950k0856l6677J7611J3961m5968j4610J0129M5295K6918J7349J852
14588E7221Q024l6057J1037m627j0817J946L691M0661l5948m0622K4446J1328
14576C0283j8493m680K6911j3802j5279j6600N301j608p646j0790k6546R366P677
14563c5906J9855K9127j8565k0302J2100L2955l5836l9659L108O0511M9952k2271
14551C5069k9729K4762l221k7736k9298k3688M569L6325N929q954M1392N2218
14539G7638R306n4922j6480J7865R084j0251J0847p842m8405o4130k8388L9211
14527f6467M5262L065k0587J8683m710l0224O656j5995K7080L7060r709J5971
14515F085J8677N654m634l378k0548J795q073j1765p73k2972j6242P09M4851j9633
$$ y = [30267, 42217, 21361, -15316, 2295, 16256, -29712, -44322, -34193, 11102, 38020, 55369, 57221, 65245, 29188, 40225, 35598, 24781, 26727, 30418, 71079, 35131, -5491, 18955, 30283, 11790, 7110, 34021, 20219, 4940, -11660, -6359, -7967, -15613, -26403, -52949, -43583, -35906, -16051, 13076, -5489, -25791, -13691, 19264, -16572, -56231, -53123, 7388, 57340, 35069, 5340, 30102, 26881, -855, -30153, -53841, -49272, -12947, -7018, -15972, 25420, 77638, 86944, 32022, 15542, 33407, 42491, 32240, 43087, 35245, -13160, -77290, -105678, -66467, -21205, -18140, -38727, -20044, -24754, -54978, -48322, -64317, -37237, -177, -9886, 6085, 24762, 30416, 25782, 22404, 1856, 3651, -4422, -16187, -16960, -39932, -56174, -55465, -10614, -30247]
14501c0247j1204j402j9117q942J465L7753L447Q718k2842K3120j3225K2077j6895
14488b7294J7945l686l504K624l9403J3346J4939K4171M837n9934p597n038n274
14475g3868J9163J6025J9457M4601l1150l4480O201J9286j8943J6851R90K2468
14463F601K0057J773j1620J0098J3210n417j8210m5960l7329K2368K4719L9097
14451A9387J8277r249Q827q927l4093L0439J6281j3965j1222Q773Q61k3457j1388
14438i456K444L7781J7843j2758n2537k9046J5631l3100R182O7898M8248k2648
14426C9482J6067R944J452n7945J5897L1642n685q30m4166J0652L0266k9275r348
14413H153K2723j8784m8182L5178k2270l0602Q167k7533J4132L0783L4086K1155
$$ y = [-30247, -41451, -42853, -61970, -70912, -69447, -31694, -28247, -19529, -42371, -19251, -32476, -10399, -27294, -9349, -13035, -16539, -13915, -53318, -39972, -25033, -862, 3975, -55959, -63556, -68594, -73868, -54705, -38680, -19223, 25378, -5772, -40252, -34051, -14765, -33708, -16857, -15867, 6601, 26658, 28431, 16811, 26909, 40119, 34702, 16492, -29468, -66797, -44429, -19710, 19387, 37664, 28415, 37242, 28315, -5778, 24661, 40942, 26977, 15755, 24528, 25389, 1932, -9456, -7012, 30769, 48612, 35854, -16683, -45729, -30098, -63198, -54016, 13882, 62130, 39482, 55549, 65493, 66945, 9000, 24897, 56539, 50854, 50024, 5858, 16510, 46776, 17501, 8153, 30876, 12092, -36090, -912, -23182, -53784, -45617, -73150, -59018, -28235, 5851, 27006]
14401B7006p253P833J687m7677K5909n865l029P567l0859p429J0722J6899k3990
14388b8479J3423R263j5014K0627L241l3j7965J821L7650J9684j1245Q452j2134
14375B9291m1514o2967k5191L7495J8317J449k2250M1955K9020K2380J2210m124
14363C6071m6229k2802J1144j796j859L8656J033q836j2348L2673M8049m6493
14351B7263l1125j8090K0986L8091m135k5510j3761L251K2992J9722K739o033
14339C6390k3344n822k026J1931m1069l3772K8648K2218m7129N307J9786K2927
14327e955m0185P125N3225K5612O105p798J0468M1884l7201p1751q1023L1540
14315f7954K8097j5787Q386m1413l865P512J7067K8564K4689J742K8755K0816
$$ y = [27006, 19753, 27586, 29273, -18404, 7505, 1640, -1389, 6178, -24681, -32110, -21388, -4489, -28479, -15056, -5793, -20807, -180, 3061, 3028, -14937, -13116, 24534, 44218, 32973, 41425, 29291, -12223, -75190, -100381, -62886, -44569, -43120, -65370, -23415, 5605, 27985, 40195, 36071, -10158, -32960, -21816, -23612, -25471, 13185, 14218, 5382, -6966, 25707, 73756, 27263, -3862, -21952, -966, 37125, 32990, 7480, -6281, -3030, 19962, 39684, 42423, 36390, 13046, 7224, 5198, 17129, -23940, -57712, -29064, -6846, -53975, -48668, -28882, -5955, -46140, -39015, 14210, 39822, 45927, 38129, 48597, 90481, 53280, -18471, -99494, -67954, -39857, -55644, -47258, -88671, -92536, -85024, -67957, -39393, -14704, -12962, 15793, 36609]
14303C6609m0489n0888k0589N772J6251j262o203j7327N009p346J062J2946K270
14290f4185K4461J2567k3571l210j0845m046K9441k168k3890j3205J1768Q422
14278e8461J9738K6307K0900N205l6460j7367L3720L9872J9780k0836o6134r738
14266d3474N386L1774l08k1834N3356m467m3705J0782M3121J0946k9922k0582
14254h927J5662J6559j3911r139O503J6054J0137K3616l5326K951J7317Q432R84
14241E0912J433j5266N143Q646j5988J1296L856n5180J7560j2668l0932j7100
14229d8288k1493M5717K5940J7755r310K0315R433p975o222O393p730j6948L277
14216A0864J4542K017L0258k3257l9162k6171J5262j4672l1153l825o717M6763
$$ y = [36609, -3880, -54768, -75357, -69585, -53334, -54596, -60799, -78126, -73117, -80463, -79401, -66455, -64185, -39724, -27157, -50728, -53938, -64783, -68829, -39388, -41556, -65446, -78651, -66883, -58461, -38723, -12416, 8484, 13689, -22771, -40138, -6418, 33454, 53234, 32398, -33736, -43474, -38088, -6314, -6622, -28456, 24900, 20433, -23272, -12490, 30631, 41577, 11655, -8927, 6735, 23294, 9383, 244, 6747, 22801, 32938, 56554, 21228, 24179, 41496, 49928, 50912, 52345, 37079, 42222, 50868, 34880, 46176, 50032, -5148, 12412, -256, -31188, -48288, -69781, -24064, 1876, 19631, 10321, 30636, 40069, 32094, 25872, 32265, 24535, 7587, 10864, 25406, 27423, 57681, 34424, -4738, -30909, -15647, -30319, -61472, -65297, -72014, -25251]
14204b5251K8419n831n289M5766r396k9160Q145k8302l4364K6336J485p482P978
14191b6946K5334k1785O094J0091j2580l5105M558L9140l80j6217k4668J5607
14179c6857L7364J7472j7768m2096N927L2250K4578p715m9532K5839K6725n651
14167A0536l5254j3718q374j2504J47j5126J2510J9177M0184J1046m964J8352
14155B2012O188j6891k6656J982l0585l373L7831J2166k7213J555j9986o047l1897
14142h0914K8388K7126k7746L5728J017p545M3511J4470q870l3650Q981j0588
14130a0092J0861M4464M424k1030m291k1315l302M8272K3220o045j3401l0966
14118B0799l800K8403J0281l3997L6641L6301p11j7890L995k6490J9289J5121
$$ y = [-25251, 3168, -2663, -7952, 37814, 28418, -742, 7403, -20899, -55263, -28927, -27442, -34924, -26946, -1612, -23397, -17303, -7212, -19792, -54897, -50339, -11199, -11579, -27796, -52464, -36857, 507, 17979, 211, -41885, -35958, -3708, 20870, 13155, -36377, -10538, 16187, 10536, -24718, -38436, -46810, -59314, -59167, -74293, -61783, -42606, -2422, 8624, 3660, 22012, 28200, 11309, -15347, -13365, -43950, -47323, -9492, 2674, -24539, -22984, -42970, -49017, -80914, -52526, -25400, -53146, -17418, -16401, -23946, 19565, 34035, 25165, -8485, 496, -10092, 769, 45233, 49657, 28627, 24336, 3021, -281, 47991, 71211, 65166, 51765, 20799, 16999, 45402, 55683, 21686, 58327, 94628, 93917, 76027, 80022, 53532, 72821, 87942]
14106H7942K9721P5324R2596R7843J86858K49410K83955K99156L33589K84069
14096B020463K19468J57159J0874j32423k03134k35406k86401k96655k99972k79095
14086F74878j86201j05900m8666m0406k8719o6302l7483n0819p3667J6316K8593
14075H1624j0334J7657K3145p3011l8210O880O886O110J5656l9330j906L57R47
14062c529J9934O214k6310k9718J0461L6838K6863k9075k9716l0966J7491L0976
14050e37j569J98M0994l6869o3972j457L0880M355j5000J0130J9061K8974k465
14037A2723j1911O62K9619L1045K5516n3709j05791m5624L7673M0127M2284k991
14025c77P733N860m2000O56o490k8325M3817m941k7689j41L3987o439m671N244
$$ y = [87942, 117663, 192987, 285583, 383426, 570284, 819694, 1103649, 1402805, 1736394, 2020463, 2239931, 2397090, 2407964, 2275541, 2072407, 1837001, 1550600, 1253945, 953973, 674878, 488677, 382777, 334111, 293705, 264986, 198684, 161201, 110382, 36715, 53031, 81624, 71290, 88947, 112092, 39081, 871, 7751, 14637, 20747, 36403, -2927, -4833, -4476, -3529, 16405, 22619, -3691, -33409, -22948, 13890, 40753, 11678, -18038, -49004, -31513, -537, -2106, -1908, 39086, 2217, -61755, -63212, -32332, -27977, -42977, -32847, -13786, 15188, 12723, 812, 1474, 31093, 62138, 87654, 33945, -71846, -117470, -79797, -39670, 2614, -377, 7356, 13216, -28784, -28128, -34618, -62943, -19126, -24067, -51756, -51897, -17910, -24349, -29020, -23776]
14011b3776K7405N464l2214P233k0709R795L0039M692p739j0686m124l1970J7975
13998b8615l0267j2280J1863K8464k2805J8221l3370J1444P9018J6125Q743K8288
13986G4829K9979O911l5843n3725l753N839l5566n720j3652j2848k3464j4434
13974h1447M4916l267k6117J5763P011R354M1932k6462o950J0230j5148M0745
13962A0560K6541J0327m324M45l8088m0943j9557J1889J3657L8948N498j6241
13950a288J2594J7272j2980R879l7307j5034j7879o390L2985L8263J4268k9982
13938D401l6864j4291j4248r469L6159p210r727k6654J5963M8919M5007L9431
13926G1417l2778j6793k3395K6541M8852j3131j0153K7731J3792l6970l636J7266
$$ y = [-23776, 3629, 9093, -23121, -15888, -36597, -26802, 3237, 7929, 190, -10496, -14620, -46590, -28615, -58882, -71162, -59299, -30835, -53640, -35419, -68789, -57345, 21673, 37798, 46541, 74829, 104808, 111719, 75876, 22151, 18398, 24237, -11329, -17049, -30701, -43549, -67013, -81447, -36531, -39798, -65915, -50152, -43141, -33787, 8145, -18317, -25267, -15037, -30185, 10560, 37101, 47428, 43104, 43549, 5461, -35482, -55039, -43150, -29493, 9455, 14953, -1288, 11306, 28578, 15598, 25477, -11830, -26864, -44743, -51133, -18148, 20115, 34383, 4401, -32463, -46754, -61002, -70471, -34312, -41522, -51249, -77903, -61940, -13021, 31986, 71417, 38639, 21846, -1549, 24992, 73844, 60713, 50560, 78291, 92083, 55113, 51477, 68743]
13914F8743P276O92j5019k0436m824n2051k4658J8227K4512M4351J0194o422o455
13901D4130j0071j9728m7545j9482O6851O6409l1919o308o612m918m4376k6700
13889d0269J711N1723O501j1288O144l4773R359K0011j0640r51P009o947K8352
13876B5942m738k8176K2144r15J4135j4707k9341k4566J8974l1553l9147J4026
13864g7922N3076J6480O50M7463l1854n8091l7930N3942L9343n0719O49J6432
13852b8481M724j4604J3748l3742K4875r168j1523Q226K1354K2214j8110K1285
13840G98k9464L569J3531m909J8590L5312j29k8818K1814N969l8025p142K5159
13827A6255M205L0728k7296n3819k6836K689l662L9725M70r006J1043L6888K6908
$$ y = [68743, 76019, 76711, 61692, 41256, 36432, -15619, -40277, -22050, 2462, 46813, 57007, 50585, 44130, 34059, 14331, -33214, -52696, 14155, 80564, 48645, 42337, 35725, 30807, -13569, -40269, -38558, 13165, 19666, 8378, 14522, -20251, -10892, 9119, -1521, -2472, 4537, -2410, 25942, 21204, -6972, 15172, 14257, 28392, 13685, -15656, -40222, -21248, -52801, -91948, -77922, -24846, -8366, -7716, 39747, 7893, -50198, -88128, -34186, 5157, -45562, -44913, -28481, -23757, -38361, -24613, -58355, -33480, -42648, -54171, -45945, -24591, -2377, -20487, 798, -28666, -25097, -11566, -16475, 2115, 37427, 37298, 8480, 30294, 36263, -1762, -8904, 16255, 20460, 51188, 23892, -29927, -56763, -54074, -57736, -18011, -17541, -26547, -15504, 21384, 48292]
13814D8292p7987l8496N8986P2970q850j4598Q073o0279k4404K1O9626P460l7123
13801C691j6960m1360K4498m990j791j7071K7431M6329L6419j4759r1852k1256
13789g1671L6334N9218M935j1253m1043m1507J7041l0657J5596j9625J7394N8624
13777f614Q899k9555O710j3961J8397L5509j2739j1232r475O701N484l7613o465
13764d5954K3492J5411K9858J102J2498K8534J184r4056q5450j5232N0785J2458
13752f5370j8337p391K8879M9414K9851m340N463K2215L9444K9017p186l7266
13740F4393j00362p5034P607L9811j5127J4917M0927K3247j566J3361K6174n322
13728C3026K1677M25l0504j7617m700K8725L6026J1488k0874j3488k3755L2752
$$ y = [48292, -29695, -68191, -9205, 63765, 54915, 40317, 48390, -11889, -36293, -36272, 33354, 40814, 3691, -13269, -54629, -30131, -35121, -36912, -53983, -26552, 19777, 56196, 41437, -50415, -71671, -35337, 23881, 28816, 17563, -23480, -64987, -47946, -78603, -63007, -82632, -65238, -6614, 2285, -27270, -20560, -34521, -16124, 19385, 6646, -4586, -14061, -7360, -1876, -39489, -45954, -22462, -7051, 22807, 23909, 36407, 64941, 66125, -27931, -113381, -128613, -77828, -65370, -83707, -91098, -62219, -12805, 17046, 12706, 18169, 40384, 79828, 108845, 101659, 64393, -35969, -111003, -103396, -63585, -78712, -63795, -22868, 379, -1187, 12174, 38348, 33026, 54703, 55128, 24624, 7007, 2307, 31032, 67058, 78546, 57672, 44184, 20429, 53181]
13716E3181l1294j6159L4311K4368m0777R43K4812m7860m1292j5281J67l090R349
13703d8622L331J4801J8635K5790j9957k1947l7224J3746M3508j5922J0230k7007
13691d0638J9382Q6176K7928n1506n2063n014l0672m63J927Q006J2537N202J1886
13678g312K2825J0388l6951j9642J4955q357K2878Q944k658L281j2949l5848l7836
13665g8282J255J1625K713L0588M1537J7429K659K604j8136l4072k7205k085j8885
13652f8255j4871L1913K0474K9948k659l9834M7744L274K4231J3206J2688J2098
13640F9957J853m228k7897o5337l6143q568N7838L8686J9843L79l425l5045k2550
13627a4637Q580J8676L1966J8400j848k7710n6617l2201K25j1584l519K3622J9086
$$ y = [53181, 21887, 5728, 40039, 64407, 23630, 24573, 49385, 1525, -39767, -55048, -54881, -57971, -48622, -45291, -30490, -11855, 13935, -6022, -27969, -65193, -51447, -7939, -23861, -13631, -40638, -21256, 64920, 92848, 41342, -10721, -15735, -46407, -46870, -44943, -36937, -24400, -19198, -7312, 15513, 25901, -11050, -30692, -15737, -24094, -1216, 7728, 5070, 8351, -4598, -40446, -78282, -77027, -65402, -62689, -32101, 9436, 26865, 29524, 32128, 13992, -20080, -47285, -49370, -68255, -83126, -51213, -30739, -791, -3450, -43284, 4460, 7734, 31965, 45171, 57859, 69957, 71810, 67582, 39685, -25652, -61795, -70363, -12525, 26161, 46004, 46383, 42958, 7913, -14637, -6057, 12619, 44585, 62985, 61137, 33427, -23190, -55391, -55166, -66750, -70269, -46647, -27561]
13614b7561K6450l5244j8813M9323K2910j2909J1334N3605k4420n2038k5015J8048
13602a4330L1314j0981j1088O102j9166k8961q180l208R545r694N7498L5347N0157
13589H4355o841l6812j3698l6480l729J7084l4781R046K3896J1215l3161J4539
13577e367L4429K9384R323m2747j919N927J5623j3557j5668m6678j6968j0559
13565e8777Q31o40j1748j6305j5792M4272O4491m1632m4581O101K3891K6497K1902
13552a490J6692P879O014K7108N547q076J4579j3012n072l5203q331n702m0639
13539c9706j3128J6741k861K0328N124j9366J3377O322L64J3943l0390R529J0041
13526i682j8680j9440L489Q33J2173K6925J41j307P097o084K7037n578j0146J0947
$$ y = [-27561, -1111, -36355, -55168, -5845, 17065, 4156, 15490, 69095, 44675, -7363, -32378, -14330, 16984, 6003, -5085, 1017, -18149, -47110, -55290, -58498, -48953, -58647, -1149, 34198, 84355, 77514, 40702, 27004, -9476, -13205, 3879, -30902, -21856, 2040, 13255, -19906, -5367, 29062, 58446, 67769, 25022, 23103, 29030, 44653, 31096, 15428, -31250, -48218, -58777, -57946, -58586, -70334, -86639, -102431, -58159, 6332, -35300, -79881, -73780, -49889, -23392, -1490, 15202, 23081, 29095, 56203, 61750, 53674, 68253, 55241, 50169, 14966, 6635, 933, -39706, -52834, -36093, -38954, -18626, -13502, -32868, -19491, -13169, -12805, 1138, -29252, -19723, -9682, -28362, -47802, -44313, -43480, -31307, -4382, -4241, -5548, 1549, -4535, 22502, 16924, 6778, 17725]
13512A7725k2499k1705L8186J6387K0755j0987j6119j1196j3825j3899J7534K980
13500C337Q222L054r27L542j8987L134k1441l701K0758J3860j0189j3398L4617
13487B1881p758K547K504j3035M6312J0687l8298j0642j639k7976m8551j7590
13475h1558j2906L8588n91p61N981L561L613K665j2224m8417O393M7112j2991
13462f1535l5464K3234M3168k0866J2995j9947J793K958m017L8127J8226l8542
13450c9870P146J5751r934J4917j4994Q981K046j6700k318K9692j7412j7967K6253
13437a4409m80N149J068m6679m1210n1246M883M3391M7436M1681r854J2800K3512
13424A6042l3765p396J596M8371j0028k3871l6312k018j8605L2954N0765l043
$$ y = [17725, -4774, -26479, 11707, 28094, 48849, 37862, 21743, 10547, -3278, -17177, 357, 3337, 11559, 14613, 13686, 17228, -1759, 1375, -20066, -23767, -3009, 10851, 662, -12736, 21881, 14123, 16670, 19174, 6139, 52451, 63138, 24840, 14198, 12559, -15417, -63968, -81558, -94464, -55876, -56467, -57228, -51247, -47686, -44073, -41408, -53632, -102049, -95656, -48544, -61535, -96999, -73765, -30597, -51463, -38468, -58415, -56622, -53664, -57681, -19554, -1328, -39870, -32724, -16973, -26907, -11990, -26984, -18003, -15957, -32657, -34975, -5283, -22695, -40662, -14409, -14889, -9740, -8672, -55351, -96561, -147807, -142924, -99533, -52097, -10416, -20270, -7470, 16042, -17723, -25119, -23523, 24848, 14820, -9051, -45363, -47381, -65986, -33032, 17733, 14690]
13412A4690O631J2976J5687m2844j3096J6969Q967j0370k4290j1751j4073P127
13400c3377L7576J4385l9804J1484K4048k34l4755Q327k265j1069L847l2895m9035
13387a03767p153j2490J7890J4414M4259M357j974j5059J379M0928M0667J3468
13375C6919k1324k0764j2338L542K5862N2752L4529j3298O132K0328j0127j2068
13363I0145o920m924j3126o6562k1557L6064J2528j9060r513K9783J6851J0897
13351E4606j336n0513r548L6996k653J9826N497j8116m9802k1694J3712K6176
13339C151J0142j1447j6569n213k024J622J3066K0935J4457n577m6441Q210j4851
13326c0539J1282j8431j8187J689K6172J3401O723J3737j9306k2494M4152J464
$$ y = [14690, 21321, 34297, 49984, 7140, -5956, 11013, 19980, 9610, -14680, -26431, -40504, -33377, 4199, 18584, -21220, -9736, 14312, 14078, -20677, -12350, -14615, -25684, -21837, -54732, -103767, -110920, -123410, -105520, -91106, -46847, -42490, -44464, -59523, -58144, -17216, 23451, 36919, 15595, -5169, -17507, -13965, 11897, 64649, 99178, 85880, 92012, 112340, 102213, 90145, 83225, 78301, 65175, -1387, -22944, 13120, 25648, 6588, -2925, 26858, 43709, 54606, 53270, 2757, -6791, 30205, 27552, 47378, 52875, 34759, -15043, -36737, -23025, 3151, 13293, 1846, -14723, -19936, -21960, -20338, -7272, 13663, 28120, 22543, -23898, -15688, -30539, -19257, -37688, -55875, -54186, -28014, -14613, -7890, 5847, -13459, -35953, 8199, 9663]
13314I663o434r408k4344J7024q236l5029l8669Q760K4354M2074J6385j2187l3621
13301d9668q957n482J3024O772J97l2492k2713J9988K2477K3650L3538o217p867
13288a3750J2669L4954J0191n1303k2706K1007L2750l3373l2521m4973K8438O1619
13276C002K6146m360L8051R590l2045m223L078L844k141m2064k1507M253k8751
13263d7127L1478K0848n133j1518k9914l6402R590J8589K9095K4537j1829Q104
13251C18N395j029j6332m7283J3651J4797J0680J4467m702K84q103r378P361K3029
13237C155J6806K9015J0866m5218R656q840m6382J9659L3057O566N047K6519l6849
13224B3057P178K6622J0510m7753k2576M3576M253j2299Q099l6972l2966j5554
$$ y = [9663, 3229, -6179, -30523, -13499, -21735, -56764, -95433, -86673, -62319, -20245, -3860, -16047, -49668, -58625, -64107, -51083, -44311, -44114, -76606, -99319, -79331, -56854, -33204, 334, -5883, -13750, -1081, 33873, 44064, -7239, -29945, -8938, 23812, -9561, -42082, -87055, -58617, 3002, 29148, 24788, 62839, 72429, 40384, 36161, 39239, 43083, 40942, -1122, -22629, -18376, -47127, -15649, 5199, 66, -11452, -41366, -77768, -68178, -49589, -20494, 4043, -7786, 318, 5713, 4684, -11648, -58931, -45280, -30483, -19803, -5336, -10038, -9754, -17857, -27235, -19874, 3155, 19961, 48976, 59842, 14624, 24280, 15440, -30942, -11283, 21774, 28340, 33387, 59906, 23057, 30235, 56857, 67367, 19614, -2962, 40614, 44867, 32568, 40667, 3695, -29271, -44825]
13212d4825J5404Q421k1986r677j839K8568j417m245N328L255J4511K2073r201
13199D370P376K3713q363m9K5850n932l449l4012N56j6675k7299J3541K9421L8693
13185D7741J1652O315j8146n0849j2444J5617j9852j0138n671M3000K3968J007
13173C2200j1934j683J1733J6900Q484j5240k8861j5834J9407L8527p781l516
13161D2402j0562P29n805k164M3728K8186J2239l8303l2659l0873k2316J8658
13149C260L5161P700J0747n3832k5379j454j1619K1484O462n504q002p610p399
13136c5985M4435r34j6480l84K5029O864l031k5931m2186l1638R218N4253K8777
13123A2007k133J8943R556L457K1568k9093P468M5539N182k253p237j5105K0936
$$ y = [-44825, -29421, -21000, -42986, -52663, -54502, -25934, -27351, -31596, -26268, -23013, -8502, 13571, 4370, 11746, 35459, 27096, 27047, 52897, 46965, 43516, 9504, 10060, -6615, -33914, -20373, 9048, 47741, 59393, 65708, 47562, -3287, -15731, -114, -19966, -30104, -35775, 7225, 31193, 32200, 20266, 18583, 30316, 47216, 55700, 40460, 11599, -4235, 15172, 53699, 45918, 42402, 31840, 32569, 26764, 24600, 68328, 96514, 108753, 70450, 37791, 6918, -15398, 3260, 38421, 46121, 56868, 3036, -22343, -23797, -35416, -13932, -7470, -12974, -20976, -28586, -35985, 8450, 7516, -8964, -9348, 15681, 22545, 19514, -6417, -48603, -80241, -71023, -16770, 12007, 9874, 28817, 38373, 41830, 63398, 34305, 41773, 87312, 92494, 90241, 83004, 67899, 88835]
13110H8835J8323m065k0538m8965j4986J5944J3454j7049n765p182P834K5525
13098E1365m2159k8752n905l535j2127J2085K2155L9294K2160j3867l4662j7543
13086a1491J9967K6567o089k6109K5747j6673o313oj9216l576q997o388J3917
13073a8660L3768k18k6293J2975M4728o932k278k42p81p397j1383R775N115k3275
13059H902j8521k1551n586l2258j5580K3207N0632N611K6014K4398K3351k1693
13047D6926j4160J0847k8882l3718K1154l614j0709M4794K1274j6923n157J2407
13035D4239P937j3214p869k046J5092m94K7650K1133J148k2841l5063k7893N210
13022A2989k435j8481n045j2094K0133q423R873K7903K0812q611J5473K9363k7544
$$ y = [88835, 107158, 103093, 82555, 33590, 18604, 34548, 48002, 30953, 25188, 18006, 25840, 51365, 9206, -19546, -25451, -28986, -41113, -29028, -6873, 32421, 54581, 40714, 6052, -11491, 8476, 35043, 28954, 2845, 28592, 11919, 5606, 5600, -13616, -17192, -26189, -32577, -18660, 15108, 14890, -11403, 1572, 46300, 39368, 37090, 36848, 36067, 28670, 17287, 27062, 32177, 8902, -9619, -31170, -36756, -69014, -84594, -61387, -10755, -5144, 20870, 45268, 68619, 46926, 32766, 43613, 14731, -18987, 2167, -1447, -12156, 32638, 53912, 36989, 31832, 44239, 52176, 38962, 31093, 29047, 44139, 43645, 71295, 92428, 93576, 70735, 35672, 7779, 12989, 10554, -7927, -12972, -25066, -4933, -13356, -3483, 24420, 45232, 36621, 52094, 81457, 53913]
13009E3913m2096J5449n37J6265N9695j5978m0188J1448N555j0806J7517J06197
12997A76434Q2309R7110O9105N8297R3677O6528M1259k4555q3422q7858l2049
12986D56835q1974q5612j11654l7675l3806l3054k7921j1882j278K0537n005k093
12974D5418L33R183n3168Q16k6907k7668M2685N0559J0169L723o685m234j959
12961D2265m2263j7408J3561Q553m853L7855J1823p433l0528n5328k1590p280
12949g2626L4999L6136j6428r678M2835J3477O851K157j4734O553o7865Q584M0033
12936A0294m2r430K9009J5272j6175K2657J3002M6622p403k8829j3199k5571P938
12923D4145k3076J1364j7780l6619l5613M257k470q229N693J6515J8511N727j0591
$$ y = [53913, 11817, 27266, 26729, 42994, 102689, 86711, 46523, 57971, 63526, 52720, 70237, 176434, 258743, 355853, 424958, 483255, 576932, 643460, 684719, 660164, 576742, 488884, 456835, 374861, 289249, 177595, 139920, 106114, 73060, 45139, 33257, 31979, 52516, 47511, 45418, 45751, 54934, 1766, 2582, -24325, -51993, -9308, 41251, 51420, 55143, 48458, 44224, 42265, 2, -17406, -3845, 4708, -145, 37710, 49533, 42100, 11572, -43756, -65346, -72626, -37627, -1491, -17919, -27597, 15238, 28715, 35566, 37723, 22989, 29542, -38323, -29739, 10294, 10252, 822, 29831, 45103, 28928, 51585, 64587, 111209, 103806, 74977, 61778, 36207, 44145, 21069, 32433, 14653, -21966, -57579, -53322, -55792, -64021, -58328, -41813, -23302, -17575, -28166]
12910b8166J6501K9816j0647K4168j7060k3899l8152J4509M2957K4804j2850m643
12898A7338j3564N087J1819k1545l254K3955K3745O829l5919m3307J8576L8396
12886B8156p775l1830J5583M035l2234k9441j8389M1472K3778k111k5309M896
12874b9169J8511q538O896j7849j1216Q038K1458K3260k6346j2176j1216M2141
12862C794J1465l6417o718O4026k7477o5461l0608j7567K9509O4760o62K8429
12850A7073p903L2449L0103j2424j414K6578n6722p7760K1199K844Q108O1719
12838D3850j5562l5772l1215O674J0730J8022K5391R205Lj171L315P277J262L0789
12824G2798K0456R162J2977k9638J0103k0902o9260K2571L1485l0623j4665M482
$$ y = [-28166, -11665, 18151, 7504, 31672, 14612, -9287, -47439, -32930, 10027, 34831, 21981, 17338, 3774, 8861, 20680, -865, -4119, 19836, 43581, 50410, 14491, -28816, -10240, 28156, 20381, -11449, 4134, 8169, -24065, -53506, -71895, -30423, -6645, -8756, -34065, -29169, -10658, -19196, -12300, -30149, -41365, -33327, -11869, 11391, -14955, -27131, -38347, 3794, 15259, -21158, -27876, 36150, 8673, -56788, -87396, -104963, -75454, -10694, -11356, 17073, 9170, 41619, 71722, 59298, 57884, 84462, 27740, -50020, -28821, -25977, -17869, 43850, 28288, -7484, -38699, -32025, -21295, -3273, 22118, 31323, 31326, 30155, 33470, 40747, 42009, 72798, 93254, 102416, 115393, 85755, 95858, 74956, 5696, 28267, 59752, 29129, 14464, 18946]
12812A8946k5032J9180J0372n86J3110J9763L069l2571j8154R23J8247L3007k9251
12799C1023l7309K3850J472j6018K4676j0763P370j9278j9561l7768j1927L8468
12787b5765L9420M2186L615m08k2657l2316K0883j189J3810j7322j899K5366l454
12774D0270l0043k1002o169L4346M4192k0500l017L285j0077j3568r130J630M4596
12761E4813M0422L364K953j7502l1937J9474q792j3288l8683k9213K1450M9008
12749E2069J3632L5837L0090M808k0558j6587l2271m0909L0325L5372L2407k6436
12737I7779m5467l3625j5008M395M174L1453L3575j7873k8825m1734n5206j2574
12725g8936k79O448J5350K7475M3559j734k215M984M924J1869N217k8727N318
$$ y = [18946, -6086, 13094, 23466, 22880, 35990, 55753, 58822, 26251, 8097, 9020, 27267, 60274, 31023, -6286, 17564, 19036, 3018, 27694, 16931, 24301, 5023, -14538, -52306, -64233, -25765, 13655, 55841, 59456, 59048, 36391, 4075, 24958, 23769, 37579, 20257, 18358, 43724, 40270, 10227, -10775, -16944, 17402, 61594, 41094, 38077, 41362, 31285, 17717, 8587, 10217, 54813, 95235, 98599, 101552, 84050, 52113, 71587, 62795, 49507, 10824, -18389, 3061, 52069, 65701, 101538, 131628, 136436, 115878, 99291, 67020, 26111, 56436, 91808, 124215, 97779, 52312, 18687, 3679, 8074, 12248, 43701, 77276, 59403, 30578, -11156, -66362, -78936, -79215, -72767, -57417, -29942, 13617, 11883, 9668, 14652, 19576, 31445, 36662, 7935, 13253]
12712A3253M412m0506K2451M48J5663m055j8636m5378j6023N3641M1435Q2672
12700A09377K8885j7274L1988P4486M4620j2094m753o9155j2785J4457j963J6975
12688B02764j2097n8603J2285j2338j4677o330j5560N316o44q652m8464J5936
12676E8936K0913j1492m648k4085L5767j7044m0343L2286l5380p6778j8569O6683
12664a3754M4724N3847o710l255K6948L0494l212L431L037j975r469L0687l672
12651A51121L260K0985L2991L910j3897L0738L1615N574k138q427o3190k5113
12639A67429K7838J1825J2548j7085j7026j0201j1025M017M7444M7789P9912k0600
12627C22865j3956J1621L8497K5488L4681K486M980N892l9101L2233M3896M7042
$$ y = [13253, 17665, -22841, -390, 58, 15721, 11666, -6970, -52348, -68371, -14730, 26705, 109377, 138262, 120988, 152976, 227462, 272082, 259988, 255235, 186080, 173295, 187752, 185789, 202764, 190667, 132064, 144349, 132011, 117334, 111004, 95444, 100760, 100116, 91464, 43000, 58936, 79849, 68357, 63709, 39624, 75391, 58347, 18004, 50290, 14910, -61868, -80437, -13754, 30970, 84817, 78107, 74852, 101800, 132294, 129082, 132513, 135550, 133575, 124106, 154793, 151121, 154381, 175366, 208357, 212267, 198370, 229108, 260723, 266297, 264159, 255732, 192542, 167429, 195267, 207092, 219640, 202555, 185529, 175328, 164303, 168320, 215764, 263553, 343465, 322865, 308909, 320530, 359027, 384515, 419196, 421682, 426662, 432554, 393453, 425686, 469582, 516624]
12615E16624N1167K5172L3080M1501o28K0068M8070J4369J6606M0183Q4629O9905
12603I60746J07923P9211N9408L6497P1144J11769J59805J77178J94237K55149
12593B213067L16786L45539M09979M99324O25652O70873P29855P95211Q94390
12584G500676R56121J056845J197805J575512K216730L245846M855632P274837
12576B9880004J0648835J4449520J6809377J6851098J5335220J2664286P444723
12569A24083063k61251p391418j1777531j4223598j6047955j6505423j4589580
12562D3286307j1151820p730330n129110l390072k284095j596185j183831r46046
12554I874818q36015q45965q45022q04570p77450p25426o79349n73163m20934
$$ y = [516624, 567791, 592963, 626043, 667544, 666916, 686984, 735054, 749423, 766029, 806212, 890841, 960746, 1068669, 1147880, 1207288, 1243785, 1314929, 1426698, 1586503, 1763681, 1957918, 2213067, 2529853, 2875392, 3285371, 3784695, 4410347, 5081220, 5811075, 6606286, 7500676, 8456797, 9513642, 10711447, 12286959, 14503689, 17749535, 22605167, 29880004, 40528839, 54978359, 71787736, 88638834, 103974054, 116638340, 124083063, 123821812, 116430394, 104652863, 90429265, 74381310, 57875887, 43286307, 32134487, 24404157, 19275047, 15884975, 13600880, 12004695, 10820864, 9874818, 9038803, 8192838, 7347816, 6543246, 5765796, 5040370, 4361021, 3787858, 3366924]
12545C366924l56941k67982k25873j90123j31809j47148j35442j33421j33456
12536A644729r8339n7256j25688j26513p0563q4979r5809n5509o2714J6029k1599
12525H61789q7682j1056l4952r130o9238j0740m504k9482l8022m5147n7625j6061
12513D48150J9201j0615j6241N246L25k4728n510k3059o2971j8100K6278L690
12501C41666K416n520J3117k2145K4258o730k7728M058j5826k7059P962k229k7584
12488B58656l1094Q704K8882k3981l2328l1014l069L7364R11j8039l0204M1473
12476B06261L9879n0099j1397q198k5394J6530K6144j6176K6299K4836p354k1092
12464B00239l4993k7752o22K9474M089m8704K541J3539P72J05r042j0737o602
$$ y = [3366924, 3009983, 2742001, 2516128, 2326005, 2194196, 2047048, 1911606, 1778185, 1644729, 1546390, 1489134, 1363446, 1236933, 1166370, 1081391, 985582, 930073, 867359, 883388, 861789, 774107, 763051, 728099, 718969, 649731, 638991, 634487, 605005, 566983, 521836, 464211, 448150, 467351, 456736, 440495, 445741, 446066, 421338, 415828, 392769, 329798, 311698, 337976, 341666, 344082, 338562, 351679, 329534, 353792, 347062, 319334, 323392, 307566, 280507, 288469, 286240, 258656, 227562, 236266, 265148, 241167, 208839, 177825, 174756, 212120, 213031, 194992, 164788, 206261, 246140, 196041, 184644, 176446, 151052, 167582, 193726, 177550, 203849, 228685, 221331, 200239, 165246, 137494, 136872, 166346, 170435, 121731, 124272, 137811, 138583, 138688, 129646, 118909, 112307]
12451A12307L2208j1975m1617p1215k7737L2622N9840o54l1065o2253L370J5756
12439I587M5567K5411J1195m6502k920M5962K4761m4790j2728M1347R803j0773
12427I5920R803k8975M1752L8844k8802j9966J2896L081m2154j3326J1525q272
12415G2326j0723k9649r225L6361k2860K864j3228k5213j297L4500L5569l5181
12403C4244N5K8664l0205n1387R315M4804J2007J8691n772j2018p358q788p490
12390B4762j0452J2542J7790k802K2617J6193j330l7740l6733k8699J8770L8720
12378C3638n809j0848M2605N6818j3025j7322K5110j8141l5989l884K9594p232
12366G5515l3386J4750k5893k0732J3569q106j869N322q943K783J6122P773j2908
$$ y = [112307, 144515, 132540, 90923, 19708, -8029, 24593, 84433, 83779, 52714, -9539, -6169, 9587, 55154, 80565, 91760, 45258, 42338, 88300, 113061, 68271, 55543, 96890, 106693, 95920, 105723, 76748, 118500, 157344, 128542, 108576, 121472, 124553, 82399, 69073, 80598, 72326, 61603, 31954, 22729, 59090, 36230, 39094, 25866, 653, -644, 33856, 69425, 34244, 34299, 62963, 32758, -18629, -9314, 35490, 47497, 66188, 60416, 48398, 41040, 32252, 24762, 14310, 26852, 44642, 41840, 64457, 80650, 79320, 41580, 4847, -23852, -5082, 33638, 27829, 16981, 59586, 116404, 103379, 86057, 111167, 93026, 57037, 53153, 82747, 75515, 42129, 56879, 30986, 10254, 23823, 15717, 13848, 19170, 10227, 13010, 29132, 36905, 23997]
12353B3997j4481K6337J8873l0559J4104N1983j6607j8649K8257J6307j5552N038
12341H9048N634J832j7104l1327m0430J6658j8264R728n907M0094K2886k1752
12329E1096L974n0286r084J2382J1254r623n619O659O920M0572Q005r350n1622
12316E278m2428J1000K0235J9470k8061l689K4715J1706Q904k091K3976J7446
12304F6461k7785l1792j6239O702O486J227k048L0937J7324l504M902J4248j8333
12291D8586m6056j2669L794o975K3999n241l776N0772o924J2446J0509k4503Q81
12278D4843R305j7180j3117J2594l4008l9356j5684J5412L8519r822m042K7288
12266A4752M1627k1772m9805l7105k5851J138L234L5193J8573J3606M9305K9999
$$ y = [23997, 9516, 35853, 54726, 24167, 38271, 90254, 73647, 54998, 83255, 99562, 84010, 89048, 94682, 96514, 79410, 48083, 7653, 24311, 6047, 15775, 9868, 49962, 72848, 51096, 55070, 4784, -4300, 8082, 19336, 9713, 4094, 10753, 17673, 58245, 66250, 56900, 5278, -37150, -26150, -5915, 13555, -14506, -18195, 6520, 18226, 27130, 25039, 49015, 66461, 38676, 6884, -9355, -2653, 3833, 5060, 3012, 33949, 51273, 47769, 52671, 66919, 48586, 2530, -10139, -6345, -13320, 10679, 5438, 1662, 52434, 45510, 57956, 68465, 43962, 44843, 54148, 36968, 23851, 36445, 2437, -36919, -52603, -37191, 1328, -8494, -12536, 14752, 56379, 34607, -15198, -52303, -78154, -77016, -73782, -38589, -20016, -6410, 42895, 72894]
12254G2894l689M9m3404j8818m573R537o163k0816N4265L3875j1087P504o4299
12241E275k3875P269L7195J1936K4182o1867k2958J4170j672M8699l311K095R515
12228D6653J6131l063j764j8794j9744O082l0220k2410l3180M924l7718j2896
12216a05999O180l1912M3639N4744N475k701J9033J3315j6880j7747Q840L803
12204b0210J1020J0628j0941l2134k755j0826n238j7471m0718K2872K4684M2256
12192b8833L4343l515N122K2821o42K1692m6658j7533K2793j8534M136L5891O7972
12179I9055m2827k8044J8829j7530L888K550k4211J6795M9578j1801K1994K5259
12167A13535l2995n851l972J3414j8341N698m2257j4396J9581N6754L1595j5116
$$ y = [72894, 69205, 69254, 25850, 7032, 2459, 11996, 5833, -14983, 39282, 73157, 62070, 69574, 5275, -18600, -11331, 25864, 37800, 61982, 115, -22843, -8673, -10345, 38354, 35043, 37138, 46653, 62784, 59721, 57957, 39163, 19419, 25501, -4719, -27129, -60309, -55385, -93103, -105999, -99819, -131731, -88092, -33348, -27873, -30574, -11541, 1774, -15106, -32853, -24013, -20210, -9190, 1438, -9503, -41637, -44392, -55218, -60456, -77927, -118645, -95773, -71089, -28833, 5510, 1995, 7117, 29938, 29296, 50988, 4330, -13203, 9590, -8944, -4808, 31083, 99055, 56228, 28184, 47013, 29483, 33371, 35921, 11710, 28505, 78083, 66282, 88276, 113535, 80540, 74689, 70717, 84131, 65790, 71488, 29231, 14835, 34416, 91170, 122765, 107649]
12155A07649n2618l8223L4026O3506J6842m633M4931Q1384J02995J10060Q5857
12144E51776N0532K8945K4811k4046Q06m5232p1947j15331n8009p0378r6663m6895
12132A28369K8837m735k6474l0534q431l0482n0250l0569l8117J7479L3834j6134
12120b7207k6971K52Q777O0425K8723j1194j9105l397j2383j5239J6337k9563
12108c0545J2268K9235l9581m9238l2186q22M6712N3506j765L0115J2102j9088
12096A0713p503j0880l829n769K262J0630k8363Q61L9836p04j6166k621K7896
12083A6363N3181l668m2219k064L0370K1225O856k687k1709N567R173j8498j8363
12070C3527jM3171m710o2904j5098J0236R116J1587l1830l5130K3541J6386R683
$$ y = [107649, 55031, 16808, 50834, 114340, 131182, 126549, 171480, 252864, 355859, 465919, 551776, 602308, 631253, 656064, 632018, 632824, 587592, 515645, 400314, 342305, 271927, 175264, 128369, 157206, 152471, 125997, 95463, 87032, 56550, 6300, -24269, -62386, -44907, -11073, -27207, -54178, -53926, -45149, 15276, 43999, 32805, 13700, 10303, -2080, -17319, -982, -30545, -18277, 10958, -28623, -77861, -110047, -110869, -64157, -10651, -12416, 17699, 29801, 10713, 3210, -7670, -11499, -17268, -15006, -4376, -32739, -31878, 7958, 7254, -8912, -11533, 16363, 69544, 65876, 23657, 21593, 51963, 73188, 80044, 77357, 55648, 61215, 70388, 51890, 33527, 33526, 76697, 71987, 9083, -6015, 4221, 13337, 24924, -6906, -42036, -18495, -2109, 7574]
12057G574L0237O4070J6538l5583q466J1045L7189O6107P6600M7316J03077J52504
12045E68208J30987J44292J53332J55815O9480N7435j6566r0529j76581k17560
12035G78313j87796j49293j07149p479j10563n2910j8732j8368l4j4383j2130
12024I9476j8594j6870j1120l0604M17K5566K5605k5236q164L317m1443l6186
12012c3836L5284J6081L3205J613k7826l3795k2568k0848k0427J0105O2478N715
12000E181J004k2161K2356K3315l2229j9364J5781L7700M8962K2313m4026j0948
11988D7884k0508j3964J5274l314j7227p282j2258k195K7053k4100m0717l6988
11976h8342L7071N2849P095k5028l906N582J1816L1489k5584j5095j0822j484
$$ y = [7574, 37811, 101881, 118419, 82836, 74370, 85415, 122604, 188711, 265311, 312627, 415704, 568208, 699195, 843487, 996819, 1152634, 1222114, 1279549, 1262983, 1172454, 995873, 778313, 590517, 441224, 334075, 326596, 216033, 163123, 144391, 126023, 125989, 111606, 99476, 80882, 64012, 52892, 22288, 22705, 48271, 73876, 48640, 40476, 43793, 2350, -33836, 1448, 17529, 50734, 52347, 24521, -9274, -31842, -52690, -73117, -63012, -534, 5181, 6185, -15976, 6380, 29695, -2534, -21898, -6117, 31583, 80545, 102858, 58832, 47884, 27376, 13412, 28686, 25372, 8145, 863, -11395, -13590, 13463, -10637, -51354, -88342, -51271, 1578, 8673, -16355, -20261, -14679, -2863, 28626, 3042, -12053, -22875, -24359]
11964b4359j0286K231K0939K0460l5389l6099J2150K2151j4476J6539l770l5399
11952f5308J4143K2891R160o25J3913N0557o840l6098N945l228k976L464K3023
11939B8021L565k4021k746k7268J5365m336J7801n554l7459k9989k265K4621L5851
11926h414L494j6766j575M4790L0099k2387k1960K4205K785N6939j8240m6799
11914B6171n8901j294J9490l3757j6134K1339K5861l505k282p513K2920j5612
11902b3217N670M1370K0474m0629K6286M093k2860J2822m0310k4605j9969O4561
11890C686L6688l5043k874M6784k4119k3671K611K477k5754k8782o940o419K7272
11877c4084J0760j59k3190J1013N224k8469K0066N8094L1969K8254r698k3388
$$ y = [-24359, -34645, -32414, -11475, 8985, -26404, -62503, -50353, -28202, -42678, -26139, -29909, -65308, -51165, -28274, -19114, -19739, -5826, 44731, 37891, 1793, 7738, 4510, 1534, 4998, 28021, 31586, 7565, 4819, -22449, -7084, -11420, 6381, 827, -36632, -66621, -68886, -44265, -8414, -4920, -21686, -23261, 21529, 51628, 29241, 7281, 31486, 34271, 91210, 72970, 26171, -32730, -34024, -14534, -48291, -64425, -43086, -17225, -20730, -23012, -30525, -7605, -23217, -17547, 23823, 44297, 3668, 29954, 34047, 11187, 24009, -16301, -40906, -60875, 3686, 40374, 5331, 2457, 49241, 25122, 1451, 4062, 6539, -19215, -47997, -54937, -61356, -34084, -23324, -23483, -46673, -35660, -30436, -58905, -38839, 19255, 51224, 79478, 69780, 46392]
11865D6392m2591J803j1113l7720n192l7128k1702M5903J7920j1410j2163J0666
11853e6335L1536Q49L3162M6675r706l2607q589K7275K591k9742K9686K629j6009
11840B1415J6045Q636n307l1825K026j4823R916J9977k962l6357m5159j0320M4597
11827b4141J0882R225J9179k855j9585J4100M127p814l2080l1180n2642M3211
11815f9573P1192K3215j9901j6156P270o305O430N466P711k7473J414Q792L7916
11802B9998R442j0861j2217k1952J7625K185J2876L4169p90P548m0118J3722L9218
11789H0845n104p343n3083k4919l2634r624J9781N4585K9891J4962J2783j3788
11777F6352j2981k4851m6775l6985r39r816P582j6991K4647J0379Q387j2033l257
$$ y = [46392, 3801, 5604, -5509, -43229, -48421, -85549, -107251, -61348, -43428, -54838, -67001, -56335, -24799, -23950, 9212, 55887, 46181, 13574, 4985, 32260, 34851, 5109, 34795, 37424, 21415, 37460, 46096, 40789, 8964, 10990, -3833, 6083, 26060, 23098, -13259, -58418, -68738, -24141, -13259, -4034, 15145, 12290, -7295, 6805, 10932, 3118, -28962, -60142, -112784, -69573, 1619, 24834, 4933, -11223, -3953, -10258, -3828, 1638, 9349, -18124, -16710, -7918, 29998, 39440, 28579, 16362, -5590, 12035, 14220, 27096, 61265, 60475, 68023, 27905, 41627, 80845, 75741, 68398, 15315, -9604, -42238, -51862, -32081, 22504, 52395, 67357, 80140, 66352, 53371, 28520, -18255, -55240, -56179, -65995, -58413, -75404, -50757, -40378, -31991, -44024, -47281]
11764d7281J4184L1074j2325r415R478J1474J3680j4166r776L5413J9434j240
11752D0534n7265j1446J8418K3400o7429l3649l015k312N454L6012O965k0681
11740f5014l7213J8291K2886O195j7658k5023q166J5995M5967L7692J2781k5281
11728a8548m238k054p05J6771J3107L4064k7052k1052j0847o21j0905k4710m4684
11715a01474R91R079K7519N7162k1110m9221J8183J3518m5742K597K138j4702
11703a01062N6723L7378k4161K6903K3076j2854L0685j0017j0483N661j3820m8169
11691d0140Q668L0453K2315m1455l3773l356M6817O417k1976k7468K583N593J0023
11678c5299K1932j8280O284L825m7008J7122K6981J7967K0513R598K7078K4169
$$ y = [-47281, -33097, -2023, -14348, -23763, -14285, -2811, 10869, -3297, -13073, 22340, 41774, 40534, -16731, -28177, -9759, 13641, -53788, -87437, -90452, -92764, -87310, -51298, -44333, -65014, -102227, -83936, -61050, -54855, -72513, -97536, -105702, -89707, -43740, -6048, 6733, -18548, -22786, -24840, -25545, -8774, 4333, 38397, 11345, -9707, -20554, -21175, -32080, -56790, -101474, -100483, -91404, -63885, -6723, -27833, -77054, -58871, -45353, -91095, -88498, -86360, -101062, -44339, -6961, -31122, -4219, 18857, 6003, 36688, 26671, 16188, 21849, 8029, -40140, -31472, -1019, 21296, -20159, -53932, -57288, -10471, -4054, -26030, -53498, -50915, -45322, -35299, -13367, -31647, -25363, -21538, -68546, -51424, -24443, -6476, 14037, 23635, 50713, 74882]
11666G4882p720k526m4753K110Q183m8286n273L6412J1973r398j3597k5884m9601
11653g3478J1545m47O668J6485j6863K9629K3164k7540q681l6522j84K9363K345
11640d4516K4557K4790j3563J6848J8331k8610K5387M3402J2779k0280j6915k4410
11628A7800P883m220P521O930l6604m4832K1019M8036j7318k4586J248K2676l0294
11615b4741k1831L1151J6990l9635J4355K1791k6511J5733K7862K013l7694j4454
11603c4971J7782J2666k6177k5240J2690P096r28k7943r961J7576N4866K712R14
11590A082j4232j3893j2107j3902m128J9418M1727K5519n671O747j1813J523L8014
11577E8284l1433j3435q21l7240M3655L5252j8772k7294j8492J7179R232r23J6305
$$ y = [74882, 67162, 64636, 19883, 21993, 30176, -18110, -23383, 13029, 25002, 15604, 2007, -23877, -73478, -61933, -62380, -55712, -39227, -56090, -26461, -3297, -30837, -39518, -76040, -76224, -46861, -44516, -19959, 4831, -8732, 8116, 26447, -2163, 23224, 66626, 79405, 59125, 42210, 17800, 25683, 21463, 28984, 35914, -690, -45522, -24503, 23533, 6215, -18371, -17123, 5553, -24741, -46572, -15421, 1569, -38066, -23711, -1920, -28431, -12698, 15164, 17177, -20517, -34971, -17189, -4523, -30700, -55940, -43250, -36154, -37082, -65025, -74986, -57410, -2544, 168, 1082, -13150, -27043, -39150, -53052, -57180, -37762, 3965, 29484, 23813, 30560, 18747, 20270, 58284, 26851, 13416, 12595, -24645, 19010, 54262, 35490, 8196, -10296, 6883, 16115, 15192, 31497]
11564C1497j067L861m4226p840o885m7948N713J5723N4042J2631k4077P418L4619
11551C3461k4828k7140K4574O91J6436j8504K5903J7386k5733J5720K1726J3293
11539G2985n5207k0663l7972j4529L70J4023K5498K068j0752m2069l3903K5779
11527g4372J4037L0555K5790K0167m015J6450j7079k2586M1128l9243n1879k2220
11515h3267L9380N284k4535L4310J634o250l09R197L7607m2468K4099J6841l034
11502H489j023j9800j2305m1330m369K1959J6081L0402J3244o0059k7958J7026
11490e9643j0717l305K5521M7943L0454q753n570O785J0526k1582J4596J3016
11478C9271n992j5756n447O07k7057p426j2485P615K3139j5446J295P384j1292
$$ y = [31497, 30430, 34291, -9935, -17775, -24660, -72608, -66895, -51172, 2870, 15501, -8576, -1158, 33461, 8633, -18507, 6067, 6758, 23194, 4690, 30593, 47979, 22246, 37966, 59692, 72985, 17778, -2885, -40857, -55386, -55016, -40993, -15495, -13427, -24179, -66248, -100151, -74372, -60335, -29780, -3990, 16177, 12162, 28612, 11533, -11053, 30075, -9168, -61047, -83267, -43887, -38603, -63138, -28828, -27194, -33444, -33753, -24556, 13051, -29417, -5318, 11523, 8489, 7466, -12334, -24639, -65969, -70338, -48379, -32298, -1896, 11348, -48711, -76669, -59643, -70360, -73665, -48144, -201, 30253, 21500, 15930, 22715, 33241, 11659, 26255, 39271, 33279, 17523, 12076, 12683, -14374, -21800, -34285, -26670, -3531, -18977, -17682, -10298, -21590]
11465b1590M0193M6912J6530j0807k8880M439k8419l0263K9193J3995k147m960
11453B4196K6935l59N369k413J1195M929O099K736q472l5558M024j4768p058j4884
11439A971j358P1145k6019l9404K201M15L651q556J2865j2303k8706O116k4797
11426d2779J8332M0194J9797L9354o3107n0364L3301M3410o821j2504j6848R854
11414A1819J1985N48m9406o143K2060L5341K5226r408n1286k9307J579J6409J4717
11401e866N714P517k6596k5745j5942J2774M553K4389L7714L2786k9364l3265
11389a1331l371J5920J9367k9906Q302J5114l3005l8572k9510m35n703M157l9846
11376a28819j5981P1640O0045K1590r53O872J5354j7088J784J9637j2763p848
$$ y = [-21590, 18603, 65515, 82045, 71238, 42358, 46797, 18378, -11885, 17308, 31303, 29156, 24196, 51131, 50772, 56141, 53728, 64923, 69852, 75951, 78687, 70215, 34657, 38681, 23913, 16855, 1971, 613, 71758, 45739, 6335, 8536, 8951, 12602, 4046, 16911, 4608, -24098, -17982, -42779, -24447, 15747, 35544, 74898, 11791, -38573, -5272, 38138, 31317, 18813, 1965, 11819, 23804, 24352, -25054, -31197, -9137, 26204, 51430, 42022, -9264, -38571, -36992, -20583, -5866, -152, 7365, -19231, -44976, -60918, -48144, -43591, -19202, 18512, 51298, 21934, -11331, -14702, 1218, 20585, -9321, -1019, 14095, -18910, -57482, -86992, -87427, -93130, -88973, -128819, -144800, -73160, -13115, 8475, 7522, 14394, 29748, 12660, 14444, 34081, 21318, 13470]
11364A3470k8178J5263L3316j3599j5732j072j9766K5903R788J714J0852Q020
11352C9979l9230j6761K4294M4353M5773l2859n1817j3907K7450K3453n9841J2738
11340C625K777K0146J2314m395k8502j6229K4871J6742j039k0657j9507p475P148
11327a0181J9024P535j9362J3546K6384J9614l2084j4292N843k9739k4936j2801
11315e1449R76J195M2839p046k1738K3570R856n158l7356R543K055m60K502M5379
11301A4708k619j2683L600k3674l1747L332R013n0330L0984M8810r225j6966J0256
11288b6541J8361J2082L9278m2434j217J5560j0624k2847j1425q467o911j2017
11276e7202K7209O8077j6597K658m6925m3596j6541N967L520L1587K5475M8675
$$ y = [13470, -14708, 555, 33871, 20272, 4540, 3468, -16298, 9605, 19393, 21107, 31959, 39979, 749, -16012, 8282, 52635, 98408, 65549, 13732, -175, 27275, 50728, -9113, 3625, 6402, 26548, 38862, 34467, 5965, -10264, 14607, 31349, 30310, 9653, -9854, -17329, -10181, 8843, 16378, -2984, 10562, 36946, 56560, 24476, 10184, 16027, -13712, -38648, -51449, -50473, -49278, -6439, -13485, -35223, -11653, -1797, -6955, -44311, -34768, -32713, -33173, -30671, 14708, 12089, -594, 3006, -20668, -52415, -49083, -40070, -90400, -59416, -10606, -19831, -36797, -26541, -8180, 3902, 43180, 746, -471, 15089, 4465, -18382, -29807, -38274, -45185, -57202, -29993, 38084, 21487, 24145, -22780, -66376, -82917, -76950, -73430, -41843, -16368, 32307]
11264C2307n342k9020m558l2146l5550PL2083r893k229K2738r167k626L3868k664
11250a2192m6204l8987J4079L606P2405M9178P190l0052l4738l1467M9787L3657
11238C6262k3333o200l1043m921k5000k8989M913L8059K3474J3714M412P690k4248
11225a5210k0879j0411J0314O656O1307K7701n1059k4258o554k2623K124o042
11213d8934M4502M0615j9793p3222j6077J7975N9377K1586l3871k6329K106M0307
11201H242M028m970k2832j3494K0792j6804r123j0507p03K6409n231K9104K5661
11188C0572j7243K744R186l5282j4428n88R362O888K4035K2567k3100P018j241
11175B0490o80j285j6860N59j6223J4001J4444J0759J3183r310n7205k237L2777
$$ y = [32307, 26965, -2055, -6613, -38759, -74309, -74302, -42219, -52112, -54341, -31603, -40770, -43396, -9528, -12192, -58396, -97383, -83304, -79698, -7293, 41885, 49075, 19023, -15715, -47182, 2605, 36262, 12929, 6729, -24314, -29235, -54235, -83224, -78311, -40252, -16778, -3064, 1348, 9038, -15210, -36089, -46500, -36186, -29530, 31777, 59478, 8419, -15839, -22393, -45016, -42892, -48934, -4432, 36183, 16390, -56832, -72909, -54934, 4443, 26029, -7842, -34171, -32065, 8242, 12270, 7300, -15532, -29026, -8234, -25038, -34161, -44668, -45371, -18962, -24193, 4911, 30572, 13329, 16073, 25259, -10023, -24451, -25039, -15677, -8789, 15246, 37813, 14713, 21731, 20490, 19810, 18525, 1665, 2224, -13999, 2, 14446, 25205, 38388, 29078, -28127, -30364, 2413]
11162B413l8459j7392J5208K860m158m191r692L19J4956K1827J5113P237j5557
11149i516j8635j1063K5281M7551j4512k1972k5128j7637K3207L4356O217j4744
11137C405k9047l409K0345K9459J3616j3665l9975N964K9372O0152q501l2716
11125C5000k3894k4231K601J3599J1886n389K545j6627Q727k443L533l345k9187
11112b7225l2872J22K0240L2717L6339K5598l623l0121r853l2010J447j1396m988
11099c5625r170k8148j8809Q822N5055O24j4262Q81j663L6695J3982r268l0543
11086c1429P096k6498k2452N6327J5852j8797k9072Q723m469M2919L0349o84l3739
11073e874J5089L3758j7981k3225J6195n468k8002J6128J0080j7207J7258p495
$$ y = [2413, -36046, -53438, -38230, -35370, -39528, -43719, -53411, -53092, -38136, -16309, -1196, 6041, -9516, -28151, -39214, -13933, 33618, 19106, -2866, -27994, -45631, -22424, 11932, 18149, 3405, -25642, -29051, -8706, 20753, 34369, 20704, -19271, -13307, 16065, 76217, 67716, 35000, 11106, -13125, -10524, 3075, 14961, 9572, 12117, -4510, 4217, 1774, 5307, 1962, -27225, -60097, -59975, -39735, -7018, 29321, 54919, 51296, 21175, 11322, -20688, -19241, -30637, -35625, -44795, -72943, -91752, -82930, -27875, -27251, -41513, -40632, -42295, -5600, 8382, -886, -31429, -24333, -50831, -73283, -16956, -1104, -19901, -48973, -40250, -44719, -1800, 28549, 27865, -5874, 9215, 42973, 24992, 1767, 17962, 12494, -15508, 620, 10700, -6507, 10751, 3256]
11061C256k7414J6348m1235J6740k511L6542L6047N976N091k8639m6525k6412
11049e2736l8495K5389J9350k937L0796N3364k7110j8523R589J7930r498l1114
11037b3995K2288P6331K3314k2501o1473K8177p504j7998l5310M92K4814R93p497
11024A31K2672O388L1143J2347J0291M450l5841j2978J7626L632l1005k1031J4102
11011B1927j1995k883J2110j1006k371k244J4164L892j260Q219r043k3330m2942
10998d6762j3292J2781j8267P778K8280o886q763K4166P622k5990J6319K5800
10986B786K2882L0850J3333l7611l9971l651J9774j3139M3567R110J5240O355
10974F9525k7449j1764j6887m782l759L9942J8724q749k2021k6012j0280k7458
$$ y = [3256, -24158, -7810, -49045, -32305, -34816, 1726, 37773, 43749, 48840, 20201, -26324, -52736, -91231, -65842, -46492, -49429, -18633, 34731, 7621, -10902, -1313, 16617, 7119, -23995, -1707, 74624, 97938, 75437, 13964, 42141, 34637, 16639, -18671, -18179, 6635, 7628, 131, 22803, 29191, 60334, 72681, 82972, 87422, 51581, 38603, 56229, 59861, 28856, 7825, 21927, 9932, 7049, 19159, 8153, 5782, 3538, 17702, 21594, 20334, 28553, 19510, -3820, -46762, -60054, -47273, -65540, -57762, -29482, -36368, -45131, -20965, -13343, -39333, -23014, 2786, 25668, 56518, 69851, 32240, -7731, -11382, 8392, -4747, 38820, 47930, 63170, 69525, 42076, 30312, 13425, 8643, 4884, 44826, 63550, 54801, 32780, 6768, -3512, -30970]
10962c0970K4782K5230J8447K6768k7896l1208j3410K1808j2651j1571k1000j8837
10950e0508M4875J0020K354J3788K4932r031N770N0698M5343j7618o32R1951O0057
10937B71999N1537Q7463J31329K31826L76616L67024O4400k77768l47955k85861
10927F70610j98974j24143r6985p8344o7086N51J2149L897n129P251m5192K5262
10915A03867L2774J1995q820k598k0385m6252N558J2568l2403k0730K0145j2233
10903D3486J1592r67j4976P712o313l3089L033q898k5952j3058K0099R230k87
10890h388M082K0155K5959K2360j6707l532l026k645k1179k2895j3846j8485J3491
10877b4656J5858m5073L94M5353l644J1347j1801O053j0594m3375K1441j1449
$$ y = [-30970, -6188, 19042, 37489, 64257, 36361, 5153, -8257, 13551, 900, -10671, -31671, -50508, -5633, 4387, 6741, 20529, 45461, 36430, 42200, 92898, 138241, 120623, 119991, 211942, 271999, 323536, 410999, 542328, 774154, 1150770, 1517794, 1582194, 1304426, 956471, 670610, 471636, 347493, 250508, 172164, 105078, 105629, 117778, 121675, 116546, 123797, 78605, 103867, 136641, 148636, 139816, 137218, 116833, 70581, 76139, 88707, 56304, 35574, 55719, 43486, 55078, 54111, 39135, 46847, 40534, 7445, 10478, 1580, -24372, -37430, -17331, -8101, -8388, -4306, 15849, 41808, 64168, 47461, 43929, 40903, 38258, 17079, -5816, -19662, -38147, -24656, -8798, -53871, -53477, -8124, -11768, -421, -12222, -6169, -16763, -60138, -38697, -50146]
10865e0146J7024l230q027l1834k5541O5060L6487M0277M805L218J4449o427k4908
10852C1207l756L5536L9267Q799o7966j5887L0947k996r304j2045K5203M275l0837
10839C2443k3767L5626L761l070o837l2286l6130p317J129K6914r441l7835r527
10826f6337L5435L8970K9828L3007J9423o7545l3376J5614L6483j4528j0248k8563
10814a1837j8480K0279P7131p191K0214L9323o964j7312l9852m6618N780L6397
10802E0870n03q19J9288l867j4050m512j910j23k9013k8392l058J5488k3998K0265
10788d334q64M8506L8916q044j6015M658K2499o445n239k2930j2588o3014l7545
10775f2439N9919R714n920L0840K0160M0158N1904N2016K8111L1861L0131m181
$$ y = [-50146, -33122, -36352, -44379, -76213, -101754, -36694, -207, 40070, 44875, 48093, 62542, 56115, 31207, 27451, 62987, 102254, 111053, 43087, 27200, 58147, 55151, 45847, 33802, 59005, 63280, 32443, 8676, 44302, 48063, 44993, 38156, 5870, -30260, -37577, -36448, -9534, -18975, -56810, -66337, -30902, 8068, 37896, 70903, 90326, 22781, -10595, 5019, 41502, 26974, 16726, -11837, -30317, -10038, 67093, 59902, 80116, 119439, 112475, 95163, 55311, 8693, 14473, 50870, 50367, 49548, 68836, 64969, 50919, 46407, 44497, 44374, 15361, -13031, -16089, -601, -24599, -4334, -5198, 43308, 82224, 74180, 58165, 62823, 85322, 78877, 73638, 50708, 38120, -24894, -62439, -2520, 7194, 1274, 32114, 52274, 92432, 144336, 196352, 224463, 256324, 286455, 282274]
10763B82274o9113n6333k6428m2604l0916P565l8460J0149l8797k4354M6337M2385
10751F1705J4318k4790q122j6628o937L0534k4444k1740K3947L7197m4295j0633
10739A0112K1805J6646j5420n412k3343Q434L1895o756J9633J8697r277K692l432
10726F6274l2838k0821j5773l0617J8550K0281M7469k0506o5909j7806J081L0341
10714b0274k076l2927K3022K4866J2513j1591K3135K6690l1739j5710R671k230
10702C350K1296j0305o027k9777J2426P2642J5972K4517j4545l4000K3332K4262
10690A03143n925j5568Q800l2253K210K6652J2431N953o1519J7654J1434l418
10678F9594K7459j5497m2948O0942L9869J1992l5434J4714L2661m1455k721Q808
$$ y = [282274, 213161, 156828, 130400, 87796, 56880, 64445, 25985, 36134, -2663, -27017, 19320, 61705, 76023, 51233, 43111, 26483, 19546, 50080, 25636, 3896, 27843, 65040, 20745, 10112, 31917, 48563, 33143, 27731, 4388, 12822, 44717, 37961, 57594, 76291, 67014, 69706, 66274, 33436, 12615, -3158, -33775, -15225, 5056, 52525, 32019, -33890, -51696, -50615, -20274, -22350, -55277, -32255, -7389, 5124, -6467, 16668, 43358, 11619, -4091, 5580, 3350, 24646, 14341, 8314, -21463, -9037, 63605, 79577, 104094, 89549, 55549, 78881, 103143, 97218, 81650, 90450, 58197, 60407, 87059, 99490, 105443, 43924, 61578, 73012, 69594, 97053, 81556, 38608, 99550, 139419, 151411, 115977, 130691, 163352, 121897, 119176, 127984]
10666A27984k5250m3744k8336m1187l7777L3276J1273L2376l8102k0900L8995
10655H608J7447k4311K1263K8883M863N378O343M0403L551K1261P583o0139m7047
10642C4086K7156Q6436J39453J32982N6657n9386j14946q5868l6927O560l2145
10631A54058m9029k7651k1653K0433J7745L9257j3080o0065p129O5146N97r504
10619A09125J4463j681p4164m7771M567J6731N1241J6224L03l56J0453J7298j1881
10606A04552J4411K4723L0997j3993p638Q707J248N282L7302o037K7769L4153
10594B61476J1145J0757J4761j0013j8950J8623K4191j9478j2326l0431O801J7855
10582B74411j918M2647k732j9031j331L3733O9479L1409J6309J5742K9445K5530
$$ y = [127984, 102734, 58990, 30654, -10533, -48310, -15034, -3761, 28615, -9487, -30387, 8608, 26055, 1744, 23007, 51890, 56753, 62131, 68474, 108877, 112428, 133689, 141272, 81133, 34086, 61242, 147678, 287131, 420113, 476770, 417384, 302438, 216570, 179643, 186203, 154058, 105029, 77378, 55725, 76158, 93903, 133160, 120080, 60015, 52886, 118032, 118629, 109125, 123588, 121907, 47743, -28, 4539, 21270, 72511, 88735, 89038, 88682, 99135, 116433, 104552, 118963, 143686, 174683, 160690, 153052, 161759, 163007, 168289, 205591, 199554, 227323, 261476, 272621, 283378, 298139, 288126, 269176, 287799, 311990, 292512, 280186, 249755, 256556, 274411, 272493, 315140, 312408, 293377, 292046, 325779, 395258, 426667, 442976, 458718, 488163, 513693]
10570E13693k5531m0647k176M3179N1906J7699J1413O1542O2208L0756N8896Q1066
10558H64004J1153o700L8467M0554K4761K4963M0720P889O5787R3434P3678M6547
10546A325257N6190P0460J10910J09054J19772J44678K10223K66016K75802K37699
10536B926061K52261L53323M33910N26644O86891Q25604P79006N99623M90457
10527G873780O50309R50421J350825J809889K362856L183485M280982N881673
10519B8344220Q238995J2129092J8744497K9791956M7019724O7529691P1271611
10512B83069786K4612445m7127640p4258008o0275654l9567191k4817105j5873414
10505D5763219j0539451p230810n064008l706816k847886k195062j690842j317275
$$ y = [513693, 488162, 447515, 445339, 488518, 540424, 558123, 569536, 631078, 693286, 724042, 782938, 864004, 875157, 868457, 906924, 947478, 972239, 997202, 1037922, 1045811, 1111598, 1205032, 1278710, 1325257, 1381447, 1451907, 1562817, 1671871, 1791643, 1936321, 2146544, 2412560, 2688362, 2926061, 3178322, 3531645, 3965555, 4492199, 5179090, 6004694, 6783700, 7383323, 7873780, 8524089, 9474510, 10825335, 12635224, 14998080, 18181565, 22462547, 28344220, 36583215, 48712307, 67456804, 97248760, 144268484, 211798175, 283069786, 307682231, 260554591, 186296583, 126020929, 86453738, 61636633, 45763219, 35223768, 27992958, 22928950, 19222134, 16374248, 14179186, 12488344, 11171069]
10497A1171069r80918o96208n63321n81042p92581q30464p71365p03316n72026
10488D679828m67340l68343l33322k05092j18971r9429j00328k01731k76810k03318
10478B305144j81954j64796j25192j30262j33995m8846m0908q2426j11007m3089
10468A242669p9525l2566k6117n7692o845p285n3324o8686n9192m0315l6901k8636
10456G45585j9039o074j9714m9926j8886p303k9719k2699l8105j0243m0660j7295
10444D65922J043L2469j993m0200k1474O139K0160j167l0679l2641j0678L31k466
10431C84766p263r628j3311R035J3156N344j0278r045j9291l8293j6141L6109
10419C25160L353J7149J7802n0503m4329N505M7182K8306J22p414j1762l4286
$$ y = [11171069, 10190151, 9493943, 8930622, 8349580, 7556999, 6726535, 5955170, 5251854, 4679828, 4212488, 3844145, 3510823, 3305731, 3186760, 3087331, 2987003, 2785272, 2508462, 2305144, 2123190, 1958394, 1833202, 1702940, 1568945, 1520099, 1479191, 1396765, 1285758, 1242669, 1163144, 1130578, 1104461, 1046769, 1039924, 1032639, 979315, 910629, 851437, 811122, 774221, 745585, 726546, 720472, 700758, 650832, 631946, 624643, 594924, 572225, 534120, 523877, 483217, 465922, 466965, 499434, 497441, 457241, 435767, 441906, 462066, 460899, 430220, 397579, 386901, 387232, 384766, 377503, 367875, 354564, 363599, 376755, 382099, 371821, 362776, 343485, 305192, 289051, 325160, 328513, 345662, 363464, 312961, 268632, 274137, 321319, 349625, 349747, 342333, 330571, 296285]
10407B96285k5906K4172n4228l0112n11L0641l359l6293j3252L339r240K7917
10395B09453M6957J3460L3476L0845n7706o1296n7551j30010r8049j7801N8859
10384b9363R3067N8029L010K704J7546L6517J3000o125O388j2891k5810l2258
10372A23814j7197Q004j348p635j5091R206M6028N8472K8926j813k3864m7172
10360A60330m1573J8428k8251m0031p124J0779j1040J2737k0130k0738j0228L5687
10348E8846N2747L0334M485k1774L7405K0711l3969j3899N450l729l0636k9364
10336G6607k7379K9304L6881K7418l4657j2115J3073l4047k7355J6349J9259R82
10324H4320L2200K0357l1441K4647m7617l1356j3109N502M501k7664K0896K6231
$$ y = [296285, 270379, 294551, 240323, 210211, 209700, 240341, 236982, 200689, 187437, 190776, 181536, 209453, 256410, 269870, 303346, 334191, 276485, 215189, 157638, 27628, -70421, -88222, -29363, 63704, 121733, 124743, 127447, 144993, 181510, 194510, 188385, 194773, 181882, 156072, 123814, 106617, 114621, 113273, 105638, 90547, 99753, 145781, 204253, 233179, 231366, 207502, 160330, 118757, 137185, 108934, 68903, 61779, 72558, 61518, 74255, 54125, 33387, 23159, 58846, 111593, 141927, 146412, 124638, 162043, 182754, 148785, 134886, 140336, 136607, 105971, 76607, 49228, 78532, 115413, 142831, 108174, 96059, 109132, 75085, 47730, 64079, 83338, 84320, 116520, 136877, 105436, 130083, 82466, 51110, 38001, 43503, 48004, 20340, 41236, 67467]
10312F7467k299P5070J7125j274r953r1303r0532Q774L2845L4732K3217l4415
10300B9454m5115K5399M3370K8817j8992j5256K221J4387P838k3060K4973K6785
10288A00821o702k942R503o602J9036p055l3053j0068J91J4554L1307K7506r454
10275A27042l2218K3400j8498k3251j0376k772k4293l4711L8963L4358J8560K5667
10263A21871N628m037j9913j2148O068k799K910J0182k5109n8576l376L9618R558
10250F9877j2404K9285o972j6610k2505q805K2361o541J7383Q4227L2241o008
10238A75529n3731p9949M3403J4053M3462o845j04312p873k271k3278k4012J5138
10226a0686N0970M1176O5263k4749n2062J4294K6059j2502O52j1661J0721J5668
$$ y = [67467, 65168, 140238, 157363, 156089, 146136, 54833, -35699, -26925, 5920, 40652, 63869, 29454, -15661, 9738, 53108, 81925, 62933, 47677, 49898, 64285, 72123, 49063, 74036, 100821, 94119, 91177, 100680, 94078, 113114, 106059, 73006, 62938, 63129, 77683, 108990, 136496, 127042, 94824, 118224, 99726, 76475, 66099, 63327, 39034, 4323, 43286, 77644, 96204, 121871, 127499, 123462, 103549, 91401, 97469, 94670, 97580, 107762, 82653, 24077, 20701, 60319, 69877, 57473, 86758, 79786, 63176, 40671, 31866, 54227, 47686, 65069, 149296, 181537, 175529, 121798, 41849, 85252, 99305, 142767, 135922, 31610, 23737, 21466, -1812, -25824, -10686, 40284, 81460, 146723, 121974, 69912, 84206, 110265, 97763, 98415, 86754, 97475, 113143]
10214A13143q380J6602K760O335j3916J089j1536m7690k7473J2445J5359J97L250
10201F2185J3360J324M2151K4594P1285K2362J0642Q771k4596L6146Q3426M4358
10189C96008P2546M7158J7504N3471J51298J96051L00693M85050P24522J019774
10179C464075J238592R48501O3944q53283j217431j020199o89680m84543l91061
10170A058915k29038j56953p1183o5701q9427l5370J905Q271k6460L3291L1520
10159D59770l3527p6422o5800m9441k3290j114r335k2996k8830k0730k3611l0880
10147G3794l4878L978N0959m616K1810L8119j6028M1235k1146k5388j2196j8774
10135I6869L6592O5156j4094n7281k4378m1093j4082K7048n659k1312J9317J1488
$$ y = [113143, 104763, 121365, 124125, 130460, 116544, 117633, 106097, 58407, 30934, 43379, 58738, 58935, 62185, 75545, 76869, 119020, 143614, 214899, 237261, 247903, 256674, 232078, 268224, 351650, 396008, 468554, 515712, 533216, 586687, 737985, 934036, 1234729, 1719779, 2444301, 3464075, 4702667, 5651168, 5715112, 4861829, 3644398, 2624199, 1934519, 1449976, 1058915, 829877, 672924, 601741, 536040, 446613, 411243, 413148, 421419, 394959, 428250, 459770, 426243, 349821, 284021, 234580, 211290, 210176, 200841, 177845, 149015, 128285, 104674, 73794, 38916, 42894, 93853, 89237, 111047, 149166, 133138, 174373, 153227, 127839, 115643, 96869, 133461, 198617, 184523, 127242, 102864, 61771, 47689, 74737, 69078, 47766, 67083, 78571]
10123G8571j0505j7830J7700J4241j3637j3200k2840l9966K5212L9002q248K3044
10111G1544Q892m0960J8443K9905K9195Q735Q143M3482m4648n5194J122J7953
10099I6612K0514K4178j9279k5973J3374Q2287N4658J05280J37735K20645K61653
10088I71684L17899K82080l3236l24031l45634k67403j78056p0168L427l6126
10078C20436l8390n8027l7535j3631l8417J013J5041k1564l7602o4512J3884J7363
10066E8059L4072J2034m3480j7005n905K6875k9123q670m048j973J6368n721j1946
10053A9537p537K6276J0401k660K7452L127J8104j7367l4432r521o07N2698L757
10040H9228j7955p0090k8377J2294K0340k7107M714O9300o6k7283J4717R204l0270
$$ y = [78571, 68066, 50236, 67936, 82177, 68540, 55340, 32500, -7466, 17746, 56748, 48500, 71544, 80436, 39476, 57919, 87824, 117019, 125754, 133897, 177379, 132731, 77537, 78659, 96612, 117126, 141304, 122025, 96052, 109426, 191713, 246371, 351651, 489386, 710031, 971684, 1289583, 1571663, 1538427, 1214396, 868762, 601359, 423303, 353135, 356562, 320436, 282046, 224019, 186484, 172853, 134436, 135449, 150490, 128926, 91324, 26812, 40696, 58059, 92131, 104165, 60685, 43680, 37775, 64650, 35527, 26857, 22809, 20836, 37204, 31483, 19537, 12000, 38276, 48677, 46017, 73469, 76596, 94700, 77333, 42901, 33380, 32773, 85471, 89228, 71273, 1183, -27194, -14900, 5440, -21667, -16953, 52347, 52281, 24998, 39715, 48919, 18649]
10027A8649l25J8469Q006k0338Q303M0755M064l0733n645J9177K6646p254K0426
10014A00200m959k8177j3809J8954J7543j5457n506m2647p293J7279L0108j1631
10002E4605K812r725l0614q993K56J216p985O256K8413L526j9847j2314J0368
9989A7974N7346M973j4630j2018k7835o91L6944O441k710O295j5209K1473k4452
9976E3901j7842l2766l3757l4053m010m9453L8088Q0688K5321j3003j5335N103
9964B882j3271k2288m822O006Q106j3367j3771J1088L1644K3291J0572L9142o081
9951E9131q027K1742J9142j7594k1062M77n3334k7135L8866M5645p767j9626j9256
9938A1202M61L141J5281j0931L924k0526R088J3210j0216j293J3216J3905k0195
$$ y = [18649, 18324, 36793, 44799, 24461, 32764, 73519, 77583, 46850, 41205, 60382, 87028, 79774, 100200, 95241, 67064, 53255, 72209, 89752, 74295, 68789, 26142, 18849, 36128, 66236, 54605, 57417, 47692, 17078, 8085, 8341, 9557, 1572, 7828, 36241, 39767, 19920, 7606, 17974, 75320, 80293, 65663, 53645, 25810, 25119, 62063, 68504, 65794, 72089, 56880, 78353, 53901, 36059, 3293, -30464, -64517, -68527, -117980, -79892, 796, 26117, 13114, -2221, 2882, -10389, -32677, -37499, -31493, -23387, -36754, -50525, -39437, -7793, 15498, 26070, 65212, 59131, 51104, 72846, 91988, 74394, 53332, 53809, 475, -26660, 12206, 57851, 50084, 30458, 11202, 11663, 14804, 30085, 19154, 23078, 2552, 11640, 24850, 14634, 13341, 26557, 40462, 20267]
9925B0267O526K4373l4459m0185K7408K7757L0344l4724m393k1445k9422M1804
9913A3851M9926O914j1452l193l2369l3701L006j7618K197p592Q363L0165j0523
9900b026J1065k518r237j93N847j0063K0726k9480J637J8041L455L1805R342p874
9886D0527j4488k3193L5819J9655l3040J4015l6861p1056l6548K3705L3737M2834
9874d894L8013J3366O212j1720R17Q779J4859k927p3692m1412J7830L3208N5378
9861E3917J792k0968k7635j1415K0124Q38L7336L9014j1157J38O9092Q3693J11233
9848C46002Q1476m5353j25828j33049q3831l2802J7376j1756O7314J0135m8701
9837D0983L1921K3030J8090n067j7337M3079R350j4963j3724p0995m2742j1900
$$ y = [20267, 26793, 51166, 16707, -23478, 3930, 31687, 62031, 27307, 22914, 1469, -27953, 13851, 63777, 70691, 59239, 56046, 23677, -10024, -7018, -24636, -22439, -30031, -21668, 8497, -2026, 9039, 6521, -2716, -2909, 2938, -7125, 13601, -15879, -14242, 3799, 7254, 39059, 48401, 40527, 26039, 2846, 38665, 58320, 25280, 39295, 2434, -68622, -105170, -81465, -47728, -4894, 33119, 46485, 52697, 40977, 41894, 50673, 65532, 62605, -11087, -52499, -34669, -1461, 53917, 55709, 34741, 7106, -4309, 15815, 16653, 53989, 93003, 81846, 81984, 151076, 234769, 346002, 427478, 382125, 256297, 123248, 39417, 6615, 23991, 12235, 79549, 89684, 40983, 72904, 95934, 114024, 108957, 91620, 134699, 144049, 129086, 115362, 44367, 1625, -10275]
9825a0275k3214K5017J4571l8250J0720K4395O6575r059j2957l9871j6089N2662
9813D4225k557k262j2801o403k7655j973J5082J2252l372j8554J4160K8476l496
9800C5122K166k7299k8678o917J1154j8187O248K1215J1315J3702M434k6075l955
9787e755L2888p631k0118N290j4718J9670M531j3793j5173k345k6739L3345K8219
9774A7671k5249J1707P948j9391r999Q027K3794k8987M6785Q922l3224L134J6172
9761B7310O355n276J4838k754l3649j7632k3335M2938N4499j3379l0643q400j6955
9748f083j7633m135J2588J5175n03M3481Q458M09J6914J2642o373k1552j7416
9735C5972k0217j7809k3152j1564q732q862M503N437j1209Q527K2174K3949K6022
$$ y = [-10275, -33489, -8472, 6099, -32151, -21431, 2964, 69539, 60480, 47523, 7652, -8437, 44225, 41668, 39406, 26605, 20202, -7453, -9426, 5656, 17908, 14536, -4018, 10142, 38618, 35122, 37288, 9989, -18689, -25606, -14452, -32639, -26391, -5176, 6139, 19841, 24275, -1800, -5755, 27133, 19502, -616, 4674, -10044, 9626, 14157, 364, -14809, -17154, -43893, -10548, 17671, -7578, 4129, 12077, -7314, -17313, -9286, 14508, -14479, 32306, 41228, 8004, 11138, 27310, 33665, 28389, 43227, 40473, 6824, -10808, -34143, 8795, 63294, 49915, 19272, 10872, -6083, -23716, -27851, -15263, -88, -591, 42890, 51348, 51757, 68671, 81313, 74940, 53388, 35972, 15755, -2054, -25206, -36770, -45502, -54364, -49861, -44424, -55633, -47106, -24932, -983, 25039]
9722B5039j5344l3858L317p423K5068P616K075j7801K6737K8349J1764j6274k6728
9709A2537j2243j6796k683K0284K4087m624m6233r217k0533l2921N1795J9180
9697a7367j8594p395n0453o354P2672P361N8352K5792m1826k580J2295j566k9182
9684A155R682o831k6296k6610n018k9205L589J7475N378L405J6715J1596M9245
9671B4280O0393J4517o5452m6827k846K8696M7183K0312j1236n4515m1816J2314
9659a4997k3772k0040R912J0337J236J5159j0366L735j0702K4526K8575j0696
9647B907k9625j5471P595K6821R184K283j3751J3300l623m8645M1638J8466K0805
9634C1884L871p560K6460J1528R444J6367j7538k4983o122j371l3476l2348l5605
$$ y = [25039, 9695, -24163, -20846, -28269, -3201, 4415, 6490, -11311, 15426, 43775, 55539, 39265, 12537, 294, -16502, -19185, 1099, 25186, 20562, -25671, -34888, -55421, -88342, -36547, -17367, -35961, -43356, -93809, -100163, -27491, -20130, 38222, 64014, 22188, 19608, 31903, 30337, 1155, 10837, 4006, -22290, -48900, -53918, -83123, -79534, -62059, -56681, -53276, -36561, -24965, 24280, 84673, 99190, 33738, -13089, -15935, 12761, 59944, 80256, 69020, 14505, -27311, -14997, -38769, -58809, -48897, -38560, -37324, -22165, -32531, -28796, -39498, -14972, 13603, 2907, -26718, -42189, -34594, -7773, 1411, 3694, -10057, 3243, -380, -49025, -7387, 11079, 31884, 35755, 28195, 54655, 66183, 75627, 91994, 74456, 49473, 43351, 41980, 8504, -23844, -59449]
9621e9449r916M0731R901r337M4620K9791J749l1427q715K5390O155O519n047
9608D0965p466k1976J1426K7085K3432k4420m813J7095J5869J6884J0223j4629
9596H9675J155k0063m4011n4942l4583K672M3687M9952J0990L3468k5905m5094
9584G001J5480M5095j0198L531J7978j2791n0155n0294l1161L8361K4159M8339
9572D5345J6216m6284j4341J8827L0347j985j2124o454O799m3106o162j4981J7476
9559a0427p753K5327L6103j5044o476J6157M6680l825k3031k7413L745J8154p454
9546D4743l0391K0930J0889n0002o3257K0965M2150K4581j7854j2699J8370J6106
9534B4531k7591l4725J0710J1213J4756K7049K5678K9766j1934j8316K522o376
$$ y = [-59449, -69365, -28634, -18733, -28070, 16550, 46341, 48090, 16663, 7948, 33338, 39493, 46012, 40965, 33499, 11523, 22949, 50034, 73466, 49046, 44233, 61328, 77197, 94081, 104304, 89675, 90830, 70767, 26756, -28186, -62769, -60097, -16410, 33542, 44532, 78000, 52095, 7001, 22481, 67576, 57378, 60909, 78887, 66096, 15941, -34353, -65514, -27153, -2994, 45345, 61561, 15277, 936, 19763, 50110, 48125, 36001, 29547, 36346, -6760, -12922, -27903, -10427, -18180, 7147, 43250, 28206, 21730, 37887, 84567, 80742, 57711, 30298, 34043, 52197, 44743, 14352, 35282, 46171, -3831, -67088, -46123, -3973, 20608, 2754, -9945, 8425, 24531, -3060, -37785, -27075, -15862, -1106, 25943, 51621, 81387, 69453, 51137, 53659, 47283]
9522D7283l7848r250K2412K0131J6729n750m5563l0804J9921L082k868j0201K8918
9509A6192K3377n522L8693J2968n7370m3976J4201j4212j9589j3844K1170K8161
9497B49O4091n792L029J4735J7715Q812k3588l663n9008k211K5533k9344j8141
9484g583j5594K0032N5431j9017m2148m007l6493K4508N0371L9203K5782K4260
9472A14745p048j2951k8645n2006K4311N7764m3880j9880j7185n8026n3390K8743
9460f7448K8684j61J7408L5174M666R437m19j1307q225M66j3409K2876m695j7191
9446d144J552L514J0640O404o814K1017j3591L4104l1918j4633j1830k1242N0627
9433B3686J2577j548k4876L092k6806l8743L6344J4656j0262K4273M7182j8361
$$ y = [47283, 9435, 185, 22597, 42728, 59457, 53707, 8144, -22660, -2739, 343, -2525, -12726, 16192, 39569, 34047, 72740, 85708, 28338, -15638, -1437, -15649, -35238, -49082, -27912, 249, 64340, 58548, 61577, 76312, 94027, 102839, 79251, 75588, 16580, 14369, 39902, 10558, -7583, -23177, -3145, 52286, 33269, -8879, -12886, -49379, -24871, 25500, 64703, 90485, 114745, 107697, 94746, 66101, 14095, 38406, 96170, 52290, 32410, 15225, -42801, -96191, -67448, -38764, -38925, -21517, 13657, 18323, 27760, 27341, 16034, 7809, 8275, -5134, 17742, 13047, -4144, -2592, 922, 11562, 17966, 11152, 32169, 18578, 52682, 20764, 6131, -5699, -26941, 23686, 36263, 34715, 9839, 12931, -13875, -52618, -16274, -1618, -11880, 12393, 59575, 41214]
9421D1214k3640j2178o395j0398N808Q12N5729K8474l3307m2916p994J3464N286
9408A3959J7286J6531K6314J0964J906q398L845k5127l5254J0541K0613k9841
9396B3339j6316J6972k4996k2216k5390k956J354j4512J8265M4345J0055R255
9384A7199m245k8566J2969L4835K3340l2028j5508j0137J5413J2621J6044K0536
9372F2473j439L4744j3299k6185l5277o2131L34J7368K8450j4220r705J452L9928
9359B2493L7184j26J7896J5304j0088J5306J7142k4713j9834J2937l7939k5999
9347A9563j2476K4010L285j8063J0048p50m8617j1473J6090k7855K0680M6344
9335B0786K513k8774J8950L1111K9905k1032k0667k9412k7996N0781O5717J344
$$ y = [41214, 17574, 5396, -999, -11397, -5589, -4777, 50952, 79426, 46119, 3203, -4791, 8673, 13959, 31245, 47776, 74090, 85054, 86960, 78562, 82407, 57280, 22026, 32567, 53180, 23339, 7023, 23995, -1001, -23217, -48607, -51563, -50209, -64721, -46456, -2111, 7944, 17199, 12954, -15612, -2643, 32192, 55532, 23504, 7996, -2141, 13272, 25893, 41937, 62473, 61034, 95778, 82479, 56294, 21017, -41114, -40780, -23412, 5038, -9182, -18887, -17435, 22493, 59677, 59551, 77447, 92751, 82663, 97969, 115111, 90398, 70564, 83501, 45562, 19563, 7087, 31097, 34382, 16319, 26367, 25617, -23000, -34473, -18383, -46238, -25558, 20786, 23299, -5475, 13475, 44586, 74491, 53459, 32792, 3380, -24616, 26165, 91882, 93226]
9323I3226N297j5200m6081k5012n755l639K1712K0342L4310J1646p958j3070j5038
9310E4780l24L9875q076r614m6586j0046j522j9399K1377L0470j3240l8242k1182
9297b1729J8537K2778j7889L141P155N9606M9247j622k7848k5988j1132K96l376
9284E1176N757K1816O467o70k2779M6219M6502l6979l3121k6760k9182j411o463
9271B0572L6940J1119R140k9613K1955P845m6075Q105J9010k7608j2944K2272
9259D0718M5966K752K1448l2903p0489k6835P014J3882M8427L3118j6278l1199
9247C5621l0620j3972k9056L391M9674L2322p844J8984j2825l274O353Q011L5342
9234I2107J97m3658p946j5592K7588l0669q81J7496J1413K6500K5273j1515o2677
$$ y = [93226, 98523, 83323, 37242, 12230, 6475, 2836, 24548, 44890, 79200, 90846, 82888, 69818, 54780, 54456, 94331, 86255, 76641, 30055, 20009, 18487, -912, 20465, 50935, 37695, -547, -21729, -3192, 19586, 1697, 4838, 11993, 71599, 120846, 119224, 91376, 65388, 54256, 54552, 51176, 56933, 78749, 85216, 84546, 61767, 107986, 154488, 117509, 84388, 57628, 28446, 27035, 20572, 57512, 68631, 77771, 48158, 70113, 77958, 31883, 39988, 58998, 31390, 18446, 40718, 86684, 89436, 110884, 77981, 7492, -19343, -12329, 1553, 49980, 83098, 66820, 35621, 5001, -8971, -38027, -34636, 15038, 47360, 39516, 58500, 45675, 42401, 48754, 56765, 92107, 92304, 48646, 40700, 25108, 52696, 22027, 21146, 38642, 50055, 76555, 101828, 90313, 27636]
9221B7636j6920j1617K8165K4255K5094J8438j6140j5783j9560P797J935L984
9209E7284q485N6969L3430p638k4185n456K0687j2373j6241j3562J8271j2696
9197H6005K289P804j9787l0737k3225L4028L0914j1395L762k1124l856k859K0457
9184G2276K0027l7771j8568M4552l923k4041N437o571j2434R80P3649P5079n0620
9171A38072l5482j3151j091o687k3602M8287M0551N325m0949j4920O2574N0176
9159B09103k6862p0683l9457n365L610k208j1873r332J3456P627j236K3374J4359
9146A04513k1618K4150J1277k9864M1746n866K485l312J9878Q945l2971p309r944
9133A02110K472K363K4080J2092l460R990l3797M155K4529J4904j0108J208j6789
$$ y = [27636, 10716, -901, 27264, 51519, 76613, 95051, 78911, 63128, 43568, 51365, 53300, 57284, 48799, 105768, 139198, 131560, 107375, 101919, 122606, 110233, 93992, 80430, 98701, 86005, 88294, 96098, 76311, 45574, 22349, 56377, 87291, 75896, 79658, 58534, 54678, 51819, 72276, 92303, 54532, 35964, 80516, 76593, 52552, 57989, 51418, 38984, 39964, 113613, 188692, 138072, 102590, 89439, 88348, 81661, 58059, 106346, 146897, 152222, 111273, 96353, 158927, 209103, 182241, 111558, 72101, 66736, 70346, 68138, 56265, 46933, 60389, 68016, 66780, 90154, 104513, 82895, 107045, 118322, 88458, 130204, 124338, 126823, 123511, 143389, 152334, 119363, 112054, 102110, 104582, 106945, 131025, 143117, 139657, 149647, 115850, 120005, 144534, 159438, 149330, 150538, 133749]
9120A33749J0957m776j465j9736J0121K0963P351P974m768J77k9886l4683j2889
9107H3089L4769l6946k9050O5736K023M9773P738o343R707j7536K9053L1012m9548
9094A73477m0733j9512M2453L1420p122j1071n011K5072l642j6595N767j8681
9082A55822j2328J2650L1560M948l7244K1202M7671K2536p0608l6942L876P1K8631
9069A71845K2210J7486J7583m885j683n8214m5743M1845P1957l3760o3058p51
9057A34832N5001j276M275J7937j2519q119M394J1429j1185k4289k8333K6554
9045A68701M0776k0119m6915R76M7835m1774J0005P5118N3751k254m6775M196
9033B43521J6907j4999j5462j3898L470O334j9844L03j530K031M572J3791p394
$$ y = [133749, 144706, 139930, 138465, 118729, 128850, 149813, 157164, 165138, 160370, 160547, 130661, 95978, 83089, 117858, 80912, 51862, 117598, 119621, 169394, 177132, 170789, 180496, 162960, 192013, 223025, 173477, 132744, 113232, 155685, 187105, 179983, 168912, 163901, 188973, 185331, 168736, 174503, 155822, 143494, 156144, 187704, 192652, 155408, 176610, 224281, 246817, 176209, 139267, 143143, 143214, 171845, 194055, 211541, 229124, 224239, 222556, 164342, 118599, 160444, 232401, 198641, 135583, 134832, 189833, 188557, 192832, 210769, 198250, 190131, 194525, 205954, 194769, 170480, 142147, 168701, 209477, 189358, 142443, 143419, 191254, 149480, 159485, 234603, 288354, 286100, 239325, 243521, 260428, 245429, 229967, 216069, 219539, 225873, 206029, 206332, 204802, 206833, 211405, 225196, 217802]
9020B17802m1409j4745K967M8936L0183K8434L8288j3084k499K1603J9650N189
9008C41315M361r730l3661k0372K0956L3621J7668j6136m3614k2030J6067K3325
8996C11770K2940l9110j8176L4220K5877k3352k0118N3320o161r309l1771K1112
8984C21242L0441J7417P414l5021o4315o455K9951M2503L4475r235J4279p746
8972C74950R439J4916n0524j6639O639K410J0899n227j7062j4869L5952J7998
8960C68882k6081J771Q488j0681j8709K18K6951M3276J9883J2677J4376n897m557
8947D30597O080k0607J7505K7445L5870K7185j1425k0400k034K960m774M5145
8935E33547J1075r450j1973l171N640K9701l4333j0448m025M7274M0232K4394
$$ y = [217802, 176393, 161648, 164615, 213551, 243734, 272168, 310456, 297372, 294873, 316476, 336126, 341315, 345676, 335946, 302285, 281913, 302869, 336490, 354158, 338022, 294408, 272378, 288445, 311770, 334710, 295600, 277424, 311644, 337521, 314169, 294051, 347371, 341210, 331901, 300130, 321242, 351683, 369100, 376514, 341493, 277178, 270723, 300674, 343177, 377652, 368417, 382696, 374950, 384389, 399305, 348781, 332142, 338781, 341191, 352090, 346863, 329801, 314932, 350884, 368882, 342801, 344572, 353060, 342379, 323670, 323888, 350839, 394115, 413998, 426675, 441051, 435154, 430597, 436677, 416070, 433575, 461020, 496890, 524075, 512650, 492250, 490216, 493176, 488402, 533547, 544622, 535172, 523199, 520028, 525668, 555369, 521036, 510588, 506563, 553837, 594069, 618463]
8923F18463J0397l0275K335M0828K2225j1388q186N565j2890M763J0105J9022
8911F70964r70j3213r157K4363O2028l565l8070J1467M5579K2043k3915j1336
8899G36218K2242M0441M3025m1725L5749O298m8974m440J2684p43J0870M0020
8887H51665K1705l2962K4177N1722Q107K2214Q384J0013k9632L8413J8573L0475
8875A022854O3710J1945n879J3164K7489K436K6051J1093J3487J6334J0831n118
8863A208397J3406p658l026J6081K120L6631N3191J8773L4857N3028L3879M0666
8851A500345J8798J9529l711Q635L0347L5484J4695O1762N4904j9949M7031Q5739
8839A853609K7577l6116m041Q571P1189P3046J5076K8895N7862J5019k6987M5205
$$ y = [618463, 628860, 598585, 600920, 641748, 663973, 652585, 644399, 649964, 637074, 641837, 651942, 670964, 669994, 656781, 647624, 671987, 734015, 730450, 692380, 703847, 749426, 771469, 747554, 736218, 758460, 798901, 841926, 800201, 835950, 842248, 793274, 788834, 801518, 800775, 811645, 851665, 873370, 840408, 864585, 916307, 924414, 946628, 955012, 965025, 935393, 973806, 992379, 1022854, 1086564, 1098509, 1092630, 1105794, 1133283, 1135719, 1161770, 1172863, 1186350, 1202684, 1213515, 1208397, 1221803, 1214145, 1211119, 1227200, 1229320, 1265951, 1319142, 1337915, 1372772, 1425800, 1459679, 1500345, 1519143, 1538672, 1534961, 1543596, 1573943, 1609427, 1624122, 1685884, 1740788, 1720839, 1767870, 1853609, 1881186, 1845070, 1841029, 1849600, 1920789, 1993835, 2008911, 2037806, 2095668, 2110687, 2083700, 2128905]
8827B128905J09846N7058L9180M5368L9919R449O0185N1874O4974O937K2966O9333
8815B705994Q9016M2635M4502R6047J47156R9902N6396L6964P5995O6861R2135
8804C553603N0467k501J6047Q2544J11276R9385R1768R0168J17154N3613R0680
8793D354204P4410J14093J05698Q3936O7262J43374J27898K8842L9446R5574R0014
8782E324751J45691J12670Q6429R8410R1055R0734J56077J34344O7351M0635O7062
8771F415209Q1700P7431J04636J15268J07287P8501Q5692L8227P1743N0907O4624
8760G291225L8456K2165L8112Q0994O3632L3699L0229R53o4540l5684j9823l9835
8748G439583J0540J8867k1959l3903k9586o1838p9971o1753n7319m9641l7321
$$ y = [2128905, 2238751, 2295809, 2334989, 2380357, 2420276, 2429725, 2489910, 2541784, 2606758, 2613695, 2636661, 2705994, 2795010, 2837645, 2882147, 2978194, 3125350, 3225252, 3281648, 3318612, 3394607, 3461468, 3553603, 3604070, 3601569, 3617616, 3700160, 3811436, 3910821, 4002589, 4092757, 4209911, 4263524, 4354204, 4428614, 4542707, 4648405, 4732341, 4799603, 4942977, 5070875, 5099717, 5139163, 5234737, 5324751, 5470442, 5583112, 5669541, 5767951, 5859006, 5949740, 6105817, 6240161, 6307512, 6348147, 6415209, 6496909, 6574340, 6678976, 6794244, 6901531, 6980032, 7065724, 7103951, 7175694, 7226601, 7291225, 7329681, 7351846, 7389958, 7470952, 7534584, 7568283, 7598512, 7599465, 7534925, 7499241, 7479418, 7439583, 7450123, 7468990, 7447031, 7413128, 7383542, 7321704, 7241733, 7179980, 7122661, 7073020, 7035699]
8737G035699n8681j29736j65235j11729l9868n3160m2237p8573j19965j30395
8727F106120j09483j21624j08947p9328o7621p1173r9782p4419m2091q3789j10457
8716E137406j12771r9363r9532j11577q9911p9724r5535j50245j06692r8356q4687
8705D009013p2138l6184m9081n6570p8097p6123j14046o0479q6206p3558n2211
8694C254320n4334r5214q2286l9998r83n9826q4724n3147m6295o5930n3460m5932
8682B572191n8499q0241l4378o876o8602m2696j4287k4002n5093m7277j5193l8161
8670B086886l3913j0659q6629l9399L049n1276m7029q539l5297o0474K1571j3036
8658A725255p0202n0442k1619J7823m942L20j7914l2032l6639o5162j8717L3455
$$ y = [7035699, 6977018, 6847282, 6682047, 6570318, 6530450, 6477290, 6435053, 6356480, 6236515, 6106120, 5996637, 5875013, 5766066, 5686738, 5619117, 5547944, 5448162, 5373743, 5331652, 5247863, 5137406, 5024635, 4925272, 4825740, 4714163, 4624252, 4544528, 4448993, 4298748, 4192056, 4093700, 4009013, 3936875, 3900691, 3851610, 3795040, 3716943, 3640820, 3526774, 3466295, 3380089, 3306531, 3254320, 3199986, 3104772, 3022486, 2982488, 2981505, 2921679, 2836955, 2783808, 2737513, 2671583, 2618123, 2572191, 2513692, 2433451, 2399073, 2392197, 2323595, 2280899, 2266612, 2242610, 2187517, 2140240, 2125047, 2086886, 2052973, 2042314, 1955685, 1916286, 1919335, 1868059, 1821030, 1812491, 1777194, 1716720, 1738291, 1725255, 1655053, 1604611, 1582992, 1600815, 1595873, 1596193, 1578279, 1546247, 1509608, 1444446, 1425729, 1459184]
8646A459184k6682p1556k0344l3346m733j0008n5158m2388R015M2630j5877l7334
8634A193403o9726J5777N0574l2702k3183l9265k3955j944l0831n8697n5128L3027
8622I57350K8940j9334o7493k5770J7977m719j7426l9913J1001L1395N11l242
8610H69277L4278Q928o1913k3684K9409J1543K0974O7438J6283k1265k0408m1799
8598H89061m6052k3270J7651j5530k7143j5535k9695P932l9591k2543k1636k9598
8586F44051m591j3502J0752k2127J235l859J4739j3008k3170l5032m138N403K3874
8573E80627M985m127m8342l5470P86J7934k1794k1694l3932N130L9344l8932j7784
8560D26731r104M6102N3432K9983J3088k2678l0040k2726p9991m3262K8468J0971
$$ y = [1459184, 1432502, 1360946, 1340602, 1307256, 1302523, 1292515, 1237357, 1194969, 1203984, 1246614, 1230737, 1193403, 1123677, 1139454, 1190028, 1157326, 1134143, 1094878, 1070923, 1068979, 1038148, 979451, 924323, 957350, 986290, 966956, 899463, 873693, 891670, 886951, 869525, 829612, 840613, 872008, 872519, 869277, 903555, 912483, 850570, 826886, 856295, 867838, 888812, 956250, 972533, 951268, 930860, 889061, 843009, 819739, 837390, 821860, 794717, 779182, 749487, 757419, 717828, 695285, 673649, 644051, 639460, 625958, 636710, 614583, 615818, 611959, 626698, 613690, 590520, 555488, 551350, 556753, 580627, 585612, 581485, 533143, 497673, 498459, 516393, 494599, 472905, 438973, 444103, 483447, 444515, 426731, 417627, 463729, 517161, 547144, 560232, 537554, 507514, 484788, 404797, 361535, 390003, 400974]
8548D00974l255j6590K6350k0503l8788k0286j9568J234K0232J2641L180j6071
8536C29550J4126q786k3652m366M984K903N961Q435j0328O610J8806k0145J5637
8523C39735l1024Q253k3929L1834L0191l8891m533M69k739o597J6837l8845j3943
8510B66818j06J6561J3516J5748J0350j9645j8423j4776l0542o224J7675q692
8498B42260M298L8034P590k050M585j7839M430m908k6891J6237n671j1840K3791
8485B72026M9385J073R508l1731k6202p1076m749P944k2975J2700Q74L089m707
8472A95159M324q694R507J1647M8868M3560r764m9424j4512r682P720m034n3996
8459A70679J1069N1809L206K612J7600J782j6098r765o992p1j5368r023R460k1678
$$ y = [400974, 397719, 381129, 407479, 386976, 348188, 327902, 308334, 309568, 329800, 342441, 345621, 329550, 343676, 334890, 311238, 306872, 311856, 314759, 320720, 329155, 318827, 325437, 344243, 324098, 339735, 308711, 316964, 293035, 324869, 355060, 316169, 311636, 312105, 309366, 302769, 319606, 280761, 266818, 266712, 283273, 296789, 312537, 322887, 303242, 284819, 270043, 239501, 233277, 250952, 242260, 246558, 284592, 292182, 290132, 294717, 276878, 281308, 276400, 249509, 265746, 260075, 248235, 272026, 321411, 322484, 331992, 300261, 274059, 202983, 198234, 206178, 183203, 195903, 196777, 199866, 195159, 199483, 190789, 200296, 211943, 260811, 304371, 294607, 245183, 230671, 220989, 228709, 224675, 170679, 181748, 233557, 236763, 239375, 256975, 258757, 242659, 232894, 225902, 225831, 210463, 201440, 210900, 189222]
8445A89222j7801K9555k1155j0405Q357j3366P797R83k8441n0184l2256L5576
8433I7882N4078k475K3017k0055j6630K6008r681O948J7796k6392m5832l6265
8421F8399N7690P3902M988n520n045j7615k5822k5800q055L2755N2020l034l5980
8408A62883J1169K2337o430n2473O602M9534K0583j9458j1082l3522J0625K0245
8396A81013L3576n2994k4008k117k5509l1852j2184M9609L6258j6011k0901o1121
8384E3759J1087O1480m4598p453K1490k632l7522J6200M9542P52n825m5234j3837
8371E7209J5810J5066K5558l1925l1074J3324K8112j3795J9943K4037j3718o731
8359A01816k1437j5326k9919k0389K8441J4878N942J6969r660j9516j8398L5949
$$ y = [189222, 171421, 200976, 179821, 169416, 177773, 164407, 172204, 173187, 144746, 94562, 62306, 97882, 151960, 149485, 172502, 152447, 135817, 161825, 152144, 159092, 176888, 150496, 104664, 68399, 126089, 199991, 204979, 199459, 194414, 176799, 150977, 125177, 117122, 149877, 201897, 198863, 162883, 174052, 196389, 189959, 137486, 144088, 193622, 214205, 194747, 183665, 150143, 160768, 181013, 214589, 161595, 137587, 135470, 109961, 78109, 65925, 115534, 151792, 135781, 114880, 53759, 64846, 126326, 81728, 74275, 95765, 93133, 55611, 71811, 121353, 122105, 116280, 71046, 57209, 73019, 88085, 113643, 81718, 50644, 63968, 92080, 78285, 98228, 122265, 108547, 101816, 80379, 65053, 35134, 14745, 43186, 58064, 64006, 80975, 71315, 51799, 33401, 69350]
8347F9350L1545k4019j2706J7728j0085r333j5248j7286K2647L3171o518J9495
8335I8741J0485j7450J5286L8409k2436m8203K7047L1841P236O521J8653J4518
8323A80648m7333n6672k3591L885n583k4275j5020L7442o789K707N9369j5079
8311H9709r665J4896K8967N906j2631l6286o500L4494q248j4906J0006k1069J5600
8298I0273J7161J0777j4621n3133j8616K0905L6124Q178J507j603n105P85K0589
8285A13221l0862j2289J9329k087j0725J6949k245m7045O536k7489J6536k1008
8273A8821n283L917m086L776N0017j7823J4821Q110j8912M330L4674k897K7389
8260A16854k497L605J1426k7944m5681k9400k3105j9715M9206J7304l9601l1110
$$ y = [69350, 100895, 76876, 64170, 81898, 71813, 62480, 47232, 29946, 52593, 85764, 79246, 98741, 109226, 91776, 107062, 145471, 123035, 74832, 101879, 133720, 140956, 147477, 166130, 180648, 133315, 76643, 53052, 56937, 51354, 27079, 12059, 49501, 42712, 45419, 104788, 89709, 80044, 94940, 123907, 129813, 117182, 80896, 74396, 108890, 100642, 85736, 95742, 74673, 90273, 107434, 118211, 103590, 50457, 31841, 52746, 88870, 97048, 98555, 96952, 91847, 92632, 113221, 82359, 70070, 89399, 87312, 76587, 93536, 91291, 44246, 50782, 23293, 39829, 18821, 13538, 17455, 13369, 17145, 67162, 49339, 64160, 72270, 53358, 57688, 92362, 89465, 116854, 114357, 117962, 129388, 101444, 55763, 26363, 3258, -16457, 32749, 50053, 10452, -20658]
8248b0658K8468L3211J3047J504L3601k8426o1609J4749J9813r811J4652J5083
8236E3624p355J9133L1865j1638l2620m7100L652L213N4325J7620k6334j3381
8224D5004N02j6775j4310n92o101m598J0781N5507M4937j4318m5552k7391J5433
8211D2527j0755l4625l392J5432q022n699L4554K9205n954q482j4821q896M690
8198B5762j5333J933M878k3469N9027J3224L965N9125m127q0437k6215l2278J2193
8185a752N2691R988k5693k5439O236M0282j019K964j4877l2575j4747K4359M0219
8172F0637K3510l1723j5042k9091L0412K8734j9858j3556r246K6775j3063n071
8160C3418K7274j5146R139m860k4275k6717m4061q252L2772N2128p581l123k0643
$$ y = [-20658, 7810, 41021, 54068, 55572, 89173, 60747, -862, 13887, 33700, 23889, 38541, 53624, 46269, 65402, 97267, 85629, 53009, 5909, 9561, 12774, 67099, 84719, 58385, 45004, 45506, 28731, 14421, 13829, 7728, 3130, 13911, 69418, 114355, 100037, 54485, 27094, 42527, 31772, -2853, -6245, 9187, 1165, -4534, 30020, 59225, 53271, 44789, 29968, 21072, 25762, 10429, 12362, 17240, -6229, 52798, 66022, 69987, 129112, 124985, 44548, 18333, -13945, -1752, 50939, 60927, 35234, 9795, 16031, 56313, 55294, 58258, 43381, 10806, -3941, 20418, 60637, 84147, 52424, 37382, 8291, 38703, 67437, 47579, 34023, 24777, 51552, 38489, 33418, 60692, 45546, 54685, 49825, 25550, -1167, -45228, -53480, -20708, 31420, 23839, 20716, 73]
8147G3j6538l3373N8049L6217J10m0680j4784l2228J2609K1401K7381Q85J7478
8134C6600J1852j1852R477J3397K4120Q479k4641j1665j4192L9977l7700o4117
8122b0265K3574L8852K8760K0853l1742m0538k9776j430M6143O831j121k7034
8110A3107j7803K8961J5002m423j7062k2540Q633M192J0389j9745k0652R817J9816
8097G692J7448J9219l9594m1577K8831J5065j9286J7954L7546J8394l2640l6958
8085g906j8326J3497J574r872J629K0148J6113R803k9299J2685J1354K0883K2594
8072F4877k546r772l3498j8610K1440J1746k4133J2362J6752k3993J0216R50K3046
8059D8837j3901K5630L682j4779j2101K516p568P128P990L7604j3309k2333k3491
$$ y = [73, -16465, -49838, 8211, 44428, 44538, 3858, -10926, -43154, -30545, -9144, 18237, 19122, 36600, 48452, 36600, 46077, 59474, 83594, 92073, 67432, 55767, 41575, 81552, 43852, -20265, 3309, 42161, 70921, 91774, 60032, 19494, -10282, -11712, 34431, 41262, 40141, 13107, -4696, 24265, 39267, 34844, 17782, -4758, 3875, 8067, 18456, -1289, -21941, -12124, 7692, 25140, 44359, 4765, -36812, -7981, 7084, -12202, 5752, 43298, 61692, 29052, -7906, -26232, -12735, -11161, -21033, -19404, 744, 16857, 26660, -2639, 10046, 21400, 42283, 64877, 62331, 52559, 19061, 451, 21891, 33637, 9504, 21866, 38618, 14625, 24841, 25791, 48837, 34936, 60566, 64248, 49469, 37368, 39884, 32316, 39444, 47434, 85038, 71729, 49396, 25905]
8046B5905j9546N588j1618L554K4888J5677k5052l8493J1797K3995K8624K5720
8034G1039p624l993j0069K5292j8505k1457k5951M2507j399j5945P853J7952J3602
8021G3302j2751n289R632K5138q783k9803l2665j2472K3368K4190K0793p452K321
8008F9529M7305m1543m8642j7783M0593P161K4377L9641J624j705n1993o5947
7996B617n3091R717n091J1866N1548M06j538O7241m547m2990q3335j3866K0236
7983d0827L5164K1406N107K7972J4877j3223q959k0058l1629J1978O6931J3734
7971H2473l1539l9713j057k7146j2224J5283j6826j5916q055L6755M6832j2587
7959A6280P843m524k9035N65M0211R377j7581m770J2555J158l3728l252j4474
$$ y = [25905, 6359, 11947, 329, 3883, 28771, 44448, 19396, -19097, -7300, 16695, 45319, 71039, 63415, 59422, 49353, 74645, 56140, 34683, 8732, 51239, 49840, 33895, 41748, 59700, 73302, 60551, 55262, 64894, 90032, 81249, 51446, 18781, 6309, 29677, 53867, 74660, 67208, 69529, 116834, 75291, 26649, 8866, 49459, 56620, 80997, 120638, 122262, 120557, 68564, 2617, -50474, -40757, -45848, -33982, 17566, 17972, 16434, 83675, 79128, 36138, -47197, -61063, -40827, -5663, 15743, 20850, 48822, 63699, 50476, 41517, 21459, -10170, 1808, 68739, 82473, 50934, 11221, 10164, -16982, -29206, -13923, -30749, -46665, -54720, -17965, 28867, 16280, 24123, 19599, -9436, -8871, 31340, 40717, 23136, 18366, 30921, 32079, -1649, -4901, -19375]
7946a9375m788M783L0876K4782N94k7479k2376m606j1522J9129K8324L8138J1393
7933F7873M0032N3315k699J00q1454m9332j0574J4346l6819k3322M0120O2299
7921G3885K643m1033o892L7431K7777m3206j6168J5094N433j1182J8396J4086
7909G6264m035j8877l641J9111K809l9240J5976K737J022p607m7366k0788O36
7896b2999J3595J365l105j0259J7322J9891J4647J6642J4332k9449k8200K6040
7884B9822J596P478O0399k5372n1343L950L4241M1560J5712m6555m3528p6301
7872d8341q546k886K3833N2539M3962q97j9807M675J7910k6530m76l2356J6188
7859A9268J4173Q127O868k8670n0460Q310o586Q20O407l936k7276k4311O3125
$$ y = [-19375, -24163, -19380, 11496, 36278, 36872, 9393, -12983, -17589, -29111, -9982, 18342, 56480, 67873, 107905, 161220, 158521, 158621, 77167, 27835, 17261, 31607, -5212, -28534, 11586, 73885, 76528, 35495, 28603, 66034, 93811, 50605, 34437, 49531, 54964, 43782, 62178, 76264, 72229, 53352, 49711, 68822, 71631, 32391, 48367, 51104, 52126, 44519, -2847, -23635, -22999, -9404, -8039, -11144, -21403, -4081, 15810, 30457, 47099, 61431, 31982, 3782, 29822, 31418, 38896, 99295, 73923, 22580, 26530, 60771, 102331, 118043, 71488, 27960, -48341, -56887, -59773, -35940, 16599, 60561, 59664, 39857, 44532, 62442, 35912, 35436, 3080, 19268, 33441, 41568, 48436, 19766, -30694, -22384, -28970, -28150, -21743, -25679, -52955, -77266, -14141]
7846a4141K0274k0808L1142K2246l632n08O319j4824j1185J98L3721L8928j4497
7833G3233n1020j6918p044k1817n362J3352L9606k311P097l3652n7351l5419k201
7820i9807L4417J9052P825J5211l727o686P936j5554L831M2053J4695j6952k2833
7807b0539Q485l2257N475J4894N4055J3316k387j5408l2142p72J9219J8305L1582
7794F1826J0949l3121M1866L1408o5493k0238l976j4337J6312K9290J9038j1289
7782F2235l3970k0491M4496J5642j6773k7220J1564Q28j6418n580N6702O624l9431
7769C8208j980j3638l1761L9232M1519l227o634n086j4681j1597J956O291j1578
7756B7024L6007j7173m237j9336M302K9535m745j6677m6017P971M9069J1774k6548
$$ y = [-14141, 6133, -14675, 16467, 38713, 35081, 34573, 40892, 26068, 14883, 15081, 48802, 87730, 73233, 22213, 5295, -1749, -23566, -28928, -15576, 24030, 21719, 28816, -4836, -62187, -97606, -99807, -65390, -46338, -38513, -23302, -27029, -33715, -25779, -41333, -37502, 4551, 19246, 2294, -20539, -12054, -44311, -38836, -23942, 30113, 43429, 41042, 25634, -6508, -7280, 11939, 30244, 61826, 72775, 39654, 81520, 112928, 47435, 27197, 23221, 8884, 25196, 54486, 73524, 62235, 28265, 7774, 52270, 67912, 51139, 23919, 35483, 36311, 19893, 14313, 71015, 77639, 38208, 36228, 22590, -9171, 30061, 71580, 68353, 61719, 56633, 41952, 30355, 32311, 38602, 27024, 63031, 45858, 41621, 22285, 26587, 56122, 51377, 34700, -11317, -3346, 45723, 57497, 30949]
7743C0949k0998j4353o115k6987K0556K1745m9866M8998K9888n0735Q201L2968
7731B4251j1326k3561j663M1039m9141k8161O6849L6100k4812o3455k8836L1339
7719c1377N9331K8256l8996k0022J1112K1716K8378j2986q489n1894n2185K292
7707f4864M3715J6913Q676K1672l483L2870J3073N81L249m198j2542k9913J4173
7694C9922N0167P142k6392k3364J672K5747j5989m7655n6868j044O020M682J5032
7681b0928k4368J8031K66j0317J0119J287J3208K3690L6986L3962l0050o4078
7669a2192P837J0137j9348q969j1012K3237N3691K884k2383l828N7440j1894M301
7656F9901J172r703l376l4807m7208K6649K5836j7466j4154m1733n200J0104l092
$$ y = [30949, 9951, -4402, -10517, -37504, -16948, 4797, -45069, 3929, 33817, -16918, -8717, 24251, 12925, -10636, -12299, 28740, -20401, -48562, 18287, 54387, 29575, -33880, -62716, -31377, 27954, 56210, 17214, -2808, 8304, 30020, 58398, 45412, 36923, -14971, -67156, -64864, -21149, -4236, 4440, 26112, 22629, 55499, 68572, 69153, 72402, 68204, 55662, 25749, 39922, 90089, 97231, 70839, 47475, 49147, 74894, 58905, 11250, -45618, -46662, -40642, -35960, -20928, -45296, -27265, -26999, -37316, -27197, -25910, -12702, 10988, 47974, 81936, 51886, -12192, -4355, 5782, -13566, -22535, -33547, -10310, 43381, 46265, 23882, 20054, 77494, 65600, 69901, 71073, 61370, 57994, 23187, -24021, 2628, 28464, 10998, -3156, -44889, -50089, -39985, -43077]
7643d3077j2661k1333l408Q5791R1213o730k0674m0359n4450k2952J5658L6324
7631C342L4533l5219k8824R374J0374L8838N5163l0136j1700m229j955m0156m581
7618e176K4350M0804Q356n7620l6406J08K756j9579J6797J9471j653k1989R766
7605b0015L4097L5027K4399l7287k4585L290J758J5646p212J1491k2086m1945
7593b7422k9416M3100K9279j4369p339M2955p809m4957j4842J291J5385N4408
7581D0264j0064J4658j9856j6454l4659K859O9493L9397J158N150l5987k8643
7569B7316L332m73N999o3672m4222K9027K2300L475K886O229K2812R274N405J2464
7555D2152l8991m7507m2809N3899M8681M62k7710O472J7861j8257m5809j1087
$$ y = [-43077, -55738, -77071, -80479, 5312, 96525, 89795, 69121, 28762, -25688, -48640, -32982, 3342, 37875, 2656, -26168, -16794, -6420, 32418, 87581, 57445, 45745, 41516, 39561, -595, -5176, 19174, 59978, 68334, 10714, -25692, -25584, -22828, -42407, -25610, -6139, -7792, -29781, -20015, 14082, 49109, 73508, 36221, 11636, 14926, 16684, 32330, 25118, 36609, 14523, -27422, -56838, -13738, 15541, 1172, -6167, 36788, 28979, -15978, -30820, -29529, -14144, 40264, 30200, 44858, 25002, 8548, -26111, -23252, 46241, 85638, 86796, 91946, 55959, 27316, 30648, 30175, 36174, -27498, -71720, -42693, -20393, -16918, -14032, -7803, 15009, 24283, 29688, 42152, 3161, -44346, -87155, -33256, 15425, 15887, -11823, -5351, 12510, -5747, -51556, -62643]
7543f2643N005o056L779K5491J3934q182M3224L2452j5501m0251L324M1n5611
7530f0994m9159L1349L6827J5952Q935J9849J3352K688k2039N235K6676R372k3165
7517A4878n7707j341L4866l6352o1299k217P1056L0463K508P765J5943r839k9367
7504b0643k6091M9216p256j5180m6226j586L7960K7644K3251R278J1448O118r275
7491C8658k3489Q940K3904q78j1012N668j2937j4899p34k1524m3936P069m1636
7478h6806k132P5092K9394k1711j2089K7056K3189L2895J2953m2473k3236n4021
7466d1889m5061J5541J5178M2249L1353M777l1052j6245l647N1649j2555m0466
7454c0168k1921M3714k1229k0234k1182j3286L0419M4214J8235m2967J0944J7103
$$ y = [-62643, -57638, -63694, -59915, -34424, -20490, -28672, 14552, 47004, 31503, -8748, -5424, -5383, -60994, -110153, -78804, -41977, -26025, -17090, 2759, 16111, 18799, -3240, 1995, 28671, 38043, 14878, -42829, -44170, -9304, -45656, -106955, -109172, -38116, -7653, -5145, 2620, 18563, 8724, -20643, -46734, 2482, -4774, -19954, -66180, -67766, -29806, -2162, 21089, 30367, 41815, 47933, 38658, 15169, 24109, 48013, 47135, 36123, 41791, 28854, 13955, 13221, -8303, -52239, -45170, -86806, -88938, -13846, 15548, -6163, -18252, 8804, 31993, 64888, 77841, 35368, 12132, -41889, -86950, -71409, -56231, -13982, 17371, 22148, -8904, -25149, -28796, 22853, 10298, -30168, -52089, -8375, -29604, -49838, -71020, -84306, -53887, -9673, 8562, -34405, -23461, -6358]
7442f358j3617J941N761P347M384J9291M95r495j8844j156J5915j9772j6447p265
7428c7820L919J8127N115k755q560m9799m065l530m5984N857P0793L3838M6187
7415C1323K6444l7091r988K0122K6967q813k8141n2321k6225J6048j2980l4988
7403h9643j9293J6356L6279J4496m1306k682j108J7255j4120K9218j708J3685
7391d2571K6810K0696j4262m1192l48J400j3698j2788K8045o553K4141N8213R89
7378B8882m0025j035m634j2973M3208L2441K0660l7435J8310j6429m1784n2381
7366f3195m1933l238O3260P4589R388k1130l4477J2884K0100j0961J3720j0365
7354H642j6116K3686K3354k0522k1868O398p208J2506L224R213J6194J3520k8185
$$ y = [-6358, -19975, -18034, -12273, -4926, -542, 18749, 19244, 9749, -9095, -10251, 5664, -14108, -30555, -37820, -33901, -15774, -10659, -13414, -21974, -71773, -75838, -79368, -125352, -119495, -48702, -14864, 31323, 57767, 20676, 10688, 30810, 57777, 48964, 20823, -31498, -57723, -41675, -54655, -89643, -108936, -92580, -56301, -41805, -83111, -85793, -86901, -69646, -83766, -54548, -56256, -42571, -15761, 4935, -9327, -50519, -50867, -49467, -63165, -75953, -47908, -54461, -30320, 27893, 28882, -11143, -12178, -16812, -29785, 13423, 45864, 66524, 29089, 47399, 30970, -10814, -63195, -105128, -108366, -45106, 29483, 38871, 17741, -16736, -3852, 16248, 5287, 19007, 8642, -7474, 16212, 39566, 19044, -2824, 3574, -3634, 8872, 12096, 21309, 37503, 51023, 22838]
7341B2838j0784l9517R908N774l1484J1988k1084K237J5370j1307L7018L2636
7329B3593M169K1140l2857k1378k1780k762m718l4492j535Q943L039l038L614
7316e8062L641K807O205K4006j6895m458l0081j3086K3797K1254n923j2519L7464
7303b1850j8699k5903K1621l415q101o792L74J6043j2431j3418K2883q237K2993
7290c4932O335j971J4953L5954L3597r17k4227j829k5671m6179J0834M8229K3809
7277C7985O824l5504k4847k335J348j2478j8901J2625j4334P068M2216K4794j751
7264B2710L0007j1771n8572n731k249K3994J3794n062o743q12j4411Q046P81K4632
7250A8613m0605j5342L7595j7189o38L6746J1140j3220m0343m1391j9919J3125
$$ y = [22838, 12054, -27463, -17555, -11781, -43265, -31277, -52361, -50124, -34754, -46061, -9043, 23593, 27762, 48902, 16045, -5333, -27113, -29875, -34593, -69085, -70620, -61677, -58638, -61676, -58062, -54421, -51614, -45409, -21403, -38298, -42756, -72837, -85923, -62126, -40872, -46795, -59314, -21850, -40549, -66452, -44831, -48246, -56347, -63139, -62765, -46722, -59153, -72571, -49688, -57925, -34932, -28597, -30568, -15615, 20339, 53936, 53019, 28792, 26963, 1292, -44887, -34053, 14176, 37985, 44809, 9305, -15542, -17877, -16529, -29007, -47908, -35283, -49617, -42549, -333, 24461, 22710, 52717, 40946, -17626, -23357, -25606, -1612, 12182, 7120, 377, -435, -14846, -6800, -6019, 18613, -21992, -37334, 261, -16928, -17566, 19180, 30320, 17100, -23243, -64634, -84553, -71428]
7238g1428k8920L1928J2264J7056L3173L2958O747p376n698J654m1831m4279k7624
7225i1376k622J6783J9549k61J5624J2465o374p447o538l930o120J2910L3564
7212a3773J309K4622K656l7954n727K8043j5765k9498j7321j3291M6397M1973
7200A1671k0820j3684l502K638k0368j5931K5563K0383M730m043p872o226k1914
7187d9375n550j7565M056R051J5640K3651K0646M6329P100j6969k4863q567J1890
7174A5474j010P707n035k1605M784M9611m77p0672m7102o717K2009P6517K0681
7161D4165j6363P777J041k8210l7232O958O695J3641J6040j8859M524M7341P348
7148E4866j5188k1942k8516M048k9557l3950J1838k413k7810m308k3968N068K8029
$$ y = [-71428, -100348, -68420, -56156, -39100, -5927, 27031, 33778, 26402, 20704, 22358, -19473, -63752, -91376, -93998, -77215, -57666, -57927, -42303, -29838, -36212, -43659, -50197, -54127, -60247, -47337, -13773, -12464, 12158, 14814, -23140, -28867, -824, -16589, -46087, -63408, -76699, -30302, 11671, -9149, -22833, -26335, -23697, -44065, -59996, -34433, -14050, -9320, -13363, -21235, -27461, -49375, -54925, -72490, -68434, -59383, -43743, -20092, 554, 46883, 53983, 37014, 12151, 3584, 15474, 14464, 22171, 17136, -4469, 315, 49926, 49449, -21223, -68325, -75042, -53033, 23484, 44165, 27802, 35579, 36620, 8410, -28822, -21864, -15169, -1528, 14512, -4347, 177, 47518, 54866, 39678, 17736, -10780, -6732, -36289, -70239, -58401, -60814, -88624, -92932, -116900, -111832, -83803]
7135h3803l8224N2031R174O027J5686J4451l3713k977P858R062M8193j3461L5367
7122B5671L8129J9113j7437n2277k2725K972l74l3019L314K9595l0902j1972j0045
7109e9957K4589k7490m4299L5632N6852M9389j244l5358p2864j0520P483q195
7097h5982J3839J3101L3098j96l0065J7143K2391N4986L576l521k1838n2924k9693
7084f6085m07J9345N731J661J865k0743K3168N1917r705l7269j9048j6337k462
7071f8369L3051j656l4559L5842M3187l9416o3503j9071O0444O1468N940l2968
7059a9610K7457o487q49L95M2802L7569l9094j4226l7077m1073L741L4989N0392
7046C8929N177k6546k4793j966p529J001R731J0851k9921L8343N8599l8117p712
$$ y = [-83803, -122027, -69996, -60822, -54795, -39109, -24658, -58371, -61348, -53490, -44428, 3765, -9696, 25671, 63800, 82913, 65476, 13199, -9526, -6554, -6928, -39947, -36633, -7038, -37940, -49912, -59957, -35368, -62858, -107157, -71525, -14673, 34716, 33472, -1886, -74750, -85270, -77787, -85982, -72143, -59042, -25944, -26140, -56205, -39062, -16671, 38315, 41891, 38370, 16532, -36392, -66085, -66492, -47147, -41416, -39755, -37890, -58633, -35465, 16452, 6747, -30522, -49570, -65907, -68369, -35318, -36974, -71533, -35691, 7496, -31920, -95423, -114494, -54050, 7418, 13358, -19610, 7847, 1360, 511, 906, 43708, 81277, 42183, 27957, -9120, -50193, -46452, -11463, 38929, 44106, 17560, -7233, -9199, -16728, -15727, -5996, 4855, -25066, 13277, 71876, 33759, 26047]
7033B6047j2579O148o412o4974j6848j1191k2514J453K656K225k631j322m575
7020a04517M9377L6402k3930l6944j6534J6614J403J045L4676n228Q696L753l135
7007c8322J0288J6707j4216L8435N1612j3576n5380j8701K7144n553k1360l2031
6995e4953L4432j3863k4253L8738k0803k9556P196K2211m504J0561j3001j9824
6983f7619K9017k2017j7304K6694J5311o225k7059N234Q322L6752r501o307J9670
6970a5032P178K251K7709l3110j6474k7457Q696j701l0586l2594k813P2993J8413
6957b2527n1989J5884O1309K1996r548l238J1306k0890r427J147J972m1403J7684
6944b7724K8408k2170k7268J6304K4598J3544o2939r422Q0235M2703j2560l0799
$$ y = [26047, 13468, 19616, 13204, -51770, -68618, -79809, -102323, -100870, -98214, -95989, -98620, -99942, -104517, -55140, -18738, -42668, -79612, -96146, -79532, -78129, -77084, -42408, -47636, -38940, -35187, -38322, -28034, -11327, -25543, 12892, 64504, 50928, -4452, -23153, 3991, -1562, -22922, -54953, -20521, -34384, -58637, -19899, -40702, -70258, -63062, -40851, -45355, -34794, -47795, -67619, -38602, -60619, -77923, -51229, -35918, -42143, -69202, -63968, -55646, -18894, -28395, -34702, -15032, -7854, -5603, 22106, -11004, -27478, -54935, -46239, -47940, -78526, -111120, -113933, -40940, -22527, -74516, -58632, 2677, 24673, 15125, 11887, 23193, 2303, -7124, -5977, -4005, -45408, -27724, 684, -21486, -48754, -32450, -7852, 5692, -57247, -66669, 13566, 56269, 43709, 12910]
6932A2910o527K381J0547j8498q300r304m397J5785j7658k3090K1687J079j1973
6919c5358M1169J8109k9013j9732j490K5778k1575R966L2412m900l687r383J9538
6906B1834j328o177L1692k2186l5361j834J4018j4231k5575J4209L6073Q617l0480
6893a0729o7682l03M3126J1937P660k846l2461R2j7209L3012J4429K8916L0365
6880C8307O290K9351m129j4509K2178j7704j6579j5898j0030j9937j9077j0414
6868c2151l6686j2476K3733l159p021R896J8436K7648o719o168j8742q0938j5183
6855a39530L9059K7368K7537n953Q377j3774j449j9848n454J586K0819L4540J3167
6842a3555j5454Q030j6898k0519J1199J1051r675l4752J3573J7009N995J413j6337
$$ y = [12910, 6383, 8764, 19311, 813, -7487, -16791, -21188, -5403, -23061, -46151, -24464, -23385, -35358, 5811, 23920, -5093, -24825, -26315, -537, -22112, -12146, 20266, 15366, 11679, 2296, 21834, 20506, 14329, 46021, 23835, -11526, -13360, 658, -13573, -39148, -24939, 11134, 19751, -10729, -78411, -78714, -35588, -23651, -15991, -18837, -51298, -51206, -68415, -35403, -20974, 7942, 38307, 44597, 73948, 69819, 55310, 77488, 59784, 43205, 27307, 17277, -2660, -21737, -32151, -68837, -81313, -57580, -60739, -67760, -57864, -39428, -11780, -18499, -24667, -43409, -124347, -139530, -100471, -73103, -45566, -51519, -43142, -56916, -58365, -78213, -83667, -82081, -61262, -26722, -13555, -29009, -20979, -37877, -58396, -47197, -36146, -45821, -80573, -67000, -49991, -43996, -42583, -58920]
6829e8920K5060J04415L0706o4976j538R770m03O741j3753l2051k2010J3731j298
6816d526J3144o341J0917J1517K5236k536q570n5232m4001N7910K2834P702m5613
6803a7559k4943K1358O488j2120j9574J8882k024K4199L3753K2180n5489j7197
6791b2046J1710p63j9343K5276n4956j8859m502j9247M2277M099L7534L9835k4262
6778c247l8424m4252r061J141Q145j1651Q174N1964k1482n4293o509L2197O0760
6765b6538j1718L8136m051j6547K1264L8379m318l1541p026o806P053K8966k393
6752B2860K7952M013p792j3480j0182J8786J013k9960K2101L1792m587m0138j7928
6739D450K7765K0420p190j8461j3406k9722j9654K7728O720J4347o916J7735Q726
$$ y = [-58920, -33860, 70555, 101261, 36285, 34747, 44517, 44114, 50855, 37102, 5051, -16959, -3228, -4526, 8618, 2277, 13194, 24711, 49947, 47411, 38841, -16391, -60392, -2482, 20352, 28054, -17559, -42502, -21144, -14656, -26776, -46350, -27468, -29492, -5293, 28460, 50640, -4849, -22046, -10336, -11099, -30442, -5166, -60122, -78981, -83483, -102730, -60453, -56354, -18820, 21015, -3247, -41671, -85923, -94984, -93843, -85698, -97349, -89175, -37211, -58693, -112986, -119495, -87298, -26538, -38256, -120, -4171, -20718, 546, 38925, 34607, 3066, -3960, -10766, -3713, 25253, 22860, 50812, 54825, 47033, 33553, 23371, 42157, 43170, 13210, 35311, 67103, 62516, 22378, 4450, 32215, 52635, 45445, 26984, 13578, -16144, -35798, -8070, -1350, 12997, 6081, 23816, 32542]
6726C2542j3252k9017j8342N094M2393P4032J03955J03250K0615p1373j17052
6715A32845p2623k9402j2541j0809j6204M0974M0402j7027k4132l4390k4968l9184
6703f7059l785k4385n90N5391L8465j8137j7676p070j3784j9279k0209O5905L5218
6690C005j5493Q351k2345j037J4505l5730K1678K2172R338L0347l0571k0988K5215
6677H447M0065j9849l3018m1213J1267k3173K2391Q894N616Q234J6371L9981j1355
6664C2658m9476P292R804J0222n6491l3556M7827N4878j3254o2626j1303N9655
6652d370J3807j0653L462L359k0436m546K7678M3054k0021o7268P961M7661m1411
6639b1723k5542K3148M8974j1666l7513P404M7457M243m7730l5232K1796N4873
$$ y = [32542, 19290, -9727, -28069, -22975, 19418, 93450, 197405, 300655, 321270, 249897, 132845, 60222, 30820, 18279, 7470, -8734, 32240, 72642, 55615, 31483, -2907, -27875, -67059, -70844, -95229, -95819, -40428, -1963, -20100, -37776, -44846, -58630, -77909, -98118, -32213, 3005, -12488, -4137, -26482, -27519, -13014, -48744, -27066, -4894, 4444, 34791, 4220, -16768, 8447, 48512, 28663, -4355, -45568, -34301, -57474, -35083, -26189, -20573, -12339, 4032, 44013, 32658, -16818, -9526, 278, 10500, -45991, -79547, -31720, 23158, 9904, -52722, -64025, -4370, 9437, -1216, 2246, 5605, -14831, -19377, 8301, 51355, 31334, -35934, -27973, 19688, -21723, -47265, -24117, 24857, 13191, -24322, -16918, 30539, 34782, -12948, -48180, -26384, 28489]
6627B8489J2263J9476k0599j287O873m9087J14L9070k9252j3719J6859j6750J5599
6614H049K9748J124r018j8554m9374l8347n969M2139N8625j8759n5776k1320O7674
6601i758K6219K2744N99l1452r24l675k490J8968J5733j6501K9745K5820k1682
6588E3346l358k1579l1200m33k709J9478M200J0467k7315j2383q38J1911K7821
6575B7408K5962j5180m3792O36p0285j5387K9368L0745J5874J508K7708n401J1189
6562B0353n554k2344O591q110N519Q498L1N759O460r303j5058n261k3897j600
6548c7916K1644q419O422l7129L3766L3566k6926j1264P046p583P969j8885j7056
6535e4765j5878l6537M2174J3140K8135O901K9565q575j8381K3842j4393K217
$$ y = [28489, 40752, 60228, 39629, 38342, 45215, -3872, -3758, 35312, 6060, -7659, 9200, -7550, 8049, 37797, 38921, 29903, 11349, -38025, -76372, -82341, -40202, 18423, -336, -56112, -77432, -9758, 16461, 39205, 39804, 8352, 7428, 3753, 1263, 20231, 35964, 19463, 49208, 75028, 53346, 49988, 28409, -2791, -3224, -5933, 13545, 17745, 28212, 897, -11486, -12324, -413, 27408, 53370, 38190, -5602, -4966, -75251, -90638, -61270, -30525, -14651, -13143, 14565, 9164, 20353, 14799, -7545, -954, -9064, -3545, 4953, 4984, 10743, 17203, 7900, -7158, -12419, -36316, -37916, -16272, -24691, -18269, -55398, -21632, 11934, -14992, -26256, -19210, -26793, -18824, -37709, -54765, -70643, -107180, -65006, -51866, -23731, -16830, 12735, 4160, -14221, 9621, -4772, -2555]
6523b555j955l4451m165J3147K4582R915l2001l0512M2502L5246L462k4120k6706
6510b7611j1687j0422n523N5811q412n9203M153M5493P08K9251N554n6220j5088
6497e3196L9757j4424j7933k6511K1295l964K0397L877k4803M704L0550K3622
6485C371R422l3078j3976J4542l9224j4618J2856P045L3732L7139K8693J5208
6473F1112N515p29j4314l3231m0177k5254Q289n359L1638M9872M2085l8003l6892
6460D552k952K4033j7905l5897r151K4003j6504l1827j7008O7514N4237j518n147
6447C6430J936K2448m3415k3804J4234m206p8797o1554L4624M6175M4184J0589
6435a156q138J0623N6851N1657R674m2718k8372m248R969o9940q741K591M0857
$$ y = [-2555, -4510, -38961, -43126, -29979, -5397, 4518, -27483, -57995, -15493, 19753, 23215, -905, -27611, -39298, -49720, -55243, 568, -7844, -67047, -62894, -17401, -16693, 12558, 18112, -38108, -53196, -13439, -27863, -45796, -72307, -51012, -54976, -34579, -30702, -55505, -50801, -20251, 3371, 12793, -20285, -34261, -19719, -58943, -73561, -60705, -53660, -19928, 17211, 45904, 61112, 66627, 65898, 51584, 18353, -21824, -47078, -38789, -44148, -12510, 37362, 79447, 41444, 4552, 1600, 25633, 7728, -28169, -37320, -13317, -29821, -61648, -78656, -11142, 43095, 41577, 36430, 38366, 60814, 17399, -6405, 7829, 3623, -75174, -136728, -102104, -55929, -11745, -1156, -9294, 1329, 58180, 109837, 119511, 76793, 48421, 44173, 54142, -15798, -24539, -21948, 18909]
6422A8909j3021l0385m90J2757M5267o876o200J1694K2975j1274m4742l1568p357
6409d0311J7466J1024k441m8555J0257P8731J0878j537l0356M852k8926l2899
6397e1817M1592m669j6833j3840k1664L0702L5150L0392Q614l1832k3479j7543
6385c5227L9764K097J367K5456J4368j4909M367k6235J0080K157m8867m6167J3561
6372e8188M4458o240J672L784J9937K9317j4511k2834m689J3722J9889j9057m6908
6359c9648L710L9686K1832j6835j5035k3090j4448K751o461N04M711j3070m078
6346e9471J397J2692j149J5705q846L0224K4443k55j0757n591j1664Q039K5746
6333B0513N0128O774n5733j6772l857k7077m665l957J2972l653J6304J2202j1002
$$ y = [18909, 5888, -24497, -24987, -12230, 33037, 26161, 19961, 31655, 54630, 43356, -1386, -32954, -40311, -22845, -11821, -14262, -62817, -52560, 26171, 37049, 35512, 5156, 10008, -18918, -51817, -10225, -14894, -31727, -45567, -67231, -36529, -1379, 29013, 37627, 5795, -17684, -35227, 4537, 6634, 8001, 33457, 47825, 32916, 37283, 11048, 21128, 23285, -25582, -71749, -58188, -13730, -19970, -18298, -14514, 5423, 34740, 20229, -2605, -7294, 6428, 26317, 7260, -39648, -35938, 3748, 25580, 8745, -6290, -29380, -43828, -41077, -47538, -47034, -42323, -55393, -59471, -58074, -45382, -46531, -30826, -39672, -9448, 14995, 14740, 3983, -1608, -13272, -5233, 20513, 70641, 77415, 21682, 4910, 1053, -26024, -30689, -34646, -21674, -25327, -9023, 3179, -7823]
6320g823l0009M289L1915P292k274p215l5011K2075J0678k0630J6541M7130m1581
6307d623j3580J8209l52R421K3273m160j1565m2234o6664N8609L9095j3168N460
6294b279k2588k3652K8732p990J7913k9610k1225R962P600j8789K6472L2847q523
6281a1130J4772J2217K3045n9302n6641q257K0017K6655j0140L4431O498l7306
6269d5141j2956O006K1228N4933K3736k1142o9188J9632j2269q379J0399K6915
6257f226J2260M1356j1215J2229k1824l9106l8587k093P5724N090M9545k591j0877
6244F3685l1226k7067k5698j3931k710J3043n721R302p277J2760l6784K8246L730
6231a9648m5784o501M0406N3564O40j0199k7177o0342j6438J5983N6775K3575
$$ y = [-7823, -37832, -33543, -1628, 5664, 3390, -3825, -38836, -16761, -6083, -26713, -10172, 36958, -4623, -18203, 6, -346, 9075, 32348, 28188, 16623, -25611, -92275, -33666, 5429, -7739, -2279, -24867, -48519, -19787, -27777, -9864, -39474, -60699, -50737, -43137, -61926, -35454, -2607, -11130, 3642, 15859, 38904, -20398, -77039, -85296, -65279, -38624, -48764, -14333, -7835, -45141, -58097, -52091, -30863, 24070, 47806, 26664, -42524, -22892, -35161, -43540, -33141, -6226, 6034, 47390, 36175, 48404, 26580, -12526, -51113, -53206, 22518, 27608, 77153, 74562, 63685, 32459, 5392, -20306, -34237, -36947, -23904, -29625, -20323, -27600, -14840, -51624, -23378, -19648, -65432, -71933, -31527, 22037, 22677, 12478, -14699, -75041, -91479, -75496, -18721, 4854]
6219D854n7535l7196K0277p559j4070J7327K707p068N4305m56L2295k3979m2987
6206e9085L2605K6494l2002J2403o925J5569l2640J3819O2542Q114p117j313j9080
6193A3384l5135l6901n576J7310M1139L1488l3338J9810j7803k3411j6908L810
6181d2131L6668r747l700J8506J4085r788q113k0633J1473M3762J6854L50k9567
6168A8019k8772j7244p562m716k969R74j138K5097N500n3508n233N2676M2113
6155B3237J6707o031l5136l3628N0954L983k2106m0240K1440L2628l722m682j2344
6142h940J2041J610j4607K4437q954l8931j5165j311J2938K644k6698j8602J5375
6129f4163M4264J9497k9213j543K983K1594j8646O697J2930j0023l644J5290J3946
$$ y = [4854, -52681, -89877, -69600, -77159, -91229, -73902, -71195, -78263, -23958, -24414, 7881, -16098, -59085, -26480, 14, -31988, -19585, -26510, -10941, -43581, -29762, 32780, 40894, 33777, 32464, 13384, -21751, -58652, -64228, -46918, -5779, 25709, -7629, 12181, -5622, -29033, -45941, -42131, -5463, -15210, -18910, -404, 13681, 3893, -4220, -24853, -13380, 30382, 47236, 47586, 18019, -10753, -27997, -35559, -40275, -43244, -42270, -43408, -18311, -12811, -66319, -71552, -18876, 23237, 39944, 33913, -1223, -34851, 16103, 20086, -2020, -42260, -20820, 11808, 8086, 3404, -8940, 3101, 4711, -9896, 14541, 5587, -33344, -48509, -49820, -36882, -34238, -60936, -79538, -64163, -19899, -402, -29615, -31158, -28175, -6581, -25227, -18530, -5600, -15623, -19267, -3977, 9969]
6116I969r63k596j5489j6267n5173l5845M4431P4413n573p899J6340j3060L3353
6103B5641M3939N472m5842l6298L5608n950o917M683j7871O097k557J651K9719
6090C7375k5254K81m8656J7385K7000K1544J2692n2349k9711M3903L2140m2058
6078e708J607m820j4784k2356M6085L8183K1980k387K0611k5233k5149o591k0152
6065A286J1533J2094p883L0621k3753l9979q432N807K9853N1924N840j0616k4269
6052C4026l7788j4893M822k5978m0938o311K7759L3003k4389j3220o23JJ0720
6039e3809j9384J2749L6637l629k5421j9078M002L4402O53j6606l1284J3199L492
6026f4077J6994K9270p135l3738j4352K8263N2608K6670m8145q594j4426K6605
$$ y = [9969, 9006, 6410, -9079, -25346, -80519, -116364, -71933, 2480, -3093, -10992, 5348, -7712, 25641, 69580, 75052, 29210, -7088, 28520, 22570, 15653, 20336, 2465, 8562, 6005, 7656, 37375, 12121, 12402, -36254, -18869, 8131, 29675, 42367, -9982, -39693, 4210, 36350, -5708, -4101, -8921, -23705, -46061, 24, 38207, 60187, 57800, 78411, 53178, 28029, 21438, 1286, 12819, 24913, 17030, 47651, 23898, -16081, -24513, -18706, 11147, 63071, 68911, 58295, 34026, -3762, -18655, -13833, -39811, -80749, -87060, -59301, -26298, -50687, -63907, -64530, -64529, -53809, -73193, -60444, -23807, -27436, -52857, -71935, -67933, -33531, -32878, -49484, -80768, -67569, -64077, -47083, -17813, -24948, -58686, -73038, -44775, 7833, 34503, -13642, -22236, -36662, -10057]
6014a0057J6747M420n858M774n913m114J7211N86L4877J5335k425l2422n5505
6001b2344L356L0125k1354K8249L6737r91o661j7006r184k7102J231J3139o1842
5988e3647J0872q934J0338l614L55k7653p382O501K4450K449j6593K3551K4077
5975a5230J2156j0366l6128j6106M1308J4729J9442N389j0628L680J9595K9528
5963E7369j7060n1096R106j8884l490K7149L3787m7493n3656L3143M6598j8698
5951c225n6513L3892J6246L0575k7315j8392j0103l6476J4280q519K0515J7571
5939b7464R807K6601l634m8105J4151N6709k870l7300K6977M1870j6591k0476
5927A9675l8215L6393M4150q79K8005p891n2806m7496o174L1253L1296l2583k3160
$$ y = [-10057, 6690, 11110, 5252, 10026, 4113, -1, 17210, 17796, 52673, 68008, 65583, 33161, -22344, -18988, 11137, -10217, 18032, 54769, 53778, 47117, 30111, 20927, -6175, -4944, 8195, -53647, -42775, -51709, -41371, -44985, -44630, -72283, -79665, -73164, -48714, -46265, -62858, -39307, -15230, -3074, -13440, -49568, -65674, -24366, -9637, 9805, 15194, 4566, 8246, 27841, 57369, 40309, -10787, -1681, -20565, -24055, 3094, 36881, -10612, -64268, -31125, 15473, -3225, -59738, -25846, -9600, 20975, -6340, -24732, -34835, -71311, -57031, -65550, -45035, -27464, -17657, 8944, 5310, -42795, -28644, 28065, 25195, -12105, 14872, 56742, 40151, 19675, -18540, 17853, 62003, 61124, 89129, 81238, 28432, -19064, -25238, 6015, 37311, 4728, -18432]
5914a8432Q025L7688l5666K1160L5691p242k2713j0442l9141l8511j4648J0836
5902g3395L1384K3878q271J3889M7603K5640n8813k6038Q17m887j5681J6413Q31
5889b6630K9673L1677R289j2170j5519l8265J546j3725J3383K5297j6203J8902
5877G255k694M461m713o3483Q729M3747K7838J3477l5701m6923k6500L211J1166
5864f0130J4257P479p936K9225l9794K527M4488k8294q100K1161k0221r141K5274
5851b9205M1096K7671p954J8461K1047J4455m5635m6604M486l3622p106J6254
5839b6656l6556j5802L9145K4214k3344k7222O957K932J4278j3049M600J6986
5827c3517L2520m4807J2836K7583J6637p145j9607n321n941J1034j1652J2654
$$ y = [-18432, -10407, 27281, -8385, 12775, 48466, 41224, 18511, 8069, -31072, -69583, -84231, -73395, -42011, -18133, -26404, -12515, 35088, 60728, 1915, -24123, -23306, -28193, -43874, -27461, -26630, 3043, 34720, 44009, 31839, 16320, -21945, -20399, -34124, -20741, 4556, -11647, 7255, 4561, 9022, 4309, -59174, -50445, -6698, 21140, 34617, -1084, -48007, -74507, -71296, -60130, -45873, -38394, -46330, -17105, -56899, -54372, -9884, -38178, -46278, -25117, -45338, -54479, -29205, 11891, 39562, 31608, 50069, 71116, 85571, 39936, -6668, -2182, -35804, -42910, -26656, -63212, -79014, -39869, -15655, -38999, -66221, -59264, -56332, -42054, -55103, -50503, -33517, -997, -45804, -32968, -5385, 11252, 4107, -15500, -20821, -26762, -15728, -27380, -14726]
5815a4726J8203j0470n8950K3662J2637j8572J2176J4271m687L8371K8046o761
5803C3200K1017l8768m6765K2638L8948K1731k8164o563l0284k2201j2020M025
5791d3206j205J0532l248l755j8296N5364K8269k3558k9812k6732j1274R859K0834
5778c6228j1920m2403l2379J4574K735N2220o084l1317k4143K6223K9779K480
5766e6463N29K1321J708M0119M3858M3272j1713n7518m3866j4549N0639J3375
5754C0712P438j4912k4799R265J3846j5000J5662P243m3832k3903M6100K2757
5742C0577n425m3324p590l5415J4914L9048K6673K346j6406l039j7804k0959J3301
5729b3103J1346j7950k66K8627k280o613k4924O381K461L638m300K820J506k0018
$$ y = [-14726, 3477, -6993, -65943, -42281, -29644, -48216, -36040, -21769, -26456, 11915, 39961, 33200, 54217, 15449, -31316, -8678, 30270, 52001, 23837, 17274, -13010, -35211, -47231, -43206, -44411, -33879, -37127, -40882, -59178, -3814, 24455, 897, -28915, -55647, -66921, -57062, -36228, -48148, -90551, -122930, -108356, -105621, -53401, -59485, -90802, -114945, -88722, -58943, -56463, -55934, -34613, -32905, 7214, 51072, 94344, 82631, 25113, -18753, -33302, 17337, 30712, 38150, 23238, -1561, 7704, 21550, 6550, 22212, 29455, -14377, -38280, 7820, 30577, 25152, -18172, -25762, -61177, -46263, -7215, 19458, 21804, 5398, 2359, -15445, -36404, -23103, -11757, -29707, -29973, -1346, -3626, -10239, -35163, -28782, -26321, -22683, -26983, -24163, -22657, -42675]
5715d2675k7044k0954J9414P0138k459j3903L419K0165l2127m8095L8929L1195
5703c997o1522k3355J0811J9272O2498J7819l4846m573j71L3332M196j5333K5477
5690B9608l6164n7766Q057K4687K0567M561K8585L1478q126p8625K2966P4343
5678F4171j1170j8463N531J519k3820P727j5837l7633k3388N199L4046j9136m6635
5665g7889N3485K1416L3148l7885o201N327J457M2908L7273m2083m3646J6038
5653C348L8086o6107k3116K8567O495K9433M8686l8620m3426m3110m8L4379l99
5640b5832l2825J628j1896k2018j2263K0318K5138K6937N7034O736j2085l4670
5628a3798l3889R172J6149j705o140j3963l227K8203K4634j5411p269k4785J5085
$$ y = [-42675, -69719, -90673, -71259, -1121, -3580, -17483, -14064, 6101, -26026, -74121, -35192, -3997, -65519, -88874, -78063, -58791, 3707, 21526, -13320, -17893, -18064, 15268, 19464, 4131, 29608, -6556, -64322, -56265, -31578, -11011, -6450, 22135, 53613, 45487, -33138, -10172, 64171, 53001, 34538, 40069, 41588, 17768, 25495, 9658, -27975, -51363, -46164, -12118, -31254, -77889, -24404, -2988, 30160, -7725, -13926, -8599, -7142, 35766, 73039, 30956, -12690, 3348, 41434, -24673, -47789, -19222, -12727, 16706, 65392, 26772, -16654, -59764, -59812, -25433, -25832, -58657, -57029, -68925, -90943, -103206, -82888, -57750, -30813, 26221, 32957, 20872, -13798, -47687, -38515, -22366, -24071, -30211, -44174, -47401, -19198, 5436, -9975, -17244, -42029, -26944]
5615b6944J7112o309J8064J2345k6736j6132K8166k5165j9221K3007J6924J4985
5603A0096k1849J3370K4560q332m7993j2223N5897k974K149m3800J5690K4443
5591I034P771j9585k1955K3107l150o6472j4972N185k2336n45k4222m0012O4890
5578a03262P4836O140o604N82N982L551j0803O755l2915k0662k2982J7975l241
5565h4648k3474l242J4173K248N3524K2423J5712k0919m1178q293K0972K446m7955
5552i8211j2214J9463J3068m095q063L7746M0738J8156N0628O884o5886j7631
5540a9417K024K3725K0040K64k5840l0793l886m5397l94J1704J5619K5391k7778
5527e4738r570L4323J7362L3345l1745k0763J9449O436K173m9158L851K5781M1895
$$ y = [-26944, -9832, -16141, 1923, 14268, -12468, -28600, -434, -25599, -44820, -21813, -4889, 10096, -11753, 1617, 26177, 17845, -30148, -42371, 13526, 10552, 12701, -31099, -15409, 9034, 16805, -2780, -24735, -1628, -4778, -71250, -86222, -81037, -103373, -103918, -128140, -168152, -103262, -28426, -22286, -28890, -28308, -22326, -18775, -29578, -22823, -55738, -76400, -99382, -81407, -84648, -108122, -111364, -97191, -94943, -41419, -18996, -3284, -24203, -65381, -73674, -52702, -50256, -98211, -110425, -90962, -77894, -81989, -90052, -52306, -11568, 6588, 57216, 64100, -1786, -19417, -17393, 6332, 26372, 26636, 796, -29997, -33883, -79280, -79674, -67970, -52351, -26960, -54738, -64308, -29985, -12623, 20722, -11023, -31786, -12337, -5901, -3728, -52886, -49035, -23254, 18641]
5514A8641m6219l1367o329K0122k844N722k3974R454L1355j7593j76K751j7652
5501e8109l2823n22O5431J4317j8523p022L3235j0024n5479N405o436K1496r877
5488e8931L480l8722j1934M0147M4093Q331J0904J8859J858j3966j634n473r414
5475a2402J9959Q681k7763l9843J2868k5077J5152K1743K5875k040k6575j1719
5463d1141M8475Q089k0147p16L1628l5798n616j87n478J1073m1852m162P865K9298
5449a8669K3367R982k1828j4981j0330m065J6614k6639n666J0665l46M9065M3682
5436E0851r0910m1902j2839J2914M9327j8362K9568O4212o02L642p4945q32k1356
5423e1234J1259n01R540K3815J1909k582Q670l025L490K472p401j9859k6793J8233
$$ y = [18641, -27578, -58945, -65274, -45152, -47996, -42274, -66248, -56794, -25439, -43032, -43208, -40457, -58109, -90932, -91454, -26023, -11706, -30229, -37251, -4016, -14040, -69519, -64114, -70550, -49054, -58931, -55451, -94173, -106107, -65960, -21867, -13536, -2632, 16227, 18085, 4119, 2485, -2988, -12402, 7557, 16238, -11525, -51368, -38500, -63577, -48425, -26682, -807, -2847, -29422, -41141, 7334, 15423, -4724, -5440, 26188, -9610, -15226, -15413, -20891, -9818, -51670, -55832, -47967, -18669, 4698, 14680, -7148, -22129, -32459, -36524, -19910, -46549, -52215, -41550, -41896, 7169, 50851, -40059, -81961, -94800, -81886, -32559, -50921, -21353, 42859, 42257, 45899, -29046, -29878, -51234, -39975, -40476, -30936, -7121, 4788, 2206, 10876, 7851, 11341, 13813, 6412, -13447, -40240, -22007]
5409b2007l2101k449M7113j4502N628N1678O576J092Q871l757l9188J2672n114
5396A4512r304L1473j6753l4062p327P652k1567K4042J5633J940m1269K0302K1656
5383F928R557k8157m4876N2340L120K2083P39J4126J5574q753m0926m7912j4162
5370f0319L7793j8728j900l923L6675J7228k1656m2234J6852J6941P632j306K5801
5357H856R557j682j3859n5569K6456j957q240J2922J5108r623K731P874N925K9401
5343B7900K777K28l7397n2173m388M4337k310j1744K8928p860J8424K3397L6456
5330F6575L1588j1631j9664l6777j7412j0925r050N967l5327K4008J1557j0319
5318a1410J9023j7335l6324K4130N4783K3297k2107l6493n340P965j1615k2210
$$ y = [-22007, -54108, -56557, -9444, -23946, -18318, 33360, 39936, 41028, 49899, 46142, 6954, 19626, 14512, 5208, 36681, 19928, -14134, -21461, -13809, -35376, -11334, 4299, 6239, -35030, -14728, 6928, 16485, -11672, -56548, -4208, -1088, 20995, 21734, 35860, 51434, 42681, 1755, -46157, -60319, -22526, -41254, -43154, -47077, -10402, 6826, -14830, -57064, -40212, -23271, -15639, -16945, 8856, 18413, 16731, 2872, -52697, -26241, -28198, -36438, -23516, -8408, -18031, -15300, -7426, -1501, 27900, 30677, 30905, -6492, -58665, -63053, -18716, -21026, -32770, -3842, -11702, 6722, 30119, 66575, 98163, 86532, 66868, 30091, 12679, 1754, -7296, -1329, -36656, -12648, -1091, -11410, 7613, -9722, -46046, -21916, 32867, 56164, 34057, -2436, -7776, 189, -11426, -33636]
5306c3636L0614L7310m8078l5713K2968j2469Q080J0920k1572n692M4836M6615
5294D4183L5329l3819m3766l0927n6855J159J6041L2492N1341L3583j9368m5198
5282a5805k5699n420p990R379J1062K5246n532J3648k101j5395j0613j9264k882
5269e1366j5616M4157K5066K6400l841k4840j3995n177J928L4036J7161n0598
5257a6685J0954L2138j0313k2917m0989l2126j1827K0149K4757P485k0706J525
5245e8555K7223J05k4392L1215l1407j8731L1769L1177p78K1983o071k0560k8574
5232d5596j2854O2546J204l5539l4364j0257m180j0214K018M2830M6925m657j2067
5219a4205Q718M2930q5o70k963k8581k2374L8764J2210m7898m7636K9817K4050
$$ y = [-33636, -3022, 34288, -13790, -49503, -26535, -39004, -30924, -20004, -41576, -47268, -2432, 44183, 79512, 45693, 1927, -29000, -85855, -84696, -68655, -36163, 15178, 48761, 29393, -15805, -41504, -46924, -54914, -45535, -34473, -9227, -14759, -1111, -3212, -18607, -29220, -48484, -51366, -66982, -22825, 2241, 28641, 24800, -40, -14035, -19212, -17284, 16752, 33913, -16685, -5731, 26407, 16094, -6823, -47812, -79938, -91765, -71616, -46859, -39374, -60080, -58555, -31332, -31227, -55619, -24404, -55811, -74542, -42773, -11596, -12374, 9609, 3538, -17022, -45596, -58450, 4096, 5300, -30239, -64603, -74860, -79040, -89254, -87236, -44406, 2519, -2138, -14205, -5487, 37443, 37358, 36688, 33725, 5144, -17230, 21534, 33744, -14154, -61790, -31973, -7923]
5206g923L1507K0389j9527l2285K2366O425l532l9658J3120L1807Q153p004m5592
5193b1754n8690k5739J2622N1263J6986J8347L3115k6591k9574O813K3165k3628
5181b3665k2683J3981j5380N6402J172n363O097k8275P475K0859k1615l9594K2356
5168b8233N0168K6105K454m0065P930k624M9113J2186j540k2020n3589O98J0875
5155A1458p842m970j3245J9613L2091k2811j0493p787l4477l6090O965O5300N2781
5142E0493l614o0288j1577O7382o525l9161l9852M1506M4302k4492k7075J6568
5130G667L0849L5667j7402n3809J0273K1986j5899j5149J2829Q031k6548l4808
5118c6313j3772N7393N2591p0530m9473j5432k0311L1942L8092o288m892K7383
$$ y = [-7923, 23584, 43973, 24446, -7839, 14527, 20952, 17420, -22238, -9118, 22689, 30842, 23838, -21754, -80444, -106183, -93561, -42298, -25312, -6965, 26150, -441, -30015, -23202, -37, -23665, -46348, -32367, -47747, 8655, 9827, 4464, 10561, -17714, -10239, 10620, -10995, -50589, -28233, 21935, 48040, 50494, 10429, 18359, 15735, 64848, 77034, 75494, 53474, -115, 583, 11458, 3616, -1354, -14599, 5014, 37105, 14294, 3801, -3986, -38463, -74553, -67588, -2288, 50493, 46879, -13409, -24986, 42396, 35871, -3290, -43142, -1636, 42666, 18174, -8901, 7667, 38516, 74183, 56781, 2972, 13245, 35231, 19332, 4183, 17012, 25043, -1505, -36313, -50085, 7308, 59899, -10631, -60104, -75536, -95847, -63905, -25813, -32101, -36993, -9610]
5106i610J7197q452n0302K1637J9833K3504r348J519K7131Q312Q742j734j8963
5093B9466K0932r883j7174k1729J713P722k2096J1963K6261J822m3940j7783J3879
5080a8847J4684M485n306k2835r736K889l134O1325J6627q109J8023n7757k4523
5067c2214L6777R693M3751j23m9360L868L5336J7833k5874r761k5203j7349l3966
5054d6592N025J9494r05n036k7633J2016q862J471j7625r533l767L3628K0211
5041b8108k7354k8725M0743Q507j6367j0561j3901N6058J5242n955M734R950J0636
5028A4899k4360m503M1064J9370k2392N914L7041k792n6517j3255j3293J573k620
5015a9871L1470L1094K545k5607p807n9888o3819J99M8743L6295k8325P554j1446
$$ y = [-9610, 7587, -865, -51167, -29530, -9697, 13807, 4459, 5978, 33109, 41421, 50163, 48429, 29466, 50398, 40515, 23341, 1612, 3325, 11047, -11049, 914, 27175, 28997, -14943, -32726, -18847, -4163, 322, -4984, -27819, -37555, -34666, -37800, 23525, 40152, 32043, 50066, -7691, -32214, 4563, 14256, 58007, 57884, 8524, 12392, 47728, 65561, 39687, 29926, 4723, -12626, -46592, -41567, -22073, -22978, -28014, -55647, -43631, -52493, -51022, -68647, -78180, -81947, -48319, -28108, -55462, -84187, -43444, -34937, -51304, -61865, -75766, -19708, -4466, -10421, -5687, 4263, 14899, -9461, -13964, 27100, 46470, 24078, 29992, 67033, 64241, 7724, -5531, -18824, -17251, -19871, 11599, 42693, 45238, 19631, 11824, -48064, -111883, -111684, -62941, -26646, -54971, -47417, -58863]
5002e8863m9991o831L5038L3535K2826K950j2256j3015Q033L3430J799r456l6193
4989d8994M5435l895k9118l1445j5396m756O107L9279j894n697N321M0945q387
4976a2495n369m582J1113k613j9219j3808J0680J7953j0680k8899r567J9155J9634
4963b8697k6983M9270L3928J812l1403q512k0129k6304K7119K7886L3220k9021
4951B186Q22K5496L6667L8292p175n7051k4914L1313L154J2628O708l4098l2832
4938A196j9817J5211M005J2280l2616N170p820J6918P839L991j1907K977k0124
4925b2697j4626k0318j567L2170K3432M4989r582k7276k5816K5828j9358j7590
4913c2411K0945M2050m0525l5295M64K3020K0681l742K1884o548k3073L944q81
$$ y = [-58863, -108854, -115685, -80647, -47112, -24286, -21336, -33592, -46607, -38574, -5144, -3345, -12801, -48994, -3559, -7454, -36572, -68017, -83413, -88169, -82062, -42783, -44677, -50374, -45053, -4108, -12495, -17864, -22446, -11333, -13946, -33165, -46973, -36293, -18340, -29020, -57919, -67486, -48331, -28697, -55680, -6410, 27518, 29330, -2073, -10585, -30714, -57018, -29899, -2013, 31207, 2186, 3008, 28504, 65171, 103463, 96288, 39237, 14323, 45636, 48790, 61418, 68126, 34028, 1196, -18621, -3410, 595, 12875, -19741, -14571, -22391, -5473, 2366, 6357, -5550, -2573, -22697, -37323, -57641, -59208, -27038, -3606, 41383, 31801, 4525, -21291, 4537, -14821, -32411, -11466, 30584, -9941, -45236, -44772, -21752, -1071, -4813, 17071, 10523, -12550, -8606, -9487]
4900i487K6565N123l1711j1512k5219K0836M8079m7847l5400N840o817o388o254
4887g4192M761j220Q641l4808M2335N5948J0749l310L7399q812o1678k8918J9448
4874c3657q168L2627J9453j6146k7268k418L0104Q29n4589R226L0623L6702K3074
4861D0392j5587k255M5119R553k6306k1732m4493K8911P2246j0573k9008l8510
4849G757j438O9468L1538m7687l0302J0311m0660j9531L7213J2958L9075L1304
4837A00006o7261m5257J4076L477r95k4909L2490K7857j674L34N636j1208j5993
4824A6579R795J5389M997j8429Q730k6786l7250l801P08K4505K3113k8455k6556
4811c7461j0744j875K3860o949j5292L5733M2467O161O413j0233j4244m0016J5181
$$ y = [-9487, 17078, 22201, -9510, -21022, -46241, -25405, 22674, -25173, -60573, -54733, -61550, -67938, -74192, -69431, -70651, -62010, -96818, -54483, 1465, 12214, 8904, 46303, 37491, -24187, -53105, -33657, -41825, -9198, 10255, -5891, -33159, -35577, -5473, -4644, -59233, -50007, -19384, 17318, 40392, 24805, 22550, 67669, 77222, 50916, 29184, -15309, 13602, 85848, 75275, 46267, 7757, 6319, 75787, 107325, 59638, 29336, 39647, -1013, -20544, 16669, 29627, 68702, 100006, 32745, -12512, 1564, 5041, 4046, -20863, 11627, 39484, 37810, 38144, 43780, 32572, 16579, 26374, 41763, 46760, 28331, 37061, 10275, -26975, -30776, -30068, -5563, 17550, -10905, -37461, -48205, -50080, -26220, -33169, -48461, -12728, 29739, 35900, 42313, 32080, 17836, -22180, -6999]
4798f999J945J8852L8724j5321o195m5776p185K3713L0445J9192j7860k8030j1903
4785f398J6089l3029j952M2519J4393j4606m2360l0195L5451L1743J0955P66J2500
4772C5876l9121j2821q861M7274l114j3055J7394K3068L4908j4745l234j5619
4760D7950k7247l4142p036l3100m2932J0939K8302J9603O409n861l6709R772L3964
4747c0088M4111j6454K7265K4002p0875k4445N3952n889l1257k1326l5932R32
4735h6004L8681K4348J483k7336k2082o770L1756N6780L8522L197m0235n6082
4723d3742M3643J8532o5450m8483L4161M6973P699J7614K1827J3475L2264j3646
4711F4867m7032l7868K7695n51q810J5319M15k9283n8699k0180K7775k71l6603
$$ y = [-6999, -5054, 13798, 52522, 37201, 31006, -14770, -21955, 1758, 32203, 51395, 33535, 5505, -6398, 9691, -23338, -25290, 17229, 31622, 17016, -25344, -55539, -20088, 11655, 22610, 23376, 35876, -3245, -16066, -24927, 22347, 19233, 6178, 23572, 46640, 81548, 66803, 63569, 47950, 20703, -13439, -20475, -53575, -96507, -85568, -57266, -37663, -31254, -37115, -73824, -64052, -30088, 14023, -2431, 24834, 48836, -22039, -46484, 7468, 1579, -29678, -51004, -86936, -86004, -47323, -22975, -21492, -48828, -70910, -77680, -45924, 10856, 49378, 52575, 12340, -43742, -99, 18433, -47017, -95500, -61339, -14366, -6667, 10947, 32774, 46249, 78513, 64867, 17835, -20033, 7662, 7111, -1699, 13620, 14035, -15248, -73947, -94127, -66352, -66623, -103226]
4698a03226K2604K5194L3134M140n860M3916K8505K2960M789l4094m3559r570
4686a1067K4011k6264j1640J1954j0885P143k2958k1457Q069K4971K4007L3872
4674B9756j3376m3348L8930L1136J25K8734L5985K4656l5752k6337k4725m3169
4662B615j1733K7184l654J6455K8536l4277l4891j4196Q600K8783m644k2976J4980
4649G82k873k6872j0290L9633K5280J419k2321o6460j2071N3969J5506k5190r39
4636c0427M2788L688L6688J9498N0551l7730p5676j8619k9297j1401k6079o7494
4624a43510K1547Q115j8201L5052j796l550M876k7054J3060N6499L9832J8911
4612C781o798L662l4704j5930N4841J3520o385K0567j7461k2218M935N332Q074
$$ y = [-103226, -80622, -55428, -22294, -18154, -24014, 19902, 48407, 71367, 76156, 42062, -1497, -11067, 12944, -13320, -24960, -13006, -23891, -16748, -39706, -61163, -53094, -28123, -4116, 29756, 16380, -26968, 11962, 43098, 43223, 71957, 107942, 132598, 96846, 70509, 45784, 2615, -9118, 18066, 14412, 30867, 59403, 25126, -9765, -23961, -15361, 13422, 8778, -14198, 782, -2091, -28963, -39253, 380, 25660, 27079, 4758, -61702, -73773, -19804, -4298, -29488, -30427, 12361, 16049, 52737, 72235, 122786, 85056, 9380, -9239, -38536, -49937, -76016, -143510, -121963, -113848, -132049, -96997, -98793, -102343, -97467, -124521, -111461, -54962, -15130, 3781, -3017, 645, -34059, -49989, 4852, 18372, 11987, 32554, 15093, -7125, -2190, 3142, 11216]
4599A1216Q757R62r29r49k1797q788j1880r95L8438J9638j8996j3662k7926l8434
4585f5345j8733K3908M2185M1194K8643j4122j0554R142o418k9494o2345j6946
4573g8885J6259N885K8658L3998J1197k3679o149j5887l0430P1220K6264l2476
4561E975m0068l8702l6159K1994Q887J7885L5496j362o508J0444L2288j0223m6710
4548d6763J2824J105J4848R794k1247j4733p581Q541K0519L2867J691l2910j4606
$$ y = [11216, 19973, 20935, 20006, 19057, -2740, -11528, -23408, -24403, 14035, 33673, 14677, 1015, -26911, -65345, -84078, -60170, -17985, 23209, 51852, 37730, 27176, 36318, 29900, 406, -61939, -78885, -62626, -56741, -28083, 5915, 17112, -6567, -12716, -28603, -59033, 12187, 38451, 5975, -34093, -72795, -108954, -86960, -78073, -60188, -24692, -26054, -32562, -22118, 10170, -53, -46763, -33939, -32834, -17986, -8192, -29439, -44172, -51753, -43212, -22693, 10174, 11865, -21045, -35651]
$$ [...]
##END NTUPLES=NMR SPECTRUM
##END=
