##TITLE=Analysis number 326182
Compound Code cc 55804
Book Reference 505/51
Project Code adrs
Chemist Name robb
##JCAMPDX= 6.0         $$ Bruker NMR JCAMP-DX V2.0
##DATA TYPE= NMR SPECTRUM
##DATA CLASS= NTUPLES
##ORIGIN= Bruker BioSpin GmbH
##OWNER= nmr
$$ XWIN-NMR		Version 3.5
$$ Fri Jan 26 08:42:50 2007 GMT Standard Time (UT+0h)  MAYBRIDGE\nmr@NMR_250MHZ
##.OBSERVE FREQUENCY= 250.131544655141
##.OBSERVE NUCLEUS= ^1H
##.ACQUISITION MODE= SIMULTANEOUS (DQD)
##.ACQUISITION SCHEME= undefined
##.AVERAGES= 16
##.DIGITISER RES= 18
##SPECTROMETER/DATA SYSTEM= dpx250
##.PULSE SEQUENCE= zg30
##.SOLVENT NAME= CDCl3
##.SHIFT REFERENCE= (INTERNAL, CDCl3, 0, 16.522)
##AUDIT TRAIL= $$ (NUMBER, WHEN, WHO, WHERE, WHAT)
$$ ##TITLE= Audit trail, XWIN-NMR		Version 3.5
$$ ##JCAMPDX= 5.01
$$ ##ORIGIN= Bruker BioSpin GmbH
$$ ##OWNER= nmr
$$ C:\u/data/dgb/nmr/ADRS/2130/pdata/1/auditp.txt
$$ ##AUDIT TRAIL=  $$ (NUMBER, WHEN, WHO, WHERE, WHAT)
(   1,<2007-01-26 08:42:15.01 +000>,<MAYBRIDGE\nmr>,<NMR_250MHZ>,
      <created by zg, POWCHK disabled, PULCHK disabled
       configuration hash MD5:
       49 4B E0 1D 92 C2 6B 37 9F E6 65 BC 52 41 86 1D
       data hash MD5: 64K
       7B 49 BF A3 80 1C 57 A3 28 E4 E8 F4 6F E3 67 E4>)
(   2,<2007-01-26 08:42:30.99 +000>,<MAYBRIDGE\nmr>,<NMR_250MHZ>,
      <Start of raw data processing
       ef LB = 0.3 FT_mod = 6 PKNL = 1 SI = 32K 
       data hash MD5: 32K
       53 93 97 BE 1B EC F6 D8 7C E8 0D 5A 95 57 4B C3>)
(   3,<2007-01-26 08:42:35.49 +000>,<MAYBRIDGE\nmr>,<NMR_250MHZ>,
      <apk 
       data hash MD5: 32K
       9D 7F D8 B2 C9 14 E0 72 5C 00 26 7F CE 5D DE C4>)
(   4,<2007-01-26 08:42:37.02 +000>,<MAYBRIDGE\nmr>,<NMR_250MHZ>,
      <abs ABSG = 5 
       data hash MD5: 32K
       B5 FB 8C 3D 69 6A FF 80 8C 6C 37 28 33 40 C4 8A>)
$$ ##END=
$$ 
$$ hash MD5
$$ B9 EC A6 9A 87 EC F0 C6 EE C2 2E A0 59 C9 7C 7E
##$RELAX= 
##$RELAX= 
##$RELAX= 
##$RELAX= 
##$RELAX= 
##$RELAX= 
##$RELAX= 
$$ Bruker specific parameters
$$ --------------------------
##$DU= <C:\u>
##$EXPNO= 2130
##$NAME= <ADRS>
##$PROCNO= 1
##$TYPE= <nmr>
##$USER= <dgb>
##$AMP= (0..31)
100 100 100 100 100 100 100 100 100 100 100 100 100 100 100 100 100 100 
100 100 100 100 100 100 100 100 100 100 100 100 100 100 
##$AQSEQ= 0
##$AQ_mod= 3
##$AUNM= <au_zg>
##$AUTOPOS= <2 >
##$BF1= 250.13
##$BF2= 250.13
##$BF3= 250.13
##$BF4= 250.13
##$BF5= 500.13
##$BF6= 500.13
##$BF7= 500.13
##$BF8= 500.13
##$BYTORDA= 1
##$CFDGTYP= 0
##$CFRGTYP= 5
##$CHEMSTR= <none>
##$CNST= (0..31)
1 1 145 1 1 1 1 1 1 1 1 1 1 1 1 1 1 1 1 1 1 1 1 1 1 1 1 1 1 1 1 1 
##$CPDPRG= <>
##$CPDPRG1= <>
##$CPDPRG2= <>
##$CPDPRG3= <>
##$CPDPRG4= <mlev>
##$CPDPRG5= <mlev>
##$CPDPRG6= <mlev>
##$CPDPRG7= <mlev>
##$CPDPRG8= <mlev>
##$CPDPRGB= <>
##$CPDPRGT= <>
##$D= (0..31)
0 1 0 0 0 0 0 0 0 0.06 0 0 0 0 0 0 0.0002 0 0 0 0 0 0 0 0 0 0 0 0 0 0 
0 
##$DATE= 1169800933
##$DBL= (0..7)
120 120 120 120 120 120 120 120 
##$DBP= (0..7)
150 150 150 150 150 150 150 150 
##$DBP07= 0
##$DBPNAM0= <>
##$DBPNAM1= <>
$$ [...]
##$SUBNAM7= <"">
##$SUBNAM8= <"">
##$SUBNAM9= <"">
##$SW= 20.6930455092707
##$SWIBOX= (0..15)
0 0 3 0 0 0 0 0 0 0 0 0 0 0 0 0 
##$SW_h= 5175.983436853
##$TD= 65536
##$TD0= 1
##$TE= 294.16
##$TE2= 300
##$TE3= 300
##$TEG= 300
##$TL= (0..7)
0 120 120 120 120 120 120 120 
##$TP= (0..7)
150 150 150 150 150 150 150 150 
##$TP07= 0
##$TPNAME0= <>
##$TPNAME1= <>
##$TPNAME2= <>
##$TPNAME3= <>
##$TPNAME4= <>
##$TPNAME5= <>
##$TPNAME6= <>
##$TPNAME7= <>
##$TPOAL= (0..7)
0.5 0.5 0.5 0.5 0.5 0.5 0.5 0.5 
##$TPOFFS= (0..7)
0 0 0 0 0 0 0 0 
##$TUNHIN= 0
##$TUNHOUT= 0
##$TUNXOUT= 0
##$USERA1= <user>
##$USERA2= <user>
##$USERA3= <user>
##$USERA4= <user>
##$USERA5= <user>
##$V9= 5
##$VALIST= <valist>
##$VCLIST= <CCCCCCCCCCCCCCC>
##$VD= 0
##$VDLIST= <DDDDDDDDDDDDDDD>
##$VPLIST= <PPPPPPPPPPPPPPP>
##$VTLIST= <TTTTTTTTTTTTTTT>
##$WBST= 1024
##$WBSW= 4
##$XGAIN= (0..3)
0 0 0 0 
##$XL= 0
##$YL= 0
##$YMAX_a= 377453
##$YMIN_a= -382809
##$ZGOPTNS= <>
##$ZL1= 120
##$ZL2= 120
##$ZL3= 120
##$ZL4= 120
##$ABSF1= 16.522
##$ABSF2= -4.171173
##$ABSG= 5
##$ABSL= 3
##$ALPHA= 0
##$AQORDER= 0
##$ASSFAC= 0
##$ASSFACI= 0
##$ASSFACX= 0
##$ASSWID= 0
##$AUNMP= <proc_1d>
##$AZFE= 0.1
##$AZFW= 0.1
##$BCFW= 0
##$BC_mod= 0
##$BYTORDP= 0
##$COROFFS= 0
##$CY= 12.5
##$DATMOD= 1
##$DC= 0
##$DFILT= <>
##$DTYPP= 0
##$F1P= 14.0000005364418
##$F2P= -0.99999901652339
##$FCOR= 0.5
##$FTSIZE= 32768
##$FT_mod= 6
##$GAMMA= 0
##$GB= 0
##$INTBC= 1
##$INTSCL= 1
##$ISEN= 128
##$LB= 0.3
##$LEV0= 0
##$LPBIN= 0
##$MAXI= 10000
##$MC2= 0
##$MEAN= 0
##$ME_mod= 0
##$MI= 0
##$NCOEF= 0
##$NC_proc= -3
##$NLEV= 6
##$NOISF1= 0
##$NOISF2= 0
##$NSP= 0
##$NTH_PI= 0
##$NZP= 0
##$OFFSET= 16.522
##$PC= 1
##$PHC0= 232.4596
##$PHC1= 3.001843
##$PH_mod= 1
##$PKNL= yes
##$PPARMOD= 0
##$PSCAL= 4
##$PSIGN= 0
##$REVERSE= no
##$SF= 250.13
##$SI= 32768
##$SIGF1= 0
##$SIGF2= 0
##$SINO= 400
##$SIOLD= 32768
##$SREGLST= <1H.CDCl3>
##$SSB= 0
##$STSI= 32768
##$STSR= 0
##$SW_p= 5175.98343685301
##$SYMM= 0
##$S_DEV= 0
##$TDeff= 65536
##$TDoff= 0
##$TI= <Analysis number 999999
Compound Code 99
Book Reference 9
Project Code 9>
##$TILT= no
##$TM1= 0
##$TM2= 0
##$TOPLEV= 0
##$USERP1= <user>
##$USERP2= <user>
##$USERP3= <user>
##$USERP4= <user>
##$USERP5= <user>
##$WDW= 1
##$XDIM= 32768
##$YMAX_p= 300916994
##$YMIN_p= -63171
$$ End of Bruker specific parameters
$$ ---------------------------------
##NTUPLES= NMR SPECTRUM
##VAR_NAME=  FREQUENCY,     SPECTRUM/REAL,   SPECTRUM/IMAG
##SYMBOL=    X,             R,               I
##VAR_TYPE=  INDEPENDENT,   DEPENDENT,       DEPENDENT
##VAR_FORM=  AFFN,          ASDF,            ASDF
##VAR_DIM=   32768,         32768,           32768
##UNITS=     HZ,            ARBITRARY UNITS, ARBITRARY UNITS
##FACTOR=    0.157963299565203, 1,           1
##FIRST=     4132.6476996994, 0,             0
##LAST=      -1043.33573715361, 0,           0
##MIN=       -1043.33573715361, -63171,      0
##MAX=       4132.6476996994, 300916994,     0
$$ Real data points
##PAGE= N=1
##DATA TABLE= (X++(R..R)), XYDATA
$$ [...]
16458C3954l693j3507q258J6171J5048m535j2056o664j137m957p593j0712J21
16445g818J3069R983o954j2177q261P479o66r4J4577J2042L14j6481o218J5888
16431A4683N721j6711j8489l759l933J1446J1817P677J1935K384j0485K369P477
16418B2132j382K187k334k581J612N303N125Q059p779n677m874p607Q896J0020
16404C1100j0763k0944m111K402P094N403J4655L938K471L722j0098J146n238
16391B0777k109k0916Q737K215Q647l906j4614j4347r500M868K1266N622j0228
16378c488M775j750j346q126m161K990K992O955l03M952L424L296q95j6663k382
16363i730J1169J6194q397j2650k138J1331P944N19j267J9683Q98j9166k1504
$$ y = [33954, 30261, 16754, 8496, 24667, 39715, 35180, 23124, 16460, 15323, 10366, 2773, -7939, -7818, 5251, 15234, 8280, -3897, -12158, -4679, -5345, -5439, 9138, 21180, 21494, 5013, -1205, 14683, 20404, 3693, -14796, -18555, -22488, -11042, 775, 8452, 20387, 22771, 12286, 14655, 22132, 20750, 22937, 20603, 18022, 19634, 24937, 30062, 38121, 30342, 24665, 19791, 12184, 21080, 31100, 20337, -607, -4718, -2316, 4778, 10181, 24836, 28774, 31245, 34967, 24869, 26015, 20777, 18668, -2248, 6489, 8704, 17351, 13445, -1169, -15516, -25016, -20148, 1118, 6740, -3488, 1287, -463, -1809, -9935, -14096, -11106, -8114, -1159, -1462, 3490, 6914, 10210, 9315, -7348, -9730, 1439, 17633, 9236, -3414, -5552, 5779, 13723, 14242, 12975, 32658, 33556, 14390, -7114]
16350g114n87m734K656L008n374L59O185j4852o857N4Q866J2576J1882M138j0591
16335c85j0096k606j0005O449M700N256J0658Q101m51J937p451r281j2453m314
16321a9941P455j329K71M594k349k809n14R465n574J411k242L359L461J5459L591
16306A4308l687J4728j6197j2455k347O56o507j5361K12j387J592P002P004J615
16292a0824J962j208k260L901K0014J2665j1262k521N15j0980M471J517j024P821
16278A2787K561p273r133L053N797J243m381P658j0859j0387l84J142J8404L964
16264A4192k873o756Q141n237o382Q509K572j5448j2022K849j140J0574Q359N499
16250A0837R715j0432k6059j2945J5339J0543j529n984N670Q449j36j167O67j4642
$$ y = [-7114, -7701, -12435, -9779, -6771, -12145, -11786, -5601, -20453, -27310, -27256, -18390, -5814, 6068, 10206, -385, -10481, -13087, -23092, -16643, -11943, -6687, 3971, 12072, 11621, 13558, 6107, -3174, -15627, -19941, -12486, -13815, -13544, -8950, -11299, -14108, -14622, -5157, -10731, -9320, -11562, -8203, -4742, 10717, 14308, 10621, 25349, 9152, -3303, -5650, -4994, -11501, -26862, -26650, -28037, -26445, -19443, -12439, -10824, -8862, -10070, -12330, -8429, 11585, 24250, 12988, 10467, 10982, 2, 4473, 5990, 4966, 12787, 15348, 8075, -1058, 1995, 7792, 9035, 4654, 12312, 1453, -8934, -9318, -8176, 10228, 14192, 11319, 4563, 12704, 7467, 1085, 9594, 12166, -3282, -15304, -12455, -13595, -3021, 5338, 10837, 20552, 10120, -15939, -28884, -13545, -3002, -4531, -10515, -4845, 3604, 3468, 2301, 2968, -11674]
16236a1674p82P637q051m914J8385k031j3522N331N820J0717k648J085N15k4557
16222a8689n700M374J1257J3603J0835M782j635j1993q96L841J4188K477q329
16209A8115r066n673q401J1965q43j3220Q276J5554j888N352p72L793o327J035
16195A7900o457k733K145j136j3412k592J689k873n938l651o38J0502l995k302
16181a3491O721J373j0710j316J750R936Q120J5904O700r693j2296l996J224J181
16167A407R686j350J6562K018p743j7388l3815n567J9213J2374K167J1891j473
16154G982m198M672P180L08j2006r060j6780Q90R724P713Q198O515j0927k3475
16140b3264Q416N949Q694J7545J6385j1596k0423j5611l072Q010O645q098n688
$$ y = [-11674, -12456, -4819, -12870, -17784, 601, -1430, -14952, -9621, -3801, 6916, 4268, 5353, 5868, -18689, -24389, -20015, -8758, 4845, 15680, 20462, 18827, 6834, 5938, 9779, 23967, 26444, 18115, 9049, 3376, -5025, 6940, 6097, -7123, 1153, 16707, 14819, 20171, 19399, 23192, 16865, 17900, 11443, 8710, 10855, 9719, -3693, -6285, -4596, -7469, -13407, -17058, -17696, -7194, -11189, -13491, -6770, -5397, -16107, -17423, -15673, -5737, 2383, 18287, 24987, 15294, 2998, -998, 226, 1407, 11093, 9743, 26305, 28323, 20580, 3192, -30623, -36190, -16977, -4603, -2436, 9455, 7982, 3784, 8456, 15636, 15944, 3938, -5122, -21902, -21012, -11288, -3575, 4623, 11138, 211, -23264, -14848, -8899, -205, 17340, 33725, 22129, 1706, -13905, -16977, -8967, -2322, -10420, -16108]
16127a6108L67L972J0176P346o190m640P529K979M078N04p082J054M690k38l156
16112E281o563j143j0126R299N197R69j739j0489j563J0066J2404K852m614P668
16098A7499p956R912K742O956j3818j509k004k674p30p025m236n471J010j4642
16084b1946j0574Q701J6917J1207M769m837q295j1499m680N759P17Q093J2377
16071F709j4506l125o099j3142j8605P561J0839m22L163J3233Q637k034J0104
16058B313R249J370n086j3888j4308l983L517M46J9813O840j6608n350j971o440
16044b4086M274K2744K806J3692p309k2435J0568M651o264J0109J91P436N171
16031B1548j3342j7329O97J5482j0585m900P111O000k710r045P767N781j0974
$$ y = [-16108, -15741, -11769, -1593, 5753, -437, -5077, 2452, 5431, 9509, 10013, 2931, 3985, 8675, 8437, 5281, -1282, -2425, -12551, -3252, 1945, 2914, 1175, -9314, -10877, -811, 11593, 14445, 9831, 17499, 9543, 19455, 22197, 29153, 15335, 13826, 11822, 9148, 8418, 1393, -2843, -8314, -7304, -21946, -32520, -23819, -6902, 4305, 9074, 4237, -4058, -15557, -20237, -14478, -13761, -5668, 6709, -7797, -10922, -17021, -30163, -48768, -41207, -30368, -30790, -27627, -14394, -5757, -7791, 2313, 11562, 12932, 7846, -6042, -20350, -24333, -20816, -20370, -557, 6283, -10325, -15675, -17646, -24086, -19812, 2932, 5738, 19430, 12121, -10314, 254, 4905, -1359, 8750, 8941, 16377, 21548, 8206, -9123, -8426, 7056, -3529, -8429, -1318, 4682, 1972, -7073, 694, 6475, -4499]
16018d499l681M250K960J2045Q626p776j1599m569J1959p294j2106P397J6141
16005A1854M185j8413j8640M723J6354K611j332J4662m38o886o867l164O119l69
15991D399O626l928L989J223p523l940p141L440N571L269j0454M966K194k650
15977D1j2660o846J8475j40j1937K007k444m738k24p57R731M904k248j0602K696
15962a4742J0749j3215J139M863l372J1254J5826J0616j763J432m390k4577k178
15949h358O988J0187q032j4430k171l424J4277P195O805p233q998p172r335K082
15935b1619P157J8983n624o230L607K383m901p658J609L842j116p402m168N692
15921a5445O516K544N442M515P581j1909k915Q617O051j1373K640O841l589j766
$$ y = [-4499, -8180, -3930, -970, 11075, 19701, 11925, 326, -4243, 7716, 422, -11684, -4287, 11854, 16039, -2374, -21014, -16291, 63, 2674, 1342, 16004, 15566, 8680, 1813, -1351, 4768, 4399, 11025, 7097, 11086, 12309, 4786, 846, -6295, -2855, 2716, 5985, -4469, 497, 2691, 41, -12619, -19465, -990, -1130, -13067, -11060, -13504, -18242, -18466, -19223, -9492, -4588, -6836, -17438, -14742, -3993, -17208, -16069, -11206, -14578, -3324, 12502, 23118, 21355, 22787, 18397, -6180, -8358, -1370, 8817, 785, -13645, -15816, -19240, -4963, 2232, 9037, 1804, -7194, -14366, -23701, -21619, -14462, 4521, -1103, -7333, -3726, -1343, -6244, -13902, -12293, -8451, -9567, -16969, -21137, -15445, -8929, -6385, -943, 3572, 11153, -756, -3671, 4946, 10997, -376, 2264, 9105, 5516, 3750]
15907C750j041k138J3238o108j4248K929J8846K969j6769n768q530j1016Q326
15894a5560J6270O780Q399L687o679j3041r067R401R363J5092j822k0856m11N139
15880F695Q76r91P003j3294J0602P911K272n609k952J170j069l922k1217l627
15866a6152J662N442q95P639J1537J770L245J311j4322j5875K853L935L431m00
15852d819m05l415K798P705j306m635L992L861O228M352r901l253n011Q444L580
15837H215K238N37m965l301m234P931m673r284J3988J2081L356j1254m897O735
15823A2473J2997N884P3K165m212m747p602p920k301L098O828N516r746r814J3753
15808A6445K916j1218j0097o816N592R463k4501j8862O767N426L236J3728O75
$$ y = [3750, 2709, 571, 13809, 7701, -6547, -3618, 15228, 18197, 1428, -4340, -12870, -23886, -15560, 710, 7490, 15889, 19576, 12897, -144, -9211, 190, 9553, 24645, 22823, 1967, 1556, 6695, 7571, 6580, 13583, 289, 10891, 18802, 21074, 15465, 12513, 13683, 12614, 8692, -12525, -16152, -14490, -9048, -9943, -2304, 9233, 11003, 14248, 15559, 1237, -14638, -11785, -7850, -4419, -4819, -5224, -8639, -5841, 1864, 558, -4077, -85, 3776, 10004, 14356, 4455, 1202, -3809, 4635, 8215, 10453, 10990, 6025, 2724, -1510, 6421, 1748, -7536, 6452, 18533, 21889, 10635, 5738, 12473, 25470, 31354, 31427, 33592, 29380, 24633, 17031, 9111, 6810, 9908, 16736, 22252, 12506, 2692, 16445, 19361, 8143, -1954, -8770, -3178, 6285, -18216, -37078, -30311, -24885, -21649, -7921, -7246]
15795g246k033Q347J7001P712j0474o937q646q197M516O441j2803o987J998P364
15781i944P439M31P599Q923K279m870r266o206K125Q855R705J152j0378j3022
15767e178n144R186j330l366J555P722L093k201k542O010L419l846m798m611J041
15752i90N079o05j406j7054p517N524J5114J8551N527k183q344L112q598r121
15738b911j443J764Q94j3070O892P249M340Q668O309l070j7655j1693P930M652
15724a144q541J1677J4413n08j0019K309Q78j2290J2631n870K935J0639P640q874
15710A5876j704l251m244l019J012j136J1366R066j1881j0662q202n214p001k973
15696b1967O285R876L99r896O300J9779k262j1595n76k011j1846l627J0605J8645
$$ y = [-7246, -9279, -932, 16069, 23781, 13307, 6370, -2276, -10473, -5957, 484, -12319, -19306, -17308, -9944, -2505, -2074, 5525, 14448, 16727, 11857, 2591, -3615, -1490, 7365, 17070, 18222, 7844, -5178, -10322, -1136, -2466, -5832, -4277, 3445, 6538, 4337, 1795, 7805, 11224, 7378, 2580, -2031, -990, 4089, 3484, 2078, -14976, -22493, -16969, -1855, 16696, 22223, 20040, 11696, 14808, 6210, -2911, -4354, -2590, -1696, -14766, -7874, -625, 3715, 12383, 18692, 15622, -2033, -13726, -5796, -1144, -9685, 1992, 16405, 15897, 5878, 8187, 9065, -3225, 9406, 3536, 6471, 17110, 24750, 15876, 14172, 10921, 6677, 3658, 4670, 3534, 14900, 23966, 12085, 1423, -6779, -11993, -18994, -21967, -15682, -5806, -5407, -15303, -9003, 10776, 8514, -3081, -3657, -5668, -17514, -21141, -10536, 8109]
15682H109K1082J3595j8109k3007j1330L506p175j496N229J7284M722j1732j310
15669f32l800j3792o90K19M145j900j5751n851j983J3057J8589L727Q924K205
15655F467m273l781o506j029M173J7426N347m240j1325J3400j357r607m933m77
15641g15K566o570r616K360J035j2194J0455K184N787J0866O980M867k437R97
15627A6565r204r497n857J970O133j8301j4758J2505N710M440O559J105L433m31
15613C72q665j318P413p521m197J8429J3223N228q224o092p52L873j3976k789
15599d996J7637M745r604k1182o458q000J106J1546K319n191Q313N136j100o536
15585a2265j0085N03N72R795J7751M652j000M197j80l630N147n018k225J947m913
$$ y = [8109, 29191, 42786, 24677, 1670, -9660, -6154, -13329, -14825, -9596, 7688, 12410, 678, -632, -4432, -18224, -18914, -18695, -14550, -16450, -32201, -38052, -40035, -26978, -8389, -4662, 4262, 6467, 2194, -1587, -8093, -9122, -4949, 12477, 17824, 13584, 2259, 15659, 14302, 4695, -238, -715, 1851, -4719, -14335, -11975, -10940, -23134, -12679, -10495, -4708, 6158, 13138, 18005, 15568, 16565, 7361, -2136, -7993, -6023, 110, -18191, -32949, -20444, -14734, -10294, -3735, -2630, 803, 372, -8293, -9611, -2198, -9719, -13916, 4513, 17736, 22964, 14740, 8648, 7896, 11769, -2207, -4996, 12641, 17386, 7782, -13400, -19858, -27858, -26752, -15206, -12887, -18078, -9765, -4629, -5729, -12265, -22350, -21847, -21275, -11480, 6271, 10923, 9923, 14120, 13940, 10310, 15457, 10439, 8214, 10161, 5248]
15570E248j459j2440k985Q41j690M011L292J4902Q227q957j9507j3496n43j0053
15556c4609K610J1453o543L393Q002N635Q376N522L907k4L743p50j3480m683J57
15541g291p181l803k35M227M609J1006O934J2734K414k122j7544j4759R212J994
15527A95j975J2230J8954J4357j7808k3229j0411R588P263p79J4802J908l909
15514B1186M959j0372j0810O284R499k506r361O070M270o344P167P404o353j1785
15500I308q476q593j330O784K683J1198p01m091j1225J4152Q904p854q285o604
15486d130N714O325K618J329j3464q817p169R165J8061L050n399o327J9590k330
15472A8216q415j0667l451P359q113j2557J850Q070j4L872Q864J023l784r474
$$ y = [5248, 3789, -8651, -11636, -10795, -12485, -8474, -5182, 9720, 17947, 8990, -10517, -24013, -24556, -34609, -31999, -20546, -27089, -23696, -15694, -10059, -1683, 3839, 7746, 7722, 11465, 10715, -2765, -7448, -7291, -14472, -18275, -18510, -14283, -9674, 1332, 8266, 21000, 23414, 21292, 3748, -11011, -1799, 195, -1780, 10450, 29404, 43761, 25953, 2724, -7687, 1901, 9164, 8385, 23187, 25095, 21186, 26145, 15773, 4963, 11247, 20746, 18240, 8879, 14949, 19219, 12875, 20042, 27446, 21093, 9308, 832, -7761, -9091, -2307, 376, 11574, 10873, 6782, -4443, 9709, 18613, 10759, 2474, -4130, 1584, 7909, 10527, 11856, -1608, -10425, -17594, -8429, 9632, 12682, 7283, 956, 20546, 18216, 9801, -866, -4317, 3042, -5071, -17628, -15778, -7708, -7722, -3850, 5014, 6037, 2253, -7221]
15458g221k201m204j776k746j212J3737J6832J2962M405p592q385m431M565p721
15444E012P288L459p989o71J482Q229Q816M443j7490j2961l390Q996q842j436
15430e054j2712r486j253Q996p119q188P735K745m090o67l029o255j238O953K455
15415c0207J1061J0100l210P781n159n203P685O288O209P71k518M192k1781n921
15401a9912l83L17J740J9477p715p026L144L064J1116N957O502n836n256J1456
15387A6645l928r244p015p953l976R991R532N694m049J583p611j301O787o825
15373a670m513O973q40L702l713o044J588j3891j0653l921O688J3782J6631J6
15359D135p947M104k679O353J562l208P596l518n718j2013o248M679M969J4926
$$ y = [-7221, -9422, -13626, -15402, -18148, -19360, -5623, 11209, 24171, 28576, 20984, 12599, 8168, 12733, 5012, 12300, 15759, 7770, 7099, 8581, 16810, 25626, 30069, 12579, -382, -3772, 5224, -3618, -5054, -17766, -27252, -28505, -19509, -26628, -34816, -27081, -24336, -28426, -29093, -32122, -38377, -39615, -32662, -30207, -19146, -9046, -12256, -4475, -9634, -14837, -7152, -864, 5345, 6116, 3598, 7790, -13991, -19912, -20295, -19978, -18238, 1239, -6476, -13502, -10358, -7294, 3822, 9779, 16281, 10445, 5189, 16645, 12717, 3473, -3542, -11495, -15471, -5480, 4052, 9746, 5697, 7280, -331, -1632, 5155, -1670, -6183, 790, -50, 3652, -61, -6105, -4517, -18408, -29061, -32982, -26294, -12512, 4119, 4135, -3812, 292, -2387, 3966, 5528, 2320, 9916, 6398, 680, -11333, -17581, -12902, -7933, 6993]
15345F993m056Q072m068n057n091n842n65Q469j0488M783m257o311K476J181k561
15330a6322L346p184o445l6J4677M989L202o742P101P749q604p549J0992m826
15316e652N197J2554j2331n278k678M26p820L471m054n487j4474R332K1146J801
15302c847m908k407K612j898P814P918R699r208j3988q025O02Q672o808K153N629
15287e990J0691n005N25j4944Q412J1457o436J79K657o731n308l523m426L756
15273a4686J1759l539l030J708n812r375P426J1646N779j669j2520m918q962j731
15259b7924J6060N334M669Q644o602J812j380L595P724p347j7812j7610Q065K2833
15245F1K872o191m07Q058P892j1344k468q730L854O015N764r468k0112N057J4595
$$ y = [6993, 2937, 11009, 6941, 1884, -3207, -9049, -9614, -1145, -11633, -6850, -11107, -17418, -14942, -13761, -16322, -12976, -20160, -26605, -26641, -11964, -6975, -3773, -10515, -3414, 4335, -4269, -11818, -826, -5652, -455, 12099, -232, -5510, -8188, -7762, -15582, -12111, -16165, -21652, -36126, -26794, -5648, -3847, -8755, -11162, -8550, -10448, -2634, 5284, 14983, 5775, -8213, -16238, -15636, -6964, -13772, -11619, -5990, 4701, -304, 221, -14723, -6311, 5146, -1290, -1111, 1546, -5185, -10493, -14016, -18442, -14686, -2927, -6466, -9496, -7788, -13600, -22975, -15549, -3903, 1876, 207, -12313, -17231, -26193, -27924, -11864, -6530, -1861, 6783, 181, 1993, 613, 4208, 11932, 4585, -13227, -30837, -22772, 61, 2933, -3258, -3665, 4393, 12285, 941, -1527, -10257, -6403, -388, 5376, -4092, -24204, -19147, -4552]
15230d552o619M362M734N823l359L562k0170m312M321k727Q120J0669j25m584
15216d857k620n88l491j1448J825N449L457L65l89J749N545j688m603p458J909
15201a6843K553R961k799p500n145J148O924R013K016J0626k963m831j9054q203
15187b5097J6301L976l92P298L975r941J991o069m250M905P886P174K851m949
15173E659p091O343p409K504J2999j8600n181R84j417l642p706P246N945l471
15159a2837r942j935J4477J1747m048L334O328O805p93j6875m900r3m890q640
15145b2262q785J4014R451O522q082k525R251M440L031r771j2718m671Q960J1775
15131a370J187R109p71l351q512k067L925J9423n811j8877L882J4361l046j5669
$$ y = [-4552, -11171, -6809, -2075, 3748, 389, 3951, -16219, -20531, -16210, -18937, -10817, -148, -273, -4857, -7477, -8065, -11556, -23004, -21179, -15730, -12273, -11908, -12297, -10548, -5003, -6691, -11294, -18752, -16843, -14290, -4329, -7128, -14628, -19773, -18625, -11701, -2688, -672, 9954, 6991, 2160, -16894, -25097, -8796, -4820, -5212, 2086, 6061, -3880, -1889, -7958, -12208, -7303, 583, 7757, 10608, 5659, -1432, 4911, -2498, 6, 13005, -5595, -10776, -9792, -11209, -14851, -22557, -15311, -9366, -12837, -22779, -24714, -10237, 1510, -2538, 796, 7124, 13929, 13136, -3739, -8639, -8732, -13622, -22262, -31047, -17033, -7582, -1060, -9142, -11667, -2416, 2024, 5055, -4716, -17434, -22105, -13145, -1370, -183, 8926, 8155, 4804, -3708, -5775, -1850, 17573, 11762, -7115, -3233, 11128, 8082, -7587]
15117g587o231j174M71j3246J863P829K730J791j0127Q038R137m517m219r955
15103b5197r638P129M734K47j7167P723J2629J7659J5718J1559j0554j9470l902
15090h530K806L601k173q489R544J4904Q431J302k828k674j0815j2407l030j811
15076a2169Q962N465j2688J494P572M802L946j001j2271m361r041r246J4436J2519
15062a581K338N450o830N488L604J8710J124l849j125p210m790L459k806P752
15048A9734p317q595N547J2654J0551k727N28j6926R423J7298N703k936o280j7829
15034A8828k2597j0197P823Q331J371m127K315O596j0483r806j0459k718O319
15021a8804J0666j8517o952K8297J2036J427K961j3220j8441Q7O537p068l987
$$ y = [-7587, -13818, -14992, -14521, -27767, -25904, -18075, -15345, -13554, -23681, -15643, -6506, -11023, -15242, -25197, -34835, -27706, -22972, -22725, -39892, -32169, -19540, -1881, 13837, 25396, 14842, -4628, -8530, -5724, -2123, -4296, -12785, -3241, 11663, 20094, 21396, 18568, 15894, 5079, -7328, -10358, -12169, -3207, 2258, -10430, -8936, -1364, 3438, 7384, 6383, -5888, -10249, -19290, -28536, -14100, -1581, 757, 6207, -623, 4865, 8469, 27179, 28303, 24454, 23329, 16119, 11329, 14788, 11982, 19734, 12417, 3822, 9369, 22023, 32574, 29847, 30375, 13449, 22872, 40170, 45873, 42937, 36657, 18828, -3769, -13966, -6143, 2188, 3559, -568, 1747, 8343, -2140, -11946, -22405, -25123, -18804, -8138, -26655, -33607, -5310, 6726, 8153, 11114, -2106, -20547, -20460, -13923, -20991, -24978]
15008b4978N234J3768j109J682N063j271k267k064q700K676J1722J936l387PJ1876
14993A0188K30j4231R957j572j3955N090O321l650k380l193O135l349M662J6226
14979A6479L893o000m765J1851J101M712K455o360N235j0934j3690o320M493r996
14965g846k987J0346J063R420j730l658l192L699j780N193N575l63j2293P301
14951H748k186P545l771l740J917j8584j1015N792N047k239R526J3281j0489q87
14937a055L476l228m518O333P064N121r101j809k990J085q067J5681O793K700
14923A7485j7288O151N607j5300j3179L069r281k6559L604J2047K3005P757n607
14910h489l529m748j3227N008J1497R008J770P488J927k600k527k293j602l764
$$ y = [-24978, -19744, -5976, -7085, -5403, -340, -1611, -3878, -5942, -14642, -11966, -244, 1692, -1695, -1688, 10188, 10418, -3813, 6144, 4572, -9383, -4293, 2028, -1622, -4002, -7195, -1060, -4409, 253, 16479, 20372, 14372, 9607, 21458, 22559, 27271, 29726, 23366, 28601, 17667, 3977, -2343, 2150, -7846, -10833, -487, 576, 9996, 8266, 4608, 1416, 5115, 3335, 8528, 14103, 13740, 1447, 8748, 6562, 14107, 10336, 6596, 8513, -10071, -21086, -15294, -10247, -12486, -2960, 10321, -168, -1055, 2421, -807, -5325, 1008, 8072, 13193, 4092, 2283, -707, 378, -7689, 7992, 14785, 17485, 197, 6348, 11955, -3345, -16524, -13455, -22736, -49295, -45691, -33644, -10639, -2882, -8489, -12018, -16766, -29993, -24985, -13488, -4480, -2710, 4778, 6705, 4105, 1578, -715, -2317, -6081]
14896f081q823Q976R65Q300j492m40n083l070j375j322R628k764j450J87N876
14881B032q647r385R076J43N211O252r486O401J2090L273p44k268l113k468M013
14866A2380K967K234M771j7236r047P022J170n879p581o09n739J0898O525J0673
14852A2549j2318J548l347L73J845o389J1133P477j240j4721o130p737N170O76
14838a1111P941Q413J513n887J1922o620q261L561nR480J326r29n976j9519o477
14823b0629P415N246J4888R301J750j485O545j0898l472L934k654j829Q361Q091
14809B4564J3881J2978j5770r90J1481O795p808J486n329j2193j3623k253r68
14796A2251n934l368J1688k421j749j745m66k363n112j0484N560Q538o911J366
$$ y = [-6081, -14904, -5928, -4963, 3337, 1845, 1405, -3678, -6748, -8123, -9445, 183, -2581, -4031, -3844, 2032, -6615, -16000, -6924, -6781, -1570, 4682, -4804, 1597, 13687, 16960, 16216, 13948, 10835, 8367, 12380, 15347, 17581, 22352, 5116, -3931, 3091, 4261, -1618, -9199, -9808, -15547, -4649, 1876, 12549, 231, 1779, -1568, -1195, 650, -5739, 5394, 12871, 11631, -3090, -9220, -16957, -11787, -11111, -3170, 5243, 6756, 869, 12791, 6171, -2090, 1471, 1466, 10946, 12272, 11343, 5367, -14152, -20629, -13214, -7968, 6920, 16221, 17971, 16486, 23031, 12133, 8661, 12595, 9941, 8112, 16473, 24564, 38445, 51423, 35653, 34663, 46144, 52939, 45131, 46617, 41288, 29095, 15472, 13219, 12251, 6317, 2949, 14637, 12216, 10467, 8722, 8256, 5893, 781, -9703, -4143, 4395, -2516, -1150]
14782a150Q206o722j1299L684J4747m243o034J317j1048l946R646k511p260N017
14768a1596J1470j712J9744p194j3533j647k039q355L777R149Q141j1818J0270
14755D657P274o344n01m298j613q11K457L767m484j1599p008L379O417J0722J5642
14740A7657R585q686j1964j3205j333n143j022J5743R281Q927l915j2827M462
14727G560Q53o82l13o79P009L629q271q595p294m695k2r652M491m484K3117J0125
14711A2097J818P075J940k0544j7171r897n05J5269J3712J6000J2331r746n685
14698A6694r520o474j2083r52J097r404J2951J016j0083o374J1681K033L635n083
14684a0866j542P281Q851O536r501j8268p173J7810J7894k163Q74N235J068P680
$$ y = [-1150, 7056, 334, -10965, -7281, 7466, 3223, -2811, -1494, -12542, -16488, -6842, -9353, -16613, -11596, -126, -1838, 17906, 10712, -2821, -4468, -6507, -14862, -11085, -1936, 6205, -5613, 4657, 11931, 5587, 5086, 788, -825, -1636, 821, 4588, 104, -11495, -18503, -15124, -8707, 2015, 17657, 27242, 18556, 6592, -6613, -7946, -13089, -14111, 1632, 10913, 19840, 15925, 3098, 7560, 8413, 7731, 7418, 6739, 13748, 17377, 9106, 511, -6783, -11478, -11500, -21152, -16661, -21145, 1972, 12097, 13915, 20990, 22930, 2386, -14785, -24682, -25187, -9918, 3794, 19794, 32125, 22379, 16694, 7174, 700, -11383, -12335, -11238, -20642, -7691, -6675, -16758, -23132, -11451, -9418, -5783, -10866, -12408, -5127, 3724, 10260, 759, -17509, -24682, -6872, 11022, 8859, 9733, 14968, 16036, 23716]
14670B3716l964j7206l438L095k481m118l958j0284P286p48k994O289J4076p779
14656b508j5176j342Q853J5725N694K580j2557L659j671M120L490j0008J0131
14643A0990o746k82j2269p644J4271J4667N274j99j3437k1169o053J5325J3686
14630F414q202P01j6814o170O826m811l810J961L300J0854p064k205k976J7253
14616d743L29r134r079L527N105J979N051o130l23l827k320J7380K269O14J1455
14601A2153J609j880Q860o783O426r910m024N4N520N391j1397J210M28m12J443
14586H688l791l140M196N611n159j4537J556J6203O674m183j782J0242P989r031
14572A9536O150P72k517m755j0893l363l914j434Q609k229j823j89j0026j436
$$ y = [23716, 19752, 2546, -892, 2203, -278, -4396, -8354, -18638, -11352, -12100, -15094, -8805, 5271, -2508, -17684, -19026, -10173, 5552, 11246, 13826, 1269, 4928, 3257, 7377, 10867, 859, 10990, 4244, 3962, -8307, -15951, -1680, 12987, 18261, 18062, 4625, -16544, -22597, -7272, 6414, -1788, -1087, -17901, -24071, -17245, -22056, -25866, -23905, -20605, -9751, -16815, -19020, -21996, -4743, -4414, -13548, -22627, -19100, -13995, -12016, -6965, -13095, -13418, -17245, -19565, -2185, 84, 698, 12153, 13762, 11882, 20742, 13959, 20385, 10475, 6451, 6505, 12025, 17416, 6019, 7229, 7657, 7245, 8688, 4897, 1757, 5953, 11564, 6405, -8132, -6576, 9627, 16301, 12118, 10336, 20578, 28567, 19536, 25686, 26458, 23941, 19186, 8293, 4930, 1016, -418, 8191, 5962, 4139, 3950, -6076, -7512]
14558g512n287k16J178J6334J1364n715J0166L2128L7931L2802J7079R40r246
14545A31946m0528m8484k3237j8995j6601j3377Q625J1361K924O619n24r260l055
14532a2586k825j377J042N882l862K909R740p617J122j377Q730J2104j59M083
14518A5809P540P484q483q102o174j0029J586n595r068J3810M261m297k511k0936
14504b4705n209q737J3003J1565p980m581R473Q078n12k734K783j1331p434J2719
14490a5602J2552N481M731l585r748o419J446J0315m936R843j554j3537P268L06
14476c439J3894n687m278J1067Q57n177n801R33q742o977Q813M169m391M56r036
14461a3339j0619P853O123M260J4603J1521j5174j3424M917Q8N32R81L374Q767
$$ y = [-7512, -12799, -13015, -11837, 4497, 15861, 10146, 20312, 52440, 90371, 123173, 140252, 141192, 131946, 91418, 42934, 19697, 702, -15899, -29276, -20651, -9290, -6366, 253, -271, -9531, -12586, -15411, -16788, -15746, -9864, -13726, -10817, -1077, -8694, -7572, -8949, -219, 11885, 11726, 15809, 23349, 30833, 22350, 14248, 8074, -1955, -369, -5964, -15032, -1222, 3039, -1258, -3769, -24705, -29914, -38651, -25648, -14083, -22063, -26644, -17171, -9093, -9605, -12339, -9556, -20887, -28321, -15602, -3050, 2431, 7162, 3577, -6171, -12590, -11144, -829, -5765, 4078, 2524, -11013, -3745, -3439, 10455, 4768, 490, 11557, 12414, 7237, 1436, 2369, -6373, -13350, -4537, -368, -4759, -4303, -13339, -23958, -16105, -9982, -5722, 8881, 20402, 5228, -8196, -3279, -3191, -2659, -1678, 1696, 10463]
14447A0463L647m306j1055O895k605o074r295r81R12j495O402n304n424J2378
14433e842K0397j0467k578J271r320N808R675K636n653j127k964j3818n354M796
14419a2540r613j4880K124R640k0j1540P28K3240J4589j009p507k41j0673K862
14405a4840l312j3862O537P121p105j031N573J0578m462L291M563L544P500L235
14391G330j8105r30J421j2157j1103N536l66O121m005M557O514Q85Q653q468Q13
14376a3304J1360J0702j0784l143k08j347l503n810j2809r026J2451K9308J3434
14363A7321p392j4286k5233L987J6727J3201n471m91O038o163k0043r757K026
14350b9536J7225P110J4882o222j9733K459O128K637M19M351J4762M693r620m235
$$ y = [10463, 14110, 9804, -1251, 5644, 3039, -3035, -12330, -13311, -12399, -13894, -7492, -12796, -18220, -5842, 14555, 4088, 1510, 2781, -6539, -731, 8944, 11580, 5927, 4800, 1836, -11982, -17336, -12540, -22153, -37033, -34909, -25269, -25289, -36829, -36101, -12861, 1728, 719, -6788, -7029, -17702, -14840, -18152, -32014, -25477, -18356, -25461, -26492, -20919, -10341, -14803, -11512, -6949, -3405, 4095, 7330, -10775, -11705, -10284, -22441, -33544, -28008, -28374, -22253, -26258, -21701, -15187, -14302, -5649, -14117, -13304, -1944, 8758, -2026, -5169, -5377, -6724, -10227, -16037, -28846, -37872, -25421, 3887, 17321, 9929, -4357, -29590, -25603, -8876, 4325, -1146, -1637, 4401, -1762, -21805, -31562, -29536, -12311, -5201, 9681, 3459, -16274, -13815, -7687, -5050, -4631, -280, 14482, 19175, 9555, 5320]
14336E320j2105q672J0721j1998N10L936J0347N048l612l722J0239k623j2714
14323i325q798M156K729J046M617j4321j2666N712J5114r48j954N846J1934q660
14309e518R290Q453j1081k0639L757J3174p701K300J3173k457o685j749K404O032
14295B753R045O235j6854j0102M280J4251k765n032j9912j2867J5465K5237K0366
14282C0100q161j0562Q414q882j0468K018o905J2556L626o30q316l004P161J1215
14268A8162L328j833p070o621n175n271j689Q130n50K856R137J118J0133o668
14254A7987l305p061l142m113j1961N12r275o337J0157R001j1872n437J4285J1880
14240A319m268J0080q537n522J1174J611K376J623k068K738o851j513M346k515
$$ y = [5320, -6785, -15457, -4736, -16734, -16224, -12288, -1941, 3107, -505, -4227, 6012, 3389, -9325, -18123, -13967, -11238, -10192, -5575, -19896, -32562, -26850, -11736, -12684, -14638, -8792, 3142, -5518, 3772, 12225, 1144, -19495, -15738, -2564, -10265, -7965, 5208, 2751, -3934, -5683, -3279, 2753, 11798, 18033, 1179, -8923, -4643, 9608, 6843, 1811, -18101, -30968, -15503, 9734, 30100, 21939, 11377, 19791, 10909, 441, 2459, -4446, 8110, 11736, 11106, 2790, -214, 6947, 18162, 21490, 19657, 12587, 5966, 791, -4480, -6169, 1961, 1411, 4267, 13404, 14522, 24655, 17987, 14682, 7621, 4479, 366, -11595, -11083, -20358, -26695, -16538, -7537, -19409, -24846, -10561, 1319, -2949, 7131, -1406, -6928, 4246, 5857, 8233, 9856, 7788, 10526, 3675, 2162, 6508, 3993]
14226C993k922N519N487j5791J2511q530m541K377K55L733nl319M117L319R325
14211A5528n691j7620j4166k962J3133O703j129j5318R24J1378j5526p51J9194
14198f303Q097j300J0721K874m513M677O25j0514j982r43q933K0524Q650p231
14184A4449k0076J5295J8421K542l180o12j8199r655K2j5874j06K837m161q008
14170b6305J5038j0093O239Q154M695l974p25J0054q152k4357j0984P087J0332
14157b2991r586J574K938M895M857j5546m994R441N803j49O474J92M550j111M060
14142i593J6677k868k194l579j7507O993L596l199K439M47m640Q363Q437N429
14128H801j2611n770L893L535M550p054L361r721l982m592k126J4546j97n510
$$ y = [3993, 1071, 6590, 12077, -3714, 8797, 267, -4274, -1897, -1642, 2091, 2086, -1233, 2884, 6203, 15528, 9837, -7783, -21949, -24911, -11778, -5075, -6204, -21522, -20598, -9220, -24746, -25497, -6303, 1794, 494, 11215, 14089, 9576, 14253, 14878, 4364, 2382, 1439, -7494, 13030, 21680, 14449, -5627, 9668, 28089, 30631, 27451, 26839, 8640, -1015, -993, -16867, -16973, -14136, -18297, -26305, -11267, -21360, -15121, -6967, -2272, -6246, -6971, 3083, -5069, -29426, -40410, -33323, -22991, -32577, -31003, -28065, -23170, -18313, -33859, -38853, -29412, -23609, -23758, -17284, -17092, -12542, -13653, -9593, 7084, 4216, 2022, -1557, -19064, -12071, -8475, -11674, -9235, -8788, -13428, -5065, 3372, 8801, -3810, -9580, -5687, -2152, 2398, -4656, -1295, -11016, -14998, -19590, -21716, -7170, -7367, -12877]
14114a2877M842o687O016J0616m586J386O357m771n916r89J576k621R740J375
14100C461j7033o142P507M241r120j0109j1341J787J9213Q975l207O308J8118
14087A2658L96J292q432j1795n776q579J2367J1610L251n930l67N568l32J1798
14073A7729K2j7353O178k367r792o027P175J2782n36j0390K57N243R07N130j4683
14058e725j0936n326J4803J7386J723j0312m301K045R63m948r970L544r277q49
14044b1180N81j286n869J971Q470J8021R120o209n738j667J604j2112k359l227
14030a9880L069m422L883k952n609J0993J3915j0844j6610J1628J9693M031j1273
14017d378O613K1685J767k882N780n163o389n066n159j0397o394K857J0046L6985
$$ y = [-12877, -8035, -14722, -8706, 1910, -2676, -1290, 5067, 296, -5620, -6609, -5033, -7654, 2086, 3461, -13572, -19714, -12207, -7966, -17086, -27195, -38536, -36749, -17536, -8561, -11768, -5460, 12658, 13054, 14346, 5914, -5881, -11657, -20236, -7869, 3741, 6992, 1062, 695, 6263, 5931, 17729, 17751, 398, 6576, 4209, -5583, -11610, -4435, 8347, 7811, -2579, -2322, 2921, 3828, 8958, -5725, -16661, -21987, -7184, 10202, 11925, 1613, -2688, -643, 320, -4628, -14598, -11054, -20331, -21180, -20599, -21885, -27754, -25783, -17313, 708, 9828, 3619, -2119, -3786, -2182, -14294, -16653, -19880, -16811, -21233, -17350, -20302, -25911, -14918, -1003, -11847, -28457, -16829, 2864, 6895, -4378, 2235, 23920, 25687, 22805, 28585, 23422, 17033, 11967, 6808, -3589, -9983, -7126, 2920, 39905]
14003C9905M456m018j1580O372L08J1074L2216K9712L3416K5089J3308J4260O68
13990A95186M723k5316l6433m1371m2307k2658k71l996j2276k12j448o643l260
13977C718o389j5493q975j2561l155J1239J0384J202R607J4858J7829K459n244
13964A9479o694n467q827L523j15q98k44R393K478j0577p194n807J83R343J1499
13949A0075K240l631J0619k0991r740M183N797O351m991J710l716R727J468p650
13935A451m335k685L265k608n691J364R160J394n053J224j2870n66l868Q984J423
13920i411j3821N266J9770L003k721M016P990j0970j101o955o148K989P047p131
13906h177J4122R559o76o043j9931o826O821M404J2454J4546j9382q392L382j2405
$$ y = [39905, 44361, 40343, 28763, 35135, 35443, 46517, 78733, 108445, 141861, 166950, 180258, 194518, 195186, 199909, 174593, 138160, 96789, 54482, 31824, 31553, 27557, 15281, 15069, 13621, 6978, 3718, -2671, -18164, -27139, -39700, -42855, -31616, -21232, -20030, -10423, 4435, 22264, 24723, 19479, 12785, 7318, -1509, 2014, 1899, 1001, 757, 10150, 12628, 2051, -5143, -10950, -10767, -1424, 10075, 12315, 8684, 19303, -1688, -11428, -7245, -1448, 4903, -88, 1622, -2094, 7633, 9101, 1451, -2884, -5569, -2304, -4912, -10603, -9239, -79, 1315, -3738, -2514, -15384, -15950, -19818, -10834, -9411, -23232, -17966, 1804, 4807, 2086, 6102, 14092, 3122, 2021, -4934, -11082, -8093, -1046, -8177, 5945, 15504, 14828, 8785, -11146, -17972, -11151, -6747, 5707, 20253, 871, -7521, -4139, -16544]
13892a6544N400M183L670J0652N396q279K491q333r392p502J09q46O622M236O818
13877a319j1124k875O640L97j715j023K647j471j2960R177P62n834j227l824j1
13862b3760N395J0572m2l191j2219J4676K1163q06r840l546R648J3772O704M128
13848C2654j2085K280r02M4j2728l523Q160K733j5021J279J107k318n973m087
13834h380M578k402o155J887k713J4690k12j2546l247N047K5648J0396j8951j7575
13820i935k29O02L624l205J2023M315Q464N647J4880j3408j6886R485L679K611
13806B1667K3220L1227K3968J4378M0200K9127L3024M0167O6581J33241J99160
13795F55960K82508L19277L30648L29469L05507K72294K07686J00771p7706j98161
$$ y = [-16544, -11144, -6961, -3291, 7361, 12757, 4478, 6969, -1364, -10756, -18258, -18149, -18995, -12373, -8137, -1319, -12443, -15318, -8678, -8281, -9996, -11019, -8372, -9843, -22803, -13626, -12864, -18698, -19925, -23749, -23760, -18365, -7793, -7835, -11026, -23245, -8569, 12594, 11788, 1948, -1598, 8050, 21822, 28526, 32654, 20569, 22849, 21947, 21991, 9263, 5740, 13900, 16633, 1612, 2891, 3998, 1680, -4293, -8380, -3802, -6204, -12359, -10472, -13185, 1505, 1293, -11253, -14500, -9453, 16195, 26591, 7640, -9935, -10164, -9562, -5938, -9143, 2880, 7195, 15659, 21306, 36186, 22778, 5892, 15377, 19056, 21667, 44887, 76114, 100082, 114460, 154660, 183787, 216811, 256978, 323559, 456800, 655960, 938468, 1257745, 1588393, 1917862, 2223369, 2495663, 2703349, 2804120, 2726414, 2528253]
13785B528253k88348k89541l11426l23318l05606k72727k02119j32548q7281m6967
13775B68372l2376k9554k6446k4290k0947j6119k0352j9076j2399j7901j136M493
13763E2269O426j714j3354J809q911j0611K338Q289r308o992J0364j283N774k41
13749C4855j365k961r98j1003j0715J0466J3144K862q74O998k619o16q147m496
13735B4531o097m36p410p607M900M429J090n511j0222n826Q975R464Q472J5316
13721C4068J4721P05r505j7016p74N683O282p69j5095k035L57r735J633L543N1
13706A2114k1832q123J1838J4443N334p080n682K306K4191M507M746J114K633
13693D0509Q558j5776j4015P910q63j1317j1433k44k026n169J3273N414j9439
$$ y = [2528253, 2239905, 1950364, 1638938, 1315620, 1010014, 737287, 535168, 402620, 315339, 268372, 235996, 206442, 179996, 155706, 134759, 118640, 98288, 79212, 66813, 48912, 47776, 52269, 58695, 56981, 43627, 45436, 36525, 25914, 28252, 36541, 27233, 20241, 30605, 29322, 35096, 34855, 33490, 30529, 29531, 18528, 7813, 18279, 31423, 34285, 33411, 40409, 37790, 37174, 29027, 24531, 18434, 17998, 10588, 2981, 7881, 12310, 13400, 7889, -2333, -8159, 816, 10280, 18752, 34068, 48789, 49494, 39989, 22973, 22199, 27882, 34164, 33395, 18300, 16265, 16622, 6887, 8520, 12063, 12114, -9718, -17841, -6003, 8440, 13774, 6694, 1012, 3318, 27509, 32016, 36762, 37876, 40509, 49067, 33291, 19276, 27186, 26323, 15006, 3573, 3329, 1303, -3866, 9407, 14821, -4618]
13680d618j412J2690k982L405Q489j0878j5344p195J5600K2953m984p872l132
13667D720j441M807M276k238m043L290q278r84m933n361l702J0939L489L934J529
13652F004p179L308L005j7255p67L081n437k4079p29J2098J1615L953l362j0341
13638b6085P066p878m137R019R398L487n584L658P63o337p562N007M673P672J096
13623e744Q006N38j5032j269n010K752L116o07j544M158m516J1797m376K037j2403
13608a8097j1565j608O607J1023J458L120K0776J6691m24j6237k0479J6232p018
13595D79K797J7706j2420n913J480j23o403K394M306J699o922j7994j4090M118
13581b8886J759M798Q74O540K841j651j870q632J9107J3273o129l00j0388J773
$$ y = [-4618, -6030, 6660, 3678, 7083, 15572, 4694, -10650, -17845, -2245, 20708, 15724, 7852, 4720, 3279, 8086, 12362, 10124, 6081, 9371, 1093, 109, -4824, -10185, -13887, -2948, 541, 4475, 6004, -1175, 2133, 5138, -12117, -12884, -9803, -15240, -39319, -40048, -27950, -16335, -12382, -15744, -26085, -19019, -26897, -31034, -22015, -12617, -9130, -14714, -11056, -10293, -16630, -24192, -19185, -14512, -6840, -5744, 2262, 2800, -12232, -13501, -18511, -15759, -12643, -13250, -14794, -10636, -15152, -3355, -7731, -5694, -18097, -29662, -31270, -24663, -13640, -12182, -9062, 11714, 28405, 27981, 11744, -8735, 7497, 479, 3276, 20982, 8562, 2649, 4129, 4006, -2397, -3, 4303, 6002, -920, -18914, -33004, -28886, -27127, -22329, -21455, -14915, -12074, -13725, -15595, -24227, -5120, 8153, 2024, 1724, -8664, -6891]
13567f891N711J340l27m713j439l323j444N897j0404j0230J174M564J263j627
13553b0449J5234J7008J648k2949m114k600J0214O800M393j253J660p151j329
13540b888m176j4657N893N894J4780o844j4801k672J1977MM070l536J985n079
13526a0050Q885P917J2992Q985K979j1285j5553o578j2590J2184j152r796k1222
13513c4284m900k017O97P833R807K287l562N602k428J185K294J6060J3810m989
13499G395Q68k392O798j2086k3947q199L841K4205J1854R57j578O97k0947j0432
13485b2966J3128J5833n902j812J6037o520k0983q613J1095P803j287n909L900
13472f196R156M268m17j5269p832j157L420k892p324N702M538M843l455q849r393
$$ y = [-6891, -1180, 160, -167, -4880, -6319, -9642, -11086, -5189, -15593, -25823, -24649, -20085, -18822, -20449, -5215, 11793, 13441, -9508, -13622, -16222, -6008, 792, 5185, 3932, 5592, -1559, -2888, -7064, -21721, -15828, -9934, 4846, -1998, -16799, -19471, -7494, -7490, -3420, -6956, -4971, -10050, -1165, 6752, 19744, 28729, 31708, 20423, 4870, -1708, -14298, -2114, -3266, -13062, -34284, -39184, -41201, -40504, -32671, -22864, -20577, -24139, -18537, -20965, -19780, -17486, -1426, 12384, 7395, 8263, 5871, 12669, 583, -23364, -31563, -27722, -3517, 8337, 9294, 7716, 8413, -12534, -22966, -9838, 5995, 93, -1719, 14318, 7798, -13185, -21798, -10703, -2900, -4187, -10096, -6196, 2960, 7228, 6811, -8458, -16290, -17447, -14027, -16919, -24243, -18541, -14003, -9160, -12615, -21464, -30857]
13457c0857L529q039M323K5005J3201J758K477j02r302p891j3758K824P243J086
13443h503j987K663j1151N062J0732M877J1062Q609r299r945o391j2222M755J2540
13429H02K122m708m92N287O383o195j499l58K751o431o189N016P652q71J670n487
13413e47K148r64j2808P902K942j132k450J0960N478r836m132O178o697m330o688
13398a3976m48J7155P564j0010j4921k010L905J5301Q452m720j0479j3391O757
13385a0821J2918J253R25p916o647m480O924O767N260J4505Q478r868n744J715
13371A3269r344R960m628o875M031k393m797j825o153J768L225o652m048q692
13357b3154q939k413J135J3060k580j1259L298P968R744J5363N291r65P366r726
$$ y = [-30857, -27328, -35367, -31044, -6039, 7162, 8920, 11397, 11295, 1993, -5898, -19656, -16832, -9589, -8503, -10490, -7827, -18978, -13916, -3184, 1693, 12755, 21364, 12065, 2120, -4271, -16493, -11738, 802, 2924, -1784, -2276, 3011, 9394, 3199, 1700, 1342, 4093, -2338, -8527, -3511, 4141, 3270, 4940, -547, 1601, 637, -12171, -4269, -1327, -2459, -4909, 6051, 11529, 1693, -2439, 3739, -2958, -7288, -13976, -14424, 2731, 10295, 285, -14636, -16646, -12741, 2560, 11012, 6292, -4187, -17578, -10821, 2097, 3350, 4275, -3641, -10288, -14768, -7844, -1077, 4183, 18688, 27166, 17298, 11554, 13269, 3925, 13885, 9257, 2382, 6413, 4020, -777, -2602, -8755, -6987, -3762, -10414, -14462, -23154, -32093, -34506, -33371, -20311, -22891, -34150, -30852, -22884, -13140, 2223, 7514, 6549, 13915, 4189]
13343D189m917O120P934n48L958J3731n783j4618L52R640o551J834Q679p78k486
13328B0756p173n992n941l049K883j525l419j913O793j1012j0113o496O95P239
13314a8267k251K030k403M428j481L655L502P700q196J2639Q349n571M332N6L378
13299A1900j0302M520Q185l259j5861p969R844q466j5666L145J5599O096L227
13286I93o038n819l488n767j582r821N483R961K183P770M213P350O570q19n44
13271A0645M009j0753k1080m611P228O699k0024r580J251J1539J3816j0747l66
13258b1974K018M127L806J0011J1171p131n991L382k481l103k0116J2269J4308
13245B96K137r827r381j1412J3495L558j1821m904o446Q202R664K341k0K097N755
$$ y = [4189, -728, 5392, 13326, 12778, 16736, 30467, 24684, 10066, 10418, 20058, 13507, 15341, 24020, 23242, 20756, 13583, 7591, 1650, -1399, 1484, -41, -3460, -5373, 1420, -9592, -19705, -26201, -25506, -18267, -20518, -18488, -20891, -16463, -17944, -14289, -10787, -3087, -11283, 1356, 9705, 4134, 8466, 8522, 11900, 1598, 6118, 14303, 11044, -4817, -12786, -2942, -11408, -27074, -23929, -8330, -2234, 993, -5045, -10864, -14352, -20119, -21701, -31522, -26039, -16078, -13895, -6125, -1912, 5438, 12008, 11189, 10645, 14654, 3901, -17179, -21790, -14562, -7863, -27887, -37467, -36216, -24677, -10861, -21608, -21974, -19956, -15829, -12023, -2012, 9159, 2028, -3963, -581, -3062, -6165, -26281, -14012, 296, 2433, -7394, -16775, -28187, -14692, -11134, -22955, -27859, -34305, -26103, -16439, -14098, -14118, -12021, -6266]
13230f266O667l793j4437NJ1016Q851m088k303p690R085q287r751p362M844Q098
13215a5411J943P216J0597r086q086r946M68O63m454K140P179L797l374J997K258
13200a2099M316O424L720N207j5777j1281N474N535R983R176K757q483Q02Q727
13186A4481j1144k590l897N463J0690l286j2088J4446M585j2951q083k468N093
13173a749L2O7K778J849j53N200j729j7630q437O748J2884J2550k08m510l202
13158D490j34k325q621o680k935o026N213J1423M519j4997p913N763J5669J7362
13144A4808n816j4186j6913l775L405J3709K1097J2724n637j8199K504K2985o546
13131B0160j3200o3J619j308j964j5410j4023r675q862J9948J7947l200r703n290
$$ y = [-6266, 401, -3392, -17829, -17824, -6808, 2043, -2045, -4348, -12038, -2953, -11240, -20991, -28353, -23509, -15411, -13468, -6252, 4345, -4741, -12827, -22773, -22305, -21642, -26096, -23956, -16777, -12980, -16354, -14357, -12099, -7783, -1359, 2361, 7568, -8209, -19490, -14016, -8481, 1502, 10678, 13435, 4952, 5754, 14481, 3337, 747, -3150, 2313, 13003, 9717, -2371, 12075, 16660, 3709, -4374, -6842, -1749, -1717, -1650, 1128, 2977, 2824, 8024, 6295, -11335, -19772, -13024, -140, 12410, 12202, 7692, 4490, 4356, 2031, -6590, -13270, -16205, -22231, -17018, -5595, -1076, -16073, -23986, -18223, -2554, 14808, 8992, -5194, -22107, -25882, -22477, -8768, 12329, 25053, 19416, 1217, 3721, 26706, 20160, 6960, 6897, 8516, 7208, 5244, -10166, -24189, -33864, -42726, -22778, -4831, -8031, -17734, -23024]
13117b3024j069j25J5840O629p153K835o100k463J2189K1231J464o877n499j902
13103E976p27k753p740p496M381r43p55n983l99R914J1999P869N568j0809o561
13088A541r812o992m257Q269R015n779q641n254j800J0152N697J0572J3903m642
13074A1972l0322p800J0058M439J2051q090j085K847n518J1370K060K69L761j2961
13060f949j5751m641o969O726m395J3177J8334j366j032L219l264j0954P78k180
13046a5267M957O970p386r908j2836J4885M972R499k029l987O053M300p249o586
13032a3612q581J916M975J066L095K078j7404j2765J4685J677j2258l104J6657
13019b1575K545L784l897K405K1882J870k1859j1149N662K1310J980l435l404
$$ y = [-23024, -24093, -24218, -8378, -1749, -8902, -6067, -12167, -14630, -2441, 18790, 20254, 13377, 7878, 5976, 5249, 2496, -5244, -12740, -8359, -9302, -10057, -16040, -16439, -6525, 5474, 13343, 18911, 8102, 1541, -8271, -15263, -19520, -11251, -2236, -8015, -16656, -21910, -23710, -13558, -7861, 2711, 16614, 11972, -18350, -26150, -16092, -11653, 398, -7692, -8777, -5930, -11448, -78, 1982, 2251, 6012, -6949, -22700, -27341, -34310, -27584, -31979, -18802, -468, -1834, -2866, 353, -2911, -13865, -13087, -15267, -10310, -3340, -10726, -20634, -33470, -18585, -13613, -4114, -6143, -10130, -4077, 223, -7026, -13612, -22193, -20277, -15302, -14236, -11141, -9063, -26467, -39232, -24547, -22870, -35128, -38232, -21575, -19030, -15246, -19143, -16738, 5144, 7014, -14845, -25994, -20332, 978, 2958, -477, -3881]
13006c881k0201O531J630j0232P045K652O737m649l073j047N842J117m075O787
12992h817j086j26J488R698K2087o132k2748j3041Q163m086O515N174P26K067
12978a18j1424m508R134J8045J12o230n656r625r872K3275J4898j9077m371J4559
12964I142l459Q420q104j1907p767o133q051J5259N884q835m187M62N407J4095
12950B26j2751j4151P977K841k729Q187l85j2894k346J2154j501m358N824J0126
12936c780P436R76p347k571j921O130M654l604o936j1644q826N696L600o61n453
12921b4251r86J1412O019M503M831Q468r216n027M752o37j0941N493J0033J3529
12907A7982M075m095o013J4329J5819M65q949o00J2250L2613K2947J8918L8630
$$ y = [-3881, -24082, -17551, -15921, -26153, -19108, -16456, -9719, -14368, -17441, -18488, -12646, -11529, -15604, -8817, -9903, -10029, -8541, 1157, 23244, 17112, -5636, -18677, -10514, -14600, -8085, -2911, -2185, -118, -11542, -16050, -6916, 11129, 11241, 5011, -645, -10270, -20142, 3133, 18031, -1046, -5417, 9142, 5683, 14103, 5999, -5908, -13675, -19808, -27859, -12600, -6716, -15551, -19738, -19276, -13869, 226, -12525, -26676, -18699, -15858, -18587, -10400, -10785, -23679, -26025, -13871, -15372, -19730, -13906, -3780, 3656, 4632, -2715, -5286, -7207, -1077, 3577, -27, -6963, -18607, -27433, -21737, -18137, -18798, -24251, -25237, -13825, -7806, -3303, 1528, 9996, 780, -4247, 505, -132, -11073, -5580, 4453, 17982, 22057, 17962, 11949, 26278, 42097, 42562, 33613, 33013, 45263, 77876, 100823, 119741, 158371]
12894A58371M5948O5694N8805N6768O5207O2496L8453K1141k33l1163n4591n1704
12882D35192o7588n3540m7903n1312n1021k9569j954K3426K5063K2020l6162n4654
12870A11998m9003j3092o303l935K110j3032o679m43L408n319j1215j0382j811
12857c698N20P212J0334M542M119o885j6609n642j789j337Q30O693o69J3027q79
12842I769P539k1387j2391k449J4805K13j2611j0265J1286J7273J8059J2757o159
12829B6439j5578q940p685O557K05j1854j395j57o754J6451P661n084K437L956
12815F259o399J1485q80j1442K039l551l122R629J1572j3865o975m744p660j380
12801a9034N396q93l464N366J4845m260j2085M759Q135l452l978R827n138j394
$$ y = [158371, 204319, 270013, 328818, 385586, 450793, 513289, 551742, 572883, 572650, 541487, 486896, 435192, 367604, 314064, 266161, 214849, 163828, 134259, 132305, 155731, 180794, 202814, 166652, 111998, 62995, 49903, 43600, 39665, 41775, 28743, 22064, 21621, 25029, 19710, 8495, -1887, -3698, -3178, 4034, 14368, 18910, 23029, 16144, -465, -6107, -7896, -9233, -8403, -1710, -2379, 10648, 9769, 17308, -4079, -16470, -18919, -4114, -3901, -16512, -26777, -15491, 1782, 19841, 32598, 26439, 10861, 1921, -5764, 793, 998, -10856, -12251, -12408, -19162, -2711, 4950, -134, 2303, 6259, -140, 11345, 10465, -977, 1062, -2489, -5611, 4018, 15590, 1725, -5250, -9994, -17654, -19034, -13638, -14531, -17995, -12629, 2216, -2044, -14129, -9370, -1235, -4687, -8665, 1162, -3976, -5370]
12787e370K1998L623o361K011L27n7R541j089M488J2989Q10j1992R173m09n752
12772C3930q95J0778j4963m31O347K032J6618K9428N6433P7104K6875l7753p9141
12759A26362n8726k0052k6021r414l57k694N64j2407R190J4360p570r176r378
12746e319M050P576R411M480q728m04Q258L936k99J0808Q797J812K677j2800j343
12731C2912n390P602J5920O540M133j520j251O444K209N238L308o675j0860q406
12717E0204k054j3216p626j5342q064j42j0886Q182J9586J778p874K162K800j7356
12703B152m766n061J0067N842P59P599N18o928l951o813R332l788k0627p014J9232
12688c447N890L399q229K090k900r559m191j1458N021j298Q844m567K285L550
$$ y = [-5370, 16628, 20251, 13890, 15901, 16228, 16171, 25712, 24623, 29111, 42100, 42910, 30918, 40091, 39682, 33930, 33035, 43813, 28850, 28419, 34766, 36798, 53416, 82844, 139277, 216381, 243256, 205503, 126362, 67636, 47584, 21563, 12149, 11792, 9098, 9662, -2745, 6445, 20805, 13235, 4059, -5319, -1269, 6307, 15718, 20198, 11470, 11066, 19324, 23260, 22961, 33769, 42566, 44378, 47055, 34255, 32912, 27522, 35124, 51044, 57584, 61717, 60197, 58946, 65390, 67599, 72837, 76145, 69470, 58610, 50204, 48150, 34934, 27308, 11966, 3902, 3760, -7126, 1056, 20642, 22420, 14546, 16708, 19508, 2152, -2614, -7675, 2392, 8234, 8993, 16592, 17110, 10182, 6231, -582, 8750, 4962, -15665, -22679, -3447, 2443, 5842, -2387, -297, -3197, -12756, -16947, -28405, -23384, -24682, -15838, -20405, -18120, -14570]
12674a4570l958k314n625L752J2124M42j5670r379K876J6487P758J080m033J08
12660a0922J2523J1710N449J0905K921k722L729M746j705k888K329p484m978j874
12646B1739m299K61N193m635M013L827j2539n430J0183J0905N403Q61j805o828
12632B6849o639L330K892N961Q909j1219m347p844j2447L373J7412N290J1728
12619D3248K197j0958j049M065O993P659P087J1640M820j1930q142q729L750J840
12605E2491P823l078J3777K544R404J0227O163M970r892M927O316M367K367n964
12591A06442r418j6652j5358L355J6249m962l46r965j2947q71k427J467k526P583
12577E9624R234N128J998N315L393k7887j3461M470Q095k100j478L780l060l918
$$ y = [-14570, -18528, -20842, -26467, -22715, -10591, -10149, -25819, -35198, -32322, -15835, -8077, -6997, -11030, -10922, 1601, 13311, 18760, 29665, 32586, 29864, 33593, 38339, 36634, 33746, 36075, 28591, 23613, 21739, 17440, 17701, 22894, 18259, 22272, 26099, 13560, 8130, 18313, 29218, 34621, 35482, 33677, 26849, 20210, 23540, 26432, 32393, 41302, 30083, 25736, 17892, 5445, 8818, 26230, 31520, 43248, 45445, 34487, 33438, 37503, 44496, 52155, 59242, 70882, 75702, 63772, 55630, 46901, 50651, 52491, 60314, 57236, 71013, 73557, 82961, 93188, 99351, 104321, 94429, 99356, 105672, 110039, 112406, 106442, 97024, 80372, 65014, 68369, 84618, 79656, 79310, 69345, 56398, 55527, 53100, 54567, 52041, 59624, 68858, 73986, 75984, 81299, 84692, 56805, 43344, 47814, 55909, 53809, 52331, 56111, 53051, 49133]
12563D9133J298N753K0501J5007k3270j3832j1277P809J7753L102M36O518l136
12550G5795j950l23K2891K7407k232M713N823L2196J7186Q69l83J6379J0719p37
12536B08353L335K48Q114J3785L274O479m441J7649J9230j3986j9745q93N391
12523B46793K458q02L704K4983J3877O949K0250J5163J6477K7054K3570K3944
12511D24420K6326J4151K5743L8320L8106L1244M5679P2612P7089O8391Q0212
12500I42293R6527J03647J29949J65581J91078K20725K67488L22593L99269N06063
12490C345213O25490P28347Q58807R62750J005724J099812J276500J628756K271393
12481A3802792L365075N034381P407122J0038181J1894344J2644900J2403618
$$ y = [49133, 50431, 56184, 76685, 91692, 68422, 54590, 43313, 51122, 68875, 71977, 72413, 78931, 75795, 73845, 73522, 96413, 123820, 121588, 126301, 132124, 164320, 181506, 182375, 181992, 198371, 209090, 208353, 211688, 211936, 220050, 233835, 237109, 243588, 239147, 256796, 276026, 262040, 242295, 241402, 246793, 249251, 248449, 252153, 277136, 291013, 297962, 318212, 333375, 349852, 376906, 400476, 424420, 450746, 464897, 490640, 528960, 567066, 598310, 643989, 716601, 793690, 862081, 942293, 1038820, 1142467, 1272416, 1437997, 1629075, 1849800, 2117288, 2439881, 2839150, 3345213, 3970703, 4699050, 5557857, 6520607, 7526331, 8626143, 9902643, 11531399, 13802792, 17167867, 22202248, 29609370, 39647551, 51541895, 64186795, 76590413]
12474G6590413J1526992J0262961P578092L580866j845529o567188r633318j1229207
12466H0264082j1823307j2231956j1819403j0529237q205732n666232l760595
12459A6227620k575040j849041j420121j167786j046399r59665q62625p82361
12451E564582p21478o42668n43824m50242l71407l02368k47552j79667j52463
12442A952913j41103j27294j16332j02449r1828p1566o3336n8856n1597m9922
12432A078630m7783n0072m2279l1917k6010k2768j3547j4858k2074l1627l7425
12421G38270j8610m0053l4744m3625m2117k9265k5068m1149l3418j9590o944k8043
12409C75644l3612N538n56j7803j9609n046N972j605J7433J2512P539m220J0375
$$ y = [76590413, 88117405, 98380366, 105958458, 109539324, 107693795, 101126607, 91493289, 80264082, 68440775, 56208819, 44389416, 33860179, 25654447, 19988215, 16227620, 13652580, 11803539, 10383418, 9215632, 8169233, 7209568, 6346943, 5564582, 4843104, 4200436, 3656612, 3206370, 2834963, 2532595, 2285043, 2105376, 1952913, 1811810, 1684516, 1568184, 1465735, 1373907, 1302341, 1239005, 1180149, 1128552, 1078630, 1030847, 980775, 938496, 906579, 880569, 857801, 844254, 829396, 807322, 775695, 738270, 719660, 679607, 644863, 601238, 559121, 529856, 504788, 463639, 430221, 410631, 403687, 375644, 342032, 347570, 347014, 329211, 309602, 304556, 310528, 308923, 326356, 338868, 346407, 342187, 352562]
12396C52562J1666K7325J254j2606M503O134L258o41J727J1696K7328N0143M5983
12383E30332M4580N7583M2734J7573K4864L087k7691m6244m8374o1474n9747n0554
12371D26669o1299l2606k8057j6133j6895j7577o723J6880J3304P065K1314L1864
12359C37806M1833N3599L3940J2378Q591K5323O068J91j1539j5537l2846l4231
12347D25576m7478m6028l0779n832k0825o208l897J2760J7919J6510K7261K1201
12335C60180J0084K364o977l0961m8564m4999l4455j9803n018j3150j1353j6627
12323A40721k0219M932Q185J3010K806N553J7862J5901N084o405k8956k2026j2826
12310A23622M001p368j5258r083l601r56m188K261P047J075K534k827R862Q522
$$ y = [352562, 364228, 391553, 392807, 380201, 384704, 390838, 394096, 393455, 395182, 406878, 434206, 484349, 530332, 574912, 632495, 675229, 692802, 717666, 720753, 693062, 646818, 598444, 536970, 477223, 426669, 365370, 332764, 304707, 288574, 271679, 254102, 247379, 264259, 277563, 284628, 305942, 337806, 379639, 433238, 467178, 479556, 488147, 513470, 519538, 519729, 508190, 492653, 459807, 425576, 378098, 332070, 301291, 295459, 274634, 268426, 264529, 277289, 295208, 311718, 338979, 360180, 370264, 372628, 365651, 334690, 286126, 241127, 206672, 186869, 181851, 168701, 157348, 140721, 120502, 125434, 133619, 146629, 149435, 154988, 172850, 188751, 193835, 187430, 158474, 136448, 123622, 127623, 120255, 104997, 95914, 92313, 91357, 87169, 89430, 96477, 97552, 100086, 97259, 107121, 115643]
12296A15643j286n265r876R34O587j1183J51p512L169J6140N803J0132K07K2144
12282A45788K4994R767M623N149J1270n720K50q541j5761r648k583j0150k417
12269A47021J0809K6523N1522O0813L8698l0692n5047l5375l7253j6332K0736
12258A81423Q058L068L0742K5658j2899l0243n5522l1888N264R168p46k985o623
12245A22475K470L119o447k685p007n860P377M001j2720j043p155n827k081m052
12231H4565j5979o158P732J079j1117j2066J9800J2938r19R246L525m558r513
12218G8575o741m937J2081J4070K4220K070l037o113J327P354q505M278J7506
12205A32148O98K150r488o287N776n610r245o859o877J3164L724r445J946M538
$$ y = [115643, 114357, 109092, 99216, 100150, 106737, 95554, 95705, 88193, 91362, 107502, 113305, 123437, 123644, 145788, 170782, 180549, 185172, 190321, 201591, 195871, 196121, 187580, 171819, 162171, 159588, 149438, 147021, 157830, 184353, 235875, 296688, 335386, 304694, 249647, 214272, 177019, 160687, 181423, 189481, 192549, 223291, 248949, 236050, 205807, 150285, 118397, 123661, 132829, 132083, 129098, 122475, 124945, 128064, 121617, 118932, 111925, 106065, 113442, 117443, 104723, 103680, 96525, 90698, 88617, 84565, 68586, 62428, 70160, 71239, 60122, 48056, 67856, 80794, 79875, 89121, 92646, 88088, 78575, 71834, 66897, 78978, 93048, 117268, 119338, 116301, 110188, 111515, 118869, 110364, 114642, 132148, 132846, 134996, 125508, 119221, 124997, 119387, 110142, 103283, 96406, 109570, 113294, 103849, 105795, 110333]
12191A10333m271j6480j8434j1557l549J0946l673P142j67L877J0140K7205J2922
12178A24434J3513j3254o138o230l013m345m607M557l95J555l004J2926Q767J9791
12164A44557J3090o80N769K2150M1297N3254P1695R8215J18758J10156Q8432o918
12152G59775r2793j22493r0511m1213P876N7182P9742R0600P1488j338r4336j37923
12140D86056j27818r6658o3206l0061j3864o696o870j921j315n269m496R635N050
12127A42567j9865j3815j4334j3411j4346r431N7J3417K2836J2335O252K088p466
12114A06884k2746p364N914j7483q496P606J0313p281n521r388j1580k559J4214
12101E2513P9n430o51J4431R738M420R610Q962J773J3723n9o070o505k0148l94
$$ y = [110333, 106062, 89582, 71148, 59591, 56042, 66988, 63315, 70457, 70290, 74167, 84307, 111512, 124434, 137947, 124693, 118555, 112325, 109312, 104967, 100360, 104917, 104522, 106077, 103073, 115999, 124766, 144557, 157647, 156967, 162736, 184886, 226183, 279437, 351132, 449347, 568105, 678261, 766693, 759775, 666982, 544489, 453978, 412765, 420641, 477823, 557565, 648165, 719653, 718315, 623979, 486056, 358238, 261580, 198374, 168313, 154449, 147753, 140883, 138962, 137647, 132378, 127882, 137517, 142567, 122702, 108887, 94553, 81142, 66796, 57365, 57422, 70839, 93675, 106010, 112262, 114350, 106884, 84138, 76774, 82688, 65205, 56709, 64315, 74628, 67347, 61826, 52438, 40858, 38299, 52513, 52592, 47162, 46511, 60942, 70680, 75100, 84710, 93672, 95445, 109168, 109109, 103039, 96534, 76386, 75992]
12086G5992R333q092j6379M19J273j1412O817N094n198J592J0040k280M928j2624
12072E9503J0267J0515J6006J2517J0445R342R89J8676J6475O03r782m890O500
12059A57166L3419L1716M4219L8297O4809J02184R8900P0584N0465M2170L1084
12048G65013J1228o132k3970O50J0563K0560P6943J73270L77658P78708J438278
12037C622769K412259K902805N89553k838420k858946j559043p62675m10155k47018
12028H51129j70827j18221q7796n9048m9991l5087l8486j9025p128j4923j9892
12017B30705k3311j8504j6491k2959k1178r681j126m858j2407j0822N89M494K104
12004I6555o605n899K678o048j3187j5890r852l426o358J077J5476P1N185K1344
$$ y = [75992, 85325, 77233, 60854, 61273, 62546, 51134, 57951, 63045, 57847, 59439, 69479, 67199, 72127, 59503, 69770, 80285, 96291, 108808, 119253, 128595, 129584, 148260, 164735, 165338, 155556, 150666, 157166, 190585, 222301, 266520, 304817, 369626, 471810, 570710, 641294, 691759, 733929, 765013, 776241, 770109, 746139, 746789, 757352, 777912, 854855, 1028125, 1405783, 2184491, 3622769, 6035028, 8937833, 9527386, 6688966, 3830020, 2270977, 1508302, 1098147, 851129, 680302, 562081, 474285, 415237, 365246, 330159, 291673, 272648, 265520, 250597, 230705, 207394, 188890, 172399, 149440, 128262, 118581, 117455, 112597, 100190, 89368, 89957, 94451, 96555, 89950, 84051, 86729, 80681, 67494, 51604, 41752, 38326, 31968, 33045, 48521, 48592, 53777, 75121]
11990G5121Q592J8512P910q210j2416j1268n502J587j1J2800R642n067j4316j2600
11976F4774j0869o412j306k86J5759P326j5913j2832p729J556m824J2639K7245
11963F9128R545J174R135o321j4763j4354j1034J857l059N955Q474L441m578p606
11949D6994o192j3889k19P369K150m848J359l73J519N442K778K961O584k021j5567
11934C4047j1824R330N64n69N525p863M096J222N998o068K194k056l5N278o481
11919C3358n299P735Q566m710m552J646m335M833J2808R797k129l329j3658k072
11905C8659m636j786R81j8041n236M814P156J718J6289R49m784J6398j316p445
11891D3720r548p835O744K3903J6506O389M478q64J067J000l586j9833q852k642
$$ y = [75121, 83713, 102225, 110135, 101925, 89509, 78241, 72739, 74326, 74315, 87115, 96757, 91690, 77374, 64774, 53905, 47493, 46187, 45901, 61660, 68986, 53073, 40241, 32512, 34068, 29244, 41883, 69128, 78673, 79847, 88982, 82661, 67898, 53544, 42510, 44367, 41308, 47263, 55737, 59178, 54600, 46994, 40802, 26913, 26694, 34063, 36213, 31365, 32724, 32351, 33870, 39312, 42090, 45051, 51635, 49614, 34047, 22223, 31553, 32117, 31548, 37073, 29210, 33306, 34528, 40526, 34458, 36652, 34596, 34561, 39839, 33358, 28059, 35794, 44360, 39650, 35098, 36744, 32409, 37242, 50050, 59847, 57718, 54389, 40731, 38659, 34023, 32237, 33218, 15177, 9941, 14755, 21911, 23629, 39918, 40867, 36083, 52481, 51165, 43720, 34172, 26337, 33081, 56984, 73490, 79879, 84357, 83493, 84560, 85560, 81974, 62141, 53289, 50647]
11877E0647L390j0279j3592o324K072O056J5472K032R45N89j1509o780J5272j637
11863D6354K511j0732N223n431M074J2699R517r39p781m210K322P717j0325M314
11849E5313j0430J436O738J4032K642P73l401j732M6n185L479J684q59j1874o837
11834D5825M587L697j98l482m994J9749J3570n577Q840J1318n356j3145k0717
11821E4117j3058q033n238p492k223r51K077l262o45l734p15Q895J4765J4109
11807D8612J02N528J4814O023j3386p701k631j2060j1811J4461J0489j186l407
11794D7847j0746p246L246M382j1941L826R540J0031O782J452j785J261J3575
11781G0224J3437n084j0942j2550j1850J038J0662o663n556j202j847m683m23
$$ y = [50647, 54037, 43758, 30166, 23842, 25914, 31970, 47442, 49474, 50419, 51008, 39499, 32719, 47991, 46354, 48865, 38133, 43356, 37925, 41999, 54698, 64215, 63276, 55495, 51285, 53607, 61324, 50999, 55313, 44883, 46319, 53057, 67089, 69731, 70504, 67103, 65371, 65417, 60232, 63711, 65395, 64536, 52662, 45825, 50412, 54109, 53911, 50429, 45435, 65184, 78754, 73177, 82017, 93335, 87979, 74834, 54117, 41059, 33026, 27788, 20296, 18073, 17122, 19199, 15937, 15292, 11558, 10843, 19738, 34503, 48612, 48714, 54242, 69056, 75079, 61693, 53992, 51361, 39301, 27490, 41951, 52440, 51254, 47847, 37101, 29855, 33101, 37483, 25542, 29368, 38908, 48939, 55721, 57173, 55388, 56649, 70224, 83661, 78577, 67635, 55085, 43235, 44273, 54935, 48272, 42716, 41514, 39667, 34984, 34561]
11768C4561J688K931Q824m964j6444j619O316l562J2511k1754k4090O705J9457
11755B0560J1207P965J1719m650j4J2861N167R53j9734L77P442J3982k604n353
11741E9878P82r82k391j097j4066o658j5321o348K1560J7564N813j5093l889n26
11727C9226M955J759o809o931M750j820o766P359p589l627J6222K441R40J4722
11713E8832L500j4029m781K5818P641l187j3289q688J7308K3485r09j8191j1817
11700F1693l228J1067N328p221q101o747K031p437L775q889j0976m721r564M967
11686B1977N593J0058L843L228r129Q221P930l976j4596l609J875n081r920j1367
11672E047K1229J2556n547J60p807N150J0883J5750m522L801l193m139J3584m783
$$ y = [34561, 36249, 39180, 48004, 43040, 26596, 24977, 31293, 27731, 40242, 18488, -5602, 1103, 20560, 31767, 39732, 51451, 46801, 46787, 59648, 64815, 65768, 46034, 46411, 53853, 67835, 65231, 59878, 60660, 59678, 57287, 56190, 42124, 35466, 20145, 13797, 35357, 52921, 58734, 43641, 39752, 39226, 44181, 45940, 39131, 32200, 36950, 35130, 28364, 35723, 28134, 24507, 40729, 43170, 44110, 58832, 62332, 48303, 43522, 69340, 76981, 73794, 60505, 51817, 69125, 92610, 91701, 73510, 61693, 58465, 69532, 74860, 67639, 59538, 52791, 54822, 47385, 51160, 42271, 31295, 26574, 17010, 21977, 27570, 37628, 41471, 44699, 35570, 43791, 51721, 47745, 33149, 29540, 31415, 26334, 16414, 5047, 26276, 38832, 33285, 33445, 25638, 30788, 41671, 57421, 52899, 56700, 53507, 49368, 62952, 58169]
11658E8169j8791m747K776L086o381k0478j6580J1544J2476m59r347M956J3349
11645B9573M649j8847n597J1493L098o113J234m70J739l034o212k648j2292l561
11631f988R741J7019O359k730j5945j6465r583q286l41P935N377q253J3948N971
11617b241J1100Q008j696l531j4338J611l631O499M565N850l514p161R587K30
11603A1338j959l915M468J6946m257o662p143j1123o141L115O717O834J3520J1515
11589C3253m273R63O086L910O371K81o508o371J694q510l686R1j9101K549J66
11574F915K06M598q065O686J5444o572J464P650p304j5556j1778P664J2206J4954
11560B8512R594M03J224J441J2775K62j1445p097o057M344Q083m816j2990O182
$$ y = [58169, 39378, 34631, 37407, 40493, 34112, 13634, -2946, 8598, 21074, 20615, 11268, 16224, 29573, 34222, 15375, 9778, 21271, 24369, 18256, 19490, 19020, 20759, 17725, 11513, 8865, -3427, -6988, 2753, 19772, 26131, 23401, 7456, -9009, -18592, -26878, -27219, -19284, -13907, -22160, -8212, -2241, 8859, 16867, 15171, 11640, -2698, -1087, -4718, 1781, 6346, 12196, 8682, 1521, 11108, 11338, 9379, 5464, 9932, 26878, 22621, 15959, 8816, -2307, -8448, -5333, 1384, 8218, 21738, 33253, 28980, 29943, 36029, 39939, 46310, 46591, 40083, 33712, 35406, 26896, 23210, 23301, 4200, 6749, 6915, 7121, 11719, 3654, 10340, 25784, 19212, 20676, 28326, 21022, 5466, -6312, 1352, 13558, 28512, 38106, 38509, 39733, 41174, 53949, 54211, 42766, 35669, 29612, 33956, 42039, 37223, 24233, 30415]
11546C0415N723P426J762R7j1145J1924Q37n568q04q870j2887K96Q301R546R307
11531D6360J5584M191L456k629r419q970p16R070J2363J098j0786n639j4823j4759
11517B4381P403K3166R162k997m19j9698j1643J3305O987j1685r554k095K650
11504B8963J0708N935O089N637n552o544p224r55K223P835l380r961J5508O377
11490E5659J3894J9596q100j6220J0538R118p608j8069R539J4247K252j36j5456
11477F9254j6281Q979K0933J1143J1539J4305j4936j1234n42J3443l68l031L918
11464A07122O109j2921n38N452q752l919r553r993j2182K883N351m280j1796P526
11450F0509L225o529Q290n856O04r639j5419K979K2384J7393q379j2238j6840
$$ y = [30415, 36138, 43564, 45326, 45423, 34278, 46202, 47039, 41471, 40667, 31797, 18910, 19206, 27507, 37053, 46360, 61944, 66135, 69591, 66962, 57543, 48573, 47857, 56927, 69290, 70388, 59602, 53963, 39140, 24381, 31784, 54950, 64112, 61115, 60696, 40998, 29355, 42660, 49647, 37962, 28408, 26313, 28963, 39671, 45606, 51695, 57332, 51780, 45236, 38012, 37057, 39280, 47115, 43735, 33774, 49282, 55659, 69553, 89149, 81049, 64829, 75367, 84485, 76877, 58808, 68347, 82594, 84846, 84710, 69254, 52973, 61952, 82885, 94028, 105567, 119872, 104936, 93702, 93160, 106603, 106235, 103204, 107122, 113231, 100310, 99772, 105224, 96472, 92553, 83000, 73007, 60825, 63708, 69059, 64779, 52983, 60509, 63734, 57205, 65495, 59639, 60243, 50604, 35185, 38164, 60548, 77941, 69562, 57324, 40484]
11437D0484o991q69J629L758N06J0643Q763R956K261j413j242j988K559m463K264
11422F5857j5526j4903m11q961L605L273R809Q697K9M070j0825p878J4815K187
11408E3838j3695O29r947m142M007j232k885j2376J3314J0699j1852J0526l962
11395C2922m107r484o289N593J120J3091K280j701k711l907P5l525L146P455m870
11380B9088j5547j3866L770J9247J7872J2204N330k80L515Q270j3317l277P457
11367F0466O235O121j25R455J8646J0988L6536K7048J5163J4638M527j3477j7976
11354A78245k6744l9394j5226o788n527m8M086p762L806L041k551p367N949P134
11340I0854o920p462J3601J2534j2161n713P004O040L552m826J1912J752J3818
$$ y = [40484, 33493, 32624, 34253, 38011, 38517, 49160, 57923, 67879, 70140, 68727, 67485, 65497, 68056, 63593, 65857, 50331, 35428, 35017, 26056, 29661, 32934, 42743, 51440, 51469, 55539, 44714, 36836, 51651, 53838, 40143, 40772, 30825, 26683, 30690, 29458, 26573, 14197, 27511, 38210, 26358, 36884, 32922, 28815, 19331, 13042, 18635, 19755, 32846, 35126, 33425, 30714, 26807, 26882, 23357, 26503, 33958, 29088, 13541, -325, 3445, 22692, 40564, 52768, 58098, 57818, 61333, 69603, 56286, 53009, 60466, 66701, 72822, 72697, 82152, 100798, 111786, 148322, 175370, 190533, 205171, 209698, 196221, 178245, 151501, 112107, 96881, 90093, 84566, 84518, 88604, 80842, 84648, 87689, 85138, 77771, 83720, 90854, 83934, 76472, 90073, 102607, 90446, 84733, 91737, 97777, 101329, 96503, 108415, 110167, 123985]
11327A23985L9102L9021K0885L8580M1562M7594M4489L7873J3941j3790j8406
11316D14836k5264m4253n0115m0642k0210k5613k1815j7726k39M260J9548J6759
11304B09526p750p06l081j3390j0121l274J1488J4447l729O998K2354J9104L1866
11291B73732M9524Q6124J07165J04325P8353K5907j6841k7786p7111q1671p4328
11280D47393o2975m7432m1751q114j1017o495M722J1444K1348L0245K2780j1403
11268C48745l864l717k2295k7764k1976p709q196r103Q449J4238J2126J2639J1737
11255C03310J5079k3679j5272k2366k9141j7961j7349j8828k9667j2102j500J3201
11243A43725J8246J281N271K763j18O339J7002J0362K0401J3650K742J2056J1820
$$ y = [123985, 163087, 202108, 222993, 261573, 303135, 350729, 395218, 433091, 447032, 433242, 414836, 389572, 345319, 295204, 254562, 234352, 208739, 186924, 169198, 168959, 173219, 192767, 209526, 201776, 201070, 197989, 184599, 174478, 171204, 182692, 197139, 193410, 200408, 222762, 241866, 273732, 323256, 409380, 516545, 620870, 699223, 725130, 708289, 680503, 603392, 521721, 447393, 384418, 336986, 295235, 287121, 276104, 269609, 274331, 285775, 307123, 337368, 360148, 348745, 344881, 341164, 318869, 291105, 269129, 261420, 253224, 244121, 252570, 266808, 278934, 291573, 303310, 318389, 294710, 279438, 257072, 227931, 209970, 192621, 173793, 144126, 132024, 130524, 143725, 161971, 163252, 168523, 171286, 171168, 177507, 194509, 204871, 225272, 238922, 241664, 253720, 265540]
11230B65540K958j9129n349j0317l2120j8037j3680p689j0191k5051k2056n553
11218I9326j1051j935k454M183J1986J8353Q979m572l988j0789r872Q53M910l084
11204A00845n227J0935J0046l808N332J3273L0862L1216K5820K2608J2526n54
11192B53874k2274k2563k9716k6378j7511k3682j3925j416L585j0056J36m301
11180H5773r64Q257J4663K300M230N354L686J8936J9998K8345J2247o640J3501
11167B09686L836j9125j2422r261p996j3392k700P958J6327Q310J2958J5196L5430
11154B44805L2906j967k1443j2312j2068p520m707J1206K4451J2491j601K1714
11142B85955K6437o043k8309l0724l187j3304k3749j6984k6130j9019k7120j365
$$ y = [265540, 268498, 249369, 244020, 233703, 201583, 183546, 169866, 162177, 151986, 126935, 104879, 99326, 88275, 86340, 83886, 88069, 100055, 118408, 127387, 122815, 118827, 108038, 98166, 99019, 103929, 100845, 95618, 106553, 116599, 112791, 118123, 131396, 162258, 193474, 219294, 241902, 254428, 253874, 231600, 209037, 179321, 152943, 135432, 111750, 97825, 96409, 99994, 89938, 90074, 85773, 84809, 93066, 107729, 110029, 114259, 119613, 123299, 142235, 162233, 190578, 202825, 196185, 209686, 213522, 194397, 181975, 172714, 164718, 151326, 148626, 156584, 172911, 181221, 194179, 209375, 244805, 277711, 275744, 254301, 241989, 229921, 222401, 217694, 228900, 253351, 265842, 264241, 285955, 312392, 306349, 278040, 247316, 244129, 230825, 207076, 190092, 163962, 144943, 117823, 116458]
11130A16458J6357K9282K563K643J4123j38N470O731L119p077O565J8777J3083
11117B27956N555j9182k4318R115J7942J5444J6152K7890K4545J9369J674o875
11105C15267k6724l5287m3496l7571j5937j0210o544l404q963j4893l009J4578
11093A23807k956M621J89R107n501l159q411j555J874l407R775K359k989P975
11079A31729Q745q056J6364n017j2245j366P765k73n169K166J3459R924q024j5992
11065A34010j508m905L274L179N748K021j6297M555J3439M52k333M43J3159J9667
11051A74904n805j666r052Q08o087j3267m569J824L800R949Q065L211J5597O373
11037A84085N175J4426J6714J72J4093P601j688j396M249K136J2271J6757J4160
$$ y = [116458, 132815, 162097, 164660, 167303, 181426, 181288, 186758, 193489, 196608, 189531, 196096, 214873, 227956, 233511, 214329, 190011, 199126, 217068, 232512, 248664, 276554, 301099, 320468, 322142, 315267, 288543, 253256, 209760, 172189, 156252, 146042, 139498, 136094, 127131, 112238, 109229, 123807, 120851, 125472, 125661, 134768, 129267, 126108, 117697, 116142, 118016, 114609, 124384, 126743, 123754, 131729, 140474, 132418, 148782, 143765, 131520, 130154, 137919, 137646, 132477, 134643, 148102, 158026, 150002, 134010, 132502, 127597, 130871, 134050, 139798, 141819, 125522, 130077, 143516, 143968, 141635, 142078, 155237, 174904, 169099, 167433, 158381, 159189, 153102, 139835, 135266, 137090, 140890, 150839, 158904, 162115, 177712, 184085, 189260, 203686, 220400, 220572, 234665, 242266, 240578, 239182, 243431, 245567, 257838, 274595, 288755]
11024B88755K130l1558k6540n769l459q012L31j334P154K718k071J7049L0462
11011B69856J1025J1508J4785r318P79J521P241L019o735l498J0972J2637J71
10998C23963J759M314N420J849K5167K4867J0430j2764N117J9699n944M833J0280
10985D18990k087R15R486J0594K9133J1847R523R945J4809J3892K0298K6060L1734
10972F05139L8499L2537L0564M3887N5139M9366N3112Q4769R7294J04457J13106
10961A307869J29200J37636J11140J09394J52295K29467L04560L86274N15108
10952C382943O55222Q62632J199784J778798K612839L698042M788164N384306
10944B4362730M913665L232664O75224k001905l985506m939686m830104l918531
$$ y = [288755, 290885, 259327, 232787, 227018, 223559, 215547, 215878, 214544, 221698, 224416, 222345, 239394, 269856, 280881, 292389, 307174, 297856, 298635, 300156, 307397, 310416, 303681, 300183, 311155, 323792, 323963, 325722, 330036, 335456, 337305, 362472, 387339, 397769, 385005, 390122, 409821, 403877, 408710, 418990, 416903, 417818, 427304, 437898, 467031, 478878, 488401, 498346, 513155, 527047, 547345, 573405, 605139, 643638, 676175, 706739, 750626, 805765, 855131, 908243, 993012, 1090306, 1194763, 1307869, 1437069, 1574705, 1685845, 1795239, 1947534, 2177001, 2481561, 2867835, 3382943, 4038165, 4900797, 6100581, 7879379, 10492218, 14190260, 18978424, 24362730, 29276395, 32509059, 33184283, 31182378, 27196872, 22257186, 17427082, 13508551]
10936A3508551k798735j886129j237128p84226m80574k79430j31301r700R8984
10927F000312J94859K30297J98120J58611J66303J70461K65706M38502P09058
10918H532229J082696J563915K095534K666990L261941L806347M378470N022910
10910C2411032N823379O646937O966495O266815M426331J909079o90991k935986
10902F0823091m570692n473690n623553n150511m257675l191890k048432j080612
10894B9426036m20611j51712l00853o00145q40504q35772n75352k10167Q0359
10885B5571279K00324J04335k38170o04708o94855m20937P3008M66901N61626
10876B5018803L43711J2263k61957k87843J09547J018974K431151M025419N218130
$$ y = [13508551, 10709816, 8823687, 7586559, 6802333, 6321759, 6042329, 5911028, 5901328, 6000312, 6195171, 6425468, 6623588, 6782199, 6948502, 7118963, 7384669, 7823171, 8532229, 9614925, 11178840, 13274374, 15941364, 19203305, 23009652, 27388122, 32411032, 38234411, 44881348, 51847843, 58114658, 62540989, 64450068, 63759077, 60823091, 56252399, 50778709, 45155156, 40004645, 35746970, 32555080, 30506648, 29426036, 29005425, 28853713, 28552860, 27952715, 27112211, 26276439, 25701087, 25490920, 25571279, 25771603, 25875938, 25637768, 25033060, 24338205, 23917268, 23990276, 24457177, 25018803, 25362514, 25374777, 25112820, 24824977, 24934524, 25953498, 28384649, 32410068, 37628198]
10867C7628198N376830M352083K562903N44551j097871j911903j687509p04979
10859D5062303N85683J687646K557616K892086K373692J285646m0934j203538
10851E5200200k101515k762548k943882k431945j789654j552991j446899q99899
10843C9270867N3923N11193k47367j641255k823897l591075m023770m024246l524992
10834A9959381k737183j924726j175410n13001O6204O05396J120567J641350K144922
10825A9187500K525044K590298K450475K386046K410187K387777K303095J886136
10817C8126558Q65321n26791j804927k599992k788176k514897k105843j876991
10809B4774262j812098j863038k039329k203789k185602j943252j601928j283142
$$ y = [37628198, 43005028, 47357111, 49920014, 50464565, 49366694, 47454791, 45767282, 45062303, 45647986, 47335632, 49893248, 52785334, 55159026, 56444672, 56403738, 55200200, 53098685, 50336137, 47392255, 44960310, 43170656, 41617665, 40170766, 39270867, 39324790, 39835983, 39588616, 37947361, 35123464, 31532389, 27508619, 23484373, 19959381, 17222198, 15297472, 14122062, 13609061, 13675265, 14280661, 15401228, 17042578, 19187500, 21712544, 24302842, 26753317, 29139363, 31549550, 33937327, 36240422, 38126558, 38991879, 38465088, 36660161, 34060169, 31271993, 28757096, 26651253, 24774262, 22962164, 21099126, 19059797, 16856008, 14670406, 12727154, 11125226, 9842084]
10801I842084j006722p24792m48192k11622k812J85052L35004L97541L84882K87028
10791I037451J57959P1443J10226L54645P96734J421179K314103L492278M719834
10782B2475852N529980N245358L661633J082150j805638m188988n476094n449990
10774B1074263m445630l213236k202747j459634r28249n56597k40246L5671L23624
10765H387219O44480J051665J527060K027098K479540K918076L290669L271389
10757B5597196K678226J763426Q70655J55694k36912j33141J55432J25241l89154
10748C0586663j052146j523825j800639j881212j504168o44809M07745J177450
10740B3765059J371419R13175j04926j257828k120197k531323k514818k225799
$$ y = [9842084, 8835362, 8110570, 7662378, 7450756, 7447944, 7632996, 7968000, 8365541, 8750423, 9037451, 9195410, 9266853, 9377079, 9731724, 10528458, 11949637, 14263740, 17756018, 22475852, 28005832, 33251190, 36912823, 37994973, 36189335, 32000347, 26524253, 21074263, 16628633, 13415397, 11212650, 9753016, 8824767, 8268170, 8027924, 8063595, 8387219, 9031699, 10083364, 11610424, 13637522, 16117062, 19035138, 22325807, 25597196, 28275422, 30038848, 30909503, 31065197, 30828285, 30695144, 30850576, 30975817, 30586663, 29534517, 28010692, 26210053, 24328841, 22824673, 22179864, 22587609, 23765059, 25136478, 26049653, 25944727, 24686899, 22566702, 20035379, 17520561, 15294762]
10732A5294762j778185j280080q24082m35510p9262K47557O09770R96087J336553
10723A4087610J528610J464763J102574N72837L4564k96402k81081r096L49228
10714A8553607N51923M90686K25216o5587k18665j72559O8294L24789L74010J10455
10704B0242169m37436j126305j705526j937273j825047j429474q53971k30782
10696A0696355L66861R00850J223755J269102R84155M58502m8936l55932m08136
10687A5086576k66789q8841p6337m81517j212647j830227k018830j822616j448874
10678E839898j070153p86123n85916m50706l33285k63396k04257j66736j42416
10669A836910j24639j06151q8470p9814q2868n9467n9140o5702p8012n8860k7575
$$ y = [15294762, 13516577, 12236497, 11412415, 10976905, 10897643, 11145200, 11754970, 12751057, 14087610, 15616220, 17080983, 18183557, 18756394, 18790958, 18494556, 18213475, 18204379, 18553607, 19105530, 19596216, 19821432, 19755845, 19537180, 19364621, 19432915, 19757704, 20131714, 20242169, 19804733, 18678428, 16972902, 15035629, 13210582, 11781108, 10927137, 10696355, 11063216, 11964066, 13187821, 14456923, 15441078, 15899580, 15850644, 15494712, 15086576, 14819787, 14730946, 14654609, 14173092, 12960445, 11130218, 9111388, 7288772, 5839898, 4769745, 3983622, 3397706, 2947000, 2613715, 2350319, 2146062, 1979326, 1836910, 1712271, 1606120, 1517650, 1437836, 1354968, 1295501, 1236361, 1170659, 1092647, 1033787, 1006212]
10658A006212m9833m4463l5005k7355k1270n200k560k4639j2320k610k1162l440
10646G56355L002k0786k4600j7936j9392j1875k1118j9983l0438l2511k7444j7251
10634E16023L320k569r800j4555n470q777k031k685m951j2525j0512J107O944
10621D53519l464k572k152R723k456l755k0904j0640j134K954J0784j5843k9981
10608C84079j1623j1601k443N41k680P146J0804J5911L6644M4324M5713L0878
10596E47693j4616n9982l9516k8249k89j2206q069n53K337j5289j2748p890j7146
10583C33477J688K3325J7479l222j5238n959J3471N227k463n26j3023J77R36q187
10569C47162r485P355J304j234M797L818n783p169m026j3639n127J516r774p527
$$ y = [1006212, 956379, 911916, 876911, 849556, 828286, 823086, 820526, 795887, 783567, 780957, 759795, 756355, 759357, 738571, 713971, 696035, 676643, 664768, 643650, 623667, 593229, 560718, 533274, 516023, 519343, 516774, 506974, 492419, 486949, 478172, 476141, 473456, 468505, 455980, 445468, 446575, 453519, 450055, 447483, 445331, 455054, 452598, 448843, 427939, 417299, 416165, 419119, 429903, 414060, 384079, 372456, 360855, 358412, 358953, 356273, 363419, 374223, 390134, 426778, 471102, 516815, 547693, 533077, 473095, 433579, 405330, 405041, 392835, 384766, 384213, 386550, 371261, 358513, 350623, 333477, 335165, 358490, 375969, 372747, 357509, 351550, 365021, 370248, 367785, 367259, 354236, 354413, 355349, 347162, 337677, 345032, 346336, 345102, 349899, 353717, 347934, 340765, 336739, 323100, 317973, 319489, 309715, 302188]
10555C02188J373J3731J783j3092k2045m662J2457K851Q838Q523m909j5283Q177
10542B99930J1001J3195J0737m644j4850L523j3816k2535J7054K3748J2376O233
10530C41952K7945Q765Q839K5540J1275J3365J4378J2523J7499J8905L78j1735
10518D89629j6636k1875j2193j6755k2499j2843n035q562q421R709p131p08J2716
10505C79396O362M837p092q247j0454j5386j3090O686J3782O520P556L000J8866
10492C92736K3482L5396L2729L7972L7624N1702L7279L6233L1940L3717K6366
10481G77176K1j6419j5644l6955l9867m2645k1525K20J4575L2863M7032L8200
10469G37032m83k2857k2002l7243j9671L876L210j187j7038j8429j6217k4159
$$ y = [302188, 303561, 317292, 319075, 305983, 283938, 279276, 291733, 294584, 303422, 311945, 307036, 291753, 299930, 310931, 324126, 334863, 330219, 315369, 318892, 305076, 282541, 299595, 323343, 335719, 341952, 369897, 378662, 387501, 413041, 424316, 437681, 452059, 464582, 482081, 500986, 501364, 489629, 472993, 451118, 438925, 422170, 399671, 386828, 381793, 373231, 364810, 374519, 367388, 366680, 379396, 385758, 390595, 383503, 375256, 364802, 349416, 336326, 343012, 356794, 363314, 370870, 373870, 392736, 416218, 451614, 484343, 522315, 559939, 611641, 648920, 685153, 717093, 750810, 777176, 777197, 760778, 745134, 708179, 668312, 625667, 604142, 604362, 618937, 651800, 698832, 737032, 736549, 713692, 691690, 654447, 634776, 638652, 641862, 640675, 623637, 605208, 588991, 564832]
10457E64832j3614M143q777j884J858L99j2106J111K2600L1117J2681K1252L0219
10444F53831K905k3189k0243j160o681k3443N033J777p859J0044J4466J3238M262
10431F22981p596k3563k7759l6100k3798m023J5684K0946J9149J0248J5725R578
10419E91472R463L564J2111J1745k0236q39J8896J7763m355o141K5639J3367J0851
10406F83300K3654L5629M1393J9217J5010K2654J6699J8431J7411M641Q927J037
10394I08003K179M5371R8890J51611J51043J09109J9346o7297p4958n1098l0916
10383A261283k2056k5348r03J1218P3617J16559J25871J00830J14156J24848J18673
10372A998748J32680J88580K64249L43064L95957L63473L04925L72575O05125
$$ y = [564832, 551218, 555361, 546584, 544700, 546558, 546957, 534851, 535962, 558562, 589679, 602360, 623612, 653831, 656736, 633547, 613304, 612144, 605463, 582020, 587053, 588830, 580971, 591015, 605481, 618719, 622981, 615385, 591822, 564063, 527963, 504165, 500142, 515826, 536772, 555921, 566169, 581894, 591472, 600935, 604499, 616610, 628355, 608119, 607280, 626176, 643939, 639584, 633443, 659082, 672449, 683300, 706954, 742583, 783976, 803193, 818203, 840857, 857556, 875987, 893398, 898039, 906966, 908003, 910182, 955553, 1054443, 1206054, 1357097, 1466206, 1485552, 1418255, 1343297, 1292199, 1261283, 1239227, 1213879, 1212976, 1224194, 1297811, 1414370, 1540241, 1641071, 1755227, 1880075, 1998748, 2131428, 2320008, 2584257, 2927321, 3323278, 3686751, 3991676, 4364251, 4969376]
10363D969376Q63987J102340J203952Q97195L93891L26514P47351J270792J811557
10354A3586955K516579L475421M756504O664142J0053648J6020685K5973008M1096691
10346A24143633N9976015P1284011M5513335k6043473p3197390o5717959m3192046
10339I2766126k6761882j7083612j1383082p876667n588279m026911k949355k115894
10331A4980444j409288p97315l14952p5618l93373j146009j486301j276546r77125
10322G103917q34873p33465o27819n22047l99479k99542k80237k65515k38132
10313B902808k04225j69515j37411q4900p2850q8152j02570q5792r4835q3432
10303A779126o7756m8309k1950O798k3908k4581k2998k3507k8699o4697o8741
$$ y = [4969376, 5833363, 6935703, 8139655, 9036850, 9430741, 9757255, 10504606, 11775398, 13586955, 16103534, 19578955, 24335459, 30999601, 41053249, 57073934, 83046942, 124143633, 184119648, 255403659, 300916994, 274873521, 201676131, 135958172, 92766126, 66004244, 48920632, 37537550, 29660883, 24072604, 20045693, 17096338, 14980444, 13571156, 12773841, 12458889, 12383271, 11989898, 10843889, 9357588, 8081042, 7103917, 6269044, 5535579, 4907760, 4385713, 3986234, 3686692, 3406455, 3140940, 2902808, 2698583, 2529068, 2391657, 2306757, 2233907, 2145755, 2043185, 1957393, 1862558, 1779126, 1711370, 1663061, 1641111, 1647909, 1624001, 1599420, 1576422, 1552915, 1524216, 1459519, 1390778]
10292A390778o3580q1484p6050n5412n8864n6627n1934k4188o56o360j5495k4114
10280H76014l8394k8449k4480p901j5403k3958o113j0336k2955r276j0773j6543
10268F61433j3300p775l5085j8666j9241j7843o924j1755R498j2392k3469l4759
10256D69722j0240J3044K155j4967j3586r280j4964j0577m296o083l787k042p518
10243C87581k0918k1436j2994n809j882l335m112j7973o803J8838K903M600n817
10230C12843J362l657r502j545k461J1462O405N416q525m82K397m396N890Q972
10216C24179o852l137j5638p926Q68k2856j9384j1145N560J3978j592m940L388
10203B54503J39j8559j3964P626Q375J3670J8369K9386M3441N3322L5943K4603
$$ y = [1390778, 1327198, 1245714, 1169664, 1114252, 1055388, 998761, 946827, 922639, 921983, 915623, 900128, 876014, 837620, 809171, 784691, 776790, 761387, 737429, 731316, 720980, 698025, 688749, 677976, 661433, 648133, 640358, 605273, 586607, 567366, 549523, 542599, 530844, 540342, 527950, 504481, 469722, 459482, 472526, 474681, 459714, 446128, 436848, 421884, 411307, 407011, 400928, 397141, 395099, 387581, 366663, 345227, 332233, 326424, 324542, 321207, 317095, 299122, 292319, 311157, 314060, 318660, 312843, 314205, 310548, 301046, 299501, 297040, 308502, 314907, 320323, 311798, 311316, 313713, 309317, 315207, 324179, 317327, 314190, 298552, 290626, 291494, 268638, 249254, 238109, 243669, 257647, 256055, 251115, 254503, 254642, 236083, 222119, 229745, 238120, 251790, 270159, 299545, 342986, 396308, 432251, 456854]
10191D56854M8234N8909K8151m7494l9864k6150j9527n0927n6342m6919l6752
10180B68173l1186j1915k169O90j8625J0N106O187k797p852k568J2737K0937J439
10166B38167j6482r603k5422k1388j2403n226J291k646p539j380O302K9959L4588
10153B08218K5966k105j3481n297j2344J996J3385J5558Q466K036j395m675m867
10140B31461j0389j1315R845J2491Q588J3177Q669J6681J8189L0037L2469L2491
10128C92394L4955L5111K0924j415k831j0499j7446l2552m2890l8747l6091m1534
10116B59379k8166o228R259P011K6125M9819N1779J04932J48889J95142K22365
10105A040306J50224j18702k83913k16401j40074p8610m8830k9535k7417j6230
$$ y = [456854, 505088, 563997, 592148, 544654, 504790, 478640, 459113, 408186, 351844, 304925, 268173, 236987, 225072, 222903, 223593, 204968, 204978, 210084, 216271, 213474, 205622, 203054, 215791, 236728, 238167, 221685, 212082, 186660, 165272, 152869, 147643, 148934, 146288, 138749, 137369, 143671, 173630, 208218, 234184, 232079, 218598, 213301, 200957, 202953, 216338, 231896, 240362, 242398, 241003, 236328, 231461, 221072, 209757, 219602, 232093, 240681, 253858, 262527, 279208, 297397, 327434, 359903, 392394, 427349, 462460, 483384, 481969, 479138, 468639, 451193, 418641, 375751, 337004, 300913, 259379, 231213, 224985, 234244, 241255, 267380, 317199, 368978, 473910, 622799, 817941, 1040306, 1190530, 1071828, 787915, 571514, 431440, 352830, 304000, 274465, 247048, 230818]
10095B30818j641J955j5459k0911O180J0327N111r825M109q013k3548j0370j1964
10082A56769j1668L413l137J0262J1915K1596j285J617p109o182o75o385J2281
10069A81412R368J2986j2598p055N97R839J4769P541N11p04l0013k8063j8658
10056A39932r875m211J681r551L022L197j9313j067J2984O522j4890o404M610
10043A06637Q169l269q051m303P037O424j4187L959j0286o027J288Q830J5456
10030A11677J7259r765j4420J071J5913J109p29q878O944p602L602P365m064m031
10016A15451q962m640j6311j613M081J4467J0158n457j0112j7941j6552j419J6961
10003G8111J9783q477m572J0465j4350q361J8947J5928j5509q622n826j661J1353
$$ y = [230818, 229177, 231132, 215673, 194762, 200942, 211269, 216380, 206555, 210664, 202651, 179103, 168733, 156769, 145101, 148514, 145377, 155639, 167554, 189150, 187865, 189482, 182373, 176191, 175516, 169131, 181412, 190780, 203766, 191168, 184113, 184710, 194549, 209318, 216859, 217370, 216666, 186653, 158590, 139932, 130057, 125846, 127527, 117976, 120998, 124195, 104882, 103815, 116799, 123321, 108431, 102027, 106637, 114806, 111537, 103486, 99183, 106220, 112644, 98457, 102416, 92130, 86103, 87391, 96221, 111677, 128936, 119171, 104751, 105822, 121735, 122844, 122115, 113237, 120181, 112579, 116181, 123546, 119482, 115451, 106489, 101849, 85538, 83925, 88006, 102473, 112631, 107174, 97062, 79121, 62569, 61150, 78111, 97894, 89417, 84845, 95310, 80960, 72599, 91546, 107474, 91965, 83343, 77517, 75856, 87209]
9990H7209r54j4733k773J360J5831J0859O486J1783q168n849n273j2730j151K699
9976H4596Q520m12J856m877p657o113l745p556j5885l896K7315K9285Q641j4177
9962I5895q531N865r16q455q241P082P345j129j4052M513J3386K986P977M635
9948A08360K0692L775j6787P374o09n474j1673l66j002l081n864J5155N068j775
9934A13793J0949J0022R532l231J1131K8027M1681M2086N7781Q2850J43296K02326
9922G50243K69731L06536J90083p5393k84448l09128k09015j32447q4594m0533
9912C81035l5013k2647l0224j5881q456j4591j8937j3372j3235p202k4816k7929
9900A48732j6898j1404j7074p617J0180Q637q144j5980n684P495M672O912m919
$$ y = [87209, 86255, 71522, 68749, 70109, 85940, 96799, 103285, 115068, 106900, 101051, 95778, 83048, 81897, 84596, 93116, 92704, 94560, 89683, 82026, 75913, 72168, 64612, 48727, 44831, 72146, 101431, 110072, 95895, 87364, 93229, 92313, 83858, 75617, 82699, 90044, 88915, 74863, 79376, 92762, 95748, 103725, 108360, 129052, 132827, 116040, 123414, 122805, 117331, 105658, 105292, 104290, 101209, 95345, 110500, 115568, 113793, 124742, 134764, 144296, 141065, 152196, 180223, 221904, 263990, 321771, 404621, 547917, 750243, 1019974, 1326510, 1516593, 1441200, 1156752, 847624, 638609, 506162, 421568, 381035, 346022, 323375, 293151, 277270, 268814, 254223, 235286, 221914, 208679, 201477, 176661, 148732, 131834, 120430, 103356, 95739, 105919, 114556, 106412, 90432, 84748, 92243, 96915, 103827, 98908]
9887I8908Q9O089n01J0064J1667J1448j266q77r089r93m189n284J9223L3820L7179
9872B06288J3968N295J4041R375l1322l3801k6281j5637j1185N220N146l493j192
9859A36422l490p033l650p061j5461o097k084q902O456J2167q719n082J8197J6815
9845A22478n379Q08N306R708p337j2718N6K0002M510n375k418R491K0483J0610
9831A70225j1211r436q121n161N714k0221k2962m765j1768q623o538p473L068
9818F2728Q336o693p46k954M860J4261m907j0672m067k492r644j745N703J1653
9804F3621j0079L19J6403k613l260N633Q246J0478J0948J181j3227Q82n220j2469
9790G0843q048j874J1310L995q630q514j538Q278P976J624O183J923n456k566
$$ y = [98908, 98997, 105086, 104585, 114649, 126316, 137764, 136498, 135621, 126532, 125539, 121350, 116066, 135289, 169109, 206288, 220256, 225551, 239592, 248967, 217645, 183844, 157563, 141926, 130741, 135961, 141107, 137614, 136422, 132932, 125899, 122249, 115188, 99727, 93630, 91546, 82644, 89100, 101267, 92548, 87466, 105663, 122478, 117099, 117907, 123213, 132921, 125584, 112866, 112922, 132924, 137434, 132059, 129641, 139132, 159615, 170225, 159014, 149578, 141457, 136296, 142010, 121789, 98827, 94062, 82294, 73671, 67133, 59660, 62728, 71064, 64371, 63625, 60671, 65531, 79792, 74885, 64213, 60146, 57654, 48010, 46265, 51968, 63621, 53542, 53861, 70264, 67651, 64391, 70024, 78270, 88748, 99696, 100877, 87650, 88532, 83312, 70843, 62795, 60921, 72231, 76226, 67596, 59082, 57544, 65822, 73798, 75422, 81605, 83528, 78072, 75506]
9776G5506Q762O150P433j785l497o406j0078k5261p504J5368M770J479m124j877
9762E8936J0885K719K83K0952m923r095o394j0142j2235k045L545n301m533N113
9748D7765L597J4318J8467n309k0040j4692j1035Q82K1885M773m41l380P286k617
9734F1459j6392O831P629K330J3568L312L423P052J286j2480j269k505j951l140
9720F9153m686P215N694r625m950N828j053O722J7255n822j5802m643Q776J8806
9706I2868L901N147J164J1104P02K92R501P525j4486j8171K528J0285O087l142
9692A15305k32K504R827J2745j721k0080n447N825k218P041L401r395j394k106
9678A14055j6708L783L456m536O082L280J419J0236J1359P792N635n694j18m014
$$ y = [75506, 84268, 90418, 97851, 96066, 92569, 86163, 76085, 50824, 43320, 58688, 63458, 64937, 60813, 58936, 69821, 72540, 72823, 93775, 88852, 79757, 73363, 63221, 50986, 48941, 52486, 47185, 42652, 47765, 51362, 65680, 84147, 78838, 58798, 44106, 33071, 33953, 55838, 60611, 60170, 56790, 64076, 61459, 45067, 51898, 59527, 61857, 75425, 78737, 82160, 89212, 90498, 78018, 76749, 74244, 72293, 69153, 64467, 71682, 77376, 67751, 62801, 68629, 67576, 74298, 91553, 85731, 69929, 65286, 74062, 92868, 96769, 101916, 103080, 114184, 114886, 115178, 124679, 132204, 117718, 99547, 102075, 112360, 118447, 115305, 115073, 117577, 127404, 140149, 138428, 118348, 112901, 118726, 116508, 123549, 126950, 117555, 116161, 114055, 97347, 101130, 104586, 100050, 106132, 109412, 110831, 121067, 132426, 140218, 145853, 140159, 140041, 136027]
9664A36027m179J776L346L024J1573P745j1812n490k060n157l492J7625K1919
9651A70845J1307p174r029j3730r119k4826p767M895Q474J7291L413k231k066
9638A40283o052o609j655m505l805M530P334q549K509L778j0035R321K1156L518
9624A51219O189l762j4782M636m465p544L489M672O936J8852J2587J2191P947
9611A98165J503o530j2764j1072M162o313j1420j797J2033J0145l123l954L319
9598A72354N962N368O223r462M279L593J4165N596j2620J604Q153L701p182j616
9584B00118K250N944Q755J0564K1771K1329Q095Q253R056J2922L0176L4044K5724
9571C99001J5148L8477O7997P5157P5385J07451J24614J32428J66744J95781K29111
$$ y = [136027, 131848, 133624, 136970, 139994, 151567, 159312, 147500, 142010, 139950, 134793, 131301, 148926, 170845, 182152, 174978, 165949, 152219, 143100, 118274, 110507, 115402, 123876, 141167, 144580, 142349, 140283, 134231, 127622, 125967, 121462, 117657, 122187, 129521, 120972, 123481, 127259, 117224, 126545, 147701, 151219, 157408, 153646, 138864, 143500, 139035, 131491, 134980, 139652, 146588, 165440, 178027, 190218, 198165, 199668, 193138, 180374, 169302, 173464, 167151, 155731, 153934, 165967, 176112, 172989, 169035, 172354, 178316, 183684, 189907, 180445, 184724, 188317, 202482, 208078, 195458, 197062, 205215, 208916, 201734, 200118, 202368, 208312, 217067, 227631, 249402, 270731, 278826, 287079, 296135, 309057, 339233, 373277, 399001, 414149, 452626, 520623, 595780, 671165, 778616, 903230, 1035658, 1202402, 1398183, 1627294]
9560A627294L05067M44202O46209R34183J287288J596485J687386J249252L22071
9551A0099437q08919j550270j586611j255590q83868n94851l76107k16916q2604
9542B743701M4266J27865K04266J89748Q4235M179k4145m2904r3614j18675q0265
9531C038657K1948J50314K87222M39688O51873Q94202J144425J295416J199562
9522I123307J031907J121251J523252J830042J796470J730828J828467J610826
9514B1596350Q68167j25317r67976j291418j520998j909821k125754j960664j603603
9505A0958966j317705j072342p97950n88896m86616m17200l05836j33104Q8987
9496E928304K94010M54534N28920N23211O15942Q81314J218069J376679J002632
$$ y = [1627294, 1932361, 2376563, 3022772, 3956955, 5244243, 6840728, 8528114, 9777366, 10099437, 9290518, 7740248, 6153637, 4898047, 4014179, 3419328, 3043221, 2826305, 2743701, 2787967, 2915832, 3120098, 3309846, 3394081, 3398260, 3374115, 3331211, 3237597, 3118922, 3038657, 3060605, 3210919, 3498141, 3937829, 4589702, 5483904, 6628329, 7923745, 9123307, 10155214, 11276465, 12799717, 14629759, 16426229, 18157057, 19985524, 21596350, 22464517, 22339200, 21371224, 20079806, 18558808, 16648987, 14523233, 12562569, 10958966, 9641261, 8568919, 7770969, 7182073, 6695457, 6278257, 5972421, 5839317, 5928304, 6222314, 6676848, 7205768, 7728979, 8344921, 9226235, 10444304, 11820983, 12823615]
9487A2823615J22029n15290l74474K58273J090820K088772L213629M248170M664889
9478B7620433L842847J887655l99915k439136l881923m234519l572794k464164
9470A6358484j407335o45557m41861p22212j027569j090740j022377q96932q02363
9461H301538p92376p65533o18264m24706k30102j2388K14216M25750N76925O80008
9451G355068P10396P45045Q55626J101018J350145J310921Q23808K73311K50127
9442A4775465P14161J154287J190640P84948K18309l38658r08934j583946j982661
9433A4023611j776155j340766j215924j392850j427058j215656r10299o45662
9425D099241m42484k89927j80216p8412j8019K7128O155m8771m4354l1319p5072
$$ y = [12823615, 12945644, 12430354, 12055880, 12314153, 13404973, 15493745, 18707374, 22955544, 27620433, 31463280, 33350935, 32951020, 30511884, 26629961, 22395442, 18822648, 16358484, 14951149, 14305592, 13863731, 13141519, 12113950, 11023210, 10000833, 9103901, 8301538, 7509162, 6743629, 6125365, 5700659, 5470557, 5458169, 5672385, 6098135, 6675060, 7355068, 8065464, 8810509, 9666135, 10767153, 12117298, 13428219, 14252027, 14525338, 14775465, 15489626, 16643913, 17834553, 18619501, 18837810, 18499152, 17590218, 16006272, 14023611, 12247456, 10906690, 9690766, 8297916, 6870858, 5655202, 4744903, 4099241, 3656757, 3366830, 3186614, 3108202, 3090183, 3117311, 3123466, 3074695, 3030341, 2999022, 2923950]
9414B923950j42077j72592j24924n3731K6111J22713K28736L86738N99745Q56370
9404D651039J127352J252521J021827L30564n44913j244069j432633j215725r06936
9395C039027o40683m61717l39125k29027j58498j21165j09447r1912p3075o4326
9385G50052o5313p3576n5522l8483l4039k6645j1236p753p223l0990k6944j8858
9373C53470j2480m357m195l313j361j2750K499n187k0418o765n890j5959q080
9360B55214j0088n548L54j5621m121k863k825J886o792j6622M575J1281p194l808
9346A97828L295l70p586o095J0473P819M823R410o422m907N713j832k933P645
9332B16861q441n155J5697j833m269O402J3526q972n815O51j479j5173j6143o02
$$ y = [2923950, 2781873, 2609281, 2484357, 2430626, 2456737, 2579450, 2808186, 3194924, 3794669, 4651039, 5778391, 7030912, 8052739, 8383303, 7838390, 6594321, 5161688, 3945963, 3039027, 2398344, 1936627, 1597502, 1368475, 1209977, 1088812, 979365, 887453, 814378, 750052, 684739, 611163, 555641, 517158, 483119, 456474, 445238, 437485, 430262, 399272, 372328, 353470, 340990, 336633, 332438, 329125, 327764, 315014, 317513, 312326, 291908, 285143, 279253, 263294, 255214, 245126, 239578, 239932, 224311, 220190, 217327, 214502, 216388, 209596, 192974, 197549, 208830, 201636, 197828, 201123, 200753, 193167, 187072, 197545, 205364, 210187, 219597, 213175, 208268, 213981, 212149, 209216, 216861, 208420, 203265, 218962, 217129, 212860, 219262, 232788, 223816, 218001, 218652, 217173, 202000, 185857, 185255]
9318A85255p046l717J1082O208j6551O936M981j0999J638q948q755n011P618q132
9304A54559Q863j013l9q985j0928m05m890K4002P028m582m934o771n965N290J7899
9289A69129N22p630m866L856l172j4643n889L448O407n243j1750j5211p914j2961
9275I4083l644m045K0613R011j1216l884J2991N860K069O574n718j6355J263j2037
9261I5565K911j947k760J367R555o758r569o922J100J6335L007j7171o317m935
9247G3461k492O625n008l447J1160M325r800j562J4582J1087k4161j0935M749
9234F8584J310k82J7987O988q518o977L245J474L623j7310j5197o540M731L072
9220E6190K076R482N25q868N211M783j2935q376j4782j956M967k070Q32N241L948
$$ y = [185255, 178209, 174492, 185574, 191782, 175231, 182167, 187148, 176149, 177787, 168839, 160084, 155073, 162691, 154559, 163422, 162409, 162370, 153385, 142457, 142052, 137162, 161164, 168192, 163610, 158676, 151905, 145940, 151230, 169129, 169651, 162021, 157155, 161011, 157839, 143196, 137307, 140755, 147162, 141919, 130169, 114958, 107044, 94083, 90439, 86394, 107007, 116018, 104802, 100918, 113909, 119769, 121838, 128412, 122694, 106339, 107602, 95565, 98476, 96529, 93769, 95136, 104691, 97933, 88364, 81442, 82542, 98877, 101884, 84713, 78396, 73461, 70969, 77594, 72586, 69139, 80299, 84624, 74824, 73262, 87844, 98931, 74770, 63835, 68584, 69894, 69612, 87599, 94587, 86069, 79092, 82337, 83811, 87434, 70124, 54927, 48387, 53118, 56190, 58266, 67748, 68273, 59405, 64616, 69399, 56464, 48088, 33306, 31350, 36317, 34247, 35079, 40320, 44268]
9205D4268j162n415j596Q747M572P169l691J740k223o571J17n278j128j1848o45
9190B7056J216K028J3525J6035R431j2684j0897M03J8797O375p836j3007j0518
9177C9924j5580k996K830N922J705J3312l14q36Q978K267o613O731K9K406O729
9162F4494J170l584r011Q812j447p544O254J349O753J0552k140j1124o733Q339
9148F6140N26j734r425m037o237M084J0740K821K378k964j8010p988J9898M392
9134F0584r87J446j5002J3992O781p56q451O143J3346O080J004J4638q199k021
9120H8598Q938K3354J7313J2784Q410l363q696Q4J999j5837j3771l308l794j7110
9106I5601p562j2039j804k644j2376j3648k438K0356J205p025R428J0085K5652
$$ y = [44268, 43106, 37691, 36095, 44842, 49414, 56583, 52892, 54632, 52409, 45838, 45955, 40677, 39549, 27701, 27056, 28272, 30300, 43825, 59860, 69291, 56607, 45710, 46113, 64910, 71285, 63449, 50442, 39924, 24344, 21348, 24178, 30100, 31805, 45117, 44803, 43967, 52945, 55212, 48599, 55330, 55359, 57765, 64494, 65664, 62080, 53069, 61881, 60434, 52890, 59144, 60493, 67246, 77798, 75658, 64534, 57801, 66140, 66666, 64932, 55507, 51470, 45233, 49317, 60057, 62878, 65256, 62292, 44282, 36294, 56192, 60584, 59597, 61043, 46041, 60033, 66814, 66058, 57607, 63750, 77096, 83176, 84180, 98818, 90619, 88598, 97536, 120890, 138203, 150987, 159397, 156034, 147338, 147422, 149421, 133584, 119813, 116505, 112711, 95601, 88039, 76000, 74196, 71552, 59176, 45528, 43090, 63446, 64651, 57626, 67054, 77139, 102791]
9093A02791J4481j2275p09q279j3218q637m724M571R815J9904J4843K0695J9599
9080A58857K5541K0162R19k45j3642j2312r556j9642k0832n303J34N0j7583j7952
9066H8596p672r729J0843k633l006p832r200q64j7701J307J5805q48O992J1051
9052G5109L745q899n926M2J3492J0990J0535K2130j0558k149J3239k054R613N760
9038A35069k0620L68Q64k00k0503j9154J704j4307j0378O009o010J103j3408m04
9024D0133p571J0073j769N52L71R940L366j0087j5802l204j569p565J689J1625
9010C0182L916j783l611j824J4507J1231M987J7181K913p533j2368J498j7759
8997D1537n050p569L149m387l921N226L230M993R92j5467q486q746m429N650J2113
$$ y = [102791, 117272, 104997, 104288, 96009, 82791, 74154, 69430, 74001, 83816, 103720, 118563, 139258, 158857, 184398, 204560, 205479, 205234, 191592, 179280, 169724, 150082, 129250, 123947, 124081, 124131, 106548, 88596, 80924, 71195, 82038, 79405, 76399, 68567, 59367, 58503, 40802, 42109, 57914, 57066, 64058, 75109, 78854, 69955, 64029, 64071, 77563, 88553, 99088, 121218, 110660, 108511, 121750, 119696, 129309, 135069, 114449, 114817, 115681, 115481, 94978, 75824, 77528, 63221, 52843, 58852, 52842, 53945, 40537, 40133, 32562, 42635, 40866, 41418, 41789, 51729, 55095, 45008, 29206, 26002, 24433, 16868, 18557, 30182, 34098, 32315, 28704, 26880, 41387, 52618, 57605, 74786, 77699, 70166, 57798, 59296, 41537, 36487, 28918, 32067, 27680, 23759, 28985, 32215, 37208, 38200, 22733, 14247, 5501, 1072, 6722, 18835]
8982A8835J9223N487J70k185j4017N445n238J364P761J3209o402l469j5192j8675
8968F316l454M27K310j568K9557P076q085j6586K858O151N700Q802l801n927n137
8953B4639k399J1037J3812J5294l749p742J544J2392J976j8083L380P144j307
8940E7938O915Q58J9023J8045L4665O5476R4565J42630J53965K5116j42023j54022
8928C23151j00775n4273m3514k6412O744k7094j3940j0212K265k626j1843Q400
8916D9871o6j390l949p780M429l241M68p989j2524j4656r23O802Q439O625l467
8901B0649L411P538J0197j1333m214oO256J0520M75j1470j93J4752o259n926k059
8886C2338J5295M459Q356R208Q667J2025K5846K9529O4379L1119l6122l6339k8471
$$ y = [18835, 38058, 43545, 43715, 41530, 27513, 32958, 27720, 29084, 36845, 50054, 43652, 40183, 24991, 6316, 2862, 3289, 5599, 4031, 33588, 40664, 32579, 15993, 18851, 25002, 30702, 39504, 35703, 29776, 24639, 22240, 33277, 47089, 62383, 58634, 50892, 52436, 64828, 66804, 48721, 52101, 59245, 57938, 64853, 65711, 84734, 102779, 137444, 202920, 297485, 440115, 594080, 619196, 477173, 323151, 222376, 168103, 124589, 98177, 104921, 77827, 63887, 53675, 55940, 53314, 41471, 49871, 49805, 48415, 44466, 36686, 41115, 37874, 38342, 30353, 17829, 3173, 2250, 9052, 17491, 24116, 20649, 24060, 31598, 41795, 30462, 26248, 26242, 32498, 43018, 43493, 32023, 31830, 46582, 40323, 34397, 32338, 47633, 52092, 60448, 69656, 78323, 90348, 116194, 145723, 210102, 241221, 205099, 168760, 140289]
8873A40289j2838p663j952Q820K4403K8370K717K4272M1022O1904J27145J76621
8861F13110K71162M80725P03496P35865P7146p38252p79867m65745k63004j60548
8851D74088j06806o9897l6312j9505j1926k5023J7452j768k7071l7644j1843j1355
8839A32390j4669j0549j3852q480j2865n361O266L756Q920l784j2987j52P658
8826G6291J1632N727J1078P099m44P973o352m808o286q44l410j4868o782l480
8812G2526k212K525j0853n755q57m419j5858j0164K263m140j1528K893J192m653
8798A0960R032O523O043N747k2155J299K4014J1631j1197j764J02j1044p846M020
8784B5365j3237N113J7558p872r322P766Q467j4309j2199K789J02j779O418L882
$$ y = [140289, 127451, 119788, 117836, 126656, 151059, 179429, 182146, 206418, 247440, 309344, 436489, 613110, 884272, 1364997, 2068493, 2804358, 2881504, 2143252, 1363385, 897640, 634636, 474088, 367282, 297385, 261073, 241568, 229642, 204619, 222071, 220303, 193232, 155588, 143745, 132390, 117721, 107172, 93320, 84840, 71975, 66614, 72880, 76636, 85556, 81772, 68785, 68633, 76291, 87923, 93650, 104728, 111827, 111383, 119356, 113004, 108196, 101910, 101066, 97656, 82788, 76006, 72526, 70314, 72839, 61986, 56231, 55374, 50955, 35097, 24933, 27196, 23056, 11528, 14421, 15613, 10960, 19992, 26515, 32558, 38305, 16150, 17449, 41463, 53094, 41897, 40133, 40235, 29191, 21345, 25365, 12128, 17241, 34799, 26927, 17605, 25371, 33838, 19529, 7330, 10119, 10221, 8442, 14860, 18742]
8770A8742r623j649Q450L421q334M512k820p386n676j3255L408K1280L772j0739
8756D103J2058J5895J0462J212l627j1908k408O256L779n759n286K840p088R729
8742C0258J0430M77J8386j515j1475j1841Q733o75k249k065k982j5862m275J1973
8728B7318N888J676j568M951l922J275j716n566P691o499l012M195j2438q155
8714A0118P804l866q850j0301Q799j035J3175M450L341N461J225O681R260p031
8700C9231j6896j1534q648l527K4401K4305O595r371j4862K167p635q826N576
8687B0976L97j2814j4913N478K6193L271K803L041j1203j0247O324L673l268N042
8673B4753K224M518p032J217o673o742r977p176P934M931K021L186l17q319J0758
$$ y = [18742, 9119, 7470, 15920, 19341, 11007, 15519, 12699, 5313, -363, -13618, -10210, 11070, 14842, 4103, 16161, 32056, 42518, 43730, 40103, 28195, 25787, 32043, 35822, 30063, 24777, 27617, 20529, 30258, 40688, 41165, 59551, 58036, 46561, 34720, 43453, 42778, 40529, 38464, 35482, 19620, 15345, 27318, 33206, 34882, 33314, 38265, 34343, 35618, 33902, 28336, 36027, 29528, 26516, 30711, 18273, 10118, 17922, 14056, 5206, -5095, 3704, 2669, 15844, 20294, 23635, 29096, 30321, 37002, 46262, 39231, 22335, 10801, 2153, -1374, 23027, 47332, 53927, 44556, 29694, 31861, 24226, 15400, 20976, 21373, 8559, -6354, -876, 25317, 28588, 31391, 34432, 23229, 12982, 19306, 22979, 19711, 24753, 26977, 31495, 24463, 25680, 19007, 12265, 2288, -4888, 3046, 7977, 9998, 13184, 12867, 4548, 15306]
8658A5306J2030l709j5837P51R141N796J5367M971K637K990l763J260N848N116
8644E7904j6975k927L18M871M647j9750K468L226o140M631K197j1366o030P264
8630B4338k389k278N890K844P877N223J3345K3553K2273K0854M0073M7933O865
8617B16401m7413n3253j2930k1099k9430j0948j609O408m146J619j984n452j6781
8604A9383L580J9638k211q622J824l828k372Q421J678K249P920r877K626M682
8590D5091N338q26J0997K0424Q971l30J8511L99J5261Q643Q076J1170J5845K801
8576A70371k060J720j0518j3058k841K931p293j3643L245J3725K5296L8432O7786
8563B74093R1144Q5108j701r2012r6897o3765l9174k9625j4294r118p417M804
$$ y = [15306, 27336, 23627, 7790, 8541, 17682, 23478, 38845, 43816, 46453, 49443, 45680, 46940, 52788, 57904, 40929, 38002, 38320, 43191, 47838, 28088, 30556, 33782, 27642, 32273, 34470, 23104, 17074, 24338, 21949, 19671, 25561, 28405, 36282, 41505, 54850, 78403, 100676, 121530, 161603, 209536, 216401, 168988, 115735, 102805, 81706, 52276, 41328, 39719, 46127, 41981, 43600, 41616, 36164, 19383, 22963, 42601, 40390, 31768, 33592, 29764, 27392, 35813, 37491, 39740, 47660, 37783, 40409, 45091, 50429, 49603, 60600, 81024, 89995, 89665, 108176, 108575, 123836, 132479, 140555, 151725, 167570, 170371, 168311, 170031, 159513, 146455, 143614, 146545, 139252, 125609, 128854, 142579, 167875, 206307, 274093, 365237, 450345, 448644, 356632, 259735, 195970, 156796, 127171, 112877, 103759, 96342, 101146]
8551A01146p441n169q320k737j0782J821R368j1989k1610q625J1801O869K383
8538E6715q875m610p859N118m467p789J4872P256J688N821l871j3260M099L332
8524D8170L218K6701K7393M4817P7746O0745L9254j5177o5000p4072l1418l7319
8512A05058k0354j2607j389r443L350K087q090j7921L562J4807p560p080K546
8499D6966j1823m36j487l660N743j301j1580m445j485M704L619l199j1593J7655
8485B7678Q461l249R196j5101K633m520p488R004L993q50r243l65J122R47L032
8470B5250k637k580J3838k072n659n364J0505O347p136j949J463L314k767p910
8456B2643j0636L975N098l522r608N76O164J621J2702M834j1873m021J0097J2505
$$ y = [101146, 93705, 88536, 80216, 77479, 66697, 68518, 77886, 65897, 44287, 35662, 47463, 54332, 56715, 47840, 43230, 35371, 40489, 36022, 28233, 43105, 50361, 52049, 57870, 53999, 40739, 44838, 48170, 51388, 78089, 105482, 150299, 228045, 288790, 328044, 312867, 247867, 173795, 142377, 105058, 84704, 72097, 70708, 61265, 64615, 66702, 58612, 40691, 44253, 59060, 51500, 44420, 46966, 35143, 34707, 33220, 29560, 35303, 34002, 22422, 17977, 16492, 21196, 24815, 21616, 10023, 27678, 36139, 32890, 42086, 26985, 29618, 25098, 17610, 26614, 30607, 29757, 20514, 20149, 21271, 22218, 25250, 22613, 20033, 33871, 31799, 26140, 20776, 31281, 37628, 30492, 28543, 30006, 33320, 30553, 22643, 12007, 15982, 21080, 17558, 7950, 8526, 14690, 16311, 29013, 33847, 21974, 17953, 28050, 40555]
8442D0555r743l717m328j146L635N337n631m501j271J0923P15r649q486m80o315
8427E898k122R206P539j073J6437j1840j8655J4856k770J0009r508p559o688L178
8413F908J1102k433m641Q861m49J0056Q15O33l76k430p12j840j9168P735J1897
8398B5958K1476L388j1686l053j1817R386o81j2349j1382n626m2K172J1908K235
8384A9887q768j2213M479O215p94o07P304P261J895l065l795M238M527j525j3409
8369A1630n910J0859J9197J025r132j831R451J8M718M047p173l494p731j4447
8355A1227M632J4375r856j2838k804r73m553l436j2782R97J5122P361l233q392
8341e153O133O598J5698J1853q048p12q891j4304N682Q380l159o387l954J0866
$$ y = [40555, 30812, 27095, 22767, 21621, 25256, 30593, 24962, 20461, 19190, 30113, 30828, 21179, 12693, 12213, 5898, 3776, 12982, 20521, 19448, 35885, 24045, 5390, 20246, 17476, 27485, 17977, 10418, 3730, 6908, 18010, 15577, 10936, 19797, 19348, 29404, 30219, 30852, 30476, 28046, 27334, 25494, 6326, 14061, 25958, 47434, 50822, 39136, 36083, 24266, 33652, 32971, 20622, 9240, 3614, 3572, 5744, 17652, 19887, 11119, -1094, 3385, 9600, 8806, 8199, 15503, 22764, 24659, 21594, 17799, 22037, 26564, 25039, 11630, 5720, 16579, 35776, 36801, 27669, 25838, 35289, 35307, 40025, 44072, 36899, 33405, 25674, 11227, 15859, 30234, 20378, 7540, 4736, 3763, -790, -4226, -17008, -16011, -889, 6472, 3239, -5153, 980, 7578, 23276, 35129, 27081, 26369, 17478, 3174, 8856, 17236, 14077, 7690, 3736, 14602]
8327A4602O856n782n715N082m00O297k873j528j475M311n030m645R982Q05j232
8312A9255m867m958q719P29J0887L74j0059j846J2931J9911j2417r593K76R115
8298B1019Q717P067J2946J477q819M19j5456k1088Q963L691K085j38Q166O645
8284C5694L340j4001L483N663l078p926j4292j926L628R46J6719J6188J4952J4784
8270G4174N087L671j1332j4914j0105j5596j0843r477j2788j1010l699N737K1520
8257A0425N777P725n974n519M44n851J6439J0508j3884j1205n69J8077J5736k392
8243C9737n695j0218m121o582P725N174o765j0447Q217J5807l169o850j0538p173
8229E102o46M127J4886Q015N651O858m35o941M301r614K1005J2402N201n322j9009
$$ y = [14602, 21458, 15676, 9961, 15043, 14643, 20940, 18067, 16539, 15064, 19375, 14345, 9700, 19682, 20487, 19255, 14388, 9430, 711, 1440, 12327, 12701, 2642, 796, 13727, 33638, 21221, 11628, 11904, 21019, 29736, 36803, 49749, 51226, 42407, 42826, 27370, 6282, 15245, 18936, 21021, 20883, 29049, 35694, 39034, 25033, 28516, 34179, 31101, 23175, 8883, 6957, 10585, 11531, 28250, 44438, 59390, 74174, 79261, 82932, 71600, 56686, 46581, 30985, 20142, 10665, -2123, -13133, -16832, -11095, 10425, 16202, 23927, 17953, 12434, 12878, 7027, 23466, 33974, 20090, 8885, 8316, 26393, 42129, 39737, 34042, 23824, 19703, 13121, 20846, 26020, 19255, 8808, 17025, 32832, 29663, 22813, 12275, 5102, 4456, 8583, 23469, 31484, 37135, 43993, 43558, 36617, 40918, 31304, 52309, 64711, 69912, 64590, 45581]
8214D5581k0945p055k815J4417J976o095k803j391k977R566k845N651l66j5598
8200A4301p991Q905J748J1749J525j0347k076J1623j867q343j880P748M947L464
8186C3506j9312r580J4554J3742J3788j8330p920K805m747N491j5246j5000j2883
8173a9132P241N716R298o10l990l961l646M225N764j0189J267J1291n305n233
8159g264N85P788K75j834J8449k518M603o420L241P511q424K894R966L092M800
8144C6744n443m564l997l581k263M413p195l609n479l239O263N263j0240l528
8130d55M111N781R009R232N357q41O412J0317M791r568J193O283l202n680p259
8115C5481o419q604N847L690k754K019q331n791m781K131K317J653K19k3k004
$$ y = [45581, 24636, 17581, 14766, 29183, 31159, 25064, 22261, 20870, 17893, 27459, 24614, 30265, 29899, 14301, 6310, 15215, 16963, 28712, 30237, 19890, 17814, 29437, 27570, 19227, 17347, 25095, 30042, 33506, 14194, 4614, 19168, 32910, 46698, 28368, 20448, 23253, 18506, 23997, 8751, -6249, -19132, -11891, -6175, 3123, 2513, -1477, -5438, -9084, -4859, 905, -9284, -8017, 3274, -2031, -7264, -6679, 1109, 1384, -450, 17999, 15481, 20084, 13664, 16905, 24416, 15992, 18886, 28852, 31944, 36744, 31301, 26737, 22740, 19159, 16896, 21309, 14114, 10505, 5026, 1787, 8050, 13313, 3073, -455, 3656, 9437, 18446, 27678, 33035, 32194, 38606, 48923, 53714, 44146, 45339, 51622, 48420, 42740, 35481, 29062, 20458, 26305, 29995, 27241, 29260, 20929, 15138, 10357, 12488, 14805, 16458, 16677, 16654, 14650]
8100A4650k003k671L84L582l233J3962J2320L745j8044k565m860j859n163j503
8086F742J1610R539j177l219L022K467n908o549l459m749K740o090j901j449K070
8071C689Q151p124Q121o399L247k564K383N187J280o798k754o45Q663l20k95R60
8055A4782J2875j2330k3656J0810P959j2798K186Q352R675J297K854q069M225
8042A8162j153n713O070N502M271q346j1931m889Q511l607P937K538L479K1003
8028D1834P530q815J123N429j6069r089j917M654L534O450j684N620q922l315
8014B6363Q380m171R33r411L649R233l366k164j3486J232J5730m064p81q390k0269
7999e82p11K5759L999L986J0296k575k457m265M791j0869o009m61m013J8539L38
$$ y = [14650, 12647, 9976, 10360, 13942, 10709, 24671, 36991, 40736, 22692, 20127, 15267, 13408, 8245, 6742, 18352, 27891, 26714, 23495, 26517, 28984, 23076, 16527, 13068, 8319, 11059, 4969, 3068, 1619, 3689, 11840, 4716, 12837, 6438, 9685, 7121, 9504, 14691, 15971, 9173, 6419, 5774, 14437, 14117, 13822, 14782, 27657, 15327, -8329, 2481, 10440, -2358, -172, 8180, 17855, 19152, 22006, 13937, 18162, 17009, 11296, 17366, 22868, 27139, 18793, 6862, 1973, 10484, 6877, 14814, 17352, 20831, 41834, 49364, 40549, 41672, 47101, 31032, 21943, 20026, 24680, 28214, 34664, 32980, 38600, 29678, 26363, 34743, 30572, 31505, 22094, 25743, 34976, 31610, 29446, 15960, 17192, 32922, 28858, 28077, 19687, -582, -1293, 24466, 28465, 32451, 42747, 40172, 37715, 33450, 38241, 27372, 21363, 20902, 16889, 35428, 35766]
7984C5766j4773l052Q468m660O89J1192M473M921o584m305J5017J2227q408j2027
7970C8944n798l940n964L19l729o599P914k879K284K314l965j5768N24O597n343
7955D911M373j308k279J3127J1089n228J3004N255j724j0826j2709J435M035L259
7941B6414O536K819P338M278j3278j8047j1965L760O172M687j210O847k455k807
7927A9089P820J6324m606k2918j0713l391J4089J1596m674n963P893L693Q204
7914C6443q291j1845m226m004m74L540L026L778K888M789p926o510K038J362r79
7899A3609J688m565L338J040j2821p044R231R45O781J4961O949m089j0475M852
7885B4400j3198k321R614o875K917N375q009k692j64M748L105R482J2871J31n531
$$ y = [35766, 20993, 17941, 26409, 21749, 22438, 33630, 38103, 43024, 36440, 32135, 47152, 59379, 50971, 38944, 33146, 29206, 23242, 23561, 19832, 13233, 21147, 18268, 20552, 22866, 18901, 3133, 3657, 10254, 4911, 9284, 7976, 5697, 18824, 29913, 24685, 37689, 42944, 41220, 30394, 17685, 19120, 23155, 26414, 32950, 35769, 43107, 47385, 34107, 16060, 4095, 7855, 14027, 18714, 17504, 24351, 21896, 19089, 26909, 43233, 38627, 15709, 4996, 1605, 15694, 27290, 22616, 16653, 24546, 28239, 36443, 28152, 16307, 12081, 8077, 7603, 11143, 14169, 17947, 20835, 25624, 17698, 11188, 13226, 14588, 13609, 15297, 10732, 14070, 15110, 2289, -4755, 4476, 5421, 12202, 27163, 34112, 30023, 19548, 24400, 11202, 8881, 18495, 11620, 14537, 19912, 11903, 9211, 9047, 13795, 16900, 26382, 39253, 39384, 33853]
7870C3853l922j558j2393r620R258l619j0889K028R352J6185Q807j3169j731r064
7856A3518j9534m41R745M278R350L000j739o625J3939R333R018j501k0849j5160
7842F332L330P396n35j6932o288j199p261P320J0074j2610P783J0616M219R633
7828B1878q228k1393q960O688OL537M672K0835p514k3007p71m468K024O751l609
7813a1559L787J0924P314N500O074r304K516M52j2299j207J1011p454O77l390
7799C042J2017p39r128k1744J1561K4270k994j5697O424J847o750Q819R037j3224
7785F741k470N590n941q209j727k014L23k844K4889J8146j1708p150L068q610
7771H084M626n378m029k773J197R03m356p106j0568K8j38R665K0181k847n449
$$ y = [33853, 29931, 28373, 15980, 6360, 15618, 11999, 1110, 3138, 12490, 28675, 37482, 24313, 22582, 13518, -6016, -6457, 3288, 7566, 16916, 19916, 18177, 11552, 25491, 34824, 43842, 42341, 21492, 6332, 9662, 17058, 16523, -409, -6697, -7896, -15157, -7837, 2237, -10373, -2590, 8026, 12245, 21878, 13650, -7743, -16703, -10015, -10009, -6472, -1800, 19035, 11521, -11486, -12257, -16725, -14701, -7950, -11559, -7772, 3152, 10466, 15966, 22040, 12736, 15252, 15704, 3405, 2198, 13209, 5755, 6432, 3042, 15059, 14320, 5192, -16552, -4991, 19279, 16285, 588, 7012, 8859, 2109, 10928, 19965, 6741, 4271, 9861, 3920, -4289, -6016, -8030, -7707, -10551, 14338, 32484, 20776, 13626, 16694, 8084, 12710, 7332, 3303, 530, 1727, 2630, -1726, -8832, -19400, -19372, -19510, -9845, 10336, 7489, 2040]
7756B040J229M450k875M2m989o864L357l907m618M496N673m47j2579k135J5612
7741a515o347j5192P195L7285K413k1327J0913J2707m935j5913J0230J4374P745
7728C7633j2347n434K666M486K211p889j6093q940j093J2556n730j0337o874J1862
7714c323J1819M750K747K560r357j1070P86J2486J154o99l920n277R566N111M374
7699B1707r869p156o95N678N567o759L69J0299J8149O182k4122n530q419o143
7685g42K335m865j1005N53J4195j82P968Rj4950q77k944Q200R348j754l228J5660
7669A7721J728O384j3786n155R888o176r226j1101P94l087L228J4266J0510j131
7655A4857n778p516r18R560J6946p99j6405q906l785J209J7821k585j3380p620
$$ y = [2040, 3269, 7719, 4844, 4886, -103, -6967, -3610, -7517, -12135, -7639, -1966, -2413, -14992, -17127, -1515, -7862, -23054, -15859, 21426, 23839, 2512, 13425, 26132, 21197, 5284, 15514, 29888, 37633, 25286, 19852, 22518, 27004, 29215, 21326, 5233, -3707, -4800, 7756, 2026, -8311, -15185, -3323, 8496, 13246, 15993, 18553, 9196, -1874, -1088, 11398, 12552, 11853, 7933, 2656, 12222, 17333, 21707, 11838, 4682, 3987, 9665, 15232, 8473, 8842, 19141, 37290, 43472, 19350, 13820, 5401, -742, 1593, -3272, -14277, -13724, 471, 289, 8257, 8266, -6684, -7561, -10505, -2305, 7043, 5289, 2061, 17721, 19449, 25833, 12047, 6892, 16780, 10604, 1378, -9723, -8929, -12016, -8788, 5478, 15988, 14857, 9079, 1563, 645, 10205, 27151, 26352, 9947, 1041, -2744, -1535, 16286, 13701, 321, -7299]
7641g299j414M138K670q656j4687K1829K2113N134j4162j7575n906k764J0593
7628e986N778p278n788p233n306M128K3013L093N66q25n388J572L799p238n160
7613h253o452N929J6419j1451j4083J875J3778O787R44p237j772O282r63k746
7599i43j8322p104J0986K0469J2305j2708o894q269J8578J3589m39q754K388L850
7585A8732J751r93q644Q718l837j6076P249J8930m220K639M706j2423j4836n28
7571A168j7554O147L789k088l895m547M675J3444P572o616m246m746n170L92j0362
7556b2037m549K058J5211J6066j0792j4075p288p087J060R423J9765m820O51L050
7542c364M062N247P714L754j772n098J0164n039j2033M64J416K875J6169q35j3009
$$ y = [-7299, -8713, -4575, -1905, -10561, -25248, -3419, 18694, 23828, 9666, -7909, -13815, -16579, -5986, -208, -7486, -13274, -20507, -25813, -21685, 1328, 4421, 4987, 4162, -1226, 346, 4145, -3093, -8253, -14705, -8776, 7643, -3808, -17891, -16016, -2238, 4549, 5493, -1744, -3516, 2766, 1803, -943, -19265, -26369, -15383, 5086, 17391, 4683, -2211, -10480, 8098, 21687, 21248, 12494, 14882, 18732, 20483, 19490, 10846, 19564, 15727, -349, 6900, 25830, 21610, 24249, 28955, 16532, 1696, 1168, -16386, -10239, -6450, -8538, -12433, -16980, -12305, 1139, 8711, 2095, -2151, -6897, -12067, -11675, -22037, -26586, -24528, -9317, 6749, -4043, -18118, -25406, -32493, -31433, -22010, -2245, -7065, -6414, -3364, 698, 5945, 13659, 17413, 15641, 10543, 20707, 15668, 3635, 4099, 5515, 8390, 24559, 23724, 10715]
7527A0715l047p123P88j100J5428J14q057k265n140L358M861O04p868r62J2458
7512A2764k726q559p563J6312l80m839l530p114N021J8059n122j3967j082o688
7498i414K846J5704r159k957N338j086n309J0513P044J1753o510q419n939P580
7484A1985M223o086j5917K288L353J0065O726k389j9226k279n289j4400J5214
7471a1732J4297j40M951k904J84K769j1854k316J0931j0856o378O860J460j1818
7457a6546j2087K099L241j826L375Q494J5472k531j7512j5551r27J7177J1033
7444f089r242l070J6490P905N199l308O385P60k165r981k3633J950J6413L126
7430G40J5709N278q364P97k248O292l661K536o895j597p810j2701N368K42J953
$$ y = [10715, 7668, 545, 1333, 233, 15661, 15775, 7718, 5453, 313, 3671, 8532, 9136, 1268, 306, 12764, 10038, 1479, -6084, 10228, 9848, 5009, 1479, -5635, -614, 17445, 12323, -1644, -2726, -9414, -6568, 9136, -23, -2980, 2358, 1272, -4037, 6476, 13520, 25273, 18763, 10344, 4405, 11985, 16208, 10122, -5795, -3507, -154, 9911, 16637, 14248, -4978, -7257, -12546, -26946, -11732, 2565, 2425, 7376, 4472, 4656, 7425, -4429, -6745, 4186, -6670, -13048, -6188, -4728, -16546, -28633, -26534, -23293, -25119, -21744, -13250, 2222, -309, -17821, -33372, -34299, -17122, -6089, -15331, -18401, -1911, 5994, 11193, 7885, 14270, 15030, 12865, 2884, -20749, -18799, -2386, 740, 16449, 21727, 13363, 14160, 11912, 18204, 14543, 17079, 10184, 8587, 777, -11924, -6556, -6314, -4361]
7415d361J3361J355r341O578j0879q281J4481K979m571q463N822k068L97M454
7401A463L05K31O854J2838j3199j8452K955J7874q81K667J2831j6351j1093l609
7387e567j1979K399N96M209N197P669l244o186l19K3229N708M584L621j3831p783
7372H303Q498Q028p501m696q913k56l435q504n526j3433n544m009P202J523J1629
7357a6634P327Q16R483j176J1801J0988j1078j1933O667n910O87R622M1L504o141
7342H064k06j424J2516J0539J470r390J837M238j3329P75N385q89k079m346j658
7327A1503N497J3695k5935j2012L293o210J878j34l908p073O83J735L232J589
7313a2167j731M266J0239P175n508L137j501K250l279k1044l961M456j362J1021
$$ y = [-4361, 9000, 10355, 1014, 7592, -3287, -11568, 2913, 5892, 1321, -7142, -1320, -3388, -2991, 1463, 1768, 1999, 8853, 21691, 8492, -9960, -7005, 10869, 9988, 12655, 25486, 9135, -1958, -5567, -17546, -15147, -14551, -10342, -5145, 2524, -720, -6906, -7225, 16004, 21712, 26296, 29917, 16086, 8303, 16801, 24829, 17328, 12632, 3719, 3463, 28, -8476, -14002, -27435, -32979, -36988, -29786, -28263, -16634, -9307, -8491, 992, -184, 11617, 22605, 11527, -406, 6261, 351, 1038, 10660, 10701, 14205, 8064, 7858, 6434, 18950, 29489, 30959, 21569, 23406, 27644, 14315, 15090, 20475, 19586, 17507, 13161, 11503, 17000, 30695, 4760, -7252, -3959, -10169, -8291, -8425, -12333, -19406, -18723, -16988, -13756, -12167, -13898, -9632, 607, 7782, 2274, 5411, 3910, 6160, 2881, -18163, -22124, -17668, -19030, -8009]
7299h009Q145R554P672n113j7009J6187P945j0315j2460J660J4011m250m49K625
7285A0194N6M724P378l737J506o100j9735J663K463K308Q929M096l594j6138q959
7270a4946n73l534N673j0550m915J8640Q183n250N422Q607p592j1382O417J1953
7256F153m5j5972j4023K983J5254R235K34J04n618N813L760L42k0485r076J2001
7241i340N848q758J0593l95R981O228m495j868l343J5696N67o262j4438r736N676
7226d046J1806J2984l330j1034j4232k195R570R397j108m717m791J970n778k530
7212h034O287k181o039l004Q230J3145r472N154J0131j0241P880M074m205j0118
7198A607j8950M066j193R305j3443o669J1382L370J0199K541L255p13J0250N271
$$ y = [-8009, 136, 9690, 17362, 12249, -4760, 11427, 19372, 9057, -3403, -1743, 12268, 8018, 7569, 10194, 10250, 14974, 22352, 18615, 20121, 14021, -5714, -4051, -1588, 720, 9649, 13745, 10151, -5987, -14946, -15519, -19053, -13380, -23930, -28845, -10205, -2022, -7272, -1850, 6757, -835, -12217, -5800, 6153, 6108, -9864, -23887, -20904, -5650, 3585, 3819, 3923, -1695, 4118, 7878, 8220, -12265, -21341, -9340, -3492, -12250, -1657, -2052, 7929, 14157, 9662, 7794, 4451, 20147, 20714, 14452, 14, -9722, -4046, 7760, 20744, 17414, 6380, -7852, -10047, -477, 8920, 7812, 3095, -1696, 274, -5504, -8034, -1747, -3928, -9967, -12971, -4741, 8404, -1068, 4086, 14217, 3976, 11856, 15930, 11725, 1607, -17343, -13277, -14470, -5165, -18608, -25277, -13895, -10525, -326, 2215, 5470, 4757, 15007, 20278]
7184B0278k492m200j4237k847P752n543O250n669j9000j298l078l474N945P758
7170a3855K419J0095j461n558O390J2099l591j064J5694P064N294r366j702k0024
7156B434m862N293l258r415k255l322J2150L370o711J6103J3033j0254j4152j460
7142c306l825J7872J3562M449l491j3385j0312j939q74q257j2809N19L337P489
7128a0970m264n542J2688n994q025q842O70m54k612J3758J9745N215j0190p114
7114a1931M394n240o333j0988k369K4984J0954J284l49j9826l663J3079l884J2596
7100B708m901j9036l674J4232L920o965J08K309R115j329m54M368n214j0820q868
7085b4501j2219J6009n32P858N142J3043k93j2989M053N706K365P98j4059k996
$$ y = [20278, 17786, 13586, -651, -3498, 4254, -1289, 4961, -708, -19708, -21006, -24084, -27558, -21613, -13855, -11436, -1341, -2802, -8360, -1970, 10129, 6538, 5474, 21168, 28232, 33526, 24160, 22458, 2434, -2428, 2865, -393, -9808, -12063, -15385, -3235, 135, -6576, 9527, 22560, 12306, -1846, -3306, -7131, 10741, 24303, 28752, 25261, 11876, 1564, -375, -1249, -9506, -22315, -21796, -18459, -10970, -15234, -20776, -8088, -14082, -22107, -30949, -30279, -30733, -33345, -19587, 158, 5373, -4817, -11931, -7537, -12777, -19110, -30098, -32467, -7483, 3471, 4755, 4406, -15420, -19083, -6004, -9888, 2708, -2193, -21229, -24903, -10671, -6751, -13716, -13608, -11299, -2184, -3513, -3967, 401, -4813, -15633, -24501, -36720, -20711, -21243, -13385, -8243, 4800, 4507, -8482, -4429, 1277, 3642, 4440, -9619, -12615]
7071a2615J1977P434J0927j8043q688l228j481J0005J0636l726r143n33j284j278
7057i040j2645o638M903N269K059O432O311R763N967K469m959r888o901l061l592
7042a3551L810n233j5489K186K0932K0675N912n993p040j3264j2721n384Q932
7029a6228p043k932J0409P527L038P011M739j3507J56l324L894K759p09m276K396
7014f090Q065m91q989j2586J404R802k683K213m696q168K273J4894J0365J1342
7000A6655j106j603n983m06l244l699J5561J0229j1229j7917K97J149j0134p845
6986a9275M206j944Q278M564j2612O028N511M019r295o350J2234r316l496J4920
6972b528l533j6937m422K385r871J4258J3781J4376j67m904k393l675Q663j1915
$$ y = [-12615, -638, 6796, 17723, -320, -9008, -12236, -13717, -3712, 6924, 3198, -5945, -6478, -7762, -9040, -21685, -28323, -23420, -18151, -16092, -9660, -3349, 6414, 12381, 14850, 9891, 3, -6898, -9959, -13551, -9741, -14974, -30463, -28277, -7345, 13330, 19242, 13249, 6209, -7055, -19776, -25160, -16228, -23271, -26203, -15794, -8267, -5229, 1782, 6521, -6986, -6830, -10154, -6260, -3501, -4210, -8486, -6090, 1975, 1484, -7505, -20091, -18687, -8885, -11568, -9355, -14051, -22219, -19946, -5052, 5313, 16655, 15549, 13946, 7963, 7557, 4313, 614, 16175, 26404, 15175, -2742, -2445, -1296, -11430, -19275, -15069, -17013, -8735, -4171, -16783, -10755, -5244, -1225, -10520, -16870, -4636, -13952, -17448, -2528, -6061, -22998, -27420, -25035, -34906, -20648, -6867, 7509, 7342, 2438, 45, -3630, 5033, -6882]
6958f882j8590M193J0691l842J639R917L575O37O857J0370n909l757k288k686
6944C925j1276p633J0942n746r71N011j023K511M117r598q484J2949R867M536
6930I127j6519j0044k563J0483J4826N846J8269L872k3699j4411J7363l73j1035
6917A142P95O574j0767j2747M338J757q019N630p61R591O649N527J718M09q745
6902C091n995M858O691n563j1461J0557R727j037J842n411k0378k347P548Q511
6888F33R324j2993N887Q198l423j0041L373r003k440l474O427M319J5873j0044
6874B616r936O433L723p200M637k383Q95o136J2026j311Q757m048q784o370R929
6859B848p41L271L384P901L729k1367r180J1163l841o724n673J278K368l818J1664
$$ y = [-6882, -25472, -21279, -10588, -14430, -12791, -2874, 701, 1338, 8195, 18565, 12656, 8899, 6611, 3925, -7351, -14984, -4042, -9788, -10759, -5748, -6771, -4260, -143, -9741, -18225, -5276, 4591, 9127, -7392, -17436, -19999, -9516, 5310, 11156, 29425, 33297, 9598, -4813, 12550, 12177, 1142, 1937, 8511, -2256, -15003, -10665, -8908, -16927, -11297, -12058, -2467, 4182, 9709, 11427, 11836, 3091, -2904, 1954, 8645, 3082, -8379, 2178, 11905, 10868, 12710, 7299, -13079, -15426, -7878, 633, 9957, -3036, 2851, 11049, 7626, -2415, 958, -8045, -10485, -13959, -7532, -3213, 12660, 2616, -7320, -887, 2836, -4364, 273, -2110, -1215, -7351, 4675, 3364, 12121, 8073, -711, -7081, 2848, 2107, 5378, 8762, 16663, 20392, -975, -10155, 1008, -2833, -9557, -15230, -13952, -11584, -15402, -3738]
6844c738J641R046j783K098K169N197n958m806j5262k262J0417Q807K150j438
6830F278k47j7879k2139O709J5069M602J345m674p951J514J382M51K015P079P182
6815G36j2464o24L085M457K02j7875j64j310r561j387L999k919j258J826J4562
6800a8695Q863j508p761N680j0142o665J3390K1318P597l694p479l115K755O568
6786G112L715j234j728j392J125R653K666m541j5183j4358j530Q855O375R882
6772I417J0566j7559o113k7J0620o703Q50q213k374r21p997K40N402J195J5369
6757C752m095o140o06J301n321m434m194M405J1648J2913N633p710r532m26j783
6742d589p657o352O519J4812o770l178J9625j625k0012n819N553J0540J1968j425
$$ y = [-3738, -2097, 6949, 5166, 7264, 9433, 14630, 8672, 3866, -11396, -13658, -3241, 5566, 7716, 6278, 6031, -11848, -33987, -27278, -12209, -7607, -6262, -10936, -18887, -17373, -15991, -15540, -13525, -6446, 736, -11728, -12352, -9267, -4810, -4608, -22483, -22647, -23957, -33518, -34905, -30906, -33825, -35083, -33257, -18695, -9832, -11340, -19101, -13421, -23563, -30228, -16838, 4480, 12077, 8383, 904, -2211, 544, 7112, 10827, 9593, 7865, 6473, 7598, 17251, 19917, 15376, 193, -14165, -15695, -6840, -465, 9417, 19983, 2424, -3689, -3716, 6904, 201, 1051, -7162, -9536, -10457, -18454, -18214, -12812, -11617, 3752, -343, -6483, -7089, -5788, -11109, -15543, -19737, -15332, -3684, 9229, 14862, 7152, -2380, -2806, -4589, -12246, -18598, -12079, 2733, -4037, -7215, 12410, 10785, -9227, -15046, -9493, 1047, 13015, 11590]
6728A1590r574m949K645p298P078N403N987J2776n66k479P883N276k563M830p912
6713B8127j1671m775j4759P887K0337o957j438o837L495Q521J897r135n924L574
6699A2342N112j374j1836j1501L58J4710J1400j0412r647j274O436r653r251J0630
6685c960r482K0253J3619p5r289k58N531j2709M584N984N57J117L814n861j1218
6670B607J578J394r611p125l370J0891L820l408p335j098N850l945O419K426j475
6655b382M491m729L08R01Q449L399O447j3577n266R339N86m402l492j694m243
6640e865R110J146j771n351j4440j0894R029M661m168N11p632O57r866R916J4336
6625a0621M06J3308O527p298l484Q311J7012K617L80q839j8323m537J2201J2831
$$ y = [11590, 2016, -2933, -288, -7586, -508, 4895, 10882, 23658, 23092, 20613, 28496, 33772, 31209, 36039, 28127, 16456, 11681, -3078, 4809, 25146, 18189, 16751, 9914, 13409, 21930, 23827, 14692, 8768, 12342, 17454, 16080, 4244, -7257, -6899, 7811, 19211, 8799, -848, -2122, 4314, -5339, -14590, -3960, -13442, 6811, 20430, 20355, 11066, 10808, 16339, 3630, 8214, 14198, 14755, 15872, 19686, 13825, 2607, 4185, 5579, -4032, -11157, -14527, -3636, 184, -3224, -10559, -11657, -5807, -9752, -3333, -907, -2382, 2109, -2620, -2312, -1411, 7038, 10437, 16884, 3307, -1959, 7380, 7966, 3564, 72, -1622, -5865, 3245, 4391, 2620, -2731, -17171, -28065, -19036, -14375, -18543, -18032, -25664, -25007, -34873, -24957, -10621, -10215, 3093, 9620, 2322, -1162, 7149, 24161, 26778, 27158, 18319, -4, -4541, 7660, 20491]
6611B0491j0757m249M396p839n979Q12Q10l347j0418k908Q773Q257L451N191K93
6596F977N775O561P409O932O377N039m155J046q096q655n835o349l77Q45j9468
6581e974p098l528l177K484O318j2789O651M188L041L432J992j062k142r865k911
6566b0440J001P604R22J666O045n833o544l98K3609m370k826J17K112M934P979
6551A5578p984k195K272o273k1765l728L927N267o18J8761J813K758P932n926
6537I819n317J3888o488l516L536n575r990L698J1048Q921p054j1193k873j3438
6523a4534K660n54Q910J315q887r612n657L047Q063K114r57P296o283k647M676
6508a1050l707R344r76k493P067m092o387n92O607J8474J2799j0606j0884j2441
$$ y = [20491, 9734, 5485, 9881, 2042, -3937, -3125, -2315, -5662, -16080, -18988, -10215, -1958, 1493, 6684, 6977, 12752, 19313, 26722, 33654, 40031, 45070, 40915, 41961, 33865, 25210, 19375, 13026, 12649, 13494, -5974, -13072, -16600, -19777, -17293, -10975, -23764, -17113, -12925, -9884, -6452, -4460, -5522, -7664, -17529, -20440, -19439, -11835, -10913, -9247, -3202, -9035, -15579, -15977, 7632, 3262, 436, 553, 2665, 7599, 15578, 7594, 5399, 7671, 1398, -20367, -24095, -20168, -14901, -15519, 3242, 5055, 7813, 15745, 9819, 4502, 18390, 11902, 8386, 11922, 6347, -3643, 55, 11103, 20024, 12970, 1777, -1096, -14534, -11874, -12428, -3518, -2203, -11090, -20702, -26359, -23312, -15249, -13135, -14092, -6796, -13079, -15726, -11050, -14757, -5413, -6389, -8882, -1815, -5907, -12294, -12886, -6279, 12195, 24994, 14388, 3504, -8937]
6494h937r325j3030L987J2659o164N122J8235k489j4375m485J350J2239N453L145
6480C385Q814p243N180k407m578j1648J724M081Q085n231L263J158k1114m387
6466b0918Q607m083R739J2539l484j2583r601M272j90j1452o322N953Q275J7433
6452a815J2545L801j811o049l708o127j614m050p916N009K2918L501r621q998
6438c935j2402r972K125k03J3443k410L1M908l622q346L065p261p651R069m632
6423b7793q277J1145J9634j361j1186J0681J933o666P609N532l55N167M601n988
6409D676j2945j4537m386J1220J0658Q155M265j0921p172o027L811M585Q924j585
6395a279Q511n201j4078n448L612M994r667j1311k796K613J6358k324R512O848
$$ y = [-8937, -18262, -31292, -27305, -14646, -20810, -15688, 2547, 58, -14317, -18802, -17452, -5213, 240, 3385, 12199, 4956, 10136, 7729, 3151, -8497, -6773, -2692, 5393, 162, 3425, 4583, -16531, -20918, -12311, -16394, -6655, 5884, 2400, -10183, -19784, -15512, -15702, -27154, -33476, -27523, -19248, -1815, 10730, 14531, 12720, 6671, 2963, -3164, -4778, -8828, -16744, -11735, 11183, 14684, 5063, -3935, -16337, -26309, -24184, -24387, -10944, -13354, -13323, -8415, -12037, -20383, -17318, -24579, -32230, -23161, -27793, -36070, -24925, -5291, -6652, -17838, -7157, -5224, -11890, -4281, 1251, 896, 6063, 10664, 4676, -8269, -22806, -27192, -15972, -5314, 2841, 7106, -3815, -10987, -17014, -13203, -8618, 306, -1279, 7232, 2031, -12047, -17495, -13883, -8889, -18556, -29867, -32663, -30050, -13692, -16016, -6504, 344]
6381C44L142N384o265j0199M625K2116k90j9753k830J412m753Q605o467j0532
6367a5461k496j063k113J1819J8901P31j7277J017o195o32j0268J680J0599R55
6353i803N852M507l218j0789l714N232K011J5784Q508K448l949q513r808Q08m643
6338i287n546K728m374L610J0134n390n432K184m091l070R846O733m995J5217
6324H267j744j3913j1566l882K713M506n306J1068J6118J1779p654q153l835L689
6310B087j7K61J4322O559j593j1056Q46q714o27o207Q197N923N463M009m645p887
6294F921k790p243j347R619L188m268j9601P314K868m833N27P743n498j0462p101
6279b4963m167J0241N675J0079n865j3159J3750K535L901L976Q869K501r764p441
$$ y = [344, 3486, 8870, 2605, -7594, -2969, 19147, 18857, -896, -3726, -2314, -7067, 1538, -4929, -15461, -17957, -19020, -21133, -9314, 9587, 10318, -6959, -5942, -12137, -12769, -23037, -21357, -10758, -9803, -3951, 556, -2662, -13451, -17165, -11933, -9922, 5862, 14370, 16818, 12869, 4356, -5452, -4644, -9287, -14833, -12105, -16479, -12869, -2735, -8125, -13557, -11373, -15464, -18534, -8688, -1955, -6950, 8267, 6523, -7390, -18956, -22838, -20125, -15619, -20925, -9857, 6261, 18040, 10386, 2233, -1602, 2087, 2070, 2331, 16653, 23212, 21619, 10563, 11409, 2695, 2068, -4139, 4058, 9981, 15444, 19453, 14808, 6921, 4131, -3112, -4459, 5160, 8348, 4080, -15521, -8207, -5339, -10172, -9645, -1902, -7400, -17862, -24963, -29130, -18889, -13214, -3135, -9000, -22159, -8409, -5874, -1973, 2003, 10872, 13373, 3609, -3832]
6265c832p724j132P69R30J732O946J3178J0793j6348j4295j788J5828M619l027
6251F649j3059J38J221J659j752j5095R443J0774J0190K223m937j0693j2154j0408
6237b5801o989J2546J7950J0993J7198p940o522j4040n498M882M291L726k823
6224A973k1914m412j163j915R826r239R346r582K920K2908o443j0631m851P884
6210a5293J2623n340k970N901J1289J0567l183n214J5169n269p739M58P408M033
6196B2440K22j0776O21r653j0512j6612k234J1364J2565K668O156K346L24q740
6182A79j4323L725M447j5847J5392J7299k781m394J5103J1359r647j7158r961
6169f607M754l743Q220K124o977J3278J1476p235k7891O593R943n216k399j5560
$$ y = [-3832, -11556, -12688, -11919, -10989, -9257, -2311, 10867, 21660, 5312, -8983, -10771, 5057, 9676, 6649, -6410, -6272, -5051, -3392, -5144, -20239, -10796, -22, 10168, 12391, 7454, -3239, -15393, -25801, -32790, -20244, -2294, 8699, 25897, 17957, 11435, -2605, -8103, -3221, 1070, 4796, 1973, -19941, -24353, -25516, -27431, -17605, -26844, -17498, -27080, -24160, -1252, -7695, -18326, -23177, -15293, -2670, -8010, -10980, -5079, 6210, 16777, 13594, 8380, 23549, 18280, 10541, 10999, 18407, 22440, 22662, 11886, 12507, 2854, -7658, -24270, -26504, -15140, -2575, 93, 6249, 8595, 8919, 179, -14144, -10419, -5972, -21819, -6427, 10872, 8091, 3697, 18800, 30159, 20512, 3354, -6607, -1853, -5596, 2624, 4748, -2229, 11049, 22525, 15290, -12601, -6008, 3935, -1281, -3680, -19240]
6155a9240n445J9395P644M781N326o595j6175k399M337J5538J1684J1354O134
6142C6339q44j579j4386l464L964M060m841J897j486n482k4619R83Q740K288o308
6127d738j7100p833m026P675K5672p508k1262J0952J6977Q371K124l470J308q540
6113a398m218J1875N073J2125j1530j2662Q416Q425p513j6427k836R619P510P512
6099A3971n757J5430N499j0549j0569k1795j1704J242J3897R04J136j0063L229
6086a5129K1054J7186O855j5599j0565M281j155j042J2154l261j1527o56j3866
6073a1270o849k780k512R92P81N524J5268q903j1648O784m12p994k794J3191Q607
6058d015j201o676J277P69J3445R081j945J113q324o184o469m849k66q898J5449
$$ y = [-19240, -24685, -5290, 2354, 7135, 12461, 5866, -10309, -12708, -8371, 7167, 18851, 30205, 36339, 35495, 33916, 19530, 16066, 20030, 24090, 19249, 21146, 19660, 14178, -10441, -9458, -718, 1570, -4738, -21838, -29671, -33697, -26022, -350, -7858, -29120, -18168, -1191, 7180, 9304, 5834, 7142, -1398, -5616, 6259, 11332, 23457, 11927, -735, 7681, 16106, 8593, -7834, -10670, -1051, 6459, 13971, 8214, 23644, 29143, 18594, 8025, -13770, -25474, -24232, -10335, -9431, -8295, -18358, -15129, 5925, 23111, 29966, 14367, 3802, 8083, 6928, 5886, 18040, 14779, 3252, 2596, -11270, -18119, -20899, -23411, -22419, -21638, -16114, -846, -9749, -21397, -14613, -15025, -23019, -25813, -12622, -4015, -5216, -11892, -10615, -9846, 3599, 12680, 10735, 11848, 3524, -2660, -9129, -13978, -14244, -23142, -7693]
6043g693K675O731Q638j1760j2908P224Q897q747r600Q528Q694P434J1932M602
6029B4647q519r930n022n542k499L257Q63L155J778o064j2341m065k298J820M666
6014a6094N132J9322J4121o326j3540p342r934o655j333N026N25J0202M290K590
6000a6m925k716p773Q119P37J143L810M359R099L606j003j3507k015p39J4939
5985A3118o228j7520m770o024M696L249n86N304K200n626q645L879J4628O175
5971C850p024K431J2938J6794o965k1552N820J5076M113p207j5297p785j273O870
5957G89M763l298o693Q509J7381Q099q088j7453p141P110m891K339M774N434Q12
5942A2446o349q711r354k13j2449J4245O226j1407j3424J2762m21j964j5078M521
$$ y = [-7693, -5018, 1713, 10351, -1409, -14317, -7093, 1804, -6943, -16543, -8015, 679, 8113, 20045, 24647, 16128, 6198, 1176, -4366, -6865, -3608, -2745, 410, 2188, -3876, -16217, -20282, -22580, -20760, -16094, -10962, 8360, 22481, 16155, 2615, -4727, -14661, -21316, -22649, -17623, -17098, -6896, -2606, -16, -4941, -7657, -15430, -7311, -6574, -5431, -1621, 2738, 11837, 15443, 14440, 933, -1082, -1821, 13118, 6890, -10630, -15400, -21424, -16728, -13479, -14065, -8761, -6561, -12187, -20832, -16953, -2325, 3850, -3174, -743, 12195, 28989, 22024, 472, 6292, 21368, 25481, 18274, 2977, -4808, -6081, 789, 5552, 2254, -4439, 4070, 21451, 29550, 21462, 4009, -3132, 3978, -913, 1426, 6200, 11634, 12446, 6097, -2614, -11968, -12181, -24630, -10385, -4159, -15566, -28990, -16228, -16649, -18613, -33691, -29170]
5928b9170J1759R382J6655K50l203L615q208n555l908j001M998L131q407q467
5914a8129Q37Q753j792O466Q52o713J0925J974m525j3164O82J0057L604o458m339
5899a0970p145P525j158j2210n394P67Q849k89R656L97j1189L33Q798N762P296
5884A028J1061j3785J410J4735O602r609n110l442n828j196j012K569J018O220
5870D661Q352j6050j8228k702K450J8336k592j1926K735K385Q84J8665j986j1995
5856g011j9465L411J1271L355p440P12J0090J1037j4462l261J2127O787m000j1719
5842h568o320k078J513J4611J1987j8870j9658K1189K165j682J419o412L731o574
5828a3547l523K570J0017m993J2061K1234L917m560j9638j8450O58M181R951J526
$$ y = [-29170, -17411, -8029, 8626, 8876, 5673, 9288, 1080, -4475, -8383, -9384, -4386, -1255, -9662, -18129, -17292, -8539, -10331, -3865, -3013, -9726, 1199, 3173, -1352, -14516, -13834, -3777, -173, -6631, -10970, -18115, -10590, -11748, -23958, -29352, -28585, -19736, -20025, -10369, -9972, -21161, -20828, -12030, -6268, 1028, 12089, -1696, -286, 14449, 21051, 11442, 6332, 2890, -2938, -4134, -5146, -2577, -1559, 4661, 13013, -3037, -21265, -23967, -21517, -3181, -5773, -17699, -14964, -12579, -11695, 6970, 4984, -7011, -26476, -23065, -11794, -8439, -15879, -15167, -5077, 5960, -8502, -11763, 364, 7151, 3151, -8568, -14888, -16966, -15453, -842, 11145, -7725, -27383, -6194, -4029, -5711, -4292, -10704, -6973, -13547, -17070, -14500, -4483, -9476, 2585, 23819, 27736, 23176, 3538, -14912, -14254, -10073, -122, 1404]
5814A404l957M858j014o986k349L413o967P486P511m663n12r684j0555K1179J5029
5799A4193q579j1351j1331N070J3893J112m019m625m590K929Q514N840m981l356
5785a281K407q33K944J0085o089j6969j8894M751J1431M305R652l233m001n864
5771a1589n784L502O099kj1011o886O125J7854J390l637J9418j057k414j513l250
5756G245l487N416n657k1695l383N337L759Q562O984j005j6129m791O192K488
5742a0164l114J0061J064p463P580L128j0613P753J8918q10j8715o546J4058J2741
5728A7878L181n05N394L205j0889j3695j0990m062L656J469J0835P597o674K796
5714I196l426J3355n618J805N85j2067m885N2J0197J0637J232j3269n866K423
$$ y = [1404, -2553, 2305, 1291, -5695, -8044, -4631, -11598, -4112, 3399, -1264, -1776, -11460, -22015, -836, 14193, 5614, -5737, -17068, -11998, 1895, 3007, -1012, -5637, -10227, -7298, 1216, 7056, 2075, -1281, 1126, 293, 3237, 13322, 7233, -9736, -28630, -23879, -12448, -8143, 1509, -1724, -5725, -11589, -17373, -13871, -7772, -7774, -18785, -25671, -19546, -1692, -302, -3939, 15479, 14422, 12008, 10495, 7245, 3758, 9174, 3517, -18178, -21561, -16224, -12465, -3903, 3081, 2076, -14053, -18844, -12652, -10164, -13278, -3217, -2153, -9616, -2036, 1092, -9521, -1768, 17150, 16340, -2375, -8921, 5137, 17878, 21059, 20554, 25948, 29153, 18264, 4569, -6421, -10483, -6827, -5358, 5477, 13074, 6400, 9196, 5770, 19125, 13507, 15312, 15897, 3830, -1055, -1003, 9194, 19831, 21063, 7794, 1928, 4351]
5700D351m245j1802O102j879l028K046R3K126L112m20m903j664q578q197R193
5685a7693J020O648J369q656l049J4816n365j0459j3271J7586N924k464J586J5783
5671C775l865j2923l716j393J1616R838J108p945j1456m878n938J2031J892Q977
5657b877M554L234O537L33j2011m637j536r689n790m26j2504K354J5055O977o20
5642a1046J519O390r2N586o782o132j4644l303O883o62K780O306K1302k97j2038
5627d230L994q693L233J420p663N742J0217n054l790P786N940J0012Q747j4528
5613A3133q273J711J516m803j999q48j680J279O653O643J086q155j3410q24j1405
5598a9376r227O837J3767N97J857n636O139l885k636J1103j3571n609o931K852
$$ y = [4351, 106, -11696, -5594, -7473, -10501, -8455, -8362, -6236, -3124, -3544, -8447, -10111, -18689, -26886, -17693, -16673, -10025, -8656, -17312, -20361, -5545, -10910, -21369, -34640, -17054, -11130, -13594, -12008, 3775, -90, -13013, -16729, -18122, -6506, 3332, 4440, -3505, -14961, -19839, -25777, -13746, -11854, -2877, 1677, 4911, 11448, 11781, -230, -4867, -6403, -16092, -21882, -22308, -34812, -32458, -17403, -10426, -11046, -9527, -3137, -3229, 2357, -4425, -10557, -25201, -28504, -21621, -22283, -19503, -13197, 8105, 7808, -4230, -236, -8929, -5696, -4276, -11939, -6197, 4020, -1034, -4824, 2962, 8902, 18914, 27661, 13133, 4860, 6571, 8087, 3284, 1285, 437, -1243, 36, 6689, 13332, 14418, 6263, -7147, -7971, -19376, -28603, -21766, -7999, -7402, -5545, -11181, -5042, -8927, -11563, -460, -14031, -19640, -26571, -23719]
5584b3719Q959L23J488K177q451K77n057R545J4880O077M946j2383j405l55m496
5569g194K573J555l93m185O91p356k28M183M873J359j4883P88J3547J6602j200
5554A0732r324J0563R880o844j3136n497m72M588r377j1496P571j486j0735O984
5540a8049P627K835J6923K361l712O183P483j5534N873n608m921J4985M974j6270
5526E150j0308m881J9541Q808l488j0603o012k821r662L285J170O5J7974L204
5512A1422j5751j0061L983n593L403K4352P898p409K668n011j3724q341q162M643
5498a5683J1795J4588j139j891K503Q820r206j9565q405P574J068J9300P828j820
5484A5767o777p119K590m251J1676p726j1292O29l916L192M690M780J764K437
$$ y = [-23719, -14760, -14437, -12949, -10772, -19223, -18946, -24003, -14458, 422, 6499, 11445, -938, -2343, -2698, -7194, -4621, -3066, -3459, -7644, -6953, -14309, -14537, -10354, -5481, -4122, -19005, -18217, -4670, 11932, 10732, 1408, 11971, 21851, 15007, 1871, -3626, -4098, 490, -8887, -20383, -12812, -14298, -25033, -18049, -10422, -7587, 9336, 11697, 7985, 14168, 21651, 6117, 11990, 6382, 1461, 16446, 21420, 5150, -5158, -10039, 9502, 18310, 14822, 4219, -1793, -4614, -14276, -10991, -9821, -9756, 8218, 11422, -4329, -14390, -10407, -16000, -12597, 11755, 19653, 12244, 14912, 9901, -3823, -12164, -20326, -15683, -3888, 10700, 9561, 7670, 10173, 18993, 9787, -9778, -18183, -10609, -9541, 9759, 17587, 15767, 8990, 1871, 4461, 210, 11886, 4160, -7132, -6503, -10419, -7227, -2537, 2243, 4007, 6444]
5470F444Q393p862m665P560O780Q867r205p588p011L216O08j528j975J296j95
5455C135n315L282R180P770r86L136p828j7271j1587O099Q759K155L577P689L61
5440A2156j2593q186Q766j249o431L346J653o808Q666M863j627O517K340o388
5426E025J1158J453o519J0110M684k704j1027j1371J3711K5977p647j4320j8610
5413h0l024Q752K721j939j145p402m800j542K744n730J411O378N218r282M243
5398c477l130l448n362q474k201M036P983J0378Q40J174Q168o53q520j1536m718
5383a8940J7218k158N79l93o853K259M013L525r017M151L653o046p222J0358M018
5368h55J295K696O034p42j561o179K142k359K413Q695m227q048Q337l644r516
$$ y = [6444, 14837, 6975, 2310, 9870, 16650, 25517, 16312, 8724, 1713, 4929, 5537, 4009, 2034, 3330, 3135, -2180, 1102, 10282, 18052, 17066, 20202, 12374, -4897, -16484, -10385, -1626, 529, 4106, 11795, 12156, -437, -8623, 143, -1106, -7537, -4191, -2538, -9346, -680, 4183, 2556, 9073, 11413, 5025, 16183, 17636, 11117, 21227, 25911, 23207, 12180, 809, 14520, 40497, 32850, 18530, -80, -3104, 5648, 8369, 6430, 5285, -2117, -6917, -8459, -5715, -11445, -10034, -3656, 1562, -7720, -3477, -6607, -10055, -15417, -23891, -26092, -22056, -14073, -3695, -2855, -1681, 6487, 5834, -2686, -14222, -18940, -1722, -3880, -3301, -3694, -10547, -8288, -4275, -750, -9767, -5616, -1963, -8009, -15231, -4873, -855, 440, 3136, 9170, 8428, 6867, 688, 2830, 471, 2884, 11579, 7352, -696, 7641, 3997, -5519]
5353e519l843N944j879j1765J2680P451j3029K028J5206O251M043j3121j4261
5340i814k892j113N296j904n97J1067L525m553j3202k247k809K53K047o334j3204
5325c6481p632R673J2786L053J636p161n391J1300o28N045J3835j229J2303K91
5311A1400j8442q159q298q88K225N867P551k09J0136R194J286r162O66j7873r63
5296a5669k16J2738P259n51Q589K263L5p410m307r274L907p413o263J466M147
5281a0699j4560m25J0232k189l425o042J095J1822l903L67J3354M787Q898J5780
5267B5092Q0q05n228r648P436j193j3606l750M712P411p663p752l899J1692J295
5252D174j3248j5567N369J2313M05O508N405k043J718K75L56L106n8j4664j1744
$$ y = [-5519, -9362, -3418, -5297, -17062, -4382, 3069, -9960, -7932, 7274, 13525, 17568, 4447, -9814, -12706, -13819, -8523, -10427, -11024, 43, 3568, -985, -14187, -16434, -19243, -18990, -16943, -23277, -36481, -44113, -34440, -21654, -18601, -16965, -24126, -29517, -18217, -18845, -13800, 35, -1194, 11109, 11400, -7042, -15201, -23499, -24387, -22162, -16295, -8744, -8953, 1183, 10377, 11663, 2501, 3167, -14706, -15669, -15885, -3147, 4112, 3561, 12150, 14413, 14448, 7038, 2731, -6543, -2636, -10049, -16312, -14846, -10699, -25259, -25684, -15452, -17641, -21066, -27108, -26013, -14191, -18094, -17727, -4373, 414, 9312, 25092, 25172, 24367, 19139, 9491, 16927, 15734, 2128, -1622, 3090, 10501, 2838, -4914, -8813, 2879, 4174, -9074, -24641, -19272, -6959, -6554, -46, 5359, 3316, 5034, 5309, 5665, 8771, 8713, -5951, -17695]
5237a7695q381j9142K977P748r389L195Q894J8214J840J4456J3500m822k0464
5224i069K090J3613M857J369j2900q537Q194J2784K628J532J695j2045p477R522
5210H256K1536l82j5724j3879j24M26o331j590j693J0702j607Q98J255j3575j3054
5195b4886O003N722P672J556o654l669l984k802M152L237j2538M165l999O15R78
5180b4432J0085N838J335K58R181l42j4270r040Q500J746Q722O906r92J064l269
5165A290m906p126n544J2852J8057O735p248M715o749m431l265m38k2099K423
5151a5734J4589J786p210q376P789J0582p563j7282j321J3564p71Q018J1084L485
5137A2640o402P17O196j0523j2038r660r162J2418J0736Q998m366j4864o992L49
$$ y = [-17695, -26076, -45218, -42241, -34493, -43882, -40687, -31793, -13579, -11739, 2717, 16217, 11395, -9069, -6979, 6634, 11491, 12860, -40, -8577, -383, 12401, 15029, 16561, 18256, 6211, -1266, 8256, 29792, 29410, 13686, -193, -317, 109, -6222, -7812, -9505, 1197, -410, 488, 1743, -11832, -24886, -18883, -13161, -5489, -3933, -10587, -14256, -18240, -21042, -16890, -13653, -26191, -22026, -26025, -25410, -24432, -14347, -8509, -7174, -6916, 2265, 1923, -12347, -21387, -12887, -11141, -2419, 4487, 3495, 4559, 1290, -3616, -10742, -16286, -3434, 14623, 21358, 14110, 18825, 12076, 7645, 4380, 3942, -18157, -15734, -1145, 641, -6569, -14945, -7156, 3426, -4137, -21419, -22740, -9176, -9947, -1929, 9155, 12640, 6238, 6955, 13151, 2628, -9410, -19070, -28232, -15814, -5078, 3920, -446, -15310, -22302, -21953]
5123b1953Q091L938J3728J186K146N939N432n380p531q088l064m212R2o554o691
5108b2921m251J6667N899r70r737j966J9650k591R75J1343M893M270j7652j2077
5094h468m305L097l160n876J0873m448q030K923l017k237K0125m617O41K629L171
5079f99k818L191m166L879K575l087j6208r61M336J3359L310j8481m51P872P719
5064f30N518J445k0844R873Q110j1385j0472N659L26M000L484L483Q239l951o435
5049c580j6911l643J5254R9j485O170J785J1038K335J1512p170o489j432q15O311
5034A2979r742j4648m869J3352O474J4096L871O704j5815o843O757O093k4546
5021f137j5514J3950J7130r8k0796j58O438p672o32K44J2305j549k550j3125j982
$$ y = [-21953, -13862, -9924, 3804, 4990, 7136, 13075, 18507, 13127, 5596, -2492, -5556, -9768, -9676, -16230, -22921, -27172, -10505, -4606, -5576, -15313, -17279, 2371, -220, 755, 12098, 16991, 21261, 3609, -8468, -12773, -9676, -12836, -18712, -7839, -12287, -20317, -17394, -20411, -22648, -2523, -7140, -6499, -3870, -699, -3517, -326, -4492, -613, 1962, -1125, -17333, -18294, -13958, -599, 2711, -15770, -16221, -8349, -630, 4888, 6333, -14511, -4638, 3472, -7913, -18385, -12726, -12400, -8400, -4916, -1433, 6806, 2855, -3580, -20491, -24134, -8880, -8781, -10266, -4096, -2311, 8727, 11062, 22574, 15404, 8915, 7483, 6668, 12979, 3237, -11411, -16280, -2928, 3546, 17642, 21513, 28217, 12402, 5559, 12316, 18409, -6137, -21651, -7701, 9429, 9331, -11465, -11623, -5185, -12857, -13489, -13245, -940, -2489, -5039, -18164, -20146]
5006b0146J631L001M524R860K941j616l328P478J3079P582j0349j5430J640Q087
4992H954l855j0576M538j520m950j5816k702Q536N317J1899Q527l246p784n302
4978g980m886O016J490N249k257q329J0204J3592m774K47Q30n665j414n801j2589
4963a6067j7986N51L303R663K095j229j036P35J7763M847n764j0270m527L301
4949a4621J3112l340l125N826M423K379m035J1969J0777j3226j0090k278R930
4936G701k252q939r414K542j7947p900p449J1533K5432J0819k157o310Ll601M241
4921c698P631p66o951l978j896o283p91Q98j299o938O320o701K5091K6104j8147
4906H596p086l446l155K978L987L360k533J8044L844r62o227j510L646p386q039
$$ y = [-20146, -18515, -15514, -10990, -1130, 1811, 195, -3133, 4345, 17424, 25006, 14657, -773, 867, 8954, 5099, -5477, -939, -2459, -7409, -23225, -25927, -17391, -12074, -175, 8352, 5106, -2678, -7980, -12866, -6850, -5360, -111, -2368, -10697, -493, 13099, 8325, 8572, 9402, 3737, 2323, -3478, -16067, -34053, -33502, -30199, -20536, -18441, -19670, -20706, -19971, -2208, 2639, -3125, -13395, -17922, -14621, -1509, -4849, -7974, -2148, 2275, 4654, 619, 12588, 23365, 10139, 49, -2229, 7701, 5449, -3490, -12904, -10362, -28309, -36209, -43658, -32125, -6693, 4126, 1969, -4341, -4338, -7939, -3698, 3933, 3167, -3784, -7762, -9658, -15941, -16732, -15834, -17133, -24071, -17751, -24452, 639, 26743, 8596, 1510, -1936, -5091, -2113, 1874, 5234, 2701, 20745, 24589, 23627, 17400, 15890, 19536, 12150, 4111]
4891D111M225l634L002J618M018j2178j8955k183r93o087l367N017J747j2719
4877c6378K731R108m97J1727J7721Q539J654k467p553q257P467j837j1273r83
4863a0298R004n721j657J988Q120r311n548L682r79j3897N056M167M913P348J0336
4848G203L061p179M778p102o185O154M944l636r418K650J5050P123p689o658J1212
4833A4308l006j3571m466J5660Q176m086j4558o464M676J168j466j356L308N68
4819a109k383j1652O096P81m540j0975o154Q104L616N822P232J5964n249j2997
4805g444l279O894K634M712q683j5534K184J2294N669q118p649J1727j249j5006
4791b0848m754J0069L233R934O500R720K919n737q145M224J768j9337o74n95K343
$$ y = [4111, 8336, 4702, 7704, 9322, 13340, 1162, -17793, -19976, -20969, -27056, -30423, -25406, -23659, -36378, -33647, -24539, -25036, -13309, 4412, 12951, 14605, 12138, 4585, -3672, 3795, 1958, -9315, -10298, -1294, -7015, -8672, -6684, 1436, -7875, -13423, -9741, -10720, -24617, -19561, -15394, -10481, -3133, 7203, 10264, 3085, 7863, 761, -5424, 730, 5674, 2038, -7380, -4730, 10320, 17443, 9754, 3096, 14308, 11302, -2269, -6735, 8925, 17101, 13015, -1543, -8007, -3331, -2163, -3629, -4985, -1677, -1109, -3492, -15144, -9048, -8267, -12807, -23782, -29936, -21832, -18216, -12394, -5162, 10802, 5553, -7444, -10723, -3829, -1195, 3517, -5166, -20700, -18516, -6222, -553, -8671, -16320, -4593, -5842, -20848, -25602, -15533, -12300, -2366, 4134, 13854, 16773, 11036, 2891, 7115, 8883, -10454, -11128, -11723, -9380]
4776i380P644J5186L635M015r0j3652j3789j7289K580L987Q578Q22M414O939L547
4761G147j0220p837J018K987L988n310M31J2156J2326o116j0271j4764N5K2823
4747H413J649l3P701L375l530J416l208Q508n698m915m301j4391l567J0570n659
4732c670j7803N529M599k604n168K445j6411P528J2610P986k33Lp404L23J2320
4717E0m327n304J1012p07M52r026L77Q184L662o554r065p295P457J6100J6847
4702B1863k925r518j2425l143J790Q601P38j2589k658J2009m480q284q889N759
4688a4151O141r805p623j396L692R593n111k217l095R774K44M29J943m654R119
4673g117R717j4727j0202N035o753j855J1875L757M067O023M459R681R04q474
$$ y = [-9380, -1736, 13450, 17085, 21100, 21010, 7358, -6431, -23720, -21140, -17153, -8575, -7753, -3339, 3600, 7147, -3073, -10910, -9892, -6905, -2917, -8227, -7796, 4360, 16686, 10570, 299, -14465, -14410, 8413, 10062, 10029, 17730, 21105, 17575, 18991, 15783, 24291, 18593, 13678, 9377, -5014, -8581, 1989, -3670, -21473, -15944, -11345, -13949, -19117, -16672, -33083, -25555, -12945, -4959, -5192, -5189, -12593, -12270, 50, -4277, -9581, 1431, 724, 1176, -7850, -7473, 711, 4373, -2181, -11246, -18541, -11084, 5016, 21863, 18938, 9420, -3005, -6148, -4358, 4243, 4981, -7608, -10266, 1743, -2737, -11021, -19910, -14151, -8010, -17815, -25438, -26834, -23142, -13549, -18660, -20877, -23972, -14198, -13954, -13525, -11582, -16236, -7117, 2600, -12127, -22329, -17294, -24047, -25902, -14027, -10270, -6203, -180, 4279, 13960, 14864, 6390]
4659F390P658P772N678o952r758j7154l834K81M013R69J03k975Q42P796R637p186
4643C280r26N393o742K660j2449q74L65l398m990r97K350Q026K649p728l724M616
4627a2489j072K482O036l100o627j470Q960J0131l378j2076p704j0567K418Q500
4613a9956k628R772J2990l810O485P298P274p679k745j3139NL336K640J1367N694
4598A6904j4602q239k431k230M648j238k374q066j863O795Q044l934r17J3337
4584C834n235K816q08j2400j0762k866R349N477M512M267J0634O40L708l005j0841
4569f80J480q746j2584M32O721J6375J774p763P57N918l806L693M952Q28L354
4554A2705k510j0186j3934m353K2416R421q478n272R828N406j6784p085J4233
$$ y = [6390, 14048, 21820, 27498, 20546, 10788, -6366, -10200, -9919, -5906, -4937, -4834, -7809, -6967, 829, 10466, 3280, 2354, 7747, 1005, 3665, -8784, -9658, -9293, -12691, -17681, -18678, -16328, -8302, -5653, -13381, -17105, -12489, -13561, -11079, -5043, -8143, -14770, -16240, -7280, 2851, -527, -12603, -20307, -30874, -28456, -19956, -22584, -12812, 178, -3632, 2853, 10151, 17425, 9746, 7001, -6138, -6133, -2797, -157, 11210, 16904, 2302, -5937, -8368, -10598, -5950, -7188, -9562, -17628, -19491, -12696, -4652, -8586, -9503, 3834, -1401, 1415, 607, -11793, -22555, -25421, -16072, -10595, -6083, -1816, 8818, 9458, 13166, 10161, -680, 800, -7946, -20530, -20098, -13377, 2998, 4772, -2991, -2234, 3684, -122, 3571, 8523, 9351, 12705, 10195, 9, -13925, -18278, 4138, 13559, 5081, -191, 9637, 15043, -1741, -8826, 5407]
4541E407r5j4548r5p222q149K855L842R033J607j1647M6n487j250j664J0403L527
4525a3437M751J2596O61J35O147l52m668p294k353P720m3k837J4503L332m637
4510A4224O99K941o742j0596M085q449j3576J181J6719J273M002N472l283j448
4496F502n601p216M922n040o342P921N650J636l618P576Q785k6979r65O557O982
4481G70p240n127L888R381J2148K263j6332r341p557P893R742n426J3194Q535
4467A6791q342j0809q834P672O132n48j1282p156Q175J7055Q586n480q477j4124
4453a0641j1975O411N737J73K1019K595R80k0027k9084J1436K3476J2211j19j1738
4439D54k414q70K64J068Q655J7651o392k0105r089O470N387m798L719O413j8071
$$ y = [5407, 5312, -9236, -9331, -16553, -24702, -21847, -18005, -8972, -7365, -19012, -18966, -24453, -25703, -27367, -16964, -13437, -8686, 3910, 4571, 4706, 10853, 10501, 5833, -1461, -3814, 3906, 3863, 1026, 15529, 18861, 14224, 14923, 17864, 11122, 526, 4611, -3838, -17414, -16233, 486, 1759, 5761, 11233, 7950, 6502, 901, -6315, -1393, -6433, -12775, -4854, 796, 2432, -1186, 6390, 15175, -11804, -12769, -6212, 770, -6470, -11597, -7709, 1672, 13820, 16083, -249, -9590, -17147, -9254, 488, -4938, 8256, 16791, 8449, -2360, -11194, -3522, 2610, 2062, -9220, -16376, -8201, 8854, 17440, 11960, 3483, -10641, -22616, -16205, -10468, -10295, 10724, 13319, 14299, -5728, -34812, -23376, 100, 12311, 12192, 454, -1960, -2830, -2566, -1498, 7157, 24808, 18416, -1689, -10778, -4308, 1079, -3719, 0, 6413, -11658]
4424a1658m280Q60Q75J819o607k05K644l867j1140N437L040N799O575O020N617
4409I29O050p610j085r62p895n211J1668P609J0350l732j2239L883J3448P745
4395B2948o868j2705m527K169J1402m520K37R49j5531p718j0376J045J0825J4629
4381A959K332r442L764P563J103p530q84r48L577j118M632J3063k1112K346j0761
4366a1456n524J2091J0820J5056q361l325Q599J555j2290O85k979n331j953j3678
4352a6091j12Q647J3037R440N86J1099O481l3921j0014j995O90l1O668m519K522
4337g513J8170p789q1P640P744l883j7645J126k48Q716J62o167N738L367L323
4322A2660J977j0508p315K203O571J51P810M436j6633j0672O628n498J1134r545
$$ y = [-11658, -15938, -15078, -14203, -12384, -18991, -19196, -16552, -20419, -31559, -26122, -23082, -17283, -10708, -4688, 929, 6979, -631, -1716, -2678, -10573, -15784, -4116, 3493, 13843, 10111, -2128, 1755, 15203, 22948, 16080, 3375, -1152, 1017, 12419, 7899, 8136, 9085, -6446, -14164, -24540, -23495, -12670, 1959, 4291, -5151, -1387, 6176, 7279, -251, -1135, -2083, 1494, 376, 5008, 18071, -3041, -695, -11456, -16980, -4889, 5931, 20987, 12626, 9301, 17900, 19455, 7165, 7850, 4871, -460, -2413, -16091, -16203, -7556, 5481, 14921, 15507, 26606, 33087, -834, -10848, -12843, -12153, -12184, -5516, -10035, -7513, 10657, 2868, 2787, 10427, 18171, 14288, -3357, -2231, -2479, 6237, 6399, 232, 5970, 9337, 12660, 14637, 4129, -3186, -983, 5588, 5739, 13549, 17985, 1352, -9320, -2692, -8190, 2944, -6601]
4308f601j656l703j5038n118Q07P549J0321J1839Q266l693j291J7616L138K852
4294B5288J72j4188R31p689N148Q088J333M563j070M762m343k164j1636p354j3007
4279a1166j4645K840K6021L3487O96r678K488j896j4623j4619r462j0301P741
4266a3117J0811j2831Q687J798l72l757L902M840j3913l060q367J7595J9394L735
4252A5345j2371P474J2734J1517m403k7660r256M831n089l001N496P815P744r288
4238A888j2796j0486j2382M296J1909N317L002q144k600R476J9026j87p056L334
4224D597j4742p676k416R645Q490l160l23o271J6578O364k782j581j1847K259
4210b865P774K600l120o466R299o084K86J1334P50l378J932j2977n15j0029j1247
$$ y = [-6601, -8257, -11960, -26998, -32116, -31309, -23760, -13439, -1600, 6666, 2973, 1682, 19298, 22436, 25288, 25460, 11272, 12203, 4514, 9662, 17750, 19083, 23646, 22576, 27338, 22995, 20831, 9195, 1841, -11166, -25811, -22971, 3050, 36537, 37233, 27555, 30043, 28147, 13524, -1095, -10557, -20858, -13117, -2306, -15137, -6450, -4652, -5024, -8781, -4879, -39, -13952, -17012, -25379, -7784, 11610, 15345, 2974, 10448, 23182, 34699, 30296, 2636, -6620, -1789, -6878, -9879, -4383, 3432, 11176, 1888, -10908, -21394, -33776, -29480, -17571, -12254, -9252, -17396, -19996, -10520, 8506, 8319, 1263, 4597, -10145, -17821, -20237, -10592, -2102, -5262, -5585, -11856, 4722, 11086, 8304, 6723, -5124, -2865, 4909, 7509, 4389, -2077, 7222, 1138, 1424, 12758, 13508, 10130, 12062, -915, -1430, -11459, -22706]
4195b2706k540P318O999L464j6985j102Q607j3257p089K2520J4326P889n714j0247
4181h517R088r79o01m849r050J897N571J1095p229K362R388Q485j0395n177l913
4166b824q68J168M629P312j163j3544N014M144j300m892q066K601O003j930j9755
4151b3471N286L008K996J6852J0939j1960m515r182J4375Q297K962P641o452k1536
4137d760j4768Q59j021R819j597m79q12o75q688N99J282J5556J2784n84q086r196
4121i767R300l498j962o770q815Q202J0015n819j499m913j293J3222L076M46n226
4106e301o540j351P92M099J248q036j800J9040N826j3516O364P02o062j3612O122
4091a2025M803K815L180j5184K073r311L063J301J063m680r161k038K4124J8178
$$ y = [-22706, -25246, -17928, -10929, -7465, -24450, -25552, -16945, -30202, -37291, -14771, -445, 7444, 1730, -8517, 571, -408, -1009, -5858, -14908, -13011, -7440, 3655, -3574, -1212, 8176, 16661, 6266, 1089, -2824, -3692, -2524, 2105, 9417, 8254, -5290, -276, 3868, 2568, -2324, -10390, -7789, -1786, -3716, -23471, -18185, -15177, -12181, 4671, 15610, 3650, -865, -10047, 4328, 12625, 15587, 23228, 16776, -4760, -19528, -18669, -19690, -9871, -11468, -11947, -12759, -13434, -22122, -21523, -20241, -4685, 8099, 7515, -571, -9767, -467, -3965, -5927, -12697, -21512, -13310, -3295, -9114, -10613, -15526, -16819, -3597, -521, -75, -5301, -11841, -13192, -12400, -8301, -7053, -15089, -16889, 2151, 7977, -5539, 825, 1527, -4535, -18147, -12025, -7222, -4407, -1227, -16411, -14338, -23649, -20586, -19285, -18222, -22902, -32063, -34101, -9977, 8201]
4077H201l063k72o793j3285j1064O710J75M808K186L796j48J453n784M805m775
4062a3050J5107o409j6477J0678P016m962K026n472j1485o695J6231P59j5195
4049b7928N77N192Q067k098K720j897Q641P039j4241j0654o362P912K587M75j150
4034b1120M013M613O913m39N802P817K509K620m822j0176j0438P243l055M50o456
4019a4526j258N177K778P956L098j0244q574N766N858j1589l939r241J1112K2617
4005D991q119j0887J2248J2938j3880j3842j2490q901K1499J5079q34o398R08
3992g688N3n528P367J4330K905k087P85Q465R057o212L272r26k730N246q893n186
3976A2230K502K576J705l274M364j6039j5468q557R556L1001K84j5147j2168l280
$$ y = [8201, 5138, 4866, -1927, -15212, -26276, -19566, -19391, -14583, -12397, -8601, -8749, -7296, -13080, -8275, -13050, 2057, -4352, -20829, -10151, -3135, -8097, -6071, -11543, -23028, -29723, -13492, -12733, -27928, -27351, -22159, -14092, -16190, -13470, -15367, -6726, 313, -13928, -24582, -30944, -23032, -20445, -19970, -21120, -17107, -12494, -5581, -6020, -218, 7599, 10108, 12728, 7906, -2270, -12708, -5465, -8520, -8070, -14526, -15784, -10607, -7829, 127, 3225, -7019, -15593, -9827, -3969, -15558, -19497, -28738, -17626, 4991, -3128, -14015, -1767, 11171, -2709, -16551, -29041, -37942, -16443, -1364, -2198, -8596, -7688, -7635, -13163, -5796, 8534, 11439, 9352, 10137, 18602, 27659, 21447, 24719, 23793, 21063, 26309, 17416, 12230, 14732, 17308, 19013, 15739, 20103, 4064, -11404, -19961, -10405, 20596, 20880, 5733, -6435, -9715]
3962i715q293j879K475r50P697O968O585J832p562k706J433J276K255O83K278
3947B377L105L379J968q321P328N322j346j710m624j1969J8983j1663r810j5117
3933b2098J44L683Q640M218k837L659P82o19m799j0078J470N206R39K001N834
3918c855p573p895o083L359M059P675L430N610k842K058O216M105K327l816j1753
3903d978O531O149p070K279J1187p015j1179j3649o98N950j379j679N775M033
$$ y = [-9715, -18008, -19887, -17412, -18362, -10665, -3697, 2888, 4720, -2842, -5548, -4115, -2839, -584, 99, 2377, 5482, 8861, 10829, 2508, 9836, 15158, 13812, 12102, 7478, -4491, 14492, 2829, -6981, -22098, -21954, -18271, -9631, -5413, -8250, -4591, -3809, -4428, -9227, -19305, -17835, -12629, -11690, -9689, -3855, -11428, -19323, -25406, -22047, -17988, -10313, -6883, -1273, -4115, -2057, 4159, 8264, 10591, 6775, -4978, 1553, 7702, 632, 2911, 14098, 7083, -4096, -17745, -18443, -12493, -13872, -15551, -9776, -5743]
$$ [...]
##END NTUPLES=NMR SPECTRUM
##END=
