##TITLE=Analysis number 326590
Compound Code cc 55910
Book Reference 494/122
Project Code adrs
Chemist Name craigr
##JCAMPDX= 6.0         $$ Bruker NMR JCAMP-DX V2.0
##DATA TYPE= NMR SPECTRUM
##DATA CLASS= NTUPLES
##ORIGIN= Bruker BioSpin GmbH
##OWNER= nmr
$$ XWIN-NMR		Version 3.5
$$ Wed Feb 14 10:17:40 2007 GMT Standard Time (UT+0h)  MAYBRIDGE\nmr@NMR_250MHZ
##.OBSERVE FREQUENCY= 250.131544655141
##.OBSERVE NUCLEUS= ^1H
##.ACQUISITION MODE= SIMULTANEOUS (DQD)
##.ACQUISITION SCHEME= undefined
##.AVERAGES= 16
##.DIGITISER RES= 18
##SPECTROMETER/DATA SYSTEM= dpx250
##.PULSE SEQUENCE= zg30
##.SOLVENT NAME= CDCl3
##.SHIFT REFERENCE= (INTERNAL, CDCl3, 0, 16.522)
##AUDIT TRAIL= $$ (NUMBER, WHEN, WHO, WHERE, WHAT)
$$ ##TITLE= Audit trail, XWIN-NMR		Version 3.5
$$ ##JCAMPDX= 5.01
$$ ##ORIGIN= Bruker BioSpin GmbH
$$ ##OWNER= nmr
$$ C:\u/data/dgb/nmr/ADRS/860/pdata/1/auditp.txt
$$ ##AUDIT TRAIL=  $$ (NUMBER, WHEN, WHO, WHERE, WHAT)
(   1,<2007-02-14 10:17:21.48 +000>,<MAYBRIDGE\nmr>,<NMR_250MHZ>,
      <created by zg, POWCHK disabled, PULCHK disabled
       configuration hash MD5:
       49 4B E0 1D 92 C2 6B 37 9F E6 65 BC 52 41 86 1D
       data hash MD5: 64K
       E1 F5 AA 7D 7C 3A 89 9C CA 08 31 B4 9F B0 1C 9C>)
(   2,<2007-02-14 10:17:32.32 +000>,<MAYBRIDGE\nmr>,<NMR_250MHZ>,
      <Start of raw data processing
       ef LB = 0.3 FT_mod = 6 PKNL = 1 SI = 32K 
       data hash MD5: 32K
       3D 50 D8 C1 EA 0F 87 42 3F F1 C0 5E AA AD 2C E8>)
(   3,<2007-02-14 10:17:34.06 +000>,<MAYBRIDGE\nmr>,<NMR_250MHZ>,
      <apk 
       data hash MD5: 32K
       6D 23 E5 7F 34 98 0D 04 CD FA 11 C9 0D ED B8 BB>)
(   4,<2007-02-14 10:17:34.75 +000>,<MAYBRIDGE\nmr>,<NMR_250MHZ>,
      <abs ABSG = 5 
       data hash MD5: 32K
       EB F8 90 70 4D FE 48 DB DC 66 04 AB FC 7F CA 5B>)
$$ ##END=
$$ 
$$ hash MD5
$$ C8 3E 82 43 2C 2D 68 AF D2 77 79 41 F3 A5 00 0E
##$RELAX= 
##$RELAX= 
##$RELAX= 
##$RELAX= 
##$RELAX= 
##$RELAX= 
##$RELAX= 
$$ Bruker specific parameters
$$ --------------------------
##$DU= <C:\u>
##$EXPNO= 860
##$NAME= <ADRS>
##$PROCNO= 1
##$TYPE= <nmr>
##$USER= <dgb>
##$AMP= (0..31)
100 100 100 100 100 100 100 100 100 100 100 100 100 100 100 100 100 100 
100 100 100 100 100 100 100 100 100 100 100 100 100 100 
##$AQSEQ= 0
##$AQ_mod= 3
##$AUNM= <au_zg>
##$AUTOPOS= <37 >
##$BF1= 250.13
##$BF2= 250.13
##$BF3= 250.13
##$BF4= 250.13
##$BF5= 500.13
##$BF6= 500.13
##$BF7= 500.13
##$BF8= 500.13
##$BYTORDA= 1
##$CFDGTYP= 0
##$CFRGTYP= 5
##$CHEMSTR= <none>
##$CNST= (0..31)
1 1 145 1 1 1 1 1 1 1 1 1 1 1 1 1 1 1 1 1 1 1 1 1 1 1 1 1 1 1 1 1 
##$CPDPRG= <>
##$CPDPRG1= <>
##$CPDPRG2= <>
##$CPDPRG3= <>
##$CPDPRG4= <mlev>
##$CPDPRG5= <mlev>
##$CPDPRG6= <mlev>
##$CPDPRG7= <mlev>
##$CPDPRG8= <mlev>
##$CPDPRGB= <>
##$CPDPRGT= <>
##$D= (0..31)
0 1 0 0 0 0 0 0 0 0.06 0 0 0 0 0 0 0.0002 0 0 0 0 0 0 0 0 0 0 0 0 0 0 
0 
##$DATE= 1171448240
##$DBL= (0..7)
120 120 120 120 120 120 120 120 
##$DBP= (0..7)
150 150 150 150 150 150 150 150 
##$DBP07= 0
##$DBPNAM0= <>
##$DBPNAM1= <>
$$ [...]
##$SUBNAM7= <"">
##$SUBNAM8= <"">
##$SUBNAM9= <"">
##$SW= 20.6930455092707
##$SWIBOX= (0..15)
0 0 3 0 0 0 0 0 0 0 0 0 0 0 0 0 
##$SW_h= 5175.983436853
##$TD= 65536
##$TD0= 1
##$TE= 295.16
##$TE2= 300
##$TE3= 300
##$TEG= 300
##$TL= (0..7)
0 120 120 120 120 120 120 120 
##$TP= (0..7)
150 150 150 150 150 150 150 150 
##$TP07= 0
##$TPNAME0= <>
##$TPNAME1= <>
##$TPNAME2= <>
##$TPNAME3= <>
##$TPNAME4= <>
##$TPNAME5= <>
##$TPNAME6= <>
##$TPNAME7= <>
##$TPOAL= (0..7)
0.5 0.5 0.5 0.5 0.5 0.5 0.5 0.5 
##$TPOFFS= (0..7)
0 0 0 0 0 0 0 0 
##$TUNHIN= 0
##$TUNHOUT= 0
##$TUNXOUT= 0
##$USERA1= <user>
##$USERA2= <user>
##$USERA3= <user>
##$USERA4= <user>
##$USERA5= <user>
##$V9= 5
##$VALIST= <valist>
##$VCLIST= <CCCCCCCCCCCCCCC>
##$VD= 0
##$VDLIST= <DDDDDDDDDDDDDDD>
##$VPLIST= <PPPPPPPPPPPPPPP>
##$VTLIST= <TTTTTTTTTTTTTTT>
##$WBST= 1024
##$WBSW= 4
##$XGAIN= (0..3)
0 0 0 0 
##$XL= 0
##$YL= 0
##$YMAX_a= 479845
##$YMIN_a= -416519
##$ZGOPTNS= <>
##$ZL1= 120
##$ZL2= 120
##$ZL3= 120
##$ZL4= 120
##$ABSF1= 16.522
##$ABSF2= -4.171173
##$ABSG= 5
##$ABSL= 3
##$ALPHA= 0
##$AQORDER= 0
##$ASSFAC= 0
##$ASSFACI= 0
##$ASSFACX= 0
##$ASSWID= 0
##$AUNMP= <proc_1d>
##$AZFE= 0.1
##$AZFW= 0.1
##$BCFW= 0
##$BC_mod= 0
##$BYTORDP= 0
##$COROFFS= 0
##$CY= 12.5
##$DATMOD= 1
##$DC= 0
##$DFILT= <>
##$DTYPP= 0
##$F1P= 14.0000005364418
##$F2P= -0.99999901652339
##$FCOR= 0.5
##$FTSIZE= 32768
##$FT_mod= 6
##$GAMMA= 0
##$GB= 0
##$INTBC= 1
##$INTSCL= 1
##$ISEN= 128
##$LB= 0.3
##$LEV0= 0
##$LPBIN= 0
##$MAXI= 10000
##$MC2= 0
##$MEAN= 0
##$ME_mod= 0
##$MI= 0
##$NCOEF= 0
##$NC_proc= -3
##$NLEV= 6
##$NOISF1= 0
##$NOISF2= 0
##$NSP= 0
##$NTH_PI= 0
##$NZP= 0
##$OFFSET= 16.522
##$PC= 1
##$PHC0= 227.4992
##$PHC1= 6.989553
##$PH_mod= 1
##$PKNL= yes
##$PPARMOD= 0
##$PSCAL= 4
##$PSIGN= 0
##$REVERSE= no
##$SF= 250.13
##$SI= 32768
##$SIGF1= 0
##$SIGF2= 0
##$SINO= 400
##$SIOLD= 32768
##$SREGLST= <1H.CDCl3>
##$SSB= 0
##$STSI= 32768
##$STSR= 0
##$SW_p= 5175.98343685301
##$SYMM= 0
##$S_DEV= 0
##$TDeff= 65536
##$TDoff= 0
##$TI= <Analysis number 999999
Compound Code 99
Book Reference 9
Project Code 9>
##$TILT= no
##$TM1= 0
##$TM2= 0
##$TOPLEV= 0
##$USERP1= <user>
##$USERP2= <user>
##$USERP3= <user>
##$USERP4= <user>
##$USERP5= <user>
##$WDW= 1
##$XDIM= 32768
##$YMAX_p= 310679518
##$YMIN_p= -208199
$$ End of Bruker specific parameters
$$ ---------------------------------
##NTUPLES= NMR SPECTRUM
##VAR_NAME=  FREQUENCY,     SPECTRUM/REAL,   SPECTRUM/IMAG
##SYMBOL=    X,             R,               I
##VAR_TYPE=  INDEPENDENT,   DEPENDENT,       DEPENDENT
##VAR_FORM=  AFFN,          ASDF,            ASDF
##VAR_DIM=   32768,         32768,           32768
##UNITS=     HZ,            ARBITRARY UNITS, ARBITRARY UNITS
##FACTOR=    0.157963299565203, 1,           1
##FIRST=     4132.6476996994, 0,             0
##LAST=      -1043.33573715361, 0,           0
##MIN=       -1043.33573715361, -208199,     0
##MAX=       4132.6476996994, 310679518,     0
$$ Real data points
##PAGE= N=1
##DATA TABLE= (X++(R..R)), XYDATA
$$ [...]
16208c852q143m524k9799P371K5081J9864M784l957L099J0312j4811O924J5485
16195B7834Q095o691o822J311N77j9646k5341j0455K7146J5859L5302k3441j0138
16182A3590K4618J3416k0384m8640j1536k785q928L6196J8197k1745q280j2053
16170b8334O879l34n403L50k3153J2645O770J4765j9028j0160K9659L1617o553
16157I720m223j8482m308k2438K3987M0668Q352J5721j0410l8134k6761K4086
16145b222J6465k3660O180K0769m949q917J3652O8l8919j6325O127K7196J9602
16132A5067J6078k6825j5438m613k433J3363k0902n311R856p182p316K430J8993
16119a4233L667Q26R441o215j1179p638J0105J3435m455Q308L551j2061j4905
$$ plain form
16208 -3852 -11995 -16519 -46318 -38947 -13866 5998 10782 6825 9924 20236 5425 12349 27834
16195 27834 35929 29238 22416 23727 24304 4658 -20683 -31138 -3992 11867 47169 23728 13590
16182 13590 38208 51624 31240 -17400 -28936 -31721 -40649 -4453 13744 -8001 -16281 -28334
16170 -28334 -21455 -21789 -27192 -26842 -49995 -37350 -30580 -15815 -34843 -45003 -15344 16273 9720
16157 9720 5497 -12985 -17293 -39731 -15744 24924 33276 48997 38587 453 -26308 -2222
16145 -2222 14243 -9417 -3237 17532 12583 3666 17318 17386 -21533 -37858 -31731 -4535 15067
16132 15067 31145 4320 -11118 -15731 -18164 -4801 -25703 -31014 -21158 -28340 -35656 -33226 -14233
16119 -14233 -10566 -9740 -299 -6514 -17693 -25331 -15226 -1791 -6246 2062 5613 -6448 -21353
16106b1353p16K4977J1363j0558Q956M458M275J078M390o197k2824j8068L149
16093a7070P822L560l742j8272O775M367q644J9075j9494m44J0284J0654m460
16080i589J2512k0611n144j3542k3033j473P633J4965Q367J5584K3790j1498l250
16067e289J005j0372J1043R137N288l067j7047j8380N662N565m80N28j4256K2944
16053g719k705O710o066P359k4736l6602j1163J1134L0306J5334J6744J2922J1679
16040B3197m059j5074m847M515n488q081j0655J9422j0037L757J179l783j273
16027a1227K1493J9005k1917m3131J535J0489m363r619P249Q872O284K4275l254
16014E691J7523l2216j0573P47N731J1675M775R873j773r290o084K190n084K1513
$$ plain form
16106 -21353 -22069 2908 14271 3713 12669 17127 21402 22480 26870 20673 -2151 -20219 -17070
16093 -17070 -9248 -5688 -9430 -27702 -20927 -16560 -25204 -6129 -25623 -26067 -15783 -5129 -9589
16080 -9589 2923 -17688 -22832 -36374 -59407 -60880 -53247 -38282 -29915 -14331 9459 -2039 -5289
16067 -5289 -4284 -14656 -3613 5524 10812 7745 -9302 -27682 -22020 -16455 -16935 -16407 -30663 -7719
16053 -7719 -10424 -3714 -9780 -2421 -27157 -63759 -74922 -63788 -33482 -18148 -1404 11518 23197
16040 23197 19138 4064 -783 3732 -1756 -9837 -20492 -1070 -11107 -7350 -6171 -9954 -11227
16027 -11227 10266 29271 7354 -35777 -34242 -23753 -28116 -37735 -30486 -21614 -15330 8945 5691
16014 5691 23214 -9002 -19575 -18828 -13097 -1422 3353 13226 11453 2163 -3921 -1731 -6815 14698
16000A4698o320j2963k182j1369O093J9765M060p173l3800j676Q868j844J4160
15987i683K1635j1383P260M335K4622j2910N077j8053j0718j1311j5595K83m013
15974c0454j0100L286k424l12Q032J7714R680J8844k8118k4977R329L6570K9230
15961C6300m157j8900q782m633j7147L975K451j3018r730l2399n764Q890K4517
15948c8397J4754R05O244Q691P998j1049l732J7956o648j1614R375L7993J8259
15935E0735j0764k0279m883k9166n534J0707R916l585j0257N440m275L390K9070
15922B0515J3511j7702J3786k8956n636j688J65P394L1387n950l3164m774l7644
15909d8756o675K7568P33n577p619J0555P236k673J1247K5734K1723O098j0137
$$ plain form
16000 14698 8378 -4585 -6767 -18136 -12043 7722 11782 4609 -29191 -30867 -21999 -23843 -9683
15987 -9683 11952 569 7829 12164 36786 23876 28953 10900 182 -11129 -26724 -26441 -30454
15974 -30454 -40554 -37268 -39692 -40004 -31972 -14258 -4578 14266 -13852 -38829 -29500 7070 36300
15961 36300 32143 13243 4461 -172 -17319 -13344 -10893 -23911 -33641 -66040 -71804 -62914 -38397
15948 -38397 -23643 -22738 -16494 -7803 195 -10854 -14586 3370 -3278 -14892 -5517 32476 50735
15935 50735 39971 19692 14809 -14357 -19891 -9184 732 -2853 -13110 -7670 -11945 -8555 20515
15922 20515 34026 16324 30110 1154 -4482 -6170 -6005 1389 32776 26826 -6338 -11112 -48756
15909 -48756 -55431 -27863 -27130 -32707 -40326 -29771 -22535 -25208 -13961 11773 33496 39594 29457
15896B9457j5294k4042K665J2285K6654k0636L147N203J274J2126J1965j8418
15884B6386j2499o229p776n329K2421O472k3284j1104n610k9881Q264j0404j4250
15871f2823k666L9970r131k35J0658R260j5287K784M4688J8191m363n982m396
15858B0668j1991K9163j2030k7382L3098k730k9327n145K3360n600k0200r202
15846a7318J4941j3382k4891N135L9138k1259l704J3004l408o222Q991J8583N085
15833A4693k3434o897L5777j0839m786O576L0747P439j1014k1195l5979j9637
15821c8549Q595p633R77L8249K1419k2210k3333p514J9355q834j4437J0143K0028
15808c744J9709q187m0839l9128J4712L5973K5474k036L790o002J3522j9249k9969
$$ plain form
15896 29457 14163 -9879 -7214 5071 31725 11089 14236 19439 20713 32839 44804 26386
15884 26386 13887 7658 -118 -5447 16974 23446 162 -10942 -16552 -46433 -38169 -48573 -62823
15871 -62823 -65489 -25519 -34650 -34885 -24227 -14967 -30254 -27470 17218 35409 31046 25064 20668
15858 20668 8677 37840 25810 -1572 31526 28796 -531 -5676 17684 12084 -8116 -17318
15846 -17318 -2377 -15759 -40650 -35515 3623 -17636 -21340 -8336 -11744 -17966 -8975 9608 14693
15833 14693 -8741 -15638 20139 9300 4514 11090 41837 49276 38262 17067 -18912 -38549
15821 -38549 -29954 -37587 -36610 1639 23058 848 -22485 -29999 -10644 -19478 -33915 -23772 -3744
15808 -3744 15965 7778 -33061 -72189 -57477 -21504 3970 1934 5724 -278 13244 -6005 -35974
15795c5974J5069Q635J7700J0205n968K780R016J1851J1017l684k1290j0337q314
15782G06q385k606j9457m19l516l371K153J3747r261l812R09K231J3588K9765
15768A2272N846k2517j1693k5321J4098K8438L057N80n681J12J6712M853m234
15755A6522J142N474M960n521p09p783k2427j7512K0190J6524k268j427j4461
15742g296j3619K1940Q02r324k093k92O901J1560q579J4052J166O342k2225j7519
15728a8184J0625J2338k276j6405p099J5101L947j6140j1136J2283L6208J1289
15716C0551k788l9325j4937r624J1141K3062K798J3745J5964l3982j5884n932
15704b5211J8923L5369l5769j3614r506P911J5486L668n950p675J8245K6937K124
$$ plain form
15795 -35974 -20905 -12270 5430 15635 9667 12447 21463 33314 44331 40647 19357 9020 706
15782 706 -7679 -10285 -29742 -30161 -33677 -37048 -34895 -21148 -30409 -34221 -33312 -31081 -17493 12272
15768 12272 18118 -4399 -16092 -41413 -27315 1123 4180 4760 -921 -809 15903 20756 16522
15755 16522 17664 23138 28098 22577 21868 14085 -8342 -25854 -5664 10860 8592 7165 -7296
15742 -7296 -20915 1025 1827 -7497 -9590 -9882 -2981 8579 0 14052 15218 21560 -665 -18184
15728 -18184 -7559 4779 2503 -13902 -21001 -5900 -1953 -18093 -29229 -16946 19262 30551
15716 30551 27763 -11562 -26499 -36123 -24982 -1920 878 14623 30587 -3395 -19279 -25211
15704 -25211 -6288 29081 -6688 -20302 -29808 -21897 -6411 -2743 -8693 -16368 1877 28814 30938
15691C0938K576k7333j4595j2915O068K5047m276q230j2867L739J8398J7654j0030
15678A4174O146j5156q391m740k2094P654K7905q44m620O865K9824j9814k1792
15665d883j6941k552j2744R643J1839K236j1605r933J063r989j2721K315K8262
15652b6010P513O340K4732K264m361P009o034j161R664k5705J0837J4731J9309
15639C9128l542p802k049L747k393P647o689j0964m357j8257k6594n643J6025
15626b1743L3758L3309m104n523j1940J0428m019k8312m923K3194r989k1940J7554
15613E750K8539j3601R881k6459j6449j3947j6377O976J8323J1380j1012q342
15601b5338k1815L661R442M358P871J733q574K5721J8706O746L2286J1763j7711
$$ plain form
15691 30938 33514 6181 -8414 -21329 -15261 9786 5510 -2720 -15587 -11848 6550 24204 14174
15678 14174 20320 5164 -3227 -7967 -30061 -22407 5498 4654 34 6899 36723 16909 -4883
15665 -4883 -21824 -24376 -37120 -27477 -15638 -13402 -25007 -34940 -33877 -43866 -56587 -54272 -26010
15652 -26010 -18497 -12157 12575 14839 10478 17487 11453 10292 19956 -5749 5088 19819 39128
15639 39128 35586 27784 25735 29482 27089 34736 28047 17083 12726 -5531 -32125 -37768 -21743
15626 -21743 12015 45324 41220 35697 23757 34185 30166 1854 -3069 20125 10136 -11804 5750
15613 5750 34289 20688 30569 4110 -12339 -26286 -42663 -35687 -17364 -5984 -16996 -25338
15601 -25338 -47153 -43492 -34050 -29692 -21821 -20088 -28662 -2941 15765 22511 54797 66560 48849
15588D8849k6433m517k4642k1693k3587J5707O13J3813L0605j8590P264j6839
15576a9450r044q960K0255k850l48n287k647o488l0531j5772M178J1162j4034
15563g9816n807M1760M0493Q732j395r498j7967J4299Q864q488l982J1459K4511
15550B3165o107j8316j3005J0950J2441M433k86o991k0472m5489J2299J0469j1869
15537d8778l291J1559Q651M192K5426p828Q644J3684J4000p934J7324j6699m3761
15524b4811k93J7534J3389k7400j3759N656J3366K2021K1848j9659j0688n909
15512h705R088p124O329O796J1998K1885j3280L70j3774l0028k5252J2990P932
15499b0775j3438k2033J053r532J2024M0587K7441L448j5190k8296k8982K5372
$$ plain form
15588 48849 22416 17899 -6743 -28436 -52023 -36316 -35703 -21890 8715 -9875 -2611 -19450
15576 -19450 -28494 -37454 -17199 -20049 -20397 -25684 -28331 -34819 -65350 -81122 -76944 -65782 -79816
15563 -79816 -85623 -43863 -3370 5362 3967 -5531 -23498 -9199 -335 -8823 -12805 -1346 23165
15550 23165 17058 -1258 -14263 -3313 9128 13561 13275 6284 -14188 -59677 -47378 -36909 -48778
15537 -48778 -52069 -40510 -31859 -27667 -2241 -10069 -1425 12259 26259 18325 35649 18950 -24811
15524 -24811 -25104 -7570 5819 -21581 -35340 -29684 -16318 5703 27551 7892 -2796 -8705
15512 -8705 383 -6741 -412 6384 18382 40267 26987 27357 13583 -16445 -41697 -28707 -20775
15499 -20775 -34213 -56246 -55193 -64725 -52701 -12114 15327 18775 3585 -24711 -53693 -28321
15487b8321K0047O650k160J456j5026j4155K4004L0652j304j7111k1631j7542
15475c4441J5193K9075K6779K626l6516l1449K5767j8271Q413k808O866M696K406
15462a664l129K060L246J2437p426k5068J5372J8361k911k7036r074M196K4819
15449D183m112l335l670n700R837J5000j1654l8936R20J9379K4552l7k745j4863
15435a1181K6600J4814J0248J5228J034o817k8488j7781k2289k183p23j0563k4909
15422e7010l87L4532L1753O908j2494r992R646J8624m021j2104r481j4411p664
15409b6101J7043j9877P463J5254K9105J5749o64j6006J102m521L49P001q504
15396A7393k1989j085K203k5590J2K7477k785j7924L2588P073j5770k619l063
$$ plain form
15487 -28321 -8274 -1624 -3784 -2328 -17354 -31509 -7505 23147 21843 4732 -16899 -34441
15475 -34441 -19248 9827 36606 39232 2716 -28733 -2966 -21237 -12824 -15632 -8766 -4070 -1664
15462 -1664 -4793 -2733 513 12950 5524 -19544 -4172 14189 11278 -15758 -24832 -20636 4183
15449 4183 71 -3264 -6934 -12634 -2797 12203 549 -38387 -37467 -18088 6464 6427 3682 -11181
15435 -11181 15419 30233 40481 55709 56743 49926 21438 3657 -18632 -20815 -21538 -32101 -57010
15422 -57010 -57397 -22865 8888 15796 3302 -6690 2956 21580 17559 5455 -4026 -18437 -26101
15409 -26101 -9058 -28935 -21472 -6218 22887 38636 37972 21966 23068 18547 18896 25897 17393
15396 17393 -4596 -5681 -3478 -29068 -29056 -1579 -4364 -22288 10300 17373 1603 -1016 -4079
15383d079j335o159k2668j3257N44L5888K0907k5867J170N281Q320K584l67J1207
15369A2169J3329l5694j480j0804q700N322K142j12J4754k2450L9227J0731j482
15356A6952j5613P59N511K1212j5764j4752K4500K2183l183p853l459j230j6057
15343A3206K2602l859k1200P6O52O229r875j4122j778R140j1321K0107K1103q308
15329B2652m3441m896O792J4774p866k2534j0799J3223q20J0L1435k214l841j3413
15315b0938r002Q879J786R625q682P129k5408J5760K4038k895k7891j8033k860
15302d8492J7635O832o741n805j2589M266m820m632J876M576L6058r04j4675L890
15288b3525J3646K6467J9897k1284k6680o925K1919j5881j9310J0604K0542J3082
$$ plain form
15383 -4079 -5414 -11573 -34241 -47498 -46954 -11066 9841 -16026 -14856 -9575 -1255 1329 962 12169
15369 12169 25498 -10196 -11676 -22480 -31180 -25858 -23716 -23828 -9074 -31524 7703 18434 16952
15356 16952 1339 2098 7609 28821 13057 -1695 22805 44988 41805 33952 30493 29263 13206
15343 13206 35808 31949 10749 10825 11477 17706 7831 -6291 -8069 1071 -10250 9857 30960 22652
15329 22652 -20789 -25685 -18893 -4119 -11985 -34519 -45318 -32095 -32915 -32905 -1470 -3684 -7525 -20938
15315 -20938 -29940 -21061 -19275 -9650 -18332 -11203 -36611 -20851 3187 292 -27599 -45632 -48492
15302 -48492 -30857 -24025 -30766 -36571 -49160 -44894 -49714 -54346 -52470 -47894 -11836 -12740 -27415 -23525
15288 -23525 -9879 16588 36485 15201 -11479 -18404 3515 -12366 -31676 -21072 -530 12552
15276A2552j2569K2615k6222k5332j9383J0553j2117j0225J5061N47L2200R463
15264b857j2463j9439j8944L1245K6571J220n099J7450j2218j6645J94k943n316
15251a9244n899j4072j7167O823Q390L570K816O639L6928N26P976o185j6974Q295
15237B422n245J0756K769j5919k9961L731L415l175R45P485M216Q138o28L854
15223g197n125M0194j1991j8367l4121N366J7178J8114j063l219R093J376n941
15210D297o28N948k6911j2363j4661J5829L6019j3679J1191K0694k6068l1572
15198c1904j3909o16K022J2451J9818L094l0539j9914K7384K7491J255K8130K1261
15185D6024J0721k0730m668q847k4989n86Q864j609l2535n832K7385J5445o841
$$ plain form
15276 12552 -17 22598 -3624 -28956 -48339 -37786 -49903 -60128 -45067 -44520 -12320 -2857
15264 -2857 -15320 -34759 -53703 -22458 4113 5333 234 17684 5466 -11179 -10985 -13928 -19244
15251 -19244 -25143 -39215 -56382 -49559 -41169 -37599 -34783 -28144 8784 9310 17286 11101 -5873 2422
15237 2422 -2823 7933 10702 -5217 -35178 -31447 -28032 -31207 -30262 -22777 -18561 -10423 -11051 -7197
15223 -7197 -12322 27872 15881 -2486 -36607 -31241 -14063 4051 2988 -231 8862 10238 4297
15210 4297 3669 9617 -17294 -29657 -44318 -28489 7530 -6149 5042 25736 -332 -31904
15198 -31904 -45813 -46429 -44407 -31956 -12138 -9044 -39583 -59497 -32113 -4622 -3367 24763 46024
15185 46024 56745 36015 31347 22500 -2489 -3075 5789 4180 -28355 -34187 -6802 8643 1802
15172A802m049o45o971J0489J081Q274J1860o924o551m281O655j1245j3601O928
15158g178j8893K271J5736p003n845p173K3497j3170j7449k918j61k25J8532p06
15144b0685J6211L491k374j6573J1573L699k2089M705L0063l718j6356J5932J2325
15131A6204J2905K6943L189l1787k653j70j9744p493p747j205k2282o998R117
15118c1721M858p611j0063K7510K503j925k1328L0266K6986j4984r351k7009J401
15105c0468Q175K8531J4871L687p652k673k610j3047N839j938r782L0323k110
15092B1146j8562r220j71P253Q79K5479K0105j7187j4062J556q3K2657k576k0291
15078A6923j5762q506K3002P987j1485j1654j8981k6026j0515J5782K2519K4556
$$ plain form
15172 1802 -2247 -2892 -9863 626 1707 9981 21841 14917 8366 4085 10740 -505 -14106 -7178
15158 -7178 -26071 -23800 -8064 -15067 -20912 -28085 -4588 -17758 -35207 -38125 -38286 -38511 -19979 -20685
15144 -20685 -4474 -983 -3357 -19930 -8357 -4658 -26747 -22042 8021 4303 -12053 3879 16204
15131 16204 29109 56052 59241 27454 24801 24631 4887 -2606 -10353 -11558 -33840 -40838 -31721
15118 -31721 -26863 -34474 -44537 -17027 -14524 -16449 -37777 -7511 19475 4491 -4860 -31869 -30468
15105 -30468 -22293 6238 21109 24796 17144 14471 11861 -1186 4653 2715 -7067 23256 21146
15092 21146 2584 -6636 -6807 446 1325 26804 46909 29722 15660 17216 17133 39790 37214 16923
15078 16923 1161 -7345 15657 23644 12159 505 -18476 -44502 -55017 -39235 -16716 7840
15066G840j6768k9566M004K2014J2982q453j0531J7814N512L423j278l286j3190
15053i483j380K590K3903K6699l4967q986j2288R034o317j5396J2642J0683K3766
15040B0500j6980j7157j8213Q735q151P222J5727K9639L063l8258m126R747L0104
15027B1852K1069p17M254m671j9937j8323M447L4109j3891k8174k0989j2504M217
15014b9258J5904n664K3323J4660p865j4693K4764J985l6327M2162L5468j9632
15002D4827k5211j5172P6K8976J2912L432J7269j5711n3947k3266J2220o53P554
14989f694K7422j316Q990k5426j9732J3070K0475O054K8592p144k4276n996r672
14976D347J8404p389l386N5l876r63j4107O314k5887r511R724O836M523k3140
$$ plain form
15066 7840 -8928 -38494 -34490 -12476 506 -7947 -18478 -664 4848 8271 6993 3707 -9483
15053 -9483 -10863 -8273 15630 42329 7362 -1624 -13912 -4878 -11195 -26591 -13949 -3266 20500
15040 20500 3520 -13637 -31850 -23115 -31266 -24044 -8317 21322 24385 -13873 -17999 -8252 21852
15027 21852 42921 42204 46458 41787 21850 3527 7974 42083 28192 18 -20971 -33475 -29258
15014 -29258 -13354 -19018 4305 18965 11100 -3593 21171 23156 -13171 28991 64459 44827
15002 44827 19616 4444 4520 33496 46408 49840 67109 51398 -2549 -25815 -13595 -14248 -6694
14989 -6694 20728 19412 28402 2976 -16756 -3686 16789 22843 51435 44291 20015 14019 4347
14976 4347 22751 15362 11976 12031 8155 7192 -6915 -601 -26488 -35999 -26275 -19439 -14916 -38056
14962c8056J2563P346J2600R764j2738O02K7651R86R595k9016j4088l8480p618
14949e8889J8255J9988Q879J8716K3989J2549P341l2427l2952J1452J6297kK336
14936A5532r054J2430j2415q690j4102k5052J2140j5440L154K1944J0733j082
14924i902k2067P583J3685m439J293K56l6554j4697J9163K5393o806k9382Q304
14911d8170M8308n201N27j1831j6219O82J7955K7159j7670k2383p972Q859K5329
14898f27M94J328m549q345K3371m394k3340K4147K7302J8406j4778j9822n331
14885A3862q076J1110O676j2601q41l6301J997K6653K3338M835j26j8878J8046
14872B9694J3311O479j8517o011j0299k0863k7129K9058J5025J6975r767O012
$$ plain form
14962 -38056 -25493 -18147 -5547 4217 -8521 -7919 19732 20718 30313 1297 -12791 -51271 -58889
14949 -58889 -40634 -20646 -11767 6949 30938 43487 50828 18401 -14551 -3099 13198 13196 15532
14936 15532 6478 18908 6493 -2197 -16299 -41351 -29211 -44651 -41497 -19553 -8820 -9902
14924 -9902 -31969 -24386 -10701 -15140 -13847 -13591 -50145 -64842 -45679 -20286 -27092 -56474 -48170
14911 -48170 138 -5063 -4536 -16367 -32586 -31904 -13949 13210 -4460 -26843 -34815 -25956 -627
14898 -627 -133 1195 -3354 -11699 11672 7278 -16062 8085 35387 53793 39015 19193 13862
14885 13862 5786 16896 23572 10971 10130 -26171 -24174 2479 25817 30652 30526 11648 29694
14872 29694 43005 49484 30967 24956 14657 -6206 -33335 -4277 10748 27723 17956 23968
14860B3968K111k5837j6204l746M334l872P919J7194N645K1440q511j1283J552
14847A4710l276K721j5276j08J4330M706J9607L2274j3792l0890k6190j8871j8492
14834c8547r441L7235K7013r409L192k7407r738J1196k3321J7919J9949j6498
14822a7857j3987K1413O435K9566K085r819l111P571n483j8518O799q993j0252
14809a4151L7871K909j1672j6742q463l724r168j1561J698K5891J8786M546j9798
14796c578l6635M838L0104P970R334M828p627k5437k079P952j1987J6434N5632
14783D9749o835l8610Q110R977j9525j9647L478P495K3893k121k9673k614J5551
14770g72q629j8873O623p777k8941j0082P924L339P244J0490L2485J7182p10j0270
$$ plain form
14860 23968 26079 242 -15962 -19708 -15374 -19246 -11327 5867 11512 32952 24441 13158 14710
14847 14710 11434 14155 -1121 -1229 13101 17807 37414 69688 55896 25006 -1184 -20055 -38547
14834 -38547 -47988 -10753 16260 6851 10043 -17364 -27102 -15906 -39227 -21308 -1359 -17857
14822 -17857 -31844 -10431 -3996 25570 27655 17836 14725 22296 16813 -1705 5094 -3899 -14151
14809 -14151 23720 26629 14957 -1785 -10248 -13972 -23140 -34701 -33003 -7112 11674 16220 -3578
14796 -3578 -40213 -35375 -5271 2699 12033 16861 9234 -16203 -18282 -10330 -22317 -5883 49749
14783 49749 42914 4304 12414 22391 2866 -16781 -13303 -5808 18085 15964 -13709 -16323 -772
14770 -772 -9401 -28274 -21651 -29428 -58369 -68451 -60527 -57188 -49944 -39454 -6969 10213 9503 -767
14756g67o850j5598J2480Q728M697p294p774M1834L0624l4159k1908r472p531
14743a2990N980P410M240J1697J4426k3883j3447L8187J3776r805l436l7166K76
14730d735k255k997J959J1492q153K0224L764J3653R287J999j3076j3812J5499
14717C2849M58k3773j1887J160J5241q874j1467J884j3287q89L464L5302K1972
14704D2153j3271l1707k2232J5880N43j654J873j1923m680K067K2004J4147k324
14691A0876k8734N807K4562j140k5324P021J9460J1620R883j3619j7935J9585
14679B2062O319j8047k5410k0855n83K0864L8457N73l8887j0502R236L1842N581
14666B0650j4053j7135r201j1022J3513j0574P763K2229L79N806k0504j6268R929
$$ plain form
14756 -767 -7617 -23215 -10735 -2007 2690 -4604 -12378 29456 60080 25921 4013 -5459 -12990
14743 -12990 -7010 400 4640 16337 30763 6880 -6567 31620 45396 35591 32155 -5011 -4735
14730 -4735 -6990 -9987 -8028 3464 -4689 15535 19299 32952 42239 44238 31162 17350 32849
14717 32849 33307 9534 -2353 -1193 14048 5174 -6293 -4409 -17696 -18585 -15121 20181 42153
14704 42153 28882 -2825 -25057 -9177 -8634 -10288 -8415 -20338 -25018 -22951 -947 13200 10876
14691 10876 -17858 -12051 12511 11371 -13953 -6932 12528 24148 34031 20412 2477 22062
14679 22062 28381 10334 -15076 -35931 -36514 -15650 22807 23380 -15507 -26009 -16773 15069 20650
14666 20650 6597 -10538 -19739 -30761 -17248 -27822 -20059 2170 2549 8355 -12149 -28417 -18488
14653a8488K5553J2289j6101K7242K6465J671j2823O156j4857k1398k0015k2181
14641b6487l8189J1321L7462j0151J0331o291J5080R669J1823P13m1933K7820
14629A168L2689j6322j9435L610j4816m545R197k963m333q663K6416M1695K1023
14616F4721o3385k9495L2501M3948j1205n1048K2478J3396n218j5944j1133j6631
14604b7015N39O70l638m387J8217L8362K3527o705k8962k5598J827J6000j7675
14591a4838O630q322O53L098l831K42J5435L913J2518j6872j0134K508K6449J8271
14577C5720j3700J1202L233n357O701k0113k3334q893n005K90J2283j2049M729
14564a4293m625K5560M21k1764O285p248n051Q567J6838Q324j3925j3501J0368
$$ plain form
14653 -18488 7065 19354 3253 30495 56960 58631 45808 51964 37107 15709 -4306 -26487
14641 -26487 -64676 -53355 -15893 -26044 -15713 -22004 -6924 2745 14568 15281 -26652 1168
14629 1168 33857 17535 -1900 1710 -13106 -17651 -8454 -11417 -15750 -24413 2003 43698 64721
14616 64721 1336 -28159 4342 48290 37085 -13963 8515 21911 16693 749 -10384 -27015
14604 -27015 -26476 -25806 -29444 -33831 -15614 22748 46275 39570 10608 -14990 -13163 2837 -14838
14591 -14838 -8208 -16530 -15877 -12779 -16610 -16368 -933 2980 15498 -1374 -11508 -9000 17449 35720
14577 35720 22020 33222 36455 31098 37799 17686 -5648 -14541 -19546 -19256 -6973 -19022 -14293
14564 -14293 -18918 6642 7063 -14701 -8416 -15664 -20715 -12148 4690 13014 -911 -14412 -4044
14551d044L792j4948K126J6300K40jM224J5599J2861j2751k8046j3151j1146R136
14537a9809k448M893o462J9091J7924n024k3444K300J4105P382o623l5670n938
14524c9723J0977P154J7128p828j037j1674k3343k0877J2819L0391J3659J1470
14512h84L654R771m456j3440Q116j1595p115k879q904j0144J4260O538n793J3520
14498i351K0870j0600k911J574J3977q955k3727J453K8819O532M520Q393k5105
14485E489l1470M839N17m216m907j1108R759J8762K1514k513N81L275N625M670
14471B0817k117p294k4710j1585j3315k6215J016K6219K8807K6485L100j2563
14459H645j0436j5730J2335J9635M202k635j3094j7436l1292M801Q98J2149n650
$$ plain form
14551 -4044 -252 -15200 -13074 3226 3466 3465 7689 23288 36149 23398 -4648 -17799 -28945 -19809
14537 -19809 -22257 -17364 -23826 -4735 13189 8165 -15279 -12979 1126 8508 1885 -33785 -39723
14524 -39723 -28746 -21592 -4464 -12292 -13329 -25003 -48346 -69223 -56404 -26013 -12354 -884
14512 -884 2770 12541 8085 -5355 2761 -8834 -15949 -18828 -27732 -37876 -23616 -17078 -22871 -9351
14498 -9351 11519 919 -1992 -418 13559 4604 -19123 -17670 11149 17681 22201 30594 5489
14485 5489 -25981 -21142 -20625 -24841 -29748 -40856 -31097 -12335 9179 6666 7247 10522 16147 20817
14471 20817 18700 11406 -13304 -24889 -38204 -64419 -63403 -37184 -8377 18108 21208 8645
14459 8645 -1791 -17521 -5186 14449 18651 16016 2922 -14514 -45806 -41005 -40107 -27958 -33608
14446c3608L919J8105j20P690l820o320l709P5J1390N5124r569j2796J8446j7296
14432B7511q813j3931k5368L961K6620L0373Q953j8457j7189p50M959k2545k7128
14419c1804M85J2959K5323R455j7063J8489k2394j565r699l461K592Q719J8186
14406A0222J1288J1876J2677j5297j8437k1058J5607J8482l790k0329p647j8192
14394b4598k9383l33K4002K2444o558l5426m505K0421K2953k1782j030K2917N018
14381e860q179o164K687K6898R084n231j588j4450j9119k6511J9900l385P896
14368b4022j452J8600K7667R876j9696m216o997K620K1168J9111L0173k4392j8720
14355B9720P49m732k3871Q772K262J9398P108J0987j9267l4450L791j795M724
$$ plain form
14446 -33608 -29689 -11584 -11704 -4014 -7834 -14154 -17863 -17788 -6398 48726 39157 26361 44807 27511
14432 27511 18698 4767 -20601 -16640 9980 40353 49306 30849 13660 12910 17869 -4676 -31804
14419 -31804 -31319 -18360 6963 16418 -645 17844 -4550 -6115 -15814 -19275 -16683 -7964 10222
14406 10222 21510 33386 46063 30766 12329 -8729 6878 25360 21570 1241 -6406 -24598
14394 -24598 -53981 -54314 -30312 -7868 -14426 -49852 -54357 -33936 -10983 -32765 -33795 -10878 -5860
14381 -5860 -14039 -20203 -17516 9382 18466 13235 11647 -2803 -21922 -48433 -28533 -31918 -24022
14368 -24022 -25474 -6874 20793 30669 10973 6757 -240 2380 23548 42659 72832 48440 29720
14355 29720 30469 25737 1866 10638 12900 32298 39406 50393 31126 -3324 467 -1328 3396
14342C396j6441N988Q469K4363k2176j4612Q57k69J0571N475K3737j8148k619
14329H591o907J563R212m455l5118l5501J7826L1241K5732J6509j6775m909n691
14316A318M822j0165j2278L086J6875K431j5760J9155N631m260r918K2103K7790
14303E0830k079m0323m80K3672J74k1987k4934M303J1532q984N820K0109k968
14290A4685Q003k606l0601K569Q135j3950p866O139J1392J2593Q933p845k7614
14277a8033j5040J3839L6435K439O173K6196k6292K576o213M131L131j4941j0558
14264C843k4709K0093M4192J2992k2672j7260j1746o381J8397K8445j962k9184
14252A4048k6910q560k7726n801L2495K3290Q503p039m472J027p900N857K5201
$$ plain form
14342 3396 -13045 -7057 1412 25775 3599 -11013 -10156 -10425 146 5621 29358 11210 8591
14329 8591 1684 3247 12459 8004 -27114 -62615 -44789 -13548 12184 28693 11918 7009 1318
14316 1318 6140 -4025 -16303 -13217 3658 6089 -9671 9484 15115 10855 937 23040 50830
14303 50830 48751 8428 7948 31620 31794 9807 -15127 -10824 708 -8276 -2456 17653 14685
14290 14685 22688 20082 -10519 -7950 185 -13765 -21631 -15492 -4100 8493 17426 9581 -18033
14277 -18033 -33073 -19234 17201 19640 25813 52009 25717 28293 22080 26211 29342 14401 3843
14264 3843 -20866 -773 43419 56411 33739 16479 4733 -1648 16749 45194 43232 14048
14252 14048 -12862 -21422 -49148 -54949 -22454 836 9339 2300 -2172 -1145 -9045 -3188 22013
14239B2013j0642k0453J2410J7577j5779j4559j7642j8238j7061J2999J998K4961
14227b2416R955o932q956J2277J0411J2328R995j3405m25J2296J3975K2561j3948
14214C7716l4552k7485j018J9723Q388j457J65j0902k5608P893K4068j812R696
14201D815m739j6088J943M663N57K6111k0939J885k234M215P060m447N637j6629
14187h190j0795l427K2075J0169o847j664K7904N144j6241o363j2179l535R606
14174E657K2393m887O645o40j6278l949j6313k9168Q998L6986J4836R200k0244
14161A3236k2830P758k1889O480J6081R678k0819k0385J8411j2863n424o224J6211
14148b2579P191j946J0717K2936K0801j3967n103o651k1668J1490J3330j3837
$$ plain form
14239 22013 11371 -9082 3328 20905 5126 -9433 -27075 -45313 -62374 -49375 -47377 -22416
14227 -22416 -12461 -19393 -28349 -16072 -5661 6667 16662 3257 2832 15128 29103 51664 37716
14214 37716 3164 -24321 -25339 -5616 2772 1315 1480 -9422 -35030 -27137 -3069 -4881 4815
14201 4815 76 -16012 -14069 -9406 -8849 17262 -3677 -1792 -4026 189 7249 2802 8439 -8190
14187 -8190 -18985 -22412 -337 9832 2985 1321 29225 34369 18128 11765 -414 -3949 5657
14174 5657 28050 23163 29808 29168 12890 8941 -7372 -36540 -27542 9444 24280 33480 13236
14161 13236 -9594 -1836 -23725 -17245 -1164 8514 -12305 -32690 -14279 -27142 -32566 -38790 -22579
14148 -22579 -15388 -17334 -6617 16319 37120 23153 18050 11399 -10269 1221 14551 714
14136G14k4451P92M53k421J4562k794J6899o806m702j195L2388J8094j2783J6444
14122D5194p753q311o994o749k2000k8066M967K152m79j6564J0851P164M565j88
14108b2211Q229J2598m192o520n851j5031J2712K1050J5980j7754k4395J6284
14096i101j217j6469j5962M342l047j0992m961K2645J0586K2983j896q445N0229
14083C8695j9911m806K589k2339Q275l21K033p119J8371O852l642j0137j3335
14070d795j9309n609K296K567J4077K7683j294k8396j6753J2143Q256K532k1056
14057b7658R999K2069L766q920p779O917J9608j1709j2836j807P904J6170j2747
14044B977j2536m087J9182J301j9172o038j5820j7396P230K3617K9963p671J4531
$$ plain form
14136 714 -23737 -22945 -22492 -24913 -10351 -13145 3754 -3052 -7754 -8949 23439 41533 28750 45194
14122 45194 37441 29130 22136 15387 -6613 -34679 -29712 -27560 -28039 -44603 -33752 -26588 -22023 -22211
14108 -22211 -13982 -1384 -5576 -12096 -17947 -32978 -20266 784 16764 -990 -25385 -9101
14096 -9101 -10318 -26787 -42749 -38407 -41454 -52446 -57407 -34762 -24176 -1193 -3089 -11534 38695
14083 38695 18784 13978 16567 -5772 2503 2182 4215 -2904 15467 22319 18677 8540 -4795
14070 -4795 -24104 -29713 -27417 -24850 -10773 16910 15616 -12780 -29533 -17390 -9134 -6602 -27658
14057 -27658 -17659 4410 8176 -744 -8523 -1606 18002 6293 -6543 -8350 -446 15724 2977
14044 2977 -9559 -13646 5536 6837 -12335 -18373 -34193 -51589 -44359 -20742 9221 1550 16081
14031A6081j2943o821J9261r690J0619J3017k240p499k454o84l411J1048J2671
14018C6955L136J0249r916j8847k775M781J0500M754M2359K9251Q786O337j20
14005A25450P49n607m142l0795k5015j7978Q631l156j257r301l1420p561m099
13992e501K3077K3666j7150k4890j1164K29j7710J4125O617K695N167l5551J059
13979c5331L4105J5216j7224J3546J2243k0207N025j4739K938J0723j5135M824
13967d016M489k1723k2011J02K5037J9336j6458j5316l834k969L475l886K4263
13954a3511K3563J2362p349J7200m517N645m008P623j1473m6587k171J8606k54
13941d871O676R057q620j9274j696l571j621J6806P185J0468j0196j9076K0667
$$ plain form
14031 16081 3138 -3683 15578 5888 16507 29524 27284 19785 17331 16647 13236 24284 36955
14018 36955 40091 50340 40424 21577 18802 23583 34083 38837 81196 110447 119233 125570 125450
14005 125450 126199 120592 116450 85655 60640 42662 51293 48137 46880 37579 6159 -1402 -5501
13992 -5501 17576 41242 24092 -798 -11962 -11733 -29443 -15318 -8701 -6006 -839 -36390 -35331
13979 -35331 -1226 13990 -3234 10312 22555 2348 7373 -7366 -4428 6295 -8840 -4016
13967 -4016 473 -21250 -43261 -43159 -18122 1214 -15244 -30560 -34394 -37363 -33888 -37774 -13511
13954 -13511 10052 22414 15065 32265 27748 33393 29385 37008 25535 -21052 -23223 -4617 -4871
13941 -4871 1805 10862 2242 -17032 -18728 -22299 -23920 -7114 71 10539 343 -18733 1934
13928A934m657m587l517M248K1145K916j3630o25j0562q617l823N086j1680j633
13914b8002N349p287r077j8791J8937J7557q031l881K108J6004J0761q840O159
13901g034j33p83J0649o99K5640L1067k9984l9615K962K7674L741J9243k2577
13888B0151l2538k0854o568M151P251J8536P981l0590Q434M586R713j19j3647
13875b3513j980J6088J1741j6909m2686R123J8185j4620l28J076J0145J0238K408
13862b1032J4555M6177J2706n652p904k8325k0616j4104M60J0148R696l5406J5852
13849b3445J1080k862P123J2447k7085r303J9206j1577M898K6015K4136q628m1099
13836a9094m966Q606J4155J4114j2416O921o262p704L670J1292J110O034L3893
$$ plain form
13928 1934 -2723 -7310 -10827 -6579 14566 17482 3852 3227 -7335 -15952 -19775 -14689 -26369 -28002
13914 -28002 -22653 -29940 -39017 -57808 -38871 -21314 -29345 -33226 -31118 -15114 -4353 -13193 -7034
13901 -7034 -7167 -7950 2699 2000 27640 58707 28723 -10892 -7930 19744 23485 42728 20151
13888 20151 -12387 -33241 -39809 -35658 -28407 -9871 -1890 -32480 -24046 -19460 -9747 -9866 -23513
13875 -23513 -25493 -9405 2336 -14573 -57259 -48136 -29951 -44571 -44899 -43823 -33678 -23440 -21032
13862 -21032 -6477 39700 52406 46754 38850 10525 -10091 -24195 -23735 -13587 -3891 -39297 -23445
13849 -23445 -12365 -15227 -8104 4343 -22742 -32045 -12839 -24416 -19518 6497 30633 22005 -19094
13836 -19094 -24060 -15454 -1299 12815 399 7320 1058 -6646 -2976 8316 9426 15460 49353
13823D9353M663l954K019j30N192k6072j1216q162O817J431l383j9655L610k3015
13809b2502k0692j191k046L332k931M91K7480K7344K3456J4992j6140k2743j7831
13796h981p922k1122J057J3716M411j6344q018J0920K3913j837J3074J4645L412
13783B0924j5837l5941N769L4397K5399j5983N078K2031j606l5082k9455L625
13771a6681K8908J825r334J3854P339K112J9200k3178n347k529M771K23J6339
13758C7502M226k9299R458K6172j252k1158j8113r693P95R980P230J6229k6357
13745E720j1259R514K3802J791N760K0316J422k2864l2347J4227P745mM661k213
13731B6271L61j3977P626l3087j1134k858K1820J6706l4663n697K5276p343J383
$$ plain form
13823 49353 54016 50062 52081 51951 57143 31071 19855 11693 18510 19941 16558 -3097 513 -22502
13809 -22502 -43194 -44385 -46431 -43099 -46030 -45539 -18059 9285 32741 47733 31593 8850 -8981
13796 -8981 -16903 -38025 -36968 -23252 -18841 -35185 -43203 -32283 -8370 -10207 2867 17512 20924
13783 20924 5087 -30854 -25085 9312 34711 18728 23806 45837 44231 9149 -20306 -16681
13771 -16681 12227 14052 4718 18572 25911 28023 47223 24045 18698 16169 20940 21163 37502
13758 37502 41728 12429 21887 48059 46807 25649 7536 -2157 -1362 8618 15848 32077 5720
13745 5720 -5539 3975 27777 29568 35328 55644 57066 34202 1855 16082 23827 23823 28484 26271
13731 26271 26632 12655 20281 -12806 -23940 -26798 -4978 11728 -22935 -28632 -3356 -10699 -9316
13718i316o574m41P065K8479K716j9710M417M28j4994l144J2329J4059J0181M893
13704C0388j8599L7M271j6583L3993J5979J7636l0841k9183l1686N902k959l4805
13691e6450K0762K4758J1735r823j9824R847q050n820K5458K1401J3852L628J8877
13678E0351j4827j5920l2609o363K0649K3837j3386n172o693p214M808J7826Q501
13665B3788J4994l205k0493j9094j3065J0653j2288J1641J9127K2161M346l5641
13653B924j6140k622N335L503J9884L6669K4883j7123m2284J3472k867J5588P497
13640D8719J0791J0268j4497k0722m823K3177O523j1256m0200j124J2969k648
13628A7177J0324k83k8240O589J278r318j3747J8005K1477M214q893k2695K749
$$ plain form
13718 -9316 -15890 -16331 -9266 19213 21929 2219 6636 7064 -7930 -11074 1255 15314 25495 30388
13704 30388 11789 11826 16097 -486 33507 49486 67122 36281 7098 -24588 -18686 -21645 -56450
13691 -56450 -35688 -10930 805 -9018 -28842 -18995 -27045 -32865 -7407 13994 27846 31474 50351
13678 50351 35524 19604 -13005 -19368 1281 25118 11732 6560 -133 -7347 -2539 15287 23788
13665 23788 38782 35577 15084 -4010 -17075 -6422 -18710 -7069 12058 34219 38565 2924
13653 2924 -13216 -15838 -10503 -7000 12884 49553 74436 57313 15029 28501 25634 41222 48719
13640 48719 59510 69778 55281 34559 29736 52913 59436 48180 7980 6856 19825 17177
13628 17177 27501 27218 -1022 5567 6845 -2473 -16220 1785 23262 27476 18583 -4112 -1363
13615a363o686j179j0216J7748j5848j9849L0535M156q460J6389J8324k01j6899
13602F451O892j0062j4676j6264J8619K559j6514k5879K6943M382J3990J5863
13590A2304J4458j3119j6957M884P296m882j4335j1640L142J7686O531J3331J2213
13577C0912j5943k7746j8350j087J9938o753l276K78R236P215j2624j4257J5384
13564a7073J5007j1115m680K2528p787k559L3984J882l3688L460j4500R542j8642
13551b3641k7037K2113L8110j6406k6991P865M5999L0730j4533m0022j0442J9905
13539E650O4098q081N23J2091j3233k7787j6731k8542K4043J9713k332k0898r15
13526G599N655K1873L7291j8347n2104j8153L3305J0278L0573k9042j3214k8643
$$ plain form
13615 -1363 -8049 -9228 -19444 -1696 -17544 -37393 -6858 -2702 -11162 5227 23551 23350 6451
13602 6451 13343 3281 -11395 -27659 -9040 -6481 -22995 -48874 -21931 -17549 -3559 12304
13590 12304 26762 13643 -3314 1570 8866 3984 -10351 -21991 -18849 -1163 5368 18699 30912
13577 30912 14969 -12777 -31127 -32214 -12276 -19029 -22305 -22027 -12791 -5576 -18200 -32457 -17073
13564 -17073 -2066 -13181 -17861 4667 -3120 -5679 28305 30187 -3501 -41 -14541 -4999 -23641
13551 -23641 -50678 -28565 9545 -6861 -33852 -25987 20012 50742 36209 -3813 -14255 5650
13539 5650 69748 61667 62190 74281 61048 33261 16530 -12012 12031 31744 29412 8514 7599
13526 7599 13254 35127 72418 54071 1967 -16186 17119 27397 57970 28928 15714 -12929
13514a2929m4078J7847L5396J254p504j0620L639J9736q565q711J6910J0458R1
13501A2924n619m534R250Q987m297N988N125J9684j3188m1177k4703J5357L9065
13488B2862p413l0907j3754J8169J3522K506k0986k8721L3900M351j740j3467
13476b1678J1877J039J7442P21J809J1902l168p94N385P565J670K8336j5632k5749
13462B0725K630K3477q873k4003N177k444k4289j0504j3612M527J1830l75J0366
13449e368k1689j1668J8078R311Q107J9850k238k2839j8730k9378L4899K4018
13437B353Q237Q432Q15k8403k740m699P984j1568j4741j3952R806K0804N25k9843
13423d6990k0861P993K6734k8554N905J8575K8616P085n763r023L600J1039J1978
$$ plain form
13514 -12929 -57007 -39160 -3764 -2510 -10014 -20634 -16995 2741 -5824 -14535 2375 12833 12924
13501 12924 7305 2771 12021 21008 16711 22699 27824 47508 34320 -6857 -31560 -16203 22862
13488 22862 15449 -15458 -29212 -11043 2479 4985 -16001 -44722 -10822 -6471 -8211 -21678
13476 -21678 -9801 -8762 8680 9401 11210 23112 19944 19150 24535 32100 33770 62106 46474 20725
13462 20725 23355 46832 37959 13956 19133 16689 -7600 -18104 -31716 -27189 -15359 -15734 -5368
13449 -5368 -27057 -38725 -20647 -11336 -3229 16621 14383 -8456 -27186 -56564 -21665 2353
13437 2353 10590 19022 19837 -8566 -11306 -16005 -8021 -19589 -34330 -48282 -38476 -17672 -17147 -46990
13423 -46990 -67851 -59858 -33124 -61678 -55773 -37198 -8582 -1497 -7260 -16283 -12683 -1644 10334
13410A0334R877J0476j8918P94J9200J7221J380k5451j6400J0307n087r726J1408
13397A5415K2358M541n405r032n504j6485K1394k6087q039O479K5510k282O408
13384B9271j1778k2114K2831J2133j7624j0720k0373Q923J2751J8609J5951M106
13372D1966j7638k9520p810m715M1489K5744j7704k7230k2622p91J0048l138K794
13359i127l424n1k5139O450J4913M188l8942k9952j0714L1386L4808P408J9557
13346A361j2510K002Q082J1269R304j8245J050p524O609J3022k4162j1720M9006
13333B7544k970l0694m7966l0542J8872p94J5094L3025K0410N715q430k1097k0782
13320d2615j113J7027J9874j3523j7103L8571J12j3802n016K745j1950j8528P836
$$ plain form
13410 10334 20211 30687 11769 12563 31763 48984 50364 24913 8513 18820 13733 4007 15415
13397 15415 37773 42314 36909 27877 22373 5888 27282 1195 -6844 -365 25145 22863 29271
13384 29271 17493 -4621 18210 30343 12719 1999 -18374 -9451 3300 21909 37860 41966
13372 41966 24328 -5192 -13002 -17717 23772 49516 31812 4582 -18040 -18831 -8783 -11921 -9127
13359 -9127 -12551 -12602 -37741 -31291 -16378 -12190 -51132 -81084 -91798 -60412 -25604 -18196 1361
13346 1361 -11149 -9147 -1065 10204 19508 1263 2313 -5211 1398 14420 -9742 -21462 27544
13333 27544 24574 -6120 -54086 -84628 -65756 -66550 -51456 -18431 1979 7694 -736 -21833 -42615
13320 -42615 -43728 -26701 -6827 -20350 -37453 1118 1230 -12572 -17588 -14843 -26793 -45321 -37485
13307c7485K0934L2124j370K0670j8465j6719l900j1803K460J1151J6292P171
13295B1060L4398J7804j6327j0681m3330l0831K7241J9871j5671j3054K3175P310
13283B0965p303k823r583P268p566j2198J4114l411l702m214L631J4737J5139
13270B5054n597k9349j4743J2152j397l883K0456J5148j768j4795l945k624J6759
13257A1468j0164j046m300R812K3430J2257j7382j9410l401N135J400j0154j510
13244c865o11j1351P182N701k6536k0225j4739K8367L4304j7667l0200M1665L0673
13231B2698p492p293k2737l338J7276j5256J0630K2311j1122j6625J3972K1216
13219B4240J9446l6697J1617l1257k3641J9128J5193P375j1440J9869K2926j4274
$$ plain form
13307 -37485 -16551 15573 14203 34873 16408 -311 -4211 -16014 -13554 -2403 13889 21060
13295 21060 55458 73262 56935 46254 2924 -27907 -666 19205 3534 -9520 13655 20965
13283 20965 13662 10839 1256 8524 958 -11240 2874 -537 -4239 -8453 -4822 9915 25054
13270 25054 19457 -9892 -24635 -12483 -13880 -17763 2693 17841 16073 1278 -2667 -5291 11468
13257 11468 1304 258 -4042 5770 29200 41457 24075 4665 1264 6399 7799 -2355 -3865
13244 -3865 -4476 -15827 -8645 -2944 -29480 -49705 -64444 -36077 -1773 -19440 -49640 -7975 22698
13231 22698 15206 7913 -14824 -18162 -886 -16142 -5512 16799 5677 -10948 3024 24240
13219 24240 43686 6989 18606 -12651 -36292 -17164 -1971 5404 -6036 13833 36759 22485
13207B2485k8935N338J0279J9996p302k7299j1965R452j1009J0039n963j7207
13195c2091J4457Q732R875L092Q40k2748j471J027M1672Q711j1834P052J2800
13182D0114k3144Q875n262l836k7332R964Q960L0266J0002j9155j8149J6636j3716
13169A4223m0867j0688J6299J9968p292j0818j0407R891R020J378L6113J1813
13157C8633j5003N977j3484l1401J0037K3917k332j8387l019J2192K2064J0357
13145C9551r099p484j7969J1177N445k4069m476M173J0892M496p85q723J783J7267
13131B2179p1n762l382l2767N696j4419n072J2057J9271j3992k0926J0789l673
13118c0072J8625L1046j2315k3660o762Q42J5753m073J2306p431J3223L893J1954
$$ plain form
13207 22485 -6450 -1112 9167 29163 21861 -5438 -17403 -7951 -18960 -8921 -14884 -32091
13195 -32091 -17634 -8902 973 4065 4905 -17843 -19314 -18287 23385 32096 20262 27314 40114
13182 40114 16970 25845 20583 16747 -10585 -621 8339 38605 48607 29452 11303 27939 14223
13169 14223 -26644 -37332 -21033 -1065 -8357 -19175 -29582 -19691 -10671 -9293 26820 38633
13157 38633 23630 29607 16123 -15278 -5241 18676 16344 -2043 -5062 7130 29194 39551
13145 39551 30452 22968 4999 16176 21621 -2448 -6924 -2751 8141 12637 11852 3129 4912 22179
13131 22179 22108 16346 12964 -19803 -14107 -28526 -33598 -21541 -2270 -16262 -37188 -26399 -30072
13118 -30072 -11447 19599 7284 -16376 -23138 -22296 -6543 -10616 1690 -5741 7482 11375 23329
13105B3329N049J3394K2724K51k4977r984j357p727j502j2241m00J8665J1726
13092C6950j6133J8530j4817J5710k3464K7529J6806m0231j7924k592R440k1218
13080a1414k416J9952j4262Q921J9642j4083J241j8096m85K0227k8541k1472J1700
13067b9086J6181K4079j7087O571J3918J7430j7699k6784o542o716L5149J0982
13055B0396n745l4104k2577P807K8800l764L7707M993k6055k8700J3676L3068
13043B5502j5999O592n413J1829n546j0635n054j0991J5221j2040o655o999K0566
13030C78L4930O96k0475m1566p52K7723Q96P354J3365K8239J3311j6402p668m808
13016C5221L1035J3380j6902j1898k089p284m3921k1994K1285K5950r213j7653
$$ plain form
13105 23329 28378 41772 64496 64747 39770 29786 28429 20702 19200 6959 6559 25224 36950
13092 36950 20817 39347 24530 40240 16776 44305 61111 20880 2956 364 9804 -11414
13080 -11414 -13830 6122 -8140 781 20423 6340 7581 -10515 -11000 9227 -19314 -40786 -29086
13067 -29086 -12905 11174 -5913 658 14576 32006 14307 -12477 -19019 -25735 9414 20396
13055 20396 14651 -19453 -42030 -34223 -5423 -9187 28520 33513 7458 -21242 -7566 25502
13043 25502 9503 16095 10682 22511 16965 6330 1276 -9715 5506 -6534 -13189 -20188 378
13030 378 35308 36004 15529 -26037 -26789 934 1830 9184 22549 50788 64099 47697 40029 35221
13016 35221 66256 79636 62734 50836 48747 41463 -2458 -24452 -3167 22783 13570 -4083
13004d083k8437j6846L2119J0763P313J239J4231R48L104K2876q965l9029q939
12991a3706J9065p629j306P962P822J4947j0098L727L021M773k987K2263q060
12978C9794j8654k0068k2497j9933K741K0382K2561J2895j2333k202l105o14J5823
12965A4790r019o005O17J652J0187r130J941k4044k9967J4245J5153J8364K9167
12952B7951K7285j6219j3164r136K93K0318n377j616J8644J360j4695j7039j6321
12939B284k9721O650O534J4145O775J5299k426k5555k4269O619K0081K5511o694
12926A5233j3992K5696P58J173L3677J8204o540n3013n1524M43n065j7208L728
12913d8430L0988n003k2823P847L5427J5836k0469M453j019J6923K0911j252Q976
$$ plain form
13004 -4083 -32520 -49366 -17247 -6484 829 2068 16299 17247 20351 43227 34262 -4767 -13706
12991 -13706 5359 -2270 -3576 4386 12208 27155 17057 20784 23805 28578 25591 47854 39794
12978 39794 21140 1072 -21425 -41358 -38617 -18235 4326 17221 4888 2686 -419 -1033 14790
12965 14790 5771 -234 383 2035 12222 3092 5033 -19011 -48978 -34733 -19580 -1216 27951
12952 27951 55236 39017 25853 16717 17010 37328 31951 30335 48979 50339 35644 18605 2284
12939 2284 -27437 -20787 -14253 -108 6667 21966 19540 -6015 -30284 -23665 -3584 21927 15233
12926 15233 1241 26937 27695 28868 62545 80749 74209 21196 -30328 -29885 -34950 -52158 -48430
12913 -48430 -17442 -22445 -45268 -37421 -1994 13842 -6627 -2174 -3193 13730 34641 33389 42365
12900D2365k906j3720j4792n969K188P133K1724j5053Q489L0298j0082l7297o948
12887E430J9662J6779j2145l420Q950K132l6890k9733R375K2559M31K0408p681
12874A5857m366j82j150K6705J0429j5056k9224j0803J1118L624n106k2410k8081
12861d8645K4215J2534J7104N136k0950q219R99K6351L1927R109r735J3010q092
12848D4744p024k2778j2225j706J0185j1896l05J3256M1703J3422k4004k5236
12836A8136J4176j6962N870L757M106J3075q854j9772r001Q538k596n366J8986
12823B4093K3097R991j5963k4098J7690j2120Q643J0673L235K7624n974k0818
12811D6073j7971O359L7305k1782k5931n07J0004r947P000j1723J0323P050l159
$$ plain form
12900 42365 39459 25739 10947 4978 7166 14299 36023 20970 29459 59757 49675 12378 5430
12887 5430 25092 41871 29726 26306 35256 37388 498 -29235 -19860 2699 3130 23538 15857
12874 15857 11491 11309 10159 36864 47293 32237 3013 -7790 3328 6952 1846 -20564 -48645
12861 -48645 -24430 -11896 5208 10344 -10606 -18825 -17826 8525 40452 49561 39826 52836 44744
12848 44744 37720 14942 2717 1011 11196 -700 -1005 12251 53954 67376 43372 18136
12836 18136 32312 15350 21220 24977 29083 42158 33304 13532 4531 13069 10473 5107 24093
12823 24093 47190 57181 41218 17120 34810 22690 31333 42006 45241 72865 66891 46073
12811 46073 28102 34461 71766 49984 24053 23546 33550 23603 30603 18880 29203 36253 33094
12798C3094p27m278j1932K4727J9391j5741l2161N438n638M062j72j3116K437
12785E384Q091L827J6343N628R76j8087j2415j5070o592Q628o428k7829m763J0490
12771c1817j4L2480J3427P919r251j8424K5476K6892O88k27j9867j8621j0898
12758b237L206K5050J3179j4535m2079J3674P202n035m46j063M7548J0049j9897
12745C4616m990n522J9421K3368j018j6748M631P016q760p254K8168N524K7174
12732A05626K9253M5957L0588L9613J8235L3805P1533Q7186P3950L3845L2749
12721F02340J2886k1736k6042k8424l9797n6392p5763n3832q9890o7827k8032
12710A27491J651j2342m2621J579j3745k3110l131m61J1327p698q074R874q307
$$ plain form
12798 33094 32367 28089 16157 40884 60275 44534 12373 17811 12173 16235 16063 2947 5384
12785 5384 13475 17302 33645 39273 40249 22162 9747 -5323 -11915 -3287 -9715 -37544 -42307 -31817
12771 -31817 -31831 649 14076 21995 12744 -5680 19796 46688 47376 47149 27282 8661 -2237
12758 -2237 969 26019 39198 24663 -17416 -3742 3460 -1575 -2021 -3084 44464 54513 34616
12745 34616 29626 24104 43525 66893 65875 49127 53758 60774 52014 44760 72928 78452 105626
12732 105626 134879 180836 211424 251037 269272 303077 374610 461796 535746 569591 602340
12721 602340 615226 593490 567448 539024 499227 442835 367072 313240 223350 155523 127491
12710 127491 129142 116800 74179 75758 62013 38903 35772 35311 46638 38940 30866 40740 32433
12697C2433K730m909j0169j2674k552k408k303J2883M719l9317q582J7034J7779
12684D664J7205j5880q365L890k315o172j335M027J2265J0958K1409j9880l9616
12671a9145J1760J2749j4807j1845N350j1253j3681Q925K4878M1321L4456Q059
12659G6767j6142j6381l6842m539n280m167m199N333J5930M394K1169K078K1467
12646E9588l450K708M355J619J571k8782j1105K0406O312k2157k776j3985J1040
12633B5344J3583m729L091J1386K0180N587Q144Q082j0222l363k181j0305L5902
12620A00499K8500r552r036J6006L4873J8152q937J8531K5728M6189L9917O1184
12608C62054P7701N3144K4317K2848j4950j6623k6390l5298m5551n3923n5980
$$ plain form
12697 32433 35163 30254 20085 7411 4859 2451 148 13031 17750 -21567 -30149 -13115 4664
12684 4664 21869 5989 -2376 1514 -801 -6973 -8308 -4281 7984 18942 40351 20471 -19145
12671 -19145 -7385 5364 -9443 -21288 -15938 -27191 -40872 -31947 -7069 34252 68708 76767
12659 76767 60625 44244 7402 2863 -2417 -6584 -10783 -5450 10480 14874 36043 38121 59588
12646 59588 56138 58846 63201 64820 66391 37609 26504 46910 53222 31065 28289 14304 25344
12633 25344 38927 34198 37289 48675 68855 74442 82586 90668 80446 77083 74902 64597 100499
12620 100499 128999 119447 110411 126417 161290 179442 170505 189036 214764 260953 300870 362054
12608 362054 439755 492899 517216 540064 525114 508491 482101 446803 401252 347329 291349
12597B91349m3828l3561k2009j0559p500j926K750l4721j4345j7279n819J2226
12585A14778N897l7348k4605J4860j0835J4524J2814J9220n068j1418k4623Q972
12573G7168l626j0389q57Q904O507N521J6294L3089K0735J7229l865M244p815
12560A63139M793M450j8609k6843J0324K7189J3311k5399k5119p81J2482J2196
12548A51133j5713m7258L887M5683l703l6703l0936N33K718Q435o272k632K2404
12535I1576J0209R610j0790j2736J6811J222J4843m781q701j228J98k6590k9261
12522E0382k663J0322J1255J065J485j0449j4553P953J3614p524j6028p508n87
12509C6764L1008J9692j7081J2729O477K2116J7510L777k0232k7893J8533L0246
$$ plain form
12597 291349 247521 213960 191951 181392 173892 171966 174716 139995 125650 108371 102552 114778
12585 114778 120675 83327 58722 73582 62747 77271 90085 109305 104237 92819 68196 77168
12573 77168 73542 63153 62296 71200 77707 83228 99522 132611 153346 170575 166710 170954 163139
12560 163139 167932 172382 153773 126930 137254 164443 177754 152355 127236 126455 138937 151133
12548 151133 135420 88162 92049 137732 134029 97326 66390 66923 69641 78076 71804 69172 91576
12535 91576 101785 111395 100605 87869 104680 105902 120745 115964 107263 106035 106233 79643 50382
12522 50382 47719 58041 69296 70361 71846 61397 46844 54797 68411 60887 44859 37351 36764
12509 36764 67772 87464 70383 83112 89589 111705 129215 132992 112760 84867 103400 133646
12497A33646K2942J1234K017k1475J7302K7807L4959J0082k0251j7375L919O027
12485B10834l1506k3812j0636j3905j9714N908K2336j3137k5836J597R871J713
12473A13713Q423J9261J029k2601J678J1679k035J9463L8897K0211J7162p013
12461B19867J2019m181j1818N882k7217j4785P181j9341j6494K2242M974j809
12449A76520J2806r507k1638j7595j2311j4613K0445J8186j0190k995p316O638
12437A38430L4644M8202P778M1156O6741J8119M9607N2009J3303k5778j7996j656
12425D24559k6603m625J8486J7911l1575l3878j2073k073q091l0431l4631j0064
12413B66912J0392M680k241J5752J0565j5560l809k208j8241q769o843r743j7222
$$ plain form
12497 133646 156588 167822 169839 148364 165666 193473 228432 238514 218263 200888 204807 210834
12485 210834 179328 155516 144880 130975 111261 117169 139505 126368 100532 102129 112000 113713
12473 113713 122136 141397 142426 119825 121503 133182 131147 150610 189507 209718 226880 219867
12461 219867 231886 227705 215887 221769 194552 179767 186948 167607 151113 173355 178329 176520
12449 176520 189326 179819 158181 140586 128275 113662 134107 152293 142103 139108 131792 138430
12437 138430 173074 221276 229054 270210 336951 355070 404677 456686 469989 444211 426215 424559
12425 424559 397956 393331 411817 429728 398153 364275 352202 350129 342038 311607 276976 266912
12413 266912 277304 281984 279743 295495 306060 290500 286691 284483 266242 257473 250630 240887 223665
12400B23665J779J8063K1323K8888M214j7504J68K5060j3461o44J2339L2300K6207
12387C62397l414O520j1589J5345L2073j633J9651l296o253L6289K3887q164j5832
12374D45981J3188Q460J3692P168J9335J2581J412n741P392K2549M459j7744j4092
12361E18640L1571N2483M2136P944J8820L0094J4612K5123M1680L6894K5645P790
12349H53432L2023M1733J8442J9508M8432M3672P3382N2283O4603M6196O4074
12338A357780Q5240R5480J31260J28636J23492J50052J57826K14323K47018K51142
12328B942249L19726L67457M98114O01161O94345P87431Q98413J035430J151024
12319I295350J242101J407444J732519K229843L050267M442052O566954R071818
$$ plain form
12400 223665 225444 243507 264830 293718 297932 280428 280596 305656 292195 291551 303890 336190 362397
12387 362397 358983 365503 353914 369259 401332 399699 419350 416054 409801 446090 469977 461813 445981
12374 445981 459169 467629 481321 488489 507824 520405 521817 516076 523468 546017 550476 532732 518640
12361 518640 550211 602694 644830 652774 671594 701688 716300 741423 783103 819997 845642 853432
12349 853432 885455 927188 945630 965138 1013570 1057242 1130624 1182907 1247510 1293706 1357780
12338 1357780 1443020 1538500 1669760 1798396 1921888 2071940 2229766 2444089 2691107 2942249
12328 2942249 3261975 3629432 4127546 4728707 5423052 6210483 7108896 8144326 9295350
12319 9295350 10537451 11944895 13677414 15907257 18957524 23399576 29966530 39038348
12311C9038348J1075321J2229397J3306611J4389666J3774922J0358168N745188
12304A19917621J896454j790997o520506j1171282j3613430j3816754j3321206
12297F1579900j2653584j1119082q720544o205289m232595k908807k129244j647624
12289A1963131j355010j182299j085518j024243r21857p90784o90576o13941n24803
12280C774100m21420l69317k80616j85180j99845j89255j24470j25640j16510
12271A761847j02652q6838o1309n2436o2463n7114n1804l3585n3831p2240p2047
12260A055528p5058m7391k0560m6962o7507m9058n3721o3500m3720j6832M587
12249E75806o780M467k9341m3874j5618j9180j331j3703l3115q150O90m871m116
$$ plain form
12311 39038348 50113669 62343066 75649677 90039343 103814265 114172433 119917621
12304 119917621 121814075 120023078 113502572 102331290 88717860 74901106 61579900
12297 61579900 48926316 37807234 29086690 22881401 18648806 15739999 13610755 11963131
12289 11963131 10608121 9425822 8340304 7316061 6394204 5603420 4912844 4298903 3774100
12280 3774100 3352680 2983363 2702747 2517567 2317722 2128467 2003997 1878357 1761847
12271 1761847 1659195 1572357 1511048 1458612 1396149 1339035 1287231 1253646 1199815 1127575 1055528
12260 1055528 980470 933079 912519 865557 798050 748992 695271 631771 588051 571219 575806
12249 575806 569026 573493 544152 500278 484660 465480 464149 450446 417331 409181 409871 405000 400884
12236D00884k2396j2924M664M845Q326M5459P3428M0272p029J1109N0448j2520
12224E84566k7709m8762l6730o6953m5952n0683j1851p541k3221j4160j2524J3924
12212B52404L1169k36n162J4078O212k2551l2780m2320j1267k637K070k2881o974
12199A59125J3549M672j0197k2477J9944k748j9984k332k0671j959J9927P763
12187A44612k3066j3009J9928J6435j2340o1842l3522L554J4377K2151j3443N1840
12175A15675L6008L9811K7351K5314k563l484o71j7567k6894k065j9046j9017
12163A52852k2247N747j6761J1357J3017j2332j2774l015j5345l913M569L482
12151A04637k1044J050P496q005Q029K5975M2852K3635M155n6715m8143j2223
$$ plain form
12236 400884 378488 365564 370228 375073 383399 428858 502286 542558 535529 546638 597086 584566
12224 584566 556857 508095 471365 404412 358460 307777 295926 288385 265164 251004 238480 252404
12212 252404 283573 283337 278175 292253 298465 275914 243134 200814 189547 186910 188980 166099 159125
12199 159125 172674 177346 167149 144672 164616 161868 141884 139552 118881 116922 136849 144612
12187 144612 121546 108537 128465 144900 132560 70718 37196 40750 55127 77278 63835 115675
12175 115675 151683 191494 218845 244159 241596 238112 237441 219874 192980 190915 171869 152852
12163 152852 130605 136352 119591 130948 143965 131633 118859 115844 100499 96586 101155 104637
12151 104637 83593 84643 92139 84134 92163 118138 160990 184625 188780 132065 83922 71699
12139G1699L570J0186J0801M648J8k4993k5842K9637K11l4641m040O157O079R313
12125F2803J8985K8195l67J9734J3261q12k8363n574J6434J3150K2616j7887j1299
12112A30876k143k3482J4807Q08k7575l8775q234M86J0534K895l1754J5723J1225
12099E5391J598r217L2905q894L303K0233K1221J1699N352q033j3367l2243j2479
12086F7469J4913Q535o764j8734L764l108J1179n076r684j1878q010j4119j8027
12073A0460J8931K275N484j2709q940L371j714M219J1769N306Q123J2746M1158
12060A00479J4189j3026j3095l048k4459o234K0638j661J98q557k7985j485L1883
12047F7837J7252j4154R026J048R4J759k668q272p085m249J6690J4895R978k0892
$$ plain form
12139 71699 75269 85455 96256 100904 100922 75929 50087 79724 79935 45294 41254 47411 53490 62803
12125 62803 81788 109983 109616 129350 142611 141799 113436 107862 124296 137446 160062 142175 130876
12112 130876 128733 105251 120058 120866 93291 54516 46282 46768 57302 60197 28443 44166 55391
12099 55391 56989 47772 80677 71783 75086 95319 116540 128239 133591 125558 112191 79948 67469
12086 67469 82382 90917 84153 65419 69183 66075 77254 72178 62494 50616 42606 28487 10460
12073 10460 29391 31666 37150 24441 15501 18872 17158 21377 33146 38452 46575 59321 100479
12060 100479 114668 101642 88547 85499 61040 54806 75444 73783 73981 65424 37439 35954 67837
12047 67837 85089 70935 79961 81009 81103 82862 80194 71922 64837 60588 77278 92173 102151 81259
12033H1259l9632m4772O748J8188K8052K6667j4621m1311p072Q095K4105O130
12021E1836q571J8606K6211j0436l2193j4931l061M775J7278j0138J344N662O541
12008E2923j14j6126J4563J4411j6060k4009Q124L8485p698j4359k8720J1651
11996C3071R471J6223K773l5164m533j123K6111k1919o268K9278K0027Q642l7257
11983C9332k7395J0972J5796o712q673P487n662l117K8389J9473q39K990j3221
11970E8820j4166m313P778j4662k1717L157J8929K544j1470Q757Q044o344J6907
11957E2264L4332k3945j8378j598M0783K7564q140m271j5170j0339j6015j8478
11945C8609l0626J112M6104j3174o972P964j1009N004J0887R892j5970q38J3899
$$ plain form
12033 81259 41627 -3145 3603 21791 49843 76510 61889 20578 13506 21601 45706 51836
12021 51836 43265 61871 88082 77646 45453 30522 27461 32236 49514 39376 40720 46382 52923
12008 52923 52809 36683 51246 65657 49597 25588 33712 72197 64499 50140 21420 33071
11996 33071 42542 58765 61538 26374 21841 20718 46829 24910 18642 47920 67947 76589 39332
11983 39332 11937 22909 38705 31993 23320 30807 25145 22028 50417 69890 69051 72041 58820
11970 58820 44654 40341 48119 33457 11740 14897 33826 36370 24900 33657 41701 35357 52264
11957 52264 86596 62651 44273 42675 83458 111022 102882 98611 83441 73102 57087 38609
11945 38609 7983 9095 55199 42025 35053 43017 32008 37012 47899 57791 41821 40983 54882
11932E4882J424q695Q198O524k1564P400J2759m391L0528K1947K1836J4551L237
11919A48636k8114n8640j3438J0919J1353L986N455j3206k7147J866j4612o965
11907B0093k020R836M787L3636J0900p616l896K7131J4016L187j4419n503J3235
11894A03367N859O330Q654r721L7208O5834O1097P9850Q9276M6547M6241N2319
11882E92861N0342J3373j6372l1185m4491j12543r1083o5752o0797n7325o3046
11871A13982l4273l1647K1012M2109j1895k9973J288J7219K1284k692j9827j0783
11859G5804k0768J9588O769L220l2855l5276k2371O156J4940j092M1970K3951
11847H0036m943k2362j3293K7373l676M370O589N909L1856K2645l1139l6204j9139
$$ plain form
11932 54882 56306 47611 55809 62333 40769 48169 60928 56537 87065 109012 130848 145399 148636
11919 148636 120522 61882 48444 59363 70716 74702 80157 66951 39804 41670 27058 20093
11907 20093 18073 27909 32696 66332 77232 69616 65720 92851 106867 110054 95635 90132 103367
11894 103367 109226 115556 124210 114489 151697 217531 278628 358478 447754 494301 540542 592861
11882 592861 643203 656576 640204 609019 564528 451985 360902 295150 234353 177028 113982
11871 113982 79709 48062 69074 111183 99288 69315 70603 87822 109106 106414 86587 75804
11859 75804 55036 74624 81393 84613 51758 16482 -5889 267 15207 14115 56085 80036
11847 80036 75093 52731 39438 66811 63135 67505 74094 80003 111859 134504 103365 67161 48022
11834D8022L230j9051l4265L276m66J6559K7161k358l807P102O282N273j2048
11821D4910r04k729J2725k1786n07j2284m852J2736K7265J1495q136J0767J1746
11808H0446K1313j664j1835j5747k7644j359J3706j2972L719j897J9524J4345
11796G9935j3470k6649k7336R29K7591L9184J8976j0879m6449j1638j7434k6120
11784a3360K7065L0388o984N38l2276j1437L9178K2449o48j3070j494l849L8882
11771G5382M0549j9305j2536K4830K043Q151j3913l2252J3694L608j9828n463
11759F4960j2160K1256J5338p225j2284k900r337Q079m439R268n690k9701K1599
11746E6764L0698J1668j0939j1681n5515j1395J1129L542O624k1817j7500N406
$$ plain form
11834 48022 51252 32201 -2064 1212 746 17305 44466 42108 38301 45403 51685 56958 44910
11821 44910 44006 41277 54002 32216 31709 19425 14573 27309 54574 66069 57933 68700 80446
11808 80446 101759 100095 88260 72513 44869 43510 57216 44244 47963 46066 65590 79935
11796 79935 66465 39816 12480 13409 41000 80184 99160 88281 41832 30194 12760 -13360
11784 -13360 13705 44093 37109 37647 5371 -6066 33112 55561 54913 41843 40349 36500 75382
11771 75382 115931 96626 84090 108920 110963 119114 105201 72949 86643 90251 70423 64960
11759 64960 52800 74056 89394 82169 69885 66985 57648 65727 61288 70556 64866 35165 56764
11746 56764 87462 99130 88191 76510 20995 9600 20729 24271 30895 9078 -8422 -3016
11734c016M1187J1323J4080J4017j0286n598J947k630l680m03j6561o328R113
11721D3165L6939R027j0667j3729m0819M771L7205J2022j8421m303J6962l6017
11709C6135j0108l880N893J2178J9313n761J19M460j1003K8414M1205k6761k4331
11696F5873j1682q836K484k2248j2653J4417J983O199j1847N078M450O640J0928
11683E0786j7359n043J3477n3057k2687N1293K7688J8410q345j8969J4536J9207
11671F9937K764K282k1084k6523j7495O760R587J2588J9538L234Q164j625J0353
11658G8480j9454j09r083j6510P795K2464Q561l7916l8277k4224n862M7374K1623
11645C4862j3827R816J1309l0361N741K4801j553J4054j6082j4027r115R839J5450
$$ plain form
11734 -3016 38171 49494 63574 77591 67305 61707 63654 61024 57344 56941 40380 34052 43165
11721 43165 80104 89131 78464 64735 23916 28687 65892 77914 59493 55190 72152 36135
11709 36135 26027 22147 28040 40218 59531 53770 53889 58349 47346 75760 116965 90204 65873
11696 65873 54191 45355 47839 25591 12938 27355 29338 35537 23690 28768 33218 39858 50786
11683 50786 33427 28384 41861 -11196 -33883 17410 45098 63508 55163 36194 50730 69937
11671 69937 72701 74983 53899 27376 9881 16641 26228 38816 58354 61588 69752 68127 78480
11658 78480 59026 58917 49834 33324 41119 63583 72144 34228 -4049 -28273 -34135 13239 34862
11645 34862 21035 30851 42160 11799 17540 42341 40788 54842 38760 24733 15618 25457 40907
11632D0907O625J3962p765j9852l841J7369j9881l372K1914P837l1209J989j1041
11619A3642j9113l1971j878J9649M489N753K6320l361k6751Q393K6822K5078m291
11606D2781J3312k8287k316N519J5525k0111j1156J1993J3631R398k454q578k6140
11593A3117j663M143j4975k7058Q376K7992m2k849J1957M9104R307n1713m989
11580B0707J4759k9047j7991r464k29j473p055J7370K1086J4319j7942P228J5981
11567B8249L867j3963j8792j6681m499l970J6574K1799L29j5352J2367O680j5034
11554A574O759O12J8218p342L31J4010j1725j2579j0155k0771Q415K4264K0576
11541C2187J7761q925r661P625o94k08L368j1626k2305o52K3842J2368n564J069
$$ plain form
11632 40907 47532 61494 53729 33877 30036 47405 27524 24152 46066 53903 22694 24683 13642
11619 13642 -5471 -37442 -39320 -19671 -15182 -9429 16891 13530 -13221 -4828 21994 47072 42781
11606 42781 56093 27806 25490 31009 46534 26423 15267 27260 40891 50289 47835 39257 13117
11593 13117 11454 15597 622 -26436 -18060 9932 9890 7041 18998 68102 77409 25696 20707
11580 20707 35466 6419 -11572 -21036 -21265 -22738 -29793 -12423 8663 22982 5040 12268 28249
11567 28249 32116 18153 -639 -17320 -21819 -25789 -9215 12584 12913 -2439 9928 16608 1574
11554 1574 8333 8945 27163 19821 20152 34162 22437 9858 -297 -21068 -12653 11611 32187
11541 32187 49948 41023 31362 38987 38293 38085 41453 29827 7522 6870 30712 43080 37516 38585
11527C8585M139M592N01j5694J2727K832j4958r814o924K0741K1592j0718L103
11514E0704j6773m094k929r062K6001n459r394j3742J6170J7291K0987M2534L730
11501A15964k4974j0543l2253j7534j8016o052J1787K4596R186j1304l959j845
11489C5053J3288K1782K53k8992j0517m72J2483o184k038k4225J7425J9455k7498
11476A9813k5859K5279J2502j8677K4913M518n575J7915M023j3172K8777J8116
11464I2573j6399l0731k0018k2898J0691j5547M110J7618J6771N05O276j2912
11452C0039l989Q887J3922k147j2448J1271K2205K8852j2522k3749j4791r913
11440C5617l539J4333r475l087K3665J3445J3821j3133j0213lj2994k0707P102
$$ plain form
11527 38585 42724 47316 47817 32123 44850 47682 32724 22910 15986 36727 58319 47601 50704
11514 50704 33931 29837 26908 17846 43847 38388 28994 15252 31422 48713 69700 112234 115964
11501 115964 90990 80447 48194 30660 12644 6592 18379 42975 52161 40857 36898 35053
11489 35053 48341 70123 70376 41384 30867 30395 42878 36694 34656 10431 27856 47311 19813
11476 19813 -6046 19233 31735 13058 37971 42489 36914 54829 58852 45680 74457 92573
11464 92573 76174 45443 25425 2527 13218 -2329 1781 19399 36170 36675 42951 30039
11452 30039 26050 34937 48859 46712 34264 45535 67740 96592 84070 60321 45530 35617
11440 35617 32078 46411 36936 33849 57514 70959 84780 71647 61434 61431 48437 27730 34832
11427C4832l078L8869K9731j2737M491l081p620k8802k4817J8493J7609L286r307
11414E7869j9665m156J2862J4224L857o250j5108o136O937j4145K2211K1693l612
11401G0581K1664K592k8095O462m627m0985L304K3102K3328q66j3500j5353j9430
11388B8177l983Q221j337L821j0238J8214J9798j4683m276k1158m04K8912j0523
11375D0541O044j541m6354o244M009J9312K2878J9899j2887j1150J0795R488J4649
11362F9439J8546R794r9k6467l4913J3142J2233j253J4002M901L377J1868R721
11349A04291k569M815J6908J3145K0053J4745J4125P112J2210L1703j693L161
11337B38006M0436N444j246m627m8164j7792j5877j6851p197k7209j1701J5722
$$ plain form
11427 34832 31754 70623 100354 87617 92108 89027 81407 52605 27788 46281 63890 67176 57869
11414 57869 38204 34048 46910 61134 64991 58741 43633 37497 44434 30289 52500 74193 70581
11401 70581 92245 94837 66742 73204 68577 27592 30896 53998 77326 76460 62960 47607 28177
11388 28177 24194 32415 31078 34899 24661 42875 62673 47990 43714 22556 22152 51064 40541
11375 40541 46585 45044 -1310 -7554 -3545 15767 38645 58544 45657 34507 45302 54790 69439
11362 69439 87985 97779 97680 71213 36300 49442 61675 60422 74424 79325 82702 94570 104291
11349 104291 101722 106537 123445 136590 156643 171388 185513 192625 204835 236538 234845 238006
11337 238006 278442 283886 282640 278013 229849 212057 196180 179329 172132 144923 133222 148944
11325A48944P295J0878j5328m211k960J1865j3756J2069L1851O794j1042j373
11313A81026p276j8829J8067M5793O0124M0706L8206L0659L1301K8282J5304K0963
11301D84326R648l6409l8211R119P91k6516j5800j1336Q028p66j6441k5245j1642
11288C29546k1162k4981k5951l7861l804j786K0311K1824q382J2040L9183J8408
11276C17385k458N887j9569M205L5082L2580N851J2495j208K1366N563M1831J8561
11263D77571o401k3344P728p142l2814m080J1262j8551m7417r561j0861J820j3569
11250C24641j973q667J5224j0886q78K5114q14K5542M8258K3468k7323j9373k2697
11237C69636k5641j6576o297N42L659O035L1080J1715j2991j0703j179k8953l2359
$$ plain form
11325 148944 156239 167117 151789 147578 144618 156483 142727 154796 186647 193441 182399 181026
11313 181026 173750 154921 172988 218781 278905 319611 357817 388476 419777 448059 463363 484326
11301 484326 493974 457565 419354 428473 429264 402748 386948 375612 383640 382874 366433 341188 329546
11288 329546 308384 283403 257452 219591 215787 214001 234312 256136 247754 259794 298977 317385
11276 317385 314927 320814 301245 305450 340532 373112 378963 391458 390250 411616 417179 459010 477571
11263 477571 471170 447826 455554 448412 415598 411518 422780 404229 356812 347251 336390 338210 324641
11250 324641 322668 314001 329225 318339 317461 342575 341761 367303 415561 439029 411706 392333 369636
11237 369636 343995 327419 321122 321664 325323 331358 362438 374153 361162 350459 349280 320327 287968
11224B87968m0264J264K4744m726m467k0958k2997k784j5352k4906o832n963M244
11211A68971m150k8103p381M7672K0759Q402k2882K5906K6245M474K742k7195
11199B15460j8399k3063m823J3779K8874M2258N238r65J0992n883j3694k8158
11187B21616M130k981k4492O636P548j8918J679q307N199r41j3374k873K8319
11174B03241J4973Q046K3560P679j489l783l2842M497J5439J7313j2770M477j6362
11161B31979j4828p062r477r844p16J6973K395K9838K8516J1412L8697r502k7820
11148B80561k487J2743j5596O886P492q622J3205P718J0243K9016K2770J650p726
11135C57853m6982j3670m2794J0545K4214L817k788K408K6354O074L1459J8248
$$ plain form
11224 287968 247704 248968 273712 268986 264519 243561 220564 217780 202428 177522 170690 164727 168971
11211 168971 164821 136718 129337 177009 197768 206170 183288 209194 235439 239913 242655 215460
11199 215460 197061 173998 169175 182954 211828 254086 259324 258359 269351 263468 249774 221616
11187 221616 225746 222765 198273 204909 212457 193539 195218 186911 192110 191169 177795 174922 203241
11174 203241 218214 226260 249820 257499 256010 252227 219385 223882 239321 256634 243864 248341 231979
11161 231979 217151 210089 200612 190768 190052 207025 209420 239258 267774 279186 317883 308381 280561
11148 280561 278074 290817 275221 282107 289599 280977 294182 301900 312143 341159 363929 365579 357853
11135 357853 310871 297201 254407 264952 289166 292983 290195 292603 318957 325031 356490 374738
11123C74738O57Q503Q416k5250k0701J5211K3416O420k7796j7025n827J4997K6978
11110C82737N5359M5407K9950j4167l0253k5732m3505j8797l5598j7474m342M355
11098C27940j0775j0325J0621m279k1205K527J2094J1775q001j8074N921J1056
11086C09275k9285J3010J0054L0941M241j8938l1842P982J6337j4514j3724R150
11074B92687k4362P765l3749p828M5726J9552k071j7108k910J1870j4748o882
11062B67942L1966j030o009J2058K0729J6137q319k1230K1608J5674K2987K5352
11050C97865N831R09K4754n29J831l342j4772j0805l2782r03Q219J8935J1796
11037D07007j9155p029J7115J4083j9939n078J6209o280j0j1394M196N186K6907
$$ plain form
11123 374738 375395 383898 392314 367064 346363 361574 384990 391410 363614 346589 340762 355759 382737
11110 382737 438096 483503 513453 499286 469033 443301 399796 380999 345401 327927 323585 327940
11098 327940 317165 306840 317461 313182 291977 294504 306598 318373 310372 292298 298219 309275
11086 309275 279990 293000 303054 333995 338236 319298 287456 295438 311775 297261 283537 292687
11074 292687 268325 276090 242341 234513 280239 299791 297720 280612 277702 289572 274824 267942
11062 267942 299908 298878 292869 304927 325656 341793 333474 312244 333852 349526 372513 397865
11050 397865 403696 404605 429359 428830 430661 427319 412547 401742 368960 368057 376276 395211 407007
11037 407007 387852 380823 397938 412021 392082 387004 403213 396933 396923 385529 389725 394911 421818
11024D21818J4940L768Q226P006K8647P226O1691N0170L1508K7651L6830j114
11012F98367j6852P627K495k2461J2556J7234M544N385L910k4505r111J4278L1615
10999G25082q168j3861K0359K4114n899M456K0110L117l1944L4597L8191o809
10987H03345j0371k8160k0164K2889P027j5227q143J6405L7309L8002N1375J2786
10975I07073J2956L5060P198N158M5488P198j1556l358J0069M063J4411J3106
10963A046866K0735K9477N6349N4411K1395K9702N4491O7537K6202J4294J8158
10952A439617M7362M7322K4675P0960Q2377P4603J15088J16601J26750J49768
10942B295123J63287J66094J45042J88981J94414K47369L40207M05503N03786
$$ plain form
11024 421818 436758 440526 448752 455758 484405 491631 553322 603492 635000 662651 699481 698367
11012 698367 681515 689142 691637 669176 681732 698966 703510 708895 712805 688300 679189 693467 725082
10999 725082 716914 703053 723412 747526 741627 746083 766193 769310 737366 771963 810154 803345
10987 803345 792974 764814 744650 767539 774566 759339 751196 767601 804910 842912 894287 907073
10975 907073 920029 955089 962287 967445 1012933 1020131 1008575 1005217 1015286 1019349 1033760 1046866
10963 1046866 1067601 1097078 1153427 1207838 1229233 1258935 1313426 1380963 1407165 1421459 1439617
10952 1439617 1486979 1534301 1558976 1629936 1712313 1786916 1902004 2018605 2145355 2295123
10942 2295123 2458410 2624504 2769546 2958527 3152941 3400310 3740517 4146020 4649806
10933D649806O79657Q95183J159038J661071K398108L394643M544973N431117
10925B4813596N518582M510736K389360l03931k782971m521729n169874m813340
10917A9640429l814463k746004j840780j230818p34596l93449j90137l671J91019
10908H877530L40827M26781N26318O60539Q39666J082795J418680J784573K092620
10899A8050329K217694K141137K031520K019002K202570K652740L337158M204691
10891C8856841N041342N426235N118491M303487L194906K007427Q21930k20321
10883F4550338j150465j822337k194765k416254k793729l403997l844533l829002
10875D3095256l360423k546164j816099j343925j184006j250475j378487j331602
$$ plain form
10933 4649806 5329463 6224646 7383684 9044755 11442863 14837506 19382479 24813596
10925 24813596 30332178 34842914 37232274 36928343 34145372 29623643 24453769 19640429
10917 19640429 15825966 13079962 11239182 10008364 9273768 8880319 8690182 8686511 8877530
10908 8877530 9218357 9645138 10171456 10831995 11671661 12754456 14173136 15957709 18050329
10899 18050329 20268023 22409160 24440680 26459682 28662252 31314992 34652150 38856841
10891 38856841 43898183 49324418 54442909 58746396 61941302 63948729 64770659 64550338
10883 64550338 63399873 61577536 59382771 56966517 54172788 50768791 46924258 43095256
10875 43095256 39734833 37188669 35372570 34028645 32844639 31594164 30215677 28884075
10867B8884075r45576k64278N42476J143445J361090J120790O01145P9187j89088
10858C2333266K7375Q36175K239398M057000N711531O714186O852403O288836
10850F5060170N539359M850712M091235L130053J717940n93122l831329o864947
10842G3100071q303831p694413n827735l536325j456351m9690N71854P60337P37830
10833D8301747O17277L85487J83049L17373L84636m6394q72912j613733j998775
10824D5657755k055647j729598j035922k54866M15868R37476J377186J652622
10816D4964874J640188J112519Q5100j251303k424012l051848l138272k876585
10808C5060661k564782k418195k403883k497829k587942k636376k455524k139271
$$ plain form
10867 28884075 27938499 27674221 28216697 29360142 30721232 31842022 32443167 32522354 32333266
10858 32333266 32360641 33196816 35436214 39493214 45204745 51918931 58771334 65060170
10850 65060170 70599529 75450241 79541476 82671529 84389469 83796347 79965018 73100071
10842 73100071 64796240 57101827 51274092 47737767 46281416 46231726 46803580 47563917 48301747
10833 48301747 48919024 49304511 49487560 49804933 50189569 50143175 49270263 47656530 45657755
10824 45657755 43602108 41872510 40836588 40581722 40997590 41935066 43312252 44964874
10816 44964874 46605062 47717581 47802681 46551378 44127366 41075518 37937246 35060661
10808 35060661 32495879 30077684 27673801 25175972 22588030 19951654 17496130 15356859
10800A5356859j809845j422715j110105p91498m83475j92110P2336K22770L85572
10791A0227789M27503L90567L15623K37894K03677L00072O00127J087630J826979
10782A5617861K846378M155200N362349N938189N299896L356540N71091k334908
10774D0812596m640428n704278n514046m465282l170172k047580j207954p24523
10766A3338333n07037l08797J9200M90730J026441J704092K437286L252338L948631
10757B5401217M190389L841253L066254K114184J226834N26210J27471j33034
10749D0360778n60627j153075j744382k188141k304494k011866j256908j85680
10741B8955605O87743R80439N94936l19141j376099k260098k808559k910470k665615
$$ plain form
10800 15356859 13547014 12124299 11014194 10222696 9739221 9547111 9619447 9842217 10227789
10791 10227789 10655292 11045859 11361482 11599376 11803053 12103125 12703252 13790882 15617861
10782 15617861 18464239 22619439 27981788 33919977 39219873 42576413 43147504 40812596
10774 40812596 36172168 30467890 24953844 20488562 17318390 15270810 14062856 13338333
10766 13338333 12831296 12522499 12541699 13032429 14058870 15762962 18200248 21452586 25401217
10757 25401217 29591606 33432859 36499113 38613297 39840131 40366341 40493812 40360778
10749 40360778 39800151 38647076 36902694 34714553 32410059 30398193 29141285 28955605
10741 28955605 29643348 30623787 31218723 30899582 29523483 27263385 24454826 21544356 18878741
10732A8878741k213536j687392j152431p01461l01856J67169N91037R97384J422174
10723A5999829J620220J528265J088180M04837k56154p14954p74337m56208R7734
10714A8537412O15494R36888R15287O54161K89672N7052J4849J17331J49818L3892
10704B2321856k96791q64727j445110j848250j931638j626102j096114m39879
10696A2773245K39045Q44327J213843J297173R55287L60446k46477n92402o64376
10687A6180111n28934l15214j84179k45725o82548j331235j831218j975047j742012
10678G343999j341441j040302q08405n76302m21342l54046k67120k43758j99094
10669B092189j61124j47800j09331q6678j08256j09686n8895p3344p1512m3071
$$ plain form
10732 18878741 16665205 14977813 13825382 13123921 12822065 12989234 13580271 14577655 15999829
10723 15999829 17620049 19148314 20236494 20641331 20385177 19670223 18895886 18439678 18537412
10714 18537412 19152906 20089794 21005081 21659242 21948914 22005966 22020815 22138146 22287964 22321856
10704 22321856 22025065 21160338 19715228 17866978 15935340 14309238 13213124 12773245
10696 12773245 13012290 13856617 15070460 16367633 17322920 17683366 17436889 16844487 16180111
10687 16180111 15651177 15335963 15151784 14906059 14223511 12892276 11061058 9086011 7343999
10678 7343999 6002558 4962256 4153851 3577549 3156207 2802161 2535041 2291283 2092189
10669 2092189 1931065 1783265 1673934 1587256 1479000 1369314 1310419 1237075 1165563 1122492
10659A122492n2073m7768l9894p3690n2579l7492k3092k8124j1560p836j8166
10648G30218k8426P425L1052K8081L4977k5658k5190l1630K382l787k597k7240
10636F89607j7094o365l4415m2380n5369p052p557q941r804l0459l4327j0823
10624D25021j0103J032J6750J0860K7905J8736o287k2829j8252j1488k9788O437
10612D07994M0822J280K1090J4365M3550M1727J5561K0386N0341K5164j6822n9958
10600F05500n7933l3488o5215n8645l4015Q377j7148k6584L7026q740j1510j6548
10588C21077M97j6991M494K2238r379j5959Q612p122p170k5705j4908J9374J3816
10575B92874j8329J0060K2884j9355J1824o986k3695J6033K8457j9253k5278O543
$$ plain form
10659 1122492 1070419 1022651 982757 909067 856488 818996 795904 767780 756220 748384 730218
10648 730218 701792 709217 740269 768350 803327 777669 752479 720849 723231 719444 716847 689607
10636 689607 672513 666148 631733 589353 533984 526932 519375 510434 500630 470171 435844 425021
10624 425021 414918 415950 432700 443560 471465 490201 483914 461085 442833 431345 401557 407994
10612 407994 448816 450096 471186 485551 529101 570828 586389 606775 657116 682280 665458 605500
10600 605500 547567 514079 448864 390219 356204 364581 347433 320849 357875 349135 337625 321077
10588 321077 321574 304583 309077 331315 321936 305977 314589 307467 300297 274592 259684 279058 292874
10575 292874 274545 284605 307489 288134 299958 292972 269277 285310 313767 294514 269236 275779
10563B75779K3n422j1854l948l3880L650J7505O552J0252j3913K4163J4844L1542
10550C15293K7604o667m971l914j5151j3099j8585p652m2572j6071P12J1866K1235
10537B48028J7999N458M192n033j8189O68l951j3233J3048n24M0592O5373J1694
10524C66122l3800J0189M920k789m431k7423j9754k0421K590M182N708M442J4241
10511C03776l046j7150R992L7209M5540j5766O697J7876j1260j0744J9805L6886
10499D19815J7503l1244k5424k9007j6137l2469P196L456J483N99Q706K536l0233
10486B96780k928J6000L3602K1904R49r197L0357N7454J43754K59452K80454P8097
10474A206678p4739j10026p4644m9290p545q200J3484L6694J3518q852o876k6679
$$ plain form
10563 275779 275802 270380 258526 254578 220698 224348 241853 248405 258657 244744 268907 283751 315293
10550 315293 342897 336230 331259 327345 312194 299095 280510 272858 230286 214215 214927 226793 248028
10537 248028 266027 271485 275677 270644 252455 253123 249172 235939 248987 248463 289055 354428 366122
10524 366122 332322 342511 347431 344642 340211 312788 293034 272613 275203 279385 285093 289535 303776
10511 303776 300730 283580 293572 330781 376321 360555 367252 385128 373868 363124 382929 419815
10499 419815 437318 406074 380650 351643 335506 303037 310233 313689 315172 315771 324477 327013 296780
10486 296780 293852 309852 343454 365358 366307 357110 387467 444921 588675 848127 1128581 1206678
10474 1206678 1131939 1021913 947269 897979 890434 882234 895718 932412 945930 937078 930202 903523
10462I03523l1391m841k3198p534m934k2962j2825l9792k6654k1857j5124j6430
10450F75981l0848j4710j5223K9055M540k5635o152m921K794K2288K4167n505
10438F55831J5674O486K0545N1853O8923M5100J4491K4415M2511J2260L2196J8068
10426A008353O764J8191o21K9376p92k928Q11k1899k7480j6566j623J2369K6249
10413A030204J9447N6513M3506K2547J6606J0870Q33n156M806M8664M5488J3902
10401A308230K4143M8885P9846M1321N6654J6909L7939L9559L3034O808L2917
10390A726245O4726R8797J09351J01283J23344J43266J10492Q4237J30446J71814
10380B864001K21096K46517L04963L36139L65187L95645M19975M01648M14449
$$ plain form
10462 903523 872132 867291 844093 836559 831625 808663 795838 756046 729392 707535 692411 675981
10450 675981 645133 630423 615200 644255 648795 623160 617008 612087 614881 637169 661336 655831
10438 655831 671505 677991 698536 750389 819312 864412 878903 903318 945829 958089 990285 1008353
10426 1008353 1015117 1033308 1032687 1062063 1061271 1058343 1059154 1037255 1009775 993209 991586 1003955 1030204
10413 1030204 1049651 1106164 1149670 1172217 1188823 1199693 1200526 1195370 1200176 1248840 1294328 1308230
10401 1308230 1332373 1381258 1461104 1502425 1559079 1575988 1613927 1653486 1686520 1693328 1726245
10390 1726245 1790971 1889768 1999119 2100402 2223746 2367012 2477504 2561741 2692187 2864001
10380 2864001 3085097 3331614 3636577 3972716 4337903 4733548 5153523 5555171 5969620
10371E969620M94501O51037R04402J192942J446378J378899J070966Q07122Q50835
10362A4766702J174751J755052K538942L589993M999697P014100J0062353J4894703
10354F0796293K2840446L5707758N4089532P0176379N9215295P853815m7310329
10347B63369189o7873644n7830723m0044194k6263243j7428024j1949442q433786
10340C3546133o035001m462391l371221k580675j902670j268831p91793o86110
10332A2447441r34202j240829j333339j205042r52658p13533n59214m43693l97101
10323D667830l76594l31227k87975k25802k14377k08930j82782j58897j22591
10314B558655j12328j15911j59974j52674p1092n5885n7677p2062p9447r0771
$$ plain form
10371 5969620 6464121 7115158 8019560 9212502 10658880 12037779 13108745 13915867 14766702
10362 14766702 15941453 17696505 20235447 23825440 28825137 35839237 45901590 60796293
10354 60796293 83636739 119344497 173434029 243610408 302825703 310679518 263369189
10347 263369189 195495545 137664822 97620628 71357385 53929361 41979919 33546133
10340 33546133 27511132 23048741 19677520 17096845 15194175 13925344 13133551 12447441
10332 12447441 11513239 10272410 8939071 7734029 6781371 6067838 5508624 5064931 4667830
10323 4667830 4291236 3960009 3672034 3446232 3231855 3022925 2840143 2681246 2558655
10314 2558655 2446327 2330416 2170442 2017768 1946676 1890791 1833114 1761052 1681605 1590834
10304A590834o4710o7441o9819n3053o4802p3178m3173l1904k1770p961k5457
10293A067566k5996k0766o7747p7617l6391o484k9125n360J2781l3719l3339m1259
10281G02544j3747j3755k5010j2331P307R607Q918L7763L6920J3427j4618k9737
10269G07288j4255k8939o4818n0127m0989q98L1270k2823k2969k2502j7717p937
10257D44584j6699p884n457J1824n927l3837k409q897l774q55o67j4474j717L803
10243C57614j9127J9321J0875k6346l071j4143j4694l5699l1603J549j7099j6983
10231B10594j8901k2082l9909o3418p0786j16012q2843m842J32309K05927J56648
10220B86685Q9566M4029J2089o275m0384n0885n865j961j467l00J8078N027K0716
$$ plain form
10304 1590834 1526124 1458683 1388864 1335811 1271009 1197831 1154658 1122754 1100984 1093023 1067566
10293 1067566 1041570 1020804 953057 875440 839049 832565 803440 798080 810861 777142 743803 702544
10281 702544 688797 675042 650032 637701 645008 654615 663533 701296 738216 751643 737025 707288
10269 707288 693033 664094 599276 549149 508160 507262 538532 515709 492740 470238 452521 444584
10257 444584 427885 420001 414544 426368 420441 386604 384195 375298 371524 370669 370002 355528 353811 357614
10243 357614 338487 357808 368683 342337 339266 325123 310429 274730 243127 244676 227577 210594
10231 210594 191693 169611 129702 66284 -4502 -120514 -203357 -208199 -75890 130037 286685
10220 286685 376251 420280 432369 426094 385710 334825 328960 326999 325532 325232 343310 348337 369053
10207C69053m902L2709J7534o74k9325k0710J507K3623L2436R126j4086k3269
10195C93022J2299N3973P2191J32170K05009K90975K68071J02774j47076k56819
10185A126589k26754j94270j28575q6472o0999n9019l1143j5742l0467k9868j0185
10174B53095j5117J7945M2884K9751P117L014r079j2388n270P660j3179R7R976
10161C16506q785N29l756K4527R05k1518k3157J3384m569o689P386j7609l1982
10148B45172K9327o087k6454P312K557j144n144J0607J6087J0732M905o176L892
10135B85586J177Q78O792j7632Q33m062J327j3785L7817L439o487k778J7368M802
10121C15275k329j0717J612j2138k3169n171K538J2712K1447P091K516l4619n273
$$ plain form
10207 369053 364151 396860 414394 413720 384395 363685 365192 388815 421251 430377 416291 393022
10195 393022 405321 459294 531485 663655 868664 1159639 1427710 1530484 1383408 1126589
10185 1126589 899835 705565 576990 490518 429519 370500 339357 323615 293148 263280 253095
10174 253095 237978 255923 298807 328558 335675 338689 329610 317222 311952 319612 306433 306530 316506
10161 316506 307721 308250 304494 329021 329926 308408 285251 298635 294066 287377 294763 277154 245172
10148 245172 274499 268412 241958 249270 251827 250683 245539 256146 272233 282965 287870 281694 285586
10135 285586 286763 287641 294433 276801 277634 273572 274899 261114 298931 302370 295883 293105 310473 315275
10121 315275 312946 302229 303841 291703 268534 263363 265901 278613 300060 307151 309667 275048 269775
10108B69775K3297n017j4441J6057J5174o340m948j7201o443J833R43O08L409
10095B76706j1011L5215L5991K2490J1667J888K143L738l922k2504p517j783k0492
10082C22609m351j597j2910q436l630l735K1143J7529K0899j876O730l242m717
10069C44416k4674j6912K6349Q306j8855N964K850P35J1419J2914k084J4117q369
10056C56176k4967K3005J9660K8060k0890j6111k3291j1537K2069Q271j2820j2724
10044C34901j6922K841J1930J6855J6483J5811o178J9181M455M381m1819l607
10032C58312J9454r658R315J989K2957J1048p083k028j5422J7656J9482K1459
10020D47481R546k2176m908J8668j717q619M344q164j967Q541m673L1946M2962
$$ plain form
10108 269775 293072 288055 273614 289671 304845 298505 293557 276356 269913 271746 272689 273297 276706
10095 276706 265695 300910 336901 359391 371058 372946 375089 378827 374905 352401 344884 343101 322609
10082 322609 318258 316661 303751 295315 291685 287950 309093 326622 347521 345645 352375 349133 344416
10069 344416 319742 302830 329179 337485 318630 324594 327444 328179 339598 352512 350428 364545 356176
10056 356176 331209 354214 373874 401934 381044 364933 341642 330105 352174 360445 347625 334901
10044 334901 317979 320820 332750 349605 366088 381899 375721 394902 399357 403738 361919 358312
10032 358312 377766 368108 377423 379412 402369 413417 406334 404306 388884 406540 426022 447481
10020 447481 457027 434851 429943 448611 446894 438275 442619 434455 432488 441029 436356 468302 511264
10007E11264k0997j5647J5903L811q975j6130n076k481k5662N244J8988M764j6365
9994D48641J816J7264K4656O503M142j0591k0265N069L987J2677j0809M596J1809
9981D99495K3538J7929k2770j4987K3994n09N123Q513l987J2208J5004j0599p577
9968E45375P089q147j9088M443j650J2055K9854Q154j207q282k3926n069o849
9955E32752K4905K2400K4504L6772K0465Q334l2179k5966L4989K2700P220L5883
9943G12779N1244P0253P0362O9627L9916J5686k1214k1681k4216L252L4096Q2737
9931A082841J39933K36537K21827K53189K37910J46406p9675k35983k81580l00368
9921A421037k15481j78213j25637o6724m4950l0037j7907Q307J599j0837k0019
$$ plain form
10007 511264 490267 474620 490523 494334 485359 469229 464153 461672 436010 441254 460242 465006 448641
9994 448641 450457 467721 492377 498880 503022 492431 472166 477235 481222 493899 483090 487686 499495
9981 499495 523033 540962 518192 503205 527199 526690 531813 540326 536339 548547 563551 552952 545375
9968 545375 552464 544317 525229 529672 528022 540077 569931 578085 576878 568596 544670 539601 532752
9955 532752 557657 580057 604561 641333 661798 670132 637953 611987 646976 669676 676896 712779
9943 712779 764023 834276 904638 974265 1014181 1029867 1008653 986972 962756 966008 1000104 1082841
9931 1082841 1222774 1459311 1681138 1934327 2172237 2318643 2238968 2002985 1721405 1421037
9921 1421037 1205556 1027343 901706 834982 790032 759995 742088 750395 751994 741157 721138
9910G21138k8773k1281j9749Q887N503l4769J7760K7744o581J1845K2711K340
9898G06775r913k7172m5208l673L073J645J2339m0948l2824J0589O257q031j0901
9885E62008n401m393k4363j7300m484L003K8943J7603j9704J230P491j1874k446
9872E30313l914r593R154L8917J8153J2462K7020L1545l714k4666k5569j8796
9860E81312j9445l5639j9332k3422k0612j4465N685K4291j475j7483l3991L672
9848D29096K6495Q653o815L623k2936l4190J3637K2914J1263n286N073N273k4769
9835D32031l0458M911J3317J4114L318M65Q057j4743j0062j8499m948P436K3398
9822D28337L1846J7302j6862k0493k1841k4058J6019N970n8396k4113l2373N433
$$ plain form
9910 721138 692365 671084 651335 660222 665725 630956 648716 676460 669879 681724 704435 706775
9898 706775 696862 669690 624482 620809 623882 625527 637866 596918 564094 574683 580940 572909 562008
9885 562008 556607 552214 527851 510551 506067 509070 538013 555616 535912 537142 544633 532759 530313
9872 530313 526399 516806 525960 564877 583030 595492 622512 654057 650343 625677 600108 581312
9860 581312 561867 526228 506896 483474 462862 448397 454082 478373 476898 459415 425424 429096
9848 429096 455591 464244 457429 461052 438116 403926 417563 440477 451740 446454 451527 456800 432031
9835 432031 401573 406484 419801 433915 437233 437698 445755 431012 420950 402451 397503 404939 428337
9822 428337 460183 477485 460623 440130 418289 394231 410250 416220 357824 333711 301338 306771
9810C06771J4932L203r844L9957K183r031J285J603o955j068J5148J694k3635
9797C36243M2525P942m3501K56J5718o229k445j4507j4J5444j4302r429j0572
9784C17129k5486k0233j3898J2661K4353K6174p959o89P32L3114O5808J03939
9772E15645R4634k177p5975r8405p1010j1102j7121l2230p602N129j2721p23j0200
9759B76142K2744j488j9770j1629j9370n515j2689k205J306J8342K5583M4811
9747C16262J0253k8359J3836K0515O92q762k1901o750m295j4775O935J0353j2419
9734B81585k87K8447J4894j8838j497O470n362J7281K3551P313n2871k4607o337
9721B69742Q703J340j4565l7454p491P89K166J9681P527r164L753o284j1881J6570
$$ plain form
9810 306771 321703 324906 315062 355019 357202 348171 349456 351059 344104 343036 358184 359878 336243
9797 336243 378768 386710 343209 343465 359183 352954 350509 336002 335988 351432 337130 327701 317129
9784 317129 291643 271410 257512 270173 294526 320700 312741 312052 312784 345898 411706 515645
9772 515645 610279 608102 532127 433722 362712 351610 334489 302259 294657 299786 287065 286342 276142
9759 276142 298886 297398 277628 265999 246629 241114 228425 226220 227526 245868 271451 316262
9747 316262 326515 298156 311992 332507 333199 324437 302536 295786 291491 276716 283651 294004 281585
9734 281585 281298 309745 324639 305801 304304 310774 305412 322693 346244 353557 300686 276079 269742
9721 269742 278445 279785 265220 227766 220275 221064 223230 242911 250438 241274 245027 238743 226862 243432
9707B43432L2455k3237k7320J7361K82K1026j3801q356j9472L732j8941oJ8730
9694B25885O386m630m3024l308K6594K4847l786k4546J2934J6310K3234K6736
9682B83632J5712j3254n0812j6044K3502J4867k9036J3400M1319j2984K253K4259
9670B96814J0856j928k7019J0638N192L7008K4288o439Q551k8378j3850m21J0161
9657C25473L2357m514k3583J7568J600j8309l029p205k5404J484J8167j186J6891
9644C30310k029n1386j6101K1296K6384J1069J4215j5454k6118l993K8466M758
9632C21417j1925J601J6616p153m420J7829j306j9043n3937j5773K7929L3900
9620C05735J208p753J3177K0179L177Q107N191j0345n110J8088k3824j2692K8637
$$ plain form
9707 243432 275887 252650 225330 242691 242973 263999 250198 241842 222370 226102 207161 207155 225885
9694 225885 232271 227641 184617 181309 207903 232750 228964 204418 217352 233662 256896 283632
9682 283632 299344 286090 235278 219234 242736 257603 228567 241967 283286 270302 272555 296814
9670 296814 307670 305742 278723 289361 294553 331561 355849 349410 357961 329583 315733 315312 325473
9657 325473 357830 353316 329733 347301 348901 330592 327563 320358 294954 296438 314605 313419 330310
9644 330310 328281 276895 260794 282090 308474 319543 333758 318304 292186 288193 316659 321417
9632 321417 309492 311093 327709 320556 316136 333965 332659 313616 259679 243906 271835 305735
9620 305735 306943 299190 312367 332546 335723 343830 349021 338676 333566 351654 327830 315138 343775
9607C43775K1925J3285q331K163l063m720O457L0068J7966r419O031M0198R416
9594D65751Q201P854O496j8011q052j9220k7051k3280K4717K9381J307O502K2130
9581D76725J5268l336k2770L023K8465J3587L5690K1120K2870K6222N6898L6486
9569G10248L4801O2007K2229L2701N2852M7456O5183P4881R2086J35568J42917
9558A472929J77251J76506K11721K76763L62387N08460P58959R92851J307432
9549F245259J571142J644483J339173N32614m84471j299508j599058j453832j126415
9540E369387p81434n13789k80844j37235J4217J60841K03290J90542J02616N2939
9530D380530L611n2879j00667j06215n2382K7669J52058L10034N13439P41046
$$ plain form
9607 343775 365700 378985 370654 372817 369754 365034 371491 401559 419525 410106 416137 456335 465751
9594 465751 473952 481806 488302 470291 462239 443019 415968 392688 417405 446786 448093 454595 476725
9581 476725 491993 488657 465887 468910 497375 510962 546652 567772 590642 616864 673762 710248
9569 710248 745049 807056 829285 861986 914838 962294 1027477 1102358 1194444 1330012 1472929
9558 1472929 1650180 1826686 2038407 2315170 2677557 3186017 3944976 4937827 6245259
9549 6245259 7816401 9460884 10800057 11332671 10848200 9548692 7949634 6495802 5369387
9540 5369387 4587953 4074164 3793320 3656085 3670302 3831143 4034433 4224975 4327591 4380530
9530 4380530 4384141 4331262 4230595 4124380 4071998 4099667 4251725 4561759 5075198 5816244
9520E816244R92272J272382J426832J400091J339062J390298J568613J666860
9512A6872654J703540J827471J993220J825118J063953k0537q99653j313069j578449
9503B1474248j830304k061681k085865j873771j626734j293789j019290p60555
9495H922259o38436m83246l59785j88016L6779L19395M92328O55897P16190P60198
9485A0233563J019628J306632J319612Q93235J04855l98047k43071L42372J210875
9476A5789654K210076L327356M434645M975921M313492K433189n7488k457320
9468C4969525m059197m529785l977240k939868j872448r98027o03841o80257r33242
9459A4375620j075724j120815j089163j022421r78028q83898o98511n08219l12505
$$ plain form
9520 5816244 6808516 8080898 9507730 10907821 12246883 13637181 15205794 16872654
9512 16872654 18576194 20403665 22396885 24222003 25285956 25265419 24365766 23052697 21474248
9503 21474248 19643944 17582263 15496398 13622627 11995893 10702104 9682814 8922259
9495 8922259 8283823 7800577 7440792 7252776 7289555 7608950 8101278 8757175 9473365 10233563
9485 10233563 11253191 12559823 13879435 14772670 14877525 14479478 14236407 14578779 15789654
9476 15789654 17999730 21327086 25761731 30737652 35051144 37484333 37426845 34969525
9468 34969525 30910328 26380543 22403303 19463435 17590987 16592960 15989119 15308862 14375620
9459 14375620 13299896 12179081 11089918 10067497 9089469 8205571 7507060 6998841 6686336
9450F686336p1646J63905L72667O13695P46453Q30868R48471J088780J303727
9441A2683256J414545J194419O90345K93735L62823Q54384J277095J262238Q00385
9432B0833225K25003l70144r40268j472795j836612j816109j643207j582775j683325
9423I712993j636843j344939j035402p46036n35827l84683k30495j02690q506
9414C687572J5286j4390k3550n7046o6801r0016j64135j88697j40741q8948J0504
9403B879038J32555K28858M16704O47536R49343J230456J369649J048251L20603
9394I222993n92874j247837j443915j321265j037433p32837n52083l91541k83859
9385A619349k15752j24836j32898j28621j07000r4417r0518r0870n7921l3774
$$ plain form
9450 6686336 6614690 6778595 7151262 7764957 8511410 9342278 10290749 11379529 12683256
9441 12683256 14097801 15292220 15982565 16276300 16639123 17493507 18770602 20032840 20833225
9432 20833225 21058228 20688084 19747816 18275021 16438409 14622300 12979093 11396318 9712993
9423 9712993 8076150 6731211 5695809 4949773 4413946 4029263 3798768 3696078 3687572
9414 3687572 3702858 3688468 3664918 3607872 3541071 3451055 3286920 3098223 2957482 2868534 2879038
9403 2879038 3011593 3240451 3657155 4304691 5254034 6484490 7854139 8902390 9222993
9394 9222993 8630119 7382282 5938367 4617102 3579669 2846832 2294749 1903208 1619349
9385 1619349 1403597 1278761 1145863 1017242 910242 815825 725307 634437 576516 542742
9375E42742l7982k9064J876j1734l1496l2353o328j8197k1231j7889l0061k8195
9363B80088k6760j4929N309j301p27k7379L95J2800M053k4594R89l503P662p760
9349B04343q013k8728o219J4593k358J8335K7352R367J277P159L115j5552l0399
9336A94272O184M2031n499k8799q682J2872m525n014j3504j1465k3110K8649O571
9323A89981j4111n415j1953k1435J3264M961q365j6373q548k0976N432O003n446
9310A07019J0730J131j5290p5M097J8502J2537M373j6681m45R772m054J5157q582
9296A38191K2882P558m0637l087j1978J7521J9330j292m830L712j7995P133l72
9283A36136k0946k696M218j1113j7661j656L747J2814n94O951j5421l925j1451
$$ plain form
9375 542742 504760 475696 477572 465838 434342 401989 395661 377464 356233 338344 308283 280088
9363 280088 253328 238399 243708 242407 241680 214301 214696 227496 231549 206955 207944 204441 212103 204343
9349 204343 196330 167602 161383 175976 173618 191953 219305 228672 229949 237108 240223 224671 194272
9336 194272 200456 242487 236988 208189 199507 212379 207854 202840 189336 177871 154761 183410 189981
9323 189981 175870 170455 158502 137067 150331 155292 146927 130554 122006 101030 106462 112465 107019
9310 107019 117749 118880 103590 103515 107612 126114 138651 143024 126343 125898 135670 131616 146773 138191
9296 138191 161073 168631 127994 124907 112929 130450 149780 148488 143658 147370 129375 136508 136136
9283 136136 115190 112494 116712 105599 87938 86282 90029 102843 102249 109200 93779 89854 78403
9270G8403q911K1165k600P593O645o210m639K086j7193J0650K8715J3909p641
9257A21972r130k5475M53L8780J4760k4967j3905n649N619p697j0526M458O575
9244I5268j1720k2977l064J4531j1796k5049J0242L4098q82k1551J0154L080l739
9231F6595K077j5371M121J3181J7478P496j7795k0844K8555K411m693Q026q429
9218H2808j2322j0060m734l747J6866M313Q389J3511J3386P099k2846l6660k1896
9205C4107j011L3937j5368j2548K646J4087L943P756J4713j8531j6806M807j682
9192E0050k4630J5372J0157K1374Q038r395J8205m751k6022k4760j600O695P390
9179D6123J5437j8202r34k3887o121K5663M1972J9398j7992l580q014j3134n660
$$ plain form
9270 78403 69492 90657 88057 95650 102295 96085 91446 93532 76339 86989 115704 129613 121972
9257 121972 112842 87367 87820 126600 141360 116393 102488 96839 102458 94761 84235 88693 95268
9244 95268 83548 60571 57507 72038 60242 35193 45435 79533 78651 57100 67254 70334 66595
9231 66595 68672 53301 57422 70603 88081 95577 77782 56938 85493 87904 83211 91237 82808
9218 82808 70486 60426 55692 51945 68811 73124 81513 95024 108410 115509 92663 56003 34107
9205 34107 33096 67033 51665 39117 41763 55850 59793 67549 82262 63731 46925 51732 50050
9192 50050 25420 40792 50949 72323 80361 70966 89171 84420 58398 33638 32038 38733 46123
9179 46123 61560 43358 42424 18537 12416 38079 80051 99449 81457 77877 69863 56729 51069
9166E1069j523k1659j5103j7888J1889J2371o852j8662L3846K6020K4989R253
9154H7750j4371R985L7442l646k3931j4640K7347J8733j4704j5847k4187m150
9142F5781k2565m335l9269N994K1216R624P651J1714L365L248n510L8755R888
9129A05557M09p672j3773q529l6878j1729L2975N800k4739L7743K4171R697l708
9116A09324j6353P678O421J3444J2866k7536J9795M9148J5161N683m354j4118
9104A77159k7286j6827q14J172J3525N058k1973n134n473q294k4307n299O22n475
9090G6654J4169k2546K059J5648j216j9378Q86M349K6307p317J3109Q032p491
9077A03265L1575p940P552L4446K1757K6519N479J6067l0398k9420j0440j0695
$$ plain form
9166 51069 49546 27887 12784 -5104 6785 19156 12304 -6358 27488 53508 78497 87750
9154 87750 73379 83364 120806 117160 93229 78589 105936 124669 109965 94118 69931 65781
9142 65781 43216 38881 -388 5606 26822 36446 44097 55811 59176 62424 56914 95669 105557
9129 105557 105966 98294 84521 75992 39114 27385 60360 66160 41421 79164 103335 113032 109324
9116 109324 92971 100649 107070 120514 133380 105844 125639 174787 189948 195631 191277 177159
9104 177159 149873 133046 132232 133404 146929 151987 130014 124880 119407 111113 86806 81507 82129 76654
9090 76654 90823 68277 70336 85984 84768 65390 66276 70625 96932 89615 102724 110756 103265
9077 103265 134840 126900 134452 168898 190655 217174 222653 238720 208322 178902 168462 157767
9065A57767J663l5507J176L0063M963l6911j7566R763l6965j4336J0011L706j7718
9052F0109j3306j3627O820J2575L5022J1312j4211l197r768R399Q951K2209m176
9039A08112OR420n680J8808Q087J466O759j0862q944j1568j5473J1529K2749l5588
9025I8821j7540k062J1438J778j6376j115j774p907j0392Q433Q976k6752j9550
9012B5978N060J3108K8379J9361j9536j9466j4213j0056q063K5934M2588K3281
9000A12355J0629R667p27j8082p918J7192P111j0891l6901j2577k4830j2827j3365
8987A8836o108K6806L5034k1460J7197j934J1133P16J1386k0649k6868J9782J5435
8974G9306l785M14q628J0847j0428P000j3390l0093j3306J4076K0504J1763o436
$$ plain form
9065 157767 159430 123923 125099 155162 160125 123214 105648 115411 78446 64110 74121 77827 60109
9052 60109 46803 33176 39996 52571 87593 98905 84694 81497 71729 81128 90079 112288 108112
9039 108112 108118 117538 111858 130666 138753 140219 146978 136116 127172 115604 100131 111660 134409 98821
9025 98821 81281 79219 90657 92435 76059 74944 73170 65263 54871 63304 72280 45528 25978
9012 25978 31038 44146 72525 91886 72350 52884 38671 28615 20552 46486 89074 112355
9000 112355 122984 132651 131924 113842 105924 123116 130227 119336 82435 69858 45028 32201 18836
8987 18836 12728 39534 74568 53108 70305 68371 79504 80220 91606 70957 44089 63871 79306
8974 79306 75521 75935 67307 78154 67726 74726 61336 31243 17937 32013 52517 64280 57844
8961E7844j4458j9959K397R939J1437O238R256J7630k0762m3112j0123J4311j255
8948A9383N195j0963r459K1189L0944k141m293o067j7215J3884K1058J6850p604
8935G0761Q497N859P79l2401J7211J5123P953J88R491j3004k0121k3J1952O282
8921H8547N453j5679k1314K6162J7268k2807j8943j434J7781P32J5286m44j7875
8908G2733k0893j7967P399K9225K9751o171j0076K3817J563p293m584J1963o068
8895A03399L428p898n389j7918j4440J2937j1358k9110n02j3618J633J5348K2251
8882E8763K472R391j0271j6087p47k2468q807J6898k6104r263O434k674M610O727
8868H874J8215K2161J2805j7417j2230M017J7325J0753Q529j0008l6893r723K5103
$$ plain form
8961 57844 43386 23427 25824 35763 47200 53438 62694 80324 59562 16450 6327 20638 19383
8948 19383 24578 13615 4156 25345 56289 54148 49855 43788 26573 40457 61515 78365 70761
8935 70761 79258 85117 85896 53495 70706 85829 93782 93970 103461 90457 70336 70313 82265 88547
8921 88547 94000 78321 57007 83169 100437 77630 58687 57253 75034 75766 91052 90608 72733
8908 72733 51840 33873 41272 70497 100248 94077 84001 107818 109381 102088 97504 109467 103399
8895 103399 106827 98929 93540 75622 61182 74119 62761 33651 33149 19531 21164 36512 58763
8882 58763 61235 70626 60355 44268 43521 21053 12246 29144 3040 -6223 211 -2463 2147 8874
8868 8874 27089 49250 62055 44638 32408 36425 53750 64503 73032 63024 26131 16408 41511
8855D1511K5759j4772k963J4693q284l126l902q160j4784K612L271J2931N045
8842D9831J2430O396k7036R87M26J2717J6407K3585j0888j5209o21K2404p496
8829H3933k8806r169O401k158p582J057j9514K0508M1465j8466l5595j8967O915
8816B0022J2842J426m1167j3491M087Q572J3403J6389J7023j3039j630Q129l909
8803B8657j3280J591j3986L464J4926O45O060J369K5128K5845o761k8974j0906
8790C3778j5796R198J9220J0441k0380m394O51J620k0802l0456q017J0387J0521
8777d029K1105j4395R709J340K037J661K717j3315J1833K0594J292m186l017j2696
8763B0650J8628J390J9003J4885J596j3118k4491M939J4969P897J4084J0446j2373
$$ plain form
8855 41511 67270 52498 49535 64228 55944 52818 48916 40756 25972 28584 31855 44786 49831
8842 49831 62261 68657 41621 42608 43034 55751 72158 95743 84855 69646 69025 91429 83933
8829 83933 55127 45958 52359 50201 42619 43676 24162 44670 86135 67669 32074 13107 20022
8816 20022 32864 34290 -6877 -20368 -16281 -7709 5694 22083 39106 26067 24437 32566 28657
8803 28657 15377 16968 2982 6446 21372 22017 28077 29446 54574 80419 73658 44684 33778
8790 33778 17982 27180 46400 56841 36461 32067 32718 34338 13536 -16920 -24937 -14550 -4029
8777 -4029 17076 2681 12390 13730 15767 17428 20145 6830 18663 39257 40549 36363 33346 20650
8763 20650 39278 40668 59671 74556 76152 63034 38543 43482 58451 66348 80432 90878 78505
8750G8505l4652j6425j0680j4022j3983j2579J8702O111K6070J4971k2917q127
8738A0974o110j2599Q051J8048K4104K0014k457k6733j6320P138M0859k917k2146
8725C9906j9650p352j5965J3521L5192k645j3880L3544K6571k4980m633m378k225
8712E3026j2702J0598M169p520k5228k5330m734K1482J1570o229R257J8565k6227
8699B0697q094L8849R967k8416k434p543k163p765Q50j2973J147N981J0511K0026
8685C8640p923k3129J2596K0515m040J9955K810j6898k1481K0282j324J3654j249
8672E2408j7852k8708n012J6984R741R295M499j0002J4317l0197N111J5133j6856
8659A8861J4948K2417k5639m8597j715m363J1071K3251O324K139n109j7422J9283
$$ plain form
8750 78505 43853 27428 16748 2726 -11257 -23836 -5134 977 27047 42018 19101 10974
8738 10974 4864 -7735 316 18364 42468 62482 60025 33292 16972 24110 64969 62052 39906
8725 39906 20256 12904 -3061 10460 45652 43007 29127 62671 89242 64262 59629 55251 53026
8712 53026 40324 50922 55091 47571 22343 -2987 -7721 13761 25331 19102 28359 46924 20697
8699 20697 12603 51452 61419 33003 30569 23026 20863 13098 13948 975 2122 8103 18614 38640
8685 38640 30717 7588 20184 40699 36659 56614 59424 42526 21045 41327 40003 53657 52408
8672 52408 34556 5848 836 17820 27561 36856 41355 31353 45670 15473 20584 35717 18861
8659 18861 33809 56226 30587 -18010 -19725 -24088 -13017 10234 16558 18697 13588 -3834 15449
8646A5449L5789K98L300J6347O175l491n528P788J429J3570j7785J655Q913J5788
8632I9697k2618j8556j8673J2171K9948q838j0904R568K2089k1720k4380K9616
8620G7400J8586K150L604l769j7542J8864J5372j8663p994o188J5931K4167o859
8607A15059l5254m865M0610M1408J9334K5720J9230J0438J2734M1098N6575J8813
8595C60900j6204J0821L2328M5535L7738J1382N463J8131J972p265k8142p6671
8583C95988r4738k4054k7545l1957k4037j2619k2054q43j8897k8040m0941j1057
8571E9206J426N321j4104K2164j453j9690k0033o577K4061J4407k153Q524K83
8558G1382J4903o638k0447k0503k5241k6894O401K5881M5702Q150k2618L409O724
$$ plain form
8646 15449 51238 51536 54836 71183 77358 73867 68339 76127 77556 91126 73341 74996 83909 99697
8632 99697 77079 58523 39850 52021 81969 73131 62227 71795 93884 72164 47784 77400
8620 77400 95986 98136 101740 97971 80429 99293 114665 96002 88008 81820 97751 121918 115059
8607 115059 79805 74940 115550 156958 176292 202012 221242 231680 244414 285512 342087 360900
8595 360900 344696 355517 387845 433380 471118 482500 487963 506094 508066 500801 472659 395988
8583 395988 301250 277196 249651 217694 193657 181038 158984 158141 139244 111204 70263 59206
8571 59206 60632 65953 51849 74013 72560 52870 32837 26260 50321 64728 62575 71099 71382
8558 71382 86285 79647 59200 38697 13456 -13438 -7037 18844 64546 72696 50078 53487 60211
8545F0211j491M712o032j7709M169j1774j0749k8604j408L1410M4879K8409m442
8532I1581k6289j4670k966k2662k5752j1722L8067J7277j0585K1792Q288l5415
8520B6944j4748K4950k0636j0503K1795N768l269M190J5741M201l0316o507J0844
8507B8454K6419K038l3292k7384M175j3584k6646J7537M6083o770O555L7733N920
8494F7238k8223j1369Q854K4468K0916k3593M77j2928P003m237j9292j2859k053
8481A4402K142j6716M564j6899J2591n891P494L7141p717l7135j2740O852j3569
8468b5481k0770L1370K2628m042N83j2436r79J4241j2063m358K9591J2953j6987
8455A4250r266O554J6039r178J1488r85K527J0102L910O167j7621l9592M175J2063
$$ plain form
8545 60211 58720 63432 57400 39691 43860 32086 21337 -7267 -8675 22735 67614 96023 91581
8532 91581 65292 50622 47656 24994 -758 -12480 25587 42864 32279 54071 62359 26944
8520 26944 12196 37146 16510 6007 27802 33570 30301 34491 50232 54433 24117 17610 28454
8507 28454 54873 56911 23619 -3765 410 -13174 -39820 -22283 23800 17030 23585 61318 67238
8494 67238 39015 27646 36500 60968 81884 58291 58768 45840 52843 48606 29314 16455 14402
8481 14402 16544 -172 4392 -12507 84 -5807 1687 38828 31111 -6024 -18764 -11912 -25481
8468 -25481 -46251 -14881 7747 3705 4288 -8148 -9127 5114 -6949 -11307 18284 31237 14250
8455 14250 4984 11538 27577 18399 29887 28902 31429 41531 45441 51608 33987 -5605 -1430 10633
8441A0633J3205J6091m955J4476j7903k8275r674J7200m49j24j0201J4292j5170
8428h54m844N0240N413k3074q165p75K4033k4545k2858J0586J9913J650O328M6770
8414G9818O001m2104k9302k7015N591K3406K0794p494r290J5628j0589j8272J521
8401H693L0703M166j6425k7621k425j709K3307N800O344J1027q840j3398k0058
8388d36K540J7126K5264L930j3136j899k745j1217M164p349k1479m052J7604L9242
8374D7557L73l8780m3881J1104K6035P088J3158J7308N501l3414k3059j8390j2970
8361d2370L6279K5280p474J0288n245j0867J7131o922q975R025R299k2556k0078
8348a7185N1832K0764l6714j7502J8380J3128J578j2038K57o114P863K2015K2892
$$ plain form
8441 10633 23838 39929 34974 49450 31547 3272 -6402 10798 10349 10225 24 14316 -854
8428 -854 -5698 44542 49955 26881 18716 17941 41974 17429 -5429 5157 25070 26720 33048 79818
8414 79818 85819 43715 14413 -12602 -7011 16395 37189 29695 20405 36033 25444 7172 8693
8401 8693 39396 43562 27137 -484 -2909 -4618 18689 24489 30833 41860 33020 19622 -436
8388 -436 2104 19230 44494 48424 35288 33389 30644 19427 23591 16242 -5237 -9289 8315 47557
8374 47557 47930 9150 -34731 -23627 2408 9496 22654 39962 45463 12049 -11010 -29400 -42370
8361 -42370 -6091 19189 11715 22003 16758 5891 23022 16100 7125 16150 25449 2893 -17185
8348 -17185 34647 55411 18697 1195 19575 32703 34281 22243 22500 16386 24249 46264 69156
8335F9156q872r887j4189j3945m86N594j3162J2192K5021l543j7262j2234j9564
8322a181O017L2661Q08o601j151l8257k476L656K599k8644j5674J4847L4663J8512
8308A9779M645l2321p646L5093Q762j5639k7898j8282K697O53j2264q402m42K2569
8294b8696p347Q153K7625L7081K221j4313k722k819l5297O097J012J6762J8282
8281B6039J9864o984J2221j436k618O109Q552k4671j0602o300Q519j7547o759
8268D387J5235R970J2274j1449k3568o434j1503P319K5117l3146j3913L995Q788
8255a2928R898R081k4892r121j1926K0369J5786Q77J1201J7499J5848J314k417
8242D0589N472K038j3880j069m728J9479J9518j945m4051N826M6855J2717J3502
$$ plain form
8335 69156 60284 50397 36208 22263 21777 27371 14209 26401 51422 47879 30617 18383 -1181
8322 -1181 4836 37497 38305 31704 30553 -7704 -10180 -6524 -3925 -32569 -48243 -33396 1267 19779
8308 19779 24424 -7897 -15543 19550 28312 12673 -15225 -33507 -30810 -30157 -42421 -50823 -51265 -28696
8294 -28696 -36043 -27890 -265 36816 39037 24724 22002 19183 -16114 -10017 -9005 7757 26039
8281 26039 45903 38919 51140 49704 47086 53195 61747 37076 26474 20174 28693 11146 4387
8268 4387 19622 29592 41866 30417 6849 415 -11088 -3769 21348 -11798 -25711 -21716 -12928
8255 -12928 -3030 6051 -18841 -27962 -39888 -19519 -3733 -2856 8345 25844 41692 43006 40589
8242 40589 46061 48099 34219 33150 28422 47901 67419 65474 21423 27249 74104 86821 100323
8229A00323K564m3834r403k2364j1703j1461l654l357J4166J5677R215p259l3704
8216d794k0917J3332j267p412J321k593j7629K2574K3556l4137k1180M657J2630
8203c1859l084Q825M8799Q573k1297j1978K1823n227j2987j702r267N944J1903
8190H466P894J8424J9158n847k5106j6841j3201M786J902J3536K2j2553k954J2010
8176I696k539L158j1681K0324J0555J2312j7938j5958R089l102N791L58m424j4684
8162I57J1879K5054Q620o659r490j1604l290J7366j2031j2622k4117P008J87P916
8148h26j0134j5935L8267J1485j6612J5282Q271k649M378k2568k9579j163j9536
8135d1319j772N448L6766m111Q243o709k5695K9851M5358K9710j3681k1433j2693
$$ plain form
8229 100323 102887 59053 49650 27286 15583 4122 468 -2889 11277 26954 36169 28910 -4794
8216 -4794 -25711 -12379 -13646 -21058 -19737 -22330 -39959 -17385 6171 -27966 -49146 -44489 -31859
8203 -31859 -34943 -26118 22681 31254 9957 -2021 19802 14575 1588 -114 -9381 -3437 8466
8190 8466 16360 34784 53942 48095 22989 6148 -7053 -2267 -365 13171 13193 640 -2314 9696
8176 9696 7157 10315 -1366 18958 29513 41825 23887 7929 17018 13916 19707 20065 15641 957
8162 957 12836 37890 46510 39851 30361 18757 15467 32833 20802 8180 -15937 -8929 -8742 -826
8148 -826 -10960 -26895 11372 22857 6245 21527 29798 27149 31527 8959 -20620 -21783 -41319
8135 -41319 -43091 -37643 -877 -4988 3255 -3454 -29149 702 46060 75770 62089 40656 27963
8122B7963k2805J4793Q507j4694J677J6905k9921J383J3489k640Q878P059n055
8109B5539l343k7940j0191J6167j3350l2829K5616J1695J3981j6425l918j187
8097a6185L314r963k2J1988M26j447j179J7145L606j2592j2823j2802K3417M297
8083b820J5020J2237J23k6333j4349K808m510J2219j6864K283J3453J0625J1323
8070A5215p716k343k5714J9882L0768J487K49j0260L104O1388l874l1059j5911
8057C5216L107l163n38R840j7N494J0501l487k829k6519L751R730q430J6654N753
8042E5063k2344Q837N359j686k5542K96L3659M085l3527R863K3617j663l9473
8029A6544j8169j8832N368J8618M546Q480J4766J5314p699r59N531J3260j1955
$$ plain form
8122 27963 5158 19951 28458 13764 15441 32346 2425 3808 17297 14657 23535 30594 25539
8109 25539 22196 -5744 -15935 232 -13118 -45947 -20331 -8636 5345 -11080 -14998 -16185
8097 -16185 -12871 -22834 -22856 -10868 -10442 -11889 -13068 4077 7683 -4909 -17732 -30534 -7117 -2820
8083 -2820 12200 24437 24560 -1773 -16122 -13314 -17824 -5605 -22469 -20186 -6733 3892 15215
8070 15215 7499 5156 -20558 -676 30092 31579 31828 21568 24672 86060 82186 51127 35216
8057 35216 38323 35160 34622 44462 44445 49939 60440 56953 54124 27605 31356 41086 32656 49310 55063
8042 55063 32719 41556 46915 45229 19687 19983 53642 57727 24200 34063 57680 56017 16544
8029 16544 -1625 -20457 -15089 3529 8075 16555 31321 46635 38936 37977 43508 56768 44813
8016D4813k9804k3462j232K7626J867m2291k1345J8417K4073K4888K6447O390
8004E6387J106o220J710n105J0875J9900K366k5861R866J7350J6818o374j3039
7991G9779J7332R121J0856k7279L12j4788j0264p809j0197k6321L090J6975n332
7978C5475n297j8614J6055K7094P026j40n364J343m385j3319Q371K736j5759J9375
7964E4597J4193k1518j5839j3498j5111q237L4982J7292K87J8525J8434j8600
7952F5507k4462j2701n91N1922n658k0372J4480m644n299M031j3063N104K362
7939E6616K8503R131j9275k9316q602J7220p642k4706K2886q115K962R654j1301
7926C8015j0878k396j0391k4256R68L140l3784J4158L0982J3237j9371j5920p224
$$ plain form
8016 44813 15009 -8453 -9685 17941 19808 -22483 -43828 -25411 -1338 23550 49997 56387
8004 56387 57493 51273 52983 47878 58753 78653 81019 55158 65024 82374 99192 92818 79779
7991 79779 97111 106232 117088 89809 90121 75333 65069 57260 47063 20742 23832 40807 35475
7978 35475 30178 11564 27619 54713 61739 61599 56235 57578 53193 39874 48245 50981 35222 54597
7964 54597 68790 47272 31433 17935 2824 -5413 29569 46861 47148 65673 84107 65507
7952 65507 41045 28344 27753 79675 74017 53645 68125 63481 58182 62213 49150 54254 56616
7939 56616 85119 94250 74975 45659 37057 54277 46635 21929 44815 36700 39662 49316 38015
7926 38015 27137 24741 14350 -9906 -8938 -5798 -39582 -25424 5558 18795 -576 -16496 -23720
7913b3720L0344L055L33K6599J170L376j9234J472J1391k104k1816O063J6197
7900C3126j2686k0954l5873J0562K3890l936P105J1666r500N875n933L799M123
7887A1264N228j2997j6147m191J0565K551N76J4913p614j7776l026J757K1982
7874G085J2300j2364o058J439k1906R757L074Q513l433J8286j2677k7039P410
7861a5613P959L357r273K4352K0547k959k950L6171k732j8093k4390l3328N326
7848a1626J6164Q530L144o68r470j2377J8290L3146j7820k7153j4390k0198J5216
7835a9212J8417L1838Q10K473k719k4193Q310j7344j5442M655J9087M375J2717
7822B3772J1919M967k1628l283r338K346N620J1755J7019K3336l2856l2731O134
$$ plain form
7913 -23720 6624 9679 10012 36611 37781 41157 21923 23395 34786 32682 10866 16929 33126
7900 33126 20440 -514 -36387 -25825 -1935 -5871 1234 12900 3400 9275 3342 7141 11264
7887 11264 16492 3495 -12652 -16843 -6278 -3727 -3151 11762 4148 -13628 -16654 -14897 7085
7874 7085 19385 7021 963 2402 -19504 -9747 -6673 1840 -1593 16693 4016 -23023 -15613
7861 -15613 -7654 -4297 -13570 10782 31329 28370 25420 61591 58859 40766 16376 -16952 -11626
7848 -11626 4538 13068 16212 15544 6074 -6303 11987 45133 27313 160 -14230 -34428 -19212
7835 -19212 -795 31043 31853 34326 31607 7414 15724 -1620 -17062 -12407 6680 11055 23772
7822 23772 35691 40658 19030 15747 6409 8755 14375 26130 43149 66485 33629 898 7032
7809G032j2402r120J4671M2641M1378k0197l2992n944p555j4341j8526K1341J1672
7796A7658M984N291r560L231j2165j4755k4564P716K3641J4918J5395Q394J2016
7783E2200m981L488j6198k4888j5436m38j1881M641O551J5710j2194K0834j4919
7770B489k0488j0357K6469K1607j6211J7684M357k4861k2923N846K6505L797P728
7757B1642N07j284L0513q036k7077j8362L119k228L666j2434k23K2627j222n425
7743E783j9998m75J4172o222j1668J9194J8740r049k1615k0780l8990J0602M4359
7730a5947J9251J2201K6052J0920k6994l6178l56K8029K7991j5771k8558P819
7718H459j7073K474k989K318n167o014m483l576n54J1177J809j3765o460r976
$$ plain form
7809 7032 -5370 -14490 181 42822 84200 64003 31011 25067 17512 3171 -15355 5986 17658
7796 17658 22642 27933 18373 21604 9439 -5316 -29880 -22164 1477 16395 31790 40184 52200
7783 52200 47219 50707 34509 9621 -5815 -6253 -18134 -13493 -6942 8768 -3426 17408 2489
7770 2489 -17999 -28356 -1887 19720 3509 21193 25550 689 -22234 -16388 10117 13914 21642
7757 21642 22149 20865 51378 43342 16265 -2097 1022 -1206 2460 -9974 -10197 12430 11208 5783
7743 5783 -14215 -14690 -518 -6740 -18408 786 19526 10477 -11138 -31918 -70908 -60306 -15947
7730 -15947 3304 15505 41557 52477 25483 -10695 -11051 16978 44969 29198 640 8459
7718 8459 -8614 -6140 -9129 -6811 -11978 -17992 -22475 -26051 -26605 -15428 -13619 -27384 -33844 -43820
7704d3820L329K0489L3702J2048l3756k831j6340k9577p741J869K1314K6689J5430
7691H05l1101J728J3652J6772p395r723k0384l452J1104Q325K3488J4692K013
7678B0524L649j3924k2866j834K5756R474k993q426l227o445j297k2212j3323
7665c7144J1954L0133O138m0173L531M2438J8673p990j7770k7492P544J6401M119
7652A0362P518j0836k2936j8141j0568N969L906J6548K3635r751q454J70j2993
7639b5571n001N104L5322J0494o360k565j361P617m744l5242k0808J4071L5252
7626F208L925j31J8666k3038J1097k4193m0429K2405L5353J0832K3777q438k5317
7613A0717j0896P555J943j5722k774K5231K9262n861j8967N224K445j4860K0371
$$ plain form
7704 -43820 -40491 -20002 13700 25748 -8008 -10839 -27179 -56756 -64497 -62628 -41314 -14625 805
7691 805 -30296 -28568 -14916 1856 -5539 -15262 -35646 -39098 -27994 -19669 3819 18511 20524
7678 20524 24173 10249 -12617 -14451 11305 20779 17786 9360 6133 -312 -1609 -23821 -37144
7665 -37144 -25190 4943 11081 -29092 -25561 16877 35550 27560 9790 -17702 -10158 6243 10362
7652 10362 17880 7044 -15892 -34033 -44601 -38632 -34726 -18178 5457 -4294 -12748 -12578 -25571
7639 -25571 -30572 -25468 9854 20348 13988 11423 10062 17679 12935 -22307 -43115 -29044 6208
7626 6208 10133 10002 28668 5630 16727 -7466 -47895 -25490 9863 20695 44472 36034 10717
7613 10717 -179 7376 9319 -6403 -9177 16054 45316 39455 20488 25712 28157 13297 33668
7600C3668m251k6526j8857R288j6709j0317r095K4369J4015p153Q138R361j0431
7587d500M39J9701l144k3240j9896K724J6094Q165j6819m306p613M395j4688j84
7573d2872J7554r770K7624K0045l0907k8010J2132J5020P005K810j4332m761P039
7560b1423P436L5211J8543k8666k6156P92J2014j105P633j8618k41M617j8621
7547b8584k4758j6964K4043J5883L2239J9523J607N077j7145j252p498k2598n081
7534b5508R620J8176j0515j3750P78j4953j422L252K9363M721R955K243J697o899
7520F758J4307K5459j1619j0725J0157k951j1782k003j4154Q91J7518n021j525
7507A5310j5660l1096M458K3114O318k087J2838O917j3940J6386J170o817K1524
$$ plain form
7600 33668 29417 2891 -15966 -6678 -23387 -33704 -42799 -18430 -4415 -11568 -3430 5931 -4500
7587 -4500 -4061 15640 12496 -10744 -30640 -27916 -11822 -3657 -20476 -24782 -32395 -28000 -42688 -42872
7573 -42872 -25318 -35088 -7464 12581 -18326 -46336 -34204 -19184 -12179 -9369 -23701 -28462 -21423
7560 -21423 -13987 21224 39767 11101 -15055 -14263 -2249 -3354 4279 -14339 -14580 -9963 -28584
7547 -28584 -53342 -70306 -46263 -30380 1859 21382 22989 28066 10921 9669 2171 -20427 -25508
7534 -25508 -15888 2288 -8227 -21977 -21199 -36152 -37574 -34322 -4959 -238 9717 11960 13657 6758
7520 6758 21065 46524 34905 24180 34337 31386 19604 17601 3447 4338 21856 16835 15310
7507 15310 -350 -31446 -26988 -3874 2444 357 13195 20112 6172 22558 23728 16911 38435
7494C8435J5263j6627k7853l683r595M455j973J1689l5860j1206L6490J5630j7039
7481a874j6012J2929K2207p290j7936P050O928j2467j3600l466m346K1290P149
7468E62j2359J418j6134k4207J7548N1644K1021J2492L99P41j0726k1591R03m977
7454A6734l6976j3642k3549j9121Q363j7064K5865J7744l801J6244J3896J3031
7442b276j3405m865L019P658j0975J201L029J1967m354k859j7216P156l734M414
7428b1240N341j66n718k8777J0048j971P48K4686M4144o64k4492k1537J4442j0234
7414a5390j2124k370o792L323K5167l404n195L0665J1056j8731k3519k9822k3356
7401g0492L5410K8929j3170k8681n439L4759K1198Q831L450o564j0566O807J3386
$$ plain form
7494 38435 53698 37071 9218 5535 -4060 395 -1578 10111 -25749 -36955 -465 15165 -1874
7481 -1874 -17886 -4957 17250 9960 -7976 -926 6002 -6465 -20065 -23531 -27877 -6587 562
7468 562 -11797 -10379 -26513 -50720 -33172 18472 39493 51985 52384 53125 42399 20808 21711 16734
7454 16734 -20242 -33884 -57433 -76554 -68191 -85255 -59390 -41646 -45447 -29203 -15307 -2276
7442 -2276 -15681 -20546 -17527 -9869 -20844 -19643 -16614 -4647 -9001 -11860 -29076 -21920 -25654 -21240
7428 -21240 -15899 -16065 -21783 -50560 -40512 -42483 -41735 -17049 27095 26431 1939 -19598 -5156 -15390
7414 -15390 -27514 -29884 -36676 -33353 -8186 -11590 -16785 13880 24936 6205 -17314 -47136 -70492
7401 -70492 -35082 -6153 -19323 -48004 -53443 -18684 2514 11345 14795 8231 -2335 4472 17858
7388A7858k1131k0313j7994J6768J5191j8577K1744J264L3527k8146l2769j3824
7376d6402J3095J9246r491K3334K8592l1188L848K531j8007l1621n764J4736P088
7363c0003K535J0603N21J0568j2631k8693j7877M541J703m002J892M665L4171
7350b2007J3273q699k0148J0198J0460L106J9876j5749j4070J5593J8901j5530
7338d796j3333L207o029L1346J4007l348k605j204L459K1469l1227j0736k3838
7325b3628o532J9493J7026j2678J003j8155k1590P465J2828K5082J031M78J125
7312B948K5309K0679j9174j2390j1884j0685q738k778k0653R646K6235k5391J380
7299b5496n280L7937J0700r494j108p531K5715J450k3139j9052P842q771j0561
$$ plain form
7388 17858 -3273 -23586 -41580 -24812 -9621 -28198 -6454 -5190 28337 191 -32578 -46402
7376 -46402 -33307 -14061 -23552 -218 28374 -2814 1034 3565 -14442 -46063 -51827 -37091 -30003
7363 -30003 -27468 -16865 -16344 -5776 -18407 -47100 -64977 -60436 -58733 -62735 -60843 -56178 -22007
7350 -22007 -8734 -17433 -37581 -27383 -16923 -13817 6059 -9690 -23760 -8167 10734 -4796
7338 -4796 -18129 -14922 -20951 10395 24402 21054 18449 17245 20704 42173 10946 210 -23628
7325 -23628 -30160 -10667 6359 -6319 -5316 -23471 -45061 -37596 -24768 314 1345 1823 2948
7312 2948 28257 48936 29762 17372 5488 -5197 -13935 -16713 -37366 -27720 -1485 -26876 -25496
7299 -25496 -30776 7161 17861 8367 7259 -272 25443 26893 3754 -15298 -7456 -16227 -26788
7286b6788Q895n104j3666R843J3678J3698j5341k2975j0809j9473l868J7587j5751
7273g0074L968M2597M0544K6582m291R818m321l7006l0884o895J3806J4456K3173
7260B1473j5386k5683N438r091k0837L5286L0857K0319J751k1074j7113p489p290
7247h839j6517P093J8370J9011n57j5008k77J8941p51k9957l997R676K4497k0231
7233A454l1298k6520j7774N978J6050J6863j4669K0433J4348l8520j0212Q323
7221e5544j6115o7J2304J6068O713L5599J1732m325L859j3408k0620j0688k7239
7208f1731k2488q321J7600K8897J5848N886l310j2389p382j1632j5306K828L855
7195f7645j2559o089J2054J3799K567J7666J4421O948M651N952K413j0670R865
$$ plain form
7286 -26788 -17893 -22997 -36663 -26820 -13142 556 -14785 -37760 -48569 -68042 -71910 -54323 -70074
7273 -70074 -66106 -23509 17035 43617 39326 49144 44823 7817 -23067 -29962 -16156 -1700 21473
7260 21473 6087 -19596 -14158 -23249 -44086 -8800 22057 42376 44127 23053 5940 -1549 -8839
7247 -8839 -25356 -18263 107 19118 18561 3553 3276 22217 21466 -8491 -12488 -2812 21685 1454
7233 1454 -29844 -56364 -74138 -68160 -52110 -35247 -49916 -29483 -15135 -53655 -63867 -55544
7221 -55544 -71659 -71726 -59422 -43354 -36641 -1042 10690 6365 10224 -3184 -23804 -34492 -61731
7208 -61731 -84219 -92540 -74940 -46043 -30195 -24309 -27619 -40008 -47390 -59022 -74328 -71500 -67645
7195 -67645 -80204 -86293 -74239 -60440 -57873 -40207 -25786 -18838 -14187 -8235 -5822 -16492 -6627
7182f627m829L94k32q73j1325N630Q669k8149j8247J6725m735O676J8932J3219
7168d772K2311r502P325J7301j14k695J6997q15k3928m528j0623r77N539k5059
7154a3540J4554J1264j5648o079K0296R889n9904j4498J0919q368P803k579r820
7141e5711q38O960K646J0259R750K265K5162K8571q530m3151j409J4951k176J9788
7127H537M9633j3758l8827j2662k2462o43O362N405R08k565k5264r321J1371L9677
7113c609L2425m218m3850j6844K9284k08M109K819O632Q134j9225o013K2949J9221
7099C1606l969k299Q337k566j5477r373M468J1695j4554p324j8185k8360k354
7086d8355J5298K69K8852J1149R37p311O284j655L804M170j6931p618O510l14
$$ plain form
7182 -6627 -11456 -11062 -11294 -12167 -23492 -17862 -9193 -37342 -55589 -38864 -43599 -36923 -17991 -4772
7168 -4772 17539 8037 15362 32663 32549 29854 46851 46036 22108 17580 6957 5980 11519 -13540
7154 -13540 1014 12278 -3370 -9449 10847 20736 -39168 -53666 -42747 -51115 -43312 -45891 -55711
7141 -55711 -56549 -49589 -46943 -36684 -26934 -24669 493 29064 20534 -22617 -24026 -9075 -11251 8537
7127 8537 58170 44412 5585 -7077 -29539 -30182 -23820 -18415 -17507 -20072 -45336 -54657 -43286 -3609
7113 -3609 28816 24598 -19252 -36096 -6812 -7020 -2911 -92 6540 14674 -4551 -10564 12385 31606
7099 31606 27637 25338 33675 31109 15632 6259 10727 22422 7868 544 -17641 -46001 -48355
7086 -48355 -33057 -32788 -3936 7213 8150 839 7123 5468 9272 13442 -3489 -11107 -4597 -4911
7072d911K552J4262O674o160l992J052M58k9080K4634K1302k1178j4069j2053
7059b0509J9138R789r793k9851R987M178j0759O58K1607j1204j7012K1166K1613
7046I008R232k1844r076j6171Q188K6340L9608J4076n364k1594j5848j373O90
7033A5872j0941j861Q067j1434k2812K530J1189J0518j3248n375J6487J7132r14
7020A5210k5629l9745j4111J2860O157K3750K2174K7341J618j557l1055o643J7660
7007H030j433k0652k7559l0442M962Q094j860K6172L6094J8038j0139J4747l562
6994B0490j0418P76l795l282k6420N294K2166J280K601k7889r380L575j1221j905
6980c8128J3316n251k4851K3214J2703l907P904P206n789j596O963j8132J103
$$ plain form
7072 -4911 -2359 11903 18577 12417 8425 9477 9935 -19145 5489 26791 5613 -8456 -20509
7059 -20509 -1371 8418 -1375 -31226 -21239 -17061 -27820 -27162 -5555 -16759 -33771 -12605 9008
7046 9008 18240 -3604 -12680 -28851 -20663 5677 45285 59361 53997 32403 16555 15182 15872
7033 15872 4931 3070 11137 -297 -23109 -20579 -9390 1128 -12120 -17495 -1008 16124 15210
7020 15210 -10419 -50164 -64275 -51415 -45258 -21508 666 28007 29625 28068 -2987 -9630 8030
7007 8030 6597 -14055 -41614 -72056 -67094 -59000 -60860 -34688 1406 19444 9305 24052 20490
6994 20490 10072 10848 7053 3771 -22649 -17355 4811 6091 8692 -19197 -28577 -25002 -36223 -38128
6980 -38128 -24812 -30063 -54914 -31700 -18997 -22904 -15000 -7794 -13583 -15179 -8216 -26348 -25245
6967b5245M976r332n688J6303K4351j6490j4184J5930J9893J7614N387k7033k6972
6954b0490p278k0834J681L1508M964r952J55K3598M702J7309Q312k0958k9116
6941a6399j4455K0301L1270p420p611j4445q99j4718m596J5054L7234L7254K259
6928F2829J996k3730k7483Q143J70j3042O98r889k1012j333L1005M963j7249L747
6914a87K5834k980k7180l617K2416j3416j0180j6693Q550R118O715l560l139J871
6900f448K381m056k5273n172l476m457j5353Q169J3464P303K0358L529p740O207
6886a0564J1856M617N242j7590o955J6476j6812o431j152j9422k104L1623J2939
6873A723n274j7266M764J9761r003O536Q187j6352j128j6352l0828L8K3753K2599
$$ plain form
6967 -25245 -20269 -29601 -35289 -18986 5365 -11125 -25309 -9379 10514 28128 33515 6482 -20490
6954 -20490 -27768 -48602 -46921 -15413 -10449 -20401 -20246 3352 8054 25363 33675 12717 -16399
6941 -16399 -30854 -10553 20717 13297 5686 -8759 -9658 -24376 -28972 -13918 23316 60570 62829
6928 62829 64825 41095 13612 21755 21925 8883 9581 -308 -21320 -22653 8352 13315 -3934 -187
6914 -187 25647 22667 -4513 -8130 14286 870 -9310 -26003 -17453 -8335 -1620 -5180 -8319 -6448
6900 -6448 -4067 -8123 -33396 -38568 -42044 -46501 -61854 -53685 -40221 -32918 -12560 -9031 -16771 -10564
6886 -10564 1292 5909 11151 -6439 -13394 3082 -13730 -20161 -21313 -40735 -42839 -11216 1723
6873 1723 -3551 -20817 -16053 3708 -5295 1241 9428 -6924 -8052 -24404 -55232 -55194 -31441 -8842
6859h842M21M332k7923Q417P547j1369K5049M770j4590k36J1359k1293J529N195
6845a5634J6238K090j4404k488L9871l048k3632j1735P21J5302J0748J5956j2817
6832A7168j8954J2327k2437j431r15j2401J3406J9116l678j0627r092N970j1093
6819b2641O875J8156J1713J76m991q184K7630J1626l7173j1211P075J8011R90
6806A8052m129j958j5941l604j2242j2344J3624O924Q692q714j9304L4336J5630
6793A9022j759k0264j8554J2745k619q78J0880M849L365j053p121K4118j0723
6780A2008j2445K774j5406N49o09j0984J3243r198N669P570j9935R850J6249p012
6766g677k8351K643l519J8866k41K599J4523j5217j4310J1757j426N729L1752
$$ plain form
6859 -8842 -8421 -4089 -32012 -23595 -16048 -27417 -2368 2402 -12188 -12424 -1065 -22358 -20829 -15634
6845 -15634 604 2694 -11710 -14198 25673 22625 -1007 -12742 -12021 3281 14029 29985 17168
6832 17168 -1786 10541 -11896 -13327 -14242 -26643 -13237 5879 2201 -8426 -17518 -11548 -22641
6819 -22641 -15766 2390 14103 14279 9288 1104 28734 40360 3187 -8024 -949 17062 18052
6806 18052 13923 11965 -3976 -7580 -19822 -32166 -18542 -11618 -2926 -11640 -30944 3392 19022
6793 19022 17263 -3001 -21555 -8810 -11429 -12307 -1427 3422 6787 5734 -1387 22731 12008
6780 12008 -437 2337 -13069 -12520 -13129 -24113 -10870 -20068 -14399 -6829 -26764 -16914 -665 -7677
6766 -7677 -36028 -33385 -36904 -18038 -18279 -15680 -1157 -16374 -30684 -18927 -20353 -14624 17128
6753A7128O786o768j5879l5098j1824J2638J9954j9243J3265K9546J9338J1552
6741D1395j3581n604p395o56N289J3456r902j0538K439j0263j7225j0346K8524
6728E593m84j3740j7479j1203L721K0438j711L1847L3665J0253k6380r664K213
6715B7069J9883J5050l9605l0421n123M400o323J8985J9731k5653l711M815q321
6702i224M711J7451k223j487J1007J7360l8164n184M108J1164r214J795J4610
6689A6710p641L270N611k5055k0003k3754o254J3451M1316k106j333J2047j0502
6676d243p622n495m228N413R002K7453k7581j5931J2402j4617q562J505n776P074
6662c1206M547o065j8114L697J9822K1660k525l4871l24K4099j4106j3511K7081
$$ plain form
6753 17128 23914 17146 1267 -33831 -45655 -33017 -13063 -32306 -19041 10505 29843 41395
6741 41395 27814 22210 14815 14159 19448 32904 23002 12464 14903 4640 -12585 -22931 5593
6728 5593 5109 -8631 -26110 -37313 -33592 -13154 -14865 16982 50647 60900 34520 24856 27069
6715 27069 46952 62002 22397 -8024 -13147 -8747 -15070 3915 23646 -2007 -5718 -903 -9224
6702 -9224 -4513 12938 10715 9228 20235 37595 -569 -5753 -1645 9519 305 2100 16710
6689 16710 9069 12339 17950 -7105 -27108 -50862 -57116 -43665 -2349 -4455 -5788 6259 -4243
6676 -4243 -11865 -17360 -21588 -16175 -7173 20280 -7301 -23232 -10830 -25447 -34009 -32504 -38280 -31206
6662 -31206 -26659 -32724 -50838 -47141 -27319 -5659 -8184 -43055 -43379 -19280 -33386 -46897 -19816
6649a9816J3720J0608j3406J887j568l089l1118j6590L6029K6846r511j0591j9265
6636c5864J8606j1948J2418J3197N51k0549k3405k862L3343P701R743p417K514
6623c972r244L4475P207j0055j8637j7392k0707M030L0898O061q855j0297L1989
6610A5501j2854R140P225k1890J1313L870m257Nm522N350l7601j8794K5861J6439
6596e214m566J2324r33J7633L842r213L391n141N734l0582j4492J2236J5252O614
6582F885J8758L2355K3296O862j6249l8768l2808j1167J4350k036Q418M3617p866
6569D5647n3198q309J9235m314k3533j2710Q574Q240K642l223l0189l6390M0349
6556d7179M8547q732J5234R810Q691j095j8760j3043k2220k2591L3437K560K978
$$ plain form
6649 -19816 -6096 4512 -8894 -7007 -8575 -11664 -42782 -59372 -23343 3503 -6008 -16599 -35864
6636 -35864 -17258 -29206 -16788 -3591 -3040 -23589 -46994 -49856 -16513 -8812 931 -6486 -3972
6623 -3972 -13216 21259 28466 18411 -226 -17618 -38325 -34295 -3397 2664 -6191 -16488 15501
6610 15501 2647 11787 19012 -2878 8435 12305 8048 8053 3531 8881 -28720 -47514 -21653 -5214
6596 -5214 -9780 2544 1611 19244 23086 13873 17264 12123 17857 -12725 -27217 -14981 271 6885
6582 6885 25643 57998 81294 88156 71907 33139 331 -10836 3514 1478 9896 53513 45647
6569 45647 -7551 -15860 3375 -939 -24472 -37182 -28608 -20368 -17726 -20949 -51138 -87528 -47179
6556 -47179 1368 -7364 7870 17680 26371 25276 6516 -6527 -28747 -51338 -17901 -15341 -12363
6543a2363N990J7349M227N275k4730k1913K3571j2146m054kP507j1477J7476L1527
6529B6237j7055n599j6637k1551J9130l3547r437K4110J6071Q911K5707j4428
6517A912n573j986L034J9471M630M142m0037k1682J1007J2388Q346r862J4580
6504C70J322K097K661N038K090l6555r880M766J2372r330j6210R821K5340J859
6490d239k3939L718J4867j2440l844j769J3999K55O046L7312P665j3953m2918
6477a9240k7991k1450J1994L9893J9623P030l071j9545r145J2642j3803J0711
6465a2352j9477q28K6601M486r085N279K814J4918L0542k0021k6492L618K8294
6452B8297n52j0965l342j6873l560Q296n40j0869r351l5697l1506K746O2255K6253
$$ plain form
6543 -12363 -6373 10976 15203 20478 -4252 -26165 -2594 -14740 -18794 -18796 -11289 -22766 -5290 26237
6529 26237 9182 3583 -13054 -34605 -15475 -49022 -58459 -34349 -18278 -9367 16340 1912
6517 1912 -3661 -5647 -2613 16858 21488 25630 -14407 -36089 -25082 -12694 -4348 -14210 370
6504 370 1692 3789 6450 11488 13578 -22977 -32857 -28091 -15719 -25049 -41259 -31438 -6098 -4239
6490 -4239 -28178 -24460 -9593 -22033 -25877 -27646 -13647 -13392 -7346 29966 37631 23678 -19240
6477 -19240 -47231 -68681 -56687 -16794 2829 9859 6788 -12757 -21902 -9260 -23063 -12352
6465 -12352 -31829 -32657 -6056 -1570 -10655 -5376 -2562 12356 42898 22877 -3615 3 28297
6452 28297 27745 16780 13438 -3435 -6995 1301 761 -10108 -19459 -55156 -86662 -83916 -21661 4592
6438D592j3957k09j1954J4658L8686P279k5048j8838Q782l0579K7396M6621m511
6425D2918n466J6176k5910l1775m332J3031l210j071j6592j4246K4871j6247k0077
6412d1930J1111J0569k0752M501K8172J659J0477J3715J781j2636l0680m2891
6400f6904k8119j891Q688L2667L3334K9209m342J9982l347o410k869o555J4052
6387A7495M372J6892l4618Q57K5019J68q237k8411j9266Q777K6780K0971l803
6374B6996j5165j2364q490o38r870K975J0384J6411j7868k1451K2340L984O416
6361C660j0584j2008J3005L4163O69p580o253r724j8013j8250Q418K2546J9438
6348A9487K072k092p956k0736k7354K7448K7326m931R09J56j7818J8058J1114
$$ plain form
6438 4592 -9365 -9574 -21528 -6870 31816 39095 14047 -4791 3991 -26588 808 47429 42918
6425 42918 37452 53628 27718 -4057 -8389 4642 1432 361 -16231 -30477 -5606 -21853 -41930
6412 -41930 -30819 -20250 -41002 -36501 -8329 -6670 3807 17522 19303 6667 -24013 -66904
6400 -66904 -95023 -96914 -88226 -55559 -22225 6984 2642 22624 19277 12867 9998 3443 17495
6387 17495 21867 38759 4141 4998 30017 30185 21948 -6463 -25729 -16952 9828 30799 26996
6374 26996 11831 -533 -9023 -9661 -19531 -16556 -6172 10239 -7629 -29080 -6740 -2756 3660
6361 3660 -6924 -18932 -5927 28236 28905 21325 15072 5348 -12665 -30915 -22497 49 19487
6348 19487 21559 19467 11511 -9225 -36579 -9131 18195 13264 14173 14329 -3489 14569 25683
6335B5683l304l5443j0559p671P917K0894p640k4988p430K7295L0639j8184l4995
6322c7786j23L1471J6512K585k3265j6053J7722k319k2268K1592J1011p429K14
6309h136j4479K092n886j452J2461K024Q775L2544L7077j2647j8170l418k8750
6296B035p048O765j1973j6890K738L761Q350J7025L0062N21j1172l5333j4674
6283b5833k5566L0983K6322M309O886p892l5494k8433p535Q831J4157n004j3134
6270e7403Q130J8305J9508l200r788J1591k609j7749L100K3993J3496J6624j5057
6257H941o748L098K85j2514k9683M503J7006O105O233m360k7501N319K4124L0649
6243B5457J9410k9175j5987j4303R952l689l8860k0423J5542J7566L6002m187
$$ plain form
6335 25683 22379 -13064 -23623 -31294 -23377 -2483 -10123 -35111 -42541 -15246 15393 -2791 -37786
6322 -37786 -37909 -6438 10074 12659 -10606 -26659 -8937 -11256 -33524 -11932 -921 -8350 -8136
6309 -8136 -22615 -20523 -26409 -27861 -15400 -13376 -4601 27943 65020 52373 34203 30785 2035
6296 2035 -5013 1752 -10221 -27111 -24373 -20612 -12262 4763 34825 35346 24174 -11159 -25833
6283 -25833 -51399 -20416 5906 10215 17101 9209 -26285 -54718 -62253 -53422 -39265 -44269 -57403
6270 -57403 -49273 -30968 -11460 -14660 -24448 -12857 -15466 -33215 -30115 -6122 7374 23998 8941
6257 8941 2193 5291 5576 -6938 -36621 -32118 -15112 -9007 -2774 -7134 -34635 -29316 -5192 25457
6243 25457 44867 15692 -295 -14598 -4646 -8335 -47195 -67618 -52076 -34510 1492 -2695
6231b695J036M675Q693m386k9195J7533J129J813J6864J3183j9089p386n961k0837
6217b4623N648k8027k6373p831K1141J6737K327n650J9593l635L2087M465j2437
6204f578j7912j0727K1460j127j5344K0049L1820M042j3695O800R749q550j4407
6191E580k7798k40K7559K2272k8748r78J781Q596M315M259J8855L356o642j2762
6177A9405L1590m018p88m499l0124j0350j2234L267O56J922J1699l0252k0839
6164d4565J8312L3448n096n510K2361J6625k606j4124q663k60N443M115l823O161
6150B1818N059k2148k2688K323K5699L215j32k1389j1850r52J3286M0255J6293
6137D8789l6866j8918J2147L243k0087l397J2996J7428J3592k844Q529l556j2835
$$ plain form
6231 -2695 -1659 3016 11709 7323 -21872 -4339 -3210 -1397 15467 28650 9561 2175 -3786 -24623
6217 -24623 -18975 -47002 -73375 -81206 -60065 -43328 -41001 -46651 -27058 -30693 1394 5859 -6578
6204 -6578 -24490 -35217 -13757 -14884 -30228 -10179 21641 25683 11988 18788 28537 19987 5580
6191 5580 -22218 -22458 5101 27373 -1375 -2353 -572 8024 12339 16598 35453 38809 32167 19405
6177 19405 50995 46977 46189 41690 11566 1216 -11018 -7751 -7095 -5173 6526 -23726 -44565
6164 -44565 -26253 7195 2099 -3411 18950 35575 32969 18845 10182 9922 15365 19480 15657 21818
6150 21818 26877 4729 -17959 -15636 10063 13278 13146 -8243 -20093 -21045 -7759 32496 48789
6137 48789 11923 -6995 5152 8395 -11692 -15089 -2093 15335 28927 26083 34612 31056 18221
6124A8221k7933j1405J5948q564M235j2021J8975J3537j9965J6443j8718L720
6112g527J1116r177O488r879j9097L3562N4315n751l0424m527l89k7483j4329
6099b3102m233J1765N149J0587P421k4303r888n156J2765p581j9297j7472L1372
6086c1973M8235m505j4248j6471N267j5226p499J6188J6775j0117j5106J6543
6074a2137p164J4723K0652Q48M115m751k6794j6971K420k1373K2691L2289k5555
6061a7007k5095j2762K7080K4153K516p456M457k333J7627r846j0253K3837Q875
6048B3793M611k931J93k0019j5467O363K6319l1773r986J8951K8761J66j0777
6035A8204j4101m981O499l0994Q939Q435j8823j2475J8953k835Q603K419J1839
$$ plain form
6124 18221 -9712 -21117 -5169 -13733 -9498 -21519 -2544 10993 -8972 7471 -11247 -7527
6112 -7527 3589 -5588 900 -8979 -28076 5486 59801 54050 23626 19099 18710 -8773 -23102
6099 -23102 -27335 -15570 -10421 166 7587 -16716 -26604 -31760 -18995 -26576 -45873 -63345 -31973
6086 -31973 16262 11757 -2491 -18962 -13695 -28921 -36420 -20232 -3457 -13574 -28680 -12137
6074 -12137 -19301 -4578 16074 16922 21037 16286 -10508 -27479 -25059 -46432 -23741 8548 -17007
6061 -17007 -42102 -54864 -27784 -3631 -1115 -8571 -4114 -6447 11180 1334 -8919 14918 23793
6048 23793 28404 25473 25666 5647 -9820 -3457 22862 -8911 -18897 54 28815 28981 18204
6035 18204 4103 -878 5621 -25373 -16434 -7999 -26822 -39297 -20344 -23179 -14576 -12157 -318
6022c18J9875N336R87k5027J502j8059Q276k401j5251J4224R871R00k0230n043
6008b5358q087k8536J2250L2957j0328k5359n91K6446k6908j0498J5847M2670
5996e495J6375J435J3352j3271r389j5755j0938q169n617j844k1844K3808L1543
5983e809J0272q979j5647j2921K7585P362j171j3353l4162l0999J5463J2447L0392
5970a9520K721k6836k337k144M567J7578K5300N74j5002O63Q023R195L659m116
5956B325K2177K7376n1572j6581p032j6972J5968J192p430L663r124K9460J4795
5943H245N138K0677j4770j7464k117K8104K381q940Q719J718j5152q769l923K7185
5929C1032k1109l6082p25q250N037K0985k699J9249R340j9909p489l036m235p618
$$ plain form
6022 -318 19557 24893 25880 853 2355 -15704 -7428 -9829 -25080 -10856 -985 -85 -20315 -25358
6008 -25358 -33445 -61981 -49731 -16774 -27102 -52461 -53052 -26606 -53514 -64012 -48165 -5495
5996 -5495 10880 12315 25667 12396 3007 -12748 -23686 -31855 -37472 -39316 -61160 -37352 -5809
5983 -5809 4463 -4516 -20163 -33084 -5499 1863 692 -12661 -46823 -77822 -62359 -49912 -19520
5970 -19520 -16799 -43635 -45972 -48116 -43549 -25971 -671 -97 -15099 -14436 -6413 2782 6441 2325
5956 2325 24502 51878 306 -16275 -23307 -40279 -24311 -23119 -30549 -26886 -36010 -6550 8245
5943 8245 13383 34060 19290 1826 -291 27813 30194 21254 29973 31691 16539 7770 3847 31032
5929 31032 9923 -26159 -26884 -35134 -30097 -9112 -11811 7438 16778 -3131 -10620 -13656 -17891 -25509
5915b5509J2501Q536L099K587j4259k2080l192P740m654R670J4089J6622J3952
5902A9102r166j3664j7167K9256J1860j6118r756j458K3203J5655k0930k8028
5890a7211J485O51p619m7910N251J5910K2362o366k9034K1461J8050J147k398
5877b4221j1330K8258J0642j9519P8J2566N711j5605j8210L604Q607l140M997
5864a7562R014m769P030K6771j878j8621l867R296j1840k175j8894k0445N374
5851d2566j3869j8906j440k326L499K2172M5052K4382q912R015j5103j7000M420
5838a1582k334J1962q651l951j570J1253J2018j994j1102k6160j3246K565k7758
5825g0550j562J6707J3737L198J0351J5180K7615k136k5172J0551L472k1192j4653
$$ plain form
5915 -25509 -13008 -4472 -1373 1214 -13045 -35125 -38317 -30577 -35231 -25561 -11472 5150 19102
5902 19102 9936 -3728 -20895 8361 20221 4103 -5653 -7111 16092 31747 10817 -17211
5890 -17211 -15726 -15075 -22694 -70604 -65353 -49443 -27081 -33447 -62481 -41020 -22970 -21823 -24221
5877 -24221 -35551 -7293 3349 -16170 -16092 -3526 2185 -13420 -31630 -28026 -19419 -22559 -17562
5864 -17562 -8548 -13317 -6287 20484 18606 -15 -3882 5414 -6426 -8601 -27495 -47940 -42566
5851 -42566 -56435 -75341 -76781 -79107 -75608 -53436 -8384 15998 7086 16101 998 -16002 -11582
5838 -11582 -13916 -1954 -10605 -14556 -16126 -4873 7145 5151 -5951 -32111 -45357 -42792 -70550
5825 -70550 -72112 -55405 -41668 -38470 -28119 -12939 14676 12540 -12632 -2081 1391 -19801 -34454
5812c4454Q030j0357p750J1940J1540J5124O215r355M4363Q15l4124j8392J2609
5799c796K524q711j7910j3193K932r21J3280J4379k2206k1790J6484J2853N060
5786b1015o384k3299m810J5369J8791P998J4996j1738k8993K4815M1659j4706
5774A2683K2460j3543j25o801j2930k2501J3474K0534j3861J2024J2351n858j1626
5761F281m9024j2799J6829J5758N020j2654j039J4590n663p560j338k2576q455
5748f2630K4336L2248K5413o317j8698j4931P539K5706K4259K0524j1721q251
5736C7477K0758r955k3844l3936K4788K5314r829m918J2370m530j3530j1181K3686
5723C2670K92j6711k0703k2855Q422K8403R053o432m900L961j791q851k5424R442
$$ plain form
5812 -34454 -26424 -36781 -44531 -32591 -21051 -5927 288 -9067 35296 36111 1987 -16405 -3796
5799 -3796 -1272 -9983 -27893 -41086 -38154 -39075 -25795 -11416 -33622 -55412 -38928 -26075 -21015
5786 -21015 -27399 -50698 -55508 -40139 -21348 -13350 1646 -10092 -39085 -14270 27389 12683
5774 12683 35143 21600 21475 14674 1744 -20757 -7283 13251 -610 11414 23765 17907 6281
5761 6281 -42743 -55542 -38713 -22955 -17935 -30589 -31628 -17038 -22701 -30261 -31599 -54175 -62630
5748 -62630 -38294 -6046 19367 13050 -5648 -20579 -13040 12666 36925 57449 45728 37477
5736 37477 58235 48280 24436 -9500 15288 40602 30773 25855 38225 33695 20165 8984 32670
5723 32670 32962 16251 -4452 -27307 -18885 9518 18571 12139 7239 11200 9409 558 -24866 -15424
5709a5424k255l458N096J7178j346k2162J2520j3532M697l571K1360q72k3335
5696b5104k639j0285m244N813J0291O660P255j251j8795P176r113K2393N00j0962
5682b2305j1233J754O90J1084L0889R851m005Q477j0466j1645r160R108K3901
5669B6940k0531l244j2808j01J3308J7732j7983k3473J2940K9091j9706k1421
5657a9256J1951R93N822k5985P084L4390R034j4598j0371j7498k4242l3072L0674
5644d5074M3831j0377J5320L826L358L343k6095k4670L2626K925l6679j41J1873
5631b5934N549k670N529M929J2178j8812J2081J5092J458K818p973r437J1164
5618E972l471j1336k4822k8267K6545L3131J9732j750j8223k155R432q423k026
$$ plain form
5709 -15424 -17679 -21137 -16041 1137 -209 -22371 -9851 -23383 -18686 -22257 -897 -1769 -25104
5696 -25104 -27743 -38028 -42272 -36459 -26168 -19508 -12253 -13504 -32299 -25123 -34236 -11843 -11343 -22305
5682 -22305 -33538 -31784 -31094 -20010 10879 20730 16725 25202 14736 3091 -6069 3039 26940
5669 26940 6409 3165 -9643 -9744 3564 21296 3313 -20160 -7220 21871 2165 -19256
5657 -19256 -7305 -6312 -490 -26475 -19391 14999 24033 9435 -936 -18434 -42676 -75748 -45074
5644 -45074 -1243 -11620 3700 7526 10884 14227 -11868 -36538 -3912 -987 -37666 -37807 -25934
5631 -25934 -20385 -23055 -17526 -12597 -419 -19231 -7150 7942 9400 12218 4245 -5192 5972
5618 5972 2501 -8835 -33657 -61924 -35379 -2248 17484 15734 -2489 -4644 4788 -3635 -5661
5605e661J536m87N890j679J052j6977j0241p154j5365J427R734o652Q898L1492
5591d187o932j2l2225j5920M6555K1190R414j5158k1172Q889P359j0210l4768
5578d7177n645K9952J0927j113k286o679J2635K7416j8790l5929J614M909J8862
5565a1304K6838J4158j0807j1790o863k8135j2884o183K2525L6185L569n550M563
5552A4322J1188j5063K295J0773p576q224l2271j4199K1659K955r43j4518k1429
5539e1031j1293l506R898N330J6666n242J728J2412q088j5545m502J1183Q664
5526c3326K2P128r356j0453J4443Q253j5916k3994j4735R093O66N646J1058K391
5512d9080j0051J6492J9854O14m560n17R677L4772j804k5157n353j3745k101J4445
$$ plain form
5605 -5661 -4125 -4612 1278 -401 651 -16326 -26567 -33721 -49086 -47659 -37925 -44577 -35679 -4187
5591 -4187 -11119 -11131 -43356 -59276 -12721 8469 17883 2725 -18447 -9558 -2199 -12409 -47177
5578 -47177 -52822 -22870 -11943 -13056 -15342 -22021 -9386 18030 -760 -36689 -35075 -30166 -11304
5565 -11304 15534 29692 18885 7095 232 -27903 -40787 -46970 -24445 11740 15309 9759 14322
5552 14322 25510 10447 12742 23515 15939 7715 -24556 -38755 -17096 -14141 -15084 -29602 -51031
5539 -51031 -62324 -65830 -55932 -50602 -33936 -39178 -37450 -25038 -33126 -48671 -53173 -41990 -33326
5526 -33326 -33304 -26176 -35532 -45985 -31542 -23289 -39205 -63199 -77934 -68841 -68175 -62529 -51471 -49080
5512 -49080 -59131 -42639 -22785 -22171 -26731 -27248 -17571 17201 15397 -9760 -15113 -28858 -30959 -16514
5498a6514J3457O794O495l252j2385j2583K531j9449J2040J5862R652J1542j0924
5485C266k5531k6016K008K2720K3233J8797Q932Q523j5930o326L598J45k0621
5472c202j1681l0938R875J7758J3635J5062p727k1142p365K089j3700m813J3125
5459b9024K7755O28J0515j5832o841l521P088r052j1431J0482J6907K0749r431
5446H992k583m1765n093j0262p105J5347K9275l396O388l318P379L990J194k2294
5432b3251K2799J0011k274K595L556m040j1061R531p443o459K224J3903k4023
5419a3932K308K6633m008k4841J638n521o519P489L1092N753l3739j2245k510
5406b8402m371M156J2292J788J730J0999k9101J7454N4389J7210k748k6126k2152
$$ plain form
5498 -16514 -3057 3737 10232 6980 -5405 -17988 -15457 -34906 -22866 -7004 2648 14190 3266
5485 3266 -22265 -48281 -46273 -23553 -320 18477 27409 35932 20002 13676 17274 17419 -3202
5472 -3202 -14883 -45821 -35946 -18188 -4553 10509 2782 -18360 -25725 -23636 -37336 -42149 -29024
5459 -29024 -1269 -641 9874 -5958 -12799 -16320 -9232 -18284 -29715 -19233 -2326 18423 8992
5446 8992 6409 -35356 -40449 -50711 -57816 -42469 -13194 -16590 -10202 -13520 -6141 -2151 -957 -23251
5432 -23251 -452 9559 7285 9880 13436 9396 -1665 7866 423 -6036 -3812 10091 -13932
5419 -13932 -11624 15009 11001 -13840 -12202 -17723 -24242 -16753 14339 20092 -13647 -25892 -28402
5406 -28402 -32773 -28617 -16325 -14537 -12807 -1808 -30909 -13455 40934 58144 55396 29270 7118
5393G118j7999o06j5118k490J5658j1783Q188j6417M146L7069K4084j2071k4022
5380d243j1336j0795J2274J4249J9007K714K086j7142P14o520j7557K1446J3108
5367A8005k4320j5654N417M889K170k4891j2788K9964R33j8016j2316J3442J4349
5354a8816j8761M571J7702Q6P8k2864K215L2269N474k18L245K2130O762L00j8905
5339A5268n1063j3195N2680r112J097J7037l1223k7970M842J5692O308K7214R234
5326A6809j0461L130o556k0693J6198N639k753r119p241J2639j362j6894j3110
5313c3774K2070L289k232j151j3877K5238m448l0184l328R256K8347J812p895
5300f877j4208l265N038L0352L65k2670j4336K005K540J6334L0839L512k1786
$$ plain form
5393 7118 -10881 -11487 -26605 -29095 -13437 -25220 -17032 -33449 -29303 7766 31850 19779 -4243
5380 -4243 -15579 -26374 -14100 149 19156 21870 23956 6814 7528 1008 -16549 4897 18005
5367 18005 -6315 -21969 -16552 -11663 -9493 -34384 -47172 -17208 -16275 -34291 -46607 -33165 -18816
5354 -18816 -37577 -33006 -15304 -15218 -15140 -38004 -35789 -3520 1954 1736 4981 27111 33873 34173 15268
5339 15268 -35795 -48990 3690 -5422 -4325 12712 -18511 -46481 -41639 -25947 -19639 7575 16809
5326 16809 6348 9478 2922 -17771 -1573 4066 1313 -7806 -15047 -2408 -3770 -20664 -33774
5313 -33774 -11704 -8415 -10647 -11798 -25675 -437 -4885 -35069 -38397 -29141 -794 1018 -6877
5300 -6877 -21085 -24350 -19312 11040 11405 -11265 -25601 -23596 -21056 -4722 26117 29629 7843
5287G843k7487J3625n978j7558K7699R227j0244K1256J2546j8229r866J4375N595
5274B2804Q061k3621l8851j9613k6j4035j3220M0025L7870l553O571j3480p521
5261a8589J1347K0363J3925J069J7825j4770l0555o254N003l572j62K6439K426
5248B4495j4307Q32J5299j1181k4230k086J9298o576J7827L735l8492j4753L3101
5235B962o610k1074K580K0549L465j282j0663j7270J5515J6683m514Q070K0290
5222B8701j1k0355l1895O75J1981K2235O975k3590j4590J3193J4832l476j3695
5209i020q591J3214J6820Q414k5287L13j9920J525J6983K7320l6315l7179K491
5196d9232L5897K0984J927J5972j271J3498n597j9153j293p77Q985o675P95j7343
$$ plain form
5287 7843 -19644 -6019 -11997 -29555 -1856 7371 -2873 18383 30929 12700 2834 17209 22804
5274 22804 30865 7244 -31607 -51220 -51246 -65281 -78501 -38476 -606 -4159 2412 -11068 -18589
5261 -18589 -7242 13121 27046 28115 45940 31170 615 -5639 -636 -4208 -4370 22069 24495
5248 24495 10188 11020 26319 15138 -9092 -11178 8120 1544 19371 23106 -15386 -30139 2962
5235 2962 -3648 -24722 -22142 -1593 1872 590 -10073 -27343 -11828 4855 341 8411 28701
5222 28701 28690 8335 -23560 -22885 -10904 11331 18306 -5284 -19874 -6681 8151 4675 -9020
5209 -9020 -17611 -4397 12423 20837 -4450 -4137 -24057 -22532 -5549 21771 -14544 -51723 -49232
5196 -49232 -13335 7649 9576 25548 24277 37775 32178 13025 11732 10955 19940 13265 14060 -3283
5182c283L894J9438p768j0330j9576N509j2500m784M543j5195P534J6812r47o996
5168b3649k075j5057k9295K105J5245P155J4125n164L5270Q588j997k6677j8932
5155d0358J2776J0933j038j5715O631l266P759J0455J058J106j5707K5759J8654
5142A9047j2243j0519r842J598j9032q682j5007L4894J3818r298k9852l602J3544
5129c5176M979j395j2030Q809Q169K9096j3250j5363M910M617K407l353r023j520
5115b8123J5596n252k5512j0252J613J4030jo197Q201K8687n680o931l712J4777
5101h756K1622k0010o725j1146p301P935j5697L771J8300K329L3917J3395M531
5088C6165j0215k9832K481L1268p713j0987K5778J0939j2133j6159m2480j4092
$$ plain form
5182 -3283 611 20049 12281 1951 -17625 -12116 -24616 -29400 -24857 -40052 -32518 -15706 -16653 -23649
5168 -23649 -25724 -40781 -70076 -67971 -52726 -45571 -31446 -36610 -1340 7248 5251 -21426 -40358
5155 -40358 -27582 -16649 -17687 -33402 -26771 -30037 -22278 -11823 -10765 -9659 -25366 393 19047
5142 19047 6804 -3715 -13557 -11959 -30991 -39673 -54680 -19786 -5968 -15266 -45118 -48720 -35176
5129 -35176 -30197 -31592 -43622 -34813 -26644 2452 -10798 -26161 -21251 -16634 -14227 -17580 -26603 -28123
5115 -28123 -12527 -17779 -43291 -53543 -51930 -37900 -37901 -44098 -35897 -7210 -12890 -19821 -23533 -8756
5101 -8756 12866 -7144 -13869 -25015 -32316 -24381 -40078 -36307 -18007 -15678 18239 31634 36165
5088 36165 25950 -3882 -1401 29867 22154 11167 36945 47884 35751 19592 -22888 -36980
5076c6980R824P547r82R114p05J5039j289k9673l286J1907P978J9750o738k4495
5062b2989K6354j4622J0545J0077n622m894k225K1862J727j4960K4948l32l5853
5049e984k4106j8394L1357L9174R014O15k5293k7154J5961k0577p923P19M893
5036b7698k6510j3696J0005J1883K3257K1365o862J5187j4560N374M714j6834
5024a4375L730K7282q728l5283k7136K5634J5619j3136j7393K8349L1282J3125
5012B8970j5881o599J6234k4519k1005n080N952J8670J4289n365L344n431l4286
4999c0707N707R12j0935P726J7698j4170r865l906J0890J5677L343J7058J3526
4986B2954P113j9525k4242q194K0483q214K2434K528k1649k870j4844k0016L5779
$$ plain form
5076 -36980 -27156 -19609 -20591 -11477 -12182 2857 1568 -28105 -31391 -19484 -11506 8244 1506 -22989
5062 -22989 3365 -11257 -712 9365 3743 -1151 -3376 18486 20213 5253 30201 29869 -5984
5049 -5984 -30090 -48484 -17127 22047 31061 31676 6383 -20771 -4810 -25387 -33310 -32591 -27698
5036 -27698 -54208 -67904 -57899 -46016 -22759 -1394 -8256 6931 -7629 -2255 2459 -14375
5024 -14375 -10645 16637 7909 -27374 -54510 -28876 -13257 -26393 -43786 -15437 15845 28970
5012 28970 13089 6490 22724 -1795 -22800 -27880 -21928 -3258 11031 5666 9010 3579 -30707
4999 -30707 -25000 -24088 -35023 -27297 -9599 -23769 -33634 -37540 -26650 -10973 -7630 9428 22954
4986 22954 30067 10542 -13700 -21894 -1411 -9625 12809 15337 -6312 -9182 -24026 -44042 -8263
4973h263J1208l5154K825J1724j3836k770J9110J3715J2538j3501q280j4093m79
4960b5256L2991j4195k5379J4864J5847k4403l676K715n68J1697O599J0060J0139
4947A1435O538m898p807O060j204k5469l4520k2863J5871Q818r095J0744L324
4934d3066j5071J1843M0608K4490j2616j8792M405o023J6019J448p505L995j2423
4921a2688p575r948J9995J6068j320q432l155M914k999o704j7329K9423J9720
4908A9970N954P0N150l695J9414k8030k9003j5917J3455L1733J3587P475j1203
4895B8960l3084l61r447J4475J3189N250L360j0185j815l387j6833n158q898k6912
4881e0846j709L4706O922O167J5829k953J7207R764l9938k5447J4511K728K1051
$$ plain form
4973 -8263 2945 -32209 -29384 -17660 -31496 -34266 -15156 -1441 11097 -2404 -10684 -24777 -25256
4960 -25256 7735 -6460 -31839 -16975 -1128 -25531 -29207 -26492 -27060 -15363 -8764 1296 11435
4947 11435 17973 13075 5268 11328 10124 -15345 -49865 -72728 -56857 -48039 -57134 -46390 -43066
4934 -43066 -58137 -46294 -5686 18804 6188 -12604 -8199 -14222 1797 3245 -4260 -265 -12688
4921 -12688 -20263 -30211 -10216 5852 4532 -3900 -7055 -2141 -5140 -11844 -29173 250 19970
4908 19970 25924 25994 31144 27449 46863 18833 -10170 -26087 -12632 19101 32688 40163 28960
4895 28960 -4124 -4485 -13932 543 13732 18982 22342 12157 10342 6955 -9878 -15036 -23934 -50846
4881 -50846 -52555 -17849 -10927 -4760 11069 8116 25323 35087 -4851 -30298 -15787 -13059 7992
4868G992j4528n292J4562O249k2506R403J680j0939l639m246P585K2539k516n138
4854A206k2644N24L2574j683q249M581j974Q534N909O780k15n463j3398l6543
4840c0061j7188r640J8904K9235J5905J8104J6102m4084j6316l2000j441K3105
4828b9375o701K6735J4779k4623r239R952k380M2282m541k2166J2185j1962L4590
4815B9536J45j9352k2667j2722Q71n547O506j8822J8799J7084J4693p97j5148
4802g421p099j0125J3481J8203o642m940M070k78j3971j8073J0237j0631j6031
4789d9220k0621O524J7675J6979q572q838K9026M462l628O933j2701P601J4759
4776C79K6390n3039p217M1245J6039j4157k0183n263Q973n379q054o140K6986
$$ plain form
4868 7992 -6536 -11828 2734 8983 -13523 -4120 -2440 -13379 -17018 -21264 -13679 8860 6344 1206
4854 1206 -21438 -20914 11660 9977 1728 6309 4335 12869 18778 25558 25343 19880 6482 -30061
4840 -30061 -47249 -56889 -37985 -8750 7155 25259 41361 -2723 -19039 -51039 -52480 -29375
4828 -29375 -36076 -9341 5438 -19185 -28424 -18472 -20852 21430 16889 -5277 6908 -5054 29536
4815 29536 29681 10329 -12338 -25060 -24189 -29736 -23230 -42052 -23253 -6169 8524 7727 -7421
4802 -7421 -14520 -24645 -11164 7039 397 -4543 -473 -751 -14722 -32795 -22558 -33189 -49220
4789 -49220 -69841 -63317 -45642 -28663 -37235 -46073 -17047 -12585 -16213 -9280 -21981 -14380 379
4776 379 26769 -26270 -33487 7758 23797 9640 -10543 -15806 -6833 -12212 -20266 -26406 580
4763E80K1965j144j6714p324o030J8251J3896j3821n895n084J6468n104k9952
4750a9908j3904q176K489K1314K0917J3420N372o139j9386K939j5424N038J677
4737i771k5761P406L5681n741q389r972J3288R679J6762K367J2122m0974j6051
4724a9354L3917n648R44j2610m439L545q593o531k4326k2289J2559j6188K189
4711f6824L3827L1330M756n302q709Q839k9669j6204j2089j7285J7753L071O524
4698d9982J9194J4552J7840K84l8423o532J3618K3993k1j7485J4915P084l536
4685d499J436R4k1922P118O775j3363K4582L0640J4973k6729j0445j4710N481
4672e69M573R679J5875j5091j0020K628k0822l2747K846K3228N464J1061n488
$$ plain form
4763 580 22545 21401 4687 -2637 -8667 9584 23480 9659 3764 -1320 15148 10044 -19908
4750 -19908 -33812 -41988 -39499 -18185 2732 16152 21524 15385 -4001 -1062 -16486 -11448 -9771
4737 -9771 -35532 -28126 7555 1814 -6575 -16547 -3259 6420 23182 25549 37671 -3303 -19354
4724 -19354 14563 8915 9859 -2751 -7190 -3645 -12238 -18769 -43095 -65384 -52825 -69013 -66824
4711 -66824 -32997 -1667 3089 -2213 -10922 -2083 -31752 -47956 -60045 -77330 -59577 -56506 -49982
4698 -49982 -30788 -16236 1604 1888 -36535 -43067 -29449 -5456 -5477 -22962 -8047 -963 -4499
4685 -4499 -3063 -2969 -24891 -17773 -10998 -24361 221 30861 45834 19105 8660 -6050 -569
4672 -569 4004 13683 29558 14467 4447 7075 -13747 -46494 -43648 -20420 -14956 -3895 -9383
4659i383O450P149k097J8615K4054j2774k6811k9211J6016O892l142k0194L0134
4646E698J3912M075n095O906m93j5780j4827k886q049L418j545L692K7887Q862
4632B5775j2222r041j5499Q860J9620p298J436m0996k5599J2718J1154L2370n391
4619d113k978J2147O223j617K0545o648k3758L007R804J534n579M112J2536j2107
4605A3108J4191m262l0494j9887q248q641n491K9480J3883O030k7922m2555J496
4592f9312K8796J3426K1329j620O887J1891n961J2631J2225k8234r211J6541p91
4579H597j1583K1238L271p840k4908J2518j3036j9288o158j0470P828M041K1851
4566a3939O826r512R314J7j1275M2849K5436k5164k9328j1440J0851j7206j6465
$$ plain form
4659 -9383 -2933 4216 2119 20734 44788 32014 5203 -24008 -7992 -1100 -4242 -24436 5698
4646 5698 19610 23685 18590 25496 25003 9223 -5604 -8490 -16539 -13121 -14666 -10974 16913 25775
4632 25775 13553 4512 -10987 -2127 17493 10195 11631 -29365 -54964 -42246 -31092 1278 -4113
4619 -4113 -7091 5056 11279 9662 30207 23559 -199 2808 12612 14146 8567 12679 25215 13108
4605 13108 27299 23037 -7457 -27344 -35592 -44233 -49724 -20244 -6361 -331 -28253 -70808 -69312
4592 -69312 -40516 -27090 -5761 -7381 -494 11397 5436 18067 30292 2058 -7153 9388 8597
4579 8597 -2986 18252 21523 13683 -11225 1293 -11743 -31031 -37189 -47659 -39831 -35790 -13939
4566 -13939 -7113 -16625 -7311 -7294 -18569 24280 49716 24552 -4776 -16216 -5365 -22571 -39036
4553c9036Q83K885J2898J2587j4728l604L560k1408K068j184J4897L34J4401J1117
4539d330j0852k0372q336k9541n454K007K007O056k3246L649N6293J4434n986
4526b3671O841J5825K4283j6330O300K1053n750j2946j0766r516L247k7463K1879
4513g014l610k6152J2120J8081L145J9101j0337l8102j8701L33K2192L8707J011
4500A0774j4756P199J1646j2561q08J208n671K5250j4762r774k600q625q747L5360
4486A3133J7947m512K18j7728j941m930l849L5856L3573l2596j4613M874O215
4473C1647l578j9245L141L306L586r662k7456k980J0104K6218L082m3571j1315
4460c6723R835J4330K0329l0697j0852P247J4056K6337L96k014q271K8157p108
$$ plain form
4553 -39036 -38153 -35268 -22370 -9783 -24511 -28115 -24555 -45963 -43895 -45079 -30182 -29848 -15447 -4330
4539 -4330 -15182 -35554 -43890 -73431 -78885 -76878 -74871 -68815 -92061 -88412 -32119 -17685 -23671
4526 -23671 -16830 -1005 23278 6948 13248 34301 28551 15605 4839 -4677 -1430 -28893 -7014
4513 -7014 -10624 -36776 -24656 -6575 -3430 15671 5334 -32768 -51469 -51136 -28944 9763 10774
4500 10774 -3982 3217 14863 2302 1494 2702 -2969 22281 7519 -2255 -4855 -13480 -22227 13133
4486 13133 31080 26568 26786 9058 7117 2187 -1662 34194 67767 35171 20558 25432 31647
4473 31647 28069 8824 11965 15271 18857 9195 -18261 -21241 -11137 15081 18163 -25408 -36723
4460 -36723 -26888 -12558 7771 -22926 -33778 -26531 -12475 13862 14258 12244 3973 32130 25022
4447B5022m0109j568L155Q28j4336j1158J2173R964j2130k3081N829L8725l973
4434a0659j1567J6766k34j3629j3496K3790J3225J9835j0197k8833P880J4974
4422G855J3545K2821r247l4893n623l247j4937n707j5685p421k399k944J1497
4409d6385Q780L2387K76n663K366n998K279K670J2253J5751J1568p878j9091k7554
4395b4239M757K332j920R219k0061j3804K6270L554m630L3728K0872j5366l0499
4382i787R44O154j4364M650J5749K1062j3269k5782k111J9389J3067r026K1284
4369B7960K306o580J7751j7303k7765L953K5214r544M627q792j1395R788J6743
4356B6963K2268j8986r978R145j9889j0799k3523j8353l003J4019J0946R915n469
$$ plain form
4447 25022 -15087 -16655 -13500 -12672 -27008 -38166 -25993 -16029 -28159 -51240 -45411 -6686 -10659
4434 -10659 -22226 -5460 -5694 -19323 -32819 -9029 4196 24031 13834 -14999 -7119 7855
4422 7855 21400 44221 34974 81 -5542 -8789 -23726 -29433 -45118 -52539 -54938 -57882 -46385
4409 -46385 -37605 -5218 -4942 -10605 -8239 -14237 -11958 -9288 2965 18716 30284 22406 3315 -24239
4395 -24239 -19482 -17150 -19070 -9851 -29912 -43716 -17446 -13892 -18522 15206 36078 20712 -9787
4382 -9787 -8843 -2689 -17053 -12403 3346 24408 11139 -14643 -16754 2635 15702 6676 27960
4369 27960 30266 23686 41437 24134 -3631 322 25536 15992 20619 11827 432 10220 26963
4356 26963 49231 30245 20267 29412 9523 -1276 -24799 -43152 -46155 -32136 -21190 -11275 -16744
4343a6744P947L493o546N126J8112q403K5763m653n275q673j808J3653J6344j2731
4329B5605k2503k5803r461N825J4270K0097K2414J0488j1776j2412q269O217j5212
4316e20k4985p537L3514K750R061L4095j6069p960K4008J435J3084l4196l3240
4303f560J4590j0249r171j6771j988K2973k3425O72K3264J4746j2774J925J324
4290a444j930j881K3217K6638j4148k990r747k3168J74j1862j3314K3350o718
4277a3823j1383k78q549q463J7442N838O908K1955m781l2600Q634L2559K393l940
4263A1912J7049N778j1817j7650j6339P429j3537L284J5580k0128L1932J611l1305
$$ plain form
4343 -16744 -8797 -5304 -11850 -6724 11388 2985 28748 24095 18820 10147 8339 21992 38336 25605
4329 25605 3102 -22701 -32162 -26337 -12067 8030 30444 40932 29156 16744 8475 14692 -520
4316 -520 -25505 -33042 472 3222 12283 46378 30309 22349 46357 47792 60876 26680 -6560
4303 -6560 8030 -2219 -11390 -28161 -30149 -7176 -30601 -29929 -6665 8081 -4693 -2768 -1444
4290 -1444 -3374 -5255 17962 44600 30452 27462 17715 -5453 -5279 -17141 -30455 -7105 -13823
4277 -13823 -25206 -25484 -34033 -42496 -25054 -19216 -12308 9647 4866 -27734 -19100 13459 15852 11912
4263 11912 28961 34739 22922 5272 -11067 -3638 -17175 -13891 1689 -18439 13493 15104 -16201
$$ [...]
##END NTUPLES=NMR SPECTRUM
##END=
