##TITLE=Analysis number 326983
Compound Code cc 55914
Book Reference 494/134
Project Code adrs
Chemist Name craigr
##JCAMPDX= 6.0         $$ Bruker NMR JCAMP-DX V2.0
##DATA TYPE= NMR SPECTRUM
##DATA CLASS= NTUPLES
##ORIGIN= Bruker BioSpin GmbH
##OWNER= nmr
$$ XWIN-NMR		Version 3.5
$$ Tue Mar  6 10:24:07 2007 GMT Standard Time (UT+0h)  MAYBRIDGE\nmr@NMR_250MHZ
##.OBSERVE FREQUENCY= 250.131544655141
##.OBSERVE NUCLEUS= ^1H
##.ACQUISITION MODE= SIMULTANEOUS (DQD)
##.ACQUISITION SCHEME= undefined
##.AVERAGES= 16
##.DIGITISER RES= 18
##SPECTROMETER/DATA SYSTEM= dpx250
##.PULSE SEQUENCE= zg30
##.SOLVENT NAME= CDCl3
##.SHIFT REFERENCE= (INTERNAL, CDCl3, 0, 16.522)
##AUDIT TRAIL= $$ (NUMBER, WHEN, WHO, WHERE, WHAT)
$$ ##TITLE= Audit trail, XWIN-NMR		Version 3.5
$$ ##JCAMPDX= 5.01
$$ ##ORIGIN= Bruker BioSpin GmbH
$$ ##OWNER= nmr
$$ C:\u/data/dgb/nmr/ADRS/400/pdata/1/auditp.txt
$$ ##AUDIT TRAIL=  $$ (NUMBER, WHEN, WHO, WHERE, WHAT)
(   1,<2007-03-06 10:23:42.31 +000>,<MAYBRIDGE\nmr>,<NMR_250MHZ>,
      <created by zg, POWCHK disabled, PULCHK disabled
       configuration hash MD5:
       49 4B E0 1D 92 C2 6B 37 9F E6 65 BC 52 41 86 1D
       data hash MD5: 64K
       C2 79 56 78 B4 9B 91 7B 1A 58 53 12 5C FB 87 41>)
(   2,<2007-03-06 10:23:56.56 +000>,<MAYBRIDGE\nmr>,<NMR_250MHZ>,
      <Start of raw data processing
       ef LB = 0.3 FT_mod = 6 PKNL = 1 SI = 32K 
       data hash MD5: 32K
       01 C3 36 B5 71 F8 AE 4D 77 BA 61 43 65 4E CF 61>)
(   3,<2007-03-06 10:23:58.20 +000>,<MAYBRIDGE\nmr>,<NMR_250MHZ>,
      <apk 
       data hash MD5: 32K
       D8 6C 7E FB 56 05 1E 06 63 F1 2C 66 07 C2 9D E7>)
(   4,<2007-03-06 10:23:58.90 +000>,<MAYBRIDGE\nmr>,<NMR_250MHZ>,
      <abs ABSG = 5 
       data hash MD5: 32K
       21 EB 9E 49 99 BF BE BD 2F 62 97 FE E6 F8 45 54>)
$$ ##END=
$$ 
$$ hash MD5
$$ 86 BF 56 90 3B 42 61 CB 09 5C A7 0A 1A C5 C2 B0
##$RELAX= 
##$RELAX= 
##$RELAX= 
##$RELAX= 
##$RELAX= 
##$RELAX= 
##$RELAX= 
$$ Bruker specific parameters
$$ --------------------------
##$DU= <C:\u>
##$EXPNO= 400
##$NAME= <ADRS>
##$PROCNO= 1
##$TYPE= <nmr>
##$USER= <dgb>
##$AMP= (0..31)
100 100 100 100 100 100 100 100 100 100 100 100 100 100 100 100 100 100 
100 100 100 100 100 100 100 100 100 100 100 100 100 100 
##$AQSEQ= 0
##$AQ_mod= 3
##$AUNM= <au_zg>
##$AUTOPOS= <8 >
##$BF1= 250.13
##$BF2= 250.13
##$BF3= 250.13
##$BF4= 250.13
##$BF5= 500.13
##$BF6= 500.13
##$BF7= 500.13
##$BF8= 500.13
##$BYTORDA= 1
##$CFDGTYP= 0
##$CFRGTYP= 5
##$CHEMSTR= <none>
##$CNST= (0..31)
1 1 145 1 1 1 1 1 1 1 1 1 1 1 1 1 1 1 1 1 1 1 1 1 1 1 1 1 1 1 1 1 
##$CPDPRG= <>
##$CPDPRG1= <>
##$CPDPRG2= <>
##$CPDPRG3= <>
##$CPDPRG4= <mlev>
##$CPDPRG5= <mlev>
##$CPDPRG6= <mlev>
##$CPDPRG7= <mlev>
##$CPDPRG8= <mlev>
##$CPDPRGB= <>
##$CPDPRGT= <>
##$D= (0..31)
0 1 0 0 0 0 0 0 0 0.06 0 0 0 0 0 0 0.0002 0 0 0 0 0 0 0 0 0 0 0 0 0 0 
0 
##$DATE= 1173176621
##$DBL= (0..7)
120 120 120 120 120 120 120 120 
##$DBP= (0..7)
150 150 150 150 150 150 150 150 
##$DBP07= 0
##$DBPNAM0= <>
##$DBPNAM1= <>
$$ [...]
##$SUBNAM7= <"">
##$SUBNAM8= <"">
##$SUBNAM9= <"">
##$SW= 20.6930455092707
##$SWIBOX= (0..15)
0 0 3 0 0 0 0 0 0 0 0 0 0 0 0 0 
##$SW_h= 5175.983436853
##$TD= 65536
##$TD0= 1
##$TE= 295.16
##$TE2= 300
##$TE3= 300
##$TEG= 300
##$TL= (0..7)
0 120 120 120 120 120 120 120 
##$TP= (0..7)
150 150 150 150 150 150 150 150 
##$TP07= 0
##$TPNAME0= <>
##$TPNAME1= <>
##$TPNAME2= <>
##$TPNAME3= <>
##$TPNAME4= <>
##$TPNAME5= <>
##$TPNAME6= <>
##$TPNAME7= <>
##$TPOAL= (0..7)
0.5 0.5 0.5 0.5 0.5 0.5 0.5 0.5 
##$TPOFFS= (0..7)
0 0 0 0 0 0 0 0 
##$TUNHIN= 0
##$TUNHOUT= 0
##$TUNXOUT= 0
##$USERA1= <user>
##$USERA2= <user>
##$USERA3= <user>
##$USERA4= <user>
##$USERA5= <user>
##$V9= 5
##$VALIST= <valist>
##$VCLIST= <CCCCCCCCCCCCCCC>
##$VD= 0
##$VDLIST= <DDDDDDDDDDDDDDD>
##$VPLIST= <PPPPPPPPPPPPPPP>
##$VTLIST= <TTTTTTTTTTTTTTT>
##$WBST= 1024
##$WBSW= 4
##$XGAIN= (0..3)
0 0 0 0 
##$XL= 0
##$YL= 0
##$YMAX_a= 368176
##$YMIN_a= -383910
##$ZGOPTNS= <>
##$ZL1= 120
##$ZL2= 120
##$ZL3= 120
##$ZL4= 120
##$ABSF1= 16.522
##$ABSF2= -4.171173
##$ABSG= 5
##$ABSL= 3
##$ALPHA= 0
##$AQORDER= 0
##$ASSFAC= 0
##$ASSFACI= 0
##$ASSFACX= 0
##$ASSWID= 0
##$AUNMP= <proc_1d>
##$AZFE= 0.1
##$AZFW= 0.1
##$BCFW= 0
##$BC_mod= 0
##$BYTORDP= 0
##$COROFFS= 0
##$CY= 12.5
##$DATMOD= 1
##$DC= 0
##$DFILT= <>
##$DTYPP= 0
##$F1P= 14.0000005364418
##$F2P= -0.99999901652339
##$FCOR= 0.5
##$FTSIZE= 32768
##$FT_mod= 6
##$GAMMA= 0
##$GB= 0
##$INTBC= 1
##$INTSCL= 1
##$ISEN= 128
##$LB= 0.3
##$LEV0= 0
##$LPBIN= 0
##$MAXI= 10000
##$MC2= 0
##$MEAN= 0
##$ME_mod= 0
##$MI= 0
##$NCOEF= 0
##$NC_proc= -4
##$NLEV= 6
##$NOISF1= 0
##$NOISF2= 0
##$NSP= 0
##$NTH_PI= 0
##$NZP= 0
##$OFFSET= 16.522
##$PC= 1
##$PHC0= 228.9285
##$PHC1= 2.002456
##$PH_mod= 1
##$PKNL= yes
##$PPARMOD= 0
##$PSCAL= 4
##$PSIGN= 0
##$REVERSE= no
##$SF= 250.13
##$SI= 32768
##$SIGF1= 0
##$SIGF2= 0
##$SINO= 400
##$SIOLD= 32768
##$SREGLST= <1H.CDCl3>
##$SSB= 0
##$STSI= 32768
##$STSR= 0
##$SW_p= 5175.98343685301
##$SYMM= 0
##$S_DEV= 0
##$TDeff= 65536
##$TDoff= 0
##$TI= <Analysis number 999999
Compound Code 99
Book Reference 9
Project Code 9>
##$TILT= no
##$TM1= 0
##$TM2= 0
##$TOPLEV= 0
##$USERP1= <user>
##$USERP2= <user>
##$USERP3= <user>
##$USERP4= <user>
##$USERP5= <user>
##$WDW= 1
##$XDIM= 32768
##$YMAX_p= 536957046
##$YMIN_p= -133431
$$ End of Bruker specific parameters
$$ ---------------------------------
##NTUPLES= NMR SPECTRUM
##VAR_NAME=  FREQUENCY,     SPECTRUM/REAL,   SPECTRUM/IMAG
##SYMBOL=    X,             R,               I
##VAR_TYPE=  INDEPENDENT,   DEPENDENT,       DEPENDENT
##VAR_FORM=  AFFN,          ASDF,            ASDF
##VAR_DIM=   32768,         32768,           32768
##UNITS=     HZ,            ARBITRARY UNITS, ARBITRARY UNITS
##FACTOR=    0.157963299565203, 1,           1
##FIRST=     4132.6476996994, 0,             0
##LAST=      -1043.33573715361, 0,           0
##MIN=       -1043.33573715361, -133431,     0
##MAX=       4132.6476996994, 536957046,     0
$$ Real data points
##PAGE= N=1
##DATA TABLE= (X++(R..R)), XYDATA
$$ [...]
$$ plain form
15884 3415 282 3373 -8779 -25824 -30469 -56954 -30914 -44390 -31807 -47079 -35425 -18691
15872 -18691 -26731 -6689 4544 -7750 -50335 -83177 -74679 -29059 22658 34270 1813 -30538
15860 -30538 -15821 42 -33555 -50081 -55584 -39640 -16983 8798 14850 16650 37727 24901
15848 24901 8010 -3942 14533 13047 3822 23121 32843 7305 28805 38294 46194 65141 51995
15835 51995 11095 -390 20964 19864 40839 40602 24128 12646 23445 3410 19515 50022
15823 50022 44490 -9485 -30629 -9135 40869 35879 2799 -21411 -29629 -51711 -100424 -101319 -21782
15810 -21782 12298 -2791 17446 7687 -24779 -41207 -12791 12277 11809 31064 52681 38391
15798 38391 30783 56112 -341 -17663 13519 50089 29015 30245 28293 18938 47362 41114 4312
$$ packed form
15884C415l133L091j2152j7045m645k6485K6040j3476J2583j5272J1654J6734
15872a8691q040K0042J1233j2294m2585l2842Q498M5620N1717J1612l2457l2351
15860c0538J4717J5863l3597j6526n503J5944K2657K5781O052J800K1077j2826
15848B4901j6891j1952J8475j486r225J9299R722k5538K1500R489P900J8947j3146
15835E1995m0900j1485K1354j100K0975k37j6474j1482J0799k0035J6105L0507
15823E0022n532n3975k1144K1494N0004m990l3080k4210q218k2082m8713q95P9537
15810b1782L4080j5089K0237r759l2466j6428K8416K5068m68J9255K1617j4290
15798C8391p608K5329n6453j7322L1182L6570k1074J230j952r355K8424o248l6802
$$ plain form
15785 4312 19738 9740 1972 13863 64846 82248 34240 5179 8400 17414 4063 18415 865
15772 865 -2743 19894 34182 12448 10338 -3950 -32477 -29031 -24952 22089 27448 13612 20127
15759 20127 14519 -8903 12264 41541 53410 39611 -16478 -26573 21394 32564 28993 25857
15747 25857 36819 42407 51909 46895 26493 52823 88541 74443 29079 -9488 -13657 -38700
15735 -38700 -21117 7612 27225 55911 43217 29427 21679 13943 -18637 -34309 7184 -9003
15723 -9003 -33782 -32470 -23956 -9617 18731 16100 34080 57185 6657 -5779 -7607 474 11137
15710 11137 5528 -4194 -19364 -19637 -4934 5860 17627 51346 72664 61967 27921 47959
15698 47959 77171 68801 13320 -2658 7603 27211 18477 -32851 -35197 -13918 -12269 -19139 3811
$$ packed form
15785D312J5426r998p768J1891N0983J7402m8008k9061L221R014j3351J4352j7550
15772H65l608K2637J4288k1734k110j4288k8527L446M079M7041N359j3836O515
15759B0127n608k3422K1167K9277J1869j3799n6089j0095M7967J1170l571l136
15747B5857J0962N588R502n014k0402K6330L5718j4098m5364l8567m169k5043
15735c8700J7583K8729J9613K8686j2694j3790p748p736l2580j5672M1493j6187
15723i003k4779J312Q514J4339K8348k631J7980K3105n0528j2436j828Q081J0663
15710A1137n609r722j5170k73J4703J0794J1767L3719K1318j0697l4046K0038
15698D7959K9212q370n5481j5978J0261J9608q734n1328k346K1279J649o870K2950
$$ plain form
15685 3811 54226 51055 13755 9288 45775 38407 2151 -24372 -2199 56812 52495 19091 5934
15672 5934 -21760 -44079 -44074 13658 38049 51028 50620 48777 36552 7626 7436 -201 -41404 -23105
15658 -23105 23055 21206 -21752 -17332 -24100 -31764 -4410 -274 2258 14569 15842 22501 60371
15645 60371 9771 -14269 9153 13104 33283 24313 -10018 5807 29034 5026 -21682 -77176
15633 -77176 -67196 -46661 -18490 -5256 -40974 -43827 -36810 -24955 8137 1709 -1115 8729 -43575
15620 -43575 -70053 -34774 -19974 -6512 6712 15095 36664 2243 -29352 21226 30316 9845
15608 9845 -5416 -17037 -28861 -25630 -19651 -22112 -32281 -25923 -16719 41196 30603 37241 32854
15595 32854 40635 5607 6491 -10897 16024 65139 75035 48967 30103 18647 22392 29840 -51971
$$ packed form
15685C811N0415l171l7300m467L6487p368l6256k6523K2173N9011m317l3404j3157
15672E934k7694k2319NN7732K4391J2979m08j843j2225k8926j90p637m1203J8299
15658b3105M6160j849m2958M420o768p664K7354M136K532J2311J273O659L7870
15645F0371n0600k4040K3422L951K0179q970l4331J5825K3227k4008k6708n5494
15633g7176R980K0535K8171J3234l5718k853P017J1855L3092o428k824R844n2304
15620d3575k6478L5279J4800J3462J3224Q383K1569l4421l1595N0578R090k0471
15608I845j5261j1621j1824L231N979k461j0169O358R204N7915j0593O638m387
15595C2854P781l5028Q84j7388K6921M9115R896k6068j8864j1456L745P448q1811
$$ plain form
15582 -51971 -80768 -43073 -44041 -47530 -26498 -2099 -25333 -59721 -38535 -23912 29467 19507
15570 19507 19163 50254 72933 41543 -10725 -29400 10451 -20761 -70989 -28174 -6206 17297
15558 17297 53494 30510 18891 49765 49135 21816 6462 38882 22968 -45063 -48339 -58694
15546 -58694 -31191 -53580 -68348 -67789 -45816 792 29400 31069 62972 40748 8319 14310
15534 14310 28016 15032 43626 19246 579 2962 126 -24223 -17226 -2203 -10007 -17882 -19511
15521 -19511 15683 29356 28404 5119 -10335 -21041 -20525 -41449 -61556 -39136 -8584 -7110 -22237
15508 -22237 -22603 -9313 -49681 -21649 31908 34594 47803 63086 73381 83046 59375 12494
15496 12494 -9175 28421 50604 37872 -20806 9568 38680 4144 12611 43233 57746 69105
$$ packed form
15582e1971k8797L7695r68l489K1032K4399k3234l4388K1186J4623N3379r960
15570A9507l44L1091K2679l1390n2268j8675L9851l1212n0228M2815K1968K3503
15558A7297L6197k2984j1619L0874o30k7319j5354L2420j5914o8031l276j0355
15546e8694K7503k2389j4768N59K1973M6608K8608J669L1903k2224l2429N991
15534A4310J3706j2984K8594k4380j8667K383k836k4349O997J5023p804p875j629
15521a9511L5194J3673r52k3285j5454j0706N16k0924k0107K2420L0552J474j5127
15508b2237l66J3290m0368K8032N3557K686J3209J5283J0295R665k3671m6881
15496A2494k1669L7596K2183j2732n8678L0374K9112l4536Q467L0622J4513J1359
$$ plain form
15484 69105 55501 34435 43482 47338 24333 27096 16647 18210 15735 19186 14383 38933 25516
15471 25516 44502 29972 3241 -3088 -39280 -49916 -65521 -52376 -2731 20237 -8038 -7710
15459 -7710 13103 32879 21102 31694 26962 32574 34931 44570 2501 -193 23911 5195 -14658
15446 -14658 -24499 -26228 -10720 9997 31138 60356 32999 15133 -18120 -36110 -39562 -34243
15434 -34243 -17269 -1323 17666 30827 19928 -2331 -28295 -35487 -25170 -34781 -64374 -83080
15422 -83080 -102030 -102519 -71430 -73656 -53333 -41415 -21396 -15299 -36065 -43743 -19827 22952 51828
15409 51828 14627 -22933 -4344 -15140 -11221 10568 35983 23092 -5849 -14956 15949 47216
15397 47216 44133 44629 33923 11184 -12030 -36407 -49008 -23102 -18067 -4525 -9342 29495 63149
$$ packed form
15484F9105j3604k1066R047L856k3005K763j0449J563k475L451m803K4550j3417
15471B5516J8986j4530k6731o329l6192j0636j5605J3145M9645K2968k8275L28
15459g710K0813J9776j1777J0592m732N612K357R639m2069k694K4104j8716j9853
15446a4658r841j729J5508K0717K1141K9218k7357j7866l3253j7990l452N319
15434c4243J6974J5946J8989J3161j0899k2259k5964p192J0317r611k9593j8706
15422h3080j8950m89L1089k226K0323J1918K0019O097k0766p678K3916M2779K8876
15409E1828l7201l7560J8589j0796L919K1789K5415j2891k8941r107L0905L1267
15397D7216l083M96j0706k2739k3214k4377j2601K5906N035J3542m817L8837L3654
$$ plain form
15384 63149 46437 54122 32302 44518 31938 38092 91226 90188 37917 -24076 -33428 -51324
15372 -51324 -16207 22081 30261 2705 -19976 30600 11156 1861 -27085 -38831 -26595 -4723
15360 -4723 -18830 -5230 -14489 -356 57001 48683 18276 -3223 -16763 15850 33595 21214
15348 21214 15042 18926 25314 48157 72180 47884 52659 70766 53514 56174 22030 -23713 -21421
15335 -21421 -16202 -23895 -1662 11610 7172 -8925 -13052 -27468 -58244 -82746 -81949 -28896 -5282
15322 -5282 -6078 -3457 -5219 9592 24753 4354 -36485 -20173 26719 15760 2236 16606 26184
15309 26184 31546 48494 45545 48144 22249 5091 21805 -5305 -23518 -15084 7371 1590 9715
15296 9715 13830 -5504 13031 28152 -16911 -52146 -48478 -11356 11579 -2483 11613 23350
$$ packed form
15384F3149j6712P685k1820J2216j2580O154N3134j038n2271o1993r352j7896
15372e1324L5117L8288Q180k7556k2681N0576j9444r295k8946j1746J2236K1872
15360d723j4107J3600r259J4133N7357q318l0407k1499j3540L2613J7745j2381
15348B1214o172L884O388K2843K4023k4296M775J8107j7252K660l4144m5743K292
15335b1421N219p693K2233J3272m438j6097m127j4416l0776k4502P97N3053K3614
15322e282p96K621j762J4811J5161k0399m0839J6312M6892j0959j3524J4370R578
15309B6184N362J6948k949K599k5895j7158J6714k7110j8213Q434K2455n781Q125
15296I715M115j9334J8535J5121m5063l5235L668L7122K2935j4062J4096J1737
$$ plain form
15284 23350 -19188 -22674 -24235 -28229 24762 43854 212 -30936 -19813 2294 -32867 -51810
15272 -51810 -28847 -18518 -6905 9832 29951 32874 57515 37470 14981 6151 48179 18162
15260 18162 -23600 -32129 -80173 -53901 -29642 -37526 -30207 4061 -25187 -72517 -74763 -48194
15248 -48194 -56655 -45013 -35733 -45730 -53879 -27645 -28233 -23952 -2031 27925 -19649 -16459 -17861
15235 -17861 7446 17617 6547 12843 21926 -3712 -36363 -38118 -29193 -32010 13551 29564 -30562
15222 -30562 -41423 -16563 1531 11266 11689 -20844 -33664 -25371 15222 41271 23443 14135 7771
15209 7771 56250 5680 -2143 4059 -8911 3932 509 -2274 -20871 -9240 49751 62581 79058
15196 79058 89898 97227 70843 58549 55273 40100 28621 43874 30076 6733 19921 9663
$$ packed form
15284B3350m2538l486j561l994N2991J9092m3642l1148J1123K2107l5161j8943
15272e1810K2963J0329J1613J6737K0119K923K4641k0045k2489q830M2028l0017
15260A8162m1762q529m8044K6272K4259p884P319L4268k9248m7330k246K6569
15248d8194q461J1642R280r997q149K6234n88M281K1921K9956m7574L190j402
15235a7861K5307J0171j1070O296R083k5638l2651j755Q925k817M5561J6013o0126
15222c0562j0861K4860J8094R735M23l2533j2820Q293M0593K6049j7828r308o364
15209G771M8479n0570p823O202j2970J2843l423k783j8597J1631N8991J2830J6477
15196G9058J0840P329k6384j2294l276j5173j1479J5253j3798k3343J3188j0258
$$ plain form
15184 9663 8848 28305 30485 25926 -784 -24425 -23956 -19155 -9304 2927 -811 8376 14381 26381
15170 26381 37208 10068 12970 42586 70430 87325 89509 28361 5949 7007 13776 30816
15158 30816 60035 54277 29575 5577 28523 29317 24433 -32319 -11512 24311 12572 -37778
15146 -37778 20627 46502 8743 -24632 -20112 -41199 -29151 -34604 -43623 -58174 -70820 -59230
15134 -59230 -31315 -19661 -6945 26340 55437 39070 22446 37438 11036 11122 36097 8429
15122 8429 -18685 20565 45596 39512 8627 31447 63249 39767 6635 -10133 5145 -11755
15110 -11755 9578 6931 20529 15184 26256 -993 -29465 -14520 -13499 2855 15604 6673
15098 6673 3729 16700 40299 60027 41781 39254 44726 21121 23924 28201 -2177 -28131 -28201
$$ packed form
15184I663q15J9457K180m559k6710k3641M69M801R851J2231l738R187O005J2000
15170B6381J0827k7140K902K9616K7844J6895K184o1148k2412J058O769J7040
15158C0816K9219n758k4702k3998K2946P94m884n6752K0807L5823j1739n0350
15146c7778N8405K5875l7759l3375M520k1087J2048n453r019j4551j2646J1590
15134e9230K7915J1654J2716L3285K9097j6367j6624J4992k6402Q6K4975k7668
15122H429k7114L9250K5031o084l0885K2820L1802k3482l3132j6768J5278j6900
15110a1755K1333k647J3598n345J1072k7249k8472J4945J021J6354J2749q931
15098F673k944J2971K3599J9728j8246k527N472k3605K803M277l0378k5954p0
$$ plain form
15085 -28201 22763 28377 -3173 16400 12847 4175 3710 2121 47161 23607 -5468 30707 48319
15072 48319 70500 90403 63645 56603 29459 32714 17803 26282 44142 768 -27729 -2520
15060 -2520 3456 -3984 19 2679 9402 57261 64026 27470 16761 7356 34020 17126 -26471
15047 -26471 -50121 -33950 -64099 -74605 -69409 -57590 -37703 1019 35297 49646 8090 -37368
15035 -37368 -54046 -84270 -57853 -8177 30020 44401 18836 37081 6934 11584 9186 21212
15023 21212 10911 151 -5168 -11543 10881 4352 -15645 -6726 32070 61215 69123 20062 8855
15010 8855 16931 14761 26841 15967 7104 9298 -11367 -22355 23345 55980 51120 44184 42696
14997 42696 27205 23298 16928 -34616 -40238 -11847 4027 4945 -3140 20477 28945 51500 34695
$$ packed form
15085b8201N0964N614l1550J9573l553q672m65j589M5040k3554k9075L6175J7612
15072D8319K2181J9903k6758p042k7144L255j4911Q479J7860m3374k8497K5209
15060b520N976p440M003K660O723M7859O765l6556j0709r405K6664j6894m3597
15047b6471k3650J6171l0149j0506N196J1819J9887L8722L4278J4349m1556m5458
15035c7368j6678l0224K6417M9676L8197J4381k5565J8245l0147M650k398J2026
15023B1212j0301j0760n319o375K2424o529j9997Q919L8796K9145P908m9061j1207
15010H855Q076k170J2080j0874q863K194k0665j0988M5700L2635m860o936j488
14997D2696j5491l907o370n1544n622K8391J5874R18q085K3617Q468K2555j6805
$$ plain form
14984 34695 65233 92967 100831 104572 69025 47413 63344 75871 46227 38428 49744 36581
14972 36581 13847 -2529 8395 34388 19135 5995 24477 32594 60563 68919 17306 -31299
14960 -31299 -27615 -1411 24078 33317 43157 14859 35444 35110 26403 31285 6020 -20749 -17115
14947 -17115 29919 34564 24454 18890 62097 81645 68886 62016 2068 -29576 8218 4408
14935 4408 -32739 -17406 10202 26726 37286 22094 14470 -18879 -25105 -24250 -731 -2877 10824
14922 10824 17584 25423 46108 82184 47326 10436 2608 13395 5895 5702 -22635 -52155 -36892
14909 -36892 -29473 -8380 2863 -23370 2587 52298 23903 -17543 -20926 13652 16992 -734
14897 -734 -28463 -26391 -26749 -31113 -302 28518 4921 4915 -23160 -4891 -22034 -22267 25975 2761
$$ packed form
14984C4695L0538K7734P864L741l5547k1612J5931J2527k9644p799J1316j3163
14972C6581k2734j6376J0924K5993j5253j3140J8482Q117K7969Q356n1613m8605
14960c1299L684K6204K5489R239R840k8298K0585l34q707M882k5265k6769L634
14947a7115M7034M645j0110n564M3207J9548j2759o870n9948l1644L7794l810
14935D408l7147J5333K7608J6524J0560j5192p624l3349o226Q55K3519k146J3701
14922A0824O760P839K0685L6076l4858l6890p828J0787p500j93k8337k9520J5263
14909c6892P419K1093J1243k6233K5957M9711k8395m1446l383L4578L340j7726
14897g34k7729K072l58m364L0811K8820k3597ok8075J8269j7143k33M8242k3214
$$ plain form
14883 2761 -38526 -601 42579 44796 68236 47003 -28669 -45295 -40400 -35016 -15774 2459
14871 2459 -3983 -23533 -20534 -48804 -21653 1308 16554 27342 10914 7582 2022 -34265 -1801
14858 -1801 35047 24143 -3236 7318 5678 6284 -28506 -57833 -44820 22872 61240 43191
14846 43191 -17717 -5058 14253 30490 30644 26382 31326 56205 90852 104333 101039 65732 58174
14833 58174 44376 36338 30961 30338 42509 31051 34692 69184 96014 100378 86405 70657 48082
14820 48082 35278 2005 -17619 22741 34277 27571 26794 84525 85457 51244 6558 23194 15863
14807 15863 377 -50312 -11014 65589 110086 101005 88937 50083 44522 43865 30788 5171
14795 5171 7877 11908 21334 49884 59004 43117 69745 79229 91223 89699 78365 74773 46468
$$ packed form
14883B761m1287L7925M3180K217K3440k1233p5672j6626M895N384J9242J8233
14871B459o442j9550K999k8270K7151K2961J5246J0788j6428l332n560l6287L2464
14858a801L6848j0904k7379J0554j640O06l4790k9327J3013O7692L8368j8049
14846D3191o0908J2659J9311J6237J54m262M944K4879L4647J3481l294l5307p558
14833E8174j3798q038n377o23J2171j1458L641L4492K6830M364j3973j5748k2575
14820D8082j2804l3273j9624M0360J1536o706p77N7731R32l4213m4686J6636p331
14807A5863j5486n0689L9298P6603M4497r081j2068l8854n561o57j3077k5617
14795E171K706M031R426K8550R120j5887K6628R484J1994j524j1334l592k8305
$$ plain form
14782 46468 23827 -13031 21668 41493 25794 -9983 12351 31582 7516 1494 34741 46725
14770 46725 52327 47535 27622 -16313 -7631 -8879 -46034 -32824 5412 -30206 -33984 -33201 -36523
14757 -36523 -45091 -28397 9745 34203 10818 14266 8787 -17072 -8416 5878 4421 3158 -29650
14744 -29650 -32287 -21906 16322 49385 -9719 -40472 -15470 -17833 -5164 12481 42792 36984
14732 36984 11428 4343 -5251 5804 -23302 -46068 -59282 -7432 65542 118086 91432 65889
14720 65889 74692 46506 27962 -6776 -8001 125 12235 -7776 -31731 1665 27733 19459
14708 19459 21781 51108 62619 42943 41164 52107 52520 44809 56445 36989 34852 61825 39997
14695 39997 42517 45990 32833 34626 16665 -17168 -12678 14083 51387 58125 27531 25680 38199
$$ packed form
14782D6468k2641l6858L4699J9825j5699l5777K2334J9231k4066o022L3247J1984
14770D6725N602m792j9913m3935Q682j248l7155J3210L8236l5618l778P83l322
14757c6523q568J6694L8142K4458k3385L448n479k5859Q656J4294j457j263l2808
14744b9650k637J0381L8228L3063n9104l0753K5002k363J2669J7645L0311n808
14732C6984k5556p085r594J1055k9106k2766j3214N1850P2974N2544k6654k5543
14720F5889Q803k8186j8544l4738j225Q126J2110k0011k3955L3396K6068q274
14708A9459K322K9327J1511j9676j779J0943M13p711J1636j9456k137K6973k1828
14695C9997K520L473j3157J793j7961l3833M490K6761L7304O738l0594j851J2519
$$ plain form
14682 38199 80570 54858 40933 38574 43411 46150 32686 66130 63168 57475 34072 17532 27328
14669 27328 15184 -26286 -7919 9529 31192 44735 57517 24865 3268 -15449 -7491 40773
14657 40773 66571 49364 72233 66929 42004 37818 23575 9397 14214 -1849 -5954 8963
14645 8963 -51 -5849 -25661 -15590 -1685 7867 -11757 -27779 -76966 -63448 -32938 -53102
14633 -53102 -14237 31513 39677 30744 64331 49016 23156 50181 54601 60994 38259 19326
14621 19326 44971 37976 59918 66861 46011 39482 78592 61881 42705 36755 30317 24301 20780
14608 20780 22357 9763 28632 66616 47657 37073 26900 -1576 -31706 -48550 -56147 -62858
14596 -62858 -29063 -38809 -54537 -52972 -64654 -64182 -34171 -7143 -4601 4795 25031 -3972 6972
$$ packed form
14682C8199M2371k5712j3925k359M837K739j3464L3444k962n693k3403j6540R796
14669B7328j2144m1470J8367J7448K1663J3543J2782l2652k1597j8717P958M8264
14657D0773K5798j7207K2869n304k4925m186j4243j4178M817j6063m105J4917
14645H963r014n798j9812J0071J3905R552j9624j6022m9187J3518L0510k0164
14633e3102L8865M5750Q164q933L3587j5315k5860K7025M420O393k2735j8933
14621A9326K5645o995K1942O943k0850o529L9110j6711j9176n950o438o016l521
14608B0780J577j2594J8869L7984j8959j0584j0173k8476l0130j6844p597o711
14596f2858L3795r746j5728J565j1682M72L0011K7028K542R396K0236k9003J0944
$$ plain form
14583 6972 14173 38962 30605 26005 29866 57943 65515 56550 93898 60035 28959 79430 88767
14570 88767 76033 64626 42315 30046 40960 695 -3153 8420 -12943 -18612 -10783 22814
14558 22814 98296 110884 92425 44522 34109 48529 59417 96066 78536 56910 59028 6879
14546 6879 -7110 -19867 -13529 5513 16465 39778 57253 74555 44951 24320 21834 20885 33061
14533 33061 47988 45738 10207 43079 52517 46069 52480 46625 10971 -19503 -7522 -32842 -74083
14520 -74083 -63618 -98015 -80373 -28226 4620 8156 35769 20817 11529 34314 45522 21534
14508 21534 17563 15870 43117 101282 55978 44498 77631 82469 97487 61338 52187 39665
14496 39665 63831 63007 54347 53444 67402 77076 54597 31610 30294 20936 -1639 -16267 19170
$$ packed form
14583F972P201K4789q357m600L861K8077P572q965L7348l3863l1076N0471R337
14570H8767j2734j1407k2311j2269J0914m0265l848J1573k1363n669P829L3597
14558B2814P5482J2588j8459m7903j0413J4420J0888L6649j7530k1626K118n2149
14546F879j3989j2757O338J9042J0952K3313J7475J7302k9604k0631k486r49J2176
14533C3061J4927k250l5531L2872R438o448O411n855l5654l0474J1981k5320m1241
14520g4083J0465l4397J7642N2147L2846L536K7613j4952r288K2785J1208k3988
14508B1534l971j693K7247N8165m5304j1480L3133M838J5018l6149r151j2522
14496C9665K4166q24q660r03J3958R674k2479k2987j316r358k2575j4628L5437
$$ plain form
14483 19170 31374 50664 77332 49536 20605 22782 9623 19811 59709 47712 13470 -3413
14471 -3413 24059 26043 12039 2672 -7021 -20885 -132 10469 3625 -1996 2704 16919 -18125
14458 -18125 5349 30114 40574 40344 14619 10720 -12136 -33262 -20955 55 -10264 -16935
14446 -16935 11680 15850 11291 -18040 -12610 -20128 34301 93580 107756 101774 106593 78429 56668
14433 56668 38408 16249 2364 6981 -12993 39033 80606 70495 21097 -10984 4426 1165
14421 1165 -6420 21810 -590 -14976 113 2451 -23025 -45199 -29823 -7967 -2023 5659 51114
14408 51114 47995 51551 74327 75444 70753 24314 -253 10431 27005 24206 -2257 -18727 -12809
14395 -12809 -46833 -55990 -35471 -18464 -35401 -8890 8194 -13623 -15244 50807 60348 88607
$$ packed form
14483A9170J2204J9290K6668k7796k8931K177j3159J0188L9898j1997l4242j6883
14471c413K7472J984j4004r367r693j3864K0753J0601o844n621M700J4215l5044
14458a8125K3474K4765J0460k30k5725l899k2856k1126J2307K1010j0319o671
14446a6935K8615M170m559k9331N430p518N4429N9279J4176n982M819k8164k1761
14433E6668j8260k2159j3885M617j9974N2026M1573j0111m9398l2081J5410l261
14421A165p585K8230k2400j4386J5089K338k5476k2174J5376K1856N944P682M5455
14408E1114l119L556K2776J117m691m6439k4567J0684J6574k799k6463j6470N918
14395a2809l4024r157K0519J7007j6937K6511J7084k1817j621O6051R541K8259
$$ plain form
14383 88607 113337 72482 28631 2514 -750 6699 28710 63066 64028 33848 16637 16095 28165
14370 28165 58401 41832 38673 45524 36429 29945 35250 23222 20935 9080 35480 72443 90467
14357 90467 71519 36535 28768 55393 88825 109365 122395 103577 56085 75624 99285 91427
14345 91427 109457 99199 79746 61762 51144 22119 -13812 22721 77113 90587 39550 51875
14333 51875 57894 62781 46478 70888 66869 14857 -14838 -17666 -22703 -42274 -36797 -41568 -50290
14320 -50290 -26871 27423 46835 31653 20231 7105 -9657 5016 47374 69741 44598 61792
14308 61792 30748 17857 8347 4155 14009 -8010 -12614 49153 74863 72917 64274 10076 10474
14295 10474 42662 21505 10618 17628 -1114 404 -2774 16338 31814 45904 103856 107227
$$ packed form
14383H8607K4730m0855m3851k6117l264P449K2011L4356R62l0180j7211n42J2070
14370B8165L0236j6569l159O851r095o484N305j2028k287j1855K6400L6963J8024
14357I0467j8948l4984p767K6625L3432K0540J3030j8818m7492J9539K3661p858
14345I1427J8030j0258j9453j7984j0618k9025l5931L6533N4392J3474n1037J2325
14333E1875O019M887j6303K4410m019n2012k9695k828n037j9571N477m771q722
14320e0290K3419N4294J9412j5182j1422j3126j6762J4673M2358K2367k5143J7194
14308F1792l1044j2891r510m192R854k2019m604O1767K5710j946q643n4198L98
14295A0474L2188k1157j0887P010j8742J518l178J9112J5476J4090N7952L371
$$ plain form
14283 107227 58045 27799 75689 74044 77399 84534 68944 15273 12105 16341 16847 -10288 -10864
14270 -10864 6589 16030 -1371 -572 45366 23560 -26847 -54725 -20547 24368 46014 58572
14258 58572 73174 63860 45953 59401 63774 10937 -50400 -46874 -25774 22472 14877 35572
14246 35572 14534 6489 14226 42639 38077 27921 19942 -29974 -33782 -24373 -24582 -29196 -37060 8290
14232 8290 22298 35943 59670 51750 41014 31757 3209 -25179 -29222 -8871 -41460 -3923
14220 -3923 -9425 -17173 -27358 -34308 -6967 15413 63659 60974 39248 31681 57696 27197 34312
14207 34312 33770 33044 31027 23163 24613 4290 27827 65212 37037 26840 72186 95206 75704
14194 75704 11154 5579 -10833 -29220 -28151 -20041 -19678 -36100 -42716 -53288 -43127 3961 30129
$$ packed form
14283A07227m9182l0246M7890j645L355P135j5590n3671l168M236N06k7135n76
14270a0864J7453R441j7401P99M5938k1806n0407k7878L4178M4915K1646J2558
14258E8572J4602r314j7907J3448M373n2837o1337L526K1100M8246p595K0695
14246C5572k1038q045P737K8413m562j0156p979m9916l808R409k09m614p864M5350
14232H290J4008J3645K3727p920j0736r257k8548k8388m043K0351l2589L7537
14220c923n502p748j0185o950K7341K2380M8246k685k1726p567K6015l0499P115
14207C4312n42p26k017p864J450k0323K3537L7385k8175j0197M5346K3020j9502
14194G5704o4550n575j6412j8387J069Q110L63j6422o616j0572J0161M7088K6168
$$ plain form
14181 30129 48441 57771 22252 34354 52068 45145 17117 22863 5082 13553 6371 27730 65364
14168 65364 28530 -7718 -10219 8071 2497 17699 46253 21302 2896 23619 27636 24091
14156 24091 47440 57526 31113 -1664 1107 -12781 -42991 -26945 -51529 -54916 3923 4597
14144 4597 -7545 4936 15600 56442 31188 23531 38049 30507 30074 15411 20990 43235 42998
14131 42998 75988 82098 92056 90768 76692 69322 59333 62019 53772 34737 64111 71010 74923
14118 74923 84021 56513 65364 70572 71534 59543 33917 12478 42412 54925 73881 56771 40860
14105 40860 54803 54430 32464 37329 14208 24585 1483 21683 19700 20435 83158 85265 96509
14092 96509 60450 65939 95929 99062 84337 62453 46400 36272 63822 76749 58563 47309
$$ packed form
14181C0129J8312R330l5519J2102J7714o923k8028N746j7781Q471p182K1359L7634
14168F5364l6834l6248k501J8290n574J5202K8554k4951j8406K0723M017l545
14156B4091K3349J0086k6413l2777K771j3888l0210J6046k4584l387N8839O74
14144D597j2142J2481J0664M0842k5254p657J4518p542m33j4663N579K2245k37
14131D2998L2990O110R958j288j4076p370r989K686q247j9035K9374O899L913
14118G4923R098k7508Q851N208R62j1991k5626k1439K9934J2513J8956j7110j5911
14105D0860J3943l73k1966M865k3121J0377k3102K0200j983P35O2723K107J1244
14092I6509l6059N489K9990L133j4725k1884j6053j0128K7550J2927j8186j1254
$$ plain form
14080 47309 39305 46475 31268 20604 26485 11129 7153 19346 40978 49671 13539 13764 11838
14067 11838 10336 9179 42038 55839 74591 50789 46163 42011 19200 -4592 -15020 -17707 40072
14054 40072 59403 32486 52622 113618 101641 96376 72332 50967 17095 22487 37654 36714
14042 36714 29272 -15555 -41419 -63323 -44240 10911 7409 -4412 52229 47290 57933 37481
14030 37481 21587 18884 5172 -15671 61609 79771 72580 83659 73554 38011 -23918 -50669
14018 -50669 -12693 9147 17588 -52935 -56757 -601 3354 47304 85844 102933 81320 76817
14006 76817 91889 91159 48400 21447 19667 6737 19237 19583 33864 40931 39731 38631 20954
13993 20954 19358 17193 49426 83979 81515 30328 48152 32687 25159 3633 -9972 5778
$$ packed form
14080D7309q004P170j5207j0664N881j5356l976J2193K1632Q693l6132K25j926
14067A1838j502j157L2859J3801J8752k3802m626m152k2811k3792j0428k687N7779
14054D0072J9331k6917K0136O0996j1977n265k4044k1365l3872N392J5167r40
14042C6714p442m4827k5864k1904J9083N5151l502j1821N6641m939J0643k0452
14030C7481j5894k703j3712k0843P7280J8162p191J1079j0105l5543o1929k6751
14018e0669L7976K1840Q441p0523l822N6156L955M3950L8540J7089k1613m503
14006G6817J5072p30m2759k6953j780j2930J2500L46J4281P067j200j100j7677
13993B0954j596k165L2233L4553k464n1187J7824j5465p528k1526j3605J5750
$$ plain form
13981 5778 53232 90181 112383 97587 59750 39532 46185 24044 37951 70538 89889 74387
13969 74387 77822 67838 45919 47663 79716 79276 69078 75283 17086 -16806 1549 41113 31884
13956 31884 45409 67541 94444 48877 40831 47984 31579 4839 -11408 -16952 -24186 -6256
13944 -6256 31843 45830 11210 3719 24147 61739 76238 42702 20206 22090 51755 110226
13932 110226 131693 118656 94897 59532 58724 68265 11624 9870 15372 40051 44594 58866 63476
13919 63476 62783 71175 84812 103172 100036 73373 97200 110090 65050 22201 37622 52260
13907 52260 8182 -8571 28050 1517 -794 59486 92175 109097 120566 79343 54289 61978
13895 61978 70538 91238 101007 103540 115681 106301 86221 93205 121173 112053 89413 76909 68353
$$ packed form
13981E778M7454L6949K2202j4796l7837k0218O653k2141J3907L2587J9351j5502
13969G4387L435r984k1919J744L2053m40j0198O205n8197l3892J8355L9564r229
13956C1884J3525K2132K6903m5567q046P153j6405k6740j6247n544p234J7930
13944f256L8099J3987l4620p491K0428L7592J4499l3536k2496J884K9665N8471
13932A10226K1467j3037k3759l5365q08R541n6641j754N502K4679M543J4272M610
13919F3476o93Q392J3637J8360l136k6663K3827J2890m5040m2849J5421J4638
13907E2260m4078j6753L6621k6533k311O0280L2689J6922J1469m1223k5054P689
13895F1978Q560K0700R769K533J2141r380k0080O984K7968r120k2640j2504q556
$$ plain form
13882 68353 60920 33995 59354 66130 59485 46922 9413 13340 41057 79976 108212 100209 78644
13869 78644 62081 43927 9964 21345 28077 63317 65164 47730 29593 -12972 -13257 27334
13857 27334 36315 45946 32024 9282 6020 -2948 17623 32113 53235 96054 74062 42084
13845 42084 55695 88715 81794 65556 30383 6669 8305 28341 31679 22137 27883 31433 34315
13832 34315 28829 11744 8876 16409 41777 56428 55539 62799 81186 85513 77885 78674 78445 45016
13818 45016 37847 52035 90622 78177 54969 34037 49604 52163 38561 25487 -2135 34745
13806 34745 50436 41604 41816 18927 20027 54403 69059 95867 104508 63376 31931 32128 24266
13793 24266 43952 63434 79533 72579 77802 103484 84401 40746 55296 46785 71087 55693
$$ packed form
13882F8353p433k6925K5359O776o645j2563l7509L927K7717L8919K8236q003k1565
13869G8644j6563j8154l3963J1381O732L5240J847j7434j8137m2565k85M0591
13857B7334Q981R631j3922k2742l262q968K0571J4490K1122M2819k1992l1978
13845D2084J3611L3020o921j6238l5173k3714J636K0036L338r542N746L550K882
13832C4315n486j7085k868P533K5368J4651q89P260J8387M327p628P89k29l3429
13818D5016p169J4188L8587j2445k3208k0932J5567K559j3602j3074k7622L6880
13806C4745J5691q832K12k2889J100L4376J4656K6808Q641m1132l1445J97p862
13793B4266J9686J9482J6099o954N223K5682j9083m3655J4550q511K4302j5394
$$ plain form
13781 55693 16321 -2675 18808 47606 55723 55654 44801 27225 19591 37172 18119 12293 42115
13768 42115 54990 53802 47211 41747 20923 4667 17 26817 80872 103052 108934 118241 112986
13755 112986 82402 54798 74505 110166 98627 115367 84728 60108 45366 41789 45912 42170
13743 42170 8762 11822 32845 40915 50666 57655 47388 27004 30611 40762 28685 19496 51602
13730 51602 52625 50377 33674 78833 99795 77041 54723 50406 54186 27225 29335 32774 26724
13717 26724 25854 35068 56655 55891 75441 78004 56137 46625 65454 79136 59747 47317 72028
13704 72028 44520 27882 39639 37025 6457 -7815 14895 45986 20676 37404 60824 74099
13692 74099 98880 129192 119840 85764 89139 68098 74809 85785 69477 46399 36540 16941
$$ packed form
13781E5693l9372j8996K1483K8798Q117o9j0853j7576p634J7581j9053n826K9822
13768D2115J2875j188o591n464k0824j6256m650K6800N4055K2180N882R307n255
13755A12986l0584k7604J9707L5661j1539J6740l0639k4620j4742l577M123l742
13743D2170l3408L060K1023Q070R751O989j0267k0384L607J0151j2077r189L2106
13730E1602J023k248j6703M5159K0962k2754k2318m317L780k6961K110L439o050
13717B6724q70R214K1587p64J9550K563k1867r512J8829J3682j9389j2430K4711
13704G2028k7508j6638J1757k614l0568j4272K2710L1091k5310J6728K3420J3275
13692G4099K4781L0312r352l4076L375k1041O711J0976j6308k3078r859j9599
$$ plain form
13680 16941 45508 67578 62011 53399 46041 57162 86595 94764 108331 102835 111673 76257 67565
13667 67565 93913 123753 99520 86616 51463 58840 51121 43581 13769 4693 4896 5968 43468
13654 43468 38015 45641 84261 93046 69183 36764 53247 64035 57384 74368 91622 39130
13642 39130 -8663 -12318 -26753 -4583 9355 32298 32395 28506 63101 76182 97917 88708 81860
13629 81860 86383 110220 112350 94135 85270 51129 24506 4310 -13543 7736 46728 52405
13617 52405 43018 34215 30084 90098 61186 75069 44865 21157 48561 66556 59568 72585
13605 72585 106782 105938 57951 29408 23802 27741 65563 70170 44110 42384 48074 35598 24101
13592 24101 40835 54184 99027 119625 97873 90092 73063 63154 31898 39043 27915 23093
$$ packed form
13680A6941K8567K2070n567q612p358J1121K9433Q169J3567n496Q838l5416q692
13667F7565K6348K9840k4233j2904l5153P377p719p540k9812r076K03J072L7500
13654D3468n453P626L8620Q785k3863l2419J6483J0788o651J6984J7254n2492
13642C9130m7793l655j4435K2170J3938K2943R7l889L4595J3081K1735r209o848
13629H1860M523K3837K130j8215q865l4141k6623k0196j7853K1279L8992N677
13617E2405r387q803m131O0014k8912J3883l0204k3708K7404J7995o988J3017
13605G2585L4197q44m7987k8543n606L939L7822M607k6060j726N690j2476j1497
13592B4101J6734J3349M4843K0598k1752p781j7029r909l1256P145j1128m822
$$ plain form
13580 23093 53964 30638 25024 59540 108831 129935 76996 57848 37483 51520 69832 64066
13568 64066 34741 66900 61723 34570 43161 71930 72358 82861 56959 46751 47946 33348 50474
13555 50474 42509 29762 7367 22816 40660 88033 100418 70442 61855 34925 4186 36064
13543 36064 76312 81147 59781 45277 84467 84192 46430 70267 102771 118665 99474 79533
13531 79533 83896 75730 102339 70008 28484 11167 17947 87537 94967 106259 94518 104555
13519 104555 95774 58052 70766 78437 56427 88562 81724 85293 105755 116375 117239 109381 108424
13506 108424 99416 64421 84151 116307 116857 92351 52240 44853 83604 103402 100152 63172
13494 63172 46310 58742 59343 56749 59156 30840 21491 50779 84423 109363 112258 98990 72593
$$ packed form
13580B3093L0871k3326n614L4516M9291K1104n2939j9148k0365J4037J8312n766
13568F4066k9325L2159n177k7153Q591K8769M28J0503k5902j0208J195j4598J7126
13555E0474p965j2747k2395J5449J7844M7373J2385k9976q587k6930l0739L1878
13543C6064M0248M835k1366j4504L9190k75l7762K3837L2504J5894j9191j9941
13531G9533M363q166K6609l2331m1524j7317O780O9590P430J1292j1741J0037
13519A04555q781l7722J2714P671k2010L2135o838L569K0462J0620Q64p858r57
13506A08424r008l4995J9730L2156N50k4506m0111p387L8751J9798l250l6980
13494F3172j6862J2432O01k594K407k8316r349K9288L3644K4940K895j3268k6397
$$ plain form
13481 72593 39637 49177 78813 110003 115302 103483 103694 105041 126186 127673 104820 74280 59242
13468 59242 57443 85371 99171 64996 44812 33645 36910 38310 -13668 -16150 14728 29777
13456 29777 51241 63192 76195 48273 59910 86000 97475 110094 107448 127217 84406 81544
13444 81544 88739 130844 106084 39864 20915 44828 102862 83004 62956 74916 95243 104332
13432 104332 106881 37705 46867 113572 123564 81965 35025 42792 22431 -185 6507 59421
13420 59421 52974 30150 38589 45293 46561 56733 83136 102679 124032 148457 146019 106131 61547
13407 61547 74921 61457 30928 71693 107753 106865 112289 118822 118035 68167 53679 68023 78535
13394 78535 95004 90872 77067 58989 58453 77720 106416 87986 53298 8161 -11686 -8917
$$ packed form
13481G2593l2956R540K9636L1190N299j1819K11J347K1145J487k2853l0540j5038
13468E9242j799K7928J3800l4175k0184j1167L265J400n1978k482L0878J5049
13456B9777K1464J1951J3003k7922J1637K6090J1475J2619k646J9769m2811k862
13444H1544P195M2105k4760o6220j8949K3913N8034j9858k0048J1960K0327R089
13432A04332K549o9176R162O6705R992m1599m6940P767k0361k2616O692N2914
13420E9421o447k2824Q439O704J268J0172K6403J9543K1353K4425k438l9888m4584
13407F1547J3374j3464l0529M0765L6060q88N424O533p87m9868j4488J4344J0512
13394G8535J6469m132j3805j8078n36J9267K8696j8430l4688m5137j9847K769
$$ plain form
13382 -8917 -6497 16917 34988 55248 54075 77286 98812 129336 129648 91974 62915 84353 96137
13369 96137 103792 72659 39250 24175 29049 44457 42458 61806 55483 51921 44851 60965 107517
13356 107517 106591 109270 123327 109041 98392 107159 151167 171554 153127 150692 157188 156591 180168
13343 180168 168200 140042 104153 104504 121802 122721 103881 88529 86485 92359 115070 73388 81576
13330 81576 63943 56805 65146 92066 88883 57998 55721 56934 92187 139325 147205 138841 67273
13317 67273 52482 72051 87249 109768 117139 127871 138789 131775 99337 112190 88874 98931
13305 98931 132462 131089 107848 101002 82943 97481 92916 110555 132825 140551 133364 103954 102851
13292 102851 95886 89788 98160 99662 91713 73783 75002 76506 73085 63056 75185 92817 125410
$$ packed form
13382h917K420K3414J8071K0260j173K3211K1526L0524L12l7674k9059K1438J1784
13369I6137P655l1133l3409j5075M874J5408j999J9348o323l562p070J6114M6552
13356A07517r26K679J4057j4286j0649Q767M4008K0387j8427k435O496n97K3577
13343A80168j1968k8158l5889L51J7298R19j8840j5352k044N874K2711m1682Q188
13330H1576j7633p138Q341K6920l183l0885k277J213L5253M7138P880q364p1568
13317F7273j4791J9569J5198K2519P371J0732J0918p014l2438J2853k3316J0057
13305I8931L3531j373k3241o846j8059J4538m565J7639K2270P726p187k9410j103
13292A02851o965o098Q372J502p949j7930J219J504l421j0029J2129J7632L2593
$$ plain form
13279 125410 143818 137575 155296 139444 84917 59547 85863 102449 112093 125402 151998 165655
13267 165655 135680 120913 131180 149887 149273 199452 184104 113172 102106 68094 77084 64183
13255 64183 70330 73983 72103 33080 35994 60279 72848 91126 91976 113536 126093 141825 130320
13242 130320 147044 119167 96454 76088 74172 64048 37172 88042 103045 89368 86400 109607
13230 109607 96452 69060 91463 136158 138285 129377 96171 77614 90256 97466 117308 108166
13218 108166 88635 79242 65688 54570 47568 75743 72428 39848 44459 63976 102524 81704
13206 81704 51788 68984 89677 119079 132923 132946 145426 140933 137394 67337 37510 42170 67092
13193 67092 149584 159347 162081 160766 132151 120092 107996 107565 129055 142192 155468 144311 106560
$$ packed form
13279A25410J8408o243J7721j5852n4527k5370K6316J6586R644J3309K6596J3657
13267A65655k9975j4767J0267J8707o14N0179j5348p0932j1066l4012Q990j2901
13255F4183O147L653j880l9023K914K4285J2569J8278Q50K1560J2557J5732j1505
13242A30320J6724k7877k2713k0366j916j0124k6876N0870J5003j3677k968K3207
13230A09607j3155k7392K2403M4695K127q908l3206j8557J2642P210J9842r142
13218A08166j9531r393j3554j1118p002K8175l315l2580M611J9517L8548k0820
13206H1704k9916J7196K0693K9402J3844K3J2480m493l539p0057k9827M660K4922
13193F7092Q2492R763K734j315k8615j2059j2096m31K1490J3137J3276j1157l7751
$$ plain form
13180 106560 74446 74284 99988 98540 82267 82171 144102 168779 164018 163300 166527 116588 117335 96875
13166 96875 72379 53134 76606 106862 117144 123452 115851 147762 165116 158569 123659 97541
13154 97541 82173 108063 114849 133125 112446 81745 58412 56198 31614 48527 57071 76978
13142 76978 82317 81159 82177 79895 89355 91331 82387 86899 116504 98409 61486 53091 60175 83959
13128 83959 108954 105456 85778 67370 54615 42125 58621 81643 104807 86556 86992 124681
13116 124681 161640 148951 139168 143151 141009 189292 166061 127810 115313 102848 102953 120649
13104 120649 109134 107602 149952 182254 141953 124294 140425 150324 141929 126368 129549 128316
13092 128316 131608 127717 127218 130990 119700 120216 158252 173625 159167 136195 100062 87287 109979
$$ packed form
13180A06560l2114j62K5704j448j6273r6O1931K4677m761p18L227m9939P47k0460
13166I6875k4496j9245K3472L0256J0282O308p601L1911J7354o547l4910k6118
13154I7541j5368K5890O786J8276k0679l0701k3333k214k4584J6913Q544J9907
13142G6978N339j158J018k282R460J976q944M512K9605j8095l6923q395P084K3784
13128H3959K4995l498j9678j8408j2755j2490J6496K3022K3164j8251M36L7689
13116A24681L6959j2689r783L983k142M8283k3231l8251j2497j2465J05J7696
13104A20649j1515j532M2350L2302m0301j7659J6131R899q395j5561L181j233
13092A28316L292l891m99L772j1290N16L8036J5373j4458k2972l6133j2775K2692
$$ plain form
13079 109979 137282 136800 131322 150693 143638 156954 174862 147242 111396 110304 140553 169949
13067 169949 186720 172846 177419 168266 148176 136533 137603 123100 134510 92792 61585 50220
13055 50220 63916 102211 130668 135035 119184 132267 173337 190520 199181 171914 145435 153661
13043 153661 158634 117561 133963 155934 130703 88142 64352 70944 107827 103013 74671 38665
13031 38665 45822 56039 57991 95342 120837 136876 151992 185518 174056 167062 168867 148860
13019 148860 111154 89209 124762 148355 123657 133342 155485 139282 131472 132424 143156 150977
13007 150977 190865 188929 166693 129808 107282 119262 97710 106429 138119 154640 115713 97893
12995 97893 103399 123310 152755 140288 141645 145550 169578 178749 175485 162241 167515 165726 172001
$$ packed form
13079A09979K7303m82n478J9371p055J3316J7908k7620l5846j092L0249K9396
13067A69949J6771j3874M573r153k0090j1643J070j4503J1410m1718l1207j1365
13055E0220J3696L8295K8457M367j5851J3083M1070J7183Q661k7267k6479Q226
13043A53661M973m1073J6402K1971k5231m2561k3790O592L6883m814k8342l6006
13031C8665P157J0217J952L7351K5495J6039J5116L3526j1462o994J805k0007
13019A48860l7706k1945L5553K3593k4698R685K2143j6203p810R52J0732P821
13007A50977L9888j936k2236l6885k2526J1980k1552Q719L1690J6521l8927j7820
12995I7893N506J9911K9445j2467J357L905K4028R171l264j3244N274j789O275
$$ plain form
12982 172001 183493 197081 235664 228299 212333 212740 196600 163055 141334 166900 188790 191610
12970 191610 201212 210748 232314 217208 196603 197261 188480 210627 188579 189232 171280 164689 163640
12957 163640 167764 171688 209142 238901 253997 245971 210968 192254 147034 112365 113563 162381
12945 162381 155119 147652 147774 179721 213891 224423 261183 262407 278481 251971 209299 196341
12933 196341 184649 200310 196069 172501 172697 165950 163913 153666 164093 175621 154398 143968
12921 143968 121953 141619 151699 159940 182590 177285 159417 139469 175320 196309 217049 224779
12909 224779 238306 251381 236259 233418 217475 213340 249435 225895 206949 211518 197767 186812
12897 186812 181535 203174 215745 188590 165871 146484 161385 153125 149053 168729 171522 181224
$$ packed form
12982A72001J1492J3588L8583p365j5966M07j6140l3545k1721K5566K1890K820
12970A91610R602R536K1566j5106k0605O58q781K2147k2048O53j7952o591j049
12957A63640M124L924L7454K9759J5096q026l5003j8714m5220l4669J198M8818
12945A62381p262p467J22L1947L4170J0532L6760J224J6074k6510m2672j2958
12933A96341j1692J5661m241k3568J96o747k037j0247J0427J1528k1223j0430
12921A43968k2015J9666J0080Q241K2650n305j7868j9948L5851K0989K0740P730
12909B24779J3527J3075j5122k841j5943m135L6095k3540j8946M569j3751j0955
12897A86812n277K1639J2571k7155k2719j9387J4901q260m072J9676K793R702
$$ plain form
12885 181224 190444 187609 172627 182565 196524 220221 234811 202261 195933 231504 243116 227365
12873 227365 195804 224985 239000 220132 207803 238959 253011 215435 198300 199862 233319 240621
12861 240621 238315 234300 232981 234295 225398 206832 220044 255717 234440 213144 193661 225878
12849 225878 243348 264169 275754 237345 226479 228416 228529 245395 226283 246136 263231 243874
12837 243874 267471 272176 242326 245390 286199 330974 335232 333547 320883 258846 214589 207268
12825 207268 219171 247719 277058 241793 241959 311371 348854 343217 344604 323549 259885 225917
12813 225917 226242 236812 254834 288275 283053 267513 269064 302966 280665 237200 192139 170880
12801 170880 196873 252094 279295 281466 289085 318074 308808 276913 251713 237533 209969 208031
$$ packed form
12885A81224R220k835j4982R938J3959K3697J4590l2550o328L5571J1612j5751
12873B27365l1561K9181J4015j8868j2329L1156J4052l7576j7135J562L3457P302
12861B40621k306m015j319J314q897j8566J3212L5673k1277k1296j9483L2217
12849B25878J7470K0821J1585l8409j0866J937J13J6866j9112J9853J7095j9357
12837B43874K3597M705k9850L064M0809M4775M258j685j2664o2037m4257p321
12825B07268J1903K8548K9339l5265J66O9412L7483n637J387k1055o3664l3968
12813B25917L25J0570J8022L3441n222j5540J551L3902k2301m3465m5061k1259
12801A70880K5993N5221K7201K171P619K8989r266l1895k5200j4180k7564j938
$$ plain form
12789 208031 255544 299867 286439 257992 251677 270644 307461 343855 329688 322241 356946 377517
12777 377517 352722 324417 339439 344547 316082 282446 303466 315980 303094 306958 335663 333488
12765 333488 376018 369991 322372 328120 319700 317088 342037 326696 297548 305270 355706 424769
12753 424769 397747 372117 357631 386934 387233 386162 351463 299308 308267 330575 339708 361226
12741 361226 374768 383454 413361 360354 340717 356462 368732 338801 307652 319331 365934 416296
12729 416296 389192 357220 356623 365605 377569 395065 437213 465998 465964 457345 444334 427768 407960
12716 407960 413175 402123 395036 383336 369172 409130 423910 429220 443858 444807 418530 429474
12704 429474 479891 520000 491726 491954 476580 474841 474874 451795 429711 470093 468284 470225 448281
$$ packed form
12789B08031M7513M4323j3428k8447o315J8967L6817L6394j4167p447L4705K0571
12777C77517k4795k8305J5022N108k8465l3636K1020J2514j2886L864K8705k175
12765C33488M2530o027m7619N748q420k612K4949j5341k9148P722N0436O9063
12753D24769k7022k5630j4486K9303K99j071l4699n2155Q959K2308R133K1518
12741C61226J3542Q686K9907n3007j9637J5745J2270k9931l1149J1679M6603N0362
12729D16296k7104l1972n97Q982J1964J7496M2148K8785l4q619j3011j6566j9808
12716D07960N215j1052p087j1700j4164L9958J4780N310J4638R49k6277J0944
12704D29474N0417M0109k8274K28j5374j739L3k3079k2084M0382j809J941k1944
$$ plain form
12691 448281 427733 420036 409294 437076 410929 416229 421441 427208 441971 451153 424207 455726
12679 455726 504269 538656 527681 540786 560214 562653 545359 536330 529459 514201 465065 469667
12667 469667 524372 565928 556674 551667 538656 593250 585152 573643 568123 583172 576816 593571
12655 593571 556351 537924 552089 602470 668459 654767 626613 622572 648345 627961 651414 683789
12643 683789 697575 726749 802172 861930 906020 960139 1057721 1176369 1292555 1384411 1453047
12632 1453047 1543255 1643616 1699474 1684277 1639391 1579329 1479189 1349570 1218427 1122711
12622 1122711 1052588 981462 944629 914528 860408 870371 840008 834350 851464 865055 906869 886968
12610 886968 871172 879606 914532 915115 913925 909327 897295 893785 911562 897058 876833 852543 857992
$$ packed form
12691D48281k0548p697j0742K7782k6147N300N212N767J4763R182k6946L1519
12679D55726M8543L4387j0975J3105J9428K439j7294r029o871j5258m9136M602
12667D69667N4705M1556r254n007j3011N4594q098j1509n520J5049o356J6755
12655E93571l7220j8427J4165N0381O5989j3692k8154m041K5773k0384K3453L2375
12643F83789J3786K9174P5423N9758M4090N4119R7582J18648J16186R1856O8636
12632A453047R0208J00361N5858j5197m4886o0062j00140j29619j31143r5716
12622A122711p0123p1126l6833l0101n4120R963l0363n658J7114J3591M1814j9901
12610H86968j5796Q434L4926N83j190m598j2032l510J7777j4504k0225k4290N449
$$ plain form
12597 857992 831070 813342 809608 845717 894409 907994 912540 920027 925057 953874 954741 957219 975187
12584 975187 996232 1014283 1030600 1004881 992189 972217 952247 954215 935426 924319 955009 1015151
12572 1015151 1003783 972107 951151 1032711 1057229 1053871 1053374 1060816 1056466 1057434 1054524 1083202 1112196
12559 1112196 1097405 1096199 1103588 1085123 1096377 1132876 1120361 1149725 1158830 1151691 1162555 1169580
12547 1169580 1199400 1193975 1230354 1257701 1243634 1220629 1227921 1234555 1216408 1235737 1270017 1305707
12535 1305707 1316070 1294784 1330011 1388693 1422730 1439619 1476203 1519178 1525230 1507912 1501924 1496557
12523 1496557 1517701 1579119 1656806 1703394 1733096 1821812 1888697 1952985 2052304 2166677 2336438
12512 2336438 2496544 2686920 2871047 3045687 3252510 3393306 3495080 3504183 3417034 3243279
$$ packed form
12597H57992k6922j7728l734L6109M8692J3585M546P487N030K8817Q67K478J7968
12584I75187K1045J8051J6317k5719j2692j9972j9970J968j8789j1107L0690O0142
12572A015151j1368l1676k0956Q1560K4518l358m97P442m350R68k910K8678K8994
12559A112196j4791j206P389j8465J1254L6499j2515K9364R105p139J0864P025
12547A169580K9820n425L6379K7347j4067k3005P292O634j8147J9329L4280L5690
12535A305707J0363k1286L5227N8682L4037J6889L6584M2975O052j7318n988n367
12523A496557K1144O1418P7687M6588K9702Q8716O6885O4288R9319J14373J69761
12512B336438J60106J90376J84127J74640K06823J40796J01774R103q7149j73755
$$ plain form
12502 3243279 3094178 2958197 2793328 2682317 2576335 2517232 2536463 2560365 2549636 2584169
12492 2584169 2689453 2844526 3110130 3553972 4256439 5214822 5664278 5008612 4074907
12483 4074907 3539630 3274023 3185489 3122194 3125531 3099119 3079931 3127258 3158410 3156496 3129841
12472 3129841 3132394 3154275 3177450 3211158 3242371 3311079 3361736 3374355 3411482 3463101 3526407
12461 3526407 3572804 3634193 3718221 3833601 3960864 4152839 4365492 4629117 4921432 5164134
12451 5164134 5331199 5364183 5329465 5208118 5088299 5018841 4983770 4983783 5053081 5102729 5163752
12440 5163752 5234369 5348246 5461976 5553957 5680961 5829103 5997195 6130104 6233577 6317996
12430 6317996 6406764 6547582 6678913 6859912 7043943 7221231 7462291 7696066 7961420 8203053
$$ packed form
12502C243279j49101j35981j64869j11011j05982n9103J9231K3902j0729L4533
12492B584169J05284J55073K65604M43842P02467R58383M49456o55666r33705
12483D074907n35277k65607q8534o3295L337k6412j9188M7327L1152j914k6655
12472C129841K553K1881K3175L3708L1213O8708N0657J2619L7127N1619O3306
12461C526407M6397O1389Q4028J15380J27263J91975K12653K63625K92315K42702
12451E164134J67065L2984l4718j21347j19819o9458l5071J3O9298M9648O1023
12440E163752P0617J13877J13730R1981J27004J48142J68092J32909J03473Q4419
12430F317996Q8768J40818J31331J80999J84031J77288K41060K33775K65354K41633
$$ plain form
12420 8203053 8434020 8638804 8775024 8852805 8939785 9017298 9109988 9257108 9409152 9589611
12410 9589611 9796954 10023175 10270625 10524713 10789627 11055257 11324429 11591353 11822509
12401 11822509 12089452 12414901 12785616 13124047 13435533 13761876 14117928 14509685 14960873
12392 14960873 15438154 16010825 16654332 17332754 17938939 18459786 18884253 19290729 19671024
12383 19671024 20081604 20477713 20848421 21211444 21475934 21711926 21999596 22285043 22621327
12374 22621327 22933767 23241754 23615785 24009072 24356740 24686538 25076062 25410883 25721136
12365 25721136 26037224 26280229 26517467 26686762 26853382 27021536 27169960 27306190 27445116
12356 27445116 27485070 27499532 27506387 27461822 27348256 27228458 27094242 26947959 26803614 26672130
$$ packed form
12420H203053K30967K04784J36220P7781Q6980P7513R2690J47120J52044J80459
12410I589611K07343K26221K47450K54088K64914K65630K69172K66924K31156
12401A1822509K66943L25449L70715L38431L11486L26343L56052L91757M51188
12392A4960873M77281N72671O43507O78422O06185N20847M24467M06476L80295
12383A9671024M10580L96109L70708L63023K64490K35992K87670K85447L36284
12374B2621327L12440L07987L74031L93287L47668L29798L89524L34821L10253
12365B5721136L16088K43005K37238J69295J66620J68154J48424J36230J38926
12356B7445116L9954J4462O855m4565j13566j19798j34216j46283j44345j31484
$$ plain form
12346 26672130 26566847 26448080 26328142 26136956 25815871 25407433 24875318 24277202 23633092
12337 23633092 22975535 22254287 21629906 21090820 20539779 20003912 19502427 19000064 18504234
12328 18504234 18023689 17577463 17161871 16728267 16325326 15931717 15580738 15187684 14809448
12319 14809448 14462683 14137206 13763103 13386501 13117890 12828927 12529651 12277997 12052825
12310 12052825 11824642 11568914 11357143 11137512 11008956 10959444 10946015 10885317 10809427 10643538
12300 10643538 10421414 10118943 9748724 9353802 9020298 8703539 8399844 8163309 7988430
12291 7988430 7814126 7631517 7452337 7265613 7126459 7033387 6944078 6807041 6658632 6570295
12281 6570295 6468283 6365092 6232668 6149345 6083816 5977018 5933141 5896064 5796441 5714230
$$ packed form
12346B6672130j05283j18767j19938j91186l21085m08438n32115n98116o44110
12337B3633092o57557p21248o24381n39086n51041n35867n01485n02363m95830
12328A8504234m80545m46226m15592m33604m02941l93609l50979l93054l78236
12319A4809448l46765l25477l74103l76602k68611k88963k99276k51654k25172
12310A2052825k28183k55728k11771k19631j28556m9512j3429o0698p5890j65889
12300A0643538k22124l02471l70219l94922l33504l16759l03695k36535j74879
12291G988430j74304j82609j79180j86724j39154r3072q9309j37037j48409q8337
12281F570295j02012j03191j32424q3323o5529j06798m3877l7077r9623q2211
$$ plain form
12271 5714230 5667366 5628679 5614543 5568709 5559343 5531057 5531345 5515658 5488226 5446527 5450548 5484959
12259 5484959 5516489 5524244 5522804 5507721 5492845 5498436 5526369 5581476 5640010 5707004 5805172 5898465
12247 5898465 5995487 6097752 6279326 6488835 6790670 7230297 7723188 8386117 9143354 9971901
12237 9971901 10764090 11511899 12393758 13440501 14720149 16249877 18004696 20027741 22353106
12228 22353106 25109328 28568259 33267479 40144267 50448980 65339755 84914985 107513158
12220 107513158 131522987 156314765 180117842 199183052 210147463 212611830 207061963
12213 207061963 193552031 172578470 147484459 122260294 98679087 77176148 59026872
12206 59026872 45651926 36571062 30505708 26302959 23181026 20721852 18618917 16796137
$$ packed form
12271E714230m6864l8687j4136m5834r366k8286K88j5687k7432m1699M021L4411
12259E484959L1530P755j440j5083j4876N591K7933N5107N8534O6994R8168R3293
12247E898465R7022J02265J81574K09509L01835M39627M92891O62929P57237Q28547
12237I971901P92189P47809Q81859J046743J279648J529728J754819K023045K325365
12228B2353106K756222L458931M699220O876788J0304713J4890775J9575230K2598173
12220A07513158K4009829K4791778K3803077J9065210J0964411K464367n549867
12213B07061963j3509932k0973561k5094011k5224165k3581207k1502939j8149276
12206E9026872j3374946r080864o065354m202749l121933k459174k102935j822780
$$ plain form
12198 16796137 15068845 13441566 11990145 10744083 9672748 8734399 7904351 7203385
12190 7203385 6655877 6254848 5997105 5924487 5988849 6135987 6471216 6896079 7204240 7192109
12180 7192109 6793485 6290124 5890809 5659011 5558301 5564932 5466792 5174928 4750130 4290651
12170 4290651 3934136 3641150 3428876 3221660 2941641 2690184 2490532 2335938 2250400 2191485
12160 2191485 2106008 2022866 1975604 1961555 1940207 1910876 1869044 1862980 1840422 1820801 1850318
12149 1850318 1851785 1904029 1966596 2020128 2216266 2453153 2755332 3090026 3353453 3317556
12139 3317556 2948346 2503392 2105692 1820152 1652671 1567936 1518967 1503528 1451631 1417555
12129 1417555 1385477 1354470 1331021 1328283 1345518 1295626 1217901 1175717 1167296 1157495 1206708 1222782
$$ packed form
12198A6796137j727292j627279j451421j246062j071335r38349q30048p00966
12190G203385n47508m01029k57743p2618O4362J47138L35229M24863L08161j2131
12180G192109l98624n03361l99315k31798j00710O631r8140k91864m24798m59479
12170D290651l56515k92986k12274k07216k80019k51457j99652j54594q5538n8915
12160B191485q5477q3142m7262j4049k1348k9331m1832o064k2558j9621K9517
12149A850318J467N2244O2567N3532J96138K36887L02179L34694K63427l5897
12139C317556l69210m44954l97700k85540j67481q4735m8969j5439n1897l4076
12129A417555l2078l1007k3449k738J7235m9892p7725m2184q421r801M9213J6074
$$ plain form
12117 1222782 1191188 1180195 1165463 1172179 1137491 1135014 1134649 1129806 1172011 1189833 1239093 1283609
12105 1283609 1266909 1265467 1297972 1338639 1329890 1349084 1407927 1447989 1443803 1415779 1384933 1316182
12093 1316182 1277840 1230213 1192737 1098409 1010694 946407 857085 818727 756652 729760 685261
12082 685261 652322 640567 666326 692765 674516 661525 635660 633800 632776 591175 563291 574128
12070 574128 583261 625526 688759 670805 617757 648085 636077 621931 614238 603048 610689 627920
12058 627920 644198 619079 613797 586561 569848 572594 589480 584561 579135 610581 600710 572088
12046 572088 545494 533918 543879 513947 514125 533719 548033 563127 560781 537492 539181 549274
12034 549274 554792 535413 553361 551265 563502 545114 494011 442809 404562 433171 466849 441839
$$ packed form
12117A222782l1594j0993j4732O716l4688k477l65m843M2205J7822M9260M4516
12105A283609j6700j442L2505M0667q749J9194N8843M0062m186k8024l0846o8751
12093A316182l8342m7627l7476r4328q7715o4287q9322l8358o2075k6892m4499
12082F85261l2939j1755K5759K6439j8249j2991k5865j860j024m1601k7884J0837
12070E74128R133M2265O3233j7954n3048L0328j2008j4146p693j1190P641J7231
12058F27920J6278k5119n282k7236j6713K746J6886m919n426L1446r871k8622
12046E72088k6594j1576R961k9932J78J9594J4314J5094k346k3289J689J0093
12034E49274N518j9379J7948k096J2237j8388n1103n1202l8247K8609L3678k5010
$$ plain form
12022 441839 428977 436286 472565 493400 519680 486604 495612 514775 479467 456493 463358 474795
12010 474795 478558 488507 503270 490942 499499 492458 454940 461349 484889 473348 470171 461574 423558
11997 423558 410640 417036 425881 390521 401261 433201 428083 405564 413206 446754 484906 497542
11985 497542 508518 486870 469146 490666 529863 528733 473785 438592 445992 406591 397331 387591
11973 387591 364960 358585 382894 401791 419316 415877 381024 387162 418055 437082 429734 408873
11961 408873 425027 453268 471544 458061 396024 401433 427380 402039 397023 415754 398870 373181
11949 373181 340614 311943 332229 331478 351089 339604 343814 338413 301920 349586 389516 393521
11937 393521 373338 354959 366835 409901 445714 514172 613685 634216 568267 485157 406401
$$ packed form
12022D41839j2862P309L6279K0835K6280l3076R008J9163l5308k2974O865J1437
12010D74795L763R949J4763j2328Q557p041l7518O409K3540j1541l177q597l8016
11997D23558j2918O396Q845l5360J0740L1940n118k2519P642L3548L8152J2636
11985D97542J0976k1648j7724K1520L9197j130n4948l5193P400l9401r260r740
11973C87591k2631o375K4309J8897J7525l439l4853O138L0893J9027p348k0861
11961D08873J6154K8241J8276j3483o2037N409K5947k5341n016J8731j6884k5689
11949C73181l2567k8671K0286p51J9611j1485M210n401l6493M7666L9930M005
11937C93521k0183j8379J1876M3066L5813O8458R9513K0531o5949q3110p8756
$$ plain form
11926 406401 380921 421607 400289 382202 385455 340808 322430 311297 325953 335322 332952 318788
11914 318788 312219 322063 351803 339452 297301 263351 290197 333039 335941 316614 328530 293533
11902 293533 300311 300962 307709 322920 335522 350701 323691 327198 300110 284709 265911 274963 286677
11889 286677 300987 283167 246544 262013 279517 276176 260848 256058 241539 239915 263588 288836
11877 288836 271881 262054 294109 290865 281153 271557 278724 297159 289831 277672 285060 277486 258570
11864 258570 238236 257606 276231 323387 315397 302879 311776 293087 265463 231197 211762 234106
11852 234106 237297 253000 300382 284612 292990 306982 329927 330023 319244 301016 287761 298500
11840 298500 292463 264800 298687 300985 312789 346194 347995 325969 296738 300381 287459 264305
$$ packed form
11926D06401k5480M0686k1318j8087L253m4647j8378j1133J4656R369k370j4164
11914C18788o569R844K9740j2351m2151l3950K6846M2842K902j9327J1916l4997
11902B93533O778O51O747J5211J2602J5179k7010L507k7088j5401j8798R052J1714
11889B86677J4310j7820l6623J5469J7504l341j5328m790j4519j624K3673K5248
11877B88836j6955r827L2055l244r712r596P167J8435p328j2159P388p574j8916
11864B58570k0334J9370J8625M7156p990j2518Q897j8689k7624l4266j9435K2344
11852B34106L191J5703M7382j5770Q378J3992K2945R6j0779j8228j3255J0739
11840B98500o037k7663L3887K298J1804L3405J801k2026k9231L643j2922k3154
$$ plain form
11828 264305 251012 267137 319302 351304 351248 302185 249877 219658 196705 175420 189705 229818
11816 229818 250477 256367 275365 315207 342233 344606 330613 319825 338790 365227 378572 418871
11804 418871 469721 538585 610449 704795 823541 946219 1045146 1166400 1249914 1291258 1291139
11793 1291139 1253161 1235166 1168540 1039281 893376 793547 717909 619944 492272 464681 424193
11782 424193 401358 386166 375370 360487 353244 355023 345627 329885 292911 241166 211384 212314
11770 212314 214288 240372 274331 271914 249697 247471 230804 205156 211000 223148 212624 210565
11758 210565 199317 182593 195787 224349 272995 261311 244838 234691 275007 269791 278624 287342
11746 287342 287290 235032 201443 214697 265286 298483 289032 268161 243974 233299 247196 263773
$$ packed form
11828B64305j3293J6125N2165L2002n6m9063n2308l0219k2953k1285J4285M0113
11816B29818K0659N890J8998L9842K7026K373j3993j0788J8965K6437J3345M0299
11804D18871N0850O8864P1864R4346J18746J22678R8927J21254Q3514M1344j19
11793A291139l7978j7995o6626j29259j45905r9829p5638r7965j27672k7591m0488
11782D24193k2835j5192j0796j4883p243J779r396j5742l6974n1745k9782R30
11770B12314J974K6084L3959k417k2217k226j6667k5648N844J2148j0524k059
11758B10565j1248j6724J3194K8562M8646j1684j6473j0147M0316n216Q833Q718
11746B87342n2n2258l3589J3254N0589L3197r451k0871k4187j0675J3897J6577
$$ plain form
11734 263773 279561 244628 185254 178628 199590 211864 225249 184589 179747 182899 193339 215363
11722 215363 224473 222993 249613 266909 269902 295178 308767 290684 282903 241971 263424 312764
11710 312764 311684 297135 318942 299643 286982 247105 269329 282283 255433 239123 198160 191939
11698 191939 230256 238320 274311 271267 213822 179284 200404 243921 253526 266920 224145 222551
11686 222551 207939 201380 232214 226751 196947 192398 197256 166603 180520 191156 239558 224571
11674 224571 228304 246827 241503 262356 253329 246115 278291 251969 223492 194883 200669 221597
11662 221597 178005 170251 188546 234101 263955 264583 229261 234935 226295 248872 273451 309044
11650 309044 287136 220408 195117 195631 184918 227505 275169 299283 269239 253078 247681 242730
$$ packed form
11734B63773J5788l4933n9374o626K0962J2274J3385m0660m842L152J0440K2024
11722B15363R110j480K6620J7296K993K5276J3589j8083p781m0932K1453M9340
11710C12764j080j4549K1807j9299j2661l9877K2224J2954k6850j6310m0963o221
11698A91939L8317Q064L5991l044n7445l4538K1120M3517R605J3394m2775j594
11686B22551j4612o559L0834n463k9804m549M858l0653J3917J0636M8402j4987
11674B24571L733J8523n324K0853r027p214L2176k6322k8477k8609N786K0928
11662B21597m3592p754J8295M5555K9854O28l5322N674q640K2577K4579L5593
11650C09044k1908o6728k5291N14j0713M2587M7664K4114l0044j6161n397m951
$$ plain form
11638 242730 265549 235394 158471 141261 172338 175186 196479 253818 249933 224373 241676 244124
11626 244124 236674 188672 178547 211501 202582 224851 269327 269808 265929 218829 190261 189115 177169
11613 177169 178173 190436 192339 205259 220576 228277 255005 247259 249505 246643 205939 197796 170440
11600 170440 126013 108801 145182 180233 197898 239134 238885 218532 205635 221806 272611 277567
11588 277567 235072 223058 232486 240665 221295 207519 185497 159877 157017 197756 253983 261726
11576 261726 272872 271451 216848 159928 146545 129540 120308 156433 173120 206685 261638 257156
11564 257156 287985 311571 269465 258832 284213 272950 274357 290966 277492 265870 274618 279517
11552 279517 272049 250941 180276 168984 184369 187218 180854 201527 257188 266130 272734 262588
$$ packed form
11638B42730K2819l0155p6923j7210L1077K848K1293N7339l885k5560J7303K448
11626B44124p450m8002j0125L2954q919K2269M4476M81l879m7100k8568j146j1946
11613A77169J004J2263J903J2920J5317P701K6728p746K246k862m0704q143k7356
11600A70440m4427j7212L6381L5051J7665M1236k49k0353j2897J6171N0805M956
11588B77567m2495j2014R428Q179j9370j3776k2022k5620k860M0739N6227P743
11576B61726J1146j421n4603n6920j3383j7005r232L6125J6687L3565N4953m482
11564B57156L0829K3586m2106j0633K5381j1263J407J6609j3474j1622Q748M899
11552B79517p468k1108p0665j1292J5385K849o364K0673N5661Q942O604j0146
$$ plain form
11540 262588 264508 268535 276921 237426 244935 221510 237917 229192 205388 238736 253578 254742 241825
11527 241825 248960 298898 262020 238918 257038 291405 288434 286753 245509 190233 214435 250719
11515 250719 251204 206804 195599 226556 202678 184985 204565 240027 271046 273479 223163 175736
11503 175736 158906 187473 219678 213477 223972 277956 278950 243182 216692 200902 234383 251511
11491 251511 286114 300214 315734 316039 280466 240680 216319 197243 183380 173895 206181 234358
11479 234358 264917 291445 273184 270058 266089 255914 238454 210284 218668 239960 252556 270764
11467 270764 273138 286313 262594 243544 256936 274469 244869 228286 223839 199410 213823 257162
11455 257162 231879 228360 222106 233905 237381 236857 241447 265225 260772 249156 233400 222996 252542
$$ packed form
11540B62588J920M027Q386l9495P509k3425J6407q725k3804L3348J4842J164j2917
11527B41825P135M9938l6878k3102J8120L4367k971j681m1244n5276K4202L6284
11515B50719M85m4400j1205L0957k3878j7693J9580L5462L1019K433n0316m7427
11503A75736j6830K8567L2205o201J0495N3984R94l5768k6490j5790L3481J7128
11491B51511L4603J4100J5520L05l5573l9786k4361j9076j3863r485L2286K8177
11479B34358L0559K6528j8261l126l969j0175j7460k8170Q384K1292J2596J8208
11467B70764K374J3175k3719j9050J3392J7533k9600j6583m447k4429J4413M3339
11455B57162k5283l519o254J1799L476n24M590K3778m453j1616j5756j0404K9546
$$ plain form
11442 252542 261739 221497 235660 267911 285391 283038 284860 264345 266199 261249 265981 240264 225886
11429 225886 208435 221377 235932 224128 217983 273552 313449 301524 307991 288510 273799 292897
11417 292897 316867 331205 324888 303969 312196 329759 329534 334709 320243 336923 326515 330517 335454
11404 335454 324447 319916 293625 270979 236376 209054 224622 252178 270642 254188 242484 230036
11392 230036 232533 238832 273511 254899 234889 273168 310342 309817 272500 273747 257295 271501
11380 271501 300641 291170 313858 343267 304566 280029 270931 267222 261428 284650 303988 311499
11368 311499 318883 357792 338802 341588 346364 350303 347651 315744 338324 370306 386623 405817
11356 405817 466561 500041 554301 624245 661865 614037 514536 487184 483867 432944 406749 382275
$$ packed form
11442B52542R197m0242J4163L2251J7480k353J822k0515J854m950M732k5717j4378
11429B25886j7451J2942J4555j1804o145N5569L9897j1925O467j9481j4711J9098
11417B92897K3970J4338o317k0919Q227J7563k25N175j4466J6680j0408M002M937
11404C35454j1007m531k6291k2646l4603k7322J5568K7556J8464j6454j1704j2448
11392B30036K497O299L4679j8612k0010L8279L7174n25l7317J247j6452J4206
11380B71501K9140r471K2688K9409l8701k4537r098l709n794K3222J9338P511
11368C11499P384L8909j8990K786M776L939k652l1907K2580L1982J6317J9194
11356D05817O0744L3480N4260O9944L7620m7828r9501k7352l317n0923k6195k4474
$$ plain form
11344 382275 365149 375335 414987 416562 399966 385031 402618 446004 462825 440021 416881 444969
11332 444969 498371 525077 535979 602796 678029 733168 740428 673214 634532 638906 662702 702339
11320 702339 725073 839631 921884 974032 1029493 1052504 989096 986878 987018 925550 820226 791252
11308 791252 731530 662367 665982 666792 618619 637861 683206 696218 665668 636647 602297 584292
11296 584292 570063 620113 699941 713543 749089 830703 956648 1047545 1089010 1097638 1064764
11285 1064764 993858 1005932 1021282 985916 964346 924906 908333 917351 907802 909446 888849 870726
11273 870726 862610 836344 848741 838188 851107 846905 847145 830076 837854 851533 823528 829944 889495
11260 889495 880808 916825 938101 912646 892119 907062 939758 1005058 1080672 1130661 1170786 1164096
$$ packed form
11344C82275j7126J0186L9652J575j6596j4935J7587M3386J6821k2804k3140K8088
11332D44969N3402K6706J0902O6817P5233N5139P260o7214l8682M374K3796L9637
11320G02339K2734J14558Q2253N2148N5461K3011o3408k218J40o1468j05324k8974
11308G91252n9722o9163L615Q10m8173J9242M5345J3012l0550k9021l4350j8005
11296E84292j4229N0050P9828J3602L5546Q1614J25945R0897M1465Q628l2874
11285A064764p0906J2074J5350l5366k1570l9440j6573R018r549J644k0597j8123
11273H70726q116k6266J2397j0553J2919m202K40j7069P778J3679k8005O416N9551
11260H89495q687L6017K1276k5455k0527J4943L2696O5300P5614M9989M0125o690
$$ plain form
11248 1164096 1112830 1033633 971993 900699 812460 726243 682800 644814 641682 681934 761417
11237 761417 781213 744623 741892 755424 755600 784255 787224 795792 825749 844882 882159 911366
11225 911366 926969 907211 894626 849165 803104 785441 781035 777885 729005 704510 658266 634987
11213 634987 616228 627273 622320 584606 553588 543727 581128 676653 790439 799179 790991 734148
11201 734148 671758 632475 643649 652027 626455 640545 638978 652877 682279 688844 709183 728192
11189 728192 740004 778637 775099 772727 809143 802267 758076 740591 683968 651728 623903 621225
11177 621225 663075 680961 685520 699367 738521 758875 734869 715366 682982 688023 670417 654307
11165 654307 663958 661826 690569 703651 697849 688390 701065 715633 715885 696732 715094 709882 713796
$$ packed form
11248A164096n1266p9197o1640p1294q8239q6217m3443l7986l132M0252P9483
11237G61417J9796l6590k731J3532J76K8655K969Q568K9957J9133L7277K9207
11225I11366J5603j9758j2585m5461m6061j7663m406l150m8880k4495m6244k3279
11213F34987j8759J1045m953l7714l1018r861L7401R5525J13786Q740q188n6843
11201G34148o2390l9283J1174Q378k5572J4090j567J3899K9402O565K0339J9009
11189G28192J1812L8633l538k372L6416o876m4191j7485n6623l2240k7825k678
11177F21225M1850J7886M559J3847L9154K0354k4006j9503l2384N041j7606j6110
11165F54307R651k132K8743J3082n802r459J2675J4568K52j9153J8362n212L914
$$ plain form
11152 713796 715490 697629 708522 702703 703033 711282 724988 746247 721396 678276 691361 747629
11140 747629 757444 732539 699507 637190 612213 618855 644291 646798 637437 665586 662614 659569 670766
11127 670766 711193 720190 760958 792900 815037 852705 841330 793227 802664 838581 871790 899746
11115 899746 952029 1015297 1083973 1176228 1205769 1163183 1131923 1086959 1067659 1027247 1019096 1032676
11103 1032676 1080417 1109969 1136740 1155774 1173477 1197095 1209491 1219373 1221566 1180953 1121565 1122615
11091 1122615 1116490 1092049 1084052 1025965 1025651 987859 969489 943510 918338 922244 907123 929778
11079 929778 929176 903803 873181 911839 932063 925695 913295 917703 925041 894653 960555 984371
11067 984371 1001682 978425 977340 975517 928634 900895 902564 901873 908715 902522 941427 968442 1012003
$$ packed form
11152G13796J694j7861J0893n819L30Q249J3706K1259k4851m3120J3085N6268
11140G47629R815k4905l3032o2317k4977O642K5436K507r361K8149k972l045J1197
11127F70766M0427Q997M0768L1942K2137L7668j1375m8103R437L5917L3209K7956
11115H99746N2283O3268O8676R2255K9541m2586l1260m4964j9300m0412q151J3580
11103A032676M7741K9552K6771J9034J7703K3618J2396R882K193m0613n9388J050
11091A122615o125k4441p997n8087l14l7792j8370k5979k5172L906j5121K2655
11079I29778o02k5373l0622L8658K0224o368j2400M408P338l0388O5902K3816
11067I84371J7311k3257j085j823m6883k7739J669o91O842o193L8905K7015M3561
$$ plain form
11054 1012003 1005846 939905 913978 914332 916454 962697 991504 1001142 971860 963304 995344 1036043
11042 1036043 1056119 1072838 1066500 1070857 1069005 1067738 1072045 1095699 1174030 1191352 1209422 1205340
11030 1205340 1193494 1172895 1155628 1178964 1150987 1083043 1055390 1104048 1132701 1161469 1200540
11019 1200540 1210997 1232177 1242570 1258500 1247795 1237905 1252059 1289820 1332620 1352677 1371422
11008 1371422 1376841 1349059 1266410 1240099 1239276 1223058 1244481 1244195 1230560 1256733 1298724 1308306
10996 1308306 1334870 1356427 1403994 1475859 1472040 1520741 1561318 1553411 1622009 1647134 1656722 1656891
10984 1656891 1685401 1707631 1699334 1706580 1737282 1722774 1689251 1716143 1729421 1786188 1822764 1864999
10972 1864999 1852546 1827499 1855145 1903489 1953726 1992065 2086773 2175335 2276852 2400626 2547169
$$ packed form
11054A012003o157o5941k5927L54K122M6243K8807R638k9282q556L2040M0699
11042A036043K0076J6719o338M357j852j267M307K3654P8331J7322J8070m082
11030A205340j1846k0599j7267K3336k7977o7944k7653M8658K8653K8768L9071
11019A200540J0457K1180J0393J5930j0705r890J4154L7761M2800K0057J8745
11008A371422N419k7782q2649k6311q23j6218K1423k86j3635K6173M1991R582
10996A308306K6564K1557M7567P1865l819M8701M0577p907O8598K5125R588J69
10984A656891K8510K2230q297P246L0702j4508l3523K6892J3278N6767L6576M2235
10972A864999j2453k5047K7646M8344N0237L8339R4708Q8562J01517J23774J46543
$$ plain form
10961 2547169 2677562 2814767 3012017 3279517 3587230 3943615 4229320 4532456 4863482
10952 4863482 5198513 5610513 6226825 7054404 8043725 9291433 10924419 13179406 16309004
10943 16309004 20765154 27059545 35318603 44920311 54177646 60892585 63238061 60590881
10935 60590881 53927634 45062282 36008407 28334940 22711992 18869823 16399410 14851323
10927 14851323 13904719 13407322 13237136 13321817 13623007 14068311 14555770 14971717 15341646
10918 15341646 15746405 16259669 17032135 18231913 20056637 22665627 26272219 30948754
10910 30948754 36595868 43139920 50470686 58581950 67612740 77715099 88578846 99098096
10902 99098096 107889037 113642960 115540626 113479786 108008327 100192250 91562260 83353801
$$ packed form
10961B547169J30393J37205J97250K67500L07713L56385K85705L03136L31026
10952D863482L35031M12000O16312Q27579R89321J247708J632986K254987L129598
10943A6309004M456150O294391Q259058R601708R257335O714939K345476k647180
10935F0590881o663247q865352r053875p673467n622948l842169k470413j548087
10927A4851323r46604m97397j70186Q4681L01190M45304M87459M15947L69929
10918A5341646M04759N13264P72466J199778J824724K608990L606592M676535
10910C0948754N647114O544052P330766Q111264R030790J0102359J0863747J0519250
10902I9098096Q790941N753923J897666k060840n471459p816077q629990q208459
$$ plain form
10894 83353801 76288467 70694379 66650938 63801592 61471829 59222038 56861324 54362262
10886 54362262 51752811 49492191 48029161 47479853 47549749 47786915 47818284 47289770 46169370
10877 46169370 44958128 44270820 44563529 45731093 47226488 48475284 49016169 48884923 48370523
10868 48370523 48121147 49026372 52140726 58089199 66661668 76417588 85161295 91060916
10860 91060916 93196175 91793766 88016166 83660113 80242273 78247167 77133131 76226439
10852 76226439 75844090 77003475 80989552 88513051 98761645 109263658 117049609 120226800
10844 120226800 118694593 113132606 104729657 95589545 88203796 83628749 80764137 77534239
10836 77534239 72805208 66692848 59613209 51978500 44575026 38175630 33098868 29142708
$$ packed form
10894H3353801p065334n594088m043441k849346k329763k249791k360714k499062
10886E4362262k609451k260620j463030n49308O9896K37166L1369n28514j120400
10877D6169370j211242o87308K92709J167564J495395J248796N40885j31246n14400
10868D8370523k49376R05225L114354N948473Q572469R755920Q743707N899621
10860I1060916K135259j402409l777600m356053l417840j995106j114036r06692
10852G6226439l82349J159385L986077P523499J0248594J0502013P785951L177191
10844A20226800j532207n561987q402949r140112p385749m575047k864612l229898
10836G7534239m729031o112360p079639p634709p403474o399396n076762l956160
$$ plain form
10828 29142708 26122803 23912862 22446148 21665491 21587550 22219899 23498567 25446409 28180019
10819 28180019 31872463 36529090 41696759 46919742 51871672 56548452 61228862 65853706
10811 65853706 70122564 73229708 74119905 72418615 68561032 63607045 58604790 54175749
10803 54175749 50337906 46786061 43173143 39331136 35239691 31005996 27008677 23614313
10795 23614313 20929128 18824241 17234899 16111303 15437527 15131748 15163180 15546544 16244103
10786 16244103 17127610 18080142 18953488 19669087 20303754 21082544 22355861 24505664 27844565
10777 27844565 32878580 40151813 49526740 59981603 69413069 75542690 76835672 72998859
10769 72998859 65329291 56124905 47871213 42190329 39534256 39639233 42253787 46876288
$$ packed form
10828B9142708l019905k209941j466714p80657p7941O32349J278668J947842K733610
10819B8180019L692444M656627N167669N222983M951930M676780M680410M624844
10811F5853706M268858L107144Q90197j701290l857583m953987n002255m429041
10803E4175749l837843l551845l612918l842007m091445m233695l997319l394364
10795B3614313k685185k104887j589342j123596o73776l05779L1432L83364O97559
10786A6244103Q83507R52532Q73346P15599O34667P78790J273317K149803L338901
10777B7844565N034015P273233R374927J0454863R431466O129621J292982l836813
10769G2998859p669568r204386q253692n680884k656073J04977K614554M622501
$$ plain form
10761 46876288 52583418 58177468 62694182 65804976 67533683 68008571 67658248 67219056
10753 67219056 66762984 65449177 62930637 59564014 55905011 52453324 49911670 48953424
10745 48953424 49775888 51689079 53403475 53704515 51983265 48310130 43355315 38099922
10737 38099922 33160078 28893901 25597880 23301467 21886596 21127710 21090771 21737077 23039541
10728 23039541 25131397 27805010 30741756 33419344 35219534 35841138 35319115 34134498
10720 34134498 32998176 32581465 33150831 34433957 35864725 36862556 37182535 36946694 36475167
10711 36475167 36268151 36530211 37240668 37928987 37888726 36742349 34518958 31573897 28424456
10702 28424456 25686906 23806772 23055752 23416433 24733360 26653901 28595456 29955296
$$ packed form
10761D6876288N707130N594050M516714L110794J728707M74888l50323m39192
10753F7219056m56072j313807k518540l366623l659003l451687k541654r58246
10745D8953424Q22464J913191J714396L01040j721250l673135m954815n255393
10737C8099922m939844m266177l296021k296413j414871p58886l6939O46306J302464
10728B3039541K091856K673613K936746K677588J800190O21604n22023j184617
10720C4134498j136322m16711N69366J283126J430768R97831L19979k35841m71527
10711C6475167k07016K62060P10457O88319m0261j146377k223391k945061l149441
10702B8424456k737550j880134p51020L60681J316927J920541J941555J359840
$$ plain form
10694 29955296 30383071 30021536 29262818 28505769 27975178 27652568 27255894 26231786 24162690
10685 24162690 21134374 17780144 14801465 12467303 10680013 9374508 8380136 7637494
10677 7637494 7017970 6553225 6138261 5773033 5439443 5092452 4701229 4346341 4040798
10668 4040798 3737423 3414595 3122259 2878382 2656048 2498668 2349184 2290890 2273512 2251934
10658 2251934 2236784 2256521 2235695 2208457 2179034 2121978 2016817 1943647 1875553 1843686 1841414
10647 1841414 1887374 1981346 2059363 2163037 2293936 2454190 2611320 2806378 3021621 3184637
10637 3184637 3287819 3287286 3195016 2990284 2705504 2412264 2115556 1859138 1635977 1495999
10627 1495999 1442510 1437648 1388721 1286898 1177678 1119009 1044962 983795 930483 897307 883954
$$ packed form
10694B9955296M27775l61535p58718p57049n30591l22610l96674j024108k069096
10685B4162690l028316l354230k978679k334162j787290j305505r94372p42642
10677G637494o19524m64745m14964l65228l33590l46991l91223l54888l05543
10668D040798l03375l22828k92336k43877k22334j57380j49484n8294j7378k1578
10658B251934j5150J9737k0826k7238k9423n7056j05161p3170o8094l1867k272
10647A841414M5960R3972P8017J03674J30899J60254J57130J95058K15243J63016
10637C184637J03182n33r2270k04732k84780k93240k96708k56418k23161j39978
10627A495999n3489m862m8927j01823j09220n8669p4047o1167n3312l3176j3353
$$ plain form
10616 883954 912052 1005536 1103044 1190560 1246991 1288718 1340730 1442332 1576886 1723293 1868515
10605 1868515 1972448 1951402 1813893 1598980 1373604 1165040 1030864 986018 927659 908381
10595 908381 922687 910204 899605 926189 939291 888914 794810 671535 615240 582969 583879 601379
10583 601379 589863 555078 505902 513308 503802 455010 470017 464044 419770 378385 379076 403753
10571 403753 469083 500636 498236 461544 443180 431674 443886 461002 447348 434687 428674 406358
10559 406358 408912 486026 516266 554413 584671 572622 563203 553526 593614 602884 606269 604467 590929
10546 590929 557183 519799 513733 505620 478795 475358 515272 557102 540881 511744 497714 524921
10534 524921 529934 525343 523462 513930 540673 545376 545174 535895 532416 588823 618547 632879 655373
$$ packed form
10616H83954K8098R3484R7508Q7516N6431M1727N2012J01602J34554J46407J45222
10605A868515J03933k1046j37509k14913k25376k08564j34176m4846n8359j9278
10595I08381J4306j2483j0599K6584J3102n0377r4104j23275n6295l2271R10J7500
10583F01379j1516l4785m9176P406r506m8792J5007n973m4274m1385O91K4677
10571D03753O5330L1553k400l6692j8364j1506J2212J7116j3654j2661o013k2316
10559D06358K554P7114L0240L8147L0258j2049r419r677M0088R270L385j802j3538
10546E90929l3746l7384o066q113k6825l437L9914M1830j6221k9137j4030K7207
10534E24921N013m591j881r532K6743M703k02r279l479N6407K9724J4332K2494
$$ plain form
10521 655373 672618 720081 752926 746231 777140 823156 849078 845757 821642 805006 773659 776392
10509 776392 760253 723958 702527 703725 663045 648901 630524 585756 612538 620969 623221 633641
10497 633641 646929 649735 639310 636468 658770 631457 647798 684712 736096 786695 838925 924725
10485 924725 1026072 1145062 1247582 1324961 1401471 1440577 1500611 1581834 1598068 1585301 1595430
10474 1595430 1579729 1525347 1523672 1565577 1607150 1668498 1770282 1760912 1601499 1391531 1151287
10463 1151287 927814 749120 677771 668447 650874 593912 575292 618985 693919 712524 747339
10452 747339 783899 804939 866281 880679 912014 960906 1013717 1144618 1306549 1497258 1740357
10441 1740357 1952793 1987022 1818234 1607760 1472673 1351689 1266380 1189790 1154647 1163567
$$ packed form
10521F55373J7245M7463L2845o695L0909M6016K5922l321k4115j6636l1347K733
10509G76392j6139l6295k1431J198m0680j4144j8377m4768K6782Q431K252J0420
10497F33641J3288K806j0425k842K2302k7313J6341L6914N1384N0599N2230Q5800
10485I24725J01347J18990J02520P7379P6510L9106O0034Q1223J6234j2767J0129
10474A595430j5701n4382j675M1905M1573O1348J01784r370j59413k09968k40244
10463A151287k23473j78694p1349r324j7573n6962j8620M3693P4934J8605L4815
10452G47339L6560K1040O1342J4398L1335M8892N2811J30901J61931J90709K43099
10441A740357K12436L4229j68788k10474j35087j20984q5309p6590l5143Q920
$$ plain form
10431 1163567 1150818 1135158 1160913 1149774 1177753 1209755 1213950 1226904 1301347 1322535 1309009
10420 1309009 1289545 1285060 1301378 1289955 1273113 1286441 1310367 1312704 1305187 1331099 1356242 1347499
10408 1347499 1352213 1435523 1445858 1446732 1423532 1447816 1499065 1507410 1539387 1610054 1709376 1813965
10396 1813965 1906214 2013709 2122703 2246602 2363523 2481088 2599940 2769596 3004736 3303103
10386 3303103 3636539 4080656 4676718 5254596 5384027 5048533 4777775 4730800 4981542 5518166
10376 5518166 6460921 8027113 10399219 13415280 15573165 14814903 12074055 9667488
10368 9667488 8322048 7743778 7676092 7874219 8175167 8562220 9072468 9817454 10785831
10359 10785831 12015878 13526735 15527898 17948741 20234509 21764626 22862374 24306970
$$ packed form
10431A163567j2749j5660K5755j1139K7979L2002M195J2954P4443K1188j3526
10420A309009j9464m485J6318j1423j6842J3328K3926K337p517K5912K5143q743
10408A347499M714Q3310J0335Q74k3200K4284N1249Q345L1977P0667R9322J04589
10396A813965R2249J07495J08994J23899J16921J17565J18852J69656K35140K98367
10386C303103L33436M44117N96062N77878J29431l35494k70758m6975K50742N36624
10376E518166R42755J566192K372106L016061K157885p58262k740848k406567
10368I667488j345440n78270o7686J98127L00948L87053N10248P44986R68377
10359A0785831J230047J510857K001163K420843K285768J530117J097748J444596
$$ plain form
10351 24306970 26768944 30538420 35802598 42796284 52105955 64984777 83818296 112363842
10343 112363842 156272272 222387746 316340887 434315741 534705864 536957046 430532733
10336 430532733 301798918 205711971 143645069 103914614 77773058 60027979 47673341
10329 47673341 38974988 32899833 28547315 25375213 23148218 21766269 21110701 20466600
10321 20466600 18816001 16243201 13627714 11446391 9853667 8699657 7808173 7089054
10313 7089054 6493247 6032219 5628194 5235631 4937206 4711700 4478161 4181793 3888594
10304 3888594 3658393 3477195 3296429 3067904 2831306 2651985 2535584 2432506 2295780
10295 2295780 2155129 2095901 2003302 1905191 1868481 1836924 1755397 1719212 1670323 1587278 1488361
$$ packed form
10351B4306970K461974L769476N264178O993686R309671J2878822J8833519K8545546
10343A12363842M3908430O6115474R3953141J17974854J00390123K251182j06424313
10336D30532733j28733815r6086947o2066902l9730455k6141556j7745079j2354638
10329D7673341q698353o075155m352518l172102k226995j381949o55568o44101
10321B0466600j650599k572800k615487k181323j592724j154010q91484p19119
10313G089054n95807m61028m04025l92563k98425k25506k33539k96368k93199
10304C888594k30201j81198j80766k28525k36598j79321j16401j03078j36726
10295B295780j40651n9228r2599r8111l6710l1557q1527l6185m8889q3045r8917
$$ plain form
10284 1488361 1396336 1367765 1334718 1314368 1320191 1346328 1361238 1336472 1308030 1295983 1255081
10273 1255081 1204792 1141111 1078281 991165 925896 938745 945888 970019 961858 883566 803891 815935
10261 815935 790212 743654 726138 701275 677313 684005 683306 670118 691305 743318 735180 719726
10249 719726 707402 669325 670530 672988 644471 587253 558871 519580 530757 553145 585957 568669
10237 568669 548608 583178 605695 612710 626865 621299 671884 654571 613250 607867 605701 622919
10225 622919 641349 678629 682813 746555 822112 836450 890903 946490 972658 1007507 1003570 967069
10213 967069 841635 640582 491037 415401 401055 451916 485755 527690 573399 613516 623058
10202 623058 655605 733536 798324 926386 1135228 1466569 1837995 2144325 2508798 2989917
$$ packed form
10284A488361r2025k8571l3047k0350N823K6137J4910k4766k8442j2047m0902
10273A255081n0289o3681o2830q7116o5269J2849P143K4131q161p8292p9675J2044
10261H15935k5723m6558j7516k4863k3962O692o99j3188K1187N2013q138j5454
10249G19726j2324l8077J205K458k8517n7218k8382l9291J1177K2388L2812j7288
10237E68669k0061L4570K2517P015J4155n566N0585j7313m1321n383k166J7218
10225F22919J8430L7280M184O3742P5557J4338N4453N5587K6168L4849l937l6501
10213I67069j25434k01053j49545p5636j4346N0861L3839M1935M5709M0117R542
10202F23058L2547P7931O4788J28062K08842L31341L71426L06330L64473M81119
$$ plain form
10192 2989917 3451257 3729952 3892988 3997996 4032157 3935771 3702976 3460876 3349578 3469211
10182 3469211 3876019 4525468 5137436 5060031 4144811 3083716 2296407 1769927 1459691
10173 1459691 1236845 1064088 918630 786812 690976 617273 596871 558489 524915 526167 559663
10162 559663 525281 488717 475573 484416 488128 461771 450900 419670 365381 348776 363400 384137
10150 384137 427671 441336 452890 457879 425360 386067 383986 403995 423772 435461 426130 454596
10138 454596 439907 439580 466160 485354 454695 455147 480734 502958 484995 478578 493127 486656 499984
10125 499984 472419 451411 430453 457662 501237 504016 492125 533568 533052 510698 512499 550518
10113 550518 577742 560244 535774 551958 528751 542683 533398 560862 608339 627167 657707 637456
$$ packed form
10192B989917M61340K78695J63036J05008L4161r6386k32795k42100j11298J19633
10182C469211M06808O49449O11968p7405r15220j061095p87309n26480l10236
10173A459691k22846j72757j45458j31818r5836p3703k0402l8382l3574J252L3496
10162E59663l4382l6564j3144Q843L712k6357j0871l1230n4289j6605J4624K0737
10150C84137M3534J3665J1554M989l2519l9293k081K0009J9777J1689r331K8466
10138D54596j4689l27K6580J9194l0659M52K5587K2224j7963o417J4549o471J3328
10125D99984k7565k1008k0958K7209M3575K779j1891M1443n16k2354J801L8019
10113E50518K7224j7498k4470J6184k3207J3932r285K7464M7477J8828L0540k0251
$$ plain form
10101 637456 607666 585175 599302 639521 714482 850427 974213 1130661 1313352 1540243
10091 1540243 1659254 1613167 1400311 1185851 1046322 972689 917200 917402 911861 878951 816743
10080 816743 731443 691673 647978 582439 589571 602718 584153 592906 581014 607941 637954 631363
10068 631363 632869 627298 608160 620935 657040 663508 698619 720951 786398 773066 739165 766493
10056 766493 800776 845193 911960 952453 993667 1082886 1125061 1162278 1344044 1733210 2389767
10045 2389767 3140941 2963975 2027818 1418670 1138877 1012315 869079 755992 748886 778823
10035 778823 762784 751041 750334 763247 817848 818707 783093 768501 761862 749676 721524 735547
10023 735547 751896 769057 752380 753192 756809 740693 757502 756619 765618 785977 790103 794477 785162
$$ packed form
10101F37456k9790k2491J4127M0219P4961J35945J23786J56448J82691K26891
10091A540243J19011m6087k12856k14460j39529p3633n5489K02n541l2910o2208
10080H16743q5300l9770m3695o5539P132J3147j8565Q753j1892K6927L0013o591
10068F31363J506n571j9138J2775L6105O468L5111K2332O5447j3332l3901K7328
10056G66493L4283M4417O6767M0493M1214Q9219M2175L7217J81766L89166O56557
10045B389767P51174j76966r36157o09148k79793j26562j43236j13087p106K9937
10035G78823j6039j1743p07J2913N4601Q59l5614j4592o639j2186k8152J4023
10023G35547J6349J7161j6677Q12L617j6116J6809q83Q999K0359M126M374r315
$$ plain form
10010 785162 768859 793259 793410 760318 756401 755938 792041 811425 817343 799172 769108 777297 791290
9997 791290 787866 803451 837397 836984 824261 836133 887913 907066 890499 918178 903079 884090
9985 884090 903284 937567 936876 880026 857719 863209 845626 897472 919690 940156 966762 983736
9973 983736 995065 1010282 1030436 1053941 1049191 1016528 1009742 1035971 1040441 1052141 1066988 1112169
9961 1112169 1152353 1139912 1183340 1243932 1284628 1304891 1301940 1343680 1378142 1410380 1495007 1560980
9949 1560980 1664512 1788780 1949909 2189879 2511327 3001034 3750356 5026057 6821121
9940 6821121 8725999 10369700 11618431 11443646 10138032 8868238 7568172 6967084 7560335
9931 7560335 9313266 11723424 13865365 14567735 12972908 10217111 7437010 5332385
$$ packed form
10010G85162j6303K4400J51l3092l917m63L6103J9384N918j8171l0064Q189J3993
9997G91290l424J5585L3946m13j2723J1872N1780J9153j6567K7679j5099j8989
9985H84090J9194L4283o91n6850k2307N490j7583N1846K2218K0466K6606J6974
9973I83736J1329J5217K0154K3505m750l2663o786K6229M470J1700J4847M5181
9961A112169M0184j2441M3428O0592M0696K0263k951M1740L4462L2238Q4627O5973
9949A560980J03532J24268J61129K39970L21448M89707P49322J275701J795064
9940F821121J904878J643701J248731j74785j305614j269794j300066o01088N93251
9931G560335J752931K410158K141941P02370j594827k755797k780101k104625
$$ plain form
9923 5332385 4092396 3369589 2967061 2817364 2916967 3116264 3450095 3827871 4062937 3861821
9913 3861821 3317088 2783676 2344767 2062989 1857411 1671885 1548481 1477593 1416382 1370682
9903 1370682 1350881 1319112 1323648 1341235 1337762 1320476 1300280 1291142 1268985 1295050 1293462 1263288
9891 1263288 1262179 1264299 1241726 1197849 1164276 1079851 1037086 1028497 1002480 978653 970066 985203
9879 985203 983628 941412 931369 975342 995990 991534 965046 969715 986164 998837 1039158 1059705
9867 1059705 1100349 1074597 1009914 963025 993156 999892 984251 959197 1001237 1060483 1103329 1147927
9855 1147927 1167987 1165564 1095008 1066750 1040679 978087 967080 966631 923111 917617 926009 908357
9843 908357 887286 888620 863482 849115 866173 874383 865123 875268 881335 868042 877491 877944 865795
$$ packed form
9923E332385j239989p22807m02528j49697R9603J99297L33831L77776K35066k01116
9913C861821n44733n33412m38909k81778k05578j85526j23404p0888o1211m5700
9903A370682j9801l1769M536J7587l473j7286k0196r138k2157K6065j588l0174
9891A263288j109K120k2573m3877l3573q4425m2765q589k6017k3827q587J5137
9879I85203j575m2216j0043M3973K0648m456k6488M669J6449J2673M0321K0547
9867A059705M0644k5752o4683m6889L0131O736j5641k5054M2040N9246M2846M4598
9855A147927K0060k423p0556k8258k6071o2592j1007m49m3520n494Q392j7652
9843I08357k1071J334k5138j4367J7058Q210r260J0145O067j3293R449M53j2149
$$ plain form
9830 865795 832701 857633 873214 882636 920207 915802 910876 924668 926272 906035 890669 928489
9818 928489 965972 967580 941971 951354 955281 954190 945877 907049 860087 825471 800544 801051 819594
9805 819594 808267 854287 851279 812610 805890 773041 774918 785253 801862 821863 825782 824771 835118
9792 835118 852020 864961 853975 843034 844001 786834 697149 687691 699499 714153 725382 749435
9780 749435 807041 804019 815171 831120 859967 945682 1158924 1440409 1828939 2128048 1899731
9769 1899731 1427548 1102794 914890 846072 752095 634936 596922 616781 623398 608669 602821
9758 602821 607759 643038 661068 655862 629556 636628 670727 693785 709994 694394 734163 767280
9746 767280 780250 825857 912163 1042299 1145676 1207340 1205871 1112699 1044596 1037247 1006915 985874
$$ packed form
9830H65795l3094K4932J5581R422L7571m405m926J3792J604k0237j5366L7820
9818I28489L7483J608k5609R383L927j091q313l8828m6962l4616k4927N07J8543
9805H19594j1327M6020l008l8669o720l2849J877J0335J6609K0001L919j011J0347
9792H35118J6902J2941j0986j0941R67n7167q9685r458J1808J4654J1229K4053
9780G49435N7606l022J1152J5949K8847Q5715K13242K81485L88530K99109k28317
9769A899731m72183l24754j87904o8818r3977j17159l8014J9859O617j4729n848
9758F02821M938L5279J8030n206k6306P072L4099K3058J6209j5600L9769L3117
9746G67280J2970M5607Q6306J30136J03377O1664j469r3172o8103p349l0332k1041
$$ plain form
9734 985874 955813 921827 898121 890312 932653 893053 872092 880879 910407 935426 935229 960805
9722 960805 970472 982598 1017226 1050523 1067449 1014272 952697 929788 926434 894069 868057 891037
9710 891037 923086 949559 1028715 1099431 1126877 1199901 1270932 1275043 1283899 1363226 1392563 1352808
9698 1352808 1295726 1194198 1097799 1022179 974277 951796 932712 892406 850100 842687 825865
9687 825865 778782 773478 792830 793777 856341 973383 1052645 1054595 1039735 1002917 1002052 1024201 1112382
9674 1112382 1256425 1374746 1476875 1551227 1552034 1556823 1581007 1593856 1647736 1739904 1868227
9663 1868227 1967127 2043826 2059884 1943262 1738809 1607786 1516616 1472860 1454195 1493361 1512943
9652 1512943 1457522 1375109 1331646 1319867 1274767 1228634 1185522 1157850 1162338 1200115 1268358 1361242
$$ packed form
9734I85874l0061l3986k3706p809M2341l9600k0961Q787K9528K5019j97K5576
9722I60805R667J2126L4628L3297J6926n3177o1575k2909l354l2365k6012K2980
9710H91037L2049K6473P9156P0716K7446P3024P1031M111Q856P9327K9337l9755
9698A352808n7082j01528r6399p5620m7902k2481j9084m0306m2306p413j6822
9687H25865m7083n304J9352R47O2564J17042P9262J950j4860l6818q65K2149Q8181
9674A112382J44043J18321J02129P4352Q07M789K4184J2849N3880R2168J28323
9663A868227R8900P6699J6058j16622k04453j31023r1170m3756j8665L9166J9582
9652A512943n5421q2413m3463j1779m5100m6133m3112k7672M488L7777O8243R2884
$$ plain form
9640 1361242 1424807 1471712 1453705 1470106 1495619 1525283 1548284 1545880 1622611 1716157 1798636 1879111
9628 1879111 1877413 1784778 1688814 1630955 1592569 1612350 1592217 1502948 1361882 1292119 1238352
9617 1238352 1254744 1285729 1258007 1190776 1104342 1053629 996428 963506 918631 875497 879245 912195
9605 912195 940666 996957 1083610 1187331 1236001 1258287 1244921 1204438 1199489 1237764 1330986 1452254
9593 1452254 1623293 1792424 1841322 1769232 1651382 1553570 1491997 1450300 1505271 1568431 1614184
9582 1614184 1631055 1535695 1377588 1266966 1237744 1212737 1223475 1264177 1269279 1215618 1182127
9571 1182127 1146495 1148128 1181833 1230130 1272414 1312016 1347704 1374428 1414347 1541183 1643752
9560 1643752 1719903 1852796 1931385 1954237 1995271 2108523 2230220 2463191 2732187 2969054
$$ packed form
9640A361242O3565M6905j8007J6401K5513K9664K3001k404P6731R3546Q2479Q0475
9628A879111j698r2635r5964n7859l8386J9781k0133q9269j41066o9763n3767
9617A238352J6392L0985k7722o7231q6434n0713n7201l2922m4875m3134L748L2950
9605I12195K8471N6291Q6653J03721M8670K2286j3366m0483m949L8275R3222J21268
9593A452254J71039J69131M8898p2090j17850r7812o1573m1697N4971O3160M5753
9582A614184J6871r5360j58107j10622k9222k5007J0738M0702N102n3661l3491
9571A182127l5632J633L3705M8297M2284L9602L5688K6724L9919J26836J02569
9560A643752P6151J32893P8589K2852M1034J13252J21697K32971K68996K36867
$$ plain form
9550 2969054 3240314 3522984 3908700 4400267 4999494 5839355 7016316 8643709 10853023
9541 10853023 13689568 16711435 19063301 19714919 18280273 15414805 12396783 9985597
9533 9985597 8283846 7164384 6504561 6172910 6058261 6165064 6479348 6849140 7196751
9524 7196751 7397769 7459257 7433626 7201126 6897836 6628228 6555168 6717680 7084724 7762784
9514 7762784 8833164 10317822 12255343 14630644 17290837 19896537 22214828 24484019
9506 24484019 26731938 28764906 30909481 33800135 37310344 40314561 41510792 40518536
9498 40518536 38330062 36154719 34193852 31763321 28555552 24907592 21408943 18518369
9490 18518369 16381944 14843688 13663178 12694011 11940839 11488861 11446565 11820225 12665913
$$ packed form
9550B969054K71260K82670L85716M91567N99227Q39861J176961J627393K209314
9541A0853023K836545L021867K351866O51618j434646k865468l018022k411186
9533I985597j701751j119462o59823l31651j14649J06803L14284L69792L47611
9524G196751K01018O1488k5631k32500l03290k69608p3060J62512L67044O78060
9514G762784J070380J484658J937521K375301K660193K605700K318291K269191
9506B4484019K247919K032968K144575K890654L510209L004217J196231r92256
9498D0518536k188474k175343j960867k430531l207769l647960l498649k890574
9490A8518369k136425j538256j180510r69167p53172m51978m2296L73660Q45688
$$ plain form
9481 12665913 13903175 15404103 17018384 18791352 20890257 23179510 24873919 24992256
9473 24992256 23761045 22649761 22614112 23929689 26804163 31561596 38334107 46829325
9465 46829325 55624804 62141065 64160806 61177337 54354665 45939560 38137216 32135975
9457 32135975 28219129 26165696 25482226 25229441 24484079 23131666 21482779 19716876 17875303
9448 17875303 15941003 14112480 12580745 11513341 10854002 10554362 10654921 11122452 12051458
9439 12051458 13345207 14993546 16896486 19113058 21581892 24059669 26008118 26765046
9431 26765046 26531318 26432471 27422125 29400847 31662017 33345112 33932199 33528047 32306748
9422 32306748 30470736 28004557 25061277 22175859 19547675 16771802 13840481 11247365
$$ packed form
9481A2665913J237262J500928J614281J772968K098905K289253J694409J18337
9473B4992256j231211j111284l5649J315577K874474M757433O772511Q495218
9465D6829325Q795479O516261K019741k983469o822672q415105p802344o001241
9457C2135975l916846k053433o83470k52785p45362j352413j648887j765903j841573
9448A7875303j934300j828523j531735j067404o59339k99640J00559M67531R29006
9439A2051458J293749J648339J902940K216572K468834K477777J948449P56928
9431B6765046k33728r8847R89654J978722K261170J683095N87087m04152j221299
9422C2306748j836012k466179k943280k885418k628184k775873k931321k593116
$$ plain form
9414 11247365 9301194 7949664 7002167 6361686 5935030 5693243 5644532 5743764 5921115
9405 5921115 6037222 6017208 5894139 5689539 5487560 5175486 4881661 4723822 4732390 4909425
9395 4909425 5274586 5968026 7052406 8549579 10506266 12695299 14633044 15461114 14654500
9386 14654500 12507432 9865527 7497132 5705658 4435034 3519055 2894099 2458978 2145207
9377 2145207 1905609 1675575 1492441 1358197 1193861 1087732 988135 918360 821612 761036
9367 761036 688770 660944 590822 558277 548844 515490 487123 472252 437550 418670 397722 374168
9355 374168 379895 356960 333340 361952 363771 311344 299564 346506 350823 286999 268287 285387
9343 285387 278674 260756 265252 250728 186702 174270 181230 169406 161883 176855 167404 147476 131899
$$ packed form
9414A1247365j946171j351530r47497o40481m26656k41787m8711R9232J77351
9405E921115J16107k0014j23069k04600k01979l12074k93825j57839Q568J77035
9395D909425L65161O93440J084380J497173J956687K189033J937745Q28070q06614
9386A4654500k147068k641905k368395j791474j270624r15979o24956m35121l13771
9377B145207k39598k30034j83134j34244j64336j06129r9597o9775r6748o0576
9367G61036p2266k7826p0122l2545r433l3354k8367j4871l4702j8880k0948k3554
9355C74168N727k2935k3620K8612J819n2427j1780M6942M317o3824j8712J7100
9343B85387o713j7918M496j4524o4026j2432O960j1824p523J4972r451j9928j5577
$$ plain form
9330 131899 161362 166762 198321 168733 136736 111137 74324 75059 119168 163848 146894 135705
9318 135705 130170 158778 174813 168242 173281 165158 140135 133254 154686 172373 151955 155675 144464
9305 144464 138964 117061 119179 106398 75924 72887 90147 112423 113070 85263 67230 94803 137988
9292 137988 129562 131015 106962 127137 143019 85367 62209 68015 62336 35053 54643 88126
9280 88126 90918 89194 110444 112532 108733 96970 76561 91801 77769 49811 50424 40012 37689
9267 37689 91622 93437 88110 97397 92435 65877 33083 50474 63509 56917 34874 15494 40010
9254 40010 77197 86599 101460 112081 99048 60468 31222 31174 67830 92873 56142 55295 76746
9241 76746 58989 59337 43526 27467 4443 -12278 847 31019 827 -17828 21121 45082
$$ packed form
9330A31899K9463N400L1559k9588l1997k5599l6813P35M4109M4680j6954j1189
9318A35705n535K8608J6035o571N039q123k5023o881K1432J7687k0418L720j1211
9305A44464n500k1903K118j2781l0474l037J7260K2276O47k7807j8033K7573M3185
9292A37988q426J453k4053K0175J5882n7652k3158N806n679k7283J9590L3483
9280H8126K792j724K1250K088l799j1763k0409J5240j4032k7958O13j0412k323
9267C7689N3933J815n327R287m962k6558l2794J7391J3035o592k2043j9380K4516
9254D0010L7187R402J4861J0621j3033l8580k9246m8L6656K5043l6731q47K1451
9241G6746j7757L48j5811j6059k3024j6721J3125L0172l0192j8655L8949K3961
$$ plain form
9229 45082 67158 67084 13655 1861 -24993 -46527 -56131 -31694 -8184 7654 22850 -1213 -29663
9216 -29663 -32897 -11105 10202 26584 63156 75282 22542 -6996 -29975 -62455 -76634 -89862
9204 -89862 -56599 -17992 964 -7757 10971 40233 48262 9392 -6567 -26053 -29628 -16713
9192 -16713 -20220 -8511 20354 31447 51920 45603 29958 -13826 -40370 -9184 9457 13251
9180 13251 901 -3113 44880 45199 -10362 -29565 -13624 -22114 -15208 -42256 -87564 -97582 -94450
9167 -94450 -41066 -27160 -21275 -25078 -46618 -85615 -84052 -33159 -3496 -8661 -51150 -43769 -25872
9154 -25872 -39551 16072 43137 30450 -6606 -17833 334 -12264 -25561 36978 38051 41768
9142 41768 39027 19255 3796 -214 47898 95663 113939 118127 94621 61871 42894 41312 51676
$$ packed form
9229D5082K2076p4n3429j1794k6854k1534r604K4437K3510J5838J5196k4063k8450
9216b9663l234K1792K1307J6382L6572J2126n2740k9538k2979l2480j4179j3228
9204h9862L3263L8607J8956q721J8728K9262Q029l8870j5959j9486l575J2915
9192a6713l507J1709K8865J1093K0473o317j5645m3784k6544L1186J8641L794
9180A3251j2350m014M7993L19n5561j9203J5941q490O906k7048m5308j0018L132
9167i4450N3384J3906N885l803k1540l8997J563N0893K9663n165m2489P381J7897
9154b5872j3679N5623K7065j2687l7056j1227J8167j2598j3297O2539J073L717
9142D1768k741j9772j5459m010M8112M7765J8276M188k3506l2750j8977j582J0364
$$ plain form
9129 51676 15457 20829 56363 63958 71540 40101 -2717 -9959 -20792 -7949 -7192 -23633 -41343
9116 -41343 -33029 -8910 5259 11006 50162 76824 104260 102045 121430 121365 140387 154392 185820
9103 185820 213762 210428 199801 162723 147373 164832 154168 138403 95792 64755 42579 49738
9091 49738 57670 112321 108590 82619 64512 19858 3394 73492 105471 46855 9972 48978
9079 48978 73433 84057 126180 137422 130020 106024 104311 143061 133645 108434 168804 232508
9067 232508 270767 312145 358325 327447 306235 310178 276207 246906 216869 178255 144589 128719
9055 128719 117335 80064 81274 76503 88981 62842 34438 12780 9298 47141 57668 47590
9043 47590 50918 80726 92173 69928 30021 49293 46337 42103 69790 110811 126127 111522
$$ packed form
9129E1676l6219N372L5534P595P582l1439m2818p242j0833J2843P57j6441j7710
9116d1343Q314K4119J4169N747L9156K6662K7436k215J9385o5J9022J4005L1428
9103A85820K7942l334j0627l7078j5350J7459j0664j5765m2611l1037k2176P159
9091D9738P932N4651l731k5971j8107m4654j6464P0098L1979n8616l6883L9006
9079D8978K4455J0624M2123J1242p402k3996j713L8750r416k5211O0370O3704
9067B32508L8259M1378M6180l0878k1212L943l3971k9301l0037l8614l3666j5870
9055A28719j1384l7271J210m771J2478k6139k8404k1658l482L7843J0527j0078
9043D7590L328K9808J1447k2245l9907J9272k956m234K7687M1021J5316j4605
$$ plain form
9031 111522 168858 194463 178163 193382 209114 180555 185610 189851 156053 116613 96255 69382
9019 69382 104870 128722 141514 146396 114709 62411 69244 72390 90343 90854 102357 118713 88907
9006 88907 79010 118833 135653 129156 70833 60962 56996 45213 39268 30929 45486 55333 45736
8993 45736 39153 44535 58005 99248 120057 139848 160299 156042 121321 136565 134303 154563 161483
8980 161483 132820 137521 118703 92137 85738 78517 71912 4560 -24578 5263 7528 34364 87260
8967 87260 74541 22377 18128 46426 63625 34908 1030 -9704 26841 20454 -15667 -14664
8955 -14664 -19527 -2235 -1608 1961 32395 34288 32909 40667 69524 54598 44934 64187 49138
8942 49138 55147 80783 86370 106726 129103 147252 152322 155076 187558 199433 172034 178587 181081
$$ packed form
9031A11522N7336K5605j6300J5219J5732k8559N055M241l3798l9440k0358k6873
9019F9382L5488K3852J2792M882l1687n2298O833L146J7953N11J1503J6356k9806
9006H8907r897L9823J6820o497n8323r871l966j1783n945q339J4557R847r597
8993D5736o583N382J3470M1243K0809J9791K0451m257l4721J5244k262K0260O920
8980A61483k8663M701j8818k6566o399p221o605o7352k9138K9841K265K6836N2896
8967H7260j2719n2164m249K8298J7199k8717l3878j0734L6545o387l6121J003
8955a4664m863J7292O27L569L0434J893j379P758K8857j4926r664J9253j5049
8942D9138O009K5636N587K0356K2377J8149N070K754L2482J1875k7399O553K494
$$ plain form
8929 181081 176691 137888 139925 141510 173440 180743 203724 202072 170578 174244 182593 170582 171590
8916 171590 163097 135999 115049 115083 120417 129415 153866 191949 190765 127514 92856 94299 114159
8903 114159 91491 77938 114468 128413 122633 128439 97617 53721 69668 73585 66256 47116
8891 47116 40659 45887 34290 45797 50248 5418 -11842 -43619 -30283 8193 17545 31341 48955
8878 48955 49020 62750 84256 78396 64352 69649 42426 24151 9233 61428 117242 208881 193171
8865 193171 170530 187404 197642 178041 174407 151533 142647 164489 166689 155876 151968 123768
8853 123768 113869 123512 123410 129846 105361 91596 70576 83953 103716 110874 116743 140227 162519
8840 162519 151994 149481 149673 183103 198724 197011 153366 63843 32282 58779 102402 112041 148532
$$ packed form
8929A81081m390l8803K037J585L1930P303K2981j652l1494L666Q349j2011J008
8916A71590q493k7098k0950L4N334Q998K4451L8083j184o3251l4658J443J9860
8903A14159k2668j3553L6530J3945n780N806l0822m3896J5947L917p329j9140
8891D7116o457N228j1597J1507M451m4830j7260l1777J3336L8476R352J3796J7614
8878D8955O5J3730K1506n860j4044N297k7223j8275j4918N2195N5814R1639j5710
8865A93171k2641J6874J0238j9601l634k2874q886K1842K200j0813l908k8200
8853A23768r899R643j02O436k4485j3765k1020J3377J9763P158N869K3484K2292
8840A62519j0525k513J92L3430J5621j713m3645q9523l1561K6497M3623R639L6491
$$ plain form
8827 148532 156641 105728 98260 119471 116503 104444 58632 17409 40600 46913 33745 20019
8815 20019 18461 1569 -1903 -14627 -41421 -55477 -76204 -94062 -81908 -92205 -22454 -16447
8803 -16447 -54684 -41270 -24110 -17556 949 5872 -1779 -34504 -40914 -48558 -18230 25192 15848
8790 15848 9362 -12751 15521 20455 55551 73822 45161 49578 75757 49397 68198 74005 35183
8777 35183 38281 33064 14710 -4556 34943 39720 32076 29078 49700 34713 48690 47799 30253
8764 30253 24301 52408 41350 31651 41186 31154 16130 1196 -10282 -8730 -52730 -53357 -41507
8751 -41507 -38647 -66667 -57357 -26834 -17202 -10781 -25052 -6590 2492 -17346 -41245 -18484 -8946
8738 -8946 -20660 1835 -33326 -46881 -27763 -33087 -7037 -1411 16465 33787 13926 -16871
$$ packed form
8827A48532Q109n0913p468K1211k968j2059m5812m1223K3191O313j3168j3726
8815B0019j558j6892l472j2724k6794j4056k0727j7858J2154j0297O9751O007
8803a6447l8237J3414J7160O554J8505M923p651l2725o410p644L0328M3422r344
8790A5848o486k2113K8272M934L5096J8271k8661M417K6179k6360J8801N807l8822
8777C5183L098n217j8354j9266L9499M777p644k998K0622j4987J3977q91j7546
8764C0253n952K8107j1058r699R535j0032j5024j4934j1478J552m4000o27J1850
8751d1507K860k8020R310L0523R632O421j4271J8462R082j9838k3899K2761R538
8738h946j1714K2495l5161j3555J9118n324K6050N626J7876J7322j9861l0797
$$ plain form
8726 -16871 -13193 25196 13633 -26909 -53597 -55256 -52190 -65277 -84353 -82936 -25579 -8363 -34862
8713 -34862 -45187 9489 11738 11680 -13148 -36755 -35477 -15434 -2141 -22394 -30099 -78458 -100446
8700 -100446 -78353 -45658 -38649 -16175 1648 16006 51573 36167 -329 -8209 8670 18510
8688 18510 17784 27939 -7143 -489 25672 36379 10988 26088 53890 64162 43561 38467 22059
8675 22059 17527 18469 -8239 -35223 -44921 -31347 -7568 -10336 15721 25031 31615 13321 -15593
8662 -15593 -6605 8952 -970 -2760 -5886 959 -17688 -7126 -18961 -15535 -5168 -13169 -14980
8649 -14980 -57248 -80617 -33502 -25187 -33350 -33109 4708 44161 40913 2972 10607 11994 11111 1596
8635 1596 -1547 -2448 13189 63698 57120 69287 57821 29657 8927 15901 19159 26407 22019 12293
$$ packed form
8726a6871L678L8389j1563m0542k6688j659L066j3087j9076J417N7357J7216k6499
8713c4862j0325N4676K249n8k4828k3607J278K0043J3293k0253p705m8359k1988
8700a00446K2093L2695P009K2474J7823J4358L5567j5406l6496p880J6879R840
8688A8510p26J0155l5082O654K6161J0707k5391J5100K7802J0272k0601n094j6408
8675B2059m532R42k6708k6984r698J3574K3779k768K6057R310O584j8294k8914
8662a5593Q988J5557r922j790l126O845j8647J0562j1835L426J0367q001j811
8649a4980m2268k3369M7115Q315q163K41L7817L9453l248l7941P635J387q83r515
8635A596l143r01J5637N0509o578J2167j1466k8164k0730O974L258P248m388r726
$$ plain form
8621 12293 8618 25207 75272 92475 56547 35673 45116 24793 -13092 17772 18418 10566 -21780
8608 -21780 -16814 15478 2306 42735 94996 94199 85936 85517 82894 59603 66832 48683 78824
8595 78824 120462 103779 140848 167871 143529 121172 132322 157435 177335 199543 169086 107137
8583 107137 87640 99123 111042 62197 48577 30753 38621 93839 133483 127418 89999 93197
8571 93197 146736 158233 149926 174327 254146 425084 674293 893219 754709 473572 287800
8560 287800 214726 165346 99923 55693 100269 83752 76789 97800 130754 137304 120612 106259
8548 106259 103055 92452 58909 19616 -3396 38869 55407 41143 34230 54755 16683 -5572
8536 -5572 -12879 8923 47969 65253 80420 57950 52922 38830 7859 -42679 -67340 -68777 -62794
$$ packed form
8621A2293l675J6589N0065J7203l5928k0874R443k0323l7885L0864O46p852l2346
8608b1780M966L2292j3172M0429N2261p97q263m19k623k3291P229j8149L0141
8595G8824M1638j6683L7069K7023k4342k2357J1150K5113J9900K2208l0457o1949
8583A07137j9497J1483J1919m8845j3620j7824P868N5218L9644o065l7419L198
8571I3197N3539J1497q307K4401P9819J70938K49209K18926j38510k81137j85772
8560B87800p3074m9380o5423m4230M4576j6517o963K1011L2954O550j6692j4353
8548A06259l204j0603l3543l9293k3012M2265J6538j4264o913K0525l8072k2255
8536e572p307K1802L9046J7284J5167k2470n028j4092l0971n0538k4661j437N983
$$ plain form
8523 -62794 -25357 5699 27503 30236 70644 129420 149448 116227 99484 80819 47694 -13246
8511 -13246 -9344 -832 -9637 -78243 -96948 -77931 -80762 -97469 -93816 -48424 -53187 -30882 -47624
8498 -47624 -68093 -46224 -42477 -43805 -10791 14574 -2391 5749 6482 18152 11740 4023 18061
8485 18061 16953 -42854 -93784 -86581 -68434 -72727 -64824 -57621 -36642 -8810 -11647 -4523 -6854
8472 -6854 -16121 -21724 -20512 -5545 34915 47180 54882 63584 44760 60939 104848 100338 88586
8459 88586 116161 93920 64214 15978 -2195 -3244 -22465 -77895 -42431 -6330 -1343 4320
8447 4320 -12964 -15140 -5717 16496 5623 -35141 -50662 -18331 -22817 -48146 -19314 -2492 -32287
8434 -32287 -41139 -19649 1319 33941 -1897 -40906 -51531 -66691 -50002 -51658 -109405 -104450
$$ packed form
8523f2794L7437L1056K1804K733M0408N8776K0028l3221j6743j8665l3125o0940
8511a3246L902Q512q805o8606j8705J9017k831j6707L653M5392m763K2305j6742
8498d7624k0469K1869L747j328L3014K5365j6965Q140P33J1670o412p717J4038
8485A8061j108n9807n0930P203J8147m293P903P203K0979K7832k837P124k331
8472f854r267n603J212J4967M0460J2265P702Q702j8824J6179M3909m510j1752
8459H8586K7575k2241k9706m8236j8173j049j9221n5430L5464L6101M987N663
8447D320j7284k176R423K2213j0873m0764j5521L2331m486k5329K8832J6822k9795
8434c2287q852K1490K0968L2622l5838l9009j0625j5160J6689j656n7747M955
$$ plain form
8422 -104450 -88951 -70028 -86586 -94879 -92934 -126307 -128998 -103357 -71391 -25210 -18324 -8412 -12395
8409 -12395 972 21386 1222 -12141 -19455 -45032 -51964 -58433 -28759 -7915 34807 39583 17015
8396 17015 2989 522 15177 710 -66 -24522 -4815 6199 -27889 -14771 -2763 -11389 4533
8383 4533 26385 29024 12135 39490 33146 46415 18667 -14333 -51734 -44007 -44820 -32266 20854
8370 20854 61433 17491 -22684 -65336 -128295 -117046 -60045 -52347 -52114 -56113 -84259 -68039 -44146
8357 -44146 -44864 -42240 -37735 -44208 -13049 -5959 15916 41317 -7502 -35951 -36472 -35422 -48117 -48722
8343 -48722 -57507 -29325 -30270 -34256 -34644 -41069 -3428 25564 -15578 -85605 -95122 -57134 -65821 -59228
8329 -59228 -56699 -55763 -29551 -15548 -18275 -44722 -42052 -57955 -59544 -59274 -70810 -47927 -21993
$$ packed form
8422a04450J5499J8923j6558q293J945l3373k691K5641L1966M6181O886R912l983
8409a2395J3367K0414k0164j3363p314k5577o932o469K9674K0844M2722M776k2568
8396A7015j4026k467J4655j4467p76k4456J9707J1014l4088J3118J2008q626J5922
8383D533K1852K639j6889K7355o344J3269k7748l3000l7401P727q13J2554N3120
8370B0854M0579m3942m0175m2652o2959J1249N7001P698K33l999k8146J6220K3893
8357d4146p18K624M505o473L1159P090K1875K5401m8819k8449n21J050j2695o05
8343d8722q785K8182r45l986l88o425L7641K8992m1142p0027r517L7988q687O593
8329e9228K529R36K6212J4003k727k6447K670j5903j589K70j1536K2883K5934
$$ plain form
8316 -21993 14256 -3180 -20166 -20305 -39185 -26153 -48017 -62091 -25617 7070 -20023 -19014
8304 -19014 -22150 -26155 -36695 -41590 -10143 -35058 -85378 -84328 -41549 17410 49226 78243 119655
8291 119655 152968 146339 108779 101568 68179 53325 69183 92294 55915 26085 10529 16297
8279 16297 -26947 -42802 -50568 -45691 -36093 9747 30074 45677 29983 -87 -1787 424 -31961
8266 -31961 -22775 -7927 -19256 -20948 -41399 -52236 -62990 -45912 -38129 -32440 -46485 -38875 -30351
8253 -30351 -41822 -33137 -29025 -16950 2333 -39260 -32220 5046 6482 -55569 -51835 -43401 -63813
8240 -63813 -67799 -37699 -4391 -13955 -41298 -95634 -94940 -63269 -48158 -19747 -23534 -30717 -6639
8227 -6639 12088 47693 34218 2948 -1350 -60563 -83139 -39892 -7149 12484 31546 11109
$$ packed form
8316b1993L6249j7436j6986j39j8880J3032k1864j4074L6474L2687k7093J009
8304a9014l136m005j0540m895L1447k4915n0320J050M2779N8959L1816K9017M1412
8291A19655L3313o629l7560p211l3389j4854J5858K3111l6379k9830j5556N768
8279A6297m3244j5855p766M877R598M5840K0327J5603j5694l0070j700K211l2385
8266c1961R186J4848j1329j692k0451j0837j0754J7078P783N689j4045P610Q524
8253c0351j1471Q685M112J2075J9283m1593P040L7266J436o2051L734Q434k0412
8240f3813l986L0100L3308r564k7343n4336O94L1671J5111K8411l787p183K4078
8227f639J8727L5605j3475l1270m298n9213k2576M3247L2743J9633J9062k0437
$$ plain form
8215 11109 -60883 -17381 50919 73559 36801 16180 45683 53139 -260 -9155 -5717 -29267
8203 -29267 -50306 -42287 4568 51784 42824 57189 75476 59127 3620 -41972 -63963 -53058
8191 -53058 -12736 -5337 -26695 -44757 -56457 -48608 -34361 -39770 -69800 -102063 -81741 -80116 -50813
8178 -50813 -34872 -33204 -56395 -83954 -81767 -58330 -74577 -21268 41474 11943 182 10574
8166 10574 40350 36034 41156 74084 92783 95141 41310 -6898 12477 530 11441 28236
8154 28236 40243 29949 -7026 27321 57352 57740 41361 -1683 -12324 -38773 -81967 -91783
8142 -91783 -72919 -51544 -20945 -52896 -76993 -31138 -13670 -21798 -9534 22737 19971 19469 1291
8129 1291 -28134 -29988 -25090 26624 22008 -3184 2254 15648 33017 41960 23647 -12094 -41198
$$ packed form
8215A1109p1992M3502O8300K2640l6758k0621K9503P456n3399q895L438k3550
8203b9267k1039Q019M6855M7216q960J4365J8287j6349n5507m5592k1991J0905
8191e3058M0322P399k1358j8062j1700P849J4247n409l0030l2263K0322J625K9303
8178e0813J5941J668k3191k7559K187K3437j6247N3309O2742k9531j1761J0392
8166A0574K9776m316N122L2928J8699K358n3831m8208J9375j1947J0911J6795
8154B8236J2007j0294l6975L4347L0031L88j6379m3044j0641k6449m3194r816
8142i1783J8864K1375L0599l1951k4097M5855J7468q128J2264L2271k766n02j8178
8129A291k9425j854M898N1714m616k5192N438J3394J7369Q943j8313l5741k9104
$$ plain form
8116 -41198 -41727 -14475 -5986 -10457 -36721 -52268 -67304 -37821 805 12405 -13475 -40764 -40444
8103 -40444 -24122 -50722 -71503 -53318 -53099 -23955 -9967 -4170 -50118 -61411 -3365 59930
8091 59930 54820 25 -12619 -13916 -8485 -26276 -35669 -61964 -47568 -9574 3070 -3685 -3978
8078 -3978 7964 -5684 -9268 -33307 -49561 -48628 -25272 -4496 4578 12117 -21873 -20746 7214
8065 7214 5012 -7813 7814 11165 19707 16354 7740 1606 33355 2433 41426 70393 72923
8052 72923 72638 46632 91626 45257 -14156 -37012 -37412 -846 13774 15228 40428 33066 39466
8039 39466 57249 38882 33405 4124 7538 27698 -81 -55656 -46053 1735 5662 4015 11634
8026 11634 -7384 -52603 -24961 -3646 21782 6706 16921 3813 -19507 -27743 4596 25270
$$ packed form
8116d1198n29K7252Q489m471k6264j5547j5036K9483L8626J1600k5880k7289L20
8103d0444J6322k6600k0781J8185K19K9144J3988N797m5948j1293N8046O3295
8091E9930n110n4795j2644j297N431j7791r393k6295J4396L7994J2644o755k93
8078c978J1942j3648l584k4039j6254R33K3356K0776R074P539l3990J127K7960
8065G214k202j2825J5627L351Q542l353q614o134L1749l0922L8993K8967K530
8052G2923k85k6006M4994m6369n9413k2856m00L6566J4620J454K5200p362O400
8039C9466J7783j8367n477k9281L414K0160k7779n5575R603M7788L927j647P619
8026A1634j9018m5219K7642K1315K5428j5076J0215j3108k3320q236L2339K0674
$$ plain form
8014 25270 44234 44963 68034 68240 38695 37286 77231 120765 124510 128661 141565 106061 48054
8001 48054 22668 26731 8730 -10 21074 29041 16760 61032 111249 151525 96319 594
7989 594 -27449 -16154 -31588 -40731 -31613 -14189 24037 44524 28903 10863 39191 59527 53056
7976 53056 37101 61906 34665 5345 24923 55731 90129 131669 168515 168900 169778 144609 138563
7963 138563 142130 157689 142327 111610 112187 162439 140518 125294 98525 35387 8463 53935
7951 53935 56379 39709 43705 -24459 -19397 49997 43105 -11361 -9731 10870 1837 5694 12718
7938 12718 19642 59353 44367 36292 34607 26702 28505 44192 80727 100131 107000 94520 88369
7925 88369 94893 104280 78767 69014 87752 80219 105009 143312 136630 102140 83216 64084 46088
$$ packed form
8014B5270J8964P29K3071K06k9545j409L9945M3534L745M151J2904l5504n8007
8001D8054k5386M063j8001q740K1084P967j2281M4272N0217M0276n5206r5725
7989E94k8043J1295j5434r143R118J7424L8226K0487j5621j8040K8328K0336o471
7976E3056j5955K4805k7241k9320J9578L0808L4398M1540L6846L85Q78k5169o046
7963A38563L567J5559j5362l0717N77N0252k1921j5224k6769o3138k6924M5472
7951E3935K444j6670L996o8164N062O9394o892n4466J630K0601r033L857P024
7938A2718O924L9711j4986q075j685p905J803J5687L6535J9404O869j2480o151
7925H8369O524R387k5513r753J8738p533K4790L8303o682l4490j8924j9132j7996
$$ plain form
7912 46088 47486 54856 36880 -21759 -59461 -29156 -35428 -45718 -48921 -55343 -66868 -19958 -11088
7899 -11088 -19425 -3595 14544 25517 33380 52525 46244 13454 16422 1975 -4467 -3715 -22697
7886 -22697 -15100 -6657 -19602 -15768 -18967 -51083 -25679 -10792 23720 17967 11614 21141 39940
7873 39940 54413 72795 43997 13359 2749 -36357 -69996 -58286 -37789 -15892 -15039 -30806
7861 -30806 -8945 9008 18392 -8314 -28434 -55386 -64317 -70419 -40887 11600 39713 23658
7849 23658 8405 32848 31170 39404 19724 -3634 -9990 -14000 -43343 -58315 -29713 -7750 48159
7836 48159 79573 89749 57756 33273 -19205 -65322 -16905 19635 30429 2823 7099 -5669
7824 -5669 -27846 -61233 -14578 18081 17047 5019 -26161 -35938 -46999 -58432 -48623 -79541 -93746
$$ packed form
7912D6088J398P370j7976n8639l7702L0305o272j0290l203o422j1525M6910Q870
7899a1088q337J5830J8139J0973P863J9145o281l2790K968j4447o442P52j8982
7886b2697P597Q443j2945L834l199l2116K5404J4887L4512n753o353R527J8799
7873C9940J4473J8382k8798l0638j0610l9106l3639J1710K0497K1897Q53j5767
7861c0806K1861J7953R384k6706k0120k6952q931o102K9532N2487K8113j6055
7849B3658j5253K4443j678Q234j9680k3358o356m010k9343j4972K8602K1963N5909
7836D8159L1414J0176l1993k4483n2478m6117M8417L6540J0794k7606M276j2768
7824e669k2177l3387M6655L2659j034j2028l1180r777j1061j1433R809l0918j4205
$$ plain form
7811 -93746 -90138 -70477 -80085 -65854 -54694 -64807 -50006 -32635 -1843 -8619 -27850 -32235 543
7798 543 14415 3451 -9797 -9829 7316 -6423 -54179 -89238 -17580 6207 -19837 -10133 -22422
7785 -22422 -24091 -20887 1220 -8946 -64208 -82758 -39177 -27144 -5821 -7742 -5173 -3158 -4634
7772 -4634 -20140 -19457 -16942 -14253 -814 13852 39130 16338 -16250 -218 27791 37663 31360
7759 31360 -11455 -63827 -47980 -15731 -18928 -49321 -47574 -28139 -28743 -25051 -4040 29106 33451
7746 33451 -6668 -21047 -46323 -44845 -4112 -3320 -27002 -11431 -33625 -45037 -39392 -311 20875
7733 20875 -28175 -38309 -37501 -28789 2532 -13756 -11504 30479 74995 45259 24500 3966 -27949
7720 -27949 -42527 -18774 2928 20067 9177 -5066 658 6729 -1467 22611 28822 2350 -5306
$$ packed form
7811i3746L608J9661r608J4231J1160j0113J4801J7371L0792o776j9231m385L2778
7798E43J3872j0964j3248l2J7145j3739m7756l5059P1658K3787k6044R704j2289
7785b2422j669L204K2107j0166n5262j8550M3581J2033K1323j921K569K015j476
7772d634j5506O83K515K689J3439J4666K5278k2792l2588J6032K8009R872o303
7759C1360m2815n2372J5847L2249l197l0393J747J9435o04L692K1011L3146M345
7746C3451m0119j4379k5276J478M0733P92k3682J5571k2194j1412N645L9081K1186
7733B0875m9050j0134Q08Q712L1321j6288K252M1983M4516k9736k0759k0534l1915
7720b7949j4578K3753K1702J7139j0890j4243N724O071q196K4078O211k6472p656
$$ plain form
7707 -5306 27173 14111 -20042 -25436 -17927 -26817 -45980 -58337 -57209 -80939 -90624 -58638 -88808
7694 -88808 -99543 -91576 -81887 -89963 -130875 -130078 -78776 -31653 -39150 -56533 -42446 -42859 -3434
7681 -3434 -34710 -89214 -133431 -120717 -92189 -75602 -44646 -4706 5259 -37774 -90914 -96241
7669 -96241 -32093 -37682 -60330 -52312 -23738 -42746 -58796 -65598 -48478 -9823 8044 -2596
7657 -2596 2907 13523 -8897 8687 8830 -10381 -3560 -6977 -10913 2394 -37648 -35531 -17522
7644 -17522 -15980 -5705 -1956 -15036 -1750 2107 -33647 -65589 -105085 -111398 -105467 -98555 -93418
7631 -93418 -82144 -61056 -20923 -6020 2615 -2467 -12473 -43860 -69774 -67135 -43867 -24817
7619 -24817 -50074 -66108 -52711 -64000 -76757 -85944 -53022 -34974 -68329 -73667 -59045 -77384
$$ packed form
7707e306L2479j3062l4153n394P509q890j9163j2357J128k3730r685L1986l0170
7694h8808j0735P967R689q076m0912P97N1302M7123p497j7383J4087m13L9425
7681c434l1276n4504m4217J2714K8528J6587L0956L9940R965m3033n3140n327
7669i6241O4148n589k2648Q018K8574j9008j6050o802J7120L8655J7867j0640
7657b596N503J0616k2420J7584J43j9211O821l417l936J3307m0042K117J8009
7644a7522J542J0275L749j3080J3286L857l5754l1942l9496o313N931O912N137
7631i3418J1274K1088M0133J4903Q635n082j0006l1387k5914K639K3268J9050
7619b4817k5257j6034J3397j1289j2757r187L2922J8048l3355n338J4622j8339
$$ plain form
7607 -77384 -62861 -32810 -37393 -61425 -45073 28715 38936 13360 50 -20978 -56861 -71482
7595 -71482 -58013 -46800 6338 27831 19303 17493 -1337 -444 -27085 -47789 -61709 -65921 -39229
7582 -39229 -27788 -38199 -51232 -71590 -75749 -55846 -83304 -77833 -79624 -43909 -62321 -56315 -49750
7569 -49750 -48958 -21183 -16921 -15844 -31459 -60478 -52675 -19055 -17757 -45383 -90770 -59825 -32918
7556 -32918 -35835 -9683 -20009 -51688 -9443 19824 24601 24097 17382 8067 -13603 -46163 -48586
7543 -48586 -48905 -50142 -19278 -14085 2023 2837 13046 6887 -20244 -36527 -61956 -37793 -9254
7530 -9254 12616 11113 -30636 -54037 -54214 -33733 -30579 -40327 -40283 -37416 -28150 -25687 -66668 -47221
7516 -47221 -1579 8709 -12545 -29085 -20070 3491 1994 -2720 -6219 -32204 -29623 -3278 -27755
$$ packed form
7607g7384J4523L0051m583k4032J6352P3788J0221k5576j3310k1028l5883j4621
7595g1482J3469J1213N3138K1493q528j810j8830Q93k6641k0704j3920m212K6692
7582c9229J1441j0411j3033k0358m159J9903k7458N471j791L5715j8412O006O565
7569d9750P92K7775M262J077j5615k9019P803L3620J298k7626m5387L0945K6907
7556c2918k917K6152j0326l1679M2245K9267M777n04o715r315k1670l2560k423
7543d8586l19j237L0864N193J6108Q14J0209o159k7131j6283k5429K4163K8539
7530i254K1870j503m1749k3401j77K0481L154r748M4K867R266K463m0981J9447
7516d7221M5642J0288k1254j6540R015K3561j497m714l499k5985K581K6345k4477
$$ plain form
7503 -27755 -24888 -54107 -44314 -40018 -58148 -66997 -38276 -2355 -8156 35759 44473 27065 25969
7490 25969 48291 36025 11904 28856 43003 54431 -1913 -9932 -29626 -54553 -19150 -16699
7478 -16699 -7138 -44427 -69466 -35120 -19442 10866 55119 46685 -7576 -22048 -56892 -65836
7466 -65836 -54499 -68979 -66352 -57195 -32326 -19749 -43961 -39893 -29513 -29002 -16760 -25313 -19087
7453 -19087 -25955 -81384 -73996 -25906 -9461 -15633 -56553 -49179 2864 16669 34478 23940 -14024
7440 -14024 -18377 -32527 -54053 -52853 -47942 -6792 -1543 -86187 -99874 -56529 -47293 -42619 -41257
7427 -41257 -30030 -37039 -47407 -56286 -58058 -71488 -75027 -37320 -25093 -32246 -18207 -3515 -7519
7414 -7519 -35755 -52374 -34958 -31520 -5398 -3011 -15088 -23094 -2655 -18984 -30012 -38121 -19700
$$ packed form
7503b7755K867k9219R793M296j8130q849K8721L5921n801M3915Q714j7408j096
7490B5969K2322j2266k4121J6952J4147J1428n6344q019j9694k4927L5403K451
7478a6699R561l7289k5039L4346J5678L0308M4253q434n4261j4472l4844q944
7466f5836J1337j4480K627R157K4869J2577k4212M068J0380N11J2242q553O226
7453a9087o868n5429P388M8090J6445o172m0920P374N2043J3805J7809j0538l7964
7440a4024m353j4150k1526J200M911M1150N249q4644j3687M3345R236M674J362
7427d1257J1227p009j0368q879j772j3430l539L7707J2227p153J4039J4692m004
7414g519k8236j6619J7416L438K6122K387j2077q006K0439j6329j1028q109J8421
$$ plain form
7401 -19700 5712 -21144 -66261 -83198 -56400 -58075 -12597 25227 40587 38640 36180 39249 -264
7388 -264 18766 16856 -14453 -58802 -72027 -80071 -35740 -15191 -77332 -96678 -70167 -65618 -86670
7375 -86670 -74733 -35091 -44049 -67843 -91925 -104033 -52869 -4707 -480 -16169 -21370 -9304
7363 -9304 4896 8350 30164 24825 -21345 -43456 -9591 15601 4592 -29455 -31565 -31608 -31950 -36966
7349 -36966 -22112 -29337 -66694 -76055 -69188 -41772 -47050 -24596 -26862 -24393 -43474 -82809 -87327
7336 -87327 -31405 23424 52746 39054 -2850 -48920 -97307 -105576 -83734 -90570 -114689 -120789
7324 -120789 -100686 -62997 -50121 -33455 546 32469 304 -58608 -84606 -37295 -4313 13302
7312 13302 29387 11787 20381 25671 4931 15399 10197 -17127 -51319 -35765 -13025 -31985
$$ packed form
7401a9700K5412k6856m5117j6937K6798j675M5478L7824J5360j947k460L069l9513
7388b64J9030j910l1309m4349j3225q044M4331K0549o2141j9346K6511M549k1052
7375h6670J1937L9642q958k3794k4082j2108N1164M8162M227j5689n201J2066
7363i304J4200L454K1814n339m6170k2111L3865K5192j1009l4047k110m3l42n016
7349c6966J4854p225l7357r361O867K7416n278K2454k266K469j9081l9335m518
7336h7327N5922N4829K9322j3692m1904m6070m8387q269K1842o836k4119o100
7324a20789K0103L7689J2876J6666L4001L1923l2165n8912k5998M7311L2982J7615
7312A3302J6085j7600Q594N290k0740J0468n202k7324l4192J5554K2740j8960
$$ plain form
7300 -31985 -51080 -65421 -74800 -75675 -66014 -65233 -59050 -78008 -90861 -66292 -62766 -44560 -23105
7287 -23105 -16943 -64398 -28602 14763 10613 70 -14380 -14586 21996 14650 -1777 -36931 -70655
7274 -70655 -70381 -84804 -93056 -75622 -79774 -77435 -88650 -78315 -72362 -54458 -48713 -14562 -33952
7261 -33952 -35202 -20629 -4982 50015 64504 41295 28749 17507 -10976 -24043 -26837 -43487
7249 -43487 -21764 925 -11994 -42987 -46122 -51401 -27900 14511 36422 13877 18508 15676 12182
7236 12182 41491 62165 69645 99677 71686 25421 31077 63521 39424 -33680 -57752 -74596
7224 -74596 -67745 -57672 -61030 -66955 -17623 43715 46365 21489 23020 -4941 -11495 9216 21283
7211 21283 -17923 -16468 -9408 -39258 -47053 -42364 -49420 -19162 -92 -35007 -61656 -944 7592
$$ packed form
7300c1985j9095j4341r379q75R661P81O183j8958j2853K4569L526J8206K1455
7287b3105O162m7455L5796M3365m150j0543j4450k06L6582p346j6427l5154l3724
7274g0655K74j4423q252J7434m152K339j1215J0335N953J7904N745L4151j9390
7261c3952j250J4573J5647N4997J4489k3209j2546j1242k8483j3067k794j6650
7249d3487K1723K2689j2919l0993l135n279K3501M2411K1911k2545M631k832l494
7236A2182K9309K0674P480L0032k7991m6265N656L2444k4097p3104k4072j6844
7224g4596O851J0073l358n925M9332O1338K650k4876J531k7961o554K0711J2067
7211B1283l9206J455P060k9850p795M689p056L0258J9070l4915k6649O0712Q536
$$ plain form
7198 7592 22114 46480 14752 -3407 39947 71269 26091 7407 13306 -31479 -59879 -74277
7186 -74277 -51024 -55851 -56888 -37880 -21135 -31125 -19706 1819 -10711 -38049 -19658 46668
7174 46668 68859 51553 46651 47681 -7335 -45404 -65701 -59194 -73426 -76292 -86992 -56731 -77158
7161 -77158 -64631 -70960 -66067 -67946 -19446 1466 -23268 -12860 3976 20246 7824 -27627
7149 -27627 -8136 6320 -31996 -61977 -64017 -33171 -7838 -9064 -1423 -14542 -34891 -21031
7137 -21031 12063 -30674 -45989 -14861 23720 43864 38816 38986 12216 -3896 14878 11371 41789
7124 41789 47634 13516 -35820 -76129 -52653 9815 -22072 -33850 -17232 -35005 -29284 14707
7112 14707 -3328 -14569 -15277 -23765 365 23695 4931 -4634 -14471 5678 14399 -25676 -71975
$$ packed form
7198G592J4522K4366l1728j8159M3354L1322m5178j8684N899m4785k8400j4398
7186g4277K3253m827j037J9008J6745r990J1419K1525j2530k7338J8391O6326
7174D6668K2191j7306m902J030n5016l8069k0297O507j4232k866j0700L0261k0427
7161g7158J2527o329M893j879M8500K0912k4734J0408J6836J6270j2422l5451
7149b7627J9491J4456l8316k9981k040L0846K5333j226P641j3119k0349J3860
7137b1031L3094m2737j5315L1128L8581K0144n048J70k6770j6112J8774l507L0418
7124D1789N845l4118m9336m0309K3476O2468l1887j1778J6618j7773N721M3991
7112A4707j8035j1241p08q488K4130K3330j8764r565r837K0149Q721m0075m6299
$$ plain form
7099 -71975 -83327 -51701 -53847 -33716 -61673 -60976 -24958 10760 13726 1669 -34369 -4405 539
7086 539 -5743 -10059 -45954 -19254 8424 -15811 -38450 -45227 -31674 -46254 -76181 -46554 -8225
7073 -8225 26699 52136 26635 18583 5790 -28024 4377 29345 -9858 -52292 2775 -41219
7061 -41219 -58262 -45086 -25748 21674 22099 -1309 -7102 -3690 -19299 -6794 12187 -6545 -8906
7048 -8906 -25856 9727 -14794 -24099 -24000 -34668 -20133 -3334 -3671 -16007 -12998 -20360 -44188 -45560
7034 -45560 -64360 -74368 -63737 -72159 -32021 -27159 -37502 -66612 -61378 -44517 -33600 -36714 -28938
7021 -28938 -54229 -54619 -25039 1046 -24031 -26325 -35878 6816 45657 61441 46284 -7097 -56430
7008 -56430 -74176 -36399 -52840 -59523 -22074 -13013 -27237 -10377 -29613 11469 27803 16245
$$ packed form
7099g1975j1352L1626k146K0131k7957O97L6018L5718K966j2057l6038K9964M944
7086E39o282m316l5895K6700K7678k4235k2639o777J3553j4580k9927K9627L8329
7073h225L4924K5437k5501q052j2793l3814L2401K4968l9203m2434N5067m3994
7061d1219j7043J3176J9338M7422M25k3408n793L412j5609J2505J8981j8732k361
7048h906j6950L5583k4521r305R9j0668J4535J6799l37j2336L009p362k3828j372
7034d5560j8800j0008J0631q422M0138M862j0343k9110N234J6861J0917l114P776
7021b8938k5291l90K9580K6085k5077k294r553M2694L8841J5784j5157n3381m9333
7008e6430j7746L7777j6441o683L7449R061j4224J6860j9236M1082J6334j1558
$$ plain form
6996 16245 -11880 -18173 -27945 -44788 -80989 -89332 -52950 -25068 -23649 13181 25137 3874 -20107
6983 -20107 -28269 194 18283 -630 7560 8273 9099 9778 3246 -12033 -86249 -82893 -33591 12555
6969 12555 22968 21883 -22382 -35592 -17928 -58426 -61292 -63254 -73542 -42677 -24854 -25688 -40202
6956 -40202 -50953 -19244 -18594 -3917 793 16933 3540 13184 30092 14617 36640 46482 -6642
6943 -6642 -14275 9550 18188 13669 -5755 1174 -37216 -78953 -68834 -17294 -4565 -17305 -57435
6930 -57435 -76324 -62774 -78632 -58801 -57687 -39947 -21918 24325 40528 39049 52945 60258
6918 60258 78906 87763 77699 16128 18330 38203 10467 10141 -595 -6725 -17862 -18528 -19597
6905 -19597 -20754 -33045 -26029 -3401 713 -2843 -16126 -34825 -15953 8374 -34492 -29014 -46356
$$ packed form
6996A6245k8125o293r772j6843l6201q343L6382K7882J419L6830J1956k1263k3981
6983b0107q162K8463J8089j8913Q190P13Q26O79o532j5279p4216L356M9302M6146
6969A2555J0413j085m4265j3210J7664m0498k866j962j0288L0865J7823q34j4514
6956d0202j0751L1709O50J4677M710J6140j3393R644J6908j5475K2023R842n3124
6943f642p633K3825Q638m519j9424O929l8390m1737J0119N1540J2729j2740m0130
6930e7435j8889J3550j5858J9831J114J7740J8029M6243J6203j479J3896P313
6918F0258J8648Q857j0064o1571K202J9873k7736l26j0736o130j1137o66j069
6905a9597j157j2291P016K2628M114l556j3283j8699J8872K4327m2866N478j7342
$$ plain form
6892 -46356 -72006 -60234 -70891 -29618 -24279 -53306 -44654 -9199 -25668 -26216 -37767 -1040 8274
6879 8274 4130 -7269 23968 20110 24425 38042 23633 48616 69669 36029 -2429 -25410 -58592
6866 -58592 -36955 -19964 -22897 -53961 -49580 -14537 -9201 -6123 18783 41158 43667 25123 16224
6853 16224 31733 47716 40660 -4617 -49471 -81527 -92951 -75875 -81432 -129700 -129125 -86300 -82673
6840 -82673 -42140 -48013 -50366 -26509 10902 22967 -6406 14350 1585 -23884 8950 51904
6828 51904 26257 -37409 -58590 -35050 -31897 -41676 -3868 -24201 -18088 -8539 -13856 -23563 -51372
6815 -51372 -72877 -91255 -80095 -49041 -31199 -9600 4097 -28214 -26169 -52586 -48977 -29622
6803 -29622 -22099 -40067 -52517 -12283 469 18167 -13920 -46187 -72184 -103490 -97800 -91975
$$ packed form
6892d6356k5650J1772j0657M1273N339k9027Q652L5455j6469n48j1551L6727R314
6879H274m144j1399L1237l858M315J3617j4409K4983K1053l3640l8458k2981l3182
6866e8592K1637J6991k933l1064M381L5043N336L078K4906K2375K509j8544q899
6853A6224J5509J5983p056m5277m4854l2056j1424J7076n557m8268N75M2825L627
6840h2673M0533n873k353K3857L7411J2065k9373K0756j2765k5469L2834M2954
6828E1904k5647o3666k1181K3540L153r779L7808k0333O113R549n317r707k7809
6815e1372k1505j8378J1160L1054J7842K1599J3697l2311K045k6417L609J9355
6803b9622P523j7968j2450M0234J2752J7698l2087l2267k5997l1306N690N825
$$ plain form
6791 -91975 -45746 -21725 -28840 -45532 -48911 -46266 12265 16582 16470 24424 -810 -8630 3409
6778 3409 183 -23391 9461 -8560 15995 43076 39253 22483 34571 25661 -2380 22521 47183
6765 47183 13009 -12904 -3196 31400 10936 11488 28236 27052 36863 25159 23122 -17886 -65636
6752 -65636 -76775 -55903 -45747 -43904 -14545 -25910 -7221 -9713 -1215 18592 22852 35119 42017
6739 42017 5125 -2305 7306 15411 12721 -21194 -41689 8467 60461 63144 67855 65703 91481
6726 91481 79155 37758 19803 17569 42790 47609 37374 67623 133447 176253 182127 136834
6714 136834 64131 30451 58549 70343 46255 23535 27102 53253 37279 17426 36429 46674
6702 46674 24739 296 43732 35266 -10210 -10110 14860 32719 30097 39579 67567 21949 -8816
$$ packed form
6791i1975M6229K4021p115j6692l379K645N8531M317j12P954k5234p820J2039
6778C409l226k3574L2852j8021K4555K7081l823j6770J2088q910k8041K4901K4662
6765D7183l4174k5913R708L4596k0464N52J6748j184R811j1704k037m1008m7750
6752f5636j1139K0872J0156J843K9359j1365J8689k492Q498J9807M260J2267O898
6739D2017l6892p430R611Q105k690l3915k0495N0156N1994K683M711k152K5778
6726I1481j2326m1397j7955k234K5221M819j0235L0249O5824M2806N874m5293
6714A36834p2703l3680K8098J1794k4088k2720L567K6151j5974j9853J9003J0245
6702D6674k1935k4443M3436q466m5476J00K4970J7859k622R482K7988m5618l0765
$$ plain form
6689 -8816 -5115 -33694 -17806 8306 2702 -2814 13107 36697 10123 -28381 -41525 -1803 23578
6676 23578 22458 31017 11456 -9005 30304 9542 -7536 -16345 10069 34383 17241 -27404
6664 -27404 -58432 -65724 -66397 -41010 -31958 -70650 -60848 -5411 3461 -4144 5686 35991 -14535
6651 -14535 -18038 -32440 -33027 -24922 -28262 -44715 -11551 12470 -17987 -11726 11334 3951 -3858
6638 -3858 22199 44904 59860 85400 51114 26616 46149 51697 18270 -6663 -2076 -23553
6626 -23553 -12454 -23501 -69319 -117486 -73729 -48422 -3789 7985 -20150 -36952 -20724 -27108
6614 -27108 -38178 -59798 -31204 -36775 -36719 -36923 -5200 496 -13077 -43954 -40425 -8056 31552
6601 31552 21271 36987 48860 54050 52383 38588 9092 -17198 -27575 -25269 -13668 38036
$$ packed form
6689h816L701k8579J5888K6112n604n516J5921K3590k6574l8504j3144L9722K5381
6676B3578j120Q559j9561k0461L9309k0762j7078q809K6414K4314j7142m4645
6664b7404l1028p292o73K5387R052l8692R802N5437Q872p605R830L0305n0526
6651a4535l503j4402n87Q105l340j6453L3164K4021l0457O261K3060p383p809
6638c858K6057K2705J4956K5540l4286k4498J9533N548l3427k4933M587k1477
6626b3553J1099j1047m5818m8167M3757K5307M4633J1774k8135j6802J6228o384
6614b7108j1070k1620K8594n571N6k04L1723N696j3573l0877L529L2369L9608
6601C1552j0281J5716J1873N190j667j3795k9496k6290j0377K306J1601N1704
$$ plain form
6589 38036 51554 40267 15812 -47900 -54149 -56377 -55937 -8879 19471 15436 -6150 -403 -9953
6576 -9953 -21001 -41000 -17454 8466 13066 31267 64489 76554 16287 -36777 -5997 37638
6564 37638 42609 36258 62289 75998 21983 -30060 -36132 -5731 31058 33458 6599 -23831 -44040
6551 -44040 -47782 -35187 -12228 9049 1468 -6064 -17095 -39923 -43089 11640 58699 44579 64616
6538 64616 85866 63760 52130 17984 -18343 -1800 43979 37753 15031 -24105 -23611 46580
6526 46580 60661 58852 38349 29923 39804 46528 26533 38624 15483 13723 -17132 -58238 -51848
6513 -51848 -19070 -21591 -12566 -10007 -15021 -12745 3267 21261 41559 60985 23647 -21764 -57000
6500 -57000 -55960 -31440 -7145 26388 31948 20607 23997 7660 -5133 -5604 -3198 -13121 9940
$$ packed form
6589C8036J3518j1287k4455o3712o249k228M40M7058K8350m035k1586N747r550
6576i953j1048j9999K3546K5920M600J8201L3222J2065o0267n3064L0780M3635
6564C7638M971o351K6031J3709n4015n2043o072L0401L6789K400k6859l0430k0209
6551d4040l742J2595K2959K1277p581p532j1031k2828l166N4729M7059j4120K0037
6538F4616K1250k2106j1630l4146l6327J6543M5779o226k2722l9136M94P0191
6526D6580J4081j809k0503q426R881O724j9995J2091k3141j760l0855m1106O390
6513e1848L2778k521R025K559n014K276J6012J7994K0298J9426l7338m5411l5236
6500e7000J040K4520K4295L3533N560j1341L390j6337j2793m71K406r923K3061
$$ plain form
6487 9940 12498 -2442 -3791 9278 6129 -38890 -11160 4426 -20740 -446 41851 31794 -14760
6474 -14760 -18480 -9133 -12662 -24556 12801 8361 18665 32239 4925 16821 30420 15548 -5254
6461 -5254 -6666 -33472 -43805 -56723 -53957 -55913 -58274 -65522 -89311 -56572 -18250 -19814 -28728
6448 -28728 -15981 -22527 -2195 27129 50026 39852 15705 10753 29342 12365 -37090 -68289
6436 -68289 -44470 -44141 -30907 14251 21157 -7072 -8028 1470 -32606 -69092 -52298 -4950 6156
6423 6156 7084 23678 5385 -23209 13403 26558 14622 -11710 1728 -590 -10127 12119 15883
6410 15883 2584 -8952 -11254 -20961 -33676 -5007 -21253 1338 353 -33671 -42437 -45765 -39237
6397 -39237 -72331 -94890 -59673 -16562 -13417 -22820 -55591 -75738 -78645 -75399 -39787 18128 18599
$$ packed form
6487I940K558j4940j349J3069l149m5019K7730J5586k5166K0294M2297j0057m6554
6474a4760l720R347l529j1894L7357m440J0304J3574k7314J1896J3599j4872k0802
6461e254j412k6806j0333j2918K766j956k361p248k3789L2739L8322j564q914
6448b8728J2747o546K0332K9324K2897j0174k4147m952J8589j6977m9455l1199
6436f8289K3819L29J3234M5158O906k8229r56R498l4076l6486J6794M7348J1106
6423F156R28J6594j8293k8594L6612J3155j1936k6332J3438k318r537K2246L764
6410A5883j3299j1536k302r707j2715K8669j6246K2591r85l4024q766l328O528
6397c9237l3094k2559L5217M3111L145r403l2771k0147k907L246L5612N7915M71
$$ plain form
6384 18599 22972 -4477 -31229 -52311 -66115 -63129 -6633 18565 24522 23484 35604 26406 4417
6371 4417 9314 -23447 -7010 -4966 -9943 -13952 -10651 -2420 17315 42798 48205 -10699 -24859
6358 -24859 -85477 -77143 -44941 -31307 -21032 -8636 14986 10010 2162 6859 2561 12434 -16112
6345 -16112 -32877 -26224 -2093 -7280 -47123 -35413 -6305 25229 28525 47396 38121 -3505 -10480
6332 -10480 -3687 -9321 -23426 -56849 -108370 -98305 -65193 -49832 1330 32962 38701 15320
6320 15320 -4574 29286 53591 32414 33703 -1585 -32796 463 -7110 -14319 -23555 -31639 -39336
6307 -39336 -4512 28640 15334 4282 -27861 -34123 -47474 -21792 21572 63588 62627 35117
6295 35117 27676 28679 14666 1185 4618 16455 6813 -38959 -35655 -21817 -26687 -5789 -6403
$$ packed form
6384A8599M373k7449k6752k1082j3804K986N6496K5198N957j038J2120r198k1989
6371D417M897l2761J6437K044m977m009L301Q231J9735K5483N407n8904j4160
6358b4859o0618Q334L2202J3634J0275J2396K3622m976p848M697m298R873k8546
6345a6112j6765O653K4131n187l9843J1710K9108L1534L296J8871r275m1626o975
6332a0480O793n634j4105l3423n1521J0065L3112J5361N1162L1632N739k3381
6320A5320j9894L3860K4305k1177J289l5288l1211L3259p573p209r236q084p697
6307c9336L4824L3152j3306j1052l2143o262j3351K5682M3364M2016r61k7510
6295C5117p441J003j4013j3481L433J1837r642m5772L304J3838m870K0898o14
$$ plain form
6282 -6403 -20264 -21518 -22575 -12426 -4598 -10675 1309 -30432 -55170 -54583 -44683 -53127 -29824 240
6268 240 47166 59743 50103 39414 27709 8852 -33517 -22742 1004 43927 64220 49656
6256 49656 5844 -3455 -41192 -32490 27 -6315 -21695 -11697 -13736 32056 78860 73529 83764
6243 83764 82642 9853 -6290 -33 28463 16314 24172 38794 29426 7744 -21893 -33341 19065
6230 19065 49958 57425 21663 11570 10163 -20074 -27809 11614 14452 8785 23625 45628 24104
6217 24104 -13136 -24995 -45034 -45675 -17183 -15571 21512 23918 11311 25323 38481 23693 32019
6204 32019 88275 84828 39576 31480 48463 50253 12924 -5048 -17958 -7123 11334 -35858
6192 -35858 -43045 -16074 -8628 465 8980 14967 22436 42322 17156 -9013 -7100 -26682 -39823
$$ packed form
6282f403j3861j254j057J0149P828o077J1984l1741k4738N87R900q444K3303L0064
6268B40M6926J2577r640j0689j1705j8857m2369J0775K3746M2923K0293j4564
6256D9656m3812r299l7737Q702L2517o342j5380R998k039M5792M6804n331J0235
6243H3764j122p2789j6143O257K8496j2149P858J4622r368k1682k9637j1448N2406
6230A9065L0893P467l5762j0093j407l0237p735L9423K838n667J4840K2003k1524
6217B4104l7240j1859k0039o41K8492J612L7083K406j2607J4012J3158j4788Q326
6204C2019N6256l447m5252q096J6983J790l7329j7972j2910J0835J8457m7192
6192c5858p187K6971P446R093Q515N987P469J9886k5166k6169J913j9582j3141
$$ plain form
6179 -39823 -49003 -40476 -29061 -32886 -28405 -1982 16800 7415 -9223 -13579 -36214 -37718 -15692
6166 -15692 -7032 2556 -840 20760 30693 16526 -28565 -26184 -10382 20706 33745 8023 -10086
6153 -10086 -27760 -4746 -135 -20332 -49200 -71643 -77571 -91636 -59736 -36128 -71252 -89792
6141 -89792 -72995 -68708 -23719 21995 19239 -44166 -47640 -42506 -17130 7014 -1103 -6251 14175
6128 14175 6840 -1911 18753 35592 -4319 -27858 -12104 -46518 -59567 -49566 -20284 67
6116 67 6984 -35867 -69020 -59880 -52710 -38237 10929 34130 -5806 -15749 -8893 4935 -15501
6103 -15501 -32654 -11573 -12097 -22400 -31922 -39719 -41582 -25679 -8700 -20949 -38266 -20243 10023
6090 10023 -2547 351 -2885 -11291 -24405 -43701 -65209 -55593 -33592 -42118 -10459 19769 34913
$$ packed form
6179c9823r180Q527J1415l825M481K6423J8782r385j6638m356k2635j504K2026
6166a5692Q660R588l396K1600R933j4167m5091K381J5802L1088J3039k5722j8109
6153a0086j7674K3014M611k0197k8868k2443n928j4065L1900K3608l5124j8540
6141h9792J6797M287M4989M5714k756o3405l474N134K5376K4144q117n148K0426
6128A4175p335q751K0664J6839l9911k3539J5754l4414j3049J0001K9282K0351
6116F7O917m2851l3153R140P170J4473M9166K3201l9936r943O856J3828k0436
6103a5501j7153K1081n24j0303r522p797j863J5903J6979j2249j7317J8023L0266
6090A0023j2570K898l236q406j3114j9296k1508R616K2001q526L1659L0228J5144
$$ plain form
6077 34913 29385 30626 33569 -13504 -21768 -43072 -17455 32947 57609 62130 54583 31363 14009
6064 14009 -5948 -37617 -26904 -579 20582 28494 21163 -44893 -33891 -6148 821 -3932 15142
6051 15142 21646 29881 71172 104803 89929 31527 -38008 -23389 59190 65258 53455 34394
6039 34394 16411 -5264 6860 -11769 4786 25760 30512 10239 -15112 10620 33023 51906
6027 51906 41106 14612 -17875 -22082 -18271 -35748 -72849 -81794 -98850 -72396 -65358 -73610 -85465
6014 -85465 -74582 -49208 -26757 35236 67046 19800 -14143 11109 9719 20535 30790 19369
6002 19369 41219 19201 -35828 -68617 -49980 -68109 -56130 -33632 -21530 6066 19718 -6517
5990 -6517 -29022 -17741 -10608 -51844 -48221 -38332 -54074 -36563 -43560 -53421 -44386 -54350 -55596 -18641
$$ packed form
6077C4913n528J241K943m7073q264k1304K5617N0402K4662M521p547k3220j7354
6064A4009j9957l1669J0713K6325K1161P912p331o6056J1002K7743O969m753J9074
6051A5142O504Q235M1291L3631j4874n8402o9535J4619Q2579O068j1803j9061
6039C4394j7983k1675J2124j8629J6555K0974M752k0273k5351K5732K2403J8883
6027E1906j0800k6494l2487m207L811j7477l7101q945j7056K6454P038q252j1855
6014h5465J0883K5374K2451O1993L1810m7246l3943K5252j390J0816J0255j1421
6002A9369K1850k2018n5029l2789J8637j8129J1979K2498J2102K7596J3652k6235
5990f517k2505J1281P133m1236L623R889j5742J7511o997r861R035r964j246L6955
$$ plain form
5976 -18641 -19345 -46920 -33448 -14339 -20221 -39235 -35466 -40139 -28203 -3400 22748 60644 104950
5963 104950 104114 73063 61588 35197 33663 43043 62287 61507 50095 39050 32505 -10385 -7596
5950 -7596 -52442 -62700 -58059 -61986 -95859 -87810 -83626 -100259 -90721 -70947 -40238 12716 14398
5937 14398 6459 645 4624 -16900 -29520 36495 78606 81980 52237 40284 19847 36836 -5415
5924 -5415 -65054 -88596 -90042 -56418 2676 5911 9542 -17446 -30296 -44458 -44538 -14803 -34371
5911 -34371 -51363 -4394 -19384 -31896 -38930 -25017 15338 27204 -4793 -24894 -7017 7145
5899 7145 10193 27031 1793 -15525 4359 -7737 -23604 -29855 -51350 -15604 -14975 -10668 -5903
5886 -5903 -9126 -11342 -6165 -10793 -12185 -25050 -48698 -39942 -51029 -47104 -55144 -7156 22425 6015
$$ packed form
5976a8641p04k7575J3472J9109n882j9014L769m673J1936K4803K6148L7896M4306
5963A04950q36l1051j1475k6391j534R380J9244p80j1412j1045o545m2890K789
5950g596m4846j0258M641l927l3873Q049M184j6633R538J9774L0709N2954J682
5937A4398p939n814L979k1524j2620O6015M2111L374k9743j1953k0437J6989m2251
5924e415n9639k3542j446L3624N9094L235L631k6988j2850j4162q0K9735j9568
5911c4371j6992M6969j4990j2512p034J3913M0355J1866l1997k0101J7877J4162
5899G145L048J6838k5238j7318J9884j2096j5867o251k1495L5746O29M307M765
5886e903l223k216N177m628j392j2865k3648Q756j1087L925q040M7988K9581j6410
$$ plain form
5872 6015 -30597 -21076 -11235 -4021 -25668 -48496 -64103 -57496 -102774 -83167 -47035 -13013 -30460
5859 -30460 -37013 -48069 -85577 -84878 -60430 -32515 -13233 -6587 -25522 -4476 29095 16537 2827
5846 2827 -12517 -27068 3152 1138 567 23123 7974 -20655 -14702 10888 18293 -22149 -29713
5833 -29713 -21608 -11552 -9079 1083 11516 20957 16409 -9072 -50113 -37416 -2443 801 4371
5820 4371 -4261 -839 -6932 -19723 -16743 -18459 5054 5088 -7521 -68373 -77623 -52008 -13914 -4922
5806 -4922 -45461 -6029 5072 23119 24519 91 -15175 -13576 -24134 -23458 -21725 -31204 -10105
5793 -10105 34694 24692 -5086 35331 40900 20766 45604 78174 37768 18812 28919 28979 38730
5780 38730 -4084 -30437 6285 29294 44554 31639 26750 -25626 62 40103 34886 2899
$$ packed form
5872F015l6612R521R841P214k1647k2828j5607O607m5278J9607L6132L4022j7447
5859c0460o553j1056l7508O99K4448K7915J9282O646j8935K1046L3571j2558j3710
5846B827j5344j4551L0220k014n71K2556j5149k8629N953K5590P405m0442p564
5833b9713Q105J0056K473J0162J0433R441m548k5481m1041J2697L4973L244L570
5820D371q632L422o093j2791K980j716K3513L4j2609o0852r250K5615L8094Q992
5806d922m0539L9432J1101J8047J400k4428j5266J599j0558O76J733r479K1099
5793a0105M4799j0002k9778M0417N569k0134K4838L2570m0406j8956J0107O0R751
5780C8730m2814k6353L6722K3009J5260j2915m889n2376K5688M0041n217l1987
$$ plain form
5768 2899 -27406 -23721 13259 -9412 -21238 -45565 -30266 -26474 9028 12668 2348 -25346 -31902
5755 -31902 -15428 -41762 -39663 -6709 42418 39828 -7278 -23130 18323 20770 -38899 -46271 -31956
5742 -31956 -20788 -11209 28208 44668 42214 34756 14727 -60966 -106326 -89048 -43356 7237
5730 7237 17910 46387 40934 -24804 -34663 -28992 -22025 -9530 -10696 -4744 13622 -19241 -36247
5717 -36247 -13688 -20615 -35897 -15952 -220 6239 -7292 -9899 21409 15856 -10792 -32869 -33255
5704 -33255 -6736 20865 5030 31822 23294 9065 -18673 -46940 -76885 -98599 -55783 -35924
5692 -35924 -13114 2935 40382 21069 -12913 11995 58316 71333 25756 4785 39474 59452
5680 59452 48758 30314 31895 50892 53008 46052 32143 -540 5264 2253 -20926 -39481 -25259
$$ packed form
5768B899l0305L685L6980k2671j1826k4327J5299L792L5502L640j0320k7694o556
5755c1902J6474k6334K099L2954M9127k590m7106j5852M1453K447n9669p372J4315
5742c1956J1168R579L9417J6460k454p458k0029p5693m5360J7278M5692N0593
5730G237J0673K8477n453o5738r859N671O967J2495j166N952J8366l2863j7006
5717c6247K2559o927j5282J9945J5732O459j3531k607L1308n553k6648k2077l86
5704c3255K6519K7601j5835K6792q528j4229k7738k8267k9945k1714M2816J9859
5692c5924K2810J6049L7447j9313l3982K4908M6321J3017m5577k0971L4689J9978
5680E9452j0694j8444J581J8997K116o956j3909l2683N804l011k3179j8555J4222
$$ plain form
5667 -25259 14907 19840 -11877 -28338 -36055 -29861 13157 34740 61591 10354 1556 17553 128
5654 128 -187 -23723 -14350 3449 -8762 -37666 -67093 -52813 -25067 -33080 -17902 4428 2763
5641 2763 5147 -11133 -26554 -21238 16494 28625 7474 43561 54427 30794 9156 25615
5629 25615 24289 15846 -42517 -72917 -46485 -8033 -37135 -72453 -76852 -97660 -104842 -63565 -37832
5616 -37832 8989 9299 -19867 -64746 -77059 -53310 -34999 -27846 -30831 -26043 -27326 -15355 -33623
5603 -33623 -46707 -68928 -63916 -51649 -31971 -11297 6671 3364 19371 -23312 -34164 -22925
5591 -22925 -8849 5093 -33607 -40641 -10542 -11390 -37786 -21286 -26881 -40178 -27944 -11247 3056
5578 3056 -32146 -44764 5508 59717 46310 55729 75246 54010 18794 -36728 -18583 11903
$$ packed form
5667b5259M0166M933l1717j6461p717O194M3018K1583K6851n1237q798J5997j7425
5654A28l15k3536R373J7799j2211k8904k9427J4280K7746q013J5178K2330j665
5641B763K384j6280j5421N316L7732J2131k1151L6087J0866k3633k1638J6459
5629B5615j326q443n8363l0400K6432L8452k9102l5318m399k0808p182M1277K5733
5616c7832M6821L10k9166m4879j2313K3749J8311P153k985M788j283J1971j8268
5603c3623j3084k2221N012J2267J9678K0674J7968l307J6007m2683j0852J1239
5591b2925J4076J3942l8700p034L0099q48k6396J6500n595j3297J2234J6697J4303
5578C056l5202j2618N0272N4209j3407R419J9517k1236l5216n5522J8145L0486
$$ plain form
5566 11903 17185 -4166 -18828 -35821 -10324 -14760 10435 32768 33566 36565 57081 24602 36346
5553 36346 48417 56386 74398 84696 78849 50264 35794 35227 56607 40355 6635 16426 -15608
5540 -15608 -19408 -16028 7436 -1164 -16900 -22698 2589 10958 33658 49158 15875 -20085 -3455
5527 -3455 20145 -11126 -5357 14327 20580 27298 35599 44925 49195 31600 -2618 3616 13089 -15143
5513 -15143 -22055 -27680 -5550 -18510 -27719 -51233 -49364 -27245 -19630 5076 24028 15072 -10336
5500 -10336 -5168 -15010 13525 23708 -21473 -21559 -42322 -25296 -47280 -29925 -1362 29002 59706
5487 59706 69521 40879 40703 61178 72626 78471 61487 38019 17586 26368 -7164 -34306 -20271
5474 -20271 -15885 -1958 14150 18957 61059 80299 64934 49035 39214 59806 64788 57424 36037
$$ packed form
5566A1903N282k1351j4662j6993K5497m436K5195K2333P98K999K0516l2479J1744
5553C6346J2071P969J8012J0298n847k8585j4470n67K1380j6252l3720R791l2034
5540a5608l800L380K3464q600j5736n798K5287Q369K2700J5500l3283l5960J6630
5527c455K3600l1271N769J9684O253O718Q301R326M270j7595l4218O234R473k8232
5513a5143o912n625K2130j2960r209k3514J869K2119P615K4706J8952q956k5408
5500a0336N168r842K8535J0183m5181q6k0763J7026k1984J7355K8563L0364L0704
5487E9706R815k8642j76K0475J1448N845j6984k3468k0433Q782l3532k7142J4035
5474b0271M386J3927J6108M807M2102J9240j5365j5899r821K0592M982p364k1387
$$ plain form
5461 36037 33262 -3519 -18476 -36947 -36599 -28147 -49950 -38356 15705 861 4269 31661 27545
5448 27545 -17140 -42762 -36758 15800 26575 6878 30405 40505 34995 49974 51427 39870
5436 39870 46050 27459 -9016 35987 42392 32251 31167 21352 -1661 -32452 -53613 1692 22866
5423 22866 7132 -31477 -42758 19098 44380 60326 57573 3265 -175 2040 22873 6671
5411 6671 -38152 -35329 -15677 863 1791 25164 34508 37371 32466 33780 43727 50320 25859 9283
5397 9283 16595 32646 41285 64265 95184 74734 63263 14490 -19948 -7894 15046 9707 31872
5384 31872 20105 21417 34750 -22606 -42086 -46664 -13530 44562 34535 29857 69230 63578 28829
5371 28829 15616 51702 81445 41922 -2272 -39316 -49993 -49275 -51825 -47587 -36874 -2335 -6250
$$ packed form
5461C6037k775l6781j4957j8471L48Q452k1803J1594N4061j4844L408K7392m116
5448B7545m4685k5622O004N2558J0775j9697K3527J0100n510J4979J453j1557
5436C9870O180j8591l6475M5003O405j0141j084r815k3013l0791k1161N5305K1174
5423B2866j5734l8609j1281O1856K5282J5946k753n4308l440K215K0833j6202
5411F671m4823K823J9652J6540R28K3373R344K863m905J314R947O593k4461j6576
5397I283P312J6051Q639K2980L0919k0450j1471m8773l4438J2054K2940n339K2165
5384C1872j1767J312J3333n7356j9480m578L3134N8092j0027m678L9373n652l4749
5371B8829j3213L6086K9743l9523m4194l7044j0677P18k550M238J0713L4539l915
$$ plain form
5358 -6250 14727 13070 -5729 -38010 -86704 -84760 -90351 -64848 -32275 -15500 -13098 -11011 -27413
5345 -27413 -61633 -30009 27947 32736 14069 18333 36510 66112 86768 40922 2911 -21711
5333 -21711 -41985 -54547 -24561 -15978 -34874 -27218 -25138 -41719 -37738 -51562 -37615 -10150 -3420
5320 -3420 2169 -37902 -13984 22808 48497 49142 31500 66947 96919 73209 57197 11316 -17028
5307 -17028 24780 78580 97318 77189 84238 53297 59246 75972 37795 -12145 -24761 -38159
5295 -38159 19694 16674 -6854 6269 4843 46058 3608 -50434 -60039 -25674 13377 22591 40436
5282 40436 47960 21005 -10024 -38307 -29834 -11081 17917 21854 6668 -8730 49353 58282 46443
5269 46443 22507 7693 35995 -9893 -42941 -38559 -26026 23570 39066 14892 -3321 -30323
$$ packed form
5358f250K0977j657j8799l2281m8694J944n591K5503L2573J6775K402K087j6402
5345b7413l4220L1624N7956M789j8667M264J8177K9602K0656m5846l8011k4622
5333b1711k0274j2562K9986Q583j8896P656K080j6581L981j3824J3947K7465O730
5320c420N589m0071K3918L6792K5689O45j7642L5447K9972k3710j6012m5881k8344
5307a7028M1808N3800J8738k0129P049l0941N949J6726l8177m9940j2616j3398
5295c8159N7853l020k3528J3123j426M1215m2450n4042r605L4365L9051R214J7845
5282D0436P524k6955l1029k8283Q473J8753K8998L937j5186j5398N8083Q929j1839
5269D6443k3936j4814K8302m5888l3048M382J2533M9596J5496k4174j8213k7002
$$ plain form
5257 -30323 -14568 -6289 11900 1124 -2870 4097 -13250 -31928 13336 64619 73487 57742 15959
5244 15959 2879 44694 47264 56066 58834 92087 72957 45517 37099 57293 55622 41420 -25891
5231 -25891 -27700 9752 -22059 -41361 -65863 -44694 -38727 -16271 5151 -20570 -32918 -25918
5219 -25918 -45303 -9573 58414 49482 -7489 -48465 -33092 -8890 -14481 -26833 -18299 -19245 -21709
5206 -21709 -26985 -34236 -16951 2237 12476 9878 28391 73379 79278 49421 24359 56316 61731
5193 61731 51974 27977 8355 -10923 13106 -20156 -62671 -36123 -40154 -39658 -24104 -19904 -28161
5180 -28161 -29872 -7845 2296 56738 105999 71823 -14810 -24021 1648 24954 14941 6813
5168 6813 -1539 8892 47714 39347 4919 25212 27798 27568 39744 35930 51170 79932 56857
$$ packed form
5257c0323J5755Q279J8189j0776l994O967j7347j8678M5264N1283Q868j5745m1783
5244A5959j3080M1815K570Q802K768L3253j9130k7440q418K0194j671j4202o7311
5231b5891j809L7452l1811j9302k4502K1169N967K2456K1422k5721j2348P000
5219b5918j9385L5730O7987q932n6971m0976J5373K4202n591j2352Q534r46k464
5206b1709n276p251J7285J9188J0239k598J8513M4988N899k9857k5062L1957N415
5193F1731r757k3997j9622j9278K4029l3262m2515K6548m031M96J5554M200q257
5180b8161j711K2027J0141N4442M9261l4176q6633r211K5669K3306j0013q128
5168F813q352J0431L8822q367l4428K0293K586k30J2176l814J5240K8762k3075
$$ plain form
5155 56857 25604 -22023 -4480 26402 -6411 -29840 -36378 -34336 12878 53066 19424 18602 41472
5142 41472 58330 42861 4337 -10923 -1899 -32745 -17857 -15195 11079 36204 33213 43742
5130 43742 48084 39999 22304 -11293 -3151 -12195 -3098 15560 -5828 -19219 -12891 27115 36127
5117 36127 11642 -31184 -45329 -26884 -11013 -27753 -47651 -31774 -24120 -34863 11209 52724
5105 52724 8731 -31463 -2278 23795 28895 36578 35576 -2932 -44202 -52137 -14721 7961 -4098
5092 -4098 9056 40203 48254 49240 14073 -6144 -45270 -19666 19683 26830 4011 25362 34418
5079 34418 42917 27724 -9354 -34484 -19404 -39480 -59670 -93375 -55505 -22035 -15555 -40054
5067 -40054 -44742 -45110 -67688 -93347 -89879 -83554 -38316 -9448 13693 4992 -16366 -52869 5490
$$ packed form
5155E6857l1253m7627J7543L0882l2813k3429o538K042M7214M0188l3642q22K2870
5142D1472J6858j5469l8524j5260R024l0846J4888K662K6274K5125k991J0529
5130D3742M342q085j7695l3597Q142r044R097J8658k1388j3391O328M0006R012
5117C6127k4485m2826j4145J8445J5871j6740j9898J5877P654j0743M6072M1515
5105E2724m3993m0194K9185K6073N100P683j002l8508m1270p935L7416K2682j2059
5092d098J3154L1147Q051R86l5167k0217l9126K5604L9349P147k2819K1351R056
5079C4418Q499j5193l7078k5130J5080k0076k0190l3705L7870L3470O480k4499
5067d0054m688l68k2578k5659L468O325M5238K8868K3141q701k1358l6503N8359
$$ plain form
5054 5490 -1132 11822 13081 35222 59249 41946 -3438 -45549 -36869 -25711 -6953 13305 7322
5041 7322 40248 57656 43655 34289 25122 -4849 -26891 -31938 -25042 10255 11682 20104 34346
5028 34346 30153 2787 -25983 -32528 -31886 -17371 -41967 -62544 -57395 -57621 -83304 -78650 -78760 -60786
5014 -60786 -48520 -63565 -35485 -36256 -27652 -1212 26042 27072 -22506 -9809 22757 28037 -10512
5001 -10512 -3621 -20284 -35262 -6376 -9538 -34681 -7089 -22419 -6777 -14098 -31960 -14925
4989 -14925 18314 40289 26374 16946 4580 22623 59223 82389 63999 13555 -16784 15883
4977 15883 8374 1765 19110 47527 44801 42864 23220 1428 -13923 -297 664 -27999 -53582
4964 -53582 -32971 -27785 -61934 -23269 49858 54449 54485 83895 103575 86466 69135 33974 -3213
$$ packed form
5054E490o622J2954J259K2141K4027j7303m5384m2111Q680J1158J8758K0258n983
5041G322L2926J7408j4001r366r167k9971k2042n047O896L5297J427Q422J4242
5028C4346m193k7366k8770o545O42J4515k4596k0577N149k26k5683M654j10J7974
5014f0786J2266j5045K8080p71Q604K6440K7254J030m9578J2697L2566N280l8549
5001a0512O891j6663j4978K8886l162k5143K7592j5330J5642p321j7862J7035
4989a4925L3239K1975j3915r428j2366J8043L6600K3166j8390n0444l0339L2667
4977A5883p509o609J7345K8417k726j937j9644k1792j5351J3626R61k8663k5583
4964e3582K0611N186l4149L8665P3127M591L6K9410J9680j7109j7331l5161l7187
$$ plain form
4951 -3213 -25333 -23373 -46364 -30457 -38510 -26584 1282 6282 2399 15442 22555 6513 -23956
4938 -23956 -15238 17632 11701 4152 -9468 -28150 -15485 -7995 -39017 -64443 -37542 -18625 -8172
4925 -8172 14078 37547 29935 43447 43806 75928 58213 18635 -2315 -23023 -9588 16248 13259
4912 13259 -45662 -30347 -8480 -37369 -41226 -42995 -58455 -29392 -34114 -21598 16799 31172
4900 31172 21773 -14386 -21697 5308 2829 -18294 6482 30112 66350 77544 52816 41170
4888 41170 10787 -27140 -50017 -35791 -55042 -22454 26202 51223 42410 51841 46054 47892 52344
4875 52344 91114 110771 120311 79399 54423 23127 43096 74487 39443 -35966 -71095 -61194
4863 -61194 -57868 -39074 -18161 -5334 6858 15780 28141 13663 -3367 -2484 -6374 -18973 -38309
$$ packed form
4951c213k2120J960k2991J5907q053J1926K7866N000l883J3043P113j6042l0469
4938b3956Q718L2870n931p549j3620j8682J2665P490l1022k5426K6901J8917J0453
4925h172K2250K3469p612J3512L59L2122j7715l9578k0950k0708J3435K5836k989
4912A3259n8921J5315K1867k8889l857j769j5460K9063m722J2516L8397J4373
4900C1172r399l6159p311K7005k479k1123K4776K3630L6238J1194k4728j1646
4888D1170l0383l7927k2877J4226j9251L2588M8656K5021q813R431n787J838M452
4875E2344L8770J9657R540m0912k4976l1296J9969L1391l5044p5409l5129R901
4863f1194L326J8794K0913J2827J2192Q922J2361j4478j7030Q83l890j2599j9336
$$ plain form
4850 -38309 3391 -1209 -37358 -31757 -43505 -61262 -59507 -60228 -68896 -75647 -94082 -79686 -57110
4837 -57110 -31068 -12827 1867 22980 36200 35007 16394 11180 -26372 -9485 -36478 -37184 -8695
4824 -8695 34067 47225 37987 -1994 -48242 -46073 -15035 7161 -5481 -15222 24034 33794 61448
4811 61448 23423 6549 -22214 -43884 -11545 11008 45454 42176 12255 11140 57203 26279
4799 26279 -22218 -35515 -2792 27121 -3320 -27306 -6996 20861 16751 -5579 -14391 5195
4787 5195 31761 20028 58465 83164 88286 49402 33597 23116 24069 22562 26776 35099 30903
4774 30903 17170 -47173 -89198 -71077 -30274 -29127 -58709 -53669 -67293 -38464 11233 -4015
4762 -4015 -63093 -79568 -91464 -30688 -35960 -32608 -46468 -55882 -24213 -55164 -64017 -3635 50587
$$ packed form
4850c8309M1700m600l6149N601j1748j7757J755p21q668o751j8435J4396K2576
4837e7110K6042J8241J4694K1113J3220j193j8613n214l7552J6887k6993p06K8489
4824h695M2762J3158r238l9981m6248K169L1038K2196j2642r741L9256R760K7654
4811F1448l8025j6874k8763k1670L2339K2553L4446l278k9921j115M6063l0924
4799B6279m8497j3297L2723K9913l0441k3986K0310K7857m110k2330q812J9586
4787E195K6566j1733L8437K4699N122l8884j5805j0481R53j507M214Q323m196
4774C0903j3733o4343m2025J8121M0803J147k9582N040j3624K8829M9697j5248
4762d015n9078j6475j1896O0776n272L352j3860r414L1669l0951q853O0382N4222
$$ plain form
4749 50587 56507 20736 45778 71961 70098 73951 87518 48921 36882 23083 19335 33881 18335
4736 18335 6348 17170 17087 5392 33740 68786 82683 85099 62998 27858 -6066 -10054 23920
4723 23920 57666 7906 -23631 -25517 11794 28294 2750 1096 35445 66217 39523 17957
4711 17957 3243 -11498 9347 24331 43205 85894 110288 71951 7331 -22477 8853 11397
4699 11397 16191 22402 32893 17520 20958 44909 45851 48579 47575 30899 18728 12483 20338 50582
4685 50582 22582 -24234 -5847 13284 -7673 -52821 -38445 17373 35197 -12031 932 25293
4673 25293 35771 31234 24011 -1894 -8999 -25212 -1359 9516 -18402 -46782 -41689 -47331 -53367
4660 -53367 -45728 -26812 21717 47252 47779 47518 48466 63011 52512 19982 -741 23764 -6811
$$ packed form
4749E0587N920l5771K5042K6183j863L853J3567l8597j2039j3799l748J4546j5546
4736A8335j1987J0822q3j1695K8348L5046J3897K416k2101l5140l3924l988L3974
4723B3920L3746m9760l1537j886L7311J6500k5544j654L4349L0772k6694k1566
4711A7957j4714j4741K0845J4984J8874M2689K4394l8337o4620k9808L1330K544
4699A1397M794O211J0491j5373L438K3951R42K728j004j6676j2171o245P855L0244
4685E0582k8000m6816J8387J9131k0957m5148J4376N5818J7824m7228J2963K4361
4673B5293J0478m537p223k5905p105j6213K3853J0875k7918k8380N093n642o036
4660e3367P639J8916M8529K5535N27k61R48J4545j0499l2530k0723K4505l0575
$$ plain form
4647 -6811 -6395 -30672 -2044 9022 10449 7357 -18306 -24140 -38754 -20605 3155 -2514 9648
4634 9648 -8757 -16986 -10032 36985 26166 15790 22519 32240 13344 -18225 -25594 -16254 7505
4621 7505 18390 57877 41788 29834 1417 -20737 8775 54814 73626 67480 49658 7501
4609 7501 -23096 -8890 -20439 -7460 12368 -21358 -6711 -17464 -4166 12354 23604 13771
4597 13771 -6727 -19370 12831 -6739 24661 21975 -3252 4414 -20540 -27867 -17572 -33024
4585 -33024 -41855 -52094 -53215 -21228 -3923 -5737 9904 3612 -13327 -11579 -47523 -78238 -64995
4572 -64995 -24411 2213 17395 21246 -6737 -19280 22976 30910 24999 35033 43210 49498 -5438
4559 -5438 -25346 -25062 -39739 -32878 -24566 -26740 -66007 -57270 -59730 -54183 -22316 -23053 -38566 -44572
$$ packed form
4647f811M16k4277K8628J1066J427l092k5663n834j4614J8149K3760n669J2162
4634I648j8405q229O954M7017j0819j0376O729R721j8896l1569p369R340K3759
4621G505J0885L9487j6089j1954k8417k2154K9512M6039J8812o146j7822m2157
4609G501l0597J4206j1549J2979J9828l3726J4647j0753J3298J6520J1250r833
4597A3771k0498j2643L2201j9570L1400k686k5227P666k4954p327J0295j5452
4585c3024q831j0239j121L1987J7305j814J5641o292j6939J748l5944l0715J3243
4572f4995M0584K6624J5182L851k7983j2543M2256P934n911J0034Q177O288n4936
4559e438j9908K84j4677O861Q312k174l9267Q737k460N547L1867p37j5513o006
$$ plain form
4545 -44572 -19977 16315 3368 -5716 12129 20885 51950 70221 93578 85742 37073 -1847
4533 -1847 -1519 -10942 -10947 -30895 -51869 -44601 -33427 -18275 -53561 -39869 -28160 -28700 -38962 -42603
4519 -42603 -19242 -2293 -17220 -23652 -44569 -44726 -17333 -9959 -29323 -36847 -34569 20103 66749
4506 66749 84056 66116 38229 23478 64056 29537 -8094 -13146 4755 53783 74819 74004
4494 74004 55215 33410 11038 1633 33857 22507 18952 24454 19886 -320 10174 -43764 -72735
4481 -72735 -58762 -19585 -11679 -28559 -11085 -10843 9903 16314 15913 3022 -3146 -15143 -17431
$$ packed form
4545d4572K4595L6292j2947r084J7845Q756L1065J8271K3357p836m8669l8920
4533a847L28r423nj9948k0974P268J1174J5152l5286J3692J1709n40j0262l641
4519d2603K3361J6949j4927o432k0917j57K7393P374j9364p524K278N4672M6646
4506F6749J7307j7940k7887j4751M0578l4519l7631n052J7901M9028K1036q15
4494G4004j8789k1805k2372r405L2224j1350l555N502m568k0206J0494n3938k8971
4481g2735J3973L9177P906j6880J7474K42K0746O411m01j2891o168j1997k288
$$ [...]
##END NTUPLES=NMR SPECTRUM
##END=
